0.4639053705  
0.3333770974  
0.1999337246  
0.06671987853  
-0.06186524812  
-0.1802565294  
-0.2820799306  
-0.3607400457  
-0.4101937528  
-0.4257799637  
-0.4049855852  
-0.3480341988  
-0.2581461139  
-0.1414436604  
-0.006461625496  
0.1366829509  
0.277354501  
0.4055375673  
0.5128942223  
0.5935690131  
0.6446170852  
0.6659981059  
0.6601486242  
0.6312149471  
0.584092676  
0.5234494272  
0.4529122414  
0.3745545208  
0.2887657324  
0.1945144912  
0.08993791081  
-0.02688374014  
-0.1570884133  
-0.3003328358  
-0.4543162452  
-0.6146219406  
-0.7748756423  
-0.9271939567  
-1.062820626  
-1.172873858  
-1.249103993  
-1.284593884  
-1.274376186  
-1.215939999  
-1.109639628  
-0.9589851445  
-0.7708087682  
-0.5552373502  
-0.3254181256  
-0.09693237545  
0.1131708076  
0.2876882239  
0.4108730505  
0.4701917106  
0.45799459  
0.3728834114  
0.2204902957  
0.01349794575  
-0.2292179835  
-0.4843106289  
-0.7263780759  
-0.930810822  
-1.076676969  
-1.149256493  
-1.141841252  
-1.05649766  
-0.9036787959  
-0.700696539  
-0.4692593089  
-0.232462991  
-0.01164969808  
0.1763500575  
0.3212032529  
0.4199662895  
0.4767762342  
0.5014136578  
0.5070102363  
0.5072918034  
0.5138669454  
0.5339961052  
0.5692554782  
0.6152919001  
0.662717108  
0.6989558104  
0.7107221466  
0.6866666822  
0.619739369  
0.5088307117  
0.3594143868  
0.1830777467  
-0.003982107104  
-0.1832503685  
-0.3365714068  
-0.4487926633  
-0.5099334865  
-0.5165554464  
-0.4721209136  
-0.3863255671  
-0.2735306031  
-0.1505509096  
-0.03417607823  
0.06122068367  
0.1256275086  
0.1546369897  
0.1498383616  
0.1183416686  
0.07154463881  
0.02333694246  
-0.01199044227  
-0.0218328771  
0.002908965447  
0.06652453129  
0.167833105  
0.300269268  
0.4526621331  
0.6106131963  
0.7582737915  
0.8803016393  
0.963729328  
0.9995085829  
0.9835220495  
0.9169356982  
0.8058656165  
0.6604054472  
0.4931775595  
0.317627078  
0.1463313558  
-0.0104630697  
-0.1458143868  
-0.2564981646  
-0.3428049015  
-0.4078163311  
-0.4563268223  
-0.4936293239  
-0.5243992752  
-0.5518723532  
-0.5774351094  
-0.6006670501  
-0.6197631667  
-0.6321956451  
-0.6354282427  
-0.6274934502  
-0.6073037652  
-0.5746176609  
-0.5296938566  
-0.4727495981  
-0.4033825927  
-0.3201513156  
-0.2204964858  
-0.1010574816  
0.04157527359  
0.2098044594  
0.4038446413  
0.6206644402  
0.8533071326  
1.090791038  
1.318698089  
1.520436112  
1.679058147  
1.779345483  
1.809868912  
1.76467381  
1.644284584  
1.455841887  
1.212315785  
0.9308784103  
0.6306883003  
0.3304072843  
0.0458682602  
-0.2117417779  
-0.4368873103  
-0.6297060227  
-0.7950487886  
-0.9407080751  
-1.075126259  
-1.205025025  
-1.333344172  
-1.4579234  
-1.571186966  
-1.660940219  
-1.712221838  
-1.709932377  
-1.641829643  
-1.50139319  
-1.290038419  
-1.018254494  
-0.7053865704  
-0.3779842797  
-0.06688755196  
0.1965921783  
0.384842937  
0.4778790175  
0.4663909881  
0.3534638128  
0.1546280993  
-0.103791982  
-0.3878356968  
-0.6601631978  
-0.8847859748  
-1.031654024  
-1.080421019  
-1.022905821  
-0.8639117011  
-0.6203269963  
-0.3186841052  
0.008479225836  
0.3268831214  
0.6048338387  
0.8170170031  
0.9472720966  
0.9900462125  
0.9503887904  
0.8425931334  
0.6877365324  
0.5105327328  
0.3359573619  
0.1861070357  
0.07770660817  
0.02050820652  
0.01675899817  
0.06168001916  
0.1448235882  
0.2520377709  
0.3677357514  
0.4771263427  
0.5681320551  
0.6327510357  
0.6677350577  
0.6745512363  
0.6586702454  
0.6283400446  
0.5930342471  
0.561808434  
0.5417938806  
0.5370465638  
0.5478946734  
0.5708677544  
0.5992136528  
0.6239310841  
0.6351684157  
0.6237781959  
0.5828359642  
0.5088784924  
0.4027009658  
0.2695826571  
0.1189031081  
-0.03681680581  
-0.1833353023  
-0.3063867501  
-0.3934530481  
-0.4353855351  
-0.427671645  
-0.3711825126  
-0.272325234  
-0.1425405299  
0.002786481374  
0.1458922804  
0.2685189246  
0.3539012664  
0.3886466761  
0.3642742187  
0.2782436333  
0.1343393056  
-0.05766349233  
-0.2830039109  
-0.5235299701  
-0.7596876406  
-0.9726796466  
-1.146522866  
-1.26975223  
-1.336572649  
-1.347285547  
-1.30796497  
-1.229406685  
-1.125503584  
-1.011247825  
-0.9006417032  
-0.8047767136  
-0.7303441386  
-0.6787873729  
-0.6461766257  
-0.6238544853  
-0.5997469693  
-0.5601656936  
-0.4918791509  
-0.3841441911  
-0.2304919725  
-0.02998356432  
0.2121937856  
0.4848626736  
0.7717312087  
1.052883765  
1.306725966  
1.512149382  
1.650689436  
1.708412232  
1.677344645  
1.556290387  
1.350950834  
1.073366329  
0.7407449657  
0.3738573409  
-0.004829711671  
-0.3730366681  
-0.7103673913  
-0.9996537421  
-1.227822751  
-1.386267956  
-1.470757639  
-1.480972161  
-1.419843655  
-1.292798657  
-1.107089205  
-0.8712600568  
-0.5948033585  
-0.2879767579  
0.03829643386  
0.3725177655  
0.7028090789  
1.017243546  
1.304358459  
1.553778092  
1.756881762  
1.907392822  
2.001770722  
2.039325859  
2.021999314  
1.953857347  
1.840363177  
1.687585286  
1.501477173  
1.287394693  
1.049931264  
0.7931256562  
0.5209664188  
0.2380987911  
-0.04946508946  
-0.3338137515  
-0.6049733968  
-0.8512096359  
-1.059851361  
-1.218560106  
-1.316883859  
-1.347858644  
-1.309403917  
-1.205246879  
-1.045160535  
-0.8444464421  
-0.6226286494  
-0.4015143303  
-0.2028485976  
-0.04585454906  
0.05497713478  
0.09158472889  
0.06324591652  
-0.02343677676  
-0.1554448844  
-0.3150751901  
-0.4822331683  
-0.6369832286  
-0.7620004425  
-0.8446154038  
-0.8781522018  
-0.8624149746  
-0.8032675966  
-0.7113966503  
-0.6004704647  
-0.4849677441  
-0.3780291481  
-0.2896268847  
-0.2253351025  
-0.1858375919  
-0.167239405  
-0.1620757314  
-0.1608432369  
-0.1537745858  
-0.1325807241  
-0.09187267512  
-0.03006437628  
0.05036933397  
0.1432967607  
0.2398932521  
0.3300072712  
0.4036977313  
0.4527160885  
0.4717089525  
0.4589800622  
0.4167337079  
0.3507739782  
0.2697262665  
0.1839170876  
0.1040554617  
0.03990979848  
-0.000862375597  
-0.01360323103  
0.002846730005  
0.0460550461  
0.1103029645  
0.1872488677  
0.2668339298  
0.3383507606  
0.3915592678  
0.4177353811  
0.4105879272  
0.3669502354  
0.2871921759  
0.1753336331  
0.03880256871  
-0.1121060021  
-0.2650932247  
-0.4069554525  
-0.5248230368  
-0.6074517866  
-0.6464023289  
-0.6369927941  
-0.5788819053  
-0.4761896845  
-0.3371131955  
-0.1730475828  
0.002686955028  
0.1763867838  
0.3355431316  
0.4702601222  
0.5742757914  
0.645447503  
0.6855965582  
0.6997425696  
0.694848165  
0.6782814393  
0.6562799331  
0.6326746438  
0.6081394971  
0.5800935599  
0.5433056888  
0.4911050479  
0.4169800678  
0.3162954718  
0.1877797099  
0.03452510256  
-0.1357499427  
-0.3112421059  
-0.4774079338  
-0.6188975188  
-0.721837633  
-0.7760766782  
-0.7770663221  
-0.7270059857  
-0.6350607958  
-0.516517855  
-0.3909362967  
-0.2795065313  
-0.2019386264  
-0.1733125196  
-0.2013632128  
-0.284617364  
-0.4117352074  
-0.5622268168  
-0.7085495043  
-0.8193940137  
-0.8637571085  
-0.8153037695  
-0.6564269316  
-0.3814213365  
0.001700770561  
0.4710807029  
0.9926546959  
1.52345232  
2.0161509  
2.424371963  
2.708023224  
2.838031435  
2.799831337  
2.59516822  
2.241982762  
1.772386892  
1.229005126  
0.6601653565  
0.1145338643  
-0.3641048768  
-0.7413226665  
-0.9952482582  
-1.118177542  
-1.116504037  
-1.009035857  
-0.8240652809  
-0.595565917  
-0.3590575537  
-0.1476340782  
0.01141435211  
0.09904797989  
0.1058120781  
0.03201162909  
-0.1131563005  
-0.313341746  
-0.5473464022  
-0.7917032121  
-1.023223469  
-1.221265208  
-1.369511338  
-1.457157181  
-1.479441922  
-1.437567867  
-1.338072363  
-1.191772319  
-1.012421768  
-0.8152330669  
-0.6153963807  
-0.4267288623  
-0.2605702118  
-0.1249954915  
-0.02440904071  
0.04047341178  
0.07226222769  
0.07622124623  
0.05935534069  
0.02939448036  
-0.006232220342  
-0.04128565111  
-0.07138276687  
-0.09438049354  
-0.1104363593  
-0.1217658768  
-0.1321640239  
-0.14633661  
-0.1691705468  
-0.2049925612  
-0.2569118125  
-0.326302869  
-0.4124524122  
-0.5123999285  
-0.6209814049  
-0.7310711518  
-0.834008712  
-0.9202140312  
-0.9799294516  
-1.004068287  
-0.9850831478  
-0.9177714714  
-0.7999332821  
-0.632758172  
-0.4209006205  
-0.1721813497  
0.1030627631  
0.3929350626  
0.6850919598  
0.9679052475  
1.231473271  
1.468348861  
1.673872912  
1.84606882  
1.985121895  
2.092567078  
2.170323866  
2.219784963  
2.241130501  
2.23301627  
2.192709594  
2.116650034  
2.001356787  
1.844514209  
1.646034745  
1.408909388  
1.139666147  
0.8483344982  
0.5478828778  
0.2531884014  
-0.02033229636  
-0.2582624329  
-0.4486660022  
-0.5833272131  
-0.6585774796  
-0.6756075925  
-0.6402246584  
-0.5621055892  
-0.4536596593  
-0.3286525001  
-0.2007894936  
-0.08242105126  
0.01646861935  
0.0888925494  
0.1310790895  
0.1423152376  
0.1244738226  
0.08136039861  
0.01799715876  
-0.06004403432  
-0.1471795377  
-0.2381858021  
-0.3284160802  
-0.4139015178  
-0.4914061671  
-0.5584854488  
-0.613595269  
-0.6562519594  
-0.687230986  
-0.7087084891  
-0.7243080165  
-0.7389557401  
-0.7584922437  
-0.7890551306  
-0.8362475463  
-0.9042001561  
-0.9946573628  
-1.106214545  
-1.233882746  
-1.369073066  
-1.500065476  
-1.612981022  
-1.693162098  
-1.726843221  
-1.702907713  
-1.614525205  
-1.46043637  
-1.245691635  
-0.9817012359  
-0.6855327231  
-0.3784836551  
-0.08404000107  
0.1745462209  
0.3768361372  
0.5075784357  
0.5586353164  
0.5301676244  
0.4309312236  
0.2776018606  
0.09318851587  
-0.09530549685  
-0.259708978  
-0.3736778366  
-0.4155079036  
-0.3704649202  
-0.2323382639  
-0.004090711256  
0.3024827745  
0.66798182  
1.067379687  
1.472481707  
1.854575126  
2.186986918  
2.447264135  
2.618795984  
2.691760646  
2.6633623  
2.53742382  
2.323464193  
2.035417295  
1.690186502  
1.30620494  
0.9021404553  
0.4958492143  
0.1036112497  
-0.2603276073  
-0.583989657  
-0.8577144843  
-1.074106444  
-1.227986428  
-1.316370161  
-1.338546048  
-1.296214097  
-1.19369878  
-1.038136085  
-0.8395800349  
-0.6109324932  
-0.3676305923  
-0.127029774  
0.09252272961  
0.2728867803  
0.3975315126  
0.4530067412  
0.4303276045  
0.3261229225  
0.1433756938  
-0.1083526452  
-0.413287658  
-0.7504045462  
-1.09492569  
-1.420226543  
-1.69999567  
-1.910402447  
-2.032111072  
-2.051892883  
-1.963720203  
-1.769190874  
-1.477282791  
-1.103455977  
-0.6681950714  
-0.1951796331  
0.2907374865  
0.7655187413  
1.20769258  
1.599698691  
1.928720106  
2.18696747  
2.371448122  
2.483328061  
2.527030781  
2.509248538  
2.438022285  
2.322013002  
2.17002402  
1.990797739  
1.792996214  
1.585282911  
1.376360276  
1.174856715  
0.9889671635  
0.825851564  
0.6908031967  
0.5863692362  
0.5115243335  
0.4611486657  
0.4259608079  
0.3930301611  
0.3469142942  
0.2713430904  
0.1512927225  
-0.02482445564  
-0.2631425374  
-0.56284198  
-0.915411678  
-1.304865251  
-1.708953963  
-2.10129492  
-2.454160354  
-2.741609246  
-2.942507992  
-3.043061866  
-3.03845827  
-2.933392709  
-2.741359523  
-2.482826006  
-2.182507751  
-1.866175197  
-1.557426133  
-1.274934402  
-1.030525144  
-0.828377144  
-0.6654063213  
-0.532708753  
-0.4177929317  
-0.3072090641  
-0.1891092057  
-0.05537962034  
0.09699960795  
0.2655074839  
0.4425462849  
0.6166896921  
0.7744551351  
0.902301383  
0.9885386177  
1.024909331  
1.007639862  
0.9378876371  
0.8215968409  
0.6688365592  
0.4927522255  
0.3083059973  
0.1309323226  
-0.02474138326  
-0.1460022432  
-0.2229434318  
-0.2490865849  
-0.2217285759  
-0.1420266454  
-0.0148279272  
0.1517141744  
0.3467332414  
0.5573888813  
0.7697304433  
0.9696261282  
1.143715758  
1.280307664  
1.370184036  
1.407251132  
1.388972392  
1.316584049  
1.195024447  
1.032621953  
0.8405213898  
0.6319119998  
0.4210929492  
0.2224534281  
0.04941317381  
-0.08657079575  
-0.1769158818  
-0.216651533  
-0.2049668113  
-0.1454976032  
-0.0463630476  
0.08013744198  
0.2181512046  
0.349269494  
0.4538802437  
0.5128500677  
0.5094370457  
0.431305811  
0.2724379545  
0.03470549569  
-0.271163573  
-0.6254545157  
-1.000335688  
-1.361826467  
-1.672745985  
-1.896453118  
-2.000988216  
-1.963136187  
-1.771885168  
-1.430759707  
-0.9586298583  
-0.3887358193  
0.234064956  
0.8576436914  
1.428048344  
1.895437066  
2.219762286  
2.375438212  
2.354363638  
2.166838785  
1.840195356  
1.415267083  
0.9411400633  
0.4688463065  
0.04486673069  
-0.2946843639  
-0.5283730513  
-0.6516648777  
-0.6767386159  
-0.6299234311  
-0.5471654511  
-0.4681761665  
-0.4301444973  
-0.4619202905  
-0.5795460626  
-0.7837407769  
-1.059712789  
-1.379261715  
-1.704834085  
-1.99488907  
-2.209753288  
-2.317094364  
-2.296231637  
-2.140685266  
-1.85865556  
-1.471454715  
-1.010202015  
-0.5113391382  
-0.01170650937  
0.456102879  
0.8674237543  
1.207742035  
1.473234862  
1.669642426  
1.809775809  
1.910117256  
1.987138848  
2.05394522  
2.117748439  
2.178587541  
2.229416498  
2.257514699  
2.246938245  
2.181584897  
2.048363246  
1.839941476  
1.556665737  
1.207334101  
0.8087222739  
0.3839548905  
-0.04004979701  
-0.4356508618  
-0.7776547727  
-1.046117797  
-1.228420122  
-1.320365947  
-1.326201074  
-1.257622972  
-1.131979356  
-0.9699503468  
-0.7930619231  
-0.621365786  
-0.4715558603  
-0.3557132877  
-0.2807514982  
-0.2485277819  
-0.2565110794  
-0.2988283768  
-0.367489018  
-0.4536026149  
-0.5484599879  
-0.6443435262  
-0.735069958  
-0.8162358154  
-0.8852352853  
-0.9410929891  
-0.9841819098  
-1.015877591  
-1.038167761  
-1.053257675  
-1.063159384  
-1.06930359  
-1.072171547  
-1.071017241  
-1.063710509  
-1.046767431  
-1.01561715  
-0.9651128224  
-0.8902724835  
-0.7871707712  
-0.6538758286  
-0.4912626813  
-0.303555824  
-0.09845924388  
0.1132246702  
0.3185034258  
0.5035584541  
0.6554302476  
0.7637826924  
0.8225120598  
0.8309248895  
0.7942952337  
0.7236417461  
0.6347165795  
0.5462820037  
0.4778663243  
0.4472719631  
0.4681500728  
0.547959063  
0.6865969712  
0.8758819056  
1.100003901  
1.336898696  
1.560440328  
1.743178518  
1.859373732  
1.887944646  
1.815031789  
1.635881591  
1.355810913  
0.990162397  
0.5632010764  
0.1060538563  
-0.3461150415  
-0.7573990288  
-1.094625886  
-1.330595298  
-1.446784983  
-1.435200388  
-1.299168354  
-1.052991233  
-0.7204946074  
-0.3326132724  
0.07567162385  
0.4687472574  
0.8137066313  
1.083281026  
1.258048206  
1.32772303  
1.291450839  
1.157144615  
0.9400417726  
0.6606935874  
0.3426870495  
0.01035302832  
-0.3132673328  
-0.6080660737  
-0.8579974284  
-1.051693376  
-1.182608537  
-1.248800437  
-1.252423891  
-1.19908925  
-1.097125948  
-0.9568439706  
-0.7897924458  
-0.608060421  
-0.4235871658  
-0.2475141234  
-0.08957662218  
0.04244243592  
0.1431287825  
0.2097337576  
0.2422628037  
0.243363895  
0.2180029672  
0.1729356226  
0.1160350226  
0.05551697714  
-0.0008342467375  
