657.5302821  
669.2366067  
697.8953451  
745.4482941  
596.6634063  
1303.83295  
37483.26343  
433.1122502  
1632.984191  
37093.45443  
30527.14951  
77172.92455  
8326.397089  
28191.82297  
14755.33887  
36706.49634  
707.4686067  
842.7590398  
2643.035184  
1717.796525  
18070.99384  
211.7994054  
18189.62798  
5128.515795  
1514.186029  
29278.20941  
2015.584777  
16719.72071  
5023.533229  
2907.319686  
4171.998049  
3247.54181  
6032.736612  
991.6417305  
5825.025342  
11719.32782  
2619.930622  
17117.56591  
2501.360993  
1180.102333  
2655.050668  
1653.551823  
978.1240791  
3682.948326  
4319.206851  
969.6889342  
5212.016807  
2220.918135  
6094.377717  
96.71729512  
979.2690088  
1877.761058  
663.9812974  
1025.168447  
3439.009045  
1308.027736  
2310.683698  
506.9975698  
5348.894764  
1214.487551  
1628.067587  
112.8673726  
472.940971  
73.09873185  
146.44727  
67.35269139  
47.76617412  
28.35894889  
91.35945861  
238.6973881  
4.490249009  
170.3694679  
42.05148695  
12.21145921  
11.28905267  
56.19672478  
22.1358422  
14.37721221  
14.36238146  
17.14649801  
21.10643702  
14.52821136  
16.49963574  
15.6636842  
13.32712752  
11.80500454  
11.17395523  
11.01200257  
10.64526645  
10.02319644  
8.909151149  
8.952704287  
8.45456463  
8.087764  
7.462317688  
7.156971976  
6.856888956  
6.522054786  
6.184726894  
5.932956336  
5.630610353  
5.367656314  
5.100114271  
4.88921168  
4.687056181  
4.492677627  
4.293062142  
4.113584351  
3.948500793  
3.785957707  
3.629787092  
3.481094587  
3.344450236  
3.210578145  
3.08471317  
2.966487127  
2.853602856  
2.74646066  
2.643709275  
2.546586335  
2.453267601  
2.366528576  
2.280895553  
2.200834356  
2.123195928  
2.049245832  
1.9787762  
1.911211446  
1.846886329  
1.784676386  
1.72604903  
1.669143561  
1.614932814  
1.562565592  
1.512565779  
1.46474696  
1.418677382  
1.374499949  
1.33191956  
1.29114833  
1.251886126  
1.214191199  
1.177863742  
1.142905416  
1.109282996  
1.07684995  
1.045663091  
1.015581106  
0.9865787834  
0.9586394812  
0.9316840759  
0.9057283078  
0.8806013196  
0.856410163  
0.8330050225  
0.8104124755  
0.7886149977  
0.7675715456  
0.7472194004  
0.7275212716  
0.7084822207  
0.6900834629  
0.6722542619  
0.655040786  
0.6383444971  
0.6222067703  
0.6065583326  
0.5914332739  
0.5767545757  
0.5625825418  
0.5487988543  
0.535439285  
0.5224772126  
0.5099498132  
0.4978002225  
0.4859471918  
0.474505876  
0.4633864007  
0.452600986  
0.4421287434  
0.431966019  
0.422070135  
0.4124890847  
0.4031779348  
0.3940856191  
0.3853025768  
0.3767383564  
0.3684419455  
0.3603284538  
0.3524692713  
0.3448288141  
0.3373724495  
0.3301273176  
0.3230754772  
0.3162376872  
0.3095459755  
0.3030621575  
0.2967193684  
0.2905578845  
0.2845708793  
0.2787181931  
0.2730205746  
0.2674585199  
0.2620600057  
0.2567810579  
0.2516585821  
0.2466336123  
0.2417431413  
0.2369891112  
0.2323276829  
0.2277950427  
0.2233893663  
0.2190784993  
0.2148663819  
0.2107631989  
0.2067360908  
0.2028551001  
0.1990228763  
0.1952909097  
0.1916395177  
0.1880811422  
0.1846229495  
0.1812252853  
0.1779046878  
0.1746721238  
0.1715135759  
0.168413588  
0.165404407  
0.1624245423  
0.15954533  
0.1567203716  
0.1539626092  
0.151248707  
0.1486278402  
0.1460499635  
0.1435259915  
0.1410486891  
0.1386364079  
0.1362730418  
0.133954641  
0.1316902439  
0.1294795228  
0.1273013404  
0.125184232  
0.1230934806  
0.1210643547  
0.1190779865  
0.1171169254  
0.1152241982  
0.1133466953  
0.1115158268  
0.1097177269  
0.1079581087  
0.1062403599  
0.1045555614  
0.1028969788  
0.1012873799  
0.09967536718  
0.09813232662  
0.09660437611  
0.09511641599  
0.09364608393  
0.09219907503  
0.09079469637  
0.08941247735  
0.08806412243  
0.08673369624  
0.08543057994  
0.08414688365  
0.08289214529  
0.08167781434  
0.08045506535  
0.07927972058  
0.07810594288  
0.0769724566  
0.0758567083  
0.0747574467  
0.07368217468  
0.07261950658  
0.0715935355  
0.07055406744  
0.06956387577  
0.06858248312  
0.06762471115  
0.06667866953  
0.06574799045  
0.06483191752  
0.06393701831  
0.06306297914  
0.06219696718  
0.06134311627  
0.06050829762  
0.05969149414  
0.05888866257  
0.05809446646  
0.05732015822  
0.05655242175  
0.05580771745  
0.05507220979  
0.05435099561  
0.05363577217  
0.05293273065  
0.05225784065  
0.05157263508  
0.05091151452  
0.05026288891  
0.04961925279  
0.04899336904  
0.04837674822  
0.04776340243  
0.04716246503  
0.04658066376  
0.04599419753  
0.04542009289  
0.04486587362  
0.04431438511  
0.04377014203  
0.04323837135  
0.04271598904  
0.04219973696  
0.04169991952  
0.04119684826  
0.04070912816  
0.0402319676  
0.0397585108  
0.03928402308  
0.03882913943  
0.038371237  
0.03793440599  
0.03749102634  
0.03705874499  
0.0366442007  
0.03622236668  
0.03581593296  
0.03541161547  
0.03501574689  
0.03462529931  
0.03424520048  
0.03385906015  
0.03349172433  
0.03312226271  
0.03275549251  
0.03240757779  
0.03205749588  
0.03171094886  
0.03137677586  
0.03104312363  
0.03071556032  
0.03038880162  
0.03007238245  
0.02976229457  
0.02945198989  
0.02915596652  
0.02885728587  
0.02855891056  
0.02826972271  
0.02798398697  
0.02770157619  
0.02742336454  
0.02715673995  
0.02689148024  
0.02662413928  
0.02636431644  
0.02610802892  
0.02585637871  
0.02561868026  
0.02536438116  
0.02512679367  
0.02488895542  
0.02466022254  
0.02442702351  
0.02420334554  
0.02398146223  
0.02376432206  
0.02354461877  
0.02334223865  
0.02312537304  
0.02292416195  
0.02271935096  
0.02251752576  
0.02232817457  
0.02212725589  
0.02194439242  
0.02175577959  
0.0215677543  
0.02138778561  
0.02120855114  
0.02103848122  
0.02086391738  
0.02069219336  
0.02052590857  
0.02035686535  
0.02019725377  
0.0200416536  
0.01987596341  
0.01972707697  
0.01957730828  
0.01942173681  
0.01927987976  
0.01913166938  
0.01899013247  
0.01884663707  
0.01871230767  
0.01857358428  
0.01844026534  
0.01830864057  
0.01818133891  
0.0180527992  
0.01793024161  
0.01780591851  
0.01768629609  
0.01756444128  
0.01744595781  
0.01733387567  
0.01721885974  
0.01710746051  
0.01700160608  
0.01689527866  
0.01679047107  
0.01668811481  
0.01658056647  
0.01648391353  
0.0163876936  
0.0162921677  
0.0161917832  
0.01610536976  
0.01600824662  
0.0159213824  
0.01583448093  
0.01574975066  
0.01566519924  
0.01558416305  
0.01550134853  
0.01542157904  
0.01534326166  
0.01526750662  
0.01519384473  
0.01512175413  
0.01505390095  
0.0149798467  
0.01490918687  
0.0148407656  
0.01477674614  
0.014711369  
0.01465231784  
0.0145936669  
0.01453025689  
0.01447150271  
0.01441576048  
0.01436094412  
0.01430452634  
0.01425220059  
0.01420038763  
0.01414890468  
0.01409965601  
0.01405609172  
0.0140111163  
0.01396136708  
0.01391921483  
0.01387808146  
0.01383888345  
0.01380127406  
0.01376408601  
0.01372314397  
0.01368559751  
0.01364972588  
0.01362406931  
0.01358813251  
0.01355711982  
0.01353030918  
0.01350071301  
0.01347238665  
0.01345078245  
0.01342278152  
0.01339718727  
0.01337870657  
0.01335909995  
0.01333822406  
0.01331659882  
0.013307706  
0.01328478599  
0.01327050891  
0.01325630274  
0.01324935245  
0.01323704798  
0.01322446791  
0.01321639901  
0.01320571569  
0.01320078382  
0.01319780232  
0.01319393882  
0.01319022604  
0.01319062894  
0.01318585368  
