11.1267226  
14.05201307  
18.83768657  
33.18643791  
203.7503969  
502.5922883  
10169.73157  
6303.88582  
3353.54209  
48469.21377  
12623.58761  
28480.03161  
43384.3522  
45671.41305  
4773.658534  
25166.5406  
12462.08501  
8446.684631  
4749.500767  
6918.594485  
9933.097638  
2742.727331  
2734.110709  
32319.47934  
7504.193841  
22486.1339  
1729.339799  
4567.384863  
5820.665169  
17324.97025  
8852.487955  
2732.588821  
4147.963692  
4278.567395  
2269.551255  
3370.213054  
15882.46537  
1522.032026  
1287.862222  
1373.483376  
2833.322938  
99.34643715  
10103.3541  
5541.105253  
1196.113461  
14047.55786  
3234.78145  
1455.720527  
10749.18605  
2020.857578  
846.9018999  
428.9245551  
1521.934624  
1122.5539  
6258.407727  
5167.849848  
52.81012289  
374.375861  
262.54468  
2526.457003  
1125.149248  
9.839078477  
346.0517881  
462.3839665  
151.386879  
192.9351665  
182.7985293  
64.55769898  
150.530705  
10.04286195  
65.93868  
30.44796391  
98.7176382  
21.73722783  
22.74027423  
14.92196546  
14.23385172  
19.11866162  
3.779908767  
4.910546064  
10.62357039  
5.521589784  
5.533102569  
4.104781725  
4.583384241  
4.570697814  
3.274537574  
3.269302699  
2.704345141  
3.093506023  
2.464767206  
2.427546944  
2.110790548  
2.049909029  
1.849788562  
1.797070862  
1.659573039  
1.616319593  
1.469647264  
1.390089517  
1.299487279  
1.261496712  
1.185035038  
1.118629273  
1.055453597  
0.9983875749  
0.9509150424  
0.9114848434  
0.8620075335  
0.8235627904  
0.787035451  
0.748104306  
0.7164721026  
0.6856911607  
0.6551171092  
0.6286826267  
0.6017760479  
0.5786691349  
0.5551334523  
0.5341428896  
0.5127398065  
0.4931560043  
0.4747212163  
0.4573647628  
0.4406160199  
0.4249234983  
0.4098602649  
0.3956016171  
0.3819442605  
0.3691001224  
0.3567003725  
0.3450506084  
0.3338129122  
0.3230939949  
0.3129684311  
0.3031693236  
0.2938416715  
0.2849170608  
0.2763640061  
0.2681855792  
0.2603263726  
0.2528177376  
0.2455948643  
0.2386853285  
0.2320379667  
0.2256459485  
0.2195250023  
0.2136114772  
0.2079444231  
0.2024730765  
0.1972343938  
0.1921704397  
0.1872897109  
0.1825861044  
0.1780479381  
0.1736835855  
0.1694621962  
0.1653878778  
0.1614596633  
0.1576731757  
0.1539963881  
0.1504667737  
0.1470344063  
0.1437212634  
0.1405183895  
0.1374114244  
0.1344262522  
0.1315009635  
0.128694269  
0.1259633628  
0.1233189807  
0.120754311  
0.1182780057  
0.1158669052  
0.1135355485  
0.1112592015  
0.1090615305  
0.1069240806  
0.1048567215  
0.10283257  
0.100878814  
0.09898015556  
0.09712899539  
0.09533281811  
0.09358137652  
0.09188347257  
0.09022776541  
0.08862028998  
0.08706314198  
0.08553241302  
0.0840507446  
0.08260515536  
0.0811948188  
0.07982959967  
0.07848516914  
0.077189534  
0.07591835905  
0.07468790269  
0.07347995621  
0.07229882132  
0.07115205755  
0.07003441463  
0.06893847814  
0.06786900815  
0.06683282249  
0.06581842812  
0.06482495592  
0.06385734816  
0.0629091117  
0.06198510001  
0.06107920613  
0.06020534328  
0.05933629086  
0.05849763143  
0.05767281115  
0.05687139528  
0.0560801464  
0.05531072655  
0.05455470138  
0.05381603421  
0.05309373819  
0.0523903995  
0.05170044668  
0.05102604152  
0.05036669083  
0.0497190207  
0.04908562141  
0.04845932644  
0.04784999386  
0.04725372462  
0.04667600807  
0.0461026486  
0.04553925272  
0.04499455889  
0.04445250581  
0.04392176606  
0.0434048144  
0.04289881921  
0.04240352616  
0.04191827908  
0.04144162029  
0.04096799549  
0.04051337177  
0.04005785533  
0.03961650826  
0.03918128893  
0.03875636315  
0.03834010664  
0.03792117601  
0.03752005307  
0.03712558839  
0.03673289336  
0.03635570075  
0.03598137392  
0.03561294239  
0.03524970576  
0.03489931391  
0.03455015472  
0.03420293298  
0.03386695444  
0.03354038067  
0.03321436685  
0.03289302363  
0.03258154268  
0.0322724968  
0.0319670284  
0.0316686114  
0.0313806328  
0.03108636245  
0.0308070678  
0.03052752079  
0.03025520063  
0.02998280469  
0.02972141478  
0.02945725834  
0.02920012157  
0.0289515516  
0.0287031449  
0.02845241655  
0.02821777425  
0.02798061362  
0.02775036342  
0.02751990744  
0.02729509521  
0.02707235753  
0.02685573456  
0.02664137166  
0.02643222575  
0.02622036132  
0.02601307895  
0.02581521245  
0.02561780523  
0.02541935846  
0.02522453484  
0.02503685358  
0.0248540995  
0.02466257271  
0.02448450471  
0.02430610209  
0.0241293084  
0.0239545924  
0.02378197188  
0.0236180244  
0.02345121061  
0.02328907941  
0.02312732167  
0.02297005724  
0.02281353076  
0.02266178973  
0.02250960748  
0.02235967555  
0.02221448044  
0.02206906859  
0.0219219877  
0.02178235443  
0.02164655289  
0.02150723175  
0.02136996796  
0.02123997983  
0.02110488058  
0.02097568609  
0.02084858568  
0.02072053681  
0.02059725835  
0.02047510117  
0.02035589755  
0.02023471129  
0.02011900381  
0.01999856344  
0.01989177623  
0.01977923953  
0.01966538073  
0.01955636422  
0.01944712376  
0.01934326017  
0.01923424548  
0.01913127838  
0.01903207555  
0.01892762354  
0.01882516835  
0.0187292136  
0.01863854967  
0.01853724498  
0.01844774357  
0.01835262467  
0.01826216489  
0.01817022656  
0.01807995327  
0.01798947457  
0.01790753485  
0.01782101308  
0.01773713692  
0.01765232783  
0.01757088591  
0.01748908564  
0.01740936315  
0.01732922375  
0.01725261115  
0.01717481707  
0.01710124784  
0.01702285385  
0.01694836806  
0.01687769485  
0.0168102549  
0.01673462995  
0.01666966836  
0.01659530961  
0.01652548586  
0.01646344926  
0.01639481439  
0.01632699358  
0.01626839901  
0.016201196  
0.01613785225  
0.0160750076  
0.01601514004  
0.01595404717  
0.01589469827  
0.01583413851  
0.01577833576  
0.01572186294  
0.01566388606  
0.01561100855  
0.01555352041  
0.01550237088  
0.01544597955  
0.01539556331  
0.01534203901  
0.01529140606  
0.0152408923  
0.01519329397  
0.01514459782  
0.0150970313  
0.01504925418  
0.01499792077  
0.01495395867  
0.01490794128  
0.01486298228  
0.01482178848  
0.01477604064  
0.01473219124  
0.01469221641  
0.01464747565  
0.01460509694  
0.01456563603  
0.01452709674  
0.01448887103  
0.01444935541  
0.01441101369  
0.01437193545  
0.01433858619  
0.01430063285  
0.01426608197  
0.01422892551  
0.01419393453  
0.01415865978  
0.01412498974  
0.01409525906  
0.01406003057  
0.01402897663  
0.01399895315  
0.01396965093  
0.01393262412  
0.01390772352  
0.01387793403  
0.01384965005  
0.01382180042  
0.01379284266  
0.01376393747  
0.01374006061  
0.01371165155  
0.01368480546  
0.01366030125  
0.01363794951  
0.01360909137  
0.01358285072  
0.01356625734  
0.01353774929  
0.01351800917  
0.01349340329  
0.01347176462  
0.01345285677  
0.01343470271  
0.01341321191  
0.01338887082  
0.01336962481  
0.01335338141  
0.01333416162  
0.01331703603  
0.01329600705  
0.01328297802  
0.01326372972  
0.01324809272  
0.01323162816  
0.01321538807  
0.01320024986  
0.01318662877  
0.01316892118  
0.01315643633  
0.01314095646  
0.0131324364  
0.01311790793  
0.0131053425  
0.01309307286  
0.01308101864  
0.01306905815  
0.01306153252  
0.01305094066  
0.01304015331  
0.01303068679  
0.01302294981  
0.01301143353  
0.01300475564  
0.01299648724  
0.01298921642  
0.01298172668  
0.0129750438  
0.01296866082  
0.0129594546  
0.01295635407  
0.01295208748  
0.0129466578  
0.01294330581  
0.01293935259  
0.0129342287  
0.01293230073  
0.0129289538  
0.01292725905  
0.01292452223  
0.01292217081  
0.01291922792  
0.01292000117  
0.01291854521  
0.01291951822  
