287.0521628  
307.5104313  
349.6439445  
454.5063847  
874.205193  
2089.288769  
3203.838354  
5377.880132  
28653.01379  
2451.000855  
2954.514117  
1010.222126  
14090.98901  
46986.62191  
23793.77525  
7313.455765  
9519.10866  
616.857459  
51017.34763  
3229.402533  
67225.61507  
158.3142926  
5153.825282  
14084.21536  
5726.58138  
7897.813324  
8616.838021  
6604.94579  
8692.704225  
26202.94532  
3577.259265  
7378.111828  
6428.261562  
4299.244553  
6679.324945  
26920.89551  
4661.731367  
2427.290732  
5566.619737  
3969.067881  
9441.842854  
6239.358784  
304.9402957  
1045.370945  
2707.907099  
1140.44548  
10110.51774  
5301.114412  
1864.104283  
1022.572602  
1466.627278  
1537.690542  
147.713547  
302.7974174  
221.934201  
533.5347008  
5022.656057  
5649.061828  
428.2414804  
2408.545425  
60.16848811  
1520.321565  
166.6526738  
69.05581157  
1151.05813  
481.1585468  
21.90071241  
110.6897503  
4.559078524  
20.55233385  
6.038933161  
3.80318389  
23.56507937  
10.93024978  
21.9793661  
15.60124047  
6.892751295  
7.789100818  
5.0182873  
9.282561392  
4.584590848  
5.88926393  
3.214745311  
3.054383414  
2.833220758  
2.862117213  
3.421550396  
3.432238253  
2.967090881  
2.755078566  
2.773014956  
2.602540107  
2.463205999  
2.306415401  
2.270460584  
2.150368109  
2.004667896  
1.916550108  
1.880417914  
1.8073412  
1.656332171  
1.571505352  
1.517510145  
1.460924262  
1.408016031  
1.342704508  
1.300059706  
1.236962121  
1.187399727  
1.139885401  
1.09364504  
1.053779357  
1.011165342  
0.9744710081  
0.9381962401  
0.9019525343  
0.8674211534  
0.8358811715  
0.8066559874  
0.7795750296  
0.751710995  
0.7256348202  
0.7006134914  
0.6769200012  
0.65394314  
0.6322241133  
0.6113633122  
0.5917206484  
0.5726665113  
0.5542264864  
0.5366213478  
0.5197774599  
0.5036694129  
0.4880736444  
0.473303883  
0.4591777508  
0.4454697123  
0.4322485378  
0.4195564826  
0.407400338  
0.3957219325  
0.3844255545  
0.3736020463  
0.3631601964  
0.3530915703  
0.3434033493  
0.3340343116  
0.3250349072  
0.3163329791  
0.3079462676  
0.2998579088  
0.2920481978  
0.2845043326  
0.2772133364  
0.2701652641  
0.2633651347  
0.2567941828  
0.2504313515  
0.2442749287  
0.2383248749  
0.2325657514  
0.2269887886  
0.2215935237  
0.2163643081  
0.2113048259  
0.2063944993  
0.2016459598  
0.1970336507  
0.1925694616  
0.1882366436  
0.184035288  
0.1799546232  
0.1760037888  
0.1721637116  
0.1684363389  
0.1648187475  
0.161302843  
0.1578892587  
0.1545755327  
0.1513554703  
0.1482205011  
0.1451726695  
0.1422140033  
0.1393341641  
0.1365340048  
0.1338116213  
0.1311606044  
0.1285825286  
0.1260764293  
0.1236347316  
0.1212540207  
0.1189366838  
0.1166806742  
0.1144831632  
0.1123428748  
0.110256479  
0.108225981  
0.1062444958  
0.10431394  
0.1024264658  
0.1005889737  
0.09879996619  
0.09704974614  
0.09534790138  
0.09368654343  
0.09206116881  
0.0904767459  
0.08893327664  
0.08742548513  
0.08594911524  
0.08451263473  
0.08310572262  
0.08173095864  
0.08039103822  
0.07908380181  
0.07780029935  
0.07655202283  
0.07532629346  
0.07413215734  
0.07296390009  
0.07182354729  
0.0707072838  
0.06961345679  
0.06854408762  
0.06749897255  
0.06647735221  
0.06547717078  
0.06450005494  
0.06354287468  
0.06260133889  
0.06168636548  
0.06078717292  
0.05990774074  
0.05904884512  
0.05820573387  
0.05737688198  
0.05656847048  
0.05577682439  
0.05500139751  
0.05424462709  
0.05349727511  
0.05276752718  
0.05204925213  
0.05135350995  
0.05066427148  
0.04998797142  
0.04933144215  
0.04868115734  
0.04804900929  
0.04742693343  
0.04681452474  
0.04621735718  
0.04562998112  
0.04505329189  
0.04448571237  
0.04393407021  
0.0433914254  
0.0428561538  
0.04233417592  
0.0418180331  
0.04131551743  
0.04082038076  
0.04033200497  
0.03985521038  
0.03938708783  
0.03892671808  
0.03847534279  
0.03803294663  
0.03759617808  
0.03716788985  
0.03674935344  
0.03633671777  
0.03592988333  
0.03553034766  
0.03513935066  
0.03475516177  
0.03437830178  
0.03400787519  
0.03364143919  
0.03328105022  
0.03292917288  
0.03258510034  
0.0322436322  
0.03190808142  
0.03157847166  
0.03125545406  
0.03093620629  
0.03062399885  
0.03031619755  
0.03001477609  
0.02971616534  
0.02942296432  
0.02913372553  
0.02885210553  
0.02857239129  
0.02829968021  
0.0280289394  
0.02776364156  
0.02750233383  
0.02724677984  
0.02699481346  
0.02674574717  
0.02650082078  
0.02626068984  
0.02602329433  
0.02579033286  
0.02556062894  
0.02533324224  
0.02511267698  
0.02489394167  
0.02467741782  
0.024465034  
0.02425625924  
0.02405089485  
0.02384763659  
0.02364860831  
0.02345140267  
0.02325861391  
0.02306930404  
0.0228807066  
0.02269587707  
0.02251246621  
0.0223339131  
0.0221579128  
0.02198378561  
0.02181216641  
0.02164588175  
0.02147974137  
0.02131482223  
0.02115466171  
0.02099480717  
0.02083776448  
0.02068574736  
0.02053178288  
0.02038279635  
0.0202359314  
0.02009102059  
0.01994760143  
0.0198057679  
0.01966713993  
0.01952953462  
0.01939449278  
0.01926350786  
0.01913205211  
0.01900095011  
0.01887560959  
0.01874896948  
0.01862674867  
0.01850303322  
0.01838415747  
0.01826651333  
0.01814899435  
0.01803346149  
0.01791979384  
0.01780923451  
0.01769840577  
0.01759060211  
0.01748324479  
0.01737833434  
0.01727468891  
0.01717205817  
0.0170711769  
0.01697207825  
0.01687440332  
0.0167773648  
0.01668082686  
0.01658662489  
0.01649374497  
0.01640344685  
0.01631288247  
0.01622362814  
0.01613729498  
0.01605143084  
0.01596633305  
0.01588281799  
0.01580058933  
0.0157193278  
0.01563750397  
0.01555906897  
0.0154830423  
0.01540502702  
0.01532958502  
0.01525638618  
0.01518201925  
0.01510966139  
0.0150381374  
0.01496885877  
0.01489870924  
0.0148310585  
0.01476418552  
0.01469787732  
0.01463288721  
0.01456785917  
0.01450527763  
0.01444293681  
0.01438082656  
0.01432111011  
0.01426146875  
0.01420295168  
0.01414352088  
0.01408818012  
0.01403136904  
0.01397575923  
0.0139228159  
0.01386997922  
0.01381558137  
0.0137642032  
0.01371305345  
0.0136642652  
0.01361391155  
0.01356604071  
0.01351769869  
0.01347015193  
0.0134252059  
0.01337920241  
0.01333297174  
0.01328944732  
0.01324603592  
0.01320329584  
0.01316120422  
0.01312127938  
0.01308062221  
0.01304061539  
0.0130017955  
0.01296307845  
0.0129256892  
0.01288729586  
0.01285117878  
0.01281587333  
0.01278120133  
0.0127468136  
0.01271356794  
0.01268009074  
0.01264737531  
0.01261551732  
0.01258443562  
0.012555205  
0.01252366731  
0.01249442905  
0.01246611239  
0.01243814493  
0.01240967412  
0.0123836917  
0.01235819008  
0.01233169536  
0.01230748304  
0.01228210298  
0.01225678697  
0.01223280226  
0.01221052759  
0.01218929067  
0.01216691237  
0.01214617973  
0.01212458359  
0.01210567758  
0.01208527258  
0.01206687826  
0.01204860144  
0.01203047365  
0.01201303073  
0.01199533881  
0.01197949443  
0.0119636265  
0.01194780625  
0.01193421888  
0.01191900579  
0.011904752  
0.01189344106  
0.01187908985  
0.01186772072  
0.01185428215  
0.0118437998  
0.01183349463  
0.01182489379  
0.01181474285  
0.01180498511  
0.01179682315  
0.01178859922  
0.01178043345  
0.01177330463  
0.0117675565  
0.01176111275  
0.01175486416  
0.01174934299  
0.01174512382  
0.01174092087  
0.01173698197  
0.01173519641  
0.01173176125  
0.01172892811  
0.01172718103  
0.01172720302  
0.01172549735  
0.01172505385  
