0.5931018873  
0.8535117186  
1.101180023  
1.322244563  
1.505552692  
1.64393128  
1.734951635  
1.781084927  
1.789238425  
1.769762469  
1.735045893  
1.697912796  
1.669998118  
1.660313514  
1.674149639  
1.712427806  
1.771574041  
1.843907807  
1.918529974  
1.982606433  
2.022948576  
2.027737634  
1.988224661  
1.900209972  
1.765118461  
1.590491908  
1.389751245  
1.181162602  
0.9860036051  
0.8260613146  
0.7206875916  
0.6837433932  
0.7208348845  
0.8272924851  
0.9872609817  
1.174214315  
1.353020371  
1.483465325  
1.52493462  
1.441715781  
1.208247306  
0.8135573239  
0.2641756608  
-0.4150279693  
-1.182371725  
-1.983199771  
-2.755648309  
-3.437612342  
-3.973988597  
-4.323189946  
-4.462004857  
-4.3881148  
-4.119924019  
-3.693764442  
-3.158930297  
-2.571287561  
-1.986415997  
-1.45323024  
-1.008931533  
-0.6758791594  
-0.4606583372  
-0.355280932  
-0.3401675511  
-0.3883093426  
-0.4699402291  
-0.5569902601  
-0.6267416987  
-0.6642508377  
-0.6633355147  
-0.6261510697  
-0.5615757016  
-0.4827878459  
-0.4044672723  
-0.3400983168  
-0.2997541378  
-0.2886493527  
-0.3066029553  
-0.3483933535  
-0.4048701999  
-0.4645799962  
-0.5156011749  
-0.5473063886  
-0.5517795718  
-0.5247171341  
-0.4657300737  
-0.3780603637  
-0.2678170609  
-0.1429050539  
-0.01183481037  
0.1173923186  
0.2381615935  
0.345790022  
0.4377081594  
0.5132952172  
0.5734713687  
0.6201479385  
0.655671185  
0.682352202  
0.7021720517  
0.7166795086  
0.7270539329  
0.7342863349  
0.739385983  
0.7435368708  
0.748127659  
0.7546335968  
0.7643556604  
0.7780657327  
0.7956378496  
0.8157669324  
0.8358524282  
0.8521100332  
0.8599306476  
0.8544474321  
0.8312406776  
0.7870697928  
0.7205069578  
0.6323631355  
0.525815447  
0.4062184182  
0.2805945267  
0.1568856886  
0.04307207224  
-0.05371695784  
-0.1279754244  
-0.1763614607  
-0.1979519133  
-0.1941839369  
-0.1685082919  
-0.1258321379  
-0.07183950941  
-0.01228642617  
0.04762113205  
0.1037006604  
0.15307653  
0.1942549446  
0.2270197299  
0.2521878131  
0.2712816732  
0.2861815948  
0.2988081629  
0.3108876136  
0.3238066474  
0.338576335  
0.3558812505  
0.3761841605  
0.3998474787  
0.4272201798  
0.4586571994  
0.4944391833  
0.5345842018  
0.5785751471  
0.6250501035  
0.671500037  
0.7140730398  
0.747548203  
0.7655364029  
0.76094406  
0.7266772434  
0.6565467069  
0.546252416  
0.3943180256  
0.2028327091  
-0.02216617682  
-0.2707567191  
-0.5297089601  
-0.7835577219  
-1.016062322  
-1.211906391  
-1.35840204  
-1.446991351  
-1.474309215  
-1.442649362  
-1.359748065  
-1.237885191  
-1.092406367  
-0.9398628963  
-0.7960079182  
-0.6739230962  
-0.5825323362  
-0.5257074215  
-0.502060999  
-0.5054741465  
-0.526231975  
-0.5526108547  
-0.5726756607  
-0.5760214879  
-0.5552262412  
-0.506813473  
-0.4316261307  
-0.3345828365  
-0.2238781015  
-0.1097826404  
-0.003216243407  
0.08569010666  
0.1488426119  
0.181094159  
0.180710687  
0.1493710583  
0.09173319799  
0.01467473172  
-0.07367434518  
-0.1649397441  
-0.2514293492  
-0.3268513445  
-0.3867661765  
-0.4287349437  
-0.4521968211  
-0.4581478104  
-0.4486703932  
-0.4264458744  
-0.3943113145  
-0.3549252451  
-0.3105832414  
-0.2631759009  
-0.2142586733  
-0.165201284  
-0.1173319011  
-0.07204184335  
-0.03080095536  
0.004935852631  
0.03392103909  
0.05536161294  
0.06917884689  
0.07620688169  
0.07827749079  
0.07814295349  
0.07923806477  
0.08527589199  
0.09975541587  
0.125431377  
0.1638411396  
0.2149636735  
0.2770847571  
0.3468955789  
0.4198244098  
0.4905648477  
0.553727055  
0.6045215045  
0.6393602798  
0.6563087297  
0.6552826013  
0.6379914498  
0.6076096302  
0.5682512168  
0.5243123936  
0.4798139809  
0.4378371081  
0.4001613295  
0.3671499128  
0.3379203515  
0.3107269743  
0.2835094103  
0.2544820675  
0.2226330557  
0.1880582489  
0.1520296089  
0.116810895  
0.08523610248  
0.0601476894  
0.0438064192  
0.03739343545  
0.04070920647  
0.05213364344  
0.06885092123  
0.08730145399  
0.1037680246  
0.1149745254  
0.1185875634  
0.1135134692  
0.09994556638  
0.07915244657  
0.05307302062  
0.02379763591  
-0.006941970302  
-0.03815728508  
-0.06978263079  
-0.1026049317  
-0.1379570446  
-0.1772395125  
-0.2213772578  
-0.2703274212  
-0.3227622073  
-0.3759956361  
-0.4261998396  
-0.4688812534  
-0.499534163  
-0.5143615505  
-0.5109151035  
-0.4885383007  
-0.4485163582  
-0.3938974974  
-0.3290209523  
-0.2588228595  
-0.1880633176  
-0.1206171214  
-0.0589541318  
-0.003919544679  
0.04515830216  
0.09005466339  
0.1330181404  
0.1760596341  
0.2203124295  
0.2655940155  
0.3102796762  
0.3515144766  
0.3857474387  
0.4094737443  
0.4200634982  
0.4164882255  
0.399800032  
0.373237069  
0.3419136982  
0.3121039881  
0.2902319401  
0.2817396428  
0.2900190993  
0.3156172091  
0.3558694209  
0.4050516619  
0.4550543353  
0.4965084907  
0.5201901576  
0.5185088066  
0.4868455139  
0.4245184077  
0.3352084384  
0.2267519589  
0.110274378  
-0.001232503417  
-0.0947317747  
-0.1591056482  
-0.1869929728  
-0.176210786  
-0.1305429664  
-0.05969749576  
0.02157524441  
0.09517575525  
0.1419507716  
0.1443035566  
0.08877106859  
-0.03183499664  
-0.2170264352  
-0.4582602702  
-0.7396664693  
-1.039831089  
-1.33439974  
-1.599147547  
-1.813059646  
-1.960963732  
-2.035316608  
-2.036886568  
-1.974234896  
-1.862100768  
-1.718963733  
-1.56417528  
-1.415099009  
-1.284705789  
-1.179938906  
-1.101067082  
-1.042061738  
-0.9918728995  
-0.9363875322  
-0.8607366084  
-0.7516234652  
-0.5993724285  
-0.3994299274  
-0.1531923526  
0.1319200649  
0.443105671  
0.7634350352  
1.073547552  
1.353608121  
1.585293685  
1.753612362  
1.848355429  
1.865056786  
1.805346625  
1.676676469  
1.491461882  
1.265731334  
1.017448456  
0.7646960926  
0.5239335912  
0.3085314956  
0.127738139  
-0.01379745666  
-0.1159120331  
-0.1822745313  
-0.219279573  
-0.2346757815  
-0.2361335431  
-0.2299681167  
-0.2202216528  
-0.2082465702  
-0.1928601565  
-0.1710564453  
-0.1391572498  
-0.09420845463  
-0.03536628528  
0.03497460351  
0.1105895584  
0.181510486  
0.2348893284  
0.2565693473  
0.2331958342  
0.1545602956  
0.01583151828  
-0.1807282637  
-0.4248788431  
-0.6986001912  
-0.9774336888  
-1.232888826  
-1.435624227  
-1.559004288  
-1.582516487  
-1.494561249  
-1.294162522  
-0.991321889  
-0.6059206782  
-0.1652961259  
0.2991773741  
0.7560057233  
1.177420618  
1.542574041  
1.83959513  
2.06622178  
2.228911426  
2.340610219  
2.417564817  
2.475733466  
2.527423572  
2.578735885  
2.628288879  
2.667450902  
2.682068034  
2.655391815  
2.571700129  
2.419959248  
2.196855068  
1.908588131  
1.571056495  
1.208287534  
0.8493081723  
0.5239013731  
0.2579277579  
0.06898065561  
-0.03687529093  
-0.06668554276  
-0.0401746972  
0.01271062384  
0.055972687  
0.05283509875  
-0.0286675291  
-0.2106443584  
-0.5016276691  
-0.8947585367  
-1.368164941  
-1.887489093  
-2.41018976  
-2.890985964  
-3.287647124  
-3.566294019  
-3.705490102  
-3.698563268  
-3.553930784  
-3.293434633  
-2.949039999  
-2.558415889  
-2.160070809  
-1.788734277  
-1.471581643  
-1.225747237  
-1.057355691  
-0.9620615958  
-0.9268964847  
-0.9330279671  
-0.9589980649  
-0.9839266559  
-0.9902691583  
-0.9658127691  
-0.9047254632  
-0.8076255685  
-0.6807951489  
-0.5347241713  
-0.3822802186  
-0.2367637167  
-0.1101278121  
-0.01155890212  
0.05344914563  
0.0834828435  
0.08106008001  
0.05203798889  
0.004681297643  
-0.0514724803  
-0.1068021733  
-0.1527170652  
-0.1825803406  
-0.1923454997  
-0.1808401416  
-0.1496926998  
-0.1028835605  
-0.04601229494  
0.01465392567  
0.07321287447  
0.1251053122  
0.1678966099  
0.2017463245  
0.2294613037  
0.2561410937  
0.2884003301  
0.3333085945  
0.3971643588  
0.4842984741  
0.5960853091  
0.7303343711  
0.881165924  
1.039418239  
1.193563301  
1.331001185  
1.439573653  
1.509082401  
1.532604817  
1.507414468  
1.435385975  
1.322830195  
1.17977976  
1.018841628  
0.8537761098  
0.6979910737  
0.5631669571  
0.458167667  
0.3883689702  
0.3554621842  
0.3577026217  
0.3905489213  
0.4475302699  
0.5212230114  
0.6041531892  
0.6895220056  
0.7716524891  
0.8461515712  
0.9098033347  
0.9602850497  
0.9958101778  
1.014815648  
1.015786795  
0.997279606  
0.9581525011  
0.8979464317  
0.8173444108  
0.7185767401  
0.6056633015  
0.4843927505  
0.3620005159  
0.2465330081  
0.1459865051  
0.06731906538  
0.01550348352  
-0.007237732331  
-0.001856350602  
0.02751278967  
0.07400270187  
0.1288697144  
0.1826498649  
0.2264328087  
0.2530786578  
0.2581585051  
0.2404913427  
0.2021665405  
0.1480461877  
0.08484143096  
0.01987779239  
-0.04021981578  
-0.09072685456  
-0.1297091893  
-0.1584420755  
-0.1813122492  
-0.2051916771  
-0.2383837357  
-0.2893023296  
-0.3650803148  
-0.4703132265  
-0.6061271161  
-0.7697220037  
-0.9544442905  
-1.150400775  
-1.345528581  
-1.526975485  
-1.6826036  
-1.802427008  
-1.879770004  
-1.912016755  
-1.900833813  
-1.851856418  
-1.773872709  
-1.677618745  
-1.574343349  
-1.47434822  
-1.385678381  
-1.313158071  
-1.257895643  
-1.217328316  
-1.18579955  
-1.155594396  
-1.118283925  
-1.066189921  
-0.9937434466  
-0.8985524195  
-0.7819924118  
-0.6492314348  
-0.508676654  
-0.3709035892  
-0.2472379368  
-0.1481758777  
-0.08189446554  
-0.05306992413  
-0.0621615415  
-0.1052870844  
-0.1746761106  
-0.2596400674  
-0.3478995379  
-0.4270628874  
-0.4860515618  
-0.5162554593  
-0.5122664258  
-0.4721203146  
-0.3970169708  
-0.2906113558  
-0.1580060487  
-0.004631153117  
0.1647816556  
0.3469517369  
0.540370667  
0.7451203875  
0.9621891907  
1.192375188  
1.434959342  
1.686370709  
1.939118157  
2.181228062  
2.396397583  
2.564959281  
2.66564797  
2.678015794  
2.585219002  
2.376804782  
2.051086206  
1.616700662  
1.093034974  
0.5093535358  
-0.0973793052  
-0.6857714403  
-1.214017182  
-1.64414779  
-1.94599754  
-2.100351262  
-2.100880422  
-1.954604526  
-1.680845264  
-1.308812549  
-0.8741577677  
-0.4149554845  
0.03238277757  
0.4367450921  
0.7751003352  
1.034127433  
1.210565059  
1.31034678  
1.346715073  
1.337620929  
1.302815057  
1.261003238  
1.227422072  
1.212100141  
1.218968297  
1.245843963  
1.285233947  
1.325783515  
1.354144238  
1.357005551  
1.323027629  
1.244448817  
1.118181862  
0.9462937287  
0.7358327008  
0.4980371246  
0.2470491025  
-0.00171415842  
-0.233317979  
-0.4349828703  
-0.5974718257  
-0.7160183802  
-0.7906856406  
-0.8261110769  
-0.8306728542  
-0.8151718036  
-0.7912120243  
-0.7694787922  
-0.7581496894  
-0.7616651061  
-0.7800378533  
-0.8088149764  
-0.8397293383  
-0.8619769866  
-0.8639428072  
-0.835155958  
-0.7681793725  
-0.6601542601  
-0.5137556986  
-0.3373888268  
-0.144575839  
0.04740387579  
0.2194389657  
0.3528213298  
0.4314640292  
0.4438120199  
0.3841700784  
0.2532918605  
0.05816714157  
-0.1889136163  
-0.4718685219  
-0.7726377084  
-1.073049741  
-1.356470417  
-1.609042416  
-1.820396866  
-1.983831353  
-2.096012268  
-2.156360005  
-2.166276948  
-2.128405876  
-2.046038898  
-1.922773132  
-1.762418154  
-1.569114231  
-1.347562762  
-1.103256119  
-0.8426075781  
-0.5728874628  
-0.3019564676  
-0.03780182261  
0.2120483685  
0.4411208524  
0.6445173072  
0.8192405073  
0.9642921488  
1.080505788  
1.170176078  
1.236545576  
1.283247812  
1.313802285  
1.331247871  
1.337936486  
1.335504633  
1.324974622  
1.306927629  
1.281678522  
1.249386135  
1.210068884  
1.163527944  
1.109210079  
1.046072263  
0.9725260631  
0.8865274821  
0.7858478672  
0.6685229568  
0.533446146  
0.3809962541  
0.2135918283  
0.03605166661  
-0.144367189  
-0.3183042062  
-0.4750277373  
-0.6034985888  
-0.6936553153  
-0.7377432921  
-0.7314906347  
-0.6749501034  
-0.5728505893  
-0.434375764  
-0.2723634896  
-0.1020137752  
0.0607316533  
0.200937121  
0.3063010152  
0.3684594584  
0.3837901986  
0.3536221432  
0.2838413538  
0.1839600154  
0.06580186309  
-0.05801698692  
-0.1756002175  
-0.2770702983  
-0.3555111591  
-0.4074465649  
-0.4328295671  
-0.4345853175  
-0.4178104821  
-0.3887755796  
-0.3538876532  
-0.3187746731  
-0.287602203  
-0.2627111308  
-0.2445775705  
-0.2320839075  
-0.2229973897  
-0.2145631474  
-0.2041096566  
-0.1895383651  
-0.1696547341  
-0.1442813326  
-0.1141812524  
-0.08080817044  
-0.04596520232  
-0.01143903078  
0.02131709611  
0.05140248874  
0.07855735376  
0.1031187703  
0.1258749354  
0.1478474662  
0.1700646967  
0.1933600578  
0.218236528  
0.244817248  
0.272872724  
0.3019015701  
0.3312548785  
0.3602419949  
0.3882179083  
0.4146214594  
0.4389672491  
0.4608178132  
0.4797396395  
0.49528263  
0.5069908054  
0.5144478009  
0.5173448919  
0.5155427578  
0.5090978698  
0.4982277089  
0.4831929894  
0.4641129531  
0.4407432765  
0.412264466  
0.3771467044  
0.3331462686  
0.2774763231  
0.2071577228  
0.1195292311  
0.01283218103  
-0.1132057797  
-0.2569240639  
-0.4144938689  
-0.5800013047  
-0.7458415411  
-0.9034254084  
-1.044095675  
-1.160135863  
-1.245704693  
-1.29756319  
-1.315461153  
-1.302113386  
-1.262757117  
-1.20435929  
-1.134577764  
-1.060647832  
-0.9883681681  
-0.921336256  
-0.8605653997  
-0.8045366015  
-0.7496679356  
-0.6911423303  
-0.6239329984  
-0.543868437  
-0.4485616363  
-0.3380374077  
-0.2149594865  
-0.08441240731  
0.04672299934  
0.1707121898  
0.2800637695  
0.3686066356  
0.4323762446  
0.4701762824  
0.4837235368  
0.4773688295  
0.4574514251  
0.4313936194  
0.4066854482  
0.3899235191  
0.3860281925  
0.3977560038  
0.4255405193  
0.4676526821  
0.5206200623  
0.5798071786  
0.6400559751  
0.6962746596  
0.7439159834  
0.7792905002  
0.7997294594  
0.8036101106  
0.7902984083  
0.7600592533  
0.7139640394  
0.6538295074  
0.5821605975  
0.5020993433  
0.4173199654  
0.3318552443  
0.2498309532  
0.1751128191  
0.1109071183  
0.05936877836  
0.02128272604  
-0.004098361401  
-0.01902052429  
-0.02697192664  
-0.03221574596  
-0.03917963904  
-0.05177587044  
-0.07276543293  
-0.1032733212  
-0.1425350655  
-0.1879330556  
-0.2353258952  
-0.2796342639  
-0.315597655  
-0.3385925324  
-0.3453862507  
-0.3347139885  
-0.307574012  
-0.2671998676  
-0.2187046577  
-0.1684263309  
-0.1230919383  
-0.08890119583  
-0.070680989  
-0.07123896216  
-0.09100693057  
-0.1280428475  
-0.1783703424  
-0.2366093602  
-0.29677919  
-0.3531372868  
-0.4009220111  
-0.4368649372  
-0.4594182679  
-0.4686663995  
-0.4659612947  
-0.4533909476  
-0.4331646664  
-0.4070870101  
-0.3761811298  
-0.3405711731  
-0.2996125213  
-0.252256088  
-0.1975554026  
-0.1352223569  
-0.06609255666  
0.007585627042  
0.08211895046  
0.1526296424  
0.2135692333  
0.2594240632  
0.2854956884  
0.2886326572  
0.2677919783  
0.2243291601  
0.1619627375  
0.08641837013  
0.004800665128  
-0.07522230134  
-0.1462829319  
-0.202125379  
-0.2382299426  
-0.2521938593  
-0.2438173763  
-0.2149288874  
-0.168976211  
-0.1104762719  
-0.04441317779  
0.02433579702  
0.09146734104  
0.1535780868  
