123.7764939  
158.03383  
224.6503668  
503.6390439  
2798.729248  
18872.59498  
37484.16844  
29828.18381  
39519.13285  
17600.80873  
45245.06748  
58091.24479  
788.5224037  
13005.48268  
13487.53455  
7629.39739  
14240.84939  
8471.324515  
4505.668505  
439.9801009  
661.740659  
580.2751527  
6848.67623  
1926.458817  
12898.37962  
11504.03646  
5671.185859  
311.0851277  
33013.30592  
447.2501987  
10333.24761  
3461.595834  
4835.624341  
4798.021706  
6522.678724  
3599.338732  
4705.008141  
1126.594772  
4734.092142  
89.95117379  
2677.213555  
9485.182992  
3036.450034  
5203.338504  
2458.256985  
2514.126331  
2350.993788  
350.9371908  
1094.406185  
2337.558047  
347.253347  
3767.676739  
3264.987167  
3062.07787  
423.8292283  
81.03769346  
2130.326895  
3802.462643  
1287.481268  
3045.736108  
1731.766141  
16.13295142  
287.6712798  
1136.680776  
69.21044875  
135.7848233  
144.8127691  
34.70233911  
72.8943811  
77.75410129  
12.71428989  
2.799801378  
10.43458113  
1.676947602  
14.84827915  
6.167795077  
2.34567685  
1.527247079  
1.420234902  
0.8551534069  
0.3024840034  
0.7863703257  
1.015329073  
0.384829637  
0.494634901  
0.4108826361  
0.5908653225  
0.3461650757  
0.2662322783  
0.1763252704  
0.1587467586  
0.1223687402  
0.1221562947  
0.1231044723  
0.1621200583  
0.1101131559  
0.09397885653  
0.08964480991  
0.07811524817  
0.08235238195  
0.07425361648  
0.072105952  
0.05945264254  
0.05931468264  
0.05073546824  
0.05127367727  
0.04659518407  
0.04175877032  
0.04143350776  
0.03647099728  
0.03469783966  
0.03164329574  
0.03015996601  
0.02789423159  
0.02620966359  
0.02487317174  
0.02333802835  
0.02244732317  
0.02048911979  
0.01943365087  
0.01849465176  
0.01752245962  
0.01636270849  
0.01543884944  
0.01458143166  
0.01382485676  
0.01305410638  
0.01241891516  
0.01172360115  
0.01118302198  
0.01058721459  
0.01007036592  
0.00956507034  
0.009084843443  
0.008648860286  
0.008232789537  
0.007837056517  
0.007474180511  
0.007125597861  
0.006803887226  
0.006493715655  
0.006215837588  
0.005928521976  
0.005670035751  
0.005421854652  
0.005183764151  
0.004968625052  
0.004756513766  
0.004556621515  
0.00436771423  
0.004187083483  
0.004018548988  
0.003855806136  
0.00370317006  
0.003555324213  
0.003416713969  
0.003283907116  
0.003159213251  
0.003037387649  
0.002921777575  
0.002813436806  
0.002708313893  
0.002608611513  
0.002513970079  
0.002422890941  
0.002335009412  
0.002251831108  
0.002173403343  
0.002096159585  
0.002023571156  
0.001953987953  
0.001886993795  
0.001823009807  
0.001762113848  
0.001703196247  
0.001647593773  
0.001592883239  
0.001540758505  
0.001491485806  
0.001443377611  
0.001398238133  
0.001354114807  
0.001311420221  
0.001271208974  
0.001231323843  
0.001192916168  
0.00115768244  
0.001122183898  
0.001089279057  
0.001056502308  
0.001025990685  
0.0009946368853  
0.0009665722004  
0.0009379459363  
0.0009123602528  
0.0008854298853  
0.0008604003324  
0.000836932219  
0.0008133257702  
0.0007909036887  
0.0007689619593  
0.0007482106413  
0.0007274379309  
0.0007089861985  
0.0006894771692  
0.0006712962218  
0.0006537050069  
0.0006372932559  
0.0006201440528  
0.0006031964046  
0.0005886805534  
0.0005736265878  
0.0005594062363  
0.0005450399494  
0.0005315705955  
0.0005180436429  
0.0005046827518  
0.0004934689047  
0.0004808801347  
0.0004693503999  
0.0004578647521  
0.0004477750645  
0.0004367394338  
0.0004258827182  
0.0004161932604  
0.0004069051061  
0.0003979938681  
0.0003882027904  
0.0003799613875  
0.0003709995539  
0.0003631190754  
0.0003546340432  
0.0003465895613  
0.0003388056997  
0.0003319091723  
0.0003245741249  
0.0003174236356  
0.000310787977  
0.0003038833677  
0.0002974475172  
0.0002913820528  
0.0002854920766  
0.0002790574496  
0.0002732877963  
0.0002681365336  
0.0002624327628  
0.000256912156  
0.0002516961927  
0.0002465572746  
0.0002416667882  
0.0002369023304  
0.0002323014993  
0.0002276991341  
0.0002232376158  
0.0002189371473  
0.0002144452201  
0.0002107916176  
0.0002066780724  
0.0002026439671  
0.0001989422199  
0.0001952969857  
0.0001916590758  
0.0001879570064  
0.0001846945808  
0.0001811831648  
0.000178034977  
0.0001745336202  
0.0001715704596  
0.0001686413125  
0.0001655874269  
0.0001626756998  
0.000160078388  
0.0001569629143  
0.0001541048886  
0.0001519918854  
0.0001492488996  
0.0001466101198  
0.0001441191979  
0.0001418623769  
0.0001395083915  
0.0001371426045  
0.0001346792056  
0.000132322192  
0.0001301877038  
0.00012817985  
0.0001260891077  
0.0001242806759  
0.0001223844965  
0.0001204532606  
0.0001184149867  
0.0001166846452  
0.0001148475722  
0.0001128387125  
0.0001111139595  
0.0001097275349  
0.0001077848571  
0.0001063328127  
0.0001045979151  
0.0001033316009  
0.0001018005549  
0.0001001365854  
9.855374774e-05  
9.735605488e-05  
9.583163253e-05  
9.45393577e-05  
9.312705616e-05  
9.161809036e-05  
9.054927825e-05  
8.932465678e-05  
8.824523087e-05  
8.726532782e-05  
8.569383209e-05  
8.419237957e-05  
8.331763295e-05  
8.220200796e-05  
8.096985467e-05  
7.994137499e-05  
7.908285836e-05  
7.786571418e-05  
7.696753721e-05  
7.598835999e-05  
7.499901812e-05  
7.410456721e-05  
7.331212866e-05  
7.228082255e-05  
7.137919421e-05  
7.049594955e-05  
6.970842776e-05  
6.868878474e-05  
6.778095907e-05  
6.691206751e-05  
6.614073511e-05  
6.530265797e-05  
6.469942008e-05  
6.383150508e-05  
6.319292904e-05  
6.231407648e-05  
6.179695663e-05  
6.103838041e-05  
6.021522729e-05  
5.947269353e-05  
5.894475401e-05  
5.822923852e-05  
5.75935698e-05  
5.711844232e-05  
5.630287931e-05  
5.551857618e-05  
5.53014507e-05  
5.45287599e-05  
5.397999623e-05  
5.34591464e-05  
5.304092625e-05  
5.223933855e-05  
5.185438222e-05  
5.127468537e-05  
5.066664786e-05  
5.01943614e-05  
4.970752878e-05  
4.917420301e-05  
4.866738968e-05  
4.820940171e-05  
4.774148093e-05  
4.723620266e-05  
4.675423435e-05  
4.647047931e-05  
4.601608883e-05  
4.544795255e-05  
4.515643278e-05  
4.469984961e-05  
4.421928337e-05  
4.396678908e-05  
4.347669666e-05  
4.324168324e-05  
4.278943222e-05  
4.241717849e-05  
4.203056003e-05  
4.155648804e-05  
4.138257725e-05  
4.083438553e-05  
4.067115073e-05  
4.004500996e-05  
3.995696823e-05  
3.957262371e-05  
3.923466432e-05  
3.901720066e-05  
3.878660447e-05  
3.847815812e-05  
3.810846957e-05  
3.769227599e-05  
3.744511361e-05  
3.70825236e-05  
3.680564878e-05  
3.659106522e-05  
3.640114965e-05  
3.598340019e-05  
3.572949284e-05  
3.555211668e-05  
3.519169691e-05  
3.502502016e-05  
3.477908775e-05  
3.4500936e-05  
3.446226241e-05  
3.411787786e-05  
3.385778238e-05  
3.374648015e-05  
3.331510507e-05  
3.325505108e-05  
3.300740772e-05  
3.274874324e-05  
3.250285796e-05  
3.241656308e-05  
3.216978341e-05  
3.193935358e-05  
3.184307027e-05  
3.163108593e-05  
3.141183601e-05  
3.120293197e-05  
3.120906569e-05  
3.091926176e-05  
3.085251359e-05  
3.065377152e-05  
3.032155722e-05  
3.016688478e-05  
3.004207555e-05  
2.99921277e-05  
2.98172833e-05  
2.959530977e-05  
2.964731071e-05  
2.944062872e-05  
2.919801758e-05  
2.906787616e-05  
2.892894225e-05  
2.881116826e-05  
2.861737851e-05  
2.854726219e-05  
2.843278943e-05  
2.838592138e-05  
2.837916602e-05  
2.817881363e-05  
2.808454103e-05  
2.79436448e-05  
2.773425282e-05  
2.772527929e-05  
2.766574058e-05  
2.751514029e-05  
2.732413413e-05  
2.717979352e-05  
2.725997954e-05  
2.70349071e-05  
2.696070499e-05  
2.687869901e-05  
2.692725859e-05  
2.677694198e-05  
2.652930643e-05  
2.662428976e-05  
2.641202965e-05  
2.644914332e-05  
2.646343561e-05  
2.619571052e-05  
2.624925313e-05  
2.618679958e-05  
2.610336261e-05  
2.604687501e-05  
2.601026327e-05  
2.594480982e-05  
2.599800392e-05  
2.583383322e-05  
2.576513356e-05  
2.573708118e-05  
2.560885856e-05  
2.553771124e-05  
2.556518616e-05  
2.552255101e-05  
2.554410201e-05  
2.54286137e-05  
2.541809399e-05  
2.543577621e-05  
2.539740573e-05  
2.526866746e-05  
2.514706917e-05  
2.5375143e-05  
2.533338412e-05  
2.51683987e-05  
2.51185318e-05  
2.525395174e-05  
2.523457878e-05  
2.507901655e-05  
2.520189407e-05  
2.52295315e-05  
2.523621704e-05  
2.518382906e-05  
2.520138744e-05  
2.511310249e-05  
2.519996264e-05  
