-0.04352608256  
-0.6851072978  
-1.289112295  
-1.822102275  
-2.256056524  
-2.570201548  
-2.752190028  
-2.798565981  
-2.714527691  
-2.513064782  
-2.2135954  
-1.840254791  
-1.420015357  
-0.9807691955  
-0.549538501  
-0.1509043633  
0.1942813771  
0.4698467077  
0.6649304319  
0.7742890564  
0.798307935  
0.7427527942  
0.6182725672  
0.4396665469  
0.224948531  
-0.005792431443  
-0.2316986636  
-0.4325542978  
-0.5902449825  
-0.6901540639  
-0.7223912537  
-0.6827214902  
-0.5731028075  
-0.4017103164  
-0.1824182772  
0.06628789654  
0.3229092094  
0.5649288847  
0.7710245785  
0.9232746281  
1.009095316  
1.022667454  
0.965626176  
0.8468853206  
0.6815817034  
0.4892214588  
0.2912664474  
0.1084785533  
-0.04161294291  
-0.1467388888  
-0.2011331697  
-0.2058004281  
-0.1677883079  
-0.09860616373  
-0.01206851353  
0.07806001958  
0.1602315496  
0.2267182241  
0.274427575  
0.3048021432  
0.3228962608  
0.3358319436  
0.3509573852  
0.3740583467  
0.407979387  
0.451875849  
0.5012229362  
0.5485346637  
0.5846274927  
0.6001497606  
0.5870940107  
0.5399885421  
0.4566083023  
0.3381045868  
0.1886098752  
0.01446993613  
-0.1766759447  
-0.3767493294  
-0.5778342729  
-0.7724241525  
-0.9533243725  
-1.113303179  
-1.244676658  
-1.339022194  
-1.387221769  
-1.379948904  
-1.308647995  
-1.166919763  
-0.9521370767  
-0.667039715  
-0.3210112665  
0.06925603159  
0.4799278993  
0.8811712585  
1.239271954  
1.519597022  
1.690134073  
1.725226423  
1.609066461  
1.338472686  
0.9245454656  
0.3928682815  
-0.2178907795  
-0.858969323  
-1.475850135  
-2.013533304  
-2.422170341  
-2.662403996  
-2.709758894  
-2.557499261  
-2.217580327  
-1.719503777  
-1.107212357  
-0.4343658212  
0.2414007515  
0.8645235211  
1.387113917  
1.773440433  
2.002787593  
2.070436483  
1.986766768  
1.774757016  
1.46633104  
1.098144999  
0.707400707  
0.3282230922  
-0.01103268901  
-0.2893471948  
-0.4934843575  
-0.6175042464  
-0.6616201661  
-0.6307556451  
-0.5331148491  
-0.3790150276  
-0.1801106655  
0.05097980605  
0.3007546411  
0.5547847335  
0.7977723187  
1.01386109  
1.187336303  
1.303696178  
1.351022624  
1.321432947  
1.212389833  
1.027599925  
0.7772964588  
0.47777239  
0.1501617642  
-0.1814324665  
-0.492246639  
-0.7592977672  
-0.9636540538  
-1.092233536  
-1.138898661  
-1.104728916  
-0.997465031  
-0.830236943  
-0.6197944246  
-0.3845040387  
-0.1424103903  
0.09039321938  
0.3008871983  
0.4796523717  
0.6208258655  
0.7215859748  
0.7813475976  
0.8008822664  
0.7815494545  
0.7247968517  
0.632004072  
0.5046760158  
0.3449012076  
0.1559580537  
-0.05707756125  
-0.286893399  
-0.5237633042  
-0.7557420154  
-0.9692313718  
-1.149905176  
-1.283905735  
-1.359189936  
-1.366882865  
-1.302461534  
-1.166626753  
-0.9657179556  
-0.7115809878  
-0.4208558724  
-0.1137113256  
0.1878825238  
0.4621754715  
0.6897532366  
0.8555224979  
0.9503381169  
0.9720576698  
0.9258993082  
0.8240099413  
0.684263738  
0.5284043598  
0.3796945081  
0.2603590933  
0.1890867207  
0.1788818675  
0.235540932  
0.3569194045  
0.5330857321  
0.7473501722  
0.9780324835  
1.200767692  
1.391057342  
1.52678394  
1.590394602  
1.57053085  
1.462951502  
1.270699703  
1.003555727  
0.6768907386  
0.3101149664  
-0.07509960086  
-0.4566100293  
-0.8134519443  
-1.127236181  
-1.383226674  
-1.571063947  
-1.68517161  
-1.724842266  
-1.694046924  
-1.600987237  
-1.457408169  
-1.277692996  
-1.077767484  
-0.8738750457  
-0.6812851405  
-0.5130489018  
-0.3789101538  
-0.2845063552  
-0.2309693628  
-0.2150074195  
-0.2295041706  
-0.2645935949  
-0.3091199203  
-0.3522997769  
-0.3853651277  
-0.4029427725  
-0.40393581  
-0.3917263171  
-0.3736166152  
-0.359548482  
-0.3602512084  
-0.3851026643  
-0.4400348973  
-0.5258592524  
-0.6373137266  
-0.7630563693  
-0.8866685677  
-0.9885663095  
-1.048589331  
-1.048873242  
-0.9766086696  
-0.8262442327  
-0.6008013037  
-0.3120739553  
0.0203337113  
0.3710316224  
0.7116467967  
1.014049086  
1.25354532  
1.411647956  
1.478042604  
1.451546814  
1.339956925  
1.158866429  
0.9296492207  
0.676914283  
0.4257787652  
0.1993182131  
0.01647538023  
-0.1093498264  
-0.1709546124  
-0.1672376013  
-0.102489031  
0.01475045604  
0.1730203177  
0.3592601391  
0.5599278171  
0.7618177844  
0.9525562873  
1.120812813  
1.25635148  
1.350046398  
1.393999923  
1.381863289  
1.309404513  
1.175270163  
0.9818530039  
0.7360810692  
0.4499307568  
0.1404616935  
-0.170789475  
-0.4591318035  
-0.698732135  
-0.8651753689  
-0.9382867599  
-0.9048896097  
-0.7610574692  
-0.5135205838  
-0.1798898299  
0.2124363775  
0.6286793664  
1.030166432  
1.378513829  
1.639974574  
1.789379476  
1.81311338  
1.710712461  
1.494817768  
1.189483631  
0.8270427896  
0.4439476319  
0.07616052084  
-0.2452936528  
-0.4980006213  
-0.6705803109  
-0.7635395425  
-0.7884868864  
-0.7658361028  
-0.7213696472  
-0.6821425029  
-0.6723261626  
-0.7095443419  
-0.8022057935  
-0.9481583577  
-1.134822785  
-1.340750417  
-1.538367874  
-1.697529686  
-1.789408349  
-1.790221817  
-1.684353455  
-1.466493283  
-1.142580929  
-0.7294680753  
-0.2533763952  
0.252629167  
0.7518516084  
1.207468998  
1.585964006  
1.860093919  
2.011131898  
2.030166141  
1.918382822  
1.686372141  
1.352593722  
0.9412421251  
0.4797908049  
-0.003478463541  
-0.4816852364  
-0.9310830769  
-1.332183854  
-1.670253405  
-1.935240208  
-2.121304605  
-2.226124503  
-2.250205764  
-2.19633831  
-2.069307582  
-1.875875188  
-1.624930027  
-1.327699129  
-0.9978118134  
-0.6510821471  
-0.304882565  
0.02289850077  
0.3152575347  
0.5576565848  
0.7395606659  
0.8556711117  
0.9066396464  
0.8990893061  
0.8448804254  
0.759701378  
0.6611234285  
0.5663948711  
0.490264165  
0.4431477427  
0.4298721379  
0.4491967522  
0.4941511108  
0.5531542873  
0.6117603919  
0.6547847392  
0.6685443574  
0.642901715  
0.5728582895  
0.459490533  
0.3100937032  
0.1375070327  
-0.04131178362  
-0.2073132763  
-0.3417415732  
-0.4286102413  
-0.4569441022  
-0.4225062085  
-0.328754475  
-0.1868627322  
-0.0147557881  
0.1647898089  
0.3267729167  
0.4470255179  
0.5053342784  
0.4882141498  
0.3909557346  
0.2186620513  
-0.01391026374  
-0.2837135954  
-0.5618463846  
-0.8167753445  
-1.017966772  
-1.139477711  
-1.163076483  
-1.080507468  
-0.8946347005  
-0.619317136  
-0.2780437348  
0.09851420804  
0.4757472628  
0.8187754109  
1.09611866  
1.282968937  
1.363709592  
1.333419805  
1.198223865  
0.974481366  
0.6869193081  
0.3659512787  
0.04446892909  
-0.2455255336  
-0.4761107024  
-0.6261239215  
-0.6830738142  
-0.6441318311  
-0.516103022  
-0.3144539413  
-0.06148185286  
0.2161332968  
0.4901497104  
0.7336695545  
0.9238382796  
1.044075804  
1.085635107  
1.048343267  
0.9404654564  
0.7777188052  
0.5815413499  
0.376803451  
0.189184914  
0.04250076669  
-0.04377086078  
-0.05649157374  
0.009790555924  
0.1522987865  
0.3603281487  
0.6163597527  
0.8978528444  
1.179527702  
1.435881914  
1.643664164  
1.784042836  
1.844231557  
1.818404874  
1.707822212  
1.520169406  
1.268222883  
0.9680224028  
0.636802582  
0.290950533  
-0.05573370785  
-0.3932626456  
-0.715995819  
-1.022444788  
-1.314373488  
-1.595332802  
-1.868852409  
-2.1365634  
-2.396547319  
-2.642190648  
-2.861773574  
-3.038928427  
-3.153983477  
-3.186101716  
-3.115983776  
-2.928818462  
-2.617103294  
-2.182917782  
-1.639309591  
-1.010505894  
-0.3308050227  
0.3578179223  
1.009228398  
1.57741964  
2.021109109  
2.308130229  
2.419070592  
2.349712343  
2.111912245  
1.732771469  
1.2521281  
0.7186060842  
0.1846552616  
-0.2988739387  
-0.6879934653  
-0.9500762382  
-1.067054687  
-1.036962943  
-0.8736500146  
-0.6047205572  
-0.2679786084  
0.09317078476  
0.4347884007  
0.7173253542  
0.9098170187  
0.9928892581  
0.9602785055  
0.8187652174  
0.5866394294  
0.2909627512  
-0.03594163598  
-0.3603218371  
-0.6506718464  
-0.8808533446  
-1.032363353  
-1.095596116  
-1.070061803  
-0.9636587009  
-0.7911797582  
-0.5722953184  
-0.3292665723  
-0.08464228991  
0.1408298939  
0.3299142493  
0.4700862906  
0.5541620242  
0.5803493455  
0.5517757184  
0.4755923337  
0.3617981049  
0.2219528155  
0.06794982713  
-0.08900034649  
-0.2390771469  
-0.3741861371  
-0.4879691421  
-0.5755487982  
-0.6331672669  
-0.6578386527  
-0.6471668131  
-0.5993968249  
-0.5137265521  
-0.3908092702  
-0.2333355888  
-0.04652911349  
0.1616035904  
0.3803912008  
0.5970623343  
0.7977185208  
0.9686367336  
1.097714343  
1.175856466  
1.198097476  
1.164269705  
1.079121298  
0.9518492519  
0.7951105561  
0.6236464183  
0.4527004412  
0.29645099  
0.1666288843  
0.0714927183  
0.01525373434  
-0.002015888166  
0.01597316266  
0.06246577672  
0.1286430177  
0.2047317256  
0.2810894131  
0.3491486633  
0.4021337411  
0.4354889725  
0.4470207679  
0.4367661486  
0.4066660627  
0.3601165713  
0.3014651176  
0.2355480423  
0.1672770577  
0.1013224652  
0.04185906534  
-0.007640431986  
-0.04459188997  
-0.06748514195  
-0.0760687416  
-0.07149135108  
-0.05637045572  
-0.03471561731  
-0.01167061141  
0.00695250677  
0.0153395546  
0.008467494915  
-0.01707602926  
-0.06237025741  
-0.1256970247  
-0.2024318697  
-0.2853779593  
-0.3655381514  
-0.4332442333  
-0.4794967719  
-0.4973135799  
-0.4828593523  
-0.4361661421  
-0.3613045244  
-0.2659533873  
-0.1604314248  
-0.05632157603  
0.03507647177  
0.1042326897  
0.1445697389  
0.1531702246  
0.1309141194  
0.08205857931  
0.01336344545  
-0.06705864073  
-0.1509424627  
-0.230931139  
-0.3013007625  
-0.3582638292  
-0.3998357755  
-0.4253374816  
-0.4346717554  
-0.4275613594  
-0.4029417628  
-0.3586613384  
-0.2915989765  
-0.198201215  
-0.07539249581  
0.07831403799  
0.2616795723  
0.4698146505  
0.6936468712  
0.9199391266  
1.131917317  
1.310491581  
1.435968179  
1.490062309  
1.458022494  
1.33060061  
1.105663473  
0.7892406111  
0.3958578026  
-0.05192744031  
-0.5248129205  
-0.9888281065  
-1.408043813  
-1.747735403  
-1.977707066  
-2.075445184  
-2.02873654  
-1.83741849  
-1.513967297  
-1.08277846  
-0.5781254418  
-0.04097070427  
0.4850387362  
0.9579208565  
1.341516034  
1.608932175  
1.744839457  
1.746338306  
1.62232554  
1.391510037  
1.079395429  
0.7147187894  
0.3258613344  
-0.062241688  
-0.4302931577  
-0.7656737683  
-1.062279355  
-1.319302394  
-1.539266671  
-1.725739319  
-1.881184794  
-2.005353243  
-2.094528063  
-2.141747751  
-2.137961457  
-2.073891427  
-1.942251361  
-1.739900734  
-1.469521727  
-1.140483768  
-0.7687039267  
-0.375478614  
0.01457521959  
0.3761676303  
0.6861946694  
0.9263809502  
1.085336745  
1.159730871  
1.154446347  
1.081705096  
0.959327068  
0.808373787  
0.6505257355  
0.5055240666  
0.3890193313  
0.3110505584  
0.2753080944  
0.279219279  
0.3147789105  
0.3699797325  
0.4306316873  
0.4823347727  
0.5123643498  
0.5112714457  
0.4740276654  
0.4006229773  
0.2960688198  
0.1698493213  
0.03489169586  
-0.09380447715  
-0.2007320908  
-0.2714635646  
-0.2941172133  
-0.2605686595  
-0.1673162863  
-0.01595278628  
0.1867899951  
0.4293998565  
0.6963297012  
0.9690811881  
1.227568709  
1.451695487  
1.623046169  
1.726572541  
1.752139695  
1.695756177  
1.560332698  
1.355829063  
1.098677107  
0.8104827204  
0.5160602272  
0.2409759179  
0.00885855688  
-0.1612248939  
-0.2569696277  
-0.2743337653  
-0.2180916787  
-0.1013340255  
0.05605797826  
0.2298180435  
0.3942629327  
0.5254803137  
0.6043018545  
0.6186755658  
0.5651346439  
0.449141951  
0.2842877075  
0.09043740751  
-0.1089177791  
-0.2897503391  
-0.4306076102  
-0.5153463747  
-0.5351318729  
-0.4894415749  
-0.385985509  
-0.2395612725  
-0.0700153734  
0.1003733393  
0.2497594931  
0.3594350915  
0.4160324143  
0.4129284007  
0.3507043085  
0.2366156944  
0.08319742956  
-0.09376210013  
-0.2775661039  
-0.4528763953  
-0.6076014451  
-0.7340907116  
-0.8295225118  
-0.8954452181  
-0.9366228772  
-0.959428106  
-0.9701049295  
-0.9732291112  
-0.9706526506  
-0.9611207718  
-0.9406145484  
-0.9033410163  
-0.8431764511  
-0.7552822494  
-0.6375849624  
-0.4918397251  
-0.324066942  
-0.1442530157  
0.03466730879  
0.1984024779  
0.3332413691  
0.428038973  
0.4759378895  
0.4755427979  
0.4313485611  
0.353321874  
0.255661244  
0.1548933517  
0.06755719513  
0.0077967485  
-0.01478368924  
0.003301328958  
0.05865490154  
0.1411758912  
0.235170645  
0.3212786358  
0.3789595058  
0.3892205895  
0.3372328724  
0.2144948365  
0.02026753002  
-0.2379081385  
-0.5446693777  
-0.8782066952  
-1.21238962  
-1.519376836  
-1.772398824  
-1.948399629  
-2.030235433  
-2.008221776  
-1.880886758  
-1.654909903  
-1.34431728  
-0.9690891973  
-0.5533807134  
-0.1235806708  
0.2935868404  
0.6727663854  
0.9913846289  
1.23074393  
1.376832065  
1.420890519  
1.359822114  
1.196444431  
0.9396132156  
0.6041301382  
0.2103663648  
-0.2165017832  
-0.6477322303  
-1.052732775  
-1.401215768  
-1.665625842  
-1.823617515  
-1.860304713  
-1.769977315  
-1.557035346  
-1.235946541  
-0.8301801441  
-0.370170721  
0.1094887568  
0.573315436  
0.9883087277  
1.32703603  
1.570099647  
1.707704407  
1.74018611  
1.677483586  
1.537635212  
1.344533293  
1.125187128  
0.9068326411  
0.7141839706  
0.5671067331  
0.4789294146  
0.4555192917  
0.4951823134  
0.5893420351  
0.7238984808  
0.8810921318  
1.041661926  
1.187069039  
1.30154405  
1.373752971  
1.397906337  
1.374204579  
1.308568156  
1.211712384  
1.097659834  
0.9818874591  
0.8793266915  
0.8024650012  
0.7597833912  
0.7547196057  
0.785280828  
0.8443402284  
0.9205673739  
0.9998576175  
1.06705857  
1.107773295  
1.110002206  
1.065434212  
0.9702485898  
0.8253564757  
0.6361006237  
0.4114930572  
0.163113059  
-0.09616029294  
-0.353429128  
-0.5969195381  
-0.8168774124  
-1.006145635  
-1.160408653  
-1.27811628  
-1.360153892  
-1.409333819  
-1.429793118  
-1.426403518  
-1.404246795  
-1.368230621  
-1.322849369  
-1.272102969  
-1.219522585  
-1.16827181  
-1.121233736  
-1.08105451  
-1.050075789  
-1.030156232  
-1.022379948  
-1.026706841  
-1.041628233  
-1.063915183  
-1.088539905  
-1.108845709  
-1.117003278  
-1.104743821  
-1.064323401  
-0.9896246315  
-0.8772329242  
-0.7273500314  
-0.5443713455  
-0.3369927354  
-0.1177645266  
0.09791595064  
0.2933003214  
0.4521284978  
0.5605725102  
0.6090487099  
0.5936222565  
0.516786115  
0.3874817078  
0.2203096549  
0.03401483876  
-0.1505701914  
-0.3128572823  
-0.434794124  
-0.5028029507  
-0.5091249778  
-0.4523831043  
-0.3373399678  
-0.1739035423  
0.02441551757  
0.2423606302  
0.464787873  
0.6782752234  
0.8722619292  
1.039600838  
1.176523878  
1.282095335  
1.357337289  
1.404223696  
1.424765494  
1.420344941  
1.391424355  
1.33762959  
1.25817727  
1.152506741  
1.020973005  
0.8654342008  
0.6896001848  
0.4990604913  
0.3009566003  
