-0.02736928486  
-0.105664594  
-0.1893306349  
-0.2785457177  
-0.3729586574  
-0.4717917833  
-0.5739615196  
-0.6781920858  
-0.7831072181  
-0.8872999554  
-0.9893750479  
-1.087955668  
-1.181681628  
-1.269169313  
-1.3489693  
-1.419496708  
-1.47894791  
-1.525206111  
-1.555757977  
-1.567624556  
-1.557365705  
-1.521177217  
-1.455122636  
-1.355518554  
-1.219460407  
-1.045468142  
-0.8341512882  
-0.588819673  
-0.3158880892  
-0.02499301608  
0.2712924284  
0.5581619662  
0.8196857803  
1.040224734  
1.205988801  
1.306563002  
1.336174969  
1.294532543  
1.187100502  
1.024736975  
0.8227348182  
0.5993441667  
0.3739767028  
0.1652692675  
-0.01074079414  
-0.1421322084  
-0.2221325855  
-0.2495635712  
-0.2286602105  
-0.1682945126  
-0.0807230167  
0.02000955347  
0.1197945029  
0.2061309367  
0.2695355994  
0.3045459756  
0.3101844517  
0.2898506375  
0.250649132  
0.2022324454  
0.1553123842  
0.12001456  
0.1042953061  
0.1126223791  
0.1451137236  
0.1972525885  
0.260254964  
0.3220615965  
0.3688584602  
0.3869413865  
0.3646869634  
0.2943722829  
0.1735779803  
0.005958471179  
-0.198747409  
-0.4255233993  
-0.6556074972  
-0.8685726591  
-1.044691832  
-1.167271651  
-1.224622446  
-1.211416298  
-1.129211804  
-0.986119885  
-0.7956278665  
-0.5748104136  
-0.3421583321  
-0.1153779101  
0.09055380751  
0.264788264  
0.4013335075  
0.4990335563  
0.5608929919  
0.5929030909  
0.6026074441  
0.597663389  
0.5846136853  
0.5680521472  
0.5502533902  
0.5312752688  
0.5094562458  
0.4821746952  
0.4467105069  
0.4010758546  
0.3446633044  
0.2786565691  
0.2061412823  
0.131935803  
0.06217590594  
0.003691180924  
-0.03674054073  
-0.05319960343  
-0.04141286285  
0.0005366808661  
0.07168648563  
0.1678971944  
0.2818789957  
0.4035610974  
0.5208313577  
0.620600852  
0.6901063896  
0.7183148226  
0.6972653885  
0.6231525538  
0.4969988613  
0.3247766457  
0.1169470085  
-0.1125672306  
-0.347840212  
-0.5726502171  
-0.7721968252  
-0.9345903366  
-1.05190602  
-1.12067526  
-1.141762201  
-1.11969022  
-1.061566483  
-0.9758035459  
-0.8708750676  
-0.7543033124  
-0.6320412023  
-0.5083027682  
-0.3858148108  
-0.2663880537  
-0.1516259224  
-0.04358414013  
0.05478741921  
0.1395391139  
0.2060035343  
0.2493920605  
0.2656040522  
0.252066103  
0.2084153834  
0.1368593422  
0.04212722057  
-0.06901649932  
-0.1886175317  
-0.3085831666  
-0.421736067  
-0.5226756667  
-0.608263132  
-0.6776265776  
-0.7316965014  
-0.7723442992  
-0.8013191943  
-0.8191994227  
-0.8245952702  
-0.8138098683  
-0.7810428092  
-0.7191707494  
-0.6209791704  
-0.4806455889  
-0.2952054973  
-0.06572814248  
0.2020430647  
0.4977480251  
0.8071881201  
1.113748859  
1.400264426  
1.651028572  
1.853650445  
2.00043947  
2.089122062  
2.122764551  
2.108939769  
2.058276319  
1.982653458  
1.893334071  
1.79934468  
1.706352847  
1.616205676  
1.527157642  
1.434729607  
1.332995829  
1.216088763  
1.079623104  
0.921835463  
0.744228532  
0.5516575323  
0.351841079  
0.1544001787  
-0.030416849  
-0.1931124292  
-0.3262238185  
-0.4252959467  
-0.489430668  
-0.5213145547  
-0.5267485487  
-0.5137520441  
-0.4913818467  
-0.4684614585  
-0.4524116617  
-0.4483558225  
-0.4586369961  
-0.4827974577  
-0.5180140148  
-0.5598607025  
-0.6032824171  
-0.6435671051  
-0.6771433649  
-0.7020718957  
-0.7181535001  
-0.7266594759  
-0.7297659011  
-0.7298305533  
-0.7286808176  
-0.7270604442  
-0.7243609598  
-0.7186861827  
-0.7072324975  
-0.6869003176  
-0.6550102074  
-0.609975418  
-0.5517893348  
-0.482234909  
-0.4047730191  
-0.3241420054  
-0.245713515  
-0.1747531911  
-0.1157006586  
-0.07158267698  
-0.04367643964  
-0.03144672492  
-0.03278398438  
-0.04448456506  
-0.06288017767  
-0.08452574667  
-0.1068120241  
-0.1284073153  
-0.1494456952  
-0.171434972  
-0.1968979751  
-0.2288020077  
-0.2698980132  
-0.3220659122  
-0.3858156992  
-0.4600326902  
-0.5420186346  
-0.6278460797  
-0.7129582934  
-0.7929137655  
-0.8641469646  
-0.9245903584  
-0.974049487  
-1.014247061  
-1.048512331  
-1.081157552  
-1.116643779  
-1.158649722  
-1.209214378  
-1.268086144  
-1.332381803  
-1.396622629  
-1.453149649  
-1.492855292  
-1.50614511  
-1.48399082  
-1.418949377  
-1.306018744  
-1.143242655  
-0.9320137278  
-0.6770493074  
-0.3860661782  
-0.06919378147  
0.2617975311  
0.594389179  
0.9162515714  
1.216147134  
1.484721674  
1.715144868  
1.903505727  
2.04895913  
2.153574835  
2.221908424  
2.260318942  
2.276109039  
2.27657397  
2.268081265  
2.255285596  
2.240598617  
2.223963048  
2.202998381  
2.173463475  
2.130018722  
2.067148452  
1.98016709  
1.866126974  
1.724552838  
1.557858296  
1.371411408  
1.173211987  
0.9732036543  
0.7822973503  
0.6112079038  
0.4692400587  
0.3631605064  
0.2962975452  
0.267978687  
0.27338667  
0.3038592135  
0.3476179455  
0.3908562407  
0.4190798088  
0.4185544958  
0.3777221619  
0.2884278411  
0.1468311987  
-0.04608560153  
-0.2844754699  
-0.5580443805  
-0.8528917948  
-1.152680769  
-1.440039573  
-1.698034634  
-1.911595352  
-2.06874028  
-2.161502149  
-2.186461827  
-2.144851008  
-2.042222993  
-1.88773417  
-1.693134633  
-1.471573908  
-1.236368861  
-0.9998652956  
-0.7725221598  
-0.5622963749  
-0.3743873206  
-0.2113210251  
-0.07333839241  
0.04100155536  
0.1341257478  
0.2087506549  
0.2673153011  
0.3116021355  
0.3426043408  
0.3606202  
0.3655686002  
0.3574173215  
0.3366601911  
0.3047382755  
0.2642918297  
0.2192123787  
0.1744262559  
0.1354446787  
0.1077237419  
0.09593601335  
0.1032550809  
0.1307883242  
0.1772586456  
0.2389911949  
0.3102522331  
0.3838865403  
0.4521890434  
0.5078889784  
0.5451044301  
0.5601387647  
0.5519897755  
0.5224985074  
0.476106841  
0.4192493701  
0.3594494366  
0.3042675724  
0.2602163111  
0.2318129087  
0.2209150944  
0.2263980107  
0.2442689278  
0.2681600235  
0.2901770798  
0.3019388133  
0.2957159252  
0.265479518  
0.2077275956  
0.1219896386  
0.01093723211  
-0.1199064604  
-0.2627945713  
-0.4086561565  
-0.5481028639  
-0.672438038  
-0.7745167178  
-0.849367658  
-0.8944997974  
-0.9098996739  
-0.8977208522  
-0.8617624225  
-0.8068092836  
-0.7379491932  
-0.6599637109  
-0.5768843098  
-0.4917483553  
-0.4066059745  
-0.322715176  
-0.2409189999  
-0.1620857253  
-0.08753400215  
-0.01936123902  
0.03941392584  
0.08492754817  
0.1127706782  
0.1184729345  
0.09811897497  
0.04898219755  
-0.0299015489  
-0.1373141238  
-0.2696623548  
-0.4210540904  
-0.583638034  
-0.7481967472  
-0.904921703  
-1.044301688  
-1.158029168  
-1.239831666  
-1.286129266  
-1.296467983  
-1.273647426  
-1.223535543  
-1.154557804  
-1.076890097  
-1.00141014  
-0.9384704836  
-0.8966184988  
-0.8813788144  
-0.8942305852  
-0.931944455  
-0.9863996681  
-1.044977471  
-1.091585451  
-1.108261106  
-1.077254958  
-0.9833569555  
-0.8161986891  
-0.5722062115  
-0.2558566649  
0.1200005329  
0.5349415571  
0.9628823104  
1.374934045  
1.742892777  
2.042869537  
2.258544367  
2.383533798  
2.422426599  
2.390292127  
2.310619271  
2.211956871  
2.123702523  
2.071671539  
2.074119904  
2.138852075  
2.261883522  
2.427886955  
2.612379435  
2.785312052  
2.915525315  
2.975386594  
2.944908832  
2.81474267  
2.587627203  
2.278123904  
1.910724317  
1.516663723  
1.129934753  
0.7830939195  
0.5034470672  
0.3100793631  
0.2120735162  
0.2080366897  
0.2868797195  
0.4296231726  
0.611892166  
0.8067265678  
0.9873259869  
1.129448238  
1.213253831  
1.224504539  
1.155137605  
1.003288464  
0.7728944219  
0.4730038944  
0.1168949267  
-0.2789139121  
-0.6957454636  
-1.113900151  
-1.51386925  
-1.877585457  
-2.189664436  
-2.438556848  
-2.617472434  
-2.724964033  
-2.76504096  
-2.746731559  
-2.683108888  
-2.589822207  
-2.483311664  
-2.378907298  
-2.289064617  
-2.221965945  
-2.180705175  
-2.163137734  
-2.162444393  
-2.168300635  
-2.168489431  
-2.150722511  
-2.104413986  
-2.022165212  
-1.900774229  
-1.741653971  
-1.550630953  
-1.337189931  
-1.113275462  
-0.8918457773  
-0.6853713767  
-0.5044573003  
-0.3567793406  
-0.2464215022  
-0.1736810758  
-0.1353367268  
-0.1253011073  
-0.1355507827  
-0.1571961881  
-0.1815255655  
-0.2009081758  
-0.2094252553  
-0.2031980841  
-0.1803747829  
-0.1408344293  
-0.08568511336  
-0.01665511968  
0.06449193971  
0.156420999  
0.2584775962  
0.3706826294  
0.4934660065  
0.6271805754  
0.7714803865  
0.9246807246  
1.083214119  
1.24131029  
1.391001337  
1.522501622  
1.624967512  
1.687588716  
1.700895369  
1.658125672  
1.556465438  
1.397972106  
1.190001264  
0.9450373518  
0.6798586973  
0.414111844  
0.1684184996  
-0.03775758119  
-0.1881971949  
-0.271705095  
-0.2833079941  
-0.2247124805  
-0.1039578156  
0.0656767157  
0.2673377372  
0.4825848389  
0.6933953259  
0.8839229009  
1.041782214  
1.158749769  
1.230869204  
1.2580482  
1.243316518  
1.191934319  
1.110521841  
1.006361313  
0.88692283  
0.7596034144  
0.6316280763  
0.5100077431  
0.4014413585  
0.3121135735  
0.2473234508  
0.2109931993  
0.2051263631  
0.2293148824  
0.280439734  
0.3526527723  
0.4377232094  
0.5257381539  
0.6061077264  
0.6687310381  
0.7051769765  
0.7096609202  
0.6796884232  
0.6162182158  
0.523348598  
0.4075477576  
0.2765724862  
0.1382653917  
-0.0005721406723  
-0.1350357903  
-0.2625676345  
-0.3829460925  
-0.4978282814  
-0.6099692964  
-0.7222638912  
-0.8367978594  
-0.9540820469  
-1.07260168  
-1.188740704  
-1.297091885  
-1.391089554  
-1.463837843  
-1.509027064  
-1.52177886  
-1.499319139  
-1.441386949  
-1.350348347  
-1.231007221  
-1.090158961  
-0.9359412537  
-0.7770696463  
-0.6220537429  
-0.4784578076  
-0.3523036302  
-0.2476593282  
-0.1664373581  
-0.1084300133  
-0.0715373076  
-0.05217392594  
-0.04577978471  
-0.04738888628  
-0.05218443215  
-0.05598582728  
-0.0556276972  
-0.04918658659  
-0.03605633978  
-0.01686961208  
0.00671164008  
0.03228863466  
0.05706856919  
0.07819301289  
0.09302131251  
0.09934022123  
0.09548698413  
0.08039535074  
0.05359975496  
0.01521645106  
-0.03406889069  
-0.0929835531  
-0.1596318969  
-0.2314506737  
-0.3052066527  
-0.3770505134  
-0.4426932188  
-0.4976911207  
-0.5378478441  
-0.5596772554  
-0.5608718311  
-0.5406836296  
-0.500128717  
-0.4419727935  
-0.3704407585  
-0.2906982445  
-0.2081536803  
-0.1276974745  
-0.05300168673  
0.01399792242  
0.07333230934  
0.1269072137  
0.1780915162  
0.2310687369  
0.2900498009  
0.3585092878  
0.4385695205  
0.5306208711  
0.6332694072  
0.7435622317  
0.8574644532  
0.9704716423  
1.078235708  
1.177099922  
1.264450928  
1.338839262  
1.399878514  
1.447956271  
1.483834963  
1.508224868  
1.521422234  
1.523070836  
1.512101244  
1.486849873  
1.445351289  
1.385748416  
1.306751916  
1.208090728  
1.090840282  
0.957600099  
0.8124532817  
0.6607104657  
0.508456955  
0.3619697021  
0.2270708545  
0.1085252874  
0.009559394383  
-0.06842249566  
-0.1259013364  
-0.1650698716  
-0.1894679834  
-0.2034888427  
-0.2118300672  
-0.2189811025  
-0.2288075278  
-0.2442874572  
-0.2674234787  
-0.299310704  
-0.3403339282  
-0.3904217649  
-0.4493121481  
-0.5167496424  
-0.5925868533  
-0.6767548266  
-0.7691257026  
-0.8692869347  
-0.976291984  
-1.088431485  
-1.203081263  
-1.31666469  
-1.4247542  
-1.522281729  
-1.603869273  
-1.664218392  
-1.698527789  
-1.702907684  
-1.674738398  
-1.612965413  
-1.518306571  
-1.393342677  
-1.242500857  
-1.071911351  
-0.8891296997  
-0.7027316501  
-0.5217767332  
-0.3551714088  
-0.210954086  
-0.09556644279  
-0.01318237444  
0.03482191057  
0.05016977295  
0.03768212613  
0.004936870042  
-0.03842262051  
-0.08165230889  
-0.114073154  
-0.1262650327  
-0.1111546389  
-0.06482911537  
0.01302849896  
0.1191508346  
0.247136909  
0.3882758933  
0.5326199355  
0.6701536955  
0.79192071  
0.8909251288  
0.96275492  
1.005827512  
1.021272054  
1.012486332  
0.9844374183  
0.9428214175  
0.8931804589  
0.8401091407  
0.7866278736  
0.7338172026  
0.6807464572  
0.6247155469  
0.5617805869  
0.4875053515  
0.3978482794  
0.290076474  
0.1635872643  
0.0205148686  
-0.1339793064  
-0.2917980746  
-0.4424178439  
-0.5737922245  
-0.6735684872  
-0.7305127617  
-0.735963464  
-0.6851544999  
-0.57822497  
-0.4207727849  
-0.2238414603  
-0.00328986163  
0.221417151  
0.4289253238  
0.5980468732  
0.709957436  
0.7503047415  
0.710970491  
0.5912927148  
0.3985466144  
0.1476068025  
-0.1402477338  
-0.4392744377  
-0.7217985489  
-0.9610480132  
-1.133988959  
-1.223807908  
-1.221731927  
-1.127935111  
-0.9513997434  
-0.7087158803  
-0.421968753  
-0.1159866119  
0.1846786869  
0.45863562  
0.6899874558  
0.869809305  
0.9965813636  
1.075559043  
1.117208851  
1.135015163  
1.143003655  
1.153407766  
1.174819042  
1.211093374  
1.261131467  
1.319512837  
1.377812544  
1.426332396  
1.455927383  
1.459612803  
1.433689731  
1.378242983  
1.296948063  
1.196286461  
1.084319356  
0.9692733561  
0.8581703171  
0.7557490426  
0.6638247469  
0.5811923985  
0.5040343379  
0.426761289  
0.3431129537  
0.2473248454  
0.1351835333  
0.004783768697  
-0.1431005542  
-0.305071461  
-0.4755707758  
-0.6476415727  
-0.8138650482  
-0.9673175013  
-1.102401183  
-1.215428546  
-1.304904116  
-1.37147509  
-1.417599559  
-1.446996428  
-1.464002539  
-1.4729214  
-1.477483867  
-1.480464815  
-1.483511129  
-1.487150964  
-1.490966918  
-1.493848844  
-1.494288895  
-1.490619506  
-1.481187104  
-1.464409569  
-1.438748062  
-1.402619798  
-1.354286824  
-1.291795247  
-1.213004336  
-1.115741373  
-0.9980882992  
-0.8587827231  
-0.6976778877  
-0.5161877206  
-0.3176266409  
-0.1073685051  
0.1072410122  
0.3172456586  
0.5127010388  
0.683506437  
0.8203435255  
0.9156290873  
0.9643478462  
0.9646693304  
0.9182605771  
0.8302568122  
0.7088811879  
0.564758884  
0.4099939226  
0.2571121208  
0.1179778179  
0.002806224669  
-0.08063199543  
-0.1275366614  
-0.136280589  
-0.1082856974  
-0.04759428856  
0.03980702413  
0.1468193025  
0.2661176915  
0.3909844297  
0.5159831745  
0.6373899424  
0.7533313188  
0.863614571  
0.9692727058  
1.071896643  
1.172857292  
1.272527867  
1.369643327  
1.460910878  
1.540935216  
1.602519291  
1.637305456  
1.636698943  
1.59295016  
1.500267014  
1.35577864  
1.160245968  
0.9183876285  
0.6387794261  
0.3333425983  
0.01645974201  
-0.2961652341  
-0.5887801916  
-0.8468670936  
-1.058305312  
-1.214311911  
-1.31010468  
-1.345230282  
-1.323541113  
-1.252824853  
-1.144110124  
-1.010683727  
-0.866880614  
-0.7267326962  
-0.6025853849  
-0.5038010722  
-0.4357001763  
-0.398865863  
-0.3889445796  
-0.3970076466  
-0.4105193699  
-0.4148428703  
-0.3951761241  
-0.3386997521  
-0.2366843285  
-0.0862461389  
0.1085202992  
0.3362863443  
0.5792302383  
0.8147710767  
1.018143241  
1.165487229  
1.237055541  
1.220042781  
1.110596793  
0.9146763481  
0.6475596685  
0.3320604524  
-0.004320995327  
