0.09541447781  
0.6644906545  
1.196094434  
1.653347095  
2.006414227  
2.235207401  
2.331034839  
2.29703376  
2.147394856  
1.905522911  
1.601376994  
1.268317871  
0.9398357167  
0.646472685  
0.4132623744  
0.2578830953  
0.1896306951  
0.2092573155  
0.3095800557  
0.4767451596  
0.6919461802  
0.93341742  
1.178490305  
1.405534251  
1.595638119  
1.73393037  
1.8104642  
1.820636738  
1.765165365  
1.649644435  
1.483750915  
1.280168741  
1.053331861  
0.8180799656  
0.5883314584  
0.3758911769  
0.1894804979  
0.03408581256  
-0.08929764247  
-0.1835143569  
-0.2546658296  
-0.3111810138  
-0.3626089371  
-0.418289113  
-0.4860510468  
-0.5711190903  
-0.6753490561  
-0.7969365677  
-0.9306162373  
-1.068359215  
-1.200451461  
-1.316835452  
-1.40851015  
-1.468774968  
-1.494160748  
-1.484883329  
-1.444753112  
-1.380550044  
-1.300950928  
-1.215177842  
-1.131555777  
-1.056230677  
-0.9922305318  
-0.9390364512  
-0.8927311025  
-0.8467199444  
-0.7929053552  
-0.7231521109  
-0.6307992441  
-0.5120025228  
-0.3666721808  
-0.1988922795  
-0.0167130811  
0.1686238702  
0.3439460954  
0.4957046976  
0.611612077  
0.682144467  
0.7017338506  
0.6694719928  
0.5892988158  
0.4696394754  
0.3225572911  
0.1625532366  
0.005118901685  
-0.1347750762  
-0.2441161591  
-0.3130800257  
-0.3359367602  
-0.311569016  
-0.2435500655  
-0.1397823011  
-0.01173009825  
0.1266905008  
0.2604553838  
0.3748954067  
0.4571242328  
0.4972975703  
0.4895663618  
0.4326351503  
0.3298445153  
0.1887969966  
0.02055297302  
-0.1615100682  
-0.343021879  
-0.5099983967  
-0.6501107585  
-0.7537017927  
-0.8144728554  
-0.829775286  
-0.8005139158  
-0.7307271041  
-0.6269303225  
-0.4973237673  
-0.351004696  
-0.1972569955  
-0.0450052791  
0.09754197761  
0.2230803435  
0.3252572965  
0.3986664024  
0.438851411  
0.4424001045  
0.407155269  
0.3325576497  
0.2200674339  
0.07360316432  
-0.1001335577  
-0.2915207184  
-0.4882026811  
-0.6756234234  
-0.8379351048  
-0.9592182183  
-1.024912545  
-1.023297905  
-0.9468573768  
-0.7933549373  
-0.5664587734  
-0.2758409873  
0.06331766493  
0.431369976  
0.8057125902  
1.162635643  
1.47931001  
1.735746208  
1.916505839  
2.012012749  
2.019322359  
1.942262343  
1.790942366  
1.580662539  
1.330343438  
1.06062096  
0.7918331011  
0.542084609  
0.3256147315  
0.1516439328  
0.02383182468  
-0.05960531457  
-0.1051195312  
-0.1225070915  
-0.1232050469  
-0.1184429015  
-0.1174857218  
-0.126232866  
-0.1463807557  
-0.1752779332  
-0.2065155016  
-0.2311715107  
-0.2395387306  
-0.2230620824  
-0.1761667962  
-0.09767809005  
0.008440791869  
0.1331767764  
0.26340901  
0.3835720129  
0.4777908103  
0.5321512507  
0.5367214106  
0.4870089453  
0.3846159648  
0.2369913939  
0.05635389884  
-0.1420319799  
-0.3419142299  
-0.5281298126  
-0.6883676317  
-0.8143862255  
-0.9025588984  
-0.9537155938  
-0.9723933883  
-0.9656637563  
-0.9417611793  
-0.9087302692  
-0.8732946701  
-0.8400776052  
-0.8112409228  
-0.7865487326  
-0.7637994885  
-0.7395077651  
-0.7097314645  
-0.6709054853  
-0.6205775158  
-0.5579457184  
-0.484162453  
-0.4023643424  
-0.3174518232  
-0.2356360586  
-0.16382503  
-0.1088977512  
-0.0769516015  
-0.07259268465  
-0.09834096192  
-0.1542154736  
-0.2375481006  
-0.3430523051  
-0.4631454154  
-0.5885152297  
-0.7088672086  
-0.8137859831  
-0.8936200347  
-0.9403010815  
-0.9480098655  
-0.9136255914  
-0.8369188224  
-0.720496577  
-0.5694967344  
-0.3911136368  
-0.1939889161  
0.012447572  
0.2186304745  
0.4154530235  
0.5947706921  
0.7497983225  
0.8753895904  
0.9682059963  
1.026793076  
1.051551619  
1.044638641  
1.009765697  
0.9519409548  
0.8771184879  
0.7917942276  
0.702555753  
0.6156133171  
0.5363474491  
0.4689104456  
0.4159192292  
0.378295267  
0.3552453574  
0.3444307044  
0.3422996188  
0.3445592407  
0.3467452651  
0.3448019819  
0.3356260726  
0.3174697754  
0.2901489952  
0.2550230174  
0.2147253415  
0.1726905122  
0.1325269931  
0.09735855499  
0.06922144721  
0.04864040842  
0.0344730986  
0.02405230178  
0.0136304119  
-0.0009358155588  
-0.023371256  
-0.05617470179  
-0.09995470846  
-0.153051278  
-0.2115169028  
-0.2694857014  
-0.31993212  
-0.3556857497  
-0.3705848612  
-0.3605835069  
-0.324630902  
-0.2651518772  
-0.1880176379  
-0.1019671386  
-0.01751772986  
0.05450924109  
0.1046176122  
0.1262004568  
0.1167379023  
0.07842683722  
0.01808168832  
-0.05373006554  
-0.124235108  
-0.1804620935  
-0.211406514  
-0.2100013847  
-0.1745387695  
-0.1092738449  
-0.02405144974  
0.06702294206  
0.1477179881  
0.2022771964  
0.2180839102  
0.1879395124  
0.1115614896  
-0.003983453197  
-0.1450261619  
-0.2931314266  
-0.4277559529  
-0.5293285227  
-0.5822389945  
-0.577273803  
-0.5130909833  
-0.3964812738  
-0.2413784592  
-0.066762198  
0.1062211795  
0.2574439219  
0.370814294  
0.4366157089  
0.4528155606  
0.4251505439  
0.3659612628  
0.2919776833  
0.2214195545  
0.1708606892  
0.1523672154  
0.1713491689  
0.2254668063  
0.3047566876  
0.3929621784  
0.4698496499  
0.5141861291  
0.5069162682  
0.4340868805  
0.2891004751  
0.0739907201  
-0.2004592581  
-0.5157541481  
-0.8477196711  
-1.16926971  
-1.453515312  
-1.67682708  
-1.821455399  
-1.877394935  
-1.843280704  
-1.726234923  
-1.540728942  
-1.306624129  
-1.046682843  
-0.7838689408  
-0.5387853864  
-0.3275668315  
-0.1604446924  
-0.04115263483  
0.03282530584  
0.06922685875  
0.07940712422  
0.07639395218  
0.07289016741  
0.07950946367  
0.1034745994  
0.1479222481  
0.2118986692  
0.2909654087  
0.3783098384  
0.4661264133  
0.5470462264  
0.6153710994  
0.6679287444  
0.704418065  
0.7272268612  
0.7407770291  
0.7505228288  
0.7618120907  
0.7787877766  
0.8035470201  
0.8356881143  
0.8723083695  
0.9084670486  
0.9380029215  
0.9545765862  
0.952747853  
0.9289133721  
0.8819350726  
0.8133799865  
0.7273205094  
0.6297471235  
0.52767723  
0.4281239673  
0.3370777178  
0.2586584942  
0.1945763221  
0.1439717255  
0.1036568814  
0.06870689702  
0.03330497304  
-0.00830966571  
-0.06092806376  
-0.1276631296  
-0.2095213122  
-0.3053215476  
-0.4119389147  
-0.524812224  
-0.6385907007  
-0.7477990815  
-0.8473955198  
-0.9331431884  
-1.001747569  
-1.050782923  
-1.078479084  
-1.083458724  
-1.064526831  
-1.020618005  
-0.9509327296  
-0.8552620192  
-0.7344507736  
-0.5908927141  
-0.4289284566  
-0.2550282491  
-0.07766431905  
0.09316798705  
0.2467758416  
0.3728322843  
0.4625637299  
0.5098698863  
0.5122175303  
0.4711228436  
0.3921626857  
0.2844476187  
0.1596181825  
0.03050484343  
-0.0903918108  
-0.1923716292  
-0.2677466059  
-0.312628903  
-0.3271698312  
-0.3152277761  
-0.2835172836  
-0.2403615142  
-0.19424613  
-0.1523917455  
-0.1195773127  
-0.09739056081  
-0.08403416266  
-0.07474885438  
-0.06276873882  
-0.04070514558  
-0.002112705492  
0.05699419717  
0.1369490679  
0.2337820437  
0.3392552668  
0.4416354315  
0.5271158977  
0.5817203836  
0.5933938301  
0.5539772228  
0.4607359142  
0.3171917977  
0.1330898064  
-0.07649818015  
-0.2928482161  
-0.4957870357  
-0.6661025767  
-0.7878426003  
-0.8501471067  
-0.8484151457  
-0.7846227193  
-0.6668284339  
-0.5079396661  
-0.3239485948  
-0.131912903  
0.05205210267  
0.2144908236  
0.3458474568  
0.4410827646  
0.4996502183  
0.5248908927  
0.5229781617  
0.5016059431  
0.4686327414  
0.4308748319  
0.3932113523  
0.3581045056  
0.325566813  
0.2935464588  
0.2586385265  
0.2169888884  
0.1652496746  
0.1014376671  
0.02555168159  
-0.06012635633  
-0.1510875345  
-0.2410141708  
-0.3224860223  
-0.3878801998  
-0.4303298217  
-0.4446175175  
-0.427870775  
-0.3799802197  
-0.3036724586  
-0.204257725  
-0.08907032278  
0.03330318857  
0.1539180911  
0.2643713672  
0.3576097802  
0.4285552353  
0.4745065599  
0.4952769612  
0.4930849807  
0.4722244341  
0.4385677629  
0.3989451322  
0.3604713519  
0.3298545413  
0.3127474317  
0.3131746263  
0.3330863375  
0.3720552008  
0.4271890668  
0.4932506043  
0.5630168263  
0.6278668635  
0.678558089  
0.7061281027  
0.7028221806  
0.6629554271  
0.5835767997  
0.4648495707  
0.3100938625  
0.1254638348  
-0.08070610272  
-0.2987850975  
-0.518849891  
-0.7316627929  
-0.9294873331  
-1.106638743  
-1.259701172  
-1.387408627  
-1.490229769  
-1.569758624  
-1.628009738  
-1.666760249  
-1.687051721  
-1.688916938  
-1.671395444  
-1.632811928  
-1.571275749  
-1.485290523  
-1.374400338  
-1.239710386  
-1.084224306  
-0.9129037318  
-0.7324375589  
-0.5507171736  
-0.3761044303  
-0.2165666892  
-0.07879369918  
0.03255978928  
0.1154153215  
0.1705102573  
0.2012769909  
0.2133887809  
0.2140288636  
0.2109658598  
0.2115803339  
0.2219693052  
0.2462512106  
0.2861690352  
0.3410282783  
0.4079708056  
0.4825319523  
0.5593727637  
0.6330837206  
0.6989164008  
0.7533504689  
0.7943992058  
0.8216296061  
0.8359145248  
0.838974287  
0.8328048117  
0.8191098137  
0.7988521698  
0.7720052602  
0.7375756954  
0.6938666067  
0.638964586  
0.5713366954  
0.4904273916  
0.3971385651  
0.2940800509  
0.1855416509  
0.07716403337  
-0.02465131535  
-0.1134831769  
-0.1836896132  
-0.2311075582  
-0.2535461647  
-0.250987975  
-0.2254619271  
-0.1806091635  
-0.1210320237  
-0.05153414728  
0.0236021824  
0.1011677362  
0.1793253293  
0.2575825208  
0.3364833903  
0.4170733439  
0.5002711364  
0.5862608577  
0.6740633497  
0.7613506063  
0.8445768751  
0.9193838436  
0.9812363998  
1.026157785  
1.051436681  
1.056175751  
1.041552096  
1.010750014  
0.9685191559  
0.9204384985  
0.8719610664  
0.8274109912  
0.7890930455  
0.7566701835  
0.7269534383  
0.6941731129  
0.6507194815  
0.5882845933  
0.4992473129  
0.3780912293  
0.2226423311  
0.03491132275  
-0.1786189935  
-0.4073309788  
-0.6374324199  
-0.8534199457  
-1.0398649  
-1.18327602  
-1.273783668  
-1.306407825  
-1.281732409  
-1.205887732  
-1.089848313  
-0.9481397973  
-0.7971362972  
-0.6531790883  
-0.5307667926  
-0.4410509761  
-0.3908295996  
-0.3821298979  
-0.4124327954  
-0.4754443218  
-0.562311333  
-0.6630747107  
-0.768136237  
-0.8695517817  
-0.9619500847  
-1.042963655  
-1.113120706  
-1.17524347  
-1.233444451  
-1.291925834  
-1.353754403  
-1.419853011  
-1.488368283  
-1.554541368  
-1.611109013  
-1.649197679  
-1.659581863  
-1.634114195  
-1.567137629  
-1.456644217  
-1.305021022  
-1.119256191  
-0.9105467454  
-0.6933509252  
-0.4839626742  
-0.2987811112  
-0.1524756866  
-0.05624609813  
-0.01640484373  
-0.03344401117  
-0.1017152651  
-0.2097801482  
-0.3414321485  
-0.477288238  
-0.5968451107  
-0.6807603651  
-0.7131619341  
-0.6837290195  
-0.5893010684  
-0.4347948562  
-0.2332867477  
-0.005150039797  
0.2237468478  
0.4246819252  
0.569358809  
0.6335269021  
0.6005565482  
0.464533723  
0.2324412041  
-0.07497847975  
-0.4239596919  
-0.7701689554  
-1.06280805  
-1.250011395  
-1.284996891  
-1.13223545  
-0.772801269  
-0.2080944843  
0.5387288095  
1.4239993  
2.38746902  
3.358571799  
4.264227948  
5.037172963  
5.623625423  
5.989205918  
6.122222658  
6.033869264  
5.755348279  
5.332402793  
4.8181749  
4.265512727  
3.719930553  
3.21426538  
2.765756288  
2.375833895  
2.032475169  
1.714549576  
1.397287162  
1.057904363  
0.6804244732  
0.258960298  
-0.2009772955  
-0.6832331025  
-1.163553279  
-1.613390649  
-2.004300137  
-2.312179576  
-2.520735126  
-2.623704968  
-2.625585623  
-2.540872121  
-2.392006649  
-2.206390582  
-2.012919405  
-1.838505461  
-1.705030799  
-1.62707012  
-1.610597295  
-1.652788862  
-1.742844709  
-1.863700795  
-1.994358709  
-2.112539618  
-2.197346689  
-2.231635716  
-2.203838777  
-2.109073293  
-1.949460495  
-1.733651699  
-1.47566668  
-1.193220532  
-0.905738565  
-0.6323157887  
-0.3898287637  
-0.1914095556  
-0.04542040957  
0.04500581883  
0.08181828539  
0.07138921149  
0.02341750701  
-0.05042164053  
-0.1379463227  
-0.2278497103  
-0.3108702289  
-0.3806151871  
-0.433976966  
-0.4711194996  
-0.495059022  
-0.5109148079  
-0.5249420599  
-0.5434453171  
-0.5717384682  
-0.6132303224  
-0.6687748  
-0.7363386232  
-0.8110470421  
-0.8856073008  
-0.9510719517  
-0.9978769009  
-1.017030452  
-1.001311274  
-0.9463180139  
-0.8512205928  
-0.7190882445  
-0.5567070243  
-0.3739003124  
-0.1823956734  
0.005618134207  
0.179045584  
0.3293320988  
0.4515850966  
0.5451801472  
0.6137255904  
0.6643666742  
0.7065094589  
0.7501218865  
0.8038818268  
0.8734385743  
0.9601002722  
1.060159535  
1.165019545  
1.262141245  
1.336715902  
1.373835307  
1.360865562  
1.289660312  
1.158267093  
0.9718601733  
0.7427054974  
0.4891226461  
0.2335660424  
3.066848483e-05  
-0.1888287981  
-0.314506176  
-0.3649722929  
-0.3361942934  
-0.2326324774  
-0.0666478237  
0.1430972239  
0.3740080423  
0.6023613704  
0.8061442473  
0.9675420518  
1.074739904  
1.122834946  
1.113771472  
1.055365515  
0.9596356516  
0.8407156837  
0.7126902157  
0.5876960603  
0.4745385125  
0.3780108592  
0.2989585078  
0.235020002  
0.1818485055  
0.134589451  
0.08929065202  
0.04402854607  
-0.0004844364299  
-0.0408880054  
-0.07175734576  
-0.08666644201  
-0.0795142449  
-0.04587054843  
0.0159080683  
0.1040301721  
0.2131915279  
0.3351127088  
0.4596112688  
0.5759932684  
0.6745664049  
0.7479477342  
0.7919736137  
0.8060134089  
0.7926550284  
0.7567958848  
0.7043205572  
0.6406246763  
0.5692565549  
0.4909603942  
0.403330813  
0.3011789885  
0.1775809519  
0.02547586043  
-0.1604763082  
-0.3820856264  
-0.6362237092  
-0.9141198703  
-1.201544397  
-1.479945368  
-1.72843085  
-1.926326278  
-2.055959636  
-2.105214686  
-2.069470291  
-1.952567492  
-1.766655982  
-1.530872044  
-1.269070487  
-1.006903205  
-0.7687009789  
-0.5745952284  
-0.4382948556  
-0.3658177132  
-0.3553049488  
-0.3978959231  
-0.4794720481  
-0.5829564653  
-0.6908061377  
-0.7873226883  
-0.8604578754  
-0.9029205572  
-0.9124724099  
-0.8914842471  
-0.8458771295  
-0.7836935992  
-0.7135446965  
-0.6431748297  
-0.578338212  
-0.522093797  
-0.4745710077  
-0.4331649978  
-0.3930689019  
-0.3480533491  
-0.2913532001  
-0.216568367  
-0.118502465  
0.00611845082  
0.1580966241  
0.335402109  
0.5330141294  
0.7430247894  
0.9549957082  
1.156595568  
1.334504448  
1.475548767  
1.567959355  
1.602665177  
1.574436728  
1.482742982  
1.332174102  
1.132329289  
0.8971361925  
0.6436600304  
0.3905086478  
0.1560472949  
-0.04338818638  
-0.1950161454  
-0.2907137527  
-0.327541683  
-0.3076741739  
-0.2377532447  
-0.1277970682  
0.01014543021  
0.1634038262  
0.3199546246  
0.4693855863  
0.603471973  
0.716327658  
0.8042009282  
0.8650141909  
0.897794514  
0.9021518453  
0.8779161793  
0.8250375431  
0.743746866  
0.6349508556  
0.5007529448  
0.3449643642  
0.1734645378  
-0.005733941581  
-0.182799893  
-0.3468150717  
-0.4868538221  
-0.5933041045  
-0.6592232804  
-0.6815178369  
-0.6617036708  
-0.6060935543  
-0.5252976937  
-0.4330580645  
-0.3445585384  
-0.2744217842  
-0.23472531  
-0.2333313927  
-0.2728226446  
-0.3502202239  
-0.4575437369  
-0.5831083688  
