0.2482933227  
0.4434736441  
0.6173654405  
0.746560933  
0.8150914747  
0.817227341  
0.7587424941  
0.6564347304  
0.5359586672  
0.4282544505  
0.3650583725  
0.374128272  
0.4748470589  
0.674832877  
0.9680535088  
1.334738142  
1.743137493  
2.152929468  
2.519841154  
2.800883027  
2.959514954  
2.970063088  
2.820823386  
2.515460566  
2.072564064  
1.523451394  
0.9085547925  
0.2728853669  
-0.3388249718  
-0.8867032911  
-1.339503578  
-1.677159795  
-1.891909879  
-1.987950049  
-1.979776757  
-1.88950823  
-1.743586255  
-1.569300762  
-1.391569881  
-1.230339811  
-1.09888059  
-1.003103367  
-0.9419092216  
-0.9084360303  
-0.8919606525  
-0.8801602184  
-0.8613850349  
-0.8266354456  
-0.770978668  
-0.6942382521  
-0.6009012204  
-0.4992888799  
-0.4001473991  
-0.3148785424  
-0.2536746895  
-0.2238270481  
-0.2284456454  
-0.2657565805  
-0.3290903457  
-0.4075493775  
-0.4872766734  
-0.5531583077  
-0.5907425947  
-0.5881269596  
-0.5375712981  
-0.4366309033  
-0.2886611031  
-0.1026407343  
0.1076765433  
0.325163354  
0.5311111905  
0.7071871474  
0.8373377629  
0.9094145937  
0.916371731  
0.8569062944  
0.7355121699  
0.5619597634  
0.3502813521  
0.1173727605  
-0.1186342269  
-0.3400614247  
-0.531269527  
-0.6799674078  
-0.7781160314  
-0.8223309056  
-0.8137513907  
-0.7574059293  
-0.6611829962  
-0.5345662446  
-0.3873266179  
-0.2283774759  
-0.06496035952  
0.09773292024  
0.2564650628  
0.4094632851  
0.5556636087  
0.6938883132  
0.8221552545  
0.9372961849  
1.034996224  
1.110269566  
1.158303633  
1.175510673  
1.160563983  
1.115181881  
1.044438537  
0.9564615029  
0.8614767945  
0.7702895946  
0.6924267127  
0.6342537909  
0.5974362459  
0.5780889731  
0.566874242  
0.5501593442  
0.51214887  
0.4377396401  
0.3156491887  
0.1413054726  
-0.0810557781  
-0.3375460055  
-0.6053214801  
-0.8548731622  
-1.0536989  
-1.17087585  
-1.181887587  
-1.072930099  
-0.8439878356  
-0.5100948932  
-0.1004625559  
0.3445073397  
0.7779876058  
1.152614914  
1.426663792  
1.569588224  
1.566095296  
1.418136711  
1.144519378  
0.7782061583  
0.361717913  
-0.05866381057  
-0.439034747  
-0.7434732705  
-0.9483449197  
-1.044741603  
-1.038809576  
-0.950005377  
-0.8076143635  
-0.6461057962  
-0.5000089029  
-0.3990490535  
-0.3641882292  
-0.4050752131  
-0.519175166  
-0.692614115  
-0.9025398003  
-1.120599729  
-1.317025149  
-1.464733716  
-1.542921979  
-1.539689455  
-1.453389684  
-1.292588472  
-1.074678822  
-0.8233709448  
-0.5654085748  
-0.3269412307  
-0.1300283886  
0.0102766269  
0.08788272949  
0.1063759775  
0.07839886261  
0.02373852361  
-0.03361908745  
-0.06908141418  
-0.06116526947  
0.005192345602  
0.1362387243  
0.3282858304  
0.5680362275  
0.8342975456  
1.100807661  
1.339724334  
1.525223558  
1.636681477  
1.66099681  
1.593778306  
1.439342083  
1.20963765  
0.9223967767  
0.5988584271  
0.261451917  
-0.06826062894  
-0.3711729445  
-0.6316810006  
-0.838220875  
-0.9834101051  
-1.063950215  
-1.080422888  
-1.037069658  
-0.9415741454  
-0.8047981772  
-0.6403714418  
-0.464029148  
-0.2926211651  
-0.1427787178  
-0.02931472934  
0.03647793425  
0.04840671596  
0.006568624132  
-0.08208662347  
-0.2040073197  
-0.3401637151  
-0.4680025912  
-0.5640188113  
-0.6066457269  
-0.5790681874  
-0.4715673613  
-0.2830307289  
-0.02140558573  
0.2970092527  
0.6493427329  
1.008759232  
1.347536477  
1.640175444  
1.866127889  
2.011781606  
2.071476777  
2.047484787  
1.949036247  
1.79062863  
1.5899193  
1.365547224  
1.135177465  
0.9139955079  
0.7137469541  
0.5423278188  
0.403834319  
0.298929721  
0.2253805216  
0.1786378058  
0.1523846672  
0.1390341078  
0.1302011898  
0.1171990298  
0.09162056903  
0.0460245347  
-0.02529869351  
-0.1255441291  
-0.2547274167  
-0.4092705608  
-0.5819838692  
-0.7625290642  
-0.9383798194  
-1.096208933  
-1.22354057  
-1.310426584  
-1.350888476  
-1.343857878  
-1.293425216  
-1.208299168  
-1.100512062  
-0.9835428057  
-0.8701423136  
-0.7702096904  
-0.6890894648  
-0.6265900876  
-0.576937249  
-0.5296996672  
-0.4715953877  
-0.3889243006  
-0.2702636104  
-0.1090160389  
0.09461394762  
0.3325729712  
0.5890730425  
0.8419531309  
1.06517892  
1.232177544  
1.319559226  
1.310667022  
1.198387874  
0.9867348721  
0.6908853344  
0.3356049486  
-0.04776579688  
-0.4253215425  
-0.7649953599  
-1.040673969  
-1.23539  
-1.343097285  
-1.368788152  
-1.326963999  
-1.238751515  
-1.128180406  
-1.018242682  
-0.9274053503  
-0.8671339269  
-0.8408132845  
-0.8441829557  
-0.8671582181  
-0.896626363  
-0.9196721774  
-0.9265871909  
-0.9130919136  
-0.8813421281  
-0.8395374928  
-0.8002052461  
-0.7774865976  
-0.7839338966  
-0.8274016155  
-0.9086178836  
-1.0198834  
-1.145178131  
-1.261709563  
-1.342721251  
-1.36116187  
-1.293694281  
-1.124447018  
-0.8479329026  
-0.4706895006  
-0.01134325957  
0.5009517748  
1.029542451  
1.534383235  
1.976696742  
2.323575664  
2.551909825  
2.651128944  
2.624386805  
2.48802404  
2.269358226  
2.003084484  
1.726730596  
1.475767052  
1.279027841  
1.155063617  
1.109965088  
1.13697413  
1.217968206  
1.326613431  
1.432727323  
1.507184023  
1.526610982  
1.477131914  
1.356574106  
1.17479808  
0.9521077598  
0.7160153401  
0.4968902714  
0.3231842107  
0.2169852672  
0.1905847549  
0.2445565869  
0.3676276912  
0.5383129654  
0.7280425696  
0.9052779476  
1.039982899  
1.107774469  
1.093155423  
0.9913751807  
0.808703189  
0.5611470891  
0.2718728219  
-0.03220862675  
-0.3241423477  
-0.5803472896  
-0.7832677297  
-0.9229223992  
-0.9972223205  
-1.011128214  
-0.9749010758  
-0.9018362942  
-0.8059170329  
-0.6998007227  
-0.5934486062  
-0.4935628882  
-0.4038081456  
-0.3256455593  
-0.2594944781  
-0.2058854076  
-0.166305752  
-0.1435327976  
-0.1413873286  
-0.1639711285  
-0.2145911307  
-0.2946235134  
-0.4026055463  
-0.5337752431  
-0.6802235705  
-0.8316610791  
-0.9767244958  
-1.10461412  
-1.2067845  
-1.278392835  
-1.319223272  
-1.333882597  
-1.331178089  
-1.322712868  
-1.320888253  
-1.336594021  
-1.37696714  
-1.4435848  
-1.53144356  
-1.628945117  
-1.718979213  
-1.781011112  
-1.793920768  
-1.7391992  
-1.604038916  
-1.383833016  
-1.083683586  
-0.7186404988  
-0.3125908665  
0.1041119536  
0.4979847201  
0.8362903186  
1.090964189  
1.242073912  
1.280353235  
1.208485745  
1.040939662  
0.802356076  
0.5246678239  
0.243278284  
-0.007223937214  
-0.1972891253  
-0.3060303107  
-0.3237721094  
-0.2531898073  
-0.1088670417  
0.08469268859  
0.2963666906  
0.4926078999  
0.6420111317  
0.7196401227  
0.7105438203  
0.6119729436  
0.4339840516  
0.1983168931  
-0.06431359289  
-0.3181677762  
-0.527138051  
-0.6594902147  
-0.6920501444  
-0.6132709763  
-0.4247743741  
-0.1411654678  
0.2118421728  
0.6007328837  
0.9884763843  
1.339204886  
1.622651034  
1.817741574  
1.914868481  
1.916549466  
1.836425314  
1.696773891  
1.524952632  
1.349302111  
1.19512331  
1.081309824  
1.018085512  
1.006123651  
1.037096161  
1.095476446  
1.161243622  
1.213005164  
1.231027567  
1.199725209  
1.109279087  
0.95626027  
0.7433030031  
0.4780575673  
0.1717384978  
-0.1623848994  
-0.5102666742  
-0.8579533532  
-1.192010152  
-1.499591617  
-1.768346263  
-1.986376956  
-2.142444433  
-2.226541992  
-2.230833924  
-2.1508581  
-1.98677182  
-1.744372218  
-1.435608739  
-1.078366011  
-0.6953871032  
-0.3123846321  
0.04449727624  
0.3515226043  
0.5901019382  
0.7489849256  
0.8255356583  
0.8258502943  
0.7636643292  
0.6582062889  
0.5313180572  
0.4043058814  
0.2950168455  
0.2155941437  
0.1712516372  
0.1602193977  
0.1748216284  
0.203450089  
0.2330539365  
0.2516901717  
0.2506873862  
0.2260562763  
0.1789495938  
0.1151310284  
0.04361597652  
-0.02521901448  
-0.0816864851  
-0.1186099139  
-0.1326048902  
-0.1246080266  
-0.09961067826  
-0.06567103853  
-0.03242628645  
-0.009374499033  
-0.004238921809  
-0.02166807697  
-0.06247482827  
-0.1234810951  
-0.1979545736  
-0.276528869  
-0.3484229566  
-0.4027886232  
-0.4300031622  
-0.4227856663  
-0.3770369095  
-0.2923752449  
-0.1723480182  
-0.02432857671  
0.1408949519  
0.3098193677  
0.4672009687  
0.5972724335  
0.6851446303  
0.7183015995  
0.6880700264  
0.5908914869  
0.4292436893  
0.2120308819  
-0.04566474443  
-0.3235323863  
-0.5976441823  
-0.8426045349  
-1.034026822  
-1.151069896  
-1.178756944  
-1.109799608  
-0.9457192373  
-0.697108203  
-0.3829885078  
-0.02928654816  
0.3334441869  
0.6728568937  
0.957935018  
1.162089598  
1.265904209  
1.259210133  
1.142231043  
0.9256337241  
0.6294291222  
0.2808260179  
-0.08873777496  
-0.4470279026  
-0.7644952975  
-1.017354489  
-1.189863331  
-1.275521563  
-1.277043224  
-1.205157852  
-1.076450966  
-0.9106058336  
-0.727481667  
-0.5444743599  
-0.3745536821  
-0.2252174168  
-0.09847552114  
0.008232200794  
0.1004150427  
0.184556008  
0.2661638778  
0.3482106893  
0.4302330577  
0.5082299014  
0.5753534671  
0.6232524487  
0.6438094858  
0.63096532  
0.5822870412  
0.5000052712  
0.3913105324  
0.2678131363  
0.1442351533  
0.03648373825  
-0.04059437351  
-0.07544601209  
-0.06167261962  
0.0007706862177  
0.1052538588  
0.2391035514  
0.3851172174  
0.5237737701  
0.6358337764  
0.7049711024  
0.7200686058  
0.6768398477  
0.5785213905  
0.4355231816  
0.2640355722  
0.08378543916  
-0.08476750915  
-0.2233697106  
-0.3186003612  
-0.3637661693  
-0.3597429315  
-0.3146151684  
-0.2421562338  
-0.1593970465  
-0.0836854379  
-0.02972069267  
-0.007066617633  
-0.01854942565  
-0.05979782773  
-0.1199937873  
-0.1837009613  
-0.2334659352  
-0.252772019  
-0.2288793573  
-0.1551074643  
-0.03221078181  
0.1313731575  
0.3204420432  
0.514999833  
0.6929993845  
0.8334599698  
0.9195112879  
0.9408900692  
0.89551141  
0.7898421846  
0.6379910837  
0.4596176241  
0.2769544057  
0.1113908844  
-0.01986899448  
-0.1065322156  
-0.1468844965  
-0.1480998186  
-0.1251072807  
-0.09814742132  
-0.08937712647  
-0.1190466531  
-0.2018462992  
-0.3440362613  
-0.5418337606  
-0.7813668992  
-1.04023068  
-1.290439573  
-1.502335045  
-1.648863002  
-1.709570598  
-1.673733069  
-1.542150627  
-1.327362289  
-1.052251759  
-0.7472473728  
-0.4465040052  
-0.183574116  
0.01284917783  
0.1225714896  
0.136446494  
0.05751664507  
-0.09939538099  
-0.3095716775  
-0.5414985931  
-0.7607674797  
-0.9342501121  
-1.0340142  
-1.040490065  
-0.9445195274  
-0.7480921407  
-0.4637545991  
-0.1128628673  
0.2770122157  
0.6751408404  
1.050735855  
1.375750414  
1.627109546  
1.788251434  
1.849971769  
1.810655849  
1.676034908  
1.458592711  
1.176699558  
0.8534912635  
0.5154597243  
0.1907037213  
-0.09316707752  
-0.3114072826  
-0.4446014654  
-0.480946311  
-0.417984605  
-0.2634523706  
-0.03496201546  
0.2415872657  
0.5347919698  
0.8114184074  
1.04048993  
1.197203384  
1.266080651  
1.242858949  
1.134820142  
0.9594988132  
0.7419797906  
0.5112197063  
0.2959676259  
0.1209092994  
0.003598436919  
-0.0474196712  
-0.03309817396  
0.03698942507  
0.1466457358  
0.275791299  
0.4034855326  
0.5107621703  
0.5828891386  
0.6107918708  
0.5915179114  
0.5277955599  
0.4268538673  
0.298780358  
0.1547180232  
0.005206102694  
-0.1411002816  
-0.2781784394  
-0.402795884  
-0.5141265716  
-0.6129443836  
-0.7005813715  
-0.7778550853  
-0.8441751362  
-0.8970116212  
-0.9318444797  
-0.9426406661  
-0.9228217124  
-0.8665880216  
-0.7704041478  
-0.6343828335  
-0.463323174  
-0.2671547827  
-0.06064311386  
0.1376975258  
0.3074115253  
0.4284256555  
0.4836003602  
0.4611414024  
0.3565208657  
0.173593848  
-0.0752896076  
-0.3702389027  
-0.6857639843  
-0.9934674975  
-1.265160683  
-1.47600797  
-1.60729628  
-1.648488037  
-1.598299249  
-1.464680619  
-1.263724929  
-1.017647101  
-0.7521144192  
-0.4932644704  
-0.264783062  
-0.0853920318  
0.03296846218  
0.08606900589  
0.07737634712  
0.0171295919  
-0.07931625707  
-0.1936500126  
-0.3069599934  
-0.4019967962  
-0.4650571372  
-0.4872754161  
-0.4651860771  
-0.4005377002  
-0.2994166524  
-0.1708625993  
-0.02520938107  
0.1275729223  
0.2792579023  
0.4242641149  
0.5599356519  
0.6862032993  
0.8047154353  
0.9176430841  
1.02641112  
1.130617113  
1.227378164  
1.311256454  
1.37481415  
1.409740498  
1.408378133  
1.365393682  
1.279295769  
1.153495551  
0.9966673107  
0.8222645144  
0.6471796473  
0.4896967721  
0.3670121095  
0.2927095851  
0.2745973237  
0.3132895538  
0.4017953193  
0.5262440155  
0.6676575507  
0.8045476716  
0.9159429869  
0.9844003442  
0.9985334572  
0.9546755203  
0.8574034169  
0.7188410556  
0.5568281403  
0.3922320586  
0.2457984615  
0.1350117837  
0.07144881962  
0.05900780457  
0.09326949795  
0.1620769894  
0.2472214638  
0.3269768273  
0.3791019378  
0.3838964009  
0.3268930709  
0.2008475498  
0.006784897843  
-0.2460025564  
-0.540991327  
-0.8563647234  
-1.167598562  
-1.45039042  
-1.683572255  
-1.851639412  
-1.946575984  
-1.968725268  
-1.926575229  
-1.835455448  
-1.715302914  
-1.587781483  
-1.473147793  
-1.387313933  
-1.339553793  
-1.331216046  
-1.355681638  
-1.399596585  
-1.445228141  
-1.473572132  
-1.467729692  
-1.415976845  
-1.314014188  
-1.165987982  
-0.9840906402  
-0.7867801848  
-0.5958908424  
-0.4331039429  
-0.3163470893  
-0.2567134292  
-0.2564004943  
-0.3080183405  
-0.3953731141  
-0.4956272996  
-0.582501264  
-0.6300203356  
-0.6162426717  
-0.5263910355  
-0.3549324802  
-0.1063051364  
0.2057784913  
0.5602949024  
0.9318035828  
1.293781803  
1.621888362  
1.89666972  
2.105351064  
2.242535238  
2.309811732  
2.314468016  
2.267611075  
2.182075551  
2.070485364  
1.943750472  
1.810173755  
1.675196592  
1.541696713  
1.410654168  
1.281963351  
1.155180836  
1.030061337  
0.9068179127  
0.7861326846  
0.6690258772  
0.5567148797  
0.4505900773  
0.3523701563  
0.2644273051  
0.1901760465  
0.134364167  
0.1030736355  
0.1032943026  
0.1419891091  
0.2247218937  
0.3540285776  
0.5278213322  
0.7381848142  
0.9708877706  
1.205858815  
1.418709939  
1.58320434  
1.6743714  
1.671822066  
1.562730348  
1.343977933  
1.023058725  
0.6175409008  
0.1531354311  
-0.3393567612  
-0.827730749  
-1.282114166  
-1.678171113  
-1.999299796  
-2.237553979  
-2.393253523  
-2.473488901  
-2.489912577  
-2.456291235  
-2.38629352  
-2.291888622  
-2.182539282  
-2.065189583  
-1.944854061  
-1.825478573  
-1.710722287  
-1.604323898  
-1.5098849  
-1.430048303  
-1.365277578  
-1.31256199  
-1.264474543  
-1.208982326  
-1.130283407  
-1.010748807  
-0.8338172047  
-0.5874453392  
-0.2675501476  
0.1192093683  
0.5539307357  
1.005728298  
1.433987956  
1.792546507  
2.035390461  
2.123184333  
2.02970432  
1.747191207  
1.289664536  
0.6934934902  
0.01487116356  
-0.6757189007  
-1.301446803  
-1.788496464  
-2.075539853  
-2.12193142  
-1.913359411  
-1.464030442  
-0.8149859421  
-0.02873988504  
0.8189812567  
