-0.06252602142  
-0.1231283649  
-0.1771692419  
-0.2192146373  
-0.2454638043  
-0.2543369506  
-0.246746513  
-0.2260115126  
-0.1974100566  
-0.1674257278  
-0.1427888121  
-0.1294429526  
-0.1315875398  
-0.1509393586  
-0.1863258356  
-0.2336860317  
-0.2864886185  
-0.3365189487  
-0.3749390761  
-0.3934678691  
-0.3855255728  
-0.3471773836  
-0.277747847  
-0.1800148305  
-0.05996358729  
0.07386848159  
0.211359047  
0.3419492833  
0.4558128631  
0.5448984032  
0.6037106489  
0.6297466527  
0.6235519123  
0.5884180525  
0.529790758  
0.4544922831  
0.3698793419  
0.2830537667  
0.2002165439  
0.1262358923  
0.06443943695  
0.01662304246  
-0.01677717662  
-0.03640708223  
-0.04368692166  
-0.04051993206  
-0.02906173009  
-0.01155943244  
0.009746764487  
0.03268214715  
0.05519149541  
0.07540781448  
0.09175455414  
0.1030782836  
0.1087894379  
0.1089822312  
0.1044910201  
0.09685692225  
0.08817736738  
0.08084288302  
0.07718546955  
0.07907986081  
0.08756293253  
0.1025343081  
0.1226020776  
0.1451126394  
0.1663869851  
0.1821386492  
0.1880317841  
0.1803012267  
0.1563388893  
0.1151611813  
0.05767322162  
-0.01332173771  
-0.09337479003  
-0.1768842721  
-0.2577570969  
-0.3301476736  
-0.3891626947  
-0.4314344185  
-0.4554734275  
-0.4617574831  
-0.4525511897  
-0.4314868877  
-0.4029835701  
-0.3715927586  
-0.3413737028  
-0.31539111  
-0.2953966227  
-0.28173885  
-0.2734893315  
-0.2687561735  
-0.26511642  
-0.2600944005  
-0.2516024646  
-0.238279635  
-0.2196829153  
-0.1963113839  
-0.1694718263  
-0.1410269742  
-0.1130673611  
-0.08757496364  
-0.0661274259  
-0.04968756318  
-0.03850414388  
-0.03212657728  
-0.02952248672  
-0.02926563461  
-0.02975641125  
-0.02944224306  
-0.02699529214  
-0.02143420941  
-0.01217600922  
0.0009776383563  
0.0179008757  
0.03823042295  
0.06145665356  
0.08699315259  
0.114213525  
0.1424535696  
0.170981834  
0.1989567173  
0.2253892548  
0.2491338918  
0.2689189728  
0.2834318992  
0.2914479552  
0.2919913246  
0.2845033793  
0.2689904249  
0.2461176679  
0.2172350741  
0.1843160805  
0.1498130389  
0.1164492814  
0.08696365232  
0.06384957073  
0.04911476396  
0.0440946565  
0.04933600344  
0.0645588078  
0.08869820976  
0.1200032667  
0.1561850504  
0.1945877962  
0.2323615947  
0.2666339418  
0.2946638925  
0.3139840516  
0.3225292606  
0.3187561798  
0.3017522479  
0.2713305502  
0.2280953652  
0.1734702741  
0.1096693435  
0.0396028005  
-0.03328826703  
-0.105259451  
-0.1725375823  
-0.2316151905  
-0.2795282483  
-0.3140910165  
-0.3340534851  
-0.3391649694  
-0.3301406293  
-0.3085356369  
-0.2765476229  
-0.2367782918  
-0.1919794173  
-0.1448167407  
-0.09767398421  
-0.05250971335  
-0.01077725664  
0.02659086673  
0.05915306569  
0.08687244071  
0.1100088742  
0.1289863766  
0.1442604297  
0.1561944052  
0.1649614694  
0.1704846152  
0.172428039  
0.1702401204  
0.1632545957  
0.1508302525  
0.1325223211  
0.1082511013  
0.07844426185  
0.04412031739  
0.006892812439  
-0.03112437101  
-0.06750268664  
-0.09976453015  
-0.1256962373  
-0.1436627114  
-0.1528744612  
-0.153561884  
-0.1470127572  
-0.1354563152  
-0.1217928951  
-0.1091993825  
-0.100654901  
-0.09846304001  
-0.1038326767  
-0.1166020982  
-0.135149175  
-0.1565238672  
-0.1767925551  
-0.1915579301  
-0.1965824583  
-0.1884294856  
-0.1650182279  
-0.1260160925  
-0.07298645996  
-0.009282827326  
0.06032332627  
0.1302132618  
0.1946207097  
0.2483543794  
0.2874391422  
0.3095826867  
0.314401969  
0.3033861279  
0.2796009066  
0.2471951447  
0.210785073  
0.174816507  
0.1430004051  
0.1179013301  
0.1007353464  
0.09138735631  
0.08863301403  
0.09050550712  
0.09473553496  
0.09917670936  
0.1021417073  
0.1025890717  
0.1001360901  
0.09490888779  
0.08726813802  
0.07748082656  
0.06541614918  
0.05034100805  
0.03087420382  
0.005123899089  
-0.02900028628  
-0.07334879268  
-0.1290431544  
-0.1960287061  
-0.2727626293  
-0.3561095136  
-0.4414897289  
-0.5232769658  
-0.5954042672  
-0.6520977492  
-0.6886288213  
-0.7019714935  
-0.6912603349  
-0.6579744041  
-0.6058071498  
-0.5402416049  
-0.4678800801  
-0.3956288584  
-0.3298468172  
-0.2755826156  
-0.2359991115  
-0.2120686288  
-0.2025638756  
-0.2043445135  
-0.2128855971  
-0.2229654281  
-0.2294127762  
-0.2278060652  
-0.2150342717  
-0.1896439626  
-0.1519408927  
-0.1038393455  
-0.04849628744  
0.01021372016  
0.06830074963  
0.122255539  
0.1695570529  
0.2090302734  
0.2410018874  
0.2672452119  
0.2907184921  
0.3151330166  
0.3444066062  
0.3820695102  
0.4306981521  
0.4914456237  
0.5637299301  
0.6451234235  
0.7314586348  
0.8171490975  
0.8956915836  
0.9602946639  
1.004567722  
1.023196896  
1.012526266  
0.9709899932  
0.8993452163  
0.8006847748  
0.6802277805  
0.5449177017  
0.402857773  
0.2626506871  
0.132689536  
0.02047246439  
-0.06800563758  
-0.1287318777  
-0.1599788421  
-0.1624119629  
-0.1389813448  
-0.09460901511  
-0.03569878037  
0.03049141875  
0.09654630532  
0.1555892894  
0.2019016027  
0.2313943993  
0.2418800274  
0.2331156768  
0.2066169751  
0.1652777113  
0.1128482902  
0.0533561821  
-0.009457163251  
-0.07259577676  
-0.1341106872  
-0.1932058781  
-0.2501398756  
-0.3059516359  
-0.3620581945  
-0.4197891468  
-0.4799371203  
-0.5423943241  
-0.6059380969  
-0.6681991426  
-0.7258334887  
-0.7748771649  
-0.8112380029  
-0.8312655334  
-0.8323108654  
-0.8131942461  
-0.7745090578  
-0.7186967885  
-0.6498775065  
-0.5734383781  
-0.495430315  
-0.4218500879  
-0.3579068051  
-0.3073797373  
-0.272163617  
-0.2520749036  
-0.2449537013  
-0.2470492368  
-0.2536330538  
-0.2597503235  
-0.2609843919  
-0.2541195202  
-0.2375825827  
-0.2115988979  
-0.1780200202  
-0.1398593873  
-0.1006044063  
-0.06342265062  
-0.03040634985  
-0.001990916455  
0.02333033953  
0.0489251447  
0.07955911746  
0.1206013736  
0.1770090507  
0.2522482844  
0.3473285128  
0.4601239451  
0.5851238057  
0.7136847972  
0.8347998137  
0.9363029702  
1.006369043  
1.035108755  
1.016036365  
0.947202504  
0.8318139268  
0.6782346958  
0.4993461272  
0.3113256732  
0.1319810459  
-0.02115926508  
-0.1327765259  
-0.1914754159  
-0.1910905838  
-0.1314235826  
-0.01834581749  
0.1367487973  
0.3180669668  
0.5069791084  
0.6838577941  
0.8299868383  
0.9293500054  
0.9701282116  
0.9457649372  
0.8555190357  
0.7044675815  
0.5029813556  
0.2657385926  
0.01037951884  
-0.2440666276  
-0.4788394847  
-0.6770464736  
-0.8250647415  
-0.9136353559  
-0.9385569362  
-0.9009255009  
-0.8069098926  
-0.6670818392  
-0.4953676367  
-0.3077229855  
-0.1206539713  
0.05026703933  
0.1917519746  
0.2938725925  
0.3507660703  
0.3608971031  
0.3268706618  
0.2548296385  
0.1535186087  
0.0331431585  
-0.09584155878  
-0.2238605397  
-0.3431467214  
-0.4483695964  
-0.5369136919  
-0.6088075039  
-0.6663404094  
-0.713444397  
-0.7549360227  
-0.7957189198  
-0.8400389578  
-0.8908694778  
-0.9494753063  
-1.015183194  
-1.085364753  
-1.155620139  
-1.220135907  
-1.27219025  
-1.30476317  
-1.311211106  
-1.28595732  
-1.225138038  
-1.127146973  
-0.993017049  
-0.8265763355  
-0.6343443388  
-0.4251443858  
-0.2094416155  
0.001537182935  
0.1968348149  
0.3668309093  
0.5042322294  
0.6048614247  
0.6681531591  
0.6972787934  
0.6988783436  
0.682419981  
0.6592374938  
0.6413536449  
0.6401944379  
0.6653277639  
0.7233445617  
0.8169951517  
0.9446620391  
1.10023514  
1.273416178  
1.45045091  
1.615253207  
1.750846133  
1.841013252  
1.87201696  
1.834220006  
1.7234333  
1.541825908  
1.298257328  
1.007952548  
0.6914979689  
0.3732225356  
0.07909968221  
-0.165627052  
-0.3388591298  
-0.4238378218  
-0.4108906523  
-0.2985370544  
-0.09383587618  
0.1880611006  
0.525104791  
0.8901727673  
1.253342393  
1.584387531  
1.855278185  
2.042443799  
2.12861954  
2.104113993  
1.967413125  
1.725091318  
1.391057259  
0.9852336744  
0.5318033238  
0.05718998166  
-0.4120356628  
-0.8511529948  
-1.239024591  
-1.559438838  
-1.801980494  
-1.962382933  
-2.042371807  
-2.049047497  
-1.993882064  
-1.891436183  
-1.757918213  
-1.609706016  
-1.461958195  
-1.327423953  
-1.21554608  
-1.131923211  
-1.078167961  
-1.052160106  
-1.048658627  
-1.06019939  
-1.078180968  
-1.094013201  
-1.1002089  
-1.09128702  
-1.064394942  
-1.019575382  
-0.9596514297  
-0.8897475995  
-0.816512012  
-0.7471388077  
-0.6883198021  
-0.6452661189  
-0.6209346608  
-0.6155646484  
-0.6265993085  
-0.6490067262  
-0.6759682914  
-0.6998431157  
-0.7132732233  
-0.7102774542  
-0.6871569949  
-0.6430768453  
-0.5802063971  
-0.5033745591  
-0.4192680937  
-0.3352607576  
-0.2580425351  
-0.1922507471  
-0.1393274633  
-0.09680820221  
-0.05820047323  
-0.01352887266  
0.04947075683  
0.1436225035  
0.2802628847  
0.4671414857  
0.7065812463  
0.9941832548  
1.318318804  
1.660544292  
1.996964256  
2.300439908  
2.54341031  
2.701006533  
2.754079438  
2.691753472  
2.513165429  
2.228135332  
1.856647093  
1.427159579  
0.9739176435  
0.5335575901  
0.1413946446  
-0.1721845631  
-0.3848029426  
-0.4843008815  
-0.4698276068  
-0.3517075014  
-0.1501244128  
0.1071995911  
0.3880376502  
0.6590419216  
0.8890873256  
1.052215109  
1.129876127  
1.112282648  
0.9987894061  
0.7973469653  
0.5231763455  
0.1968899106  
-0.157682749  
-0.5156900195  
-0.8532518354  
-1.14907702  
-1.385618217  
-1.549750764  
-1.633026947  
-1.631617024  
-1.546047665  
-1.380855691  
-1.14423333  
-0.8476993021  
-0.5057817257  
-0.1356481597  
0.243389387  
0.6105771033  
0.9446800776  
1.225202888  
1.433810302  
1.555827887  
1.581651063  
1.507868103  
1.33791005  
1.082080803  
0.7568913258  
0.3837205486  
-0.0130860903  
-0.4084745009  
-0.7790355276  
-1.105161146  
-1.372737993  
-1.574158908  
-1.708535365  
-1.781099082  
-1.801887092  
-1.783916353  
-1.741104587  
-1.686236792  
-1.629252213  
-1.576076288  
-1.528131433  
-1.482560825  
-1.433088374  
-1.37134609  
-1.288445569  
-1.176531343  
-1.030081113  
-0.8467661805  
-0.6277623392  
-0.37750877  
-0.1029902663  
0.1872849005  
0.4844173985  
0.7801304527  
1.067493846  
1.341228998  
1.597569849  
1.833738512  
2.04716939  
2.234682447  
2.391808141  
2.512447487  
2.588988046  
2.612905739  
2.575787766  
2.470626429  
2.293167368  
2.043078244  
1.724715462  
1.347339281  
0.9246984142  
0.4740211284  
0.01454396532  
-0.4342244059  
-0.854248901  
-1.23048478  
-1.551954727  
-1.812255099  
-2.009444078  
-2.145372856  
-2.224586175  
-2.252998158  
-2.236556628  
-2.180117181  
-2.086691398  
-1.95718224  
-1.790634491  
-1.584944339  
-1.337919527  
-1.048507812  
-0.718008005  
-0.3510658515  
0.0437093717  
0.4536257402  
0.8623432257  
1.250839856  
1.59883329  
1.886503202  
2.096330261  
2.214831861  
2.233983331  
2.152142405  
1.974338822  
1.711878292  
1.381278601  
1.00266397  
0.5977941728  
0.1879864029  
-0.2078129829  
-0.5745517432  
-0.9019937089  
-1.184923344  
-1.422628877  
-1.617756422  
-1.774743932  
-1.898087493  
-1.990751688  
-2.052993279  
-2.081818688  
-2.071194638  
-2.013007099  
-1.898637414  
-1.720915335  
-1.476128852  
-1.165749819  
-0.7975488312  
-0.385861249  
0.04911589532  
0.4829717572  
0.889494427  
1.243547474  
1.524008037  
1.716348771  
1.814466961  
1.82147119  
1.749268398  
1.616987871  
1.448430158  
1.268904493  
1.101894956  
0.9660414428  
0.8728735822  
0.8256194463  
0.8192546721  
0.841761229  
0.8763860221  
0.9045354338  
0.9088521725  
0.8760018143  
0.7987531336  
0.6770548332  
0.517977739  
0.3345630076  
0.1437929899  
-0.03598122021  
-0.1877493391  
-0.2982783305  
-0.3599321439  
-0.3716341499  
-0.3388788699  
-0.2728400077  
-0.1887552157  
-0.1038567763  
-0.03516733419  
0.002534597831  
-0.001682515132  
-0.05390088473  
-0.1550203452  
-0.3010628359  
-0.4839917624  
-0.6928714212  
-0.9151644866  
-1.13798086  
-1.349121408  
-1.537826954  
-1.695196879  
-1.814302094  
-1.890065796  
-1.919002192  
-1.898916113  
-1.828649931  
-1.7079404  
-1.537419423  
-1.318753131  
-1.05489522  
-0.7503998762  
-0.4117326685  
-0.04750495726  
0.3314341687  
0.7121167583  
1.079827498  
1.418757245  
1.712935306  
1.94739292  
2.10948364  
2.190229162  
2.185540328  
2.097134247  
1.932984825  
1.707165052  
1.439009863  
1.151604521  
0.8697007286  
0.6172634017  
0.4149145307  
0.2776036675  
0.2128205212  
0.2196313506  
0.2887156816  
0.4034595067  
0.5420197269  
0.6801132023  
0.7941924999  
0.8645792807  
0.8781273737  
0.8300348386  
0.7245307688  
0.5743263784  
0.3988793811  
0.2217002006  
0.06706431364  
-0.04342332097  
-0.09393314657  
-0.0767570417  
0.006422904775  
0.1445226565  
0.318298202  
0.5026703425  
0.6698184942  
0.7926287003  
0.8480383059  
0.8198467971  
0.7006353181  
0.4925678314  
0.2069941144  
-0.137060507  
-0.5152955257  
-0.9010899283  
-1.268619537  
-1.595732372  
-1.8662306  
-2.071297158  
-2.209924822  
-2.288339929  
-2.318546548  
-2.316215138  
-2.298215483  
-2.280122244  
-2.274011049  
-2.286807378  
-2.319371999  
-2.366413037  
-2.417203266  
-2.456992701  
-2.468923856  
-2.436208195  
-2.344297106  
-2.18279426  
-1.946888962  
-1.638150412  
-1.264608253  
-0.8401147242  
-0.3830764306  
0.08529024171  
0.5429778519  
0.9692471649  
1.346496185  
1.661736281  
1.90751888  
2.082230807  
2.189742815  
2.238478407  
2.240033925  
2.207522964  
2.153853678  
2.090138584  
2.02441716  
1.96082756  
1.899305165  
1.835824937  
1.763146026  
1.671962814  
1.552327921  
1.395203007  
1.193962549  
0.9457115013  
0.652264777  
0.3206907252  
-0.03667046969  
-0.4027391189  
-0.7567819012  
-1.075977246  
-1.337358418  
-1.519962304  
-1.606982933  
-1.587703112  
-1.458973727  
-1.226047559  
-0.9026233959  
-0.5100428876  
-0.07568104797  
0.3693337538  
0.7928406458  
1.164522522  
1.458619145  
1.656183237  
1.746635432  
1.728458599  
1.608994463  
1.403392352  
1.132880854  
0.8225832449  
0.4991483584  
0.1884522238  
-0.08640400242  
-0.3066408428  
-0.4588139876  
-0.5352827315  
-0.5341962396  
-0.4590881343  
-0.3182000896  
-0.1236356881  
0.1095692976  
0.3644097252  
0.6228834018  
0.8669682107  
1.079603032  
1.245667629  
1.352921328  
1.392851364  
1.361342901  
1.259084279  
1.091622346  
0.8690042176  
0.6049973027  
0.3159128128  
0.01914087805  
-0.2684740097  
-0.5322277188  
-0.7609450511  
-0.9479790491  
-1.091703047  
-1.19540731  
-1.266616922  
-1.315890461  
-1.355249221  
-1.396421614  
-1.449123289  
-1.519581526  
-1.609501269  
-1.715597374  
-1.829771415  
-1.939913599  
-2.031248529  
-2.088065023  
-2.095628948  
-2.042055199  
-1.919907677  
-1.727341161  
-1.468641208  
-1.154096831  
-0.7992095862  
-0.4233298166  
-0.04786877385  
0.3057128782  
0.6179161359  
0.8729926385  
1.060319425  
1.175215231  
1.219126288  
1.199175884  
1.127155239  
1.018088596  
0.8885519727  
0.7549496844  
0.6319415643  
0.5311857008  
0.4605198757  
0.4236290487  
0.4201980591  
0.4464757581  
0.4961455588  
0.5613588709  
0.6337945533  
0.7056160933  
0.7702286308  
