806.233737  
868.378773  
995.1647773  
1257.612723  
1834.828358  
17721.3974  
10571.70549  
669.7087681  
53910.30583  
20166.71308  
7126.413108  
1574.975114  
32438.83773  
20208.50838  
21806.74896  
19517.28561  
261.1114221  
18620.12011  
16639.31011  
559.5282616  
1584.137046  
3143.915385  
1440.699755  
20639.79712  
24090.2537  
11139.15067  
5092.555915  
2496.158262  
22051.53913  
4080.487898  
19942.67309  
2486.89505  
2020.290591  
5536.573203  
6316.013422  
18037.09679  
11556.25593  
3851.408947  
934.6852393  
3970.059983  
5662.007771  
2588.768583  
4740.601935  
6377.268614  
16293.48801  
10933.93391  
1541.086111  
4174.220216  
945.5915444  
253.6768605  
3141.622686  
1181.56647  
2417.532236  
1684.885285  
9.606206707  
1273.637272  
1062.43784  
943.9397477  
706.40294  
471.3498521  
572.0852438  
78.75650535  
1011.455344  
369.8106879  
306.5027105  
320.4576067  
17.82947051  
234.4077229  
45.48109885  
0.2544822374  
30.55884999  
29.87468875  
13.28603164  
1.807597482  
18.31114021  
4.374853833  
6.083638038  
12.61625642  
6.200972803  
3.228227359  
8.834589392  
6.570507271  
3.32572767  
3.574857902  
3.881113255  
4.462248865  
4.294206404  
2.409409253  
2.431603957  
3.428581056  
2.739016358  
2.310302862  
2.457119154  
2.174505295  
2.296068722  
1.985413475  
1.963407008  
1.919065291  
1.78867255  
1.653378396  
1.592899382  
1.553724339  
1.463288111  
1.41764902  
1.370972071  
1.291383288  
1.249480865  
1.191785589  
1.141962703  
1.113931746  
1.064228761  
1.022122467  
0.9881685695  
0.9534729149  
0.9177651597  
0.8837543235  
0.8553052128  
0.8262504454  
0.7980121014  
0.7702371173  
0.7450900859  
0.7232265624  
0.698543994  
0.6759219674  
0.6552546432  
0.635715597  
0.6160067234  
0.5968648394  
0.5793454338  
0.5626598748  
0.5464145134  
0.5304929103  
0.515229964  
0.5010029048  
0.4870778136  
0.4737259129  
0.4608856626  
0.4485400199  
0.4366150648  
0.4251883693  
0.4141313861  
0.4035530141  
0.3932801858  
0.3833952075  
0.3738134794  
0.3646876529  
0.355780173  
0.3472125507  
0.3389328166  
0.330915335  
0.3232022869  
0.3157072135  
0.3084756122  
0.3014865883  
0.2947120763  
0.2881537969  
0.2818090001  
0.2756712087  
0.2697070736  
0.263941254  
0.2583451007  
0.2529220933  
0.2476722436  
0.2425682221  
0.237618256  
0.2328193705  
0.2281604776  
0.2236261732  
0.2192305933  
0.2149610718  
0.210801222  
0.2067724308  
0.2028514707  
0.1990417455  
0.1953406695  
0.191730858  
0.1882284585  
0.1848144545  
0.1814927502  
0.1782632216  
0.1751096705  
0.172046762  
0.1690620309  
0.1661551974  
0.1633202605  
0.1605601197  
0.1578662433  
0.1552418269  
0.1526838564  
0.1501895564  
0.1477552374  
0.1453813149  
0.1430638165  
0.1408030719  
0.1385936487  
0.1364420554  
0.1343387252  
0.13228657  
0.1302828241  
0.1283211655  
0.1264041151  
0.1245374691  
0.1227097082  
0.1209255045  
0.1191805354  
0.117477198  
0.1158052659  
0.1141725053  
0.1125808371  
0.1110179729  
0.109492251  
0.1079966769  
0.1065321926  
0.1051037293  
0.1037048771  
0.1023321388  
0.100992349  
0.09967631054  
0.09838915451  
0.09712768549  
0.09589277234  
0.09468275346  
0.09350074139  
0.09233577808  
0.09120161321  
0.09008401761  
0.08899298476  
0.08792279061  
0.08687041449  
0.0858398963  
0.0848306371  
0.08384113117  
0.08287253758  
0.08191806067  
0.08098450094  
0.08006781997  
0.07916763749  
0.07828441946  
0.07741871467  
0.07656952664  
0.07573158475  
0.0749123723  
0.07411008862  
0.07332250401  
0.07254480071  
0.07178269304  
0.07103869532  
0.0703018056  
0.06958144456  
0.06887288154  
0.06817468719  
0.06749376712  
0.06682257737  
0.06616125115  
0.06551263689  
0.06487548893  
0.06424490508  
0.06362962688  
0.06302793178  
0.06242955512  
0.06184567113  
0.06126905106  
0.06070161464  
0.06014542742  
0.05959700037  
0.05905812103  
0.05853079119  
0.05800982061  
0.05749462143  
0.05699186344  
0.05649445965  
0.05600744003  
0.0555261355  
0.05505006121  
0.0545901993  
0.05413049064  
0.05367856373  
0.05324031086  
0.05280101942  
0.05236970801  
0.05194599791  
0.05153148039  
0.0511201357  
0.05071775965  
0.05031781169  
0.04992646771  
0.04954259812  
0.0491606053  
0.04878780471  
0.04842067983  
0.04805755936  
0.04769863302  
0.04734519199  
0.04699863363  
0.04665865875  
0.04632006308  
0.04598703246  
0.04566036273  
0.04533840908  
0.04502098233  
0.04470849335  
0.04440061237  
0.0440961695  
0.04379549388  
0.04349756532  
0.0432096201  
0.04292231283  
0.04264044463  
0.04236013919  
0.04208442034  
0.04181411753  
0.04154787419  
0.04128142436  
0.04102379699  
0.04076759942  
0.04051492976  
0.04026351283  
0.04002041839  
0.03977778478  
0.0395384358  
0.0393044317  
0.03906934404  
0.03884048175  
0.03861378868  
0.03839288983  
0.03817077785  
0.03795535236  
0.03774217731  
0.03753033199  
0.03732257531  
0.03711630614  
0.03691305984  
0.03671351384  
0.03651378006  
0.03632116854  
0.03612977114  
0.03594170768  
0.03575491672  
0.03556969918  
0.0353875439  
0.03520940076  
0.03502961433  
0.03485774482  
0.03468227573  
0.03451141374  
0.0343438181  
0.03418054185  
0.03401603866  
0.03385301987  
0.03369670067  
0.03353810536  
0.0333832375  
0.0332319932  
0.03308154941  
0.03293206059  
0.03278472912  
0.03264017354  
0.0324962254  
0.03235454312  
0.03221383398  
0.03207780179  
0.03194283182  
0.03180860984  
0.03167629546  
0.03154621148  
0.03141645871  
0.03128786604  
0.03116484463  
0.03104142289  
0.03092056088  
0.03080069174  
0.03068182661  
0.03056353284  
0.03044707932  
0.03033347208  
0.03022218821  
0.03011063876  
0.03000198809  
0.02989259271  
0.02978583377  
0.02968202283  
0.02957715451  
0.02947438682  
0.02937630021  
0.02927346049  
0.02917778599  
0.029078952  
0.02898506641  
0.02888935044  
0.02879778766  
0.02870566437  
0.02861535878  
0.02852628431  
0.02843956926  
0.02835352261  
0.02826752633  
0.02818409259  
0.02809970858  
0.02801916556  
0.02793565637  
0.02785970024  
0.02777914436  
0.02770329126  
0.02762715769  
0.02755179201  
0.02747764066  
0.0274041882  
0.02733313391  
0.02726281109  
0.0271936071  
0.02712588216  
0.02705815916  
0.02699075823  
0.02692428094  
0.02686128781  
0.02679965909  
0.02673573654  
0.02667546177  
0.02661570735  
0.02655647794  
0.02649721267  
0.0264405305  
0.02638328266  
0.02632821584  
0.02627444802  
0.02622051211  
0.02616826124  
0.0261166536  
0.02606459459  
0.02601585598  
0.02596659377  
0.02591651528  
0.02587154373  
0.02582551745  
0.02578042305  
0.02573457555  
0.02568951589  
0.02564817487  
0.02560611759  
0.02556440819  
0.02552560886  
0.02548564261  
0.02544774762  
0.02540963854  
0.02537261447  
0.02533592162  
0.0252995221  
0.02526539721  
0.02523243626  
0.02519984654  
0.02516552324  
0.02513418428  
0.02510384941  
0.0250748721  
0.02504724322  
0.02501835971  
0.02498946302  
0.02496409442  
0.02493866451  
0.02491335704  
0.02488869783  
0.02486307216  
0.02484125753  
0.02482121902  
0.02479940126  
0.0247788672  
0.02475762707  
0.02473805682  
0.02472044905  
0.02470357542  
0.02468589689  
0.02466904462  
0.02465420953  
0.02464015101  
0.02462725633  
0.02461450968  
0.02459984909  
0.02458939402  
0.02457728758  
0.02456793691  
0.02455627817  
0.02454785561  
0.02454032424  
0.02453252754  
0.02452645463  
0.02451979702  
0.0245135692  
0.0245107885  
0.02450675289  
0.02450226749  
0.02450162476  
0.02449751791  
0.02449885902  
0.0244965992  
