0.006894440527  
0.5134890462  
0.9983658816  
1.432921767  
1.791289394  
2.052161352  
2.200442705  
2.228631329  
2.137760689  
1.937787701  
1.647284559  
1.292355937  
0.9047841228  
0.519470541  
0.1713509555  
-0.1079204876  
-0.2931804313  
-0.3684862195  
-0.3289957515  
-0.1817152837  
0.05505267364  
0.3535457218  
0.6795235942  
0.9960424806  
1.267583718  
1.464018622  
1.563898313  
1.556645357  
1.443363535  
1.236174061  
0.9562048053  
0.6305382151  
0.2885830329  
-0.04159355268  
-0.3364494263  
-0.5792482504  
-0.7611521249  
-0.8810796525  
-0.9444543368  
-0.9611612649  
-0.9431283802  
-0.9019893169  
-0.8472174144  
-0.7850237114  
-0.7181451541  
-0.6464640027  
-0.5682828813  
-0.4819114488  
-0.3872518032  
-0.2870050945  
-0.187260163  
-0.09728907152  
-0.02857390088  
0.006831461484  
-0.00168755228  
-0.06123543409  
-0.1736732995  
-0.33451973  
-0.5327704641  
-0.7517225959  
-0.9707467959  
-1.167810992  
-1.322401985  
-1.418410225  
-1.446546998  
-1.405894072  
-1.304325231  
-1.157668101  
-0.9877167127  
-0.8193083429  
-0.6768602293  
-0.5808607518  
-0.5447657614  
-0.572788867  
-0.6588735823  
-0.7870704305  
-0.9333010166  
-1.068322803  
-1.161572738  
-1.18539278  
-1.119114416  
-0.952426961  
-0.6875505161  
-0.3398350067  
0.06340027727  
0.4857494939  
0.8860694902  
1.223802653  
1.464622759  
1.585640243  
1.579404991  
1.456051719  
1.243121665  
0.9829039574  
0.7274939223  
0.5320622358  
0.4472351202  
0.5115672284  
0.7452572319  
1.146069957  
1.688199952  
2.324392942  
2.991159569  
3.616445406  
4.128726056  
4.46623808  
4.585048571  
4.464775794  
4.111163048  
3.555170877  
2.848745361  
2.057930938  
1.254362514  
0.5063485531  
-0.1292152147  
-0.6130409943  
-0.9270133102  
-1.074822334  
-1.079744408  
-0.9800799004  
-0.8230533819  
-0.6580511226  
-0.5301883732  
-0.4749765333  
-0.5146836566  
-0.6566770576  
-0.8937630335  
-1.206260076  
-1.565359592  
-1.937236946  
-2.287320954  
-2.5842007  
-2.802787499  
-2.926434414  
-2.947952202  
-2.869526815  
-2.701718454  
-2.461762414  
-2.171429466  
-1.854695815  
-1.535459368  
-1.235440008  
-0.972424382  
-0.7589076511  
-0.6012103188  
-0.4990918241  
-0.4459040096  
-0.4292995277  
-0.4324843266  
-0.435983218  
-0.4197924478  
-0.3657649959  
-0.2599863793  
-0.09485791198  
0.1294018616  
0.4041079581  
0.7124680554  
1.031009081  
1.331973439  
1.586420076  
1.767663129  
1.854583544  
1.834377355  
1.70431089  
1.472262964  
1.155930551  
0.7808261647  
0.3773342251  
-0.02274820848  
-0.3897042084  
-0.6989726632  
-0.9333987757  
-1.084437382  
-1.152213555  
-1.144554316  
-1.075194457  
-0.9615001561  
-0.8220420488  
-0.6743530655  
-0.5331300967  
-0.4090310249  
-0.3081462792  
-0.2321088215  
-0.1787297249  
-0.1430448627  
-0.1185626299  
-0.09860098968  
-0.07751452705  
-0.05173506723  
-0.02048488614  
0.01389259134  
0.04602449002  
0.06807302169  
0.07071254764  
0.04447505112  
-0.01866414614  
-0.1236522877  
-0.2708698802  
-0.4550333273  
-0.6647154911  
-0.8826252188  
-1.086742499  
-1.252263503  
-1.354183668  
-1.370256668  
-1.283950068  
-1.086999502  
-0.7811840729  
-0.3790104717  
0.09687297419  
0.6155218162  
1.140640479  
1.634296584  
2.060924693  
2.391111166  
2.60466885  
2.692581792  
2.657578726  
2.513283546  
2.282086174  
1.992062325  
1.673407868  
1.354859848  
1.060615007  
0.8081003174  
0.6068376531  
0.4584469527  
0.3576652003  
0.2941406094  
0.2546313928  
0.2252612545  
0.1934916114  
0.1495786214  
0.08738583049  
0.004557843847  
-0.09783804897  
-0.216030903  
-0.3444312828  
-0.4764896256  
-0.6054124323  
-0.7246777275  
-0.8283592776  
-0.9113192592  
-0.9693578914  
-0.9994124052  
-0.9998211528  
-0.9706593987  
-0.9140818827  
-0.8345574789  
-0.7388563564  
-0.6357158394  
-0.5351103461  
-0.4471283762  
-0.3806010662  
-0.341632881  
-0.3323046062  
-0.349782076  
-0.3860650542  
-0.4285077515  
-0.4611334914  
-0.4666340964  
-0.4288043935  
-0.3350821575  
-0.1788126524  
0.03912026687  
0.3096037703  
0.6156552447  
0.933886274  
1.236875244  
1.496172055  
1.685546783  
1.784049167  
1.778504356  
1.665097339  
1.449869235  
1.14808107  
0.7825252315  
0.3810246259  
-0.02653620974  
-0.4113124039  
-0.7483126541  
-1.018643038  
-1.210912574  
-1.321711877  
-1.355172474  
-1.321710041  
-1.236198675  
-1.115844911  
-0.9780205525  
-0.8383709066  
-0.7093615646  
-0.5994128598  
-0.5126411434  
-0.4491834514  
-0.4059622246  
-0.3777608162  
-0.3584007786  
-0.3418752459  
-0.3232789478  
-0.2994395643  
-0.269205275  
-0.2333717001  
-0.1943169429  
-0.155393261  
-0.1202316227  
-0.09201912027  
-0.07289454636  
-0.06354058723  
-0.06301802855  
-0.06888865658  
-0.07756944488  
-0.08489213769  
-0.08675109048  
-0.07975472938  
-0.06175918581  
-0.0322068824  
0.007786084851  
0.05562356902  
0.1076367035  
0.1596640736  
0.2076805159  
0.2483668537  
0.2795349213  
0.3003279288  
0.3111867501  
0.3136060879  
0.3097436986  
0.3019799124  
0.2925056888  
0.2830339694  
0.2746617947  
0.2678904857  
0.262788182  
0.2592113702  
0.2570250932  
0.2562555875  
0.2571281263  
0.2599636911  
0.2649835748  
0.2720359745  
0.2803651504  
0.2884492625  
0.2940068211  
0.2941814417  
0.2858980084  
0.2663537969  
0.2335527575  
0.1867994115  
0.1270514339  
0.05706027244  
-0.01875216622  
-0.09467993688  
-0.1643368547  
-0.2214204188  
-0.260525228  
-0.2778848792  
-0.2719500237  
-0.2436992334  
-0.1966326758  
-0.1364482242  
-0.07040636687  
-0.006497631066  
0.04750849601  
0.08498273787  
0.1012102528  
0.09391263662  
0.06344640685  
0.01266848132  
-0.05351589368  
-0.1288301415  
-0.2064347225  
-0.2797511532  
-0.343174833  
-0.3926173922  
-0.4257981135  
-0.4422927528  
-0.4433675998  
-0.4316518238  
-0.4107313465  
-0.3847369217  
-0.3579874313  
-0.3347345725  
-0.3189987322  
-0.3144808736  
-0.3244996252  
-0.3518905817  
-0.3988192629  
-0.4664864055  
-0.554710156  
-0.6614611345  
-0.7823939506  
-0.9105231724  
-1.036103468  
-1.146876706  
-1.228678036  
-1.266481747  
-1.245789402  
-1.15427958  
-0.983537871  
-0.7306651459  
-0.3995300344  
-0.001462094555  
0.4448039193  
0.9140466356  
1.376327704  
1.799531667  
2.15246661  
2.408177689  
2.547105765  
2.559647556  
2.44775834  
2.225256912  
1.916740504  
1.55510303  
1.17795355  
0.8233163893  
0.5252037312  
0.3096275708  
0.191623225  
0.1736905049  
0.2458551653  
0.3873353006  
0.5695459502  
0.7599786579  
0.9264137858  
1.040857881  
1.08270876  
1.040764831  
0.9138939406  
0.7103857213  
0.4461897795  
0.1423818802  
-0.1777430604  
-0.491496765  
-0.7791956365  
-1.025859383  
-1.222054754  
-1.363895168  
-1.452322101  
-1.491864903  
-1.489179971  
-1.451612068  
-1.38604414  
-1.298185049  
-1.192375876  
-1.071873019  
-0.9394826791  
-0.7983773128  
-0.6528517107  
-0.5088302878  
-0.3739621934  
-0.25720959  
-0.1679798432  
-0.1148572842  
-0.1041709276  
-0.1386243206  
-0.2162220511  
-0.3297567497  
-0.4669788837  
-0.6115325953  
-0.7445771922  
-0.8469182582  
-0.9013898387  
-0.8951384279  
-0.821473035  
-0.681001877  
-0.4818528961  
-0.2388967375  
0.02790379406  
0.2958418215  
0.5421733811  
0.746803951  
0.8945995484  
0.9770003521  
0.9927517287  
0.9476717261  
0.8535431091  
0.7263042318  
0.5838448976  
0.4436905925  
0.3209166951  
0.2265250161  
0.1664856887  
0.1414782244  
0.1473480402  
0.1761161396  
0.2173974565  
0.2599774203  
0.2933485882  
0.3090080469  
0.3013764174  
0.2682626877  
0.210865738  
0.1333767636  
0.04225201125  
-0.05469500446  
-0.1492764707  
-0.2338490952  
-0.3021022826  
-0.3496254433  
-0.3742380416  
-0.37606345  
-0.3574002813  
-0.3223893095  
-0.2765683227  
-0.2263561809  
-0.1785131358  
-0.1396305415  
-0.1156787404  
-0.1116211061  
-0.131094263  
-0.1761616541  
-0.2471090425  
-0.3423097019  
-0.458144336  
-0.5890120049  
-0.7274532897  
-0.8644282948  
-0.9897553503  
-1.09272763  
-1.162883546  
-1.190883976  
-1.169420408  
-1.094058811  
-0.9639230255  
-0.7821211432  
-0.5558381664  
-0.2960469399  
-0.01683441413  
0.2656247696  
0.5343751638  
0.773149632  
0.9678697279  
1.108004876  
1.187675494  
1.206317857  
1.168851469  
1.085276109  
0.9697379149  
0.8391118585  
0.7112640533  
0.6031533149  
0.5290028279  
0.4987188826  
0.5167817366  
0.5817020878  
0.6861769058  
0.8178954238  
0.9609582663  
1.097735821  
1.210972358  
1.285878406  
1.311943274  
1.284243667  
1.204050342  
1.07863459  
0.9202843628  
0.7446404331  
0.5685608081  
0.4078190292  
0.2749424744  
0.1775070709  
0.1171532915  
0.08945488483  
0.08467638537  
0.08932686204  
0.08826315482  
0.06706740354  
0.01431816687  
-0.07654896525  
-0.2060962322  
-0.3685990706  
-0.5526896331  
-0.7428021719  
-0.9212500045  
-1.070582233  
-1.175909707  
-1.226846901  
-1.218792652  
-1.153402459  
-1.038178469  
-0.8853017385  
-0.7098817578  
-0.5279250097  
-0.3543295925  
-0.2012025499  
-0.07671972252  
0.01533310462  
0.07534475425  
0.1070576331  
0.1163566682  
0.1098862282  
0.09371926821  
0.07232475382  
0.04793993326  
0.02042358577  
-0.01243983451  
-0.05429053849  
-0.1093361768  
-0.1814771374  
-0.2735373813  
-0.386740826  
-0.520470993  
-0.6723207136  
-0.838352237  
-1.01348799  
-1.191919808  
-1.367456208  
-1.533750516  
-1.684434359  
-1.813168376  
-1.91373464  
-1.980193402  
-2.007209195  
-1.990515693  
-1.927483766  
-1.817684397  
-1.663312038  
-1.469328151  
-1.243231525  
-0.9944280435  
-0.7332324804  
-0.4696561171  
-0.2121619676  
0.03339301829  
0.2644237254  
0.4817487536  
0.6891419196  
0.8923477391  
1.097698158  
1.310558757  
1.533851526  
1.766876727  
2.00465278  
2.237875146  
2.453513905  
2.636004274  
2.76885737  
2.836503397  
2.826147976  
2.729412023  
2.543569659  
2.272247491  
1.925516753  
1.519363644  
1.074584558  
0.6152238862  
0.166687834  
-0.2462842121  
-0.6016075425  
-0.8816121831  
-1.074412521  
-1.174756441  
-1.184265541  
-1.111071457  
-0.9688758133  
-0.7755531191  
-0.5514730937  
-0.3177039704  
-0.09430528695  
0.1011395661  
0.2546347336  
0.3564674943  
0.4014988465  
0.3890899116  
0.3227544349  
0.2096076942  
0.05970727025  
-0.1146774271  
-0.2998169493  
-0.4813090462  
-0.644888982  
-0.7772654244  
-0.8669683305  
-0.9051670829  
-0.8863958991  
-0.8091122722  
-0.6759982186  
-0.4939289145  
-0.2735805693  
-0.02867404454  
0.2251074287  
0.4714056234  
0.6945729087  
0.8809893763  
1.020179134  
1.105599006  
1.135035038  
1.110565367  
1.038118414  
0.9266795936  
0.7872502197  
0.6316683625  
0.4714002003  
0.3164419909  
0.1744312756  
0.05004747461  
-0.05520211377  
-0.1428125295  
-0.2167104697  
-0.2823560183  
-0.3456096246  
-0.4115190452  
-0.483184665  
-0.5608961648  
-0.6416780216  
-0.7193654297  
-0.7852442766  
-0.8292101796  
-0.8413130087  
-0.8134716487  
-0.7411109015  
-0.6244463352  
-0.4691630282  
-0.2863538526  
-0.09161748737  
0.09656607306  
0.2590456365  
0.3784594883  
0.4416225341  
0.4414755582  
0.3782964791  
0.2599593919  
0.1011753301  
-0.07822632532  
-0.2557454186  
-0.4090819332  
-0.5190309946  
-0.5720195839  
-0.5619021519  
-0.4908143546  
-0.3688947437  
-0.212983245  
-0.04440744616  
0.1138076097  
0.2399157367  
0.3162429019  
0.3313841456  
0.281537452  
0.1708067064  
0.01046684366  
-0.1826889153  
-0.388637807  
-0.5867187189  
-0.7581617915  
-0.8882072545  
-0.9675358414  
-0.9928993849  
-0.9668957361  
-0.8970236789  
-0.794208436  
-0.6710626264  
-0.5401656902  
-0.4125930641  
-0.2968837047  
-0.1985180234  
-0.119917431  
-0.06087073036  
-0.01925392967  
0.008125215605  
0.02472699691  
0.03363268699  
0.03715909247  
0.0367255178  
0.0329630276  
0.02597791127  
0.01567790313  
0.002065787996  
-0.01456798345  
-0.0336037764  
-0.05418586436  
-0.07540685359  
-0.09651998872  
-0.1171075281  
-0.1371288169  
-0.1568164606  
-0.1764447883  
-0.1960036596  
-0.214857876  
-0.2315036332  
-0.2434816582  
-0.2475298511  
-0.2399619805  
-0.2172360293  
-0.1766359743  
-0.1169171537  
-0.03882840981  
0.05464057142  
0.1583331921  
0.265347649  
0.3677718549  
0.45762971  
0.5279235394  
0.5736046002  
0.5923366537  
0.5849283222  
0.5553540934  
0.5103493679  
0.4586188667  
0.4097516551  
0.3729950586  
0.3560429781  
0.3640126281  
0.3987417623  
0.4585116817  
0.5382238927  
0.6300062921  
0.7241696935  
0.8103578238  
0.8787715724  
0.921279548  
0.9322934521  
0.9093215273  
0.8531270546  
0.7675246377  
0.6588375496  
0.5351284825  
0.4052840971  
0.2780875212  
0.1613722222  
0.06134627928  
-0.01786366427  
-0.07441927589  
-0.1087181267  
-0.123133242  
-0.1215867123  
-0.1090090654  
-0.09076061259  
-0.07206829882  
-0.05753876928  
-0.05077155917  
-0.05411460306  
-0.06853759845  
-0.09366414811  
-0.1278901676  
-0.1686241025  
-0.2125691066  
-0.2560661147  
-0.2954406811  
-0.3273462865  
-0.3490613046  
-0.3587297243  
-0.3555206633  
-0.3396759018  
-0.3124655385  
-0.2760329823  
-0.2331561347  
-0.1869796668  
-0.1407121408  
-0.09738300383  
-0.05963548573  
-0.02961012328  
-0.008881528274  
0.001560149583  
0.00133138092  
-0.009304631381  
-0.02934020366  
-0.05690567531  
-0.089136684  
-0.1221272479  
-0.1510014291  
-0.1701812104  
-0.1738750456  
-0.1567590121  
-0.1147803548  
-0.04597043287  
0.04888962492  
0.1658873973  
0.2980026425  
0.4355747131  
0.5672135565  
0.6810402539  
0.76608347  
0.8136485829  
0.8184166535  
0.7791301245  
0.6987357807  
0.5839516408  
0.4443508762  
0.2910826384  
0.1354290363  
-0.01256501225  
-0.145223253  
-0.2579492937  
-0.3494659733  
-0.4215688843  
-0.4784697464  
-0.5258655738  
-0.5698873501  
-0.616077981  
-0.6685529833  
-0.7294306624  
-0.7985727347  
-0.8736558685  
-0.9505160384  
-1.023711967  
-1.087222435  
-1.135172569  
-1.162544431  
-1.165756444  
-1.143092932  
-1.094922207  
-1.023697858  
-0.9337393886  
-0.8308116913  
-0.7215520749  
-0.612779667  
-0.5107682374  
-0.4205751906  
-0.3454715758  
-0.286572891  
-0.2427277256  
-0.2106890193  
-0.1855720638  
-0.1615544959  
-0.1327688271  
-0.09424901399  
-0.04282989628  
0.02214402953  
0.09842945227  
0.1808754558  
0.261876429  
0.3322353208  
0.3823822324  
0.4037876119  
0.390400312  
0.3398861088  
0.2544594608  
0.1411382569  
0.01131486571  
-0.120348927  
-0.2376367052  
-0.3248718232  
-0.3691347031  
-0.3622681495  
-0.3023494189  
-0.1943896146  
-0.05005775062  
0.1135709566  
0.2761404173  
0.4167661748  
0.517035257  
0.5638664908  
0.5517651186  
0.4841607533  
0.3735300123  
0.2402646083  
0.1103603371  
0.01218639187  
-0.02723644609  
0.01402222826  
0.1495776782  
0.3824467847  
0.7040577868  
1.094686778  
1.525291085  
1.960506767  
2.362417976  
2.694618674  
2.926054365  
3.034179021  
3.007072021  
2.844291752  
2.556437176  
2.163525538  
1.69246116  
1.173942853  
0.639208986  
0.1170286375  
-0.3687302187  
-0.8007102807  
-1.168717871  
-1.469430063  
-1.705283478  
-1.882772322  
-2.010467896  
-2.097072057  
-2.149810233  
-2.173410688  
-2.169768193  
-2.13831687  
-2.076975346  
-1.983447057  
-1.856589833  
-1.697576876  
-1.510590703  
-1.302931531  
-1.084489136  
