-0.02385776258  
0.04370508265  
0.1033647431  
0.1472252883  
0.1693314704  
0.1663557705  
0.1379406382  
0.08667002885  
0.01768234084  
-0.06200531588  
-0.1443635045  
-0.2212908939  
-0.2855032113  
-0.3312705561  
-0.3549236671  
-0.355089989  
-0.3326588978  
-0.2905080662  
-0.2330504905  
-0.1656757603  
-0.09416268542  
-0.02412484405  
0.0394537796  
0.09256842121  
0.1324175632  
0.1575036048  
0.1676300376  
0.1638119609  
0.1481215531  
0.1234774211  
0.09339422739  
0.06169296514  
0.03218488042  
0.008338591381  
-0.007049282979  
-0.01215211228  
-0.006343204818  
0.009672866775  
0.03386662146  
0.06304066822  
0.09314381197  
0.1197195065  
0.1384494121  
0.1457245912  
0.1391764064  
0.1180879478  
0.08362580264  
0.03883910857  
-0.01157546127  
-0.0617379162  
-0.1052189604  
-0.1357730433  
-0.1480745198  
-0.1383663567  
-0.1049408412  
-0.04838728109  
0.02841513669  
0.1205567179  
0.2215669671  
0.3240294777  
0.4202673314  
0.503007256  
0.5659586747  
0.604247777  
0.6146825102  
0.5958448335  
0.5480347025  
0.4731071328  
0.374242456  
0.255700808  
0.1225862341  
-0.01936488599  
-0.1639738315  
-0.3048103989  
-0.4354072789  
-0.5495243663  
-0.6414759977  
-0.7065094733  
-0.7412098823  
-0.7438809484  
-0.7148417531  
-0.6565759024  
-0.5736877831  
-0.472638092  
-0.361262431  
-0.24811784  
-0.141718393  
-0.04975254015  
0.02162349888  
0.06833237813  
0.08869537715  
0.08348890103  
0.05573979327  
0.01029104393  
-0.04679772843  
-0.1089420638  
-0.1697206683  
-0.2234913159  
-0.265863871  
-0.2939909732  
-0.3066626632  
-0.3042211449  
-0.2883177811  
-0.2615739966  
-0.2271907867  
-0.1885597617  
-0.1489256239  
-0.1111188161  
-0.07737991888  
-0.04926962369  
-0.02764872552  
-0.0127122445  
-0.004053181741  
-0.0007374448621  
-0.001381648226  
-0.004235748477  
-0.007269238809  
-0.008280978037  
-0.005039876105  
0.004539219168  
0.02218426883  
0.04903842905  
0.08544055282  
0.1307492413  
0.1832439362  
0.2401397593  
0.2977248193  
0.3516303481  
0.3972055957  
0.4299627856  
0.4460388195  
0.4426121573  
0.4182277989  
0.3729775015  
0.3085240013  
0.2279637331  
0.1355575488  
0.03636818577  
-0.06414009134  
-0.1604855998  
-0.2474972777  
-0.3205536823  
-0.3757280459  
-0.4098577214  
-0.4205601562  
-0.4062376211  
-0.3661053087  
-0.3002667674  
-0.209838934  
-0.09711347296  
0.03428839856  
0.1793177946  
0.33151277  
0.4831790668  
0.6257591691  
0.7503907404  
0.8486210141  
0.9132006965  
0.9388709498  
0.9230294114  
0.8661737367  
0.7720434852  
0.6474084762  
0.5015135909  
0.345222389  
0.1899605942  
0.04658580094  
-0.07567410133  
-0.1700854462  
-0.2329642661  
-0.2638669638  
-0.2654075873  
-0.2427421084  
-0.2028106641  
-0.1534537258  
-0.102520846  
-0.05708786634  
-0.02286087422  
-0.003817665405  
-0.002083032755  
-0.01801690933  
-0.05045241486  
-0.09702319709  
-0.1545142995  
-0.2191936591  
-0.2870911311  
-0.3542236309  
-0.4167736759  
-0.4712431586  
-0.5146004141  
-0.544435034  
-0.559116098  
-0.5579478035  
-0.5412877657  
-0.5106047476  
-0.468449267  
-0.4183136367  
-0.3643842619  
-0.3111979807  
-0.2632344408  
-0.2244861569  
-0.1980631786  
-0.1858692021  
-0.1884020072  
-0.2046942592  
-0.2324058901  
-0.2680571132  
-0.3073695711  
-0.3456810982  
-0.3783801208  
-0.4013160477  
-0.411144735  
-0.4055755264  
-0.3835012843  
-0.3450142041  
-0.2913054737  
-0.2244768431  
-0.1472857399  
-0.06285057224  
0.02565436359  
0.1152845873  
0.2035782727  
0.2887497616  
0.3698162844  
0.4466453235  
0.5199249504  
0.5910465922  
0.6619148412  
0.7346937058  
0.811500153  
0.8940769478  
0.9834694958  
1.079738167  
1.181747911  
1.287054352  
1.391924972  
1.491498074  
1.580080533  
1.65156628  
1.699937066  
1.719795567  
1.70687162  
1.658441729  
1.573610433  
1.453415523  
1.300741829  
1.12005812  
0.9170085065  
0.6979101746  
0.4692277328  
0.2370809252  
0.006847188561  
-0.2171076598  
-0.4315519184  
-0.6343741464  
-0.8244574857  
-1.001483178  
-1.165704491  
-1.317733135  
-1.458359318  
-1.588421863  
-1.708721614  
-1.819960658  
-1.92268812  
-2.017227332  
-2.103581462  
-2.181313389  
-2.249420148  
-2.306236708  
-2.349396769  
-2.375894585  
-2.382262233  
-2.364873613  
-2.320349298  
-2.246028521  
-2.140441883  
-2.003721055  
-1.837876697  
-1.646887936  
-1.436576  
-1.214252035  
-0.9881710134  
-0.7668415346  
-0.5582667925  
-0.369206174  
-0.2045374136  
-0.06679814655  
0.04403719147  
0.1305217982  
0.1974381754  
0.2512652113  
0.2994708614  
0.3497035311  
0.4089628894  
0.4828461518  
0.5749446009  
0.6864598384  
0.8160788267  
0.9601255552  
1.112969639  
1.267648053  
1.416634604  
1.55266181  
1.669515946  
1.762703363  
1.829923756  
1.871291355  
1.889281522  
1.888407382  
1.874659863  
1.854774633  
1.835401888  
1.822270964  
1.819451382  
1.828787465  
1.849587061  
1.878604134  
1.910330421  
1.937572913  
1.952255555  
1.946358865  
1.912878672  
1.846690363  
1.745199879  
1.608696223  
1.440352653  
1.245870211  
1.032815307  
0.8097342165  
0.585177056  
0.3667652232  
0.1604358163  
-0.03002637765  
-0.203114802  
-0.3593707601  
-0.5008533053  
-0.6304042776  
-0.7508414709  
-0.8642264749  
-0.9713325321  
-1.071412924  
-1.162311253  
-1.240897837  
-1.303753558  
-1.347985811  
-1.372014164  
-1.376181967  
-1.363057342  
-1.337342001  
-1.305365253  
-1.274211977  
-1.250603242  
-1.239690501  
-1.243959827  
-1.262435242  
-1.290337279  
-1.319294712  
-1.338126404  
-1.334122203  
-1.294677786  
-1.2090698  
-1.070132644  
-0.8755999795  
-0.6289112939  
-0.3393575267  
-0.02152592437  
0.3059052824  
0.6218768263  
0.9049652515  
1.135462527  
1.297282537  
1.379478347  
1.377220994  
1.292146343  
1.132070179  
0.9101237425  
0.6434340947  
0.3515044277  
0.05447350816  
-0.2285787859  
-0.4811166657  
-0.6903105046  
-0.8477891351  
-0.949948752  
-0.9978236883  
-0.9965660742  
-0.9546093768  
-0.8826169192  
-0.7923287305  
-0.6954185289  
-0.6024656064  
-0.5221306031  
-0.4605937834  
-0.4212913618  
-0.4049467484  
-0.4098716802  
-0.43247853  
-0.4679311077  
-0.5108545726  
-0.5560105921  
-0.598875446  
-0.6360486735  
-0.6654691367  
-0.6864209295  
-0.6993500941  
-0.7055303951  
-0.7066383993  
-0.7043011807  
-0.6996879126  
-0.6931998259  
-0.6843048401  
-0.6715340601  
-0.6526386035  
-0.6248781211  
-0.5853982662  
-0.5316379165  
-0.4617056804  
-0.3746730514  
-0.2707456118  
-0.1512851646  
-0.01869493743  
0.1238164965  
0.2725509431  
0.4236617448  
0.5734754058  
0.7187452293  
0.8568120089  
0.9856582942  
1.103865819  
1.210503287  
1.304975305  
1.386872969  
1.455856633  
1.511590234  
1.553732529  
1.581977934  
1.596125886  
1.596157188  
1.582290107  
1.555009285  
1.515053243  
1.463376745  
1.401092217  
1.329417488  
1.249636924  
1.163090937  
1.071187272  
0.9754208945  
0.8773911082  
0.778782148  
0.6813010021  
0.5865604403  
0.4959144369  
0.4102770808  
0.3299463868  
0.2544876327  
0.1827053501  
0.1127354032  
0.04226338216  
-0.03114275496  
-0.1096269908  
-0.1946168871  
-0.2864406632  
-0.3840523534  
-0.4849123423  
-0.5850594491  
-0.6793699103  
-0.7619807695  
-0.8268268182  
-0.8682311837  
-0.8814737328  
-0.8632838182  
-0.8122065648  
-0.7288192724  
-0.6157969669  
-0.4778367702  
-0.3214712704  
-0.1547964295  
0.01286906113  
0.1713717016  
0.3101633733  
0.4187969282  
0.4874817064  
0.5076978852  
0.472853911  
0.3789433292  
0.2251515615  
0.01432819192  
-0.2467471595  
-0.5473900077  
-0.8733732723  
-1.207654138  
-1.531433838  
-1.82548434  
-2.07162127  
-2.254176702  
-2.361306659  
-2.385983324  
-2.326542274  
-2.186714437  
-1.975132093  
-1.704366305  
-1.389610664  
-1.047178675  
-0.6929962116  
-0.3412718504  
-0.00349755927  
0.3121176225  
0.6007450834  
0.8605886837  
1.092179664  
1.297443011  
1.478690121  
1.63768539  
1.774918451  
1.889174477  
1.977446073  
2.035177232  
2.056794064  
2.036438631  
1.968800562  
1.849945256  
1.678039315  
1.453898393  
1.181305197  
0.867079022  
0.5208867153  
0.1548308821  
-0.2171582119  
-0.580077241  
-0.9187006186  
-1.218475676  
-1.466407681  
-1.651882621  
-1.767373285  
-1.808972943  
-1.776714876  
-1.674627213  
-1.510505967  
-1.295393663  
-1.042790783  
-0.7676417855  
-0.4851839779  
-0.2097552603  
0.04631618812  
0.2736263045  
0.4663052407  
0.6222512014  
0.7429499728  
0.8329023695  
0.8987193347  
0.9480003773  
0.9881367088  
1.025190835  
1.063004742  
1.102648734  
1.142283585  
1.177450388  
1.201737103  
1.207722388  
1.188062179  
1.136554145  
1.049038073  
0.924001534  
0.7628248123  
0.5696365903  
0.3508268187  
0.1143026692  
-0.1313893063  
-0.3779397755  
-0.6180230208  
-0.8458192795  
-1.057253094  
-1.249946924  
-1.422923928  
-1.576140344  
-1.709938342  
-1.824522169  
-1.919542665  
-1.993845369  
-2.045415306  
-2.071507335  
-2.068931691  
-2.034441107  
-1.965161862  
-1.859013798  
-1.715076304  
-1.533869606  
-1.317538913  
-1.06993907  
-0.7966176419  
-0.5047028273  
-0.2026965495  
0.09984033175  
0.3927047508  
0.6655846723  
0.9086889458  
1.113452398  
1.273265123  
1.384152436  
1.445321292  
1.459478099  
1.432835129  
1.374746964  
1.296966908  
1.212550054  
1.134504929  
1.074326977  
1.040596077  
1.037820875  
1.065711181  
1.119006719  
1.187930354  
1.259253063  
1.317867454  
1.348690937  
1.338661571  
1.278561019  
1.164414274  
0.9982543123  
0.7881345311  
0.5473536502  
0.292990018  
0.04391906739  
-0.1814253597  
-0.3672473778  
-0.5022526444  
-0.5809365825  
-0.6041238199  
-0.5787035884  
-0.516610908  
-0.4331982113  
-0.3452352232  
-0.268804893  
-0.2173716271  
-0.2002689489  
-0.2217688617  
-0.2808294934  
-0.3715033491  
-0.4839104689  
-0.6056125856  
-0.7231842587  
-0.8237665297  
-0.8964185721  
-0.9331218806  
-0.9293594531  
-0.8842514391  
-0.8002976188  
-0.6828067682  
-0.5391334387  
-0.377839396  
-0.2078802819  
-0.03790458294  
0.1242966703  
0.2721681864  
0.4006123731  
0.5060876603  
0.586615334  
0.6417322068  
0.6724151314  
0.6809882513  
0.6710060289  
0.6471058497  
0.6148064685  
0.5802339431  
0.5497700138  
0.5296206627  
0.5253280139  
0.5412563028  
0.5801024895  
0.6424857362  
0.7266727165  
0.8284871632  
0.9414362657  
1.057066193  
1.165533514  
1.256348117  
1.31923151  
1.345002094  
1.326408324  
1.258819961  
1.140707449  
0.9738589315  
0.7633097171  
0.516990611  
0.2451243227  
-0.04056626643  
-0.327772769  
-0.6045481279  
-0.8602050164  
-1.086085825  
-1.276139498  
-1.427256076  
-1.539341694  
-1.615121024  
-1.659703572  
-1.679948526  
-1.683694027  
-1.678931426  
-1.672996243  
-1.671863247  
-1.6796101  
-1.6980988  
-1.726904001  
-1.763486167  
-1.803579682  
-1.841748248  
-1.872030906  
-1.888607374  
-1.886398753  
-1.86153903  
-1.811672136  
-1.736049257  
-1.635435003  
-1.511851622  
-1.368216739  
-1.207933567  
-1.034502176  
-0.8512053928  
-0.6609084444  
-0.4659890685  
-0.2683891274  
-0.06975926004  
0.128345831  
0.32427044  
0.5161054146  
0.7016091978  
0.8782234207  
1.043172714  
1.193631756  
1.326928605  
1.440744596  
1.533275994  
1.603340653  
1.650411513  
1.674586354  
1.676508458  
1.657263427  
1.618276012  
1.561232931  
1.488039294  
1.400818854  
1.301941278  
1.194064102  
1.080167372  
0.9635580845  
0.8478271594  
0.736754482  
0.6341649868  
0.5437464229  
0.4688539408  
0.4123227064  
0.3763132375  
0.3622034362  
0.3705298769  
0.4009780228  
0.4523963253  
0.5228216693  
0.6094861677  
0.7088042277  
0.816327888  
0.9267009348  
1.033634381  
1.129953458  
1.207759666  
1.258742459  
1.274661454  
1.247981096  
1.172619477  
1.044728886  
0.8634181241  
0.6313028489  
0.3547912306  
0.04402315947  
-0.2875672579  
-0.6240626032  
-0.9481850949  
-1.242629509  
-1.491475151  
-1.68152418  
-1.803420138  
-1.852421702  
-1.828739156  
-1.737396593  
-1.587630121  
-1.391889946  
-1.164559578  
-0.9205333365  
-0.6738204937  
-0.4363282178  
-0.2169615311  
-0.02113767298  
0.1492418039  
0.2953692462  
0.4207290493  
0.5300291228  
0.628011416  
0.7183115483  
0.8025177855  
0.8795697849  
0.9455839009  
0.9941432415  
1.017027377  
1.005297734  
0.9505987404  
0.8465175802  
0.6898003805  
0.4812710178  
0.2262971949  
-0.06527287345  
-0.379722959  
-0.7005777348  
-1.010076918  
-1.290846316  
-1.527545512  
-1.708294275  
-1.825684004  
-1.877255398  
-1.865385672  
-1.796608737  
-1.68048879  
-1.528202958  
-1.351052371  
-1.159106421  
-0.9601760173  
-0.7592423871  
-0.5584106978  
-0.3573622192  
-0.1542180417  
0.05333987525  
0.2668766435  
0.4861340045  
0.7082457161  
0.9273643893  
1.13475986  
1.319377926  
1.468791583  
1.570427259  
1.612906342  
1.587345452  
1.488460953  
1.315358609  
1.071921848  
0.7667689744  
0.4127869879  
0.02630208846  
-0.3740335302  
-0.7685277647  
-1.13779429  
-1.4640446  
-1.732228767  
-1.930940548  
-2.053031335  
-2.095907306  
-2.061494094  
-1.955907157  
-1.788850398  
-1.572819288  
-1.322164299  
-1.052093631  
-0.7776843795  
-0.5129624194  
-0.270106896  
-0.05881234604  
0.1141678187  
0.2452801886  
0.3342376505  
0.38389552  
0.3999498469  
0.390472916  
0.3653031219  
0.3353182851  
0.3116168103  
0.3046550089  
0.3233876871  
0.3744769771  
0.4616351313  
0.5851707285  
0.74179999  
0.924761915  
1.124263549  
1.328228063  
1.523305028  
1.696050759  
1.834169682  
1.927686501  
1.969921127  
1.958150442  
1.893877869  
1.782666996  
1.633555071  
1.458103814  
1.269199541  
1.079738859  
0.9013587751  
0.7433517843  
0.6118996271  
0.5096963394  
0.4359988203  
0.38707127  
0.3569476737  
0.3383956716  
0.3239416378  
0.3068178513  
0.2817089803  
0.2452145175  
0.1959862442  
0.1345514805  
0.06287868083  
-0.0162213875  
-0.09975337589  
-0.1851376581  
-0.270662218  
-0.3557193536  
-0.4407992805  
-0.527254315  
-0.616882824  
-0.7114079099  
-0.8119419944  
-0.9185264992  
-1.029826493  
-1.143033569  
-1.253991788  
-1.35754792  
-1.448062137  
-1.520022184  
-1.568668966  
-1.590543599  
-1.583882005  
-1.548800244  
-1.487246713  
-1.402731436  
-1.299875617  
-1.183849111  
-1.05977948  
-0.9322177309  
-0.8047365825  
-0.6797099809  
-0.5583003847  
-0.4406376804  
-0.3261556444  
-0.2140119951  
-0.1035255505  
0.005450779756  
0.1122874556  
0.2154975182  
0.3128427709  
0.4015959402  
0.4789254948  
0.5423321255  
0.5900698131  
0.6214793798  
0.6371775375  
0.6390762432  
0.63021472  
0.6144339958  
0.5959330206  
0.5787691803  
0.5663699197  
0.5611193584  
0.5640742285  
0.5748383089  
0.5916172146  
0.6114291034  
0.6304586382  
0.6444961581  
0.6494199148  
0.6416636644  
0.6186219447  
0.5789501672  
0.5227334804  
0.45150528  
0.3681206819  
0.2764944778  
0.1812382436  
0.08722897738  
-0.0008416982248  
-0.07889083141  
-0.1437990826  
-0.1936598836  
-0.2279014515  
-0.2472725865  
-0.25369869  
-0.250030801  
-0.2397153406  
-0.2264264239  
-0.2136983417  
-0.2045948317  
