1272.245766  
1293.619577  
1392.559726  
1556.284252  
739.2043406  
6549.25236  
31736.64573  
39343.25736  
24219.46428  
16323.32207  
25039.12364  
15564.36649  
11841.70551  
9287.301253  
6273.912348  
10097.05579  
2621.445489  
3389.303093  
666.2522421  
4330.767184  
15143.10955  
6285.70815  
2775.677733  
6152.418303  
4398.31422  
2505.417899  
1574.116335  
348.7448741  
4451.43572  
2638.579655  
1178.640268  
3942.488428  
8600.685269  
5213.59593  
2150.866958  
2352.209309  
1246.679993  
35.89706137  
4467.328502  
1296.566219  
5745.28475  
4022.447217  
34393.11774  
5323.717602  
19539.96748  
13847.00899  
14876.98777  
4729.324113  
5733.097024  
7936.367875  
1715.343634  
7000.967642  
745.0971045  
3472.838285  
15801.67333  
1188.186342  
23410.26915  
7651.304644  
1411.140677  
171.2645354  
3671.146857  
1506.420869  
2189.760091  
4353.641942  
1109.279185  
977.4494067  
89.19293563  
75.793287  
0.7587800856  
1390.750287  
276.7663502  
262.1457241  
252.6056282  
145.8722052  
204.4201977  
71.39339988  
127.4726936  
59.15825131  
51.41710056  
47.3120089  
36.84110767  
41.00028254  
45.04597583  
47.24406792  
46.69566343  
37.37246977  
33.1939836  
32.04211338  
29.68912897  
27.65916386  
25.42505942  
24.53323844  
25.39646689  
23.74873923  
22.52417628  
21.70668898  
21.34550965  
20.00488461  
19.28169735  
18.64845479  
18.11085266  
17.66995712  
16.7156898  
16.18703661  
15.71544134  
15.25379446  
14.73915936  
14.23630356  
13.85713749  
13.42378805  
13.02135816  
12.68780012  
12.36328441  
12.01043346  
11.70473512  
11.38089059  
11.09096401  
10.8219768  
10.54914355  
10.30156315  
10.02786755  
9.801630536  
9.571810904  
9.356414986  
9.139314368  
8.939954539  
8.743513695  
8.553340898  
8.372121907  
8.195875628  
8.024087754  
7.861315112  
7.70124851  
7.547621693  
7.399401385  
7.255378975  
7.117873376  
6.981823377  
6.851893724  
6.725045428  
6.601948739  
6.483150704  
6.367730521  
6.256025049  
6.146944481  
6.041322844  
5.9386111  
5.838856164  
5.741915904  
5.647515923  
5.555776977  
5.466465607  
5.379655793  
5.295061594  
5.212748419  
5.132511203  
5.054329252  
4.978200313  
4.903919197  
4.83157247  
4.760934847  
4.692057531  
4.62487223  
4.559321964  
4.495303602  
4.432884151  
4.371810072  
4.31222309  
4.2539751  
4.197144598  
4.141508489  
4.087170506  
4.034030954  
3.982054865  
3.931247196  
3.881569777  
3.832905377  
3.785308376  
3.738703576  
3.693148946  
3.648495669  
3.604796789  
3.56195754  
3.520056529  
3.478975957  
3.438765673  
3.39928904  
3.360649694  
3.322764382  
3.285618807  
3.249225006  
3.213506269  
3.178434071  
3.144095424  
3.110401194  
3.077340966  
3.044859664  
3.013018065  
2.981743617  
2.951054195  
2.920940433  
2.891363179  
2.862324064  
2.833810267  
2.805769923  
2.77827498  
2.751230717  
2.724625206  
2.698527056  
2.672875301  
2.647675839  
2.622902115  
2.598538922  
2.574614906  
2.551032872  
2.527874413  
2.505113024  
2.482724356  
2.460669776  
2.439010534  
2.417711427  
2.396713265  
2.376090943  
2.355807213  
2.335795965  
2.316122319  
2.296777483  
2.277700593  
2.258985221  
2.240516082  
2.222318374  
2.204450782  
2.186785872  
2.16944161  
2.152309435  
2.135482267  
2.118905063  
2.102560738  
2.086448056  
2.070606545  
2.054973369  
2.039565365  
2.024411678  
2.009441604  
1.99471177  
1.980174094  
1.965864266  
1.951765944  
1.937833915  
1.924129494  
1.910588948  
1.897246865  
1.884113378  
1.871171072  
1.858375187  
1.845766476  
1.833340957  
1.821079064  
1.808987636  
1.797034922  
1.785272062  
1.773659626  
1.762220324  
1.750910035  
1.73975532  
1.72877077  
1.717899937  
1.707192615  
1.69663221  
1.686188144  
1.675884397  
1.665750264  
1.65570711  
1.645822042  
1.636021508  
1.626377251  
1.616852834  
1.607480583  
1.598169566  
1.589027703  
1.57996716  
1.571035641  
1.562222879  
1.553506974  
1.544900664  
1.536425291  
1.528045796  
1.519755651  
1.511570195  
1.503497508  
1.495528449  
1.487658324  
1.479864108  
1.472164252  
1.46456996  
1.457074177  
1.449662527  
1.442335909  
1.435140082  
1.427957562  
1.420916579  
1.413952711  
1.407068455  
1.400241229  
1.393515101  
1.386884634  
1.380315107  
1.373819329  
1.367412108  
1.361080219  
1.354802207  
1.348655615  
1.342526987  
1.336496329  
1.330519907  
1.324623187  
1.318789201  
1.313018599  
1.307327322  
1.301690009  
1.296143436  
1.290654689  
1.285210682  
1.279857651  
1.274560838  
1.269292869  
1.264112986  
1.258989236  
1.253936039  
1.24892174  
1.243980206  
1.239068563  
1.23426089  
1.229483091  
1.224749761  
1.220077743  
1.215469925  
1.210909514  
1.206397403  
1.20194684  
1.197527985  
1.193195446  
1.188873637  
1.184628952  
1.180423969  
1.176263255  
1.172177392  
1.168099969  
1.164083998  
1.160120612  
1.15620957  
1.15230053  
1.148504456  
1.144699575  
1.140971865  
1.137259692  
1.133616222  
1.13000115  
1.12644661  
1.122899091  
1.119421925  
1.115984279  
1.112576334  
1.109198447  
1.105881498  
1.102601117  
1.099347241  
1.096151435  
1.092954726  
1.089855718  
1.086730918  
1.083665932  
1.080691524  
1.077685731  
1.074724839  
1.071812718  
1.068936716  
1.066096037  
1.063272  
1.060508761  
1.057769917  
1.055060687  
1.052386511  
1.04974897  
1.047127276  
1.044571217  
1.04203052  
1.039517979  
1.037040487  
1.034601639  
1.032177616  
1.029808825  
1.02745883  
1.025121827  
1.022845541  
1.020571587  
1.018336464  
1.016129712  
1.013964857  
1.011801631  
1.009704659  
1.007607267  
1.005558925  
1.00351934  
1.001511336  
0.9995520923  
0.9975945581  
0.995675214  
0.9937931346  
0.9919204287  
0.9900829038  
0.988257634  
0.9864773442  
0.9847142793  
0.9830039563  
0.9812728543  
0.9795929398  
0.9779424257  
0.9763165405  
0.9747021562  
0.9731245056  
0.9715560597  
0.9700447168  
0.9685328041  
0.9670552449  
0.9655928254  
0.9641638093  
0.9627542188  
0.9613710115  
0.960007548  
0.9586755312  
0.9573666199  
0.9560655902  
0.9548094802  
0.9535499574  
0.9523362302  
0.9511332778  
0.9499705608  
0.9488099542  
0.9476684027  
0.9465695228  
0.9454866494  
0.9444208724  
0.9433823323  
0.9423791437  
0.9413776279  
0.9403922296  
0.9394454445  
0.9385234437  
0.937608315  
0.9367283576  
0.9358492223  
0.9350047461  
0.934185406  
0.9333931358  
0.9326128903  
0.931848441  
0.9311098325  
0.9303775319  
0.929687647  
0.9290151785  
0.9283737847  
0.9277225826  
0.9271167733  
0.9265239318  
0.9259598635  
0.9254023934  
0.9248598124  
0.9243622182  
0.923881669  
0.9233998646  
0.9229531421  
0.9225187774  
0.9220912048  
0.9217342545  
0.9213464774  
0.9210238545  
0.9206672593  
0.9203682317  
0.9200936927  
0.9198107026  
0.9195695588  
0.9193357127  
0.9191328463  
0.9189469617  
0.918761203  
0.9186294063  
0.9184984794  
0.9183858567  
0.9183011263  
0.9182118611  
0.9181738209  
0.9181573387  
0.918135237  
