-0.1929603288  
-0.3191310689  
-0.4410369392  
-0.5538520567  
-0.6537916728  
-0.7385751383  
-0.8076544868  
-0.8621790481  
-0.904718522  
-0.938793293  
-0.9682941528  
-0.9968857729  
-1.027472443  
-1.061794087  
-1.10019618  
-1.141580899  
-1.183539378  
-1.222630334  
-1.254772901  
-1.275706521  
-1.281474723  
-1.26888001  
-1.23587507  
-1.181840338  
-1.107719522  
-1.015989892  
-0.9104591723  
-0.7959046467  
-0.6775862827  
-0.5606934411  
-0.4497860978  
-0.3483163272  
-0.2582924007  
-0.1801406045  
-0.1127863027  
-0.053947665  
-0.0005935229751  
0.05050847639  
0.1022400014  
0.1566716418  
0.2147670196  
0.2762958778  
0.339962523  
0.4037147315  
0.4651663936  
0.5220502888  
0.572607128  
0.6158512144  
0.651661587  
0.6807053948  
0.7042170027  
0.7237027956  
0.740631408  
0.7561875347  
0.7711274131  
0.7857556203  
0.8000104002  
0.8136143158  
0.826230646  
0.8375759958  
0.8474410597  
0.8556069797  
0.8616784104  
0.8648687216  
0.8638129362  
0.8564657424  
0.8401457822  
0.8117528269  
0.7681449418  
0.7066343114  
0.6255176974  
0.5245535467  
0.4052878672  
0.2711564353  
0.1273294513  
-0.01969878301  
-0.1627206563  
-0.2945422109  
-0.4087181829  
-0.50018832  
-0.5657278026  
-0.6041512767  
-0.6162671775  
-0.6045949217  
-0.5729259113  
-0.5257934499  
-0.4679492417  
-0.4039176236  
-0.3376788063  
-0.2725001524  
-0.2109124842  
-0.1547888103  
-0.1054868087  
-0.06399039879  
-0.03101935528  
-0.007065235382  
0.007646053156  
0.01325698114  
0.0104120795  
0.0003796252606  
-0.01488456118  
-0.03276903947  
-0.05016663746  
-0.06376045087  
-0.07041562918  
-0.06763828162  
-0.05403311389  
-0.02968747849  
0.003582902757  
0.04219110227  
0.08096866525  
0.1135868796  
0.1331788162  
0.1330958205  
0.1077141479  
0.05318930003  
-0.03192819721  
-0.1462990789  
-0.2856722202  
-0.4430520198  
-0.60914055  
-0.7730128671  
-0.9229610434  
-1.047428307  
-1.135948947  
-1.180020668  
-1.173827032  
-1.11476168  
-1.003703518  
-0.845011758  
-0.6462348263  
-0.4175404733  
-0.1709084226  
0.08086245175  
0.3252329504  
0.5509864519  
0.749159824  
0.9137196794  
1.041902882  
1.134158082  
1.193697105  
1.225704106  
1.236318182  
1.231541545  
1.216240108  
1.193399147  
1.1637633  
1.125920662  
1.076830221  
1.012713307  
0.9301598327  
0.8272630492  
0.704583745  
0.5657572478  
0.4176097621  
0.2697259443  
0.1334910344  
0.02072201201  
-0.05793071979  
-0.0945800987  
-0.08545317767  
-0.031775022  
0.05996751697  
0.1784599552  
0.3086646031  
0.4334590708  
0.5356067705  
0.5997871919  
0.6144158341  
0.5730016011  
0.4748682667  
0.3251507445  
0.1340894258  
-0.08425995315  
-0.3137008884  
-0.5377220312  
-0.7412294318  
-0.9119760251  
-1.041545738  
-1.125821993  
-1.164948742  
-1.162862852  
-1.126512496  
-1.064900203  
-0.9880743935  
-0.9061673459  
-0.8285496947  
-0.7631311385  
-0.7158192996  
-0.6901329013  
-0.6869778396  
-0.7045934046  
-0.7386877359  
-0.7827943355  
-0.8288459372  
-0.8679634067  
-0.8913972517  
-0.8915386807  
-0.8628701906  
-0.8027228114  
-0.711705488  
-0.5937176791  
-0.4555086604  
-0.30581991  
-0.1542282687  
-0.009860277352  
0.1198154396  
0.2299136806  
0.3186119343  
0.3870929535  
0.4389576632  
0.4792063635  
0.5129770538  
0.5442755791  
0.5749469378  
0.604093666  
0.6280800599  
0.6411524174  
0.6365808694  
0.6081500425  
0.551732571  
0.4666582759  
0.356618726  
0.2299071067  
0.09890070649  
-0.02118593431  
-0.1141311925  
-0.1648706395  
-0.1616917948  
-0.09813402099  
0.02569394965  
0.2026030955  
0.4187148535  
0.6547587076  
0.8881251143  
1.095444973  
1.255372413  
1.351223179  
1.373123392  
1.319378891  
1.196869242  
1.020385864  
0.8109717064  
0.5934484045  
0.3934247327  
0.234162894  
0.1337000675  
0.1026050113  
0.1426671001  
0.2467060004  
0.3995317272  
0.5799392662  
0.7634697934  
0.9255636358  
1.04467282  
1.104902365  
1.097810335  
1.023126555  
0.8882971337  
0.7069445497  
0.4964929779  
0.2753339751  
0.05998153318  
-0.1373392064  
-0.3102835454  
-0.4589148402  
-0.589083878  
-0.7107669797  
-0.8356344079  
-0.9742579067  
-1.133423944  
-1.314011589  
-1.509817187  
-1.707556059  
-1.888092636  
-2.028752818  
-2.106400841  
-2.100834971  
-1.997995654  
-1.792505515  
-1.489145494  
-1.103033635  
-0.6584581718  
-0.1865097875  
0.278156237  
0.7010032484  
1.051233203  
1.30488867  
1.44705335  
1.472921641  
1.387677236  
1.205284082  
0.9464327709  
0.6359781525  
0.3002280672  
-0.03557417713  
-0.3493062394  
-0.6233984587  
-0.8455793201  
-1.00897628  
-1.111690699  
-1.156006526  
-1.14740888  
-1.093564162  
-1.003388145  
-0.8862733337  
-0.7515092355  
-0.6078889255  
-0.4634710123  
-0.3254493548  
-0.2000934437  
-0.09271940852  
-0.007664557261  
0.05174602581  
0.08324614681  
0.0856924596  
0.05913680255  
0.004903545513  
-0.07433693075  
-0.1745130869  
-0.2901328061  
-0.4143274272  
-0.5389820061  
-0.6549818912  
-0.7525948514  
-0.8219939544  
-0.8539070631  
-0.8403571245  
-0.775430918  
-0.6559926916  
-0.4822524415  
-0.2580977844  
0.008891591204  
0.3077810224  
0.6249828293  
0.9452689711  
1.253002404  
1.533461938  
1.774099826  
1.96559077  
2.102533937  
2.18373249  
2.212013625  
2.19362707  
2.137310837  
2.053156389  
1.951429525  
1.84149513  
1.730972539  
1.625208525  
1.527093989  
1.437207883  
1.354223958  
1.275489915  
1.197677998  
1.117416667  
1.031815781  
0.9388543084  
0.8375903135  
0.7282107985  
0.6119396854  
0.4908321915  
0.3674986966  
0.2447914126  
0.1254789239  
0.01194414752  
-0.09407743059  
-0.1917011254  
-0.2810133036  
-0.3630973851  
-0.4399455747  
-0.5142615259  
-0.5891442264  
-0.6676831018  
-0.7524932505  
-0.8452388953  
-0.9462106144  
-1.054008816  
-1.165402395  
-1.275401166  
-1.377560759  
-1.464517771  
-1.528710139  
-1.56321166  
-1.562593198  
-1.523695375  
-1.446214036  
-1.333003561  
-1.190037995  
-1.026014374  
-0.8516180411  
-0.6785304233  
-0.5182911443  
-0.3811481924  
-0.2750373098  
-0.2048252968  
-0.171897075  
-0.1741440142  
-0.2063324851  
-0.2608057412  
-0.3284051419  
-0.3994943255  
-0.4649543925  
-0.5170321364  
-0.5499623792  
-0.5603172589  
-0.5470783679  
-0.5114697289  
-0.456606877  
-0.3870365616  
-0.3082324068  
-0.2261000315  
-0.1465289654  
-0.07500457458  
-0.01627224782  
0.02594326138  
0.0491852902  
0.05246044023  
0.03637048438  
0.003142161131  
-0.04348278566  
-0.09853654348  
-0.1563022646  
-0.2109655027  
-0.2573783311  
-0.2918319633  
-0.3127174536  
-0.320925173  
-0.3198741291  
-0.3150922981  
-0.3133536887  
-0.3214427359  
-0.344728783  
-0.3857551161  
-0.4431132864  
-0.510828124  
-0.5784390126  
-0.6318433553  
-0.6548615085  
-0.6313465377  
-0.5475600828  
-0.3944652463  
-0.1695846043  
0.1218855148  
0.4669241131  
0.8455519835  
1.232652342  
1.600513608  
1.921766981  
2.172329382  
2.333971835  
2.396182807  
2.357112843  
2.223509998  
2.009702992  
1.735797221  
1.425358615  
1.102881139  
0.7913606001  
0.5102363847  
0.2739121807  
0.09096061184  
-0.03595435989  
-0.1095094229  
-0.1366295844  
-0.1270561998  
-0.09176933603  
-0.04146976788  
0.01470694409  
0.07009800683  
0.1209630748  
0.1664434538  
0.2080741835  
0.2489364478  
0.2926006159  
0.3420246384  
0.3985936847  
0.4614578054  
0.5272911649  
0.5905261195  
0.6440473531  
0.6802515327  
0.6923035524  
0.675396427  
0.6277823574  
0.5513950607  
0.4519137198  
0.3382313969  
0.2213729622  
0.1130066648  
0.02378157124  
-0.03825283071  
-0.06888193081  
-0.06840303762  
-0.04162794395  
0.002807646261  
0.05372557415  
0.09907225983  
0.1277199272  
0.1311089974  
0.1044919612  
0.04758173652  
-0.03546369727  
-0.1367108643  
-0.2456401126  
-0.3506586498  
-0.4406924748  
-0.5066204576  
-0.5423464709  
-0.5453734232  
-0.5168386785  
-0.4610458933  
-0.3846129476  
-0.2954038535  
-0.2014275014  
-0.1098802217  
-0.02646416283  
0.04494274695  
0.1022647054  
0.144901441  
0.1732028483  
0.1878682218  
0.1894003983  
0.1777089603  
0.1519378565  
0.1105255999  
0.05147860777  
-0.02721001018  
-0.1270768584  
-0.2487338316  
-0.3915151973  
-0.5532832129  
-0.7304153682  
-0.917966118  
-1.109969282  
-1.299832729  
-1.480767637  
-1.646207167  
-1.790167964  
-1.907542299  
-1.994308764  
-2.047674159  
-2.066157049  
-2.049622592  
-1.999284457  
-1.917660568  
-1.808476958  
-1.676510836  
-1.527348686  
-1.367064722  
-1.20183247  
-1.037492205  
-0.879124669  
-0.7306873427  
-0.5947618482  
-0.4724660905  
-0.3635447944  
-0.2666417227  
-0.1797050927  
-0.1004639706  
-0.02689530241  
0.0424149574  
0.1080803146  
0.1699390201  
0.2272956777  
0.279342448  
0.3256663717  
0.3667510165  
0.404350566  
0.441640369  
0.4830843024  
0.5340128616  
0.5999487114  
0.6857833967  
0.7949353233  
0.9286303274  
1.085440347  
1.261171206  
1.449138301  
1.640803053  
1.826681516  
1.997389963  
2.144669144  
2.262233932  
2.346318114  
2.395846825  
2.412221807  
2.398770623  
2.359967928  
2.300556658  
2.224726254  
2.135467841  
2.034205382  
1.920746133  
1.793544375  
1.650212601  
1.488201139  
1.305522413  
1.101412673  
0.8768414894  
0.6347977232  
0.3803271112  
0.120322311  
-0.1368958677  
-0.3821619475  
-0.6061417577  
-0.800040934  
-0.9562865206  
-1.069125263  
-1.135101528  
-1.153372198  
-1.12583879  
-1.057071998  
-0.9540272747  
-0.8255532661  
-0.681722908  
-0.5330302332  
-0.3895212861  
-0.2599402832  
-0.15098977  
-0.06679206274  
-0.008630354882  
0.02497672348  
0.0378621622  
0.03548748801  
0.02399425983  
0.009142348366  
-0.004714198934  
-0.01546918146  
-0.02378734605  
-0.03320527271  
-0.049768237  
-0.08121121417  
-0.1357730496  
-0.2207728121  
-0.3411437887  
-0.4981141689  
-0.6882455305  
-0.9029858157  
-1.128854231  
-1.348292422  
-1.541131219  
-1.686551936  
-1.765329854  
-1.762114643  
-1.667468217  
-1.47939565  
-1.204152846  
-0.8561909248  
-0.4571936283  
-0.03428876575  
0.3823927503  
0.7625361388  
1.078518831  
1.308003884  
1.435950111  
1.455814256  
1.369827633  
1.188350652  
0.928439067  
0.611833757  
0.2626694812  
-0.09480768534  
-0.4382444488  
-0.7487005514  
-1.011587779  
-1.217006378  
-1.359571528  
-1.437860692  
-1.453663354  
-1.411190449  
-1.316380973  
-1.176374437  
-0.9991642612  
-0.7933844509  
-0.568170704  
-0.332989649  
-0.0973898368  
0.1293713405  
0.3388039914  
0.5237128263  
0.6786858325  
0.8004547431  
0.8880426697  
0.9426541424  
0.9673161589  
0.9663137202  
0.9445173631  
0.9067126304  
0.8570463394  
0.7986699786  
0.7336330398  
0.6630114373  
0.587223805  
0.5064436314  
0.4210030449  
0.3316980081  
0.2399192375  
0.1475919234  
0.05694056097  
-0.02986149779  
-0.1110683209  
-0.185675482  
-0.2535944913  
-0.3156414658  
-0.373344232  
-0.4285941243  
-0.483228977  
-0.5386190366  
-0.5953559276  
-0.6530960365  
-0.7105982955  
-0.7659369449  
-0.8168403518  
-0.8610762518  
-0.8967954589  
-0.9227513153  
-0.9383411548  
-0.943459943  
-0.9381961228  
-0.9224402953  
-0.8955049696  
-0.85585862  
-0.8010553637  
-0.7279163219  
-0.6329577558  
-0.5130222902  
-0.366010115  
-0.1915911243  
0.008242652107  
0.2288967963  
0.4632489355  
0.7021088656  
0.9350201797  
1.15132166  
1.341321526  
1.497422428  
1.615028451  
1.693091513  
1.73420008  
1.744177786  
1.731228238  
1.704729826  
1.673842941  
1.646122591  
1.626338272  
1.61568065  
1.611488177  
1.607551559  
1.594977035  
1.563502294  
1.503094101  
1.405602279  
1.266234885  
1.084638159  
0.8654057559  
0.6179373527  
0.3556345548  
0.0945345865  
-0.1484569896  
-0.3575061083  
-0.5197184015  
-0.6266999436  
-0.675615261  
-0.6696105498  
-0.6175573201  
-0.5331417498  
-0.4334093422  
-0.3369331415  
-0.2618054854  
-0.2236731599  
-0.2340261012  
-0.2989129139  
-0.4182198572  
-0.585584282  
-0.7889525514  
-1.011735826  
-1.234448482  
-1.436678289  
-1.599189264  
-1.705946294  
-1.745846106  
-1.713952955  
-1.612092363  
-1.448702057  
-1.23793048  
-0.9980552092  
-0.7493867801  
-0.511893165  
-0.3028402134  
-0.1347481602  
-0.01394878963  
0.06004671972  
0.09426434499  
0.1010811002  
0.09629507212  
0.09670822134  
0.1175727303  
0.1702706695  
0.2605728369  
0.387734371  
0.5445634691  
0.7184427415  
0.8931366164  
1.051101186  
1.175927132  
1.254548945  
1.278879846  
1.2466623  
1.161432602  
1.031663608  
0.8692800802  
0.6878230546  
0.5005964642  
0.3190877684  
0.1519045517  
0.004338344046  
-0.1214444796  
-0.2257074962  
-0.3101497579  
-0.3768598243  
-0.4274543045  
-0.4625783196  
-0.4818586732  
-0.4843027158  
-0.469022726  
-0.4361158069  
-0.3874828674  
-0.3273793619  
-0.262553165  
-0.2018823567  
-0.1555404996  
-0.1337822551  
-0.1455349542  
-0.1970042404  
-0.2905099271  
-0.4237540535  
-0.5896416926  
-0.7767162319  
-0.9701848611  
-1.153415866  
-1.309747219  
-1.424368865  
-1.486058988  
-1.488535013  
-1.431244013  
-1.319468111  
-1.16371801  
-0.9784752373  
-0.7804315976  
-0.5864478403  
-0.4115092531  
-0.2669424592  
-0.1591472501  
-0.08901359291  
-0.05210838032  
-0.03959664242  
-0.03976146458  
-0.03989387104  
-0.02827234481  
0.004057830205  
0.0619633807  
0.1455511629  
0.2502189979  
0.3674182609  
0.4859875562  
0.5938579727  
0.6798666773  
0.7354265972  
0.7558185604  
0.7409462348  
0.6954704375  
0.6283318524  
0.5517504154  
0.4798428837  
0.4270476633  
0.406544419  
0.4288443762  
0.5006923199  
0.6243758093  
0.7974887124  
1.013151874  
1.260635524  
1.526323935  
1.794911865  
2.05071842  
2.278996619  
2.467118085  
2.605519309  
2.688319383  
2.713548446  
2.682962381  
2.601474559  
2.476264349  
2.315685307  
2.128107251  
1.920850188  
1.699349196  
1.466668358  
1.223423919  
0.9681240003  
0.6978729179  
0.4093322167  
0.09980062333  
-0.2317455837  
-0.5837981994  
-0.9517764387  
-1.327879753  
-1.701366685  
-2.059246819  
-2.38731377  
-2.671414712  
-2.89882502  
-3.059576848  
-3.147591835  
-3.161484396  
-3.104926203  
-2.986507518  
-2.81907855  
-2.618606996  
-2.402651797  
-2.188595491  
-1.991819644  
-1.824031476  
-1.691939594  
-1.596454677  
-1.532540022  
-1.489765227  
-1.453531201  
-1.406852823  
-1.33250751  
-1.215304872  
-1.044193243  
-0.813948331  
-0.5262017565  
-0.1896643273  
0.1805152289  
0.5642082759  
0.9384172284  
1.279801705  
1.567305214  
1.784557463  
1.921743904  
1.976692869  
1.95503925  
1.869426812  
1.737855697  
1.581384836  
1.421499171  
1.277489017  
1.164197042  
1.090427066  
1.058217959  
1.063058747  
1.094982815  
1.140350841  
1.184038097  
1.21169415  
1.211729958  
1.176765532  
1.104346984  
0.9968750782  
0.8608124328  
0.705340601  
0.540728046  
0.3766823171  
0.2209596926  
0.07843725135  
-0.04923527427  
-0.1633880532  
-0.2675713493  
-0.3664473495  
-0.4645394726  
-0.5650635712  
-0.669033317  
-0.7747851269  
-0.8779858907  
-0.9721153714  
-1.04934226  
-1.101643242  
-1.122000582  
-1.105492983  
-1.05011478  
-0.9572167239  
-0.8314981113  
-0.6805636377  
-0.5141075978  
-0.3428512437  
