8998.714546  
9583.125971  
10787.75017  
13209.3357  
18720.8126  
32506.51805  
45299.97352  
58417.20558  
41187.01539  
17979.80473  
10664.56321  
46125.97628  
1243.564579  
2920.495549  
5035.205331  
8808.718  
9655.335908  
7802.693574  
4197.823287  
7644.068134  
1938.098533  
870.8872922  
3466.430224  
117.6726284  
3134.395311  
4430.506393  
9031.554607  
4725.34382  
10755.46761  
5791.548263  
5414.430994  
1470.502763  
2770.603001  
3175.495249  
2741.909909  
6146.995755  
5333.003546  
4866.050037  
6516.31484  
1486.297416  
1246.830154  
640.8339757  
809.0519026  
1343.211397  
156.8341833  
2111.203504  
1326.619476  
361.5428041  
1185.625617  
8034.845976  
1727.699593  
6318.730922  
637.8681768  
1633.57681  
1241.535017  
346.7775548  
542.011554  
1684.315944  
712.2411068  
1186.014525  
1194.157086  
1370.632651  
394.4669248  
1547.229898  
542.0565173  
182.3861039  
306.8132613  
325.9402221  
242.0342653  
462.3113682  
399.0969557  
240.0065436  
112.8110277  
121.1025323  
70.7718505  
95.47552162  
80.69270737  
94.22730932  
95.71773267  
69.3802417  
67.17444573  
58.17236534  
57.62680722  
49.51559724  
52.68526641  
45.83468639  
45.81576472  
42.87965763  
39.38968632  
36.34899067  
34.65325425  
32.77369437  
30.85666886  
28.80136184  
27.28758145  
26.19262849  
24.91888994  
23.76460356  
22.24880091  
21.18770132  
20.08320564  
19.24749876  
18.24120994  
17.5780823  
16.71703878  
16.02789343  
15.32511084  
14.64739148  
14.0345828  
13.44715508  
12.89930046  
12.38741734  
11.89343429  
11.42200954  
10.98330283  
10.56353953  
10.16677196  
9.781785198  
9.421848685  
9.080006256  
8.753552279  
8.443646856  
8.149558656  
7.865930256  
7.596733739  
7.339016681  
7.093736039  
6.857343675  
6.632819094  
6.418303144  
6.212554078  
6.015623211  
5.82706009  
5.645352437  
5.471812256  
5.305425941  
5.145483674  
4.991878812  
4.844617682  
4.702889792  
4.566631414  
4.43557891  
4.309628041  
4.188228825  
4.071486301  
3.958996237  
3.850540337  
3.746138897  
3.645425767  
3.548328163  
3.454691472  
3.364309425  
3.277022552  
3.192807632  
3.111409041  
3.032775171  
2.956845173  
2.883391359  
2.812345766  
2.743699699  
2.677266742  
2.612971096  
2.550728429  
2.490479691  
2.432153634  
2.375600966  
2.32087147  
2.267808421  
2.216368928  
2.166488022  
2.118124913  
2.071210879  
2.025686807  
1.981522086  
1.938650916  
1.897022003  
1.856612864  
1.8173636  
1.779266604  
1.742182379  
1.706201886  
1.671203647  
1.637205266  
1.604106133  
1.571962921  
1.540643564  
1.510205308  
1.480602599  
1.451785455  
1.423727373  
1.396362695  
1.369820708  
1.343900216  
1.318662303  
1.294068329  
1.270130782  
1.246778853  
1.224041361  
1.201872671  
1.180238783  
1.159159953  
1.138615913  
1.118553989  
1.098972523  
1.079888017  
1.061287821  
1.043092437  
1.025369991  
1.008061237  
0.9911345471  
0.9746355133  
0.9584959658  
0.9427251054  
0.9273610269  
0.9123213371  
0.8976168903  
0.8832526181  
0.8692487073  
0.8555186645  
0.8421160803  
0.8290270959  
0.8161898743  
0.8036656551  
0.7913903928  
0.7794106293  
0.7676839316  
0.7561978607  
0.7449813216  
0.7339734203  
0.7232070422  
0.7126926251  
0.7023722746  
0.6922758418  
0.6823996289  
0.6727348863  
0.6632559753  
0.6539754621  
0.6448891231  
0.6359692074  
0.6272516024  
0.6187176521  
0.6103233007  
0.6021148004  
0.5940814784  
0.5861814361  
0.5784552565  
0.5708756699  
0.5634456048  
0.5561727835  
0.549008572  
0.542029128  
0.5351331973  
0.5283941454  
0.5217843192  
0.5153018916  
0.5089312017  
0.5026899262  
0.4965441419  
0.4905406092  
0.4846324227  
0.4788547978  
0.4731582134  
0.4675682393  
0.4620865813  
0.456704359  
0.451426205  
0.4462266956  
0.4411555155  
0.4361304528  
0.43120032  
0.4263867068  
0.4216449922  
0.416970519  
0.4124138291  
0.407906683  
0.4034839178  
0.3991468984  
0.394870078  
0.3906640479  
0.3865557653  
0.3825116315  
0.3785230183  
0.3746035737  
0.3707574955  
0.3669657963  
0.3632477443  
0.359584606  
0.3559841536  
0.3524454345  
0.348969603  
0.3455405557  
0.3421785534  
0.3388807539  
0.3356140718  
0.3324138742  
0.3292589144  
0.3261429103  
0.3230974858  
0.3201135212  
0.3171546016  
0.3142464255  
0.3113767014  
0.3085711959  
0.3058015231  
0.3030725573  
0.3003803947  
0.2977410036  
0.2951385277  
0.2925860031  
0.290064565  
0.2875825847  
0.2851467975  
0.2827344972  
0.2803716522  
0.2780298053  
0.275728566  
0.2734753735  
0.2712508192  
0.269062085  
0.2669144592  
0.2647762242  
0.2626789257  
0.2606123524  
0.2585901843  
0.2565842032  
0.2546100407  
0.2526592117  
0.2507540001  
0.2488698711  
0.2470154341  
0.2451840997  
0.243387546  
0.2416028203  
0.2398513065  
0.2381336979  
0.2364372612  
0.2347514143  
0.2331021613  
0.2314862273  
0.2298839579  
0.228300597  
0.2267495109  
0.2252227188  
0.223714611  
0.2222124698  
0.2207536325  
0.2193031043  
0.2178733327  
0.2164738381  
0.2150911956  
0.2137315941  
0.2123770804  
0.2110542114  
0.2097413181  
0.2084711686  
0.2071962057  
0.2059330152  
0.2047096728  
0.2034886718  
0.2022968534  
0.201104345  
0.1999442324  
0.1987996158  
0.1976677303  
0.1965499068  
0.1954556419  
0.1943694798  
0.1932938203  
0.192251379  
0.1912074374  
0.1901887746  
0.1891748448  
0.1881835292  
0.1872096621  
0.1862367414  
0.1852773891  
0.1843530098  
0.1834336345  
0.1825140265  
0.1816098964  
0.1807314195  
0.1798599085  
0.1789991597  
0.1781533163  
0.1773134955  
0.1765005295  
0.1756877854  
0.1748862995  
0.1740957204  
0.1733238241  
0.1725564929  
0.1718097043  
0.1710611488  
0.1703451898  
0.1696047595  
0.1688959267  
0.1682088782  
0.1675216279  
0.1668443084  
0.1661846702  
0.1655149144  
0.1648740069  
0.1642354269  
0.1635957535  
0.1629938859  
0.1623794116  
0.161779253  
0.1611889567  
0.1606125958  
0.1600436857  
0.1594921608  
0.1589271519  
0.1583864881  
0.1578436473  
0.1573227394  
0.1568150661  
0.1562944002  
0.1557918412  
0.1553013825  
0.1548168234  
0.1543376528  
0.1538769162  
0.1534182287  
0.1529635582  
0.152518842  
0.1520870264  
0.1516635854  
0.1512336037  
0.1508244892  
0.1504225049  
0.1500253968  
0.1496429518  
0.1492568467  
0.1488772549  
0.1485008055  
0.1481430179  
0.1477951416  
0.1474457045  
0.1471100546  
0.146768855  
0.1464563213  
0.1461338644  
0.145829992  
0.1455222988  
0.145218139  
0.144932848  
0.144640742  
0.1443610339  
0.1440913998  
0.143841094  
0.1435706298  
0.1433282594  
0.1430665075  
0.1428345309  
0.1426017185  
0.1423763162  
0.1421480129  
0.1419378164  
0.1417329723  
0.1415261927  
0.1413321888  
0.1411485796  
0.1409692106  
0.1407926538  
0.1406186799  
0.140444358  
0.1402965547  
0.1401408441  
0.1400007289  
0.139858048  
0.1397182256  
0.1395893234  
0.1394642761  
0.1393468869  
0.1392326804  
0.1391252728  
0.139025352  
0.1389256273  
0.1388432582  
0.1387668822  
0.1386792882  
0.1386162845  
0.1385493428  
0.1384991515  
0.1384410882  
0.1383882722  
0.1383429643  
0.1383049956  
0.1382803869  
0.138244696  
0.138231376  
0.1382195189  
0.1382057576  
0.1382042312  
