2.126590033  
9.306569555  
22.02047105  
20.81833525  
348.4610902  
4048.109528  
11013.31028  
2926.109779  
10230.33503  
26685.4526  
14187.75937  
71680.99024  
79939.60221  
3364.668369  
20965.49777  
9921.393812  
315.5781029  
11666.2354  
8514.209873  
1481.106021  
1183.109423  
30843.80785  
2174.455124  
11702.60828  
10577.71973  
5993.705091  
2167.975396  
445.4908453  
15520.67482  
15402.71982  
20287.93208  
15167.10847  
12373.78905  
2819.676297  
11173.29661  
7298.752463  
2642.485442  
1503.303334  
361.6340853  
4006.110736  
665.9136547  
2830.051184  
4197.048449  
4274.511809  
995.2077769  
1747.748351  
1198.656533  
830.4720076  
244.3308662  
2688.410779  
4387.493121  
4550.556191  
34.69769273  
176.5147559  
1634.270925  
151.8404992  
1013.330465  
665.5071378  
659.0095988  
718.8638747  
1680.599075  
28.45848474  
199.1130175  
55.96740697  
84.73585447  
290.3170399  
10.31651551  
116.3376621  
0.1194837042  
20.50068972  
34.35115325  
4.296880594  
31.47063335  
1.685584932  
10.2718686  
9.893718681  
3.488760317  
4.125744645  
3.2810873  
4.706596899  
5.613507969  
6.312483808  
3.374397351  
3.696809576  
3.011423821  
3.57621236  
3.606335284  
3.761593173  
3.620835288  
3.729915456  
3.518648246  
3.228149408  
3.282217392  
3.141933911  
3.121742914  
3.153353847  
3.063800716  
2.982378677  
2.884838257  
2.833408511  
2.764937481  
2.702721221  
2.670447537  
2.631259689  
2.579315596  
2.515111931  
2.482590699  
2.430140552  
2.389752399  
2.339364428  
2.305300657  
2.265229044  
2.223051911  
2.191738804  
2.150645733  
2.112132275  
2.080265098  
2.045541975  
2.013759607  
1.980416762  
1.948333798  
1.917450736  
1.887337518  
1.858388342  
1.830636638  
1.801690279  
1.775513063  
1.748290472  
1.722725094  
1.697289247  
1.672723435  
1.648443607  
1.624615359  
1.601782793  
1.579120848  
1.557048999  
1.535598492  
1.514387758  
1.493946068  
1.473736218  
1.454010233  
1.434694992  
1.415796068  
1.397341746  
1.379164513  
1.361455563  
1.344139562  
1.327167053  
1.31043411  
1.294173811  
1.27817774  
1.262497474  
1.247156577  
1.232111679  
1.217380882  
1.202888882  
1.188718799  
1.174822798  
1.161181919  
1.147784367  
1.134660782  
1.121795192  
1.109164164  
1.096753545  
1.084584593  
1.072626589  
1.060904184  
1.049381739  
1.038076743  
1.026970988  
1.016075449  
1.005347236  
0.9948213557  
0.9845009631  
0.9743146683  
0.9643339352  
0.9545534816  
0.9449065787  
0.9354189441  
0.9261006018  
0.9169372433  
0.9079340156  
0.8990932903  
0.890382018  
0.8818237115  
0.8733977845  
0.8651143869  
0.8569648074  
0.8489567788  
0.8410739848  
0.8333090255  
0.825674081  
0.8181440466  
0.8107571882  
0.8034873408  
0.7963141667  
0.7892607204  
0.7823265506  
0.7754779825  
0.7687536762  
0.7621132102  
0.755586489  
0.7491524053  
0.7428308261  
0.7366007433  
0.7304496346  
0.7243872285  
0.7184412461  
0.7125476242  
0.7067621925  
0.7010637455  
0.6954457467  
0.6899025778  
0.6844508985  
0.6790660093  
0.6737547548  
0.6685367665  
0.6633690555  
0.6583067085  
0.6532831709  
0.6483520427  
0.6434658465  
0.6386700474  
0.6339355748  
0.6292797861  
0.6246615928  
0.6201084741  
0.6156209561  
0.6112262896  
0.6068483718  
0.6025424418  
0.5983095193  
0.5941315515  
0.5899882875  
0.5859064778  
0.581885513  
0.5779189845  
0.5740036824  
0.5701369129  
0.5663102803  
0.5625547222  
0.558834019  
0.5551732299  
0.5515434714  
0.5479875367  
0.5444490661  
0.5409670134  
0.5375161424  
0.5341226088  
0.5307642675  
0.5274643141  
0.5241846018  
0.5209650586  
0.5177744895  
0.514616915  
0.5115035826  
0.5084427244  
0.5054079522  
0.5024164312  
0.4994547139  
0.4965385944  
0.4936326001  
0.4907857656  
0.4879716722  
0.4851929155  
0.4824371  
0.479723042  
0.4770327144  
0.4743831068  
0.4717580937  
0.4691801726  
0.4666084091  
0.4640906619  
0.4615926466  
0.459113449  
0.4566791185  
0.4542703064  
0.4518938662  
0.4495319907  
0.4472038093  
0.4448978879  
0.4426199384  
0.4403842352  
0.4381634753  
0.4359594469  
0.4337925957  
0.4316471056  
0.4295231109  
0.4274312229  
0.425349549  
0.4233051132  
0.4212759831  
0.4192767693  
0.4173028403  
0.4153328954  
0.4133946419  
0.4114924997  
0.4095895349  
0.4077346525  
0.4058674861  
0.4040479634  
0.4022318967  
0.4004570335  
0.3986777729  
0.3969311847  
0.3952066989  
0.3934866875  
0.391804931  
0.3901329737  
0.3884732389  
0.3868552057  
0.3852224232  
0.3836220088  
0.3820451584  
0.3804879961  
0.3789393605  
0.3774009619  
0.3758925606  
0.3744009166  
0.372915432  
0.3714533637  
0.370002347  
0.3685892652  
0.3671593556  
0.3657594953  
0.3643705361  
0.3630139875  
0.3616528292  
0.3603170933  
0.358984075  
0.3576811117  
0.3563830759  
0.3550977841  
0.3538364587  
0.3525850792  
0.3513382874  
0.3501112891  
0.3488973051  
0.3477056898  
0.3465177951  
0.3453461634  
0.3441910222  
0.3430348456  
0.3418992913  
0.3407781288  
0.339674844  
0.3385763871  
0.3374894119  
0.3364099244  
0.3353521366  
0.3343088785  
0.3332702788  
0.3322437935  
0.3312279309  
0.3302371137  
0.3292329768  
0.3282490959  
0.3272776629  
0.326321279  
0.3253710077  
0.3244368072  
0.3235106468  
0.3225868004  
0.3216869646  
0.3207987799  
0.3199031181  
0.3190331309  
0.3181695632  
0.3173107842  
0.3164588804  
0.3156366398  
0.3148060794  
0.3139888698  
0.3131821444  
0.3123864607  
0.3116035319  
0.3108181869  
0.310052482  
0.3092863602  
0.3085348788  
0.3077908572  
0.307064742  
0.3063330833  
0.3056274204  
0.3049151645  
0.3042086124  
0.3035122805  
0.3028339087  
0.3021731836  
0.3015123938  
0.300848905  
0.3001946584  
0.2995604516  
0.2989270724  
0.2983017945  
0.2976853829  
0.2970725884  
0.2964884281  
0.2958762099  
0.2952908448  
0.2947233259  
0.2941555467  
0.2935802341  
0.2930354147  
0.2924917046  
0.2919542977  
0.2914114771  
0.2909000473  
0.2903762431  
0.2898649695  
0.2893692668  
0.2888778615  
0.2883957423  
0.2879036869  
0.28743117  
0.2869588489  
0.28651178  
0.2860480865  
0.2856061143  
0.2851589526  
0.2847275136  
0.2843038062  
0.2838844616  
0.2834655337  
0.2830686839  
0.2826628778  
0.2822754333  
0.2818866536  
0.2815096901  
0.2811285463  
0.2807620918  
0.2804071777  
0.280050078  
0.2797073766  
0.2793644912  
0.2790260279  
0.2786955598  
0.2783609994  
0.2780626456  
0.2777475586  
0.2774478558  
0.2771480643  
0.2768499313  
0.2765667604  
0.2762843635  
0.2760168206  
0.2757415584  
0.2754845583  
0.2752247086  
0.2749764995  
0.2747439033  
0.2744918997  
0.2742642392  
0.2740356781  
0.2738090148  
0.2735991436  
0.2733840751  
0.27318719  
0.2729861122  
0.2727965189  
0.2726133566  
0.2724319701  
0.2722575863  
0.2720950759  
0.2719280864  
0.271766489  
0.2716177294  
0.2714636589  
0.271332727  
0.2711939851  
0.2710579271  
0.2709354738  
0.2708202887  
0.2707026872  
0.2706065994  
0.2705027129  
0.270408072  
0.2703112735  
0.2702235163  
0.2701535621  
0.2700736668  
0.2700092798  
0.2699349617  
0.2698789792  
0.2698283719  
0.2697833789  
0.269742768  
0.2697085617  
0.269680427  
0.2696568891  
0.2696343843  
0.2696193728  
0.2696187637  
0.2696150336  
