63.84175963  
66.91706284  
74.94525892  
95.35030907  
131.662697  
1712.124229  
4707.536307  
48571.09744  
6461.116188  
66424.32042  
39171.70983  
3041.5411  
8100.466153  
3495.788506  
16875.15873  
22831.91955  
10687.83152  
320.4446619  
2212.820443  
6278.397548  
7971.844918  
3319.984778  
1573.099245  
49795.5698  
32474.28248  
2388.041936  
99.06637582  
25632.08687  
1228.989494  
1662.488778  
1302.688944  
981.73437  
2487.329219  
14499.46709  
24893.34575  
4240.136043  
8097.624019  
2474.092866  
13629.20199  
1099.95203  
8.901714728  
123.7759428  
658.4095348  
928.2876152  
2920.359027  
1700.422859  
3446.250774  
5073.607943  
1855.56328  
2958.267724  
4677.151552  
411.1456877  
4460.566054  
179.946251  
3467.124175  
2382.459075  
997.1998939  
2800.128217  
1329.257793  
110.0589302  
761.1374479  
2137.531741  
780.1669079  
124.7643817  
929.5799107  
434.1381638  
287.5143621  
4.781873314  
33.68734516  
89.96039922  
33.19496538  
5.198228835  
19.45152291  
16.85939552  
2.444529122  
12.92480487  
18.69319221  
13.99506608  
7.014437059  
7.961424607  
4.165894322  
5.085354814  
6.050719872  
6.001536669  
6.471595652  
5.028995618  
4.886693664  
3.921489559  
3.576414659  
3.537667541  
3.869676756  
3.717020185  
3.482727974  
3.158860546  
2.808852321  
2.71234273  
2.747051407  
2.489153508  
2.475472534  
2.324851393  
2.273641217  
2.150019723  
2.080522657  
2.022291104  
1.934914312  
1.880482056  
1.807329207  
1.743512783  
1.682056211  
1.620875564  
1.577696255  
1.517699861  
1.473426494  
1.426349076  
1.383552444  
1.342758713  
1.300121434  
1.26056555  
1.224924533  
1.19170959  
1.158952936  
1.126790135  
1.095992429  
1.067115964  
1.038919553  
1.011570005  
0.9857318605  
0.96098127  
0.937352851  
0.914218638  
0.8921169693  
0.8708449379  
0.8502579131  
0.8306036543  
0.8115623666  
0.7931474406  
0.7753599868  
0.7582601583  
0.7416600197  
0.7257636141  
0.7103201311  
0.6954034365  
0.6809614974  
0.667056871  
0.6534994169  
0.6404267165  
0.6277486566  
0.6154896582  
0.603612684  
0.5920768979  
0.5808914263  
0.5700473719  
0.5595310756  
0.5492976664  
0.5393938154  
0.5297577862  
0.5204028183  
0.5113002473  
0.5024676222  
0.4938774617  
0.4854941954  
0.4773834378  
0.4694817656  
0.4617837059  
0.4542880968  
0.4469937713  
0.4398799539  
0.4329628528  
0.4262159114  
0.4196525686  
0.4132442712  
0.4069785983  
0.4008887518  
0.3949438629  
0.3891483112  
0.3834885134  
0.3779735473  
0.3725641267  
0.3673007177  
0.3621522684  
0.3571427767  
0.3522270306  
0.3474271776  
0.3427494085  
0.3381733711  
0.3336981069  
0.3293190744  
0.3250473651  
0.3208614493  
0.3167537632  
0.3127432815  
0.3088339521  
0.304990291  
0.3012290936  
0.2975583399  
0.2939411561  
0.2904283572  
0.2869620537  
0.2835858618  
0.280259749  
0.2770161982  
0.2738274866  
0.2707074001  
0.2676487858  
0.2646559386  
0.2617004302  
0.2588212293  
0.255988796  
0.2532211548  
0.2504963592  
0.2478253778  
0.2452151036  
0.2426337741  
0.2401107881  
0.2376184299  
0.2352049154  
0.2328174622  
0.2304711918  
0.228159124  
0.2259042502  
0.2236854783  
0.2215072958  
0.2193618133  
0.2172464369  
0.2151881246  
0.2131567858  
0.211158728  
0.2091819526  
0.2072497635  
0.2053515584  
0.2034914236  
0.2016591188  
0.1998553189  
0.1980863254  
0.1963331512  
0.1946215219  
0.1929270678  
0.1912655119  
0.1896222159  
0.1880261927  
0.186438595  
0.1848856531  
0.1833483776  
0.1818522402  
0.1803548009  
0.1788943335  
0.1774494999  
0.1760401812  
0.1746440541  
0.1732773433  
0.1719216964  
0.1705851369  
0.1692726888  
0.1679891296  
0.1667162504  
0.1654629387  
0.1642255745  
0.1630053266  
0.1618009484  
0.1606204251  
0.1594583467  
0.1583118118  
0.1571797716  
0.1560701389  
0.154970084  
0.153880272  
0.152825223  
0.1517725453  
0.1507349837  
0.1497142759  
0.1487039582  
0.1477053799  
0.1467254324  
0.1457581735  
0.1448054452  
0.1438711835  
0.1429382103  
0.1420311652  
0.1411295295  
0.140236715  
0.1393567581  
0.1384923902  
0.1376383809  
0.1367950624  
0.1359676592  
0.1351418411  
0.1343405503  
0.1335333781  
0.132745474  
0.1319761063  
0.1312010334  
0.1304494366  
0.129700827  
0.1289657762  
0.1282405096  
0.127518756  
0.1268047997  
0.1261069759  
0.1254136914  
0.1247361539  
0.124061692  
0.1233936999  
0.1227374768  
0.1220858965  
0.1214486097  
0.1208188553  
0.1201891448  
0.1195759629  
0.1189723804  
0.1183677018  
0.1177750091  
0.1171891171  
0.1166139834  
0.1160342635  
0.1154757007  
0.114922454  
0.1143664247  
0.1138276125  
0.1132926843  
0.1127535123  
0.1122294127  
0.1117151914  
0.1112059041  
0.1106953484  
0.1101952842  
0.1097091548  
0.1092251067  
0.1087426492  
0.1082690148  
0.1078005915  
0.1073365572  
0.1068762106  
0.1064245284  
0.1059772383  
0.1055393146  
0.1051008963  
0.1046730528  
0.1042463286  
0.1038221069  
0.1034063074  
0.1029968283  
0.1025944871  
0.1021915636  
0.101799212  
0.101408734  
0.1010178588  
0.100637144  
0.1002603412  
0.09988718347  
0.09951957294  
0.09916309876  
0.09879728971  
0.0984427353  
0.09809086254  
0.09775245522  
0.09740542866  
0.09706233698  
0.09672889144  
0.09640122539  
0.09607980232  
0.09575569935  
0.09543046675  
0.09512035765  
0.09481326266  
0.09451099661  
0.09420351548  
0.09390339064  
0.09360546424  
0.09331667642  
0.09302598641  
0.0927413443  
0.09246054296  
0.09218549825  
0.09190608322  
0.09163996092  
0.09137276545  
0.09110690044  
0.0908389689  
0.09058689909  
0.09033365804  
0.09008821639  
0.08983976052  
0.0895941731  
0.08935348603  
0.08910367998  
0.08887569164  
0.08864400346  
0.08841509813  
0.08818508639  
0.08796599126  
0.08774434191  
0.08752540392  
0.08731194745  
0.08709779849  
0.08688998157  
0.08668374676  
0.08648004276  
0.08628134007  
0.08607609564  
0.08588388014  
0.08569156009  
0.08550936977  
0.08531709941  
0.08513182443  
0.0849491798  
0.08476934077  
0.08459101651  
0.08441353477  
0.08424519775  
0.0840760757  
0.08391032097  
0.0837414319  
0.08358230935  
0.08342340546  
0.0832650978  
0.08310614598  
0.0829522116  
0.08280964042  
0.08265636491  
0.08251371648  
0.08236907865  
0.08222815507  
0.08208583554  
0.08195034682  
0.08182309723  
0.08168456195  
0.08156467453  
0.08143290239  
0.08130402228  
0.08117998026  
0.0810584072  
0.08094247102  
0.08081987025  
0.08071020726  
0.08059411551  
0.08048805192  
0.08037816428  
0.08027516125  
0.08016282229  
0.08006333803  
0.0799639207  
0.07986795041  
0.0797687253  
0.07967632325  
0.07958803912  
0.07949644481  
0.07940827312  
0.07932752061  
0.07923863277  
0.07915446249  
0.07907399396  
0.0789954869  
0.07891919226  
0.07884342453  
0.07877647477  
0.07870193392  
0.07863461482  
0.07856901562  
0.07850562141  
0.07843870576  
0.07838007939  
0.07832052385  
0.07826367778  
0.07820932224  
0.07815798277  
0.07810196007  
0.07805286573  
0.07800519791  
0.07795644992  
0.07791787319  
0.07787541837  
0.07783508064  
0.07779230775  
0.07775754731  
0.07772266139  
0.07768713822  
0.0776572866  
0.07762374355  
0.07760020209  
0.07757693092  
0.07754926111  
0.07752759934  
0.07750767927  
0.0774892371  
0.07746813857  
0.07745622742  
0.07744153919  
0.07743054643  
0.07742095128  
0.07741413257  
0.07740427684  
0.07740286725  
0.0773992951  
0.07739410621  
