468.8816217  
515.6576868  
611.8270526  
813.3383499  
1399.69084  
2654.269457  
8102.684132  
1562.758509  
9400.164262  
3660.137737  
17887.70806  
6697.171166  
2267.46817  
8655.222242  
1764.847354  
22519.06078  
1864.585044  
72084.13521  
21065.20104  
8350.92758  
28403.26533  
17331.26449  
21298.67206  
3227.469638  
4697.885077  
23612.67041  
3637.789172  
117.4690799  
2577.055451  
16478.10412  
8556.014691  
13299.54593  
8946.166841  
21254.27899  
6270.802596  
10864.71308  
341.48882  
818.1557031  
7943.35377  
7245.710167  
1344.970751  
570.2751072  
282.6921233  
417.7168117  
18946.55764  
3215.000148  
6392.17752  
2417.580442  
5485.06996  
7735.424138  
14830.7573  
9607.847033  
2580.639411  
697.8502683  
1257.519616  
5838.813422  
676.8170368  
572.8784415  
91.2071593  
2791.124902  
267.3055817  
531.0509406  
33.88599026  
352.360674  
273.400811  
97.41094248  
658.3121225  
25.77861837  
49.83756467  
89.36668014  
17.62541952  
78.16149952  
25.39041247  
8.381748408  
5.06011481  
0.8004519449  
2.128964204  
1.332702933  
3.171471374  
0.7090536602  
2.526629924  
1.379586007  
0.6750987184  
0.3143406506  
1.709543482  
0.7023941224  
0.5533589723  
0.4242270004  
0.5224626289  
0.554136069  
0.4247293722  
0.5414583254  
0.4472806464  
0.3765204694  
0.3673824024  
0.3741816278  
0.3356192108  
0.3622598333  
0.3284410687  
0.3066842427  
0.3034769213  
0.298776237  
0.28130433  
0.2738797375  
0.2658316088  
0.2582557781  
0.2446372369  
0.2422742751  
0.2330933619  
0.2295779822  
0.223287532  
0.2170318201  
0.2120230908  
0.2074493799  
0.2025958448  
0.1969177726  
0.192807313  
0.1888189646  
0.1846762422  
0.1809599514  
0.1774779614  
0.1737336023  
0.1704560074  
0.1670813067  
0.1640993402  
0.1608856317  
0.1579996038  
0.1551555214  
0.1523916561  
0.1497831104  
0.1472485901  
0.1447228439  
0.1423342672  
0.1400367776  
0.1378086999  
0.1356183139  
0.133508576  
0.1314528576  
0.1294669437  
0.127537224  
0.1256398203  
0.1238116413  
0.122026152  
0.1202910082  
0.1186008004  
0.1169485005  
0.1153444384  
0.113775194  
0.1122467126  
0.1107608342  
0.1093069706  
0.1078874891  
0.1065021401  
0.1051460411  
0.103820128  
0.1025233617  
0.101265441  
0.1000312949  
0.09881439039  
0.09763140915  
0.09647428838  
0.09534080521  
0.09423052904  
0.09314378953  
0.09207801194  
0.09103055134  
0.09001098892  
0.08900988994  
0.08802962995  
0.08706892139  
0.08612317366  
0.08519736065  
0.08428856541  
0.08339778027  
0.08252223775  
0.081665726  
0.08082583994  
0.08000068098  
0.07918680799  
0.07838551138  
0.07760664893  
0.07683910058  
0.07608052552  
0.07533969606  
0.07461056912  
0.0738960505  
0.07318876874  
0.07249391187  
0.0718161486  
0.07114502193  
0.07049387679  
0.06983835193  
0.06920463977  
0.06858230607  
0.06796234666  
0.06735938803  
0.06676005825  
0.06617376755  
0.06559817814  
0.06503067472  
0.06446962155  
0.06391906791  
0.06337926756  
0.06284289527  
0.06231885155  
0.06180156531  
0.0612911997  
0.06079092594  
0.06029556121  
0.05980601627  
0.05932693702  
0.05885441167  
0.05839235071  
0.05793257799  
0.05747757112  
0.05703038713  
0.05659477895  
0.05616275455  
0.05573673644  
0.05531640091  
0.05490067339  
0.05449067336  
0.05408656788  
0.05369139587  
0.05329661683  
0.05291213365  
0.05253127435  
0.05215441075  
0.05178450268  
0.05141672928  
0.05105738051  
0.05070089322  
0.05034885167  
0.05000593487  
0.04966139854  
0.0493265584  
0.04899253366  
0.04866417321  
0.04833844662  
0.04802043291  
0.04770400443  
0.04739398542  
0.0470830395  
0.04678164354  
0.04647827279  
0.0461871648  
0.04589474889  
0.04560628711  
0.04532087907  
0.04503875596  
0.04476304413  
0.0444838554  
0.04421636958  
0.04394421828  
0.04368604765  
0.04342432537  
0.04316666296  
0.04291403117  
0.04266081948  
0.04241378092  
0.04216662  
0.04192480742  
0.04168852122  
0.04144902595  
0.04121432113  
0.04098646221  
0.04075828143  
0.04053126641  
0.04030974499  
0.04008953385  
0.03987052849  
0.03965641236  
0.03944507014  
0.03923564946  
0.03902852901  
0.03882326966  
0.03862146667  
0.03842060355  
0.03822212207  
0.03802699746  
0.03783414795  
0.03764363571  
0.03745731342  
0.03726883015  
0.03708700306  
0.0369016439  
0.03672307707  
0.03654320793  
0.03636810731  
0.03619256004  
0.03602271564  
0.03585051264  
0.03568257645  
0.03551686251  
0.03535001292  
0.03518846222  
0.03502785587  
0.03486882705  
0.03471098531  
0.03455635045  
0.03440338688  
0.03425021427  
0.03409969819  
0.033952602  
0.03380213208  
0.0336596809  
0.0335137845  
0.03337405876  
0.0332325146  
0.03309316781  
0.032958213  
0.03282003674  
0.03268581597  
0.0325527607  
0.03242093275  
0.0322919931  
0.03216316617  
0.03203365627  
0.03191012868  
0.03178552393  
0.03166070288  
0.03153950087  
0.03141844212  
0.03129849822  
0.03118085045  
0.03106560478  
0.0309499954  
0.03083720092  
0.03072310766  
0.03061218835  
0.03050138868  
0.03039206123  
0.03028534659  
0.03017717336  
0.03007093314  
0.02996826066  
0.02986483534  
0.02976512373  
0.02966218171  
0.02956094709  
0.02946027547  
0.02936338246  
0.02926928951  
0.02917236311  
0.02907750986  
0.02898622596  
0.02889134591  
0.02879994655  
0.02870988956  
0.02861979102  
0.02853311614  
0.02844494471  
0.02835624065  
0.02827179352  
0.028189023  
0.02810421935  
0.02802186812  
0.02793874565  
0.02785730585  
0.02777931623  
0.0277012878  
0.02761885885  
0.02754253175  
0.02746675285  
0.02739035179  
0.02731805794  
0.02724169811  
0.02717109668  
0.02709831212  
0.02702735365  
0.02695638102  
0.02688874315  
0.02681853217  
0.02674930554  
0.02668269909  
0.02661455894  
0.02655024589  
0.02648397004  
0.02642123694  
0.02635856307  
0.02629427701  
0.02623167739  
0.02617094281  
0.02611194103  
0.02605021371  
0.02599213458  
0.02593561154  
0.02587688439  
0.02581832329  
0.02576207471  
0.02570785204  
0.02565227314  
0.02559952945  
0.02554563534  
0.02549249829  
0.0254401992  
0.02539197022  
0.02533932341  
0.02528946374  
0.02523983442  
0.02519068805  
0.0251398862  
0.02509584108  
0.02504903436  
0.02500105537  
0.02495619814  
0.0249113054  
0.02486853099  
0.02482268093  
0.02477919921  
0.02473690585  
0.02469614626  
0.0246551302  
0.02461645033  
0.02457382916  
0.02453394301  
0.02449621241  
0.02445696885  
0.02442048628  
0.02438282525  
0.02434516437  
0.02431151351  
0.02427516059  
0.02423972875  
0.02420350064  
0.02417080355  
0.02413719744  
0.02410365322  
0.02407319599  
0.02404204026  
0.02401045762  
0.02397804929  
0.02395011434  
0.02391896274  
0.02389251447  
0.02386348062  
0.02383509475  
0.02380973758  
0.02378219183  
0.02375759155  
0.02372974821  
0.02370445616  
0.02367894526  
0.02365493206  
0.02363130456  
0.02360755125  
0.023585098  
0.02356355469  
0.02354248828  
0.02351794625  
0.02350083935  
0.02348022889  
0.02345998599  
0.02344139551  
0.02342310615  
0.0234047841  
0.02338750687  
0.02336843575  
0.02335360294  
0.02333790588  
0.02332031062  
0.02330538203  
0.02329159436  
0.02327759521  
0.02326315498  
0.02324835793  
0.02323602196  
0.02322496859  
0.02321367647  
0.02320013663  
0.02318792839  
0.02317861478  
0.0231696947  
0.02315943544  
0.0231490138  
0.02314245663  
0.02313507513  
0.02312710415  
0.02311885055  
0.02311048883  
0.02310564223  
0.02309954422  
0.02309467344  
0.02309039623  
0.02308784744  
0.02308182869  
0.02307961255  
0.02307496808  
0.02307196188  
0.02307071364  
0.02306751279  
0.02306635661  
0.02306867925  
0.02306817601  
