3669.052296  
3951.656188  
4495.676579  
5618.791404  
11369.79224  
21468.51836  
24796.42423  
2803.381794  
12609.87272  
2010.88094  
7514.769103  
61212.18626  
11864.38964  
9342.169882  
7619.305056  
12092.16477  
12200.67915  
4650.609364  
20044.85143  
2244.973765  
3695.803154  
38511.25023  
9771.137908  
15050.52384  
6542.76258  
8146.503642  
1641.991105  
782.4778728  
32709.71122  
939.6308426  
5283.299976  
7472.342619  
1666.458614  
1898.132108  
18598.83571  
1075.207437  
3215.372922  
3005.416912  
8313.277197  
18381.26374  
4774.558077  
3517.954876  
3876.116823  
8568.810195  
1560.756339  
2475.740976  
1987.76181  
9317.644887  
2250.372196  
3057.130556  
6291.767149  
251.2170255  
2206.713693  
3086.370527  
584.1992448  
2034.257559  
6.12959301  
122.9429538  
350.1209079  
793.7586647  
116.7772735  
48.20424356  
469.8038754  
580.5958663  
198.2032786  
259.3681484  
27.14858996  
18.66104427  
70.28827326  
45.71545085  
15.04386295  
27.48433394  
23.86918478  
0.1365443628  
2.110743988  
25.37019157  
1.577718446  
9.255322941  
4.088633008  
8.66305665  
7.75872234  
6.447966208  
6.425980868  
6.330413859  
5.433406908  
5.6559359  
4.956363242  
4.708179996  
5.054441505  
4.845050285  
4.411858811  
4.240893661  
3.934512044  
3.657804307  
3.579733163  
3.558227487  
3.372466072  
3.287815063  
3.103018929  
2.99732339  
2.878825688  
2.787624061  
2.719400795  
2.564265518  
2.488340042  
2.419810108  
2.328991436  
2.25470356  
2.189911401  
2.10385149  
2.039348543  
1.979375189  
1.920315606  
1.851243727  
1.798146022  
1.744929964  
1.692485965  
1.643703873  
1.596665401  
1.549285494  
1.504511138  
1.464217753  
1.42362053  
1.384135365  
1.346322016  
1.310215019  
1.275831111  
1.242984203  
1.21093229  
1.179605091  
1.149898732  
1.121174976  
1.093443018  
1.066670382  
1.040708591  
1.015817034  
0.9915939186  
0.9684981548  
0.9461214099  
0.9242789757  
0.9033047021  
0.8830459767  
0.8634212917  
0.8443191695  
0.8259699379  
0.8080711718  
0.7908601388  
0.774123186  
0.7579590945  
0.7422171688  
0.727033986  
0.7122147257  
0.6979347248  
0.6840039759  
0.6705133352  
0.6574047436  
0.6446771772  
0.6323351869  
0.6203242318  
0.6086655247  
0.5973312019  
0.5863099391  
0.5756112372  
0.5651933827  
0.5550469409  
0.5451806133  
0.5355872874  
0.5262451788  
0.5171503658  
0.5082936548  
0.499663519  
0.4912766453  
0.483070829  
0.4751072696  
0.4673207047  
0.4597417742  
0.4523539903  
0.4451431308  
0.4381158596  
0.4312452154  
0.4245534921  
0.4180342609  
0.4116471482  
0.4054274838  
0.3993563016  
0.3934198878  
0.3876255141  
0.3819520996  
0.3764253162  
0.3710277503  
0.3657416328  
0.3605809926  
0.3555060501  
0.3505855403  
0.3457547488  
0.3410486137  
0.3364295893  
0.3318925502  
0.3274838301  
0.3231487563  
0.3189168077  
0.3147829431  
0.3107284333  
0.3067544228  
0.3028721082  
0.2990587136  
0.2953343091  
0.29168148  
0.2880916781  
0.2845977181  
0.2811633208  
0.2777842579  
0.2744787828  
0.2712377658  
0.2680749869  
0.2649642194  
0.2619080531  
0.2589083  
0.2559882929  
0.2531062435  
0.2502765416  
0.2475213749  
0.2447916371  
0.2421202345  
0.2395081989  
0.2369515119  
0.2344116023  
0.2319394338  
0.2295059029  
0.2271229318  
0.2247722001  
0.2224795287  
0.2202155244  
0.2179866127  
0.215806293  
0.2136518832  
0.2115532262  
0.2094930667  
0.2074581758  
0.2054540097  
0.2034900683  
0.2015523972  
0.199650005  
0.1977830383  
0.1959631215  
0.1941600659  
0.1923726439  
0.1906329372  
0.1889175022  
0.1872276834  
0.1855676877  
0.1839336162  
0.1823359742  
0.1807468375  
0.1791956727  
0.1776643636  
0.1761598088  
0.1746749709  
0.1732123278  
0.1717742408  
0.1703496609  
0.1689688129  
0.1675921531  
0.1662483683  
0.1649256488  
0.1636179784  
0.1623344887  
0.1610511933  
0.1598085083  
0.1585733783  
0.1573634105  
0.1561662019  
0.1549937679  
0.1538496048  
0.1526963902  
0.1515760724  
0.1504576174  
0.1493705043  
0.1482853331  
0.1472325481  
0.1461925987  
0.1451673141  
0.1441552427  
0.1431486535  
0.1421640417  
0.1411891351  
0.1402311953  
0.1392873549  
0.1383497642  
0.137443448  
0.1365299632  
0.1356298129  
0.1347560585  
0.1338905115  
0.1330327592  
0.1321834877  
0.1313606533  
0.1305339567  
0.1297310108  
0.1289283366  
0.1281459283  
0.1273683147  
0.1265898007  
0.1258409087  
0.1250905471  
0.1243566689  
0.1236355497  
0.1229153807  
0.1222153487  
0.1215145403  
0.12082858  
0.1201451529  
0.1194735451  
0.1188127641  
0.1181558656  
0.1175188843  
0.1168759433  
0.1162610634  
0.1156365777  
0.1150262588  
0.1144239139  
0.1138196503  
0.1132491343  
0.1126605852  
0.1120851567  
0.1115171231  
0.1109594617  
0.1104111944  
0.1098666287  
0.1093359849  
0.1088059938  
0.1082770823  
0.1077671663  
0.1072544258  
0.1067404554  
0.1062503385  
0.1057712602  
0.1052821615  
0.1047952694  
0.1043379508  
0.1038589528  
0.1034018233  
0.1029536348  
0.1024959535  
0.1020618963  
0.1016164714  
0.1011782818  
0.1007626563  
0.1003363873  
0.09992847816  
0.09951572839  
0.09910123592  
0.09870764985  
0.09831477152  
0.09792914624  
0.09753407519  
0.09715927147  
0.09678029552  
0.09640704178  
0.09604058652  
0.0956843898  
0.09532515955  
0.09497353716  
0.09462481169  
0.09428389131  
0.0939446096  
0.09360721127  
0.09328185178  
0.09295104633  
0.0926360659  
0.09231105425  
0.09199008069  
0.0916824482  
0.0913849881  
0.09108349843  
0.0907783336  
0.09048881068  
0.09019509625  
0.0899091533  
0.08962556951  
0.08935195002  
0.08907386319  
0.08879377409  
0.08854614381  
0.08826496693  
0.08799957054  
0.08774481689  
0.08749186261  
0.08723872403  
0.08698557331  
0.08675207222  
0.08650755349  
0.08627327499  
0.08603717669  
0.08580549172  
0.08557198392  
0.08535601863  
0.08512669395  
0.08491086263  
0.08469415062  
0.08448104065  
0.0842715924  
0.08406891732  
0.08385833688  
0.08366384925  
0.08346246576  
0.08326638055  
0.08307689487  
0.0828836339  
0.08269976608  
0.0825152277  
0.08233318781  
0.08216090523  
0.08197955771  
0.08181288227  
0.0816400372  
0.081471497  
0.08130781873  
0.08114252909  
0.08097670339  
0.08082975758  
0.08067201253  
0.0805169083  
0.08036991745  
0.08023045  
0.08007875984  
0.07993398611  
0.07979968623  
0.07965750299  
0.07952102791  
0.07939156045  
0.07926095069  
0.07913277699  
0.07900959464  
0.07888248137  
0.07876470049  
0.07864642412  
0.07853068296  
0.07841814399  
0.07830880364  
0.07819495236  
0.07808563903  
0.07798736032  
0.0778789028  
0.07777736776  
0.0776859651  
0.07758480908  
0.07749641418  
0.07739976437  
0.07731208922  
0.07722670282  
0.07713622149  
0.07705699642  
0.07697440788  
0.07690247794  
0.0768212675  
0.0767439855  
0.07668264199  
0.07660430746  
0.07653559157  
0.07647074146  
0.07640474515  
0.07634580488  
0.07628756986  
0.07622110745  
0.07616503095  
0.07611172109  
0.07606307593  
0.0760202128  
0.0759609172  
0.07592038263  
0.07587092073  
0.07583758069  
0.07579371734  
0.07575618613  
0.07571328274  
0.07568182575  
0.07565433457  
0.07562056965  
0.07558928114  
0.07556150061  
0.07553869014  
0.07552533209  
0.07550487123  
0.07548642625  
0.07546361352  
0.07544240206  
0.07543790085  
0.07542673814  
0.07541095355  
0.07541338711  
0.07540563299  
0.07540783954  
0.0754166711  
