0.006092051974  
-0.4157801291  
-0.8179418988  
-1.181139007  
-1.488887773  
-1.728746086  
-1.893254301  
-1.980447965  
-1.993877349  
-1.942127487  
-1.837869485  
-1.696532254  
-1.534729142  
-1.368603588  
-1.212249623  
-1.076424636  
-0.9676587218  
-0.8878978661  
-0.8347181572  
-0.8020739283  
-0.7815074472  
-0.7636338622  
-0.7397240251  
-0.703153705  
-0.6505125857  
-0.5822157376  
-0.5025124572  
-0.4188926592  
-0.3409499873  
-0.2788834123  
-0.2418287143  
-0.2362840423  
-0.2648610784  
-0.325562853  
-0.4117108685  
-0.5125584526  
-0.614513286  
-0.7028309777  
-0.7635312344  
-0.7852935718  
-0.761058412  
-0.6891059541  
-0.5734663856  
-0.4235743254  
-0.2532158036  
-0.07889648446  
0.08217433317  
0.2142082205  
0.3048200653  
0.3465849092  
0.3380116769  
0.2837891106  
0.1942887948  
0.0844151848  
-0.028095638  
-0.1246549759  
-0.18790593  
-0.2036340002  
-0.1623277523  
-0.06021781003  
0.1002893333  
0.3107980303  
0.5576974094  
0.823418357  
1.088031813  
1.331027351  
1.533114062  
1.677867246  
1.753096131  
1.751834496  
1.672871786  
1.520811522  
1.305669354  
1.042046046  
0.7479502487  
0.443377736  
0.1487211474  
-0.116844092  
-0.3369032251  
-0.4991548265  
-0.5964492136  
-0.6274412054  
-0.5967439004  
-0.5145668155  
-0.3957998509  
-0.25861343  
-0.1226476441  
-0.006966757404  
0.0720301831  
0.1024973762  
0.07860717452  
0.001370929864  
-0.1213231703  
-0.2755252812  
-0.4428107631  
-0.6025133763  
-0.7342985374  
-0.8207721461  
-0.8497709261  
-0.8159854695  
-0.7217001176  
-0.5765077881  
-0.3960337128  
-0.1998266045  
-0.008728864124  
0.1579223386  
0.2848360877  
0.3626981867  
0.3892167603  
0.3691282883  
0.3131900602  
0.2363272917  
0.155221775  
0.08573377183  
0.04054764413  
0.02740712018  
0.04821414839  
0.09910660713  
0.1715092507  
0.2539492745  
0.334347359  
0.4023810624  
0.4515217088  
0.480400678  
0.4932310978  
0.4992120709  
0.5109937461  
0.5424051679  
0.6058494706  
0.7097569098  
0.8565465546  
1.041437131  
1.252326696  
1.470798487  
1.674119109  
1.837947739  
1.939345294  
1.959668841  
1.88691242  
1.717197062  
1.455226739  
1.113698209  
0.7118164995  
0.2731919117  
-0.1765702444  
-0.6122186251  
-1.010851946  
-1.353397775  
-1.625461651  
-1.817601088  
-1.92516175  
-1.947819738  
-1.889053581  
-1.755639343  
-1.557280738  
-1.306339033  
-1.017601178  
-0.7079642188  
-0.395918175  
-0.1007175225  
0.1587700139  
0.3654998827  
0.5058385239  
0.5710912077  
0.5587462326  
0.4731891848  
0.3257108106  
0.1336941541  
-0.08098601208  
-0.2942341035  
-0.4824135395  
-0.6250966626  
-0.7075079292  
-0.7223236234  
-0.6705209859  
-0.5611428347  
-0.4099769498  
-0.2373050104  
-0.06506977774  
0.08617394144  
0.200039758  
0.2664109784  
0.2825621296  
0.2531255482  
0.1889481485  
0.1050153297  
0.01781067877  
-0.05745840808  
-0.1093231678  
-0.1318212822  
-0.1252931112  
-0.09613301226  
-0.05555727279  
-0.01764365254  
0.003015277508  
-0.006352321944  
-0.05474885604  
-0.146115734  
-0.2788769567  
-0.4463033788  
-0.6375705081  
-0.8392906586  
-1.03719551  
-1.217723133  
-1.369250783  
-1.482852462  
-1.552540285  
-1.575068463  
-1.549453169  
-1.47636933  
-1.357630579  
-1.195861518  
-0.9944400458  
-0.7576859499  
-0.4912183074  
-0.2023323856  
0.09975130012  
0.4039021092  
0.6974582751  
0.9669754298  
1.199305551  
1.382861296  
1.508911508  
1.572682752  
1.574103136  
1.518027503  
1.413900194  
1.274836805  
1.116247777  
0.9541801503  
0.8035820668  
0.6767249039  
0.5820026151  
0.5232532338  
0.4996831436  
0.5063933082  
0.5353962479  
0.576997146  
0.6212989891  
0.6596509749  
0.6858199128  
0.6967375283  
0.6927315882  
0.6772273062  
0.6559683053  
0.6359018444  
0.6238839898  
0.6254066891  
0.6435561464  
0.6783189743  
0.7263782587  
0.7814015061  
0.8347811527  
0.8767358848  
0.8975939998  
0.8891210662  
0.8456851183  
0.7651445159  
0.6493327411  
0.5041012266  
0.338898085  
0.1659348597  
-0.000977795793  
-0.147827317  
-0.2618782507  
-0.3331009363  
-0.3553968631  
-0.327475643  
-0.2532800064  
-0.1418623406  
-0.006693446798  
0.1355748353  
0.2667806908  
0.3692180646  
0.4276638857  
0.431245573  
0.3749097358  
0.2602793288  
0.09578909811  
-0.1039860965  
-0.319739897  
-0.5294390014  
-0.7107298627  
-0.8434458742  
-0.911952365  
-0.907035047  
-0.8271209861  
-0.678678664  
-0.4757237988  
-0.2384908099  
0.008621493427  
0.2396013622  
0.4296030112  
0.5576625431  
0.6090227906  
0.5768241765  
0.4629280737  
0.2777758227  
0.03925905186  
-0.2292764732  
-0.5017061821  
-0.752148855  
-0.9580079099  
-1.10263726  
-1.177310471  
-1.182238899  
-1.126487971  
-1.026807616  
-0.9055015686  
-0.7876096748  
-0.6977523044  
-0.6570390338  
-0.6804134938  
-0.7747841183  
-0.9381335249  
-1.159721959  
-1.421315463  
-1.69927812  
-1.967216038  
-2.198859252  
-2.370807572  
-2.464814377  
-2.469397694  
-2.380622149  
-2.202046517  
-1.943933213  
-1.621882588  
-1.255115793  
-0.8646331563  
-0.4714490534  
-0.09505470978  
0.2477823641  
0.5438541314  
0.7839822754  
0.9631572203  
1.080405558  
1.138436712  
1.143119249  
1.102834963  
1.027746121  
0.9289986637  
0.8179233259  
0.7052535303  
0.6004271787  
0.5110092603  
0.4423090587  
0.3972269207  
0.3763431858  
0.3782729753  
0.4002404672  
0.438810434  
0.490682407  
0.5534336811  
0.62609421  
0.7094515887  
0.8060066537  
0.919563932  
1.054481604  
1.214677707  
1.402516343  
1.617755404  
1.856709672  
2.111804922  
2.371610884  
2.621418832  
2.844320925  
3.022703687  
3.139987685  
3.182414115  
3.140655257  
3.011050558  
2.796287631  
2.505456617  
2.153426229  
1.75960528  
1.346241119  
0.9364014274  
0.5518881509  
0.2112970703  
-0.07156853808  
-0.2887673086  
-0.4386548048  
-0.5256675379  
-0.5594624954  
-0.5535361063  
-0.5234851982  
-0.4850923046  
-0.4524903813  
-0.4366073115  
-0.4440716526  
-0.4767309335  
-0.5318086481  
-0.6026745946  
-0.6801218994  
-0.7539472768  
-0.8146060386  
-0.8547277287  
-0.8702627593  
-0.8611107501  
-0.8311845454  
-0.7879057097  
-0.7412331409  
-0.7023878985  
-0.6824572003  
-0.6910470093  
-0.7351462455  
-0.8183107304  
-0.9401839819  
-1.096409063  
-1.278822788  
-1.475934638  
-1.673610125  
-1.855901878  
-2.00603369  
-2.107501705  
-2.145290112  
-2.107178774  
-1.985080902  
-1.776311183  
-1.484646984  
-1.12100139  
-0.7035370878  
-0.2570643426  
0.1883547098  
0.5996087519  
0.9433880825  
1.189453652  
1.313962912  
1.302442629  
1.151980098  
0.8722606157  
0.4852404046  
0.02335214381  
-0.4735880836  
-0.9624639388  
-1.401423367  
-1.754348477  
-1.994618029  
-2.107670562  
-2.09200608  
-1.958520259  
-1.728299229  
-1.429237756  
-1.092017229  
-0.7460680693  
-0.4160935145  
-0.1196504153  
0.1339436708  
0.3433217212  
0.5135762964  
0.6539393951  
0.7750892056  
0.8865931976  
0.9949034265  
1.102206473  
1.206248946  
1.301055414  
1.378358748  
1.429383684  
1.446670802  
1.425558994  
1.365136305  
1.268494903  
1.142304327  
0.9958532621  
0.8397120828  
0.6843288677  
0.5387483196  
0.4096818231  
0.3010388549  
0.2139408401  
0.1471719828  
0.09793989448  
0.0627836281  
0.03844128024  
0.02253959541  
0.01398078747  
0.01297131353  
0.02070723338  
0.03879440227  
0.06851291478  
0.1100746963  
0.1620474289  
0.2210414712  
0.2817802936  
0.3375545893  
0.3810340847  
0.4053128845  
0.4050348119  
0.3774163471  
0.3229617886  
0.2457572069  
0.1532219487  
0.05535902222  
-0.03644111125  
-0.1108519554  
-0.1581170523  
-0.1713592152  
-0.1474940005  
-0.08759429233  
0.003356976396  
0.1172800599  
0.244247517  
0.3739499773  
0.4971350777  
0.6067847515  
0.6988292415  
0.772312131  
0.8289877645  
0.8724639047  
0.9070794958  
0.9367313335  
0.963906608  
0.9890761715  
1.010597614  
1.025092076  
1.028232393  
1.015744762  
0.9844325873  
0.9329715117  
0.8623302997  
0.7757169075  
0.6780515009  
0.5750783696  
0.4722935541  
0.3739024498  
0.2820145489  
0.1962554606  
0.113844604  
0.03016306087  
-0.06032262703  
-0.1629397894  
-0.2817020042  
-0.4184178192  
-0.5721504399  
-0.7391304922  
-0.9130937875  
-1.085967897  
-1.248775084  
-1.392579013  
-1.509347576  
-1.592594183  
-1.637797944  
-1.642558544  
-1.606580692  
-1.531547805  
-1.420956495  
-1.279978548  
-1.11531684  
-0.9350648513  
-0.7484735074  
-0.5655544987  
-0.3964863484  
-0.2508014233  
-0.136395285  
-0.05851137757  
-0.01882503256  
-0.0148595979  
-0.03988866897  
-0.08346226565  
-0.1325729089  
-0.1733980104  
-0.1933917267  
-0.1834605862  
-0.1398332203  
-0.06531455128  
0.03039694732  
0.1314641176  
0.2177471665  
0.2675399131  
0.2608550645  
0.1828062834  
0.02655484327  
-0.2046478666  
-0.4967128811  
-0.8254604686  
-1.158835662  
-1.460381141  
-1.693509739  
-1.82603892  
-1.834350931  
-1.706605288  
-1.444567097  
-1.063755062  
-0.5919030861  
-0.06590919059  
0.4723014345  
0.9804775825  
1.420689194  
1.763306452  
1.989847651  
2.094354605  
2.083181971  
1.973297673  
1.789408168  
1.560335428  
1.315195912  
1.079884044  
0.8743419708  
0.7109210082  
0.5939651148  
0.5205885375  
0.4823980373  
0.4678273845  
0.46464336  
0.4622077512  
0.4531523738  
0.4342283125  
0.4062684172  
0.3733475439  
0.3413560838  
0.3163031525  
0.3026845499  
0.3022267111  
0.3132317888  
0.3306295144  
0.3467189938  
0.3524575484  
0.3390744998  
0.2997147823  
0.2308596042  
0.1332719484  
0.01231263724  
-0.1224033796  
-0.257992858  
-0.3797791715  
-0.4730638558  
-0.524947479  
-0.5259887498  
-0.4714715648  
-0.3621595603  
-0.2044381794  
-0.009850701332  
0.2059076187  
0.4244048853  
0.6261610411  
0.7924052106  
0.9067451239  
0.9566043078  
0.9343155258  
0.8377817986  
0.6707080703  
0.4423739595  
0.1669879012  
-0.1373239117  
-0.4498475994  
-0.7488486079  
-1.013289999  
-1.224582123  
-1.368241358  
-1.43529433  
-1.423275058  
-1.336640782  
-1.186525185  
-0.989733417  
-0.7670458031  
-0.5409387383  
-0.3329641496  
-0.1611042515  
-0.0374398058  
0.03350110708  
0.05543291087  
0.03986977584  
0.004546102384  
-0.02915175536  
-0.0394080009  
-0.007410547112  
0.07953351048  
0.2256701404  
0.4256753807  
0.6649413011  
0.9212967539  
1.167930726  
1.377109906  
1.524159566  
1.591057042  
1.56913891  
1.460443482  
1.277502692  
1.041588348  
0.7796711968  
0.5205557439  
0.2907766187  
0.110881433  
-0.00734776124  
-0.06230604513  
-0.06242994952  
-0.02453804222  
0.02905329766  
0.07419081832  
0.08873876732  
0.0560269348  
-0.03263660441  
-0.1767505608  
-0.3668710258  
-0.5862522153  
-0.8135846098  
-1.0263832  
-1.204465742  
-1.332981253  
-1.404504419  
-1.41991994  
-1.387955191  
-1.323499038  
-1.245000857  
-1.171374757  
-1.11894206  
-1.098865079  
-1.115478059  
-1.165742831  
-1.239882086  
-1.323042932  
-1.397696219  
-1.446390459  
-1.454394545  
-1.411846385  
-1.315094463  
-1.16705062  
-0.9765543718  
-0.7568639274  
-0.5235731549  
-0.2922517148  
-0.07622720591  
0.115188459  
0.2777545306  
0.4124861776  
0.5249849223  
0.6240170378  
0.7195981785  
0.8208797226  
0.9341919642  
1.061566422  
1.199969591  
1.341409855  
1.473913671  
1.583239615  
1.65509554  
1.67751873  
1.643037357  
1.550294851  
1.404811532  
1.218764624  
1.009749178  
0.7986774994  
0.6070971284  
0.454316583  
0.3547648763  
0.3159939573  
0.3376413496  
0.4115142608  
0.5228290672  
0.6523748922  
0.7793267677  
0.8842267687  
0.9516961256  
0.9724382302  
0.9442371146  
0.8718045827  
0.7655291495  
0.6393710256  
0.5082709708  
0.3855471638  
0.280714877  
0.1981271395  
0.1366560838  
0.09044530242  
0.0506020523  
0.007485358279  
-0.04682552192  
-0.116366081  
-0.1998442361  
-0.2902201075  
-0.3754231689  
-0.4401303777  
-0.4683372794  
-0.4462654452  
-0.3651419305  
-0.2233205278  
-0.02737424551  
0.2081007697  
0.4619679056  
0.7091301536  
0.9238267654  
1.083123971  
1.170043845  
1.175854811  
1.101117278  
0.955376462  
0.755520875  
0.5231233843  
0.2811885911  
0.05085549815  
-0.1514189422  
-0.3157508892  
-0.4395355889  
-0.5268929707  
-0.5870145212  
-0.6317436861  
-0.6728415621  
-0.7194294159  
-0.7760588265  
-0.8417394254  
-0.9100618084  
-0.9704081593  
-1.009991004  
-1.016395244  
-0.9801518448  
-0.8969004751  
-0.768777916  
-0.604749308  
-0.4198208149  
-0.2332324536  
-0.06589488898  
0.06252740163  
0.1364404124  
0.1465937804  
0.09145731503  
-0.02254107458  
-0.1819205784  
-0.3680881734  
-0.5599720915  
-0.7369647735  
-0.8816825696  
-0.9821563387  
-1.033115567  
-1.036205872  
-0.999182076  
-0.9342189471  
-0.855694324  
-0.7777957136  
-0.7123495774  
-0.6671916261  
-0.6452788252  
-0.6446178763  
-0.6589307875  
-0.6788888495  
-0.6936415016  
-0.6923998842  
-0.6658142789  
-0.6070042181  
-0.512159167  
-0.3807260491  
-0.2152616333  
-0.02107834041  
0.1942018432  
0.4211094206  
0.648747305  
0.865202384  
1.057991999  
1.21461225  
1.323266596  
1.373760346  
1.358550164  
1.273822216  
1.120451753  
0.9046704754  
0.6382628303  
0.338167716  
0.02544803751  
-0.2763491335  
-0.5432896564  
-0.7533896437  
-0.8889438252  
-0.9385420339  
-0.8985205829  
-0.7736615755  
-0.5770091484  
-0.328804539  
-0.05461947602  
0.2171223288  
0.4579699536  
0.6423414542  
0.7501537558  
0.7689254314  
0.6951100058  
0.5345341093  
0.3018660951  
0.01919226642  
-0.2861561451  
-0.5843145589  
-0.8458318303  
-1.044579228  
-1.160292421  
-1.180522188  
-1.101765376  
-0.9296837656  
-0.6783756618  
-0.3687700647  
-0.02631385294  
0.3218136925  
0.6496485274  
0.9352387672  
1.162967098  
1.325121018  
1.422512737  
1.464058265  
1.46534625  
1.446356368  
1.428591729  
1.431994285  
1.472031168  
1.55733594  
1.688254375  
1.856493483  
2.045952479  
2.234673972  
2.397646905  
2.510113279  
2.550924909  
2.505464567  
2.367721565  
2.14119159  
1.838453994  
1.479464538  
1.088797929  
0.692237971  
0.3132439716  
-0.03018762006  
-0.3277360491  
-0.5777169149  
-0.7865938707  
-0.9671252945  
-1.135418321  
-1.30738029  
-1.495131647  
-1.703996943  
-1.930597275  
-2.162391391  
-2.378806863  
-2.553828057  
-2.659671595  
-2.671026305  
-2.569179151  
-2.345428764  
-2.003212144  
-1.558633496  
-1.039278256  
-0.4814768217  
0.07359791537  
0.5844375439  
1.01369214  
1.332036554  
1.520912132  
1.573862263  
1.496334021  
1.304123768  
1.020763341  
0.6742995625  
0.2939528243  
-0.09287926455  
-0.462931841  
-0.7984750725  
-1.08776179  
-1.324627302  
-1.507448088  
-1.637742016  
-1.71871749  
-1.754014614  
-1.746839274  
-1.699555888  
-1.613763722  
-1.490736548  
-1.332089113  
-1.140495796  
-0.9202876548  
-0.6777948286  
-0.4213585815  
-0.160990315  
0.092283338  
0.3273030528  
0.5337672031  
0.7032130608  
0.8298522817  
0.911183787  
0.9482816667  
0.9457462263  
0.9112872589  
0.8549919291  
0.7883300818  
0.7229939169  
0.6697134838  
0.6371479217  
0.6310245933  
0.6536194463  
0.7036426009  
0.7765774346  
0.8654016592  
0.96161647  
