0.03528500767  
-0.05481171761  
-0.1313108524  
-0.1835561665  
-0.2016754554  
-0.1770142322  
-0.1027697761  
0.02523706055  
0.2077572779  
0.4414359518  
0.7184420739  
1.026549225  
1.349759988  
1.669472902  
1.966092864  
2.220911471  
2.417997446  
2.545841055  
2.598495679  
2.5760508  
2.484350005  
2.333997801  
2.138812522  
1.913952084  
1.674008184  
1.431350206  
1.194949941  
0.9698381153  
0.7572334975  
0.5552761439  
0.3601932522  
0.16768446  
-0.02572966262  
-0.2216171717  
-0.4189827266  
-0.6141294572  
-0.8010514266  
-0.9722628835  
-1.119909137  
-1.236967912  
-1.318327039  
-1.361570082  
-1.367317241  
-1.339079962  
-1.282634011  
-1.205017311  
-1.113314927  
-1.013420648  
-0.9090047948  
-0.8008682252  
-0.6868105513  
-0.5620863718  
-0.4203977304  
-0.2553095284  
-0.0618794481  
0.1617525926  
0.4130693691  
0.684429203  
0.9630271153  
1.23165821  
1.47023127  
1.657901847  
1.775555206  
1.808338027  
1.747868737  
1.593809357  
1.354536161  
1.046754725  
0.6940600632  
0.3245649339  
-0.03210464644  
-0.3480883834  
-0.6004079131  
-0.773489346  
-0.8607610898  
-0.8650862165  
-0.7979827625  
-0.6777307371  
-0.5266488868  
-0.3679332513  
-0.2224990101  
-0.1062936135  
-0.02843507114  
0.009571936796  
0.01345238249  
-0.00528616348  
-0.03163576781  
-0.04983298671  
-0.04615130787  
-0.0113263135  
0.05775830576  
0.1573608052  
0.2772405666  
0.4020363336  
0.5134372186  
0.5928207361  
0.6239563473  
0.5953741263  
0.5020376747  
0.3461069785  
0.1366772576  
-0.1114308916  
-0.3796142974  
-0.6478672222  
-0.897217909  
-1.111872241  
-1.280776357  
-1.398398729  
-1.464692571  
-1.484292791  
-1.46514533  
-1.416831781  
-1.348863544  
-1.269245363  
-1.183494542  
-1.094264295  
-1.001555732  
-0.9034569631  
-0.7972150691  
-0.6804256519  
-0.552098801  
-0.4134184235  
-0.2680334288  
-0.1218582685  
0.01759051133  
0.1422006325  
0.2444295814  
0.318447986  
0.3610582001  
0.3722564653  
0.3553503529  
0.3166059203  
0.2644969436  
0.2086469426  
0.158636001  
0.1228152878  
0.1072933837  
0.1152269774  
0.1464713118  
0.1976377711  
0.2625215912  
0.3328288003  
0.3991191844  
0.451828541  
0.4822901416  
0.4836280824  
0.4514599859  
0.3843336085  
0.2838794008  
0.1546490066  
0.003666549206  
-0.1602672859  
-0.3274517119  
-0.4882475005  
-0.6340060782  
-0.7578678251  
-0.855304336  
-0.9243562814  
-0.9655247152  
-0.9813408249  
-0.9756950172  
-0.9530358391  
-0.9175758005  
-0.8726320897  
-0.8202100731  
-0.7608843903  
-0.6939867688  
-0.6180451112  
-0.5313822215  
-0.4327458604  
-0.3218563738  
-0.1997544054  
-0.06888003291  
0.06712366581  
0.2038689488  
0.3368403337  
0.4620694324  
0.5767211698  
0.6794884218  
0.7706814653  
0.851997985  
0.9259745386  
0.9952281527  
1.061598033  
1.125382472  
1.18481367  
1.235923292  
1.272853217  
1.288617257  
1.276203518  
1.229847338  
1.146260166  
1.025573616  
0.8718143873  
0.6927875225  
0.4993641277  
0.3042534654  
0.1204716275  
-0.04025849247  
-0.1688819233  
-0.2599516841  
-0.311952745  
-0.3269816114  
-0.3098430615  
-0.2667511432  
-0.2038785798  
-0.1260438654  
-0.03577661449  
0.06704481298  
0.1849185996  
0.3218495596  
0.4820406898  
0.6683903197  
0.8810763315  
1.11649696  
1.366770778  
1.619912792  
1.860674479  
2.071918516  
2.236320319  
2.338126246  
2.364701651  
2.307657285  
2.163420015  
1.93322593  
1.622634025  
1.240711522  
0.799128798  
0.3113477371  
-0.2079218057  
-0.7429484456  
-1.276929837  
-1.79181193  
-2.268190756  
-2.685528497  
-3.022861895  
-3.260105332  
-3.379896901  
-3.369805521  
-3.224584576  
-2.94808417  
-2.554425948  
-2.068101896  
-1.522803441  
-0.9589810201  
-0.420308271  
0.05055618315  
0.4164005636  
0.649503728  
0.7347665839  
0.6714761154  
0.4734663572  
0.1676289099  
-0.209041459  
-0.6134956988  
-1.001270503  
-1.331153692  
-1.569332158  
-1.692550068  
-1.689976294  
-1.563618682  
-1.327340094  
-1.004672326  
-0.6257626703  
-0.2238657189  
0.1681837524  
0.5211257905  
0.8117315569  
1.024359889  
1.151538022  
1.193603061  
1.157568485  
1.055441848  
0.9022507652  
0.7140749886  
0.5062992548  
0.2923010271  
0.08266290832  
-0.1150474922  
-0.295983393  
-0.4573379373  
-0.5974453201  
-0.7148606935  
-0.8076094572  
-0.8727698031  
-0.9064733116  
-0.9043466976  
-0.8623208544  
-0.7776692268  
-0.6500718435  
-0.482500069  
-0.2817183442  
-0.0582593432  
0.1741708696  
0.3998403949  
0.6025322246  
0.7673058449  
0.8821898135  
0.9395865709  
0.9371618768  
0.8780823939  
0.7705647876  
0.6267931748  
0.4613602334  
0.2894600878  
0.1250782425  
-0.02055911074  
-0.1400599038  
-0.2303286098  
-0.292357959  
-0.3304061307  
-0.3506940414  
-0.359846041  
-0.3633355265  
-0.3642117926  
-0.3623276291  
-0.3542349154  
-0.3337949069  
-0.2934333693  
-0.2258569619  
-0.1259558784  
0.007443322807  
0.1702931193  
0.3527844523  
0.5397271156  
0.7118619746  
0.8479980017  
0.9276838214  
0.9340652477  
0.8564784411  
0.6923948088  
0.4483794294  
0.1399093836  
-0.20996614  
-0.5729331887  
-0.9183601964  
-1.216472417  
-1.441300319  
-1.573033043  
-1.599482029  
-1.516557687  
-1.327808849  
-1.043206186  
-0.6774801057  
-0.2483259866  
0.225196521  
0.7238644541  
1.228976508  
1.722538295  
2.187089347  
2.605382925  
2.960166201  
3.234278319  
3.411218229  
3.476229499  
3.417822753  
3.229540599  
2.911691676  
2.472725337  
1.929946203  
1.309321618  
0.6442587411  
-0.02663144355  
-0.6626036309  
-1.224375933  
-1.677839466  
-1.997423743  
-2.168685649  
-2.189780349  
-2.071598781  
-1.836545127  
-1.516084813  
-1.147365944  
-0.7693222563  
-0.418721284  
-0.1266169716  
0.08440963299  
0.2019441586  
0.2242356782  
0.1595257357  
0.02435131045  
-0.1589044309  
-0.3648812752  
-0.568182252  
-0.7460465517  
-0.8804760229  
-0.9596345847  
-0.9784251322  
-0.938258858  
-0.8461326397  
-0.7132014858  
-0.5530653551  
-0.3800208291  
-0.2074963522  
-0.04683681934  
0.09345497393  
0.2079853897  
0.2943065852  
0.3523972426  
0.3839458263  
0.3915649176  
0.3780759645  
0.3459632421  
0.2970461997  
0.2323923264  
0.1524229449  
0.05716459125  
-0.05342844199  
-0.1791464873  
-0.3192368146  
-0.4721778416  
-0.6355094775  
-0.8057064519  
-0.9780660969  
-1.146608906  
-1.304008991  
-1.441595526  
-1.549497084  
-1.617000498  
-1.63317872  
-1.587822564  
-1.47261877  
-1.282500193  
-1.016988316  
-0.6813291322  
-0.2872080124  
0.1471554039  
0.5976678589  
1.035829066  
1.430921018  
1.752763356  
1.974738328  
2.076745716  
2.047720156  
1.887365423  
1.606833898  
1.228203339  
0.7827335486  
0.3080345856  
-0.1555757651  
-0.5691527347  
-0.8991930053  
-1.121227634  
-1.222520836  
-1.203541065  
-1.078001082  
-0.8714233739  
-0.6183552842  
-0.3585131236  
-0.1322677154  
0.02402907898  
0.08234859602  
0.02641507053  
-0.1461480436  
-0.4232310583  
-0.7793026777  
-1.178022447  
-1.576130595  
-1.928158367  
-2.19144543  
-2.33086734  
-2.322750195  
-2.157524963  
-1.840825725  
-1.392934579  
-0.846648623  
-0.2438331235  
0.3689253476  
0.945066391  
1.442672014  
1.828428589  
2.080533827  
2.190244956  
2.161957541  
2.011868951  
1.765454443  
1.454109589  
1.111418043  
0.7695061293  
0.4559393239  
0.1914930728  
-0.01098647713  
-0.1465955512  
-0.2173749127  
-0.2305738957  
-0.1965173174  
-0.1264676139  
-0.03082285225  
0.08207514863  
0.2064071187  
0.3386424341  
0.4767448607  
0.6190865037  
0.7633748393  
0.9058536796  
1.041011585  
1.161863041  
1.26077557  
1.330668109  
1.366328759  
1.365577305  
1.329985904  
1.265000692  
1.179380058  
1.084018614  
0.9903347544  
0.9084959624  
0.8457855904  
0.8053953782  
0.7858653963  
0.781270264  
0.7821399139  
0.7769651253  
0.7540518745  
0.7034372794  
0.6185574938  
0.4974238074  
0.3431344695  
0.1636489539  
-0.02911867838  
-0.2207451118  
-0.3960753708  
-0.5410665651  
-0.6444608253  
-0.6990877481  
-0.7026394828  
-0.6578686668  
-0.5722147693  
-0.4569437822  
-0.3259270389  
-0.1942167575  
-0.07656826097  
0.01393794789  
0.06706527947  
0.07628799459  
0.03930452314  
-0.04182981856  
-0.1609520922  
-0.3084009276  
-0.4719403582  
-0.6379353029  
-0.7926717758  
-0.9237347745  
-1.021290527  
-1.079159005  
-1.095538109  
-1.073298342  
-1.019785816  
-0.9461236732  
-0.8660934936  
-0.7946860346  
-0.746481341  
-0.7340354008  
-0.7664498203  
-0.8482854402  
-0.9789294728  
-1.152490458  
-1.358216336  
-1.581394806  
-1.804625959  
-2.009336926  
-2.177388091  
-2.292623429  
-2.342223909  
-2.31775297  
-2.215829902  
-2.038360958  
-1.792347036  
-1.489274733  
-1.144157127  
-0.7743111709  
-0.3979813885  
-0.03293877163  
0.3048102385  
0.6020862216  
0.8492624038  
1.040595385  
1.174156105  
1.251383953  
1.276376452  
1.255021297  
1.19412535  
1.100664551  
0.981263881  
0.8419543403  
0.688206281  
0.5251702561  
0.3580259967  
0.1923039455  
0.03405547397  
-0.1102247406  
-0.2339616837  
-0.3311331733  
-0.3970712943  
-0.4292824775  
-0.4281092746  
-0.3970545113  
-0.3426294963  
-0.2736633598  
-0.200119432  
-0.1315495774  
-0.07541996746  
-0.03559523224  
-0.0112706556  
0.003402355243  
0.01884719385  
0.04873303538  
0.1079130904  
0.2099098367  
0.3643026053  
0.5744480105  
0.8359206697  
1.135997996  
1.454338024  
1.764847952  
2.038540889  
2.247012444  
2.366065899  
2.378975358  
2.278910808  
2.070160418  
1.767979484  
1.397066475  
0.9888737784  
0.5781359436  
0.199075124  
-0.1182071404  
-0.3507103803  
-0.4845417244  
-0.5157633251  
-0.4500713059  
-0.3014431408  
-0.09002337264  
0.1604205532  
0.4251091711  
0.6806319107  
0.9068387779  
1.088120255  
1.214036592  
1.27934554  
1.283564498  
1.230213913  
1.125905961  
0.9794240131  
0.8008813412  
0.6010180579  
0.3906336917  
0.1801294562  
-0.02088324465  
-0.2039625583  
-0.3622184475  
-0.4906990423  
-0.5867448195  
-0.6502477033  
-0.6837372985  
-0.6922236632  
-0.6827590432  
-0.6637200554  
-0.6438565995  
-0.6312267635  
-0.6321587492  
-0.6504044949  
-0.6866333615  
-0.7383748679  
-0.800447591  
-0.8658353743  
-0.9268822615  
-0.9766283429  
-1.010059317  
-1.025060007  
-1.022880002  
-1.008030343  
-0.9875798842  
-0.9699688881  
-0.9635065375  
-0.9748156337  
-1.007474842  
-1.061120172  
-1.131166479  
-1.209229364  
-1.284205346  
-1.343851592  
-1.376620159  
-1.373452334  
-1.329228753  
-1.243636453  
-1.121300421  
-0.9711431461  
-0.8050847959  
-0.6362811774  
-0.4772115566  
-0.3379159114  
-0.2246850126  
-0.139406499  
-0.07966450377  
-0.03955567019  
-0.01105668887  
0.01431291653  
0.04383369043  
0.08224070579  
0.1309206333  
0.1877903627  
0.2478758274  
0.3044629275  
0.3506038331  
0.3806912854  
0.3917878704  
0.3844488681  
0.3628592549  
0.3342330185  
0.3075578227  
0.2918960016  
0.2945537985  
0.3194612458  
0.3660907173  
0.4291635937  
0.4992586641  
0.5642716475  
0.6115345813  
0.6302523629  
0.6138421328  
0.5617581464  
0.4804301309  
0.3830888789  
0.2884226246  
0.2181787954  
0.1940363908  
0.234185289  
0.3501244769  
0.5441793468  
0.8081529544  
1.12337081  
1.462185156  
1.790784216  
2.072980213  
2.274490782  
2.367159897  
2.332558097  
2.164494954  
1.870106511  
1.469376863  
0.9931347137  
0.479790435  
-0.02879818779  
-0.4918308697  
-0.8738982367  
-1.148644892  
-1.301360091  
-1.330213058  
-1.246042028  
-1.070751238  
-0.8345521639  
-0.5723856576  
-0.3199521775  
-0.1098086457  
0.03203662255  
0.08868425085  
0.05378922905  
-0.06821146938  
-0.2630759857  
-0.5087819049  
-0.7783316629  
-1.042985904  
-1.275552445  
-1.4533315  
-1.560410426  
-1.589050035  
-1.540042789  
-1.422050227  
-1.250053889  
-1.043151747  
-0.8220341419  
-0.6064692129  
-0.4131506773  
-0.2541564773  
-0.1361872235  
-0.06062357826  
-0.02431188662  
-0.02087522722  
-0.04229177563  
-0.08043646849  
-0.1283425241  
-0.1809712904  
-0.2354325056  
-0.2906541506  
-0.346658504  
-0.4036243894  
-0.460972773  
-0.5166909079  
-0.5670459347  
-0.6067638175  
-0.6296481519  
-0.6295328949  
-0.6013913339  
-0.542400924  
-0.4527678243  
-0.3361456272  
-0.1995629881  
-0.05284357984  
0.09242878795  
0.2242534304  
0.3317051821  
0.4063689725  
0.4435242022  
0.4429182052  
0.409016613  
0.3506706105  
0.2802258954  
0.2121451725  
0.1613020472  
0.1411198365  
0.161783517  
0.228745201  
0.3417254479  
0.4943633618  
0.6746100251  
0.8658555324  
1.04870298  
1.203189457  
1.311202972  
1.358777614  
1.337977777  
1.248078071  
1.095879777  
0.8950745647  
0.6647360857  
0.4270973194  
0.2049324122  
0.01886676827  
-0.1150218985  
-0.1869837044  
-0.1945457752  
-0.1425113816  
-0.04203622182  
0.09106727052  
0.2385427207  
0.3821049409  
0.5057251051  
0.597485726  
0.6507789959  
0.6647206876  
0.6437733699  
0.5966691034  
0.5348298486  
0.4705282055  
0.4150538905  
0.3771286106  
0.3617725902  
0.3697347232  
0.3975213178  
0.4379797413  
0.4813210133  
0.516417755  
0.5322155783  
0.5190655374  
0.4698530081  
0.3808094708  
0.2519608825  
0.0871886802  
-0.1060562941  
-0.3173571735  
-0.5341710189  
-0.7428416005  
-0.9297118052  
-1.082256939  
-1.190160282  
-1.246252355  
-1.24722568  
-1.194052288  
-1.092045007  
-0.9505246639  
-0.7820953758  
-0.6015768625  
-0.4246843592  
-0.2665869718  
-0.1405013816  
-0.05647061473  
-0.02048331804  
-0.03402109048  
-0.09408676932  
-0.1937120073  
-0.3228442762  
-0.4695199896  
-0.6211542232  
-0.765793376  
-0.8931857232  
-0.9955570774  
-1.068036577  
-1.108707853  
-1.118334121  
-1.09982558  
-1.057552368  
-0.9966026848  
-0.9220934094  
-0.8385994931  
-0.749760489  
-0.6580851776  
-0.5649408349  
-0.4707140373  
-0.3750979537  
-0.2774539056  
-0.1772158684  
-0.07427165009  
0.03070389222  
0.1360251768  
0.2388903495  
0.3354402199  
0.4209729281  
0.4903237627  
0.5383704905  
0.560629042  
0.5538695232  
0.5166912138  
0.4499752079  
0.3571520111  
0.2442326262  
0.1195651641  
-0.006681536775  
-0.1232876543  
-0.2189613981  
-0.2834258191  
-0.3085289007  
-0.2892344173  
-0.2243783537  
-0.1170680638  
0.02535685197  
0.1918479687  
0.3686240523  
0.5405258915  
0.692591395  
0.8116745002  
0.8878896336  
0.9156920928  
0.8944411203  
0.8283643712  
0.7259211127  
0.5986548715  
0.4596953714  
0.3221232041  
0.1974132622  
0.09418947455  
0.01743666246  
-0.03172820461  
-0.05571446836  
-0.05963105462  
-0.0501102077  
-0.03398949988  
-0.01706083757  
-0.003090447478  
0.00674228964  
0.01390038769  
0.02204931081  
0.0362043099  
0.06161038045  
0.1025640525  
0.161365843  
0.2375952189  
0.3278246623  
0.425831244  
0.5232693873  
0.6107049592  
0.6788435168  
0.7197505531  
0.7278939537  
0.7008248803  
0.6394248996  
0.5476864975  
0.4320881589  
0.3006742827  
0.1620131292  
0.02417841822  
-0.1060727061  
-0.223838075  
-0.3262621137  
-0.4123988188  
-0.4828199772  
-0.5390599125  
-0.5830278653  
-0.6165074049  
-0.640817724  
-0.6566973235  
-0.6643932619  
-0.6639241029  
-0.6554151893  
-0.6394304568  
-0.6172059826  
-0.5907136339  
-0.5625513303  
