1936.206273  
2053.290091  
2301.547855  
2797.855351  
3406.139059  
7356.132295  
44330.22303  
32488.06063  
2450.96074  
5915.52874  
5323.356806  
48843.53345  
11058.28273  
571.9239489  
18317.62796  
10161.05276  
19196.89835  
3062.833305  
2298.611828  
27182.87429  
13004.51606  
9703.45951  
19179.49204  
25998.40313  
2782.313107  
8927.874897  
6523.792202  
18432.41602  
12884.04522  
814.8153738  
6983.006087  
73.15876406  
1617.82104  
646.9033117  
1346.790379  
1868.379936  
4588.286842  
3212.524641  
11724.08703  
16535.25149  
373.3634064  
4002.490956  
2370.273619  
2593.499572  
365.8090604  
10655.8817  
1834.056945  
4504.006165  
2818.570487  
1574.58179  
2104.969379  
3095.518552  
2167.059348  
2606.503223  
1158.156121  
256.6143552  
978.0304425  
14096.23006  
3001.486754  
213.3608094  
3747.392986  
29.93281484  
668.7495741  
2794.249092  
182.5070973  
43.30637075  
217.7530451  
73.05969135  
153.4872293  
137.6086581  
120.7972273  
44.0066163  
75.5330685  
48.62744784  
48.49950999  
7.12318646  
14.36223539  
42.01980179  
34.60987843  
14.48262785  
18.21006411  
17.06707716  
15.60983919  
19.46249563  
15.62235141  
14.51097407  
13.95321313  
12.35261557  
11.917865  
11.33467842  
10.87635291  
10.44982874  
9.77859543  
8.891541105  
8.423802282  
8.20757652  
7.712229153  
7.384855981  
7.010667709  
6.661339062  
6.216813826  
5.950510139  
5.731686537  
5.422386772  
5.177119327  
4.957811597  
4.72506491  
4.510872414  
4.329526078  
4.13970223  
3.96211311  
3.795075687  
3.640017394  
3.490278208  
3.35256269  
3.217448771  
3.087492234  
2.969726671  
2.85467944  
2.745056462  
2.641562477  
2.541793919  
2.448220292  
2.357646492  
2.271419573  
2.189195229  
2.11128836  
2.036605351  
1.96476871  
1.896486589  
1.831593166  
1.768834912  
1.708862702  
1.651505532  
1.596646565  
1.543729121  
1.493236145  
1.444753822  
1.398204542  
1.353517947  
1.310548942  
1.269302088  
1.229626804  
1.191552179  
1.154878114  
1.119626946  
1.085659582  
1.053029038  
1.021542068  
0.9912178192  
0.9620309168  
0.9338849164  
0.906717863  
0.880557731  
0.8553109566  
0.8309406361  
0.8074417592  
0.7847528009  
0.7628222526  
0.7416671273  
0.7211925977  
0.7014404574  
0.6823395954  
0.6638733792  
0.646000308  
0.6287129675  
0.6120000002  
0.5958072343  
0.5801599032  
0.564993414  
0.5503171675  
0.5360951324  
0.5223150896  
0.5089658095  
0.4960411467  
0.4835021103  
0.4713345237  
0.4595736153  
0.4481335464  
0.4370360519  
0.4262684123  
0.4158341117  
0.4056956961  
0.3958601135  
0.3863110944  
0.3770294608  
0.368022631  
0.3592646377  
0.3507540897  
0.3424897155  
0.3344657264  
0.3266476907  
0.3190701826  
0.3116874611  
0.3045062117  
0.2975304881  
0.2907348748  
0.2841245823  
0.277690182  
0.2714336502  
0.2653568522  
0.2594173377  
0.2536437118  
0.2480315499  
0.2425349155  
0.237207222  
0.2320249721  
0.2269508911  
0.2220222085  
0.217216809  
0.2125318994  
0.2079682781  
0.2035063265  
0.1991720978  
0.1949417732  
0.1908086954  
0.1867778708  
0.1828573233  
0.1790240565  
0.1752904194  
0.1716356403  
0.1680750488  
0.1646055061  
0.1612020208  
0.1578898988  
0.1546605441  
0.1515152163  
0.1484208525  
0.1454165263  
0.1424640335  
0.1395964501  
0.13679557  
0.1340501886  
0.1313695991  
0.1287528904  
0.1261958466  
0.1236955088  
0.12124748  
0.1188519065  
0.1165117206  
0.1142348505  
0.1119989224  
0.1098144809  
0.107672705  
0.1055804815  
0.1035344455  
0.1015373462  
0.09957890251  
0.09765919037  
0.09579084381  
0.09395270769  
0.09215761422  
0.09040378591  
0.08868131076  
0.0870027026  
0.08534632103  
0.08374120022  
0.08215387134  
0.08060835106  
0.07908879055  
0.07760687647  
0.07614634542  
0.0747303827  
0.07333289229  
0.07196942578  
0.07063010691  
0.06931019572  
0.06802754245  
0.06677155895  
0.06552914336  
0.06432191057  
0.06313768707  
0.06197575775  
0.06084029004  
0.0597165102  
0.05862536826  
0.05754754567  
0.05649573854  
0.05546715353  
0.05444811603  
0.0534550331  
0.05247794751  
0.05152715545  
0.05058582549  
0.0496695003  
0.04876300525  
0.04787826057  
0.04701628816  
0.04616130241  
0.04532846933  
0.04450352733  
0.04369997873  
0.04291200488  
0.04213477903  
0.04137714945  
0.04062796183  
0.03989198053  
0.03917038764  
0.038465812  
0.03777253579  
0.03708821059  
0.03642208414  
0.03576562822  
0.03511994509  
0.03448632964  
0.03386678335  
0.03325483371  
0.03265955967  
0.03206854329  
0.03148958123  
0.03091979491  
0.03036025503  
0.0298094057  
0.02927199771  
0.02874469589  
0.02822862804  
0.02771130936  
0.02720703168  
0.0267164185  
0.0262351364  
0.02575483267  
0.02528705165  
0.02482725942  
0.02437883585  
0.02393059302  
0.0234950409  
0.02306585839  
0.02264606245  
0.02223121807  
0.0218197078  
0.02142203457  
0.02102993331  
0.02064018948  
0.02025898289  
0.01988395321  
0.01951881859  
0.01915673522  
0.0188013887  
0.01844871996  
0.01810445716  
0.01776853148  
0.0174360908  
0.01710763571  
0.01678586478  
0.01647091626  
0.01616095241  
0.01585615903  
0.01555591171  
0.01525732344  
0.01496542405  
0.01468186853  
0.01439839979  
0.01412012871  
0.01384989161  
0.01357923195  
0.01331894888  
0.01305991298  
0.01280503935  
0.01255367229  
0.01230514201  
0.01206410481  
0.01182707806  
0.01159165679  
0.0113586418  
0.01113511675  
0.01090891264  
0.01069026364  
0.01047526619  
0.01026110391  
0.01005223289  
0.009844691789  
0.009641893518  
0.009443703712  
0.00925070607  
0.009055931391  
0.008864619415  
0.0086779708  
0.008495536686  
0.008313738345  
0.00813701073  
0.007962300098  
0.007790320395  
0.007621683648  
0.007455767128  
0.007291870174  
0.00713019094  
0.006972415196  
0.006817189096  
0.006664757839  
0.006513702988  
0.006366659974  
0.006218786904  
0.006076391646  
0.005935845303  
0.005798555102  
0.005660342414  
0.005526455471  
0.005395081109  
0.005265563433  
0.005138788064  
0.005014193815  
0.004890068023  
0.004769243342  
0.004650574463  
0.004534383034  
0.004418773584  
0.004305778492  
0.004193927496  
0.004085912691  
0.003978588061  
0.003873206121  
0.003769431689  
0.003668030175  
0.00356842202  
0.003470999918  
0.003374841556  
0.003280663593  
0.003188585326  
0.003096102788  
0.003006458874  
0.002919530922  
0.002831322369  
0.002747627577  
0.002664058652  
0.002583144029  
0.002502924877  
0.002424023817  
0.00234746665  
0.002272079917  
0.002197873696  
0.002125816694  
0.00205462004  
0.001984781074  
0.001916786693  
0.001850143086  
0.001784522779  
0.001721170263  
0.001657887123  
0.001597175041  
0.001537048175  
0.001478800876  
0.001421619481  
0.001365320194  
0.001310779485  
0.001256421169  
0.00120472083  
0.001153218828  
0.001103585333  
0.001054296846  
0.001008594502  
0.0009616330983  
0.0009164452581  
0.000872582994  
0.0008301889616  
0.0007888419599  
0.0007485981475  
0.0007096687258  
0.0006714323395  
0.0006342836092  
0.0005993598747  
0.0005645735891  
0.0005314079838  
0.0004987345106  
0.0004674566684  
0.0004371473807  
0.00040827185  
0.0003799465236  
0.0003528860479  
0.0003268211848  
0.0003017090055  
0.0002779562637  
0.0002552796565  
0.0002336910232  
0.0002132479979  
0.0001933304097  
0.0001748238382  
0.0001572987566  
0.0001408685862  
0.0001249959823  
0.0001105758816  
9.700729686e-05  
8.469114816e-05  
7.300596619e-05  
6.260750633e-05  
5.324316625e-05  
4.472863539e-05  
3.729306803e-05  
3.087051451e-05  
2.520974107e-05  
2.077423327e-05  
1.725541804e-05  
1.476879442e-05  
1.340205368e-05  
1.280330832e-05  
