0.5767534478  
0.5167154057  
0.453726624  
0.3895130279  
0.3250767609  
0.26054324  
0.1953455389  
0.1286918309  
0.0602062585  
-0.009438769263  
-0.07805837615  
-0.1418240974  
-0.1955302577  
-0.2332696472  
-0.249415826  
-0.239742735  
-0.2024726282  
-0.1390265096  
-0.05430442817  
0.04360163719  
0.1442647609  
0.2362370727  
0.3086287733  
0.3526862597  
0.3631162242  
0.3389102815  
0.2835342128  
0.2044195074  
0.1118405724  
0.01734254678  
-0.06801935025  
-0.1353653319  
-0.1793117028  
-0.1987413757  
-0.196896512  
-0.1807937413  
-0.1600555848  
-0.1453631833  
-0.1467505995  
-0.1720179224  
-0.2254885103  
-0.3072777083  
-0.4131711181  
-0.5351090509  
-0.6621880157  
-0.7820302382  
-0.8823200066  
-0.9523016936  
-0.9840409723  
-0.9733058318  
-0.9199579907  
-0.8278535379  
-0.7042618168  
-0.5589257542  
-0.4028901677  
-0.2472605525  
-0.1020537025  
0.02472046877  
0.1276515994  
0.20414505  
0.2542660455  
0.2802676411  
0.2858982055  
0.2756051921  
0.2537678388  
0.2240664927  
0.1890891265  
0.1502159537  
0.1077943086  
0.06156123868  
0.01122358458  
-0.04291741925  
-0.09942322821  
-0.1553825582  
-0.2063770782  
-0.2467812634  
-0.2703958486  
-0.2713230322  
-0.2449607072  
-0.1889492635  
-0.1039077662  
0.006193379202  
0.1341090067  
0.2698758121  
0.4017912478  
0.5177031716  
0.6064244286  
0.6590874933  
0.6702380913  
0.6385174059  
0.5668376148  
0.4620218752  
0.3339695929  
0.1944580259  
0.05574940248  
-0.07081434391  
-0.1760434761  
-0.2538098429  
-0.3015317425  
-0.320184297  
-0.3138673481  
-0.2889961858  
-0.253242672  
-0.2143754254  
-0.1791531736  
-0.1524147258  
-0.1364869221  
-0.1309661347  
-0.1329115908  
-0.1374056378  
-0.1384040444  
-0.1297570542  
-0.1062611684  
-0.06458932278  
-0.003969060382  
0.07349716799  
0.1629237118  
0.2571496812  
0.3476028833  
0.4254137867  
0.4826263976  
0.5133412955  
0.5146189557  
0.4870074948  
0.4346008832  
0.3646062088  
0.2864552834  
0.2105770002  
0.1470014515  
0.1039780363  
0.08682020073  
0.09714175385  
0.1326032538  
0.1872186325  
0.252175542  
0.3170676296  
0.3713446716  
0.4057794768  
0.4137328295  
0.3920192616  
0.3412741833  
0.2657468052  
0.1725958885  
0.07078725593  
-0.03020869448  
-0.1217138784  
-0.1969291859  
-0.2516513859  
-0.2845242129  
-0.2968257339  
-0.2918487094  
-0.2740312506  
-0.2480084097  
-0.2177658069  
-0.1860638516  
-0.1542068903  
-0.1222008211  
-0.0892125426  
-0.05422996365  
-0.01674359255  
0.02270605125  
0.06225570464  
0.0987932769  
0.1283770349  
0.1469206704  
0.1510102984  
0.1386789624  
0.1099777828  
0.06720292397  
0.0147199659  
-0.04160085487  
-0.09526064461  
-0.1401531941  
-0.1715653152  
-0.186963595  
-0.1864324499  
-0.1726831988  
-0.1506285641  
-0.1265991943  
-0.1073459187  
-0.0989883932  
-0.1060904978  
-0.1310109173  
-0.1736114193  
-0.2313485622  
-0.2997115574  
-0.3728921579  
-0.4445632681  
-0.508621178  
-0.5597737655  
-0.5938935693  
-0.608126203  
-0.6007652505  
-0.5710017191  
-0.5186288233  
-0.4438266814  
-0.3471078457  
-0.2294666351  
-0.09271823623  
0.06004179267  
0.2239761186  
0.3921853707  
0.5556689008  
0.7036671469  
0.8244421975  
0.9064469925  
0.9397813055  
0.9177363737  
0.8381896443  
0.7046074625  
0.5264186456  
0.3186232221  
0.1005790062  
-0.1059489438  
-0.2792818418  
-0.4005435276  
-0.4562327455  
-0.4402549808  
-0.3550857912  
-0.211818353  
-0.02903208606  
0.1694324664  
0.3575132064  
0.5103810592  
0.6078177406  
0.637014345  
0.5943845167  
0.4860935339  
0.3272193862  
0.1396547144  
-0.05095299789  
-0.2187660753  
-0.3413173543  
-0.402543599  
-0.394856692  
-0.3199843487  
-0.1884683055  
-0.01794639382  
0.169516776  
0.3506145334  
0.5040307332  
0.6132459445  
0.6685169386  
0.6677899705  
0.6164542134  
0.5260355766  
0.4120851173  
0.2916190713  
0.180529991  
0.09135876096  
0.03174482426  
0.003749647561  
0.004092221536  
0.02519961234  
0.05683948008  
0.08804540141  
0.1089941652  
0.1125457356  
0.0952102119  
0.05743740221  
0.003210519026  
-0.06093324067  
-0.1272633766  
-0.1883449243  
-0.2383980407  
-0.2742931569  
-0.2960260394  
-0.3065942717  
-0.3113056251  
-0.3166392165  
-0.3288619364  
-0.3526298519  
-0.389831412  
-0.4388756334  
-0.4945670702  
-0.5486120818  
-0.5907086546  
-0.6100565465  
-0.5970696464  
-0.545031123  
-0.4514214671  
-0.3187121584  
-0.1544799545  
0.02919943604  
0.2170141746  
0.3921792191  
0.538467206  
0.6422330281  
0.6941611757  
0.6904915088  
0.6335461515  
0.5314760679  
0.3972524538  
0.24701188  
0.09798702723  
-0.03370865836  
-0.1351345074  
-0.1981210937  
-0.2201829041  
-0.2046124622  
-0.1597401635  
-0.0974742003  
-0.03134502802  
0.02563646989  
0.06297088153  
0.07420308855  
0.05775873838  
0.01696575712  
-0.04071920105  
-0.1051341479  
-0.1652263507  
-0.2109471108  
-0.2349135638  
-0.2335651907  
-0.2076428706  
-0.1619424772  
-0.1043959499  
-0.04468220028  
0.007407416565  
0.04355451879  
0.05820218545  
0.04934148042  
0.01870084447  
-0.02868025238  
-0.08537977334  
-0.1428621972  
-0.1928682889  
-0.2286894429  
-0.2461371269  
-0.2440636172  
-0.2243687537  
-0.1915178853  
-0.1516771243  
-0.1116058095  
-0.07751154413  
-0.05404384735  
-0.04357906771  
-0.04591267377  
-0.0583719701  
-0.07633340861  
-0.09403694106  
-0.1055608122  
-0.105795885  
-0.09126970429  
-0.06068799456  
-0.0151322091  
0.0421299708  
0.1061555313  
0.1710896995  
0.2310523331  
0.2810051846  
0.3174705187  
0.3389929786  
0.3462786893  
0.3419945851  
0.3302616597  
0.3159278591  
0.3037328728  
0.2975025589  
0.2994954008  
0.3100273295  
0.327415142  
0.3482771288  
0.3681286027  
0.3821868189  
0.3862397262  
0.3774366682  
0.354847758  
0.319696395  
0.2752143111  
0.2261344582  
0.1779182574  
0.1358534077  
0.1041869529  
0.08546026285  
0.08016737789  
0.08679788371  
0.1022602012  
0.1225875598  
0.1437896304  
0.1626824989  
0.1775206058  
0.188305839  
0.1967056692  
0.2055886186  
0.2182609388  
0.2375519168  
0.2649105575  
0.2997063042  
0.3388605478  
0.3769123758  
0.4065238663  
0.4193792704  
0.4073570446  
0.3638100599  
0.2847810801  
0.1699664057  
0.02329053268  
-0.1470107907  
-0.3288445742  
-0.5072242403  
-0.66566068  
-0.7878454263  
-0.8594434242  
-0.869799466  
-0.8133566004  
-0.6906027262  
-0.5084114472  
-0.2797093006  
-0.02246031723  
0.2419422884  
0.4907193434  
0.7019728203  
0.8569207559  
0.9418340106  
0.9494588428  
0.8797289121  
0.7396985353  
0.5426872311  
0.3067513161  
0.0526630657  
-0.1983449675  
-0.4267961628  
-0.6168832494  
-0.7578712047  
-0.8448341413  
-0.8786950688  
-0.8656032042  
-0.8157802226  
-0.742015135  
-0.6580182537  
-0.5768405392  
-0.5095275489  
-0.4641296946  
-0.4451284931  
-0.4532768045  
-0.4858119695  
-0.5369589112  
-0.5986367637  
-0.6612911093  
-0.7147670396  
-0.7491848799  
-0.7557686052  
-0.7276049526  
-0.6602917523  
-0.5524541352  
-0.4060631751  
-0.2265264323  
-0.02249544015  
0.1946363189  
0.4115383933  
0.6140139198  
0.7882590996  
0.9221855755  
1.006669085  
1.036562595  
1.011348558  
0.9353184757  
0.8172316206  
0.6694692389  
0.5067578422  
0.344593865  
0.1975590603  
0.07770588301  
-0.006770343255  
-0.05243074356  
-0.06091290552  
-0.03864502826  
0.004051301783  
0.05435738332  
0.09871425312  
0.1247041583  
0.1228376511  
0.08800308625  
0.02036922517  
-0.07438846445  
-0.1856005501  
-0.298818742  
-0.3975860395  
-0.4655611333  
-0.4887182071  
-0.4573371555  
-0.3675270179  
-0.2220625709  
-0.03041866067  
0.1920197054  
0.4254878906  
0.6479412496  
0.8374713351  
0.9747528311  
1.045241838  
1.040855956  
0.9609471308  
0.8124460344  
0.6091656143  
0.3703334123  
0.1185322138  
-0.1227289995  
-0.3315196972  
-0.4897900648  
-0.58519305  
-0.6122358548  
-0.5726230218  
-0.4747856695  
-0.3326692372  
-0.1639677158  
0.0119706864  
0.1762865003  
0.3125436564  
0.4082501915  
0.4558177526  
0.4529142372  
0.4022408973  
0.3108335815  
0.1890470089  
0.04937046135  
-0.09476333383  
-0.2300682826  
-0.344325655  
-0.4271126734  
-0.4703583821  
-0.4687545771  
-0.4200655787  
-0.3253435106  
-0.1890498521  
-0.01903626935  
0.1736597538  
0.3752743787  
0.5700631349  
0.7413518473  
0.8728412634  
0.950089641  
0.9620167183  
0.9022784403  
0.7703150021  
0.5719230746  
0.3192218282  
0.02995511964  
-0.273854134  
-0.5677896859  
-0.8273087988  
-1.030139375  
-1.158563296  
-1.201299666  
-1.154778283  
-1.023617188  
-0.8202390882  
-0.563646159  
-0.2774763499  
0.01244208436  
0.2807630252  
0.5052170163  
0.6688352642  
0.7615508284  
0.7810081605  
0.7325042535  
0.6280881029  
0.4849425474  
0.3232568793  
0.1638461505  
0.02580575001  
-0.07554081835  
-0.1301651893  
-0.1341759781  
-0.08991212176  
-0.005303566361  
0.1073846649  
0.2332516864  
0.3566736414  
0.4631763029  
0.5410585752  
0.5825590911  
0.584459536  
0.5480857566  
0.4787481843  
0.3847411064  
0.2760752439  
0.1631267469  
0.05540831023  
-0.03939457319  
-0.1160129494  
-0.1717808833  
-0.2064457293  
-0.2217013833  
-0.2205533884  
-0.2066677939  
-0.1838164657  
-0.1555033606  
-0.1248078964  
-0.09442894804  
-0.06685745404  
-0.04459203778  
-0.03028535252  
-0.02674138395  
-0.03671927629  
-0.06253627544  
-0.1055389848  
-0.165543059  
-0.2403687428  
-0.3256050856  
-0.4147119854  
-0.4995036492  
-0.5710142997  
-0.6206353693  
-0.6414013323  
-0.6291970585  
-0.5837104048  
-0.5089159235  
-0.4129870572  
-0.3075747688  
-0.2065109884  
-0.1240829163  
-0.07310460338  
-0.06305998435  
-0.09858275586  
-0.178527223  
-0.2957842002  
-0.4378968937  
-0.5884278156  
-0.7288946501  
-0.8410343415  
-0.9090833254  
-0.921770519  
-0.8737559945  
-0.7663342954  
-0.6073131192  
-0.4100946201  
-0.192098544  
0.02726982231  
0.2288343807  
0.395775502  
0.5154120208  
0.5804464239  
0.58954242  
0.5472007148  
0.4629857352  
0.350213598  
0.2242932491  
0.1009185655  
-0.005664959531  
-0.08413885686  
-0.1271642679  
-0.1319409202  
-0.1002172483  
-0.03780585075  
0.04630395287  
0.1411129832  
0.2348964377  
0.316458161  
0.3762215313  
0.4070667998  
0.4048641786  
0.3686943321  
0.3007876459  
0.2062316168  
0.09250485836  
-0.03110952969  
-0.1541982728  
-0.2659475972  
-0.3559174759  
-0.4148401226  
-0.4354101658  
-0.4130048639  
-0.3462692284  
-0.2374683086  
-0.09252460589  
0.07931716305  
0.266218084  
0.4548209024  
0.6315830692  
0.7842008861  
0.9029595267  
0.9818138239  
1.019043976  
1.017380518  
0.9835662561  
0.9273982506  
0.8603830274  
0.7941749151  
0.7390289824  
0.7024777056  
0.6884293526  
0.6968079463  
0.7237936971  
0.7626091929  
0.8047376158  
0.8413697826  
0.864851916  
0.8699113457  
0.8544524547  
0.8198160648  
0.770454277  
0.7130973162  
0.6555560166  
0.6053681867  
0.5685276156  
0.5484964334  
0.5456656728  
0.5573348094  
0.5781909192  
0.6011861292  
0.6186528744  
0.6234598816  
0.6100380752  
0.5751198354  
0.5181116629  
0.4410823342  
0.3483994342  
0.246104045  
0.141129576  
0.0404728686  
-0.04957244407  
-0.1240526868  
-0.179798819  
-0.2156599242  
-0.2325106734  
-0.2330487821  
-0.2214125283  
-0.202652088  
-0.1821132569  
-0.1648016681  
-0.1547929149  
-0.1547726144  
-0.1657612375  
-0.1870817487  
-0.21658176  
-0.2510951082  
-0.2870818287  
-0.3213597765  
-0.3518014723  
-0.3778788344  
-0.4009391578  
-0.4241294795  
-0.4519600041  
-0.4895282805  
-0.5415273465  
-0.6111855913  
-0.6993309433  
-0.803771471  
-0.919132333  
-1.037241064  
-1.148041409  
-1.240938306  
-1.306370262  
-1.337370857  
-1.330842735  
-1.28831233  
-1.215999696  
-1.124150333  
-1.025698005  
-0.9344303549  
-0.8629425841  
-0.8206923677  
-0.8124702879  
-0.8375514054  
-0.8896881015  
-0.9579724143  
-1.028463231  
-1.086356501  
-1.118357042  
-1.114892203  
-1.07180832  
-0.9912471645  
-0.8815394798  
-0.7560824342  
-0.631343168  
-0.5242721669  
-0.4495123627  
-0.4168549474  
-0.429355017  
-0.4824411119  
-0.5642063677  
-0.656872919  
-0.7392494421  
-0.7898222186  
-0.7900149416  
-0.7271234351  
-0.5964569451  
-0.4023646734  
-0.1579662867  
0.1163622856  
0.3955339575  
0.6529515768  
0.863892459  
1.008620658  
1.074786258  
1.058831104  
0.9662411931  
0.8106585859  
0.6120236045  
0.3940133312  
0.1811363688  
-0.004149495472  
-0.1439535713  
-0.2268090221  
-0.2486818767  
-0.213045745  
-0.1300405198  
-0.01485437127  
0.1144642078  
0.2394651974  
0.3437296739  
0.41495273  
0.4464250248  
0.4377193867  
0.3945084009  
0.3275555117  
0.2510335583  
0.1804135584  
0.1302455365  
0.1121346512  
0.1332050631  
0.1952576088  
0.2947059906  
0.4232871445  
0.5693969188  
0.7198369415  
0.8617034352  
0.9841405607  
1.079717235  
1.145254281  
1.182019883  
1.195302792  
1.193452533  
1.186566062  
1.185001498  
1.197935541  
1.232158068  
1.291225852  
1.375079413  
1.480122043  
1.59973006  
1.725088849  
1.846240526  
1.953190388  
2.036949558  
2.090389771  
2.10883985  
2.090383285  
2.035863395  
1.948634142  
1.834117424  
1.699248737  
1.551871245  
1.400137704  
1.251959334  
1.114506047  
0.9937765307  
0.8942265739  
0.818466994  
0.7670544242  
0.738394588  
0.7288083897  
0.7327795742  
0.7433996713  
0.75298551  
0.7538191687  
0.7389194133  
0.702751349  
0.6417617237  
0.5546712715  
0.442477151  
0.3081678743  
0.1562111025  
-0.008106420301  
-0.1793666112  
-0.3526354247  
-0.5239051456  
-0.6903118793  
-0.8501082685  
-1.002424502  
-1.146869883  
-1.283074051  
-1.410251462  
-1.526885904  
-1.630603456  
-1.718267878  
-1.786315431  
-1.831283473  
-1.850477733  
-1.842675703  
-1.808763413  
-1.752187564  
-1.679127804  
-1.598304182  
-1.520404361  
-1.457134137  
-1.419978029  
-1.418794662  
-1.46040981  
-1.547410107  
-1.677315245  
-1.842290873  
-2.029499879  
-2.222119153  
-2.400962223  
-2.546546182  
-2.641389758  
-2.67225354  
-2.632032829  
-2.521022271  
-2.347334443  
-2.126353482  
-1.87921557  
-1.630453278  
-1.405058813  
-1.225326476  
-1.107884005  
-1.061339392  
-1.084896254  
-1.168177656  
-1.292341435  
-1.432389157  
-1.560379601  
-1.649135168  
-1.675918245  
-1.625558469  
-1.492566562  
-1.281904466  
-1.008278504  
-0.6940324774  
-0.365937188  
-0.05132459465  
0.2258547781  
0.4484808276  
0.6086837035  
0.7088870655  
0.7612913774  
0.7858774717  
0.8072178206  
0.8505681965  
0.9378220334  
1.083943317  
1.2944012  
1.564017537  
1.877402192  
2.210924591  
2.535955665  
2.822900072  
3.04544499  
3.184405702  
3.230603073  
3.186358019  
3.065378933  
2.891048915  
2.693350949  
2.50486374  
2.35637211  
2.272706763  
2.269378664  
2.350448135  
2.507922033  
2.722740776  
2.967217664  
3.208601828  
3.413293482  
3.551154388  
3.599341433  
3.545158947  
3.387522365  
3.136827814  
2.813196005  
2.443302493  
2.05618904  
1.678634668  
1.330744831  
1.022448816  
0.7514998786  
0.5033954046  
0.2533783793  
-0.02963659176  
-0.3776777223  
-0.8176143202  
-1.365245497  
-2.020552325  
-2.764957889  
-3.561217452  
-4.356160467  
-5.086106988  
-5.684330552  
-6.089584719  
-6.254486789  
-6.15251145  
-5.782484399  
-5.169825762  
-4.364245193  
-3.434143794  
-2.458489723  
