1409.49242  
1468.311375  
1583.839619  
1760.975284  
2110.297045  
5341.490852  
27434.17394  
70276.69765  
17085.84869  
8494.230811  
540.8669366  
56478.52832  
32276.44376  
5467.901872  
7008.341356  
6549.732568  
29017.83685  
2413.646153  
4109.380704  
11594.97331  
19503.235  
3142.616173  
4962.230435  
22067.608  
890.3106043  
624.3834907  
5314.528384  
3524.107742  
503.5328296  
12850.68348  
5890.042665  
1679.370853  
7481.970617  
15897.25914  
870.2970415  
4405.596164  
3887.287266  
8145.90586  
5386.30781  
94.03100423  
7023.873843  
1135.856577  
7086.03991  
5325.352434  
1419.601165  
1632.057429  
3351.710707  
743.9489691  
4321.983422  
2626.023713  
3686.474559  
4751.642004  
2703.196806  
5123.219047  
1822.361399  
587.4965368  
252.6530688  
3656.334248  
3769.282244  
1528.217754  
1089.953915  
794.5174949  
200.6985624  
169.9957268  
212.3796164  
7.98371906  
177.8280427  
494.2715914  
407.3831478  
212.9836602  
97.84797366  
176.945144  
59.52831643  
139.0923311  
29.17522705  
54.11908381  
47.25904363  
55.12134767  
39.50970533  
38.1471326  
34.35635651  
31.37111878  
29.02052817  
30.03764728  
31.5864659  
27.05067593  
25.98006439  
24.37567725  
22.60457622  
20.4027916  
19.8663609  
18.38667555  
17.25683562  
16.42496356  
15.82506311  
14.9616007  
14.40628704  
13.55239397  
13.11039518  
12.44060659  
12.04441569  
11.56673367  
11.06089985  
10.65767164  
10.21462776  
9.802941138  
9.441153652  
9.070559592  
8.731931074  
8.423967731  
8.148592275  
7.847430539  
7.578349615  
7.325526153  
7.091542185  
6.856354715  
6.644644496  
6.443123441  
6.244910588  
6.053945877  
5.872198716  
5.701209321  
5.538405088  
5.380604211  
5.230348811  
5.08568537  
4.948291108  
4.814571236  
4.687186586  
4.564456284  
4.447193228  
4.334498453  
4.226404927  
4.121702204  
4.020938713  
3.924003416  
3.831047347  
3.741173443  
3.654450707  
3.570859968  
3.490091526  
3.412033077  
3.336721802  
3.26391706  
3.193635383  
3.125616178  
3.059891417  
2.996236626  
2.934610441  
2.874986942  
2.817209781  
2.761261961  
2.706981364  
2.65436787  
2.603376784  
2.553934461  
2.505875836  
2.45928929  
2.414049411  
2.370106871  
2.327434676  
2.285929662  
2.245634071  
2.206436704  
2.168335244  
2.131242239  
2.095183527  
2.060099139  
2.025920097  
1.992667457  
1.960281152  
1.928746599  
1.898006901  
1.868049159  
1.838875885  
1.810406953  
1.782665125  
1.755599888  
1.729195376  
1.703445999  
1.678314378  
1.653793956  
1.629852115  
1.606467927  
1.583617343  
1.561335288  
1.539550523  
1.518285487  
1.497469069  
1.477146498  
1.457278604  
1.437844221  
1.418834391  
1.4002632  
1.382087586  
1.364306739  
1.346881641  
1.329853451  
1.313196481  
1.296887078  
1.280909448  
1.265274619  
1.249957721  
1.234937728  
1.220246587  
1.205840531  
1.191728666  
1.177893264  
1.164361406  
1.151076229  
1.138041422  
1.125269282  
1.112751999  
1.100465508  
1.088420955  
1.076610696  
1.065011794  
1.053626956  
1.0424812  
1.031519363  
1.020763377  
1.010206927  
0.9998419763  
0.9896739416  
0.979683159  
0.9698809716  
0.9602384467  
0.9507780435  
0.9414652058  
0.9323498597  
0.9233640657  
0.9145542763  
0.9059016613  
0.8973788205  
0.8890113686  
0.8807914909  
0.8726876802  
0.8647398189  
0.8569148479  
0.8492350052  
0.8416697361  
0.8342419086  
0.8269174702  
0.8197344278  
0.8126484032  
0.8057018689  
0.7988321465  
0.7920961697  
0.7854737887  
0.7789332911  
0.7725188729  
0.7661948398  
0.7599710321  
0.7538474849  
0.7478073038  
0.7418651563  
0.7360258727  
0.7302641796  
0.724603383  
0.7190220359  
0.7135107684  
0.7080963356  
0.7027592262  
0.6975092554  
0.6923344999  
0.687236515  
0.682199934  
0.6772607406  
0.6723709311  
0.6675722935  
0.6628414101  
0.6581638682  
0.6535578009  
0.649025484  
0.6445438949  
0.6401314642  
0.6358034546  
0.6315162754  
0.6272974564  
0.6231381046  
0.6190170122  
0.6149832946  
0.6109813409  
0.6070518109  
0.6031685593  
0.5993381256  
0.5955675573  
0.5918411001  
0.5881615366  
0.5845452509  
0.5809690408  
0.5774433369  
0.5739586743  
0.5705288481  
0.567145607  
0.5637992713  
0.5605056203  
0.5572417626  
0.5540442829  
0.5508759502  
0.5477437197  
0.5446660644  
0.5416235752  
0.5386166963  
0.5356517118  
0.5327275883  
0.5298363153  
0.5269811718  
0.5241707105  
0.5213816462  
0.5186513153  
0.5159361975  
0.5132727512  
0.5106264244  
0.5080170229  
0.5054507665  
0.5029070241  
0.5004014763  
0.49792135  
0.4954857187  
0.4930707064  
0.4906858543  
0.4883302249  
0.4860087578  
0.483709734  
0.4814470285  
0.4792072168  
0.4769989331  
0.4748199468  
0.4726606746  
0.4705300204  
0.4684333799  
0.4663617671  
0.4643163413  
0.4622784085  
0.4602836651  
0.4583065377  
0.4563592547  
0.4544301297  
0.4525257784  
0.4506423951  
0.4487892474  
0.4469448021  
0.4451353755  
0.4433583853  
0.4415902495  
0.439844011  
0.4381244388  
0.4364190402  
0.4347399614  
0.4330781349  
0.4314387215  
0.4298131052  
0.4282133256  
0.4266332597  
0.4250793669  
0.4235302338  
0.4220082643  
0.4205076848  
0.4190198348  
0.4175504118  
0.4160947678  
0.4146681044  
0.4132557965  
0.4118566057  
0.4104825391  
0.4091152612  
0.4077723753  
0.4064551112  
0.4051381904  
0.4038527956  
0.4025632586  
0.4013040974  
0.4000589349  
0.3988238164  
0.3976039582  
0.3964042955  
0.3952184797  
0.3940405775  
0.3929011665  
0.3917558187  
0.3906258549  
0.3895198225  
0.3884181378  
0.3873401973  
0.3862726482  
0.385220076  
0.3841771537  
0.3831537352  
0.3821326277  
0.3811377048  
0.3801542537  
0.3791776708  
0.3782135309  
0.3772719062  
0.3763293059  
0.3754155658  
0.3745025468  
0.373604689  
0.3727232289  
0.3718473278  
0.3709911474  
0.3701404406  
0.3692988812  
0.3684780607  
0.3676582831  
0.3668650275  
0.3660738603  
0.3652927433  
0.3645263889  
0.3637774233  
0.3630281089  
0.3622944467  
0.3615772517  
0.3608668913  
0.3601618039  
0.359469767  
0.3588003267  
0.3581297427  
0.3574725157  
0.3568228553  
0.3561827862  
0.3555606564  
0.3549451176  
0.3543415766  
0.3537415247  
0.3531590591  
0.3525856915  
0.3520135817  
0.3514594502  
0.3509109633  
0.3503819586  
0.3498493244  
0.3493400778  
0.3488302303  
0.3483320754  
0.3478388946  
0.3473619466  
0.3468928922  
0.3464298417  
0.3459844266  
0.3455409865  
0.3451012522  
0.3446865323  
0.3442643372  
0.3438577097  
0.3434641142  
0.3430814667  
0.3427094662  
0.3423276041  
0.3419711886  
0.3416221229  
0.3412741061  
0.3409405344  
0.3406123695  
0.3402992307  
0.3399912246  
0.3396940615  
0.3393956398  
0.3391172311  
0.338842602  
0.3385793225  
0.3383201333  
0.3380772358  
0.3378312632  
0.3376009931  
0.3373746371  
0.3371590795  
0.3369480455  
0.3367555073  
0.3365612235  
0.3363853046  
0.3362103019  
0.3360408742  
0.3358868717  
0.3357346539  
0.3355889384  
0.3354605275  
0.3353327581  
0.3352221362  
0.3351159166  
0.3350053711  
0.3349227925  
0.3348335172  
0.3347531477  
0.3346892336  
0.3346262481  
0.3345800844  
0.334533084  
0.3344991967  
0.3344634537  
0.3344467921  
0.3344375998  
0.334425611  
