-0.2425515284  
-1.101779274  
-1.898201175  
-2.576047437  
-3.093241547  
-3.425846418  
-3.57008041  
-3.541703699  
-3.372963285  
-3.107619445  
-2.794841022  
-2.482858024  
-2.213257535  
-2.016633726  
-1.910089417  
-1.896735982  
-1.967076643  
-2.101864982  
-2.275888475  
-2.462025221  
-2.63497765  
-2.774205163  
-2.86575237  
-2.902891471  
-2.885662202  
-2.819568491  
-2.713760004  
-2.579050498  
-2.426086049  
-2.263899977  
-2.098980655  
-1.934884136  
-1.77233879  
-1.609723728  
-1.443801201  
-1.270556734  
-1.086052236  
-0.8872037405  
-0.6724302755  
-0.4421423894  
-0.1990423238  
0.05177908954  
0.3029792308  
0.54533668  
0.7683768387  
0.961210633  
1.113547907  
1.216797334  
1.265137951  
1.256439485  
1.192900645  
1.081291784  
0.9327402167  
0.7620203214  
0.5863959268  
0.4241040289  
0.2926146057  
0.2068630243  
0.1776404284  
0.2103351604  
0.3041939276  
0.4522161633  
0.6417263922  
0.8555980418  
1.074020062  
1.276626024  
1.444749521  
1.563555662  
1.623772905  
1.62282632  
1.565195428  
1.461961213  
1.329544432  
1.187796859  
1.057649828  
0.9586003516  
0.906343202  
0.9108241098  
0.9749717933  
1.094256453  
1.257152676  
1.446439949  
1.641206327  
1.819301484  
1.959946852  
2.046178848  
2.066814861  
2.017718419  
1.902186426  
1.73043271  
1.51824156  
1.284972131  
1.051176586  
0.8361619311  
0.6557827307  
0.5207680708  
0.4357665111  
0.3992082979  
0.4039690044  
0.4387143466  
0.4897017781  
0.542787868  
0.5853402922  
0.6078149123  
0.6047807205  
0.5753056881  
0.5226681927  
0.4534991875  
0.3765033138  
0.3009848621  
0.235404391  
0.186162133  
0.1567971136  
0.1476557299  
0.1560607496  
0.1769078962  
0.2035728075  
0.2289543376  
0.2465167328  
0.2511609289  
0.2398344333  
0.2117995588  
0.168558156  
0.1134710345  
0.05110583476  
-0.01356051103  
-0.07599831162  
-0.1329322133  
-0.1829895558  
-0.2270875062  
-0.2684981113  
-0.3125459837  
-0.3659447441  
-0.4358429579  
-0.5286681394  
-0.6489599205  
-0.7983436675  
-0.9748606506  
-1.172777352  
-1.382978962  
-1.593933471  
-1.793126165  
-1.968762074  
-2.111481117  
-2.215785922  
-2.280918034  
-2.311005579  
-2.314387725  
-2.302210794  
-2.286478043  
-2.277880837  
-2.283765146  
-2.306609235  
-2.343280484  
-2.385248125  
-2.419743037  
-2.431697703  
-2.406177771  
-2.330902994  
-2.198453645  
-2.007783599  
-1.764795376  
-1.481853995  
-1.176304095  
-0.86820716  
-0.577636345  
-0.321933327  
-0.1133487777  
0.04259619737  
0.1477666531  
0.2110078532  
0.246731824  
0.272703558  
0.3073690265  
0.3670825306  
0.4636723738  
0.60265996  
0.7823992488  
0.994254677  
1.223773863  
1.452694793  
1.661488924  
1.832083747  
1.950384752  
2.00824024  
2.004600239  
1.94570539  
1.844298677  
1.718000568  
1.587060021  
1.471823222  
1.390247302  
1.355799247  
1.375992142  
1.451720619  
1.577428578  
1.742037204  
1.930444851  
2.125353172  
2.309154719  
2.465616123  
2.58118221  
2.645779257  
2.653116108  
2.600536873  
2.488583137  
2.3204035  
2.101173405  
1.837641112  
1.537845347  
1.210989097  
0.8674012454  
0.5184875216  
0.1765535623  
-0.145570216  
-0.4351339939  
-0.6802697778  
-0.8709080858  
-0.9996735367  
-1.06263349  
-1.059763891  
-0.9950662622  
-0.8762941755  
-0.7143437179  
-0.5223771796  
-0.3148077273  
-0.106263776  
0.08935100378  
0.2596258942  
0.3942032636  
0.4851305959  
0.5270461874  
0.5172232788  
0.455545543  
0.3444220216  
0.1886513223  
-0.004764191683  
-0.2269151227  
-0.4673837262  
-0.7147876156  
-0.9574485452  
-1.184139475  
-1.38485028  
-1.551476834  
-1.678349336  
-1.762517298  
-1.803764996  
-1.804341684  
-1.768470778  
-1.701703144  
-1.610242598  
-1.500329964  
-1.377781156  
-1.247738849  
-1.114626423  
-0.9822785283  
-0.8541679515  
-0.7336464698  
-0.6241197171  
-0.529088963  
-0.4520511628  
-0.3962577866  
-0.3644020153  
-0.3582807882  
-0.3785144349  
-0.4243805019  
-0.4937750966  
-0.5833095946  
-0.6885044335  
-0.8040235712  
-0.9239150005  
-1.041785692  
-1.150934709  
-1.244421857  
-1.315137827  
-1.355930641  
-1.359844523  
-1.320513355  
-1.232727648  
-1.093119491  
-0.9008970241  
-0.6585010558  
-0.372047076  
-0.05142333027  
0.2900461751  
0.636409003  
0.9703124012  
1.274543436  
1.533694346  
1.735735361  
1.873280581  
1.944350832  
1.952526655  
1.906432387  
1.818636229  
1.704096161  
1.578365466  
1.455818231  
1.348110413  
1.263109251  
1.2043895  
1.171356221  
1.159925524  
1.16361978  
1.174894313  
1.186443873  
1.192305712  
1.188587617  
1.173738422  
1.148358267  
1.114645008  
1.075607512  
1.034238651  
0.9928137837  
0.9524572263  
0.9130516925  
0.8734830846  
0.832151274  
0.787602268  
0.7391307535  
0.6871888317  
0.6334985339  
0.5808106716  
0.5323433379  
0.4910178635  
0.4586310204  
0.4351611101  
0.4183559515  
0.4037352152  
0.3850355784  
0.3550562851  
0.3067913389  
0.234663577  
0.1356502465  
0.01011499352  
-0.1378113108  
-0.3003882758  
-0.4669496056  
-0.625057519  
-0.7619387101  
-0.8660510613  
-0.9285374242  
-0.944388987  
-0.9131578406  
-0.8391362186  
-0.7309675037  
-0.6007482567  
-0.4627473196  
-0.3318716439  
-0.2220906678  
-0.1449847477  
-0.1085871152  
-0.1166367189  
-0.1683096074  
-0.2584415909  
-0.3781859467  
-0.5160242833  
-0.6589897303  
-0.793972481  
-0.908959125  
-0.9940837307  
-1.042406036  
-1.050359  
-1.017854328  
-0.948068985  
-0.8469702779  
-0.7226487969  
-0.5845431036  
-0.4426311073  
-0.3066666829  
-0.1854999705  
-0.08652942355  
-0.01529150132  
0.0247971705  
0.03256602455  
0.009077186396  
-0.04250281741  
-0.1171416075  
-0.2082837144  
-0.3082922988  
-0.4089701883  
-0.5021401204  
-0.5802657958  
-0.6370512158  
-0.6679775128  
-0.6707195448  
-0.645382646  
-0.5945261292  
-0.5229331833  
-0.4371554985  
-0.3448404331  
-0.2539267158  
-0.1717778799  
-0.1043710208  
-0.05563248196  
-0.02702140465  
-0.01741763088  
-0.02333802508  
-0.03946356204  
-0.05940111009  
-0.07657704239  
-0.08513994295  
-0.08073066875  
-0.0610116238  
-0.02588395499  
0.02266074655  
0.08098710624  
0.1445233619  
0.2085991303  
0.2692665185  
0.3239925292  
0.3720993077  
0.4148723394  
0.4553316661  
0.4976836971  
0.5465414055  
0.6060231975  
0.6788738916  
0.7657439613  
0.8647378013  
0.971314344  
1.078569542  
1.177871084  
1.259778826  
1.315134712  
1.336176704  
1.317549562  
1.257073027  
1.156185485  
1.019993479  
0.8569391469  
0.6781130678  
0.4962945807  
0.3248251808  
0.1764166658  
0.0620306132  
-0.01008905906  
-0.03513292678  
-0.01214271662  
0.05591320649  
0.1623913189  
0.297541178  
0.4493234939  
0.60441572  
0.7493076641  
0.8713945529  
0.9599804497  
1.007095802  
1.008070025  
0.9618207405  
0.8708316231  
0.7408396933  
0.5802621552  
0.3994200427  
0.2096366886  
0.02227855523  
-0.1521574096  
-0.3048508816  
-0.4292809229  
-0.521616546  
-0.5808500296  
-0.6086714488  
-0.6091018541  
-0.5879380379  
-0.5520612229  
-0.5087018095  
-0.4647172532  
-0.4259814672  
-0.3969245371  
-0.3802788132  
-0.3770452712  
-0.3866658992  
-0.4073697479  
-0.4366319785  
-0.4716704638  
-0.5099057919  
-0.5492998135  
-0.5885424408  
-0.6270318587  
-0.6646818659  
-0.7015724247  
-0.7375328322  
-0.7717286984  
-0.8023418159  
-0.826429142  
-0.8399957903  
-0.8383038605  
-0.8163921667  
-0.7697347402  
-0.6949559596  
-0.5904877743  
-0.4570686747  
-0.2980015341  
-0.1191122071  
0.07160319982  
0.2646126005  
0.4496888976  
0.616868236  
0.7573918961  
0.8645286211  
0.9341681013  
0.9651106265  
0.95902929  
0.9201108828  
0.8544353684  
0.7691858021  
0.6717920817  
0.5691366625  
0.4669137393  
0.3692324428  
0.2784818157  
0.1954750757  
0.1198084317  
0.05037140992  
-0.01410741275  
-0.07456213875  
-0.131231566  
-0.1834968245  
-0.2299370697  
-0.2685578714  
-0.2971747182  
-0.3138312048  
-0.317196645  
-0.3068501832  
-0.2834043603  
-0.248450162  
-0.2043351824  
-0.1538299976  
-0.09974485395  
-0.04456549384  
0.009802601287  
0.06216018279  
0.1119861959  
0.1592665922  
0.2042292848  
0.2470466502  
0.2875721317  
0.3251670836  
0.3586662376  
0.3864811448  
0.4068436597  
0.4181322635  
0.4192258635  
0.4098238265  
0.3906606339  
0.3635599057  
0.3313179365  
0.2974041332  
0.2655190346  
0.2390680588  
0.2206260607  
0.2114778301  
0.2113055466  
0.2180920723  
0.2282652481  
0.2370693434  
0.2391450139  
0.229227715  
0.2028784386  
0.157151548  
0.09109046939  
0.005993763847  
-0.09461055497  
-0.2052634393  
-0.3191318109  
-0.4287384776  
-0.5267759051  
-0.6068996193  
-0.6643922587  
-0.6966223404  
-0.7032321306  
-0.6860398117  
-0.648665259  
-0.5959395059  
-0.533177646  
-0.4654138526  
-0.3967198122  
-0.3296960318  
-0.2652261907  
-0.2025340154  
-0.1395392228  
-0.07347045244  
-0.001625057828  
0.07782890699  
0.1651746666  
0.2587081062  
0.3546432415  
0.4474156567  
0.5303516701  
0.5966208426  
0.6403302004  
0.6575646649  
0.6471949792  
0.6112900701  
0.5550295395  
0.4861030643  
0.4136629867  
0.3469877291  
0.2940616832  
0.2603179802  
0.2477405638  
0.2545146053  
0.2752724511  
0.3019246373  
0.3249458025  
0.3349160272  
0.324055056  
0.2875252883  
0.2242664516  
0.1372459944  
0.03308037943  
-0.07890978329  
-0.188050336  
-0.2838450475  
-0.3574626674  
-0.40292187  
-0.4178149656  
-0.4034666246  
-0.3645200613  
-0.3080460233  
-0.2423309952  
-0.1755604752  
-0.1146092964  
-0.06414272002  
-0.0261557076  
-6.465151443e-06  
0.01708155367  
0.02916471368  
0.04054435324  
0.05474788776  
0.07372898729  
0.09743378272  
0.1238299499  
0.1493819225  
0.1699033158  
0.1816155798  
0.1822028418  
0.1716552751  
0.152714953  
0.1307889918  
0.1133222772  
0.1086850146  
0.1247483361  
0.1673753425  
0.2390866635  
0.3381521234  
0.4582863134  
0.5890491975  
0.7169237567  
0.826959304  
0.9047378768  
0.93839607  
0.9204055768  
0.84883658  
0.7279197114  
0.5677978158  
0.3834966348  
0.1932311693  
0.01627068511  
-0.1293639308  
-0.2290680931  
-0.2734133326  
-0.2592695179  
-0.1901566007  
-0.0757857959  
0.06914142617  
0.226709498  
0.377915707  
0.5048550905  
0.5927111424  
0.6312908153  
0.6159446905  
0.5477809767  
0.4331919493  
0.2827877435  
0.1099203921  
-0.07099585749  
-0.2461355595  
-0.4037008741  
-0.5349831202  
-0.6349730559  
-0.7025017627  
-0.7399633368  
-0.7527044722  
-0.748198792  
-0.7351219759  
-0.722428974  
-0.7185072288  
-0.7304429915  
-0.763420942  
-0.820263233  
-0.9010866668  
-1.003103659  
-1.120566041  
-1.244897809  
-1.365051566  
-1.468129099  
-1.540273946  
-1.567822612  
-1.538635692  
-1.443505748  
-1.277459582  
-1.040803778  
-0.7397155734  
-0.3862564484  
0.002276752163  
0.404636665  
0.7974615498  
1.157452169  
1.463654455  
1.699561676  
1.854761005  
1.92592505  
1.917000337  
1.838578392  
1.706522358  
1.540031261  
1.359382273  
1.183631389  
1.028550209  
0.9050271643  
0.8181068112  
0.7667467029  
0.7442914732  
0.739564884  
0.7384466907  
0.725717332  
0.6869639219  
0.6103480486  
0.4880415574  
0.3172041999  
0.1004334154  
-0.1543577068  
-0.4345743219  
-0.7240258142  
-1.004335849  
-1.25653938  
-1.46271977  
-1.607535702  
-1.679507977  
-1.671950643  
-1.583478112  
-1.418054643  
-1.184591056  
-0.8961577381  
-0.56889217  
-0.2207353886  
0.129876657  
0.4652447759  
0.7694465033  
1.029140131  
1.234077038  
1.377361009  
1.455483416  
1.46818766  
1.418234297  
1.311095033  
1.154602779  
0.9585616713  
0.7342898861  
0.4940741536  
0.2505348024  
0.01589674531  
-0.1987830145  
-0.3843639334  
-0.5342636779  
-0.6448871482  
-0.7157767459  
-0.7494375246  
-0.7508368142  
-0.7266363869  
-0.6842638475  
-0.6309470201  
-0.5728541751  
-0.5144608952  
-0.4582335819  
-0.4046544433  
-0.3525511343  
-0.2996726007  
-0.2433773366  
-0.1813180542  
-0.1119897211  
-0.03508059105  
0.04845170684  
0.1365443356  
0.2263954927  
0.3149481562  
0.3993906081  
0.477569772  
0.5482563433  
0.6111994735  
0.6669734657  
0.716651699  
0.7613731167  
0.8018772375  
0.8381121848  
0.869002351  
0.8924195726  
0.9054028421  
0.9046104188  
0.8869421336  
0.8502570584  
0.7940536777  
0.7200079256  
0.6322361469  
0.5372089205  
0.4432696435  
0.3597877045  
0.2960174876  
0.2598054377  
0.2563241469  
0.2870293415  
0.3490008225  
0.4348243368  
0.5330636236  
0.6293105856  
0.7077100316  
0.7527861785  
0.7513344135  
0.694135185  
0.5772615327  
0.4027917384  
0.1788281319  
-0.0811912031  
-0.3598135967  
-0.6373619524  
-0.8939846249  
-1.111713992  
-1.276306209  
-1.37864395  
-1.415557108  
-1.389984359  
-1.310471776  
-1.190080864  
-1.044839372  
-0.8919340153  
-0.7478244702  
-0.6265128599  
-0.5381412521  
-0.4880605686  
-0.4764650201  
-0.4985982946  
-0.5454941327  
-0.6051514433  
-0.6639879901  
-0.7084074085  
-0.7263059472  
-0.7083661595  
-0.6490084576  
-0.5469345996  
-0.4052237853  
-0.2310143438  
-0.03481457364  
0.1704575562  
0.3706018155  
0.5513351791  
0.6994449294  
0.8038136053  
0.8562490472  
0.8520788835  
0.7904653798  
0.6744521547  
0.5107371446  
0.3092003537  
0.08220227169  
-0.1562925336  
-0.3917291326  
-0.6100374564  
-0.7987043776  
-0.9477338378  
-1.050423783  
-1.103848377  
-1.108988461  
-1.070473994  
-0.9959314236  
-0.8949973468  
-0.7781187314  
-0.6552564937  
-0.5346941208  
-0.4220957393  
-0.3199595484  
-0.2275514219  
-0.1413400881  
-0.05584847941  
0.03518933486  
0.1375699792  
0.2554596755  
0.3905248488  
0.5414949  
0.7042287408  
0.8722607363  
1.037722094  
1.192477081  
1.329259555  
1.442640385  
1.529637376  
1.589907478  
1.625493073  
1.640201203  
1.638739079  
1.62577764  
1.605113214  
1.579059764  
1.548186331  
1.511403794  
1.466370567  
1.410138652  
1.339871369  
1.253534952  
1.150414244  
1.031367239  
0.8987960827  
0.756350365  
0.608428903  
0.4595905069  
0.3139865775  
0.1749189956  
0.0445970457  
-0.07587383636  
-0.186293973  
-0.2870071334  
-0.378476621  
-0.4608792677  
-0.5338158749  
-0.5961849424  
-0.6462635012  
-0.6819670061  
-0.7012504299  
-0.7025730415  
-0.6853563946  
-0.6503497221  
-0.5998355346  
-0.5376436529  
-0.4689581905  
-0.3999213586  
-0.3370911403  
-0.2867947049  
-0.2544619199  
-0.244019868  
-0.2574183492  
-0.2943627406  
-0.3522959114  
-0.4266433277  
-0.5113087243  
-0.5993563095  
-0.6837917366  
-0.7583378077  
-0.8180845721  
-0.8599228712  
-0.882685118  
-0.8869849377  
-0.8747876783  
-0.8487907412  
-0.8117411678  
-0.7658136359  
-0.7121753003  
-0.6508244208  
-0.5807393057  
-0.5003056657  
-0.4079421423  
-0.3028073451  
-0.1854248463  
-0.05811200874  
0.07490282359  
0.2077096693  
0.3332854056  
0.4443021856  
0.5340717019  
0.5974469988  
0.6315612529  
0.6362589727  
0.6141656787  
0.5703758478  
0.5118178805  
0.4463826116  
0.3819654919  
0.3255457487  
0.2824421162  
0.255845866  
0.2466590474  
0.2536616881  
0.2739379604  
0.303473239  
0.3378386267  
0.372823663  
0.4049502617  
0.4318001178  
0.4521306363  
