3.345929871  
4.206793673  
5.886431425  
8.307038852  
36.21364357  
3144.529265  
1472.00707  
5459.16073  
35988.71499  
6781.164387  
2504.252888  
2610.061339  
25143.0409  
4309.185447  
14709.70326  
11694.5707  
16450.92337  
31102.96799  
54190.97245  
20848.30265  
19565.60004  
15243.87542  
3665.891878  
3600.227533  
13660.87444  
25147.0771  
1964.779978  
7282.180435  
12026.54351  
823.6656332  
10620.19424  
12895.53036  
2156.994514  
4398.83775  
1809.631468  
9154.311633  
12638.08206  
13838.98299  
1233.088406  
11429.54986  
1744.143802  
4287.479286  
1072.984063  
953.4638445  
8439.285436  
1388.750811  
597.2698698  
1554.215332  
3178.97063  
5111.752163  
10709.84801  
10693.01578  
5406.852504  
1110.931288  
520.9444537  
676.43225  
2546.415518  
809.5452959  
91.40105612  
270.9598533  
2719.875669  
1436.488812  
1385.095357  
458.800642  
159.5832732  
121.6410301  
72.37433449  
66.72789096  
118.8255206  
50.81195225  
70.66871253  
21.14552209  
0.8384949185  
0.05717550348  
10.96263416  
0.4304339357  
4.474387163  
4.134592863  
4.626826444  
2.478697023  
5.688344057  
4.136248526  
0.9690411721  
2.749694736  
2.851528181  
1.990870043  
1.334298906  
2.048524482  
1.590126927  
1.351148848  
1.730553706  
1.407130744  
1.323811429  
1.36085863  
1.13251541  
1.084678156  
1.088017363  
1.030807134  
0.9201775503  
0.9563229774  
0.9221226604  
0.835617337  
0.8192404294  
0.8047587863  
0.7677889641  
0.7259659184  
0.709496893  
0.6781102627  
0.6523480844  
0.6337905726  
0.6059221252  
0.5874299983  
0.5727874153  
0.5508716492  
0.5326653364  
0.5180729473  
0.5010134318  
0.4854364082  
0.4716364386  
0.4581456311  
0.4443408338  
0.4318761548  
0.4197658732  
0.4081517019  
0.3973452583  
0.3866906273  
0.3762086384  
0.3666998386  
0.3574159649  
0.3482517847  
0.3396303196  
0.3315404654  
0.3234448585  
0.3156704907  
0.3083627357  
0.3011527409  
0.2942711246  
0.2876975317  
0.2812477098  
0.2750654757  
0.2691193522  
0.263328567  
0.2577593202  
0.25238825  
0.2471849754  
0.2421236005  
0.2372468701  
0.232538785  
0.2279587426  
0.2235294452  
0.2192393692  
0.2150696635  
0.2110242688  
0.2071166529  
0.2033153217  
0.1996190891  
0.1960404902  
0.1925612262  
0.1891797099  
0.1858940285  
0.1827016509  
0.1795954204  
0.176573564  
0.1736348077  
0.170772954  
0.1679950873  
0.1652838807  
0.1626445676  
0.1600689624  
0.1575686239  
0.1551300313  
0.1527555398  
0.1504365021  
0.1481743455  
0.1459766086  
0.143819129  
0.1417218155  
0.1396763473  
0.1376715983  
0.1357229698  
0.1338172418  
0.1319564193  
0.1301398305  
0.1283660643  
0.1266313508  
0.1249319465  
0.1232739949  
0.1216524099  
0.120066434  
0.1185188986  
0.1170031477  
0.1155200145  
0.1140629673  
0.1126486869  
0.111252234  
0.109892087  
0.1085633119  
0.1072531218  
0.1059741723  
0.1047264768  
0.1034980578  
0.1022971991  
0.1011207625  
0.09996411999  
0.09883534203  
0.09772232663  
0.09663485277  
0.09556740607  
0.0945233009  
0.09349997893  
0.0924896917  
0.09150135892  
0.09053618963  
0.08958747938  
0.08865013959  
0.08773396988  
0.08683630115  
0.08595373421  
0.08509195059  
0.0842383861  
0.08340098309  
0.08258162249  
0.08177733252  
0.08098382893  
0.0802069718  
0.07944200188  
0.07869393393  
0.07795308756  
0.07722765771  
0.07651363969  
0.07581276917  
0.07512424193  
0.07444685674  
0.07378232868  
0.07312660292  
0.07248231606  
0.07184806013  
0.07122459764  
0.07060706877  
0.07000599148  
0.06941255171  
0.06882863959  
0.06825341387  
0.06768780604  
0.067127709  
0.06658426402  
0.06604352047  
0.06551289737  
0.06498955909  
0.06447451373  
0.06396819007  
0.06347006411  
0.06297678273  
0.06249022073  
0.06201767186  
0.06154612309  
0.06108460479  
0.06062753738  
0.06017829349  
0.05973442702  
0.05930368586  
0.05887209195  
0.05844481478  
0.05803055186  
0.05762042824  
0.0572142378  
0.05681581407  
0.05642217231  
0.05603410721  
0.05564869486  
0.05527633598  
0.05490517362  
0.05453703806  
0.05417203058  
0.0538177064  
0.05346510424  
0.05312033365  
0.05277703479  
0.0524404625  
0.05210738832  
0.05178314674  
0.05145817777  
0.05113896538  
0.05081987891  
0.05051217351  
0.05020677625  
0.04989958859  
0.04960440861  
0.04931381147  
0.04902103784  
0.0487344563  
0.04845076069  
0.04817240316  
0.04789811365  
0.047625717  
0.04735436719  
0.04708791941  
0.04683184274  
0.04657196046  
0.04631887547  
0.04606340149  
0.04581758448  
0.04557116231  
0.04532856816  
0.04509187384  
0.04485492868  
0.04461889034  
0.0443907195  
0.04416359738  
0.0439407921  
0.04371938383  
0.04350275881  
0.04328476318  
0.0430733213  
0.04286283215  
0.04265296209  
0.0424493221  
0.04224416214  
0.04204593732  
0.04184864281  
0.04165047053  
0.04145777355  
0.04126762277  
0.04107883579  
0.04089258717  
0.04071311429  
0.04052544077  
0.04034883356  
0.04017343885  
0.03999519812  
0.03982624741  
0.03965498518  
0.03948581336  
0.03931989853  
0.03915614194  
0.03899278469  
0.03883127387  
0.03867556576  
0.0385169228  
0.03836081599  
0.03820966025  
0.03805945567  
0.03790817521  
0.03776097651  
0.03761542358  
0.03747044369  
0.03733062372  
0.03718892066  
0.03705153321  
0.03691235748  
0.03677730417  
0.03664502649  
0.03651060357  
0.03638159362  
0.03625038124  
0.03612594969  
0.03599852529  
0.03587279674  
0.03575029603  
0.03563034652  
0.03550863368  
0.03539142715  
0.03527236081  
0.03515592736  
0.03504581265  
0.03493196906  
0.03482168497  
0.03470947275  
0.03460129953  
0.0344945919  
0.03438836772  
0.03428213684  
0.03417885083  
0.03407611648  
0.033978613  
0.03387826376  
0.03378029535  
0.03368046381  
0.03358710509  
0.03349258416  
0.03339824978  
0.03330733036  
0.03321606541  
0.03312617577  
0.03303438216  
0.03294856888  
0.03286410446  
0.03277775413  
0.03269033343  
0.03261018849  
0.03252626092  
0.03244730084  
0.03236586168  
0.0322870166  
0.03220874439  
0.03213210507  
0.03205614348  
0.03198115063  
0.03190776734  
0.031836515  
0.03176426241  
0.03169382615  
0.03162217799  
0.03155409034  
0.03148582259  
0.03142138285  
0.03135418911  
0.03128651669  
0.03122556702  
0.03116133577  
0.03110049493  
0.03103868837  
0.03097978303  
0.03091885757  
0.03085966607  
0.030800573  
0.03074333185  
0.03068669971  
0.03063370732  
0.03058042854  
0.03052552099  
0.03047406388  
0.03042366439  
0.03037187369  
0.03032224452  
0.03027482721  
0.0302252118  
0.0301773922  
0.03012905394  
0.03008278706  
0.0300407942  
0.02999442184  
0.02995014788  
0.02990878334  
0.02986684162  
0.02982596534  
0.0297863561  
0.02974544555  
0.02970719298  
0.02967030925  
0.02963392004  
0.02959451938  
0.0295600102  
0.02952426764  
0.0294896473  
0.0294573623  
0.02942376818  
0.02939376653  
0.02936018537  
0.02933112591  
0.02930136207  
0.02927259944  
0.02924376062  
0.0292165222  
0.02918846342  
0.02916364147  
0.02913817365  
0.02911435889  
0.02908937787  
0.02906530445  
0.02904329789  
0.02902245945  
0.02899995354  
0.02897733248  
0.02895805258  
0.02894039815  
0.02892026769  
0.02890359029  
0.02888658212  
0.02886867204  
0.02885513248  
0.0288384069  
0.02882306404  
0.02881232205  
0.02879824635  
0.02878625863  
0.0287740218  
0.02876454886  
0.02875365356  
0.02874246893  
0.02873318928  
0.02872592676  
0.02871919466  
0.0287095348  
0.02870461571  
0.02869914076  
0.02869289101  
0.02869081473  
0.02868594908  
0.02868380901  
0.02868035035  
0.02867937324  
0.02867821197  
0.02867832577  
