0.2292268313  
-0.04535115914  
-0.2867213727  
-0.4653735539  
-0.5601769159  
-0.5611657299  
-0.4707634248  
-0.3033129233  
-0.08300167139  
0.1594768637  
0.3910371933  
0.5805033054  
0.7025029827  
0.7404606473  
0.6883267471  
0.5508804028  
0.3426479706  
0.08565243146  
-0.1936461685  
-0.4677714059  
-0.7115614906  
-0.9049965194  
-1.03520585  
-1.097472986  
-1.095193797  
-1.038876845  
-0.9443911347  
-0.8307265791  
-0.7175762168  
-0.6230224536  
-0.5615868013  
-0.5428096777  
-0.5704656903  
-0.6424349067  
-0.7511807911  
-0.8847360751  
-1.028062514  
-1.164632158  
-1.278082587  
-1.353792949  
-1.38025345  
-1.350122774  
-1.260882003  
-1.115039147  
-0.9198688746  
-0.686713772  
-0.4299293989  
-0.1655760871  
0.08999426264  
0.3215103896  
0.5159677902  
0.663520235  
0.7580111746  
0.7971300653  
0.7822296709  
0.7178804283  
0.6112475214  
0.4713880294  
0.3085397873  
0.1334489645  
-0.04323799072  
-0.2115229066  
-0.3625488813  
-0.4890466291  
-0.5857179188  
-0.6495378614  
-0.6799296179  
-0.6787765148  
-0.6502265858  
-0.6002873033  
-0.5362223002  
-0.4657995796  
-0.3964699402  
-0.3345678526  
-0.284630459  
-0.2489166848  
-0.2271896713  
-0.2167792909  
-0.2129245278  
-0.2093608027  
-0.1990795988  
-0.1751939581  
-0.1318206134  
-0.06489851734  
0.02714817416  
0.1429667222  
0.2781249905  
0.4252921211  
0.5747710914  
0.7153639739  
0.8355151373  
0.9246150601  
0.974328439  
0.9797719552  
0.9403590554  
0.8601712521  
0.7477510048  
0.6152992672  
0.4773461203  
0.3490497218  
0.2443535577  
0.1742451319  
0.1453855483  
0.1592949618  
0.2122246863  
0.2957213212  
0.3977977401  
0.5045274602  
0.6018248781  
0.6771649313  
0.7210039219  
0.7277485684  
0.6961695643  
0.629272741  
0.5336939189  
0.4187489628  
0.295291469  
0.1745348501  
0.06696281278  
-0.01857415172  
-0.07553312945  
-0.1001021992  
-0.09138554947  
-0.05137294189  
0.01528931287  
0.1016978164  
0.1992577538  
0.2983839749  
0.3893204757  
0.4630230091  
0.5120412259  
0.5313083971  
0.5187416495  
0.4755572032  
0.4062247574  
0.3180322958  
0.2202800245  
0.1231776041  
0.03658303871  
-0.03125887688  
-0.07479101991  
-0.09187325904  
-0.08404311267  
-0.05625941397  
-0.01614956953  
0.02712874599  
0.06424825744  
0.08708085579  
0.08986785017  
0.06999967949  
0.02829243436  
-0.03128840025  
-0.1023979662  
-0.1774496444  
-0.2489180582  
-0.3105920424  
-0.3585623332  
-0.3917750455  
-0.4120649426  
-0.4236607085  
-0.4322521294  
-0.4437895173  
-0.4632115632  
-0.4933411371  
-0.5341289523  
-0.5823907608  
-0.6320881284  
-0.6751122526  
-0.7024508899  
-0.7055515835  
-0.6776591531  
-0.614918156  
-0.5170622104  
-0.3875897534  
-0.2334060055  
-0.06399606599  
0.1097342361  
0.2767648589  
0.4272217882  
0.5534140269  
0.6505210912  
0.716856055  
0.7537105762  
0.7648364553  
0.7556684244  
0.7324099268  
0.7011123662  
0.6668593695  
0.6331419965  
0.6014860633  
0.571354881  
0.5403211118  
0.5044903794  
0.4591191939  
0.3993650527  
0.3210840411  
0.2215866581  
0.1002543034  
-0.04107091394  
-0.1979904771  
-0.363781428  
-0.5299486749  
-0.6870411473  
-0.825637696  
-0.9373678373  
-1.015833523  
-1.057297099  
-1.061044109  
-1.029374303  
-0.967227458  
-0.8815231633  
-0.780313035  
-0.6718807643  
-0.5639172292  
-0.4628686497  
-0.3735214885  
-0.2988296963  
-0.2399627568  
-0.1965032841  
-0.1667393186  
-0.1479790903  
-0.1368519725  
-0.1295885543  
-0.1222821858  
-0.1111609269  
-0.09288629077  
-0.06488204561  
-0.02567282939  
0.02481560841  
0.08505262102  
0.1518521865  
0.2205251339  
0.2852382789  
0.3395560799  
0.3771019288  
0.3922554548  
0.3807882923  
0.3403604285  
0.2708223217  
0.1743015566  
0.0550886486  
-0.08063540617  
-0.2251902233  
-0.3698505245  
-0.5053455154  
-0.6223879486  
-0.7122418902  
-0.7673364425  
-0.78192553  
-0.7527562583  
-0.6796925212  
-0.5661868543  
-0.4194960298  
-0.2505231224  
-0.07320948459  
0.09654339731  
0.2423737398  
0.3492413022  
0.4052920045  
0.4035503734  
0.3431837962  
0.2301139208  
0.07681863548  
-0.09871516093  
-0.27482432  
-0.4285902456  
-0.5385643506  
-0.5874468201  
-0.5643623585  
-0.466404708  
-0.2992127855  
-0.0764674841  
0.1816620392  
0.4509451974  
0.7060846476  
0.9238823466  
1.086151628  
1.181964924  
1.20892158  
1.173252625  
1.08874074  
0.9746126645  
0.8527072488  
0.744333655  
0.6672750606  
0.633372504  
0.6470270468  
0.7048273303  
0.7963271904  
0.905833731  
1.014924796  
1.105297463  
1.161527558  
1.173333168  
1.137019878  
1.055918446  
0.9397753802  
0.8032127114  
0.6635147652  
0.5380824415  
0.4419439127  
0.3856847597  
0.3740889109  
0.4056571929  
0.4730413734  
0.5642852276  
0.6646488317  
0.75872272  
0.8325098906  
0.8751779912  
0.8802530709  
0.846129412  
0.7758682184  
0.6763691417  
0.5570779425  
0.4284466395  
0.3003781443  
0.1808838145  
0.0751241899  
-0.01504497309  
-0.09098379717  
-0.1566765026  
-0.2177467654  
-0.2802537153  
-0.3494639278  
-0.4288168359  
-0.5192460426  
-0.6189851541  
-0.7238850168  
-0.8281882003  
-0.9256174756  
-1.010579555  
-1.07924476  
-1.130296402  
-1.165194926  
-1.187889439  
-1.204022456  
-1.219766715  
-1.240518029  
-1.269688045  
-1.307843629  
-1.352360574  
-1.397678817  
-1.436133119  
-1.459210486  
-1.459040938  
-1.429847147  
-1.369119913  
-1.278311629  
-1.162939216  
-1.032070206  
-0.8972762304  
-0.7712068922  
-0.6659857256  
-0.5916579215  
-0.5548897512  
-0.5580854141  
-0.5990245952  
-0.6710549988  
-0.7638080564  
-0.8643509475  
-0.9586332225  
-1.033065549  
-1.076049668  
-1.079289528  
-1.038730565  
-0.9550176221  
-0.8334180779  
-0.68320477  
-0.5165734127  
-0.3472161789  
-0.1887193908  
-0.05298281514  
0.05114547597  
0.1188539159  
0.1498481771  
0.1482771419  
0.1221258626  
0.08215922485  
0.04056682319  
0.009484588036  
-0.0004089772561  
0.01894411243  
0.07220991646  
0.1603537795  
0.2808214511  
0.4281563467  
0.594944444  
0.7729401513  
0.9541900188  
1.131993776  
1.301552502  
1.460222235  
1.607351942  
1.743755603  
1.870935254  
1.990214312  
2.101953069  
2.205001272  
2.296494842  
2.372035379  
2.426219877  
2.45341215  
2.448614071  
2.408271496  
2.330871495  
2.217230964  
2.070441654  
1.895501669  
1.698717897  
1.487003807  
1.267193766  
1.045483794  
0.8270680102  
0.6159905704  
0.4151839651  
0.2266357568  
0.05160812589  
-0.1091599899  
-0.2553159707  
-0.3868355568  
-0.5040317378  
-0.6075803362  
-0.6985252404  
-0.778206522  
-0.8481013877  
-0.9095795054  
-0.9636171366  
-1.010537115  
-1.049839806  
-1.080193279  
-1.099613076  
-1.105824379  
-1.096757958  
-1.071085494  
-1.028693565  
-0.9709812764  
-0.9009103829  
-0.8227659303  
-0.7416571082  
-0.6628348777  
-0.590941878  
-0.5293388483  
-0.4796259515  
-0.4414532262  
-0.4126522923  
-0.3896647603  
-0.3681869726  
-0.3439142847  
-0.3132581243  
-0.2739209545  
-0.2252452189  
-0.168300052  
-0.105716424  
-0.04130636749  
0.02045261641  
0.07499834364  
0.1182434313  
0.1470566815  
0.1596100292  
0.1555625033  
0.136059387  
0.1035532671  
0.06146146103  
0.01369451924  
-0.03588125524  
-0.08398334143  
-0.1283681525  
-0.1681234465  
-0.2037447652  
-0.2369587297  
-0.2703141798  
-0.3066009417  
-0.3481904776  
-0.3964264755  
-0.451178759  
-0.510665686  
-0.5715889473  
-0.6295762828  
-0.6798585272  
-0.7180714808  
-0.7410215864  
-0.7472856603  
-0.7375153026  
-0.7143850886  
-0.6821858193  
-0.6461220503  
-0.6114364661  
-0.5825013906  
-0.5620367817  
-0.5505740449  
-0.5462593057  
-0.5450136435  
-0.5410324274  
-0.527542876  
-0.4977025378  
-0.4455253451  
-0.3667050593  
-0.2592371444  
-0.1237701949  
0.03635212617  
0.2153533532  
0.4055539828  
0.5981058512  
0.7838394446  
0.9541187897  
1.101599927  
1.220795896  
1.308373406  
1.363145745  
1.385771296  
1.37821993  
1.343105349  
1.283020092  
1.200007397  
1.095292433  
0.9693350879  
0.8222223213  
0.6543259686  
0.4671002509  
0.2638454834  
0.05025095505  
-0.1654403191  
-0.3727501761  
-0.5597814335  
-0.7144579446  
-0.8260266523  
-0.8865955793  
-0.8924588167  
-0.8449706879  
-0.7507953414  
-0.6214376843  
-0.4720741377  
-0.3198139896  
-0.1816094185  
-0.07209352589  
-0.001651643604  
0.02500092936  
0.009519050964  
-0.04020425309  
-0.1110002528  
-0.1861054554  
-0.2473449622  
-0.2775343931  
-0.2627935788  
-0.1944612374  
-0.07037389478  
0.1046664442  
0.3192930101  
0.5567954142  
0.797007496  
1.018631087  
1.201698673  
1.32988387  
1.392372707  
1.385071758  
1.311022993  
1.179978456  
1.007203354  
0.8116671024  
0.6138480368  
0.4334316363  
0.2871790682  
0.1872277454  
0.1400141129  
0.1459287863  
0.199718837  
0.2915421516  
0.4084978077  
0.536395986  
0.6615192362  
0.7721098875  
0.8594282205  
0.9182472674  
0.9467908364  
0.946182039  
0.9195525212  
0.8710026775  
0.8046022594  
0.7236012785  
0.629972442  
0.5243341118  
0.4062353443  
0.274734771  
0.1291484909  
-0.03018304224  
-0.2012430348  
-0.3799421441  
-0.5600554694  
-0.7335389817  
-0.8911950185  
-1.023617301  
-1.122284919  
-1.180656661  
-1.195102512  
-1.165533372  
-1.095623311  
-0.9925823523  
-0.8664923492  
-0.729294799  
-0.5935440839  
-0.4710941919  
-0.3718847777  
-0.3029700437  
-0.2679125223  
-0.2666157794  
-0.2955990239  
-0.3486825233  
-0.4179855544  
-0.4951044683  
-0.5723162363  
-0.6436405191  
-0.7056108055  
-0.7576412087  
-0.8019213271  
-0.8428391985  
-0.8860046091  
-0.9370042126  
-1.000079237  
-1.076936576  
-1.165901682  
-1.26158928  
-1.355190758  
-1.43538875  
-1.489804719  
-1.506792937  
-1.477315179  
-1.396597541  
-1.265285687  
-1.089875751  
-0.8822938952  
-0.6586372672  
-0.4372238761  
-0.2362126951  
-0.07114267281  
0.04722635453  
0.1144341887  
0.1329382389  
0.1117099338  
0.06484774245  
0.009394219789  
-0.03731179778  
-0.06034812587  
-0.04956056526  
-0.0011723293  
0.08159962377  
0.1890428782  
0.3064847929  
0.4166268152  
0.5023110359  
0.5492665605  
0.5484014895  
0.4972641039  
0.4004416877  
0.2688421159  
0.1179913416  
-0.03435904154  
-0.1709058719  
-0.2772992011  
-0.3440664638  
-0.3676537025  
-0.3504367546  
-0.2997477189  
-0.2261110735  
-0.1410459049  
-0.05482162446  
0.02542444626  
0.09689549755  
0.1614827271  
0.2252232124  
0.2970110993  
0.3868198719  
0.5037817767  
0.654470058  
0.8416765098  
1.063874891  
1.315408331  
1.587316715  
1.868591554  
2.147595254  
2.413368255  
2.656592775  
2.870098682  
3.048880578  
3.189727628  
3.290637963  
3.350215699  
3.367242909  
3.340544818  
3.26918109  
3.152906736  
2.99276644  
2.791651213  
2.554651946  
2.289083941  
2.004141343  
1.710208235  
1.417938639  
1.137243899  
0.8763654671  
0.6411589924  
0.4346875557  
0.2571602049  
0.1061842546  
-0.02273124582  
-0.13551836  
-0.238834998  
-0.3393720601  
-0.4432461841  
-0.5555087021  
-0.6797798657  
-0.8180074257  
-0.9703328322  
-1.135055989  
-1.3086888  
-1.486101304  
-1.66076471  
-1.825104093  
-1.97096959  
-2.090224024  
-2.175434368  
-2.220625018  
-2.22202283  
-2.178713991  
-2.093103242  
-1.971077555  
-1.821803721  
-1.65712276  
-1.490574746  
-1.336134426  
-1.206819418  
-1.113342451  
-1.063004166  
-1.058987026  
-1.100154757  
-1.181380548  
-1.294345369  
-1.428663203  
-1.573147928  
-1.717012781  
-1.850821544  
-1.967066971  
-2.060325312  
-2.127030363  
-2.164976731  
-2.1727212  
-2.149054122  
-2.0927001  
-2.002347496  
-1.877020568  
-1.716742313  
-1.523342358  
-1.301230276  
-1.05792846  
-0.8041985249  
-0.5536342195  
-0.3216988974  
-0.1242678526  
0.02416511521  
0.1123830152  
0.1341736147  
0.08962275989  
-0.01426202901  
-0.1637373699  
-0.3393635703  
-0.5178176765  
-0.6742851545  
-0.7851447068  
-0.830610798  
-0.7969758395  
-0.6781620475  
-0.4763513401  
-0.2016136196  
0.1294257688  
0.4956872102  
0.8742131966  
1.242852216  
1.58266982  
1.879763154  
2.126237155  
2.320253985  
2.465193714  
2.568112139  
2.637778612  
2.682628684  
2.708966936  
2.719695604  
2.713762828  
2.686386926  
2.63001222  
2.535830607  
2.395622976  
2.203644808  
1.958263284  
1.66309913  
1.327493385  
0.9662099565  
0.5983737136  
0.2457654389  
-0.06934843598  
-0.3265871177  
-0.5097448993  
-0.608715414  
-0.6207984364  
-0.5512161211  
-0.4127550384  
-0.2245574869  
-0.01018914299  
0.2047903249  
0.3954786542  
0.5401915226  
0.6226433373  
0.6335102064  
0.5712179136  
0.441894591  
0.2585277477  
0.03944995144  
-0.1936496911  
-0.4179645771  
-0.6118106471  
-0.7566516627  
-0.8387174944  
-0.8500890585  
-0.7891768968  
-0.660582688  
-0.4743950666  
-0.2450151171  
0.01035491371  
0.2734077011  
0.5264399234  
0.7539127603  
0.9437199545  
1.088039294  
1.183692288  
1.23198598  
1.238062626  
1.209853352  
1.156774026  
1.088341446  
1.012902761  
0.9366492628  
0.8630429005  
0.7927172957  
0.7238382114  
0.6528248309  
0.5752885501  
0.4870182738  
0.3848359708  
0.2672042361  
0.1345143477  
-0.01094614513  
-0.1652817764  
-0.3234471797  
-0.4797573288  
-0.6283648276  
-0.763641373  
-0.8804561609  
-0.9743622168  
-1.041740078  
-1.079947529  
-1.087499333  
-1.064291325  
-1.011839714  
-0.9334850556  
-0.8345029033  
-0.722054707  
-0.6049339444  
-0.4930882674  
-0.396919541  
-0.3264079953  
-0.2901233493  
-0.294222213  
-0.3415414503  
-0.4309127795  
-0.5568259987  
-0.7095504611  
-0.8757804748  
-1.039838531  
-1.185366323  
-1.297366226  
-1.364358199  
-1.380358325  
-1.346333225  
-1.270823812  
-1.169498103  
-1.06353144  
-0.9769000387  
-0.9328607599  
-0.9500821527  
-1.039003869  
-1.199048774  
-1.417239515  
-1.668595062  
-1.918434601  
-2.12639826  
-2.251707064  
-2.258939382  
-2.123473532  
-1.835753705  
-1.403678645  
-0.8526825206  
-0.2234334281  
0.4325891417  
1.059024284  
1.601260278  
2.012841393  
2.260803087  
2.329243341  
2.220733307  
1.955471588  
1.568412714  
1.104849005  
0.6150984027  
0.1490129884  
-0.2490221388  
-0.5440539647  
-0.7131431287  
-0.7464186452  
-0.6466736769  
-0.4277337421  
-0.1119541793  
0.2727599433  
0.6960149842  
1.127728815  
1.540428185  
1.910900286  
2.221165515  
2.458826303  
2.616915589  
2.693403826  
2.690518361  
2.614015074  
2.472482208  
2.276717465  
2.039158491  
1.773321094  
1.493179217  
1.212451906  
0.9437743382  
0.6978092575  
0.4823776926  
0.301738732  
0.1561620799  
0.04191019704  
-0.04829938833  
-0.1243412516  
-0.1973243942  
-0.2779790266  
-0.3750011809  
-0.4935948874  
-0.6344390178  
-0.7932604207  
-0.9611176292  
-1.125391247  
-1.271381284  
-1.384303019  
-1.451410761  
-1.463936617  
-1.418550065  
-1.318099918  
-1.171500662  
-0.9927483898  
-0.7991893946  
-0.6092748936  
-0.4401292117  
-0.3052881092  
-0.2129415179  
-0.1649493137  
-0.1567747574  
-0.1783428695  
-0.2156958719  
-0.2531870137  
-0.27589196  
-0.2718713419  
-0.2339535066  
-0.1607856125  
-0.05700678856  
0.06746389669  
0.1989011861  
0.3217765934  
0.4209870282  
0.4839748417  
0.502438961  
0.4733987799  
0.3994845933  
0.2884374086  
0.151929725  
0.003902703962  
