,/home/mpib/LNDG/StateSwitch/WIP_rest/preproc/B_data/D_preproc/1240/preproc/rest/FEAT.feat/,1
,/home/mpib/LNDG/StateSwitch/WIP_rest/preproc/B_data/D_preproc/1240/preproc/rest/FEAT.feat/,2
,/home/mpib/LNDG/StateSwitch/WIP_rest/preproc/B_data/D_preproc/1240/preproc/rest/FEAT.feat/,3
,/home/mpib/LNDG/StateSwitch/WIP_rest/preproc/B_data/D_preproc/1240/preproc/rest/FEAT.feat/,4
,/home/mpib/LNDG/StateSwitch/WIP_rest/preproc/B_data/D_preproc/1240/preproc/rest/FEAT.feat/,5
,/home/mpib/LNDG/StateSwitch/WIP_rest/preproc/B_data/D_preproc/1240/preproc/rest/FEAT.feat/,6
,/home/mpib/LNDG/StateSwitch/WIP_rest/preproc/B_data/D_preproc/1240/preproc/rest/FEAT.feat/,7
,/home/mpib/LNDG/StateSwitch/WIP_rest/preproc/B_data/D_preproc/1240/preproc/rest/FEAT.feat/,8
,/home/mpib/LNDG/StateSwitch/WIP_rest/preproc/B_data/D_preproc/1240/preproc/rest/FEAT.feat/,9
,/home/mpib/LNDG/StateSwitch/WIP_rest/preproc/B_data/D_preproc/1240/preproc/rest/FEAT.feat/,10
,/home/mpib/LNDG/StateSwitch/WIP_rest/preproc/B_data/D_preproc/1240/preproc/rest/FEAT.feat/,11
,/home/mpib/LNDG/StateSwitch/WIP_rest/preproc/B_data/D_preproc/1240/preproc/rest/FEAT.feat/,12
,/home/mpib/LNDG/StateSwitch/WIP_rest/preproc/B_data/D_preproc/1240/preproc/rest/FEAT.feat/,13
,/home/mpib/LNDG/StateSwitch/WIP_rest/preproc/B_data/D_preproc/1240/preproc/rest/FEAT.feat/,14
,/home/mpib/LNDG/StateSwitch/WIP_rest/preproc/B_data/D_preproc/1240/preproc/rest/FEAT.feat/,15
,/home/mpib/LNDG/StateSwitch/WIP_rest/preproc/B_data/D_preproc/1240/preproc/rest/FEAT.feat/,16
,/home/mpib/LNDG/StateSwitch/WIP_rest/preproc/B_data/D_preproc/1240/preproc/rest/FEAT.feat/,17
,/home/mpib/LNDG/StateSwitch/WIP_rest/preproc/B_data/D_preproc/1240/preproc/rest/FEAT.feat/,18
,/home/mpib/LNDG/StateSwitch/WIP_rest/preproc/B_data/D_preproc/1240/preproc/rest/FEAT.feat/,19
,/home/mpib/LNDG/StateSwitch/WIP_rest/preproc/B_data/D_preproc/1240/preproc/rest/FEAT.feat/,20
,/home/mpib/LNDG/StateSwitch/WIP_rest/preproc/B_data/D_preproc/1240/preproc/rest/FEAT.feat/,21
,/home/mpib/LNDG/StateSwitch/WIP_rest/preproc/B_data/D_preproc/1240/preproc/rest/FEAT.feat/,22
,/home/mpib/LNDG/StateSwitch/WIP_rest/preproc/B_data/D_preproc/1240/preproc/rest/FEAT.feat/,23
,/home/mpib/LNDG/StateSwitch/WIP_rest/preproc/B_data/D_preproc/1240/preproc/rest/FEAT.feat/,24
,/home/mpib/LNDG/StateSwitch/WIP_rest/preproc/B_data/D_preproc/1240/preproc/rest/FEAT.feat/,25
,/home/mpib/LNDG/StateSwitch/WIP_rest/preproc/B_data/D_preproc/1240/preproc/rest/FEAT.feat/,26
,/home/mpib/LNDG/StateSwitch/WIP_rest/preproc/B_data/D_preproc/1240/preproc/rest/FEAT.feat/,27