-1.194137705  
-1.299490747  
-1.406105902  
-1.502568029  
-1.578231426  
-1.624774494  
-1.637540947  
-1.616482124  
-1.566566265  
-1.497551546  
-1.423110832  
-1.35935423  
-1.32285969  
-1.328410796  
-1.386654579  
-1.501943505  
-1.670640524  
-1.880129373  
-2.108751944  
-2.326812514  
-2.498697723  
-2.58602313  
-2.551581002  
-2.363734407  
-2.000769912  
-1.454659363  
-0.7336861736  
0.1365239066  
1.113895804  
2.142769203  
3.15856316  
4.093784567  
4.884697507  
5.47787729  
5.835796139  
5.940753362  
5.796618162  
5.428176434  
4.878177394  
4.202483049  
3.463940694  
2.72577815  
2.045314233  
1.468692732  
1.027205449  
0.7354932309  
0.5916732576  
0.5792126741  
0.6701581486  
0.8292169685  
1.018160937  
1.200027932  
1.342705209  
1.421596947  
1.421214131  
1.335665834  
1.168132037  
0.929517  
0.6365039354  
0.3092944311  
-0.03070465492  
-0.3629957177  
-0.6697127936  
-0.9368228923  
-1.154750434  
-1.318449798  
-1.427019903  
-1.483008828  
-1.491558915  
-1.459557868  
-1.394912553  
-1.30600286  
-1.201324295  
-1.089270772  
-0.9779793737  
-0.8751381023  
-0.7877124439  
-0.7215526691  
-0.6809101426  
-0.6679418313  
-0.6823031474  
-0.7209314374  
-0.7781061037  
-0.8458306393  
-0.9145140381  
-0.9738833179  
-1.014011343  
-1.02631172  
-1.00437943  
-0.9445621903  
-0.8462053909  
-0.7115665751  
-0.5454603717  
-0.3547014089  
-0.1474792169  
0.06725731048  
0.2803182911  
0.4826622755  
0.6656687202  
0.8213407533  
0.9424926546  
1.023002375  
1.058151647  
1.045068435  
0.9832082243  
0.874793324  
0.7250991791  
0.5424729705  
0.3380062725  
0.1248077404  
-0.08305088716  
-0.2718637765  
-0.4297056811  
-0.5477717632  
-0.6214218416  
-0.6507898361  
-0.6408294449  
-0.6007593601  
-0.5429651589  
-0.4814680613  
-0.4301681206  
-0.4010847804  
-0.4028302886  
-0.4395316277  
-0.51033358  
-0.6095600076  
-0.7274955066  
-0.8516772072  
-0.968506326  
-1.064963864  
-1.130179397  
-1.156665952  
-1.141055102  
-1.084274355  
-0.9911548918  
-0.8695806054  
-0.7293148695  
-0.5806975641  
-0.4334063635  
-0.2954386471  
-0.1724568036  
-0.06753162414  
0.01871681047  
0.08763527138  
0.1418548149  
0.1845101663  
0.2185265514  
0.2460808515  
0.2683203091  
0.285373374  
0.2966411908  
0.3012901231  
0.2988520115  
0.2897911702  
0.2759172676  
0.260526698  
0.2482098435  
0.2443137542  
0.2541053888  
0.281752944  
0.3292778517  
0.395662228  
0.4762857915  
0.5628326014  
0.643767336  
0.7053740728  
0.733290312  
0.7143885131  
0.6387562735  
0.5015343172  
0.3043229316  
0.05591758792  
-0.2278018732  
-0.5249114808  
-0.8093727928  
-1.053667294  
-1.231867644  
-1.322767584  
-1.312656161  
-1.197339003  
-0.983097699  
-0.6863884343  
-0.3322642805  
0.04833343443  
0.42208081  
0.7571393267  
1.026880018  
1.212955455  
1.307323368  
1.312938935  
1.243036995  
1.119108686  
0.9678662068  
0.8176156437  
0.6945485154  
0.6194300568  
0.6051485868  
0.6553940632  
0.7646281577  
0.9192740934  
1.099921962  
1.28417944  
1.449736742  
1.57721404  
1.652377056  
1.667468793  
1.6215135  
1.519641631  
1.371611676  
1.189831203  
0.9872364913  
0.7753780539  
0.5630215652  
0.3554366466  
0.154461262  
-0.04075627282  
-0.2325054847  
-0.4230395938  
-0.6131671274  
-0.8011973378  
-0.982451934  
-1.149431326  
-1.292631576  
-1.401857835  
-1.467806021  
-1.483637937  
-1.446271836  
-1.357163998  
-1.22246708  
-1.052522367  
-0.8607991121  
-0.6624341748  
-0.4725926753  
-0.3048866015  
-0.1700526425  
-0.07501913202  
-0.02245807091  
-0.01082175937  
-0.03479985411  
-0.08611839145  
-0.1545429904  
-0.2289691552  
-0.2984807717  
-0.3532900525  
-0.3854810933  
-0.3895363705  
-0.3626079132  
-0.3045671984  
-0.2178399763  
-0.1070708267  
0.02132840508  
0.1597086186  
0.2997249819  
0.432866666  
0.5509115646  
0.6463194914  
0.7125356178  
0.7442215695  
0.7374331452  
0.6897590039  
0.6004432621  
0.4705003356  
0.3028078756  
0.1021744806  
-0.1246602476  
-0.3691267289  
-0.6210518226  
-0.8690494762  
-1.101066678  
-1.305069375  
-1.469826614  
-1.585720003  
-1.645514968  
-1.645000874  
-1.58345716  
-1.463871614  
-1.292901705  
-1.080557642  
-0.8396318206  
-0.5848817781  
-0.3320264906  
-0.09660152585  
0.1072599713  
0.2680165874  
0.3777899158  
0.43318962  
0.4357936547  
0.3921842471  
0.3134723262  
0.2143167016  
0.1114725188  
0.02200838877  
-0.03863692022  
-0.05852887358  
-0.03078447381  
0.04542511776  
0.1646078368  
0.3154975928  
0.4823981622  
0.6471911161  
0.7917430469  
0.9004039827  
0.9622209638  
0.9725455946  
0.9337580337  
0.8549750975  
0.7507492367  
0.6389180776  
0.53789586  
0.4638156542  
0.4279391566  
0.4347481762  
0.4810213783  
0.5560762097  
0.6431661293  
0.7218502591  
0.7710098982  
0.7720684885  
0.7119487253  
0.5852963758  
0.3956652334  
0.1554313044  
-0.1155435812  
-0.3923331558  
-0.6481277416  
-0.8576903937  
-1.000644004  
-1.06409226  
-1.044223308  
-0.9466927876  
-0.7857528218  
-0.5822729762  
-0.3609680943  
-0.1472272031  
0.03600739418  
0.1709024517  
0.2465993806  
0.2600998991  
0.2161138  
0.1259718595  
0.005808942149  
-0.1256701372  
-0.2495426983  
-0.3488178128  
-0.4101591926  
-0.4250142971  
-0.390113879  
-0.3073469054  
-0.1831488396  
-0.02752406233  
0.1471207865  
0.3271977598  
0.4990856532  
0.6501349358  
0.7694955613  
0.8487555409  
0.882402192  
0.8681097735  
0.806867904  
0.7029331715  
0.5635889143  
0.3986935887  
0.2200075474  
0.04032507627  
-0.1275635704  
-0.271964034  
-0.3833526208  
-0.455267994  
-0.4849286371  
-0.4734605839  
-0.4257014706  
-0.349571151  
-0.2551008504  
-0.1532296464  
-0.0545447527  
0.03186759322  
0.09930963179  
0.1439717417  
0.1650254559  
0.1643071892  
0.1457113975  
0.1143929559  
0.07596741655  
0.03580073696  
-0.001481900925  
-0.03225570824  
-0.0539340371  
-0.0648491916  
-0.06406827414  
-0.05121947349  
-0.02640124799  
0.009815135491  
0.05629516554  
0.1112286369  
0.17204063  
0.2353940461  
0.297327695  
0.3535203862  
0.3996647842  
0.4318889992  
0.447149051  
0.4435437878  
0.4204734102  
0.3786398179  
0.3198921173  
0.2469596795  
0.1631448225  
0.072028336  
-0.02274351686  
-0.1175598754  
-0.2088559048  
-0.2930593195  
-0.3665497491  
-0.4256921058  
-0.4670043872  
-0.4874941843  
-0.4851184521  
-0.4593016502  
-0.4114217754  
-0.3451165017  
-0.2663157632  
-0.1829261386  
-0.1041499581  
-0.03950615959  
0.002335282766  
0.01472473958  
-0.005981978585  
-0.05979747744  
-0.1429672164  
-0.2483724773  
-0.3664378074  
-0.4864012369  
-0.5977595055  
-0.6916546933  
-0.7619730916  
-0.8059891704  
-0.8244554693  
-0.8211518767  
-0.8019851336  
-0.7738262724  
-0.7432858202  
-0.7156531295  
-0.6941639082  
-0.6796944334  
-0.6709057939  
-0.6647509932  
-0.6572295275  
-0.6441968446  
-0.6220759621  
-0.5883431732  
-0.5417076698  
-0.4820134067  
-0.4099311743  
-0.3265695268  
-0.2331323005  
-0.1307357613  
-0.02043195557  
0.09657108417  
0.2185861781  
0.3431318801  
0.4667636614  
0.5851587964  
0.6934755241  
0.7869824379  
0.8618136168  
0.9157198663  
0.9486237247  
0.9628299013  
0.962811589  
0.9545496704  
0.9445318626  
0.9385653831  
0.9406214867  
0.951940932  
0.9705793993  
0.9915292473  
1.007416845  
1.009708704  
0.9902267866  
0.9427352973  
0.8643203903  
0.7563065996  
0.6245269649  
0.4788742539  
0.3321692172  
0.1984976706  
0.09127935982  
0.02135052287  
-0.004623888773  
0.01481378872  
0.07560176941  
0.1686052323  
0.2807404355  
0.3966018585  
0.5003495484  
0.5775795129  
0.6169271609  
0.611200576  
0.5579435352  
0.4593772734  
0.3218275764  
0.1547461907  
-0.03047708541  
-0.2217316997  
-0.4072634255  
-0.5765123287  
-0.7206386971  
-0.8327756385  
-0.9080494266  
-0.9434630832  
-0.9377420307  
-0.891217949  
-0.8057994574  
-0.6850332542  
-0.5342307199  
-0.3605887121  
-0.1732318093  
0.01691848797  
0.197508111  
0.3553918645  
0.4775461453  
0.5521929561  
0.5700374412  
0.5254588901  
0.4175004758  
0.250473637  
0.03404308631  
-0.2172886892  
-0.4853169984  
-0.7497914075  
-0.9904341013  
-1.189070013  
-1.331598225  
-1.409514663  
-1.420760095  
-1.36975371  
-1.266581191  
-1.125456034  
-0.9626779756  
-0.7943947214  
-0.6345175219  
-0.4931074304  
-0.3754616304  
-0.282011386  
-0.2090068288  
-0.1498072905  
-0.09653360846  
-0.04175613917  
0.02006973166  
0.09165362221  
0.1725386376  
0.2593816474  
0.346733287  
0.4281309072  
0.4972610684  
0.5489651785  
0.5799181687  
0.5889004751  
0.576660849  
0.5454682909  
0.4984979796  
0.4392058352  
0.3708445121  
0.2961973587  
0.217560935  
0.1369317423  
0.05630509822  
-0.02203894645  
-0.09536315586  
-0.1604996149  
-0.2140966192  
-0.253049459  
-0.2750289931  
-0.2789802836  
-0.2654757181  
-0.2368127643  
-0.1968002442  
-0.1502623381  
-0.1023240083  
-0.05761035171  
-0.01951831971  
0.01030842809  
0.03219236574  
0.04829139171  
0.06214833568  
0.07800993517  
0.1000445409  
0.1315930629  
0.1745758869  
0.22912546  
0.2934939945  
0.3642166409  
0.4364869279  
0.5046919176  
0.5630347538  
0.6061769997  
0.6298589159  
0.6314349974  
0.6102831231  
0.5680410297  
0.50861899  
0.4379670979  
0.3635704728  
0.293694468  
0.2364320411  
0.1986391015  
0.1848767447  
0.1965171909  
0.2311497925  
0.2824282266  
0.3404453763  
0.3926612045  
0.4253451127  
0.4253908394  
0.3822909395  
0.2900104115  
0.1484725031  
-0.03562359981  
-0.2488376036  
-0.4719797222  
-0.6820015922  
-0.8546125853  
-0.9672937263  
-1.002312009  
-0.9493096405  
-0.8070725635  
-0.5841792372  
-0.2984048057  
0.02508902366  
0.3565703757  
0.6651781014  
0.9225486343  
1.10612927  
1.201730516  
1.204983116  
1.121492468  
0.9656990121  
0.7586106793  
0.5247408817  
0.2886958682  
0.07191761882  
-0.1099618619  
-0.2487711238  
-0.3442395741  
-0.4031956752  
-0.437684223  
-0.4623490409  
-0.4915083199  
-0.5364134436  
-0.6031327353  
-0.6913822036  
-0.7944606188  
-0.9002757144  
-0.9932445432  
-1.056755335  
-1.075769295  
-1.039171578  
-0.9415113975  
-0.7839067071  
-0.5740350652  
-0.3252549117  
-0.05505504937  
0.2169134068  
0.4709181013  
0.6890569185  
0.8568044578  
0.9640377569  
1.005530426  
0.9809498339  
0.8944602628  
0.7540638289  
0.570792495  
0.3578560169  
0.1297805086  
-0.09842091206  
-0.3120622659  
-0.4976093523  
-0.6434974226  
-0.7409437769  
-0.7846922843  
-0.7736098809  
-0.7110366102  
-0.604782359  
-0.4666800108  
-0.3116758516  
-0.1564595133  
-0.01775471182  
0.08956487104  
0.1543033253  
0.1704492822  
0.138130852  
0.06380588372  
-0.04038728912  
-0.1581244368  
-0.2710786474  
-0.3615344748  
-0.415099699  
-0.4231077058  
-0.384363573  
-0.3058941711  
-0.2025338678  
-0.0952943834  
-0.008658313228  
0.03290076704  
0.008723048226  
-0.09443480486  
-0.2795750201  
-0.5378625824  
-0.8486423548  
-1.181158521  
-1.497867988  
-1.758960707  
-1.927482969  
-1.974359971  
-1.882558034  
-1.649775062  
-1.289210808  
-0.8282838288  
-0.3054623736  
0.2343458509  
0.7451837146  
1.185463961  
1.522663253  
1.736700513  
1.82159422  
1.785277972  
1.647699146  
1.437575222  
1.18830575  
0.9336449772  
0.7036908215  
0.5216909159  
0.4019741456  
0.3491851461  
0.3587863653  
0.4186528089  
0.5114543512  
0.6174610703  
0.7173880931  
0.7949130347  
0.8385967116  
0.8429997635  
0.8089257906  
0.7428266567  
0.6554812555  
0.5601802656  
0.4706455394  
0.3989798624  
0.3538927973  
0.3394316023  
0.3543597857  
0.3922648375  
0.4423820099  
0.4910275172  
0.5234764649  
0.5260511391  
0.488139883  
0.4039002108  
0.2733776916  
0.1028804217  
-0.09548815123  
-0.3051026241  
-0.5067724805  
-0.6811215145  
-0.8110842324  
-0.884166934  
-0.8941494963  
-0.841976512  
-0.7356930865  
-0.589425136  
-0.4215371817  
-0.2522255685  
-0.100874056  
0.01645414344  
0.08905732654  
0.1128929573  
0.09098067199  
0.03287256652  
-0.04671057031  
-0.1298813688  
-0.1979357669  
-0.2337492942  
-0.2239047591  
-0.1602952621  
-0.04102674425  
0.1294602128  
0.3410231743  
0.5790867796  
0.8263541021  
1.064735712  
1.277233441  
1.449581211  
1.571446814  
1.637089429  
1.645441871  
1.599643748  
1.506136659  
1.373472986  
1.211014553  
1.027712537  
0.8311209935  
0.6267810198  
0.4180183227  
0.2061722407  
-0.008829255083  
-0.227637232  
-0.4505647973  
-0.6767170573  
-0.9033344676  
-1.125446924  
-1.335920537  
-1.525900835  
-1.685618792  
-1.805465764  
-1.877196608  
-1.895100971  
-1.856982963  
-1.764792283  
-1.624804701  
-1.447297836  
-1.245745842  
-1.035615744  
-0.8329161446  
-0.6526617468  
-0.507451658  
-0.4063220121  
-0.3539847325  
-0.3505299254  
-0.391576299  
-0.4688358853  
-0.5709829674  
-0.6847353832  
-0.7960252324  
-0.891157962  
-0.957892779  
-0.9863737764  
-0.9698774635  
-0.9053362505  
-0.7936223448  
-0.639545736  
-0.4515648572  
-0.2411764246  
-0.02201417894  
0.191300992  
0.3844756521  
0.5448891461  
0.6628210161  
0.7323985078  
0.7521363508  
0.724972745  
0.6577912928  
0.5604791522  
0.4446530381  
0.3222324933  
0.2040543398  
0.09872637426  
0.01185758107  
-0.05424438415  
-0.1004033013  
-0.130000398  
-0.1481132812  
-0.1605220547  
-0.1727380231  
-0.1892116035  
-0.2127794958  
-0.2444458911  
-0.2834507596  
-0.3275970885  
-0.3737586087  
-0.4184542872  
-0.4584190569  
-0.4910608253  
-0.5147589679  
-0.5289637995  
-0.5340979066  
-0.5312823278  
-0.5219441046  
-0.5073786931  
-0.4883342741  
-0.4647136072  
-0.4354148752  
-0.398386754  
-0.350856674  
-0.2897243376  
-0.2120511878  
-0.1155718403  
0.0008456603344  
0.1368696281  
0.2905398265  
0.4583038323  
0.6352428065  
0.8154612247  
0.9926013576  
1.160405001  
1.313281773  
1.446806542  
1.558091051  
1.645996593  
1.711164401  
1.755855559  
1.783632096  
1.798901578  
1.806383023  
1.810553554  
1.815114766  
1.822547212  
1.833791286  
1.848073684  
1.862914014  
1.874304625  
1.877049981  
1.865236902  
1.832802127  
1.774138855  
1.684702038  
1.561555626  
1.40382033  
1.212988139  
0.9930704397  
0.7505601678  
0.4941929544  
0.2344972208  
-0.01686223552  
-0.247922548  
-0.4474014647  
-0.6057482233  
-0.7161616298  
-0.7754828784  
-0.7848139262  
-0.7497900149  
-0.6803976201  
-0.5903292904  
-0.4958832557  
-0.4144941939  
-0.3630435087  
-0.3561030077  
-0.4043283313  
-0.513191996  
-0.6822122868  
-0.904806671  
-1.168799759  
-1.457560795  
-1.751649128  
-2.030786382  
-2.275924719  
-2.471163144  
-2.605273278  
-2.672660096  
-2.673637485  
-2.614000377  
-2.503965963  
-2.356627252  
-2.186155416  
-2.005962331  
-1.827099703  
-1.657083801  
-1.49930158  
-1.35305778  
-1.214246052  
-1.076512342  
-0.9327476568  
-0.7766467029  
-0.6041085693  
-0.4142487138  
-0.2098605248  
0.002736390628  
0.2144423981  
0.4145976642  
0.5924692177  
0.7387899021  
0.8470932106  
0.9146456415  
0.9428439786  
0.9370220017  
0.9057125597  
0.8594858691  
0.8095541448  
0.7663532677  
0.7383249375  
0.7310595195  
0.7469132784  
0.7851200636  
0.8423327554  
0.9134738063  
0.9927098005  
1.07438232  
1.153743685  
1.227392448  
