1122.249219  
1185.535873  
1305.72459  
1588.938015  
3386.354471  
2499.343645  
62499.18326  
2144.273536  
25033.25835  
85969.78347  
53526.40284  
66045.25446  
1650.493855  
1579.773405  
4728.180751  
5872.800353  
14470.32551  
30879.75224  
28021.77214  
19148.50606  
2931.048915  
5659.314577  
4057.089688  
29.11978598  
2599.845165  
6405.429578  
12363.403  
3224.780392  
5140.908673  
3033.088082  
1472.301195  
1333.799951  
647.7392655  
386.9936272  
2479.213833  
1688.790639  
1357.648042  
545.486264  
2620.400346  
89.34501698  
29.38307938  
119.2332664  
1189.021055  
1473.137861  
3473.315317  
391.5101776  
1374.316103  
1418.150457  
939.1841533  
488.7932026  
733.3688786  
851.3503114  
974.9581015  
45.9896829  
101.4840365  
172.5827484  
205.3159262  
189.8231681  
505.8370282  
182.3943862  
458.049339  
251.0677593  
384.5110306  
125.3683805  
62.08673457  
18.25654465  
24.49416574  
47.87500638  
72.38946618  
58.21524458  
44.07160283  
19.02813397  
36.85733482  
20.09589544  
25.0371472  
28.60322539  
23.17913974  
17.95486534  
12.73589216  
11.4037275  
12.0461313  
10.11304564  
9.543056931  
10.4086068  
7.731611587  
7.30780946  
7.448479751  
7.436050457  
6.532184628  
6.091463997  
6.09317831  
5.649372579  
5.229736197  
5.020329782  
4.798319023  
4.540396312  
4.232527396  
4.032806282  
3.867039028  
3.644029689  
3.481155185  
3.32967689  
3.18458311  
3.007010061  
2.891474269  
2.781255847  
2.669591719  
2.554940349  
2.455036982  
2.36204648  
2.259514512  
2.173377091  
2.098808544  
2.020074974  
1.940697268  
1.869113886  
1.80464161  
1.740262928  
1.677849934  
1.619916344  
1.566179643  
1.512060091  
1.460954073  
1.413304377  
1.368050638  
1.323950355  
1.281483626  
1.241672078  
1.203478149  
1.166321301  
1.130941532  
1.097186462  
1.064770884  
1.033505887  
1.003409565  
0.9747799353  
0.9471615382  
0.9205042121  
0.894929795  
0.8703794181  
0.84669865  
0.823867773  
0.8019276504  
0.7807866713  
0.7603818609  
0.7407125484  
0.7217566831  
0.7034751429  
0.6858119136  
0.6687647799  
0.652299683  
0.6363934078  
0.6210242561  
0.6061602567  
0.5917923131  
0.5778965794  
0.5644537181  
0.5514407843  
0.5388418921  
0.526652513  
0.514838325  
0.5033990097  
0.4923097093  
0.4815605128  
0.4711416636  
0.4610358984  
0.4512349487  
0.4417293447  
0.4324988687  
0.4235509436  
0.4148495069  
0.4064049121  
0.3982060472  
0.3902364976  
0.3824956108  
0.3749748298  
0.3676586464  
0.3605444996  
0.3536344361  
0.3469057222  
0.340363255  
0.3339918737  
0.3277955157  
0.3217656718  
0.315890989  
0.3101751581  
0.3046017915  
0.2991779309  
0.2938878019  
0.2887401205  
0.2837199319  
0.2788236216  
0.2740547933  
0.2693980423  
0.2648650544  
0.2604380785  
0.2561215686  
0.2519090478  
0.2477994007  
0.2437830283  
0.2398653294  
0.2360432398  
0.2323097002  
0.2286618995  
0.2251034766  
0.2216217182  
0.2182211158  
0.2148990531  
0.2116562534  
0.2084816353  
0.2053790017  
0.2023471645  
0.1993826886  
0.1964811715  
0.1936479581  
0.1908722599  
0.1881616482  
0.1855045817  
0.1829084893  
0.180363813  
0.1778765107  
0.1754393452  
0.1730565862  
0.1707220062  
0.168434253  
0.1661942989  
0.1640027065  
0.161855508  
0.1597497834  
0.1576871061  
0.155667323  
0.1536889613  
0.1517507146  
0.1498490247  
0.1479835119  
0.1461557597  
0.1443644292  
0.1426087412  
0.1408839094  
0.1391940056  
0.1375404606  
0.1359128352  
0.134318709  
0.1327518047  
0.1312172735  
0.1297094977  
0.1282311308  
0.1267812696  
0.1253574836  
0.1239593115  
0.1225853014  
0.1212376794  
0.119916314  
0.1186155664  
0.1173372815  
0.1160872196  
0.1148564211  
0.1136424614  
0.1124562678  
0.1112920344  
0.1101453185  
0.1090169497  
0.1079095485  
0.1068216909  
0.1057536395  
0.1047027643  
0.1036699043  
0.1026539245  
0.1016556775  
0.100674268  
0.09970834695  
0.09876158587  
0.09782894519  
0.09691080578  
0.09600934756  
0.0951203001  
0.09424860175  
0.09338869334  
0.0925431601  
0.0917133046  
0.09089675641  
0.09009316548  
0.0892982655  
0.08852231211  
0.08775328031  
0.08699991033  
0.08625785065  
0.0855249189  
0.08480688709  
0.08410078843  
0.08340126201  
0.08271664329  
0.08204069205  
0.0813748139  
0.08071856607  
0.08007558536  
0.07943854484  
0.07881543853  
0.07819769168  
0.07759194713  
0.0769951211  
0.07640366392  
0.07582605981  
0.0752539247  
0.0746928561  
0.07413875123  
0.07359221047  
0.07305525391  
0.07252486827  
0.07200188697  
0.07148687453  
0.07097950907  
0.07048062092  
0.06998942726  
0.06950183758  
0.06902568506  
0.06855460963  
0.06808965836  
0.06763246213  
0.06718047597  
0.06673622887  
0.06629699878  
0.06586536174  
0.06544012191  
0.06501855409  
0.06460611003  
0.06419709835  
0.06379464199  
0.06339730727  
0.06300638522  
0.06262160995  
0.06224105498  
0.06186545404  
0.06149663759  
0.06113066819  
0.06077000113  
0.06041695532  
0.06006694758  
0.05972187031  
0.05938233769  
0.05904678482  
0.05871558043  
0.05839027454  
0.0580699487  
0.05775058197  
0.0574374046  
0.0571300848  
0.05682530796  
0.05652534916  
0.05622903659  
0.05593654239  
0.05564734009  
0.05536441035  
0.0550843996  
0.05480671657  
0.05453525869  
0.05426707568  
0.05400058758  
0.05373680488  
0.05347876157  
0.0532262432  
0.05297635227  
0.05272686292  
0.05248209246  
0.05224195712  
0.05200419238  
0.05176978446  
0.05153905791  
0.05130964325  
0.05108487405  
0.0508626651  
0.05064525926  
0.0504293915  
0.05021578393  
0.05000456565  
0.04979786499  
0.04959445099  
0.0493922209  
0.04919396929  
0.04899750709  
0.04880465691  
0.04861291062  
0.04842538007  
0.04824044528  
0.04805667986  
0.04787795626  
0.04770074134  
0.04752496083  
0.04735245083  
0.04718159774  
0.04701512015  
0.04685008386  
0.04668637281  
0.04652507435  
0.04636709725  
0.04621132757  
0.04605744287  
0.04590726492  
0.04575670919  
0.04561031618  
0.04546518801  
0.04532242321  
0.04518183272  
0.04504248763  
0.04490606617  
0.04477248157  
0.04463886081  
0.04450887392  
0.04438038034  
0.0442541378  
0.04412910907  
0.04400864247  
0.04388572369  
0.04376713821  
0.0436502141  
0.04353551672  
0.04342287684  
0.04330968758  
0.0432022653  
0.04309446217  
0.04298824707  
0.0428848652  
0.04278271669  
0.04268180315  
0.04258274857  
0.04248521484  
0.04239015752  
0.04229554654  
0.04220426444  
0.04211390887  
0.04202413605  
0.04193728346  
0.04185192306  
0.04176787721  
0.04168471635  
0.04160515082  
0.04152560785  
0.04144868987  
0.04137214151  
0.04129777272  
0.04122464132  
0.04115215443  
0.04108444772  
0.04101592685  
0.04095016412  
0.04088382747  
0.04081844051  
0.04075738287  
0.04069668491  
0.04063647672  
0.04057852038  
0.04052170267  
0.04046783261  
0.04041373369  
0.04036054279  
0.04030810998  
0.0402606234  
0.04021265019  
0.04016547793  
0.04012027754  
0.04007668774  
0.04003468445  
0.0399925233  
0.03995181223  
0.03991459124  
0.03987653207  
0.03983950062  
0.03980604009  
0.03977304875  
0.03974073379  
0.0397093753  
0.03968171853  
0.03965417485  
0.03962868925  
0.03960283548  
0.03957917573  
0.03955755855  
0.03953388669  
0.0395147441  
0.03949477386  
0.03947939693  
0.03946268176  
0.03944734211  
0.03943261967  
0.03942214908  
0.03941128084  
0.03940089363  
0.03939240794  
0.03938548027  
0.03938002691  
0.03937663013  
0.03937277165  
0.03936999089  
0.03936997879  
