9428.270377  
9431.306567  
9434.38673  
9437.476166  
9440.524999  
9443.469379  
9446.236018  
9448.749963  
9450.94457  
9452.772293  
9454.214338  
9455.287241  
9456.04469  
9456.57348  
9456.983511  
9457.392761  
9457.909196  
9458.612405  
9459.537973  
9460.667581  
9461.926838  
9463.191873  
9464.304198  
9465.091948  
9465.394651  
9465.087788  
9464.103585  
9462.444839  
9460.189633  
9457.48606  
9454.537477  
9451.580163  
9448.856164  
9446.584795  
9444.936299  
9444.010908  
9443.825811  
9444.311517  
9445.317996  
9446.629875  
9447.988949  
9449.121456  
9449.767188  
9449.707354  
9448.788194  
9446.93803  
9444.176021  
9440.611795  
9436.436144  
9431.903748  
9427.309687  
9422.962058  
9419.153338  
9416.133048  
9414.084237  
9413.105815  
9413.202192  
9414.281114  
9416.159892  
9418.579547  
9421.22577  
9423.755111  
9425.824199  
9427.119716  
9427.386436  
9426.450924  
9424.238586  
9420.782408  
9416.222352  
9410.795245  
9404.815872  
9398.650978  
9392.688482  
9387.304843  
9382.833676  
9379.538656  
9377.593414  
9377.070126  
9377.937932  
9380.070996  
9383.26502  
9387.260271  
9391.768301  
9396.499464  
9401.18817  
9405.613499  
9409.613253  
9413.090737  
9416.014133  
9418.409647  
9420.349685  
9421.938287  
9423.295572  
9424.543008  
9425.790862  
9427.128585  
9428.618422  
9430.292133  
9432.150434  
9434.164674  
9436.280334  
9438.421952  
9440.499316  
9442.414708  
9444.070964  
9445.380056  
9446.271551  
9446.700275  
9446.652239  
9446.148055  
9445.242965  
9444.02332  
9442.59934  
9441.094909  
9439.635338  
9438.334585  
9437.283443  
9436.540253  
9436.125368  
9436.020072  
9436.170137  
9436.493523  
9436.891264  
9437.260036  
9437.50501  
9437.551313  
9437.352905  
9436.897848  
9436.209455  
9435.343368  
9434.38075  
9433.4185  
9432.557386  
9431.889278  
9431.484962  
9431.383695  
9431.585932  
9432.050191  
9432.694886  
9433.405279  
9434.045294  
9434.473083  
9434.558826  
9434.202608  
9433.350075  
9432.003673  
9430.227658  
9428.145868  
9425.932053  
9423.793669  
9421.950833  
9420.612893  
9419.955369  
9420.100069  
9421.100803  
9422.936438  
9425.512148  
9428.668644  
9432.198337  
9435.866333  
9439.433767  
9442.680595  
9445.42521  
9447.538594  
9448.951587  
9449.654746  
9449.691406  
9449.145276  
9448.12479  
9446.746676  
9445.121196  
9443.341058  
9441.475314  
9439.568584  
9437.645046  
9435.715795  
9433.78758  
9431.870954  
9429.985786  
9428.16306  
9426.442291  
9424.865258  
9423.467262  
9422.267903  
9421.263537  
9420.423386  
9419.690711  
9418.989449  
9418.235725  
9417.352642  
9416.285854  
9415.017223  
9413.573734  
9412.029787  
9410.501675  
9409.134604  
9408.083778  
9407.492306  
9407.469194  
9408.071059  
9409.290598  
9411.053772  
9413.226579  
9415.630446  
9418.064123  
9420.328942  
9422.253574  
9423.714911  
9424.652027  
9425.07155  
9425.043941  
9424.691643  
9424.171056  
9423.651189  
9423.291946  
9423.22499  
9423.539331  
9424.273244  
9425.412858  
9426.897021  
9428.627294  
9430.48138  
9432.328013  
9434.041444  
9435.513848  
9436.664471  
9437.444756  
9437.839281  
9437.862966  
9437.555131  
9436.971633  
9436.176136  
9435.231788  
9434.194218  
9433.106742  
9431.998202  
9430.883397  
9429.766101  
9428.643799  
9427.513539  
9426.377898  
9425.250057  
9424.157272  
9423.142052  
9422.260816  
9421.579957  
9421.169884  
9421.097543  
9421.418334  
9422.168549  
9423.359076  
9424.97145  
9426.956686  
9429.237326  
9431.712553  
9434.265952  
9436.775179  
9439.122422  
9441.20445  
9442.941125  
9444.281207  
9445.204814  
9445.722214  
9445.869204  
9445.699729  
9445.276945  
9444.66395  
9443.915693  
9443.073155  
9442.160633  
9441.18641  
9440.146581  
9439.031103  
9437.831164  
9436.546243  
9435.189886  
9433.792898  
9432.403566  
9431.084696  
9429.907784  
9428.94531  
9428.261989  
9427.906386  
9427.903901  
9428.252084  
9428.918907  
9429.844217  
9430.944119  
9432.117742  
9433.255665  
9434.24893  
9434.997706  
9435.418773  
9435.451102  
9435.059234  
9434.234228  
9432.992421  
9431.372322  
9429.430096  
9427.234225  
9424.859935  
9422.383843  
9419.879343  
9417.413009  
9415.042262  
9412.814375  
9410.766712  
9408.92805  
9407.320505  
9405.961806  
9404.867331  
9404.051569  
9403.52867  
9403.312032  
9403.412943  
9403.838524  
9404.589415  
9405.657578  
9407.024732  
9408.661742  
9410.529132  
9412.578761  
9414.756515  
9417.005583  
9419.270067  
9421.498266  
9423.64543  
9425.675562  
9427.562242  
9429.288455  
9430.845756  
9432.232979  
9433.454927  
9434.521333  
9435.446237  
9436.247807  
9436.948314  
9437.57408  
9438.154847  
9438.722396  
9439.308099  
9439.939626  
9440.636944  
9441.408277  
9442.24663  
9443.127499  
9444.008416  
9444.830587  
9445.522668  
9446.006408  
9446.203628  
9446.043802  
9445.471508  
9444.452924  
9442.980894  
9441.078019  
9438.79758  
9436.222225  
9433.460412  
9430.640762  
9427.904494  
9425.396325  
9423.254046  
9421.597586  
9420.518009  
9420.067645  
9420.2522  
9421.026041  
9422.291642  
9423.903901  
9425.679684  
9427.412325  
9428.890244  
9429.918114  
9430.338551  
9430.051881  
9429.031439  
9427.332105  
9425.090258  
9422.514442  
9419.866855  
9417.437361  
9415.512642  
9414.344145  
9414.11892  
9414.937176  
9416.799873  
9419.608106  
9423.174586  
9427.245747  
9431.531413  
9435.738022  
9439.600855  
9442.910996  
9445.533745  
9447.416384  
9448.585097  
9449.132089  
9449.195499  
9448.935437  
9448.509679  
9448.052445  
9447.658801  
9447.376266  
9447.20395  
9447.098609  
9446.985945  
9446.775036  
9446.373587  
9445.701758  
9444.702944  
9443.350341  
9441.648993  
9439.633582  
9437.362847  
9434.91185  
9432.363454  
9429.800277  
9427.298137  
9424.9217  
9422.722397  
9420.738482  
9418.996575  
9417.513887  
9416.300407  
9415.360237  
9414.691787  
9414.286743  
9414.128199  
9414.188588  
9414.42819  
9414.795189  
9415.227632  
9415.657729  
9416.01818  
9416.249837  
9416.309632  
9416.177477  
9415.86095  
9415.396616  
9414.847559  
9414.297051  
9413.839001  
9413.566323  
9413.558721  
9413.871614  
9414.52764  
9415.512084  
9416.772853  
9418.225223  
9419.760773  
9421.259605  
9422.604254  
9423.693749  
9424.455985  
9424.856844  
9424.904854  
9424.650589  
9424.18071  
9423.60719  
9423.05287  
9422.635094  
9422.449553  
9422.556423  
9422.97097  
9423.659954  
9424.544756  
9425.510961  
9426.423285  
9427.143914  
9427.551666  
9427.559291  
9427.12639  
9426.266213  
9425.045371  
9423.576728  
9422.00675  
9420.499174  
9419.21756  
9418.309039  
9417.891322  
9418.044244  
9418.806318  
9420.175994  
9422.116481  
9424.562868  
9427.429918  
9430.619235  
9434.025061  
9437.538191  
9441.048362  
9444.445628  
9447.62159  
9450.471329  
9452.896491  
9454.80996  
9456.141569  
9456.84444  
9456.900805  
9456.326262  
9455.171465  
9453.520492  
9451.485652  
9449.198897  
9446.800733  
9444.427623  
9442.199522  
9440.208907  
9438.512764  
9437.128556  
9436.034664  
9435.175361  
9434.469696  
9433.823203  
9433.14108  
9432.341156  
9431.365067  
9430.186425  
9428.814881  
9427.295727  
9425.705197  
9424.142031  
9422.716465  
9421.537981  
9420.703334  
9420.286193  
9420.329619  
9420.842021  
9421.79695  
9423.136487  
9424.777537  
9426.620162  
9428.556701  
9430.480663  
9432.294296  
9433.914266  
9435.274969  
9436.329677  
9437.049747  
9437.422668  
9437.449595  
9437.143102  
9436.525753  
9435.629585  
9434.49653  
9433.179239  
9431.741632  
9430.258461  
9428.81308  
9427.493115  
9426.383988  
9425.560768  
9425.079391  
9424.968375  
9425.222692  
9425.800788  
9426.625907  
9427.59194  
9428.573397  
9429.438586  
9430.064246  
9430.349835  
9430.229476  
9429.679885  
9428.723188  
9427.424167  
9425.88238  
9424.220124  
9422.567935  
9421.049482  
9419.767766  
9418.794311  
9418.162442  
9417.865335  
9417.858782  
9418.068006  
9418.397645  
9418.74346  
9419.00447  
9419.094184  
9418.94984  
9418.538774  
9417.861515  
9416.951479  
9415.87137  
9414.706877  
9413.558366  
9412.531293  
9411.726464  
9411.230878  
9411.110017  
9411.402164  
9412.11519  
9413.2259  
9414.68201  
9416.406463  
9418.303727  
9420.267688  
9422.190525  
9423.97195  
9425.52826  
9426.800156  
9427.758893  
9428.409724  
9428.792236  
9428.976966  
9429.058518  
9429.145257  
9429.346595  
9429.759054  
9430.452623  
9431.45921  
9432.764757  
9434.306494  
9435.976203  
9437.629593  
9439.101394  
9440.224574  
9440.851782  
9440.876335  
9440.250072  
9438.995339  
9437.209198  
9435.058427  
9432.765512  
9430.586524  
9428.78336  
9427.593591  
9427.201713  
9427.715579  
9429.151337  
9431.429001  
9434.379553  
9437.762705  
9441.293233  
9444.672342  
9447.620152  
9449.905085  
9451.366602  
9451.928692  
9451.602849  
9450.480745  
9448.718212  
9446.512992  
9444.079672  
9441.624942  
9439.326306  
9437.316514  
9435.674908  
9434.426135  
9433.545325  
9432.968429  
9432.605661  
9432.356001  
9432.12087  
9431.815296  
9431.375741  
9430.764089  
9429.968101  
9428.998851  
9427.886195  
9426.673252  
9425.410849  
9424.152622  
9422.951225  
9421.855636  
9420.909378  
9420.149189  
9419.603816  
9419.292429  
9419.22265  
9419.388391  
9419.76781  
9420.322137  
9420.995941  
9421.719463  
9422.41317  
9422.994465  
9423.386022  
9423.524715  
9423.370076  
9422.910995  
9422.169587  
9421.201529  
9420.092523  
9418.951202  
9417.899142  
9417.059203  
9416.543463  
9416.442132  
9416.814653  
9417.683937  
9419.034098  
9420.811928  
9422.931587  
9425.281998  
9427.736053  
9430.160717  
9432.427108  
9434.419843  
9436.044941  
9437.235854  
9437.957344  
9438.20698  
9438.014309  
9437.437696  
9436.559164  
9435.477555  
9434.300537  
9433.136243  
9432.085177  
9431.233316  
9430.646941  
9430.36986  
9430.422956  
9430.806001  
9431.501002  
9432.476394  
9433.690888  
9435.096241  
9436.638327  
9438.25634  
9439.880606  
9441.429856  
9442.809322  
9443.910974  
9444.617021  
9444.807292  
9444.370357  
9443.217319  
9441.296431  
9438.606229  
9435.204613  
9431.21171  
9426.80507  
9422.206804  
9417.663718  
9413.422498  
9409.703285  
9406.675242  
9404.437925  
9403.011494  
9402.337687  
9402.29189  
9402.704903  
9403.391362  
9404.18058  
9404.944906  
9405.620899  
9406.219564  
9406.823532  
9407.571173  
9408.629865  
9410.162571  
9412.293204  
9415.076792  
9418.479658  
9422.373672  
9426.546032  
9430.723692  
9434.609036  
9437.921263  
9440.437072  
9442.024021  
9442.661087  
9442.442935  
9441.566961  
9440.304973  
9438.963869  
9437.841356  
9437.183577  
9437.151073  
9437.798155  
9439.06835  
9440.806238  
9442.783175  
9444.732447  
9446.388188  
9447.521988  
9447.971941  
9447.660366  
9446.598406  
9444.877901  
9442.65284  
9440.114093  
9437.461807  
9434.879799  
9432.515588  
9430.46826  
9428.785173  
9427.466694  
9426.477179  
9425.759516  
9425.250277  
9424.892808  
9424.646277  
9424.489648  
9424.420625  
9424.450478  
9424.596417  
9424.873425  
9425.287328  
9425.830612  
9426.481585  
9427.206909  
9427.966721  
9428.721158  
9429.436727  
9430.091247  
9430.676278  
9431.196605  
9431.666898  
9432.106274  
9432.531832  
9432.952394  
9433.363683  
9433.745803  
9434.063507  
9434.269271  
9434.308684  
9434.127427  
9433.67878  
9432.930679  
9431.871418  
9430.513304  
9428.893955  
9427.075126  
9425.139352  
9423.1848  
9421.318788  
9419.650619  
9418.284123  
9417.310418  
9416.801229  
9416.803144  
9417.333182  
9418.375935  
9419.882731  
9421.772971  
9423.937954  
9426.246983  
9428.555688  
9430.715877  
9432.586356  
9434.043683  
9434.991938  
9435.370665  
9435.16007  
9434.383041  
9433.103751  
9431.422914  
9429.470055  
9427.393473  
9425.348705  
9423.486451  
9421.940885  
9420.819354  
9420.1943  
9420.098002  
9420.520651  
9421.411922  
9422.685846  
9424.228695  
9425.909082  
9427.589442  
9429.137814  
9430.438836  
9431.40298  
9431.973101  
9432.127809  
9431.881343  
9431.280151  
9430.396704  
9429.32123  
9428.1526  
9426.989305  
9425.921554  
9425.025386  
9424.359084  
9423.962089  
9423.855917  
9424.046544  
9424.527384  
9425.282091  
9426.286495  
9427.509448  
9428.91259  
9430.449427  
9432.064449  
9433.692969  
9435.262451  
9436.695634  
9437.915544  
9438.852005  
9439.448918  
9439.671218  
9439.51047  
9438.988125  
9438.155607  
9437.090973  
9435.892219  
9434.667758  
9433.525132  
9432.559007  
9431.839986  
9431.405509  
9431.254061  
9431.34365  
9431.594915  
9431.899018  
9432.129611  
9432.157856  
9431.868801  
9431.17734  
9430.041615  
9428.472026  
9426.534352  
9424.346142  
9422.066456  
9419.879777  
9417.97586  
9416.528018  
9415.672432  
9415.491293  
9416.001977  
9417.153794  
9418.832735  
9420.873712  
9423.078675  
9425.238315  
9427.154558  
9428.661203  
9429.640212  
9430.032057  
9429.839077  
9429.122105  
9427.991034  
9426.590991  
9425.085917  
9423.641698  
9422.410576  
9421.518541  
9421.0565  
9421.075827  
9421.588059  
9422.568142  
9423.96031  
9425.685389  
9427.648482  
9429.746024  
9431.871554  
9433.919928  
9435.790087  
9437.386854  
9438.622439  
9439.418446  
9439.70907  
9439.44585  
9438.603953  
9437.189428  
9435.246354  
9432.862489  
9430.171811  
9427.352417  
9424.618815  
9422.208216  
9420.361428  
9419.299953  
9419.201626  
9420.177837  
9422.255395  
9425.365868  
9429.344337  
9433.938363  
9438.826804  
9443.646463  
9448.024048  
9451.609612  
9454.108096  
9455.305328  
9455.086009  
9453.441837  
9450.46933  
9446.357915  
9441.369949  
9435.814945  
9430.020886  
9424.305663  
