5.56930386  
7.402435913  
11.76596523  
13.19942588  
67.97846205  
7931.740909  
2142.317178  
8378.922118  
79651.18638  
58733.81493  
8807.64491  
17478.46554  
10298.83546  
6985.448352  
7048.654294  
12934.99752  
26264.32541  
5652.860188  
25542.40401  
15795.60504  
4753.171349  
26623.6534  
18214.34681  
2809.75156  
18767.76056  
7535.855501  
2007.427731  
1132.162666  
13349.48645  
18196.25618  
4114.276584  
3519.543479  
11792.04503  
6139.13745  
7173.828457  
8191.190828  
2449.495968  
1823.806291  
6911.879261  
7891.459071  
831.3146962  
2460.839058  
201.9548822  
150.4053549  
4091.941059  
221.4968655  
2720.045826  
421.3459661  
575.7141343  
481.8883054  
315.944501  
963.951286  
1356.508313  
231.9936565  
1018.965854  
595.2828672  
350.8773024  
170.7748715  
725.0789717  
806.9186067  
720.1958518  
282.6576449  
79.44839884  
60.24962297  
176.679928  
6.648018324  
6.113080697  
40.97683831  
41.27882952  
13.78714638  
11.62188775  
14.17276741  
14.22355476  
8.077080369  
11.62794891  
11.83855565  
5.675224403  
4.738172022  
5.513478549  
3.908061989  
4.791934561  
5.980848977  
4.409480059  
4.022605104  
3.868857141  
4.13119887  
3.238725632  
3.830887989  
3.063357847  
3.182152126  
2.975954001  
3.045351459  
2.829006151  
2.643232305  
2.567271242  
2.485976511  
2.393146186  
2.303007117  
2.266195785  
2.157427857  
2.101900225  
2.050569131  
1.982936135  
1.914819386  
1.865986826  
1.817157071  
1.759034235  
1.720445935  
1.683308971  
1.632609268  
1.594264367  
1.558487174  
1.519915175  
1.483288541  
1.447946283  
1.41442428  
1.382598631  
1.351512116  
1.323490038  
1.294764686  
1.267292476  
1.240928642  
1.215076985  
1.190528596  
1.166669938  
1.143647335  
1.121341062  
1.100090079  
1.079149705  
1.059004114  
1.03939638  
1.020427809  
1.002105648  
0.9841485634  
0.9669061834  
0.9501708611  
0.9337578403  
0.9180051588  
0.9026126728  
0.8876489226  
0.8731093488  
0.858957348  
0.8451919003  
0.8318021785  
0.8187584214  
0.8060467854  
0.7936955615  
0.781637102  
0.7698958039  
0.7584386134  
0.7472810752  
0.7363826077  
0.7257681524  
0.7154040301  
0.7052769158  
0.6954037668  
0.6857586595  
0.6763511741  
0.6671491632  
0.6581561197  
0.6493724077  
0.6407844626  
0.6323896289  
0.6241819547  
0.6161603028  
0.608302681  
0.6006225069  
0.5931046211  
0.5857532028  
0.578548574  
0.5714953611  
0.5645911234  
0.5578286841  
0.5512154933  
0.5447134306  
0.5383634537  
0.5321333341  
0.5260250233  
0.5200375964  
0.5141767923  
0.5084313062  
0.5027796068  
0.4972533166  
0.4918192708  
0.4864968011  
0.4812684087  
0.4761449362  
0.4711111202  
0.4661712572  
0.461319112  
0.4565590546  
0.4518912757  
0.4472992037  
0.4427817647  
0.4383651099  
0.4340133835  
0.4297482237  
0.4255444513  
0.4214158488  
0.4173511499  
0.4133677294  
0.4094540883  
0.4056068992  
0.4018190374  
0.3980964924  
0.3944269017  
0.3908382685  
0.3872959306  
0.3838053686  
0.3803791161  
0.3770159192  
0.3736832236  
0.370430365  
0.3672128334  
0.3640478729  
0.3609386844  
0.3578762343  
0.3548681252  
0.351896609  
0.3489773645  
0.3460952427  
0.3432629139  
0.3404736493  
0.3377358254  
0.3350222773  
0.3323586349  
0.3297374322  
0.3271471124  
0.3246019683  
0.3220908344  
0.3196154541  
0.3171748148  
0.3147813116  
0.3124010411  
0.3100730989  
0.307774384  
0.3055029957  
0.303271582  
0.3010698061  
0.2988940226  
0.2967557665  
0.2946397289  
0.2925519928  
0.2905020093  
0.2884736746  
0.2864842451  
0.2845138838  
0.2825697621  
0.2806476963  
0.2787631455  
0.2768898494  
0.2750485344  
0.273237304  
0.2714479327  
0.2696793941  
0.2679381801  
0.2662172803  
0.2645179148  
0.2628461799  
0.2611901971  
0.2595517224  
0.2579402858  
0.2563498026  
0.2547820455  
0.2532329429  
0.2517019978  
0.2501915888  
0.2487012787  
0.2472207349  
0.2457694826  
0.2443377419  
0.2429168131  
0.2415240019  
0.2401363503  
0.2387705266  
0.2374248986  
0.2360880634  
0.234773502  
0.2334772759  
0.232195323  
0.2309256203  
0.2296745088  
0.2284369552  
0.2272222993  
0.2260154614  
0.2248224276  
0.2236416317  
0.2224818989  
0.2213286876  
0.2201900313  
0.2190733352  
0.2179644411  
0.2168643958  
0.2157853007  
0.2147124531  
0.2136609272  
0.2126170322  
0.2115865357  
0.21056052  
0.209553839  
0.2085585998  
0.2075718777  
0.2065984413  
0.2056382252  
0.2046874007  
0.2037427614  
0.2028161722  
0.2019049061  
0.2009952733  
0.2000921585  
0.1992099284  
0.1983339899  
0.1974740138  
0.1966100027  
0.1957630102  
0.1949300586  
0.1941027409  
0.193279478  
0.1924750936  
0.191674038  
0.1908884071  
0.1901127588  
0.1893332026  
0.1885729574  
0.1878181837  
0.1870679706  
0.1863315573  
0.1856128106  
0.1848841852  
0.1841700623  
0.1834630823  
0.182769695  
0.1820809064  
0.1813995185  
0.1807266472  
0.1800563355  
0.1794023214  
0.178750291  
0.1781139997  
0.1774736906  
0.1768414959  
0.176219054  
0.1756103981  
0.1749986562  
0.174399744  
0.1738063297  
0.1732188484  
0.1726373246  
0.1720672959  
0.171497259  
0.1709375543  
0.170383689  
0.1698315139  
0.1692949722  
0.1687560484  
0.1682254445  
0.1677040007  
0.167184697  
0.1666741081  
0.1661711987  
0.1656718003  
0.1651722513  
0.1646858105  
0.1642080874  
0.1637254675  
0.1632602265  
0.1627935336  
0.1623299503  
0.1618722952  
0.1614274316  
0.1609874743  
0.1605400992  
0.160109415  
0.1596809297  
0.15925361  
0.1588369665  
0.1584169637  
0.1580135103  
0.1576060244  
0.1572133191  
0.1568139978  
0.1564308483  
0.1560513634  
0.1556642915  
0.1552941827  
0.1549161622  
0.15455675  
0.1541876596  
0.1538393637  
0.1534832154  
0.1531333339  
0.152790441  
0.15245231  
0.1521208296  
0.1517840548  
0.1514611104  
0.1511420344  
0.1508250665  
0.1505091615  
0.1501981961  
0.149895352  
0.1495920179  
0.1493003133  
0.1490023768  
0.148715434  
0.1484321017  
0.1481462689  
0.1478686332  
0.1475993759  
0.147331096  
0.1470657362  
0.1468010415  
0.1465496975  
0.1462946919  
0.1460396309  
0.1457947776  
0.145552841  
0.1453140886  
0.1450745587  
0.1448380599  
0.1446140775  
0.1443934751  
0.1441708988  
0.1439515596  
0.1437397782  
0.1435276148  
0.1433233364  
0.1431183618  
0.1429151115  
0.1427161498  
0.1425278787  
0.1423316344  
0.1421505734  
0.1419678321  
0.1417853546  
0.141615759  
0.1414375489  
0.1412705504  
0.1411004213  
0.1409398417  
0.1407786773  
0.1406236881  
0.1404713145  
0.1403151111  
0.1401704487  
0.1400267926  
0.1398829023  
0.1397452554  
0.1396115097  
0.1394808502  
0.1393520322  
0.1392260407  
0.1391063226  
0.1389832284  
0.1388688781  
0.1387585767  
0.1386445552  
0.1385402532  
0.1384360631  
0.1383347987  
0.1382403987  
0.138143742  
0.1380498698  
0.1379636  
0.137877693  
0.1377904386  
0.1377146124  
0.1376333003  
0.137563213  
0.1374850002  
0.137424819  
0.1373585885  
0.137297426  
0.1372372478  
0.1371771926  
0.1371308954  
0.1370737516  
0.1370286633  
0.1369854857  
0.1369426131  
0.1369041288  
0.1368720002  
0.1368362241  
0.1368039273  
0.1367797235  
0.136751566  
0.1367265706  
0.1367141664  
0.1367009476  
0.1366875129  
0.1366758605  
0.1366704997  
0.1366645227  
0.1366685661  
