0.1226838311  
0.4394463187  
1.274447873  
4.297003635  
6.875901907  
28.59948974  
912.1944012  
18892.76118  
15215.96036  
8592.227939  
9468.775726  
19083.97638  
26265.64463  
4319.406497  
9342.714586  
7732.92118  
883.5542357  
10227.26782  
33185.32558  
9796.406837  
11976.29017  
17861.74361  
40322.52429  
16949.95021  
22874.36777  
1593.863602  
102.0129344  
35764.48298  
15219.42339  
3065.805856  
2362.195773  
6516.645915  
13215.59913  
13581.9539  
924.7995031  
615.0735513  
4583.691338  
26748.74299  
12322.5893  
599.4885231  
5897.266716  
18798.16791  
2372.280124  
3127.260191  
1904.964769  
3463.111649  
2431.13703  
4453.536094  
3982.828093  
4683.360857  
3230.268342  
3441.698893  
533.135365  
1625.537358  
193.2599648  
951.5958479  
236.43018  
913.7996582  
382.2800543  
411.764003  
615.2470975  
376.607202  
974.6002989  
580.8965218  
13.75139692  
143.1554177  
147.6454847  
86.60171716  
100.9332926  
7.676340158  
16.53249059  
70.36590951  
11.62248545  
15.11242569  
3.54522704  
6.544822073  
4.065400006  
5.760667193  
6.403618734  
8.344140095  
5.431986271  
5.630572824  
2.635741233  
3.800916126  
3.125854637  
3.157201218  
3.219364508  
2.883132022  
3.100988387  
2.664879449  
2.931630286  
2.634605786  
2.559079005  
2.504605494  
2.34684746  
2.313769737  
2.147466635  
2.091239678  
2.040514438  
1.945968471  
1.925162317  
1.816301398  
1.790852204  
1.731699574  
1.672723452  
1.618557185  
1.582172007  
1.529238476  
1.494656362  
1.45001653  
1.404480123  
1.374175125  
1.337823386  
1.304674283  
1.26988222  
1.240334584  
1.211060118  
1.185147401  
1.157777679  
1.129619663  
1.105721798  
1.080557388  
1.058338122  
1.034940821  
1.013883555  
0.9931683418  
0.9726708136  
0.9532109955  
0.9343885049  
0.9164744613  
0.8985694103  
0.8816549516  
0.8649473022  
0.849032155  
0.8333844171  
0.8183487527  
0.8036901566  
0.7894691603  
0.7758154181  
0.7623797346  
0.7495132057  
0.7368431535  
0.7246290464  
0.7127530544  
0.7011506844  
0.6899198993  
0.6789448429  
0.6683154791  
0.6579127364  
0.6478356522  
0.6379621443  
0.6283847156  
0.6190207484  
0.6098889891  
0.6010041641  
0.5923343697  
0.5838943245  
0.5756466707  
0.5675747238  
0.5597160186  
0.5520453788  
0.5445278782  
0.5371968889  
0.5300358231  
0.5230342722  
0.5161936975  
0.5095148737  
0.5029828321  
0.4965878006  
0.4903203049  
0.4841807941  
0.4781935269  
0.4723486126  
0.4665944479  
0.4609822198  
0.4554668466  
0.4500786985  
0.4447997868  
0.43963559  
0.4345607451  
0.4296127147  
0.4247297377  
0.4199524871  
0.4152794081  
0.4106882835  
0.4061910874  
0.4017750634  
0.3974630584  
0.3931933035  
0.3890209554  
0.3849348001  
0.380919852  
0.3769925502  
0.3730929757  
0.3692913555  
0.3655717978  
0.3619046961  
0.3583211587  
0.3547746049  
0.3513049737  
0.3478997167  
0.3445410596  
0.3412459854  
0.3380134171  
0.3348271778  
0.3316879554  
0.3286141956  
0.3255865567  
0.3226082036  
0.3196979546  
0.3168139959  
0.3139910962  
0.3112058336  
0.3084570549  
0.3057597594  
0.3031109829  
0.3005071753  
0.2979346812  
0.2954148023  
0.2929256929  
0.2904554247  
0.2880464852  
0.285687374  
0.2833470162  
0.2810504743  
0.2787869459  
0.276558056  
0.2743479864  
0.2721842681  
0.2700630413  
0.2679494104  
0.265875335  
0.2638478358  
0.2618378498  
0.2598579823  
0.257906903  
0.2559759468  
0.2540904367  
0.2522192405  
0.2503690114  
0.248569034  
0.2467610507  
0.2450048337  
0.2432703638  
0.24155289  
0.2398595481  
0.2381863665  
0.2365446047  
0.23492278  
0.2333271881  
0.2317552516  
0.2301943625  
0.2286483442  
0.227128531  
0.2256517049  
0.2241616934  
0.2227109306  
0.2212779029  
0.2198595092  
0.2184638642  
0.2170907853  
0.2157148467  
0.2143707649  
0.2130466434  
0.2117349825  
0.2104339229  
0.2091681841  
0.2079161622  
0.2066733913  
0.2054458822  
0.2042403536  
0.2030366236  
0.2018560149  
0.2006956309  
0.1995422202  
0.1983976632  
0.1972800077  
0.1961664405  
0.1950791642  
0.1939962691  
0.1929224443  
0.1918629333  
0.1908264246  
0.1897944696  
0.1887811258  
0.1877662923  
0.1867793013  
0.1858156534  
0.1848380114  
0.1838689063  
0.1829464805  
0.1820009217  
0.1810741913  
0.1801728807  
0.1792701275  
0.1783797801  
0.1774974431  
0.1766392676  
0.175781277  
0.1749271674  
0.1740888064  
0.1732640034  
0.1724481108  
0.1716390818  
0.1708330604  
0.1700447188  
0.1692628885  
0.168488271  
0.1677291217  
0.166971606  
0.1662312904  
0.1654936959  
0.1647675218  
0.1640456598  
0.163331486  
0.1626308003  
0.1619400974  
0.1612523159  
0.1605627311  
0.1598998112  
0.1592383255  
0.1585707684  
0.1579245314  
0.1572865229  
0.1566555376  
0.1560266001  
0.1554081182  
0.1548021771  
0.1541957625  
0.153590214  
0.1529903172  
0.1524166722  
0.1518431044  
0.1512550197  
0.1506896543  
0.150137404  
0.1495923284  
0.1490392822  
0.1484998138  
0.1479796111  
0.1474411628  
0.1469159566  
0.1464089  
0.1458848609  
0.1453888279  
0.1448888034  
0.1444031232  
0.1439148469  
0.143432079  
0.1429565932  
0.142491075  
0.1420167226  
0.1415606385  
0.1411004116  
0.1406495319  
0.1402095375  
0.1397760924  
0.1393393059  
0.1389149634  
0.138477396  
0.1380632566  
0.1376455543  
0.1372404951  
0.1368246441  
0.1364374296  
0.1360423748  
0.135649538  
0.1352601021  
0.1348873912  
0.1345076309  
0.1341300967  
0.1337613007  
0.1334018355  
0.1330464413  
0.1326843867  
0.1323323344  
0.1319898341  
0.1316433167  
0.1313130448  
0.1309870051  
0.1306447814  
0.1303170066  
0.1300015954  
0.1296753821  
0.1293630443  
0.129046927  
0.1287512129  
0.1284429216  
0.1281430816  
0.1278573295  
0.1275599248  
0.1272716677  
0.1269852744  
0.1267058933  
0.1264230399  
0.1261557118  
0.1258886444  
0.1256214433  
0.1253648829  
0.125101047  
0.1248402382  
0.1245876318  
0.1243407769  
0.1240968333  
0.1238578327  
0.1236198655  
0.1233816718  
0.1231475126  
0.1229222544  
0.1226990455  
0.1224744193  
0.122256304  
0.1220371791  
0.1218231264  
0.1216163328  
0.1214081178  
0.1212142074  
0.1210097757  
0.1208098101  
0.1206210395  
0.1204346554  
0.120237047  
0.1200465417  
0.1198745059  
0.119697179  
0.119516084  
0.1193457125  
0.1191729172  
0.1190085397  
0.1188361666  
0.1186738634  
0.1185123575  
0.1183575454  
0.1182078886  
0.1180651781  
0.117915831  
0.1177651886  
0.1176292854  
0.1174837717  
0.1173418607  
0.1172168678  
0.1170837418  
0.1169528253  
0.1168267601  
0.1167069765  
0.1165821509  
0.1164664212  
0.116346845  
0.1162386453  
0.1161226497  
0.1160181337  
0.115912571  
0.115815301  
0.1157158098  
0.1156198137  
0.1155231667  
0.1154269823  
0.1153412349  
0.1152584674  
0.1151651856  
0.1150798616  
0.115011814  
0.1149269012  
0.1148534238  
0.1147848559  
0.1147145616  
0.1146477948  
0.1145798117  
0.1145254376  
0.1144604708  
0.1144073709  
0.1143541061  
0.1143025746  
0.1142445115  
0.114197252  
0.114158617  
0.1141105291  
0.1140789777  
0.1140334096  
0.114005839  
0.1139728106  
0.1139387732  
0.1139027179  
0.1138877653  
0.1138661822  
0.1138482498  
0.1138316448  
0.1138116498  
0.1138087414  
0.1137895515  
0.113775254  
0.1137806597  
0.1137695883  
0.1137751835  
