-0.03268015191  
0.5100125971  
1.032534629  
1.516748283  
1.947821198  
2.315290461  
2.6135178  
2.841501721  
3.002127655  
3.101031052  
3.145294486  
3.142218236  
3.09835895  
3.018961047  
2.907835201  
2.767629059  
2.600379424  
2.408187283  
2.193856628  
1.961344822  
1.715950194  
1.46419061  
1.213423627  
0.9712800522  
0.7450278632  
0.5409833483  
0.3640625051  
0.2175372531  
0.1030060311  
0.0205571718  
-0.03093939954  
-0.05348687772  
-0.0496451648  
-0.02229004199  
0.02550449393  
0.09047461719  
0.1690900646  
0.2574470492  
0.3511879456  
0.4455024856  
0.5352459421  
0.6151799004  
0.6803159779  
0.7263164948  
0.7498868972  
0.7490933122  
0.7235464503  
0.6744163349  
0.6042684178  
0.5167430955  
0.4161373512  
0.3069454053  
0.1934434301  
0.07937377549  
-0.03221894734  
-0.1390022659  
-0.2392250512  
-0.3315065858  
-0.4146009375  
-0.487221358  
-0.5479706214  
-0.5954282736  
-0.6283778307  
-0.6461510355  
-0.6490068896  
-0.6384685416  
-0.6175177384  
-0.5905801966  
-0.5632628145  
-0.5418474426  
-0.5325911433  
-0.5409382739  
-0.5707449953  
-0.623654987  
-0.6987189981  
-0.792336025  
-0.8985265421  
-1.009513695  
-1.116531319  
-1.210752571  
-1.284215819  
-1.330637387  
-1.346014237  
-1.32895583  
-1.280730386  
-1.205036751  
-1.107541069  
-0.9952538731  
-0.8758113816  
-0.7567448856  
-0.644802865  
-0.5453810185  
-0.4621125711  
-0.3966412752  
-0.3485913502  
-0.315734171  
-0.2943396013  
-0.2796632832  
-0.2665428293  
-0.2500240672  
-0.2259693329  
-0.1915635209  
-0.1456781872  
-0.08902818201  
-0.0241195116  
0.04502342183  
0.1133200414  
0.1752233815  
0.2253810238  
0.259280489  
0.2738094425  
0.2676601023  
0.2415369421  
0.1981387536  
0.1419178821  
0.07864811806  
0.01484223323  
-0.04291078892  
-0.08861663044  
-0.117478874  
-0.126372049  
-0.1141230716  
-0.0815803123  
-0.03146423606  
0.03198569699  
0.1035028989  
0.1773766607  
0.2480441821  
0.3106227058  
0.3613260009  
0.3977286312  
0.4188671599  
0.4251858165  
0.4183564634  
0.4010185232  
0.3764747503  
0.3483803972  
0.320453742  
0.2962203109  
0.2787906747  
0.2706733802  
0.2736152098  
0.2884659367  
0.3150798543  
0.3522605833  
0.397776403  
0.4484523536  
0.500361772  
0.5491069798  
0.5901765353  
0.6193461522  
0.6330772856  
0.628857842  
0.6054480094  
0.5629832062  
0.502925534  
0.4278719261  
0.341245078  
0.246916299  
0.1488272177  
0.05065040716  
-0.04444489578  
-0.1339165505  
-0.2158496914  
-0.288854513  
-0.3519103881  
-0.4041996472  
-0.4449774943  
-0.4735153888  
-0.4891331498  
-0.4913145525  
-0.4798756631  
-0.4551531852  
-0.4181600171  
-0.3706776454  
-0.315255836  
-0.2551179845  
-0.1939752567  
-0.1357920176  
-0.08451243761  
-0.0437970037  
-0.01678059191  
-0.005866297323  
-0.01255951555  
-0.0373360111  
-0.07954835145  
-0.1373712351  
-0.2078118891  
-0.2867982035  
-0.3693830738  
-0.4500720736  
-0.5232773559  
-0.5838670999  
-0.6277444776  
-0.6523799086  
-0.657187699  
-0.6436676296  
-0.6152474933  
-0.5768098379  
-0.533949055  
-0.4920586966  
-0.4553802187  
-0.4261860327  
-0.4042345434  
-0.386624484  
-0.3680896545  
-0.3417291315  
-0.3000692347  
-0.2363121768  
-0.145579834  
-0.02595310109  
0.1208628696  
0.2893694286  
0.4706511006  
0.6532571164  
0.8244849167  
0.9718840646  
1.084774732  
1.155557401  
1.180627386  
1.160749133  
1.100830041  
1.009118463  
0.8959310019  
0.7720969114  
0.6473487315  
0.5289074683  
0.4204933495  
0.321923287  
0.2293866537  
0.1363782474  
0.035155693  
-0.08149133458  
-0.2184423379  
-0.3767241645  
-0.5525317601  
-0.7369986521  
-0.9168042871  
-1.075583835  
-1.195966191  
-1.261965518  
-1.261378119  
-1.187820415  
-1.042086294  
-0.8325968588  
-0.5748443828  
-0.2898826183  
-0.002061694097  
0.2636944307  
0.4846955093  
0.6430032215  
0.7273377317  
0.7341421901  
0.6677079823  
0.5393815423  
0.366010624  
0.1678617226  
-0.03370519044  
-0.2185127031  
-0.3695381161  
-0.4743930578  
-0.5261951152  
-0.5238087196  
-0.4714904083  
-0.3780480097  
-0.2556433984  
-0.1183889483  
0.01911093023  
0.1431427675  
0.2420790647  
0.3073019074  
0.3337999586  
0.3204098909  
0.26970441  
0.187547871  
0.08237532383  
-0.03573696463  
-0.1561208825  
-0.2685799727  
-0.3643754623  
-0.4370240814  
-0.4828370639  
-0.5011386207  
-0.4941426415  
-0.4664938198  
-0.42453353  
-0.3753588862  
-0.325797854  
-0.2814136785  
-0.2456751124  
-0.2193954007  
-0.2005315643  
-0.1843816241  
-0.1641786708  
-0.1320208414  
-0.08003437387  
-0.001624599816  
0.1073466599  
0.2476210704  
0.4159834033  
0.6051793762  
0.8043453803  
0.9999312666  
1.177008862  
1.32081988  
1.418363819  
1.459830428  
1.439683409  
1.357258436  
1.216800431  
1.026945894  
0.799728419  
0.5492540507  
0.290229695  
0.03654004957  
-0.1999476343  
-0.4102136144  
-0.5884782008  
-0.7321445615  
-0.8413568863  
-0.9182750695  
-0.966222438  
-0.9888500386  
-0.9894675739  
-0.9706339359  
-0.9340754329  
-0.8809043246  
-0.812083416  
-0.7290200703  
-0.6341548388  
-0.5313933872  
-0.4262763071  
-0.3258100838  
-0.2379557941  
-0.1708187372  
-0.1316697989  
-0.1259264954  
-0.1562752229  
-0.2220681572  
-0.3191082414  
-0.4398704362  
-0.5741428237  
-0.7100060582  
-0.8350299203  
-0.9375265385  
-1.007701204  
-1.038562634  
-1.02649075  
-0.971411795  
-0.8765932108  
-0.7481231963  
-0.5941756218  
-0.4241913028  
-0.2481063518  
-0.07572307321  
0.08370176602  
0.2216540459  
0.3303939122  
0.4029110257  
0.4329342147  
0.4151151033  
0.3454709693  
0.2221127541  
0.04620173705  
-0.1770134607  
-0.4372807598  
-0.7188171494  
-1.000392299  
-1.256212599  
-1.457674409  
-1.575902586  
-1.584856018  
-1.464631429  
-1.204521511  
-0.8053519038  
-0.2806943669  
0.3433282352  
1.029731609  
1.733743211  
2.40692587  
3.001870189  
3.476887663  
3.800109761  
3.952488711  
3.92934514  
3.740285508  
3.407548739  
2.963027701  
2.444379465  
1.890744756  
1.338611581  
0.8183286208  
0.351660528  
-0.04938832387  
-0.3824210678  
-0.6532985971  
-0.8738697946  
-1.05916119  
-1.224462245  
-1.382698362  
-1.542427881  
-1.706664092  
-1.872586029  
-2.032065751  
-2.172838708  
-2.2800762  
-2.338119458  
-2.332154183  
-2.249687864  
-2.081753795  
-1.823832824  
-1.476514967  
-1.045925589  
-0.5439174701  
0.0120260688  
0.5992344059  
1.190740041  
1.756656298  
2.266036607  
2.689116654  
2.999738269  
3.177695532  
3.210698151  
3.095678786  
2.839231733  
2.457108079  
1.972803654  
1.415419085  
0.8170675261  
0.210152744  
-0.375167955  
-0.9130627824  
-1.383473924  
-1.772856581  
-2.074241925  
-2.286725915  
-2.414543373  
-2.465899493  
-2.451724872  
-2.384478966  
-2.277090712  
-2.142079967  
-1.990880316  
-1.833343206  
-1.677415747  
-1.528968364  
-1.391759119  
-1.267527385  
-1.156199936  
-1.056198012  
-0.9648284322  
-0.8787208601  
-0.7942798155  
-0.7081078429  
-0.6173704101  
-0.520067483  
-0.4152016855  
-0.3028385304  
-0.1840726659  
-0.06091481847  
0.0638769779  
0.1869953232  
0.3048015384  
0.4135497995  
0.5096152803  
0.589725778  
0.6511990346  
0.6921820448  
0.7118772686  
0.7107421326  
0.6906312944  
0.6548408347  
0.6080412727  
0.5560605  
0.5055221897  
0.4633538394  
0.4361967719  
0.4297828514  
0.4483432003  
0.4941171417  
0.5670326925  
0.66459234  
0.7819882542  
0.9124346759  
1.047683929  
1.178667848  
1.296205639  
1.391698563  
1.457770692  
1.488784287  
1.481213705  
1.433849169  
1.347823678  
1.226469754  
1.07502246  
0.9001883364  
0.7096182553  
0.5113267818  
0.3131063985  
0.1219863986  
-0.05620968783  
-0.2171766422  
-0.3582828199  
-0.4785672957  
-0.5785997361  
-0.660226621  
-0.7262594096  
-0.780137806  
-0.8256038079  
-0.8664119811  
-0.9060785471  
-0.9476627763  
-0.9935694495  
-1.045352525  
-1.103531375  
-1.167414199  
-1.234977509  
-1.30282616  
-1.366297814  
-1.419738604  
-1.456972075  
-1.471943858  
-1.459489055  
-1.416118871  
-1.340720496  
-1.235026096  
-1.103743912  
-0.9542744266  
-0.7959986472  
-0.6391985169  
-0.4937434407  
-0.3677251897  
-0.266267548  
-0.1907138339  
-0.1383557274  
-0.1027834796  
-0.07483812355  
-0.04404564589  
-0.0003139192917  
0.06436114001  
0.1544661449  
0.2700528967  
0.4064971836  
0.5549754247  
0.7036183092  
0.8391434716  
0.9487385558  
1.021888652  
1.051884178  
1.036772084  
0.9796271678  
0.8881093143  
0.7733931434  
0.6486517487  
0.5273245048  
0.4214377515  
0.3402233437  
0.2892171703  
0.2699471245  
0.2802153666  
0.3148909088  
0.3670420909  
0.4292028348  
0.4945440257  
0.5577566595  
0.6155146121  
0.6664653956  
0.710789411  
0.7494562888  
0.7833516029  
0.8124773243  
0.8354095772  
0.8491394086  
0.8493422975  
0.8310378208  
0.7895141731  
0.7213371144  
0.6252410818  
0.5027216219  
0.3581960558  
0.1986882169  
0.03306726798  
-0.1290329501  
-0.2784416635  
-0.4076297392  
-0.5116469071  
-0.5886779732  
-0.6401391582  
-0.6703136786  
-0.6855934836  
-0.693451277  
-0.7012967661  
-0.7153829778  
-0.7399050107  
-0.7764103227  
-0.8235838568  
-0.8774274818  
-0.9318008936  
-0.9792496702  
-1.012013604  
-1.023085042  
-1.007190637  
-0.9615663236  
-0.8864289534  
-0.785078994  
-0.6636124989  
-0.5302676119  
-0.3944866991  
-0.2658023672  
-0.1527048999  
-0.06163567025  
0.003738299335  
0.04286131701  
0.05817815899  
0.05458630255  
0.03852441009  
0.01684546426  
-0.004346714636  
-0.02069876251  
-0.03027009471  
-0.03373523697  
-0.03407861489  
-0.03582510085  
-0.0439344286  
-0.06255304085  
-0.09384860082  
-0.1371440503  
-0.1885264491  
-0.241027048  
-0.2853699694  
-0.3112028171  
-0.3086170881  
-0.2697439829  
-0.1901656356  
-0.06992135263  
0.08604804263  
0.2681072117  
0.4627603918  
0.6540059191  
0.8250285979  
0.960008874  
1.045804033  
1.073308195  
1.038318639  
0.9418431136  
0.7898332112  
0.5924155703  
0.3627508583  
0.1156721407  
-0.1337197985  
-0.3713515031  
-0.5852397791  
-0.7662331253  
-0.9083987524  
-1.009062044  
-1.068538471  
-1.089630229  
-1.076970803  
-1.0363042  
-0.9737818621  
-0.8953454615  
-0.8062492112  
-0.7107492926  
-0.6119741794  
-0.511957098  
-0.4118134158  
-0.3120189888  
-0.2127348589  
-0.1141444845  
-0.01674697911  
0.0784279521  
0.1696995445  
0.2547366577  
0.3306614829  
0.3942608474  
0.4422684407  
0.4716975773  
0.4801886429  
0.4663314039  
0.4299353563  
0.3722041622  
0.2957965465  
0.2047464745  
0.104248602  
0.0003054300251  
-0.100725753  
-0.1926476448  
-0.269951524  
-0.3282908232  
-0.3648554297  
-0.3785898882  
-0.3702375654  
-0.3421985416  
-0.2982150152  
-0.242925972  
-0.1813348991  
-0.1182573455  
-0.05780507013  
-0.002971161149  
0.04465205226  
0.08496982655  
0.1193097419  
0.1501640614  
0.1807884695  
0.2146982664  
0.2551256383  
0.3045065193  
0.3640691176  
0.433590155  
0.5113693093  
0.5944381942  
0.6789950445  
0.7610056594  
0.8368843027  
0.9041241846  
0.9617520943  
1.010492678  
1.052554394  
1.09103647  
1.129014765  
1.168450465  
1.209134917  
1.247896958  
1.278296722  
1.290968369  
1.274652703  
1.217852127  
1.110888266  
0.9480417405  
0.7293923432  
0.4619786467  
0.1599801015  
-0.1562322147  
-0.4621441603  
-0.7320203003  
-0.9422904824  
-1.074894417  
-1.12004947  
-1.077965755  
-0.9592061737  
-0.7835881045  
-0.5777612345  
-0.3718089761  
-0.1953774789  
-0.07389421672  
-0.02542392761  
-0.05859260729  
-0.1718261264  
-0.3539629441  
-0.5860783289  
-0.8441985444  
-1.102483385  
-1.33641371  
-1.525557543  
-1.655594692  
-1.719400928  
-1.717145203  
-1.655499519  
-1.54615469  
-1.403912241  
-1.244647029  
-1.083406985  
-0.9328696065  
-0.8022952249  
-0.6970431245  
-0.6186290435  
-0.5652361143  
-0.5325560534  
-0.5148003314  
-0.5057176203  
-0.499487691  
-0.4913717648  
-0.4780646705  
-0.4577326868  
-0.4297698722  
-0.3943533424  
-0.3519020795  
-0.3025541818  
-0.2457805426  
-0.1802165479  
-0.1037680696  
-0.01398526522  
0.09134055744  
0.2134509016  
0.3518984307  
0.5039583142  
0.6643108468  
0.8250861463  
0.9763148465  
1.106773101  
1.205128428  
1.261260964  
1.267569453  
1.220084015  
1.119206579  
0.9699576179  
0.7816630146  
0.567108417  
0.3412514121  
0.1196619592  
-0.08310918719  
-0.2550211401  
-0.3876918947  
-0.4770815948  
-0.523636422  
-0.5319088077  
-0.5097542897  
-0.4672402834  
-0.4154547316  
-0.3653721142  
-0.3269142678  
-0.3082788754  
-0.3155383531  
-0.3524499184  
-0.4203924081  
-0.5183119869  
-0.6426106443  
-0.7869571132  
-0.9420617292  
-1.095544911  
-1.232051535  
-1.333786209  
-1.381588431  
-1.356582309  
-1.242314078  
-1.027154305  
-0.7066414507  
-0.2853612783  
0.2220151701  
0.7908476074  
1.387951165  
1.974283274  
2.508640331  
2.951920823  
3.271395405  
3.444392135  
3.460862295  
3.324453149  
3.051927117  
2.6710032  
2.216931498  
1.728281161  
1.242526895  
0.7920142715  
0.4008283504  
0.08291067417  
-0.1583996874  
-0.329443422  
-0.4441655812  
-0.5212498809  
-0.5809204892  
-0.6418560948  
-0.7186229763  
-0.8199114108  
-0.9477400395  
-1.097624601  
-1.259594876  
-1.41983874  
-1.562690896  
-1.672684158  
-1.736395004  
-1.743894204  
-1.689667797  
-1.57298283  
-1.397725625  
-1.171807217  
-0.9062749329  
-0.6142601062  
-0.309908078  
-0.00738856038  
0.2799407164  
0.5401793826  
0.7633419028  
0.9416532377  
1.069708045  
1.144539306  
1.165616077  
1.134780986  
1.056135479  
0.9358490019  
0.781890817  
0.6036521283  
0.4114700339  
0.2160482886  
0.02780249671  
-0.1438348495  
-0.2910900762  
-0.4084454756  
-0.4930874047  
-0.5451362453  
-0.5676169174  
-0.5661330674  
-0.5482578383  
-0.5226808995  
-0.4981900951  
-0.4826107839  
-0.4818244629  
-0.4990061262  
-0.5342025536  
-0.5843225266  
-0.6435762841  
-0.7043100766  
-0.7581493368  
-0.7972841069  
-0.8157190878  
-0.8102838731  
-0.781250849  
-0.7324407467  
-0.6707770229  
-0.6053408743  
-0.5460508654  
-0.5021663501  
-0.4808331684  
-0.4859112501  
-0.5172665524  
-0.5706517987  
-0.6382048155  
-0.7094990568  
-0.7729914961  
-0.8176423671  
-0.8344644711  
-0.8177709744  
-0.7659262205  
-0.6815062017  
-0.570849805  
-0.4430876334  
-0.3088118949  
-0.1785923514  
-0.06156647501  
0.03569660092  
0.1099060458  
0.1612573445  
0.19313772  
0.2114027756  
0.2233576293  
0.2366085291  
0.2579547076  
0.2924783868  
0.3429412116  
0.4095631695  
0.4901731889  
0.5806942319  
0.6758709876  
0.7701113674  
0.8583180388  
0.9365852942  
1.002654139  
1.056078091  
1.098061135  
1.131020228  
1.157932407  
1.181575435  
1.203798708  
1.224941579  
1.243510841  
1.256182873  
1.258154397  
1.243790899  
1.207488436  
1.144611289  
1.052349969  
0.9303553399  
0.7810278309  
0.6094012188  
0.4226230466  
0.2290999077  
0.0374473977  
-0.1446025663  
-0.3111363848  
-0.4586962333  
-0.5864969467  
-0.6961899041  
-0.7912129572  
-0.8758375364  
-0.9540849794  
-1.028708783  
-1.100429805  
-1.167567668  
-1.226152421  
-1.270502683  
-1.294178466  
-1.2911531  
-1.256994869  
-1.189854882  
-1.091077922  
-0.9653297519  
-0.8202021235  
-0.6653623577  
