-0.1663437723  
-0.1106928833  
-0.06217570682  
-0.02504157985  
-0.002219091271  
0.004936869342  
-0.003310508089  
-0.02524238846  
-0.0580299572  
-0.09820800402  
-0.1422083846  
-0.1868685659  
-0.2298413175  
-0.2698403077  
-0.3066839267  
-0.3411327082  
-0.3745456489  
-0.4084199855  
-0.443890963  
-0.4812904201  
-0.519846461  
-0.5575900136  
-0.5914989768  
-0.6178639259  
-0.6328199375  
-0.6329598006  
-0.6159134213  
-0.5807941812  
-0.5284242143  
-0.4612922774  
-0.3832484811  
-0.2989813998  
-0.213367843  
-0.1308047367  
-0.0546342591  
0.01324547338  
0.07252626686  
0.1243830933  
0.1711496986  
0.215844027  
0.2616430634  
0.3113937629  
0.367245842  
0.4304469519  
0.5013132959  
0.5793415667  
0.6634088099  
0.7519860145  
0.8433002127  
0.9354021729  
1.026120093  
1.112929565  
1.192784936  
1.261990607  
1.316180311  
1.350462869  
1.359756181  
1.339291444  
1.285228133  
1.195284434  
1.069277027  
0.9094638318  
0.7206125903  
0.509758081  
0.2856631052  
0.05805325463  
-0.1632770081  
-0.3693506571  
-0.5527668497  
-0.7082278535  
-0.8327728157  
-0.9257086272  
-0.9882792033  
-1.02315488  
-1.033849655  
-1.024169036  
-0.9977831008  
-0.9579753182  
-0.9075787247  
-0.8490700243  
-0.7847565856  
-0.7169809049  
-0.6482625691  
-0.5813279432  
-0.5189987825  
-0.4639568421  
-0.4184286105  
-0.3838575772  
-0.3606366971  
-0.3479677309  
-0.3438828075  
-0.3454396539  
-0.349065002  
-0.3509924613  
-0.347726946  
-0.3364648115  
-0.3154055038  
-0.2839187146  
-0.2425504083  
-0.1928857966  
-0.1373008615  
-0.07865382778  
-0.01996371906  
0.03587900021  
0.08634341448  
0.1294203198  
0.1637156953  
0.1884922484  
0.2036731312  
0.2098218084  
0.2081045968  
0.2002307075  
0.1883633611  
0.1749898147  
0.1627441226  
0.1541879692  
0.1515615767  
0.1565368802  
0.1700032569  
0.1919245475  
0.2212966644  
0.256221095  
0.2940893945  
0.3318608169  
0.3663920557  
0.3947714302  
0.4146118064  
0.4242605436  
0.422904893  
0.4105649667  
0.3879935702  
0.3565118055  
0.3178181108  
0.2738130331  
0.2264672011  
0.1777499132  
0.1296161554  
0.08403475015  
0.04302589975  
0.00867249522  
-0.01692510099  
-0.03177508641  
-0.0342025716  
-0.02312593017  
0.001637612209  
0.03908955516  
0.08684854758  
0.1410898058  
0.1966683762  
0.2474461183  
0.2868136082  
0.3083609765  
0.3066260559  
0.277823472  
0.220450491  
0.1356730932  
0.02741960029  
-0.0978578555  
-0.2317389078  
-0.3646579513  
-0.4868940387  
-0.589604033  
-0.6657650681  
-0.7109007883  
-0.7234968622  
-0.7050544121  
-0.6597801673  
-0.5939648415  
-0.5151426623  
-0.4311549584  
-0.3492450638  
-0.2753062283  
-0.213370661  
-0.1653877129  
-0.1312990278  
-0.1093658883  
-0.09668055002  
-0.08976321818  
-0.08515702165  
-0.07993026952  
-0.07203504462  
-0.06048626312  
-0.04537057561  
-0.02770684008  
-0.009205723268  
0.008024418727  
0.0217821831  
0.03005348809  
0.0312471106  
0.02438259357  
0.009226520214  
-0.0136169071  
-0.04266090782  
-0.07554360958  
-0.1090990508  
-0.1395063365  
-0.1625266137  
-0.1738327552  
-0.1694167848  
-0.1460421119  
-0.1016983398  
-0.03599289177  
0.04957994671  
0.1515505603  
0.2646079166  
0.381959866  
0.4959073548  
0.5985719499  
0.6826963827  
0.7424206574  
0.7739283926  
0.77587707  
0.7495459553  
0.6986807742  
0.6290484211  
0.5477609975  
0.4624579916  
0.3804518437  
0.3079499955  
0.24944474  
0.2073443998  
0.1818757518  
0.1712562258  
0.1720950109  
0.1799577675  
0.1900098862  
0.1976540211  
0.1990810425  
0.1916747687  
0.1742278988  
0.1469602911  
0.1113496297  
0.06980674453  
0.02524985324  
-0.01937011049  
-0.06152452695  
-0.09949246745  
-0.1326244757  
-0.1614598327  
-0.1876792692  
-0.2139047312  
-0.2433668557  
-0.2794820603  
-0.3253914495  
-0.3835085311  
-0.4551377112  
-0.5402008141  
-0.6371081097  
-0.7427913611  
-0.8528954503  
-0.9621120607  
-1.064619233  
-1.154578626  
-1.226634899  
-1.276356094  
-1.300563477  
-1.297509728  
-1.266880031  
-1.209624141  
-1.12764091  
-1.023373232  
-0.899379353  
-0.7579620254  
-0.6009233707  
-0.4295031539  
-0.2445225448  
-0.04671754714  
0.1627876833  
0.381954044  
0.6073508287  
0.8338366408  
1.054487609  
1.260828252  
1.443375017  
1.592448016  
1.699157459  
1.756433356  
1.759955426  
1.708830116  
1.605905887  
1.457655397  
1.273614667  
1.065438745  
0.8456871227  
0.6265008989  
0.4183476203  
0.2290142254  
0.06298622083  
-0.07869576443  
-0.198085712  
-0.2995428615  
-0.3886274545  
-0.4708590008  
-0.5505335827  
-0.6297956647  
-0.7081260086  
-0.7823399802  
-0.8471116209  
-0.8959595338  
-0.922541403  
-0.9220524242  
-0.8924894643  
-0.835546858  
-0.7569542293  
-0.6661455177  
-0.5752400585  
-0.4974341961  
-0.4450031748  
-0.4271941187  
-0.4483389052  
-0.5065076193  
-0.5929763022  
-0.6926737315  
-0.7856398401  
-0.8493686204  
-0.8617684983  
-0.8043456463  
-0.6651646642  
-0.4411344699  
-0.139247976  
0.2234643276  
0.6213220057  
1.022585864  
1.392936546  
1.699384637  
1.914092274  
2.017595637  
2.00100102  
1.866881353  
1.628779377  
1.309426694  
0.9379517958  
0.5464837396  
0.1666133864  
-0.1738319447  
-0.4533237544  
-0.6582179842  
-0.783288848  
-0.8312570163  
-0.8114896969  
-0.738141689  
-0.6280392777  
-0.4986057954  
-0.3660662139  
-0.2440864865  
-0.1429099673  
-0.06896983919  
-0.02489012048  
-0.009756522913  
-0.019543564  
-0.04760328769  
-0.08517517663  
-0.1219154137  
-0.1464832471  
-0.1472389955  
-0.1130947915  
-0.03452693523  
0.09529548946  
0.2793668926  
0.515834721  
0.7973009516  
1.110603926  
1.437210825  
1.754278218  
2.036347478  
2.257534819  
2.39399954  
2.426405618  
2.342074757  
2.136554947  
1.814393702  
1.389003535  
0.8816211615  
0.3194784286  
-0.266605195  
-0.8449268862  
-1.385598107  
-1.86294406  
-2.257361754  
-2.556472288  
-2.755497665  
-2.856882589  
-2.869266264  
-2.805979065  
-2.683264233  
-2.518444141  
-2.328223512  
-2.127291637  
-1.927326067  
-1.73645181  
-1.559149059  
-1.396562585  
-1.247126727  
-1.107406934  
-0.9730383799  
-0.8396571454  
-0.7037212118  
-0.5631348984  
-0.4176191126  
-0.2687841377  
-0.1199022783  
0.02459834979  
0.1598590035  
0.2814432332  
0.3862040541  
0.4730282909  
0.5433343424  
0.6012073449  
0.6531063128  
0.7071308819  
0.7719033784  
0.8551938628  
0.9624723558  
1.095608759  
1.251943704  
1.423923281  
1.599420748  
1.762773923  
1.896458451  
1.983203769  
2.008282384  
1.961647301  
1.839592766  
1.64567295  
1.390703228  
1.091805726  
0.7706013972  
0.4507794084  
0.1553765378  
-0.09586120438  
-0.2886681682  
-0.4157081581  
-0.4771002465  
-0.4799830761  
-0.4372160024  
-0.3654398541  
-0.2827969065  
-0.2066473507  
-0.1515849117  
-0.1279965574  
-0.1413056283  
-0.1919217544  
-0.2758204849  
-0.3855892103  
-0.5117259123  
-0.6439752723  
-0.7725084963  
-0.8888125978  
-0.9862235608  
-1.060109661  
-1.107768656  
-1.12813967  
-1.121442381  
-1.08884481  
-1.032225762  
-0.9540607659  
-0.8574141711  
-0.7459883182  
-0.6241635006  
-0.4969546927  
-0.3698407056  
-0.2484363092  
-0.1380287848  
-0.04302657721  
0.03359934365  
0.09078470862  
0.1296667894  
0.153623835  
0.1680289743  
0.1797154533  
0.1962028088  
0.2247729736  
0.2715079616  
0.340421524  
0.4328038076  
0.5468851342  
0.6778721401  
0.8183719565  
0.9591602187  
1.09020283  
1.201795749  
1.285676942  
1.335956324  
1.349735998  
1.3273379  
1.27211039  
1.189849271  
1.087924669  
0.9742520392  
0.8562632334  
0.7400358349  
0.6297023035  
0.5272210254  
0.4325195855  
0.3439680041  
0.2590779131  
0.1752929528  
0.09072317808  
0.00469068624  
-0.08201012545  
-0.1671808251  
-0.2475988675  
-0.3196372102  
-0.3800088476  
-0.4264977581  
-0.4585363601  
-0.477519609  
-0.4867824689  
-0.4912320326  
-0.4966760586  
-0.5089495452  
-0.5329810218  
-0.5719409572  
-0.6266260216  
-0.6951777427  
-0.7731988804  
-0.8542540759  
-0.930688016  
-0.9946371309  
-1.039080301  
-1.058763058  
-1.050861617  
-1.01527943  
-0.9545439557  
-0.8733325861  
-0.7777117391  
-0.6742288345  
-0.5690072624  
-0.4669919007  
-0.3714638388  
-0.2838820837  
-0.2040599105  
-0.1306125101  
-0.06157618041  
0.004939154884  
0.07018488443  
0.1344122332  
0.1967652347  
0.2554427367  
0.3080741828  
0.3522216498  
0.3858928513  
0.4079534678  
0.4183472338  
0.4180840202  
0.4089933186  
0.3933068289  
0.3731537106  
0.3500862036  
0.3247362064  
0.2966830055  
0.2645660037  
0.226422903  
0.180189686  
0.1242579101  
0.05797271011  
-0.0180362241  
-0.1017667441  
-0.1900220175  
-0.2788273807  
-0.3639974603  
-0.4417359979  
-0.5091401481  
-0.5644914483  
-0.6072657956  
-0.6378500342  
-0.6570225057  
-0.6653118758  
-0.6623820621  
-0.6466038761  
-0.6149436166  
-0.5632404342  
-0.4868724871  
-0.3817302274  
-0.24533881  
-0.07793297795  
0.1167284827  
0.330990026  
0.553486629  
0.7699197308  
0.9643544565  
1.120878368  
1.225396872  
1.267313881  
1.240856061  
1.145850406  
0.9878481452  
0.7775836211  
0.5298500246  
0.2619573095  
-0.008019724964  
-0.262974037  
-0.488273437  
-0.6728879497  
-0.8100437934  
-0.8973865938  
-0.936699319  
-0.9332696523  
-0.8950240363  
-0.8315487555  
-0.7531086368  
-0.6697340128  
-0.5904344751  
-0.5225503244  
-0.4712543884  
-0.439195967  
-0.4262888828  
-0.4296450179  
-0.4436726398  
-0.4603512733  
-0.4696967823  
-0.4604193525  
-0.4207541799  
-0.3394253286  
-0.2066797521  
-0.01531461566  
0.2383899193  
0.5539205747  
0.9260365146  
1.344590822  
1.794704159  
2.257301752  
2.710004223  
3.128334626  
3.487193274  
3.762517426  
3.933034337  
3.981982952  
3.89867015  
3.679705765  
3.329771652  
2.861788695  
2.296396522  
1.660718042  
0.9864608801  
0.3074959987  
-0.342870019  
-0.9346533539  
-1.443674508  
-1.853480241  
-2.156463204  
-2.354041127  
-2.455860519  
-2.478125886  
-2.441259309  
-2.367194551  
-2.276654862  
-2.1867677  
-2.109328969  
-2.04993036  
-2.008052502  
-1.978078842  
-1.951053892  
-1.916901532  
-1.866737563  
-1.79490039  
-1.70035992  
-1.587251206  
-1.464423983  
-1.344050916  
-1.239488045  
-1.162728875  
-1.121858113  
-1.118948382  
-1.148787529  
-1.198715212  
-1.249680281  
-1.278451137  
-1.260708707  
-1.174605075  
-1.004270084  
-0.7427229195  
-0.3937134852  
0.02784666867  
0.4970026098  
0.9813353556  
1.444693152  
1.851584789  
2.171637155  
2.383488023  
2.477569298  
2.457365803  
2.338959315  
2.148896061  
1.920649697  
1.690144958  
1.490941517  
1.349726493  
1.282721483  
1.293494565  
1.372472618  
1.498219965  
1.640306068  
1.763368017  
1.831811033  
1.814507881  
1.688867715  
1.443741705  
1.080811176  
0.6143172087  
0.06923125907  
-0.5218260159  
-1.122449867  
-1.696548272  
-2.212117575  
-2.64422017  
-2.976835042  
-3.203427754  
-3.326276577  
-3.354773277  
-3.303031496  
-3.187221112  
-3.023041361  
-2.823698663  
-2.598644211  
-2.353193427  
-2.089004813  
-1.805260913  
-1.500292549  
-1.173328895  
-0.8260508836  
-0.4636614974  
-0.09528330204  
0.2664103042  
0.6062809208  
0.9083798106  
1.157916577  
1.343251141  
1.457595162  
1.500165817  
1.476602435  
1.398575395  
1.282626952  
1.148398474  
1.016482079  
0.9061797672  
0.8334546908  
0.8093241847  
0.8388624828  
0.920898928  
1.048393476  
1.20940074  
1.388463373  
1.568256318  
1.731293378  
1.861530723  
1.945734848  
1.974518459  
1.942992177  
1.851008432  
1.703010501  
1.507514119  
1.276282597  
1.023264213  
0.7633858787  
0.511304681  
0.2802268681  
0.08090364537  
-0.07910710701  
-0.1958448718  
-0.2689897409  
-0.3015574716  
-0.2993050378  
-0.2699352341  
-0.2222122517  
-0.1651021146  
-0.1070375686  
-0.055368501  
-0.01603189962  
0.006579806094  
0.009594520003  
-0.008449613198  
-0.04773577456  
-0.1072658963  
-0.1849034757  
-0.2773697982  
-0.3802361926  
-0.4879706846  
-0.5941041522  
-0.6915639149  
-0.7731887578  
-0.8324012138  
-0.8639665964  
-0.8647316318  
-0.8342209057  
-0.7749643604  
-0.6924697238  
-0.5947870931  
-0.4916905326  
-0.3935541814  
-0.3100704687  
-0.2489838746  
-0.2150326359  
-0.2092693431  
-0.228876857  
-0.2675312453  
-0.3162782788  
-0.3648109293  
-0.4029701832  
-0.4222541018  
-0.417112533  
-0.3858358908  
-0.330900493  
-0.2587147148  
-0.1787985414  
-0.1025095564  
-0.04149441829  
-0.006083147377  
-0.003850486961  
-0.0385385061  
-0.1094802102  
-0.2115979033  
-0.3359598561  
-0.4708130835  
-0.6029455617  
-0.7191915423  
-0.807891352  
-0.8601216405  
-0.8705619141  
-0.83790667  
-0.7648081259  
-0.6573836605  
-0.5243833548  
-0.3761443498  
-0.2234762427  
-0.07661601729  
0.05563318901  
0.1665004552  
0.2515519543  
0.3087114906  
0.3380483595  
0.341403568  
0.321935717  
0.2836669299  
0.2310832611  
0.1688240336  
0.1014622603  
0.03335969708  
-0.03144030905  
-0.08931684064  
-0.1372033617  
-0.1727565131  
-0.194548995  
-0.2022549925  
-0.196776898  
-0.1802615415  
-0.1559625564  
-0.1279285795  
-0.1005277133  
-0.0778576826  
-0.06311628156  
-0.05803494239  
-0.06247500084  
-0.07427486521  
-0.08940201998  
-0.1024123637  
-0.1071759919  
-0.09776847369  
-0.06940041506  
-0.01923723779  
0.05302274645  
0.1449204018  
0.251400874  
0.3653629526  
0.4785175788  
0.5824255299  
0.6695633537  
0.7342562419  
0.7733381735  
0.786452195  
0.7759504094  
0.7464303061  
0.7039833619  
0.6552851551  
0.6066665894  
0.5632986464  
0.5286030732  
0.5039529476  
0.4886864281  
0.480402165  
0.4754733419  
0.4696888069  
0.4589226926  
0.4397348321  
0.4098344943  
0.3683540493  
0.3159182075  
0.2545238317  
0.1872619064  
0.1179369772  
0.05063953989  
-0.01067523887  
-0.06255700306  
-0.1023478636  
-0.1283772363  
-0.1400582997  
-0.1378959296  
-0.1234200794  
-0.09905641399  
-0.06794539645  
-0.03371797929  
-0.0002358131675  
0.0286982063  
0.04964126151  
0.05980489415  
0.05731331251  
0.04139036522  
0.01244180296  
-0.02798963861  
-0.07740990842  
-0.1326857226  
-0.1904490796  
-0.247537381  
-0.3013992409  
-0.3503937271  
-0.3939216506  
-0.4323511407  
-0.4667382266  
-0.4983752846  
-0.528243564  
-0.5564654778  
-0.5818666209  
-0.601746717  
-0.6119333211  
-0.6071415721  
-0.5816214523  
-0.5300162095  
-0.4483089782  
-0.3347234539  
-0.1904258826  
-0.01990845944  
0.1690280288  
0.3657181989  
0.557465707  
0.7306720664  
0.8721268957  
0.9702969134  
1.016460694  
1.005550965  
0.9366149831  
0.8128532082  
0.6412482375  
0.4318533011  
0.1968366753  
-0.05059038911  
-0.2972426727  
-0.5309119962  
-0.7411209578  
-0.9196315409  
-1.060699648  
-1.161102795  
-1.219991083  
-1.238624026  
-1.220055867  
-1.168817003  
-1.090616077  
-0.9920663688  
-0.8804108437  
-0.7632123569  
-0.6479763503  
-0.5416742695  
-0.4501790763  
-0.3776375624  
-0.3258557193  
-0.2937884613  
-0.2772474667  
-0.2689295016  
-0.2588498091  
-0.2352081085  
-0.1856591807  
-0.09888479475  
0.033699519  
0.2163219559  
0.4475602451  
0.7195991705  
1.018224249  
1.323643128  
1.612118387  
1.858271865  
2.037818827  
2.130391858  
2.122089178  
2.007381712  
1.790095121  
1.483288834  
1.108012709  
0.6910778144  
0.2621234269  
