0.1174866656  
-0.2037239415  
-0.5254619544  
-0.8514188962  
-1.182640237  
-1.516233871  
-1.844605402  
-2.155374938  
-2.432026302  
-2.655264764  
-2.8049577  
-2.862464  
-2.81307518  
-2.648267273  
-2.367459768  
-1.979021359  
-1.500340791  
-0.9568887231  
-0.3803158574  
0.1942329072  
0.7313224064  
1.198595409  
1.569924802  
1.827985277  
1.965944922  
1.98805602  
1.90907764  
1.752569043  
1.548245299  
1.328682787  
1.125748066  
0.9671574497  
0.8735425519  
0.8563698371  
0.9169245231  
1.046467783  
1.227527032  
1.436143945  
1.644799312  
1.82565442  
1.953713188  
2.009544223  
1.981241892  
1.865436069  
1.667252714  
1.399294801  
1.079807395  
0.7302994119  
0.3729537441  
0.02816243835  
-0.2875072371  
-0.5626768356  
-0.7917314569  
-0.9745789429  
-1.115695702  
-1.2226476  
-1.304334309  
-1.369234308  
-1.423903677  
-1.471943489  
-1.513550594  
-1.545704225  
-1.562926856  
-1.558486521  
-1.525851769  
-1.460174122  
-1.359576622  
-1.226047944  
-1.065797121  
-0.8889940324  
-0.708897515  
-0.5404517439  
-0.3985182611  
-0.2959531493  
-0.2417906943  
-0.2397876054  
-0.2875572883  
-0.3764567166  
-0.4923051771  
-0.6168882128  
-0.7301060702  
-0.8125016694  
-0.8478542835  
-0.8254737683  
-0.7418661821  
-0.6015125633  
-0.4165983516  
-0.2057032078  
0.00841834679  
0.201686301  
0.3517986179  
0.441173987  
0.459318261  
0.4042888552  
0.2830326927  
0.11054704  
-0.09203286347  
-0.3001593874  
-0.489037209  
-0.6367877346  
-0.7271783491  
-0.751541377  
-0.7096416981  
-0.6093888423  
-0.4654699757  
-0.2971290644  
-0.1254261708  
0.02961853179  
0.1516057958  
0.229725389  
0.2598819842  
0.2448868558  
0.1937513425  
0.1202349858  
0.04090403003  
-0.02703520282  
-0.06783660699  
-0.06901304046  
-0.02265897403  
0.07380395146  
0.2174782904  
0.4004062984  
0.6104554406  
0.8325547346  
1.050152991  
1.246755896  
1.407411277  
1.520013849  
1.576335022  
1.572682373  
1.510139699  
1.394367474  
1.234976773  
1.044548217  
0.8373768912  
0.6280847479  
0.4302361895  
0.2551057536  
0.1107343977  
0.001371654433  
-0.07263426727  
-0.1144868153  
-0.1301853285  
-0.1274532472  
-0.1144976876  
-0.0987619629  
-0.08584756685  
-0.07876152642  
-0.07760314827  
-0.0797432837  
-0.08048730675  
-0.07410936057  
-0.05512242795  
-0.01955658678  
0.03395527023  
0.1034912866  
0.1836934411  
0.266212144  
0.3407159812  
0.3963160974  
0.4231981442  
0.4142069397  
0.3661075484  
0.2803155978  
0.1629555985  
0.02421720336  
-0.1229053253  
-0.2642938545  
-0.3865533824  
-0.4787357718  
-0.5336688282  
-0.5487073541  
-0.5258012946  
-0.4709068268  
-0.392869547  
-0.3019935403  
-0.2085433331  
-0.1214314606  
-0.04727929858  
0.01002746608  
0.04928017641  
0.07145438958  
0.07894830002  
0.07471728077  
0.06151489722  
0.0413665552  
0.01536891221  
-0.01618387874  
-0.05341198296  
-0.09632520803  
-0.1443009168  
-0.1957051644  
-0.2477585859  
-0.2966897407  
-0.3381578571  
-0.3678709551  
-0.3822719239  
-0.3791657832  
-0.3581564204  
-0.3208051647  
-0.2704698648  
-0.2118571821  
-0.1503493586  
-0.0912426373  
-0.03902191859  
0.003185706987  
0.03388648599  
0.05317751144  
0.06239356259  
0.0635273057  
0.05853452052  
0.04868724881  
0.03410088076  
0.0135659205  
-0.01526802057  
-0.05536734776  
-0.1095290357  
-0.179481167  
-0.2650439455  
-0.363531827  
-0.46954297  
-0.5752186941  
-0.6709792534  
-0.7466409898  
-0.7927649478  
-0.8020134817  
-0.7702964577  
-0.6974981381  
-0.5876473043  
-0.4484796424  
-0.2904435043  
-0.1252952362  
0.03549764324  
0.1822873631  
0.3084559521  
0.4111130541  
0.4911573341  
0.552694994  
0.6019203525  
0.6456533615  
0.6897907203  
0.737951875  
0.7905668976  
0.8445731872  
0.8938028529  
0.9299972895  
0.9442945692  
0.9289305742  
0.8788712805  
0.7930731375  
0.6751432733  
0.533258744  
0.3793272478  
0.2275008585  
0.09226116355  
-0.01362736188  
-0.08096989879  
-0.1055047128  
-0.08855730567  
-0.03687497009  
0.03833360084  
0.1230041875  
0.2022111835  
0.2622468793  
0.292454757  
0.2865525684  
0.2432514938  
0.166118426  
0.06272594875  
-0.05671866409  
-0.1810280481  
-0.2996744466  
-0.4041484571  
-0.4888289701  
-0.5512462444  
-0.5917455205  
-0.6126574729  
-0.6171797516  
-0.6082232699  
-0.5874676195  
-0.5548551489  
-0.5086448194  
-0.4460389598  
-0.3642887372  
-0.2620685357  
-0.1408349633  
-0.005862977673  
0.1333177835  
0.263275375  
0.3678853144  
0.4303048088  
0.4354754393  
0.3727874572  
0.2384844609  
0.0373601978  
-0.2166035116  
-0.5008898834  
-0.7864281623  
-1.040733571  
-1.23185  
-1.332574723  
-1.324379008  
-1.200441586  
-0.967295645  
-0.644790449  
-0.264273141  
0.1348351959  
0.5096611905  
0.8191041735  
1.028970882  
1.116307318  
1.072323398  
0.9034841272  
0.6306102036  
0.2860914295  
-0.0903802402  
-0.456976927  
-0.7750482719  
-1.013848512  
-1.154027903  
-1.189430279  
-1.127009686  
-0.9849577552  
-0.7894009991  
-0.5702095673  
-0.3565833738  
-0.1730597002  
-0.03649200709  
0.04562702568  
0.07535967021  
0.06312002088  
0.02536783744  
-0.01838023487  
-0.04870978041  
-0.04917393397  
-0.008461429284  
0.0783731834  
0.2097215234  
0.3781864366  
0.5721012495  
0.7775024891  
0.9802234558  
1.167792408  
1.330879973  
1.464138754  
1.566373563  
1.640095103  
1.690577073  
1.724605713  
1.749120338  
1.769944499  
1.790760685  
1.812457307  
1.832881423  
1.847021045  
1.847557074  
1.825717318  
1.772324599  
1.678934449  
1.538938016  
1.348530285  
1.107437838  
0.8193217336  
0.491801529  
0.13607834  
-0.2338301753  
-0.6021802667  
-0.95281277  
-1.270542032  
-1.54247108  
-1.759073946  
-1.914913059  
-2.008912116  
-2.044147876  
-2.027211466  
-1.967224307  
-1.874658151  
-1.760121355  
-1.633268878  
-1.501977513  
-1.371862501  
-1.24617385  
-1.126025118  
-1.010889477  
-0.8992291144  
-0.7891436683  
-0.6789219926  
-0.5674231176  
-0.4542428879  
-0.339698388  
-0.2246660716  
-0.110367583  
0.001833427754  
0.1105475766  
0.2143694909  
0.3117940932  
0.4010813057  
0.4801499192  
0.5465686977  
0.5977063242  
0.6310548876  
0.6446910468  
0.6378058017  
0.6111725132  
0.5674415416  
0.5111407913  
0.4483323347  
0.3859194102  
0.3306945002  
0.2882643196  
0.2620436875  
0.2525158108  
0.2569125022  
0.2694188351  
0.2819002616  
0.2850672222  
0.2698948107  
0.2290775562  
0.1582651078  
0.05687614686  
-0.07165727356  
-0.220255984  
-0.3791134032  
-0.5370163328  
-0.68283857  
-0.806971396  
-0.9024465184  
-0.9655909673  
-0.9961159168  
-0.9966628994  
-0.9719092469  
-0.9274192679  
-0.8684707936  
-0.7990742796  
-0.7213702433  
-0.6355156788  
-0.5400730742  
-0.4328208838  
-0.3118277552  
-0.1765723839  
-0.02887836918  
0.1265353202  
0.2820301974  
0.4276076535  
0.5519845775  
0.6440602492  
0.6945369485  
0.6974377782  
0.6512720103  
0.5596199288  
0.4310231704  
0.2781469025  
0.1163017949  
-0.03846845921  
-0.1714674395  
-0.2712855912  
-0.3312946954  
-0.3504602191  
-0.3333211434  
-0.2891324859  
-0.2302757258  
-0.1701818736  
-0.1210835257  
-0.09196398821  
-0.08703445422  
-0.1050053495  
-0.1392824666  
-0.1790737652  
-0.2112346289  
-0.2225519693  
-0.2020832422  
-0.1431576424  
-0.0446911894  
0.08840821113  
0.2458304891  
0.4133379691  
0.574887031  
0.7150364198  
0.8212366052  
0.8856256951  
0.9060523898  
0.8861723403  
0.8346443895  
0.7635875577  
0.6865859197  
0.6165902776  
0.5640541525  
0.5355900957  
0.5333203024  
0.5549573656  
0.5945407503  
0.6436269872  
0.6926989271  
0.7325279703  
0.7552735772  
0.7551920251  
0.7288916887  
0.6752035185  
0.5947786921  
0.4895698711  
0.3623758062  
0.2165397104  
0.05588659789  
-0.115133924  
-0.2911791437  
-0.4657508352  
-0.6310825127  
-0.7782966568  
-0.8978989549  
-0.9806047257  
-1.01840886  
-1.00573831  
-0.9404953773  
-0.8247852004  
-0.6651571021  
-0.4722721328  
-0.2599932259  
-0.04399350415  
0.15991486  
0.337498825  
0.4776052929  
0.5732199501  
0.6219356471  
0.6257838978  
0.5904943089  
0.5243436732  
0.4368153564  
0.3373278725  
0.234233268  
0.1342516815  
0.04237068772  
-0.03782532616  
-0.1035523652  
-0.1521446366  
-0.1805076033  
-0.1848848646  
-0.1610500209  
-0.1049259998  
-0.01355426728  
0.1137724547  
0.2744395043  
0.4617440759  
0.664648641  
0.8681858547  
1.054547818  
1.204781841  
1.300896402  
1.328108273  
1.276911672  
1.144655725  
0.9363791925  
0.6647353028  
0.348977522  
0.01310135397  
-0.3166403835  
-0.6145370092  
-0.8581750022  
-1.030804051  
-1.123013197  
-1.133515193  
-1.068963089  
-0.9428472724  
-0.7736364693  
-0.5824379044  
-0.3904779241  
-0.2167454086  
-0.07607980285  
0.02207232677  
0.07410387342  
0.08190805053  
0.05184259288  
-0.006799318195  
-0.08355517061  
-0.1685236418  
-0.2538040362  
-0.3344476689  
-0.4088169422  
-0.4783435039  
-0.5467664354  
-0.6190183688  
-0.6999644305  
-0.7932036994  
-0.9001347321  
-1.019399585  
-1.146790211  
-1.275582169  
-1.397235334  
-1.502333529  
-1.581618675  
-1.626985218  
-1.632321547  
-1.59411223  
-1.511774535  
-1.387712503  
-1.227126248  
-1.037600324  
-0.8285323881  
-0.6104369975  
-0.3941645562  
-0.1900856156  
-0.00728002089  
0.1472146447  
0.2690290132  
0.356887758  
0.4127604859  
0.4416792885  
0.4511858116  
0.450415095  
0.4488846123  
0.4550948911  
0.4751257424  
0.5114016866  
0.5618516366  
0.6196243775  
0.6734761965  
0.7088681096  
0.7096966303  
0.6604902217  
0.5488050012  
0.3675081683  
0.1166195197  
-0.1956089631  
-0.5525692591  
-0.9302545234  
-1.299241792  
-1.627516725  
-1.883817049  
-2.041086098  
-2.07958514  
-1.989245139  
-1.770929224  
-1.436411759  
-1.007059263  
-0.5113830227  
0.01821834947  
0.5490849614  
1.051800205  
1.503118186  
1.88792156  
2.19999118  
2.441519551  
2.621494363  
2.753230069  
2.851441146  
2.929311458  
2.995999524  
3.054953753  
3.103291445  
3.132327374  
3.129189875  
3.079286889  
2.969260275  
2.789989997  
2.539186176  
2.223137829  
1.85730751  
1.465582697  
1.07820189  
0.7285443752  
0.449153839  
0.2674911171  
0.2019879022  
0.2589561609  
0.4308339595  
0.696077276  
1.020809432  
1.362087391  
1.672440436  
1.90512847  
2.019466962  
1.985540873  
1.787714154  
1.426486398  
0.9184914309  
0.2946764993  
-0.4030571345  
-1.126287213  
-1.824994806  
-2.452390768  
-2.969115177  
-3.346415773  
-3.568085483  
-3.631104675  
-3.545080868  
-3.330678597  
-3.01728982  
-2.6402  
-2.237500354  
-1.846959133  
-1.503050002  
-1.234299533  
-1.061122558  
-0.9942808946  
-1.034094094  
-1.170492999  
-1.383945792  
-1.647226551  
-1.927914705  
-2.191417897  
-2.404270734  
-2.537392344  
-2.568984778  
-2.486762348  
-2.289271755  
-1.986130556  
-1.597129871  
-1.150257702  
-0.678823069  
-0.2179620009  
0.1991143711  
0.5447134011  
0.7997052435  
0.9556327187  
1.015624028  
0.9939512836  
0.9142303829  
0.8064190134  
0.7029279145  
0.6342752045  
0.6248035164  
0.6890121184  
0.8290022692  
1.033440568  
1.278275033  
1.529225435  
1.745834322  
1.886654136  
1.914940677  
1.804124996  
1.542298268  
1.135045284  
0.6061253739  
-0.004207841592  
-0.6431531792  
-1.251145185  
-1.768767689  
-2.143903749  
-2.338159605  
-2.331691543  
-2.125754155  
-1.742620114  
-1.222875638  
-0.6204659605  
0.003837323872  
0.5896564016  
1.083970154  
1.446917282  
1.655742653  
1.706443863  
1.613016303  
1.404510849  
1.120400935  
0.8049441087  
0.5013411091  
0.2464480175  
0.06669832211  
-0.02431430874  
-0.02639838331  
0.04846650565  
0.1788737376  
0.3377547896  
0.4966162967  
0.6296365376  
0.7171077756  
0.7478050121  
0.7200461083  
0.6413895136  
0.5270807259  
0.3975298743  
0.2751942545  
0.1812979304  
0.1328251665  
0.140166298  
0.2056993368  
0.323462008  
0.4799314644  
0.6557874267  
0.8284051751  
0.9747571901  
1.074342233  
1.111766178  
1.078662684  
0.9747183852  
0.8076893407  
0.5924320515  
0.3490792425  
0.1006190269  
-0.1298196991  
-0.3216227366  
-0.4589660336  
-0.5324355804  
-0.5398186417  
-0.4859927458  
-0.3819706675  
-0.2432554308  
-0.08774771533  
0.06650058358  
0.2033828803  
0.3104260727  
0.3798645247  
0.4090011185  
0.3998656153  
0.3582754723  
0.2924975467  
0.2117434083  
0.1247615186  
0.03873662228  
-0.04135163553  
-0.1128540089  
-0.1750901941  
-0.2286450476  
-0.2744902957  
-0.3131523583  
-0.3441194814  
-0.3656299086  
-0.374886215  
-0.3686841235  
-0.344313606  
-0.3005541059  
-0.2385506896  
-0.1623566291  
-0.07900130868  
0.001991554088  
0.0696053513  
0.1127170353  
0.1216623862  
0.08973517408  
0.01436545073  
-0.1022294816  
-0.2530449512  
-0.4269704822  
-0.6100616061  
-0.7872321213  
-0.9441176904  
-1.068843415  
-1.153433546  
-1.194666644  
-1.194253668  
-1.158324273  
-1.09630066  
-1.019333559  
-0.9385249994  
-0.8631967263  
-0.7994594246  
-0.7492803606  
-0.710196758  
-0.6757195246  
-0.6363908564  
-0.5813593895  
-0.5002696606  
-0.3852137905  
-0.2324670102  
-0.04375212935  
0.1731727166  
0.4047371284  
0.6326212419  
0.8355840593  
0.9918703903  
1.081929857  
1.091106396  
1.011956584  
0.8458475306  
0.6035833323  
0.304893655  
-0.02322261571  
-0.3491833315  
-0.6402354046  
-0.8662259345  
-1.003236824  
-1.036631085  
-0.9630664898  
-0.7911845901  
-0.5408226755  
-0.2408039638  
0.07444728215  
0.369062845  
0.6101218919  
0.771711027  
0.8381071678  
0.8056617785  
0.68312057  
0.4903431271  
0.2555918062  
0.01177402741  
-0.2078609599  
-0.3739648576  
-0.4647108012  
-0.4683205142  
-0.3841808167  
-0.2224505065  
-0.002274438654  
0.2510995562  
0.5098478271  
0.747234635  
0.9409024078  
1.075376636  
1.143488689  
1.146608181  
1.093747924  
0.999738651  
0.882801228  
0.7618836307  
0.6541378597  
0.5728427502  
0.5260182634  
0.5158352351  
0.5388392697  
0.5868836998  
0.6486057328  
0.711208838  
0.7623129704  
0.7916351847  
0.7922861347  
0.7615490276  
0.7010485469  
0.616317229  
0.5158248852  
0.4096169885  
0.3077553685  
0.218779222  
0.1484103671  
0.09870171461  
0.06775104221  
0.05004414223  
0.03737766163  
0.02023952046  
-0.01056755249  
-0.06230446789  
-0.1389465156  
-0.2403200105  
-0.3618838475  
-0.4952069561  
-0.6290847144  
-0.7511215471  
-0.8495534605  
-0.9150176963  
-0.9420073432  
-0.9297791584  
-0.8825849556  
-0.8091882784  
-0.7217399513  
-0.6341752248  
-0.560366666  
-0.5122875078  
-0.4984325496  
-0.5227145711  
-0.5839627554  
-0.67609584  
-0.7889169731  
-0.9094341351  
-1.023504513  
-1.117597949  
-1.180429251  
-1.204252495  
-1.185646173  
-1.125698195  
-1.029565016  
-0.9054956031  
-0.7634608215  
-0.6136010557  
-0.4647267113  
-0.3230983133  
-0.1916765378  
-0.06995465389  
0.04559774454  
0.1605527249  
0.2811589405  
0.4128234832  
0.5586972281  
0.7186038736  
0.8885221123  
1.060726867  
1.224591258  
1.367942074  
1.478757127  
1.546932664  
1.565814995  
1.533243136  
1.451911741  
1.328990158  
1.175063845  
1.002576809  
0.8240533822  
0.6503996379  
0.4895785197  
0.3458611749  
0.219761223  
0.1086098534  
