-0.09428491964  
-0.007146212425  
0.06954139376  
0.1145629583  
0.1120640013  
0.05436774526  
-0.05631981641  
-0.207563038  
-0.377781457  
-0.5386631387  
-0.6586268588  
-0.7069198971  
-0.6578454223  
-0.4945845539  
-0.2121157326  
0.1811582097  
0.6633223433  
1.200448255  
1.749549579  
2.262671007  
2.691669947  
2.993161242  
3.13308265  
3.09038756  
2.859465973  
2.451031983  
1.89136969  
1.220001395  
0.4859938739  
-0.2567352118  
-0.9546316242  
-1.5596884  
-2.034023186  
-2.35331763  
-2.508691445  
-2.506763929  
-2.367880289  
-2.122724173  
-1.807776911  
-1.460256618  
-1.113265167  
-0.7918414369  
-0.5104866051  
-0.2724919949  
-0.07110970639  
0.1076919644  
0.2814090295  
0.4667933626  
0.6759955548  
0.9137069694  
1.175769383  
1.449452367  
1.715301876  
1.950196309  
2.131054427  
2.23854058  
2.260145801  
2.192157614  
2.040235493  
1.818562758  
1.5477758  
1.252059633  
0.9559054588  
0.6810474884  
0.4440250086  
0.2546867928  
0.1157778829  
0.02357255411  
-0.03064518538  
-0.05856641303  
-0.07267092977  
-0.08422109954  
-0.1017267914  
-0.1300615475  
-0.1702810843  
-0.2200822812  
-0.2747350949  
-0.3282653938  
-0.3746476832  
-0.4088014785  
-0.4272428015  
-0.4283283168  
-0.4121146909  
-0.3799323131  
-0.3338217242  
-0.2759902406  
-0.2084385543  
-0.1328457734  
-0.05073905053  
0.03609941794  
0.1251069468  
0.212450888  
0.2927404338  
0.3590769514  
0.4035191909  
0.4179549766  
0.3952777477  
0.3306845089  
0.2228653514  
0.07483963014  
-0.1057667294  
-0.3071227627  
-0.5142796919  
-0.7108278438  
-0.8808947631  
-1.011182427  
-1.092722789  
-1.122064693  
-1.10169997  
-1.039661828  
-0.9483656508  
-0.8428895347  
-0.7389730573  
-0.6510463068  
-0.5905792932  
-0.5649600617  
-0.5770125761  
-0.6251412321  
-0.7039923471  
-0.8054489155  
-0.9197494507  
-1.036538811  
-1.145711743  
-1.237989345  
-1.305243367  
-1.340647902  
-1.338775602  
-1.295742144  
-1.209478574  
-1.080136148  
-0.9105635697  
-0.7067358989  
-0.4779718947  
-0.2367872328  
0.001729109593  
0.2210568581  
0.4048314347  
0.5387186011  
0.61232415  
0.6208509392  
0.5662048241  
0.4573272538  
0.3096107256  
0.1433984821  
-0.0182884116  
-0.1525302118  
-0.2394260434  
-0.2647435333  
-0.2219071055  
-0.1130163885  
0.05128495708  
0.253107757  
0.4696231212  
0.6760725622  
0.8490582749  
0.969653622  
1.025888865  
1.01426067  
0.9400520781  
0.8164280227  
0.6624456994  
0.5002742492  
0.3520335662  
0.2367015751  
0.1675248478  
0.1502855862  
0.1826414947  
0.254599584  
0.3500245294  
0.4489428151  
0.5303069625  
0.5748405233  
0.5675918345  
0.49988774  
0.3704631604  
0.1856704233  
-0.04122455814  
-0.2915378507  
-0.5432483611  
-0.7734106535  
-0.96061478  
-1.087227406  
-1.141176635  
-1.117108002  
-1.016812297  
-0.8488979804  
-0.627777065  
-0.372087835  
-0.1027408277  
0.1591967332  
0.3945507521  
0.5878154383  
0.7284807625  
0.8117905753  
0.8388771259  
0.816277333  
0.7549059125  
0.6686113638  
0.5724831482  
0.481102148  
0.4069265604  
0.3589947417  
0.3420837816  
0.3564099671  
0.3978950389  
0.4589468394  
0.5296476047  
0.5991821076  
0.6573166573  
0.6957319226  
0.7090348449  
0.6953293185  
0.6562836986  
0.5967074809  
0.5237261671  
0.4456866977  
0.3709683891  
0.3068773249  
0.258776176  
0.2295624592  
0.219542915  
0.2266875364  
0.2471905165  
0.2762104284  
0.3086524365  
0.3398490355  
0.3660266854  
0.3844916024  
0.3935273732  
0.3920551383  
0.3791534426  
0.3535690611  
0.3133539639  
0.2557458155  
0.1773580877  
0.0746973325  
-0.05505986671  
-0.2131436048  
-0.3982937264  
-0.6060728937  
-0.8285605452  
-1.054552581  
-1.27031675  
-1.460862769  
-1.611595103  
-1.710137831  
-1.748076395  
-1.722338884  
-1.635985632  
-1.498229815  
-1.323626521  
-1.130473802  
-0.9385999113  
-0.7668015436  
-0.6302829544  
-0.5384528032  
-0.493430989  
-0.4895187515  
-0.5137796317  
-0.5477116049  
-0.5698407133  
-0.5589065084  
-0.497210093  
-0.3736374516  
-0.1858910052  
0.05844036979  
0.3421979562  
0.6403824311  
0.9231064332  
1.159409833  
1.321417013  
1.388259093  
1.349195517  
1.205471618  
0.9706161722  
0.6691073621  
0.3335649458  
0.0008389038858  
-0.2924788875  
-0.5145043613  
-0.6418751543  
-0.6624233947  
-0.5763742348  
-0.3959493625  
-0.1434809027  
0.1516510273  
0.4568101421  
0.740085487  
0.9739455972  
1.138113632  
1.22136051  
1.22206724  
1.147592011  
1.012616797  
0.8367725903  
0.6418951052  
0.4492777358  
0.2772515328  
0.1393457398  
0.04319129264  
-0.009780935425  
-0.02388734225  
-0.00811096549  
0.02542283421  
0.06319780072  
0.09207005895  
0.100837193  
0.08146128758  
0.02983076118  
-0.05398121968  
-0.1659582281  
-0.2988231253  
-0.4430497787  
-0.5880865208  
-0.7236331245  
-0.8408316775  
-0.9332359851  
-0.9974552547  
-1.033402617  
-1.044124655  
-1.035238445  
-1.014042568  
-0.9884200297  
-0.9656675111  
-0.9514133095  
-0.9487677251  
-0.9578357878  
-0.9756735618  
-0.996715072  
-1.013625509  
-1.018478578  
-1.004089582  
-0.9653048628  
-0.9000381735  
-0.8098673148  
-0.7000577916  
-0.5789741086  
-0.4569263276  
-0.3446048188  
-0.251339122  
-0.1834562237  
-0.1430253904  
-0.1272240733  
-0.1284736273  
-0.1353706377  
-0.134307558  
-0.1115523366  
-0.05547428359  
0.04144395955  
0.1811339082  
0.3592693846  
0.5655166944  
0.7846919726  
0.9986609414  
1.18869504  
1.337932306  
1.433572011  
1.468490168  
1.442045195  
1.359990818  
1.233535353  
1.077720589  
0.9093871613  
0.7450263079  
0.5988333293  
0.4812105985  
0.3978950869  
0.3497768508  
0.3333714921  
0.3418197693  
0.3662216405  
0.3970905844  
0.4257045025  
0.4451870698  
0.4511939923  
0.4421611509  
0.4191332704  
0.3852531674  
0.3450296994  
0.3035192143  
0.2655437037  
0.235055397  
0.2147060513  
0.2056547705  
0.2075903221  
0.2189332202  
0.2371499973  
0.2591186737  
0.281485344  
0.3009678954  
0.3145924846  
0.3198510359  
0.314800144  
0.2981163597  
0.2691352803  
0.2278855163  
0.1751277383  
0.1123878465  
0.04197369228  
-0.03305612656  
-0.1089879397  
-0.1816378595  
-0.2466265017  
-0.2997385341  
-0.3373285639  
-0.3567359629  
-0.3566466153  
-0.337340903  
-0.3007784739  
-0.2504870813  
-0.1912470002  
-0.1286016607  
-0.06824726075  
-0.01538674193  
0.02585976996  
0.05289801786  
0.06488493651  
0.06269911081  
0.04866168055  
0.02605580417  
-0.001475701903  
-0.0305491034  
-0.05857013333  
-0.08409166686  
-0.1069407193  
-0.1281054571  
-0.1494125403  
-0.1730625622  
-0.2011133066  
-0.2350049145  
-0.2752070446  
-0.3210446774  
-0.3707235232  
-0.4215362406  
-0.4702073562  
-0.5133089476  
-0.5476767458  
-0.5707612402  
-0.5808693942  
-0.5772717725  
-0.5601810586  
-0.5306256604  
-0.49025868  
-0.4411458633  
-0.3855730985  
-0.3259024351  
-0.2644891698  
-0.2036574278  
-0.1457136209  
-0.09297951851  
-0.0478056406  
-0.01254938693  
0.01050188807  
0.01926396762  
0.01203240593  
-0.0123178033  
-0.0541460019  
-0.112901302  
-0.1870545269  
-0.274124015  
-0.3708008147  
-0.4731650879  
-0.5769636486  
-0.6779156287  
-0.7720020131  
-0.8556961403  
-0.9261109788  
-0.9810419555  
-1.01892007  
-1.038693377  
-1.039683482  
-1.021463831  
-0.9838074199  
-0.9267367592  
-0.8506875548  
-0.7567674025  
-0.6470630963  
-0.5249214834  
-0.3951208589  
-0.2638483313  
-0.1384216341  
-0.0267279527  
0.06359348977  
0.1261438977  
0.156811101  
0.1546938987  
0.1227458196  
0.06797457486  
0.001098392645  
-0.06436816513  
-0.1135447561  
-0.1319763008  
-0.107563311  
-0.03235835926  
0.09605021237  
0.2738006699  
0.4908301288  
0.7317958861  
0.9777617887  
1.208438456  
1.404676874  
1.550851986  
1.636791878  
1.658958944  
1.620709289  
1.531596787  
1.405833867  
1.260158137  
1.111435512  
0.9743691999  
0.8596510071  
0.7728133961  
0.7139180285  
0.6780777599  
0.6566873015  
0.6391296302  
0.614671246  
0.5742575746  
0.5119384207  
0.4257539025  
0.3179774768  
0.1947333655  
0.06507760998  
-0.06028831074  
-0.1704789455  
-0.2558489562  
-0.3092007612  
-0.3266346704  
-0.3079537099  
-0.2566065955  
-0.1792042997  
-0.08469134134  
0.01670165336  
0.1145927683  
0.1995382994  
0.2639490239  
0.3027499715  
0.3137240931  
0.2975274055  
0.2573944383  
0.1985929357  
0.1277027696  
0.0518145368  
-0.0222609254  
-0.08868876212  
-0.1431446329  
-0.1831453866  
-0.2081648912  
-0.2195424035  
-0.2202178955  
-0.214343039  
-0.2068203182  
-0.2028224672  
-0.2073369332  
-0.2247609295  
-0.2585655267  
-0.3110291979  
-0.3830339985  
-0.4739209247  
-0.5813980255  
-0.701512857  
-0.8287045853  
-0.9559665005  
-1.07514621  
-1.177409719  
-1.253876282  
-1.296402246  
-1.298466787  
-1.256069164  
-1.168530429  
-1.039070924  
-0.8750429028  
-0.6877177597  
-0.4915785424  
-0.303119258  
-0.1392308532  
-0.01531717758  
0.0566555867  
0.06993413937  
0.02432680205  
-0.07310125312  
-0.2081504012  
-0.3605054138  
-0.505613177  
-0.6172662989  
-0.6706210624  
-0.6453024886  
-0.5281925588  
-0.3155208645  
-0.01392802244  
0.3596982411  
0.7796640017  
1.214057422  
1.628190903  
1.988469235  
2.266175986  
2.440681914  
2.501636723  
2.449857813  
2.296813356  
2.062797586  
1.7740853  
1.459490156  
1.146822431  
0.8597379181  
0.6153816363  
0.4230965589  
0.2842918729  
0.1933903785  
0.1396200072  
0.1093166722  
0.08834909448  
0.06430660269  
0.02814637487  
-0.02487819971  
-0.09507286934  
-0.1788732505  
-0.2699625682  
-0.3607012089  
-0.4436089826  
-0.5126571492  
-0.5641815075  
-0.5973045165  
-0.6138453974  
-0.6177755688  
-0.6143542667  
-0.6091117769  
-0.6068705053  
-0.6109683715  
-0.6228141645  
-0.641835668  
-0.6658160244  
-0.6915489731  
-0.7156832058  
-0.7356028988  
-0.7501728895  
-0.7602082566  
-0.7685611264  
-0.7797848863  
-0.7994081253  
-0.8329124756  
-0.8845774589  
-0.9563842847  
-1.047184173  
-1.152314673  
-1.263795415  
-1.371146135  
-1.462787559  
-1.527871075  
-1.558294941  
-1.550602739  
-1.507427396  
-1.438173877  
-1.358701538  
-1.289896519  
-1.255187582  
-1.277223543  
-1.374100609  
-1.555654775  
-1.820386017  
-2.15356459  
-2.526957398  
-2.900420763  
-3.22534622  
-3.449685475  
-3.524002242  
-3.407807854  
-3.075331397  
-2.519885664  
-1.756139767  
-0.8198623235  
0.2349641037  
1.341380652  
2.426425307  
3.418948849  
4.257250742  
4.895510423  
5.308167405  
5.491688954  
5.463554575  
5.258684623  
4.923906099  
4.511312384  
4.071497826  
3.647617083  
3.271040298  
2.959091957  
2.715010083  
2.529922266  
2.386338707  
2.262479129  
2.136685329  
1.991224654  
1.814963506  
1.604615394  
1.364530205  
1.10522787  
0.8410558891  
0.5874580792  
0.3583409448  
0.1639622695  
0.009628600971  
-0.1046729266  
-0.1837504755  
-0.2359750271  
-0.2716163182  
-0.301063519  
-0.3332284906  
-0.3743668556  
-0.4274552656  
-0.4921604461  
-0.5653346638  
-0.641897086  
-0.7159171436  
-0.7817037579  
-0.8347312736  
-0.8722754946  
-0.8936947715  
-0.900352378  
-0.8952360312  
-0.882361409  
-0.8660770351  
-0.8503834643  
-0.8383654722  
-0.8318132925  
-0.8310650875  
-0.835080759  
-0.8417152351  
-0.8481398321  
-0.8513461816  
-0.8486616189  
-0.8382025141  
-0.819213804  
-0.7922516243  
-0.7591832213  
-0.723013521  
-0.6875476662  
-0.6569383273  
-0.6351650247  
-0.6255068578  
-0.6300764363  
-0.6494695531  
-0.6825818488  
-0.7266201059  
-0.7773157909  
-0.8293272865  
-0.8767850145  
-0.9139229491  
-0.9357208626  
-0.9384781567  
-0.9202527132  
-0.8811003481  
-0.8230932001  
-0.7501036847  
-0.6673869615  
-0.5810092721  
-0.4971924907  
-0.4216557194  
-0.3590304971  
-0.3124168663  
-0.2831288111  
-0.2706463532  
-0.2727790137  
-0.2859998067  
-0.3059078463  
-0.3277572743  
-0.3469824998  
-0.3596651063  
-0.3628929964  
-0.3549793466  
-0.3355364925  
-0.305404502  
-0.2664627088  
-0.2213527164  
-0.1731489857  
-0.1250169006  
-0.07988392988  
-0.04016144606  
-0.007528105576  
0.01720263115  
0.03412594048  
0.04419288236  
0.04906800289  
0.05090373822  
0.05204842656  
0.05471873445  
0.06066924384  
0.07089779984  
0.08543696548  
0.1032671143  
0.122389333  
0.1400682256  
0.1532430833  
0.1590728114  
0.1555540463  
0.1421284162  
0.1201786471  
0.09331219568  
0.06734092004  
0.04990240693  
0.049714279  
0.07550831972  
0.1347574193  
0.2323577964  
0.3694625231  
0.542665471  
0.7437091725  
0.9598248951  
1.174728401  
1.370193583  
1.52803106  
1.6322226  
1.670922164  
1.638038563  
1.534165284  
1.366710443  
1.149189348  
0.8997732552  
0.6392719498  
0.388830764  
0.1676363177  
-0.00907272093  
-0.1314451368  
-0.195751484  
-0.204352473  
-0.1649475181  
-0.08924367968  
0.008753405076  
0.1145819449  
0.2150596671  
0.2997017915  
0.3616641937  
0.3981311895  
0.4101438754  
0.4019320941  
0.3798817784  
0.3512925042  
0.3231090671  
0.3007901207  
0.2874537945  
0.2833985228  
0.2860425978  
0.2902793813  
0.2891900164  
0.2750258129  
0.2403367976  
0.1791120966  
0.08779771749  
-0.03393573694  
-0.1827780151  
-0.3517828395  
-0.530824199  
-0.70747713  
-0.8682557172  
-1.000084855  
-1.091843011  
-1.135790758  
-1.128693587  
-1.072470368  
-0.9742511959  
-0.8457921709  
-0.702287435  
-0.5607036054  
-0.4378325334  
-0.3483179282  
-0.3029091963  
-0.3071826194  
-0.3608982554  
-0.4580690788  
-0.5877265148  
-0.7352590072  
-0.8841322937  
-1.017756728  
-1.12125633  
-1.182930074  
-1.195241787  
-1.155260253  
-1.06454083  
-0.9285157232  
-0.7555174693  
-0.5555941382  
-0.3392889454  
-0.1165470957  
0.1041263052  
0.316163223  
0.5150639074  
0.6981829755  
0.8642476182  
1.0127201  
1.143133763  
1.254532219  
1.345113835  
1.412148484  
1.452179213  
1.461475949  
1.43665922  
1.375383641  
1.276962694  
1.142819776  
0.9766875971  
0.7845096554  
0.5740533615  
0.3542875501  
0.1346091495  
-0.07596928703  
-0.2695645152  
-0.4400035721  
-0.5831777143  
-0.6971431351  
-0.7819819716  
-0.8394673285  
-0.8726053728  
-0.8851266069  
-0.8810018552  
-0.8640356416  
-0.8375726544  
-0.8043191801  
-0.7662729452  
-0.7247308659  
-0.6803471666  
-0.6332155801  
-0.5829631405  
-0.5288528621  
-0.4699024132  
-0.405034851  
-0.3332679824  
-0.2539417681  
-0.1669667876  
-0.07306103425  
0.0260701471  
0.1276592886  
0.2279488404  
0.3224295157  
0.406239448  
0.4746873191  
0.5238264807  
0.550999361  
0.555255406  
0.5375649071  
0.5007837783  
0.4493587304  
0.3888102103  
0.3250718783  
0.2637844559  
0.2096510993  
0.1659509645  
0.1342712163  
0.1144837746  
0.1049491079  
0.102897071  
0.1049045987  
0.1073964096  
0.10708916  
0.1013294316  
0.08830119658  
0.06710557317  
0.03773622895  
0.000991021447  
-0.04164776572  
-0.08813165208  
-0.1359517146  
-0.1822396227  
-0.2238786536  
-0.2576513832  
-0.2804426773  
-0.2895041905  
-0.2827628646  
-0.2591409057  
-0.2188291811  
-0.1634593364  
-0.09612182947  
-0.02119642547  
0.05600392143  
0.1297420515  
0.1944566407  
0.2453654967  
0.2789845305  
0.2934787018  
0.2887965383  
0.2665665488  
0.2297828591  
0.1823306476  
0.1284368997  
0.07213266936  
0.01680593914  
-0.03509159889  
-0.08215903323  
-0.1239828171  
