-0.2322168677  
0.2521459443  
0.7062073415  
1.106962066  
1.43756216  
1.688988898  
1.860595503  
1.959475473  
1.998773572  
1.995232345  
1.966383724  
1.927824376  
1.891015315  
1.861909586  
1.840616032  
1.822091611  
1.797718112  
1.757456177  
1.692213148  
1.595987045  
1.46745107  
1.31070482  
1.135068527  
0.9539674196  
0.7830916453  
0.6381382448  
0.532511989  
0.475334082  
0.4700987732  
0.5141596705  
0.5991149681  
0.7120172505  
0.8371948959  
0.9584029389  
1.060956997  
1.133554587  
1.169524099  
1.167360607  
1.130506598  
1.066454969  
0.9853526366  
0.8983231373  
0.8157651184  
0.7458615256  
0.6934907129  
0.6596600188  
0.6415048232  
0.6328341095  
0.6251039231  
0.6086932972  
0.5743037604  
0.514294308  
0.4238012878  
0.3015021336  
0.149934682  
-0.02466350754  
-0.212964672  
-0.403555359  
-0.5841893251  
-0.7431621917  
-0.8706344043  
-0.9597341796  
-1.007332931  
-1.014377774  
-0.9857588234  
-0.9297211647  
-0.8568998577  
-0.7790821986  
-0.7078604038  
-0.6533065786  
-0.6228502135  
-0.6204549397  
-0.6462003612  
-0.6963010149  
-0.7635531774  
-0.8381458553  
-0.9087470008  
-0.9637211432  
-0.9923723096  
-0.9860504916  
-0.9390237798  
-0.8490355848  
-0.7174819523  
-0.5492146174  
-0.3519888141  
-0.1356221178  
0.08903987981  
0.3112405946  
0.5213769563  
0.7118883129  
0.8778547328  
1.017208545  
1.13053368  
1.220439591  
1.290602432  
1.344585075  
1.384618375  
1.410543948  
1.419111618  
1.403796593  
1.355232999  
1.262275712  
1.113596317  
0.899627207  
0.6145901738  
0.2583148635  
-0.162471971  
-0.6336302995  
-1.134007037  
-1.636808207  
-2.111813457  
-2.528204874  
-2.857678269  
-3.077428078  
-3.172637692  
-3.138135221  
-2.979001977  
-2.710074776  
-2.354398332  
-1.940869433  
-1.501361195  
-1.067716752  
-0.6689377599  
-0.3288823832  
-0.06465687556  
0.114218958  
0.2058690741  
0.2154907863  
0.1542685792  
0.0379675346  
-0.1146408709  
-0.2834055842  
-0.4483807425  
-0.5913228229  
-0.6970395695  
-0.7545527194  
-0.7580035332  
-0.7072070759  
-0.6077751148  
-0.4707132748  
-0.3114613801  
-0.1483852525  
-0.0008366696028  
0.1130614507  
0.1786363978  
0.1866393508  
0.1346732136  
0.02786675269  
-0.1213422243  
-0.2943428303  
-0.4682889828  
-0.61862313  
-0.7218790846  
-0.7584279549  
-0.7148048159  
-0.5853619223  
-0.373018115  
-0.0890399163  
0.2481132121  
0.6147466274  
0.984440011  
1.33081697  
1.630249043  
1.864174695  
2.020772051  
2.095801921  
2.092541511  
2.020848914  
1.895509442  
1.734108316  
1.554738876  
1.373851454  
1.20454328  
1.055498944  
0.9306727213  
0.8297208614  
0.749045218  
0.683236134  
0.6266399224  
0.5747874691  
0.5254324466  
0.4790547748  
0.4387608256  
0.4096159328  
0.3975771559  
0.4081799854  
0.4452511494  
0.5098372295  
0.5995276477  
0.7082625795  
0.8266658307  
0.9428134205  
1.04336937  
1.114902153  
1.145249031  
1.124771202  
1.047377223  
0.9112322457  
0.719088327  
0.4782269195  
0.2000163108  
-0.1008755353  
-0.4075529482  
-0.7021657402  
-0.9672898719  
-1.18728578  
-1.349536012  
-1.445443069  
-1.47108805  
-1.4275094  
-1.320551348  
-1.160326372  
-0.9603216731  
-0.736273336  
-0.5048810504  
-0.2825248361  
-0.08406422099  
0.0781507604  
0.1950147525  
0.2610790549  
0.2746510611  
0.2375940183  
0.1548814534  
0.0339638653  
-0.1159587201  
-0.2846820435  
-0.4616897638  
-0.6367163662  
-0.8001725219  
-0.9434144381  
-1.0588949  
-1.140247756  
-1.182363895  
-1.181509637  
-1.135517488  
-1.044054929  
-0.9089166243  
-0.7343054717  
-0.526998716  
-0.296353007  
-0.05407146033  
0.1862783625  
0.4099971788  
0.6021875124  
0.7488284972  
0.8378830224  
0.8603590245  
0.8111850882  
0.6898524548  
0.5007013383  
0.252839094  
-0.04035154817  
-0.362090837  
-0.6934085609  
-1.014590742  
-1.306759254  
-1.553409898  
-1.741780783  
-1.863879688  
-1.917054862  
-1.904009465  
-1.832269886  
-1.713128168  
-1.56020823  
-1.387834697  
-1.209405508  
-1.036014367  
-0.8754648047  
-0.7318240309  
-0.6055198353  
-0.4939382347  
-0.3923716771  
-0.2951512979  
-0.1967427569  
-0.09264637444  
0.02002400683  
0.1423450614  
0.273717867  
0.412258555  
0.5553045479  
0.6998871491  
0.8430613038  
0.9820259903  
1.114017756  
1.236037669  
1.344509366  
1.43497836  
1.501973817  
1.539122623  
1.539538555  
1.496492501  
1.404286483  
1.259225186  
1.060561081  
0.8112640619  
0.5184993399  
0.1937320907  
-0.1476166627  
-0.4869330083  
-0.8035669259  
-1.076279126  
-1.28486517  
-1.411819512  
-1.443882565  
-1.373345477  
-1.198990041  
-0.9265552708  
-0.5686873613  
-0.144347452  
0.3223021973  
0.8034700279  
1.269647997  
1.691755775  
2.043325939  
2.30258411  
2.454232773  
2.490780964  
2.413283553  
2.23137145  
1.962542442  
1.630703244  
1.264061688  
0.8925220926  
0.5448097725  
0.2456042539  
0.01299257482  
-0.1434681873  
-0.2238146276  
-0.2376930988  
-0.2032384868  
-0.144894348  
-0.09034498162  
-0.06688378256  
-0.0976558196  
-0.1982273191  
-0.3739838738  
-0.6187495052  
-0.9149166841  
-1.235138197  
-1.545467202  
-1.809563266  
-1.99343411  
-2.070055105  
-2.023223899  
-1.85006624  
-1.561824652  
-1.182793158  
-0.7475352178  
-0.2967734569  
0.1274609048  
0.4867618334  
0.7506821578  
0.899921123  
0.9279931461  
0.8412395633  
0.6572960425  
0.4023191363  
0.1074438071  
-0.1950074038  
-0.4750376299  
-0.7077993081  
-0.8754354989  
-0.9678493116  
-0.9824551  
-0.923124354  
-0.7986308866  
-0.6209056163  
-0.4034322698  
-0.1599845374  
0.09616465657  
0.3525591053  
0.5975032768  
0.819802133  
1.00850481  
1.152829322  
1.242406277  
1.267898227  
1.22193702  
1.100257877  
0.902847399  
0.6348672443  
0.3071628123  
-0.06381279327  
-0.4567273659  
-0.8467526713  
-1.207467231  
-1.513112103  
-1.74094056  
-1.873393076  
-1.899870245  
-1.817863342  
-1.633345023  
-1.360349034  
-1.019777946  
-0.6375706907  
-0.2423937666  
0.1368973692  
0.4737901927  
0.7463832144  
0.9391812736  
1.044236399  
1.061543228  
0.9986513817  
0.869550878  
0.6929521815  
0.4901594079  
0.2827532459  
0.09034333751  
-0.07137119942  
-0.1920329108  
-0.2673982092  
-0.2993840306  
-0.2953883246  
-0.2669915398  
-0.2281955944  
-0.193409575  
-0.1754412561  
-0.1837325603  
-0.2230578704  
-0.2928554105  
-0.3872774668  
-0.4959646495  
-0.6054547167  
-0.7010295095  
-0.7687867352  
-0.7976158977  
-0.780836494  
-0.7172215264  
-0.6112525912  
-0.4725599136  
-0.3145900984  
-0.1526844318  
-0.001848313881  
0.1254610621  
0.2211949688  
0.2829153074  
0.3141453128  
0.3237868396  
0.3246776623  
0.3314747567  
0.358198061  
0.4157738894  
0.5099770754  
0.6400807142  
0.7984400245  
0.9710914844  
1.139310211  
1.281928554  
1.378098295  
1.410132066  
1.366043426  
1.241440487  
1.040515757  
0.7760080865  
0.468112827  
0.1424791539  
-0.172484152  
-0.4486784506  
-0.6614025262  
-0.7921037597  
-0.8304871793  
-0.7757221248  
-0.6366338322  
-0.4308257971  
-0.1828564587  
0.0783643203  
0.3226421428  
0.5217102738  
0.6522178825  
0.6981595933  
0.6524822921  
0.5176882025  
0.3053863375  
0.03486094499  
-0.2691410158  
-0.5791394617  
-0.8678054857  
-1.110684721  
-1.28843965  
-1.388391183  
-1.405245967  
-1.340988273  
-1.204052773  
-1.007935645  
-0.769488773  
-0.5071115883  
-0.2390596588  
0.01797723699  
0.2499335316  
0.4460433717  
0.5991435209  
0.7056857213  
0.765522685  
0.7815440154  
0.7592236456  
0.7061037111  
0.6312306078  
0.5445426021  
0.4561953639  
0.3758364402  
0.311843629  
0.2705803864  
0.2557285051  
0.2677811699  
0.3037878096  
0.3574073742  
0.4193319247  
0.4780814167  
0.5211101977  
0.5361472198  
0.5126318229  
0.4430575009  
0.3240809984  
0.1572083587  
-0.05103426275  
-0.2895103022  
-0.5434223668  
-0.7957249505  
-1.028820386  
-1.226344206  
-1.374807372  
-1.464918234  
-1.492400806  
-1.458234947  
-1.36830706  
-1.232516662  
-1.063492818  
-0.8750692712  
-0.6807390786  
-0.4922660339  
-0.318629822  
-0.1654156497  
-0.03470043388  
0.07456505923  
0.1657737672  
0.2435892027  
0.3127435962  
0.3768698392  
0.4375273138  
0.493539358  
0.5407395428  
0.5721616162  
0.5786748031  
0.5500057503  
0.4760631394  
0.3484366421  
0.1619021502  
-0.08422458747  
-0.3850718438  
-0.7296895463  
-1.101132966  
-1.477239487  
-1.832070184  
-2.137928487  
-2.367800712  
-2.49796498  
-2.510485778  
-2.395295263  
-2.151604729  
-1.788421853  
-1.324101559  
-0.7849203924  
-0.2028393371  
0.3873187781  
0.9509515235  
1.456667758  
1.878880621  
2.199713837  
2.410071196  
2.509791121  
2.506942849  
2.416391434  
2.257841184  
2.053604509  
1.826319806  
1.596857308  
1.382581232  
1.19608706  
1.044503105  
0.9293430011  
0.8469205407  
0.7892198046  
0.7451599864  
0.7021223498  
0.647596683  
0.5708205685  
0.4642279181  
0.3245987986  
0.1537534441  
-0.04128807614  
-0.248727432  
-0.452976241  
-0.6361526212  
-0.7799190094  
-0.8675086727  
-0.8856972766  
-0.8265076844  
-0.688441132  
-0.4770711564  
-0.2049187784  
0.1094082438  
0.4427420473  
0.7693928488  
1.06349767  
1.301436787  
1.464049001  
1.538428939  
1.519090904  
1.408384353  
1.216110187  
0.958372088  
0.6557970631  
0.3313205182  
0.007785287435  
-0.2943661344  
-0.5590617407  
-0.7759842691  
-0.941250167  
-1.057297926  
-1.132036954  
-1.17736239  
-1.207262552  
-1.235736066  
-1.274809096  
-1.332886792  
-1.413633885  
-1.515521964  
-1.632066722  
-1.752716511  
-1.864255765  
-1.952534586  
-2.004292371  
-2.008850831  
-1.959451176  
-1.854099615  
-1.695793351  
-1.492143049  
-1.254442724  
-0.9963175857  
-0.7321520323  
-0.4754930051  
-0.2376513273  
-0.02666721181  
0.1532338885  
0.3016513765  
0.4215086197  
0.5181469728  
0.5981558  
0.6681291277  
0.7335164166  
0.7977375974  
0.8616596913  
0.9234987838  
0.9791209048  
1.022694821  
1.047564358  
1.047232129  
1.016296806  
0.9512473132  
0.8510005027  
0.717164714  
0.5539918298  
0.3680659262  
0.1677806891  
-0.037318292  
-0.2372651844  
-0.4223833904  
-0.5839278954  
-0.7146241569  
-0.8090577219  
-0.8639298212  
-0.8781678176  
-0.8529067465  
-0.7913629975  
-0.6986058221  
-0.5812500342  
-0.4470771614  
-0.3045820649  
-0.1624657837  
-0.02907712306  
0.08816809203  
0.183364297  
0.2526333839  
0.2945252366  
0.3102402518  
0.3036174955  
0.2808414863  
0.2498785915  
0.219651043  
0.1990302801  
0.195755707  
0.2154059624  
0.260574713  
0.3303646906  
0.4203170072  
0.522808229  
0.6278985461  
0.7245554961  
0.8020962457  
0.8516694853  
0.8675522543  
0.8480935787  
0.7961053394  
0.7186556882  
0.6262286151  
0.5313581452  
0.4469044262  
0.384202928  
0.3513640281  
0.3519690395  
0.3843696514  
0.4417199308  
0.512756041  
0.5832288645  
0.6378043086  
0.6621498632  
0.6449334822  
0.579420945  
0.4644590928  
0.3046998922  
0.1100375632  
-0.1056502174  
-0.3262595041  
-0.5354629452  
-0.7186633383  
-0.8646249104  
-0.9665662796  
-1.022588321  
-1.03542751  
-1.01159663  
-0.9601064741  
-0.8909674739  
-0.8137301835  
-0.736265609  
-0.6639584918  
-0.5993959597  
-0.5425469929  
-0.4913698281  
-0.4426900851  
-0.3931857972  
-0.3402957098  
-0.2829030116  
-0.221670099  
-0.1589913863  
-0.09858356503  
-0.04479125657  
-0.001745131182  
0.02747806836  
0.04153467884  
0.0412121885  
0.02945137533  
0.0109856563  
-0.008368510113  
-0.02266792995  
-0.02689431414  
-0.01794004237  
0.004647990241  
0.03829692396  
0.07750027701  
0.1143961462  
0.1397692632  
0.1443762469  
0.1203889284  
0.06277133425  
-0.02963177105  
-0.153471471  
-0.3008525608  
-0.4599349008  
-0.6161042124  
-0.7536142321  
-0.8574672985  
-0.9152961428  
-0.9189946487  
-0.8658430589  
-0.7589748862  
-0.6070974392  
-0.4234819861  
-0.2243692406  
-0.02698445666  
0.1525494892  
0.3011201408  
0.4101021221  
0.4761866117  
0.5014890788  
0.492917168  
0.4609150656  
0.4177847749  
0.3758268868  
0.345558487  
0.3342700074  
0.3450977527  
0.3767200059  
0.4237081279  
0.4774431825  
0.5274597661  
0.5630116577  
0.574638468  
0.5555096685  
0.502381407  
0.4160504858  
0.3012808916  
0.1662132315  
0.02141305568  
-0.1213379334  
-0.250297664  
-0.3549205276  
-0.4267816684  
-0.4601707186  
-0.4523404265  
-0.403431308  
-0.3161436322  
-0.1952515842  
-0.04706077827  
0.1211087662  
0.3013511719  
0.485501753  
0.6653575129  
0.8328396731  
0.9801452247  
1.099921496  
1.185504432  
1.231218751  
1.232723693  
1.187355528  
1.094414639  
0.9553334767  
0.7736860571  
0.5550107204  
0.3064588556  
0.03630205449  
-0.2466585141  
-0.5336869183  
-0.8166612421  
-1.088516287  
-1.343516019  
-1.577370594  
-1.787175361  
-1.971198112  
-2.128562806  
-2.258860163  
-2.361744426  
-2.436549482  
-2.48199074  
-2.495980717  
-2.475601477  
-2.417250015  
-2.316976681  
-2.170990631  
-1.976291827  
-1.731378148  
-1.436922349  
-1.096328035  
-0.7160828223  
-0.3057987354  
0.1220772962  
0.5529136714  
0.9708488584  
1.359970959  
1.705595685  
1.99548986  
2.220907461  
2.377271983  
2.464456277  
2.486576937  
2.451355296  
2.36910649  
2.251499635  
2.110253773  
1.955927228  
1.796974463  
1.639166133  
1.485433926  
1.336138961  
1.189669484  
1.043272444  
0.8939567449  
0.7393225354  
0.5781852924  
0.4109133045  
0.2394338098  
0.06695082892  
-0.1025797441  
-0.2650722772  
-0.4169358164  
-0.5555642849  
-0.6796176107  
-0.7890375479  
-0.8848143431  
-0.9685574596  
-1.04195488  
-1.106242077  
-1.161773279  
-1.207789229  
-1.242417856  
-1.262908626  
-1.266060695  
-1.248768555  
-1.208583035  
-1.144197827  
-1.055782586  
-0.9451184939  
-0.8155019904  
-0.6714788615  
-0.518417251  
-0.3620181883  
-0.2078312874  
-0.06082838245  
0.07490505886  
0.1963465696  
0.3015654385  
0.3896364789  
0.4604533291  
0.5144839551  
0.5524938605  
0.5752894935  
0.5834907375  
0.5773764854  
0.5568225228  
0.5213448736  
0.4702563429  
0.4029325963  
0.3191582573  
0.2195122993  
0.1057274095  
-0.01902312306  
-0.1500057149  
-0.28099515  
-0.4045810345  
-0.5126775329  
-0.597217348  
-0.6509356397  
-0.6681597659  
-0.6454914724  
-0.582309823  
-0.4810117796  
-0.3469628481  
-0.1881709479  
-0.01470460444  
0.1620794926  
0.3304221781  
0.4790836985  
0.5982337653  
0.6802268394  
0.7202213293  
0.7165718857  
0.6709749617  
0.5883423225  
0.4763780381  
0.3449048361  
0.204971267  
0.0678152252  
-0.05620294808  
-0.1585883742  
-0.2334985853  
-0.2782293534  
-0.2933283839  
-0.2823348465  
-0.2511606549  
-0.2072293922  
-0.1584794655  
-0.1123929525  
-0.07517222149  
-0.05118082181  
-0.0426948697  
-0.04997499146  
-0.07159895388  
-0.1049714027  
-0.1468922512  
-0.1941038774  
-0.2436881685  
-0.2933077985  
-0.3412491712  
-0.3863061791  
-0.4275475375  
-0.4640480259  
-0.4946404521  
-0.5177588476  
-0.5314094578  
-0.5332787437  
-0.5209775669  
-0.4923643982  
-0.4459089372  
-0.3810288819  
-0.2983305757  
-0.1997223167  
-0.08835560868  
0.03159152712  
0.1552677402  
