-0.1513337469  
0.09183993104  
0.324751747  
0.5379753668  
0.7232290379  
0.8740070314  
0.9860879219  
1.057853176  
1.090386651  
1.087317442  
1.054421614  
0.9990090177  
0.9291454414  
0.852795087  
0.7769737604  
0.7070243535  
0.6461080579  
0.5950066175  
0.5522799897  
0.5147894563  
0.4785277165  
0.4396625695  
0.3956291434  
0.3460988525  
0.2936453648  
0.2439691439  
0.2055815317  
0.1889626732  
0.2052626361  
0.2647108779  
0.3749641276  
0.5396199341  
0.7571393514  
1.020342756  
1.316570363  
1.62852895  
1.935695888  
2.216142126  
2.448529417  
2.614059256  
2.698151701  
2.691681882  
2.591672878  
2.401405724  
2.129980795  
1.791409074  
1.403359329  
0.985688907  
0.5588960133  
0.1426151604  
-0.2457320276  
-0.5920480761  
-0.8863511986  
-1.123202635  
-1.3017332  
-1.42526267  
-1.500549195  
-1.536729883  
-1.544064639  
-1.53261533  
-1.51102865  
-1.485574041  
-1.459563782  
-1.433242117  
-1.404153271  
-1.367928881  
-1.319370274  
-1.253647879  
-1.167420626  
-1.059686537  
-0.9322234249  
-0.7895410049  
-0.6383636691  
-0.4867115338  
-0.342759211  
-0.2136629628  
-0.1045472912  
-0.01784665558  
0.04690375087  
0.09277261231  
0.1246964697  
0.1484292628  
0.1693521717  
0.1913658055  
0.2160512287  
0.2422586502  
0.2662098163  
0.2821015623  
0.2831375321  
0.2627981543  
0.2161724173  
0.1410819211  
0.03883517841  
-0.08556100699  
-0.2237766879  
-0.3650877769  
-0.4977221858  
-0.6104242741  
-0.6939825256  
-0.7424886132  
-0.7541162297  
-0.7313032522  
-0.6803182339  
-0.6102826384  
-0.531822485  
-0.4555707184  
-0.3907683913  
-0.3441732094  
-0.319439376  
-0.3170298917  
-0.3346432821  
-0.3680236256  
-0.4120082979  
-0.4615714679  
-0.5127012982  
-0.562942387  
-0.6115215198  
-0.6590621951  
-0.7069592372  
-0.7565549747  
-0.8082857611  
-0.8609820833  
-0.9114543605  
-0.9544668202  
-0.9830992011  
-0.9894585494  
-0.9656039791  
-0.9045524786  
-0.8011954663  
-0.6529915587  
-0.4603663671  
-0.2267729504  
0.04153907027  
0.3359659213  
0.6461181808  
0.9604120783  
1.26662262  
1.552368166  
1.805551904  
2.014799693  
2.169942886  
2.262592147  
2.286807226  
2.239804052  
2.122617199  
1.940586855  
1.703530015  
1.425470639  
1.123877981  
0.8183936003  
0.5291616263  
0.2749180118  
0.07108168346  
-0.07189306233  
-0.1496530771  
-0.1643789985  
-0.1244049108  
-0.04305418929  
0.06319929307  
0.1769832069  
0.282395587  
0.3671337879  
0.4240821143  
0.4520975097  
0.4558738056  
0.4448892036  
0.431585587  
0.4290482544  
0.4485354119  
0.4972285339  
0.5765639315  
0.6813969761  
0.8001593712  
0.9160039797  
1.008788371  
1.057642066  
1.043742789  
0.952929587  
0.7777752293  
0.5188384378  
0.1849142582  
-0.2077139271  
-0.6369298197  
-1.077071518  
-1.501538727  
-1.885353033  
-2.207348176  
-2.451728202  
-2.608874869  
-2.675369546  
-2.653363258  
-2.549473179  
-2.373467783  
-2.136969419  
-1.85238148  
-1.532168721  
-1.188501946  
-0.833228707  
-0.4780256195  
-0.1345924028  
0.1852871884  
0.4699186523  
0.7081739971  
0.8902278984  
1.008485373  
1.058527253  
1.039922719  
0.9567228883  
0.8175291583  
0.6350587203  
0.4252302986  
0.2058573624  
-0.004903014999  
-0.1901585061  
-0.3357565032  
-0.4314440743  
-0.4716109659  
-0.4555378611  
-0.3871686836  
-0.2744824974  
-0.1285693823  
0.03743997454  
0.2094663843  
0.3734682043  
0.5162571054  
0.6261095824  
0.6931807235  
0.7097720699  
0.6705098892  
0.5724903159  
0.4154537904  
0.2019889143  
-0.06223471736  
-0.3682464865  
-0.7036475785  
-1.052660575  
-1.396431115  
-1.713664502  
-1.981638138  
-2.177582549  
-2.280383188  
-2.27248252  
-2.141831041  
-1.883665074  
-1.50188941  
-1.009846952  
-0.4302694955  
0.205684988  
0.8603593445  
1.492376585  
2.060075288  
2.525275517  
2.856996483  
3.034677745  
3.050519718  
2.910596718  
2.634553598  
2.253849422  
1.808687488  
1.343949501  
0.9045840124  
0.5309759838  
0.2548345207  
0.09608746718  
0.06112551652  
0.1425965092  
0.3207248285  
0.5659744859  
0.8426836834  
1.113212746  
1.342092806  
1.499685403  
1.564955383  
1.527090754  
1.385852326  
1.15071276  
0.8389977376  
0.4733139034  
0.07866581459  
-0.3203683934  
-0.7020572581  
-1.04927028  
-1.350417737  
-1.599548894  
-1.795711291  
-1.941740061  
-2.042754826  
-2.1046271  
-2.132670731  
-2.130762576  
-2.100997365  
-2.043885703  
-1.959002675  
-1.845921546  
-1.705209375  
-1.53926306  
-1.352790278  
-1.152820291  
-0.9482123526  
-0.7487249699  
-0.5638208301  
-0.4013914531  
-0.2666628494  
-0.1614630233  
-0.08400911361  
-0.02926190101  
0.01019503743  
0.04290367729  
0.07709741449  
0.1193393006  
0.1734511386  
0.2399153783  
0.3158470494  
0.3955296239  
0.4714319513  
0.5355200626  
0.5806552514  
0.6018425195  
0.5971403338  
0.5680881015  
0.5195952406  
0.4593257851  
0.3966912562  
0.3415948948  
0.3031369449  
0.2884467378  
0.3018043883  
0.344128926  
0.4128886024  
0.5023953597  
0.6044193296  
0.7090220604  
0.8055139615  
0.8834176909  
0.9333848837  
0.9479916401  
0.9223815604  
0.8547328572  
0.7465250991  
0.6025857778  
0.4308987502  
0.2421414018  
0.04897681583  
-0.1349047696  
-0.2959170538  
-0.4217978881  
-0.5028070364  
-0.5327512138  
-0.5097272533  
-0.4364598884  
-0.3201963982  
-0.1721314331  
-0.006423003404  
0.1611047106  
0.3144412941  
0.4388884618  
0.5224490934  
0.5569595288  
0.5388605609  
0.4695613847  
0.3553410264  
0.206808361  
0.03795771061  
-0.1351219191  
-0.2957732347  
-0.4284226165  
-0.5201910951  
-0.5623288237  
-0.551295825  
-0.4893333925  
-0.3844468712  
-0.2497171684  
-0.1019968549  
0.03991109351  
0.1574025881  
0.2342847864  
0.2587791847  
0.2250421604  
0.1339852828  
-0.00674173607  
-0.1836066156  
-0.3788010559  
-0.5723875937  
-0.7446954222  
-0.8786597398  
-0.9617879311  
-0.9875186137  
-0.9558030297  
-0.8728798062  
-0.7502951729  
-0.6033506423  
-0.4492023278  
-0.3048833828  
-0.1855046489  
-0.1028455092  
-0.06445907931  
-0.07334639616  
-0.1281508153  
-0.2237452446  
-0.3520720204  
-0.5030405288  
-0.6653513978  
-0.8271425766  
-0.9764177729  
-1.101309761  
-1.190254252  
-1.232205482  
-1.2170173  
-1.13606639  
-0.9831484539  
-0.7555811016  
-0.4553716911  
-0.09024063635  
0.3257510226  
0.772191404  
1.223117475  
1.648671646  
2.017564978  
2.300130655  
2.471632944  
2.515400566  
2.425347471  
2.207455478  
1.879943591  
1.471972791  
1.020972914  
0.5688461829  
0.1574812483  
-0.1758523942  
-0.4026618123  
-0.5063747324  
-0.4840717682  
-0.3465513536  
-0.1167392484  
0.1733446673  
0.4866436758  
0.78559323  
1.036504096  
1.213240707  
1.299717861  
1.29095805  
1.192638944  
1.019296822  
0.7915303586  
0.5326877181  
0.2655457761  
0.009481178516  
-0.2214789392  
-0.4195174464  
-0.5827531749  
-0.7139896149  
-0.8187844722  
-0.9032511636  
-0.9720036278  
-1.026652478  
-1.065120725  
-1.081914772  
-1.06931709  
-1.01928471  
-0.9257230828  
-0.786711801  
-0.6062506944  
-0.3951533928  
-0.1708393855  
0.04406274646  
0.2241884623  
0.3446877887  
0.384821314  
0.331360269  
0.1812629137  
-0.05684547956  
-0.362694298  
-0.7060047403  
-1.049606032  
-1.353684923  
-1.580623258  
-1.699784858  
-1.691590422  
-1.550297038  
-1.285077756  
-0.9192256144  
-0.4875636874  
-0.03239880516  
0.4014588083  
0.7719421691  
1.0445642  
1.196231846  
1.217560339  
1.113445482  
0.9018644381  
0.6111285331  
0.2759933868  
-0.06681517753  
-0.3830794817  
-0.6449778899  
-0.8339188151  
-0.9420079522  
-0.9720388966  
-0.9360877578  
-0.8529914612  
-0.7451129412  
-0.634869402  
-0.541520026  
-0.4786273503  
-0.4525016813  
-0.4617815414  
-0.4981414181  
-0.5479608732  
-0.594660192  
-0.6213517675  
-0.6133992079  
-0.5605442043  
-0.4583202227  
-0.3085893324  
-0.1191856022  
0.09724626544  
0.3249997248  
0.5473601969  
0.7486542073  
0.9160070136  
1.040577049  
1.118141381  
1.149001909  
1.137308878  
1.08996185  
1.015331495  
0.9220294854  
0.8179523563  
0.7097283329  
0.602632325  
0.5009136654  
0.4084061622  
0.3292176812  
0.2682733777  
0.2315199635  
0.2256559765  
0.2573432696  
0.3319890512  
0.4522721991  
0.616684764  
0.8183844576  
1.044636528  
1.277066884  
1.492811389  
1.666524885  
1.773060309  
1.790513313  
1.703233606  
1.504387345  
1.197687663  
0.7979929476  
0.3306127652  
-0.1706646534  
-0.6666641146  
-1.116682931  
-1.482712706  
-1.73349394  
-1.847932888  
-1.817467568  
-1.647082125  
-1.354853898  
-0.9700769552  
-0.5302110805  
-0.07698507941  
0.3478631858  
0.7067461498  
0.9698234378  
1.117671242  
1.142774493  
1.049737904  
0.8542414899  
0.5809248499  
0.2604561433  
-0.07386182571  
-0.3895960091  
-0.6584290483  
-0.8588306017  
-0.9779020203  
-1.012255052  
-0.9678404161  
-0.8588024305  
-0.705491839  
-0.5318805309  
-0.3626771902  
-0.2204580069  
-0.1231602299  
-0.08219471754  
-0.1014077447  
-0.1769826845  
-0.2982708417  
-0.4494370654  
-0.6116680056  
-0.7656629443  
-0.8940577048  
-0.9834843078  
-1.025995602  
-1.019711258  
-0.9686336401  
-0.8817099299  
-0.7713229396  
-0.6514426996  
-0.535731038  
-0.4358410613  
-0.3601224024  
-0.3128813363  
-0.294207938  
-0.300362441  
-0.3246017893  
-0.358294815  
-0.3921797859  
-0.4175930575  
-0.4275462811  
-0.4175413308  
-0.3860686756  
-0.3347464199  
-0.268111837  
-0.193069164  
-0.1180687452  
-0.05206679373  
-0.003378531537  
0.02147246929  
0.01877003844  
-0.01162730886  
-0.06590328003  
-0.1363616449  
-0.2120023077  
-0.2795882778  
-0.3251070712  
-0.3354801281  
-0.3003180911  
-0.2134950121  
-0.07431466831  
0.1119263263  
0.3340967805  
0.5761493814  
0.8187186853  
1.041245184  
1.224345901  
1.352145737  
1.414245756  
1.407047974  
1.334243139  
1.206373363  
1.039509927  
0.8532109662  
0.6680299546  
0.5029213478  
0.3728755183  
0.287125236  
0.2481508381  
0.2516095919  
0.2871919075  
0.3402600635  
0.3940295282  
0.4319825965  
0.4401634  
0.4090543036  
0.334763525  
0.2194075192  
0.07065141905  
-0.09949722182  
-0.2763978587  
-0.4447592065  
-0.590552476  
-0.7025920303  
-0.7735650215  
-0.800408952  
-0.7840172421  
-0.7284059586  
-0.6395340565  
-0.5240343042  
-0.3880924496  
-0.2367110975  
-0.07345537029  
0.09927929065  
0.2795756201  
0.4650623428  
0.6519675717  
0.8344243005  
1.00421222  
1.151080633  
1.263649005  
1.330789589  
1.343275761  
1.295420897  
1.186409017  
1.021054803  
0.8098118897  
0.5679730373  
0.3141294189  
0.06808313476  
-0.151480384  
-0.3292490542  
-0.4551141488  
-0.5253158845  
-0.5427324799  
-0.516278233  
-0.4594961143  
-0.388575582  
-0.320071868  
-0.2686671046  
-0.2452824651  
-0.2557938036  
-0.3005105559  
-0.3744536801  
-0.4683612776  
-0.5702568241  
-0.6673262033  
-0.7478349228  
-0.8028172464  
-0.8272881386  
-0.8208409074  
-0.7875249128  
-0.7350599315  
-0.6734653298  
-0.6133270295  
-0.5639230716  
-0.5314990883  
-0.5179326548  
-0.5200155488  
-0.5294839887  
-0.5338468115  
-0.5179360669  
-0.4660199398  
-0.3642223034  
-0.2029110363  
0.02124101205  
0.3038617104  
0.6323739167  
0.9865073198  
1.339829646  
1.662158917  
1.922596756  
2.092829904  
2.150303839  
2.0808768  
1.88061123  
1.556484992  
1.12591759  
0.6151762659  
0.05686160503  
-0.5132212947  
-1.059416377  
-1.549396085  
-1.956807088  
-2.263103057  
-2.458420689  
-2.541465271  
-2.518537116  
-2.401907212  
-2.207829133  
-1.954500894  
-1.660245778  
-1.342119991  
-1.015073828  
-0.6916580342  
-0.3821971933  
-0.09525528564  
0.1617942288  
0.3823055032  
0.5601595696  
0.6899075191  
0.7672519676  
0.7897900113  
0.7578393746  
0.6751492409  
0.5493210119  
0.3917330024  
0.216943539  
0.04153653672  
-0.1174398142  
-0.2442741336  
-0.3263623322  
-0.3557044892  
-0.3298882284  
-0.2524094711  
-0.1322617788  
0.01715544707  
0.1796656718  
0.3382495198  
0.4770350883  
0.5830587457  
0.6475852127  
0.6668113128  
0.6419202401  
0.5784925811  
0.4854172373  
0.373488192  
0.2539101669  
0.1369302718  
0.0307822439  
-0.05894172476  
-0.129452211  
-0.1804904347  
-0.2137292853  
-0.2319965712  
-0.2384809646  
-0.2360683009  
-0.2269053509  
-0.2122587525  
-0.1926426329  
-0.1681465231  
-0.1388760296  
-0.1053692122  
-0.06889724221  
-0.03155856637  
0.003848068315  
0.03415451657  
0.05630267719  
0.06786380286  
0.06750375229  
0.05529487865  
0.03281522485  
0.003017377452  
-0.03012994491  
-0.06213698945  
-0.08858124127  
-0.1056409886  
-0.1105351002  
-0.101760219  
-0.07912126923  
-0.04354989678  
0.003254892749  
0.05928002414  
0.1226721635  
0.1921328094  
0.2671652596  
0.3481272589  
0.4360553045  
0.5322968831  
0.6379989388  
0.7535318827  
0.8779606791  
1.008652089  
1.141112788  
1.269102926  
1.385052579  
1.480739659  
1.54815598  
1.580461202  
1.572881198  
1.523426212  
1.433318372  
1.307045023  
1.151994557  
0.9777207624  
0.7948926194  
0.6140681079  
0.4444462924  
0.2927747667  
0.1625642069  
0.05374269586  
-0.03718348662  
-0.1164767564  
-0.1920807921  
-0.2722599762  
-0.3641388305  
-0.4723744866  
-0.5981520726  
-0.7386782565  
-0.8872635968  
-1.0340236  
-1.167105913  
-1.274300536  
-1.344807282  
-1.37089713  
-1.349227523  
-1.28158012  
-1.174891995  
-1.040522115  
-0.8928319611  
-0.747245263  
-0.6180553397  
-0.5163078063  
-0.4480872719  
-0.4135151982  
-0.4066626231  
-0.4164504503  
-0.4284841991  
-0.4275595819  
-0.4005045225  
-0.3388882856  
-0.2411405681  
-0.1136611651  
0.0293515526  
0.1674520016  
0.276739595  
0.3335455151  
0.318487175  
0.2202529981  
0.03848201931  
-0.2148241658  
-0.5156807799  
-0.8304037278  
-1.11956503  
-1.343143722  
-1.466139551  
-1.463853326  
-1.32599196  
-1.058962234  
-0.6859165498  
-0.244490895  
0.2175088461  
0.6478891471  
0.9965236964  
1.221565107  
1.294577148  
1.203884622  
0.9557435014  
0.5732448729  
0.09319239139  
-0.4385198606  
-0.9723440555  
-1.460567883  
-1.862147792  
-2.146345751  
-2.294831237  
-2.302160991  
-2.174793904  
-1.928943186  
-1.587727294  
-1.178058914  
-0.7277212187  
-0.2629480536  
0.1932814241  
0.6221780763  
1.009348782  
1.34445815  
1.620524912  
1.83310468  
1.979549934  
2.058509711  
2.069739837  
2.014246917  
1.894701368  
1.715999778  
1.485833598  
1.215107984  
0.9180547854  
0.6119377867  
0.3162882017  
0.05168126824  
-0.1618745194  
-0.3067865178  
-0.3697663288  
-0.343532847  
-0.2280830589  
-0.03132633438  
0.2310677669  
0.5366917891  
0.8582198603  
1.165913317  
1.43054175  
1.62639942  
1.734065825  
1.74256317  
1.65062541  
1.46688137  
1.208915082  
0.9012644986  
0.5725975617  
0.2523743133  
-0.03258600746  
-0.2612284282  
-0.4206845212  
-0.5076875373  
-0.5287993567  
-0.4994010717  
-0.4415745194  
-0.3811099366  
-0.3440220181  
-0.3529860566  
-0.4241652581  
-0.5648202552  
-0.7720273078  
-1.03268201  
-1.324809876  
-1.620042813  
-1.886951545  
-2.094818958  
-2.21738994  
-2.236090903  
-2.142322895  
-1.938525283  
-1.637873418  
-1.26267362  
-0.8416676419  
-0.4066364267  
