554.7444374  
622.6351767  
765.1281345  
1092.867126  
2105.357684  
5749.437907  
24663.77359  
14253.77974  
1921.566819  
48195.96957  
566.561877  
27853.19379  
49953.12146  
36369.23535  
6665.112942  
7959.190709  
22024.11509  
7563.412589  
31013.02355  
16506.35608  
2590.648065  
2641.523428  
26900.94547  
8861.547689  
1126.995581  
8566.410503  
4462.581704  
891.6097203  
15191.12193  
14184.01755  
11865.81221  
1625.638345  
697.964286  
9110.149721  
675.5904233  
8058.771269  
1919.135602  
542.9064663  
3585.935164  
4386.809258  
45.24350093  
3923.98097  
6629.09547  
2109.631996  
924.4249255  
3482.367745  
1497.83108  
3083.386732  
455.6786812  
57.30073643  
2937.337313  
2836.191868  
6833.679566  
1220.01667  
123.9912389  
3139.16075  
613.1701022  
4956.343465  
74.35953955  
2597.638859  
694.2077685  
447.1214496  
401.6027493  
798.9359338  
1501.373132  
1568.399667  
15.13407278  
116.0107551  
23.01163827  
22.60958384  
46.38967856  
16.80030033  
5.242527692  
11.72169794  
11.27263442  
29.64431257  
9.247388066  
1.031164173  
1.891233098  
0.02691346864  
1.523212693  
3.606673332  
1.495031196  
0.8317926857  
0.8776594652  
1.11599648  
0.5183260209  
0.8185362098  
0.7803099826  
0.4827532837  
0.6318936496  
0.5299819311  
0.5223408643  
0.3986099496  
0.4521698731  
0.4398306191  
0.4154570941  
0.4100168814  
0.3706134746  
0.3362201392  
0.3339344228  
0.3399282521  
0.3246803809  
0.313449166  
0.2948851602  
0.2751839297  
0.2599028472  
0.2540090165  
0.2454410787  
0.2383323144  
0.2304279133  
0.219609784  
0.2102893582  
0.2044859346  
0.1962021548  
0.1886622814  
0.1847547531  
0.178072723  
0.1719200766  
0.1658021638  
0.1606767317  
0.1556539279  
0.1512096329  
0.1464410123  
0.1421367333  
0.1385540221  
0.1347674889  
0.1307005285  
0.1270677504  
0.1235426811  
0.1201547938  
0.117025903  
0.1139026395  
0.1107954188  
0.1079380945  
0.1052525407  
0.1025974691  
0.1000470942  
0.09752384846  
0.09516844429  
0.09288425795  
0.09069021787  
0.08853333517  
0.08646794565  
0.08449341259  
0.08256840676  
0.08073163042  
0.07893431291  
0.07718768251  
0.07551402584  
0.07388519063  
0.07231183769  
0.07079471766  
0.06933019477  
0.06789208304  
0.06650528654  
0.06516182048  
0.06385574665  
0.06260076896  
0.06138130419  
0.06018494057  
0.05903253569  
0.05791340243  
0.05682425726  
0.05576383994  
0.05473707533  
0.05373685477  
0.05276734956  
0.05182671592  
0.05091287321  
0.05001739182  
0.04914958536  
0.04830554032  
0.04747964006  
0.04668075774  
0.04589806761  
0.04513721353  
0.04439930622  
0.04367142555  
0.04297246662  
0.04228565384  
0.0416173601  
0.04096014406  
0.04032403223  
0.03970775061  
0.03910358854  
0.03850569138  
0.0379358846  
0.03736992026  
0.03682239621  
0.03628335745  
0.03575772846  
0.03524735068  
0.03474503884  
0.03425886233  
0.03377547462  
0.0333086372  
0.03285199803  
0.03241221804  
0.0319694008  
0.03154087385  
0.03112317301  
0.03071641911  
0.03031565924  
0.02992662068  
0.02954117143  
0.02916282702  
0.02879617527  
0.0284358841  
0.02808054252  
0.02773766523  
0.02739753715  
0.02706871595  
0.02674503768  
0.0264258341  
0.02611445561  
0.02580562674  
0.02550940293  
0.02521744504  
0.02492418061  
0.02464520015  
0.02436839836  
0.02409556448  
0.02383236777  
0.02356766553  
0.02330886167  
0.02306102029  
0.02281205863  
0.02256676624  
0.02233436692  
0.0221017096  
0.02186922518  
0.02164382533  
0.02142160876  
0.0212041342  
0.02099261165  
0.02078256196  
0.02057663015  
0.02037204031  
0.02017762105  
0.01998139076  
0.01978653731  
0.01960007151  
0.0194127268  
0.01922993119  
0.01905552494  
0.01887546568  
0.01870209796  
0.01853409159  
0.01836561815  
0.01820035252  
0.01804013516  
0.01788043815  
0.01772562294  
0.01757143389  
0.01742004673  
0.01727038261  
0.01711976723  
0.0169767932  
0.0168353481  
0.01669520386  
0.01655800609  
0.01642233663  
0.01628763084  
0.01616069165  
0.01603038072  
0.01590292814  
0.01577511824  
0.01565249663  
0.01553087868  
0.0154139306  
0.01529492825  
0.01517952328  
0.01506579942  
0.01495244601  
0.0148384144  
0.0147311303  
0.01462390771  
0.01452122664  
0.0144127708  
0.01431280662  
0.01421116591  
0.01410758578  
0.01400983361  
0.01391391763  
0.01381670141  
0.01372390771  
0.01362932405  
0.01353872638  
0.01344828148  
0.01335698695  
0.0132711312  
0.01318382227  
0.01309649787  
0.0130156323  
0.0129319961  
0.01285160917  
0.01277003858  
0.01268857809  
0.01261104224  
0.01253230787  
0.0124558472  
0.01237959985  
0.01230795149  
0.01223289213  
0.0121586332  
0.01208707171  
0.01201840459  
0.01195048464  
0.0118804905  
0.01181452267  
0.01174611833  
0.0116791271  
0.01161431451  
0.01155325433  
0.0114910192  
0.01142775126  
0.01136581358  
0.01130335459  
0.01124517483  
0.01118448639  
0.01112562918  
0.01106903384  
0.01101226917  
0.01095377329  
0.01090154959  
0.0108453885  
0.01079178236  
0.0107387193  
0.01068826137  
0.01063072378  
0.01058069509  
0.01053168622  
0.01048142241  
0.01043308929  
0.01038220334  
0.01033510317  
0.01028661906  
0.01024143443  
0.01019349384  
0.01014963754  
0.01010265737  
0.0100586993  
0.01001478582  
0.009971132317  
0.009928802095  
0.009887929969  
0.009846298022  
0.009804954219  
0.00976166991  
0.009723082318  
0.009684289669  
0.009644506313  
0.009604894665  
0.009566454786  
0.009529775841  
0.009489939964  
0.009454875732  
0.009419596397  
0.009383300097  
0.009346261765  
0.009312173699  
0.00927868458  
0.009243349781  
0.009211868072  
0.00917761736  
0.009144371969  
0.009109198732  
0.009080447443  
0.009050142834  
0.009015194058  
0.008986371044  
0.008956078885  
0.008925466184  
0.008895591028  
0.008865373333  
0.008838491457  
0.008807897179  
0.008782425902  
0.008754984723  
0.008727331467  
0.008699928534  
0.008671818262  
0.008647044143  
0.008620329331  
0.008596956387  
0.008569371733  
0.008543752455  
0.008521858343  
0.008495057321  
0.008472440377  
0.00845071804  
0.00842726536  
0.008402671616  
0.008381435599  
0.008357480258  
0.008336224986  
0.008313100584  
0.008291798398  
0.008272742732  
0.0082522876  
0.008227918797  
0.008210454669  
0.008190763002  
0.008169813445  
0.008151144644  
0.008131273008  
0.008113189237  
0.008094505481  
0.0080767483  
0.008058562441  
0.008039579204  
0.008024303186  
0.008004182477  
0.007989443004  
0.007971658456  
0.00795477698  
0.007940369991  
0.007923811903  
0.00790762282  
0.007893816422  
0.00788005226  
0.007864094231  
0.007847174777  
0.007834318718  
0.007820614607  
0.007807792688  
0.007793109078  
0.00777967972  
0.007766287497  
0.007750958014  
0.007738646206  
0.007727397054  
0.007715920128  
0.007703291898  
0.007691782373  
0.00767987314  
0.007667347865  
0.007657721024  
0.007648721768  
0.007637337402  
0.007627203275  
0.007616881506  
0.007607783679  
0.007596083078  
0.007585222331  
0.007577799781  
0.007568511885  
0.007557887202  
0.007551241984  
0.007540337332  
0.007533880632  
0.007525065074  
0.007517017331  
0.007508855744  
0.007502967282  
0.007493232163  
0.007485573803  
0.007480467657  
0.007474163773  
0.007465720971  
0.007461433518  
0.007455604319  
0.007449224864  
0.007442189122  
0.007437517415  
0.007435269522  
0.007426833066  
0.007420789387  
0.007418642986  
0.007413763155  
0.007408983915  
0.007405511085  
0.007399915289  
0.007395626991  
0.007393710158  
0.00739249141  
0.007385458691  
0.00738451186  
0.007380443576  
0.007379762199  
0.0073754753  
0.007375417809  
0.007371931035  
0.007368774764  
0.007369578828  
0.007368439939  
0.007367333126  
0.007364613386  
0.007363357104  
0.007364470732  
0.007364978399  
0.007362664398  
0.007361243597  
