0.06986563313  
0.4935161867  
0.9019806976  
1.278691293  
1.609475938  
1.883741141  
2.095279942  
2.242613713  
2.328847964  
2.361073345  
2.349394737  
2.305702736  
2.242331572  
2.170738325  
2.100347982  
2.037663789  
1.985736586  
1.944039901  
1.908754858  
1.873448673  
1.830061195  
1.770119192  
1.686024648  
1.572295361  
1.426586987  
1.250378424  
1.049214519  
0.8324435314  
0.6124636661  
0.4035327299  
0.2202702857  
0.07601750863  
-0.01874537797  
-0.05773208252  
-0.03974919613  
0.03095966674  
0.1449902305  
0.2886520493  
0.4453641087  
0.5973888056  
0.7277174882  
0.8218631967  
0.8693495248  
0.8647120903  
0.8079016175  
0.7040488426  
0.5626402215  
0.3962322379  
0.2188743921  
0.04445670331  
-0.1148190445  
-0.2496671482  
-0.3545197481  
-0.4278421655  
-0.4719657911  
-0.4924964921  
-0.4974059297  
-0.495926535  
-0.4973865842  
-0.5101059923  
-0.5404600987  
-0.5921899215  
-0.6660058582  
-0.759523601  
-0.8675164986  
-0.9824768194  
-1.095426367  
-1.196910077  
-1.278082806  
-1.331769001  
-1.353384354  
-1.34160014  
-1.298645199  
-1.23019627  
-1.144817356  
-1.053010508  
-0.9659563012  
-0.8941035452  
-0.845779221  
-0.8260154032  
-0.835760151  
-0.8716071817  
-0.9261002326  
-0.9886033142  
-1.046634123  
-1.087496187  
-1.099990451  
-1.075969823  
-1.011517881  
-0.9075737537  
-0.7699080906  
-0.6084399094  
-0.4359799903  
-0.2665713371  
-0.1136524141  
0.01170118274  
0.1022180679  
0.1553551289  
0.1735879062  
0.1640387561  
0.1375049419  
0.1070374037  
0.08627573668  
0.08776175246  
0.1214622018  
0.1936615546  
0.3063462696  
0.4571059644  
0.6395083248  
0.8438537466  
1.05816166  
1.269250301  
1.463777226  
1.629150518  
1.75425874  
1.830022699  
1.849789149  
1.809610544  
1.708450048  
1.548324851  
1.334378846  
1.074853758  
0.7808940089  
0.4661424398  
0.1460828481  
-0.1628671837  
-0.4444824425  
-0.6839673259  
-0.8691991369  
-0.9918184873  
-1.048021974  
-1.038944195  
-0.9705593146  
-0.8530887646  
-0.6999853607  
-0.5266047628  
-0.3487326576  
-0.1811369965  
-0.03632624095  
0.07635964941  
0.1512387129  
0.1863363612  
0.1830294725  
0.1453815083  
0.079283404  
-0.008461393418  
-0.1109791586  
-0.2219950571  
-0.3362618128  
-0.4497282363  
-0.5594602802  
-0.6633735339  
-0.7598475252  
-0.8473198265  
-0.9239279102  
-0.9872864197  
-1.034439391  
-1.062009507  
-1.066537028  
-1.044966214  
-0.9952250884  
-0.916805498  
-0.8112587861  
-0.6825104869  
-0.5369125708  
-0.3829772053  
-0.2307679504  
-0.09097405887  
0.02625590824  
0.1125953111  
0.1627831789  
0.1756388795  
0.1546787141  
0.1081948585  
0.04871638592  
-0.008151636475  
-0.04540941513  
-0.04670268302  
0.001538393155  
0.1081231981  
0.2755783314  
0.4992958995  
0.7675123434  
1.062156152  
1.360494612  
1.637404128  
1.867992772  
2.03026501  
2.107513568  
2.090146169  
1.976745425  
1.77423825  
1.497180592  
1.166245551  
0.8061134039  
0.4430016512  
0.102121473  
-0.194670027  
-0.4307866181  
-0.5962108412  
-0.6880750175  
-0.7105144429  
-0.6738290651  
-0.5931051116  
-0.4864616592  
-0.3731205353  
-0.2715140774  
-0.1976105787  
-0.1635915819  
-0.1769806107  
-0.2402534225  
-0.3509129812  
-0.5019621559  
-0.6826979783  
-0.879713708  
-1.078017326  
-1.262179352  
-1.417442349  
-1.530738156  
-1.591583968  
-1.592818171  
-1.53115607  
-1.40752679  
-1.227158593  
-0.9993728562  
-0.7370672703  
-0.4558701515  
-0.1730038161  
0.09409648171  
0.3292923074  
0.5192551154  
0.6548099715  
0.7319534952  
0.7523975804  
0.7235277563  
0.6577477478  
0.5712306817  
0.4821962261  
0.4088939353  
0.3675232068  
0.3703363151  
0.4241661332  
0.5295584586  
0.6806267425  
0.8656421716  
1.068290573  
1.269431925  
1.449140245  
1.588785528  
1.67290499  
1.690663788  
1.636761649  
1.511715888  
1.321532664  
1.076843236  
0.7916451004  
0.4818182641  
0.1635924664  
-0.1478611564  
-0.4395699243  
-0.7015402243  
-0.92712491  
-1.112990303  
-1.258733869  
-1.366246023  
-1.438937349  
-1.48095251  
-1.496490705  
-1.489312002  
-1.462491911  
-1.418420327  
-1.359010497  
-1.286048365  
-1.201580502  
-1.108247999  
-1.009475135  
-0.9094632911  
-0.8129660895  
-0.7248804693  
-0.6497151826  
-0.5910257842  
-0.5509199485  
-0.5297239026  
-0.5258708159  
-0.5360389011  
-0.5555259902  
-0.5787923733  
-0.6001029052  
-0.6141513703  
-0.6165927523  
-0.6043986858  
-0.5760099309  
-0.5312826659  
-0.4712752304  
-0.3979271946  
-0.3137191028  
-0.2213661739  
-0.1236069456  
-0.02309755008  
0.07759924214  
0.1759603828  
0.2694452293  
0.3554779158  
0.4315129652  
0.4952031996  
0.5446453798  
0.5786786297  
0.5971578917  
0.6011548323  
0.5930001175  
0.5761533577  
0.5548755214  
0.5337418188  
0.5170617968  
0.5082970469  
0.5095738474  
0.5213951384  
0.54261379  
0.5706963025  
0.6022519524  
0.6337541326  
0.6623411946  
0.6865480354  
0.7068338468  
0.7257850051  
0.7479169983  
0.7790685302  
0.825453421  
0.8924813019  
0.9835345071  
1.098878018  
1.234904464  
1.383850486  
1.534072293  
1.670887951  
1.777913005  
1.838738551  
1.838757194  
1.76690907  
1.617132956  
1.38933188  
1.089730315  
0.7305640392  
0.3291329559  
-0.09369050278  
-0.5153264809  
-0.9135290874  
-1.268374805  
-1.563986865  
-1.789813852  
-1.941334405  
-2.02013044  
-2.03333584  
-1.99255174  
-1.912357693  
-1.808604647  
-1.696677246  
-1.589921289  
-1.498385289  
-1.428000606  
-1.380262619  
-1.352405215  
-1.338040816  
-1.32815524  
-1.312347537  
-1.2801728  
-1.222440226  
-1.132343034  
-1.006307767  
-0.8444814279  
-0.6508138378  
-0.4327352228  
-0.2004572714  
0.03402435489  
0.2581243298  
0.4599370772  
0.6294391421  
0.7594988992  
0.8465764058  
0.8910248789  
0.8969634257  
0.8717132457  
0.8248687828  
0.7670997403  
0.7088250934  
0.65891652  
0.623596515  
0.6056635713  
0.6041584331  
0.6145114014  
0.6291805343  
0.6387006181  
0.6330261304  
0.6030095059  
0.5418206782  
0.4461285241  
0.3168816129  
0.159562662  
-0.01613513515  
-0.1971900484  
-0.3686143738  
-0.5151364193  
-0.6230053787  
-0.6816943487  
-0.6852893254  
-0.6333734456  
-0.5312894865  
-0.3897336482  
-0.2237143829  
-0.05099823841  
0.1097754155  
0.2410869468  
0.3283989336  
0.3616686886  
0.3363410685  
0.2537121246  
0.1206467554  
-0.05130435941  
-0.2472574454  
-0.4506407687  
-0.6449350593  
-0.8152971456  
-0.9498906283  
-1.040802678  
-1.084456617  
-1.081534436  
-1.036446679  
-0.9564656057  
-0.8506480715  
-0.7287038105  
-0.5999401242  
-0.4724104049  
-0.3523327874  
-0.2438214734  
-0.1489164143  
-0.06786467562  
0.0004231910322  
0.05783104327  
0.1065057953  
0.1484052329  
0.184991766  
0.2170888152  
0.2449072579  
0.2682008322  
0.2865131565  
0.2994481397  
0.3069127559  
0.3092846626  
0.307469429  
0.3028517146  
0.2971477385  
0.2921980687  
0.2897416894  
0.2912216633  
0.2976557755  
0.3095997772  
0.3272038831  
0.3503484847  
0.3788245523  
0.4125169783  
0.4515406486  
0.4962936061  
0.5473973801  
0.6055159603  
0.6710723939  
0.7438983046  
0.8228663798  
0.905580965  
0.9881842017  
1.065341713  
1.130443144  
1.176028799  
1.194418592  
1.178496653  
1.122563214  
1.023159185  
0.8797534573  
0.695206282  
0.4759135355  
0.2316028295  
-0.02524321712  
-0.2802947534  
-0.5185437737  
-0.7256365628  
-0.8892311215  
-1.000237703  
-1.053800714  
-1.049892411  
-0.9934247385  
-0.893826748  
-0.7641030897  
-0.6194393229  
-0.4754966527  
-0.346577749  
-0.2438927515  
-0.1741476361  
-0.1386663315  
-0.1331956555  
-0.1484556741  
-0.1714169288  
-0.1871586978  
-0.1810873002  
-0.1412288598  
-0.06027426042  
0.06292142814  
0.2226187808  
0.4063930766  
0.5962646329  
0.7706426124  
0.9068545271  
0.9839309637  
0.9852931675  
0.9009740191  
0.72908371  
0.4763139737  
0.1574147673  
-0.2062858754  
-0.5891209568  
-0.9637824641  
-1.304124474  
-1.587714451  
-1.797823332  
-1.924637465  
-1.96559336  
-1.924871471  
-1.812188106  
-1.64113191  
-1.427311676  
-1.186604956  
-0.9337328706  
-0.6813150161  
-0.4394610958  
-0.2158541238  
-0.01620587575  
0.1550946413  
0.2943309058  
0.397970495  
0.4624637833  
0.4843788676  
0.4608414631  
0.3901953495  
0.2727438665  
0.1114121744  
-0.08780555311  
-0.3157393761  
-0.5603274807  
-0.8072941881  
-1.041153778  
-1.246442277  
-1.409021076  
-1.517309662  
-1.563299451  
-1.543241356  
-1.457930716  
-1.312578513  
-1.116288801  
-0.881217436  
-0.6215170027  
-0.3521777049  
-0.08788830556  
0.1579848695  
0.3742159949  
0.5522954967  
0.686739247  
0.7751536583  
0.8180858629  
0.8187197505  
0.7824578891  
0.7164517088  
0.6291081807  
0.5295952619  
0.4273621491  
0.3316616453  
0.2510818093  
0.1930828997  
0.1635512229  
0.166400251  
0.2032483484  
0.2732289081  
0.3729613044  
0.4967260076  
0.63684655  
0.7842619746  
0.9292481276  
1.062219549  
1.17453086  
1.259190427  
1.311417524  
1.328985807  
1.312319124  
1.264347402  
1.190153357  
1.096446466  
0.9909386247  
0.8816822657  
0.7764364977  
0.6821075567  
0.6043164252  
0.5470954155  
0.5127407913  
0.5017902036  
0.5131258997  
0.5441612211  
0.5910920542  
0.6491758095  
0.7130283051  
0.7769094141  
0.8350000793  
0.8816609  
0.9116737168  
0.9204715255  
0.9043482049  
0.8606447036  
0.7879094856  
0.6860001478  
0.5561392199  
0.400888325  
0.224051555  
0.03050400878  
-0.1740436473  
-0.3833247948  
-0.5908221289  
-0.7900770594  
-0.9749772222  
-1.14001097  
-1.280474507  
-1.392628844  
-1.473806375  
-1.522467184  
-1.538216348  
-1.521787477  
-1.474990347  
-1.400641018  
-1.302457937  
-1.184943065  
-1.053233193  
-0.9129344077  
-0.7699355083  
-0.6302034801  
-0.4995679854  
-0.3834956361  
-0.2868555199  
-0.2136850793  
-0.166955319  
-0.148352306  
-0.1580839417  
-0.1947350026  
-0.2551952758  
-0.3346874608  
-0.426915207  
-0.5243574199  
-0.6187059895  
-0.7014400058  
-0.7645130925  
-0.8010928224  
-0.8062936411  
-0.7778164938  
-0.7164106957  
-0.6260718602  
-0.513917935  
-0.3897020282  
-0.2649770519  
-0.1519606597  
-0.06220419022  
-0.005207531552  
0.01285359986  
-0.009885100624  
-0.07043230768  
-0.160948913  
-0.2693689987  
-0.380595408  
-0.4781762494  
-0.5462745916  
-0.5716985503  
-0.5457256337  
-0.4654674851  
-0.3345625556  
-0.1630623945  
0.03352099285  
0.2359153705  
0.423349685  
0.5760898728  
0.6779123684  
0.7181771703  
0.693207643  
0.6067694276  
0.4695728633  
0.297858642  
0.1112564504  
-0.06977393417  
-0.2265637621  
-0.3445488905  
-0.4149469006  
-0.4355877687  
-0.4107923629  
-0.3503642713  
-0.2678606577  
-0.1784395769  
-0.09660881133  
-0.03421237536  
0.001060614996  
0.006456561169  
-0.0158413256  
-0.05944843052  
-0.1150833726  
-0.1722138077  
-0.2207680786  
-0.2526473338  
-0.2628206599  
-0.2498566445  
-0.2158498731  
-0.1657836308  
-0.1064522125  
-0.04513579146  
0.01176404777  
0.05991542292  
0.09790096233  
0.1275908274  
0.1539916451  
0.1845894355  
0.2282710976  
0.2939722419  
0.3892154278  
0.518744811  
0.6834283655  
0.8795849628  
1.098840923  
1.328555402  
1.552798281  
1.753784963  
1.913630075  
2.016233493  
2.04908768  
2.004806243  
1.882185229  
1.68666379  
1.430109983  
1.129931151  
0.8075806866  
0.4866106902  
0.1904696567  
-0.0597300119  
-0.2472270603  
-0.3611999723  
-0.397759109  
-0.360235592  
-0.258747036  
-0.1090924008  
0.0688992462  
0.2533726482  
0.4225924876  
0.5569964218  
0.6409459149  
0.6640044351  
0.621634963  
0.5152697219  
0.3517829851  
0.1424589878  
-0.09841541426  
-0.3551618937  
-0.6123614636  
-0.8563698606  
-1.076565046  
-1.266209589  
-1.422856595  
-1.548259038  
-1.647801933  
-1.72949632  
-1.802635856  
-1.876253129  
-1.957532391  
-2.05037205  
-2.154285813  
-2.263804959  
-2.368510455  
-2.453744194  
-2.50198789  
-2.494778635  
-2.414982048  
-2.249159561  
-1.989734127  
-1.636678223  
-1.198474292  
-0.6921798649  
-0.1425395418  
0.4198104734  
0.9608804371  
1.446348716  
1.844750899  
2.130489086  
2.286335094  
2.305154862  
2.190676924  
1.957224949  
1.628458749  
1.235261228  
0.8130097234  
0.3985027836  
0.02685372164  
-0.2713694805  
-0.4725106138  
-0.5615177245  
-0.5328577002  
-0.3906242748  
-0.1478745418  
0.174701522  
0.5506457995  
0.9499581446  
1.341501893  
1.695405225  
1.985280017  
2.190092183  
2.2955663  
2.295004447  
2.189486496  
1.987433633  
1.703589786  
1.357522811  
0.9717890024  
0.569932679  
0.174517682  
-0.1946237921  
-0.5217731592  
-0.7962079566  
-1.012537214  
-1.170472479  
-1.274111029  
-1.330829247  
-1.349946156  
-1.341321941  
-1.314066649  
-1.275496191  
-1.230462575  
-1.181104194  
-1.127031507  
-1.065888325  
-0.9942024392  
-0.9083905442  
-0.8057746652  
-0.6854740146  
-0.5490522095  
-0.4008388618  
-0.2478811446  
-0.09954041824  
0.03323457817  
0.1388668733  
0.2062473395  
0.2258643892  
0.1908456341  
0.09781989806  
-0.05247974726  
-0.254939463  
-0.5001446649  
-0.7748232387  
-1.062635367  
-1.345255775  
-1.603677111  
-1.819631775  
-1.977017305  
-2.063205072  
-2.070101776  
-1.994858666  
-1.840156318  
-1.614009413  
-1.329107568  
-1.001742577  
-0.6504289212  
-0.2943436704  
0.04823330253  
0.3613343212  
0.6324105985  
0.8530321061  
1.019112156  
1.130665863  
1.191158369  
1.206557787  
1.184235746  
1.131884962  
1.05659639  
0.9642257382  
0.8591145594  
0.7441971755  
0.6214290885  
0.4924709074  
0.3594716665  
0.2258239141  
0.0967273678  
-0.02054906868  
-0.1167953794  
-0.1814103069  
-0.2033334014  
-0.1722846228  
-0.08016585411  
0.07754303351  
0.3005839985  
0.5830974207  
0.9133296503  
1.27396012  
1.643090811  
1.995824901  
2.306317614  
2.550082694  
2.706312507  
2.759941021  
2.703214992  
2.53655963  
2.268651884  
1.915668298  
1.499793615  
1.047164104  
0.5854757282  
0.1415207097  
-0.2610817078  
-0.6037316711  
-0.8741197211  
-1.06680939  
-1.183142696  
-1.230517624  
-1.221164024  
-1.170574163  
-1.095762862  
-1.013527991  
-0.9388599586  
-0.8836253254  
-0.8556052229  
-0.8579501694  
-0.8890621711  
-0.9429082185  
-1.009721957  
-1.077048962  
-1.131049739  
-1.157967484  
-1.145640845  
-1.084930723  
-0.9709251523  
-0.8037915902  
-0.58916369  
-0.3379949823  
-0.06584848811  
0.2083242335  
0.4638247616  
0.6800984822  
0.8386809459  
0.9249743651  
0.9296596159  
0.8495717545  
0.6879546069  
0.4540729962  
0.1622559228  
-0.1694852033  
-0.5210870992  
-0.8720896324  
-1.203143321  
-1.497208959  
-1.740371948  
-1.922257108  
-2.036094193  
-2.078520851  
-2.04925561  
-1.950735091  
-1.787804029  
-1.567496501  
-1.298883828  
-0.9929529709  
-0.6624159818  
-0.3213882331  
0.01513680417  
0.3320325723  
0.6149757088  
0.8514914764  
1.031994195  
1.150680616  
1.206142991  
1.201588553  
1.144614631  
1.046523941  
0.9212518804  
0.7840097798  
0.6498027405  
0.5319890884  
0.4410475023  
0.3836908528  
0.3624234213  
0.3755775385  
0.4178169803  
0.481023808  
0.555457351  
0.6310214483  
