632.9984264  
699.166184  
828.178448  
1106.206903  
2591.372883  
9666.2467  
8605.803539  
44228.13099  
7378.115927  
42136.67778  
11343.09698  
20058.20042  
44442.96497  
20687.83261  
38354.09482  
28277.79247  
13004.09681  
13985.0154  
11267.69174  
5834.422673  
30272.80681  
2419.511385  
10040.51093  
12048.13695  
5693.019293  
3087.779113  
6603.676408  
6752.234566  
5356.22752  
5616.013107  
6886.462822  
1046.166726  
4110.371911  
395.3970742  
1772.961991  
1342.976452  
1104.835482  
3096.463563  
3385.292398  
182.3593945  
3165.321242  
4288.37267  
3694.726364  
5321.055275  
411.6648595  
514.0745178  
5014.147388  
2204.207923  
2895.006934  
759.2966756  
8206.294427  
3524.553741  
529.8621422  
335.8866017  
1864.862076  
380.9017017  
1625.395077  
447.0129613  
1574.483563  
2040.674098  
502.2704217  
1386.797113  
35.95977431  
0.01090804675  
232.8146773  
12.36996461  
50.48579367  
78.02259168  
47.45587396  
1.171635901  
11.27209933  
2.823898786  
21.15553276  
2.574856282  
12.70350873  
6.413054637  
2.800534862  
0.1000936447  
0.3149925181  
0.441267433  
1.773079671  
0.2796025648  
0.5792628149  
0.3533220364  
0.09262193683  
0.1553112037  
0.3436182358  
0.0734333841  
0.2237838691  
0.1542729702  
0.1723117734  
0.1924181747  
0.1780899625  
0.1647357458  
0.1815981945  
0.1761672486  
0.1795012499  
0.1897225677  
0.187408761  
0.2010863842  
0.1957389183  
0.185996409  
0.1776257113  
0.1816522066  
0.178863265  
0.1779580918  
0.1727913173  
0.1751600906  
0.1772920768  
0.1698476287  
0.1719029332  
0.1692639044  
0.1690819435  
0.1681626747  
0.1667492643  
0.1658646999  
0.1642762902  
0.1625028649  
0.1607401822  
0.1605546628  
0.1587652434  
0.1573206169  
0.1562118351  
0.1550089017  
0.1537597238  
0.1521332196  
0.1508783515  
0.1496585666  
0.1482137081  
0.1469170885  
0.145584856  
0.1442292886  
0.1429121815  
0.1415789128  
0.1402221592  
0.1389204164  
0.1376404019  
0.1363495112  
0.1350484513  
0.1338093947  
0.1325454913  
0.1312911856  
0.1300732195  
0.1288315942  
0.1276335955  
0.1264504809  
0.1252720631  
0.1241035296  
0.1229361188  
0.1217971248  
0.1206813898  
0.1195677818  
0.1184547207  
0.1173664556  
0.1162834404  
0.115221851  
0.114172203  
0.113131103  
0.1121068522  
0.1110901152  
0.1100881806  
0.1090978797  
0.1081191357  
0.1071634256  
0.1062116642  
0.1052708488  
0.1043513951  
0.1034202753  
0.1025285  
0.1016324741  
0.1007482234  
0.09988237976  
0.09902211051  
0.0981706477  
0.09733300877  
0.09650641976  
0.09569697911  
0.0948892467  
0.09409454449  
0.09330792957  
0.09253887827  
0.09176968816  
0.09101870711  
0.090275071  
0.08953856888  
0.08881494813  
0.08809025108  
0.08738902451  
0.0866863186  
0.08600263431  
0.08532060458  
0.08465153574  
0.08399127004  
0.08333857551  
0.08268775343  
0.08204590705  
0.0814225029  
0.08081059976  
0.08018418867  
0.07958271106  
0.07899228265  
0.07838914173  
0.07780917817  
0.07723555505  
0.0766643707  
0.07610003984  
0.07554760469  
0.07500280257  
0.07446574307  
0.07392566378  
0.07339718162  
0.07287171757  
0.07236938929  
0.07186163731  
0.07135287866  
0.07085592487  
0.07036885426  
0.06988893274  
0.0694010062  
0.068936987  
0.06847915752  
0.06801645524  
0.06755907083  
0.06711447734  
0.06666397374  
0.06622708927  
0.06579197443  
0.06536460482  
0.06494221649  
0.06452441194  
0.06411268376  
0.06370067979  
0.06330444126  
0.06290215857  
0.06250747391  
0.06212008109  
0.0617343731  
0.06135317018  
0.06098303544  
0.06060573906  
0.06024152371  
0.05988349324  
0.05952214989  
0.05916411828  
0.05881317624  
0.05847310254  
0.0581296924  
0.05778893305  
0.05745663176  
0.0571286785  
0.05679879505  
0.05647243987  
0.05615942393  
0.05584420802  
0.05552609544  
0.05522376124  
0.05491327998  
0.05462027761  
0.05431759862  
0.05402151629  
0.05373354728  
0.0534443657  
0.05315868699  
0.05287052965  
0.05259817387  
0.05231667613  
0.05204589406  
0.05178284295  
0.05151260046  
0.05125339602  
0.05099058344  
0.05073002959  
0.0504683445  
0.05022129341  
0.04997919782  
0.04972613814  
0.04949122785  
0.04923579483  
0.04900367059  
0.04876819604  
0.0485332374  
0.04830298427  
0.04807172463  
0.04784938106  
0.04762549975  
0.04740319888  
0.04718143646  
0.04696902375  
0.0467526016  
0.04654059694  
0.04633303455  
0.04612425392  
0.04592145086  
0.04571467394  
0.04551485763  
0.04531351035  
0.04512052608  
0.04492216306  
0.04473594736  
0.04454282242  
0.04435664119  
0.04417391152  
0.04398536917  
0.04380555758  
0.0436191912  
0.04344845031  
0.04327100603  
0.04309142005  
0.04291959441  
0.04275057221  
0.0425732961  
0.0424121068  
0.04224840215  
0.04208469301  
0.0419196727  
0.04175750613  
0.04159978929  
0.04144142845  
0.04128910028  
0.04113083671  
0.04097842863  
0.04082942352  
0.0406811476  
0.04053381299  
0.04038984812  
0.04024334265  
0.04010244237  
0.03995857301  
0.03981888844  
0.03968389317  
0.03954121551  
0.03940871893  
0.03927094297  
0.03914478838  
0.03901330766  
0.03888007507  
0.03875043084  
0.03862848477  
0.03850194953  
0.03838076885  
0.03824908104  
0.03813068293  
0.03800621579  
0.03789175203  
0.03777465102  
0.0376592438  
0.03754655029  
0.03742432013  
0.03731765469  
0.03720387054  
0.03709356257  
0.03698414428  
0.03687706092  
0.03677198382  
0.0366580489  
0.03655524596  
0.03644951571  
0.03635450693  
0.03625070125  
0.03615421604  
0.0360522366  
0.03594855996  
0.03585261326  
0.03575426784  
0.03566409994  
0.03557208237  
0.03548032529  
0.03538844266  
0.03529954461  
0.03520796231  
0.03512207179  
0.03503114785  
0.0349476853  
0.03485879606  
0.03477500549  
0.03468911509  
0.03460702673  
0.034528398  
0.03444826553  
0.03436136849  
0.03428504476  
0.03420917196  
0.03413172496  
0.0340580503  
0.03398407923  
0.0339053666  
0.0338344316  
0.03375959454  
0.03369139949  
0.03361524416  
0.03355203139  
0.03347847419  
0.03340995135  
0.03334739299  
0.03327775749  
0.03321101715  
0.03314634653  
0.03308287399  
0.03301973361  
0.03295738301  
0.03289285728  
0.03283589108  
0.03277582262  
0.03271537141  
0.03265531407  
0.03259793469  
0.03254035649  
0.03248819822  
0.03243322312  
0.03237631105  
0.03232188261  
0.03226861757  
0.03221370588  
0.0321645659  
0.03211839801  
0.03206794077  
0.03201976009  
0.03196762351  
0.03192033092  
0.03187293674  
0.03182643044  
0.03178212884  
0.03173968213  
0.03168609208  
0.03165290264  
0.03160481521  
0.03156489546  
0.03152112008  
0.03148561119  
0.03144243479  
0.03140440292  
0.03136574697  
0.03133021766  
0.03129138444  
0.03125074073  
0.03121453182  
0.0311799217  
0.03114935445  
0.031109735  
0.03108046729  
0.03104361103  
0.03101258574  
0.03098489204  
0.03095011618  
0.03092378115  
0.03089115106  
0.03086570053  
0.03083370632  
0.03080791783  
0.03078239572  
0.0307533376  
0.03073087933  
0.03070756246  
0.0306789096  
0.03065615711  
0.03063566114  
0.03061377824  
0.03058958325  
0.03056447494  
0.03054522037  
0.03052939444  
0.03050616081  
0.0304881798  
0.03047375211  
0.03045333477  
0.03043823976  
0.0304227154  
0.0304075017  
0.03039174825  
0.03038011575  
0.03036444278  
0.03034577019  
0.03033306738  
0.03032585835  
0.0303085702  
0.03030235411  
0.03029403972  
0.03028657286  
0.03026709901  
0.03026371476  
0.03025320054  
0.03024996307  
0.03024323878  
0.03023351306  
0.03023245168  
0.03022695129  
0.03021962707  
0.0302147188  
0.03021472371  
0.03021585662  
0.03020932496  
0.03020667117  
0.0302031166  
0.0302023038  
