0.2319360478  
0.0006756778769  
-0.2275202759  
-0.4484859022  
-0.6566986619  
-0.8451827406  
-1.005813913  
-1.129988015  
-1.209570237  
-1.237953775  
-1.211050836  
-1.128025503  
-0.991636765  
-0.8081075844  
-0.5865392159  
-0.3379621786  
-0.07419410711  
0.1933004825  
0.4543390688  
0.7005925697  
0.9257195242  
1.125075002  
1.295104394  
1.432609528  
1.534078552  
1.595304186  
1.611416905  
1.577398766  
1.489011137  
1.34400532  
1.143375124  
0.8923937754  
0.6011991607  
0.2847421369  
-0.03797694593  
-0.3453529538  
-0.6151380847  
-0.8266939656  
-0.9632157277  
-1.013645483  
-0.9740018946  
-0.8479341892  
-0.6464314887  
-0.386714758  
-0.09045339361  
0.2184704496  
0.5163642077  
0.7820176001  
0.9986058027  
1.15500562  
1.246407056  
1.274180834  
1.245084942  
1.169947639  
1.062027669  
0.9352854027  
0.802779194  
0.675375934  
0.5609003139  
0.4637816346  
0.3851837186  
0.3235359319  
0.2753425793  
0.2361010402  
0.201196787  
0.1666177088  
0.1294186566  
0.0878816621  
0.04140533084  
-0.009829476224  
-0.06529510343  
-0.1245657252  
-0.1876527996  
-0.2551655912  
-0.3282498342  
-0.408319357  
-0.4966362632  
-0.593824782  
-0.6994194308  
-0.8115571618  
-0.9268858888  
-1.040731888  
-1.147523979  
-1.241419658  
-1.317064516  
-1.370342527  
-1.399037394  
-1.403266775  
-1.385629156  
-1.351022323  
-1.306132711  
-1.258657689  
-1.21635254  
-1.186020243  
-1.172585537  
-1.178378639  
-1.202737512  
-1.241990417  
-1.289843304  
-1.338115087  
-1.37774284  
-1.399910165  
-1.39714746  
-1.364246566  
-1.298862243  
-1.201716439  
-1.076389611  
-0.9287478261  
-0.766082879  
-0.596153215  
-0.4262315942  
-0.2623450484  
-0.1087858777  
0.03202198036  
0.1593385032  
0.2736427082  
0.376009816  
0.4674626323  
0.5484184413  
0.6183507409  
0.6757139756  
0.7181685479  
0.7430408699  
0.747957285  
0.7315137702  
0.6938826224  
0.6372173401  
0.5657790434  
0.4857461941  
0.4046980825  
0.3308460864  
0.2721044061  
0.2351332974  
0.2244861932  
0.2420004448  
0.2865177922  
0.353990312  
0.4379661258  
0.5304059836  
0.6227079069  
0.7068291696  
0.776335044  
0.8272403261  
0.8585308181  
0.8722980971  
0.873464009  
0.869137879  
0.8676966254  
0.8777030021  
0.9068113885  
0.9607829643  
1.042744162  
1.152752086  
1.287714804  
1.441648963  
1.606234216  
1.771572142  
1.927067992  
2.0623261  
2.167968401  
2.236313338  
2.261859914  
2.241559032  
2.174870145  
2.063629755  
1.911761465  
1.724867888  
1.509758798  
1.273948226  
1.025167221  
0.7709250488  
0.5181405089  
0.2728564792  
0.04004788853  
-0.1764763634  
-0.3740939209  
-0.5513134475  
-0.7076589037  
-0.8435039471  
-0.9598789164  
-1.058239235  
-1.140245593  
-1.207542165  
-1.261580133  
-1.303495073  
-1.334078219  
-1.353848347  
-1.363228372  
-1.362816791  
-1.353704087  
-1.337780017  
-1.317955099  
-1.29821284  
-1.283434657  
-1.278959727  
-1.289894695  
-1.320234761  
-1.371907896  
-1.443904627  
-1.531652669  
-1.626799601  
-1.717518149  
-1.789380351  
-1.826763614  
-1.814663372  
-1.740698058  
-1.597054274  
-1.382074717  
-1.101237473  
-0.767323487  
-0.3996639129  
-0.02249406566  
0.3374504422  
0.6538274444  
0.9037292221  
1.070476097  
1.145772872  
1.130918131  
1.036854994  
0.8829993646  
0.6949564949  
0.5013877249  
0.3304097018  
0.2059991148  
0.1448744695  
0.1542889146  
0.2310376054  
0.3618440138  
0.5250742233  
0.6935812157  
0.8382874816  
0.9320304114  
0.9531565697  
0.8883725533  
0.7344774164  
0.4987619299  
0.198037524  
-0.1435272633  
-0.4974377198  
-0.8343383465  
-1.127415014  
-1.355284518  
-1.504023669  
-1.568110264  
-1.550249403  
-1.460188495  
-1.312784212  
-1.125643158  
-0.9167133579  
-0.7021418558  
-0.4946605301  
-0.3026400775  
-0.1298621042  
0.02407783013  
0.162872731  
0.2922940103  
0.4188809302  
0.5487016895  
0.6863117863  
0.8340101032  
0.9914128775  
1.155351408  
1.320050607  
1.477556451  
1.618355975  
1.732152066  
1.808747872  
1.838994273  
1.815749994  
1.734772769  
1.595462429  
1.401360386  
1.160301269  
0.8841597215  
0.5881383712  
0.2896277324  
0.006709103148  
-0.2435563777  
-0.4468645721  
-0.5932229848  
-0.6781144812  
-0.7030896784  
-0.6756889823  
-0.6086771445  
-0.5186494975  
-0.424174811  
-0.3436929628  
-0.2934312359  
-0.2855790538  
-0.3269412415  
-0.4182089367  
-0.5539071208  
-0.7229800353  
-0.9099214143  
-1.096268008  
-1.262288423  
-1.388689023  
-1.458188403  
-1.456868905  
-1.375247351  
-1.209047116  
-0.9596836726  
-0.6344578364  
-0.2464488029  
0.1859095845  
0.6396238477  
1.088330437  
1.503886509  
1.858319803  
2.126029496  
2.286039761  
2.324091871  
2.23429672  
2.0201036  
1.694406181  
1.278693529  
0.8012876768  
0.2948491274  
-0.2065954708  
-0.6707218554  
-1.069726641  
-1.382548749  
-1.596263208  
-1.706516027  
-1.71702148  
-1.638265672  
-1.485654396  
-1.277392321  
-1.032403061  
-0.7685240936  
-0.5011778745  
-0.2425800512  
-0.001491326875  
0.2165934577  
0.4089428808  
0.5749534847  
0.7155035866  
0.832426058  
0.9281357501  
1.0054214  
1.067350079  
1.117213699  
1.158442325  
1.19441806  
1.22816526  
1.261930121  
1.296708456  
1.331805931  
1.364527882  
1.390120534  
1.401999965  
1.392327152  
1.352881092  
1.276153354  
1.156521664  
0.9913496274  
0.7818296248  
0.5334312748  
0.2558506464  
-0.03757564702  
-0.3309416527  
-0.607229739  
-0.8499736659  
-1.044934788  
-1.181587615  
-1.254219714  
-1.262536566  
-1.211672062  
-1.111630585  
-0.9762102741  
-0.8215388289  
-0.6643894693  
-0.5204558624  
-0.4027784679  
-0.3204878673  
-0.2779913887  
-0.2747002508  
-0.3053115667  
-0.3606192379  
-0.4287706262  
-0.4968181219  
-0.5524020257  
-0.5853691915  
-0.5891409571  
-0.5616600194  
-0.5057966758  
-0.4291693468  
-0.3433648771  
-0.2626600103  
-0.2023622866  
-0.1769678624  
-0.1983338512  
-0.2740799811  
-0.4064088146  
-0.5914841931  
-0.8194589542  
-1.075181024  
-1.339502787  
-1.591085183  
-1.808496529  
-1.972376788  
-2.067420633  
-2.083932983  
-2.018768564  
-1.875532168  
-1.664018222  
-1.398960749  
-1.098282209  
-0.7810749252  
-0.4656126578  
-0.1676691994  
0.1006405393  
0.331359672  
0.5205203551  
0.6673954943  
0.7733979609  
0.8408562687  
0.8719572179  
0.8680796889  
0.8296549847  
0.7565826018  
0.649122067  
0.5090600638  
0.3408773015  
0.1526682828  
-0.04346683814  
-0.2317089096  
-0.3935402907  
-0.5094420946  
-0.5610575457  
-0.5335625031  
-0.4178810479  
-0.2124410809  
0.07585226165  
0.4315913967  
0.8318766768  
1.248291023  
1.649639299  
2.00514295  
2.287714255  
2.476912326  
2.561203349  
2.539254533  
2.420063671  
2.221916169  
1.970269532  
1.694813857  
1.426056152  
1.191830538  
1.014155934  
0.9067970819  
0.8738311194  
0.9093642711  
0.9984287923  
1.118943495  
1.244481099  
1.347516344  
1.402763804  
1.390200202  
1.297446629  
1.121217787  
0.8677106384  
0.5518993586  
0.1958477594  
-0.1737473677  
-0.528485033  
-0.8413147395  
-1.089373681  
-1.256308319  
-1.333830683  
-1.32237174  
-1.230793282  
-1.075219561  
-0.8771422851  
-0.6610291022  
-0.4516997595  
-0.2717517905  
-0.1393080808  
-0.06630944596  
-0.0575128575  
-0.1102941239  
-0.2152514277  
-0.3575227981  
-0.5186663341  
-0.6788865297  
-0.8193416054  
-0.9242713726  
-0.9826989726  
-0.9895269841  
-0.945881693  
-0.8587118804  
-0.7396773685  
-0.6035126225  
-0.4660555684  
-0.3422261951  
-0.2441860215  
-0.1799383046  
-0.1525022549  
-0.1597698298  
-0.1950314694  
-0.2480728137  
-0.3066904108  
-0.3584098028  
-0.3921790515  
-0.3998259836  
-0.3771048031  
-0.3242046241  
-0.2456778344  
-0.1498198674  
-0.04757262035  
0.04888986532  
0.1277170311  
0.1788976834  
0.1955428845  
0.1747902757  
0.1182090353  
0.03166174569  
-0.07536471191  
-0.1909031857  
-0.3019642495  
-0.3961792749  
-0.4633816206  
-0.4969661563  
-0.4948206157  
-0.459699378  
-0.3989608323  
-0.3236634531  
-0.2471067701  
-0.1829690553  
-0.1432773065  
-0.136461392  
-0.1657873763  
-0.228407748  
-0.3152186813  
-0.4116142608  
-0.4991086567  
-0.5576592689  
-0.5684233981  
-0.5165859641  
-0.3938537746  
-0.2002529455  
0.05509391114  
0.3543590219  
0.6726054532  
0.9804027113  
1.247170166  
1.444804731  
1.551116976  
1.552612709  
1.446238305  
1.239852893  
0.9513567342  
0.6066107474  
0.2364166206  
-0.1270233812  
-0.4536954238  
-0.7189580202  
-0.9059242507  
-1.006768786  
-1.02287003  
-0.9638165941  
-0.8455075809  
-0.6876373319  
-0.5109505228  
-0.3346408503  
-0.1742178684  
-0.04009028559  
0.06301804687  
0.1358104889  
0.1834359948  
0.2139768202  
0.2366676929  
0.2601314599  
0.2908796055  
0.3322844554  
0.3841531228  
0.4429307872  
0.5024686986  
0.5552126204  
0.5936084902  
0.611493188  
0.6052376747  
0.5744695084  
0.5222571394  
0.4547188244  
0.3801320286  
0.3076767539  
0.246018614  
0.2019576706  
0.1793706267  
0.1786049417  
0.1964313508  
0.2265715751  
0.2606983241  
0.289765037  
0.3054407527  
0.3014282944  
0.2744613866  
0.2248214941  
0.1563248191  
0.07576785361  
-0.008042590773  
-0.08554431657  
-0.1477378237  
-0.1874013172  
-0.2000271048  
-0.1843761803  
-0.1425980133  
-0.07993901572  
-0.004105332268  
0.07561257809  
0.149336172  
0.2075991073  
0.2422523741  
0.2472078472  
0.2189668869  
0.1569219488  
0.06342285692  
-0.05637578804  
-0.1948851936  
-0.3426212974  
-0.4889213791  
-0.6227657855  
-0.7336655332  
-0.8125509406  
-0.8525855497  
-0.8498050289  
-0.803523669  
-0.7164513047  
-0.5944742536  
-0.446140684  
-0.2818778569  
-0.1130467477  
0.04905947986  
0.1941631021  
0.3137639138  
0.4016690398  
0.4542262932  
0.4702710946  
0.4508541719  
0.3988068817  
0.3182592005  
0.2141971557  
0.09212351161  
-0.0421260422  
-0.1824338861  
-0.3223585687  
-0.4550690816  
-0.5733411208  
-0.6696921369  
-0.7367049713  
-0.7675298869  
-0.7565529704  
-0.7001213688  
-0.5972247463  
-0.4500178499  
-0.2640543647  
-0.04816839512  
0.1860353736  
0.4250530716  
0.6546395458  
0.8611086489  
1.032627123  
1.160335405  
1.239132008  
1.26803272  
1.250037695  
1.191530925  
1.101294149  
0.9892828285  
0.8653155465  
0.7378834346  
0.6132321306  
0.4948375839  
0.3833368223  
0.2769171015  
0.1720746452  
0.06462332842  
-0.04919469172  
-0.1716878719  
-0.3029118662  
-0.4402166575  
-0.5782128564  
-0.7091474564  
-0.8236666631  
-0.9118511287  
-0.9644006482  
-0.9738218242  
-0.9354600297  
-0.8482430699  
-0.7150517419  
-0.54263464  
-0.3410869611  
-0.1229435441  
0.09802788375  
0.308169211  
0.4952620996  
0.6496812668  
0.76521612  
0.8394752958  
0.8738177681  
0.8728260342  
0.843419519  
0.7937132878  
0.7318150392  
0.664710577  
0.5974187855  
0.5325236442  
0.4701395558  
0.4083189879  
0.3438087583  
0.2730241404  
0.1930579488  
0.102552914  
0.002263251018  
-0.1048078651  
-0.2137250608  
-0.3183445148  
-0.4123358489  
-0.490298119  
-0.5487690657  
-0.5869326181  
-0.6068644388  
-0.6132454175  
-0.6125757185  
-0.6120085855  
-0.6179925071  
-0.6349752143  
-0.6644064269  
-0.7042300989  
-0.748989655  
-0.7905529342  
-0.8193617914  
-0.8259967454  
-0.8028323139  
-0.7454720867  
-0.6537481021  
-0.5320862021  
-0.3891681366  
-0.2369245461  
-0.08899620609  
0.04110950937  
0.1418940866  
0.2054956039  
0.2288327774  
0.2140888439  
0.1684647186  
0.1032406234  
0.03226159574  
-0.02992069904  
-0.07001720247  
-0.0777952896  
-0.04745829923  
0.02155711531  
0.1244801599  
0.2517973027  
0.3904288372  
0.5253468789  
0.6413809026  
0.7249844746  
0.7657382919  
0.7574005534  
0.6984148641  
0.5918432167  
0.4447902068  
0.2674398332  
0.07186427338  
-0.1292087875  
-0.3235243592  
-0.5002017603  
-0.6503404545  
-0.7673405434  
-0.8469534209  
-0.8871671363  
-0.8879822429  
-0.8511722311  
-0.7800676694  
-0.6793751557  
-0.5550228377  
-0.413963933  
-0.2639157113  
-0.1129813349  
0.03085539514  
0.1603199657  
0.2694607343  
0.3541921838  
0.4126580765  
0.4453426728  
0.4548729244  
0.4455183119  
0.4224609011  
0.3909427377  
0.3554332008  
0.3189656244  
0.2827573847  
0.2461940128  
0.2071698345  
0.1627364349  
0.109936993  
0.04667528778  
-0.02751874788  
-0.1109819173  
-0.1997360348  
-0.2876655868  
-0.3670413212  
-0.4292924172  
-0.4659318105  
-0.4695150556  
-0.4345050533  
-0.3579670782  
-0.2400082063  
-0.08394635699  
0.1038037562  
0.3141133786  
0.5357473349  
0.7561525669  
0.9623713587  
1.142008685  
1.284201747  
1.380494585  
1.425568678  
1.417742562  
1.359190741  
1.255842495  
1.116935411  
0.9542490013  
0.7810581681  
0.6109060678  
0.4562860469  
0.3273932938  
0.2310730215  
0.1701106418  
0.1429656359  
0.144026207  
0.1643725964  
0.1930039261  
0.2183800407  
0.2301015976  
0.2204920663  
0.1858577476  
0.1272025293  
0.05028073247  
-0.03509715273  
-0.1164358066  
-0.1804574391  
-0.2152807109  
-0.2125702377  
-0.1693213394  
-0.08897571876  
0.01835786269  
0.1367066473  
0.2460114674  
0.3247262924  
0.3529220515  
0.3154652617  
0.2048329628  
0.02309557639  
-0.2172774745  
-0.494023185  
-0.7771187512  
-1.032077084  
-1.224110325  
-1.322650622  
-1.305611057  
-1.162785256  
-0.8978848604  
-0.528883251  
-0.08659906182  
0.3883629091  
0.8498714084  
1.251224659  
1.550125713  
1.713088778  
1.718731101  
1.559636831  
1.242657375  
0.7877454423  
0.2255908473  
-0.4055428817  
-1.063326828  
-1.70482082  
-2.28950425  
-2.781707382  
-3.152333948  
-3.379934837  
-3.451240573  
-3.361313862  
-3.113455191  
-2.718937368  
-2.196584234  
-1.572118333  
-0.8771861776  
-0.1479377755  
0.5768782602  
1.258286125  
1.859776987  
2.35006543  
2.705602197  
2.912466175  
2.967358488  
2.877482532  
2.659289239  
2.336228152  
1.935819915  
1.486470293  
1.014526271  
0.541974518  
0.08511494678  
-0.3456584724  
-0.7450372111  
-1.11118918  
-1.443742163  
-1.741807351  
-2.0024615  
-2.219991443  
-2.386068272  
-2.490789224  
-2.524379802  
-2.47921088  
-2.351710671  
-2.143789314  
-1.86346946  
-1.524589401  
-1.145588712  
-0.7475938539  
-0.3520918056  
0.02138663153  
0.3572424388  
0.6451162842  
0.8803778937  
1.063771786  
1.200354531  
1.297954104  
1.365462694  
1.411259671  
1.442005246  
1.46198627  
1.473029898  
1.474941446  
1.466305935  
1.445451119  
1.411368033  
1.364396252  
1.306562075  
1.241509586  
1.174057363  
1.109485321  
1.052662115  
1.007209193  
0.9748153123  
0.9548404997  
0.944279682  
0.9380978979  
0.9298923447  
0.9128088815  
0.8805739839  
0.8284969746  
0.7543057539  
0.6586714774  
0.5453363243  
0.4207852167  
0.2934714475  
0.1726679431  
0.06707226043  
-0.01665736702  
-0.07522329674  
-0.1096493139  
-0.1256917735  
-0.1335630015  
-0.1469192357  
-0.1811599687  
-0.2512206566  
-0.3691160929  
-0.5415936189  
-0.7682452487  
-1.040456636  
-1.3414124  
-1.647297393  
-1.929622466  
-2.158440318  
-2.306041628  
-2.350630903  
-2.279438572  
-2.090782173  
-1.794722842  
-1.412176418  
-0.9725653594  
-0.5103194832  
