677.4015369  
715.3815816  
798.6792485  
979.9362298  
1389.932941  
2893.854665  
106532.3273  
2744.344035  
2396.833055  
48823.42038  
35890.13262  
4901.498267  
19902.2248  
26792.20477  
10209.01089  
18606.8301  
243.9039943  
7460.052406  
9209.786582  
1722.471048  
7205.368425  
11387.54803  
2811.580666  
1103.365248  
8616.543476  
16245.12969  
261.5391172  
5744.006065  
6741.893474  
4887.841484  
5281.868959  
15584.2548  
4277.682423  
3970.430721  
11360.33124  
4516.004551  
2125.450116  
2745.951656  
409.1124715  
5977.61075  
11905.55729  
376.8258817  
6361.362696  
3825.295661  
1250.056503  
6560.297033  
1150.996746  
3478.227902  
2542.729458  
5416.606508  
397.256596  
2425.521872  
236.5746385  
3631.97114  
4613.757683  
1496.377352  
2558.188875  
120.4011651  
946.100351  
200.1886742  
1141.408643  
98.71707829  
461.0144536  
1270.234281  
97.01685459  
66.70051114  
226.7221488  
179.0470208  
51.46222737  
16.87303197  
57.43581848  
17.60302975  
17.60465066  
7.290096316  
6.759519154  
14.64724974  
13.6666194  
11.13095169  
10.70611371  
9.263733973  
7.890768743  
5.786231032  
7.629941786  
6.957270261  
6.555408144  
6.26499141  
6.579918653  
5.356749484  
4.941075512  
4.392684583  
4.475796137  
3.818985052  
3.946235708  
3.523564752  
3.292656378  
3.192186944  
3.051999559  
2.822187892  
2.716610016  
2.563536772  
2.427874678  
2.332477653  
2.224734445  
2.113304186  
2.014872548  
1.921344723  
1.848432345  
1.758908565  
1.686046179  
1.610566269  
1.547842142  
1.483020769  
1.420683445  
1.362327722  
1.3081042  
1.255195016  
1.207433935  
1.159626374  
1.118042656  
1.07473993  
1.034441544  
0.9966380608  
0.960560837  
0.9259166464  
0.8924034071  
0.8608864971  
0.8305857972  
0.8016669023  
0.7740948702  
0.7476930624  
0.7223418961  
0.6981430895  
0.6749313525  
0.6527240906  
0.6313783834  
0.6109469728  
0.5912878096  
0.5724818062  
0.5543981881  
0.5369967716  
0.5203183917  
0.5042638235  
0.4888239138  
0.4739866232  
0.4596499392  
0.4459007574  
0.4326338702  
0.4198820683  
0.407556676  
0.3957091771  
0.3842817985  
0.3732541103  
0.3626139599  
0.3523491621  
0.342455429  
0.3328887832  
0.3236340323  
0.3147147582  
0.3061128704  
0.2977572311  
0.2897364286  
0.2819290547  
0.2744104451  
0.2671238422  
0.2600793834  
0.2532670055  
0.2466597116  
0.2402568167  
0.2340646828  
0.2280766883  
0.2222620766  
0.2166165774  
0.2111744354  
0.205877222  
0.2007508012  
0.1957782181  
0.1909494463  
0.1862729593  
0.1817168946  
0.1773219156  
0.1730382177  
0.1688900018  
0.1648473006  
0.1609384977  
0.1571294284  
0.1534351145  
0.149843698  
0.1463494586  
0.1429479254  
0.1396462904  
0.1364537355  
0.1333328735  
0.1302903751  
0.1273375224  
0.1244679957  
0.1216883948  
0.1189548103  
0.1163083705  
0.113742692  
0.1112278661  
0.1087895069  
0.1064111172  
0.1041005747  
0.101843667  
0.09963868907  
0.09750012532  
0.09540734713  
0.09337792747  
0.0913990932  
0.0894646576  
0.08757486287  
0.08574084594  
0.08394143089  
0.0821970933  
0.08049337809  
0.07882403653  
0.07720762938  
0.07561617294  
0.07407053539  
0.07256152078  
0.07109378627  
0.06965529051  
0.06825171342  
0.06688021432  
0.06554457411  
0.06423819942  
0.06296056295  
0.06171117272  
0.06048782981  
0.05929974708  
0.05813330457  
0.05700306701  
0.05589191672  
0.05480127966  
0.05373712637  
0.05270262492  
0.05168243026  
0.05069206228  
0.04971449914  
0.04877409151  
0.04784955625  
0.04693833199  
0.0460513004  
0.04518124507  
0.04433545557  
0.04350063122  
0.04268352276  
0.04189057549  
0.04111326677  
0.04034582891  
0.03959913713  
0.03886886361  
0.038151064  
0.03745190319  
0.0367594564  
0.03609127439  
0.03543761627  
0.03478492563  
0.03415894825  
0.03354553521  
0.0329360301  
0.03233912351  
0.03175767062  
0.03118736676  
0.03062632252  
0.03007911197  
0.02954533421  
0.02901909493  
0.02850444798  
0.02799569121  
0.0275031954  
0.02701920664  
0.02654040045  
0.02607047674  
0.0256134344  
0.02516305166  
0.02472353053  
0.02429626234  
0.02387063652  
0.02345316997  
0.02304531939  
0.02264633109  
0.02225543149  
0.02186678003  
0.02148738971  
0.02112009431  
0.02075596189  
0.02039863358  
0.02004469415  
0.01970677141  
0.0193729701  
0.01903908757  
0.01871257219  
0.01839334299  
0.01807743807  
0.01776868574  
0.01746878926  
0.0171724533  
0.01687854546  
0.01659384457  
0.0163176559  
0.01603677704  
0.01577050521  
0.01549821117  
0.0152408455  
0.01498135207  
0.01472986297  
0.01448363169  
0.01423919106  
0.0140012255  
0.01376544728  
0.01353218514  
0.01330889826  
0.01308556587  
0.01286720663  
0.01264872782  
0.01243860002  
0.01223141615  
0.01202801316  
0.01182847724  
0.01162815454  
0.0114338105  
0.01124348144  
0.01105658883  
0.01087462685  
0.01069242878  
0.01051331236  
0.01033786778  
0.01016552893  
0.009997905932  
0.009833092982  
0.009667164381  
0.009506795883  
0.009345989309  
0.009196282017  
0.009039166448  
0.008889838028  
0.008743096753  
0.008598607615  
0.008457029612  
0.008312878617  
0.008175985681  
0.008036644608  
0.007904314979  
0.007775562874  
0.007643028892  
0.00751565514  
0.007390691913  
0.007266435663  
0.00714737165  
0.00702700058  
0.006911847292  
0.006792817895  
0.006683202801  
0.00656919427  
0.006458693173  
0.006351389985  
0.006244871244  
0.006139845294  
0.006036471317  
0.0059352918  
0.005835366382  
0.005738568167  
0.005642425885  
0.00554541139  
0.005451396569  
0.005360299229  
0.005269738406  
0.005180773052  
0.005092769157  
0.005006633858  
0.004923368619  
0.004840253194  
0.004757373586  
0.004676595391  
0.00459654299  
0.004518690013  
0.004441545503  
0.004367978323  
0.004292032444  
0.004218210021  
0.004145979181  
0.004074158647  
0.004004991984  
0.003937283279  
0.003869541635  
0.003801605348  
0.003737920885  
0.003674330378  
0.003611458552  
0.00354784722  
0.003489349507  
0.003425711235  
0.003368209094  
0.00330966733  
0.003253552223  
0.003197609125  
0.003141218701  
0.003085786911  
0.003032406495  
0.002980214938  
0.002928190242  
0.0028781083  
0.002827902283  
0.002776694905  
0.002729720832  
0.002682256203  
0.002635592511  
0.002590190969  
0.002544774377  
0.002499542632  
0.002456227169  
0.002413216989  
0.002372408875  
0.002329977345  
0.002289824967  
0.002250777675  
0.002209826082  
0.00217243877  
0.002135564479  
0.002096986055  
0.002060755035  
0.002025134156  
0.001990101232  
0.001956350383  
0.001921478741  
0.001887953879  
0.001855889103  
0.001824012806  
0.001792607296  
0.001763353314  
0.001731979953  
0.001702734113  
0.001674774204  
0.001645316159  
0.001618006449  
0.001591395217  
0.001564143856  
0.001539116691  
0.001514175676  
0.001488841043  
0.001464619967  
0.001441278406  
0.001417289939  
0.001395177295  
0.001373469848  
0.001351151418  
0.001329939483  
0.001309445531  
0.001290044128  
0.00127032966  
0.001250351595  
0.001232607356  
0.001214852238  
0.001196415136  
0.001179668153  
0.001162550682  
0.001147691131  
0.001131989796  
0.001116282469  
0.00110246085  
0.001087734955  
0.001073102625  
0.001061216795  
0.001047320045  
0.001036015008  
0.001023118305  
0.001012759759  
0.001001238076  
0.0009911044259  
0.0009807839074  
0.0009709307232  
0.0009618665485  
0.0009527922987  
0.000944583064  
0.0009367845396  
0.00092882166  
0.0009218309596  
0.0009157580514  
0.0009095039128  
0.0009041660553  
0.0008984494816  
0.0008939890775  
0.0008888382538  
0.0008851252424  
0.0008815425678  
0.000877378921  
0.0008753285218  
0.0008729844977  
0.0008714536724  
0.000869787609  
0.0008685418231  
0.0008683065702  
0.0008679358054  
