-0.1351595488  
-0.3807263747  
-0.5950721256  
-0.7509048686  
-0.8284503594  
-0.8181849417  
-0.7222163386  
-0.554081979  
-0.3370022835  
-0.1007884385  
0.1221653917  
0.3012966851  
0.4120716331  
0.4394239414  
0.3799559498  
0.2426085772  
0.04770404228  
-0.1755184085  
-0.3925448222  
-0.5679482782  
-0.6698988118  
-0.6742548042  
-0.567724602  
-0.349714297  
-0.03266198149  
0.3591705306  
0.7922684251  
1.227458721  
1.624102738  
1.944375226  
2.15716428  
2.241168037  
2.186884178  
1.997350752  
1.687582429  
1.28286283  
0.8161007018  
0.3245789654  
-0.1535669069  
-0.5827715389  
-0.9330560547  
-1.182393811  
-1.318234927  
-1.338135468  
-1.249482474  
-1.068416274  
-0.8180809569  
-0.5264222264  
-0.2237013937  
0.06003468676  
0.2973486009  
0.4655191968  
0.5482100934  
0.5366212279  
0.4300711049  
0.2359677623  
-0.0307939318  
-0.3489859629  
-0.6926736009  
-1.033217856  
-1.341522973  
-1.590384237  
-1.756762352  
-1.823807204  
-1.782453069  
-1.632417774  
-1.382492267  
-1.050033244  
-0.6596710117  
-0.2412911755  
0.1725481807  
0.5495236367  
0.8605196068  
1.082339416  
1.199871147  
1.207455551  
1.109291115  
0.9188328416  
0.6572367026  
0.3510451153  
0.02939250876  
-0.2789507957  
-0.5483271335  
-0.7584416349  
-0.8958790332  
-0.9547517112  
-0.936498611  
-0.848923979  
-0.7046843104  
-0.5194755084  
-0.310177863  
-0.09318154813  
0.1169227412  
0.3082134544  
0.4718633377  
0.6021757069  
0.6963537164  
0.7541210482  
0.7773188431  
0.7695477168  
0.7358976985  
0.6827292436  
0.6174709651  
0.5483382142  
0.4839231347  
0.4326158969  
0.4018589476  
0.3973162284  
0.4220577966  
0.4758888501  
0.5549857744  
0.6519276698  
0.756190994  
0.8550959531  
0.9351127916  
0.9833765822  
0.9892096548  
0.9454370931  
0.8493134023  
0.7029071639  
0.5128917784  
0.2897744243  
0.04666731138  
-0.2021970406  
-0.4429936866  
-0.6636449376  
-0.8547776263  
-1.010176687  
-1.126708333  
-1.203766686  
-1.242400054  
-1.244321566  
-1.211026682  
-1.143227023  
-1.04073958  
-0.9028751425  
-0.7292805476  
-0.5210704978  
-0.2820104699  
-0.01949527284  
0.2549503422  
0.5258423128  
0.7746781651  
0.9816087661  
1.127688693  
1.197401215  
1.181113023  
1.077049407  
0.8924456066  
0.6436051486  
0.3547543103  
0.05574662456  
-0.2211551399  
-0.4450411936  
-0.5901747579  
-0.6393621625  
-0.5863886978  
-0.4371643584  
-0.2093755853  
0.06935457916  
0.3645872998  
0.6390876624  
0.8572239621  
0.9891886762  
1.014486477  
0.9242605884  
0.7221545854  
0.4236688931  
0.05410130576  
-0.3545859195  
-0.7675317074  
-1.15086369  
-1.475198186  
-1.718334836  
-1.866864102  
-1.916595133  
-1.871856319  
-1.743914428  
-1.548833971  
-1.305152714  
-1.031746141  
-0.7461452544  
-0.4634897455  
-0.196140206  
0.04613313342  
0.2555850811  
0.4257878994  
0.5510408219  
0.6260750356  
0.6461856567  
0.6078022796  
0.5093849618  
0.3524804708  
0.142701139  
-0.1096141277  
-0.3892568302  
-0.6766535225  
-0.9490389145  
-1.182221196  
-1.352775013  
-1.440376155  
-1.43004402  
-1.31395206  
-1.092617746  
-0.7752688514  
-0.379336959  
0.07089237853  
0.546344156  
1.015712282  
1.448252368  
1.816514523  
2.098742982  
2.280698056  
2.3567328  
2.330024463  
2.211959728  
2.020754827  
1.779460153  
1.513578496  
1.248534594  
1.007271408  
0.8082061785  
0.6637623915  
0.579602268  
0.5546213752  
0.5816718706  
0.6488994556  
0.7414991001  
0.8436616487  
0.9404496335  
1.019372091  
1.071470465  
1.091803907  
1.079309143  
1.036122151  
0.9665022387  
0.8755703932  
0.7680975321  
0.64755143  
0.5155534767  
0.371851591  
0.2147697806  
0.04207110518  
-0.1479571407  
-0.3553922148  
-0.5777520394  
-0.8094580204  
-1.041803682  
-1.263480176  
-1.461608836  
-1.623172669  
-1.736643868  
-1.793572779  
-1.789922143  
-1.726923903  
-1.611319809  
-1.454928564  
-1.273544552  
-1.085314896  
-0.908762139  
-0.7606990302  
-0.6543150884  
-0.5976527912  
-0.5926912378  
-0.6351607553  
-0.7151115305  
-0.8181820519  
-0.9274176855  
-1.025398028  
-1.096431385  
-1.128506744  
-1.114785764  
-1.05441351  
-0.9525717147  
-0.8197579478  
-0.6703956516  
-0.5209796582  
-0.3880032567  
-0.2859503251  
-0.2256212591  
-0.2130015037  
-0.2487898807  
-0.3286151524  
-0.4438446771  
-0.5828218493  
-0.7323073153  
-0.8788865044  
-1.010134175  
-1.115403318  
-1.186173318  
-1.21601375  
-1.200270723  
-1.135651117  
-1.019880909  
-0.8515881753  
-0.6304875596  
-0.3578644062  
-0.03725084598  
0.3248688329  
0.7185314985  
1.130160187  
1.542964158  
1.937923116  
2.295324115  
2.596662728  
2.826644583  
2.975000958  
3.037784848  
3.017922509  
2.924870979  
2.773404647  
2.581659389  
2.368732383  
2.152181813  
1.945815382  
1.758108617  
1.591491668  
1.44262045  
1.303569182  
1.163745925  
1.012221539  
0.8400870396  
0.6424606352  
0.4198281963  
0.1784951234  
-0.06992276279  
-0.3098828504  
-0.5239758685  
-0.6953441112  
-0.8100926348  
-0.8593387681  
-0.8406049387  
-0.7583455039  
-0.6235507365  
-0.4525016971  
-0.2648526953  
-0.08134073255  
0.07856134706  
0.1987213108  
0.2678815114  
0.2804880209  
0.2367393557  
0.1419175885  
0.005163852925  
-0.1620736073  
-0.3476506147  
-0.5401469941  
-0.7298979547  
-0.909523245  
-1.073938305  
-1.21992311  
-1.345407246  
-1.448662915  
-1.527616213  
-1.579430455  
-1.600476948  
-1.586697587  
-1.534307985  
-1.440694366  
-1.305331051  
-1.130528862  
-0.9218560287  
-0.6881170953  
-0.4408737813  
-0.1935347045  
0.03985793014  
0.2459957435  
0.4136363969  
0.5347436863  
0.6052879609  
0.625637745  
0.6005021422  
0.5384585719  
0.4511256239  
0.3520690609  
0.2555517696  
0.1752182347  
0.1228067615  
0.1069888435  
0.1323968742  
0.1989422777  
0.301474585  
0.4298792651  
0.5696310231  
0.7028460189  
0.809790304  
0.8707515704  
0.8681258004  
0.7885158768  
0.6245794053  
0.3764004982  
0.05214479323  
-0.3321368696  
-0.7536071002  
-1.184568043  
-1.595029158  
-1.955614258  
-2.240453427  
-2.429700276  
-2.511340777  
-2.482077259  
-2.347184081  
-2.119406116  
-1.817074745  
-1.461763533  
-1.075828408  
-0.6801967162  
-0.292694229  
0.07290227965  
0.4070322702  
0.7038365511  
0.9601481902  
1.174267967  
1.344822974  
1.469959289  
1.547043464  
1.572935211  
1.544766208  
1.461053533  
1.322900622  
1.135019897  
0.9063167509  
0.6498722949  
0.3822372048  
0.122103368  
-0.1115076276  
-0.3012719051  
-0.4335194082  
-0.4998195052  
-0.4979534564  
-0.432108631  
-0.3122636874  
-0.1528329643  
0.02922722369  
0.2165813823  
0.3936409275  
0.5483528805  
0.6733979298  
0.7666690383  
0.8309733301  
0.873059179  
0.9021320565  
0.9281192298  
0.9599452964  
1.004073177  
1.06350995  
1.137386752  
1.221130546  
1.307160904  
1.385974203  
1.447421156  
1.482006178  
1.482025352  
1.442414647  
1.361240213  
1.23980417  
1.082415163  
0.8958739065  
0.6887900426  
0.4708006355  
0.2518006641  
0.04124469862  
-0.1524347115  
-0.3222519943  
-0.4629510251  
-0.5711307791  
-0.6452614274  
-0.6855841684  
-0.693950336  
-0.6736107753  
-0.6289805917  
-0.5653841571  
-0.4888181143  
-0.4056956355  
-0.3226045747  
-0.2460521478  
-0.1821978206  
-0.1365593511  
-0.1136997163  
-0.1168891811  
-0.1477762238  
-0.2060784955  
-0.2893646658  
-0.3929615978  
-0.5100586701  
-0.6320514695  
-0.7491359863  
-0.8511586742  
-0.9286434616  
-0.9739076378  
-0.9821221578  
-0.9521551972  
-0.8870715053  
-0.7941410477  
-0.684318919  
-0.5711935202  
-0.4695008264  
-0.3933578058  
-0.3544337344  
-0.3602975961  
-0.4131807226  
-0.5093421114  
-0.6391537415  
-0.7879406999  
-0.9375078169  
-1.06816179  
-1.161009267  
-1.200220754  
-1.174974521  
-1.080823008  
-0.9202963951  
-0.7026765962  
-0.4429646495  
-0.1602137  
0.1245618664  
0.3905749256  
0.6192961416  
0.7960422325  
0.9109711708  
0.959402517  
0.9414938179  
0.8614416893  
0.7263618498  
0.5451286738  
0.3273354331  
0.08257123001  
-0.1799400601  
-0.4513345041  
-0.7228459162  
-0.9854338603  
-1.229472779  
-1.444663634  
-1.620276918  
-1.745743792  
-1.81156118  
-1.810370055  
-1.738034449  
-1.594527713  
-1.384429266  
-1.116927696  
-0.8052669514  
-0.4656767002  
-0.115932837  
0.2262850061  
0.5449862118  
0.8272157958  
1.063951892  
1.250469068  
1.386131947  
1.473715751  
1.518389697  
1.526570918  
1.504864753  
1.459260386  
1.394719203  
1.315172618  
1.22388658  
1.124053153  
1.019423817  
0.9147845941  
0.8161039144  
0.730261515  
0.6643316183  
0.6245512695  
0.6151152262  
0.6370779419  
0.6875969502  
0.7597255831  
0.8428941896  
0.9240663373  
0.9894561718  
1.026560966  
1.026203772  
0.9842314101  
0.9025805619  
0.7894937559  
0.6588167573  
0.5284253478  
0.4180006461  
0.3464535178  
0.3293450973  
0.3766755576  
0.491331257  
0.6683846519  
0.8953374162  
1.153239478  
1.418548086  
1.665461306  
1.868455518  
2.004736406  
2.056344301  
2.0117128  
1.866571025  
1.624146338  
1.294699287  
0.8945110042  
0.4444559296  
-0.03165854355  
-0.5088277436  
-0.9625053171  
-1.370076722  
-1.712078293  
-1.973139956  
-2.142667429  
-2.215286653  
-2.191076804  
-2.07562446  
-1.879876961  
-1.61976597  
-1.315558561  
-0.9908644649  
-0.6712915169  
-0.3827452681  
-0.149451336  
0.008147079836  
0.07542880623  
0.0453122109  
-0.08058295075  
-0.2915739416  
-0.5684548397  
-0.8850014121  
-1.210338373  
-1.511945819  
-1.758989601  
-1.925586157  
-1.993617059  
-1.954713976  
-1.811187708  
-1.575749  
-1.270073216  
-0.9223635067  
-0.5642422649  
-0.2273258302  
0.06008194426  
0.2758007587  
0.4057880223  
0.4451541295  
0.3981245341  
0.2770033041  
0.1003488922  
-0.1094075477  
-0.3285687715  
-0.5347021604  
-0.7088386531  
-0.83710168  
-0.9116755218  
-0.9310467481  
-0.8995767785  
-0.82652053  
-0.7246253311  
-0.6085136931  
-0.4930098904  
-0.3915799623  
-0.3150116135  
-0.2704322015  
-0.2607160869  
-0.2843156684  
-0.3354968617  
-0.4049611689  
-0.4807912977  
-0.5496383092  
-0.598069955  
-0.6139467279  
-0.5877054506  
-0.513432391  
-0.3895824575  
-0.2192792729  
-0.01013119217  
0.2264204569  
0.4761790929  
0.7235534941  
0.9530740341  
1.15086544  
1.305925393  
1.411050729  
1.463312089  
1.464052167  
1.4184289  
1.334573374  
1.222505704  
1.092947152  
0.9561897179  
0.8211588844  
0.694770212  
0.5816450359  
0.4841997119  
0.4030631755  
0.337747314  
0.2874455674  
0.2518329281  
0.2317137337  
0.2293985167  
0.2487111932  
0.2945886182  
0.3722801603  
0.4862339437  
0.638819298  
0.8290701161  
1.051667862  
1.29637531  
1.548085392  
1.787586646  
1.993037747  
2.142056764  
2.214194496  
2.193513104  
2.070922465  
1.845931828  
1.52752881  
1.133996272  
0.6916121607  
0.2323200163  
-0.2093788494  
-0.5999714388  
-0.9104776528  
-1.11956405  
-1.215836301  
-1.199024599  
-1.079904484  
-0.878991079  
-0.6241351199  
-0.3473616775  
-0.08129451918  
0.1443719518  
0.3059655306  
0.388148574  
0.3851875607  
0.3010918852  
0.1486229338  
-0.05265560811  
-0.2790260117  
-0.5056338768  
-0.7094869275  
-0.8720792409  
-0.9813407625  
-1.032680814  
-1.029037799  
-0.9799646846  
-0.8998931252  
-0.8058378536  
-0.714864891  
-0.6416646733  
-0.5965571833  
-0.584195261  
-0.6031115258  
-0.6461572409  
-0.7017430625  
-0.7556816548  
-0.7933602368  
-0.8019245741  
-0.7721547237  
-0.6997966272  
-0.5861592087  
-0.4379284021  
-0.2662614353  
-0.08530868272  
0.08959143943  
0.2437713518  
0.3648877141  
0.4441568523  
0.4770182718  
0.4632081488  
0.4062689742  
0.3126565613  
0.1906050303  
0.04895789477  
-0.1038410615  
-0.260490107  
-0.4152050062  
-0.5637654006  
-0.7032659855  
-0.8316976103  
-0.9474779888  
-1.049043846  
-1.134583023  
-1.201971579  
-1.248872265  
-1.272991668  
-1.272395629  
-1.245832037  
-1.192980231  
-1.114588533  
-1.012479965  
-0.889436398  
-0.7489885206  
-0.5951380976  
-0.4320671146  
-0.263854724  
-0.09422354943  
0.0736663689  
0.2373590765  
0.3951983053  
0.5463355188  
0.6906637585  
0.8286571308  
0.961107209  
1.088784495  
1.21202741  
1.330332574  
1.441985382  
1.543827868  
1.631215631  
1.698227267  
1.738128468  
1.744086509  
1.710054928  
1.631728369  
1.507432892  
1.33882829  
1.131283288  
0.8938581165  
0.6388553923  
0.3809624601  
0.1360765577  
-0.08006923012  
-0.2533151253  
-0.3723734512  
-0.429870447  
-0.4230307103  
-0.3539513657  
-0.2294499008  
-0.06054286156  
0.13839681  
0.3506933064  
0.5585501545  
0.7442732319  
0.8914519778  
0.9860688421  
1.017457917  
0.9791104517  
0.8692635313  
0.691232405  
0.453447316  
0.1691318712  
-0.1444032196  
-0.4668683149  
-0.77646412  
-1.051634725  
-1.272970884  
-1.425073743  
-1.498176436  
-1.489308666  
-1.402828719  
-1.250180099  
-1.048882084  
-0.8207551771  
-0.5896172846  
-0.3786501334  
-0.2077707446  
-0.09134240627  
-0.0365091984  
-0.04240723961  
-0.1003599665  
-0.1950692477  
-0.3066638191  
-0.4133397246  
-0.4942742766  
-0.5324012042  
-0.5166966072  
-0.4436441697  
-0.3176828955  
-0.150566012  
0.04028516334  
0.234213768  
0.4102063885  
0.5498165463  
0.6397161938  
0.6735115564  
0.6525540197  
0.5856171201  
0.4874778503  
0.3765983571  
0.2722240199  
0.1913358379  
0.1458819639  
0.1407348339  
0.1726678677  
0.230553239  
0.2967707065  
0.3496647102  
0.3667144917  
0.3279790908  
0.2193220664  
0.03495351749  
-0.2210874905  
-0.5347525717  
-0.8831406671  
-1.2368688  
-1.563344787  
-1.830522383  
-2.010651265  
-2.083541931  
-2.038937934  
-1.877701482  
-1.611695627  
-1.262385258  
-0.8583656981  
-0.4321204567  
-0.01643641951  
0.3591144126  
0.6711913718  
0.9048824592  
1.054819483  
1.125140131  
1.128324192  
1.083077045  
1.011558544  
0.936307103  
0.8772683184  
0.8492831738  
0.8603571793  
0.9109158926  
0.9941138443  
1.097137186  
1.203302693  
1.294639151  
1.354604714  
1.370542129  
1.335546632  
1.249493964  
1.119085786  
0.9569420088  
0.7798597572  
0.60650675  
0.4548612665  
0.3397708275  
0.2709395117  
0.2516248289  
0.2781918165  
0.3405916562  
0.4236621842  
0.5090860913  
0.5777318896  
0.6120704939  
0.5983510062  
0.5282676098  
0.3999056755  
0.2178702738  
-0.007403623309  
-0.2610462466  
-0.5256417966  
-0.78335804  
-1.01800492  
-1.216771829  
-1.371405821  
-1.478694168  
-1.540224863  
-1.561488213  
-1.550480041  
-1.516051769  
-1.466253799  
-1.406945128  
-1.340884506  
-1.267425695  
-1.182888151  
-1.081519609  
-0.9569146398  
-0.803652171  
-0.6188932416  
-0.4036682713  
-0.1636277166  
0.09088876633  
0.3455274065  
0.5832689264  
0.7862836838  
0.9380618113  
1.025491712  
1.040616717  
0.9817928594  
0.854086681  
0.6688489499  
0.4425206647  
0.1948448451  
-0.05326584191  
-0.2819087419  
-0.47413778  
-0.6174298499  
-0.7045267613  
-0.7335928727  
-0.7077395721  
-0.6340575563  
-0.5223354544  
-0.3836792035  
-0.2292280661  
-0.06910372936  
0.08830198284  
0.2366913764  
0.3718989242  
