2.358121636  
10.02021647  
25.16820262  
38.13633759  
96.61802327  
1367.487563  
80167.8636  
87248.30868  
19431.747  
37403.19657  
2972.84731  
7915.807125  
5726.785207  
946.3810375  
33904.02039  
8505.561517  
7710.884128  
2353.475165  
10103.32173  
9151.602878  
3765.292197  
2678.378623  
10751.98697  
21469.30452  
3193.048812  
10200.20626  
2081.575  
2120.329244  
1244.499462  
3235.090658  
2966.781264  
170.4742808  
434.048294  
8249.725052  
444.7335604  
13088.02521  
11600.35329  
1368.21554  
5154.059446  
4829.300946  
5810.592932  
672.4997452  
8074.232504  
4399.272726  
3489.771084  
4468.827681  
2527.016387  
2325.202308  
1661.481919  
2985.674818  
2639.197838  
7996.991949  
2121.256066  
649.0829478  
239.0883152  
180.719165  
7233.860695  
88.14191033  
845.6035687  
1199.962794  
897.1383942  
886.9801007  
515.6649127  
132.5541258  
171.216744  
213.2326642  
124.3685522  
264.5601065  
10.32413811  
7.260649376  
15.15934561  
29.2634116  
89.02012918  
26.08270763  
23.621268  
0.8634813783  
9.442768307  
8.176880337  
18.22116012  
7.121266889  
1.199365547  
5.989423519  
8.339526938  
3.160354329  
2.891865773  
4.696785223  
3.503836186  
4.870253167  
5.326437619  
4.713113519  
3.945833014  
3.573920836  
4.145836926  
4.333808621  
3.713928814  
3.704724368  
3.838288693  
3.551311435  
3.508306151  
3.455040028  
3.242731372  
3.199400026  
3.34333452  
3.143763298  
3.063819014  
2.99376315  
2.955055067  
2.938394939  
2.889694105  
2.800366436  
2.759009207  
2.735630164  
2.658687572  
2.632887267  
2.594744405  
2.544682362  
2.498955117  
2.459889714  
2.409621894  
2.379255838  
2.345203573  
2.303899379  
2.260942712  
2.232332128  
2.201013156  
2.161920058  
2.131559093  
2.099932676  
2.070214224  
2.035618161  
2.007732214  
1.977194998  
1.949944988  
1.922356167  
1.894877534  
1.86808107  
1.842089529  
1.816520146  
1.791626157  
1.767822678  
1.74345798  
1.720737004  
1.697852768  
1.675633923  
1.653525111  
1.632187517  
1.611518024  
1.591216615  
1.570831781  
1.551397051  
1.532118099  
1.513204616  
1.494777149  
1.476683521  
1.458961506  
1.441566987  
1.42451796  
1.407802021  
1.391370486  
1.375311367  
1.359541519  
1.344059959  
1.328863558  
1.313980126  
1.299356157  
1.284995418  
1.270906226  
1.257067848  
1.243475211  
1.230126052  
1.217050332  
1.204186034  
1.191545885  
1.179118403  
1.166925132  
1.154941169  
1.143168356  
1.131601955  
1.120223832  
1.109045082  
1.098059851  
1.08726459  
1.076616127  
1.066179438  
1.05592056  
1.045814266  
1.035874326  
1.026081915  
1.016483039  
1.007011915  
0.9977055418  
0.9885579656  
0.9795427583  
0.9706665182  
0.9619501535  
0.9533510928  
0.944885217  
0.9365619675  
0.928355914  
0.9202868493  
0.9123573641  
0.9045271491  
0.8968183822  
0.8892215771  
0.8817476221  
0.8743700246  
0.8671205211  
0.8599569574  
0.8529357403  
0.8459991829  
0.8391483947  
0.8324169058  
0.8257834906  
0.8192493235  
0.8127841523  
0.8064391867  
0.8001659974  
0.7939901803  
0.7878928925  
0.7818933184  
0.7759772856  
0.7701461333  
0.7643906522  
0.758718717  
0.7531278982  
0.7476038047  
0.7421708464  
0.736788327  
0.7314878533  
0.7262690445  
0.7211136323  
0.716032099  
0.7110080133  
0.7060691073  
0.7011940734  
0.6963607239  
0.6916128929  
0.6869186223  
0.6822946138  
0.677718268  
0.673218964  
0.6687536847  
0.6643591184  
0.6600262754  
0.6557326815  
0.6515019959  
0.6473421786  
0.6432191253  
0.6391590864  
0.6351286947  
0.6311770923  
0.6272635922  
0.6233925883  
0.6195747558  
0.6158053983  
0.6120874842  
0.6084087824  
0.6047779936  
0.6011850885  
0.5976340633  
0.5941349286  
0.5906812734  
0.5872774332  
0.5838966981  
0.5805517385  
0.5772605587  
0.5740122846  
0.5707955379  
0.5676179078  
0.5644838028  
0.5613901378  
0.5583272255  
0.5552908353  
0.5523040502  
0.5493510481  
0.5464153368  
0.5435369506  
0.5406821413  
0.5378694818  
0.5350700159  
0.5323275727  
0.5296067185  
0.5269149752  
0.5242559592  
0.5216273581  
0.5190227768  
0.5164583236  
0.5139214401  
0.5114059384  
0.5089280168  
0.5064693735  
0.5040389469  
0.5016474891  
0.4992790668  
0.496935561  
0.4946148633  
0.4923204745  
0.4900683428  
0.4878263585  
0.4856091693  
0.4834151159  
0.4812560901  
0.4791263455  
0.4769930466  
0.4749020562  
0.4728283651  
0.470787809  
0.4687675672  
0.4667529657  
0.4647835083  
0.4628269389  
0.4608843607  
0.458981188  
0.4570819389  
0.4552120225  
0.4533665533  
0.4515317787  
0.4497277721  
0.4479222539  
0.4461709229  
0.4444165428  
0.442681528  
0.4409609556  
0.4392657686  
0.4375926231  
0.4359339028  
0.4342964669  
0.4326893193  
0.4310817259  
0.4294905839  
0.4279227603  
0.4263671263  
0.424832282  
0.4233237071  
0.4218283636  
0.4203428889  
0.4188737818  
0.4174194149  
0.4159794183  
0.4145662746  
0.4131625707  
0.411770981  
0.4104013235  
0.4090511351  
0.4077009512  
0.4063716008  
0.4050684671  
0.4037672274  
0.4024835796  
0.4012033447  
0.3999469579  
0.3987154748  
0.3974821525  
0.3962628798  
0.3950647767  
0.3938700608  
0.392705683  
0.3915437889  
0.3903998199  
0.3892589476  
0.3881351837  
0.3870236613  
0.3859437749  
0.3848506781  
0.3837749839  
0.3827225688  
0.3816618068  
0.3806367511  
0.3796070386  
0.3786112583  
0.3775956594  
0.3766139572  
0.3756353042  
0.3746727621  
0.3737177649  
0.3727697168  
0.3718324731  
0.3709253753  
0.3700125659  
0.3691059525  
0.3682137365  
0.3673437601  
0.3664758842  
0.3656167114  
0.3647805592  
0.3639296731  
0.3631120269  
0.3622957069  
0.3614879527  
0.3606870007  
0.3599092353  
0.3591328816  
0.358365101  
0.3576155466  
0.3568648979  
0.3561221688  
0.355396038  
0.3546895603  
0.3539772256  
0.3532759724  
0.3525893588  
0.3519053037  
0.3512250196  
0.350562579  
0.3499177141  
0.3492688135  
0.3486328411  
0.348017995  
0.3473853954  
0.346778798  
0.3461778241  
0.345583362  
0.3449997237  
0.3444185048  
0.3438584828  
0.3433031823  
0.3427482426  
0.3422012005  
0.3416662145  
0.3411387877  
0.3406197081  
0.3401103816  
0.3396106331  
0.3391212476  
0.3386270202  
0.3381537806  
0.3376890308  
0.3372225543  
0.3367637109  
0.3363181427  
0.3358850192  
0.3354498642  
0.3350324766  
0.3346069215  
0.3342024689  
0.3337967538  
0.3334034572  
0.3330206163  
0.3326459627  
0.3322702765  
0.3319052025  
0.3315502077  
0.3312027707  
0.3308600643  
0.3305176835  
0.330194842  
0.3298763968  
0.3295678069  
0.3292525285  
0.3289555407  
0.3286532695  
0.3283767942  
0.3280978994  
0.3278280019  
0.3275597036  
0.3273084975  
0.3270606971  
0.3268241072  
0.3265802941  
0.3263426513  
0.3261178918  
0.32591082  
0.3257047659  
0.3255024544  
0.3253021913  
0.325116543  
0.3249305479  
0.3247569038  
0.3245896261  
0.3244283488  
0.3242660019  
0.3241151095  
0.3239859927  
0.3238460132  
0.3237197494  
0.3235866762  
0.3234876456  
0.3233660063  
0.3232700555  
0.3231785391  
0.3230860429  
0.3230051171  
0.322934963  
0.3228592002  
0.3227945956  
0.3227394936  
0.3226985968  
0.3226535327  
0.3226134304  
0.3225850128  
0.3225665227  
0.3225453086  
0.3225436498  
0.3225270059  
