6291.594541  
6686.763158  
7462.429533  
9013.250056  
13775.89872  
36215.74102  
5621.781846  
22820.61828  
14362.27146  
48973.04561  
31879.75511  
23690.60542  
1058.469754  
16725.13713  
6010.521798  
2175.791061  
2150.430798  
1694.654016  
8210.542575  
4329.101995  
4292.322552  
3418.110515  
469.8455886  
11932.85899  
29119.97575  
4015.434178  
4435.375378  
19240.01915  
1140.005065  
3398.81686  
17737.68834  
1629.632273  
5451.588826  
24537.12048  
1007.74631  
3472.398253  
4156.830003  
8132.021083  
1953.92562  
241.6543499  
1861.766381  
4362.647132  
849.7639282  
3321.340912  
2177.659155  
2668.975503  
2853.762938  
8829.996026  
501.7172553  
1367.54832  
14486.94901  
545.43131  
1405.310885  
4893.75257  
3094.589064  
822.8759421  
1290.083102  
377.6201799  
499.4816263  
6498.076  
528.6711078  
1947.064593  
95.03437239  
764.9589693  
178.8025127  
532.6598942  
255.8210509  
44.9781379  
1.491834636  
362.1665041  
198.3496453  
180.4196876  
26.4614303  
26.26542025  
69.99472274  
44.42259385  
27.77603201  
13.5342053  
27.23639977  
28.27369879  
32.77825767  
27.43830054  
18.6708917  
22.35011102  
19.15850476  
19.02061869  
21.88662843  
20.05121061  
15.73096783  
15.27894672  
14.66014458  
14.02410613  
13.91034169  
12.78390006  
11.36238668  
11.2902479  
10.71543552  
10.15748296  
9.832824758  
9.423383045  
8.811830994  
8.47244899  
8.077267097  
7.645155735  
7.382361884  
7.039699759  
6.785079803  
6.4120406  
6.197995773  
5.868939413  
5.662130981  
5.414703694  
5.207455656  
5.008142054  
4.798345939  
4.617761406  
4.440558974  
4.268974695  
4.104615634  
3.956880282  
3.810326439  
3.669796637  
3.535020517  
3.410873127  
3.290032519  
3.173002562  
3.063195819  
2.957186077  
2.856470456  
2.758935512  
2.666286197  
2.577186789  
2.491780514  
2.409820628  
2.331249253  
2.256024902  
2.183708996  
2.114190137  
2.047329307  
1.983231303  
1.921616814  
1.862365564  
1.805190831  
1.750327317  
1.697522038  
1.646591507  
1.597628777  
1.550424353  
1.504969184  
1.461051233  
1.418762361  
1.377894074  
1.338581951  
1.300572637  
1.263901178  
1.228473601  
1.194284163  
1.161210337  
1.129295724  
1.098474118  
1.068621056  
1.039712166  
1.011854554  
0.9848876744  
0.9587393673  
0.9334177241  
0.9089758418  
0.8852353423  
0.8623420873  
0.8401199566  
0.8185459394  
0.7976659887  
0.7774702196  
0.7578810965  
0.7388735678  
0.720408489  
0.7025064402  
0.6851505728  
0.6683131753  
0.6519581813  
0.6361030295  
0.6207342998  
0.6057685812  
0.591222587  
0.5771384226  
0.5634384641  
0.5501069168  
0.5371469087  
0.5245838757  
0.5123583407  
0.5004645127  
0.4889225885  
0.4776706  
0.4667160297  
0.4561289308  
0.4457101243  
0.4356700248  
0.4258582045  
0.4163086527  
0.4070243127  
0.3979688884  
0.3891540216  
0.3805814561  
0.3722132036  
0.3640968899  
0.3561434723  
0.3484276329  
0.3408761291  
0.3335328423  
0.3263608835  
0.319407536  
0.3125935109  
0.3059658761  
0.2994966689  
0.2931613817  
0.287026033  
0.2810249335  
0.2751790804  
0.269425033  
0.2638639438  
0.2583957436  
0.253071631  
0.2478733654  
0.2428182554  
0.237861758  
0.2330320593  
0.2283129887  
0.2237132053  
0.2191934301  
0.2147955415  
0.2104597734  
0.2062783086  
0.2021781052  
0.1981640032  
0.1942373575  
0.1904020527  
0.1866566242  
0.183000054  
0.1794030947  
0.1759232275  
0.1725019897  
0.169125877  
0.1658319052  
0.162636418  
0.159512366  
0.1564310302  
0.1534120945  
0.1504607918  
0.1476106798  
0.1448006662  
0.142044748  
0.1393333278  
0.1366932363  
0.1341093006  
0.1315820691  
0.1291095101  
0.1266726823  
0.1242978208  
0.1219556979  
0.1196955056  
0.1174443947  
0.1152636224  
0.1131181009  
0.1110288762  
0.1089632827  
0.1069382354  
0.1049581114  
0.1030506324  
0.1011304861  
0.09928557613  
0.09746293583  
0.09566396963  
0.09390568973  
0.09220541158  
0.09050479018  
0.0888439511  
0.08723165409  
0.08565130573  
0.08409357049  
0.08255915637  
0.08106063271  
0.07958956037  
0.07816238833  
0.07674093443  
0.07534582716  
0.07398201651  
0.07264850889  
0.07134626006  
0.07005654205  
0.06878924331  
0.06755425488  
0.06635270778  
0.06513978278  
0.06397500543  
0.06281223204  
0.0616985469  
0.06058149255  
0.0594879876  
0.05843543635  
0.05737303244  
0.05634119713  
0.0553368701  
0.0543568325  
0.05336408961  
0.05241143496  
0.05147039695  
0.0505490634  
0.04964414362  
0.04875214316  
0.04788139586  
0.04701884409  
0.04616278531  
0.04535006665  
0.0445275251  
0.0437293003  
0.04293814483  
0.04216109983  
0.04140954907  
0.0406580328  
0.03991813856  
0.03920158948  
0.03849439662  
0.03779508251  
0.03712020739  
0.03644134926  
0.03577416293  
0.03511815627  
0.03448400151  
0.03385852845  
0.03323310426  
0.03263555692  
0.03203082069  
0.03143832321  
0.0308669701  
0.03030160133  
0.02974578067  
0.02919924325  
0.02865681916  
0.02812564946  
0.02761015208  
0.02709141018  
0.02658578916  
0.02609209154  
0.02560307592  
0.0251230967  
0.02465133571  
0.02418852906  
0.02372729737  
0.02328187425  
0.02283459378  
0.02240157974  
0.02197865735  
0.02155705557  
0.02114130566  
0.02073883062  
0.02034166375  
0.01994372965  
0.01955885441  
0.01918347762  
0.01880634164  
0.01843488949  
0.01807259443  
0.0177203916  
0.01736357411  
0.01702302633  
0.01668335471  
0.01634926939  
0.01601760978  
0.015699372  
0.01537795212  
0.01506792326  
0.01475833048  
0.01445731753  
0.01416068068  
0.01386706739  
0.01357992078  
0.0132954793  
0.01301183213  
0.01274163007  
0.01246749595  
0.01220522897  
0.01194654488  
0.01168331149  
0.01143608086  
0.01118966915  
0.01094149152  
0.01070209395  
0.01046179173  
0.0102291608  
0.01000073866  
0.009774689354  
0.009558742796  
0.009340682864  
0.00912351218  
0.008911845421  
0.008704644505  
0.008502482335  
0.008303082566  
0.00810545816  
0.007913875529  
0.007722475694  
0.007533005566  
0.007347723195  
0.007166389701  
0.00699141425  
0.006815365194  
0.006648199635  
0.006476563433  
0.006311291525  
0.006149084404  
0.005988621258  
0.005829191314  
0.005678328733  
0.005521282314  
0.005370962362  
0.005228579572  
0.005082630213  
0.004939852785  
0.004802531572  
0.004668132236  
0.004533388206  
0.004402249877  
0.004272366428  
0.004146901857  
0.004023907798  
0.003898874837  
0.003780370835  
0.003663327237  
0.00355199282  
0.003435195046  
0.003326505395  
0.003217357024  
0.003113172483  
0.003009626266  
0.002905963197  
0.002806415523  
0.002710536277  
0.002612562615  
0.002521432091  
0.002430059542  
0.002343908094  
0.002252820112  
0.002167432666  
0.0020847229  
0.002005410498  
0.001923724836  
0.001845989466  
0.001770326115  
0.001694839578  
0.001624214746  
0.001551950047  
0.001484569807  
0.001417831987  
0.001352622682  
0.001290741235  
0.001227624833  
0.001169164114  
0.001111222986  
0.001056270508  
0.001001381019  
0.0009485111786  
0.0008977009208  
0.0008492968641  
0.0008003947236  
0.0007538822891  
0.0007104549365  
0.0006678632152  
0.0006268501665  
0.0005864754103  
0.0005488536726  
0.0005122162511  
0.0004777459154  
0.0004440114286  
0.0004136516452  
0.0003830898755  
0.000354966448  
0.0003279288988  
0.0003031335793  
0.0002791666677  
0.0002574315251  
0.0002366795751  
0.0002177305971  
0.0002002919763  
0.0001842025251  
0.0001693790002  
0.0001568737583  
0.000145598533  
0.0001354747522  
0.0001275029026  
0.0001203151206  
0.0001146731218  
0.0001113580464  
0.0001087868493  
0.0001084594249  
