1155.583945  
1236.021199  
1391.240561  
1737.796632  
3219.737055  
5191.869608  
10874.71689  
22581.30771  
14782.41085  
19423.12778  
43907.01811  
33054.70945  
12460.5728  
11082.60297  
10250.60215  
34273.86538  
6901.485317  
17677.97922  
3963.288179  
17004.39417  
2910.795288  
6324.865862  
4540.340844  
3465.14217  
2893.139183  
11707.51544  
40721.30431  
3081.350735  
4876.190443  
2325.403422  
6121.240562  
4791.717859  
2162.318692  
4476.114339  
1082.351325  
2968.366115  
18776.88308  
1811.641671  
6348.816477  
11579.02078  
1628.07529  
6403.039586  
1055.3912  
5925.668074  
873.762612  
1923.226682  
6157.087072  
9621.456145  
230.9793134  
6369.134038  
2975.445454  
11349.54337  
1270.450875  
4310.850373  
2283.50985  
2349.689614  
17.94814373  
796.3859147  
11.43032603  
1447.821842  
1116.967157  
1869.941703  
682.9478716  
180.0624666  
458.1655351  
104.6439999  
105.6238915  
62.48242195  
561.9686879  
73.00055144  
1.286656838  
61.87092076  
46.1526169  
15.35620448  
14.11827276  
1.543654661  
1.168129305  
6.958198078  
6.513001751  
3.584215353  
2.672560109  
2.083535434  
3.757872513  
2.83100826  
2.903300759  
1.550545466  
2.493397998  
1.94641402  
1.790767523  
1.7462675  
1.760042843  
1.389443946  
1.509979891  
1.280573654  
1.254113494  
1.167372167  
1.088626922  
1.080165231  
1.005553597  
0.996021136  
0.9285225214  
0.8923216724  
0.8566947629  
0.8083868415  
0.7943237655  
0.7482695111  
0.7181814922  
0.6907410253  
0.664935434  
0.6388655471  
0.6131589722  
0.5899505336  
0.5697438525  
0.5494170112  
0.5288748839  
0.5095653301  
0.4915038179  
0.4738480384  
0.4569667144  
0.4414117244  
0.4261497232  
0.4123946695  
0.3983890052  
0.3851371266  
0.372716522  
0.3605673694  
0.3490453665  
0.3378834242  
0.3273053777  
0.3172550115  
0.307430486  
0.2979730468  
0.289019291  
0.280439561  
0.2721125115  
0.2641278328  
0.2564565194  
0.2491202477  
0.242025464  
0.2351898232  
0.2286092074  
0.2222542903  
0.2161627692  
0.2102752407  
0.204603276  
0.1991193512  
0.1938435846  
0.1887460505  
0.1838325667  
0.1790870531  
0.1744809144  
0.1700455457  
0.1657583283  
0.1616211335  
0.1576073686  
0.153736054  
0.1499832644  
0.146350415  
0.1428439981  
0.1394377202  
0.1361396076  
0.132950862  
0.1298554603  
0.1268582454  
0.1239520586  
0.121137249  
0.1184003893  
0.1157528231  
0.1131747672  
0.1106861886  
0.1082634145  
0.1059140349  
0.1036296667  
0.1014097901  
0.09925785169  
0.09716712119  
0.0951300633  
0.09315529316  
0.09122894553  
0.08936653082  
0.08755240401  
0.08577956988  
0.0840630698  
0.08238799219  
0.08076367806  
0.07917951182  
0.07763667235  
0.07613680165  
0.07467426392  
0.07324728779  
0.07186223953  
0.07050781827  
0.06918843861  
0.06790675286  
0.06665623165  
0.06544167514  
0.06424646565  
0.06309101129  
0.0619584541  
0.06085327816  
0.0597759712  
0.05872812201  
0.05770850795  
0.05670418579  
0.05572739399  
0.05477494259  
0.05384100398  
0.05293410405  
0.05204900862  
0.05117818489  
0.0503307639  
0.04950501367  
0.04869614925  
0.04790635016  
0.04713590766  
0.0463802062  
0.04564178022  
0.04492595247  
0.04421674832  
0.04352979053  
0.0428553335  
0.04219514967  
0.04155215867  
0.04091494207  
0.04029914369  
0.03969485115  
0.03909785222  
0.03852673278  
0.03795642491  
0.03740186197  
0.03685443882  
0.03632348463  
0.03580364842  
0.03529677045  
0.03479621829  
0.03430501378  
0.03382338639  
0.03335610969  
0.03289252208  
0.03244491774  
0.03200319695  
0.03156639113  
0.03114320371  
0.03072519852  
0.03031853863  
0.02991982611  
0.02952517805  
0.02914127682  
0.02876518511  
0.02839256078  
0.02802802956  
0.02767152142  
0.0273252227  
0.02697936799  
0.02664718562  
0.02631427685  
0.02598959314  
0.02567341598  
0.02535914709  
0.02505466921  
0.02475452932  
0.02445803916  
0.02416650228  
0.02388471182  
0.0236058072  
0.02332942737  
0.02305865901  
0.02279804954  
0.02253797344  
0.02227808518  
0.02202819582  
0.02178349153  
0.02154115223  
0.02129967459  
0.02106627924  
0.02083849989  
0.02060931012  
0.020392043  
0.02017193493  
0.01995772235  
0.01974745085  
0.01954042213  
0.01933308762  
0.01913513859  
0.01893787915  
0.01874498409  
0.01855515938  
0.01836780604  
0.01818544527  
0.0180025769  
0.01782330604  
0.01764830498  
0.01747611599  
0.01730708668  
0.01713995116  
0.01697485944  
0.01681500888  
0.01665355652  
0.01649910361  
0.01634368232  
0.01619276629  
0.01604356856  
0.01589820758  
0.01575312038  
0.01561277348  
0.01547047128  
0.01533248442  
0.01519649306  
0.01506354969  
0.01493504966  
0.01480193375  
0.01467533488  
0.01454954594  
0.01442878096  
0.01430295376  
0.01418583543  
0.01406826777  
0.01395050612  
0.01383875539  
0.01372420828  
0.01361350239  
0.01350368056  
0.01339905903  
0.0132900578  
0.01318917082  
0.0130861402  
0.01298453245  
0.01288204259  
0.0127838729  
0.01268665508  
0.01259137024  
0.01249873935  
0.01240524701  
0.01231558224  
0.01222388716  
0.01213742898  
0.01204794005  
0.01196177966  
0.01187801255  
0.01179311259  
0.01171341824  
0.01163016157  
0.01155232913  
0.01147361571  
0.01139358862  
0.01131887151  
0.01124221035  
0.01116790527  
0.01109537871  
0.01102492446  
0.01095158942  
0.01088127502  
0.01081194311  
0.01074400437  
0.01067767825  
0.01061163481  
0.01054421056  
0.01048082864  
0.0104169814  
0.01035618229  
0.01029418322  
0.01023435687  
0.01017215305  
0.01011502755  
0.01005510689  
0.009998583568  
0.009941879807  
0.009887127706  
0.009830396616  
0.009777274256  
0.00972513854  
0.009671336982  
0.009620944107  
0.009568516995  
0.009518179636  
0.009469549415  
0.009419523764  
0.00937194496  
0.009323761823  
0.009277656395  
0.009230823977  
0.009184448612  
0.009140743171  
0.009097049892  
0.00905359069  
0.009009084146  
0.008966685177  
0.00892654726  
0.008885165969  
0.008843631539  
0.008804196033  
0.008766599014  
0.008727836643  
0.008687895785  
0.008651771751  
0.00861459596  
0.008578046028  
0.00854282564  
0.008507233786  
0.008471808398  
0.008438649555  
0.008405908496  
0.008371380823  
0.008335657783  
0.008305523604  
0.008275104898  
0.008243513574  
0.00821200788  
0.008182550363  
0.008153040592  
0.008123258219  
0.008092681163  
0.008064512227  
0.008036897821  
0.008011704817  
0.007982412937  
0.007956092407  
0.007930705403  
0.007904576726  
0.0078809197  
0.007855727565  
0.00783063425  
0.007805707021  
0.007782833206  
0.007760508875  
0.007737092607  
0.007714311131  
0.007692512658  
0.007671581368  
0.007650235726  
0.007628235085  
0.00761034666  
0.007589343247  
0.007569813294  
0.007551262218  
0.007532425412  
0.007513400635  
0.007494483434  
0.007476092348  
0.007459596018  
0.007443158082  
0.007426481131  
0.007409745693  
0.007395345658  
0.007377662496  
0.007361542143  
0.007349090084  
0.007334694468  
0.007320663973  
0.007306737983  
0.007293769646  
0.007283059316  
0.007266180276  
0.007255147013  
0.007242013009  
0.007232432322  
0.007219397587  
0.007209336893  
0.007197767276  
0.007187359772  
0.007176722039  
0.007166260463  
0.007155837416  
0.007149267148  
0.007140660004  
0.007130908158  
0.007122990204  
0.007114592158  
0.007107614649  
0.007099022037  
0.007092601125  
0.007084893699  
0.007079398512  
0.007074135966  
0.007066962824  
0.007062155468  
0.007056082586  
0.00705056696  
0.007046299595  
0.007042067389  
0.007039094423  
0.007034830715  
0.007031541109  
0.00702960708  
0.007026767994  
0.007023137931  
0.007020915418  
0.00701895213  
0.007017850604  
0.007016074018  
0.007015117419  
0.007013863881  
0.0070149128  
0.007012610845  
