-0.3678428215  
-0.294406599  
-0.2310908559  
-0.1862729655  
-0.166460104  
-0.1755766113  
-0.2145383394  
-0.2811877819  
-0.3705887239  
-0.4756642033  
-0.5880906259  
-0.6993526051  
-0.8018088229  
-0.88964804  
-0.9595881407  
-1.011219543  
-1.046929907  
-1.071392409  
-1.090673286  
-1.111063683  
-1.137793224  
-1.173814825  
-1.218862225  
-1.268943048  
-1.316400883  
-1.350578699  
-1.35904028  
-1.329216325  
-1.250248328  
-1.114784108  
-0.9204299714  
-0.67063917  
-0.3748547303  
-0.04784886636  
0.2916878261  
0.6231406537  
0.926281549  
1.18358566  
1.382223501  
1.515457165  
1.583237029  
1.591929167  
1.553214824  
1.482333933  
1.395926872  
1.309785792  
1.236825319  
1.18554841  
1.159194414  
1.155666978  
1.168215143  
1.186735836  
1.199505138  
1.195068073  
1.164027006  
1.100479066  
1.0029317  
0.8745709639  
0.7228835938  
0.5586951388  
0.3947688815  
0.2441704401  
0.1186024201  
0.02694043562  
-0.02585769139  
-0.03933880018  
-0.01757051399  
0.03140128661  
0.09658204465  
0.1654108077  
0.2253176566  
0.2652734049  
0.2771357776  
0.2566243829  
0.2038111137  
0.1230621657  
0.02243955812  
-0.08735933501  
-0.1943875298  
-0.286982237  
-0.3552452204  
-0.3922744786  
-0.3949920555  
-0.3644606905  
-0.3056621946  
-0.2267710407  
-0.1380457237  
-0.05049476987  
0.02549632944  
0.0813852021  
0.1113883306  
0.11299132  
0.08700786693  
0.03722008163  
-0.03032170892  
-0.1082141401  
-0.1886838208  
-0.2645143306  
-0.3297871425  
-0.3803745107  
-0.4141434922  
-0.4308931743  
-0.4320724663  
-0.4203506047  
-0.3991390989  
-0.3721267683  
-0.3429171645  
-0.3147795536  
-0.2905362346  
-0.2725596325  
-0.2628358564  
-0.263038789  
-0.2745672694  
-0.2985059572  
-0.3354942966  
-0.3855223838  
-0.4476927032  
-0.5200082305  
-0.5992623813  
-0.6810826573  
-0.7601756177  
-0.8307771714  
-0.8872651375  
-0.9248668832  
-0.9403565352  
-0.9326205509  
-0.9029865265  
-0.8552363284  
-0.7952608951  
-0.7303844623  
-0.6684342701  
-0.6166773474  
-0.5807841869  
-0.5639774471  
-0.5664997801  
-0.5855045776  
-0.6153905345  
-0.6485414313  
-0.6763739535  
-0.6905232968  
-0.6840026254  
-0.652144489  
-0.5931982385  
-0.508478238  
-0.4020654553  
-0.280103048  
-0.1498136585  
-0.01838867116  
0.1080671355  
0.2253789641  
0.3318051713  
0.4281258513  
0.5173134914  
0.6038376963  
0.6927099162  
0.7884229825  
0.8939367668  
1.009865882  
1.134003316  
1.261256301  
1.384016525  
1.49294496  
1.578060868  
1.630009481  
1.641331658  
1.607556888  
1.52796199  
1.405875318  
1.248464928  
1.066033373  
0.8709070567  
0.6760764636  
0.4937851296  
0.3342787652  
0.2048838805  
0.1095572756  
0.04894718745  
0.0209220003  
0.02144847317  
0.04564625296  
0.08879672837  
0.1471388697  
0.218290705  
0.3012426534  
0.3959378322  
0.502548614  
0.6206054641  
0.7481712146  
0.8812474028  
1.013548508  
1.136711899  
1.240931341  
1.315926895  
1.352095821  
1.341660724  
1.279638599  
1.164482465  
0.9983090228  
0.7866974691  
0.5381183895  
0.2630853317  
-0.02681431469  
-0.3198879933  
-0.6051851645  
-0.8731397137  
-1.115996339  
-1.32801759  
-1.505525188  
-1.646827692  
-1.752078611  
-1.823106026  
-1.86320848  
-1.876907568  
-1.869628567  
-1.847283927  
-1.81575806  
-1.780317906  
-1.745010015  
-1.712143537  
-1.681954203  
-1.652555086  
-1.620226186  
-1.580044119  
-1.526784835  
-1.45595446  
-1.364770714  
-1.25288717  
-1.122702051  
-0.979138035  
-0.8289048081  
-0.6793319081  
-0.5369911352  
-0.406346004  
-0.2887210997  
-0.1818067603  
-0.07984385673  
0.02549191904  
0.1436223576  
0.2832448085  
0.4504547318  
0.6471527479  
0.8700130134  
1.110234297  
1.354142551  
1.584598622  
1.783017762  
1.931717698  
2.016259328  
2.027442814  
1.962675463  
1.826521683  
1.630361776  
1.391205604  
1.129834195  
0.868500523  
0.6284949765  
0.42786811  
0.2795887171  
0.1903418454  
0.1600937237  
0.1824496121  
0.2457409669  
0.334682461  
0.4323843975  
0.5224635931  
0.5909901602  
0.6280363501  
0.6286514466  
0.5931577141  
0.526753531  
0.4385125875  
0.3399223443  
0.2431845206  
0.1595136601  
0.0976664695  
0.06289033053  
0.05642581539  
0.07559225041  
0.1144167032  
0.1646751358  
0.2171623319  
0.2629626781  
0.2945421869  
0.3064652741  
0.2956721247  
0.2612972544  
0.2041152817  
0.1257665997  
0.02796138898  
-0.08814910898  
-0.2222577192  
-0.3747640115  
-0.5462129432  
-0.7364027955  
-0.9433539458  
-1.162365385  
-1.385404991  
-1.601033509  
-1.794982933  
-1.95140005  
-2.054631274  
-2.091326766  
-2.052544957  
-1.935527678  
-1.744818557  
-1.492508589  
-1.19748772  
-0.8837508518  
-0.5779472554  
-0.3064673219  
-0.09245878945  
0.04685719321  
0.1022033871  
0.07335179783  
-0.03081587742  
-0.1933007677  
-0.390899885  
-0.5968101003  
-0.7836174052  
-0.9263362383  
-1.005154649  
-1.007588199  
-0.9298019827  
-0.7769474537  
-0.5624895961  
-0.3065793536  
-0.03367131017  
0.2303432336  
0.4611361055  
0.6387147692  
0.7496209864  
0.7882905949  
0.7574120764  
0.6672727612  
0.534205432  
0.3783846801  
0.2212881036  
0.08318112494  
-0.01905852365  
-0.07351586729  
-0.07408059618  
-0.02053092819  
0.08206175471  
0.2244327757  
0.3945214038  
0.5789522452  
0.764411836  
0.9387950233  
1.092039625  
1.216651874  
1.307925131  
1.363935942  
1.385348688  
1.375089003  
1.33792297  
1.27995331  
1.208046444  
1.129201499  
1.049892316  
0.9754183625  
0.9093486364  
0.8531213772  
0.8059084253  
0.764784791  
0.7252439831  
0.6820350862  
0.6302175158  
0.5663128489  
0.4893441665  
0.4015927897  
0.3088744579  
0.2202461387  
0.1470912769  
0.1016792477  
0.0953634602  
0.1366739007  
0.2296224355  
0.3724970659  
0.5574004542  
0.7706649002  
0.9941451175  
1.207246801  
1.3894196  
1.522761967  
1.594338219  
1.597854112  
1.534421325  
1.412287166  
1.245551314  
1.052059426  
0.850783128  
0.659077366  
0.4902102879  
0.3515309919  
0.2435309917  
0.1599308246  
0.08876307586  
0.01429235904  
-0.08050800594  
-0.2112814766  
-0.3897812261  
-0.6218869401  
-0.9063947911  
-1.234753847  
-1.59175471  
-1.95708087  
-2.307496847  
-2.61939257  
-2.871349747  
-3.046430096  
-3.133918341  
-3.130336047  
-3.039662502  
-2.87276664  
-2.646171878  
-2.38031751  
-2.097543529  
-1.820013358  
-1.567792638  
-1.357248022  
-1.199900871  
-1.101796328  
-1.063396249  
-1.079958456  
-1.142316652  
-1.237951086  
-1.352224199  
-1.469656947  
-1.575140344  
-1.6549957  
-1.697822062  
-1.695100559  
-1.641560166  
-1.535298589  
-1.377699185  
-1.173161979  
-0.9286763143  
-0.6532603751  
-0.3572966578  
-0.05178147202  
0.2524678914  
0.5456000457  
0.8194567864  
1.068154485  
1.288462505  
1.479911008  
1.644582723  
1.786606409  
1.911374555  
2.024585192  
2.131210145  
2.234539035  
2.335422649  
2.431833254  
2.518820347  
2.588869237  
2.632646422  
2.640040238  
2.601371491  
2.508644955  
2.356682515  
2.144028642  
1.873519671  
1.552476202  
1.192493177  
0.8088486375  
0.4195781102  
0.04428383056  
-0.2972550197  
-0.5865722258  
-0.8080097757  
-0.9501132894  
-1.006793921  
-0.9781490122  
-0.8708088149  
-0.6977162477  
-0.4772913141  
-0.2319808974  
0.01371240157  
0.2355621839  
0.4120761769  
0.5267999566  
0.5701774435  
0.5407175026  
0.4452796763  
0.298412961  
0.1207786378  
-0.06316090163  
-0.2279321682  
-0.3499943258  
-0.4104685122  
-0.3973482964  
-0.3069210673  
-0.1442372851  
0.07741022252  
0.3379351462  
0.6126437396  
0.8749031221  
1.098970003  
1.262648178  
1.349479977  
1.35021726  
1.263436929  
1.095260137  
0.8582525919  
0.5696887426  
0.2494372892  
-0.08223644775  
-0.4066742856  
-0.7083849717  
-0.9760143042  
-1.202662113  
-1.385591696  
-1.525468618  
-1.625306734  
-1.689348975  
-1.722066336  
-1.727445971  
-1.708636763  
-1.667969057  
-1.607260829  
-1.528300995  
-1.433334478  
-1.325415634  
-1.208505729  
-1.087270301  
-0.966603231  
-0.8509621991  
-0.743670512  
-0.6463333655  
-0.5585258792  
-0.4778398109  
-0.4003317557  
-0.3213019796  
-0.2363035573  
-0.142176596  
-0.03794436819  
0.07463199654  
0.1909582539  
0.3040267149  
0.4053276476  
0.4861257717  
0.5389326718  
0.5589300524  
0.5451396746  
0.5011067615  
0.4349811572  
0.3589150108  
0.2878322182  
0.2377041898  
0.223541217  
0.2573829788  
0.3465622621  
0.492506153  
0.6902632155  
0.9288398764  
1.192319736  
1.461622814  
1.716643865  
1.938484356  
2.111449523  
2.224540777  
2.272252202  
2.254598628  
2.176421408  
2.046134701  
1.874162503  
1.671328673  
1.447479869  
1.21052511  
0.9660130854  
0.7172403388  
0.465796981  
0.2123790266  
-0.04233806085  
-0.2969629153  
-0.5489419776  
-0.7944760632  
-1.028796241  
-1.246716262  
-1.443319526  
-1.614634223  
-1.758139256  
-1.873013926  
-1.960089455  
-2.021530702  
-2.060323722  
-2.079697159  
-2.08257442  
-2.071168719  
-2.046785135  
-2.009830245  
-1.960013939  
-1.896681612  
-1.819191609  
-1.727267101  
-1.621255299  
-1.502253267  
-1.372089545  
-1.233177998  
-1.088278018  
-0.9402168547  
-0.7916226581  
-0.6447243094  
-0.5012481506  
-0.3624272658  
-0.2291193454  
-0.1020019309  
0.01821462418  
0.130595039  
0.2338820632  
0.326518889  
0.4068283592  
0.4733103617  
0.5250274273  
0.5620053234  
0.5855585068  
0.5984598943  
0.6049040069  
0.6102221607  
0.620369163  
0.6412374803  
0.6778853548  
0.7337874957  
0.8102334279  
0.9059633099  
1.017117239  
1.137531051  
1.259340269  
1.373842795  
1.472495197  
1.547920417  
1.594784384  
1.610424516  
1.595133103  
1.552059275  
1.486731781  
1.406265987  
1.318365218  
1.23024608  
1.147649783  
1.074076219  
1.010363982  
0.9546834409  
0.9029599702  
0.8496767639  
0.7889406434  
0.7156653638  
0.6266774927  
0.5215653135  
0.4031128854  
0.2772207228  
0.1522781897  
0.03805558954  
-0.05575236121  
-0.1211101913  
-0.1531265379  
-0.151168706  
-0.1194119004  
-0.06669195116  
-0.005624341003  
0.04890740988  
0.08171137202  
0.07939617655  
0.03233043942  
-0.06386662738  
-0.2075366207  
-0.3910336978  
-0.6016176005  
-0.8230515768  
-1.037681486  
-1.228662884  
-1.382021648  
-1.488237511  
-1.543139357  
-1.548010645  
-1.508916355  
-1.435403536  
-1.338803994  
-1.230417583  
-1.119877294  
-1.01393184  
-0.9158211295  
-0.8253093957  
-0.7393236543  
-0.6530602465  
-0.5613332563  
-0.4599286372  
-0.3467032049  
-0.222264538  
-0.09010898507  
0.04378751538  
0.1718330737  
0.2859757928  
0.3789340687  
0.4452796333  
0.4821836097  
0.489693658  
0.4705066955  
0.4293005549  
0.3717482568  
0.3034232999  
0.2288100686  
0.1506101451  
0.06949028538  
-0.01568577721  
-0.1071760577  
-0.2073757644  
-0.3177191161  
-0.4377000099  
-0.5642250302  
-0.6914443028  
-0.811134865  
-0.9135960304  
-0.9889140904  
-1.028406523  
-1.025974493  
-0.9791517308  
-0.8896495137  
-0.763313037  
-0.6094821361  
-0.4398720179  
-0.2671507388  
-0.1034504136  
0.04096817603  
0.1586925314  
0.2456658526  
0.3011768116  
0.3273939885  
0.3285655264  
0.3100488678  
0.2773687933  
0.2354547425  
0.1881773971  
0.1382455683  
0.08743056289  
0.03705229517  
-0.01141433654  
-0.05574712521  
-0.09255262267  
-0.1171136856  
-0.1235723787  
-0.1054500366  
-0.0564463193  
0.02859928004  
0.1527135621  
0.3159361778  
0.5147296323  
0.7417836465  
0.9862693539  
1.234552015  
1.471307981  
1.680939919  
1.849125498  
1.964328975  
2.019073015  
2.010814715  
1.942288935  
1.821267401  
1.659748688  
1.47266159  
1.276262811  
1.086410839  
0.9169419788  
0.7783347094  
0.6768147263  
0.6139600637  
0.5868288474  
0.5885242684  
0.60910587  
0.6367080012  
0.6587361924  
0.6630360879  
0.6389475622  
0.5781911117  
0.4755499657  
0.3293225087  
0.1415239881  
-0.08217624563  
-0.3328063527  
-0.5987115069  
-0.8664361694  
-1.121801988  
-1.351093094  
-1.542242675  
-1.685884313  
-1.776148348  
-1.811105192  
-1.792799379  
-1.726863399  
-1.621769438  
-1.487806272  
-1.335929229  
-1.17661383  
-1.018870172  
-0.869524207  
-0.7328546678  
-0.6105994105  
-0.5023275748  
-0.4060806927  
-0.319198801  
-0.2391758829  
-0.1644254002  
-0.09482083108  
-0.0319264405  
0.02113031023  
0.0601268848  
0.08049684434  
0.078237694  
0.05083949015  
-0.001930465032  
-0.07752452329  
-0.1704965054  
-0.2728233418  
-0.3746396898  
-0.465308678  
-0.5346853297  
-0.5744015868  
-0.5789790158  
-0.5466082657  
-0.4794605448  
-0.3834760142  
-0.267642577  
-0.1428579023  
-0.02054113245  
0.08880899939  
0.1768846633  
0.2384742504  
0.2718645766  
0.2786843946  
0.263220814  
0.231345287  
0.1892445874  
0.1421898212  
0.0935831348  
0.04444937937  
-0.006518183436  
-0.06236809642  
-0.1268629644  
-0.203206127  
-0.2927625046  
-0.3940289181  
-0.5020575194  
-0.6084795738  
-0.702163869  
-0.7704417299  
-0.8007340147  
-0.7823525415  
-0.7082010412  
-0.5761311292  
-0.3897332177  
-0.1584401113  
0.1030939825  
0.3762746274  
0.6403566378  
0.8745257193  
1.060034284  
1.182129369  
1.231581905  
1.205636306  
1.108314893  
0.9500474053  
0.7467015472  
0.5181196635  
0.2863229084  
0.0735625122  
-0.09960615393  
-0.2160604083  
-0.2635145739  
-0.235495278  
-0.1318142807  
0.04147547593  
0.2726240104  
0.5451659396  
0.8392534935  
1.133210525  
1.405194273  
1.634813936  
1.804600166  
1.901208062  
1.916298239  
1.847040505  
1.696235331  
1.472058109  
1.187461984  
0.8592705322  
0.50702654  
0.1516406387  
-0.1860622525  
-0.4868289543  
-0.7343796285  
-0.9166230999  
-1.026563714  
-1.062817085  
-1.029654103  
-0.9365526483  
-0.797280198  
-0.6285738071  
-0.4485452096  
-0.2749742774  
-0.1236476786  
-0.006931216306  
0.06727549447  
0.09610149687  
0.0817205165  
0.03081851788  
-0.04641189986  
-0.137648226  
-0.2300231751  
-0.311735197  
-0.3735055293  
-0.4097001691  
-0.4189837014  
-0.4044131736  
-0.3729533811  
-0.3344638977  
-0.3002792989  
-0.2815640071  
-0.2876616523  
-0.324671251  
-0.3944585971  
-0.4942481105  
-0.616874231  
-0.7516606673  
-0.8858045488  
-1.006059008  
-1.100472424  
-1.159895419  
-1.179044831  
-1.156955157  
-1.096759236  
-1.004848718  
-0.8895790962  
-0.7597489691  
-0.6231333752  
-0.4853287228  
-0.3491193385  
-0.2144767357  
-0.07916668406  
0.0601415722  
0.2065050061  
0.3613380786  
0.5233304882  
0.6878757668  
0.8471542137  
0.9908700754  
1.107551248  
1.186194026  
1.217965808  
1.197691359  
1.124845798  
1.003901302  
0.8439404317  
0.6576141429  
0.4595966194  
0.2647895912  
0.08654981605  
-0.06478512956  
-0.182858349  
-0.2656188066  
-0.3149927282  
-0.3359810416  
-0.3353720582  
-0.3203016585  
-0.2969100207  
-0.2693279931  
-0.239160455  
-0.2055235562  
-0.1656234825  
-0.1157295829  
-0.05235826109  
0.02657448292  
0.1208530782  
0.2274890755  
0.3407581518  
0.4527518531  
0.554332177  
0.6363240763  
0.690735538  
0.7117968564  
0.6966675976  
0.6457020923  
0.562271344  
0.4522045564  
0.3229657752  
0.182723061  
0.03945816293  
-0.09976426143  
