0.1474970835  
0.2965840202  
0.4453291851  
0.5884344277  
0.7205763771  
0.8369452453  
0.9338256893  
1.009166191  
1.063033113  
1.097872779  
1.118498658  
1.131753676  
1.145843369  
1.169372647  
1.210194888  
1.274206623  
1.364261909  
1.47938798  
1.614449845  
1.76038315  
1.905018565  
2.034450524  
2.134802628  
2.194173869  
2.204490961  
2.162985474  
2.073036945  
1.944206037  
1.791372319  
1.633037943  
1.488975657  
1.377515825  
1.312846493  
1.302713491  
1.346886676  
1.436646335  
1.555429582  
1.680582868  
1.786029585  
1.845509184  
1.835946647  
1.740498028  
1.550852201  
1.268466431  
0.9045832689  
0.4790299167  
0.01798492852  
-0.4489792523  
-0.8921636538  
-1.284915094  
-1.606292007  
-1.842944928  
-1.990020251  
-2.05105017  
-2.036926224  
-1.964128549  
-1.852491431  
-1.722785848  
-1.594413205  
-1.483450264  
-1.401242076  
-1.35364251  
-1.340937383  
-1.358407282  
-1.397413151  
-1.446842873  
-1.494729323  
-1.529847297  
-1.543101  
-1.528566352  
-1.484090754  
-1.41141158  
-1.315816811  
-1.205410633  
-1.090095278  
-0.9803732033  
-0.8861261761  
-0.8154622459  
-0.7737533704  
-0.7629487379  
-0.7812139397  
-0.8229488782  
-0.8791862886  
-0.938360886  
-0.9874016208  
-1.01305802  
-1.003348551  
-0.9489764902  
-0.8445561498  
-0.6894774469  
-0.4882750259  
-0.2504206062  
0.01049031799  
0.2780833047  
0.5349448111  
0.7645361434  
0.9530396609  
1.09088476  
1.173729362  
1.202765806  
1.184298384  
1.128654772  
1.048602976  
0.9574961812  
0.867438595  
0.7877246633  
0.7237838452  
0.6767573006  
0.6437455993  
0.6186528735  
0.593466245  
0.5597502777  
0.5101135562  
0.4394312262  
0.3456410817  
0.2300389567  
0.09704948356  
-0.04643495207  
-0.1920238513  
-0.3309246357  
-0.4549932416  
-0.5575917019  
-0.6341463668  
-0.6823650284  
-0.7021406594  
-0.6951946505  
-0.6645782182  
-0.6141345717  
-0.5480181032  
-0.4703539323  
-0.3850505856  
-0.2957740186  
-0.2060159711  
-0.1192088572  
-0.03880039044  
0.03176539552  
0.08919355189  
0.1306153272  
0.1539568841  
0.1583382028  
0.1444229291  
0.1146348285  
0.07317255381  
0.02579008721  
-0.02067155244  
-0.0589494526  
-0.08215818918  
-0.08461321913  
-0.06256569724  
-0.0147398185  
0.05741905119  
0.1498335558  
0.2562339354  
0.3688969337  
0.4795910356  
0.5806126395  
0.6657629039  
0.7311246187  
0.7755296839  
0.8006399493  
0.8106258167  
0.8114831285  
0.8100853633  
0.8131056014  
0.8259620703  
0.8519451249  
0.8916419948  
0.9427460027  
1.000265824  
1.057100885  
1.104883566  
1.134978314  
1.139476884  
1.112080535  
1.048758459  
0.9481191178  
0.8115027053  
0.6427984214  
0.4480736317  
0.2350557766  
0.01256978483  
-0.2100468349  
-0.4234942652  
-0.6190274483  
-0.7889221907  
-0.9269103347  
-1.028559448  
-1.091600188  
-1.116148972  
-1.104808277  
-1.062584584  
-0.9965994321  
-0.9155825955  
-0.8291560879  
-0.7469654917  
-0.677728773  
-0.6283098861  
-0.6029394405  
-0.6026788764  
-0.6252431423  
-0.6652175928  
-0.7146954969  
-0.7642780323  
-0.8043330232  
-0.8263686813  
-0.8243312469  
-0.7956418468  
-0.7418088808  
-0.6684869516  
-0.5849480969  
-0.5029783178  
-0.4353390872  
-0.3939530523  
-0.3880785399  
-0.4226991743  
-0.4973740853  
-0.6057242569  
-0.7356627372  
-0.870370285  
-0.9899402468  
-1.073514861  
-1.101675528  
-1.058818762  
-0.9352294177  
-0.7286144278  
-0.4448937847  
-0.09814177972  
0.2903517566  
0.6938135372  
1.08237499  
1.425859763  
1.696709501  
1.872728888  
1.93936299  
1.891262901  
1.73293934  
1.478445803  
1.150088479  
0.7763093229  
0.3889577344  
0.02025102096  
-0.3002527721  
-0.5483353157  
-0.707187276  
-0.7686504468  
-0.7335490639  
-0.6111090135  
-0.4175884519  
-0.1743122777  
0.09463598972  
0.3648009657  
0.6135624927  
0.8219654417  
0.9760206604  
1.067420216  
1.093659103  
1.057636462  
0.9668383495  
0.8322370354  
0.6670448122  
0.4854449937  
0.3014100847  
0.1276777276  
-0.02505625137  
-0.1487129727  
-0.2381580059  
-0.2913026664  
-0.3089789921  
-0.2946311758  
-0.2538379522  
-0.1937191501  
-0.1222528534  
-0.04757477862  
0.02269604185  
0.08204418622  
0.1255039269  
0.149924273  
0.1540384497  
0.1383324405  
0.1047506305  
0.05627496079  
-0.003557543028  
-0.07112092294  
-0.1431021864  
-0.2167782428  
-0.2901386429  
-0.3618527632  
-0.4310958344  
-0.4972706532  
-0.5596854561  
-0.6172442006  
-0.6682121248  
-0.7101145951  
-0.7397891656  
-0.753618962  
-0.7479272819  
-0.7194871538  
-0.6660885495  
-0.5870838951  
-0.483818691  
-0.3598775995  
-0.2210809808  
-0.07520185708  
0.06857917625  
0.2004404851  
0.3108255337  
0.3913699579  
0.4357482267  
0.4403292756  
0.4045486251  
0.330965307  
0.2249922649  
0.09434625631  
-0.05171337631  
-0.2032438408  
-0.3504827157  
-0.4845975407  
-0.5982670368  
-0.686025602  
-0.7443819072  
-0.7717367785  
-0.7681521851  
-0.735058806  
-0.674970951  
-0.5912732888  
-0.4881216726  
-0.3704504039  
-0.2440514276  
-0.1156577469  
0.007059187572  
0.1156706338  
0.201409925  
0.2558588826  
0.2718719634  
0.2446496895  
0.1728163634  
0.05933474947  
-0.08792888586  
-0.2561446715  
-0.4280728917  
-0.5832541747  
-0.6997823767  
-0.7564988991  
-0.7353938676  
-0.6239213916  
-0.4169575623  
-0.11811618  
0.259768667  
0.6951000167  
1.158930463  
1.61719699  
2.033574363  
2.372659629  
2.603156248  
2.700735888  
2.650291761  
2.447372655  
2.098658979  
1.621476548  
1.042398702  
0.3951055166  
-0.2822915907  
-0.9502062933  
-1.570540056  
-2.109410085  
-2.539412487  
-2.841269684  
-3.004750315  
-3.028833599  
-2.92115788  
-2.696845284  
-2.376850151  
-1.986000215  
-1.550916981  
-1.097998584  
-0.6516108884  
-0.2326209773  
0.1426473061  
0.46300133  
0.7225007882  
0.9201618581  
1.059307565  
1.146655885  
1.191250641  
1.203340898  
1.193304092  
1.170706625  
1.143551388  
1.117764094  
1.096932493  
1.082291057  
1.072934918  
1.066234965  
1.058404533  
1.045172485  
1.022514801  
0.9873624921  
0.9382320904  
0.8756926797  
0.8026054969  
0.7240729135  
0.6470690164  
0.5797632918  
0.5305791486  
0.5070953196  
0.51491786  
0.556667202  
0.6312512196  
0.7335315773  
0.8544713392  
0.9817775946  
1.100977884  
1.196826937  
1.254862233  
1.262931313  
1.212493708  
1.099553077  
0.9250949499  
0.6950140795  
0.4195338388  
0.1122207207  
-0.2112829508  
-0.5346524001  
-0.8422447786  
-1.120299699  
-1.357880668  
-1.547483597  
-1.685313258  
-1.771229033  
-1.808410217  
-1.802803611  
-1.762411428  
-1.696495849  
-1.614750525  
-1.526507074  
-1.440019584  
-1.36188331  
-1.296622524  
-1.246493293  
-1.211508223  
-1.189698089  
-1.177571806  
-1.170732137  
-1.164565389  
-1.154904389  
-1.13858168  
-1.113772476  
-1.080089222  
-1.03842173  
-0.9905437767  
-0.9386019134  
-0.8845708884  
-0.8298141999  
-0.7748452466  
-0.7193451189  
-0.6624528976  
-0.6032532079  
-0.5413629703  
-0.4774784148  
-0.4137239936  
-0.3537029188  
-0.3021776179  
-0.264398423  
-0.2451592621  
-0.2477276343  
-0.2728427756  
-0.3179600038  
-0.3769200455  
-0.4401366224  
-0.4953433232  
-0.5288340099  
-0.5270653489  
-0.4784172506  
-0.3748866433  
-0.2134614403  
0.003016386949  
0.2656590392  
0.560064942  
0.8675582758  
1.1670046  
1.437004399  
1.658206445  
1.815461513  
1.899546662  
1.908241607  
1.846614255  
1.726471675  
1.565032673  
1.382978925  
1.202119694  
1.042952709  
0.922412063  
0.8520724335  
0.8370282541  
0.875557515  
0.9596077774  
1.076016862  
1.208302451  
1.338777244  
1.450717908  
1.530306881  
1.568104181  
1.559869237  
1.506649866  
1.41414744  
1.291467432  
1.149453936  
0.9988575928  
0.8486065197  
0.7044500622  
0.5681606701  
0.437427411  
0.3064495931  
0.1671430966  
0.01077616965  
-0.1702197948  
-0.3805359525  
-0.6206435496  
-0.8860295398  
-1.167141751  
-1.450063173  
-1.717833062  
-1.952240898  
-2.135853472  
-2.254001779  
-2.296483792  
-2.258756993  
-2.142502576  
-1.955496523  
-1.710837535  
-1.425645634  
-1.119401437  
-0.8121255794  
-0.5226129431  
-0.2668841069  
-0.05700763782  
0.09963004917  
0.200576854  
0.2481116137  
0.2486475256  
0.2118472678  
0.1495442355  
0.07459758625  
-0.0002310823603  
-0.06328626161  
-0.1048534378  
-0.1177744336  
-0.09783145734  
-0.04388291002  
0.04223267626  
0.1560021178  
0.2907322245  
0.4381945796  
0.5893721673  
0.7352582505  
0.867645167  
0.9798354635  
1.06719986  
1.127525674  
1.161103454  
1.170514244  
1.160140797  
1.135429927  
1.102000372  
1.064701873  
1.026767169  
0.9891779911  
0.9503725115  
0.9063497952  
0.8512001813  
0.7779943706  
0.6799345474  
0.5515884167  
0.3900307576  
0.1956920793  
-0.02723240515  
-0.2709238773  
-0.5246294595  
-0.7758575715  
-1.011900262  
-1.221487151  
-1.396309884  
-1.532173486  
-1.629573193  
-1.693571901  
-1.732956498  
-1.758764185  
-1.782371488  
-1.813433701  
-1.857981548  
-1.91699709  
-1.985730065  
-2.053916947  
-2.106933253  
-2.127772035  
-2.099600519  
-2.008539577  
-1.846251094  
-1.611917669  
-1.313259853  
-0.9663691152  
-0.5942897979  
-0.2244811706  
0.1145339566  
0.3968833829  
0.6028838126  
0.7218737149  
0.753875496  
0.7097902434  
0.6100336417  
0.4817526608  
0.3549924307  
0.2583487555  
0.2147481763  
0.2379824137  
0.3305462226  
0.483118207  
0.6757961694  
0.8809219791  
1.067097957  
1.203790853  
1.265853777  
1.237288118  
1.113698795  
0.9030888558  
0.624891944  
0.3074146663  
-0.01591287947  
-0.3109297304  
-0.5471195206  
-0.7013659884  
-0.7605793807  
-0.7228741665  
-0.5972008534  
-0.4015652092  
-0.1601560036  
0.1001508306  
0.3533933101  
0.5777206596  
0.7577782703  
0.8860068459  
0.9627719624  
0.9953872765  
0.9962746194  
0.9805812035  
0.9636388624  
0.9586318116  
0.9747937061  
1.016323542  
1.082134673  
1.166384855  
1.259645594  
1.350506193  
1.427316123  
1.479831611  
1.500511378  
1.485316515  
1.43393079  
1.349421882  
1.237450629  
1.105181609  
0.9601096562  
0.808982859  
0.6570131433  
0.5074570331  
0.3616315387  
0.219302711  
0.07935560278  
-0.05940776931  
-0.197514114  
-0.3342563397  
-0.4674361389  
-0.5934689956  
-0.7078275054  
-0.8057462821  
-0.8830586036  
-0.9369998368  
-0.9668406499  
-0.9742139662  
-0.9630718572  
-0.9392713638  
-0.9098396055  
-0.8820348239  
-0.8623454206  
-0.8555847581  
-0.8642125779  
-0.8879845176  
-0.9239695858  
-0.966932752  
-1.010013286  
-1.045596088  
-1.066263992  
-1.065694138  
-1.039401108  
-0.9852399645  
-0.9036285413  
-0.7974844473  
-0.6719041978  
-0.5336394603  
-0.3904402519  
-0.2503461397  
-0.1209956999  
-0.009017794904  
0.0804577618  
0.1441341012  
0.180726446  
0.1909946673  
0.1776420395  
0.1451040605  
0.09923802427  
0.04693576308  
-0.004336570102  
-0.04706601254  
-0.07426908091  
-0.08010148393  
-0.06045560732  
-0.01349680603  
0.0599253876  
0.1560721991  
0.2683661882  
0.3877440025  
0.5033270814  
0.6033549412  
0.6763334756  
0.7122498394  
0.7037483582  
0.6470896256  
0.5427804751  
0.3957673382  
0.2151445033  
0.01339070717  
-0.1947970467  
-0.3939444568  
-0.5693549666  
-0.7086052932  
-0.8028104347  
-0.8475126062  
-0.8431127495  
-0.7947901317  
-0.7119383684  
-0.6071845148  
-0.4950905213  
-0.3906882932  
-0.3079835251  
-0.2585752744  
-0.2505232572  
-0.2875683528  
-0.3687749144  
-0.4886344507  
-0.6376173609  
-0.8031335181  
-0.9707922155  
-1.125844329  
-1.25464928  
-1.346002572  
-1.392163536  
-1.389472134  
-1.338465574  
-1.243491584  
-1.111863327  
-0.9526834039  
-0.7754908352  
-0.5889291764  
-0.3996308617  
-0.211464024  
-0.0252746319  
0.160859772  
0.3508813521  
0.549641503  
0.7615762833  
0.9893838999  
1.232901419  
1.488357162  
1.748119069  
2.000988655  
2.233007036  
2.428671673  
2.572408437  
2.650110941  
2.65056078  
2.566573487  
2.395753858  
2.140813083  
1.80945487  
1.413887665  
0.9700640743  
0.4967451055  
0.01449621648  
-0.4553114417  
-0.891459538  
-1.273780786  
-1.584022293  
-1.806696464  
-1.929934303  
-1.946322624  
-1.853687441  
-1.655714889  
-1.362310758  
-0.989553132  
-0.5591437436  
-0.09728423755  
0.3669924903  
0.80395336  
1.185562997  
1.487905084  
1.693332936  
1.79207415  
1.783069056  
1.673897625  
1.479794294  
1.221849074  
0.9246270771  
0.6135124598  
0.3121126138  
0.04004213015  
-0.1886450886  
-0.3662335509  
-0.4913005547  
-0.5679125516  
-0.6042788792  
-0.6110690935  
-0.5996790712  
-0.5806711206  
-0.5625741586  
-0.5511421775  
-0.5491055834  
-0.5563518927  
-0.5704494463  
-0.5873710811  
-0.6023034717  
-0.6104150628  
-0.6075038445  
-0.5904929511  
-0.5577365412  
-0.5091690501  
-0.4463011428  
-0.3720992379  
-0.2907588801  
-0.2073875622  
-0.1276097745  
-0.05710578933  
-0.001100120509  
0.03615568528  
0.05186727362  
0.04508594901  
0.01694823405  
-0.02928962249  
-0.08844201765  
-0.1538178882  
-0.2178373231  
-0.2727895265  
-0.3116353048  
-0.3287711308  
-0.3206519563  
-0.2862046539  
-0.2269822083  
-0.1470416483  
-0.05256865576  
0.04870662894  
0.1482281027  
0.2373920809  
0.3082971419  
0.3544035222  
0.3710427403  
0.3557417929  
0.3083529215  
0.2309951595  
0.1278282447  
0.004683878642  
-0.1313927481  
-0.2726669708  
-0.4112647269  
-0.5397164322  
-0.6514597254  
-0.7412878892  
-0.8057022377  
-0.8431443586  
-0.854094545  
-0.8409893203  
-0.8079662277  
-0.7604326675  
-0.7044696382  
-0.6461405503  
-0.5907525734  
-0.5421683286  
-0.5022570734  
-0.4705696381  
-0.4443009052  
-0.4185730027  
-0.3870206497  
-0.3426303468  
-0.2787313775  
-0.1900149742  
-0.07345220132  
0.07103281317  
0.240220055  
0.4276518527  
0.6240958131  
0.8183638032  
0.9983853755  
1.152402603  
1.270119724  
1.343671108  
1.368267037  
1.342461144  
1.268004824  
1.149361365  
0.9929704791  
0.8064115969  
0.597621533  
0.3742978199  
0.1435644002  
-0.08806123858  
-0.3144684207  
-0.5296174256  
-0.7272178423  
-0.9005621085  
-1.042637696  
-1.146556189  
-1.206280841  
-1.217532119  
-1.178710375  
-1.091624216  
-0.9618407696  
-0.7985341241  
-0.6137702307  
-0.4212967574  
-0.2349882055  
-0.06716940261  
0.07292136963  
0.1802812681  
0.2547237939  
0.3007809467  
0.3269407451  
0.3443250643  
0.3649993454  
0.4001473003  
0.4583715489  
0.5443374366  
0.6579341146  
0.7940511432  
0.9429957835  
1.091486751  
1.224110955  
1.325078549  
1.380076064  
1.378020625  
1.312515397  
1.182845934  
0.9943808444  
0.7583187063  
0.4907613284  
0.2111990706  
-0.05946880879  
-0.3011621031  
-0.4968500937  
-0.6345213572  
-0.7086221913  
-0.7207719421  
-0.6796082494  
-0.5997542498  
-0.4999929052  
-0.400862559  
-0.321964762  
-0.2793507159  
-0.2833364347  
-0.3370647164  
-0.4360314999  
-0.5686626079  
-0.7178769249  
-0.8634247678  
-0.9846803062  
-1.06349179  
-1.086684532  
-1.047861558  
-0.9482521693  
-0.7964998025  
-0.6074302355  
-0.3999971709  
-0.19470826  
-0.01091522774  
0.1356577868  
0.2347929064  
0.2828371734  
0.2828080809  
0.243587168  
0.1783500014  
0.1024989401  
