6197.761628  
6639.677255  
7527.631621  
9361.577906  
14333.17083  
33078.80986  
40132.02024  
1612.484149  
22020.15516  
18621.52352  
40629.12962  
15275.29866  
4126.601322  
24299.8639  
16548.54773  
3692.030301  
7155.219585  
15600.29959  
10543.09096  
4178.240815  
8557.489688  
14209.35208  
14553.95792  
1485.634556  
7554.188427  
15012.19408  
10474.65435  
2718.472844  
4150.286723  
6284.761857  
6809.338685  
1415.049053  
4524.378452  
9117.971583  
4950.844573  
12188.14384  
4050.667345  
2135.234473  
4426.867827  
2617.608757  
4281.077763  
14190.41277  
1614.407743  
1572.007109  
104.1437953  
2355.473503  
2000.961189  
3592.865761  
4886.054599  
504.4629276  
3491.197455  
348.3158198  
324.5976868  
412.2658461  
713.1336813  
618.2104002  
594.8801338  
951.7953859  
426.9222546  
797.0093786  
685.072594  
395.1609429  
351.4850959  
73.04582664  
24.03416713  
632.9699373  
407.5170701  
275.0883589  
297.5538309  
217.6460238  
36.37697622  
203.8642955  
52.29905819  
85.37779617  
85.81658242  
68.87357587  
61.46725658  
51.9664156  
50.7342652  
41.79654245  
40.46278242  
39.7540142  
34.61184942  
32.70191361  
33.89280362  
30.6002166  
28.58333789  
26.69956579  
24.55426156  
23.43574906  
21.15292682  
20.23380802  
19.23599929  
18.37558411  
17.38796959  
16.26308814  
15.67059912  
14.90356542  
14.15796614  
13.4132607  
12.75499373  
12.20685268  
11.59455608  
11.06417534  
10.56052038  
10.10947819  
9.637666889  
9.22944535  
8.855566819  
8.466172579  
8.132401132  
7.796974809  
7.48539269  
7.200365096  
6.913610165  
6.63845105  
6.389394239  
6.15995894  
5.922401736  
5.707035195  
5.500630296  
5.303583616  
5.118191406  
4.937363386  
4.766584136  
4.604697987  
4.450757325  
4.302577282  
4.161136871  
4.025264328  
3.895153265  
3.771192108  
3.652500944  
3.538681375  
3.429016085  
3.324137374  
3.223398071  
3.126742374  
3.03383888  
2.944488521  
2.85875875  
2.776534255  
2.697224671  
2.620887712  
2.547538151  
2.47681905  
2.408586297  
2.343012031  
2.27978921  
2.218771052  
2.15994289  
2.103215025  
2.048389789  
1.995454334  
1.944424342  
1.895108214  
1.847424995  
1.801353184  
1.756861565  
1.713779134  
1.67210694  
1.631799303  
1.592771959  
1.555003533  
1.518417774  
1.483032117  
1.448709408  
1.415490397  
1.383251943  
1.352020343  
1.321700948  
1.292323406  
1.26384622  
1.236196385  
1.209347304  
1.183299325  
1.157986967  
1.133435125  
1.109584626  
1.086402071  
1.063864651  
1.041986866  
1.020710789  
1.00003618  
0.9799230486  
0.9603308883  
0.941316176  
0.9228021956  
0.9047747198  
0.8872473324  
0.8701600047  
0.8535301466  
0.8373520726  
0.8215903611  
0.8062146947  
0.7912627151  
0.7766558989  
0.7624723675  
0.7486104906  
0.7351072499  
0.7219335461  
0.7091009509  
0.6965748866  
0.6843563623  
0.6724374143  
0.6607893387  
0.6494473684  
0.6383744421  
0.6275758114  
0.617013176  
0.6066984887  
0.5966309194  
0.5868057533  
0.5771927981  
0.5678258002  
0.5586513447  
0.5497018918  
0.5409544752  
0.5323937859  
0.5240311266  
0.5158487151  
0.5078566527  
0.5000307276  
0.4923814481  
0.484898537  
0.477591424  
0.4704267154  
0.4634273267  
0.4565630647  
0.449845  
0.4432979355  
0.4368731135  
0.4305861068  
0.4244223631  
0.4183898053  
0.4124690024  
0.4066872247  
0.4010336139  
0.3954751048  
0.3900354203  
0.384709597  
0.3794966614  
0.3743717859  
0.3693577351  
0.3644424128  
0.3596247259  
0.3549031293  
0.3502620274  
0.3457175959  
0.3412881441  
0.3369134795  
0.3326277197  
0.3284360385  
0.324308115  
0.3202657489  
0.3163045116  
0.3124141536  
0.3086148716  
0.3048420718  
0.3011834193  
0.297563895  
0.2940314695  
0.2905462079  
0.2871339668  
0.2837832249  
0.2804870092  
0.2772603805  
0.2740952877  
0.2709540616  
0.2679121845  
0.2649034691  
0.2619490029  
0.25904585  
0.2561878386  
0.2533933783  
0.2506439927  
0.2479495611  
0.2452836049  
0.242667058  
0.2401058245  
0.237585317  
0.2351020488  
0.2326654653  
0.2302679079  
0.227916504  
0.225596039  
0.2233250095  
0.2210804451  
0.2188773983  
0.2167090993  
0.2145842361  
0.2124849203  
0.2104243624  
0.2083919074  
0.2064045577  
0.2044518632  
0.2025175208  
0.2006099804  
0.1987430972  
0.1969088354  
0.1950973153  
0.1933217619  
0.191573088  
0.1898538782  
0.1881614374  
0.1864834829  
0.1848377878  
0.1832237165  
0.1816200209  
0.1800526384  
0.1785088474  
0.1770038015  
0.1755058117  
0.1740251941  
0.1725782585  
0.1711508008  
0.169746053  
0.1683607143  
0.1670018457  
0.165653148  
0.1643425388  
0.1630338582  
0.1617443989  
0.1604817832  
0.1592471237  
0.1580199549  
0.1568078115  
0.1556220516  
0.1544480738  
0.1532873317  
0.1521516827  
0.1510290568  
0.1499219501  
0.1488428179  
0.1477706991  
0.1467046848  
0.1456689862  
0.1446447904  
0.1436275018  
0.142633916  
0.1416580289  
0.1406871767  
0.1397375173  
0.1387984151  
0.1378723099  
0.1369575877  
0.1360603551  
0.1351697911  
0.1342934014  
0.1334383127  
0.1325991676  
0.1317614142  
0.1309318107  
0.1301234854  
0.1293189407  
0.1285205877  
0.1277501469  
0.1269816601  
0.1262280725  
0.1254899752  
0.1247471023  
0.1240274674  
0.1233099473  
0.1226117059  
0.1219172175  
0.1212342469  
0.1205573656  
0.1198987637  
0.1192468409  
0.1185981389  
0.1179597829  
0.1173295635  
0.1167137096  
0.1161115498  
0.1155183974  
0.1149158837  
0.1143321449  
0.1137536923  
0.1131900624  
0.1126349413  
0.1120905869  
0.1115444373  
0.1110100712  
0.110484732  
0.1099616233  
0.1094453553  
0.1089448421  
0.1084523658  
0.1079608461  
0.1074861368  
0.1070014882  
0.1065438893  
0.106081784  
0.1056215343  
0.1051764176  
0.1047372741  
0.1042970924  
0.1038736506  
0.1034541812  
0.1030374765  
0.1026322118  
0.1022290453  
0.1018314906  
0.1014431737  
0.1010608013  
0.1006848219  
0.100308069  
0.09994273579  
0.09958156013  
0.09923200043  
0.09888224825  
0.09853871478  
0.09819800224  
0.09786664956  
0.09753808544  
0.09722073775  
0.09690246639  
0.09659126165  
0.09628703758  
0.09598538776  
0.09569113143  
0.09540691951  
0.09511610492  
0.09483652372  
0.0945556568  
0.09428518853  
0.09402267495  
0.09375637274  
0.0935027565  
0.09325178284  
0.09300168785  
0.09276114833  
0.09252742304  
0.09229093051  
0.09206091962  
0.09184170039  
0.0916299008  
0.09140901754  
0.09119631619  
0.09098851297  
0.09078659749  
0.09059404469  
0.09039594572  
0.09020587117  
0.090030356  
0.08983911153  
0.08966217527  
0.08948691609  
0.08931985171  
0.08915879958  
0.08899735718  
0.08883841799  
0.08868900625  
0.08853977294  
0.08839245058  
0.08826023902  
0.08811790853  
0.08798519418  
0.08785840353  
0.08772394047  
0.08761758004  
0.0874910152  
0.08737928148  
0.08726322247  
0.08716726298  
0.08705884745  
0.08696277655  
0.08686359771  
0.08676933919  
0.08668627775  
0.08660266091  
0.08652559718  
0.08644873694  
0.08637950165  
0.08630849058  
0.0862462954  
0.08617559209  
0.0861178261  
0.08605843885  
0.08601224657  
0.08596594993  
0.08591358853  
0.08587569895  
0.08583958535  
0.0858108917  
0.08578137465  
0.08574752061  
0.08572964536  
0.0857038745  
0.08568959442  
0.08568139156  
0.08566904379  
0.08566773737  
0.08566423157  
