-0.2586862495  
-0.3958638456  
-0.5148269069  
-0.6036036263  
-0.6543844305  
-0.6645892254  
-0.6371722728  
-0.5801146691  
-0.5051883896  
-0.4261976381  
-0.3569559661  
-0.3093237059  
-0.2915887244  
-0.3074188994  
-0.3555291442  
-0.4300763432  
-0.5216921791  
-0.6189784171  
-0.7102128545  
-0.7850063807  
-0.8356695727  
-0.8580974314  
-0.8520697247  
-0.8209549611  
-0.7708967356  
-0.7096383707  
-0.6451930936  
-0.5845728635  
-0.5327755005  
-0.4921798347  
-0.4624117547  
-0.4406789601  
-0.4224820859  
-0.4025599715  
-0.3758913893  
-0.3385816656  
-0.2884936385  
-0.2255336515  
-0.1515717665  
-0.07004288192  
0.01467597413  
0.09798774044  
0.1757570202  
0.2448378773  
0.3033711331  
0.3508185319  
0.3877601649  
0.4155121594  
0.4356675441  
0.4496549055  
0.4584106624  
0.4622297045  
0.4608208555  
0.4535521053  
0.4398314938  
0.419539007  
0.3934150087  
0.3633084115  
0.3322187835  
0.3040896656  
0.2833671461  
0.2743673957  
0.2805530329  
0.3038221135  
0.3439467896  
0.3982524381  
0.4616307621  
0.5269071514  
0.5855377129  
0.6285625643  
0.6476896805  
0.6363695936  
0.5907055191  
0.5100765163  
0.3973761138  
0.2588357577  
0.1034488594  
-0.05793468959  
-0.2137214367  
-0.3527653739  
-0.4654857183  
-0.5447901697  
-0.5866983785  
-0.5906090538  
-0.5591991095  
-0.4979803744  
-0.4145817055  
-0.3178502411  
-0.2168808994  
-0.1200762105  
-0.03434783565  
0.0354679092  
0.08693086996  
0.1200270191  
0.1369267462  
0.1415135594  
0.1387517624  
0.1339730762  
0.1321771187  
0.1374185389  
0.1523530293  
0.1779800839  
0.2135995162  
0.2569648672  
0.3046013456  
0.3522359608  
0.3952826814  
0.4293290057  
0.4505749636  
0.4561917479  
0.4445806671  
0.4155187305  
0.3701891134  
0.3110997321  
0.2418972036  
0.1670835142  
0.09165687819  
0.02069365567  
-0.04109224855  
-0.0897764455  
-0.1225931466  
-0.1381999252  
-0.1368034811  
-0.1201174829  
-0.09115112481  
-0.05384043476  
-0.01256695797  
0.02837865401  
0.06531838658  
0.09561833045  
0.1179712839  
0.1324884754  
0.1405803666  
0.1446498912  
0.1476394756  
0.1524982345  
0.1616510823  
0.1765485711  
0.1973625188  
0.2228787037  
0.250592791  
0.2770022887  
0.2980437398  
0.3096167606  
0.3081095514  
0.2908624894  
0.256498578  
0.205085217  
0.1381180086  
0.05833269246  
-0.03060624853  
-0.1244952706  
-0.2189951806  
-0.3099987219  
-0.3939155993  
-0.4678586374  
-0.5297244872  
-0.5781850657  
-0.6126128059  
-0.6329751166  
-0.6397217441  
-0.6336901164  
-0.6160356389  
-0.5881882148  
-0.5518283206  
-0.5088694601  
-0.4614373333  
-0.4118421996  
-0.3625462613  
-0.3161331693  
-0.2752894786  
-0.2427997713  
-0.221553405  
-0.2145336108  
-0.2247603213  
-0.2551370717  
-0.308160021  
-0.3854712317  
-0.4872620327  
-0.6115918003  
-0.7537286588  
-0.9056662979  
-1.055985985  
-1.190218912  
-1.291808024  
-1.343675526  
-1.330285695  
-1.239977804  
-1.06723483  
-0.8145078361  
-0.4932251305  
-0.1236865325  
0.2662982337  
0.6439948284  
0.9753020883  
1.228856109  
1.38013071  
1.414927542  
1.331719955  
1.142430888  
0.871466593  
0.553052159  
0.2271860723  
-0.06527209709  
-0.287729233  
-0.4124986333  
-0.4243240405  
-0.3222962064  
-0.1198997812  
0.1568136075  
0.4726736224  
0.7879884076  
1.063659594  
1.266130159  
1.371510034  
1.36834865  
1.25872052  
1.057526741  
0.7901518324  
0.4888486192  
0.1883683133  
-0.07854386743  
-0.2851699913  
-0.413826436  
-0.4574783553  
-0.4197978846  
-0.3137255709  
-0.1588260661  
0.0221093071  
0.2066440936  
0.3758922895  
0.5168303536  
0.6233893951  
0.6962118237  
0.7411863804  
0.7670928135  
0.7828437311  
0.7948817781  
0.8052508843  
0.8107445583  
0.8033185036  
0.7717150742  
0.7040073811  
0.590578884  
0.4269542611  
0.2159027356  
-0.03165034028  
-0.297155686  
-0.5564067995  
-0.782673107  
-0.9504975637  
-1.039534744  
-1.037781575  
-0.9436434549  
-0.7664848778  
-0.5255550049  
-0.2474656775  
0.03737419632  
0.2987970821  
0.5107579889  
0.6544757737  
0.7203945448  
0.7087364164  
0.6286523364  
0.4961947565  
0.3315053909  
0.1557057518  
-0.01201681533  
-0.1567142125  
-0.2690908121  
-0.3459108883  
-0.3894581738  
-0.4062499613  
-0.4053039048  
-0.3962891691  
-0.387877098  
-0.3865322872  
-0.3958749977  
-0.4166443485  
-0.4471683821  
-0.4841805574  
-0.5237733461  
-0.5622816338  
-0.5969212442  
-0.6260844122  
-0.6492586012  
-0.6666293014  
-0.6784817498  
-0.6845599541  
-0.6835495478  
-0.6728201776  
-0.6485194119  
-0.606035608  
-0.5407741252  
-0.4491310659  
-0.329494892  
-0.1830954014  
-0.01452875827  
0.1681620644  
0.3539203701  
0.5295915803  
0.6812266526  
0.7956044745  
0.8617617256  
0.8723106399  
0.8243510528  
0.7198425962  
0.5653824895  
0.3714285625  
0.1510928828  
-0.08130946902  
-0.3117395979  
-0.5277347361  
-0.7193653384  
-0.8797514695  
-1.005129567  
-1.094518459  
-1.14911102  
-1.171528145  
-1.165088274  
-1.133204546  
-1.078989407  
-1.005087213  
-0.9137095344  
-0.8068153541  
-0.6863545748  
-0.5545048484  
-0.4138356561  
-0.267378432  
-0.1185899247  
0.0287649522  
0.1707773201  
0.3035831207  
0.4235404624  
0.5274066736  
0.6125122747  
0.676957917  
0.7198424679  
0.7415219015  
0.7438657992  
0.7304615139  
0.7066782597  
0.679520264  
0.6571932705  
0.6483632982  
0.6611298909  
0.7018069718  
0.7736621404  
0.8758100541  
1.002470587  
1.14278609  
1.281337113  
1.399410087  
1.476959668  
1.495107217  
1.438892272  
1.299940841  
1.078663083  
0.7856136281  
0.4417159337  
0.07717077936  
-0.2709758726  
-0.5624506865  
-0.7582219365  
-0.8253292067  
-0.7414823314  
-0.4988039288  
-0.1061411511  
0.4104842058  
1.009496719  
1.637405549  
2.234111355  
2.739278989  
3.098991974  
3.271825693  
3.233526126  
2.979660506  
2.52587307  
1.905728113  
1.166442293  
0.3631248759  
-0.4476783175  
-1.214241997  
-1.894890505  
-2.461534253  
-2.901113429  
-3.214862666  
-3.415634353  
-3.523786522  
-3.56235616  
-3.552311999  
-3.508674479  
-3.438124157  
-3.338497394  
-3.200242215  
-3.00959416  
-2.752918244  
-2.421450593  
-2.015548347  
-1.547605699  
-1.04295764  
-0.5384035462  
-0.0783681576  
0.2908707469  
0.5280909919  
0.6041173179  
0.5077532496  
0.2495958724  
-0.1370409772  
-0.5984600918  
-1.066039362  
-1.464210348  
-1.719914871  
-1.772277789  
-1.581134382  
-1.133195815  
-0.4449480145  
0.4381759269  
1.446297656  
2.492708498  
3.483618907  
4.328779712  
4.951613208  
5.297584642  
5.339801961  
5.081236803  
4.553403517  
3.811811219  
2.928897484  
1.985429989  
1.061501619  
0.2282205516  
-0.4589736112  
-0.9646998938  
-1.275406839  
-1.398540885  
-1.359447836  
-1.196573599  
-0.9556903229  
-0.6839162437  
-0.4242444655  
-0.2111697326  
-0.06780946848  
-0.00470689557  
-0.02027382639  
-0.1026481042  
-0.2325875373  
-0.3869276404  
-0.5421183806  
-0.6773815402  
-0.777129636  
-0.8324189003  
-0.8413484427  
-0.8084773247  
-0.7434370826  
-0.6590207083  
-0.5690614787  
-0.4864135398  
-0.4212984815  
-0.3802056897  
-0.365438722  
-0.3752972226  
-0.4048020466  
-0.4468013898  
-0.4932623551  
-0.5365446892  
-0.5704792754  
-0.5911151705  
-0.5970673594  
-0.5894499902  
-0.571444752  
-0.5475997973  
-0.5229840804  
-0.5023233587  
-0.4892474046  
-0.4857386402  
-0.4918475668  
-0.5056920763  
-0.5237222893  
-0.541192166  
-0.5527691081  
-0.5531828595  
-0.5378365353  
-0.5032982679  
-0.4476285908  
-0.37051494  
-0.2732180131  
-0.1583602174  
-0.02959909589  
0.1087543869  
0.2521183903  
0.3959758709  
0.5361301057  
0.668870006  
0.7910436211  
0.9000691724  
0.9938966376  
1.070957267  
1.130114414  
1.170625577  
1.19212811  
1.194631286  
1.178518543  
1.144551089  
1.093876995  
1.028043761  
0.9490222468  
0.8592365711  
0.7615955194  
0.6594997924  
0.5568046065  
0.4577044547  
0.36651801  
0.2873663223  
0.2237594785  
0.1781319746  
0.1513950109  
0.1425816776  
0.1486768593  
0.1646997626  
0.1840769322  
0.1993131504  
0.2028982382  
0.1883576659  
0.151300966  
0.09030778326  
0.007495916367  
-0.09135506482  
-0.1972018634  
-0.2986466408  
-0.3832867488  
-0.4393392603  
-0.4573367961  
-0.4316460769  
-0.3615841094  
-0.2519354984  
-0.1127659292  
0.04149041482  
0.1935758987  
0.3254025656  
0.4202340496  
0.4647616513  
0.4507856387  
0.3762674212  
0.2456016114  
0.06907498373  
-0.1384064178  
-0.3591313729  
-0.5746788058  
-0.7679939122  
-0.925169165  
-1.036707131  
-1.09813788  
-1.109965614  
-1.077025867  
-1.007409885  
-0.9111693456  
-0.7990109486  
-0.681169025  
-0.5665820231  
-0.4624266532  
-0.3739898848  
-0.3047948435  
-0.2568647891  
-0.2310051971  
-0.2269961021  
-0.2436473555  
-0.2787078413  
-0.3286916997  
-0.3887107064  
-0.4524300964  
-0.5122460382  
-0.5597550732  
-0.5865094955  
-0.5850052578  
-0.5497618407  
-0.4783268042  
-0.3720090774  
-0.2361745157  
-0.07999472059  
0.08437812812  
0.2431331832  
0.3824575766  
0.4902854664  
0.5578828529  
0.5810149451  
0.5605124523  
0.5021452582  
0.4158201824  
0.3142321785  
0.2111717746  
0.1197497478  
0.05079090763  
0.01161846023  
0.005373068392  
0.03092305559  
0.08333423756  
0.1547843493  
0.2357591505  
0.3163428869  
0.3874255749  
0.4416835553  
0.4742375779  
0.4829503793  
0.4683806764  
0.433443878  
0.3828618376  
0.3224915325  
0.258616388  
0.1972719581  
0.1436590274  
0.1016820642  
0.07363394707  
0.06003701771  
0.0596493849  
0.06963382157  
0.08588522722  
0.103498986  
0.1173567035  
0.1227792199  
0.1161888424  
0.09570213159  
0.06157610301  
0.01642307884  
-0.0348566665  
-0.08546097964  
-0.1273733946  
-0.1522963331  
-0.1527296124  
-0.123057455  
-0.06049805713  
0.0342347366  
0.1566671058  
0.2987725278  
0.449643364  
0.5965709107  
0.7263958711  
0.8269659787  
0.8885008681  
0.9046857409  
0.8733475589  
0.7966298125  
0.6806514976  
0.5347130931  
0.3701658946  
0.1991112091  
0.03309802369  
-0.1180026035  
-0.2468348016  
-0.3490037461  
-0.4231266345  
-0.4705137681  
-0.4945621749  
-0.4999717969  
-0.4919177425  
-0.4752813392  
-0.4540495714  
-0.4309352342  
-0.407246722  
-0.3829870955  
-0.3571409347  
-0.3280807922  
-0.2940151401  
-0.2534113431  
-0.2053298593  
-0.1496371071  
-0.08708053549  
-0.01924196441  
0.05160623401  
0.1227005826  
0.190997715  
0.253366878  
0.3067428818  
0.3482368502  
0.375218791  
0.3853989989  
0.3769321786  
0.3485698352  
0.2998585712  
0.2313708662  
0.1449265068  
0.04375227968  
-0.06748879654  
-0.1828453255  
-0.2954363399  
-0.3980171353  
-0.4837087393  
-0.5468058023  
-0.5835532896  
-0.5927633441  
-0.5761590588  
-0.5383531494  
-0.4864260156  
-0.4291198989  
-0.3757308005  
-0.3348344006  
-0.3130102139  
-0.3137560636  
-0.3367511811  
-0.3776078057  
-0.4281721058  
-0.4773735721  
-0.5125391343  
-0.5210223768  
-0.4919463138  
-0.4178339199  
-0.2959076239  
-0.1288778114  
0.07489627006  
0.3019045059  
0.5345884478  
0.7529158269  
0.9362397287  
1.065227107  
1.123656187  
1.099920053  
0.9881273141  
0.7887626518  
0.5089172723  
0.1621223516  
-0.2321630864  
-0.6493950728  
-1.061112394  
-1.436458394  
-1.744074436  
-1.954348392  
-2.041932633  
-1.988360003  
-1.784488993  
-1.432445525  
-0.9467111538  
-0.354054869  
0.307878898  
0.9933309591  
1.652347649  
2.235456215  
2.698551728  
3.007369431  
3.140944662  
3.093593476  
2.875144215  
2.509410027  
2.031137468  
1.481875867  
0.9053463701  
0.3429240217  
-0.1702073526  
-0.6078057029  
-0.9539886755  
-1.203285829  
-1.359480842  
-1.433543593  
-1.441038698  
-1.399423932  
-1.325605408  
-1.234039753  
-1.13554762  
-1.03688911  
-0.941024763  
-0.8479067599  
-0.7555863241  
-0.6614058242  
-0.5630723246  
-0.4594557263  
-0.3510239792  
-0.2398974784  
-0.1295726854  
-0.0244145481  
0.07097411218  
0.1523771522  
0.2164865836  
0.2612572847  
0.2860635038  
0.291664416  
0.2800144308  
0.2539714244  
0.2169539318  
0.1726006147  
0.1244695717  
0.07579571563  
0.02932133899  
-0.01281014106  
-0.04909614722  
-0.07866608252  
-0.101231428  
-0.1169936633  
-0.1265217884  
-0.130603414  
-0.1300788121  
-0.1256761543  
-0.1178664099  
-0.1067612442  
-0.09207615355  
-0.07317402511  
-0.0491856221  
-0.01920453312  
0.0174831535  
0.06116257916  
0.1115031543  
0.1674491619  
0.2272245782  
0.2884488992  
0.348346015  
0.4039969549  
0.4525805179  
0.4915377069  
0.5186183986  
0.5317995389  
0.5291086048  
0.5084281728  
0.4673896018  
0.4034747929  
0.3144164565  
0.1989318734  
0.05774817489  
-0.1052322221  
-0.2818445599  
-0.4589493825  
-0.618376404  
-0.7377610258  
-0.7923872929  
-0.7579776289  
-0.6141811726  
-0.3483202506  
0.04116857037  
0.5422215798  
1.128134598  
1.758440516  
2.38182656  
2.940910342  
3.378381101  
3.643737148  
3.699692321  
3.527312503  
3.129072531  
2.529315794  
1.771969758  
0.915774345  
0.02766838952  
-0.8247632452  
-1.580744386  
-2.192664777  
-2.63053032  
-2.884002401  
-2.96189125  
-2.889331519  
-2.703183668  
-2.446409153  
-2.162244271  
-1.888966864  
-1.655876748  
-1.480897146  
-1.369930087  
-1.317852286  
-1.310828325  
-1.329472108  
-1.352345882  
-1.359292292  
-1.334182572  
-1.266805457  
-1.153746686  
-0.9982715353  
-0.8093428628  
-0.5999949098  
-0.3853422956  
-0.1805192576  
0.001185447029  
0.1497700266  
0.2593961112  
0.3286382096  
0.3601326547  
0.3597324995  
0.3353410603  
0.2956243146  
0.2488056716  
0.2017257474  
0.1592801661  
0.1242846336  
0.09773562258  
0.07936171344  
0.06832217688  
0.06388544696  
0.06594038387  
0.07522971384  
0.09326893591  
0.1219721885  
0.1630747167  
0.2174896212  
0.284737468  
0.362596263  
0.4470576097  
0.5326288583  
0.6129522199  
0.681646776  
0.7332369239  
0.7640168105  
0.7726965225  
0.7607183699  
0.7321822177  
0.6933781128  
0.651987386  
0.6160692177  
0.5929696411  
0.5883136485  
0.6052149424  
0.6438148216  
0.7012045625  
0.7717382535  
0.847688225  
0.9201516523  
0.9800855902  
1.019335543  
1.031538837  
1.01278596  
0.9619824762  
0.8808758179  
0.773766891  
0.6469603412  
0.5080303125  
0.3650072834  
0.2255786985  
0.09639756248  
-0.01743583155  
-0.1126749881  
-0.1880037013  
-0.2439010018  
-0.2823375541  
-0.3063602316  
-0.3196215722  
-0.3259184978  
-0.3287925502  
-0.3312251612  
-0.3354509926  
-0.3428952906  
-0.3542199657  
-0.3694561525  
-0.3881913138  
-0.4097746811  
-0.4335060339  
-0.4587817501  
-0.4851764278  
-0.5124520863  
-0.54050147  
-0.5692337891  
-0.5984349286  
-0.6276252668  
-0.6559469114  
-0.6821105398  
-0.7044209489  
-0.7208910258  
-0.7294391953  
-0.7281579622  
-0.7156136349  
-0.6911434022  
-0.6550998201  
-0.6089977333  
-0.5555266697  
-0.4984016651  
-0.4420502183  
-0.3911481809  
-0.3500443019  
-0.3221337607  
-0.309249335  
-0.3111608925  
-0.3252570103  
-0.3464826604  
-0.3675775181  
-0.3796317516  
-0.3729365929  
-0.3380642007  
-0.2670749337  
-0.1547199954  
0.0005117552648  
0.1956576967  
0.4229818668  
0.6702079943  
0.9213153379  
1.157863197  
1.360732747  
1.512104598  
1.597449083  
1.607272982  
1.538384444  
1.394479518  
1.185941977  
0.928843034  
0.6432433914  
0.351010116  
