69.45268781  
84.19208769  
117.6225084  
204.1618136  
739.7992598  
8216.068533  
54605.88235  
21197.58283  
28438.30596  
14333.31047  
34720.81836  
16649.76827  
26031.22493  
8905.976518  
5236.246735  
2466.163073  
11913.71125  
25059.50579  
350.0198262  
14958.12679  
8527.84196  
3448.017589  
2462.385078  
12547.22268  
13873.78924  
6999.077214  
10959.10851  
9474.022062  
2177.362824  
19163.05674  
22891.82637  
936.7111596  
5087.650334  
531.6289518  
5523.214676  
573.9470276  
4784.245177  
15372.11229  
513.5661799  
4939.02345  
7875.176394  
6069.261763  
10567.07849  
848.7573565  
2782.830132  
944.0598177  
944.1269818  
524.0355168  
601.5963508  
6249.398564  
3661.425067  
1556.513372  
1618.097684  
3825.123884  
3817.626574  
2147.926059  
2201.420467  
304.1852056  
653.196503  
905.8020865  
1901.165505  
476.8460272  
378.3063973  
596.3654809  
303.6804428  
130.655335  
99.23613681  
300.6318476  
37.7925476  
27.42979798  
33.4005055  
13.07928143  
4.339319241  
6.07913108  
10.39101928  
13.48929849  
0.3991253424  
0.4333235933  
0.3163969478  
1.622997468  
1.996860265  
0.4298432635  
1.345381622  
1.090909849  
0.894394732  
0.5777147084  
0.8318449645  
0.7862443775  
0.501065874  
0.6660712648  
0.7136521405  
0.749044079  
0.6023439779  
0.5341084343  
0.5743445487  
0.5159508629  
0.516228701  
0.5844490725  
0.5586626637  
0.5218209364  
0.4928405746  
0.4885738967  
0.4827788184  
0.4622509098  
0.46905521  
0.4748502054  
0.4542363714  
0.4370386862  
0.4271862624  
0.423400971  
0.4148878425  
0.4080548598  
0.402391704  
0.3955552808  
0.3862022659  
0.3782526165  
0.3733354281  
0.3663903057  
0.3611184782  
0.3552882594  
0.3493446347  
0.3437444137  
0.3378917351  
0.3324862698  
0.3273649383  
0.3219689731  
0.3170965109  
0.3122383262  
0.3075135835  
0.3029427749  
0.2982366851  
0.2938431366  
0.2896014582  
0.2853555881  
0.2812812181  
0.2773607669  
0.2735032005  
0.2695498188  
0.2657973442  
0.2621882302  
0.2586405115  
0.2551188265  
0.2517353019  
0.248427803  
0.2451237594  
0.2419036217  
0.2387927255  
0.2357303302  
0.2327520835  
0.2298203093  
0.2269443091  
0.2241269164  
0.2213701226  
0.2186672018  
0.2160217183  
0.2134275417  
0.2108882258  
0.2083964781  
0.2059562285  
0.2035629443  
0.2012126753  
0.198907911  
0.1966407016  
0.1944279914  
0.1922451117  
0.1901192481  
0.1880261216  
0.1859599083  
0.1839472057  
0.1819672157  
0.1800245214  
0.178107032  
0.1762332963  
0.1743920678  
0.1725815289  
0.170800015  
0.1690496492  
0.1673351277  
0.1656431034  
0.1639859714  
0.1623543439  
0.1607594253  
0.1591736424  
0.1576279398  
0.1561063603  
0.1546029507  
0.1531302787  
0.1516823935  
0.1502586791  
0.148850585  
0.1474747561  
0.146116192  
0.1447757831  
0.1434643434  
0.1421801386  
0.1409002939  
0.1396492673  
0.1384164489  
0.1372042198  
0.1360060956  
0.134827437  
0.1336680866  
0.1325200799  
0.1314082143  
0.130299106  
0.1292047609  
0.1281284429  
0.1270723646  
0.1260317011  
0.1250028792  
0.123997379  
0.1229962946  
0.1220163654  
0.1210450589  
0.120092905  
0.1191430426  
0.1182232997  
0.117305009  
0.1164016335  
0.1155200867  
0.1146414405  
0.1137835203  
0.1129320596  
0.1120887052  
0.1112641597  
0.1104427801  
0.1096415483  
0.1088516496  
0.1080608767  
0.1072954555  
0.1065270483  
0.1057783272  
0.1050366236  
0.1043002764  
0.1035796668  
0.1028688602  
0.1021715521  
0.101469559  
0.1007866485  
0.1001135782  
0.09944386139  
0.09878388021  
0.09813542269  
0.0974979552  
0.09686298288  
0.09624000143  
0.09561838408  
0.0950093172  
0.09441264693  
0.09381268502  
0.09323212729  
0.09265116858  
0.09207731321  
0.09151819465  
0.09095761449  
0.09040528993  
0.08986297863  
0.0893243886  
0.08879486982  
0.08827310499  
0.08775792327  
0.08724007024  
0.08673543404  
0.08623866941  
0.08574945485  
0.08525949408  
0.084779366  
0.08430731288  
0.08383512774  
0.08337247776  
0.08291403034  
0.08245879107  
0.08201394275  
0.08157411147  
0.0811347915  
0.0806990907  
0.08027395987  
0.07985451013  
0.07943842932  
0.07902357049  
0.07862221834  
0.07821537826  
0.0778167178  
0.07742432027  
0.07703864607  
0.076655878  
0.07627488629  
0.07590027238  
0.075530403  
0.075165227  
0.07480264525  
0.0744383343  
0.07408962483  
0.07373596607  
0.0733886362  
0.07305023251  
0.07270774418  
0.07237786311  
0.07204668247  
0.07171891007  
0.07139064961  
0.07107448138  
0.07075707318  
0.07044641801  
0.07013489095  
0.06982711929  
0.06952625125  
0.06922846529  
0.06893371723  
0.06864385525  
0.06835194638  
0.06806368425  
0.06778195602  
0.06750291248  
0.06722799904  
0.06695405378  
0.0666767611  
0.06641471281  
0.06615200716  
0.06588965198  
0.06562926064  
0.06537533588  
0.06512107583  
0.06486831035  
0.06462016333  
0.06437796886  
0.06413747381  
0.06389737117  
0.06365969031  
0.06342812663  
0.06319078417  
0.06296308754  
0.06273772254  
0.06250859696  
0.06229391876  
0.06207521296  
0.06185863501  
0.06164370769  
0.06143536588  
0.06122360528  
0.0610138994  
0.06081021862  
0.06060696357  
0.060402669  
0.06020703641  
0.06001111779  
0.05981893701  
0.05962657135  
0.05943461768  
0.05924680575  
0.05906179569  
0.05888004511  
0.05869830755  
0.05851439165  
0.05834175834  
0.05816725884  
0.05799022239  
0.0578232968  
0.05765194622  
0.05748215955  
0.05731942019  
0.0571548125  
0.05699336621  
0.05683283148  
0.05667093182  
0.05651878439  
0.05636287512  
0.05620989282  
0.05605643693  
0.05590871769  
0.05576252643  
0.05561521068  
0.05546815663  
0.05532712502  
0.05518887278  
0.05504825434  
0.05490804431  
0.05477335979  
0.05463869984  
0.05450935032  
0.05437635192  
0.05424632313  
0.05411820752  
0.05399187341  
0.05386836925  
0.05374540556  
0.053619344  
0.05349950113  
0.05338032307  
0.05326591583  
0.05314728285  
0.05303334894  
0.05292063652  
0.05280804407  
0.0526983491  
0.05258802125  
0.05248289639  
0.05237533681  
0.05227139042  
0.05216477893  
0.05206472801  
0.05196779466  
0.05186966073  
0.05176987026  
0.05167097603  
0.0515783144  
0.05148271775  
0.05138729399  
0.05129609871  
0.05120779105  
0.05111871109  
0.05103241503  
0.05094650247  
0.05085922738  
0.05077559423  
0.05069775266  
0.05061531768  
0.05053043449  
0.05045366551  
0.05037477787  
0.05029927753  
0.05022385034  
0.05014944217  
0.05007855626  
0.05000531714  
0.04993450313  
0.04986471306  
0.04979723335  
0.04972895495  
0.04966670254  
0.04959972071  
0.04953459298  
0.0494732933  
0.04941266168  
0.04935381457  
0.04929506102  
0.04923410669  
0.04917661751  
0.04912033766  
0.04906582246  
0.04901311671  
0.04895720809  
0.04890870028  
0.04885748024  
0.04880806839  
0.04875618684  
0.04871038998  
0.04866487285  
0.04861980333  
0.04857579086  
0.04853215635  
0.04849134466  
0.04845135731  
0.0484077676  
0.04837186612  
0.0483328482  
0.04829663235  
0.04826273112  
0.04822396227  
0.048190694  
0.04816063461  
0.04812765416  
0.04809737037  
0.04806374483  
0.04803627077  
0.04801234603  
0.04798368708  
0.04795394655  
0.04793543878  
0.04790869095  
0.047884865  
0.04786238174  
0.04784209581  
0.04782416283  
0.04780224646  
0.04778343079  
0.04776882698  
0.04775275414  
0.04773746616  
0.04772160718  
0.04771037186  
0.04769662549  
0.04768604198  
0.0476793241  
0.04766820364  
0.04765870975  
0.04765359063  
0.04764622499  
0.04763843873  
0.04763755672  
0.04763004029  
0.04762867565  
0.04763004142  
0.04762497631  
