43.85001506  
53.52341173  
74.19813739  
123.4829006  
222.9822251  
11759.63393  
4405.899558  
85839.26405  
39289.8469  
46079.95427  
16022.20745  
14473.87431  
1031.327186  
21283.77143  
14504.4183  
4986.603895  
13195.48084  
4160.614368  
30254.45955  
16939.68061  
7260.733408  
635.1595459  
1339.161799  
18952.13157  
10651.57602  
6027.204453  
9286.528951  
7590.046549  
1677.301659  
26973.15895  
323.7471758  
10175.13767  
7173.295693  
5947.091833  
2581.732764  
7140.206981  
158.5292472  
646.6027339  
100.6081506  
506.9306133  
903.5930982  
999.4582863  
128.028649  
546.9670987  
2023.023251  
3302.97563  
3480.949372  
2632.803941  
957.4386934  
5646.460791  
3167.594819  
2686.475431  
868.1122355  
550.1147794  
1879.046939  
89.79241081  
763.0477514  
546.2038137  
2159.207058  
1466.659102  
198.1860502  
647.4509051  
626.646115  
518.8671608  
410.7577711  
56.61061598  
16.3130011  
153.6158051  
91.38750228  
25.1745308  
27.54807309  
40.21495673  
20.07979639  
3.526064498  
0.8974412864  
3.855354722  
2.430050522  
4.370465488  
0.8109098514  
1.554456485  
2.748529009  
0.6353494792  
1.885570395  
0.7980052136  
0.690597706  
0.3985373715  
0.6236952137  
0.6786081304  
0.3906460135  
0.3740872213  
0.3566938096  
0.3771816711  
0.4186983511  
0.341474471  
0.3421714354  
0.3120828329  
0.3251151296  
0.3043936454  
0.2991948662  
0.2894001583  
0.2820637439  
0.2637327013  
0.2607005925  
0.2599816352  
0.2470819073  
0.2368963932  
0.2353608332  
0.2302416073  
0.2268828396  
0.2206111711  
0.2142890546  
0.2115036222  
0.2085528442  
0.2044009017  
0.1993699483  
0.1970526148  
0.1932325151  
0.1897090156  
0.1872100666  
0.1838414744  
0.1810865224  
0.1783862729  
0.1754106257  
0.1726337117  
0.1702624053  
0.1677236878  
0.1652608362  
0.1628430736  
0.1604717889  
0.158292236  
0.156048701  
0.1539251512  
0.1517816124  
0.1497844753  
0.1477856542  
0.1457926513  
0.1439291296  
0.1420881815  
0.140244956  
0.1384641385  
0.1367247839  
0.1350476291  
0.1333722113  
0.1317414638  
0.1301487626  
0.1285834688  
0.1270566617  
0.1255658663  
0.1240854073  
0.1226514949  
0.1212413485  
0.1198584093  
0.1184965789  
0.1171685979  
0.115865893  
0.114578805  
0.1133215562  
0.1120872875  
0.1108740553  
0.1096862535  
0.1085187006  
0.1073677634  
0.1062394226  
0.1051331016  
0.1040450573  
0.1029752334  
0.101926484  
0.1008915971  
0.09987626647  
0.09887762718  
0.09789960272  
0.09693436005  
0.09598772215  
0.09505079143  
0.09413329918  
0.09323161566  
0.09234492878  
0.09146884768  
0.09060571721  
0.08976394303  
0.0889320415  
0.08811319277  
0.08730663311  
0.08651080537  
0.08573050574  
0.08496424057  
0.08420372465  
0.08345585226  
0.08272515097  
0.08200045299  
0.081287772  
0.08058649112  
0.07989506075  
0.07921444136  
0.0785427982  
0.07788465921  
0.07723330422  
0.07658833883  
0.07595721345  
0.07533658023  
0.07471949125  
0.07411446215  
0.07351754645  
0.07293123124  
0.0723540164  
0.07178220623  
0.07121610153  
0.07066118452  
0.07011568939  
0.06957385775  
0.06904146936  
0.06851557806  
0.06799899984  
0.06748682401  
0.0669821544  
0.06648617052  
0.06599510501  
0.06551370296  
0.06503535022  
0.06456436069  
0.06410009128  
0.06364250564  
0.06319087112  
0.06274377604  
0.0623035226  
0.06187012434  
0.06143736292  
0.06101372793  
0.06059552094  
0.06018342073  
0.05977754877  
0.05937278956  
0.05897653493  
0.0585845699  
0.05819723682  
0.05781815023  
0.05743966527  
0.05706543932  
0.05670174201  
0.05633501705  
0.05597737298  
0.05562346867  
0.05527613682  
0.05492659114  
0.05458590584  
0.05424873952  
0.05391498245  
0.05358743151  
0.05326385434  
0.05294105232  
0.05262575752  
0.05231329977  
0.0520033833  
0.05169750813  
0.05139528537  
0.05109626845  
0.0508030356  
0.05051266121  
0.05022305453  
0.04994014908  
0.04965643372  
0.0493796007  
0.04910583792  
0.04883390106  
0.04856799906  
0.04830384979  
0.04803918457  
0.04778155531  
0.047523472  
0.0472703297  
0.04702424719  
0.04677548216  
0.04652809254  
0.04628741806  
0.04604861937  
0.04581382066  
0.04558073923  
0.04534922088  
0.04512073049  
0.04489597611  
0.0446741083  
0.04445303515  
0.04423576171  
0.04401528747  
0.04380392854  
0.0435943704  
0.04338768109  
0.043181469  
0.04297739988  
0.04277530005  
0.04257551272  
0.04238032671  
0.04218434413  
0.04198986831  
0.04179870098  
0.04161014622  
0.04142527072  
0.04124105281  
0.04106022637  
0.04087987841  
0.04069934705  
0.04052444272  
0.04034684318  
0.04017441855  
0.04000577593  
0.03983613043  
0.03967006971  
0.03950522272  
0.03934200501  
0.03918146739  
0.03901883954  
0.03886130065  
0.03870244544  
0.03855191649  
0.03839691673  
0.03824540684  
0.03809529655  
0.03794689681  
0.03779882166  
0.03765594698  
0.03751166242  
0.03737160102  
0.03722911181  
0.03709201325  
0.03695389599  
0.03681905802  
0.03668421383  
0.03655271607  
0.0364190588  
0.03628997586  
0.03616212379  
0.03603354464  
0.03590658191  
0.03578115329  
0.03565905677  
0.03553647221  
0.03541647413  
0.03529899013  
0.03517789898  
0.03506401877  
0.03494746453  
0.03483396492  
0.03472088857  
0.03460992563  
0.03449764412  
0.03438836028  
0.03428028345  
0.03417376736  
0.0340685454  
0.03396259252  
0.03386027293  
0.03375724802  
0.03365712679  
0.0335560028  
0.03345796019  
0.03335841599  
0.03326270039  
0.03316595463  
0.0330727287  
0.03297653802  
0.03288538186  
0.03279533775  
0.03270502982  
0.03261202069  
0.03252601624  
0.03243926357  
0.03235217268  
0.03226685999  
0.03218161889  
0.03209734546  
0.03201575151  
0.03193518296  
0.03185398074  
0.0317733432  
0.03169461443  
0.03161606657  
0.03153979847  
0.03146312333  
0.03138724401  
0.03131320323  
0.03124062442  
0.03116705943  
0.03109576724  
0.03102469637  
0.03095410697  
0.0308846911  
0.03081738744  
0.03074868765  
0.03068172862  
0.03061661568  
0.03055150618  
0.030488172  
0.03042345283  
0.03036132122  
0.03030065545  
0.03023738704  
0.03017842817  
0.03011928036  
0.03005836595  
0.03000198808  
0.02994441198  
0.02988796395  
0.02983122156  
0.02977691512  
0.02972256381  
0.02967022469  
0.02961715043  
0.02956456957  
0.02951328149  
0.02946287274  
0.02941427489  
0.02936579721  
0.0293157599  
0.02926774089  
0.02922091406  
0.0291748816  
0.02912847531  
0.0290836306  
0.02903818156  
0.02899488829  
0.02895130976  
0.02890835626  
0.02886850884  
0.02882810999  
0.0287861868  
0.02874775402  
0.02870805465  
0.02866936765  
0.02863174351  
0.02859473398  
0.02855636536  
0.02852132564  
0.0284868086  
0.02845214723  
0.02841734306  
0.0283847661  
0.02835254825  
0.02831923711  
0.02828785442  
0.02825685105  
0.02822657776  
0.02819778349  
0.02816986592  
0.02814102613  
0.02811210008  
0.0280865457  
0.02805907154  
0.02803307993  
0.02800728059  
0.02798366985  
0.02795710973  
0.0279339513  
0.02791220813  
0.02788867814  
0.02786719874  
0.02784424769  
0.02782597882  
0.02780480787  
0.02778496275  
0.02776589449  
0.02774716558  
0.02772825213  
0.02771268872  
0.02769496568  
0.02767787297  
0.0276628093  
0.02764792658  
0.02763253323  
0.02761933399  
0.02760534092  
0.02759212601  
0.02757946559  
0.02756939951  
0.02755644671  
0.02754693713  
0.02753798779  
0.02752552105  
0.02752015641  
0.02750902353  
0.02749984128  
0.02749453539  
0.02748812556  
0.02748156812  
0.02747486531  
0.02747102947  
0.02746672482  
0.02746192567  
0.02745817722  
0.02745489978  
0.0274514412  
0.02745029499  
0.02744854244  
0.02745002763  
0.02745129863  
