-0.5181040986  
0.4601314154  
1.379052567  
2.168401289  
2.770002289  
3.143519182  
3.27034531  
3.155218145  
2.825391109  
2.327459559  
1.722208559  
1.078052738  
0.4638072126  
-0.05839699493  
-0.4392811956  
-0.6469961443  
-0.669644239  
-0.515529606  
-0.2111875428  
0.2024886168  
0.6754933686  
1.154653564  
1.589541595  
1.937655388  
2.168308856  
2.264838218  
2.22500203  
2.059676618  
1.790168988  
1.444654237  
1.054305557  
0.6496812169  
0.2578470694  
-0.09948343523  
-0.4066837151  
-0.6539470582  
-0.8362986068  
-0.9522624683  
-1.002583256  
-0.9893258079  
-0.9155477734  
-0.7855559752  
-0.6056149591  
-0.3848223272  
-0.1358175189  
0.1249976678  
0.3779591189  
0.6014465486  
0.7739046131  
0.8763366171  
0.8948805306  
0.8230652992  
0.6633292635  
0.4275090287  
0.1361545253  
-0.1832925843  
-0.4992372267  
-0.7792478817  
-0.9935209522  
-1.11805608  
-1.137181532  
-1.045150309  
-0.846680371  
-0.5564254292  
-0.1975074684  
0.2006985349  
0.6052724275  
0.9826794111  
1.301654789  
1.535809096  
1.665754441  
1.680579545  
1.578584018  
1.367206669  
1.062171709  
0.6859337145  
0.2655773537  
-0.1696239776  
-0.5907378431  
-0.9715376867  
-1.290467244  
-1.532024107  
-1.687457925  
-1.754772652  
-1.738099818  
-1.646601508  
-1.4930904  
-1.29258482  
-1.060986441  
-0.8140206738  
-0.5665124514  
-0.3319731575  
-0.1224299482  
0.05165621942  
0.1815171304  
0.2603897628  
0.2840562233  
0.2515876754  
0.1661678473  
0.03576709163  
-0.1265668646  
-0.3030427029  
-0.4722434617  
-0.6110408003  
-0.6971779647  
-0.7122129454  
-0.6444090472  
-0.4910772754  
-0.2599377516  
0.03085654839  
0.354167705  
0.6767248638  
0.9630633885  
1.180041537  
1.301314366  
1.311109347  
1.206718071  
0.9993151109  
0.7129154516  
0.3815633373  
0.04511032061  
-0.2558774867  
-0.4853950001  
-0.6167381796  
-0.6360631087  
-0.5442498204  
-0.3568018114  
-0.1017459238  
0.1842103473  
0.4608028513  
0.6899132396  
0.8410934417  
0.8960983993  
0.8517287905  
0.7204851236  
0.5288085873  
0.3130503803  
0.1136579377  
-0.03161152091  
-0.09442146547  
-0.06142434021  
0.06232572778  
0.252847045  
0.4698960016  
0.6626246189  
0.7775221414  
0.7675079614  
0.6007559084  
0.2677834927  
-0.2144737978  
-0.8025021875  
-1.430253606  
-2.01705341  
-2.478369957  
-2.737951271  
-2.739523765  
-2.456249987  
-1.896406046  
-1.104268372  
-0.1559074802  
0.8496570253  
1.80277101  
2.597241518  
3.144217978  
3.383900561  
3.293407068  
2.889675956  
2.226991619  
1.389476183  
0.4796015994  
-0.3956657815  
-1.139138012  
-1.676101733  
-1.963660312  
-1.995424627  
-1.800942155  
-1.439991743  
-0.9926343765  
-0.5465278371  
-0.1834036668  
0.03326675132  
0.06759053565  
-0.08382515941  
-0.3920236609  
-0.8008651391  
-1.236342396  
-1.618571595  
-1.874586518  
-1.949935275  
-1.817307915  
-1.480879852  
-0.9757506563  
-0.3626102854  
0.2814749785  
0.874690696  
1.342700072  
1.629569381  
1.705751387  
1.57196861  
1.258475712  
0.8199273352  
0.3267276056  
-0.145736187  
-0.5282942067  
-0.7679118969  
-0.8348786749  
-0.7262442414  
-0.4651157434  
-0.09605774385  
0.3225745307  
0.7280886883  
1.063177367  
1.284424897  
1.368317428  
1.313941687  
1.14206929  
0.8909150896  
0.6093430079  
0.3486788025  
0.1544429396  
0.059283755  
0.0781705115  
0.2064962919  
0.4212743449  
0.6851482759  
0.9524810486  
1.176540766  
1.316638298  
1.34415588  
1.246595484  
1.029118924  
0.7134421711  
0.334349381  
-0.06557698665  
-0.4421763313  
-0.7559370822  
-0.9773385501  
-1.090565498  
-1.095119874  
-1.005169663  
-0.8467960425  
-0.6535957415  
-0.4613165678  
-0.3023292983  
-0.2007434057  
-0.1688923407  
-0.205692937  
-0.2971316028  
-0.4187897049  
-0.5400500438  
-0.6293087461  
-0.6594049021  
-0.612388412  
-0.4828591038  
-0.2793131131  
-0.02325485744  
0.2538111621  
0.5150543381  
0.7239072365  
0.8497121238  
0.8725030555  
0.7861914014  
0.5996493714  
0.3355380967  
0.02707242596  
-0.2867691155  
-0.5668402638  
-0.7793966273  
-0.9007957572  
-0.9206532446  
-0.8430205793  
-0.6854447388  
-0.4760853865  
-0.2493570405  
-0.04073653078  
0.1184812406  
0.2057316402  
0.2103882425  
0.135190399  
-0.004288945806  
-0.1820287989  
-0.3654438682  
-0.5201851478  
-0.6151782724  
-0.6271859229  
-0.5442580371  
-0.3676058376  
-0.1116684066  
0.1976243241  
0.5261213461  
0.8357870929  
1.089525593  
1.255834696  
1.312711669  
1.250323676  
1.072139126  
0.794432551  
0.4442666501  
0.05624996411  
-0.3315045887  
-0.6817035296  
-0.9619714355  
-1.148240099  
-1.227081405  
-1.196739632  
-1.066822043  
-0.856718096  
-0.5929999308  
-0.3061286087  
-0.02687760001  
0.217119449  
0.4043033082  
0.5212930208  
0.5639460745  
0.537277252  
0.4542799235  
0.3338172354  
0.1978680011  
0.06847635692  
-0.03517474936  
-0.09919342748  
-0.1165776589  
-0.08777420751  
-0.02014240526  
0.07358105986  
0.1775563959  
0.2754806982  
0.3531667908  
0.400641773  
0.4134368002  
0.392879029  
0.345372801  
0.2808366501  
0.2106092129  
0.1452298056  
0.09250247239  
0.05620721675  
0.03566426877  
0.0262119325  
0.02046517183  
0.01007459348  
-0.01237833808  
-0.05173485672  
-0.1091847785  
-0.1819552293  
-0.2637948603  
-0.346119623  
-0.4195755234  
-0.4756696628  
-0.5081750287  
-0.514030088  
-0.493618258  
-0.4504175557  
-0.3901522466  
-0.3196543476  
-0.2456968142  
-0.1740076374  
-0.1086540114  
-0.05185276026  
-0.004196464466  
0.03481245057  
0.06607687903  
0.09023746352  
0.1071908034  
0.1158894944  
0.1144951881  
0.1008558697  
0.07323221034  
0.03115059853  
-0.02379303146  
-0.08734670319  
-0.1523897388  
-0.2092200274  
-0.2463842189  
-0.2520193083  
-0.2155787645  
-0.1297232086  
0.007903611976  
0.1933196501  
0.4155651687  
0.6569835938  
0.894525916  
1.10201785  
1.253174981  
1.325008262  
1.301156658  
1.17467456  
0.9498082212  
0.6424381729  
0.2790193784  
-0.1059336683  
-0.4735681844  
-0.7851740291  
-1.006874791  
-1.113905118  
-1.093897446  
-0.9487336421  
-0.6946673664  
-0.3606735059  
0.01479658627  
0.388279594  
0.7164259293  
0.9611623552  
1.094239197  
1.100609898  
0.9801942028  
0.7478391316  
0.4314543628  
0.06859102135  
-0.2981190535  
-0.6260815999  
-0.87778507  
-1.025151306  
-1.052685594  
-0.9590631612  
-0.7569884808  
-0.4714053376  
-0.1362735789  
0.2096373127  
0.5274414032  
0.7827324327  
0.9495309131  
1.013125674  
0.9714644582  
0.8349585398  
0.6247409242  
0.3696243492  
0.1021660332  
-0.1456313423  
-0.3464079744  
-0.4807942599  
-0.5395605356  
-0.524318266  
-0.4466913816  
-0.3261214227  
-0.1866375803  
-0.05308199382  
0.05265462228  
0.1148365267  
0.1260656425  
0.08812920507  
0.01140529937  
-0.08707125936  
-0.1865911886  
-0.2663206128  
-0.308900423  
-0.3035116506  
-0.2479423004  
-0.149313063  
-0.02333152778  
0.1078346721  
0.2187738269  
0.2846518748  
0.2850951426  
0.2075472286  
0.04961365842  
-0.1799640733  
-0.4618560863  
-0.768156382  
-1.065603473  
-1.319602855  
-1.498540589  
-1.577838724  
-1.543252888  
-1.39297639  
-1.138290586  
-0.8026238507  
-0.4191094273  
-0.0268934884  
0.3333892121  
0.6244263858  
0.8167288947  
0.8922194568  
0.8464273977  
0.6889507794  
0.4420993981  
0.1378664706  
-0.186345265  
-0.4926586233  
-0.7475854637  
-0.9261210757  
-1.014450208  
-1.010895464  
-0.9249893027  
-0.7748799531  
-0.583531507  
-0.37440483  
-0.1673474491  
0.02457367895  
0.1967783524  
0.3531341089  
0.5042021516  
0.6641289223  
0.8467542107  
1.061689992  
1.311090628  
1.58775642  
1.874938367  
2.147929655  
2.377192867  
2.532513472  
2.587468771  
2.523462451  
2.332659668  
2.019348873  
1.599546554  
1.098975375  
0.5498017603  
-0.01327783127  
-0.5569349281  
-1.052480245  
-1.478052859  
-1.81948723  
-2.069902607  
-2.2282741  
-2.297436764  
-2.282022179  
-2.186841933  
-2.016054674  
-1.773298074  
-1.462698652  
-1.090485811  
-0.6667589857  
-0.2068915905  
0.2678974239  
0.7311455927  
1.153021264  
1.503331956  
1.755254354  
1.889207026  
1.89617685  
1.779872693  
1.557197746  
1.256837456  
0.9160135853  
0.5758325275  
0.2758456096  
0.04865036733  
-0.08464236265  
-0.1173587586  
-0.0581475457  
0.07036580559  
0.2349740326  
0.3968230953  
0.5171618674  
0.5630425901  
0.5121460671  
0.3560466696  
0.1014941331  
-0.2304289019  
-0.6070683818  
-0.9884604025  
-1.332442848  
-1.599927402  
-1.759667635  
-1.791927908  
-1.690704176  
-1.464291472  
-1.134227431  
-0.7328173084  
-0.2995779755  
0.1229780914  
0.4937376951  
0.7771270417  
0.9465796486  
0.9870154857  
0.8961283765  
0.6843838292  
0.3737639795  
-0.004577783247  
-0.4135178263  
-0.8136682182  
-1.167236573  
-1.441648385  
-1.61258777  
-1.666175538  
-1.600071173  
-1.423421539  
-1.155670256  
-0.8243577564  
-0.4621535901  
-0.1034203989  
0.2193276461  
0.4787086054  
0.6551577024  
0.7387364659  
0.729881515  
0.6390233182  
0.4851325376  
0.2933605963  
0.09205660778  
-0.0905205042  
-0.2294042144  
-0.3057000161  
-0.3086352321  
-0.2366594867  
-0.09749176508  
0.09288653803  
0.3121683037  
0.5343843569  
0.7330048704  
0.8841484657  
0.9695581668  
0.979007546  
0.9118491522  
0.7774717442  
0.5945536221  
0.3890990501  
0.1914040572  
0.03224294633  
-0.0612973419  
-0.06981646396  
0.01514610022  
0.189110097  
0.4343071996  
0.7211827955  
1.011666584  
1.263890015  
1.437744106  
1.500538114  
1.431920187  
1.227306093  
0.8992405104  
0.4764048986  
0.0003369236219  
-0.4797284609  
-0.9131875657  
-1.254674943  
-1.470006511  
-1.540604512  
-1.465792745  
-1.262647277  
-0.9634624821  
-0.6112314922  
-0.2537940786  
0.06249554698  
0.2987233892  
0.4282038735  
0.4395102743  
0.3374267178  
0.1417894719  
-0.1155360242  
-0.3950652458  
-0.65486615  
-0.8558214914  
-0.9663340843  
-0.9659515438  
-0.8475484807  
-0.6178974619  
-0.2966642945  
0.08597878861  
0.4927809887  
0.8834798911  
1.219062452  
1.465788206  
1.598611221  
1.603695381  
1.479822866  
1.23858042  
0.9033221932  
0.5069890704  
0.08896098488  
-0.3087845943  
-0.6458881504  
-0.8877996286  
-1.009542832  
-0.9986408049  
-0.8568688524  
-0.6005524576  
-0.259310285  
0.1267367379  
0.5110683947  
0.8457994637  
1.08711179  
1.200486716  
1.16508846  
0.9767387778  
0.649046352  
0.212459912  
-0.2887227907  
-0.8011153839  
-1.268250378  
-1.637123164  
-1.8645025  
-1.922202454  
-1.800657797  
-1.510327174  
-1.080723778  
-0.5571603367  
0.004420599227  
0.5439169465  
1.004057569  
1.337072649  
1.510236304  
1.509597641  
1.341439648  
1.031291336  
0.6205966023  
0.1614603974  
-0.2898839177  
-0.6800637666  
-0.965129835  
-1.115865927  
-1.121160967  
-0.9890269281  
-0.7451324138  
-0.4290767496  
-0.08889473576  
0.2254421365  
0.4686606996  
0.6060603455  
0.6178518485  
0.5014006467  
0.2711263917  
-0.04386923044  
-0.4040480315  
-0.7649170959  
-1.082947958  
-1.321114789  
-1.453319254  
-1.467158455  
-1.364753106  
-1.161636742  
-0.8839715258  
-0.5645755089  
-0.2383700133  
0.06210129896  
0.3104787549  
0.4892637641  
0.5910946215  
0.6185627274  
0.5827260928  
0.5006502743  
0.3924054069  
0.2780116831  
0.1747615851  
0.09527549287  
0.04648434425  
0.02958438161  
0.0408417053  
0.07302195974  
0.1171252472  
0.1641124145  
0.2063303929  
0.2384431952  
0.2577637757  
0.2640274793  
0.258720552  
0.2441655735  
0.222594879  
0.1954171931  
0.1628398963  
0.1239210516  
0.07702310875  
0.0205656089  
-0.04609451215  
-0.1218596545  
-0.2033449545  
-0.2847289519  
-0.3580654465  
-0.414022199  
-0.4429651335  
-0.4362039549  
-0.3872348892  
-0.2927887378  
-0.1535364887  
0.02564013141  
0.235844293  
0.4647964631  
0.6978248332  
0.9191039688  
1.112999931  
1.265398904  
1.364904138  
1.403803226  
1.378738975  
1.291062327  
1.146832343  
0.9564918906  
0.7342193305  
0.4969984666  
0.2634376763  
0.05239498851  
-0.1185184895  
-0.2344608049  
-0.284770048  
-0.2641494753  
-0.1734377241  
-0.01987312984  
0.1832775729  
0.4177240826  
0.6617515653  
0.8922660074  
1.087077761  
1.22714334  
1.298509673  
1.293692168  
1.212334843  
1.061056535  
0.8525371888  
0.6039735095  
0.3351264408  
0.06623110992  
-0.1839774184  
-0.3998895019  
-0.5701546988  
-0.6882476646  
-0.7524956367  
-0.7656523693  
-0.7341559982  
-0.6672314463  
-0.5759524911  
-0.4723835037  
-0.3688235605  
-0.2771604535  
-0.2082781581  
-0.1714633528  
-0.1737598953  
-0.2192642844  
-0.3084161032  
-0.4373995715  
-0.5978181504  
-0.7768239862  
-0.9578500908  
-1.122015379  
-1.250154599  
-1.325276085  
-1.335120426  
-1.274404932  
-1.146308529  
-0.962821858  
-0.7437429966  
-0.5143118126  
-0.30173321  
-0.1310702471  
-0.02114958796  
0.0188007866  
-0.008848022836  
-0.08996009341  
-0.2004497233  
-0.3099189916  
-0.386602193  
-0.4028680166  
-0.3403666542  
-0.1939369138  
0.02645957096  
0.2961901153  
0.5788630391  
0.8313295876  
1.010072409  
1.078024917  
1.010755003  
0.8010094894  
0.4608593126  
0.02101502841  
-0.4726690018  
-0.965063867  
-1.399186518  
-1.724096426  
-1.902101538  
-1.914190405  
-1.762857113  
-1.471874672  
-1.083015353  
-0.6501954154  
-0.2318864366  
0.1170821288  
0.3531324353  
0.4498488582  
0.4013469373  
0.2226580157  
-0.05287534266  
-0.3787270887  
-0.7020399436  
-0.9711387335  
-1.142612936  
-1.186976424  
-1.092159257  
-0.8644530981  
-0.5269158584  
-0.115599467  
0.3257428664  
0.751661987  
1.120860776  
1.401125403  
1.572741257  
1.630062708  
1.581163862  
1.445757948  
1.251783242  
1.03118663  
0.8155061666  
0.6318292813  
0.4996093807  
0.428697935  
0.4187682066  
0.4601205895  
0.5357049743  
0.6240374191  
0.7026012879  
0.7512708028  
0.7553129278  
0.7075661053  
0.6095316056  
0.4712180016  
0.3097818893  
0.1471216755  
0.006773969985  
-0.0894914584  
-0.1248857651  
-0.09018404179  
0.0147113572  
0.1804511605  
0.3892432428  
0.6170576442  
0.8367334745  
1.021577783  
1.148947617  
1.203321156  
1.178430728  
1.078147824  
0.9159955056  
0.7133469095  
0.4965382328  
0.293293652  
0.1289408189  
0.02292840223  
-0.01386194181  
0.01935356495  
0.1131257174  
0.2490622186  
0.4023790984  
0.545372951  
0.6513346805  
0.6983533653  
0.6724723408  
0.569742513  
0.3968774902  
0.1704118029  
-0.08551856946  
-0.3424552306  
-0.5714949237  
-0.7472184408  
-0.8511268859  
-0.8741265364  
-0.817728128  
-0.6938324773  
-0.5231500691  
-0.3324788396  
-0.1512163784  
-0.007565799669  
0.075101794  
0.0812643386  
0.00530684258  
-0.1476336344  
-0.3621182207  
-0.6141050166  
-0.8737035329  
-1.108681093  
-1.28833798  
-1.387323074  
-1.388966671  
-1.287755953  
-1.090653478  
-0.8170852749  
-0.4975461022  
-0.1709246792  
0.1192341463  
0.3291855689  
0.4197414626  
0.3608678516  
0.1356487132  
-0.2568052091  
-0.7998631343  
-1.459530172  
-2.186369063  
-2.919119138  
-3.589783727  
-4.12979411  
-4.476667006  
-4.58050142  
-4.40955146  
-3.954192896  
-3.228675778  
-2.27033102  
-1.136160791  
0.1028657862  
1.369171748  
