0.1237620979  
-0.3563551014  
-0.8143059089  
-1.229146359  
-1.582191043  
-1.858122037  
-2.045997681  
-2.140110879  
-2.140579786  
-2.053583206  
-1.89115973  
-1.670498615  
-1.412750016  
-1.141395588  
-0.8803319597  
-0.651840587  
-0.4746834122  
-0.3625341143  
-0.3229537977  
-0.3570322919  
-0.4597260986  
-0.6208368777  
-0.8264670133  
-1.060716097  
-1.307366188  
-1.551305473  
-1.779492401  
-1.981376066  
-2.14877586  
-2.275338683  
-2.355775898  
-2.385130423  
-2.358300604  
-2.27000379  
-2.115262519  
-1.89037728  
-1.594227767  
-1.229674399  
-0.8047539451  
-0.3333949057  
0.1645701872  
0.664219902  
1.137175716  
1.553902679  
1.886439873  
2.111207414  
2.211547546  
2.179661902  
2.017678114  
1.73770344  
1.360836187  
0.9152509147  
0.4335745732  
-0.05013417314  
-0.5034536383  
-0.8983768658  
-1.213499896  
-1.435412039  
-1.55918752  
-1.587983726  
-1.531874573  
-1.406119682  
-1.229117981  
-1.020327906  
-0.7983915354  
-0.5796445129  
-0.3771475349  
-0.2002410541  
-0.05458766655  
0.05741138056  
0.135983438  
0.1832792566  
0.2027342213  
0.1985833858  
0.1755603814  
0.1387610281  
0.09360566698  
0.04581234501  
0.001297300077  
-0.03406257011  
-0.05482619258  
-0.05651089523  
-0.0361754213  
0.007047660455  
0.07158286325  
0.1533018887  
0.2457528419  
0.3407311678  
0.4291614921  
0.5021966199  
0.5523983978  
0.5748544699  
0.5680764225  
0.5345424261  
0.4808027744  
0.4170949684  
0.3564845684  
0.3135890797  
0.3030028689  
0.3375755323  
0.4267223043  
0.5749583013  
0.7808449683  
1.03650155  
1.327794522  
1.635247088  
1.935630962  
2.204112151  
2.416758268  
2.553123284  
2.598624448  
2.546391007  
2.398346224  
2.165317362  
1.866133267  
1.525752318  
1.172619918  
0.8355612619  
0.540597044  
0.3080735191  
0.1505044731  
0.07139096766  
0.06519890209  
0.1184703918  
0.2119157059  
0.323179744  
0.4298759635  
0.51246454  
0.5565757785  
0.5544628364  
0.505445004  
0.4153174934  
0.2949037676  
0.1580268897  
0.01925084595  
-0.1082216284  
-0.2142080637  
-0.2925193067  
-0.3411881369  
-0.3619921953  
-0.3594569595  
-0.3395671824  
-0.308479949  
-0.2714707948  
-0.2322900119  
-0.1930060121  
-0.1543031324  
-0.1161129922  
-0.07839426249  
-0.04186149737  
-0.008477476808  
0.01841535409  
0.0343579381  
0.03440070458  
0.01395644638  
-0.0302714669  
-0.09950236275  
-0.1923684149  
-0.3048261064  
-0.4305092078  
-0.5614939879  
-0.6893478469  
-0.8062986983  
-0.9063197191  
-0.9859542032  
-1.044730912  
-1.085109513  
-1.111976995  
-1.131765278  
-1.151369635  
-1.177045327  
-1.213458138  
-1.263050556  
-1.325796786  
-1.399364584  
-1.479611368  
-1.561291013  
-1.638823671  
-1.706962987  
-1.761247964  
-1.79816807  
-1.815061054  
-1.80980088  
-1.780414761  
-1.724765832  
-1.640442349  
-1.524943283  
-1.376183737  
-1.193261357  
-0.9773663431  
-0.7326329462  
-0.4667486099  
-0.1911173245  
0.07953560367  
0.3281724402  
0.5369986047  
0.6894085726  
0.7720762401  
0.7769015293  
0.7025232457  
0.555141609  
0.3484893748  
0.1028868098  
-0.1565340561  
-0.4022782108  
-0.6072984838  
-0.7478630991  
-0.8061147752  
-0.7720207341  
-0.6444694664  
-0.4313920609  
-0.148887965  
0.1805319983  
0.5303761832  
0.8729858295  
1.182404976  
1.436987448  
1.62143614  
1.728076277  
1.757231421  
1.716699872  
1.620416412  
1.486497067  
1.334917867  
1.185116832  
1.053820305  
0.9533395417  
0.8905341411  
0.8665344684  
0.8772409128  
0.9144757942  
0.9676127075  
1.025442046  
1.077970311  
1.117910814  
1.141630072  
1.149423834  
1.145088857  
1.134880992  
1.126036667  
1.125133266  
1.136575304  
1.161493778  
1.197262692  
1.237746449  
1.274253812  
1.297037951  
1.297075861  
1.26781889  
1.206559278  
1.115156927  
0.9999590697  
0.8708939461  
0.7398734294  
0.6187851226  
0.5174229217  
0.4417368722  
0.3927398456  
0.3662880395  
0.3538039426  
0.3438300048  
0.3241691015  
0.2842254807  
0.2171390355  
0.1213292655  
0.001150870374  
-0.133473616  
-0.2684173069  
-0.3875071398  
-0.4751287691  
-0.5188725688  
-0.5117772339  
-0.4537932291  
-0.3522284076  
-0.2210569881  
-0.07919532534  
0.05201811193  
0.1517571563  
0.2026083872  
0.1929998781  
0.1187782256  
-0.01630434409  
-0.2012673135  
-0.4196367661  
-0.6519639006  
-0.8787433049  
-1.083273928  
-1.254034733  
-1.386213251  
-1.482163965  
-1.550740471  
-1.605611607  
-1.66283005  
-1.738022405  
-1.843641211  
-1.986671085  
-2.167145635  
-2.377679843  
-2.604071568  
-2.826884966  
-3.023762503  
-3.172134062  
-3.251927526  
-3.24792017  
-3.151421375  
-2.961099148  
-2.682898115  
-2.329115971  
-1.916849997  
-1.466059887  
-0.9975438802  
-0.5311033843  
-0.08410399416  
0.3294473699  
0.6992815927  
1.018750874  
1.284361562  
1.49509329  
1.651691117  
1.756049285  
1.810796157  
1.81910496  
1.78472573  
1.712170736  
1.60696039  
1.475839578  
1.326853557  
1.169230346  
1.013020839  
0.8685088231  
0.7454389881  
0.652146852  
0.5947079341  
0.5762314549  
0.5964228592  
0.6515127782  
0.7346109247  
0.8364777333  
0.9466480107  
1.054788811  
1.152089674  
1.232501586  
1.293618692  
1.337036777  
1.368098804  
1.39501706  
1.427480973  
1.474907895  
1.544613677  
1.640177993  
1.760270035  
1.898167486  
2.042073123  
2.176241999  
2.282790601  
2.34395612  
2.344478468  
2.273769513  
2.127536078  
1.908604717  
1.626824591  
1.298040108  
0.9422817865  
0.5814360321  
0.236727391  
-0.07363066742  
-0.3362981323  
-0.5439439565  
-0.6955310432  
-0.7957705066  
-0.8538795701  
-0.8818656011  
-0.8926361686  
-0.8982101586  
-0.9082788405  
-0.9292990112  
-0.9641677288  
-1.012481353  
-1.071238971  
-1.135840775  
-1.201171408  
-1.2625913  
-1.316680069  
-1.361640965  
-1.39733601  
-1.424990622  
-1.446652395  
-1.464520395  
-1.48027786  
-1.494550403  
-1.50657781  
-1.514162417  
-1.513897224  
-1.501637102  
-1.473156534  
-1.42488249  
-1.354603603  
-1.262051055  
-1.149255882  
-1.020622038  
-0.8826841738  
-0.7435593374  
-0.6121260441  
-0.497030561  
-0.4056069037  
-0.342847669  
-0.3105578045  
-0.3068093607  
-0.3257975679  
-0.3581696116  
-0.3918300951  
-0.4131774493  
-0.4086739909  
-0.3665785808  
-0.2786397023  
-0.1415301127  
0.04220144974  
0.2638227825  
0.5088712611  
0.7583754778  
0.9907409495  
1.184112047  
1.318930253  
1.380346527  
1.360177379  
1.258109318  
1.081967167  
0.8469834898  
0.5741426361  
0.2878129183  
0.01297815774  
-0.2275523091  
-0.4155860551  
-0.5393069506  
-0.5941416894  
-0.5826446718  
-0.5134586558  
-0.3995663544  
-0.2561170993  
-0.09819979772  
0.06110467324  
0.2120969406  
0.3490917821  
0.4702648606  
0.5768224115  
0.6716966159  
0.7580738172  
0.8380591523  
0.9117454377  
0.9768814387  
1.029189524  
1.063272392  
1.073906816  
1.057474804  
1.013208064  
0.9439985321  
0.8565644111  
0.7608986283  
0.6690575277  
0.5934530413  
0.5449276659  
0.5309266416  
0.5540734215  
0.6114197002  
0.6944992552  
0.7902254965  
0.8825018607  
0.9543259757  
0.9900514805  
0.9774785525  
0.909448031  
0.7847057663  
0.60792591  
0.3889292636  
0.1412514197  
-0.1196654829  
-0.3783485501  
-0.6209217542  
-0.8362592359  
-1.016510471  
-1.157016538  
-1.255712777  
-1.312245905  
-1.327049052  
-1.300629147  
-1.2332315  
-1.124976551  
-0.9764192843  
-0.7893857338  
-0.5678705178  
-0.3187436172  
-0.05204143589  
0.2192901151  
0.4802505642  
0.7151420434  
0.9092390315  
1.050515563  
1.131139393  
1.148479894  
1.105462292  
1.010198737  
0.8749518175  
0.7145851341  
0.5447406241  
0.3800092523  
0.2323492167  
0.109957915  
0.01672021297  
-0.04772831981  
-0.08738749388  
-0.1088502825  
-0.1200152749  
-0.1287551476  
-0.1417138749  
-0.1634113256  
-0.1957360114  
-0.2378826005  
-0.286705718  
-0.3374215641  
-0.3845315066  
-0.4228234547  
-0.4483059038  
-0.4589220426  
-0.4549470146  
-0.4389978562  
-0.4156585594  
-0.3907583622  
-0.3704080827  
-0.3599344489  
-0.3628820808  
-0.3802321702  
-0.4099826995  
-0.447183739  
-0.4844550669  
-0.5129362273  
-0.52357542  
-0.5085618771  
-0.4627195195  
-0.3846313053  
-0.2773167316  
-0.1483177011  
-0.009153781403  
0.1258257833  
0.2410663522  
0.3216884445  
0.3553849279  
0.3340612832  
0.2549898584  
0.1213027909  
-0.05824192421  
-0.2701938342  
-0.4979013898  
-0.7233444882  
-0.9290428669  
-1.09977038  
-1.223844951  
-1.293833857  
-1.306622315  
-1.262891254  
-1.166149768  
-1.021527795  
-0.8345880609  
-0.6103766669  
-0.3529150362  
-0.06522176334  
0.2501227151  
0.5899746136  
0.9493972312  
1.320446027  
1.691271656  
2.045794536  
2.364129064  
2.623846081  
2.801983062  
2.877622397  
2.834690776  
2.664585119  
2.368209563  
1.957053532  
1.453061785  
0.8872090013  
0.2968791693  
-0.2776718425  
-0.7973544915  
-1.22826373  
-1.545172735  
-1.734042803  
-1.793234764  
-1.733280673  
-1.57526682  
-1.348064254  
-1.08478897  
-0.8189633378  
-0.5808512281  
-0.3944187975  
-0.2752397898  
-0.2295448082  
-0.2544278956  
-0.3391002298  
-0.4669402234  
-0.6180098047  
-0.7716827484  
-0.9090659911  
-1.014916728  
-1.078903811  
-1.096117073  
-1.066867325  
-0.9958785052  
-0.8910542367  
-0.762025535  
-0.6186921662  
-0.4699479202  
-0.3227369907  
-0.1815434358  
-0.04832896141  
0.07710436254  
0.1964126779  
0.311822267  
0.4251957445  
0.5372398574  
0.6469835892  
0.7516535812  
0.8469579051  
0.9277818089  
0.9891660424  
1.027414423  
1.041135981  
1.032002446  
1.005070926  
0.9685483613  
0.9329866422  
0.9099776816  
0.9105189609  
0.9432726845  
1.012989717  
1.119350051  
1.256415526  
1.412837675  
1.572809382  
1.717690028  
1.828097866  
1.886216826  
1.878015833  
1.79509673  
1.63593419  
1.406337786  
1.119090952  
0.7927889299  
0.4500308783  
0.1151815552  
-0.1880485649  
-0.4389138928  
-0.6215985938  
-0.726621469  
-0.7515561245  
-0.7010291979  
-0.5860176218  
-0.4225526027  
-0.2300000619  
-0.02909891453  
0.1600379438  
0.3197565055  
0.4363622235  
0.5011555856  
0.5109153084  
0.4678023422  
0.3787023224  
0.2541072853  
0.1066547929  
-0.05049258804  
-0.2052345239  
-0.3478938035  
-0.4721865324  
-0.5756808542  
-0.6596934035  
-0.7286445626  
-0.7889876645  
-0.847861677  
-0.9116727028  
-0.9848340665  
-1.068831033  
-1.161783567  
-1.258545712  
-1.351350794  
-1.430897096  
-1.487702998  
-1.513543518  
-1.502734375  
-1.45307956  
-1.366337307  
-1.248134289  
-1.107344444  
-0.9550216116  
-0.8030490811  
-0.662679261  
-0.5431936287  
-0.4508357663  
-0.3881699728  
-0.3539230399  
-0.3433155226  
-0.3488242646  
-0.3612448404  
-0.3709254676  
-0.3689919344  
-0.3484352033  
-0.3049197225  
-0.2372500292  
-0.1474364226  
-0.04039753278  
0.0766772366  
0.1951981793  
0.3061822503  
0.4012742684  
0.4736686746  
0.5188219035  
0.5348849301  
0.522812604  
0.4861333968  
0.4304450132  
0.3626786085  
0.29026718  
0.2203140248  
0.1588888278  
0.1105308696  
0.07803078835  
0.06247872695  
0.06356225471  
0.08001307716  
0.1101268453  
0.1522179187  
0.2049395934  
0.2673996309  
0.3390469895  
0.4193817055  
0.5075256848  
0.6017722548  
0.6992010353  
0.7954604086  
0.8847707145  
0.9601842189  
1.014099744  
1.03896728  
1.028130748  
0.9766996425  
0.8823456322  
0.7459255445  
0.5718345947  
0.368009418  
0.14556009  
-0.08198935274  
-0.299784875  
-0.492967965  
-0.6480941709  
-0.7544758522  
-0.8052781188  
-0.7982071357  
-0.7356876819  
-0.6244738343  
-0.4747627047  
-0.2989061268  
-0.109929118  
0.07992826159  
0.2604131264  
0.4240352906  
0.5663071478  
0.6854405708  
0.7816147054  
0.8559792587  
0.9096331769  
0.9428053972  
0.9544275646  
0.9421950885  
0.9031124549  
0.8344088063  
0.7346408929  
0.6047248994  
0.4486906977  
0.273941411  
0.09095615661  
-0.08757648623  
-0.2480716703  
-0.3776023854  
-0.4654603721  
-0.5044599917  
-0.4917850081  
-0.4292432783  
-0.3228993814  
-0.1821486656  
-0.01839821192  
0.1564199005  
0.3312722295  
0.4971518006  
0.6477366621  
0.7795098882  
0.8913575941  
0.9837465026  
1.057693835  
1.113729118  
1.151103569  
1.167411139  
1.158717832  
1.120212397  
1.047251818  
0.9366225434  
0.7877532368  
0.6036342132  
0.3912260975  
0.1612250706  
-0.07283514073  
-0.2960422773  
-0.4939163212  
-0.654301704  
-0.7690354819  
-0.8351066709  
-0.8551166347  
-0.836950662  
-0.7926863594  
-0.7369018075  
-0.6846385932  
-0.6493106741  
-0.6408681064  
-0.6644870705  
-0.7199418247  
-0.801746731  
-0.9000129221  
-1.001881385  
-1.0933087  
-1.160958253  
-1.193930494  
-1.185125763  
-1.132071399  
-1.037139811  
-0.9071596102  
-0.7524923662  
-0.5857226672  
-0.4201346851  
-0.2681708641  
-0.1400615666  
-0.04278714629  
0.02051832801  
0.05065525451  
0.05195866816  
0.03145606277  
-0.002282767528  
-0.04045464632  
-0.07531569291  
-0.10128045  
-0.1156805175  
-0.1190676101  
-0.1150251108  
-0.1094995959  
-0.1097411492  
-0.1230003134  
-0.1551723795  
-0.2095705566  
-0.2860301822  
-0.3804811479  
-0.4850632879  
-0.5887955254  
-0.6787222359  
-0.7414054842  
-0.7645643308  
-0.7386672031  
-0.6582653571  
-0.5229055362  
-0.3375023802  
-0.1121194695  
0.138819044  
0.3978124769  
0.6459080489  
0.8645269371  
1.037268347  
1.151532081  
1.199792103  
1.180381428  
1.09773025  
0.9620087805  
0.7882106903  
0.594756185  
0.4017285821  
0.2289185178  
0.09386159911  
0.01006993764  
-0.01434591685  
0.02250155366  
0.1161236118  
0.2562074515  
0.427826766  
0.6131873714  
0.7936900909  
0.9520537927  
1.074227493  
1.150841055  
1.178001515  
1.15734673  
1.095365663  
1.002110141  
0.8895052349  
0.769527229  
0.6525229003  
0.5459133662  
0.4534619776  
0.3751871288  
0.3078879684  
0.246188891  
0.1838853264  
0.1153849677  
0.03700609292  
-0.0520707114  
-0.1493358737  
-0.2490301625  
-0.3427713637  
-0.4206234743  
-0.4724676977  
-0.4894864129  
-0.4655556057  
-0.3983561994  
-0.2900507935  
-0.1474225931  
0.01855005638  
0.1936623383  
0.3618767745  
0.5069972521  
0.6144275585  
0.6728161949  
0.6753796192  
0.6207565545  
0.5132718854  
0.3625652981  
0.1826192903  
-0.009730041718  
-0.1966254223  
-0.3611665882  
-0.4893011079  
-0.5713965437  
-0.6033003376  
-0.5867498545  
-0.5290745623  
-0.4422152323  
-0.3411889252  
-0.2421896294  
-0.1605878562  
-0.1090816497  
-0.09624575294  
-0.1256653278  
-0.1957467081  
-0.3001973354  
-0.4290622639  
-0.5701398431  
-0.7105198783  
-0.838034193  
-0.9423963518  
-1.015911012  
-1.053714903  
-1.053603466  
-1.01556508  
-0.9411989466  
-0.8331801651  
-0.6949083284  
-0.530410758  
-0.3444865759  
-0.1430068556  
0.06677142845  
0.2760359598  
0.4745424077  
0.6511024165  
0.7944626562  
0.8944579621  
0.943303024  
0.9367903269  
0.8751705956  
0.7635421258  
0.6116273745  
0.4329296791  
0.2433697832  
0.05958231503  
-0.102878622  
-0.2311753533  
-0.316425146  
-0.3544014775  
-0.3456122551  
-0.294801597  
-0.2099892165  
-0.1012141716  
0.02079829006  
0.145872648  
0.2653593508  
0.3727578211  
