0.4388762716  
0.3385657114  
0.237302479  
0.131524754  
0.01787960055  
-0.1063607703  
-0.2427194986  
-0.390838385  
-0.5478314431  
-0.7078142667  
-0.8617804358  
-0.9979424897  
-1.102587675  
-1.161416621  
-1.161223896  
-1.091722911  
-0.9472560343  
-0.7281397131  
-0.4414252792  
-0.1009225581  
0.2735478738  
0.6576409644  
1.024551217  
1.34743545  
1.601923811  
1.768439701  
1.834070067  
1.793780576  
1.650847749  
1.416464503  
1.10857303  
0.7500599244  
0.3665117699  
-0.01620786391  
-0.3743008316  
-0.6880387927  
-0.9432189725  
-1.131928112  
-1.252565986  
-1.30916596  
-1.3101439  
-1.266682032  
-1.190987915  
-1.094685484  
-0.9875556854  
-0.8767839859  
-0.7667834907  
-0.6595607433  
-0.5555021754  
-0.4543886988  
-0.3564146312  
-0.2629903224  
-0.1771555788  
-0.1035159526  
-0.0476945628  
-0.01541092195  
-0.01135461935  
-0.03807836966  
-0.09513500774  
-0.1786449967  
-0.2814026862  
-0.3935419267  
-0.5036695552  
-0.6003065425  
-0.6734030423  
-0.7156963774  
-0.7236960254  
-0.6981340421  
-0.6438332699  
-0.5689965316  
-0.4840519987  
-0.4002165907  
-0.3279962432  
-0.2758311581  
-0.249061932  
-0.2493393536  
-0.2745276281  
-0.3190820466  
-0.3748288389  
-0.4320132984  
-0.4804928717  
-0.5109146559  
-0.5157722034  
-0.4902270207  
-0.4326471917  
-0.3448172858  
-0.2318221353  
-0.1016212517  
0.03565796986  
0.1686538698  
0.2858671268  
0.3768366767  
0.4333060497  
0.4502581542  
0.426706115  
0.3661309438  
0.2764686943  
0.1695931119  
0.06029978557  
-0.03515874561  
-0.1008510297  
-0.1230810344  
-0.09221512921  
-0.004182985069  
0.1385581876  
0.3267629858  
0.5449323851  
0.772624078  
0.9864338016  
1.162439867  
1.27883576  
1.318435118  
1.270755918  
1.133405612  
0.9126052067  
0.6227646165  
0.2851605626  
-0.07413114535  
-0.4268145485  
-0.7451519772  
-1.004638027  
-1.186271331  
-1.27817987  
-1.276465553  
-1.185202124  
-1.015626445  
-0.78466771  
-0.5129824024  
-0.2227461781  
0.06457696304  
0.3302547793  
0.5599169842  
0.7446525076  
0.8814950825  
0.9732816359  
1.027910907  
1.057093727  
1.074730905  
1.095075652  
1.130876094  
1.191684903  
1.282526118  
1.403074551  
1.547461677  
1.704751689  
1.860073717  
1.996305483  
2.096127604  
2.144226729  
2.129370376  
2.046088452  
1.895717045  
1.686641599  
1.433658006  
1.156491194  
0.877631925  
0.6197359288  
0.4029222  
0.242317737  
0.1461831164  
0.1148842482  
0.1408594059  
0.2096008885  
0.3015279806  
0.3944893544  
0.4665654849  
0.4987652856  
0.4772579405  
0.3948250427  
0.2513509762  
0.05331454451  
-0.1876165243  
-0.4566337269  
-0.7381411832  
-1.018024077  
-1.285472022  
-1.534069145  
-1.761990886  
-1.971303639  
-2.16650974  
-2.352630426  
-2.53317426  
-2.708399607  
-2.874201407  
-3.021873941  
-3.138840471  
-3.210274992  
-3.221374837  
-3.159926808  
-3.0187296  
-2.797453781  
-2.5035927  
-2.152293529  
-1.76504935  
-1.367408749  
-0.9860334934  
-0.6455306355  
-0.3655474051  
-0.1585465218  
-0.02859793718  
0.028674033  
0.02500393506  
-0.0225151358  
-0.0940105422  
-0.1695651754  
-0.2316887023  
-0.2671821491  
-0.2681762199  
-0.2322662801  
-0.1618358487  
-0.06277584783  
0.05711220334  
0.1897119921  
0.3279159301  
0.4664687422  
0.602240088  
0.7339470522  
0.8614435809  
0.9847757899  
1.103229716  
1.214586634  
1.314770926  
1.39798599  
1.457342541  
1.485912762  
1.478037755  
1.430683237  
1.344600326  
1.225072685  
1.082072852  
0.9297256633  
0.785076415  
0.6662657705  
0.5902979813  
0.5706811546  
0.6152547834  
0.7245200379  
0.8907532347  
1.098095606  
1.323699645  
1.539864549  
1.716965686  
1.826850439  
1.846288875  
1.760037386  
1.563091693  
1.2618057  
0.8736715543  
0.4257503253  
-0.04809296382  
-0.5108183557  
-0.926256068  
-1.263047318  
-1.497979402  
-1.618287541  
-1.622645485  
-1.520734634  
-1.331501147  
-1.080366776  
-0.7958073712  
-0.505789125  
-0.234538973  
-7.655341934e-05  
0.1872100024  
0.3248203164  
0.4172827466  
0.4743866942  
0.5088463176  
0.5337897569  
0.5604645749  
0.5965072581  
0.6449918009  
0.7043589965  
0.7691579106  
0.8314375363  
0.882484852  
0.914621672  
0.9227265629  
0.9052460394  
0.8645281294  
0.8064499731  
0.739411753  
0.6728805717  
0.6157399203  
0.5747112077  
0.5531261625  
0.5502402523  
0.5612063241  
0.577727701  
0.5892870424  
0.5847722134  
0.5542468753  
0.4905996976  
0.3908085374  
0.2566161211  
0.09450332494  
-0.08505903604  
-0.2689795355  
-0.4433441996  
-0.595373999  
-0.7152578224  
-0.7975666423  
-0.8420357387  
-0.8535831873  
-0.8415587579  
-0.8183254209  
-0.7973965323  
-0.7914027466  
-0.8102025018  
-0.8594162697  
-0.9396050764  
-1.04620209  
-1.170201664  
-1.299483104  
-1.420564783  
-1.52051392  
-1.588728415  
-1.618322683  
-1.60693131  
-1.556810545  
-1.474258713  
-1.368448112  
-1.249876382  
-1.128683007  
-1.013107451  
-0.9083365249  
-0.8159180851  
-0.7338395332  
-0.6572452719  
-0.5796771567  
-0.4946126951  
-0.3970468329  
-0.2848274622  
-0.1595150855  
-0.02658358602  
0.1050853062  
0.2243619642  
0.3195210463  
0.3801246371  
0.3988387113  
0.3728841341  
0.3048763902  
0.2028891396  
0.07970567978  
-0.0486584315  
-0.1649572209  
-0.2529649476  
-0.2996462594  
-0.2969242801  
-0.2427965694  
-0.1416357607  
-0.003626019021  
0.1565718913  
0.3217416254  
0.4743431949  
0.5987478961  
0.683185248  
0.7211447784  
0.7120800317  
0.6613459173  
0.5794130544  
0.4804894781  
0.3807407613  
0.2963435257  
0.2416022247  
0.2273285012  
0.2596547022  
0.3393716252  
0.4618410336  
0.6174580743  
0.7926073856  
0.9710065508  
1.135313758  
1.268853077  
1.357309927  
1.390241942  
1.362266543  
1.273797483  
1.131244638  
0.9466151374  
0.7365316633  
0.5207251118  
0.3201253309  
0.1547349848  
0.04150777399  
-0.007541231747  
0.01324560335  
0.1023952928  
0.2513001518  
0.445008829  
0.6637435066  
0.8849870961  
1.085889993  
1.245724825  
1.34807431  
1.382487847  
1.345405617  
1.240233849  
1.076587784  
0.8688123321  
0.6340021875  
0.3898184897  
0.152399805  
-0.06533083602  
-0.25474224  
-0.4118287199  
-0.5368062892  
-0.6330819379  
-0.7058268781  
-0.7604289298  
-0.8011266331  
-0.8300771429  
-0.84702943  
-0.8496475843  
-0.8344090551  
-0.7978795178  
-0.7380822435  
-0.6556618357  
-0.5545682691  
-0.4420639901  
-0.328004891  
-0.2234659293  
-0.1389332097  
-0.08237992706  
-0.05758180074  
-0.06301736297  
-0.09160313718  
-0.1313765949  
-0.1670931147  
-0.1825154864  
-0.1630703979  
-0.09844598641  
0.01528266956  
0.1743668517  
0.3671689429  
0.575093009  
0.7745646871  
0.9397839765  
1.04588744  
1.072067481  
1.004224463  
0.8367973189  
0.5735421209  
0.2271854837  
-0.1819617587  
-0.6282094808  
-1.083189424  
-1.518683656  
-1.909238741  
-2.234262044  
-2.47940762  
-2.637172502  
-2.706728506  
-2.693105972  
-2.605917347  
-2.457827754  
-2.262977796  
-2.035545492  
-1.788566019  
-1.533104495  
-1.277797922  
-1.028757072  
-0.7897738517  
-0.5627540406  
-0.3482984305  
-0.1463225208  
0.04335014112  
0.2205147919  
0.3842679064  
0.5328933553  
0.6639455757  
0.7745164252  
0.8616410074  
0.9227767354  
0.9562899503  
0.9618678263  
0.9407957154  
0.8960543736  
0.8322069196  
0.7551012374  
0.6714034963  
0.5880451358  
0.5116392102  
0.4479598829  
0.4015396748  
0.3754411287  
0.3712138746  
0.3890316878  
0.4279554352  
0.4862715384  
0.5618243076  
0.6522689009  
0.755213854  
0.868210092  
0.9886098342  
1.113341035  
1.238650992  
1.359908303  
1.471533114  
1.567104122  
1.639668043  
1.682245388  
1.688477451  
1.653342224  
1.573839498  
1.44955452  
1.283007631  
1.079724793  
0.8480090414  
0.5984024114  
0.3429090107  
0.09402676034  
-0.1362859819  
-0.3376172456  
-0.5019700258  
-0.6243934946  
-0.7033223762  
-0.740582577  
-0.7410680119  
-0.7121249791  
-0.6627160145  
-0.6024521388  
-0.5405982791  
-0.485162396  
-0.4421600072  
-0.4151328042  
-0.4049603102  
-0.4099811199  
-0.426391262  
-0.4488603537  
-0.4712867259  
-0.4875880976  
-0.4924340853  
-0.4818321243  
-0.4535078687  
-0.407044678  
-0.3437912382  
-0.2665669903  
-0.1792327485  
-0.08618927196  
0.008107774848  
0.0995643114  
0.1847522878  
0.2610790068  
0.3268423176  
0.381196221  
0.4240680818  
0.4560630185  
0.4783831719  
0.4927617855  
0.5013889223  
0.5068075779  
0.5117237454  
0.5187136153  
0.5298162483  
0.5460381847  
0.5668386073  
0.5896825167  
0.6097867408  
0.6201415885  
0.6119163982  
0.5752393661  
0.5003333591  
0.3788892056  
0.2054975129  
-0.02105773405  
-0.2968733283  
-0.6125366022  
-0.9534078267  
-1.300588979  
-1.632522496  
-1.927038121  
-2.163616402  
-2.325575118  
-2.401898147  
-2.38845819  
-2.288471941  
-2.112113453  
-1.875349645  
-1.598122891  
-1.302128573  
-1.008458257  
-0.7353896195  
-0.4965926735  
-0.2999363034  
-0.1470278943  
-0.03349487024  
0.05004309824  
0.1164694273  
0.1803108054  
0.2557674979  
0.3548509955  
0.4858285258  
0.6521385662  
0.851866679  
1.077810677  
1.318107547  
1.55732664  
1.777907914  
1.961789856  
2.092068946  
2.15454898  
2.139050275  
2.040380644  
1.858902748  
1.600667316  
1.27710065  
0.9042845555  
0.5018712708  
0.09171177262  
-0.3036969112  
-0.6628364858  
-0.9667294249  
-1.200309398  
-1.353482299  
-1.421768189  
-1.406482329  
-1.314417149  
-1.157082934  
-0.9495717601  
-0.7091857788  
-0.453966941  
-0.2012922991  
0.03333915309  
0.2372060652  
0.4009010796  
0.5184941733  
0.5873613493  
0.6077639304  
0.5822852953  
0.5152351668  
0.4121291901  
0.2793064716  
0.1237311991  
-0.04705041378  
-0.2248373564  
-0.4006777994  
-0.5648454949  
-0.7069850406  
-0.8164922321  
-0.883156247  
-0.8980393636  
-0.8545083783  
-0.7492828481  
-0.5833418206  
-0.3625133935  
-0.09759713401  
0.196077295  
0.4996872413  
0.7924784902  
1.053719299  
1.264811657  
1.411312829  
1.484576424  
1.482794475  
1.411262139  
1.281794559  
1.111353079  
0.9200299297  
0.7286446752  
0.556254243  
0.4179071183  
0.3229314309  
0.2739688174  
0.2668919563  
0.291587877  
0.3335044635  
0.3757384891  
0.401374322  
0.3957702763  
0.348476844  
0.2545531442  
0.1151191291  
-0.06289954635  
-0.2677735915  
-0.4845497165  
-0.6969738582  
-0.8894782586  
-1.048963396  
-1.166149045  
-1.23633428  
-1.259508072  
-1.239841944  
-1.184689706  
-1.103264816  
-1.005223741  
-0.8993605402  
-0.7925893452  
-0.6893493657  
-0.5914701121  
-0.4984835027  
-0.4082875884  
-0.3180296924  
-0.2250444383  
-0.1276881942  
-0.02592983785  
0.0783940091  
0.1816961646  
0.2791122943  
0.3652581661  
0.4351569011  
0.4851945056  
0.5139650415  
0.5228611195  
0.5163088077  
0.5015808481  
0.4881708361  
0.4867668662  
0.5079198712  
0.5605468976  
0.6504494136  
0.7790386229  
0.9424676897  
1.131327557  
1.331021026  
1.522839641  
1.685682745  
1.798263186  
1.841556124  
1.801199423  
1.669520569  
1.446905853  
1.142288658  
0.7726431835  
0.3614999664  
-0.06336201178  
-0.4727760407  
-0.8392508586  
-1.13983982  
-1.358463176  
-1.487383963  
-1.527674607  
-1.488639634  
-1.386315214  
-1.241276164  
-1.076077404  
-0.912671955  
-0.7701420362  
-0.6629980918  
-0.6001985926  
-0.5849322188  
-0.615080681  
-0.6842107104  
-0.7828692253  
-0.8999733705  
-1.02408306  
-1.144433014  
-1.251643803  
-1.338115151  
-1.398160121  
-1.427957357  
-1.425422545  
-1.390068602  
-1.322895345  
-1.226309184  
-1.104046803  
-0.9610407895  
-0.8031851872  
-0.6369623252  
-0.4689319843  
-0.3051254303  
-0.1504167519  
-0.007976365942  
0.1210872244  
0.2378088989  
0.3451232655  
0.4472972197  
0.5491004176  
0.6548335081  
0.7673631727  
0.8873301316  
1.012676442  
1.138596899  
1.257954661  
1.362115426  
1.442104424  
1.489913955  
1.499766969  
1.469151264  
1.399459638  
1.296140113  
1.168322497  
1.027975898  
0.8887084718  
0.7643665815  
0.6676107646  
0.6086385521  
0.594178154  
0.6268414696  
0.7048691395  
0.822234207  
0.9690709221  
1.132336548  
1.296660097  
1.445306597  
1.561225598  
1.628164977  
1.631819644  
1.560995607  
1.408721319  
1.173229129  
0.8586805062  
0.4755116507  
0.04026475827  
-0.4251764934  
-0.8949778058  
-1.341309413  
-1.736706697  
-2.056603406  
-2.281734109  
-2.400093076  
-2.408173891  
-2.311291007  
-2.122906888  
-1.863030177  
-1.55588985  
-1.227193624  
-0.9013405317  
-0.598974635  
-0.3351891697  
-0.1186031184  
0.04861572326  
0.1698484693  
0.2524491511  
0.3057864274  
0.339239308  
0.3604803743  
0.3742957501  
0.3821102395  
0.3822343934  
0.3707585505  
0.3428763312  
0.2943863339  
0.2230785468  
0.1297456852  
0.018635563  
-0.1027497488  
-0.2244755688  
-0.3354824023  
-0.4251603058  
-0.4849266912  
-0.509534772  
-0.4979005272  
-0.4533007917  
-0.3829092151  
-0.2967503709  
-0.2062278135  
-0.1224695051  
-0.05474734652  
-0.009211099768  
0.01188194489  
0.01032772687  
-0.008467457502  
-0.03644280979  
-0.06419665462  
-0.08243521886  
-0.08333864568  
-0.06164618742  
-0.01531488305  
0.05431287592  
0.1428345328  
0.2435177377  
0.3483108282  
0.4489588586  
0.538074151  
0.6100092331  
0.6614308955  
0.6915450618  
0.70197072  
0.6963144304  
0.6795257862  
0.6571377215  
0.6345064142  
0.6161456557  
0.6052385449  
0.6033779003  
0.6105467874  
0.6253272019  
0.6452814919  
0.6674433923  
0.6888236331  
0.7068518781  
0.7196795088  
0.7262997893  
0.7264598228  
0.7204030542  
0.7084868933  
0.6907583162  
0.6665858311  
0.6344201758  
0.5917504058  
0.5352691891  
0.4612417229  
0.3659998472  
0.2465015744  
0.1008472664  
-0.07132410431  
-0.2686105328  
-0.4878234454  
-0.7241372515  
-0.9713668309  
-1.222314448  
-1.46911379  
-1.7035331  
-1.917221373  
-2.101907073  
-2.249596187  
-2.352810185  
-2.404913557  
-2.400543616  
-2.336128929  
-2.210435514  
-2.025065601  
-1.78479636  
-1.497674921  
-1.174790082  
-0.8297042355  
-0.4775666915  
-0.1339905561  
0.1861834834  
0.4700871321  
0.7078412365  
0.8932603702  
1.024156048  
1.102217807  
1.132489493  
1.122545497  
1.08147693  
1.018854992  
0.943806076  
0.8643291839  
0.7869214075  
0.7165316245  
0.6567921388  
0.6104268251  
0.579697434  
0.5667504513  
0.5737326519  
0.6026097701  
0.6546859724  
0.7298970166  
0.8260270558  
0.9380401079  
1.057721609  
1.173815958  
1.272736989  
1.339860385  
1.361270683  
1.325742751  
1.226653186  
1.063505639  
0.8427716071  
0.5778464476  
0.2880380168  
-0.003340927402  
-0.2715550018  
-0.4933790964  
-0.6499709158  
-0.7292856997  
-0.7276810218  
-0.650480711  
-0.511406909  
-0.3309574605  
-0.1339550285  
0.05340126603  
0.2065840809  
0.3054919194  
0.3365660604  
0.2940371925  
0.1801959154  
0.004716932891  
-0.2168134716  
-0.4649102248  
-0.7184579427  
-0.9569324388  
-1.162311118  
-1.320496885  
-1.422147995  
-1.46290417  
-1.443096953  
-1.367054608  
-1.242166236  
-1.077859595  
-0.8846139203  
-0.6731038492  
-0.4535142688  
-0.235043219  
-0.0255619526  
