349.1710089  
373.1538376  
425.6633179  
549.411378  
800.5585837  
3106.352093  
17064.07097  
10994.4224  
17347.34657  
17013.87397  
26755.31662  
17468.48018  
3968.480965  
22371.79379  
26520.64885  
28845.04293  
4956.42628  
3613.076195  
18258.59561  
1758.379084  
362.2885655  
37718.10391  
20601.55859  
3843.503367  
3645.354287  
11171.7094  
37132.37263  
6656.69249  
10874.03589  
4996.156919  
3028.297344  
1511.288145  
6488.39469  
8246.299885  
10470.13011  
13865.15961  
2237.03988  
5620.605117  
17249.12045  
8837.531219  
585.4929444  
111.0982691  
511.3899199  
2738.78972  
12887.33541  
390.384313  
2959.670481  
6576.251819  
3074.733153  
4065.212506  
685.4528694  
1571.71288  
3580.894798  
3684.743357  
1643.56379  
2425.97707  
95.70342777  
366.612409  
362.137108  
481.5777274  
463.128603  
190.536346  
138.324828  
314.2639797  
25.29149858  
10.79611306  
36.64258344  
160.8427024  
12.19701485  
2.824000887  
0.1571315999  
38.90126744  
18.1908813  
21.70169513  
18.52531314  
36.27110465  
22.05383391  
8.044087797  
7.971639492  
6.855740003  
8.255349371  
7.52540669  
6.453628264  
5.623871879  
5.144073015  
5.478127226  
4.337263966  
4.119318178  
3.754556144  
3.839507753  
3.770988351  
3.410599516  
3.141884556  
2.936130146  
2.739584244  
2.584182864  
2.598942555  
2.357962771  
2.289152829  
2.163597309  
2.063925208  
1.936819953  
1.84183636  
1.764853266  
1.688834569  
1.610956421  
1.548504107  
1.479848248  
1.423179451  
1.356986331  
1.300666122  
1.253797542  
1.199769737  
1.156425488  
1.108376634  
1.062715458  
1.02576349  
0.9870926387  
0.9500268809  
0.9168445825  
0.8834390535  
0.8521131727  
0.8223323914  
0.7944174588  
0.7676757655  
0.741683567  
0.7178113315  
0.6935822923  
0.6713088246  
0.6497333039  
0.6295415401  
0.6097075374  
0.5907176805  
0.5728349524  
0.5554643263  
0.5387972523  
0.5229535038  
0.5076352262  
0.4930983507  
0.4789164748  
0.4653640327  
0.4523557304  
0.4398080057  
0.4277498239  
0.4160952194  
0.4048799971  
0.3941699852  
0.3837909629  
0.3737003031  
0.3640985038  
0.3547710898  
0.3457769058  
0.3371045716  
0.3287344693  
0.320643497  
0.3128106425  
0.3052600138  
0.2979561575  
0.2908991583  
0.2840606079  
0.2774428098  
0.2710380943  
0.2648506101  
0.2588468576  
0.2530435539  
0.2474099301  
0.2419474085  
0.2366586182  
0.2315352456  
0.2265672406  
0.2217367184  
0.217059004  
0.2125099092  
0.2081021813  
0.2038209387  
0.1996643732  
0.1956301024  
0.1917063797  
0.1878921736  
0.1841843567  
0.1805921508  
0.1770799641  
0.173669284  
0.1703592164  
0.1671399527  
0.1640012831  
0.1609482144  
0.1579793864  
0.1550888798  
0.1522713741  
0.1495174683  
0.1468503541  
0.144246248  
0.1417037486  
0.1392347888  
0.1368158413  
0.134470669  
0.1321751802  
0.1299416451  
0.1277539237  
0.1256262094  
0.1235507425  
0.1215255649  
0.1195492291  
0.1176232603  
0.1157337732  
0.1138893573  
0.1120944398  
0.1103438292  
0.1086258251  
0.1069517995  
0.1053105475  
0.1037112651  
0.1021495366  
0.1006199179  
0.09912522149  
0.09766369403  
0.09623630727  
0.09483755096  
0.09347223863  
0.09213211692  
0.09082585056  
0.08954500734  
0.08828931158  
0.08706504325  
0.08586361862  
0.08468965006  
0.08353440947  
0.08240972675  
0.0813035072  
0.08022682178  
0.07916584536  
0.07813243949  
0.07711492819  
0.07612072263  
0.07514679112  
0.07418669379  
0.07325025006  
0.07233141608  
0.07142750025  
0.07054684671  
0.0696843862  
0.06883294294  
0.06800318941  
0.06718203108  
0.06638446779  
0.06559601597  
0.06482759721  
0.06407024008  
0.06333032469  
0.0626002689  
0.06188418486  
0.06118452517  
0.06049896066  
0.05982141843  
0.05915571846  
0.05850530531  
0.05786541005  
0.05723557259  
0.05662265535  
0.05601674027  
0.05541994856  
0.05483893209  
0.0542568911  
0.05369480695  
0.05314367898  
0.05259746872  
0.05205977715  
0.05153554182  
0.051019211  
0.05050910587  
0.0500131467  
0.04951719752  
0.04903351796  
0.04855999207  
0.04809414486  
0.04763546901  
0.04718221662  
0.04673991143  
0.0462999029  
0.04587245241  
0.04545405208  
0.045035377  
0.04462782767  
0.0442251189  
0.04382907678  
0.04343975785  
0.04306168681  
0.04268427529  
0.04231008171  
0.04194868661  
0.0415888716  
0.04123191956  
0.04088733207  
0.04054302516  
0.04020560898  
0.03987382922  
0.03954802483  
0.03922374173  
0.03890826414  
0.03859715758  
0.03828956955  
0.03798828822  
0.0376921015  
0.03739486248  
0.03710865242  
0.03682435021  
0.0365448605  
0.03626600136  
0.03599471449  
0.0357273031  
0.03546268968  
0.03520281883  
0.03494705068  
0.03469504875  
0.03444732093  
0.03419971282  
0.03396159493  
0.03372242063  
0.03348823539  
0.03325923091  
0.03302829101  
0.03280410914  
0.0325855759  
0.03236341877  
0.03215547254  
0.03194090391  
0.03173150286  
0.03152616352  
0.03132431984  
0.03112258816  
0.03092673909  
0.03072993637  
0.03053812524  
0.03035140278  
0.03016459461  
0.02997981457  
0.02980103784  
0.02962079408  
0.02944488124  
0.02927202087  
0.02910016595  
0.02893263848  
0.02876756543  
0.02860501756  
0.02844218468  
0.02827850504  
0.02812635954  
0.02797008366  
0.02781864336  
0.02766501037  
0.02751651249  
0.02737389355  
0.02722601257  
0.02708385152  
0.02694400293  
0.02680756973  
0.02667066427  
0.02653220707  
0.02639924099  
0.02627077204  
0.02613879659  
0.02601355515  
0.02588525671  
0.02576256193  
0.02563943228  
0.02551889581  
0.0254000092  
0.02528426623  
0.02516640068  
0.02505251874  
0.02493956555  
0.02483033043  
0.02472304678  
0.02461224351  
0.02450542856  
0.02440028171  
0.0242975165  
0.02419597113  
0.02409542901  
0.02399503078  
0.0238983612  
0.02380063426  
0.02370784023  
0.02361313752  
0.02352140486  
0.02343036277  
0.02334232176  
0.02325429823  
0.02316549476  
0.0230779198  
0.02299358341  
0.02290966905  
0.0228285457  
0.02274471158  
0.02266489914  
0.02258968492  
0.02251040415  
0.02243339472  
0.02235860179  
0.0222838855  
0.02221076646  
0.02214005483  
0.02206868449  
0.02199882465  
0.0219298071  
0.02186005216  
0.02179465916  
0.02172934227  
0.021665418  
0.02160334118  
0.02153834206  
0.02147464047  
0.02141579935  
0.02135671227  
0.02129784342  
0.02124126665  
0.02118377079  
0.02112617835  
0.02107169382  
0.02101784123  
0.02096524882  
0.02091310423  
0.02085832095  
0.02081088632  
0.0207599414  
0.02071204913  
0.0206658253  
0.02061657788  
0.02057370533  
0.02052704109  
0.0204826185  
0.02043687124  
0.020395871  
0.02035208918  
0.02031130219  
0.02027113471  
0.02023402127  
0.02019119981  
0.02015409883  
0.02011727567  
0.02008263113  
0.02004437951  
0.02000970893  
0.01997793674  
0.0199434354  
0.01991051714  
0.0198801403  
0.01984647281  
0.01981626635  
0.01978816292  
0.01975821406  
0.01973107087  
0.01970300155  
0.01967659429  
0.01965234274  
0.01962557858  
0.01960044237  
0.01957866761  
0.01955371772  
0.01953086548  
0.01951079906  
0.01948923385  
0.01946901052  
0.01944802074  
0.01943069478  
0.0194142169  
0.01939573467  
0.01937812912  
0.01936135061  
0.01934624907  
0.01933199751  
0.0193179376  
0.01930241331  
0.01929091457  
0.01927871702  
0.01926693809  
0.01925607681  
0.01924664463  
0.01923776619  
0.01922778236  
0.01922030173  
0.0192129852  
0.01920411568  
0.01920131262  
0.01919422339  
0.0191891523  
0.01918328622  
0.01918018262  
0.019178708  
0.01917471432  
0.0191743712  
0.01917329944  
0.01917485956  
