0.1831046064  
-0.02037423098  
-0.2043050789  
-0.3534842104  
-0.4573312597  
-0.5111828803  
-0.5167128172  
-0.4814151636  
-0.417240121  
-0.338597801  
-0.2600510381  
-0.194055509  
-0.1491095918  
-0.1285895199  
-0.1304627295  
-0.1479035499  
-0.1707072771  
-0.1872689588  
-0.1867941883  
-0.1613869588  
-0.1076633596  
-0.02763277359  
0.07131351867  
0.1773061817  
0.2756623538  
0.351071425  
0.3899550464  
0.382653445  
0.325108263  
0.2197781455  
0.07565960166  
-0.09260413702  
-0.2663967329  
-0.4253661395  
-0.549906992  
-0.6235633045  
-0.6350368431  
-0.5795480806  
-0.4593849894  
-0.2835996419  
-0.06691339928  
0.1720033842  
0.4126390896  
0.6348585894  
0.8209538163  
0.9572902245  
1.035378638  
1.052279821  
1.010360161  
0.9164767301  
0.7807621716  
0.6152006583  
0.4321963273  
0.2433330961  
0.05843902472  
-0.1149535883  
-0.271749146  
-0.4090931934  
-0.5259282282  
-0.6224332622  
-0.6994665697  
-0.7581098604  
-0.7993887849  
-0.8241819482  
-0.8332993733  
-0.8276832368  
-0.8086494947  
-0.7780993656  
-0.7386315484  
-0.6935248087  
-0.6465692307  
-0.6017677849  
-0.5629549041  
-0.5333820308  
-0.5153397077  
-0.5098665642  
-0.5165964613  
-0.5337614157  
-0.5583524017  
-0.5864219906  
-0.6134859782  
-0.6349771649  
-0.6466967493  
-0.6452094958  
-0.6281436781  
-0.5943637954  
-0.5440031954  
-0.4783646539  
-0.3996964055  
-0.3108855922  
-0.2150873134  
-0.1153428364  
-0.01420289427  
0.0865841924  
0.1863092616  
0.2854259266  
0.3855303195  
0.4891916675  
0.599609398  
0.7201169047  
0.8535479958  
1.001520528  
1.163715686  
1.337245603  
1.516222647  
1.691634267  
1.851614923  
1.982154528  
2.068238323  
2.095341408  
2.051125441  
1.927157792  
1.720411371  
1.434320447  
1.079210989  
0.6719685133  
0.234927303  
-0.2059423793  
-0.6233745833  
-0.9913982616  
-1.287874283  
-1.496657159  
-1.609104838  
-1.6247464  
-1.551026735  
-1.402173258  
-1.19735021  
-0.9583607554  
-0.707210719  
-0.463854099  
-0.2444052523  
-0.06001276684  
0.08350504069  
0.1852938237  
0.2484915629  
0.2788717288  
0.283342884  
0.2685682349  
0.2399141698  
0.2008599789  
0.1529223401  
0.09603851404  
0.02929398545  
-0.04819499254  
-0.1364323945  
-0.2339058078  
-0.3372971898  
-0.4415933195  
-0.5405824204  
-0.6276448833  
-0.6966850747  
-0.7430340031  
-0.7641433074  
-0.7599360201  
-0.7327339033  
-0.686758068  
-0.6272742931  
-0.5595308207  
-0.4876684402  
-0.4138030401  
-0.3374588451  
-0.2554808413  
-0.1624766105  
-0.05175383981  
0.08337140949  
0.2480786465  
0.4446016731  
0.6710794516  
0.9209056683  
1.182731557  
1.441157748  
1.678081007  
1.874524946  
2.01273271  
2.078226994  
2.061568063  
1.959544921  
1.775646667  
1.519742509  
1.207023783  
0.8563612795  
0.4883202649  
0.123097755  
-0.2213314154  
-0.5306394176  
-0.7949810662  
-1.009195998  
-1.172413032  
-1.287187254  
-1.358359822  
-1.391843474  
-1.393531627  
-1.368480634  
-1.320443374  
-1.251777013  
-1.163662706  
-1.056544191  
-0.9306599386  
-0.7865480056  
-0.6254318593  
-0.4494317883  
-0.261594099  
-0.0657682056  
0.1336058912  
0.3317388995  
0.523689349  
0.7044978661  
0.869230493  
1.012971601  
1.130798991  
1.217801961  
1.269193953  
1.280537318  
1.248100813  
1.169301016  
1.043183591  
0.8708694231  
0.6558761404  
0.4042589037  
0.1245126675  
-0.1727769976  
-0.4755233038  
-0.7709210713  
-1.046352175  
-1.290322084  
-1.493332845  
-1.648597059  
-1.752510065  
-1.8048205  
-1.80846903  
-1.769105235  
-1.694321949  
-1.592693167  
-1.472720725  
-1.341826367  
-1.205519127  
-1.06684888  
-0.9262487498  
-0.7817806752  
-0.629791175  
-0.4658770234  
-0.2860434551  
-0.08788679596  
0.1283882852  
0.3592796069  
0.5977610952  
0.8336027619  
1.054217521  
1.245972158  
1.39578944  
1.492844407  
1.530104124  
1.5054951  
1.422492838  
1.2900319  
1.121695847  
0.9342821221  
0.7458905325  
0.5737935757  
0.4323538199  
0.3312761061  
0.2744183789  
0.2593347505  
0.2776077561  
0.3159323336  
0.3578123299  
0.3856478607  
0.3829614764  
0.3364723774  
0.2377822556  
0.08446745493  
-0.1195204775  
-0.3641947152  
-0.6345336666  
-0.9120071191  
-1.176447658  
-1.408033817  
-1.589180353  
-1.706129896  
-1.750104551  
-1.717923552  
-1.612055486  
-1.440131125  
-1.214002518  
-0.9484530444  
-0.6597148595  
-0.3639280832  
-0.07570748168  
0.19306508  
0.434096034  
0.6431204856  
0.8198928864  
0.9677396382  
1.092731348  
1.202587609  
1.305440751  
1.408615682  
1.517570679  
1.635121447  
1.761049931  
1.892107748  
2.022416309  
2.14417546  
2.248584886  
2.326830968  
2.371024369  
2.37496672  
2.334665147  
2.24857116  
2.117533166  
1.944529202  
1.734231566  
1.492503945  
1.225900693  
0.9412442052  
0.6453102567  
0.3446400663  
0.04546184125  
-0.246323899  
-0.5251351043  
-0.7857263353  
-1.023284542  
-1.233590699  
-1.413268733  
-1.560061859  
-1.673092581  
-1.753043741  
-1.802196883  
-1.824297154  
-1.824235664  
-1.807569049  
-1.779940769  
-1.746487283  
-1.711304691  
-1.677066426  
-1.644841369  
-1.614131105  
-1.583120059  
-1.549076006  
-1.508844453  
-1.459354869  
-1.398063323  
-1.323281437  
-1.234361581  
-1.131727566  
-1.016776133  
-0.8916757109  
-0.7590994289  
-0.6219297941  
-0.4829709216  
-0.3446859683  
-0.2089806186  
-0.07705501336  
0.05066862071  
0.174519481  
0.2954434617  
0.4147500105  
0.5337527526  
0.6533323115  
0.7734737188  
0.892842865  
1.008486247  
1.115730583  
1.20833487  
1.278920502  
1.319661002  
1.323152633  
1.283374617  
1.196590594  
1.062060322  
0.8824428692  
0.6638084196  
0.4152369317  
0.1480459269  
-0.125262895  
-0.3921868735  
-0.6413889326  
-0.8636720787  
-1.05264923  
-1.205014603  
-1.320407129  
-1.400908642  
-1.450256908  
-1.472925422  
-1.473207543  
-1.45444893  
-1.418541748  
-1.365752015  
-1.294896654  
-1.203830361  
-1.090165143  
-0.9520866325  
-0.7891459434  
-0.6028747449  
-0.3971148686  
-0.1779943996  
0.04648150517  
0.2671790554  
0.4748301335  
0.6611368526  
0.8198130711  
0.9474065478  
1.043751577  
1.111966358  
1.157966649  
1.189547323  
1.21515745  
1.24253552  
1.277420574  
1.322530896  
1.376978649  
1.436224824  
1.492586092  
1.536247491  
1.556625515  
1.543904381  
1.490535199  
1.392470907  
1.249995895  
1.068020975  
0.855813552  
0.6262019969  
0.3943524264  
0.1762716761  
-0.01278356245  
-0.1598099133  
-0.2553111483  
-0.2941613259  
-0.2760138357  
-0.2052080397  
-0.09021863829  
0.05728979255  
0.2236787107  
0.3946883256  
0.5567681562  
0.698260115  
0.8102988453  
0.8873599073  
0.9274239113  
0.9317597888  
0.9043924991  
0.8513429736  
0.7797462153  
0.6969684289  
0.6098183294  
0.523934467  
0.4433955933  
0.370566266  
0.306160388  
0.2494833929  
0.1987959279  
0.1517384146  
0.1057615641  
0.05851199288  
0.008138351743  
-0.04649699917  
-0.1057148911  
-0.1690146019  
-0.235154887  
-0.3023070808  
-0.368248718  
-0.4305872356  
-0.4869812873  
-0.5353538813  
-0.5740705045  
-0.6020810804  
-0.6190154896  
-0.6252263091  
-0.6217780038  
-0.6103884895  
-0.593323548  
-0.5732456113  
-0.5530410028  
-0.5356268338  
-0.5237661279  
-0.5199090028  
-0.5260812823  
-0.5438354842  
-0.5742696434  
-0.6181158974  
-0.6758620825  
-0.7478900446  
-0.8345729187  
-0.9362848567  
-1.05330236  
-1.185555411  
-1.332260035  
-1.491465914  
-1.659602029  
-1.831108602  
-1.998280976  
-2.151397588  
-2.279213392  
-2.369809543  
-2.411759648  
-2.395487251  
-2.314641643  
-2.167300041  
-1.95679298  
-1.691986307  
-1.386922487  
-1.059802521  
-0.7313941233  
-0.4230158717  
-0.1543565899  
0.05863975179  
0.20552648  
0.2825486873  
0.2931170086  
0.2475048397  
0.1618054323  
0.05627240379  
-0.04675412282  
-0.1251019967  
-0.1589506201  
-0.1327197126  
-0.03646472929  
0.1333283747  
0.3735987158  
0.6751922713  
1.023873887  
1.401725143  
1.788758787  
2.164570918  
2.50986288  
2.807711989  
3.04449338  
3.210429209  
3.299784079  
3.310753717  
3.245133777  
3.107863405  
2.906506787  
2.650746969  
2.351899878  
2.022451314  
1.675590914  
1.324695723  
0.9827522866  
0.6617006402  
0.3717278086  
0.1205865774  
-0.08698251625  
-0.2496120258  
-0.3693545115  
-0.4513496854  
-0.5031006648  
-0.5333980799  
-0.5510163442  
-0.5633505386  
-0.5751921486  
-0.5878590266  
-0.5988371727  
-0.602049206  
-0.588754201  
-0.5489981003  
-0.4734181027  
-0.3551652334  
-0.1916247167  
0.01432056049  
0.2537303624  
0.5118807995  
0.7693801195  
1.004028101  
1.193182572  
1.316344307  
1.357603604  
1.307627014  
1.164917323  
0.9361720924  
0.6356931601  
0.2839250749  
-0.09468499575  
-0.4742418231  
-0.8300396296  
-1.140977776  
-1.391467195  
-1.572631063  
-1.682688836  
-1.726521271  
-1.714512459  
-1.660845652  
-1.581481728  
-1.492080456  
-1.406100715  
-1.333308874  
-1.278832151  
-1.242855648  
-1.220956504  
-1.205015804  
-1.184571461  
-1.148435327  
-1.086369381  
-0.9906126633  
-0.8570819287  
-0.6861008824  
-0.4825819438  
-0.2556511449  
-0.01777365111  
0.2164989526  
0.4319997111  
0.6144581492  
0.7518704758  
0.8355887635  
0.8610274124  
0.8279332438  
0.740242742  
0.6055775678  
0.4344786463  
0.2394895178  
0.0341991341  
-0.1676614008  
-0.3530009209  
-0.5100010594  
-0.6285963581  
-0.7008151255  
-0.7210317072  
-0.6861473138  
-0.59573415  
-0.4521482262  
-0.2605879694  
-0.02907530698  
0.2317007539  
0.5087108405  
0.7871303284  
1.051106915  
1.284735115  
1.473178875  
1.603852164  
1.667544328  
1.659359279  
1.579345469  
1.432719109  
1.229613095  
0.9843408553  
0.7142224791  
0.4380730032  
0.1744980103  
-0.05982406523  
-0.251686743  
-0.392552033  
-0.4792639723  
-0.5141945837  
-0.5048060539  
-0.4626867999  
-0.4021724175  
-0.3387214501  
-0.2872345089  
-0.2605128897  
-0.2680189094  
-0.3150656841  
-0.4024953391  
-0.5268498877  
-0.6809656625  
-0.8548917561  
-1.036999034  
-1.215131865  
-1.377686689  
-1.514502197  
-1.617524232  
-1.681188098  
-1.702559438  
-1.681239465  
-1.619096114  
-1.519860217  
-1.388631726  
-1.231334479  
-1.054151405  
-0.8629683358  
-0.6628625759  
-0.457674752  
-0.2497103003  
-0.03961997512  
0.1735006207  
0.3917687683  
0.6179326455  
0.8545844523  
1.103263422  
1.363546164  
1.632279288  
1.903087932  
2.166286702  
2.409281201  
2.617465606  
2.775567592  
2.869302347  
2.887133518  
2.821910349  
2.672125421  
2.442593636  
2.144408116  
1.794130308  
1.412292463  
1.021380263  
0.6435608145  
0.2984538366  
0.001249812996  
-0.2385819678  
-0.4178444245  
-0.5393652442  
-0.6110484305  
-0.6443871375  
-0.652683346  
-0.6492528645  
-0.6458449297  
-0.6514814753  
-0.6717972044  
-0.7089144942  
-0.7617641619  
-0.8267380451  
-0.8985190073  
-0.9709372454  
-1.037744882  
-1.093228182  
-1.132644858  
-1.152486763  
-1.150615877  
-1.126309967  
-1.080253418  
-1.014482637  
-0.9322790762  
-0.8379880157  
-0.7367418281  
-0.634064194  
-0.5353789274  
-0.4454450986  
-0.3678035913  
-0.3043035431  
-0.2548046957  
-0.2171362574  
-0.1873463571  
-0.1602475967  
-0.130203656  
-0.09206059998  
-0.04208003714  
0.02126798392  
0.0968017357  
0.1805151161  
0.2659165769  
0.3447954591  
0.4083267378  
0.448373024  
0.4587762572  
0.4364446939  
0.3820362936  
0.3001099798  
0.1986835157  
0.08823252431  
-0.01973434822  
-0.1143223299  
-0.1868484463  
-0.2321354765  
-0.2492656191  
-0.2416310095  
-0.2162608624  
-0.1824855239  
-0.1501540497  
-0.1276850247  
-0.1202931032  
-0.1287070961  
-0.1486329612  
-0.1710980824  
-0.1836526086  
-0.1722817418  
-0.1237296654  
-0.02787459556  
0.1202373207  
0.3190254173  
0.559925104  
0.827928077  
1.103056993  
1.362558098  
1.583491681  
1.745349408  
1.832334651  
1.835015045  
1.751147624  
1.585637323  
1.349682447  
1.059299535  
0.7334635548  
0.3921398581  
0.05444474141  
-0.2628762867  
-0.5465297381  
-0.7872860824  
-0.9801509528  
-1.124151667  
-1.221855707  
-1.278682327  
-1.302098554  
-1.300745174  
-1.283524489  
-1.258694661  
-1.233000522  
-1.21090445  
-1.19398822  
-1.180619492  
-1.165960246  
-1.142379267  
-1.100289495  
-1.029367225  
-0.9200435657  
-0.7651126085  
-0.5612315138  
-0.3101170131  
-0.01920371777  
0.2983638074  
0.6244825858  
0.9375602479  
1.214572896  
1.433484481  
1.57574501  
1.628558995  
1.586608801  
1.453000606  
1.239271139  
0.9644076325  
0.6529844539  
0.3326012274  
0.03093539462  
-0.2272436886  
-0.4227113476  
-0.5437621356  
-0.5872486143  
-0.5585658339  
-0.4705796166  
-0.3416466739  
-0.1929944489  
-0.04582222382  
0.08149809477  
0.1757292799  
0.2302857045  
0.2457639406  
0.2294299041  
0.1937465077  
0.1541726633  
0.1265515396  
0.1244652295  
0.1569398253  
0.226824391  
0.3300777733  
0.4560668702  
0.5888314098  
0.7091519577  
0.7971243111  
0.8348973118  
0.8091959797  
0.7132908242  
0.5481401775  
0.3225688036  
0.05243908106  
-0.2410562015  
-0.5337684179  
-0.8013241631  
-1.021868083  
-1.178472568  
-1.260927232  
-1.266699043  
-1.200969763  
-1.075765436  
-0.9083239512  
-0.7189126107  
-0.5283979166  
-0.3558566276  
-0.2165364603  
-0.1203840933  
-0.071299525  
-0.06716364226  
-0.1005935429  
-0.16027236  
-0.2326579016  
-0.3038211959  
-0.3611701343  
-0.3948537109  
-0.3986914898  
-0.3705576985  
-0.3122213752  
-0.2287203125  
-0.1274012061  
-0.0167822006  
0.09459251504  
0.1991569894  
0.2910786767  
0.3666903031  
0.4245895482  
0.4654185759  
0.4914003528  
0.505711149  
0.5117865195  
0.5126693923  
0.5104816377  
0.5060907516  
0.4990155735  
0.4875721088  
0.4692368895  
0.4411754703  
0.4008452967  
0.3465915569  
0.2781377406  
0.1969006657  
0.1060716083  
0.01046112781  
-0.08388058463  
-0.1702143328  
-0.2417505337  
-0.2922961165  
-0.3168350561  
-0.3119631392  
-0.2761648337  
-0.2099111361  
-0.1155978294  
0.002625383168  
0.1391047666  
0.28697103  
0.4384351133  
0.5851055185  
0.7183174378  
0.8295234392  
0.9107382648  
0.9550631123  
0.9572684782  
0.9143738229  
0.8261713957  
0.695586863  
0.5287966048  
0.3350248438  
0.1259844365  
-0.08501151117  
-0.2842206787  
-0.458774618  
-0.5979789773  
-0.6944287215  
-0.7447810268  
-0.7500646127  
-0.7154731467  
-0.6496453779  
-0.5635382162  
-0.4690221407  
-0.3774185724  
-0.298160792  
-0.2377763004  
-0.1993208492  
-0.182325165  
-0.1832415886  
-0.1962964032  
-0.2146015041  
-0.2313380036  
-0.2408381532  
-0.2393959933  
-0.2257136648  
-0.2009337636  
-0.1682825202  
-0.1324118258  
-0.09855170148  
-0.07162740579  
-0.05546509712  
-0.05220570162  
-0.06199696019  
-0.08298663053  
-0.1116057886  
-0.1430774928  
-0.1720737621  
-0.1934235199  
-0.2027759734  
-0.1971417628  
-0.1752507179  
-0.137689626  
-0.08681258312  
-0.0264504681  
0.03855368473  
0.1029144282  
0.1615112429  
0.2099692535  
0.2451349505  
0.2654002989  
0.2708266139  
0.263065741  
0.2450876634  
0.2207436528  
0.1942400225  
0.1695873699  
0.1500971115  
0.1380063776  
0.1342672369  
0.1385311022  
0.149323703  
0.1643630355  
