0.2990728348  
0.487765976  
0.6681144468  
0.8355481821  
0.9858740507  
1.115186218  
1.219837677  
1.296506945  
1.342384822  
1.355469186  
1.334932352  
1.281526198  
1.19792837  
1.088983113  
0.9617447409  
0.8252771797  
0.6901908712  
0.5679102062  
0.4697309095  
0.4057638376  
0.3838545397  
0.4086394052  
0.480838831  
0.5969107889  
0.7491294158  
0.9260961756  
1.113661003  
1.29616062  
1.457830675  
1.584258971  
1.663692556  
1.688071186  
1.653657307  
1.56121056  
1.415688455  
1.225530716  
1.001623925  
0.7560922275  
0.5010543808  
0.2474996192  
0.004422277406  
-0.2217342306  
-0.427261819  
-0.6110420506  
-0.7741158638  
-0.9190740656  
-1.049357954  
-1.168595271  
-1.280017927  
-1.386051024  
-1.488058965  
-1.586269799  
-1.679823132  
-1.766921572  
-1.845029488  
-1.911087752  
-1.961746089  
-1.993567867  
-2.003260476  
-1.987908687  
-1.945237718  
-1.873909346  
-1.773807915  
-1.646321461  
-1.49452024  
-1.323214555  
-1.138805485  
-0.9489302816  
-0.7618751396  
-0.5858080367  
-0.4279239465  
-0.293604153  
-0.185712554  
-0.104170883  
-0.04588433401  
-0.005061417471  
0.0260820108  
0.05633711891  
0.09433916004  
0.1474291068  
0.2206682274  
0.3161786757  
0.4328826562  
0.566685003  
0.7110390512  
0.857816681  
0.9983151257  
1.124255643  
1.228628927  
1.306249468  
1.354003054  
1.370745988  
1.356932287  
1.314088727  
1.244217955  
1.149293407  
1.030922657  
0.8902493696  
0.7281031147  
0.5453581496  
0.3434331857  
0.1248127844  
-0.1065152922  
-0.3448036453  
-0.5825494859  
-0.8107947296  
-1.019688165  
-1.199267768  
-1.340355327  
-1.435451038  
-1.47949867  
-1.470433653  
-1.409421296  
-1.300767436  
-1.151509253  
-0.9707308699  
-0.7687005428  
-0.5559313511  
-0.3422739951  
-0.1361546409  
0.05596568585  
0.2298572294  
0.3834906391  
0.5167472702  
0.6309123822  
0.7280557831  
0.8103842764  
0.8796868052  
0.9369464895  
0.9821927557  
1.014589358  
1.032766437  
1.035301841  
1.021268607  
0.9907255403  
0.9450566359  
0.8870649442  
0.8207917562  
0.7510865001  
0.6829836786  
0.6210188121  
0.5685886073  
0.5275096922  
0.4978350927  
0.4779891578  
0.465185174  
0.456043923  
0.4472924092  
0.4363966724  
0.4219971379  
0.4040604567  
0.3837058778  
0.3627441726  
0.3430143513  
0.3256603143  
0.310497319  
0.295618956  
0.2773457981  
0.2505663027  
0.209446092  
0.1484138045  
0.06326334355  
-0.04780057855  
-0.1833683845  
-0.3384319611  
-0.5044944176  
-0.6702038411  
-0.8224471276  
-0.9477736287  
-1.033969244  
-1.071567256  
-1.05509516  
-0.9839062115  
-0.8624727801  
-0.7001234861  
-0.5102611301  
-0.3091482071  
-0.1144256453  
0.05648245771  
0.1878935091  
0.267183497  
0.2857633901  
0.2396580566  
0.1296514475  
-0.03896724529  
-0.2569984101  
-0.5121888838  
-0.7902262916  
-1.075787972  
-1.353540783  
-1.609025216  
-1.829378404  
-2.00387628  
-2.124304217  
-2.185178143  
-2.183844646  
-2.120489224  
-1.998068538  
-1.822161831  
-1.600736949  
-1.343805852  
-1.062941865  
-0.7706754328  
-0.4797594022  
-0.2023643365  
0.05074033546  
0.2709364609  
0.4523532741  
0.5922288385  
0.6910099435  
0.7521485514  
0.7816349836  
0.7873187165  
0.7780935464  
0.7630345703  
0.750571241  
0.7477688359  
0.7597678119  
0.7894078334  
0.8370442598  
0.9005590747  
0.9755517019  
1.055687293  
1.133194135  
1.199477737  
1.245824427  
1.264160036  
1.247815257  
1.192226746  
1.095532632  
0.9589734364  
0.7870481028  
0.587393969  
0.3703631862  
0.1483163505  
-0.06532011338  
-0.2571439587  
-0.414920412  
-0.5286679359  
-0.5915551806  
-0.6005374641  
-0.5566358567  
-0.4648450655  
-0.3336649847  
-0.1743070135  
0.0003322133676  
0.1768309704  
0.3423983238  
0.4859110826  
0.5987175633  
0.6751417805  
0.7126539332  
0.7117151179  
0.6753581545  
0.6085945819  
0.5177361042  
0.409748779  
0.2917166298  
0.1704520665  
0.05227815698  
-0.05705722529  
-0.1524000397  
-0.2291986681  
-0.2835855325  
-0.3125581776  
-0.3142715087  
-0.2883908202  
-0.2364444754  
-0.1620607831  
-0.07100863051  
0.02903775039  
0.1290326048  
0.2193705435  
0.290878165  
0.3358670883  
0.3490876851  
0.3284361731  
0.2752954508  
0.1944378517  
0.09350309417  
-0.01789746825  
-0.1293058371  
-0.2306259541  
-0.3132403529  
-0.3708887811  
-0.4001909673  
-0.4007890698  
-0.3750930346  
-0.3277289637  
-0.2647742727  
-0.1929237523  
-0.118709218  
-0.04787210869  
0.01503108242  
0.06679173837  
0.1054781613  
0.1302016236  
0.1408046687  
0.1375356799  
0.1208225157  
0.09117093433  
0.04922915403  
-0.004008626179  
-0.06689886384  
-0.1368401627  
-0.2100324179  
-0.2814147667  
-0.3448307795  
-0.3934583239  
-0.4204944409  
-0.4200158272  
-0.3879176516  
-0.3227859723  
-0.226555298  
-0.1048182345  
0.03330957027  
0.1758120994  
0.3088597758  
0.4182349046  
0.490965461  
0.5169264753  
0.4901923283  
0.4099321687  
0.2806865876  
0.1119288168  
-0.08304941816  
-0.2888259392  
-0.489893995  
-0.6727678713  
-0.8278427198  
-0.9506990796  
-1.042623356  
-1.11019344  
-1.163970138  
-1.216422063  
-1.27940213  
-1.36156141  
-1.46613211  
-1.589493756  
-1.720816847  
-1.842951728  
-1.934499179  
-1.972831291  
-1.937636653  
-1.814459218  
-1.597649963  
-1.292240229  
-0.914339466  
-0.4899380546  
-0.05218737667  
0.3624834637  
0.7188822733  
0.9875420372  
1.148536569  
1.194040624  
1.129283044  
0.9717486827  
0.7487816939  
0.493946599  
0.2426908977  
0.02792312595  
-0.1238891893  
-0.1956038748  
-0.1809587517  
-0.08466549983  
0.07886731108  
0.2879084238  
0.516486612  
0.7377478855  
0.9271417885  
1.065079132  
1.138795656  
1.143312049  
1.081459231  
0.9630777432  
0.8035645179  
0.6219586404  
0.4388090931  
0.2740185621  
0.1448579323  
0.06430975741  
0.03985886573  
0.0728199839  
0.1582652855  
0.2855449816  
0.4394045902  
0.6015776032  
0.7527531899  
0.8747116308  
0.9524293517  
0.9759071894  
0.941507325  
0.8526117497  
0.7195039858  
0.5584285953  
0.3899257063  
0.2365945547  
0.1205340667  
0.06075253594  
0.07083893214  
0.157179288  
0.3179141152  
0.5427712813  
0.8137949706  
1.10688569  
1.394017431  
1.645869614  
1.834637368  
1.936728123  
1.935085552  
1.820930332  
1.594735031  
1.266368887  
0.8543642008  
0.384399027  
-0.1128959082  
-0.6045786443  
-1.058258031  
-1.444892847  
-1.741247103  
-1.9317765  
-2.009734533  
-1.977414464  
-1.845498906  
-1.63163962  
-1.358418676  
-1.050983525  
-0.7346142999  
-0.4325253715  
-0.1641251567  
0.05610793088  
0.2190909081  
0.3209864241  
0.3625718109  
0.3483243316  
0.2854215198  
0.1828349069  
0.05063599236  
-0.1004454994  
-0.2592517165  
-0.4143176346  
-0.5540178322  
-0.6668656675  
-0.7420626418  
-0.7703086584  
-0.7448298135  
-0.6624715571  
-0.5246888419  
-0.3382116769  
-0.1152034156  
0.1272181453  
0.3681340893  
0.5845993619  
0.7538451883  
0.855676894  
0.8747497733  
0.8024251433  
0.6379251615  
0.3886358511  
0.06947953227  
-0.2985743386  
-0.6906630963  
-1.080588928  
-1.443447264  
-1.758002075  
-2.008538185  
-2.185981172  
-2.288221679  
-2.3196486  
-2.290030293  
-2.212927618  
-2.103869388  
-1.978536491  
-1.851128397  
-1.733065537  
-1.632129471  
-1.552032034  
-1.492423413  
-1.44926605  
-1.415528565  
-1.38209744  
-1.338866852  
-1.275893855  
-1.184555526  
-1.058599764  
-0.8949861971  
-0.6944153001  
-0.4614469685  
-0.2041752139  
0.0665669073  
0.3383856874  
0.5987669594  
0.8365899864  
1.043491471  
1.2148685  
1.350350938  
1.453639317  
1.531705941  
1.593482721  
1.648218528  
1.703796043  
1.765269504  
1.83390403  
1.906888608  
1.977789359  
2.03769533  
2.076876166  
2.086680427  
2.061355811  
1.999474605  
1.904705023  
1.785762247  
1.655501292  
1.529257575  
1.422649448  
1.349152464  
1.317812571  
1.331441536  
1.385614355  
1.468643844  
1.562608449  
1.645353933  
1.693229825  
1.684221749  
1.601060732  
1.433881611  
1.182029687  
0.8547448343  
0.4705823198  
0.05560476467  
-0.3594401599  
-0.7426006353  
-1.06441364  
-1.301320108  
-1.438354446  
-1.47076896  
-1.40438955  
-1.254686249  
-1.04470978  
-0.8021985893  
-0.556262365  
-0.3340785076  
-0.1580310738  
-0.04362730308  
0.001589030701  
-0.02192735042  
-0.1066693385  
-0.2397854708  
-0.4052500166  
-0.5861552121  
-0.7667923045  
-0.9342767933  
-1.079529818  
-1.197580097  
-1.287240809  
-1.350314505  
-1.390541082  
-1.412500708  
-1.420679784  
-1.418823377  
-1.40964373  
-1.394840359  
-1.375350577  
-1.35168196  
-1.324192602  
-1.293195847  
-1.258842569  
-1.220791342  
-1.17775657  
-1.127069008  
-1.064419698  
-0.9839276737  
-0.8786206403  
-0.7413455334  
-0.5660297949  
-0.3491055213  
-0.09088323651  
0.2034046864  
0.5231251286  
0.8525019711  
1.171679864  
1.458536211  
1.691055032  
1.849956832  
1.921229208  
1.898181926  
1.782687084  
1.585383183  
1.324758298  
1.025182205  
0.7141371348  
0.4189925743  
0.1637706275  
-0.03366545808  
-0.1636137713  
-0.2254582171  
-0.2274076177  
-0.1851010974  
-0.11929456  
-0.05296082596  
-0.008205280119  
-0.003409974613  
-0.05096008923  
-0.1558225227  
-0.3151153367  
-0.5186534783  
-0.7503575388  
-0.9902845762  
-1.217006426  
-1.410011631  
-1.551871963  
-1.629925605  
-1.637345712  
-1.573523109  
-1.443785645  
-1.258544849  
-1.032014025  
-0.7806596383  
-0.5215771125  
-0.270943265  
-0.04270819109  
0.1523937202  
0.3074254524  
0.4194283757  
0.4892130269  
0.5208286546  
0.5208060864  
0.4972705026  
0.4590355381  
0.4147780203  
0.3723609149  
0.3383468732  
0.3177337133  
0.31386862  
0.3285293967  
0.3621050312  
0.4138309727  
0.482021402  
0.5642719967  
0.6576021084  
0.7585421806  
0.8631698183  
0.9671208219  
1.065601733  
1.153440086  
1.225190413  
1.27532907  
1.298546639  
1.290121822  
1.24637773  
1.16515309  
1.046252026  
0.8917846179  
0.7063265542  
0.4968412863  
0.2723124193  
0.04310388984  
-0.1799258568  
-0.3864431146  
-0.5676723833  
-0.7172780619  
-0.8319578502  
-0.9116117354  
-0.9590514331  
-0.9792300668  
-0.9781087816  
-0.96132129  
-0.9328491053  
-0.89395661  
-0.8425958879  
-0.7734391427  
-0.6786087008  
-0.5490380639  
-0.3763029269  
-0.1546551039  
0.1170603756  
0.4339529162  
0.7843583619  
1.150039782  
1.507375696  
1.829425629  
2.088653304  
2.259961578  
2.323630368  
2.26777288  
2.089951748  
1.797744667  
1.408158985  
0.9459762017  
0.4412328087  
-0.07383781502  
-0.5680211168  
-1.014113549  
-1.391339348  
-1.686946038  
-1.896834422  
-2.025213548  
-2.083374009  
-2.087780945  
-2.057736505  
-2.012909066  
-1.97098282  
-1.945696392  
-1.945419592  
-1.97240773  
-2.022743027  
-2.086945275  
-2.151141712  
-2.19866586  
-2.211897301  
-2.174174411  
-2.071589881  
-1.894509996  
-1.638694529  
-1.305920052  
-0.9040789371  
-0.4467524119  
0.04769438322  
0.5573770362  
1.058436589  
1.526682949  
1.939239058  
2.276033537  
2.521052917  
2.663276712  
2.697265206  
2.623386957  
2.447711845  
2.181608401  
1.841076576  
1.445886985  
1.018535366  
0.5830654278  
0.1637834598  
-0.2160943269  
-0.535822815  
-0.7784624558  
-0.9320945338  
-0.9908093989  
-0.9553644573  
-0.8334084878  
-0.6391849581  
-0.3926803682  
-0.1182185316  
0.1574334462  
0.4073012464  
0.606606662  
0.7351056788  
0.7791108341  
0.7329777812  
0.5998504427  
0.3915529214  
0.1275889399  
-0.1666765425  
-0.4624964876  
-0.7306232526  
-0.9442879852  
-1.081941141  
-1.129448908  
-1.081483861  
-0.9419574683  
-0.7234347603  
-0.4456279122  
-0.1331384795  
0.1872579841  
0.4894554458  
0.7506558006  
0.9534902443  
1.087404037  
1.149173719  
1.142558031  
1.077176212  
0.9668218623  
0.827462673  
0.6752042885  
0.5244883256  
0.3867198082  
0.2694634192  
0.1762414988  
0.1068844294  
0.05830673694  
0.02554751786  
0.002870903511  
-0.01524147121  
-0.03333676584  
-0.05455971204  
-0.08056420339  
-0.1116977273  
-0.1473921839  
-0.186623905  
-0.2283326471  
-0.2717054999  
-0.3162684774  
-0.3617718073  
-0.4079195641  
-0.4540075555  
-0.4985748995  
-0.5391665779  
-0.5722806099  
-0.5935547863  
-0.5981949801  
-0.5815945284  
-0.5400790956  
-0.471651744  
-0.3766322879  
-0.2580743434  
-0.1218737434  
0.0234823883  
0.1675220515  
0.2987068266  
0.4055655944  
0.477916841  
0.5080313025  
0.4915943626  
0.4283313374  
0.3222224775  
0.1812546745  
0.01673612963  
-0.1577487946  
-0.3276368187  
-0.4787681884  
-0.5987135267  
-0.6778812736  
-0.7103068923  
-0.6940312045  
-0.6310831064  
-0.527071064  
-0.3904947767  
-0.2318549718  
-0.06270326194  
0.1052846926  
0.261110852  
0.3950952353  
0.4993366433  
0.5680096795  
0.5975217795  
0.5865712691  
0.5361288998  
0.4493409092  
0.3313649869  
0.1890926265  
0.03075447697  
-0.1346112227  
-0.2978158241  
-0.4502453209  
-0.5845992706  
-0.6955287388  
-0.7800976812  
-0.8379444325  
-0.8711385661  
-0.8836816149  
-0.8807370043  
-0.8676695829  
-0.8490403614  
-0.8277112537  
-0.8042177217  
-0.776499521  
-0.7400780735  
-0.6886696783  
-0.6151571897  
-0.5128164591  
-0.3766165145  
-0.2044233913  
0.002057106763  
0.2367672946  
0.4892818317  
0.7453424758  
0.9879116999  
1.198655145  
1.359701509  
1.455507559  
1.474611832  
1.411087608  
1.265506085  
1.045298415  
0.7644273031  
0.442407373  
0.1027266191  
-0.229158589  
-0.5280715889  
-0.7713726135  
-0.9409940566  
-1.02507213  
-1.018990278  
-0.9257598576  
-0.7557100437  
-0.5255098429  
-0.2566516422  
0.02648571368  
0.2988005575  
0.5366834039  
0.7200829369  
0.834272841  
0.871154242  
0.8299986911  
0.7175502796  
0.547474102  
0.3391573781  
0.1159636996  
-0.09694901229  
-0.2750484428  
-0.3968813481  
-0.4463071792  
-0.414273393  
-0.299933023  
-0.1109284908  
0.1372001087  
0.4224734582  
0.7186470185  
0.9978884088  
1.233635642  
1.403326985  
1.490662288  
1.487143602  
1.392702863  
1.215369888  
0.9700476974  
0.6765696355  
0.3573139082  
0.03469412901  
-0.271147137  
-0.5441717132  
-0.7736040822  
-0.9543185648  
-1.086474544  
-1.174529773  
-1.225823119  
-1.248967824  
-1.2523189  
-1.24271212  
-1.224650946  
-1.200012949  
-1.168258957  
-1.127091854  
-1.073387881  
-1.0042452  
-0.9179501859  
-0.8147036789  
-0.6969790257  
-0.569461046  
-0.4385683961  
-0.3116582354  
-0.1960192663  
-0.09784726548  
-0.02136374803  
0.03178362267  
0.06271494518  
0.07509215834  
0.07448882197  
0.06746736985  
0.06050931869  
0.05895980975  
0.06617631069  
0.0829918623  
0.1075920198  
0.135821235  
0.1618576022  
0.1791758254  
0.1816309334  
0.1645230278  
0.1254940545  
0.0651358717  
-0.0127665032  
-0.1013726242  
-0.1913035144  
-0.2714560811  
-0.3300485184  
-0.355780441  
-0.3390067445  
-0.2728243591  
-0.1539760694  
0.0165030489  
0.2329719602  
0.4852285717  
0.7589661772  
1.036622098  
1.298592844  
1.524739952  
1.69608821  
1.796541394  
1.814475281  
1.743998952  
1.585730593  
1.34696096  
1.041140949  
0.6867174414  
0.3054231886  
-0.07980543738  
