0.3770248905  
0.3172882933  
0.2596893839  
0.2051466668  
0.1541459766  
0.1067981328  
0.06299785801  
0.02264019422  
-0.0141403302  
-0.04676765381  
-0.07409942259  
-0.0944235636  
-0.1056145226  
-0.1054128082  
-0.09184184874  
-0.06367223465  
-0.02088621089  
0.03494753693  
0.1004693039  
0.1705558115  
0.2386018551  
0.2970751729  
0.3382798004  
0.3552577984  
0.3427043358  
0.2977771112  
0.2206654866  
0.1148173111  
-0.01323191731  
-0.1544380067  
-0.2981840108  
-0.433449939  
-0.550086954  
-0.6400044004  
-0.6981188608  
-0.7229318855  
-0.7166400059  
-0.6847820266  
-0.6354547543  
-0.5782205465  
-0.5228609715  
-0.478140731  
-0.4507609371  
-0.4446295843  
-0.4605231047  
-0.4961801263  
-0.5467708866  
-0.6056564595  
-0.6653347826  
-0.7184093739  
-0.7584681402  
-0.7807774968  
-0.7826974472  
-0.7638145695  
-0.7257792182  
-0.6719069062  
-0.6065986282  
-0.5346645359  
-0.4606373658  
-0.3881632136  
-0.3195316255  
-0.255418986  
-0.1948592563  
-0.1354803264  
-0.07393956244  
-0.006554849538  
0.06998508013  
0.1579087666  
0.2577563914  
0.3679755391  
0.484795782  
0.6024082834  
0.7134496925  
0.8097475543  
0.8832248628  
0.9268607696  
0.9355741961  
0.9069154241  
0.8414609564  
0.7428709972  
0.6175755541  
0.4741392131  
0.3223753418  
0.1723284278  
0.03324800955  
-0.08730457957  
-0.1841115757  
-0.2546208862  
-0.2989203167  
-0.3193538232  
-0.3198875387  
-0.3052988679  
-0.2803520271  
-0.2490873084  
-0.2143425059  
-0.1775909211  
-0.1390858092  
-0.09829946298  
-0.0545228845  
-0.007508123602  
0.04201644534  
0.09207928821  
0.1395352412  
0.180494412  
0.2110433087  
0.2281330431  
0.2304527695  
0.2190892742  
0.1978001665  
0.1727846469  
0.1519200658  
0.1435455305  
0.1549696645  
0.1909427181  
0.2523938982  
0.3356788322  
0.432544982  
0.5308958251  
0.6162908009  
0.6739903162  
0.6912344913  
0.6593961058  
0.5756268093  
0.4437014868  
0.2738874645  
0.08182195872  
-0.1134525358  
-0.2920034893  
-0.4356735194  
-0.530497723  
-0.5685025614  
-0.5486098113  
-0.4765595699  
-0.3638807631  
-0.2261042645  
-0.08052413136  
0.05614272914  
0.1698655999  
0.2508808595  
0.2945710315  
0.301585798  
0.2772437869  
0.230372647  
0.1718094036  
0.1127819132  
0.0634153897  
0.03155065757  
0.02197847797  
0.0361713622  
0.0724635442  
0.1266278552  
0.1927175834  
0.2640246499  
0.334027155  
0.3971808353  
0.4494643061  
0.4886246515  
0.5141176038  
0.5267666368  
0.5282362374  
0.5204169728  
0.5048329217  
0.4821936102  
0.4521608896  
0.4133968929  
0.3638673782  
0.3013721425  
0.2241863951  
0.1317068461  
0.02497232188  
-0.09305454049  
-0.217502968  
-0.3419257149  
-0.4589044393  
-0.5608290482  
-0.6407413558  
-0.6930973347  
-0.7143501971  
-0.7032732425  
-0.6610098267  
-0.5908710516  
-0.4979605479  
-0.3887016309  
-0.2703698605  
-0.1506649153  
-0.0373813064  
0.0618723129  
0.1399029229  
0.1902011307  
0.2072671712  
0.1870155492  
0.127242202  
0.0280837499  
-0.1076025492  
-0.2740599659  
-0.4627057095  
-0.6625394934  
-0.8608593987  
-1.044248882  
-1.199726187  
-1.315916907  
-1.384101201  
-1.39900934  
-1.359251083  
-1.267349934  
-1.129365115  
-0.9541954007  
-0.7526397244  
-0.5363653217  
-0.3168960651  
-0.1047449386  
0.09122323728  
0.2641747178  
0.4094044079  
0.5242016419  
0.6075332796  
0.6596326544  
0.6815592842  
0.6748305945  
0.6411679227  
0.5823942058  
0.5005064656  
0.3978687746  
0.277507631  
0.1433949355  
0.0006686116007  
-0.1443106778  
-0.2841146727  
-0.4106363551  
-0.5157098364  
-0.5918822706  
-0.6332644583  
-0.6363345783  
-0.6005622909  
-0.5287617315  
-0.427058599  
-0.3044632388  
-0.1720263943  
-0.04167944907  
0.07514323491  
0.1689157672  
0.2332956092  
0.2660430712  
0.2694577275  
0.2501981344  
0.2184729282  
0.1866681753  
0.1675570599  
0.1723477587  
0.208821078  
0.2798813954  
0.3827372634  
0.5088993219  
0.6450417673  
0.7746560987  
0.8802961957  
0.9461104496  
0.9603169849  
0.9172433603  
0.8186316311  
0.6739730013  
0.4997975017  
0.3179740516  
0.1532071934  
0.03004811838  
-0.03020971494  
-0.01234416553  
0.0906306981  
0.2762426118  
0.5324419659  
0.8386307029  
1.167737708  
1.489084065  
1.771745449  
1.987995483  
2.11643082  
2.144407157  
2.069495941  
1.899759011  
1.652808737  
1.3537257  
1.032086833  
0.7184317317  
0.4405853731  
0.2202991598  
0.0706196105  
-0.00566150806  
-0.01625361253  
0.02174521464  
0.08421756492  
0.1433842417  
0.171727586  
0.145978974  
0.05065333594  
-0.1193917598  
-0.3577202392  
-0.6466559634  
-0.9591855626  
-1.262254545  
-1.521025425  
-1.70358387  
-1.785437608  
-1.753198764  
-1.606900117  
-1.360590315  
-1.041056976  
-0.6848044515  
-0.3336379076  
-0.02942014351  
0.1912962248  
0.3020555001  
0.2900021143  
0.1576491281  
-0.07740785956  
-0.3847703441  
-0.7252546065  
-1.056092618  
-1.336613499  
-1.533629574  
-1.625783402  
-1.606259944  
-1.483495408  
-1.27979794  
-1.028080105  
-0.7671794863  
-0.5364286863  
-0.370221837  
-0.2933501947  
-0.3177129621  
-0.4408397008  
-0.6463887605  
-0.9065049781  
-1.185665909  
-1.44547761  
-1.649725701  
-1.769020831  
-1.784421938  
-1.689609066  
-1.491354674  
-1.208303609  
-0.8682729257  
-0.5044772159  
-0.1511873357  
0.160579611  
0.4068190311  
0.5732632046  
0.6567739422  
0.6652557513  
0.6161505913  
0.5337263086  
0.4455513817  
0.3786051752  
0.3555451929  
0.3915983963  
0.4924871161  
0.6536444355  
0.8608163969  
1.091965395  
1.320218846  
1.517467052  
1.658128714  
1.722589173  
1.699834248  
1.588959536  
1.399345692  
1.149509621  
0.8647941628  
0.574251376  
0.3071351734  
0.08948560399  
-0.05875328387  
-0.1257417363  
-0.1086639134  
-0.01352550463  
0.1460763981  
0.3509557265  
0.5788156447  
0.8068351608  
1.014058148  
1.183317749  
1.302527636  
1.365269305  
1.370704268  
1.322893973  
1.229680317  
1.101311553  
0.9489854062  
0.7834821688  
0.6140461719  
0.4476232285  
0.2885101672  
0.1384630908  
-0.002808515007  
-0.1368376517  
-0.2654262844  
-0.3896877145  
-0.5092591407  
-0.6218565824  
-0.7232618603  
-0.8077700038  
-0.8690421344  
-0.9012372071  
-0.9002143816  
-0.8646022629  
-0.7965158295  
-0.7017603418  
-0.5894545558  
-0.4710899145  
-0.3591338474  
-0.2654009099  
-0.1994279515  
-0.1671326771  
-0.1699610574  
-0.204697236  
-0.2639575572  
-0.3373170948  
-0.4128728086  
-0.4790054215  
-0.5260312578  
-0.5474796032  
-0.5407800335  
-0.5072478596  
-0.451381759  
-0.3796261939  
-0.2988192415  
-0.2146469918  
-0.1304007859  
-0.04630665588  
0.04042939575  
0.1348282794  
0.2427166952  
0.3689523485  
0.5156155394  
0.680543918  
0.8565589353  
1.031586117  
1.189747688  
1.313324309  
1.385306361  
1.392117534  
1.326069067  
1.187077198  
0.9833362935  
0.730741063  
0.4511141044  
0.1694733799  
-0.08927087573  
-0.3036598433  
-0.4585695065  
-0.5471556391  
-0.5715631576  
-0.5422910098  
-0.4762966778  
-0.394172554  
-0.3168194423  
-0.2621597474  
-0.242414013  
-0.2623494831  
-0.3187891146  
-0.4014316872  
-0.4948407172  
-0.5812794035  
-0.643904035  
-0.6698111471  
-0.6524226802  
-0.5928399357  
-0.4999280391  
-0.3891404252  
-0.280273597  
-0.1945228949  
-0.1513285287  
-0.1654828765  
-0.2449650907  
-0.3897712107  
-0.5918731379  
-0.8362356402  
-1.102652807  
-1.368082792  
-1.609101436  
-1.804143132  
-1.935288568  
-1.989469555  
-1.959083532  
-1.842106684  
-1.641842886  
-1.366448169  
-1.028341797  
-0.6435364022  
-0.2308808452  
0.18883947  
0.5940158295  
0.9635539064  
1.278405533  
1.523168544  
1.687555059  
1.767502396  
1.765688381  
1.691297071  
1.558965036  
1.387002791  
1.195106282  
1.001893187  
0.8226626185  
0.6677404999  
0.5417150836  
0.4436924554  
0.3685331495  
0.3088386554  
0.2572980323  
0.2089372215  
0.1627982211  
0.1226785946  
0.09672879355  
0.09592088648  
0.1316441688  
0.2128543117  
0.3433378318  
0.5196385431  
0.7301404874  
0.9555449482  
1.170793764  
1.348160801  
1.46105138  
1.487860829  
1.415261449  
1.240332561  
0.9711871567  
0.6259883636  
0.2305519363  
-0.1850314102  
-0.5901749411  
-0.9573370565  
-1.264776947  
-1.49816194  
-1.650901539  
-1.723334893  
-1.721117325  
-1.65326488  
-1.530338064  
-1.363135341  
-1.162116568  
-0.9375187523  
-0.6999607539  
-0.4611436303  
-0.2342516014  
-0.03369764562  
0.1259786587  
0.2319934981  
0.275710297  
0.2550420639  
0.1762989082  
0.0549056155  
-0.08538553193  
-0.2149243408  
-0.3020517592  
-0.3179096566  
-0.2414486006  
-0.06373711897  
0.2092452207  
0.5559727818  
0.9411849258  
1.320029325  
1.644033646  
1.868022326  
1.956926368  
1.891387483  
1.671235182  
1.316213361  
0.8637754183  
0.3642405661  
-0.1259868512  
-0.5521263155  
-0.8684715073  
-1.044491692  
-1.068660679  
-0.9495015055  
-0.713730918  
-0.4018835163  
-0.06213352452  
0.2566921219  
0.5118300702  
0.6720387439  
0.721049997  
0.6586117093  
0.4991219426  
0.2682292582  
-0.001932811834  
-0.2780132321  
-0.5303551208  
-0.7367819423  
-0.8847481376  
-0.9716313718  
-1.003291784  
-0.9912959539  
-0.949421783  
-0.8901527206  
-0.8218220912  
-0.7469355265  
-0.6619647438  
-0.5586004525  
-0.4262177608  
-0.2550362555  
-0.03936660642  
0.2197200949  
0.5128442889  
0.8222529641  
1.1233406  
1.387543941  
1.586202041  
1.694725631  
1.696403285  
1.585172388  
1.366896056  
1.058886884  
0.6877362879  
0.2857986149  
-0.1131205258  
-0.4781628852  
-0.7852210768  
-1.01954289  
-1.176778984  
-1.262358354  
-1.289399903  
-1.275562329  
-1.239452482  
-1.197227109  
-1.159958816  
-1.132216743  
-1.112014239  
-1.092072603  
-1.062083273  
-1.011493911  
-0.9322564052  
-0.8209998807  
-0.6802208337  
-0.5182607467  
-0.3480787821  
-0.1850582833  
-0.04423211746  
0.06254175659  
0.1289482451  
0.155676721  
0.1506991424  
0.1282799482  
0.1068586593  
0.1061378158  
0.143859269  
0.2327762725  
0.3783313743  
0.5774195964  
0.8184308109  
1.082564844  
1.346214842  
1.584028316  
1.772176098  
1.891334317  
1.928945063  
1.880481101  
1.749573538  
1.54710024  
1.289440588  
0.9962592163  
0.6881790112  
0.3847005393  
0.1026158797  
-0.144943925  
-0.3488553596  
-0.5038440994  
-0.6080282243  
-0.6623665572  
-0.6701805455  
-0.6368442672  
-0.56964246  
-0.4777122799  
-0.3719043852  
-0.2644395725  
-0.1682234998  
-0.09578485837  
-0.05791973752  
-0.06219858611  
-0.1115901973  
-0.2034885698  
-0.3293896935  
-0.4754000783  
-0.623601342  
-0.7541822444  
-0.8480622788  
-0.8896413139  
-0.86924929  
-0.7848826108  
-0.6429055005  
-0.4575564823  
-0.2492699398  
-0.04204395308  
0.13978007  
0.2748359239  
0.3476413609  
0.3506584942  
0.2851972848  
0.161041845  
-0.005101718696  
-0.1920695791  
-0.3772054087  
-0.5393573729  
-0.6614547964  
-0.7323341845  
-0.7475779444  
-0.7093742049  
-0.6254973343  
-0.507681929  
-0.3697096973  
-0.2255328949  
-0.08772446708  
0.0335785484  
0.1311689649  
0.2007402594  
0.2404881535  
0.2505132984  
0.2322244086  
0.1878930128  
0.1204519985  
0.03353527494  
-0.0683044586  
-0.1793229136  
-0.292408997  
-0.3991471066  
-0.490184738  
-0.5559510548  
-0.5876335832  
-0.5783111411  
-0.5240439922  
-0.4247327803  
-0.2845883339  
-0.1120764163  
0.08068044004  
0.2790102273  
0.4671751382  
0.6300482696  
0.7547708876  
0.8321775622  
0.8578185407  
0.8324486115  
0.7619421895  
0.6566454824  
0.5302644804  
0.3984017526  
0.2769184464  
0.1802883198  
0.1201018412  
0.1038516426  
0.134116976  
0.2081921451  
0.3181998899  
0.4516891367  
0.5926450243  
0.7228845004  
0.823722265  
0.8777985936  
0.8709399041  
0.7939070274  
0.6438662697  
0.4254289021  
0.1510944166  
-0.159021825  
-0.4782675117  
-0.7753443545  
-1.016958144  
-1.17103762  
-1.210250405  
-1.11546086  
-0.8786949837  
-0.5051935681  
-0.0141699434  
0.5619767413  
1.180078196  
1.790113853  
2.340263756  
2.782545982  
3.078352023  
3.203131055  
3.149552454  
2.928644595  
2.568644964  
2.111653339  
1.608448915  
1.11216579  
0.6716617408  
0.3254982851  
0.09737412391  
-0.006367332972  
0.003167666067  
0.09969366894  
0.2459921036  
0.3994782315  
0.5182360157  
0.5666516961  
0.5198685936  
0.3664909719  
0.1092896438  
-0.2360636013  
-0.6438668069  
-1.082315098  
-1.517817794  
-1.919035323  
-2.260099177  
-2.522650932  
-2.696588621  
-2.779631614  
-2.775988433  
-2.694530057  
-2.546898097  
-2.34589526  
-2.10439661  
-1.834857038  
-1.549343266  
-1.259877248  
-0.9788489046  
-0.7192140573  
-0.4943063839  
-0.3171546976  
-0.1993457487  
-0.149585713  
-0.1722088706  
-0.2659013155  
-0.4229278549  
-0.6290517443  
-0.864269385  
-1.104342033  
-1.322995779  
-1.494572773  
-1.59681743  
-1.613479297  
-1.536416058  
-1.366911412  
-1.116030925  
-0.8039081065  
-0.4579905174  
-0.1103859615  
0.2054689237  
0.4584559433  
0.6233857286  
0.6841425862  
0.635991184  
0.4867171261  
0.2564135483  
-0.02417162505  
-0.3166213134  
-0.5788829401  
-0.76997069  
-0.8547713958  
-0.8084269965  
-0.6196964681  
-0.292882824  
0.1519976619  
0.6808708987  
1.248943116  
1.805355631  
2.298613795  
2.682145354  
2.919322853  
2.987344077  
2.879539293  
2.605829416  
2.19134793  
1.673420196  
1.097304762  
0.5112401423  
-0.03860902432  
-0.5127274089  
-0.881839509  
-1.129162247  
-1.251148255  
-1.256706193  
-1.165101629  
-1.002849639  
-0.8000195829  
-0.5864216809  
-0.3881168918  
-0.2246365555  
-0.1071894876  
-0.03801488363  
-0.0108736498  
-0.01257755027  
-0.02529971308  
-0.02936145893  
-0.006131331255  
0.05932393152  
0.1761458189  
0.3463894597  
0.5646696881  
0.8187561064  
1.091043057  
1.360678083  
1.606092929  
1.807612923  
1.949811734  
2.02331884  
2.025835832  
1.962239537  
1.843727717  
1.686121007  
1.50754087  
1.325766326  
1.155654035  
1.006995553  
0.8831350223  
0.7805987961  
0.6898222124  
0.5968995376  
0.4861336145  
0.3430133911  
0.1571722703  
-0.07514540875  
-0.3495139464  
-0.652970853  
-0.9649623202  
-1.259553672  
-1.508603947  
-1.685502617  
-1.76893845  
-1.746133158  
-1.615069051  
-1.385328098  
-1.077375975  
-0.7203294756  
-0.3484864123  
0.002943797932  
0.3023099736  
0.5255743977  
0.6593601566  
0.7025416894  
0.6661351376  
0.5714746093  
0.4469193461  
0.3235380065  
0.23040098  
0.1901179132  
0.2152860373  
0.3063293171  
0.4510366968  
0.6258586337  
0.7987718528  
0.9332993357  
0.9931495523  
0.9468600499  
0.7718653986  
0.4575237916  
0.006791926646  
-0.5635648045  
-1.224169764  
-1.935415726  
-2.650717591  
-3.320296639  
-3.895126274  
-4.330750609  
-4.590719427  
-4.64945046  
-4.494367283  
-4.127196675  
-3.564329639  
-2.836154009  
-1.985332044  
-1.064021571  
-0.1301594708  
0.7569863732  
1.541655377  
2.176393969  
2.62629735  
2.872223794  
2.912501613  
2.762903225  
2.45475589  
2.03140461  
1.543386251  
1.042925774  
0.5784370793  
0.1897144812  
-0.09557330163  
-0.2637088985  
-0.3149264126  
-0.2616999254  
-0.125699254  
0.06605689471  
0.2852430609  
0.50586914  
0.7070656379  
0.8747233976  
1.001913484  
