0.0767209302  
-0.05574439038  
-0.1667100188  
-0.236955955  
-0.2516256228  
-0.2019867183  
-0.08659299127  
0.08827720393  
0.3089883037  
0.5556977064  
0.8041913637  
1.028250771  
1.202295772  
1.304046063  
1.31690226  
1.23179167  
1.048252082  
0.7746270234  
0.4273267536  
0.02922284792  
-0.3926421614  
-0.809788532  
-1.195146517  
-1.525697296  
-1.784595531  
-1.962528943  
-2.058184341  
-2.077783548  
-2.033794672  
-1.943013726  
-1.824283711  
-1.696153998  
-1.574763272  
-1.472188978  
-1.395407857  
-1.345961536  
-1.320283844  
-1.310621005  
-1.306382279  
-1.295752721  
-1.267376943  
-1.211921653  
-1.123368769  
-0.9998896677  
-0.84421684  
-0.6634662572  
-0.4684219687  
-0.2723549635  
-0.08950073096  
0.06662021557  
0.184839388  
0.2577182346  
0.2824823511  
0.2613824038  
0.2014139504  
0.1134424393  
0.01084010658  
-0.0921769704  
-0.1822753969  
-0.2485654329  
-0.2837814777  
-0.2849432236  
-0.2534163844  
-0.1944189958  
-0.1160493441  
-0.02802179503  
0.05970728747  
0.1382222395  
0.2006818766  
0.2429870921  
0.2640441847  
0.265634875  
0.2519734833  
0.2290400324  
0.2038166491  
0.1835218467  
0.1749174251  
0.183735556  
0.2142275106  
0.2688346727  
0.3479522828  
0.4497770897  
0.5702470097  
0.7030899954  
0.8400304703  
0.9711874837  
1.085697828  
1.172575162  
1.221745078  
1.225187558  
1.178043792  
1.079544105  
0.9335872852  
0.7488508057  
0.5383303929  
0.3183214185  
0.1068832397  
-0.07803434316  
-0.2205985416  
-0.3089734886  
-0.3368000906  
-0.3040508219  
-0.2170913426  
-0.08789734958  
0.06752047221  
0.23129693  
0.3862194772  
0.5182040774  
0.6183735668  
0.6843910634  
0.720810008  
0.7383203492  
0.7519580255  
0.7784845567  
0.8333169763  
0.927471093  
1.065014991  
1.241477552  
1.443545715  
1.650181698  
1.835085693  
1.970200687  
2.029786173  
1.994438062  
1.854440977  
1.611879213  
1.281118987  
0.8875044576  
0.4643647652  
0.04874443913  
-0.3235692979  
-0.6229822527  
-0.8302402321  
-0.9391435845  
-0.9573801448  
-0.9053148258  
-0.8128801898  
-0.7150108954  
-0.6462881104  
-0.6355924093  
-0.701570584  
-0.8496004955  
-1.070712875  
-1.342645339  
-1.632869746  
-1.903156283  
-2.114992459  
-2.235089546  
-2.240151434  
-2.120263086  
-1.880414817  
-1.539992837  
-1.130339648  
-0.6907802762  
-0.2636903852  
0.1106817626  
0.3989387802  
0.578202334  
0.6382926051  
0.5822258033  
0.4250827772  
0.1915123896  
-0.08771109624  
-0.3795502435  
-0.6524724513  
-0.8796671954  
-1.041377451  
-1.126166205  
-1.131081835  
-1.060853112  
-0.9263173484  
-0.7423914593  
-0.5258839006  
-0.2934453036  
-0.05989524351  
0.1628969924  
0.3665253453  
0.545945399  
0.698880137  
0.8248873712  
0.9243083173  
0.9973037893  
1.043180413  
1.060137665  
1.045487508  
0.9963143765  
0.9104453229  
0.7875358428  
0.6300407285  
0.443853493  
0.2384308818  
0.02632196805  
-0.1778755593  
-0.3590196881  
-0.5031511429  
-0.5991971451  
-0.6403659034  
-0.6250072286  
-0.5568085148  
-0.4442822165  
-0.2996353833  
-0.1372026597  
0.02832356094  
0.1835948912  
0.3180148046  
0.4246791213  
0.500743683  
0.5472316213  
0.5683395562  
0.5703847087  
0.5605520427  
0.5456442236  
0.5309762674  
0.519588789  
0.5118692659  
0.5056399918  
0.4967127721  
0.4798366391  
0.4499239314  
0.4033591446  
0.3391800143  
0.2599128475  
0.1718475561  
0.08463866553  
0.01019864581  
-0.03903486614  
-0.05221651044  
-0.02229272767  
0.05210810534  
0.1654640438  
0.305129572  
0.4522402014  
0.5837343681  
0.6752663633  
0.704630447  
0.6551736385  
0.5186810416  
0.2972282128  
0.003682145342  
-0.3392852951  
-0.7015817453  
-1.049157816  
-1.348061659  
-1.568546748  
-1.688640216  
-1.696730778  
-1.592839087  
-1.388467433  
-1.105085312  
-0.7715161075  
-0.4205804094  
-0.08543152281  
0.2039722312  
0.4238836681  
0.5589614988  
0.6034563584  
0.5613304314  
0.4453356997  
0.2752182429  
0.07525895314  
-0.1285500487  
-0.311397597  
-0.4522874564  
-0.536137105  
-0.5551227594  
-0.5091226583  
-0.4052333249  
-0.2564353431  
-0.07959465327  
0.1069252977  
0.2857130583  
0.4424681186  
0.567591732  
0.6569548433  
0.7117759432  
0.7376192002  
0.7427213019  
0.7359183852  
0.7245618539  
0.7127893223  
0.7004846309  
0.6831370132  
0.6526420446  
0.5989356581  
0.5121595279  
0.3849804904  
0.2146209059  
0.004215133569  
-0.2367808494  
-0.4932334434  
-0.7459443012  
-0.9739745493  
-1.157311936  
-1.279448712  
-1.329481436  
-1.303432461  
-1.204625992  
-1.04312473  
-0.8343617788  
-0.5972215719  
-0.3518606749  
-0.1175916218  
0.0889295904  
0.2550143762  
0.3726807067  
0.4388116879  
0.4548296624  
0.4260209179  
0.3606573158  
0.2690684548  
0.1627731121  
0.05372519679  
-0.04631478165  
-0.1263269204  
-0.1765510155  
-0.1890387439  
-0.1582708059  
-0.08180362038  
0.03912059891  
0.1991417817  
0.3886672292  
0.5942258222  
0.7993650018  
0.9860915655  
1.136753197  
1.236138122  
1.273515868  
1.244284583  
1.150944521  
1.003161442  
0.8168527241  
0.6123606023  
0.4119284182  
0.2368331928  
0.1045930476  
0.02666542499  
0.006989245385  
0.04160642389  
0.1194067086  
0.2238974213  
0.3357006391  
0.4354025675  
0.5063013737  
0.5366500367  
0.5210531391  
0.4608445175  
0.3634376946  
0.2407915648  
0.1073054542  
-0.02249710767  
-0.1360945115  
-0.2245721421  
-0.2834780787  
-0.3128586154  
-0.3165439855  
-0.3008997996  
-0.2733368364  
-0.2408843355  
-0.2091134183  
-0.1815805505  
-0.1598373199  
-0.143937226  
-0.1332503673  
-0.1273333301  
-0.1266121661  
-0.1326744934  
-0.1480730634  
-0.1756701723  
-0.2176574628  
-0.2745029704  
-0.3440766065  
-0.4212219816  
-0.4979292272  
-0.5641606805  
-0.6092059009  
-0.6233670625  
-0.5996305374  
-0.5350231687  
-0.4313598833  
-0.2952298737  
-0.1372070325  
0.02958908596  
0.1913120159  
0.3352783658  
0.4515991688  
0.5343049301  
0.5818071577  
0.5966785663  
0.5848490615  
0.5544035609  
0.5142033037  
0.4725673141  
0.4361752537  
0.4093199375  
0.3935312629  
0.3875605499  
0.3876407008  
0.3879579889  
0.3812374593  
0.3594072164  
0.3143002716  
0.2383825407  
0.12551066  
-0.02831281928  
-0.2242247517  
-0.4598973293  
-0.7291587786  
-1.02194233  
-1.324660835  
-1.621061466  
-1.893544885  
-2.124848001  
-2.299913442  
-2.407684192  
-2.442567537  
-2.405289977  
-2.302965254  
-2.148290192  
-1.957930573  
-1.750290329  
-1.542980437  
-1.350371094  
-1.181615316  
-1.039479792  
-0.9201845351  
-0.8143122931  
-0.7086557842  
-0.588716615  
-0.4414641538  
-0.2578998169  
-0.03500197836  
0.2232736931  
0.5061270734  
0.7971613215  
1.076575841  
1.323960836  
1.521254527  
1.655405038  
1.720316991  
1.717791087  
1.657289683  
1.554604137  
1.429589015  
1.303351495  
1.195284258  
1.120405303  
1.087372382  
1.097448297  
1.144556827  
1.216370925  
1.296278539  
1.365904742  
1.40783168  
1.408125065  
1.358337272  
1.256708133  
1.108457254  
0.925126824  
0.7231159492  
0.5216111248  
0.3401900403  
0.1964200171  
0.1037318235  
0.06981828068  
0.09573150967  
0.1757597501  
0.2980841605  
0.4461176055  
0.6003724849  
0.7406401248  
0.8482395643  
0.9080828257  
0.9103345555  
0.8514792073  
0.734671382  
0.5693324083  
0.3700400194  
0.1548326336  
-0.0568558342  
-0.2463943012  
-0.3980018727  
-0.5003983167  
-0.5478545618  
-0.5405195577  
-0.4840189864  
-0.3884103791  
-0.2666917736  
-0.1331006666  
-0.001475801249  
0.1160927454  
0.2101630224  
0.274341931  
0.3052373122  
0.3020885356  
0.2662779749  
0.200873226  
0.1103491639  
0.0005159518888  
-0.1214059507  
-0.2466909081  
-0.3651732047  
-0.4656375279  
-0.5366242742  
-0.5676504532  
-0.5507127518  
-0.4818571869  
-0.3625053165  
-0.200250772  
-0.008874714433  
0.1925429436  
0.3814071947  
0.534093719  
0.6288437164  
0.6486428806  
0.5836758368  
0.4329661095  
0.2049293561  
-0.08326063552  
-0.4074558289  
-0.7392194626  
-1.04906833  
-1.30984342  
-1.499765391  
-1.604801512  
-1.620064789  
-1.55011614  
-1.408188617  
-1.214474201  
-0.993739622  
-0.772554278  
-0.5764703657  
-0.4274286517  
-0.3416357304  
-0.3280723296  
-0.3877349736  
-0.5136261948  
-0.6914779071  
-0.9011184976  
-1.118374871  
-1.317357024  
-1.472939214  
-1.563244934  
-1.57191121  
-1.489901174  
-1.316673988  
-1.060529146  
-0.7380389772  
-0.3725533272  
0.008106689776  
0.3745580071  
0.699035037  
0.9584668441  
1.137034592  
1.227866202  
1.233602051  
1.165726823  
1.042746262  
0.8874407973  
0.7235920899  
0.5726596273  
0.4508879763  
0.3672840861  
0.3227593629  
0.3105558739  
0.3178802896  
0.3284739589  
0.3256970851  
0.2956404978  
0.2297406415  
0.1264947047  
-0.008006352926  
-0.1608108944  
-0.3139754522  
-0.4472606311  
-0.5412315495  
-0.5802636948  
-0.5550099679  
-0.4639590492  
-0.3138868441  
-0.1191526147  
0.1000256489  
0.32007466  
0.517006784  
0.6694123779  
0.7611574151  
0.7834538801  
0.7360614196  
0.6274652307  
0.4739867308  
0.297883911  
0.1246399794  
-0.0202670211  
-0.1147116779  
-0.1429418411  
-0.09781968868  
0.01808107233  
0.192757992  
0.4064496572  
0.6345101801  
0.851045642  
1.032754735  
1.162332609  
1.230852797  
1.23872378  
1.195052126  
1.11554959  
1.019374041  
0.925520977  
0.84944433  
0.8005383477  
0.7809431939  
0.7858617671  
0.8052661419  
0.826593103  
0.8378238457  
0.8302868291  
0.8005550287  
0.7510503772  
0.6892102012  
0.6254136332  
0.5701171892  
0.5308482736  
0.5097368038  
0.5021824815  
0.4970113206  
0.4781901859  
0.4278196364  
0.3298694621  
0.1739118949  
-0.04188885451  
-0.3091864044  
-0.6096516742  
-0.9170261348  
-1.200740318  
-1.430505889  
-1.581107384  
-1.636545117  
-1.592815933  
-1.458830843  
-1.255304899  
-1.011810493  
-0.7624769945  
-0.5410501267  
-0.3761124199  
-0.2871924003  
-0.2823360404  
-0.3574290486  
-0.4972768671  
-0.6781600751  
-0.8713850961  
-1.047243327  
-1.17878063  
-1.244896851  
-1.232444213  
-1.137204929  
-0.9637944383  
-0.7246889137  
-0.4386488874  
-0.1287986595  
0.179395908  
0.4601114926  
0.6890373398  
0.8451076197  
0.9120913888  
0.8800130434  
0.7462981564  
0.516530013  
0.2046124354  
-0.1678102892  
-0.5727783908  
-0.978277729  
-1.351170386  
-1.660490664  
-1.880688919  
-1.994375302  
-1.994131793  
-1.883121806  
-1.674369171  
-1.38882166  
-1.052501949  
-0.6931936022  
-0.3371699061  
-0.006454320847  
0.2830337316  
0.5222545834  
0.7087585667  
0.8455189027  
0.9392118354  
0.9983136893  
1.031370284  
1.045701659  
1.04669006  
1.037645812  
1.020160995  
0.9947591888  
0.9616420381  
0.9213552654  
0.8752422838  
0.8256372689  
0.7757987456  
0.7296411443  
0.6913375568  
0.6648728428  
0.6535832418  
0.6597284743  
0.6840938508  
0.7256303439  
0.7811538888  
0.8451439611  
0.9097080292  
0.9648052846  
0.9988113812  
0.9994968898  
0.9554101981  
0.8575972701  
0.7014894716  
0.4886853215  
0.228322345  
-0.06232017058  
-0.3582686125  
-0.6285418014  
-0.8390778144  
-0.9567121441  
-0.9537633753  
-0.8126462431  
-0.5297887897  
-0.1181617788  
0.3921817168  
0.9558725125  
1.516334219  
2.01186867  
2.383024411  
2.580284051  
2.570976148  
2.344367424  
1.914087131  
1.317409656  
0.6113684316  
-0.1338511453  
-0.8433730734  
-1.446782334  
-1.886700135  
-2.125589044  
-2.149860567  
-1.970756505  
-1.621958506  
-1.154340862  
-0.6286983073  
-0.1075270685  
0.3529562363  
0.7094475172  
0.9359896402  
1.02569165  
0.9896665917  
0.853501952  
0.6519501687  
0.4227517731  
0.2005768542  
0.012006269  
-0.127748056  
-0.2159888942  
-0.2615325319  
-0.2818632096  
-0.2990603839  
-0.3352473841  
-0.4083595957  
-0.5289133418  
-0.6982408947  
-0.9083916997  
-1.14358019  
-1.382829877  
-1.603277926  
-1.783545247  
-1.906620549  
-1.961844419  
-1.945782406  
-1.861999072  
-1.719926937  
-1.533158544  
-1.317564812  
-1.089574926  
-0.8648791196  
-0.657672759  
-0.4803906227  
-0.3437771185  
-0.2570468831  
-0.2279032744  
-0.2622105882  
-0.3632570894  
-0.5306647207  
-0.7591495604  
-1.037420942  
-1.347581735  
-1.665326355  
-1.961166755  
-2.202722745  
-2.357933043  
-2.398843882  
-2.305470131  
-2.069141246  
-1.694754414  
-1.20146253  
-0.6215415248  
0.002565960525  
0.6227343963  
1.190611062  
1.663310742  
2.008531719  
2.208352147  
2.261142849  
2.181320342  
1.996992602  
1.745859566  
1.470020708  
1.210436291  
1.001857387  
0.8689167358  
0.8238483146  
0.8660599154  
0.9834733046  
1.155303109  
1.355760416  
1.558057498  
1.738113814  
1.877461348  
1.964995589  
1.997454331  
1.978681372  
1.917946106  
1.827682513  
1.721081231  
1.609931981  
1.503038055  
1.405389444  
1.318133423  
1.239239389  
1.164663074  
1.08973835  
1.010523625  
0.9248776073  
0.8330801983  
0.7379361456  
0.6443618898  
0.5585457134  
0.4868264189  
0.4344732291  
0.404550323  
0.3970548389  
0.4084747562  
0.4318589159  
0.4574474118  
0.4738166692  
0.4694260587  
0.4343724272  
0.362120342  
0.2509120472  
0.1046280088  
-0.06712762138  
-0.249797528  
-0.4254768674  
-0.5751797087  
-0.6814682067  
-0.7310646272  
-0.7170275668  
-0.6401182812  
-0.5091004418  
-0.3398544342  
-0.1533999854  
0.02691182806  
0.1786260861  
0.2833285533  
0.3292167783  
0.3126723593  
0.2385674798  
0.119250842  
-0.02766251326  
-0.1823420305  
-0.3261747793  
-0.4450290353  
-0.5318314244  
-0.5880410919  
-0.6237483778  
-0.6563524222  
-0.7079687818  
-0.8019120148  
-0.9587436339  
-1.192464713  
-1.507408744  
-1.896338111  
-2.340064405  
-2.808744486  
-3.264742452  
-3.666739126  
-3.974580142  
-4.154214339  
-4.182063958  
-4.048194049  
-3.757827299  
-3.330962354  
-2.800122932  
-2.206530078  
-1.595225249  
-1.009809617  
-0.4875336745  
-0.05538359803  
0.2723210791  
0.4945540612  
0.6224389279  
0.6765764322  
0.6833351158  
0.6706729648  
0.6641400878  
0.6836070592  
0.7411352253  
0.8402023971  
0.9762627451  
1.138436069  
1.311949134  
1.480888176  
1.630790307  
1.750686059  
1.834318256  
1.880426629  
1.892138463  
1.875668667  
1.838611947  
1.788188454  
1.729755639  
1.665874226  
1.596071364  
1.517324261  
1.425162818  
1.315148968  
1.184460775  
1.033228157  
0.8653794027  
0.6887665318  
0.514526507  
0.3557264327  
0.2255033002  
0.1349912553  
0.09138648038  
0.09649498829  
0.1460355957  
0.229857165  
0.333085325  
0.4380432484  
0.5266855623  
0.5831493348  
0.5960528074  
0.5601409824  
0.4770363731  
0.3549497958  
0.2074056213  
0.05117443113  
-0.0962447907  
-0.2192010189  
-0.3061138029  
-0.3509988626  
-0.3540744257  
-0.3213903055  
-0.2635717342  
-0.1939269575  
-0.1262498367  
-0.0726948412  
-0.04205311466  
-0.03870438848  
-0.06234352904  
-0.108491414  
-0.1696366646  
-0.2367666713  
-0.3010029381  
-0.3550458844  
-0.3942072214  
-0.4168716769  
-0.4243733728  
-0.4203551823  
-0.4097886955  
-0.3978688761  
-0.3890163589  
-0.3861638376  
-0.3904448576  
-0.4012946532  
-0.4168941443  
-0.4348106459  
-0.4526758518  
-0.4687345205  
-0.4821600983  
