0.2536027259  
0.4885824893  
0.7168907265  
0.9311589226  
1.124393167  
1.290302536  
1.423686155  
1.520849702  
1.580009055  
1.601610566  
1.588505719  
1.545911773  
1.481123005  
1.402963858  
1.321022562  
1.244725041  
1.182370153  
1.140233883  
1.121870332  
1.127708444  
1.15500514  
1.198175879  
1.2494584  
1.299834611  
1.340084444  
1.361840795  
1.358513573  
1.325966538  
1.262874994  
1.170733058  
1.053522404  
0.9171007306  
0.7684072483  
0.6145849431  
0.4621474759  
0.3162863183  
0.1804199234  
0.05601635558  
-0.05727753448  
-0.1612436229  
-0.2585007728  
-0.351808448  
-0.443387366  
-0.5343681444  
-0.6244669293  
-0.7119424838  
-0.7938575845  
-0.8665995525  
-0.9265729009  
-0.9709509857  
-0.9983414715  
-1.009242587  
-1.006189791  
-0.9935442674  
-0.9769301071  
-0.9623889848  
-0.9553695065  
-0.959708949  
-0.9767639561  
-1.00483841  
-1.039033004  
-1.071560224  
-1.092526562  
-1.091107151  
-1.056974275  
-0.9818131108  
-0.8607067558  
-0.6932179134  
-0.4839715161  
-0.2426654473  
0.01656399813  
0.2763483603  
0.5177534458  
0.7222060326  
0.873454544  
0.9593149428  
0.9729852992  
0.9137679985  
0.7871062532  
0.6039460924  
0.3795052922  
0.1316094804  
-0.1211902523  
-0.3615028647  
-0.5747578443  
-0.7504672212  
-0.8829557801  
-0.9715103112  
-1.019942374  
-1.03565478  
-1.02833932  
-1.008471061  
-0.9857968595  
-0.9680042007  
-0.9597272617  
-0.9620184552  
-0.9723367159  
-0.9850520178  
-0.9923903925  
-0.985690682  
-0.9567957305  
-0.8993917606  
-0.8101050066  
-0.6892056042  
-0.5408052891  
-0.3725320516  
-0.194710788  
-0.01915753853  
0.142228987  
0.2789005944  
0.3829017935  
0.4497442389  
0.4787989283  
0.4731402426  
0.4388788493  
0.3840921698  
0.3175212144  
0.247238266  
0.1795088477  
0.1180182628  
0.06359483284  
0.01446494743  
-0.03299982495  
-0.0831761024  
-0.1399143575  
-0.2053092597  
-0.2787343127  
-0.3563147644  
-0.4309327535  
-0.4928023399  
-0.5305280756  
-0.5325203814  
-0.4885589542  
-0.3912932611  
-0.2374717951  
-0.0287279791  
0.2281778406  
0.5216955912  
0.8363573144  
1.15407415  
1.455707783  
1.722741407  
1.938867369  
2.091347982  
2.172022703  
2.177889788  
2.111237498  
1.979324023  
1.793669282  
1.569011021  
1.322028214  
1.069925747  
0.8289960258  
0.6132752277  
0.4334061339  
0.2958228212  
0.2023423294  
0.1502199348  
0.1326827807  
0.1398929591  
0.1602361736  
0.1817895546  
0.1937727473  
0.1877956603  
0.1587372943  
0.105134008  
0.02904136838  
-0.0645907536  
-0.1689178316  
-0.276393934  
-0.3799632092  
-0.4740572682  
-0.5552581435  
-0.6225297879  
-0.6770310501  
-0.7215636012  
-0.759795828  
-0.7954170735  
-0.8313744736  
-0.8693271969  
-0.9093944345  
-0.9502184658  
-0.9892951658  
-1.023488179  
-1.049618461  
-1.065009468  
-1.067887269  
-1.057585472  
-1.03452674  
-1.000001635  
-0.9558116545  
-0.9038319888  
-0.8455947718  
-0.7819480078  
-0.7128521353  
-0.6373359696  
-0.5536152614  
-0.4593524832  
-0.3520231136  
-0.2293327454  
-0.08965671712  
0.06756868762  
0.2415203495  
0.4297752515  
0.6282261628  
0.8311477665  
1.031423451  
1.220937248  
1.391112633  
1.533578568  
1.640908893  
1.707372134  
1.729604782  
1.707114898  
1.642526591  
1.541496652  
1.412269494  
1.264884006  
1.110098944  
0.958154331  
0.8175307552  
0.6938656623  
0.5892002789  
0.5016757448  
0.4257505798  
0.3529263744  
0.2729042075  
0.1750307822  
0.0498260845  
-0.1095957866  
-0.3064206394  
-0.539490536  
-0.8031961987  
-1.087926216  
-1.380993813  
-1.667914976  
-1.93386163  
-2.165102292  
-2.350257977  
-2.481229556  
-2.553719542  
-2.567310555  
-2.525147763  
-2.4332941  
-2.299875052  
-2.134141993  
-1.945578816  
-1.743140717  
-1.534710894  
-1.326793403  
-1.12443594  
-0.9313442222  
-0.750117802  
-0.5825324153  
-0.4298033618  
-0.2927623484  
-0.1719275903  
-0.06745653577  
0.02097716498  
0.09434194425  
0.1543754755  
0.2036011181  
0.2452054919  
0.2827373079  
0.3196533404  
0.3587611316  
0.4016427082  
0.4481762229  
0.4962479353  
0.5417641919  
0.5789932752  
0.6012479131  
0.6018260297  
0.5751087372  
0.5176377935  
0.4290071886  
0.3124100756  
0.174720724  
0.0260654269  
-0.121093734  
-0.2532488037  
-0.3573561933  
-0.4223458847  
-0.4404308636  
-0.4080241774  
-0.3261392614  
-0.2002239653  
-0.03944691775  
0.1444408591  
0.3385215199  
0.5301909434  
0.7085088024  
0.8652539669  
0.9955435368  
1.097985745  
1.174358099  
1.228900818  
1.267351246  
1.295862767  
1.31997664  
1.343774573  
1.369315757  
1.396416095  
1.422770893  
1.444381732  
1.456212856  
1.452967727  
1.429890957  
1.383481704  
1.312041264  
1.215989704  
1.097933638  
0.9624777348  
0.8158224357  
0.6651950131  
0.5181940849  
0.3821204695  
0.2633722373  
0.1669736586  
0.09627371238  
0.0528561179  
0.03662645719  
0.04607648992  
0.07864295855  
0.1311143424  
0.1999984409  
0.2817931396  
0.3731174846  
0.4706769569  
0.5710882574  
0.6706046578  
0.7648249621  
0.8484583541  
0.9152528851  
0.9581405158  
0.9696358132  
0.9424870023  
0.8705047129  
0.7494815739  
0.5780499872  
0.3583499897  
0.09636236186  
-0.19818082  
-0.5123384379  
-0.8309308006  
-1.137831428  
-1.417423773  
-1.65603909  
-1.843183979  
-1.972399053  
-2.041640046  
-2.05315161  
-2.012872938  
-1.929484943  
-1.813251561  
-1.674836948  
-1.524257757  
-1.370107437  
-1.219122444  
-1.076111952  
-0.9441977419  
-0.8252738095  
-0.7205657007  
-0.6311616578  
-0.5584069575  
-0.5040962883  
-0.4704265779  
-0.4597381455  
-0.4740962108  
-0.5148097241  
-0.5819740158  
-0.6741340417  
-0.7881346015  
-0.9191875008  
-1.061160999  
-1.207041563  
-1.349506438  
-1.48152896  
-1.59691864  
-1.690741918  
-1.759558852  
-1.801468084  
-1.815969621  
-1.803686707  
-1.766011033  
-1.704734264  
-1.621744544  
-1.518825095  
-1.397598822  
-1.259601967  
-1.106478848  
-0.9402328897  
-0.7634818554  
-0.5796479445  
-0.3930271776  
-0.2087014329  
-0.03228082741  
0.1305046855  
0.2743248034  
0.3948118021  
0.4890957183  
0.5562342604  
0.597471605  
0.6162785787  
0.6181592845  
0.6102283168  
0.6005972824  
0.5976363167  
0.6091829148  
0.6417884913  
0.7000803592  
0.7862984703  
0.9000668763  
1.038389093  
1.195883482  
1.365204725  
1.537614787  
1.703639294  
1.853760453  
1.979097924  
2.072044622  
2.126829746  
2.139986601  
2.110703192  
2.041028046  
1.935888994  
1.802897873  
1.651888137  
1.494193303  
1.341667966  
1.205519181  
1.095057977  
1.016519296  
0.9721235592  
0.9595537472  
0.9719851818  
0.9987371917  
1.026531194  
1.041235404  
1.029883699  
0.9826904222  
0.8947465187  
0.7671138356  
0.6071103269  
0.427675342  
0.2458688425  
0.08068934714  
-0.04948892071  
-0.1294773574  
-0.1494493042  
-0.1063915553  
-0.004605236419  
0.1448145205  
0.3254368907  
0.5176616776  
0.701245882  
0.857806467  
0.9729290827  
1.03758865  
1.048707294  
1.008835313  
0.9250541158  
0.8073512732  
0.666741273  
0.5134790572  
0.3556164338  
0.1981301437  
0.04269914271  
-0.1118763788  
-0.2687396391  
-0.4317287727  
-0.604052513  
-0.7871366317  
-0.9798367377  
-1.178154112  
-1.375491479  
-1.56340702  
-1.73272613  
-1.874844222  
-1.98298878  
-2.053263352  
-2.085293646  
-2.082385237  
-2.051161941  
-2.000739603  
-1.94153734  
-1.883897044  
-1.836685604  
-1.806062464  
-1.794574584  
-1.800686688  
-1.818812823  
-1.839853818  
-1.852173805  
-1.842924879  
-1.79956421  
-1.711405425  
-1.571022284  
-1.375362158  
-1.126415513  
-0.8313818818  
-0.5022815623  
-0.1550538105  
0.191771776  
0.5186925423  
0.8069630551  
1.040250898  
1.206037004  
1.296615311  
1.309594228  
1.247869602  
1.119096907  
0.9347570018  
0.7089432302  
0.4570213837  
0.1943245118  
-0.06499926279  
-0.3088726536  
-0.5278676605  
-0.7154525662  
-0.8679451844  
-0.984224582  
-1.065276024  
-1.113652766  
-1.132922964  
-1.127169944  
-1.100581985  
-1.057149749  
-1.00047632  
-0.9336797239  
-0.859363502  
-0.7796294183  
-0.6960975798  
-0.6099316971  
-0.5218458811  
-0.4321092582  
-0.3405594758  
-0.246639709  
-0.1494795333  
-0.04803468642  
0.05871714017  
0.1715316824  
0.2906306154  
0.4154369768  
0.5443692735  
0.6747183218  
0.8026541161  
0.9233825629  
1.031455269  
1.121222693  
1.187390924  
1.225630973  
1.233173572  
1.209308478  
1.155727087  
1.076641709  
0.9786445925  
0.8702988891  
0.7614829634  
0.6625375824  
0.5833012205  
0.5321334514  
0.5150342951  
0.5349608542  
0.5914245052  
0.6804288168  
0.7947460218  
0.9245246959  
1.058152587  
1.183283222  
1.287930338  
1.361510191  
1.395746724  
1.385360855  
1.328495295  
1.22686043  
1.08559589  
0.9128738883  
0.7192773173  
0.5169924115  
0.3188746308  
0.1374466321  
-0.01610228978  
-0.1328355739  
-0.2068307095  
-0.2356950587  
-0.2207887425  
-0.1671035177  
-0.08280271844  
0.02154622064  
0.1339673088  
0.2421946104  
0.3347892258  
0.4021288227  
0.4371676174  
0.4358923179  
0.3974502947  
0.3239707507  
0.2201416127  
0.09262373617  
-0.05060076933  
-0.2008626509  
-0.3493692946  
-0.4876678775  
-0.6080198916  
-0.7037121253  
-0.7693380075  
-0.8010888835  
-0.7970367368  
-0.7574131242  
-0.6848139406  
-0.5842671015  
-0.4631023779  
-0.3305607058  
-0.1971439304  
-0.07372789556  
0.0294714177  
0.1039492995  
0.1438499116  
0.1466288659  
0.1133401698  
0.04848781356  
-0.04055221671  
-0.1444553921  
-0.2530845006  
-0.356661655  
-0.4468071809  
-0.5172966017  
-0.564434313  
-0.5870273508  
-0.5859986908  
-0.563743715  
-0.5233736598  
-0.4679971378  
-0.4001716666  
-0.3216226801  
-0.2332595099  
-0.1354731188  
-0.02863370447  
0.08631608899  
0.2073033716  
0.3307213086  
0.4512654535  
0.5620767265  
0.6551751506  
0.7221574937  
0.7550665118  
0.7473211752  
0.6945839938  
0.5954508601  
0.4518549088  
0.2691378814  
0.05574082467  
-0.1774349519  
-0.4179569724  
-0.6529596813  
-0.8703034282  
-1.059654691  
-1.213371018  
-1.327095383  
-1.399993362  
-1.434621855  
-1.436457709  
-1.413147319  
-1.373580265  
-1.326904023  
-1.281586824  
-1.24464991  
-1.221125277  
-1.213795652  
-1.223212525  
-1.247954484  
-1.285062686  
-1.330561075  
-1.379982428  
-1.428809788  
-1.472795163  
-1.508126507  
-1.531460993  
-1.539875041  
-1.530794191  
-1.501967667  
-1.451548743  
-1.378297477  
-1.281896207  
-1.163318464  
-1.025167599  
-0.8718729534  
-0.709652781  
-0.5461648671  
-0.3898255811  
-0.2488382393  
-0.1300390322  
-0.03771772268  
0.02739166258  
0.06875084221  
0.0941245444  
0.1150555791  
0.1457063665  
0.2011460708  
0.2952946294  
0.4387780824  
0.6370146973  
0.8888280207  
1.185848152  
1.512835487  
1.848974027  
2.169995691  
2.450899688  
2.668922899  
2.806351712  
2.852796812  
2.806589599  
2.675110805  
2.473964932  
2.225119658  
1.954246845  
1.687618385  
1.448979004  
1.25680228  
1.122288013  
1.048340262  
1.029633496  
1.053723113  
1.103013519  
1.157298244  
1.196518007  
1.203376872  
1.16548101  
1.07676399  
0.9380403393  
0.7566654194  
0.5453945744  
0.3206107699  
0.1001877561  
-0.09874600603  
-0.2618437138  
-0.3791509155  
-0.4461009267  
-0.463806858  
-0.4386446449  
-0.3812089938  
-0.3048057632  
-0.2236822002  
-0.1512378616  
-0.09842865236  
-0.07256976703  
-0.07666397205  
-0.1093053847  
-0.1651568389  
-0.2358905359  
-0.3114562033  
-0.3814820184  
-0.4366342704  
-0.4697506073  
-0.476620225  
-0.4563405079  
-0.4112225341  
-0.3462911244  
-0.2684672879  
-0.1855504382  
-0.1051412834  
-0.03364985588  
0.02449760831  
0.06734805835  
0.09555037455  
0.1121118537  
0.1218103063  
0.1303403482  
0.1433111196  
0.1652251745  
0.1985957574  
0.2433318523  
0.2965068852  
0.3525536498  
0.4038925382  
0.4419181179  
0.4582079455  
0.4457819816  
0.4002162383  
0.3204325175  
0.2090172666  
0.07201399841  
-0.08181216527  
-0.2421179137  
-0.3983765655  
-0.5412982679  
-0.6640513538  
-0.7630959579  
-0.8384870719  
-0.893618268  
-0.9344450541  
-0.9683314021  
-1.00271912  
-1.043836043  
-1.095668372  
-1.159345864  
-1.233039904  
-1.312362773  
-1.391187024  
-1.462730468  
-1.520704633  
-1.560344778  
-1.579135237  
-1.577134644  
-1.556849621  
-1.522707466  
-1.480226608  
-1.435035872  
-1.391917036  
-1.35402324  
-1.322393601  
-1.295840896  
-1.271196883  
-1.243869341  
-1.208600453  
-1.160290929  
-1.094760365  
-1.009323517  
-0.9031114231  
-0.7771103632  
-0.6339437919  
-0.4774551774  
-0.312198963  
-0.1429179125  
0.02588721803  
0.1902496884  
0.3468596903  
0.4930331692  
0.626572042  
0.7455773324  
0.8482855623  
0.932980369  
0.9980218518  
1.041990567  
1.063927509  
1.06361989  
1.041867717  
1.00066957  
0.9432732889  
0.8740568901  
0.7982446362  
0.7214753922  
0.649282383  
0.5865521622  
0.5370346045  
0.5029752189  
0.4849178739  
0.4817011835  
0.4906438346  
0.5078929098  
0.5288812491  
0.5488310761  
0.5632445038  
0.5683242799  
0.5612886716  
0.5405524396  
0.5057845226  
0.4578459006  
0.3986450615  
0.3309303083  
0.2580628166  
0.1837761915  
0.1119643236  
0.04647391445  
-0.00906732172  
-0.0514150673  
-0.07785302478  
-0.08633098037  
-0.07558831012  
-0.04525698782  
0.004061495054  
0.07076062242  
0.1522437562  
0.2449974709  
0.3447233379  
0.4465259191  
0.5451407625  
0.6352005876  
0.7115030518  
0.7692816806  
0.8044484844  
0.8138029376  
0.795202614  
0.7476839774  
0.6715372176  
0.5683518873  
0.4410132026  
0.2936737013  
0.1316826252  
-0.03852748519  
-0.2096183365  
-0.3735980725  
-0.5221668658  
-0.6471626277  
-0.7410898711  
-0.7977109708  
-0.812642905  
-0.7838855879  
-0.7122101647  
-0.6013202031  
-0.4577330227  
-0.290351719  
-0.1097457766  
0.07279436629  
0.2463192634  
0.4012706185  
0.53036842  
0.6292118922  
0.6965044851  
0.7338702519  
0.7452884754  
0.736240511  
0.7126956143  
0.6801097621  
0.6425795968  
0.6022881131  
0.5593195689  
0.5118615953  
0.4567503769  
0.3902582933  
0.3089889879  
0.2107369577  
0.09516430404  
-0.03579645378  
-0.1778869387  
-0.3248085006  
-0.4688139032  
-0.6015111613  
-0.7147739014  
-0.8016334099  
-0.8570428993  
-0.8784247326  
-0.8659387354  
-0.8224599858  
-0.7532785759  
-0.6655666001  
-0.5676950134  
-0.4684736315  
-0.3764066696  
-0.299046244  
-0.2424922132  
-0.2110917436  
-0.2073338128  
-0.2319355181  
-0.2840678431  
-0.3616778133  
-0.4618284551  
-0.5809988644  
-0.7153025304  
-0.8605737203  
-1.012352349  
-1.16576917  
-1.315404625  
-1.455183384  
-1.578375162  
-1.677763134  
-1.745999827  
-1.77614744  
-1.762335175  
-1.700454482  
-1.588767468  
-1.428321518  
-1.223066569  
-0.9796319888  
-0.7067649664  
-0.4145000393  
-0.1131817364  
0.187501162  
0.4793165737  
0.7559774823  
1.013256596  
1.248702845  
1.46104605  
1.649409478  
1.812526189  
1.94811805  
2.052608908  
2.121241945  
2.148621934  
2.129600017  
2.06034675  
1.939421267  
1.768626317  
1.55347411  
1.30313501  
1.029848165  
0.7478484276  
