0.1077245344  
0.07075612543  
0.03434081973  
0.001081032334  
-0.02629360038  
-0.04493529317  
-0.05194259754  
-0.04451322454  
-0.02017423663  
0.02290733806  
0.08557259245  
0.167334274  
0.2661065364  
0.3780725671  
0.4977446911  
0.618249796  
0.731853215  
0.8306872835  
0.9076244377  
0.9571984239  
0.9764448181  
0.9655471653  
0.9281508826  
0.8712745206  
0.8047623459  
0.740309259  
0.6901332806  
0.6654492107  
0.6749207091  
0.7233103919  
0.8105191802  
0.93117922  
1.074886447  
1.227083137  
1.370505549  
1.487032849  
1.559706055  
1.574669235  
1.522784121  
1.400714981  
1.21135604  
0.9635501362  
0.671160172  
0.3516067234  
0.02407318811  
-0.2924068335  
-0.5807549108  
-0.8273469382  
-1.023054888  
-1.163751324  
-1.250248884  
-1.287724885  
-1.284743707  
-1.251996297  
-1.200938444  
-1.142478378  
-1.08585171  
-1.037804544  
-1.002133159  
-0.9796217675  
-0.9683233035  
-0.9641525007  
-0.9616680019  
-0.9549504436  
-0.9384644686  
-0.9078020449  
-0.8602273755  
-0.7949784971  
-0.7133113964  
-0.6182949331  
-0.5144141871  
-0.4070351259  
-0.3018205028  
-0.2041505634  
-0.1186275646  
-0.04869537443  
0.00359649839  
0.03768241265  
0.05444218498  
0.05604164441  
0.04568924213  
0.0273109036  
0.005172213589  
-0.01654473004  
-0.03417359686  
-0.04499717815  
-0.04760884298  
-0.04216028428  
-0.03043827958  
-0.01571745679  
-0.002372338556  
0.004742124829  
0.001069102884  
-0.01680565696  
-0.0503872766  
-0.09871590107  
-0.1581582848  
-0.2226133049  
-0.2841567889  
-0.3340521989  
-0.364003888  
-0.3674551785  
-0.3407205948  
-0.2837673148  
-0.2004809248  
-0.09835410033  
0.01237564656  
0.120029219  
0.2130436933  
0.281539205  
0.3186770809  
0.3215865112  
0.2917452102  
0.2347546507  
0.1595642799  
0.07727839544  
-0.0002719067499  
-0.06197651774  
-0.09870382728  
-0.1042199236  
-0.07567349732  
-0.01362482393  
0.0783159783  
0.1941388332  
0.326219823  
0.4661164667  
0.6052382866  
0.7353501101  
0.8488758283  
0.9390509221  
1.00001207  
1.026891173  
1.016004958  
0.9651632426  
0.8740869276  
0.744856816  
0.5822795384  
0.3940524263  
0.1905997852  
-0.01548681849  
-0.2103966218  
-0.3803871573  
-0.5132394163  
-0.5996966436  
-0.6346749362  
-0.6180364157  
-0.5547988344  
-0.454709681  
-0.3312250659  
-0.2000223265  
-0.07722869237  
0.02238809923  
0.08703940036  
0.1091360453  
0.08596963209  
0.01978735719  
-0.08272167548  
-0.2114304553  
-0.354115294  
-0.4979448565  
-0.6309205427  
-0.7430859153  
-0.8273726168  
-0.8800019562  
-0.9004238844  
-0.8908457567  
-0.8554532918  
-0.7994604285  
-0.7281544086  
-0.646074365  
-0.5564595356  
-0.4610341318  
-0.3601506837  
-0.2532495777  
-0.13954304  
-0.01877870207  
0.1080466056  
0.2381866534  
0.3669524412  
0.4878914728  
0.5933389635  
0.6752758942  
0.7263761724  
0.7410866696  
0.716578132  
0.6534051588  
0.5557640947  
0.4312825773  
0.2903487835  
0.1450481838  
0.007847155773  
-0.1098140736  
-0.1988194044  
-0.2533966865  
-0.2717200825  
-0.2559923686  
-0.2120140459  
-0.1482873161  
-0.07477512592  
-0.001492079743  
0.06288050784  
0.1121606757  
0.1434621098  
0.1575013059  
0.1583846049  
0.1529054949  
0.1494594577  
0.1567224353  
0.1822842006  
0.2314250222  
0.3062014389  
0.4049574045  
0.5223378942  
0.6497791315  
0.7764238869  
0.8903332541  
0.9798354379  
1.034851649  
1.048030988  
1.015564862  
0.9375942027  
0.818174335  
0.6648141622  
0.4876595297  
0.2984320849  
0.1092528357  
-0.06850682327  
-0.2252226699  
-0.3537596828  
-0.4498880661  
-0.512368218  
-0.5427112719  
-0.5446863468  
-0.5236571263  
-0.4858437535  
-0.4376153753  
-0.3848881996  
-0.332694797  
-0.2849469744  
-0.2444000618  
-0.2127867752  
-0.1910633028  
-0.1797277725  
-0.1791183627  
-0.1896590753  
-0.211984636  
-0.2469405364  
-0.2954404975  
-0.3582115011  
-0.4354647843  
-0.526550656  
-0.6296643957  
-0.74166252  
-0.8580424337  
-0.9731237065  
-1.080423722  
-1.173225013  
-1.245247838  
-1.291383365  
-1.308355585  
-1.295237735  
-1.253713922  
-1.188031808  
-1.104612292  
-1.011348919  
-0.9166590284  
-0.8284108783  
-0.7528622277  
-0.6937727657  
-0.6518190039  
-0.6244191999  
-0.6060047891  
-0.5887272001  
-0.5634979566  
-0.5212328801  
-0.4541158017  
-0.3567104438  
-0.2267539557  
-0.06553199775  
0.1222172268  
0.3288407985  
0.5446552823  
0.7590452611  
0.9616112469  
1.143212208  
1.296765973  
1.41773541  
1.504269382  
1.557026145  
1.578753079  
1.573728266  
1.547167497  
1.504688668  
1.451907601  
1.3941829  
1.336501623  
1.283459619  
1.239266214  
1.207706181  
1.192003629  
1.194561759  
1.216593471  
1.257691615  
1.315434532  
1.385117984  
1.459716681  
1.530153296  
1.585892018  
1.615839225  
1.609463315  
1.557998097  
1.455568737  
1.300078054  
1.093703412  
0.8429256465  
0.5580480094  
0.2522646752  
-0.05961108171  
-0.3626015299  
-0.6430083071  
-0.889671438  
-1.094884688  
-1.254879404  
-1.369837726  
-1.443472419  
-1.482262488  
-1.494476251  
-1.489125558  
-1.47499944  
-1.459881366  
-1.450033734  
-1.449956896  
-1.462416734  
-1.488650941  
-1.528692574  
-1.581695879  
-1.646200338  
-1.720277661  
-1.801543241  
-1.887064988  
-1.973210571  
-2.055520498  
-2.128662793  
-2.18654983  
-2.222632489  
-2.230382953  
-2.203915263  
-2.138671854  
-2.032083314  
-1.884090743  
-1.697445358  
-1.477713795  
-1.232969502  
-0.9731768284  
-0.7093375767  
-0.452488833  
-0.2126764569  
0.001992726972  
0.1860857974  
0.3373005995  
0.4565897366  
0.547931122  
0.6177904287  
0.6743112377  
0.7263386839  
0.7823671717  
0.8495241944  
0.9326988867  
1.033909364  
1.151981536  
1.282589173  
1.418655083  
1.551081185  
1.669735469  
1.764579315  
1.82680699  
1.849852181  
1.830142319  
1.767505594  
1.665178146  
1.529435683  
1.368899476  
1.193630566  
1.014137043  
0.8404344666  
0.6812545828  
0.5435072327  
0.4319918288  
0.3493785856  
0.2963908329  
0.2721278744  
0.2744598542  
0.3004212628  
0.3465683833  
0.4092746738  
0.4849581058  
0.5702581595  
0.6621593391  
0.7580817137  
0.8559227673  
0.9540425528  
1.051172282  
1.146238996  
1.238100554  
1.325222426  
1.405338327  
1.475158305  
1.530200693  
1.564814439  
1.572439925  
1.546122016  
1.479250431  
1.366458118  
1.204563998  
0.993437453  
0.7366417874  
0.4417280979  
0.1200863272  
-0.2136831999  
-0.5428677268  
-0.850114465  
-1.119146331  
-1.336510364  
-1.493157227  
-1.585617615  
-1.616608019  
-1.594930601  
-1.534643397  
-1.453546659  
-1.371158733  
-1.306400996  
-1.275305857  
-1.289023626  
-1.352417633  
-1.463433433  
-1.61334328  
-1.787832157  
-1.9687798  
-2.136494612  
-2.272093705  
-2.359698523  
-2.388167078  
-2.352144811  
-2.252326573  
-2.094946101  
-1.890618476  
-1.652750555  
-1.395781595  
-1.133514621  
-0.8777729315  
-0.6375227113  
-0.4185310372  
-0.2235240163  
-0.05273564743  
0.0953167702  
0.222979514  
0.3327148336  
0.4265459554  
0.5057579409  
0.5708466923  
0.6216692177  
0.6577164413  
0.6784226326  
0.6834408983  
0.6728399747  
0.6471956708  
0.6076060211  
0.5556356843  
0.493254658  
0.4227770471  
0.3468366332  
0.2683883097  
0.1907216436  
0.117439987  
0.05238105931  
-0.0005633398969  
-0.03773202781  
-0.05608036915  
-0.05361620345  
-0.02982741738  
0.01397934886  
0.07451254784  
0.1465584886  
0.223309203  
0.2969439571  
0.3594139083  
0.4033356163  
0.422880002  
0.4145270149  
0.3775765971  
0.3143470094  
0.2300061985  
0.1320817668  
0.0296906252  
-0.06738419367  
-0.1496658765  
-0.2088665959  
-0.2385956476  
-0.2348122024  
-0.19601162  
-0.1231531896  
-0.01939431929  
0.1103125498  
0.2596763314  
0.421523546  
0.5882084364  
0.7519781229  
0.9052912802  
1.041128677  
1.153315729  
1.236880173  
1.288430053  
1.306534723  
1.292043088  
1.248267844  
1.180972492  
1.098091627  
1.009157785  
0.9244569346  
0.8539531532  
0.8061081275  
0.7867163554  
0.7979205812  
0.8375567098  
0.8989531795  
0.9712629881  
1.040336268  
1.090075034  
1.104147848  
1.067858403  
0.9699651336  
0.8042135143  
0.5703760176  
0.2746634757  
-0.07057157284  
-0.4478098747  
-0.8359219087  
-1.212121444  
-1.554091197  
-1.842043123  
-2.060485595  
-2.199514019  
-2.255501172  
-2.231150365  
-2.134935971  
-1.980021417  
-1.782800341  
-1.56125037  
-1.333262604  
-1.115140461  
-0.9203951136  
-0.7589404681  
-0.6367230888  
-0.5557718231  
-0.5145897889  
-0.5087935172  
-0.5318620618  
-0.5758856166  
-0.6322151683  
-0.6919694154  
-0.7463881891  
-0.7870773352  
-0.8062177051  
-0.7968057946  
-0.7529928495  
-0.670538554  
-0.5473508634  
-0.3840349779  
-0.1843288124  
0.04469443896  
0.2927798365  
0.5470625745  
0.7930526159  
1.015972441  
1.202273743  
1.341154851  
1.425848464  
1.454481495  
1.430357591  
1.361601906  
1.260186984  
1.14047172  
1.017437628  
0.9048698745  
0.8137328034  
0.750950799  
0.7187512756  
0.7146553152  
0.7320711069  
0.7614050957  
0.7915062003  
0.8112314158  
0.8109216316  
0.7835881543  
0.7256774748  
0.6373313381  
0.522158175  
0.3865693673  
0.2388059567  
0.08780793278  
-0.05792037788  
-0.1912973786  
-0.3074031288  
-0.4038863616  
-0.4810305055  
-0.5414949286  
-0.5897865597  
-0.6315491384  
-0.6727556802  
-0.7188957495  
-0.774248574  
-0.8412929127  
-0.9203129358  
-1.009232189  
-1.103680745  
-1.197305193  
-1.282280689  
-1.350007573  
-1.391923086  
-1.400360312  
-1.369384042  
-1.295511474  
-1.178252599  
-1.020402431  
-0.8280442141  
-0.6102445446  
-0.3784562906  
-0.1456582186  
0.07468977645  
0.2697997251  
0.428697011  
0.5432402587  
0.608904042  
0.6252323218  
0.5958785394  
0.5282341882  
0.432637823  
0.3212617184  
0.206779659  
0.100973818  
0.01345145947  
-0.04937978803  
-0.0849204688  
-0.09451927777  
-0.08309429106  
-0.05829289886  
-0.02930767673  
-0.00549520693  
0.005005909794  
-0.003536118051  
-0.03360643633  
-0.08407209423  
-0.1503287801  
-0.2249268626  
-0.2986008325  
-0.3615296644  
-0.4046678141  
-0.4209485596  
-0.4062077905  
-0.359705834  
-0.2841982555  
-0.1855612492  
-0.07203975358  
0.04675912529  
0.1609956918  
0.2616874645  
0.3416386112  
0.3960978004  
0.4230860125  
0.4233873678  
0.4002149149  
0.358647627  
0.3048953824  
0.2455214202  
0.1867120005  
0.1336701995  
0.09020710849  
0.05854969865  
0.03936944549  
0.03200409044  
0.03481685354  
0.0456366816  
0.06220970731  
0.08259563286  
0.105472395  
0.130309569  
0.1574057816  
0.187800441  
0.2230820201  
0.2651309594  
0.3158266492  
0.3767552826  
0.4489383999  
0.5325979054  
0.6269635401  
0.7301267554  
0.8389504442  
0.9490424268  
1.054821371  
1.149691082  
1.226358323  
1.277296344  
1.295355541  
1.274475682  
1.210438387  
1.101569282  
0.9492840502  
0.7583676659  
0.5369248269  
0.2959483426  
0.04852284699  
-0.1912566218  
-0.4095385255  
-0.5939765393  
-0.73483732  
-0.8258071214  
-0.8643914718  
-0.8518772521  
-0.7928745483  
-0.6945408147  
-0.5656296745  
-0.41550712  
-0.2533113338  
-0.08734093815  
0.07522969857  
0.228337181  
0.3667609265  
0.4857055539  
0.5803728018  
0.6456666603  
0.676135627  
0.6662428169  
0.6109645216  
0.5066674685  
0.3521403749  
0.1496055848  
-0.09450455815  
-0.3691858529  
-0.6590921355  
-0.9454248154  
-1.207466826  
-1.424630068  
-1.578781013  
-1.656538538  
-1.651214496  
-1.564065156  
-1.404639246  
-1.190083378  
-0.9434623625  
-0.6912515146  
-0.4603406722  
-0.2749394166  
-0.1538044417  
-0.1081886867  
-0.1407773778  
-0.2457507101  
-0.4099410889  
-0.6148698877  
-0.8393523812  
-1.062251965  
-1.2649931  
-1.433470634  
-1.559135743  
-1.639169702  
-1.675806156  
-1.67501044  
-1.644788294  
-1.593450342  
-1.528111912  
-1.453660418  
-1.372291219  
-1.283625342  
-1.185299158  
-1.073869149  
-0.9458118655  
-0.7984383406  
-0.6305474026  
-0.4427490662  
-0.237430357  
-0.01840910602  
0.2096146545  
0.4416808192  
0.6731421265  
0.9000748793  
1.119462222  
1.329124181  
1.52742889  
1.712855634  
1.883513758  
2.036732949  
2.168832354  
2.275153699  
2.350380351  
2.3891381  
2.386782177  
2.340262752  
2.248897932  
2.114925142  
1.943686633  
1.743409932  
1.524575492  
1.298960992  
1.078512032  
0.874213353  
0.6951418919  
0.5478294635  
0.4360276401  
0.360850718  
0.3212162558  
0.3144501029  
0.3368846024  
0.3843110298  
0.4521904566  
0.5356032051  
0.6290028608  
0.7258996764  
0.8186441776  
0.8984676458  
0.9558935495  
0.9815587306  
0.9673570604  
0.9077579909  
0.8010418464  
0.6501982505  
0.4632408465  
0.2527858233  
0.03485348273  
-0.1730017747  
-0.353999284  
-0.4945412081  
-0.5863516859  
-0.6279781522  
-0.6253884791  
-0.5915169512  
-0.5447690058  
-0.50667156  
-0.498974762  
-0.5406106508  
-0.6449412749  
-0.8176847122  
-1.055830097  
-1.347694696  
-1.674126871  
-2.010696276  
-2.330573394  
-2.607705897  
-2.819865632  
-2.951154916  
-2.993654697  
-2.948015221  
-2.822943836  
-2.633709953  
-2.399916196  
-2.142884715  
-1.88304663  
-1.637696503  
-1.419397506  
-1.235204835  
-1.086729015  
-0.970933388  
-0.8814450108  
-0.8101040616  
-0.7484593117  
-0.6889670299  
-0.6257299403  
-0.5547185284  
-0.4735296687  
-0.3808184774  
-0.2756083302  
-0.1566746419  
-0.02219280635  
0.130251274  
0.3032563446  
0.4988880191  
0.7177752532  
0.9582290067  
1.215585988  
1.481934803  
1.746365439  
1.995745482  
2.215974004  
2.393555993  
2.517287622  
2.579796222  
2.57870206  
2.517199896  
2.403927685  
2.252105344  
2.078024226  
1.89906304  
1.731491991  
1.588368451  
1.477815304  
1.401954506  
1.356641817  
1.332083464  
1.314247599  
1.286893854  
1.233929662  
1.141767162  
1.001328282  
0.8094226757  
0.56928671  
0.2902238183  
-0.0135975366  
-0.3249787003  
-0.6258899678  
-0.8996763063  
-1.132954477  
-1.316924033  
-1.447931813  
-1.527255679  
-1.560202823  
-1.554727482  
-1.519842393  
-1.464113396  
-1.394492014  
-1.315663129  
-1.229959508  
-1.137808871  
-1.038551671  
-0.9314165059  
-0.8164325444  
-0.6950604523  
-0.5704174559  
-0.4470519651  
-0.3303188465  
-0.2254964015  
-0.1368411511  
-0.06677573721  
-0.01540131416  
0.01955870951  
0.04234063539  
0.05831424203  
0.0728830489  
0.09030259493  
0.1126435918  
0.1390941161  
0.1657537199  
0.1860010697  
0.1914044355  
0.1730752793  
0.1232692153  
0.03699766082  
-0.08660098202  
-0.243378548  
-0.4239488807  
-0.6142235338  
-0.7966942073  
-0.9523553233  
-1.063038145  
-1.113868894  
-1.095496044  
-1.005756037  
-0.8504821469  
-0.6432765513  
-0.404197702  
-0.1574713455  
0.07149753026  
0.2594282665  
0.3883216813  
0.4480080277  
0.4376907007  
0.3662345794  
0.2511153309  
0.116154623  
-0.01166215873  
-0.1058435688  
-0.1440089913  
-0.1109536857  
-0.0007328703251  
0.1825137312  
0.4250998226  
0.705583483  
0.9975236407  
1.272788791  
1.504936166  
1.672193098  
1.759665049  
1.760514732  
1.676050071  
1.514807304  
1.290861733  
1.021688862  
0.7259214037  
0.4213193902  
0.123208507  
-0.1564994212  
