81.53164341  
89.58296469  
107.2069238  
150.36684  
539.7878491  
1624.501213  
4614.468447  
12127.48745  
1598.054087  
18824.16864  
8995.614783  
6461.424752  
118088.5292  
683.4106022  
35325.94297  
2474.208543  
17752.05761  
1023.593305  
8096.168284  
11889.0487  
1121.921465  
3656.386064  
10342.90268  
23198.14022  
19215.60396  
750.857254  
8522.692441  
19318.02427  
4601.159415  
4409.717693  
1295.000586  
4965.278896  
16212.04119  
1431.610067  
664.1487655  
5770.254038  
3805.185048  
3843.051931  
6190.070789  
6187.372158  
10015.1082  
7899.589205  
6206.352248  
10825.65358  
16414.20438  
2864.811897  
5960.805469  
5340.488619  
7164.439762  
2361.550646  
4986.855159  
504.2451323  
999.9915977  
696.8184778  
2062.273627  
920.8513407  
496.8378352  
1446.534419  
764.5163706  
908.3423977  
4.270011919  
1023.796881  
530.1684561  
30.49531596  
362.2483069  
230.6815209  
35.81483378  
6.204259161  
25.00554322  
42.83168679  
20.51229827  
65.04776039  
35.35450414  
22.24843381  
12.33871203  
21.59479642  
25.75755404  
14.13858249  
12.78688008  
8.920114384  
10.04979069  
7.524241573  
9.910104754  
7.135369123  
6.483145442  
5.414829065  
5.174644405  
5.143209636  
4.711681781  
4.711078139  
3.970062036  
4.023669429  
3.81617416  
3.568713057  
3.312439211  
2.952158546  
2.754446184  
2.632952636  
2.521601099  
2.422248888  
2.330097882  
2.145029597  
2.048636713  
1.949620851  
1.836354389  
1.759246232  
1.673293678  
1.590475565  
1.509705463  
1.441427626  
1.376362064  
1.317768404  
1.261903059  
1.207936717  
1.152568261  
1.102686271  
1.058177378  
1.011111015  
0.9728392799  
0.9321237616  
0.8964965379  
0.860366912  
0.8275524481  
0.795842632  
0.7658703114  
0.73711311  
0.7097075044  
0.6834791482  
0.6585555908  
0.6352396532  
0.6127325303  
0.5911512283  
0.5702159747  
0.5504658152  
0.5318602468  
0.5139221366  
0.4967468097  
0.4802565968  
0.4644029581  
0.4492279991  
0.4347545885  
0.4208090051  
0.407546223  
0.3947309958  
0.3824311296  
0.370639659  
0.359265666  
0.3483750008  
0.3379095442  
0.327837481  
0.3181271489  
0.3087802491  
0.2998018965  
0.2911315038  
0.2827913101  
0.2747580641  
0.2670025407  
0.2595296554  
0.2523235877  
0.2453677942  
0.238655355  
0.2321673745  
0.2259121684  
0.2198612113  
0.2140177894  
0.2083760546  
0.2029062015  
0.1976319202  
0.1925314259  
0.1875951659  
0.1828195202  
0.1781855725  
0.1737058532  
0.1693826076  
0.16517742  
0.161110707  
0.1571665836  
0.1533419531  
0.1496390805  
0.1460491104  
0.1425676284  
0.1391878318  
0.1359022348  
0.1327230191  
0.1296369317  
0.1266418767  
0.1237317243  
0.1209029965  
0.1181623577  
0.1154939966  
0.1129078372  
0.1103880756  
0.107942808  
0.1055579717  
0.1032492512  
0.1009987168  
0.09881427476  
0.09668489489  
0.09461037475  
0.09259765166  
0.09063493816  
0.08872992121  
0.08686827108  
0.0850602201  
0.08329814628  
0.08157909579  
0.07990804183  
0.07827950049  
0.07669267122  
0.07514237909  
0.07363138493  
0.07216917807  
0.07073092621  
0.06933213842  
0.06797325887  
0.06664674718  
0.0653496362  
0.0640837275  
0.06284822023  
0.06164539193  
0.06046951443  
0.05932240043  
0.05820084781  
0.05710986318  
0.05604279046  
0.05499750323  
0.05398219742  
0.05298829344  
0.05201608739  
0.0510652093  
0.05013913958  
0.04923490513  
0.0483470009  
0.04748064741  
0.04663762683  
0.04580862232  
0.04500233182  
0.04420744265  
0.04343532108  
0.04268055158  
0.04194008789  
0.04121382795  
0.04051011516  
0.03981821971  
0.03914141436  
0.03847749101  
0.03782842068  
0.03719215417  
0.03657156911  
0.03595985465  
0.03536536572  
0.03478310564  
0.03421336828  
0.03365329965  
0.03310494686  
0.0325681187  
0.03204102215  
0.03152683807  
0.03102133405  
0.03053229096  
0.03004518936  
0.0295679893  
0.02910807495  
0.02864930496  
0.02820440815  
0.027765565  
0.02733616366  
0.0269170762  
0.0265021022  
0.02609723509  
0.02570016858  
0.02531352801  
0.02492901084  
0.02456104878  
0.02419000213  
0.02382909205  
0.02347583633  
0.02312955163  
0.02279007949  
0.02245578878  
0.02212621352  
0.02180765088  
0.02149140795  
0.02118319178  
0.0208789734  
0.02057931448  
0.02028664554  
0.02000067784  
0.0197181423  
0.01944136396  
0.01917145471  
0.01890290746  
0.0186419684  
0.01838350276  
0.01812970862  
0.01788089107  
0.01763831564  
0.01739859111  
0.0171627623  
0.01693094347  
0.01670234816  
0.01647924493  
0.01626124648  
0.01604437627  
0.01583553338  
0.01562640977  
0.01542041922  
0.01522150003  
0.01502377149  
0.01482872029  
0.01463640074  
0.01445030058  
0.01426560678  
0.01408289801  
0.01390627051  
0.01373022012  
0.01355721336  
0.01339031611  
0.01322137448  
0.01305922474  
0.01289547136  
0.01273951845  
0.01258346687  
0.01242921778  
0.012278986  
0.01213055009  
0.01198363529  
0.01184200193  
0.01170158866  
0.01156068415  
0.01142514181  
0.0112915355  
0.01116032151  
0.01103064445  
0.01090118652  
0.01077694295  
0.01065123153  
0.01052919116  
0.0104095465  
0.01029116321  
0.01017737206  
0.01006375122  
0.009951108437  
0.009838832446  
0.00973138462  
0.009624208041  
0.00951903432  
0.009415153367  
0.00931345725  
0.009212092095  
0.009112289528  
0.00901699907  
0.008919234905  
0.008827185536  
0.008733273224  
0.008640682993  
0.00855315715  
0.008462246443  
0.008377177037  
0.008289377376  
0.008205809266  
0.008123233485  
0.008040373967  
0.007962014763  
0.007880522463  
0.007802964805  
0.007727002432  
0.007650328976  
0.007575973164  
0.007504411452  
0.007431199483  
0.007360483441  
0.007291130882  
0.007222266037  
0.007154105039  
0.007085957372  
0.007021221145  
0.006956192771  
0.006892371486  
0.006830626513  
0.006767324929  
0.006707261173  
0.0066456979  
0.006588990524  
0.006531111116  
0.006473849494  
0.006418884307  
0.006361821335  
0.006308945473  
0.006254041226  
0.006202106164  
0.006149830927  
0.006098601389  
0.006049989847  
0.005999910447  
0.005950327766  
0.005903775401  
0.00585609354  
0.005809891791  
0.00576408186  
0.005719222091  
0.005675653233  
0.005631469636  
0.005590948028  
0.005547283879  
0.005506850137  
0.005466888723  
0.005425856794  
0.005386527015  
0.005347538744  
0.005310250532  
0.00527345285  
0.005237029373  
0.005201137004  
0.005165494366  
0.005130907346  
0.00509692512  
0.005063280824  
0.005030986307  
0.00499751943  
0.004965284215  
0.004934592062  
0.004904285171  
0.004873421095  
0.004844291293  
0.004814657742  
0.004787901065  
0.004759033837  
0.004731606276  
0.004704600602  
0.004677213817  
0.004652446462  
0.004626747778  
0.004601721894  
0.004577493497  
0.004552964322  
0.004530541629  
0.004507693487  
0.004485756266  
0.004462978357  
0.004442371343  
0.004420039025  
0.004400247313  
0.004380691598  
0.004360911292  
0.00434188077  
0.004322160078  
0.004304881727  
0.004286804703  
0.004269750454  
0.004252368943  
0.004236224036  
0.004220911956  
0.004204657804  
0.004189192875  
0.004174857693  
0.004160743065  
0.004146224135  
0.004132508846  
0.004120144587  
0.004106733709  
0.004094392508  
0.004082832885  
0.004070247768  
0.004059326509  
0.004048542129  
0.004038688564  
0.004029065051  
0.004018246125  
0.004010019666  
0.004001050448  
0.003992540964  
0.003986051274  
0.003977193534  
0.003970341412  
0.003962346502  
0.003957107908  
0.003950600664  
0.003945265397  
0.003939855856  
0.003934956769  
0.003930056863  
0.003924649485  
0.003922266775  
0.003917700659  
0.00391453444  
0.003912321266  
0.003909585343  
0.003908238419  
0.00390608761  
0.003904993669  
0.003904343502  
0.003903296669  
0.003902244232  
