0.6895246162  
0.9929420246  
1.283116115  
1.545506414  
1.767946984  
1.941907999  
2.063409283  
2.133466893  
2.158009405  
2.147248726  
2.114557571  
2.074969104  
2.043428503  
2.033001246  
2.053220365  
2.108761885  
2.198610066  
2.315827551  
2.447975208  
2.578183705  
2.68677226  
2.753289213  
2.758743398  
2.68782043  
2.530812478  
2.285042109  
1.955613494  
1.555351091  
1.103921067  
0.6262011418  
0.1500462975  
-0.2963077419  
-0.6869329488  
-1.000684654  
-1.223208131  
-1.348236603  
-1.378055306  
-1.323075391  
-1.200584716  
-1.032816603  
-0.8445614884  
-0.6605839943  
-0.5031326441  
-0.389790451  
-0.3318864684  
-0.333623008  
-0.3919651447  
-0.4973125977  
-0.6348277718  
-0.7862936491  
-0.9322815736  
-1.054402679  
-1.137418919  
-1.170982833  
-1.150828651  
-1.079312762  
-0.9652208523  
-0.8228834522  
-0.6706715738  
-0.5290529376  
-0.4183783031  
-0.3566570213  
-0.3575495734  
-0.4287746442  
-0.5711389427  
-0.7782551046  
-1.037028273  
-1.328836158  
-1.631295264  
-1.920433928  
-2.173039294  
-2.368921632  
-2.492864524  
-2.536032434  
-2.496690932  
-2.380151297  
-2.197950026  
-1.966362218  
-1.704434231  
-1.431771643  
-1.166382803  
-0.9228312493  
-0.7109445562  
-0.5352385923  
-0.3951046954  
-0.2857001436  
-0.1993828843  
-0.1274455648  
-0.06185761405  
0.003275029869  
0.07074044795  
0.1399290767  
0.2072162953  
0.2669720529  
0.3129898647  
0.3401027271  
0.3456796431  
0.3307549328  
0.3005551775  
0.2643306501  
0.234454249  
0.2249193492  
0.2494201691  
0.3192954401  
0.4416403148  
0.6178684159  
0.842947851  
1.105460246  
1.388501714  
1.671322298  
1.931527422  
2.14753965  
2.301030686  
2.378991304  
2.375184624  
2.29080373  
2.134241596  
1.920017486  
1.667009189  
1.396211228  
1.128308924  
0.8813749462  
0.6689688192  
0.498880432  
0.3726449502  
0.2858851042  
0.2294164588  
0.1909530898  
0.1571732656  
0.1158748326  
0.05789798238  
-0.02140191984  
-0.1213740019  
-0.2360599552  
-0.3549588312  
-0.4644619402  
-0.5497617137  
-0.5969763708  
-0.5952004813  
-0.5382072462  
-0.4255909401  
-0.2631669852  
-0.06261547213  
0.1596267913  
0.3840599022  
0.5902171055  
0.7588805605  
0.8741880767  
0.9253477134  
0.9078007886  
0.8236780851  
0.6815281028  
0.4953516704  
0.283065956  
0.06458009825  
-0.1403024158  
-0.3139194185  
-0.4425036578  
-0.5174864302  
-0.536210303  
-0.5020112597  
-0.4236771304  
-0.314364749  
-0.1901161222  
-0.06814697785  
0.0349074744  
0.1046030132  
0.130004347  
0.1046055524  
0.02679645016  
-0.1001373076  
-0.2684233205  
-0.466567612  
-0.6803803389  
-0.8941690994  
-1.092021278  
-1.259087065  
-1.382801714  
-1.453975628  
-1.467663102  
-1.42375234  
-1.327192504  
-1.187789742  
-1.019542038  
-0.8395222382  
-0.666370157  
-0.5185129093  
-0.4122906113  
-0.3602104037  
-0.3695137922  
-0.4412767883  
-0.5701581268  
-0.7448485419  
-0.9491851651  
-1.163781781  
-1.367990827  
-1.541939013  
-1.668395864  
-1.734259706  
-1.731511281  
-1.657577636  
-1.51511462  
-1.31131989  
-1.056909976  
-0.7649491987  
-0.4496899658  
-0.1255470436  
0.1936933108  
0.4954390977  
0.7686196473  
1.003874643  
1.193656941  
1.332329991  
1.416292793  
1.444154895  
1.416924442  
1.338165953  
1.214046825  
1.05322975  
0.8665486187  
0.6664663812  
0.466333245  
0.2794891675  
0.1182998486  
-0.006792421087  
-0.08811075776  
-0.1213909048  
-0.1061800817  
-0.04591932971  
0.05228079942  
0.1782073798  
0.3193895272  
0.4621977525  
0.5930852839  
0.6998940917  
0.7730692125  
0.8066802336  
0.7991002004  
0.7532451321  
0.6763282793  
0.5790975207  
0.4746391003  
0.3768428722  
0.2987042853  
0.2506721877  
0.2392341609  
0.2659446747  
0.3270319703  
0.4136747669  
0.5129338527  
0.6092673916  
0.6864545935  
0.7297065153  
0.7277086644  
0.6743136338  
0.5696712397  
0.4206008483  
0.2401342127  
0.04625072003  
-0.1400843475  
-0.297353906  
-0.4060873195  
-0.4513334208  
-0.4246538117  
-0.3253808426  
-0.1609699608  
0.05364226997  
0.2975956754  
0.5464018842  
0.774697358  
0.9591086911  
1.080856395  
1.127796081  
1.095622285  
0.9881149012  
0.8164136252  
0.5974327928  
0.3516625449  
0.1006352509  
-0.1356033948  
-0.3406880263  
-0.5035554101  
-0.6192962703  
-0.6891958465  
-0.7199809089  
-0.7224447783  
-0.7096459808  
-0.6949589713  
-0.6902221133  
-0.7042327456  
-0.7417374404  
-0.8030189805  
-0.8840772472  
-0.9773218143  
-1.072640732  
-1.158677482  
-1.224126954  
-1.258909321  
-1.255101699  
-1.20756934  
-1.114290791  
-0.9764136882  
-0.7981049986  
-0.586260334  
-0.3501392455  
-0.1009414399  
0.1486481091  
0.3849861301  
0.5940998395  
0.7624444761  
0.8777994967  
0.9302658452  
0.9133015504  
0.8246646959  
0.6671099075  
0.4487123582  
0.1826588841  
-0.1135424479  
-0.419438253  
-0.7134902738  
-0.9752388214  
-1.187511576  
-1.338375347  
-1.422566787  
-1.442139165  
-1.40621007  
-1.32977747  
-1.231729245  
-1.132272321  
-1.050139598  
-0.9999295974  
-0.9899755949  
-1.021040642  
-1.08604872  
-1.170895767  
-1.256253364  
-1.320121582  
-1.340779675  
-1.299734075  
-1.184268526  
-0.9892383753  
-0.7178936165  
-0.3816257271  
0.001296696461  
0.4078206747  
0.8127172896  
1.191361127  
1.522312721  
1.789394553  
1.983019413  
2.100663809  
2.146480371  
2.130165567  
2.065283876  
1.967296589  
1.851558154  
1.731541743  
1.617474661  
1.515513497  
1.427513069  
1.351359296  
1.281771453  
1.21144654  
1.132376366  
1.037176955  
0.9202854707  
0.7788805197  
0.6134710932  
0.4280758273  
0.2299997657  
0.02924754188  
-0.1623988781  
-0.3325224872  
-0.4693532535  
-0.5630686805  
-0.6069841497  
-0.5985187734  
-0.5398086468  
-0.437878972  
-0.3043029232  
-0.1543325225  
-0.005543577653  
0.1238929486  
0.2171472433  
0.2606446132  
0.2457230926  
0.1697844455  
0.03675748442  
-0.1432300151  
-0.3549822946  
-0.5800416303  
-0.7989440629  
-0.9936209832  
-1.149614903  
-1.25775135  
-1.315053352  
-1.324708589  
-1.295134444  
-1.238233073  
-1.167148735  
-1.09385707  
-1.026988608  
-0.970228344  
-0.921583255  
-0.8736265932  
-0.8147282003  
-0.7310706961  
-0.6091624971  
-0.438445141  
-0.213585147  
0.06392247195  
0.3851285402  
0.7340951426  
1.089431734  
1.426687919  
1.721274788  
1.951468689  
2.101066953  
2.161277402  
2.131567568  
2.019339927  
1.838502621  
1.607166707  
1.344858576  
1.06969856  
0.7960177235  
0.5327799208  
0.2830708951  
0.04468805938  
-0.1882870543  
-0.4232552512  
-0.6666222714  
-0.921541028  
-1.186284528  
-1.45357066  
-1.710947912  
-1.942213945  
-2.1296206  
-2.25650762  
-2.309922883  
-2.282792333  
-2.17529251  
-1.995193123  
-1.757102194  
-1.480728276  
-1.188426726  
-0.9023957401  
-0.6419284433  
-0.4211271978  
-0.247417669  
-0.1210321762  
-0.03555621011  
0.02059881626  
0.06200336507  
0.103652478  
0.1584115991  
0.2348469477  
0.3357600984  
0.457627306  
0.5910154706  
0.7219270068  
0.8338371804  
0.9101610434  
0.9367642971  
0.9041688675  
0.8091425951  
0.6554398246  
0.453618865  
0.2199546881  
-0.02537120525  
-0.2605548531  
-0.46459777  
-0.6195576368  
-0.7123339964  
-0.7357757541  
-0.6890206227  
-0.5770556509  
-0.409642072  
-0.199784779  
0.03800877851  
0.2894166239  
0.5417254554  
0.7848155338  
1.01161588  
1.218025256  
1.402371694  
1.564523682  
1.704850779  
1.823194973  
1.918034363  
1.985986684  
2.021734278  
2.018399067  
1.968332392  
1.864233766  
1.70043221  
1.474166674  
1.186688386  
0.8439908388  
0.4570593497  
0.04154592603  
-0.3831232785  
-0.7951557418  
-1.17216595  
-1.493135474  
-1.740350499  
-1.901082612  
-1.968836541  
-1.944015955  
-1.833922627  
-1.652114074  
-1.417158633  
-1.150953818  
-0.8767639851  
-0.6171812706  
-0.3922207201  
-0.2176953643  
-0.1040527512  
-0.05571738019  
-0.0710066444  
-0.1425961581  
-0.2584609591  
-0.403190304  
-0.5595510686  
-0.7101387251  
-0.8389693587  
-0.9328742209  
-0.9825826484  
-0.9833988268  
-0.9354423826  
-0.84341068  
-0.7159271707  
-0.5645048894  
-0.4022559976  
-0.242438992  
-0.09701150799  
0.02467475361  
0.1168849252  
0.1780939403  
0.2110739431  
0.2224399889  
0.221689916  
0.2198247961  
0.2277299364  
0.2545040298  
0.3059812339  
0.3836608502  
0.4842164927  
0.599678852  
0.7183082695  
0.8260414932  
0.9083336811  
0.9521383819  
0.9477499442  
0.8902301183  
0.780227557  
0.6240617781  
0.4330595606  
0.2222369969  
0.00852642665  
-0.1912269274  
-0.3622139592  
-0.493315399  
-0.5782540783  
-0.6161416443  
-0.6113658008  
-0.5728881755  
-0.5130560896  
-0.4461105144  
-0.3865480355  
-0.3475448234  
-0.3395739382  
-0.3693429735  
-0.4391302368  
-0.5465499057  
-0.6847388838  
-0.842942417  
-1.007426707  
-1.162647625  
-1.292582618  
-1.382112397  
-1.418356674  
-1.391853765  
-1.297478923  
-1.135025438  
-0.9093843361  
-0.6303077625  
-0.3117568134  
0.02911290971  
0.3732326902  
0.7010739085  
0.9941300543  
1.236310216  
1.415131613  
1.522596168  
1.555713806  
1.516618755  
1.412287037  
1.253896855  
1.055874181  
0.8347194948  
0.6077110914  
0.3915822533  
0.2013045495  
0.04904406088  
-0.05659103344  
-0.1109792223  
-0.1135684098  
-0.06760730446  
0.02039906364  
0.1414601876  
0.2849857318  
0.4397111111  
0.5945761482  
0.7394871638  
0.8659350962  
0.96743577  
1.039800361  
1.081234272  
1.092268911  
1.075545166  
1.035434818  
0.9775308698  
0.9080210008  
0.8329843393  
0.7576850268  
0.6859396762  
0.6196597382  
0.5586341702  
0.5006439106  
0.4418925619  
0.3777284875  
0.3035702338  
0.2158728357  
0.1129984663  
-0.004202201947  
-0.1321891046  
-0.2649937953  
-0.3949190304  
-0.5135678861  
-0.6130578368  
-0.6871885319  
-0.7323969406  
-0.7483018128  
-0.7377651524  
-0.7064453313  
-0.6619318744  
-0.6126055129  
-0.5664241743  
-0.5298460965  
-0.507070084  
-0.4997078416  
-0.5069346197  
-0.5260686849  
-0.5534440801  
-0.5854207292  
-0.6193029451  
-0.6540079382  
-0.6903301532  
-0.7307540227  
-0.7788310891  
-0.8382291356  
-0.911622602  
-0.9996253422  
-1.099971436  
-1.207100183  
-1.312251578  
-1.404097254  
-1.46982688  
-1.496582093  
-1.473030053  
-1.390890354  
-1.246212543  
-1.040244742  
-0.7797958361  
-0.4770267364  
-0.1487027871  
0.1850363606  
0.5022797686  
0.7811628077  
1.001762587  
1.147886059  
1.208579565  
1.17923178  
1.062133614  
0.8664268909  
0.6074175989  
0.3052994735  
-0.01661215905  
-0.3339634599  
-0.6235641332  
-0.8654670634  
-1.044704901  
-1.152503622  
-1.186825299  
-1.152199868  
-1.058889256  
-0.921470351  
-0.7570433824  
-0.5832716998  
-0.4164755666  
-0.2700001837  
-0.1530101244  
-0.06982859402  
-0.01984842949  
0.002019092223  
0.004432793595  
-0.001626565488  
-0.004264152445  
0.007885884087  
0.0443629387  
0.1118301305  
0.2133751878  
0.3482152001  
0.5117948846  
0.6962694056  
0.8912658671  
1.084872585  
1.264701866  
1.41895774  
1.53739575  
1.612101131  
1.638061744  
1.613481561  
1.53986912  
1.421887837  
1.267004592  
1.084950467  
0.8870257919  
0.6852663917  
0.4915226464  
0.3164849219  
0.1687487227  
0.05398179049  
-0.02568769283  
-0.07197458692  
-0.09035682431  
-0.08956043652  
-0.08063436729  
-0.07566589393  
-0.08628063958  
-0.1220876645  
-0.1892686573  
-0.2895208582  
-0.419490974  
-0.5708441959  
-0.7309836175  
-0.8843585501  
-1.014251143  
-1.104815616  
-1.143120877  
-1.120944561  
-1.036056965  
-0.8928248699  
-0.7020219153  
-0.4798351768  
-0.2461752038  
-0.02246982687  
0.1707957804  
0.3164937464  
0.4029198301  
0.4252569082  
0.3862314696  
0.2958806995  
0.1704382743  
0.03046768003  
-0.1015273454  
-0.2037355622  
-0.2575879965  
-0.2499221631  
-0.1745093061  
-0.03276035951  
0.166437191  
0.4077400453  
0.6710552975  
0.933741403  
1.173030338  
1.368378508  
1.503498776  
1.567854336  
1.557468883  
1.474993154  
1.329071134  
1.133110031  
0.9036248617  
0.6583935789  
0.4146452834  
0.1875012698  
-0.01116811852  
-0.1733604237  
-0.2950178636  
-0.3756209258  
-0.4174371595  
-0.4245783297  
-0.4020892828  
-0.3552020609  
-0.2889079878  
-0.2078649891  
-0.1166521435  
-0.02021632154  
0.07559822667  
0.1636546626  
0.2354069889  
0.2812013265  
0.2910261703  
0.2556782422  
0.1681901999  
0.0253135834  
-0.1712059879  
-0.4138252351  
-0.6890907735  
-0.9783350417  
-1.259199987  
-1.507852835  
-1.701645686  
-1.821867793  
-1.856212928  
-1.800572999  
-1.659878123  
-1.44779641  
-1.185301638  
-0.8982545809  
-0.6143105851  
-0.3595684041  
-0.1554278613  
-0.01607388209  
0.05304269601  
0.05554384144  
0.003235388766  
-0.08585739789  
-0.1902357664  
-0.288054995  
-0.3601866027  
-0.3927833095  
-0.3790286745  
-0.3198449432  
-0.2235080146  
-0.1042972118  
0.01961740385  
0.1286939066  
0.2045940622  
0.2324649648  
0.2026488393  
0.1116443254  
-0.0377314221  
-0.236929043  
-0.4728255104  
-0.7292634275  
-0.9887137819  
-1.233843761  
-1.448838959  
-1.620358699  
-1.738120176  
-1.79513221  
-1.78768112  
-1.715156407  
-1.579817348  
-1.386568906  
-1.142757475  
-0.8579896588  
-0.5438954286  
-0.2138027704  
0.1177729377  
0.4358244376  
0.7257427369  
0.9743421112  
1.170906414  
1.308128972  
1.382812958  
1.396208991  
1.353913711  
1.265321777  
1.142690431  
0.9999108586  
0.8511670238  
0.7096335429  
0.5863730922  
0.4895684457  
0.4241301939  
0.3917107768  
0.3910575223  
0.4186028872  
0.469190895  
0.5368059061  
0.6152119339  
0.698439096  
0.781097134  
0.8585249791  
0.9268344733  
0.9828924134  
1.024305828  
1.049453055  
1.057564047  
1.048858544  
1.024681842  
0.9875906934  
0.9413435655  
0.8907267965  
0.841212639  
0.7984420545  
0.767587638  
0.7526712377  
0.7559355276  
0.7773737508  
0.8145117614  
0.8625016032  
0.9145424104  
0.9625912674  
0.9982650564  
1.013827655  
1.003095678  
0.9621380214  
0.8896587849  
0.7870142753  
0.6578598518  
0.5075108517  
0.3421243983  
0.167860715  
-0.009849490219  
-0.1867943241  
-0.3601775324  
-0.5285152157  
-0.6912769839  
-0.8483921043  
-0.9997275762  
-1.144655326  
-1.281812993  
-1.409078265  
-1.523754157  
-1.622907598  
-1.703766013  
-1.764081754  
-1.802362396  
-1.817945693  
-1.810883083  
-1.781691297  
-1.731043225  
-1.659487015  
-1.567297827  
-1.45451786  
-1.32121576  
-1.167932394  
-0.9962446326  
-0.8093171312  
-0.6123203802  
-0.4125768935  
-0.2193599782  
-0.04328886454  
0.1046228608  
0.2141896365  
0.2773612683  
0.2894384733  
0.2499907924  
0.163306853  
0.03828054771  
-0.1123039184  
-0.2730121917  
-0.4273748191  
-0.5596582062  
-0.6565532385  
-0.7085430539  
-0.7107695319  
-0.6632913768  
-0.5707256268  
-0.4413530146  
-0.2858550049  
-0.1158725276  
0.05738052045  
0.224265976  
0.3775063163  
0.5125210259  
0.6273365263  
0.7221439354  
0.7986179512  
0.8591373414  
0.9060561831  
0.9411261853  
0.9651701599  
0.978002977  
0.9786197794  
0.9655656098  
0.9374171769  
0.8932821619  
0.8332180677  
0.7584942711  
0.6716575815  
0.5763841655  
0.4771511959  
