-0.3474446444  
-0.3546096312  
-0.3598738365  
-0.3663207197  
-0.3775107068  
-0.3974719872  
-0.4305159705  
-0.4808344914  
-0.5519039261  
-0.6457439718  
-0.7621459354  
-0.8980050243  
-1.046912689  
-1.199146925  
-1.342164772  
-1.461620543  
-1.542879632  
-1.572873508  
-1.542086314  
-1.446382199  
-1.288381857  
-1.07808608  
-0.8325394383  
-0.5744427242  
-0.3297527578  
-0.1244987533  
0.0188192322  
0.08476343069  
0.0678805126  
-0.02549963441  
-0.1769905462  
-0.3576135952  
-0.5309714449  
-0.6578247551  
-0.7015318589  
-0.6336168626  
-0.4386506381  
-0.1176626235  
0.310532345  
0.8104399252  
1.33341717  
1.823267412  
2.223182456  
2.483104422  
2.5664515  
2.455238381  
2.152818374  
1.683827171  
1.091317115  
0.4314876958  
-0.2332369997  
-0.8417889211  
-1.341643851  
-1.694632285  
-1.880643349  
-1.898802786  
-1.766105034  
-1.513831089  
-1.182382146  
-0.8153459773  
-0.4536652359  
-0.1306981711  
0.1312150925  
0.3223371497  
0.4452117077  
0.5126483893  
0.5444631168  
0.5635418101  
0.5918575808  
0.6470091432  
0.7397306397  
0.8726346447  
1.040259265  
1.230290726  
1.425688415  
1.607329254  
1.756750949  
1.858612647  
1.902547879  
1.884210417  
1.805445179  
1.673634244  
1.500388544  
1.299817898  
1.086651676  
0.8744803499  
0.6743389487  
0.4937792362  
0.3365152564  
0.2026163191  
0.0891617921  
-0.008774747366  
-0.09698900129  
-0.1810295431  
-0.2652436179  
-0.3521070529  
-0.4418965  
-0.5327133575  
-0.6208270035  
-0.7012667964  
-0.7685598162  
-0.8175157199  
-0.8439552982  
-0.8452894445  
-0.8208999922  
-0.7722746374  
-0.7028999304  
-0.6179394082  
-0.5237341889  
-0.4272060675  
-0.3352216177  
-0.2540002351  
-0.1886246038  
-0.1427031194  
-0.1182064269  
-0.1154894482  
-0.1334702069  
-0.1699387151  
-0.2219391921  
-0.2861775742  
-0.3593973927  
-0.4386818836  
-0.5216529904  
-0.6065467809  
-0.6921659353  
-0.7777251295  
-0.862618357  
-0.9461408116  
-1.027218829  
-1.104179277  
-1.1746148  
-1.235367664  
-1.282652652  
-1.312327693  
-1.320288167  
-1.30295518  
-1.257808217  
-1.183892484  
-1.0822434  
-0.9561583939  
-0.8112575434  
-0.6552976168  
-0.4977136415  
-0.3489080179  
-0.2193068931  
-0.1182681428  
-0.05292513311  
-0.02708196253  
-0.04029718714  
-0.08727638626  
-0.1576994513  
-0.236567365  
-0.3051128396  
-0.3422644696  
-0.3265831951  
-0.2385304214  
-0.06285761092  
0.2091315215  
0.5777251556  
1.033609557  
1.55757374  
2.12124788  
2.688917036  
3.2203246  
3.674237271  
4.012433138  
4.203670154  
4.227165523  
4.075126899  
3.753961804  
3.283967832  
2.697453868  
2.035506894  
1.343768134  
0.6677545281  
0.04831650473  
-0.4821904965  
-0.9025565078  
-1.203896627  
-1.389289465  
-1.472025632  
-1.472804301  
-1.416338873  
-1.327884236  
-1.230156242  
-1.141020318  
-1.072154354  
-1.028747525  
-1.010118213  
-1.011026585  
-1.023386404  
-1.038064276  
-1.046493488  
-1.04190905  
-1.020099192  
-0.9796565748  
-0.9218043087  
-0.8499066586  
-0.7688044616  
-0.6840973826  
-0.6014793367  
-0.52618444  
-0.4625681514  
-0.4138213263  
-0.3817955007  
-0.3669173423  
-0.3681736476  
-0.3831642149  
-0.408224767  
-0.4386327676  
-0.4689023831  
-0.4931661512  
-0.5056305668  
-0.5010695343  
-0.4753178812  
-0.4257047629  
-0.351387726  
-0.2535376603  
-0.1353511685  
-0.001887044552  
0.140257118  
0.2834062828  
0.4193485738  
0.5399202075  
0.637571437  
0.7058884276  
0.7400192207  
0.7370041014  
0.6959807329  
0.6182798594  
0.5073973903  
0.3688624492  
0.2099959059  
0.03955638553  
-0.1327113251  
-0.2966330274  
-0.4422386024  
-0.5604499859  
-0.6437748489  
-0.6869368478  
-0.6873806935  
-0.6455686245  
-0.565016741  
-0.4520340433  
-0.3151660733  
-0.1643879746  
-0.01013176179  
0.1377384712  
0.2708804719  
0.383223106  
0.4714162294  
0.5349240535  
0.5757520795  
0.5978534301  
0.6063102933  
0.6064160142  
0.6027925445  
0.5986807298  
0.5954921217  
0.5926920146  
0.5880090196  
0.577930114  
0.5583940993  
0.5255677443  
0.4765850364  
0.4101329142  
0.3268086266  
0.2291945312  
0.1216580754  
0.00990971923  
-0.09960704954  
-0.2003949244  
-0.2865660166  
-0.353394573  
-0.397698442  
-0.4180172471  
-0.4145814856  
-0.3891052204  
-0.344450265  
-0.2842284322  
-0.2123962014  
-0.1329131237  
-0.04947857952  
0.03461691531  
0.1165537463  
0.1939717567  
0.2649329347  
0.3278893045  
0.3816883035  
0.4256275561  
0.4595502688  
0.48395042  
0.5000451293  
0.5097712881  
0.5156622253  
0.5205937552  
0.5274021496  
0.5384232565  
0.555014707  
0.5771445611  
0.6031282981  
0.6295829232  
0.6516306836  
0.6633467063  
0.6584074864  
0.6308551461  
0.5758751089  
0.4904804261  
0.3740010164  
0.2283180528  
0.05780121063  
-0.1310264107  
-0.3300667705  
-0.5303752055  
-0.7229644593  
-0.8995796712  
-1.053365045  
-1.179357165  
-1.274757091  
-1.338965772  
-1.37339397  
-1.381063948  
-1.366063715  
-1.33291278  
-1.285914432  
-1.228575928  
-1.163167962  
-1.09049108  
-1.009878672  
-0.9194542308  
-0.8166044708  
-0.6986185568  
-0.5633904889  
-0.4100940636  
-0.2397140996  
-0.05535158302  
0.1377562353  
0.3325205321  
0.5205648241  
0.6929924451  
0.8412729474  
0.958117079  
1.038240219  
1.078907016  
1.080202957  
1.044994969  
0.9786069188  
0.8882548471  
0.782321958  
0.6695715029  
0.5583826184  
0.4561013572  
0.3685521894  
0.2997571918  
0.2518528662  
0.225187851  
0.2185616378  
0.2295495837  
0.2548627984  
0.2906971131  
0.3330379202  
0.3779009177  
0.4215109489  
0.460416374  
0.4915691255  
0.5123789567  
0.5207599474  
0.5151740828  
0.4946755585  
0.4589404223  
0.4082733109  
0.3435745532  
0.2662627483  
0.1781491736  
0.08128375951  
-0.02221920012  
-0.1303273059  
-0.2412048573  
-0.3532466285  
-0.4650414082  
-0.5752567803  
-0.6824734813  
-0.7850035555  
-0.880736617  
-0.9670633034  
-1.040901103  
-1.098854465  
-1.13748868  
-1.153706968  
-1.145164935  
-1.110675854  
-1.05053187  
-0.9666852721  
-0.8627545574  
-0.7438255351  
-0.6160728187  
-0.4862314266  
-0.3609798414  
-0.246317123  
-0.1470117694  
-0.06618870633  
-0.00512814348  
0.03671288605  
0.06144675112  
0.0723068743  
0.07307365307  
0.06745398388  
0.0585231691  
0.04830883601  
0.03760135794  
0.02602109089  
0.01234891762  
-0.004934851087  
-0.0269866706  
-0.05394189018  
-0.08438320968  
-0.1150677154  
-0.1410018044  
-0.1558966205  
-0.1529907425  
-0.1261323107  
-0.07097072509  
0.01393425202  
0.1263083047  
0.2598452995  
0.4045201752  
0.5475766613  
0.6751391046  
0.774274141  
0.8352265519  
0.8534796549  
0.8312691223  
0.7781991994  
0.7107132568  
0.6503154523  
0.6206408282  
0.6436724118  
0.7355916639  
0.9028921125  
1.139429195  
1.425041357  
1.726192027  
1.998840206  
2.193389301  
2.261231213  
2.162067171  
1.870961411  
1.384013366  
0.7216160588  
-0.07144522654  
-0.929390355  
-1.772137044  
-2.514559517  
-3.077135687  
-3.396487822  
-3.434274108  
-3.18303554  
-2.668052189  
-1.944805898  
-1.092346577  
-0.2034631947  
0.6269374237  
1.313582883  
1.7910485  
2.021048155  
1.995880414  
1.737708777  
1.294004529  
0.7299770531  
0.1192549398  
-0.4658113694  
-0.9628679616  
-1.326209214  
-1.530660496  
-1.572437612  
-1.46717553  
-1.245679922  
-0.948205169  
-0.6181674009  
-0.2961636156  
-0.01503484797  
0.2035232201  
0.3505517897  
0.4296065836  
0.4549595792  
0.4485781465  
0.4363626709  
0.4441325942  
0.4938432938  
0.6004351705  
0.7696330692  
0.9968999117  
1.267626144  
1.558524816  
1.840083235  
2.079815794  
2.245988612  
2.311406611  
2.256841559  
2.073695178  
1.765545489  
1.348345264  
0.8491981359  
0.3037994475  
-0.2471799439  
-0.7623464075  
-1.203949739  
-1.541824427  
-1.756397457  
-1.840415947  
-1.799199195  
-1.649444068  
-1.416814782  
-1.13267729  
-0.8304627793  
-0.5421282011  
-0.2951343354  
-0.1102457213  
-0.0003099049877  
0.02998615644  
-0.01650396527  
-0.1306412657  
-0.2986425928  
-0.5038523622  
-0.7284280297  
-0.9547950186  
-1.166788957  
-1.350482066  
-1.494709494  
-1.591372314  
-1.635561937  
-1.625560596  
-1.562747169  
-1.451398112  
-1.298392657  
-1.112784072  
-0.9052403996  
-0.6873494121  
-0.4708210315  
-0.2666323078  
-0.08419919482  
0.06934868997  
0.1896923941  
0.275573984  
0.3287225116  
0.3534476835  
0.3559300387  
0.343297629  
0.3225987078  
0.2998197539  
0.2790903751  
0.2621995937  
0.2485143202  
0.2353252578  
0.2185820488  
0.1939198913  
0.1578248436  
0.1087448346  
0.04796219771  
-0.01994103072  
-0.08713909626  
-0.1431741453  
-0.1760814123  
-0.1738908978  
-0.1263094368  
-0.02634580531  
0.1283727253  
0.3347940902  
0.5842973034  
0.863258671  
1.154276378  
1.437905894  
1.694672785  
1.907101963  
2.061480874  
2.149134041  
2.167050386  
2.117803826  
2.00882411  
1.851152748  
1.657904761  
1.442674669  
1.218126968  
0.9949538487  
0.7813151015  
0.5827761097  
0.4026752456  
0.2427678652  
0.1039669659  
-0.01302534498  
-0.1073546716  
-0.178019671  
-0.2242675218  
-0.2462924313  
-0.2460915156  
-0.228263039  
-0.2005215764  
-0.1737471884  
-0.1614255952  
-0.1784704136  
-0.2395083594  
-0.3568357506  
-0.5383279675  
-0.7856361964  
-1.092985646  
-1.446829169  
-1.826488875  
-2.205781478  
-2.555462245  
-2.846194917  
-3.051669809  
-3.151442773  
-3.133127812  
-2.993651311  
-2.739419897  
-2.385418819  
-1.953391966  
-1.469389433  
-0.9610228655  
-0.4547925668  
0.02620833936  
0.4639721827  
0.8465225176  
1.168104272  
1.428699378  
1.633009208  
1.789087262  
1.906793602  
1.996269175  
2.066546222  
2.124430296  
2.173727264  
2.214883648  
2.245056394  
2.258622405  
2.248083453  
2.205286429  
2.122832784  
1.995512245  
1.821559046  
1.603542052  
1.348705079  
1.068655035  
0.7783615687  
0.4945548796  
0.2336999921  
0.009827220535  
-0.1674587688  
-0.294466379  
-0.3741217088  
-0.4157349974  
-0.4338064417  
-0.4460078508  
-0.4706226549  
-0.5238316706  
-0.6172579026  
-0.7561684252  
-0.9386175023  
-1.155657087  
-1.392587091  
-1.631010957  
-1.851365011  
-2.03549874  
-2.168909179  
-2.242290936  
-2.252228627  
-2.200979245  
-2.095493866  
-1.945906679  
-1.763811978  
-1.560645188  
-1.346424712  
-1.12901661  
-0.9139566354  
-0.7047648708  
-0.5035837251  
-0.3119299579  
-0.131365725  
0.03609967408  
0.1879393036  
0.3213928421  
0.4340155571  
0.5243533216  
0.5925652559  
0.6408488198  
0.6735194613  
0.6967160567  
0.7177342955  
0.7440923674  
0.7824736849  
0.8377182599  
0.9120377703  
1.004577497  
1.111410334  
1.225951332  
1.339739807  
1.443456498  
1.528029226  
1.585665143  
1.610667545  
1.599943241  
1.553158471  
1.472558063  
1.362502218  
1.228831966  
1.078155107  
0.9171773928  
0.7521438878  
0.5884539546  
0.4304604335  
0.2814365961  
0.1436647621  
0.01859500984  
-0.0929814268  
-0.1907902702  
-0.2749876388  
-0.3461321253  
-0.4051923038  
-0.4535726509  
-0.4930991223  
-0.5259516969  
-0.5545145854  
-0.5811520167  
-0.6079265255  
-0.6363142276  
-0.6669619964  
-0.699542343  
-0.7327577117  
-0.7645077321  
-0.7922136348  
-0.8132623382  
-0.8254983019  
-0.8276838807  
-0.8198280928  
-0.8033142041  
-0.7807801528  
-0.7557389707  
-0.7319874365  
-0.7128870375  
-0.7006372266  
-0.6956789313  
-0.6963458386  
-0.6988637217  
-0.6977292058  
-0.6864491981  
-0.6585425023  
-0.6086694523  
-0.533695242  
-0.4335201762  
-0.311502579  
-0.1743736541  
-0.03161344611  
0.1056628587  
0.2261725309  
0.3200910626  
0.3805904723  
0.4050552107  
0.3957631964  
0.359892589  
0.3088032971  
0.256651651  
0.2185029365  
0.2081762284  
0.2361315642  
0.30769586  
0.4219150366  
0.5712178604  
0.7420006454  
0.9160703293  
1.072811892  
1.191774497  
1.255356395  
1.251199258  
1.173959894  
1.026201218  
0.8182759346  
0.5672044141  
0.2947229263  
0.02476149322  
-0.2192853826  
-0.4171344026  
-0.553705765  
-0.6204818754  
-0.61601804  
-0.5455971258  
-0.4201497052  
-0.2546441497  
-0.0661997413  
0.1278119273  
0.3114474803  
0.4714803644  
0.5982039932  
0.6857201981  
0.7317810863  
0.7372746985  
0.705492556  
0.6413199287  
0.5504659621  
0.4388336169  
0.3120766591  
0.1753549618  
0.03326459221  
-0.1101053101  
-0.2510532782  
-0.3861466678  
-0.512143793  
-0.6259939337  
-0.7249158595  
-0.8065369987  
-0.8690693241  
-0.9114701792  
-0.9335642919  
-0.9360857898  
-0.920633199  
-0.8895288291  
-0.8456049425  
-0.7919379516  
-0.731565884  
-0.6672151248  
-0.6010810034  
-0.5346685289  
-0.4687268793  
-0.4032686245  
-0.3376825049  
-0.2709161679  
-0.2017226291  
-0.1289280962  
-0.05170039685  
0.03022094886  
0.1163638618  
0.2054565061  
0.2954705159  
0.383774029  
0.4673830891  
0.5432789256  
0.6087601226  
0.661769346  
0.7011611116  
0.7268532364  
0.7398485554  
0.7421000026  
0.7362406586  
0.7252003342  
0.7117637464  
0.6981292204  
0.6855352581  
0.6740167908  
0.6623339867  
0.6481015288  
0.6281039252  
0.5987629638  
0.5566955374  
0.4992785845  
0.4251351201  
0.3344743437  
0.229219303  
0.112911593  
-0.009602356098  
-0.132660535  
-0.2503709271  
-0.35722001  
-0.4486133868  
-0.5212814292  
-0.5734992396  
-0.6051117521  
-0.6173674116  
-0.6126094006  
-0.5938841062  
-0.5645292569  
-0.5278116869  
-0.4866575566  
-0.4435034472  
-0.400272572  
-0.3584444301  
-0.3191859947  
-0.2834893063  
-0.2522691937  
-0.2263859006  
-0.2065783275  
-0.1933156892  
-0.1866005546  
-0.185776874  
-0.1893934204  
-0.1951841707  
-0.2001929269  
-0.2010577518  
-0.1944277809  
-0.1774565544  
-0.1483013476  
-0.1065306619  
-0.05336734147  
0.008306349838  
0.074198725  
0.1391039281  
0.197578485  
0.244710728  
0.2768601416  
0.2922505647  
0.2913104733  
0.2766986001  
0.2529867128  
0.2260402543  
0.202177926  
0.1872280198  
0.1856310185  
0.1997196761  
0.2292979971  
0.271588745  
0.3215613696  
0.3726074133  
0.4174517369  
0.4491834725  
0.4622311734  
0.4531502812  
0.4210963271  
0.3679146277  
0.2978372669  
0.216834528  
0.1317314149  
0.04921992475  
-0.02506794193  
-0.08729198845  
-0.1358295957  
-0.1713377057  
-0.1964564735  
-0.2152103266  
-0.2322186227  
-0.251843368  
-0.2774240955  
-0.3107074293  
-0.3515637698  
-0.3980245717  
-0.4466151902  
-0.4929188783  
-0.5322706933  
-0.5604594524  
-0.5743232289  
-0.5721531002  
-0.5538407013  
-0.5207691143  
-0.4754724368  
-0.4211388013  
-0.3610518565  
-0.298066701  
-0.2342176647  
-0.1705146288  
-0.1069701654  
-0.04283469487  
0.02300370458  
0.09153405113  
0.163149125  
0.2372840478  
0.3122306183  
0.3851842822  
0.4525227356  
0.5102696434  
0.5546745884  
0.5828065997  
0.5930507292  
0.585420848  
0.5616299354  
0.524892313  
0.4794915755  
0.4301886331  
0.3815567463  
0.3373695637  
0.3001245827  
0.2707944624  
0.2488237707  
0.2323725222  
0.2187445046  
0.2049297555  
0.1881530295  
0.1663418302  
0.1384386538  
0.1045168704  
0.06569339631  
0.02387012076  
-0.01863639401  
-0.05950618113  
-0.09679579621  
-0.1292177665  
-0.1562940209  
-0.1783559244  
-0.1964162523  
-0.2119466546  
-0.2265981361  
-0.2419298671  
