799.3484284  
869.7788653  
1010.978366  
1329.918116  
2525.774015  
3206.571664  
6104.984956  
15434.79279  
16697.53641  
19228.93747  
16384.17316  
39471.34973  
1368.721284  
16390.78385  
17682.43156  
10758.84668  
5055.708325  
16631.01912  
1019.599316  
5827.135823  
10492.00272  
17414.44351  
17680.99389  
31642.81446  
12719.87031  
15384.51453  
8913.589029  
2402.106864  
4194.328249  
5864.815009  
1617.976155  
9702.419518  
13722.51322  
5066.405243  
724.1329037  
7113.057974  
10141.13943  
15214.30459  
2888.024788  
2616.360959  
8842.641184  
4345.021161  
7922.131823  
3670.587412  
2283.905892  
13715.49468  
877.094622  
4309.116787  
7447.932208  
2985.924054  
12643.78268  
1913.435771  
4974.816078  
1561.568798  
3509.078744  
2915.926025  
2690.536173  
2877.30156  
545.9056604  
540.4993842  
773.5738526  
737.5187799  
133.0400827  
824.3125671  
477.2060265  
142.3235332  
74.37475839  
81.55565643  
73.29521096  
73.21457718  
38.28823335  
9.558541423  
11.45244901  
25.47939155  
39.04927015  
23.15771681  
6.879872161  
6.002741178  
11.5991774  
6.146468444  
4.731093573  
9.179909081  
7.03149344  
3.400192079  
6.251799059  
4.415628029  
4.167878365  
3.567910863  
3.660241269  
3.539417915  
3.312683279  
2.841328368  
2.772154067  
2.565487656  
2.4165524  
2.279885919  
2.15707613  
2.013169165  
1.894675857  
1.824742017  
1.721060126  
1.630660091  
1.561947039  
1.466427105  
1.407234902  
1.332074649  
1.269658032  
1.214490696  
1.159323767  
1.103578063  
1.054938792  
1.008509007  
0.9643545302  
0.924520726  
0.885184437  
0.8492930694  
0.8146392208  
0.7811757425  
0.7503416003  
0.7211794543  
0.6932637548  
0.6669224468  
0.6414699863  
0.6174403722  
0.5948168726  
0.5733906149  
0.5525333767  
0.5330906852  
0.5143696068  
0.4964303253  
0.4795237123  
0.4631840643  
0.4475962582  
0.4326993667  
0.418479805  
0.4048557403  
0.3918264399  
0.3793151143  
0.3673707795  
0.3558978807  
0.3448876727  
0.3343298899  
0.3241802616  
0.3144631045  
0.3051062039  
0.2960898596  
0.2874487206  
0.2791293256  
0.2711383016  
0.2634308235  
0.2560173848  
0.2488842286  
0.2419945383  
0.2353650611  
0.2289718102  
0.222802256  
0.2168555107  
0.2111118647  
0.2055742287  
0.2002306474  
0.1950583985  
0.190074727  
0.1852360504  
0.1805716927  
0.176055744  
0.1716980416  
0.1674810669  
0.1633966582  
0.1594436579  
0.1556147437  
0.1519101673  
0.1483205236  
0.1448493406  
0.1414772799  
0.1382025589  
0.1350286486  
0.1319589118  
0.1289868628  
0.1260955553  
0.1232942915  
0.1205708066  
0.1179216098  
0.1153618445  
0.1128693252  
0.1104532749  
0.1080939129  
0.1058034849  
0.1035897883  
0.1014311807  
0.09933110392  
0.09728683928  
0.09530078625  
0.09336882599  
0.09149267469  
0.0896589182  
0.08788418925  
0.08615199732  
0.0844618823  
0.08282570468  
0.08122419962  
0.07966619714  
0.07814542344  
0.07666227798  
0.07522950173  
0.07382134878  
0.07244677288  
0.07111347747  
0.06981438557  
0.06854021102  
0.06730278133  
0.06609155795  
0.06491639215  
0.06376882149  
0.06264508722  
0.06154384631  
0.06047693826  
0.05943074611  
0.05841028609  
0.05741274529  
0.05644531421  
0.05549460562  
0.05456133196  
0.05365345936  
0.05277372148  
0.0519018324  
0.05105669088  
0.05023241733  
0.04942267282  
0.04862996451  
0.04785349675  
0.04709991931  
0.04635933179  
0.04563017504  
0.04492690487  
0.04423225474  
0.0435536697  
0.04288612367  
0.04224012861  
0.04160569956  
0.0409825408  
0.04037281948  
0.03977695487  
0.03919464999  
0.03861740501  
0.03806134475  
0.03751145715  
0.03697334233  
0.03644648161  
0.03593107166  
0.03542428043  
0.03493127741  
0.03444380567  
0.03397141802  
0.03350084215  
0.03304696414  
0.03259883157  
0.03215728824  
0.03172647467  
0.03130135588  
0.03089063667  
0.03048037014  
0.03008358329  
0.02969360522  
0.02930743543  
0.02893063027  
0.02856198036  
0.02820016113  
0.02784581733  
0.02749403169  
0.02714656061  
0.02681269501  
0.02648345123  
0.02615775711  
0.02584476481  
0.02552979519  
0.02522333423  
0.02492008172  
0.02462450817  
0.02433415608  
0.02405085147  
0.02376697519  
0.02349147095  
0.0232242305  
0.02295522567  
0.02269702591  
0.02243584167  
0.02218534607  
0.02193925127  
0.02169446586  
0.02145509447  
0.02122140331  
0.02098928647  
0.02076063956  
0.02053875347  
0.02031801247  
0.02010289181  
0.01988965725  
0.01968369951  
0.01947584774  
0.0192712901  
0.01907499191  
0.01888222505  
0.01868919256  
0.01849866944  
0.01831401924  
0.01813001197  
0.01795201605  
0.01777396975  
0.0175982623  
0.01743001144  
0.01726139445  
0.01709527953  
0.01693170132  
0.01677291054  
0.01661244476  
0.01645709291  
0.01630522532  
0.01615303996  
0.01600819452  
0.01585835815  
0.01571556813  
0.0155765654  
0.01543693092  
0.01530094705  
0.0151654209  
0.01503357837  
0.01490120028  
0.01477445948  
0.01464706051  
0.01452279517  
0.0143995896  
0.01427734084  
0.01415979496  
0.01404188339  
0.01392735335  
0.01381197778  
0.0137011064  
0.01359035306  
0.01348200691  
0.01337414657  
0.01327048086  
0.01316590249  
0.01306389365  
0.01296263714  
0.01286252456  
0.01276700489  
0.01266988963  
0.01257402366  
0.01248131033  
0.01239014307  
0.01229892411  
0.01221071532  
0.01212159706  
0.01203495557  
0.01195016137  
0.01186474061  
0.0117829375  
0.01170241983  
0.0116216677  
0.01154143832  
0.01146368332  
0.01138624807  
0.01131124672  
0.0112373884  
0.01116337188  
0.01108977645  
0.01101928326  
0.01094793203  
0.01087788879  
0.0108110475  
0.01074516641  
0.01067610705  
0.01061176083  
0.01054848155  
0.01048225912  
0.01042133483  
0.010359725  
0.01029933152  
0.01023926183  
0.01018065325  
0.01012181141  
0.01006613936  
0.01000949615  
0.009955567692  
0.009899037863  
0.009846201241  
0.009793420315  
0.009739229273  
0.009689010612  
0.009637330397  
0.009588108371  
0.009537977392  
0.009490437882  
0.009442786757  
0.009397102181  
0.009350376299  
0.009304520355  
0.009258704636  
0.009216041101  
0.009172309383  
0.009129913852  
0.009088269634  
0.009045388465  
0.009004699936  
0.008965048059  
0.008924939261  
0.008887151058  
0.008847270653  
0.008810895241  
0.008772862413  
0.00873762339  
0.008700776944  
0.008667051646  
0.008632917323  
0.008597812089  
0.008564057665  
0.008531026139  
0.008500989335  
0.008467877035  
0.008435644597  
0.008404937316  
0.008373901451  
0.008344152674  
0.008315705482  
0.008288072983  
0.008260000333  
0.008231727801  
0.008203893746  
0.008176274064  
0.008151102733  
0.008125763256  
0.00810194419  
0.008075671756  
0.008050190405  
0.00802791743  
0.008005885613  
0.007983715168  
0.007961475762  
0.007937876407  
0.007916183132  
0.007895357636  
0.007874827949  
0.007854765533  
0.007835908248  
0.007816470874  
0.007795962192  
0.007779581937  
0.007759664066  
0.007744768344  
0.007727303186  
0.007711064682  
0.007693387208  
0.00767794494  
0.007664054564  
0.007648135304  
0.007634707925  
0.007620099784  
0.007604959585  
0.007593057492  
0.007579972626  
0.007565746708  
0.007555175176  
0.007544046053  
0.007531821279  
0.007521379746  
0.007509236952  
0.007500291528  
0.007490713232  
0.007480283037  
0.007472359825  
0.007463364656  
0.007455541412  
0.007447558286  
0.007438806822  
0.00743193285  
0.007425327026  
0.007420509273  
0.007412638191  
0.007407891696  
0.007401954752  
0.007397312832  
0.007392485917  
0.007388907972  
0.007383814793  
0.007380516703  
0.007378811374  
0.007376012783  
0.007373468506  
0.007371164962  
0.007369491061  
0.007370224959  
0.007366986302  
0.007366587592  
0.007367084094  
