77.02829619  
104.0941066  
155.2568278  
267.5583581  
1602.40992  
33340.60656  
1492.084194  
61917.44937  
3480.965273  
29868.80606  
464.4088069  
21999.24435  
6868.980779  
88166.689  
10164.8862  
11593.05171  
30189.07529  
4321.303239  
8310.868558  
19908.85979  
1952.172736  
5782.883012  
4506.571266  
6091.84911  
631.514283  
19880.61654  
5614.363937  
2799.50319  
2647.337505  
14370.38242  
10018.00066  
3313.077671  
5254.755841  
759.7053512  
2888.71903  
3266.354247  
3699.227329  
1826.555169  
688.7112489  
2211.467254  
3579.130021  
1622.84246  
5044.464996  
102.925691  
1238.878701  
4917.145863  
3408.211777  
8423.784807  
187.1465668  
1136.959433  
721.3291865  
4122.557166  
5523.120864  
853.2877481  
1374.090962  
4880.773824  
1132.234027  
1044.327619  
206.8761284  
1112.407371  
637.9956928  
49.56499526  
356.6223102  
1366.388596  
94.25999596  
591.15957  
124.2893234  
250.9048743  
335.7701244  
15.65107629  
93.37883392  
71.57213755  
7.138336273  
6.653489997  
50.45229084  
17.46969956  
14.29656194  
36.39728765  
15.29396006  
17.21412752  
14.89569693  
15.64012748  
14.05862504  
12.28866215  
11.60677084  
9.991293251  
8.102937228  
8.173881752  
7.319757199  
6.947034185  
6.600373941  
6.054947006  
5.822858442  
5.377538701  
5.116687807  
4.777389487  
4.50480475  
4.238203078  
4.122397874  
3.914269223  
3.687038469  
3.513937533  
3.359619762  
3.178748374  
3.01408928  
2.912860063  
2.78057935  
2.661709535  
2.551451585  
2.443880934  
2.347156744  
2.256851508  
2.170297481  
2.083447904  
2.004220246  
1.926814929  
1.863383907  
1.794125771  
1.731215325  
1.672467684  
1.61229198  
1.559674756  
1.509846253  
1.457963571  
1.413305848  
1.368931877  
1.324462626  
1.284133133  
1.246069223  
1.208141063  
1.173060245  
1.139110644  
1.105678279  
1.074783125  
1.044980574  
1.015880158  
0.9885321018  
0.9619804792  
0.9362839106  
0.9118537355  
0.8882262364  
0.8654827888  
0.8435093622  
0.8224876026  
0.8023280736  
0.7827842962  
0.7637812619  
0.7457408804  
0.7280991122  
0.7112093921  
0.6949055012  
0.6790580655  
0.6637705342  
0.6490011883  
0.6346918361  
0.6209317108  
0.6075024812  
0.5946172992  
0.5821159098  
0.569977622  
0.5582126742  
0.546832483  
0.5357709033  
0.5251071129  
0.5147048015  
0.5046434244  
0.4948468982  
0.4853952357  
0.4761821808  
0.4672348328  
0.4585375176  
0.4500920853  
0.4419080314  
0.433891947  
0.4261448538  
0.4185918334  
0.4112749442  
0.4041134461  
0.3971845094  
0.3904055407  
0.3838248786  
0.3773984399  
0.371179111  
0.3650664849  
0.3591403155  
0.3533662376  
0.3477146497  
0.3422335738  
0.3368806944  
0.3316340168  
0.3265410364  
0.3215582398  
0.3167194616  
0.3119721811  
0.3073468817  
0.3028220817  
0.2984373922  
0.2941108403  
0.2898882883  
0.2857926438  
0.281754939  
0.2778343185  
0.2740035633  
0.2702343271  
0.2665723125  
0.2629964517  
0.25947465  
0.2560482895  
0.2526789575  
0.2493814  
0.2461601759  
0.2430149317  
0.2399340734  
0.2369283252  
0.2339621625  
0.2310541353  
0.2282388478  
0.2254500628  
0.2227368161  
0.2200754647  
0.2174527143  
0.2149077092  
0.2123840522  
0.2099169968  
0.2075075263  
0.2051435761  
0.202820776  
0.2005571476  
0.1983179052  
0.1961277485  
0.1940004004  
0.1918891169  
0.1898207669  
0.1877987708  
0.1857980273  
0.1838465889  
0.1819290621  
0.1800384854  
0.1781892333  
0.1763737156  
0.1745982149  
0.1728450969  
0.1711293422  
0.1694358431  
0.167770299  
0.1661420814  
0.1645371798  
0.1629663739  
0.1614305671  
0.1599006037  
0.1584058083  
0.1569311273  
0.1554886142  
0.1540812714  
0.1526712184  
0.1513053667  
0.1499516192  
0.1486320404  
0.1473217366  
0.1460260939  
0.1447659516  
0.1435197971  
0.1423161582  
0.1410939518  
0.1399130111  
0.1387510257  
0.1376110488  
0.1364743023  
0.1353602634  
0.1342653835  
0.1332012793  
0.1321380414  
0.1310962833  
0.1300606404  
0.1290545125  
0.1280485359  
0.1270780712  
0.1261106764  
0.1251673402  
0.1242298779  
0.1233036853  
0.1223934344  
0.1214945652  
0.120614823  
0.1197468377  
0.118889423  
0.1180491622  
0.1172152494  
0.1163954063  
0.1155818835  
0.1147969746  
0.1140158774  
0.1132433707  
0.1124809834  
0.1117178766  
0.1109826591  
0.1102565261  
0.1095379685  
0.1088303208  
0.1081208466  
0.1074358185  
0.1067490437  
0.1060890718  
0.1054280527  
0.1047880282  
0.1041228788  
0.1035046874  
0.1028774621  
0.1022546759  
0.1016464424  
0.1010501711  
0.1004588535  
0.09987550862  
0.09929910339  
0.09872831627  
0.09816833884  
0.09761626866  
0.09706023398  
0.09652482562  
0.09600933299  
0.09546740032  
0.09495421834  
0.09444548084  
0.09394433915  
0.09346031419  
0.09296876149  
0.09248434051  
0.09199101794  
0.09152905906  
0.0910657306  
0.09060248883  
0.09015177214  
0.08970956219  
0.08927286045  
0.08883308321  
0.08840785601  
0.08798189135  
0.08756727731  
0.08714835346  
0.08674201843  
0.0863342354  
0.08593970713  
0.0855448155  
0.08517044773  
0.08477848634  
0.0844019446  
0.08402125285  
0.08366177254  
0.08330032492  
0.08293346499  
0.08258918923  
0.08224318056  
0.0818913732  
0.0815526168  
0.08121385336  
0.08090160735  
0.08056037891  
0.08024443816  
0.07992461642  
0.07960420392  
0.0792948894  
0.07897845074  
0.07869002473  
0.07838590909  
0.07809426355  
0.0778019003  
0.07751483519  
0.07722743118  
0.07694657921  
0.07667835148  
0.07639872465  
0.07614005369  
0.0758580156  
0.07560252865  
0.07533880542  
0.07509197852  
0.07483300397  
0.0745824837  
0.07434575778  
0.07410372158  
0.0738623256  
0.07362915701  
0.07339025446  
0.07316603705  
0.07294141782  
0.0727163895  
0.07248939108  
0.07227192944  
0.07206510165  
0.07184571873  
0.07164175404  
0.07143934536  
0.07123256754  
0.07102945613  
0.07083960104  
0.07064648327  
0.07044869625  
0.07026272158  
0.07007682304  
0.06989805404  
0.06971034897  
0.06952980631  
0.0693474612  
0.06918585859  
0.06900458313  
0.06883629657  
0.06866952258  
0.06850885283  
0.06834713376  
0.06819159699  
0.06802987954  
0.06787085706  
0.06772214467  
0.06757813197  
0.0674287138  
0.06728661457  
0.06714405545  
0.0669987895  
0.06686561368  
0.06672671502  
0.06658984109  
0.06645987303  
0.066332898  
0.06620972402  
0.06607712109  
0.06595477154  
0.0658417674  
0.06571564752  
0.0655967653  
0.06548926787  
0.06537431039  
0.06526322688  
0.06515485993  
0.06504682979  
0.06494200497  
0.06483516891  
0.06474309425  
0.06463936282  
0.06455255233  
0.06445174393  
0.06435839097  
0.06426155773  
0.06417680228  
0.06409169281  
0.06399632061  
0.06391874173  
0.06382826056  
0.06376990429  
0.06368408009  
0.06360165178  
0.06352947889  
0.06345219313  
0.06338288143  
0.06331908018  
0.06325486932  
0.06319074127  
0.06312993271  
0.06307037192  
0.063010769  
0.06294776189  
0.06289060366  
0.06283661569  
0.06278151898  
0.06272838433  
0.06267470359  
0.06263633966  
0.06259075921  
0.06254090033  
0.06250138476  
0.0624600472  
0.06242089991  
0.06238122459  
0.06235140943  
0.06231766626  
0.06228503378  
0.06226037471  
0.06222446112  
0.06219369983  
0.06217093113  
0.06214313128  
0.06211700571  
0.06210083634  
0.06207996615  
0.06206472348  
0.06205413584  
0.06203996372  
0.06202425817  
0.06202623896  
0.06200623544  
0.061998522  
0.06199839254  
0.06199247032  
0.06198518234  
0.06198008346  
