9.80567243  
12.07139087  
17.14816542  
30.07888239  
112.2023759  
2984.792448  
43371.48064  
4278.887516  
51992.26942  
50158.49213  
38366.5486  
27597.88305  
26812.07384  
10615.31425  
774.672297  
8346.508084  
2019.35821  
4546.728659  
37879.84755  
27107.39571  
17928.69795  
2433.065835  
19962.72993  
1658.721763  
634.8419354  
2233.933396  
2201.501316  
13681.86896  
1872.715629  
531.1629639  
16577.54073  
1845.85768  
4705.610756  
5822.225159  
5745.449623  
835.3318345  
787.2124428  
6325.258737  
2706.708938  
5631.745955  
1995.349497  
2199.681581  
3115.430893  
1083.116037  
5028.917659  
1422.862092  
2919.407331  
79.57102769  
973.1730265  
884.5155518  
1180.448516  
1565.680974  
5083.723069  
3554.642223  
527.5312291  
225.514126  
370.2227089  
1130.243083  
1131.204074  
1004.034439  
58.64099009  
97.06743267  
196.8783254  
172.7739764  
186.656564  
77.00339904  
26.74471949  
4.052489704  
10.48191971  
18.37431886  
20.23062011  
1.917731322  
11.617685  
8.432382293  
2.014163356  
4.291141294  
2.355558713  
1.654806667  
0.3440197541  
0.5130945124  
0.5423705722  
1.350615985  
1.549479062  
1.226664741  
0.9575189749  
0.6490308983  
0.7606876158  
0.627946039  
0.7134694117  
0.5645490511  
0.7276590508  
0.624898585  
0.5944546823  
0.5812349831  
0.4950464681  
0.5084235079  
0.5172960374  
0.4994530697  
0.4737217337  
0.4552657576  
0.4367284046  
0.4243334555  
0.4063187474  
0.3973675654  
0.3880678689  
0.3738527931  
0.3652689103  
0.3566871232  
0.3470961095  
0.3359255975  
0.3256668611  
0.31804915  
0.3099860303  
0.3027226232  
0.2952498657  
0.2879731335  
0.2807726989  
0.2744092793  
0.2683730111  
0.2629335537  
0.2571241257  
0.2514113109  
0.2463416135  
0.2411474127  
0.2360833108  
0.2315092672  
0.2270144181  
0.2225595913  
0.2182399453  
0.2141105857  
0.2101052188  
0.2062675698  
0.202525119  
0.1989051204  
0.195376976  
0.192007308  
0.1886753375  
0.1854663369  
0.182362835  
0.1793351673  
0.1763870425  
0.1735286442  
0.1707481743  
0.1680587954  
0.1654241025  
0.1628741232  
0.1603894861  
0.1579618231  
0.1556040988  
0.1533030552  
0.1510579304  
0.1488676052  
0.1467398066  
0.1446615428  
0.1426247862  
0.1406534846  
0.1387181292  
0.1368308398  
0.1349881546  
0.1331834993  
0.1314244598  
0.1297051425  
0.1280260608  
0.12637429  
0.1247728405  
0.1232040471  
0.1216639904  
0.1201505464  
0.118683847  
0.1172386262  
0.1158297972  
0.1144457747  
0.1130941546  
0.1117645195  
0.1104664272  
0.1091943571  
0.1079477642  
0.1067275516  
0.1055299235  
0.1043545531  
0.1031993803  
0.102068321  
0.1009631073  
0.09987318184  
0.09881096338  
0.097763653  
0.09673523248  
0.09572530229  
0.09473623863  
0.09376563687  
0.09281094966  
0.09187118682  
0.09095237618  
0.09004972841  
0.0891637755  
0.08828921659  
0.08743444677  
0.08659070588  
0.0857617848  
0.08494629375  
0.0841498688  
0.08336229019  
0.08258922748  
0.08183017681  
0.08108352286  
0.08034973928  
0.07962636327  
0.07891344855  
0.07821359668  
0.07752565925  
0.0768475363  
0.07618074328  
0.07552729104  
0.07487779815  
0.07424656528  
0.07362043797  
0.07300035764  
0.07239669764  
0.07179973106  
0.07121341074  
0.0706295377  
0.07006378662  
0.06949878057  
0.06894756263  
0.06840359588  
0.06786898484  
0.06733858216  
0.06681447913  
0.06630440442  
0.06579787129  
0.06529660222  
0.06480523341  
0.06432340545  
0.06384745495  
0.06337504148  
0.06291109268  
0.06245289632  
0.0620023405  
0.06155859601  
0.06112304698  
0.06068989619  
0.06026326287  
0.05984168103  
0.05942706731  
0.05901918766  
0.05861811197  
0.05821822808  
0.05782525096  
0.05743683113  
0.05705538022  
0.05667979936  
0.05630655481  
0.05593871629  
0.055577888  
0.05522435021  
0.0548689593  
0.05451780557  
0.05417561903  
0.05383555546  
0.05350241787  
0.0531735708  
0.05284701739  
0.05252404804  
0.05220731437  
0.05189468025  
0.05158207817  
0.05127794242  
0.0509762761  
0.05067698709  
0.0503849373  
0.05009285164  
0.04980748904  
0.04952075815  
0.04924367963  
0.04896475879  
0.04869297802  
0.04842360975  
0.04815391238  
0.04789443446  
0.04763222516  
0.04737731905  
0.04712002984  
0.04687048843  
0.04662321773  
0.04637831484  
0.04613951827  
0.04589672696  
0.04566241674  
0.04543052138  
0.04519838136  
0.04496957487  
0.04474699032  
0.04452503121  
0.04430413918  
0.04408858014  
0.04387227106  
0.04366225551  
0.04345013976  
0.04324412873  
0.04303942465  
0.04283676975  
0.04263715815  
0.04243927553  
0.04224490265  
0.04205129685  
0.04185975411  
0.04166972264  
0.04148489784  
0.0413014755  
0.04111845035  
0.04093802761  
0.04076134769  
0.04058479564  
0.04041021387  
0.04023787011  
0.0400679915  
0.03989785341  
0.03973150905  
0.0395695299  
0.0394058551  
0.03924528867  
0.03908497654  
0.03892898826  
0.03877420311  
0.03862109697  
0.03846931621  
0.03831851464  
0.03817072432  
0.03802189942  
0.03787979097  
0.0377353383  
0.03759332107  
0.03745442558  
0.03731352428  
0.03717803458  
0.03704272852  
0.0369070341  
0.03677429955  
0.03664383586  
0.03651436739  
0.03638691908  
0.03626189874  
0.03613734636  
0.03600952085  
0.03588759864  
0.03576605727  
0.03564783125  
0.03553218515  
0.0354126877  
0.0352965524  
0.0351822645  
0.03507051473  
0.03495755709  
0.03484891706  
0.03473833459  
0.03463162302  
0.03452354969  
0.03441822077  
0.03431412931  
0.03421217991  
0.03410878321  
0.03400754286  
0.03390969684  
0.03381151415  
0.03371358515  
0.03361542795  
0.03352254265  
0.03342860973  
0.03333673456  
0.03324183745  
0.03315220827  
0.03306335351  
0.03297341591  
0.03288656354  
0.03280159307  
0.03271432066  
0.03263125946  
0.0325456022  
0.03246476461  
0.03238225071  
0.03230337374  
0.0322227859  
0.03214680904  
0.03206682156  
0.03199240961  
0.03191458571  
0.03184017289  
0.03176660415  
0.03169398344  
0.03162201427  
0.03155241656  
0.03148217867  
0.03141265668  
0.03134364555  
0.03127671903  
0.03121083992  
0.0311440099  
0.03108111314  
0.0310141587  
0.03095190022  
0.03088984611  
0.03082980731  
0.03076703768  
0.03070760962  
0.03064878266  
0.03059102667  
0.03053281784  
0.03047707168  
0.03042058249  
0.03036626457  
0.03031167387  
0.03025740857  
0.03020454183  
0.03015443909  
0.03010287961  
0.03005306051  
0.03000375716  
0.02995276537  
0.0299039025  
0.02985686439  
0.02981317076  
0.0297662988  
0.02971886915  
0.02967745133  
0.02963148678  
0.02958891458  
0.02954832428  
0.02950518169  
0.02946507882  
0.02942432536  
0.02938288918  
0.02934613305  
0.02930690715  
0.02927026306  
0.02923396254  
0.02919690264  
0.02916137334  
0.02912842344  
0.02909467593  
0.02905917647  
0.02902799973  
0.02899500981  
0.02896353646  
0.02893265947  
0.02890159465  
0.02887302365  
0.02884238346  
0.02881560988  
0.02878886186  
0.02876235955  
0.02873620885  
0.02870999449  
0.0286852137  
0.02866110819  
0.02863659236  
0.02861323816  
0.02859215308  
0.02856835704  
0.02854752987  
0.02852764559  
0.02850837683  
0.02848810071  
0.02846970403  
0.02845260111  
0.02843377989  
0.02841855656  
0.02839971272  
0.02838238043  
0.02836914624  
0.02835517613  
0.02834111846  
0.02832630852  
0.02831359989  
0.02830395554  
0.02829208002  
0.02828124565  
0.02826829236  
0.02826068906  
0.02825214962  
0.02824025572  
0.02823522261  
0.02822558996  
0.02821926036  
0.02821385858  
0.02821000472  
0.0282033633  
0.02819809146  
0.02819449389  
0.02819134776  
0.02818846177  
0.02818660755  
0.02818594322  
0.02818499117  
0.02818562631  
