28,-0.0024223,0.014013,0.019265,-0.99031,0.0029833,-1.9007,0.91932,0.32457,3.3072,0.057411,3.2006,0.00028942,0.54422,4.0929,0.017645,5.7097,0.0058143,0.99116,0.11698,0.071381,0.058403,0.04939,0.32335,0.2745,0.29163,0.040213,0.012077,0.0085634,0.049667,0.47678,0.17285,0.012724,42.704,522.33,844.35,665.35,2075.4,0.099204,0.18222,0.18222,3.7782,4.5717,1.5199,0.16996,0.015863,64,57.281,1656,45567,6.6089,49.179,44712,9450,7128,0.93469,0.9439,0.035877,0.027209,0.025878,0.2255,31121,16357,0.00094251,0.00037526,0,0.1031,0,0.048544,0.0052709,0.068214,0.002094,0.087824,1.3217,3.5908,2.6339,0.30873,0.2862,0.27303,0.38145,0.28328,0.13398,0.42309,0.29787,0.10769,21.928,7.3718,33293,81211,80498,0.22567,0.1985,0.084104,0.53355,0.53291,0.10263,0.73722,0.76059,0.098791,0.84984,0.8715,0.089484,0.91802,0.93038,0.081224,0.024629,0.029934,0.22568,0.09185,0.11573,0.07861,0.055228,0.067874,0.23811,0.12792,0.15816,0.11262,0.093665,0.11561,0.24053,0.15995,0.19539,0.14438,0.017034,0.023677,0.308,0.093282,0.11677,0.11914,0.038832,0.054094,0.32153,0.12941,0.16013,0.16231,0.068258,0.093895,0.32757,0.16502,0.19953,0.19661,0.0057813,0.00468,0.12137,0.028939,0.040709,-0.030421,0.011534,0.0092805,0.11988,0.036572,0.049627,-0.040346,0.017693,0.01408,0.11467,0.04198,0.056133,-0.049671,0.0018139,0.0015769,0.29292,0.037203,0.034254,-0.015296,0.0048626,0.0044995,0.24792,0.042926,0.046052,-0.010612,0.0077142,0.0076375,0.19556,0.042688,0.054656,-0.0016255,0.42576,74,74,40,988,3,3,3,0.645
28,-0.0040001,0.019633,0.028535,-0.98561,0.0014777,-1.9454,0.97376,-0.017954,3.8576,0.063379,3.2216,0.00064794,0.61334,3.6251,0.028569,4.788,0.0048757,0.9857,0.079962,0.039877,0.028452,0.022452,0.235,0.32866,0.3599,0.03685,0.011029,0.0058914,0.02267,0.38016,0.31286,0.034953,43.862,513.89,1491.3,2802.9,4852.7,0.087249,0.11538,0.11538,0.93286,1.0984,0.55191,0.21533,0.020635,43,141.42,4917,5.5834e+05,6.225,40.163,1.3276e+05,10665,6426,0.9254,0.9303,0.40229,0.31445,0.22707,0.95225,35888,21527,0.001654,0.00056294,0,0.064569,0,0.055069,0.015202,0.023254,0.015462,0.03533,0.53795,0.26235,0.9831,0.31704,0.31657,0.27373,0.40871,0.35612,0.15936,0.41165,0.38438,0.13373,36.039,7.3908,19109,55001,54066,0.14519,0.15365,0.079923,0.50657,0.54869,0.14392,0.72802,0.77853,0.1441,0.8253,0.86618,0.12835,0.88431,0.914,0.11557,0.046493,0.067142,0.62925,0.22213,0.26882,0.28555,0.094723,0.13139,0.60321,0.27893,0.32614,0.32475,0.14947,0.19988,0.56696,0.32306,0.3673,0.34709,0.02909,0.043256,0.77691,0.20057,0.24416,0.24564,0.059468,0.083114,0.72728,0.24802,0.28745,0.25842,0.094214,0.12566,0.66782,0.28355,0.31854,0.26258,0.015594,0.020941,0.48353,0.10803,0.12564,0.12298,0.031859,0.042597,0.48911,0.14029,0.16083,0.15517,0.050117,0.066062,0.47977,0.16654,0.18701,0.17604,0.0018088,0.0029451,0.43145,0.045312,0.068033,0.091421,0.0052341,0.0079313,0.39415,0.056821,0.080262,0.10431,0.010112,0.014524,0.37865,0.070329,0.094457,0.11359,0.40099,74,74,40,988,3,3,3,0.645
28,-0.0030176,0.015679,0.022258,-0.9888,0.0019446,-1.9334,0.95532,-0.036808,12.516,0.033538,2.776,0.01798,1.2543,8.4501,0.021988,20.322,0.020695,0.98899,0.077695,0.051334,0.042392,0.03584,0.33319,0.28432,0.30882,0.023773,0.0083373,0.0062005,0.035354,0.5017,0.20927,6.5834e-07,129.17,955.91,1476.2,1250.5,3812.4,0.39808,0.20081,0.39808,2.1453,3.7797,1.393,0.21218,0.036317,52,130.54,4512,4.1645e+05,6.2575,42.196,1.2182e+05,36072,6399,0.92761,0.92965,0.10345,0.077142,0.077123,0.3448,32643,17721,0.00093696,0.00046216,0,0.048061,0,0.044416,0.015163,0.062595,0.018775,0.08359,0.98671,2.6017,1.8612,0.31579,0.25541,0.23134,0.37675,0.20338,0.081948,0.39374,0.18474,0.065427,8.9028,6.2462,9327.1,28260,27449,0.29143,0.28436,0.18043,0.7061,0.74554,0.22563,0.86584,0.89575,0.19275,0.93234,0.95072,0.16309,0.96065,0.97214,0.1412,0.014645,0.014065,0.22293,0.065901,0.085623,-0.014096,0.028236,0.027515,0.20224,0.076989,0.10586,-0.011428,0.044104,0.043656,0.18816,0.087177,0.12387,-0.0055396,0.011348,0.011529,0.34086,0.077693,0.088825,0.0051077,0.022807,0.023479,0.31371,0.093784,0.11284,0.011972,0.036704,0.038233,0.29262,0.10836,0.13421,0.020828,0.0031186,0.0024195,0.10876,0.016612,0.030894,-0.035337,0.0057076,0.0044101,0.098555,0.018355,0.035506,-0.043806,0.008331,0.0064146,0.0897,0.019136,0.038526,-0.051621,0.00017847,0.00011671,0.04788,0.0013614,0.013376,-0.016086,0.00043959,0.00028394,0.037233,0.00030769,0.017185,-0.020203,0.00074071,0.00048708,0.031195,-0.00075719,0.020764,-0.023695,0.62129,74,74,40,988,3,3,3,0.645
28,-0.0022095,0.012579,0.017478,-0.99121,0.002479,-1.9094,0.92637,0.073694,2.5132,0.13605,3.2918,0.00037418,0.40081,3.1531,0.016129,4.0979,0.004173,0.99192,0.10076,0.068485,0.056196,0.046952,0.35499,0.30801,0.24371,0.027961,0.011097,0.0085193,0.045702,0.51392,0.24122,0.11909,96.952,585.76,807.41,782.8,2273.8,0.080459,0.15235,0.15235,1.4555,2.22,0.56385,0.15891,0.012218,60,112.7,4168,2.8886e+05,7.2227,54.695,1.1254e+05,10206,9990,0.9224,0.92766,0.33483,0.26092,0.19319,0.76474,97651,36808,0.00071352,0.00036541,0,0.057586,0,0.047982,0.0011431,0.026773,0.00026552,0.029894,0.17039,0.17074,0.70418,0.31618,0.33242,0.27152,0.36786,0.39751,0.20128,0.39145,0.40189,0.17381,52.919,7.3311,22346,72662,71893,0.025714,0.019212,0.016805,0.18516,0.15922,0.062456,0.39284,0.3548,0.092315,0.59375,0.5514,0.10963,0.73893,0.70656,0.11465,0.0095737,0.0084714,0.15384,0.039914,0.062657,-0.032406,0.02281,0.022015,0.17246,0.060762,0.0897,-0.013625,0.04109,0.041098,0.18504,0.082122,0.11573,0.00010272,0.0068134,0.0065095,0.21604,0.044306,0.061836,-0.010538,0.016238,0.017241,0.23578,0.065168,0.091951,0.020291,0.0293,0.032394,0.24659,0.085894,0.12053,0.04407,0.0018651,0.0012931,0.068663,0.0069384,0.022308,-0.037868,0.0044698,0.0031487,0.081471,0.012513,0.027773,-0.050741,0.0082544,0.0059387,0.093815,0.019383,0.032899,-0.06148,0.00089514,0.00066876,0.2535,0.022554,0.022778,-0.0248,0.0026446,0.0020066,0.23645,0.028731,0.029875,-0.033306,0.0053525,0.0040838,0.23795,0.037429,0.038188,-0.043287,0.40215,74,74,40,988,3,3,3,0.645
28,-0.0023292,0.011579,0.016783,-0.99156,0.00091525,-1.9557,0.97235,0.0062624,2.9911,0.085331,3.2559,1.7181e-05,0.40325,3.1199,0.016672,4.1359,0.0042117,0.99165,0.066304,0.036573,0.028656,0.023633,0.29915,0.38168,0.25661,0.027065,0.0074707,0.0048003,0.02323,0.41079,0.29538,0.16053,127.55,1627.6,3308.2,3815.9,8880.2,0.07457,0.10917,0.10917,1.2332,2.0667,0.55875,0.1634,0.013234,50,216.9,5166,6.3464e+05,5.129,30.896,1.3948e+05,51462,40284,0.92353,0.92913,0.42033,0.31926,0.29064,0.80587,77342,39778,0.00087723,0.00039943,0,0.062457,0,0.050681,0.0011471,0.0032669,0.0013328,0.0049581,0.44335,1.9447,0.86083,0.29788,0.34632,0.28707,0.324,0.40496,0.24867,0.33853,0.41457,0.22977,53.17,7.7508,14618,58654,56825,0.021791,0.016031,0.021468,0.16388,0.16318,0.08333,0.35657,0.36838,0.12632,0.52877,0.54731,0.14719,0.66049,0.6801,0.15449,0.0034523,0.0035269,0.083629,0.0077878,0.036021,0.0045363,0.0088556,0.0089148,0.10093,0.016614,0.053868,0.0019271,0.016685,0.016324,0.11327,0.026178,0.069863,-0.0079905,0.0031364,0.0033104,0.14992,0.019141,0.044472,0.010934,0.007762,0.0081515,0.1699,0.030749,0.063644,0.013412,0.014263,0.014612,0.18095,0.042163,0.080638,0.0082543,5.1731e-05,3.2616e-05,0.0028709,-0.0095978,0.0029385,-0.013185,0.00021563,0.00014054,0.0059249,-0.011604,0.0048984,-0.018055,0.00053874,0.00036315,0.0092306,-0.013133,0.0062968,-0.023826,0.00026425,0.00018391,0.11281,0.0048757,0.015599,-0.020544,0.00087789,0.00062273,0.11832,0.0073959,0.021001,-0.027417,0.0018863,0.001351,0.12642,0.010803,0.02646,-0.036826,0.44899,74,74,40,988,3,3,3,0.645
28,-0.0023853,0.01145,0.01674,-0.99159,0.00064889,-1.9638,0.98043,-0.36121,4.3096,-0.028994,3.2569,0.00046421,0.60653,4.6786,0.016772,6.2361,0.0063504,0.99161,0.039491,0.020074,0.015703,0.012806,0.37237,0.31002,0.27907,0.018577,0.0042807,0.0028565,0.012828,0.50518,0.19929,0.060555,264.99,4770.2,8518.7,11961,25516,0.12327,0.062943,0.12327,1.5165,1.9562,0.66392,0.16399,0.013166,53,114.42,3202,2.1652e+05,5.7773,37.639,86454,28593,20142,0.9271,0.93557,0.26229,0.19845,0.15557,0.71885,68846,27943,0.00095304,0.00040374,0,0.059026,0,0.043491,0.0032588,0.011765,0.0049588,0.011964,0.61831,0.32514,1.5628,0.3213,0.31232,0.26724,0.37901,0.37003,0.17582,0.41577,0.35757,0.15649,33.586,7.2154,31108,87052,86464,0.074291,0.063062,0.041891,0.33523,0.34387,0.097564,0.60145,0.63655,0.12195,0.78041,0.81771,0.12433,0.89263,0.9186,0.1195,0.0061016,0.0049345,0.084596,0.019304,0.045206,-0.04334,0.014834,0.012525,0.096772,0.031213,0.062607,-0.048137,0.026555,0.02307,0.10318,0.042419,0.079283,-0.051465,0.005713,0.0046801,0.1563,0.033042,0.049555,-0.039084,0.013427,0.011567,0.16822,0.047971,0.068209,-0.040282,0.023298,0.020776,0.16918,0.060387,0.08498,-0.039174,0.00011443,7.0566e-05,0.0036347,-0.0067007,0.012099,-0.013731,0.00035003,0.00022085,0.0055048,-0.0080293,0.013983,-0.018374,0.00092421,0.00062933,0.0090632,-0.0084244,0.016377,-0.026213,0.0002742,0.00018383,0.066998,0.0039148,0.012425,-0.021497,0.0010571,0.00073708,0.081548,0.0076654,0.018769,-0.028174,0.0023362,0.0016666,0.08961,0.011525,0.025256,-0.035634,0.42438,74,74,40,988,3,3,3,0.645
28,-0.0034468,0.022799,0.030085,-0.98483,0.0073222,-1.8415,0.86983,0.22841,4.9859,0.064277,3.2056,0.0014252,0.67744,4.1375,0.026756,5.3411,0.005428,0.98659,0.17425,0.11316,0.092688,0.078282,0.23731,0.26421,0.33812,0.050501,0.018188,0.013211,0.078449,0.39601,0.21628,0.022315,19.179,157.32,258.23,201.96,637.32,0.073618,0.1885,0.1885,2.4259,3.8018,1.1965,0.206,0.017551,65,21.738,395,3815.2,3.9644,20.915,10665,6048,5697,0.93703,0.9518,0.049913,0.036186,0.0017362,0.36619,21841,13505,0.00067108,0.00028405,0,0.13321,0,0.093842,0.043095,0.21559,0.093649,0.46798,0.6806,3.7089,3.0647,0.30869,0.29121,0.30031,0.43946,0.29409,0.2057,0.501,0.24998,0.19861,26.064,8.1085,32835,52511,51996,0.10976,0.10619,0.021066,0.33641,0.32831,0.033324,0.53749,0.5306,0.037094,0.66024,0.66284,0.035803,0.7411,0.73524,0.033769,0.012633,0.0093428,0.059616,0.03033,0.068723,-0.063308,0.028385,0.021174,0.063026,0.042607,0.090798,-0.08496,0.049858,0.037505,0.065939,0.05563,0.11109,-0.1037,0.0089945,0.006717,0.083756,0.032846,0.062622,-0.049584,0.018743,0.014129,0.079921,0.041222,0.079111,-0.065426,0.032353,0.024632,0.07996,0.051559,0.094769,-0.079485,0.0031522,0.002299,0.034079,0.0092802,0.030826,-0.036728,0.0082709,0.0060904,0.044273,0.01714,0.042687,-0.048595,0.015057,0.011136,0.050256,0.024494,0.053097,-0.058762,0.00048637,0.0003268,0.04045,0.005608,0.021345,-0.021827,0.0017674,0.0012184,0.046406,0.0093182,0.029325,-0.027683,0.0036888,0.0026057,0.048159,0.012643,0.03795,-0.033946,0.38263,74,74,40,988,3,3,3,0.645
28,-0.0014713,0.0071572,0.010505,-0.99473,0.00036438,-1.9721,0.9825,-0.61953,4.0476,-0.077353,3.2212,0.00034447,0.54559,5.3286,0.010462,7.6172,0.0077568,0.99476,0.044892,0.026703,0.021979,0.018669,0.43716,0.36259,0.1564,0.017304,0.0045942,0.0032448,0.018704,0.49124,0.20155,2.6447,444.4,5789.8,9538.9,7814.2,23591,0.16068,0.11147,0.16068,2.1253,3.5492,1.1316,0.12942,0.014005,35,98.257,3101,2.7228e+05,5.6297,32.806,83727,4671,1782,0.93598,0.94682,0.10732,0.0774,0.058777,0.55163,30418,17301,0.00070711,0.00033628,0,0.077754,0,0.073632,0.0074332,0.014216,0.0028482,0.0037859,0.40395,2.0014,1.3852,0.27074,0.30069,0.30659,0.26082,0.3329,0.26057,0.25593,0.31772,0.2413,29.843,8.278,24182,45233,44322,0.119,0.13045,0.036906,0.37231,0.41599,0.059592,0.58595,0.62616,0.065341,0.73036,0.7706,0.063995,0.84185,0.87388,0.061982,0.0021575,0.001571,0.016451,-0.00056875,0.038853,-0.042703,0.0055224,0.0040623,0.019813,0.0014223,0.05166,-0.053946,0.010046,0.0074153,0.021468,0.0030794,0.062892,-0.067333,0.0021548,0.0015692,0.032422,0.0052716,0.039921,-0.042638,0.0054851,0.0040371,0.037793,0.0095155,0.053324,-0.053528,0.0098457,0.0072778,0.039319,0.012794,0.065424,-0.065972,0,0,0,-0.0055644,0.015277,0,0,0,0,-0.007138,0.01915,0,0,0,0,-0.0086503,0.020953,0,2.7069e-06,1.8107e-06,0.00036376,-0.0025832,0.0029287,-0.011529,3.7364e-05,2.5248e-05,0.0015852,-0.0033192,0.0064422,-0.012762,0.00020044,0.00013747,0.0042284,-0.0035837,0.011241,-0.017871,0.35892,74,74,40,988,3,3,3,0.645
28,-0.0023609,0.011988,0.017213,-0.99135,0.0011802,-1.9481,0.96511,-0.2452,2.4499,-0.024075,3.3208,0.00026909,0.4087,3.136,0.016949,3.9657,0.0040384,0.99152,0.063407,0.041434,0.03423,0.028879,0.34183,0.32417,0.27361,0.020095,0.006774,0.0050936,0.028428,0.47304,0.20656,0.088017,241.9,1964,2886.9,2551.1,7644.8,0.07569,0.11747,0.11747,2.8147,3.5623,1.1418,0.16262,0.012335,60,131.18,5018,4.4259e+05,6.7799,49.749,1.3549e+05,27081,23787,0.91916,0.92209,0.36811,0.28736,0.20668,0.83489,70291,35543,0.0010438,0.00048552,0,0.068131,0,0.054971,0.0027505,0.017931,0.001167,0.015522,1.953,2.6874,0.13844,0.29707,0.33627,0.28023,0.33726,0.3992,0.21154,0.33577,0.41249,0.21162,46.015,7.5661,16896,59698,58622,0.066286,0.054323,0.046635,0.29863,0.28633,0.10844,0.55634,0.56313,0.14074,0.76834,0.78959,0.15273,0.89771,0.91913,0.14994,0.0041313,0.0027214,0.071466,0.010403,0.037035,-0.062251,0.0085341,0.0057617,0.069461,0.012789,0.044896,-0.077959,0.014469,0.010192,0.070147,0.016182,0.053158,-0.090259,0.002263,0.0015197,0.077246,0.0089143,0.030805,-0.044078,0.0045337,0.0030885,0.070867,0.0097897,0.037367,-0.055241,0.0073093,0.0051342,0.06622,0.010398,0.044076,-0.063709,0.0018161,0.0011677,0.071975,0.0067974,0.020688,-0.04294,0.0038446,0.0025739,0.075439,0.0096628,0.025074,-0.052999,0.0068149,0.0048379,0.083382,0.01433,0.030048,-0.060728,5.2221e-05,3.3966e-05,0.01592,-0.0024172,0.0077052,-0.014192,0.00018815,0.00011835,0.018109,-0.0030381,0.0091807,-0.018088,0.0004397,0.00027487,0.021043,-0.0034005,0.01077,-0.022336,0.44987,74,74,40,988,3,3,3,0.645
28,-0.0027503,0.015068,0.021088,-0.98939,0.0025058,-1.9181,0.93871,-0.03379,3.2867,-0.028007,3.273,0.00015683,0.5169,3.6292,0.020246,4.7391,0.0048259,0.98986,0.10489,0.06945,0.057496,0.048505,0.31422,0.31109,0.27886,0.030274,0.01067,0.0081862,0.0467,0.47184,0.24194,0.020774,78.021,622.21,874.57,740.45,2316,0.093578,0.063581,0.093578,1.7421,2.2514,0.73155,0.18412,0.01295,50,128.38,6210,7.6745e+05,6.8535,47.988,1.6767e+05,2430,2214,0.92385,0.92956,0.35249,0.25607,0.20134,0.929,42241,27436,0.00076641,0.00037077,0,0.045339,0,0.047652,0.0050634,0.0060582,0.0046074,0.0024477,1.5023,0.35368,1.4633,0.28902,0.31683,0.31192,0.31647,0.36819,0.29867,0.3283,0.37403,0.28358,53.869,8.4218,13039,28608,27429,0.034758,0.029298,0.019941,0.18472,0.18596,0.054696,0.37589,0.39246,0.077541,0.55459,0.5765,0.089893,0.7068,0.72786,0.096266,0.0048798,0.0046527,0.068834,0.013202,0.050734,-0.016956,0.011231,0.010637,0.07454,0.020061,0.06522,-0.024543,0.018987,0.017738,0.07506,0.025114,0.077062,-0.037069,0.0046274,0.0044678,0.1288,0.025371,0.057578,-0.012189,0.010534,0.010127,0.13427,0.035519,0.072417,-0.017324,0.017705,0.016791,0.13079,0.042885,0.085114,-0.028068,0.00025244,0.00018496,0.0081581,-0.0057164,0.011942,-0.023751,0.00069717,0.0005102,0.011155,-0.006433,0.014756,-0.031559,0.0012828,0.00094665,0.012798,-0.0071978,0.016183,-0.037362,0,0,0,-0.0036152,0.012532,0,0,0,0,-0.0049993,0.015885,0,0,0,0,-0.006464,0.018678,0,0.37172,74,74,40,988,3,3,3,0.645
28,-0.0038071,0.017965,0.026136,-0.98683,0.0011594,-1.9515,0.97757,0.55365,15.503,0.039195,2.8502,0.015739,1.5915,9.8067,0.026284,25.287,0.02575,0.98684,0.037424,0.0088123,0.0073359,0.0062255,0.29371,0.28501,0.38432,0.028017,0.0014889,0.0011227,0.0063404,0.46114,0.22154,0.044512,81.909,31437,46296,38928,1.1674e+05,0.43595,0.33019,0.43595,1.5608,3.151,0.9332,0.2369,0.04282,57,86.667,3595,2.2738e+05,7.117,52.661,97065,11907,7695,0.93284,0.94431,0.09208,0.062868,0.076858,0.51003,27571,17446,0.00067701,0.00035702,0,0.050432,0,0.060143,0.0070353,0.027601,0.012798,0.049532,0.84232,2.145,1.3388,0.28759,0.26332,0.27417,0.33096,0.22771,0.12915,0.32713,0.21338,0.11599,11.173,7.4025,9469.7,19095,16137,0.29306,0.31185,0.13556,0.62072,0.65495,0.14819,0.7902,0.81609,0.13143,0.89884,0.91498,0.11747,0.95481,0.96291,0.10486,0.013971,0.013492,0.1589,0.053608,0.079388,-0.015897,0.023929,0.022844,0.12806,0.054013,0.092252,-0.025077,0.033967,0.032351,0.10827,0.053807,0.10289,-0.03064,0.010034,0.0099608,0.22518,0.058218,0.07383,-0.0028267,0.017032,0.016732,0.17504,0.057683,0.085453,-0.0081786,0.023909,0.023436,0.14242,0.056294,0.095567,-0.010621,0.0038522,0.0034682,0.10038,0.019261,0.037573,-0.024104,0.0066479,0.0059293,0.085766,0.019837,0.043128,-0.031042,0.0096819,0.0086394,0.077886,0.020856,0.047607,-0.036507,8.574e-05,6.2727e-05,0.017186,-0.0011184,0.011898,-0.013544,0.00025261,0.00018512,0.015986,-0.0017511,0.014106,-0.016929,0.0004115,0.00030188,0.012948,-0.0029333,0.016512,-0.018702,0.57237,74,74,40,988,3,3,3,0.645
28,-0.0029136,0.013873,0.020326,-0.98977,0.00075775,-1.9609,0.98118,-0.071879,3.4203,-0.040038,3.2685,0.00010694,0.51907,3.6315,0.020389,4.8355,0.0049141,0.98979,0.064992,0.026546,0.017039,0.012027,0.27205,0.39388,0.26913,0.037427,0.0096915,0.0051824,0.012648,0.38905,0.3318,0.043294,52.695,815.95,2435.7,11337,14642,0.059583,0.063356,0.063356,2.4149,2.9358,0.91841,0.18017,0.016505,72,101.81,5027,3.5207e+05,8.0129,66.685,1.3573e+05,13689,10827,0.92813,0.93706,0.35823,0.26089,0.24818,0.82334,48876,28616,0.00097881,0.00038108,0,0.047708,0,0.048589,0.0028165,0.021544,0.0025243,0.023715,0.40486,2.6523,1.7473,0.29236,0.33289,0.29635,0.32434,0.40081,0.24586,0.33255,0.40601,0.23724,41.791,8.0014,14940,42144,40509,0.036498,0.032146,0.026212,0.22212,0.23096,0.082334,0.45141,0.47601,0.11657,0.65987,0.69064,0.1339,0.81684,0.84253,0.13927,0.0032986,0.0024808,0.058247,0.005709,0.044281,-0.051093,0.0064189,0.0049536,0.053331,0.0053861,0.054566,-0.060114,0.010672,0.0084218,0.052815,0.0063866,0.065005,-0.070456,0.0018877,0.0014195,0.065776,0.0059159,0.042362,-0.039126,0.0038756,0.0030166,0.06184,0.0066031,0.052638,-0.047031,0.0071673,0.005742,0.066285,0.009996,0.063724,-0.056908,0.0012674,0.00096151,0.051274,0.0022057,0.017996,-0.030037,0.0022508,0.0017312,0.045084,0.0011607,0.021058,-0.033851,0.0031019,0.002394,0.038742,-0.00066512,0.02276,-0.037751,0.00014347,9.9823e-05,0.044647,0.00038546,0.012996,-0.016243,0.00036391,0.00025501,0.035755,-0.00069193,0.016977,-0.019449,0.00056868,0.0004001,0.027782,-0.0023148,0.021896,-0.021366,0.44629,74,74,40,988,3,3,3,0.645
28,-0.0021646,0.015334,0.020103,-0.98989,0.0054259,-1.8357,0.85445,2.2927,14.615,0.1045,3.0603,0.0075555,1.5285,11.366,0.018049,19.751,0.020072,0.99096,0.20346,0.11124,0.082604,0.06684,0.30289,0.23401,0.26831,0.079453,0.027422,0.015726,0.072186,0.45099,0.11421,0.03529,7.7788,85.007,229.98,296.49,619.85,0.075308,0.30927,0.30927,3.6136,5.911,1.7074,0.17181,0.014166,122,13.156,565,4064.8,6.9856,54.569,15255,11151,3564,0.93775,0.95376,0.0076882,0.0048678,0.0007362,0.10034,24703,13196,0.00059633,0.00027039,0,0.039951,0,0.065652,0.01017,0.025463,0.0023094,0.051961,2.0679,4.7144,2.6818,0.30049,0.27643,0.30214,0.41898,0.25843,0.17517,0.43013,0.25744,0.16852,15.013,8.1579,7463.8,11136,8947.2,0.18114,0.18046,0.048806,0.50552,0.51888,0.070299,0.68935,0.70985,0.066786,0.81498,0.83293,0.062041,0.87138,0.88413,0.05574,0.021479,0.022263,0.1423,0.066878,0.094736,0.033691,0.040884,0.04249,0.12744,0.077531,0.11831,0.045826,0.061663,0.063669,0.11448,0.084798,0.13746,0.044897,0.0069292,0.0070293,0.090583,0.028709,0.061291,0.0083917,0.016246,0.016907,0.097253,0.041401,0.084382,0.031586,0.028068,0.0293,0.097386,0.051837,0.105,0.041811,0.01426,0.014965,0.21643,0.068108,0.070502,0.035082,0.023587,0.024638,0.17725,0.070349,0.078504,0.037088,0.03135,0.032336,0.1469,0.069276,0.081724,0.029147,0.00029042,0.0002695,0.033908,0.0029871,0.021416,-0.015078,0.0013603,0.0012749,0.050142,0.0077344,0.031618,-0.016927,0.0031414,0.0029657,0.057575,0.012134,0.041566,-0.018723,0.4828,74,74,40,988,3,3,3,0.645
28,-0.0019276,0.0097677,0.014098,-0.99292,0.0008929,-1.9539,0.96782,0.25673,6.816,-0.015742,3.131,0.0037576,0.505,4.296,0.013791,6.0776,0.006189,0.9931,0.064193,0.040019,0.033421,0.028322,0.38465,0.3448,0.20847,0.022479,0.0063185,0.0049373,0.028345,0.51707,0.24749,0.47506,195.83,2236.4,3015.6,2550.4,7999.4,0.058174,0.10994,0.10994,2.2471,2.5506,0.66292,0.14751,0.010347,39,77.615,2733,1.8929e+05,5.9879,36.914,73791,2214,1917,0.93509,0.94628,0.21381,0.17583,0.057687,0.77284,46867,16369,0.0012661,0.00034575,0,0.11701,0,0.096629,0.0070252,0.048833,0.0081254,0.069949,0.0412,0.063188,0.62006,0.24621,0.29805,0.33791,0.19354,0.31461,0.34719,0.17544,0.30696,0.38474,52.122,9.1236,35502,1.0468e+05,1.042e+05,0.14382,0.12443,0.041167,0.43427,0.4712,0.064157,0.66938,0.74029,0.068897,0.83343,0.89416,0.067403,0.92275,0.95576,0.062708,0.025762,0.022275,0.18131,0.084372,0.085564,-0.044159,0.05131,0.046449,0.16991,0.10312,0.10931,-0.040563,0.083638,0.079206,0.16497,0.12342,0.13472,-0.028422,0.017237,0.015392,0.23938,0.082592,0.078001,-0.028091,0.032969,0.029825,0.20967,0.094844,0.094574,-0.031667,0.051376,0.047044,0.18937,0.10612,0.11092,-0.033901,0.0082647,0.0067178,0.13326,0.03846,0.04192,-0.036526,0.019085,0.017503,0.15236,0.057391,0.06054,-0.022158,0.033862,0.034316,0.16857,0.077829,0.081774,0.0045812,0.00026014,0.00016508,0.032267,0.0024952,0.013546,-0.019316,0.0011537,0.00073574,0.045178,0.0062325,0.019081,-0.028035,0.0028532,0.0018568,0.055555,0.010949,0.025155,-0.036004,0.3692,74,74,40,988,3,3,3,0.645
28,-0.0030709,0.014704,0.021496,-0.98918,0.00083146,-1.959,0.98047,-0.24308,5.4531,-0.0086151,3.1694,0.001734,0.5496,3.7416,0.021533,4.9813,0.0050726,0.98922,0.036976,0.019387,0.015502,0.012861,0.28117,0.35992,0.32215,0.017149,0.0038686,0.0026461,0.013087,0.41711,0.2993,0.00024503,304,5431.8,9613.7,10887,26237,0.12027,0.046021,0.12027,1.5795,2.1327,0.61309,0.18828,0.01415,53,186.32,9117,1.5595e+06,7.0644,50.945,2.4616e+05,4374,3132,0.90349,0.89643,0.50824,0.42705,0.26202,0.92442,91933,42131,0.0011918,0.0005683,0,0.051755,0,0.055188,0.001007,0.0095543,9.6348e-05,0.013046,0.48814,1.4256,1.4929,0.23473,0.33128,0.36149,0.19451,0.36082,0.40298,0.18812,0.37341,0.4039,74.394,9.7602,24410,1.2854e+05,1.2797e+05,0.039181,0.02866,0.033851,0.19851,0.19441,0.088517,0.39013,0.42474,0.1212,0.56463,0.62533,0.13783,0.71736,0.77581,0.14714,0.009232,0.0078814,0.19611,0.044008,0.058805,-0.037714,0.020984,0.018413,0.20974,0.063132,0.080256,-0.042441,0.036867,0.033142,0.21948,0.082799,0.10128,-0.044362,0.0082969,0.0073452,0.34778,0.064735,0.066047,-0.027654,0.018263,0.016749,0.35056,0.086556,0.089245,-0.026505,0.031258,0.029481,0.34776,0.10719,0.11146,-0.022656,0.00054115,0.00028494,0.026336,-0.0043718,0.013719,-0.029334,0.0012152,0.00064061,0.02928,-0.0048815,0.016685,-0.03792,0.002244,0.0012253,0.033716,-0.0045886,0.019209,-0.049851,0.00039403,0.00025131,0.14751,0.0089814,0.017571,-0.027873,0.0015268,0.0010343,0.18046,0.016576,0.024508,-0.034462,0.0034993,0.0025072,0.20565,0.025541,0.032476,-0.040945,0.42925,74,74,40,988,3,3,3,0.645
28,-0.002429,0.011411,0.016791,-0.99156,0.00046485,-1.9693,0.98606,-0.23887,2.5248,-0.064382,3.3314,0.00025949,0.47916,3.6866,0.016859,4.7534,0.0048405,0.99156,0.024485,0.0063113,0.0049858,0.004186,0.35952,0.3493,0.26677,0.018012,0.0013392,0.00080976,0.0042595,0.47872,0.24474,0.11176,301.01,53564,1.1811e+05,1.1767e+05,2.8965e+05,0.073111,0.067111,0.073111,1.2116,1.4771,0.61926,0.16237,0.013298,65,79.108,2682,1.1597e+05,6.9389,52.822,72414,14229,11934,0.92991,0.93721,0.22869,0.16824,0.14037,0.66444,66223,26761,0.00079337,0.00031025,0,0.057299,0,0.047217,0.0078885,0.03678,0.0084671,0.044165,0.58276,0.37842,1.5173,0.29957,0.31958,0.29157,0.35851,0.38696,0.21513,0.38169,0.38571,0.20282,33.765,7.8723,25372,63070,62428,0.043308,0.033713,0.022272,0.2747,0.27678,0.072914,0.54065,0.56155,0.099977,0.74312,0.76845,0.10798,0.87383,0.89463,0.10669,0.00348,0.0032956,0.044003,0.0056828,0.028451,-0.0096624,0.0070787,0.0068005,0.042115,0.0065091,0.038749,-0.0092262,0.011978,0.011442,0.042447,0.0082557,0.049157,-0.013222,0.00098223,0.00074361,0.024508,-0.0013043,0.01593,-0.027848,0.0024711,0.0018645,0.028234,-0.00035563,0.023854,-0.036227,0.0047235,0.0035811,0.031281,0.00095794,0.032428,-0.046902,0.0024901,0.0025469,0.072136,0.010599,0.022732,0.0033336,0.0046094,0.0049378,0.066113,0.011689,0.028405,0.013077,0.0072435,0.0078554,0.064784,0.013655,0.033385,0.018808,7.6518e-06,5.0667e-06,0.0017052,-0.0032174,0.010056,-0.013619,7.6406e-05,5.2318e-05,0.0053756,-0.0038552,0.014466,-0.014916,0.00033338,0.00023564,0.011662,-0.0036694,0.019113,-0.022007,0.44421,74,74,40,988,3,3,3,0.645
28,-0.0028956,0.015717,0.022064,-0.9889,0.0025351,-1.9192,0.9408,-0.68646,6.6208,-0.038434,3.1293,0.0037041,0.99207,6.7407,0.021617,11.091,0.011294,0.98918,0.11202,0.064283,0.047997,0.039482,0.30394,0.26221,0.32393,0.044015,0.015933,0.0085302,0.041449,0.46961,0.16316,0.0017686,31.652,254.92,759.32,907.03,1953.6,0.3456,0.21166,0.3456,2.7793,3.3817,1.1299,0.18771,0.017307,75,56.28,2955,1.1677e+05,8.2052,69.755,79785,9153,5103,0.93459,0.94605,0.15919,0.10723,0.13188,0.49719,26297,16502,0.00065061,0.00030619,0,0.050309,0,0.046808,0.0065879,0.016232,0.030778,0.016493,0.91781,1.609,0.39686,0.3187,0.27932,0.26917,0.44037,0.26512,0.11103,0.44472,0.26306,0.10418,14.709,7.2676,8885.7,16582,14705,0.17881,0.17576,0.076787,0.55158,0.57379,0.12226,0.73806,0.76184,0.11397,0.85939,0.87639,0.10427,0.92679,0.93561,0.094491,0.010482,0.0099521,0.11068,0.036165,0.075415,-0.023152,0.02175,0.021798,0.10806,0.046035,0.096175,0.0013706,0.037698,0.039243,0.11156,0.059306,0.1181,0.032631,0.0062336,0.0062062,0.12988,0.032014,0.065389,-0.0016341,0.014335,0.015208,0.13677,0.045181,0.086149,0.031643,0.026305,0.029049,0.14547,0.060848,0.10837,0.070085,0.0042483,0.0037454,0.10277,0.021123,0.04104,-0.032399,0.0076984,0.0068677,0.092205,0.023444,0.049625,-0.03715,0.012095,0.010871,0.090329,0.027625,0.057101,-0.043323,5.0329e-07,4.6722e-07,9.3656e-05,-0.0031027,0.0096477,-0.0055701,3.6847e-05,3.2459e-05,0.0021648,-0.0039248,0.01506,-0.012998,0.00028753,0.00025698,0.0083995,-0.0036507,0.022135,-0.013602,0.51865,74,74,40,988,3,3,3,0.645
28,-0.0025828,0.019505,0.025134,-0.98734,0.0077771,-1.8078,0.83101,-1.559,10.776,-0.11489,2.987,0.0096582,1.4092,9.4563,0.022166,16.166,0.016428,0.98889,0.22342,0.12233,0.090354,0.071822,0.28164,0.25189,0.25851,0.083843,0.029755,0.018058,0.076309,0.46205,0.17956,0.013909,5.0733,57.485,137.12,220.06,420.39,0.17356,0.25422,0.25422,1.6438,2.2791,0.82379,0.18601,0.014279,129,24.667,1364,18169,8.4307,78.554,36828,19035,3942,0.93734,0.95231,0.16526,0.1061,0.13009,0.61828,41041,19340,0.00052675,0.0002651,0,0.045671,0,0.050389,0.014033,0.033797,0.028342,0.067654,0.18074,1.7942,2.0895,0.30706,0.29222,0.29781,0.42821,0.31109,0.17685,0.43996,0.31298,0.16869,18.97,8.041,8151.2,14809,12040,0.096887,0.091695,0.040042,0.27296,0.26497,0.058223,0.48521,0.48019,0.072106,0.63541,0.63229,0.074195,0.75214,0.75228,0.073798,0.011714,0.012018,0.11904,0.040805,0.0731,0.017934,0.026563,0.027629,0.127,0.058041,0.098227,0.036471,0.044696,0.046872,0.12729,0.071967,0.1212,0.05474,0.0041238,0.0042503,0.08269,0.018311,0.046855,0.013157,0.010712,0.011195,0.098356,0.030675,0.06806,0.027633,0.020867,0.022037,0.11106,0.044847,0.090981,0.044939,0.0067136,0.0067701,0.1563,0.03647,0.051807,0.0041963,0.013404,0.013741,0.1545,0.046152,0.063233,0.015213,0.019771,0.020473,0.1421,0.050635,0.070028,0.02472,0.00087672,0.00099741,0.15701,0.01738,0.027627,0.030631,0.0025924,0.0028641,0.14657,0.022156,0.035752,0.030521,0.0045659,0.0049251,0.12836,0.02441,0.042662,0.028049,0.50963,74,74,40,988,3,3,3,0.645
28,-0.00576,0.027594,0.040424,-0.97956,0.0014636,-1.9412,0.98173,0.2051,4.2682,0.019522,3.2228,0.00074886,0.77042,3.8251,0.040486,5.0362,0.0051285,0.97973,0.06008,0.032041,0.023666,0.01876,0.23469,0.20304,0.50463,0.026067,0.0080623,0.0047849,0.018729,0.36408,0.083201,0.17309,95.171,936.53,2364.2,4151.6,7548.1,0.11219,0.11797,0.11797,1.2238,1.5225,0.73191,0.25403,0.031316,35,152.94,4498,5.8217e+05,5.4722,31.529,1.2145e+05,18846,1350,0.92917,0.93742,0.34918,0.25924,0.2077,0.91472,34275,21530,0.00052619,0.00034099,0,0.074629,0,0.0767,0.0048217,0.016731,0.00075301,0.012556,4.2296,6.1302,1.9792,0.2167,0.24121,0.46173,0.12238,0.15221,0.70002,0.11477,0.13452,0.73129,46.815,12.467,16809,37430,36255,0.029998,0.023365,0.014151,0.064599,0.049353,0.015728,0.09971,0.076866,0.016913,0.17488,0.14003,0.023308,0.27271,0.22506,0.030543,0.0086559,0.0078793,0.1004,0.02947,0.062264,-0.027717,0.015651,0.014122,0.085414,0.030815,0.073203,-0.037384,0.023502,0.021325,0.076398,0.032244,0.082705,-0.042403,0.0012766,0.00089492,0.02922,0.00070577,0.03086,-0.037516,0.0025685,0.0018325,0.02692,5.166e-05,0.038258,-0.04521,0.0039018,0.0028595,0.023702,-0.0014799,0.044584,-0.049471,0.0068561,0.006581,0.18219,0.040004,0.055441,-0.010915,0.012185,0.011576,0.16031,0.044093,0.063827,-0.016771,0.018273,0.017315,0.14991,0.049272,0.070852,-0.021099,0.0005232,0.0004034,0.10695,0.0097821,0.016297,-0.02215,0.0014791,0.0012248,0.095457,0.011588,0.022207,-0.022562,0.0030091,0.0027237,0.096558,0.015223,0.030221,-0.017009,0.37594,74,74,40,988,3,3,3,0.645
28,-0.0030158,0.016453,0.022928,-0.98846,0.0027641,-1.9154,0.93779,-0.5923,10.032,-0.0018098,3.1209,0.0054289,1.3188,8.8049,0.022387,18.145,0.018478,0.98879,0.10253,0.067668,0.054821,0.045715,0.27621,0.28305,0.34589,0.030205,0.011635,0.0084207,0.04459,0.42857,0.21432,0.015561,74.838,480.93,761.53,745.6,2063.6,0.32261,0.30369,0.32261,1.9835,2.0331,0.75923,0.20865,0.033749,70,56.571,2047,71026,6.5196,46.627,55269,25704,5076,0.93604,0.94897,0.17324,0.11443,0.13874,0.60298,32810,17811,0.00058193,0.00029789,0,0.049085,0,0.059668,0.010034,0.02549,0.014344,0.033319,0.025572,1.4924,1.335,0.29422,0.27939,0.27513,0.36416,0.23703,0.12877,0.35138,0.22548,0.12462,17.308,7.4285,9116.7,16259,13330,0.23888,0.25669,0.093672,0.53517,0.56623,0.10831,0.74287,0.76917,0.10475,0.86344,0.87978,0.095663,0.935,0.94493,0.087046,0.0089826,0.0084017,0.086608,0.028186,0.067291,-0.032001,0.017978,0.016749,0.081559,0.034102,0.083851,-0.044022,0.028621,0.02641,0.077337,0.039167,0.098172,-0.05956,0.0078446,0.0074089,0.14925,0.040282,0.071993,-0.025673,0.015118,0.014195,0.13171,0.045993,0.087277,-0.035224,0.022731,0.021167,0.11478,0.048602,0.098554,-0.046017,0.0010143,0.00086894,0.022405,3.9416e-05,0.021606,-0.026945,0.0029349,0.0025424,0.032098,0.0035532,0.029819,-0.03916,0.005862,0.0051086,0.039977,0.0077559,0.037288,-0.047928,0.00012374,0.00012388,0.021026,-0.00016542,0.012044,9.2645e-05,0.00048715,0.0004649,0.026134,0.00071435,0.016783,-0.0056336,0.0011592,0.0010466,0.030922,0.0020669,0.022332,-0.01629,0.49186,74,74,40,988,3,3,3,0.645
28,-0.0029454,0.014463,0.020951,-0.98946,0.0011511,-1.9514,0.97214,0.33972,3.0981,0.070031,3.2969,5.6225e-07,0.40736,2.8073,0.021012,3.5328,0.0035902,0.98948,0.062072,0.03437,0.026073,0.021037,0.27572,0.36421,0.29807,0.026752,0.0082938,0.0050998,0.021858,0.39867,0.31034,0.0059414,106.27,1089.8,2397.6,3610.9,7205.3,0.11178,0.1283,0.1283,1.2692,2.2451,0.60429,0.1829,0.016108,68,64.544,2205,82199,6.455,46.519,59535,24327,9747,0.92912,0.93824,0.27262,0.20202,0.16171,0.804,41135,22883,0.00065229,0.00036594,0,0.051732,0,0.051255,0.0040749,0.010016,0.00090219,0.0054426,0.16079,1.3289,0.92889,0.26514,0.33773,0.31595,0.23727,0.43323,0.30526,0.22358,0.4503,0.30727,40.081,8.5305,17538,41214,39966,0.027545,0.021857,0.012704,0.18828,0.17568,0.044819,0.39243,0.37764,0.06508,0.55771,0.54126,0.072673,0.67782,0.66207,0.074218,0.0054793,0.0048539,0.062135,0.01455,0.049061,-0.029288,0.014197,0.01313,0.075749,0.026337,0.069889,-0.027687,0.027407,0.026497,0.087101,0.040027,0.091633,-0.015927,0.0034705,0.0033109,0.077659,0.015086,0.04033,-0.0092328,0.0084822,0.0084686,0.086916,0.023579,0.057638,-0.00044854,0.01598,0.016763,0.094908,0.033354,0.076567,0.017594,0.00088553,0.00059512,0.023006,-0.00082785,0.021759,-0.027889,0.001609,0.0010899,0.020697,-0.001833,0.026077,-0.035572,0.0025164,0.0017089,0.020183,-0.002429,0.029463,-0.043896,0.0011233,0.00094784,0.22449,0.024465,0.032591,-0.0246,0.0041967,0.0036314,0.26479,0.040708,0.047758,-0.029421,0.0093713,0.0083327,0.294,0.059078,0.064843,-0.032335,0.40399,74,74,40,988,3,3,3,0.645
28,-0.0051793,0.024651,0.035653,-0.98199,0.0019496,-1.9368,0.97227,-0.064811,4.7512,-0.056188,3.2058,0.0011756,1.0569,5.5807,0.035792,8.794,0.0089552,0.98208,0.094406,0.034154,0.021813,0.014698,0.22611,0.28682,0.39526,0.056657,0.012429,0.007303,0.015416,0.3534,0.23973,0.05816,15.467,398.67,998.63,6179.1,7592.5,0.23022,0.11849,0.23022,3.2602,3.5911,0.84387,0.23854,0.02979,72,52.25,2590,94314,7.9287,65.627,69930,10611,4509,0.93415,0.94542,0.15532,0.10606,0.11937,0.55419,26031,16727,0.0013195,0.00049708,0,0.044632,0,0.059625,0.024923,0.053928,0.035042,0.082933,0.49003,0.55091,0.99685,0.32706,0.27362,0.26677,0.46572,0.25596,0.10094,0.48429,0.25437,0.092347,13.286,7.2029,8248.1,14843,13285,0.25511,0.24902,0.096325,0.75277,0.78403,0.1467,0.87692,0.89608,0.11906,0.93888,0.94996,0.10016,0.95954,0.96732,0.086015,0.018956,0.019923,0.17599,0.068965,0.091071,0.030018,0.035972,0.037136,0.15713,0.079498,0.11401,0.023961,0.054003,0.054788,0.14051,0.08626,0.13338,0.012718,0.006095,0.0062964,0.11166,0.029153,0.050813,0.011849,0.013482,0.01368,0.1131,0.039237,0.071415,0.0069,0.022698,0.02267,0.11036,0.047584,0.090725,-0.00070358,0.012183,0.013039,0.25914,0.068206,0.073686,0.032105,0.021686,0.023467,0.22838,0.076173,0.086828,0.045465,0.030152,0.032646,0.19799,0.078757,0.09472,0.051765,0.00067781,0.00058698,0.1109,0.012169,0.029507,-0.023408,0.0025167,0.0021382,0.13,0.02042,0.040252,-0.035181,0.0052738,0.0044825,0.13545,0.02773,0.050195,-0.043361,0.4572,74,74,40,988,3,3,3,0.645
28,-0.0026925,0.014112,0.020032,-0.98992,0.0018016,-1.9343,0.95397,0.1229,3.0357,0.018898,3.2532,3.7943e-05,0.41312,2.9531,0.019532,3.8062,0.003876,0.99022,0.08262,0.05323,0.044421,0.037531,0.37829,0.2455,0.29697,0.026763,0.008315,0.0066017,0.03756,0.52799,0.11067,0.0084765,111.69,1119,1470.4,1268.6,3970.4,0.10173,0.12936,0.12936,0.85458,1.1934,0.50115,0.18056,0.016446,69,65.652,1472,53713,4.767,26.294,39744,31401,14013,0.93198,0.94276,0.25681,0.18161,0.17507,0.7304,42453,21611,0.00057264,0.00028426,0,0.048888,0,0.047226,0.00082958,0.0080715,0.00056539,0.0097927,1.5336,1.908,0.81392,0.29918,0.31485,0.29702,0.35403,0.37847,0.22738,0.36484,0.38587,0.21582,29.841,8.0195,13290,28108,26567,0.038639,0.031532,0.018815,0.20872,0.19458,0.052455,0.41232,0.40676,0.072193,0.59792,0.60819,0.08226,0.74339,0.76198,0.085939,0.0016631,0.0014519,0.019911,-0.0030499,0.028372,-0.023969,0.0049355,0.0043135,0.027803,8.0154e-05,0.041881,-0.034165,0.010294,0.0089704,0.034541,0.0044113,0.056445,-0.046987,0.0011226,0.0009279,0.026521,-0.00032166,0.028885,-0.024942,0.0030109,0.0024408,0.032573,0.0018626,0.04106,-0.039028,0.0062806,0.005077,0.039382,0.0055469,0.054097,-0.055145,8.3894e-06,6.2309e-06,0.00023012,-0.00695,0.0079629,-0.009387,5.5785e-05,4.1531e-05,0.0007576,-0.008744,0.010376,-0.009452,0.00015625,0.00011848,0.0013231,-0.010374,0.012907,-0.011099,0.00053209,0.00051781,0.11227,0.010168,0.014785,-0.0034873,0.0018688,0.0018312,0.12449,0.016092,0.023132,-0.0034704,0.0038574,0.0037748,0.12777,0.021511,0.032014,-0.004673,0.44346,74,74,40,988,3,3,3,0.645
28,-0.0030003,0.014663,0.021322,-0.98927,0.001044,-1.954,0.97521,0.33066,2.932,0.0071457,3.2784,8.6341e-05,0.48516,3.3138,0.021391,4.2539,0.0043319,0.98929,0.065476,0.034558,0.026459,0.021256,0.27736,0.35693,0.30182,0.029161,0.0079285,0.0051604,0.021638,0.39893,0.30107,0.0097328,99.351,1237.4,2441.2,3899.1,7677.7,0.043037,0.070037,0.070037,2.2691,3.1961,0.94683,0.1828,0.016037,68,86.824,2351,95686,6.0523,43.151,63477,21627,14661,0.92816,0.93566,0.33716,0.24985,0.21161,0.86357,48490,25623,0.00068917,0.00035153,0,0.072301,0,0.068643,0.0038363,0.0092583,0.0030798,0.00070675,2.2564,4.1226,1.4297,0.27999,0.33343,0.30233,0.28129,0.42296,0.25632,0.26825,0.43551,0.26533,38.772,8.163,19492,49121,48001,0.037681,0.029974,0.020745,0.21688,0.20867,0.061626,0.42106,0.42275,0.083353,0.58566,0.5869,0.091097,0.70264,0.69711,0.091838,0.0052116,0.004014,0.070546,0.014592,0.04828,-0.056824,0.010418,0.0082694,0.066355,0.017114,0.058355,-0.064627,0.016661,0.01358,0.063205,0.019264,0.066603,-0.070445,0.0042159,0.0033412,0.11261,0.021881,0.044311,-0.046249,0.0086624,0.0070769,0.10595,0.026615,0.056964,-0.052827,0.01412,0.011814,0.1001,0.030664,0.067328,-0.057402,0.00099336,0.0006711,0.030806,-0.00010822,0.023376,-0.034401,0.0016879,0.001139,0.025918,-0.0016366,0.025586,-0.038013,0.0021935,0.0014785,0.021001,-0.0038089,0.026195,-0.041622,2.3278e-06,1.6609e-06,0.00055532,-0.0034762,0.0075295,-0.012518,6.7932e-05,5.3504e-05,0.0051164,-0.004093,0.0082273,-0.015289,0.00034733,0.00028755,0.013007,-0.0036948,0.010266,-0.0157,0.44953,74,74,40,988,3,3,3,0.645
28,-0.0032157,0.01724,0.024285,-0.98777,0.0025626,-1.922,0.94577,0.27092,3.2765,0.066452,3.2683,7.3234e-05,0.58189,3.762,0.023876,4.9653,0.0050563,0.98805,0.10182,0.061718,0.049142,0.04104,0.27847,0.33073,0.2923,0.036539,0.012036,0.0079072,0.042024,0.43356,0.30338,0.0005612,46.659,430.76,844.26,822.78,2145.2,0.22832,0.11834,0.22832,1.4187,2.273,0.72797,0.19724,0.018858,68,57.691,2410,87319,7.4857,59.572,65070,9504,8937,0.93522,0.94916,0.26612,0.17871,0.19785,0.82801,42208,22704,0.00046085,0.00025691,0,0.051779,0,0.057195,0.008284,0.024474,0.0015374,0.0061432,1.2478,2.9796,1.7835,0.27225,0.31361,0.3211,0.28699,0.38653,0.29066,0.2853,0.40294,0.28182,32.21,8.6698,11976,21267,19448,0.030124,0.025236,0.0119,0.13312,0.11843,0.02714,0.29005,0.26328,0.041199,0.46835,0.43702,0.052273,0.62426,0.59787,0.058546,0.0043399,0.0039236,0.042153,0.0086092,0.042684,-0.032281,0.0097062,0.0089553,0.044358,0.012566,0.058353,-0.035431,0.016912,0.015768,0.046036,0.016728,0.074579,-0.038855,0.0034339,0.0029732,0.065815,0.013713,0.045987,-0.037394,0.0063542,0.0054462,0.055768,0.01396,0.057863,-0.049547,0.0096594,0.0081874,0.049137,0.013979,0.069867,-0.063356,1.6685e-06,1.2814e-06,3.7127e-05,-0.0062851,0.0084727,-0.01241,4.2232e-05,3.312e-05,0.00046529,-0.0079085,0.011644,-0.013108,0.0002142,0.00017179,0.0014715,-0.0091448,0.015225,-0.017686,0.00090437,0.00094916,0.15481,0.017613,0.025515,0.011575,0.0033098,0.0034759,0.17887,0.028783,0.03828,0.01543,0.0070385,0.007409,0.18913,0.039659,0.051362,0.020354,0.42854,74,74,40,988,3,3,3,0.645
28,-0.0021735,0.012056,0.016911,-0.9915,0.0020633,-1.9205,0.93701,0.078415,2.7694,0.014329,3.3015,5.1819e-05,0.52359,4.0724,0.016498,5.2222,0.0053071,0.99174,0.09898,0.065465,0.052097,0.042864,0.35996,0.29308,0.24837,0.031336,0.013055,0.0092124,0.044997,0.49576,0.1869,0.13212,81.897,469.59,765.82,897.61,2215.7,0.18216,0.15785,0.18216,1.4452,1.6875,0.65298,0.16063,0.013116,70,108.34,3764,2.3792e+05,6.4872,46.856,1.0163e+05,43605,17334,0.92624,0.93399,0.34085,0.24775,0.22235,0.80234,53366,28430,0.00073233,0.00039741,0,0.048455,0,0.048117,0.0025882,0.004381,0.0024702,0.0022068,0.419,1.0118,0.14812,0.26377,0.32887,0.32142,0.25644,0.39786,0.30253,0.24781,0.4038,0.31371,41.017,8.6785,16411,46050,44726,0.038111,0.031383,0.027257,0.1946,0.18061,0.071835,0.39314,0.37454,0.1011,0.57279,0.54878,0.11575,0.70006,0.67167,0.11887,0.0093614,0.0086477,0.16462,0.040609,0.064893,-0.031413,0.021765,0.021222,0.18008,0.059962,0.090671,-0.01343,0.037363,0.03786,0.18414,0.076303,0.11542,0.0089024,0.0074573,0.0066828,0.25877,0.051732,0.067469,-0.036908,0.016065,0.015028,0.25527,0.067432,0.09003,-0.028993,0.026187,0.025442,0.24118,0.078759,0.11077,-0.01551,0.00050523,0.00034844,0.020355,-0.0042648,0.014892,-0.03298,0.0012403,0.0008701,0.024741,-0.0042862,0.017503,-0.038351,0.0021311,0.0015244,0.026507,-0.0046162,0.019473,-0.044311,0.0013989,0.0016164,0.43353,0.039219,0.040655,0.03157,0.0046835,0.0054805,0.45825,0.057647,0.061467,0.046333,0.009501,0.011214,0.46223,0.075246,0.082464,0.063243,0.47758,74,74,40,988,3,3,3,0.645
28,-0.0050029,0.023983,0.035185,-0.98223,0.0012057,-1.9475,0.98272,-0.78505,12.418,0.046004,3.0595,0.0081274,1.2144,6.4561,0.035311,11.317,0.011524,0.98232,0.059018,0.027935,0.021165,0.01751,0.17112,0.36149,0.41058,0.029106,0.0065753,0.0035851,0.017543,0.21044,0.33698,0.082286,76.352,1506.8,4185.3,4817.9,10587,0.1382,0.096988,0.1382,1.4561,2.0458,0.70918,0.23885,0.030595,69,53.696,1365,52313,5.0852,28.047,36855,34992,13446,0.93496,0.9461,0.10159,0.068849,0.073131,0.41357,25259,14452,0.00085248,0.00041649,0,0.044769,0,0.054482,0.016382,0.02033,0.021149,0.0013157,1.1204,1.5458,0.69825,0.29769,0.26822,0.27821,0.3678,0.21032,0.14227,0.38485,0.1995,0.12486,14.71,7.5117,8328.4,15387,13873,0.25473,0.25405,0.099622,0.68606,0.71195,0.13848,0.82566,0.85012,0.11611,0.89926,0.91722,0.099366,0.93997,0.95303,0.087275,0.013729,0.014249,0.13202,0.048168,0.077022,0.019203,0.025847,0.02622,0.11694,0.054557,0.094998,0.0091239,0.039057,0.03911,0.10525,0.05914,0.11058,0.0010309,0.0068585,0.0071669,0.13014,0.034283,0.061024,0.016572,0.013686,0.013969,0.11892,0.040695,0.076936,0.0095476,0.02124,0.021377,0.10697,0.044585,0.090494,0.0035723,0.0066413,0.0068755,0.14631,0.035005,0.046327,0.012585,0.013149,0.013644,0.14342,0.043859,0.058851,0.016964,0.019955,0.020732,0.13572,0.049775,0.068174,0.020619,0.00022927,0.00020639,0.038854,0.0022259,0.015412,-0.011073,0.00096083,0.00084979,0.051408,0.0053993,0.0231,-0.017179,0.0022194,0.0019807,0.059044,0.0088067,0.031036,-0.021069,0.46404,74,74,40,988,3,3,3,0.645
28,-0.0041406,0.021288,0.03042,-0.98466,0.0024432,-1.9289,0.959,0.55934,7.1897,0.037003,3.1685,0.0033017,0.88101,5.0446,0.030439,8.5379,0.0086944,0.98476,0.10719,0.05521,0.042012,0.034636,0.19459,0.37422,0.33161,0.045764,0.012347,0.0070372,0.034433,0.27102,0.35251,0.0094983,27.043,425.63,1070.8,1248.3,2772.4,0.18965,0.22143,0.22143,2.6218,3.7384,1.3646,0.22165,0.023991,96,38.583,1564,38060,6.7561,48.687,42228,30699,4536,0.9337,0.94487,0.14764,0.10081,0.12011,0.50896,24104,13036,0.00079056,0.00039197,0,0.050589,0,0.05256,0.014973,0.04874,0.028823,0.06731,0.92326,3.446,2.2958,0.29437,0.26359,0.27633,0.35861,0.21102,0.11889,0.36846,0.20183,0.10526,11.496,7.4608,8295.7,15599,13973,0.30081,0.29996,0.12471,0.69337,0.711,0.14836,0.83689,0.85502,0.12475,0.90361,0.92029,0.10584,0.93619,0.9483,0.092143,0.014587,0.013739,0.14869,0.053355,0.080922,-0.028989,0.025805,0.024233,0.12376,0.056097,0.096194,-0.037487,0.038117,0.035827,0.10889,0.059073,0.10958,-0.043941,0.0071728,0.0063269,0.14427,0.037273,0.05679,-0.041354,0.013094,0.011687,0.1206,0.039697,0.069916,-0.047584,0.020186,0.018362,0.10776,0.043058,0.083318,-0.048436,0.0073069,0.0073192,0.17064,0.040326,0.056084,0.0005887,0.012559,0.012403,0.14522,0.04279,0.063787,-0.0051868,0.017647,0.017227,0.12723,0.044189,0.068489,-0.011453,0.00010749,9.3197e-05,0.019309,-0.00054969,0.016703,-0.015372,0.00075712,0.00065424,0.042941,0.0034865,0.023717,-0.023336,0.0021843,0.0018864,0.061598,0.0088433,0.030902,-0.029076,0.53373,74,74,40,988,3,3,3,0.645
