10.65294538  
11.66931853  
13.40205389  
23.74227773  
148.946212  
554.3791977  
4057.385344  
9491.924342  
4461.466437  
2230.617668  
5222.879483  
2693.316376  
9725.71483  
46320.28647  
63526.43376  
25209.10351  
7776.378744  
56131.70505  
44671.26767  
17670.0108  
8132.304454  
2315.570037  
2664.399376  
39030.02264  
19012.17965  
6876.6189  
15410.39307  
7517.900657  
9932.028578  
4005.251175  
5697.88947  
4728.169749  
11912.57679  
1232.930214  
11724.41031  
2112.870658  
527.6945836  
941.4175752  
1767.627018  
121.233958  
240.7506536  
4364.809667  
2358.221819  
953.8508364  
7991.925771  
3053.728115  
625.4309802  
1175.179398  
1982.336931  
443.3398342  
2330.390261  
764.5449546  
1684.449543  
110.2397629  
762.6931437  
241.8487269  
875.379034  
324.5621188  
627.1767823  
140.3856467  
177.3912867  
164.9492651  
56.60359468  
135.807433  
82.20280411  
38.81048412  
56.89790076  
113.0230157  
9.981752546  
7.293858107  
44.37208026  
1.110403081  
10.88646831  
0.7277245616  
0.8622477039  
0.02595571906  
1.111066003  
0.8641257118  
0.6266281127  
0.3638719355  
0.6614704632  
0.3961115575  
0.5724236087  
0.2684898281  
0.2654521698  
0.179060758  
0.1684290048  
0.1091753185  
0.1899458212  
0.1113262095  
0.1201474828  
0.1043051068  
0.1132144292  
0.112368329  
0.08709223868  
0.09366104502  
0.08310992026  
0.0842675177  
0.08155455696  
0.08323141477  
0.07338732102  
0.07234186052  
0.06910350116  
0.06652536243  
0.06390868055  
0.06158477697  
0.058811406  
0.05656588518  
0.05424075801  
0.05297255706  
0.05131237618  
0.04987449903  
0.04841014034  
0.04718889365  
0.04558181761  
0.04414908829  
0.04306477996  
0.04182205936  
0.04064306395  
0.03960400462  
0.038696918  
0.03758628299  
0.03666013914  
0.03575487596  
0.03497062116  
0.0341464545  
0.03333113053  
0.03257253182  
0.03184002891  
0.03115921262  
0.03046494694  
0.02981737307  
0.02918460239  
0.02860058025  
0.02799543087  
0.02744591325  
0.02688811379  
0.02636782412  
0.02585823894  
0.02536267749  
0.02489107126  
0.02442602913  
0.02397542273  
0.02354868799  
0.02312156248  
0.02271588943  
0.0223211666  
0.02193504433  
0.02156207074  
0.0212001797  
0.02084800486  
0.02050629531  
0.02017281715  
0.019848293  
0.01953338056  
0.01922880199  
0.01893010657  
0.0186381253  
0.01835453635  
0.01808047263  
0.01780960166  
0.01754773888  
0.01729221385  
0.01704212308  
0.0167995806  
0.01656397207  
0.01633026105  
0.01610401756  
0.01588331715  
0.01566892969  
0.01545687945  
0.0152516711  
0.01504982373  
0.01485276498  
0.01466124445  
0.01447344328  
0.01428893201  
0.01410805007  
0.01393336546  
0.01376192263  
0.01359162669  
0.01342674702  
0.01326522505  
0.0131098408  
0.01295171579  
0.01279979439  
0.01265209188  
0.01250580248  
0.01236431999  
0.01222372776  
0.01208744195  
0.01195239862  
0.01182120542  
0.01169067124  
0.01156562091  
0.01144029649  
0.01131841177  
0.01119956648  
0.01108060217  
0.01096709991  
0.0108522265  
0.01074118632  
0.0106323079  
0.01052534323  
0.01041921082  
0.01031646535  
0.01021439534  
0.01011502764  
0.01001695258  
0.009920032759  
0.00982711268  
0.00973340214  
0.009640584468  
0.009550917775  
0.009463958853  
0.009376636155  
0.009291467265  
0.009207977191  
0.009126044222  
0.009043481111  
0.008963388288  
0.008885383879  
0.008808391824  
0.008731519577  
0.008657257879  
0.00858328382  
0.008511494434  
0.008439918816  
0.008368004697  
0.00830110389  
0.008233158365  
0.008165830526  
0.008100725227  
0.008035188389  
0.007971390465  
0.007908117823  
0.007845526445  
0.007784536148  
0.007725584284  
0.007665131005  
0.00760748547  
0.007549565793  
0.007492817848  
0.007437097961  
0.007382613757  
0.007327647215  
0.007274157115  
0.007221782566  
0.007169605515  
0.007117624191  
0.007068562278  
0.007019086032  
0.006969909948  
0.006919610059  
0.006873973458  
0.006826166241  
0.006778662902  
0.006734119875  
0.006688292056  
0.006645217693  
0.006600195806  
0.006556900876  
0.00651482389  
0.006471585149  
0.006430549309  
0.006389410915  
0.006350165503  
0.006310380607  
0.006268904419  
0.006231981562  
0.006192872238  
0.006154680412  
0.006117799616  
0.006080085464  
0.006043873765  
0.006008316574  
0.005971851562  
0.005937943264  
0.005903389248  
0.005869274285  
0.005835587563  
0.005800946658  
0.005769051292  
0.005737218583  
0.005704271136  
0.005674402506  
0.005641912962  
0.005610700422  
0.005580856031  
0.005551314799  
0.005521945473  
0.005491984977  
0.005462528779  
0.005433976086  
0.005405774097  
0.005378748078  
0.005351655265  
0.005323157958  
0.005296096601  
0.005269411341  
0.005243621186  
0.005215957582  
0.005192114996  
0.005167472303  
0.005142465975  
0.005117792304  
0.005092466456  
0.005068697472  
0.005044218314  
0.005021172095  
0.004997255984  
0.004975286898  
0.004952239229  
0.004929420854  
0.004907290363  
0.004884282481  
0.004864432781  
0.004842983079  
0.004820727267  
0.004799776501  
0.004780633802  
0.004760055714  
0.004739242786  
0.004719328303  
0.004699011309  
0.004679550166  
0.004660777917  
0.004642640838  
0.004622818995  
0.00460470402  
0.00458588509  
0.004568483838  
0.004549555649  
0.004531578001  
0.004514479599  
0.004496933627  
0.004479475243  
0.004463272509  
0.004445993135  
0.004430817075  
0.004414685199  
0.00439759708  
0.004381506954  
0.004365147603  
0.004349677611  
0.004335002104  
0.004319912826  
0.004304529341  
0.004290617142  
0.004274953373  
0.004260152747  
0.004245373316  
0.004231764746  
0.00421816046  
0.004203554651  
0.004190036975  
0.004176847857  
0.004162780561  
0.00414970667  
0.004137402986  
0.004123530022  
0.004111677  
0.004098199299  
0.004085920437  
0.004072965869  
0.004061055327  
0.004050001823  
0.004037714495  
0.004025667839  
0.004014984001  
0.004003504107  
0.00399235653  
0.003980550732  
0.003969319795  
0.003958332568  
0.003947416604  
0.003935860305  
0.003925874106  
0.003916398961  
0.003904974927  
0.003895581405  
0.003885351298  
0.003875286684  
0.003865835979  
0.003856035965  
0.003846156747  
0.003837503165  
0.003827986137  
0.003818848028  
0.003809328757  
0.003800573408  
0.003791946499  
0.003782669552  
0.003773753337  
0.003766211782  
0.003757256719  
0.003749627712  
0.003741319682  
0.00373211277  
0.003724967827  
0.003718099268  
0.00370907605  
0.003702022057  
0.003693774429  
0.003687067672  
0.003679272796  
0.003672843799  
0.003665471581  
0.003658085451  
0.00365136696  
0.003644908662  
0.003637769754  
0.003630931283  
0.003624615799  
0.003618220877  
0.003611357455  
0.003605318111  
0.003600343367  
0.003593078796  
0.003587966845  
0.003581816626  
0.003576550823  
0.003570323521  
0.003565137929  
0.003559473421  
0.003553774247  
0.003548215454  
0.003543438123  
0.003538717061  
0.003533935982  
0.003527881914  
0.003523111537  
0.003518740518  
0.0035136777  
0.003509200131  
0.003505556354  
0.003499934081  
0.003495004379  
0.003491487127  
0.003487534545  
0.003483967243  
0.003479169558  
0.003475580584  
0.003472542661  
0.00346744957  
0.003463691984  
0.003460259339  
0.003456600568  
0.003453916938  
0.003450572225  
0.003446128127  
0.003443236696  
0.003441045934  
0.003436754895  
0.003434341179  
0.003431480572  
0.003429538907  
0.003426196624  
0.003424664872  
0.003421301027  
0.003418809377  
0.003415268678  
0.003414341043  
0.003411397412  
0.003409499712  
0.003407269322  
0.003405685953  
0.003402539323  
0.003400651757  
0.003398299784  
0.003396755966  
0.003395518947  
0.003394674762  
0.003391947893  
0.003391907638  
0.003390227306  
0.00338830687  
0.003387683911  
0.003386372402  
0.003385565847  
0.003383407089  
0.003383301292  
0.003382742058  
0.003381449286  
0.00338052115  
0.003380104468  
0.003379469416  
0.003379521971  
0.003379755895  
0.003379160396  
0.003378982866  
0.003378269917  
0.003378044688  
0.003378892446  
