-0.2299471536  
-0.1054243861  
0.02209239181  
0.1566200673  
0.3009820561  
0.4561823941  
0.6209035026  
0.7911911219  
0.9603885698  
1.119375648  
1.257131708  
1.361612787  
1.420880102  
1.424368952  
1.364164768  
1.236115967  
1.040632802  
0.7830436164  
0.4734356248  
0.125961472  
-0.2423176416  
-0.6129386642  
-0.9677045635  
-1.290313103  
-1.567749011  
-1.791259368  
-1.956794487  
-2.064880493  
-2.119951161  
-2.129262709  
-2.101563468  
-2.045710186  
-1.969460562  
-1.878583857  
-1.776424963  
-1.663932507  
-1.540122766  
-1.402852072  
-1.249732537  
-1.079025107  
-0.8903303399  
-0.6849716563  
-0.4660123954  
-0.2379167761  
-0.005945708661  
0.2245972632  
0.4491130968  
0.6643078638  
0.8685289549  
1.061777033  
1.245378893  
1.421378858  
1.591733973  
1.757465798  
1.917888657  
2.070067436  
2.208603376  
2.325817028  
2.412343893  
2.458088066  
2.453448199  
2.390667355  
2.26513939  
2.076493189  
1.82929023  
1.533211893  
1.202664063  
0.8558022913  
0.5130535388  
0.1952977335  
-0.0781027278  
-0.2911793253  
-0.4329123565  
-0.4982673949  
-0.4885943939  
-0.4113353225  
-0.2791046026  
-0.1082657013  
0.08278708416  
0.2754344794  
0.4524750406  
0.5994448539  
0.7054784609  
0.7636717136  
0.7709840633  
0.7277736431  
0.6371146292  
0.5040498533  
0.3349222205  
0.1368844408  
-0.08236870214  
-0.3146618783  
-0.5512775751  
-0.7828758984  
-0.9995244347  
-1.190945644  
-1.347045754  
-1.458715557  
-1.518835736  
-1.523336966  
-1.472130034  
-1.369707936  
-1.225244743  
-1.052077246  
-0.8665641027  
-0.6864009917  
-0.5285883039  
-0.4073308331  
-0.332164102  
-0.3066232346  
-0.3276757992  
-0.3860582093  
-0.4675098  
-0.5547481964  
-0.6299312114  
-0.6772287043  
-0.6851285341  
-0.6481116837  
-0.5674293451  
-0.4508504472  
-0.3114124876  
-0.1653650395  
-0.02962568441  
0.08084152304  
0.1553209268  
0.1889393825  
0.183319038  
0.1461934757  
0.09006004896  
0.03009874376  
-0.01830199722  
-0.04200839686  
-0.03221159265  
0.01422120055  
0.09429469911  
0.199396369  
0.3166486363  
0.4308833999  
0.5269012137  
0.5916833465  
0.6162171141  
0.5966783427  
0.5348460548  
0.4377028049  
0.316340945  
0.1843644425  
0.05603811353  
-0.05553342459  
-0.1399486365  
-0.1905768697  
-0.2050463653  
-0.1851271984  
-0.1360842465  
-0.06564059136  
0.017267415  
0.1037350158  
0.1859697621  
0.258052703  
0.3163346682  
0.3594311039  
0.3878962195  
0.40366726  
0.4093957976  
0.407804834  
0.4011514565  
0.3908842338  
0.3775008785  
0.36060515  
0.3391146431  
0.3115615271  
0.2764234508  
0.232426811  
0.1787812085  
0.1153175762  
0.0425345879  
-0.03845190484  
-0.1260198189  
-0.2181972776  
-0.3128172919  
-0.407658872  
-0.5005312483  
-0.5893009057  
-0.6718480364  
-0.7459724488  
-0.8092698288  
-0.8590237285  
-0.8921606934  
-0.9053115232  
-0.89501953  
-0.8581023139  
-0.7921478415  
-0.6960956043  
-0.5708085748  
-0.4195346246  
-0.2481442943  
-0.06505740334  
0.1192093631  
0.2928476834  
0.4438827423  
0.5614590714  
0.6371436457  
0.666040186  
0.647537673  
0.5855550945  
0.4882112376  
0.3669400325  
0.2351546349  
0.1066422699  
-0.006075779356  
-0.09317664804  
-0.1485554193  
-0.1702742474  
-0.16039966  
-0.1242783639  
-0.06940506106  
-0.004099512113  
0.06376673631  
0.1277588099  
0.1834278411  
0.2283652066  
0.2617897297  
0.2838349453  
0.2947369015  
0.2941562145  
0.2808503983  
0.2528035063  
0.2078409828  
0.1446172781  
0.06377107653  
-0.03102789314  
-0.132420608  
-0.2293163563  
-0.3076109237  
-0.3516478949  
-0.3462909394  
-0.2793242455  
-0.1438180868  
0.05992269259  
0.3231937297  
0.6287636254  
0.9519159471  
1.262604793  
1.528515912  
1.718682198  
1.807202799  
1.776587946  
1.62027265  
1.343961482  
0.9655777552  
0.5137914051  
0.02527526341  
-0.4590111031  
-0.8980763422  
-1.255191095  
-1.50171695  
-1.620034485  
-1.605221764  
-1.465325828  
-1.220196137  
-0.8990614845  
-0.5371414936  
-0.17172025  
0.1618647416  
0.4338502907  
0.6228999983  
0.7178894024  
0.7184797295  
0.6344659814  
0.4840551765  
0.2913247955  
0.08320247959  
-0.1136675497  
-0.2757983864  
-0.385185045  
-0.4308480972  
-0.409481971  
-0.3252119753  
-0.1885522697  
-0.01476138941  
0.1781698262  
0.3716173151  
0.54826219  
0.6936513305  
0.7972317777  
0.8528005364  
0.8583966904  
0.8157205686  
0.7292419633  
0.6051680796  
0.4504436406  
0.2719204311  
0.0758054192  
-0.1326001609  
-0.3488720496  
-0.5692192031  
-0.7901166886  
-1.007918437  
-1.218543684  
-1.417295592  
-1.598864527  
-1.757495  
-1.887307098  
-1.982714934  
-2.038881404  
-2.052160885  
-2.020468546  
-1.943541142  
-1.823063198  
-1.662643509  
-1.467648678  
-1.244894342  
-1.002238507  
-0.7480926251  
-0.4909239038  
-0.2387867295  
0.001051458877  
0.2223478198  
0.4199612384  
0.5897689447  
0.7284560181  
0.8332481154  
0.9016705499  
0.9314098221  
0.920364521  
0.8669014688  
0.7703133203  
0.6314096298  
0.4531207772  
0.2409919706  
0.003421874346  
-0.2484469837  
-0.5012272044  
-0.7401545621  
-0.9502091021  
-1.117346547  
-1.229644633  
-1.278212517  
-1.257720121  
-1.166517816  
-1.006365877  
-0.7818775512  
-0.4998390269  
-0.168559566  
0.202595769  
0.6033985219  
1.022685169  
1.448059847  
1.865540813  
2.259313549  
2.61178947  
2.904119045  
3.117234036  
3.23340632  
3.23817668  
3.122430314  
2.884312213  
2.530646427  
2.077560522  
1.550100308  
0.9807395178  
0.4068693109  
-0.1325108512  
-0.6005349737  
-0.9661780583  
-1.207470863  
-1.313775635  
-1.286827988  
-1.140374644  
-0.8984629954  
-0.5925746855  
-0.2579857073  
0.07020012733  
0.3608504255  
0.5899845878  
0.7429787583  
0.8155716751  
0.8136185  
0.7516786257  
0.6506831949  
0.5349993008  
0.429293913  
0.3555535214  
0.3306158449  
0.3644370714  
0.4592581695  
0.6096643635  
0.8034781882  
1.023297382  
1.24846182  
1.457196904  
1.628707328  
1.745006835  
1.792359945  
1.762227847  
1.651711507  
1.463499648  
1.205380497  
0.8894008538  
0.5307532362  
0.1464989991  
-0.245790602  
-0.6293765492  
-0.98958022  
-1.314821125  
-1.59737192  
-1.833766688  
-2.024813052  
-2.175177565  
-2.292580343  
-2.386632881  
-2.467442047  
-2.544114969  
-2.623337075  
-2.708207633  
-2.797499125  
-2.885478184  
-2.962357371  
-3.015378271  
-3.030425792  
-2.994018231  
-2.895422731  
-2.728627206  
-2.493885926  
-2.198596749  
-1.857328689  
-1.490924574  
-1.124719647  
-0.7860175185  
-0.5011064962  
-0.2921306971  
-0.1742163452  
-0.1532194074  
-0.2244194654  
-0.3723925464  
-0.5721517248  
-0.7915017801  
-0.9943956734  
-1.144930161  
-1.211531748  
-1.170821522  
-1.010665326  
-0.7319898371  
-0.3491060355  
0.1115636976  
0.6142322232  
1.117654532  
1.579729149  
1.962230722  
2.23508292  
2.379642233  
2.390618818  
2.276392124  
2.05774908  
1.76522071  
1.435398922  
1.10670573  
0.815147381  
0.5905512172  
0.4537050161  
0.4146723773  
0.4724097195  
0.6156283063  
0.82472127  
1.074435919  
1.336935507  
1.584865687  
1.794084095  
1.945774933  
2.027793435  
2.035170479  
1.969827948  
1.839632267  
1.656987296  
1.437171794  
1.196649321  
0.9515293489  
0.7163224547  
0.5030672884  
0.3208518596  
0.1756982375  
0.07073930358  
0.006596031959  
-0.01815320309  
-0.006490900884  
0.03744014206  
0.1086348263  
0.2013987376  
0.3094205641  
0.4257972214  
0.5430671747  
0.6533241552  
0.7484627631  
0.8205782564  
0.862527049  
0.8685862102  
0.8351435119  
0.7613040457  
0.6493084727  
0.5046460101  
0.3358077608  
0.1536474587  
-0.02960497154  
-0.2015764819  
-0.3510806685  
-0.4693760121  
-0.5511530606  
-0.5951119218  
-0.6040383072  
-0.5843358192  
-0.545097662  
-0.4968322153  
-0.4500356486  
-0.4138193606  
-0.3947960823  
-0.3963696321  
-0.4185296565  
-0.4581568062  
-0.509762338  
-0.566532407  
-0.6214970737  
-0.6686351044  
-0.7037467596  
-0.7249713324  
-0.7328933748  
-0.7302544298  
-0.7213314719  
-0.7111231287  
-0.7044743145  
-0.7052924495  
-0.7159627171  
-0.7370363158  
-0.7672223661  
-0.8036343391  
-0.8422452418  
-0.8784535606  
-0.9076689903  
-0.9258527233  
-0.9299439505  
-0.9181604338  
-0.8901619012  
-0.847093861  
-0.791530041  
-0.7273296605  
-0.6594225985  
-0.5935261829  
-0.5357959262  
-0.4924120366  
-0.4691211796  
-0.4707454866  
-0.5007079356  
-0.560610362  
-0.6499104547  
-0.7657429174  
-0.9029069682  
-1.054038977  
-1.209957976  
-1.360168306  
-1.493477769  
-1.598691515  
-1.665336431  
-1.684373611  
-1.648848142  
-1.554449849  
-1.39993021  
-1.187362033  
-0.922196192  
-0.613100071  
-0.2715687926  
0.08868720214  
0.4525471128  
0.8044414065  
1.129387039  
1.414023114  
1.647554012  
1.822510071  
1.935243423  
1.986118386  
1.979355285  
1.922557318  
1.825960337  
1.701495683  
1.561750808  
1.418952639  
1.284061736  
1.166057369  
1.071456627  
1.004084671  
0.9650601967  
0.9529648255  
0.964128844  
0.9929829842  
1.032445382  
1.074332739  
1.109797841  
1.12983991  
1.125900801  
1.090578676  
1.018430284  
0.9068186612  
0.756689197  
0.5731632951  
0.3657724333  
0.1482236609  
-0.0624086015  
-0.2470723983  
-0.3866371773  
-0.4641185473  
-0.4669793815  
-0.3891926751  
-0.2327383502  
-0.008270282272  
0.2652407281  
0.5619317886  
0.8514419237  
1.102022043  
1.284009134  
1.373209515  
1.353780949  
1.220214985  
0.9781659124  
0.6440291844  
0.24330514  
-0.1920195614  
-0.6267575616  
-1.026075446  
-1.358903011  
-1.600843497  
-1.736275454  
-1.759498224  
-1.674838133  
-1.495774648  
-1.243236361  
-0.9432846674  
-0.6244373697  
-0.314918083  
-0.04009632719  
0.179658545  
0.3305187318  
0.4060191409  
0.4071258914  
0.3415651792  
0.2225376128  
0.06696408448  
-0.1065356714  
-0.2796975494  
-0.4365003902  
-0.5646909308  
-0.6568058026  
-0.7106110131  
-0.728941774  
-0.7189839493  
-0.6911154958  
-0.6574299144  
-0.6301341825  
-0.6199926714  
-0.6349839967  
-0.67932269  
-0.7529363163  
-0.8514513596  
-0.9666718621  
-1.087486104  
-1.201078327  
-1.294303813  
-1.355057113  
-1.373486993  
-1.342922893  
-1.260436264  
-1.127009506  
-0.9473247463  
-0.7292486967  
-0.4830987349  
-0.2208010218  
0.04496813716  
0.3015820915  
0.5371503291  
0.7410948967  
0.9045926988  
1.020932395  
1.085785286  
1.097402484  
1.05673265  
0.9674368313  
0.8357714298  
0.6703055823  
0.4814670008  
0.2809099209  
0.08074921562  
-0.1072765421  
-0.272641831  
-0.4067644907  
-0.5035534886  
-0.5596954544  
-0.5746547194  
-0.5503780905  
-0.4907605546  
-0.4009457074  
-0.2865755708  
-0.1531045259  
-0.005276247442  
0.1531516038  
0.3194104312  
0.4914561886  
0.6675107705  
0.8455024369  
1.022514567  
1.194368044  
1.35542494  
1.498675923  
1.616132961  
1.699493505  
1.741017752  
1.734516351  
1.676334387  
1.566199549  
1.407822869  
1.20913831  
0.9821090729  
0.7420667687  
0.5065854486  
0.2939677673  
0.1214636268  
0.003391063826  
-0.05062779771  
-0.03708888279  
0.04051548244  
0.1715275835  
0.3387562887  
0.5199040844  
0.6896790697  
0.8223893312  
0.894740374  
0.8885050596  
0.7927527306  
0.6053428256  
0.3334904011  
-0.006688007962  
-0.3916161349  
-0.7925374271  
-1.178369526  
-1.51882269  
-1.787423409  
-1.964123849  
-2.03721021  
-2.004332042  
-1.872561335  
-1.657518365  
-1.381671619  
-1.072036393  
-0.7575081988  
-0.4661240615  
-0.2225071598  
-0.0457388673  
0.05216276666  
0.06703921109  
0.002627797343  
-0.1301430468  
-0.3144985579  
-0.5296545819  
-0.7529589769  
-0.9621216858  
-1.13732927  
-1.263032994  
-1.329253098  
-1.332286947  
-1.274750326  
-1.164974854  
-1.015835271  
-0.843120085  
-0.6636488892  
-0.493325956  
-0.345352898  
-0.2287989074  
-0.1476816296  
-0.1006764585  
-0.08147370765  
-0.07974680172  
-0.08261300825  
-0.07640444705  
-0.04853531558  
0.01077434282  
0.1071285655  
0.2411060989  
0.4080443004  
0.598466428  
0.799094535  
0.9943107706  
1.167881129  
1.304718716  
1.39248268  
1.422827871  
1.392175594  
1.301957368  
1.158329659  
0.971445864  
0.7543941798  
0.5219575472  
0.289338288  
0.07097828782  
-0.1204216789  
-0.2746324507  
-0.3843471118  
-0.4453880157  
-0.4566871216  
-0.4201126072  
-0.3401820342  
-0.2237088359  
-0.07940952779  
0.08252247762  
0.2508716051  
0.4138982315  
0.5599031812  
0.6778362333  
0.7579721859  
0.7925997473  
0.7766906969  
0.7084790512  
0.5898800348  
0.4266677617  
0.2283583674  
0.007747899749  
-0.2198881756  
-0.4379042135  
-0.6296165677  
-0.779733579  
-0.8757506048  
-0.9091350628  
-0.8761681371  
-0.7783296404  
-0.6221677464  
-0.4186507756  
-0.182085211  
0.07127585271  
0.3247757896  
0.5628392297  
0.772245615  
0.9430419756  
1.069014645  
1.147712271  
1.180065418  
1.169705137  
1.122118921  
1.043793686  
0.9414502043  
0.8214785049  
0.689588552  
0.5506755155  
0.4088370775  
0.2674704128  
0.1293692903  
-0.003230112567  
-0.1286841359  
-0.2460277444  
-0.3550727648  
-0.4564340045  
-0.5514297406  
-0.6418089437  
-0.7293040708  
-0.8150672588  
-0.8990855805  
-0.9796941075  
-1.053322759  
-1.114579084  
-1.156709471  
-1.172428098  
-1.155011088  
-1.099503975  
-1.003836102  
-0.8696480647  
-0.7026598021  
-0.5124615671  
-0.311732403  
-0.1149394807  
0.0632960722  
0.2099525826  
0.3152195474  
0.373735557  
0.3852611312  
0.3546872806  
0.2913840062  
0.2079690267  
0.1186933678  
0.03766085167  
-0.02286909691  
-0.05387052529  
-0.05047177674  
-0.01231264065  
0.05666932173  
0.1489385161  
0.254430367  
0.3617989247  
0.4596926377  
0.5378853471  
0.5881634638  
0.6048946728  
0.5852837318  
0.5293257441  
0.4395305056  
0.3204857092  
0.1783312339  
0.02021495105  
-0.1462341087  
-0.3133647836  
-0.4738928516  
-0.6211991596  
-0.7495411392  
-0.854185056  
-0.9314729684  
-0.9788333884  
-0.9947684629  
-0.9788303575  
-0.9316123926  
-0.8547637955  
-0.751031684  
-0.6243119944  
-0.4796860493  
-0.3233954748  
-0.1627276132  
-0.005760240475  
0.1390520124  
0.2634389478  
0.3600068734  
0.4229894568  
0.4489823751  
0.4375491178  
0.3916123051  
0.3175238316  
0.2247630062  
0.1252531353  
0.03230693279  
-0.04069078719  
-0.08174972682  
-0.08171953766  
-0.03552383701  
0.05696723493  
0.1905867785  
0.3551155783  
0.5361461081  
0.7164940299  
0.8780330422  
1.003734834  
1.079692385  
1.09685626  
1.052261699  
0.949564045  
0.7987747119  
0.6152034675  
0.4176973636  
0.2263870535  
0.06019369862  
-0.06556402687  
-0.1411577243  
-0.1637440792  
-0.1377671306  
-0.07439670556  
0.009965612054  
0.09591585048  
0.1637291886  
0.196128222  
0.1807465258  
0.1119437256  
-0.008305344128  
-0.1705569355  
-0.3590904726  
-0.5539507709  
-0.7335608351  
-0.8775276858  
-0.9692401256  
-0.9979106378  
-0.9597901149  
-0.858420587  
-0.7039372251  
-0.5115651476  
-0.2995630862  
-0.08692656848  
0.1088165226  
0.2734342668  
0.3972346839  
0.4756119745  
0.5089077683  
0.5016875557  
0.4615969851  
0.3980240213  
0.3207677229  
0.2388886157  
0.1598716471  
0.08915123891  
0.0299879772  
-0.01634762119  
