338.1891708  
367.0035824  
420.1673824  
552.5117165  
1266.657566  
4616.640157  
7788.545694  
5922.842177  
22984.38473  
50011.55833  
33396.03029  
40585.31551  
20277.88052  
20442.93874  
8389.813016  
16346.4385  
11620.92896  
20268.62807  
36007.2851  
37168.22828  
4297.721887  
6044.385432  
7232.662459  
8392.113793  
11308.94217  
16866.50884  
4625.907643  
8028.208447  
649.8987656  
5934.836058  
1976.653123  
2066.014637  
5836.612462  
4363.975839  
2841.983517  
3187.875725  
18.78067664  
7615.053276  
710.0817409  
3832.935749  
802.0297362  
2508.536939  
821.7984357  
245.0000334  
2437.653554  
14758.77966  
4366.380751  
3145.636795  
1141.255572  
65.52221856  
1570.953654  
2126.894358  
280.9892225  
803.5227001  
1173.417156  
460.4278113  
2491.383687  
52.15232384  
805.7238907  
673.6349811  
670.2709601  
209.9110619  
172.8230937  
10.85740187  
84.5335102  
549.2082225  
335.8688941  
46.20666811  
14.17618698  
18.52461626  
23.73472405  
30.8121842  
13.60310578  
7.706372361  
0.3636543314  
0.1378527092  
0.9376948736  
1.932587771  
0.7051522719  
0.6637346195  
2.116589105  
1.386639152  
0.5977212584  
0.5554344819  
0.7051038289  
0.766513736  
0.7603558284  
0.6889063861  
0.7538953091  
0.6495547072  
0.6277991813  
0.5813072352  
0.5614827171  
0.5289755641  
0.5334153809  
0.5183501258  
0.4755582047  
0.475056191  
0.4537968272  
0.4545079952  
0.4467066775  
0.4241093661  
0.4169416529  
0.4067805014  
0.3986093194  
0.3876579837  
0.3825777957  
0.3701330622  
0.3632609885  
0.3568953705  
0.3491767851  
0.3418777069  
0.3344554448  
0.327234072  
0.3210113532  
0.3149067101  
0.3084979422  
0.302626504  
0.2970199707  
0.2912122372  
0.2858510841  
0.2805891311  
0.2758959049  
0.2709539297  
0.2662735877  
0.2615942517  
0.2571787958  
0.2528244415  
0.2485986304  
0.2444957844  
0.2405194124  
0.2366589282  
0.2329028384  
0.2291959861  
0.2256011077  
0.222104307  
0.2187112903  
0.2154084852  
0.2121785828  
0.2090223568  
0.2059302397  
0.2029430801  
0.2000105964  
0.1971564138  
0.1943636415  
0.1916457831  
0.1889774342  
0.1863800792  
0.1838379489  
0.1813520575  
0.1789195648  
0.1765563495  
0.1742285498  
0.1719569313  
0.1697364676  
0.1675668072  
0.1654397247  
0.1633575101  
0.1613191564  
0.1593245818  
0.1573646438  
0.155454331  
0.1535818012  
0.1517417038  
0.1499488219  
0.1481813249  
0.1464452626  
0.144755063  
0.1430873808  
0.1414605184  
0.1398645532  
0.1382947695  
0.1367559415  
0.1352491171  
0.1337666338  
0.1323120829  
0.130884313  
0.1294895597  
0.1281065242  
0.1267691371  
0.1254419255  
0.1241374251  
0.1228637653  
0.1216035391  
0.1203691473  
0.1191600122  
0.117973701  
0.1167995768  
0.1156510658  
0.1145207641  
0.1134087044  
0.112316832  
0.111240157  
0.1101874762  
0.1091506477  
0.1081300308  
0.1071246451  
0.1061350443  
0.1051683134  
0.1042101722  
0.1032684357  
0.1023460194  
0.1014360375  
0.1005386823  
0.09965427408  
0.09878547237  
0.09793444852  
0.09709089407  
0.09626516255  
0.09544416871  
0.09464337503  
0.09385669895  
0.09307094727  
0.09230864503  
0.09155272265  
0.09080813659  
0.09007317721  
0.08935093888  
0.08864081351  
0.08793884962  
0.08724915957  
0.08656476301  
0.08590004773  
0.08523530538  
0.08458663152  
0.08394191926  
0.08330922837  
0.08268634388  
0.08206882901  
0.08146538354  
0.08086609666  
0.08027250819  
0.07969082142  
0.07911608531  
0.07855124589  
0.07799219956  
0.0774429474  
0.07689773335  
0.07636431442  
0.07583538488  
0.07531523206  
0.07480192776  
0.07429588091  
0.07379603713  
0.07329646017  
0.07281202316  
0.07233057181  
0.07185272723  
0.07138745488  
0.07092506844  
0.07046607174  
0.07001796112  
0.06957405635  
0.06913534344  
0.06870044075  
0.06827394182  
0.06785194506  
0.06743243492  
0.0670215555  
0.06661725231  
0.06621357226  
0.06581815291  
0.06542494619  
0.0650366218  
0.06465616985  
0.06428121741  
0.06390916358  
0.06354247267  
0.0631748798  
0.06281909813  
0.06246632065  
0.06211607975  
0.06176581216  
0.06142854614  
0.06108871541  
0.06075436691  
0.06042649803  
0.06010070213  
0.05977898634  
0.05945985624  
0.05914866417  
0.05883633222  
0.05853019794  
0.05822737897  
0.05792587114  
0.05763007137  
0.05733994868  
0.05704945494  
0.05676513656  
0.05648094975  
0.05620691209  
0.05592764803  
0.05565445782  
0.05538868933  
0.05512100998  
0.05485784299  
0.0545958469  
0.05433865411  
0.05408386552  
0.05383499449  
0.05358613085  
0.05334178897  
0.05309778539  
0.05285909545  
0.05261832241  
0.05238400525  
0.05215631212  
0.05192526861  
0.05169820709  
0.05147418383  
0.05125268698  
0.05103004303  
0.0508182246  
0.05060079909  
0.05039100314  
0.05018033897  
0.04997221908  
0.04976971954  
0.04956450729  
0.04936561529  
0.04916819618  
0.04897247408  
0.04877933589  
0.04858932512  
0.04839859061  
0.04821255396  
0.04802764154  
0.04784219387  
0.04766190807  
0.04748353541  
0.04730908461  
0.04713353298  
0.04695709934  
0.0467892755  
0.04661699043  
0.0464517613  
0.04628433262  
0.04612034669  
0.0459604902  
0.04580127867  
0.04564425347  
0.04548646168  
0.04533008348  
0.0451807145  
0.04502588487  
0.04487737583  
0.04472999751  
0.04458336869  
0.04443774119  
0.04429668106  
0.04415554889  
0.04401524673  
0.04387427453  
0.04373803952  
0.04360492372  
0.04346880657  
0.0433382441  
0.0432064961  
0.04307935996  
0.04295139936  
0.04282609682  
0.04270216341  
0.04257905417  
0.04245625253  
0.04233689268  
0.04221615622  
0.0420991382  
0.04198344877  
0.04186746233  
0.04175469853  
0.04164150432  
0.04153025119  
0.04142036325  
0.04131057868  
0.04120628005  
0.04110155554  
0.04099301334  
0.04089042062  
0.04078592323  
0.04068774798  
0.0405889478  
0.04049104593  
0.04039242201  
0.04029801033  
0.04020214614  
0.04010766646  
0.04001285373  
0.03992452996  
0.03983341632  
0.03974484844  
0.03965835338  
0.03956845813  
0.03948505768  
0.03939930643  
0.03931386677  
0.0392341562  
0.03915062785  
0.03907184707  
0.03899209926  
0.03891441165  
0.03883524761  
0.03876076509  
0.03868290311  
0.0386093875  
0.03853612858  
0.03846397644  
0.03839186576  
0.03832291324  
0.03825391583  
0.03818442628  
0.03811838313  
0.03805172583  
0.03798377514  
0.03792197007  
0.03785537062  
0.03779598968  
0.03773274803  
0.03767301101  
0.03761405738  
0.0375543398  
0.03749780894  
0.03743834016  
0.03738385897  
0.03732809394  
0.03727366611  
0.03721650796  
0.03716853563  
0.03711437291  
0.03706528337  
0.0370142861  
0.03696586034  
0.03691886179  
0.03687124594  
0.03682546423  
0.03677615232  
0.03673346626  
0.03669183068  
0.03664628366  
0.03660284172  
0.0365614004  
0.03651992815  
0.03648207088  
0.03644307533  
0.0364065729  
0.03636679517  
0.03632941917  
0.03629505302  
0.03625983486  
0.03622450176  
0.03619346928  
0.0361583408  
0.03612695532  
0.03609679266  
0.03606627768  
0.03603478864  
0.03600813845  
0.03598059465  
0.03595150588  
0.03592706918  
0.03589942155  
0.03587493548  
0.03585155915  
0.03582700201  
0.0358058499  
0.03578276326  
0.03576269635  
0.03574314428  
0.03572293302  
0.03570383406  
0.0356875462  
0.03566849929  
0.0356510531  
0.03563567167  
0.03561918748  
0.035606842  
0.03559332568  
0.03558262529  
0.03556850857  
0.03555406142  
0.03554667822  
0.03553477328  
0.03552519311  
0.03551682723  
0.03551183807  
0.03550538406  
0.0354967688  
0.035489974  
0.03548687019  
0.03548238656  
0.03547956938  
0.03547801112  
0.03547530874  
0.03547560156  
0.0354741731  
