2489.680102  
2703.527439  
3155.076389  
4186.605647  
7179.999945  
10240.8596  
41402.87142  
14435.11589  
7412.099619  
33554.03574  
1988.846619  
481.144439  
460.0063232  
15531.85905  
925.0584771  
20932.68472  
20456.88581  
20946.6809  
1798.795337  
41965.38584  
4386.942113  
21180.90877  
9919.430115  
1293.785961  
555.5129044  
2668.443121  
5310.137795  
22300.39222  
12338.98749  
14822.51328  
8107.823036  
595.2165284  
543.6223399  
4107.0291  
9473.509595  
5471.115331  
5040.497403  
1910.221309  
3519.23166  
185.3514977  
650.7682854  
4029.832613  
3444.165395  
12116.65042  
552.0212955  
8548.290872  
27.64950081  
7171.66897  
5265.314889  
989.9061964  
5074.477247  
9052.3818  
775.8178129  
8703.994695  
5554.288556  
6643.641671  
7860.787508  
1537.920154  
3347.781305  
1756.687619  
876.7364097  
1373.598117  
1197.07893  
1629.273652  
394.9442178  
113.1847704  
105.63364  
216.6191395  
69.24269325  
122.5613984  
228.4880349  
234.4264269  
48.15521504  
47.46976737  
43.04727746  
22.3115778  
29.52366422  
59.69151919  
48.92774458  
39.05969989  
38.99604192  
32.85601943  
28.54189791  
30.87352741  
30.83122443  
27.4832666  
28.23178404  
27.12908924  
26.24775151  
23.93367212  
24.00984084  
21.50770992  
21.40717076  
20.67207337  
20.14713444  
19.04797637  
18.58235672  
18.09896046  
17.38271247  
16.72971632  
16.42058335  
15.76823982  
15.23745052  
14.826486  
14.39640945  
13.97263355  
13.64627257  
13.22571222  
12.82732513  
12.5060125  
12.17437894  
11.83935976  
11.55764545  
11.2700002  
10.99348046  
10.7387563  
10.4903857  
10.23667034  
10.00488516  
9.773222899  
9.557916079  
9.344653965  
9.148121789  
8.952216864  
8.764918428  
8.585731983  
8.409133892  
8.241135311  
8.078394074  
7.917834154  
7.767069822  
7.618571237  
7.476524976  
7.337711456  
7.203975397  
7.073620867  
6.947997735  
6.824842877  
6.706032383  
6.590777921  
6.478832954  
6.3696972  
6.264207116  
6.161202663  
6.061191758  
5.963739376  
5.869366664  
5.777152195  
5.687365369  
5.600018266  
5.514968165  
5.432147893  
5.351277662  
5.272441126  
5.195548122  
5.120681131  
5.047577319  
4.976204209  
4.906499278  
4.838569819  
4.772145185  
4.70728479  
4.643967092  
4.582059096  
4.5215783  
4.462424608  
4.40459214  
4.348067204  
4.29274683  
4.238661044  
4.185747359  
4.13394436  
4.083250636  
4.033610277  
3.985022242  
3.937443  
3.890835349  
3.845184219  
3.800448791  
3.756603081  
3.713674214  
3.67155776  
3.630290327  
3.589840175  
3.550151125  
3.511248561  
3.473069009  
3.435601586  
3.398881999  
3.362837953  
3.32743824  
3.292731144  
3.258646905  
3.225173561  
3.192331951  
3.160055462  
3.128361255  
3.097234922  
3.066665373  
3.036636229  
3.007120676  
2.978119798  
2.949624609  
2.921611265  
2.894094341  
2.86703741  
2.840410861  
2.814269502  
2.788525263  
2.763237253  
2.738360499  
2.713879423  
2.689801168  
2.666117483  
2.642809867  
2.619874188  
2.597315053  
2.575123443  
2.553259812  
2.531748134  
2.510587411  
2.489727711  
2.469184463  
2.448987921  
2.429080005  
2.409487228  
2.390178475  
2.371165692  
2.352459151  
2.334015485  
2.31586003  
2.297939953  
2.280310389  
2.262956089  
2.245819132  
2.22893789  
2.212305072  
2.195914341  
2.17976187  
2.163827761  
2.148144336  
2.132646624  
2.117399707  
2.102353625  
2.087515172  
2.072896672  
2.058462024  
2.044244891  
2.03021897  
2.016367699  
2.002721013  
1.989261628  
1.975986531  
1.962885691  
1.949948891  
1.93720354  
1.924625403  
1.912199129  
1.899956826  
1.887866307  
1.875954691  
1.864165423  
1.852550765  
1.84108696  
1.829751043  
1.818595449  
1.807575802  
1.796678301  
1.785932493  
1.775319759  
1.76483605  
1.754489278  
1.744297548  
1.734202655  
1.724257182  
1.714414449  
1.704698846  
1.695119588  
1.685663678  
1.676302953  
1.66706364  
1.657941721  
1.648933781  
1.640034164  
1.6312524  
1.622558852  
1.613983177  
1.605517359  
1.597139191  
1.588857771  
1.580714754  
1.572620078  
1.564653797  
1.556781139  
1.549002662  
1.541310503  
1.533694076  
1.526184722  
1.518769772  
1.51143093  
1.504187072  
1.497026393  
1.489934222  
1.482954354  
1.476048908  
1.469216127  
1.462460161  
1.455781387  
1.449209728  
1.442678979  
1.436220415  
1.429862429  
1.423563109  
1.417341961  
1.41119499  
1.405109197  
1.399111099  
1.393161691  
1.387285652  
1.381481987  
1.375742401  
1.370078462  
1.364464895  
1.358926904  
1.35344833  
1.348034808  
1.342666116  
1.337377927  
1.332140584  
1.326974055  
1.321862117  
1.316802673  
1.311804888  
1.306853313  
1.301973183  
1.297143774  
1.292369916  
1.28764064  
1.282973427  
1.278361776  
1.273805018  
1.269296693  
1.264843716  
1.260429846  
1.256062413  
1.251759986  
1.247503248  
1.243289409  
1.239129482  
1.235016203  
1.230947229  
1.226930705  
1.222954534  
1.219027356  
1.215145329  
1.211303851  
1.20750608  
1.203751754  
1.200039556  
1.196371311  
1.192756578  
1.189182017  
1.185646876  
1.182146714  
1.178679151  
1.175272199  
1.171889217  
1.168546732  
1.165258777  
1.161987994  
1.158774094  
1.155602231  
1.152450669  
1.149350555  
1.146286142  
1.14324753  
1.140250803  
1.137288087  
1.134362233  
1.131480321  
1.12862527  
1.125793621  
1.123015788  
1.120271289  
1.11755363  
1.114872603  
1.112233336  
1.109614225  
1.1070382  
1.104477554  
1.101952921  
1.099481065  
1.097022139  
1.094591894  
1.092206804  
1.089826399  
1.087525181  
1.085218796  
1.082954318  
1.080711074  
1.078495785  
1.07632645  
1.074168903  
1.072042652  
1.069955761  
1.067900219  
1.065864508  
1.063869414  
1.0618793  
1.059939627  
1.058014665  
1.056122934  
1.054245296  
1.052418325  
1.050606849  
1.048825906  
1.047056511  
1.045341791  
1.043637823  
1.041942532  
1.040294868  
1.038669799  
1.0370623  
1.035498506  
1.033954802  
1.032421802  
1.030929362  
1.029451052  
1.028008105  
1.026587315  
1.025183075  
1.023814695  
1.022457391  
1.021140537  
1.019843372  
1.018557227  
1.01730187  
1.01607726  
1.01487292  
1.013691705  
1.012534106  
1.011399705  
1.01027276  
1.009191911  
1.008131521  
1.007081336  
1.006059452  
1.005064847  
1.004110037  
1.003146479  
1.002218978  
1.001318719  
1.000434022  
0.9995667918  
0.9987278551  
0.9979069976  
0.9971134955  
0.9963331429  
0.9955889091  
0.9948645093  
0.994161826  
0.9934749128  
0.9928124591  
0.9921616655  
0.991543556  
0.99094816  
0.9903641546  
0.9898082677  
0.9892644042  
0.9887620516  
0.9882656973  
0.9878025638  
0.9873565672  
0.9869244794  
0.9865075228  
0.9861427948  
0.9857622706  
0.9854173443  
0.9850877348  
0.9847889022  
0.9845180885  
0.984250566  
0.9840101432  
0.9837792009  
0.9835963501  
0.9834148586  
0.9832613803  
0.9831306355  
0.9829981108  
0.9829218852  
0.9828405553  
0.9827993308  
0.9827591603  
0.9827598711  
