242.3835203  
259.2910936  
294.7745152  
376.4229093  
679.3161632  
1108.56623  
6712.827045  
19161.60955  
46273.41477  
9736.258783  
31430.5096  
21889.484  
6565.106166  
795.7186348  
18305.8814  
42456.58995  
12524.75088  
15864.60767  
23534.98684  
15417.49042  
13326.99443  
16729.03515  
13099.0016  
26374.27493  
12904.52878  
3829.214761  
10226.56336  
4105.716812  
3891.816949  
9472.116386  
2999.986034  
7320.402968  
15521.8026  
2844.224346  
6031.661353  
966.4630117  
623.0374751  
2442.127747  
2351.70981  
1547.441793  
1566.627389  
6930.809019  
2179.578411  
11032.85002  
1506.855615  
3732.128829  
2989.822361  
8470.517132  
1059.751176  
1441.316441  
342.1484703  
100.5628457  
1840.508074  
350.707071  
2099.217693  
1435.299265  
1040.799136  
1263.538019  
4034.056828  
729.5602624  
400.0984789  
75.22604464  
1478.349759  
204.3322341  
95.87978519  
404.5427519  
95.70129105  
86.50997083  
131.178548  
124.3409959  
13.84668598  
23.943886  
2.628765358  
4.946844535  
14.6756579  
15.60066904  
4.965607988  
1.996620864  
0.4463687084  
0.07385197978  
0.3851122091  
0.5739377645  
0.4721097898  
0.4280360302  
0.4366656881  
0.3764387195  
0.1285636923  
0.1793911753  
0.1502372952  
0.1977950558  
0.141632089  
0.09734670594  
0.1489826684  
0.132836778  
0.1186165998  
0.1044723294  
0.133818595  
0.1257178305  
0.1227543355  
0.1158099458  
0.1240306209  
0.1198374158  
0.1130529546  
0.1078565315  
0.1028909526  
0.1014936824  
0.09951542393  
0.09550402748  
0.09292674779  
0.09071370053  
0.09116529782  
0.0880334493  
0.08668381154  
0.0844192149  
0.08352877967  
0.08123321232  
0.08008844959  
0.07830010493  
0.07711004558  
0.07541259905  
0.07431563377  
0.07289437254  
0.07147764759  
0.07019928831  
0.06911094984  
0.06781877256  
0.06666740355  
0.06549090021  
0.06441175792  
0.06335730559  
0.06234179948  
0.06130769288  
0.06031744976  
0.05934487936  
0.05841944436  
0.0574975434  
0.05659945479  
0.05575499323  
0.05492312664  
0.05409391874  
0.053297749  
0.05252881697  
0.05177325654  
0.05103605099  
0.05030805446  
0.04960630821  
0.04891947929  
0.0482445504  
0.04757477053  
0.04695616099  
0.04631678221  
0.04570424542  
0.04510327373  
0.04451429265  
0.04393586983  
0.04337634599  
0.04283070136  
0.04228863226  
0.04176454437  
0.04125587071  
0.04075445526  
0.04025705422  
0.03976776269  
0.03930311905  
0.03883590519  
0.03838038124  
0.03792753178  
0.03749852413  
0.03706496627  
0.03665416943  
0.03623984539  
0.03583167206  
0.03543820006  
0.03505113815  
0.03466485303  
0.03429132017  
0.03393326049  
0.0335685386  
0.03321097839  
0.03286855934  
0.03252797802  
0.03219581439  
0.03185654683  
0.03153698226  
0.03122098423  
0.03090726489  
0.03059719766  
0.03029805458  
0.03000519725  
0.02970593887  
0.02942748883  
0.02914382974  
0.0288719766  
0.02859564263  
0.02833120854  
0.02806554565  
0.02780937968  
0.02755913159  
0.02730460476  
0.02706093239  
0.02681666449  
0.02657553609  
0.02634274765  
0.02611378988  
0.02588258534  
0.02566690907  
0.02543778631  
0.02522031815  
0.02501142861  
0.02480484264  
0.02459910432  
0.02438877477  
0.02419126047  
0.02399069013  
0.0238012334  
0.02360717551  
0.02341797491  
0.02323193221  
0.02304637931  
0.02286735882  
0.02268864643  
0.02251246202  
0.02233682715  
0.02217173368  
0.02200497917  
0.02184029688  
0.02167485275  
0.02151295606  
0.02135458087  
0.0211967676  
0.02104458041  
0.02089027666  
0.02074140694  
0.02059688017  
0.02044729292  
0.02030278424  
0.02015563211  
0.02002307991  
0.01988490976  
0.01974659402  
0.01961251784  
0.01948202052  
0.01934823322  
0.01921868947  
0.01908628858  
0.01896644319  
0.01884200233  
0.01872047156  
0.01859634467  
0.01848039348  
0.0183591247  
0.01824827311  
0.0181328889  
0.01801965806  
0.01790574419  
0.01779448782  
0.01768590766  
0.01757497734  
0.01746806372  
0.01736251755  
0.01726251267  
0.01715854325  
0.01705943908  
0.01695904258  
0.0168639502  
0.0167631055  
0.01666740446  
0.01657224074  
0.01647351961  
0.01638528503  
0.01629281056  
0.01620044618  
0.01611212268  
0.01602435295  
0.01593440223  
0.01585202568  
0.01576056698  
0.01568509348  
0.01559662874  
0.01551611647  
0.01543691659  
0.0153549898  
0.01527678919  
0.01519432175  
0.01512045862  
0.01504149863  
0.01496630294  
0.01489148319  
0.01481837932  
0.01474481912  
0.014675515  
0.01459923936  
0.01452763583  
0.01445727111  
0.01438966427  
0.01432268325  
0.01425499111  
0.01418893476  
0.01412121455  
0.01405857523  
0.01399369504  
0.01392969093  
0.01387048019  
0.01380756933  
0.01374581886  
0.0136839307  
0.01362121551  
0.0135627824  
0.01350333403  
0.01344622234  
0.01338733685  
0.0133318809  
0.01327887732  
0.01322011177  
0.01316511271  
0.01311364952  
0.01305939698  
0.01300138881  
0.01294860757  
0.01290149078  
0.01284631048  
0.01279920425  
0.01275097558  
0.01269988894  
0.01265041951  
0.01259922684  
0.01255326308  
0.01250195879  
0.01245751532  
0.01240977439  
0.01236499879  
0.01232327813  
0.01227953584  
0.01223099669  
0.01218398471  
0.01214550098  
0.01210239213  
0.01205581409  
0.01201331517  
0.01197551294  
0.0119318436  
0.01189347719  
0.01185240164  
0.01181502713  
0.01177648792  
0.01173418855  
0.0116982148  
0.01165845106  
0.01162105617  
0.01158373259  
0.01154859782  
0.01151109444  
0.01147571826  
0.01143909183  
0.01140777309  
0.0113699148  
0.01133541802  
0.01130251347  
0.01127017643  
0.01123364427  
0.01120254699  
0.01117038742  
0.011139726  
0.01110572017  
0.01107557336  
0.0110442977  
0.01101067274  
0.01098531587  
0.01095036518  
0.01092497547  
0.01089681789  
0.01086370752  
0.01083519753  
0.01080861773  
0.0107798039  
0.01075353162  
0.01072723766  
0.01070136704  
0.01067503294  
0.01064786564  
0.01062055019  
0.01059576975  
0.01057230052  
0.01054796749  
0.01052332932  
0.01049668414  
0.01047275853  
0.01045012384  
0.01042520153  
0.01040089971  
0.01037695049  
0.01035409565  
0.01033283144  
0.01031009159  
0.01029176458  
0.01026758798  
0.01024894393  
0.01022565969  
0.01020580681  
0.01018687863  
0.01016732003  
0.01014442088  
0.01012577836  
0.01010738892  
0.01008628366  
0.01006954017  
0.01005210796  
0.01003235442  
0.01001136777  
0.009994738961  
0.009976977617  
0.009960365063  
0.009942852864  
0.009927355024  
0.00991117131  
0.009892875733  
0.009879773934  
0.009861791422  
0.009848632592  
0.009835076644  
0.009819147362  
0.009801881421  
0.009786329257  
0.009774006259  
0.009759584951  
0.009743636357  
0.009732004136  
0.009718609803  
0.009703614523  
0.009692538119  
0.009678353882  
0.009663520571  
0.009652348044  
0.009643258748  
0.009628146724  
0.00961722443  
0.0096053056  
0.009595478791  
0.009586507916  
0.009575339213  
0.009563477068  
0.009553703869  
0.009540771583  
0.009529894501  
0.009524883846  
0.009513221947  
0.009504335228  
0.009495188115  
0.009486175161  
0.009476830767  
0.009470383102  
0.009457638117  
0.00945389106  
0.009446669981  
0.009436617069  
0.009429102833  
0.009421688944  
0.009413748236  
0.00940859476  
0.009400998517  
0.009397002032  
0.009388079074  
0.009383826202  
0.00937853181  
0.009370588311  
0.009363750179  
0.009361207656  
0.009356185945  
0.009353357285  
0.00934486335  
0.009341744968  
0.009333650268  
0.009332861176  
0.009327444798  
0.009323100754  
0.009319147961  
0.009318011821  
0.009313731098  
0.009314002064  
0.009308964956  
0.009308876799  
0.009306615595  
0.009301260016  
0.009298593627  
0.009297893423  
0.009299501571  
0.009295110733  
0.009292775089  
0.009293202697  
0.009293260305  
0.009293690328  
0.009293719676  
0.009287348297  
0.00929048297  
