-0.06043698831  
-0.1646840469  
-0.2616581405  
-0.3449644384  
-0.4099313078  
-0.4541811594  
-0.4778574758  
-0.4834840563  
-0.4754789714  
-0.459413896  
-0.4411298728  
-0.4258533714  
-0.4174437689  
-0.4178775043  
-0.4270367241  
-0.4428192851  
-0.4615380773  
-0.4785396107  
-0.4889411882  
-0.4883778486  
-0.4736556935  
-0.4432239139  
-0.3974162132  
-0.3384362698  
-0.2701043545  
-0.1974081043  
-0.1259212795  
-0.06116763257  
-0.008007017663  
0.02988521818  
0.05039436296  
0.05315847093  
0.03956876977  
0.01258163611  
-0.02362514549  
-0.0641154811  
-0.1037221172  
-0.1375880792  
-0.1616657436  
-0.1731282735  
-0.1706554759  
-0.1545652099  
-0.126781282  
-0.09063543694  
-0.05052285072  
-0.01143794992  
0.0215613549  
0.04391365782  
0.05207867432  
0.043971621  
0.01925887751  
-0.02052006823  
-0.07202629252  
-0.1303822239  
-0.1896051223  
-0.2431679889  
-0.2846390507  
-0.3083336448  
-0.3099184699  
-0.2869052864  
-0.2389830879  
-0.1681498129  
-0.07861969637  
0.02349146286  
0.1306911592  
0.2347971894  
0.3277299326  
0.4023254847  
0.4530834459  
0.4767527256  
0.4726796792  
0.4428569369  
0.3916546319  
0.3252520027  
0.250839197  
0.1756894336  
0.1062361915  
0.0472892337  
0.001518312782  
-0.03071580604  
-0.05114138905  
-0.06299846263  
-0.07019326969  
-0.07632111196  
-0.08372717934  
-0.09277430578  
-0.1014605581  
-0.1054776927  
-0.09872986948  
-0.07425383889  
-0.02541171818  
0.05282465633  
0.1627082351  
0.3028661194  
0.467921495  
0.6486704426  
0.8328219939  
1.006204214  
1.154278671  
1.26375127  
1.324049824  
1.328467512  
1.274824644  
1.165577153  
1.007394593  
0.8102984163  
0.5865170246  
0.3492382749  
0.1114315494  
-0.1151125097  
-0.3204455078  
-0.4967972871  
-0.6386166006  
-0.742396867  
-0.8063828514  
-0.8302573922  
-0.8148902986  
-0.7621951939  
-0.6750981939  
-0.5575931468  
-0.41482543  
-0.2531379745  
-0.08001342645  
0.09613080596  
0.2663172271  
0.4215373414  
0.553392888  
0.6547848563  
0.7205616031  
0.7480483082  
0.7373747262  
0.6915498412  
0.6162471722  
0.5193092966  
0.4100080918  
0.2981247789  
0.1929514251  
0.1023174821  
0.0317569467  
-0.01608085461  
-0.04169510194  
-0.04862846732  
-0.04298340433  
-0.03260698513  
-0.02602434724  
-0.03125139737  
-0.05463124436  
-0.09985363992  
-0.1673022221  
-0.2538430996  
-0.3531143056  
-0.4563157001  
-0.5534252722  
-0.6347024798  
-0.6922886841  
-0.7216796724  
-0.7228440635  
-0.7007915572  
-0.6654501818  
-0.6307993843  
-0.6133025373  
-0.6297866084  
-0.6950120166  
-0.8192344249  
-1.006103361  
-1.251217545  
-1.541603215  
-1.856277772  
-2.167925838  
-2.445563282  
-2.657920551  
-2.777149499  
-2.782387264  
-2.66268724  
-2.418882106  
-2.064064004  
-1.622538968  
-1.127325383  
-0.6164778302  
-0.1286974991  
0.3011813086  
0.6462139066  
0.8903121669  
1.02974934  
1.073008161  
1.039028405  
0.9541437164  
0.8481899761  
0.750366259  
0.6854456714  
0.6708432021  
0.7148934937  
0.8164882499  
0.9660106137  
1.147329237  
1.340474288  
1.524572695  
1.680618163  
1.79372719  
1.854640897  
1.86036343  
1.813953019  
1.723585066  
1.601088655  
1.460193099  
1.314723818  
1.176971671  
1.056402871  
0.9588319834  
0.8861058189  
0.8362945363  
0.8043265382  
0.7829654361  
0.7639879263  
0.7394200215  
0.7026747168  
0.6494579434  
0.5783389093  
0.4909197074  
0.3915896378  
0.2869073852  
0.1846904893  
0.09294311899  
0.01876111066  
-0.03263337603  
-0.0586017844  
-0.05945076886  
-0.03840074558  
-0.001174696175  
0.04472980388  
0.09098136785  
0.1294367907  
0.1531114884  
0.1569740003  
0.138479891  
0.09778704797  
0.03765725506  
-0.03693145467  
-0.1193863409  
-0.2022348624  
-0.2779002909  
-0.3394379978  
-0.3811630801  
-0.3991264837  
-0.3914171952  
-0.3582848939  
-0.3020935871  
-0.2271225297  
-0.1392351678  
-0.04543763263  
0.04665466219  
0.1294131124  
0.195832675  
0.2401622904  
0.2584893821  
0.2492165979  
0.2133742843  
0.1547101648  
0.07951498152  
-0.003838906158  
-0.08563403141  
-0.1557748234  
-0.2049003216  
-0.2255329252  
-0.2131183661  
-0.1668230789  
-0.08995223708  
0.01009972276  
0.1224177444  
0.2336213777  
0.3293157165  
0.3957697367  
0.4216123021  
0.3993068409  
0.3261841194  
0.2048613325  
0.04296286377  
-0.1478437481  
-0.3533644506  
-0.5587315751  
-0.7503101641  
-0.9173599512  
-1.053198443  
-1.155686866  
-1.226984479  
-1.272637622  
-1.300197631  
-1.317635694  
-1.331861819  
-1.347634956  
-1.367065562  
-1.389800777  
-1.413841214  
-1.436804681  
-1.457351442  
-1.476431574  
-1.498030515  
-1.52916076  
-1.578985071  
-1.657116027  
-1.771316022  
-1.924964083  
-2.114754541  
-2.329108619  
-2.547715677  
-2.742470932  
-2.87986622  
-2.924645755  
-2.844307614  
-2.613843618  
-2.220015452  
-1.664479412  
-0.9651953906  
-0.1557961598  
0.7171183342  
1.598475494  
2.430445058  
3.158612434  
3.737770839  
4.136554766  
4.340311802  
4.351891355  
4.190329263  
3.887724247  
3.484822469  
3.025983744  
2.554229655  
2.106989665  
1.71301628  
1.39071359  
1.147909572  
0.9828966577  
0.886419733  
0.844203487  
0.8396013548  
0.8559986581  
0.8786991556  
0.8961412578  
0.9004225979  
0.887209784  
0.8551977243  
0.8053086149  
0.7398328449  
0.6616693395  
0.5737780862  
0.4788820644  
0.3794046474  
0.2775726365  
0.1756011674  
0.07585936416  
-0.01904752729  
-0.1063301218  
-0.1831949842  
-0.2471273552  
-0.2962102071  
-0.3294135708  
-0.3467889809  
-0.3495203643  
-0.3398150057  
-0.3206496646  
-0.2954107944  
-0.2674927758  
-0.2399219823  
-0.2150716613  
-0.1945081858  
-0.178994673  
-0.1686344724  
-0.1631249221  
-0.1620557698  
-0.1651934777  
-0.172682167  
-0.1851195427  
-0.2034820802  
-0.2289115764  
-0.2623961428  
-0.3044095719  
-0.3545787875  
-0.4114505881  
-0.4724132646  
-0.5338054878  
-0.5912084774  
-0.6398902644  
-0.6753401591  
-0.6938173567  
-0.6928301638  
-0.6714735332  
-0.6305728876  
-0.5726152578  
-0.5014698427  
-0.4219441478  
-0.3392346319  
-0.2583476653  
-0.1835706582  
-0.1180592538  
-0.06359504674  
-0.0205341091  
0.01204887237  
0.0360562298  
0.05394850349  
0.06828084534  
0.0812640272  
0.09441582453  
0.1083549069  
0.1227663168  
0.136536254  
0.1480357515  
0.1554991758  
0.157432258  
0.1529852622  
0.1422191998  
0.1262253317  
0.1070691754  
0.0875700767  
0.0709420102  
0.06035662066  
0.05848746305  
0.0671114587  
0.08681930678  
0.1168824577  
0.1552923312  
0.1989602391  
0.2440528116  
0.2864047078  
0.3219562196  
0.3471485665  
0.3592319431  
0.3564435383  
0.3380477315  
0.3042429001  
0.2559662698  
0.1946371126  
0.1218970286  
0.0393932652  
-0.05135027944  
-0.1489497862  
-0.2520646494  
-0.3592087637  
-0.4685176206  
-0.5775275378  
-0.6830379541  
-0.7811172974  
-0.8672939272  
-0.9369433587  
-0.9858494264  
-1.010870085  
-1.010614901  
-0.9860107811  
-0.9406368101  
-0.8807219527  
-0.8147445635  
-0.7526218694  
-0.7045518623  
-0.6796252232  
-0.6843846011  
-0.7215370781  
-0.789028444  
-0.8796560994  
-0.9813409969  
-1.078090624  
-1.151590369  
-1.18326831  
-1.156590444  
-1.059305488  
-0.8853297511  
-0.6360108383  
-0.3205654354  
0.04440209802  
0.4362722412  
0.8285325001  
1.19339596  
1.504600488  
1.740054615  
1.884010781  
1.928530487  
1.874093785  
1.729320129  
1.509886256  
1.236798204  
0.9342489019  
0.6273047364  
0.3396609193  
0.09167132029  
-0.1011933745  
-0.2293615435  
-0.2896046682  
-0.2849164802  
-0.2238724672  
-0.119548525  
0.01189862657  
0.1528606442  
0.2859827921  
0.3957954517  
0.470133643  
0.5012152451  
0.4862796865  
0.4277237928  
0.3327225834  
0.2123774522  
0.08047527492  
-0.0479995485  
-0.1584415033  
-0.2381080803  
-0.2773458961  
-0.2704268465  
-0.2159023479  
-0.1164608805  
0.02166885164  
0.189659632  
0.3772233426  
0.5737691506  
0.7694224327  
0.9557757537  
1.126300074  
1.276408549  
1.403226569  
1.505164304  
1.581413934  
1.631483745  
1.654864222  
1.650874703  
1.618697716  
1.557576295  
1.467109776  
1.347586329  
1.200280568  
1.027666387  
0.833503496  
0.6227913311  
0.4015871468  
0.1767104672  
-0.04463294673  
-0.2552747055  
-0.4485157687  
-0.6185282948  
-0.7606950014  
-0.871860639  
-0.9504780682  
-0.9966369595  
-1.011981851  
-0.9995259342  
-0.9633823552  
-0.9084365197  
-0.8399945856  
-0.7634348469  
-0.6838962223  
-0.6060256349  
-0.5338048014  
-0.4704571659  
-0.4184327693  
-0.379452274  
-0.3545846798  
-0.3443283519  
-0.3486721343  
-0.3671124867  
-0.3986263663  
-0.4416055204  
-0.4937841632  
-0.5521919293  
-0.6131799108  
-0.6725552584  
-0.7258477842  
-0.7687123006  
-0.7974383567  
-0.8095105616  
-0.8041432535  
-0.7826909216  
-0.7488416592  
-0.7085149432  
-0.6694171156  
-0.6402538726  
-0.6296571675  
-0.6449354085  
-0.6908028538  
-0.7682746016  
-0.8739126625  
-0.9995872702  
-1.132857213  
-1.257999452  
-1.35762123  
-1.414693058  
-1.414766058  
-1.348078454  
-1.211249398  
-1.008285292  
-0.7507048501  
-0.4566971924  
-0.1493617646  
0.1457889329  
0.4037654496  
0.6031039591  
0.7285328629  
0.7729365032  
0.738333041  
0.6357116652  
0.4837366872  
0.3064683564  
0.1304007578  
-0.01879577929  
-0.119402505  
-0.156240142  
-0.1223851333  
-0.01981398116  
0.1410931008  
0.3430834923  
0.56437509  
0.7814775008  
0.9721111984  
1.117848971  
1.206157513  
1.231613342  
1.196183051  
1.108587881  
0.982885832  
0.836493545  
0.6879261255  
0.554551266  
0.4506301756  
0.3858615422  
0.364571843  
0.3855981237  
0.4428279312  
0.5262779986  
0.6235397905  
0.7213891284  
0.8073520509  
0.8710494936  
0.905173447  
0.9060151472  
0.8735171354  
0.8108817283  
0.7238235283  
0.619583717  
0.5058509566  
0.3897374291  
0.276946175  
0.1712390287  
0.0742688161  
-0.0142052328  
-0.09576243274  
-0.1725135886  
-0.2461764851  
-0.3171945574  
-0.3840568448  
-0.4429643401  
-0.4879360375  
-0.5113883955  
-0.5051404639  
-0.461726618  
-0.3758298723  
-0.2456099075  
-0.07369636184  
0.1323547093  
0.3602703338  
0.5939685934  
0.815094585  
1.004997643  
1.146888819  
1.227878046  
1.24058719  
1.184100789  
1.064108128  
0.8922103847  
0.6844898236  
0.4595495898  
0.2362977616  
0.03178317343  
-0.1406336144  
-0.2725470165  
-0.3610755643  
-0.4087027021  
-0.4224559569  
-0.4125773808  
-0.3908942111  
-0.3691184056  
-0.3572982855  
-0.3626073334  
-0.3885963976  
-0.4349677487  
-0.4978634103  
-0.570596131  
-0.6447043666  
-0.7111843658  
-0.7617418238  
-0.7899080998  
-0.7918984209  
-0.7671124381  
-0.7182318925  
-0.6509043438  
-0.5730585888  
-0.493926254  
-0.4228886074  
-0.3682769347  
-0.3362728691  
-0.3300448743  
-0.349231806  
-0.3898615424  
-0.444730548  
-0.5042306467  
-0.5575460149  
-0.5940927809  
-0.6050341996  
-0.5846814025  
-0.5315859387  
-0.4491526646  
-0.3456537678  
-0.2335864899  
-0.1284021277  
-0.04671826633  
-0.004203865719  
-0.01338162083  
-0.08163222963  
-0.2096655744  
-0.3906970362  
-0.6104867237  
-0.8482974144  
-1.078721679  
-1.274214515  
-1.408063567  
-1.457473077  
-1.406388563  
-1.247715383  
-0.9846259546  
-0.6307540593  
-0.209199929  
0.2495898548  
0.710853335  
1.139121327  
1.501981662  
1.773541695  
1.937158706  
1.987093029  
1.928870086  
1.778306079  
1.559323479  
1.300846726  
1.033178092  
0.7843283911  
0.5767646113  
0.4249820192  
0.3341850333  
0.3002113329  
0.3106735907  
0.3471327424  
0.3879931324  
0.4117350043  
0.4000583341  
0.3405394783  
0.228477431  
0.06769833362  
-0.1297720123  
-0.3451202834  
-0.5550707684  
-0.7348342067  
-0.8613125711  
-0.9161633471  
-0.8883288679  
-0.7757057436  
-0.5857226016  
-0.3347353971  
-0.04628825576  
0.2515506789  
0.529457992  
0.7603147087  
0.9224118585  
1.001988177  
0.9947608379  
0.9062483877  
0.7508428755  
0.5497510181  
0.328087666  
0.1115148828  
-0.07711660971  
-0.2206592029  
-0.3097021172  
-0.3434674589  
-0.3294554494  
-0.2819025264  
-0.2192864989  
-0.1612497051  
-0.1254051877  
-0.1244905767  
-0.1643087423  
-0.242752756  
-0.3500674132  
-0.4703121985  
-0.5837990424  
-0.6701481101  
-0.7114911622  
-0.6953452188  
-0.616717472  
-0.4791236721  
-0.2943634207  
-0.08108455834  
0.1376574215  
0.3374830629  
0.4959762299  
0.595701692  
0.6265327585  
0.586974019  
0.4843071469  
0.3335589423  
0.1554497467  
-0.0263852793  
-0.1885159314  
-0.3107576785  
-0.3787234834  
-0.3855584423  
-0.3326275157  
-0.2290806265  
-0.09036288937  
0.06411944866  
0.2138478414  
0.3401542726  
0.4288786325  
0.4723428323  
0.4703443592  
0.4300328241  
0.3646680866  
0.2914479496  
0.2287221069  
0.1930136123  
0.1963092893  
0.2440388005  
0.3340699843  
0.4568880652  
0.5969415776  
0.734951925  
0.8508260535  
0.9267101601  
0.9496969773  
0.9137585917  
0.8205972273  
0.6792919605  
0.5048096296  
0.3156424398  
0.130963258  
-0.03223214678  
-0.1615369614  
-0.2507306746  
-0.3003338932  
-0.317078369  
-0.3124256204  
-0.3004331163  
-0.2953517338  
-0.3093762666  
-0.3509207071  
-0.4236789056  
-0.5265810431  
-0.6545868206  
-0.8001014813  
-0.9546916575  
-1.110731863  
-1.262625882  
-1.407347146  
-1.544174163  
-1.673668743  
-1.796110926  
-1.909728674  
-2.009138338  
-2.084400013  
-2.121008213  
-2.100981181  
-2.005014429  
-1.815451815  
-1.519646498  
-1.113163912  
-0.6022567386  
-0.005101766444  
0.6485351781  
1.31931362  
1.961855303  
2.529396823  
2.978957195  
3.276316486  
3.40011077  
3.344454684  
3.119708885  
2.751267409  
2.276516753  
1.74037062  
1.189975271  
0.6692918369  
0.2142596339  
-0.1508339125  
-0.415334348  
-0.5823377541  
-0.6669773737  
-0.6931696945  
-0.6892994456  
-0.6834641101  
-0.6989428576  
-0.7505196611  
-0.8421579102  
-0.9663457743  
-1.105190398  
-1.233107733  
-1.320724505  
-1.339448177  
-1.266059525  
-1.086673497  
-0.7994998722  
-0.4159964944  
0.03977083863  
0.5334943549  
1.024409172  
1.469987979  
1.830915624  
2.075673699  
2.184133523  
2.149700908  
1.979766736  
1.694457798  
1.32391157  
0.9044878247  
0.4744522014  
0.06970511235  
-0.2799132506  
-0.5533276018  
-0.7396829626  
-0.83848349  
-0.8585169465  
-0.8158092155  
-0.7309589493  
-0.6262279028  
-0.5227661571  
-0.4382765739  
-0.385345992  
-0.3705591831  
-0.3944092557  
-0.4519329769  
-0.5339196365  
-0.6285100484  
-0.7229717269  
-0.8054510127  
-0.8665085664  
-0.9002912695  
-0.905221774  
-0.8841441047  
-0.8439022478  
-0.7943916517  
-0.7471680214  
-0.7137520865  
-0.7038077985  
-0.7234114197  
-0.7736240112  
-0.849590267  
-0.9403235556  
-1.029288634  
-1.095791369  
-1.117084416  
-1.070993261  
-0.9387766317  
-0.7078778966  
-0.3742057657  
0.05637553213  
0.5675894797  
1.133441718  
1.720043848  
2.288398011  
2.797856088  
3.209880663  
3.491702548  
3.619481445  
3.580636443  
3.375112796  
3.015462824  
2.52573957  
1.939333681  
1.295968067  
0.638158436  
0.007485649505  
-0.5589545212  
-1.031581789  
-1.390555369  
-1.626982533  
-1.743014788  
-1.750844017  
-1.670736064  
-1.528331183  
-1.351535273  
-1.167360677  
-0.9990814998  
-0.8640288354  
-0.772265299  
-0.726262226  
-0.721569037  
-0.7483256694  
-0.7933575388  
