27,-0.0054971,0.027949,0.039867,-0.97984,0.003293,-1.9183,0.95781,-1.3462,8.7022,-0.065084,3.1423,0.0042419,1.1388,5.7344,0.039359,7.6852,0.0078101,0.98029,0.13006,0.061663,0.043004,0.032576,0.23393,0.22846,0.41111,0.062655,0.018521,0.010642,0.034675,0.39978,0.15729,0.10335,9.9648,153.02,391.65,1023.3,1578.6,0.10187,0.16116,0.16116,1.218,1.923,0.60303,0.25073,0.030527,61,35.869,1040,27359,5.2841,29.75,28080,21816,2889,0.92983,0.94773,0.15044,0.11803,0.041964,0.63333,17893,11339,0.0010642,0.00039278,2,0.23534,0,0.12228,0.098011,0.38578,0.15071,0.62101,0.39811,3.1292,2.5623,0.23291,0.32711,0.34918,0.30389,0.30653,0.31905,0.39348,0.28551,0.26907,24.446,9.428,27459,62369,61833,0.24687,0.24894,0.06468,0.46341,0.49258,0.063027,0.56955,0.63309,0.054288,0.63514,0.70713,0.048037,0.6971,0.75601,0.044852,0.062484,0.064191,0.40623,0.20722,0.17466,0.012332,0.11359,0.11358,0.34816,0.2331,0.20218,-1.8368e-05,0.1635,0.16,0.29709,0.24505,0.22005,-0.014284,0.030112,0.030121,0.43766,0.15297,0.12586,9.5289e-05,0.055924,0.056324,0.37066,0.17121,0.1482,0.0027582,0.082887,0.083563,0.32029,0.18306,0.16511,0.0037146,0.031963,0.033833,0.41371,0.14592,0.12087,0.018494,0.058969,0.05953,0.37588,0.1718,0.14063,0.0037298,0.084607,0.082132,0.3277,0.1834,0.15149,-0.013171,0.00040956,0.00023716,0.052817,0.0059756,0.025556,-0.020633,0.0013857,0.00082347,0.057,0.0090599,0.034073,-0.027741,0.0028754,0.0017822,0.05835,0.012124,0.04199,-0.033846,0.42344,74,74,40,988,3,3,3,0.645
27,-0.0038303,0.018912,0.027381,-0.9862,0.0014986,-1.945,0.97225,-0.059192,3.0786,-0.028105,3.2953,8.3756e-06,0.44509,2.6923,0.027275,3.3896,0.0034517,0.98635,0.075941,0.036424,0.029567,0.024549,0.23462,0.34513,0.34916,0.035687,0.0064712,0.0047912,0.02413,0.35666,0.31347,0.014652,52.642,1706.3,2509.3,2719.9,6988.8,0.11655,0.083205,0.11655,1.0102,1.1835,0.37989,0.20669,0.021132,45,73.178,2407,1.2683e+05,6.2317,40.853,64989,6777,4887,0.92694,0.94069,0.27242,0.20171,0.16025,0.83139,67229,21054,0.00088018,0.00037929,0,0.044892,0,0.049544,0.0025383,0.017021,0.0023631,0.014329,0.69333,0.5915,0.62203,0.21458,0.41471,0.29404,0.23772,0.53998,0.201,0.26273,0.54444,0.17638,52.947,7.939,29065,61076,60449,0.060409,0.046619,0.024007,0.25771,0.21952,0.053165,0.51,0.4664,0.073735,0.69557,0.66966,0.079796,0.80921,0.80691,0.078974,0.0080793,0.0074891,0.079672,0.025246,0.069652,-0.021642,0.021152,0.021932,0.09834,0.04394,0.099326,0.015128,0.039129,0.042756,0.10785,0.061223,0.12753,0.047867,0.0024475,0.0031549,0.053958,0.0096914,0.050455,0.053659,0.0079063,0.011687,0.079484,0.022865,0.077307,0.12946,0.016695,0.025378,0.097849,0.037407,0.10456,0.1814,0.0043761,0.0033688,0.085914,0.019302,0.043625,-0.045981,0.0096206,0.0074614,0.093017,0.027847,0.056728,-0.057239,0.015814,0.012308,0.092906,0.034237,0.067484,-0.068428,0.0012557,0.0009654,0.24562,0.02807,0.028338,-0.033153,0.0039916,0.0030367,0.24905,0.039019,0.036566,-0.043988,0.0074575,0.005647,0.22954,0.046302,0.044993,-0.053336,0.36795,74,74,40,988,3,3,3,0.645
27,-0.0042846,0.021686,0.031173,-0.98427,0.0021717,-1.9336,0.96454,0.1054,3.2914,-0.047152,3.2774,5.5941e-05,0.69399,3.9183,0.031307,4.9752,0.0050561,0.98433,0.10595,0.056851,0.04242,0.033909,0.26067,0.26404,0.37637,0.043372,0.013526,0.0081534,0.033865,0.41767,0.19868,0.048797,29.486,312.06,753.05,1226.1,2321.3,0.056957,0.070046,0.070046,1.343,1.5759,0.52664,0.22149,0.023864,45,153.09,4239,4.2174e+05,5.7033,35.862,1.1445e+05,26622,19953,0.91539,0.92622,0.31129,0.24182,0.16246,0.74212,81963,32247,0.0013168,0.00054849,0,0.057638,0,0.044216,0.0035656,0.016872,0.0031915,0.018762,0.070637,0.61736,0.01132,0.20262,0.42075,0.30402,0.21504,0.48509,0.25823,0.20712,0.50683,0.25467,61.563,8.2087,15847,56659,55739,0.11247,0.089811,0.075561,0.3374,0.32831,0.11767,0.56118,0.59207,0.13717,0.73046,0.77351,0.14167,0.84614,0.88069,0.1396,0.008086,0.0063387,0.1348,0.033109,0.05315,-0.055138,0.016925,0.013968,0.13303,0.042932,0.070528,-0.057418,0.028315,0.024709,0.13193,0.052672,0.088518,-0.052075,0.0036877,0.0027225,0.13744,0.02323,0.034649,-0.047727,0.0084772,0.0066071,0.14408,0.032893,0.048873,-0.052387,0.014767,0.012175,0.14632,0.041795,0.063658,-0.051909,0.0043466,0.0035784,0.14426,0.025059,0.039812,-0.031461,0.008323,0.007256,0.13604,0.030123,0.050283,-0.028506,0.013305,0.01231,0.13215,0.035654,0.061021,-0.020507,5.1781e-05,3.7795e-05,0.017123,-0.0017814,0.0088408,-0.014214,0.00029301,0.00021361,0.030907,-0.00061149,0.012723,-0.019294,0.00092386,0.00068688,0.048073,0.00216,0.017351,-0.023703,0.39659,74,74,40,988,3,3,3,0.645
27,-0.0081394,0.039618,0.057427,-0.97083,0.0029862,-1.9161,0.97365,0.029177,3.5256,0.046994,3.2615,0.0002175,0.7202,2.9846,0.058109,3.9721,0.0040449,0.97091,0.10462,0.043241,0.032695,0.026792,0.17605,0.19909,0.52476,0.056297,0.010345,0.0058841,0.027578,0.26932,0.11333,0.22432,12.526,474.33,1217,1557.5,3261.9,0.12346,0.1444,0.1444,2.1719,3.4244,0.77783,0.31402,0.049282,57,55.947,1931,73642,6.1358,41.199,52137,20817,4050,0.92746,0.94274,0.23945,0.17819,0.11191,0.83377,23937,13618,0.0011896,0.00047311,0,0.081859,0,0.064379,0.01796,0.043615,0.026478,0.070216,0.66537,2.5121,2.364,0.2441,0.36244,0.30832,0.39379,0.35095,0.19564,0.39126,0.39346,0.16224,32.826,8.3247,29230,59295,58534,0.23697,0.25808,0.081693,0.53732,0.59465,0.096154,0.69339,0.75719,0.086962,0.76653,0.82067,0.076281,0.82866,0.8699,0.070152,0.072395,0.1149,0.61927,0.27734,0.3335,0.43085,0.13702,0.20692,0.55262,0.32556,0.38217,0.48353,0.20401,0.29608,0.48775,0.35493,0.41166,0.51707,0.038715,0.054983,0.74039,0.22774,0.23795,0.2219,0.074415,0.10357,0.64895,0.26443,0.27931,0.26238,0.11183,0.15391,0.56856,0.28725,0.30953,0.30059,0.031577,0.057918,0.53776,0.16566,0.23479,0.38785,0.060482,0.10464,0.50726,0.20277,0.27371,0.43332,0.091026,0.14899,0.46389,0.22754,0.29429,0.44723,0.0021024,0.0019994,0.35674,0.045358,0.040931,-0.0070226,0.0056891,0.0054944,0.30791,0.053144,0.051908,-0.0065808,0.010428,0.010277,0.27843,0.061945,0.064354,-0.0034696,0.40255,74,74,40,988,3,3,3,0.645
27,-0.0045251,0.021454,0.031241,-0.98424,0.0013944,-1.9463,0.97743,-0.066067,2.282,-0.00014568,3.3507,0.00058903,0.54536,3.0742,0.031407,3.8364,0.0039068,0.98428,0.046895,0.018017,0.012534,0.0095302,0.25258,0.34308,0.35879,0.027551,0.0054083,0.0029884,0.0095988,0.41533,0.33109,0.026408,82.753,2185.1,6019.1,15878,24166,0.1335,0.072813,0.1335,1.0121,1.5114,0.40361,0.22173,0.023728,41,95.341,1865,96209,4.6819,26.123,50355,14769,14256,0.9251,0.93943,0.26422,0.19854,0.15295,0.79652,55049,23337,0.00096715,0.00041621,0,0.048479,0,0.044026,0.0059555,0.013905,0.007565,0.010047,0.28391,1.0695,0.33877,0.2017,0.41365,0.30295,0.22509,0.51571,0.21972,0.22231,0.531,0.21458,46.299,8.1797,25919,60774,60007,0.070897,0.052371,0.02962,0.33154,0.31711,0.071902,0.61038,0.62876,0.092774,0.79785,0.82228,0.096223,0.89644,0.91508,0.091973,0.0027641,0.002186,0.028655,0.0027583,0.039897,-0.039105,0.0079541,0.0066295,0.038877,0.0093095,0.056214,-0.043306,0.01612,0.014377,0.046706,0.016938,0.072826,-0.036778,0.0022466,0.0017642,0.052068,0.0086053,0.03535,-0.03671,0.0064195,0.005332,0.067846,0.017461,0.050296,-0.039362,0.012594,0.011243,0.077602,0.026373,0.066007,-0.031748,0.00051729,0.00042156,0.010677,-0.0033115,0.019979,-0.014056,0.0015185,0.0012811,0.015435,-0.0025105,0.027074,-0.017883,0.003419,0.0030332,0.021117,-0.00045099,0.034088,-0.018332,2.4875e-07,2.5545e-07,5.1153e-05,-0.0026874,0.012895,0.00083208,2.4191e-05,2.4489e-05,0.0015867,-0.003423,0.016931,0.00056554,0.00021442,0.00021097,0.0069383,-0.0032824,0.021999,-0.0010904,0.3789,74,74,40,988,3,3,3,0.645
27,-0.0049999,0.023938,0.034885,-0.98238,0.001542,-1.9428,0.97765,-0.44729,2.8696,-0.1156,3.3112,4.7523e-05,0.58146,3.0971,0.035178,3.9369,0.0040091,0.98239,0.061695,0.025106,0.018636,0.015191,0.21558,0.30459,0.42043,0.034365,0.0063333,0.0034053,0.015295,0.31393,0.2541,0.074002,52.142,1655,4607.5,6474.8,12790,0.099716,0.059198,0.099716,1.1363,1.8324,0.45808,0.23464,0.024165,54,135.02,3460,2.3378e+05,6.1043,41.958,93420,17658,14310,0.92258,0.93657,0.29951,0.21658,0.21148,0.71164,72268,26972,0.0011695,0.00048409,0,0.069011,0,0.061779,0.0024709,0.015035,0.0077154,0.029732,0.023977,0.26277,0.31402,0.20591,0.42043,0.29643,0.22652,0.50753,0.22617,0.23537,0.51862,0.21327,50.821,8.0035,15447,45785,44516,0.092728,0.078842,0.068048,0.3069,0.30572,0.11691,0.54448,0.56074,0.14537,0.72193,0.74523,0.15294,0.83855,0.85911,0.15112,0.0047239,0.0038923,0.08602,0.015094,0.047757,-0.042646,0.010807,0.0091384,0.092784,0.022782,0.065058,-0.052273,0.020506,0.017627,0.10436,0.034332,0.083596,-0.062856,0.001756,0.0013856,0.071487,0.0071411,0.032448,-0.034782,0.0047503,0.0038598,0.088185,0.014343,0.046743,-0.044052,0.0097024,0.0080357,0.10501,0.023939,0.06195,-0.053545,0.0029247,0.0024759,0.10603,0.01485,0.034534,-0.027458,0.005838,0.0051152,0.10423,0.018793,0.043118,-0.029338,0.010178,0.0091071,0.11042,0.02533,0.052195,-0.032063,4.3164e-05,3.0905e-05,0.015591,-0.0021538,0.0081759,-0.011423,0.00021906,0.00016342,0.025239,-0.0017228,0.013316,-0.015584,0.00062573,0.00048457,0.035565,-0.0005329,0.01898,-0.020687,0.45141,74,74,40,988,3,3,3,0.645
27,-0.0039633,0.018783,0.027416,-0.98618,0.0011282,-1.9519,0.97921,0.32667,3.5082,0.023365,3.2658,0.00023469,0.60667,3.648,0.0276,4.8966,0.0049863,0.98619,0.048303,0.017394,0.012431,0.0096925,0.27409,0.31273,0.36673,0.029218,0.0048575,0.002701,0.0096779,0.42961,0.26505,0.024998,80.659,2855.2,7854.3,17256,28047,0.096844,0.091517,0.096844,1.0778,1.8792,0.43911,0.21492,0.018345,66,90.273,5165,4.0194e+05,7.9013,63.623,1.3946e+05,6507,3294,0.91702,0.9287,0.32963,0.25816,0.17935,0.8203,57505,24803,0.0013741,0.00048933,0,0.076615,0,0.059296,0.00096175,0.020791,1.9835e-05,0.024205,1.2049,1.7309,0.040332,0.22043,0.40289,0.29373,0.24803,0.47436,0.22529,0.26278,0.48545,0.20672,58.076,7.9308,24867,80482,79745,0.12676,0.11337,0.073661,0.29529,0.30992,0.089071,0.45772,0.50003,0.096764,0.5989,0.65027,0.10046,0.7166,0.76105,0.10226,0.0090922,0.0082554,0.1311,0.035905,0.061446,-0.023243,0.017881,0.016189,0.12156,0.042896,0.076839,-0.030027,0.027377,0.024858,0.11033,0.046648,0.089336,-0.034652,0.0063625,0.0064033,0.2051,0.042629,0.055882,0.0013765,0.012936,0.012882,0.19016,0.051817,0.069945,-0.0011576,0.020451,0.020256,0.17527,0.058486,0.082167,-0.0031404,0.0027202,0.0018463,0.078087,0.011708,0.032679,-0.042422,0.0048864,0.0032724,0.069081,0.01233,0.039326,-0.052066,0.0067707,0.0045059,0.058162,0.010861,0.043798,-0.05902,9.535e-06,5.7646e-06,0.0027271,-0.0029076,0.0064476,-0.0095899,5.8063e-05,3.5257e-05,0.0052971,-0.0036154,0.0096191,-0.0099905,0.00015653,9.6816e-05,0.0070447,-0.0043691,0.013287,-0.011981,0.42452,74,74,40,988,3,3,3,0.645
27,-0.0040935,0.023415,0.032406,-0.98365,0.0046993,-1.8932,0.92465,-0.16553,2.7304,-0.13252,3.3203,0.00012195,0.69707,3.927,0.031445,4.9415,0.0050218,0.98425,0.15798,0.088792,0.069382,0.056636,0.2426,0.29106,0.32606,0.056424,0.017141,0.011599,0.055113,0.37958,0.26118,0.010559,14.616,188.14,348.17,424.74,976.32,0.099159,0.094953,0.099159,1.2191,1.2419,0.42201,0.22199,0.023681,53,65.925,2327,1.0395e+05,6.5034,45.39,62829,12906,6183,0.92363,0.93775,0.27201,0.20983,0.12964,0.80401,52226,23529,0.00070591,0.00038116,0,0.10073,0,0.079894,0.0045469,0.00083026,0.004283,0.011838,0.54829,0.52775,0.31422,0.16884,0.41426,0.34381,0.12873,0.50388,0.34655,0.10843,0.51817,0.3597,61.944,9.283,31648,80670,80028,0.044953,0.029357,0.018998,0.16449,0.11973,0.036086,0.30548,0.23354,0.046968,0.44279,0.35229,0.05402,0.56723,0.47688,0.05887,0.010399,0.0095323,0.10905,0.03621,0.05741,-0.022153,0.021108,0.019994,0.10436,0.045222,0.07626,-0.018081,0.033979,0.032909,0.099593,0.052851,0.094008,-0.013279,0.0090428,0.0080839,0.21201,0.054135,0.062725,-0.025688,0.017129,0.015602,0.18313,0.061011,0.0772,-0.026733,0.025775,0.023904,0.16066,0.06534,0.089262,-0.025778,0.00032772,0.00021395,0.0068422,-0.0044733,0.015305,-0.013899,0.00051342,0.0003308,0.005279,-0.0064035,0.021449,-0.017886,0.0011373,0.00071547,0.0071055,-0.0070411,0.028317,-0.033171,0.0010281,0.0012345,0.21387,0.023227,0.030142,0.023806,0.0034964,0.0040803,0.23199,0.034809,0.041648,0.02723,0.0072578,0.0084068,0.23757,0.046372,0.054588,0.033159,0.37915,74,74,40,988,3,3,3,0.645
27,-0.0052039,0.025244,0.036586,-0.98152,0.0018953,-1.9373,0.97375,0.29849,2.8792,0.091379,3.3038,3.5317e-05,0.59315,3.0902,0.036768,4.0133,0.0040868,0.9816,0.070404,0.032069,0.026036,0.021713,0.21938,0.31124,0.40196,0.035567,0.005839,0.0042274,0.021782,0.35211,0.27576,0.0688,46.469,1844,2928.7,3045.7,7865.6,0.098619,0.075383,0.098619,1.4161,2.0871,0.46706,0.24347,0.028399,53,119.09,5067,4.8172e+05,6.9633,49.975,1.3681e+05,11367,7479,0.91316,0.9234,0.36015,0.28695,0.18773,0.82275,75884,32049,0.0012249,0.00049357,0,0.065464,0,0.055065,0.0043879,0.015103,0.0031068,0.015754,0.36551,0.3572,0.33964,0.17905,0.41275,0.32479,0.16837,0.46219,0.30817,0.15368,0.48972,0.31598,73.069,8.7694,26105,93558,92928,0.12393,0.092622,0.077547,0.30927,0.28017,0.10046,0.50041,0.49947,0.11392,0.68038,0.70451,0.1229,0.83591,0.869,0.12845,0.0078894,0.0085206,0.1225,0.030859,0.054117,0.019463,0.016667,0.018087,0.12201,0.04052,0.070164,0.026997,0.027676,0.030096,0.1201,0.049199,0.084946,0.034287,0.0046529,0.0057585,0.16151,0.030293,0.051128,0.043693,0.0095008,0.011797,0.15039,0.036784,0.062521,0.056671,0.015243,0.018835,0.14067,0.042,0.072294,0.067301,0.0032158,0.0027504,0.099406,0.015817,0.026903,-0.022753,0.0070754,0.0062383,0.10771,0.023144,0.036895,-0.024709,0.012158,0.011096,0.11246,0.030314,0.047117,-0.02269,2.0708e-05,1.1668e-05,0.0063779,-0.0026761,0.0063374,-0.011253,9.1153e-05,5.1565e-05,0.0089549,-0.0033103,0.0091168,-0.012708,0.00027531,0.00016486,0.013343,-0.0035144,0.012085,-0.018464,0.39047,74,74,40,988,3,3,3,0.645
27,-0.0052147,0.025057,0.036545,-0.98154,0.0015373,-1.9422,0.97874,0.20232,3.4413,0.0077633,3.2717,0.0001077,0.8409,4.3867,0.036672,6.1973,0.0063109,0.98164,0.055383,0.025796,0.021142,0.017689,0.17856,0.35469,0.41212,0.028452,0.0046253,0.0034591,0.018096,0.23154,0.33679,0.07344,78.364,3064.7,4506.7,4564.1,12215,0.12187,0.098818,0.12187,0.61306,0.77237,0.32204,0.2536,0.031114,34,157.65,4909,7.0305e+05,5.5521,31.896,1.3254e+05,4860,3834,0.91477,0.92686,0.33144,0.25103,0.14029,0.93319,48594,26463,0.001054,0.0004536,0,0.060471,0,0.061081,0.00010907,0.0027571,0.004791,0.010931,0.22512,1.739,1.0522,0.203,0.39688,0.32804,0.21438,0.45286,0.31228,0.23079,0.46434,0.28806,83.357,8.8572,20040,48788,47941,0.062973,0.056728,0.031606,0.21387,0.21655,0.05572,0.38868,0.40651,0.070971,0.54646,0.57236,0.079172,0.67739,0.70602,0.083491,0.0047552,0.0047386,0.059221,0.012553,0.04257,-0.00098122,0.010415,0.010558,0.061152,0.017553,0.057789,0.0051206,0.017637,0.018183,0.061391,0.02193,0.072786,0.014246,0.0047552,0.0047386,0.1324,0.027786,0.05435,-0.00098122,0.010412,0.010556,0.1322,0.03687,0.071171,0.0051566,0.017566,0.018139,0.13003,0.044959,0.087522,0.014951,0,0,0,-0.0070417,0.0087403,0,5.0236e-08,3.1947e-08,6.1342e-07,-0.0091566,0.012139,-0.013996,3.9556e-05,2.4325e-05,0.00029349,-0.011151,0.015388,-0.02387,0,0,0,-0.0029591,0.003724,0,2.6725e-06,1.6844e-06,0.00021059,-0.0040193,0.0071821,-0.014215,3.2157e-05,2.0316e-05,0.00125,-0.0050097,0.011353,-0.014497,0.33413,74,74,40,988,3,3,3,0.645
27,-0.0049947,0.024551,0.035413,-0.98212,0.0021202,-1.9344,0.9696,1.0741,5.6842,0.12094,3.2074,0.0011182,0.87902,4.667,0.035403,6.7238,0.0068471,0.98228,0.087098,0.036535,0.02896,0.024157,0.25223,0.28929,0.37742,0.045401,0.0071852,0.0046115,0.023865,0.42736,0.26708,0.065297,22.533,1104.6,2281.4,2286.5,5695.7,0.089378,0.077003,0.089378,0.51867,0.66244,0.206,0.2502,0.032165,58,96.534,2654,1.6099e+05,5.2103,31.031,71658,37989,22869,0.92569,0.94125,0.38203,0.27325,0.2715,0.93447,45382,26616,0.000873,0.00037645,0,0.048692,0,0.058251,0.0015301,0.0042937,0.0033314,0.021268,0.71374,1.6707,0.63423,0.18947,0.41911,0.3181,0.19005,0.52704,0.25958,0.19019,0.54503,0.2454,57.636,8.5887,12362,28371,26862,0.072775,0.064554,0.040674,0.22296,0.22248,0.064685,0.36959,0.38221,0.075149,0.50541,0.52654,0.081541,0.63288,0.65334,0.086862,0.0060827,0.0052097,0.084356,0.019978,0.054602,-0.04676,0.012252,0.010897,0.080112,0.024334,0.072126,-0.045292,0.019309,0.017533,0.074841,0.027046,0.087566,-0.045272,0.0054676,0.0047263,0.16952,0.03487,0.056316,-0.041749,0.010984,0.0099124,0.1553,0.041646,0.072504,-0.037688,0.016953,0.015708,0.13974,0.045433,0.086304,-0.033575,0.00061036,0.00048007,0.016852,-0.0031976,0.022302,-0.02251,0.0012623,0.00097793,0.017164,-0.0040558,0.030095,-0.03002,0.002251,0.0017299,0.018598,-0.0044159,0.036905,-0.039985,4.7407e-06,3.3324e-06,0.0013041,-0.0029894,0.0088307,-0.013294,7.2674e-05,5.4686e-05,0.0063768,-0.0033578,0.013883,-0.01876,0.00046068,0.0003578,0.019941,-0.0018064,0.020723,-0.028286,0.38572,74,74,40,988,3,3,3,0.645
27,-0.003528,0.016652,0.024367,-0.98773,0.00090409,-1.957,0.98127,0.028419,2.7397,0.016597,3.3203,4.5176e-05,0.53016,3.3872,0.024448,4.3191,0.0043983,0.98776,0.047727,0.015403,0.010393,0.0075633,0.31392,0.29963,0.33808,0.032267,0.005186,0.0029519,0.0079717,0.47041,0.21442,0.0054076,67.719,2727.6,7083.7,26658,36538,0.1892,0.091977,0.1892,0.76722,1.1296,0.47635,0.1953,0.018358,58,52.741,1978,68026,6.924,50.963,53406,9288,5130,0.92839,0.94586,0.15416,0.10824,0.090995,0.70691,52665,22383,0.00068106,0.00033918,0,0.057719,0,0.054361,0.0072881,0.0067559,0.0087786,0.003835,0.86068,0.50124,0.081043,0.17828,0.42474,0.32153,0.15788,0.55921,0.26211,0.15764,0.58444,0.24147,49.655,8.6813,19840,39406,38297,0.04018,0.030838,0.01468,0.17088,0.14206,0.03241,0.3368,0.28599,0.044769,0.47979,0.41465,0.050605,0.61144,0.5409,0.054862,0.0065084,0.0051517,0.059006,0.017799,0.052182,-0.060812,0.014139,0.011531,0.060438,0.024348,0.068727,-0.069603,0.023088,0.019123,0.058502,0.028789,0.083409,-0.077174,0.0058697,0.0046761,0.11897,0.030544,0.053298,-0.058776,0.013395,0.010977,0.12381,0.042577,0.071747,-0.067039,0.022103,0.018397,0.1191,0.05062,0.087705,-0.073689,0.00063857,0.00047556,0.011526,-0.0024141,0.022125,-0.017564,0.00076677,0.00056956,0.0068159,-0.0050373,0.027159,-0.019127,0.0010638,0.0007789,0.005746,-0.0067336,0.031896,-0.025679,1.6161e-07,1.1056e-07,2.9063e-05,-0.0025117,0.0070183,-0.012539,8.3694e-06,5.7255e-06,0.0004801,-0.0033584,0.008587,-0.012539,5.6681e-05,3.8775e-05,0.001604,-0.004098,0.011016,-0.012539,0.37249,74,74,40,988,3,3,3,0.645
27,-0.0040894,0.019271,0.028258,-0.98576,0.00093942,-1.955,0.98324,0.020973,2.5047,-0.00058381,3.3335,0.00025697,0.50562,2.9961,0.028422,3.8234,0.0038934,0.98577,0.038055,0.01179,0.0087288,0.0069623,0.2804,0.28168,0.40092,0.025235,0.0030263,0.0017549,0.006977,0.41934,0.20576,0.04422,117.75,8279.9,20421,34691,63510,0.091869,0.072626,0.091869,1.4798,1.5227,0.41199,0.21221,0.022211,60,79.85,1981,87312,5.1379,30.907,53487,28620,14094,0.92077,0.93607,0.29056,0.22227,0.14355,0.85552,50823,23777,0.00097474,0.00041078,0,0.050161,0,0.049398,0.0057071,0.014019,0.008468,0.012081,0.35438,0.85563,0.86691,0.21027,0.40718,0.29862,0.24752,0.46317,0.23743,0.25073,0.48393,0.22295,44.37,8.0627,14856,41684,40234,0.10216,0.08977,0.049827,0.31179,0.2976,0.07894,0.52496,0.5213,0.093151,0.68467,0.69657,0.096398,0.81763,0.83674,0.097932,0.0020387,0.0016686,0.024674,-0.00043285,0.031358,-0.026997,0.0058526,0.005326,0.033395,0.0039126,0.044037,-0.0201,0.01244,0.012125,0.042079,0.010395,0.058505,-0.0076954,0.0011827,0.0010394,0.032001,0.0016544,0.025503,-0.015153,0.003801,0.0037572,0.046897,0.0074701,0.037566,-0.0021452,0.008074,0.0086414,0.058079,0.014226,0.050417,0.017254,0.00085589,0.00062916,0.020623,-0.0013893,0.018743,-0.0228,0.0020447,0.0015642,0.024263,-0.00053281,0.023922,-0.028994,0.004313,0.0034489,0.031098,0.0022894,0.030666,-0.035053,1.0767e-07,6.904e-08,2.5847e-05,-0.002913,0.0060083,-0.01023,6.9971e-06,4.4891e-06,0.0005358,-0.0039094,0.0094482,-0.010282,5.3129e-05,3.479e-05,0.002007,-0.0047774,0.013246,-0.012583,0.42437,74,74,40,988,3,3,3,0.645
27,-0.0041683,0.02232,0.03137,-0.98417,0.0033815,-1.9138,0.94457,0.16683,2.8749,0.05552,3.3088,6.3407e-06,0.69032,3.929,0.030808,5.0987,0.0051816,0.98457,0.11787,0.068537,0.052377,0.042398,0.25407,0.28173,0.35661,0.042141,0.014663,0.0092823,0.041501,0.4305,0.25275,0.040617,29.885,250.42,531.15,753.03,1565.2,0.080745,0.088446,0.088446,0.88542,1.4684,0.32261,0.21953,0.023508,68,64.029,1020,32141,3.6144,16.708,27540,22464,13527,0.92589,0.94266,0.13793,0.096156,0.056541,0.61607,45151,22839,0.0010213,0.0003989,0,0.04464,0,0.046859,0.0036972,0.0079474,0.007012,0.01577,0.69845,0.29763,0.13141,0.1888,0.4139,0.32024,0.18693,0.4966,0.28353,0.18148,0.50903,0.28167,46.794,8.6465,11458,27236,25691,0.07725,0.067034,0.039292,0.26061,0.25213,0.068809,0.43514,0.4281,0.080522,0.58947,0.58119,0.086551,0.70662,0.69252,0.088262,0.002482,0.0019589,0.031325,0.0016923,0.043514,-0.038852,0.005199,0.0040773,0.030937,0.0020386,0.056598,-0.054294,0.0094313,0.0076249,0.033269,0.0039872,0.069222,-0.062215,0.0020368,0.0016262,0.057471,0.0079749,0.042302,-0.03152,0.0034257,0.0027065,0.044078,0.0059589,0.052202,-0.03936,0.0048256,0.0037855,0.036199,0.004018,0.060365,-0.045803,0.00032253,0.00024237,0.0081043,-0.0049532,0.018332,-0.025279,0.00099935,0.00075246,0.012366,-0.0049796,0.023839,-0.030686,0.0020756,0.0015827,0.015607,-0.0047636,0.029135,-0.03641,0.00012264,9.0309e-05,0.030704,0.00042255,0.014419,-0.024304,0.00077781,0.00062131,0.062113,0.0053433,0.021979,-0.028549,0.0025977,0.0023084,0.10233,0.014851,0.033256,-0.023442,0.40228,74,74,40,988,3,3,3,0.645
27,-0.0061124,0.030031,0.04337,-0.97805,0.0025302,-1.9271,0.97039,-0.11467,3.9672,0.012016,3.1845,0.0010733,0.7789,3.7197,0.043759,5.1655,0.0052601,0.9781,0.096143,0.046664,0.035164,0.027993,0.21811,0.26575,0.42643,0.044114,0.010858,0.0068935,0.027855,0.37888,0.23372,0.12522,25.349,458.52,962,1654.5,3101.2,0.14024,0.062089,0.14024,1.116,2.7184,0.55831,0.28065,0.030932,41,105.51,3954,3.773e+05,6.153,38.916,1.0676e+05,2727,2538,0.92133,0.93483,0.29189,0.22091,0.12108,0.88616,64153,23343,0.0008967,0.00044827,0,0.057428,0,0.073494,4.1197e-05,0.019042,0.0048022,0.017839,0.86948,0.0062287,0.25049,0.17969,0.37737,0.36067,0.13313,0.4,0.43253,0.11379,0.40025,0.46163,66.121,9.7381,23800,55494,54619,0.05743,0.039435,0.024698,0.22269,0.18308,0.049713,0.37912,0.34567,0.059315,0.51225,0.48828,0.063592,0.63293,0.62037,0.066843,0.019003,0.02111,0.20279,0.074556,0.1068,0.052604,0.037651,0.043229,0.18943,0.091129,0.13852,0.090475,0.059902,0.070096,0.17866,0.10577,0.16674,0.12813,0.015378,0.018307,0.36688,0.097394,0.11625,0.079885,0.02909,0.035954,0.31647,0.11051,0.14241,0.12396,0.044312,0.056111,0.28105,0.12099,0.16557,0.1681,0.0022103,0.0013695,0.046957,0.0069307,0.033335,-0.057865,0.0040908,0.0026115,0.042801,0.007466,0.043447,-0.070656,0.0065442,0.0043086,0.041605,0.0086455,0.051841,-0.082873,0.0014147,0.0014335,0.29945,0.033273,0.037383,0.0023092,0.0044893,0.0046757,0.30311,0.046157,0.052341,0.0096248,0.0091544,0.0097492,0.30492,0.060283,0.06926,0.019826,0.35634,74,74,40,988,3,3,3,0.645
27,-0.004131,0.020006,0.02909,-0.98533,0.0013717,-1.9472,0.97614,-0.0275,2.9465,-0.093463,3.2934,1.9689e-06,0.58249,3.4156,0.029024,4.355,0.0044349,0.98547,0.062583,0.029028,0.023058,0.019042,0.24641,0.32182,0.37204,0.03112,0.0057507,0.0039067,0.018949,0.37321,0.27596,0.029555,67.119,2102.4,3701,4347.3,10218,0.17481,0.061002,0.17481,1.3904,1.8229,0.41771,0.21311,0.023601,48,91.979,2854,1.7163e+05,6.2153,41.499,77058,11394,9207,0.92658,0.94079,0.34022,0.23946,0.24057,0.87905,44191,25032,0.00095724,0.00041752,0,0.039005,0,0.043695,0.0030083,0.012901,0.0085017,0.034713,0.45801,0.84019,0.013788,0.19011,0.41439,0.31524,0.18709,0.52399,0.25129,0.1776,0.54158,0.24981,45.25,8.5114,9987.8,20298,18714,0.067059,0.055126,0.03247,0.30926,0.28787,0.07773,0.58284,0.57701,0.10267,0.77671,0.7801,0.10856,0.87302,0.8747,0.10381,0.00082401,0.00077245,0.0099002,-0.006135,0.03114,-0.011865,0.0028328,0.0026731,0.016047,-0.0049283,0.044089,-0.014148,0.0061493,0.0057442,0.020649,-0.0031684,0.057806,-0.02124,0.00066502,0.0006568,0.017863,-0.0020661,0.024678,-0.0023481,0.0024523,0.0023906,0.030038,0.0015766,0.036978,-0.0060206,0.0054552,0.0052222,0.038956,0.0059052,0.049945,-0.013063,0.00015899,0.00011565,0.0038031,-0.005886,0.017338,-0.016819,0.00038047,0.00028251,0.0044819,-0.0074156,0.022936,-0.020737,0.00069411,0.00052207,0.0049685,-0.0089209,0.028104,-0.025309,0,0,0,-0.0029051,0.013743,0,0,0,0,-0.0039774,0.018796,0,0,0,0,-0.0051613,0.024887,0,0.39397,74,74,40,988,3,3,3,0.645
27,-0.0016333,0.010117,0.01362,-0.99316,0.0027396,-1.8808,0.89379,-0.071456,2.9775,0.072148,3.2384,2.4298e-05,0.43384,3.8746,0.012513,5.3583,0.0054565,0.99373,0.12385,0.08408,0.069377,0.058335,0.41103,0.24001,0.23359,0.034172,0.013278,0.010214,0.057704,0.54626,0.072863,0.23942,73.418,476.36,662.34,578.81,1791.8,0.12722,0.12734,0.12734,1.0851,2.5468,0.4859,0.14445,0.0084082,46,93.283,3009,2.0762e+05,5.8903,37.423,81243,23868,3753,0.92437,0.93913,0.2193,0.1594,0.1343,0.6983,25723,15722,0.0013647,0.00062299,0,0.1084,0,0.087498,0.00091947,0.028802,0.0099822,0.056212,1.974,2.0233,0.16913,0.21955,0.33584,0.30821,0.28641,0.29749,0.20552,0.27846,0.30746,0.20441,32.873,8.3218,18914,41989,40721,0.32082,0.31206,0.14249,0.65934,0.67621,0.15201,0.79623,0.82547,0.12865,0.87186,0.89842,0.11178,0.9337,0.94978,0.10183,0.011634,0.0090598,0.12821,0.04269,0.070442,-0.083301,0.025584,0.020144,0.13293,0.058903,0.09448,-0.10373,0.041442,0.032892,0.12764,0.069559,0.11428,-0.11965,0.0055115,0.0042938,0.13579,0.031289,0.049503,-0.056851,0.012008,0.0095035,0.13491,0.041271,0.066955,-0.068934,0.019599,0.015692,0.12838,0.048367,0.081543,-0.079065,0.0061163,0.0047622,0.13419,0.031186,0.049208,-0.060192,0.013674,0.010714,0.14775,0.045518,0.066298,-0.076821,0.022299,0.017547,0.14641,0.055444,0.0807,-0.089397,5.8587e-06,3.8069e-06,0.0012807,-0.0026277,0.01311,-0.013969,6.9327e-05,4.5197e-05,0.0048341,-0.0030217,0.017455,-0.01691,0.00027571,0.00018159,0.0094841,-0.0029433,0.022404,-0.021679,0.38694,74,74,40,988,3,3,3,0.645
27,-0.0052898,0.025779,0.037299,-0.98115,0.002003,-1.9356,0.97278,-0.015091,2.9868,-0.016428,3.283,2.5976e-06,0.67149,3.4691,0.037391,4.5514,0.0046348,0.98128,0.065645,0.031841,0.025839,0.021639,0.21037,0.29074,0.43571,0.03153,0.0058152,0.00411,0.021722,0.32804,0.2525,0.11496,58.04,1828.3,2986.4,2962.7,7836.1,0.1207,0.068691,0.1207,0.87198,1.2688,0.40143,0.25355,0.035605,63,100.32,3697,2.2461e+05,7.04,53.439,99819,15336,14526,0.92503,0.94293,0.15462,0.1032,0.099575,0.53727,40527,23351,0.0009607,0.00044059,0,0.040795,0,0.045211,0.0029468,0.0071486,0.003705,0.00078458,0.48375,1.4364,0.32326,0.20439,0.39801,0.29667,0.22659,0.46669,0.21188,0.22913,0.47474,0.20752,34.945,8.0102,6916.5,16632,14354,0.13925,0.12861,0.089896,0.34698,0.337,0.11628,0.54468,0.54217,0.12793,0.72231,0.721,0.13461,0.84805,0.8508,0.13445,0.006047,0.0054313,0.09687,0.021328,0.059238,-0.045458,0.014899,0.013603,0.11253,0.035187,0.083245,-0.052996,0.026881,0.024796,0.12036,0.04802,0.10472,-0.059252,0.0030007,0.0027818,0.10747,0.017039,0.03963,-0.023952,0.0076816,0.007183,0.12545,0.028207,0.056524,-0.028512,0.01399,0.013027,0.1332,0.038097,0.072202,-0.03771,0.0025743,0.0022779,0.082101,0.011269,0.039421,-0.032242,0.0062465,0.0056332,0.098112,0.019544,0.054757,-0.038478,0.011492,0.010584,0.10968,0.028417,0.068673,-0.039605,0.00047205,0.00037161,0.15,0.011438,0.026764,-0.026744,0.0012142,0.00098643,0.12306,0.01202,0.033773,-0.032006,0.0022635,0.0019198,0.11318,0.013865,0.040976,-0.032869,0.46776,74,74,40,988,3,3,3,0.645
27,-0.0081395,0.03868,0.057042,-0.97103,0.001453,-1.9296,0.98718,-0.15803,3.2504,0.0091378,3.274,1.9856e-05,0.70837,2.9456,0.057716,3.6313,0.0036979,0.97111,0.066416,0.028503,0.022839,0.019354,0.15878,0.1725,0.60593,0.034846,0.0054279,0.003369,0.01914,0.14485,0.013232,0.23631,56.275,2362,5397.7,4443.1,12260,0.06767,0.11937,0.11937,1.2794,1.7669,0.43153,0.30816,0.046903,24,257.29,5931,1.4554e+06,4.5842,22.025,1.6014e+05,2403,2349,0.91579,0.92472,0.38466,0.29584,0.20037,0.9452,44161,27793,0.00058142,0.00037203,0,0.078304,0,0.081239,0.0039891,0.0012691,0.0036496,0.00027346,2.7194,3.6683,0.97706,0.13376,0.2676,0.54019,0.050717,0.1022,0.84322,0.048526,0.081572,0.86737,63.35,14.585,18675,51038,49858,0.0084785,0.0057096,0.0047496,0.026823,0.017704,0.0077999,0.055033,0.035984,0.011216,0.10174,0.068348,0.016453,0.20672,0.15102,0.028438,0.001496,0.0009464,0.020795,-0.0032116,0.037772,-0.047699,0.0027898,0.0017782,0.018283,-0.0054475,0.048732,-0.058903,0.0045157,0.0029028,0.017544,-0.0072006,0.058125,-0.073927,0.00095316,0.00061282,0.029621,1.2433e-06,0.030999,-0.034809,0.0014292,0.00092412,0.020254,-0.003097,0.037995,-0.038283,0.0018523,0.0012036,0.015304,-0.0058944,0.043423,-0.043306,0.00028008,0.00017147,0.007751,-0.0055011,0.019677,-0.027733,0.00085409,0.0005346,0.01164,-0.0058809,0.026825,-0.037583,0.0018583,0.0011877,0.015389,-0.0057313,0.033827,-0.052125,0.00026274,0.00016211,0.072446,0.0045284,0.018324,-0.031081,0.00077335,0.00048224,0.068016,0.0055587,0.022703,-0.036502,0.0013309,0.00083529,0.057743,0.0052835,0.027021,-0.041055,0.35894,74,74,40,988,3,3,3,0.645
27,-0.0061113,0.028816,0.042124,-0.97869,0.001608,-1.9385,0.98073,0.02207,3.8314,0.076502,3.2344,0.00050677,0.65155,3.1575,0.042495,4.1919,0.0042687,0.97873,0.050775,0.014869,0.010742,0.008177,0.19381,0.29229,0.46394,0.034811,0.0041595,0.0026023,0.0083853,0.28264,0.25511,0.14367,48.566,3604.4,7578.8,20231,31463,0.062229,0.068203,0.068203,1.153,1.3927,0.44193,0.25814,0.032436,45,141.16,4299,4.3324e+05,5.794,36.547,1.1607e+05,29268,18414,0.92651,0.94046,0.40433,0.28833,0.29885,0.90574,41735,24208,0.00078061,0.00038972,0,0.04361,0,0.0475,0.0029253,0.0022865,0.0031824,0.014151,0.99159,0.30387,0.83603,0.18173,0.38925,0.3603,0.1551,0.45063,0.37613,0.16295,0.46751,0.35461,59.493,9.728,17831,41570,39908,0.042515,0.036875,0.026511,0.14236,0.13304,0.046082,0.28431,0.28532,0.064499,0.44246,0.45661,0.079646,0.59258,0.60919,0.090743,0.0091796,0.0088447,0.14204,0.037705,0.069105,-0.01443,0.018375,0.01823,0.13405,0.046134,0.089592,-0.0041054,0.029832,0.030156,0.12901,0.054393,0.10833,0.006913,0.0053874,0.0056134,0.18636,0.036242,0.060661,0.01348,0.011737,0.012583,0.18515,0.0478,0.080675,0.03051,0.019574,0.021435,0.18002,0.057502,0.099669,0.049123,0.00265,0.0022253,0.081633,0.011625,0.033296,-0.031324,0.0046433,0.0038809,0.070443,0.011641,0.041132,-0.040765,0.0072615,0.006105,0.06694,0.012995,0.047484,-0.049279,0.0011423,0.001006,0.3506,0.031885,0.029964,-0.019778,0.0030302,0.0026485,0.29666,0.036241,0.037403,-0.027588,0.0054635,0.0047413,0.26387,0.041181,0.046033,-0.03597,0.40084,74,74,40,988,3,3,3,0.645
27,-0.0042845,0.021136,0.030467,-0.98463,0.0018415,-1.939,0.96931,0.28954,2.744,0.025749,3.3124,0.00018345,0.51702,2.9605,0.030438,3.7897,0.0038592,0.98476,0.074556,0.036538,0.029809,0.025368,0.26885,0.28784,0.37071,0.035713,0.006596,0.0044011,0.025886,0.41399,0.22218,0.033525,48.87,1547.8,2874.4,2271.5,6743.2,0.065093,0.087109,0.087109,0.68545,1.751,0.36471,0.21932,0.022431,48,76.062,1119,49996,3.6652,16.134,30213,27405,9585,0.92573,0.93984,0.22738,0.16344,0.12231,0.78308,43689,20334,0.0011358,0.00037951,0,0.054734,0,0.076174,0.00077412,0.0075567,0.001304,0.037253,0.24285,1.0258,0.4104,0.21118,0.39714,0.30783,0.24535,0.49889,0.22741,0.25717,0.50656,0.21146,45.156,8.3115,17205,33919,32919,0.11249,0.10861,0.043869,0.345,0.3606,0.06984,0.55912,0.58053,0.079328,0.7376,0.75986,0.083036,0.86138,0.88068,0.082494,0.0036563,0.0030188,0.035382,0.0064132,0.047476,-0.042355,0.007912,0.0063875,0.036097,0.0088775,0.06177,-0.059129,0.012743,0.010195,0.034466,0.0098546,0.074508,-0.073223,0.0030656,0.0025966,0.066322,0.013568,0.04329,-0.033111,0.0062214,0.0051722,0.061377,0.016086,0.054983,-0.044525,0.0094763,0.0078335,0.054504,0.01665,0.06502,-0.053468,0.00059066,0.00042221,0.011379,-0.0027728,0.024811,-0.032834,0.0016906,0.0012153,0.01604,-0.0017866,0.032365,-0.044897,0.0032672,0.0023613,0.018836,-0.00085605,0.039258,-0.054611,0,0,0,-0.0026005,0.0063897,0,0,0,0,-0.0035605,0.0091164,0,0,0,0,-0.0046203,0.012513,0,0.3871,74,74,40,988,3,3,3,0.645
27,-0.0035189,0.018221,0.025773,-0.98702,0.0024666,-1.9256,0.95094,-0.36431,4.948,-0.015571,3.1535,0.0022765,0.69188,4.3626,0.025102,6.0388,0.0061369,0.98743,0.11234,0.056985,0.043155,0.034165,0.34323,0.21704,0.33178,0.050323,0.013407,0.0089083,0.035313,0.51091,0.078342,0.0012112,24.299,390.13,758.13,1303.5,2476.6,0.12156,0.14835,0.14835,0.57638,0.8136,0.2841,0.20678,0.015813,62,42.339,2262,81718,7.6305,59.484,61074,3348,2376,0.92951,0.94843,0.1494,0.095717,0.082496,0.75516,18361,14192,0.0006587,0.00033498,0,0.046429,0,0.079139,0.0048147,0.020344,0.028125,0.0036867,1.7421,1.7375,0.063849,0.18427,0.33543,0.38643,0.14839,0.28862,0.49142,0.14797,0.28771,0.49405,28.953,10.434,9030.7,13212,10334,0.15188,0.14958,0.045078,0.27088,0.26782,0.041734,0.34798,0.34448,0.037575,0.42392,0.41809,0.036321,0.51237,0.50451,0.037345,0.011085,0.010847,0.081637,0.032752,0.074902,-0.016912,0.020836,0.0206,0.072348,0.03715,0.093234,-0.011271,0.031581,0.031436,0.065007,0.040124,0.10972,-0.0054271,0.0050359,0.0047888,0.082917,0.022819,0.052424,-0.025631,0.0088852,0.0084331,0.066712,0.023023,0.063199,-0.032219,0.012385,0.011837,0.054213,0.021641,0.072329,-0.031785,0.0048613,0.0048623,0.07128,0.019078,0.048813,9.6092e-05,0.0086293,0.008739,0.062311,0.020806,0.060602,0.0080054,0.013128,0.013284,0.057602,0.023031,0.071356,0.008999,0.0011875,0.001196,0.17347,0.022755,0.029439,0.0026291,0.0036142,0.0036802,0.16842,0.030156,0.039538,0.0084125,0.0071687,0.0073398,0.16479,0.038205,0.052112,0.01411,0.40332,74,74,40,988,3,3,3,0.645
27,-0.0031164,0.015628,0.022372,-0.98874,0.0015893,-1.9417,0.96383,-0.47576,3.7521,-0.050395,3.2309,0.00045317,0.6767,4.5579,0.021999,6.9002,0.0070266,0.98899,0.065088,0.038793,0.032075,0.027032,0.33524,0.2792,0.32297,0.02434,0.0064175,0.0048728,0.026956,0.50469,0.20173,0.0032884,119.71,1673.2,2405.2,2199.4,6398.2,0.16416,0.089062,0.16416,1.6652,3.1211,0.57849,0.18651,0.01694,65,61.815,2843,1.2542e+05,7.5588,59.514,76761,12042,4212,0.92597,0.93725,0.10207,0.076372,0.084575,0.42476,32093,16651,0.00088507,0.00041426,0,0.060386,0,0.064309,0.0051479,0.014264,0.0041295,0.014331,0.94336,1.6884,0.53732,0.21729,0.34185,0.27667,0.2713,0.31907,0.15467,0.26725,0.28949,0.13323,22.403,7.47,21895,51868,51200,0.36084,0.40329,0.15069,0.61787,0.65748,0.13394,0.74421,0.77351,0.11307,0.85649,0.8826,0.10325,0.933,0.94976,0.095684,0.0061304,0.0054669,0.063527,0.017411,0.047243,-0.022478,0.012217,0.010971,0.05969,0.020859,0.059726,-0.027999,0.019945,0.017731,0.057767,0.024559,0.072146,-0.037078,0.00020721,0.00014575,0.0048005,-0.0049602,0.017418,-0.014425,0.00067479,0.00050515,0.0071287,-0.0057057,0.02346,-0.018524,0.0015739,0.0012445,0.0096938,-0.0058845,0.030585,-0.021977,0.0059172,0.0053171,0.12208,0.029027,0.047317,-0.02109,0.012045,0.01086,0.12238,0.037861,0.060486,-0.026833,0.019488,0.017427,0.12031,0.045657,0.072156,-0.034712,6e-06,4.0563e-06,0.0012333,-0.0025427,0.0083538,-0.0098865,7.3167e-05,5.1235e-05,0.0047973,-0.002886,0.012093,-0.012963,0.00032177,0.0002356,0.010408,-0.0025292,0.016439,-0.016284,0.44447,74,74,40,988,3,3,3,0.645
27,-0.0036091,0.01881,0.026651,-0.98657,0.0024416,-1.9269,0.95309,0.36508,3.5121,0.057223,3.2806,6.8444e-05,0.54004,3.3154,0.026479,4.2588,0.0043369,0.98674,0.11525,0.060701,0.047744,0.039191,0.27883,0.27022,0.34487,0.047336,0.011968,0.0080639,0.038715,0.43473,0.19877,0.011272,27.888,452.79,840.26,1021.6,2343.2,0.053759,0.17618,0.17618,0.35268,1.0435,0.23636,0.20507,0.020681,54,69,2348,1.0409e+05,6.5677,46.316,63396,11826,8316,0.92785,0.94474,0.21803,0.149,0.15671,0.73862,33535,18528,0.0010274,0.00047105,0,0.046711,0,0.052417,0.00042032,0.00024435,0.0025861,0.015284,1.5763,1.3522,0.51953,0.21931,0.36906,0.28772,0.28921,0.38221,0.14868,0.29316,0.3777,0.13738,33.342,7.7683,12048,23572,22071,0.25739,0.26237,0.10898,0.56455,0.5826,0.12408,0.75056,0.76908,0.11561,0.8662,0.87852,0.10587,0.92148,0.93283,0.095812,0.0037228,0.0030565,0.039113,0.00698,0.052339,-0.05017,0.0085243,0.0070969,0.042224,0.010929,0.070125,-0.063267,0.014666,0.012363,0.043065,0.014136,0.086814,-0.072415,0.001436,0.0011485,0.033729,0.0032352,0.036197,-0.033116,0.0028082,0.0022476,0.030078,0.002917,0.04523,-0.040331,0.0040389,0.003221,0.025221,0.0013389,0.054525,-0.04599,0.0022385,0.0018731,0.046822,0.0070461,0.036346,-0.036411,0.0055247,0.0047073,0.056909,0.012945,0.050426,-0.04633,0.010077,0.0087176,0.063076,0.018787,0.063058,-0.052208,4.833e-05,3.4866e-05,0.010072,-0.0014918,0.012845,-0.013722,0.00020315,0.00015182,0.013504,-0.0014731,0.019531,-0.01864,0.00069608,0.00054425,0.022826,9.5245e-05,0.027436,-0.029263,0.42094,74,74,40,988,3,3,3,0.645
27,-0.0034702,0.020066,0.02757,-0.9861,0.0042882,-1.8923,0.91895,-0.30506,3.852,-0.1105,3.197,0.00074824,0.55747,3.4896,0.02547,4.7887,0.0048765,0.98724,0.13332,0.08703,0.071548,0.060236,0.24791,0.31898,0.31147,0.038856,0.013744,0.010295,0.058746,0.39031,0.29643,0.0036432,38.471,310.96,465.69,390.85,1206.7,0.10399,0.14162,0.14162,0.47969,1.3465,0.27629,0.20497,0.014471,59,56.729,2883,1.3947e+05,7.4461,56.637,77841,2727,2430,0.9303,0.9487,0.2384,0.15734,0.21969,4.3272,25790,17289,0.00069234,0.00038289,0,0.066048,0,0.10295,0.0042464,0.011946,0.0037774,0.016111,0.92335,0.94302,0.34929,0.18072,0.38101,0.34688,0.14137,0.4681,0.34123,0.13314,0.47674,0.34801,36.886,9.3658,13124,22299,20410,0.09449,0.085917,0.033765,0.25447,0.2459,0.047203,0.4768,0.4782,0.061986,0.66844,0.68118,0.068952,0.78951,0.80076,0.069282,0.0019669,0.001664,0.017441,-0.00065785,0.048142,-0.042486,0.0047684,0.0040401,0.019934,0.00062421,0.061885,-0.053972,0.0080775,0.0068487,0.020018,0.00083651,0.073973,-0.064403,0.0017742,0.0015044,0.035171,0.0050442,0.046909,-0.039179,0.0042157,0.0035665,0.038108,0.0079159,0.058619,-0.051268,0.0070136,0.0059166,0.036963,0.0092676,0.06818,-0.06176,0.0001927,0.00015962,0.0034017,-0.0048528,0.02278,-0.018292,0.00061206,0.00051919,0.0053211,-0.0055284,0.031186,-0.019556,0.0012534,0.0010791,0.0066214,-0.0061552,0.038979,-0.023686,0,0,0,-0.0024871,0.0050888,0,1.1684e-07,9.3337e-08,6.5548e-06,-0.003404,0.0076553,-0.012653,1.1765e-05,9.3297e-06,0.00032562,-0.0043426,0.011026,-0.014848,0.40424,74,74,40,988,3,3,3,0.645
27,-0.0052567,0.026564,0.038008,-0.98079,0.0027806,-1.925,0.96273,-0.17323,2.5092,-0.028621,3.3175,0.00033311,0.6425,3.2966,0.037908,4.2466,0.0043244,0.98102,0.11287,0.048886,0.03984,0.03389,0.20698,0.26298,0.42463,0.056972,0.0086204,0.0057525,0.03407,0.32158,0.21879,0.10828,13.324,777.54,1416.1,1115.6,3323.2,0.10227,0.094131,0.10227,0.79905,0.84754,0.3305,0.24871,0.030638,31,88.387,2229,1.5845e+05,5.1748,28.17,60183,7128,2565,0.92961,0.94805,0.21328,0.14624,0.11913,0.83614,29769,16242,0.00084868,0.0003457,0,0.055322,0,0.073539,0.0054284,0.0017028,0.0014566,0.019318,2.0082,2.7244,0.64154,0.16798,0.36454,0.38011,0.095852,0.37052,0.47612,0.092503,0.37799,0.47643,50.91,10.263,15649,24434,21932,0.093338,0.085279,0.025648,0.29478,0.31833,0.042048,0.52231,0.57119,0.052215,0.7027,0.74913,0.05574,0.79478,0.82926,0.053632,0.0046451,0.0040799,0.031672,0.0088444,0.059849,-0.037803,0.013045,0.012175,0.041936,0.018668,0.080553,-0.029865,0.027877,0.027156,0.053126,0.032619,0.10273,-0.015833,0.00049694,0.00039115,0.0075751,-0.002451,0.036218,-0.031474,0.0016896,0.001334,0.011744,-0.0013042,0.047295,-0.035103,0.0035111,0.0028208,0.014229,-0.00017381,0.057601,-0.041126,0.0041452,0.0036864,0.05627,0.01488,0.045534,-0.031458,0.01127,0.010773,0.075342,0.028191,0.064258,-0.01816,0.023886,0.023933,0.09703,0.047092,0.085736,0.0011091,2.9154e-06,2.3213e-06,0.00039431,-0.0021171,0.017552,-0.016461,8.8986e-05,7.1289e-05,0.0038389,-0.0021921,0.021773,-0.018232,0.00056485,0.00047141,0.012021,-0.00066686,0.026693,-0.020362,0.33975,74,74,40,988,3,3,3,0.645
27,-0.0031566,0.015819,0.022708,-0.98857,0.0015197,-1.9435,0.96596,0.019197,3.1872,0.040807,3.2793,3.69e-06,0.6105,4.054,0.022632,5.7155,0.0058202,0.98867,0.068343,0.041684,0.033398,0.027696,0.30984,0.27621,0.34821,0.024615,0.0079086,0.0055168,0.027692,0.47226,0.18107,0.014431,122.08,1131.6,1907.2,2086,5247.6,0.23021,0.12881,0.23021,1.7527,1.8389,0.50925,0.193,0.018327,51,68.627,1882,80171,5.4418,33.589,50814,21681,7182,0.92764,0.94448,0.12901,0.087597,0.099104,0.53686,25211,15197,0.0011156,0.00054996,0,0.047144,0,0.04618,0.0055692,0.013467,0.0050894,0.0061778,0.34907,1.5941,1.3478,0.23204,0.33549,0.28305,0.35139,0.24244,0.12301,0.36054,0.23313,0.1069,21.659,7.6423,12714,24736,23156,0.38602,0.3929,0.15881,0.71872,0.74803,0.15349,0.82997,0.85521,0.12422,0.90974,0.92554,0.10804,0.94983,0.95972,0.09596,0.003739,0.0032088,0.038169,0.006948,0.055649,-0.039143,0.0087617,0.0076398,0.042169,0.011408,0.07334,-0.048626,0.016012,0.014294,0.045685,0.016593,0.088349,-0.052373,0.0020404,0.001664,0.046565,0.0071768,0.041721,-0.038764,0.005218,0.0043701,0.054304,0.012516,0.05563,-0.049192,0.010298,0.0089639,0.062482,0.019497,0.068474,-0.051711,0.0016987,0.0015447,0.034523,0.0037351,0.034717,-0.016234,0.0035437,0.0032697,0.035469,0.0052166,0.04426,-0.017734,0.0057143,0.0053298,0.034753,0.0060886,0.052082,-0.01871,0,0,0,-0.0026725,0.017908,0,0,0,0,-0.003659,0.022579,0,0,0,0,-0.0047482,0.026013,0,0.43817,74,74,40,988,3,3,3,0.645
