0.7117979214  
2.647988826  
7.806555875  
34.42179294  
532.6910156  
6270.596531  
6123.826278  
32604.60578  
16177.48701  
5994.925064  
35826.67107  
4691.620866  
45083.31079  
98678.94083  
3659.688209  
286.068479  
45099.2432  
12967.80338  
9071.930586  
2151.659541  
17069.71976  
4538.092184  
2297.805823  
4844.077856  
9322.510368  
3448.874153  
5310.933093  
10967.07119  
3672.815478  
2277.352592  
5001.68477  
9717.065947  
1591.688331  
871.4619296  
2270.089373  
7761.59446  
9353.572646  
10270.93269  
554.7658591  
1758.967512  
9125.074794  
4876.982146  
640.5812667  
433.0421846  
4220.645887  
10033.9804  
6500.17054  
1327.582376  
1231.969163  
1510.647931  
637.8208325  
3877.321532  
106.0101062  
1013.756805  
819.4325045  
536.8002329  
772.9445006  
700.7318701  
301.6413636  
103.615429  
212.1218532  
117.6904648  
33.74526122  
90.61714958  
39.18180922  
0.8656292238  
42.1932768  
35.8495882  
0.4373013014  
5.650976905  
0.1933016154  
3.400210221  
4.899372537  
5.45303942  
2.49243733  
1.386090841  
0.8063102573  
0.140197652  
1.442055801  
0.7695078887  
0.7414881944  
0.99396433  
0.6521629036  
0.6962212827  
0.8960918175  
0.7115068472  
0.5311977418  
0.58912751  
0.640373513  
0.5347654575  
0.5933087968  
0.5665987597  
0.5294955023  
0.5418135562  
0.51400461  
0.4823295415  
0.4919971053  
0.4862396901  
0.4567328055  
0.4506860912  
0.4366308513  
0.41507181  
0.4094296933  
0.3990548136  
0.3900114732  
0.3801960306  
0.3682561561  
0.3567738336  
0.3489038377  
0.3412788286  
0.3319954452  
0.325597918  
0.3180409677  
0.3097721674  
0.3023966482  
0.2954181661  
0.2878457763  
0.2809372683  
0.2738250275  
0.2680248019  
0.2618791468  
0.2561871137  
0.2504436211  
0.2449823638  
0.239629912  
0.234292684  
0.2294376562  
0.2245432672  
0.2199019237  
0.215304748  
0.2108393039  
0.2066321265  
0.2024582888  
0.1984952568  
0.1946051392  
0.1908657986  
0.1871771005  
0.18356855  
0.1801823785  
0.1768192253  
0.1735605351  
0.1704153278  
0.1673212237  
0.1643552991  
0.1614390769  
0.1586356525  
0.1558873588  
0.1532210067  
0.1506258807  
0.1480921402  
0.1456343127  
0.1432406192  
0.1409008838  
0.1386371449  
0.1364151339  
0.1342632662  
0.1321663742  
0.1301085643  
0.1281054069  
0.1261565846  
0.1242542254  
0.1224004102  
0.1205901776  
0.118817029  
0.1170922496  
0.1154101838  
0.113763542  
0.1121512717  
0.110585809  
0.1090500136  
0.1075464108  
0.1060879348  
0.1046524137  
0.1032535995  
0.1018789969  
0.1005387908  
0.09922770541  
0.09794582632  
0.09669366822  
0.09546278956  
0.09426007461  
0.09308475567  
0.09193381741  
0.09080705539  
0.0897005416  
0.08861336746  
0.08755744656  
0.08651938004  
0.08550041822  
0.08450352604  
0.08352638749  
0.08256350696  
0.08162576443  
0.08070276204  
0.0797995101  
0.07891618895  
0.07804502189  
0.07719627329  
0.07635392432  
0.0755404618  
0.07472584115  
0.07393828802  
0.07316347951  
0.07240088671  
0.07165249732  
0.07091607091  
0.07019246223  
0.06948959441  
0.06878884453  
0.0681074336  
0.06743367696  
0.06677770473  
0.06612625704  
0.06548934801  
0.06486505816  
0.06425060875  
0.06364133239  
0.063044625  
0.06246455616  
0.06188646622  
0.06132263833  
0.06076764106  
0.06022167976  
0.05967874918  
0.05915742451  
0.05863323655  
0.05811982648  
0.05762056304  
0.05712329336  
0.05663238907  
0.05615801472  
0.05567959377  
0.05521597734  
0.05475790382  
0.05430719367  
0.0538588715  
0.05342137817  
0.05299505376  
0.05257350015  
0.05215769692  
0.05174029755  
0.05133514281  
0.05093630967  
0.05054583987  
0.05015627696  
0.04978113353  
0.04940292037  
0.04903602969  
0.04866794429  
0.04830962374  
0.0479545017  
0.04760603966  
0.04726223622  
0.04692364995  
0.04659191447  
0.04625495977  
0.04593159088  
0.04561302229  
0.045293799  
0.04498464679  
0.0446795848  
0.04437630822  
0.04407637179  
0.04378499906  
0.04349139988  
0.04320799328  
0.04292031833  
0.0426419545  
0.04236850856  
0.04209313614  
0.04182888776  
0.04156779334  
0.04130394713  
0.04104487463  
0.04079260358  
0.04054601357  
0.04029663874  
0.04005127519  
0.0398140792  
0.03957706999  
0.03933816353  
0.03910647753  
0.03888478355  
0.0386557398  
0.03843312995  
0.03821330355  
0.03799729931  
0.03778345019  
0.03756786756  
0.0373603716  
0.03715288019  
0.03695398828  
0.03675121754  
0.03655049685  
0.03635575  
0.03616111656  
0.03596845499  
0.035780249  
0.03559566762  
0.03541309102  
0.03522814471  
0.03505006863  
0.03486986495  
0.03469916026  
0.03452383486  
0.03435646539  
0.03418553648  
0.03401812191  
0.03385467031  
0.03369167153  
0.03352951583  
0.03337069811  
0.0332170063  
0.03306156752  
0.03290878691  
0.03275376001  
0.03260359448  
0.03245802638  
0.03231052763  
0.03216755801  
0.03202407412  
0.0318848311  
0.03174459572  
0.03160798661  
0.03146926632  
0.03133765134  
0.03120279469  
0.03107311686  
0.03094370505  
0.03081821008  
0.03069012754  
0.03056555841  
0.03044114358  
0.0303173743  
0.030198082  
0.03007734865  
0.02996010323  
0.02984392417  
0.02973126247  
0.02961465493  
0.02950211517  
0.02938946909  
0.02928503643  
0.02917369012  
0.02906793973  
0.02895713892  
0.02885789816  
0.02875229919  
0.02865023868  
0.02854938849  
0.02844955936  
0.02835233466  
0.02825554282  
0.02815891654  
0.02806062492  
0.02796595913  
0.02787548869  
0.02778475429  
0.02769091995  
0.02760308457  
0.02751104925  
0.02742760619  
0.02734260409  
0.02725377586  
0.02716895418  
0.02708831528  
0.02700226209  
0.0269229249  
0.02684194031  
0.02676257832  
0.02668206205  
0.02660608684  
0.02652854923  
0.0264539998  
0.02637898769  
0.02630539007  
0.02623175848  
0.02616053565  
0.02608848498  
0.02601938766  
0.02594850646  
0.02587927697  
0.02581246028  
0.0257451075  
0.02568246348  
0.02561333222  
0.02555004485  
0.02548576352  
0.02542364613  
0.02536190094  
0.02530079702  
0.02523996219  
0.0251830947  
0.02511910481  
0.0250624131  
0.02500842801  
0.02494923601  
0.02489680064  
0.0248406327  
0.02478767297  
0.02473040773  
0.02467839789  
0.02462865865  
0.02457726568  
0.02452375663  
0.02447585339  
0.02442619165  
0.02437760702  
0.02433113449  
0.02428269344  
0.0242339497  
0.02418795484  
0.02414353348  
0.02410126443  
0.02405760807  
0.02401302552  
0.0239712854  
0.02393136049  
0.02388958402  
0.02384748269  
0.02380966457  
0.02377071499  
0.02373087789  
0.02369324471  
0.02365694175  
0.02361715556  
0.02358166778  
0.02354606459  
0.02351372709  
0.02348050556  
0.02344356777  
0.02341024845  
0.02337726934  
0.02334613335  
0.02331736413  
0.02328349764  
0.02325501177  
0.02322303773  
0.02319545172  
0.02316664311  
0.02313789706  
0.02311252258  
0.02308581815  
0.02305642191  
0.02303279363  
0.02300676909  
0.02298264787  
0.0229602833  
0.02293559245  
0.02291057239  
0.0228909617  
0.02286852776  
0.02284732524  
0.02282442577  
0.02280617988  
0.0227883793  
0.02276763604  
0.02274767836  
0.02273152196  
0.02271082932  
0.0226980775  
0.02267959755  
0.02266380913  
0.02264886994  
0.02263372917  
0.02261974489  
0.02260567517  
0.02259329912  
0.02258226014  
0.02256906953  
0.02255562116  
0.02254483881  
0.02253472067  
0.02252453092  
0.02251292459  
0.02250260439  
0.02249622686  
0.0224877593  
0.02247936393  
0.022470041  
0.02246395751  
0.02245750303  
0.02245117772  
0.02244897422  
0.02244200359  
0.02244029242  
0.02243741797  
0.02243025886  
0.02242928483  
0.02242630974  
0.02242644355  
0.02242295849  
0.02242418923  
0.02242574899  
