-0.03023587566  
-0.03393986102  
-0.0261743282  
0.005975514513  
0.0714416887  
0.1736669804  
0.3099054384  
0.4714246814  
0.6445681002  
0.8125282896  
0.9575652319  
1.063372468  
1.117259392  
1.111869402  
1.046223461  
0.9259631438  
0.7627944552  
0.5732182198  
0.3767260313  
0.1936790154  
0.0431313993  
-0.05917517274  
-0.1024365904  
-0.08187953465  
0.0007588844712  
0.1373992178  
0.3144013185  
0.5138798302  
0.7154434351  
0.8981977759  
1.042844626  
1.133682414  
1.160301923  
1.118788183  
1.012267402  
0.850682051  
0.6497828009  
0.4293845301  
0.211084278  
0.01568029285  
-0.1393799083  
-0.242179858  
-0.2878482362  
-0.2791716495  
-0.226213704  
-0.1449556574  
-0.0551383851  
0.02241590741  
0.06865312921  
0.0689139363  
0.0149953133  
-0.09363896529  
-0.2496557064  
-0.4386887908  
-0.6411082685  
-0.8344786436  
-0.9964021827  
-1.107355601  
-1.153167184  
-1.126799692  
-1.029219224  
-0.8692363863  
-0.662348205  
-0.4287479488  
-0.1907716797  
0.02985820222  
0.2146274491  
0.3503040291  
0.4302298386  
0.4546774655  
0.4302616054  
0.3685355862  
0.284013919  
0.1919539197  
0.10622573  
0.03760187136  
-0.007314082296  
-0.02639334279  
-0.02154707807  
0.002309544381  
0.03865862824  
0.0808419783  
0.1233125367  
0.1624292285  
0.1966699819  
0.2262651469  
0.2523528081  
0.2758886095  
0.2965698485  
0.3120502404  
0.3176520763  
0.3066917991  
0.271402115  
0.2043166094  
0.09987110478  
-0.04407210943  
-0.2250848627  
-0.435662275  
-0.6634957139  
-0.8925366619  
-1.104735653  
-1.282192526  
-1.409398923  
-1.475199415  
-1.474158443  
-1.407100337  
-1.280743951  
-1.10650607  
-0.8986882299  
-0.6723851479  
-0.441480989  
-0.2170763259  
-0.006605382449  
0.1862585422  
0.3609448958  
0.5187830336  
0.6615451185  
0.7900725635  
0.9032963689  
0.9978616186  
1.068449441  
1.108718029  
1.112678931  
1.0762206  
0.9984571985  
0.8826210662  
0.7362837687  
0.5708325809  
0.4002486937  
0.2393726364  
0.101926215  
-0.001387866085  
-0.06439800475  
-0.08634279133  
-0.07197243916  
-0.03084715742  
0.02405621169  
0.07821918403  
0.1176584517  
0.1308860801  
0.1104819562  
0.05405046182  
-0.03555033472  
-0.1507140177  
-0.2802193726  
-0.4107996005  
-0.5289006901  
-0.6223705071  
-0.6818412792  
-0.7016442036  
-0.6801723954  
-0.6196943931  
-0.5257153415  
-0.4060411694  
-0.2697205908  
-0.126046485  
0.01623656042  
0.1494469231  
0.267173315  
0.3642418995  
0.436529332  
0.480763771  
0.4944227571  
0.4758174998  
0.4243795368  
0.3411097465  
0.2290765546  
0.09380315206  
-0.05661061697  
-0.2117690814  
-0.3597279921  
-0.4881753396  
-0.5859222715  
-0.6444879584  
-0.6595114801  
-0.6317235406  
-0.5672557757  
-0.4771644714  
-0.3761751119  
-0.2807806601  
-0.2069630233  
-0.167868173  
-0.1717962244  
-0.2208368891  
-0.3103671186  
-0.4295181021  
-0.562556909  
-0.6909826927  
-0.7960377126  
-0.8612678749  
-0.8747575397  
-0.830719626  
-0.7302178919  
-0.5809259261  
-0.3959730782  
-0.1920540945  
0.01292038534  
0.202284902  
0.3628412871  
0.4865352627  
0.5713519479  
0.6213257969  
0.6456757188  
0.6572063452  
0.6702080023  
0.6981656577  
0.7515810687  
0.8362266789  
0.9520383125  
1.092813339  
1.246737066  
1.397666694  
1.527014682  
1.615984372  
1.647886578  
1.610251591  
1.496475055  
1.306809536  
1.04858081  
0.7356104768  
0.3869151078  
0.02484737009  
-0.3270994884  
-0.6465593841  
-0.9143676132  
-1.116203514  
-1.243625389  
-1.294401404  
-1.272142217  
-1.185319611  
-1.04584582  
-0.8674399482  
-0.6640039598  
-0.4482373855  
-0.2306529951  
-0.01908416595  
0.1813128196  
0.3676229862  
0.5384423277  
0.6930166338  
0.83041858  
0.9489151648  
1.045622689  
1.11650464  
1.156693594  
1.16108193  
1.125082554  
1.045435224  
0.9209524021  
0.7530888137  
0.5462612429  
0.307869736  
0.04800786  
-0.2211195895  
-0.4860242496  
-0.7329317315  
-0.948860435  
-1.122684707  
-1.246073163  
-1.314214038  
-1.326233845  
-1.285273804  
-1.198187943  
-1.07489207  
-0.9274239096  
-0.7688114128  
-0.6118683547  
-0.4680475601  
-0.3464836508  
-0.2533110972  
-0.1913272402  
-0.1600200913  
-0.1559426367  
-0.1733755508  
-0.2052010331  
-0.2438908953  
-0.2825082413  
-0.3156233485  
-0.340045943  
-0.3552940528  
-0.3637301255  
-0.3703230554  
-0.3820257573  
-0.4068021425  
-0.4523866911  
-0.5249108207  
-0.6275676222  
-0.7595143057  
-0.9152107168  
-1.08433694  
-1.252394687  
-1.401961001  
-1.514497067  
-1.572487737  
-1.561620905  
-1.472705471  
-1.303028184  
-1.05694194  
-0.745587179  
-0.3857846855  
0.001729959117  
0.394476982  
0.7704855298  
1.110323151  
1.3986499  
1.625139677  
1.784714721  
1.877163414  
1.906283513  
1.878756125  
1.802961702  
1.687924098  
1.542507109  
1.374932309  
1.192600431  
1.002150177  
0.8096527931  
0.620833016  
0.4412160422  
0.2761414905  
0.1306159246  
0.00902964033  
-0.08522076841  
-0.1501302571  
-0.1854274309  
-0.1927952709  
-0.1759242036  
-0.1403591966  
-0.09315202443  
-0.04232449059  
0.003802805106  
0.03737012975  
0.05175114348  
0.04226005581  
0.006729091146  
-0.05412724808  
-0.1366028112  
-0.2341969172  
-0.3381130326  
-0.4380523033  
-0.5232331045  
-0.5835611615  
-0.610811422  
-0.5996946819  
-0.548658334  
-0.460289313  
-0.3412460842  
-0.2016715589  
-0.0541437188  
0.08773325848  
0.2109208775  
0.3045183023  
0.3610962181  
0.3776090673  
0.3557526065  
0.3017168584  
0.2253704251  
0.1389913773  
0.05571869805  
-0.01205389747  
-0.05414354367  
-0.06370312143  
-0.03788501084  
0.02201132124  
0.1109061305  
0.220728725  
0.341497707  
0.4625309235  
0.5736252068  
0.6660506974  
0.7332670791  
0.7713017796  
0.7787949157  
0.7567622724  
0.7081527886  
0.6373058463  
0.5493889605  
0.4498914687  
0.3442117045  
0.2373433431  
0.1336478302  
0.03668810027  
-0.05089922969  
-0.12749846  
-0.1925709026  
-0.2466328664  
-0.2911449354  
-0.328271284  
-0.360524702  
-0.3903202533  
-0.4194962801  
-0.4488944999  
-0.4780764611  
-0.5052593438  
-0.5275105018  
-0.541201671  
-0.5426612412  
-0.5289353666  
-0.4985215478  
-0.4519373327  
-0.3920158673  
-0.3238412764  
-0.254316274  
-0.1914051434  
-0.1431536164  
-0.1166328033  
-0.1169584265  
-0.1465381107  
-0.2046482382  
-0.287409789  
-0.3881444946  
-0.498069835  
-0.6072223229  
-0.705481932  
-0.783579828  
-0.833960408  
-0.85143281  
-0.8335512419  
-0.7807292879  
-0.6961032106  
-0.5852007101  
-0.4554653563  
-0.3156929779  
-0.1754235078  
-0.04431104624  
0.06851092037  
0.1550722174  
0.2092009338  
0.227135051  
0.2080638754  
0.1545330061  
0.07262343114  
-0.02818314176  
-0.1355321342  
-0.235143841  
-0.3121556548  
-0.3527585044  
-0.3459487499  
-0.2851672585  
-0.1695750697  
-0.004729617819  
0.197512327  
0.419926302  
0.6416423886  
0.8404592031  
0.9954779741  
1.089691858  
1.112170885  
1.059529303  
0.9364625852  
0.7552621938  
0.5343719031  
0.2961780574  
0.0643114728  
-0.1391785813  
-0.2964394717  
-0.3958954023  
-0.4335568127  
-0.4134128894  
-0.3468771745  
-0.2513574957  
-0.1481124393  
-0.05964810931  
-0.006926390031  
-0.006711184918  
-0.06934530962  
-0.1972222316  
-0.3841455001  
-0.6156791549  
-0.870482414  
-1.122504294  
-1.34380642  
-1.507687144  
-1.591735938  
-1.580432869  
-1.466963808  
-1.254009241  
-0.9534126684  
-0.5847749029  
-0.173175362  
0.2536647228  
0.6683938948  
1.0468269  
1.3701691  
1.62643502  
1.810921658  
1.925764058  
1.978698835  
1.981276329  
1.946805823  
1.888330746  
1.816904126  
1.740360499  
1.662699935  
1.584103338  
1.501516774  
1.409664601  
1.302318424  
1.173625374  
1.019328173  
0.8377161596  
0.6302173503  
0.4015803002  
0.1596419548  
-0.08527285779  
-0.3212570163  
-0.5359300861  
-0.7176502228  
-0.8567111477  
-0.9464173896  
-0.9839208305  
-0.9707206317  
-0.9127591986  
-0.820052033  
-0.7058653232  
-0.5854735056  
-0.4746088907  
-0.3877518719  
-0.3364495496  
-0.3278725499  
-0.3638078664  
-0.4402431054  
-0.5476428164  
-0.6719298699  
-0.7960870152  
-0.9022146008  
-0.9738024762  
-0.9979262975  
-0.9670799128  
-0.8803857981  
-0.7439935758  
-0.5705794076  
-0.3779860575  
-0.1871539495  
-0.01959385918  
0.1052612041  
0.1724919319  
0.173570651  
0.1074407605  
-0.01935391065  
-0.1935141329  
-0.3966798799  
-0.6077467039  
-0.8055016937  
-0.9712145583  
-1.090856341  
-1.156648987  
-1.167764941  
-1.130094621  
-1.055130229  
-0.9581275556  
-0.8558020472  
-0.7638627512  
-0.694710372  
-0.6555981563  
-0.6474931798  
-0.6647818639  
-0.6958651299  
-0.7245745981  
-0.7322423062  
-0.700183261  
-0.6122934246  
-0.457454624  
-0.2314559679  
0.06180732221  
0.4100272969  
0.7931374395  
1.184898295  
1.555286676  
1.873459772  
2.111006017  
2.245130511  
2.261419184  
2.155849636  
1.935777211  
1.619726122  
1.235940298  
0.8198092649  
0.4103992437  
0.04646392744  
-0.2376202875  
-0.4155288656  
-0.4718312756  
-0.4036581503  
-0.2209973989  
0.05442975655  
0.3915602775  
0.7533670896  
1.100819109  
1.396966341  
1.610690163  
1.719726603  
1.712665322  
1.589746262  
1.362433768  
1.051862359  
0.6863522847  
0.2982953448  
-0.07926370072  
-0.4159934854  
-0.6872556973  
-0.8764105036  
-0.9762238475  
-0.9892385701  
-0.9270919046  
-0.8088479504  
-0.6585379432  
-0.5021856722  
-0.3646700101  
-0.2667908797  
-0.2229047507  
-0.2394186764  
-0.3143323365  
-0.437874244  
-0.5941307054  
-0.7634324194  
-0.9251372276  
-1.060419942  
-1.154662259  
-1.199115903  
-1.191632143  
-1.136405583  
-1.042827818  
-0.9236965122  
-0.7931011885  
-0.6643485247  
-0.5482380218  
-0.4519414509  
-0.3785846339  
-0.3275235758  
-0.2951779433  
-0.2762075033  
-0.264774635  
-0.2556581037  
-0.2450337194  
-0.2308203835  
-0.2125945869  
-0.1911502434  
-0.1678500804  
-0.1439430034  
-0.1199993199  
-0.09559458079  
-0.06928567728  
-0.03887010191  
-0.001846970127  
0.04403477182  
0.1002782868  
0.1672951136  
0.2442883286  
0.3293763829  
0.419902985  
0.5128480568  
0.6052225337  
0.6943396045  
0.7779010893  
0.853875347  
0.9202151337  
0.9745189954  
1.01376025  
1.034209871  
1.031658267  
1.00196439  
0.9418950955  
0.8501337851  
0.7282761061  
0.5816045733  
0.4194215131  
0.2547938858  
0.1036298739  
-0.01688449227  
-0.09033999321  
-0.1034033218  
-0.04805650427  
0.07657826451  
0.2631207487  
0.4957769386  
0.7512483263  
1.000693517  
1.212559168  
1.355987912  
1.404390781  
1.338753302  
1.150233714  
0.8417101491  
0.4280387411  
-0.06504265368  
-0.6032693376  
-1.147197434  
-1.656153514  
-2.092325223  
-2.42449695  
-2.631009732  
-2.70160724  
-2.637981977  
-2.453023257  
-2.168890292  
-1.814207668  
-1.420760154  
-1.020085771  
-0.640381496  
-0.3040461587  
-0.02609345462  
0.1864517112  
0.3341866427  
0.4241255711  
0.4678578531  
0.4793524136  
0.4726872595  
0.459984597  
0.4497761906  
0.4459784798  
0.4475526582  
0.4488793599  
0.4407686498  
0.4119916847  
0.3511431889  
0.2486199326  
0.0984847097  
-0.1000258345  
-0.3415382851  
-0.6142975697  
-0.9007101513  
-1.178667899  
-1.423551285  
-1.610700933  
-1.718091015  
-1.728867172  
-1.633439461  
-1.430841695  
-1.12918076  
-0.74509596  
-0.3023035874  
0.1705935076  
0.6427538663  
1.083867815  
1.46673805  
1.769388889  
1.976514504  
2.080183108  
2.079810347  
1.981512706  
1.796984  
1.542095196  
1.235383745  
0.8965778149  
0.5452658477  
0.1997730326  
-0.1237306282  
-0.4118777397  
-0.6545115202  
-0.8448698419  
-0.9795438931  
-1.058229742  
-1.08329852  
-1.059217401  
-0.9918826066  
-0.8879406507  
-0.7541717037  
-0.5970195055  
-0.4223166668  
-0.2352317271  
-0.0404214018  
0.1576737681  
0.3544698246  
0.5449169575  
0.7233068436  
0.8832800154  
1.018054052  
1.120864182  
1.185563486  
1.207293913  
1.18313095  
1.112615086  
0.9980810769  
0.8447431854  
0.6605142528  
0.4555809407  
0.2417669901  
0.03174783883  
-0.1618077778  
-0.3271084032  
-0.4540495145  
-0.5349074863  
-0.5648672193  
-0.5423420523  
-0.4690629355  
-0.349916792  
-0.1925345251  
-0.006652305451  
0.1967163917  
0.4062201062  
0.6111442082  
0.8022997658  
0.9727361139  
1.118166842  
1.237061226  
1.330364563  
1.400895492  
1.452493066  
1.489050239  
1.513584118  
1.527494545  
1.530146666  
1.518844034  
1.489217246  
1.435967878  
1.353847206  
1.238718062  
1.088519456  
0.9039677398  
0.6888733083  
0.4500099088  
0.1965381721  
-0.06093255886  
-0.3115176358  
-0.5452816533  
-0.754345248  
-0.9337041465  
-1.081647223  
-1.1997171  
-1.292234009  
-1.365465799  
-1.426574867  
-1.482510816  
-1.539016177  
-1.599876074  
-1.666522742  
-1.738011975  
-1.811374015  
-1.882245641  
-1.945683935  
-1.997036642  
-2.03273797  
-2.050929849  
-2.051814807  
-2.03771676  
-2.012819733  
-1.982625833  
-1.953186971  
-1.930197762  
-1.918061688  
-1.919042444  
-1.93261994  
-1.955155011  
-1.979926831  
-1.997579991  
-1.996953556  
-1.966233433  
-1.894294764  
-1.772101901  
-1.593984308  
-1.358634294  
-1.069690745  
-0.7358131987  
-0.370211989  
0.01033477709  
0.3868979919  
0.7400977391  
1.051918684  
1.307446066  
1.496319008  
1.613752283  
1.660977836  
1.645058254  
1.578059085  
1.475660277  
1.355345372  
1.234365499  
1.127713613  
1.046356681  
0.9959477255  
0.9762026969  
0.9810393959  
0.9994909704  
1.01730561  
1.019030595  
0.9903314646  
0.9202256106  
0.8029201324  
0.6389873398  
0.4356892265  
0.2063863886  
-0.0309092217  
-0.2556356357  
-0.4471541306  
-0.5872319835  
-0.6621839772  
-0.6643688877  
-0.5928480554  
-0.4531375182  
-0.2561364964  
-0.01644005758  
0.2496828692  
0.5263220357  
0.7996677019  
1.05924293  
1.298487826  
1.514687238  
1.708317511  
1.881978743  
2.039107477  
2.182699582  
2.314217598  
2.432855693  
2.535235738  
2.615583892  
2.666339899  
2.679129282  
2.645957786  
2.560473663  
2.419126896  
2.222061489  
1.973607515  
1.682282175  
1.360270191  
1.02242567  
0.6849009558  
0.363558637  
0.07237382727  
-0.1779734362  
-0.3811278662  
-0.5355710609  
-0.6445435468  
-0.715394168  
-0.7584323429  
-0.7854545248  
-0.8081319459  
-0.8364852985  
-0.8776607665  
-0.9351650152  
-1.008669389  
-1.094404984  
-1.186083772  
-1.276205986  
-1.35754447  
-1.424581423  
-1.474654244  
-1.508636953  
-1.531023389  
-1.549393058  
-1.573331281  
-1.612945959  
-1.677215022  
-1.772397195  
-1.900745195  
-2.059711451  
-2.241757049  
-2.434798526  
-2.62322138  
-2.789338809  
-2.915093341  
-2.983814783  
-2.981818187  
-2.899692948  
-2.733174286  
-2.483536822  
-2.157528516  
-1.766882034  
-1.327486694  
-0.8582988413  
-0.3800843954  
0.08594184175  
0.5195012533  
0.9026023161  
1.220782957  
1.464169882  
1.628254328  
1.714298884  
1.72927891  
1.685304758  
1.598512164  
1.487474781  
1.371270945  
1.267405415  
1.189834572  
1.147360431  
1.142641935  
1.171988745  
1.226011599  
1.291065863  
1.351299638  
1.391023342  
1.397040081  
1.36058923  
1.278598956  
1.15406626  
0.9955122603  
0.8156274242  
