47.07099322  
51.97686522  
63.34683059  
92.81259504  
477.0770009  
1209.201461  
1050.988911  
4923.32725  
5560.790843  
19235.83725  
11692.93113  
4661.498571  
7288.700857  
54390.73995  
83171.71015  
5694.549059  
10088.56949  
9464.484029  
16381.93235  
5479.567529  
28800.61137  
15758.4576  
15808.68193  
5205.132698  
6153.533029  
3534.950934  
5760.793332  
359.4608814  
1200.7393  
14857.80613  
407.531454  
2964.372278  
14010.92602  
6104.640109  
1515.735705  
12242.08262  
15468.75391  
3308.956779  
15424.29785  
1982.639035  
1461.923098  
5929.248453  
2282.868349  
40.49268261  
1230.470437  
2373.529512  
2317.108225  
1850.115599  
3121.822819  
15288.47158  
3746.431406  
3606.580017  
605.9199318  
6968.915303  
909.4128648  
5852.251281  
7720.789135  
1593.773075  
2196.061055  
490.3958257  
1992.380794  
516.7297893  
961.6594009  
1675.407417  
96.63194364  
301.4303326  
132.3635801  
76.13105182  
44.22735035  
55.97344288  
146.4943417  
6.926427811  
27.82732092  
11.9868575  
8.948072963  
18.13114344  
6.372859931  
6.709995678  
0.4029599475  
1.039778277  
1.869455193  
0.4876503395  
0.5207603926  
0.1853232234  
0.221753909  
0.08350506828  
0.1121490546  
0.03485226851  
0.07915067465  
0.05182499187  
0.03310679286  
0.04673908047  
0.02867451189  
0.04579113651  
0.02038690303  
0.05207972627  
0.03236085302  
0.04416354213  
0.03337006738  
0.03571267739  
0.02654578217  
0.03918269376  
0.03370639154  
0.03332683815  
0.0303772848  
0.02888172318  
0.02921077575  
0.02850617752  
0.02795036347  
0.02592142607  
0.02608642521  
0.02489568244  
0.02469580571  
0.02368433325  
0.02356295562  
0.02284959387  
0.02256191905  
0.02191433035  
0.02147995953  
0.02116656263  
0.02082035577  
0.02021594067  
0.01986546404  
0.01946441121  
0.01909354483  
0.01871165671  
0.01836899037  
0.01792481379  
0.01764138218  
0.01727879126  
0.01694829668  
0.01662308358  
0.01635222511  
0.01602853546  
0.01576527549  
0.01547336416  
0.01519695425  
0.01493972798  
0.0147025525  
0.01444292087  
0.0142078873  
0.01397111251  
0.01374198486  
0.01352686074  
0.01331200401  
0.01309924811  
0.01289627456  
0.01269768579  
0.01250088392  
0.01231372128  
0.01212750187  
0.01194702392  
0.01177109841  
0.01159974066  
0.01143138006  
0.01126997536  
0.01111157918  
0.01095614972  
0.01080391813  
0.01065442144  
0.01050808837  
0.01036756679  
0.01022891565  
0.01009478175  
0.009962734411  
0.009834134221  
0.009705171414  
0.009581309579  
0.009462221403  
0.009342499135  
0.009227857922  
0.009113772022  
0.009000288966  
0.008893392896  
0.008785998198  
0.008681296292  
0.008578965585  
0.008480083114  
0.008381767875  
0.008284774473  
0.008190562915  
0.00809765966  
0.008006424704  
0.007917567934  
0.007829605935  
0.007744384834  
0.007662261709  
0.007578340268  
0.007498534033  
0.007418033989  
0.007339756367  
0.007264977376  
0.007188756685  
0.00711537244  
0.007043050365  
0.006971255547  
0.006901148747  
0.006832279167  
0.006766131719  
0.00669855864  
0.006634532865  
0.006569577104  
0.006507734368  
0.006446901743  
0.006385605297  
0.00632651655  
0.006266584168  
0.006210146358  
0.006152483106  
0.006097139381  
0.006042421392  
0.005986923854  
0.005934651421  
0.005883128446  
0.005831613681  
0.005780358756  
0.005730675979  
0.005682325706  
0.00563268434  
0.005585644757  
0.005539305501  
0.005493760162  
0.00544755459  
0.005403243308  
0.005359592066  
0.005316608184  
0.005274019976  
0.005231607639  
0.005190271082  
0.005149003898  
0.005109921048  
0.005069763214  
0.005031752707  
0.004992265556  
0.00495479811  
0.004917708733  
0.004880252992  
0.004845264105  
0.004809369084  
0.004774460869  
0.004738728824  
0.004704947814  
0.004670844496  
0.00463862815  
0.004606388856  
0.004572365099  
0.004541003129  
0.004509400586  
0.00447907185  
0.004447315149  
0.00441795517  
0.004388885232  
0.004358873505  
0.00433055578  
0.004301946046  
0.004273387542  
0.00424497227  
0.004218041952  
0.004191294806  
0.004164433148  
0.00413777196  
0.004111376863  
0.004086797317  
0.004061138833  
0.004036462776  
0.004011959865  
0.003987518427  
0.003963381225  
0.003940189695  
0.003915848959  
0.003892798737  
0.003870183045  
0.003847352486  
0.003825215993  
0.003803054357  
0.003781276569  
0.003760393116  
0.003738569015  
0.003718555293  
0.003697442216  
0.003676623798  
0.003657689727  
0.003637837647  
0.003617094055  
0.003597660748  
0.003578997058  
0.003560175405  
0.003540838467  
0.003522637157  
0.003504640929  
0.003486768515  
0.003467967244  
0.003450555182  
0.003433688472  
0.003416326372  
0.003399202907  
0.003382083696  
0.003365453218  
0.003349526322  
0.003332682062  
0.003316585161  
0.0033013627  
0.003285544186  
0.003270635193  
0.00325504921  
0.003239624432  
0.003224801432  
0.003210525655  
0.003196069177  
0.003180953912  
0.003166970038  
0.003152926391  
0.003138984129  
0.003125468385  
0.003112238785  
0.003098792827  
0.003085287294  
0.003071953073  
0.00305941688  
0.003046253513  
0.003033143138  
0.003021088349  
0.003008708944  
0.002996613881  
0.002983988737  
0.002972198343  
0.002960590756  
0.002948889708  
0.002937842291  
0.002925640851  
0.002914920001  
0.002903528892  
0.002892275932  
0.002881732551  
0.002871286389  
0.002859907569  
0.002850461932  
0.002839374052  
0.00282935236  
0.002818893271  
0.002808788863  
0.002797711787  
0.002789170617  
0.002778909796  
0.002769786842  
0.002759807925  
0.002751163144  
0.002740781667  
0.002732325393  
0.002722965931  
0.002714413108  
0.002704883745  
0.002696140937  
0.002687150936  
0.002678591487  
0.002670404044  
0.002661492647  
0.0026540321  
0.002645990645  
0.002638271544  
0.002629707835  
0.002621586059  
0.002613552758  
0.002606689512  
0.002598308106  
0.002590675745  
0.002584051129  
0.002576168448  
0.002569646709  
0.002561767055  
0.002554353788  
0.002548056418  
0.002540903364  
0.002533910538  
0.002526799902  
0.002520632922  
0.002513944033  
0.002507353551  
0.00250120472  
0.002494020258  
0.002487529148  
0.002482170796  
0.002475331824  
0.002469835726  
0.002463687482  
0.002458187314  
0.002451831866  
0.002446215672  
0.002440051957  
0.002434468834  
0.002429206402  
0.002424119497  
0.002417920084  
0.002412966416  
0.002408065503  
0.002402018555  
0.00239768725  
0.002392173348  
0.00238738661  
0.002381721341  
0.002377396347  
0.002372234444  
0.002367891827  
0.002362745206  
0.002358945933  
0.002353585779  
0.002349867594  
0.002344886875  
0.002341013976  
0.002336401659  
0.002332183357  
0.00232715471  
0.002323563804  
0.002320510309  
0.002315893286  
0.002312199385  
0.002308108983  
0.002303983155  
0.002300581269  
0.002296926589  
0.002293284654  
0.002289150905  
0.002285721479  
0.002282636139  
0.002279053819  
0.002275592805  
0.002272586057  
0.002269141681  
0.00226616006  
0.002262524818  
0.002259120369  
0.002257428213  
0.002253835793  
0.002250627225  
0.002247932154  
0.002244791261  
0.002242209192  
0.002239347485  
0.002236452344  
0.002234525828  
0.002231838644  
0.002228991232  
0.002227058907  
0.002224747186  
0.002222239688  
0.00221980188  
0.002217582644  
0.002215427082  
0.00221267606  
0.002211840222  
0.002208445368  
0.002206480725  
0.002205092127  
0.002204019072  
0.002201234534  
0.002199345708  
0.002197783395  
0.002196171533  
0.002193670919  
0.002192534163  
0.002191060385  
0.002189821013  
0.002188877542  
0.002186499767  
0.002185022639  
0.002183771904  
0.002182756786  
0.002182215164  
0.002180391496  
0.002178858284  
0.002178799794  
0.00217719524  
0.002176128471  
0.002175390615  
0.002174629007  
0.00217325535  
0.002172639354  
0.002171482596  
0.002171298086  
0.002170726917  
0.002170248911  
0.002169101136  
0.002168252518  
0.002168334914  
0.00216854965  
0.002167712085  
0.002167301357  
0.002166250093  
0.002167009961  
0.002167463184  
0.002166131387  
0.002166390956  
0.0021668199  
0.00216608502  
