0.1536649294  
0.207465161  
0.2570676854  
0.2991668733  
0.3303734553  
0.3473216605  
0.3469399895  
0.3268658459  
0.2859315275  
0.2246321364  
0.1454525461  
0.05296523962  
-0.04637707899  
-0.1447743474  
-0.233876573  
-0.3057683615  
-0.353980544  
-0.3743718765  
-0.3657449093  
-0.3300691121  
-0.2722748616  
-0.1996446855  
-0.1208754037  
-0.04497281632  
0.01987598131  
0.06727700393  
0.09331942201  
0.09690559769  
0.07969414015  
0.04569453389  
0.0006115187848  
-0.04896656476  
-0.09639144536  
-0.135686934  
-0.1621121144  
-0.1725109453  
-0.165437417  
-0.1411009993  
-0.1011654441  
-0.04847361503  
0.01325560968  
0.07971123813  
0.1462384096  
0.2080549023  
0.2604373093  
0.2989130518  
0.3194664092  
0.3187757113  
0.2944807311  
0.2454452243  
0.1719999481  
0.07610399253  
-0.03859532398  
-0.166864318  
-0.3021355387  
-0.4369228026  
-0.5633657327  
-0.6738493299  
-0.7616490026  
-0.8215145386  
-0.8501444034  
-0.8464869338  
-0.8118379477  
-0.749722169  
-0.6655719719  
-0.5662319674  
-0.4593556775  
-0.3527369686  
-0.2536585906  
-0.168301752  
-0.1012842887  
-0.05534624129  
-0.0312117122  
-0.0276268391  
-0.04156252033  
-0.06855595302  
-0.1031647967  
-0.1394862455  
-0.1717107203  
-0.1946440854  
-0.2041798155  
-0.1976605869  
-0.174098398  
-0.1342381609  
-0.08044694586  
-0.0164382433  
0.05313040432  
0.1231546647  
0.1886129515  
0.2450671183  
0.2890783782  
0.3185003496  
0.3326111801  
0.3321005002  
0.3189136576  
0.295990217  
0.2669437342  
0.2357121713  
0.206224909  
0.1820950129  
0.1663653441  
0.1613000793  
0.1682252281  
0.1874228112  
0.2180838968  
0.2583270895  
0.3053023883  
0.3553795282  
0.4044309413  
0.4481905324  
0.4826619731  
0.5045278177  
0.5115245803  
0.5027204655  
0.4786469719  
0.4412825716  
0.393860259  
0.3405269452  
0.2858865652  
0.2344971136  
0.1903575746  
0.1564697549  
0.1345174953  
0.1246985896  
0.1257378244  
0.1350670301  
0.1491621795  
0.1639846697  
0.1754822622  
0.1800882815  
0.1751541024  
0.1592777476  
0.132470992  
0.09616621739  
0.05305028975  
0.00675430246  
-0.03856352948  
-0.07869437744  
-0.1098495988  
-0.1290866632  
-0.1346379259  
-0.1261160247  
-0.1045815268  
-0.0724806766  
-0.03345582567  
0.007940380716  
0.04660474921  
0.07729720278  
0.09507761309  
0.09574263355  
0.07624166511  
0.0350323114  
-0.02764678212  
-0.1096343855  
-0.2068565761  
-0.3135272545  
-0.4225288626  
-0.5259761985  
-0.6158994018  
-0.6850047757  
-0.7274038424  
-0.7392366868  
-0.7191072528  
-0.6682628903  
-0.590490927  
-0.4917490667  
-0.3795540087  
-0.2622214066  
-0.1480218469  
-0.04437388375  
0.04286000898  
0.109885478  
0.1552406073  
0.1798060154  
0.1865476028  
0.1800279207  
0.1657554085  
0.1494333704  
0.1362115408  
0.1300242899  
0.1330969425  
0.1456926334  
0.1661216239  
0.191015864  
0.2158460598  
0.2355855715  
0.2454555611  
0.2416352984  
0.2218348337  
0.1856619811  
0.1347166262  
0.07241734187  
0.003564865419  
-0.06627039697  
-0.1314581069  
-0.1870170085  
-0.2292107121  
-0.2559525391  
-0.2669678024  
-0.2636935583  
-0.2489371043  
-0.2263512568  
-0.1998124155  
-0.1727928209  
-0.1478220278  
-0.1261266904  
-0.1074857198  
-0.09034368909  
-0.07214118123  
-0.04983023742  
-0.02048630608  
0.01806832717  
0.06672640517  
0.1247351456  
0.1895526122  
0.256975172  
0.3215096937  
0.3769630965  
0.4171664129  
0.4367518934  
0.4318784543  
0.4008038088  
0.3442363167  
0.2653981616  
0.1697925677  
0.06469133199  
-0.04160297102  
-0.1406336432  
-0.2246973379  
-0.2876751472  
-0.3256838666  
-0.3374611552  
-0.324443811  
-0.2905256472  
-0.2415288195  
-0.1844563556  
-0.1266193534  
-0.07476439504  
-0.0342925083  
-0.00868251835  
0.0008170028613  
-0.004807191587  
-0.02261244804  
-0.04822984501  
-0.07654460209  
-0.1024393418  
-0.1214889866  
-0.1305089218  
-0.1278987749  
-0.1137397265  
-0.0896530494  
-0.05847038386  
-0.02376353325  
0.01066379716  
0.04126487095  
0.06513974033  
0.08029954922  
0.08578293979  
0.08164016439  
0.06882208886  
0.04899876924  
0.02436831598  
-0.002543805713  
-0.02904386782  
-0.05242981979  
-0.07012738488  
-0.07983597356  
-0.07969456908  
-0.0684563692  
-0.04567065728  
-0.01182947514  
0.03155016294  
0.08194937252  
0.136006811  
0.1898109617  
0.2393215802  
0.2808574764  
0.3115883412  
0.3299606202  
0.3359582041  
0.3311674635  
0.3185915182  
0.302244415  
0.2865678753  
0.2757502438  
0.2730639695  
0.2803065754  
0.2974541034  
0.3225787436  
0.3520442293  
0.3809607841  
0.4038243502  
0.415257707  
0.4107387434  
0.3872190167  
0.3435521912  
0.2806892404  
0.2016142846  
0.1110541854  
0.01500229643  
-0.07987934969  
-0.1669043288  
-0.2399837992  
-0.2941729024  
-0.3260950452  
-0.3342088712  
-0.3189141094  
-0.2824947371  
-0.228902417  
-0.1634147207  
-0.09218638467  
-0.02173807525  
0.04157716784  
0.09208336656  
0.1252257416  
0.1379030449  
0.1286628129  
0.0977482221  
0.04698373153  
-0.02046747314  
-0.1004539829  
-0.1882448078  
-0.2789506057  
-0.3679162968  
-0.4510440749  
-0.5250273868  
-0.5874800536  
-0.6369625481  
-0.6729217449  
-0.6955567615  
-0.7056332003  
-0.704264711  
-0.6926892379  
-0.6720484282  
-0.6432047703  
-0.606598155  
-0.5621854561  
-0.5094565855  
-0.4475587285  
-0.3755120079  
-0.292515812  
-0.1983022978  
-0.09349645934  
0.02008202017  
0.1392348308  
0.2593751255  
0.3747325985  
0.4787808144  
0.5648606328  
0.6269432183  
0.6604404096  
0.662951171  
0.6348310635  
0.5794722761  
0.5032261063  
0.4149259567  
0.3250317517  
0.2444716437  
0.183293213  
0.1492987294  
0.1468402562  
0.1759450862  
0.2319394484  
0.3056550157  
0.384261987  
0.4526635513  
0.4953228013  
0.498310793  
0.4513168003  
0.34933923  
0.193800856  
-0.007108371853  
-0.2389604435  
-0.4824691793  
-0.7155869509  
-0.9160442502  
-1.06401539  
-1.144543911  
-1.149377542  
-1.077979433  
-0.9375562029  
-0.7421215602  
-0.5107331948  
-0.2651608323  
-0.02731038008  
0.1832496005  
0.3513479792  
0.4676217248  
0.5291347349  
0.5391902126  
0.5064105229  
0.4432551288  
0.3641926624  
0.2837824646  
0.2148998205  
0.1673063283  
0.1467180168  
0.1544483204  
0.1876306868  
0.2399566439  
0.3028028276  
0.3665814836  
0.422134983  
0.4619730045  
0.4812214433  
0.478145558  
0.4542184089  
0.4137355479  
0.3630524182  
0.309573161  
0.2606363732  
0.2224644795  
0.1993199246  
0.1929713247  
0.2025399098  
0.2247190255  
0.2543252259  
0.2850817049  
0.3105196335  
0.3248627453  
0.3237778086  
0.3049014033  
0.2680785934  
0.2153043296  
0.150398117  
0.07846017437  
0.005206239842  
-0.06373383798  
-0.1234626867  
-0.1703266789  
-0.2022419511  
-0.2188100782  
-0.2212194879  
-0.2119673372  
-0.1944405185  
-0.1724317772  
-0.1496421787  
-0.1292449363  
-0.1135598625  
-0.1038808695  
-0.1004593474  
-0.1026522856  
-0.1091913149  
-0.1185283819  
-0.1291952647  
-0.1401199887  
-0.1508331654  
-0.1615366998  
-0.1730118466  
-0.186381822  
-0.2027716347  
-0.2229290181  
-0.2468813479  
-0.2737079822  
-0.3014906452  
-0.3274804253  
-0.3484790835  
-0.3613901193  
-0.36386435  
-0.354928107  
-0.335476542  
-0.3085154849  
-0.2790790617  
-0.2537791406  
-0.2400200636  
-0.2449542365  
-0.2743262238  
-0.3313668965  
-0.4159246677  
-0.5239863934  
-0.6477013055  
-0.7759520107  
-0.8954219595  
-0.9920440477  
-1.052648736  
-1.066588179  
-1.027112022  
-0.932308701  
-0.7854767019  
-0.5948778952  
-0.3729094605  
-0.1348087328  
0.1029393374  
0.3242838667  
0.5151786768  
0.6648664711  
0.7667413443  
0.8187304634  
0.8231889882  
0.7863516188  
0.7174531416  
0.627626798  
0.5287137531  
0.4321175433  
0.3477995611  
0.2835019337  
0.2442430738  
0.2321071262  
0.2463175638  
0.2835614527  
0.3385118179  
0.4044873526  
0.4741806451  
0.5403875225  
0.5966716432  
0.6379152187  
0.6607165215  
0.6636016354  
0.6470514294  
0.6133297107  
0.5661564871  
0.5102332265  
0.4506904262  
0.3925004137  
0.3399195808  
0.2960353551  
0.262453256  
0.2391788603  
0.2247101347  
0.2163246654  
0.2105229886  
0.2035813337  
0.1921180517  
0.1736150673  
0.14679966  
0.1118530867  
0.07040198886  
0.02530645902  
-0.01973234668  
-0.06067950149  
-0.09372162939  
-0.1157892308  
-0.124978989  
-0.1208115531  
-0.1043048015  
-0.07785602612  
-0.04495551785  
-0.009781302232  
0.02326156425  
0.04999335215  
0.06684629949  
0.07114206331  
0.0612401895  
0.03655776118  
-0.00251237522  
-0.0547494305  
-0.1182833201  
-0.1907573596  
-0.2694594502  
-0.3514080551  
-0.4334079274  
-0.5120871949  
-0.5839575514  
-0.645509089  
-0.6933720828  
-0.7245274354  
-0.7365701624  
-0.7279719979  
-0.6983207403  
-0.6484803404  
-0.5806392247  
-0.4982277913  
-0.4056966623  
-0.308176481  
-0.2110551286  
-0.1195196599  
-0.03811198937  
0.02964590249  
0.08152086549  
0.1166997234  
0.1357820282  
0.1406266643  
0.134089978  
0.1196704444  
0.1011143231  
0.08201752825  
0.06546665666  
0.05376050909  
0.04823945477  
0.04924017575  
0.056179074  
0.06775131567  
0.08221930164  
0.09774687676  
0.1127323408  
0.1260878072  
0.137426052  
0.1471145807  
0.1561957888  
0.1661754581  
0.1787125451  
0.1952584552  
0.2167126391  
0.243133365  
0.2735830776  
0.3061194825  
0.3379582516  
0.3657812372  
0.3861592233  
0.3960305971  
0.3931617954  
0.3765287896  
0.3465522314  
0.3051580449  
0.2556247551  
0.2022520637  
0.1498666096  
0.1032341778  
0.06644423195  
0.04235393483  
0.03216470943  
0.03519974951  
0.04891936396  
0.06919358573  
0.09080269929  
0.1081165861  
0.1158609963  
0.1098692954  
0.08770363014  
0.04905471977  
-0.004162832371  
-0.06804255785  
-0.1372254292  
-0.2056757127  
-0.2675767052  
-0.318204254  
-0.3546251452  
-0.3761000016  
-0.3840985998  
-0.3819176693  
-0.3739423687  
-0.364674775  
-0.3577015817  
-0.3547882066  
-0.3553028204  
-0.3560983935  
-0.351935412  
-0.3364281425  
-0.3033870156  
-0.248357979  
-0.1701006914  
-0.07171122172  
0.03885228541  
0.1490258805  
0.2427392516  
0.3022874139  
0.3107602103  
0.2547103934  
0.1266543838  
-0.07300545293  
-0.3349861166  
-0.6413099204  
-0.9667266455  
-1.28127106  
-1.553632723  
-1.754912419  
-1.862223411  
-1.861636843  
-1.750019154  
-1.535517703  
-1.236593765  
-0.8797771515  
-0.4964447942  
-0.1190947635  
0.2223813735  
0.5039323041  
0.7096988949  
0.833221841  
0.8774233324  
0.8534524077  
0.7786082867  
0.6736863445  
0.5601211356  
0.4573045533  
0.3804197431  
0.339014  
0.3364512271  
0.3702302997  
0.4330572528  
0.5144698605  
0.6027351498  
0.6867342617  
0.7575705728  
0.809682295  
0.8413379859  
0.8544816939  
0.8540033456  
0.8465752848  
0.8392778959  
0.8382299725  
0.8474613967  
0.8681785433  
0.8985448114  
0.9339853197  
0.9679525147  
0.9930222899  
1.002135161  
0.9897879434  
0.9529833293  
0.89179399  
0.8094577538  
0.7119887325  
0.6073713686  
0.5044546845  
0.4117189327  
0.3361014985  
0.2820478949  
0.2509325876  
0.2409298042  
0.2473469091  
0.2633663935  
0.2810851094  
0.2926943584  
0.2916218953  
0.2734796926  
0.2366744464  
0.1826007949  
0.1153942229  
0.04128756403  
-0.03233122171  
-0.09801762067  
-0.1493632976  
-0.1819285537  
-0.1938769189  
-0.186236875  
-0.1627485767  
-0.1293353616  
-0.09328149027  
-0.06223814083  
-0.0431989924  
-0.04160146524  
-0.06065581642  
-0.1010011713  
-0.1607110253  
-0.2356444978  
-0.3200668322  
-0.4074476111  
-0.4913224564  
-0.5660933307  
-0.6276652074  
-0.6738473678  
-0.7044740309  
-0.721251011  
-0.7273618162  
-0.7269052514  
-0.7242408505  
-0.72334977  
-0.7272856498  
-0.7377925835  
-0.7551317192  
-0.7781394863  
-0.8044958837  
-0.8311556365  
-0.8548929214  
-0.8728527276  
-0.883044738  
-0.884696676  
-0.8784031138  
-0.8660529544  
-0.8505315265  
-0.8352465374  
-0.823543572  
-0.8180989373  
-0.8204026247  
-0.8304009386  
-0.8463802928  
-0.8651129668  
-0.8822577354  
-0.8929576795  
-0.8925536652  
-0.8772994684  
-0.8449714636  
-0.795263746  
-0.7299164051  
-0.6525317018  
-0.5681118414  
-0.4823820065  
-0.4009880044  
-0.328705016  
-0.2687650036  
-0.2224079432  
-0.1887307767  
-0.1648548543  
-0.1463760531  
-0.1280488423  
-0.1045879  
-0.07147278398  
-0.02563705876  
0.0340496888  
0.1065829487  
0.1889235035  
0.2763880125  
0.3632559846  
0.4435245628  
0.5116900672  
0.5634545643  
0.5962734974  
0.6096559301  
0.6052031332  
0.5863713446  
0.5580084516  
0.5257294334  
0.495212212  
0.4715241384  
0.4585452171  
0.4585718908  
0.4721449075  
0.4980963022  
0.5338204405  
0.5757044661  
0.6196735183  
0.6617691829  
0.6987031855  
0.7283093437  
0.7498453414  
0.7641102071  
0.7733496494  
0.7809554678  
0.7909851728  
0.8075408203  
0.8340888462  
0.872801607  
0.9240190196  
0.9859193801  
1.054486395  
1.12379938  
1.186661115  
1.235502659  
1.263466746  
1.265526134  
1.239472726  
1.186600829  
1.111950808  
1.024014302  
0.9338865094  
0.8539294962  
0.796100676  
0.7701597364  
0.7820376687  
0.8326272232  
0.9172388096  
1.025884357  
1.14443533  
1.256556207  
1.346206152  
1.400345478  
1.411441506  
1.379332098  
1.312052724  
1.225379897  
1.14096446  
1.083203792  
1.075170608  
1.134122977  
1.267253312  
1.468378061  
1.71619059  
1.97455898  
2.195078011  
2.321777393  
2.297556008  
2.071607004  
1.606899585  
0.8866746008  
-0.0810211028  
-1.261528651  
-2.594952848  
-4.000719783  
-5.384897465  
-6.649458888  
-7.702353627  
-8.467137918  
-8.890932448  
-8.949701777  
-8.650213432  
-8.028474075  
-7.14492713  
-6.077100538  
-4.910731533  
-3.73052868  
-2.611736567  
-1.613477264  
-0.7745643596  
-0.1120881912  
0.3772975772  
0.7138119679  
0.9293894832  
1.061754544  
1.148568628  
1.222407044  
1.307118276  
1.415893546  
1.551098909  
1.705684465  
1.865786915  
2.01402207  
2.1329268  
2.208033254  
2.230174934  
2.196769461  
2.11199014  
1.985896161  
1.832754022  
1.668848336  
1.510156379  
1.370222797  
1.258541296  
1.179630583  
1.132886353  
1.113183072  
1.112063488  
1.119308669  
1.124624366  
1.119192313  
1.096863247  
1.054856371  
0.9938955269  
0.9178108238  
0.8327114162  
0.7458806499  
0.6645790213  
0.5949484211  
0.5411569206  
0.5049027546  
0.4853186781  
0.4792577902  
0.4818877318  
0.4874869106  
0.4902967758  
0.4853179469  
0.4689279177  
0.4392485874  
0.3962393471  
0.3415154004  
0.2779505193  
0.2091377494  
0.1387967563  
0.07022319049  
0.005852436927  
-0.05300220828  
-0.1062207817  
-0.1547577398  
-0.2003625654  
-0.2452040543  
-0.2914466199  
-0.34084626  
-0.3944180689  
-0.4522131914  
-0.5132150847  
-0.5753756967  
-0.6357570832  
-0.6907803302  
-0.7365364724  
-0.769151549  
-0.7851615878  
-0.7818877449  
-0.7577787372  
-0.7126995208  
-0.6481252913  
-0.5672198352  
-0.4747532085  
-0.3768428911  
-0.2804976602  
-0.1929906138  
-0.1210909989  
-0.07023924923  
-0.04376310328  
-0.042260566  
-0.06326209632  
-0.1012644612  
-0.1482031742  
-0.1943365988  
-0.2294727758  
-0.2443870375  
-0.2322362143  
-0.1897384971  
-0.117919572  
-0.02225499784  
0.0878480458  
0.2002062676  
0.3015037001  
0.3791878679  
0.4233142938  
0.4280529314  
0.39259497  
0.3212996912  
0.2230546243  
0.1099523664  
