9319.592205  
9951.003619  
11246.39344  
13897.00676  
20282.58765  
31885.61993  
73270.6725  
34135.97174  
30547.4713  
32361.42112  
4564.237809  
25538.03739  
24161.80751  
38913.84121  
14011.85212  
8597.672013  
563.16142  
1183.357636  
12142.95011  
14951.97399  
2239.075179  
3368.494308  
429.0853398  
3044.897325  
194.5882942  
3920.290043  
3008.931858  
5188.268608  
3364.539654  
5058.712187  
1431.461002  
855.3124664  
6492.796366  
544.4426062  
2746.338892  
39.87961334  
3665.685806  
1566.002728  
86.33032961  
92.93578321  
3457.57473  
425.6415243  
2232.911954  
3414.111454  
398.4426785  
1445.402071  
1408.799839  
609.760014  
1559.60287  
2771.259896  
1606.287295  
1068.158368  
944.6393866  
425.85863  
1307.141827  
207.5483552  
1129.796748  
128.4698499  
96.62628481  
505.8660465  
396.4153424  
109.7637723  
206.5442428  
254.2627041  
529.2290367  
139.7308954  
129.0805617  
300.9552589  
117.0661877  
132.1967426  
158.7879838  
58.46382478  
37.61061566  
57.20240216  
46.96437677  
50.32190551  
49.4859302  
40.24443467  
41.9899437  
32.51886601  
36.10978721  
28.35102895  
29.23611324  
26.96421166  
25.26947547  
23.37371985  
21.7527372  
20.87929395  
19.45778918  
18.43619792  
17.00935889  
16.23573099  
15.45258645  
14.5889873  
13.85503092  
13.05823125  
12.36967976  
11.79376788  
11.1945103  
10.72055438  
10.14841113  
9.717057152  
9.271121099  
8.847396553  
8.454285455  
8.09494915  
7.749983998  
7.402332924  
7.091410923  
6.790279417  
6.52124811  
6.248949065  
5.997554769  
5.754397404  
5.526178862  
5.315674776  
5.112776665  
4.915305115  
4.73239645  
4.555521365  
4.387930984  
4.228021078  
4.075578965  
3.928828797  
3.789746889  
3.656189823  
3.529497764  
3.408025124  
3.291267522  
3.180000024  
3.073511294  
2.971368501  
2.873421883  
2.779516508  
2.689571118  
2.603070207  
2.520284966  
2.440621712  
2.364140426  
2.290647406  
2.220002184  
2.152036128  
2.08669087  
2.023828885  
1.963279024  
1.905037046  
1.84891107  
1.79483442  
1.742733649  
1.692482298  
1.644085765  
1.597360484  
1.552279405  
1.508741428  
1.466771433  
1.426226575  
1.387061986  
1.349229724  
1.312678721  
1.277331666  
1.243181946  
1.21012415  
1.178187747  
1.14727905  
1.117339474  
1.088401278  
1.060380996  
1.033222636  
1.006926573  
0.9814508874  
0.9567731288  
0.9328622891  
0.909689274  
0.8872037218  
0.8654120509  
0.8442692543  
0.8237793027  
0.8038801277  
0.7845818661  
0.765830222  
0.7476234727  
0.7299622117  
0.7128038856  
0.6961584621  
0.6799686632  
0.6642297899  
0.64895139  
0.6340788869  
0.619649771  
0.6056032686  
0.5919437654  
0.5786615397  
0.5657436041  
0.5531940772  
0.5409473865  
0.5290548239  
0.517476848  
0.5061939997  
0.4952198571  
0.4845328257  
0.4741146001  
0.4639860283  
0.4541063781  
0.4444736352  
0.4351157648  
0.4259720565  
0.417075037  
0.4083959437  
0.3999277132  
0.3916659182  
0.3836353106  
0.3757881711  
0.3681366298  
0.3606848549  
0.3533939223  
0.3462796862  
0.3393472322  
0.332577834  
0.3259603918  
0.3195240702  
0.3132343696  
0.3070785386  
0.3010791842  
0.2952185082  
0.2894893268  
0.2838949958  
0.2784417537  
0.2731007585  
0.2678859955  
0.2627819664  
0.2577995295  
0.2529378234  
0.2481784592  
0.2435224595  
0.2389669732  
0.2345235297  
0.2301760243  
0.2259276518  
0.2217659893  
0.2177034529  
0.2137118342  
0.2098208002  
0.2060115962  
0.2022860383  
0.1986320195  
0.1950633958  
0.1915714969  
0.1881511491  
0.1848016553  
0.1815237331  
0.1783155991  
0.1751728704  
0.1720899973  
0.1690875858  
0.1661247634  
0.1632320232  
0.1604052252  
0.1576314995  
0.1549061097  
0.1522411421  
0.1496355056  
0.1470790925  
0.1445724449  
0.1421232317  
0.1397118454  
0.1373538896  
0.1350451006  
0.1327758693  
0.1305483749  
0.1283648915  
0.1262297849  
0.1241387779  
0.1220832375  
0.1200647928  
0.1180894182  
0.1161524147  
0.1142492513  
0.1123832323  
0.1105520025  
0.1087573395  
0.1069937701  
0.105261816  
0.1035702039  
0.1019057944  
0.1002690913  
0.09866254669  
0.09708972378  
0.09553957829  
0.09403021766  
0.09254474303  
0.09108161614  
0.08964291942  
0.08823708992  
0.08685020637  
0.08549526332  
0.08415150913  
0.08284855599  
0.08155670314  
0.08029224086  
0.07905466321  
0.0778365012  
0.07663900174  
0.07546577851  
0.07430552686  
0.07317197964  
0.07205809014  
0.07095227711  
0.06987917988  
0.06882587102  
0.06778071246  
0.06676286559  
0.06575852441  
0.06477054435  
0.0637971647  
0.06284823183  
0.06190651158  
0.06098593059  
0.06007715022  
0.05918916337  
0.05831535188  
0.05745575672  
0.05660183208  
0.05577597348  
0.05495615723  
0.05415119281  
0.05336297792  
0.05258878503  
0.05182107984  
0.05106395874  
0.05032914732  
0.04960077046  
0.04888977672  
0.04817899634  
0.04749095951  
0.0468094961  
0.04614197863  
0.04548174438  
0.04483665674  
0.04419330762  
0.04357503219  
0.0429505408  
0.04234761956  
0.04175046814  
0.04116701941  
0.04058510494  
0.04001988612  
0.03945782089  
0.03890626244  
0.03836728118  
0.03783284458  
0.03731040303  
0.03679594304  
0.03629052799  
0.03579065289  
0.03529579926  
0.03481691522  
0.03433786541  
0.03387114389  
0.03341143243  
0.03295795808  
0.03251074076  
0.0320712976  
0.03163889994  
0.03121104081  
0.03079253488  
0.03038504353  
0.02997659784  
0.02957975647  
0.02918531937  
0.02879872223  
0.02841916074  
0.02804409215  
0.02767598202  
0.02731218546  
0.02695941623  
0.02660709795  
0.02626101377  
0.02592075995  
0.02558509037  
0.02525788162  
0.02493388899  
0.02461396027  
0.02429980325  
0.02399163641  
0.02368837636  
0.02338862869  
0.0230947133  
0.02280613394  
0.02252140181  
0.0222414649  
0.02196609824  
0.02169386403  
0.02142648166  
0.02116492278  
0.02090725909  
0.02065153232  
0.02039963992  
0.02015572221  
0.01991144556  
0.01967594501  
0.01944180741  
0.01921263679  
0.0189867412  
0.01876149389  
0.01854450941  
0.01833160714  
0.01811637927  
0.01790971832  
0.0177045783  
0.01750460874  
0.01731020587  
0.01711458534  
0.01692241121  
0.01673635705  
0.01655298931  
0.0163723783  
0.01619407916  
0.0160178553  
0.01584676333  
0.01567849043  
0.01551280597  
0.01535104277  
0.01519038932  
0.01503537592  
0.01488259506  
0.01473045564  
0.01458267742  
0.01443770855  
0.01429845469  
0.01415720348  
0.01402085908  
0.01388700189  
0.01375659114  
0.01362587717  
0.01350060938  
0.01337786271  
0.01325677857  
0.01313658962  
0.01302184369  
0.01290709345  
0.01279668414  
0.01268956717  
0.01258142788  
0.01247892185  
0.01237657011  
0.0122786246  
0.01218096699  
0.01208729323  
0.01199656168  
0.01190519755  
0.01181697102  
0.01173315265  
0.01165141577  
0.01156835811  
0.01149015668  
0.01141526729  
0.01133835022  
0.01126754125  
0.01119649737  
0.01113065887  
0.01106482984  
0.01099947329  
0.01093906837  
0.01087961263  
0.01082056346  
0.01076711898  
0.01071252045  
0.010661749  
0.01061256016  
0.01056516399  
0.0105171391  
0.01047696778  
0.01043534094  
0.01039644985  
0.01035953611  
0.01032271299  
0.01028882999  
0.01026054923  
0.01022945426  
0.01020137993  
0.01017506812  
0.0101506086  
0.01012980152  
0.01011039251  
0.01008936278  
0.01007604268  
0.01006309108  
0.01004901035  
0.01003965571  
0.01002868864  
0.0100231618  
0.01001765429  
0.01001531156  
0.01001406407  
