-0.1361726673  
0.1997364079  
0.5112910132  
0.7812810881  
0.9975461148  
1.154161128  
1.251685722  
1.296482384  
1.299236976  
1.272969688  
1.230864144  
1.18429909  
1.141393523  
1.106271464  
1.079140929  
1.057122661  
1.035632736  
1.010040421  
0.9772748079  
0.9370721304  
0.8926108125  
0.850413851  
0.8194945868  
0.8098868621  
0.8307891839  
0.8886379682  
0.9854520124  
1.117736422  
1.276185105  
1.446264014  
1.609650059  
1.746325142  
1.83705397  
1.865867528  
1.822198513  
1.702332512  
1.509976311  
1.255853284  
0.9563968955  
0.6317456206  
0.3033520126  
-0.008460776408  
-0.2866366943  
-0.5189553119  
-0.698840121  
-0.8253620326  
-0.9024877241  
-0.9377560199  
-0.9405978264  
-0.9205805221  
-0.8858290024  
-0.8418364432  
-0.7908172056  
-0.731656374  
-0.6604426189  
-0.5714800734  
-0.4586190423  
-0.316711219  
-0.1429818888  
0.06187745825  
0.2930523481  
0.5414754786  
0.7942702546  
1.035709319  
1.248608571  
1.415971208  
1.522716041  
1.55727135  
1.51285763  
1.388296277  
1.188257439  
0.9229030218  
0.6069703265  
0.2583986052  
-0.1033543015  
-0.4591064774  
-0.7916609732  
-1.087244059  
-1.336513806  
-1.535040984  
-1.683230343  
-1.785702286  
-1.850238889  
-1.886437092  
-1.904238963  
-1.912530195  
-1.917977101  
-1.924232902  
-1.931603969  
-1.937191062  
-1.935474044  
-1.919240249  
-1.88073264  
-1.812851063  
-1.710268896  
-1.570316404  
-1.393542234  
-1.183886919  
-0.9484693959  
-0.6970171535  
-0.4410127113  
-0.1926640146  
0.036201371  
0.2351909976  
0.3962565639  
0.5143663949  
0.5878816794  
0.6186062048  
0.6115108591  
0.5741554543  
0.5158771723  
0.4468206183  
0.3769120214  
0.3148809686  
0.2674335651  
0.2386620958  
0.2297509142  
0.2390089222  
0.2622152096  
0.2932330946  
0.3248103162  
0.3494778866  
0.3604286854  
0.3522854918  
0.3216633748  
0.2674815242  
0.1909964756  
0.09557113159  
-0.0137623949  
-0.1308818174  
-0.2491899163  
-0.3621818803  
-0.4638780846  
-0.5490695067  
-0.6133616361  
-0.6530378792  
-0.6648120829  
-0.6455642557  
-0.5921669573  
-0.5014911091  
-0.370677845  
-0.1976676256  
0.01804682133  
0.2745542542  
0.5667080515  
0.885542814  
1.21809441  
1.547768004  
1.855300565  
2.120286023  
2.323107435  
2.447058816  
2.480338488  
2.417622198  
2.260929722  
2.01961971  
1.709443881  
1.350774636  
0.9662360562  
0.5780843195  
0.2057394885  
-0.1361539307  
-0.4388476293  
-0.699620237  
-0.9209500647  
-1.108889092  
-1.270964737  
-1.41399375  
-1.542205909  
-1.656008284  
-1.751610154  
-1.821547806  
-1.856003854  
-1.844677392  
-1.778852464  
-1.653297536  
-1.467659246  
-1.227118553  
-0.9421896053  
-0.6277055637  
-0.3011719727  
0.01924256218  
0.3167479264  
0.5776908989  
0.7927584884  
0.9574820017  
1.071998332  
1.140159099  
1.168180845  
1.163105553  
1.131345442  
1.07757743  
1.004160759  
0.9111714316  
0.7970256986  
0.6595517667  
0.4973006208  
0.3108335555  
0.1037345711  
-0.1168729375  
-0.3404263736  
-0.5536715662  
-0.7419609286  
-0.8909228913  
-0.9882507707  
-1.025333368  
-0.99847238  
-0.909495029  
-0.7656738022  
-0.5789652716  
-0.3646866152  
-0.1398405962  
0.07866667534  
0.2756671444  
0.439017304  
0.5603965463  
0.635571364  
0.6641702605  
0.649077592  
0.5956170353  
0.5106778566  
0.4019303156  
0.2772144165  
0.1441384302  
0.009859527476  
-0.1190252341  
-0.2365453401  
-0.3374684485  
-0.4174832911  
-0.473467863  
-0.5037904079  
-0.5085826361  
-0.4898946078  
-0.4516634871  
-0.3994445355  
-0.339911452  
-0.2801637304  
-0.2269295962  
-0.1857741249  
-0.1604359114  
-0.152387687  
-0.1607005635  
-0.1822347298  
-0.2121321538  
-0.2445408655  
-0.2734689945  
-0.2936444043  
-0.3012530748  
-0.2944645098  
-0.2736569114  
-0.2413301689  
-0.2017215962  
-0.1601823904  
-0.1224172767  
-0.09369243089  
-0.07813029383  
-0.07818432033  
-0.09435832146  
-0.1252048397  
-0.1675788481  
-0.2171018591  
-0.2687564412  
-0.3175118143  
-0.3588983184  
-0.3894457548  
-0.4069300203  
-0.4104166092  
-0.4001072219  
-0.3770374723  
-0.3426874938  
-0.2985953156  
-0.2460400495  
-0.1858587099  
-0.1184389206  
-0.04387695487  
0.03771502954  
0.1258315775  
0.2191948564  
0.3154703755  
0.4111459778  
0.5016306322  
0.5815723793  
0.6453868323  
0.6879042519  
0.7050597657  
0.694498303  
0.6560053628  
0.5916707297  
0.5057505309  
0.4042401574  
0.294213344  
0.1830255331  
0.07751459327  
-0.01668980983  
-0.09563325179  
-0.1572239798  
-0.2011257007  
-0.2284083909  
-0.241034042  
-0.2413105824  
-0.2314193674  
-0.2131266614  
-0.1877258141  
-0.1562184931  
-0.1196743328  
-0.0796733551  
-0.0387029366  
-0.0003884508637  
0.03053603388  
0.04856304283  
0.04803911372  
0.02399537678  
-0.02694054896  
-0.105711541  
-0.2102373246  
-0.3351866275  
-0.4721985079  
-0.6105563753  
-0.7382528226  
-0.8433206792  
-0.9152495327  
-0.9462959404  
-0.9324906572  
-0.8742074192  
-0.7761816809  
-0.6469805403  
-0.4979770883  
-0.341966979  
-0.1916091338  
-0.05789857418  
0.05111499256  
0.1312094547  
0.1823412507  
0.2084511985  
0.216741012  
0.2165442613  
0.217955335  
0.2303951746  
0.26131426  
0.315197356  
0.3929810129  
0.4919464056  
0.6060825348  
0.7268466762  
0.8442077143  
0.9478344047  
1.028267885  
1.077941628  
1.091926744  
1.068334295  
1.008343846  
0.9158804255  
0.7970007428  
0.6590993829  
0.5100375554  
0.357324959  
0.2074610406  
0.0655094983  
-0.06505747316  
-0.1822462685  
-0.2852233481  
-0.3738631888  
-0.4482758349  
-0.5084052464  
-0.5537922559  
-0.5835397882  
-0.5964856215  
-0.5915453185  
-0.568140042  
-0.5266186283  
-0.4685665629  
-0.3969213457  
-0.3158477942  
-0.2303792195  
-0.1458531588  
-0.06725802295  
0.00142128138  
0.05772148464  
0.1009958688  
0.132407316  
0.1546188185  
0.1712212253  
0.1859821977  
0.2020522014  
0.2212550452  
0.2435963752  
0.2670748633  
0.2878431654  
0.3007062926  
0.29987497  
0.2798788529  
0.2364928406  
0.1675354872  
0.0734245982  
-0.04260236994  
-0.1746251497  
-0.3145318023  
-0.4527843846  
-0.5793675897  
-0.6847842023  
-0.7609916555  
-0.8021545297  
-0.8051535948  
-0.7698063362  
-0.698798132  
-0.5973673844  
-0.4727836071  
-0.3337057593  
-0.1894669014  
-0.04936860612  
0.07798548008  
0.1852574702  
0.2668340905  
0.3191398382  
0.3408049501  
0.332668917  
0.2976250635  
0.2403177739  
0.1667003713  
0.08349327003  
-0.002421263261  
-0.08462463258  
-0.1577440316  
-0.2179419092  
-0.2632658004  
-0.2938150406  
-0.3116969528  
-0.3207855411  
-0.3262758314  
-0.3341087808  
-0.3502879357  
-0.3801871405  
-0.4279157079  
-0.4958081837  
-0.58410444  
-0.6908577446  
-0.8120765491  
-0.9420882603  
-1.07408378  
-1.200760954  
-1.315010511  
-1.410534107  
-1.482336996  
-1.527040754  
-1.542981383  
-1.530102564  
-1.489677048  
-1.423916171  
-1.335535883  
-1.227345136  
-1.101926424  
-0.9614393722  
-0.8075631239  
-0.6415593763  
-0.4644328279  
-0.2771177218  
-0.08066480482  
0.1236326902  
0.3341872485  
0.5491461345  
0.7664836746  
0.9841118113  
1.199982695  
1.412127571  
1.618611775  
1.817398578  
2.006131242  
2.181869235  
2.340839162  
2.478243064  
2.58821011  
2.663917654  
2.697930201  
2.682754524  
2.611582676  
2.479175247  
2.282792641  
2.0230751  
1.704750922  
1.337059819  
0.9337938775  
0.512880107  
0.09549423126  
-0.2952847488  
-0.6361840338  
-0.9056712267  
-1.085941676  
-1.164738712  
-1.136806987  
-1.004784034  
-0.7793930195  
-0.4788657904  
-0.1276190241  
0.2457278205  
0.6107930678  
0.9380956617  
1.201653557  
1.381240453  
1.464053001  
1.445610919  
1.32979054  
1.128024368  
0.8577531142  
0.5403519138  
0.1987683101  
-0.1448295019  
-0.4711283626  
-0.7652401699  
-1.017615634  
-1.224226407  
-1.386066507  
-1.508080803  
-1.597716267  
-1.66333177  
-1.712690121  
-1.751750464  
-1.783907843  
-1.809751147  
-1.827338282  
-1.832897129  
-1.82181137  
-1.789712689  
-1.733492247  
-1.652075902  
-1.546842147  
-1.421639563  
-1.282409208  
-1.136487008  
-0.9917082967  
-0.8554494502  
-0.733753673  
-0.6306550965  
-0.5477946535  
-0.4843562718  
-0.437314202  
-0.4019482174  
-0.3725385471  
-0.3431454954  
-0.3083778675  
-0.2640529807  
-0.2076898571  
-0.1387810008  
-0.05882732586  
0.0288535755  
0.1195161507  
0.2075229981  
0.2869648791  
0.3522999973  
0.3989425843  
0.4237410354  
0.4253063235  
0.4041584879  
0.3626930398  
0.3049714091  
0.2363776933  
0.1631815585  
0.09205153839  
0.02957299522  
-0.01819694881  
-0.04611055281  
-0.05023543546  
-0.02807994028  
0.0212553646  
0.09698744612  
0.1966325124  
0.3160451315  
0.4495475162  
0.5901311737  
0.7297725107  
0.8598444481  
0.9716251881  
1.056873859  
1.108436491  
1.12081879  
1.090669906  
1.017116044  
0.9018871036  
0.7492248382  
0.5655587609  
0.35899252  
0.1386480741  
-0.08604162941  
-0.306023171  
-0.5132071058  
-0.700883322  
-0.863939877  
-0.9988683473  
-1.10358474  
-1.177113222  
-1.219194817  
-1.229903087  
-1.209322879  
-1.157358033  
-1.07369713  
-0.9579456726  
-0.8099099202  
-0.6299875575  
-0.4196083928  
-0.1816602698  
0.0791774256  
0.3562538245  
0.6409685215  
0.9230336366  
1.190972031  
1.432835222  
1.637089807  
1.79358005  
1.894484834  
1.935147559  
1.914670354  
1.836198406  
1.706810328  
1.537022829  
1.339922715  
1.130000884  
0.92181987  
0.7286387374  
0.5611525365  
0.4264946877  
0.3276073582  
0.2630602014  
0.2273415704  
0.2115964096  
0.2047258978  
0.1947398833  
0.1702151147  
0.1216873687  
0.04284552841  
-0.06863173783  
-0.21067665  
-0.3769255881  
-0.557313913  
-0.7390963102  
-0.9081946094  
-1.050719732  
-1.154491986  
-1.210381957  
-1.213323314  
-1.162865337  
-1.063213304  
-0.9227498731  
-0.7531039779  
-0.5678824134  
-0.3812218365  
-0.2063406245  
-0.05424815354  
0.06721974026  
0.1539589943  
0.205687269  
0.225586661  
0.2195595605  
0.1952189469  
0.1607544262  
0.1238309621  
0.0906456018  
0.06527248476  
0.04933652827  
0.0420419226  
0.04051402037  
0.04038361897  
0.03650827334  
0.02373069669  
-0.002418504993  
-0.0451703592  
-0.1061452649  
-0.1851945695  
-0.2804430061  
-0.3885062781  
-0.5048382732  
-0.6241717647  
-0.7409972165  
-0.8500426784  
-0.9467219649  
-1.027512682  
-1.090233885  
-1.134214354  
-1.160313168  
-1.17079179  
-1.169053461  
-1.159243837  
-1.145775948  
-1.13281775  
-1.123814706  
-1.121105964  
-1.125694599  
-1.137196942  
-1.153989963  
-1.173510482  
-1.192676894  
-1.208334466  
-1.217663383  
-1.21846443  
-1.209285614  
-1.189364407  
-1.158413241  
-1.116294281  
-1.062675462  
-0.9967340622  
-0.9169992862  
-0.821382721  
-0.7074181482  
-0.5726846056  
-0.4153649082  
-0.2348415728  
-0.03223685163  
0.189210472  
0.4240022278  
0.6645390241  
0.901569198  
1.124902614  
1.324312227  
1.490518337  
1.616124111  
1.696413581  
1.729875996  
1.718435875  
1.667335706  
1.584707425  
1.480895903  
1.367599339  
1.256930548  
1.160472753  
1.088411409  
1.048776927  
1.046837902  
1.084654244  
1.160803966  
1.270292492  
1.404675955  
1.552401916  
1.699416506  
1.830035807  
1.928066957  
1.978143438  
1.967172047  
1.885759838  
1.729464221  
1.499677796  
1.203993826  
0.8559363897  
0.4740037596  
0.08007389334  
-0.3026731488  
-0.6521104743  
-0.9494784148  
-1.181366169  
-1.341072958  
-1.429136398  
-1.452939033  
-1.425423822  
-1.363093027  
-1.283569726  
-1.203075701  
-1.134193095  
-1.084234234  
-1.054460643  
-1.040243714  
-1.032134372  
-1.017657244  
-0.9835379053  
-0.9180186525  
-0.8129038972  
-0.6650427264  
-0.4770358159  
-0.2570969714  
-0.01811014364  
0.2239380188  
0.4519074668  
0.6495461803  
0.8033348216  
0.9039135261  
0.9469270568  
0.9332254989  
0.8684642739  
0.7621894278  
0.6265910666  
0.4750899729  
0.3209517308  
0.1760875893  
0.05014157207  
-0.05006062421  
-0.1207036791  
-0.1608408754  
-0.1720030033  
-0.157646656  
-0.1225376113  
-0.07217110312  
-0.0122798988  
0.05151700476  
0.1139220543  
0.1700495122  
0.2154411808  
0.2460626307  
0.2583344347  
0.2492459338  
0.2165677829  
0.1591556549  
0.07731037476  
-0.02686807226  
-0.1492108384  
-0.2833659115  
-0.4209207669  
-0.5517863363  
-0.6648715377  
-0.74899069  
-0.79395101  
-0.791694963  
-0.7373819201  
-0.6302641954  
-0.4742417382  
-0.277992302  
-0.05463473488  
0.1790878629  
0.4040501516  
0.6003088429  
0.7488493838  
0.8333375202  
0.8417000905  
0.7673599113  
0.6099795956  
0.3756242904  
0.07630183854  
-0.271069636  
-0.6461905728  
-1.027217815  
-1.392739267  
-1.723640063  
-2.004674321  
-2.225553643  
-2.38143834  
-2.47279896  
-2.504672659  
-2.48544228  
-2.425315179  
-2.33471181  
-2.222804955  
-2.096394847  
-1.959289619  
-1.81225007  
-1.653502993  
-1.479713937  
-1.287254372  
-1.07354383  
-0.8382393402  
-0.5840540901  
-0.3170641565  
-0.04642696312  
0.216457509  
0.4592322544  
0.6701189797  
0.8394668881  
0.9610793262  
1.033096445  
1.058305466  
1.043806584  
1.000100023  
0.9397115012  
0.8755735214  
0.8193979655  
0.7802750615  
0.7636931615  
0.771114753  
0.8001191735  
0.8450954396  
0.8983111903  
0.9512112086  
0.9957126074  
1.025319491  
1.035900262  
1.026049935  
0.9970130943  
0.9522366525  
0.8966555047  
0.8358601397  
0.7752780674  
0.7195101287  
0.6718849241  
0.6342743383  
0.6071394623  
0.5897496435  
0.5804908813  
0.5771646107  
0.5772277741  
0.5779136504  
0.5762654898  
0.5690923525  
0.5529506628  
0.5242052243  
0.4792548865  
0.414945583  
0.3291688531  
0.2215797723  
0.09431916759  
-0.04740179721  
-0.1950212526  
-0.3367712288  
-0.4583486842  
-0.544112044  
-0.5787299131  
-0.5491150129  
-0.4463991365  
-0.2676702298  
-0.01719799301  
0.2930966034  
0.6440696737  
1.010707855  
1.364311788  
1.675280873  
1.916189713  
2.064763698  
2.106391324  
2.03583713  
1.857921326  
1.587068446  
1.245757213  
0.8620722982  
0.4666362272  
0.08931437715  
-0.2439138521  
-0.513538413  
-0.7082629587  
-0.8257187036  
-0.8721018392  
-0.8608211077  
-0.8103721788  
-0.7417290563  
-0.6756117691  
-0.6299688613  
-0.6179818933  
-0.6468014614  
-0.7171329776  
-0.8236556051  
-0.9561716872  
-1.101281698  
-1.244335015  
-1.371391925  
-1.470943541  
-1.535201367  
-1.560824967  
-1.549042397  
-1.505206862  
-1.437885291  
-1.35763407  
-1.27563667  
-1.202375567  
-1.146482675  
-1.113902287  
-1.107400567  
-1.126471709  
-1.167589035  
-1.224751036  
-1.290232518  
-1.355435787  
-1.4117481  
-1.45130626  
-1.46759578  
-1.455831509  
-1.413102763  
-1.338281403  
-1.231744449  
-1.094968483  
-0.930077993  
-0.7394447227  
-0.5253992455  
-0.2901308131  
-0.03578084623  
0.2352787728  
0.5200508075  
0.8144800171  
1.113094287  
1.408826816  
1.69307581  
1.956063913  
2.18745546  
2.377183358  
2.516358847  
2.598138485  
2.618424743  
2.576265957  
2.473931971  
2.316630309  
2.111934826  
1.869019846  
1.597822466  
1.308255355  
1.009578298  
0.7099743398  
0.4163510781  
