-0.5322478897  
-0.4563371141  
-0.3716949754  
-0.2807046755  
-0.1880257742  
-0.1005464949  
-0.02678920252  
0.02420575902  
0.04434874383  
0.02807903476  
-0.02624082647  
-0.1154144693  
-0.2311901585  
-0.3608558843  
-0.4886207156  
-0.5976217697  
-0.6722710186  
-0.7005942517  
-0.6761846482  
-0.5994312462  
-0.4777857943  
-0.3249640081  
-0.1591397568  
-0.0003517943503  
0.1325385656  
0.2248706973  
0.2687452094  
0.2646670656  
0.221951122  
0.1577338441  
0.09462304504  
0.05724017976  
0.06812523818  
0.1435573977  
0.2899890487  
0.5016920866  
0.7601093478  
1.035188139  
1.28866365  
1.47897569  
1.567210488  
1.523236487  
1.331144229  
0.9930860045  
0.5308387565  
-0.01530835326  
-0.5903477261  
-1.130642964  
-1.571544119  
-1.855527479  
-1.939728501  
-1.801800431  
-1.443264711  
-0.8898597049  
-0.1888483433  
0.5963712937  
1.393592452  
2.130068324  
2.740658291  
3.174800785  
3.401500451  
3.411811677  
3.218634247  
2.854039602  
2.364570003  
1.805232441  
1.232980914  
0.7004701728  
0.2507941334  
-0.0862717056  
-0.29623505  
-0.3799582541  
-0.3520181895  
-0.2376589022  
-0.06883055395  
0.1201714702  
0.2969211777  
0.4344612681  
0.5139082649  
0.5258524544  
0.4704688446  
0.356441155  
0.1989163826  
0.01682551617  
-0.1700419109  
-0.3438094964  
-0.4907813417  
-0.6029495789  
-0.6785602734  
-0.7217621225  
-0.7414075963  
-0.749270705  
-0.7579268231  
-0.7786490491  
-0.8195968248  
-0.8845573809  
-0.9723818064  
-1.077165151  
-1.189121904  
-1.296001203  
-1.384836822  
-1.443764554  
-1.463687016  
-1.439552154  
-1.371091737  
-1.262947499  
-1.124173265  
-0.9671981924  
-0.8064018134  
-0.6564789684  
-0.5308022584  
-0.4400045817  
-0.3909137849  
-0.3859760017  
-0.4232043711  
-0.4966243453  
-0.5971358923  
-0.713636746  
-0.8342800436  
-0.9476728135  
-1.043887208  
-1.115209085  
-1.156536807  
-1.165463339  
-1.142091991  
-1.088648448  
-1.008991843  
-0.9081234805  
-0.7917370006  
-0.6658639458  
-0.5366087672  
-0.4099457891  
-0.2915289554  
-0.1864827009  
-0.09910676471  
-0.03254193269  
0.01161924302  
0.03369720577  
0.03615685398  
0.0236601274  
0.002823477479  
-0.01832861382  
-0.03121028212  
-0.02772322967  
-0.001403492648  
0.05152108671  
0.131335567  
0.2344526961  
0.3535551023  
0.4782899915  
0.5964624475  
0.6956039796  
0.7646937346  
0.7958134994  
0.7854750733  
0.7354232257  
0.6527547305  
0.549311324  
0.4403773477  
0.3428339585  
0.272998234  
0.2444294288  
0.265995629  
0.3405053507  
0.4640927076  
0.6264861949  
0.8121585011  
1.002230746  
1.176878941  
1.317936168  
1.411333012  
1.44902738  
1.43015644  
1.361233597  
1.255342581  
1.130447776  
1.007008804  
0.9052422949  
0.8423901069  
0.8303543373  
0.87403017  
0.9705436944  
1.109505889  
1.274245592  
1.443838506  
1.595678988  
1.708246108  
1.76369822  
1.749992865  
1.662249424  
1.503207313  
1.282763455  
1.016657197  
0.724494023  
0.4273935664  
0.1455554318  
-0.1039441114  
-0.3088599376  
-0.4627967222  
-0.5654570233  
-0.6221124559  
-0.6424470336  
-0.6389240604  
-0.6249676892  
-0.6131756301  
-0.6138347268  
-0.6338852018  
-0.6764547518  
-0.7409482846  
-0.8236287532  
-0.9185262706  
-1.018512145  
-1.116332935  
-1.205469872  
-1.280705698  
-1.338374426  
-1.376319423  
-1.393644834  
-1.390372978  
-1.367127792  
-1.324934694  
-1.265193246  
-1.189834006  
-1.101584187  
-1.004269721  
-0.9030333058  
-0.8043677638  
-0.715872504  
-0.6457286196  
-0.6018968393  
-0.5911564969  
-0.6180861731  
-0.6841661787  
-0.787149284  
-0.9208279429  
-1.075272628  
-1.237551148  
-1.392886765  
-1.526124345  
-1.623331468  
-1.67336663  
-1.669176693  
-1.608677882  
-1.495088545  
-1.336621449  
-1.145587847  
-0.936979406  
-0.7266945196  
-0.5296333276  
-0.3578906098  
-0.2192936603  
-0.1164765425  
-0.04663000664  
-0.001977611531  
0.02908446591  
0.06030110123  
0.1055666598  
0.1768811032  
0.2825314379  
0.4257499401  
0.6040440768  
0.8093023919  
1.02867403  
1.246130802  
1.444519505  
1.607833623  
1.72342088  
1.783827402  
1.788021664  
1.741815394  
1.65738333  
1.551924922  
1.445591841  
1.358915681  
1.310067281  
1.31227109  
1.37173613  
1.486389142  
1.645609607  
1.831046123  
2.018456439  
2.180360212  
2.289219743  
2.320735307  
2.256861738  
2.088139226  
1.815056316  
1.448247474  
1.007495712  
0.5196676153  
0.01583329033  
-0.4720752073  
-0.9146423689  
-1.287977525  
-1.576004393  
-1.771756757  
-1.877566765  
-1.904143291  
-1.868700041  
-1.792393049  
-1.69740861  
-1.604081512  
-1.528411581  
-1.480273288  
-1.462527222  
-1.471133791  
-1.496197828  
-1.523799183  
-1.538335981  
-1.525051852  
-1.472400198  
-1.373924998  
-1.22941638  
-1.045180038  
-0.8333966621  
-0.6106803389  
-0.3960094131  
-0.2083262464  
-0.06410845527  
0.02476998409  
0.05262494852  
0.02079630097  
-0.06238257233  
-0.1824684679  
-0.3205604  
-0.4555149796  
-0.5664931773  
-0.6355120963  
-0.6497180758  
-0.6030829228  
-0.4973200671  
-0.3418465669  
-0.1527997455  
0.04885821286  
0.2399272084  
0.3979882765  
0.504490059  
0.5475345964  
0.523956914  
0.4404282992  
0.3133345412  
0.1673707255  
0.03294379411  
-0.05735711661  
-0.07284044334  
0.01118876107  
0.2097954936  
0.5258059337  
0.9485755027  
1.454361965  
2.008334813  
2.567980173  
3.087507454  
3.522699297  
3.835586789  
3.998360304  
3.996052841  
3.827693711  
3.505853841  
3.054743895  
2.507166106  
1.900782675  
1.274197103  
0.6633357963  
0.09851101089  
-0.397570273  
-0.8107251349  
-1.135203387  
-1.372728004  
-1.530938734  
-1.621495883  
-1.65815776  
-1.655031646  
-1.625184592  
-1.579697338  
-1.527161165  
-1.473590113  
-1.422649323  
-1.376107853  
-1.334395914  
-1.297189708  
-1.263932095  
-1.234235125  
-1.208146245  
-1.186227772  
-1.169483046  
-1.159115065  
-1.156170567  
-1.161097728  
-1.17330543  
-1.190776079  
-1.209825862  
-1.225094209  
-1.229809775  
-1.216364779  
-1.177182914  
-1.10579743  
-0.9980382211  
-0.8531284053  
-0.6745404992  
-0.4703959136  
-0.2532855274  
-0.03943486676  
0.1527700933  
0.3047607721  
0.4000485065  
0.4264724118  
0.3781185169  
0.2565811986  
0.07136288173  
-0.1607344205  
-0.4171898745  
-0.6721530162  
-0.8993491272  
-1.075120466  
-1.181178614  
-1.206712149  
-1.149541855  
-1.016156151  
-0.8206713175  
-0.5828250971  
-0.325339942  
-0.07099481529  
0.1601505599  
0.3530336042  
0.4990721587  
0.5966723822  
0.6507543428  
0.6713966185  
0.6718376061  
0.6661519513  
0.6669489629  
0.6834367448  
0.7201309083  
0.7763804912  
0.8467524106  
0.9222066256  
0.9918461576  
1.044942386  
1.072900402  
1.070840639  
1.038507213  
0.980365354  
0.9048476179  
0.8228790775  
0.745922927  
0.6838826448  
0.6432295671  
0.6256928495  
0.6277556377  
0.6410770918  
0.6537907125  
0.6524845921  
0.6245535059  
0.5605109115  
0.4558789735  
0.3123241698  
0.1378122702  
-0.0542607389  
-0.2468329423  
-0.4215872058  
-0.5615974055  
-0.6538095371  
-0.6909616623  
-0.6726261364  
-0.6052494727  
-0.5011797636  
-0.3768555564  
-0.2504544731  
-0.1393657833  
-0.05786394157  
-0.01530843646  
-0.01510642456  
-0.05453472755  
-0.1253929474  
-0.2153519014  
-0.3097598481  
-0.3936134624  
-0.4534495386  
-0.4788840125  
-0.4636517384  
-0.4060477413  
-0.3087803347  
-0.178325048  
-0.02388426132  
0.1438250313  
0.3138326426  
0.4760425444  
0.6221083112  
0.7460083434  
0.8442709585  
0.9158922886  
0.9620019675  
0.9853410139  
0.9896612613  
0.9791001144  
0.9576138235  
0.928507894  
0.8941037881  
0.8555404103  
0.8127277636  
0.7644408095  
0.7085401767  
0.6422977299  
0.562815165  
0.4674890566  
0.3544771639  
0.2231190023  
0.0742523912  
-0.08963158794  
-0.2644098404  
-0.444565386  
-0.6235916173  
-0.7945400147  
-0.9506288872  
-1.085837869  
-1.195417754  
-1.276230221  
-1.326916815  
-1.347851592  
-1.340933714  
-1.309249467  
-1.256670114  
-1.187452424  
-1.10588392  
-1.016025812  
-0.9215420234  
-0.8256390256  
-0.7310703984  
-0.6401940277  
-0.5550450703  
-0.4773955084  
-0.4087868954  
-0.3505234944  
-0.3036223842  
-0.2687352467  
-0.2460440376  
-0.2351659327  
-0.235079989  
-0.2440959049  
-0.2598960132  
-0.2796550162  
-0.3002342898  
-0.3184436191  
-0.3313378016  
-0.3365127346  
-0.3323472937  
-0.3181636111  
-0.2942647731  
-0.2618529791  
-0.22282984  
-0.179510381  
-0.1343090014  
-0.08943247539  
-0.04663504284  
-0.007069478685  
0.02877020362  
0.0610009171  
0.09024071748  
0.1174737767  
0.143901985  
0.170830246  
0.1995791021  
0.2314207355  
0.26751658  
0.3088295598  
0.3560059864  
0.4091870162  
0.4678078783  
0.5303838603  
0.5943539555  
0.6560342893  
0.7107267203  
0.7530194197  
0.7772708518  
0.7782366531  
0.7517556995  
0.6954221128  
0.6091037428  
0.4952311693  
0.3587928023  
0.2069973896  
0.04864014837  
-0.1067685952  
-0.2499869388  
-0.3730433525  
-0.4700792634  
-0.5379642905  
-0.5765726449  
-0.5886936595  
-0.5795803139  
-0.5561976248  
-0.5262688076  
-0.497222516  
-0.4752005738  
-0.4642197165  
-0.4656137844  
-0.4778091021  
-0.496458717  
-0.5149353088  
-0.5251054729  
-0.5183151365  
-0.4864699248  
-0.4231022727  
-0.3242989748  
-0.1894088029  
-0.0214140976  
0.1730444327  
0.3840455717  
0.5991419688  
0.8044223742  
0.9858118015  
1.130472736  
1.228160121  
1.272375786  
1.261179751  
1.197531201  
1.089100984  
0.9475438948  
0.7873002388  
0.6240501798  
0.4730190909  
0.3473355594  
0.2566609334  
0.2062655652  
0.196671442  
0.223896257  
0.280248616  
0.3555650855  
0.4386759263  
0.5189161181  
0.5874418553  
0.6381919686  
0.6683555198  
0.6783175539  
0.6710872081  
0.6513388394  
0.624211247  
0.5940713546  
0.5634479731  
0.5323142464  
0.4978695914  
0.4548493948  
0.3963662024  
0.3151673549  
0.2051024553  
0.06258071361  
-0.1122306296  
-0.3146896573  
-0.5356034547  
-0.7618512409  
-0.9776517501  
-1.16631597  
-1.312251306  
-1.402919159  
-1.430455589  
-1.392710919  
-1.293547803  
-1.142370794  
-0.9529417826  
-0.7416807993  
-0.5257056799  
-0.3209028056  
-0.1403054204  
0.007005431772  
0.1163581412  
0.1872864397  
0.2227696717  
0.2280795416  
0.2094858441  
0.1730243415  
0.12355833  
0.06424054511  
-0.003559130801  
-0.07991914282  
-0.165726518  
-0.2618939263  
-0.3686038604  
-0.4847394435  
-0.6075892017  
-0.7328772432  
-0.8551089321  
-0.9681371624  
-1.065870066  
-1.14297882  
-1.195512477  
-1.221325109  
-1.220286216  
-1.194229434  
-1.146695308  
-1.082497621  
-1.007181442  
-0.9264303447  
-0.8455094707  
-0.7687713711  
-0.6992774001  
-0.6385640847  
-0.5865554085  
-0.5416230453  
-0.5007986081  
-0.460096731  
-0.414959626  
-0.3607685521  
-0.2934114042  
-0.2098550993  
-0.1086843938  
0.009460840491  
0.1415956057  
0.2823062169  
0.4239363138  
0.5570420961  
0.6711357391  
0.7556540223  
0.8010898109  
0.8001571814  
0.7488641641  
0.6473293944  
0.5002303676  
0.3167550185  
0.1100494642  
-0.1038553709  
-0.3075195148  
-0.4838254638  
-0.6177536969  
-0.6979850885  
-0.7181263383  
-0.6773700556  
-0.5805360394  
-0.4374270919  
-0.2616368954  
-0.06892981907  
0.1245911716  
0.3043006882  
0.4586086414  
0.5800888323  
0.6660732821  
0.7186128415  
0.7438875904  
0.7511257898  
0.7512140029  
0.755154764  
0.7726009025  
0.8106141307  
0.8728098089  
0.9589713519  
1.065162188  
1.184306267  
1.307135155  
1.423387289  
1.523070615  
1.597655572  
1.641025461  
1.650078662  
1.624925791  
1.568667078  
1.486803497  
1.386383042  
1.275003932  
1.159822068  
1.046707848  
0.9396409441  
0.8404352539  
0.7487971681  
0.6626999235  
0.5789863111  
0.4941146991  
0.4049230049  
0.3092935289  
0.2066321638  
0.0980958217  
-0.0134615555  
-0.1238048242  
-0.2278303793  
-0.3202292235  
-0.3961541167  
-0.4518401249  
-0.4850611325  
-0.4953678557  
-0.4840929945  
-0.4541058041  
-0.4094001674  
-0.3545445834  
-0.2941269618  
-0.232253023  
-0.1722055747  
-0.1162855889  
-0.06586872012  
-0.02165640149  
0.01595577561  
0.04644799326  
0.06880227456  
0.08124827389  
0.08120732832  
0.06545425609  
0.03048730327  
-0.02694171552  
-0.1092271634  
-0.2173342516  
-0.3503586545  
-0.5052842965  
-0.6770158616  
-0.8586740684  
-1.042124715  
-1.21869014  
-1.379930548  
-1.518402972  
-1.628313278  
-1.705986492  
-1.750103609  
-1.761703396  
-1.743967651  
-1.701812375  
-1.641358101  
-1.569318703  
-1.49238594  
-1.41666156  
-1.347180259  
-1.287572839  
-1.239888503  
-1.204585916  
-1.180678438  
-1.166015588  
-1.157629735  
-1.152119593  
-1.145989979  
-1.135913722  
-1.118889146  
-1.092281037  
-1.053789662  
-1.001367243  
-0.933166277  
-0.8475386563  
-0.7431473402  
-0.6191809629  
-0.4756579715  
-0.3137747564  
-0.1362004235  
0.05272248727  
0.2469767865  
0.4390885374  
0.6206213411  
0.7828637138  
0.9177014466  
1.01852643  
1.081090217  
1.104152677  
1.08982299  
1.043523923  
0.9735447468  
0.8902204917  
0.8048423117  
0.7284075543  
0.6704035791  
0.637764919  
0.6341525646  
0.6596378336  
0.7108299435  
0.7814055114  
0.8629398414  
0.9459399482  
1.020894897  
1.079244163  
1.114127788  
1.120863919  
1.097155395  
1.043027104  
0.9605763173  
0.8536047238  
0.7272068981  
0.5873842824  
0.4407057246  
0.2940300991  
0.1542666749  
0.02814195607  
-0.07806783352  
-0.1588544591  
-0.2098615933  
-0.2283108175  
-0.2134105979  
-0.1666877853  
-0.09216334072  
0.003710762707  
0.1123872725  
0.2238564213  
0.3275354241  
0.4133372267  
0.4727955959  
0.5001020653  
0.4929093101  
0.4527745422  
0.385132668  
0.2988017309  
0.2050376207  
0.1162209069  
0.04436209723  
-0.0004046101953  
-0.01114905795  
0.01491031207  
0.07595152436  
0.1656909731  
0.2740776787  
0.3885083079  
0.4953489214  
0.5816361427  
0.6366768157  
0.6533774126  
0.6291084333  
0.5660078782  
0.4706754068  
0.3533213579  
0.2264744449  
0.1034384479  
-0.003311746825  
-0.08358661821  
-0.1305985783  
-0.1416343658  
-0.1182016597  
-0.06566331277  
0.007562635673  
0.09111587886  
0.1739490636  
0.2455816329  
0.2971580262  
0.3222242816  
0.3171452876  
0.2811249689  
0.2159107938  
0.1252182315  
0.01404063975  
-0.1120831148  
-0.2476911495  
-0.3878683195  
-0.5284812301  
-0.6662290398  
-0.7985202841  
-0.9232600181  
-1.038635307  
-1.142962662  
-1.234638716  
-1.312217213  
-1.374592191  
-1.421213269  
-1.452284716  
-1.468885055  
-1.472939153  
-1.467035898  
-1.454097059  
-1.436946195  
-1.417848248  
-1.398087635  
-1.377685806  
-1.355298521  
-1.328343458  
-1.293333616  
-1.246398498  
-1.183910636  
-1.103125204  
-1.002729705  
-0.8832271326  
-0.7470492124  
-0.5983805651  
-0.4426840869  
-0.2859544661  
-0.1337979431  
0.009550097655  
0.1421256266  
0.2648901876  
0.382004488  
0.5005964944  
0.6299743877  
0.7803169423  
0.9609438004  
1.178369238  
1.434408671  
1.724662485  
2.037666282  
2.354943127  
2.652121594  
2.901069331  
3.07288664  
3.141396591  
3.086691686  
2.898186301  
2.576701452  
2.135195059  
1.597919404  
0.9980733358  
0.3742158992  
