-0.5133710001  
-0.1445414989  
0.2298431451  
0.6075298731  
0.9835267147  
1.349617088  
1.694387928  
2.003845475  
2.262591381  
2.455456036  
2.569413843  
2.595534645  
2.530705276  
2.378824497  
2.151279466  
1.866502457  
1.548616155  
1.22522084  
0.9245920238  
0.6725864693  
0.4896855806  
0.3885884712  
0.372693741  
0.4357236261  
0.5625500582  
0.7311289568  
0.9152625159  
1.087797916  
1.223815639  
1.303366391  
1.313407263  
1.248727709  
1.111812112  
0.9117711817  
0.662581967  
0.3809869397  
0.08440523842  
-0.2108187746  
-0.4906285017  
-0.7438064303  
-0.9619360758  
-1.138919832  
-1.270291777  
-1.352592341  
-1.38300104  
-1.359389945  
-1.280789153  
-1.148170682  
-0.9653272233  
-0.7396151764  
-0.482257227  
-0.2080413581  
0.06569439419  
0.320725337  
0.5400780842  
0.7103079594  
0.8235589146  
0.8790240905  
0.8835059976  
0.8508715241  
0.800430365  
0.7543683171  
0.7345833743  
0.75938468  
0.8405313359  
0.9810944474  
1.174493135  
1.404906267  
1.649032826  
1.878972318  
2.065839537  
2.183581517  
2.212444451  
2.141586419  
1.970484566  
1.708938977  
1.375712197  
0.9960761033  
0.5986144916  
0.2118349177  
-0.1389593654  
-0.4340834765  
-0.6609259696  
-0.8142985406  
-0.8958135993  
-0.9124951179  
-0.8749708728  
-0.7956241806  
-0.6870113901  
-0.5607814408  
-0.427174009  
-0.2950525331  
-0.1722829582  
-0.06623438476  
0.01586125353  
0.06687661386  
0.08018543237  
0.05045632483  
-0.02530577776  
-0.1466875462  
-0.3090610137  
-0.5032598706  
-0.715916108  
-0.9304932588  
-1.128931475  
-1.29367861  
-1.409838407  
-1.467077211  
-1.461034436  
-1.393987349  
-1.27471693  
-1.117563302  
-0.9408616046  
-0.7649608159  
-0.6101126591  
-0.4944849717  
-0.4325322485  
-0.4338261625  
-0.5024560034  
-0.6369282109  
-0.8305235077  
-1.07199767  
-1.346511226  
-1.636698871  
-1.923800704  
-2.188796282  
-2.413514244  
-2.581659425  
-2.679747092  
-2.69788233  
-2.630362493  
-2.476056228  
-2.238534297  
-1.925951131  
-1.550667478  
-1.128642179  
-0.6786183664  
-0.2211386744  
0.2225758376  
0.6318228863  
0.9876569372  
1.274085285  
1.479161562  
1.595879618  
1.62278886  
1.564251472  
1.430273667  
1.235907881  
1.000219232  
0.7449035768  
0.4926428942  
0.2653363703  
0.08237955456  
-0.0409001302  
-0.09446234119  
-0.07437412611  
0.01687773535  
0.170583722  
0.3725212327  
0.6041244041  
0.8440379358  
1.069939872  
1.260494099  
1.397289714  
1.466577316  
1.460659236  
1.37874936  
1.227232388  
1.019216024  
0.7734146618  
0.5124416922  
0.260635945  
0.04166101804  
-0.123904559  
-0.2207062403  
-0.2402574363  
-0.181890157  
-0.05286756758  
0.1323576247  
0.353692103  
0.5875943305  
0.8096804608  
0.9974107472  
1.132568825  
1.203187061  
1.204696216  
1.140138894  
1.01940772  
0.8576381404  
0.672945421  
0.4838418439  
0.3066923204  
0.1535556701  
0.03072562744  
-0.06183261813  
-0.1300856447  
-0.1846353546  
-0.2387513786  
-0.3059956791  
-0.3978352863  
-0.5215701822  
-0.6788751603  
-0.8651822893  
-1.069954918  
-1.277809939  
-1.470325705  
-1.628264549  
-1.733907309  
-1.773190788  
-1.737386323  
-1.624103402  
-1.437558438  
-1.188057566  
-0.8908422075  
-0.5644211415  
-0.2286644525  
0.0971553057  
0.3961012095  
0.6549267344  
0.8648955273  
1.022032239  
1.126807363  
1.183330639  
1.198232579  
1.179361387  
1.134509792  
1.070322575  
0.9915377783  
0.9006164695  
0.7978297824  
0.6817256954  
0.5499265213  
0.4001100281  
0.231039111  
0.04347125712  
-0.1591658684  
-0.3704687143  
-0.581154181  
-0.7795825681  
-0.9526517411  
-1.086965482  
-1.170140635  
-1.192104741  
-1.146207521  
-1.030049584  
-0.845894105  
-0.6006465548  
-0.3054100713  
0.02531702941  
0.3746968344  
0.7247187201  
1.05737684  
1.355727659  
1.604800123  
1.792297639  
1.90913539  
1.949816439  
1.912704002  
1.800177274  
1.618663575  
1.378499658  
1.093547663  
0.7805063351  
0.4578670353  
0.1445625644  
-0.1416476324  
-0.3858792146  
-0.5776932667  
-0.7123264499  
-0.7913297476  
-0.8224745394  
-0.818844522  
-0.7971903599  
-0.7756984723  
-0.7714817528  
-0.7981300038  
-0.863683414  
-0.9693285637  
-1.109035908  
-1.27021041  
-1.435268311  
-1.583946507  
-1.695994968  
-1.753913638  
-1.745322653  
-1.66466685  
-1.514048131  
-1.303065418  
-1.047717962  
-0.7685502471  
-0.4882834293  
-0.2292639021  
-0.01104401616  
0.1515967551  
0.2499685343  
0.282006483  
0.2520051451  
0.1696257464  
0.0483572593  
-0.09634042473  
-0.2489524188  
-0.3956642921  
-0.5257332653  
-0.632370696  
-0.7130568576  
-0.7693199618  
-0.8060608798  
-0.8305363289  
-0.8511679874  
-0.8763017069  
-0.913076452  
-0.9664823143  
-1.038703843  
-1.128768724  
-1.232517035  
-1.342862613  
-1.450320515  
-1.543733837  
-1.611148694  
-1.640773364  
-1.621960844  
-1.54615689  
-1.407745054  
-1.204756165  
-0.9393530269  
-0.6180629907  
-0.2516924032  
0.1450982712  
0.5545873262  
0.957119879  
1.332520307  
1.661684312  
1.928219121  
2.119939542  
2.230069148  
2.25796005  
2.209209853  
2.095123529  
1.9315319  
1.737079198  
1.531188381  
1.331926208  
1.154090905  
1.007749342  
0.8974533419  
0.8222359056  
0.776399498  
0.7509600485  
0.7355255602  
0.72033903  
0.6981338229  
0.6655323456  
0.6237598321  
0.5785443738  
0.5392297288  
0.5172143007  
0.5239622267  
0.5688971333  
0.6575054925  
0.7899496887  
0.9604309153  
1.157408595  
1.364672276  
1.563114908  
1.732965538  
1.856155964  
1.918492841  
1.911320117  
1.832452136  
1.686275541  
1.48300835  
1.237269636  
0.9661787618  
0.6872626832  
0.4164584406  
0.1664973867  
-0.05418189589  
-0.241829062  
-0.3971402961  
-0.5244332305  
-0.6304079182  
-0.7227141086  
-0.8085323898  
-0.8933758119  
-0.9802654064  
-1.069372781  
-1.158134783  
-1.241788994  
-1.31422053  
-1.368966483  
-1.400217194  
-1.403674091  
-1.377143361  
-1.320815662  
-1.237212989  
-1.130860324  
-1.007750398  
-0.8747115668  
-0.7387944822  
-0.6067714411  
-0.4847891558  
-0.3782172698  
-0.2916662808  
-0.2290940158  
-0.1939519857  
-0.1892527412  
-0.2175148162  
-0.2805499464  
-0.3790858066  
-0.5122984582  
-0.6773473468  
-0.869011853  
-1.079549213  
-1.298835398  
-1.514860783  
-1.714515178  
-1.884619833  
-2.013075455  
-2.089987658  
-2.108628869  
-2.066109336  
-1.963694614  
-1.806723203  
-1.604146323  
-1.367755814  
-1.111180589  
-0.8487450996  
-0.5943173612  
-0.3601959814  
-0.1561656639  
0.01124867496  
0.1392586835  
0.2289845145  
0.2852948277  
0.3163120124  
0.3326073366  
0.3461195926  
0.3688940143  
0.4117529712  
0.4830124382  
0.587408613  
0.7253594625  
0.8926498202  
1.080615004  
1.276827631  
1.466210742  
1.632484244  
1.759769337  
1.834188218  
1.845255919  
1.786938674  
1.658241753  
1.463305923  
1.211008309  
0.9141689589  
0.5884657102  
0.2511940055  
-0.079979905  
-0.388192456  
-0.6583978492  
-0.878200623  
-1.038511967  
-1.134031116  
-1.1635687  
-1.130185688  
-1.041123973  
-0.9074823087  
-0.7435531731  
-0.5658502264  
-0.3917846656  
-0.2381204802  
-0.1193090229  
-0.04591310732  
-0.02330964199  
-0.05090372416  
-0.1219519515  
-0.2241325308  
-0.340793523  
-0.4528016455  
-0.5407592847  
-0.5873504801  
-0.5795168174  
-0.5101887139  
-0.3793426871  
-0.1942403045  
0.03121051289  
0.2778966458  
0.5236068432  
0.7455418734  
0.9229473549  
1.039543496  
1.085481971  
1.058561311  
0.9645817657  
0.8167709135  
0.6343339298  
0.4403136412  
0.2589779785  
0.1130668144  
0.02120353485  
-0.00419039694  
0.04175877619  
0.1559568368  
0.3278867447  
0.5410551807  
0.7751239191  
1.00843505  
1.220577449  
1.394618804  
1.518726663  
1.586956961  
1.599167315  
1.560138441  
1.478103922  
1.363003408  
1.224764028  
1.07189613  
0.9106212089  
0.7446046638  
0.5752687406  
0.4025465533  
0.225863256  
0.04513407965  
-0.1384472392  
-0.3219563907  
-0.5007049839  
-0.6685918992  
-0.8187821917  
-0.9445501476  
-1.04018351  
-1.101772606  
-1.127812391  
-1.119535053  
-1.080942099  
-1.018566264  
-0.9409651394  
-0.858021852  
-0.7800928944  
-0.7170657645  
-0.6774074193  
-0.6672536788  
-0.6896474101  
-0.7440033891  
-0.8258800187  
-0.9271525373  
-1.036606636  
-1.140948298  
-1.226186305  
-1.279218738  
-1.289465645  
-1.250323648  
-1.160217779  
-1.023082534  
-0.848163514  
-0.6491182236  
-0.4425442301  
-0.2460823671  
-0.0763820572  
0.05279667867  
0.13209345  
0.1574712942  
0.1304442708  
0.05761872467  
-0.0503460137  
-0.1801798098  
-0.3176206508  
-0.4489599097  
-0.5623522326  
-0.6487073362  
-0.702139834  
-0.7199734447  
-0.702404437  
-0.6519293996  
-0.5726991413  
-0.4699080148  
-0.3493156986  
-0.2169152516  
-0.07873675643  
0.05927932352  
0.1914201935  
0.312412253  
0.4177467875  
0.5040999363  
0.5697642683  
0.6150122598  
0.6422479875  
0.6558544319  
0.6616965798  
0.6662892933  
0.6757386124  
0.6946191663  
0.7249897368  
0.7657393737  
0.8124482567  
0.8577986014  
0.8925678415  
0.9070235512  
0.8925489559  
0.8432034869  
0.7569550792  
0.6363462718  
0.488443472  
0.3240440604  
0.1562430315  
-0.001433300515  
-0.1369989568  
-0.2417914888  
-0.3117106642  
-0.3477281127  
-0.3555473037  
-0.344471782  
-0.3256762274  
-0.31017346  
-0.3068438054  
-0.3208557158  
-0.3527622314  
-0.3984013895  
-0.4496309377  
-0.4957268248  
-0.5252071179  
-0.5277596477  
-0.4959581134  
-0.426492002  
-0.3207513444  
-0.1846994501  
-0.02813533775  
0.1365330601  
0.2957534227  
0.436316644  
0.5466559791  
0.6178335054  
0.6441237518  
0.6232323235  
0.5561912572  
0.4470224478  
0.3022805931  
0.1305184364  
-0.05825683567  
-0.2531636876  
-0.4430538815  
-0.6171800578  
-0.7659266918  
-0.881558618  
-0.9589405379  
-0.9961073575  
-0.9945947262  
-0.9594122243  
-0.8986138939  
-0.8224344402  
-0.7420743868  
-0.6682531699  
-0.6097000275  
-0.5718055835  
-0.5556263824  
-0.5574357842  
-0.568898526  
-0.5779265782  
-0.5701345366  
-0.5307400592  
-0.4467023049  
-0.3088085076  
-0.1134350045  
0.1362666629  
0.4299666302  
0.7506457996  
1.075950297  
1.38030586  
1.637572346  
1.823895905  
1.920437609  
1.915611195  
1.806554054  
1.599591082  
1.30967205  
0.958794376  
0.5736442338  
0.1827277521  
-0.1866219972  
-0.5110072331  
-0.773146128  
-0.9632263764  
-1.079301089  
-1.126718642  
-1.116715611  
-1.064404055  
-0.986435894  
-0.898680572  
-0.8142014538  
-0.7417661815  
-0.685045036  
-0.6425681624  
-0.6083611303  
-0.573174098  
-0.5260979061  
-0.4563522553  
-0.3550365169  
-0.2166091183  
-0.03995661111  
0.1710906942  
0.4078517755  
0.6574689788  
0.904129886  
1.130670821  
1.320414967  
1.459030372  
1.536180373  
1.546797381  
1.491777003  
1.378035995  
1.21786371  
1.027655197  
0.8261568883  
0.6324303319  
0.4637738302  
0.333874065  
0.2514042735  
0.219245517  
0.2344039713  
0.2886235721  
0.3695766508  
0.4624723124  
0.5518324331  
0.6232274424  
0.6647548333  
0.6681003974  
0.6290981829  
0.5477750225  
0.4279176271  
0.2762972327  
0.1016476659  
-0.08641975676  
-0.2784411796  
-0.465958571  
-0.6421336005  
-0.8020841901  
-0.9429733906  
-1.063875427  
-1.165491803  
-1.249779139  
-1.31954431  
-1.378047604  
-1.428631212  
-1.474375324  
-1.51777036  
-1.560415165  
-1.602730445  
-1.643724658  
-1.680848354  
-1.709989097  
-1.725660153  
-1.721414171  
-1.690497838  
-1.626686911  
-1.525248072  
-1.383870439  
-1.203450523  
-0.9885730752  
-0.7475655846  
-0.4920685953  
-0.2361327567  
0.005085590586  
0.2168804715  
0.3865858021  
0.5050071421  
0.5674745607  
0.5743676613  
0.5310273927  
0.447061797  
0.3351259362  
0.2093484172  
0.08362392978  
-0.03000566441  
-0.1226460437  
-0.1893540798  
-0.2293372428  
-0.2455494287  
-0.243731745  
-0.2310941193  
-0.2148112722  
-0.2006011311  
-0.1916030005  
-0.1877347661  
-0.1856443232  
-0.1792445477  
-0.1607781264  
-0.1222281781  
-0.05685391712  
0.03937086436  
0.166661057  
0.3208176402  
0.4932327783  
0.6715287357  
0.8407419915  
0.984947542  
1.089099383  
1.140895584  
1.132423628  
1.061386171  
0.9317376739  
0.7536334619  
0.5426612075  
0.318411412  
0.1025152539  
-0.08362061307  
-0.2211622435  
-0.2959682889  
-0.3002619246  
-0.2336104122  
-0.1031020136  
0.07731991266  
0.288322367  
0.5072608263  
0.7106547533  
0.8767648393  
0.9879754037  
1.032685854  
1.006510395  
0.9126192913  
0.7611962941  
0.5680808871  
0.3527688871  
0.1360285993  
-0.06254759703  
-0.2267644685  
-0.3454970356  
-0.4136285801  
-0.4321350621  
-0.4073185774  
-0.3493369016  
-0.2702564102  
-0.1819340434  
-0.0940767638  
-0.01277644239  
0.060233044  
0.1274773556  
0.1948265642  
0.2699070449  
0.3601213992  
0.4706228483  
0.6026204097  
0.7523081002  
0.910664174  
1.06417515  
1.196402338  
1.290170088  
1.330031801  
1.304617998  
1.208489667  
1.043179456  
0.8172438368  
0.5452978529  
0.2461644117  
-0.05958037206  
-0.3522816145  
-0.6156906066  
-0.8388588442  
-1.01715355  
-1.152232879  
-1.251012541  
-1.323783497  
-1.381842908  
-1.435010955  
-1.489495451  
-1.546443111  
-1.601457128  
-1.645141522  
-1.664615715  
-1.64574407  
-1.57572839  
-1.445634006  
-1.252467959  
-1.000450616  
-0.7012998322  
-0.3734365513  
-0.04025013585  
0.2723792982  
0.5389369734  
0.7371563867  
0.8505363656  
0.8701887175  
0.7958087993  
0.6356782718  
0.405720023  
0.1277902177  
-0.1725962757  
-0.4687859156  
-0.735483968  
-0.9509453616  
-1.098661405  
-1.168411208  
-1.156629856  
-1.066125783  
-0.9052555117  
-0.6866969874  
-0.4259966194  
-0.1400678984  
0.1542084617  
0.4411629619  
0.7072154736  
0.9414216681  
1.135695842  
1.284760308  
1.385862163  
1.438363427  
1.443254628  
1.402676675  
1.319513672  
1.197098971  
1.039064471  
0.8493387463  
0.6322664747  
0.3928204393  
0.1368193275  
-0.1289044277  
-0.3964794574  
-0.6571425191  
-0.9016211006  
-1.120723299  
-1.306075044  
-1.45095156  
-1.551040183  
-1.605059669  
-1.61506953  
-1.586413877  
-1.527238667  
-1.447603403  
-1.358258862  
-1.269232787  
-1.188414572  
-1.12030862  
-1.065207729  
-1.018890802  
-0.9729816309  
-0.9159372375  
-0.834618236  
-0.7162250053  
-0.5503991401  
-0.3311654243  
-0.05848527392  
0.2608658559  
0.6132411542  
0.9789420675  
1.333912118  
1.652101971  
1.908293282  
2.081037236  
2.155346641  
2.12479439  
1.99272679  
1.772378486  
1.485808679  
1.161743634  
0.8325311048  
0.5305433581  
0.2844643789  
0.1159156188  
0.03685668946  
0.04811806172  
0.1392621308  
0.2898443982  
0.471936702  
0.6536023268  
0.8029282632  
0.8920951045  
0.9009671488  
0.8197649937  
0.6504612312  
0.4066704283  
0.1120973872  
-0.2023674665  
-0.5024935307  
-0.7550589795  
-0.9321293371  
-1.014718028  
-0.9953457319  
-0.8791220697  
-0.6832153253  
-0.4347391955  
-0.1673407491  
0.0830538855  
0.2827679067  
0.4045597054  
0.4308900729  
0.355856468  
0.1855455363  
-0.06319217921  
-0.3653292396  
-0.6911988286  
