-0.06382742402  
-0.4712646106  
-0.8576924162  
-1.205410583  
-1.50187103  
-1.740981879  
-1.923327888  
-2.055315561  
-2.147434985  
-2.211985493  
-2.260703361  
-2.302722704  
-2.343224942  
-2.382988348  
-2.41886098  
-2.445005366  
-2.454619755  
-2.441750356  
-2.402817908  
-2.3375443  
-2.249098215  
-2.143448013  
-2.028070697  
-1.910295776  
-1.795641494  
-1.686501223  
-1.58147214  
-1.475487114  
-1.360763852  
-1.228409964  
-1.070403031  
-0.881571305  
-0.6611984495  
-0.4139284552  
-0.1497665099  
0.1168657968  
0.3689029728  
0.5889610251  
0.7618431807  
0.8768241624  
0.9293322726  
0.9217609784  
0.8632735727  
0.7686326133  
0.6562336169  
0.5456430567  
0.4550024563  
0.3986682637  
0.3854094028  
0.4173803492  
0.489984117  
0.5925992383  
0.7100458195  
0.8245752173  
0.9181237626  
0.9745550727  
0.9816361462  
0.9325374978  
0.8267077951  
0.6700429974  
0.4743442855  
0.256124867  
0.03489144738  
-0.1689211858  
-0.3361478554  
-0.4509888941  
-0.5027722866  
-0.4871778652  
-0.4067736545  
-0.2707851438  
-0.09411313651  
0.1043033992  
0.3035886304  
0.4832508667  
0.6254390598  
0.7168693374  
0.7501786075  
0.7245577094  
0.645594544  
0.5243736838  
0.3759608671  
0.2174905717  
0.06609896489  
-0.06303381737  
-0.1583034148  
-0.2127940826  
-0.224779638  
-0.1976002326  
-0.1389685628  
-0.05982277162  
0.02711366712  
0.1088943402  
0.173857208  
0.2129255827  
0.2205796349  
0.1954131946  
0.1402370667  
0.061726511  
-0.0303390935  
-0.1241706996  
-0.2072783887  
-0.2678678432  
-0.296170727  
-0.2855688642  
-0.2333835273  
-0.1412367879  
-0.01493499195  
0.1361149758  
0.2998997785  
0.4630829345  
0.6124286394  
0.7361917683  
0.8253035123  
0.8742093235  
0.8812621001  
0.8486297355  
0.7817492  
0.6884110703  
0.5776188087  
0.4583876904  
0.3386590932  
0.2244814754  
0.1195689066  
0.02528417177  
-0.05897008664  
-0.1350394231  
-0.2051191172  
-0.2708423555  
-0.3325199803  
-0.3886850375  
-0.4360304596  
-0.4697760435  
-0.4844053321  
-0.4746615819  
-0.4366266855  
-0.3686880993  
-0.272208443  
-0.1517498971  
-0.0147821103  
0.1291152464  
0.2694491407  
0.3962293952  
0.5013739038  
0.5798574253  
0.6303946542  
0.6555181437  
0.6610068955  
0.6547434352  
0.6451789175  
0.6396643867  
0.6429513093  
0.6561462677  
0.6763373901  
0.6970040683  
0.7091804104  
0.7032050752  
0.6707746127  
0.6069341439  
0.5116370572  
0.3905469228  
0.2548748584  
0.1201973317  
0.004380544314  
-0.07510485087  
-0.1040653105  
-0.07419662367  
0.01503237844  
0.1555715378  
0.3312655757  
0.5195997688  
0.6945126219  
0.8298762271  
0.9031276563  
0.8984925613  
0.8092840752  
0.6389027884  
0.4003554315  
0.114353618  
-0.1937214864  
-0.4975090426  
-0.773423924  
-1.003870935  
-1.179399596  
-1.299453823  
-1.371607636  
-1.409431426  
-1.429373383  
-1.447207248  
-1.474671597  
-1.516911173  
-1.571177654  
-1.627048771  
-1.668151935  
-1.675125754  
-1.629324928  
-1.516643252  
-1.330795052  
-1.07547427  
-0.7649901078  
-0.4232214521  
-0.08100765002  
0.2276503445  
0.4700172753  
0.619011967  
0.6568978999  
0.5777307742  
0.3882154761  
0.106868809  
-0.2383569528  
-0.6136079598  
-0.983288221  
-1.314230653  
-1.579308063  
-1.760011336  
-1.847705848  
-1.843491396  
-1.756794518  
-1.603005385  
-1.400591105  
-1.168163959  
-0.9219523803  
-0.6740311379  
-0.4315177887  
-0.1967755527  
0.03150722796  
0.2566257832  
0.4819143122  
0.7089325762  
0.9361338461  
1.158267456  
1.366634507  
1.550161931  
1.697104379  
1.797075502  
1.843034829  
1.832863926  
1.770217997  
1.664470383  
1.529711037  
1.382932504  
1.241677218  
1.121527729  
1.03385279  
0.9841917345  
0.9715572364  
0.9887829135  
1.023866635  
1.062086655  
1.088534283  
1.090634617  
1.060223747  
0.9948328823  
0.8979613249  
0.7783087001  
0.6481113213  
0.5208921738  
0.409041164  
0.3216608351  
0.2630772937  
0.2322788472  
0.2233810173  
0.2270186157  
0.2323930409  
0.2295739469  
0.2116083494  
0.1760189944  
0.1253951557  
0.06694648422  
0.0110965163  
-0.03061663936  
-0.04793379394  
-0.03408677982  
0.01261022692  
0.08812072212  
0.1831460916  
0.2846266192  
0.3780185321  
0.4499263953  
0.4905974919  
0.4957961482  
0.4676909354  
0.4145623593  
0.3493638958  
0.287378631  
0.2433897418  
0.2288722451  
0.2497212481  
0.3049306055  
0.3864713509  
0.4804022811  
0.5690277809  
0.6337315843  
0.6580014315  
0.6301306922  
0.5451430054  
0.4056293023  
0.2213767851  
0.00787599053  
-0.2160196695  
-0.4308752155  
-0.6194266933  
-0.7688646614  
-0.8723021325  
-0.9292357699  
-0.9449894657  
-0.9293036571  
-0.8943625901  
-0.8526376322  
-0.8149189422  
-0.7888574208  
-0.7782163201  
-0.7828930961  
-0.7996333666  
-0.8232282499  
-0.8479306221  
-0.8687927339  
-0.8826794623  
-0.888786157  
-0.8885989083  
-0.8853531014  
-0.883132269  
-0.8858154935  
-0.8960958105  
-0.9147631367  
-0.9403862299  
-0.9694405721  
-0.9968418282  
-1.01677167  
-1.023631101  
-1.012943953  
-0.9820559155  
-0.9305161881  
-0.8601006067  
-0.7744956407  
-0.6787214566  
-0.5784118303  
-0.4790780273  
-0.3854700056  
-0.3011253698  
-0.2281475137  
-0.1672114143  
-0.1177646626  
-0.07835302231  
-0.04699895945  
-0.0215556727  
1.721002355e-05  
0.01950266633  
0.03839692271  
0.05799686689  
0.0795563546  
0.1044616173  
0.1343646958  
0.1712179946  
0.2171702487  
0.2743069689  
0.3442457529  
0.4276377038  
0.5236452906  
0.6295010906  
0.7402502125  
0.8487762168  
0.9461813944  
1.022541287  
1.068001917  
1.074110605  
1.035227794  
0.9498083024  
0.8213348631  
0.6587031772  
0.4759087115  
0.2909778793  
0.1241913684  
-0.004232912726  
-0.0767281511  
-0.08089450268  
-0.01156873253  
0.1278898769  
0.3253566264  
0.5608635126  
0.8086391106  
1.040058338  
1.227136221  
1.346101289  
1.380550817  
1.32373037  
1.179587387  
0.9624281879  
0.6951985801  
0.4066172132  
0.1275535676  
-0.1128433239  
-0.2907255231  
-0.3903478896  
-0.4057187188  
-0.340902119  
-0.2089802477  
-0.02987291328  
0.1726274813  
0.3741443947  
0.5528459487  
0.6919717738  
0.7814361645  
0.81833348  
0.8063588189  
0.7543112245  
0.6739925873  
0.5778737587  
0.4769329855  
0.3789950077  
0.2878234213  
0.2030575936  
0.1209549262  
0.03576077684  
-0.05856232532  
-0.1665696099  
-0.2898457259  
-0.426047304  
-0.5686453518  
-0.7074091526  
-0.829561458  
-0.9214295292  
-0.9703377257  
-0.9664592051  
-0.9043461181  
-0.7839104544  
-0.6107060871  
-0.3954623711  
-0.1529296178  
0.09980844949  
0.345323023  
0.5678538362  
0.7550714599  
0.8993467676  
0.998357159  
1.05495775  
1.076352415  
1.072697925  
1.055356447  
1.035053697  
1.020208666  
1.015659988  
1.021950833  
1.035244511  
1.047855819  
1.049294134  
1.027664355  
0.9712358845  
0.8699814112  
0.7169192241  
0.5091132719  
0.2482455425  
-0.05928630873  
-0.4027440559  
-0.7678478428  
-1.137923373  
-1.495278585  
-1.822683235  
-2.104803764  
-2.329450973  
-2.488518966  
-2.578519893  
-2.6006635  
-2.560482792  
-2.467058453  
-2.331934787  
-2.167861413  
-1.987500784  
-1.80225084  
-1.621305518  
-1.451045448  
-1.294811757  
-1.153061267  
-1.023864732  
-0.9036601277  
-0.7881519443  
-0.6732219265  
-0.5557293293  
-0.4340890102  
-0.3085480877  
-0.1811337791  
-0.05528918195  
0.06473777938  
0.1746421186  
0.2708217683  
0.3510146895  
0.4147051217  
0.4632241919  
0.4995283099  
0.52769177  
0.5522058682  
0.5772133943  
0.6058169102  
0.6395931837  
0.6784044124  
0.7205428118  
0.7631804847  
0.8030368253  
0.837129639  
0.863464622  
0.8815157418  
0.8924012495  
0.8987083512  
0.9039897684  
0.9120230792  
0.9259633724  
0.9475545828  
0.9765449817  
1.010429995  
1.044591857  
1.072826647  
1.088198093  
1.084091433  
1.0553053  
0.999009848  
0.9154143607  
0.8080248807  
0.6834382927  
0.5506767075  
0.4201479851  
0.3023661021  
0.2066068924  
0.139694592  
0.1050870097  
0.1024037007  
0.1274652877  
0.1728506768  
0.2288927649  
0.284977337  
0.3309594753  
0.3584894609  
0.3620617548  
0.3396316053  
0.2927160985  
0.2259713518  
0.1463231724  
0.06179528214  
-0.01977189183  
-0.09189790718  
-0.1503463801  
-0.1935681024  
-0.2226399761  
-0.2407141036  
-0.2520880774  
-0.2610676  
-0.2708342261  
-0.2825355986  
-0.2947704216  
-0.3035778552  
-0.3029430456  
-0.2857416379  
-0.2449606449  
-0.1749835671  
-0.0727163036  
0.06164038496  
0.2242973414  
0.4081040123  
0.6032360225  
0.7982122366  
0.9810581557  
1.140420019  
1.266470187  
1.351501192  
1.390182692  
1.379532229  
1.318698474  
1.208686084  
1.052129564  
0.8531889608  
0.6175693717  
0.3526132619  
0.0673623776  
-0.2275350053  
-0.5201665838  
-0.7980086941  
-1.048866781  
-1.26201004  
-1.429336146  
-1.546369868  
-1.612898314  
-1.633086569  
-1.6150024  
-1.569566997  
-1.509063034  
-1.445403611  
-1.388426233  
-1.344477932  
-1.315519824  
-1.29890544  
-1.287874613  
-1.27269863  
-1.242306238  
-1.186143165  
-1.095986324  
-0.9674359951  
-0.8008662668  
-0.601692161  
-0.37992077  
-0.1490541463  
0.0754892644  
0.2782103696  
0.4453633972  
0.566539765  
0.6358024323  
0.6522378166  
0.6198812421  
0.5470586153  
0.4452632508  
0.3277342094  
0.2079399704  
0.09815378496  
0.008291427649  
-0.05487421193  
-0.08805814406  
-0.09137473671  
-0.06786241574  
-0.02272519501  
0.03759180498  
0.106357394  
0.1774194194  
0.2458745393  
0.3084743109  
0.3637326645  
0.4117452632  
0.4537646767  
0.4916140855  
0.5270395172  
0.5611144322  
0.593803399  
0.6237712314  
0.648486775  
0.6646222447  
0.668695534  
0.6578581402  
0.6306854143  
0.5878175578  
0.5323072614  
0.469566181  
0.4068710572  
0.3524571527  
0.3143152049  
0.2988645225  
0.3097203762  
0.3467700933  
0.405747259  
0.4784145028  
0.553384007  
0.6174943826  
0.6575806038  
0.6623935187  
0.6243903002  
0.5411292233  
0.4160346009  
0.2583904304  
0.08251717824  
-0.0937943343  
-0.2514058708  
-0.3722438793  
-0.4416784229  
-0.4505375589  
-0.396468125  
-0.2844410248  
-0.1263059448  
0.0605540705  
0.2552976028  
0.4361514408  
0.5830344203  
0.6799298846  
0.7166744444  
0.689939949  
0.6032929875  
0.4663649395  
0.2932889458  
0.1006661763  
-0.09462027585  
-0.2774196164  
-0.4358760292  
-0.5623530954  
-0.653643154  
-0.7105066088  
-0.7366965345  
-0.7376905101  
-0.719387892  
-0.6870107604  
-0.6443913754  
-0.5937385531  
-0.5358746386  
-0.4708406949  
-0.3986949122  
-0.3202921363  
-0.2378428576  
-0.1550952558  
-0.07706991213  
-0.009368484229  
0.04281578217  
0.07579460203  
0.08834569465  
0.08231369129  
0.06267640494  
0.0370002739  
0.01432656627  
0.003650773072  
0.01224895783  
0.0441671178  
0.0991694756  
0.1723915489  
0.2548100785  
0.3345114303  
0.3985671585  
0.4352212428  
0.4360007118  
0.3973708535  
0.3216149646  
0.2167534573  
0.09548408164  
-0.02670064728  
-0.1339108916  
-0.212368547  
-0.2526051315  
-0.2509772045  
-0.2102483779  
-0.139149609  
-0.05100590553  
0.03832574276  
0.1128620703  
0.1588391467  
0.166635904  
0.1319905578  
0.0563597146  
-0.05358210149  
-0.1871665122  
-0.331436904  
-0.4730331035  
-0.5999564188  
-0.7029570902  
-0.7763797195  
-0.8184036072  
-0.8307226137  
-0.8177954701  
-0.7858488723  
-0.7418267125  
-0.6924585659  
-0.6435662945  
-0.5996569458  
-0.563785859  
-0.5376207046  
-0.5216092815  
-0.5151552055  
-0.5167296631  
-0.5238964756  
-0.5332731285  
-0.5404935889  
-0.5402613519  
-0.5265782331  
-0.4932002372  
-0.434322789  
-0.345432576  
-0.2242000455  
-0.07124845288  
0.1093777804  
0.3102021457  
0.5208461247  
0.729103148  
0.9224462999  
1.089766329  
1.223059444  
1.31876575  
1.378483288  
1.408870174  
1.420679535  
1.427024929  
1.441123118  
1.473878912  
1.531733568  
1.615178124  
1.718243902  
1.829117946  
1.931846784  
2.008884618  
2.044080773  
2.025604987  
1.948295478  
1.81499085  
1.636575141  
1.430678241  
1.219202619  
1.025064434  
0.8686733773  
0.7647372841  
0.7199280754  
0.7318020403  
0.789162599  
0.8738043535  
0.9633482738  
1.034691474  
1.06750342  
1.047189877  
0.9668581568  
0.8279824138  
0.6397002776  
0.4169033721  
0.1774856975  
-0.06075909845  
-0.2830493843  
-0.479851972  
-0.6480897373  
-0.7911599872  
-0.9178146402  
-1.040158703  
-1.171146657  
-1.322049414  
-1.500322494  
-1.708224007  
-1.942368701  
-2.194231266  
-2.451441619  
-2.699584899  
-2.924164121  
-3.112375727  
-3.254427896  
-3.344238091  
-3.379482052  
-3.361086985  
-3.292355333  
-3.177957021  
-3.023006257  
-2.8324118  
-2.610586393  
-2.361520256  
-2.08913895  
-1.797794816  
-1.49272836  
-1.180341792  
-0.8681769507  
-0.5645624729  
-0.2779680407  
-0.01618064314  
0.2145440997  
0.4101812234  
0.569345871  
0.6933136121  
0.7856407849  
0.8514457475  
0.8964869003  
0.9262123663  
0.9449676294  
0.9555105586  
0.958925377  
0.9549368511  
0.942541666  
0.9208059236  
0.8896310613  
0.8503026414  
0.8056773852  
0.7599454921  
0.7180041261  
0.6845742124  
0.6632587482  
0.6557728182  
0.6615448075  
0.6778202895  
0.7002905635  
0.7241449477  
0.7453461008  
0.7618508055  
0.7745005246  
0.7873417976  
0.8072500494  
0.8428616519  
0.9029632032  
0.9946140826  
1.121338131  
1.281743464  
1.46885849  
1.670361513  
1.869727134  
2.048149638  
2.186966374  
2.27020905  
2.28688448  
2.232623492  
2.110438714  
1.930471204  
1.70876455  
1.465254752  
1.221272436  
0.9969195247  
0.8086820521  
0.6675907097  
0.5781520776  
0.5381419497  
0.539245063  
0.5684052867  
0.6096719227  
0.6462832507  
0.6627138271  
0.6464434264  
0.5892525651  
0.4879202903  
0.3442781248  
0.1646556638  
-0.04118202198  
-0.2614410859  
-0.4838532282  
-0.6971630169  
-0.8923533827  
-1.06344747  
-1.207795654  
-1.325830829  
-1.420363671  
-1.495560599  
-1.555803833  
-1.604646003  
-1.644061288  
-1.67412615  
-1.693192361  
-1.698502632  
-1.687118571  
-1.656953997  
-1.607682499  
-1.541300022  
-1.462194598  
-1.376663148  
-1.291939932  
-1.214911951  
-1.150769631  
-1.101889669  
-1.067207803  
-1.042268766  
-1.020004219  
-0.992140883  
-0.9509942121  
-0.891296274  
-0.8116608916  
-0.715325724  
-0.6099235911  
-0.5062179351  
-0.4159433073  
-0.3491049482  
-0.3112344083  
-0.3011755271  
-0.3099264234  
-0.3209114289  
-0.3118190434  
-0.2578428485  
-0.1358841884  
0.07095290184  
0.3693594551  
0.7530668308  
1.201932343  
1.683163712  
2.154635845  
2.569877672  
2.884021385  
3.059808219  
3.072733042  
2.914518999  
2.594400624  
2.138032728  
1.584230146  
0.9800731756  
0.3751544832  
-0.1841657545  
-0.6596709585  
-1.024732464  
-1.265921203  
-1.382741468  
-1.385736523  
-1.293446266  
-1.128826006  
-0.9157498853  
-0.676121141  
-0.4279508349  
-0.1845370462  
0.04533113683  
0.2563929222  
0.4455196769  
0.6102905729  
0.7478747364  
0.8544568204  
0.9252910272  
0.9553307706  
0.9402578126  
0.8776576938  
0.768064698  
0.6156337419  
0.4282701084  
0.2171602531  
-0.004252112496  
