1693.834379  
1838.141622  
2114.639725  
2654.086512  
5067.722027  
21941.56792  
9606.695695  
52084.80239  
10281.1101  
61083.59204  
4374.543323  
2821.388523  
7688.749106  
6578.370262  
28027.72668  
5739.453346  
10051.44233  
1213.434295  
51479.32224  
844.1513549  
6982.182032  
4531.470799  
3329.190692  
1456.617836  
2057.629024  
10858.07665  
83.57907221  
2639.347066  
11084.75286  
2091.830307  
1220.313169  
6405.341093  
4848.187217  
1374.280553  
8809.358406  
2889.265921  
13501.20199  
11996.45649  
5753.367972  
8721.224359  
1466.157786  
21765.66999  
1444.012078  
3479.992429  
7090.506149  
3833.034305  
2878.961589  
9149.109252  
4370.592015  
3157.576365  
1862.059501  
1668.639035  
3353.835782  
4585.525803  
1892.644544  
3421.46338  
5422.935265  
1839.387489  
2034.716758  
632.3685355  
416.0114002  
1177.580911  
605.6142295  
334.8897039  
653.6520713  
397.9931653  
329.0628248  
62.11966748  
200.699642  
32.94123783  
61.28173933  
38.96208359  
2.057754868  
2.183757978  
1.926217318  
2.654905773  
3.711309722  
8.049830114  
1.591360541  
2.137760688  
4.691319197  
1.819706422  
3.377317316  
1.907630291  
2.039586642  
1.660735434  
2.197173053  
1.248818604  
1.704475606  
1.68554114  
1.959070897  
1.73035762  
1.676516984  
1.542870023  
1.462306173  
1.312050669  
1.36545408  
1.302595737  
1.227248144  
1.15730587  
1.140232731  
1.077977323  
1.0556645  
0.9990850702  
0.9802319155  
0.9316421641  
0.892551089  
0.8635953982  
0.8325625359  
0.8010989875  
0.7693369923  
0.7458243623  
0.7174982679  
0.6934345139  
0.6682799399  
0.6443279328  
0.6217284335  
0.6007706637  
0.579960216  
0.5603536586  
0.5418314305  
0.5235754726  
0.5063345511  
0.4896536899  
0.4741263818  
0.4587545313  
0.4442093666  
0.4299616448  
0.4165475304  
0.4036463814  
0.3911120139  
0.3792138961  
0.3676356549  
0.3566610508  
0.3459336759  
0.3356893051  
0.3258139304  
0.3163058757  
0.3071163839  
0.2982768877  
0.2897730802  
0.28153824  
0.2736428648  
0.2659660689  
0.258617348  
0.2515053359  
0.244640946  
0.2379881595  
0.2315963987  
0.2254043304  
0.2194191437  
0.2136334781  
0.2080564184  
0.2026375265  
0.1974175801  
0.1923591532  
0.1874609132  
0.1827239328  
0.1781379702  
0.1737026801  
0.1693946173  
0.1652266855  
0.1611837119  
0.1572785502  
0.1534908934  
0.149806569  
0.1462358346  
0.1427853024  
0.1394306964  
0.1361743919  
0.1330208107  
0.1299491909  
0.1269788068  
0.12408814  
0.1212850843  
0.1185503925  
0.1159051618  
0.1133341898  
0.1108352985  
0.1084052175  
0.1060396503  
0.1037439564  
0.1015106301  
0.09933839667  
0.09722623879  
0.0951686297  
0.09316659517  
0.09122528111  
0.08933560358  
0.08748604728  
0.08569022538  
0.08394169965  
0.0822436584  
0.0805765106  
0.07896199515  
0.07738368525  
0.07585277581  
0.07435776338  
0.07289659699  
0.07147213147  
0.0700908482  
0.06873605217  
0.06741367269  
0.06613761512  
0.06488218728  
0.06366019535  
0.0624633696  
0.06130014054  
0.0601596413  
0.05905261657  
0.05797097541  
0.05691109063  
0.05587965013  
0.05487142626  
0.0538890435  
0.05292363715  
0.05198742743  
0.05106622313  
0.0501676891  
0.04928834728  
0.04843797352  
0.04759390318  
0.04678269298  
0.04597348411  
0.04519888689  
0.04442769894  
0.04368148283  
0.04294948238  
0.0422296962  
0.04152825125  
0.04084695474  
0.04017808925  
0.03952248413  
0.03887421124  
0.03824745892  
0.03763298858  
0.03703141283  
0.03643948133  
0.03586548405  
0.03529840695  
0.03474745081  
0.03420432269  
0.03367491182  
0.03315356084  
0.03264165692  
0.03214209276  
0.03165600408  
0.031171577  
0.03070680443  
0.03024702431  
0.0297946439  
0.02935272609  
0.02891769466  
0.02849519458  
0.02807903776  
0.02766943087  
0.02727114974  
0.02687843815  
0.02649750878  
0.02611442812  
0.02574386733  
0.02538268535  
0.02502300242  
0.02467616186  
0.0243355365  
0.02399402955  
0.02366579035  
0.02334239474  
0.02302507919  
0.02270886602  
0.02240801111  
0.02210496647  
0.02180799835  
0.02151871985  
0.02123486528  
0.02095411994  
0.02067849735  
0.02041210569  
0.02014773839  
0.01988824184  
0.01963200494  
0.01938297442  
0.01913642754  
0.01889303748  
0.01865624077  
0.01842027296  
0.01819199726  
0.0179671855  
0.01774742033  
0.01752677378  
0.01731615445  
0.01710500077  
0.0168951572  
0.01669618886  
0.01649556391  
0.01629983449  
0.01610855647  
0.01591896802  
0.01572885362  
0.01554951932  
0.01536861867  
0.0151898225  
0.01501665446  
0.01484403876  
0.01467498683  
0.0145105775  
0.01434892638  
0.01418667921  
0.01402893347  
0.01387319973  
0.01372114967  
0.0135746098  
0.01342559679  
0.01327905835  
0.01313574007  
0.01299574003  
0.012858023  
0.01272139606  
0.01258919655  
0.01245522979  
0.01232572786  
0.01219734203  
0.01207258023  
0.01194879694  
0.01182751799  
0.01171050188  
0.01159204502  
0.01147436506  
0.01136119257  
0.01124801889  
0.01113574353  
0.01102698985  
0.01091952983  
0.01081479103  
0.01071110196  
0.01060810084  
0.01050905107  
0.01040914451  
0.01031100959  
0.01021458472  
0.01011981565  
0.01002809145  
0.009934046254  
0.009845216188  
0.009755224985  
0.009668289649  
0.009581091896  
0.00949777959  
0.009413662071  
0.0093314255  
0.009249519563  
0.009169253066  
0.009089224522  
0.009013705955  
0.008937328066  
0.008861674866  
0.008786823285  
0.008713985433  
0.008642888922  
0.008571072723  
0.008501814457  
0.008431949967  
0.008364945417  
0.008298029035  
0.008232227905  
0.008168402611  
0.008105185227  
0.008040570409  
0.007982205743  
0.007918174896  
0.007859408547  
0.007802176896  
0.007741100264  
0.007682893835  
0.007627762112  
0.00757141111  
0.007516879143  
0.007463848999  
0.007411680726  
0.007359525892  
0.007306373869  
0.007255870588  
0.007204698413  
0.007157459905  
0.007108536463  
0.007061647824  
0.007013044142  
0.006967310663  
0.006921650152  
0.006877086489  
0.006831020728  
0.00678691573  
0.006745146649  
0.006704184976  
0.006663145486  
0.006621447909  
0.006581688724  
0.006542044566  
0.006501385173  
0.006463667921  
0.006427108981  
0.006389507509  
0.0063530391  
0.006318417833  
0.006281277676  
0.006246988006  
0.006211774523  
0.006178491278  
0.006144622568  
0.006113685181  
0.006082138381  
0.006050377648  
0.006018238041  
0.005986562505  
0.005956747912  
0.005928022475  
0.005898965354  
0.005870665961  
0.005841608561  
0.005815202927  
0.005788480834  
0.005761973249  
0.005734680706  
0.005709692846  
0.005685446183  
0.005657620688  
0.005635162289  
0.005612560609  
0.005588305103  
0.005564902254  
0.005542817307  
0.005520138634  
0.005498389201  
0.00547848459  
0.005456625859  
0.005436901038  
0.005417124625  
0.005396919277  
0.005377045788  
0.005358351042  
0.005340414776  
0.005324362076  
0.005305610025  
0.005287651071  
0.005270794905  
0.005254433582  
0.005240067665  
0.005224043793  
0.00520839493  
0.005192159808  
0.005178528139  
0.005163668846  
0.00515180307  
0.005137087999  
0.005125253998  
0.005111386165  
0.005099399353  
0.005087612099  
0.005076195531  
0.005064390035  
0.005053047887  
0.0050429758  
0.005032753901  
0.005021993892  
0.005014295034  
0.005003254227  
0.004995239931  
0.004986301127  
0.00497865948  
0.004969554669  
0.004962433277  
0.004956744274  
0.004947601859  
0.004942265873  
0.004936394842  
0.004929773732  
0.00492424283  
0.004919593852  
0.004914735493  
0.004908787113  
0.00490607812  
0.004900919709  
0.004897104389  
0.004894603353  
0.004890801273  
0.004887382991  
0.004885936029  
0.004883197725  
0.004882220387  
0.004880894064  
0.00487899336  
0.004877781852  
0.004879165885  
0.004878502005  
