------------------------------------------
Setting up environment variables
---
LD_LIBRARY_PATH is .:/opt/software/fix/1.065/MATLAB_Compiler_Runtime/v83/runtime/glnxa64:/opt/software/fix/1.065/MATLAB_Compiler_Runtime/v83/bin/glnxa64:/opt/software/fix/1.065/MATLAB_Compiler_Runtime/v83/sys/os/glnxa64
Warning: Name is nonexistent or not a directory: /usr/local/fsl/etc/matlab
[> In path at 109
  In startup at 1] 
Warning: Name is nonexistent or not a directory: /usr/local/fmrib/fmt
[> In path at 109
  In startup at 2] 
/home/mpib/LNDG/StateSwitch/WIP_rest/preproc/B_data/D_preproc/2107/preproc/rest/FEAT.feat/
    31     1

    31     2

    31     3

    31     4

    31     5

    31     6

    31     7

    31     8

    31     9

    31    10

    31    11

    31    12

    31    13

    31    14

    31    15

    31    16

    31    17

    31    18

    31    19

    31    20

    31    21

    31    22

    31    23

    31    24

    31    25

    31    26

    31    27

    31    28

    31    29

    31    30

    31    31

End of Matlab Script
