333.0740338  
352.4772693  
411.0921368  
553.3588053  
546.2710471  
2280.480571  
29078.25687  
4778.055402  
26814.93374  
1125.951066  
6431.403091  
5214.531689  
6818.893192  
5611.292169  
8396.194318  
3682.927431  
6412.349486  
4672.612296  
2102.696607  
103.869504  
9357.896872  
11211.93565  
9313.197243  
723.4858543  
537.4056527  
690.9058079  
17955.5011  
13858.02796  
6888.405521  
9609.517048  
9150.945072  
5409.649398  
6232.945792  
2718.799705  
2041.090312  
4794.495807  
10947.32524  
5409.463556  
11328.33019  
44453.44763  
3971.552723  
1703.709321  
2928.622123  
8451.073574  
5891.4384  
8346.557866  
3463.106815  
28566.63973  
19833.19927  
17102.25749  
28789.51931  
5784.49103  
5443.808793  
5779.887494  
5196.797894  
597.7863474  
498.7169607  
141.4972135  
8059.066849  
2723.862597  
15441.32753  
2415.533605  
1543.471732  
1239.162487  
320.1217675  
1308.710037  
892.0938837  
648.3518652  
378.1623715  
95.83136845  
325.8387812  
85.44464434  
118.832148  
68.97666509  
10.93400659  
18.13380498  
8.3872812  
19.66853184  
15.09112707  
16.17161957  
11.16153129  
4.575135114  
21.86993773  
16.3828761  
18.41488371  
13.92234832  
14.64382858  
15.00934231  
11.98831383  
12.27224619  
11.26895609  
10.72630608  
10.31883209  
9.975148722  
10.66645395  
10.86607754  
10.13901303  
9.757863735  
9.344317233  
9.471236176  
9.028949784  
8.94542191  
8.590157036  
8.393332593  
8.15569626  
7.979097827  
7.854142763  
7.634004691  
7.45977323  
7.343268915  
7.126668094  
7.033736442  
6.88081302  
6.706645584  
6.597868677  
6.47728693  
6.340893889  
6.228625862  
6.108767925  
5.999863822  
5.890445564  
5.776450642  
5.672922626  
5.572994422  
5.473336244  
5.381550834  
5.28601357  
5.197473575  
5.110459032  
5.026050969  
4.942479737  
4.863294386  
4.784797584  
4.70923287  
4.634528321  
4.563069174  
4.492484825  
4.423421832  
4.357179798  
4.291373581  
4.228299299  
4.166128486  
4.105676325  
4.046525401  
3.989198873  
3.93273123  
3.877815033  
3.824171826  
3.771617966  
3.720293289  
3.67032381  
3.621271091  
3.573350886  
3.5265411  
3.480730261  
3.435828482  
3.391997198  
3.349097731  
3.307073637  
3.265925825  
3.225647382  
3.186229873  
3.14758613  
3.109765673  
3.072663292  
3.036368943  
3.000753476  
2.965826603  
2.931626686  
2.898081283  
2.865236136  
2.832932665  
2.801306864  
2.770271735  
2.739799547  
2.70993702  
2.680618515  
2.651816527  
2.623558531  
2.595820534  
2.568611958  
2.541851802  
2.515610291  
2.48981534  
2.46446633  
2.439582636  
2.415133314  
2.391117473  
2.367484957  
2.344301201  
2.32147818  
2.299067016  
2.277011302  
2.255355105  
2.234049259  
2.213093264  
2.192487657  
2.172213053  
2.152281368  
2.132671176  
2.113366301  
2.094414649  
2.075710858  
2.057325683  
2.039206498  
2.021421095  
2.003912845  
1.986663906  
1.969654482  
1.952928279  
1.936459083  
1.920249529  
1.904279647  
1.888560709  
1.873065142  
1.857826032  
1.842787234  
1.827979761  
1.813404012  
1.799033389  
1.784881  
1.770924284  
1.757169259  
1.743610946  
1.730244299  
1.71709612  
1.704118623  
1.691351275  
1.678722619  
1.666268703  
1.654033767  
1.641936419  
1.630023106  
1.61827684  
1.606675051  
1.595251241  
1.583969666  
1.572847261  
1.561882737  
1.551057273  
1.540385821  
1.529847149  
1.519460179  
1.509190555  
1.499101929  
1.489117937  
1.479261392  
1.469535601  
1.459949023  
1.450497711  
1.441142885  
1.431914983  
1.422809659  
1.413834078  
1.404960879  
1.396208399  
1.387570824  
1.37902038  
1.370593414  
1.362274595  
1.354050777  
1.345944214  
1.337929174  
1.330009658  
1.32220659  
1.314477858  
1.306883929  
1.299341005  
1.291912573  
1.284567346  
1.277315399  
1.270141277  
1.263079816  
1.256073463  
1.249165329  
1.242336927  
1.235611983  
1.228947353  
1.222362519  
1.215850633  
1.209434037  
1.203086131  
1.196816006  
1.190604974  
1.184492665  
1.178442052  
1.172460963  
1.166530004  
1.160699945  
1.154923077  
1.149229001  
1.143599194  
1.138016357  
1.132509787  
1.127041845  
1.121661189  
1.116343233  
1.111089553  
1.10588418  
1.100746804  
1.09565853  
1.090623671  
1.08566398  
1.080763881  
1.0759015  
1.07110346  
1.06635995  
1.061676494  
1.057043728  
1.052444731  
1.047914041  
1.043432997  
1.039003533  
1.034618989  
1.030292458  
1.026012206  
1.021776658  
1.017584121  
1.013444726  
1.009334825  
1.005307705  
1.001294855  
0.9973405389  
0.9934307476  
0.9895601713  
0.985742977  
0.9819425476  
0.9782048171  
0.9745057817  
0.9708390084  
0.9672160879  
0.9636498036  
0.9601134404  
0.956607813  
0.9531372857  
0.9497271983  
0.9463384578  
0.9429888911  
0.9396905931  
0.9364183322  
0.9331874867  
0.9299773453  
0.9268150491  
0.9236982492  
0.9206047258  
0.917536625  
0.9145147869  
0.9115407875  
0.9085689629  
0.905650258  
0.9027470645  
0.8999072954  
0.8970845838  
0.8942923457  
0.8915161902  
0.8887729947  
0.8860886609  
0.8834208908  
0.880776019  
0.878167411  
0.875606091  
0.8730364685  
0.8705170847  
0.8680328812  
0.8655686554  
0.8631345717  
0.8607224711  
0.8583528497  
0.855998343  
0.8536668567  
0.8513674573  
0.8491063233  
0.846861769  
0.8446552609  
0.842452084  
0.8402785339  
0.838153805  
0.8360330486  
0.8339514442  
0.8318782789  
0.8298469115  
0.8278423937  
0.8258480126  
0.8238847664  
0.8219459663  
0.8200287223  
0.8181299708  
0.816257644  
0.814416014  
0.8125907525  
0.8107881765  
0.8090089953  
0.8072592412  
0.8055216599  
0.8038179646  
0.8021165315  
0.8004477581  
0.7988131654  
0.7971856942  
0.795581111  
0.7940019419  
0.7924406086  
0.7908956503  
0.7893853289  
0.7878746194  
0.7864067294  
0.7849449236  
0.7834962548  
0.7820897286  
0.7806978908  
0.7793247631  
0.7779585376  
0.7766267038  
0.7753070003  
0.7740216354  
0.7727265318  
0.7714778194  
0.7702366533  
0.7690082024  
0.7678031327  
0.7666228294  
0.7654624063  
0.7643016034  
0.7631768271  
0.7620612199  
0.7609765058  
0.7598860676  
0.7588256391  
0.7577943624  
0.7567839072  
0.7557811688  
0.7547876777  
0.7538148756  
0.7528599554  
0.7519307208  
0.751007187  
0.7501037754  
0.7492269997  
0.7483547875  
0.747510132  
0.7466842435  
0.7458670482  
0.745075413  
0.7442870091  
0.7435171236  
0.7427667755  
0.7420377467  
0.7413194645  
0.7406279192  
0.7399303102  
0.7392599799  
0.7386181904  
0.7379800717  
0.7373599058  
0.7367581538  
0.7361634346  
0.7355985999  
0.7350552852  
0.7345076537  
0.7339937097  
0.7334757032  
0.7329839961  
0.7324995368  
0.7320394717  
0.7315979181  
0.7311692213  
0.7307372971  
0.7303519199  
0.7299598466  
0.7295995853  
0.7292517423  
0.7288951304  
0.7285801479  
0.7282762726  
0.7279849531  
0.7276986838  
0.7274309757  
0.7271866373  
0.72695056  
0.7267375252  
0.7265353164  
0.7263506824  
0.7261762609  
0.7260193485  
0.7258695443  
0.7257468261  
0.7256281472  
0.7255342102  
0.7254584154  
0.7253955599  
0.7253374765  
0.7253103591  
0.7252881084  
0.7252839362  
