-0.222060764  
0.8694973017  
1.89167977  
2.768629574  
3.440314421  
3.869071024  
4.043259346  
3.977651756  
3.710626089  
3.298673601  
2.809037318  
2.311498463  
1.870352585  
1.53752038  
1.347512261  
1.31471149  
1.433097282  
1.678268379  
2.011377342  
2.384391932  
2.74603981  
3.047729338  
3.248827965  
3.320765806  
3.249596704  
3.036835806  
2.698562649  
2.262993419  
1.766860658  
1.251061576  
0.7561126785  
0.3179195934  
-0.0356667542  
-0.2871808207  
-0.4305576052  
-0.4708387319  
-0.4226958345  
-0.3080499626  
-0.1531379879  
0.01460290084  
0.1694691488  
0.2899657391  
0.3606180816  
0.3730271201  
0.3261595522  
0.225937769  
0.084234903  
-0.0825856437  
-0.2554586641  
-0.414592921  
-0.541494795  
-0.620905452  
-0.6424931966  
-0.6021456618  
-0.5026987217  
-0.353976387  
-0.1720472856  
0.02229932124  
0.2057592567  
0.3552036854  
0.450542587  
0.4774002107  
0.4292222815  
0.3084806808  
0.1267418088  
-0.09647886948  
-0.335985862  
-0.564046023  
-0.753985909  
-0.8837750858  
-0.9390836691  
-0.9153724391  
-0.8187136916  
-0.6651927915  
-0.4789680352  
-0.2892321148  
-0.1264800454  
-0.01857151838  
0.01290425466  
-0.0445065922  
-0.1923685543  
-0.4209300026  
-0.7100555516  
-1.03140012  
-1.35154945  
-1.635761991  
-1.851869655  
-1.973907472  
-1.985065526  
-1.879638981  
-1.663779424  
-1.354961954  
-0.9802327489  
-0.5734286794  
-0.1716690154  
0.18850506  
0.4749205433  
0.6630798488  
0.7386365192  
0.6987626657  
0.5522659372  
0.3184574868  
0.02491350529  
-0.2956110801  
-0.608745463  
-0.882127393  
-1.088686625  
-1.20921177  
-1.233963215  
-1.163183037  
-1.006527753  
-0.7815574263  
-0.5115250013  
-0.2227741341  
0.05795158382  
0.3059836459  
0.5007826397  
0.6274281311  
0.6774902101  
0.6493099437  
0.5477578485  
0.383561883  
0.1723086941  
-0.06681287044  
-0.3124421916  
-0.5426175044  
-0.7364135546  
-0.8755828997  
-0.946101  
-0.9394978918  
-0.8538319693  
-0.6941774166  
-0.4725091675  
-0.2069386829  
0.07969254775  
0.3617700656  
0.6132396423  
0.8100978466  
0.9327754526  
0.9681601829  
0.9110319666  
0.7647460492  
0.5410889819  
0.2593084319  
-0.05557725937  
-0.3750247737  
-0.6695430364  
-0.911358814  
-1.076916052  
-1.148985863  
-1.118202509  
-0.9838859784  
-0.7540949863  
-0.4449055122  
-0.07899753583  
0.3163177268  
0.7114370908  
1.076954232  
1.386066354  
1.616682544  
1.753069392  
1.78690306  
1.717694543  
1.552589037  
1.305604111  
0.9964194175  
0.6488172006  
0.288901653  
-0.05679430906  
-0.3632276754  
-0.6086759133  
-0.7764063868  
-0.8560667541  
-0.8446885267  
-0.7471832774  
-0.5762119066  
-0.3513496276  
-0.09750476207  
0.1573449423  
0.3849554932  
0.5598938398  
0.6625512075  
0.6816922438  
0.6161561103  
0.4753894827  
0.2786175043  
0.0526639036  
-0.1713910878  
-0.3623139025  
-0.4930399603  
-0.5446011056  
-0.5090640197  
-0.3910147641  
-0.2073038631  
0.01496093383  
0.2419437702  
0.4376657961  
0.5690115986  
0.6104537753  
0.5478333451  
0.3806461461  
0.1225147794  
-0.2002263234  
-0.5516495673  
-0.8906268923  
-1.175909825  
-1.371222464  
-1.449713133  
-1.397195678  
-1.213799797  
-0.9138605079  
-0.5241111219  
-0.0804508128  
0.3762510851  
0.8047774026  
1.168015939  
1.436720584  
1.592151615  
1.627343917  
1.546943864  
1.365715531  
1.1060217  
0.79466434  
0.4595471591  
0.126599315  
-0.1826525448  
-0.4526176068  
-0.6741632571  
-0.8441706906  
-0.9643282172  
-1.03943602  
-1.075581423  
-1.078513389  
-1.052490022  
-0.9997695169  
-0.9207761839  
-0.8148551678  
-0.6814190956  
-0.5212114465  
-0.3374231838  
-0.1363964359  
0.07223917175  
0.2760709294  
0.4609898363  
0.6127058035  
0.7184624737  
0.7686742651  
0.7582398145  
0.6873151371  
0.5614472044  
0.3910298176  
0.1901937994  
-0.02472307794  
-0.2368969395  
-0.430701706  
-0.59315089  
-0.7149389833  
-0.7910002569  
-0.8205683794  
-0.8067926515  
-0.7560285841  
-0.676926583  
-0.5794750073  
-0.4741043749  
-0.3709463576  
-0.279276436  
-0.2071206993  
-0.1609815313  
-0.1456044655  
-0.1637339084  
-0.2158055213  
-0.2996138554  
-0.4100020359  
-0.5386970835  
-0.6744185282  
-0.803379462  
-0.910248764  
-0.9795699916  
-0.9975333693  
-0.9539047808  
-0.8438493282  
-0.6693448549  
-0.4399060364  
-0.1723994285  
0.1101585691  
0.3807696205  
0.6114122044  
0.7764304663  
0.8559479004  
0.8388039201  
0.7245819523  
0.5243728164  
0.2600844768  
-0.03770078055  
-0.3330999434  
-0.5891477524  
-0.7723087062  
-0.8566859209  
-0.8273572155  
-0.6823542515  
-0.433017854  
-0.1026597513  
0.2762755162  
0.6661615418  
1.028693019  
1.329324696  
1.54104768  
1.647022518  
1.641767292  
1.530842463  
1.329178785  
1.058412179  
0.7436952167  
0.4105108761  
0.08195574451  
-0.2231464703  
-0.4911363511  
-0.7134228568  
-0.8855931709  
-1.006049381  
-1.074555836  
-1.09105791  
-1.055059837  
-0.965691049  
-0.8224511507  
-0.6264441953  
-0.3818052494  
-0.0969548133  
0.2146655287  
0.5346489252  
0.8406052569  
1.108014698  
1.312758536  
1.433964453  
1.456735143  
1.374327708  
1.189411593  
0.9141850898  
0.5692908129  
0.1816796159  
-0.2182715829  
-0.5999921203  
-0.935830704  
-1.203653122  
-1.388610248  
-1.483913457  
-1.490610888  
-1.416513005  
-1.274508333  
-1.080590801  
-0.8518881546  
-0.6049612221  
-0.3545394318  
-0.1127571045  
0.1111398502  
0.310699243  
0.4819371836  
0.6229021965  
0.7332426513  
0.8138360996  
0.8664838863  
0.8936448229  
0.8981528768  
0.8828771737  
0.850308832  
0.8021094132  
0.7386983801  
0.65899157  
0.5604055738  
0.4392254365  
0.2913647057  
0.1134762024  
-0.09572703587  
-0.3341551015  
-0.5952871597  
-0.8676561321  
-1.1350768  
-1.377737841  
-1.574128367  
-1.703612625  
-1.749336345  
-1.701026522  
-1.55722924  
-1.326557241  
-1.027641532  
-0.6876662807  
-0.3395809491  
-0.01829913846  
0.2436159198  
0.4201887616  
0.4955641984  
0.4662977677  
0.3420382507  
0.1444466715  
-0.09553198973  
-0.3416949164  
-0.5573659233  
-0.710268154  
-0.7768301187  
-0.7453099544  
-0.6173233591  
-0.4075615782  
-0.1417622175  
0.1467853585  
0.4217006531  
0.6483381565  
0.7983123471  
0.8531517338  
0.8066029437  
0.6653215274  
0.4479055648  
0.1824229188  
-0.09719769701  
-0.3554366254  
-0.5595423921  
-0.6834393413  
-0.7106991344  
-0.636246855  
-0.4666341093  
-0.2189014112  
0.08176682144  
0.4052574911  
0.720183207  
0.9975112237  
1.213722719  
1.353144189  
1.40920573  
1.384511687  
1.289789846  
1.141884441  
0.961110754  
0.7683357948  
0.5821885363  
0.4167631232  
0.2801102044  
0.1736899954  
0.0928124158  
0.02796219804  
-0.03323195263  
-0.1037041553  
-0.1946882242  
-0.3138185756  
-0.463858922  
-0.6422074869  
-0.8412063448  
-1.04914546  
-1.251776163  
-1.434061435  
-1.58191178  
-1.683655495  
-1.731092363  
-1.72004416  
-1.650412024  
-1.525818328  
-1.352967561  
-1.140854188  
-0.8999486074  
-0.6414521077  
-0.3766589647  
-0.1164334727  
0.129233209  
0.3516160953  
0.5436328093  
0.7002051498  
0.8185811689  
0.8985525906  
0.9424971022  
0.955181755  
0.9432725063  
0.9145621658  
0.8769690395  
0.8374171812  
0.8007595784  
0.7689128868  
0.7403709205  
0.7102313631  
0.670783747  
0.6126461434  
0.5263334701  
0.4040604343  
0.2415394773  
0.0394771938  
-0.1954738321  
-0.4505283313  
-0.7074588356  
-0.9441554819  
-1.136931997  
-1.26332734  
-1.305059202  
-1.250740532  
-1.097974265  
-0.8544887822  
-0.5380997399  
-0.1754132144  
0.2006303065  
0.5541351306  
0.8501542984  
1.058660951  
1.158083313  
1.137947414  
1.000276821  
0.7595509191  
0.4412036062  
0.07884074744  
-0.2894908887  
-0.6255144266  
-0.8949044556  
-1.070930114  
-1.137133302  
-1.088756581  
-0.932797478  
-0.6867474685  
-0.3762305004  
-0.03189050497  
0.3140638147  
0.6312267407  
0.8938951138  
1.083212682  
1.188375547  
1.206865533  
1.143776489  
1.010421222  
0.8224515792  
0.5977656166  
0.35447437  
0.109143145  
-0.1245214433  
-0.3364470527  
-0.5204210326  
-0.6738167149  
-0.7969251702  
-0.8920303324  
-0.96238731  
-1.011258544  
-1.041133273  
-1.053240594  
-1.047399654  
-1.022216058  
-0.9755765715  
-0.9053493605  
-0.8101718451  
-0.6901831541  
-0.5475714624  
-0.3868239147  
-0.2146249271  
-0.03937885223  
0.129564294  
0.2829022076  
0.4124081738  
0.5118511547  
0.5776412872  
0.6090798708  
0.6081708223  
0.5790100746  
0.5268631519  
0.4570938469  
0.3741458016  
0.2807707024  
0.1776613541  
0.06356972471  
-0.06409567974  
-0.2082925075  
-0.3711565037  
-0.5528182923  
-0.7504517114  
-0.9577409379  
-1.164889966  
-1.359221042  
-1.526299038  
-1.651459026  
-1.721523032  
-1.72648058  
-1.66088614  
-1.524773239  
-1.323932448  
-1.069494375  
-0.7768456748  
-0.4640015668  
-0.1496450773  
0.1489012439  
0.4174952561  
0.6465064853  
0.8314765035  
0.9729949995  
1.075825134  
1.147432711  
1.196169677  
1.229449799  
1.252246525  
1.266202461  
1.269531746  
1.257752246  
1.225132844  
1.166587281  
1.079653513  
0.9661590868  
0.833190887  
0.6931079413  
0.5624807652  
0.4600268418  
0.4038102961  
0.4081063152  
0.4804426404  
0.6193198004  
0.8130605283  
1.040074945  
1.270623432  
1.469939537  
1.602355429  
1.635896394  
1.546730431  
1.322848489  
0.9664329589  
0.4945623532  
-0.06190867987  
-0.6611836595  
-1.25475692  
-1.792529058  
-2.22819196  
-2.524233404  
-2.655958793  
-2.614080911  
-2.405577583  
-2.052767549  
-1.590747486  
-1.063536679  
-0.5194043961  
-0.00594913505  
0.4345209904  
0.7688026626  
0.9754319082  
1.045930616  
0.9846258849  
0.8071818589  
0.53812667  
0.2077442024  
-0.1512500437  
-0.506868515  
-0.8305040542  
-1.098884233  
-1.295216633  
-1.409558032  
-1.438530303  
-1.384574335  
-1.254942553  
-1.060633008  
-0.8153970923  
-0.5348992774  
-0.2360197276  
0.06374260175  
0.3468611853  
0.5964526742  
0.7970669831  
0.9356082038  
1.002321828  
0.9917321629  
0.90339564  
0.7423099257  
0.5188872806  
0.2484127261  
-0.04998868686  
-0.3547944605  
-0.6437892053  
-0.8958513087  
-1.092637052  
-1.219980677  
-1.268895762  
-1.23609618  
-1.124029622  
-0.9404692496  
-0.6977430132  
-0.4117129  
-0.1006093175  
0.2161757513  
0.5192579142  
0.7903359288  
1.013133848  
1.174198947  
1.2635354  
1.275079571  
1.207000216  
1.061817616  
0.8463236412  
0.571287873  
0.2509483762  
-0.09771762759  
-0.4559107295  
-0.8040713264  
-1.12303017  
-1.395170302  
-1.605513876  
-1.742662769  
-1.799503938  
-1.773637977  
-1.667476646  
-1.488008046  
-1.246242324  
-0.9563862264  
-0.6348130247  
-0.2989298291  
0.03396650644  
0.3477414216  
0.6283061947  
0.8642738789  
1.04736943  
1.172599283  
1.238214812  
1.245511579  
1.198502617  
1.10350884  
0.9686806254  
0.8034638815  
0.6180280686  
0.4226701392  
0.2272287935  
0.0405614791  
-0.1298713661  
-0.2782563107  
-0.4004861642  
-0.4940382104  
-0.5577020818  
-0.5912361559  
-0.5950334247  
-0.5698757651  
-0.5168324797  
-0.4373106433  
-0.3332361045  
-0.2072902194  
-0.06312026568  
0.09457044929  
0.2601089233  
0.4271500792  
0.589146982  
0.7399275927  
0.8742653492  
0.9883293071  
1.07990009  
1.148299258  
1.194016378  
1.218090505  
1.221368564  
1.203790629  
1.163876902  
1.098564196  
1.003500816  
0.8738009103  
0.7052072326  
0.4954885955  
0.2458409593  
-0.03796635979  
-0.3449656064  
-0.6590793387  
-0.9600228702  
-1.225003689  
-1.431051279  
-1.557706211  
-1.5897068  
-1.519291297  
-1.347754956  
-1.085989825  
-0.7538808856  
-0.3785641584  
0.00825029877  
0.3735771594  
0.6866560965  
0.9222016394  
1.062988168  
1.10144149  
1.040052256  
0.890590946  
0.6722603899  
0.4090611287  
0.1267542304  
-0.1501792471  
-0.401179046  
-0.6115273908  
-0.773358286  
-0.8856856103  
-0.9535344743  
-0.9863821695  
-0.996182312  
-0.9952966844  
-0.9946259139  
-1.002187497  
-1.022279102  
-1.055288225  
-1.098086942  
-1.144890583  
-1.18840446  
-1.221066527  
-1.236200123  
-1.228942927  
-1.196844642  
-1.14010758  
-1.061457163  
-0.9657087603  
-0.8590803499  
-0.7483576809  
-0.6399892563  
-0.5392096675  
-0.4492806694  
-0.3709418891  
-0.3021339162  
-0.238070871  
-0.1716872322  
-0.09446763198  
0.002391413151  
0.1265851751  
0.2832218876  
0.473451026  
0.6934116935  
0.9336993306  
1.179500355  
1.411483129  
1.607405569  
1.744341877  
1.801279407  
1.761812898  
1.616593415  
1.365229255  
1.017347911  
0.5926598851  
0.1199248745  
-0.3651197167  
-0.8227149572  
-1.212662469  
-1.498192764  
-1.649727474  
-1.648158824  
-1.487261171  
-1.174948599  
-0.7331791458  
-0.1964428605  
0.3910900918  
0.9795163551  
1.517883674  
1.959132087  
2.26476524  
2.408734417  
2.380078802  
2.183997367  
1.841211128  
1.38565531  
0.860773612  
0.3148194056  
-0.2042589707  
-0.6537622255  
-1.000422097  
-1.223350054  
-1.315439664  
-1.283118705  
-1.14456534  
-0.9266865829  
-0.6613194039  
-0.3811862003  
-0.1161363127  
0.1098550708  
0.2805990757  
0.3883737755  
0.433394651  
0.4223016918  
0.3659989508  
0.2772568714  
0.1684846035  
0.05001183935  
-0.07090758499  
-0.1902978147  
-0.3069423373  
-0.4213373321  
-0.5343991821  
-0.6462027555  
-0.7550324848  
-0.8569197728  
-0.9457599514  
-1.01397386  
-1.05359035  
-1.057545604  
-1.020964535  
-0.9421897876  
-0.8233774027  
-0.6705428121  
-0.4930381617  
-0.3025426785  
-0.1117099032  
0.06730974264  
0.2242473496  
0.3517869182  
0.4461614458  
0.5072105219  
0.5378920931  
0.5433601933  
0.5297718841  
0.5030334496  
0.4677019292  
0.4262253484  
0.3786299928  
0.3226987068  
0.2545779523  
0.1696927066  
0.06380676935  
-0.0659628115  
-0.2203313744  
-0.3973493744  
-0.5922685636  
-0.7977600003  
-1.004419811  
-1.201456674  
-1.377464821  
-1.521188723  
-1.622214581  
-1.67158137  
-1.662295413  
-1.58979035  
-1.452338306  
-1.251419283  
-0.9920135297  
-0.6827631325  
-0.3359020032  
0.03311655237  
0.4063779319  
0.7646495142  
1.088870883  
1.361849089  
1.569958272  
1.704609573  
1.763243367  
1.749647285  
1.673505474  
1.549192226  
1.393961033  
1.225789411  
1.061194125  
0.9133542196  
0.7907951578  
0.6968148756  
0.6296680781  
0.5834172307  
0.5492419824  
0.5169548495  
0.4764679139  
0.4190026798  
0.3379340318  
0.229243383  
0.09164892696  
-0.07347508879  
-0.2622660146  
-0.4685348246  
-0.6838950174  
-0.8978883692  
-1.098220739  
-1.271211522  
-1.402581932  
-1.478630495  
-1.487754506  
-1.422185597  
-1.279693583  
-1.064965693  
-0.7903492437  
-0.4756931246  
-0.1471422461  
0.1651220691  
0.4300135435  
0.6192016451  
0.7108366577  
0.6927964783  
0.5649511381  
0.340029055  
0.04284427116  
-0.2921147146  
-0.6245112793  
-0.9129554577  
-1.120140081  
-1.217637462  
-1.189676662  
-1.035369535  
-0.7690340245  
-0.4185462812  
-0.02193494482  
0.377339228  
0.7357650272  
1.015097777  
1.186897489  
1.235695798  
1.160405501  
0.9738447023  
0.7005125181  
0.3729941173  
0.02754166108  
