0.6561267804  
0.9135610606  
1.49671253  
11.56391527  
166.2748512  
2181.097905  
39394.54018  
19370.6065  
4663.112555  
11439.19533  
34237.2185  
12611.82624  
9965.528819  
30895.47946  
13895.92213  
17673.14268  
73350.52845  
18950.16537  
18530.90458  
3753.022777  
5731.185708  
2581.050589  
15859.40634  
509.480937  
6103.046656  
2978.806755  
21706.35021  
23439.04384  
913.0185372  
1907.429715  
6964.910787  
5332.500502  
2726.499012  
3776.481481  
13155.97336  
1723.631648  
282.0034818  
5223.305963  
4374.891112  
422.7861355  
1470.482461  
1429.080117  
6068.382733  
2197.704161  
1346.187375  
3416.940719  
531.2848817  
820.250933  
8182.251736  
1680.122799  
417.6889955  
5867.180961  
740.9127749  
2550.836783  
2748.955559  
2432.44621  
1018.896151  
152.3773422  
743.9232439  
2565.665946  
563.1943305  
1761.092235  
58.14270676  
176.3418544  
1310.90114  
57.28853852  
124.742223  
187.9414544  
49.9765986  
10.03093872  
9.926345237  
15.01409778  
13.64252692  
7.559432024  
4.381336142  
0.2088221568  
5.082752268  
5.986774553  
1.358690736  
1.051177737  
0.5661817289  
0.6117419111  
0.9114700199  
0.6606420452  
0.6180298279  
1.445009929  
0.6216059778  
0.6510346875  
0.712850228  
0.6668946375  
0.4582644833  
0.5616477763  
0.5138649319  
0.4261601078  
0.4598164445  
0.4517407849  
0.4171686056  
0.3834621131  
0.3956051172  
0.3756236  
0.3508218158  
0.3374289119  
0.3263345638  
0.3077741384  
0.2956679382  
0.2872159912  
0.2778424598  
0.2655163361  
0.2557622719  
0.246755601  
0.2376429595  
0.2310656601  
0.2219748012  
0.2148552185  
0.2084701626  
0.2013205736  
0.1953392355  
0.1885588892  
0.183622408  
0.1776988559  
0.17207387  
0.1674833437  
0.162479281  
0.1579776256  
0.1533039043  
0.1491782739  
0.1450702959  
0.1410287261  
0.1372791972  
0.1336398958  
0.1301298717  
0.1267454723  
0.1235484285  
0.1204471222  
0.1174211602  
0.1145730822  
0.1117657406  
0.1090793539  
0.1064956378  
0.1040037816  
0.1015990927  
0.09925435809  
0.09701797339  
0.09484663056  
0.09274690542  
0.09071912358  
0.08875715348  
0.08685971458  
0.08502520708  
0.08323757134  
0.08152050837  
0.07985470997  
0.07823676246  
0.07666317313  
0.07514569188  
0.0736685817  
0.07223753353  
0.07084834478  
0.0695084901  
0.06819789914  
0.06692286754  
0.06569366239  
0.06449000525  
0.06333221497  
0.06219771125  
0.0610942864  
0.06002385425  
0.058980524  
0.05796706231  
0.05698020911  
0.05602079614  
0.05508042489  
0.05417411746  
0.05328562684  
0.05242317855  
0.05158151679  
0.05075832826  
0.04995969651  
0.04917550385  
0.04841914483  
0.04767275773  
0.04695204955  
0.04624245925  
0.04555426275  
0.04488017193  
0.04422417239  
0.04358232753  
0.04295669017  
0.04234328275  
0.04174573932  
0.04116121575  
0.04059034483  
0.04003277508  
0.03948514778  
0.03895498193  
0.03842985707  
0.03792140954  
0.03741980697  
0.03693322027  
0.03645380721  
0.03598610523  
0.03552790834  
0.0350786016  
0.03464095142  
0.0342123333  
0.03379347007  
0.03338114743  
0.03297618724  
0.03258061618  
0.03219334355  
0.03181410929  
0.03144291765  
0.03107795251  
0.03071957196  
0.03037184803  
0.03002606759  
0.0296873911  
0.0293568619  
0.0290310045  
0.02871738825  
0.0284047452  
0.02809959507  
0.02779823367  
0.0275039383  
0.02721433951  
0.02692650842  
0.0266495355  
0.0263779478  
0.0261055895  
0.02584309433  
0.0255812127  
0.02532462955  
0.02507695154  
0.02483457224  
0.02459247324  
0.02435518936  
0.02412191185  
0.02389184549  
0.02366697462  
0.02344604718  
0.02322809595  
0.02301492438  
0.02280276268  
0.02259664065  
0.02239505433  
0.02219315269  
0.02199652613  
0.02180383977  
0.02161127583  
0.02142935283  
0.02124449531  
0.02106130644  
0.02088511156  
0.02070634613  
0.0205364005  
0.02036406573  
0.02019923241  
0.0200360224  
0.01987302999  
0.01971023118  
0.01955637241  
0.01940039204  
0.01924894106  
0.01909801751  
0.01894886114  
0.01880579338  
0.0186618749  
0.0185244141  
0.01838097333  
0.01824246985  
0.01811044572  
0.01797691394  
0.0178449501  
0.01771824523  
0.01759137129  
0.01746477541  
0.01734095711  
0.01721906965  
0.01710260333  
0.01698272968  
0.01686583206  
0.01675236887  
0.01663560287  
0.01652790849  
0.0164175912  
0.01630885061  
0.01620317551  
0.01609713796  
0.01599240485  
0.01589007189  
0.01578811364  
0.01568885975  
0.01559031457  
0.0154932178  
0.0153977423  
0.01530298175  
0.01520858035  
0.01512024959  
0.01502826276  
0.01493897826  
0.01485115266  
0.01476508239  
0.01468127248  
0.01459295221  
0.01451201578  
0.01442751703  
0.01434653756  
0.01426488934  
0.01418640961  
0.01410818068  
0.01403150576  
0.01395512027  
0.01387963595  
0.01380689675  
0.01373382452  
0.0136608733  
0.01358954915  
0.01352135544  
0.01344778635  
0.01338081241  
0.01331251503  
0.01324613288  
0.01318116508  
0.01311706035  
0.01305149076  
0.012986884  
0.01292676908  
0.01286483728  
0.01280311352  
0.01274157679  
0.01268150896  
0.01262212921  
0.0125646421  
0.0125092285  
0.0124523072  
0.01239419696  
0.01234025324  
0.0122873996  
0.01223336525  
0.01217966932  
0.01212648622  
0.01207609504  
0.0120230426  
0.01197183053  
0.0119206433  
0.0118714608  
0.01182519015  
0.01177694447  
0.01172887507  
0.01168288924  
0.01163486859  
0.01159040522  
0.01154688713  
0.01149881541  
0.01145689757  
0.01141493654  
0.01137001955  
0.01132879252  
0.01128610773  
0.01124556497  
0.011205156  
0.01116267067  
0.01112165933  
0.01108447336  
0.01104541623  
0.01100649539  
0.01097025318  
0.01093187645  
0.0108946084  
0.01085955132  
0.01082268854  
0.01078728863  
0.01075223958  
0.01071721569  
0.01068514986  
0.01064986382  
0.01061466275  
0.01058338503  
0.01055118252  
0.0105193076  
0.01048693309  
0.01045733463  
0.01042537512  
0.01039583519  
0.01036615257  
0.0103349464  
0.01030592332  
0.01027816757  
0.01024873291  
0.0102216497  
0.01019471947  
0.01016651045  
0.01013760088  
0.01011216466  
0.01008591781  
0.01006187435  
0.01003641753  
0.01000868609  
0.009984718231  
0.009958928408  
0.009935986226  
0.009911837327  
0.00988828229  
0.009864411805  
0.00984205169  
0.009819073447  
0.009796742691  
0.00977618632  
0.009755592006  
0.009733079049  
0.009714145422  
0.009693172887  
0.009670713891  
0.009651479364  
0.009632289673  
0.009612548061  
0.009594467845  
0.009575359602  
0.009555366378  
0.009538843168  
0.009521679347  
0.009502581905  
0.009484902956  
0.009469335379  
0.009452565315  
0.009436880181  
0.009419779201  
0.009403264469  
0.009389039402  
0.009371177131  
0.009359198347  
0.009342386545  
0.009329589845  
0.009313374737  
0.009299832119  
0.009286140297  
0.009273378867  
0.009258672689  
0.009245917004  
0.009233630868  
0.009223088246  
0.009208895478  
0.009197435758  
0.0091846982  
0.009173850799  
0.009163824662  
0.009152379253  
0.009142865923  
0.009132700345  
0.009121026618  
0.009111158421  
0.009102747978  
0.009092272994  
0.009083180522  
0.009075539862  
0.009064969119  
0.009057128947  
0.009047896773  
0.009041021034  
0.009033181332  
0.009025540511  
0.009016972268  
0.009010334112  
0.009003768659  
0.008998888767  
0.008991849539  
0.008984194872  
0.008978318732  
0.008971778496  
0.008969231805  
0.00896228769  
0.008957189242  
0.008951152092  
0.008949708191  
0.008943050901  
0.008940342423  
0.008936213619  
0.008932887559  
0.008930177388  
0.008924675121  
0.008923136613  
0.008918635405  
0.008917433815  
0.008914252512  
0.008911514067  
0.008910816992  
0.008909261738  
0.00890667242  
0.008906493182  
0.008905482001  
0.008904638964  
0.00890429812  
0.008904213189  
0.008902170883  
