296.9564188  
323.7591247  
387.3406864  
563.7293  
965.548025  
196.78175  
60297.05354  
12529.97738  
36612.64395  
2004.005  
4972.413598  
6905.361084  
6947.929647  
42677.67876  
27621.72757  
23965.34238  
3270.159071  
8448.461216  
24027.09743  
8484.238808  
19831.42039  
2041.674961  
20110.20852  
18235.63823  
12800.73814  
6606.703324  
15199.05802  
27524.01543  
9083.748199  
5342.714012  
3414.672263  
1992.341773  
3481.541376  
7322.289809  
524.1224225  
6891.765583  
2058.442195  
547.226852  
9987.96517  
8296.652879  
2796.912609  
1717.019803  
3380.514433  
124.2869932  
2660.037239  
799.733168  
224.590958  
379.7733389  
1117.454607  
2256.145512  
3622.128294  
5860.862  
227.4007025  
1102.029476  
1503.468926  
40.18035024  
1400.040338  
1244.450366  
879.0757729  
543.2066434  
836.6491057  
214.350281  
668.4345258  
201.6721963  
104.4085465  
211.7528696  
140.2455743  
34.81259736  
89.91910063  
55.58129563  
46.93479954  
10.38176262  
46.70710368  
41.20174471  
9.477104866  
24.33863568  
10.79070444  
13.84075618  
7.544365303  
8.150378956  
8.871230344  
5.187314661  
5.617743845  
5.872813005  
4.59573677  
5.066686098  
4.098044585  
4.102422749  
3.812431136  
3.426578699  
3.343893852  
2.934148663  
3.024513674  
2.6837455  
2.570069987  
2.414901124  
2.319355956  
2.185702247  
2.039578888  
1.948130495  
1.824114404  
1.750949147  
1.66968071  
1.571553043  
1.497029157  
1.424858143  
1.359876812  
1.299198351  
1.238495105  
1.186066414  
1.130000381  
1.07976444  
1.034497405  
0.990575853  
0.9494325075  
0.9109790966  
0.8748426017  
0.8394704901  
0.8071276895  
0.7753682337  
0.745249563  
0.7178985417  
0.6913058423  
0.6656190226  
0.6413819324  
0.6187615696  
0.596332964  
0.5755619247  
0.5555398425  
0.5367924027  
0.5187721354  
0.5013386399  
0.4847817594  
0.4689947669  
0.4538837371  
0.4394121676  
0.4255432714  
0.4122866842  
0.3995265201  
0.3873005903  
0.3755309589  
0.3643398803  
0.3535635987  
0.3431530367  
0.3332064951  
0.3236509655  
0.314410122  
0.3055683434  
0.297042874  
0.2888349794  
0.2809173512  
0.273302576  
0.2659739249  
0.2589029142  
0.2520695512  
0.2454905354  
0.2391378948  
0.2329999433  
0.2270775718  
0.2213515634  
0.2158331294  
0.2105011737  
0.2053363853  
0.2003389918  
0.1955178561  
0.190840954  
0.18632115  
0.1819462856  
0.1777045412  
0.1736090627  
0.1696326667  
0.1657818273  
0.1620449572  
0.1584368597  
0.1549206942  
0.1515189713  
0.148214688  
0.1450102178  
0.1418956475  
0.138882172  
0.1359514078  
0.1331004939  
0.130338873  
0.1276529046  
0.1250487552  
0.1225031016  
0.1200377594  
0.1176527526  
0.1153154902  
0.1130382048  
0.1108364705  
0.1086899519  
0.1066024097  
0.1045713497  
0.1025848702  
0.1006602327  
0.09877649392  
0.09695184379  
0.09517374231  
0.09343805898  
0.09174292498  
0.09010063315  
0.08848740542  
0.08692026613  
0.0853873743  
0.08390130924  
0.0824485817  
0.08102872256  
0.07964576176  
0.07829245137  
0.07697489843  
0.07568844075  
0.07443382094  
0.0732061834  
0.07200595311  
0.0708403366  
0.06969501005  
0.06857499942  
0.06748996558  
0.06642250538  
0.06537330396  
0.06435957088  
0.063367592  
0.06239167991  
0.06144263864  
0.06051200125  
0.05960185596  
0.05870810521  
0.05783589332  
0.05698721848  
0.05615247419  
0.05533327428  
0.05453697002  
0.05375476901  
0.05299316913  
0.05224669341  
0.05150614171  
0.05079214528  
0.05008320546  
0.04939744522  
0.04872678525  
0.0480607573  
0.04741610063  
0.04678109415  
0.04616088671  
0.04554625478  
0.04495093764  
0.0443651719  
0.04378747543  
0.04321994372  
0.04267371578  
0.04213125557  
0.04160216779  
0.04108486754  
0.04056797107  
0.0400683083  
0.0395776351  
0.03909580066  
0.03862201288  
0.03816105128  
0.03770430844  
0.03725630625  
0.03682049854  
0.03638562822  
0.03596752556  
0.03555056389  
0.03514242968  
0.03474084523  
0.03435276413  
0.03396775103  
0.03358957633  
0.03321342659  
0.03284834992  
0.03248633058  
0.03213806401  
0.03178944114  
0.03144855034  
0.03111339112  
0.03078512506  
0.03046145904  
0.03014394882  
0.02983141845  
0.0295255671  
0.02922757229  
0.02892901333  
0.02863616868  
0.02835014844  
0.02806935143  
0.02779228574  
0.02751985073  
0.0272513503  
0.02698761725  
0.02672985654  
0.02647336539  
0.02622190186  
0.02597513304  
0.02573144621  
0.02549307835  
0.02525927258  
0.02502964699  
0.02480444205  
0.02457717984  
0.02436145515  
0.02413961498  
0.02392661539  
0.02372055896  
0.0235132046  
0.02330895235  
0.02311013954  
0.02291121858  
0.02271594228  
0.02252713216  
0.0223382929  
0.02215019983  
0.02196968017  
0.02179318891  
0.02161645536  
0.02144244987  
0.02127184946  
0.02110392218  
0.02093668716  
0.02077462498  
0.02061240863  
0.02045467487  
0.02029843642  
0.02014168046  
0.01998889545  
0.01984176896  
0.01969453946  
0.01955058354  
0.0194100955  
0.01926625668  
0.01912616101  
0.01899017859  
0.01885628119  
0.01872464535  
0.01859003278  
0.01846429449  
0.01833759186  
0.01821434808  
0.01808993882  
0.01796785217  
0.01784720521  
0.01772710122  
0.01761539696  
0.01749762861  
0.01738718821  
0.01727497683  
0.01716607117  
0.01705649984  
0.01695210401  
0.01684660173  
0.01674476434  
0.01663808663  
0.01653872153  
0.01644019082  
0.01634338222  
0.01624650627  
0.01615239136  
0.01605921308  
0.0159669641  
0.01587666613  
0.01578478682  
0.01569835866  
0.01560994131  
0.01552357713  
0.01544079746  
0.01535621694  
0.01527543316  
0.01519506148  
0.01511543148  
0.01503533902  
0.01495854339  
0.01488062366  
0.01480603928  
0.01473295731  
0.01465986938  
0.01458694495  
0.01451539254  
0.01444486535  
0.01437675182  
0.01430535521  
0.01424296603  
0.01417766201  
0.01411142945  
0.01404669937  
0.01398372557  
0.0139196279  
0.01385908238  
0.01379661369  
0.01374013386  
0.01368007178  
0.01362338422  
0.0135647832  
0.01350758831  
0.01345175709  
0.01339972298  
0.01334773581  
0.01329275088  
0.01324110414  
0.01318908303  
0.01313872773  
0.01308746079  
0.01304073398  
0.01299162098  
0.0129444095  
0.01289840025  
0.01285440376  
0.01280661133  
0.01276205604  
0.01271958039  
0.0126753216  
0.01263307581  
0.01259045412  
0.0125514827  
0.01250790044  
0.01246869655  
0.01243132833  
0.01239360528  
0.01235419237  
0.0123201039  
0.0122802023  
0.01224593141  
0.01221137951  
0.01217669894  
0.01214082136  
0.01211021226  
0.0120743707  
0.01204287516  
0.01201143417  
0.01198278365  
0.0119499941  
0.01192073713  
0.01189314596  
0.0118631879  
0.01183444574  
0.01180690879  
0.01177897495  
0.01175312519  
0.01172763573  
0.01170366153  
0.0116759702  
0.01165151208  
0.01162897172  
0.0116048155  
0.01158028862  
0.01155952542  
0.01154045392  
0.01151666961  
0.01149548233  
0.01147611158  
0.01145803075  
0.01143847177  
0.0114197835  
0.01140119506  
0.01138388104  
0.0113670599  
0.0113510061  
0.01133325565  
0.01131907214  
0.0113019438  
0.01128705347  
0.01127351218  
0.0112589303  
0.01124482692  
0.01123272796  
0.0112211898  
0.01120856734  
0.01119954434  
0.01118561709  
0.01117550676  
0.01116499067  
0.01115563556  
0.01114777176  
0.01114002185  
0.01113007014  
0.01112106649  
0.01111511303  
0.01110934753  
0.01110198892  
0.01109533968  
0.01108833584  
0.01108340872  
0.01107981291  
0.011073933  
0.01107158735  
0.01107085568  
0.01106441352  
0.01106414764  
0.01106111514  
0.0110601665  
0.01106037404  
0.01105798941  
0.01105806147  
