-0.0946310143  
-0.1233523547  
-0.1411374622  
-0.1375395154  
-0.1050775269  
-0.04031909745  
0.05553751623  
0.1766208527  
0.3128954372  
0.4511452977  
0.5763325317  
0.673149717  
0.7276271932  
0.7286057828  
0.6689267379  
0.546237627  
0.3633206369  
0.1279322425  
-0.1478264406  
-0.4485395061  
-0.7568011431  
-1.054701945  
-1.325328908  
-1.554144124  
-1.730106051  
-1.846433704  
-1.900950935  
-1.895981426  
-1.8378156  
-1.735811511  
-1.601225157  
-1.445908975  
-1.281014064  
-1.115857029  
-0.9570760339  
-0.8081913664  
-0.6696174419  
-0.5391241195  
-0.4126871345  
-0.2856034004  
-0.1536998462  
-0.01445686509  
0.1321458905  
0.2831992841  
0.4329529281  
0.5734167639  
0.6954131648  
0.7899207019  
0.8494935371  
0.8695450023  
0.8492434251  
0.7918768262  
0.7045901662  
0.5975140576  
0.482398556  
0.3709628692  
0.2732068406  
0.195961308  
0.1419102067  
0.1092514157  
0.09205838028  
0.08129827489  
0.06635778837  
0.03684347165  
-0.01562962161  
-0.09591609882  
-0.2043353553  
-0.3363346633  
-0.4828580149  
-0.6313801367  
-0.7674415658  
-0.8764663098  
-0.94559668  
-0.9652823464  
-0.9304197254  
-0.8408800492  
-0.7013844295  
-0.5207599264  
-0.3107121496  
-0.08430796174  
0.145598395  
0.3677708681  
0.5736248586  
0.7577682933  
0.9179874168  
1.054732789  
1.170201592  
1.267207796  
1.348037711  
1.413497268  
1.46231917  
1.491042022  
1.494381172  
1.466054688  
1.399927643  
1.291292488  
1.138088648  
0.9418552149  
0.7082510044  
0.4470530482  
0.1716015941  
-0.1022527565  
-0.3575548257  
-0.5778463542  
-0.748746661  
-0.8593224736  
-0.9030751341  
-0.8784618351  
-0.7888840442  
-0.6422005446  
-0.4498417808  
-0.2256653267  
0.0152889417  
0.2580082817  
0.4885501931  
0.6948399302  
0.8671943212  
0.9985725448  
1.084608165  
1.123470496  
1.115632476  
1.063583485  
0.9715366372  
0.8451316706  
0.6911329164  
0.5171096566  
0.3310844723  
0.1411446754  
-0.0449805725  
-0.2203293739  
-0.3790844239  
-0.5168619776  
-0.6308618179  
-0.7198728663  
-0.7841123394  
-0.8249281246  
-0.844416441  
-0.8450000327  
-0.8290502597  
-0.7985975755  
-0.755170561  
-0.6997862493  
-0.6330566162  
-0.5553943514  
-0.4672443797  
-0.3692937507  
-0.2626143423  
-0.1486920413  
-0.02936824169  
0.0933145461  
0.2172865155  
0.340614104  
0.461581628  
0.5786696967  
0.6904063341  
0.7951341066  
0.8907254092  
0.974339767  
1.04228196  
1.09003892  
1.112525463  
1.104536577  
1.061363692  
0.9794995204  
0.857319589  
0.695637652  
0.4980399872  
0.2709218822  
0.02321014658  
-0.2342188491  
-0.489365048  
-0.7300825388  
-0.9450882816  
-1.124905496  
-1.2626176  
-1.354361047  
-1.39951198  
-1.400555301  
-1.362660487  
-1.293038896  
-1.20014858  
-1.092857462  
-0.9796511038  
-0.8679746314  
-0.7637543217  
-0.6711499818  
-0.5925189318  
-0.5285806301  
-0.4787200166  
-0.4413711743  
-0.4144177186  
-0.3955506417  
-0.3825378407  
-0.3733881211  
-0.3664084685  
-0.360171994  
-0.3534343398  
-0.345029639  
-0.3337837705  
-0.3184627151  
-0.2977773418  
-0.2704345289  
-0.2352190813  
-0.1911081954  
-0.1373794024  
-0.07371310479  
-0.0002811472722  
0.08218573867  
0.1723404161  
0.2681796635  
0.3670206722  
0.4654972213  
0.5596034683  
0.6447862894  
0.7161199877  
0.768558469  
0.7972723488  
0.7980447996  
0.7676917493  
0.7044624133  
0.6083696645  
0.4813843406  
0.3274860538  
0.1525235408  
-0.0360856003  
-0.2298031095  
-0.4195079631  
-0.5960779489  
-0.7509503728  
-0.8766209755  
-0.9670370511  
-1.017881073  
-1.026728281  
-0.9931112695  
-0.9184806403  
-0.8061002379  
-0.6608731257  
-0.489101949  
-0.298178574  
-0.09620450948  
0.1084712114  
0.3077633098  
0.4944010892  
0.6624615238  
0.807830079  
0.9285273062  
1.024846083  
1.099251448  
1.15603687  
1.200738884  
1.239378144  
1.277592537  
1.319776056  
1.368333956  
1.423161959  
1.481429381  
1.537727567  
1.584576246  
1.613253063  
1.614859485  
1.581496153  
1.50742389  
1.390041105  
1.230573556  
1.034353106  
0.8106403023  
0.5719802244  
0.3331428944  
0.1097469897  
-0.0832844494  
-0.2332647728  
-0.3311115359  
-0.3723516813  
-0.357665813  
-0.2928753091  
-0.1883677362  
-0.05803085275  
0.08219281355  
0.2159510758  
0.328143906  
0.4063892713  
0.4421465821  
0.4313671313  
0.3746247578  
0.2767408415  
0.145973777  
-0.007094388466  
-0.1708247484  
-0.3337787466  
-0.4858255187  
-0.6189854097  
-0.7279461708  
-0.8102196975  
-0.8659845672  
-0.8976470416  
-0.9092307932  
-0.9056678436  
-0.8920959789  
-0.873244216  
-0.852955953  
-0.8339087638  
-0.817518279  
-0.8040390891  
-0.7928221274  
-0.7826757594  
-0.7722844538  
-0.7606129908  
-0.7472387009  
-0.7325579447  
-0.7178361592  
-0.7050765697  
-0.6967290862  
-0.6952737244  
-0.7027316111  
-0.7201883584  
-0.7473988596  
-0.7825433026  
-0.8221934681  
-0.8615057558  
-0.8946301518  
-0.915302475  
-0.9175457065  
-0.8964005284  
-0.8485852523  
-0.7730046069  
-0.6710363042  
-0.5465479551  
-0.4056303103  
-0.2560772095  
-0.1066605444  
0.03371920079  
0.1569051689  
0.2562911453  
0.327456309  
0.3685839103  
0.3805996144  
0.3670468656  
0.3337027157  
0.2880047386  
0.2383433246  
0.1933048497  
0.1609298787  
0.14805386  
0.1597682239  
0.1990327845  
0.26643706  
0.3601256771  
0.4758614106  
0.6072279808  
0.7459636659  
0.8824180061  
1.006135414  
1.106539487  
1.173706216  
1.199173441  
1.176730219  
1.103117265  
0.978558364  
0.8070462586  
0.5963398621  
0.3576215317  
0.1048360127  
-0.1462703729  
-0.3793320775  
-0.5786814779  
-0.7306725115  
-0.8248996847  
-0.8551793435  
-0.8201946026  
-0.7237136546  
-0.5743463835  
-0.3848378006  
-0.1709394621  
0.05003447527  
0.2608444624  
0.4459839252  
0.5931867913  
0.694623559  
0.7476311831  
0.7548951917  
0.7240314414  
0.6666084845  
0.5966961996  
0.5291032966  
0.4775016743  
0.4526564329  
0.4609909396  
0.503669912  
0.5763306769  
0.6695219014  
0.769809202  
0.8614256277  
0.928257376  
0.9559200583  
0.9336435928  
0.8557202523  
0.7223102054  
0.5395065205  
0.3186421696  
0.07494693722  
-0.1742673158  
-0.4116196011  
-0.621611034  
-0.7922296808  
-0.9160047132  
-0.9903809727  
-1.017387964  
-1.002693548  
-0.9542116452  
-0.8805177837  
-0.7893316649  
-0.6863294566  
-0.5744729961  
-0.453957237  
-0.3227805825  
-0.1778118823  
-0.01615664337  
0.1634317428  
0.3593760018  
0.5665520578  
0.7761798894  
0.9763752004  
1.153295203  
1.292707903  
1.381749141  
1.410596222  
1.373795306  
1.271063816  
1.107439089  
0.8927877245  
0.6407462167  
0.3672814594  
0.08906537141  
-0.1780979288  
-0.4206168983  
-0.6280735625  
-0.7937431698  
-0.9146660223  
-0.9913468812  
-1.027170457  
-1.027671515  
-0.9997599318  
-0.9510058354  
-0.8890266421  
-0.8210086729  
-0.7533429079  
-0.6913599018  
-0.6391265142  
-0.5992788984  
-0.5729034848  
-0.5594670389  
-0.5568343346  
-0.5614129449  
-0.5684559055  
-0.5725280405  
-0.5681177476  
-0.5503466591  
-0.5156704165  
-0.4624842212  
-0.3915049612  
-0.3058513754  
-0.2107649167  
-0.1129851702  
-0.01984132151  
0.06181110872  
0.1266477341  
0.1717479638  
0.1971181895  
0.2057630175  
0.2032548119  
0.1968405837  
0.1942262348  
0.2021931751  
0.2252922091  
0.2648079317  
0.3181804159  
0.3789902259  
0.4375207301  
0.4818569165  
0.499354886  
0.4783229085  
0.4096724289  
0.2883486643  
0.1143539424  
-0.1067576975  
-0.3639772093  
-0.6415359904  
-0.9201162698  
-1.178475921  
-1.395320715  
-1.551240283  
-1.63052316  
-1.622672708  
-1.523466032  
-1.335449688  
-1.067824949  
-0.7357042929  
-0.3588349332  
0.0401068713  
0.4374685121  
0.8106169827  
1.139784747  
1.409557462  
1.609870884  
1.736438079  
1.790567676  
1.778454211  
1.710047129  
1.597665913  
1.454533957  
1.293423836  
1.125546922  
0.9597875207  
0.8023351791  
0.6566809566  
0.5239412272  
0.4033942888  
0.2931426109  
0.1907761118  
0.0939741513  
0.0009671229392  
-0.08917723163  
-0.1764292275  
-0.259847921  
-0.3377587167  
-0.4080272128  
-0.4683933101  
-0.5168159432  
-0.5518027316  
-0.5726765399  
-0.579749519  
-0.5743882794  
-0.558925323  
-0.5364306759  
-0.5103240413  
-0.4838932695  
-0.4597283234  
-0.4391875045  
-0.4219734662  
-0.4059130049  
-0.3870320797  
-0.3599585793  
-0.3186618904  
-0.2574489989  
-0.1720897109  
-0.06090211541  
0.07439994459  
0.2282872034  
0.3915507785  
0.5520560813  
0.6960717312  
0.8100231033  
0.8824439249  
0.9058254689  
0.878062439  
0.8032291645  
0.6915111842  
0.558231599  
0.422063078  
0.3026469722  
0.2179428561  
0.1817013379  
0.2014443827  
0.2772729717  
0.4017120644  
0.560638789  
0.7351787419  
0.9042929501  
1.047679818  
1.148539869  
1.195784083  
1.185349907  
1.120423853  
1.010553562  
0.8698101808  
0.7143175419  
0.5595636396  
0.4179516448  
0.2969818682  
0.1983735978  
0.1182249499  
0.04818022496  
-0.02264162631  
-0.1053001798  
-0.2087030805  
-0.3376711742  
-0.4917512923  
-0.6649395309  
-0.8463573947  
-1.021745285  
-1.175502783  
-1.292950333  
-1.362452254  
-1.3770912  
-1.335666274  
-1.242907757  
-1.108930161  
-0.9480144785  
-0.7769351795  
-0.6130454117  
-0.4723604831  
-0.3678429783  
-0.3080575996  
-0.2963083838  
-0.3303192377  
-0.4024641644  
-0.5005355413  
-0.6089655197  
-0.7104171302  
-0.7876057817  
-0.8251930015  
-0.8115651205  
-0.7403118915  
-0.6112238031  
-0.4306553253  
-0.2111722042  
0.0295270792  
0.2703326707  
0.4889247399  
0.6642006084  
0.7786530211  
0.8203911945  
0.7845536999  
0.673924772  
0.4986656554  
0.2751928026  
0.02434892388  
-0.2309084456  
-0.4679909435  
-0.6670566552  
-0.8129686323  
-0.8966417599  
-0.9156430145  
-0.8740243416  
-0.7814561796  
-0.6518224012  
-0.5014711616  
-0.3473482436  
-0.2052268267  
-0.0882103267  
-0.005631670702  
0.03756855989  
0.04098804228  
0.008439018211  
-0.05275346225  
-0.1327528045  
-0.2203991633  
-0.3044687916  
-0.3748871925  
-0.4237942704  
-0.4463511984  
-0.4412180574  
-0.410643387  
-0.3601508232  
-0.2978301252  
-0.2333140737  
-0.1765255382  
-0.1363467375  
-0.1193577893  
-0.128810995  
-0.1639704291  
-0.2199258076  
-0.2879212862  
-0.3561845542  
-0.4111735407  
-0.4391022689  
-0.4275700442  
-0.3670950337  
-0.2523670803  
-0.08305141482  
0.1359546876  
0.3948435933  
0.6797829935  
0.9742436049  
1.260606507  
1.521864813  
1.743202889  
1.913275861  
2.025044975  
2.076106669  
2.068506696  
2.00812038  
1.903733728  
1.765965408  
1.606212074  
1.435730488  
1.264955169  
1.103056128  
0.9577172447  
0.8350501489  
0.7395516531  
0.674031292  
0.6394529258  
0.6347214676  
0.6564572308  
0.6988907921  
0.7539766868  
0.8118409397  
0.861615435  
0.8926191754  
0.895797468  
0.8652109303  
0.7993433999  
0.7019847895  
0.5824556439  
0.4550597056  
0.3377227259  
0.2499288172  
0.2101854818  
0.2333389262  
0.3281069252  
0.4952107096  
0.7263979359  
1.004561643  
1.304997218  
1.597682378  
1.850329347  
2.031830895  
2.115673119  
2.08288398  
1.924143806  
1.64080283  
1.244691099  
0.7567694125  
0.204810351  
-0.3795704587  
-0.9641624388  
-1.51927859  
-2.020395293  
-2.45003076  
-2.798698604  
-3.064898733  
-3.254225105  
-3.377764713  
-3.450037898  
-3.486739225  
-3.502565124  
-3.50934719  
-3.514684864  
-3.521183688  
-3.52635524  
-3.52315618  
-3.501082052  
-3.447707886  
-3.350487751  
-3.198634703  
-2.984871378  
-2.706855218  
-2.36808848  
-1.97818653  
-1.552432709  
-1.110609067  
-0.6752200737  
-0.2692576324  
0.08622980044  
0.3744839505  
0.5849999676  
0.7148464943  
0.7691413359  
0.7605890048  
0.7081090691  
0.6346818358  
0.5646866274  
0.5210238378  
0.5223986981  
0.5810947677  
0.7015189591  
0.8796977768  
1.103777413  
1.355463235  
1.612197964  
1.849805485  
2.045251959  
2.1792071  
2.23808069  
2.21532794  
2.111896265  
1.9358143  
1.70101668  
1.425605012  
1.129788428  
0.8337623944  
0.5557845681  
0.3106397653  
0.1086318779  
-0.04485025764  
-0.1492058085  
-0.2080173505  
-0.2281057717  
-0.2183682144  
-0.1885750402  
-0.1482423186  
-0.1056944174  
-0.06738988574  
-0.03755621686  
-0.0181252354  
-0.00896012473  
-0.008308672136  
-0.01341040042  
-0.02117805643  
-0.02885306089  
-0.03455396954  
-0.03764638646  
-0.03887590953  
-0.04026134579  
-0.04473683284  
-0.05559594458  
-0.07580427093  
-0.107258517  
-0.1501051644  
-0.2021972272  
-0.2588086447  
-0.3126382942  
-0.3541755751  
-0.372402059  
-0.3557980075  
-0.2935596379  
-0.1769028231  
-0.0003041202353  
0.2374748129  
0.5327273901  
0.8766158679  
1.255504296  
1.651804406  
2.045259196  
2.41452408  
2.73886384  
2.999775294  
3.182359048  
3.276294103  
3.276337895  
3.18234283  
2.998849765  
2.734358302  
2.400424913  
2.010724582  
1.580195776  
1.124342013  
0.6587166656  
0.1985595989  
-0.2414693131  
-0.6475538669  
-1.007044909  
-1.308894956  
-1.544220434  
-1.70692807  
-1.794346294  
-1.807729665  
-1.752527897  
-1.638317749  
-1.478334766  
-1.288608416  
-1.08675344  
-0.8905416398  
-0.7164049575  
-0.5780433313  
-0.4853093078  
-0.4434861324  
-0.4530471592  
-0.5099109011  
-0.6061349373  
-0.7309549471  
-0.8720359086  
-1.016774782  
-1.153513519  
-1.272541353  
-1.366798217  
-1.432247995  
-1.467910499  
-1.475607946  
-1.459479895  
-1.425333642  
-1.37993131  
-1.330245214  
-1.282770996  
-1.242907868  
-1.214462764  
-1.199291051  
-1.197103039  
-1.205452421  
-1.219926556  
-1.234534093  
-1.242284321  
-1.235907486  
-1.208659826  
-1.155120339  
-1.071884474  
-0.9580425045  
-0.8153647508  
-0.6481426616  
-0.4626677144  
-0.2664188538  
-0.06704457878  
0.1286952809  
0.3158618205  
0.4919694541  
0.6571931197  
0.8140684815  
0.966710916  
1.119638113  
1.276396751  
1.438202702  
1.602876882  
1.764266657  
1.912348851  
2.034046454  
2.114717732  
2.140141922  
2.098731754  
1.98365785  
1.794544142  
1.538439323  
1.229874883  
0.8899041046  
0.5442064592  
0.2204396753  
-0.05484467989  
-0.2593325343  
-0.3777111719  
-0.4036893561  
-0.3409833615  
-0.2030966747  
-0.01189852922  
0.2048651219  
0.4168219672  
0.5945821519  
0.7132655122  
0.7554762478  
0.7133587551  
0.5894497597  
0.3962333827  
0.1544560534  
-0.109584307  
-0.3673806803  
-0.5917760201  
-0.7602404738  
-0.8574581737  
-0.8768725934  
-0.8210480738  
-0.7008087959  
-0.5333419082  
-0.3395643949  
-0.1411631283  
0.04225989193  
0.1955228509  
0.3093769457  
0.3810113354  
0.4135494007  
0.4146768587  
0.394679773  
0.3642625554  
0.332523562  
0.3054430542  
0.2851166713  
0.2698417328  
0.2550143208  
0.2346158545  
0.2030006972  
0.1565936405  
0.09517347922  
0.02243302164  
-0.0542986555  
-0.1251823938  
-0.1796464087  
-0.2085148012  
-0.2060952573  
-0.1718200292  
-0.1111073635  
-0.03520860889  
0.039986016  
0.09607247963  
0.1148885705  
0.08147839825  
-0.01319108423  
-0.1702173972  
-0.3818052874  
-0.6315575535  
-0.8960343609  
-1.14739923  
-1.356793391  
-1.497984422  
-1.550767415  
-1.503631331  
-1.355318399  
-1.115040011  
-0.8013370803  
-0.4397381982  
-0.05958697675  
