-0.07985244123  
-0.445856051  
-0.7893078588  
-1.094964601  
-1.35121609  
-1.551272477  
-1.69381536  
-1.78301187  
-1.827839501  
-1.840783783  
-1.836044428  
-1.827472319  
-1.826515265  
-1.840474512  
-1.871336289  
-1.915392571  
-1.963751656  
-2.003692255  
-2.020708701  
-2.000947186  
-1.933666986  
-1.813331802  
-1.640975138  
-1.424585126  
-1.178394051  
-0.9211434663  
-0.6735502003  
-0.4553577688  
-0.2824223942  
-0.1643060033  
-0.1027813403  
-0.09151519734  
-0.1170208386  
-0.160757781  
-0.2020782551  
-0.2215655581  
-0.2042389677  
-0.1421151348  
-0.03569532708  
0.105869599  
0.2659915931  
0.423052118  
0.5536503183  
0.6361743069  
0.6541493424  
0.5988314138  
0.4706525087  
0.2792926411  
0.04239329435  
-0.2168827402  
-0.4730441857  
-0.7017229235  
-0.8828583139  
-1.003162817  
-1.057524536  
-1.049212858  
-0.988907571  
-0.8927693285  
-0.7798838416  
-0.6694767395  
-0.5783120668  
-0.5186062103  
-0.4967078824  
-0.512657071  
-0.5606010146  
-0.6299465261  
-0.7070179674  
-0.7769660333  
-0.8256556061  
-0.8412874662  
-0.8155793717  
-0.7444061323  
-0.6278797072  
-0.4699356941  
-0.2775558015  
-0.05978362663  
0.1732812253  
0.4113706515  
0.6446921164  
0.864298829  
1.062194466  
1.231256596  
1.365097195  
1.457991321  
1.504979635  
1.502214066  
1.447532601  
1.341191584  
1.18660054  
0.9908897819  
0.7651196768  
0.5239813748  
0.284932798  
0.06676960934  
-0.1122140725  
-0.2362682728  
-0.2941422677  
-0.2806613331  
-0.1976564715  
-0.05407510673  
0.1348048924  
0.3489738833  
0.5659313258  
0.7632760397  
0.9213037716  
1.025288434  
1.067139067  
1.04623742  
0.9693568493  
0.8497001161  
0.705182996  
0.556206128  
0.4231922766  
0.3241905069  
0.2728309819  
0.2768589365  
0.3374055732  
0.4490448421  
0.600625074  
0.7767356155  
0.9596316549  
1.131372419  
1.275910565  
1.380882251  
1.438883388  
1.448077625  
1.412075251  
1.339097991  
1.240559485  
1.129250522  
1.017390382  
0.914805626  
0.8275169485  
0.7569135455  
0.699661929  
0.6483341096  
0.5926882425  
0.5213876751  
0.4239049933  
0.2923304316  
0.1227915911  
-0.08371215115  
-0.321193376  
-0.5792736602  
-0.8444125219  
-1.101542627  
-1.335876982  
-1.534600365  
-1.688199137  
-1.791257491  
-1.842624811  
-1.844988052  
-1.803952917  
-1.726836917  
-1.621395122  
-1.494705368  
-1.352383463  
-1.198255519  
-1.034482096  
-0.8620841614  
-0.6817171641  
-0.4945221187  
-0.3028521743  
-0.1107242482  
0.07612042202  
0.250566061  
0.404838888  
0.5314731862  
0.6243583929  
0.67969372  
0.696669947  
0.677767133  
0.628594404  
0.5572872514  
0.47354485  
0.3874413208  
0.3081870824  
0.2430206558  
0.1963852349  
0.1694969557  
0.1603609573  
0.1642062224  
0.1742639096  
0.1827652554  
0.1820153737  
0.1653912724  
0.1281606656  
0.06802003751  
-0.01466691925  
-0.1169392773  
-0.2335772922  
-0.3576499697  
-0.4812049033  
-0.5960297224  
-0.6944230033  
-0.7699021029  
-0.817805645  
-0.8357253914  
-0.8237288647  
-0.7843397935  
-0.7222599314  
-0.6438414248  
-0.556368137  
-0.4672067789  
-0.3829463815  
-0.3086383397  
-0.2472477817  
-0.199407727  
-0.1635230294  
-0.1361997448  
-0.1129551888  
-0.08907410648  
-0.06047830513  
-0.02447097603  
0.01976901794  
0.07101650528  
0.1261580691  
0.1806366136  
0.2290929226  
0.266082162  
0.286749397  
0.2873727204  
0.2657144117  
0.2211696474  
0.1547441299  
0.06889680631  
-0.03268772283  
-0.1453586323  
-0.2637658029  
-0.3821334439  
-0.4945462971  
-0.5952636757  
-0.6790589589  
-0.7415637779  
-0.7795782698  
-0.7912904253  
-0.7763594464  
-0.7358223781  
-0.671836139  
-0.5872865621  
-0.4853420739  
-0.3690534567  
-0.2410895891  
-0.1036794282  
0.04121337668  
0.1915201845  
0.3445858269  
0.4967062951  
0.6428188588  
0.7764749788  
0.890169067  
0.9760347547  
1.026849842  
1.037216581  
1.004732161  
0.9309482445  
0.8219296577  
0.6882573565  
0.5444064238  
0.4075039718  
0.2955776922  
0.2254848691  
0.2107732428  
0.2597759126  
0.3742017157  
0.5484767201  
0.7699781813  
1.020189629  
1.276695424  
1.515776834  
1.715283126  
1.857392793  
1.930845835  
1.932315917  
1.866683716  
1.746131424  
1.588178289  
1.412925939  
1.239933927  
1.085210871  
0.9588120177  
0.8634191712  
0.7941655704  
0.7397262601  
0.68451871  
0.6116502475  
0.5061378719  
0.3578682135  
0.1638116056  
-0.0708799693  
-0.3330768319  
-0.603155544  
-0.8575371202  
-1.071889212  
-1.224498221  
-1.299307357  
-1.288171149  
-1.192008811  
-1.020720797  
-0.7919169725  
-0.5286802236  
-0.2567279144  
-0.001382681732  
0.2152176239  
0.3763214638  
0.471939335  
0.4992843154  
0.4623278719  
0.3706158309  
0.237590631  
0.07868349436  
-0.09055693195  
-0.2560880275  
-0.4065821281  
-0.5341637663  
-0.6346447451  
-0.7073279781  
-0.7544642963  
-0.7804809767  
-0.7911073933  
-0.7925200296  
-0.7905858005  
-0.79028885  
-0.7953590029  
-0.8081093135  
-0.829445777  
-0.8590060499  
-0.895365629  
-0.9362557304  
-0.9787582106  
-1.019461477  
-1.054588595  
-1.080121476  
-1.091970829  
-1.086219589  
-1.059455497  
-1.00918767  
-0.9343010005  
-0.8354721749  
-0.715470395  
-0.5792467158  
-0.4337676082  
-0.2875506358  
-0.1499505975  
-0.03025422702  
0.06328989305  
0.1243749256  
0.1493474163  
0.1376196776  
0.09173371309  
0.01707547496  
-0.07871000631  
-0.1864980139  
-0.2965582818  
-0.3993888269  
-0.4864381784  
-0.5506303599  
-0.5867007131  
-0.5913304019  
-0.5631431119  
-0.5025995327  
-0.4118494023  
-0.2945688272  
-0.1557987133  
-0.001769957064  
0.1603049657  
0.3225080004  
0.4765976693  
0.6144931011  
0.7288713657  
0.8138300839  
0.8655525304  
0.8828952262  
0.8678043948  
0.8254541165  
0.764067292  
0.6943458761  
0.6285583248  
0.5793287395  
0.5582670202  
0.5745822389  
0.6338718248  
0.7372465182  
0.8809242306  
1.056375668  
1.251018398  
1.449393172  
1.634694674  
1.790461697  
1.902255446  
1.959107188  
1.954595266  
1.887426559  
1.761476829  
1.58528591  
1.371082783  
1.133453815  
0.8877988219  
0.6487645096  
0.4288189784  
0.2371460869  
0.07897294729  
-0.04458439452  
-0.1361619255  
-0.2013309379  
-0.2474694716  
-0.2824827816  
-0.3135867752  
-0.3463341981  
-0.3840137207  
-0.4275012081  
-0.4755470428  
-0.5253931106  
-0.573590809  
-0.6168207767  
-0.6525561053  
-0.6794526232  
-0.6973983777  
-0.7072542726  
-0.710374917  
-0.7080417737  
-0.700963182  
-0.68896559  
-0.6709512094  
-0.6451412823  
-0.6095423325  
-0.5625319755  
-0.5034267858  
-0.4328991458  
-0.3531386934  
-0.2677191918  
-0.1811780313  
-0.09839372232  
-0.02387378701  
0.0389069128  
0.08798966919  
0.1231577063  
0.1458588793  
0.1588540383  
0.1656715923  
0.1699702478  
0.17493323  
0.1828046919  
0.1946333326  
0.210247806  
0.228446721  
0.2473350874  
0.264720573  
0.2784918429  
0.2869032145  
0.2887332627  
0.2833087594  
0.2704359637  
0.2502701162  
0.2231897116  
0.189707013  
0.1504321954  
0.1060824172  
0.05751110743  
0.005716823284  
-0.04819343576  
-0.1031070388  
-0.1580512578  
-0.2123549289  
-0.265776048  
-0.3185345656  
-0.3712282404  
-0.4246104175  
-0.4792609709  
-0.5352094578  
-0.591583322  
-0.6463800817  
-0.6964180779  
-0.7375314118  
-0.7649995808  
-0.7741648404  
-0.7611658651  
-0.7236586703  
-0.6614132144  
-0.5766686692  
-0.4741668258  
-0.3608313011  
-0.2451177639  
-0.1361002423  
-0.04241587049  
0.02878832569  
0.07277324229  
0.08785027831  
0.07567265836  
0.04111696781  
-0.008209292572  
-0.06279902234  
-0.1122919871  
-0.1466225677  
-0.157128926  
-0.1374981918  
-0.08443901386  
0.001975821412  
0.1183401481  
0.2582904569  
0.4131736047  
0.572912269  
0.726961842  
0.8652306823  
0.9788678659  
1.060832266  
1.10620616  
1.112264749  
1.078338467  
1.005559321  
0.8965661609  
0.7552629876  
0.5866673094  
0.3968769819  
0.1931025615  
-0.01628888288  
-0.221826654  
-0.4131689999  
-0.5795851158  
-0.7107068028  
-0.7974968389  
-0.8333383949  
-0.8150857549  
-0.7438854452  
-0.625597529  
-0.4706731784  
-0.2934120838  
-0.1106218445  
0.06019913688  
0.2029619182  
0.3050795711  
0.3592524672  
0.3646667526  
0.3273661888  
0.2596833744  
0.1787489287  
0.1042243565  
0.05555608655  
0.04911356081  
0.09564104792  
0.1984051217  
0.3523474162  
0.5444075142  
0.7550126898  
0.9605560699  
1.13653563  
1.260895813  
1.317109735  
1.29652532  
1.199643697  
1.036114574  
0.8234672978  
0.584751932  
0.3454472178  
0.1300953475  
-0.04085147688  
-0.1535140358  
-0.2020739616  
-0.1890855351  
-0.1246224435  
-0.02443771995  
0.09253996509  
0.2069756607  
0.3017313438  
0.3639469241  
0.3863224379  
0.3674742675  
0.311397015  
0.2261945024  
0.1223477083  
0.01085640069  
-0.09843930057  
-0.1980807459  
-0.2836120991  
-0.3535479184  
-0.4087861471  
-0.451635352  
-0.484705197  
-0.5098878445  
-0.5276572348  
-0.5367917205  
-0.5345751616  
-0.517419057  
-0.4817629136  
-0.4250833605  
-0.3468132126  
-0.2489892106  
-0.1365188553  
-0.01697953571  
0.100018017  
0.2038290145  
0.2840077038  
0.3315973595  
0.3403026427  
0.3073845478  
0.2341585488  
0.1260211596  
-0.008000529261  
-0.1561210006  
-0.3049989668  
-0.4411331125  
-0.5522959065  
-0.6288652801  
-0.6649150931  
-0.6589492611  
-0.6142092484  
-0.5385003024  
-0.4435345653  
-0.34381308  
-0.2551305239  
-0.1928071011  
-0.1698199874  
-0.1950226044  
-0.2716684367  
-0.3964642709  
-0.5593174547  
-0.7439148036  
-0.9291319536  
-1.091209975  
-1.206466798  
-1.254249589  
-1.219744038  
-1.096245745  
-0.8865342884  
-0.6031047978  
-0.2671339428  
0.09373349531  
0.4485347887  
0.7666761698  
1.021646329  
1.194243965  
1.27484385  
1.264361768  
1.173785308  
1.022323911  
0.8344672861  
0.6364026602  
0.4523277259  
0.3012311871  
0.1946121702  
0.135459355  
0.1186044948  
0.132325971  
0.1608785929  
0.1874791258  
0.1972068163  
0.1793215637  
0.1286288287  
0.04569924904  
-0.06401727932  
-0.1919231608  
-0.3284531471  
-0.4652131854  
-0.5966141266  
-0.720660581  
-0.8387329893  
-0.954417735  
-1.071651536  
-1.192598564  
-1.315731437  
-1.434567772  
-1.537388083  
-1.608063012  
-1.627909811  
-1.578290534  
-1.44352864  
-1.213640254  
-0.8864260667  
-0.468559173  
0.02451382444  
0.5698393421  
1.139202068  
1.701993337  
2.22828608  
2.691678742  
3.07154951  
3.354456775  
3.534597678  
3.613368721  
3.598196608  
3.500918977  
3.335989309  
3.118797512  
2.864310325  
2.586143078  
2.296098927  
2.00409169  
1.718337042  
1.445643939  
1.191692418  
0.9611698394  
0.7577497803  
0.5839206136  
0.4407286038  
0.3275332202  
0.2418592023  
0.1794164905  
0.1343278592  
0.09954706632  
0.06744093654  
0.03046737267  
-0.01812236652  
-0.08361972261  
-0.1693085415  
-0.2760546806  
-0.4021030573  
-0.5430920903  
-0.6923221263  
-0.8412789501  
-0.9804123059  
-1.100113879  
-1.191840831  
-1.249252871  
-1.269233357  
-1.252640023  
-1.204627882  
-1.13445098  
-1.05466824  
-0.9798055185  
-0.9245765586  
-0.9018704059  
-0.9207764811  
-0.9849482819  
-1.09158307  
-1.231260176  
-1.388743821  
-1.544734039  
-1.678394754  
-1.770331177  
-1.80559306  
-1.776230649  
-1.682959952  
-1.535591074  
-1.35207868  
-1.156238229  
-0.9744223722  
-0.8316346038  
-0.747676302  
-0.7339528548  
-0.7914737407  
-0.9104172467  
-1.071369561  
-1.248085067  
-1.411376592  
-1.533521071  
-1.592528676  
-1.575582574  
-1.481130105  
-1.319278091  
-1.110421185  
-0.8823021758  
-0.6659196485  
-0.4908916633  
-0.380946946  
-0.3501995939  
-0.4007430988  
-0.5219197079  
-0.6913551773  
-0.8776231678  
-1.044163059  
-1.153910273  
-1.173997511  
-1.079911857  
-0.8585549947  
-0.5098419164  
-0.04667834997  
0.50662254  
1.117205392  
1.747382589  
2.35868119  
2.915680076  
3.389189314  
3.758435115  
4.012082179  
4.148108645  
4.172693811  
4.098409808  
3.942050075  
3.722439702  
3.458502981  
3.167785451  
2.865496564  
2.564046475  
2.272968356  
1.999063467  
1.746630217  
1.517662488  
1.311962689  
1.127204247  
0.9590140178  
0.8011797276  
0.6460872127  
0.4854338747  
0.3112217716  
0.116930599  
-0.1012802828  
-0.3435488683  
-0.6056606532  
-0.8789599491  
-1.150912522  
-1.406309029  
-1.628993802  
-1.803888868  
-1.91902074  
-1.967229252  
-1.947266957  
-1.864095011  
-1.728294336  
-1.554659764  
-1.360188827  
-1.161770683  
-0.973939362  
-0.8070442024  
-0.6661193465  
-0.5506194688  
-0.4550385389  
-0.3702933312  
-0.2856233735  
-0.1906929854  
-0.07754211033  
0.05790084914  
0.2149974104  
0.3883431728  
0.5684802889  
0.7432314009  
0.8994163546  
1.024682993  
1.109157819  
1.14668136  
1.135460909  
1.078079024  
0.9809010587  
0.8530102645  
0.7048709444  
0.5469518082  
0.3885046853  
0.2366944245  
0.09614879855  
-0.0310414559  
-0.1449404415  
-0.2471164761  
-0.339880694  
-0.4255538887  
-0.505879411  
-0.5816602654  
-0.65263168  
-0.7175477883  
-0.7744244281  
-0.8208605439  
-0.8543854079  
-0.8727674846  
-0.8742677766  
-0.8578344551  
-0.8232402081  
-0.7711762151  
-0.7033116257  
-0.6223117997  
-0.5318026406  
-0.4362631341  
-0.3408301992  
-0.2510067133  
-0.17228469  
-0.1097029442  
-0.06737631732  
-0.04804680944  
-0.05270659602  
-0.08032817979  
-0.1277637191  
-0.1898235601  
-0.2595677703  
-0.3288100578  
-0.3888189314  
-0.4311827354  
-0.4487706514  
-0.4366961445  
-0.3931639415  
-0.3200651712  
-0.2231943281  
-0.1119818209  
0.001300939776  
0.1028411308  
0.178970278  
0.2180466024  
0.2122573397  
0.1590772069  
0.06209160862  
-0.06899414444  
-0.2192485742  
-0.3702467041  
-0.5024358405  
-0.5978119665  
-0.6424998208  
-0.6288386009  
-0.5566222651  
-0.4332828737  
-0.272962059  
-0.0945990023  
0.08068281996  
0.2324933981  
0.3439634533  
0.4040092078  
0.4087587542  
0.3619822986  
0.2745136826  
0.1628012992  
0.04682692878  
-0.05229526767  
-0.114728311  
-0.1240508902  
-0.06891490289  
0.05591161015  
0.2491490674  
0.5032337207  
0.8050827275  
1.137278203  
1.479541924  
1.810368948  
2.108693778  
2.355466483  
2.535052093  
2.636330748  
2.653443235  
2.586099209  
2.439439526  
2.223443532  
1.95194391  
1.641334212  
1.309105719  
0.9723541894  
0.6464113327  
0.3437301567  
0.07312801513  
-0.1605576801  
-0.3563974805  
-0.5169034918  
-0.6472608104  
-0.7543344764  
-0.8455886367  
-0.928018669  
-1.007225559  
-1.086723382  
-1.167546339  
-1.248203093  
-1.324966479  
-1.392456958  
-1.444434711  
-1.474699331  
-1.477970658  
-1.450638306  
-1.391293069  
-1.300971205  
-1.183108728  
-1.043215392  
-0.8883364748  
-0.7263799014  
-0.5653972557  
-0.4129083692  
-0.2753483044  
-0.1576705411  
-0.06314944562  
0.006652201319  
0.05175609864  
0.07356255317  
0.07459789018  
0.05828759626  
0.02876953939  
-0.009231331895  
-0.05049959475  
-0.08944132036  
-0.1202647077  
-0.1372801709  
-0.1353364045  
-0.1103765388  
-0.06005282086  
0.01571156855  
0.1143188266  
0.2303801884  
0.3559689343  
0.4812687416  
0.595581348  
0.6885759939  
0.7516209007  
0.7789786282  
0.7686845915  
0.7229400614  
0.6479254646  
0.553048969  
0.4497289751  
