-0.26823408  
-0.3218018551  
-0.3732643443  
-0.4229079867  
-0.4709583623  
-0.5175929598  
-0.5629871037  
-0.6073648426  
-0.651016985  
-0.6942620151  
-0.7373274788  
-0.7801583949  
-0.8221805367  
-0.8620591262  
-0.8975243148  
-0.9253249897  
-0.9413704681  
-0.9410888848  
-0.9199990916  
-0.8744510575  
-0.8024301401  
-0.7043112056  
-0.583410051  
-0.4462096413  
-0.3021511895  
-0.162959118  
-0.04152839564  
0.04951996849  
0.09943174634  
0.100844092  
0.05101540619  
-0.04745694497  
-0.1865736636  
-0.3535796892  
-0.5322887302  
-0.7049255075  
-0.8542594484  
-0.9657448577  
-1.029355646  
-1.040860993  
-1.002325219  
-0.9217688354  
-0.8119937155  
-0.6887516332  
-0.5684893067  
-0.4660050258  
-0.3923307229  
-0.3531675799  
-0.3480783273  
-0.3705756033  
-0.4090847791  
-0.4486508134  
-0.4731368939  
-0.4676175438  
-0.4206039158  
-0.325792359  
-0.1830787748  
0.001307800074  
0.215578781  
0.4439578243  
0.668831854  
0.8731715859  
1.042876126  
1.168690268  
1.24742361  
1.282277249  
1.282227411  
1.260545457  
1.232684734  
1.213825331  
1.216464058  
1.248396374  
1.31140242  
1.400824225  
1.506105714  
1.612204084  
1.701669486  
1.757072316  
1.763444771  
1.710370436  
1.593450711  
1.414953055  
1.183587457  
0.9134660546  
0.6224360059  
0.3300378771  
0.05538389555  
-0.1847610797  
-0.3774556653  
-0.5144802014  
-0.5925922831  
-0.6131908871  
-0.5815151464  
-0.5055545434  
-0.3948600342  
-0.2594515808  
-0.1089447067  
0.04801452718  
0.2040057665  
0.3528261931  
0.4893246535  
0.6091879465  
0.7087947945  
0.7852064966  
0.836331004  
0.8612090405  
0.8603542777  
0.8360264955  
0.7923148123  
0.7349550687  
0.6708283916  
0.6071869988  
0.5506956772  
0.5064537014  
0.4771527768  
0.4625546985  
0.4593880448  
0.461718778  
0.4617492877  
0.4509330625  
0.4212238604  
0.3662641035  
0.2823136109  
0.1687816974  
0.02827508749  
-0.1338179994  
-0.3101397814  
-0.4924152219  
-0.6725625406  
-0.8436968021  
-1.000856196  
-1.141369705  
-1.264829099  
-1.372698607  
-1.467661394  
-1.552825058  
-1.630928654  
-1.703688166  
-1.771353504  
-1.832568978  
-1.884516271  
-1.923314934  
-1.944619891  
-1.944317967  
-1.919233275  
-1.867754548  
-1.790310874  
-1.68964118  
-1.57082884  
-1.441095094  
-1.309357683  
-1.185585242  
-1.079987231  
-1.002087885  
-0.959757707  
-0.9582633368  
-0.9994373131  
-1.081044442  
-1.196449281  
-1.334666762  
-1.480851902  
-1.617265643  
-1.724690392  
-1.78420884  
-1.779203881  
-1.697380436  
-1.53255936  
-1.286002128  
-0.9670275094  
-0.5927683261  
-0.1869843552  
0.2220034211  
0.604093317  
0.9305932272  
1.177459001  
1.328168968  
1.375853224  
1.324375216  
1.188186015  
0.990934159  
0.7629769211  
0.538072315  
0.3496632289  
0.2272020596  
0.1929607678  
0.2597190227  
0.4295786375  
0.6940401261  
1.035273701  
1.428398694  
1.844446092  
2.253617882  
2.628426414  
2.94634821  
3.191706288  
3.356597124  
3.440830971  
3.450963038  
3.398598788  
3.298251313  
3.165041231  
3.012550523  
2.851090268  
2.686595071  
2.520251812  
2.348892257  
2.166069132  
1.963664265  
1.733792911  
1.470739487  
1.172646495  
0.8427001952  
0.4896187937  
0.1273257796  
-0.2261856544  
-0.5506962222  
-0.8260943924  
-1.034894382  
-1.164611217  
-1.209626884  
-1.172271072  
-1.062918025  
-0.8990340501  
-0.7032673892  
-0.5008169549  
-0.3164250729  
-0.171408009  
-0.08115831273  
-0.05345452265  
-0.08784151909  
-0.1761415254  
-0.3040126031  
-0.4532969056  
-0.6047907221  
-0.7410110296  
-0.8485460982  
-0.9196619499  
-0.9529588126  
-0.95304209  
-0.9293120424  
-0.8941221838  
-0.8606347055  
-0.8407144505  
-0.84319071  
-0.8727191114  
-0.929361693  
-1.008895016  
-1.103720745  
-1.204196078  
-1.300128266  
-1.38219799  
-1.443112897  
-1.478338089  
-1.486367304  
-1.468540012  
-1.428513491  
-1.371513411  
-1.303521224  
-1.230530875  
-1.15797754  
-1.090388088  
-1.031244954  
-0.9830139803  
-0.9472559514  
-0.9247199611  
-0.9153567032  
-0.9181980861  
-0.9311218659  
-0.9505491754  
-0.9711852087  
-0.9859247341  
-0.9860339061  
-0.9617130029  
-0.9030490944  
-0.8013189716  
-0.6505011691  
-0.4487857551  
-0.1998196075  
0.0865732845  
0.3944425028  
0.7026582441  
0.9867693454  
1.221641251  
1.384572354  
1.458481123  
1.43468669  
1.314809122  
1.111404347  
0.84712163  
0.552363947  
0.2616998439  
0.009466168971  
-0.1748143814  
-0.2705317004  
-0.268938999  
-0.1744769754  
-0.004204648716  
0.2146403003  
0.4486013594  
0.6629334545  
0.8267407403  
0.9175513095  
0.9246196204  
0.8504497551  
0.7102985666  
0.5297404612  
0.340663419  
0.1763158776  
0.06616296474  
0.03133975065  
0.08139411285  
0.2128105384  
0.4095287544  
0.6453719794  
0.8879962089  
1.10375035  
1.26270189  
1.343055886  
1.334309747  
1.238670314  
1.070536305  
0.8541526146  
0.6198131891  
0.3992013989  
0.220607753  
0.1047258448  
0.06169342947  
0.08978659311  
0.1759556975  
0.2980868874  
0.428618398  
0.5389294704  
0.6038185994  
0.6053856509  
0.5357333868  
0.3981125983  
0.2063657829  
-0.01719366777  
-0.2451130176  
-0.4488146104  
-0.6026795873  
-0.6876208503  
-0.6936459252  
-0.6211074237  
-0.4805120009  
-0.2910001387  
-0.07776278279  
0.1312017337  
0.3085339254  
0.4307089189  
0.4806027292  
0.4491735623  
0.3361151009  
0.1495193125  
-0.09533512352  
-0.3778272061  
-0.6742203272  
-0.9599750168  
-1.211926855  
-1.410129415  
-1.539257573  
-1.589513213  
-1.557044247  
-1.443915587  
-1.25769132  
-1.010697727  
-0.7190228707  
-0.4013164872  
-0.07743837318  
0.2329751207  
0.5119546318  
0.7445591888  
0.92005008  
1.032764723  
1.082590416  
1.074947731  
1.020246141  
0.9328242604  
0.8294301122  
0.7273837365  
0.642603326  
0.587704394  
0.5704215148  
0.5925540973  
0.6496130551  
0.7312513112  
0.8224789427  
0.9055388019  
0.9622326206  
0.9763958731  
0.9361899176  
0.8358769293  
0.6768037802  
0.4674232059  
0.2223097848  
-0.03970627063  
-0.2980479694  
-0.5331804715  
-0.7292664317  
-0.876297349  
-0.9713620044  
-1.018861735  
-1.029627323  
-1.019074181  
-1.004674997  
-1.00313518  
-1.027711809  
-1.08608517  
-1.179098644  
-1.300572237  
-1.438194279  
-1.575353959  
-1.693637357  
-1.775594946  
-1.807373826  
-1.780817287  
-1.694735883  
-1.555160194  
-1.374553316  
-1.170101595  
-0.9613325518  
-0.7674105346  
-0.6044793695  
-0.4834406902  
-0.4084530151  
-0.3763744367  
-0.3772017433  
-0.3954462522  
-0.4122603075  
-0.4080129195  
-0.3649847953  
-0.2698137102  
-0.1153855963  
0.0980694683  
0.3628142898  
0.6643709799  
0.9831120878  
1.296451068  
1.581349477  
1.816818273  
1.986098586  
2.078273535  
2.089147701  
2.021325524  
1.883546314  
1.68942764  
1.455816881  
1.201011959  
0.9430632692  
0.6983613061  
0.4806077546  
0.3002130554  
0.1640779271  
0.07565511703  
0.03519097271  
0.04001067572  
0.08479708381  
0.1618124101  
0.2611117503  
0.3708101226  
0.4775098223  
0.5669570171  
0.6249975068  
0.6388041966  
0.5982965403  
0.4976001591  
0.3363333946  
0.1204997101  
-0.1372328264  
-0.4180059064  
-0.6980798148  
-0.9508857042  
-1.14967605  
-1.27046032  
-1.294879548  
-1.212635906  
-1.023130029  
-0.7360602705  
-0.3708568404  
0.04500631961  
0.4786460054  
0.8950380094  
1.260538393  
1.546239266  
1.730793272  
1.802388013  
1.759685342  
1.611647746  
1.376316155  
1.078700243  
0.7480305015  
0.4146974003  
0.1071853479  
-0.150664774  
-0.3418096426  
-0.4573632535  
-0.4970636886  
-0.4688200707  
-0.3874331721  
-0.2726434462  
-0.1467512226  
-0.03205780625  
0.05156763045  
0.08876240424  
0.07015595215  
-0.006842413898  
-0.1380369879  
-0.3131468931  
-0.5171315591  
-0.7319260082  
-0.9383923179  
-1.118244577  
-1.255735531  
-1.338956586  
-1.360638711  
-1.318438223  
-1.214748221  
-1.05612652  
-0.8524832043  
-0.6161523691  
-0.3609696139  
-0.1014413147  
0.147957174  
0.373366708  
0.5620459164  
0.7028489488  
0.7867166836  
0.8072163354  
0.761104706  
0.6488632545  
0.4751153525  
0.248822536  
-0.01684661521  
-0.3050399442  
-0.5961743533  
-0.8692911375  
-1.103706598  
-1.280839124  
-1.386008773  
-1.41001271  
-1.350295642  
-1.211531623  
-1.005530701  
-0.7504228153  
-0.4691637758  
-0.1874842537  
0.06853767872  
0.2750338157  
0.4127867712  
0.4692738243  
0.4401078867  
0.3296809479  
0.1509214584  
-0.07584378968  
-0.3248503067  
-0.5674868186  
-0.7752843534  
-0.9229894074  
-0.9913848231  
-0.969540954  
-0.8562047758  
-0.6601342881  
-0.3992832073  
-0.09887789826  
0.2114211403  
0.5009760003  
0.7418270395  
0.9121082098  
0.9987662147  
0.9992267365  
0.9217444579  
0.7843792586  
0.6126869165  
0.4364051928  
0.2855597665  
0.1864867317  
0.1583052049  
0.2103121381  
0.3406529035  
0.5364724369  
0.7755252007  
1.029055468  
1.265565297  
1.45496492  
1.572555096  
1.602295143  
1.538909889  
1.388546193  
1.167881353  
0.9018004186  
0.6199599271  
0.3526943574  
0.1268306622  
-0.03801432181  
-0.1321404636  
-0.157095866  
-0.1254191559  
-0.05882254419  
0.01497180365  
0.06631573785  
0.06810261174  
-8.708202226e-06  
-0.1481945499  
-0.3743991792  
-0.6639047282  
-0.9906618646  
-1.320237415  
-1.614024491  
-1.834181811  
-1.948648038  
-1.935568187  
-1.786513192  
-1.508055123  
-1.121435358  
-0.6603552254  
-0.1671406173  
0.3122255057  
0.7335597258  
1.059704918  
1.264844622  
1.337331176  
1.280677003  
1.112605253  
0.8623285529  
0.5664732158  
0.2642348496  
-0.007548850114  
-0.2187389467  
-0.3491041045  
-0.3900197714  
-0.3445333088  
-0.2258881464  
-0.05483174635  
0.1438533322  
0.3450484258  
0.5267204691  
0.6726277057  
0.7740017799  
0.8300590933  
0.8473777081  
0.8382797044  
0.8185240837  
0.8046271707  
0.8111839967  
0.8485298518  
0.9210160912  
1.026102183  
1.154352847  
1.290341688  
1.414344339  
1.504623921  
1.540046511  
1.502710644  
1.380290258  
1.167783448  
0.8684670437  
0.4939064386  
0.0630182331  
-0.3997200157  
-0.8666931168  
-1.309911535  
-1.703773887  
-2.027482593  
-2.266826998  
-2.41513597  
-2.473307892  
-2.448971828  
-2.354927213  
-2.207121186  
-2.022457671  
-1.816745017  
-1.603053311  
-1.390677917  
-1.184801602  
-0.9868609207  
-0.7954955111  
-0.6079102253  
-0.4213996273  
-0.2347901284  
-0.04954938627  
0.1296061396  
0.2947358371  
0.4353350729  
0.5395668616  
0.595891085  
0.5948615929  
0.530825699  
0.4032543092  
0.2174888794  
-0.01523731296  
-0.2785457785  
-0.5523410507  
-0.8147526513  
-1.044325485  
-1.222189366  
-1.33391031  
-1.370815242  
-1.330644184  
-1.217488628  
-1.041084013  
-0.8155882351  
-0.5580462064  
-0.2867494412  
-0.0196779625  
0.2268245445  
0.4390515734  
0.6065915343  
0.7226615302  
0.7841796206  
0.7916415798  
0.7488694132  
0.6626677895  
0.5424187331  
0.399601969  
0.2472323603  
0.09920793188  
-0.03044202908  
-0.1283868861  
-0.1828628504  
-0.184537338  
-0.1272890063  
-0.008846792317  
0.1687943371  
0.39922823  
0.6718124789  
0.9721787892  
1.283072517  
1.585483072  
1.859985211  
2.088204845  
2.254277048  
2.346172271  
2.356760508  
2.284504453  
2.133704604  
1.914257963  
1.640925535  
1.332176471  
1.008678782  
0.6915763356  
0.400682851  
0.1527600098  
-0.03996371449  
-0.1708972051  
-0.239679133  
-0.2521861687  
-0.2199196191  
-0.1587967143  
-0.08743505696  
-0.02508621674  
0.01057620455  
0.005571068029  
-0.04861341621  
-0.1538261253  
-0.3047868164  
-0.4894593673  
-0.6902414455  
-0.8858501789  
-1.053717746  
-1.172585097  
-1.225015897  
-1.19950736  
-1.091955898  
-0.9062940496  
-0.6542444648  
-0.3542160198  
-0.02949772821  
0.2940471201  
0.5905173581  
0.8364703533  
1.013120795  
1.108032332  
1.116159863  
1.040149161  
0.8898935966  
0.6814033292  
0.4351011854  
0.1737094445  
-0.08007095646  
-0.3058661917  
-0.4876978873  
-0.6155928859  
-0.6865639576  
-0.7048228704  
-0.6811894578  
-0.6317102028  
-0.5756287775  
-0.5329079496  
-0.5215877799  
-0.5553008118  
-0.6412736829  
-0.7790920532  
-0.9604365509  
-1.169867394  
-1.386589913  
-1.587003678  
-1.747689397  
-1.848433788  
-1.874853391  
-1.820232067  
-1.68631815  
-1.482958421  
-1.226662053  
-0.9383349345  
-0.6405579771  
-0.35484414  
-0.09928011408  
0.1131187609  
0.2751588124  
0.385313464  
0.4467951149  
0.4661037595  
0.4513866769  
0.4108994303  
0.3518553143  
0.2798002767  
0.1985697965  
0.1107437755  
0.01843709752  
-0.07579358555  
-0.1681511934  
-0.2531025256  
-0.3233085446  
-0.3700288415  
-0.3839457978  
-0.3562973237  
-0.2801476042  
-0.1516093243  
0.02917474837  
0.2574223771  
0.5235801397  
0.8137095327  
1.110352795  
1.393818336  
1.643760505  
1.84091364  
1.968823575  
2.015422242  
1.974290042  
1.845477372  
1.63579783  
1.358511788  
1.032416652  
0.6803800614  
0.327433578  
-0.001406985743  
-0.2833831906  
-0.5000741225  
-0.6390828574  
-0.6951470014  
-0.670538187  
-0.5747055837  
-0.4231938228  
-0.235959025  
-0.03526685279  
0.1565979494  
0.3195587764  
0.4376961432  
0.5007150127  
0.5048176168  
0.4529107456  
0.3541590462  
0.222952305  
0.07739437502  
-0.06255158879  
-0.1770949563  
-0.2486644182  
-0.2638059975  
-0.2147765733  
-0.1006773576  
0.07200031922  
0.2895064122  
0.531709613  
0.7736974949  
0.9880306151  
1.147469888  
1.227940126  
1.211408876  
1.088338544  
0.8593677342  
0.5359452234  
0.1397475105  
-0.2991397579  
-0.7451295705  
-1.160822069  
-1.511015673  
-1.766550678  
-1.907465289  
-1.925048866  
-1.822531536  
-1.614337332  
-1.324044611  
-0.9813755472  
-0.6186593935  
-0.2672746356  
0.04547516047  
0.298681565  
0.479139775  
0.5816056354  
0.6081108677  
0.5665866088  
0.469081825  
0.3298990699  
0.1638956644  
-0.01485140186  
-0.1939460774  
-0.3631340538  
-0.5144010374  
-0.6418236957  
-0.7412940811  
-0.8102180421  
-0.8472686793  
-0.8522148557  
-0.8258371314  
-0.7698927923  
-0.6871028598  
-0.5811253068  
-0.4564873008  
-0.3184600936  
-0.1728875986  
-0.02596272427  
0.1160261091  
0.2469724988  
0.3612454999  
0.4539824688  
0.5213876858  
0.5610056527  
0.5719562588  
0.555093891  
0.5130568623  
0.4501757115  
0.3722192971  
0.285989231  
0.1987915046  
0.1178385391  
0.04965936409  
-0.00040804931  
-0.02858356854  
-0.0328282778  
-0.01284409941  
0.03008140899  
0.09333903936  
0.1732899651  
0.2655460436  
0.3651776335  
0.4668558123  
0.5649354273  
0.6535302213  
0.7266364357  
0.7783487403  
0.8031976451  
0.796605577  
0.7553955519  
0.6782933479  
0.5663041756  
0.4228867323  
0.2538439528  
0.06691959925  
-0.1288647175  
-0.3240408191  
-0.5095574522  
-0.6775339967  
-0.8217660259  
-0.9379019413  
-1.02326474  
-1.076374487  
-1.096297296  
-1.081997757  
-1.031870339  
-0.9436287506  
-0.814638663  
-0.6427047497  
-0.4272170626  
-0.1704447253  
0.1212761364  
0.4367595193  
0.7598503781  
1.07012563  
1.344458958  
1.559313027  
1.693494245  
1.730966552  
1.663298224  
1.491302056  
1.225558312  
0.8856626313  
0.4982386958  
0.09396437243  
