-0.1098250176  
0.04701103016  
0.1907409535  
0.3074258314  
0.3850867308  
0.414659946  
0.390782009  
0.3123384489  
0.1827255901  
0.009765194415  
-0.1947449522  
-0.4158567225  
-0.636626549  
-0.8395282352  
-1.007999153  
-1.127970989  
-1.18922385  
-1.186395259  
-1.119520823  
-0.9940208489  
-0.8201209742  
-0.6117619162  
-0.3851244449  
-0.1569444803  
0.05717494183  
0.2442510531  
0.3950324261  
0.5046106476  
0.5724766955  
0.6020534709  
0.5997916797  
0.5739799003  
0.5334594195  
0.4864195405  
0.4394481309  
0.3969476199  
0.3609769117  
0.3315023643  
0.3069734989  
0.2851055726  
0.2637020396  
0.2413645697  
0.2179624432  
0.1947773557  
0.1743095406  
0.1597828445  
0.1544579002  
0.1608804604  
0.1802139635  
0.2117838169  
0.2529272589  
0.29918214  
0.3447875724  
0.3834214192  
0.4090386348  
0.4166799493  
0.4031002712  
0.3671154595  
0.3096114077  
0.2332193571  
0.1417324322  
0.03938133486  
-0.06988076524  
-0.1829264492  
-0.2977297496  
-0.4132904151  
-0.5292348538  
-0.6451659567  
-0.7599086395  
-0.8708386358  
-0.9734569307  
-1.061367406  
-1.126712121  
-1.161058381  
-1.156628894  
-1.107688395  
-1.01185848  
-0.8711245752  
-0.6923255918  
-0.4869953531  
-0.2705206901  
-0.06067888126  
0.1242671148  
0.2676793743  
0.3565739791  
0.3832932123  
0.3465874782  
0.2519449417  
0.1111307446  
-0.05903805321  
-0.2385100941  
-0.4062047844  
-0.5423319116  
-0.6305530814  
-0.6597353447  
-0.6250990701  
-0.5286386502  
-0.3787877238  
-0.1893761422  
0.02198271027  
0.2358739538  
0.4332071644  
0.5972332742  
0.715233414  
0.7797015164  
0.7889049228  
0.7467910204  
0.6622798049  
0.5480575255  
0.4190323958  
0.2906495472  
0.1772662661  
0.09075797731  
0.03950475589  
0.02783349217  
0.05594421633  
0.1202834808  
0.2142889273  
0.3293758234  
0.4560404141  
0.5849447651  
0.707857421  
0.818363819  
0.9122880822  
0.9878125711  
1.045308527  
1.086934571  
1.116070675  
1.136673109  
1.152637934  
1.167245154  
1.182740953  
1.200086186  
1.218885271  
1.237466755  
1.253091072  
1.262233618  
1.26090667  
1.244983918  
1.210505447  
1.15396328  
1.072564843  
0.9644871007  
0.8291252624  
0.6673218941  
0.4815576436  
0.2760591598  
0.05678332738  
-0.168776606  
-0.3919791221  
-0.6036268426  
-0.7947189876  
-0.9572963553  
-1.085275279  
-1.175153516  
-1.226473942  
-1.241972792  
-1.227360163  
-1.190753211  
-1.141827832  
-1.090803881  
-1.047392621  
-1.01985338  
-1.014265796  
-1.03409828  
-1.080094409  
-1.150451334  
-1.241224344  
-1.346869792  
-1.460839919  
-1.576142336  
-1.685832239  
-1.783405995  
-1.863114659  
-1.920209133  
-1.951152795  
-1.953806257  
-1.92757633  
-1.873509992  
-1.794296513  
-1.694128962  
-1.57841871  
-1.453348994  
-1.325298063  
-1.200193429  
-1.082868086  
-0.9765047516  
-0.8822469504  
-0.7990374195  
-0.7237152956  
-0.6513677221  
-0.5759044368  
-0.4907933116  
-0.3898793989  
-0.2681925584  
-0.1226589613  
0.04736755406  
0.2398128618  
0.449878131  
0.6703281821  
0.8920619054  
1.10491018  
1.298593313  
1.463734678  
1.592817894  
1.680989821  
1.726594866  
1.731381507  
1.700342242  
1.641193551  
1.563554572  
1.477913243  
1.394510941  
1.322276114  
1.267953476  
1.235532539  
1.226053545  
1.237812382  
1.266930245  
1.308203721  
1.356098967  
1.405740224  
1.45373085  
1.498673284  
1.541282299  
1.584063375  
1.630583776  
1.684429438  
1.748013298  
1.821421837  
1.901506223  
1.981407236  
2.050639578  
2.095805109  
2.101893038  
2.054045061  
1.939569  
1.749930298  
1.482428894  
1.141288667  
0.7379532515  
0.2904877347  
-0.1778908209  
-0.6409961628  
-1.072303033  
-1.44768501  
-1.747896706  
-1.960472993  
-2.080804312  
-2.112275496  
-2.065486764  
-1.95670431  
-1.805790965  
-1.633916924  
-1.461346454  
-1.305568746  
-1.17995478  
-1.093021913  
-1.048317236  
-1.044827374  
-1.077778309  
-1.13966562  
-1.221351751  
-1.313095739  
-1.405412885  
-1.489711457  
-1.558703574  
-1.606591931  
-1.629096821  
-1.623366686  
-1.587824669  
-1.522006948  
-1.42641447  
-1.302401302  
-1.152101234  
-0.9783750669  
-0.7847706411  
-0.5754604495  
-0.3551439663  
-0.1288988821  
0.09801765637  
0.3204034829  
0.5333481409  
0.7324332378  
0.9138599467  
1.074467005  
1.211632232  
1.323079551  
1.40663376  
1.459992316  
1.480594935  
1.465656729  
1.412411167  
1.318562114  
1.182902919  
1.006007485  
0.7908827267  
0.5434335569  
0.2726317045  
-0.009707703192  
-0.2895704131  
-0.5517823778  
-0.7813463143  
-0.9649336858  
-1.092341203  
-1.157727668  
-1.160442203  
-1.105318405  
-1.00234078  
-0.8657047582  
-0.7123251672  
-0.5599635052  
-0.4251749532  
-0.3213249947  
-0.2569270514  
-0.2345227561  
-0.2502731152  
-0.2943395121  
-0.3520369963  
-0.4056415482  
-0.4366496445  
-0.4282050903  
-0.3674081477  
-0.2471933062  
-0.06754182099  
0.1641555837  
0.4336421753  
0.7212034921  
1.003784629  
1.257555991  
1.460624377  
1.595535722  
1.651255269  
1.624365447  
1.519323013  
1.347738174  
1.126784866  
0.8769551796  
0.6194816198  
0.3737833588  
0.1553084772  
-0.02594080892  
-0.1659888564  
-0.2665345355  
-0.333737911  
-0.3763864854  
-0.4037579769  
-0.4235587047  
-0.4402965266  
-0.4543720599  
-0.4620556768  
-0.4563450314  
-0.4285626759  
-0.3703918948  
-0.2759788657  
-0.1437016944  
0.02274487127  
0.2141827555  
0.416765009  
0.6136766977  
0.7874356237  
0.9224203766  
1.00718882  
1.036183125  
1.010541073  
0.9378644141  
0.8309955991  
0.7060108745  
0.5797724172  
0.467436266  
0.3803160896  
0.3244170766  
0.299839813  
0.3010942187  
0.3182248796  
0.3385264052  
0.3485536982  
0.3361146595  
0.2919521385  
0.2109144093  
0.0924859748  
-0.059325201  
-0.2366707635  
-0.4289546516  
-0.6241561461  
-0.810180152  
-0.9760674919  
-1.112936363  
-1.21458739  
-1.2777652  
-1.302104547  
-1.289843106  
-1.245375842  
-1.174738813  
-1.085081037  
-0.9841680866  
-0.8799302128  
-0.7800403064  
-0.6915145536  
-0.6203152968  
-0.5709555682  
-0.5461231149  
-0.5463666603  
-0.5698961051  
-0.6125579618  
-0.6680329483  
-0.7282864739  
-0.7842484585  
-0.8266731305  
-0.8470883815  
-0.8387091019  
-0.797184925  
-0.7210770444  
-0.6119738075  
-0.4742270865  
-0.3143290967  
-0.140034302  
0.04065773046  
0.2204846753  
0.3937217344  
0.5566656629  
0.7077199805  
0.8470778404  
0.9760455573  
1.096139554  
1.208116312  
1.311130621  
1.402188946  
1.47604063  
1.525571406  
1.542682707  
1.519551645  
1.450098998  
1.331436977  
1.165045378  
0.9574663967  
0.720344662  
0.4697369236  
0.2247377816  
0.005541337604  
-0.1688189691  
-0.282751555  
-0.3261165371  
-0.2956463254  
-0.1955853734  
-0.03741634171  
0.1613080649  
0.3788924305  
0.5919426021  
0.7780073401  
0.9180769742  
0.9986045113  
1.012812439  
0.9611196654  
0.8506669534  
0.6940397231  
0.5073928787  
0.308252105  
0.1133122189  
-0.0634815158  
-0.2123135649  
-0.3282041514  
-0.4109779587  
-0.4645709034  
-0.4958151596  
-0.5129335581  
-0.523978754  
-0.5354632056  
-0.551371823  
-0.5726827785  
-0.5974373314  
-0.6213166449  
-0.6386063875  
-0.6433861495  
-0.6307359554  
-0.5977910122  
-0.5444683134  
-0.4737737844  
-0.3916432146  
-0.306348089  
-0.2275488654  
-0.1651329433  
-0.1279906875  
-0.122898656  
-0.1536462877  
-0.220518747  
-0.3201972034  
-0.4460769822  
-0.5889559475  
-0.7379989112  
-0.8818442251  
-1.009719907  
-1.112423686  
-1.183060021  
-1.217468901  
-1.214313809  
-1.174869185  
-1.102573707  
-1.002450738  
-0.8805062972  
-0.7431998245  
-0.5970537788  
-0.4484245388  
-0.303411999  
-0.1678521369  
-0.04730550428  
0.05302291987  
0.1285073675  
0.1754588032  
0.1916022211  
0.1765773347  
0.1323651093  
0.06351047167  
-0.02294571853  
-0.1178819678  
-0.2108540873  
-0.2911106068  
-0.3487488532  
-0.3758364892  
-0.3673342479  
-0.3216717013  
-0.2408830181  
-0.1302740908  
0.00232578562  
0.1476259143  
0.2960857066  
0.4391015045  
0.5700040612  
0.6847316739  
0.7821001748  
0.8636472714  
0.9331008224  
0.995555196  
1.056489229  
1.120759581  
1.191716031  
1.270539643  
1.355888773  
1.443882234  
1.52841778  
1.601772224  
1.655411551  
1.680913568  
1.670908857  
1.619931579  
1.525108527  
1.386615321  
1.2078618  
0.995392218  
0.7584986493  
0.5085916287  
0.2583624055  
0.02082050387  
-0.1917169685  
-0.3685885158  
-0.5016086941  
-0.5856627802  
-0.6190075651  
-0.6032503081  
-0.5430136385  
-0.4453335122  
-0.3188766543  
-0.1730920883  
-0.01740557506  
0.1394288698  
0.2897568511  
0.4271994509  
0.5465952582  
0.6437859499  
0.715327318  
0.7582372773  
0.7698724444  
0.7479786004  
0.6909349757  
0.5981347507  
0.4704236572  
0.3104814953  
0.1230367279  
-0.08516719592  
-0.3056954892  
-0.5290116575  
-0.7452588019  
-0.9451168669  
-1.120601512  
-1.265676361  
-1.376595324  
-1.451929699  
-1.492307854  
-1.4999279  
-1.477961733  
-1.429960467  
-1.359367943  
-1.269225901  
-1.162094863  
-1.040183807  
-0.9056300719  
-0.7608536825  
-0.6088942267  
-0.4536470837  
-0.2999333687  
-0.1533775498  
-0.02009287632  
0.09379587573  
0.1827258495  
0.2422920407  
0.2697843912  
0.2645882293  
0.2283790998  
0.1650760558  
0.08053641483  
-0.01799847649  
-0.1226462406  
-0.2257451078  
-0.3207308542  
-0.4029086288  
-0.470017742  
-0.5224892574  
-0.5633390181  
-0.597684103  
-0.6319284021  
-0.6727024053  
-0.7256982931  
-0.7945629509  
-0.8800022174  
-0.9792475944  
-1.085978121  
-1.190738702  
-1.281827962  
-1.346564751  
-1.372784937  
-1.350392077  
-1.272762284  
-1.137823526  
-0.9486582291  
-0.7135287858  
-0.4452948581  
-0.1602606016  
0.1234341233  
0.3877143722  
0.6165312612  
0.7976515565  
0.9240374193  
0.994618302  
1.014321919  
0.9933365311  
0.9456620373  
0.8871307672  
0.8331555899  
0.7965256536  
0.7855719331  
0.8029900394  
0.8455314285  
0.9046153917  
0.9678155782  
1.020991682  
1.050750687  
1.046844205  
1.004116771  
0.923658042  
0.8129650912  
0.6850449545  
0.5565871556  
0.4454705389  
0.3680027635  
0.3363244371  
0.3564122346  
0.4270104743  
0.539683078  
0.6800068892  
0.8297368736  
0.9696292847  
1.082485228  
1.155953694  
1.184642615  
1.171200919  
1.126170745  
1.066599282  
1.013576241  
0.989030845  
1.012232233  
1.096495697  
1.246565526  
1.457080151  
1.712360936  
1.987602501  
2.251350006  
2.468970409  
2.606683869  
2.635651023  
2.535582732  
2.297410503  
1.924664427  
1.433381433  
0.8505560048  
0.2113365151  
-0.4446654688  
-1.077478755  
-1.650770285  
-2.135246909  
-2.511076924  
-2.769082504  
-2.910642089  
-2.946405875  
-2.894085949  
-2.775678827  
-2.614529281  
-2.432621142  
-2.248423179  
-2.075499714  
-1.921978619  
-1.790835337  
-1.680842845  
-1.587963941  
-1.506913889  
-1.432637715  
-1.361472378  
-1.291846278  
-1.224445372  
-1.161876594  
-1.107920901  
-1.066545827  
-1.040863778  
-1.032221143  
-1.039580948  
-1.059290581  
-1.085277241  
-1.109629818  
-1.12347664  
-1.11801522  
-1.085550135  
-1.020390117  
-0.9194875121  
-0.7827554134  
-0.6130370071  
-0.4157660711  
-0.1983794907  
0.03041897234  
0.2614509539  
0.4858162359  
0.695533558  
0.8840251051  
1.046425681  
1.17970553  
1.282641318  
1.355652919  
1.400541001  
1.420163784  
1.418084191  
1.398207318  
1.364438312  
1.320376141  
1.269048545  
1.212708752  
1.152699502  
1.089394765  
1.022230494  
0.9498368326  
0.8702728191  
0.7813568515  
0.6810770686  
0.5680337476  
0.4418660669  
0.3035896984  
0.1557765254  
0.002524092242  
-0.1508168285  
-0.2981422187  
-0.433271754  
-0.5506981535  
-0.6462957238  
-0.7178551756  
-0.7653339337  
-0.7907626053  
-0.7978048507  
-0.7910291868  
-0.775018179  
-0.7534775731  
-0.7284981062  
-0.7001417752  
-0.6664141308  
-0.6236673533  
-0.5673680775  
-0.4931057408  
-0.3976748494  
-0.2800380857  
-0.1419996435  
0.01155022983  
0.1728810649  
0.3321512935  
0.4785429872  
0.6016528927  
0.6929505848  
0.7471073678  
0.7629944473  
0.744197273  
0.6989431476  
0.6394136251  
0.5804908176  
0.53805175  
0.5270076121  
0.5593072089  
0.6421565086  
0.7766932122  
0.9573148458  
1.171781618  
1.402140513  
1.626406749  
1.820833979  
1.962537827  
2.032162473  
2.016270655  
1.90915955  
1.713863177  
1.442193094  
1.11379332  
0.7542879347  
0.3927207511  
0.05856999763  
-0.2213514506  
-0.4257503862  
-0.5411603975  
-0.5634515542  
-0.4983565038  
-0.3609660841  
-0.1742158291  
0.03347848508  
0.2312090996  
0.3888782704  
0.4804650676  
0.4869023803  
0.3982345188  
0.2148043911  
-0.05269822644  
-0.3843476026  
-0.753149345  
-1.128036055  
-1.477325311  
-1.772253791  
-1.990138574  
-2.116779778  
-2.147820362  
-2.088887283  
-1.954529778  
-1.76610131  
-1.548902654  
-1.32896394  
-1.129916611  
-0.9703595212  
-0.8620501887  
-0.8091196937  
-0.8083551322  
-0.8504383402  
-0.9218905548  
-1.007380216  
-1.092018888  
-1.163297564  
-1.212389798  
-1.23467365  
-1.229473617  
-1.199141905  
-1.147726229  
-1.079514451  
-0.9977644051  
-0.9038626779  
-0.7970757449  
-0.6749167542  
-0.5340397212  
-0.3714642914  
-0.1858640553  
0.02135539398  
0.2454226736  
0.4781699694  
0.7086455698  
0.92428951  
1.1124925  
1.262285905  
1.365878588  
1.419789025  
1.425372664  
1.388660341  
1.31952434  
1.230288395  
1.134017545  
1.042720441  
0.96575923  
0.9086833455  
0.87265884  
0.8545542136  
0.8476563003  
0.8428826186  
0.8302974291  
0.8006910777  
0.7469939531  
0.665321197  
0.555517174  
0.4211472876  
0.2689753428  
0.1080336332  
-0.0515464563  
-0.1997476839  
-0.3277443894  
-0.4286875903  
-0.4981072419  
-0.5339067137  
-0.5359966323  
-0.5056765429  
-0.4449169499  
-0.3557000372  
-0.2395701415  
-0.09750410774  
0.06986099511  
0.2616653677  
0.4760326471  
0.7092022267  
0.9547724213  
1.203247621  
1.442039969  
1.656013564  
1.828575181  
1.943223295  
1.9853639  
1.944169907  
1.814194025  
1.596491131  
1.299039492  
0.9363620011  
0.5283450196  
0.09839498057  
-0.3288477183  
-0.7299317258  
-1.084830984  
-1.378705265  
-1.602963362  
-1.755516513  
-1.840241195  
-1.865768752  
-1.843825717  
-1.787387376  
-1.708912033  
-1.61889604  
-1.524905894  
-1.431167149  
-1.338698605  
-1.245895569  
-1.149430837  
-1.045302395  
-0.9298586234  
-0.800678214  
-0.6571873766  
-0.5009723464  
-0.3357688128  
-0.1671569699  
-0.002017192364  
0.152179816  
0.2881637024  
0.3996457217  
0.4820064134  
0.5328139576  
0.552112454  
0.5424491397  
0.5086220449  
0.4571816208  
0.3957364747  
0.332141803  
0.2736710344  
0.2262801574  
0.1940449273  
0.1788521276  
0.1803737188  
0.1963161675  
0.2228939971  
0.2554578704  
0.2891656645  
0.3196100268  
0.3433057184  
0.3579891853  
0.3627031455  
0.3576857238  
0.3441083372  
0.3237247409  
0.2985134702  
0.2703604811  
0.2408389811  
0.2110997129  
0.1818657834  
0.1535092726  
0.1261709195  
0.09988929291  
