24,-0.0063845,0.030768,0.044625,-0.97741,0.0022199,-1.9302,0.97481,-5.6561,53.21,-0.0026583,2.7164,0.030142,1.8417,8.684,0.044889,24.19,0.024634,0.97753,0.069383,0.026235,0.022322,0.019083,0.22273,0.24011,0.4715,0.039791,0.0037748,0.0031465,0.018951,0.39976,0.20554,0.19071,27.371,3777.3,4349,3188.8,11343,0.73609,0.66288,0.73609,0.32566,0.74113,0.19301,0.28933,0.033027,26,180.08,3899,5.8016e+05,4.6994,23.391,1.0527e+05,10962,6669,0.91099,0.93264,0.29469,0.2099,0.15312,0.89011,56340,28536,0.00078252,0.0004186,0,0.062313,0,0.073069,0.0087667,0.0030401,0.018191,0.022455,3.544,6.1266,2.2708,0.25229,0.28761,0.31884,0.27564,0.34634,0.30198,0.27743,0.35836,0.29756,51.171,8.6087,13933,29294,28073,0.076832,0.062917,0.03517,0.25545,0.22825,0.061204,0.46792,0.44999,0.079192,0.66495,0.65953,0.089741,0.80832,0.81031,0.093005,0.0015584,0.0012257,0.019101,-0.001523,0.037907,-0.042322,0.0040163,0.0035563,0.023425,0.00018768,0.054408,-0.033141,0.0074796,0.0071327,0.026038,0.0018663,0.070795,-0.017322,0.00093501,0.00076053,0.024661,0.00043131,0.032281,-0.028055,0.0026345,0.0025319,0.031743,0.0031078,0.047154,-0.0094158,0.0053375,0.005547,0.037353,0.0063757,0.063078,0.012913,0.00062257,0.00046453,0.015812,-0.0018829,0.021013,-0.032832,0.0013807,0.0010235,0.017643,-0.0018117,0.029933,-0.041413,0.0021465,0.0015893,0.017042,-0.002444,0.037497,-0.04714,8.5399e-07,6.7797e-07,0.00019856,-0.0026082,0.0076728,-0.010407,2.0878e-05,1.6575e-05,0.0015616,-0.0033707,0.010094,-0.010407,8.49e-05,6.7401e-05,0.0031321,-0.0040465,0.013198,-0.010407,0.36346,74,74,40,988,3,3,3,0.645
24,-0.0046925,0.022441,0.032704,-0.9835,0.0014223,-1.9454,0.97801,0.49682,7.0861,-0.0017639,3.133,0.0032079,1.0207,5.6216,0.032901,9.4873,0.0096612,0.98353,0.057192,0.020663,0.016657,0.014132,0.25786,0.27908,0.40815,0.03436,0.0039188,0.0024855,0.014143,0.43407,0.2434,0.090034,48.745,4100.3,8223.1,6958.2,19331,0.48833,0.31128,0.48833,0.40476,0.85998,0.28985,0.23789,0.026225,45,45.178,1925,81347,6.4724,42.937,51975,1053,1053,0.92014,0.94625,0.16333,0.11364,0.06302,0.84438,23988,14968,0.0011549,0.00043515,0,0.058004,0,0.071951,0.012441,0.045353,0.020735,0.086099,0.26345,3.6936,3.8139,0.22977,0.26641,0.32614,0.22855,0.2551,0.22816,0.22933,0.25499,0.22778,32.219,8.8057,13386,21811,20964,0.3359,0.33587,0.079133,0.70873,0.74409,0.087394,0.84571,0.87947,0.073662,0.89881,0.92352,0.062428,0.93459,0.95018,0.055343,0.039833,0.048111,0.25126,0.1278,0.14562,0.16194,0.078938,0.093266,0.23695,0.15811,0.18059,0.18428,0.12389,0.14452,0.22197,0.18219,0.20905,0.20597,0.0095779,0.012691,0.13001,0.043971,0.079567,0.12528,0.020654,0.027716,0.12808,0.057614,0.10057,0.17706,0.036309,0.048439,0.13077,0.073491,0.12118,0.22045,0.026604,0.031978,0.34773,0.12101,0.11508,0.12778,0.053299,0.064214,0.35051,0.15712,0.15151,0.16743,0.083094,0.10001,0.33953,0.1846,0.17979,0.19933,0.0036519,0.0034422,0.437,0.067241,0.057861,-0.015422,0.0097449,0.0094096,0.37513,0.07896,0.073587,-0.012334,0.017173,0.016909,0.32607,0.08845,0.087468,-0.0068451,0.35011,74,74,40,988,3,3,3,0.645
24,-0.0029815,0.014111,0.020502,-0.98969,0.00095723,-1.956,0.97638,0.36375,2.8442,0.10131,3.2852,6.3594e-05,0.41188,2.868,0.020582,3.5505,0.0036156,0.9897,0.044615,0.010771,0.0084276,0.0068587,0.36574,0.29117,0.29941,0.032788,0.0023515,0.0015806,0.0069682,0.53045,0.21009,0.0030674,66.684,13155,24683,35200,73106,0.072285,0.075089,0.075089,0.19482,0.29365,0.1298,0.17934,0.016203,27,152.26,1990,2.7055e+05,3.246,11.558,53730,52461,1971,0.91316,0.93381,0.34448,0.27318,0.15673,0.91226,31552,16172,0.0015803,0.00057152,0,0.05665,0,0.059333,0.004152,0.047277,0.0029983,0.060272,2.0378,3.8542,2.5338,0.25281,0.27102,0.30185,0.27578,0.25867,0.25578,0.27374,0.28437,0.25185,36.173,8.1499,23723,66444,65528,0.19511,0.19532,0.079587,0.51733,0.53835,0.11045,0.70889,0.75121,0.10691,0.79711,0.84182,0.09586,0.84578,0.88169,0.086717,0.02758,0.042727,0.30122,0.11437,0.16169,0.23917,0.059194,0.088641,0.30765,0.15394,0.21047,0.29134,0.099557,0.14445,0.30884,0.19082,0.25353,0.33154,0.020657,0.034133,0.48549,0.13209,0.18478,0.24895,0.045155,0.072727,0.48482,0.1757,0.23902,0.31149,0.076655,0.11999,0.47802,0.21583,0.28612,0.36035,0.0050112,0.0070029,0.11341,0.02554,0.043791,0.063909,0.00871,0.011403,0.099176,0.027848,0.04981,0.062481,0.013031,0.016022,0.092193,0.030812,0.055318,0.055104,0.0019125,0.0015911,0.39626,0.04536,0.040535,-0.023457,0.0055419,0.0046962,0.36938,0.057878,0.053983,-0.027966,0.010689,0.0091514,0.35139,0.071093,0.067745,-0.033789,0.39874,74,74,40,988,3,3,3,0.645
24,-0.0043477,0.021325,0.030727,-0.9845,0.001835,-1.9392,0.96968,2.9891,22.74,0.045662,2.9256,0.014926,1.366,7.7943,0.030655,15.825,0.016115,0.98465,0.069564,0.032607,0.027581,0.023568,0.25555,0.29187,0.38656,0.033963,0.0048076,0.0038726,0.02337,0.41429,0.26362,0.053644,50.284,2673.8,3321.4,2534.9,8581.1,0.34437,0.48271,0.48271,0.23085,0.87081,0.20308,0.23467,0.059317,40,43.825,1483,54000,5.9906,37.26,40041,3078,2646,0.92097,0.94574,0.023839,0.016673,0.012664,0.14887,27334,13598,0.00084242,0.00040799,0,0.069379,0,0.089684,0.0015245,0.032266,0.0035063,0.058801,3.2982,7.1439,3.7964,0.24992,0.26102,0.29714,0.25937,0.23242,0.16379,0.27551,0.22034,0.14257,26.235,8.0227,20699,33810,33151,0.29137,0.27288,0.062727,0.59453,0.61956,0.066992,0.73011,0.75011,0.058112,0.84716,0.85727,0.053769,0.93095,0.9388,0.050376,0.0018399,0.0013557,0.010605,-0.0001325,0.040654,-0.031236,0.0034371,0.0025071,0.009428,-0.001039,0.054094,-0.041953,0.0058783,0.0043406,0.009624,-0.001105,0.067731,-0.052317,0.0018399,0.0013557,0.022822,0.0046615,0.036908,-0.031236,0.0034371,0.0025071,0.019477,0.0044756,0.046641,-0.041953,0.0058742,0.004338,0.019333,0.0054867,0.057545,-0.052269,0,0,0,-0.0040845,0.017367,0,0,0,0,-0.0052597,0.023985,0,4.0656e-06,2.6533e-06,1.5181e-05,-0.0063779,0.030205,-0.017021,0,0,0,-0.0017931,0.02043,0,0,0,0,-0.0024642,0.026744,0,0,0,0,-0.0031914,0.033288,0,0.35372,74,74,40,988,3,3,3,0.645
24,-0.0030831,0.015002,0.021787,-0.98904,0.0010761,-1.9533,0.97499,0.027162,2.6301,0.0016164,3.3074,0.00010528,0.46951,3.1786,0.021775,4.2302,0.0043077,0.9891,0.064066,0.025673,0.02166,0.018499,0.30968,0.35116,0.27843,0.035482,0.0038628,0.0030636,0.01832,0.47852,0.31254,0.021652,53.783,4908,6477.1,4863,16303,0.11587,0.11505,0.11587,0.37923,0.45328,0.18648,0.18439,0.016866,25,259.92,6300,1.5784e+06,4.6914,23.021,1.701e+05,3591,1674,0.88762,0.89543,0.44816,0.36632,0.19499,0.95057,80597,43722,0.0010315,0.00054121,0,0.059212,0,0.066852,0.003392,0.011055,0.0059643,0.011944,1.2446,2.261,1.6845,0.25126,0.28009,0.35578,0.24678,0.29432,0.41823,0.25247,0.29916,0.42055,85.102,9.606,20636,81375,80915,0.037449,0.025837,0.023205,0.18549,0.17473,0.06016,0.36732,0.38244,0.084152,0.5452,0.57564,0.099602,0.69163,0.7177,0.10772,0.015808,0.016034,0.26228,0.076815,0.090098,0.0057451,0.030508,0.031348,0.24087,0.091711,0.11349,0.014089,0.047672,0.049304,0.22465,0.10446,0.13405,0.021183,0.015002,0.01549,0.53561,0.1169,0.11364,0.012641,0.028355,0.02979,0.46248,0.13315,0.13792,0.024736,0.043513,0.046111,0.41221,0.14664,0.15931,0.034953,0.00041848,0.00024116,0.014387,-0.0037742,0.016315,-0.031494,0.00083363,0.0004782,0.014419,-0.0048507,0.020177,-0.036547,0.0012653,0.00072304,0.013598,-0.0061782,0.022715,-0.041532,0.00038815,0.0003024,0.12217,0.0089587,0.01509,-0.019473,0.0013197,0.0010798,0.13362,0.013862,0.022535,-0.022698,0.0028937,0.0024698,0.14451,0.019862,0.031075,-0.024525,0.3682,74,74,40,988,3,3,3,0.645
24,-0.00493,0.023518,0.034371,-0.98265,0.0013497,-1.9458,0.98017,0.24165,5.2859,0.071215,3.0807,0.0031946,0.74732,4.0166,0.034548,6.4788,0.0065975,0.98271,0.056147,0.02084,0.016498,0.013736,0.2023,0.33906,0.40426,0.033504,0.0042806,0.0027431,0.013863,0.2886,0.31361,0.063646,53.695,3588.9,6963.7,7704,18311,0.43059,0.21291,0.43059,0.55727,0.58217,0.28531,0.23296,0.024543,48,77.979,3086,1.9641e+05,6.6419,45.414,83322,5103,3834,0.91617,0.93661,0.13609,0.098582,0.067815,0.45633,22626,15503,0.0010654,0.00048584,0,0.078807,0,0.07084,0.044603,0.060398,0.081453,0.080211,1.2793,0.22557,0.67884,0.24786,0.25221,0.27529,0.2515,0.21943,0.17398,0.24126,0.21501,0.16837,15.914,7.4328,16926,38555,37706,0.32569,0.34076,0.13252,0.64469,0.67582,0.13731,0.80241,0.83549,0.12071,0.88394,0.909,0.10604,0.91958,0.9367,0.094053,0.0037282,0.0030591,0.040618,0.0082103,0.043007,-0.037705,0.0089409,0.0075267,0.046355,0.013883,0.059297,-0.044737,0.015202,0.013011,0.047044,0.017595,0.072966,-0.049764,0.0026487,0.0022465,0.062101,0.011834,0.031889,-0.027955,0.0067245,0.0058433,0.072024,0.019524,0.045716,-0.032503,0.011717,0.010367,0.072888,0.024748,0.05826,-0.035333,0.0010788,0.0008122,0.024356,0.0010633,0.027876,-0.025569,0.0022518,0.0017139,0.025577,0.0018023,0.036706,-0.032824,0.0036226,0.0027606,0.025566,0.0021839,0.042636,-0.038696,5.8233e-07,3.9449e-07,0.00012036,-0.0024627,0.01022,-0.014397,4.4961e-05,3.181e-05,0.0029894,-0.0029078,0.014832,-0.014714,0.00015928,0.00011192,0.0052233,-0.0032853,0.019995,-0.015069,0.50826,74,74,40,988,3,3,3,0.645
24,-0.0026191,0.013182,0.01904,-0.99042,0.0011699,-1.9499,0.96879,0.56312,2.974,0.19518,3.2557,6.6696e-09,0.43388,3.1513,0.018919,4.0356,0.0041096,0.99053,0.073602,0.041522,0.032879,0.026991,0.32779,0.33901,0.26131,0.030087,0.0084262,0.0058209,0.027562,0.48514,0.27938,0.059838,84.828,1027.5,1832.5,2299.9,5245.6,0.18472,0.071252,0.18472,0.4027,0.92044,0.21091,0.17214,0.014414,32,139.16,1668,1.6036e+05,2.9408,10.262,45036,36990,26190,0.91451,0.9371,0.33898,0.23861,0.21438,0.94066,39667,24390,0.000715,0.00036948,0,0.066899,0,0.081805,0.00022918,0.012618,0.0032337,0.011789,1.4484,4.4468,2.3579,0.23972,0.27886,0.35518,0.26073,0.33367,0.35946,0.27301,0.34311,0.34373,64.573,9.5899,10949,22426,20103,0.025388,0.019625,0.011421,0.12553,0.12008,0.029558,0.25932,0.26223,0.043131,0.39391,0.40023,0.052246,0.5271,0.52942,0.059604,0.0025647,0.0028181,0.030893,0.0031987,0.04425,0.027493,0.0061397,0.0067684,0.035193,0.006407,0.059662,0.037856,0.010691,0.011671,0.036576,0.0087817,0.073506,0.041243,0.0022333,0.0025687,0.057891,0.0095412,0.033303,0.039894,0.0055011,0.0062754,0.065142,0.015326,0.047002,0.049737,0.0095143,0.010729,0.065436,0.019238,0.059465,0.053912,0.00033136,0.00024937,0.0082707,-0.0037718,0.029134,-0.021631,0.00065049,0.00050256,0.0081689,-0.0048914,0.037467,-0.025397,0.0012902,0.0010332,0.010068,-0.0051612,0.044708,-0.033648,0,0,0,-0.0026076,0.0068601,0,0,0,0,-0.0035836,0.0095333,0,0,0,0,-0.0046412,0.012911,0,0.34898,74,74,40,988,3,3,3,0.645
24,-0.004151,0.020057,0.029014,-0.98537,0.0015984,-1.9432,0.97206,0.27321,3.1958,0.063575,3.2817,4.7775e-06,0.62625,3.6674,0.0291,5.1729,0.0052678,0.98543,0.061333,0.026428,0.019898,0.015943,0.28012,0.2787,0.37917,0.034378,0.0066933,0.0040949,0.016838,0.42288,0.21429,0.03551,53.675,1493.1,3314.5,5387,10249,0.36473,0.15883,0.36473,0.74879,0.87041,0.30445,0.21381,0.022688,71,60.845,3886,2.1137e+05,8.2262,68.786,1.0492e+05,3375,2052,0.917,0.94099,0.21625,0.1454,0.18132,0.59655,31649,17744,0.00085587,0.00039771,0,0.049013,0,0.050867,0.012468,0.049134,0.027327,0.052966,1.0508,1.0542,1.5391,0.24782,0.2602,0.29982,0.25375,0.24459,0.23836,0.25385,0.23919,0.23364,13.88,8.0952,6988.2,14726,12178,0.25219,0.25814,0.1173,0.50166,0.52051,0.12212,0.67804,0.70076,0.11659,0.78854,0.80728,0.10813,0.87118,0.88409,0.10185,0.0025577,0.0023305,0.031851,0.0032203,0.039853,-0.023658,0.0067205,0.0062648,0.039826,0.0082478,0.056434,-0.026144,0.012091,0.011393,0.042767,0.012008,0.070658,-0.02762,0.0010422,0.00097283,0.02793,0.0012005,0.036636,-0.014374,0.003741,0.0036265,0.045799,0.0079412,0.051759,-0.0093908,0.0074026,0.0072883,0.052636,0.012925,0.065217,-0.0059438,0.0015155,0.0013576,0.039105,0.0040445,0.01805,-0.018976,0.0029795,0.0026383,0.038683,0.0050679,0.02459,-0.027245,0.0046817,0.0040991,0.037767,0.0057844,0.029861,-0.035153,0,0,0,-0.0026524,0.014203,0,0,0,0,-0.0036452,0.018902,0,6.8101e-06,5.2718e-06,0.00025527,-0.0046695,0.02272,-0.011572,0.58242,74,74,40,988,3,3,3,0.645
24,-0.0043341,0.022427,0.031739,-0.98399,0.0028361,-1.923,0.95428,-0.16539,4.8144,0.033677,3.2607,0.00025323,1.0177,5.7528,0.031235,8.2325,0.0083834,0.98436,0.089132,0.053978,0.044468,0.037462,0.2863,0.23775,0.39239,0.031268,0.0088209,0.0066011,0.036869,0.47965,0.14945,0.064679,60.426,767.36,1144.4,1008.3,2981.2,0.35761,0.32254,0.35761,0.5749,1.1234,0.22685,0.22527,0.023044,39,121.44,2456,1.9717e+05,4.354,21.711,66312,36423,13581,0.9126,0.93217,0.30792,0.22483,0.16897,0.85533,49501,28813,0.0010348,0.00041966,0,0.044666,0,0.044131,0.0026185,0.023746,0.0020323,0.021955,1.9564,5.2048,2.5544,0.26725,0.30415,0.30471,0.31136,0.363,0.2554,0.318,0.36862,0.25115,53.419,8.2272,14002,33616,32209,0.043944,0.036664,0.021211,0.26873,0.27514,0.067894,0.53258,0.5512,0.095043,0.7384,0.7589,0.10508,0.88019,0.89968,0.10679,0.007915,0.0082375,0.10229,0.029268,0.068758,0.016522,0.021712,0.022667,0.13354,0.053941,0.099287,0.024831,0.040626,0.041812,0.14913,0.076096,0.12474,0.020806,0.0049769,0.0058685,0.13842,0.029857,0.061034,0.060728,0.014815,0.017011,0.18822,0.057134,0.091632,0.07048,0.028527,0.031708,0.21051,0.080909,0.1175,0.067096,0.0026565,0.0021693,0.071142,0.011863,0.03311,-0.038596,0.0059569,0.0049997,0.080263,0.018251,0.043021,-0.044012,0.010186,0.0087836,0.085277,0.024148,0.050413,-0.046156,0.00028155,0.00019963,0.06903,0.0049727,0.024733,-0.031921,0.0011437,0.00082069,0.090202,0.010069,0.033324,-0.040735,0.0026135,0.0019055,0.10167,0.015311,0.041919,-0.04898,0.36004,74,74,40,988,3,3,3,0.645
24,-0.0037503,0.019913,0.028083,-0.98584,0.0028247,-1.9208,0.94838,0.43572,5.627,-0.091031,3.165,0.0017099,1.0415,6.2729,0.027512,10.577,0.010771,0.98622,0.10669,0.063411,0.051948,0.043784,0.28289,0.29144,0.32717,0.037576,0.010472,0.0075975,0.042866,0.46097,0.24929,0.0099515,39.859,547.78,865,749.25,2202.6,0.33208,0.25072,0.33208,0.58918,0.63421,0.22869,0.21538,0.020861,71,61.056,1976,83654,5.7389,35.156,53352,40203,6075,0.91413,0.93547,0.19172,0.13543,0.14561,0.54373,23162,15250,0.0014905,0.0005667,0,0.083977,0,0.057591,0.037476,0.054165,0.062046,0.079497,0.94764,1.202,1.9753,0.22834,0.24456,0.29001,0.20852,0.21328,0.21293,0.19345,0.19642,0.19233,17.431,7.8302,11581,28167,26536,0.28461,0.29045,0.14648,0.6608,0.69729,0.17801,0.78144,0.80704,0.1487,0.86298,0.88087,0.13095,0.92004,0.93192,0.11902,0.011134,0.010116,0.15344,0.046386,0.071131,-0.035806,0.022617,0.020727,0.14832,0.058585,0.093761,-0.043151,0.037435,0.0347,0.14653,0.071263,0.11509,-0.046574,0.0036366,0.0032406,0.10784,0.020776,0.045639,-0.025769,0.0083854,0.0076279,0.1136,0.029621,0.062566,-0.029877,0.015531,0.014432,0.1222,0.040549,0.080132,-0.030031,0.0070271,0.0065086,0.20066,0.0429,0.051831,-0.022238,0.013472,0.012515,0.19355,0.052995,0.066437,-0.027402,0.021305,0.019878,0.19019,0.063061,0.079441,-0.031203,0.00047063,0.00036681,0.12304,0.010467,0.02051,-0.019569,0.0011284,0.00089589,0.094895,0.010216,0.026351,-0.023463,0.0018262,0.0014526,0.075749,0.0095581,0.032046,-0.028059,0.51911,74,74,40,988,3,3,3,0.645
24,-0.005101,0.024318,0.035592,-0.98202,0.0013093,-1.9458,0.98144,-0.016526,7.1047,-0.020246,2.985,0.0079352,0.78599,4.1474,0.035844,7.0515,0.0071808,0.98206,0.052845,0.020373,0.016643,0.014052,0.20495,0.33995,0.40379,0.030897,0.0036752,0.0025695,0.014165,0.30026,0.31792,0.068597,63.321,4899.4,8433.1,7437.9,20835,0.27097,0.43906,0.43906,0.58483,0.66632,0.28113,0.23911,0.028368,95,38.421,1474,28886,6.9415,55.427,39798,18873,7317,0.91679,0.93881,0.17292,0.11907,0.14143,0.54738,17581,12702,0.00081058,0.00038987,0,0.043419,0,0.045989,0.042713,0.04521,0.069307,0.082552,0.19037,1.4624,1.6349,0.23213,0.25477,0.3234,0.22062,0.22569,0.27816,0.22343,0.22163,0.27119,11.532,8.7318,4735,10284,8511.7,0.31969,0.32808,0.14304,0.58813,0.6055,0.13773,0.71657,0.73572,0.11854,0.7891,0.80542,0.10409,0.8519,0.86612,0.095808,0.01519,0.018078,0.18198,0.062099,0.09594,0.10107,0.030466,0.035527,0.17368,0.077461,0.12149,0.11283,0.047917,0.054857,0.16305,0.088894,0.14225,0.11781,0.0026956,0.0026735,0.069494,0.012751,0.042234,-0.0018389,0.0055785,0.0054736,0.065698,0.015613,0.0552,-0.00544,0.0093506,0.0090475,0.06396,0.01868,0.067083,-0.01185,0.011481,0.014547,0.28499,0.06899,0.087372,0.12216,0.023037,0.028794,0.28773,0.089766,0.11178,0.147,0.036227,0.044413,0.28113,0.10629,0.13043,0.15824,0.001014,0.00085683,0.23044,0.023991,0.029861,-0.027767,0.0028269,0.0024397,0.20668,0.029202,0.040357,-0.0298,0.0053641,0.0048701,0.19343,0.035098,0.052494,-0.025818,0.61115,74,74,40,988,3,3,3,0.645
24,-0.0057319,0.028214,0.040786,-0.97937,0.0022684,-1.9311,0.97179,2.6589,19.625,0.020539,2.9588,0.014527,1.2616,6.2374,0.040827,11.687,0.011901,0.97956,0.073153,0.037848,0.031567,0.026709,0.18533,0.32014,0.42433,0.032647,0.0060418,0.0047243,0.026791,0.28306,0.31141,0.12306,49.314,1535.2,2097.6,1763,5445.8,0.30726,0.29596,0.30726,0.80598,1.2074,0.36925,0.26656,0.033633,57,75.561,2851,1.4826e+05,6.7295,48.398,76977,18468,6777,0.91713,0.94106,0.2711,0.18483,0.21374,0.7326,23710,15771,0.0012552,0.00060665,0,0.046842,0,0.058277,0.0018799,0.0041309,0.0055809,0.0099966,2.188,6.9848,4.7504,0.24764,0.26223,0.29689,0.25859,0.24733,0.21434,0.27257,0.23959,0.20182,23.613,8.0159,9747.2,20267,18436,0.32043,0.33617,0.14703,0.69123,0.72441,0.16601,0.81865,0.83975,0.13888,0.90419,0.91481,0.12232,0.94765,0.95385,0.1093,0.013087,0.013157,0.16078,0.052962,0.081452,0.0027424,0.023873,0.023955,0.13957,0.058953,0.10063,0.0022078,0.036944,0.036847,0.12892,0.066119,0.11814,-0.0020587,0.0080381,0.0085074,0.21251,0.050799,0.069988,0.023229,0.013886,0.014663,0.16771,0.051664,0.082588,0.026896,0.020179,0.021204,0.14155,0.052754,0.094396,0.028643,0.0046799,0.0043359,0.11914,0.024934,0.043863,-0.022255,0.0090273,0.0084332,0.11563,0.030933,0.05687,-0.026319,0.015082,0.014028,0.12003,0.039348,0.068662,-0.035191,0.00036848,0.00031326,0.085881,0.0071547,0.019323,-0.015855,0.00097665,0.00087122,0.073225,0.0078501,0.024749,-0.014905,0.0018219,0.001724,0.067374,0.0089798,0.031301,-0.0095632,0.44018,74,74,40,988,3,3,3,0.645
24,-0.0044564,0.022634,0.0322,-0.98375,0.0026349,-1.9264,0.95821,0.66548,3.3907,0.096788,3.2526,6.0949e-05,0.80796,4.5029,0.03213,6.055,0.006166,0.98392,0.1094,0.050412,0.040055,0.033018,0.26131,0.26806,0.36851,0.05242,0.0098166,0.0067828,0.033099,0.43115,0.22914,0.048352,17.474,612.58,1076.1,1213.8,2920.6,0.23342,0.21317,0.23342,0.28768,0.53811,0.20649,0.2258,0.025449,31,189.77,5761,1.0654e+06,5.2937,29.027,1.5555e+05,1377,999,0.91639,0.93695,0.427,0.30019,0.29672,0.93025,35366,26091,0.00069258,0.00043063,0,0.043917,0,0.047392,0.0020746,0.0038018,0.0052419,0.014568,2.6185,1.7963,0.12126,0.24289,0.29755,0.34355,0.25159,0.34844,0.35051,0.24169,0.35682,0.35817,74.026,9.2759,13916,30372,27920,0.034987,0.030146,0.019942,0.11625,0.10255,0.034682,0.29358,0.27625,0.061865,0.5035,0.4833,0.084609,0.68384,0.66121,0.097972,0.0073576,0.0082202,0.11229,0.028932,0.058399,0.058099,0.018375,0.021279,0.13345,0.047708,0.088068,0.10869,0.033995,0.039577,0.14736,0.066717,0.11641,0.14489,0.00033258,0.00028407,0.010922,-0.004292,0.022411,-0.02554,0.0017454,0.0015066,0.026187,-0.00081031,0.035243,-0.038527,0.0048851,0.0042419,0.042567,0.0055549,0.049637,-0.050521,0.0040553,0.0041303,0.12824,0.023254,0.039481,0.0063676,0.0088731,0.0094588,0.14118,0.033837,0.055614,0.030002,0.015269,0.016776,0.15094,0.044656,0.07086,0.055902,0.0029698,0.0038058,0.85979,0.085237,0.0856,0.10219,0.0086365,0.011244,0.80435,0.10933,0.11384,0.14522,0.016174,0.021044,0.74298,0.13039,0.13923,0.18093,0.35626,74,74,40,988,3,3,3,0.645
24,-0.007351,0.040225,0.056273,-0.97143,0.0066674,-1.8835,0.93889,-0.085916,2.7491,0.050329,3.3051,0.00018321,0.78206,3.3165,0.055495,4.2493,0.0043272,0.9722,0.16198,0.084071,0.068559,0.058201,0.15427,0.22433,0.47578,0.064609,0.013988,0.0095687,0.057452,0.23718,0.18865,0.20967,7.9557,224.28,405.21,310.1,948.18,0.098669,0.090992,0.098669,0.40834,0.41161,0.16197,0.29758,0.043085,36,23.75,402,5109.4,4.0324,20.361,10854,4212,3402,0.92188,0.94805,0.042433,0.030124,0.0015497,0.40863,17893,12325,0.00072147,0.00031537,0,0.13135,0,0.082026,0.0093214,0.23151,0.047776,0.58198,2.7451,5.3815,2.7095,0.22735,0.26155,0.36715,0.21969,0.23538,0.46505,0.22556,0.22502,0.49208,32.218,9.9129,33749,48276,47662,0.10913,0.089621,0.013869,0.36305,0.3471,0.02415,0.50357,0.54861,0.02366,0.63766,0.69553,0.023892,0.74251,0.78527,0.023718,0.0024183,0.0016805,0.0082286,0.0013249,0.045271,-0.028978,0.0050362,0.0035229,0.008155,0.0016732,0.061414,-0.036266,0.0088499,0.0062411,0.0085532,0.0025344,0.077855,-0.047131,0.001664,0.0011787,0.012184,0.0029227,0.045342,-0.026054,0.0039627,0.002815,0.013256,0.0046145,0.058607,-0.031648,0.0073232,0.0052421,0.014228,0.0065686,0.072985,-0.042,0.00075428,0.00050178,0.0053183,-0.00052948,0.017394,-0.014517,0.0010594,0.00069881,0.0037581,-0.0016647,0.023638,-0.017381,0.0013277,0.00087075,0.0029266,-0.0026574,0.028972,-0.018552,0,0,0,-0.0013746,0.014676,0,1.4202e-05,9.0886e-06,0.00029492,-0.001802,0.022567,-0.014288,0.00019894,0.0001283,0.0020375,-0.0016677,0.031339,-0.019761,0.34384,74,74,40,988,3,3,3,0.645
24,-0.0025967,0.012755,0.018356,-0.99077,0.0011873,-1.949,0.96712,0.096789,2.608,-0.034669,3.3208,0.0001853,0.47669,3.5162,0.018342,4.4313,0.0045125,0.99082,0.068972,0.031317,0.024216,0.019481,0.38843,0.25059,0.29413,0.035386,0.0069656,0.0046975,0.019797,0.5564,0.12622,0.010506,61.694,1609.4,2948,4625.7,9245.5,0.15178,0.11579,0.15178,0.28511,0.64729,0.16272,0.17004,0.014017,44,103.73,1477,84329,3.4922,14.969,39879,30888,15012,0.91377,0.93507,0.40127,0.29742,0.26864,0.90842,43939,25493,0.00092112,0.0004312,0,0.075941,0,0.071403,6.4778e-05,0.016958,0.0065222,0.02516,2.5079,4.8697,1.8121,0.24505,0.30399,0.329,0.25991,0.36308,0.32024,0.25275,0.37446,0.32485,59.575,8.883,11263,27185,25618,0.035345,0.027764,0.017948,0.19779,0.18485,0.052569,0.39272,0.37493,0.073729,0.5523,0.53746,0.082685,0.66387,0.64961,0.084735,0.0017684,0.0013664,0.024044,-0.00056077,0.032843,-0.041827,0.0054432,0.0044327,0.035218,0.0046459,0.047215,-0.051321,0.011757,0.01007,0.045404,0.011794,0.061738,-0.053199,0.00043797,0.00038721,0.012814,-0.0032575,0.018247,-0.014013,0.0019266,0.0017288,0.025751,5.977e-05,0.028976,-0.019546,0.0050461,0.004612,0.039174,0.0057648,0.041487,-0.022427,0.0011569,0.00082451,0.032594,0.0017346,0.024858,-0.038413,0.0028157,0.0020321,0.039912,0.0045624,0.032215,-0.04977,0.0050663,0.003713,0.044621,0.0073597,0.037541,-0.060333,0.00017352,0.00015473,0.044755,0.0020808,0.01633,-0.0088236,0.00075214,0.00070922,0.062408,0.0054914,0.024478,-0.0068462,0.001924,0.0019499,0.078738,0.010265,0.034092,0.0021674,0.36405,74,74,40,988,3,3,3,0.645
24,-0.0052299,0.027177,0.038726,-0.98043,0.0032615,-1.9187,0.95696,0.028339,2.53,-0.043761,3.3311,0.00022821,0.58049,2.9668,0.038208,3.8327,0.003903,0.98087,0.12482,0.063347,0.051352,0.043031,0.17024,0.35795,0.35929,0.052118,0.01088,0.0076953,0.041838,0.21924,0.35644,0.036225,17.496,500.95,820.34,763.14,2102.5,0.25213,0.076666,0.25213,0.56813,0.90885,0.34157,0.24477,0.029576,43,77.093,2942,1.9951e+05,6.2992,40.796,79434,3105,2403,0.91758,0.94036,0.093966,0.06731,0.10072,0.53872,19436,13712,0.0011295,0.00042659,0,0.077868,0,0.10637,0.0003811,0.056506,0.0055564,0.078859,0.2398,2.3382,2.3183,0.23949,0.26858,0.35753,0.2252,0.26844,0.42493,0.24408,0.27157,0.41561,35.832,9.6533,16604,34494,33408,0.22785,0.25506,0.077864,0.48488,0.54393,0.08673,0.63899,0.69636,0.080733,0.76366,0.81381,0.07694,0.86154,0.89418,0.074003,0.00038676,0.00029635,0.0035389,-0.0060767,0.027688,-0.024572,0.0014452,0.0011329,0.0062927,-0.0063853,0.039032,-0.03214,0.003415,0.002796,0.0088753,-0.0060182,0.049711,-0.035975,0,0,0,-0.005333,0.01953,0,2.7445e-06,2.0095e-06,2.4687e-05,-0.007094,0.027498,-0.011537,5.5697e-05,3.8945e-05,0.00029098,-0.0087066,0.035186,-0.0194,0.00038676,0.00029635,0.007333,-0.0029631,0.019359,-0.024572,0.0014425,0.0011309,0.01376,-0.0013332,0.028299,-0.032065,0.0033594,0.0027571,0.019911,0.0012664,0.036587,-0.035042,0,0,0,-0.0022664,0.0046511,0,0,0,0,-0.0031147,0.006692,0,0,0,0,-0.0040339,0.0093238,0,0.40622,74,74,40,988,3,3,3,0.645
24,-0.005165,0.02507,0.036627,-0.9815,0.0015032,-1.9426,0.97926,-0.023115,2.4466,-0.0062569,3.3323,0.0002219,0.46806,2.4375,0.0368,3.0431,0.0030989,0.98158,0.078463,0.036122,0.026953,0.021388,0.21641,0.29326,0.41468,0.039401,0.0089605,0.0055172,0.021775,0.3308,0.23788,0.078813,37.388,783.89,1717,3128.6,5667.5,0.15795,0.087033,0.15795,0.27182,0.3895,0.16778,0.24046,0.028993,23,179.65,3543,5.4036e+05,4.3924,20.533,95661,10638,2403,0.91643,0.93981,0.32977,0.22779,0.21191,0.9285,30678,21300,0.00056023,0.00034246,0,0.069111,0,0.080562,0.00054032,0.0041898,0.0043093,0.014574,5.7707,6.8326,1.224,0.21172,0.24429,0.43848,0.1368,0.16603,0.684,0.12274,0.15015,0.71657,57.667,11.839,12743,24120,22147,0.012497,0.0098098,0.0050761,0.047534,0.037816,0.010106,0.10333,0.084837,0.015517,0.18344,0.15534,0.021967,0.28543,0.24899,0.029141,0.0056856,0.0049389,0.061833,0.016895,0.051851,-0.050121,0.011196,0.00976,0.057944,0.020141,0.068759,-0.063453,0.017917,0.015646,0.055346,0.023141,0.084392,-0.076214,0.0016247,0.0012476,0.038025,0.0050009,0.039852,-0.047928,0.0031921,0.0024581,0.034129,0.0051845,0.049685,-0.059765,0.0049062,0.0038008,0.030466,0.0047315,0.059274,-0.069032,0.0037485,0.0034475,0.084475,0.017643,0.029711,-0.024051,0.0068807,0.00642,0.078016,0.020427,0.040243,-0.025427,0.010693,0.0099881,0.075332,0.023647,0.049479,-0.030292,0.00031232,0.00024381,0.064435,0.0053205,0.022721,-0.032818,0.0011243,0.00088269,0.074621,0.0090054,0.03195,-0.039568,0.0023469,0.001878,0.076828,0.012138,0.041486,-0.046586,0.34826,74,74,40,988,3,3,3,0.645
24,-0.00458,0.022023,0.031978,-0.98386,0.0015488,-1.9436,0.97548,-0.22844,3.2885,-0.022194,3.2852,2.367e-05,0.80974,4.5148,0.032102,6.0401,0.0061508,0.98393,0.055194,0.023343,0.019451,0.016633,0.26324,0.29772,0.38497,0.030489,0.0038563,0.0028095,0.016911,0.42397,0.25359,0.055522,65.721,4412.3,6753.7,5148.1,16380,0.22359,0.24434,0.24434,0.42359,0.47502,0.19823,0.22648,0.025186,52,77.154,1734,72866,5.0842,29.468,46818,25596,7020,0.9155,0.93999,0.29863,0.20982,0.20888,0.81612,51033,24350,0.0010217,0.00040206,0,0.06784,0,0.074265,0.010655,0.010484,0.016825,0.001029,0.91416,0.9827,0.61769,0.25497,0.2795,0.30329,0.29809,0.32195,0.21889,0.32701,0.31595,0.20198,37.974,8.1888,11419,24324,22893,0.11973,0.10571,0.052756,0.37091,0.37726,0.085543,0.59082,0.61315,0.09625,0.75602,0.77663,0.098212,0.86217,0.87807,0.095489,0.00072155,0.00060005,0.0085126,-0.0053679,0.030571,-0.030575,0.002628,0.0022182,0.014754,-0.0038405,0.044255,-0.036488,0.0057455,0.0049221,0.019253,-0.0018735,0.05695,-0.0426,0.00071827,0.00059771,0.018236,-0.0010824,0.025729,-0.030343,0.0025774,0.0021822,0.029893,0.0028062,0.038919,-0.035319,0.0055162,0.0047587,0.037159,0.0067993,0.051814,-0.039743,3.28e-06,2.3374e-06,8.0186e-05,-0.005856,0.01501,-0.012734,5.0609e-05,3.603e-05,0.00062248,-0.007356,0.020592,-0.014988,0.00022931,0.00016337,0.0017525,-0.0084644,0.025127,-0.020239,0,0,0,-0.0025801,0.015111,0,0,0,0,-0.0035457,0.01911,0,0,0,0,-0.0045921,0.022982,0,0.41402,74,74,40,988,3,3,3,0.645
24,-0.004967,0.024432,0.035188,-0.98223,0.002148,-1.934,0.969,-1.4592,9.2707,-0.026985,3.1795,0.0024911,1.1578,6.1605,0.035252,9.6659,0.0098431,0.98235,0.073956,0.039107,0.031269,0.025878,0.25115,0.27677,0.40116,0.032159,0.0075324,0.0052474,0.025977,0.40405,0.23697,0.077182,57.32,1040.4,1891,2059.4,5048.9,0.48404,0.41045,0.48404,0.26753,0.86193,0.23557,0.2418,0.027275,50,111.86,1844,1.0442e+05,3.7452,18.253,49788,28539,17388,0.91249,0.93493,0.25207,0.17646,0.16045,0.69059,43627,25140,0.00096702,0.00049477,0,0.06368,0,0.068844,0.0014925,0.0087757,0.0049905,0.0070444,1.5002,3.153,1.0214,0.25773,0.28848,0.27893,0.28606,0.32377,0.19478,0.29151,0.33542,0.19473,37.344,7.5311,9042.8,23064,20951,0.17784,0.15729,0.1056,0.41398,0.38973,0.12867,0.63334,0.62483,0.13905,0.79805,0.79534,0.13972,0.9104,0.91107,0.13589,0.008831,0.0079156,0.14041,0.037499,0.058803,-0.042856,0.018036,0.016321,0.13647,0.047582,0.078487,-0.051021,0.028795,0.025969,0.13004,0.055196,0.095444,-0.063645,0.003081,0.0027671,0.10542,0.017864,0.033486,-0.027341,0.0075885,0.0069539,0.11861,0.027957,0.050563,-0.030691,0.013322,0.01212,0.12094,0.035768,0.066169,-0.040875,0.0052042,0.0046025,0.17146,0.03242,0.046771,-0.035315,0.0098637,0.0087759,0.1635,0.039402,0.059754,-0.042411,0.01514,0.013485,0.15594,0.045136,0.069775,-0.050048,0.00054584,0.00054602,0.16464,0.013546,0.01708,3.4426e-05,0.0010512,0.0010183,0.102,0.0099618,0.018379,-0.0038174,0.0014827,0.0014078,0.070958,0.0073461,0.021912,-0.0070579,0.44311,74,74,40,988,3,3,3,0.645
24,-0.0055758,0.027134,0.039106,-0.98023,0.0023565,-1.9305,0.9694,0.57762,7.0187,0.082015,3.1276,0.0035084,1.3375,6.7408,0.039289,11.886,0.012103,0.98033,0.085313,0.033829,0.027022,0.022291,0.23235,0.22817,0.45754,0.047834,0.006684,0.004697,0.022732,0.3743,0.1369,0.14013,22.682,1350,2254,2652.4,6279.8,0.42817,0.33748,0.42817,0.56323,1.0482,0.28469,0.25854,0.035252,52,69.596,1515,79085,4.6071,22.831,40905,37584,8100,0.91753,0.94283,0.25817,0.17575,0.19042,0.7916,36944,21532,0.0015525,0.00051687,0,0.050005,0,0.064813,0.017389,0.0069333,0.029148,0.005584,0.52096,2.2141,2.9925,0.26821,0.25135,0.28105,0.35412,0.2061,0.14667,0.35812,0.19551,0.12732,35.9,7.5883,9328.6,18540,16588,0.23615,0.23243,0.09545,0.58287,0.61664,0.12331,0.74568,0.77748,0.11143,0.83606,0.85912,0.099629,0.91411,0.9275,0.092869,0.0050268,0.0039217,0.0544,0.013935,0.062974,-0.067015,0.009382,0.0073977,0.048317,0.015059,0.081322,-0.082434,0.015179,0.012183,0.046657,0.017486,0.098031,-0.096415,0.0010339,0.00079787,0.024079,0.0010621,0.038524,-0.040268,0.003052,0.0024049,0.03247,0.0046048,0.054042,-0.052316,0.0063386,0.005123,0.039168,0.0089143,0.069786,-0.064726,0.0039928,0.0031239,0.089539,0.019112,0.049918,-0.056299,0.0063374,0.0049985,0.071503,0.018195,0.060623,-0.06459,0.0088972,0.0071058,0.062373,0.01815,0.068644,-0.071837,0,0,0,-0.0024688,0.0090051,0,0,0,0,-0.0033928,0.013124,0,7.8364e-06,5.9139e-06,0.00025527,-0.0043389,0.017879,-0.012557,0.38835,74,74,40,988,3,3,3,0.645
24,-0.0027805,0.016337,0.022154,-0.98885,0.0038146,-1.8885,0.90984,-0.26039,3.1252,-0.12184,3.2615,6.5633e-06,0.61753,4.3122,0.020468,6.2393,0.0063536,0.98975,0.13099,0.085828,0.071229,0.060104,0.32275,0.22795,0.33147,0.037413,0.01277,0.0099666,0.057683,0.48234,0.098245,0.0036406,46.855,417.45,566.63,460.5,1492,0.15161,0.18997,0.18997,0.50344,0.56374,0.26063,0.18085,0.017979,58,33.862,1255,28111,6.7137,48.546,33885,8073,4266,0.92026,0.94547,0.15318,0.10124,0.1176,0.62419,29524,14138,0.0011317,0.00039482,0,0.050154,0,0.07453,0.013244,0.06763,0.014108,0.19264,0.19223,2.0371,1.7293,0.26199,0.25458,0.29245,0.36324,0.22142,0.11541,0.3628,0.21099,0.099541,22.426,7.8963,9022.7,13664,12241,0.21237,0.20551,0.053209,0.63133,0.66094,0.082792,0.8144,0.83772,0.075438,0.87916,0.89522,0.06494,0.9081,0.91912,0.057188,0.0095349,0.0092155,0.063963,0.026589,0.062309,-0.016779,0.02093,0.02089,0.066815,0.036929,0.085267,-0.0012609,0.03408,0.034323,0.064936,0.044008,0.10461,0.0056591,0.008432,0.0083005,0.12173,0.03939,0.058146,-0.0073313,0.018393,0.018749,0.1213,0.052267,0.080079,0.011937,0.029823,0.030701,0.11423,0.060921,0.098723,0.021879,0.00053766,0.00045125,0.0074738,-0.0017982,0.025699,-0.023873,0.0015471,0.0013242,0.01082,-0.00080938,0.034648,-0.027172,0.0030773,0.0026721,0.013372,0.00041185,0.042184,-0.032492,0.0005652,0.00046374,0.071928,0.0090997,0.029095,-0.022545,0.0016821,0.0014103,0.068865,0.01186,0.036189,-0.033576,0.0033579,0.002842,0.067803,0.01507,0.044176,-0.04035,0.40452,74,74,40,988,3,3,3,0.645
24,-0.0061572,0.030045,0.043627,-0.97792,0.0021703,-1.9312,0.97481,0.81023,3.857,0.14999,3.1924,0.00041892,0.78036,3.7196,0.043926,5.1035,0.0051971,0.97801,0.086231,0.041037,0.032565,0.026693,0.20076,0.27007,0.44584,0.041948,0.0082726,0.0058134,0.027289,0.29545,0.21005,0.10737,32.016,929.05,1594.3,1931.1,4487.1,0.14274,0.31498,0.31498,0.3939,0.50797,0.24881,0.26325,0.033153,56,37.875,1177,26121,6.2956,43.9,31779,7155,6885,0.91785,0.94358,0.13577,0.091989,0.08534,0.5939,21308,13004,0.00076949,0.00040819,0,0.11202,0,0.13356,0.038367,0.20301,0.077406,0.47244,2.3096,1.0137,0.86134,0.22761,0.26982,0.34075,0.17831,0.29763,0.37695,0.16936,0.30036,0.40261,25.562,9.2004,10560,16853,15519,0.16542,0.14264,0.044235,0.40814,0.36106,0.057124,0.59288,0.54615,0.058615,0.73186,0.69558,0.057698,0.8339,0.80859,0.056049,0.018866,0.019605,0.13508,0.060984,0.086568,0.022743,0.040177,0.041416,0.13689,0.081439,0.11452,0.023392,0.066293,0.068837,0.13481,0.098845,0.13973,0.035687,0.0041602,0.0041267,0.064099,0.017701,0.041643,-0.0020388,0.0078003,0.007602,0.054903,0.019298,0.0533,-0.0080783,0.012097,0.011818,0.049453,0.020893,0.065179,-0.0087674,0.011676,0.012313,0.17322,0.05407,0.067884,0.02579,0.02753,0.029282,0.2055,0.083692,0.095109,0.040763,0.048412,0.052258,0.22453,0.1117,0.11958,0.063459,0.00303,0.0031652,0.41155,0.059145,0.057722,0.011591,0.0076689,0.0079624,0.33508,0.06567,0.071221,0.012869,0.013151,0.014023,0.28341,0.071384,0.085834,0.026883,0.40515,74,74,40,988,3,3,3,0.645
24,-0.0028129,0.016632,0.022747,-0.98855,0.0038195,-1.8903,0.91219,0.24251,3.2414,0.072742,3.2462,7.1249e-05,0.49971,3.3777,0.021844,4.6073,0.0046918,0.98906,0.13138,0.085203,0.068788,0.057956,0.30162,0.29039,0.2873,0.039091,0.014708,0.0099564,0.056933,0.46935,0.23216,0.0013538,39.37,285.23,527.27,448.92,1301.5,0.12275,0.20057,0.20057,0.40424,0.67511,0.20044,0.18861,0.015511,44,56.932,1562,65263,5.1033,28.826,42174,20007,3564,0.91663,0.94173,0.20554,0.14321,0.089225,0.84703,39143,16161,0.00080708,0.00036398,0,0.051877,0,0.0722,0.0011593,0.01714,0.0010897,0.03091,0.415,1.0818,0.38059,0.25866,0.25845,0.3034,0.33724,0.23419,0.20086,0.34491,0.23222,0.18795,34.692,8.1918,15317,26184,25307,0.13268,0.1151,0.038978,0.36223,0.35578,0.055701,0.57945,0.59524,0.062938,0.72879,0.74827,0.063123,0.83832,0.85366,0.061905,0.0017093,0.0013628,0.013445,-0.00064685,0.034734,-0.037569,0.0037225,0.0031296,0.013934,-0.00054305,0.050387,-0.039661,0.006389,0.0054599,0.014274,-0.00040606,0.064542,-0.044465,0.0013443,0.0010714,0.022756,0.0026568,0.035369,-0.032622,0.0027214,0.0022869,0.021045,0.0027781,0.048255,-0.033284,0.0044404,0.0037922,0.019943,0.0028527,0.06041,-0.036998,0,0,0,-0.004781,0.0089522,0,1.7004e-05,1.179e-05,0.00013944,-0.0060986,0.014282,-0.01791,0.00013582,0.00010319,0.00069209,-0.0071262,0.018804,-0.02049,0.00036494,0.00029136,0.054458,0.0056258,0.026738,-0.018896,0.00099388,0.00083779,0.04771,0.006416,0.035377,-0.021353,0.0019385,0.0016622,0.045897,0.0078519,0.044167,-0.024289,0.38702,74,74,40,988,3,3,3,0.645
24,-0.0026253,0.019033,0.024269,-0.98778,0.007502,-1.8088,0.83119,0.48571,3.6142,0.08595,3.2421,0.00029209,0.5662,3.8984,0.021056,5.4587,0.0055587,0.98945,0.19482,0.13156,0.10935,0.092214,0.31982,0.20413,0.30664,0.048612,0.018389,0.014691,0.087719,0.49342,0.070245,5.1497e-05,26.293,182.99,240,184.31,634.15,0.12783,0.16469,0.16469,0.53342,0.58385,0.24585,0.18249,0.013708,64,52.547,2419,90975,7.6179,59.974,65313,5643,4968,0.91812,0.94159,0.16081,0.10845,0.11539,0.57432,23642,13396,0.0012603,0.00051228,0,0.044619,0,0.046336,0.000664,0.021721,0.0032814,0.05452,2.6157,1.3185,1.4623,0.2504,0.24662,0.28447,0.28203,0.19291,0.13215,0.29382,0.18394,0.11822,19.114,7.6806,7967.6,15379,14054,0.35296,0.34825,0.13533,0.7435,0.76797,0.14921,0.86099,0.88226,0.12206,0.90142,0.91783,0.1019,0.92955,0.94136,0.089588,0.0086195,0.008102,0.088491,0.029058,0.05665,-0.026458,0.019089,0.018235,0.093258,0.040869,0.078354,-0.026082,0.032212,0.031174,0.093931,0.050911,0.098197,-0.023388,0.0023466,0.0022312,0.051844,0.0095264,0.036688,-0.013438,0.0069427,0.0067372,0.07007,0.0198,0.053809,-0.011434,0.014208,0.013969,0.083285,0.03111,0.072326,-0.0086224,0.0062729,0.0058707,0.13344,0.032355,0.040864,-0.022792,0.012174,0.011519,0.1303,0.040516,0.053503,-0.023731,0.01813,0.0173,0.12057,0.044885,0.062955,-0.023502,0,0,0,-0.0024032,0.016724,0,2.4195e-05,1.8939e-05,0.0015159,-0.0030435,0.021221,-0.014665,0.00013199,0.00010565,0.0040787,-0.003374,0.025114,-0.014604,0.45668,74,74,40,988,3,3,3,0.645
