172.86117  
166.033006  
148.3118375  
92.27337416  
14.52281865  
5563.866069  
67773.89113  
15726.46009  
828.9947488  
75005.03142  
23744.35406  
15128.81482  
54848.3025  
3079.604444  
11151.42013  
3554.94681  
10460.57883  
21530.0866  
7049.273529  
25341.30135  
5520.751856  
18742.22317  
30755.69815  
7942.867161  
178.8802907  
3709.717191  
2357.013938  
9451.068547  
2581.617507  
10162.49773  
1606.818602  
3486.938143  
5873.78959  
1728.618593  
849.8557054  
142.0080574  
76.30821263  
2308.052989  
2869.58572  
629.9031284  
3649.22798  
3473.585255  
2931.79086  
806.8173013  
2810.248324  
1991.655246  
4373.580336  
2263.513945  
1842.24908  
466.1343576  
152.5907669  
1309.415555  
4997.627947  
435.3393148  
522.0907415  
117.4331212  
11.45360442  
292.2212911  
76.97222419  
376.2050181  
363.5847574  
329.054144  
558.73942  
119.3925425  
28.53380753  
233.6296241  
23.16182954  
135.4082724  
152.3929511  
61.28771446  
7.670247996  
28.7152059  
4.497370162  
0.6061074291  
34.06945926  
8.268950683  
22.55467265  
19.26042445  
8.290591552  
5.960988342  
3.209310493  
7.967549991  
3.213589449  
4.56907511  
5.332603107  
7.314265113  
7.153783554  
5.82012972  
4.956294737  
4.476957787  
4.366323426  
4.390503749  
3.857460014  
3.845099889  
3.911767912  
3.483530129  
3.370271806  
3.360775404  
3.127363248  
2.999831554  
2.891897011  
2.800443191  
2.609272784  
2.507469727  
2.430839313  
2.319932617  
2.23731467  
2.145015262  
2.060517274  
1.978062196  
1.893642981  
1.829839547  
1.757320773  
1.689648507  
1.629237805  
1.567282429  
1.509503224  
1.455541057  
1.403358853  
1.352243624  
1.303805803  
1.2578919  
1.215312207  
1.172830096  
1.13223151  
1.093778592  
1.056883468  
1.021686556  
0.9874232128  
0.9548511101  
0.9237710325  
0.8935891249  
0.8648116439  
0.8372824994  
0.8106673864  
0.7850698575  
0.7606381767  
0.7370526494  
0.7143920242  
0.6924972375  
0.6714802308  
0.6512698532  
0.6317619954  
0.6129964938  
0.594932482  
0.5774996592  
0.5607060066  
0.5444921222  
0.5288627609  
0.5137718003  
0.4992215948  
0.4851651009  
0.4716031471  
0.4585003292  
0.4458349263  
0.4336071674  
0.4217803322  
0.4103500154  
0.3992991558  
0.3886173064  
0.3782741038  
0.3682660753  
0.3585891984  
0.3492110883  
0.3401374818  
0.3313442856  
0.3228341801  
0.3145881394  
0.3066043968  
0.2988572461  
0.291358441  
0.284073199  
0.277010191  
0.270160791  
0.2635280086  
0.2570846067  
0.2508353531  
0.2447628544  
0.2388750223  
0.2331504699  
0.2275945478  
0.2222029797  
0.2169614068  
0.2118728888  
0.2069208774  
0.2021165911  
0.1974395753  
0.1928944838  
0.1884715801  
0.1841805229  
0.1799940149  
0.175933237  
0.1719737004  
0.1681304265  
0.164383213  
0.1607389434  
0.1571859691  
0.1537298415  
0.1503653438  
0.1470903073  
0.1438982342  
0.1407917395  
0.1377559759  
0.1348040424  
0.1319301354  
0.1291284914  
0.1263943934  
0.123730886  
0.1211363268  
0.1186007723  
0.1161328562  
0.1137242874  
0.1113720873  
0.1090801079  
0.1068442123  
0.1046637981  
0.10253296  
0.1004535473  
0.09842331852  
0.09644327961  
0.09450956657  
0.09261646875  
0.09077355118  
0.08897023606  
0.08721469045  
0.08549450085  
0.08381722399  
0.0821771609  
0.08057483321  
0.0790084683  
0.07747695448  
0.07598168233  
0.07452341035  
0.07309020322  
0.07169403335  
0.07032515758  
0.06898727686  
0.06768517807  
0.06640182794  
0.06515303554  
0.06392685994  
0.06273390343  
0.06156374217  
0.06041431682  
0.05929425499  
0.0581977079  
0.05712584671  
0.05607558993  
0.05504277081  
0.05403777083  
0.05305119723  
0.05208780022  
0.05114093864  
0.05021575007  
0.04930807775  
0.04842287463  
0.04755082706  
0.04669952135  
0.04586437882  
0.04504693895  
0.04424698617  
0.04346253556  
0.04269192178  
0.04193863829  
0.04119865297  
0.04047583286  
0.03976433183  
0.03906981876  
0.0383877537  
0.03771737516  
0.03706407575  
0.03641933525  
0.03578782381  
0.03517099587  
0.03456532573  
0.0339701702  
0.03338581791  
0.03281456261  
0.03225371499  
0.03170414678  
0.03116444681  
0.03063229272  
0.03011417462  
0.02960366695  
0.0291014576  
0.02860981843  
0.02812836776  
0.02765428562  
0.02719015661  
0.02673444494  
0.02628739058  
0.02584598242  
0.02541763102  
0.02499163779  
0.02457632298  
0.02416753762  
0.02376776648  
0.02337239709  
0.0229855816  
0.0226067761  
0.02223293361  
0.02186510591  
0.02150521696  
0.02115359351  
0.02080675004  
0.02046507828  
0.02013047824  
0.01980311855  
0.01947940794  
0.01916058866  
0.01884797926  
0.01854232364  
0.01824100921  
0.01794368089  
0.01765235896  
0.01736514689  
0.01708416407  
0.01680848719  
0.01653574307  
0.01627015979  
0.01600752581  
0.01574956235  
0.01549584323  
0.01524628692  
0.01500071752  
0.01475985572  
0.01452263066  
0.01428947509  
0.01406006562  
0.01383545223  
0.01361319842  
0.01339525349  
0.01318125322  
0.01297069639  
0.01276388186  
0.01256064429  
0.01235976077  
0.01216271008  
0.01196736187  
0.01177811826  
0.01159086856  
0.01140596026  
0.01122483958  
0.01104497993  
0.01086993846  
0.01069758464  
0.01052669185  
0.01036018347  
0.01019518896  
0.010034767  
0.009875052391  
0.009718135345  
0.009563434974  
0.009411812324  
0.009262887055  
0.009118377676  
0.008972941916  
0.008831335426  
0.008689755418  
0.008553561571  
0.008418536214  
0.008284635913  
0.008153443743  
0.008024681458  
0.007897518438  
0.007773519381  
0.007649912022  
0.007529661356  
0.00741079711  
0.007293878954  
0.007178071575  
0.007065145496  
0.006953594213  
0.006843359665  
0.006736389049  
0.006629344572  
0.006525259782  
0.006422988308  
0.006321952832  
0.006220960545  
0.006123236205  
0.00602808396  
0.005932713574  
0.005839085637  
0.005747272163  
0.005656312862  
0.005567956162  
0.005480705763  
0.005394640675  
0.005309878793  
0.00522714707  
0.005144318996  
0.005064776074  
0.004985084009  
0.004907094354  
0.00483039387  
0.004755259431  
0.004680846242  
0.004608241879  
0.004536035364  
0.004466094857  
0.004395997061  
0.004327963594  
0.004261374738  
0.004194728571  
0.004130470777  
0.004066591154  
0.004003810119  
0.003942557409  
0.003881795768  
0.003823335766  
0.003764265653  
0.003706314759  
0.003650761968  
0.003594871756  
0.003539925869  
0.003486865046  
0.003434441805  
0.003382976548  
0.00333213336  
0.003282351859  
0.003233965653  
0.003185694805  
0.0031384372  
0.003092290374  
0.003046876716  
0.003002751518  
0.002958810502  
0.0029163525  
0.002874480828  
0.002833516448  
0.002793714919  
0.002753730366  
0.002715189598  
0.002677484601  
0.002639862144  
0.00260381145  
0.002568020928  
0.002533501033  
0.002499805062  
0.002466115955  
0.002433413355  
0.002401982573  
0.002371355135  
0.002340196802  
0.00231036526  
0.002281549976  
0.002253123942  
0.002225364501  
0.002198796981  
0.002172329256  
0.002146793473  
0.002122059277  
0.002097677454  
0.002074159507  
0.002051474837  
0.00202897227  
0.002007687314  
0.001986661892  
0.001966306545  
0.001946213859  
0.001927617705  
0.001909066346  
0.001891016672  
0.00187420741  
0.001857931062  
0.001840814638  
0.001826094099  
0.001811482236  
0.001797375799  
0.001783938731  
0.001770281212  
0.001758447068  
0.001746653156  
0.001735330046  
0.001724706806  
0.001714587749  
0.001705318043  
0.001696296321  
0.001688191265  
0.001680582649  
0.001673523951  
0.001667003549  
0.001660437348  
0.001655232631  
0.001650492045  
0.001645853198  
0.001642610576  
0.001639416875  
0.001637336025  
0.001634670275  
0.001633407978  
0.001632678319  
0.001631852114  
