900.8377751  
963.625815  
1099.759063  
1376.008326  
1568.800575  
3104.939567  
35740.60917  
16802.91469  
34946.94043  
15537.65193  
23570.90638  
666.5075207  
31839.98587  
11164.71795  
45883.48501  
19745.78306  
6669.047047  
1134.234718  
21609.83476  
2521.237379  
4691.056985  
16684.33863  
2510.966961  
34950.10795  
16394.51484  
7244.236353  
19223.93883  
57.57576955  
2550.758615  
8595.124284  
2496.415038  
16096.60699  
1308.119974  
4659.194175  
3117.086562  
123.6001445  
4326.877318  
2742.110155  
1344.072671  
11005.99498  
97.48339779  
3870.359594  
916.2686519  
984.3130939  
1776.556957  
1557.317597  
14289.34044  
674.1187929  
32.32992035  
3160.218994  
302.9822682  
957.0628119  
6130.948888  
1783.07104  
2430.776867  
1192.320617  
300.986736  
3171.415813  
1176.65194  
219.5933141  
2935.921004  
554.620055  
734.5615973  
93.63690142  
81.08377231  
19.0088105  
361.7415333  
34.07648412  
50.99425116  
104.5841738  
29.37667844  
27.3458009  
56.53442545  
48.33875505  
15.69880199  
17.08560937  
9.230345767  
6.814235111  
12.9543468  
6.78966605  
5.027664187  
5.749406184  
5.272928154  
5.739086121  
6.154525172  
5.283988502  
5.785612935  
6.29483913  
5.47265628  
5.976353322  
5.466677529  
5.126071404  
5.036678527  
4.765022488  
4.498719414  
4.46875445  
4.268006997  
4.09153025  
3.92931781  
3.783473798  
3.713928236  
3.65836637  
3.541595847  
3.441716642  
3.363354784  
3.290766403  
3.196950233  
3.127549307  
3.056397068  
2.986200123  
2.918638767  
2.849168107  
2.786009958  
2.724071334  
2.660202314  
2.601681904  
2.545221637  
2.49382711  
2.440524948  
2.39104225  
2.343978137  
2.295979294  
2.250782859  
2.209247623  
2.165214856  
2.125177977  
2.086796236  
2.04785749  
2.010646364  
1.97473301  
1.938973492  
1.90510885  
1.872248666  
1.839464249  
1.808362612  
1.778107191  
1.748291224  
1.719740147  
1.691738027  
1.664548714  
1.638164485  
1.612396093  
1.587279728  
1.562827972  
1.538841978  
1.515620356  
1.493071257  
1.470818594  
1.449366804  
1.428269017  
1.407701133  
1.387685666  
1.368155632  
1.349028453  
1.330390422  
1.31214311  
1.294351743  
1.276915527  
1.259926227  
1.243301671  
1.227019012  
1.211064665  
1.195519255  
1.180293499  
1.165351604  
1.150778028  
1.136541002  
1.122577939  
1.108856564  
1.095438622  
1.082321967  
1.069461237  
1.056869702  
1.044510894  
1.032383729  
1.020527993  
1.00887377  
0.9974900187  
0.9863183191  
0.9753631973  
0.9645905224  
0.9540564207  
0.9436863292  
0.9335287403  
0.9235664687  
0.9137666756  
0.9041463483  
0.8947126236  
0.8854426875  
0.8763458907  
0.8674174703  
0.858655985  
0.8500583395  
0.8415625111  
0.833244198  
0.8250764135  
0.8170383387  
0.8091464609  
0.8013752231  
0.7937484895  
0.7862742868  
0.7788961575  
0.7716407159  
0.7645251128  
0.757497386  
0.7506116985  
0.7438252694  
0.7371623899  
0.7305829109  
0.7241341049  
0.7177927677  
0.711538844  
0.7053759718  
0.6992931035  
0.6933187606  
0.6875046436  
0.6816880258  
0.6760055116  
0.670420492  
0.6648774699  
0.6594518027  
0.6540899085  
0.6488223551  
0.6436223801  
0.6385062069  
0.6334785138  
0.6285169913  
0.6236190409  
0.6187892696  
0.6140496314  
0.609376486  
0.6047361299  
0.6002188655  
0.5957324466  
0.5912794416  
0.5869594986  
0.5826826689  
0.5784244861  
0.5742758315  
0.5701617055  
0.5660935442  
0.5620882883  
0.5581597971  
0.554251574  
0.5504186789  
0.5466421307  
0.5429004489  
0.5392272388  
0.5355862219  
0.5319933274  
0.5284691963  
0.5249757929  
0.5215331542  
0.5181285708  
0.5148080568  
0.5114643088  
0.508228455  
0.5049836329  
0.5018102319  
0.4986747487  
0.4955745815  
0.492500837  
0.4894901241  
0.4865197228  
0.4835578148  
0.4806573169  
0.4777849968  
0.4749640886  
0.4721722231  
0.4693983931  
0.4666804975  
0.4639918931  
0.4613442395  
0.4587075489  
0.4560784927  
0.4535498724  
0.4510269388  
0.4485156108  
0.4460395071  
0.4436248269  
0.4411927609  
0.4388479513  
0.4364708434  
0.4341639402  
0.4318311458  
0.4296070182  
0.4273563822  
0.42514032  
0.4229540674  
0.4207958685  
0.4186834049  
0.4165529501  
0.4144741357  
0.4124133761  
0.41038138  
0.4083643862  
0.4063668125  
0.4044397004  
0.4025058179  
0.4005802592  
0.3986768097  
0.3968041069  
0.3949223432  
0.3931062505  
0.3913050741  
0.3895133913  
0.387742667  
0.3860091601  
0.3842708853  
0.3825500393  
0.3808784353  
0.3792054146  
0.3775521561  
0.3759207978  
0.3743283394  
0.3727238105  
0.371152569  
0.3695859082  
0.3680495377  
0.3665432506  
0.3650426259  
0.3635490674  
0.3620776874  
0.3606146326  
0.3591756486  
0.3577504092  
0.3563444654  
0.3549735175  
0.3535966243  
0.352251323  
0.3508897169  
0.3495584956  
0.3482491861  
0.346955942  
0.3456842455  
0.3443931256  
0.3431702429  
0.3419072229  
0.3406887003  
0.3394896026  
0.3382666458  
0.3370988841  
0.3359284531  
0.3347673688  
0.3336225108  
0.3324863179  
0.331364946  
0.3302606762  
0.3291707665  
0.3280898981  
0.3270222149  
0.3259505404  
0.3249234344  
0.3238714786  
0.3228572882  
0.3218573148  
0.320873314  
0.3198716041  
0.3188888722  
0.3179325772  
0.3169611341  
0.3160494729  
0.3151022067  
0.314183588  
0.3132781296  
0.3123837269  
0.3114802706  
0.3106103833  
0.3097635225  
0.3088854449  
0.3080244451  
0.3071898956  
0.3063708439  
0.3055614681  
0.3047492503  
0.3039338408  
0.3031603295  
0.3023829009  
0.3016058153  
0.3008492649  
0.3001107615  
0.2993583451  
0.2986305658  
0.2978974567  
0.2971854197  
0.2964779748  
0.2957675308  
0.2950948592  
0.2944207471  
0.2937388706  
0.2930699364  
0.2924342854  
0.2917687667  
0.2911632757  
0.2904991475  
0.2898786129  
0.2892739919  
0.2886634386  
0.2880408546  
0.287483051  
0.2868941836  
0.2863240591  
0.2857447184  
0.285195809  
0.2846445842  
0.2841033167  
0.2835481261  
0.2830323636  
0.282509554  
0.281990813  
0.2814889786  
0.2810056351  
0.2805156608  
0.2800087035  
0.2795378634  
0.2790671896  
0.2785965283  
0.2781450424  
0.2776875864  
0.2772596968  
0.2768279888  
0.2763848055  
0.2759850418  
0.27556687  
0.2751639623  
0.2747380029  
0.274353722  
0.2739492307  
0.2735895635  
0.2732126085  
0.2728432913  
0.272470719  
0.2721030255  
0.2717677244  
0.2714118334  
0.2710826396  
0.2707472903  
0.2704301793  
0.2701124427  
0.2697948226  
0.269499283  
0.2691905993  
0.2689044001  
0.2686177456  
0.2683316616  
0.2680593999  
0.2677870654  
0.2675207543  
0.2672821717  
0.2670258795  
0.2667794437  
0.2665418387  
0.26629542  
0.2660791216  
0.2658450552  
0.265638495  
0.2654284538  
0.2652276595  
0.2650070717  
0.2648427859  
0.2646407404  
0.2644681043  
0.2642933192  
0.2641096988  
0.2639593366  
0.2637875359  
0.2636453288  
0.2634877224  
0.2633600647  
0.2632154215  
0.2630787348  
0.2629549015  
0.2628526581  
0.2627311788  
0.2626344619  
0.2625125211  
0.2624266013  
0.262335525  
0.2622479946  
0.2621711851  
0.2620971773  
0.2620166611  
0.261983942  
0.2619146193  
0.2618577295  
0.2618044193  
0.2617556911  
0.2617326706  
0.2616941379  
0.2616712984  
0.2616675847  
0.2616451955  
0.2616354371  
0.2616699176  
