0.7441781765  
0.5833567894  
0.782831619  
8.946857009  
68.22902703  
2798.447661  
42208.95356  
27284.83766  
20747.36924  
31056.49084  
8094.577148  
14568.45971  
5731.689723  
18205.54534  
25962.72781  
37039.56112  
9845.741444  
13104.04386  
1665.79111  
6379.189568  
26338.35743  
16463.91984  
1674.098776  
15520.84172  
11125.02241  
149.9246265  
19395.70718  
1355.897377  
788.7487588  
8181.948056  
3668.740547  
1332.602103  
8591.875336  
2869.321993  
614.4892375  
22014.71314  
834.900707  
2137.157441  
1780.249068  
5950.705113  
3344.790774  
8302.690163  
3011.542125  
7636.175187  
4982.592922  
4435.441082  
2279.607803  
5079.160611  
3110.410142  
3355.428475  
3836.976497  
1959.538694  
4042.609982  
2847.824267  
175.7653833  
1243.359104  
2414.317587  
707.9533905  
886.1586372  
78.05992873  
121.0892473  
1387.84365  
1323.073404  
3865.110269  
617.3161807  
11.74367969  
388.983191  
154.3585602  
56.47014529  
21.03339071  
62.54934146  
11.08047913  
91.05247967  
1.24996977  
20.00600056  
15.15086101  
3.16716741  
17.3488078  
9.721265943  
5.823635347  
6.144936671  
6.828608412  
6.060291087  
4.205294894  
4.158101176  
3.018826686  
3.969616273  
2.951347081  
2.626894027  
2.496387833  
2.86597272  
2.272087853  
2.132016692  
1.849647003  
1.899066008  
1.824414984  
1.788766404  
1.524785026  
1.547870239  
1.495164039  
1.400393364  
1.345367547  
1.235701444  
1.212564821  
1.139918749  
1.093638297  
1.041652386  
0.9974563339  
0.9625696374  
0.9128033228  
0.8710308783  
0.833232624  
0.7987700976  
0.7655333218  
0.7356663477  
0.7020855308  
0.6763404878  
0.6488252915  
0.6249208166  
0.5991984846  
0.5776481189  
0.5542339245  
0.5343376613  
0.5144461258  
0.4953464563  
0.4776353339  
0.4604826517  
0.4442908883  
0.428790681  
0.4138951377  
0.3996782829  
0.3860377344  
0.373267789  
0.3607812887  
0.3489478582  
0.33752739  
0.3266825798  
0.3161701156  
0.3061599573  
0.2965762084  
0.2873571433  
0.2785008357  
0.2699992806  
0.2618148497  
0.2539653703  
0.2464058081  
0.2391226199  
0.2321487807  
0.2254104119  
0.2189209123  
0.2126871164  
0.2066686123  
0.2008654284  
0.1952911884  
0.1898811515  
0.1846968122  
0.1796836838  
0.1748460218  
0.1701631117  
0.1656373634  
0.1612798947  
0.1570648489  
0.1529915858  
0.1490485113  
0.1452427216  
0.1415540423  
0.137996717  
0.1345290549  
0.1312034029  
0.1279640401  
0.1248319872  
0.1217960977  
0.1188574088  
0.1160150601  
0.1132565889  
0.1105741701  
0.1079833042  
0.1054566525  
0.1030164101  
0.1006459638  
0.09835129309  
0.09612608068  
0.09394596582  
0.09184885089  
0.08979915488  
0.08781361028  
0.08588529946  
0.08401696273  
0.08219086987  
0.08041407071  
0.07869262586  
0.07702084465  
0.0753863976  
0.07380192749  
0.07225565275  
0.07075962705  
0.0693041742  
0.06787716207  
0.06649046087  
0.06514131154  
0.06383208065  
0.062555194  
0.06130597198  
0.06009226456  
0.05890728417  
0.057755639  
0.05663298583  
0.05554038545  
0.05447246193  
0.05343097  
0.05242359876  
0.05142429906  
0.05045684365  
0.04951399642  
0.0485947922  
0.04770040349  
0.04681999172  
0.04596560732  
0.04513131465  
0.04431642871  
0.04351377825  
0.04274235687  
0.04197995046  
0.04123549976  
0.04051393739  
0.03980399137  
0.03911985818  
0.03843866323  
0.0377777714  
0.03713259864  
0.03649832436  
0.03587987236  
0.0352827573  
0.03468774526  
0.03411215789  
0.03354554756  
0.03299068228  
0.03245305868  
0.03192188489  
0.03140434064  
0.03089540621  
0.03040554439  
0.02991916689  
0.02943990548  
0.02897720454  
0.02851848105  
0.02807441465  
0.027634595  
0.02720999334  
0.02679257074  
0.02637927858  
0.02597822022  
0.02558316429  
0.02519939947  
0.02482246135  
0.02444908757  
0.02408978922  
0.02373270518  
0.02338006734  
0.02303620926  
0.02270505205  
0.02237410445  
0.0220515139  
0.02173729631  
0.02142902799  
0.02112227839  
0.02082356057  
0.02053066818  
0.02024778456  
0.01996388835  
0.01968777845  
0.0194136985  
0.01914636643  
0.01888978426  
0.018630916  
0.01838032697  
0.01813464375  
0.0178925185  
0.01765567263  
0.01742002511  
0.01719192425  
0.01697025004  
0.01674560596  
0.01652929912  
0.01631545748  
0.01610555236  
0.01590296129  
0.01570210086  
0.01550467355  
0.01530933943  
0.01511460557  
0.01492741078  
0.01474064259  
0.01456253738  
0.01438501445  
0.01421013662  
0.01403766986  
0.01386755461  
0.01369792513  
0.01353594468  
0.01337581162  
0.01321975436  
0.01306436946  
0.01291248173  
0.01275847036  
0.01261032139  
0.01246963723  
0.01232554363  
0.01218495292  
0.0120484965  
0.01191217267  
0.01177775333  
0.01164804839  
0.01151881575  
0.01139061284  
0.01126722897  
0.01114370688  
0.01102484869  
0.01090573319  
0.01078944619  
0.0106737762  
0.01056127951  
0.01045131765  
0.01033990008  
0.01023282669  
0.01012817208  
0.01002116366  
0.009918711017  
0.009817905489  
0.009718608126  
0.00961980147  
0.009525909152  
0.009431213151  
0.009337176886  
0.00924416302  
0.009153494236  
0.009066575067  
0.00897618547  
0.008890226116  
0.00880451559  
0.008722098626  
0.00863972458  
0.008559386558  
0.008478885059  
0.00840026496  
0.008322775936  
0.008246876001  
0.008171872244  
0.008097577814  
0.008025843514  
0.007955913457  
0.007884755868  
0.00781459445  
0.007746691012  
0.00767888722  
0.007613270214  
0.00754624355  
0.007482691823  
0.00742173633  
0.007358379232  
0.007295441117  
0.007234635579  
0.007176898622  
0.007118801938  
0.007061073702  
0.007003727248  
0.006947499929  
0.006892206655  
0.006839282915  
0.006785689913  
0.00673046089  
0.006680366793  
0.006627755451  
0.006579657201  
0.006529212881  
0.006480488245  
0.006431999912  
0.006385095613  
0.006336630971  
0.006294383529  
0.0062482284  
0.006202615  
0.006157670667  
0.006115303035  
0.00607289607  
0.006031455302  
0.00599104797  
0.005948146607  
0.005909090639  
0.005871269192  
0.005832293576  
0.005794212032  
0.005756974402  
0.005720488119  
0.005682726298  
0.005648322834  
0.005611481988  
0.005578470138  
0.005543388695  
0.005509257984  
0.005478011085  
0.005444732067  
0.005411642318  
0.005380456546  
0.005348591583  
0.005321088243  
0.005288565378  
0.005261012803  
0.005230964437  
0.005202988822  
0.005173692212  
0.005146428273  
0.005121027318  
0.005094467287  
0.005066777214  
0.005040690385  
0.005014847083  
0.004990996239  
0.004966613441  
0.004941929674  
0.004918500277  
0.004895106078  
0.004873496211  
0.004851100466  
0.004830095064  
0.004807248427  
0.004786675384  
0.004763777416  
0.004744534335  
0.004723232614  
0.004704255106  
0.004684695261  
0.004666705235  
0.004648107673  
0.004629868444  
0.00461181175  
0.004595333414  
0.004578919155  
0.004560854096  
0.004545429586  
0.00452906318  
0.004512614393  
0.004498618025  
0.004482679191  
0.004468363604  
0.004452857618  
0.004440132208  
0.004428536848  
0.004412711189  
0.004402588871  
0.004387969671  
0.004375280537  
0.00436453371  
0.004351360037  
0.00434068001  
0.004329643777  
0.004318375733  
0.004307405734  
0.004299515563  
0.004287323231  
0.004278561054  
0.004270347137  
0.004259301125  
0.004251566707  
0.004243615353  
0.004235434122  
0.004228055609  
0.004221069474  
0.004212964562  
0.004207230525  
0.004197538002  
0.004193468674  
0.004186767945  
0.004181616892  
0.004175278205  
0.004170068325  
0.004165768418  
0.004162204305  
0.004157453933  
0.004152976219  
0.004148989451  
0.004145925844  
0.004142931181  
0.00413960576  
0.00413662651  
0.004136021278  
0.004133724676  
0.004132113597  
0.004129361326  
0.004129439947  
0.004126827442  
0.004126953077  
0.004125551795  
0.004126528311  
