0.3064312684  
0.2294951915  
0.1669130665  
0.1379013035  
0.1586543083  
0.2407978692  
0.3902106978  
0.6063402538  
0.8820751994  
1.204236582  
1.554651402  
1.911739936  
2.252470604  
2.554495492  
2.798234312  
2.968686678  
3.056766411  
3.06001224  
2.982612726  
2.834739938  
2.631312626  
2.390339572  
2.131048172  
1.872026407  
1.629579836  
1.416469886  
1.241142008  
1.107484987  
1.015106576  
0.9600314197  
0.935711525  
0.9341833627  
0.9472301892  
0.9673809662  
0.9886522844  
1.006943683  
1.020064074  
1.027428926  
1.029487092  
1.027001049  
1.020312802  
1.008722068  
0.9901008215  
0.9608179269  
0.9160068094  
0.850144237  
0.7578601484  
0.6348605531  
0.4788044959  
0.2899985409  
0.07178061107  
-0.1694828947  
-0.424792958  
-0.6832669238  
-0.9331306218  
-1.162810151  
-1.361978748  
-1.522420878  
-1.638610014  
-1.70797001  
-1.730824499  
-1.710096072  
-1.650841751  
-1.559715571  
-1.444434533  
-1.313308892  
-1.174819003  
-1.037256829  
-0.9083718445  
-0.795002622  
-0.7026686158  
-0.6351448313  
-0.5940615727  
-0.578602017  
-0.585381876  
-0.6085925312  
-0.6404409672  
-0.6719005994  
-0.6937141659  
-0.6975459293  
-0.6771435956  
-0.6293381231  
-0.5547389185  
-0.4579829608  
-0.3474643248  
-0.2345479893  
-0.1323084415  
-0.05395030927  
-0.01108651814  
-0.01209988968  
-0.06081316985  
-0.1556816439  
-0.289631141  
-0.4506234537  
-0.6229000667  
-0.7887777902  
-0.9307713265  
-1.033771771  
-1.086979023  
-1.085315615  
-1.030117679  
-0.9289844854  
-0.7947990973  
-0.6440376454  
-0.4946037568  
-0.3634739381  
-0.2644843278  
-0.2065621277  
-0.1926317827  
-0.2193466555  
-0.2776698558  
-0.3542123462  
-0.4331536273  
-0.4984574365  
-0.5361130826  
-0.5360941787  
-0.4937748709  
-0.4106376424  
-0.2941766826  
-0.1570073038  
-0.01529668876  
0.1132948292  
0.2119068276  
0.2667344826  
0.268969806  
0.2161919763  
0.1130281317  
-0.0290090493  
-0.1925099599  
-0.3558983818  
-0.4957218585  
-0.5892643109  
-0.6171867608  
-0.5658893663  
-0.429320143  
-0.2099866485  
0.08095896363  
0.4246090897  
0.7960758419  
1.166970151  
1.508299662  
1.793458773  
2.000961793  
2.116616748  
2.134895792  
2.059357526  
1.902101752  
1.682336609  
1.42423671  
1.154339465  
0.8987718167  
0.6805931514  
0.5175258676  
0.4202912925  
0.3917011858  
0.4265935737  
0.5125922554  
0.631619448  
0.7619985915  
0.8809290992  
0.9670761191  
1.002993169  
0.9771097494  
0.8850482144  
0.7301198841  
0.5229165732  
0.2800482069  
0.02216375802  
-0.2285014231  
-0.4507440641  
-0.6268548856  
-0.744606901  
-0.7985231206  
-0.790283161  
-0.7282378279  
-0.6261306307  
-0.501222763  
-0.3721093556  
-0.2565303369  
-0.1694593792  
-0.1217135384  
-0.1192135932  
-0.1629231525  
-0.2494001628  
-0.3717780377  
-0.5209844329  
-0.6869549506  
-0.8596571817  
-1.029787798  
-1.189099281  
-1.330398781  
-1.447325611  
-1.534061238  
-1.585145653  
-1.595517677  
-1.560846463  
-1.478148513  
-1.346581921  
-1.16826576  
-0.9489168177  
-0.6981265653  
-0.4291282593  
-0.1579845946  
0.09775635577  
0.3208149564  
0.4961271609  
0.6127106631  
0.6651900288  
0.6547181833  
0.5891495042  
0.482378531  
0.352899041  
0.2217425918  
0.1100377076  
0.03649424821  
0.01512506279  
0.05349362495  
0.151704147  
0.3022590231  
0.4907921881  
0.697596844  
0.8997563217  
1.073631134  
1.197413861  
1.253478734  
1.230257962  
1.123468117  
0.9365634513  
0.6803931646  
0.3721180889  
0.03353009054  
-0.3110311062  
-0.636935843  
-0.9214428566  
-1.145576902  
-1.295532106  
-1.363473074  
-1.347690446  
-1.252163654  
-1.085617126  
-0.8602473028  
-0.5903002089  
-0.290699913  
0.02411647614  
0.3410287673  
0.6486783906  
0.9375441453  
1.199726989  
1.428554859  
1.618164158  
1.763191115  
1.858671998  
1.90022265  
1.884466313  
1.809657774  
1.676363405  
1.48805658  
1.251474507  
0.9766188327  
0.6763398981  
0.3654980463  
0.05979091952  
-0.2256322001  
-0.4775930083  
-0.6861686975  
-0.8456669529  
-0.9551621011  
-1.01853674  
-1.043993624  
-1.043102306  
-1.029482364  
-1.017261316  
-1.019477097  
-1.046595642  
-1.105303274  
-1.197709163  
-1.321034121  
-1.467850209  
-1.626822008  
-1.783903914  
-1.92385906  
-2.03193982  
-2.095546128  
-2.105676202  
-2.057996961  
-1.953411967  
-1.798043554  
-1.602626784  
-1.381377367  
-1.150445521  
-0.9261387437  
-0.7231029587  
-0.5526769575  
-0.4215999897  
-0.331239133  
-0.2774165605  
-0.250885827  
-0.2384045701  
-0.2243080596  
-0.1924092416  
-0.1280233445  
-0.01986638355  
0.1383796107  
0.3470590032  
0.6002345693  
0.8861380538  
1.188369067  
1.487704856  
1.764321491  
2.000141068  
2.180993746  
2.298297747  
2.350012776  
2.340706253  
2.28071425  
2.184499138  
2.068424533  
1.948278294  
1.836912494  
1.742349628  
1.666669718  
1.605844088  
1.55056232  
1.487925892  
1.403751645  
1.285133623  
1.122840782  
0.9131870931  
0.6590591884  
0.3699384954  
0.06090102792  
-0.2492540309  
-0.5404590363  
-0.7940546056  
-0.9952703267  
-1.135155919  
-1.211671826  
-1.229795638  
-1.200642012  
-1.139741838  
-1.064746642  
-0.9928969024  
-0.9386310217  
-0.9116689855  
-0.9158305304  
-0.9487482304  
-1.002482853  
-1.064933442  
-1.121824581  
-1.158964782  
-1.16445406  
-1.130507835  
-1.054656539  
-0.9401399865  
-0.7954584024  
-0.6331403857  
-0.4679111133  
-0.3145220749  
-0.1855603903  
-0.08953906064  
-0.02957597134  
-0.002834066941  
-0.0008487759893  
-0.0107059339  
-0.01692876232  
-0.003833987323  
0.04198898031  
0.1294018821  
0.261005121  
0.4322513532  
0.6315366349  
0.8413091928  
1.040064448  
1.204973057  
1.314798282  
1.352685424  
1.308444877  
1.179990626  
0.9737422001  
0.7039328934  
0.3909287694  
0.05882180459  
-0.2673571472  
-0.5644079611  
-0.8133352856  
-1.001037343  
-1.121128597  
-1.173888376  
-1.165421576  
-1.106268739  
-1.009725002  
-0.8901652296  
-0.7615985666  
-0.6366216595  
-0.5258107507  
-0.4375162767  
-0.3779365569  
-0.3512965906  
-0.3599819348  
-0.4044945935  
-0.4831910139  
-0.5918546499  
-0.7232139744  
-0.8666077508  
-1.007987059  
-1.13043741  
-1.215303062  
-1.243904188  
-1.199714183  
-1.070720666  
-0.8516547283  
-0.5457153892  
-0.1654473288  
0.2674637579  
0.723575417  
1.168184904  
1.564701504  
1.878500426  
2.080787115  
2.151978206  
2.0841412  
1.882165584  
1.563503095  
1.156489348  
0.6974633891  
0.2270360562  
-0.2140299873  
-0.5888424656  
-0.8678461952  
-1.031363476  
-1.070982201  
-0.9897067243  
-0.800941392  
-0.5265141042  
-0.1940328465  
0.1660927962  
0.5236081057  
0.8510560619  
1.125875913  
1.331808714  
1.459569578  
1.506821536  
1.477536656  
1.380914721  
1.23000482  
1.040202159  
0.8277747719  
0.6085340881  
0.3967397696  
0.2043013875  
0.04027572602  
-0.08933278351  
-0.1815214311  
-0.2360282968  
-0.2549462922  
-0.2422789267  
-0.2034987051  
-0.1451697343  
-0.07466547338  
2.063157278e-05  
0.07040655626  
0.1276381481  
0.1626843827  
0.1666842405  
0.1314937319  
0.05046654174  
-0.08057822536  
-0.2623044548  
-0.4908824089  
-0.7572862457  
-1.047072292  
-1.340805571  
-1.615222053  
-1.845127599  
-2.005869437  
-2.076144094  
-2.040780095  
-1.89311085  
-1.636554497  
-1.285115354  
-0.8626435133  
-0.4008648562  
0.06362935136  
0.4930834236  
0.8525121878  
1.113363905  
1.256447128  
1.273753798  
1.168960914  
0.956597883  
0.6600197792  
0.308501962  
-0.06613195643  
-0.4329135246  
-0.764729401  
-1.040590011  
-1.246952098  
-1.378026946  
-1.435144102  
-1.425373612  
-1.359669954  
-1.250868648  
-1.111807331  
-0.953841422  
-0.7858829265  
-0.6140380603  
-0.4417918968  
-0.2706178516  
-0.1008480254  
0.06740061022  
0.2334071244  
0.3952877691  
0.549767189  
0.6923040276  
0.8175216687  
0.9198541191  
0.994283853  
1.037042982  
1.046169582  
1.021827872  
0.9663692732  
0.8841248201  
0.780996421  
0.6639178027  
0.5402745479  
0.4173822423  
0.3020840505  
0.2005027857  
0.117950714  
0.05895251494  
0.02732467191  
0.02622943327  
0.0581332919  
0.1246390406  
0.2261563626  
0.3614743072  
0.5272744726  
0.7177163452  
0.9241742216  
1.135247983  
1.337098373  
1.514139318  
1.650060408  
1.729097848  
1.737443517  
1.664652708  
1.504896939  
1.257937427  
0.9296897816  
0.5323122357  
0.08376778281  
-0.3931333388  
-0.8721685994  
-1.32552293  
-1.725864153  
-2.048511223  
-2.273512879  
-2.387428442  
-2.384638479  
-2.26802481  
-2.048910203  
-1.746226113  
-1.384966212  
-0.9940365881  
-0.6037276934  
-0.2430599848  
0.0627288215  
0.2942588117  
0.4394624688  
0.4942639532  
0.4624521624  
0.3548167601  
0.1876892327  
-0.01889679095  
-0.2431925506  
-0.4636493726  
-0.660571134  
-0.8173916056  
-0.9215215304  
-0.9647708208  
-0.9434170042  
-0.8579970882  
-0.7129237596  
-0.5159954067  
-0.2778638541  
-0.01145863648  
0.2686226086  
0.5468023409  
0.8073098899  
1.035079828  
1.216729625  
1.341572355  
1.402545588  
1.396948358  
1.326855353  
1.199115835  
1.024869234  
0.8186061355  
0.5968377517  
0.3765284334  
0.1734815894  
0.0008784355784  
-0.131822577  
-0.2195060296  
-0.2614688131  
-0.260946078  
-0.2242298823  
-0.1595206747  
-0.07573101372  
0.01856995009  
0.1159130058  
0.2103019777  
0.2972014379  
0.3732051723  
0.4355235773  
0.4814504543  
0.5079721316  
0.511632008  
0.488719362  
0.4357599532  
0.350234987  
0.2313781188  
0.08089833122  
-0.0965376752  
-0.2931929935  
-0.498578887  
-0.7002170228  
-0.8847626932  
-1.039356622  
-1.153033352  
-1.217987109  
-1.230533603  
-1.191608479  
-1.106763029  
-0.98562389  
-0.8408973761  
-0.6870494038  
-0.5388178578  
-0.4097381285  
-0.3108640052  
-0.2498203462  
-0.2302820847  
-0.2519130848  
-0.3107513958  
-0.3999517756  
-0.5107688864  
-0.6336305512  
-0.7591502319  
-0.8789454435  
-0.9861578851  
-1.075633706  
-1.143781981  
-1.188182249  
-1.207057008  
-1.198760678  
-1.161423792  
-1.092866822  
-0.9908385228  
-0.8535768429  
-0.6806032263  
-0.4736082169  
-0.2372354735  
0.02043089597  
0.2878479399  
0.5505711215  
0.7924066097  
0.9970580783  
1.150088574  
1.240914911  
1.264526907  
1.222627032  
1.123976664  
0.9837862142  
0.8222056798  
0.6620499256  
0.5260549723  
0.4340513695  
0.4004461159  
0.4323951645  
0.528929674  
0.6811787662  
0.8736450914  
1.086336467  
1.297442534  
1.486139025  
1.635119361  
1.732487064  
1.772767349  
1.756943472  
1.691560291  
1.58711445  
1.456019127  
1.310497445  
1.160746924  
1.013643598  
0.8721635354  
0.7355641636  
0.6002489471  
0.4611351072  
0.3132639064  
0.1533678354  
-0.01886499437  
-0.2000549108  
-0.3830480902  
-0.5575133205  
-0.7111457266  
-0.8313094803  
-0.9068970208  
-0.9301296756  
-0.8980537573  
-0.8134921873  
-0.6853079466  
-0.5278943876  
-0.3599104306  
-0.2023845231  
-0.07637717952  
-0.0004635824129  
0.011652428  
-0.04688585002  
-0.1748205779  
-0.3624003686  
-0.5920150899  
-0.8398146706  
-1.078204146  
-1.278929703  
-1.416442533  
-1.471117073  
-1.431931464  
-1.298235925  
-1.080352289  
-0.7988636495  
-0.4826331099  
-0.1657430512  
0.1163094617  
0.3307033375  
0.4511702384  
0.4611795077  
0.3560008614  
0.143399754  
-0.1571709413  
-0.5167499896  
-0.90017612  
-1.27007921  
-1.591059128  
-1.833520201  
-1.976682581  
-2.01043702  
-1.935833176  
-1.764226064  
-1.515247216  
-1.213945276  
-0.8875059539  
-0.5620203393  
-0.2597058388  
0.003086662986  
0.2168986757  
0.3791698905  
0.4933467972  
0.5673025314  
0.611374029  
0.6363433745  
0.6516613576  
0.6641545263  
0.677355077  
0.6914964973  
0.7041089955  
0.711067543  
0.7078869919  
0.691037598  
0.6590631937  
0.613321414  
0.5582167271  
0.5008967343  
0.4504329563  
0.4165966892  
0.4083985781  
0.4325975121  
0.4923907295  
0.5864917151  
0.7087511888  
0.848398654  
0.9909222973  
1.119490272  
1.216762867  
1.266869759  
1.257300697  
1.180467855  
1.034727448  
0.8247283891  
0.5610411993  
0.2591148132  
-0.06228915137  
-0.3829886019  
-0.683338492  
-0.9460182558  
-1.157445911  
-1.308668462  
-1.395679075  
-1.419184798  
-1.383931706  
-1.297729356  
-1.170353114  
-1.01248003  
-0.8347824508  
-0.6472528921  
-0.4587782971  
-0.2769312871  
-0.1079344264  
0.04329116252  
0.1730361371  
0.2787241177  
0.3588515572  
0.4129554135  
0.4415609166  
0.4461143505  
0.4288639637  
0.3927021854  
0.3409761932  
0.2772989398  
0.2053978015  
0.1290091213  
0.05184443759  
-0.02240217475  
-0.09003654535  
-0.1473729981  
-0.1908299336  
-0.2171173438  
-0.223544366  
-0.208388004  
-0.171273031  
-0.1134826434  
-0.03809553971  
0.05009671582  
0.1449565196  
0.2396052707  
0.3272345838  
0.4019958296  
0.459832202  
0.4991191331  
0.5209718254  
0.5291604466  
0.5295931551  
0.529431677  
0.5359379817  
0.5552252694  
0.5910856814  
0.6440867482  
0.7110714879  
0.7851611808  
0.8562753596  
0.9121267074  
0.9395696247  
0.9261526921  
0.8616796392  
0.7395976256  
0.5580469336  
0.3204432457  
0.035516375  
-0.283204477  
-0.6184233841  
-0.9505197364  
-1.259265649  
-1.525647044  
-1.733595463  
-1.871463854  
-1.933081278  
-1.918276629  
-1.832797323  
-1.687621179  
-1.497719038  
-1.280381022  
-1.053281955  
-0.8325028452  
-0.6307357923  
-0.4559090356  
-0.3104233122  
-0.1911348721  
-0.09013938775  
0.003709318602  
0.1027075296  
0.217899051  
0.3567051261  
0.520942283  
0.7055831893  
0.8985176808  
1.081458533  
1.231959739  
1.326360499  
1.343277752  
1.267180672  
1.091493812  
0.8207285942  
0.4712204826  
0.07024481702  
-0.3464857925  
-0.7387128762  
-1.066433319  
-1.294973166  
-1.399630588  
-1.369188784  
-1.207758809  
-0.9346256703  
-0.582059792  
-0.1913694192  
0.1922899455  
0.5256102081  
0.7725514412  
0.9087026625  
0.9240096422  
0.8234988228  
0.6259614231  
0.3608358754  
0.06379744173  
-0.2282725564  
-0.4821928263  
-0.6725811962  
-0.7845976615  
-0.8150223752  
-0.7715970339  
-0.670847805  
-0.5347700089  
-0.3869680891  
-0.2488346659  
-0.1363506858  
-0.05797564829  
-0.01389155394  
0.003329872035  
0.006791445899  
0.01241481358  
0.03564561131  
0.08824941869  
0.1757343314  
0.2958073932  
0.4381215614  
0.5853883099  
0.7156860166  
0.8056517738  
0.8340709289  
0.7853527045  
0.6523569604  
0.4381607169  
0.156474875  
-0.1693678605  
-0.5087432549  
-0.8270886027  
-1.089849007  
-1.266502991  
-1.334148845  
-1.280211735  
-1.10392662  
-0.8164499117  
-0.4395911918  
-0.003384280952  
0.4571954917  
0.9059233389  
1.308966884  
1.638035289  
1.872700637  
2.001659613  
2.022879952  
1.942715251  
1.774218602  
1.534957506  
1.244691522  
0.9232255063  
0.5887098313  
0.2565385015  
-0.06112719131  
-0.3552778724  
-0.6195834467  
-0.8497362122  
-1.042800884  
-1.196742965  
-1.310215749  
-1.382609825  
-1.414302381  
-1.406972727  
-1.363862879  
-1.289840417  
-1.191207172  
-1.075229093  
-0.9494552719  
-0.8209302699  
-0.6954568877  
-0.5770305643  
-0.4675756884  
-0.3670177963  
-0.2736851578  
