-0.1855846429  
-0.2180923543  
-0.2421055679  
-0.2500406987  
-0.2364010769  
-0.1985605354  
-0.1372141311  
-0.05644310795  
0.03663039994  
0.1325495048  
0.2205267076  
0.2896338988  
0.3300436222  
0.3341874882  
0.2976948276  
0.2200069627  
0.104587273  
-0.04129512885  
-0.2071952585  
-0.3804653626  
-0.547455736  
-0.6948203506  
-0.8107690366  
-0.8861350737  
-0.9151483394  
-0.8958399218  
-0.8300561941  
-0.7231064883  
-0.583106019  
-0.4201086024  
-0.2451388759  
-0.06923227558  
0.09742289944  
0.2461591236  
0.3702834506  
0.4652896531  
0.5288481633  
0.5606094419  
0.5618865933  
0.535271458  
0.4842584819  
0.4129158557  
0.3256438973  
0.227016549  
0.1217062147  
0.01443787434  
-0.09004995479  
-0.1870956411  
-0.2722771591  
-0.3416614747  
-0.3921244594  
-0.4217011715  
-0.4299137145  
-0.4180020676  
-0.3889964385  
-0.347588882  
-0.299768538  
-0.2522498958  
-0.2117326093  
-0.1840825556  
-0.1735370986  
-0.182050212  
-0.2088841369  
-0.2505221154  
-0.3009466982  
-0.3522703369  
-0.3956440524  
-0.4223589111  
-0.4249755777  
-0.3983486735  
-0.3403949708  
-0.2524950201  
-0.1394695848  
-0.009116301541  
0.1286288431  
0.2628089977  
0.3826927712  
0.4789918421  
0.5448885729  
0.5767575854  
0.5744807171  
0.5413461991  
0.4835412317  
0.4093364452  
0.328064524  
0.249044354  
0.1805858425  
0.1291972211  
0.09908510781  
0.09199330256  
0.1073732862  
0.1428402681  
0.1948311852  
0.2593469366  
0.3326692005  
0.4119366817  
0.4954928028  
0.5829560317  
0.6749953571  
0.7728539246  
0.8776865639  
0.9898202076  
1.10806886  
1.22921371  
1.347764189  
1.456069137  
1.544797538  
1.603757408  
1.622966532  
1.593843689  
1.510367736  
1.370039945  
1.174510398  
0.9297744618  
0.6458859497  
0.3362154159  
0.01633269739  
-0.2973655676  
-0.5891101535  
-0.8451377903  
-1.054831011  
-1.211502051  
-1.312742328  
-1.360319544  
-1.359651113  
-1.318941032  
-1.248090325  
-1.157515397  
-1.057020744  
-0.9548396169  
-0.8569511337  
-0.7667330765  
-0.6849726706  
-0.610210402  
-0.5393670506  
-0.4685541936  
-0.3939607008  
-0.3127022545  
-0.2235182575  
-0.1272275177  
-0.02688112712  
0.07240598666  
0.1639341625  
0.2401461827  
0.2935172353  
0.3174935656  
0.3073690438  
0.2609812796  
0.1791412644  
0.06573360698  
-0.07252582344  
-0.2266636786  
-0.3862774142  
-0.5405372824  
-0.6792329732  
-0.7937483146  
-0.8778425249  
-0.9281441601  
-0.9443076807  
-0.9288130329  
-0.8864490511  
-0.8235593708  
-0.7471636766  
-0.6640739858  
-0.5801360079  
-0.4996865948  
-0.4252926591  
-0.357776345  
-0.296501476  
-0.2398382647  
-0.1857153516  
-0.1321551992  
-0.07770223971  
-0.02168989855  
0.0356868022  
0.09346496553  
0.1501440254  
0.2039786201  
0.2532749979  
0.2966336608  
0.333098665  
0.3622080444  
0.3839513394  
0.3986645961  
0.406897674  
0.4092946333  
0.4065087176  
0.3991637524  
0.3878720538  
0.3732799525  
0.3561314881  
0.337315679  
0.3178795961  
0.2989930867  
0.2818551126  
0.2675468487  
0.2568573534  
0.2500912561  
0.2469016656  
0.2461725956  
0.245986282  
0.2436936717  
0.2361062534  
0.2198049081  
0.1915481208  
0.1487431677  
0.08992307705  
0.01517093003  
-0.07358468327  
-0.1724666399  
-0.275780573  
-0.3764100486  
-0.4664536086  
-0.5380506864  
-0.5843169904  
-0.6002627348  
-0.58357552  
-0.5351443652  
-0.4592244078  
-0.3631887137  
-0.256859156  
-0.1514651376  
-0.05833654344  
0.01253170207  
0.05386110567  
0.06225222615  
0.03895390759  
-0.009875878626  
-0.07350105109  
-0.1375287811  
-0.1853637434  
-0.2000587063  
-0.1663652393  
-0.07275439998  
0.08684264701  
0.3118069063  
0.5943001553  
0.9195337094  
1.266845179  
1.611494638  
1.926982341  
2.187634687  
2.371156532  
2.460857651  
2.447300371  
2.329193264  
2.113446844  
1.814417253  
1.452437369  
1.05182828  
0.6386118638  
0.2381692321  
-0.1269242801  
-0.4386932661  
-0.6850340026  
-0.860375534  
-0.9656932625  
-1.007905861  
-0.998726902  
-0.9530937298  
-0.8873357314  
-0.8172646688  
-0.7563863676  
-0.7144202953  
-0.6963036076  
-0.7017937342  
-0.7257293601  
-0.7589356524  
-0.7896657647  
-0.8054094768  
-0.7948294075  
-0.7495736172  
-0.6656979991  
-0.5444992058  
-0.3926130808  
-0.2213528503  
-0.04534702936  
0.1193427884  
0.2573709892  
0.3562314241  
0.4080445097  
0.4107501802  
0.3685108711  
0.2912522279  
0.1933702231  
0.09176437036  
0.003451632063  
-0.05692149538  
-0.07932190003  
-0.06000528103  
-0.002371486738  
0.08315249802  
0.1802282749  
0.2686087801  
0.3267884669  
0.334981077  
0.2780258085  
0.1478382347  
-0.05494686687  
-0.3203941528  
-0.6298729161  
-0.9578212749  
-1.274487422  
-1.549334471  
-1.754680387  
-1.869119381  
-1.880262435  
-1.78643037  
-1.597055958  
-1.331727693  
-1.017987193  
-0.688170831  
-0.3756985676  
-0.111293729  
0.08039907396  
0.1833974241  
0.1918938217  
0.1105728405  
-0.0462313372  
-0.2563691047  
-0.4924451678  
-0.7248081166  
-0.9246383447  
-1.066834688  
-1.132452272  
-1.110482232  
-0.998843172  
-0.8045058439  
-0.5427376382  
-0.2355305137  
0.09065652634  
0.4076359227  
0.6884377808  
0.9101577914  
1.056383692  
1.118909999  
1.098524463  
1.004752806  
0.8545839703  
0.6703271231  
0.4768748356  
0.2987300474  
0.1571766615  
0.06797115973  
0.03984085746  
0.07395782406  
0.1644292603  
0.2996782538  
0.4644852661  
0.6423597103  
0.8178746553  
0.9786268345  
1.116546909  
1.228399576  
1.315443264  
1.38235987  
1.435667567  
1.481913103  
1.52596107  
1.569670867  
1.611189527  
1.644970465  
1.662505769  
1.65366241  
1.608377036  
1.518447219  
1.379108147  
1.190148429  
0.9563742757  
0.6873490536  
0.3964499844  
0.09938462946  
-0.1875972209  
-0.4495310563  
-0.6743336053  
-0.8539500024  
-0.9849096015  
-1.068250137  
-1.108872494  
-1.114463039  
-1.094183686  
-1.057345302  
-1.012254071  
-0.9653816559  
-0.9209347897  
-0.8808311564  
-0.8450157478  
-0.8120153011  
-0.7795898241  
-0.7453623304  
-0.7073140664  
-0.664088695  
-0.6150847957  
-0.5603637912  
-0.5004381922  
-0.4360073756  
-0.3677242038  
-0.2960421457  
-0.2211749852  
-0.1431709984  
-0.06206352278  
0.02193683715  
0.1082752175  
0.195946013  
0.2834812746  
0.3690375763  
0.4505641638  
0.5260128043  
0.5935493459  
0.6517202337  
0.6995389334  
0.7364894991  
0.7624402296  
0.7775072691  
0.7818955738  
0.7757633593  
0.7591420073  
0.7319254065  
0.6939361319  
0.6450439987  
0.5853009373  
0.5150658097  
0.4350734479  
0.3464347341  
0.2505673339  
0.1490692226  
0.04357633377  
-0.06436375999  
-0.1733614811  
-0.2821773816  
-0.3896430303  
-0.4945257034  
-0.5953825821  
-0.6904578784  
-0.7776615595  
-0.85466854  
-0.9191385691  
-0.9690302033  
-1.0029561  
-1.020511093  
-1.022487676  
-1.010922157  
-0.9889317659  
-0.960342707  
-0.9291607398  
-0.8989599004  
-0.8723029647  
-0.8503018171  
-0.8324114154  
-0.8165137163  
-0.7993010222  
-0.7769009762  
-0.7456592556  
-0.7029365633  
-0.647788695  
-0.5814071349  
-0.5072240322  
-0.4306523257  
-0.3584826781  
-0.2980198123  
-0.2560760543  
-0.2379815345  
-0.2467477342  
-0.2825177776  
-0.3423764645  
-0.4205537763  
-0.5089776292  
-0.5981011994  
-0.6778804464  
-0.7387688923  
-0.7726172706  
-0.7733690046  
-0.7375068693  
-0.6642352482  
-0.5554139427  
-0.4152946042  
-0.2501071223  
-0.06754956742  
0.1237857636  
0.315018652  
0.4976116178  
0.6639944681  
0.8081628259  
0.9261983124  
1.016653254  
1.080732381  
1.122204799  
1.14701543  
1.162591098  
1.176901411  
1.197365311  
1.229755256  
1.277256276  
1.33983004  
1.414005426  
1.493153002  
1.568222992  
1.628866728  
1.66478907  
1.667145807  
1.629799946  
1.550252549  
1.430135911  
1.27518422  
1.094701591  
0.9005736416  
0.7059547537  
0.5237773903  
0.3652575484  
0.2385791611  
0.1479099646  
0.0928780338  
0.06859420726  
0.0662366769  
0.07416222824  
0.07943966151  
0.06963173567  
0.03462059383  
-0.03176075905  
-0.1305263533  
-0.2569544878  
-0.400751915  
-0.5470088747  
-0.6778723362  
-0.7747651891  
-0.8208936971  
-0.8037165298  
-0.7170418021  
-0.5624331496  
-0.3496981975  
-0.09632966349  
0.1740739535  
0.4342520425  
0.6562979865  
0.8148717341  
0.8901927424  
0.8704250189  
0.7531387509  
0.545660939  
0.264273794  
-0.06763248011  
-0.4222034024  
-0.77022737  
-1.084311569  
-1.341739546  
-1.52667388  
-1.631458126  
-1.656889767  
-1.611473612  
-1.5097904  
-1.370228091  
-1.212399725  
-1.054605938  
-0.9116831364  
-0.7935174403  
-0.7043937488  
-0.6432322226  
-0.6046141489  
-0.5803884514  
-0.5615618655  
-0.5401343599  
-0.5105670386  
-0.4706422791  
-0.4215832112  
-0.3674446666  
-0.3139125831  
-0.2667626741  
-0.2302828939  
-0.2059767331  
-0.1918018294  
-0.1821103992  
-0.1683172354  
-0.1401965646  
-0.08758557814  
-0.002203598005  
0.1207292829  
0.2813541109  
0.4747155909  
0.6910613597  
0.9168509205  
1.136313923  
1.333306018  
1.493177483  
1.604383679  
1.659624786  
1.656383418  
1.59684556  
1.487282994  
1.337042987  
1.157350227  
0.9601160775  
0.7569220129  
0.558290468  
0.3732792317  
0.2093666986  
0.0725421459  
-0.03251969025  
-0.1023194861  
-0.1345203718  
-0.1281136804  
-0.08374260142  
-0.004118681914  
0.1055812776  
0.2374709854  
0.3809840595  
0.5232551618  
0.6498922576  
0.7460843461  
0.7979442895  
0.793924461  
0.7261217513  
0.5912870859  
0.3913942911  
0.133675302  
-0.1698940289  
-0.5036064581  
-0.8494067377  
-1.188480166  
-1.502861534  
-1.776878905  
-1.998289505  
-2.159013089  
-2.255426547  
-2.288254659  
-2.262120811  
-2.184869142  
-2.066764197  
-1.919652336  
-1.756155189  
-1.588914909  
-1.429892168  
-1.289692502  
-1.176909246  
-1.097484064  
-1.054116605  
-1.045798906  
-1.067556314  
-1.110504159  
-1.16229504  
-1.207997579  
-1.231383904  
-1.216533719  
-1.149594318  
-1.020491417  
-0.824367825  
-0.5625343303  
-0.2427783137  
0.1210502704  
0.5101639668  
0.9025557494  
1.275112157  
1.605872017  
1.876152457  
2.072288026  
2.186782933  
2.218763898  
2.173705281  
2.062505507  
1.900066622  
1.703586205  
1.490781359  
1.278268005  
1.080262096  
0.9077072758  
0.7678733495  
0.6643878978  
0.5976142786  
0.565263468  
0.5631050615  
0.5856669222  
0.6268375419  
0.6803343395  
0.7400245033  
0.8001407815  
0.8554332473  
0.9013108814  
0.9340134434  
0.9508212312  
0.9502880672  
0.9324520522  
0.8989594253  
0.8530380858  
0.7992693656  
0.7431439509  
0.6904239741  
0.6463771235  
0.6149901646  
0.5982795846  
0.5958273111  
0.6046328085  
0.6193344265  
0.6327910041  
0.6369655334  
0.623977146  
0.5871834915  
0.5221237969  
0.4271842849  
0.3038868644  
0.1567550293  
-0.007210696929  
-0.1793659006  
-0.3504320106  
-0.5115262765  
-0.6550565148  
-0.7753636236  
-0.8690299803  
-0.9348426897  
-0.9734533727  
-0.9868268158  
-0.9775985408  
-0.9484685836  
-0.901736607  
-0.8390484646  
-0.7613803735  
-0.6692328717  
-0.5629772163  
-0.4432664117  
-0.3114287903  
-0.1697625815  
-0.02168990083  
0.1282566023  
0.2745967114  
0.4111952056  
0.5316266137  
0.629586303  
0.6992946723  
0.7358839828  
0.7357434706  
0.6968190995  
0.6188686543  
0.5036547463  
0.3550685118  
0.1791570355  
-0.01597513073  
-0.2204204743  
-0.4229010106  
-0.6113938612  
-0.7739320155  
-0.8995428803  
-0.9792579031  
-1.007093422  
-0.9808914713  
-0.9028940164  
-0.7799453731  
-0.6232313303  
-0.4475322222  
-0.2700074968  
-0.1086163433  
0.01966682148  
0.1006327958  
0.1243907011  
0.08647207213  
-0.01167253017  
-0.1628678506  
-0.3550873338  
-0.572893392  
-0.7992460365  
-1.017431909  
-1.212845606  
-1.37438858  
-1.495315634  
-1.573438478  
-1.610718903  
-1.61234791  
-1.585510763  
-1.538052193  
-1.477268968  
-1.409012627  
-1.33722768  
-1.263948408  
-1.189710128  
-1.114239188  
-1.037256099  
-0.9591930219  
-0.8816675688  
-0.807594544  
-0.7408970875  
-0.6858570715  
-0.6462251938  
-0.6242545131  
-0.6198576826  
-0.630067065  
-0.6489328062  
-0.6679299329  
-0.6768495535  
-0.6650620261  
-0.6229812188  
-0.5435031293  
-0.4231827101  
-0.2629579025  
-0.0682813752  
0.1513853737  
0.3836550531  
0.6147359661  
0.8311608701  
1.021476809  
1.177637738  
1.29589442  
1.377051326  
1.426058056  
1.451008917  
1.461709953  
1.468040097  
1.478359807  
1.498210834  
1.529494841  
1.570253348  
1.615064792  
1.655992821  
1.683928688  
1.690121259  
1.66766103  
1.612694944  
1.52519966  
1.409199586  
1.272410093  
1.125362694  
0.9801407015  
0.8489118395  
0.7424519166  
0.668862454  
0.6326314292  
0.6341507316  
0.6697278267  
0.7320658654  
0.8111388881  
0.8953426036  
0.9727734065  
1.032505404  
1.065721655  
1.066603303  
1.032898209  
0.9661337709  
0.8714650228  
0.7571832515  
0.6339304196  
0.5136872072  
0.4086093  
0.3298053692  
0.2861486254  
0.2832184617  
0.3224706848  
0.4007285594  
0.5100669503  
0.6381531836  
0.769054238  
0.8845062949  
0.965554174  
0.9944451656  
0.9565961818  
0.8424121255  
0.6487366388  
0.3797183841  
0.04693103013  
-0.3313311649  
-0.7315648596  
-1.127245038  
-1.491454661  
-1.79965718  
-2.032262698  
-2.176664241  
-2.228468104  
-2.191753755  
-2.078314235  
-1.90597605  
-1.696219611  
-1.471420121  
-1.252085914  
-1.054471189  
-0.8888887732  
-0.7589483313  
-0.6618011404  
-0.5893363256  
-0.5301193237  
-0.4717587185  
-0.4033329503  
-0.3174914314  
-0.2119194959  
-0.08994522417  
0.03979357939  
0.1645587033  
0.2694135597  
0.3395172438  
0.3624834821  
0.3304415651  
0.2415099835  
0.1004602645  
-0.0815313812  
-0.2880124794  
-0.4991137657  
-0.6938881094  
-0.8528167148  
-0.9601495485  
-1.005784856  
-0.9864607204  
-0.9061399542  
-0.7755763538  
-0.6111606443  
-0.4332258669  
-0.2640363233  
-0.1257000793  
-0.03821456339  
-0.01780860619  
-0.0756757294  
-0.2171395523  
-0.4412352085  
-0.7406694371  
-1.10209903  
-1.506701753  
-1.931012086  
-2.348029655  
-2.728613001  
-3.043158722  
-3.263543413  
-3.365245647  
-3.329514473  
-3.145374536  
-2.811234252  
-2.335840098  
-1.738367317  
-1.047495284  
-0.2994681473  
0.4647510933  
1.202955929  
1.875432013  
2.448500591  
2.897432329  
3.208370178  
3.379013482  
3.418018408  
3.343224053  
3.178991063  
2.953049344  
2.693299459  
2.424989057  
2.168598366  
1.938640677  
1.743426397  
1.585688688  
1.463852639  
1.373657859  
1.30980461  
1.267346743  
1.242612085  
1.233536517  
1.239417376  
1.260191134  
1.29542826  
1.343276336  
1.399595001  
1.457479552  
1.507295737  
1.537257282  
1.534485641  
1.486390882  
1.382181059  
1.21427723  
0.9794274825  
0.6793895931  
0.3210981077  
-0.08367006171  
-0.5190638412  
-0.9662332756  
-1.404584771  
-1.813084801  
-2.1715074  
-2.461573168  
-2.667946983  
-2.779095938  
-2.788018635  
-2.692835523  
-2.497222543  
-2.210626312  
-1.848183529  
-1.430256514  
-0.981514863  
-0.5295209825  
-0.1028673461  
0.2710397634  
0.5683487417  
0.7710295013  
0.8687551563  
0.8601180972  
0.7529577267  
0.5636925818  
0.3156662793  
0.03666644382  
-0.2440914179  
