264.69377  
298.3405  
352.8245001  
397.8982054  
1232.191231  
14900.56635  
31274.5226  
91676.4077  
60735.18988  
13567.32655  
75228.18193  
25790.06468  
26801.12731  
18254.69561  
11833.70323  
3935.194731  
2046.787063  
15464.00418  
16343.16389  
1349.328441  
1609.248005  
5481.915883  
3236.389741  
3422.922299  
6.837021065  
3348.881861  
1320.021137  
11432.4775  
176.4027604  
3468.6996  
4153.723237  
1271.321641  
1702.020001  
507.130808  
3257.713535  
77.83031969  
1072.07865  
3473.109318  
4437.651467  
210.8844743  
1403.113842  
173.807244  
178.7874123  
1511.817102  
3237.481007  
1211.698728  
635.5506179  
105.325149  
1254.579974  
1562.703217  
4178.413882  
602.8792209  
513.9395394  
916.6711429  
8.043076358  
953.7682832  
10.56969239  
389.9247175  
23.95486161  
16.38441936  
1284.487254  
118.7443024  
93.32098378  
630.2419016  
312.764986  
137.0073348  
145.5879724  
9.85589961  
49.05975742  
7.348851744  
15.26120474  
5.859302585  
8.717750447  
5.924819956  
2.548687664  
5.441383416  
11.117386  
7.73457142  
5.104354409  
7.06145917  
6.652888524  
7.028728932  
6.185405979  
6.412268999  
5.175707904  
4.283417498  
5.375364706  
5.330177513  
4.481722375  
4.726372606  
4.464245145  
4.332944427  
4.217780919  
4.21904029  
4.2411827  
3.964678733  
3.950842753  
3.820498967  
3.734307015  
3.688968976  
3.587290729  
3.503018696  
3.420317529  
3.329299543  
3.292117578  
3.219022314  
3.155875338  
3.095863249  
3.042927061  
2.974523042  
2.914882364  
2.866608277  
2.808869726  
2.756963732  
2.709717843  
2.660530474  
2.60997276  
2.563086687  
2.519885051  
2.476733196  
2.434555477  
2.394875523  
2.354106551  
2.314345663  
2.277071488  
2.240549196  
2.204168537  
2.169461427  
2.1356081  
2.102239469  
2.070110425  
2.038627538  
2.007692687  
1.977880764  
1.948731154  
1.920112944  
1.892329389  
1.865075266  
1.838548455  
1.812557732  
1.787289073  
1.762512169  
1.738285964  
1.714687578  
1.691528516  
1.668901561  
1.646837547  
1.625188447  
1.604027201  
1.583287717  
1.563041109  
1.543195332  
1.5237469  
1.504738066  
1.486096922  
1.46785175  
1.449972888  
1.432464153  
1.415286049  
1.39846657  
1.381990958  
1.365819063  
1.349967798  
1.334421833  
1.319197625  
1.304231615  
1.289559566  
1.275171672  
1.261055016  
1.247201913  
1.233597523  
1.220256259  
1.20714703  
1.194273601  
1.181646071  
1.169234448  
1.157049272  
1.145074442  
1.133318147  
1.121756807  
1.110416391  
1.099270678  
1.088305971  
1.077519394  
1.066931452  
1.056520142  
1.04629181  
1.036222345  
1.026317456  
1.016587487  
1.007016978  
0.9975984098  
0.9883412619  
0.9792236586  
0.9702595786  
0.9614358464  
0.9527608917  
0.9442188235  
0.9358080488  
0.9275322491  
0.9193861347  
0.9113760562  
0.9034746863  
0.895707249  
0.8880461423  
0.8805133645  
0.8730886542  
0.8657695353  
0.8585772337  
0.8514797459  
0.8445054842  
0.8376292004  
0.8308504988  
0.8241623589  
0.8175799373  
0.8110853222  
0.8046982217  
0.798398691  
0.792197334  
0.7860730248  
0.7800399095  
0.7740873388  
0.7682275124  
0.7624438214  
0.7567391537  
0.7511316063  
0.7455863119  
0.7401217969  
0.7347407929  
0.7294155182  
0.724183767  
0.7190059723  
0.7139111083  
0.7088810122  
0.7039191198  
0.6990146581  
0.6941950894  
0.6894240002  
0.6847249316  
0.6800698644  
0.6755034356  
0.6709832854  
0.6665201651  
0.6621170685  
0.65777892  
0.6534791056  
0.649246413  
0.6450717301  
0.640945402  
0.6368772568  
0.6328561315  
0.6288876059  
0.6249785265  
0.6210951559  
0.6172777739  
0.6135066133  
0.6097748692  
0.6061043672  
0.6024713937  
0.5988860819  
0.5953356505  
0.5918425312  
0.588386534  
0.584973047  
0.5815988974  
0.578265263  
0.5749721768  
0.5717277537  
0.5685228123  
0.5653400912  
0.5622080892  
0.5591104201  
0.5560437644  
0.5530286163  
0.5500358239  
0.5470837033  
0.5441671345  
0.5412846884  
0.5384393653  
0.5356132596  
0.5328357598  
0.5300832104  
0.5273704429  
0.52468028  
0.5220233647  
0.519408282  
0.5168118144  
0.5142428743  
0.5117200274  
0.5092139232  
0.5067395744  
0.5042933156  
0.5018728236  
0.4994812049  
0.4971254106  
0.4947841519  
0.4924688374  
0.4901795365  
0.4879239085  
0.4856999535  
0.4834889869  
0.4813025441  
0.4791424277  
0.4770053148  
0.4749094584  
0.4728154765  
0.4707535258  
0.4687120814  
0.4667026237  
0.464705209  
0.4627316004  
0.4607829711  
0.4588472567  
0.4569508744  
0.4550611419  
0.4531941057  
0.4513542784  
0.44953024  
0.4477300663  
0.4459441777  
0.4441763363  
0.4424390794  
0.4407160729  
0.4390145921  
0.4373209248  
0.4356576113  
0.4340046319  
0.4323698617  
0.4307574976  
0.4291590195  
0.427584362  
0.4260255462  
0.4244798298  
0.4229566042  
0.421445767  
0.4199536887  
0.4184718538  
0.4170230106  
0.4155725755  
0.4141447537  
0.4127355457  
0.4113406064  
0.4099581026  
0.4085914123  
0.4072398924  
0.4059071289  
0.4045852206  
0.4032812187  
0.4019896521  
0.4007103745  
0.39945194  
0.3982078487  
0.3969666564  
0.3957465752  
0.3945371541  
0.3933431861  
0.3921677255  
0.3909966086  
0.3898404492  
0.3887093452  
0.3875827424  
0.3864586424  
0.3853575025  
0.3842722353  
0.3831957027  
0.3821304881  
0.3810788015  
0.380038578  
0.3790112186  
0.3779963469  
0.3769829055  
0.3759940325  
0.3750192194  
0.374045492  
0.3730801088  
0.3721338116  
0.3712063132  
0.3702703848  
0.3693581354  
0.3684594812  
0.3675640309  
0.3666784244  
0.3658118207  
0.3649548596  
0.3641044662  
0.3632630923  
0.3624324465  
0.3616209581  
0.3608087113  
0.3600059168  
0.3592236093  
0.3584380506  
0.3576699063  
0.3569095815  
0.3561683527  
0.355419676  
0.3546945763  
0.3539712711  
0.3532599546  
0.3525622362  
0.3518652713  
0.3511855928  
0.3505028154  
0.3498400279  
0.3491852873  
0.3485384519  
0.3478996919  
0.3472647397  
0.3466488357  
0.3460336033  
0.3454308812  
0.3448385789  
0.3442530694  
0.3436799556  
0.3431096583  
0.3425452324  
0.3419955316  
0.3414481324  
0.3409127006  
0.3403790618  
0.3398682774  
0.339352558  
0.338848373  
0.3383525692  
0.3378667175  
0.3373877566  
0.3369171819  
0.3364570019  
0.335998061  
0.3355470608  
0.3351071336  
0.3346749937  
0.334246414  
0.3338305181  
0.3334129201  
0.3330148251  
0.3326246478  
0.3322411632  
0.3318562721  
0.3314880718  
0.3311279163  
0.3307666627  
0.330415065  
0.3300727704  
0.3297325979  
0.3293988647  
0.3290820786  
0.3287641108  
0.328456083  
0.3281551178  
0.3278674987  
0.3275746246  
0.3272988218  
0.3270335806  
0.3267658438  
0.3265057953  
0.3262602475  
0.3260102402  
0.3257747148  
0.3255460062  
0.3253188396  
0.3251054462  
0.3248966865  
0.3246968088  
0.3244977726  
0.3243101628  
0.3241202574  
0.3239542756  
0.3237766273  
0.3236149723  
0.3234619682  
0.3233154404  
0.3231766001  
0.323037167  
0.3229077274  
0.3227874988  
0.3226690175  
0.3225633766  
0.3224605682  
0.3223608869  
0.322278204  
0.3221895971  
0.3221167522  
0.3220526575  
0.3219899318  
0.3219329592  
0.3218842934  
0.3218349124  
0.321802062  
0.3217718621  
0.3217545916  
0.3217353305  
0.3217214836  
0.3217201536  
