5755.867751  
5919.997979  
6318.3918  
7148.842086  
7275.537728  
929.9900877  
29175.74688  
31084.57842  
68790.11305  
42635.34558  
86167.67093  
1242.604305  
2365.229839  
7061.245991  
20953.3173  
869.6141846  
1251.182769  
1892.060626  
11569.79666  
1686.149094  
1644.676121  
4907.212772  
3389.56071  
268.1813183  
4517.636509  
132.8247809  
4855.883176  
49.26111962  
769.3749887  
2111.29971  
213.5064504  
2305.619078  
6813.978195  
3679.552302  
418.2067966  
14324.93184  
13360.06083  
666.4807133  
1912.606896  
901.438566  
1179.452243  
3310.076743  
3715.380576  
597.838095  
3181.219958  
1354.917223  
5970.184718  
1382.337553  
9978.375023  
480.0940439  
4732.299673  
970.1372513  
109.7897243  
1476.039852  
5925.22132  
4685.316491  
1685.038385  
3542.528576  
371.3496318  
5228.363623  
528.2202626  
4277.550503  
250.5162929  
2249.114068  
2634.229776  
1273.192271  
621.8251214  
518.8823736  
509.4156495  
553.0583538  
584.1261556  
478.9798927  
434.083116  
383.4803876  
377.0455594  
314.4136266  
304.9959362  
224.7316215  
262.7187519  
200.2488805  
205.3645342  
171.8494424  
153.2819461  
153.4412777  
132.1035823  
126.0894655  
112.8537033  
108.4832568  
100.3314488  
94.2790042  
86.53017257  
82.13850005  
76.73946577  
73.09425326  
68.91923422  
65.2935652  
61.49412162  
58.11954792  
55.04841463  
52.03706065  
49.25210915  
46.67515178  
44.62562177  
42.3801396  
40.23845134  
38.36672485  
36.66996321  
35.01620102  
33.44888186  
31.96814876  
30.56903513  
29.22556693  
27.95260097  
26.8000833  
25.72744087  
24.6405975  
23.67023181  
22.7069259  
21.81806758  
20.95404121  
20.15278127  
19.38816272  
18.65264851  
17.96729497  
17.29546137  
16.66505782  
16.06556297  
15.48642081  
14.93668611  
14.41425094  
13.91300522  
13.43286101  
12.97435633  
12.53566975  
12.11772129  
11.71356867  
11.32821765  
10.95960479  
10.60535048  
10.26538069  
9.93901316  
9.625978518  
9.325157568  
9.036415418  
8.758199921  
8.491141534  
8.234092516  
7.987049222  
7.748791531  
7.519836667  
7.299042909  
7.086576791  
6.881593602  
6.684242286  
6.493789908  
6.31006639  
6.13293609  
5.961773258  
5.796737006  
5.637237493  
5.483277989  
5.334610127  
5.190772224  
5.051862964  
4.917448168  
4.787477487  
4.661799128  
4.540246906  
4.422544938  
4.308626169  
4.19833251  
4.091497169  
3.988124266  
3.887863849  
3.790753169  
3.696645519  
3.605405765  
3.516893164  
3.431093257  
3.347870401  
3.267095565  
3.188714997  
3.112569527  
3.038821871  
2.967154943  
2.897568417  
2.829989966  
2.764264431  
2.70052104  
2.638520622  
2.578183751  
2.519651803  
2.462688959  
2.407300337  
2.353454121  
2.301136121  
2.250120682  
2.200490376  
2.152274705  
2.105298055  
2.059600048  
2.015113118  
1.971717454  
1.929594612  
1.888442681  
1.84840332  
1.809420008  
1.771349089  
1.734294886  
1.698148743  
1.662992212  
1.628706689  
1.595256135  
1.562604206  
1.530789762  
1.499764598  
1.469484713  
1.439981639  
1.411154869  
1.383040521  
1.355602967  
1.328760896  
1.302634097  
1.277107522  
1.252191166  
1.227788105  
1.204061851  
1.180803331  
1.158179571  
1.135947853  
1.114307799  
1.093160283  
1.072481216  
1.052276313  
1.032525733  
1.013238339  
0.9943368118  
0.9758604562  
0.9578512251  
0.9401851496  
0.9229404748  
0.9060600077  
0.8895327758  
0.873365185  
0.8575457139  
0.8421004226  
0.8269741895  
0.8121085892  
0.7976572901  
0.7834330679  
0.769547784  
0.7559730794  
0.7426559728  
0.7296120711  
0.7168509108  
0.7043538013  
0.6921361476  
0.6801140099  
0.6683925143  
0.6568640744  
0.6455794534  
0.6345602355  
0.6237672904  
0.6131507383  
0.6027634459  
0.592563881  
0.582608015  
0.5728058185  
0.563214663  
0.5538218823  
0.5446021101  
0.5355738186  
0.5267168089  
0.5180262933  
0.5095203825  
0.5011284406  
0.4929135604  
0.4848961542  
0.4770063802  
0.4692726368  
0.4617100767  
0.4542596043  
0.4469559057  
0.4397708238  
0.4327574453  
0.4258299091  
0.4190487413  
0.4123900258  
0.4058766994  
0.3994773858  
0.3931845267  
0.3869964127  
0.3809551637  
0.3750271847  
0.3691757695  
0.3634186162  
0.3578002589  
0.3522695368  
0.3468422999  
0.3415059614  
0.3362691536  
0.3311085274  
0.3260664246  
0.3210947892  
0.316232226  
0.3114252885  
0.3067169829  
0.3020834288  
0.2975474213  
0.2930934686  
0.2887031006  
0.2843821974  
0.280145565  
0.2759860941  
0.2718782404  
0.2678588785  
0.26391961  
0.2600266723  
0.2562118404  
0.2524418143  
0.2487600924  
0.2451150876  
0.2415673289  
0.2380528246  
0.2345964121  
0.2312078619  
0.2278854709  
0.2245782229  
0.2213706094  
0.2182095884  
0.2150933441  
0.2120096051  
0.2089978916  
0.2060448802  
0.2031121305  
0.2002442891  
0.1974273511  
0.1946541513  
0.1918967017  
0.1892520849  
0.1865930468  
0.1839931857  
0.181453074  
0.1789183318  
0.1764370396  
0.1740154562  
0.1716210666  
0.1692525  
0.1669567724  
0.1646637279  
0.162425889  
0.1602164308  
0.158037104  
0.1558896016  
0.153795428  
0.1517250207  
0.1496941534  
0.1476927798  
0.1457323461  
0.1437859997  
0.1418630627  
0.1399843243  
0.1381313721  
0.136307427  
0.1345227024  
0.1327578671  
0.1310133547  
0.129319456  
0.1276338808  
0.1259883627  
0.1243716921  
0.1227485703  
0.1211844616  
0.1196265922  
0.1181004843  
0.1165948913  
0.1151242833  
0.1136628796  
0.1122399243  
0.1108274353  
0.1094446607  
0.1080777071  
0.1067463901  
0.1054084312  
0.1041126944  
0.1028214834  
0.1015834619  
0.1003335194  
0.09912448828  
0.09792630682  
0.09674684731  
0.0955847725  
0.0944458803  
0.09332191413  
0.09221020911  
0.09113196837  
0.09006103934  
0.0890071155  
0.08797832069  
0.08695525584  
0.08595926068  
0.0849697453  
0.08400539093  
0.08304270269  
0.08211453025  
0.08118996085  
0.08029458118  
0.07940523744  
0.07852841473  
0.07766790938  
0.07682966743  
0.07599855561  
0.07516890628  
0.07437914855  
0.07360689927  
0.07281688059  
0.07206631331  
0.07131001052  
0.07058518978  
0.06987243044  
0.06915718404  
0.06846566999  
0.06778136678  
0.06711060816  
0.06646322897  
0.06580383627  
0.0651911049  
0.06456442445  
0.06395680071  
0.06334957369  
0.06277167678  
0.06220555909  
0.06163474894  
0.06109032909  
0.06054829011  
0.06001690068  
0.05951405342  
0.05898257353  
0.05850313318  
0.0580191961  
0.0575477965  
0.05708342023  
0.05662364434  
0.05618290675  
0.05575557475  
0.0553303223  
0.0549100794  
0.05450917321  
0.05411962909  
0.05373726066  
0.0533503749  
0.05299872212  
0.05264561461  
0.05229792016  
0.05196319176  
0.05162582949  
0.05131479083  
0.05100694951  
0.05071488596  
0.05041409235  
0.05013931509  
0.04987028859  
0.04960449885  
0.04934815952  
0.04910811941  
0.04886073155  
0.04864021224  
0.04842138758  
0.04821368405  
0.04800599435  
0.04780114608  
0.04762943295  
0.04745079506  
0.0472851759  
0.04712657785  
0.04696914801  
0.04682967235  
0.04668911169  
0.04657373019  
0.04645617576  
0.04634546843  
0.04623376901  
0.04614167761  
0.04606321663  
0.0459813595  
0.04591993371  
0.04585322266  
0.04579499914  
0.04575711636  
0.04572508893  
0.04569336293  
0.04567537765  
0.04566104004  
0.04565612601  
