277.8982002  
288.4219505  
314.1688634  
394.8323054  
563.5566179  
1249.441929  
21156.52972  
123082.9044  
18751.57486  
19071.8379  
74488.20394  
12663.15067  
4731.58021  
11948.5111  
4165.602107  
25005.12388  
2101.531172  
5014.083808  
7262.79995  
14469.18784  
7564.72332  
6934.69674  
5488.864535  
492.5530002  
1420.042798  
424.6102267  
12677.61526  
1731.178714  
4703.51459  
9570.725616  
8332.652839  
3566.372212  
1646.534891  
6651.1681  
6691.420298  
2941.717421  
8.64512162  
2259.609077  
6324.176026  
2232.785258  
173.4414904  
3664.041288  
234.7950679  
3773.099022  
1373.858332  
2495.333507  
6334.9268  
1336.500678  
129.8281022  
3849.900627  
753.1737746  
1339.745408  
750.8701378  
179.0774376  
3407.319197  
4027.398135  
70.46099488  
4277.953954  
6614.852947  
547.6896742  
597.0268605  
1581.280991  
235.5274883  
553.1068226  
263.8338155  
15.8199116  
122.8578645  
71.57460116  
47.01664728  
39.71432958  
21.65250283  
2.6504064  
2.474141245  
1.267343209  
2.254114909  
2.865164637  
1.941748106  
0.6387392786  
2.260374711  
0.1061607708  
0.4237838182  
0.1773275323  
0.04356438262  
0.05663379546  
0.3808595656  
0.2069327982  
0.2233238827  
0.1750425032  
0.1915016419  
0.1565895668  
0.07340272784  
0.1396085485  
0.1293212083  
0.1608758932  
0.1396996285  
0.1130327472  
0.1403165597  
0.1152165098  
0.125090489  
0.1165218888  
0.1187103217  
0.1218137443  
0.1170472692  
0.1133343634  
0.1114336764  
0.1088524555  
0.1069853663  
0.1063017388  
0.1053755615  
0.1036107729  
0.1005792303  
0.09900839005  
0.09633523639  
0.09490605703  
0.09346968681  
0.09233269038  
0.09032756333  
0.08841833847  
0.08689349758  
0.08564723999  
0.08370299086  
0.08257840169  
0.0808715253  
0.07975766049  
0.07823880519  
0.07694959269  
0.07556172842  
0.07438125283  
0.07313715699  
0.07193196079  
0.07070152581  
0.06956027074  
0.06843729271  
0.06732763801  
0.06622201582  
0.06518392385  
0.06415227553  
0.06315574723  
0.06217559815  
0.0612181917  
0.06026547431  
0.05935377312  
0.05843451291  
0.05757432414  
0.05671693703  
0.05587215667  
0.05505709435  
0.05425337264  
0.05346617656  
0.05270532091  
0.05195192226  
0.05121602008  
0.05049962911  
0.04979903292  
0.04911282861  
0.0484375671  
0.04778056085  
0.04713602996  
0.04650445075  
0.04589183584  
0.0452857788  
0.04469268389  
0.04411120458  
0.04354415251  
0.04298658056  
0.04244192208  
0.04190861931  
0.0413861702  
0.04087561314  
0.04037125091  
0.03987762567  
0.03939582025  
0.03892203692  
0.03845707666  
0.03800410988  
0.03755640532  
0.03711881815  
0.03668886401  
0.0362690909  
0.0358535609  
0.03544766276  
0.03505138324  
0.03465914875  
0.03427720204  
0.03389985994  
0.03353057625  
0.0331684847  
0.03281207858  
0.03246100285  
0.03211838478  
0.03177995261  
0.03144616226  
0.03112394994  
0.03080241505  
0.03048960279  
0.03018058094  
0.02987996091  
0.02957960154  
0.02928855975  
0.02899598587  
0.02871486085  
0.02843583515  
0.0281610813  
0.02789175443  
0.02762919674  
0.0273673107  
0.02711159142  
0.02685747249  
0.02661179907  
0.02636678063  
0.02612687007  
0.02589269184  
0.02565738299  
0.02543094349  
0.02520543445  
0.02498343918  
0.0247678551  
0.0245523748  
0.02434033825  
0.02413299976  
0.02392880364  
0.02372815702  
0.02352837733  
0.02333310638  
0.0231412273  
0.02295092785  
0.02276376201  
0.02258085678  
0.02240064496  
0.02222143466  
0.02204672172  
0.02187250131  
0.02169947313  
0.02153301158  
0.02136791826  
0.02120310887  
0.02104322849  
0.02088422226  
0.02072807129  
0.02057465735  
0.02042249693  
0.02027084548  
0.02012330731  
0.01997815853  
0.01983557705  
0.01969358217  
0.01955227621  
0.0194147022  
0.0192794838  
0.01914605817  
0.0190123513  
0.01888356874  
0.01875497145  
0.01862815742  
0.01850296621  
0.01837829473  
0.01825824616  
0.01813787255  
0.01801946371  
0.0179018004  
0.01778467462  
0.01767133985  
0.01755912012  
0.0174472772  
0.01733751036  
0.0172314812  
0.01712390807  
0.01701866128  
0.01691525496  
0.01681233617  
0.01671216702  
0.01661033278  
0.01651140133  
0.01641514545  
0.01631779557  
0.01622341509  
0.01612979089  
0.01603637277  
0.01594535847  
0.0158542563  
0.01576512333  
0.01567759498  
0.01559066228  
0.01550390487  
0.01541995339  
0.01533467428  
0.01525260421  
0.0151707097  
0.01509014775  
0.01500995373  
0.01493188911  
0.01485300183  
0.0147754949  
0.01469971757  
0.01462476218  
0.01454975474  
0.01447761163  
0.01440500909  
0.01433254527  
0.01426265579  
0.0141923135  
0.01412364139  
0.01405523291  
0.01398799408  
0.01392133984  
0.01385364986  
0.01378994859  
0.01372536024  
0.01366196688  
0.01359801944  
0.01353740872  
0.01347611414  
0.01341548205  
0.01335576821  
0.0132962557  
0.01323751933  
0.01317960665  
0.01312270199  
0.01306614856  
0.0130095911  
0.01295502638  
0.01289873237  
0.01284559685  
0.01279266649  
0.01274030925  
0.01268605711  
0.01263633246  
0.01258563938  
0.0125355464  
0.01248509747  
0.01243615832  
0.01238769673  
0.01233853868  
0.01229198892  
0.01224424562  
0.01219849018  
0.01215201864  
0.01210651449  
0.01206240929  
0.0120177971  
0.01197388493  
0.01193062523  
0.0118871216  
0.01184519876  
0.01180388362  
0.01176203273  
0.01171974872  
0.01168038436  
0.01164138406  
0.01160155179  
0.01156291799  
0.01152412127  
0.01148509412  
0.01144643771  
0.01141091809  
0.01137326544  
0.01133725662  
0.01130190205  
0.01126443528  
0.01123035631  
0.01119666932  
0.01116163052  
0.0111266118  
0.0110917014  
0.01106112173  
0.01102792218  
0.01099631736  
0.01096445601  
0.01093189488  
0.01090006618  
0.0108706619  
0.01083869643  
0.01080839182  
0.01077858591  
0.01074980727  
0.01072282477  
0.01069329432  
0.01066343983  
0.01063524226  
0.01060770078  
0.01058097794  
0.01055333135  
0.01052736732  
0.01050168547  
0.01047452706  
0.01045010103  
0.01042431654  
0.01039827632  
0.01037444352  
0.01034980472  
0.01032496434  
0.01030124952  
0.01027941159  
0.01025499511  
0.01023214956  
0.01020926927  
0.01018681148  
0.01016546011  
0.01014416044  
0.01012299682  
0.01010076783  
0.01008106461  
0.01006111172  
0.01003835951  
0.0100196019  
0.01000021864  
0.009980212035  
0.009960644478  
0.009943277768  
0.00992422335  
0.009905037088  
0.009886318164  
0.009869543452  
0.009851677314  
0.00983496844  
0.009817967688  
0.00980052684  
0.009784908275  
0.009768786293  
0.009751836282  
0.009735096896  
0.009720116765  
0.009703919846  
0.009690647661  
0.009674857439  
0.009660822645  
0.009644848005  
0.009632456432  
0.009618836493  
0.009605444446  
0.009591483817  
0.009578132959  
0.009566338621  
0.009553102778  
0.009540064378  
0.009529018476  
0.009515860592  
0.009504895356  
0.009493262727  
0.009482011913  
0.009471045103  
0.009459667717  
0.009448787749  
0.009439093577  
0.009428279473  
0.009418127971  
0.009409196296  
0.009399805743  
0.009390347884  
0.009381487111  
0.009371752163  
0.009364397161  
0.00935588023  
0.009346761205  
0.009339331715  
0.009331061012  
0.009323200714  
0.00931568705  
0.009308557181  
0.009302704484  
0.009294795628  
0.00928852097  
0.009281920237  
0.009276501588  
0.009270768171  
0.009263705749  
0.009258183698  
0.009254964745  
0.009248838792  
0.009243228094  
0.009239077241  
0.009235291942  
0.009229958252  
0.0092262914  
0.009222678428  
0.009219283226  
0.009214686445  
0.009212705498  
0.00920803195  
0.009204730616  
0.009203300016  
0.009201173917  
0.009198214678  
0.009196736225  
0.009193417166  
0.009192769092  
0.009191808688  
0.009190685776  
0.0091890768  
0.009188458364  
0.009187593216  
0.009187164712  
0.009186517063  
0.009186839737  
