26.183133  
28.37362025  
31.621636  
43.89292425  
139.7957572  
9452.97188  
38611.51215  
25416.73501  
47466.32832  
31214.13047  
52053.88039  
19600.21672  
52324.57081  
9366.370866  
21360.92375  
881.7308951  
10638.44615  
4826.619817  
3251.610991  
8259.437775  
6203.194467  
8806.697995  
2467.572595  
4670.10457  
3541.048284  
1871.243892  
2408.81126  
2352.417851  
15750.49147  
1593.843282  
8779.165686  
1172.055754  
5528.91975  
5918.454716  
1963.559537  
11889.63163  
8816.936741  
4834.479124  
1301.127226  
3229.756296  
7710.950133  
2005.914677  
1757.633048  
520.6877218  
157.2849721  
4002.200677  
3905.234521  
1463.338775  
630.5048555  
1104.678069  
4825.847518  
1428.292389  
576.4219096  
455.9503562  
1840.229359  
4456.669605  
1151.175354  
1383.86955  
35.29640727  
3631.493737  
523.6493363  
3053.817618  
464.4065433  
214.8878534  
1378.323905  
16.56457702  
399.3467628  
17.76676053  
144.9881936  
96.04793953  
13.39160325  
27.57850015  
4.917600053  
21.06987995  
14.10435147  
8.066028904  
3.732468551  
1.267874883  
0.983815302  
3.25968231  
3.881719179  
0.6616864824  
0.4489868572  
0.06466886705  
0.6486592553  
0.5192683981  
0.3575640569  
0.5055741908  
0.4959515601  
0.3845706356  
0.1464973839  
0.3484750081  
0.2572828061  
0.3737974911  
0.3163401386  
0.2563187543  
0.2735290488  
0.242100257  
0.2750188252  
0.2432190978  
0.2560772001  
0.2364692393  
0.227482766  
0.2327098325  
0.2217752707  
0.2235997121  
0.2120904304  
0.2060514015  
0.2032853071  
0.1969440895  
0.195858947  
0.1915792099  
0.188937475  
0.18389582  
0.179859289  
0.1758589728  
0.1729633843  
0.1704659403  
0.1664639514  
0.1644193279  
0.1611783312  
0.1579781078  
0.1549778625  
0.1524849935  
0.1502956223  
0.1473378871  
0.1449746883  
0.1424111287  
0.1402993176  
0.1380103367  
0.1357174824  
0.1336714767  
0.131551811  
0.1295516792  
0.1274458788  
0.1255889329  
0.1237109471  
0.121879984  
0.1201248745  
0.1183312979  
0.1166456  
0.1149498289  
0.1133507983  
0.1117758957  
0.1102285071  
0.1087242045  
0.107231634  
0.1058004331  
0.1043877127  
0.1030113782  
0.1016643882  
0.1003399478  
0.09905255537  
0.09779510776  
0.09656235386  
0.09534956114  
0.09416633322  
0.09300986803  
0.09187341816  
0.09076881139  
0.08967136885  
0.08860676279  
0.08756369106  
0.08654052006  
0.08553403737  
0.08455082678  
0.08358710542  
0.08263879877  
0.08171164561  
0.08080210028  
0.07990636077  
0.07903077742  
0.07817301581  
0.07732970473  
0.07649932183  
0.07568470397  
0.07488877199  
0.07410244493  
0.07333654998  
0.0725787029  
0.07183493711  
0.07110499515  
0.07039046196  
0.06968701935  
0.06899020216  
0.06831061337  
0.0676455061  
0.06698574077  
0.06634161043  
0.06570372467  
0.06508154019  
0.06446691579  
0.06386244966  
0.06326825979  
0.06268100332  
0.06211042308  
0.0615425986  
0.06098692264  
0.06044007358  
0.05990134844  
0.0593686051  
0.05884866733  
0.05833735541  
0.057830345  
0.05733056014  
0.05684111724  
0.05635820814  
0.05588374904  
0.05541523486  
0.05495430198  
0.05450268438  
0.05405273049  
0.05361337327  
0.05317833829  
0.05275106296  
0.05233116032  
0.05191399696  
0.05150629375  
0.05110111313  
0.05070632851  
0.050313498  
0.04992797465  
0.04954690943  
0.04917422654  
0.04880395359  
0.0484384644  
0.04807934996  
0.04772414953  
0.0473772721  
0.04703273277  
0.04669114791  
0.04635321644  
0.04602480011  
0.04570043946  
0.04537662786  
0.04506011714  
0.04474792663  
0.04443955045  
0.04413533294  
0.0438340823  
0.04353567648  
0.0432445756  
0.04295495409  
0.04267086564  
0.04238801456  
0.04211185332  
0.0418382153  
0.04156747847  
0.04129932611  
0.04103821991  
0.04077583656  
0.04051997222  
0.04026602146  
0.04001421988  
0.03976956613  
0.03952462967  
0.03928270003  
0.03904369249  
0.0388109434  
0.03857930613  
0.03835010144  
0.03812191277  
0.03789890126  
0.03767952195  
0.03746044699  
0.03724481364  
0.03703241788  
0.03682149203  
0.03661466212  
0.03641028986  
0.03620496891  
0.0360061107  
0.03580916718  
0.03561402507  
0.035419629  
0.03522876561  
0.03504083787  
0.03485395414  
0.03467143757  
0.03448835228  
0.03430719977  
0.03413176945  
0.03395616841  
0.03378285238  
0.03360884738  
0.03343963337  
0.03327469564  
0.03310801999  
0.03294348634  
0.03278075853  
0.03262335321  
0.03246441259  
0.03230812904  
0.03215320108  
0.03200060365  
0.03185081728  
0.03170238135  
0.03155438157  
0.03140860429  
0.03126523749  
0.03112015203  
0.03098074977  
0.03084123945  
0.03070351007  
0.03056627107  
0.03043202074  
0.0302986442  
0.03016856595  
0.03003779489  
0.02990924922  
0.02978155279  
0.02965350076  
0.0295310117  
0.02940860776  
0.02928669029  
0.02916613579  
0.02904752178  
0.02892966277  
0.02881230168  
0.02869710798  
0.02858571013  
0.02847088666  
0.02836119841  
0.0282510413  
0.0281415702  
0.02803427582  
0.0279274143  
0.02782226353  
0.02771767859  
0.02761525658  
0.02751193555  
0.02741344279  
0.02731411249  
0.02721607614  
0.02711875632  
0.02702215202  
0.02692666968  
0.02683160042  
0.02673872168  
0.02664837933  
0.02655630697  
0.02646618014  
0.02637819222  
0.02628942906  
0.02620057187  
0.02611425508  
0.0260295674  
0.02594625148  
0.02586362626  
0.0257794675  
0.02570026164  
0.02561807892  
0.02553815601  
0.02545929758  
0.02538154911  
0.02530654584  
0.02523054538  
0.02515333854  
0.02507941782  
0.02500697837  
0.02493383848  
0.02486162004  
0.02479064795  
0.02471923726  
0.02465145537  
0.02458190277  
0.02451469859  
0.02444771915  
0.02438214842  
0.02431490779  
0.02425139584  
0.0241870934  
0.02412449543  
0.02406137304  
0.0239978682  
0.02393848442  
0.02387778984  
0.02381895914  
0.02375830818  
0.02370148552  
0.02364392379  
0.02358696815  
0.0235302881  
0.02347636501  
0.02342073268  
0.02336590568  
0.02331301204  
0.0232615271  
0.02320818827  
0.02315697554  
0.02310573427  
0.02305649377  
0.02300640065  
0.02295708765  
0.02290881601  
0.02286203397  
0.02281298577  
0.02276704907  
0.02272170757  
0.02267523886  
0.02263228511  
0.02258678331  
0.02254430681  
0.02250128848  
0.02245878562  
0.02241783525  
0.02237561396  
0.0223371984  
0.02229725678  
0.02225457377  
0.0222166508  
0.02217902482  
0.02214128267  
0.02210351126  
0.02206601576  
0.02203100939  
0.02199565175  
0.02196141159  
0.02192590331  
0.02189120563  
0.02185752963  
0.0218247558  
0.02179246536  
0.02176085179  
0.0217306609  
0.0216985851  
0.02166743657  
0.02163786007  
0.02160812712  
0.02158083101  
0.02155083027  
0.02152451855  
0.02149582823  
0.02146993518  
0.02144214173  
0.02141612501  
0.02139246662  
0.02136634426  
0.02134226295  
0.02131889439  
0.02129463588  
0.02127244932  
0.0212511746  
0.02122645323  
0.02120584739  
0.02118437118  
0.02116373035  
0.02114384399  
0.02112178463  
0.02110556801  
0.02108548949  
0.02106735431  
0.02104856084  
0.02103120602  
0.02101459913  
0.02099828467  
0.02098225091  
0.02096547342  
0.0209519055  
0.02093726878  
0.02092130695  
0.02090787864  
0.0208932918  
0.02087903233  
0.02086770342  
0.0208547299  
0.02084515665  
0.02083451495  
0.02082237129  
0.02081144851  
0.02080054579  
0.02079106488  
0.02078538035  
0.02077439361  
0.02076658609  
0.02075924997  
0.02075108247  
0.02074447847  
0.02073699991  
0.02072986851  
0.02072616511  
0.02071948388  
0.02071529709  
0.02071205439  
0.02070670847  
0.02070243171  
0.02069925778  
0.02069688251  
0.02069557884  
0.02069374903  
0.02069065327  
0.02069144565  
0.02068887091  
0.02069020098  
