-0.3091784638  
-0.136045907  
0.03990919987  
0.2215819431  
0.4089068786  
0.5980878427  
0.781583285  
0.9488669526  
1.087833826  
1.186607792  
1.235422708  
1.228262788  
1.163963397  
1.046593909  
0.8850642864  
0.6920337127  
0.4823166892  
0.2710703066  
0.07204438435  
-0.1038306124  
-0.2493221104  
-0.3611791366  
-0.4398331436  
-0.4886504351  
-0.5129269997  
-0.518825286  
-0.5124380816  
-0.4990998426  
-0.4829974559  
-0.4670541083  
-0.4530088966  
-0.4415928577  
-0.4326902585  
-0.4254331916  
-0.4181983917  
-0.4085449762  
-0.3931591789  
-0.3678959512  
-0.3279848576  
-0.2684527505  
-0.1847465793  
-0.07349285152  
0.06671035994  
0.2346170242  
0.4259008002  
0.6330861981  
0.8459074839  
1.05208329  
1.238449243  
1.392300725  
1.502785857  
1.56213931  
1.566596356  
1.516834423  
1.417885604  
1.278514353  
1.110156143  
0.9255637126  
0.7373582371  
0.5567001435  
0.3922654288  
0.2496603828  
0.1313582377  
0.03711221937  
-0.03522798195  
-0.08868554485  
-0.1260872247  
-0.1491787799  
-0.1580664892  
-0.151112053  
-0.1252843941  
-0.07691784977  
-0.002730121792  
0.09907644577  
0.2278516594  
0.379850919  
0.5480492608  
0.7224807363  
0.8910748701  
1.040884432  
1.159521676  
1.236594319  
1.264912605  
1.24129096  
1.166824232  
1.046607496  
0.8889612611  
0.704297782  
0.5038162912  
0.2982487963  
0.09682067647  
-0.09341562867  
-0.2678306483  
-0.4240581376  
-0.5615217019  
-0.6807775312  
-0.7828395908  
-0.8686046812  
-0.9385030894  
-0.9923984735  
-1.029731643  
-1.049841667  
-1.052374151  
-1.037659893  
-1.007001339  
-0.9627800963  
-0.9083790342  
-0.8479451905  
-0.7860201687  
-0.7271253138  
-0.675345778  
-0.6339799963  
-0.6052860686  
-0.5903372387  
-0.588979001  
-0.5998781601  
-0.6206302638  
-0.6479325309  
-0.6777915225  
-0.7057856704  
-0.7273795004  
-0.7382959547  
-0.7349253175  
-0.7147509064  
-0.6767328393  
-0.6215851876  
-0.5518827586  
-0.4719375187  
-0.3874250346  
-0.3047656472  
-0.2303327347  
-0.1695771177  
-0.1262062354  
-0.1015475122  
-0.09421817023  
-0.1001730475  
-0.113164078  
-0.1255513868  
-0.1293768957  
-0.1175458537  
-0.08493715632  
-0.02928259728  
0.04833419904  
0.143439159  
0.2486148369  
0.3543818715  
0.4503880925  
0.5267582785  
0.5754027109  
0.5911085474  
0.5722536664  
0.5210466679  
0.4432679136  
0.3475366709  
0.244225527  
0.1441700515  
0.05736537985  
-0.008177312126  
-0.04725540214  
-0.05788582246  
-0.04126281568  
-0.001311724451  
0.05607504158  
0.1239673038  
0.1953354101  
0.2638643911  
0.3245183798  
0.373816996  
0.409827933  
0.4319288861  
0.4404524611  
0.4362976687  
0.4206287996  
0.3947114526  
0.359905202  
0.3177881051  
0.2703451649  
0.2201343816  
0.1703389651  
0.1246550565  
0.08697685008  
0.06092593313  
0.04927293748  
0.05337488756  
0.0727350158  
0.1047889339  
0.1449793808  
0.1871392012  
0.2241294643  
0.2486401267  
0.2540240644  
0.2350205625  
0.1882517852  
0.1124252904  
0.008208756559  
-0.1221594159  
-0.2754348006  
-0.4479668677  
-0.6361992631  
-0.8369475745  
-1.047387403  
-1.264745716  
-1.485760375  
-1.706025382  
-1.919388074  
-2.117563108  
-2.290106236  
-2.42484153  
-2.508749242  
-2.529249064  
-2.475726733  
-2.34109536  
-2.123158078  
-1.825542312  
-1.458023924  
-1.036137022  
-0.5800575194  
-0.1128597078  
0.3416560107  
0.7613158166  
1.127787409  
1.428374336  
1.657147633  
1.815260626  
1.910407235  
1.955502979  
1.966780072  
1.961564142  
1.956042951  
1.963324957  
1.992036504  
2.045616868  
2.122358941  
2.216135855  
2.317651055  
2.41599073  
2.500226197  
2.560821114  
2.590665931  
2.585621589  
2.544545484  
2.468865252  
2.36181938  
2.227542739  
2.070157821  
1.893054445  
1.698450611  
1.487316448  
1.259638708  
1.014980799  
0.7532179496  
0.4753192758  
0.184034771  
-0.1156446851  
-0.4163490428  
-0.7085649012  
-0.9812521252  
-1.222785937  
-1.422125336  
-1.570068354  
-1.660441075  
-1.691038946  
-1.664187959  
-1.586810242  
-1.469951645  
-1.327784514  
-1.176195062  
-1.031109556  
-0.9067689013  
-0.8141901112  
-0.7600150836  
-0.7459213951  
-0.7686724345  
-0.820814092  
-0.8918992304  
-0.9700736686  
-1.043772375  
-1.103290253  
-1.141985022  
-1.156954856  
-1.149114679  
-1.122687251  
-1.084222446  
-1.041332808  
-1.001361446  
-0.9702035425  
-0.9514627243  
-0.9460563538  
-0.9522970521  
-0.9663994185  
-0.9832875503  
-0.9975336094  
-1.004259502  
-0.999837201  
-0.982289759  
-0.9513571712  
-0.9082521957  
-0.8551979222  
-0.7948636095  
-0.7298393222  
-0.6622422533  
-0.5935373928  
-0.5245716891  
-0.4557902248  
-0.38754301  
-0.3203848545  
-0.2552734932  
-0.193591536  
-0.1369759752  
-0.08697915876  
-0.04464564025  
-0.01010396428  
0.01771316091  
0.04112102503  
0.06346394536  
0.08863075019  
0.1203647429  
0.1614888923  
0.2131945407  
0.2745322691  
0.3422367878  
0.4109414909  
0.4737949016  
0.5234010211  
0.552940777  
0.5573137245  
0.5340922782  
0.4841319072  
0.411711118  
0.324156238  
0.2309863154  
0.142694436  
0.06934390356  
0.0191964945  
-0.002416982428  
0.006209691532  
0.0430143663  
0.1026026744  
0.1772096607  
0.2580343012  
0.3367211271  
0.4067544947  
0.4645052578  
0.5097507168  
0.545554879  
0.577514463  
0.6124864951  
0.657000871  
0.7156397363  
0.7896808535  
0.8762444645  
0.9681478022  
1.054517212  
1.122099315  
1.157093201  
1.14721449  
1.083677482  
0.9627576177  
0.7866899347  
0.5637265642  
0.3073459353  
0.03471157437  
-0.2353689145  
-0.4846805592  
-0.697676285  
-0.8630803369  
-0.9747755087  
-1.031874873  
-1.037988811  
-0.9998608918  
-0.9256498355  
-0.8231634996  
-0.6983927906  
-0.5546042375  
-0.3921517846  
-0.2090403178  
-0.002117133689  
0.2313401987  
0.4919589449  
0.7768604626  
1.078802519  
1.386076928  
1.683233527  
1.952555505  
2.176070093  
2.337804666  
2.425909928  
2.434332007  
2.363743953  
2.221592347  
2.021240053  
1.780329682  
1.518608046  
1.255546772  
1.008090769  
0.788861454  
0.6050416438  
0.4580736508  
0.3441452255  
0.2553532161  
0.1812983414  
0.1108611522  
0.03386712989  
-0.05758447697  
-0.1682738875  
-0.2995682075  
-0.4496146351  
-0.6139449281  
-0.7862923821  
-0.9594982956  
-1.126338846  
-1.280203824  
-1.415587625  
-1.528391775  
-1.616108808  
-1.677900515  
-1.714636088  
-1.728875018  
-1.724789046  
-1.707974075  
-1.685114799  
-1.663468431  
-1.650180378  
-1.651465184  
-1.671755957  
-1.712921985  
-1.773694281  
-1.84941525  
-1.932195311  
-2.011515029  
-2.075238317  
-2.110937331  
-2.107381316  
-2.055991496  
-1.952061828  
-1.795555886  
-1.591341696  
-1.348811443  
-1.080893208  
-0.8025931525  
-0.5292451154  
-0.2747294271  
-0.04990847637  
0.1384738208  
0.2882751481  
0.401745856  
0.4846736649  
0.5450366614  
0.5913918632  
0.6312839992  
0.6699305424  
0.7094138599  
0.7484978286  
0.7830903017  
0.8072481486  
0.8145478046  
0.7995613555  
0.7591910317  
0.6936192669  
0.6067191767  
0.5058534538  
0.4010974336  
0.3040027278  
0.2261088977  
0.1774230098  
0.1651083479  
0.1925664011  
0.259047649  
0.3598314697  
0.4869295378  
0.6301912299  
0.7786285063  
0.9217489956  
1.050695916  
1.159025621  
1.243026506  
1.301562382  
1.335502253  
1.346872897  
1.337931804  
1.310343201  
1.264645411  
1.200125876  
1.115146743  
1.007872884  
0.8772688846  
0.7241743234  
0.552231669  
0.3684493583  
0.1832426092  
0.009854864314  
-0.1368234401  
-0.2419238691  
-0.2925541069  
-0.2797743456  
-0.200295277  
-0.05761954936  
0.1375782602  
0.3679771586  
0.6110309197  
0.8411687878  
1.032544196  
1.161993333  
1.211833499  
1.172126147  
1.042084236  
0.8304085344  
0.5544786525  
0.238473342  
-0.08934991067  
-0.3998807758  
-0.6664617432  
-0.8678620935  
-0.9905357898  
-1.029898727  
-0.9904943762  
-0.8850742888  
-0.7327661708  
-0.556612932  
-0.3808425457  
-0.2282184497  
-0.1178069638  
-0.06337201234  
-0.07253706113  
-0.1466939792  
-0.2815600785  
-0.4681993052  
-0.6942876769  
-0.9454039101  
-1.206184695  
-1.461235975  
-1.695777762  
-1.896070407  
-2.049719734  
-2.145977157  
-2.176134745  
-2.13406293  
-2.016886573  
-1.825697435  
-1.566159773  
-1.248832773  
-0.8890317369  
-0.5061031286  
-0.1220871033  
0.2401636045  
0.5592207646  
0.8173883578  
1.002758656  
1.110683627  
1.144406166  
1.114691804  
1.038470132  
0.9366272795  
0.8312498394  
0.7427078653  
0.686977105  
0.6736053877  
0.7045956451  
0.7743486814  
0.8706603612  
0.9765760984  
1.072831466  
1.140488128  
1.163406314  
1.130222142  
1.035601768  
0.8806771979  
0.672678913  
0.4238990042  
0.1501945128  
-0.130739732  
-0.4010990387  
-0.6445020382  
-0.8472088878  
-0.9989419787  
-1.093308418  
-1.12783833  
-1.103701351  
-1.025165675  
-0.8988688601  
-0.7329849242  
-0.5363614362  
-0.3177172719  
-0.08497621011  
0.1551687511  
0.3974225912  
0.6377432082  
0.8729141486  
1.099902331  
1.315124323  
1.513763737  
1.689309925  
1.833450762  
1.936405192  
1.987715628  
1.977425403  
1.89748366  
1.743178672  
1.514353879  
1.216184047  
0.8593494739  
0.4595195545  
0.03618249701  
-0.3890626634  
-0.7945197696  
-1.160451884  
-1.470904879  
-1.715050061  
-1.887881097  
-1.990211856  
-2.028000966  
-2.011152523  
-1.952001501  
-1.863713028  
-1.758821064  
-1.648095536  
-1.539834623  
-1.439616316  
-1.350461522  
-1.273298369  
-1.207592474  
-1.151999957  
-1.104917987  
-1.064847741  
-1.03053538  
-1.000905458  
-0.9748279593  
-0.9508130566  
-0.9267113807  
-0.8995104347  
-0.865297608  
-0.8194271398  
-0.7568936748  
-0.6728837508  
-0.5634412533  
-0.4261577252  
-0.2607847794  
-0.06966408298  
0.1420968768  
0.3667744668  
0.5945001606  
0.8140328159  
1.013744142  
1.182709129  
1.311774065  
1.394469224  
1.427659748  
1.411867382  
1.351227864  
1.253114786  
1.127485072  
0.9860304301  
0.8412331775  
0.7054114539  
0.5898374372  
0.5039591425  
0.4547818872  
0.4464012147  
0.479713757  
0.5523117804  
0.6585703538  
0.7899597092  
0.9355799106  
1.082922184  
1.218830344  
1.330588361  
1.40705734  
1.439729287  
1.423580018  
1.357610775  
1.24499469  
1.092801226  
0.9113266028  
0.7131099975  
0.5117506583  
0.3206772121  
0.151997034  
0.01554542692  
-0.08178933499  
-0.1364353358  
-0.1482030498  
-0.1201009992  
-0.05794869262  
0.03014762955  
0.1343934459  
0.2439469628  
0.347572925  
0.4342880875  
0.4940026533  
0.5181361386  
0.5001906732  
0.4362552764  
0.3253947701  
0.1698764835  
-0.02481612424  
-0.2502179122  
-0.4953832178  
-0.7476406846  
-0.993557685  
-1.22002607  
-1.415373788  
-1.570366778  
-1.678990486  
-1.73889651  
-1.751470468  
-1.721483745  
-1.656395768  
-1.565381009  
-1.458227629  
-1.344254911  
-1.231398452  
-1.125577742  
-1.030421165  
-0.9473492059  
-0.8759689381  
-0.8146792554  
-0.7613480579  
-0.7139340894  
-0.6709291298  
-0.6315617607  
-0.5957282283  
-0.5637106004  
-0.5357561883  
-0.5116476293  
-0.4903764805  
-0.4700255847  
-0.4479066423  
-0.420962042  
-0.3863625271  
-0.3421950626  
-0.2881075521  
-0.2257509564  
-0.1589153046  
-0.0932698412  
-0.03570302255  
0.006674484794  
0.02772947638  
0.02353390994  
-0.006599999789  
-0.05947081652  
-0.1278787233  
-0.2011385707  
-0.2661970881  
-0.3092396387  
-0.3175791558  
-0.2815606335  
-0.1961985302  
-0.06227505062  
0.1132855226  
0.317879363  
0.5344855022  
0.7436011084  
0.9255989124  
1.06320944  
1.143784216  
1.161035716  
1.116012926  
1.017170698  
0.8795083332  
0.7228973163  
0.5698052881  
0.4427109197  
0.3615499803  
0.3414997808  
0.3913648561  
0.5127411579  
0.7000046664  
0.9410846287  
1.218861194  
1.512983613  
1.801859751  
2.064582554  
2.282606981  
2.441034038  
2.529438216  
2.542234132  
2.47863209  
2.342247825  
2.14047927  
1.883717433  
1.584482523  
1.25654565  
0.9140730368  
0.5708305212  
0.2394665512  
-0.06909377808  
-0.3461429885  
-0.5855285948  
-0.7838332584  
-0.9403758876  
-1.0570342  
-1.137898051  
-1.188780931  
-1.21663058  
-1.228885939  
-1.232836164  
-1.235039913  
-1.240846911  
-1.254062379  
-1.276772524  
-1.309339161  
-1.350547665  
-1.397881195  
-1.447890074  
-1.496609679  
-1.539978145  
-1.574233811  
-1.596235771  
-1.603704908  
-1.595365893  
-1.570981593  
-1.531277367  
-1.477763869  
-1.412466291  
-1.337576353  
-1.255064306  
-1.166297536  
-1.071719236  
-0.9706538429  
-0.86130109  
-0.7409451719  
-0.6063993623  
-0.4546422346  
-0.2835813944  
-0.0928167009  
0.1156986784  
0.3372509934  
0.5642904252  
0.7867606551  
0.9928134419  
1.169858532  
1.305824473  
1.390477669  
1.416639708  
1.381132447  
1.285333726  
1.135266096  
0.9411894471  
0.7167480529  
0.4777508972  
0.2407260195  
0.02140253882  
-0.1667315955  
-0.3136219609  
-0.4134990014  
-0.4652802876  
-0.4725000834  
-0.4427754863  
-0.3868631504  
-0.3174072268  
-0.2475032921  
-0.1892321991  
-0.1523033149  
-0.1429568274  
-0.1632320579  
-0.2106909007  
-0.2786243488  
-0.3567310032  
-0.432205165  
-0.4911230998  
-0.5199875388  
-0.5072714948  
-0.4447856213  
-0.32872552  
-0.1602769626  
0.05430247651  
0.3041348515  
0.5746601032  
0.8489740658  
1.109399957  
1.339124029  
1.523705266  
1.652293275  
1.718413815  
1.720255852  
1.660452383  
1.545414845  
1.384333232  
1.188007159  
0.9676753306  
0.7339942691  
0.4963067822  
0.2622504307  
0.03773350701  
-0.1727876924  
-0.3658181858  
-0.5382610159  
-0.6869051044  
-0.8080970724  
-0.8976678731  
-0.951157313  
-0.9643155843  
-0.9338101535  
-0.8580292938  
-0.73786293  
-0.5773034837  
-0.3837628798  
-0.168002042  
0.05636958751  
0.273819892  
0.4681817476  
0.6241873637  
0.7290695006  
0.7740558733  
0.7555368479  
0.6757308482  
0.5427152172  
0.3697539122  
0.1739541467  
-0.02562383759  
-0.2101897569  
-0.363501233  
-0.4738817976  
-0.5356904902  
-0.5500046443  
-0.5243856186  
-0.4717254543  
-0.4083127857  
-0.3513696127  
-0.316420329  
-0.3148680447  
-0.3521643771  
-0.4268438996  
-0.5306125169  
-0.6494791045  
-0.7657924366  
-0.8608857207  
-0.9179382881  
-0.9246233637  
-0.875131265  
-0.7712515558  
-0.6223301465  
-0.4440939743  
-0.2565013132  
-0.08092301476  
0.06291712588  
0.1597982608  
0.2012048715  
0.1865633802  
0.1232936407  
0.02568984385  
-0.0872234881  
-0.194514958  
-0.2764318906  
-0.3172657983  
-0.3075675506  
-0.2453774386  
-0.136298366  
0.007574490138  
0.1696789357  
0.3316148725  
0.4759542924  
0.5887727062  
0.6615216087  
0.6919618423  
0.6840569592  
0.6468941443  
0.5928428654  
0.5353022953  
0.4864053279  
0.4550550377  
0.4455925626  
0.4572662989  
0.4845416107  
0.5181586527  
0.5467276869  
0.5585806673  
0.5435923434  
0.4946921348  
0.4088762828  
0.2876021593  
0.1365630856  
-0.03507784097  
-0.2158368622  
-0.3932647421  
-0.5552984575  
-0.6914529157  
-0.7937195941  
-0.8571112946  
-0.8798381404  
-0.8631495939  
-0.8109182583  
-0.7290489925  
-0.6247929514  
-0.506058046  
-0.3807627505  
-0.256275327  
-0.138971512  
