-0.2197892544  
0.7448295736  
1.653359603  
2.453966615  
3.106046886  
3.584047725  
3.879360144  
4.000117454  
3.969015524  
3.819570359  
3.591381597  
3.325106722  
3.057802873  
2.819209265  
2.629353881  
2.497658971  
2.423479675  
2.397853083  
2.406050952  
2.430512642  
2.453695976  
2.460481829  
2.439857842  
2.385763028  
2.297111166  
2.177110961  
2.032122454  
1.870276967  
1.70012966  
1.529529465  
1.364845858  
1.210591417  
1.069417397  
0.9423944718  
0.8294519777  
0.7298571352  
0.6426226468  
0.5667697374  
0.5014359861  
0.445828347  
0.399093249  
0.3601589312  
0.3276189237  
0.2997136195  
0.2744138165  
0.2496052028  
0.2233249124  
0.1940066787  
0.1606607078  
0.1229621755  
0.08121964418  
0.03622139284  
-0.01099104078  
-0.05938627141  
-0.1081816252  
-0.1570052757  
-0.2059386696  
-0.2554448656  
-0.3061700001  
-0.3586851393  
-0.4132086531  
-0.4693714171  
-0.5260840155  
-0.5815446875  
-0.6333912301  
-0.6789880152  
-0.7158028463  
-0.7418194461  
-0.7559107169  
-0.7581239713  
-0.7498181622  
-0.7336322251  
-0.7132818469  
-0.6932001899  
-0.6780827247  
-0.6723641102  
-0.6797251293  
-0.7026578401  
-0.7421586751  
-0.7975678569  
-0.8665814241  
-0.9454117286  
-1.029099051  
-1.111917835  
-1.187854262  
-1.251113282  
-1.296595596  
-1.32032891  
-1.319800935  
-1.294183441  
-1.24441767  
-1.173161307  
-1.084593365  
-0.9840970561  
-0.8778380861  
-0.7722712265  
-0.6736169881  
-0.5873540934  
-0.5177660462  
-0.4675987409  
-0.4378586348  
-0.4277795575  
-0.434969534  
-0.455717564  
-0.4854346785  
-0.5191700099  
-0.5521343268  
-0.580169151  
-0.6000877183  
-0.6098399659  
-0.6084986833  
-0.5960554038  
-0.5730878574  
-0.5403572573  
-0.4984300972  
-0.447397711  
-0.3867689355  
-0.3155749485  
-0.2326682897  
-0.1371791316  
-0.02903013953  
0.09060183729  
0.2189879941  
0.3518197982  
0.4834912505  
0.6076903187  
0.7182199989  
0.8099357531  
0.8796164177  
0.9266142734  
0.9531155812  
0.9639355711  
0.9658171941  
0.9663060374  
0.9723643829  
0.9889266562  
1.017675318  
1.056256179  
1.098139182  
1.133228567  
1.14920137  
1.13344062  
1.075301629  
0.9683660461  
0.8123104565  
0.6140181088  
0.3876573373  
0.15358879  
-0.06388275843  
-0.2396887292  
-0.3517149056  
-0.3845495845  
-0.3326784978  
-0.2025586709  
-0.01314688592  
0.2053760372  
0.4146750881  
0.5728421115  
0.6399437359  
0.5838018996  
0.3851720464  
0.04151059793  
-0.4313085946  
-0.9997161058  
-1.615631424  
-2.221772179  
-2.758413319  
-3.170675644  
-3.415336922  
-3.466181048  
-3.317149013  
-2.982848291  
-2.496397889  
-1.904949987  
-1.26358175  
-0.628454261  
-0.05020102668  
0.4315757483  
0.7920169336  
1.022548859  
1.130211927  
1.135041254  
1.066010069  
0.9562297966  
0.8381118972  
0.7391686623  
0.6789486549  
0.6674262605  
0.7048969489  
0.7832335361  
0.8881776552  
1.002226841  
1.107631535  
1.189075143  
1.235676428  
1.242114365  
1.208806281  
1.141223547  
1.048558392  
0.9419876564  
0.8328731396  
0.7311393002  
0.6440798234  
0.5757021053  
0.5266516449  
0.4946564395  
0.4753574273  
0.4633402522  
0.4531895451  
0.4403814419  
0.421896444  
0.3964821711  
0.3645650355  
0.3278766426  
0.2888832195  
0.250158823  
0.2138041558  
0.1810280218  
0.1519365232  
0.1255576177  
0.1000653504  
0.0731502332  
0.04244860147  
0.005945716427  
-0.03771494318  
-0.08906976406  
-0.1478352836  
-0.2130575777  
-0.2833520433  
-0.3571838725  
-0.4331132554  
-0.5099481044  
-0.5867668988  
-0.6628210407  
-0.7373259867  
-0.8092177115  
-0.8769375779  
-0.9383135943  
-0.9905984431  
-1.030679904  
-1.055451379  
-1.062286383  
-1.049538038  
-1.01696665  
-0.965995961  
-0.8997489335  
-0.8228072125  
-0.7407318781  
-0.6593923399  
-0.5842056134  
-0.519411682  
-0.4674952883  
-0.4288558337  
-0.4017993652  
-0.3828481416  
-0.3673409258  
-0.350219604  
-0.3268957433  
-0.2940401822  
-0.2501715417  
-0.195946486  
-0.1340961765  
-0.0690092238  
-0.006037291452  
0.04937410392  
0.09258239295  
0.120529331  
0.1322637983  
0.1291397377  
0.1146371483  
0.09383225125  
0.07261310149  
0.05674635779  
0.05095885368  
0.05816667423  
0.07898437457  
0.1115834574  
0.1519406962  
0.1944287219  
0.2326711282  
0.2605233246  
0.2730317072  
0.267220218  
0.2425741427  
0.2011306772  
0.1471708471  
0.08653073282  
0.0256643033  
-0.02941519444  
-0.07412870463  
-0.1060892571  
-0.1254931862  
-0.1350649145  
-0.1395463889  
-0.1448137717  
-0.1567571887  
-0.1801102582  
-0.2174344193  
-0.268438493  
-0.3297622073  
-0.3952766972  
-0.4568670742  
-0.5055829277  
-0.5329765778  
-0.5324195355  
-0.5001950757  
-0.4361768584  
-0.3440151173  
-0.2307710266  
-0.1060777914  
0.01906498803  
0.133667085  
0.2281233626  
0.2953606854  
0.331636653  
0.336865223  
0.3144563738  
0.2707078009  
0.2138509278  
0.1529109121  
0.09653548274  
0.0519627524  
0.02425898032  
0.01590444004  
0.02675464015  
0.05434231816  
0.09444167054  
0.1417776624  
0.1907677606  
0.2361810996  
0.2736358561  
0.2998966217  
0.3129683212  
0.3120307533  
0.2972598653  
0.2696183516  
0.2306598381  
0.1823918837  
0.127199775  
0.06782914693  
0.007370140746  
-0.05077921907  
-0.1030183604  
-0.1457385739  
-0.1755989694  
-0.1898572812  
-0.1867055123  
-0.1655464175  
-0.1271629924  
-0.07371856228  
-0.008595573983  
0.06393370369  
0.1391496203  
0.2123666461  
0.2793834336  
0.3368131458  
0.3822437021  
0.4142133281  
0.4320019028  
0.4353061587  
0.4238821679  
0.3972447296  
0.3545126012  
0.294453982  
0.2157594412  
0.1174975983  
-0.000324134295  
-0.1361945019  
-0.2866668251  
-0.4461792371  
-0.6071911338  
-0.7606796463  
-0.8969537676  
-1.006684998  
-1.082008239  
-1.117530263  
-1.111083301  
-1.064091962  
-0.9815081953  
-0.8713007151  
-0.7435863069  
-0.6095242649  
-0.4801250141  
-0.3651368106  
-0.2721280156  
-0.2058749746  
-0.1680793558  
-0.1574176311  
-0.1698745997  
-0.1992855094  
-0.2379978571  
-0.2775868493  
-0.3095467997  
-0.325931262  
-0.3199163665  
-0.2862834911  
-0.2218412423  
-0.1257582833  
0.0001739416075  
0.1514070805  
0.3206506227  
0.4981048357  
0.6719424056  
0.8290680669  
0.9561407364  
1.040798324  
1.072985789  
1.04622462  
0.9586660306  
0.8137533778  
0.6203390725  
0.3921797897  
0.1468031402  
-0.09617175351  
-0.3170740322  
-0.4983461499  
-0.6265241734  
-0.6937799846  
-0.6987710448  
-0.6466733588  
-0.5483746281  
-0.4189297865  
-0.2755032401  
-0.1350853418  
-0.01230884625  
0.0823171372  
0.1435294038  
0.1716427962  
0.172062004  
0.1540971108  
0.129259025  
0.1093101392  
0.1043736735  
0.1213803975  
0.1630677387  
0.2276951393  
0.3094805009  
0.3996966391  
0.488246533  
0.5654554947  
0.623804452  
0.6593166903  
0.6723623043  
0.6677351366  
0.6539593527  
0.6418980368  
0.6428475447  
0.6663883052  
0.7183031573  
0.7988858876  
0.9019299204  
1.014575554  
1.118130194  
1.189803728  
1.205202125  
1.141308436  
0.9795929909  
0.7088737976  
0.3275316894  
-0.155229013  
-0.7193127355  
-1.334943298  
-1.965092723  
-2.568904482  
-3.105729457  
-3.539325221  
-3.841655971  
-3.995824401  
-3.997715573  
-3.85612051  
-3.591329756  
-3.232378177  
-2.813348098  
-2.369252741  
-1.932071151  
-1.527465986  
-1.172590137  
-0.8751940285  
-0.6340513092  
-0.4405076345  
-0.2808330404  
-0.1389466873  
0.0008977556788  
0.1518326779  
0.3227530137  
0.5174634224  
0.7345808186  
0.9680683132  
1.208217853  
1.442884039  
1.658777758  
1.842702086  
1.982639389  
2.068671573  
2.093734033  
2.054199445  
1.950305384  
1.786369859  
1.570768536  
1.315591161  
1.035952945  
0.7489494292  
0.4723070894  
0.2228552132  
0.01497878699  
-0.1407421861  
-0.2385219331  
-0.2778396849  
-0.2633038714  
-0.2039388242  
-0.1119675481  
-0.001278778601  
0.1142340803  
0.222225639  
0.3131672908  
0.381173477  
0.4243270238  
0.4444874568  
0.4466382402  
0.4379002256  
0.4263334992  
0.4196819067  
0.4242159178  
0.4437826525  
0.4791765889  
0.5278877044  
0.5842622819  
0.6400803183  
0.6854846099  
0.7102095916  
0.704950102  
0.6627421069  
0.5801582087  
0.4581514803  
0.3023779865  
0.1229068926  
-0.06671526536  
-0.2509765793  
-0.4143236637  
-0.5432366081  
-0.6281542904  
-0.6649272128  
-0.6555358025  
-0.6078925696  
-0.5347197156  
-0.4516218152  
-0.3746370085  
-0.3176614911  
-0.2901604326  
-0.2955780166  
-0.3307188097  
-0.3862488315  
-0.4482435331  
-0.5005737144  
-0.5277375551  
-0.517691097  
-0.4642161435  
-0.3684253214  
-0.2391463995  
-0.09208040488  
0.05216089821  
0.1708701977  
0.2425117177  
0.2499557078  
0.1831906597  
0.04110788735  
-0.1679368113  
-0.4268824712  
-0.7119522594  
-0.9956068037  
-1.250018022  
-1.450576207  
-1.578903606  
-1.624957852  
-1.587921104  
-1.475813436  
-1.303924126  
-1.092381555  
-0.8632615856  
-0.6377288594  
-0.4336132036  
-0.2637528959  
-0.1352527981  
-0.04964846657  
-0.003794413848  
0.008775351949  
-0.0036528912  
-0.03234116389  
-0.06913083638  
-0.1070461456  
-0.1404833906  
-0.1651057967  
-0.1776043944  
-0.1754639141  
-0.1568673594  
-0.1207665308  
-0.06709122995  
0.002982991479  
0.08683182648  
0.1803250512  
0.2780034252  
0.3734739415  
0.4599891636  
0.5311154662  
0.5813869315  
0.6068327539  
0.6053195368  
0.5766608111  
0.5225180144  
0.4461335663  
0.3519750071  
0.2453519328  
0.1320750499  
0.01817614447  
-0.09030423882  
-0.1874925597  
-0.2678559096  
-0.3264256084  
-0.3590759282  
-0.3628716623  
-0.3364440885  
-0.2803435784  
-0.1972987616  
-0.09230817991  
0.02747860544  
0.1531345141  
0.2745651192  
0.3813292521  
0.4635935525  
0.513139732  
0.5243200293  
0.4948612891  
0.4264149078  
0.3247754687  
0.1997047592  
0.06433467064  
-0.06584959079  
-0.1743863474  
-0.2454943052  
-0.2658609574  
-0.226399476  
-0.1237742745  
0.0385067257  
0.2496262898  
0.4917637311  
0.7412478991  
0.9705461289  
1.150956055  
1.255754828  
1.263463449  
1.160818478  
0.9450262334  
0.6249368388  
0.2208830098  
-0.2369020216  
-0.7111762757  
-1.161581949  
-1.549068294  
-1.84026545  
-2.011227349  
-2.050036042  
-1.957897461  
-1.748621336  
-1.44656072  
-1.083359375  
-0.6939594506  
-0.3124660218  
0.03159649261  
0.316156098  
0.5282793671  
0.664555975  
0.7302326659  
0.7373538999  
0.7022383829  
0.6427123405  
0.5754920703  
0.5140554176  
0.4672318499  
0.4386184106  
0.4268166411  
0.4263664199  
0.4291713829  
0.4261920942  
0.4091312322  
0.3719058965  
0.3117201537  
0.2296283189  
0.1305510454  
0.02277329075  
-0.08298690351  
-0.1748186265  
-0.2410000823  
-0.271376234  
-0.2585716729  
-0.1989133211  
-0.09296832269  
0.05436298172  
0.2341910637  
0.4343927641  
0.6406792368  
0.8378648525  
1.011189438  
1.147546899  
1.23647541  
1.270809594  
1.246913185  
1.16451301  
1.026149305  
0.8363927467  
0.6009477124  
0.3258422766  
0.01683698638  
-0.3207932107  
-0.6820711826  
-1.06174166  
-1.453423588  
-1.848690159  
-2.236305004  
-2.601869399  
-2.928061064  
-3.195569322  
-3.384698699  
-3.477467284  
-3.459949638  
-3.324469159  
-3.071320335  
-2.709669396  
-2.257449693  
-1.740171025  
-1.188760367  
-0.636665444  
-0.1165912823  
0.3427209118  
0.7192577952  
0.9996992084  
1.180345944  
1.266918028  
1.27328431  
1.219316349  
1.128156586  
1.023281393  
0.9257054203  
0.8516941326  
0.8112208722  
0.8073281762  
0.8364289814  
0.8894482809  
0.9536065286  
1.014592544  
1.058806525  
1.075388093  
1.05776703  
1.004565906  
0.919752558  
0.8120507849  
0.69370496  
0.5787695022  
0.481145552  
0.4126316251  
0.3812132755  
0.3898275263  
0.4357514264  
0.5106945259  
0.6015906538  
0.6920206474  
0.7640756885  
0.8004819021  
0.7867198711  
0.7128924584  
0.5751222385  
0.3763002901  
0.1260732601  
-0.1599400756  
-0.4616369173  
-0.7564746664  
-1.021847015  
-1.237515905  
-1.387827633  
-1.463435719  
-1.462324062  
-1.389987121  
-1.258746349  
-1.086272852  
-0.8934955801  
-0.7021554426  
-0.5323151301  
-0.4001124867  
-0.3160535223  
-0.2840272716  
-0.3011476696  
-0.3584199717  
-0.442111852  
-0.5356380954  
-0.6216963251  
-0.6843775071  
-0.7110047642  
-0.6934727624  
-0.6289767474  
-0.5200582533  
-0.3740335473  
-0.2018835696  
-0.016800545  
0.1674375215  
0.3380495883  
0.4846104415  
0.6000515415  
0.6812001222  
0.7288193522  
0.7471879974  
0.7432619918  
0.725553498  
0.702847437  
0.6829194515  
0.6714067133  
0.6709737772  
0.6808865149  
0.6970745193  
0.7126843561  
0.719086449  
0.7072076468  
0.6690230241  
0.5989971564  
0.4952536196  
0.3602817016  
0.2010510105  
0.02848202987  
-0.1436829822  
-0.300464935  
-0.4274828891  
-0.5127738675  
-0.5483557016  
-0.5312940158  
-0.4641364295  
-0.3546420487  
-0.2148651581  
-0.05970816561  
0.09482957356  
0.233472043  
0.343301268  
0.4149993813  
0.4435486119  
0.4283423848  
0.3727307142  
0.2831314365  
0.1678705917  
0.03595313721  
-0.1040323054  
-0.2447467  
-0.3805514256  
-0.5075877555  
-0.6235111498  
-0.7270016845  
-0.8171807444  
-0.8930682343  
-0.953209071  
-0.9955326649  
-1.017477644  
-1.016345119  
-0.9898225935  
-0.9365601801  
-0.8567210419  
-0.7523891439  
-0.6277654183  
-0.4891203123  
-0.3444674814  
-0.2029957732  
-0.07429696355  
0.03253975666  
0.1098726671  
0.1523940011  
0.1578522216  
0.1274963745  
0.06618329023  
-0.01792276952  
-0.1140497567  
-0.2098720687  
-0.2928310204  
-0.3515659815  
-0.3772913236  
-0.364935525  
-0.3138733285  
-0.2281225362  
-0.1159554952  
0.01106894996  
0.139526865  
0.2558432928  
0.3480431952  
0.4073059018  
0.4290849139  
0.4136281257  
0.3658188667  
0.2943631677  
0.2104442443  
0.1260478854  
0.05220627509  
-0.002572064921  
-0.03347852935  
-0.03999851021  
-0.02587756048  
0.001546172899  
0.03251395753  
0.05634924832  
0.06306396272  
0.0448472192  
-0.002773666949  
-0.08025219822  
-0.1838872607  
-0.3062341422  
-0.436982952  
-0.5641675686  
-0.6755363902  
-0.7599231641  
-0.8084444737  
-0.8154232293  
-0.7789446496  
-0.7010144296  
-0.5873076251  
-0.4465587906  
-0.289630137  
-0.1283603731  
0.02570616195  
0.1625721123  
0.2748888215  
0.3587659943  
0.4141715723  
0.4448499879  
0.4577357071  
0.4619111396  
0.4672425923  
0.4828470453  
0.5156233214  
0.5690548283  
0.6424668665  
0.7308954613  
0.8255946773  
0.9151521764  
0.9870836189  
1.029686676  
1.033896698  
0.9948667545  
0.9130230196  
0.7944019047  
0.6501777286  
0.4954010089  
0.3470762795  
0.221817961  
0.1333876344  
0.09046238675  
0.09496022718  
0.1411837441  
0.2159789362  
0.2999259622  
0.3694808407  
0.3998572693  
0.36827414  
0.2572015663  
0.05716333793  
-0.2312976529  
-0.5967790769  
-1.01748365  
-1.462994575  
-1.897203484  
-2.282078648  
-2.58182646  
-2.766956103  
-2.817715946  
-2.726474883  
-2.498717063  
-2.152506544  
-1.716484062  
-1.226639192  
-0.7222805514  
-0.2417086234  
0.1818380882  
0.5234747738  
0.7688020384  
0.9146567552  
0.9684679719  
0.9463656047  
0.8703924448  
0.7652228101  
0.6548818461  
0.5598827816  
0.4951496061  
0.468905764  
0.4826076769  
0.5317970175  
0.6076550745  
