1476.876671  
1612.705567  
1908.292369  
2533.925975  
3547.837236  
7280.415633  
16819.92487  
84754.12958  
30537.87221  
37739.45803  
4761.295116  
39244.3534  
25302.74731  
7295.51251  
8439.717776  
27019.12135  
5113.60399  
29254.03253  
9630.183005  
3662.326534  
4223.589386  
12482.82555  
33910.99655  
152.1046966  
13551.37664  
3636.668606  
6633.234821  
3062.086672  
9211.084056  
5100.44689  
753.4478428  
11.88921977  
4450.645146  
4182.36321  
382.4023933  
1008.533714  
1578.009882  
100.1880733  
937.8006156  
1269.97622  
6704.968455  
2007.549001  
1146.674416  
1119.483427  
520.1088324  
1719.025784  
2599.63916  
7227.867318  
1370.657862  
445.122226  
268.8636756  
1767.078246  
1529.819855  
306.4631499  
1028.564933  
579.6034953  
101.2953486  
356.0863982  
997.5560536  
22.14058414  
187.0007562  
73.29334578  
10.54906646  
551.597039  
24.53672866  
66.30848589  
38.4192705  
26.90996664  
77.71797529  
43.82633756  
1.523083578  
35.32252896  
7.626229215  
1.346383942  
8.564885717  
1.148369389  
1.27495951  
0.3266644217  
0.9870170942  
2.809765109  
1.013520728  
1.515105813  
0.7908811825  
0.7910746606  
0.9777508299  
0.8593413649  
0.5852223713  
0.7472814316  
0.5512125152  
0.6000442395  
0.5087055927  
0.4860984327  
0.4739283151  
0.4692818455  
0.4663848037  
0.4071757926  
0.3872488892  
0.3785181806  
0.3512065369  
0.3218646017  
0.322620857  
0.3091338729  
0.2965497633  
0.2817846955  
0.2707064895  
0.2541069957  
0.2439722304  
0.2340089429  
0.2265553133  
0.2155076349  
0.2081355679  
0.1991879496  
0.1922702207  
0.1857145848  
0.1786179213  
0.1717040085  
0.1661905563  
0.1603212558  
0.1543033196  
0.149340295  
0.1441644808  
0.139440012  
0.1347006012  
0.1303188279  
0.1260712661  
0.1221877495  
0.1183171179  
0.1146720119  
0.1111563115  
0.1078521857  
0.1046193075  
0.1015420542  
0.09861205101  
0.09576749899  
0.09305527031  
0.09043913727  
0.08794351492  
0.08553335963  
0.08320440004  
0.08097793668  
0.07883516247  
0.0767568324  
0.07477363638  
0.07285396934  
0.07100450259  
0.06922163548  
0.0675056231  
0.06584686802  
0.06424678725  
0.06269946523  
0.06120635816  
0.05976168792  
0.05836973459  
0.0570242468  
0.05571584986  
0.05445463806  
0.05323554515  
0.05205558102  
0.05090898235  
0.04980295555  
0.04872963083  
0.04769122706  
0.04668188413  
0.04570519543  
0.04475346765  
0.04383734522  
0.04294528104  
0.04207888538  
0.0412368709  
0.04042191486  
0.03962761117  
0.03885886971  
0.03810978122  
0.03738376786  
0.03667569186  
0.03598755623  
0.03532113515  
0.03467051274  
0.03403943594  
0.03342277626  
0.03282227638  
0.03223968381  
0.03167448567  
0.03111923115  
0.03058017418  
0.03005682273  
0.02954454589  
0.02904581233  
0.02856096491  
0.02808636979  
0.02762490514  
0.02717408371  
0.02673716488  
0.02630822255  
0.02589033293  
0.02548264295  
0.02508306474  
0.02469492815  
0.02431505363  
0.02394504924  
0.02358094531  
0.02322938424  
0.02288373282  
0.02254487743  
0.02221631127  
0.02189321367  
0.02157874563  
0.02127087693  
0.02096840246  
0.02067337781  
0.02038521647  
0.02010267557  
0.01982836101  
0.01955658729  
0.0192935033  
0.01903335658  
0.01878136172  
0.01853348686  
0.01829007953  
0.01805275886  
0.01782089672  
0.01759403062  
0.0173695877  
0.01715190477  
0.01693697068  
0.01672789237  
0.01652258714  
0.01632050952  
0.01612329507  
0.01592911723  
0.0157390547  
0.01555283364  
0.01537075059  
0.01519193232  
0.01501522068  
0.01484333727  
0.01467651692  
0.01450862815  
0.01434549601  
0.01418570536  
0.01402989917  
0.01387625772  
0.01372595084  
0.01357600426  
0.01343140028  
0.01328798266  
0.01314820255  
0.01301089442  
0.01287551798  
0.01274351174  
0.01261136354  
0.01248279035  
0.01235785534  
0.01223281433  
0.01211196429  
0.01199271092  
0.01187493877  
0.01175983223  
0.0116471977  
0.01153482474  
0.01142608926  
0.01131752157  
0.01121181752  
0.01110715678  
0.01100535617  
0.01090396358  
0.01080566761  
0.01070724165  
0.01061138449  
0.01051719476  
0.01042380466  
0.01033339325  
0.01024351657  
0.01015508724  
0.01006759702  
0.009982469638  
0.009897433325  
0.009815432544  
0.009732474373  
0.009654494552  
0.009574582623  
0.009496841761  
0.009420869151  
0.009344150207  
0.009269014839  
0.00919758573  
0.009125210336  
0.009054275644  
0.008983904554  
0.008914959271  
0.008848024262  
0.008781938258  
0.008715869608  
0.008650433191  
0.008587212822  
0.008524515885  
0.008462828046  
0.008400736214  
0.008342282499  
0.008281857898  
0.008223136978  
0.008166465892  
0.008109211164  
0.008053218635  
0.007998041197  
0.00794387541  
0.007890653614  
0.007837977823  
0.007784779269  
0.007734717104  
0.007684943347  
0.007633845115  
0.007586065077  
0.007536871483  
0.007489500082  
0.007441788542  
0.007395915594  
0.007350219926  
0.007305172304  
0.007261087874  
0.007217661093  
0.007173492217  
0.007130020116  
0.007089146685  
0.007048341019  
0.007006536772  
0.006966419605  
0.006926224372  
0.006886951653  
0.006848532512  
0.006810382011  
0.006772190808  
0.006734707973  
0.006698898852  
0.006661523321  
0.00662678233  
0.006591967271  
0.006556455193  
0.006521280367  
0.006488925057  
0.006456024274  
0.006422292873  
0.006390084007  
0.00635704093  
0.006326396445  
0.006294798452  
0.006264823323  
0.006234244224  
0.006204273531  
0.006174240778  
0.006145195939  
0.006115887479  
0.006088197945  
0.006060009209  
0.006033121346  
0.006005207592  
0.005978510242  
0.005951968197  
0.005925232359  
0.005898959502  
0.005874029262  
0.00584948783  
0.005824422841  
0.005799508277  
0.005775162247  
0.005751384146  
0.005728326996  
0.005704930136  
0.005681885985  
0.005658498781  
0.005636415321  
0.005614642895  
0.005593973001  
0.005571774346  
0.005550414081  
0.005529739049  
0.00550946304  
0.00548870536  
0.005468621358  
0.005449205288  
0.005429223198  
0.00541050918  
0.005392414577  
0.005373387209  
0.005353957219  
0.005335629381  
0.005318469427  
0.005300789444  
0.005282460066  
0.005265943252  
0.005248403421  
0.005231922667  
0.005215998445  
0.005199359609  
0.005183336586  
0.005166808224  
0.005152438711  
0.005136381475  
0.00512145993  
0.005106474597  
0.005091249818  
0.00507686893  
0.00506210719  
0.005049309902  
0.005035235629  
0.005021327104  
0.005007880511  
0.004994460131  
0.004981730884  
0.004969346514  
0.004956300718  
0.004943492294  
0.004931276252  
0.004919924962  
0.004907727053  
0.004895190074  
0.004883914108  
0.004872493447  
0.004860798663  
0.004850287151  
0.004839384298  
0.004829607486  
0.004818381647  
0.004808859246  
0.004798463073  
0.004788817081  
0.004778211881  
0.004769468931  
0.004759634702  
0.004750622855  
0.004742462425  
0.004732585416  
0.004724074752  
0.004715849779  
0.004707370368  
0.004699139108  
0.004690535077  
0.004682303744  
0.004675102917  
0.004667119113  
0.00465977864  
0.004653969108  
0.004645570563  
0.00463806727  
0.004631466809  
0.004625713668  
0.004619406221  
0.004612532878  
0.00460556184  
0.004599524284  
0.004592819136  
0.004588096176  
0.004582053397  
0.004577048061  
0.004571850366  
0.004566097658  
0.004561101949  
0.004556690581  
0.004551592066  
0.00454671288  
0.004542429196  
0.004537946761  
0.004534596342  
0.004529065541  
0.00452518376  
0.004521798855  
0.004518053925  
0.004514999618  
0.004510233904  
0.004507600238  
0.004505285442  
0.004502069696  
0.004498513233  
0.004496370287  
0.004493599032  
0.004491052913  
0.004488299418  
0.004486158336  
0.004484906693  
0.004482361622  
0.004480761855  
0.004480214159  
0.004478585448  
0.004476854502  
0.004474856683  
0.004473978619  
0.00447227487  
0.004472445214  
0.004471572409  
0.004470906944  
0.004469898521  
0.004470750097  
0.004470380103  
0.004470369968  
