584.1535272  
604.5337553  
657.6667634  
787.7974107  
957.5849702  
1635.709913  
3231.171914  
56622.7219  
39761.89158  
5369.612533  
6180.898671  
1340.041866  
35803.38316  
12461.08495  
5976.58796  
39623.34684  
4191.773182  
5156.491716  
8642.580627  
37101.09337  
26175.04839  
1988.704215  
10044.97911  
15730.64455  
2442.750698  
20106.26747  
18534.7815  
3552.963872  
3610.499208  
319.5487697  
2518.450534  
5040.700615  
1231.921021  
8426.544427  
1273.145005  
3885.481034  
2574.29156  
2843.433753  
6459.882432  
3170.833121  
1227.063475  
4425.096072  
6391.22582  
15690.14088  
61.31192676  
5086.146094  
572.3670253  
2949.01204  
2202.952664  
3256.436208  
3570.453039  
4442.405651  
13233.59577  
999.9137122  
27.2530741  
2920.649687  
279.2225958  
5993.082457  
2441.815454  
64.21300934  
1362.727208  
635.5465254  
1289.708685  
496.6417874  
108.3077438  
62.61164918  
61.11529236  
24.85304278  
21.92715364  
146.1190841  
69.73040449  
22.53692945  
85.07834449  
50.41020361  
1.257375781  
12.42607449  
59.52619515  
16.92598127  
17.6302418  
23.07696883  
15.81638905  
15.68934307  
15.85101886  
16.28979507  
15.43170554  
16.44348155  
13.11684951  
12.48956083  
11.68213308  
12.54233236  
11.19673601  
10.41150739  
9.84255425  
9.663722872  
8.987562137  
8.532237193  
8.382789106  
7.99819811  
7.808558916  
7.441170584  
7.111536533  
6.807608594  
6.503931189  
6.230609118  
6.066856703  
5.842347736  
5.635447251  
5.402209446  
5.241796325  
5.059389386  
4.882632846  
4.710542285  
4.556281461  
4.411634692  
4.271596998  
4.132442851  
4.00205743  
3.877965267  
3.758363026  
3.644632412  
3.536336772  
3.432811134  
3.335104094  
3.239331534  
3.148499532  
3.059081293  
2.975448168  
2.894983034  
2.816905438  
2.742704381  
2.670604605  
2.601740162  
2.535337231  
2.471564162  
2.40995274  
2.350597866  
2.293429359  
2.238225775  
2.185118708  
2.133682156  
2.084070254  
2.036257016  
1.990031698  
1.945275758  
1.902096595  
1.860293318  
1.819873173  
1.780753157  
1.742871213  
1.706225112  
1.670720227  
1.636337214  
1.6029926  
1.570686809  
1.539345938  
1.508961877  
1.479499101  
1.450889914  
1.42312498  
1.396173002  
1.370004301  
1.34455448  
1.319835477  
1.295824038  
1.272450753  
1.249767211  
1.227689637  
1.206217505  
1.185331007  
1.164973534  
1.145191526  
1.125914773  
1.107152045  
1.088886955  
1.071073294  
1.053722157  
1.036790706  
1.020296098  
1.004250544  
0.98855955  
0.9732699912  
0.9583472175  
0.9438067535  
0.9295956511  
0.9157319049  
0.9022091381  
0.8889735917  
0.8760840014  
0.8634804603  
0.8511604074  
0.8391277113  
0.8273947708  
0.8158767616  
0.8046677693  
0.793683615  
0.782937999  
0.7724277015  
0.7621608826  
0.7521155991  
0.7422934529  
0.7326756049  
0.7232589147  
0.714032853  
0.7050236199  
0.696188488  
0.6875394082  
0.6790765601  
0.6707664534  
0.6626547091  
0.6547011147  
0.6468809851  
0.6392489604  
0.6317528998  
0.6244011693  
0.6172015188  
0.6101334817  
0.6032300965  
0.596445144  
0.5897741948  
0.5832468475  
0.5768370497  
0.5705677143  
0.5644024437  
0.5583413066  
0.5524104753  
0.5465785122  
0.5408483843  
0.5352309845  
0.5297137187  
0.5243048301  
0.5189775395  
0.5137630793  
0.5086303822  
0.503583829  
0.4986581537  
0.4937911677  
0.488999447  
0.4842918735  
0.4796863112  
0.4751408052  
0.4706893876  
0.4663132278  
0.4620087353  
0.4577705479  
0.4536010874  
0.44950285  
0.4454703489  
0.4415221979  
0.4376123664  
0.433797256  
0.4300172899  
0.4263038628  
0.4226642245  
0.4190685505  
0.4155433083  
0.4120611227  
0.408637978  
0.4052867033  
0.4019677748  
0.3986899831  
0.3954773877  
0.3923249271  
0.3892082803  
0.3861360622  
0.3831260158  
0.3801490183  
0.3772335949  
0.374341469  
0.3714961632  
0.3687034304  
0.3659298557  
0.3632260436  
0.36055404  
0.357924147  
0.3553278098  
0.3527532564  
0.3502563427  
0.347758759  
0.3453209446  
0.342892953  
0.3405251187  
0.3381857415  
0.3358637177  
0.333597216  
0.3313516326  
0.3291333384  
0.3269596298  
0.3247934641  
0.3226841691  
0.3205948161  
0.3185307728  
0.3164924299  
0.3144901336  
0.3125146498  
0.3105560735  
0.308634077  
0.3067381994  
0.3048599715  
0.3030165957  
0.3011888337  
0.2993980016  
0.297618974  
0.2958740884  
0.2941494672  
0.2924491673  
0.2907690033  
0.289112838  
0.2874727631  
0.2858644211  
0.2842682989  
0.2826966379  
0.2811513015  
0.2796105517  
0.2781020492  
0.2766067214  
0.2751473545  
0.2736810979  
0.2722581607  
0.2708460455  
0.2694448427  
0.268060347  
0.2667027339  
0.2653598533  
0.2640426713  
0.2627310635  
0.2614322903  
0.2601512  
0.2589019519  
0.2576478256  
0.2564295142  
0.2552175487  
0.2540212357  
0.2528422468  
0.2516766056  
0.2505165126  
0.2493818201  
0.2482570708  
0.2471463629  
0.2460555435  
0.2449771524  
0.243910336  
0.2428503185  
0.2418065645  
0.2407753321  
0.2397670644  
0.2387715013  
0.2377748896  
0.2367989703  
0.2358262611  
0.2348798531  
0.2339317064  
0.2330113892  
0.2320859904  
0.2311849823  
0.2302852888  
0.2294041651  
0.2285310998  
0.2276662916  
0.2268173385  
0.2259817255  
0.2251540966  
0.2243364146  
0.2235249528  
0.2227251975  
0.2219464698  
0.2211594468  
0.2203865926  
0.2196324142  
0.2188813544  
0.2181332911  
0.2174112088  
0.2166901311  
0.215982084  
0.2152819185  
0.2145904056  
0.2138914238  
0.213225262  
0.2125460392  
0.2118882738  
0.211243412  
0.2105968116  
0.2099603263  
0.2093453859  
0.2087300932  
0.2081165589  
0.2075136739  
0.2069239485  
0.2063428581  
0.2057643241  
0.2051867971  
0.204632269  
0.2040704514  
0.2035304824  
0.2029848201  
0.2024525734  
0.2019299217  
0.2014025196  
0.2009030221  
0.2004002583  
0.199905391  
0.1994167409  
0.1989334289  
0.1984577566  
0.1979920226  
0.197521168  
0.1970640266  
0.1966095968  
0.1961725175  
0.1957354358  
0.1953033098  
0.1948834949  
0.1944685071  
0.1940630872  
0.1936534576  
0.1932528347  
0.19285881  
0.1924810563  
0.1920908909  
0.1917194795  
0.191355843  
0.1909848713  
0.1906279884  
0.1902805072  
0.189935318  
0.1895993805  
0.1892702437  
0.1889356947  
0.188614809  
0.1883044184  
0.1879878523  
0.1876862201  
0.1873875001  
0.1870896852  
0.1868046119  
0.1865207781  
0.1862397737  
0.185968791  
0.1857099807  
0.1854387705  
0.1851773962  
0.18493032  
0.184680394  
0.1844391164  
0.1842066044  
0.1839690976  
0.1837389701  
0.1835285672  
0.1833043021  
0.1831001872  
0.1828856618  
0.1826871807  
0.1824988673  
0.1823055879  
0.1821187936  
0.1819358194  
0.1817574189  
0.1815840368  
0.1814116635  
0.1812592102  
0.1811007754  
0.1809430315  
0.1807958214  
0.1806491899  
0.1805131208  
0.1803803567  
0.1802527223  
0.1801246952  
0.18000343  
0.1798918338  
0.1797784473  
0.1796729036  
0.1795687951  
0.1794777165  
0.179376885  
0.179289962  
0.1792115971  
0.1791343253  
0.179051843  
0.1789947744  
0.1789186489  
0.1788597807  
0.1788021098  
0.1787550835  
0.1787004886  
0.1786634833  
0.1786267179  
0.1785957158  
0.1785608509  
0.1785466904  
0.1785195994  
0.1784987265  
0.1784945211  
0.1784854305  
0.1784869791  
