8.77167178  
8.040505939  
6.078585408  
0.4681032548  
30.39434743  
1640.35887  
12491.78223  
17250.49639  
14175.46623  
4750.570611  
4442.240707  
20063.91446  
35325.49471  
6102.474932  
8208.770241  
2863.204398  
9127.417273  
27171.26731  
4702.009462  
4229.696588  
1938.052806  
21929.23768  
7127.93527  
8203.032031  
10082.69817  
2343.859551  
1370.241339  
41388.94184  
28898.70059  
31164.37083  
1462.994027  
47620.60194  
2532.666073  
552.3087744  
1288.584124  
936.6979114  
13202.40772  
2423.08076  
1230.669589  
9135.849499  
477.6262037  
1281.49132  
16323.00496  
460.620546  
10804.36413  
6483.162556  
2590.367426  
897.9174378  
2829.497387  
1393.890523  
804.6733573  
5496.251577  
5373.288754  
749.6854016  
2338.209149  
1304.688178  
620.642937  
7742.579146  
1596.751072  
1871.71578  
2007.711454  
21.48803507  
3194.453005  
8.23960635  
1302.613097  
131.0495288  
545.4465975  
206.22229  
61.10418826  
64.62667103  
299.5285684  
171.5919705  
272.7622475  
41.88744496  
52.34933084  
2.431223806  
13.17181412  
6.777047629  
9.449676447  
4.837637021  
16.61879324  
12.2775186  
14.37300303  
10.29039939  
9.669776601  
6.227766465  
7.197447203  
6.163605573  
7.285795354  
6.531917927  
6.479105743  
6.02321416  
5.548281388  
5.21065254  
4.800189979  
4.62513228  
4.321594166  
4.208858958  
3.963103123  
3.819945798  
3.584048202  
3.404138893  
3.247222891  
3.136451588  
3.014540209  
2.895876356  
2.767602928  
2.650849177  
2.525548801  
2.434161367  
2.334701711  
2.245556042  
2.164044349  
2.088312748  
2.015029892  
1.939716364  
1.870689244  
1.802154544  
1.741491902  
1.68136358  
1.628296146  
1.574649346  
1.525871782  
1.476172667  
1.431007875  
1.386090353  
1.344563018  
1.30390596  
1.266600774  
1.23003552  
1.195648787  
1.161820551  
1.129520294  
1.098337936  
1.068734289  
1.040202187  
1.013031405  
0.986741413  
0.9615892573  
0.9372990769  
0.9140599054  
0.8915561788  
0.8698697706  
0.8489756834  
0.8288591219  
0.8095323801  
0.7907920042  
0.7727458585  
0.7553271068  
0.7384970351  
0.7221927967  
0.7065210691  
0.6912866775  
0.6765955737  
0.6623615943  
0.6485905472  
0.6352793581  
0.6223703079  
0.6098511507  
0.5977250842  
0.5859920266  
0.5745870388  
0.5635433152  
0.5528318163  
0.5424215308  
0.532328481  
0.5225219977  
0.5129917527  
0.5037258277  
0.4947424485  
0.4859940484  
0.4775017112  
0.4692359305  
0.4611871774  
0.4533688121  
0.4457666007  
0.4383509699  
0.4311501341  
0.4241170447  
0.4172712923  
0.4106079994  
0.4041049988  
0.3977753368  
0.3916003119  
0.3855794091  
0.3797172661  
0.3740002789  
0.368404944  
0.3629640356  
0.3576329129  
0.352440304  
0.3473749503  
0.3424247283  
0.3375663191  
0.3328600095  
0.3282461039  
0.3237317469  
0.319320058  
0.3150141001  
0.3107910337  
0.3066850002  
0.3026522899  
0.2987103184  
0.2948537073  
0.2910982367  
0.2873977643  
0.2837809906  
0.2802545043  
0.276782639  
0.2733959941  
0.2700796399  
0.2668151591  
0.2636446734  
0.2605262871  
0.2574654372  
0.2544607911  
0.2515260558  
0.2486418761  
0.245831142  
0.2430628334  
0.2403540097  
0.2377056415  
0.2350921348  
0.2325335381  
0.2300226264  
0.2275677733  
0.2251456193  
0.2227738299  
0.2204476177  
0.2181610273  
0.2159242278  
0.2137281465  
0.2115653221  
0.2094368142  
0.2073595376  
0.2053070438  
0.2033052804  
0.201328758  
0.1993891884  
0.1974749328  
0.1956078947  
0.1937710267  
0.1919546105  
0.1901859334  
0.1884302845  
0.1867126753  
0.1850319128  
0.1833638887  
0.1817276933  
0.1801293835  
0.1785506653  
0.1769956315  
0.1754685567  
0.1739622043  
0.1724845497  
0.1710374958  
0.1696007714  
0.1681976374  
0.1668026637  
0.1654384253  
0.1641024312  
0.1627783338  
0.1614716816  
0.1602017608  
0.1589376994  
0.1576926404  
0.1564755295  
0.1552763174  
0.1540866984  
0.152918149  
0.1517670352  
0.1506371857  
0.1495242496  
0.1484219485  
0.1473408604  
0.1462701197  
0.1452292285  
0.1441902687  
0.1431751914  
0.1421718471  
0.1411789789  
0.1402007923  
0.13923719  
0.1382915434  
0.1373555747  
0.136434387  
0.1355241714  
0.134624218  
0.13373902  
0.1328791784  
0.1320209131  
0.1311755209  
0.130331226  
0.129518021  
0.1287086392  
0.1279024871  
0.1271176207  
0.1263401219  
0.1255732872  
0.124815765  
0.1240623775  
0.1233367889  
0.122602952  
0.1218985158  
0.1211879048  
0.1204829411  
0.1197977252  
0.1191181047  
0.1184476497  
0.1177817782  
0.1171350193  
0.1164898731  
0.1158496114  
0.1152329985  
0.1146093172  
0.1140017235  
0.1134023396  
0.1128028512  
0.1122178737  
0.1116397252  
0.111068673  
0.110496776  
0.109947888  
0.1093969145  
0.108851124  
0.1083148829  
0.1077865435  
0.1072626441  
0.1067427294  
0.106244372  
0.1057352552  
0.1052401084  
0.1047492678  
0.1042705987  
0.1037896627  
0.1033213343  
0.1028505348  
0.1023997782  
0.1019401336  
0.1014963866  
0.1010470931  
0.1006162909  
0.1001769737  
0.09975636431  
0.09933488348  
0.09892218722  
0.09851094238  
0.09810908407  
0.09770560441  
0.09731290853  
0.0969221355  
0.09653968815  
0.09615982065  
0.09578761614  
0.09541225852  
0.09505030977  
0.09468302117  
0.09432777372  
0.09398154785  
0.09362006758  
0.09328178146  
0.09294582998  
0.09261547543  
0.09227903616  
0.091949436  
0.09162707434  
0.09131159537  
0.09099687693  
0.09068887506  
0.09037988692  
0.09008290555  
0.08978422906  
0.08949566043  
0.08920155248  
0.08891051598  
0.08862638846  
0.08834542535  
0.08806498764  
0.0877940566  
0.08752970797  
0.08726445439  
0.08700125071  
0.08674266722  
0.08648825748  
0.08623334473  
0.08598696277  
0.08575041451  
0.08549799915  
0.08525928339  
0.08502628067  
0.08479504164  
0.08456062943  
0.08433808491  
0.08411758928  
0.08389027183  
0.08367680975  
0.0834625035  
0.083258145  
0.08304053236  
0.08283435827  
0.08263728805  
0.08243838016  
0.08224167304  
0.08204505294  
0.08185252654  
0.08166212082  
0.08147442074  
0.08129776846  
0.08112045973  
0.08093599829  
0.08076711947  
0.08059177139  
0.08042456279  
0.08024986589  
0.08008493406  
0.07991900372  
0.0797700165  
0.07960898389  
0.07945779709  
0.07930046416  
0.07915487794  
0.07901096995  
0.0788626327  
0.07871780263  
0.07857342407  
0.07844153419  
0.07830082289  
0.0781673321  
0.07803543211  
0.07791236385  
0.07778654447  
0.07765849221  
0.07754336877  
0.0774233627  
0.07730045079  
0.07719041945  
0.07707628091  
0.07696554891  
0.07685418552  
0.07675189806  
0.07665241526  
0.07654362627  
0.07644644141  
0.07634545052  
0.07624932898  
0.07615455075  
0.07606545566  
0.07598029287  
0.0758906374  
0.07580072919  
0.07572342127  
0.07563758452  
0.07556091329  
0.0754803244  
0.07540747453  
0.07533426446  
0.07525387685  
0.07519963598  
0.07512527407  
0.07506496738  
0.07499395434  
0.07493763865  
0.07488249827  
0.07482102016  
0.07476683669  
0.07471406067  
0.074659435  
0.07461512132  
0.07455914512  
0.07451848154  
0.07447468475  
0.0744312408  
0.07438866514  
0.0743552517  
0.07431480846  
0.07428320889  
0.07424958439  
0.07422474023  
0.07419095085  
0.07416118439  
0.07414202489  
0.07411733544  
0.07409165052  
0.07407408335  
0.07405469123  
0.07403965358  
0.07402375899  
0.07401462589  
0.07400610836  
0.07399595511  
0.07398998512  
0.07398849304  
0.07398141749  
0.07397888162  
