0.01122912572  
-0.4556649453  
-0.914891715  
-1.355196858  
-1.765333268  
-2.134627005  
-2.453634789  
-2.714835246  
-2.913258719  
-3.046945168  
-3.117147386  
-3.128207051  
-3.087083939  
-3.00257865  
-2.88432069  
-2.741672237  
-2.582686947  
-2.413301923  
-2.236876683  
-2.054183984  
-1.863852552  
-1.663220544  
-1.449460674  
-1.220807888  
-0.9776778939  
-0.7234779533  
-0.4649361133  
-0.2118700188  
0.02363093182  
0.2285272152  
0.3904631683  
0.4995046504  
0.5496811646  
0.5400997833  
0.4754101583  
0.3655057273  
0.2244733187  
0.06889309834  
-0.08426901441  
-0.2198884578  
-0.3266909731  
-0.3987336256  
-0.436126381  
-0.444861921  
-0.4357575454  
-0.4226466427  
-0.420072521  
-0.4408173099  
-0.4936244023  
-0.5814589434  
-0.7005683466  
-0.8405156822  
-0.9851845544  
-1.114667572  
-1.207780532  
-1.244879386  
-1.210607998  
-1.096196146  
-0.9009911471  
-0.6330074125  
-0.3083925061  
0.05013955179  
0.4157227315  
0.7603092728  
1.057816982  
1.287070832  
1.434156384  
1.493900839  
1.470301565  
1.375862459  
1.229933862  
1.056280365  
0.8802061377  
0.7255788649  
0.6121432571  
0.5534154574  
0.5554020034  
0.6162522911  
0.7268347513  
0.8721185733  
1.03314767  
1.189335375  
1.320779438  
1.410331751  
1.445202905  
1.417944641  
1.326770282  
1.175240422  
0.971432684  
0.7267590505  
0.4546303925  
0.1691419662  
-0.1160335182  
-0.3884640335  
-0.6374211174  
-0.8540005036  
-1.030961493  
-1.162392123  
-1.243313409  
-1.269344291  
-1.236540669  
-1.141473612  
-0.9815778628  
-0.7557622541  
-0.4651864278  
-0.1141199185  
0.2892896729  
0.7324919696  
1.198398436  
1.665768099  
2.110162519  
2.505463728  
2.825863657  
3.048137425  
3.153974062  
3.13209056  
2.979845559  
2.704126155  
2.321340672  
1.856446723  
1.341063932  
0.810838536  
0.3022947985  
-0.150481558  
-0.5189932423  
-0.7829672946  
-0.932196081  
-0.967376355  
-0.8998545244  
-0.7503072787  
-0.5464946104  
-0.3203299174  
-0.1045825552  
0.07043482683  
0.179853222  
0.206577065  
0.142754088  
-0.009771562908  
-0.2400354183  
-0.5294412807  
-0.8539958221  
-1.186979075  
-1.501771826  
-1.774498992  
-1.98623342  
-2.124540948  
-2.184250837  
-2.167433995  
-2.082642087  
-1.943559378  
-1.767233574  
-1.572118693  
-1.376101968  
-1.194728863  
-1.039748808  
-0.918106152  
-0.8314224206  
-0.7760096347  
-0.7434042695  
-0.7213644445  
-0.6952700737  
-0.6498153693  
-0.5708485999  
-0.4472042646  
-0.2723309102  
-0.04553633893  
0.2273275244  
0.533874455  
0.8559398618  
1.171076585  
1.454669066  
1.682455429  
1.833189576  
1.891111181  
1.847911618  
1.703921827  
1.468335442  
1.158408351  
0.7977040535  
0.4135945887  
0.03431601802  
-0.3140304185  
-0.6101583501  
-0.8396156427  
-0.9958869613  
-1.080483666  
-1.102033183  
-1.074546541  
-1.015140799  
-0.9415449788  
-0.8697641951  
-0.8121751121  
-0.7763003456  
-0.7643463136  
-0.7734945061  
-0.7968221616  
-0.824624837  
-0.8459407825  
-0.8499939855  
-0.8274038974  
-0.7710245813  
-0.6763881557  
-0.5417980063  
-0.3681651933  
-0.1587185263  
0.08130032704  
0.3448750637  
0.6233637213  
0.9065913011  
1.182968742  
1.439725147  
1.663363383  
1.840372778  
1.958194522  
2.006375309  
1.977744603  
1.86947421  
1.683812745  
1.428353738  
1.115744  
0.7628156199  
0.3892263944  
0.01574532574  
-0.3375920774  
-0.6532301514  
-0.9175190201  
-1.121641472  
-1.261923447  
-1.339522367  
-1.359543021  
-1.329752028  
-1.259072638  
-1.156111732  
-1.027927175  
-0.8792308774  
-0.7121254565  
-0.5264006808  
-0.320329311  
-0.09180551528  
0.160362305  
0.4352508311  
0.7288977778  
1.033848569  
1.339250928  
1.631513833  
1.895453486  
2.115770634  
2.278657252  
2.373296827  
2.39305814  
2.336193636  
2.205965132  
2.010161924  
1.760114189  
1.469329618  
1.151996514  
0.8215556026  
0.4895772398  
0.1650865227  
-0.1455812028  
-0.4384046074  
-0.7108932673  
-0.9610820058  
-1.186509329  
-1.383411625  
-1.546308004  
-1.668092148  
-1.740651897  
-1.755936414  
-1.707325026  
-1.591065152  
-1.407542326  
-1.162159899  
-0.865626072  
-0.5335739753  
-0.1854932466  
0.1569197622  
0.4718046993  
0.7393244896  
0.9437081324  
1.074893773  
1.129522449  
1.111172771  
1.029775525  
0.9002802447  
0.7407540983  
0.570144841  
0.406006727  
0.2624822845  
0.1488008894  
0.06848403348  
0.0193501245  
-0.00570174209  
-0.01723892609  
-0.02740606044  
-0.04785776613  
-0.08782296882  
-0.1525689811  
-0.2424966238  
-0.352991976  
-0.4750602316  
-0.5966453711  
-0.7044458526  
-0.7859554934  
-0.8314192015  
-0.835407399  
-0.797756324  
-0.723726858  
-0.623332747  
-0.5099426334  
-0.3983498849  
-0.3026111945  
-0.2339861828  
-0.19930177  
-0.1999974785  
-0.2320059979  
-0.2864764918  
-0.3512311626  
-0.4127001317  
-0.4580418959  
-0.4770917099  
-0.4638521682  
-0.4173023735  
-0.3414196639  
-0.2444574437  
-0.1376192846  
-0.03337105328  
0.05632338877  
0.1215766259  
0.155732698  
0.1559689257  
0.1233197396  
0.06217063063  
-0.02062164814  
-0.1168144207  
-0.2178689411  
-0.3158882074  
-0.4042851035  
-0.4781417735  
-0.5342599256  
-0.5709761097  
-0.5878331738  
-0.5851971376  
-0.5639182936  
-0.5250775335  
-0.4698526616  
-0.3994826081  
-0.3152944859  
-0.2187554969  
-0.1115003419  
0.004666555254  
0.1278168603  
0.2559359406  
0.3869406719  
0.5186296438  
0.6485503153  
0.7738066434  
0.8908354116  
0.9952503694  
1.081820095  
1.144667049  
1.177739974  
1.175541866  
1.134070059  
1.051819015  
0.9307016149  
0.7766812659  
0.5999584316  
0.4145739802  
0.2373915098  
0.08651240648  
-0.02072943874  
-0.06994334529  
-0.05174435993  
0.03661700515  
0.1903154533  
0.3969159505  
0.6372913524  
0.8874434199  
1.121037434  
1.312331079  
1.439133137  
1.485404698  
1.443150208  
1.313345988  
1.105778117  
0.837815461  
0.5322749475  
0.2146768812  
-0.08974854695  
-0.3589122889  
-0.5762048878  
-0.7320326883  
-0.8243831998  
-0.8583830773  
-0.8449551917  
-0.7988058042  
-0.7360534655  
-0.6718537842  
-0.6183639779  
-0.583316491  
-0.5693788888  
-0.5743334198  
-0.5920023829  
-0.6137046381  
-0.62999009  
-0.6323247338  
-0.6144856743  
-0.5734344643  
-0.5095755184  
-0.4264184091  
-0.3297428734  
-0.2264725003  
-0.1234803453  
-0.02655957982  
0.06027178194  
0.1350154093  
0.197479557  
0.2486877585  
0.2900494375  
0.3224731057  
0.345639928  
0.3575701864  
0.3546146705  
0.3318756597  
0.2840299521  
0.2064046059  
0.09614991416  
-0.04669794592  
-0.2184516177  
-0.4114491754  
-0.6142616185  
-0.8124362246  
-0.9897076793  
-1.129536652  
-1.216798856  
-1.239403391  
-1.189661984  
-1.06523044  
-0.8695345939  
-0.6116265987  
-0.305510038  
0.03098711632  
0.3776616035  
0.7135752776  
1.018716422  
1.275570228  
1.470466194  
1.594618112  
1.64478689  
1.623502816  
1.538839095  
1.403701027  
1.234675463  
1.050482901  
0.8701417861  
0.710998549  
0.5868116564  
0.5061046373  
0.4710233391  
0.4768744377  
0.5124708054  
0.5613309849  
0.603625766  
0.6187043297  
0.5878701716  
0.4970772211  
0.3391478182  
0.1151812276  
-0.1650635627  
-0.4839392655  
-0.8177435938  
-1.139406073  
-1.421673078  
-1.64036659  
-1.777264816  
-1.822228275  
-1.774277265  
-1.641495311  
-1.439796955  
-1.190745449  
-0.9187438297  
-0.6479951306  
-0.3996495964  
-0.1895057313  
-0.02657335639  
0.08736171555  
0.157142926  
0.1927553161  
0.2071847133  
0.2139699357  
0.2248081184  
0.2475691174  
0.2850041475  
0.3343250227  
0.3877086729  
0.433628225  
0.458809533  
0.4505125101  
0.3987804305  
0.2983305512  
0.1497891612  
-0.03990928834  
-0.2580162658  
-0.4872842347  
-0.7079121241  
-0.8998282299  
-1.044990749  
-1.129379825  
-1.144429012  
-1.087716475  
-0.9628832142  
-0.7788313139  
-0.5483810468  
-0.2866177621  
-0.009183799912  
0.2692380607  
0.5360767621  
0.7815480396  
0.9988497779  
1.183931233  
1.334972899  
1.451729349  
1.534889301  
1.585575838  
1.605057876  
1.594690422  
1.556030524  
1.491053042  
1.402351007  
1.293251963  
1.167750622  
1.030280492  
0.8853271204  
0.7369748407  
0.5884967682  
0.442074663  
0.2987465597  
0.1586023774  
0.02121010411  
-0.1138118058  
-0.2462120854  
-0.3746364035  
-0.4964234016  
-0.6077258779  
-0.7039898745  
-0.7807165426  
-0.8343766411  
-0.8633046556  
-0.8683628457  
-0.8532260671  
-0.8241639946  
-0.7893115433  
-0.7575006266  
-0.7368314901  
-0.7332019857  
-0.7490727982  
-0.7826969089  
-0.8280003372  
-0.8751925139  
-0.9120695243  
-0.9258460422  
-0.905260263  
-0.8426308718  
-0.7355181139  
-0.5876954508  
-0.4092317887  
-0.2155988663  
-0.02586867672  
0.139769593  
0.2628575786  
0.3294704541  
0.3325696869  
0.2735264031  
0.1625719726  
0.0180456748  
-0.1354942512  
-0.2701001326  
-0.3578445366  
-0.3743965359  
-0.3022778046  
-0.1333998082  
0.1294776181  
0.4725531285  
0.8721087569  
1.29682477  
1.711015485  
2.078412707  
2.366043189  
2.547748417  
2.606949569  
2.538336912  
2.348314076  
2.054161126  
1.682052507  
1.264169693  
0.8352796694  
0.4291667347  
0.07533593523  
-0.2036635236  
-0.3940303231  
-0.4914681291  
-0.500898937  
-0.4352396323  
-0.3134501521  
-0.1581415379  
0.006959732274  
0.1593954776  
0.2799640228  
0.3541585784  
0.3729678329  
0.3330549845  
0.2363975975  
0.08950979898  
-0.09759499629  
-0.3125634773  
-0.5418577905  
-0.7718258291  
-0.9896259003  
-1.184002717  
-1.345885559  
-1.468827406  
-1.549275806  
-1.586658481  
-1.583273339  
-1.543964416  
-1.475596607  
-1.386333525  
-1.284789954  
-1.179120562  
-1.076143205  
-0.9806020444  
-0.8946571114  
-0.8176740976  
-0.7463587768  
-0.6752263208  
-0.5973800266  
-0.505508992  
-0.3930063444  
-0.2550886043  
-0.08977589594  
0.101381993  
0.3129304459  
0.5355643811  
0.7566321881  
0.9610823529  
1.1327735  
1.2560519  
1.317439809  
1.30725209  
1.22097566  
1.060214304  
0.8330636116  
0.5538411509  
0.2421288187  
-0.0787920467  
-0.383983271  
-0.6491542599  
-0.852982209  
-0.979178657  
-1.018062995  
-0.9674513275  
-0.8327722935  
-0.6264024323  
-0.3663189308  
-0.07425746771  
0.2263830182  
0.5126456703  
0.7638914828  
0.9632561329  
1.098595466  
1.162892819  
1.154184603  
1.07512342  
0.9323147337  
0.7355703304  
0.4971836585  
0.2312828519  
-0.04673311646  
-0.3207309583  
-0.574418183  
-0.792044625  
-0.9592693724  
-1.06417801  
-1.098402003  
-1.058178795  
-0.9451902586  
-0.7669860343  
-0.5368329304  
-0.2728956262  
0.003243451719  
0.2686177584  
0.5012353534  
0.6824847855  
0.7992524804  
0.8454619296  
0.8227880667  
0.740443883  
0.6140425846  
0.4636894467  
0.3115661538  
0.1793196282  
0.08563331751  
0.04425364372  
0.06273193244  
0.1419791529  
0.2766248515  
0.4560668047  
0.6659952453  
0.8901288867  
1.111918069  
1.315989803  
1.48917799  
1.62110122  
1.704285121  
1.733957919  
1.707639585  
1.624700396  
1.486020241  
1.29385171  
1.051906749  
0.7656471878  
0.4426769777  
0.09309859943  
-0.2703153195  
-0.6322786176  
-0.9755655226  
-1.282036603  
-1.534067023  
-1.716239585  
-1.81711193  
-1.830797791  
-1.758121151  
-1.607105328  
-1.392647763  
-1.135327483  
-0.8594219309  
-0.5903195744  
-0.3516487828  
-0.1624960954  
-0.03509209172  
0.02666860408  
0.02763642462  
-0.01935514945  
-0.09535486512  
-0.178029433  
-0.2448881315  
-0.2765519239  
-0.2595855106  
-0.1884927042  
-0.06657225612  
0.09448287884  
0.2761831056  
0.4557969066  
0.6094928158  
0.7156116669  
0.7576052113  
0.7262381937  
0.6207684474  
0.4489694612  
0.2260387504  
-0.02740896866  
-0.2879546513  
-0.5321997377  
-0.7394112287  
-0.8936352197  
-0.9850362725  
-1.010338871  
-0.9723913021  
-0.8789888591  
-0.7412056801  
-0.5715217562  
-0.3820455451  
-0.1830886738  
0.01772374285  
0.2157219021  
0.4088598586  
0.5968946829  
0.780252962  
0.9588141171  
1.130833448  
1.292199807  
1.436179199  
1.553703794  
1.634187  
1.666773609  
1.641838149  
1.5525286  
1.396111609  
1.174917547  
0.8967087788  
0.5743879888  
0.2250597976  
-0.131466919  
-0.4745527517  
-0.7847339129  
-1.045607914  
-1.245356356  
-1.377701577  
-1.442211883  
-1.443907853  
-1.392281758  
-1.299870076  
-1.180607584  
-1.048193909  
-0.9146782887  
-0.7894465511  
-0.6786916526  
-0.5853814677  
-0.509656199  
-0.4495454469  
-0.4018211257  
-0.3628442278  
-0.3292561332  
-0.2984150781  
-0.2685464066  
-0.2386227764  
-0.2080516162  
-0.1762626891  
-0.1423293602  
-0.1047166861  
-0.06124803593  
-0.009313022536  
0.0536892658  
0.1297379239  
0.2195177751  
0.3218118183  
0.4330836606  
0.5473771303  
0.6565888225  
0.7511406946  
0.8209942097  
0.8568971049  
0.8516977472  
0.8015331948  
0.7067032605  
0.5720702832  
0.4068938963  
0.2240889149  
0.03897303965  
-0.1323341631  
-0.2746385232  
-0.3753248313  
-0.4256706796  
-0.4216893503  
-0.3643824051  
-0.2594144545  
-0.1162733488  
0.05291639251  
0.2347469579  
0.4158540485  
0.5840430935  
0.7291047226  
0.8432741189  
0.9213567942  
0.9606005437  
0.9604127806  
0.922053087  
0.8483688219  
0.7436413285  
0.613512872  
0.464963856  
0.3062260705  
0.1465618503  
-0.00417070448  
-0.1362015544  
-0.2407284715  
-0.3109089269  
-0.3428166513  
-0.3361816525  
-0.2947628843  
-0.2262329956  
-0.1415177389  
-0.05364611504  
0.02377677396  
0.07826185757  
0.1000620164  
0.08347661153  
0.02764341196  
-0.0633263316  
-0.1808859796  
-0.3131989819  
-0.446711077  
-0.5679127198  
-0.6650275257  
-0.7293759927  
-0.7562300234  
-0.7450530826  
-0.6991416418  
-0.6247738327  
-0.530034883  
-0.4235623998  
-0.3134114322  
-0.2062269171  
-0.1068265025  
-0.01820195397  
0.05813560992  
0.1215882866  
0.1718790524  
0.2085854359  
0.2309317337  
0.2379041433  
0.2286671782  
0.2031747799  
0.1628401698  
0.1110772567  
0.05354470164  
-0.002012211384  
-0.04637235367  
-0.06985455937  
-0.06360026561  
-0.02095312976  
0.06131917419  
0.1821539705  
0.3358530894  
0.5123725376  
0.6982304417  
0.8779417786  
1.035779672  
1.157637588  
1.232706386  
1.254741964  
1.222729098  
1.140852598  
1.01778967  
0.8654202835  
0.6971660452  
0.5261921133  
0.363739349  
0.2178319715  
0.09253025393  
-0.01216636877  
-0.09976264613  
-0.1761792454  
-0.2482896078  
-0.3223495575  
-0.4025656212  
-0.4900573717  
-0.582386732  
-0.6737576593  
-0.755859957  
-0.8192371319  
-0.8549509025  
-0.8562697814  
-0.8200939407  
-0.747856665  
-0.645747026  
-0.5241834496  
-0.3966202868  
-0.2778587687  
-0.1821235742  
-0.1212035974  
-0.1029434267  
-0.1302946958  
-0.2010582757  
-0.3083315143  
-0.4415385448  
-0.5878843777  
-0.7339519291  
-0.8672178712  
-0.9772397516  
-1.056381993  
-1.099988298  
-1.106068599  
-1.074590309  
-1.006573389  
-0.9032072661  
-0.7651855009  
-0.592422234  
-0.3842414216  
-0.1400204184  
0.1398010073  
0.4525490207  
0.7921892653  
1.14852829  
1.506949441  
1.848829559  
2.152704949  
2.396105459  
2.557861822  
2.620613946  
2.573150314  
2.412239359  
2.143627062  
1.782008897  
1.3499039  
0.8755286998  
0.3899296292  
