2344.719998  
2499.816763  
2899.150586  
3775.131959  
4095.811441  
3792.962484  
83495.83696  
35527.01883  
17316.19808  
4814.114508  
8713.915182  
38460.19162  
8263.617467  
7514.995421  
2326.772972  
16326.19382  
316.0713965  
15186.67904  
7424.122569  
1387.934849  
2183.798  
4517.533456  
3135.195326  
3304.916659  
1035.256178  
4515.805791  
10865.52054  
4449.579388  
772.4699614  
181.2285887  
3851.899491  
21464.8168  
3299.74708  
6338.892771  
4200.080983  
3454.545761  
5206.307222  
14284.55272  
7562.335805  
2010.930347  
6802.197025  
11582.6139  
4271.095651  
9157.325577  
8465.454252  
2488.810651  
4945.914716  
6715.911071  
1886.413336  
3442.669242  
7366.158402  
16042.86905  
11856.66633  
6648.540118  
377.545643  
688.2784471  
781.4426871  
19.26298194  
3486.777805  
833.4898917  
529.5719943  
1959.907744  
763.6205298  
15.91502412  
134.8348889  
122.4008025  
298.9806828  
215.241618  
198.5263437  
6.506004395  
102.7966906  
29.00503932  
118.2465407  
83.75552202  
49.28339513  
73.89680918  
43.24509621  
61.89043248  
45.10702034  
45.25944165  
26.80922598  
30.9502151  
31.10163453  
26.91323687  
26.63958556  
26.3901354  
25.90064472  
23.93308191  
23.74972943  
22.63899308  
21.38891662  
21.16048811  
20.49011391  
19.76626544  
18.88666713  
18.45906059  
17.9075444  
17.35265878  
16.84376183  
16.38513028  
15.97197987  
15.53280472  
15.1706436  
14.67723762  
14.32018844  
14.05931346  
13.70171614  
13.37627904  
13.03569849  
12.73395055  
12.46183458  
12.19636627  
11.9382594  
11.66617045  
11.4313167  
11.19842442  
10.95959956  
10.74811559  
10.53055567  
10.32644735  
10.12294864  
9.933892024  
9.745493129  
9.563975319  
9.389271875  
9.219048065  
9.053963078  
8.893154374  
8.740015729  
8.588967735  
8.443165113  
8.30013038  
8.16283057  
8.028044125  
7.897681062  
7.771054906  
7.647081201  
7.527117128  
7.409873207  
7.295928034  
7.185053816  
7.076448068  
6.971119805  
6.868113901  
6.767739445  
6.669974646  
6.574322397  
6.481183872  
6.390164299  
6.301174959  
6.214369177  
6.129557127  
6.046728171  
5.965756365  
5.886615665  
5.809175884  
5.733543508  
5.65954622  
5.587097366  
5.516247631  
5.446945992  
5.379106286  
5.312686476  
5.247626645  
5.183950894  
5.121611604  
5.060524248  
5.000640687  
4.941970685  
4.884510927  
4.828161709  
4.772938061  
4.718789485  
4.665681324  
4.613585487  
4.562496948  
4.512370428  
4.463219163  
4.414993375  
4.367626492  
4.321149601  
4.275540664  
4.230765642  
4.186794689  
4.143633855  
4.101213547  
4.059570759  
4.018651817  
3.978460927  
3.938956273  
3.900148292  
3.862040809  
3.824543969  
3.787692091  
3.751478921  
3.715877749  
3.68088583  
3.646437189  
3.612611682  
3.579303494  
3.546551583  
3.514345536  
3.482652634  
3.451456401  
3.420796121  
3.390594615  
3.360900161  
3.331659727  
3.302890922  
3.274552701  
3.246646104  
3.219214022  
3.192171042  
3.165553172  
3.139327202  
3.11352337  
3.088093342  
3.06304963  
3.038378807  
3.014053753  
2.990135866  
2.966524458  
2.943292593  
2.920372529  
2.897803861  
2.875568567  
2.85365642  
2.832025712  
2.810762906  
2.789749026  
2.769050885  
2.748672208  
2.728537001  
2.708682044  
2.689111338  
2.669856025  
2.650805138  
2.632022443  
2.613562499  
2.595311332  
2.577312667  
2.559558632  
2.542014453  
2.524744358  
2.507702263  
2.490875549  
2.474264769  
2.457890259  
2.441735923  
2.425784054  
2.410036308  
2.394495855  
2.379168442  
2.364018141  
2.349085557  
2.334358623  
2.319772774  
2.305430153  
2.291239648  
2.277227511  
2.263398306  
2.249765385  
2.236264262  
2.222942767  
2.209813372  
2.196828807  
2.183999403  
2.171357883  
2.158838551  
2.14649029  
2.134292557  
2.12225088  
2.110347699  
2.098594691  
2.086965106  
2.075493527  
2.064164725  
2.052982521  
2.041901644  
2.030993096  
2.020180133  
2.009513213  
1.998977364  
1.988563649  
1.978281482  
1.968103597  
1.958059312  
1.948129883  
1.938310396  
1.928601106  
1.919023471  
1.909539229  
1.900189859  
1.890953592  
1.881806023  
1.872765532  
1.863829559  
1.855000388  
1.846260086  
1.837629268  
1.829090876  
1.820681648  
1.812334822  
1.804102271  
1.795943359  
1.787897105  
1.779958879  
1.772075901  
1.764292289  
1.756596523  
1.748989925  
1.7414771  
1.734026254  
1.726681222  
1.719420611  
1.71225157  
1.705136247  
1.698112338  
1.691175903  
1.684306726  
1.677506456  
1.670800495  
1.664160803  
1.657604804  
1.651115308  
1.644697181  
1.638356239  
1.632075302  
1.625857811  
1.619725133  
1.613660393  
1.607677079  
1.601726051  
1.595855764  
1.590064992  
1.584334187  
1.578662135  
1.573051028  
1.567518156  
1.562027698  
1.556598432  
1.551251721  
1.545950187  
1.540704406  
1.53551612  
1.53039801  
1.525330822  
1.520327632  
1.515377773  
1.51047524  
1.50564271  
1.500850186  
1.496126498  
1.491436137  
1.486807716  
1.482234768  
1.477688056  
1.473238316  
1.468832351  
1.464454868  
1.460126658  
1.455847657  
1.451635466  
1.447454138  
1.443334276  
1.439272418  
1.435247403  
1.431251846  
1.427312289  
1.423415466  
1.419577882  
1.415776032  
1.412017516  
1.408310223  
1.404646858  
1.401021469  
1.397428997  
1.393893296  
1.39039789  
1.386958582  
1.383537555  
1.380171183  
1.376827757  
1.373546352  
1.370285773  
1.367088521  
1.363922959  
1.360773953  
1.357694199  
1.354636462  
1.351640861  
1.348654536  
1.345731596  
1.342810134  
1.339955813  
1.337119716  
1.334326736  
1.331590379  
1.328849676  
1.326175733  
1.323533333  
1.320923558  
1.318354432  
1.315815629  
1.313311158  
1.310836152  
1.30839773  
1.305985568  
1.303613061  
1.301284451  
1.298990403  
1.296710106  
1.294473572  
1.292258029  
1.290092753  
1.287952791  
1.285834938  
1.28378075  
1.281726888  
1.279710428  
1.277719674  
1.275771543  
1.273836903  
1.271959733  
1.270097018  
1.268269707  
1.266475334  
1.264707649  
1.262966738  
1.261261811  
1.259585556  
1.257937625  
1.256300596  
1.254713056  
1.253147734  
1.251608477  
1.250104739  
1.248639695  
1.247184204  
1.245760828  
1.24438162  
1.243009807  
1.241664322  
1.24034874  
1.239085029  
1.237823249  
1.236609218  
1.235392601  
1.234240287  
1.233080167  
1.231986744  
1.230891913  
1.229835186  
1.228793726  
1.227786821  
1.226794938  
1.225824563  
1.224908753  
1.224004061  
1.223131057  
1.222268433  
1.22144865  
1.220658384  
1.219893709  
1.219130393  
1.218424145  
1.217714008  
1.217054512  
1.216414593  
1.215785983  
1.215197765  
1.214642184  
1.214100751  
1.213580842  
1.213084523  
1.212620213  
1.212180879  
1.211780578  
1.211374147  
1.211021036  
1.210685093  
1.210360402  
1.210076408  
1.209805334  
1.209578148  
1.209359256  
1.209182726  
1.209010805  
1.208868773  
1.208777095  
1.208677104  
1.208622869  
1.20856616  
1.208566854  
