11.7908362  
11.61929228  
12.30938209  
16.59087084  
15.43086954  
196.8858223  
1563.594698  
2644.517294  
1298.075362  
14747.72753  
41656.72909  
5267.995428  
20109.75192  
8578.45507  
16215.83045  
22315.74359  
8592.794142  
17443.61713  
1759.657864  
515.5712257  
3951.307319  
18837.96361  
19998.31653  
23106.02262  
6761.771803  
3810.231476  
17374.49454  
5189.60216  
897.8831675  
6661.21763  
10867.47339  
713.927748  
5227.953725  
22328.27268  
2649.48802  
10072.8451  
6343.124881  
21207.09903  
18116.64028  
3493.381989  
20667.14541  
987.9997  
34368.11449  
140.8251917  
40.45776146  
7946.022144  
10408.5917  
551.7535127  
9373.603234  
201.9298883  
4554.545816  
562.737653  
2639.008069  
8212.209134  
617.0911879  
45.64693835  
4369.11795  
1041.722949  
942.7253504  
774.8070944  
3078.908951  
2906.792454  
145.177356  
643.0522046  
67.84247085  
723.2617306  
155.8435255  
562.7233161  
39.87893346  
37.31610861  
34.19626516  
10.01190095  
69.69508275  
16.60404791  
6.775209892  
7.056735726  
0.04486122151  
2.492648591  
0.9284608196  
2.661205924  
2.664104412  
1.120266164  
1.278760147  
0.2556887404  
0.7899582889  
0.2433416617  
0.3838153352  
0.5785680414  
0.3365379005  
0.343364804  
0.2622013971  
0.2214379766  
0.2566311235  
0.3405129148  
0.3058852451  
0.3013540157  
0.2865158944  
0.2961816269  
0.2687295424  
0.2710498771  
0.2727593984  
0.2451108603  
0.2533614686  
0.2430217444  
0.2418007189  
0.2422509342  
0.2369203664  
0.2303928555  
0.2294391548  
0.2264803037  
0.2252928038  
0.2187953086  
0.2143629122  
0.2115327102  
0.20880647  
0.2064565244  
0.2023148968  
0.1994380253  
0.1966465751  
0.1938671265  
0.1910792052  
0.1881211051  
0.185546997  
0.1833414048  
0.1802828035  
0.1778737544  
0.1752875189  
0.17303822  
0.1707486535  
0.1683868915  
0.1661054734  
0.1638616581  
0.1616286511  
0.1595027709  
0.1574660393  
0.1554154372  
0.1534307566  
0.1514299508  
0.1494768501  
0.1475851698  
0.1457192805  
0.1438995965  
0.1421067511  
0.1403698975  
0.1386355762  
0.1369521075  
0.1352854076  
0.1336755749  
0.1320780141  
0.1305233803  
0.1289848359  
0.1274680312  
0.1259898504  
0.1245444726  
0.1231247481  
0.1217248265  
0.1203541408  
0.1190061001  
0.117682654  
0.1163865185  
0.1151010004  
0.1138532395  
0.1126180188  
0.1114101522  
0.1102171886  
0.1090485783  
0.1079052958  
0.1067740926  
0.1056614714  
0.1045750385  
0.1035054831  
0.1024520376  
0.1014152935  
0.1003910105  
0.09938791116  
0.09840727207  
0.09743956058  
0.09648914396  
0.09554996469  
0.09462688042  
0.09372134188  
0.09282200499  
0.09194594453  
0.09108626244  
0.09023651147  
0.08939408387  
0.08857541626  
0.08776176393  
0.0869680249  
0.08618355225  
0.08540591428  
0.08464560219  
0.08389170552  
0.08315787331  
0.08242724436  
0.08170677777  
0.08100866655  
0.08031157236  
0.07962545246  
0.07896153823  
0.07828535603  
0.07763516582  
0.07698942814  
0.07635759552  
0.07573260094  
0.07511827961  
0.07450464695  
0.07390169811  
0.07331538762  
0.07273161099  
0.07216147613  
0.07159741897  
0.0710328544  
0.07048402987  
0.0699412386  
0.06940182357  
0.06888135198  
0.06836162896  
0.06784691567  
0.06734511971  
0.06684500978  
0.06635107569  
0.06586557418  
0.06537975413  
0.06491439625  
0.06444755962  
0.06398907552  
0.06353185304  
0.06308419711  
0.06264659854  
0.06220990175  
0.06177807649  
0.06135443966  
0.06093536299  
0.06052493699  
0.06011319408  
0.05971607883  
0.05931224807  
0.05892297978  
0.05853564732  
0.05815049613  
0.05777756805  
0.0574023805  
0.05703754004  
0.05667201583  
0.05631007379  
0.05595727262  
0.05560830361  
0.05526074932  
0.05491757904  
0.05458156271  
0.05425040122  
0.05391609069  
0.0535921672  
0.05327220177  
0.05295572793  
0.05264089159  
0.052336305  
0.05202927249  
0.05172955349  
0.05143196001  
0.05113621231  
0.0508449581  
0.05055826664  
0.0502748259  
0.04999559645  
0.04971120606  
0.04944198449  
0.04917362917  
0.04889853763  
0.04863699251  
0.04837474346  
0.04811879436  
0.04786559916  
0.04760722774  
0.04735892889  
0.04711095998  
0.04687140275  
0.04662486583  
0.04638696757  
0.04615633089  
0.04591966239  
0.04569167382  
0.04546230264  
0.04523434168  
0.04501893724  
0.04479823209  
0.04457762089  
0.04436325184  
0.04414861833  
0.04394124365  
0.04373270938  
0.04352832664  
0.04332896928  
0.0431252786  
0.04292729946  
0.04272886047  
0.04253552812  
0.04234400845  
0.0421538306  
0.04196756713  
0.04177805632  
0.04159756274  
0.04141462922  
0.04123825668  
0.04105873213  
0.04088406155  
0.04070968728  
0.04054195716  
0.04036708461  
0.04020461976  
0.04003431575  
0.03986639488  
0.03970888097  
0.03954454668  
0.03938795244  
0.03923596613  
0.03907877241  
0.03892026616  
0.03877220107  
0.03861992111  
0.03846662056  
0.03832479519  
0.03817669864  
0.03803013374  
0.03789265588  
0.03775102593  
0.03761094526  
0.03747155116  
0.03733250286  
0.03720194752  
0.03706773992  
0.0369355739  
0.03680220992  
0.03667161859  
0.03654818958  
0.03642335059  
0.03629710268  
0.03617427865  
0.03605382469  
0.03592989789  
0.0358124635  
0.03569499928  
0.03557459218  
0.03546215644  
0.03534555018  
0.03523525193  
0.03512638894  
0.03501132094  
0.03490249364  
0.03479532566  
0.0346854251  
0.03457831263  
0.03447682051  
0.03437049146  
0.03427038525  
0.03416966492  
0.03407101608  
0.03397161821  
0.03387243854  
0.0337783817  
0.03367966462  
0.03358915455  
0.03349218864  
0.03339955218  
0.03330973992  
0.03322029945  
0.0331316262  
0.03304207441  
0.03295418983  
0.03286652293  
0.03278020991  
0.03270016291  
0.03261934238  
0.0325331063  
0.03245462634  
0.03237236651  
0.03229028147  
0.03221448473  
0.03213332005  
0.03205389172  
0.0319852028  
0.03190946803  
0.0318352502  
0.03176180182  
0.03168982816  
0.03161775126  
0.03154842064  
0.03147798988  
0.03141223349  
0.0313404683  
0.0312777297  
0.03120708879  
0.03114485661  
0.03107578413  
0.03101796775  
0.03095332124  
0.03089305699  
0.03082984732  
0.03076975627  
0.03070955912  
0.03065175523  
0.03059135625  
0.03053971453  
0.03047951281  
0.03042628182  
0.03036801472  
0.03031524933  
0.03026434025  
0.03021036204  
0.03015596837  
0.03010481881  
0.03005519077  
0.03000472694  
0.02995679151  
0.02990719097  
0.0298591789  
0.0298165581  
0.02976642696  
0.02972222154  
0.02967408482  
0.02963153432  
0.02958697719  
0.02954698011  
0.02950467072  
0.02946197367  
0.02942522686  
0.02938205794  
0.02934708461  
0.02930444213  
0.02926566898  
0.02922929203  
0.02919419632  
0.02915878385  
0.02912238173  
0.02908392018  
0.02905711713  
0.02902067866  
0.02898837381  
0.02895521831  
0.02892535113  
0.02889556608  
0.02886097436  
0.02883184892  
0.02880396  
0.02877432851  
0.02874558527  
0.02872116144  
0.02869360057  
0.02866639443  
0.02864423501  
0.0286184507  
0.02859222075  
0.02856999068  
0.02854825487  
0.02852501025  
0.02850573132  
0.02848433138  
0.02846243313  
0.02844605396  
0.02842276459  
0.02840345176  
0.02838686111  
0.02836899636  
0.02835023512  
0.02833633331  
0.02832104067  
0.02830642956  
0.0282894941  
0.02827627921  
0.02826600434  
0.02825037503  
0.02824267724  
0.02822591251  
0.02821905734  
0.0282036757  
0.0281979492  
0.02818484643  
0.02817706776  
0.02816917323  
0.02816053364  
0.02815290574  
0.02814831341  
0.02814174095  
0.02813641377  
0.02813312031  
0.02812926993  
0.02812396866  
0.02811975629  
0.02811711879  
0.02811016086  
0.02811487704  
0.02811481937  
0.02810815201  
