-0.7153251731  
-1.892734592  
-3.005762682  
-4.000296116  
-4.833419762  
-5.477116704  
-5.920196023  
-6.168261586  
-6.241816054  
-6.172837034  
-6.000329359  
-5.765491684  
-5.50709923  
-5.257665567  
-5.040767784  
-4.869746961  
-4.747786846  
-4.669192614  
-4.621559923  
-4.58843449  
-4.552054659  
-4.495808429  
-4.406142097  
-4.273750666  
-4.094037207  
-3.866919049  
-3.59614611  
-3.288343451  
-2.951986492  
-2.596483729  
-2.231478639  
-1.866416993  
-1.510335476  
-1.171800641  
-0.8588753062  
-0.5790034183  
-0.3387252234  
-0.1431920643  
0.00449041774  
0.1039977808  
0.1584680915  
0.174948049  
0.1644662918  
0.1415887244  
0.1234266044  
0.1281126299  
0.1728952787  
0.2720451232  
0.4348714531  
0.6641275117  
0.9550773652  
1.295426878  
1.666197163  
2.04349358  
2.400986644  
2.712802539  
2.956448322  
3.11537393  
3.180817124  
3.152672971  
3.039263326  
2.856052187  
2.623491675  
2.364325632  
2.100740646  
1.851778668  
1.631371008  
1.447253504  
1.300876832  
1.188266416  
1.101643223  
1.031493758  
0.9687218325  
0.9065117489  
0.8416000485  
0.7747529075  
0.7104128791  
0.6555942777  
0.6182656121  
0.6055243708  
0.6219109822  
0.6681594976  
0.7406318918  
0.8315267418  
0.9298364299  
1.022887461  
1.098205885  
1.145383802  
1.157641749  
1.132820665  
1.073652988  
0.9872653905  
0.8840241098  
0.775908356  
0.6747013049  
0.5902851339  
0.5293258821  
0.4945263208  
0.4845555  
0.4946202995  
0.5175420226  
0.545127743  
0.5695763631  
0.5846682287  
0.586544741  
0.5739671452  
0.548041981  
0.5115120468  
0.4677816261  
0.4198937968  
0.3696756521  
0.3172373729  
0.2609232521  
0.1977389755  
0.1241641218  
0.03721220036  
-0.06446998655  
-0.1796810504  
-0.3040991438  
-0.4302057151  
-0.5477503313  
-0.6447202934  
-0.708702358  
-0.7284582934  
-0.6955077214  
-0.6054927021  
-0.4591464505  
-0.2627058226  
-0.02770790163  
0.22983231  
0.4907887939  
0.7346832651  
0.9416415933  
1.094336986  
1.179684799  
1.190106895  
1.124215778  
0.9868392052  
0.7883914411  
0.5436709689  
0.2702227754  
-0.01351852037  
-0.2900988241  
-0.5446954913  
-0.7663601288  
-0.9487358782  
-1.09017771  
-1.193306435  
-1.264093822  
-1.310627083  
-1.341749638  
-1.365759674  
-1.389353939  
-1.41691493  
-1.450224042  
-1.488584356  
-1.52928225  
-1.568284985  
-1.601027172  
-1.62315214  
-1.631095766  
-1.622435728  
-1.595982785  
-1.551649395  
-1.49015014  
-1.412647259  
-1.320423405  
-1.214676486  
-1.096476335  
-0.9668966246  
-0.8272719855  
-0.679503947  
-0.5263282399  
-0.3714405379  
-0.2194093813  
-0.075357849  
0.05557750185  
0.1689366969  
0.26166671  
0.3327638624  
0.3837066425  
0.4185708249  
0.4437706526  
0.4674238687  
0.4983911224  
0.5451071423  
0.6143493723  
0.7101258404  
0.8328435763  
0.9789160297  
1.140874617  
1.308028228  
1.467591031  
1.606157006  
1.711318347  
1.773209089  
1.785748314  
1.7473949  
1.661297157  
1.534811929  
1.378457212  
1.204467228  
1.025158141  
0.8513771896  
0.6912566144  
0.5494712681  
0.4270994038  
0.3220802262  
0.2301793623  
0.1462581469  
0.06562627932  
-0.01477368431  
-0.09556050963  
-0.174623116  
-0.247393215  
-0.3076241759  
-0.3485396492  
-0.3641434081  
-0.3504641451  
-0.3065109855  
-0.2347791092  
-0.1412119622  
-0.03460748877  
0.07442664735  
0.1748302257  
0.2565308969  
0.3117630131  
0.3360601867  
0.3287675697  
0.2930171729  
0.2351681752  
0.1638109328  
0.0884982764  
0.01839878027  
-0.03891850636  
-0.07840323215  
-0.09800701622  
-0.09869550277  
-0.08401013324  
-0.05927090102  
-0.03057208454  
-0.003733716221  
0.01662283599  
0.02774489054  
0.02906897573  
0.02217743161  
0.01040808186  
-0.001794399438  
-0.009670036042  
-0.008956208919  
0.003412919447  
0.02881490739  
0.0667189516  
0.1147630085  
0.1691034757  
0.2249715228  
0.277351807  
0.3216850831  
0.3544829012  
0.373783685  
0.379384868  
0.3728313314  
0.3571590278  
0.3364541443  
0.3152717547  
0.298010801  
0.2883196725  
0.2886117535  
0.2997486526  
0.3209330786  
0.3498210149  
0.3828349832  
0.4156475714  
0.4437679592  
0.4631651228  
0.4708371938  
0.465261504  
0.4466473557  
0.4169522953  
0.3796435767  
0.3392267991  
0.3005992945  
0.2683099472  
0.2458423775  
0.2350245113  
0.2356764345  
0.2455530061  
0.2606170694  
0.2756055344  
0.2848212051  
0.2830246039  
0.266284749  
0.2326579866  
0.1825626799  
0.1187947389  
0.04615369871  
-0.0292548047  
-0.1009441142  
-0.163046137  
-0.2112299254  
-0.2433770674  
-0.2599103162  
-0.2637144071  
-0.2596621985  
-0.2538204623  
-0.2524636754  
-0.2610575353  
-0.2833710614  
-0.3208607549  
-0.3724096897  
-0.4344743395  
-0.5015902301  
-0.5671625004  
-0.6244129883  
-0.6673304377  
-0.6914856821  
-0.6945982487  
-0.6767700212  
-0.6403756476  
-0.5896408645  
-0.5299859298  
-0.4672463158  
-0.4068944609  
-0.3533747897  
-0.3096388706  
-0.2769374494  
-0.2548697401  
-0.2416584591  
-0.2345850767  
-0.2305095105  
-0.2263752674  
-0.2196366693  
-0.208547806  
-0.1922871733  
-0.1709182978  
-0.1452153461  
-0.11639232  
-0.08579126486  
-0.05457739853  
-0.02350254278  
0.007254057353  
0.03812445007  
0.07008794172  
0.1045073709  
0.1428966323  
0.1866491815  
0.2367689338  
0.2936342594  
0.3568245821  
0.4250307895  
0.4960651577  
0.566954008  
0.6341239671  
0.6936486342  
0.7415426643  
0.7740762658  
0.7880937122  
0.7813132705  
0.7525787164  
0.7020685639  
0.6314101999  
0.5437106605  
0.443460815  
0.3363215534  
0.2287757298  
0.127664679  
0.03964315256  
-0.02940086304  
-0.07489748765  
-0.09404577263  
-0.086101297  
-0.0524506032  
0.003552116762  
0.07697067152  
0.161854481  
0.2519095358  
0.3411867814  
0.4246820311  
0.4987680269  
0.5614031698  
0.612080612  
0.6515571981  
0.681394659  
0.7034223129  
0.7191973129  
0.7295735659  
0.7344496538  
0.7327377241  
0.7225631032  
0.7016569531  
0.6678745619  
0.6197516071  
0.5569969512  
0.480842654  
0.3941708964  
0.3013954989  
0.2081006082  
0.1204695962  
0.04458797975  
-0.0142968603  
-0.05245096906  
-0.06817599886  
-0.06209669036  
-0.03717440223  
0.001568786948  
0.04758559085  
0.09354126864  
0.1321611071  
0.1570891093  
0.1636496272  
0.1494081406  
0.1144680007  
0.06144859635  
-0.004843319032  
-0.07802811026  
-0.1509562612  
-0.216617342  
-0.2690144843  
-0.3039059177  
-0.3193093547  
-0.3156946776  
-0.295862941  
-0.2645162614  
-0.2275965406  
-0.1914815561  
-0.1621559087  
-0.1444581071  
-0.1415118856  
-0.1543811898  
-0.1819951905  
-0.2213233415  
-0.267757786  
-0.3156493174  
-0.3589202216  
-0.3916876239  
-0.4088403657  
-0.4065205302  
-0.3824846372  
-0.3363274435  
-0.2695573253  
-0.1855306268  
-0.08924215921  
0.01301489559  
0.1141111417  
0.2066412854  
0.2835435369  
0.3387438081  
0.3677504346  
0.3681455035  
0.3399005839  
0.2854624123  
0.2095789772  
0.1188592451  
0.02110393231  
-0.07551772134  
-0.1633579972  
-0.2361167011  
-0.2894976544  
-0.3216001453  
-0.3329854783  
-0.3263987424  
-0.3062049721  
-0.277602117  
-0.2457398751  
-0.2148823238  
-0.1877366442  
-0.1650478311  
-0.1455389796  
-0.126192901  
-0.1028470508  
-0.07101225288  
-0.02679334043  
0.03223262139  
0.1063179053  
0.1931570758  
0.2878889855  
0.3835224441  
0.4717538334  
0.5440902299  
0.5931154582  
0.6137275144  
0.6041396283  
0.5664683628  
0.5067814107  
0.4345427776  
0.3614888354  
0.3000656754  
0.2616341207  
0.2546893869  
0.283380954  
0.3465771347  
0.4376416048  
0.5450097034  
0.6535163662  
0.7463125151  
0.8071239346  
0.8225194344  
0.7838727334  
0.6887146123  
0.5412758078  
0.3521253803  
0.1369578825  
-0.08531170771  
-0.2948630128  
-0.4733717661  
-0.6061727601  
-0.6838774767  
-0.7032606406  
-0.6673210142  
-0.5845547831  
-0.4675725357  
-0.3313177416  
-0.1911225841  
-0.06089810305  
0.04832642286  
0.1293518082  
0.1791750741  
0.1987915836  
0.1925316873  
0.1670726625  
0.1302995364  
0.09018231909  
0.05381066729  
0.02667646472  
0.01226469385  
0.01194416743  
0.02512930538  
0.04964673801  
0.08223514838  
0.1190964056  
0.1564312392  
0.1909031763  
0.2199831947  
0.2421642491  
0.2570247669  
0.2651637812  
0.2680176319  
0.2675976133  
0.2661799903  
0.2659889073  
0.268915935  
0.2762974285  
0.2887832162  
0.3062963667  
0.3280923118  
0.3528957773  
0.3790921475  
0.4049434344  
0.4287973208  
0.4492610847  
0.465322336  
0.4764041388  
0.482361502  
0.4834344643  
0.4801683889  
0.4733261093  
0.4638046665  
0.4525593557  
0.4405401534  
0.4286211172  
0.4175262863  
0.4077328915  
0.3993590722  
0.3920536357  
0.3849036934  
0.3763991516  
0.3644735495  
0.3466528393  
0.3202980039  
0.2829333023  
0.2326139286  
0.1682804022  
0.09003539882  
-0.0006959021795  
-0.1011704189  
-0.2074906678  
-0.3149109052  
-0.4182477651  
-0.5123373137  
-0.5924717398  
-0.6547763503  
-0.6964783026  
-0.7160564569  
-0.7132798446  
-0.6891387863  
-0.6457130581  
-0.5859920735  
-0.5136714528  
-0.4329459971  
-0.348290933  
-0.2642425485  
-0.1851640587  
-0.115002834  
-0.05704357219  
-0.01368274922  
0.01376001107  
0.02515088207  
0.02155676027  
0.005136047438  
-0.02108433338  
-0.05353114802  
-0.08846548385  
-0.1223709967  
-0.1522838393  
-0.1760185466  
-0.192245893  
-0.2004153546  
-0.2005347878  
-0.1928584923  
-0.1775500006  
-0.1544054752  
-0.1227066516  
-0.08126554945  
-0.02867993434  
0.03622267139  
0.1138168611  
0.2030861656  
0.301142065  
0.4029605495  
0.5014541089  
0.5879190811  
0.6528588807  
0.687094287  
0.6830377954  
0.6359403491  
0.5449151929  
0.4135659463  
0.2500824543  
0.06674481235  
-0.1211339565  
-0.2967251489  
-0.4434656396  
-0.5468918128  
-0.5962703786  
-0.5858276189  
-0.5154012706  
-0.3904467552  
-0.2214005684  
-0.02249324012  
0.1898127732  
0.3985628724  
0.5879995692  
0.7450036465  
0.8601296422  
0.9281639301  
0.9481557931  
0.9230133957  
0.8587345741  
0.7634316071  
0.646282511  
0.5165570363  
0.3828168952  
0.2523617812  
0.1309403424  
0.02271499465  
-0.06958139331  
-0.1443525263  
-0.2008052562  
-0.2386323992  
-0.257775086  
-0.2582931445  
-0.2403495746  
-0.2042905157  
-0.1507912044  
-0.08103141239  
0.003153162367  
0.09916143019  
0.203599137  
0.3123329399  
0.4206316189  
0.5233894729  
0.6154088445  
0.6917329482  
0.7480007127  
0.7808017103  
0.7880105804  
0.769058121  
0.7251050282  
0.6590892477  
0.5756049275  
0.480596689  
0.3808723146  
0.2834583195  
0.1948568462  
0.1202919094  
0.06303914959  
0.02395501009  
0.001292494273  
-0.009139741288  
-0.01344974827  
-0.01880990256  
-0.03238107238  
-0.06013557274  
-0.1057647263  
-0.1698315119  
-0.2493244661  
-0.3377217323  
-0.4255876901  
-0.5016803331  
-0.5544194998  
-0.5735587919  
-0.551793573  
-0.4860863785  
-0.3784751376  
-0.2362164557  
-0.07119596133  
0.1013569206  
0.2646902248  
0.4026608707  
0.5018695655  
0.553492514  
0.5545347428  
0.5083012384  
0.42400003  
0.3155187732  
0.1995350011  
0.09322444467  
0.01191038194  
-0.03302946458  
-0.0356783837  
0.003689091837  
0.07876112039  
0.1781825677  
0.2872401787  
0.3899752082  
0.4714013381  
0.5195153115  
0.526811966  
0.4910992503  
0.4155382921  
0.3079194953  
0.1793332746  
0.04245163438  
-0.09030152522  
-0.2084111152  
-0.3045298485  
-0.3751592486  
-0.4207043978  
-0.4449143488  
-0.4538565522  
-0.454613217  
-0.4539279065  
-0.4570247901  
-0.4667887688  
-0.4834071356  
-0.5045090555  
-0.5257412444  
-0.5416537911  
-0.5467319793  
-0.536383937  
-0.5077287496  
-0.4600600652  
-0.3949390593  
-0.3159194722  
-0.2279831235  
-0.136800081  
-0.04793833355  
0.0338350362  
0.1050770462  
0.1639407249  
0.2102005382  
0.2450355806  
0.270656128  
0.2898409477  
0.3054650121  
0.3200956821  
0.3357053678  
0.3535124265  
0.3739774584  
0.3968935152  
0.4215717243  
0.4470467143  
0.4722810045  
0.4963185004  
0.5183769435  
0.5378580958  
0.5542947703  
0.5672476152  
0.5761876782  
0.5803903746  
0.578876685  
0.5704229746  
0.5536476552  
0.5271696249  
0.4898241738  
0.440905332  
0.3804012116  
0.3091877385  
0.2291445647  
0.1431815441  
0.05514679479  
-0.03038101963  
-0.108402627  
-0.1738994948  
-0.2222879695  
-0.2498805683  
-0.254320565  
-0.2349160908  
-0.1928414221  
-0.1311573471  
-0.05463754142  
0.03060106491  
0.1176344868  
0.1993693963  
0.2692246492  
0.3217612436  
0.3531861924  
0.3616692173  
0.3474309832  
0.3126017332  
0.2608739199  
0.1970211425  
0.1263440106  
0.05413261483  
-0.01478231647  
-0.07633971502  
-0.1274016437  
-0.1657569689  
-0.1900111725  
-0.1994144347  
-0.1936895758  
-0.1729007953  
-0.137400469  
-0.08785633819  
-0.02534789032  
0.04850478073  
0.1314258803  
0.2204165715  
0.3117806913  
0.4012498967  
0.4842074629  
0.555991546  
0.6122378546  
0.6492310526  
0.6642014107  
0.6555650525  
0.6230641466  
0.567810889  
0.4922383773  
0.3999698182  
0.2956183786  
0.1845419423  
0.07255008857  
-0.0344146551  
-0.1306244599  
-0.2109223562  
-0.271083542  
-0.3081423393  
-0.3206718893  
-0.3089640135  
-0.2750824393  
-0.2227646536  
-0.1571521952  
-0.08436787012  
-0.01096776298  
0.05667567569  
0.1129937549  
0.1537610116  
0.1764900661  
0.180624905  
0.1675037097  
0.1400944778  
0.1025386242  
0.05956606707  
0.01586384631  
-0.024512827  
-0.0585995862  
-0.084797229  
-0.1029154211  
-0.1139869442  
-0.1198987808  
-0.1228848215  
-0.1249837001  
-0.1275449403  
-0.1308663121  
-0.1340407267  
-0.1350301214  
-0.130972784  
-0.1186724753  
-0.0952026703  
-0.05852136494  
-0.00799527903  
0.05525993478  
0.1282819005  
0.2064539847  
0.2839487515  
0.3543799828  
0.4115617979  
0.4502692446  
0.4668783635  
0.4597936259  
0.4296056056  
0.3789538754  
0.3121338996  
0.2345115289  
0.1518492655  
0.06964984059  
-0.007386145291  
-0.07570658692  
-0.1330366988  
-0.1782868467  
-0.2112877448  
-0.2324329362  
-0.2423093068  
-0.2413994676  
-0.2299316512  
-0.2078867897  
-0.1751793298  
-0.1319441735  
-0.07887825786  
-0.0175408447  
0.04947340375  
0.1185355348  
0.1851957277  
0.244592062  
0.2920060323  
0.3234741495  
0.3363559001  
0.3297678814  
0.3047864382  
0.2643843189  
0.2130933238  
0.1564316689  
0.1001907239  
0.04967377366  
0.009026941535  
-0.01924109552  
-0.03446691247  
-0.03772602257  
-0.03143758819  
-0.01874686019  
-0.002795588317  
0.01398636714  
0.03042597915  
0.0468947847  
0.06525379366  
0.08846785688  
0.1199418891  
0.1626833117  
0.2184562404  
0.2870640658  
0.3659304783  
0.4500529067  
0.5323888628  
0.6046296926  
0.6582682032  
0.6858087994  
0.6819256568  
0.6444010542  
0.5746690065  
0.4778719667  
0.3623993577  
0.2389450474  
0.119215782  
0.01445928116  
-0.06598734989  
-0.115907489  
-0.1330156355  
-0.1192387582  
-0.08042732077  
-0.0255354759  
0.03462430903  
0.08887528911  
0.1272072475  
0.1421443587  
0.1297416239  
0.09009207932  
0.02726338422  
-0.05131141557  
-0.1359029124  
-0.2158515574  
-0.2810357291  
-0.323234862  
-0.3371894703  
-0.3212314651  
-0.2773944954  
-0.2110166055  
-0.1299128962  
-0.04324465899  
0.03972459672  
0.1108308723  
0.1639734273  
0.1957510307  
0.2056833851  
0.1960321418  
0.1712701457  
0.1372986675  
0.1005563412  
