-0.2853167673  
-0.4734949896  
-0.6515822424  
-0.8094369626  
-0.9387805037  
-1.033908778  
-1.092119343  
-1.113814619  
-1.102285868  
-1.063219628  
-1.003993643  
-0.9328548915  
-0.8580790883  
-0.7871964789  
-0.7263683127  
-0.6799568472  
-0.6503164745  
-0.6377989488  
-0.6409445019  
-0.6568200465  
-0.6814455603  
-0.7102622935  
-0.7385911372  
-0.7620464192  
-0.7768740311  
-0.7802006653  
-0.7701817575  
-0.7460519401  
-0.7080808618  
-0.6574461905  
-0.5960371825  
-0.5262110083  
-0.4505223163  
-0.3714543191  
-0.2911771411  
-0.2113632007  
-0.1330744523  
-0.05674224719  
0.01775864795  
0.09094911834  
0.1635180271  
0.2360532329  
0.3087736239  
0.3812983039  
0.45249522  
0.5204409142  
0.5825097293  
0.6355981319  
0.6764682442  
0.7021754331  
0.7105291536  
0.7005235689  
0.6726767077  
0.62921531  
0.5740657744  
0.512631437  
0.4513655445  
0.3971783314  
0.356743186  
0.3357813437  
0.3384155499  
0.3666733354  
0.4202098182  
0.4962896798  
0.590037813  
0.6949335682  
0.8034976021  
0.9080874284  
1.001706842  
1.078733624  
1.135467897  
1.170435419  
1.18439853  
1.18007377  
1.16159277  
1.133775536  
1.101328807  
1.068083267  
1.036396117  
1.006813988  
0.9780612325  
0.9473614124  
0.9110470064  
0.8653604273  
0.8073096908  
0.7354320277  
0.6503232723  
0.5548353886  
0.4538900394  
0.353933777  
0.262112229  
0.1852981141  
0.1291250235  
0.09717902777  
0.09047074193  
0.1072500516  
0.1431768284  
0.1917952346  
0.2452179842  
0.2949130948  
0.3324782699  
0.3503205975  
0.3421934613  
0.303573467  
0.2318981312  
0.1266916935  
-0.01039367651  
-0.1756122115  
-0.3632466569  
-0.5658488683  
-0.7746347442  
-0.980057742  
-1.172555811  
-1.343425079  
-1.485733422  
-1.59515176  
-1.670565899  
-1.714346391  
-1.732182964  
-1.732455427  
-1.725175719  
-1.720613382  
-1.727774437  
-1.752941838  
-1.798501423  
-1.862246189  
-1.937305164  
-2.01276003  
-2.074914999  
-2.109090295  
-2.101725074  
-2.042502979  
-1.926201972  
-1.753976908  
-1.533846291  
-1.280253959  
-1.012699175  
-0.7535626411  
-0.5253788386  
-0.3479009484  
-0.2353536908  
-0.1942616095  
-0.2221869813  
-0.3075840104  
-0.4308464145  
-0.5664462155  
-0.6859183339  
-0.7613163482  
-0.7686963821  
-0.6911746929  
-0.5211536162  
-0.2614255842  
0.07499317742  
0.4662720342  
0.8842326026  
1.297547563  
1.675255281  
1.9901477  
2.221613101  
2.357602861  
2.395523999  
2.341997662  
2.21157887  
2.024652422  
1.804812162  
1.576061722  
1.360181975  
1.174550646  
1.030629606  
0.9332389968  
0.8806400196  
0.8653572061  
0.875596911  
0.8970670032  
0.914968506  
0.9159282379  
0.8896535646  
0.8301312852  
0.7362461503  
0.6117654069  
0.464709462  
0.3062068403  
0.1489962825  
0.005778328425  
-0.1123569616  
-0.1972196375  
-0.2443606097  
-0.2533673885  
-0.2276055643  
-0.1734677182  
-0.09927849022  
-0.01403344243  
0.07382740753  
0.1574334912  
0.2321544443  
0.2958581927  
0.3487656239  
0.3929592929  
0.4316672012  
0.4684495873  
0.5064262235  
0.547655912  
0.5927434472  
0.6407065706  
0.6890977689  
0.7343325617  
0.7721634263  
0.7982215875  
0.8085516829  
0.8000824244  
0.7709822118  
0.7208805179  
0.6509449327  
0.5638210226  
0.4634537741  
0.3548106767  
0.2435322752  
0.135532443  
0.03657367047  
-0.04816253323  
-0.114483727  
-0.1595502688  
-0.1821669473  
-0.1829814437  
-0.1645583464  
-0.1313174177  
-0.08932063253  
-0.04590870852  
-0.009195791487  
0.01254986677  
0.01159913227  
-0.0185179871  
-0.08233771689  
-0.1818946626  
-0.3163336651  
-0.4817616732  
-0.6713816398  
-0.8759253499  
-1.084372076  
-1.284901786  
-1.465997858  
-1.617592368  
-1.732126794  
-1.805405291  
-1.837128177  
-1.831028213  
-1.794571761  
-1.738231745  
-1.674394769  
-1.61600637  
-1.575088867  
-1.561299983  
-1.580686411  
-1.634790434  
-1.720226248  
-1.828794141  
-1.948151608  
-2.062986303  
-2.156578659  
-2.212586152  
-2.21684724  
-2.158983451  
-2.033602733  
-1.840938856  
-1.586837429  
-1.282082275  
-0.941141812  
-0.5805103884  
-0.2168683862  
0.1346745905  
0.4620085721  
0.7569278499  
1.015401893  
1.237209117  
1.42504026  
1.583256746  
1.716553034  
1.828767455  
1.922049788  
1.996521608  
2.050455917  
2.080912043  
2.084677376  
2.059319977  
2.004143084  
1.920869269  
1.813932155  
1.69033207  
1.559084321  
1.430342955  
1.314339323  
1.22027263  
1.155300011  
1.123743362  
1.126598457  
1.161396011  
1.222426896  
1.301302229  
1.387794623  
1.470877923  
1.539856036  
1.585472639  
1.600875601  
1.582327117  
1.529574966  
1.445822002  
1.337287481  
1.212396594  
1.080680477  
0.951519397  
0.8328837449  
0.7302373823  
0.6457597188  
0.5780010345  
0.5220384384  
0.4701245604  
0.4127599591  
0.3400492132  
0.2431562859  
0.1156570302  
-0.04541394795  
-0.2389784942  
-0.4598896159  
-0.6994845559  
-0.9466479465  
-1.189239959  
-1.415693462  
-1.616540355  
-1.785651059  
-1.920989573  
-2.024764452  
-2.1029344  
-2.164120484  
-2.218070686  
-2.273888488  
-2.338277782  
-2.414076255  
-2.499298879  
-2.586869425  
-2.665105982  
-2.718934323  
-2.73168954  
-2.687281173  
-2.572440077  
-2.378743149  
-2.104144192  
-1.753794185  
-1.340034727  
-0.8815519687  
-0.4017892488  
0.07319113189  
0.5171461035  
0.9061078282  
1.220584255  
1.44727627  
1.580141525  
1.620725997  
1.577752547  
1.466048098  
1.304933553  
1.116262059  
0.9222995336  
0.743653315  
0.5974412419  
0.4958637572  
0.4453041718  
0.4460353005  
0.4925461082  
0.5744532358  
0.677888241  
0.7872138621  
0.8868715403  
0.963156145  
1.00571219  
1.008585285  
0.9707133525  
0.895811213  
0.791682689  
0.6690595991  
0.5401279975  
0.4169381916  
0.3099012754  
0.2265590541  
0.1707724546  
0.1424164078  
0.1375998995  
0.149364517  
0.1687531443  
0.1861048142  
0.1924003295  
0.1804894377  
0.1460480203  
0.08815097896  
0.0093979387  
-0.08442113363  
-0.1850704789  
-0.2829324679  
-0.3682600103  
-0.4324658551  
-0.4692907338  
-0.475704581  
-0.4524234328  
-0.4039679027  
-0.3382356815  
-0.2656255795  
-0.197800224  
-0.1462275672  
-0.1206751207  
-0.1278496249  
-0.1703628679  
-0.2461729334  
-0.3486022544  
-0.4669490412  
-0.5876401785  
-0.6957941001  
-0.7770008389  
-0.8190883049  
-0.8136440303  
-0.7570847304  
-0.6511254537  
-0.5025818257  
-0.3225272953  
-0.1249182528  
0.07512847827  
0.2631717627  
0.4271489351  
0.5587199249  
0.6540761996  
0.7141202728  
0.744006568  
0.752126172  
0.7486971943  
0.744166242  
0.7476517342  
0.7656489613  
0.8011628515  
0.853378926  
0.9178894067  
0.9874222243  
1.052945379  
1.104974538  
1.134891998  
1.136098263  
1.104848668  
1.040687324  
0.9464485055  
0.82786301  
0.6928519368  
0.5506253523  
0.4107168289  
0.2820708979  
0.1722818124  
0.08704439334  
0.02983554546  
0.001823809007  
0.00196278909  
0.02722812357  
0.07293994886  
0.1331350364  
0.2009524905  
0.269020345  
0.329837726  
0.376147929  
0.4013101196  
0.3996526442  
0.3667998525  
0.2999407438  
0.198013334  
0.06177279047  
-0.1062725091  
-0.3020629119  
-0.5203051794  
-0.7548719449  
-0.9992189517  
-1.246771282  
-1.491210068  
-1.72663237  
-1.947570485  
-2.148896229  
-2.32565886  
-2.47293001  
-2.585729009  
-2.659089341  
-2.68829883  
-2.669308359  
-2.599260996  
-2.477058374  
-2.303865603  
-2.083448606  
-1.822258921  
-1.529220983  
-1.215219383  
-0.8923282858  
-0.57287642  
-0.2684524314  
0.01102539069  
0.2580708138  
0.4681364405  
0.6398170856  
0.7747359217  
0.8771331258  
0.953207159  
1.010280603  
1.055879775  
1.096824204  
1.138425689  
1.183885632  
1.233963462  
1.286954192  
1.338985766  
1.384597272  
1.417522011  
1.431576946  
1.421533695  
1.38385703  
1.317215771  
1.222708171  
1.103780971  
0.9658784612  
0.815878583  
0.6614081596  
0.5101292387  
0.3690827902  
0.2441538036  
0.1396941636  
0.05831884439  
0.0008600733689  
-0.0335428883  
-0.04724647017  
-0.04382503891  
-0.02773498548  
-0.003933028542  
0.02253284267  
0.04694638749  
0.06533818255  
0.07485245038  
0.07403660576  
0.063001949  
0.04342466717  
0.01836723699  
-0.008082806878  
-0.03132741838  
-0.04686956594  
-0.05095351861  
-0.04114338649  
-0.01676153978  
0.02088530085  
0.06852755326  
0.1212156611  
0.1728230065  
0.2167174639  
0.2465013856  
0.2567358613  
0.2435503946  
0.2050702965  
0.141620956  
0.05570028509  
-0.04825797111  
-0.1642821569  
-0.2853628089  
-0.4039962052  
-0.51272049  
-0.6046082451  
-0.6736983848  
-0.7153591651  
-0.7265836286  
-0.7062141857  
-0.655087382  
-0.5760810875  
-0.4740368989  
-0.355531196  
-0.2284771578  
-0.1015547875  
0.01650539356  
0.1177339962  
0.1957498154  
0.2465107919  
0.2688835619  
0.2649447445  
0.2399472197  
0.2019210482  
0.1609289466  
0.1280361765  
0.1140992506  
0.128503915  
0.1780012988  
0.26577772  
0.3908809121  
0.5480759688  
0.7281612943  
0.9187213573  
1.105238917  
1.272449238  
1.40579631  
1.492833827  
1.524427627  
1.495633953  
1.406171556  
1.260438305  
1.067082928  
0.8381809384  
0.5881054515  
0.3322150365  
0.0854996233  
-0.1386834424  
-0.3296594292  
-0.4801766167  
-0.5867909319  
-0.6498774564  
-0.6733031505  
-0.6638173529  
-0.6302448029  
-0.5825657159  
-0.5309721668  
-0.4849734208  
-0.4526090683  
-0.4398180856  
-0.4499971098  
-0.4837717509  
-0.5389979021  
-0.6110013877  
-0.6930453436  
-0.7770071974  
-0.854212419  
-0.9163578594  
-0.9564323944  
-0.9695323499  
-0.9534656365  
-0.9090600064  
-0.8401168247  
-0.7529969725  
-0.6558770028  
-0.5577589055  
-0.4673596417  
-0.3920270975  
-0.3368284542  
-0.303942621  
-0.2924370943  
-0.2984673347  
-0.3158660751  
-0.3370454933  
-0.3540840918  
-0.3598534131  
-0.3490337138  
-0.318886461  
-0.2696896487  
-0.2047904445  
-0.1302694865  
-0.05427350046  
0.01390420742  
0.06488810298  
0.09030788951  
0.08380083877  
0.04183094285  
-0.03575536566  
-0.1454829513  
-0.2803410407  
-0.4302135127  
-0.582622117  
-0.7237328029  
-0.8395540008  
-0.9172274318  
-0.9462979377  
-0.919834055  
-0.8352713341  
-0.6948591562  
-0.5056312888  
-0.2788582661  
-0.02900833155  
0.227694881  
0.4749614846  
0.6981677367  
0.8859078947  
1.031140503  
1.131760965  
1.190495431  
1.214113996  
1.212073018  
1.194779849  
1.171755839  
1.149994247  
1.132790919  
1.119258282  
1.104618057  
1.081242669  
1.040279915  
0.9735802597  
0.8755959008  
0.7448985976  
0.5850326323  
0.4045189055  
0.2159776583  
0.03449000091  
-0.1245462452  
-0.2477162109  
-0.325662602  
-0.35458967  
-0.3369435086  
-0.2811562606  
-0.2004902189  
-0.1111715497  
-0.0301051859  
0.02747300554  
0.05005323041  
0.03132200328  
-0.02914945515  
-0.126064317  
-0.2493450426  
-0.385687864  
-0.5204683609  
-0.6397124384  
-0.7318470383  
-0.7890065174  
-0.8077456351  
-0.7891076699  
-0.738093298  
-0.6626566425  
-0.5724063581  
-0.4772240797  
-0.385990405  
-0.3055892972  
-0.2402916574  
-0.1915645677  
-0.1582811394  
-0.1372525665  
-0.1239681225  
-0.1134121728  
-0.1008293725  
-0.08233715864  
-0.05531859978  
-0.01857145553  
0.0277675528  
0.08247412488  
0.1435911949  
0.2088093354  
0.2758055026  
0.3424864574  
0.4071159156  
0.4683259254  
0.5250373746  
0.5763330004  
0.6213268552  
0.6590774758  
0.6885719366  
0.7087967021  
0.7188850809  
0.718320544  
0.7071511022  
0.6861746029  
0.657047098  
0.6222846523  
0.5851397696  
0.5493586887  
0.5188412641  
0.497246721  
0.4875920362  
0.4919002622  
0.5109359929  
0.5440645783  
0.5892465563  
0.6431587883  
0.7014285591  
0.758944883  
0.8102156479  
0.8497356091  
0.8723394906  
0.8735182777  
0.8496880033  
0.7984079819  
0.7185438064  
0.6103778324  
0.4756622945  
0.317612085  
0.1408242074  
-0.04888208187  
-0.2447197804  
-0.4392794956  
-0.6249642481  
-0.7944878433  
-0.9414015882  
-1.060600124  
-1.148750016  
-1.204584537  
-1.22901976  
-1.22506513  
-1.197526171  
-1.152525633  
-1.096889355  
-1.037468927  
-0.9804755155  
-0.930900013  
-0.8920840478  
-0.8654835682  
-0.85064669  
-0.8453950661  
-0.8461845741  
-0.8485926987  
-0.8478790752  
-0.8395505309  
-0.8198756674  
-0.7862921832  
-0.7376682137  
-0.6743975425  
-0.5983161302  
-0.5124595135  
-0.420685166  
-0.3272059029  
-0.2360883204  
-0.1507771108  
-0.07370390038  
-0.006033248812  
0.05241364082  
0.1030485537  
0.1482169449  
0.1907579118  
0.233473047  
0.2785903068  
0.3273034777  
0.3794696793  
0.4335225163  
0.4866313674  
0.535092489  
0.5749006023  
0.6024109569  
0.6149846859  
0.6114956815  
0.5926114581  
0.5607791296  
0.5199094604  
0.4748040021  
0.4304160057  
0.391071029  
0.3597807361  
0.3377696815  
0.3242901715  
0.3167519916  
0.311134716  
0.3025979294  
0.2861807244  
0.2574674071  
0.2131210423  
0.1512168896  
0.07136015048  
-0.02538822601  
-0.1367108194  
-0.2592884407  
-0.3890307805  
-0.5212441124  
-0.6507233589  
-0.7718039991  
-0.8784325171  
-0.964337034  
-1.023361483  
-1.050007986  
-1.040167454  
-0.9919789098  
-0.9066855409  
-0.789333505  
-0.6491292787  
-0.4993046895  
-0.3563736344  
-0.2387573339  
-0.1648432535  
-0.1506496133  
-0.2073616758  
-0.3390628769  
-0.5410192118  
-0.7988382968  
-1.088753389  
-1.37915311  
-1.633315448  
-1.813133735  
-1.883449537  
-1.816488697  
-1.595817377  
-1.219254532  
-0.700265688  
-0.0675431862  
0.6372980777  
1.363708341  
2.057438075  
2.666376865  
3.146252387  
3.465439285  
3.608242602  
3.576227651  
3.387435729  
3.073631559  
2.675993387  
2.239860768  
1.809275063  
1.422036299  
1.105903891  
0.8763678013  
0.7361738891  
0.676531098  
0.6796930797  
0.7224331862  
0.7798545538  
0.8289693802  
0.851571647  
0.8360809772  
0.7782163816  
0.6805460877  
0.5511245426  
0.4015363601  
0.2447178635  
0.09291737235  
-0.04391897605  
-0.1591472895  
-0.2497516611  
-0.3160492503  
-0.3609272565  
-0.388816771  
-0.4046317142  
-0.4128714119  
-0.4170330511  
-0.4193975202  
-0.421181915  
-0.4229672574  
-0.4252706849  
-0.4291051269  
-0.4363754597  
-0.4500089715  
-0.4737587016  
-0.511699438  
-0.567489756  
-0.6435305754  
-0.740176038  
-0.8551551049  
-0.9833386511  
-1.116933285  
-1.246120087  
-1.360081131  
-1.448290306  
-1.501889657  
-1.514951513  
-1.485425087  
-1.415611507  
-1.312067311  
-1.184927256  
-1.046716756  
-0.9108160303  
-0.7897768376  
-0.69373722  
-0.6291487638  
-0.5980036903  
-0.5976605559  
-0.6212886576  
-0.6588602431  
-0.6985438203  
-0.7282940343  
-0.7374191622  
-0.7179159156  
-0.6653960423  
-0.5795008694  
-0.4637708731  
-0.3250122341  
-0.1722722203  
-0.01558251766  
0.1353533151  
0.2723486707  
0.3896510738  
0.4844860628  
0.5571850837  
0.6109083624  
0.65103084  
0.6842914154  
0.7178227135  
0.7581865911  
0.8105135213  
0.87783202  
0.9606339063  
1.056704751  
1.161215976  
1.267071383  
1.365471765  
1.446668335  
1.500850628  
1.519103914  
1.494357912  
1.422228396  
1.301653761  
1.135230622  
0.9291773861  
0.6928972583  
0.438162775  
0.1780019524  
