-0.1143255399  
-0.02513538349  
0.05421689667  
0.1167173348  
0.157456729  
0.1742648848  
0.1680075348  
0.1424870472  
0.103961852  
0.06031555  
0.01999386518  
-0.009161443722  
-0.02102227009  
-0.01205773672  
0.01813781647  
0.06678001437  
0.1283059363  
0.1952356888  
0.259358836  
0.3130745682  
0.3506846888  
0.3694228742  
0.3700444697  
0.3568703556  
0.337240043  
0.3204543826  
0.3163426309  
0.3336822588  
0.3787008784  
0.4539131299  
0.5574690171  
0.6831322393  
0.8209038841  
0.9582028503  
1.081440803  
1.177749551  
1.236626467  
1.25124613  
1.219268329  
1.143023981  
1.029088004  
0.8873076364  
0.7294461786  
0.5676623758  
0.4130463829  
0.2744271893  
0.1576068074  
0.06511297461  
-0.003529544916  
-0.05109303409  
-0.08165621748  
-0.09952588699  
-0.1082746972  
-0.1100740015  
-0.1054392966  
-0.09343640524  
-0.07229261789  
-0.04029341313  
0.003229220692  
0.05702576772  
0.117363164  
0.1779317539  
0.2302670353  
0.264671536  
0.2715136454  
0.2426984551  
0.173080079  
0.06156412695  
-0.0882903621  
-0.2683109903  
-0.4664152623  
-0.6679084448  
-0.8571986619  
-1.019694618  
-1.143608942  
-1.221405364  
-1.250673078  
-1.234304485  
-1.179940685  
-1.098780108  
-1.003911694  
-0.9084276893  
-0.823586196  
-0.7572957345  
-0.7131333311  
-0.690038501  
-0.6827198211  
-0.6827088772  
-0.6798889344  
-0.6642727382  
-0.6277501941  
-0.5655324153  
-0.4770744422  
-0.366321321  
-0.2412391289  
-0.112683967  
0.007207429383  
0.106880012  
0.1771770805  
0.2128349253  
0.2134129641  
0.183515335  
0.1322423424  
0.07195056274  
0.01649687561  
-0.02079019094  
-0.02908870588  
-0.001738723443  
0.06269178207  
0.1600840988  
0.2812566669  
0.4131801944  
0.5407632399  
0.6489389212  
0.7247570467  
0.7591801386  
0.7483261109  
0.6939882656  
0.603354694  
0.4879849384  
0.3621807471  
0.2409834464  
0.1380697794  
0.06383122174  
0.0238778894  
0.01817705121  
0.04090994714  
0.08109416757  
0.1238776613  
0.1523781733  
0.1498406859  
0.1018905277  
-0.001379824313  
-0.1637351485  
-0.3817304514  
-0.6444009807  
-0.9337965934  
-1.226338589  
-1.494914213  
-1.711511095  
-1.850140814  
-1.889722745  
-1.816614786  
-1.62645183  
-1.325064735  
-0.9283111926  
-0.4608084822  
0.04632135557  
0.558440417  
1.040771751  
1.461761594  
1.796024191  
2.026524486  
2.145762157  
2.155860598  
2.067610205  
1.898642065  
1.671031504  
1.408654736  
1.134653643  
0.8693022978  
0.6284766691  
0.4228458172  
0.2577700605  
0.133810541  
0.04768000397  
-0.006562420127  
-0.03628017963  
-0.04914726007  
-0.05228087166  
-0.05166633818  
-0.05187201962  
-0.05600597905  
-0.06584316448  
-0.08203513038  
-0.1043483413  
-0.1318674579  
-0.1631605436  
-0.1964018392  
-0.2294742948  
-0.2600791584  
-0.2858698185  
-0.3046159246  
-0.3143908259  
-0.3137538195  
-0.3019025439  
-0.2787606945  
-0.244986927  
-0.2018909988  
-0.1512801651  
-0.09526089623  
-0.03603103918  
0.02429321533  
0.08379332261  
0.1407876981  
0.1937952707  
0.2414578747  
0.2824396114  
0.3153524726  
0.3387344135  
0.3510964824  
0.3510563303  
0.3375141007  
0.3098660957  
0.2681947297  
0.2134082245  
0.1472961131  
0.07248613771  
-0.007691958661  
-0.08941476625  
-0.168604934  
-0.2411756903  
-0.3032378014  
-0.3512578719  
-0.3821538255  
-0.3933517326  
-0.3828372816  
-0.3492214558  
-0.2918651704  
-0.2110787798  
-0.1083912669  
0.01314511033  
0.1486572232  
0.2912477887  
0.4319644783  
0.560025208  
0.6633494224  
0.7294178578  
0.7464318403  
0.704665332  
0.5978795395  
0.4245938983  
0.1890267075  
-0.09851460693  
-0.4219105188  
-0.7602555419  
-1.089581917  
-1.385129328  
-1.6239108  
-1.787239702  
-1.862881178  
-1.846499388  
-1.742175191  
-1.561882089  
-1.323975971  
-1.050887171  
-0.7663540472  
-0.4925845666  
-0.2477735852  
-0.0443224117  
0.1119880885  
0.2217823154  
0.2909285688  
0.328647845  
0.3452705721  
0.3500317563  
0.3493023029  
0.3455569684  
0.3372496689  
0.3195799253  
0.2860045954  
0.2301714304  
0.1479097276  
0.03887678992  
-0.09247111517  
-0.236781732  
-0.3806576099  
-0.5083143351  
-0.6037968175  
-0.6533821647  
-0.647762257  
-0.5836313298  
-0.464407468  
-0.2999533978  
-0.1053306979  
0.1012160928  
0.3007212152  
0.4760235519  
0.6139521484  
0.7068432058  
0.7531841458  
0.7573034572  
0.7282101083  
0.6778160636  
0.6188415747  
0.5627743891  
0.5181949743  
0.4897164005  
0.4776580766  
0.4784485244  
0.4856327377  
0.4912623535  
0.4874090634  
0.4675520995  
0.4276237622  
0.3665954301  
0.2865666562  
0.1924083565  
0.09107332699  
-0.009271988925  
-0.1001589089  
-0.1736445695  
-0.2230002953  
-0.2432132125  
-0.2313404217  
-0.186728598  
-0.1111417988  
-0.008806453695  
0.1136414435  
0.2473393436  
0.3815744961  
0.5043813083  
0.6033945776  
0.6669139895  
0.6851062486  
0.6512143441  
0.5626102514  
0.4215278911  
0.2353287148  
0.01621387201  
-0.2196320244  
-0.4534130552  
-0.6654552555  
-0.8371203294  
-0.9526730912  
-1.000884497  
-0.9761866205  
-0.8792461955  
-0.7169121758  
-0.5015399097  
-0.2497790356  
0.01903555718  
0.2847261349  
0.528153787  
0.7329582159  
0.8869893887  
0.9832861165  
1.020521925  
1.002870081  
0.9392948961  
0.8423606369  
0.7266716688  
0.6071145452  
0.4971163822  
0.4070985249  
0.343338481  
0.3073709541  
0.2960135313  
0.3020240703  
0.3153100789  
0.3245384711  
0.3189288277  
0.2899868724  
0.23293601  
0.1476258214  
0.03878301028  
-0.08445013272  
-0.2096568419  
-0.3228033328  
-0.410200043  
-0.460494239  
-0.4663991227  
-0.4259084883  
-0.3428111541  
-0.2264086556  
-0.09046144306  
0.04850532399  
0.1733072437  
0.2683306724  
0.3215699832  
0.3261879635  
0.2813658264  
0.1923152029  
0.0694489876  
-0.07318823709  
-0.2200036007  
-0.356159393  
-0.4697425572  
-0.5535043714  
-0.6058717089  
-0.6310858935  
-0.638438733  
-0.6406910318  
-0.6519337489  
-0.6851943817  
-0.7501717966  
-0.8514508126  
-0.9874849359  
-1.150515127  
-1.327449919  
-1.501584738  
-1.654893277  
-1.770553399  
-1.835308991  
-1.841314957  
-1.787178585  
-1.678050342  
-1.524755524  
-1.342111395  
-1.146715009  
-0.9545295471  
-0.778672045  
-0.6277137452  
-0.5047556737  
-0.4073831572  
-0.3284866958  
-0.257766272  
-0.1836761368  
-0.09546863092  
0.01497869736  
0.1518258143  
0.3146138534  
0.4983416196  
0.6942331843  
0.8910244211  
1.076543831  
1.239317785  
1.369954474  
1.462118601  
1.512975375  
1.523105273  
1.495954085  
1.436978707  
1.352665037  
1.249613464  
1.133834576  
1.010362244  
0.8831862008  
0.7554672974  
0.6299190882  
0.5092233966  
0.3963550956  
0.2947039037  
0.2079561317  
0.1397493418  
0.09316247934  
0.07016353983  
0.07113594275  
0.09459478553  
0.1371737262  
0.1939042825  
0.2587457662  
0.3252835947  
0.3874685903  
0.4402720371  
0.4801423619  
0.5051953561  
0.5151159116  
0.510825066  
0.4939825644  
0.4664540783  
0.4298649202  
0.3853313051  
0.3334456778  
0.2745173532  
0.209016723  
0.138134658  
0.06431628206  
-0.008369967004  
-0.07415409358  
-0.1258571154  
-0.1555815925  
-0.1557426392  
-0.1203177782  
-0.04613493517  
0.06601586916  
0.2106467737  
0.3773938313  
0.5514861925  
0.7148842593  
0.8479802623  
0.931701226  
0.9497444865  
0.8906786641  
0.7496230918  
0.5292710241  
0.2401138172  
-0.100206418  
-0.4683582383  
-0.8374404501  
-1.179544243  
-1.46847452  
-1.682337546  
-1.805713494  
-1.831188309  
-1.760071115  
-1.602222611  
-1.374996925  
-1.101408514  
-0.8076967993  
-0.5205517432  
-0.2642900104  
-0.05830286256  
0.08493899109  
0.1610693654  
0.174055442  
0.1354217738  
0.06254870201  
-0.02375106488  
-0.1020705237  
-0.1533046202  
-0.1632095415  
-0.1242892883  
-0.03674854465  
0.09161557075  
0.246558643  
0.4094132314  
0.559688205  
0.6778840367  
0.7481244916  
0.7602430057  
0.711041945  
0.6045839098  
0.4514893111  
0.2673854779  
0.07074089353  
-0.1195844041  
-0.2867281604  
-0.4178287736  
-0.5053890484  
-0.5478541465  
-0.5493781167  
-0.5188596406  
-0.4684406849  
-0.4117163243  
-0.3619187212  
-0.3303205167  
-0.3250546991  
-0.3504477147  
-0.406891953  
-0.4911905768  
-0.5972550502  
-0.7170001211  
-0.8412796148  
-0.9607406314  
-1.066506618  
-1.150661691  
-1.206547809  
-1.228925456  
-1.214054736  
-1.159753961  
-1.065472488  
-0.9323764771  
-0.763439833  
-0.5634832605  
-0.3391285005  
-0.09861049547  
0.1485692097  
0.3921469053  
0.6217375833  
0.8275515785  
1.001122863  
1.135969979  
1.228115081  
1.276409633  
1.282614902  
1.251237069  
1.18911198  
1.104794902  
1.007790125  
0.9077114299  
0.8134365358  
0.7323580898  
0.6697861919  
0.6285779873  
0.6090237485  
0.6090014211  
0.6243781959  
0.6496097308  
0.6784507487  
0.7047046734  
0.7229080587  
0.7288728292  
0.7200333055  
0.6955659451  
0.6562987494  
0.6044409194  
0.5431893913  
0.4762901124  
0.4076064448  
0.3407435062  
0.2787671274  
0.2240215575  
0.1780333924  
0.1414945109  
0.1142956556  
0.09559622542  
0.08392125939  
0.07727100109  
0.07326259957  
0.06927802476  
0.0626399218  
0.05079390612  
0.03149716509  
0.002980608988  
-0.03591043189  
-0.08562650032  
-0.145871848  
-0.2156239728  
-0.2931948707  
-0.3763361922  
-0.4623674717  
-0.5483234643  
-0.6311047697  
-0.7076289945  
-0.7749769534  
-0.8305293856  
-0.8720962647  
-0.8980351024  
-0.9073479681  
-0.899758276  
-0.8757554176  
-0.8365966826  
-0.7842694416  
-0.7213951027  
-0.651085256  
-0.5767500726  
-0.5018784525  
-0.4297979362  
-0.3634530461  
-0.305217951  
-0.2567747058  
-0.2190789377  
-0.1924123355  
-0.1765212351  
-0.1708153378  
-0.1745877093  
-0.1872150758  
-0.2082870932  
-0.2376334242  
-0.2752360065  
-0.3210259063  
-0.3746103207  
-0.4349813771  
-0.5002740713  
-0.5676419263  
-0.6332936275  
-0.6927236714  
-0.741110596  
-0.7738398529  
-0.7870791052  
-0.7783086926  
-0.7467235741  
-0.6934407006  
-0.6214627373  
-0.5354086316  
-0.4410315276  
-0.344598249  
-0.2522036126  
-0.1691156191  
-0.09922450638  
-0.04466091355  
-0.005621191143  
0.01958662974  
0.03428747276  
0.04301441704  
0.05095323015  
0.06333127628  
0.08479549679  
0.1188726327  
0.1675436111  
0.2310083191  
0.3076514321  
0.3942337651  
0.486291411  
0.5786952955  
0.6663124138  
0.7446732176  
0.8105630164  
0.8624465531  
0.9006607326  
0.9273419521  
0.946102239  
0.9614955298  
0.9783635428  
1.001167655  
1.033405656  
1.077212151  
1.133191849  
1.200490658  
1.277074172  
1.360130896  
1.446497152  
1.533012697  
1.616720881  
1.694879981  
1.764796115  
1.823545802  
1.867678859  
1.89303492  
1.894762258  
1.867633285  
1.806653005  
1.707921881  
1.569627473  
1.392987506  
1.182965092  
0.9485643097  
0.702567304  
0.4606739717  
0.2400678579  
0.0575718531  
-0.07239633228  
-0.1397768914  
-0.1404447567  
-0.07715300831  
0.0403171135  
0.1958707512  
0.3686056713  
0.5349409462  
0.6710887251  
0.7555685048  
0.7714366047  
0.7079717638  
0.5616177388  
0.3360985132  
0.04172987406  
-0.3059623271  
-0.6881232256  
-1.084708379  
-1.476631171  
-1.847679258  
-2.185993489  
-2.484964767  
-2.743468572  
-2.965420861  
-3.158712611  
-3.333648297  
-3.50105822  
-3.670299574  
-3.847386972  
-4.03348157  
-4.22396003  
-4.408216157  
-4.570290107  
-4.690310514  
-4.746636628  
-4.718487269  
-4.588744617  
-4.346574874  
-3.989491656  
-3.524536622  
-2.968340915  
-2.345984802  
-1.688730947  
-1.03088661  
-0.4061934703  
0.1557712692  
0.6326796785  
1.011572651  
1.289726631  
1.474145772  
1.579784799  
1.626805316  
1.637312229  
1.632082539  
1.627806363  
1.635242717  
1.658517206  
1.69563726  
1.740029961  
1.78279907  
1.815251972  
1.831232289  
1.82883432  
1.811200894  
1.786265402  
1.765495146  
1.761856806  
1.78736242  
1.850627833  
1.954865702  
2.096675759  
2.265846611  
2.446242839  
2.617666196  
2.758420385  
2.848226673  
2.871055242  
2.817482852  
2.686226625  
2.484641261  
2.228111004  
1.938404891  
1.641200029  
1.363089427  
1.128443729  
0.9565018455  
0.8590460001  
0.8389345941  
0.8896601536  
0.9959908254  
1.135623616  
1.281653574  
1.405595163  
1.48059338  
1.484477497  
1.402286777  
1.227986818  
0.9651756377  
0.6266933581  
0.2331947046  
-0.1891470867  
-0.6115044498  
-1.005495268  
-1.346117815  
-1.614193244  
-1.798027188  
-1.894134753  
-1.906995217  
-1.847935241  
-1.733338835  
-1.582470288  
-1.41520545  
-1.249959775  
-1.102032873  
-0.9825153703  
-0.8978042407  
-0.8496909059  
-0.8359144579  
-0.8510429383  
-0.8875221975  
-0.9367574435  
-0.9901068756  
-1.039712263  
-1.079129401  
-1.103730957  
-1.110902227  
-1.100039976  
-1.072371445  
-1.030637677  
-0.9786616675  
-0.9208406831  
-0.861630576  
-0.8050583823  
-0.7543345947  
-0.7116187864  
-0.6779621845  
-0.6534472049  
-0.6374875752  
-0.629226841  
-0.627947606  
-0.6333950317  
-0.6459113518  
-0.6663313321  
-0.6956167936  
-0.7342778531  
-0.7816770398  
-0.8353638116  
-0.8905907326  
-0.9401685416  
-0.9747538168  
-0.9836099948  
-0.9557890136  
-0.881609211  
-0.7542215926  
-0.571038326  
-0.3347742496  
-0.05391432974  
0.2575406588  
0.5810524798  
0.8951866833  
1.177723385  
1.407969745  
1.568985503  
1.649408041  
1.644642761  
1.557261156  
1.396567806  
1.177416163  
0.9184562779  
0.6400750831  
0.362313881  
0.1030206958  
-0.1235349128  
-0.3074812473  
-0.4435547268  
-0.530778608  
-0.5717364424  
-0.5716066897  
-0.5371305828  
-0.4756704765  
-0.3944326261  
-0.2999235288  
-0.1976251661  
-0.09185445433  
0.01424484445  
0.1186252707  
0.2202093083  
0.3187244519  
0.4144926173  
0.5081698788  
0.6004159579  
0.691527967  
0.7810598105  
0.8674917658  
0.9480348245  
1.018626033  
1.074174446  
1.109063777  
1.117867156  
1.096194373  
1.04152574  
0.9539038016  
0.8363315796  
0.6947784601  
0.5377505696  
0.3754621224  
0.2186948058  
0.07752218437  
-0.0399190339  
-0.1284086124  
-0.1862171219  
-0.2151756742  
-0.2202165321  
-0.2084575101  
-0.1879795065  
-0.1664741549  
-0.1499961439  
-0.1420123392  
-0.1429082318  
-0.1500229685  
-0.1582249454  
-0.1609233849  
-0.1513711913  
-0.1240476029  
-0.07590257502  
-0.007262311308  
0.07775835049  
0.1714176262  
0.2630847317  
0.3404765334  
0.3912306425  
0.4046171881  
0.3731542303  
0.2939071319  
0.1692760818  
0.007149841422  
-0.1796344551  
-0.3744853321  
-0.5587949413  
-0.7140265478  
-0.823922416  
-0.8765565546  
-0.8659901571  
-0.7932954625  
-0.6668036756  
-0.5014939099  
-0.3175565077  
-0.1382591575  
0.01267140431  
0.1138633019  
0.1489741348  
0.1089048171  
-0.006750016082  
-0.1892258961  
-0.4211939064  
-0.6784242192  
-0.9323519788  
-1.153261075  
-1.313718112  
-1.391842905  
-1.373995401  
-1.256546944  
-1.04648227  
-0.7607547128  
-0.4244545385  
-0.06801007143  
0.2762302806  
0.5776222237  
0.8105995768  
0.9574056504  
1.0098488  
0.9699090294  
0.8491387325  
0.666992593  
0.448305765  
0.2202825679  
0.009368325514  
-0.161615575  
-0.2757323952  
-0.3233751059  
-0.3027588154  
-0.2194833565  
-0.08527930082  
0.08383498387  
0.2697309694  
0.4543802811  
