262.1756167  
263.9307156  
265.8328419  
249.4562006  
165.6523477  
472.1659119  
14719.05142  
4399.994346  
49883.79662  
3613.026267  
48556.18813  
7814.233873  
29884.53187  
10935.66083  
17859.42324  
6912.234524  
8037.757788  
11813.31546  
15524.60759  
15183.85267  
12226.74975  
25820.70829  
2225.220484  
2067.412431  
5680.037091  
4335.214718  
19664.59203  
5910.537115  
9336.661054  
4404.369301  
4157.229447  
41076.41263  
3679.22997  
7257.115521  
11210.40694  
294.5049589  
1148.044219  
76.79297465  
1368.461585  
2611.375334  
231.6509904  
45.9053305  
1092.252413  
9654.794465  
13708.74089  
5925.084476  
7866.000862  
5660.418241  
6317.983244  
2291.570595  
342.0939669  
2045.105438  
1923.872347  
3560.253109  
4451.747852  
4234.13555  
407.36717  
2052.751769  
1883.809817  
203.4539232  
853.6533184  
80.36361896  
259.8061575  
40.35576598  
217.5925338  
237.7559824  
305.5759682  
3.404571605  
18.28936817  
26.26563623  
8.428921511  
45.28005866  
5.731968061  
8.862784856  
2.882844839  
11.34733186  
0.3554756744  
5.328063753  
5.644820723  
2.971874339  
6.173142914  
3.593499421  
4.766188744  
4.187331951  
2.050656068  
2.705075232  
2.949218026  
2.297042474  
2.166770591  
2.474226135  
2.358707285  
2.247055692  
2.007765643  
2.07536186  
1.902964031  
1.857330385  
1.781914567  
1.743506262  
1.66084518  
1.641167909  
1.597157998  
1.561412433  
1.526100364  
1.465962501  
1.424699011  
1.407273262  
1.364714516  
1.326938685  
1.305389994  
1.271002413  
1.24241294  
1.213505179  
1.182663159  
1.159756735  
1.130275896  
1.110364862  
1.085190139  
1.063575206  
1.039630483  
1.018805812  
0.9981298763  
0.9776456058  
0.9585028719  
0.9395585354  
0.9220781905  
0.904322278  
0.8870926431  
0.8706342826  
0.854820019  
0.8392631792  
0.8243782835  
0.8099041952  
0.7955329871  
0.781943156  
0.7683867982  
0.7553813047  
0.7427002504  
0.7303345558  
0.7183803287  
0.7066885382  
0.6953467685  
0.6843196143  
0.6735349118  
0.6630519037  
0.6528192107  
0.6428652833  
0.6331389723  
0.6236727644  
0.614426777  
0.6054021693  
0.5966215965  
0.5880409365  
0.5796615198  
0.5714729575  
0.5634684811  
0.5556689793  
0.5480402594  
0.5405834223  
0.5332910441  
0.5261763839  
0.5192094375  
0.5124031513  
0.5057334526  
0.4992257421  
0.4928372958  
0.486588612  
0.4804886065  
0.4745006186  
0.4686512252  
0.4629277903  
0.4573097494  
0.4518124159  
0.4464231401  
0.4411525786  
0.4359713208  
0.4309075125  
0.4259263623  
0.4210665877  
0.4162819993  
0.4116055439  
0.4070073386  
0.4025031109  
0.3980762707  
0.3937501817  
0.3894758064  
0.3853028576  
0.3812060851  
0.3771817883  
0.3732299413  
0.3693493214  
0.3655461657  
0.3618079154  
0.3581336322  
0.3545211066  
0.350976312  
0.3474909878  
0.3440640579  
0.3407003107  
0.3373928075  
0.3341538972  
0.3309608763  
0.327820812  
0.324736305  
0.3217020353  
0.3187137868  
0.3157758623  
0.3128991224  
0.3100553431  
0.3072565403  
0.3045181918  
0.3018140642  
0.2991428865  
0.2965315071  
0.2939627857  
0.2914274663  
0.2889303803  
0.2864720779  
0.2840602173  
0.2816746491  
0.2793353401  
0.2770153729  
0.2747477331  
0.2725122308  
0.2703004421  
0.2681321526  
0.2659940655  
0.26388733  
0.2618162436  
0.2597737793  
0.2577536276  
0.2557681262  
0.2538050109  
0.2518929017  
0.249978765  
0.248103912  
0.2462622013  
0.2444445304  
0.2426482692  
0.2408863595  
0.2391351721  
0.2374165884  
0.2357210669  
0.2340431115  
0.2324033639  
0.2307735445  
0.229171449  
0.2275984792  
0.2260323745  
0.2244967252  
0.2229792696  
0.2214727447  
0.2200037084  
0.218547518  
0.2171062707  
0.215686878  
0.2142919235  
0.2129111693  
0.2115461971  
0.2101985445  
0.2088700396  
0.2075640895  
0.2062679458  
0.2049908446  
0.203721961  
0.2024853203  
0.2012591278  
0.200038669  
0.1988523524  
0.1976657022  
0.1964983205  
0.1953485089  
0.1942082283  
0.1930810129  
0.1919781738  
0.1908784113  
0.1897983201  
0.1887349619  
0.1876700454  
0.1866361116  
0.1856098548  
0.1845888411  
0.1835862769  
0.1825942871  
0.1816077804  
0.1806420707  
0.1796904627  
0.1787471876  
0.1778123399  
0.1768858121  
0.1759779959  
0.175074458  
0.1741844623  
0.173308524  
0.1724268486  
0.1715792294  
0.1707283865  
0.1698902514  
0.1690699681  
0.1682500695  
0.1674349918  
0.1666425559  
0.165847527  
0.1650689144  
0.1642971649  
0.1635329171  
0.1627795784  
0.1620447671  
0.1613039604  
0.1605751672  
0.1598561962  
0.1591428494  
0.158441179  
0.1577439149  
0.1570588724  
0.1563814462  
0.1557108333  
0.15504601  
0.1543914103  
0.1537458324  
0.153099817  
0.1524720895  
0.151848469  
0.1512235269  
0.1506139063  
0.1500047238  
0.1494101805  
0.1488171635  
0.1482321247  
0.1476558433  
0.147079602  
0.1465168805  
0.1459607591  
0.1454096316  
0.1448581248  
0.1443228831  
0.1437848682  
0.1432580213  
0.1427421364  
0.1422272645  
0.1417147163  
0.1412070917  
0.140715932  
0.1402198908  
0.1397357447  
0.1392544893  
0.13877367  
0.1383048468  
0.1378404741  
0.1373771643  
0.1369285696  
0.1364713818  
0.1360309456  
0.1355850376  
0.1351557736  
0.1347286712  
0.1343036968  
0.1338906958  
0.1334647666  
0.1330610553  
0.1326498425  
0.132247461  
0.1318589858  
0.1314663184  
0.1310756129  
0.1306991363  
0.1303209244  
0.1299451377  
0.1295781209  
0.1292087746  
0.128848355  
0.1284913417  
0.1281371104  
0.1277915513  
0.1274556991  
0.1271149059  
0.1267764163  
0.1264464315  
0.1261160446  
0.1257948795  
0.1254747096  
0.1251554005  
0.1248481034  
0.1245448527  
0.1242390295  
0.1239376758  
0.123640264  
0.1233492358  
0.1230577387  
0.122774753  
0.1224840743  
0.1222085676  
0.1219365515  
0.1216622711  
0.1213941256  
0.1211335847  
0.1208703603  
0.1206174587  
0.12035723  
0.1201034975  
0.1198599324  
0.1196129869  
0.1193707166  
0.1191387196  
0.1189023439  
0.1186728223  
0.1184413849  
0.1182152652  
0.1179940375  
0.1177777657  
0.1175613981  
0.1173495062  
0.1171392137  
0.1169315802  
0.1167278225  
0.1165283156  
0.1163328687  
0.1161376672  
0.115945022  
0.1157580389  
0.1155698878  
0.1153877532  
0.1152051353  
0.1150320808  
0.1148547842  
0.1146882007  
0.1145167864  
0.1143479493  
0.1141845732  
0.1140258919  
0.1138714792  
0.113720862  
0.1135646497  
0.1134141294  
0.1132671283  
0.1131250791  
0.1129805862  
0.1128430013  
0.112706123  
0.1125724799  
0.1124437359  
0.1123119682  
0.1121852115  
0.1120647853  
0.1119461045  
0.1118263302  
0.1117060041  
0.1116010451  
0.1114874139  
0.111383882  
0.1112756811  
0.1111688154  
0.1110728262  
0.1109771403  
0.1108722356  
0.1107872711  
0.1106981191  
0.1106109744  
0.1105276985  
0.1104389348  
0.110354121  
0.1102776639  
0.1102051629  
0.1101289871  
0.110060328  
0.1099919017  
0.1099257871  
0.1098612104  
0.1097995346  
0.1097383136  
0.1096848858  
0.1096303041  
0.1095744521  
0.1095250802  
0.1094797772  
0.1094299943  
0.109392264  
0.1093537996  
0.109313833  
0.1092789816  
0.1092467486  
0.109209951  
0.109183602  
0.1091540995  
0.1091334866  
0.1091136925  
0.1090901208  
0.1090776725  
0.1090603424  
0.1090464302  
0.1090302907  
0.109023658  
0.1090229281  
0.1090169377  
0.1090205625  
