5230.337043  
5459.09428  
5963.007544  
6959.922401  
8149.760222  
4343.233844  
36279.17539  
19394.43736  
9647.961136  
24230.09621  
33081.77104  
14717.39551  
35372.97366  
11047.39424  
20135.89899  
605.994133  
9377.171021  
8320.180776  
5529.784221  
13979.86609  
7665.602519  
70.47533407  
18096.15222  
2308.446725  
2869.71852  
2878.716474  
139.6960891  
1300.349995  
2072.096424  
11386.76297  
2444.216645  
624.6068789  
13938.52543  
7887.745163  
3231.379753  
3033.046442  
874.7521236  
12260.49804  
4388.451113  
11746.40611  
4562.408942  
10629.39605  
4078.246748  
3737.505161  
2567.228911  
1059.15005  
5446.424665  
3887.231153  
3930.172989  
1339.896575  
24023.79532  
2199.303868  
565.937713  
9928.43876  
1979.453251  
335.1121105  
49.40448451  
6090.344725  
2570.528861  
3376.731834  
1317.264849  
254.8615206  
24.93733222  
1149.278635  
45.96263356  
15.04329936  
1273.483815  
374.8342173  
376.5490219  
74.58825428  
419.1143437  
218.8645257  
200.3417851  
257.1357406  
128.2477515  
81.27151139  
119.9537215  
115.7817971  
85.83501398  
71.06139393  
81.77140065  
61.54505567  
56.3879803  
51.21020459  
51.87623569  
50.46026748  
44.43917014  
39.05578058  
40.03566946  
36.75902396  
34.72515258  
33.16781981  
31.69483975  
29.6460365  
28.64837778  
26.88500212  
25.7101398  
24.41187421  
23.2025116  
22.05479382  
21.21166422  
20.14066718  
19.43214479  
18.45320568  
17.738387  
17.02635508  
16.33449524  
15.64827405  
15.04910997  
14.48527366  
13.93515949  
13.39669194  
12.90285593  
12.44739012  
12.00108108  
11.56303501  
11.16814007  
10.78312198  
10.40591073  
10.06118708  
9.718410647  
9.406499535  
9.096600925  
8.80370945  
8.524685407  
8.258447149  
8.003471953  
7.759073431  
7.524521059  
7.300420634  
7.08548792  
6.878302209  
6.68012789  
6.490114022  
6.307064545  
6.131170711  
5.962621238  
5.799913665  
5.643262209  
5.492584926  
5.347603366  
5.207922852  
5.073141556  
4.943205712  
4.818105693  
4.697210046  
4.580774676  
4.468177607  
4.359429363  
4.254541153  
4.153066595  
4.055011492  
3.960176858  
3.868545639  
3.77978156  
3.693951178  
3.610882362  
3.530502555  
3.452517613  
3.37704568  
3.303892639  
3.232982809  
3.164283243  
3.097697121  
3.032978176  
2.970185994  
2.909353608  
2.850321834  
2.792885344  
2.737191664  
2.683105022  
2.630516  
2.579459603  
2.529756854  
2.481487284  
2.434585619  
2.388901888  
2.344505872  
2.30124231  
2.259211569  
2.218330095  
2.178466385  
2.139661822  
2.101913011  
2.065072338  
2.029215432  
1.994317196  
1.960217533  
1.927051294  
1.894682585  
1.863146652  
1.832367172  
1.802342783  
1.773059413  
1.744470154  
1.716641464  
1.689375827  
1.662822195  
1.636875674  
1.611518825  
1.586851941  
1.562642314  
1.539062155  
1.515969998  
1.49345232  
1.471413102  
1.449892498  
1.428850525  
1.408269114  
1.388157421  
1.368449971  
1.349216147  
1.330377373  
1.312002336  
1.293950143  
1.276304117  
1.259025236  
1.242152978  
1.225619686  
1.209406698  
1.193514139  
1.177981847  
1.162769526  
1.147851565  
1.133269597  
1.11893124  
1.104934146  
1.091201971  
1.077735462  
1.064532339  
1.051600709  
1.038907574  
1.026488529  
1.014292778  
1.002312461  
0.9906036551  
0.9791024  
0.9678078569  
0.9567191791  
0.9458765885  
0.9351787667  
0.9247073571  
0.9144435442  
0.9043956896  
0.8944924203  
0.8847775733  
0.8752308767  
0.8658502646  
0.8566835278  
0.8476281943  
0.8388004768  
0.8300823829  
0.8215157386  
0.8130688306  
0.8048121499  
0.7967150165  
0.7886870071  
0.7809045675  
0.7731718434  
0.7656523949  
0.7582052737  
0.7508847454  
0.7436903152  
0.736616905  
0.7296633587  
0.722800466  
0.7161131606  
0.7094939369  
0.7030122585  
0.6966200807  
0.6903279231  
0.6841434973  
0.6780520335  
0.6720795543  
0.6661779529  
0.6603798346  
0.6547027459  
0.6490779723  
0.6435370652  
0.6381017249  
0.6327439131  
0.6274957486  
0.6222659411  
0.6171741462  
0.6121827194  
0.6072642144  
0.6023726127  
0.5975953013  
0.5928466532  
0.5881782178  
0.5836224909  
0.5791121592  
0.5746778913  
0.5703096449  
0.5660042807  
0.5617521519  
0.557561963  
0.5534538186  
0.5494053702  
0.5453923729  
0.5414590298  
0.5375855333  
0.5337560736  
0.5299834877  
0.5262563149  
0.5226090318  
0.5190014244  
0.5154406543  
0.511942185  
0.5084847955  
0.5050798732  
0.5017008461  
0.4984181524  
0.495143643  
0.4919459817  
0.4887736107  
0.4856422034  
0.4825648607  
0.4795146129  
0.4765228051  
0.4735792784  
0.4706524644  
0.4677825889  
0.4649853173  
0.4621710439  
0.4594249725  
0.4566945249  
0.4540177979  
0.4513968427  
0.4487784137  
0.4461976558  
0.443686783  
0.4411931263  
0.4387093516  
0.4362857436  
0.4339134125  
0.431510309  
0.4291801209  
0.4268774405  
0.4246042636  
0.4223816353  
0.4201542649  
0.4179782831  
0.4158414096  
0.4137039984  
0.4116088373  
0.4095483213  
0.4074987502  
0.405508562  
0.4035179148  
0.4015459781  
0.3996361971  
0.3977109566  
0.3958633833  
0.3940026746  
0.392124924  
0.3903721346  
0.3885857444  
0.3868193187  
0.3850674582  
0.3833585075  
0.3816875114  
0.3800140159  
0.3783904083  
0.3767449916  
0.3751414405  
0.373565305  
0.3720375598  
0.3704902422  
0.368954402  
0.3674588479  
0.365988702  
0.3645542776  
0.363092977  
0.3616900885  
0.3602918047  
0.358903215  
0.3575714849  
0.3562227633  
0.3549059784  
0.353594471  
0.3523061231  
0.3510438638  
0.3498028695  
0.3485486977  
0.3473353998  
0.3461556499  
0.3449368728  
0.3437863101  
0.3426294793  
0.3415042984  
0.3403943738  
0.3392879271  
0.3381971866  
0.3371098219  
0.33608166  
0.3350249873  
0.3340016981  
0.3329735635  
0.3319707706  
0.3309953904  
0.3300362586  
0.3290770708  
0.3281277534  
0.327215734  
0.3263087487  
0.3254071702  
0.3245200891  
0.3236347123  
0.3227993377  
0.3219433883  
0.3211163903  
0.3202908572  
0.3194901017  
0.3186965923  
0.3179100393  
0.3171380123  
0.3163917557  
0.3156524799  
0.3149157098  
0.314183449  
0.313470546  
0.3127753832  
0.3121143295  
0.3114419461  
0.3107799959  
0.3101154047  
0.3094580111  
0.308844431  
0.3082364683  
0.3076183772  
0.3070382783  
0.3064652021  
0.3058690764  
0.3053162311  
0.3047779366  
0.3042409908  
0.3036979306  
0.303181668  
0.3026884779  
0.3021862438  
0.3017010417  
0.3012245324  
0.3007457382  
0.3003053129  
0.2998505911  
0.2994246732  
0.2990016328  
0.2985756703  
0.2981523582  
0.2977586442  
0.297390103  
0.2970259375  
0.2966542866  
0.2962689929  
0.2959434861  
0.2956114  
0.2952728257  
0.2949382728  
0.2946394852  
0.2943390394  
0.294036285  
0.2937767961  
0.2934937986  
0.2932290206  
0.2929741306  
0.292724032  
0.2925004002  
0.2922736478  
0.2920629947  
0.2918460288  
0.2916332506  
0.2914633857  
0.2912924472  
0.291101481  
0.2909406512  
0.2907968524  
0.2906399219  
0.2905126767  
0.2903801683  
0.2902555905  
0.2901668085  
0.2900378179  
0.2899680222  
0.2898591728  
0.289802223  
0.2897511669  
0.2896737848  
0.2896545377  
0.2896019682  
0.2895547629  
0.2895497702  
0.2895277978  
0.2895061626  
