550.9396477  
598.3876325  
684.4210734  
820.8380868  
1450.042463  
8709.648988  
29237.69233  
13008.8466  
50657.17675  
4516.343673  
7623.047372  
5948.34843  
14872.8313  
53646.20623  
7303.604667  
466.5239738  
2334.801373  
41889.60725  
10910.48119  
4651.356407  
1350.035014  
616.3698329  
3029.518363  
23382.43065  
15179.41637  
56735.79232  
89.6432111  
542.5041245  
7206.156839  
6713.946684  
7714.786606  
806.3323271  
6555.637005  
6106.613847  
14395.60411  
5007.29452  
1337.253742  
5185.720743  
489.0422087  
696.4328794  
2366.329372  
9124.076325  
670.7857646  
1016.490284  
335.8926008  
7214.907383  
6319.469198  
18482.91541  
1287.343537  
1049.253806  
700.416697  
1762.203648  
1440.822462  
618.1566573  
1385.60202  
594.8523552  
4821.256262  
213.0352125  
516.4057186  
678.9737591  
428.8617732  
855.1720206  
375.3117778  
826.6258901  
11.53889761  
839.1780508  
50.07161687  
365.4020055  
9.576373202  
15.96998764  
8.517254498  
57.75026767  
17.27326267  
34.73505511  
1.542550284  
2.157602752  
2.264692029  
2.558339583  
2.010973165  
2.31922851  
0.950717237  
2.251154575  
1.106955382  
1.699510528  
1.057375185  
0.7791902483  
1.335372316  
0.6861662961  
1.129382851  
0.8203747155  
0.9026080862  
0.897283511  
0.7816570775  
0.7785297181  
0.6748872264  
0.6821979662  
0.6560280377  
0.6539675025  
0.6273575839  
0.5943461884  
0.5824415507  
0.5423120354  
0.5239760958  
0.5075138034  
0.4940034176  
0.4758614961  
0.4638856888  
0.4480618969  
0.4339158721  
0.4180351036  
0.4065273957  
0.3938582577  
0.3821198358  
0.3722792022  
0.3623056476  
0.3507355476  
0.3415926992  
0.3322534594  
0.3231060927  
0.3143169922  
0.3053639047  
0.2977175813  
0.2901237599  
0.2823412486  
0.2752883967  
0.2683927424  
0.2616976406  
0.2552497105  
0.249132753  
0.2430834165  
0.2372816935  
0.2317192563  
0.2263259924  
0.2211975845  
0.2161088933  
0.2112818253  
0.2065848565  
0.2020567056  
0.1976363207  
0.1933833817  
0.189269262  
0.1852812479  
0.1814119252  
0.1776928833  
0.1740570493  
0.1705446308  
0.1671387256  
0.1638347849  
0.1606227088  
0.1575186548  
0.1544813567  
0.1515548388  
0.1487019916  
0.1459367288  
0.1432421706  
0.1406281253  
0.1380872182  
0.1356141343  
0.1332104402  
0.1308769923  
0.128598728  
0.1263834234  
0.1242251808  
0.1221328339  
0.1200894273  
0.1181007381  
0.1161545983  
0.1142685647  
0.1124221322  
0.1106241224  
0.1088762862  
0.1071710078  
0.1055015177  
0.103873748  
0.1022929112  
0.1007440819  
0.09923813184  
0.09776765034  
0.09632271687  
0.09491457232  
0.09354389502  
0.09220662468  
0.09089470796  
0.08961612149  
0.08836381524  
0.08713707224  
0.08594561741  
0.08477810538  
0.0836365077  
0.0825111268  
0.08142471525  
0.08035048527  
0.07930537236  
0.07827735379  
0.07728036297  
0.07629404125  
0.07533391741  
0.07439041011  
0.07347091699  
0.07256548912  
0.07167905341  
0.07081511308  
0.06996705251  
0.06913079468  
0.06831807973  
0.06751436571  
0.06673455143  
0.06596814735  
0.06521176076  
0.06447717766  
0.06374765165  
0.06303642591  
0.06234313896  
0.06165908826  
0.06098607534  
0.06033098367  
0.05968515935  
0.05905019742  
0.05842343031  
0.05781490452  
0.05721363966  
0.05662388766  
0.05604325551  
0.0554767906  
0.05491538572  
0.0543710016  
0.05383505474  
0.05330361474  
0.05278188958  
0.05227149039  
0.05177059567  
0.05127411482  
0.05079223293  
0.05031323377  
0.04984286858  
0.04938162785  
0.04893296188  
0.04848502495  
0.04804630548  
0.0476172451  
0.04719216813  
0.04677565279  
0.04636538322  
0.04596140062  
0.04556173177  
0.04517390318  
0.0447870269  
0.04441057927  
0.04403702202  
0.0436720747  
0.04330753333  
0.04295757997  
0.04260353328  
0.04225948085  
0.04192306341  
0.04158740777  
0.04125833967  
0.04093423024  
0.04061812145  
0.04030271549  
0.03999726487  
0.03968595404  
0.03938811938  
0.03909378626  
0.0388013094  
0.03851609651  
0.03823162491  
0.03795503697  
0.03768269892  
0.03741032635  
0.03714359095  
0.03687702832  
0.03662257404  
0.03636497814  
0.03611484005  
0.03586786478  
0.03562318764  
0.03538004561  
0.03514189592  
0.0349046524  
0.0346761288  
0.03444771172  
0.03422415038  
0.03400198844  
0.03378542865  
0.03356843945  
0.03335585906  
0.03314475053  
0.03293725907  
0.03273440702  
0.03253474068  
0.03233566298  
0.03213982842  
0.03194384888  
0.03175361816  
0.03156566712  
0.03138057563  
0.03119729023  
0.03101564346  
0.03083803913  
0.03066092894  
0.03048846464  
0.03031458493  
0.03014815656  
0.02997986629  
0.02981513889  
0.02965209037  
0.02949214762  
0.0293336211  
0.02917655484  
0.02902055438  
0.02887163817  
0.02871840352  
0.02856959591  
0.02842314991  
0.02828038419  
0.02813502992  
0.02799281876  
0.02785259717  
0.02771587909  
0.02758157789  
0.02744664497  
0.02731324262  
0.02718285887  
0.02705189794  
0.02692304564  
0.02679779931  
0.0266740466  
0.02655248421  
0.0264305229  
0.02631113666  
0.02619053134  
0.0260744514  
0.02595850207  
0.02584669718  
0.02573474036  
0.02562103897  
0.02551205714  
0.02540564086  
0.02529445792  
0.02519140654  
0.02508472959  
0.02498140762  
0.02488132366  
0.02477921764  
0.02468165876  
0.02457990225  
0.02448475876  
0.02438985596  
0.02429500919  
0.02419938634  
0.02410715267  
0.02401435597  
0.02392752403  
0.02383620756  
0.02374750828  
0.02366345556  
0.02357751083  
0.02349250164  
0.0234070177  
0.02332670554  
0.02324267789  
0.02316288335  
0.02308421299  
0.02300576007  
0.02292563257  
0.02284938464  
0.02277479502  
0.02269859271  
0.02262549971  
0.02255300548  
0.02248094805  
0.02240952385  
0.02234177079  
0.0222699942  
0.02220143334  
0.02213318383  
0.02206635273  
0.02200090942  
0.0219360296  
0.02187216311  
0.02180907254  
0.02174712463  
0.02168415082  
0.02162265587  
0.02156232141  
0.02150294319  
0.02144637862  
0.02138737495  
0.02132979117  
0.0212728971  
0.0212208462  
0.02116378362  
0.02110982417  
0.02105471966  
0.02100203276  
0.02095121567  
0.02089886829  
0.02084791048  
0.02079885354  
0.02075122752  
0.0207021779  
0.02065358141  
0.02060777281  
0.02056155311  
0.02051610875  
0.02047171762  
0.02042753297  
0.02038220009  
0.02033843522  
0.02029367543  
0.02025365541  
0.0202141876  
0.02017207176  
0.02013069283  
0.02009300369  
0.02005519737  
0.02001697939  
0.01997977157  
0.01994229422  
0.0199065694  
0.01986990289  
0.01983454714  
0.01980077417  
0.01976507637  
0.01973161429  
0.01969742953  
0.019665445  
0.01963249614  
0.01960459629  
0.01957319042  
0.01954195711  
0.0195139925  
0.0194834333  
0.0194552843  
0.01942646617  
0.01940114025  
0.01937325745  
0.0193462631  
0.01931918154  
0.01929674524  
0.01926779791  
0.0192458694  
0.01922419286  
0.01919801307  
0.01917382554  
0.01915219074  
0.01913083699  
0.01910995035  
0.0190887445  
0.01907130563  
0.01905075764  
0.01903064228  
0.01901123495  
0.01899316304  
0.01897610828  
0.01895973412  
0.01893847437  
0.018923214  
0.01890661184  
0.01889477398  
0.01887841786  
0.01886374428  
0.01885081876  
0.01883436635  
0.01882379894  
0.01881090539  
0.01879888632  
0.01878504271  
0.01877679257  
0.01876689913  
0.0187574315  
0.01874704656  
0.01873660309  
0.01872728142  
0.01871685634  
0.01871193361  
0.01870338527  
0.01869670739  
0.01868944159  
0.01868414419  
0.01867753855  
0.01867229181  
0.01866943853  
0.01866269287  
0.01865980086  
0.01865566197  
0.01865405492  
0.01864835394  
0.01864954683  
0.01864659472  
0.01864715796  
0.01864309787  
0.01864571248  
