0.3860577088  
0.5009556907  
0.6150097621  
0.7295592256  
0.8439308762  
0.9548926428  
1.056749895  
1.142093713  
1.203049575  
1.232776358  
1.22691379  
1.184679407  
1.109390098  
1.008292207  
0.8917079235  
0.7716399763  
0.6600691178  
0.5672217232  
0.5000924492  
0.461448132  
0.4494599929  
0.457994905  
0.4775093724  
0.4963820607  
0.5024950944  
0.4848317879  
0.4348758504  
0.3476551709  
0.2223120706  
0.06215984965  
-0.125751941  
-0.3314836763  
-0.5433550291  
-0.7492356067  
-0.9378432869  
-1.099889255  
-1.228953236  
-1.322004145  
-1.379508474  
-1.405129841  
-1.405067141  
-1.387103665  
-1.359491882  
-1.329792617  
-1.3038179  
-1.284792645  
-1.272851257  
-1.264928084  
-1.255073788  
-1.235175647  
-1.19600065  
-1.128454493  
-1.024888642  
-0.8803039979  
-0.6932695154  
-0.4664371483  
-0.2065500302  
0.07605715937  
0.3684365958  
0.656341683  
0.9257259287  
1.164221278  
1.362397614  
1.514642502  
1.619554395  
1.679798085  
1.701473638  
1.693080245  
1.664238181  
1.624334675  
1.58127054  
1.540457076  
1.504184374  
1.471408151  
1.437976388  
1.397250881  
1.341045712  
1.26076797  
1.148638042  
0.998858258  
0.8085996737  
0.5787092193  
0.3140359104  
0.02335336164  
-0.2811534019  
-0.5847944683  
-0.8715883047  
-1.125693064  
-1.332891234  
-1.481994088  
-1.566000142  
-1.582888068  
-1.535933902  
-1.433515927  
-1.288409536  
-1.116636798  
-0.935990373  
-0.7643739295  
-0.6181488859  
-0.5106466307  
-0.4510028849  
-0.4434150997  
-0.486899211  
-0.5755293252  
-0.6991190841  
-0.8442506125  
-0.9955326546  
-1.136945702  
-1.253168145  
-1.330771754  
-1.359205648  
-1.33153917  
-1.244918748  
-1.100752089  
-0.9046052094  
-0.6658230239  
-0.396881761  
-0.1124881203  
0.171542857  
0.4395676033  
0.677468046  
0.8739488314  
1.021638634  
1.117848694  
1.164846597  
1.169579887  
1.142813237  
1.097761491  
1.048363975  
1.007427861  
0.9848873935  
0.9864615938  
1.012914578  
1.060061358  
1.119524687  
1.180166334  
1.229940277  
1.257903309  
1.256023458  
1.220500044  
1.152343023  
1.057116557  
0.9438802015  
0.8235014605  
0.7066473247  
0.6018160661  
0.5137807265  
0.4427528977  
0.3844404056  
0.3310321216  
0.2729388405  
0.2009976016  
0.1087198537  
-0.005841831465  
-0.139018981  
-0.2814777706  
-0.4192906637  
-0.5360035094  
-0.6153804917  
-0.6443644636  
-0.6157409501  
-0.5300069998  
-0.3960683513  
-0.2305919471  
-0.05605165936  
0.1022586267  
0.2197781452  
0.276232321  
0.2586119665  
0.1630874591  
-0.004456471515  
-0.2293410282  
-0.4903135414  
-0.7626864847  
-1.021860046  
-1.246672431  
-1.422011107  
-1.540313568  
-1.601742901  
-1.613092572  
-1.585675914  
-1.532620248  
-1.466102202  
-1.395014438  
-1.323489842  
-1.250525969  
-1.17072842  
-1.07600942  
-0.9578803171  
-0.8098855981  
-0.6296902334  
-0.4204293572  
-0.1910382606  
0.0445139329  
0.2689544224  
0.4641205432  
0.6136319235  
0.7053616857  
0.7332882014  
0.6984113925  
0.6085849299  
0.4773069195  
0.3216740863  
0.159858319  
0.008522052177  
-0.1193973774  
-0.2161892498  
-0.2799342569  
-0.3140686472  
-0.3260754006  
-0.3255449014  
-0.3219642266  
-0.3226247605  
-0.3310079715  
-0.3459058517  
-0.3614393754  
-0.3679427783  
-0.3535858447  
-0.3064613716  
-0.2168191787  
-0.07908592065  
0.1066320118  
0.3338081692  
0.5896529398  
0.856163481  
1.111963766  
1.334707905  
1.503755936  
1.602772034  
1.621928018  
1.559407762  
1.422013175  
1.224759704  
0.9894876422  
0.74261845  
0.5123060315  
0.3253020189  
0.2038886964  
0.1632511838  
0.2095867014  
0.339193324  
0.538658703  
0.7861405742  
1.05361786  
1.309872389  
1.523865023  
1.668153581  
1.721936622  
1.673401232  
1.521081508  
1.274071295  
0.9510505581  
0.5782308679  
0.1864539089  
-0.1922166074  
-0.5280061994  
-0.7966193642  
-0.9817206419  
-1.076432536  
-1.083651446  
-1.015201703  
-0.8899489065  
-0.7311554764  
-0.5634482481  
-0.40979836  
-0.2889094501  
-0.2133243215  
-0.1884548981  
-0.2125845596  
-0.2777863502  
-0.3715357784  
-0.4787643711  
-0.5840335514  
-0.6735353907  
-0.7366882293  
-0.7671640146  
-0.7632933623  
-0.7278893412  
-0.6675733509  
-0.5917663079  
-0.5114970248  
-0.4381739158  
-0.3824370582  
-0.3531696432  
-0.356714205  
-0.3962990208  
-0.4716937473  
-0.5790879961  
-0.7111998844  
-0.8576248136  
-1.00545042  
-1.140118033  
-1.246529281  
-1.3103336  
-1.319304875  
-1.264697609  
-1.142412252  
-0.9538410429  
-0.70623182  
-0.4124997363  
-0.09042220549  
0.238730118  
0.552020862  
0.8269606543  
1.043671844  
1.186861166  
1.24736008  
1.223056095  
1.119087781  
0.9472813941  
0.7249116244  
0.4729392202  
0.2139445368  
-0.0299826508  
-0.2391474534  
-0.3977575311  
-0.4948914411  
-0.524877887  
-0.4871387545  
-0.385590012  
-0.2277794831  
-0.0239119989  
0.2140591314  
0.4731846337  
0.7400604687  
1.001182711  
1.243177075  
1.453023783  
1.618366829  
1.727986043  
1.77246291  
1.744979184  
1.642161874  
1.464814276  
1.218377391  
0.9129727561  
0.562933763  
0.1858267898  
-0.1989814915  
-0.5720342759  
-0.9155610763  
-1.215073244  
-1.460559652  
-1.647095274  
-1.774798152  
-1.848152408  
-1.874806003  
-1.864063067  
-1.825292929  
-1.766522257  
-1.693402158  
-1.608692028  
-1.512310235  
-1.401890922  
-1.273735791  
-1.123966566  
-0.9496917016  
-0.7499877841  
-0.526558313  
-0.2839760309  
-0.02949247406  
0.2275411077  
0.476551815  
0.7067875404  
0.9083904626  
1.073361524  
1.196305339  
1.274873287  
1.309864102  
1.304975158  
1.266242603  
1.201241014  
1.118139894  
1.024731117  
0.9275530704  
0.8312384534  
0.7381661355  
0.6485038005  
0.5606259279  
0.4718829782  
0.3796026405  
0.2821737139  
0.1800197652  
0.07628248646  
-0.02296000259  
-0.1090195065  
-0.171496223  
-0.199657895  
-0.1841155946  
-0.1185511815  
-0.001207329717  
0.1641279573  
0.3678701731  
0.5952059811  
0.8274900803  
1.044290962  
1.225827799  
1.355443251  
1.421725908  
1.419952651  
1.352603276  
1.228846347  
1.063067797  
0.8726637099  
0.6754440555  
0.4870795476  
0.3189827755  
0.1769821399  
0.06097006725  
-0.03443060058  
-0.1183401563  
-0.201523411  
-0.2941152741  
-0.403566713  
-0.533182628  
-0.6814811759  
-0.8424646266  
-1.006723463  
-1.163138182  
-1.300855261  
-1.411172182  
-1.488979253  
-1.533518873  
-1.548322301  
-1.540351376  
-1.518509605  
-1.491773602  
-1.467296956  
-1.448807363  
-1.435598114  
-1.422295636  
-1.399480112  
-1.355089363  
-1.276405561  
-1.152334588  
-0.9756346379  
-0.7447382665  
-0.4648657619  
-0.1482320149  
0.1867296707  
0.5170722734  
0.8177480354  
1.064433142  
1.23638138  
1.318932543  
1.305329923  
1.197618343  
1.006514152  
0.7502849224  
0.4528189789  
0.1411519852  
-0.1572079141  
-0.4168381457  
-0.6165410644  
-0.7408861738  
-0.7810512735  
-0.7349898826  
-0.6070166626  
-0.4069757921  
-0.1491549633  
0.1489019593  
0.4675790439  
0.7863148934  
1.084676175  
1.343394455  
1.545409004  
1.676908599  
1.728360814  
1.695429863  
1.579681373  
1.388929022  
1.137093896  
0.8434964668  
0.5315545624  
0.2269532152  
-0.04457112955  
-0.2596164643  
-0.3994228818  
-0.4518299888  
-0.4126697829  
-0.2864048501  
-0.08592918965  
0.1684558905  
0.4508246913  
0.7319840063  
0.9821787075  
1.173894342  
1.28447705  
1.29831672  
1.20836992  
1.016862824  
0.7350875983  
0.3822932412  
-0.01623233849  
-0.4317079698  
-0.8347621211  
-1.19839613  
-1.500653324  
-1.726708766  
-1.870104743  
-1.93299605  
-1.925369124  
-1.863326571  
-1.766674478  
-1.656119843  
-1.55045712  
-1.464118802  
-1.405416337  
-1.375705412  
-1.369572408  
-1.376012058  
-1.380407899  
-1.367035557  
-1.321726031  
-1.234303238  
-1.100449102  
-0.9227283043  
-0.710612221  
-0.4795030794  
-0.2488706437  
-0.0397638573  
0.1279726898  
0.2383910351  
0.2816922534  
0.255723264  
0.1665300887  
0.02789874615  
-0.140047171  
-0.3130014364  
-0.4651105765  
-0.5717428399  
-0.6120689381  
-0.5711511444  
-0.4413361277  
-0.2228156977  
0.07663360744  
0.4426526175  
0.8558620264  
1.293780326  
1.732839051  
2.15029643  
2.525856465  
2.842883026  
3.089150687  
3.257144606  
3.343955613  
3.350870996  
3.282748164  
3.147275947  
2.954203162  
2.714591506  
2.44012552  
2.142499395  
1.832876446  
1.521420274  
1.216900283  
0.9263714994  
0.6549499041  
0.4057071351  
0.1797040648  
-0.02380772506  
-0.2070294946  
-0.3730985327  
-0.5254770776  
-0.6672932601  
-0.8007203657  
-0.9264935974  
-1.043616487  
-1.149342489  
-1.239433664  
-1.308686272  
-1.351669275  
-1.363572416  
-1.341060098  
-1.283004906  
-1.190998921  
-1.069551807  
-0.9259534505  
-0.7697913838  
-0.6121900839  
-0.4648450378  
-0.3389772609  
-0.2443251727  
-0.1882735592  
-0.175227336  
-0.2062618642  
-0.2790852202  
-0.3882858215  
-0.525830697  
-0.6817458265  
-0.8449144233  
-1.003927001  
-1.147920254  
-1.267354187  
-1.354679446  
-1.404868442  
-1.415760967  
-1.388218656  
-1.326048047  
-1.235699279  
-1.125728471  
-1.006076269  
-0.8871828516  
-0.7790385946  
-0.690243523  
-0.6271772862  
-0.5933817397  
-0.5892122973  
-0.6118317227  
-0.6555256836  
-0.7123303828  
-0.7728867872  
-0.8274251844  
-0.8667572671  
-0.8831716307  
-0.8711076221  
-0.8275492989  
-0.7521086681  
-0.6467857771  
-0.5154873326  
-0.3633592294  
-0.1960525579  
-0.01903916101  
0.1629396892  
0.3461958588  
0.5281608366  
0.70719425  
0.8821825247  
1.052005926  
1.21498744  
1.368435529  
1.508385244  
1.629621113  
1.726009772  
1.791127649  
1.819110752  
1.805614137  
1.748719544  
1.649649781  
1.513138262  
1.347361981  
1.163388351  
0.9741844619  
0.7932720084  
0.6332093501  
0.504082821  
0.412235173  
0.3594082347  
0.3424416316  
0.3536030249  
0.3815227471  
0.4126431368  
0.4330023956  
0.430138803  
0.3948580842  
0.3226484141  
0.21453349  
0.0772491496  
-0.07729592006  
-0.2332306442  
-0.3724669264  
-0.4767727734  
-0.5299385635  
-0.5197774422  
-0.4397212878  
-0.289833243  
-0.07711010215  
0.1849483516  
0.4774632738  
0.7778637658  
1.061945326  
1.3060819  
1.48935482  
1.595374025  
1.613617781  
1.540159613  
1.377742654  
1.135214494  
0.8264259479  
0.4687430108  
0.08135827913  
-0.3163835672  
-0.7064688743  
-1.073358857  
-1.404697319  
-1.691565607  
-1.9283361  
-2.112217842  
-2.242626685  
-2.320537063  
-2.34791128  
-2.327316528  
-2.261745706  
-2.154622886  
-2.009938496  
-1.832421014  
-1.627657467  
-1.402093527  
-1.162881466  
-0.9175607152  
-0.6736363936  
-0.4381047112  
-0.2170094842  
-0.01510310451  
0.1643431313  
0.3195585891  
0.4501373783  
0.5567837076  
0.6410011276  
0.7047786591  
0.7503142754  
0.7798194172  
0.7953881338  
0.7989324695  
0.7921619134  
0.7765700098  
0.7534318759  
0.7237959329  
0.6884994932  
0.6482208435  
0.6035861976  
0.5553455401  
0.5045907582  
0.4529793521  
0.4029103063  
0.3575731648  
0.320816467  
0.296813828  
0.2895153984  
0.3019679801  
0.335580739  
0.3894822943  
0.4600962539  
0.54105461  
0.6235224955  
0.696945804  
0.7501605739  
0.7727348651  
0.7563717781  
0.6961621518  
0.5915041702  
0.446519166  
0.2698824792  
0.07405062654  
-0.1260283631  
-0.3145820855  
-0.4768248818  
-0.6006894116  
-0.6782410358  
-0.7065723727  
-0.6880802697  
-0.6300587338  
-0.5436901829  
-0.4425692024  
-0.3409582344  
-0.2520227576  
-0.1862804321  
-0.1504670498  
-0.1469548311  
-0.1737856331  
-0.225273348  
-0.2930693074  
-0.3675078141  
-0.439012726  
-0.4993723184  
-0.5426850474  
-0.5658696356  
-0.5687061919  
-0.5534326981  
-0.5240168436  
-0.4852722957  
-0.4419687068  
-0.3981288535  
-0.3566081927  
-0.3190239786  
-0.2860162111  
-0.2577473472  
-0.2345178368  
-0.2173220167  
-0.208202805  
-0.2102879502  
-0.2274453196  
-0.2635881361  
-0.3217095942  
-0.402823809  
-0.5049826735  
-0.6225880046  
-0.7461570177  
-0.8626590577  
-0.9564522015  
-1.010755899  
-1.009510846  
-0.9393991755  
-0.7917691896  
-0.5641896604  
-0.2614059776  
0.10446179  
0.5145606705  
0.9447229278  
1.367532381  
1.754805599  
2.080191438  
2.321600038  
2.463184749  
2.496656623  
2.421821992  
2.246315174  
1.984611038  
1.65647193  
1.285043002  
0.8948238557  
0.5097217648  
0.1513672462  
-0.1622045211  
-0.4174505862  
-0.6057918905  
-0.7237106615  
-0.7725128035  
-0.7578388697  
-0.6889573836  
-0.5779030497  
-0.4384936329  
-0.2852578789  
-0.1323368065  
0.007590953653  
0.1242639395  
0.2106059336  
0.2631917853  
0.2823767789  
0.2720322259  
0.2389146817  
0.1917183945  
0.1399344505  
0.09263489674  
0.05734196561  
0.03911272973  
0.03995075492  
0.05860018892  
0.09073173176  
0.1294871704  
0.1662950316  
0.1918667226  
0.1972473321  
0.1748396308  
0.119286268  
0.02816872996  
-0.09755164536  
-0.2533702591  
-0.4313735251  
-0.6206881981  
-0.8082331928  
-0.9797447173  
-1.12103  
-1.21934818  
-1.264811909  
-1.251648975  
-1.17916466  
-1.052240997  
-0.8812510675  
-0.681323372  
-0.4709564119  
-0.2701019796  
-0.09790200709  
0.0296538588  
0.1018504446  
0.1148490618  
0.07251675103  
-0.01367455435  
-0.1257278366  
-0.2410896823  
-0.3353030895  
-0.3850327945  
-0.3711003244  
-0.2811372229  
-0.1115316078  
0.1316163571  
0.4326626843  
0.7677342972  
1.107065639  
1.418090606  
1.668971067  
1.832117112  
1.887312498  
1.824056931  
1.6428345  
1.355161383  
0.9823889806  
0.5534147603  
0.1015755383  
-0.3388893954  
-0.7363794732  
-1.065046581  
-1.307125558  
-1.454227358  
-1.507489879  
-1.47663501  
-1.378105744  
-1.232584978  
-1.062240011  
-0.8880481577  
-0.7275309253  
-0.5931191818  
-0.4912925428  
-0.4225042445  
-0.3818185536  
-0.3600954876  
-0.3455316161  
-0.3253414404  
-0.2873888052  
-0.2216214603  
-0.1212048999  
0.01669947214  
0.1905330503  
0.3943019243  
0.6178930919  
0.847718583  
1.067662061  
1.260301142  
1.408336568  
1.496165747  
1.511460654  
1.446621006  
1.299914453  
1.076150871  
0.7867401149  
0.4490568734  
0.0851196068  
-0.2803278805  
-0.6221283946  
-0.9171718797  
-1.146673679  
-1.297998574  
-1.365771135  
-1.352126078  
-1.266063906  
-1.122018836  
-0.9378411427  
-0.7324966874  
-0.5238041426  
-0.3265326417  
-0.1510986857  
-0.003004552398  
0.1169573365  
0.2118418069  
0.2872231977  
0.3496759753  
0.405322238  
0.4586980687  
0.5121000556  
0.5654717936  
0.616797989  
0.6628752362  
0.7002633509  
0.7262066599  
0.7393374513  
0.7400133003  
0.7302380324  
0.7131875183  
0.6924528897  
0.6711545819  
0.6511105204  
0.6322401941  
0.6123123223  
0.587110886  
0.5509995619  
0.4977856425  
0.4217552701  
0.3187054661  
0.1868043528  
0.02714963947  
-0.1560554729  
-0.3557361601  
-0.5625348694  
-0.7656728322  
-0.9539514543  
-1.116765438  
-1.24500615  
-1.331758553  
-1.372746387  
-1.366508322  
-1.314326546  
-1.219960066  
-1.089220769  
-0.9294678328  
-0.7490533631  
-0.5567597748  
-0.3612545045  
-0.1705927094  
