0.05216684661  
-0.00243700705  
-0.03973048753  
-0.04572498946  
-0.01105545828  
0.06771603488  
0.1876524114  
0.3399120344  
0.5110407524  
0.6848956856  
0.8448882345  
0.9762231726  
1.06779003  
1.113442437  
1.112501714  
1.069442857  
0.9928607431  
0.8939172816  
0.7845519044  
0.6757551281  
0.5761761281  
0.4912610604  
0.4230173534  
0.3703740842  
0.3300158813  
0.2974977692  
0.2684061809  
0.2393556904  
0.2086591671  
0.1765854057  
0.1452005418  
0.1178601192  
0.09848651821  
0.09076591857  
0.09741273607  
0.1196079577  
0.156672213  
0.2059898826  
0.2631680599  
0.3223674699  
0.3767570881  
0.4190361735  
0.4419828056  
0.4390089297  
0.4047053696  
0.3353728566  
0.2295224136  
0.08830992649  
-0.0841447997  
-0.2806185295  
-0.4909084645  
-0.70227358  
-0.9002460177  
-1.069796164  
-1.196803355  
-1.269697796  
-1.281104552  
-1.229261343  
-1.118985531  
-0.9619664848  
-0.7762333627  
-0.5847308235  
-0.4130576481  
-0.2865527197  
-0.2270403059  
-0.2496380189  
-0.3600805032  
-0.5529957947  
-0.8114768655  
-1.108146835  
-1.407704862  
-1.670728117  
-1.858289216  
-1.936801836  
-1.882427825  
-1.684405704  
-1.346797218  
-0.8883550165  
-0.3404980358  
0.2563459794  
0.8575110132  
1.41928949  
1.903805521  
2.282879268  
2.54035198  
2.67261727  
2.687384412  
2.600989221  
2.43479995  
2.21138224  
1.951103289  
1.669741897  
1.377452217  
1.079167894  
0.7762529302  
0.4689537025  
0.1590720281  
-0.1477735156  
-0.4408500081  
-0.7043378127  
-0.918785539  
-1.06381606  
-1.121645288  
-1.080785519  
-0.9392333065  
-0.7064850626  
-0.403889885  
-0.06311219013  
0.2772063603  
0.5761787  
0.7961315482  
0.9079544656  
0.8954826566  
0.7581683307  
0.5115433175  
0.1853220636  
-0.1806308172  
-0.541881648  
-0.8557153405  
-1.087147596  
-1.213719403  
-1.228322534  
-1.139630359  
-0.9700998755  
-0.7519158786  
-0.5215900806  
-0.3141269803  
-0.1577361708  
-0.06994142373  
-0.05567475685  
-0.1075812947  
-0.2083743733  
-0.3347132562  
-0.4618392611  
-0.5681104988  
-0.6386076544  
-0.6672221524  
-0.6569178585  
-0.6182272826  
-0.5663501302  
-0.5174847771  
-0.4851284424  
-0.4770491697  
-0.4935035382  
-0.5269828139  
-0.5635166265  
-0.5852394868  
-0.5737401036  
-0.5135678211  
-0.3952816461  
-0.217530999  
0.01216779982  
0.2780446649  
0.5579585589  
0.826210967  
1.056847305  
1.226944422  
1.319425757  
1.32503424  
1.243254455  
1.082113065  
0.8569605866  
0.5884432601  
0.2999670261  
0.01499748374  
-0.2454843952  
-0.4650846888  
-0.6334393104  
-0.7468814402  
-0.8082964154  
-0.8262189777  
-0.8133064698  
-0.784370729  
-0.75420465  
-0.7354485367  
-0.7367528783  
-0.7614669219  
-0.8070352739  
-0.8652083224  
-0.9230860715  
-0.9648964268  
-0.9743031274  
-0.936946776  
-0.8428567756  
-0.6883719731  
-0.4772463949  
-0.2207214823  
0.06350254812  
0.3533055871  
0.6249286627  
0.8561193012  
1.029163684  
1.133354401  
1.16649218  
1.135169498  
1.053767664  
0.9422867648  
0.823319208  
0.7186154681  
0.6457529954  
0.6154254177  
0.6297712609  
0.6820200729  
0.7575331336  
0.8361115447  
0.8952441517  
0.9138240266  
0.8757816527  
0.7730789477  
0.6075929559  
0.3915811623  
0.1466109293  
-0.09893698859  
-0.3134478115  
-0.466262667  
-0.5318790665  
-0.4935649407  
-0.3458784068  
-0.09571324881  
0.2382571435  
0.6276736356  
1.037808965  
1.431638481  
1.774087966  
2.035881365  
2.196480237  
2.245770907  
2.184344529  
2.022436166  
1.777784846  
1.472800789  
1.131520546  
0.7767956637  
0.428097563  
0.1001728109  
-0.1973801897  
-0.4596979414  
-0.6856327114  
-0.8764177401  
-1.034344311  
-1.161714214  
-1.260247039  
-1.330990714  
-1.374659825  
-1.392235761  
-1.385586714  
-1.357896275  
-1.313721633  
-1.2586128  
-1.198351669  
-1.13795887  
-1.080724038  
-1.027517887  
-0.9766155786  
-0.9241584905  
-0.8652426718  
-0.7954660244  
-0.7126262877  
-0.6181891757  
-0.5181373544  
-0.4228844652  
-0.3461146737  
-0.302608184  
-0.3053410049  
-0.3623474641  
-0.4739358231  
-0.6308686544  
-0.8140021003  
-0.995658519  
-1.14270994  
-1.221041766  
-1.200766497  
-1.061381532  
-0.7959970885  
-0.4138598517  
0.0593596317  
0.5837131947  
1.109348474  
1.582531866  
1.952475123  
2.177940853  
2.232661503  
2.108749176  
1.817617816  
1.388296524  
0.8634303815  
0.2935916826  
-0.2692417561  
-0.7780884291  
-1.196362162  
-1.501558968  
-1.686813591  
-1.760235143  
-1.742246342  
-1.661435862  
-1.549595867  
-1.436719143  
-1.346668162  
-1.294108815  
-1.28308255  
-1.307325959  
-1.352193073  
-1.397801046  
-1.42283864  
-1.408425043  
-1.341388218  
-1.216469381  
-1.037134008  
-0.8149032827  
-0.5673631412  
-0.3152245412  
-0.07894600867  
0.1244956565  
0.2841516355  
0.3965455283  
0.4658050264  
0.5024897264  
0.521355237  
0.5384715494  
0.5682090465  
0.6206287787  
0.699722426  
0.8027905109  
0.9210501964  
1.041342266  
1.148618444  
1.228767145  
1.271278929  
1.271289758  
1.230649556  
1.157835911  
1.066716095  
0.9743637215  
0.8982730043  
0.8534251284  
0.8496719885  
0.889866131  
0.969043408  
1.074808804  
1.188907566  
1.289760304  
1.355621712  
1.367904676  
1.314187279  
1.190443909  
1.002161548  
0.764142621  
0.4989793974  
0.2343976855  
-0.0001965166377  
-0.177481321  
-0.2757776424  
-0.2818993068  
-0.1929002375  
-0.01647107533  
0.2300507234  
0.5219008201  
0.8300138223  
1.124585451  
1.37858875  
1.570754805  
1.687654599  
1.724654898  
1.685693293  
1.58200004  
1.430011473  
1.248829803  
1.057600105  
0.8731568856  
0.7082169127  
0.5702999715  
0.4614355872  
0.3786093978  
0.3148120636  
0.2604867893  
0.2051419565  
0.1389008837  
0.05378606485  
-0.05539551515  
-0.1906470979  
-0.3508343042  
-0.5321299537  
-0.7287211933  
-0.9336252883  
-1.13947048  
-1.339124611  
-1.52611734  
-1.694839974  
-1.840589184  
-1.959523503  
-2.048636473  
-2.105813789  
-2.130011732  
-2.121530913  
-2.082318822  
-2.016194021  
-1.928878625  
-1.827740383  
-1.721206954  
-1.617868051  
-1.525368989  
-1.449258116  
-1.391986305  
-1.352272925  
-1.324998218  
-1.301719949  
-1.271798478  
-1.224006002  
-1.148396338  
-1.038136084  
-0.8909857584  
-0.7101529191  
-0.5043377156  
-0.2869110267  
-0.07431603998  
0.1160699458  
0.2682992631  
0.370063671  
0.4144128849  
0.4007071721  
0.3346865094  
0.2276565174  
0.09495386582  
-0.04603793063  
-0.1780104085  
-0.2856620884  
-0.3571841119  
-0.3851387859  
-0.3666884488  
-0.3032508713  
-0.1997410022  
-0.06361257051  
0.09610210931  
0.2695765992  
0.4467250318  
0.6174777397  
0.7718814053  
0.9001501322  
0.9928184236  
1.041105585  
1.037555271  
0.9769210583  
0.8571788939  
0.6804963199  
0.4539320633  
0.1896574984  
-0.09544974335  
-0.3809067055  
-0.644370021  
-0.8638519205  
-1.020137552  
-1.09907958  
-1.093425946  
-1.003886794  
-0.8392383414  
-0.6153998669  
-0.3535529947  
-0.07753320717  
0.1891742423  
0.4264295053  
0.6199952636  
0.7632925536  
0.8580763589  
0.9139120002  
0.946494218  
0.9750214813  
1.01898143  
1.094805611  
1.21287887  
1.375357992  
1.575149296  
1.796242013  
2.015393942  
2.204981779  
2.336654397  
2.385290917  
2.332737262  
2.170791618  
1.903013443  
1.545089843  
1.123668939  
0.6737914088  
0.2352083183  
-0.1519608556  
-0.4517101896  
-0.636235495  
-0.6891403793  
-0.6073955366  
-0.4018241569  
-0.09607377867  
0.2758031056  
0.6728756021  
1.051569  
1.370136865  
1.592874232  
1.693625731  
1.658219109  
1.485584821  
1.187482434  
0.7869100677  
0.3154189393  
-0.1903146298  
-0.6922582804  
-1.154689046  
-1.547384465  
-1.848009094  
-2.043535371  
-2.130618907  
-2.115000523  
-2.010111949  
-1.835107505  
-1.612591277  
-1.366298862  
-1.118954975  
-0.890478738  
-0.6966441393  
-0.5482452928  
-0.4507750511  
-0.4045604703  
-0.4053039232  
-0.4449267465  
-0.5126236074  
-0.5960194443  
-0.6823346383  
-0.7594658231  
-0.8169069653  
-0.8464542983  
-0.8426709803  
-0.80309861  
-0.7282296818  
-0.6212816648  
-0.4878126507  
-0.3352356362  
-0.1722732639  
-0.008407238243  
0.1466616988  
0.2835149476  
0.3934872585  
0.4691060694  
0.5045119026  
0.4958672281  
0.4417317348  
0.3434000597  
0.2051369155  
0.03426532212  
-0.1589596205  
-0.3617526558  
-0.5595007132  
-0.7367733672  
-0.8785817403  
-0.9717959381  
-1.006571882  
-0.9776229612  
-0.8851577221  
-0.7353269773  
-0.5400807736  
-0.3163710913  
-0.08475658846  
0.1325031522  
0.3136671793  
0.4398310717  
0.4970833302  
0.4782567764  
0.3840565304  
0.2234030089  
0.01292141686  
-0.2244295871  
-0.4614842938  
-0.6695591977  
-0.8214557389  
-0.8944683293  
-0.8730631879  
-0.7509189697  
-0.532059094  
-0.230890306  
0.1289192724  
0.5166563428  
0.8976797521  
1.237096981  
1.503586875  
1.672902751  
1.730608861  
1.673697341  
1.510856289  
1.26135057  
0.952654343  
0.6171386336  
0.2882502046  
-0.00333013175  
-0.2330711362  
-0.3851184022  
-0.4536818247  
-0.4431881847  
-0.3672316872  
-0.2465191881  
-0.1061085312  
0.02772007731  
0.1305945144  
0.1828575764  
0.1717829097  
0.09300176647  
-0.04897156673  
-0.2411614915  
-0.463448775  
-0.6906872874  
-0.8954291423  
-1.051008295  
-1.134675792  
-1.13045425  
-1.031351861  
-0.8406481527  
-0.572018067  
-0.2484052685  
0.1002904964  
0.4404983474  
0.7388494505  
0.966176096  
1.101111221  
1.132811136  
1.062409323  
0.9029865278  
0.6780256605  
0.418535354  
0.1591902467  
-0.06600756433  
-0.2279967483  
-0.3063018539  
-0.291586963  
-0.1867883876  
-0.006690362784  
0.2240168422  
0.4739272984  
0.7089720897  
0.89680195  
1.010945507  
1.034212603  
0.9608977812  
0.7975059699  
0.56191675  
0.281097952  
-0.01230929168  
-0.2840696189  
-0.502542625  
-0.6424281479  
-0.6875727661  
-0.6325080329  
-0.4825754485  
-0.2527033077  
0.03489856927  
0.3537195361  
0.6761286995  
0.9762861494  
1.232412753  
1.42818054  
1.553177239  
1.602556525  
1.576119283  
1.477140952  
1.311263437  
1.085695186  
0.8088496794  
0.4904109188  
0.1416949986  
-0.2239301193  
-0.5908283654  
-0.9413129694  
-1.256452893  
-1.517476607  
-1.707652933  
-1.814393769  
-1.831237347  
-1.759348799  
-1.608211493  
-1.39529159  
-1.144603659  
-0.884282366  
-0.6434285601  
-0.4486284792  
-0.3206192026  
-0.2715800224  
-0.303467177  
-0.407662376  
-0.5660391646  
-0.7533405777  
-0.9405685736  
-1.098917288  
-1.203700299  
-1.23769135  
-1.193382725  
-1.07381379  
-0.8918339276  
-0.6679164932  
-0.4268567661  
-0.193882502  
0.009208745437  
0.1672698316  
0.2738715408  
0.3319115425  
0.3526915367  
0.3536592798  
0.3552177456  
0.3771522191  
0.4352689219  
0.5387718135  
0.6887621654  
0.8780271663  
1.092072517  
1.311142253  
1.512850747  
1.674979653  
1.778028366  
1.80720262  
1.75366558  
1.615011767  
1.395071539  
1.103212575  
0.753349488  
0.3628356283  
-0.04863896313  
-0.4600970843  
-0.8502866651  
-1.198701431  
-1.486655089  
-1.698410572  
-1.82231111  
-1.851795587  
-1.786144176  
-1.6307922  
-1.397094669  
-1.101495382  
-0.7641552937  
-0.4071852475  
-0.05271440456  
0.2789564666  
0.570871422  
0.8104291838  
0.9897929211  
1.105720245  
1.158916686  
1.15309447  
1.093931433  
0.9881218444  
0.8426592173  
0.6644251246  
0.4600800777  
0.2361984837  
-0.0004605728885  
-0.2426602652  
-0.4824803632  
-0.7112708107  
-0.9198079445  
-1.098648703  
-1.238644499  
-1.331580459  
-1.370871987  
-1.3522612  
-1.274466023  
-1.139709626  
-0.9540847146  
-0.7276657887  
-0.4743128463  
-0.2111001014  
0.04266251779  
0.2667956351  
0.4419410007  
0.551429666  
0.5831415176  
0.5311228027  
0.3967271265  
0.189093428  
-0.07517915412  
-0.3731770501  
-0.6775666156  
-0.9590480935  
-1.189103096  
-1.342735344  
-1.400878258  
-1.352209899  
-1.194174236  
-0.9331201563  
-0.5835747076  
-0.1667707619  
0.2913659365  
0.7625130864  
1.218277178  
1.632300584  
1.981978166  
2.249674701  
2.42343173  
2.497211422  
2.470777134  
2.349331902  
2.143015239  
1.866321818  
1.537453909  
1.17756579  
0.8098335022  
0.4582768751  
0.1462985695  
-0.1050379856  
-0.2788712848  
-0.3643656355  
-0.3582318764  
-0.2656754691  
-0.1005235093  
0.1156317481  
0.3552989629  
0.5878462999  
0.7828634446  
0.9137193576  
0.9608318456  
0.9141764476  
0.7746227065  
0.5538664315  
0.2729082952  
-0.04073372519  
-0.3567002963  
-0.6458185699  
-0.8838878644  
-1.05466209  
-1.151580058  
-1.178006289  
-1.145976092  
-1.073673969  
-0.9820838484  
-0.8913695071  
-0.8175771882  
-0.7701875928  
-0.7508936309  
-0.7537721777  
-0.7667824437  
-0.7743102809  
-0.7603124068  
-0.7115275092  
-0.620217125  
-0.4859888769  
-0.3164083772  
-0.1262964103  
0.06417377224  
0.2322788519  
0.3560235016  
0.4173829053  
0.4050277017  
0.316130539  
0.1569963715  
-0.05754961222  
-0.3059087916  
-0.5623015844  
-0.7998241106  
-0.9935285449  
-1.123101727  
-1.174823889  
-1.142606795  
-1.028061339  
-0.8396989662  
-0.5914816519  
-0.3010035168  
0.01239175703  
0.3293060753  
0.6316013879  
0.9032592623  
1.130793877  
1.303326413  
1.412469069  
1.452193541  
1.418813665  
1.311182232  
1.131093002  
0.8838285269  
0.5787008965  
0.2294115066  
-0.1459617998  
-0.525497757  
-0.8845643366  
-1.197533417  
-1.439948722  
-1.59093714  
-1.635558398  
-1.566785079  
-1.386803755  
-1.107412283  
-0.749378148  
-0.3407714588  
0.08557578108  
0.4952204545  
0.8554969615  
1.138745687  
1.32498653  
1.4037183  
1.374638257  
1.24722161  
1.039238666  
0.7744340492  
0.4796791298  
0.1819638975  
-0.09440893943  
-0.3301149984  
-0.512356032  
-0.6355493882  
-0.7011529545  
-0.7167279443  
-0.6944161509  
-0.6490616789  
-0.5962147364  
-0.5502539173  
-0.5227940795  
-0.5215205747  
-0.549502907  
-0.6050006134  
-0.681718232  
-0.7694475727  
-0.8550172122  
-0.9234748258  
-0.9594324045  
-0.9484987236  
-0.8787308449  
-0.7420091693  
-0.5352284282  
-0.2611672261  
0.07109065234  
0.4463140141  
0.8439318832  
1.239502389  
1.606748761  
1.919993013  
2.156711258  
2.299902573  
2.339947094  
2.275687246  
2.114558664  
1.87173172  
1.568368018  
1.229231873  
0.8799826311  
0.544517104  
0.2427068002  
-0.01119781996  
-0.2093479198  
-0.3502305255  
-0.4378675846  
-0.480469391  
-0.488800586  
-0.474516781  
-0.4487119457  
-0.4208266902  
-0.3980193168  
-0.3849883613  
-0.3841951755  
-0.3963498356  
-0.4210474107  
-0.4573865667  
-0.5044787089  
-0.561744989  
-0.6289707507  
-0.7061208367  
-0.7929448294  
-0.8884665017  
-0.9904382676  
-1.094880814  
-1.195815823  
-1.28529103  
-1.353745153  
-1.390744594  
-1.386030551  
-1.33078621  
-1.218954106  
-1.048427467  
-0.8218995013  
-0.5472174358  
-0.2371191099  
0.09166497111  
0.4198822522  
0.7276281033  
0.9963822533  
1.2109371  
1.360955779  
1.441924977  
1.455394141  
1.408452523  
1.312556261  
1.181872874  
1.03140997  
0.8752042229  
0.7248136854  
0.5883256959  
0.4699654039  
0.3703126457  
0.2870233914  
