-0.2722530594  
-0.6265028519  
-0.9505537696  
-1.220164871  
-1.417861731  
-1.535101567  
-1.573256038  
-1.543264973  
-1.46402841  
-1.359754366  
-1.256652946  
-1.179416424  
-1.147982579  
-1.175002278  
-1.264337415  
-1.410763846  
-1.600883522  
-1.815072769  
-2.030195821  
-2.222666  
-2.371465414  
-2.460717971  
-2.481519417  
-2.432816265  
-2.321293266  
-2.160332575  
-1.968239526  
-1.765994212  
-1.574832878  
-1.413942424  
-1.298517772  
-1.238353558  
-1.237060093  
-1.291925947  
-1.394369675  
-1.530886239  
-1.684369229  
-1.835667349  
-1.96525599  
-2.054889684  
-2.089125689  
-2.056614758  
-1.951054223  
-1.771725836  
-1.523559635  
-1.216701821  
-0.8656003431  
-0.4876949043  
-0.101825456  
0.273466646  
0.6215688944  
0.9291666051  
1.187210505  
1.391382262  
1.542023309  
1.64357512  
1.703629183  
1.731735298  
1.738136223  
1.732591526  
1.723430715  
1.716919584  
1.716981006  
1.725248728  
1.741388947  
1.763594014  
1.789143611  
1.814930594  
1.837881998  
1.855224365  
1.864599777  
1.86405366  
1.85195215  
1.826887577  
1.787629609  
1.73315834  
1.662798013  
1.576424519  
1.474712051  
1.359351488  
1.233181972  
1.100177533  
0.9652493692  
0.8338730989  
0.7115572266  
0.6032258791  
0.5126026421  
0.4416849164  
0.3904110989  
0.3565790619  
0.3360627477  
0.3233002429  
0.3120130668  
0.2960464292  
0.2702283883  
0.2311008121  
0.1774290564  
0.1103980288  
0.03347205742  
-0.04807126164  
-0.1278565608  
-0.1992724398  
-0.2563558623  
-0.2945673661  
-0.3113566013  
-0.3064451479  
-0.2818018281  
-0.2413294094  
-0.1903252902  
-0.1348036397  
-0.08077597204  
-0.03359037619  
0.002589402789  
0.02512498214  
0.03302783471  
0.02689468836  
0.008676394533  
-0.01866341898  
-0.05154600478  
-0.08618064412  
-0.1189340482  
-0.1466337279  
-0.1667991958  
-0.1777941076  
-0.1789018463  
-0.1703425219  
-0.1532272298  
-0.1294671438  
-0.1016414468  
-0.07282078628  
-0.04636198265  
-0.02567982464  
-0.01400348775  
-0.01413245122  
-0.02821601026  
-0.05755948538  
-0.1024861115  
-0.1622562278  
-0.2350645822  
-0.3181100412  
-0.4077453422  
-0.499701371  
-0.5893769392  
-0.6721777113  
-0.7438873794  
-0.8010361238  
-0.8412413227  
-0.8634681594  
-0.8681803549  
-0.8573404747  
-0.8342403507  
-0.8031531614  
-0.7688416346  
-0.7359555008  
-0.70840314  
-0.6887778921  
-0.6779348498  
-0.6747859359  
-0.6763783549  
-0.6782525971  
-0.6750584918  
-0.6613419121  
-0.6323934533  
-0.5850257865  
-0.5181492238  
-0.4330474592  
-0.3332888818  
-0.2242804073  
-0.1125209163  
-0.00466510898  
0.0934496598  
0.1776605226  
0.2460738527  
0.2992987749  
0.3402728117  
0.3737071648  
0.4052297766  
0.4403684217  
0.4835211499  
0.5370983846  
0.6009571869  
0.6722247641  
0.7455489743  
0.8137356937  
0.8686867053  
0.9024993649  
0.9085708343  
0.8825438729  
0.8229699066  
0.7315832097  
0.6131562449  
0.4749629999  
0.3259149132  
0.1754997753  
0.03267015593  
-0.09517200659  
-0.202952527  
-0.2883627069  
-0.3519002327  
-0.3965209982  
-0.4269516757  
-0.4487687039  
-0.4673855762  
-0.4870968156  
-0.5103290463  
-0.5372095634  
-0.5655281079  
-0.5911053963  
-0.6085113613  
-0.6120393499  
-0.5967751115  
-0.5595981944  
-0.4999465336  
-0.4202097725  
-0.3256591111  
-0.2239052532  
-0.1239400395  
-0.03488480945  
0.03537183898  
0.08144117023  
0.101414467  
0.09737525495  
0.07536494153  
0.0447559712  
0.01712076399  
0.004732127406  
0.01889192129  
0.0683332928  
0.1579105564  
0.2877723776  
0.4531283704  
0.6446554475  
0.8494821836  
1.052623468  
1.238672097  
1.393521181  
1.505892531  
1.568481967  
1.578580977  
1.538123246  
1.453167369  
1.332919947  
1.188447727  
1.031270193  
0.8720166097  
0.7193260868  
0.5791211586  
0.4543034266  
0.3448961839  
0.2485656083  
0.1614250292  
0.0789896534  
-0.002864180012  
-0.08706101966  
-0.1747235334  
-0.2648707946  
-0.3544582114  
-0.4387317492  
-0.5118571285  
-0.5677221004  
-0.6008214917  
-0.6070948354  
-0.5846139744  
-0.5340219016  
-0.4586603918  
-0.3643619308  
-0.2589142242  
-0.1512651063  
-0.05055648309  
0.03488950412  
0.09849914877  
0.1361620184  
0.1466369702  
0.1315861637  
0.09523123475  
0.0436821639  
-0.01596542713  
-0.07662940497  
-0.1321906023  
-0.1782602916  
-0.2126470159  
-0.2354770251  
-0.2489487658  
-0.2567880942  
-0.2634803158  
-0.2734217352  
-0.2901079589  
-0.3154888004  
-0.3495819936  
-0.3903878462  
-0.4341238836  
-0.4757230897  
-0.5095267075  
-0.5300578437  
-0.5327689468  
-0.5146517086  
-0.4746329888  
-0.4137032497  
-0.3347783745  
-0.242325091  
-0.1418248251  
-0.03915011515  
0.06003966528  
0.1508148125  
0.2293409042  
0.2930694172  
0.3407545697  
0.3723349611  
0.3887112508  
0.3914924449  
0.3827359823  
0.3647289628  
0.3398285614  
0.3103475041  
0.2784871798  
0.2462935874  
0.2156120359  
0.1880336488  
0.1648235268  
0.146837115  
0.1344353851  
0.1274236217  
0.125026966  
0.1259217093  
0.1283260395  
0.1301507645  
0.1291994691  
0.1233923533  
0.110994115  
0.09082289435  
0.06241140479  
0.02611206604  
-0.01686519448  
-0.06448313942  
-0.1139729503  
-0.1619882502  
-0.2047986756  
-0.238529214  
-0.259418879  
-0.2640989746  
-0.2498777324  
-0.2150137017  
-0.158970006  
-0.08261726787  
0.01163000589  
0.1197703651  
0.236296668  
0.3544098377  
0.4663858825  
0.564075805  
0.6395269726  
0.6856770282  
0.6970575463  
0.6704360625  
0.6053174501  
0.5042302831  
0.3727387395  
0.2191494842  
0.05391729513  
-0.1112132661  
-0.2642505586  
-0.3940802249  
-0.4915452008  
-0.5503595347  
-0.5677423714  
-0.5446982157  
-0.4859053772  
-0.3992212504  
-0.2948744978  
-0.1844296113  
-0.07965801965  
0.008555373415  
0.07115544251  
0.1016103496  
0.09630774488  
0.05464110471  
-0.02119326035  
-0.1266154459  
-0.255228969  
-0.3994545506  
-0.5511493269  
-0.7021711105  
-0.8448492255  
-0.9723605172  
-1.079017799  
-1.160485214  
-1.213937737  
-1.23816607  
-1.233609073  
-1.202299304  
-1.147684789  
-1.074304856  
-0.9873139393  
-0.8918743589  
-0.7924735333  
-0.6922454627  
-0.5924103195  
-0.491937109  
-0.3875204221  
-0.273922842  
-0.1446853517  
0.006866734266  
0.1864512472  
0.3976487446  
0.6409170132  
0.9129595734  
1.206580214  
1.511070835  
1.813110856  
2.098040789  
2.351356142  
2.560178664  
2.714521114  
2.808141499  
2.838911788  
2.808657053  
2.722531796  
2.588076883  
2.414105684  
2.209626903  
1.982962886  
1.741172473  
1.489847776  
1.233255968  
0.9747582514  
0.717375468  
0.4643543921  
0.2195983503  
-0.01214759796  
-0.2254214821  
-0.4144674743  
-0.5738985532  
-0.6994880666  
-0.7889382079  
-0.8424842429  
-0.8632030201  
-0.856939432  
-0.8318381954  
-0.7975167414  
-0.7639945161  
-0.740523994  
-0.7345107449  
-0.750676566  
-0.7906085283  
-0.8527566263  
-0.9328892049  
-1.024915822  
-1.121940964  
-1.217366763  
-1.305836982  
-1.383857017  
-1.449967441  
-1.504429632  
-1.548479842  
-1.583286056  
-1.608812415  
-1.622838767  
-1.62035655  
-1.593526735  
-1.532289105  
-1.425598804  
-1.263151795  
-1.037352687  
-0.7452143055  
-0.3898634045  
0.01864040347  
0.4633710319  
0.9215584831  
1.366484176  
1.770039799  
2.105610647  
2.350914148  
2.490393493  
2.51686012  
2.432167284  
2.246845285  
1.978776456  
1.651110504  
1.289721944  
0.9205531468  
0.5671787172  
0.2488702493  
-0.02064793441  
-0.2336702733  
-0.3882558456  
-0.4873740128  
-0.5376529597  
-0.5479625122  
-0.5280542316  
-0.4874342129  
-0.434581854  
-0.3765500595  
-0.3189129382  
-0.2659627679  
-0.2210328367  
-0.1868211539  
-0.1656020109  
-0.1592632091  
-0.1691599588  
-0.1958245094  
-0.2386170862  
-0.2954219702  
-0.3625028757  
-0.4345875618  
-0.5052352696  
-0.5674686002  
-0.6145940701  
-0.6411169364  
-0.6435841657  
-0.621230659  
-0.5762862668  
-0.5138708617  
-0.4414535914  
-0.3679211598  
-0.3023742543  
-0.2528212468  
-0.2249554193  
-0.2212296486  
-0.2403753613  
-0.2774820895  
-0.3246465213  
-0.3721340602  
-0.4098863473  
-0.4291519751  
-0.4239985908  
-0.3924313677  
-0.3369378893  
-0.2643218421  
-0.1848155743  
-0.1105779457  
-0.05377491765  
-0.02453548516  
-0.02909391322  
-0.06842105991  
-0.137589611  
-0.2259921845  
-0.318435011  
-0.3969680884  
-0.4432204146  
-0.4409169667  
-0.3782344312  
-0.2496643676  
-0.05712517395  
0.1898297871  
0.4747476485  
0.7758555698  
1.068296709  
1.326742245  
1.52807948  
1.653861623  
1.692253086  
1.639277808  
1.499241153  
1.284315612  
1.01334216  
0.7099933952  
0.400484299  
0.1110801897  
-0.1343643403  
-0.3165859479  
-0.4225984829  
-0.4467263123  
-0.3908924955  
-0.2641411003  
-0.08146300172  
0.1379291423  
0.3726720007  
0.601428507  
0.8049227712  
0.9676228851  
1.078896061  
1.133564467  
1.13184687  
1.078767752  
0.9831557171  
0.8564175856  
0.7112378793  
0.5603697062  
0.4156236882  
0.2871081225  
0.1827259232  
0.1079132696  
0.06554238115  
0.05596048079  
0.07710288627  
0.1246815524  
0.1924463224  
0.2725466937  
0.3560214112  
0.4334249276  
0.4955824624  
0.5344085059  
0.5437165433  
0.519905225  
0.4624105259  
0.3738337642  
0.2596938001  
0.1278104207  
-0.01261985631  
-0.1521342133  
-0.2821440645  
-0.395944437  
-0.4894366452  
-0.5614581133  
-0.6136687153  
-0.6500180118  
-0.6758709351  
-0.6969336497  
-0.7181469523  
-0.7427163048  
-0.7714329073  
-0.8023934173  
-0.8311587028  
-0.8513496253  
-0.8555836705  
-0.8366332512  
-0.7886292818  
-0.7081520014  
-0.5950323506  
-0.4527547253  
-0.2883881137  
-0.1120417461  
0.06409000422  
0.2269773641  
0.3641470678  
0.4650304217  
0.5221114254  
0.5317170768  
0.4943734459  
0.4146781926  
0.3007190173  
0.1631195568  
0.01383146154  
-0.1351682448  
-0.2731313344  
-0.3915891044  
-0.4850977332  
-0.5516032847  
-0.5924029255  
-0.611731353  
-0.6160340399  
-0.6130259967  
-0.6106491223  
-0.6160511411  
-0.6346966105  
-0.6696995443  
-0.7214521594  
-0.7875779459  
-0.8632136229  
-0.9415829715  
-1.014803622  
-1.074836762  
-1.114464801  
-1.128203913  
-1.113019949  
-1.068774926  
-0.9983273504  
-0.907263026  
-0.8032711517  
-0.6952254158  
-0.5920682167  
-0.5016306584  
-0.4295298409  
-0.3782934029  
-0.3468274016  
-0.3303223706  
-0.3206138346  
-0.306997567  
-0.2773912157  
-0.2197353372  
-0.1234475305  
0.01923007001  
0.2121616333  
0.4546731385  
0.7413991944  
1.06265517  
1.405284178  
1.753871797  
2.092174451  
2.404572146  
2.677374926  
2.89980571  
3.064567775  
3.167945444  
3.209465626  
3.191231163  
3.117060516  
2.991615725  
2.819679764  
2.605715032  
2.353768105  
2.067705324  
1.751712287  
1.410900752  
1.051864891  
0.6830053845  
0.3144981266  
-0.0421756392  
-0.37511233  
-0.6732052602  
-0.927517309  
-1.132588915  
-1.287456435  
-1.396156867  
-1.467581365  
-1.514601623  
-1.552532239  
-1.597070202  
-1.661972692  
-1.756781768  
-1.884935029  
-2.042566265  
-2.218228312  
-2.393654811  
-2.545530567  
-2.648101976  
-2.676319768  
-2.609117418  
-2.432388618  
-2.141252402  
-1.741269701  
-1.248428975  
-0.687866941  
-0.0914879688  
0.505228006  
1.066803361  
1.561282604  
1.963245409  
2.255981436  
2.432586896  
2.49592488  
2.457520229  
2.335592946  
2.152524532  
1.93209533  
1.696825303  
1.465725879  
1.252686096  
1.06562989  
0.9064918888  
0.7719365168  
0.6546846054  
0.5452229477  
0.433664005  
0.3114779838  
0.1728940163  
0.01578633326  
-0.1580405923  
-0.3431758967  
-0.531454089  
-0.7131751561  
-0.8785034899  
-1.018811709  
-1.127780046  
-1.202093089  
-1.241642048  
-1.249241053  
-1.229922416  
-1.189958213  
-1.135781536  
-1.072992808  
-1.00561702  
-0.9357135756  
-0.8633958661  
-0.7872154457  
-0.7048413662  
-0.6138877249  
-0.5127330451  
-0.4011972378  
-0.2809458851  
-0.1555636525  
-0.03028457028  
0.08857600492  
0.1943943995  
0.2811001862  
0.3439872955  
0.3803732953  
0.3900026573  
0.3751586023  
0.3404654375  
0.2924285586  
0.2387702495  
0.1876442786  
0.1468243974  
0.1229522552  
0.1209078965  
0.1433687415  
0.1905713428  
0.2603051959  
0.3481247726  
0.4477580233  
0.5516854253  
0.6518329414  
0.7403359459  
0.810294048  
0.8564556258  
0.8757554154  
0.8676400876  
0.8341302708  
0.779595818  
0.7102436658  
0.6333592523  
0.5563847647  
0.4859266671  
0.4268326138  
0.3814538225  
0.349217266  
0.3265899121  
0.3074672576  
0.2839736231  
0.2475905044  
0.1904871428  
0.106877238  
-0.005777757784  
-0.1459083098  
-0.3074553229  
-0.4800662464  
-0.6498798773  
-0.8008422291  
-0.9164150131  
-0.9814832637  
-0.9842257203  
-0.9177175378  
-0.7810496957  
-0.5798146609  
-0.3258783257  
-0.03645092609  
0.2674437711  
0.5629307355  
0.8274500126  
1.040879242  
1.187378209  
1.256746868  
1.245161709  
1.155224886  
0.995344144  
0.778532035  
0.5208015187  
0.2393476365  
-0.04925086619  
-0.330594072  
-0.5936026709  
-0.8311227562  
-1.039935633  
-1.220208343  
-1.374495645  
-1.506448395  
-1.619458989  
-1.715435549  
-1.79392367  
-1.851708931  
-1.882971335  
-1.879990973  
-1.834292764  
-1.738075618  
-1.585695181  
-1.374982549  
-1.108172885  
-0.7923025826  
-0.4389829049  
-0.06356997479  
0.31617493  
0.6817540921  
1.015716661  
1.303325152  
1.533885541  
1.701592993  
1.805790224  
1.850636061  
1.844253686  
1.797482487  
1.722424164  
1.630953653  
1.533400464  
1.437537866  
1.347992783  
1.266113241  
1.190278195  
1.116589181  
1.039810377  
0.9544365949  
0.8557290819  
0.7405911233  
0.608168976  
0.4601139999  
0.3004855728  
0.1353189766  
-0.0280721421  
-0.1819567213  
-0.3190845164  
-0.4335114896  
-0.5212339391  
-0.5805628489  
-0.6121901866  
-0.6189643944  
-0.6054029457  
-0.5770427473  
-0.5397001659  
-0.4987709945  
-0.4586445857  
-0.422320229  
-0.3912600842  
-0.3654847606  
-0.3438901996  
-0.3247178011  
-0.3061092379  
-0.2866447959  
-0.2657872059  
-0.2441514467  
-0.2235517293  
-0.2068124479  
-0.1973496536  
-0.1985879448  
-0.2132842699  
-0.2428605405  
-0.286854173  
-0.3425815485  
-0.4050888384  
-0.4674302586  
-0.5212614194  
-0.5577041518  
-0.5683725168  
-0.5464333908  
-0.487558381  
-0.390620387  
-0.2580204111  
-0.09558043201  
0.08800394642  
0.2820906443  
0.4752732579  
0.6566594569  
0.8170447499  
0.9498242762  
1.051486178  
1.121635099  
1.162536752  
1.178281008  
1.173704139  
1.153271428  
1.120104411  
1.075336683  
1.017897298  
0.9447701496  
0.851684234  
0.734121889  
0.5884758834  
0.4131633559  
0.2095121869  
-0.01773911552  
-0.2604225857  
-0.5074307809  
-0.7456676007  
-0.9613435092  
-1.141444541  
-1.27518309  
-1.355229607  
-1.378555677  
-1.346773042  
-1.265911605  
-1.145669607  
-0.9982292276  
-0.8368074146  
-0.6741216971  
-0.520998504  
-0.3852917039  
-0.2712630498  
-0.1794827326  
-0.1072521467  
-0.04945272307  
0.000315888392  
0.04850173618  
0.1004590499  
0.1595759446  
0.2267813548  
0.3005023757  
0.377032013  
0.4512342794  
0.5174442419  
0.5704028705  
0.606070029  
0.6221984704  
0.6185882555  
0.5970153226  
0.5608755916  
0.5146306129  
0.4631699287  
0.4111933664  
0.3627120109  
