-0.1520530888  
0.2639384743  
0.6544701839  
0.9993870378  
1.284319292  
1.502348031  
1.654549699  
1.74934311  
1.800778331  
1.826049771  
1.842664738  
1.86570868  
1.905636852  
1.966924059  
2.047744293  
2.14068622  
2.234359707  
2.315598744  
2.3718942  
2.393664688  
2.376017067  
2.319730575  
2.231323036  
2.122215438  
2.007117627  
1.901896717  
1.821245343  
1.776494203  
1.773893266  
1.813602027  
1.88953995  
1.99011954  
2.099747734  
2.200895523  
2.276433512  
2.311912152  
2.297463395  
2.229064154  
2.108982047  
1.94535219  
1.750951482  
1.541352385  
1.332716405  
1.139556481  
0.9727731319  
0.8382433467  
0.7361563709  
0.6611648381  
0.6033338429  
0.5497228838  
0.486371918  
0.4004066768  
0.2819612315  
0.1256557456  
-0.06856953478  
-0.2953616567  
-0.5446008848  
-0.8026828031  
-1.054237419  
-1.284035584  
-1.478838273  
-1.628913689  
-1.72904752  
-1.778935071  
-1.782919959  
-1.749166952  
-1.688407572  
-1.61246282  
-1.532766118  
-1.45908414  
-1.398608677  
-1.355500416  
-1.330912927  
-1.323441999  
-1.329874685  
-1.346102765  
-1.368018524  
-1.392263982  
-1.416706661  
-1.440603544  
-1.464437174  
-1.48949198  
-1.517257928  
-1.548785101  
-1.584117854  
-1.621901997  
-1.659255538  
-1.691919849  
-1.714686705  
-1.722033594  
-1.708877275  
-1.671334928  
-1.607371299  
-1.517236776  
-1.403614283  
-1.271454859  
-1.127495617  
-0.979528409  
-0.8355036179  
-0.7025845051  
-0.5862833847  
-0.489798954  
-0.4136358593  
-0.3555884334  
-0.3110710408  
-0.2737748715  
-0.2365594811  
-0.1924598548  
-0.1356711178  
-0.06238976862  
0.02862522638  
0.1358210722  
0.2549991943  
0.3798079435  
0.5025116454  
0.614932647  
0.7094355193  
0.7798260923  
0.8220606117  
0.8346750655  
0.8189080701  
0.7785065401  
0.7192743087  
0.648421585  
0.5738193712  
0.5032417282  
0.4436944783  
0.4008875219  
0.3788986446  
0.3800348129  
0.4048846898  
0.4525153061  
0.5207682573  
0.6065995163  
0.7063952305  
0.8162421425  
0.9321104272  
1.049954015  
1.165741477  
1.275446001  
1.375039697  
1.460522203  
1.528015018  
1.573934041  
1.595224004  
1.589637836  
1.556006124  
1.494457982  
1.406545572  
1.295236011  
1.164757955  
1.020318758  
0.8677099908  
0.7128556208  
0.5613542747  
0.4180685011  
0.2868060265  
0.1701265879  
0.06927125141  
-0.01577088226  
-0.08610841647  
-0.1437196275  
-0.1911904465  
-0.2314529528  
-0.2675340442  
-0.3023288771  
-0.3383948213  
-0.3777586302  
-0.4217267267  
-0.4707142308  
-0.524099442  
-0.5801472044  
-0.6360381882  
-0.6880599951  
-0.7319753718  
-0.7635829102  
-0.7794288668  
-0.7775852948  
-0.7583806765  
-0.724938605  
-0.6833852974  
-0.6426119883  
-0.6135393703  
-0.607913385  
-0.636733949  
-0.7085230121  
-0.8276710624  
-0.9931471786  
-1.197820823  
-1.428571063  
-1.667273536  
-1.892590075  
-2.082379031  
-2.216412137  
-2.279020297  
-2.261259473  
-2.162264774  
-1.989544068  
-1.758134983  
-1.488723611  
-1.204975015  
-0.9304724429  
-0.68570853  
-0.4855708018  
-0.3376833498  
-0.2418275211  
-0.1904867948  
-0.1703972684  
-0.1648252185  
-0.156202868  
-0.12870205  
-0.07037965762  
0.02540659183  
0.1594587703  
0.3271046548  
0.519316694  
0.7243664452  
0.92969944  
1.123715811  
1.297189219  
1.444126019  
1.561990342  
1.651317526  
1.714857468  
1.756444727  
1.779834682  
1.787729114  
1.781164122  
1.759357965  
1.720027102  
1.660084746  
1.5765796  
1.467684968  
1.333543443  
1.176810591  
1.002786669  
0.8191073408  
0.635037069  
0.4604703807  
0.304793518  
0.1757878488  
0.07871922134  
0.01575063223  
-0.01425419754  
-0.01552731735  
0.005164654098  
0.03934899765  
0.07781854663  
0.1116314913  
0.1330141778  
0.1360882533  
0.1173552486  
0.0759261125  
0.01349868193  
-0.06588969631  
-0.1562945134  
-0.2504309922  
-0.3403412111  
-0.4181104473  
-0.4765954616  
-0.5101178108  
-0.5150742483  
-0.4904077792  
-0.4378846153  
-0.3621231473  
-0.2703560929  
-0.1718948968  
-0.07734338556  
0.002390022384  
0.0571797113  
0.07875843038  
0.06164870607  
0.003827387775  
-0.09295528197  
-0.2232647025  
-0.3784724856  
-0.5475968345  
-0.7183964573  
-0.8785882926  
-1.017044944  
-1.124835062  
-1.195987885  
-1.227909041  
-1.221418294  
-1.180422509  
-1.111292675  
-1.022033089  
-0.9213537121  
-0.8177688097  
-0.7188049851  
-0.6304070032  
-0.5565775149  
-0.4992636584  
-0.4584677474  
-0.4325357475  
-0.4185698895  
-0.412897095  
-0.4115411315  
-0.4106467725  
-0.4068386596  
-0.3974843427  
-0.3808700541  
-0.3563039132  
-0.3241341343  
-0.2857147559  
-0.2433082819  
-0.1999336376  
-0.1591530039  
-0.1248062233  
-0.1006910436  
-0.09021590486  
-0.09603750129  
-0.1197311244  
-0.1615225567  
-0.2201278782  
-0.2927233092  
-0.375071084  
-0.4617898909  
-0.5467629622  
-0.6236331932  
-0.6863447743  
-0.7296683437  
-0.7496560411  
-0.7439722562  
-0.7120796236  
-0.6552420247  
-0.5763653152  
-0.4796872835  
-0.3703538323  
-0.253937743  
-0.135939923  
-0.02134181718  
0.08575182014  
0.1823463968  
0.2666491105  
0.3380225821  
0.3968184815  
0.4441331253  
0.4815328357  
0.5107912923  
0.5336779677  
0.5518374298  
0.5667494581  
0.5797711528  
0.5922208903  
0.6054706258  
0.6210018246  
0.6403850338  
0.6651703355  
0.6966836501  
0.735762271  
0.7824640484  
0.8358151097  
0.8936499083  
0.9526059853  
1.008287082  
1.055624272  
1.089386273  
1.10480466  
1.098221115  
1.067667389  
1.013298952  
0.9375859692  
0.8452274141  
0.7427759751  
0.6379902923  
0.5390026439  
0.4533861628  
0.3872487801  
0.3444710661  
0.3261894793  
0.3306008765  
0.3531156604  
0.3868554661  
0.4234224306  
0.4538602736  
0.4696795181  
0.4638272829  
0.4314831597  
0.370588303  
0.2820475603  
0.1695954492  
0.03934476848  
-0.1009112251  
-0.2425505934  
-0.3770215973  
-0.4966759702  
-0.5954438486  
-0.6692778131  
-0.7163338783  
-0.736891467  
-0.7330424992  
-0.7082236337  
-0.6666648762  
-0.6128409733  
-0.5510018628  
-0.4848345012  
-0.4172846125  
-0.350536405  
-0.2861292324  
-0.225151077  
-0.1684708552  
-0.1169364504  
-0.07151729047  
-0.03334601721  
-0.003666801554  
0.01629115344  
0.02549614992  
0.02329726268  
0.009589039291  
-0.01509124175  
-0.0495339213  
-0.09191379512  
-0.1399091582  
-0.1908770155  
-0.242052442  
-0.2907569106  
-0.334595405  
-0.3716390415  
-0.4005807951  
-0.4208739282  
-0.4328361712  
-0.4377276702  
-0.4377731176  
-0.4361228155  
-0.4367252432  
-0.4440999583  
-0.4630087961  
-0.498032739  
-0.5530863634  
-0.6309202943  
-0.7326552328  
-0.857422108  
-1.002154977  
-1.161586194  
-1.328465964  
-1.494005544  
-1.64852291  
-1.782238912  
-1.886152225  
-1.952902568  
-1.977536203  
-1.958063789  
-1.895744863  
-1.795034614  
-1.663174007  
-1.509452207  
-1.344207332  
-1.177683949  
-1.018880798  
-0.8745502182  
-0.7484861227  
-0.6412038909  
-0.5500722528  
-0.4698749605  
-0.3937360714  
-0.3142652232  
-0.224756215  
-0.1202608072  
0.001623771996  
0.1403741876  
0.2926150657  
0.4526306947  
0.613228544  
0.7668108247  
0.9064879013  
1.027052462  
1.125671319  
1.202201709  
1.259075552  
1.30080388  
1.333168575  
1.36224908  
1.393422323  
1.430501378  
1.475126568  
1.526502319  
1.581500216  
1.635126688  
1.681247702  
1.713498245  
1.726210561  
1.715250458  
1.678636594  
1.616848593  
1.532806615  
1.431503516  
1.319359473  
1.203391283  
1.090308993  
0.9856714325  
0.8932257688  
0.8145113807  
0.74879063  
0.6933137793  
0.6438649395  
0.5955225122  
0.5435067568  
0.4839895771  
0.4147554374  
0.3356010744  
0.2484254854  
0.1569889467  
0.06637796647  
-0.01774009536  
-0.08997243692  
-0.1460308896  
-0.1834111518  
-0.2018233996  
-0.2033039623  
-0.1919878729  
-0.1735714767  
-0.1545436734  
-0.1412953573  
-0.1392407454  
-0.1520788027  
-0.1812979167  
-0.2260116533  
-0.2831319179  
-0.3478620959  
-0.4144314387  
-0.4769562789  
-0.5303059262  
-0.5708404729  
-0.5969187143  
-0.6091090623  
-0.610078552  
-0.6041908504  
-0.5968744311  
-0.5938516814  
-0.6003505348  
-0.6203854814  
-0.6562105264  
-0.7079955179  
-0.7737576149  
-0.8495471948  
-0.9298514258  
-1.008163003  
-1.077655474  
-1.131886256  
-1.16546608  
-1.174639692  
-1.157714696  
-1.115316252  
-1.050432254  
-0.9682443569  
-0.8757444277  
-0.781154364  
-0.6931961627  
-0.6202619582  
-0.5695616296  
-0.5463362435  
-0.5532247963  
-0.5898715187  
-0.6528353533  
-0.7358318827  
-0.8303010026  
-0.9262526236  
-1.013291362  
-1.08170463  
-1.123484356  
-1.133140893  
-1.108222961  
-1.049473314  
-0.960606304  
-0.8477549169  
-0.7186671261  
-0.5817734743  
-0.4452520908  
-0.3162138344  
-0.2001054828  
-0.1003844252  
-0.01848267091  
0.04597589199  
0.09476927637  
0.1305648449  
0.1564031176  
0.1752407663  
0.1896287154  
0.2015410857  
0.212353371  
0.2229454217  
0.2338692369  
0.2455466757  
0.2584256751  
0.2730828141  
0.2902481645  
0.3107570131  
0.3354512799  
0.3650722961  
0.4001551681  
0.4409717882  
0.487512738  
0.53951993  
0.5965411921  
0.657983169  
0.7231467257  
0.7912063129  
0.8611476157  
0.9316680644  
1.001060901  
1.067134649  
1.127195953  
1.17813469  
1.21662737  
1.239451878  
1.243883439  
1.228115591  
1.191647173  
1.135552157  
1.062588059  
0.9770826151  
0.8846093983  
0.7914571571  
0.703972887  
0.6278388345  
0.5673980009  
0.5251170842  
0.5012689194  
0.4938817755  
0.4989766099  
0.5110572321  
0.5237947798  
0.5308121743  
0.5264651836  
0.5065128537  
0.4685925771  
0.4124386507  
0.3398205091  
0.2542209487  
0.1603025145  
0.06324045527  
-0.03197588776  
-0.1211908591  
-0.2015779347  
-0.2719281827  
-0.332701791  
-0.3858332999  
-0.4343323551  
-0.4817366553  
-0.531501176  
-0.586396788  
-0.6480153841  
-0.7164305089  
-0.7900629572  
-0.8657629711  
-0.9390961029  
-1.004796851  
-1.057336136  
-1.091538589  
-1.103187254  
-1.089546838  
-1.049751291  
-0.9850201764  
-0.898670439  
-0.7959229165  
-0.6835085454  
-0.5691174001  
-0.4607276191  
-0.3658915585  
-0.2910468898  
-0.2409228036  
-0.218124082  
-0.222922121  
-0.2533007718  
-0.3052429377  
-0.3732252101  
-0.4508693672  
-0.5316568639  
-0.6096321636  
-0.6799934423  
-0.739507012  
-0.786699801  
-0.8218080609  
-0.8465099075  
-0.8634798834  
-0.8758420849  
-0.8865918394  
-0.8980681598  
-0.9115387281  
-0.9269419588  
-0.942804305  
-0.9563333434  
-0.9636670088  
-0.9602338444  
-0.941199619  
-0.9019378353  
-0.8385028442  
-0.7480582064  
-0.6292376642  
-0.4824078939  
-0.3098206696  
-0.1156301675  
0.0942231523  
0.3122772018  
0.5299393722  
0.7379933767  
0.9271904485  
1.088874961  
1.215605154  
1.301711943  
1.343738667  
1.340721252  
1.294272343  
1.208450541  
1.089422401  
0.9449388302  
0.7836849932  
0.6145624971  
0.445990385  
0.2853037429  
0.1383138278  
0.009078742421  
-0.1001034789  
-0.1884986282  
-0.2565924676  
-0.3056671469  
-0.3373862064  
-0.3534571467  
-0.3554281367  
-0.3446302331  
-0.3222603921  
-0.2895439171  
-0.247918461  
-0.1991652793  
-0.1454298289  
-0.08910609867  
-0.03258988809  
0.02205191116  
0.0734209636  
0.121060663  
0.1655717538  
0.2085281883  
0.2521730597  
0.2989366301  
0.3508414811  
0.4089128994  
0.472703547  
0.5400396913  
0.6070661303  
0.668602007  
0.7187869151  
0.7519199617  
0.7633769313  
0.7504468887  
0.7129704075  
0.6536448695  
0.5779547534  
0.4937118569  
0.410258367  
0.3374373784  
0.2844673791  
0.2588647255  
0.2655561479  
0.3062860552  
0.3793877819  
0.4799288508  
0.6001980356  
0.730460678  
0.8598726359  
0.9774526203  
1.072991359  
1.137827728  
1.165423124  
1.15171778  
1.095269047  
0.9971992366  
0.8609919428  
0.6921759553  
0.4979275758  
0.2866174231  
0.06731809668  
-0.1507290988  
-0.3586730754  
-0.5486201108  
-0.714192026  
-0.85102618  
-0.9571640723  
-1.033273246  
-1.082660611  
-1.111018165  
-1.125922404  
-1.136091366  
-1.150475202  
-1.177275468  
-1.223003309  
-1.29170204  
-1.384449058  
-1.499196323  
-1.630999749  
-1.772599473  
-1.91527973  
-2.049893544  
-2.167898528  
-2.262276421  
-2.328185496  
-2.363282888  
-2.367671121  
-2.343497398  
-2.294290733  
-2.224146506  
-2.136913024  
-2.035508142  
-1.921481659  
-1.794896325  
-1.654537859  
-1.498411881  
-1.324437213  
-1.131209164  
-0.9186900846  
-0.6887047342  
-0.4451406883  
-0.1938116282  
0.05801663596  
0.3023521022  
0.5313700162  
0.7383186716  
0.9183060351  
1.068861195  
1.190165486  
1.284948216  
1.358057758  
1.415773206  
1.464969183  
1.512247438  
1.56314331  
1.621523885  
1.689218933  
1.765922424  
1.849352078  
1.935616157  
2.019723286  
2.096151499  
2.159407481  
2.20450715  
2.227335634  
2.224874824  
2.195301566  
2.137967278  
2.053314835  
1.94274277  
1.808463563  
1.653362035  
1.480875982  
1.294877591  
1.099561379  
0.8993188307  
0.6985913379  
0.501705968  
0.3126954103  
0.1351201751  
-0.02808563756  
-0.1747345792  
-0.3034477118  
-0.4136619609  
-0.5055847361  
-0.5801130671  
-0.6387261763  
-0.683376119  
-0.7163874579  
-0.740361489  
-0.7580829586  
-0.772417173  
-0.7861788255  
-0.8019742475  
-0.8220055664  
-0.8478693491  
-0.8803650102  
-0.9193623386  
-0.9637583259  
-1.011559224  
-1.060097904  
-1.106369897  
-1.147458975  
-1.180984588  
-1.205498684  
-1.220752237  
-1.227778387  
-1.228744587  
-1.226586592  
-1.22446259  
-1.225103976  
-1.230173137  
-1.239739615  
-1.251978935  
-1.263158408  
-1.267946003  
-1.26000959  
-1.23283202  
-1.180625662  
-1.099214869  
-0.9867493768  
-0.8441415532  
-0.6751567027  
-0.4861476677  
-0.2854670937  
-0.08264020956  
0.1125872802  
0.2912019539  
0.4457639314  
0.5710283396  
0.6643044289  
0.7255132212  
0.7569721007  
0.7629456539  
0.7490426023  
0.721538226  
0.686706094  
0.650237017  
0.6167974941  
0.5897535785  
0.5710772108  
0.5614013656  
0.5601983066  
0.5660298568  
0.5768208916  
0.5901240063  
0.6033292658  
0.6138312402  
0.6191338087  
0.6169253069  
0.6051391281  
0.5820242506  
0.5462458275  
0.4970229131  
0.4342983405  
0.3589256371  
0.2728354096  
0.1791538938  
0.08222272308  
-0.01251047965  
-0.09875835322  
-0.1698264198  
-0.2191929457  
-0.2412038197  
-0.2318037573  
-0.1892286507  
-0.114550963  
-0.0119925289  
0.1110857637  
0.244557548  
0.376271276  
0.4931070278  
0.582249902  
0.6325316548  
0.6356733632  
0.5872574702  
0.4872896652  
0.3402491994  
0.1546160676  
-0.05808319125  
-0.2845796289  
-0.5113374646  
-0.7259988749  
-0.9185908165  
-1.082335734  
-1.213960275  
-1.313485886  
-1.383548209  
-1.428382952  
-1.452644118  
-1.460252957  
-1.453458163  
-1.432249178  
-1.394211556  
-1.334843471  
-1.24827608  
-1.128303332  
-0.9695643645  
-0.7687207927  
-0.5254694027  
-0.2432525511  
0.07042786721  
0.404144143  
0.7431273203  
1.070249203  
1.367323435  
1.616601189  
1.802326282  
1.912192024  
1.938570693  
1.879358181  
1.738353233  
1.525086552  
1.254101999  
0.9437268594  
0.6144514243  
0.2870699614  
