479.6663351  
482.4645676  
492.4995546  
469.2288866  
217.7458912  
432.9032476  
909.8570572  
22329.40151  
40324.5463  
27660.5504  
55298.14577  
49863.27238  
53295.65506  
6852.61408  
20715.30272  
1972.020915  
8091.831087  
12467.89222  
4527.252722  
5327.462598  
17045.78346  
2492.973668  
4.84385679  
2965.708905  
6917.243942  
633.9010696  
9411.817841  
1463.639772  
362.8946235  
9426.080514  
9538.64184  
5357.070535  
7199.410302  
8666.521065  
10337.99792  
7082.844629  
4865.445179  
17322.74721  
12684.02531  
3406.735313  
1720.234818  
3240.812347  
650.2608331  
644.0346916  
1652.283478  
3152.996433  
310.2022061  
542.1245859  
475.4366641  
2936.237299  
2055.341292  
2671.151198  
234.2268351  
0.2016164298  
2514.982324  
1307.767748  
3064.319684  
3080.538321  
2492.490997  
1128.271914  
409.2791056  
631.9611237  
701.9128877  
319.571558  
682.5758247  
161.3671384  
139.693265  
280.1693622  
259.2720362  
144.2476711  
23.49681574  
22.78541696  
71.27773703  
37.7685109  
17.95262468  
11.56488289  
9.316570687  
22.32510997  
19.54179085  
20.59674351  
12.22792977  
18.04515663  
14.84770332  
14.44511049  
12.94303339  
11.14009691  
10.755637  
10.45691492  
10.06504918  
9.378013519  
8.952031092  
8.046214823  
7.557958741  
6.942500755  
6.463992836  
6.013250794  
5.704555408  
5.463101667  
5.204021774  
4.964412027  
4.675857439  
4.489226118  
4.267951293  
4.081451512  
3.894622887  
3.699180455  
3.553847055  
3.403673804  
3.259060994  
3.111161619  
2.979583342  
2.85320768  
2.734065379  
2.624907459  
2.511876668  
2.41286942  
2.314133241  
2.224496773  
2.136891485  
2.055697332  
1.976400565  
1.903069945  
1.832810389  
1.764698024  
1.700334252  
1.63876418  
1.580118312  
1.524434832  
1.471230117  
1.420205405  
1.371598147  
1.324867813  
1.280131594  
1.237271859  
1.196089323  
1.156535324  
1.118853404  
1.082560705  
1.047758527  
1.014462596  
0.9824183296  
0.9516531805  
0.9220140496  
0.8935608992  
0.8662254109  
0.8398865207  
0.8145235175  
0.7901486025  
0.7667249091  
0.7440793433  
0.7223060077  
0.7013079111  
0.6810628599  
0.6615270222  
0.6426966002  
0.6245215531  
0.6069771755  
0.5900423957  
0.5737007487  
0.5579112688  
0.5426486647  
0.5278916984  
0.5136296489  
0.4998483624  
0.4865166971  
0.4736150931  
0.4611375635  
0.4490693541  
0.4373785213  
0.4260598197  
0.4150935994  
0.4044783451  
0.3941990482  
0.3842331327  
0.3745767743  
0.3652122049  
0.3561368486  
0.3473273162  
0.338783745  
0.3304962776  
0.3224653697  
0.3146562101  
0.3070782935  
0.2997332305  
0.2925899669  
0.2856595465  
0.278920926  
0.2723750302  
0.2660205877  
0.2598351103  
0.2538283088  
0.2479863071  
0.2423122655  
0.236797224  
0.2314192273  
0.2261991516  
0.2211150131  
0.2161649829  
0.2113598306  
0.2066726164  
0.2021109445  
0.1976735791  
0.1933470686  
0.1891410786  
0.1850376411  
0.1810424543  
0.1771539295  
0.1733541328  
0.1696629196  
0.1660581144  
0.162541784  
0.1591227492  
0.1557839282  
0.152529365  
0.1493557225  
0.1462587274  
0.1432397453  
0.1402892456  
0.1374159888  
0.1346059994  
0.1318722877  
0.1291979  
0.12658968  
0.1240445487  
0.1215556196  
0.1191237139  
0.1167557851  
0.1144356092  
0.1121815023  
0.1099697895  
0.1078071663  
0.1056959294  
0.1036372436  
0.1016223785  
0.09965381402  
0.0977308294  
0.09584058743  
0.09400319534  
0.09220616554  
0.09044405787  
0.08872306992  
0.08704238355  
0.08539487906  
0.08378633421  
0.08221320932  
0.08067257823  
0.07916701765  
0.07769013147  
0.07624600786  
0.07483103261  
0.07345219713  
0.07209856185  
0.07077152903  
0.06947333784  
0.06820622579  
0.06696440533  
0.06574277157  
0.06455165667  
0.0633797911  
0.06223808808  
0.06111321178  
0.0600215863  
0.05894177205  
0.05788676084  
0.05685374273  
0.0558408433  
0.05485215644  
0.05388037083  
0.05292848032  
0.05199177529  
0.05107762482  
0.05018052673  
0.04929956475  
0.04843661642  
0.04759069756  
0.04675994741  
0.04594615466  
0.0451521035  
0.04436888948  
0.04360129907  
0.04284599107  
0.04211112475  
0.04138431163  
0.04067510597  
0.03997585554  
0.03929676066  
0.03862259096  
0.03796103449  
0.03731816003  
0.03668090906  
0.03605911789  
0.03544903928  
0.03484995889  
0.03426192956  
0.03368205031  
0.03311325034  
0.03255847687  
0.0320110872  
0.03147287701  
0.03094371556  
0.03042624793  
0.02991893743  
0.02941764494  
0.02892692516  
0.02844665218  
0.02797252809  
0.02750769257  
0.02705188764  
0.02660363245  
0.02616235813  
0.02572778393  
0.02530405229  
0.02488502072  
0.02447444091  
0.02407159396  
0.02367532722  
0.02328672923  
0.02290373168  
0.0225251988  
0.02215598417  
0.02179455256  
0.02143662563  
0.02108009038  
0.02074007722  
0.0204016924  
0.0200671448  
0.01973771041  
0.01941388208  
0.01909759707  
0.01878701423  
0.01847837824  
0.01817874166  
0.0178828243  
0.01759033652  
0.01730416694  
0.01702319668  
0.01674523036  
0.01647480528  
0.01620748081  
0.01594414231  
0.01568295775  
0.01542630559  
0.01517734196  
0.01493173736  
0.01468793741  
0.01445029768  
0.0142164857  
0.01398479587  
0.01375982176  
0.01353382529  
0.01331353504  
0.01309913866  
0.01288635485  
0.01267646462  
0.0124710026  
0.01226829025  
0.01206975847  
0.01187347185  
0.01168092087  
0.0114910815  
0.01130420734  
0.01112185303  
0.01094182902  
0.01076267673  
0.0105874874  
0.01041410181  
0.01024739375  
0.01008019396  
0.009916237253  
0.009754922677  
0.009596463243  
0.009440103469  
0.009286538125  
0.009135730095  
0.00898623856  
0.00884059239  
0.008696761787  
0.008555160664  
0.008416209205  
0.008279100664  
0.008144131579  
0.008011077912  
0.007880924615  
0.007752374366  
0.007624865467  
0.007499630403  
0.007378824776  
0.007258815553  
0.007139801447  
0.007024837855  
0.006911411198  
0.006797952209  
0.00668612264  
0.006576652834  
0.00647043523  
0.00636522173  
0.00626090317  
0.006159003102  
0.006058478627  
0.005960639692  
0.00586322875  
0.005767440739  
0.00567387198  
0.005581995408  
0.005490671652  
0.005402702444  
0.005315040623  
0.005227946246  
0.00514428122  
0.005059743611  
0.004978886809  
0.004898929807  
0.004820349359  
0.004742269252  
0.004667066464  
0.004592270695  
0.004518706369  
0.004445900181  
0.004374236669  
0.004305224296  
0.004237510037  
0.00416941983  
0.004105134188  
0.004041731735  
0.003977062771  
0.00391478656  
0.003855036287  
0.003793517708  
0.003735091655  
0.003678313746  
0.003621273045  
0.003565401697  
0.003512684284  
0.003458171712  
0.003407213706  
0.003355949283  
0.003306571679  
0.003257591676  
0.003210279771  
0.003162251387  
0.003117698566  
0.003072948829  
0.003028718157  
0.00298657436  
0.002945228573  
0.002904239981  
0.002864311358  
0.002825652  
0.002787452136  
0.002750867379  
0.002716001233  
0.002679883739  
0.002644848856  
0.002611875489  
0.00257937971  
0.00254777631  
0.002518669817  
0.002488565371  
0.00246059236  
0.002431536504  
0.002405361485  
0.002378722252  
0.002353148951  
0.002329034978  
0.002305523996  
0.002282914262  
0.002260803831  
0.002239395801  
0.002220012857  
0.002200209609  
0.002182062133  
0.002163927324  
0.002146757976  
0.002130290008  
0.00211550108  
0.00210116736  
0.002087122696  
0.002074437073  
0.002061703263  
0.002050652027  
0.002040133914  
0.002030713023  
0.002021360108  
0.002013199356  
0.002005454357  
0.001999463803  
0.001992871482  
0.001988795656  
0.001983770859  
0.001980642119  
0.001977807825  
0.001975736268  
0.00197438606  
0.001973436657  
