235.5009723  
250.1451293  
262.0900019  
279.0458824  
1143.328103  
23202.11188  
14615.95365  
25934.23891  
8988.225526  
24221.33103  
28072.28253  
26872.60004  
36042.47157  
17482.11864  
7643.492339  
22395.22784  
3593.613808  
4785.662158  
892.8661526  
35014.04324  
6392.709698  
8933.644523  
22049.54458  
2266.481849  
5517.165992  
2372.319747  
4759.740278  
2831.703147  
9471.182758  
247.3216056  
2159.309097  
27333.18505  
276.9418764  
5225.769802  
2409.672254  
16458.67627  
7542.308103  
9013.300519  
10115.43667  
311.3359042  
2313.087881  
1422.009112  
6167.101982  
1834.513616  
11161.54983  
2541.835218  
473.8879396  
2126.054143  
2048.077993  
7152.054925  
3017.448271  
321.5238095  
2136.981598  
1714.601858  
2795.565251  
1178.467888  
142.0767759  
1679.36074  
3344.952706  
485.3580278  
47.23159247  
1205.988569  
1966.667881  
446.380177  
114.1305649  
1022.291687  
162.0989604  
140.3338445  
104.6112169  
12.18776357  
8.409362178  
50.36523135  
28.38021411  
37.31963312  
13.16177878  
29.83391294  
13.99070435  
6.128101369  
11.12379326  
7.426477047  
4.181303127  
3.510024055  
6.574251046  
6.349602446  
7.290317296  
5.134357767  
6.403944733  
4.777563552  
6.536393983  
5.135878797  
5.503874719  
5.562656333  
5.204849716  
4.816040231  
4.948680413  
4.785651828  
4.714361794  
4.733542854  
4.401435036  
4.541280461  
4.296201604  
4.309760389  
4.154959896  
4.112824956  
4.006135463  
3.931324484  
3.811634269  
3.75598782  
3.677637859  
3.600429342  
3.528003704  
3.452345208  
3.399151915  
3.321702709  
3.277634317  
3.205753596  
3.152326309  
3.094490951  
3.038727399  
2.983740346  
2.933568163  
2.881081995  
2.831391164  
2.783187528  
2.736789  
2.692791016  
2.646795457  
2.604584407  
2.562420399  
2.521774221  
2.482083645  
2.443933187  
2.406077249  
2.369260078  
2.333134359  
2.298319543  
2.263937055  
2.230636422  
2.19810183  
2.166353045  
2.135295  
2.104902618  
2.075364499  
2.046491756  
2.018149399  
1.990618467  
1.963532168  
1.93710168  
1.911291139  
1.886007675  
1.86129416  
1.837115463  
1.813464721  
1.790297155  
1.767625324  
1.745414345  
1.723681705  
1.702404574  
1.681560473  
1.661117125  
1.64110036  
1.62149753  
1.602264426  
1.583423675  
1.564952475  
1.546855485  
1.529079604  
1.511666967  
1.494584992  
1.477827452  
1.46138985  
1.445240808  
1.429422061  
1.413877731  
1.398631268  
1.383654017  
1.368954813  
1.354503484  
1.340346493  
1.326414956  
1.312730843  
1.299296231  
1.28609794  
1.273130709  
1.26039249  
1.247855235  
1.235560458  
1.223447367  
1.211561004  
1.199862734  
1.188376376  
1.177067064  
1.165956452  
1.155022804  
1.144262601  
1.133681984  
1.123274169  
1.113036196  
1.10295707  
1.093045426  
1.083291118  
1.073683509  
1.064244276  
1.054932292  
1.045765814  
1.036762608  
1.027893209  
1.019141323  
1.010552595  
1.002071174  
0.9937275456  
0.9855021966  
0.9773902461  
0.9694237791  
0.961567082  
0.9538306216  
0.9462061636  
0.9386775798  
0.9312717288  
0.9239744978  
0.9167800205  
0.9097032476  
0.9027144088  
0.89582289  
0.8890324439  
0.8823494339  
0.8757432237  
0.8692341901  
0.8628115522  
0.8564963856  
0.8502593516  
0.8440981137  
0.8380373018  
0.8320519688  
0.8261646053  
0.8203282225  
0.8145872278  
0.8089149495  
0.803331786  
0.7978202578  
0.7923849081  
0.7870135362  
0.7817086729  
0.7764883257  
0.7713336896  
0.7662324202  
0.7612176113  
0.7562569477  
0.7513660727  
0.7465321735  
0.7417698067  
0.7370506411  
0.7324099728  
0.7278335946  
0.7233028832  
0.7188224599  
0.7144150475  
0.7100458427  
0.705736646  
0.7015002652  
0.6973041695  
0.6931530368  
0.6890619522  
0.6850185451  
0.6810211451  
0.6770676975  
0.6731825962  
0.6693442025  
0.6655385618  
0.6617865266  
0.6580766133  
0.6544124072  
0.6507923256  
0.6472149644  
0.6436785214  
0.6401868672  
0.6367363769  
0.63333375  
0.629964154  
0.6266355208  
0.6233390418  
0.6201040977  
0.6168924051  
0.6137241341  
0.6105816233  
0.6074773801  
0.604408244  
0.6013883061  
0.5984020541  
0.595438056  
0.5925233138  
0.5896274425  
0.5867720664  
0.5839447625  
0.5811535637  
0.578404259  
0.5756753232  
0.5729840226  
0.5703087671  
0.5676799477  
0.5650698941  
0.5624990419  
0.5599529355  
0.5574343763  
0.5549474321  
0.5524881159  
0.5500529894  
0.5476524631  
0.5452684247  
0.5429221003  
0.540603251  
0.5383041422  
0.5360294429  
0.5337742755  
0.5315627804  
0.5293609527  
0.5271919564  
0.5250364366  
0.5229176779  
0.5208172159  
0.518737589  
0.5166832669  
0.5146531629  
0.5126427818  
0.5106536239  
0.5086932945  
0.5067511857  
0.5048286075  
0.5029326217  
0.5010483098  
0.4992002179  
0.4973495184  
0.4955428319  
0.4937500547  
0.4919624133  
0.4902139551  
0.4884752772  
0.4867599585  
0.4850580014  
0.4833751771  
0.4817150144  
0.4800759079  
0.4784512364  
0.4768391533  
0.4752509567  
0.4736805687  
0.4721302879  
0.4705976955  
0.4690782276  
0.4675785259  
0.4660879553  
0.4646194275  
0.4631663322  
0.4617346406  
0.4603128052  
0.4589110782  
0.4575276163  
0.4561535167  
0.4547996397  
0.4534613635  
0.4521319025  
0.4508163271  
0.4495248877  
0.4482465071  
0.4469778137  
0.4457268947  
0.444488287  
0.4432636688  
0.4420582172  
0.440863583  
0.4396850092  
0.4385196715  
0.4373642062  
0.4362298324  
0.435106643  
0.4339836255  
0.4328833981  
0.4318034378  
0.430733007  
0.4296731147  
0.4286228361  
0.4275804255  
0.4265625978  
0.4255469662  
0.424560789  
0.4235695955  
0.4225861389  
0.4216306815  
0.4206848315  
0.4197410293  
0.4188061306  
0.4179000539  
0.4170069913  
0.416106017  
0.4152224329  
0.4143609248  
0.4135071506  
0.4126573227  
0.4118208315  
0.4109955321  
0.4101829733  
0.4093764208  
0.4085942632  
0.4078134113  
0.4070351001  
0.4062802119  
0.4055255781  
0.4047880127  
0.404060407  
0.4033429864  
0.402634648  
0.4019322774  
0.4012393201  
0.4005673173  
0.3998978932  
0.3992449859  
0.3985923256  
0.3979595831  
0.3973265802  
0.3966981916  
0.3960990535  
0.395491299  
0.3949062243  
0.39432648  
0.3937550508  
0.3931936432  
0.3926346278  
0.3920899655  
0.3915585394  
0.3910256687  
0.3905042462  
0.3900018658  
0.3895117736  
0.3890196777  
0.3885402042  
0.3880627864  
0.3876030091  
0.3871508496  
0.3866979958  
0.3862651011  
0.3858335342  
0.3854190742  
0.3850007168  
0.3846037174  
0.3842043478  
0.3838293155  
0.3834496493  
0.3830777804  
0.382720957  
0.3823650624  
0.3820259424  
0.3816853865  
0.381361218  
0.3810415586  
0.3807243012  
0.3804291707  
0.3801302666  
0.3798467291  
0.3795691458  
0.3793056489  
0.3790380989  
0.3787830909  
0.378534767  
0.3782951628  
0.378070735  
0.3778507547  
0.3776365364  
0.3774336135  
0.377234657  
0.3770388328  
0.3768544793  
0.3766821484  
0.376517011  
0.3763595438  
0.3762141432  
0.3760620383  
0.37593603  
0.3758078895  
0.3756848424  
0.3755719464  
0.3754725244  
0.3753651728  
0.3752886246  
0.3751998892  
0.375129493  
0.3750679337  
0.3750044523  
0.3749557251  
0.3749102884  
0.3748813286  
0.3748488833  
0.3748321692  
0.3748177787  
0.3748206983  
