0.03297928305  
0.3245815398  
0.5969302013  
0.8343725575  
1.024612257  
1.15985504  
1.237443198  
1.259906669  
1.234428984  
1.171798649  
1.084984811  
0.9875234393  
0.8919187008  
0.8082664205  
0.7432688033  
0.6997526771  
0.6767392103  
0.6700306768  
0.6732074438  
0.6788822578  
0.6800187225  
0.6711190877  
0.6491144172  
0.6138327396  
0.5679870702  
0.5166996294  
0.4666423384  
0.4249298767  
0.3979403567  
0.3902382591  
0.4037647899  
0.4374092203  
0.4870291006  
0.5459042002  
0.6055629672  
0.6568570567  
0.691132867  
0.7013405688  
0.6829339059  
0.6344538063  
0.5577263612  
0.4576767323  
0.3417941378  
0.2193358628  
0.1003821331  
-0.005143460446  
-0.08837104776  
-0.1422197409  
-0.1619109677  
-0.1452405389  
-0.09262109533  
-0.006925984251  
0.1068154491  
0.2418247483  
0.3900383257  
0.5425990764  
0.6903494172  
0.8243223892  
0.9362182928  
1.018866813  
1.066656503  
1.075919501  
1.045235256  
0.9756260551  
0.8706064352  
0.7360555684  
0.5799010238  
0.4116049052  
0.241483498  
0.07989823064  
-0.06361631386  
-0.1812089116  
-0.2674644328  
-0.3199734223  
-0.3396441313  
-0.3307116627  
-0.3004256563  
-0.2584304055  
-0.2158929858  
-0.1844513623  
-0.1750909729  
-0.1970583271  
-0.256920457  
-0.3578654672  
-0.4993142248  
-0.6768755393  
-0.8826513114  
-1.10585279  
-1.333672205  
-1.552323501  
-1.748164598  
-1.908804785  
-2.024111246  
-2.087043169  
-2.094246597  
-2.046379177  
-1.948127415  
-1.807919008  
-1.637332898  
-1.450241823  
-1.261731382  
-1.086866727  
-0.9393947533  
-0.8304859994  
-0.7676341229  
-0.7538248062  
-0.7870844804  
-0.8604904887  
-0.9626842336  
-1.078881941  
-1.192321548  
-1.28601445  
-1.344631739  
-1.356302264  
-1.314100442  
-1.217008126  
-1.070188866  
-0.8844916802  
-0.6752021826  
-0.4601606522  
-0.2574721495  
-0.08310473783  
0.05129883284  
0.1400826676  
0.1844650737  
0.1925085742  
0.1781604316  
0.1594854879  
0.1563201686  
0.1876742449  
0.2692178911  
0.4111899546  
0.6169904175  
0.8826219086  
1.197028361  
1.543259082  
1.900284045  
2.245212497  
2.555629156  
2.811769464  
2.998287679  
3.105448441  
3.129651376  
3.073288831  
2.944014887  
2.753571606  
2.516346237  
2.247846106  
1.963264759  
1.676273062  
1.39812484  
1.137117942  
0.8984070805  
0.6841294317  
0.4937841546  
0.3247964532  
0.1731913615  
0.03431834915  
-0.09643832757  
-0.2230156591  
-0.3481394742  
-0.4729504197  
-0.5968257402  
-0.7174181152  
-0.8309263125  
-0.9325753836  
-1.017266158  
-1.080319707  
-1.118219389  
-1.129245041  
-1.113892692  
-1.075000782  
-1.017534107  
-0.948037897  
-0.8738146704  
-0.8019406374  
-0.738259827  
-0.6865158113  
-0.6477632888  
-0.6201691396  
-0.5992491192  
-0.5785252111  
-0.5505187328  
-0.507934697  
-0.4448661757  
-0.3578359524  
-0.2465155078  
-0.1140144876  
0.0333064833  
0.186470606  
0.3348666457  
0.4674380987  
0.5739034184  
0.6458400395  
0.6774973562  
0.6662526413  
0.6126853347  
0.5203098711  
0.3950477655  
0.2445536124  
0.07750347093  
-0.09706261631  
-0.2702858741  
-0.433908738  
-0.5805856477  
-0.7041224878  
-0.7996806313  
-0.863970737  
-0.8954281647  
-0.8943446478  
-0.8629039683  
-0.8050734037  
-0.7263154086  
-0.6331224578  
-0.5324084633  
-0.4308376147  
-0.3341927222  
-0.2468871425  
-0.1717107841  
-0.1098501428  
-0.06118204398  
-0.02476584335  
0.000566175966  
0.01566007051  
0.02065767226  
0.01488006945  
-0.002985821208  
-0.03441865964  
-0.08040682196  
-0.1407383894  
-0.2134048628  
-0.2942650168  
-0.3770787389  
-0.4539543565  
-0.5161710982  
-0.5552580418  
-0.5641632853  
-0.5383058859  
-0.476323254  
-0.3803720601  
-0.2559143961  
-0.111020829  
0.04469676318  
0.2013347383  
0.3499091779  
0.4833174704  
0.5968894925  
0.6884460407  
0.757887526  
0.8064219689  
0.8356257255  
0.8465512774  
0.8391005896  
0.811815391  
0.7621573548  
0.6872364191  
0.5848553632  
0.454653986  
0.2991046709  
0.1241214613  
-0.06088780342  
-0.2436106153  
-0.4100160566  
-0.5459885478  
-0.6391648767  
-0.6806836831  
-0.6665608886  
-0.5984504553  
-0.4836529728  
-0.3343488743  
-0.1661563974  
0.003778346691  
0.1588805808  
0.2851373752  
0.3726957033  
0.4168640323  
0.4183968996  
0.3830576371  
0.3205579665  
0.2430492648  
0.1633998654  
0.09349702544  
0.0427974809  
0.01729524625  
0.01900765215  
0.04600599393  
0.09294089916  
0.1519584029  
0.2138626618  
0.2693591971  
0.3102268432  
0.3302806432  
0.3260261148  
0.296954544  
0.2454678257  
0.176466705  
0.09667621047  
0.01379753559  
-0.06440181576  
-0.1309591532  
-0.1804531283  
-0.209531865  
-0.217193763  
-0.2048028411  
-0.1758528001  
-0.1355179268  
-0.09004318745  
-0.04604272123  
-0.009773905352  
0.01354332222  
0.02029216847  
0.008859860241  
-0.02017464684  
-0.06408675218  
-0.118294104  
-0.1768585395  
-0.2331568409  
-0.2806430903  
-0.3136161922  
-0.3278891581  
-0.3212764734  
-0.2938267277  
-0.2477716191  
-0.1871930049  
-0.117466458  
-0.0445572351  
0.0257160905  
0.0883465973  
0.1396302687  
0.1774221948  
0.2011295361  
0.2114635845  
0.2100151915  
0.1987359547  
0.1794351053  
0.1533860267  
0.1211095901  
0.0823787964  
0.03642845384  
-0.01767080511  
-0.08055866783  
-0.1521430705  
-0.2312661892  
-0.3155483792  
-0.40145499  
-0.4845783088  
-0.5600998427  
-0.6233528395  
-0.6703940084  
-0.6984902143  
-0.7064377919  
-0.6946651386  
-0.66510371  
-0.6208525361  
-0.565693308  
-0.5035364538  
-0.4378852242  
-0.3714018061  
-0.305636949  
-0.2409629564  
-0.1767096908  
-0.1114833398  
-0.04360873284  
0.02836926194  
0.1052095253  
0.1865942712  
0.2709116588  
0.3552380011  
0.4355352596  
0.5070428629  
0.5648186636  
0.6043615307  
0.6222277816  
0.6165619425  
0.5874609346  
0.5371201525  
0.4697344489  
0.3911599339  
0.3083739397  
0.2287977997  
0.1595604226  
0.1067871422  
0.07499158339  
0.06663479467  
0.08188853159  
0.1186181293  
0.1725777158  
0.2377851183  
0.3070368619  
0.3725134236  
0.426422126  
0.4616354662  
0.4722813758  
0.4542526467  
0.4056097478  
0.326844848  
0.2209898802  
0.09354412526  
-0.04779532287  
-0.1936019418  
-0.3333848332  
-0.4564098004  
-0.5526331521  
-0.6136550551  
-0.6336099879  
-0.6098741605  
-0.5434999613  
-0.4392975273  
-0.3055180845  
-0.1531547976  
0.005088390478  
0.1560483337  
0.2874366142  
0.3890962778  
0.4540247645  
0.4790394292  
0.4649993369  
0.416555631  
0.3414676656  
0.2495680123  
0.1515183342  
0.05751041412  
-0.02392284592  
-0.08683199568  
-0.1284080403  
-0.1491066164  
-0.1523374865  
-0.1437762975  
-0.1304067728  
-0.1194291239  
-0.1171904685  
-0.1282865372  
-0.1549472868  
-0.1967835536  
-0.2509132109  
-0.3124320375  
-0.3751452781  
-0.4324429633  
-0.4781894804  
-0.5074977415  
-0.5172927739  
-0.5065972031  
-0.4765292093  
-0.430038311  
-0.3714490839  
-0.3059005798  
-0.2387776269  
-0.1752139586  
-0.1197225578  
-0.07597608774  
-0.04671930447  
-0.03377121409  
-0.03805313279  
-0.05958847354  
-0.09742723695  
-0.1494860392  
-0.21233782  
-0.2810133402  
-0.348918371  
-0.4079659003  
-0.449013053  
-0.4626443803  
-0.4402820648  
-0.3755199809  
-0.2655131505  
-0.1121990898  
0.07689719858  
0.2884939686  
0.5041721175  
0.7018324319  
0.8579057483  
0.950100268  
0.9603565368  
0.8776100751  
0.6999409632  
0.4357514534  
0.103713488  
-0.2686011706  
-0.6473134158  
-0.9957746592  
-1.27861042  
-1.465754656  
-1.535922506  
-1.479054631  
-1.297390801  
-1.005037818  
-0.6261071106  
-0.1917026973  
0.2637949472  
0.706626057  
1.107194996  
1.442812938  
1.699328964  
1.871525706  
1.96233783  
1.981115589  
1.941265677  
1.857658845  
1.74417704  
1.61172006  
1.466892567  
1.311484532  
1.142746001  
0.9543701967  
0.7380198945  
0.4851960265  
0.1892075675  
-0.1529861856  
-0.5393008658  
-0.9616059284  
-1.40551835  
-1.850990879  
-2.273684614  
-2.647033865  
-2.944788448  
-3.143753281  
-3.226380815  
-3.18286755  
-3.012453447  
-2.72371221  
-2.333758549  
-1.866449752  
-1.349807741  
-0.8130052074  
-0.2833267753  
0.2164784799  
0.6700926188  
1.068535712  
1.409990902  
1.698617207  
1.942581949  
2.15163882  
2.334642943  
2.497389846  
2.641094274  
2.761724833  
2.850260069  
2.893808689  
2.877403049  
2.786198542  
2.607767915  
2.334187303  
1.96365679  
1.501479269  
0.9602997271  
0.3596065877  
-0.2754375401  
-0.9156993282  
-1.53014925  
-2.088117265  
-2.561543098  
-2.927041438  
-3.167619363  
-3.273915885  
-3.244861954  
-3.087699181  
-2.817351336  
-2.455187233  
-2.027275521  
-1.562274184  
-1.089144235  
-0.634894564  
-0.2225632188  
0.1303708975  
0.4130073844  
0.6213878102  
0.7581859584  
0.8317850207  
0.8548536538  
0.84259705  
0.8108756358  
0.7744015312  
0.7452019486  
0.731502868  
0.73713915  
0.7615269815  
0.8001735  
0.8456406248  
0.888818987  
0.9203418051  
0.9319569729  
0.9176762696  
0.8745622093  
0.8030583622  
0.7068323328  
0.5921685645  
0.4670080526  
0.3397805563  
0.2182056045  
0.1082345417  
0.01328592617  
-0.06611843081  
-0.1322764908  
-0.1898045199  
-0.2448022584  
-0.3038127767  
-0.3727329924  
-0.4558347363  
-0.5550258355  
-0.6694412663  
-0.7954021508  
-0.9267235695  
-1.055309931  
-1.171948251  
-1.267187383  
-1.332212203  
-1.359623538  
-1.344070674  
-1.282703851  
-1.175435502  
-1.0250163  
-0.8369350648  
-0.6191520709  
-0.3816751183  
-0.1359888091  
0.1056539531  
0.3310418221  
0.5288800173  
0.689655644  
0.8064136  
0.8753504974  
0.8961406107  
0.871934022  
0.8090094847  
0.7160991536  
0.6034703189  
0.4818730099  
0.3614874517  
0.2510117392  
0.1569897484  
0.0834533284  
0.0318891062  
0.001502005965  
-0.01030806925  
-0.007343738091  
0.006011907812  
0.02535061904  
0.04666579441  
0.06662393662  
0.08268011463  
0.09306471483  
0.09668994491  
0.09302073762  
0.0819594437  
0.063778967  
0.03912266658  
0.009066632457  
-0.02476881994  
-0.06010003531  
-0.09389122859  
-0.1223460784  
-0.14101358  
-0.1450405513  
-0.129564678  
-0.09023273561  
-0.02379440013  
0.07129817119  
0.1943659489  
0.3421325368  
0.5085839363  
0.6850996249  
0.8608703568  
1.0235775  
1.1602784  
1.258412222  
1.306833333  
1.296776913  
1.22267712  
1.08278371  
0.8795399584  
0.6197129235  
0.3142702395  
-0.02199640687  
-0.3711018532  
-0.7127665171  
-1.025583481  
-1.288447107  
-1.482198924  
-1.591395923  
-1.606059578  
-1.52320816  
-1.347939277  
-1.093840475  
-0.7825379972  
-0.4422846155  
-0.1056086629  
0.1938056825  
0.4247031293  
0.5618775627  
0.5893503539  
0.5026354153  
0.3097037631  
0.03042859021  
-0.3055038026  
-0.6620105923  
-1.000928424  
-1.286662484  
-1.490517057  
-1.594093784  
-1.591260403  
-1.488406724  
-1.302952367  
-1.060344251  
-0.7900111004  
-0.5209031207  
-0.2773125432  
-0.07561736448  
0.07755492552  
0.1854848798  
0.2598415211  
0.3177760095  
0.3781276522  
0.4573932784  
0.5661439357  
0.7065053007  
0.871133623  
1.043889839  
1.202127882  
1.320256332  
1.37401486  
1.344792304  
1.223283244  
1.011879984  
0.7253764023  
0.3898129844  
0.03957382099  
-0.2868889736  
-0.5521179546  
-0.7247902161  
-0.7842009886  
-0.7234497175  
-0.5508527448  
-0.2893674925  
0.02593755983  
0.3520477526  
0.6432837811  
0.8570195442  
0.9591093652  
0.9283251304  
0.7592387352  
0.4631675065  
0.06704834814  
-0.3896375227  
-0.8595172269  
-1.292986405  
-1.644163148  
-1.876374008  
-1.966461459  
-1.907337929  
-1.708449325  
-1.394084829  
-0.9997810468  
-0.5673292603  
-0.1391165211  
0.2473836191  
0.5641724692  
0.7956930218  
0.9398040058  
1.006681178  
1.015884708  
0.9921218693  
0.9604267518  
0.9415607951  
0.9483777562  
0.9837345073  
1.040247633  
1.101901015  
1.147186978  
1.153227004  
1.100151331  
0.9749971005  
0.7744690693  
0.5061101965  
0.187711126  
-0.1549270944  
-0.4914817788  
-0.7912616486  
-1.027346023  
-1.180060376  
-1.239278063  
-1.205258273  
-1.087985744  
-0.9052232788  
-0.6796823817  
-0.4358211197  
-0.1967812273  
0.01809114419  
0.1948639745  
0.3256672648  
0.4084381622  
0.4459750825  
0.444584722  
0.412624584  
0.3592004434  
0.2931831975  
0.2226171403  
0.1544849813  
0.09472533872  
0.04836144191  
0.01960847766  
0.01185906211  
0.02750881039  
0.06764043465  
0.1316427384  
0.2168625646  
0.3183916844  
0.4290789882  
0.5398054772  
0.6400333132  
0.7185866834  
0.7646042674  
0.7685761769  
0.7233755983  
0.6252011458  
0.4743411662  
0.2756827152  
0.03888712354  
-0.2218313485  
-0.4883769376  
-0.7399162198  
-0.9544684065  
-1.110869973  
-1.190961833  
-1.18180099  
-1.077630962  
-0.8813395253  
-0.6051346115  
-0.2702326187  
0.09454976443  
0.4552720764  
0.776241326  
1.02394728  
1.171110989  
1.20032532  
1.106753161  
0.8994261398  
0.6008353933  
0.244720543  
-0.1277911796  
-0.4732792954  
-0.7517410993  
-0.9321448667  
-0.99702715  
-0.9454080606  
-0.7934980763  
-0.5729641124  
-0.3268642446  
-0.1037280993  
0.04944415355  
0.09426712414  
0.007084069177  
-0.216861744  
-0.5619137806  
-0.9934840727  
-1.462411526  
-1.911623847  
-2.284143089  
-2.531239458  
-2.619484605  
-2.53560682  
-2.288387271  
-1.907301109  
-1.438115596  
-0.9361555293  
-0.4582824915  
-0.05485624376  
0.2370941037  
0.3984748751  
0.4298617701  
0.3502039421  
0.1928203033  
-0.000576470402  
-0.1867919804  
-0.3278691227  
-0.396555641  
-0.3797151503  
-0.2792561016  
-0.1105687331  
0.1011196997  
0.3257401099  
0.5338176654  
0.7014046791  
0.8137140607  
0.866912217  
0.867887999  
0.8321549967  
0.7803701074  
0.7341621996  
0.7120354193  
0.7260753309  
0.7799884381  
0.8687628904  
0.9799228182  
1.096075858  
1.198243527  
1.269337645  
1.29716096  
1.27641869  
1.209426361  
1.10545678  
0.9789097498  
0.8466990494  
0.7253732347  
0.6285130507  
0.5648698115  
0.5375467789  
0.544315573  
0.5789306655  
0.6331146198  
0.6987618288  
0.7698745335  
0.8438045463  
0.9215204516  
1.006827218  
1.104677099  
1.218914124  
1.349919313  
1.492675721  
1.635710962  
1.761233898  
1.846562798  
1.866722486  
1.797839865  
1.620832302  
1.324786622  
0.9094697299  
0.3865393582  
-0.2207782089  
-0.8795248895  
-1.550113198  
-2.190254947  
-2.759172121  
-3.221529726  
-3.550615486  
-3.730422915  
-3.756495078  
-3.635546279  
-3.384047166  
-3.026043911  
-2.590541832  
-2.108760568  
-1.611535519  
-1.127073461  
-0.6791971102  
-0.2861576797  
0.03996215137  
0.293272178  
0.4735807957  
0.5854631023  
0.6370096368  
0.638402533  
0.6004753063  
0.5334305375  
0.4458686094  
0.3442474435  
0.2328256801  
0.1140820659  
-0.01048789667  
-0.1393621933  
-0.2699736563  
-0.3979114726  
-0.5165334024  
-0.6171210265  
-0.6896190346  
-0.7238834345  
-0.7112690732  
-0.6463006181  
-0.5281322111  
-0.3615038743  
-0.1569660185  
0.06975754037  
0.2992592543  
0.5106453287  
0.6841525675  
0.8038188023  
0.859786433  
0.8498642721  
0.7800536149  
0.6639046213  
0.5207510543  
0.3730540888  
0.2432474938  
0.1505697496  
0.1083859311  
0.1224265917  
0.1902242627  
0.3018230304  
0.4416148355  
