0.009605466412  
-0.5398865762  
-1.051803044  
-1.489732799  
-1.825846055  
-2.043865077  
-2.140534373  
-2.1254582  
-2.019360787  
-1.851071076  
-1.653664941  
-1.460315007  
-1.300399751  
-1.19636142  
-1.161671899  
-1.200077124  
-1.306106039  
-1.466640247  
-1.66322485  
-1.8747104  
-2.079845046  
-2.259471373  
-2.398122552  
-2.484920597  
-2.51382638  
-2.483361931  
-2.396007725  
-2.257450276  
-2.075839094  
-1.861140071  
-1.624600553  
-1.378281992  
-1.134589654  
-0.905716013  
-0.702954428  
-0.5358868127  
-0.4115069837  
-0.3333926469  
-0.3010749106  
-0.3097473925  
-0.3504263864  
-0.4106182086  
-0.4754631989  
-0.5292576246  
-0.5571712428  
-0.5469445414  
-0.4903406256  
-0.3841399605  
-0.2305433406  
-0.03691118644  
0.1851269484  
0.4210809069  
0.6553388311  
0.8730116175  
1.061643819  
1.212578456  
1.321807963  
1.390217996  
1.423206054  
1.429736636  
1.420965124  
1.408605117  
1.403253841  
1.41288171  
1.441675556  
1.489385337  
1.551249952  
1.618515612  
1.679490893  
1.720997789  
1.730049462  
1.695545706  
1.609775283  
1.469546725  
1.276806132  
1.038678895  
0.766928766  
0.4769123048  
0.1861505139  
-0.08731030933  
-0.3265617348  
-0.5173502235  
-0.6492850643  
-0.7166389274  
-0.7186733577  
-0.659485123  
-0.5474145981  
-0.3940961011  
-0.2132683929  
-0.01947173233  
0.1732283578  
0.3523580162  
0.5078951059  
0.6327870416  
0.7231099246  
0.7778763745  
0.7985624378  
0.78844803  
0.7518894938  
0.6936487966  
0.6183668363  
0.5302557519  
0.4330145226  
0.3299379368  
0.2241472167  
0.1188408556  
0.01747198083  
-0.07622261142  
-0.1583799287  
-0.2253397017  
-0.2740904375  
-0.3027329132  
-0.3108651494  
-0.2997838182  
-0.2724479627  
-0.2331815317  
-0.1871558224  
-0.139730468  
-0.09576705448  
-0.05903448609  
-0.03180627687  
-0.01472166845  
-0.006919516342  
-0.006417165959  
-0.01064562491  
-0.0170347838  
-0.0235348355  
-0.02897341951  
-0.03319396939  
-0.03696417636  
-0.04169361049  
-0.04904979788  
-0.06056443842  
-0.07733324398  
-0.09986889625  
-0.128127563  
-0.1616729869  
-0.1999020156  
-0.242225857  
-0.2881201363  
-0.3369761037  
-0.3877560931  
-0.4385154358  
-0.4859138979  
-0.5248707506  
-0.5485222936  
-0.5485969293  
-0.5162561333  
-0.4433525972  
-0.3239582738  
-0.1559411803  
0.05768352333  
0.307900486  
0.5795675836  
0.8521453044  
1.101295943  
1.301226207  
1.427518105  
1.460104533  
1.385985687  
1.201299664  
0.9124212869  
0.5358911238  
0.09711799282  
-0.3720163616  
-0.8363821749  
-1.261253518  
-1.615928426  
-1.876855418  
-2.029873134  
-2.071297937  
-2.007746178  
-1.854762736  
-1.634479914  
-1.372650024  
-1.09546848  
-0.8266068151  
-0.5848162054  
-0.3823731029  
-0.2244956544  
-0.1097269085  
-0.03115577693  
0.02177015915  
0.06112843521  
0.09842661762  
0.1428074296  
0.1997934018  
0.2706948649  
0.3527250922  
0.4397436179  
0.5234815316  
0.5950287816  
0.6463384379  
0.6715221222  
0.6677465346  
0.635614396  
0.5790048478  
0.5044236944  
0.4200078869  
0.3343486036  
0.2553452796  
0.1892567121  
0.140094514  
0.1094168044  
0.096526342  
0.0989955144  
0.1134036086  
0.1361389363  
0.1641217086  
0.1953245122  
0.2290110891  
0.2656603304  
0.3065923823  
0.3533696509  
0.4070641793  
0.4675217681  
0.5327491756  
0.598548328  
0.6584878678  
0.7042814448  
0.7265607367  
0.7160054218  
0.6646998054  
0.5675554406  
0.4235898444  
0.2368432913  
0.01674705172  
-0.2221984651  
-0.4614737806  
-0.6802583754  
-0.8576425757  
-0.9750595183  
-1.018607296  
-0.9809242425  
-0.8623097654  
-0.6709096219  
-0.4218921258  
-0.1357200958  
0.1642439144  
0.4544498891  
0.7137935463  
0.9257854649  
1.079962828  
1.172376509  
1.205154657  
1.185287508  
1.122906819  
1.029394325  
0.9156549021  
0.7908229142  
0.661567234  
0.5320216814  
0.4042448551  
0.2790141801  
0.1567175258  
0.03810490359  
-0.07526377878  
-0.1809646654  
-0.2760143722  
-0.3574205488  
-0.4227980497  
-0.4708680167  
-0.5016821131  
-0.5164997701  
-0.5173384434  
-0.5063052096  
-0.4848958923  
-0.4534580122  
-0.410998604  
-0.3554385353  
-0.284308344  
-0.1957739458  
-0.08978168925  
0.03094807172  
0.1603276745  
0.2889282557  
0.404699198  
0.4943499661  
0.5452027486  
0.5472245773  
0.4948881807  
0.3885182706  
0.2348469912  
0.04662844867  
-0.1586747363  
-0.3609755533  
-0.5401135523  
-0.6784992612  
-0.7634419579  
-0.7888208217  
-0.7558442469  
-0.6728022309  
-0.5538645587  
-0.4171305965  
-0.2822383755  
-0.1678851595  
-0.08961913196  
-0.05817413021  
-0.07853047789  
-0.1497469256  
-0.2654913139  
-0.4151091008  
-0.5849997223  
-0.7600853207  
-0.9251803249  
-1.066134973  
-1.170707347  
-1.229184131  
-1.234809157  
-1.184093001  
-1.077052514  
-0.9173968666  
-0.7126020824  
-0.4738067211  
-0.2154194031  
0.04564346521  
0.2911185452  
0.5029181368  
0.6648910641  
0.7646138097  
0.7949828237  
0.7553394059  
0.6519304982  
0.4975650291  
0.3104574069  
0.1123534847  
-0.07383705772  
-0.226605232  
-0.3282680112  
-0.3669327295  
-0.3377353445  
-0.2432039316  
-0.09271336931  
0.09887458054  
0.3131702669  
0.5305413357  
0.732405512  
0.9032338092  
1.032039591  
1.11319211  
1.146526649  
1.136798091  
1.092624928  
1.02511182  
0.9463701215  
0.8681286053  
0.8006054191  
0.7517369934  
0.7268096137  
0.7284720725  
0.7570537011  
0.8110857263  
0.8878988894  
0.9841831953  
1.096404556  
1.221020565  
1.35446789  
1.492945519  
1.632062137  
1.766440365  
1.889400085  
1.992823195  
2.06730879  
2.102656313  
2.088685136  
2.016316475  
1.87880238  
1.672929524  
1.400008309  
1.066469693  
0.6839255037  
0.2686193173  
-0.1597236118  
-0.5795516482  
-0.9694715481  
-1.31033326  
-1.587154318  
-1.790638984  
-1.918089888  
-1.973573387  
-1.967303981  
-1.914303847  
-1.83248332  
-1.740374655  
-1.654794807  
-1.588731616  
-1.549729898  
-1.53899894  
-1.55138056  
-1.57620044  
-1.598926253  
-1.60342954  
-1.574561066  
-1.50070223  
-1.375917678  
-1.201389735  
-0.9858821171  
-0.7451085199  
-0.5000345993  
-0.2742891117  
-0.09101471032  
0.03042100214  
0.07737548121  
0.04609235126  
-0.0572942075  
-0.2171131864  
-0.4098970554  
-0.6073139979  
-0.7799220855  
-0.9012340856  
-0.9515065301  
-0.9207022814  
-0.8101604149  
-0.6326991486  
-0.4110927607  
-0.1751056912  
0.04251926823  
0.2105655237  
0.3036999487  
0.3060657165  
0.2136061476  
0.03477884121  
-0.21041959  
-0.4929885408  
-0.7786426992  
-1.032197234  
-1.222010606  
-1.32388775  
-1.323934635  
-1.220020526  
-1.021707944  
-0.7487163796  
-0.4281972526  
-0.09122862037  
0.2309687529  
0.5105955264  
0.7261750476  
0.8644878989  
0.9213774241  
0.9014448112  
0.8167924156  
0.6850844449  
0.5272488929  
0.3651361947  
0.2194067341  
0.1078351197  
0.04410760083  
0.03713066175  
0.09077223831  
0.2039514278  
0.3709794452  
0.582088191  
0.8241090882  
1.081314715  
1.336429396  
1.571818453  
1.77082913  
1.919202228  
2.006425192  
2.026855939  
1.980444803  
1.8729011  
1.71522892  
1.522629082  
1.312888898  
1.104454776  
0.9144482228  
0.75689871  
0.6414393078  
0.5726176402  
0.5498941073  
0.5682629123  
0.6193684203  
0.692892645  
0.7780050637  
0.8646617525  
0.9446099123  
1.012023708  
1.063757044  
1.099269326  
1.120301454  
1.130382536  
1.134242228  
1.137170009  
1.14434565  
1.160156498  
1.187521858  
1.227270856  
1.277640454  
1.333996425  
1.388865979  
1.432367498  
1.453058113  
1.439164625  
1.380069673  
1.267864482  
1.098731749  
0.8739197479  
0.6001112644  
0.2890724903  
-0.04341653132  
-0.37923338  
-0.6999568279  
-0.9889917882  
-1.233459932  
-1.425574408  
-1.563306321  
-1.650259881  
-1.694799968  
-1.708594911  
-1.704822118  
-1.696311478  
-1.693913287  
-1.705296366  
-1.734328296  
-1.7810535  
-1.842211322  
-1.912155241  
-1.983969529  
-2.050597145  
-2.105797671  
-2.144823345  
-2.164756631  
-2.164532184  
-2.14470788  
-2.107087125  
-2.054301402  
-1.989427233  
-1.915699351  
-1.836318569  
-1.754336119  
-1.672564813  
-1.593469226  
-1.519009474  
-1.450430366  
-1.388033341  
-1.33098796  
-1.277245666  
-1.223634513  
-1.166161048  
-1.100516953  
-1.022746549  
-0.9299750535  
-0.8210713718  
-0.6971187141  
-0.5615693243  
-0.4200186274  
-0.2795809868  
-0.1479380216  
-0.03218671613  
0.06232502274  
0.1329657044  
0.180393627  
0.2085937444  
0.2243202477  
0.2359960325  
0.252226097  
0.280174403  
0.3240964691  
0.3843226402  
0.4569210013  
0.5341579934  
0.6057381869  
0.6606424479  
0.6892791113  
0.6855633663  
0.648546446  
0.5832673813  
0.5006276498  
0.4162564623  
0.3485127926  
0.3159266809  
0.3344961827  
0.4152867347  
0.5627337407  
0.7739367566  
1.039051454  
1.34270799  
1.666194738  
1.990025056  
2.296447134  
2.57148159  
2.80617382  
2.996901463  
3.144757754  
3.254202663  
3.331287767  
3.381825595  
3.409865512  
3.416733561  
3.400793707  
3.35791486  
3.282508549  
3.168900286  
3.012749715  
2.812256839  
2.568947742  
2.287935325  
1.977642258  
1.649076141  
1.314796164  
0.987740603  
0.6800751041  
0.4021838394  
0.1618943439  
-0.03603746841  
-0.1901623687  
-0.3023183895  
-0.3773720425  
-0.4227523477  
-0.4478066039  
-0.4630109218  
-0.4790795052  
-0.5060362275  
-0.5523133718  
-0.6239576492  
-0.7240254964  
-0.8522425218  
-1.004979976  
-1.175580158  
-1.355028972  
-1.532928146  
-1.698687739  
-1.84281589  
-1.958152411  
-2.040883576  
-2.091169837  
-2.113263581  
-2.115029263  
-2.106877786  
-2.100201481  
-2.105496856  
-2.130437289  
-2.178196348  
-2.246326205  
-2.326433301  
-2.404793046  
-2.463901401  
-2.484806568  
-2.449912177  
-2.345847769  
-2.165946661  
-1.911909484  
-1.594334538  
-1.231963338  
-0.8496939321  
-0.4756104384  
-0.1374590192  
0.140913585  
0.3426182919  
0.4598102872  
0.4944997985  
0.4579705186  
0.3689264775  
0.2506690842  
0.127755603  
0.02264926951  
-0.04713771738  
-0.07103414958  
-0.04627411002  
0.0223980574  
0.1240686023  
0.2437531831  
0.3648920672  
0.471836232  
0.5519606023  
0.5971352362  
0.6043983536  
0.5758192007  
0.5176670384  
0.4390801796  
0.3505037578  
0.2621493684  
0.1827048548  
0.1184498129  
0.07284883048  
0.0466056351  
0.03809948017  
0.04406579973  
0.06037894445  
0.0827967949  
0.1075567762  
0.1317672509  
0.1535703092  
0.1721102879  
0.1873443957  
0.1997801183  
0.2101791769  
0.2193055055  
0.2277319769  
0.2357470936  
0.2433463969  
0.2503179358  
0.2563924108  
0.2614384326  
0.2656671226  
0.2698045844  
0.2751953965  
0.2837951594  
0.2980251986  
0.3204867113  
0.3535458077  
0.3988473923  
0.4568275992  
0.5263173086  
0.6043349009  
0.6861340305  
0.765554808  
0.8356584187  
0.8895856951  
0.9215165955  
0.9275903877  
0.9066201575  
0.8604794399  
0.7940552322  
0.71475885  
0.6316336741  
0.5541873706  
0.4911111317  
0.4490855573  
0.4318543636  
0.439710381  
0.4694743737  
0.5149692435  
0.5679193038  
0.6191342728  
0.659804083  
0.6827224198  
0.6832678692  
0.6600261671  
0.6149820595  
0.5532810575  
0.482604723  
0.4122532753  
0.3520482128  
0.3111700645  
0.2970484423  
0.314402755  
0.3645119828  
0.4447852786  
0.5486772812  
0.6659813556  
0.7835081979  
0.886127679  
0.9581149176  
0.9847017737  
0.9536878418  
0.8569482901  
0.6916427739  
0.4609638674  
0.1742864413  
-0.1533498238  
-0.5024081023  
-0.850571379  
-1.174827022  
-1.453681262  
-1.669237464  
-1.808894431  
-1.86646196  
-1.842578469  
-1.744399028  
-1.584628284  
-1.380034742  
-1.149656648  
-0.9129150529  
-0.6878510266  
-0.4896641094  
-0.3296711838  
-0.2147501943  
-0.1472569289  
-0.1253623593  
-0.1437143658  
-0.194307967  
-0.2674499047  
-0.3527193417  
-0.4398347238  
-0.5193871612  
-0.5834039712  
-0.6257451771  
-0.6423353147  
-0.6312568432  
-0.592715167  
-0.5288933538  
-0.443705107  
-0.3424633249  
-0.2314584318  
-0.1174762919  
-0.007273406634  
0.09295887233  
0.1780892284  
0.2444594165  
0.2901623889  
0.3151488086  
0.3211415972  
0.3113603655  
0.2900824692  
0.2620925692  
0.232092214  
0.204147045  
0.1812454572  
0.1650338942  
0.1557587199  
0.1524259563  
0.1531430831  
0.1555878455  
0.1575252521  
0.1572808608  
0.1540921094  
0.1482765303  
0.1411816609  
0.1349307797  
0.1320008042  
0.134712664  
0.1447186866  
0.1625812065  
0.1875234081  
0.2173933848  
0.2488615136  
0.2778152149  
0.2998970375  
0.3110997971  
0.3083227346  
0.2898114523  
0.2554144585  
0.2066238904  
0.146402021  
0.07882748102  
0.008611591489  
-0.05943033583  
-0.1208920384  
-0.1721906379  
-0.2108453509  
-0.2355781107  
-0.2462484435  
-0.2436391055  
-0.2291502347  
-0.2044589623  
-0.1712198409  
-0.1308606412  
-0.08451433588  
-0.03309676512  
0.0224962145  
0.08112234953  
0.1411312126  
0.2001862325  
0.2552305172  
0.3026417915  
0.3385668091  
0.359407869  
0.362372591  
0.3460026025  
0.3105732253  
0.2582816702  
0.1931727605  
0.1207869262  
0.04757922118  
-0.0198269482  
-0.07542849392  
-0.1145687984  
-0.1344859161  
-0.1345973523  
-0.1164858036  
-0.08358200978  
-0.04060117326  
0.007186445391  
0.05472937671  
0.0978997512  
0.1340171904  
0.1621142287  
0.1829025369  
0.1984610898  
0.2116970068  
0.2256823315  
0.2429878605  
0.2651314045  
0.2922420344  
0.3229999913  
0.3548608634  
0.3845167438  
0.4085072481  
0.4238649676  
0.4286647389  
0.4223830013  
0.4059918532  
0.3817702203  
0.3528726179  
0.3227286958  
0.2943847774  
0.2699063865  
0.2499517101  
0.2335924217  
0.2184182093  
0.2009118984  
0.1770419769  
0.1429775087  
0.09581170895  
0.03418465709  
-0.04129844917  
-0.1279160299  
-0.2209819847  
-0.3142766711  
-0.4007082579  
-0.4731167199  
-0.5251110632  
-0.5518342841  
-0.5505563533  
-0.5210213124  
-0.4655082329  
-0.3886017604  
-0.2967036381  
-0.1973520687  
-0.09843134402  
-0.007368038657  
0.06959512122  
0.1279651663  
0.1653444081  
0.1815299524  
0.1783580941  
0.159324798  
0.1290388577  
0.09257721414  
0.05482850606  
0.01991810398  
-0.009215122102  
-0.03103089918  
-0.04535899654  
-0.05314454641  
-0.05601025863  
-0.05571851634  
-0.05362378124  
-0.05022970425  
-0.04493185091  
-0.03601483455  
-0.02091375613  
0.003281578404  
0.0391556319  
0.08824469548  
0.1503803113  
0.2232293367  
0.3021287895  
0.3802727697  
0.4492625965  
0.499964005  
0.523581655  
0.5128037905  
0.4628682191  
0.3723961843  
0.2438640291  
0.08363760466  
-0.09846147105  
-0.2900170357  
-0.4772140011  
-0.6462232608  
-0.7846168672  
-0.882635303  
-0.9341538176  
-0.9372431384  
-0.8942521866  
-0.8114227343  
-0.6980795521  
-0.5655133609  
-0.4256798215  
-0.2898801825  
-0.1675593158  
-0.06536665475  
0.01343352053  
0.06913530901  
0.105341344  
0.1283180285  
0.1460364522  
0.1670029777  
0.1990243173  
0.2480467922  
0.3172126676  
0.4062634154  
0.5113662301  
0.6254056269  
0.7387188321  
0.8401975309  
0.9186248871  
0.9640845754  
0.9692530085  
0.9304057116  
0.8479893263  
0.7266740853  
0.5748724869  
0.4037820648  
0.2260806539  
