31.39432943  
30.25357549  
32.09555038  
47.10541993  
161.7607965  
5737.102355  
1684.351721  
43537.42364  
27161.3606  
1584.04838  
8790.166544  
45130.52953  
7172.598078  
3863.641574  
323.9497272  
12903.36926  
9705.222613  
6707.872389  
7740.995579  
21350.61963  
11003.55519  
22112.56371  
3194.81073  
9571.54521  
11739.58052  
8598.356954  
9588.214067  
790.5305813  
24531.88867  
3393.537973  
13246.60207  
1509.520762  
13271.47438  
13503.28467  
18764.69074  
8636.482265  
17278.81713  
2398.781121  
483.8063514  
4877.968303  
4466.711968  
18685.60933  
9450.247312  
1896.462804  
8962.262957  
1042.093019  
7346.743353  
3801.260209  
2411.741277  
8939.807757  
6327.477057  
502.5441983  
1783.344415  
645.5266373  
470.4704091  
307.0869049  
1367.589485  
1386.560178  
795.0594473  
1666.312648  
336.1060969  
369.46366  
37.24703012  
15.12458386  
736.6745519  
335.8527074  
407.4336296  
331.4081814  
103.334903  
55.3741908  
12.82938202  
68.29611905  
66.42086413  
47.53461579  
2.255640304  
3.830246052  
10.61109799  
2.144955953  
8.374418057  
3.555213686  
1.735511893  
0.9976192192  
1.564388722  
2.106667436  
1.375104247  
2.174839856  
1.285580729  
1.885518489  
1.264155389  
1.495544276  
1.761993718  
1.57685475  
1.473040882  
1.230440087  
1.496401508  
1.503299422  
1.453181666  
1.377114867  
1.310694074  
1.426058399  
1.385613568  
1.343316332  
1.323140747  
1.310550694  
1.274438897  
1.281974795  
1.273493922  
1.226428752  
1.221307261  
1.201343396  
1.182574966  
1.175004541  
1.1571786  
1.141830327  
1.12782747  
1.113630607  
1.099334843  
1.081885488  
1.068702001  
1.057010045  
1.040317948  
1.023952716  
1.015179597  
1.003433272  
0.9879581433  
0.9736899518  
0.9618038235  
0.9495466655  
0.9380544461  
0.9267216947  
0.9145095956  
0.9030110065  
0.8921020635  
0.8810916531  
0.8699894988  
0.8593486912  
0.8487652833  
0.8384650009  
0.8284450041  
0.8185165984  
0.8088943431  
0.7991037517  
0.7899066593  
0.7807863648  
0.7716090802  
0.7626942822  
0.7539708513  
0.7454222712  
0.7369973416  
0.7287395169  
0.720559561  
0.7125170531  
0.7046560446  
0.6969320836  
0.6892522916  
0.6817365074  
0.6744238694  
0.6671683353  
0.6600755943  
0.6530676363  
0.6462190341  
0.639448142  
0.6327899702  
0.6262642292  
0.619840598  
0.6135126792  
0.6073026038  
0.6011774321  
0.5951545333  
0.5892444197  
0.5833842793  
0.5776777885  
0.5720195172  
0.5664812154  
0.5610109474  
0.5556173972  
0.5503390227  
0.5451211646  
0.5399993825  
0.5349479253  
0.52998031  
0.5250910447  
0.5202738538  
0.5155240501  
0.5108516611  
0.5062638324  
0.5017207661  
0.4972498033  
0.4928602855  
0.488534447  
0.4842606397  
0.4800386962  
0.4759278883  
0.4718388117  
0.4678290546  
0.4638511918  
0.4599462063  
0.4561136719  
0.4523058848  
0.4485925667  
0.4449121962  
0.4412763746  
0.4376977475  
0.4341687384  
0.4306972655  
0.4272658743  
0.4238925644  
0.4205451033  
0.4172697737  
0.414024389  
0.4108126329  
0.4076635393  
0.404579013  
0.4015130189  
0.3984725801  
0.3954882081  
0.3925588914  
0.3896499466  
0.3867897488  
0.3839462871  
0.3811716754  
0.3784199596  
0.3756910363  
0.3730272367  
0.3703768469  
0.3677792639  
0.3652032758  
0.3626554446  
0.3601446746  
0.3576637919  
0.3552314326  
0.3528305894  
0.3504250884  
0.3481019045  
0.3457684448  
0.3434792539  
0.3412234028  
0.3390015278  
0.3367740581  
0.3346087116  
0.3324520071  
0.3303273797  
0.3282343094  
0.3261541716  
0.3241172351  
0.322099093  
0.320090591  
0.3181451409  
0.3161815943  
0.314261659  
0.3123564254  
0.3104791344  
0.3086364065  
0.3067994488  
0.3049894002  
0.3032138883  
0.3014397177  
0.299697909  
0.2979715653  
0.2962629121  
0.2945797569  
0.2929214674  
0.2912727302  
0.2896529225  
0.2880411546  
0.2864646481  
0.2848985455  
0.2833294938  
0.281815894  
0.2803032245  
0.2787940181  
0.2773284477  
0.2758585896  
0.2744172646  
0.2729878818  
0.2715747723  
0.2701887247  
0.2687964226  
0.2674244716  
0.2660827291  
0.2647545204  
0.263431821  
0.2621335735  
0.2608300679  
0.2595695542  
0.2583029333  
0.2570566067  
0.2558321887  
0.2546043669  
0.2534124157  
0.2522139453  
0.2510482792  
0.2498820495  
0.248726186  
0.247581928  
0.2464553881  
0.2453420304  
0.2442439888  
0.2431578982  
0.2420739167  
0.2410078296  
0.2399591995  
0.2389180252  
0.2378767582  
0.2368547246  
0.2358563806  
0.234856059  
0.2338680102  
0.2328983942  
0.2319306276  
0.2309678423  
0.2300370174  
0.2291031846  
0.2281640366  
0.2272532636  
0.226358473  
0.2254651273  
0.2245757446  
0.2236975403  
0.2228380354  
0.2219826191  
0.2211359756  
0.2203079867  
0.2194712466  
0.2186464991  
0.2178488729  
0.2170336927  
0.2162533954  
0.2154581304  
0.2146787902  
0.2139194734  
0.2131707846  
0.2124160287  
0.2116660637  
0.2109251434  
0.2102036521  
0.2094834451  
0.2087690874  
0.2080700967  
0.2073810815  
0.20668273  
0.2059975695  
0.205334383  
0.2046686516  
0.2040011105  
0.2033493389  
0.202724023  
0.2020822007  
0.2014444303  
0.2008233902  
0.2002119714  
0.1996057809  
0.1989787301  
0.1983981658  
0.1978045574  
0.1972218329  
0.1966435387  
0.1960782699  
0.1955188072  
0.1949574542  
0.1944084307  
0.1938557346  
0.1933178811  
0.192782649  
0.1922636224  
0.1917359149  
0.1912274924  
0.1907043279  
0.1902067111  
0.1897134462  
0.1892227115  
0.1887445432  
0.1882596061  
0.187775576  
0.1873022058  
0.1868535197  
0.1863791231  
0.1859295463  
0.1854748554  
0.1850297029  
0.1845991107  
0.184171352  
0.1837407345  
0.1833124784  
0.1829093834  
0.1824899599  
0.1820856957  
0.1816823045  
0.1812778164  
0.1808872939  
0.180509271  
0.180115271  
0.1797484069  
0.1793733884  
0.179004776  
0.1786413769  
0.1782854956  
0.1779323513  
0.1775768569  
0.177238433  
0.1768989264  
0.1765592875  
0.1762175531  
0.1758974625  
0.1755772988  
0.1752450608  
0.1749428329  
0.1746333007  
0.1743318663  
0.1740211549  
0.1737329969  
0.1734382119  
0.1731484551  
0.172862422  
0.1725870666  
0.1723083583  
0.1720401897  
0.1717701671  
0.1715066455  
0.1712463033  
0.1709913361  
0.1707349187  
0.1704859104  
0.1702458765  
0.1700067604  
0.1697676172  
0.1695404169  
0.1693110646  
0.1690862142  
0.1688635813  
0.1686436754  
0.1684376664  
0.1682213703  
0.1680230776  
0.1678258587  
0.1676208084  
0.1674252731  
0.1672327808  
0.1670475452  
0.166855018  
0.1666850178  
0.1665088258  
0.1663275421  
0.1661646572  
0.1659971081  
0.1658348358  
0.1656706158  
0.1655262347  
0.1653798952  
0.1652184373  
0.1650769621  
0.164936983  
0.1648014704  
0.1646660867  
0.1645323306  
0.1644182648  
0.1642827001  
0.1641768337  
0.1640546352  
0.1639309183  
0.1638254297  
0.1637193972  
0.1636173503  
0.1635151737  
0.1634098747  
0.1633222725  
0.16323213  
0.1631398647  
0.1630669484  
0.1629887934  
0.1629214606  
0.1628330949  
0.1627641055  
0.1627040183  
0.1626356819  
0.1625697197  
0.162519522  
0.1624648466  
0.1624186069  
0.1623745594  
0.162318954  
0.162279679  
0.1622491503  
0.1622139385  
0.1621795864  
0.1621390181  
0.1621378806  
0.1621035844  
0.1620885329  
0.1620729943  
0.162063907  
0.1620501422  
0.1620502212  
0.16204163  
