1299.644679  
1392.150593  
1579.912276  
1964.720438  
3290.828331  
8650.536782  
950.8765516  
16500.77163  
6426.621839  
1676.493854  
9924.698472  
7428.538283  
10811.35119  
12854.24438  
11283.99867  
382.9721444  
19426.46224  
6199.497981  
16489.85613  
11882.57002  
27796.46596  
33461.95821  
17541.67949  
41214.17051  
12468.71841  
18196.09848  
23696.18709  
7493.689925  
3819.699219  
6346.870746  
843.8394421  
9880.371959  
5434.721256  
5386.514693  
4350.308439  
491.3893743  
14062.12818  
3056.352084  
5252.552958  
3862.991621  
7634.826503  
5563.760514  
4360.008872  
3137.957945  
9687.89291  
4946.380884  
1935.820442  
16687.78273  
7626.685285  
3419.309869  
443.6534481  
2391.46099  
1830.247466  
1676.676644  
721.2174236  
3362.975948  
2454.964796  
2522.267701  
3997.825644  
789.2377112  
255.3229055  
3158.304546  
831.841976  
673.5091743  
500.4087422  
667.6136082  
117.1251762  
320.023536  
34.25683268  
296.8774937  
2.937568175  
113.2832622  
8.193006565  
19.34929572  
13.19995331  
9.529956168  
20.46340616  
11.99072466  
14.5303019  
5.498536004  
13.93097411  
10.28423763  
12.8036952  
6.95984377  
9.245953337  
7.129205986  
6.912694391  
6.431401849  
6.337888592  
5.693032995  
5.375221902  
4.901112713  
4.590761317  
4.714166984  
4.173814976  
4.226487896  
3.649764315  
3.724248764  
3.400788122  
3.3290273  
3.190252599  
3.045683363  
2.887356505  
2.764484379  
2.656645597  
2.527065435  
2.453620799  
2.323971817  
2.25543502  
2.138867178  
2.073514762  
1.978013393  
1.917289747  
1.834920583  
1.771023038  
1.698981362  
1.642272599  
1.58407761  
1.528277837  
1.475913034  
1.42307983  
1.377451868  
1.329776558  
1.287217034  
1.244511948  
1.205437693  
1.166390243  
1.130163528  
1.094120274  
1.061616725  
1.029033767  
0.9982606069  
0.968585945  
0.9399919613  
0.9129391347  
0.8866103208  
0.8616355456  
0.8371870562  
0.814054409  
0.7915143215  
0.7701225084  
0.7493224365  
0.729365493  
0.7100661779  
0.6915644168  
0.673691433  
0.656437815  
0.6398208715  
0.6237353929  
0.6082485394  
0.5932829093  
0.5788353802  
0.5648513764  
0.5513795991  
0.5382816715  
0.5256554527  
0.5134524496  
0.5016406854  
0.4901901967  
0.4791199218  
0.4683764901  
0.4579876262  
0.4479318646  
0.4381467135  
0.4286898789  
0.4195216137  
0.4106215586  
0.4019986307  
0.393618021  
0.3854627132  
0.3775972145  
0.3699219026  
0.362478937  
0.3552484052  
0.3482194227  
0.341383371  
0.3347530788  
0.3282934253  
0.3220123523  
0.3159204601  
0.3099784694  
0.3041976346  
0.2985687059  
0.2931007725  
0.2877760516  
0.2825894796  
0.2775319717  
0.272606316  
0.2678146748  
0.26313541  
0.2585756966  
0.2541319312  
0.2498026406  
0.2455830625  
0.2414788957  
0.2374596637  
0.2335355038  
0.2297149482  
0.2259781119  
0.2223444442  
0.2187837856  
0.2153235979  
0.2119370587  
0.2086239189  
0.2053827812  
0.2022354122  
0.1991417172  
0.1961364228  
0.1931896393  
0.1903132808  
0.1874975658  
0.184736792  
0.1820613794  
0.1794269431  
0.1768527369  
0.1743400825  
0.1718700971  
0.1694532284  
0.1671036776  
0.1647982108  
0.1625299926  
0.1603226299  
0.1581613476  
0.1560499311  
0.1539727527  
0.1519362438  
0.1499447094  
0.1479964514  
0.1460907627  
0.144214292  
0.1423829331  
0.140580351  
0.1388196463  
0.1371050144  
0.1353994551  
0.1337447577  
0.132109286  
0.1305183572  
0.1289541878  
0.1274276784  
0.1259142257  
0.1244455985  
0.1229857469  
0.1215679606  
0.1201746352  
0.11879852  
0.1174558589  
0.1161408216  
0.1148523551  
0.1135835641  
0.112329785  
0.1111135142  
0.1098981974  
0.1087281873  
0.1075753869  
0.1064287826  
0.1053127688  
0.104204905  
0.1031267199  
0.1020745004  
0.1010288404  
0.1000050064  
0.09900096065  
0.09800772421  
0.09703498612  
0.0960857378  
0.09513509377  
0.09422153661  
0.09330543331  
0.09242043795  
0.09154585816  
0.09068599071  
0.08982702245  
0.08900050935  
0.08817224393  
0.08737212344  
0.08657103415  
0.08578986788  
0.08502898502  
0.0842717898  
0.08352523427  
0.08279062719  
0.08207196841  
0.08136157219  
0.08066583922  
0.07997583773  
0.07930471984  
0.07863942161  
0.07798692386  
0.07734403003  
0.07670868187  
0.07607964135  
0.07546349814  
0.07486039968  
0.07426557504  
0.0736722969  
0.07309622634  
0.07253419488  
0.07196738471  
0.07142057814  
0.07087630007  
0.07033646832  
0.06980599344  
0.06929231091  
0.06877352919  
0.06826662093  
0.06777322518  
0.06727979864  
0.06680425474  
0.06632952674  
0.06585708849  
0.06539389783  
0.06493995081  
0.06449605321  
0.06405118078  
0.06361498528  
0.06318264744  
0.06276131773  
0.06234517056  
0.06193881321  
0.061529077  
0.06112844055  
0.06073376672  
0.06034233325  
0.05996389723  
0.05958674037  
0.05921260468  
0.05884844162  
0.05848579479  
0.05812974709  
0.05778023512  
0.0574330456  
0.05709025911  
0.05674727398  
0.05641617291  
0.05609001654  
0.05576776387  
0.05544416651  
0.05513318275  
0.05482307062  
0.05451442562  
0.05421584188  
0.05391934221  
0.05362626987  
0.05333493494  
0.0530511777  
0.05276746413  
0.0524924586  
0.05221419848  
0.05194767661  
0.05168066792  
0.0514143429  
0.05115766779  
0.05090023397  
0.05064825181  
0.05040643468  
0.05015731763  
0.04991749084  
0.04966869759  
0.04943732052  
0.04920999225  
0.04897274365  
0.04875177976  
0.04852833931  
0.04830834573  
0.04809128352  
0.04787360641  
0.04766213601  
0.04745386965  
0.04724739106  
0.04704457315  
0.04684740594  
0.04664839374  
0.04645207754  
0.04626314786  
0.04607479101  
0.04588851317  
0.04570328107  
0.04552341937  
0.04534263142  
0.04516741656  
0.04499539602  
0.04481924682  
0.0446544877  
0.04448414772  
0.04432744854  
0.04415586722  
0.04400102949  
0.0438442142  
0.0436853069  
0.04352985509  
0.04337906485  
0.04323297745  
0.04308230898  
0.04294558289  
0.04279780178  
0.04265473204  
0.04251546452  
0.04237991719  
0.04224647068  
0.04211121144  
0.04198435829  
0.04185197659  
0.04172585765  
0.04160379858  
0.04148062117  
0.04135811621  
0.04124107705  
0.04112674649  
0.04100370439  
0.0408929029  
0.04078321034  
0.04067064398  
0.04056321673  
0.04045573946  
0.04035186871  
0.04024878779  
0.0401429578  
0.04004592145  
0.03994724517  
0.03985011492  
0.03975446242  
0.03965632373  
0.03956546865  
0.03947850918  
0.03939019461  
0.03930183403  
0.03921543828  
0.03913160617  
0.03904639022  
0.03896619379  
0.03889136619  
0.03881169536  
0.03873099684  
0.03865724316  
0.03858696115  
0.03851072666  
0.03843618333  
0.03837539831  
0.03830589503  
0.03823854885  
0.03817106198  
0.03810876217  
0.03804490256  
0.03798669959  
0.03792198177  
0.03786353316  
0.03780601395  
0.03775062429  
0.03769647385  
0.03764267137  
0.03758986918  
0.03754533447  
0.03749194678  
0.03744577921  
0.03739801226  
0.03735205534  
0.03730972936  
0.03726556583  
0.03722460309  
0.03718484217  
0.037147207  
0.03710940003  
0.03707028476  
0.03703521926  
0.03700211184  
0.03697434078  
0.03693167598  
0.0369058023  
0.03687849417  
0.03684935336  
0.03682413193  
0.03679666049  
0.03677226131  
0.03674657231  
0.03672756475  
0.03670901606  
0.03669141088  
0.0366720981  
0.03665353784  
0.03664001139  
0.03662156499  
0.03661023138  
0.03659745827  
0.03658311429  
0.03657795398  
0.03656336683  
0.0365554075  
0.03654935847  
0.03654716952  
0.03654276812  
0.03653901834  
0.03653744294  
0.03653710255  
