3339.22479  
3473.928142  
3774.590204  
4459.059198  
5016.066371  
2172.147465  
16179.33703  
27130.80031  
123437.2237  
54290.74884  
22087.33729  
30425.07077  
4614.630562  
15172.04678  
2518.110989  
2520.916794  
3608.618557  
5157.513101  
1424.236363  
9902.564814  
12263.7388  
1625.023404  
3835.158483  
25543.50173  
21795.32315  
2653.620483  
84.09676939  
11592.40272  
933.4141118  
284.0342636  
1627.353265  
4655.608068  
3155.576746  
7955.754534  
515.6548402  
4492.443297  
15521.18617  
188.2643474  
1070.077098  
235.1497236  
1348.896751  
1045.631336  
1108.414693  
532.8170746  
4777.406061  
101.5517612  
1900.911251  
920.280029  
645.6222009  
3235.345416  
271.4855727  
256.6586335  
588.9672898  
1363.219746  
1478.2354  
181.8803581  
2126.870124  
622.9242724  
428.3882704  
370.1612447  
44.81330537  
624.491  
625.3009031  
272.1065032  
71.9958739  
383.3208608  
5.534736823  
177.6841277  
167.3335956  
164.6059249  
69.45858001  
46.09542302  
46.03022651  
53.20661245  
74.90847342  
50.57277116  
38.77059243  
46.33494894  
32.18123153  
30.15187003  
25.94994373  
21.02677932  
20.22336583  
20.23862691  
19.1531451  
16.98757586  
16.05481319  
15.09944948  
15.08066424  
14.4066254  
12.94430545  
12.67649333  
11.67266036  
11.29210275  
10.73499776  
10.11730848  
9.579881491  
9.24218695  
8.731372638  
8.25975802  
7.922060154  
7.520091753  
7.217932447  
6.856014901  
6.553435316  
6.261869096  
5.972975032  
5.711692678  
5.482902863  
5.254777466  
5.029924078  
4.825561743  
4.632810519  
4.450919128  
4.272877968  
4.103511511  
3.947731243  
3.794833035  
3.654723194  
3.517305597  
3.386628318  
3.261530307  
3.14387906  
3.031040509  
2.92310523  
2.819493587  
2.721145015  
2.627487143  
2.536579024  
2.450403125  
2.368116408  
2.288815065  
2.213165225  
2.140718011  
2.071042636  
2.004134314  
1.940068852  
1.878588658  
1.819442656  
1.762587745  
1.70797424  
1.655477658  
1.604911506  
1.556294876  
1.509584972  
1.464579463  
1.421208735  
1.379398915  
1.339164847  
1.300341152  
1.262967564  
1.226869809  
1.192093495  
1.158488427  
1.126097256  
1.094781119  
1.064564246  
1.035366494  
1.007151424  
0.9798811913  
0.953527942  
0.9280582594  
0.9034061541  
0.8795690055  
0.8564904228  
0.8341647867  
0.8125630317  
0.7916366816  
0.7713631091  
0.7517288203  
0.7327084803  
0.7142906798  
0.6964183025  
0.6791002754  
0.6623155899  
0.646027842  
0.6302310898  
0.614900428  
0.6000530667  
0.5856005828  
0.571592456  
0.5579911786  
0.5447764098  
0.5319580534  
0.5194973733  
0.5073966548  
0.4956278854  
0.4842041187  
0.4730987225  
0.4622926895  
0.4517808165  
0.441559982  
0.4316302783  
0.4219630587  
0.4125609159  
0.4034146724  
0.394502322  
0.3858334569  
0.3773942592  
0.3691741643  
0.3611763668  
0.3533885688  
0.3457961638  
0.3384110068  
0.3311994662  
0.3241781126  
0.317343526  
0.3106754097  
0.3041749277  
0.2978408551  
0.2916550236  
0.2856338751  
0.2797522187  
0.2740227116  
0.2684340507  
0.2629790239  
0.2576569458  
0.2524600693  
0.2473970708  
0.2424398705  
0.2376138774  
0.2329023727  
0.2282930699  
0.2237959381  
0.2194073639  
0.2151158299  
0.2109224496  
0.2068275033  
0.2028335536  
0.1989261507  
0.1951040039  
0.1913721783  
0.1877224688  
0.1841627481  
0.1806718372  
0.1772652311  
0.1739337641  
0.1706727291  
0.1674864555  
0.1643751052  
0.1613219279  
0.1583385111  
0.1554230653  
0.1525654873  
0.1497731994  
0.1470366987  
0.1443662814  
0.1417442039  
0.1391773886  
0.1366709717  
0.1342191209  
0.1318099667  
0.129453338  
0.1271512099  
0.1248945318  
0.1226752783  
0.1205146731  
0.1183875602  
0.1163172565  
0.1142765487  
0.1122811562  
0.1103281481  
0.1084098583  
0.1065361239  
0.10468809  
0.102892804  
0.1011254724  
0.09938913265  
0.09769446956  
0.09602670521  
0.09439188286  
0.09279531864  
0.09121943183  
0.08968226505  
0.08817139217  
0.08669065931  
0.08524171855  
0.0838180865  
0.08241674596  
0.08104597189  
0.07970295547  
0.07838479641  
0.07708773644  
0.07581685519  
0.07457526678  
0.07334601023  
0.07214584411  
0.07096708319  
0.06981147466  
0.06867615872  
0.06756259006  
0.06646677435  
0.06539159986  
0.06433715981  
0.06330211655  
0.0622844175  
0.06128530976  
0.06030191759  
0.05934257865  
0.05839693658  
0.05746718619  
0.05655609939  
0.05565624627  
0.05477771697  
0.05391034193  
0.05306568636  
0.05222973141  
0.05140585937  
0.05060168638  
0.04981029785  
0.04903135248  
0.04826752137  
0.0475150923  
0.04677848215  
0.0460539116  
0.04533751907  
0.04464012605  
0.04394807155  
0.04327180499  
0.04260510722  
0.04195132908  
0.04130775449  
0.0406719973  
0.04005460849  
0.03944355787  
0.0388423701  
0.03825049769  
0.03766712268  
0.0370959664  
0.0365336136  
0.03598173714  
0.03543903231  
0.03490289108  
0.0343803971  
0.03386421947  
0.03335380081  
0.03285710808  
0.03236054518  
0.03187613518  
0.0314008698  
0.03093333149  
0.0304750488  
0.03002337458  
0.02957776913  
0.02913810606  
0.02870602023  
0.02828096936  
0.02786480261  
0.02745338535  
0.02705001127  
0.02665516475  
0.02626202876  
0.02587763041  
0.02549758553  
0.02512647853  
0.02476127021  
0.02439748336  
0.02404367363  
0.02369425789  
0.02335057643  
0.02301291833  
0.02268085043  
0.0223512817  
0.02202965765  
0.02171454083  
0.02140046316  
0.02109383868  
0.02079183199  
0.02049661661  
0.02020239672  
0.01991664922  
0.01963112895  
0.01935123247  
0.0190761425  
0.01880825401  
0.01854197327  
0.0182814825  
0.0180226351  
0.01777199125  
0.01752029391  
0.01727524357  
0.01703695484  
0.0167976822  
0.01656530645  
0.01633482749  
0.01610848768  
0.01588511648  
0.01566864528  
0.01545198662  
0.01524120409  
0.01503288641  
0.01482650325  
0.01462430538  
0.0144261085  
0.01423055286  
0.0140379001  
0.01385060392  
0.01366312506  
0.01348167787  
0.01330146586  
0.01312488842  
0.0129532671  
0.01278199805  
0.01261167732  
0.01244717499  
0.01228415138  
0.01212612892  
0.01196945505  
0.01181389036  
0.0116625827  
0.01151142523  
0.01136675054  
0.01122367051  
0.01108111327  
0.01094255855  
0.01080639629  
0.01067122377  
0.01054053487  
0.01041120515  
0.0102846281  
0.01016057069  
0.01003471768  
0.009917124343  
0.009798997648  
0.009682651914  
0.009569059707  
0.009457235407  
0.009349430916  
0.009242312487  
0.009137565345  
0.009033157672  
0.008932557032  
0.008833298233  
0.008736222177  
0.008638812666  
0.008548502592  
0.008457524588  
0.008367182643  
0.008280718748  
0.008194011887  
0.008111553026  
0.008029386109  
0.007949894485  
0.007872574762  
0.007795130564  
0.00772018393  
0.007648005868  
0.007577363185  
0.007508284736  
0.007439342226  
0.007374084242  
0.007309120218  
0.007247703859  
0.007186339752  
0.007128003159  
0.007069448937  
0.007013521762  
0.00695938916  
0.00690789129  
0.006855292539  
0.006805740774  
0.006759631134  
0.006711263379  
0.006666965697  
0.006623256527  
0.006582650539  
0.006541943215  
0.006504185568  
0.006466622718  
0.00642990752  
0.00639624967  
0.006364477201  
0.006332502125  
0.006303296258  
0.006274817815  
0.0062476999  
0.006224595007  
0.006199269483  
0.006178840434  
0.006157282418  
0.006136889665  
0.006119358517  
0.00610272896  
0.006087613965  
0.006074543333  
0.006061402931  
0.006051843377  
0.006043073498  
0.006034409616  
0.006028178317  
0.006022751082  
0.006018765175  
0.006017817957  
0.006015253802  
