-0.3442445447  
0.0206771385  
0.363491873  
0.6667273186  
0.9172938281  
1.10765498  
1.236192828  
1.306750056  
1.327430678  
1.308890461  
1.26239132  
1.19795834  
1.12292617  
1.041112095  
0.9527260027  
0.8550105651  
0.7434710884  
0.613458887  
0.4618024261  
0.2881810955  
0.09597827023  
-0.1075541191  
-0.3118826218  
-0.5044262959  
-0.6722582199  
-0.8039835301  
-0.8914731017  
-0.9311568694  
-0.9246406701  
-0.8785301547  
-0.8034662915  
-0.7125099697  
-0.619120064  
-0.5350441095  
-0.4684499299  
-0.4226062033  
-0.3953161383  
-0.3792278994  
-0.3629669934  
-0.3329416369  
-0.2755501674  
-0.17945801  
-0.03760062911  
0.1513904735  
0.3825511374  
0.6448278478  
0.9221679354  
1.195288191  
1.443858742  
1.6488047  
1.794394203  
1.86986379  
1.870393315  
1.797338743  
1.657770982  
1.463429547  
1.229272947  
0.9718573739  
0.707740756  
0.452095196  
0.2176531494  
0.0140400047  
-0.1525045414  
-0.2790632384  
-0.365722397  
-0.41508711  
-0.4317166522  
-0.4215405625  
-0.3913070939  
-0.348069301  
-0.2987148853  
-0.2495362144  
-0.2058296164  
-0.1715451819  
-0.1490069171  
-0.1387288809  
-0.1393898833  
-0.1479696262  
-0.1600841755  
-0.1704950625  
-0.1737563418  
-0.1649298693  
-0.1402808262  
-0.09785304367  
-0.03785258399  
0.03723910838  
0.1228340402  
0.2126835193  
0.2995413058  
0.3759594033  
0.4351048619  
0.4714887097  
0.4815225222  
0.4638162296  
0.419212064  
0.3505501872  
0.2622252408  
0.1596047354  
0.04839922477  
-0.06593024086  
-0.1786573136  
-0.2861131388  
-0.3858349615  
-0.4765373365  
-0.557946479  
-0.630528083  
-0.6951765814  
-0.7528946932  
-0.8045235  
-0.8505390688  
-0.890940843  
-0.9252343759  
-0.9524992103  
-0.9715355167  
-0.9810577181  
-0.9799203126  
-0.9673406404  
-0.9430877806  
-0.9076155212  
-0.86211169  
-0.8084468384  
-0.7490249251  
-0.6865450663  
-0.6237020215  
-0.562860118  
-0.5057661105  
-0.453338504  
-0.405579755  
-0.3616477338  
-0.3200714839  
-0.27910065  
-0.2371167479  
-0.1930422524  
-0.1466599085  
-0.09876883128  
-0.05112550061  
-0.006162340164  
0.03349970098  
0.06565128202  
0.08912425337  
0.1043003375  
0.1134052866  
0.1204748049  
0.1309671644  
0.1510291512  
0.1865041364  
0.2418210595  
0.3189527847  
0.4166142634  
0.5298851966  
0.6503632423  
0.7668883005  
0.8667668918  
0.9373762209  
0.9679017074  
0.950969266  
0.8839046865  
0.7693987755  
0.6154548847  
0.434584082  
0.2423425891  
0.05540958227  
-0.1105278426  
-0.2427588168  
-0.3331261973  
-0.3789510606  
-0.3831807776  
-0.3537401035  
-0.3022022867  
-0.2419910789  
-0.186384397  
-0.1466310171  
-0.1304496002  
-0.1411145423  
-0.1772396856  
-0.2332572316  
-0.3004817275  
-0.3685717454  
-0.4271464292  
-0.4673144354  
-0.4828848587  
-0.4711058357  
-0.4328597853  
-0.3723127891  
-0.2961086096  
-0.2122663501  
-0.1289526702  
-0.053320959  
0.00941268744  
0.05653946893  
0.08801989608  
0.1062275735  
0.1153499643  
0.1205537219  
0.1270601245  
0.139269647  
0.1600823559  
0.1904981617  
0.2295619627  
0.2746237812  
0.3218786631  
0.3670611433  
0.406190263  
0.4362199837  
0.455500609  
0.4639777155  
0.4631000168  
0.4554814866  
0.4443606407  
0.4329980869  
0.4240870481  
0.4193084248  
0.4190859629  
0.4225869552  
0.4279492847  
0.4326812398  
0.4341463646  
0.4300544935  
0.4188500128  
0.3999488491  
0.3737947521  
0.3417348589  
0.3057643761  
0.2681947785  
0.2313216676  
0.1971420896  
0.1671756796  
0.1423996473  
0.1232916506  
0.1099569316  
0.1022932367  
0.100151191  
0.1034462376  
0.1121927615  
0.1264493754  
0.1461723249  
0.171013286  
0.2000843483  
0.231750963  
0.2635022246  
0.2919395854  
0.3129297674  
0.3219281938  
0.3144552707  
0.2866856059  
0.2360756336  
0.1619369502  
0.06585320221  
-0.04813742077  
-0.173666552  
-0.3024831681  
-0.425197213  
-0.5322488851  
-0.6149861112  
-0.6667089834  
-0.6835393447  
-0.664984884  
-0.6141085228  
-0.53726471  
-0.4434240851  
-0.3431701064  
-0.247492447  
-0.1665443869  
-0.1085264511  
-0.07885993732  
-0.07975012893  
-0.1102132049  
-0.1665400479  
-0.2431221925  
-0.3335120108  
-0.4315286696  
-0.5322250313  
-0.6325582595  
-0.7316284407  
-0.8304536013  
-0.93130326  
-1.036709599  
-1.14833278  
-1.265898291  
-1.386414058  
-1.503847963  
-1.609365424  
-1.692151855  
-1.740720175  
-1.744531325  
-1.695687809  
-1.590435232  
-1.430214763  
-1.222081516  
-0.9783799281  
-0.7156872927  
-0.4531404511  
-0.2103494096  
-0.005181877319  
0.1482983669  
0.2414589756  
0.2720923686  
0.2446456648  
0.1696806585  
0.06263865709  
-0.05791552824  
-0.172364646  
-0.2621776406  
-0.3118836885  
-0.3106899998  
-0.2535828753  
-0.1418189146  
0.01722621543  
0.2108352511  
0.4222691781  
0.6325158482  
0.8222913895  
0.9741035738  
1.074157165  
1.11389684  
1.090996473  
1.009669157  
0.8802353099  
0.7179828661  
0.5414399739  
0.3702574341  
0.2229649415  
0.1148777297  
0.05641156589  
0.05203152547  
0.09994326072  
0.1925655473  
0.3177061345  
0.4602641485  
0.6042294124  
0.7347136803  
0.8397367072  
0.911558551  
0.9473928241  
0.949439882  
0.9242593923  
0.8816075732  
0.8329052906  
0.7895674763  
0.7614123823  
0.7553623143  
0.7745805117  
0.8181464733  
0.8812600067  
0.9559450847  
1.032116738  
1.098877038  
1.14586808  
1.164521546  
1.149079231  
1.097267723  
1.010582203  
0.8941522413  
0.756217937  
0.6072710002  
0.4589519231  
0.3228122989  
0.2090709785  
0.1254969014  
0.07653718599  
0.06280505024  
0.0809951064  
0.1242466406  
0.1829444745  
0.2458520535  
0.3014598571  
0.3393723771  
0.3515456327  
0.3332117726  
0.2833528994  
0.2046501535  
0.1029254285  
-0.01384332383  
-0.1367831701  
-0.2574641323  
-0.3691025026  
-0.4674503788  
-0.5512391187  
-0.6221188577  
-0.6841163978  
-0.7427221737  
-0.8037596998  
-0.8722304108  
-0.9513273133  
-1.041768908  
-1.14155737  
-1.246187862  
-1.349267783  
-1.443439427  
-1.521452206  
-1.577227156  
-1.606747669  
-1.608653581  
-1.584460129  
-1.538386284  
-1.476819342  
-1.407506101  
-1.338579122  
-1.277546902  
-1.230374996  
-1.200757714  
-1.189665884  
-1.19519909  
-1.212756306  
-1.235489979  
-1.254984527  
-1.262095841  
-1.247858109  
-1.204390893  
-1.125717306  
-1.008439724  
-0.8521978724  
-0.6598825361  
-0.4375639417  
-0.1941273659  
0.05937273465  
0.3105980083  
0.546971852  
0.7568091089  
0.9303839939  
1.060840026  
1.144818006  
1.182719086  
1.178569141  
1.139492524  
1.074843568  
0.995119479  
0.910758026  
0.8309905115  
0.7628643921  
0.7105526691  
0.6750244407  
0.6541055348  
0.642915156  
0.6346245549  
0.6214365528  
0.5956866121  
0.5509126215  
0.4827757651  
0.3897074325  
0.2731938594  
0.1376547202  
-0.01008823734  
-0.1616762876  
-0.3083223889  
-0.4419866096  
-0.5564645049  
-0.6482066979  
-0.7167323927  
-0.7645577399  
-0.7966150174  
-0.81923451  
-0.8388319652  
-0.8604919894  
-0.8866804403  
-0.9163114141  
-0.9443527156  
-0.9620834266  
-0.9580182552  
-0.9194062548  
-0.8341192293  
-0.6926567243  
-0.489966078  
-0.2267892124  
0.08970270967  
0.4461183169  
0.8239031125  
1.201121681  
1.554729827  
1.863022722  
2.107930612  
2.276856507  
2.363830473  
2.369861174  
2.302483979  
2.174616299  
2.002900459  
1.805779095  
1.601533599  
1.40651154  
1.233708898  
1.091802043  
0.9846962362  
0.9115542863  
0.8672746461  
0.8433273085  
0.8288557103  
0.8119472585  
0.7809589933  
0.7258011982  
0.6390711907  
0.5169464121  
0.3597439285  
0.172081467  
-0.03738411326  
-0.2566543973  
-0.471455228  
-0.6665910157  
-0.8274426619  
-0.9414630382  
-0.9995088342  
-0.9968555704  
-0.9337928652  
-0.8157336237  
-0.6528232341  
-0.4591050208  
-0.2513188055  
-0.04747651149  
0.1346551468  
0.2790017282  
0.3724420005  
0.405755904  
0.3742153666  
0.2777615514  
0.1208054926  
-0.08832047844  
-0.3381704372  
-0.615168913  
-0.9046648408  
-1.191978092  
-1.463347428  
-1.70673355  
-1.91243754  
-2.07351767  
-2.186006533  
-2.248915238  
-2.264066458  
-2.235746173  
-2.170223017  
-2.075156976  
-1.958953423  
-1.830105324  
-1.696586312  
-1.565333061  
-1.441867198  
-1.330071784  
-1.232126106  
-1.148592446  
-1.078606911  
-1.020165397  
-0.9704355199  
-0.9260928324  
-0.8836321643  
-0.8396615315  
-0.7911477407  
-0.7356327645  
-0.6713883011  
-0.5975208555  
-0.5139918929  
-0.4215607  
-0.3216286102  
-0.2159892754  
-0.1065126976  
0.00521156473  
0.1182133278  
0.2324113472  
0.3487483631  
0.4691517475  
0.5962966936  
0.7331801998  
0.8825413458  
1.046203246  
1.224422818  
1.41534668  
1.614669413  
1.815573173  
2.008980078  
2.184136004  
2.329482549  
2.433736987  
2.487077469  
2.482292569  
2.415760533  
2.288117905  
2.104522173  
1.874437435  
1.61092785  
1.329523299  
1.04675283  
0.7785188266  
0.5385041446  
0.3368154095  
0.1790482438  
0.06590221305  
-0.006589022275  
-0.04624598966  
-0.06345495452  
-0.06957486085  
-0.07527520579  
-0.08901637642  
-0.1158996131  
-0.1570203377  
-0.2094157797  
-0.2666045584  
-0.3196241066  
-0.3584246201  
-0.3734310959  
-0.3570637071  
-0.3050168644  
-0.2171425529  
-0.09781399398  
0.04427685238  
0.1969055945  
0.345588911  
0.4752581809  
0.5721376118  
0.6256282086  
0.6299634985  
0.5854023609  
0.4987453301  
0.3830165333  
0.256247446  
0.1393932348  
0.0535600731  
0.01684492479  
0.04119046915  
0.1297222737  
0.2750369648  
0.4588204402  
0.6530359592  
0.8226970046  
0.9300093177  
0.9394205149  
0.8229261713  
0.5648693051  
0.1654788252  
-0.3574989378  
-0.969464752  
-1.622015393  
-2.258094416  
-2.818630202  
-3.249789578  
-3.509834077  
-3.574590746  
-3.440720205  
-3.1262788  
-2.668450896  
-2.118766802  
-1.536480134  
-0.981052169  
-0.5048198859  
-0.1468710033  
0.07105834399  
0.1461561982  
0.09348326883  
-0.05742505185  
-0.2676808292  
-0.4950598143  
-0.6999964113  
-0.8507083939  
-0.926781067  
-0.9208292421  
-0.8381347882  
-0.6944969123  
-0.5127391904  
-0.3185043802  
-0.1360164062  
0.01555520027  
0.1246304725  
0.1883511282  
0.2122337788  
0.2085163343  
0.1935195594  
0.1845131776  
0.1965976494  
0.2400944343  
0.3188227693  
0.4294983933  
0.5622953195  
0.7024418672  
0.8325642859  
0.935398194  
0.9964489129  
1.006196174  
0.9615564446  
0.8663940331  
0.7310544814  
0.5710214132  
0.4049125823  
0.2521105283  
0.1303668932  
0.05369015342  
0.03077660443  
0.06416009141  
0.1501548697  
0.2795545989  
0.4389536064  
0.6125038828  
0.7838477352  
0.9379773129  
1.062793648  
1.150182324  
1.19649275  
1.202412738  
1.172285643  
1.113009476  
1.032709139  
0.9393812211  
0.8397207212  
0.7382954372  
0.6371639116  
0.535985143  
0.432558772  
0.3236992013  
0.2062776076  
0.07824964242  
-0.06050630913  
-0.207684111  
-0.3584794812  
-0.5059607013  
-0.6418459588  
-0.7575670525  
-0.8454581254  
-0.8998948255  
-0.9181979338  
-0.9011682622  
-0.8531560199  
-0.7816438289  
-0.6963997873  
-0.6083024353  
-0.5280067705  
-0.4646298308  
-0.4246408493  
-0.4110988587  
-0.423339274  
-0.457156987  
-0.5054236751  
-0.5590758944  
-0.6083037051  
-0.6437849948  
-0.6577994532  
-0.6450807816  
-0.6033110211  
-0.5332186524  
-0.4383025459  
-0.3242371118  
-0.1980764153  
-0.06736957941  
0.06068414664  
0.1799350396  
0.2857632421  
0.3752950605  
0.4473556611  
0.5021973191  
0.5410671123  
0.5656815442  
0.5777241718  
0.5784137855  
0.5682376896  
0.5468737874  
0.513319507  
0.4661978984  
0.4042081941  
0.3266294012  
0.2338050168  
0.127519429  
0.01119367506  
-0.110149864  
-0.2301689701  
-0.3417106135  
-0.4374780674  
-0.5107816177  
-0.556257006  
-0.5704594279  
-0.5522430054  
-0.5028876596  
-0.4259523751  
-0.3269030991  
-0.2125672327  
-0.09051014899  
0.03159225005  
0.1465016923  
0.2478570184  
0.3304735479  
0.3905275859  
0.4256413488  
0.4349019098  
0.4188429199  
0.3793923071  
0.319796001  
0.2444828292  
0.1588667498  
0.0690524594  
-0.0185519705  
-0.09771102618  
-0.162880086  
-0.2097229132  
-0.2355564331  
-0.239653601  
-0.2233444763  
-0.1898883793  
-0.1440907668  
-0.09171706398  
-0.03874673044  
0.009425799894  
0.0487274985  
0.07698215772  
0.09420910904  
0.1025905174  
0.1060778868  
0.1096935668  
0.1185917017  
0.1370393344  
0.1674728326  
0.2098046005  
0.2611239682  
0.3158947021  
0.3666639541  
0.4052216126  
0.4240543754  
0.4178687368  
0.384913134  
0.3278453132  
0.2539123048  
0.1743334935  
0.102880627  
0.05380799933  
0.03939907622  
0.0675150511  
0.1395470848  
0.2491793005  
0.3822434708  
0.5178054519  
0.6304433523  
0.6934447035  
0.6825098147  
0.5794227217  
0.3751226331  
0.07168114949  
-0.3171780871  
-0.7671450513  
-1.245874438  
-1.71669267  
-2.142928554  
-2.492269784  
-2.740502767  
-2.874126918  
-2.891484459  
-2.802286579  
-2.625667985  
-2.387084658  
-2.114587416  
-1.834995734  
-1.570567788  
-1.336579125  
-1.140127405  
-0.9802123625  
-0.8490040753  
-0.733985056  
-0.6205779682  
-0.4948086245  
-0.3455928802  
-0.1663298836  
0.04437026049  
0.2828660751  
0.541427357  
0.8097268626  
1.076569748  
1.331561579  
1.566445733  
1.775917807  
1.957848397  
2.112916464  
2.243776588  
2.35392838  
2.446503428  
2.523157867  
2.583260088  
2.623482039  
2.637847722  
2.618240787  
2.555293205  
2.439543067  
2.262728115  
2.019042843  
1.706240639  
1.326429111  
0.8864941933  
0.3981026336  
-0.1227244908  
-0.6564134012  
-1.180960837  
-1.673277057  
-2.110667091  
-2.472335759  
-2.740841633  
-2.903388388  
-2.952870917  
-2.888588531  
-2.716531173  
-2.449182269  
-2.104792262  
-1.706129812  
-1.278783605  
-0.8491304705  
-0.4421594109  
-0.0793754479  
0.2229848122  
0.4552161404  
0.6147152815  
0.7057949483  
0.7387543519  
0.7283217273  
0.6916679744  
0.646246145  
0.6077276856  
0.5882926731  
0.5954698187  
0.6316477237  
0.6942961798  
0.7767949398  
0.8697592978  
0.9626167082  
1.045211091  
1.10920338  
1.149070003  
1.16258043  
1.150706994  
1.117018712  
1.066678706  
1.005239102  
0.9374531466  
0.8663094028  
0.7924709513  
0.7142106146  
0.6278638428  
0.52870986  
0.4121209066  
0.2747692873  
0.1156636517  
-0.06318531895  
-0.2566008804  
-0.4566079222  
-0.6532992749  
-0.836031188  
-0.9947750463  
-1.121380637  
-1.210567621  
-1.26048872  
-1.272793726  
-1.252212957  
-1.205750733  
-1.141638403  
-1.068234437  
-0.9930471752  
-0.9220252568  
-0.8592199302  
-0.806832741  
-0.7656089255  
-0.735472403  
-0.7162496383  
-0.708320073  
-0.7130443254  
-0.7328368584  
-0.7708471648  
-0.8302415541  
-0.9131831261  
-1.019664941  
-1.14639574  
-1.285969915  
-1.426527954  
-1.55207786  
-1.643546287  
-1.680532802  
-1.643599023  
-1.516846562  
-1.290416431  
-0.9625336948  
-0.540751477  
-0.04212255312  
0.5078164715  
1.077193592  
1.630842257  
2.133854271  
2.555158701  
2.870640019  
3.065364771  
3.13462935  
3.083729516  
2.926545213  
2.683218263  
2.377313154  
2.032912125  
1.672051001  
1.312834633  
0.9683872579  
0.646684293  
0.3511343495  
