27,-0.0043337,0.020413,0.029795,-0.98497,0.0011702,-1.9504,0.98017,1.1035,13.141,0.094214,2.9056,0.012339,1.4259,8.2236,0.030005,16.889,0.017199,0.98498,0.038241,0.0075614,0.0061475,0.0051545,0.24417,0.32453,0.394,0.0297,0.0014124,0.00099435,0.0051931,0.38174,0.29078,0.053849,72.451,35787,57767,56612,1.5024e+05,0.48503,0.32081,0.48503,4.4125,5.2845,1.0893,0.23356,0.024428,45,55.133,588,16289,2.6133,9.3174,15876,12015,9909,0.92003,0.94653,0.041071,0.026349,0.024655,0.28009,22945,16323,0.00085613,0.00041917,0,0.053005,0,0.081587,0.0023728,0.035359,0.0040854,0.12018,1.3729,0.72827,0.33312,0.21286,0.327,0.34842,0.21928,0.35085,0.32473,0.22137,0.36487,0.31407,40.219,9.4073,7671.4,12326,10147,0.25411,0.26131,0.069111,0.59303,0.62159,0.084903,0.76749,0.79058,0.078385,0.87681,0.89017,0.071922,0.95131,0.95695,0.066851,0.0067067,0.0062129,0.049146,0.017394,0.058889,-0.036106,0.014724,0.013787,0.05094,0.02412,0.078405,-0.041093,0.024882,0.023497,0.051071,0.030053,0.097417,-0.044887,4.8952e-05,3.9316e-05,0.00081666,-0.0045029,0.0263,-0.021234,0.0003201,0.00026581,0.0024326,-0.0052442,0.036431,-0.025771,0.00094856,0.00080696,0.0041891,-0.0055764,0.048105,-0.029454,0.0066578,0.0061736,0.095469,0.028185,0.054897,-0.035418,0.014404,0.013521,0.10205,0.03959,0.072477,-0.038861,0.023933,0.02269,0.10329,0.04935,0.087563,-0.040742,0,0,0,-0.0020046,0.0093907,0,0,0,0,-0.0027875,0.01483,0,0,0,0,-0.0036017,0.020174,0,0.34253,74,74,40,988,3,3,3,0.645
27,-0.0049283,0.023155,0.033781,-0.98295,0.0013367,-1.9463,0.98002,1.4789,6.7303,0.095783,3.0503,0.004343,0.83841,4.5378,0.034068,7.595,0.0077342,0.98295,0.033879,0.0057123,0.0044351,0.0036064,0.23722,0.33378,0.39589,0.027371,0.0012776,0.00083062,0.0036309,0.3777,0.31327,0.062488,88.62,42571,80733,1.1612e+05,2.3951e+05,0.40532,0.25638,0.40532,5.6423,5.8597,1.1931,0.23713,0.025686,61,51.344,2169,77419,7.2976,55.689,58563,7317,5049,0.91686,0.9387,0.20657,0.1513,0.13542,0.70132,23846,14215,0.001368,0.00054027,0,0.066182,0,0.064253,0.012198,0.012221,0.025721,0.04999,0.70064,0.20838,0.72035,0.26087,0.30408,0.28142,0.36869,0.2514,0.1359,0.37174,0.24175,0.11959,25.52,7.5984,21941,46778,45920,0.44467,0.49432,0.15296,0.83733,0.87474,0.15162,0.92529,0.94648,0.11952,0.95461,0.96809,0.099035,0.9694,0.97857,0.086158,0.026424,0.029076,0.2449,0.10053,0.12186,0.050461,0.053556,0.058582,0.23434,0.12644,0.15477,0.061719,0.085511,0.092702,0.22198,0.14802,0.1825,0.067487,0.0079421,0.0097272,0.16758,0.045007,0.067484,0.061433,0.016441,0.01952,0.15802,0.055834,0.086694,0.067258,0.027428,0.031693,0.1532,0.067427,0.10652,0.069529,0.018326,0.01923,0.33236,0.097105,0.1017,0.020957,0.038801,0.041169,0.34768,0.13233,0.13516,0.034038,0.062468,0.06641,0.34099,0.15936,0.16077,0.042633,0.00015581,0.00011938,0.029039,0.0014044,0.020968,-0.021906,0.00089221,0.00070361,0.05282,0.0061243,0.026907,-0.025099,0.0024924,0.0020581,0.073494,0.012599,0.033607,-0.027297,0.39944,74,74,40,988,3,3,3,0.645
27,-0.0049021,0.023207,0.033809,-0.98293,0.00144,-1.9447,0.97847,0.90032,7.1975,0.099774,3.1108,0.0035986,1.1243,6.0863,0.034054,10.247,0.010434,0.98296,0.048544,0.012369,0.010388,0.0088662,0.23205,0.30253,0.41887,0.034266,0.001947,0.0015012,0.0088366,0.36507,0.26848,0.091635,50.505,16425,23369,18626,58472,0.43907,0.28992,0.43907,4.6256,5.4945,0.99928,0.23127,0.026691,58,93.414,3749,2.4937e+05,6.9089,50.642,1.0122e+05,19602,12501,0.91624,0.93868,0.31898,0.22539,0.24614,0.7322,38161,21318,0.0011774,0.00055992,0,0.04779,0,0.040981,0.0035851,0.028124,0.0058318,0.049328,1.0425,0.32721,0.4882,0.23606,0.31111,0.29058,0.26297,0.26614,0.21804,0.27924,0.26221,0.20024,20.257,7.8456,14922,36886,35727,0.38608,0.40495,0.214,0.64873,0.67686,0.18929,0.77215,0.79877,0.16072,0.85016,0.87084,0.14212,0.91377,0.9264,0.13087,0.010894,0.0098296,0.1627,0.046963,0.074725,-0.039654,0.0215,0.019261,0.1516,0.056804,0.095785,-0.052793,0.032346,0.028718,0.13531,0.061169,0.11177,-0.066667,0.0035682,0.0030643,0.12132,0.022028,0.054368,-0.035021,0.0080056,0.0068607,0.12399,0.030032,0.070472,-0.045502,0.013282,0.011337,0.11954,0.035806,0.084687,-0.05683,0.0072681,0.0067236,0.21241,0.044904,0.0508,-0.024586,0.01412,0.012993,0.20388,0.05564,0.065581,-0.032313,0.020513,0.018735,0.18044,0.059229,0.075438,-0.040209,5.8107e-05,4.1663e-05,0.017451,-0.0011395,0.013283,-0.014459,0.00020867,0.00015191,0.019907,-0.0012432,0.017535,-0.015583,0.00043461,0.00032819,0.020651,-0.0014726,0.02081,-0.018771,0.50761,74,74,40,988,3,3,3,0.645
27,-0.0038459,0.018162,0.02648,-0.98666,0.0010846,-1.9529,0.97931,0.59222,5.5338,0.044777,3.1527,0.0025726,0.99583,6.0959,0.026632,9.7078,0.0098857,0.98667,0.040339,0.0091344,0.0075544,0.0064013,0.25748,0.37488,0.32831,0.030144,0.001576,0.0011532,0.0064506,0.39203,0.35945,0.0019018,74.594,28553,42904,38281,1.0981e+05,0.41009,0.33105,0.41009,3.5668,4.253,0.99608,0.2054,0.019629,56,73.536,1730,72292,4.799,27.451,46710,22302,19116,0.9174,0.94072,0.20495,0.13921,0.15444,0.64939,30900,14780,0.0010836,0.00054927,0,0.038591,0,0.048761,0.0078687,0.0059681,0.0058139,0.0086635,0.77285,0.15849,0.82947,0.26558,0.30724,0.27625,0.3753,0.2452,0.13749,0.39964,0.231,0.12842,17.492,7.4588,7968.3,16824,15442,0.36711,0.35674,0.16111,0.76479,0.78176,0.17669,0.91667,0.93108,0.15107,0.94844,0.95848,0.12554,0.96443,0.97142,0.10936,0.0091895,0.0086128,0.10866,0.033735,0.070684,-0.027127,0.019511,0.019509,0.10892,0.04463,0.09495,-5.1727e-05,0.032372,0.033381,0.10722,0.054317,0.11736,0.02233,0.0048785,0.0047807,0.13133,0.028955,0.04842,-0.0065113,0.011113,0.011988,0.13628,0.040117,0.069754,0.034511,0.018869,0.021175,0.13446,0.049373,0.090816,0.066996,0.0041455,0.0036744,0.095924,0.020029,0.049259,-0.031501,0.0079653,0.007109,0.091066,0.024297,0.060854,-0.037979,0.012745,0.011509,0.088766,0.028858,0.070481,-0.042465,0.00016552,0.00015775,0.039357,0.0018487,0.018649,-0.0043306,0.00061598,0.00058094,0.046527,0.0036869,0.026102,-0.0066969,0.0013151,0.0012213,0.049478,0.0053575,0.033048,-0.010431,0.48002,74,74,40,988,3,3,3,0.645
27,-0.0053975,0.025515,0.03717,-0.98122,0.0015996,-1.9411,0.97825,-0.99255,7.8224,-0.096001,3.0332,0.006986,1.1019,5.6869,0.03747,9.1652,0.0093332,0.98125,0.045238,0.014242,0.010623,0.0083012,0.21899,0.30012,0.43675,0.029819,0.0036009,0.0023235,0.0083964,0.35573,0.27283,0.10427,66.927,4840.2,9695.7,20134,34737,0.38249,0.31429,0.38249,3.3293,3.8981,1.0267,0.25504,0.023121,38,106.68,3274,2.8009e+05,5.8153,35.208,88398,7452,5292,0.91826,0.94279,0.32373,0.21577,0.2265,0.89288,32543,22781,0.00051232,0.00029518,0,0.068894,0,0.088523,0.0065388,0.011653,0.0043627,0.049797,2.1613,1.8463,0.41776,0.17379,0.292,0.45818,0.085854,0.17282,0.72375,0.083705,0.16611,0.73435,46.015,12.371,11600,20492,18305,0.036477,0.032506,0.014383,0.09742,0.086824,0.020222,0.16926,0.15142,0.025063,0.25133,0.22802,0.02989,0.3532,0.3251,0.035986,0.0041197,0.0037647,0.04377,0.0096279,0.047363,-0.037333,0.0089598,0.0081487,0.044942,0.01334,0.063118,-0.051429,0.014727,0.013399,0.043825,0.015805,0.077118,-0.062214,2.296e-05,1.8827e-05,0.00055535,-0.0056163,0.01831,-0.020766,0.00015753,0.00012982,0.0017357,-0.0070026,0.02548,-0.022639,0.00043501,0.00035935,0.0027853,-0.008269,0.03273,-0.024798,0.0028,0.0025245,0.058212,0.010884,0.041599,-0.036555,0.0065799,0.0059559,0.06759,0.017663,0.056596,-0.047275,0.011616,0.010591,0.072686,0.024061,0.069647,-0.055527,0.0012968,0.0012214,0.27705,0.030264,0.028802,-0.015435,0.0032983,0.0030459,0.22384,0.033354,0.035807,-0.027405,0.0055022,0.0050056,0.18599,0.035074,0.043552,-0.037641,0.3753,74,74,40,988,3,3,3,0.645
27,-0.0042562,0.021308,0.030262,-0.98474,0.0024299,-1.9291,0.95901,-0.15456,3.3046,-0.14513,3.249,1.0081e-05,0.66631,3.8387,0.030069,5.6408,0.0057442,0.98495,0.069114,0.042965,0.035986,0.030489,0.31928,0.23058,0.38355,0.024156,0.0066534,0.0053039,0.030476,0.48769,0.11185,0.035825,118.43,1545.4,1929.9,1643.5,5237.9,0.38602,0.3052,0.38602,0.8263,0.982,0.41351,0.21816,0.022945,33,129.91,3855,4.4565e+05,5.4542,30.845,1.0408e+05,4428,3132,0.91841,0.9408,0.38209,0.27257,0.25241,0.94682,67357,32249,0.00054384,0.0003026,0,0.064143,0,0.071744,0.004056,0.0040652,0.00095923,0.0023871,0.079714,0.9897,0.39691,0.19129,0.34989,0.37742,0.1275,0.38144,0.47759,0.12185,0.39172,0.47583,60.467,10.19,19543,40376,39062,0.024406,0.019081,0.010174,0.11172,0.10078,0.024515,0.33347,0.32774,0.052202,0.56322,0.57103,0.070811,0.74711,0.76427,0.08047,0.00010357,8.769e-05,0.0011633,-0.008278,0.024177,-0.013325,0.00098715,0.00098824,0.0052346,-0.0087541,0.033814,0.00020069,0.0035938,0.003736,0.011306,-0.0068609,0.045316,0.010936,0.00010357,8.769e-05,0.0026484,-0.0052139,0.015755,-0.013325,0.00098542,0.00098703,0.011478,-0.0037069,0.025535,0.00029753,0.0035504,0.0037056,0.024032,0.0010583,0.03821,0.01196,0,0,0,-0.0060988,0.018167,0,1.7347e-06,1.2118e-06,1.8837e-05,-0.0079182,0.022365,-0.01463,4.3434e-05,3.0315e-05,0.00028733,-0.0096122,0.026292,-0.019225,0,0,0,-0.0024913,0.0038312,0,0,0,0,-0.0034643,0.0052691,0,0,0,0,-0.0044761,0.0067116,0,0.36839,74,74,40,988,3,3,3,0.645
27,-0.0046487,0.021978,0.032186,-0.98376,0.0011297,-1.9501,0.98229,1.2001,6.3126,0.056241,3.0422,0.0047098,0.76287,4.2331,0.032412,7.217,0.0073493,0.98378,0.03985,0.012011,0.01017,0.0086727,0.21572,0.35359,0.39197,0.026725,0.0018187,0.0014847,0.008686,0.32927,0.33903,0.054369,92.607,19751,24879,20327,65050,0.28937,0.30514,0.30514,3.6479,4.3858,0.93938,0.22591,0.024301,56,47.018,1353,39865,5.5538,34.571,36531,18090,5616,0.9177,0.94132,0.059157,0.040924,0.032987,0.22053,20315,13740,0.00078406,0.00034296,0,0.11516,0,0.093759,0.065653,0.1845,0.14488,0.39301,0.79383,0.28222,0.3166,0.22611,0.31844,0.32933,0.27507,0.26353,0.28749,0.26957,0.27196,0.28354,15.928,8.8919,7076,12487,11087,0.37356,0.37477,0.11077,0.58917,0.59105,0.091967,0.6992,0.7066,0.077858,0.78971,0.79636,0.070626,0.8601,0.86631,0.065899,0.017538,0.021182,0.14012,0.059401,0.10209,0.09311,0.032592,0.038798,0.12294,0.067553,0.12506,0.10708,0.048949,0.057466,0.10954,0.073424,0.14486,0.1168,0.0019177,0.0015808,0.034883,0.0062904,0.043252,-0.027432,0.0041663,0.0035516,0.034521,0.0081807,0.056359,-0.030474,0.0072573,0.0063136,0.034944,0.010459,0.069127,-0.034576,0.015399,0.019421,0.24076,0.074849,0.095408,0.11069,0.029036,0.035952,0.22429,0.090152,0.117,0.12627,0.043489,0.053089,0.20464,0.10039,0.13384,0.13857,0.00022032,0.00017977,0.035396,0.0027086,0.023977,-0.011551,0.00068922,0.00056956,0.035174,0.0037244,0.031739,-0.015862,0.0013474,0.0011455,0.034252,0.0045874,0.039783,-0.018726,0.47808,74,74,40,988,3,3,3,0.645
27,-0.0074258,0.034836,0.050723,-0.97428,0.0021385,-1.9278,0.97869,-4.3973,39.592,-0.017643,2.7593,0.023663,1.8542,8.1715,0.051382,18.343,0.01868,0.97428,0.069341,0.003297,0.0023651,0.0018425,0.15299,0.30011,0.48172,0.061873,0.00093138,0.00052304,0.0018485,0.1792,0.30338,0.18036,10.027,65314,1.6974e+05,3.7126e+05,6.0633e+05,0.3325,0.41824,0.41824,1.3612,1.7592,0.45709,0.30407,0.03949,49,62.102,1874,78895,5.7334,36.391,50598,17361,7533,0.91583,0.93587,0.22041,0.17985,0.049634,0.70901,45335,17820,0.0010211,0.00048883,2,0.30402,1,0.15008,0.12437,0.48646,0.17958,0.67383,1.1765,0.6974,0.021595,0.20248,0.30862,0.37886,0.18032,0.23722,0.47306,0.13606,0.26049,0.53091,45.935,10.229,21896,65145,64335,0.23584,0.18453,0.07525,0.39692,0.33201,0.066667,0.52474,0.45623,0.062873,0.64926,0.58808,0.062479,0.78037,0.73168,0.064336,0.0097104,0.0067836,0.083479,0.030731,0.057866,-0.057919,0.019238,0.013656,0.078082,0.037263,0.073266,-0.07243,0.031353,0.022434,0.075498,0.04432,0.087652,-0.088274,0.0011067,0.0007257,0.02166,0.001576,0.030651,-0.022487,0.0022025,0.0013893,0.019637,0.001252,0.039952,-0.031424,0.0039796,0.0024213,0.020618,0.0020733,0.049463,-0.044022,0.0086037,0.0060579,0.14474,0.041055,0.048983,-0.053379,0.017068,0.012287,0.14186,0.052152,0.061897,-0.065643,0.027612,0.020165,0.13981,0.063053,0.073052,-0.078183,0,0,0,-0.002174,0.012236,0,0,0,0,-0.003023,0.01623,0,1.7777e-05,1.0276e-05,0.00048625,-0.0037916,0.020728,-0.013255,0.37573,74,74,40,988,3,3,3,0.645
27,-0.0035043,0.017035,0.02471,-0.98756,0.0012532,-1.9497,0.97431,0.32025,4.9226,0.042357,3.2333,0.00038617,0.71349,4.5371,0.02468,6.287,0.0064023,0.98765,0.060526,0.025506,0.021044,0.017787,0.28945,0.30989,0.34162,0.03331,0.0044088,0.0032423,0.018078,0.44757,0.23789,0.0045844,63.431,3783,5804.1,5142.5,14794,0.27998,0.18767,0.27998,0.72252,1.3558,0.36387,0.19758,0.019394,37,129.19,4599,5.677e+05,5.8275,34.983,1.2417e+05,2484,2106,0.90787,0.92776,0.33831,0.25398,0.1607,0.93654,47422,27718,0.0016178,0.00047012,0,0.077785,0,0.10344,0.016068,0.014041,0.020204,0.01695,1.9432,2.334,1.4028,0.28123,0.35138,0.27379,0.37336,0.37636,0.19435,0.4086,0.36987,0.17377,62.443,7.3922,16647,41848,40981,0.13954,0.1297,0.065427,0.37935,0.39847,0.093629,0.57482,0.61137,0.10121,0.72952,0.76163,0.10316,0.84568,0.86798,0.10245,0.014535,0.016387,0.18363,0.060601,0.0962,0.06208,0.030264,0.03423,0.1805,0.078365,0.1255,0.083092,0.048781,0.054986,0.17261,0.092379,0.14887,0.098603,0.013687,0.015755,0.39365,0.095418,0.11374,0.070632,0.027862,0.032426,0.36503,0.11664,0.14227,0.099013,0.044547,0.051792,0.33916,0.13481,0.16618,0.11997,0.00026984,0.00017264,0.0066707,-0.0047068,0.024486,-0.026363,0.00080014,0.00054132,0.009773,-0.0050464,0.032243,-0.036556,0.0018471,0.0013113,0.013744,-0.0045197,0.038413,-0.047702,0.0005787,0.00045924,0.14701,0.013291,0.026757,-0.025967,0.0016271,0.00128,0.1313,0.016114,0.03582,-0.031759,0.0025185,0.0019722,0.10123,0.014963,0.042761,-0.03576,0.36267,74,74,40,988,3,3,3,0.645
27,-0.0030628,0.014726,0.021507,-0.98918,0.0008615,-1.9583,0.97977,1.951,13.15,0.071771,3.0942,0.0071123,0.79801,5.4312,0.021546,9.1142,0.0092813,0.98922,0.043868,0.021501,0.017646,0.01485,0.30982,0.35195,0.29579,0.021181,0.0037449,0.0027337,0.014777,0.46066,0.29765,0.0083437,174.77,5445.4,8396.8,7958.3,21976,0.38643,0.271,0.38643,1.6043,1.8038,0.78083,0.18889,0.015414,71,44.014,2286,73225,8.0619,66.949,61722,5049,4644,0.91748,0.94107,0.17301,0.11702,0.14325,0.5756,28835,15530,0.00081564,0.00040141,0,0.059754,0,0.065886,0.0027055,0.0052574,0.013879,0.010186,1.3869,1.2485,0.16978,0.23877,0.31722,0.29311,0.29575,0.31625,0.16154,0.30277,0.31887,0.15937,18.238,7.9141,10518,19497,17859,0.33821,0.33488,0.12156,0.67082,0.69044,0.12692,0.81991,0.83598,0.11066,0.89507,0.90789,0.097024,0.94485,0.9538,0.087745,0.018838,0.019402,0.18242,0.070964,0.091532,0.017695,0.034204,0.034676,0.15638,0.078709,0.11285,0.0099838,0.04878,0.048504,0.13231,0.080645,0.12823,-0.0047042,0.0041864,0.0036495,0.092296,0.021656,0.046182,-0.036146,0.0080656,0.0070912,0.081001,0.024293,0.059621,-0.042499,0.012726,0.011308,0.07427,0.027101,0.071376,-0.048216,0.014541,0.015657,0.27555,0.077624,0.079768,0.040161,0.026702,0.028294,0.25,0.090836,0.097605,0.037723,0.037214,0.038694,0.21225,0.093428,0.10814,0.028312,0.00011065,9.5687e-05,0.021547,0.00035039,0.018275,-0.015593,0.00067991,0.00058011,0.042057,0.0040083,0.02665,-0.022786,0.0016974,0.001454,0.052299,0.0074508,0.034437,-0.026495,0.47358,74,74,40,988,3,3,3,0.645
27,-0.0062289,0.03004,0.043453,-0.97801,0.0023497,-1.9292,0.97259,0.19301,4.267,0.023238,3.2101,0.00093224,0.7747,3.705,0.043633,5.269,0.0053655,0.97816,0.059052,0.026879,0.022012,0.018634,0.23403,0.25153,0.45779,0.030058,0.0047113,0.0032967,0.018586,0.37175,0.17541,0.12826,65.248,2873.1,4946.9,4166.8,12053,0.3597,0.16732,0.3597,1.6992,2.6744,0.62478,0.26293,0.033991,35,57.543,978,32748,4.0864,19.974,26406,12177,7236,0.91954,0.94284,0.0096356,0.006866,0.029479,0.058007,29115,15929,0.00067693,0.00029827,0,0.071884,0,0.06709,0.0037761,0.00047417,0.014049,0.015898,0.029756,0.69202,0.57347,0.21628,0.31846,0.31925,0.21794,0.29258,0.24931,0.21849,0.27562,0.22102,25.308,8.6199,26709,44200,43440,0.24057,0.25512,0.053149,0.51409,0.56075,0.059788,0.66256,0.70002,0.054968,0.81262,0.83658,0.054146,0.93053,0.94079,0.053118,0.0016859,0.0012033,0.010035,-0.00080689,0.026503,-0.028974,0.0027978,0.0020053,0.0078627,-0.0026429,0.037426,-0.034607,0.0040138,0.0029082,0.0066923,-0.0043373,0.048327,-0.039133,2.9601e-05,2.2776e-05,0.00040115,-0.004151,0.015013,-0.0097856,0.00020098,0.00015756,0.0012407,-0.0050846,0.025089,-0.012001,0.00075974,0.00060042,0.0027255,-0.0054391,0.036428,-0.017445,0.0016563,0.0011805,0.019293,0.002993,0.021672,-0.028588,0.0025968,0.0018478,0.014945,0.0017194,0.026613,-0.033119,0.003254,0.0023078,0.011408,-5.6306e-05,0.030504,-0.035365,0,0,0,-0.0018043,0.0051935,0,0,0,0,-0.0025089,0.0075513,0,0,0,0,-0.0032418,0.0093974,0,0.37255,74,74,40,988,3,3,3,0.645
27,-0.0063909,0.031115,0.04483,-0.9773,0.0026482,-1.9253,0.97001,0.14481,4.6485,-0.032814,3.2032,0.0013002,1.0254,4.8276,0.045029,7.4045,0.0075403,0.97746,0.064301,0.033329,0.028309,0.024161,0.25258,0.20659,0.47864,0.028993,0.0048636,0.0040551,0.024287,0.42144,0.090151,0.16973,67.724,2499.8,2992.7,2251.5,7812.3,0.40926,0.25836,0.40926,0.71506,1.0127,0.35756,0.2728,0.035019,23,152.26,3383,4.9204e+05,4.4723,21.018,91341,1701,1674,0.91567,0.93982,0.26732,0.18423,0.15752,0.90186,56578,31299,0.0005172,0.00027104,0,0.067798,0,0.090909,0.013712,0.014946,0.015599,0.048743,0.048825,0.87936,0.42886,0.20036,0.37333,0.34227,0.18079,0.49168,0.31191,0.18325,0.5022,0.30167,59.247,9.2413,13155,23154,21740,0.021255,0.017349,0.0072794,0.08886,0.076322,0.01602,0.26812,0.25122,0.034483,0.46633,0.45147,0.048168,0.64353,0.63349,0.056948,0.00064311,0.00061744,0.0059345,-0.0052788,0.030553,-0.0077892,0.0027022,0.0027113,0.011772,-0.0035451,0.045288,0.00096403,0.0065904,0.0066063,0.017034,-0.00057675,0.060413,0.00095802,0.00064311,0.00061744,0.013511,-0.0013009,0.021156,-0.0077892,0.0027022,0.0027113,0.025859,0.0032072,0.035891,0.00096403,0.0065904,0.0066063,0.036651,0.009401,0.051702,0.00095802,0,0,0,-0.0055171,0.019539,0,0,0,0,-0.0071692,0.026448,0,0,0,0,-0.0088121,0.032632,0,0,0,0,-0.0022537,0.014582,0,0,0,0,-0.0031339,0.018646,0,0,0,0,-0.0040492,0.023492,0,0.33082,74,74,40,988,3,3,3,0.645
27,-0.0030926,0.015083,0.021789,-0.98903,0.0012278,-1.9498,0.97142,-0.35552,5.1259,-0.01741,3.1918,0.0016731,0.79505,5.3863,0.021744,7.8945,0.0080392,0.98912,0.05757,0.027406,0.023045,0.019685,0.33772,0.30982,0.29726,0.028149,0.0042072,0.0032656,0.019576,0.49824,0.25064,0.0049905,93.696,4292.5,5887.7,4367.5,14642,0.37603,0.2649,0.37603,1.4355,1.6945,0.56494,0.18561,0.016244,34,80.588,2483,1.7946e+05,5.5305,31.735,67041,3969,2781,0.92003,0.94438,0.24961,0.16653,0.18044,0.83465,31015,18203,0.00063246,0.00031197,0,0.057139,0,0.079581,0.0082325,0.012615,0.009452,0.033772,0.56531,1.3647,0.46546,0.23207,0.34695,0.32609,0.28748,0.41733,0.26373,0.28417,0.43464,0.25526,35.165,8.8045,14249,22778,20878,0.084516,0.073007,0.024031,0.2628,0.25105,0.039335,0.49383,0.49931,0.052729,0.69618,0.71261,0.059701,0.83374,0.85086,0.061254,0.0029812,0.0025011,0.022839,0.0039094,0.056125,-0.047903,0.0070446,0.0060363,0.02548,0.0068508,0.072586,-0.057175,0.012679,0.011185,0.027208,0.0098823,0.088393,-0.059058,0.0010863,0.00093596,0.018947,0.001369,0.042863,-0.031902,0.0036818,0.0032367,0.029252,0.0063237,0.058766,-0.040308,0.0084846,0.0076897,0.039174,0.013339,0.076316,-0.042159,0.00079055,0.0006333,0.011852,-0.0010002,0.032823,-0.036552,0.0021627,0.0017394,0.01602,0.00053702,0.04097,-0.043012,0.003637,0.0029574,0.016411,0.00087201,0.046527,-0.047728,0.0011043,0.0009318,0.17013,0.021517,0.02485,-0.028898,0.0024501,0.0020731,0.1199,0.020245,0.030678,-0.033844,0.0035831,0.0030288,0.087338,0.018054,0.037577,-0.037129,0.3956,74,74,40,988,3,3,3,0.645
27,-0.0050435,0.024699,0.035726,-0.98196,0.001958,-1.9366,0.97221,1.0371,5.7954,0.030414,3.1278,0.0028114,0.78763,4.1619,0.035743,6.6939,0.0068166,0.98211,0.073212,0.033807,0.028233,0.023992,0.19167,0.35607,0.38298,0.036068,0.0053253,0.0040903,0.023795,0.29117,0.36315,0.062028,43.975,2096.8,2928.7,2411.1,7481.3,0.30694,0.18164,0.30694,3.4257,3.5365,0.78838,0.23877,0.028273,63,69.698,1639,60965,4.7757,27.819,44253,22113,15849,0.91759,0.93931,0.29631,0.20586,0.22586,0.78259,32243,18499,0.0013183,0.00054348,0,0.044006,0,0.041024,0.012637,0.026968,0.029385,0.043004,0.18358,1.286,1.2075,0.26642,0.31034,0.28758,0.38596,0.2676,0.16673,0.40632,0.25315,0.15198,22.587,7.7646,9870,21645,20266,0.34569,0.362,0.16111,0.68875,0.72389,0.16898,0.83101,0.85678,0.14544,0.88653,0.902,0.12461,0.92078,0.93019,0.11088,0.032188,0.039358,0.40419,0.14503,0.16604,0.17486,0.062104,0.073583,0.36819,0.17317,0.20191,0.18463,0.094409,0.1095,0.33207,0.19243,0.22958,0.1904,0.015391,0.015496,0.44001,0.10775,0.11133,0.0036588,0.030295,0.030825,0.39452,0.12716,0.13848,0.012068,0.047709,0.049305,0.36105,0.14467,0.16327,0.027946,0.015775,0.023014,0.38763,0.096714,0.12042,0.2536,0.031083,0.042621,0.37738,0.12213,0.14621,0.25593,0.046433,0.061023,0.34342,0.13568,0.16192,0.25142,0.0010218,0.00084796,0.25802,0.025416,0.032964,-0.029685,0.0031047,0.0026518,0.24904,0.033983,0.046152,-0.035257,0.0060957,0.0052806,0.24354,0.042836,0.05959,-0.040739,0.47008,74,74,40,988,3,3,3,0.645
27,-0.0056084,0.026466,0.0387,-0.98044,0.0014365,-1.9425,0.98127,-1.9479,16.058,-0.038252,3.101,0.0066699,1.3874,7.0156,0.039032,12.337,0.012563,0.98046,0.051793,0.010762,0.0088663,0.0075674,0.22846,0.27746,0.44448,0.038873,0.0018729,0.0012871,0.0075647,0.38414,0.23768,0.12809,37.137,17848,31197,24952,74034,0.22731,0.33452,0.33452,1.8149,2.0208,0.55217,0.25855,0.030805,75,29.48,1718,38801,8.4,72.043,46386,2241,1998,0.91908,0.9448,0.076987,0.050865,0.03874,0.47876,27864,14442,0.0006232,0.00032157,0,0.069226,0,0.08064,0.0052246,0.032232,0.0016602,0.033299,1.3783,1.4103,0.66291,0.20346,0.31503,0.37,0.18293,0.26169,0.44776,0.16872,0.2574,0.46862,23.495,9.99,10889,17968,16551,0.23345,0.22151,0.065252,0.42548,0.43665,0.062604,0.58519,0.60273,0.061423,0.69187,0.71037,0.058326,0.79008,0.80867,0.057061,0.0037086,0.0030849,0.02793,0.0065628,0.052617,-0.060588,0.010423,0.0087409,0.037059,0.014562,0.073782,-0.080904,0.020993,0.017948,0.044285,0.023885,0.094959,-0.096477,0.0014421,0.0011699,0.024726,0.0033887,0.03751,-0.043741,0.0041163,0.0034106,0.032149,0.0077665,0.051529,-0.054627,0.0086712,0.0074108,0.039356,0.013691,0.066574,-0.062654,0.0019763,0.0016806,0.029125,0.0049847,0.033056,-0.036841,0.0049747,0.0042481,0.036223,0.0096315,0.045487,-0.04817,0.0094011,0.0081476,0.0417,0.01483,0.057648,-0.057804,0.00029022,0.00023445,0.043951,0.0041074,0.023611,-0.030495,0.0013914,0.0011289,0.066934,0.010176,0.032493,-0.040554,0.0032225,0.0026262,0.077216,0.015729,0.041541,-0.049068,0.41837,74,74,40,988,3,3,3,0.645
27,-0.0055989,0.026554,0.038398,-0.98059,0.0020566,-1.9346,0.97285,-0.030631,3.1324,0.056477,3.2839,2.1661e-08,0.67418,3.4229,0.038714,4.6051,0.0046895,0.98062,0.062066,0.013475,0.011293,0.0096449,0.23158,0.29312,0.41465,0.046854,0.0022097,0.0016756,0.0099149,0.36428,0.25095,0.083243,23.49,13400,18785,14761,46970,0.28255,0.18179,0.28255,0.97432,1.1351,0.43132,0.25,0.030844,35,118.29,2845,2.4456e+05,5.0291,27.716,76815,22950,6426,0.91682,0.94042,0.335,0.23164,0.23023,0.91175,50805,27110,0.00064451,0.00031588,0,0.085236,0,0.10514,0.0032051,0.033075,0.0093054,0.060717,1.4546,2.9102,1.3356,0.21549,0.38065,0.31968,0.2306,0.48656,0.25071,0.23331,0.49838,0.24179,53.595,8.6314,14703,27950,26458,0.054645,0.045979,0.021926,0.21202,0.20195,0.044783,0.41989,0.41641,0.063268,0.60568,0.61076,0.073297,0.75235,0.76256,0.078,0.0026509,0.0021095,0.028659,0.0031921,0.042693,-0.046806,0.0039866,0.0031806,0.020348,-0.0002918,0.053125,-0.052853,0.0055365,0.0044461,0.016766,-0.0027717,0.062399,-0.061417,0.0026509,0.0021095,0.065247,0.012369,0.045682,-0.046806,0.0039866,0.0031806,0.044697,0.0087979,0.054183,-0.052853,0.0055365,0.0044461,0.036073,0.0070182,0.062949,-0.061417,0,0,0,-0.005981,0.015557,0,0,0,0,-0.007772,0.020011,0,0,0,0,-0.0095531,0.023182,0,0,0,0,-0.0024432,0.0099445,0,0,0,0,-0.0033974,0.013366,0,0,0,0,-0.0043897,0.016318,0,0.35759,74,74,40,988,3,3,3,0.645
27,-0.0066686,0.031453,0.045847,-0.97678,0.0019138,-1.933,0.97891,-0.28656,4.884,0.014868,3.2376,0.0008862,0.99726,4.6272,0.046356,6.493,0.006612,0.9768,0.063778,0.012384,0.0092321,0.0074715,0.21642,0.25119,0.47154,0.048431,0.0031305,0.0017573,0.0075263,0.35044,0.18114,0.15406,20.785,6196.2,16120,24711,47049,0.21273,0.23332,0.23332,1.8833,2.1232,0.54304,0.27131,0.03687,29,86.862,2257,1.7387e+05,5.0524,26.694,60939,4779,1755,0.91925,0.94415,0.17161,0.11636,0.07044,0.89502,35456,18072,0.00057195,0.0003626,0,0.059626,0,0.075589,0.0025056,0.030048,0.00025179,0.055434,0.024042,0.90689,0.36921,0.20317,0.34363,0.35848,0.14702,0.38974,0.43516,0.13945,0.39644,0.44262,54.226,9.679,16511,25572,24242,0.056865,0.044111,0.014383,0.13003,0.10315,0.017313,0.23474,0.20021,0.022297,0.38245,0.34773,0.029176,0.53363,0.50741,0.034876,0.018147,0.020446,0.12367,0.056937,0.090441,0.090319,0.039502,0.044912,0.1271,0.07743,0.12275,0.13053,0.06563,0.075337,0.12528,0.094604,0.15151,0.17659,0.015323,0.01764,0.23775,0.078564,0.096066,0.095092,0.030322,0.035484,0.21431,0.093244,0.12153,0.13731,0.047644,0.056469,0.19568,0.10582,0.14487,0.18219,1.9256e-07,1.4429e-07,2.568e-06,-0.0047292,0.026438,-0.01803,1.2608e-05,9.4524e-06,8.3077e-05,-0.0061078,0.032765,-0.01921,0.00013465,0.00010115,0.00054046,-0.007245,0.038068,-0.024048,0.0028234,0.0028065,0.38693,0.054851,0.051059,-0.002166,0.0091669,0.0094188,0.39906,0.078747,0.07555,0.013617,0.017854,0.018769,0.38713,0.098602,0.098245,0.032587,0.31487,74,74,40,988,3,3,3,0.645
27,-0.0034254,0.016731,0.024185,-0.98782,0.001349,-1.9477,0.97171,0.32437,3.3008,0.03487,3.2903,3.2602e-06,0.56756,3.6495,0.024137,5.0179,0.0051099,0.98792,0.068651,0.028674,0.024022,0.020436,0.30063,0.30157,0.33152,0.037523,0.004556,0.0035409,0.020663,0.45538,0.22877,0.0030405,47.293,3570,4796.2,3891.3,12306,0.18287,0.2056,0.2056,1.1558,1.2912,0.41728,0.19525,0.018199,66,58.758,1351,46332,4.8026,26.205,36477,27999,14040,0.91854,0.94389,0.16153,0.10611,0.11671,0.62187,29248,17668,0.00083576,0.00041168,0,0.057225,0,0.059906,0.0062779,0.0028388,8.337e-06,0.00042681,0.8498,1.3286,0.18318,0.22852,0.35507,0.30181,0.26477,0.41096,0.21039,0.25724,0.42679,0.20844,25.221,8.1488,10101,20601,18675,0.2341,0.22002,0.10042,0.5412,0.54111,0.12221,0.73421,0.742,0.11827,0.84645,0.85593,0.10951,0.91311,0.92235,0.10121,0.012708,0.013262,0.14688,0.049508,0.081053,0.026531,0.027177,0.027995,0.14829,0.066043,0.10752,0.023766,0.044519,0.0456,0.14413,0.079286,0.12984,0.023413,0.001599,0.0013842,0.042075,0.005329,0.03789,-0.031163,0.0041239,0.0035663,0.04943,0.009692,0.050158,-0.043599,0.0076107,0.0065741,0.053011,0.013724,0.061923,-0.054678,0.010492,0.011352,0.23729,0.059579,0.070569,0.045006,0.022176,0.02375,0.24781,0.081206,0.093713,0.050269,0.036209,0.038548,0.24648,0.099228,0.11241,0.055869,0.00061697,0.0005254,0.14339,0.013706,0.027603,-0.022775,0.0014638,0.0012451,0.10807,0.013498,0.037293,-0.026105,0.0021832,0.001872,0.080282,0.011788,0.045594,-0.029309,0.47693,74,74,40,988,3,3,3,0.645
27,-0.003691,0.017546,0.025533,-0.98714,0.0011528,-1.9517,0.97716,-0.091668,4.8751,-0.030296,3.1646,0.0019394,0.64618,4.0284,0.025678,5.8225,0.0059292,0.98715,0.042753,0.016388,0.012922,0.010591,0.29432,0.29747,0.36655,0.025277,0.00342,0.0023147,0.010648,0.44424,0.23799,0.023176,114.41,6015.9,11485,14488,32105,0.14408,0.247,0.247,0.59531,0.65535,0.30359,0.20051,0.017715,58,85,1913,1.1183e+05,4.5297,22.699,51651,42498,22626,0.91585,0.93529,0.12745,0.089959,0.088545,0.38571,31157,19027,0.0014228,0.00062399,0,0.051836,0,0.05565,0.0059757,0.0041339,0.0052903,0.010903,1.0913,1.6947,0.90168,0.28394,0.3025,0.26431,0.39857,0.24881,0.145,0.42807,0.23763,0.12385,12.685,7.1365,7031.1,17934,16670,0.38513,0.38533,0.19847,0.76191,0.79849,0.20669,0.86402,0.88951,0.16721,0.91712,0.93425,0.14255,0.95031,0.96027,0.12654,0.0030915,0.0028944,0.042927,0.0058526,0.044541,-0.014773,0.0078435,0.0075402,0.051419,0.011791,0.060152,-0.012229,0.014734,0.014363,0.057304,0.018143,0.075071,-0.010339,0.0016179,0.0016875,0.051144,0.0060016,0.030943,0.0079562,0.0045963,0.0048495,0.066187,0.012873,0.045487,0.013777,0.009191,0.0097358,0.076912,0.020487,0.059961,0.019588,0.0014734,0.0012067,0.040034,0.0033476,0.030457,-0.026403,0.0032285,0.002677,0.043343,0.0054397,0.037178,-0.032886,0.0054295,0.0045445,0.044404,0.0071155,0.04315,-0.03886,2.5158e-07,1.8364e-07,7.0245e-05,-0.0027701,0.0126,-0.013705,1.8663e-05,1.3679e-05,0.0016553,-0.0036237,0.016213,-0.013377,0.0001132,8.298e-05,0.005001,-0.0040598,0.020065,-0.014289,0.5359,74,74,40,988,3,3,3,0.645
27,-0.0054333,0.02879,0.04053,-0.9795,0.0041302,-1.9078,0.94768,0.088508,5.0493,0.020401,3.1982,0.0015499,0.93258,4.7,0.039293,6.5586,0.0066788,0.98032,0.11974,0.068908,0.056342,0.047243,0.1919,0.28845,0.40945,0.043768,0.011469,0.0084761,0.046489,0.3118,0.28281,0.11775,24.177,386.76,587.51,534.5,1533.7,0.21015,0.1494,0.21015,1.1555,1.8327,0.56308,0.25072,0.028512,55,16.473,463,4088.5,5.9637,40.694,12501,3078,2403,0.92068,0.94797,0.064799,0.04336,0.025112,0.51123,18252,11562,0.00065714,0.00029839,0,0.094543,0,0.099578,0.029643,0.18212,0.088039,0.51326,2.0331,2.788,1.4864,0.23833,0.30576,0.34037,0.34641,0.22511,0.30658,0.38021,0.2064,0.31154,21.018,9.1899,10939,14150,13046,0.22148,0.19489,0.032187,0.43693,0.40534,0.033426,0.58358,0.57672,0.031848,0.67532,0.69346,0.029599,0.75558,0.78005,0.028372,0.042468,0.039169,0.16629,0.10759,0.11969,-0.053292,0.083533,0.076509,0.15442,0.1313,0.15523,-0.071342,0.12268,0.11188,0.13455,0.14096,0.1828,-0.086518,0.039743,0.036883,0.35429,0.15957,0.13986,-0.047147,0.076539,0.070592,0.31081,0.18493,0.17111,-0.062547,0.11177,0.10258,0.26376,0.19541,0.19497,-0.076638,0.00010776,0.00010594,0.0008257,-0.003185,0.028736,-0.0024117,0.0013875,0.0013968,0.0052526,-0.00142,0.041067,0.0013646,0.0046668,0.0046199,0.010763,0.0024139,0.052771,-0.0024493,0.0026167,0.0021798,0.20604,0.038317,0.046691,-0.032016,0.0064569,0.0053943,0.1615,0.041324,0.060284,-0.037553,0.0095329,0.0080112,0.11876,0.038571,0.071278,-0.040174,0.39271,74,74,40,988,3,3,3,0.645
27,-0.0057762,0.027784,0.04039,-0.97958,0.0019454,-1.9353,0.97562,-1.0479,6.6556,-0.066551,3.0773,0.0049764,0.92077,4.5584,0.040719,7.228,0.0073605,0.97962,0.074297,0.02939,0.022017,0.017478,0.19562,0.29332,0.43682,0.043598,0.0075237,0.0046868,0.018442,0.26906,0.24061,0.10185,29.468,1138,2437,4366.1,7971.1,0.41638,0.25302,0.41638,1.7557,1.9496,0.56404,0.2542,0.030247,69,25.188,623,8551,4.7928,27.561,16821,10368,6939,0.92026,0.94726,0.070651,0.044602,0.046378,0.43042,16689,12501,0.00068588,0.00032984,0,0.043345,0,0.058992,0.0092251,0.031844,0.010004,0.08389,0.58387,0.095356,0.24364,0.22804,0.31317,0.34286,0.28102,0.27744,0.33607,0.29055,0.28051,0.32821,19.708,9.2572,6073.3,9000,6204.4,0.28781,0.29028,0.070602,0.49267,0.50284,0.06362,0.56275,0.57379,0.051839,0.61637,0.62485,0.045602,0.69003,0.70111,0.043736,0.0053681,0.0051494,0.035481,0.01188,0.069435,-0.023426,0.011495,0.011109,0.03587,0.015938,0.087539,-0.024026,0.018392,0.017718,0.03405,0.01823,0.10196,-0.030604,0.0035916,0.0036316,0.054045,0.014659,0.054289,0.0055741,0.0075039,0.0076408,0.051435,0.018197,0.068583,0.010417,0.011461,0.01166,0.045654,0.019357,0.079922,0.011046,0.0017766,0.0015178,0.022978,0.0037232,0.044126,-0.043009,0.003992,0.0034687,0.02551,0.0060383,0.054,-0.055939,0.0069591,0.0060815,0.027091,0.0083429,0.06124,-0.067652,0,0,0,-0.0019025,0.011293,0,3.4789e-07,3.2389e-07,1.4688e-05,-0.0026424,0.018133,-0.007063,1.9393e-05,1.7798e-05,0.00040783,-0.003309,0.025437,-0.010152,0.44218,74,74,40,988,3,3,3,0.645
27,-0.005605,0.026737,0.038805,-0.98039,0.0018984,-1.9365,0.97523,-0.58455,4.5406,-0.07217,3.2071,0.0011398,0.788,3.9806,0.039109,5.6725,0.0057765,0.98042,0.060895,0.019475,0.016,0.013527,0.22109,0.30564,0.41485,0.038982,0.0034147,0.0024441,0.013586,0.3507,0.27989,0.083573,36.595,5481.2,8983.8,7712.3,22215,0.43041,0.34039,0.43041,0.46783,0.50963,0.28548,0.24974,0.030186,47,85.383,1852,88034,4.8789,27.982,50004,22113,10557,0.91506,0.93818,0.32859,0.23344,0.22116,0.89381,52805,26015,0.00078034,0.00034134,0,0.049968,0,0.048951,0.0062691,0.017623,0.0004909,0.021294,0.1592,0.63292,0.21103,0.22492,0.36897,0.29899,0.25154,0.45645,0.22717,0.25226,0.47034,0.22254,38.343,8.0726,14131,28910,27702,0.096419,0.080522,0.039905,0.32613,0.31569,0.071053,0.61729,0.63043,0.095939,0.82793,0.84506,0.10335,0.94427,0.95436,0.10098,0.0034923,0.0027622,0.038943,0.0070384,0.052577,-0.061946,0.0099875,0.0079597,0.052582,0.01656,0.073817,-0.085932,0.019946,0.016047,0.062302,0.027001,0.094428,-0.1071,0.0019271,0.0015948,0.048925,0.0075201,0.039746,-0.039895,0.0055608,0.0045958,0.064309,0.015564,0.055655,-0.05427,0.010711,0.0088414,0.071983,0.02296,0.070739,-0.068883,0.0015647,0.0011671,0.034143,0.0035536,0.03307,-0.047488,0.0043976,0.0033423,0.047413,0.0094812,0.044712,-0.067423,0.0090491,0.007065,0.059433,0.017069,0.056721,-0.080851,4.786e-07,3.3482e-07,0.00010732,-0.0024699,0.015041,-0.013989,4.7317e-05,3.5963e-05,0.0033705,-0.0029116,0.02223,-0.020145,0.00031635,0.00024624,0.011224,-0.0021363,0.030387,-0.025972,0.4089,74,74,40,988,3,3,3,0.645
27,-0.0029303,0.0149,0.021207,-0.98933,0.0017166,-1.9378,0.95867,0.0077322,5.8795,-0.091455,3.1097,0.002408,0.87015,6.0231,0.020829,9.3751,0.0095469,0.98957,0.074048,0.041136,0.034175,0.028971,0.34076,0.274,0.31283,0.030914,0.0067914,0.0051359,0.029574,0.5038,0.18337,7.4275e-05,73.568,1547.3,2243.4,1889.8,5754.9,0.38387,0.17468,0.38387,2.3439,2.9163,0.75891,0.18394,0.016002,96,16.188,431,3018.3,5.176,34.177,11637,6075,5670,0.92002,0.9465,0.053754,0.03466,0.036094,0.34571,19599,13464,0.00064962,0.00034057,0,0.043006,0,0.050432,0.0060418,0.0010462,0.017392,0.0025001,1.0421,1.2088,0.22957,0.22821,0.31376,0.31348,0.28497,0.2563,0.21693,0.28801,0.24912,0.19724,17.175,8.4639,7669.5,12011,10060,0.38446,0.4151,0.097614,0.64629,0.67633,0.08638,0.73713,0.75998,0.070283,0.82211,0.8377,0.062955,0.90639,0.91766,0.059463,0.0078381,0.0079449,0.053621,0.020779,0.069909,0.0068591,0.016246,0.016238,0.052473,0.026629,0.090534,-0.00034062,0.02521,0.024896,0.048307,0.029553,0.10678,-0.0092307,0.0042883,0.0044804,0.06679,0.018706,0.054303,0.017041,0.0089914,0.009301,0.063791,0.023401,0.070783,0.016675,0.014306,0.014652,0.058983,0.026485,0.084737,0.013501,0.0027194,0.0026742,0.036405,0.0083147,0.041463,-0.0045281,0.0051345,0.004959,0.033961,0.0096658,0.050981,-0.012017,0.007817,0.007427,0.031497,0.01047,0.057592,-0.020474,0.00083034,0.00079034,0.11423,0.014796,0.025137,-0.0094294,0.0021478,0.0020028,0.093857,0.016425,0.032923,-0.015677,0.0031896,0.0029125,0.069426,0.014793,0.039857,-0.022263,0.4674,74,74,40,988,3,3,3,0.645
27,-0.004046,0.01995,0.028598,-0.98558,0.0019536,-1.9369,0.96524,-0.56574,3.9839,-0.068949,3.2834,6.2158e-05,0.62892,3.716,0.028587,4.9981,0.0050897,0.98569,0.076008,0.035946,0.029759,0.025262,0.27153,0.25586,0.39979,0.037051,0.0059785,0.0043912,0.025401,0.4118,0.16046,0.044228,52.106,1996.1,3069.1,2545.7,7663.7,0.24502,0.21624,0.24502,0.55333,0.72854,0.26961,0.21332,0.022295,51,72.667,1609,61909,5.004,29.687,43443,19143,10503,0.91619,0.93988,0.31251,0.22056,0.21882,0.89319,37581,22675,0.00068941,0.0003903,0,0.066615,0,0.068374,0.005062,0.0035251,0.0028065,0.025289,0.75476,1.7978,0.52888,0.21693,0.37429,0.30875,0.20924,0.49165,0.26,0.20771,0.50407,0.25719,48.392,8.3362,14089,27895,26459,0.065859,0.053055,0.025259,0.20695,0.17807,0.041782,0.39012,0.35281,0.056187,0.52961,0.4916,0.061262,0.62337,0.58059,0.061775,0.0030482,0.0034041,0.0315,0.0048434,0.043231,0.033994,0.0097019,0.011462,0.047333,0.015157,0.063692,0.076079,0.019309,0.023388,0.05589,0.024703,0.082108,0.11324,0.0014504,0.0013357,0.034123,0.0040362,0.029009,-0.014232,0.0042994,0.0043931,0.046075,0.0098639,0.042684,0.0058237,0.0081483,0.008624,0.050745,0.014543,0.054958,0.019829,0.00027854,0.00020699,0.0056326,-0.0041958,0.023753,-0.026246,0.00092819,0.00068616,0.0092736,-0.004067,0.030152,-0.035317,0.0019426,0.0014338,0.011823,-0.0038068,0.034989,-0.043798,0.0013193,0.0018615,0.27415,0.030398,0.040406,0.088373,0.004547,0.0064362,0.30014,0.046592,0.059974,0.12321,0.0095286,0.013562,0.31329,0.063025,0.079592,0.16235,0.36684,74,74,40,988,3,3,3,0.645
27,-0.0027835,0.013269,0.01916,-0.99036,0.0010808,-1.9524,0.97139,-0.51473,3.642,-0.029581,3.2505,0.00015379,0.6618,4.7686,0.019222,7.478,0.0076151,0.99038,0.036688,0.014566,0.011998,0.010027,0.38886,0.24083,0.33263,0.022392,0.0026629,0.002053,0.010569,0.52281,0.090915,0.00034356,181.4,12173,16919,17593,46868,0.34358,0.18099,0.34358,2.5679,3.1307,0.6693,0.17562,0.015098,43,41.349,1024,30309,4.8216,25.698,27648,15228,1944,0.91935,0.94583,0.17278,0.12869,0.058137,0.82837,24337,14204,0.0006523,0.00033478,0,0.056202,0,0.065058,0.0067866,0.017343,0.012298,0.025656,0.42914,0.14969,0.39502,0.21289,0.29842,0.27749,0.20207,0.17966,0.10039,0.16096,0.1265,0.064178,23.243,7.4921,28736,53138,52453,0.50539,0.59415,0.10288,0.77079,0.84788,0.082595,0.85997,0.91032,0.065738,0.91254,0.94499,0.056024,0.94571,0.96533,0.049742,0.0013571,0.00082015,0.007443,-0.0018087,0.043093,-0.043241,0.003362,0.0020497,0.0087055,-0.0014305,0.057846,-0.052837,0.0060497,0.003712,0.009294,-0.0012233,0.070108,-0.065357,0.00088879,0.00054119,0.011098,0.00019545,0.030874,-0.034823,0.0020788,0.0012687,0.011824,0.00063375,0.041513,-0.039638,0.0034965,0.002137,0.011557,0.00062029,0.051664,-0.048486,0.00026813,0.00015456,0.0028777,-0.0030869,0.025299,-0.016576,0.00055264,0.00032671,0.0029306,-0.0039839,0.033216,-0.022251,0.0013016,0.00079377,0.0042046,-0.004083,0.039261,-0.035665,0.00020013,0.00012441,0.022073,0.001875,0.026215,-0.027031,0.00075745,0.00047023,0.026537,0.0036213,0.033229,-0.02913,0.0014946,0.00092406,0.026082,0.0045454,0.038803,-0.032735,0.40449,74,74,40,988,3,3,3,0.645
27,-0.0058889,0.028824,0.041245,-0.97914,0.0028465,-1.9239,0.96488,0.44666,4.8784,0.07521,3.2471,0.00059867,0.9663,4.7496,0.041308,7.6415,0.0077815,0.97932,0.095481,0.036491,0.030723,0.026052,0.26784,0.19127,0.45176,0.053125,0.0055211,0.0045165,0.025964,0.4222,0.054723,0.11548,17.814,2135.5,2551.1,2139.5,6844.6,0.10923,0.11529,0.11529,1.1295,1.1596,0.34875,0.26281,0.034081,39,103.38,2478,1.8122e+05,4.8698,26.408,66906,29349,5859,0.91513,0.93309,0.077413,0.060725,0.028169,0.16355,37045,18735,0.0009204,0.00043443,0,0.075278,0,0.071289,0.0044554,0.02191,0.0045343,0.029767,0.28344,0.4197,0.024997,0.20657,0.28979,0.2695,0.19372,0.27324,0.17941,0.15604,0.21621,0.1307,29.055,7.2764,25408,77505,76815,0.36013,0.43626,0.14576,0.61755,0.70736,0.13158,0.77118,0.82941,0.11722,0.89794,0.92977,0.10962,0.96121,0.97422,0.10053,0.0026267,0.0015676,0.028646,0.0030986,0.042688,-0.050213,0.0064725,0.0039005,0.033325,0.0066108,0.056431,-0.069288,0.011642,0.007095,0.035563,0.0097072,0.068048,-0.085147,0.0023663,0.0014159,0.058751,0.010463,0.037744,-0.046773,0.005704,0.0034548,0.064511,0.015984,0.0497,-0.06433,0.010249,0.0062889,0.067359,0.021302,0.060682,-0.079348,0.00024482,0.00014311,0.0052247,-0.0045179,0.020825,-0.018046,0.0007272,0.00042603,0.0076676,-0.0049656,0.027242,-0.024887,0.0014421,0.00085075,0.0092626,-0.0053771,0.032104,-0.032145,1.5617e-05,8.5993e-06,0.0034248,-0.0020552,0.017225,-0.011261,8.9302e-05,4.9173e-05,0.0062209,-0.0024049,0.022385,-0.011261,0.00017905,9.8593e-05,0.0062127,-0.0031091,0.027659,-0.011261,0.44202,74,74,40,988,3,3,3,0.645
27,-0.0051326,0.024533,0.035695,-0.98197,0.0016376,-1.9412,0.97679,0.15308,4.7526,-0.026426,3.2388,0.00035937,1.1043,5.8213,0.035916,8.4325,0.0085871,0.98202,0.058914,0.02064,0.015981,0.013059,0.2315,0.32068,0.39172,0.03571,0.0045299,0.0028628,0.012999,0.37652,0.29518,0.077346,44.427,3004.8,6154.7,8239.2,17444,0.19856,0.22005,0.22005,1.4768,1.6254,0.44775,0.23835,0.027148,70,42.886,1092,27661,5.3753,31.542,29484,24003,4266,0.92028,0.94673,0.21372,0.13681,0.16387,0.71278,28293,17275,0.00083911,0.00036872,0,0.049147,0,0.062547,0.0037403,0.0070011,0.016801,0.0032154,0.59981,0.72849,0.078259,0.23762,0.34637,0.30213,0.28816,0.40134,0.21767,0.28235,0.40972,0.21906,26.36,8.1575,7117,12556,10376,0.17498,0.168,0.061831,0.41028,0.40557,0.076316,0.60338,0.60508,0.080065,0.75478,0.76106,0.080439,0.8558,0.86261,0.078136,0.0063554,0.006,0.060508,0.018408,0.069998,-0.029707,0.0125,0.01178,0.056188,0.021789,0.088829,-0.040798,0.02098,0.019738,0.055951,0.026883,0.10756,-0.053145,0.0012602,0.0011228,0.027316,0.0026478,0.047426,-0.032682,0.0039632,0.0036063,0.039131,0.0081548,0.062966,-0.042737,0.0086913,0.0080285,0.049869,0.015481,0.078512,-0.047523,0.0048642,0.0046782,0.090624,0.022012,0.049572,-0.016714,0.0076966,0.0074566,0.070849,0.020773,0.058206,-0.015873,0.010539,0.010222,0.059098,0.019814,0.06616,-0.017751,0.00023093,0.00019898,0.044213,0.0032142,0.017087,-0.021927,0.00084048,0.00071703,0.051114,0.0056642,0.026802,-0.030605,0.0017587,0.0014942,0.053276,0.0078022,0.037226,-0.040335,0.46025,74,74,40,988,3,3,3,0.645
