------------------------------------------
Setting up environment variables
---
LD_LIBRARY_PATH is .:/opt/software/fix/1.065/MATLAB_Compiler_Runtime/v83/runtime/glnxa64:/opt/software/fix/1.065/MATLAB_Compiler_Runtime/v83/bin/glnxa64:/opt/software/fix/1.065/MATLAB_Compiler_Runtime/v83/sys/os/glnxa64
Warning: Name is nonexistent or not a directory: /usr/local/fsl/etc/matlab
[> In path at 109
  In startup at 1] 
Warning: Name is nonexistent or not a directory: /usr/local/fmrib/fmt
[> In path at 109
  In startup at 2] 
/home/mpib/LNDG/StateSwitch/WIP_rest/preproc/B_data/D_preproc/1164/preproc/rest/FEAT.feat/
    26     1

    26     2

    26     3

    26     4

    26     5

    26     6

    26     7

    26     8

    26     9

    26    10

    26    11

    26    12

    26    13

    26    14

    26    15

    26    16

    26    17

    26    18

    26    19

    26    20

    26    21

    26    22

    26    23

    26    24

    26    25

    26    26

End of Matlab Script
