0.1429569223  
0.1133679118  
0.07619517912  
0.02659609701  
-0.03704194038  
-0.1124091047  
-0.1932884336  
-0.2703021798  
-0.332272544  
-0.3679916815  
-0.3681181188  
-0.3268774218  
-0.2432787677  
-0.1216284135  
0.02877238726  
0.194705238  
0.3607347525  
0.5112493938  
0.6325129992  
0.7143865481  
0.7514411463  
0.7432933498  
0.6941358679  
0.611584091  
0.5050779917  
0.3841578701  
0.2569429375  
0.1290951564  
0.003432364449  
-0.1197552283  
-0.2418015902  
-0.3643871426  
-0.4881749601  
-0.6116729673  
-0.7305657269  
-0.8376832655  
-0.9236342353  
-0.978011661  
-0.9909639626  
-0.9548620404  
-0.8657802223  
-0.724529711  
-0.537081963  
-0.3143072652  
-0.07106694423  
0.1752005622  
0.4062043069  
0.6046002141  
0.7556472234  
0.8485363697  
0.8772729896  
0.8410572914  
0.7441767833  
0.5954617377  
0.4073963342  
0.1949810705  
-0.02555417701  
-0.2380941588  
-0.4279541434  
-0.5830876463  
-0.6950958042  
-0.7599576238  
-0.778395184  
-0.7558019476  
-0.7017025442  
-0.628746874  
-0.5513083767  
-0.4838104458  
-0.4389728159  
-0.4261765567  
-0.4501832511  
-0.5103895636  
-0.6007429347  
-0.7103736771  
-0.8248705499  
-0.9280624444  
-1.004067582  
-1.03934254  
-1.024456119  
-0.9553406515  
-0.833862702  
-0.6676374282  
-0.4691215354  
-0.254127442  
-0.03995327777  
0.1566041061  
0.3211072485  
0.4429783828  
0.5164765218  
0.5410653932  
0.5211692826  
0.4653839234  
0.3852748284  
0.2939276381  
0.2044254535  
0.1284234478  
0.07496164756  
0.04962166777  
0.05409503641  
0.08618302928  
0.1402198857  
0.2078622478  
0.2791680047  
0.3438537009  
0.3926079183  
0.418311829  
0.4170408736  
0.3887162716  
0.3373099757  
0.2705600089  
0.1991940657  
0.1357294505  
0.09297273045  
0.08238855971  
0.1125389131  
0.1877989968  
0.3075286871  
0.465835122  
0.6519855774  
0.8514447933  
1.047437369  
1.222835512  
1.362147652  
1.453336289  
1.48922579  
1.468303884  
1.394790298  
1.27797597  
1.130903772  
0.9685878855  
0.8060204228  
0.6562509001  
0.5288154298  
0.4287344975  
0.3562166414  
0.3070876513  
0.2738661271  
0.2472941408  
0.2180757678  
0.1785398661  
0.1239669978  
0.05337724925  
-0.03034327847  
-0.12097883  
-0.2101037823  
-0.2885961075  
-0.3483137679  
-0.3836737958  
-0.3928856769  
-0.3786465408  
-0.3481740701  
-0.3125486322  
-0.2854249252  
-0.2812701415  
-0.3133455499  
-0.3916992615  
-0.5214424509  
-0.7015625045  
-0.9244602466  
-1.176315463  
-1.43827886  
-1.688369425  
-1.903862958  
-2.063879067  
-2.151836559  
-2.157452949  
-2.078029689  
-1.918841314  
-1.692579374  
-1.417922402  
-1.117414392  
-0.8149249886  
-0.5330172315  
-0.2905341189  
-0.100704307  
0.03003894213  
0.1023984236  
0.1237101773  
0.1066878289  
0.06758635902  
0.0240206441  
-0.007298189512  
-0.01263773933  
0.01709801668  
0.08532607392  
0.1894696384  
0.3214021605  
0.4686060933  
0.6159068179  
0.7475700787  
0.8495102198  
0.9113222542  
0.9278654631  
0.9001703827  
0.8355216339  
0.7466594359  
0.6501799003  
0.56430946  
0.5063319154  
0.4900201697  
0.5234247182  
0.6073607364  
0.7348376343  
0.891565959  
1.057524666  
1.209415872  
1.323714112  
1.379900383  
1.363442113  
1.268087516  
1.097138181  
0.8634766963  
0.5883073175  
0.2987449596  
0.02454068615  
-0.2056299556  
-0.3678367003  
-0.4460301724  
-0.4342346372  
-0.3374979234  
-0.1714713059  
0.03932664779  
0.2643424715  
0.4705588995  
0.6263528844  
0.7051681767  
0.6885602455  
0.5682631278  
0.3470566642  
0.03837768448  
-0.3352467715  
-0.7447037515  
-1.157411295  
-1.540666205  
-1.86482642  
-2.10600124  
-2.247974374  
-2.283224076  
-2.212999793  
-2.046537239  
-1.799569177  
-1.492364156  
-1.147536517  
-0.7878765926  
-0.4344107446  
-0.1048645892  
0.1873743194  
0.4337502753  
0.6305022139  
0.7781703751  
0.8807477748  
0.9446106749  
0.977365242  
0.9867504442  
0.979710861  
0.9617275542  
0.9364578966  
0.9056921233  
0.869593397  
0.8271542892  
0.7767834425  
0.7169133808  
0.646548433  
0.5656625402  
0.4754139484  
0.3781504997  
0.2772369324  
0.176739195  
0.08103543932  
-0.005591883978  
-0.07932362782  
-0.1370930391  
-0.1767815666  
-0.1973285613  
-0.1987694577  
-0.1822304353  
-0.149900661  
-0.1049956637  
-0.05170507431  
0.004888690672  
0.0589538405  
0.1041354274  
0.1338865467  
0.1419009643  
0.1226241158  
0.07179265027  
-0.01305991684  
-0.1322029503  
-0.283477611  
-0.4622748621  
-0.6617410907  
-0.873192222  
-1.086695329  
-1.291750441  
-1.478005225  
-1.63593221  
-1.757414783  
-1.836203613  
-1.868222885  
-1.851726482  
-1.787300273  
-1.677733644  
-1.527768225  
-1.343746068  
-1.13317398  
-0.9042316347  
-0.6652535332  
-0.4242172473  
-0.188275594  
0.03662798862  
0.2460397265  
0.4371409812  
0.6087583176  
0.7612387013  
0.8962076853  
1.016236799  
1.124443845  
1.224065454  
1.31802695  
1.408532041  
1.496706097  
1.582311857  
1.663553257  
1.737007617  
1.797690203  
1.8392876  
1.854562276  
1.835931067  
1.776202293  
1.669424847  
1.511792707  
1.302507244  
1.044508718  
0.7449563817  
0.4153608199  
0.07129269865  
-0.2683735833  
-0.582672017  
-0.8501398143  
-1.050669488  
-1.167442257  
-1.188731624  
-1.109366863  
-0.9316533766  
-0.665607089  
-0.3284246258  
0.05680748713  
0.4630577784  
0.8617685655  
1.225499787  
1.530504533  
1.758940904  
1.900460899  
1.952968496  
1.922450905  
1.821883369  
1.669338988  
1.485532184  
1.291105959  
1.104026907  
0.9374219168  
0.7981626369  
0.6863732399  
0.5959270923  
0.515840441  
0.4323364517  
0.3312580193  
0.2004519245  
0.03176295263  
-0.1776650349  
-0.4249409203  
-0.7018765327  
-0.9962052326  
-1.293334885  
-1.57831554  
-1.837695247  
-2.060971469  
-2.241447203  
-2.37641338  
-2.466709846  
-2.515827745  
-2.528765802  
-2.510891653  
-2.467013412  
-2.400806785  
-2.314652517  
-2.209848746  
-2.087091635  
-1.947073501  
-1.791046784  
-1.621215564  
-1.440881604  
-1.254322961  
-1.066449744  
-0.8823198892  
-0.7066195142  
-0.5432177277  
-0.3948614253  
-0.26305577  
-0.1481230782  
-0.04939271146  
0.03453426991  
0.1055192678  
0.1656639165  
0.217164936  
0.2622332239  
0.3030473998  
0.3416977403  
0.3800745842  
0.4196822155  
0.4613776439  
0.5050866533  
0.5495545859  
0.5922220193  
0.6292947068  
0.6560546502  
0.6674158509  
0.658668513  
0.6263162694  
0.5688678523  
0.4874429348  
0.3860589743  
0.2715152671  
0.1528506366  
0.04042530974  
-0.05526311804  
-0.1248550375  
-0.1613104642  
-0.1608104831  
-0.1232370686  
-0.05214678716  
0.04575702332  
0.1615752219  
0.2854371079  
0.4078073147  
0.5206685171  
0.6184017702  
0.6982344519  
0.760211278  
0.8067084636  
0.8416133027  
0.8693200004  
0.8937429544  
0.9175245947  
0.941579704  
0.9650467017  
0.9856487279  
1.000370773  
1.006310577  
1.001528369  
0.985707156  
0.9604831008  
0.9293649587  
0.8972377703  
0.8695327145  
0.8512067538  
0.8457282303  
0.854260564  
0.8752045462  
0.9042081723  
0.9346583006  
0.9585825974  
0.9678185663  
0.9552482585  
0.9158893651  
0.8476548306  
0.7516566569  
0.6320126491  
0.495204373  
0.3491204766  
0.2019657075  
0.06124164005  
-0.0670287225  
-0.1787098129  
-0.2715640546  
-0.3449137535  
-0.3990738823  
-0.4347334163  
-0.4524466731  
-0.4523852406  
-0.4344183356  
-0.3985144274  
-0.3453717776  
-0.2771229411  
-0.1979197415  
-0.1142224684  
-0.03465950231  
0.03060007675  
0.07091897036  
0.07657509862  
0.04024807114  
-0.0416293351  
-0.1679034482  
-0.3323058354  
-0.5237484165  
-0.7273163334  
-0.9258614218  
-1.10199536  
-1.240223756  
-1.328918397  
-1.361852267  
-1.339057894  
-1.266880313  
-1.157186609  
-1.025831835  
-0.8905729874  
-0.768716688  
-0.674828444  
-0.6188216259  
-0.6047066577  
-0.6301788259  
-0.6871034125  
-0.7628372367  
-0.8421843869  
-0.9097015073  
-0.9520136986  
-0.9597951707  
-0.9291235062  
-0.862016636  
-0.7660695263  
-0.6532618259  
-0.5381212589  
-0.4355192374  
-0.3584437779  
-0.3160700847  
-0.3124256377  
-0.345828996  
-0.4091790099  
-0.4910358435  
-0.5773130695  
-0.6533222124  
-0.7058574387  
-0.7250156275  
-0.7054916948  
-0.6471776395  
-0.5550017786  
-0.4380504455  
-0.3081354346  
-0.1780191994  
-0.05957694844  
0.0378483348  
0.1086613753  
0.1516528222  
0.1699816233  
0.1705330828  
0.162767293  
0.1572342997  
0.1639840583  
0.1911003579  
0.2435584792  
0.3225739044  
0.4255112811  
0.5463671857  
0.6767411958  
0.8071622905  
0.9285681244  
1.033734333  
1.118440817  
1.182199923  
1.228428528  
1.264012728  
1.298293247  
1.341585023  
1.403405853  
1.490652148  
1.605975497  
1.74661326  
1.903892417  
2.063539055  
2.206839954  
2.312581779  
2.359569808  
2.329436144  
2.209369678  
1.99438308  
1.688753326  
1.306379872  
0.8699162154  
0.4087154434  
-0.04420947738  
-0.4558499561  
-0.7970273227  
-1.045867219  
-1.190444703  
-1.230219201  
-1.176048077  
-1.048750747  
-0.8764161971  
-0.6908080341  
-0.5233595876  
-0.4012949424  
-0.3443941059  
-0.3628124445  
-0.4562080182  
-0.6142464191  
-0.8183400963  
-1.044339522  
-1.265759075  
-1.457076018  
-1.596674987  
-1.669076281  
-1.666225619  
-1.587768542  
-1.440384631  
-1.236363056  
-0.9917085497  
-0.7240730216  
-0.4508120885  
-0.187394903  
0.0536703331  
0.2633482713  
0.4360523211  
0.5691988575  
0.6624922409  
0.7171152931  
0.7349887789  
0.7182183833  
0.6688008529  
0.588602105  
0.4795558818  
0.3440067436  
0.1850798959  
0.006981754386  
-0.1848651905  
-0.3838949766  
-0.5826892152  
-0.7734508653  
-0.9485883075  
-1.101323219  
-1.226225602  
-1.319603327  
-1.379687618  
-1.406596818  
-1.40209146  
-1.369164375  
-1.311523101  
-1.233041115  
-1.137247422  
-1.026910129  
-0.9037675236  
-0.7684220923  
-0.6204111758  
-0.4584356668  
-0.280721889  
-0.08547328178  
0.1286341441  
0.3619662095  
0.6135077882  
0.8805476768  
1.158513933  
1.440989999  
1.719925774  
1.986043554  
2.229420825  
2.440205789  
2.609412501  
2.729709956  
2.796126794  
2.8065713  
2.762089087  
2.666799642  
2.527486137  
2.352860555  
2.152575975  
1.936105426  
1.711641891  
1.485177115  
1.259922405  
1.036165047  
0.8116121848  
0.5821768588  
0.3430885575  
0.09015430918  
-0.1790492533  
-0.4642411692  
-0.7619308747  
-1.065409108  
-1.365235166  
-1.650131674  
-1.908131153  
-2.12779634  
-2.299344947  
-2.415536215  
-2.472242551  
-2.468686557  
-2.407371105  
-2.293772705  
-2.135878731  
-1.943644158  
-1.728421618  
-1.50239851  
-1.278047453  
-1.067576717  
-0.8823747503  
-0.7324364866  
-0.6257780608  
-0.567875121  
-0.5611653283  
-0.6046817175  
-0.6938792623  
-0.8207245343  
-0.9740848002  
-1.14042952  
-1.304825626  
-1.452145869  
-1.568385965  
-1.641937472  
-1.66465841  
-1.632577881  
-1.546117902  
-1.409757731  
-1.231157413  
-1.019836359  
-0.7855885598  
-0.5368788229  
-0.2794922849  
-0.01569739779  
0.2558806793  
0.5395858949  
0.8412825962  
1.166317396  
1.517189208  
1.891321211  
2.279358848  
2.664384874  
3.022333413  
3.323728454  
3.536662139  
3.630717643  
3.581351407  
3.374122629  
3.008107568  
2.497897606  
1.873737069  
1.17959694  
0.4692757976  
-0.1990713442  
-0.7693263018  
-1.193894572  
-1.439405165  
-1.490821158  
-1.353371133  
-1.051999584  
-0.6283917874  
-0.1359599952  
0.3665323731  
0.8218665624  
1.180874901  
1.407737717  
1.483437101  
1.407013376  
1.194570082  
0.8762918973  
0.4919724967  
0.08572369146  
-0.2994059974  
-0.6262219828  
-0.8670350114  
-1.005834988  
-1.038862645  
-0.9736998269  
-0.8271613152  
-0.6224026601  
-0.3857058235  
-0.1433705796  
0.08092759446  
0.2680949535  
0.404770385  
0.4837143222  
0.5035281476  
0.4679000276  
0.3845493117  
0.2640650529  
0.1187717306  
-0.03827948452  
-0.1941567165  
-0.3367203673  
-0.4551514206  
-0.540374434  
-0.5853985672  
-0.5856098912  
-0.5390107158  
-0.4463996593  
-0.3114582837  
-0.1407198871  
0.05662130992  
0.2690809326  
0.483452235  
0.685551497  
0.8611252325  
0.996850634  
1.081363538  
1.106218942  
1.066685825  
0.9622826773  
0.796972517  
0.578967792  
0.320131607  
0.03501420356  
-0.2603937984  
-0.550066182  
-0.8193383101  
-1.056142082  
-1.251914467  
-1.40206427  
-1.505946614  
-1.566343333  
-1.588546237  
-1.5791791  
-1.544960279  
-1.491588654  
-1.422953128  
-1.340779811  
-1.244779873  
-1.133261273  
-1.004100661  
-0.8558816411  
-0.6890041827  
-0.5065335763  
-0.3146248611  
-0.1224060529  
0.05869651289  
0.2161256106  
0.3376899639  
0.4131814794  
0.4358638713  
0.403612225  
0.3195060222  
0.1917809377  
0.03311752134  
-0.1406516472  
-0.3122507124  
-0.4648643414  
-0.5839912956  
-0.6590035848  
-0.6842163024  
-0.6593442291  
-0.5892934939  
-0.4833363786  
-0.3537922115  
-0.2143966083  
-0.07858065705  
0.04211789391  
0.1393049502  
0.2084980201  
0.2493274926  
0.2651715132  
0.262303028  
0.2486925903  
0.232655573  
0.221555005  
0.2207402015  
0.2328823471  
0.2577841414  
0.2926736563  
0.332911611  
0.3729822145  
0.4075911661  
0.432687623  
0.4462338321  
0.4486086612  
0.4425721667  
0.4328161439  
0.4251689128  
0.4256005079  
0.4391907197  
0.4692292488  
0.516595618  
0.5795099595  
0.6536960068  
0.7329093089  
0.8097415844  
0.8765674479  
0.9264675377  
0.9539940285  
0.9556631912  
0.930127555  
0.8780275915  
0.8015963819  
0.7041263626  
0.5894244899  
0.4613820475  
0.3237392234  
0.1800887311  
0.03407546217  
-0.1102808551  
-0.2482727328  
-0.3743284785  
-0.4820897776  
-0.5648031313  
-0.6160184702  
-0.6305068162  
-0.6052603314  
-0.5403682112  
-0.439591381  
-0.3104711667  
-0.1638864653  
-0.0130678007  
0.127830514  
0.2454067644  
0.3286926905  
0.3705855948  
0.3687973032  
0.3261705292  
0.2503069461  
0.1525525747  
0.04649829992  
-0.05378257217  
-0.1355054524  
-0.1886963093  
-0.2072644034  
-0.1895018149  
-0.1379728002  
-0.05886328503  
0.03907821026  
0.1458141004  
0.2512992714  
0.346592872  
0.4246526648  
0.4807513327  
0.512500753  
0.5195631506  
0.503140508  
0.4653812284  
0.4088191704  
0.3359448321  
0.2489612759  
0.1497392398  
0.03993739794  
-0.07876711988  
-0.2044074532  
-0.3344884666  
-0.4658355698  
-0.5945659476  
-0.7161868677  
-0.8258256644  
-0.9185477859  
-0.9897416435  
-1.035527654  
-1.053151512  
-1.041330874  
-1.000519451  
-0.9330547348  
-0.8431645358  
-0.7368081512  
-0.6213403782  
-0.5050037529  
-0.3962843147  
-0.3031739969  
-0.2324195951  
-0.1888415985  
-0.174806834  
-0.1899305284  
-0.2310482852  
-0.2924697217  
-0.3664889139  
-0.4440827879  
-0.5157191399  
-0.5721757551  
-0.6052883515  
-0.6085596899  
-0.5775855174  
-0.5102963772  
-0.4070228216  
-0.27041317  
-0.1052433486  
0.08186273542  
0.2827856097  
0.4883256889  
0.6886980183  
0.8740952306  
1.03531369  
1.164412402  
1.255347844  
1.304514298  
1.311107717  
1.277242728  
1.207770281  
1.109786367  
0.9918660359  
0.8631117692  
0.7321341431  
0.6061088806  
0.490055194  
0.3864426125  
0.295185841  
0.2140302708  
0.1392493282  
