0.1321112156  
0.01759445505  
-0.08763002063  
-0.1745595769  
-0.2358268976  
-0.2662807119  
-0.2633688134  
-0.2272955665  
-0.1609420914  
-0.0695607286  
0.03973208356  
0.1586089186  
0.278274749  
0.390217106  
0.486893699  
0.5622873909  
0.6122808999  
0.6348274347  
0.6299186463  
0.5993803071  
0.5465398809  
0.4758251522  
0.3923434194  
0.3014928776  
0.2086231792  
0.1187635046  
0.03640194032  
-0.03469456888  
-0.09164249356  
-0.1325914594  
-0.1568662964  
-0.1650767529  
-0.1591717346  
-0.1424017162  
-0.1191574484  
-0.09466860266  
-0.07456617794  
-0.06433698517  
-0.0687224021  
-0.09113796451  
-0.1331855375  
-0.1943420032  
-0.2718737604  
-0.3610121483  
-0.4553770549  
-0.5476120694  
-0.6301518145  
-0.6960343214  
-0.7396510726  
-0.7573453956  
-0.7477829268  
-0.7120521621  
-0.6534894394  
-0.5772546817  
-0.4897188319  
-0.3977448588  
-0.3079513933  
-0.2260533224  
-0.1563452899  
-0.1013874572  
-0.06191632745  
-0.03696789026  
-0.02418817019  
-0.02027230288  
-0.02147031124  
-0.02408635245  
-0.02491260839  
-0.02154830119  
-0.01257352291  
0.002429871856  
0.02300057236  
0.04802358354  
0.07602858702  
0.105500664  
0.1351586758  
0.1641612426  
0.1922068478  
0.2195217662  
0.2467385043  
0.2746936584  
0.3041729945  
0.3356621853  
0.3691412529  
0.4039653777  
0.4388620718  
0.4720530316  
0.5014853675  
0.525149579  
0.5414243389  
0.5494054602  
0.5491501737  
0.5417941511  
0.5295097872  
0.5152955637  
0.5026138075  
0.4949188957  
0.4951358872  
0.5051633906  
0.5254691496  
0.5548505922  
0.5903983177  
0.6276860893  
0.6611785584  
0.6848144817  
0.6927032774  
0.6798481978  
0.6428075129  
0.5802027382  
0.4930045791  
0.3845447719  
0.2602433253  
0.1270733017  
-0.007177688358  
-0.134756773  
-0.2487984122  
-0.3440626341  
-0.4174566026  
-0.468262323  
-0.4980371678  
-0.5101972479  
-0.5093477079  
-0.5004635476  
-0.4880486708  
-0.4754100825  
-0.4641701869  
-0.4540965926  
-0.4432843324  
-0.4286667604  
-0.4067622733  
-0.3745400353  
-0.3302431828  
-0.274024998  
-0.2082714447  
-0.1375391737  
-0.06810083489  
-0.00715429891  
0.03818344255  
0.06193778254  
0.06022668437  
0.03193693546  
-0.02098407842  
-0.09367516266  
-0.1789303961  
-0.2681049339  
-0.3522261215  
-0.4231432974  
-0.4745523186  
-0.502752994  
-0.5070403216  
-0.4896881691  
-0.4555434279  
-0.4113032597  
-0.3645842164  
-0.3229185785  
-0.2928151189  
-0.2789947956  
-0.2838978414  
-0.3074973281  
-0.3474256941  
-0.3993716672  
-0.4576734141  
-0.5160151536  
-0.568128799  
-0.6084107936  
-0.6323810169  
-0.6369488299  
-0.6204715406  
-0.5826328756  
-0.5241856004  
-0.4466239921  
-0.3518516514  
-0.2419045323  
-0.1187731602  
0.0156551428  
0.1595381983  
0.31092664  
0.4675582244  
0.6266468611  
0.7847124419  
0.9374921978  
1.079964071  
1.206495553  
1.311119514  
1.387920035  
1.431499996  
1.43749148  
1.403058641  
1.327334046  
1.211736318  
1.060111932  
0.8786636656  
0.6756410861  
0.4608037928  
0.2446886192  
0.03774991169  
-0.150536455  
-0.3124993044  
-0.4429220444  
-0.5394303339  
-0.6025594052  
-0.6354905023  
-0.6434981173  
-0.6331864525  
-0.6116307405  
-0.5855547823  
-0.5606595552  
-0.5411963885  
-0.5298257069  
-0.5277563012  
-0.5351019434  
-0.5513606092  
-0.5758935148  
-0.6082921113  
-0.6485409457  
-0.6969308645  
-0.7537397215  
-0.8187413495  
-0.8906660664  
-0.9667473468  
-1.042501236  
-1.111847175  
-1.167625968  
-1.202495115  
-1.210100904  
-1.186355191  
-1.130589409  
-1.046350433  
-0.9416179612  
-0.8283059749  
-0.7209969029  
-0.6349957207  
-0.5839166684  
-0.5771210509  
-0.617402617  
-0.6993270654  
-0.808585686  
-0.9226023526  
-1.012470764  
-1.046091283  
-0.9921788992  
-0.8246441845  
-0.5267364539  
-0.09432656723  
0.462213714  
1.117913761  
1.83500544  
2.566470798  
3.26091101  
3.868097111  
4.344453147  
4.65772585  
4.790221923  
4.740220815  
4.52144568  
4.160775809  
3.694608343  
3.164454275  
2.612392078  
2.076963061  
1.589953472  
1.174332402  
0.8434105062  
0.6011149599  
0.4431550267  
0.3587691915  
0.3327540624  
0.3474923838  
0.3847839324  
0.4273476527  
0.4599454857  
0.470135067  
0.4486939063  
0.3897703811  
0.2908216048  
0.1523774161  
-0.02233006998  
-0.2278510979  
-0.4570895353  
-0.7019333426  
-0.9539003329  
-1.20475086  
-1.44701391  
-1.674377097  
-1.881905083  
-2.066075272  
-2.224648924  
-2.356415422  
-2.460874252  
-2.537922999  
-2.58761753  
-2.610047845  
-2.605356388  
-2.573880966  
-2.516386431  
-2.434322957  
-2.330031726  
-2.206836955  
-2.068965417  
-1.921276558  
-1.768811327  
-1.616222657  
-1.467162015  
-1.323733489  
-1.186121308  
-1.052484795  
-0.9191751498  
-0.7812907353  
-0.6335114281  
-0.4711246962  
-0.291086007  
-0.0929490066  
0.1204998216  
0.343042216  
0.5653367967  
0.7757473876  
0.9615950739  
1.110692379  
1.212931207  
1.261701953  
1.254908413  
1.195422855  
1.090887598  
0.9528845983  
0.7955797536  
0.6340437303  
0.4824857404  
0.3526550791  
0.2526280027  
0.1861362939  
0.1525010928  
0.1471524923  
0.1626177513  
0.1898118491  
0.2194256526  
0.2432028033  
0.2549444468  
0.2511155161  
0.2310101868  
0.1964995318  
0.1514384115  
0.1008619415  
0.05011689562  
0.004061304478  
-0.03354668862  
-0.06040110587  
-0.0757220622  
-0.08006986881  
-0.07497009703  
-0.06243457524  
-0.04447921107  
-0.02272407813  
0.001853873238  
0.02898483224  
0.05898970088  
0.09251245946  
0.130167792  
0.1721735242  
0.2180487755  
0.2664360121  
0.3150925437  
0.3610644293  
0.4010174282  
0.4316850938  
0.4503568338  
0.4553295597  
0.4462467948  
0.4242594411  
0.3919749758  
0.3531908868  
0.3124406149  
0.2744166471  
0.2433494795  
0.2224357018  
0.2134019897  
0.2162728375  
0.2293796332  
0.2496114786  
0.2728781511  
0.2947120592  
0.3109234905  
0.3182118204  
0.314640747  
0.2999097297  
0.2753783994  
0.2438466647  
0.2091257984  
0.1754647786  
0.146926515  
0.1268044232  
0.1171722211  
0.1186267701  
0.1302659252  
0.1498898298  
0.1743956346  
0.2002920123  
0.2242541956  
0.2436276784  
0.2568070158  
0.2634303594  
0.2643661112  
0.2615007391  
0.2573636387  
0.2546543965  
0.2557497035  
0.2622684364  
0.2747627425  
0.2925850199  
0.3139519485  
0.3361913971  
0.3561377058  
0.3706088992  
0.376892277  
0.3731587108  
0.3587398928  
0.3342215486  
0.3013357447  
0.2626689011  
0.2212301212  
0.1799536832  
0.1412170831  
0.1064586684  
0.07596291099  
0.04885513008  
0.02331473742  
-0.00303072546  
-0.03258709113  
-0.0672449963  
-0.1078991155  
-0.1541246386  
-0.204086335  
-0.254703889  
-0.3020739275  
-0.3420821652  
-0.371120864  
-0.3867887137  
-0.3884516922  
-0.3775568762  
-0.3576258023  
-0.3338992326  
-0.3126664662  
-0.3003632171  
-0.3025621595  
-0.3230194454  
-0.3629224739  
-0.4204817647  
-0.4909474328  
-0.5670843155  
-0.6400568874  
-0.7006157999  
-0.7404246983  
-0.7533347916  
-0.7364082801  
-0.6905326051  
-0.6205060117  
-0.5345642059  
-0.4433914074  
-0.3587460165  
-0.2918867145  
-0.2520263605  
-0.2450415455  
-0.272639295  
-0.3321117546  
-0.4167382418  
-0.5167857527  
-0.6209786322  
-0.7182218541  
-0.7993206552  
-0.8584209442  
-0.8939331898  
-0.9087567458  
-0.9097383735  
-0.906405373  
-0.9091411797  
-0.9270814563  
-0.9660715883  
-1.027052896  
-1.105211763  
-1.190123618  
-1.26698528  
-1.318849965  
-1.329600185  
-1.287224614  
-1.186863443  
-1.033050526  
-0.8406340439  
-0.6340160485  
-0.4445768451  
-0.3064436725  
-0.2510619229  
-0.3012909178  
-0.4659357201  
-0.7356770944  
-1.081271796  
-1.454642342  
-1.793080666  
-2.026325616  
-2.085764893  
-1.914596353  
-1.477473668  
-0.7681053358  
0.1865656134  
1.326562587  
2.563792702  
3.791307934  
4.895815338  
5.7717554  
6.334942741  
6.533724685  
6.355954902  
5.830668485  
5.024169728  
4.031100839  
2.961833147  
1.928067531  
1.028769621  
0.3384430909  
-0.1006721474  
-0.2815637981  
-0.2304211185  
-0.0002292452572  
0.3387940835  
0.7103208882  
1.042873537  
1.279084012  
1.382078588  
1.33835905  
1.15711596  
0.866439842  
0.5072974753  
0.1263730755  
-0.231089796  
-0.5274292559  
-0.7369454867  
-0.848105196  
-0.8635180487  
-0.797947443  
-0.6748669027  
-0.5222126355  
-0.3680119349  
-0.2365185474  
-0.1453279113  
-0.1037620527  
-0.1126163584  
-0.1651446162  
-0.2490215364  
-0.3488963284  
-0.4491207676  
-0.5362376814  
-0.6008927842  
-0.6389399103  
-0.65164097  
-0.6450047876  
-0.6284241494  
-0.6128686451  
-0.6089385009  
-0.6250789524  
-0.6662273356  
-0.7330626461  
-0.8219449377  
-0.9255110407  
-1.033803731  
-1.135738026  
-1.220673528  
-1.279860392  
-1.307569439  
-1.30175855  
-1.264225051  
-1.200247254  
-1.117801014  
-1.026475449  
-0.9362456635  
-0.856260801  
-0.7937929905  
-0.7534568775  
-0.7367730695  
-0.7421029661  
-0.7649409217  
-0.7985165159  
-0.8346345671  
-0.8646617683  
-0.8805623529  
-0.8758875936  
-0.8466212839  
-0.79180141  
-0.7138419404  
-0.6185053742  
-0.5144905889  
-0.4126384271  
-0.3247869215  
-0.2623613182  
-0.234819002  
-0.2481208866  
-0.3034252827  
-0.3962130421  
-0.5160300657  
-0.646984502  
-0.7690434319  
-0.8600714907  
-0.898425336  
-0.8658140907  
-0.7500501306  
-0.5472872797  
-0.2633781738  
0.08592819328  
0.4760757102  
0.8760155171  
1.251510591  
1.569022817  
1.799673935  
1.922747188  
1.928238867  
1.818103514  
1.606021888  
1.315724274  
0.9781137758  
0.6275897335  
0.2980768934  
0.01928663628  
-0.1863194613  
-0.3055133844  
-0.3350440601  
-0.2811333929  
-0.1578863113  
0.01508680461  
0.2154649151  
0.4210219042  
0.612090629  
0.7734011509  
0.8951343277  
0.9731562638  
1.008511719  
1.006354921  
0.9745447005  
0.9221484376  
0.8580769759  
0.790015726  
0.7237506078  
0.662906651  
0.6090561337  
0.5621023501  
0.5208205392  
0.4834340285  
0.4481297  
0.4134361413  
0.3784373854  
0.3428198983  
0.3067859277  
0.2708781969  
0.2357696484  
0.2020634347  
0.1701445217  
0.1401006582  
0.1117176116  
0.08454281655  
0.05799675102  
0.03150961689  
0.00465698552  
-0.02273010557  
-0.05049318811  
-0.07813274893  
-0.1048436229  
-0.1296075762  
-0.1513173831  
-0.168927028  
-0.1815959214  
-0.1888144073  
-0.1904886604  
-0.1869739121  
-0.1790533849  
-0.1678612342  
-0.1547647169  
-0.1412227338  
-0.1286350663  
-0.1182096795  
-0.1108602335  
-0.1071488373  
-0.1072769467  
-0.1111216006  
-0.1183090629  
-0.1283072931  
-0.1405200066  
-0.1543693876  
-0.1693482451  
-0.1850412702  
-0.2011095843  
-0.2172512853  
-0.233150052  
-0.2484233805  
-0.2625917028  
-0.2750726673  
-0.2852103611  
-0.2923371324  
-0.2958561575  
-0.295333935  
-0.2905865495  
-0.2817418723  
-0.269267188  
-0.2539564755  
-0.236874639  
-0.2192678134  
-0.2024473051  
-0.1876642695  
-0.1759911508  
-0.1682175495  
-0.1647832025  
-0.1657423757  
-0.1707731884  
-0.1792227555  
-0.1901859734  
-0.202605259  
-0.2153809271  
-0.2274763942  
-0.2380120357  
-0.2463290231  
-0.2520248825  
-0.2549557493  
-0.2552081947  
-0.2530507041  
-0.2488748183  
-0.2431400704  
-0.2363299303  
-0.2289334857  
-0.2214445321  
-0.2143804032  
-0.2083016021  
-0.2038198726  
-0.2015755782  
-0.2021748728  
-0.2060799604  
-0.2134703612  
-0.2240918246  
-0.2371326104  
-0.2511619056  
-0.2641641699  
-0.2736910279  
-0.2771285795  
-0.2720576849  
-0.2566550778  
-0.2300772632  
-0.192747453  
-0.1464847308  
-0.09442480659  
-0.040718078  
0.00997762144  
0.05314894292  
0.08513006219  
0.1037501889  
0.1088046403  
0.1022567673  
0.08810069906  
0.07188083188  
0.05990491736  
0.05825440907  
0.07173769235  
0.1029508173  
0.1516148204  
0.2143210539  
0.2847633706  
0.3544577708  
0.4138717539  
0.4538078352  
0.466834717  
0.4485378531  
0.3983807881  
0.3200175046  
0.2209807045  
0.1117721314  
0.004470256208  
-0.08893810833  
-0.1582570611  
-0.1965497975  
-0.2011472369  
-0.1740346817  
-0.1215507807  
-0.05343313829  
0.01864914148  
0.08286299053  
0.1290076907  
0.150074613  
0.1433242782  
0.1107203363  
0.05864214222  
-0.003077632577  
-0.06265052145  
-0.1081357006  
-0.1292712297  
-0.1190490747  
-0.0747859595  
0.001476941814  
0.1033141761  
0.2209402234  
0.3427561593  
0.4571736535  
0.5544181818  
0.6280235822  
0.6757685931  
0.6999010042  
0.7066072656  
0.7048087058  
0.7044727347  
0.7147107826  
0.7419697442  
0.7886113195  
0.8521249567  
0.9251130842  
0.9960817707  
1.050947611  
1.075052049  
1.05541154  
0.9828709828  
0.8538493335  
0.6714014331  
0.4454163995  
0.1918846054  
-0.06870723296  
-0.3136713262  
-0.5208175321  
-0.6712110357  
-0.7516144703  
-0.7562811672  
-0.687834165  
-0.5570874951  
-0.3818015839  
-0.1845068829  
0.01033534659  
0.1794787955  
0.3039198154  
0.3714050207  
0.3780479283  
0.3288147253  
0.2367626501  
0.1210961512  
0.004260538514  
-0.09155142675  
-0.148008732  
-0.1538544594  
-0.1072291887  
-0.01671770787  
0.09910952613  
0.2136886306  
0.2957895891  
0.3137876869  
0.240316626  
0.05666743422  
-0.2437076697  
-0.6531207996  
-1.149372757  
-1.697388386  
-2.252625372  
-2.76585537  
-3.188721272  
-3.479350557  
-3.607285543  
-3.55708837  
-3.330145195  
-2.944452292  
-2.43243473  
-1.837113694  
-1.207146787  
-0.5914005833  
-0.03374313914  
0.4313061301  
0.7815834965  
1.008651281  
1.11746677  
1.124503331  
1.054661779  
0.9374398158  
0.8028872907  
0.6778669117  
0.5830637897  
0.5310637316  
0.52566543  
0.562417403  
0.6302237092  
0.7137212403  
0.7960608538  
0.8616813017  
0.898693126  
0.9005604232  
0.8668860717  
0.8032257141  
0.7200160337  
0.6308050974  
0.5500799386  
0.4910211338  
0.4635225462  
0.4727485918  
0.5184226916  
0.594924217  
0.6921388036  
0.7969156552  
0.8948929837  
0.9724130101  
1.018259964  
1.024984841  
0.9896615993  
0.9140170162  
0.8039549909  
0.6685914959  
0.5189705704  
0.3666543525  
0.2223848275  
0.09498037847  
-0.0094164881  
-0.08768535778  
-0.1396741022  
-0.1677963427  
-0.1763789005  
-0.1708696625  
-0.1570226223  
-0.1401656716  
-0.1246287361  
-0.1133818305  
-0.1079007192  
-0.1082448537  
-0.1133114746  
-0.1212134435  
-0.1297163033  
-0.1366753191  
-0.1404200133  
-0.1400408272  
-0.1355518043  
-0.1279185121  
-0.118952188  
-0.1110874927  
-0.1070700776  
-0.1095905778  
-0.120902285  
-0.1424721199  
-0.1747045576  
-0.2167761539  
-0.2666130232  
-0.3210207611  
-0.3759661644  
-0.4269822939  
-0.4696553507  
-0.5001318242  
-0.5155831527  
-0.5145573345  
-0.4971735706  
-0.4651203313  
-0.4214577021  
-0.3702449505  
-0.3160454195  
-0.2633740069  
-0.2161667411  
-0.1773460626  
-0.1485349302  
-0.1299637226  
-0.1205662322  
-0.1182476062  
-0.1202738629  
-0.123717744  
-0.1258904327  
-0.1246949082  
-0.118852651  
-0.1079788572  
-0.09250523017  
-0.07347900756  
-0.05228258798  
-0.03032752366  
-0.008783118514  
0.01161981132  
0.03067460108  
0.04866617753  
0.0662375132  
0.08418066325  
0.1032011775  
0.1236990342  
0.145615648  
0.1683675342  
0.1908886189  
0.2117687062  
0.2294646756  
0.2425438531  
0.2499181913  
0.251025156  
0.2459233151  
0.2352864004  
0.2203013605  
0.2024840072  
0.1834534869  
0.1647013414  
0.1473978128  
0.13226513  
0.1195378541  
0.1090068703  
