-0.0951470462  
0.1624615191  
0.4230375935  
0.6883729506  
0.9573372451  
1.225000484  
1.482457032  
1.717412756  
1.91547959  
2.061997482  
2.14412219  
2.152869918  
2.084806051  
1.943103628  
1.737804195  
1.485192141  
1.206349292  
0.9250371859  
0.665176634  
0.4482265765  
0.2908099711  
0.202861516  
0.1865625713  
0.2361792992  
0.3388236446  
0.4760510864  
0.6260673099  
0.7662778558  
0.8758503748  
0.9379819421  
0.9415939515  
0.8822820317  
0.762431547  
0.5905409568  
0.3798811525  
0.1467182919  
-0.09164174431  
-0.3187185591  
-0.5203941108  
-0.6859606791  
-0.8085963986  
-0.8852870052  
-0.9163005939  
-0.9043615592  
-0.8537285005  
-0.7693528732  
-0.6562651665  
-0.519275029  
-0.3629949499  
-0.1921335213  
-0.01192614877  
0.1714336887  
0.3505385158  
0.5167945281  
0.6608220108  
0.7732216666  
0.8456296616  
0.8719184217  
0.8493479735  
0.7794499092  
0.6684592849  
0.5271439324  
0.3699761772  
0.213685326  
0.07533642964  
-0.02982417785  
-0.09046658819  
-0.100889411  
-0.06207164242  
0.01814524572  
0.1258290844  
0.2426126343  
0.3480343499  
0.4222362202  
0.4486352246  
0.4161666162  
0.3207719513  
0.1659134994  
-0.03794179674  
-0.2747742465  
-0.5251425768  
-0.7686592842  
-0.9864279963  
-1.163088608  
-1.288216798  
-1.356930887  
-1.369707486  
-1.331535805  
-1.250617216  
-1.136876076  
-1.00053042  
-0.8509356423  
-0.6958265524  
-0.5410066628  
-0.3904476206  
-0.2466944118  
-0.1114495389  
0.0138219195  
0.1273842234  
0.2269268338  
0.3094921592  
0.371652763  
0.4098760808  
0.4210113542  
0.4028172226  
0.3544327986  
0.2767370984  
0.1725510749  
0.0466630967  
-0.09432025566  
-0.2422738196  
-0.3879927955  
-0.5217284726  
-0.633813013  
-0.7153313405  
-0.7587997795  
-0.758819793  
-0.7126317678  
-0.6205063929  
-0.4859179318  
-0.3154389473  
-0.1183342334  
0.09412367005  
0.309575218  
0.5156391835  
0.7009983862  
0.8563774585  
0.9752871545  
1.054431644  
1.093729542  
1.09593545  
1.065934733  
1.009816511  
0.9338747706  
0.8437094862  
0.7435735358  
0.6360735981  
0.5222719111  
0.4021513022  
0.2753410339  
0.1419450386  
0.003279855614  
-0.1376374544  
-0.2759994277  
-0.4055387225  
-0.5192741386  
-0.6105235009  
-0.6740211838  
-0.7069196066  
-0.7094819911  
-0.6853323749  
-0.6412013859  
-0.5862035726  
-0.5307765333  
-0.4854584852  
-0.4597128575  
-0.4609883302  
-0.4941443842  
-0.5613001742  
-0.6620649305  
-0.7940573098  
-0.9535440163  
-1.136030599  
-1.336662785  
-1.550319977  
-1.771403649  
-1.993355897  
-2.208054268  
-2.405257224  
-2.572298988  
-2.694211177  
-2.754392648  
-2.735853628  
-2.622954191  
-2.403456455  
-2.070624608  
-1.625050391  
-1.075890943  
-0.4412653296  
0.2523541248  
0.9717758577  
1.679621859  
2.337505458  
2.909492102  
3.365443134  
3.683832143  
3.853706865  
3.875549699  
3.760955565  
3.531154041  
3.214575256  
2.843740009  
2.451841931  
2.069426946  
1.721534715  
1.425622759  
1.190477296  
1.016204179  
0.8952474345  
0.8142502546  
0.7564916003  
0.7045441102  
0.6428049568  
0.5595755074  
0.4484455013  
0.3088471698  
0.1457691895  
-0.03127392996  
-0.2098152587  
-0.3763105073  
-0.5180268679  
-0.6247028879  
-0.6897723366  
-0.7110238748  
-0.6906517163  
-0.6347310822  
-0.5522390895  
-0.4537759113  
-0.3501843216  
-0.2512637905  
-0.1647344478  
-0.0955999181  
-0.045932119  
-0.01511186111  
-0.0004264801349  
0.002081698347  
-0.003336572619  
-0.01303761375  
-0.02468209921  
-0.03763518414  
-0.05300317825  
-0.0733083191  
-0.1018605677  
-0.1419217947  
-0.1958192628  
-0.2641469778  
-0.3452196843  
-0.4348796867  
-0.5267357066  
-0.6128154908  
-0.6845646809  
-0.7340649895  
-0.755273597  
-0.745104144  
-0.7041497582  
-0.6369133487  
-0.5514710967  
-0.4585798454  
-0.3703270244  
-0.2985141381  
-0.2529921929  
-0.2402133372  
-0.2622251046  
-0.3162854688  
-0.3951750379  
-0.4881888345  
-0.5826685519  
-0.6658583221  
-0.7267958648  
-0.7579564293  
-0.7563606963  
-0.723982463  
-0.6673547143  
-0.5964171155  
-0.52277951  
-0.4576561608  
-0.4098050416  
-0.3838183058  
-0.379056307  
-0.3894481944  
-0.4042195216  
-0.409503713  
-0.3906033961  
-0.3345871863  
-0.2328194383  
-0.08301323343  
0.1095481017  
0.331867255  
0.5642701081  
0.7825286632  
0.960843034  
1.075278327  
1.107194174  
1.046164207  
0.891948607  
0.655188396  
0.3566704304  
0.02520259099  
-0.3056657043  
-0.6016570323  
-0.8320001398  
-0.973306597  
-1.012555834  
-0.9487690293  
-0.7931274941  
-0.5675031052  
-0.3016032267  
-0.02911962444  
0.2165705811  
0.406563547  
0.5198568582  
0.5456118044  
0.4839567209  
0.3453015488  
0.1483267251  
-0.0829727378  
-0.3227110136  
-0.5464576321  
-0.7340359774  
-0.871396941  
-0.9513921354  
-0.9734467568  
-0.9423141712  
-0.8662392261  
-0.7549168098  
-0.6176410368  
-0.4619540454  
-0.2930084961  
-0.1136799495  
0.07466656897  
0.2709740747  
0.4731545928  
0.6769204479  
0.8750670741  
1.057378307  
1.211229766  
1.322831783  
1.37893228  
1.368727451  
1.285688124  
1.129010876  
0.9044512459  
0.6243928993  
0.3070876435  
-0.02486466358  
-0.3466359536  
-0.6336453894  
-0.8640855189  
-1.021199539  
-1.095002205  
-1.083247125  
-0.991493094  
-0.8322763849  
-0.6234881104  
-0.386184479  
-0.1421094411  
0.0887263057  
0.2901050378  
0.4510348145  
0.5664099566  
0.6368455493  
0.667792256  
0.6681120395  
0.6483821056  
0.6192192689  
0.5898803309  
0.5673159993  
0.5557855988  
0.5569913659  
0.5706222347  
0.5951251498  
0.6284982269  
0.6689144883  
0.7150585258  
0.7661121557  
0.8214358727  
0.880036856  
0.9399853844  
0.9979293051  
1.048858156  
1.086212109  
1.102357265  
1.089402237  
1.040236197  
0.9496501829  
0.8153596189  
0.6387450411  
0.4251919557  
0.1839220369  
-0.07269265895  
-0.3302752587  
-0.5739274031  
-0.7898598828  
-0.9669745411  
-1.098168488  
-1.181187093  
-1.218881065  
-1.218812837  
-1.192235471  
-1.152551773  
-1.113442866  
-1.086914829  
-1.081525521  
-1.101056689  
-1.14383414  
-1.202821469  
-1.266507091  
-1.320474565  
-1.349461368  
-1.339618723  
-1.280650565  
-1.167529359  
-1.00152862  
-0.7904189492  
-0.5477879531  
-0.2915692058  
-0.04196789322  
0.1809302187  
0.3595604792  
0.4809661004  
0.538312959  
0.531636502  
0.4677464926  
0.3593155649  
0.2232946384  
0.07886421532  
-0.0548167441  
-0.160779961  
-0.2261006312  
-0.2432400895  
-0.2107489456  
-0.1333146967  
-0.02117118564  
0.1110122011  
0.2456329175  
0.3638759386  
0.4475052806  
0.4805735362  
0.4509391025  
0.3515045868  
0.1811087446  
-0.05497071473  
-0.34495091  
-0.6709387539  
-1.009830389  
-1.334708972  
-1.616729749  
-1.827399402  
-1.941100804  
-1.937658002  
-1.80464921  
-1.539191897  
-1.148920387  
-0.6519560735  
-0.07578851569  
0.5448755923  
1.171087662  
1.763124958  
2.284035471  
2.702837954  
2.996996161  
3.153896793  
3.17122486  
3.056263414  
2.824320974  
2.496567588  
2.097625023  
1.653219223  
1.188176951  
0.7248936447  
0.2823489049  
-0.1243950656  
-0.4843163428  
-0.790307571  
-1.038923748  
-1.230065963  
-1.366630358  
-1.45408909  
-1.499952794  
-1.513087982  
-1.502858297  
-1.478164953  
-1.446456442  
-1.412860776  
-1.379572846  
-1.345632124  
-1.307151384  
-1.258017033  
-1.190968291  
-1.098925432  
-0.9763724765  
-0.8205812464  
-0.6324943423  
-0.4171202027  
-0.1833673239  
0.05666450967  
0.2888475629  
0.4984908405  
0.6719020274  
0.7978568299  
0.8687901156  
0.8815832399  
0.8378801786  
0.7439269116  
0.6099900108  
0.4494453954  
0.2776500941  
0.1107146513  
-0.03572496057  
-0.1476533181  
-0.2136849784  
-0.2258974655  
-0.1804626624  
-0.07804966021  
0.07602057158  
0.2719036761  
0.495678379  
0.7301304284  
0.9558777469  
1.152809104  
1.301745358  
1.38620146  
1.394073282  
1.319052924  
1.161590495  
0.9292314246  
0.6362572254  
0.3026113039  
-0.04779173456  
-0.3892187239  
-0.6964788566  
-0.9472575932  
-1.124143234  
-1.216153134  
-1.219598735  
-1.138236309  
-0.9827170245  
-0.769439396  
-0.5189530563  
-0.2541013321  
0.001913437449  
0.2273736956  
0.4036646192  
0.5165660161  
0.5571772828  
0.5224411274  
0.4152781656  
0.2443372142  
0.02340333952  
-0.2295257586  
-0.4934365847  
-0.7457386658  
-0.9638598243  
-1.126934142  
-1.217463443  
-1.222844049  
-1.136626534  
-0.9593817406  
-0.6990601714  
-0.3707638674  
0.004109900379  
0.3993335631  
0.7858505832  
1.134158949  
1.416893596  
1.611371173  
1.701847626  
1.681241232  
1.552127991  
1.32684423  
1.026640922  
0.6799146992  
0.3196364782  
-0.01979230808  
-0.3059708225  
-0.5118548361  
-0.6186845053  
-0.6181513461  
-0.5135229915  
-0.3195680754  
-0.06123197238  
0.2288342726  
0.5136586898  
0.7558927409  
0.9218844341  
0.9854059005  
0.9305998797  
0.7537755351  
0.463828998  
0.08123050834  
-0.3642970018  
-0.8371152581  
-1.299599322  
-1.716144752  
-2.056784372  
-2.299958102  
-2.434170331  
-2.458383356  
-2.381206563  
-2.219074923  
-1.993741314  
-1.729446555  
-1.450156828  
-1.177186309  
-0.9274442536  
-0.7124380085  
-0.5380361483  
-0.404920794  
-0.3095466275  
-0.2454135502  
-0.2044370264  
-0.1782103077  
-0.1590226776  
-0.1405427352  
-0.118148269  
-0.08894058077  
-0.05153004306  
-0.005693135849  
0.04798945571  
0.1084456071  
0.1743075095  
0.2440074041  
0.3157745346  
0.3875899155  
0.4571410361  
0.5218281185  
0.5788343744  
0.6252750615  
0.6584084755  
0.6758830748  
0.67600122  
0.6579659736  
0.622104187  
0.5700363349  
0.5048044057  
0.4309167364  
0.3543205096  
0.2822529101  
0.2229742628  
0.1853362058  
0.1782093326  
0.2097538139  
0.2865901526  
0.4129176146  
0.5896756932  
0.8138414517  
1.077987428  
1.370196383  
1.674416287  
1.971304875  
2.239534382  
2.45748151  
2.605159657  
2.666180394  
2.629531562  
2.490929989  
2.253577483  
1.928185599  
1.532243991  
1.088598335  
0.6234766033  
0.1641984097  
-0.2631952216  
-0.6361331841  
-0.937299889  
-1.155847998  
-1.287956729  
-1.336707903  
-1.311351285  
-1.226082141  
-1.098494849  
-0.9478982486  
-0.7936576858  
-0.653717105  
-0.5434040907  
-0.4745619663  
-0.4550353659  
-0.4884638344  
-0.5743545963  
-0.7083644949  
-0.8827448666  
-1.08690742  
-1.308082949  
-1.532054017  
-1.743949042  
-1.929094757  
-2.073900081  
-2.16674724  
-2.198845383  
-2.164981817  
-2.064094112  
-1.899585139  
-1.679305756  
-1.415146379  
-1.122244139  
-0.817824102  
-0.5197864694  
-0.2451710892  
-0.008675942568  
0.1785937068  
0.3099974206  
0.3837396863  
0.4027329173  
0.3739772861  
0.3075563754  
0.2154092231  
0.1100462713  
0.003383668747  
-0.09416914361  
-0.1742790495  
-0.2308961892  
-0.2601340872  
-0.2599102749  
-0.2294793264  
-0.1689856475  
-0.07916619039  
0.03872910663  
0.1827657881  
0.3499482733  
0.5357347981  
0.7335814425  
0.9346765982  
1.127991913  
1.300740885  
1.439255931  
1.530214862  
1.562075595  
1.526509619  
1.419633656  
1.242825394  
1.002985746  
0.7121905449  
0.386738078  
0.04573436585  
-0.2906257835  
-0.6028506173  
-0.8737894605  
-1.089937326  
-1.242254485  
-1.32645364  
-1.342763485  
-1.295258318  
-1.190910756  
-1.038524704  
-0.8477310462  
-0.6281859986  
-0.3890558111  
-0.1388200108  
0.1146492216  
0.3638249329  
0.6011992229  
0.819030534  
1.009267111  
1.163720517  
1.27450078  
1.334675114  
1.339057951  
1.285006382  
1.173093799  
1.00752883  
0.7962403526  
0.5505811494  
0.2846601724  
0.01437453468  
-0.2437660253  
-0.4738923473  
-0.6619758872  
-0.7968673988  
-0.8710787195  
-0.881251209  
-0.828289137  
-0.7171608365  
-0.5564034893  
-0.3573802792  
-0.1333601484  
0.1015004917  
0.3331889339  
0.548788146  
0.7372781038  
0.8901086326  
1.001515846  
1.06857635  
1.091007328  
1.070797681  
1.011724549  
0.9188504149  
0.7980761995  
0.6558012824  
0.4987186859  
0.3337202831  
0.1678826252  
0.008454040259  
-0.1372288588  
-0.2619530055  
-0.35901475  
-0.4227725465  
-0.4493242346  
-0.4372114965  
-0.3880367015  
-0.3068502675  
-0.2021928944  
-0.08569838621  
0.02874912333  
0.1262800143  
0.1925903881  
0.2156086288  
0.1870666645  
0.1037576216  
-0.0317157167  
-0.2108312486  
-0.4197396824  
-0.6405213486  
-0.8529986738  
-1.036888574  
-1.174058294  
-1.250598749  
-1.258452098  
-1.196379331  
-1.07012856  
-0.8917783417  
-0.6783338033  
-0.4497478785  
-0.2266466814  
-0.02804536494  
0.1306344927  
0.2389938024  
0.2923560481  
0.2916880139  
0.2427762063  
0.1548520105  
0.03889041111  
-0.09411269092  
-0.234602723  
-0.37543764  
-0.5122185598  
-0.6429658281  
-0.7672351555  
-0.884880147  
-0.9947435137  
-1.09356583  
-1.175379993  
-1.231563788  
-1.251601407  
-1.224479382  
-1.140503057  
-0.9932416724  
-0.7812606749  
-0.5093190235  
-0.1887787271  
0.1629016116  
0.5235820637  
0.8686067445  
1.173434056  
1.416367702  
1.580995911  
1.657976097  
1.645909474  
1.551183364  
1.386816719  
1.170504374  
0.922177458  
0.6614586833  
0.4054022331  
0.1668382497  
-0.04647428881  
-0.231818938  
-0.3907029702  
-0.5274653146  
-0.6475928809  
-0.7560734253  
-0.8560624231  
-0.9480790968  
-1.029839293  
-1.09670187  
-1.14262881  
-1.161448136  
-1.1481918  
-1.100280097  
-1.018338905  
-0.9065240725  
-0.7722880612  
-0.6256192188  
-0.4778414513  
-0.3401551497  
-0.2220966912  
-0.1301497711  
-0.06669925885  
-0.02949911921  
-0.01174784199  
-0.002804520006  
0.01052128183  
0.04224119196  
0.1052375139  
0.2093346422  
0.359658267  
0.5555097703  
0.7899331251  
1.050059189  
1.318217533  
1.573694216  
1.794944409  
1.961984409  
2.05867634  
2.074623614  
2.006440157  
1.858232473  
1.641247672  
1.37272423  
1.074102798  
0.7688175674  
0.4799374122  
0.2279381988  
0.02885488546  
-0.1070015061  
-0.1756521239  
-0.1793754238  
-0.1260031948  
-0.02774353928  
0.1003106247  
0.2417765308  
0.3805073848  
0.501900111  
0.5938820118  
0.6475385673  
0.6573889306  
0.6213582515  
0.5405195561  
0.4186808735  
0.261898082  
0.07795286555  
-0.1241765983  
-0.3348366858  
-0.5442213042  
-0.7428987014  
-0.9223371781  
-1.075398525  
-1.196766259  
-1.283265535  
-1.334009392  
-1.350361999  
-1.335686678  
-1.294915658  
-1.233989893  
-1.159231917  
-1.076744899  
-0.991911993  
-0.9090559476  
-0.8312913239  
-0.760575514  
-0.6979156423  
-0.6436878933  
-0.5979828377  
-0.5609080516  
-0.5327778381  
-0.5141428934  
-0.50564371  
-0.5077155822  
-0.5201914134  
-0.5418906297  
-0.5702906718  
-0.6013567058  
-0.6296295046  
-0.648561428  
-0.6511224367  
-0.6305936714  
-0.58145568  
-0.500242556  
-0.3862313445  
-0.2418580253  
-0.07276832587  
0.1125262947  
0.3033648217  
0.4879581056  
0.6545971402  
0.7929009937  
0.8949523038  
0.9561634571  
0.975773793  
0.9568987559  
0.9061234411  
0.8326821053  
0.7473287061  
0.661028997  
0.5836333415  
0.5227026721  
0.482628377  
0.4641600724  
0.4644139538  
0.4773592579  
0.4947268056  
0.5072205627  
0.5058689627  
0.4833174056  
0.434879207  
0.3591904665  
0.2583680385  
0.1376562763  
0.004631543286  
