0.03315537252  
0.1214224062  
0.1999533075  
0.2615197866  
0.3014742893  
0.3184799463  
0.3147354916  
0.2956507387  
0.2690316805  
0.2438927577  
0.2290934401  
0.2319881716  
0.2573155012  
0.3064696621  
0.3772664479  
0.4642184837  
0.5592724241  
0.6528747787  
0.7352053973  
0.797390382  
0.8325306135  
0.8364043332  
0.8077808935  
0.7483402459  
0.6622430146  
0.555462516  
0.4350027191  
0.3081269022  
0.1817043898  
0.06175025871  
-0.04682868842  
-0.1402849562  
-0.2159378724  
-0.271999513  
-0.3073769924  
-0.3215217834  
-0.3143369948  
-0.2861647853  
-0.2378287639  
-0.1707122536  
-0.08684058613  
0.01105622158  
0.1195250605  
0.2344057399  
0.3509048055  
0.4637093548  
0.5671558055  
0.6554622032  
0.7230347338  
0.7648596028  
0.7769845208  
0.7570543033  
0.7048658928  
0.6228576791  
0.5164351418  
0.3940298459  
0.2668062079  
0.1479460027  
0.0515288866  
-0.008934573185  
-0.02217334583  
0.01917553293  
0.1171242835  
0.2673708031  
0.4590000332  
0.6749901239  
0.8935350329  
1.090094072  
1.239965411  
1.321064696  
1.316584893  
1.217156925  
1.022225222  
0.7404261957  
0.3888969153  
-0.008412823621  
-0.4232236973  
-0.8258838912  
-1.188427545  
-1.487360539  
-1.705834927  
-1.834978888  
-1.874262094  
-1.830919256  
-1.718565572  
-1.555233417  
-1.361122576  
-1.156351095  
-0.9589765339  
-0.7834930161  
-0.6399083414  
-0.5334497238  
-0.4648285579  
-0.4309621985  
-0.4259915511  
-0.4424384543  
-0.4723426001  
-0.5082570677  
-0.5440241615  
-0.5752682921  
-0.599618293  
-0.6166556982  
-0.6276478729  
-0.6350934682  
-0.6421583247  
-0.6520456202  
-0.667377229  
-0.6896401956  
-0.7187670219  
-0.7529060763  
-0.7884215932  
-0.8201457005  
-0.8418756686  
-0.8470693924  
-0.8296751108  
-0.784981358  
-0.7103834163  
-0.6059407647  
-0.4746355991  
-0.3222699256  
-0.1569855737  
0.01154913605  
0.173189555  
0.318477583  
0.4397514111  
0.5320478554  
0.5936625746  
0.6262795629  
0.6346308166  
0.6257417722  
0.60784024  
0.5891041616  
0.5764135244  
0.5743103883  
0.5843157423  
0.6047240819  
0.6309188677  
0.6561731527  
0.6728271232  
0.6736768578  
0.653364952  
0.6095494892  
0.54366671  
0.4611461307  
0.3710072636  
0.2848731131  
0.2155055017  
0.1750642635  
0.1733259463  
0.2161262752  
0.3042652752  
0.433052594  
0.5925898212  
0.7687705538  
0.9448807425  
1.103580344  
1.228997798  
1.308638693  
1.334828436  
1.30550138  
1.224216766  
1.099423554  
0.9431000038  
0.7689868163  
0.5906982823  
0.4199982162  
0.2654912484  
0.131914575  
0.02008389789  
-0.07253095246  
-0.150761834  
-0.2204301907  
-0.2870201652  
-0.3545531587  
-0.4248534272  
-0.4972745472  
-0.568906795  
-0.6351675988  
-0.6906436103  
-0.7300099243  
-0.7488683795  
-0.7443794243  
-0.7156120568  
-0.6636057367  
-0.591180826  
-0.5025734971  
-0.4029905344  
-0.2981579173  
-0.19393559  
-0.09601769528  
-0.00972295507  
0.06016001969  
0.1095076157  
0.1350140505  
0.134388642  
0.1065971576  
0.05211425225  
-0.02685706245  
-0.1262668424  
-0.2402606143  
-0.3614376142  
-0.4813379739  
-0.5911461531  
-0.6825367663  
-0.7485830558  
-0.7845825518  
-0.7886836763  
-0.7621909616  
-0.7094778608  
-0.6374776345  
-0.5548022134  
-0.4705935649  
-0.3932594059  
-0.3292924564  
-0.2823441156  
-0.2527181092  
-0.2373775775  
-0.2304795639  
-0.2243779202  
-0.2109401334  
-0.182982652  
-0.135590916  
-0.06710402341  
0.02041008669  
0.1212808098  
0.2269699702  
0.3273079683  
0.4120501612  
0.4724973151  
0.5029230013  
0.5015500211  
0.4708991287  
0.4174303654  
0.3505022744  
0.2808035192  
0.2185071743  
0.1714465466  
0.143640591  
0.1344370831  
0.138468662  
0.1464660527  
0.1468457262  
0.1278446529  
0.07985934852  
-0.002396813618  
-0.118303913  
-0.2606355047  
-0.4159160748  
-0.5658636364  
-0.6897533509  
-0.7673770702  
-0.7821650897  
-0.7239847167  
-0.5911690035  
-0.3914133596  
-0.1413707355  
0.135055105  
0.4095024465  
0.6526440472  
0.8378900956  
0.9447731267  
0.9615238313  
0.8864862874  
0.7281812392  
0.5040298277  
0.2379521515  
-0.04278769023  
-0.311041718  
-0.5430329958  
-0.7209825806  
-0.8347805236  
-0.8825334945  
-0.8699902903  
-0.8090223122  
-0.7154328801  
-0.6064754322  
-0.4984414834  
-0.4046630991  
-0.3341525948  
-0.2910268008  
-0.2746914965  
-0.2806865802  
-0.3019780185  
-0.3304631549  
-0.3584147158  
-0.3796584554  
-0.3903114821  
-0.3890030739  
-0.3765953984  
-0.3554815731  
-0.3286199574  
-0.2984936421  
-0.2661918553  
-0.2307911727  
-0.1891579796  
-0.1362384351  
-0.06581240428  
0.02839398496  
0.1513823515  
0.3055791854  
0.4897589342  
0.6984118272  
0.9217028724  
1.146097077  
1.355620125  
1.533619487  
1.664813479  
1.737329874  
1.744448531  
1.685753202  
1.567506804  
1.402138729  
1.20689646  
1.001814047  
0.8072787366  
0.641526589  
0.5184278117  
0.4458683004  
0.4249529829  
0.4501222584  
0.5101474166  
0.5898333009  
0.6721541828  
0.7405185919  
0.7808348907  
0.7831057444  
0.742376548  
0.6589538053  
0.5379306199  
0.3881492606  
0.2207898345  
0.04781838289  
-0.1194992221  
-0.2718175502  
-0.4025582566  
-0.5083056989  
-0.5887783804  
-0.6464175767  
-0.6857016051  
-0.7123118613  
-0.7322525824  
-0.7510488564  
-0.7730883385  
-0.8011735258  
-0.8362952396  
-0.8776314221  
-0.9227399114  
-0.9679128833  
-1.008644291  
-1.040165984  
-1.058004524  
-1.058520062  
-1.039391724  
-1.000001694  
-0.9416943632  
-0.8678675952  
-0.7838735224  
-0.6967047125  
-0.6144742508  
-0.5457061183  
-0.4984973447  
-0.4796144456  
-0.4936418066  
-0.5422770198  
-0.6238783032  
-0.733347995  
-0.8623903034  
-1.000144938  
-1.134142396  
-1.25149006  
-1.340156888  
-1.390215014  
-1.394892204  
-1.35132819  
-1.260928536  
-1.129297738  
-0.9657512423  
-0.7824622597  
-0.5933414569  
-0.4127635097  
-0.2542699612  
-0.1293730477  
-0.04656804852  
-0.01062948863  
-0.02224670638  
-0.07800828141  
-0.1707222969  
-0.2900272376  
-0.423233344  
-0.5563214978  
-0.6750184897  
-0.7658694241  
-0.8172305951  
-0.8200996474  
-0.768734859  
-0.6609909602  
-0.4983548325  
-0.2856578655  
-0.03049324239  
0.25761052  
0.5681632303  
0.8907257195  
1.215818752  
1.535602941  
1.844223672  
2.137752263  
2.413732016  
2.670380487  
2.905586607  
3.115876865  
3.295552558  
3.436195437  
3.526687966  
3.553848757  
3.503656777  
3.362971095  
3.121551619  
2.774110915  
2.322114149  
1.775035298  
1.150844786  
0.4755854375  
-0.217995367  
-0.892672322  
-1.509616883  
-2.031646752  
-2.42651438  
-2.66987651  
-2.747644631  
-2.657452469  
-2.409091054  
-2.023847849  
-1.532810438  
-0.9742846268  
-0.3905676655  
0.1756225609  
0.6847323984  
1.103633351  
1.408238627  
1.585236165  
1.632754077  
1.559899646  
1.385217107  
1.134242241  
0.836425541  
0.5217731138  
0.2176150618  
-0.05413398476  
-0.2788773435  
-0.4502036052  
-0.5696198426  
-0.6452452901  
-0.6896744471  
-0.7173584731  
-0.7419056413  
-0.7737220941  
-0.8183388537  
-0.8756791777  
-0.9403416074  
-1.002840495  
-1.0515563  
-1.075061494  
-1.064420297  
-1.015057409  
-0.9278972343  
-0.8095534817  
-0.6715581849  
-0.5287358286  
-0.3969984747  
-0.2909030879  
-0.2213772301  
-0.1939710882  
-0.2079123409  
-0.2561268408  
-0.326218369  
-0.4022693988  
-0.4671970149  
-0.5053103783  
-0.5046930734  
-0.4590663833  
-0.3688547706  
-0.2413069839  
-0.08965072715  
0.06858936233  
0.2138898039  
0.3273136413  
0.3930391804  
0.40050021  
0.3458538926  
0.2326084568  
0.07131824234  
-0.1215795909  
-0.3256505045  
-0.5188246718  
-0.6799411992  
-0.7911744379  
-0.8400558562  
-0.8208636743  
-0.7352364251  
-0.5919524869  
-0.4059228052  
-0.1965282583  
0.01448987633  
0.205345883  
0.3564670545  
0.4524519273  
0.483525793  
0.4463634674  
0.3442075437  
0.1863160534  
-0.0131877693  
-0.2368940993  
-0.4659425568  
-0.6818945861  
-0.8684462956  
-1.012816751  
-1.106673217  
-1.14653897  
-1.133665926  
-1.073440228  
-0.9744013857  
-0.8470379233  
-0.7024867675  
-0.5513007242  
-0.4024129395  
-0.2623914008  
-0.135051568  
-0.0214383373  
0.0798428236  
0.1720027335  
0.2592422626  
0.3458170747  
0.4351177231  
0.5288619303  
0.6265036449  
0.7249404339  
0.8185612425  
0.8996604513  
0.9591939314  
0.9878067979  
0.9770431624  
0.9205926883  
0.8154373459  
0.66272737  
0.4682660075  
0.2424917782  
-8.784102607e-05  
-0.2419805886  
-0.4642418717  
-0.648284317  
-0.7777762501  
-0.8403945771  
-0.8292093557  
-0.7435110422  
-0.5889495095  
-0.3769374168  
-0.1233735168  
0.15318  
0.4336398645  
0.7005906584  
0.9402308639  
1.143804369  
1.308323787  
1.436456341  
1.535595385  
1.616226107  
1.689824234  
1.766585407  
1.853333273  
1.951928282  
2.058434022  
2.16320803  
2.25192046  
2.307400241  
2.312044224  
2.250462276  
2.111966203  
1.892532737  
1.59594352  
1.233905291  
0.8251183261  
0.3933934694  
-0.03492230099  
-0.4338747043  
-0.7807904301  
-1.058722632  
-1.25814957  
-1.377706136  
-1.423883496  
-1.409769203  
-1.353041153  
-1.273507923  
-1.190560787  
-1.120863839  
-1.076585899  
-1.064360626  
-1.085046974  
-1.134257328  
-1.203499475  
-1.281716595  
-1.356976706  
-1.418073682  
-1.455839482  
-1.464044337  
-1.439825256  
-1.383673182  
-1.299050307  
-1.191745963  
-1.069098368  
-0.9391887814  
-0.8100959468  
-0.689264536  
-0.5830115022  
-0.4961741701  
-0.4318882201  
-0.3914740259  
-0.3744295007  
-0.3785152483  
-0.3999350277  
-0.4336195089  
-0.4736094159  
-0.5135287285  
-0.5471313045  
-0.5688767024  
-0.5744794047  
-0.5613847945  
-0.52909222  
-0.4792851585  
-0.4157288732  
-0.3439278857  
-0.2705698387  
-0.2028002314  
-0.1474154095  
-0.1100656701  
-0.09457204211  
-0.1024390043  
-0.1326453291  
-0.1817316337  
-0.2441884125  
-0.3130823147  
-0.3808386868  
-0.4400709326  
-0.4843294228  
-0.5086733173  
-0.509982058  
-0.486981123  
-0.4400006399  
-0.3705374021  
-0.2807141581  
-0.1727692974  
-0.0486743708  
0.09002627555  
0.2421270059  
0.4064420529  
0.5813247294  
0.7641514921  
0.9508876443  
1.13588233  
1.311963568  
1.470892548  
1.604136975  
1.703873652  
1.764073544  
1.78150564  
1.756463835  
1.693102173  
1.599263067  
1.485817963  
1.365559679  
1.251797966  
1.156827151  
1.090477491  
1.058926346  
1.063933206  
1.102574132  
1.167515978  
1.247772529  
1.329846114  
1.399116248  
1.441306264  
1.443876056  
1.397201193  
1.295432031  
1.136976618  
0.9245869352  
0.6650791683  
0.3687304661  
0.04844923571  
-0.2812139323  
-0.605119166  
-0.908589373  
-1.178391764  
-1.403619424  
-1.576419196  
-1.69255482  
-1.75175737  
-1.757832951  
-1.718486422  
-1.644826357  
-1.550532108  
-1.450689072  
-1.360355185  
-1.292956751  
-1.258671444  
-1.26299443  
-1.305694193  
-1.380355986  
-1.474664683  
-1.571478104  
-1.650665587  
-1.691538043  
-1.675612631  
-1.589359551  
-1.426553418  
-1.189863517  
-0.8913990229  
-0.5520500403  
-0.1996286  
0.1340147367  
0.4165741121  
0.6191134522  
0.7196459552  
0.7059690172  
0.5773670905  
0.3449341633  
0.03044814197  
-0.3360458076  
-0.7196342376  
-1.084453139  
-1.39760241  
-1.632553046  
-1.77161544  
-1.807206445  
-1.741810497  
-1.586743093  
-1.359963247  
-1.08331381  
-0.7796021185  
-0.4699247041  
-0.1715631472  
0.1033480562  
0.3483044382  
0.5621219738  
0.7479862649  
0.9121029868  
1.062172372  
1.20593055  
1.349922993  
1.498628793  
1.653969623  
1.815176461  
1.978961938  
2.139900035  
2.290939989  
2.423975612  
2.530443908  
2.601921867  
2.630723142  
2.610510537  
2.53688683  
2.407972477  
2.224885694  
1.99207463  
1.717406487  
1.411953727  
1.089420473  
0.7652244889  
0.455279819  
0.1745961043  
-0.06415109332  
-0.2519013931  
-0.3841607765  
-0.4614901319  
-0.4894287377  
-0.4778594437  
-0.4398704387  
-0.3902596303  
-0.3438707387  
-0.3139752187  
-0.3108976191  
-0.3410500263  
-0.4064675106  
-0.5048694123  
-0.630194529  
-0.773494137  
-0.9240379594  
-1.070465274  
-1.201844369  
-1.308522294  
-1.382722435  
-1.418871479  
-1.413708369  
-1.36623606  
-1.277597133  
-1.150934412  
-0.9912704068  
-0.8054066496  
-0.6018052947  
-0.3904022795  
-0.1822839302  
0.01080542805  
0.1771455045  
0.3058773771  
0.3879224886  
0.4168773148  
0.3897666938  
0.3075465478  
0.1752597218  
0.00181636735  
-0.2005967513  
-0.4174293638  
-0.6328958904  
-0.8312098079  
-0.9978108565  
-1.120464955  
-1.190168253  
-1.20179199  
-1.154436576  
-1.05148767  
-0.9003790909  
-0.7120748784  
-0.5002817506  
-0.2804382677  
-0.06851123294  
0.1203221977  
0.2730120571  
0.3798827564  
0.4356438675  
0.440048824  
0.398073851  
0.3195631799  
0.2183279543  
0.1107674467  
0.01414151707  
-0.05530754143  
-0.08416937393  
-0.06338886426  
0.01068829427  
0.1358669955  
0.3043064612  
0.50332397  
0.7166854067  
0.9262066907  
1.113467072  
1.261446743  
1.355924073  
1.386527642  
1.347399597  
1.237469413  
1.060373611  
0.8240959833  
0.5403790897  
0.2239660821  
-0.1083024484  
-0.4384968951  
-0.7487104717  
-1.022228728  
-1.244714905  
-1.405330617  
-1.497680202  
-1.520462689  
-1.47772002  
-1.378573468  
-1.236429203  
-1.067659454  
-0.889887822  
-0.7200387043  
-0.5724057559  
-0.4569883325  
-0.3783579697  
-0.3352375187  
-0.3209044898  
-0.3243977218  
-0.3323806401  
-0.3314146355  
-0.3102945599  
-0.262082136  
-0.1854965512  
-0.08540232872  
0.02773018564  
0.1393540341  
0.2331632354  
0.2938608697  
0.3099419388  
0.2760380537  
0.1944243543  
0.0753945558  
-0.06360681747  
-0.200018902  
-0.309099584  
-0.3673501455  
-0.355929958  
-0.2635456986  
-0.08839137647  
0.1611788111  
0.4673470586  
0.8048159849  
1.14381065  
1.453677758  
1.706588055  
1.880833888  
1.963297413  
1.950759936  
1.849932048  
1.676233244  
1.451529948  
1.201183662  
0.9508290605  
0.7233207722  
0.5362514836  
0.4003308336  
0.3187882845  
0.2878036627  
0.2978184814  
0.3354719924  
0.3858245571  
0.4345134679  
0.4695235375  
0.4823550748  
0.4684655766  
0.4270212621  
0.360092936  
0.2715298832  
0.1657823605  
0.04693064001  
-0.08188088359  
-0.2185161457  
-0.361436418  
-0.5089437033  
-0.6582917534  
-0.8049102574  
-0.9419876475  
-1.060577624  
-1.150304241  
-1.200607244  
-1.202369397  
-1.149647716  
-1.041219936  
-0.8816386875  
-0.6815585702  
-0.4572162177  
-0.2290594074  
-0.01967020026  
0.1487467388  
0.2569936942  
0.2912438225  
0.2448176691  
0.1191151494  
-0.07643003219  
-0.325372461  
-0.6061224804  
-0.8944024345  
-1.165985661  
-1.399346938  
-1.577914725  
-1.691637118  
-1.737690143  
-1.720271586  
-1.649518254  
-1.539722443  
-1.407083147  
-1.267291942  
-1.13326709  
-1.013332181  
-0.9100684419  
-0.8199991947  
-0.7341528562  
-0.639446533  
-0.5207187104  
-0.3631632968  
-0.1548533461  
0.1109765714  
0.4342037841  
0.806894476  
1.213338678  
1.631084811  
2.032884218  
2.389336023  
2.671934706  
2.856154932  
2.924206407  
2.867111508  
2.685854016  
2.391444135  
2.003885736  
1.550169779  
1.061530935  
0.5702978268  
