0.6794502794  
0.2693892602  
-0.1237598392  
-0.4800908454  
-0.7833223267  
-1.022188448  
-1.191132435  
-1.290292271  
-1.324823893  
-1.303769702  
-1.238653387  
-1.14206502  
-1.026423774  
-0.9030522166  
-0.7816219712  
-0.6699497647  
-0.5740527412  
-0.4983570046  
-0.4459194472  
-0.4185976917  
-0.4170844782  
-0.4408439095  
-0.487987146  
-0.5551668008  
-0.6375888398  
-0.7292035516  
-0.823104249  
-0.9121144449  
-0.9894996624  
-1.049684936  
-1.088872163  
-1.105432221  
-1.10001017  
-1.075295492  
-1.035513914  
-0.9857126013  
-0.930963995  
-0.8756359219  
-0.8228525311  
-0.7742399299  
-0.7299846402  
-0.6891976866  
-0.6504818922  
-0.6126024067  
-0.5750995281  
-0.5387352192  
-0.5056533719  
-0.479230555  
-0.4636116701  
-0.4630147255  
-0.4809123709  
-0.5192385353  
-0.5777650411  
-0.6537569431  
-0.7420044086  
-0.8352252021  
-0.9248143827  
-1.001825608  
-1.058051615  
-1.087043033  
-1.084910391  
-1.050801022  
-0.9869746939  
-0.8984799398  
-0.7924837359  
-0.6773688744  
-0.5617219595  
-0.4533852215  
-0.3586763916  
-0.2818848413  
-0.2250919526  
-0.1882816525  
-0.1697072168  
-0.1663982841  
-0.1747139539  
-0.1908405896  
-0.2111579418  
-0.2324403522  
-0.2518919605  
-0.267062808  
-0.2756978294  
-0.2755914126  
-0.2645118244  
-0.2402331656  
-0.2006921762  
-0.144248255  
-0.07000613752  
0.02186146391  
0.1298574581  
0.2510465661  
0.3811137769  
0.5146239523  
0.6454820323  
0.7675169729  
0.8751635278  
0.9641162601  
1.031893375  
1.078211981  
1.105123456  
1.116879543  
1.119527659  
1.120274736  
1.126683016  
1.145797608  
1.183297297  
1.24277512  
1.325245992  
1.428947655  
1.549464454  
1.680181063  
1.812999164  
1.939236769  
2.050582597  
2.139970805  
2.202243926  
2.234501886  
2.236089926  
2.20822618  
2.153350945  
2.074312421  
1.973558565  
1.852494327  
1.711161638  
1.548310632  
1.361900789  
1.149953214  
0.9116244314  
0.6482972772  
0.3644798547  
0.06830711384  
-0.2285014476  
-0.5113167207  
-0.7638683026  
-0.9699799358  
-1.115570105  
-1.190623209  
-1.190856556  
-1.118783615  
-0.9839877456  
-0.8024904601  
-0.5952538254  
-0.385960727  
-0.1983502196  
-0.05345730779  
0.03288541583  
0.05193064851  
0.003021621306  
-0.1064129084  
-0.2619022017  
-0.4438666945  
-0.6301858034  
-0.7990719699  
-0.9318647149  
-1.01536866  
-1.043439809  
-1.017605405  
-0.9466404611  
-0.8451787269  
-0.7315471742  
-0.6251283717  
-0.5436246175  
-0.5005897934  
-0.5035786978  
-0.5531452718  
-0.6428274918  
-0.7600925154  
-0.8881126558  
-1.00809677  
-1.101855633  
-1.154248075  
-1.155168116  
-1.100821273  
-0.9941225812  
-0.8441866216  
-0.6649973882  
-0.4734584163  
-0.2870980784  
-0.1217622245  
0.01039921955  
0.1023799067  
0.1530053272  
0.1668022255  
0.1530678496  
0.1243085879  
0.09426755621  
0.07582935691  
0.07910057187  
0.1099267601  
0.169044797  
0.2519772026  
0.3496655248  
0.4497506821  
0.5382972851  
0.6017317567  
0.6287035676  
0.6116311261  
0.5477065324  
0.439243151  
0.2933217137  
0.1208014355  
-0.06515074893  
-0.2507946558  
-0.4235653665  
-0.5735869978  
-0.6947440644  
-0.785165728  
-0.8470874968  
-0.8861161561  
-0.9100377906  
-0.9273597184  
-0.9458107199  
-0.9710259594  
-1.005602864  
-1.048651573  
-1.095888492  
-1.140249132  
-1.172891168  
-1.184453732  
-1.166372742  
-1.112077926  
-1.017909172  
-0.8836525396  
-0.7126303429  
-0.511373831  
-0.2889146881  
-0.0558191682  
0.1769190201  
0.3989956347  
0.6017786487  
0.77906588  
0.9275315297  
1.046821815  
1.139303063  
1.209493614  
1.263259023  
1.306858453  
1.345961841  
1.38475274  
1.425235221  
1.466819705  
1.506263222  
1.537970781  
1.554647291  
1.548217012  
1.510932116  
1.436523182  
1.321262865  
1.16480738  
0.9707014573  
0.7464699918  
0.5032558554  
0.2550346807  
0.01745900317  
-0.193546018  
-0.3632995611  
-0.4798253945  
-0.5351053822  
-0.5259837453  
-0.4546058485  
-0.3283538619  
-0.1592510437  
0.03709725306  
0.2429338824  
0.4400071166  
0.6112864307  
0.7425565085  
0.8237315074  
0.8497457715  
0.8209331944  
0.7428550829  
0.6256170036  
0.482724248  
0.329643927  
0.1821976166  
0.05497696787  
-0.0400657508  
-0.0947083878  
-0.1051385946  
-0.07216396691  
-0.0009661710166  
0.09957239456  
0.2178626182  
0.3408248867  
0.4551982572  
0.548798366  
0.6116312113  
0.6367320331  
0.6206940961  
0.5638243196  
0.4699449611  
0.345872494  
0.2006275491  
0.0444785391  
-0.1120872663  
-0.2593760694  
-0.3893707865  
-0.4964132723  
-0.5776316149  
-0.6330794891  
-0.6655848711  
-0.6803192151  
-0.6841480255  
-0.6848047769  
-0.6899796686  
-0.7063899062  
-0.738935298  
-0.7900129487  
-0.859071841  
-0.9424711563  
-1.033663072  
-1.123731909  
-1.2022109  
-1.25815234  
-1.28129592  
-1.263245243  
-1.19848176  
-1.085115648  
-0.925256941  
-0.724966261  
-0.4937806222  
-0.2438714748  
0.01106740856  
0.2570609073  
0.4810858211  
0.6721535241  
0.8221200285  
0.9261706274  
0.9829388819  
0.9942882711  
0.964820118  
0.9011917328  
0.8113398032  
0.703708189  
0.5865573895  
0.4673952485  
0.352572901  
0.2470251847  
0.1541652002  
0.07587912605  
0.01262219566  
-0.03641964377  
-0.07310798421  
-0.1000856645  
-0.1204712042  
-0.1375268146  
-0.1543248622  
-0.1734375408  
-0.1966829902  
-0.2249553066  
-0.2581655504  
-0.2952938238  
-0.3345410459  
-0.3735632895  
-0.4097425408  
-0.4404573408  
-0.4633092838  
-0.4762922301  
-0.477877601  
-0.4670382282  
-0.4432118064  
-0.4062539819  
-0.3563848359  
-0.2941680655  
-0.2205299637  
-0.1368121546  
-0.0448526506  
0.05293783278  
0.1535223504  
0.2532515135  
0.3479573111  
0.433143712  
0.5042919921  
0.5572367385  
0.5886150247  
0.5963133848  
0.5798689912  
0.540748384  
0.4824487342  
0.4103693045  
0.3314365133  
0.253492195  
0.1844945292  
0.1316321814  
0.1004464397  
0.09410341552  
0.1129146495  
0.1542061038  
0.2125584745  
0.2804140182  
0.3489697404  
0.4092463723  
0.4531812618  
0.4745924234  
0.4698997495  
0.4384852186  
0.3826750679  
0.3073518162  
0.2192635233  
0.126145603  
0.03578478618  
-0.04485141769  
-0.1103126192  
-0.1571062201  
-0.183868822  
-0.1912701327  
-0.18170406  
-0.1588406015  
-0.1271124488  
-0.09121799991  
-0.05567863685  
-0.02449278129  
-0.0008777363885  
0.01290279875  
0.01565794086  
0.007352235157  
-0.01084624673  
-0.03654675804  
-0.06617950894  
-0.09512823848  
-0.1179834342  
-0.1289499351  
-0.1224004767  
-0.09356288097  
-0.03926858459  
0.04130315428  
0.1460150191  
0.2693877707  
0.4025710984  
0.5337257154  
0.6488621122  
0.7330916596  
0.7722135959  
0.7544591445  
0.6722164984  
0.5234680745  
0.3127550004  
0.05144698496  
-0.2427908018  
-0.5473534077  
-0.8368003091  
-1.085498545  
-1.27052217  
-1.37443216  
-1.387586554  
-1.309618527  
-1.149842015  
-0.9264635597  
-0.6646360959  
-0.3935501392  
-0.1429137087  
0.06074367221  
0.1974465291  
0.256378147  
0.2373211829  
0.1507220789  
0.0163160305  
-0.1395339288  
-0.2874619567  
-0.3992146729  
-0.4516991533  
-0.4304050505  
-0.3316956257  
-0.1636177952  
0.05492490877  
0.2965825787  
0.5292422389  
0.7205010904  
0.8423132286  
0.8751357042  
0.8109582672  
0.6547411813  
0.424008391  
0.146614955  
-0.1430218238  
-0.408681934  
-0.6173978507  
-0.7440431535  
-0.7747570714  
-0.7086785355  
-0.5577414759  
-0.3445564205  
-0.09874197062  
0.1477340011  
0.3654579905  
0.5319844083  
0.6350813105  
0.6743550709  
0.66104141  
0.6160305111  
0.5664746303  
0.5414871444  
0.567583735  
0.6645147386  
0.8420526928  
1.098154028  
1.418709028  
1.778883333  
2.145840233  
2.482486871  
2.751741854  
2.920825815  
2.965027476  
2.870537639  
2.636012392  
2.272717141  
1.803268853  
1.25913595  
0.6772437888  
0.09608501106  
-0.4481678426  
-0.9251110867  
-1.312709864  
-1.598809874  
-1.781429915  
-1.867892661  
-1.872996521  
-1.816527492  
-1.720463567  
-1.606261247  
-1.492512079  
-1.393225619  
-1.316855743  
-1.266105853  
-1.238429235  
-1.227095014  
-1.222629473  
-1.214418825  
-1.192282731  
-1.147840004  
-1.075525728  
-0.9731896489  
-0.8422339384  
-0.6873234495  
-0.5157417795  
-0.3364957247  
-0.1593043545  
0.006402199606  
0.1523575391  
0.2721153036  
0.3614495255  
0.4184763948  
0.4435259553  
0.4388170441  
0.4079910016  
0.3555689464  
0.2863999204  
0.2051362137  
0.1157968815  
0.02144659578  
-0.0759850495  
-0.1757137031  
-0.2779261433  
-0.3834489353  
-0.493270803  
-0.6079880562  
-0.7272580273  
-0.8493379925  
-0.970824392  
-1.086646281  
-1.190355449  
-1.27471729  
-1.332525164  
-1.357529711  
-1.34535631  
-1.294250823  
-1.205520996  
-1.083602054  
-0.9356850606  
-0.7709892209  
-0.5997425349  
-0.4320313487  
-0.2766824814  
-0.140323118  
-0.02674809547  
0.06334183416  
0.1322191477  
0.1846689292  
0.2272732191  
0.2675537909  
0.3130818231  
0.3706594182  
0.4456455662  
0.5414667815  
0.6593263957  
0.7981118728  
0.9544716121  
1.123041147  
1.296807358  
1.46758152  
1.626585932  
1.765121448  
1.875292622  
1.950732644  
1.987260754  
1.98338957  
1.940598929  
1.863314887  
1.758549684  
1.635223452  
1.503219004  
1.372287526  
1.250936795  
1.14545288  
1.059216895  
0.9923905094  
0.9420476737  
0.9027138904  
0.8672442705  
0.8278934719  
0.7774210657  
0.7100689623  
0.6222643086  
0.5129684169  
0.3836424949  
0.2378674991  
0.08071533519  
-0.08200649562  
-0.2444934682  
-0.401544912  
-0.5489561911  
-0.6836331703  
-0.8034838134  
-0.9071110352  
-0.9934250523  
-1.061251064  
-1.109050753  
-1.134811737  
-1.136147801  
-1.110604918  
-1.056133589  
-0.9716586435  
-0.8576541707  
-0.7166324147  
-0.5534518717  
-0.3753792044  
-0.1918496526  
-0.01391540447  
0.1465932585  
0.2781309275  
0.3706379652  
0.4167311567  
0.4127524236  
0.3595206081  
0.2626538439  
0.1323603222  
-0.01732319328  
-0.1698325518  
-0.3077863199  
-0.4149450988  
-0.4781503261  
-0.4890250918  
-0.4451564505  
-0.3505767299  
-0.2154417492  
-0.05489495762  
0.1127535413  
0.2683075242  
0.3941218167  
0.4763644936  
0.5067739995  
0.4836696908  
0.4120592909  
0.3028390156  
0.1711967499  
0.03445296084  
-0.09034866814  
-0.1887547563  
-0.2508035676  
-0.2722499151  
-0.2549695251  
-0.2065073853  
-0.1388647119  
-0.06672402325  
-0.005369608811  
0.03138604241  
0.0329994806  
-0.00650506308  
-0.08788567404  
-0.206699967  
-0.3539499673  
-0.5172112241  
-0.6820540645  
-0.8335684578  
-0.957797214  
-1.042939328  
-1.080229732  
-1.064482344  
-0.9942833479  
-0.8719305076  
-0.7031358329  
-0.4965879073  
-0.2634036393  
-0.01649297068  
0.2301423178  
0.4621825243  
0.6658216893  
0.8286191434  
0.9403431899  
0.9937094811  
0.9849557571  
0.9141589579  
0.7852481081  
0.6056807431  
0.3858120008  
0.138014195  
-0.1243403605  
-0.387925691  
-0.6403956304  
-0.8711219684  
-1.071655783  
-1.235911592  
-1.360094222  
-1.442444867  
-1.482897563  
-1.482743184  
-1.444371732  
-1.371147875  
-1.267413722  
-1.13857102  
-0.9911837214  
-0.8329910699  
-0.6727486727  
-0.5198341341  
-0.3835921783  
-0.2724534719  
-0.1929181469  
-0.1485430867  
-0.1390858126  
-0.1599860074  
-0.2023129597  
-0.2532529586  
-0.2971769407  
-0.3171696255  
-0.2969071498  
-0.22264361  
-0.08505906501  
0.119270905  
0.3870092907  
0.7079318724  
1.065600455  
1.438767852  
1.80337928  
2.134932116  
2.410921203  
2.613082967  
2.72918048  
2.754127317  
2.690350207  
2.547354805  
2.340595727  
2.089795997  
1.816944495  
1.544206678  
1.291988973  
1.077348251  
0.912876982  
0.8061213672  
0.7595117019  
0.7707286987  
0.8333911986  
0.9379215097  
1.072474102  
1.223834772  
1.378224838  
1.521997186  
1.642239395  
1.727301364  
1.767292926  
1.754559725  
1.68413881  
1.554167177  
1.366179648  
1.125243021  
0.8398646653  
0.5216098826  
0.1844340661  
-0.1562653915  
-0.4847959532  
-0.7864231787  
-1.048604692  
-1.262049511  
-1.421513242  
-1.526198608  
-1.57974722  
-1.589795519  
-1.567164044  
-1.524757351  
-1.476304764  
-1.435059515  
-1.412585058  
-1.417740649  
-1.455931845  
-1.52869398  
-1.633614998  
-1.764590557  
-1.912379041  
-2.06539978  
-2.210699087  
-2.335011227  
-2.425833762  
-2.472437357  
-2.466725793  
-2.403900899  
-2.282869313  
-2.106365379  
-1.880775764  
-1.615683388  
-1.32315634  
-1.016846049  
-0.7109815543  
-0.4193310969  
-0.1542485625  
0.07412332649  
0.2584224358  
0.3943687946  
0.4807951264  
0.5194358618  
0.5145299042  
0.4722943744  
0.4003688289  
0.30726474  
0.2018885148  
0.09315604265  
-0.010307501  
-0.1003899181  
-0.1696864926  
-0.2116887427  
-0.2210178225  
-0.1936987703  
-0.1274875317  
-0.02220891754  
0.1199454942  
0.2942313906  
0.4933456485  
0.7076588626  
0.9257120758  
1.134974773  
1.322789974  
1.477430924  
1.589131235  
1.650960151  
1.659433199  
1.614767701  
1.520750316  
1.384237628  
1.21437379  
1.021615802  
0.8167306629  
0.6098803531  
0.4099167655  
0.2239709744  
0.05735611914  
-0.08622939707  
-0.2042776893  
-0.2949198034  
-0.3563879859  
-0.3866005261  
-0.3829710481  
-0.3425043168  
-0.2621754353  
-0.1395589228  
0.02641786263  
0.2346881064  
0.4814187229  
0.7596300654  
1.059200219  
1.367259485  
1.668991551  
1.948728615  
2.191221129  
2.382910758  
2.51301992  
2.574333659  
2.563537373  
2.481105786  
2.330772009  
2.118685415  
1.852430122  
1.540075052  
1.189443749  
0.8077180171  
0.401442705  
-0.0230845621  
-0.4591492773  
-0.8988446294  
-1.332371381  
-1.747633606  
-2.130268448  
-2.464223477  
-2.732866404  
-2.920556287  
-3.014471711  
-3.006475821  
-2.894714062  
-2.684694753  
-2.389623042  
-2.029857121  
-1.631468765  
-1.224008528  
-0.8377078572  
-0.500430159  
-0.2347407739  
-0.0554911235  
0.03177098758  
0.03131572296  
-0.04341457137  
-0.1715574508  
-0.3274766348  
-0.4839587424  
-0.6155475  
-0.7015676384  
-0.7284453514  
-0.6910301102  
-0.5927696951  
-0.4447478509  
-0.2637777386  
-0.06983918724  
0.1167331987  
0.2779165807  
0.4001533233  
0.4757175822  
0.5031740633  
0.4869161585  
0.4359434896  
0.3621299666  
0.2782727925  
0.1962702558  
0.1256757101  
0.07285646263  
0.04081599743  
0.02966025024  
0.03756342971  
0.06201049665  
0.1010348464  
0.1542118728  
0.2231599605  
0.3114352134  
0.4237939159  
0.564911255  
0.7377749975  
0.9420204358  
1.172547209  
1.418709053  
1.664324253  
1.888622487  
2.068117679  
2.179209063  
2.201204747  
2.119335903  
1.927308112  
1.628947466  
1.238635838  
0.780376487  
0.2855412331  
-0.2104462464  
-0.6720469679  
-1.067652516  
-1.373144385  
-1.574492019  
-1.669014274  
-1.665145322  
-1.580760437  
-1.440304847  
-1.271168465  
-1.099809657  
-0.9481714817  
-0.8308852386  
-0.75361866  
-0.7127742286  
-0.6965606956  
-0.6872504392  
-0.6643214335  
-0.6080054533  
-0.5027650576  
-0.3401956169  
-0.1209171642  
0.1448269468  
0.4379975193  
0.732929728  
1.000583432  
1.21243153  
1.344431508  
1.380498321  
1.314950094  
1.153520167  
0.9127659296  
0.617938365  
0.2996269962  
