0.002895326838  
0.06529324997  
0.1244380372  
0.1813290772  
0.2371810319  
0.2933274436  
0.3510697081  
0.4114589439  
0.4750236259  
0.5414650065  
0.6093727407  
0.6760107991  
0.7372580867  
0.7877366185  
0.821180181  
0.8310318398  
0.8112373084  
0.7571477837  
0.6664227255  
0.5398010889  
0.3816064133  
0.1998851844  
0.006097091066  
-0.1856428941  
-0.3597281137  
-0.5005170451  
-0.593927121  
-0.6289703068  
-0.5990428732  
-0.5028035481  
-0.3444969352  
-0.1336930831  
0.1155563072  
0.3860434094  
0.6590436233  
0.9160856023  
1.14062151  
1.319415291  
1.443493656  
1.508571955  
1.514951933  
1.466946477  
1.371947053  
1.239301274  
1.079164101  
0.9014777584  
0.7152000109  
0.527846524  
0.3453526603  
0.1722073313  
0.01176956266  
-0.1333491453  
-0.2609455007  
-0.3690275594  
-0.4558106452  
-0.5199126342  
-0.5607030768  
-0.5787215149  
-0.5760560347  
-0.5565721547  
-0.5258877534  
-0.4910647686  
-0.4600016222  
-0.4405980079  
-0.4397948645  
-0.4626419045  
-0.5115226761  
-0.5856884494  
-0.6811769816  
-0.7911530108  
-0.9066291334  
-1.017486229  
-1.113641057  
-1.186205263  
-1.228484042  
-1.236672215  
-1.210174355  
-1.151522045  
-1.065911814  
-0.9604603997  
-0.8432767013  
-0.7225053252  
-0.6054428823  
-0.4978549426  
-0.4035569736  
-0.3242733841  
-0.259778625  
-0.2082531588  
-0.1667828906  
-0.1319158677  
-0.1001821253  
-0.06850897038  
-0.03448409677  
0.003551416397  
0.04657171611  
0.09505111608  
0.1492175678  
0.2092996186  
0.2757135614  
0.3491301617  
0.430404313  
0.5203571222  
0.6194463946  
0.7273700397  
0.8426887046  
0.9625408004  
1.082527292  
1.196831612  
1.298590254  
1.380515512  
1.435694573  
1.458492288  
1.445417378  
1.395828771  
1.312350485  
1.200898602  
1.070280874  
0.9313615675  
0.7958864207  
0.6750937482  
0.5782855048  
0.5115620583  
0.4769074012  
0.4717725783  
0.4892553786  
0.5188760894  
0.547872001  
0.5628604885  
0.5516418078  
0.5048916777  
0.4175047567  
0.2893729879  
0.1254795598  
-0.06473476164  
-0.268653636  
-0.4722601383  
-0.6621426982  
-0.8274549454  
-0.9615350955  
-1.06293209  
-1.135659926  
-1.188631492  
-1.234304573  
-1.286731968  
-1.35926486  
-1.462250957  
-1.601055288  
-1.774703087  
-1.97537943  
-2.188868346  
-2.395925177  
-2.574404734  
-2.701885757  
-2.75843857  
-2.729172986  
-2.606213536  
-2.389838864  
-2.088627846  
-1.718596917  
-1.30144517  
-0.8621493799  
-0.4262333242  
-0.01707494882  
0.3464176909  
0.6514592607  
0.8922142504  
1.069719217  
1.190987237  
1.267452964  
1.313021428  
1.341999449  
1.367195651  
1.398409832  
1.441486858  
1.49798388  
1.565441271  
1.638147743  
1.708257543  
1.767062532  
1.806255674  
1.819022138  
1.800850225  
1.749996956  
1.667599782  
1.557455826  
1.42553906  
1.279320514  
1.12698563  
0.9766204213  
0.8354564101  
0.7092095273  
0.6015923413  
0.5140124634  
0.4454942483  
0.3928401422  
0.351011589  
0.3137322609  
0.2742475007  
0.2261893531  
0.1644629757  
0.08604090624  
-0.009422606304  
-0.1192739322  
-0.2378913235  
-0.3571249982  
-0.4671178212  
-0.5574493535  
-0.6184750595  
-0.6427105682  
-0.6260684821  
-0.5687748501  
-0.4758058052  
-0.3567539877  
-0.2250872873  
-0.09687306293  
0.01090729427  
0.08225862493  
0.1040360643  
0.06754398754  
-0.03034197189  
-0.186688039  
-0.3927016184  
-0.6346077744  
-0.895058094  
-1.154917181  
-1.395167745  
-1.598726976  
-1.751941028  
-1.845629664  
-1.875582738  
-1.842512534  
-1.751537401  
-1.611293438  
-1.432846414  
-1.228529765  
-1.010857368  
-0.7915968029  
-0.5810617614  
-0.3876351442  
-0.2175163225  
-0.07463669946  
0.03928632921  
0.1246041449  
0.1835249326  
0.2198549172  
0.2386888297  
0.2460430965  
0.2484317699  
0.2523853479  
0.2639369254  
0.288102629  
0.328414246  
0.3865546675  
0.4621454427  
0.5527409076  
0.6540331077  
0.7602640787  
0.8648139349  
0.9608876863  
1.042224067  
1.103739915  
1.142026374  
1.155628758  
1.14509815  
1.112796735  
1.062507317  
0.9989022614  
0.9269581514  
0.8513875751  
0.7761625527  
0.7041890371  
0.6371560241  
0.5755539699  
0.518859967  
0.4658252684  
0.4148326031  
0.3642534263  
0.3127564185  
0.2595314995  
0.2043930861  
0.1477631045  
0.09053946734  
0.0338782226  
-0.02106490706  
-0.07339586629  
-0.1226880824  
-0.1691010695  
-0.2133855973  
-0.2567641233  
-0.3007000611  
-0.3466002495  
-0.3954857745  
-0.4476949018  
-0.502676942  
-0.5589192826  
-0.6140385721  
-0.6650430248  
-0.7087410115  
-0.7422500858  
-0.7635413188  
-0.7719297988  
-0.7684436716  
-0.7559768129  
-0.7392036519  
-0.7242071715  
-0.7178611042  
-0.7270114823  
-0.7575485912  
-0.8134862459  
-0.896171649  
-1.003733932  
-1.130875926  
-1.269049671  
-1.407032943  
-1.531853562  
-1.629977834  
-1.688635951  
-1.697132946  
-1.647993894  
-1.53781367  
-1.36770982  
-1.143309785  
-0.8742868513  
-0.5734863285  
-0.2557436358  
0.06347019168  
0.3694191297  
0.6493505259  
0.8934741673  
1.095598207  
1.253357344  
1.368046049  
1.444100034  
1.488301604  
1.508826987  
1.514236305  
1.512524449  
1.510319214  
1.512298979  
1.520865662  
1.536084855  
1.55587961  
1.576435913  
1.592766603  
1.599379644  
1.590968836  
1.563072108  
1.512629339  
1.43839023  
1.341130694  
1.223665011  
1.090640687  
0.9481482417  
0.8031728933  
0.6629532164  
0.5343075456  
0.4230028287  
0.3332227009  
0.267194513  
0.2250111154  
0.204649546  
0.2021910161  
0.2121958108  
0.2282043705  
0.2432974383  
0.250673008  
0.2441818652  
0.2187959351  
0.1709744901  
0.09892214875  
0.002731315792  
-0.1155922461  
-0.2522207364  
-0.4017058906  
-0.5573003097  
-0.7113903265  
-0.856025638  
-0.9835329163  
-1.087161279  
-1.16171377  
-1.204091479  
-1.213685965  
-1.192554405  
-1.145337226  
-1.078905229  
-1.001756774  
-0.9232240936  
-0.8525768571  
-0.7981200768  
-0.7663973935  
-0.7615899868  
-0.7851829666  
-0.835921057  
-0.910051922  
-1.001805156  
-1.104034152  
-1.208931434  
-1.30872385  
-1.396258359  
-1.465443762  
-1.511502148  
-1.531052008  
-1.52204197  
-1.48360675  
-1.415886044  
-1.31987224  
-1.197320528  
-1.050737835  
-0.8834440772  
-0.699664877  
-0.5046116493  
-0.30449561  
-0.1064107384  
0.08193562163  
0.2526654432  
0.3983257986  
0.5125768825  
0.5909100603  
0.6312842784  
0.6345866569  
0.6048291644  
0.5490117987  
0.4766336541  
0.3988631539  
0.3274443302  
0.2734510401  
0.2460345243  
0.2513165455  
0.291588879  
0.3649274882  
0.4653054957  
0.5831996748  
0.7066481188  
0.8226237819  
0.9185686275  
0.9838822769  
1.011176223  
0.9971284767  
0.9428219961  
0.8535209999  
0.737925158  
0.6070040571  
0.4725835063  
0.3458862212  
0.2362190192  
0.150008195  
0.09028471752  
0.05667909851  
0.04589740095  
0.05257718952  
0.07035491575  
0.09298166805  
0.1153003733  
0.1339356657  
0.1476260671  
0.1571705116  
0.1650443716  
0.1747836108  
0.1902787197  
0.2151084916  
0.2520405407  
0.3027634352  
0.3678784822  
0.4471047861  
0.5396140238  
0.6443774882  
0.7604202322  
0.8868707157  
1.022792652  
1.166800769  
1.31654845  
1.468226606  
1.616208035  
1.752992961  
1.869528744  
1.955929033  
2.002523704  
2.001078554  
1.945988966  
1.835231182  
1.67085597  
1.458935659  
1.208923482  
0.9325192801  
0.6422467132  
0.3499703639  
0.06563298873  
-0.2035698898  
-0.4534574631  
-0.6825317295  
-0.8911736631  
-1.080556326  
-1.251537499  
-1.403779993  
-1.535314361  
-1.64262771  
-1.721284554  
-1.766923047  
-1.776436028  
-1.749060553  
-1.687146469  
-1.596418685  
-1.485653879  
-1.365798407  
-1.248671376  
-1.145455175  
-1.065232916  
-1.013804218  
-0.9929790013  
-1.000444405  
-1.030217378  
-1.073593498  
-1.120435828  
-1.160590938  
-1.185216882  
-1.187853021  
-1.165087895  
-1.116768244  
-1.045772952  
-0.9574038102  
-0.8585397189  
-0.756660922  
-0.658913385  
-0.5713027586  
-0.4981277502  
-0.4416829339  
-0.4022474981  
-0.3783243405  
-0.3670868914  
-0.36493461  
-0.3681004344  
-0.3732035225  
-0.3776865659  
-0.3800773557  
-0.3800421849  
-0.3782303565  
-0.3759408625  
-0.3746568679  
-0.3755364855  
-0.3789322423  
-0.384032915  
-0.3886885347  
-0.3894615851  
-0.3819156368  
-0.3611153675  
-0.3222728138  
-0.2614649429  
-0.1763202336  
-0.06657268818  
0.06559105762  
0.2154696699  
0.3760862481  
0.5387307596  
0.6937477902  
0.8315034852  
0.9434138208  
1.022918755  
1.066281446  
1.073111934  
1.046529808  
0.9929391339  
0.9214133469  
0.8427491992  
0.7682814533  
0.708590512  
0.6722519395  
0.6647800423  
0.6879087273  
0.7393092528  
0.8128021003  
0.8990610375  
0.9867366843  
1.063866873  
1.119402446  
1.144651156  
1.134431891  
1.087792871  
1.008168162  
0.9029519296  
0.7825428222  
0.6589902802  
0.5444306026  
0.449543403  
0.3822526929  
0.3468485063  
0.3436519041  
0.3692586246  
0.4172995391  
0.4795790445  
0.5474032947  
0.6128777055  
0.6699676684  
0.7151641986  
0.7476587953  
0.769023025  
0.7824625142  
0.7917903133  
0.8003037981  
0.809765637  
0.8196654036  
0.8269077562  
0.8259606731  
0.8094837083  
0.7693167271  
0.6976971714  
0.5885050379  
0.4383602564  
0.2473844648  
0.01952371373  
-0.2376233905  
-0.5134560338  
-0.7953912217  
-1.070123337  
-1.324931742  
-1.548859325  
-1.73361403  
-1.874077178  
-1.968383807  
-2.017595309  
-2.025054744  
-1.995550177  
-1.93444221  
-1.846903542  
-1.737379627  
-1.60935167  
-1.465410283  
-1.307587087  
-1.137865703  
-0.9587293888  
-0.7736250709  
-0.5872161385  
-0.405354294  
-0.2347277016  
-0.08222901119  
0.04588429608  
0.1448989751  
0.2124861563  
0.2493085969  
0.2593000709  
0.2495067104  
0.2295088992  
0.2104486345  
0.203784787  
0.219920445  
0.2668803016  
0.3492170006  
0.4672884951  
0.6170015162  
0.790078133  
0.9747966397  
1.157136658  
1.322167788  
1.455536951  
1.544857402  
1.580848063  
1.558100262  
1.47539632  
1.335573627  
1.144966719  
0.9125439933  
0.648853576  
0.3649289199  
0.07130382697  
-0.2227547843  
-0.5097171288  
-0.7839329871  
-1.041474105  
-1.279738351  
-1.49692089  
-1.691466189  
-1.861608587  
-2.0050963  
-2.119144395  
-2.20062606  
-2.246457713  
-2.254108339  
-2.222119796  
-2.150551354  
-2.041238619  
-1.897821406  
-1.725519782  
-1.530681578  
-1.32017599  
-1.100730493  
-0.8783013762  
-0.6575957825  
-0.4417997535  
-0.2325514199  
-0.03014789378  
0.1660543959  
0.3571371926  
0.5440887335  
0.727342447  
0.9064506295  
1.079935243  
1.245325391  
1.399343732  
1.538211123  
1.657989603  
1.754898298  
1.825573959  
1.8672258  
1.877706252  
1.855510649  
1.799761839  
1.71021453  
1.587325822  
1.432412895  
1.247879345  
1.03748078  
0.8065611355  
0.5621834885  
0.3130842131  
0.06939038359  
-0.1579274356  
-0.3578426787  
-0.5202434085  
-0.6369771644  
-0.7028362108  
-0.7163401205  
-0.6801664767  
-0.6011509632  
-0.4897884917  
-0.359262324  
-0.2240981703  
-0.0985761454  
0.004881893155  
0.07716303083  
0.113526868  
0.11416095  
0.08411754972  
0.03265590049  
-0.02795767954  
-0.08400020994  
-0.1220258932  
-0.130538449  
-0.1014007047  
-0.03080962708  
0.08026133028  
0.2261909091  
0.3973677054  
0.581253016  
0.7637135151  
0.9304354366  
1.06824926  
1.166233523  
1.216488223  
1.2145487  
1.159453973  
1.053530285  
0.9019835449  
0.71239394  
0.4941953585  
0.258191225  
0.01610882308  
-0.2198197157  
-0.4373119022  
-0.6245811203  
-0.7709907618  
-0.8678350679  
-0.9091748653  
-0.8926431299  
-0.8200657994  
-0.6977727884  
-0.5364613866  
-0.3505497964  
-0.1570298233  
0.02609827302  
0.1816183295  
0.2949172594  
0.3555608772  
0.3584142013  
0.3041503705  
0.1990537252  
0.05417630388  
-0.1160543783  
-0.2955554573  
-0.468403504  
-0.6204970194  
-0.7408633572  
-0.8224689611  
-0.8624764695  
-0.8619818595  
-0.8253290035  
-0.759158636  
-0.6713621035  
-0.5701024892  
-0.4630338602  
-0.3567859358  
-0.2567397858  
-0.1670453902  
-0.09081608535  
-0.03040238347  
0.01234984182  
0.03593123374  
0.03912272512  
0.02108179694  
-0.01846516344  
-0.07898393293  
-0.1589019932  
-0.2554586569  
-0.3646719266  
-0.4814592849  
-0.5999060106  
-0.7136658896  
-0.8164368826  
-0.9024650456  
-0.9670099223  
-1.006704469  
-1.019775027  
-1.006085332  
-0.9670013539  
-0.9051018476  
-0.8237754638  
-0.726761049  
-0.6177058177  
-0.4997938002  
-0.3755028683  
-0.2465266839  
-0.1138454416  
0.02205467032  
0.1608774495  
0.3021753701  
0.4450530881  
0.5879594662  
0.7286210041  
0.8641334614  
0.991195542  
1.106455086  
1.206906362  
1.290269286  
1.35527813  
1.401823681  
1.430917701  
1.444464263  
1.444873435  
1.434569239  
1.415469813  
1.388534256  
1.353448675  
1.308527832  
1.250859369  
1.176692731  
1.082024275  
0.9632998277  
0.8181348605  
0.6459367574  
0.4483290448  
0.22930622  
-0.004912390773  
-0.2463227951  
-0.4857906354  
-0.7138401547  
-0.9214507229  
-1.100761481  
-1.245585278  
-1.351698456  
-1.416905907  
-1.440918316  
-1.425123592  
-1.372336473  
-1.286586062  
-1.172994478  
-1.037737711  
-0.8880474271  
-0.7321829085  
-0.5792848572  
-0.4390422537  
-0.3211285278  
-0.2344234139  
-0.1860928163  
-0.1806385189  
-0.219076215  
-0.2984123193  
-0.4115396716  
-0.547649291  
-0.693157011  
-0.8330655868  
-0.9526021477  
-1.038915945  
-1.08257928  
-1.078681327  
-1.027322404  
-0.9334362976  
-0.8059562846  
-0.6564483681  
-0.4974201344  
-0.3405668523  
-0.1952179294  
-0.06721636027  
0.04161377962  
0.1333559256  
0.21328847  
0.2887090702  
0.3675032176  
0.4566910008  
0.5611750346  
0.6828795228  
0.8203845695  
0.9690921376  
1.121872405  
1.270062613  
1.404657033  
1.517503226  
1.602324369  
1.655442158  
1.676095588  
1.666356243  
1.630660433  
1.575063002  
1.506331661  
1.431029388  
1.354710337  
1.281347897  
1.21304497  
1.150059801  
1.091099638  
1.033819851  
0.9754228618  
0.9132504276  
0.8452668149  
0.7703606478  
0.6884225188  
0.6002118207  
0.5070446811  
0.4103863129  
0.3114351474  
0.2107817141  
0.1082234555  
0.002761401019  
-0.1072139253  
-0.2235931877  
-0.3481419575  
-0.4821014583  
-0.625882564  
-0.7789171123  
-0.9396813601  
-1.105896106  
-1.274834825  
-1.443662061  
-1.609722409  
-1.770667706  
-1.924403219  
-2.068831997  
-2.20143321  
-2.318786466  
-2.416141934  
-2.487188929  
-2.524112272  
-2.518020744  
-2.459741317  
-2.340922934  
-2.155307159  
-1.900005037  
-1.576564969  
-1.191660073  
-0.7572486809  
-0.2901403205  
0.1890236126  
0.6572864444  
1.091220491  
1.468904545  
1.771798349  
1.986318417  
2.104931045  
2.126665984  
2.057004078  
1.907171866  
1.692950307  
1.433135512  
1.14783617  
0.8567787861  
0.5778030857  
0.3256559496  
0.1111945336  
-0.05897469265  
-0.1824436375  
-0.2605719952  
-0.2977804291  
-0.3006690594  
-0.2770725109  
-0.2351531494  
-0.1826296369  
-0.1261917906  
-0.07114029949  
-0.02125157232  
0.02116173956  
0.05504314911  
