0.1325005476  
0.05492795243  
-0.01739492233  
-0.07760233741  
-0.1196695787  
-0.1388785488  
-0.1322024446  
-0.09860868744  
-0.03924245797  
0.04251022665  
0.141110236  
0.2491232255  
0.3576534623  
0.4569702011  
0.5372878394  
0.5896770686  
0.6070191735  
0.5849067583  
0.5223813092  
0.4223852998  
0.2918295928  
0.1412205316  
-0.0161769303  
-0.1655778609  
-0.2922132898  
-0.3830014343  
-0.4281534173  
-0.4225135461  
-0.3664435255  
-0.2661144556  
-0.1331256197  
0.01653599214  
0.1641084238  
0.2900743988  
0.3763611955  
0.4084626082  
0.3772338328  
0.2801251894  
0.1216982815  
-0.08665478891  
-0.327781016  
-0.5805081224  
-0.8218676648  
-1.029547622  
-1.184296176  
-1.271995259  
-1.285177944  
-1.223818302  
-1.095318541  
-0.9137057432  
-0.6981417178  
-0.4709293936  
-0.2552355803  
-0.07278770393  
0.05822747036  
0.1248410528  
0.1204205337  
0.04513217234  
-0.09425155724  
-0.2851542532  
-0.5104858103  
-0.7502777  
-0.9834846613  
-1.189783003  
-1.351209076  
-1.453512083  
-1.48711789  
-1.447677948  
-1.336159666  
-1.158532531  
-0.9250883959  
-0.6494721851  
-0.3475265231  
-0.0360434402  
0.2684742547  
0.5509402165  
0.7986213331  
1.00182022  
1.154267144  
1.253213699  
1.299257622  
1.295945578  
1.249222161  
1.166815288  
1.057613057  
0.9311031155  
0.7968911929  
0.6643110386  
0.5420965707  
0.4380807256  
0.3588913707  
0.3096111103  
0.2934140293  
0.3112065405  
0.361337707  
0.4394559789  
0.5385950488  
0.6495443958  
0.7615274367  
0.8631636427  
0.9436152354  
0.9938016944  
1.007501325  
0.9821835882  
0.9194206048  
0.8247862301  
0.707226387  
0.5779578365  
0.4490395041  
0.331807468  
0.2354065518  
0.1656303484  
0.1242535184  
0.1089559048  
0.1138500054  
0.1305388178  
0.1495277849  
0.1617749468  
0.1601318288  
0.1404502809  
0.1021817637  
0.04837753489  
-0.014891686  
-0.07960382729  
-0.13715521  
-0.179796351  
-0.2019200984  
-0.200982033  
-0.1779314557  
-0.1370946978  
-0.08556611675  
-0.03220713303  
0.01354854243  
0.04290874353  
0.04875985594  
0.02639555462  
-0.02614111142  
-0.1081001402  
-0.2164006503  
-0.3462177406  
-0.4916616566  
-0.6464065729  
-0.8041826505  
-0.9590592499  
-1.105528961  
-1.23842584  
-1.352765881  
-1.443599649  
-1.505967941  
-1.535029768  
-1.526370834  
-1.476480017  
-1.383312008  
-1.246845237  
-1.069519333  
-0.8564576011  
-0.6154074463  
-0.3563807898  
-0.0910189812  
0.1682340821  
0.4090620455  
0.6201791643  
0.7921227678  
0.9178452243  
0.9930774091  
1.016460555  
0.9894726406  
0.9162014135  
0.8030137555  
0.6581508147  
0.4912860242  
0.3130445122  
0.134485388  
-0.03344924455  
-0.180516213  
-0.2977500936  
-0.3780051041  
-0.4164019731  
-0.410631889  
-0.3610859084  
-0.2707832516  
-0.1451168162  
0.008548740679  
0.1813814787  
0.3636280482  
0.545155673  
0.7159632389  
0.8666453051  
0.9888233109  
1.075554712  
1.121735402  
1.124498459  
1.08358044  
1.001607088  
0.8842397817  
0.7400933749  
0.5803751187  
0.4181984845  
0.2675812053  
0.1421853904  
0.05391301495  
0.01150731764  
0.01934325033  
0.07657351593  
0.1767920267  
0.3082938895  
0.454960661  
0.5977144474  
0.7163967654  
0.7918769799  
0.8081567909  
0.754217809  
0.6253920758  
0.4240897017  
0.1597762153  
-0.1518041047  
-0.4900784222  
-0.8316254212  
-1.152455136  
-1.430345435  
-1.646981004  
-1.789657742  
-1.852378512  
-1.836228949  
-1.749003311  
-1.604140677  
-1.419100828  
-1.213374598  
-1.006354752  
-0.8153181629  
-0.653732383  
-0.5300766834  
-0.4472991755  
-0.4029478871  
-0.3899453272  
-0.397896531  
-0.4147495965  
-0.4286072423  
-0.4294459781  
-0.4105359741  
-0.369372185  
-0.3080042373  
-0.2327191519  
-0.1531213637  
-0.08072341054  
-0.02724374547  
-0.002824981496  
-0.01442594354  
-0.06459661712  
-0.1508078571  
-0.2654307601  
-0.3963746704  
-0.5282979178  
-0.6442405403  
-0.7274710506  
-0.7633130397  
-0.7407306102  
-0.6534933089  
-0.5008000258  
-0.2873082613  
-0.02260950292  
0.2797642772  
0.6036457578  
0.9316954443  
1.246833254  
1.533500184  
1.778633895  
1.972298749  
2.107963051  
2.18245839  
2.195704298  
2.150283787  
2.050975536  
1.904318462  
1.718258941  
1.501900418  
1.265330572  
1.019463883  
0.775844599  
0.5463178643  
0.3425402633  
0.1752893992  
0.05362151019  
-0.01605812215  
-0.03088655849  
0.007744792516  
0.09379800459  
0.2166497961  
0.3616595779  
0.5112707866  
0.6465540678  
0.7490573729  
0.8027552423  
0.7958534335  
0.7222081445  
0.5821582077  
0.3826240187  
0.1364388237  
-0.1390311905  
-0.4238130689  
-0.697543705  
-0.9416972087  
-1.141499937  
-1.287307406  
-1.375236236  
-1.407013439  
-1.389089538  
-1.331191918  
-1.244565727  
-1.140206884  
-1.027363536  
-0.9125426297  
-0.7991515663  
-0.6877957402  
-0.5771376482  
-0.4651188652  
-0.3502909717  
-0.2329760962  
-0.1160259543  
-0.005002430214  
0.09226885466  
0.1667284017  
0.2095188913  
0.2135983049  
0.1752337045  
0.09511540974  
-0.02113006833  
-0.16314773  
-0.316796433  
-0.4656985088  
-0.5932113799  
-0.6845128092  
-0.7285270347  
-0.7193873804  
-0.6572406929  
-0.5482689788  
-0.4039280886  
-0.2395212565  
-0.07230029195  
0.08062957525  
0.2043248223  
0.2876700085  
0.3244933042  
0.3140119739  
0.2605857505  
0.1728527723  
0.06239865208  
-0.05782860737  
-0.1751373913  
-0.2785285493  
-0.3597719877  
-0.4140237161  
-0.4399374427  
-0.4393140651  
-0.4163893517  
-0.3768960131  
-0.3270645239  
-0.2727170387  
-0.2185743503  
-0.1678559223  
-0.1221992725  
-0.08185197549  
-0.04607951801  
-0.01365499299  
0.01667075672  
0.04582949169  
0.07430497543  
0.1022324346  
0.129704835  
0.1572045528  
0.1860562108  
0.218763661  
0.259112906  
0.3119595476  
0.3826636301  
0.4762231811  
0.5961948057  
0.7435832876  
0.9158831788  
1.106471688  
1.304519654  
1.495511316  
1.662382037  
1.787187695  
1.853123606  
1.846639471  
1.759369  
1.58959329  
1.343015138  
1.032688874  
0.678084707  
0.3033549954  
-0.06500109803  
-0.4008095004  
-0.6809140501  
-0.8875677631  
-1.010240108  
-1.046626357  
-1.002746795  
-0.8921324127  
-0.7341977499  
-0.5520084047  
-0.3697110864  
-0.209927672  
-0.09142407111  
-0.02730684006  
-0.02394505099  
-0.0807089083  
-0.1905151498  
-0.3410685142  
-0.5166068603  
-0.6999012466  
-0.8742440739  
-1.025179559  
-1.141776411  
-1.217337655  
-1.249501036  
-1.239797717  
-1.192802967  
-1.115029364  
-1.013781543  
-0.8961223801  
-0.7680965769  
-0.6342790808  
-0.4976678848  
-0.3598687581  
-0.2214882327  
-0.08262108335  
0.05667578129  
0.1960126387  
0.3344568485  
0.4705004938  
0.6021817304  
0.7273120861  
0.8437441256  
0.9496076251  
1.043472721  
1.124391669  
1.191825679  
1.245469066  
1.285010389  
1.309878047  
1.319025829  
1.310803817  
1.282942779  
1.232672198  
1.156967439  
1.052889551  
0.9179910338  
0.7507275989  
0.5508154958  
0.3195060133  
0.05971889294  
-0.2239606487  
-0.525431516  
-0.8373348359  
-1.151396058  
-1.45880101  
-1.750563443  
-2.017869819  
-2.252370284  
-2.446428766  
-2.593346483  
-2.687568666  
-2.724899623  
-2.702726323  
-2.620237528  
-2.478617822  
-2.281172643  
-2.033347249  
-1.742599823  
-1.418115244  
-1.070365176  
-0.7105477434  
-0.349959985  
0.0006259774624  
0.331524047  
0.634571886  
0.9034290117  
1.133731388  
1.323132338  
1.471273055  
1.579727335  
1.651943182  
1.693190679  
1.71047726  
1.71237727  
1.708708553  
1.709978544  
1.726584319  
1.767764111  
1.840383968  
1.947697157  
2.088255311  
2.255183939  
2.436008843  
2.613175268  
2.765320541  
2.869239516  
2.902382077  
2.84561404  
2.685896547  
2.418524285  
2.048579243  
1.591341264  
1.0715213  
0.5213244076  
-0.02248190911  
-0.522191996  
-0.9430654704  
-1.257058756  
-1.445923442  
-1.503303123  
-1.435555624  
-1.261186468  
-1.00894896  
-0.7148122278  
-0.4181424634  
-0.1575250745  
0.03329419615  
0.1288953603  
0.1147151423  
-0.01165737164  
-0.2405384132  
-0.5515228546  
-0.9159911719  
-1.30042  
-1.670096782  
-1.992803908  
-2.242046177  
-2.399488994  
-2.456376664  
-2.413837734  
-2.28212483  
-2.078952991  
-1.827196773  
-1.552240906  
-1.279306156  
-1.031018831  
-0.8254558065  
-0.674797181  
-0.5846639978  
-0.5541219978  
-0.5762842759  
-0.6393926499  
-0.7282421879  
-0.8257856602  
-0.9147802497  
-0.9793296094  
-1.00621935  
-0.985953329  
-0.9134307871  
-0.7882407463  
-0.6145678665  
-0.4007406196  
-0.1584702959  
0.09815181811  
0.3538086237  
0.5931826857  
0.8021563165  
0.9689062221  
1.084812881  
1.145126671  
1.149342654  
1.101256782  
1.008690362  
0.882902062  
0.7377120211  
0.5884054249  
0.4504891322  
0.3384020946  
0.2642802038  
0.2368932207  
0.260844641  
0.3361178532  
0.4580191673  
0.6175203664  
0.8019882444  
0.9962282339  
1.183751455  
1.348150381  
1.474457271  
1.550372139  
1.567246764  
1.5207559  
1.411204504  
1.243460553  
1.026530302  
0.7728250851  
0.4971862562  
0.2157445853  
-0.05529070024  
-0.3008338287  
-0.5080272624  
-0.6671691063  
-0.7724047028  
-0.8221250709  
-0.8190433459  
-0.7699277055  
-0.6850139586  
-0.5771223422  
-0.4605490197  
-0.3498174844  
-0.2583949443  
-0.197486088  
-0.1750347567  
-0.1950136865  
-0.2571063133  
-0.356805154  
-0.4859371635  
-0.6335566783  
-0.7871226953  
-0.9338226303  
-1.06189142  
-1.16175943  
-1.226896388  
-1.254232392  
-1.244108734  
-1.199767765  
-1.126463768  
-1.030335305  
-0.9172160369  
-0.7915874954  
-0.6558428584  
-0.5099978109  
-0.3519109407  
-0.1779846816  
0.015746314  
0.2323267678  
0.4725943465  
0.7341253285  
1.010610158  
1.291788289  
1.56400521  
1.811351643  
2.017254141  
2.166324743  
2.246221624  
2.249273807  
2.173637877  
2.023820713  
1.810482509  
1.549526265  
1.260570606  
0.9649909612  
0.6837603594  
0.4353511529  
0.2339529447  
0.08820671755  
0.0006039148771  
-0.03239234456  
-0.01954577382  
0.02652075735  
0.09107252779  
0.159155381  
0.21739024  
0.255455727  
0.2670668351  
0.2503590184  
0.2076460936  
0.1446088037  
0.06906075373  
-0.01052971648  
-0.08653358884  
-0.1534490375  
-0.2087981623  
-0.2534945106  
-0.2916195737  
-0.3296399633  
-0.375165197  
-0.435433625  
-0.5157416563  
-0.6180727062  
-0.740139586  
-0.8750396813  
-1.011607523  
-1.135484389  
-1.230795839  
-1.282250536  
-1.277376561  
-1.208588141  
-1.074772884  
-0.8821269132  
-0.6440806428  
-0.3802540978  
-0.1145354522  
0.1275026288  
0.3215266244  
0.4473135549  
0.4911911821  
0.4476930097  
0.3201986035  
0.1204521937  
-0.1329657084  
-0.4170088484  
-0.7070371205  
-0.9797749905  
-1.215942007  
-1.402183918  
-1.532046496  
-1.605903604  
-1.629880314  
-1.614008898  
-1.5699416  
-1.508627564  
-1.438332585  
-1.363341954  
-1.283527131  
-1.194833425  
-1.090574339  
-0.9632734689  
-0.8067214089  
-0.617869157  
-0.3982127047  
-0.1544141392  
0.1019671883  
0.355613115  
0.5892919843  
0.7861404513  
0.9320202509  
1.017620418  
1.039957778  
1.003073912  
0.9178005831  
0.8006260095  
0.6718065872  
0.5529661268  
0.4645002207  
0.4231062653  
0.4397543692  
0.5183346752  
0.6551446718  
0.8392658644  
1.053774164  
1.277637133  
1.488079701  
1.663135561  
1.784110348  
1.837678547  
1.81738717  
1.72440131  
1.567416401  
1.361741188  
1.127661078  
0.8882446936  
0.6668502728  
0.4845935046  
0.3580708785  
0.2975824937  
0.3060667904  
0.3788706922  
0.504375526  
0.6654186025  
0.8413340622  
1.010373546  
1.152217528  
1.250268707  
1.293447641  
1.277274768  
1.204110161  
1.082536336  
0.9259702694  
0.7507062251  
0.5736570143  
0.4100875934  
0.2716574177  
0.1650037832  
0.09105321296  
0.04511638843  
0.01773825521  
-0.003850453559  
-0.03388589567  
-0.08609329331  
-0.1718419819  
-0.2986720965  
-0.4693592119  
-0.6816086874  
-0.9283884042  
-1.198804458  
-1.479382982  
-1.755559916  
-2.013175283  
-2.239788175  
-2.425663952  
-2.564347314  
-2.652801015  
-2.691145395  
-2.682099648  
-2.630235168  
-2.541190255  
-2.420951399  
-2.275302703  
-2.109489463  
-1.9281022  
-1.735145984  
-1.534231227  
-1.328811473  
-1.122393947  
-0.9186620792  
-0.7214782843  
-0.5347618149  
-0.3622659527  
-0.2072855413  
-0.07235853893  
0.04099743556  
0.1324637728  
0.2029928941  
0.2547485116  
0.2909334752  
0.3155124086  
0.3328642953  
0.3474005801  
0.3631849809  
0.3835958122  
0.4110574021  
0.4468752064  
0.4911841228  
0.5430147629  
0.6004828778  
0.6610694823  
0.721973379  
0.7804906991  
0.834382017  
0.8821796272  
0.923396546  
0.9586052619  
0.9893748051  
1.018064117  
1.047496435  
1.08054589  
1.119691418  
1.16659063  
1.22172414  
1.284164378  
1.351500705  
1.419934176  
1.484549771  
1.53972996  
1.579685538  
1.599041572  
1.593423725  
1.559971178  
1.49773033  
1.407858813  
1.293623576  
1.160163965  
1.014041364  
0.8626051253  
0.7132437689  
0.5725962044  
0.4458245504  
0.3360400779  
0.2439625931  
0.1678800174  
0.1039220413  
0.04663896732  
-0.01017255737  
-0.07250468877  
-0.145145586  
-0.2308001877  
-0.3294526823  
-0.4380779992  
-0.550757611  
-0.6592207764  
-0.7537629924  
-0.8244370531  
-0.8623848417  
-0.8611276908  
-0.817651705  
-0.7331282372  
-0.6131519162  
-0.4674565659  
-0.3091031135  
-0.1532437531  
-0.01559129122  
0.08921673177  
0.1491600216  
0.1561028366  
0.1066309584  
0.002372985453  
-0.1502239832  
-0.3406104953  
-0.5552463267  
-0.7789517357  
-0.9963415653  
-1.193170662  
-1.357456506  
-1.480282412  
-1.556227192  
-1.583427986  
-1.563307061  
-1.500039634  
-1.399854522  
-1.270252876  
-1.119238423  
-0.954625505  
-0.7834814238  
-0.6117264676  
-0.4439181899  
-0.2832023983  
-0.131423605  
0.01062685067  
0.1428685295  
0.2655147795  
0.3786472169  
0.4818018744  
0.5736379051  
0.6517183071  
0.7124545087  
0.7512433737  
0.7628073786  
0.7417339076  
0.68317831  
0.5836642795  
0.4418991558  
0.2594916007  
0.04146000604  
-0.2035659026  
-0.4635429844  
-0.7236307119  
-0.9672230552  
-1.177302569  
-1.338001802  
-1.436178139  
-1.462825405  
-1.414121835  
-1.291975035  
-1.103958668  
-0.8626353837  
-0.5843248111  
-0.2874554486  
0.009305920227  
0.288917938  
0.537608588  
0.7460872375  
0.9101993622  
1.03094669  
1.113890333  
1.168023638  
1.204265894  
1.233785149  
1.266355074  
1.308961439  
1.364831093  
1.432996952  
1.508447526  
1.582827156  
1.645591867  
1.68545579  
1.69193358  
1.656774473  
1.575096828  
1.446079815  
1.273118022  
1.06344057  
0.8272504103  
0.5765131915  
0.3235793674  
0.079833435  
-0.1454371828  
-0.3457988665  
-0.5179601408  
-0.6615675113  
-0.7785792722  
-0.8723247603  
-0.9464429755  
-1.00388019  
-1.04613571  
-1.07288549  
-1.08206036  
-1.070361278  
-1.034126845  
-0.9703952146  
-0.8779665701  
-0.7582667818  
-0.6158343035  
-0.4583204447  
-0.2959620927  
-0.1405847949  
-0.004264509931  
0.1021622595  
0.1704976535  
0.1963036451  
0.1795356934  
0.1246108406  
0.03987351922  
-0.06345636333  
-0.1727084046  
