0.4923456981  
0.1533381973  
-0.173312215  
-0.4748768534  
-0.7404721914  
-0.9616547862  
-1.13272309  
-1.250743456  
-1.315325433  
-1.328229093  
-1.292888423  
-1.213955641  
-1.096914596  
-0.947844102  
-0.7732980318  
-0.5803174951  
-0.3764841129  
-0.1699545912  
0.03059380366  
0.2161801738  
0.3779212632  
0.5076055606  
0.5983883692  
0.6455344492  
0.6470810016  
0.6043216212  
0.5219985417  
0.4081409289  
0.2735237365  
0.1307712481  
-0.006807451587  
-0.1265405132  
-0.2177055911  
-0.2726966527  
-0.2878782227  
-0.2640190735  
-0.2062510321  
-0.1235168126  
-0.02758512289  
0.06828355974  
0.1508488803  
0.2084248394  
0.2322161855  
0.2173497266  
0.1633911511  
0.07436574648  
-0.04178698472  
-0.1742145734  
-0.3104999956  
-0.4381632109  
-0.5461324251  
-0.6259711831  
-0.6727341154  
-0.6853193959  
-0.6663015545  
-0.621306011  
-0.5580005634  
-0.4849126641  
-0.4102159425  
-0.3406931035  
-0.2810054311  
-0.2333547023  
-0.1975769546  
-0.1715813728  
-0.1520818717  
-0.135430243  
-0.1184373143  
-0.09901108968  
-0.07654008167  
-0.05195000815  
-0.02744048156  
-0.005972886989  
0.009419366246  
0.01634664306  
0.01371339464  
0.002159266559  
-0.01576098112  
-0.03572887691  
-0.05212025716  
-0.058739742  
-0.04974405447  
-0.02062767572  
0.03084682599  
0.1038966757  
0.1943027789  
0.29435637  
0.3932792032  
0.4780548502  
0.5346564598  
0.5495341471  
0.511215892  
0.4118574542  
0.2485323732  
0.02411319842  
-0.2524076516  
-0.566222223  
-0.8976513613  
-1.223670187  
-1.519864645  
-1.762654553  
-1.931525171  
-2.011038315  
-1.992418762  
-1.874480158  
-1.663839903  
-1.374330027  
-1.025709183  
-0.6417662973  
-0.2480690232  
0.1304352232  
0.47167514  
0.7583356271  
0.9791703274  
1.129609852  
1.211646443  
1.233015617  
1.2058268  
1.144821601  
1.065465409  
0.9821557096  
0.9066880033  
0.8472174191  
0.8077593185  
0.78828386  
0.785328612  
0.7930252863  
0.8043479335  
0.8123896998  
0.8114968302  
0.7980687612  
0.770940632  
0.7313281071  
0.6823489365  
0.6282510435  
0.5734930803  
0.5218553168  
0.4757336168  
0.4357426108  
0.4007069066  
0.3680067509  
0.3342364078  
0.2960290159  
0.250908543  
0.1980039512  
0.1384946374  
0.0757003627  
0.01478683702  
-0.03787674894  
-0.07561932266  
-0.09248062791  
-0.08421315247  
-0.04908675083  
0.01160798001  
0.09344226284  
0.1891465779  
0.2892967307  
0.3833124683  
0.4606254235  
0.5118865146  
0.5300452539  
0.5111879769  
0.4549932068  
0.3648021813  
0.2472591133  
0.1116155311  
-0.0312310298  
-0.1698087676  
-0.2931505599  
-0.3917349115  
-0.4582103107  
-0.4878514346  
-0.4787471247  
-0.4317364058  
-0.3501636233  
-0.2395216977  
-0.1070293455  
0.0387966537  
0.188575691  
0.3324826602  
0.4606961423  
0.5638761888  
0.6336918163  
0.6633768267  
0.6482844055  
0.5863737529  
0.4785449774  
0.3287884092  
0.1440539554  
-0.06613062502  
-0.2902933252  
-0.515824986  
-0.7298710638  
-0.9202103589  
-1.076029012  
-1.188525138  
-1.25132982  
-1.260748656  
-1.215872219  
-1.118611215  
-0.9736815517  
-0.7885704677  
-0.5734276514  
-0.3408418401  
-0.1054080478  
0.1169935722  
0.3102272104  
0.4592337138  
0.5515540206  
0.578876788  
0.5383760252  
0.4336102116  
0.2747579066  
0.07805916341  
-0.1355651234  
-0.3426308048  
-0.5196977646  
-0.646187822  
-0.7069922057  
-0.6945511102  
-0.6100508211  
-0.4635641332  
-0.2730540384  
-0.06235733694  
0.1416422586  
0.3122903458  
0.4264629714  
0.4674995261  
0.4273604215  
0.3077579498  
0.1200867864  
-0.1158260926  
-0.3740196886  
-0.6254466777  
-0.8414271291  
-0.9970636068  
-1.074207028  
-1.063627808  
-0.9661023483  
-0.7923024733  
-0.561481705  
-0.2991391784  
-0.03392414047  
0.2058324604  
0.3955248452  
0.5172078633  
0.5616896737  
0.529513947  
0.4307108544  
0.2833565792  
0.1111205913  
-0.05987953065  
-0.2044909853  
-0.3017571072  
-0.3375513561  
-0.3062567151  
-0.2112847521  
-0.06439109538  
0.1161133802  
0.3079658736  
0.4880005589  
0.6352267703  
0.733479906  
0.7733349575  
0.7530195293  
0.6782733315  
0.5612044404  
0.4183862912  
0.2684850335  
0.1297958676  
0.01803456452  
-0.05533486053  
-0.08404401205  
-0.06718901169  
-0.008680886006  
0.08383955731  
0.2003938961  
0.330109189  
0.462482118  
0.588289789  
0.7000829518  
0.7922645587  
0.8608441521  
0.9030290029  
0.9168006005  
0.9006262293  
0.8534058261  
0.7746821143  
0.6650631932  
0.5267739916  
0.3641711436  
0.184093153  
-0.00409461223  
-0.1888318404  
-0.3571106086  
-0.4955546791  
-0.591741802  
-0.6355961277  
-0.6206763647  
-0.5451685478  
-0.4124488297  
-0.231099985  
-0.01437630905  
0.2208732245  
0.4556972178  
0.6708040309  
0.8483984064  
0.9738937093  
1.037311414  
1.034221682  
0.9661075657  
0.84014457  
0.6683925918  
0.4665130454  
0.2521566634  
0.04319658349  
-0.1439897582  
-0.2959919349  
-0.4034415814  
-0.4615843924  
-0.4703006738  
-0.4336174154  
-0.3588013592  
-0.2551890965  
-0.1329305426  
-0.00182324094  
0.1295968759  
0.2546141974  
0.3684792087  
0.4682004894  
0.5520286298  
0.6188087933  
0.6673444261  
0.6959206253  
0.7021221288  
0.6829882728  
0.6355145685  
0.5573987374  
0.4478857197  
0.3085525351  
0.1438224196  
-0.03892725146  
-0.2297516477  
-0.4170239757  
-0.5887117406  
-0.7338845564  
-0.8442208839  
-0.9152408691  
-0.9470905336  
-0.9446738976  
-0.9170996951  
-0.8764916517  
-0.8362916605  
-0.8093181155  
-0.8058357299  
-0.831919585  
-0.8883617995  
-0.9702823243  
-1.06749796  
-1.165637286  
-1.247835035  
-1.296822668  
-1.297145692  
-1.237236099  
-1.111105571  
-0.9194422243  
-0.6699876456  
-0.377129402  
-0.0607372447  
0.2556479048  
0.5471018328  
0.7898583872  
0.9638247517  
1.054804812  
1.056172908  
0.9697821099  
0.8059612926  
0.5825682562  
0.3231650696  
0.05447997306  
-0.1965594497  
-0.405877676  
-0.5550265682  
-0.6333353745  
-0.6391402389  
-0.5799339721  
-0.4713883432  
-0.3353550353  
-0.1970864017  
-0.08200945399  
-0.01245998755  
-0.004782532905  
-0.06715194953  
-0.1983985355  
-0.3879663042  
-0.6170427234  
-0.8606732876  
-1.090655796  
-1.27882545  
-1.400352127  
-1.43665161  
-1.377552433  
-1.222468378  
-0.9804411398  
-0.6690541854  
-0.312370524  
0.06184402866  
0.4252522251  
0.7520510056  
1.02164774  
1.220608578  
1.343667315  
1.393691103  
1.380701787  
1.320091174  
1.230360312  
1.13066845  
1.038540344  
0.968010806  
0.9283872266  
0.9237311817  
0.9530259358  
1.010925328  
1.088885923  
1.176494757  
1.262780876  
1.337347667  
1.391248998  
1.417559368  
1.411688213  
1.371485612  
1.297258639  
1.19170973  
1.059877091  
0.9090184661  
0.7483956423  
0.5888794382  
0.4422795822  
0.3203805552  
0.2336978773  
0.1900654923  
0.1932256173  
0.2416708825  
0.3279692361  
0.4388021141  
0.5558436772  
0.6575040003  
0.7213962889  
0.7272715945  
0.6600216562  
0.5123241068  
0.2864794949  
-0.00491546892  
-0.3396606578  
-0.6880360586  
-1.016091337  
-1.289727485  
-1.479073989  
-1.562527981  
-1.529887803  
-1.384092168  
-1.141279016  
-0.8291108013  
-0.483542169  
-0.1444533903  
0.1492681522  
0.3645437444  
0.4781649624  
0.4795496616  
0.3718552294  
0.1713034381  
-0.09513967723  
-0.3933833401  
-0.6866373238  
-0.9399999599  
-1.124636533  
-1.221004649  
-1.220745476  
-1.12709407  
-0.9538084903  
-0.7228611544  
-0.4612721452  
-0.1975351174  
0.04186562002  
0.2354116275  
0.3686623188  
0.4352954801  
0.4370540819  
0.3827162781  
0.2862654411  
0.164623633  
0.03523569993  
-0.08613199275  
-0.1871357388  
-0.2599442433  
-0.301590567  
-0.3136375533  
-0.3012498739  
-0.2718984096  
-0.2339115078  
-0.1951203958  
-0.1617765569  
-0.1379003353  
-0.1250825071  
-0.12273415  
-0.1286545412  
-0.1397929705  
-0.1530212341  
-0.1657793795  
-0.1764854538  
-0.1846704335  
-0.1908382763  
-0.1961241671  
-0.201845758  
-0.2090469433  
-0.2181031919  
-0.2284892718  
-0.2386799089  
-0.2462076831  
-0.247835635  
-0.2398164216  
-0.2182003023  
-0.1791876143  
-0.1195350337  
-0.03701228489  
0.06907670949  
0.1973551572  
0.3438455104  
0.5015839747  
0.660480057  
0.8075481679  
0.9276240912  
1.004598704  
1.023118806  
0.9706061681  
0.8393558972  
0.6283870436  
0.3447160669  
0.003774902733  
-0.3712622928  
-0.7512493014  
-1.103824641  
-1.396861185  
-1.602152654  
-1.69883166  
-1.676051297  
-1.534478305  
-1.286399106  
-0.9543789865  
-0.5686623648  
-0.1636690389  
0.2259172158  
0.5689441383  
0.8409574156  
1.026358948  
1.119345502  
1.123571827  
1.050717448  
0.9182416865  
0.7467205385  
0.5571764611  
0.3687635218  
0.1970642559  
0.05314381491  
-0.0566433643  
-0.1302231991  
-0.1689395655  
-0.176475196  
-0.1578097787  
-0.1183449763  
-0.06331620283  
0.002490284966  
0.07477187064  
0.149567376  
0.2230589714  
0.291416511  
0.3507511929  
0.3972237088  
0.4273052116  
0.4381353081  
0.4279390273  
0.396394201  
0.3449036774  
0.2766859414  
0.1966783895  
0.1112204018  
0.0275681558  
-0.0467269359  
-0.1044803492  
-0.1395191888  
-0.1472139025  
-0.1248536525  
-0.07181291952  
0.01047947139  
0.1187541969  
0.2482591432  
0.3931662029  
0.5470114407  
0.7030684322  
0.8546355481  
0.9952466813  
1.118786603  
1.219579302  
1.29247425  
1.332993555  
1.33755338  
1.303776352  
1.230866004  
1.120001178  
0.9746528232  
0.8007723787  
0.6067586198  
0.403129974  
0.2019207718  
0.0157753629  
-0.1431523043  
-0.2644077522  
-0.3403938293  
-0.3673204267  
-0.3458114305  
-0.2810346913  
-0.182315706  
-0.06224312828  
0.0646337817  
0.183368927  
0.2802343844  
0.3441818864  
0.3679352921  
0.3486113298  
0.2877588729  
0.190875263  
0.06647529245  
-0.07510865415  
-0.2230173377  
-0.3670609418  
-0.4986491774  
-0.611397766  
-0.7013511819  
-0.7668996644  
-0.8084490757  
-0.8279749548  
-0.8285723033  
-0.8140660455  
-0.7887422894  
-0.7571842241  
-0.7241616785  
-0.6945196619  
-0.6729786547  
-0.6638126375  
-0.670395475  
-0.6946411789  
-0.7364547703  
-0.7932806998  
-0.8598907786  
-0.9285019533  
-0.9892999851  
-1.031332169  
-1.043724798  
-1.017050408  
-0.9446877444  
-0.8239566325  
-0.656865076  
-0.4503180698  
-0.2157510091  
0.03181344386  
0.275159006  
0.4965896477  
0.6797209087  
0.8111715336  
0.8819359926  
0.8882945571  
0.8321513849  
0.7207917314  
0.5660819158  
0.3831944036  
0.1890366313  
0.0005039718166  
-0.1672197591  
-0.3021615077  
-0.3967005329  
-0.4482160659  
-0.4591940047  
-0.4367543468  
-0.3916505041  
-0.3368443625  
-0.2858109133  
-0.2507694496  
-0.2410522885  
-0.2618335946  
-0.3133812081  
-0.3909558341  
-0.4853961016  
-0.5843230003  
-0.67382833  
-0.7404045657  
-0.7728797633  
-0.7640437607  
-0.7117587444  
-0.6193437757  
-0.4951995176  
-0.3516680274  
-0.2033054289  
-0.06478223396  
0.05126740166  
0.1361663061  
0.186565627  
0.2050718258  
0.199997225  
0.1842411814  
0.173432693  
0.1835661145  
0.2284457358  
0.3173025062  
0.4529384432  
0.6306866878  
0.8383916402  
1.057459658  
1.264906054  
1.436137035  
1.548141436  
1.582636672  
1.528737558  
1.384763908  
1.158888146  
0.868521456  
0.5384931538  
0.1982507789  
-0.1215333394  
-0.3924980388  
-0.5917852497  
-0.704493928  
-0.7250563672  
-0.6574349429  
-0.5141213758  
-0.3141705629  
-0.08054542193  
0.1628169173  
0.3938218589  
0.5945711422  
0.7529632886  
0.8634095494  
0.9266537324  
0.9487922367  
0.9397193544  
0.9112530564  
0.8752438153  
0.8419265331  
0.8186986459  
0.8094791205  
0.8146539324  
0.8315466348  
0.8553032639  
0.8800007489  
0.8997894774  
0.9099002578  
0.9073736953  
0.8914008678  
0.8632901207  
0.8260527364  
0.7837277264  
0.7405402417  
0.7000611185  
0.6644732836  
0.634098339  
0.6072201091  
0.5802683733  
0.5483097831  
0.5057964109  
0.4474445593  
0.3691222023  
0.2686058873  
0.1461057518  
0.004454905252  
-0.1510233756  
-0.3129890574  
-0.4728134409  
-0.6214491936  
-0.750361812  
-0.8523646767  
-0.9223109025  
-0.9575561624  
-0.95817327  
-0.9269208334  
-0.8690145479  
-0.7917094051  
-0.7037548482  
-0.6147702094  
-0.5345400692  
-0.4722866717  
-0.4359342277  
-0.4314002399  
-0.4619780911  
-0.5278557182  
-0.6258520692  
-0.7494398381  
-0.889089601  
-1.032965366  
-1.167924283  
-1.280751971  
-1.359507777  
-1.394804538  
-1.380883534  
-1.316313512  
-1.2042197  
-1.051997026  
-0.8705401404  
-0.6730787177  
-0.4737874791  
-0.2863502878  
-0.1226554964  
0.008183457587  
0.100412941  
0.1517553902  
0.1631054425  
0.1378867128  
0.0812245757  
-0.0009196391331  
-0.1024959233  
-0.2178818238  
-0.3421119924  
-0.4708178644  
-0.5999536721  
-0.7254036717  
-0.8426118698  
-0.9463492831  
-1.030731846  
-1.089514055  
-1.116649985  
-1.107047283  
-1.057395208  
-0.9669137893  
-0.8378912251  
-0.6758892838  
-0.4895678196  
-0.2900973897  
-0.090243302  
0.09678339356  
0.2586016981  
0.3848642308  
0.4683217099  
0.5055943108  
0.4976065802  
0.4496655622  
0.3711521579  
0.2748906069  
0.1762187515  
0.09182189572  
0.0383991446  
0.03122621739  
0.08270736772  
0.200997342  
0.3888140668  
0.6425678821  
0.9519145071  
1.299875437  
1.663596894  
2.015788562  
2.326820689  
2.567339751  
2.711207674  
2.738456441  
2.637924563  
2.409216505  
2.063684674  
1.624204619  
1.123694119  
0.6024225751  
0.104369941  
-0.327015168  
-0.653215462  
-0.8447201726  
-0.8843266297  
-0.76929993  
-0.5121169374  
-0.1396634563  
0.3090854035  
0.7867566585  
1.242328944  
1.626516408  
1.897277686  
2.02485731  
1.995791056  
1.815309805  
1.507733634  
1.114609747  
0.6905836385  
0.2972917516  
-0.004170070342  
-0.1613661216  
-0.138258806  
0.07851733427  
0.4757936825  
1.013167897  
1.625835927  
2.23085883  
2.736300991  
3.052199621  
3.102031863  
2.833174572  
2.224915121  
1.292856936  
0.08901380419  
-1.302533939  
-2.773967525  
-4.205020016  
-5.475829514  
-6.479758899  
-7.134612944  
-7.390913768  
-7.236353187  
-6.695994043  
-5.828395432  
-4.718281949  
-3.466790304  
-2.180515542  
-0.9606711835  
0.1064559367  
0.9567940042  
1.552877225  
1.885086402  
1.969843945  
1.845204011  
1.564536318  
1.189165408  
0.7808930024  
0.3952443478  
0.07617469498  
-0.1472967745  
-0.2623221661  
-0.2713816154  
-0.1896948572  
-0.04141573707  
0.1447912346  
0.3401476626  
0.5195542951  
0.6643866219  
0.7640351376  
0.816165049  
0.8258452526  
0.8038001477  
0.7641878081  
0.7222158009  
0.6919831214  
0.6847540593  
0.7078094929  
0.7639198482  
0.8513551443  
0.9643296671  
1.093740193  
1.228059699  
1.354305923  
1.459026101  
1.529273875  
1.553611942  
1.523121866  
1.432396892  
1.280470155  
1.07152804  
0.8152733724  
0.5267796993  
0.2256905517  
-0.06526891554  
-0.3224348379  
-0.523820084  
-0.651914154  
-0.6962966509  
-0.6556434227  
-0.5387634512  
-0.3643847896  
-0.1595829044  
0.04308130178  
0.2094186512  
0.3079852753  
0.3144379361  
0.2151970941  
0.009898480725  
-0.287796691  
-0.6512230822  
-1.043497234  
-1.421764407  
-1.742329907  
-1.966043595  
-2.063160357  
-2.017041841  
-1.826183506  
-1.504291525  
-1.078423893  
-0.5854641295  
-0.06745983154  
