0.04196068939  
0.233313475  
0.4057818756  
0.5439305693  
0.6377354794  
0.6841921445  
0.6878337762  
0.660092818  
0.61761224  
0.5797814931  
0.5658771038  
0.5922584147  
0.6700279227  
0.8035012184  
0.989680415  
1.218785577  
1.475710653  
1.742161531  
1.999132757  
2.229330687  
2.419217954  
2.560384207  
2.65010566  
2.691059954  
2.69030548  
2.657729798  
2.604241814  
2.539993158  
2.472900574  
2.407659181  
2.34537016  
2.28378159  
2.218062103  
2.141960437  
2.049132061  
1.934423814  
1.7949273  
1.63063764  
1.444647407  
1.24284673  
1.033204852  
0.8247313157  
0.6262791377  
0.4453592808  
0.2871491579  
0.1538184104  
0.0442973057  
-0.04548513414  
-0.1219039868  
-0.192576067  
-0.265075323  
-0.3456162271  
-0.4378968786  
-0.5423052202  
-0.6556261214  
-0.7713234323  
-0.8803927218  
-0.9726818232  
-1.038495221  
-1.07025118  
-1.063924553  
-1.020058911  
-0.9441482437  
-0.8463243574  
-0.7403550752  
-0.6420834864  
-0.567509293  
-0.5307732661  
-0.5423222695  
-0.6074909846  
-0.7256966587  
-0.8903385571  
-1.089418788  
-1.306794811  
-1.523902454  
-1.721746328  
-1.882904492  
-1.99333451  
-2.04377349  
-2.030583372  
-1.955979531  
-1.827630649  
-1.657705218  
-1.461489744  
-1.255748301  
-1.057011281  
-0.8799785623  
-0.736190627  
-0.6330960126  
-0.5735726804  
-0.5559421749  
-0.5744293389  
-0.6200138724  
-0.6815619418  
-0.7471288053  
-0.8052826523  
-0.8463324622  
-0.8633208184  
-0.8526848014  
-0.8145129741  
-0.7523637463  
-0.6726719588  
-0.5838084017  
-0.4949116924  
-0.4146397244  
-0.3500054482  
-0.3054436009  
-0.2822326479  
-0.2783430926  
-0.2887273142  
-0.3060005981  
-0.3214114691  
-0.3259854178  
-0.3116658565  
-0.2723455764  
-0.2046405993  
-0.1083513272  
0.0134447433  
0.1546512771  
0.3067233018  
0.4594846283  
0.6021022835  
0.7241152013  
0.8164378713  
0.8722365804  
0.8876051834  
0.8619888493  
0.7982927103  
0.7026818655  
0.5840651249  
0.4533042388  
0.3222263189  
0.2025183605  
0.104637173  
0.03683354788  
0.004412077145  
0.009308244499  
0.05002177616  
0.1219077647  
0.2177820623  
0.3287489148  
0.4451350022  
0.5574293206  
0.6571027746  
0.7372457815  
0.7929698574  
0.8215815172  
0.8225423232  
0.7972739962  
0.7488639664  
0.6817238017  
0.6012387602  
0.5134275444  
0.4246240672  
0.3411567269  
0.2690226234  
0.2135442549  
0.1790086709  
0.168310025  
0.1826228049  
0.2211573649  
0.2810382917  
0.3573470957  
0.4433701343  
0.5310376178  
0.6115527857  
0.6761561931  
0.7169531457  
0.7277198948  
0.7045866561  
0.6465133294  
0.5554800714  
0.4363554399  
0.2964309573  
0.1446665512  
-0.009275810073  
-0.1560974962  
-0.2878932315  
-0.3990106205  
-0.4866140517  
-0.5508719741  
-0.5947218182  
-0.6232430759  
-0.6427104486  
-0.6594615124  
-0.6787456499  
-0.7037122862  
-0.7347174224  
-0.7690343274  
-0.8010500126  
-0.8229091219  
-0.8255339861  
-0.7998816368  
-0.738257366  
-0.6355092433  
-0.4899299507  
-0.3037598112  
-0.08320546193  
0.1620013558  
0.419455626  
0.6752075362  
0.9150278828  
1.125638659  
1.295769043  
1.416917761  
1.483768449  
1.494244433  
1.44925231  
1.352193087  
1.208363759  
1.024344417  
0.8074797265  
0.5655111384  
0.3063873395  
0.03823197189  
-0.2305845138  
-0.4913491825  
-0.7349672289  
-0.9520641933  
-1.133270814  
-1.269711468  
-1.353670719  
-1.379366518  
-1.343743931  
-1.247169146  
-1.093914105  
-0.8923322931  
-0.6546553769  
-0.396386544  
-0.1353029035  
0.1098590421  
0.3209334953  
0.4819288723  
0.5805406758  
0.6094161411  
0.5670202367  
0.4579780868  
0.2928409248  
0.08725035626  
-0.1394382038  
-0.3659467334  
-0.5711248764  
-0.7360230091  
-0.8457886665  
-0.8911501728  
-0.869319702  
-0.7842089563  
-0.6459043436  
-0.4694721315  
-0.2732182676  
-0.07662106004  
0.1018238918  
0.2465639084  
0.3465245867  
0.3960327804  
0.3950237279  
0.3485373267  
0.2655995944  
0.1576777844  
0.03695588206  
-0.08531975937  
-0.2001726099  
-0.3017381071  
-0.3875163531  
-0.4580501517  
-0.5161274868  
-0.5656946457  
-0.6106934898  
-0.6540559043  
-0.6970324982  
-0.738975265  
-0.7775958634  
-0.8096405068  
-0.8318259732  
-0.8418489328  
-0.8392626312  
-0.8260257322  
-0.8066090391  
-0.7875973488  
-0.7768328591  
-0.7822152953  
-0.8103410653  
-0.865190331  
-0.9470796377  
-1.05205749  
-1.171857753  
-1.294455968  
-1.405188212  
-1.488298932  
-1.528745262  
-1.514022962  
-1.435795102  
-1.291096559  
-1.082968653  
-0.8204201277  
-0.5177063253  
-0.1929975111  
0.1334198765  
0.4412036404  
0.7120547322  
0.9316032073  
1.090869461  
1.187136796  
1.22412165  
1.211433523  
1.163363262  
1.097152917  
1.03092829  
0.9815352573  
0.9625277185  
0.9825351219  
1.044217769  
1.143920368  
1.272094156  
1.41444135  
1.553671068  
1.671664507  
1.751807681  
1.781219988  
1.752589738  
1.665394496  
1.526325008  
1.348824232  
1.1517756  
0.9574540246  
0.7889736374  
0.6675266178  
0.6097428924  
0.6255061411  
0.7164985155  
0.8756856093  
1.087805361  
1.330834217  
1.578263148  
1.801911423  
1.974958981  
2.074831356  
2.085602809  
1.999654764  
1.818391212  
1.551968132  
1.218066687  
0.839892121  
0.4436292494  
0.05566198796  
-0.3001188091  
-0.6046286364  
-0.8452650922  
-1.01678473  
-1.121302919  
-1.167456103  
-1.168855491  
-1.142045852  
-1.104235208  
-1.071084668  
-1.05482716  
-1.062936185  
-1.097477404  
-1.155208216  
-1.228368443  
-1.306030557  
-1.375821909  
-1.425777211  
-1.446085949  
-1.430514934  
-1.377331799  
-1.289623452  
-1.174976334  
-1.044565791  
-0.911770661  
-0.7904958999  
-0.6934197762  
-0.6303996365  
-0.6072559678  
-0.6251051375  
-0.6803367235  
-0.7652502692  
-0.869245112  
-0.9804004344  
-1.087184221  
-1.18003979  
-1.252583358  
-1.302227223  
-1.330142197  
-1.340566781  
-1.339593391  
-1.333667647  
-1.328054196  
-1.325561491  
-1.325757421  
-1.324817014  
-1.316048002  
-1.291000041  
-1.240968868  
-1.158644869  
-1.039601892  
-0.8833768882  
-0.6939442709  
-0.4794900445  
-0.2515223807  
-0.02345498966  
0.1911161783  
0.3801651823  
0.5347481416  
0.6500410879  
0.7257534709  
0.7658732572  
0.7777787194  
0.7708856042  
0.7550397193  
0.7388980349  
0.7285695287  
0.7267089846  
0.7322242065  
0.7406324809  
0.7450368458  
0.7375745177  
0.7111188297  
0.6609696639  
0.5862485841  
0.4907389062  
0.3830025074  
0.2756602766  
0.1839000974  
0.1233730234  
0.1077523325  
0.1463291318  
0.242022567  
0.3901595181  
0.5782887203  
0.7871374347  
0.9926593578  
1.168935994  
1.291552934  
1.340974794  
1.305421571  
1.182799241  
0.9813799112  
0.7190914667  
0.421496176  
0.1187323044  
-0.1581525899  
-0.3809642517  
-0.527692767  
-0.5849581739  
-0.5492770508  
-0.4270138624  
-0.2331075857  
0.01118212359  
0.2811326571  
0.5515732496  
0.7996369222  
1.006907448  
1.160729564  
1.254629843  
1.287913352  
1.264640177  
1.192249203  
1.080110457  
0.9382578627  
0.776476235  
0.6037993086  
0.4283961692  
0.2577233742  
0.09876384302  
-0.04180143848  
-0.1576425297  
-0.2431089789  
-0.2938150001  
-0.3073827169  
-0.284166557  
-0.2277823845  
-0.1452533133  
-0.04666763311  
0.05568522853  
0.1486286371  
0.2196908906  
0.2587602812  
0.2595218616  
0.2204529154  
0.1451837937  
0.04213989859  
-0.07651462954  
-0.196490515  
-0.3033285354  
-0.3844029235  
-0.4306892483  
-0.438029315  
-0.4077185812  
-0.3463315242  
-0.2648286004  
-0.1770877397  
-0.09808829862  
-0.0420131663  
-0.02054601289  
-0.04156883147  
-0.1084171642  
-0.2197331919  
-0.3698700206  
-0.5497255624  
-0.7478359745  
-0.9515425541  
-1.148084785  
-1.325501747  
-1.473305778  
-1.582931973  
-1.648019377  
-1.664599995  
-1.631251854  
-1.549255905  
-1.422737777  
-1.258754322  
-1.067234226  
-0.8606904755  
-0.6536343093  
-0.4616647947  
-0.3002644644  
-0.1834079107  
-0.1221260186  
-0.1232268586  
-0.188359599  
-0.3135888282  
-0.4895838786  
-0.7024401777  
-0.935068931  
-1.168984407  
-1.386272874  
-1.57147453  
-1.713123464  
-1.804722917  
-1.845026152  
-1.837574486  
-1.789553912  
-1.710155531  
-1.608676683  
-1.492666737  
-1.366413054  
-1.230031116  
-1.079335708  
-0.9065524917  
-0.7018144702  
-0.4552313033  
-0.1592448391  
0.1891073876  
0.5863992101  
1.021831475  
1.477293647  
1.928542728  
2.34743164  
2.704913109  
2.974431855  
3.135231072  
3.175082111  
3.092025991  
2.894854323  
2.602245222  
2.240678274  
1.84143631  
1.437139561  
1.058313043  
0.7304605525  
0.4720040298  
0.2932924086  
0.1966874557  
0.1775590131  
0.2258988636  
0.328186785  
0.4691792501  
0.6333480205  
0.8058331376  
0.9729184498  
1.122142027  
1.242247109  
1.323180991  
1.356311832  
1.334956398  
1.255179573  
1.116737735  
0.9239500322  
0.6862582131  
0.4182544768  
0.1390224137  
-0.1292266851  
-0.3631641108  
-0.5407683587  
-0.6438964216  
-0.6606423638  
-0.5871576978  
-0.4286471632  
-0.199364873  
0.07845243217  
0.3766178853  
0.6637871578  
0.9086748642  
1.083323219  
1.166028139  
1.143560533  
1.012436914  
0.779096696  
0.4589788769  
0.07466603855  
-0.3466772589  
-0.776219449  
-1.186367934  
-1.553328395  
-1.859033651  
-2.092250574  
-2.248810379  
-2.33100215  
-2.346280322  
-2.305528296  
-2.221123573  
-2.105104621  
-1.967654236  
-1.816080823  
-1.65439618  
-1.483478014  
-1.301750687  
-1.106231913  
-0.8937487149  
-0.6621445894  
-0.4112741928  
-0.1436647875  
0.1352337225  
0.4172352216  
0.691959686  
0.947665222  
1.172221298  
1.354109947  
1.483345393  
1.552230946  
1.555917746  
1.492758136  
1.364456139  
1.176046524  
0.9357109258  
0.6544370088  
0.3455132361  
0.02385226384  
-0.2948572669  
-0.5951642852  
-0.8629652224  
-1.086644855  
-1.258131817  
-1.373733415  
-1.43463027  
-1.446917451  
-1.42112907  
-1.371237243  
-1.313191441  
-1.26312001  
-1.23537738  
-1.240670984  
-1.284496701  
-1.366109153  
-1.478193168  
-1.607347168  
-1.73536587  
-1.841232526  
-1.903606108  
-1.903530142  
-1.827012428  
-1.66715495  
-1.425504774  
-1.1124287  
-0.7463960882  
-0.3522178817  
0.04159078376  
0.4060052505  
0.7148662071  
0.9479925426  
1.093635847  
1.149921991  
1.125083492  
1.036411772  
0.9080523832  
0.7678980611  
0.6439887242  
0.5608845611  
0.5364906  
0.5797723288  
0.6896619455  
0.8553253739  
1.057740068  
1.272380473  
1.472642479  
1.633519959  
1.735042826  
1.764985905  
1.720483733  
1.608336284  
1.44396545  
1.249185675  
1.049106405  
0.8686033576  
0.7288538539  
0.6444034272  
0.6211801436  
0.6556945944  
0.7355439089  
0.8411289393  
0.9483474041  
1.031900923  
1.068767608  
1.04139547  
0.9401900832  
0.7649897  
0.5253418609  
0.2395500178  
-0.06738408055  
-0.3666506805  
-0.6290018706  
-0.8281717538  
-0.9439326667  
-0.9644208604  
-0.8874658413  
-0.7207846034  
-0.4810432396  
-0.1919344272  
0.1184760143  
0.420795733  
0.6873803691  
0.8950818455  
1.027383922  
1.075715895  
1.039852327  
0.9274149755  
0.7525898985  
0.5342505163  
0.2937308582  
0.05250046752  
-0.1700103467  
-0.3582234933  
-0.5017021612  
-0.5958263524  
-0.641813364  
-0.6461283211  
-0.6193744399  
-0.5748032998  
-0.5266285748  
-0.4883284055  
-0.4711280204  
-0.4828193448  
-0.5270451781  
-0.6030894284  
-0.7061868044  
-0.8282635669  
-0.9589974811  
-1.087034835  
-1.201215559  
-1.291629221  
-1.350423802  
-1.372280379  
-1.354563611  
-1.297184145  
-1.202258398  
-1.073661125  
-0.9165644078  
-0.7370482549  
-0.541813522  
-0.3380175975  
-0.1332032077  
0.06473278682  
0.247581489  
0.4069499283  
0.5345082519  
0.6223893126  
0.6637389928  
0.6533743938  
0.588504799  
0.4694161897  
0.3000338896  
0.08825005195  
-0.1540841967  
-0.4115675459  
-0.6661072235  
-0.8982058581  
-1.088604541  
-1.22013548  
-1.27959711  
-1.25941547  
-1.158854439  
-0.9845599397  
-0.7503051448  
-0.4758818228  
-0.185202582  
0.09618012699  
0.3438659487  
0.5373368613  
0.6622577577  
0.7120153253  
0.6882599778  
0.6003587885  
0.4638288343  
0.297979956  
0.1231263391  
-0.04221782352  
-0.1837111311  
-0.292775846  
-0.367163825  
-0.4104392916  
-0.4304854458  
-0.4373294993  
-0.4406690606  
-0.4475598988  
-0.4606704698  
-0.4774372977  
-0.4902793976  
-0.4878541385  
-0.457154327  
-0.386086452  
-0.2660970419  
-0.09437109122  
0.1247935816  
0.3797071498  
0.6522057842  
0.9196673523  
1.157839869  
1.344075541  
1.460475054  
1.496467827  
1.450438878  
1.330138117  
1.151823618  
0.9382468451  
0.7157796755  
0.5110862817  
0.3478097227  
0.2437088553  
0.208627889  
0.2435243681  
0.3406430903  
0.484753265  
0.6552381385  
0.828714512  
0.9818180668  
1.093797699  
1.148603273  
1.136261697  
1.053438703  
0.9031918165  
0.69405077  
0.4386148172  
0.1519033655  
-0.1502900668  
-0.4528311794  
-0.7423133828  
-1.007680572  
-1.240401763  
-1.43427548  
-1.584986005  
-1.689569515  
-1.745951296  
-1.752672914  
-1.708904861  
-1.61473952  
-1.471718587  
-1.283465899  
-1.056260715  
-0.7993905905  
-0.525108858  
-0.248130832  
0.01536732903  
0.2491607519  
0.4386224863  
0.5723946293  
0.6438092653  
0.6518247062  
0.6012952065  
0.5024762856  
0.3698131735  
0.2201330581  
0.07051461846  
-0.06388721386  
-0.1717179294  
-0.2467323201  
-0.2883267408  
-0.3012258648  
-0.2943632836  
-0.2791370988  
-0.2673185184  
-0.2689341557  
-0.2904620836  
-0.3336265869  
-0.3949831782  
-0.4663723484  
-0.5361708363  
-0.5911621196  
-0.6187340679  
-0.609060068  
-0.5569177633  
-0.4628470985  
-0.3334353231  
-0.180671115  
-0.02042714941  
0.1297146385  
0.2529736988  
0.3358487394  
0.3701728943  
0.3544394853  
0.2941816192  
0.2013501701  
0.09277586199  
-0.01205424475  
-0.09357416929  
-0.1347014754  
-0.123020563  
-0.05230435944  
0.07680138797  
0.2569835622  
0.475262152  
0.7145979307  
0.9558544451  
1.179826962  
1.369090716  
1.509470094  
1.591010303  
1.608428914  
1.561078658  
1.452525252  
1.289862851  
1.08287793  
0.8431758956  
0.5833314859  
0.316101553  
0.05372400597  
-0.1927104906  
-0.4137938948  
-0.6022387584  
-0.7531855698  
-0.8643424441  
-0.9359190406  
-0.9703401694  
-0.9717496286  
-0.9453523501  
-0.8966914865  
-0.8309723996  
-0.7525552405  
-0.6647138024  
-0.5697266023  
-0.4692655252  
-0.3650266542  
-0.2594379582  
-0.1562820855  
-0.06104616927  
0.01913459177  
0.0760065671  
0.1011689506  
0.08736101012  
0.02985849647  
-0.07227354747  
-0.215313164  
-0.3906165008  
-0.5850512101  
-0.782143361  
-0.9638163609  
-1.112503964  
-1.213343724  
-1.256130578  
-1.236733243  
-1.157730489  
-1.028149757  
-0.8622911503  
-0.6777832582  
-0.4931181396  
-0.3250058234  
-0.1859536315  
-0.08243099755  
-0.01393496459  
0.02686828603  
0.05289507003  
0.08044637924  
0.1263655789  
0.2049795547  
0.3253094363  
0.4890076708  
0.6893940679  
0.9117814656  
1.135111371  
1.334673442  
1.485527621  
1.566112327  
1.561478639  
1.465641275  
1.282678501  
1.026385239  
0.7185462443  
0.3860911613  
