71.96945038  
79.51296291  
93.73725089  
111.9019909  
45.48908472  
289.0299748  
23616.4062  
15492.60418  
2914.572849  
13350.37445  
11506.30258  
8372.738706  
44983.19981  
21641.77032  
28193.34254  
46949.05858  
5129.863697  
30747.97698  
12607.58805  
7265.497129  
13668.54031  
4782.902245  
18463.12494  
3043.247332  
121.6859257  
1019.350262  
20429.64971  
1175.376345  
8194.228028  
741.9010054  
3454.841463  
20448.33698  
1748.910104  
1821.618364  
10586.52294  
5423.68189  
10759.36821  
730.6345321  
2201.620533  
5325.567867  
4302.64538  
2029.349201  
7237.820796  
16033.86777  
2123.187246  
2165.498346  
469.5705286  
16383.75872  
2290.707834  
1646.731414  
4478.573961  
66.7205109  
2290.062773  
2317.583703  
2494.112259  
1592.638459  
453.6156089  
401.6807522  
1539.953069  
3146.036623  
1302.284174  
1619.998626  
1417.678418  
164.2936749  
453.5473209  
245.4651623  
692.120371  
136.9693965  
61.97439484  
40.01440793  
48.46025195  
124.9848028  
24.38032103  
6.732224279  
7.747498792  
18.22761733  
4.044335418  
8.572194992  
1.67292308  
4.189390844  
2.951475105  
2.154610397  
1.418280892  
3.179740302  
0.6294588946  
1.828961393  
1.477068741  
2.271504977  
1.257436659  
1.792520028  
1.241228667  
1.187643469  
1.385769616  
1.482692869  
1.37100461  
1.397560781  
1.321060196  
1.313505412  
1.244168581  
1.229414167  
1.110934337  
1.156973978  
1.081800674  
1.055527138  
1.024912482  
1.013963941  
0.9777067764  
0.9649592909  
0.954370212  
0.9281292788  
0.9172645756  
0.8994833967  
0.871491813  
0.8574341667  
0.8411882703  
0.8257639465  
0.8106752973  
0.7957884206  
0.779478372  
0.7643148663  
0.7498342577  
0.7355558444  
0.7228132104  
0.7111135357  
0.6990275418  
0.6875482623  
0.6758237767  
0.6640143895  
0.6526317857  
0.6426712023  
0.6318181773  
0.6213279968  
0.611782957  
0.6017592741  
0.5923258174  
0.5831760934  
0.5742800951  
0.5655776325  
0.5570402516  
0.5487268209  
0.5406190729  
0.5328426695  
0.5250858423  
0.5176187488  
0.5103177406  
0.503139503  
0.4961264686  
0.4892943062  
0.4826025194  
0.4760358273  
0.4696638198  
0.4634380715  
0.4573091806  
0.4513542639  
0.4455183808  
0.4397987948  
0.4342018626  
0.4287264899  
0.4233636463  
0.4181291675  
0.412988543  
0.4079586464  
0.4030330282  
0.398208523  
0.3934645671  
0.3888330478  
0.3842873245  
0.3798295257  
0.3754628268  
0.3711781606  
0.3669779625  
0.3628606865  
0.3588185515  
0.3548568547  
0.3509622557  
0.3471499982  
0.3434047572  
0.3397282007  
0.3361189121  
0.3325768283  
0.3290902891  
0.3256734237  
0.322321566  
0.3190247033  
0.3157858916  
0.3126006237  
0.3094781265  
0.3064052291  
0.3033868205  
0.3004204904  
0.297508042  
0.2946372341  
0.2918207569  
0.2890476785  
0.2863176367  
0.2836445369  
0.2810079231  
0.278413581  
0.2758653572  
0.2733576371  
0.2708892329  
0.2684554728  
0.2660702899  
0.2637174704  
0.2614004626  
0.2591244494  
0.2568819147  
0.2546736941  
0.2524990612  
0.250358178  
0.2482519176  
0.246178418  
0.2441322393  
0.2421197499  
0.2401378689  
0.2381862596  
0.2362627465  
0.2343691495  
0.2324962265  
0.2306571925  
0.2288478318  
0.2270627103  
0.2253047709  
0.2235667473  
0.2218580794  
0.220168978  
0.2185090409  
0.2168691149  
0.2152555827  
0.213667918  
0.2120962569  
0.2105513089  
0.2090168054  
0.207514188  
0.206029326  
0.2045637544  
0.2031251266  
0.2016964381  
0.2002948099  
0.1989085387  
0.1975390796  
0.1961927174  
0.1948614211  
0.193546048  
0.1922528374  
0.1909731153  
0.1897106316  
0.1884664897  
0.1872385837  
0.1860287662  
0.1848289842  
0.1836497598  
0.1824802012  
0.1813281725  
0.1801933591  
0.1790715789  
0.1779661963  
0.1768694294  
0.1757903803  
0.1747290926  
0.1736696949  
0.17263092  
0.1716046942  
0.1705894269  
0.169592763  
0.1686037024  
0.1676234402  
0.1666636685  
0.1657085021  
0.1647676512  
0.1638366184  
0.1629198263  
0.1620132874  
0.1611180007  
0.160229971  
0.1593575216  
0.1584950988  
0.1576398579  
0.1567970124  
0.1559647378  
0.1551383893  
0.1543288154  
0.1535239791  
0.1527253076  
0.1519405548  
0.1511702711  
0.1504022803  
0.1496429388  
0.1488960877  
0.1481542719  
0.1474241004  
0.1467003122  
0.1459837468  
0.1452764043  
0.1445809146  
0.1438913157  
0.1432045605  
0.1425308102  
0.1418684048  
0.1412101685  
0.140557217  
0.1399163996  
0.1392783039  
0.1386473167  
0.1380269815  
0.1374086082  
0.1368035676  
0.136199558  
0.1356072808  
0.1350210256  
0.1344370233  
0.1338638513  
0.1332959195  
0.1327343193  
0.1321802218  
0.1316279947  
0.1310877997  
0.1305525005  
0.130018293  
0.1294915328  
0.1289759608  
0.128462683  
0.1279549114  
0.127454222  
0.1269567871  
0.1264658024  
0.1259796752  
0.1255001854  
0.125026261  
0.124555682  
0.1240931844  
0.123635342  
0.1231820346  
0.1227289381  
0.1222884155  
0.1218467758  
0.1214172111  
0.1209874833  
0.1205617632  
0.1201412289  
0.1197275572  
0.1193172862  
0.1189123346  
0.1185101917  
0.1181151378  
0.1177234371  
0.1173352338  
0.1169505747  
0.1165697736  
0.1161992048  
0.1158279988  
0.1154594937  
0.1150997234  
0.1147386398  
0.1143853064  
0.1140386927  
0.1136903947  
0.1133440595  
0.1130067927  
0.1126741727  
0.1123447418  
0.1120169263  
0.1116937483  
0.1113705394  
0.1110582362  
0.1107458562  
0.1104382737  
0.110134832  
0.1098298636  
0.1095325666  
0.1092375912  
0.1089468407  
0.1086579314  
0.1083756583  
0.1080947324  
0.1078152511  
0.1075438297  
0.1072723458  
0.1070033981  
0.1067390059  
0.1064773056  
0.1062191991  
0.1059648562  
0.105712794  
0.1054638025  
0.1052200071  
0.1049742735  
0.1047355259  
0.1044977185  
0.1042615313  
0.1040311531  
0.1038066157  
0.1035800087  
0.1033562225  
0.1031376898  
0.1029224364  
0.1027068003  
0.1024989727  
0.1022891573  
0.1020830345  
0.1018781471  
0.1016800517  
0.1014834849  
0.1012872216  
0.1010958122  
0.1009047102  
0.1007188914  
0.1005340516  
0.1003535678  
0.1001723528  
0.0999982568  
0.09982466153  
0.09965097733  
0.09948353988  
0.09931731127  
0.09915150681  
0.098990342  
0.09883016613  
0.09867482096  
0.09851938804  
0.09836902963  
0.09821875019  
0.09807385716  
0.09792984542  
0.0977834906  
0.09764424652  
0.09750652922  
0.0973711273  
0.09723783094  
0.09710677561  
0.09697516832  
0.09685332117  
0.0967271543  
0.09660407087  
0.09648658987  
0.09636546319  
0.09625247909  
0.09613770812  
0.09602863017  
0.09592043864  
0.0958107417  
0.09570549314  
0.0956050398  
0.09550495087  
0.09540442246  
0.09531089253  
0.09521622675  
0.09512614572  
0.09503625129  
0.09494534844  
0.09486139105  
0.09477566419  
0.09469598207  
0.09461487509  
0.09453923289  
0.09446308917  
0.09439090518  
0.09432023092  
0.09425046446  
0.09418241018  
0.09411973588  
0.09405581755  
0.0939909645  
0.09393332657  
0.09387519073  
0.09382324967  
0.09376849342  
0.0937195704  
0.09366841481  
0.09362080521  
0.09357378023  
0.09353087824  
0.09349116028  
0.09345181724  
0.09341237761  
0.09337589677  
0.09334313105  
0.09331247734  
0.09328212103  
0.09325437718  
0.0932259833  
0.09320406204  
0.09318128387  
0.09316145219  
0.09314240701  
0.09312765371  
0.09311163516  
0.09309856479  
0.09308967246  
0.09308019829  
0.09307507951  
0.09306999801  
0.09306662138  
0.09306342878  
