0.2403081204  
0.197590165  
0.1517015309  
0.100460148  
0.04122810973  
-0.02900956986  
-0.1132477503  
-0.2137755151  
-0.3313201495  
-0.4641909899  
-0.6076245172  
-0.7535197652  
-0.8906972535  
-1.005736065  
-1.08433614  
-1.113056902  
-1.081193203  
-0.9825094356  
-0.8165477971  
-0.5892647008  
-0.3128542537  
-0.004726118807  
0.3142663584  
0.622120345  
0.8981997737  
1.125623504  
1.293186761  
1.3965456  
1.438500796  
1.428345979  
1.380375488  
1.311774255  
1.240184027  
1.181282299  
1.146703187  
1.14256706  
1.168805975  
1.219343125  
1.283088013  
1.345589304  
1.391108586  
1.404833943  
1.374933781  
1.294194987  
1.161032708  
0.9797589019  
0.7600960782  
0.5160112564  
0.2640410266  
0.02133637857  
-0.1963230357  
-0.3762805242  
-0.5103233721  
-0.5954085594  
-0.633742821  
-0.6322290186  
-0.6013805247  
-0.5538664824  
-0.5028876545  
-0.4605930625  
-0.4367222443  
-0.4376278918  
-0.4657763888  
-0.5197476557  
-0.5947071204  
-0.6832576487  
-0.7765449434  
-0.8654591818  
-0.9417768595  
-0.9991068684  
-1.033532571  
-1.043883626  
-1.03163419  
-1.000469394  
-0.955591357  
-0.9028970671  
-0.8481402683  
-0.7962038633  
-0.7505804334  
-0.7131177816  
-0.6840485853  
-0.6622709922  
-0.6458119404  
-0.6323780986  
-0.6198928909  
-0.6069209008  
-0.5929090732  
-0.5782130754  
-0.5639164704  
-0.5514802673  
-0.5423111863  
-0.5373301602  
-0.5366279833  
-0.5392839045  
-0.543377502  
-0.5462002415  
-0.5446280142  
-0.5355877008  
-0.5165453555  
-0.4859285287  
-0.4434137217  
-0.3900424184  
-0.3281419778  
-0.2610772681  
-0.1928640329  
-0.127715981  
-0.06957384116  
-0.02168500621  
0.01371953371  
0.03563045092  
0.04432558212  
0.04131445019  
0.02916569731  
0.01125699599  
-0.008535957762  
-0.02617857761  
-0.03782226694  
-0.04012563873  
-0.03054012393  
-0.00752786325  
0.02930445326  
0.07917512702  
0.1402091266  
0.2096382975  
0.2840977773  
0.3599946701  
0.4339049929  
0.5029390019  
0.5650255406  
0.6190707001  
0.6649565219  
0.7033827777  
0.7355713408  
0.7628892206  
0.7864454258  
0.8067513134  
0.8234991979  
0.8355094737  
0.84086456  
0.8372190352  
0.8222312295  
0.7940548284  
0.7517971302  
0.6958738013  
0.62818357  
0.552072948  
0.4720802037  
0.3934936657  
0.3217840263  
0.2619926933  
0.2181720645  
0.1929477624  
0.1872811594  
0.2004476898  
0.2302401161  
0.2733447438  
0.3258276504  
0.3836479199  
0.4431130351  
0.5011963825  
0.5556836527  
0.6051283406  
0.6486526683  
0.6856423878  
0.7154210764  
0.7369771345  
0.7488218373  
0.7490130146  
0.7353542845  
0.7057368912  
0.6585640211  
0.5931711448  
0.5101599573  
0.4115693425  
0.3008422155  
0.1825775713  
0.06210636263  
-0.05505614277  
-0.1637877373  
-0.2598754708  
-0.340403499  
-0.4039458014  
-0.4505537584  
-0.4815566489  
-0.499209252  
-0.5062735065  
-0.5055883756  
-0.4997072786  
-0.4906474486  
-0.4797770121  
-0.4678332625  
-0.4550542701  
-0.4413797441  
-0.4266717669  
-0.4109192727  
-0.3943838372  
-0.3776686363  
-0.3617030335  
-0.3476496941  
-0.3367509138  
-0.3301389507  
-0.3286423728  
-0.3326110492  
-0.3417950094  
-0.3552903688  
-0.3715773012  
-0.3886441724  
-0.4041932313  
-0.4159053617  
-0.4217321019  
-0.4201731607  
-0.4104939575  
-0.3928517605  
-0.3682992913  
-0.3386609758  
-0.3062984665  
-0.2737873633  
-0.2435665576  
-0.2176029186  
-0.1971270078  
-0.1824832603  
-0.1731053691  
-0.1676319245  
-0.1641215612  
-0.1603482335  
-0.1541116881  
-0.1435324016  
-0.1272837805  
-0.104738027  
-0.07601956902  
-0.04197822678  
-0.004087740033  
0.0356945603  
0.07509105285  
0.1116652284  
0.1429834297  
0.1667564407  
0.1809733497  
0.1840319706  
0.1748567909  
0.1530157597  
0.1188152772  
0.07336916129  
0.01862174908  
-0.0426912174  
-0.1071525203  
-0.1708522282  
-0.229644805  
-0.2794619958  
-0.3166550971  
-0.3383279231  
-0.3426253852  
-0.3289427982  
-0.2980239503  
-0.2519304578  
-0.1938804097  
-0.1279746572  
-0.0588247209  
0.008855816957  
0.0706739802  
0.1229346992  
0.1629396252  
0.1891793609  
0.2014088165  
0.2005956122  
0.1887657693  
0.168760176  
0.143929636  
0.1178041502  
0.09376060339  
0.07471888886  
0.06289679783  
0.05962839276  
0.06527840922  
0.07924408453  
0.100049728  
0.1255271305  
0.1530670659  
0.1799121497  
0.2034721657  
0.2216217438  
0.2329507747  
0.2369342743  
0.2339974941  
0.22546964  
0.2134170373  
0.2003811133  
0.1890456603  
0.1818752715  
0.1807689432  
0.1867800303  
0.1999246996  
0.219127601  
0.2422852407  
0.2664693494  
0.288219685  
0.3039162232  
0.3101740803  
0.3042298051  
0.284277358  
0.2497167016  
0.2012997742  
0.1411530879  
0.07266996954  
0.0002849669886  
-0.07085930234  
-0.1353246885  
-0.1878356075  
-0.2237396898  
-0.239431223  
-0.2326945733  
-0.2029365827  
-0.1512819439  
-0.08051995356  
0.00509237214  
0.1001506571  
0.1985331016  
0.2938904793  
0.3801675492  
0.4521015633  
0.50566567  
0.5384070476  
0.5496546335  
0.5405710889  
0.5140334394  
0.4743596602  
0.4268935663  
0.3774858537  
0.3319246132  
0.2953739035  
0.2718616547  
0.2638936428  
0.2722151567  
0.2957496041  
0.3317226623  
0.3759477314  
0.4232480531  
0.4679563291  
0.5044474327  
0.5276431767  
0.533438029  
0.5190174919  
0.4830371102  
0.4256723242  
0.3485382114  
0.2545180726  
0.1475166254  
0.03218432205  
-0.08636744265  
-0.2028426639  
-0.3120074488  
-0.4089247408  
-0.4891634776  
-0.5490059698  
-0.5856428348  
-0.5973649863  
-0.583733388  
-0.5457062433  
-0.4857067148  
-0.4075887274  
-0.3164938367  
-0.2185796542  
-0.1206239772  
-0.02953875012  
0.04817773434  
0.1069822654  
0.1427648718  
0.1532013854  
0.137931514  
0.098541331  
0.03834390738  
-0.03800756401  
-0.1250300363  
-0.2169667046  
-0.3083313288  
-0.3943576682  
-0.4713205145  
-0.5366899829  
-0.5891234918  
-0.6283249717  
-0.6548061548  
-0.6696118959  
-0.6740635899  
-0.6695609296  
-0.6574711658  
-0.6391113585  
-0.6158001499  
-0.5889491914  
-0.5601520478  
-0.5312257627  
-0.5041757065  
-0.4810682353  
-0.463820893  
-0.4539339921  
-0.4522095331  
-0.4585113096  
-0.4716131338  
-0.4891873866  
-0.5079539478  
-0.5239904295  
-0.5331844758  
-0.5317717168  
-0.5168993466  
-0.4871244131  
-0.4427781958  
-0.3861296363  
-0.3212911352  
-0.2538798366  
-0.190427905  
-0.1376229217  
-0.101447412  
-0.08633345159  
-0.0944396654  
-0.1251569228  
-0.1749243117  
-0.237405601  
-0.3040259841  
-0.3648276761  
-0.4095562917  
-0.4288473242  
-0.4153712422  
-0.3647853341  
-0.2763640626  
-0.1532175515  
-0.002053672934  
0.1674955785  
0.3439108069  
0.5150660853  
0.6695959944  
0.7981824035  
0.8946068445  
0.9564346652  
0.9852419769  
0.9863651819  
0.9681835027  
0.9410350688  
0.9158878154  
0.9029257785  
0.9102411438  
0.9427809046  
1.001712691  
1.08430241  
1.184343187  
1.293113293  
1.400760794  
1.49794584  
1.577525037  
1.636007906  
1.674548362  
1.699238614  
1.720568143  
1.752005459  
1.807804009  
1.900258319  
2.036771727  
2.217175245  
2.431771173  
2.660529394  
2.873747501  
3.034300478  
3.101372058  
3.035309007  
2.803033482  
2.383277781  
1.770862115  
0.9793013623  
0.0412232281  
-0.9936566495  
-2.062873154  
-3.097409819  
-4.028981978  
-4.797452986  
-5.357359593  
-5.682659223  
-5.769023248  
-5.63340547  
-5.310962793  
-4.849832863  
-4.304546092  
-3.729045082  
-3.170292472  
-2.663331718  
-2.2284076  
-1.87041299  
-1.58058128  
-1.340003533  
-1.124302655  
-0.9086810332  
-0.6725327429  
-0.402948837  
-0.09665556269  
0.2397982432  
0.5915024286  
0.9379496533  
1.256554662  
1.526336055  
1.731148239  
1.861990662  
1.918089217  
1.906668066  
1.841533792  
1.740781935  
1.624043545  
1.509730688  
1.412701214  
1.34266976  
1.303527947  
1.293597185  
1.30667052  
1.333595548  
1.364092544  
1.388482317  
1.399069155  
1.390997472  
1.362518949  
1.314715783  
1.250802902  
1.175205981  
1.092606903  
1.007135509  
0.9218277318  
0.8384021949  
0.7573404213  
0.6781947084  
0.6000172651  
0.5217960447  
0.4427982173  
0.3627642316  
0.2819264748  
0.20088355  
0.1203782193  
0.04105413611  
-0.03673723818  
-0.1130302669  
-0.188209597  
-0.262853786  
-0.3374922491  
-0.4123391608  
-0.4870622593  
-0.5606647692  
-0.631509783  
-0.6975151607  
-0.7564875451  
-0.8065516144  
-0.8465806249  
-0.8765480193  
-0.8976990882  
-0.9124889438  
-0.9242556342  
-0.9366574892  
-0.9529528239  
-0.9752364348  
-1.003785992  
-1.03665662  
-1.069642876  
-1.096681246  
-1.110689147  
-1.104751237  
-1.073504533  
-1.014497765  
-0.9292930598  
-0.8240664129  
-0.7095450515  
-0.600179191  
-0.5125905257  
-0.4634421947  
-0.4670041508  
-0.532750616  
-0.6633761613  
-0.8535677331  
-1.089788219  
-1.351188433  
-1.61159253  
-1.842322209  
-2.015498097  
-2.107351997  
-2.101087079  
-1.988858452  
-1.77261995  
-1.463712526  
-1.081308338  
-0.6499568114  
-0.1966210086  
0.2523462996  
0.6738752037  
1.050159766  
1.369727629  
1.627559956  
1.824334479  
1.965029404  
2.057164152  
2.1090139  
2.12808403  
2.120071968  
2.088438025  
2.034585938  
1.958561819  
1.860075455  
1.739614414  
1.599410663  
1.444047237  
1.280571342  
1.118060399  
0.9666965774  
0.8364822897  
0.735807149  
0.6701013278  
0.6408121716  
0.6448954937  
0.6749350549  
0.7199198276  
0.7665886776  
0.8011823211  
0.8113512583  
0.7879531131  
0.7264720239  
0.6278393423  
0.4985131244  
0.3497912539  
0.196420467  
0.05468662546  
-0.05976303267  
-0.1340713961  
-0.1599902103  
-0.1351214396  
-0.06339816336  
0.04527431484  
0.1761693926  
0.3115297571  
0.4327706242  
0.5227913492  
0.5680907978  
0.5604113792  
0.4976994729  
0.3842633175  
0.2301296963  
0.04969878684  
-0.1401053685  
-0.3219367852  
-0.480093174  
-0.602284817  
-0.6808901519  
-0.713561477  
-0.7031390775  
-0.6569304563  
-0.5854881246  
-0.5010851227  
-0.41610169  
-0.3415527786  
-0.2859219908  
-0.2544334876  
-0.2488027334  
-0.2674507478  
-0.3060967781  
-0.3586020291  
-0.4179295956  
-0.4770693787  
-0.5298250978  
-0.5713747139  
-0.5985823008  
-0.6100534181  
-0.6059912362  
-0.5879005155  
-0.5582176391  
-0.5199272732  
-0.4762161341  
-0.4301951714  
-0.3847012026  
-0.3421709702  
-0.3045739486  
-0.2733704649  
-0.2494878237  
-0.2332910883  
-0.2245534316  
-0.222433835  
-0.2254782182  
-0.2316707899  
-0.2385449045  
-0.2433726533  
-0.2434124623  
-0.2362037012  
-0.2198661925  
-0.1933538221  
-0.1566347365  
-0.1107436989  
-0.05771025512  
-0.0003532077979  
0.05801917188  
0.1139627955  
0.1642465246  
0.2061430907  
0.2376263636  
0.2574471123  
0.2650975614  
0.2606910288  
0.2447944095  
0.2182625715  
0.1821182641  
0.1374915419  
0.08564095655  
0.02801921272  
-0.03363945032  
-0.09724531243  
-0.1603474115  
-0.2202027319  
-0.2739400597  
-0.3187939325  
-0.3523840638  
-0.3729846998  
-0.3797511618  
-0.3728461021  
-0.3534533023  
-0.32366376  
-0.2862520898  
-0.2443732987  
-0.2012232231  
-0.1597158664  
-0.122216806  
-0.09037076171  
-0.06503328823  
-0.04631020518  
-0.03367829613  
-0.02615729126  
-0.0224959068  
-0.02134014507  
-0.02135351786  
-0.02128899183  
-0.02001025338  
-0.0164871886  
-0.009778217314  
0.000964417215  
0.0164632753  
0.03724814912  
0.06356094338  
0.09525959193  
0.1317406846  
0.1719125633  
0.2142373991  
0.2568468036  
0.2977268129  
0.3349451916  
0.3668867616  
0.3924575397  
0.4112153155  
0.4234033144  
0.4298764273  
0.4319206636  
0.4310063727  
0.4285062777  
0.4254331143  
0.4222463239  
0.4187573452  
0.4141576714  
0.4071700582  
0.3962973104  
0.3801289122  
0.3576620302  
0.3285828982  
0.2934561954  
0.2537941583  
0.2119823722  
0.1710663732  
0.1344193802  
0.1053350312  
0.0865968241  
0.08008658982  
0.08649244957  
0.1051575217  
0.1341069525  
0.1702506478  
0.2097442219  
0.2484620345  
0.2825193779  
0.3087690405  
0.3251997633  
0.3311738443  
0.32746503  
0.3160853544  
0.2999105312  
0.2821754432  
0.2658932333  
0.2533004401  
0.2454227395  
0.2418336251  
0.2406666838  
0.2388955026  
0.2328440425  
0.2188804234  
0.1941617472  
0.1573281415  
0.1090106721  
0.05204840809  
-0.008650530573  
-0.06662067968  
-0.1146795494  
-0.145995629  
-0.155232124  
-0.1395970844  
-0.09961084582  
-0.03944259635  
0.03328950891  
0.1082938177  
0.1738908374  
0.2186786527  
0.233353316  
0.2124169938  
0.1554949968  
0.06799706749  
-0.03905182398  
-0.1500927365  
-0.246969894  
-0.3115199915  
-0.3284973536  
-0.2884220028  
-0.1899004416  
-0.04101006734  
0.140572147  
0.3288595536  
0.4922186014  
0.597152945  
0.6127689663  
0.5153297558  
0.2922518862  
-0.0550766155  
-0.5101401065  
-1.042076356  
-1.608398644  
-2.159373885  
-2.643525968  
-3.013542256  
-3.231791456  
-3.274705881  
-3.135443679  
-2.824485038  
-2.368130217  
-1.80515441  
-1.182124528  
-0.5480498054  
0.05090651133  
0.5759816247  
0.9991206748  
1.304714116  
1.489705171  
1.562229906  
1.539119748  
1.44274227  
1.297665112  
1.127601775  
0.9530029002  
0.789512928  
0.6473447573  
0.5315185659  
0.4427585361  
0.3787991951  
0.3358221278  
0.3097741937  
0.2973655527  
0.2966419757  
0.3071014457  
0.3294056997  
0.3648020588  
0.4144011339  
0.4784617974  
0.5558278655  
0.6436081481  
0.7371624198  
0.8303859495  
0.9162605859  
0.9875779118  
1.037743845  
1.061538978  
1.055744165  
1.019532875  
0.9545905543  
0.8649357573  
0.7564729491  
0.6363305318  
0.5120790541  
0.3909253476  
0.278991249  
0.1807682489  
0.09881130728  
0.03370489959  
-0.01571003719  
-0.05189492349  
-0.07803316967  
-0.09741539115  
-0.1128829797  
-0.1264239369  
-0.1389821914  
-0.1505101705  
-0.1602396143  
-0.1671276356  
-0.1703753079  
-0.1699255442  
-0.1668309676  
-0.1634048042  
-0.1631183107  
-0.170230114  
-0.1891991553  
-0.2239717138  
-0.2772546397  
-0.3498981224  
-0.4404896094  
-0.5452557579  
-0.6582852829  
-0.7720715915  
-0.8782976799  
-0.9687726349  
-1.036385868  
-1.075953614  
-1.084844883  
-1.063298868  
-1.014396735  
-0.9436886477  
-0.8585283222  
-0.7672002505  
-0.6779554866  
-0.5980712726  
-0.5330558532  
-0.4860888599  
-0.4577569947  
-0.4461096418  
-0.4470147314  
-0.4547660983  
-0.4628511391  
-0.4647886507  
-0.4549226826  
-0.4290802629  
-0.3850084953  
-0.3225387504  
-0.2434661815  
-0.151160205  
-0.04997048135  
0.05548461074  
0.1610393491  
0.2635904744  
0.3615008238  
0.4547205602  
0.5445992562  
0.6333984847  
0.7236041698  
0.8171268258  
0.9145541624  
1.014600726  
1.113876387  
1.207067222  
1.287530927  
1.348268992  
1.383128246  
1.388061209  
1.362221658  
1.308682209  
1.234594408  
1.150680958  
1.070056063  
1.006459923  
0.9721150217  
0.9754931351  
1.019328177  
1.099226343  
1.203154088  
1.312007853  
1.401300853  
1.443854205  
1.413195379  
1.287242606  
1.05176052  
0.703071818  
0.2495659527  
-0.288282906  
-0.8794834892  
-1.48553062  
-2.064473577  
-2.575499057  
-2.983393303  
-3.262259162  
-3.397972063  
-3.389073815  
-3.246033674  
-2.989076402  
-2.644978306  
-2.243375897  
-1.813160948  
-1.379482728  
-0.9617225814  
-0.5726133318  
-0.2184777225  
