1354.462928  
1415.315366  
1564.064574  
1876.493253  
1772.017831  
2858.031253  
40255.83024  
6793.395013  
16028.3397  
23108.46239  
102614.3155  
3229.434476  
18097.92379  
21851.58822  
22530.7812  
11281.86136  
6885.931969  
336.0874673  
238.5355822  
12873.71911  
3480.566742  
1360.501054  
1364.579979  
8014.780684  
20025.05064  
7110.654559  
14805.89013  
18542.16683  
2182.183827  
11140.83162  
6893.201396  
3692.058075  
3502.325714  
12710.39673  
22680.49553  
1925.138017  
675.8672693  
4223.921051  
1163.996743  
196.9813123  
845.7455317  
2968.880019  
3624.609441  
540.4062066  
3345.908853  
1216.892143  
477.8215711  
158.1545599  
1938.043897  
4415.714052  
3164.847711  
249.2391746  
4116.167233  
3718.58359  
1180.420174  
168.84117  
1636.727206  
78.95245984  
2445.650346  
743.9461624  
1502.435009  
1654.204843  
1925.425317  
903.6358899  
64.26794379  
507.7551994  
221.8300319  
136.3332891  
18.81086391  
186.0254876  
48.52310206  
33.72492422  
21.08610946  
43.54389422  
30.75716297  
49.90546236  
19.0619799  
42.52431657  
23.84263417  
24.2821769  
25.58581843  
19.44737513  
21.01518313  
17.45250099  
16.01228842  
13.60237569  
12.20954259  
12.3315258  
12.07260886  
11.0383866  
9.941209728  
9.576963231  
8.891706297  
8.261490104  
7.769504973  
7.422892458  
6.916665002  
6.600341967  
6.195930002  
5.833711541  
5.593633245  
5.39143296  
5.098044536  
4.907224742  
4.665677342  
4.453037867  
4.259198449  
4.060025383  
3.903313808  
3.739407955  
3.592544866  
3.448746877  
3.311814946  
3.180962926  
3.056759046  
2.942325996  
2.830240043  
2.727467989  
2.627487886  
2.531840641  
2.441940856  
2.357388832  
2.275661453  
2.198787867  
2.124318792  
2.054070001  
1.987068504  
1.923091617  
1.861130281  
1.802337149  
1.746258653  
1.692319393  
1.640718299  
1.591163724  
1.543598164  
1.498090728  
1.454408193  
1.412520431  
1.372286637  
1.333508292  
1.29607556  
1.260309084  
1.225809895  
1.19257051  
1.160723301  
1.129865127  
1.100189919  
1.071567383  
1.044005553  
1.017368678  
0.9916916409  
0.9669188357  
0.942989505  
0.9199091866  
0.897545336  
0.8759901721  
0.8550996496  
0.8348972777  
0.8153945689  
0.7965107766  
0.778225312  
0.7605710438  
0.7433844093  
0.726797588  
0.7106989401  
0.6951404772  
0.6800459653  
0.6653487045  
0.6511344369  
0.6373876884  
0.6240031022  
0.6110080643  
0.598408998  
0.5862160754  
0.5743138823  
0.5627978263  
0.5515573234  
0.5406695305  
0.5300758028  
0.5197787366  
0.509766401  
0.5000259852  
0.4905694486  
0.4813416081  
0.4723875385  
0.4636442539  
0.4551428918  
0.4468720855  
0.438826261  
0.4309560335  
0.423310003  
0.4158557832  
0.4086021907  
0.4015249606  
0.3946239177  
0.3878984498  
0.3813299317  
0.3749509234  
0.3686996066  
0.3625978753  
0.3566619182  
0.3508658883  
0.3451870141  
0.3396669526  
0.3342719695  
0.3290138967  
0.3238731704  
0.3188238227  
0.3139170118  
0.3091232824  
0.3044129506  
0.2998441299  
0.2953710049  
0.2909854129  
0.2867218224  
0.2825141457  
0.2784373597  
0.2744072816  
0.2704953314  
0.2666542716  
0.2629086317  
0.2592409756  
0.2556437626  
0.2521358641  
0.2486729403  
0.245318109  
0.2420137026  
0.2387901799  
0.2356208179  
0.232532362  
0.2294815358  
0.2265131685  
0.2235913503  
0.2207334444  
0.2179398067  
0.2151872094  
0.2124956963  
0.2098630393  
0.2072841373  
0.2047479777  
0.2022655039  
0.1998260782  
0.1974367639  
0.1950866956  
0.1927783238  
0.1905484031  
0.188302464  
0.1861490804  
0.1840086817  
0.1819224573  
0.1798692731  
0.1778546244  
0.1758597216  
0.1739360899  
0.1720209763  
0.1701544031  
0.1683169509  
0.1664977082  
0.1647316516  
0.162989631  
0.1612741733  
0.159590288  
0.1579415984  
0.1563238645  
0.1547239116  
0.1531520272  
0.1516182359  
0.1500941574  
0.1485880077  
0.1471438735  
0.145707277  
0.1442975441  
0.1429148946  
0.1415226611  
0.1401999589  
0.1388665749  
0.1375627199  
0.1362990356  
0.1350353068  
0.1338021012  
0.1325819226  
0.131380623  
0.1302137263  
0.1290451959  
0.1279135217  
0.1267901302  
0.1256863198  
0.1245968075  
0.123529851  
0.1224739773  
0.1214491626  
0.1204326968  
0.1194225972  
0.118432635  
0.1174630847  
0.1165076158  
0.1155652157  
0.1146393072  
0.1137228519  
0.112827207  
0.1119332474  
0.1110634914  
0.1102093957  
0.1093580707  
0.108518509  
0.107704033  
0.1068955976  
0.106097952  
0.1053108537  
0.1045341968  
0.1037780841  
0.1030208826  
0.1022834485  
0.1015543809  
0.1008384057  
0.1001312515  
0.09943457824  
0.09874010559  
0.09806824187  
0.09740164334  
0.09673786098  
0.09608993012  
0.09545324053  
0.09482404665  
0.09420342252  
0.09359262807  
0.09298448187  
0.09240460805  
0.09180860621  
0.09123198538  
0.0906575226  
0.09010859975  
0.08955178827  
0.08900499579  
0.0884597274  
0.08792767765  
0.08739961687  
0.08689835906  
0.08638014333  
0.08587828802  
0.08538617879  
0.0848925359  
0.08440932581  
0.08393576644  
0.08347076963  
0.0830039334  
0.08255296299  
0.08210572381  
0.08166904202  
0.08122990248  
0.08079567269  
0.08037136245  
0.07996049975  
0.07954117784  
0.07912649598  
0.07872957338  
0.07833292686  
0.07793662569  
0.07755122706  
0.07717409584  
0.07680950402  
0.07642743988  
0.07606520787  
0.07570351108  
0.07535423821  
0.07500567343  
0.07465322786  
0.07431054511  
0.07398687992  
0.07364982504  
0.07331729278  
0.07300498103  
0.07268210647  
0.07237229499  
0.07206707058  
0.07174986237  
0.07146169584  
0.07115699273  
0.07087463697  
0.07058093479  
0.07030487114  
0.07001827248  
0.06974287037  
0.06947559357  
0.0691947934  
0.06893400807  
0.06866530974  
0.0684169466  
0.06815242454  
0.0679129062  
0.06766462856  
0.06742495684  
0.06718042435  
0.06694148068  
0.06671608088  
0.06648801633  
0.06625573037  
0.06603440272  
0.06582688315  
0.06560205941  
0.06539126621  
0.06518261515  
0.06497333265  
0.06476980533  
0.06456391593  
0.06437555668  
0.0641790845  
0.06398324626  
0.06379365879  
0.06360440066  
0.06342765224  
0.06324997697  
0.06307983559  
0.06290145623  
0.06272704048  
0.06256424411  
0.06239334897  
0.06222869921  
0.06206644258  
0.06190746401  
0.06175741755  
0.06160469271  
0.06144266618  
0.06130045351  
0.06115617929  
0.0610150864  
0.06086957038  
0.06074013557  
0.06060393639  
0.0604688046  
0.06034661698  
0.06021608788  
0.0600915257  
0.05996859783  
0.05984015664  
0.05972770575  
0.05960977978  
0.05949437048  
0.0593834038  
0.05927784508  
0.05916676204  
0.05906702693  
0.05896607164  
0.05886334122  
0.05876231066  
0.05866422726  
0.05858131166  
0.05848565442  
0.05839537928  
0.05830619354  
0.05822491648  
0.05813944482  
0.05805967294  
0.05798283398  
0.0579055602  
0.05783555077  
0.05775580319  
0.05768321712  
0.05761580503  
0.05755095085  
0.05748665552  
0.0574157027  
0.05736175363  
0.05731274466  
0.05724956677  
0.05719076018  
0.05713657487  
0.05708769107  
0.0570435345  
0.05699303913  
0.05695485844  
0.05691013918  
0.05686777298  
0.05682592313  
0.05679528633  
0.05675779882  
0.05672568381  
0.05669934066  
0.05667111902  
0.05663332985  
0.05661316897  
0.05658789219  
0.0565673796  
0.05653947459  
0.05652624315  
0.05651141895  
0.05650150125  
0.05648687065  
0.05646847917  
0.05646601385  
0.0564618403  
0.05645576075  
0.05645711589  
0.0564588691  
