0.1766926204  
0.1949642395  
0.2091297535  
0.2160215471  
0.2129953062  
0.1981512607  
0.1705373763  
0.1303071674  
0.07880505119  
0.01854865558  
-0.0469089154  
-0.1132481927  
-0.1757548123  
-0.2297727286  
-0.2711777548  
-0.2968194537  
-0.3048719856  
-0.2950481146  
-0.2686545058  
-0.2284729939  
-0.1784906591  
-0.123508817  
-0.06867254874  
-0.01898150194  
0.0211754452  
0.04841213956  
0.06062839361  
0.05715990092  
0.03878814498  
0.007608304859  
-0.03322209509  
-0.07983427307  
-0.128053359  
-0.1738259384  
-0.2136170801  
-0.2447414299  
-0.2655901986  
-0.2757340489  
-0.2758933348  
-0.2677828411  
-0.2538591419  
-0.2370045837  
-0.2201910561  
-0.2061737411  
-0.1972413306  
-0.1950604652  
-0.2006070475  
-0.2141830504  
-0.2354865368  
-0.2637068093  
-0.2976030837  
-0.3355533089  
-0.3755533572  
-0.4151889541  
-0.4516049991  
-0.4815179011  
-0.5013106277  
-0.5072485807  
-0.4958206755  
-0.4641881632  
-0.4106837323  
-0.3352868632  
-0.2399746433  
-0.1288658541  
-0.008084490976  
0.1146762785  
0.2308708824  
0.3320172648  
0.4106958514  
0.4614788234  
0.4816465396  
0.4715611438  
0.4346219715  
0.3767858156  
0.3057115494  
0.2296427933  
0.1562008694  
0.09127292235  
0.03818192324  
-0.002719340878  
-0.03395137661  
-0.06029920728  
-0.08777664858  
-0.1223134294  
-0.1683680947  
-0.2276939061  
-0.2984690203  
-0.3749545348  
-0.4477776087  
-0.5048420872  
-0.5327778026  
-0.5187636714  
-0.452484658  
-0.3279656874  
-0.1450137242  
0.08995347341  
0.3638575621  
0.6577435755  
0.9483716865  
1.210461208  
1.41935369  
1.55379124  
1.598470054  
1.546051022  
1.398350493  
1.16654017  
0.8702885888  
0.5359157531  
0.1937499563  
-0.1250229874  
-0.3916566211  
-0.5829065095  
-0.6835054435  
-0.6877545092  
-0.600048082  
-0.4342672887  
-0.212121  
0.03937372367  
0.2909613631  
0.5144058368  
0.685541333  
0.7867665583  
0.8086828767  
0.7507196739  
0.620700016  
0.4334478473  
0.2086612066  
-0.03164025427  
-0.2657426337  
-0.4745989129  
-0.6436391821  
-0.7638512232  
-0.8320560144  
-0.8504369988  
-0.8254771641  
-0.7665275228  
-0.6842702476  
-0.5893073039  
-0.4910754046  
-0.3971896746  
-0.3132390957  
-0.2429703785  
-0.1887253084  
-0.1519681653  
-0.1337335918  
-0.134862563  
-0.1559552247  
-0.1970426831  
-0.2570551748  
-0.3332260451  
-0.4206088656  
-0.5118686358  
-0.5974954534  
-0.6664961592  
-0.7075412053  
-0.7104563066  
-0.6678475117  
-0.5766078616  
-0.4390246661  
-0.2632432512  
-0.06291593167  
0.1440250846  
0.3373837288  
0.4972893646  
0.6070113943  
0.6555822038  
0.6397905799  
0.5651613639  
0.4456731645  
0.3021328786  
0.1593584809  
0.04251868457  
-0.02683562935  
-0.03443075382  
0.02401865779  
0.1415412647  
0.3004116891  
0.4744397346  
0.6327828059  
0.7447399649  
0.7847880748  
0.73705605  
0.5984709686  
0.3800266223  
0.1058873836  
-0.1895919983  
-0.4665274224  
-0.6851564032  
-0.8116365018  
-0.8231033515  
-0.7112291817  
-0.4837517353  
-0.1637460911  
0.213227369  
0.6036773398  
0.9617504337  
1.245037732  
1.419796394  
1.464913866  
1.37412771  
1.156287746  
0.8337256597  
0.4390465921  
0.01085036043  
-0.4109998972  
-0.789932642  
-1.096485656  
-1.310967186  
-1.424728157  
-1.440014701  
-1.368554577  
-1.229183988  
-1.044898273  
-0.8397598569  
-0.6360496581  
-0.4519787637  
-0.3001724971  
-0.1870116474  
-0.1128046324  
-0.07267076931  
-0.05793750078  
-0.05783007361  
-0.06121514149  
-0.058191541  
-0.04135369698  
-0.006616243671  
0.04645805217  
0.114825279  
0.1925663636  
0.2718356544  
0.3440250438  
0.4010028178  
0.4362779119  
0.4459569995  
0.429383553  
0.389379278  
0.3320511964  
0.2661777493  
0.2022252073  
0.1511019175  
0.1227816711  
0.1249593425  
0.1618967229  
0.2336173619  
0.3355615261  
0.4587738323  
0.5906291514  
0.7160420865  
0.8190362608  
0.8845091578  
0.8999824243  
0.8571400657  
0.7529531009  
0.5902539872  
0.3776691673  
0.1289164219  
-0.1384711115  
-0.40483892  
-0.6503315605  
-0.8568155793  
-1.009588014  
-1.098690424  
-1.119706999  
-1.073984347  
-0.9682978345  
-0.8140388202  
-0.6260389383  
-0.4211761894  
-0.2169073312  
-0.02984968527  
0.1254782047  
0.2376828414  
0.2992394714  
0.306918813  
0.2618953128  
0.169525465  
0.03883228381  
-0.1182821063  
-0.2880359111  
-0.4558998625  
-0.6077869814  
-0.7311825975  
-0.8161325898  
-0.8559918743  
-0.8478684292  
-0.7927266935  
-0.6951396476  
-0.5627214858  
-0.4052990338  
-0.2339038835  
-0.05969460796  
0.1070865115  
0.2580084465  
0.3871103555  
0.4912495582  
0.5701117855  
0.6258892132  
0.662674137  
0.6856543633  
0.7002237681  
0.711124227  
0.7217464651  
0.7336751618  
0.7465446028  
0.7582109473  
0.7652138604  
0.7634398203  
0.7488885608  
0.7184044964  
0.6702663256  
0.6045316795  
0.5230874029  
0.4293967895  
0.3279942995  
0.223810793  
0.1214524507  
0.02455470422  
-0.06467622074  
-0.1456495908  
-0.2192780204  
-0.2875799692  
-0.3530655784  
-0.4180170566  
-0.4837913412  
-0.5502720746  
-0.6155825771  
-0.6761210032  
-0.7269382597  
-0.7624067316  
-0.7770835508  
-0.7666456898  
-0.7287280366  
-0.663537166  
-0.574127873  
-0.4662722956  
-0.3479370914  
-0.2284212524  
-0.1172741015  
-0.02314425313  
0.0472801402  
0.09009233485  
0.1046328661  
0.09354158958  
0.06239165523  
0.01896017288  
-0.02775994232  
-0.06867045278  
-0.09565449864  
-0.1024995811  
-0.08554848992  
-0.04401095889  
0.0200854023  
0.1022666707  
0.1962435522  
0.2946938501  
0.3900891645  
0.4754619564  
0.5450243525  
0.5945875477  
0.6217642582  
0.6259592909  
0.6081945715  
0.5708174775  
0.5171481134  
0.4511204075  
0.3769501951  
0.2988575355  
0.2208480297  
0.1465496978  
0.07909414621  
0.02103172295  
-0.02573472524  
-0.05999787002  
-0.08128285109  
-0.08986219242  
-0.08675108023  
-0.07366841832  
-0.05296305559  
-0.02749820591  
-0.0004935129983  
0.02467215999  
0.04469485604  
0.05659995196  
0.05801030545  
0.04740184609  
0.02432444864  
-0.01044545718  
-0.05484044163  
-0.1055632253  
-0.15828202  
-0.2079669739  
-0.2493486248  
-0.277469788  
-0.2882657663  
-0.2791127015  
-0.2492650872  
-0.2001134439  
-0.1352101034  
-0.06003739655  
0.01847652477  
0.09264462695  
0.154839819  
0.1983378071  
0.218082047  
0.2112604128  
0.1776156177  
0.1194455624  
0.04128998967  
-0.05064868731  
-0.1492672129  
-0.2473952092  
-0.3385832938  
-0.4177266762  
-0.481448326  
-0.5281978459  
-0.5580625619  
-0.5723581774  
-0.5730695938  
-0.562268963  
-0.5416171147  
-0.512044347  
-0.4736775451  
-0.4260164615  
-0.3683320275  
-0.3001966202  
-0.2220362011  
-0.1355824003  
-0.04411257789  
0.0475908938  
0.1335903715  
0.2074073708  
0.2628198943  
0.294707669  
0.2998058106  
0.2772336801  
0.2287073465  
0.158392423  
0.07242617098  
-0.02181279103  
-0.1165579801  
-0.2045025044  
-0.2795040556  
-0.3370582015  
-0.3745042092  
-0.3909737886  
-0.387145995  
-0.3648983627  
-0.3269502782  
-0.2765685165  
-0.2173802986  
-0.153281099  
-0.08839979786  
-0.02704378309  
0.02644048716  
0.06795248948  
0.09406900551  
0.1025893131  
0.09309508092  
0.06740062852  
0.02975229142  
-0.01334186327  
-0.05371176318  
-0.08253658813  
-0.09166635674  
-0.07505817732  
-0.03008507766  
0.04154132143  
0.1334576295  
0.2350817729  
0.332815568  
0.4118937327  
0.4586358891  
0.4627664434  
0.4194169017  
0.3304566269  
0.2048837241  
0.0581369129  
-0.08963256548  
-0.2161335213  
-0.30000912  
-0.3239709514  
-0.2775305016  
-0.1588961731  
0.02428676822  
0.2555191332  
0.5113346026  
0.7642773016  
0.986589424  
1.154101326  
1.249765877  
1.266294401  
1.207466912  
1.087845753  
0.930861544  
0.765478407  
0.6218647965  
0.5266921432  
0.4987544582  
0.5456116439  
0.6618326815  
0.8291979755  
1.018941244  
1.195788079  
1.323255522  
1.369436772  
1.312386944  
1.1442173  
0.8731878432  
0.5233504498  
0.1316852221  
-0.2569265939  
-0.5961831775  
-0.8453124333  
-0.9753958585  
-0.9740402341  
-0.8476173709  
-0.620671917  
-0.3325670896  
-0.03187677141  
0.2305847328  
0.4090090373  
0.4689896169  
0.392121502  
0.1781621409  
-0.1554662076  
-0.5766352457  
-1.043356541  
-1.509690751  
-1.931790347  
-2.273199333  
-2.508714407  
-2.626388363  
-2.627574185  
-2.525208793  
-2.340767501  
-2.100480887  
-1.831438572  
-1.558149285  
-1.299989069  
-1.069775016  
-0.8735082213  
-0.7111363992  
-0.5780619175  
-0.4670360461  
-0.3700812338  
-0.2801284298  
-0.1921551888  
-0.1037210965  
-0.01490866857  
0.0722136882  
0.1544458488  
0.2284202127  
0.2914911192  
0.3424007984  
0.3816212695  
0.4113479456  
0.4351688432  
0.4574831051  
0.4827795709  
0.5148783613  
0.5562572995  
0.6075487063  
0.6672745115  
0.7318594836  
0.7959307539  
0.8528804153  
0.895649737  
0.9176669739  
0.9138398124  
0.881505701  
0.8212136501  
0.7372229703  
0.6376047573  
0.533869545  
0.4400834068  
0.3714941278  
0.3427650244  
0.3659741101  
0.4486188849  
0.5918773449  
0.7894157883  
1.026980794  
1.282950738  
1.529910269  
1.737178371  
1.874080319  
1.913621201  
1.836123783  
1.632352472  
1.305657407  
0.8727663648  
0.3629937437  
-0.1841602348  
-0.7228419165  
-1.205714595  
-1.589303487  
-1.839155977  
-1.934132745  
-1.869240153  
-1.656566659  
-1.324145807  
-0.9128239834  
-0.4715142705  
-0.0514184199  
0.3000258164  
0.5446757742  
0.6579755243  
0.631445282  
0.4730802698  
0.2056450267  
-0.1368362658  
-0.5138714757  
-0.8838714587  
-1.209349901  
-1.461258444  
-1.621910169  
-1.686168841  
-1.660849527  
-1.562525106  
-1.414157489  
-1.241107826  
-1.067149775  
-0.9110633123  
-0.7842776127  
-0.6898450807  
-0.6228274178  
-0.5719479049  
-0.5221932671  
-0.4579154835  
-0.3659307817  
-0.2381286503  
-0.07318900392  
0.1228399922  
0.3371938734  
0.5521684875  
0.7477618368  
0.9047912998  
1.008022949  
1.048845258  
1.027064946  
0.9515226482  
0.8393749159  
0.7140697468  
0.6022422305  
0.5299045632  
0.5184483187  
0.5810231075  
0.719846396  
0.9249090068  
1.174359667  
1.436633497  
1.674132548  
1.848027825  
1.923540283  
1.874970009  
1.689717625  
1.370675814  
0.9365830374  
0.4202348753  
-0.1352352216  
-0.6814851644  
-1.170779969  
-1.561670463  
-1.82373896  
-1.940791764  
-1.912112273  
-1.751707103  
-1.485764225  
-1.148773556  
-0.7789385013  
-0.4135360243  
-0.08483743741  
0.1829337938  
0.3753356144  
0.4880554048  
0.5260141516  
0.5014959657  
0.4316878223  
0.3360139812  
0.2336246753  
0.1413094677  
0.07199545961  
0.03388770877  
0.03020085398  
0.05939043486  
0.1157490379  
0.1902388738  
0.271480314  
0.3468253126  
0.4034949989  
0.4297730464  
0.4162252112  
0.3569003461  
0.2504153322  
0.1007855985  
-0.08216304432  
-0.2829613581  
-0.4813757522  
-0.6540395669  
-0.7767840677  
-0.8274851371  
-0.7891276011  
-0.6526978039  
-0.4194745858  
-0.1023063734  
0.2744429492  
0.6764507514  
1.062456255  
1.388508083  
1.612980682  
1.701762493  
1.632927857  
1.400231795  
1.014870753  
0.5051671764  
-0.08590370026  
-0.7051283439  
-1.294911535  
-1.799851139  
-2.173188302  
-2.382278107  
-2.412341368  
-2.267995828  
-1.972363192  
-1.56389347  
-1.091353796  
-0.6076822134  
-0.1635416954  
0.1985755283  
0.4489521496  
0.5734282114  
0.5740999551  
0.4679720772  
0.2838656404  
0.0580881737  
-0.1704904623  
-0.3653137914  
-0.4963554687  
-0.5432289844  
-0.496908121  
-0.3599785522  
-0.1455369614  
0.1250122378  
0.4248884482  
0.7251945047  
0.9981058986  
1.219645672  
1.37180336  
1.443851178  
1.432823688  
1.343217171  
1.186039179  
0.9773636712  
0.7365887689  
0.4845574324  
0.2417010529  
0.02633373572  
-0.1467982804  
-0.2676336321  
-0.3315017943  
-0.339387641  
-0.2977074516  
-0.2176168217  
-0.1138853168  
-0.003416183278  
0.09645006526  
0.1697055957  
0.2033354446  
0.1887056214  
0.1225313948  
0.007323876413  
-0.148734681  
-0.3324933095  
-0.5270513443  
-0.7133995656  
-0.8723442055  
-0.9865419298  
-1.042459732  
-1.032045027  
-0.9539171236  
-0.8139000407  
-0.6247761858  
-0.4052146799  
-0.1779244614  
0.032803074  
0.2039041138  
0.3163508109  
0.3575847744  
0.323204468  
0.2176181318  
0.05352476153  
-0.1497647401  
-0.3689436542  
-0.5798875602  
-0.7609019408  
-0.8955171343  
-0.9743689589  
-0.9958477282  
-0.9654220848  
-0.893772142  
-0.794108769  
-0.6792029707  
-0.5587275597  
-0.4374494774  
-0.3146658479  
-0.1850088579  
-0.04047792117  
0.1267163765  
0.3211030643  
0.54137303  
0.7788853212  
1.017672731  
1.236084553  
1.409854703  
1.516108194  
1.537593294  
1.466347958  
1.306083023  
1.072772165  
0.7932278654  
0.5018165788  
0.235761511  
0.0297512902  
-0.08930277824  
-0.1065270484  
-0.0216742162  
0.1503994425  
0.381481204  
0.6337422852  
0.8649479362  
1.034378061  
1.108606558  
1.066310936  
0.901425549  
0.6242100168  
0.2600953306  
-0.1535107194  
-0.5720061502  
-0.9493126477  
-1.243771789  
-1.423470594  
-1.470338695  
-1.382532546  
-1.174842231  
-0.8770879552  
-0.5306944846  
-0.1838319576  
0.1143514279  
0.319773047  
0.3990776929  
0.3342778039  
0.1258147778  
-0.2063809574  
-0.6240589066  
-1.074049364  
-1.493654348  
-1.817527188  
-1.985339047  
-1.949374085  
-1.681139543  
-1.176131858  
-0.4560756895  
0.4317891421  
1.418440104  
2.419528247  
3.343901451  
4.103256086  
4.621804216  
4.844803269  
4.744905258  
4.325530253  
3.620813306  
2.692097575  
1.62136074  
0.5023448777  
-0.5695602198  
-1.507476085  
-2.242045247  
-2.728241089  
-2.9492168  
-2.916804933  
-2.668689707  
-2.262673983  
-1.768803487  
-1.260345011  
-0.8047195554  
-0.4554749272  
-0.2462227326  
-0.1872179987  
-0.2649318381  
-0.4446267102  
-0.6755717403  
-0.8982648435  
-1.052773094  
-1.087185329  
-0.9651404146  
-0.6715016509  
-0.2154273394  
0.3695944493  
1.028835702  
1.692247355  
2.282541689  
2.724480144  
2.954216731  
2.927509069  
2.625722919  
2.058818651  
1.264907562  
0.3063984684  
-0.7367712834  
-1.775960319  
-2.723568367  
-3.502478211  
-4.054033163  
-4.343621854  
-4.363285002  
-4.131159323  
-3.687993289  
-3.091308723  
-2.408058579  
-1.706745566  
-1.049977659  
-0.488302402  
-0.05595534389  
0.2311436942  
0.3750946523  
0.3936611354  
0.3163198893  
0.1793315733  
0.02051487954  
-0.1256178796  
-0.2318131325  
-0.2807111604  
-0.2659699383  
-0.1918625688  
-0.07153406515  
0.07576442023  
0.2280427219  
0.364082484  
0.466654113  
0.5250564623  
0.5367061607  
0.5076215482  
0.4517668514  
0.389361057  
0.3443451891  
0.3413006207  
0.4021544499  
0.5430403067  
0.771673335  
1.085562947  
1.471309526  
1.905139611  
2.354692648  
2.781939036  
3.14694897  
3.412101206  
3.546237573  
3.528231646  
3.34950573  
3.015147419  
2.543482219  
1.964172003  
1.315132192  
0.6387088344  
-0.02234393686  
-0.6285756774  
-1.146826867  
-1.552241603  
-1.829250457  
-1.971634607  
-1.981912616  
-1.870318067  
-1.653627055  
-1.353986726  
-0.9977840745  
-0.6144807129  
-0.2352798061  
0.108523697  
0.3875666336  
0.5767631038  
0.6577569208  
0.6211367543  
0.4680056835  
0.210504644  
-0.1289793971  
-0.5199822719  
-0.9273315782  
