-0.07827250428  
0.008198912562  
0.08358978994  
0.1387456508  
0.1671680223  
0.1657988649  
0.1353347602  
0.0800354146  
0.007071392683  
-0.07448838837  
-0.1548979119  
-0.224993534  
-0.2773176465  
-0.3069651685  
-0.3120509949  
-0.2937584412  
-0.2559815942  
-0.2046351906  
-0.1467466858  
-0.0894656419  
-0.0391355288  
-0.000551606292  
0.0235032423  
0.03240362419  
0.02750949352  
0.01173988363  
-0.01102427309  
-0.0365915682  
-0.06105871902  
-0.08126601943  
-0.0950532664  
-0.1012986373  
-0.09976950568  
-0.09083771997  
-0.0751399718  
-0.05325821973  
-0.02548930689  
0.00825217609  
0.04838723714  
0.09549801212  
0.1500675988  
0.2121892764  
0.2813057335  
0.3560308677  
0.4340866443  
0.5123694913  
0.58714047  
0.6543075028  
0.7097644826  
0.7497452165  
0.7711468185  
0.771793442  
0.7506168463  
0.7077403292  
0.6444669824  
0.563177137  
0.4671472237  
0.3603018066  
0.2469215743  
0.1313271975  
0.01756223334  
-0.09089091675  
-0.1913410029  
-0.2820274984  
-0.3621580543  
-0.4318260914  
-0.4918240012  
-0.543366015  
-0.5877585689  
-0.6260730824  
-0.6588628505  
-0.6859774157  
-0.7065076736  
-0.7188767526  
-0.7210701006  
-0.7109754256  
-0.6867799319  
-0.6473674642  
-0.5926485303  
-0.5237662063  
-0.4431438172  
-0.3543533211  
-0.261820695  
-0.1704059652  
-0.08491337762  
-0.009598556673  
0.05225563522  
0.0986472298  
0.1290033549  
0.1441617281  
0.1461995864  
0.1381404208  
0.1235908482  
0.1063560392  
0.09008268587  
0.07796325704  
0.07252409945  
0.07549617438  
0.0877642794  
0.1093750999  
0.1395871309  
0.1769492079  
0.2194001284  
0.2643884139  
0.3090211614  
0.3502428651  
0.3850463793  
0.4107109357  
0.4250451221  
0.4266120356  
0.4149033628  
0.3904351827  
0.3547427997  
0.3102624043  
0.2601144939  
0.2078019519  
0.1568667241  
0.1105432907  
0.07145130156  
0.04136817287  
0.02110318571  
0.01048569059  
0.008461577352  
0.01327718501  
0.02272351874  
0.03440090707  
0.04597058755  
0.055361463  
0.06091256156  
0.06143947236  
0.05623431462  
0.04501181677  
0.02783018917  
0.005010067389  
-0.02291699278  
-0.05522920115  
-0.09098706942  
-0.1289852805  
-0.1677039873  
-0.2052934602  
-0.2396234516  
-0.2684205277  
-0.2894934665  
-0.3010298236  
-0.3019221936  
-0.2920681342  
-0.2725790734  
-0.2458456518  
-0.2154196252  
-0.1857046875  
-0.1614802475  
-0.1473159346  
-0.1469541188  
-0.1627526844  
-0.1952757538  
-0.2431006633  
-0.3028788915  
-0.3696535023  
-0.4373939351  
-0.4996779801  
-0.5504329677  
-0.5846290317  
-0.5988359971  
-0.5915693406  
-0.5633832301  
-0.5167054331  
-0.455445148  
-0.3844330383  
-0.3087832943  
-0.2332608912  
-0.1617433627  
-0.0968462382  
-0.03975113581  
0.00975261671  
0.05303247871  
0.09223009103  
0.1297968209  
0.1680200768  
0.2086037636  
0.2523641379  
0.2990747029  
0.3474712387  
0.3954119717  
0.4401580686  
0.4787348682  
0.5083249006  
0.5266384321  
0.5322242833  
0.5246805169  
0.5047567066  
0.4743303639  
0.4362780581  
0.3942482186  
0.352368183  
0.3149097454  
0.2859420587  
0.2689944192  
0.2667569933  
0.2808281173  
0.3115337303  
0.3578232457  
0.4172626212  
0.4861258387  
0.5595989345  
0.6320949369  
0.697665764  
0.7504955456  
0.7854345073  
0.7985210862  
0.7874389875  
0.7518395209  
0.6934811084  
0.6161477768  
0.525330708  
0.4277012791  
0.3304180027  
0.2403521407  
0.1633202264  
0.1034263273  
0.06259834908  
0.04038120832  
0.03401837744  
0.0388114099  
0.04871360748  
0.05707911924  
0.05747953729  
0.04447795966  
0.01427507572  
-0.03484702182  
-0.1023315314  
-0.1854158242  
-0.27944681  
-0.3783946843  
-0.4755103261  
-0.5640460681  
-0.6379660517  
-0.6925775827  
-0.7250213887  
-0.7345775136  
-0.7227552434  
-0.6931617489  
-0.651147011  
-0.6032584342  
-0.5565407474  
-0.5177431022  
-0.4925056124  
-0.4846106322  
-0.4953857343  
-0.523345047  
-0.5641320191  
-0.6108117584  
-0.6545107572  
-0.6853689306  
-0.6937160797  
-0.6713483508  
-0.6127477334  
-0.5160841284  
-0.3838426853  
-0.222958524  
-0.04440210106  
0.1377834114  
0.3079024594  
0.4503323462  
0.5513488618  
0.6008182459  
0.5935231895  
0.5299444445  
0.4163674305  
0.2642855104  
0.08916057237  
-0.09131273555  
-0.2592216361  
-0.3984789445  
-0.4966390158  
-0.5462664371  
-0.5456953801  
-0.4990974493  
-0.4158643214  
-0.3093885177  
-0.1954025295  
-0.090070108  
-0.008058809006  
0.03918492696  
0.04476435194  
0.007112198099  
-0.06987308406  
-0.1773503114  
-0.3026728322  
-0.4310166914  
-0.5473133434  
-0.6382603446  
-0.6941608013  
-0.710338798  
-0.687921807  
-0.6338405128  
-0.5599902483  
-0.4816073718  
-0.4150216897  
-0.3750575644  
-0.3724297296  
-0.4115093396  
-0.4888319352  
-0.5926380289  
-0.7036082652  
-0.7968134475  
-0.8446942706  
-0.820730547  
-0.7033220497  
-0.479332699  
-0.1467490538  
0.2839834968  
0.7902270323  
1.3390614  
1.890639565  
2.402549843  
2.834597058  
3.153320722  
3.335622653  
3.371004177  
3.262142672  
3.023793544  
2.680275202  
2.261981888  
1.801502523  
1.329934452  
0.8738905709  
0.4535497753  
0.08188278379  
-0.2350068107  
-0.4966664465  
-0.7065518004  
-0.8701414395  
-0.9932627127  
-1.080888128  
-1.136543622  
-1.16233244  
-1.159457774  
-1.129052097  
-1.07306332  
-0.9949680362  
-0.9001147403  
-0.7955860537  
-0.6895628337  
-0.5902726573  
-0.5046943165  
-0.4372437282  
-0.3886959809  
-0.3555726589  
-0.3301616049  
-0.3012493343  
-0.2555204397  
-0.1794776865  
-0.06162496314  
0.1053990999  
0.3230697661  
0.5859025382  
0.881267729  
1.190183664  
1.489030351  
1.751993292  
1.953922782  
2.07324394  
2.094511897  
2.010282653  
1.822045774  
1.540110753  
1.182478896  
0.7728722831  
0.3381952622  
-0.09423300904  
-0.4993273499  
-0.8564615738  
-1.151037238  
-1.375266152  
-1.528151245  
-1.614740201  
-1.64481582  
-1.631223473  
-1.588074004  
-1.529027566  
-1.465847592  
-1.407351557  
-1.35883139  
-1.32195121  
-1.295079373  
-1.273966061  
-1.252650669  
-1.224470152  
-1.183038816  
-1.123095172  
-1.041122656  
-0.9357038455  
-0.8075842426  
-0.6594772017  
-0.4956525482  
-0.3213908391  
-0.1423880414  
0.0358003661  
0.2081962955  
0.3706615555  
0.5199606959  
0.6536337362  
0.7697218295  
0.8664225829  
0.9417622001  
0.9933766046  
1.018482454  
1.014070937  
0.9773272197  
0.9062241831  
0.8001910808  
0.6607357393  
0.4918881541  
0.3003528626  
0.09529504244  
-0.1122544122  
-0.3103248934  
-0.4871577964  
-0.6324307143  
-0.7383813578  
-0.8006666752  
-0.8188302255  
-0.7963015896  
-0.7399272823  
-0.6590950458  
-0.5645768724  
-0.4672448521  
-0.3768377727  
-0.3009262992  
-0.2442023778  
-0.2081558814  
-0.1911503049  
-0.1888575813  
-0.1949671041  
-0.2020611402  
-0.2025469979  
-0.1895385731  
-0.1576055512  
-0.1033346977  
-0.02567522241  
0.07393861244  
0.1916740675  
0.3215794686  
0.4560281846  
0.5863027421  
0.70328891  
0.7982420819  
0.8635762811  
0.8936173793  
0.8852423166  
0.8383275302  
0.75592991  
0.6441424617  
0.5116083796  
0.368703656  
0.2264723363  
0.0954203804  
-0.0156742329  
-0.1007727014  
-0.1572584267  
-0.1861752344  
-0.1919754494  
-0.1817905263  
-0.1643285501  
-0.1485457113  
-0.1422951542  
-0.1511470814  
-0.1775593524  
-0.2205166719  
-0.2756810227  
-0.3360222427  
-0.392813232  
-0.4368316213  
-0.4595787505  
-0.4543414815  
-0.4169534889  
-0.3461725275  
-0.2436581287  
-0.113595091  
0.03794066439  
0.2037501184  
0.3762847125  
0.5483126947  
0.7134025287  
0.8661900642  
1.002437597  
1.11893508  
1.2133093  
1.283826755  
1.329253568  
1.34882119  
1.342314206  
1.310252731  
1.254120274  
1.176558295  
1.081449738  
0.9738218297  
0.8595363376  
0.7447671151  
0.635329604  
0.5359496062  
0.4496058238  
0.3770717047  
0.316772225  
0.2650186022  
0.2166242574  
0.1658305687  
0.1074085284  
0.03775297202  
-0.04423159179  
-0.1366280431  
-0.2345153995  
-0.33052916  
-0.4159150461  
-0.4819338036  
-0.5213904366  
-0.530032417  
-0.5075649643  
-0.45808722  
-0.3898332927  
-0.3142224053  
-0.2443394285  
-0.1930556713  
-0.1710836138  
-0.1852712643  
-0.2374192337  
-0.3238306192  
-0.4356930767  
-0.5602589048  
-0.682666509  
-0.7881332109  
-0.864185864  
-0.9025748064  
-0.9005660807  
-0.8613960305  
-0.7938052342  
-0.7107107699  
-0.6272234772  
-0.5583118024  
-0.516480705  
-0.5098216318  
-0.5407448616  
-0.60557538  
-0.6950809334  
-0.7958351881  
-0.892203764  
-0.9686488336  
-1.012005356  
-1.013393277  
-0.9695064468  
-0.8831039584  
-0.7626591928  
-0.6212396017  
-0.4747932453  
-0.3400825642  
-0.2325487646  
-0.1643685784  
-0.1429424025  
-0.1699709392  
-0.241213031  
-0.3469281018  
-0.4729342908  
-0.6021570292  
-0.7164895874  
-0.7987711167  
-0.8346677722  
-0.8142696586  
-0.7332294716  
-0.5933197558  
-0.4023448783  
-0.1734026057  
0.07642628094  
0.3278278125  
0.5612437838  
0.7588765744  
0.9064675335  
0.9946441102  
1.019671788  
0.983540587  
0.8933894562  
0.7603748653  
0.5981583693  
0.4212286663  
0.2433021699  
0.07600362455  
-0.07200922645  
-0.1953986517  
-0.2919837964  
-0.3621422933  
-0.407926868  
-0.4320845691  
-0.4371665385  
-0.4248940921  
-0.3958926887  
-0.3498336591  
-0.2859397847  
-0.2037470532  
-0.1039512561  
0.01085719368  
0.1357571069  
0.2635128726  
0.3851201393  
0.4908693114  
0.5718188164  
0.6214747411  
0.6374147345  
0.622555366  
0.5857967172  
0.5418245408  
0.5099748395  
0.5121930459  
0.5702704061  
0.7026717591  
0.9213670093  
1.22912476  
1.617700668  
2.067275812  
2.547339339  
3.019036797  
3.438794897  
3.762844279  
3.952114165  
3.976893938  
3.820652266  
3.482489695  
2.977869901  
2.337486783  
1.604372616  
0.8295866548  
0.06701362724  
-0.6320914475  
-1.22414333  
-1.677264569  
-1.97387843  
-2.11162877  
-2.102616126  
-1.971157538  
-1.750433407  
-1.478490279  
-1.194084468  
-0.9328175025  
-0.7239235748  
-0.5879499911  
-0.5354628278  
-0.5667897159  
-0.6727305701  
-0.8361059473  
-1.033959187  
-1.240207343  
-1.428507089  
-1.575089829  
-1.661312118  
-1.675670603  
-1.615064369  
-1.485132238  
-1.299582133  
-1.078532937  
-0.8460114013  
-0.6268714614  
-0.4435019042  
-0.3127522493  
-0.2435085663  
-0.2353026302  
-0.2782054299  
-0.3540958561  
-0.4391908  
-0.5075247587  
-0.5349092313  
-0.5027904698  
-0.4014229645  
-0.2318339314  
-0.00623852563  
0.2532218379  
0.5172764819  
0.7534747183  
0.9307096286  
1.023639854  
1.016340113  
0.9046339693  
0.6967638527  
0.4123332338  
0.079705043  
-0.2677136588  
-0.5957303828  
-0.8735437008  
-1.077261197  
-1.192322913  
-1.214585943  
-1.150042856  
-1.013342978  
-0.8254432399  
-0.6107939884  
-0.3944837346  
-0.1997073963  
-0.04581883378  
0.05290438532  
0.08779271333  
0.0557214129  
-0.04135362428  
-0.197067101  
-0.4013430908  
-0.6410207057  
-0.9003832545  
-1.161662733  
-1.405644198  
-1.61251907  
-1.763105286  
-1.840473139  
-1.831900605  
-1.730957066  
-1.539391755  
-1.26843302  
-0.9391028245  
-0.5812136507  
-0.2308833722  
0.07337415606  
0.2956681798  
0.4082768053  
0.3969445134  
0.2650488951  
0.03578610702  
-0.2482878136  
-0.5287001412  
-0.7373923951  
-0.8053740955  
-0.6726767089  
-0.2982523743  
0.3316951221  
1.198381288  
2.249229392  
3.401356918  
4.549648857  
5.578590582  
6.376372826  
6.84934259  
6.934696419  
6.609506975  
5.894647043  
4.852934695  
3.581686329  
2.20071861  
0.8375242229  
-0.3882488549  
-1.378824257  
-2.068918711  
-2.431631614  
-2.479007108  
-2.257498315  
-1.839273212  
-1.310845662  
-0.7607900324  
-0.2682954792  
0.1059464812  
0.3254904762  
0.3800561759  
0.2837378718  
0.07013366118  
-0.2146065021  
-0.5196375631  
-0.7969983758  
-1.007909536  
-1.127076806  
-1.144655436  
-1.065882959  
-0.9087247485  
-0.7000895004  
-0.4713082548  
-0.2535691808  
-0.07392205435  
0.04769653749  
0.1001634041  
0.08153668903  
-0.001777386423  
-0.1367996092  
-0.3063439703  
-0.4916051216  
-0.6746139292  
-0.8402703643  
-0.9777541243  
-1.081208288  
-1.14968597  
-1.186451605  
-1.197778238  
-1.191448605  
-1.175180125  
-1.155196101  
-1.135136708  
-1.115460323  
-1.093412371  
-1.063567596  
-1.018865699  
-0.9519953568  
-0.8569124657  
-0.7302612103  
-0.5724653866  
-0.3882919388  
-0.1867714123  
0.01955289758  
0.2159711363  
0.3873661139  
0.5201440576  
0.6040474748  
0.6335801576  
0.6088226456  
0.5355138442  
0.4243796164  
0.2898108682  
0.1480854533  
0.01539067742  
-0.0940658967  
-0.1696059043  
-0.2050875519  
-0.1992672458  
-0.1555036944  
-0.08089423768  
0.01499266738  
0.1215791854  
0.2287055675  
0.3278248911  
0.4128113931  
0.4803013649  
0.529564108  
0.5619738994  
0.5802096826  
0.5873449979  
0.5859935489  
0.5776547289  
0.5623624328  
0.5386785608  
0.504016865  
0.4552280915  
0.3893373482  
0.3043067052  
0.1996975821  
0.07713038836  
-0.05953075618  
-0.204294359  
-0.3494450079  
-0.486184068  
-0.6054354503  
-0.6987203361  
-0.7590135925  
-0.7814886596  
-0.7640789726  
-0.7077923816  
-0.6167427889  
-0.4978807322  
-0.3604282634  
-0.2150655483  
-0.07292509287  
0.05550045741  
0.1614268942  
0.2386881991  
0.2843702447  
0.2990677099  
0.286706372  
0.2539397087  
0.2091821718  
0.1614117115  
0.1189106487  
0.0881370893  
0.07290429004  
0.07399687636  
0.08928490013  
0.1143111414  
0.1432448504  
0.1700361589  
0.1895647501  
0.1985854878  
0.1963071003  
0.1845145052  
0.167214072  
0.1498819219  
0.1384442518  
0.1381784332  
0.1527212744  
0.18335229  
0.2286703456  
0.2847062392  
0.3454549377  
0.4037230216  
0.4521656004  
0.4843366181  
0.49560491  
0.4837994873  
0.4495001346  
0.3959477103  
0.3286025494  
0.2544195627  
0.1809584289  
0.1154442371  
0.06390267017  
0.03047556322  
0.01698790299  
0.02280892629  
0.04501272621  
0.0788078223  
0.118177589  
0.1566607821  
0.1881728342  
0.2077796349  
0.2123325445  
0.2008884046  
0.1748562603  
0.137852964  
0.09526494686  
0.05356388632  
0.01944643917  
-0.001100938343  
-0.003701050866  
0.01367199361  
0.05020905223  
0.1021215535  
0.1628753511  
0.2238005432  
0.2750197562  
0.3065972495  
0.3097731174  
0.2781278095  
0.2085194213  
0.1016613819  
-0.03775219192  
-0.2014052589  
-0.3781817488  
-0.5553422642  
-0.7199235814  
-0.8601728491  
-0.9668358693  
-1.034135527  
-1.06031953  
-1.047717069  
-1.00231566  
-0.932923864  
-0.8500442578  
-0.7646036862  
-0.686698967  
-0.6244952701  
-0.5833946818  
-0.5655415725  
-0.5696959659  
-0.5914632344  
-0.623836723  
-0.6579884363  
-0.6842160899  
-0.6929611123  
-0.6757956648  
-0.6262861232  
-0.5406496775  
-0.4181342621  
-0.2610825262  
-0.07466690773  
0.1336703949  
0.3550055677  
0.5798431626  
0.7990211968  
1.004480395  
1.189781725  
1.350299834  
1.483076576  
1.586376712  
1.65906064  
1.699919798  
1.707148683  
1.678102292  
1.609443708  
1.497707072  
1.340207042  
1.136149511  
0.8877248123  
0.6009401413  
0.2859761905  
-0.04309012689  
-0.3692361601  
-0.6740466514  
-0.9396612049  
-1.150833517  
-1.29676895  
-1.372434568  
-1.379106778  
-1.324065338  
-1.219463902  
-1.080574854  
-0.9236944279  
-0.7640469277  
-0.6140304871  
-0.4820477943  
-0.3720763803  
-0.283970856  
