-0.4209626128  
-0.5043428584  
-0.5739324193  
-0.6128585891  
-0.608698058  
-0.5553693417  
-0.4541824614  
-0.3139064299  
-0.1498575585  
0.01788287705  
0.1668855315  
0.2751144554  
0.32366267  
0.2991370528  
0.1954120066  
0.01455718868  
-0.2331570415  
-0.5301554337  
-0.8532334561  
-1.175811221  
-1.470498265  
-1.711707765  
-1.878042264  
-1.954232514  
-1.932457398  
-1.812947288  
-1.603840881  
-1.320329642  
-0.9831924666  
-0.6168607433  
-0.2471904965  
0.100844607  
0.4053496357  
0.6493851236  
0.8223531593  
0.9207733198  
0.948361429  
0.9154168536  
0.8375643628  
0.7339877571  
0.6253376642  
0.5315264394  
0.4696539588  
0.4522955269  
0.486315993  
0.5723693044  
0.7050962405  
0.8740047351  
1.064905526  
1.261718069  
1.448409804  
1.61083111  
1.738217523  
1.824173577  
1.867038013  
1.869588571  
1.838163353  
1.781320715  
1.708243228  
1.627111657  
1.543678306  
1.460250448  
1.375236981  
1.28333162  
1.176336691  
1.04453077  
0.8784111469  
0.6705886011  
0.4175682296  
0.1211550766  
-0.2107354333  
-0.5640318183  
-0.9192917034  
-1.253277592  
-1.541186392  
-1.759281834  
-1.887629725  
-1.912590484  
-1.828745373  
-1.639994947  
-1.359647508  
-1.00946775  
-0.617759244  
-0.2167047838  
0.1607351665  
0.4839903826  
0.7277510229  
0.8742079534  
0.9144275697  
0.8487405127  
0.6861528696  
0.4429161948  
0.1404857274  
-0.19684285  
-0.5443076794  
-0.8787921708  
-1.180450428  
-1.433731624  
-1.627771553  
-1.756219164  
-1.816647351  
-1.809729013  
-1.738390455  
-1.607101754  
-1.421434997  
-1.187941137  
-0.9143041738  
-0.6096768312  
-0.2850318607  
0.04663459113  
0.3704277237  
0.6701014517  
0.9290834692  
1.131895198  
1.26583651  
1.322691664  
1.300188488  
1.20294374  
1.042667853  
0.837494882  
0.6104267259  
0.3870192274  
0.1925483526  
0.04901495032  
-0.02762477505  
-0.02960663659  
0.04143690676  
0.1744296409  
0.3499970587  
0.5427065906  
0.7241178992  
0.8662524982  
0.9450334393  
0.9432315523  
0.8525512683  
0.6745807555  
0.4205192978  
0.1097497873  
-0.2325166498  
-0.5781869611  
-0.8994171329  
-1.171530011  
-1.375374611  
-1.498874092  
-1.537653608  
-1.494756443  
-1.379578153  
-1.206245913  
-0.9917089958  
-0.753810761  
-0.5095873276  
-0.2739542337  
-0.05887848562  
0.1269659488  
0.278127284  
0.3920143727  
0.468370688  
0.5087355648  
0.5159784865  
0.493962523  
0.4473419471  
0.3814503559  
0.3022077299  
0.2159839756  
0.1293529414  
0.04872289552  
-0.0201267016  
-0.07255928961  
-0.1055260019  
-0.1178693797  
-0.11038124  
-0.08559621211  
-0.04730493051  
0.0001205365641  
0.05249150958  
0.1065107814  
0.1602836986  
0.2135281503  
0.2674226655  
0.3241074488  
0.3859255472  
0.4545339165  
0.5300598914  
0.6104757495  
0.6913268675  
0.7658982592  
0.8258272966  
0.8620924197  
0.866237776  
0.8316428853  
0.7546520818  
0.635366171  
0.4779722538  
0.2905410204  
0.08432061533  
-0.1273886457  
-0.3306192116  
-0.5121914235  
-0.6610387986  
-0.7692421514  
-0.8326476181  
-0.8510231277  
-0.8277600841  
-0.7692094401  
-0.6837685123  
-0.5808724732  
-0.4700250416  
-0.3599960234  
-0.2582503054  
-0.1706388796  
-0.1013354286  
-0.05293584844  
-0.02666186676  
-0.02256247793  
-0.03965646235  
-0.07597530844  
-0.1285113194  
-0.1931090678  
-0.2643755409  
-0.3356888429  
-0.3993843905  
-0.4471683073  
-0.4707731223  
-0.4628062727  
-0.4177141154  
-0.3327239665  
-0.2086166547  
-0.05018962991  
0.133713609  
0.3306602829  
0.5255716636  
0.7020731603  
0.8441014726  
0.937583629  
0.9719707881  
0.9414352398  
0.8455754217  
0.6895286202  
0.4834933941  
0.2417102169  
-0.0189702746  
-0.280754391  
-0.5266249611  
-0.7419161259  
-0.9155861972  
-1.041054685  
-1.116536953  
-1.144837594  
-1.132649785  
-1.089429757  
-1.0259833  
-0.9529136508  
-0.879124974  
-0.8105633992  
-0.749362166  
-0.6935319152  
-0.6372637882  
-0.5718398235  
-0.4870768489  
-0.3731287162  
-0.2224094235  
-0.03137287324  
0.1981404804  
0.4582330954  
0.7351138153  
1.010164498  
1.261819359  
1.468069191  
1.609263817  
1.670839137  
1.645562212  
1.534944694  
1.349563203  
1.10819798  
0.8358387143  
0.5608119995  
0.3113989771  
0.1124150426  
-0.01776288332  
-0.0692924141  
-0.04178415168  
0.05609129645  
0.2082327066  
0.3937186833  
0.5899857578  
0.7760733173  
0.9354415381  
1.057917664  
1.140490096  
1.186852534  
1.205805439  
1.208816078  
1.207173466  
1.209251665  
1.218356935  
1.231565101  
1.239763266  
1.228918209  
1.182388732  
1.083908992  
0.9207527313  
0.6865583095  
0.3833263305  
0.02222458025  
-0.3769630888  
-0.7877265314  
-1.179803623  
-1.522837384  
-1.790197801  
-1.962412445  
-2.029724824  
-1.993401286  
-1.865594013  
-1.667783836  
-1.428014462  
-1.177301031  
-0.9457191569  
-0.7587076552  
-0.6340815867  
-0.5801576436  
-0.5952053414  
-0.6682769686  
-0.7812511022  
-0.9117811167  
-1.036702395  
-1.135425275  
-1.192831762  
-1.201297678  
-1.161575499  
-1.082442277  
-0.9791870316  
-0.8711689595  
-0.7787890395  
-0.7203071491  
-0.7089362789  
-0.7506216894  
-0.8428090073  
-0.9743799285  
-1.126786827  
-1.276239319  
-1.396684074  
-1.463188386  
-1.455282332  
-1.359828353  
-1.173022494  
-0.9012576689  
-0.5607200238  
-0.1757521907  
0.2238092234  
0.6059873472  
0.940285953  
1.201110383  
1.370562951  
1.440278551  
1.412087096  
1.297460049  
1.11586106  
0.8922449582  
0.6540641295  
0.4281794615  
0.2380502352  
0.1015351498  
0.02949884115  
0.02532388998  
0.08527789818  
0.1995907829  
0.354021724  
0.5316741158  
0.7148134954  
0.8865140464  
1.032003608  
1.139665035  
1.201696699  
1.214482871  
1.178719387  
1.099344493  
0.9852739877  
0.8489255443  
0.7054847024  
0.5718771915  
0.4654265721  
0.4022448279  
0.3954519352  
0.4534071523  
0.5781753328  
0.7644756203  
0.9993441532  
1.262673046  
1.528688688  
1.768293632  
1.952072605  
2.053623361  
2.052812768  
1.938509312  
1.710403928  
1.37961507  
0.9679318332  
0.5057526869  
0.028913226  
-0.4251727061  
-0.8216045188  
-1.131763715  
-1.336282851  
-1.426834819  
-1.406524994  
-1.288872544  
-1.095558218  
-0.8532879757  
-0.5902358052  
-0.3325738324  
-0.1015711095  
0.08836093168  
0.2304500117  
0.3251329646  
0.3785635187  
0.4003635404  
0.4010340706  
0.3894915367  
0.3711422662  
0.3468153586  
0.3127337579  
0.2614890869  
0.1838457746  
0.07103272929  
-0.08289100637  
-0.2790268503  
-0.5123586946  
-0.7714587231  
-1.03926272  
-1.294840639  
-1.515902807  
-1.681692944  
-1.775827853  
-1.788673498  
-1.71890663  
-1.574020396  
-1.369711104  
-1.128201382  
-0.8757358396  
-0.6395612848  
-0.4447768652  
-0.3114497909  
-0.2523347626  
-0.2714749863  
-0.3638357126  
-0.5160026045  
-0.7078482552  
-0.9149758336  
-1.111634562  
-1.273775758  
-1.381879349  
-1.4232261  
-1.393331085  
-1.296373381  
-1.144567361  
-0.9565419045  
-0.7549398343  
-0.5635240437  
-0.4041759481  
-0.2941360966  
-0.243860961  
-0.2557391089  
-0.3238209672  
-0.4345768937  
-0.568555428  
-0.7027172808  
-0.8131360863  
-0.8777209186  
-0.8786448322  
-0.8042132058  
-0.649981146  
-0.419055641  
-0.1215994569  
0.2263433744  
0.6045208301  
0.9904295655  
1.361327606  
1.696109047  
1.976889791  
2.190190905  
2.327694337  
2.386553867  
2.369307284  
2.283445942  
2.140699507  
1.95609326  
1.746828381  
1.531037513  
1.326453507  
1.149067424  
1.011837342  
0.9235595106  
0.8879959959  
0.9033904147  
0.9624494889  
1.052866467  
1.158392641  
1.260397805  
1.339792601  
1.379126322  
1.364619836  
1.287885618  
1.147110546  
0.9475137192  
0.7009946215  
0.4249780486  
0.1405688356  
-0.1297718229  
-0.3647595118  
-0.5467143349  
-0.6635813771  
-0.7103042277  
-0.689370534  
-0.6104709282  
-0.4893169593  
-0.3457633513  
-0.2014680867  
-0.07737387865  
0.008692193004  
0.04401227478  
0.02234617747  
-0.05548346042  
-0.181840228  
-0.3433237701  
-0.5224733902  
-0.699928918  
-0.856783106  
-0.9768391687  
-1.048513805  
-1.06615179  
-1.03060319  
-0.9489891183  
-0.8337063547  
-0.7007763777  
-0.5677746226  
-0.4515910551  
-0.3663125631  
-0.3215104515  
-0.3211391724  
-0.3632010499  
-0.4401934336  
-0.540279662  
-0.6489997025  
-0.7512766179  
-0.8334227605  
-0.884877513  
-0.8994149275  
-0.8756884192  
-0.8170408895  
-0.730647921  
-0.6261510317  
-0.514006107  
-0.4038271067  
-0.3029784212  
-0.2156331909  
-0.1424415032  
-0.08083009924  
-0.02588242232  
0.02837085906  
0.08746918774  
0.1550979573  
0.2319720663  
0.3152171656  
0.3983698563  
0.472025795  
0.5250588968  
0.5462468542  
0.526084963  
0.458506825  
0.3422636516  
0.181730215  
-0.01301503991  
-0.2268938146  
-0.4412675817  
-0.6359578296  
-0.7916170126  
-0.8921355431  
-0.9267805095  
-0.8917654071  
-0.7910010143  
-0.6359200586  
-0.4443221459  
-0.2383738095  
-0.04197719865  
0.1221739249  
0.2354745146  
0.2858563997  
0.2694635989  
0.1913134204  
0.06482802527  
-0.08974488555  
-0.2478374525  
-0.3836994506  
-0.4737664392  
-0.4998176286  
-0.4515073375  
-0.3279021432  
-0.1378116036  
0.1011710792  
0.3648106804  
0.6252863273  
0.8547638338  
1.029013395  
1.130565185  
1.150978793  
1.091898614  
0.96473678  
0.7890282509  
0.5896794448  
0.3934853227  
0.2254274715  
0.1052493721  
0.04482056  
0.04664225741  
0.1037163101  
0.200771764  
0.3166776248  
0.4276666999  
0.5109187001  
0.5479644945  
0.5274395627  
0.4468057728  
0.312786799  
0.1405011694  
-0.04859115694  
-0.2296161031  
-0.3776790417  
-0.4712485127  
-0.4950811364  
-0.4423060387  
-0.3154052458  
-0.1260015806  
0.10650249  
0.3572235363  
0.5987213594  
0.8041729091  
0.9504009246  
1.020418452  
1.005202743  
0.9045573231  
0.72699329  
0.4887162228  
0.2118665896  
-0.07775763587  
-0.3532382756  
-0.5890735985  
-0.76346891  
-0.8601983235  
-0.869880516  
-0.7906017544  
-0.6278600905  
-0.3938710118  
-0.1063238263  
0.2132793922  
0.541545218  
0.8551873368  
1.132923163  
1.357096893  
1.514900624  
1.599085614  
1.608124992  
1.545861272  
1.420682171  
1.244370014  
1.030755787  
0.7943464743  
0.54907457  
0.3072889975  
0.07907061872  
-0.1281005875  
-0.3093448051  
-0.4621138253  
-0.5857472932  
-0.6809623338  
-0.7493691726  
-0.7931110073  
-0.8146516388  
-0.8167420432  
-0.802526057  
-0.7757286967  
-0.7408486986  
-0.7032727226  
-0.6692414777  
-0.6456116435  
-0.639404809  
-0.6571612635  
-0.7041591254  
-0.7835837747  
-0.8957643095  
-1.037590786  
-1.20221749  
-1.379146057  
-1.554734169  
-1.713133671  
-1.837613244  
-1.91216333  
-1.923241775  
-1.861468176  
-1.72307232  
-1.51089031  
-1.234741772  
-0.9110583057  
-0.5617310384  
-0.2122134266  
0.1109612722  
0.3830128658  
0.5837777468  
0.7002500962  
0.7284511142  
0.6743281813  
0.5534945734  
0.3897479737  
0.2124776445  
0.05322080413  
-0.0582410819  
-0.09774862967  
-0.05011332029  
0.08854637138  
0.309806079  
0.5934734077  
0.9096497774  
1.222092894  
1.49249525  
1.685141066  
1.77134573  
1.733109863  
1.565489273  
1.277376037  
0.8905613753  
0.437208442  
-0.04394212519  
-0.5121324222  
-0.9293192821  
-1.264452049  
-1.496757243  
-1.617623345  
-1.630876905  
-1.551474704  
-1.40284641  
-1.213298004  
-1.012006118  
-0.8251645629  
-0.6728019283  
-0.566662255  
-0.5093800665  
-0.494978629  
-0.5105373387  
-0.5387005609  
-0.5606199516  
-0.5588697739  
-0.5199182496  
-0.4358368743  
-0.3050580788  
-0.1321542297  
0.07324389924  
0.2981491592  
0.5282392064  
0.749869501  
0.9517859437  
1.126324292  
1.269984774  
1.383371652  
1.470588256  
1.538243012  
1.594261807  
1.646691393  
1.702664836  
1.767626326  
1.844873817  
1.935407879  
2.038032345  
2.149633621  
2.265551874  
2.379969812  
2.486275053  
2.577363679  
2.645890677  
2.684490874  
2.685988296  
2.643643335  
2.551444561  
2.404472562  
2.19932844  
1.934610628  
1.611402517  
1.233715546  
0.8088259046  
0.347414259  
-0.1365586504  
-0.6263069739  
-1.103044684  
-1.547167041  
-1.939721366  
-2.264056674  
-2.507465011  
-2.662630282  
-2.72866925  
-2.711582529  
-2.624007519  
-2.484226623  
-2.314489174  
-2.138815143  
-1.980500822  
-1.859625723  
-1.790859586  
-1.781842432  
-1.832347318  
-1.934328293  
-2.072859458  
-2.227842133  
-2.376262436  
-2.494736887  
-2.562023926  
-2.56122239  
-2.481424538  
-2.31866406  
-2.076107006  
-1.763517204  
-1.39611605  
-0.9930049912  
-0.5753589318  
-0.1645796061  
0.2194013075  
0.55954884  
0.8427752216  
1.060587622  
1.209320806  
1.289995453  
1.307847468  
1.271596122  
1.192534423  
1.08350525  
0.9578586603  
0.828453296  
0.7067841509  
0.6022950408  
0.5219168816  
0.4698526329  
0.4476150936  
0.4542730905  
0.4868592338  
0.5408693235  
0.6107867351  
0.6905519811  
0.7739492629  
0.8548689888  
0.9274656379  
0.9862249614  
1.025996289  
1.042037897  
1.03011343  
0.9866837607  
0.9091968526  
0.7964536188  
0.6490222965  
0.4696256738  
0.2634382846  
0.03821191935  
-0.1958298431  
-0.4263716407  
-0.6396774708  
-0.821519376  
-0.958299714  
-1.038271727  
-1.052720007  
-0.9969818488  
-0.8711622856  
-0.6804548878  
-0.435009808  
-0.1493352833  
0.1587079382  
0.4692264683  
0.7617933388  
1.016987651  
1.217826104  
1.350968144  
1.407617394  
1.384057557  
1.281826889  
1.107528421  
0.8723306036  
0.5911869233  
0.281842878  
-0.03633250432  
-0.3436033392  
-0.6211693461  
-0.8524111517  
-1.024011542  
-1.126850665  
-1.15660343  
-1.113970557  
-1.004514473  
-0.8381014211  
-0.6280073918  
-0.3897591261  
-0.1398453494  
0.1055781728  
0.3318559776  
0.5267616793  
0.6811128273  
0.7890385761  
0.8479280166  
0.8581080072  
0.8223456974  
0.7452783722  
0.6328616426  
0.4919230327  
0.3298483211  
0.154416694  
-0.02626035767  
-0.2037441291  
-0.3693093079  
-0.5140770633  
-0.6293111544  
-0.706893443  
-0.7399751729  
-0.7237349365  
-0.6561703512  
-0.5387894664  
-0.3770924645  
-0.1807049837  
0.03690496243  
0.2591886064  
0.4677295722  
0.6438330169  
0.7703526245  
0.8335654469  
0.8248702163  
0.7420977051  
0.5902231083  
0.381341393  
0.1338420162  
-0.1291987386  
-0.3822755148  
-0.6001446818  
-0.7606550408  
-0.8473839724  
-0.8517388073  
-0.7742372307  
-0.6247518017  
-0.4216327375  
-0.1897723055  
0.0422008109  
0.2452679478  
0.3934989076  
0.4672218516  
0.4554764004  
0.3574188334  
0.1824985583  
-0.05063193452  
-0.3163285783  
-0.585005825  
-0.8266366353  
-1.014262044  
-1.127076904  
-1.152723775  
-1.088537836  
-0.9416233446  
-0.7277912919  
-0.4695131455  
-0.1931767565  
0.07401518793  
0.3071326911  
0.486229697  
0.5983834986  
0.638853706  
0.6112502317  
0.5267402694  
0.4023955268  
0.2589241054  
0.1180433502  
-0.0001639198424  
-0.07961830878  
-0.1100451079  
-0.08801829442  
-0.01713615307  
0.09267190381  
0.2265981695  
0.3669667105  
0.4955418736  
0.5958203841  
0.6550280531  
0.6655748778  
0.6257801396  
0.5398272749  
0.416959437  
0.2700743471  
0.1139264283  
