-0.1891993975  
-0.1775251513  
-0.1622100271  
-0.1404264978  
-0.1105253932  
-0.07244779909  
-0.02789160581  
0.0197814657  
0.06590585217  
0.1050761924  
0.1318541205  
0.1415099523  
0.130706134  
0.09803882518  
0.04435842717  
-0.02715995856  
-0.1112167755  
-0.2008230844  
-0.2879406442  
-0.364238951  
-0.4219090277  
-0.4544383074  
-0.4572695494  
-0.4282815427  
-0.36803264  
-0.2797437885  
-0.1690167043  
-0.04331010547  
0.08877569968  
0.2183293431  
0.3369948218  
0.4377687318  
0.5156443394  
0.5680229267  
0.5948368309  
0.5983726318  
0.5828024845  
0.5534864063  
0.516129559  
0.4759157774  
0.4367328636  
0.4006108944  
0.3674717  
0.3352290645  
0.3002558652  
0.2581411562  
0.2046458145  
0.1366892707  
0.05321622195  
-0.04422814305  
-0.1513201733  
-0.2612451183  
-0.3654239167  
-0.45459598  
-0.5200885367  
-0.5550839253  
-0.5556762709  
-0.5215441017  
-0.4561185895  
-0.3662153798  
-0.2611819099  
-0.1516855776  
-0.04834122527  
0.03962118234  
0.1054371636  
0.145487128  
0.1594904435  
0.1502091652  
0.122752482  
0.08360709574  
0.03959448187  
-0.003078654925  
-0.03951066807  
-0.06644886342  
-0.08225791032  
-0.08655483614  
-0.07963184429  
-0.06180707932  
-0.03287300928  
0.008224572534  
0.06337690249  
0.134947188  
0.2251018187  
0.3349457011  
0.4636409991  
0.6076851187  
0.7605395979  
0.912733902  
1.052504876  
1.166934327  
1.243460864  
1.271552686  
1.244292919  
1.159610938  
1.020943544  
0.8371807435  
0.6218632833  
0.3917162816  
0.1647140475  
-0.04205886689  
-0.2144346265  
-0.3427978295  
-0.4230894876  
-0.4570567258  
-0.4517294557  
-0.4182308902  
-0.3701055555  
-0.3214298643  
-0.2849666429  
-0.2706058398  
-0.2842777683  
-0.3274382305  
-0.397143712  
-0.4866551002  
-0.5864542788  
-0.6855219995  
-0.7727138957  
-0.838090587  
-0.8740692656  
-0.8763072326  
-0.8442453791  
-0.7812768675  
-0.6945230695  
-0.5942290356  
-0.4928084078  
-0.4036071588  
-0.3394828036  
-0.3113236175  
-0.3266755063  
-0.3886340997  
-0.4951706379  
-0.6390151197  
-0.8081633838  
-0.9869957968  
-1.157909879  
-1.303282474  
-1.407511077  
-1.458863913  
-1.450879986  
-1.383102678  
-1.26104678  
-1.095388  
-0.9004999424  
-0.6925458129  
-0.4874117014  
-0.2987686495  
-0.136542068  
-0.005980029454  
0.09257387484  
0.1632080275  
0.213378991  
0.2524407707  
0.2900048063  
0.3343702198  
0.3912478438  
0.4629445432  
0.5481033238  
0.6420073933  
0.7373921039  
0.8256192087  
0.8980565845  
0.9474434634  
0.9690698125  
0.9615932547  
0.9273871179  
0.8723740134  
0.8053539558  
0.736923103  
0.6781167633  
0.6389560224  
0.6270911778  
0.6467216335  
0.6979483464  
0.776645935  
0.8748860562  
0.9818631467  
1.085216762  
1.172560202  
1.233036291  
1.258673229  
1.245371771  
1.193377907  
1.107190418  
0.9949083171  
0.8671199799  
0.7354889818  
0.6112308525  
0.5036985547  
0.4192648645  
0.3606506486  
0.3267798564  
0.3131654043  
0.3127582088  
0.3171112816  
0.3176904385  
0.3071251669  
0.280219901  
0.2345854799  
0.1708155139  
0.09220364809  
0.004074873757  
-0.08714142927  
-0.1749296268  
-0.2536341528  
-0.3191807389  
-0.3694845314  
-0.4045013262  
-0.4259575313  
-0.4368264414  
-0.4406801388  
-0.4410296013  
-0.4407752913  
-0.4418440029  
-0.4450600504  
-0.4502396969  
-0.4564704522  
-0.4624988593  
-0.4671428073  
-0.4696449345  
-0.4699048663  
-0.4685469204  
-0.4668222992  
-0.466371824  
-0.4688972841  
-0.4758123814  
-0.487933216  
-0.5052749707  
-0.5269834051  
-0.551417969  
-0.5763694247  
-0.5993753905  
-0.6180754128  
-0.6305559657  
-0.6356216242  
-0.6329562563  
-0.6231566639  
-0.6076273438  
-0.5883713932  
-0.5677083501  
-0.547964118  
-0.5311883578  
-0.5189309686  
-0.5121078095  
-0.5109662207  
-0.5151277365  
-0.5236980804  
-0.5353976073  
-0.5486921836  
-0.5618910259  
-0.573218248  
-0.5808534209  
-0.5829709126  
-0.5778084163  
-0.563778468  
-0.5396402377  
-0.504708248  
-0.459069426  
-0.4037477636  
-0.3407500313  
-0.2729541121  
-0.2038094616  
-0.136873557  
-0.07524165304  
-0.02098642944  
0.02528750895  
0.06465200469  
0.09973959928  
0.1342970593  
0.1724399821  
0.2177259305  
0.2722126631  
0.3356770634  
0.405175773  
0.4750554296  
0.5374603365  
0.5832999217  
0.6035383754  
0.5906175161  
0.5397842608  
0.4501014774  
0.3249623886  
0.1720152204  
0.00248228361  
-0.1700366441  
-0.33109872  
-0.4670819546  
-0.5667302315  
-0.6223680496  
-0.6306290057  
-0.5926144694  
-0.5134957409  
-0.4016497187  
-0.2674819679  
-0.1221256928  
0.02378830672  
0.1611402761  
0.2829802504  
0.3848122812  
0.4645028173  
0.5219152831  
0.5583659635  
0.5760443446  
0.5775105624  
0.5653571646  
0.5420762996  
0.5101217445  
0.4721046379  
0.4310448996  
0.3905667658  
0.3549593681  
0.3290336592  
0.3177554913  
0.3256943221  
0.3563459784  
0.4114583209  
0.4904692192  
0.5901843723  
0.704789594  
0.82624085  
0.9450209751  
1.051194206  
1.135630571  
1.191234113  
1.213999038  
1.203715713  
1.164204905  
1.10301208  
1.030562566  
0.9588805319  
0.9000202859  
0.8644307845  
0.8594804094  
0.8883519861  
0.9494764712  
1.036588523  
1.139397809  
1.244781421  
1.338333316  
1.406054943  
1.435965448  
1.419430312  
1.352051206  
1.234027803  
1.069986771  
0.8683140144  
0.6401160246  
0.3979427291  
0.1544439176  
-0.07888589012  
-0.2927407162  
-0.4807044093  
-0.6395774456  
-0.7693103417  
-0.8725871563  
-0.9541359037  
-1.019867539  
-1.075958353  
-1.127995603  
-1.180277841  
-1.235346158  
-1.293774131  
-1.354226313  
-1.413736873  
-1.468165321  
-1.512744637  
-1.542663932  
-1.553616531  
-1.542273526  
-1.506663716  
-1.446455325  
-1.36312934  
-1.260070553  
-1.142556876  
-1.017633722  
-0.893851886  
-0.7808316777  
-0.6886246087  
-0.6268732531  
-0.6038004637  
-0.6251093959  
-0.692919934  
-0.8049120694  
-0.9538663335  
-1.127764785  
-1.310586908  
-1.483829094  
-1.628677459  
-1.728624534  
-1.772212381  
-1.755490272  
-1.683737401  
-1.572047896  
-1.44446214  
-1.331543334  
-1.266494997  
-1.280191537  
-1.395735164  
-1.623297974  
-1.956121836  
-2.368451239  
-2.816031698  
-3.239427257  
-3.570061037  
-3.738396352  
-3.683290658  
-3.361256526  
-2.754235239  
-1.874600793  
-0.766399891  
0.4976277071  
1.823119414  
3.104441806  
4.236986662  
5.12971073  
5.716110905  
5.962051915  
5.869291498  
5.474240429  
4.842200329  
4.058010354  
3.214568912  
2.400947232  
1.69181011  
1.139579995  
0.7702754027  
0.5833435086  
0.5551849578  
0.6455272176  
0.8054374582  
0.9856165407  
1.143702492  
1.249567259  
1.288017565  
1.258769369  
1.174017155  
1.054270427  
0.9233414989  
0.8034129252  
0.7110111735  
0.6544578504  
0.6330935632  
0.638214404  
0.6553950278  
0.6676743136  
0.6589641293  
0.6170854599  
0.5359310903  
0.416456569  
0.2664069326  
0.09891477084  
-0.06972928792  
-0.2227169597  
-0.3453214216  
-0.4270380131  
-0.4629708208  
-0.4542793111  
-0.4076914398  
-0.3342159635  
-0.2473028347  
-0.1607677795  
-0.08680389659  
-0.03437262292  
-0.008160524128  
-0.008217870295  
-0.03026632266  
-0.0665713525  
-0.1072185017  
-0.1415801887  
-0.1597791704  
-0.1539592904  
-0.1192488687  
-0.05433435325  
0.0383697823  
0.1529267243  
0.2804015538  
0.4096312435  
0.528168913  
0.6233293405  
0.6832700723  
0.6980482453  
0.6605859897  
0.5674699448  
0.4195137561  
0.2219953142  
-0.01548768364  
-0.279585003  
-0.5541838306  
-0.8217490613  
-1.064914501  
-1.268146779  
-1.419288857  
-1.510786692  
-1.540416952  
-1.511413263  
-1.431947946  
-1.314028189  
-1.171958825  
-1.020581913  
-0.8735372682  
-0.7417904946  
-0.6326289448  
-0.5492466673  
-0.4909435873  
-0.4538705753  
-0.4321680112  
-0.4192807456  
-0.4092248596  
-0.3975985823  
-0.3821853303  
-0.3630724453  
-0.3423191169  
-0.3232585649  
-0.3096054653  
-0.3045545502  
-0.3100435382  
-0.3263180665  
-0.3518663831  
-0.3837067092  
-0.4179518096  
-0.4505231976  
-0.4778542846  
-0.4974517949  
-0.5082186624  
-0.5104899101  
-0.5058173619  
-0.4965761472  
-0.4855001163  
-0.4752636407  
-0.4682007504  
-0.4662032693  
-0.4707890014  
-0.483289153  
-0.5050431804  
-0.5375199834  
-0.5822640233  
-0.640633029  
-0.7133404899  
-0.7998734304  
-0.8979147776  
-1.002906181  
-1.107890377  
-1.203740571  
-1.279802653  
-1.324912391  
-1.328676566  
-1.282834008  
-1.18249445  
-1.027047014  
-0.8205842101  
-0.5717571758  
-0.293052385  
0.0004072518938  
0.2923813697  
0.5671332823  
0.8109532625  
1.013370702  
1.167944258  
1.272549255  
1.329180314  
1.343343707  
1.323156101  
1.278284772  
1.218877031  
1.154577603  
1.09371941  
1.042740424  
1.005819705  
0.9847434115  
0.9789612631  
0.9858268106  
1.000983012  
1.018887757  
1.033451893  
1.038761413  
1.029836898  
1.003362294  
0.9583000442  
0.8962992975  
0.8218011116  
0.7417796599  
0.6650938252  
0.6014740228  
0.5602497803  
0.5489584594  
0.5720401038  
0.6298174593  
0.7179560446  
0.8275406306  
0.9458158239  
1.057549073  
1.146864937  
1.19932013  
1.203927495  
1.154829673  
1.052358774  
0.903287787  
0.7202024689  
0.5200438254  
0.321990616  
0.1449777225  
0.005175221367  
-0.08619409629  
-0.1243832181  
-0.1117678319  
-0.05749030329  
0.02385075924  
0.1142996451  
0.1951229054  
0.2495045677  
0.2649563199  
0.2350898082  
0.1604855212  
0.04853221095  
-0.08774355083  
-0.2316736902  
-0.3654763814  
-0.472934429  
-0.5418238877  
-0.5657337716  
-0.5450177442  
-0.4867324315  
-0.4035864642  
-0.312045793  
-0.2298770799  
-0.1734733765  
-0.1553429169  
-0.1821162593  
-0.2533528046  
-0.3613280878  
-0.4918507875  
-0.626020932  
-0.7427172317  
-0.8214982311  
-0.8455361395  
-0.8041884069  
-0.6948406082  
-0.5237393654  
-0.3056533014  
-0.06235946716  
0.1799016209  
0.3936917265  
0.553949694  
0.6413850596  
0.6452120837  
0.5647955404  
0.4099432769  
0.1997386363  
-0.0399608731  
-0.2800346065  
-0.4921298681  
-0.6526243962  
-0.7459277219  
-0.7666216885  
-0.7201270118  
-0.6217864061  
-0.4945358618  
-0.3655385472  
-0.2623015128  
-0.2088760138  
-0.2226805001  
-0.312380298  
-0.4770497972  
-0.7066486028  
-0.9836359299  
-1.285402114  
-1.587115332  
-1.864561442  
-2.0966202  
-2.267112944  
-2.365887883  
-2.389111895  
-2.338877168  
-2.222253082  
-2.049996081  
-1.835098031  
-1.591356778  
-1.332107241  
-1.069204853  
-0.8123341033  
-0.5686510763  
-0.3427508223  
-0.1369271082  
0.04836204912  
0.2138881251  
0.3610236104  
0.4911809318  
0.6054056835  
0.7041804591  
0.7874582003  
0.8548775205  
0.9061071057  
0.9411904645  
0.9608054912  
0.9663335105  
0.9597082268  
0.9430513586  
0.918181064  
0.8861081614  
0.8466622488  
0.7983832756  
0.7387419461  
0.6647116066  
0.5736034764  
0.4640247625  
0.3367690394  
0.1954263175  
0.04656261821  
-0.1006435954  
-0.2352899549  
-0.3460610481  
-0.4227669218  
-0.4578430333  
-0.4475569982  
-0.3926915026  
-0.2985619356  
-0.1743478168  
-0.0318286582  
0.1162627859  
0.2579967346  
0.3838162846  
0.4876448435  
0.5673708389  
0.6246369626  
0.6640056826  
0.6916929709  
0.7141257856  
0.736611452  
0.7623733709  
0.7921197045  
0.8242035884  
0.855301312  
0.8814426664  
0.8991536147  
0.9064586201  
0.9035322064  
0.8928637676  
0.8789104986  
0.8673115984  
0.8638335281  
0.8732527874  
0.8984000155  
0.9395444936  
0.9942237168  
1.057535665  
1.122821767  
1.18259991  
1.229572099  
1.257533242  
1.26204455  
1.240799643  
1.193667405  
1.122475226  
1.030615636  
0.9225906704  
0.8035719603  
0.6790426364  
0.5545250172  
0.4353640042  
0.326519551  
0.232311261  
0.156079926  
0.09977624696  
0.0635259417  
0.04526275865  
0.04053692902  
0.04261415293  
0.04293666132  
0.03196787258  
0.0003695991381  
-0.05962150677  
-0.1527951666  
-0.2797882512  
-0.4363395367  
-0.6131738036  
-0.7966243237  
-0.9699971397  
-1.115560721  
-1.216932088  
-1.261525019  
-1.242705655  
-1.161288503  
-1.026091733  
-0.8533886439  
-0.6652688538  
-0.4870751847  
-0.3442583923  
-0.2590849823  
-0.2476764584  
-0.3178237859  
-0.4678917199  
-0.6869844542  
-0.956324081  
-1.251620853  
-1.546065489  
-1.813481018  
-2.031175296  
-2.182106956  
-2.256099556  
-2.250026849  
-2.167053163  
-2.015177186  
-1.80541661  
-1.550010093  
-1.26096966  
-0.9492062982  
-0.6243205708  
-0.2949741305  
0.03036237037  
0.3425877332  
0.6313889851  
0.8851672587  
1.091613003  
1.238923996  
1.317475265  
1.321649316  
1.251420154  
1.113321108  
0.9204880141  
0.6916373847  
0.4490323464  
0.2156734422  
0.01214683213  
-0.1463744276  
-0.2524456323  
-0.3075575889  
-0.3219591337  
-0.3130657365  
-0.3026358478  
-0.3131295616  
-0.3638023183  
-0.4671446439  
-0.6262441591  
-0.8335103003  
-1.070999316  
-1.312328187  
-1.52594172  
-1.679268397  
-1.743193841  
-1.696207284  
-1.527643389  
-1.239559127  
-0.8469875864  
-0.3765314101  
0.1364953397  
0.6519990382  
1.129567858  
1.532883429  
1.833515277  
2.013649394  
2.067449468  
2.000960849  
1.830654027  
1.580890609  
1.280699611  
0.9603217853  
0.6479674737  
0.3671523675  
0.134878068  
-0.03923705453  
-0.1528869953  
-0.2102134726  
-0.2203611925  
-0.1957145616  
-0.1500604041  
-0.09689999945  
-0.0480526766  
-0.01263854276  
0.00353630644  
-0.001781030078  
-0.02738269246  
-0.06896279085  
-0.1197000992  
-0.1710150679  
-0.2134606909  
-0.2377041545  
-0.235540675  
-0.2008683369  
-0.1305333424  
-0.0249410116  
0.1116559626  
0.271269592  
0.4427240698  
0.6126164561  
0.7666274986  
0.8910440444  
0.9743339071  
1.008577297  
0.9905688348  
0.9224284684  
0.8116072881  
0.6702540684  
0.5139800982  
0.3601464334  
0.2258598122  
0.1259313974  
0.0710506199  
0.06642353064  
0.1110754663  
0.1979296381  
0.3146699599  
0.4452984189  
0.5721860647  
0.6783410878  
0.7495942095  
0.7763970611  
0.7549863316  
0.6877637177  
0.5828438153  
0.4528548887  
0.3131633261  
0.1797908349  
0.06730485489  
-0.01302312119  
-0.05456363998  
-0.05601351137  
-0.02136427176  
0.04081670372  
0.1186649889  
0.198666125  
0.2674531679  
0.313511366  
0.328591367  
0.3086621623  
0.2543066799  
0.1705307864  
0.06601822703  
-0.04805671079  
-0.1595309807  
-0.2568770747  
-0.3307733347  
-0.3754312385  
-0.3895190912  
-0.376558517  
-0.3447175808  
-0.3059817515  
-0.2747642134  
-0.2660699585  
-0.2934124823  
-0.3667222076  
-0.4905281551  
-0.6626851936  
-0.8738781566  
-1.108072954  
-1.343935027  
-1.557136887  
-1.723299912  
-1.821219153  
-1.83592666  
-1.761137144  
-1.600675484  
-1.36860984  
-1.087990354  
-0.7883062682  
-0.5019633603  
-0.260260368  
-0.08940883742  
-0.007166082913  
-0.02055516871  
-0.1249856405  
-0.3048814336  
-0.5357029591  
-0.7870423784  
-1.026341125  
-1.222696385  
-1.350253905  
-1.390762538  
-1.335038836  
-1.183241084  
-0.9440467752  
-0.6329798664  
-0.2701975226  
0.1218849996  
0.5208112342  
0.9058804782  
1.259387094  
1.567268857  
1.819247551  
2.00860348  
2.131766211  
2.187892857  
2.178542987  
2.107509379  
1.980774774  
1.806504457  
1.5949663  
1.358255517  
1.109745732  
0.8632692604  
