0.06423674753  
0.08180994521  
0.09155199174  
0.09019356732  
0.07645083005  
0.05132939699  
0.01800326121  
-0.01873282236  
-0.05334398197  
-0.08061811158  
-0.09672145145  
-0.100039705  
-0.09165655229  
-0.07534324  
-0.0570624087  
-0.0440239046  
-0.04346261563  
-0.06130406438  
-0.1009725153  
-0.1625140019  
-0.2422225822  
-0.3328369664  
-0.4243119053  
-0.5050715778  
-0.5635629373  
-0.5898946798  
-0.5773120788  
-0.5232795901  
-0.4300036304  
-0.3042974523  
-0.1567965633  
-0.0006284332233  
0.1502772191  
0.2829929764  
0.3872473959  
0.4566904931  
0.4895723289  
0.4887556391  
0.461063474  
0.4160694454  
0.3645325292  
0.3167176219  
0.2808619608  
0.262009403  
0.2613799636  
0.2763441419  
0.3009825509  
0.3271166694  
0.3456400566  
0.3479395559  
0.3271947596  
0.2793787873  
0.2038404799  
0.1034061501  
-0.01597583565  
-0.1459762579  
-0.2768877162  
-0.3987440783  
-0.5024119  
-0.5805264141  
-0.6281689063  
-0.643238383  
-0.6264897981  
-0.581275493  
-0.5130301234  
-0.4285873181  
-0.3354091892  
-0.240821402  
-0.1513392391  
-0.07214575703  
-0.006775474764  
0.0429818016  
0.07696439081  
0.09633826072  
0.1031735612  
0.09996290825  
0.08915985382  
0.07280172473  
0.05227366553  
0.02823922735  
0.0007341661223  
-0.03059932933  
-0.06619919192  
-0.1062616016  
-0.1504779756  
-0.1979002386  
-0.2469707173  
-0.2957201388  
-0.3421161492  
-0.3844854185  
-0.4219333279  
-0.4546654644  
-0.4841185019  
-0.5128470682  
-0.5441348982  
-0.5813746675  
-0.6272752961  
-0.6830279324  
-0.7475673274  
-0.8170786968  
-0.8848672218  
-0.9416811321  
-0.976490621  
-0.9776832296  
-0.9345328165  
-0.8387752515  
-0.6860576928  
-0.4770570693  
-0.2180628986  
0.07909040849  
0.3977938393  
0.718086049  
1.018567047  
1.278592811  
1.480466428  
1.611352559  
1.664652262  
1.640668073  
1.546466994  
1.394969391  
1.203397529  
0.9912926986  
0.7783769096  
0.5825270011  
0.4181103451  
0.294859197  
0.2173701276  
0.1852290849  
0.1936662551  
0.2345971049  
0.2978620224  
0.3724811249  
0.4477744147  
0.514246801  
0.5641817139  
0.5919682184  
0.5941926626  
0.569580824  
0.5188571675  
0.4445755523  
0.3509562779  
0.2437178253  
0.1298773798  
0.01748011701  
-0.08479412421  
-0.168167493  
-0.2244413396  
-0.2467727898  
-0.2304771138  
-0.1737502461  
-0.07819386016  
0.05095904814  
0.2049921965  
0.3722753137  
0.5392074053  
0.6914595095  
0.8153778203  
0.8993769276  
0.9351425007  
0.9184839944  
0.8497242479  
0.7335691893  
0.5784820997  
0.3956467886  
0.1976708116  
-0.002803943411  
-0.1943986896  
-0.3680412296  
-0.5176449363  
-0.6403667963  
-0.7364415983  
-0.8086611162  
-0.8615906066  
-0.9006617318  
-0.9312635951  
-0.9579537812  
-0.9838864773  
-1.010503899  
-1.037509139  
-1.063094365  
-1.084373236  
-1.097932583  
-1.10043159  
-1.089148386  
-1.062416933  
-1.019903294  
-0.9626880086  
-0.8931684963  
-0.8148013498  
-0.7317280113  
-0.6483400468  
-0.568845494  
-0.4968813509  
-0.4352213712  
-0.3855991558  
-0.3486547421  
-0.324000545  
-0.3103752205  
-0.3058569859  
-0.3081028482  
-0.3145725013  
-0.3227132555  
-0.3300927571  
-0.3344689023  
-0.3338129325  
-0.3262978656  
-0.3102830119  
-0.2843102507  
-0.24714027  
-0.1978305061  
-0.1358593198  
-0.06127329211  
0.02515885446  
0.1218196948  
0.2261832272  
0.3348359811  
0.4436148275  
0.5478525239  
0.6427264867  
0.7236886405  
0.7869200743  
0.8297740109  
0.8511367895  
0.8516484868  
0.8337459404  
0.8014827473  
0.7601348626  
0.7156121151  
0.6737388682  
0.6394782158  
0.616224215  
0.605250474  
0.605426548  
0.6132707052  
0.6233485051  
0.629008291  
0.6233573238  
0.600345999  
0.5558128373  
0.4883037496  
0.3995400684  
0.2944209218  
0.1805388779  
0.06725104962  
-0.03557076143  
-0.1189318429  
-0.1760356419  
-0.2033243495  
-0.2010655342  
-0.1733803741  
-0.1276889741  
-0.07365489766  
-0.02177801298  
0.01814716297  
0.03846698202  
0.0347772649  
0.006532286028  
-0.04293983193  
-0.1070012736  
-0.1767603037  
-0.2424315266  
-0.2947817288  
-0.3264352204  
-0.3328305579  
-0.3126992179  
-0.2680237989  
-0.2035040362  
-0.1256662312  
-0.04179440771  
0.04112735655  
0.11725324  
0.1823853409  
0.2340639617  
0.2712829587  
0.2939077865  
0.3019709539  
0.295015535  
0.2716760785  
0.2296138568  
0.1658758913  
0.07764207399  
-0.03675077326  
-0.1767015367  
-0.3383697325  
-0.5140613929  
-0.6921593724  
-0.8577086897  
-0.9936499999  
-1.082611046  
-1.10903803  
-1.061398222  
-0.9341243422  
-0.7290102301  
-0.4558043117  
-0.1318631499  
0.2191631423  
0.5694887089  
0.8899578048  
1.153093511  
1.336037661  
1.423027958  
1.407081421  
1.29068049  
1.085389514  
0.8104448915  
0.4905420499  
0.1530899846  
-0.174692639  
-0.4684907435  
-0.7090859584  
-0.8838089094  
-0.9871205227  
-1.020329351  
-0.9905589488  
-0.9091684713  
-0.789885671  
-0.6469178211  
-0.4932965331  
-0.3396329374  
-0.1934124215  
-0.0588432691  
0.06277293824  
0.1722858151  
0.2716968312  
0.3631043666  
0.447770107  
0.5254468341  
0.5940673505  
0.6498378357  
0.6877207097  
0.7022145584  
0.6883229627  
0.6425477478  
0.5637526024  
0.4537446129  
0.3174790538  
0.1628211675  
-0.000110053468  
-0.1599482595  
-0.3053069613  
-0.4260523684  
-0.514452189  
-0.566029348  
-0.5799997774  
-0.5592300211  
-0.5097149873  
-0.4396666886  
-0.358337247  
-0.2747669258  
-0.1966409799  
-0.1294242959  
-0.07590337313  
-0.03618868893  
-0.008154280179  
0.01176822311  
0.02760296591  
0.04282711968  
0.05953287394  
0.07791289452  
0.09615747499  
0.110790302  
0.1173818548  
0.1115217967  
0.08987666086  
0.05114307758  
-0.003282654016  
-0.06904977934  
-0.1390904372  
-0.2043420734  
-0.2548696679  
-0.2812441377  
-0.2759778426  
-0.2348111754  
-0.1576435359  
-0.04895653471  
0.08236428813  
0.2238200021  
0.3606221924  
0.4773943547  
0.5600436792  
0.5975471895  
0.5834166795  
0.5166299643  
0.4018948427  
0.2491924652  
0.07264652595  
-0.111137007  
-0.2850433022  
-0.4334814307  
-0.5441970907  
-0.6096405457  
-0.6277047675  
-0.6017519187  
-0.539948799  
-0.4540071894  
-0.3575351668  
-0.2642225662  
-0.1861211885  
-0.1322442471  
-0.1076647135  
-0.1131922171  
-0.1456513197  
-0.1986583762  
-0.2637587692  
-0.3317247123  
-0.3938004894  
-0.4427282888  
-0.4734134347  
-0.4831699868  
-0.4715713087  
-0.4399730593  
-0.3908541667  
-0.3271197298  
-0.2515121975  
-0.1662377424  
-0.0728683477  
0.02750164667  
0.1338902294  
0.2449803449  
0.358702938  
0.4719763349  
0.5806810089  
0.6799096435  
0.7644711326  
0.8295625314  
0.8715033304  
0.8883831811  
0.8805050785  
0.8505206338  
0.8032128746  
0.7449450128  
0.6828496714  
0.6238821822  
0.5738914702  
0.536850089  
0.5143807759  
0.5056399984  
0.5075741334  
0.5155012974  
0.523901203  
0.5272775538  
0.5209406492  
0.5015828921  
0.467560048  
0.4188525846  
0.356746615  
0.2833167039  
0.2008470762  
0.1113042683  
0.01600012308  
-0.08450855169  
-0.1902456864  
-0.3014203195  
-0.4178979034  
-0.5386552849  
-0.6613618398  
-0.7821812426  
-0.8958806676  
-0.9962504441  
-1.07679718  
-1.131602866  
-1.156215686  
-1.148413821  
-1.108694521  
-1.040385835  
-0.9493243137  
-0.8431248803  
-0.7301372719  
-0.61824394  
-0.5136939847  
-0.4201728331  
-0.3382829271  
-0.2655410049  
-0.1969177306  
-0.1258564786  
-0.04560152689  
0.04936815096  
0.1620584837  
0.2920506552  
0.4351390171  
0.5835919129  
0.7270105073  
0.8536632052  
0.9520723735  
1.012620548  
1.028910222  
0.9986734888  
0.9240936577  
0.811510971  
0.6705709035  
0.5129696526  
0.3509974822  
0.1961184696  
0.05778151454  
-0.05736892451  
-0.1458116898  
-0.2069859553  
-0.2427368581  
-0.256501154  
-0.2524068936  
-0.2344549638  
-0.205925861  
-0.169096224  
-0.1252922187  
-0.07523067186  
-0.01955115095  
0.040597689  
0.1030623089  
0.1644049977  
0.2199176863  
0.2639669494  
0.2906159558  
0.2944493562  
0.2714450225  
0.2197601713  
0.1402817722  
0.03682910648  
-0.08403827351  
-0.2136154589  
-0.3419673197  
-0.4590609014  
-0.5559538928  
-0.6258680103  
-0.6650077447  
-0.6729996112  
-0.6528781992  
-0.6106301094  
-0.5543353627  
-0.4930336674  
-0.4354545969  
-0.3887944328  
-0.3576993088  
-0.3436019291  
-0.3445050345  
-0.3552463206  
-0.3682207987  
-0.3744597699  
-0.3649238848  
-0.3318384089  
-0.2698780922  
-0.1770460026  
-0.05511437057  
0.09043044865  
0.2509205  
0.4154600205  
0.5721380776  
0.7093397543  
0.8169849245  
0.8875020005  
0.9164423286  
0.902664817  
0.8481008349  
0.7571751582  
0.6360101185  
0.4915517834  
0.3307800323  
0.1601097483  
-0.01493645738  
-0.1897666464  
-0.360523292  
-0.5237214755  
-0.6758567502  
-0.8130790303  
-0.9310465231  
-1.025007263  
-1.090127834  
-1.122018011  
-1.117386098  
-1.074698659  
-0.9947436364  
-0.880970251  
-0.7395416743  
-0.5790460721  
-0.4098789159  
-0.2433340325  
-0.09050858971  
0.03887268794  
0.1375749593  
0.2017749586  
0.2316811599  
0.2317515161  
0.2104755944  
0.1797064545  
0.1535989466  
0.147238809  
0.1750702656  
0.2492937188  
0.3783622122  
0.5657442156  
0.8090806449  
1.099845689  
1.423577169  
1.760696646  
2.087879766  
2.379889127  
2.611726785  
2.760913276  
2.809677366  
2.746838352  
2.569161357  
2.282029909  
1.899317544  
1.442447318  
0.9386897879  
0.4188547572  
-0.08540301623  
-0.5443965  
-0.9330334834  
-1.232990859  
-1.434184515  
-1.535394794  
-1.543969079  
-1.474655628  
-1.347706144  
-1.186475173  
-1.014800336  
-0.8544631903  
-0.7230205235  
-0.6322446235  
-0.587324781  
-0.586897105  
-0.6238549226  
-0.6867992656  
-0.7619162792  
-0.8350092363  
-0.8934233766  
-0.9276047166  
-0.9321195226  
-0.9060311001  
-0.8526344544  
-0.7786433363  
-0.6929886528  
-0.6054483443  
-0.5253049346  
-0.4602423716  
-0.4155892073  
-0.3939878875  
-0.3954528512  
-0.4177510501  
-0.4569725145  
-0.5081556982  
-0.565843142  
-0.6244864719  
-0.678661282  
-0.7231180551  
-0.752739157  
-0.762486097  
-0.7474408087  
-0.7030069697  
-0.6253079483  
-0.5117506017  
-0.3616839532  
-0.1770396141  
0.03719605759  
0.2727924274  
0.5184800291  
0.7605787459  
0.9840326381  
1.173748825  
1.316090762  
1.400338324  
1.419919371  
1.373252037  
1.264072909  
1.10120424  
0.8977841753  
0.6700484137  
0.4358065416  
0.2127837464  
0.01700990723  
-0.1385839379  
-0.245223921  
-0.2989289486  
-0.3006683481  
-0.2560566035  
-0.1746246309  
-0.06875543957  
0.04762039295  
0.1604366975  
0.2568898061  
0.3266808975  
0.3629936676  
0.3631053732  
0.328567176  
0.2649314863  
0.1810451566  
0.08798721876  
-0.002246077337  
-0.07815460081  
-0.1300981496  
-0.1514409116  
-0.1393511656  
-0.09515182706  
-0.0241759157  
0.06486440998  
0.1609240325  
0.2519739915  
0.3264893424  
0.3748947128  
0.3907905292  
0.3717828723  
0.3198078999  
0.2408743128  
0.1442479156  
0.0411506457  
-0.05684003496  
-0.1395018029  
-0.1995143459  
-0.2336125253  
-0.243145747  
-0.2339187178  
-0.2153005853  
-0.1987043307  
-0.1956421789  
-0.2156541295  
-0.2644418094  
-0.3425346986  
-0.4447341859  
-0.5604974275  
-0.6752443925  
-0.7724509825  
-0.8362236255  
-0.8539775477  
-0.8187768501  
-0.7309392993  
-0.5985765371  
-0.4369090144  
-0.2663668834  
-0.1096818121  
0.01163512197  
0.08093742585  
0.08962384789  
0.03932871582  
-0.05729678768  
-0.1774525486  
-0.2906915657  
-0.3628010403  
-0.3605752383  
-0.2568342726  
-0.03496475038  
0.3076968717  
0.7581836919  
1.288230803  
1.856653265  
2.413515338  
2.905574925  
3.282310487  
3.501753907  
3.535381744  
3.371449135  
3.016372356  
2.494012056  
1.842991799  
1.112428526  
0.3566155063  
-0.3706725327  
-1.021590092  
-1.558742886  
-1.958351782  
-2.211767404  
-2.325269016  
-2.318237984  
-2.220015738  
-2.065855261  
-1.892459172  
-1.733616425  
-1.616412082  
-1.558397834  
-1.565995011  
-1.634252797  
-1.747942332  
-1.883820626  
-2.013789803  
-2.10856612  
-2.141454972  
-2.091791447  
-1.947667197  
-1.707641255  
-1.381227867  
-0.9881152425  
-0.5561990783  
-0.1186429898  
0.2896841689  
0.6359993863  
0.8931826195  
1.042730027  
1.076757023  
0.9988274991  
0.8235341759  
0.574913975  
0.2838968963  
-0.0148780434  
-0.2865164716  
-0.4991752489  
-0.6268860586  
-0.651604668  
-0.5643318099  
-0.3652686204  
-0.06308877465  
0.3264743902  
0.7824801152  
1.280784946  
1.795954526  
2.302871055  
2.777941405  
3.19988252  
3.550149677  
3.81314352  
3.976342772  
4.030494879  
3.969956034  
3.793186984  
3.503337901  
3.108784207  
2.623438311  
2.066666234  
1.462657224  
0.8392068831  
0.2259309651  
-0.3479358856  
-0.8559337248  
-1.276673389  
-1.595740941  
-1.806947905  
-1.912733605  
-1.923657472  
-1.857019082  
-1.734786053  
-1.581090667  
-1.419620818  
-1.271244207  
-1.152163419  
-1.07281165  
-1.037598497  
-1.04547779  
-1.091189561  
-1.166930963  
-1.264157273  
-1.375198403  
-1.49441633  
-1.618725477  
-1.74739808  
-1.881210682  
-2.0211106  
-2.166660875  
-2.314577018  
-2.457665029  
-2.584400529  
-2.679306882  
-2.724158006  
-2.69988479  
-2.588967991  
-2.377999877  
-2.060054819  
-1.636529457  
-1.118166985  
-0.5250689376  
0.1143537115  
0.7654367395  
1.39012009  
1.950311857  
2.41138516  
2.745404998  
2.933713067  
2.968551944  
2.85353532  
2.602911925  
2.239730046  
1.793161992  
1.295364919  
0.778311667  
0.2710419093  
-0.2023230464  
-0.6235553735  
-0.9802499931  
-1.264844655  
-1.473018836  
-1.601903901  
-1.64853279  
-1.60893565  
-1.478134961  
-1.251118276  
-0.9246489047  
-0.4995818138  
0.01678611711  
0.6088612402  
1.25187137  
1.91231076  
2.549838397  
3.120525105  
3.58109385  
3.893613575  
4.029996702  
3.975643934  
3.731685832  
3.315465799  
2.759135972  
2.106522611  
1.408650582  
0.7184872981  
0.08556782504  
-0.4488358947  
-0.8554496995  
-1.119230138  
-1.239903143  
-1.230849339  
-1.116562433  
-0.9290699154  
-0.7038103762  
-0.4754803292  
-0.2743360222  
-0.1233353685  
-0.03639572119  
-0.01786671251  
-0.06318479026  
-0.1605290622  
-0.293185123  
-0.4422624631  
-0.5893903365  
-0.7190308963  
-0.8201469264  
-0.8870412238  
-0.9193418874  
-0.9212041057  
-0.8999420395  
-0.864363583  
-0.8231035089  
-0.7832431907  
-0.7494256132  
-0.7235694762  
-0.705164453  
-0.6920406293  
-0.681381801  
-0.6707656941  
-0.6589709888  
-0.6463937625  
-0.6349747382  
-0.6276645133  
-0.6275411134  
-0.6367844395  
-0.6557210031  
-0.6821741909  
-0.7112740798  
-0.7358039556  
-0.7470734993  
-0.7361782975  
-0.6954644239  
-0.6199459649  
-0.5084344111  
-0.3641732413  
-0.194845827  
-0.01192428318  
0.1705778745  
0.3377886523  
0.47586233  
0.5737968821  
0.6249312493  
0.627889091  
0.5868377597  
0.5110110112  
0.4135550389  
0.3098541126  
0.2155625498  
0.1446146247  
0.1074804081  
0.1099046713  
0.1522876032  
0.2297746494  
0.3330422035  
0.449629917  
0.5656423035  
0.6675671228  
0.7439607345  
0.7867792968  
0.7921958829  
0.760811905  
0.697274049  
0.6093831776  
0.5068492179  
0.3998908321  
0.2978787703  
0.2082142928  
0.1355780307  
0.081621651  
0.04510960861  
0.02244875626  
0.008496131518  
-0.002499829142  
