-0.2324922602  
-0.3186216469  
-0.3989916509  
-0.4681591647  
-0.5211476411  
-0.5536314601  
-0.5621276176  
-0.5442030644  
-0.4986935477  
-0.4259196169  
-0.3278743365  
-0.2083349542  
-0.07286245603  
0.07136672672  
0.2159137203  
0.3516292411  
0.4693685141  
0.5608209282  
0.6193584374  
0.6408096871  
0.6240489891  
0.5713163264  
0.4882016967  
0.3832744388  
0.2673769206  
0.1526390978  
0.05131611827  
-0.0254340317  
-0.06870851967  
-0.07281725959  
-0.03594353955  
0.03958376913  
0.1474402624  
0.2778833628  
0.4187127645  
0.5565228551  
0.6781274269  
0.772000292  
0.8295722969  
0.8462283915  
0.8218688587  
0.7609547106  
0.6720033903  
0.5665805477  
0.4578915404  
0.3591447221  
0.2818853394  
0.234529491  
0.2212912403  
0.2416611351  
0.2905248097  
0.3589126368  
0.43529424  
0.5072427581  
0.563240468  
0.5943695837  
0.5956377554  
0.5667436403  
0.5121522716  
0.4404566773  
0.3631023657  
0.2926462892  
0.2407970532  
0.2165202782  
0.2244921959  
0.2641395571  
0.329425605  
0.4094357046  
0.4897015035  
0.5540911887  
0.5870161515  
0.5756414387  
0.5117957786  
0.3933072851  
0.2245674919  
0.01624253298  
-0.215848103  
-0.4525371171  
-0.6735673643  
-0.8600141268  
-0.9965524182  
-1.073285827  
-1.086905126  
-1.041037892  
-0.9457524851  
-0.8162872753  
-0.6711748779  
-0.5300028202  
-0.4110923223  
-0.3293800724  
-0.2947622075  
-0.3110864521  
-0.3758973112  
-0.4809406707  
-0.6133358263  
-0.7572415878  
-0.8957954819  
-1.013064559  
-1.095782237  
-1.134662883  
-1.125166769  
-1.067663047  
-0.9670147373  
-0.8316913815  
-0.6725519428  
-0.5014858198  
-0.3300884641  
-0.1685310042  
-0.02474169776  
0.09603737552  
0.1913153735  
0.2610823271  
0.3072956641  
0.3332308284  
0.3428207035  
0.3400824505  
0.3287165155  
0.3119140902  
0.2923804163  
0.2725217621  
0.2547389884  
0.2417309858  
0.2367157531  
0.2434990651  
0.2663274453  
0.3095207975  
0.3769089113  
0.471137486  
0.5929452791  
0.7405285455  
0.9091135415  
1.090833429  
1.274981442  
1.448647189  
1.597707486  
1.708069655  
1.767035446  
1.764625767  
1.694701044  
1.555734424  
1.351142788  
1.08912281  
0.7820156905  
0.4452681015  
0.09610434062  
-0.2479429684  
-0.5704935897  
-0.8576328412  
-1.098955321  
-1.288247619  
-1.423770633  
-1.508116357  
-1.547668411  
-1.551718092  
-1.531320516  
-1.497998356  
-1.462421782  
-1.433194557  
-1.415885358  
-1.41240744  
-1.420837092  
-1.43569585  
-1.448674488  
-1.449723097  
-1.428370144  
-1.375114551  
-1.282713471  
-1.147208089  
-0.9685609317  
-0.7508321153  
-0.5018869203  
-0.232676545  
0.04381230511  
0.3137990767  
0.5640055267  
0.7828542922  
0.961445032  
1.094214973  
1.179228014  
1.218083527  
1.215473587  
1.178460073  
1.115563606  
1.035777607  
0.9476202617  
0.8583259505  
0.7732575639  
0.6955913671  
0.6262835423  
0.5642986995  
0.5070485356  
0.4509645169  
0.3921240454  
0.3268463516  
0.2521974191  
0.1663579047  
0.06884351883  
-0.03942237958  
-0.1561507185  
-0.2778158021  
-0.3998421  
-0.5168238175  
-0.622782268  
-0.7114604264  
-0.7766773066  
-0.8127516315  
-0.8149921043  
-0.780234937  
-0.7073705575  
-0.5977913327  
-0.4556668388  
-0.2879641984  
-0.1041469256  
0.08447113147  
0.2656892166  
0.4276139566  
0.5599481578  
0.6552017313  
0.7096432815  
0.7238320312  
0.7026213238  
0.6545928151  
0.5909751454  
0.5241710969  
0.4660919068  
0.4265307285  
0.4118110485  
0.4239059643  
0.4601632811  
0.513681778  
0.5742883084  
0.6299832429  
0.6686526762  
0.6798135051  
0.6561551048  
0.5946658847  
0.4972045834  
0.3704306912  
0.2251091413  
0.07486915201  
-0.06542398379  
-0.1814877583  
-0.2614038592  
-0.2971418917  
-0.2856266255  
-0.2292157417  
-0.1355059035  
-0.01648840401  
0.1128533678  
0.2363316435  
0.3384972794  
0.4064846452  
0.4315031378  
0.4097740888  
0.3427789444  
0.2367901337  
0.1017575443  
-0.05027015101  
-0.2069400689  
-0.3573171966  
-0.4932594088  
-0.6102251711  
-0.7073952779  
-0.787103611  
-0.8537044552  
-0.9120947238  
-0.9661857102  
-1.017623669  
-1.065022671  
-1.103876578  
-1.12719706  
-1.126779999  
-1.094894173  
-1.026074999  
-0.9186952826  
-0.7759974757  
-0.6063610383  
-0.422702703  
-0.241065779  
-0.07859042185  
0.04882540632  
0.1288042697  
0.154332698  
0.124875468  
0.04656515745  
-0.06856079588  
-0.2041609019  
-0.3417754509  
-0.4632543123  
-0.5530582744  
-0.600095338  
-0.5988398855  
-0.549606092  
-0.4579893699  
-0.3336185345  
-0.1884598547  
-0.03497218485  
0.115586895  
0.2544509408  
0.3760625412  
0.4781626364  
0.5613012549  
0.6279232103  
0.6812367574  
0.7240999161  
0.7581418843  
0.7832673879  
0.7976261951  
0.7980197342  
0.7806560632  
0.7420886671  
0.6801654045  
0.5948104866  
0.488513379  
0.3664511418  
0.2362398826  
0.1073672147  
-0.009600822529  
-0.1039260814  
-0.1656135031  
-0.1862492156  
-0.1597074809  
-0.08269864551  
0.04484371691  
0.2195437982  
0.4345288751  
0.6795603357  
0.941378901  
1.204294051  
1.451040775  
1.66389892  
1.826025615  
1.922910107  
1.943804747  
1.882966807  
1.740530047  
1.522848773  
1.24221557  
0.9159176716  
0.5647012039  
0.2107883122  
-0.1243311486  
-0.4220636959  
-0.6685660925  
-0.8560464  
-0.9833441691  
-1.055713829  
-1.083840219  
-1.08222029  
-1.067122489  
-1.054394113  
-1.05739845  
-1.085345979  
-1.142218461  
-1.226412785  
-1.331124069  
-1.445398333  
-1.555693928  
-1.647736893  
-1.708419737  
-1.727495401  
-1.698866012  
-1.621311667  
-1.498595015  
-1.338950237  
-1.154058669  
-0.9576503098  
-0.7639332468  
-0.5860451066  
-0.4347138805  
-0.3172749062  
-0.237130418  
-0.1936897724  
-0.1827466102  
-0.1972223411  
-0.2281470616  
-0.2657483504  
-0.3005129024  
-0.3241094384  
-0.3300867884  
-0.3143059185  
-0.2751018475  
-0.2131934512  
-0.1314000694  
-0.03421370687  
0.07270171452  
0.1830437621  
0.2903895832  
0.3886766534  
0.4726300426  
0.5381250991  
0.5824733378  
0.6046181623  
0.6052246411  
0.5866447108  
0.5527447928  
0.5085974548  
0.4600549302  
0.4132368767  
0.3739829813  
0.3473412068  
0.3371348464  
0.3456768676  
0.3736419171  
0.4201106221  
0.4827554337  
0.5581201278  
0.6419458752  
0.7294824588  
0.8157535216  
0.8957564902  
0.9646111644  
1.017685365  
1.050737901  
1.060118296  
1.043036407  
0.9978925677  
0.9246219302  
0.8249810884  
0.702694833  
0.5633815528  
0.414214676  
0.2633161976  
0.1189390077  
-0.01144568867  
-0.1220147098  
-0.209244  
-0.2722139694  
-0.3124800425  
-0.3335069238  
-0.3397453337  
-0.3355152807  
-0.3239094429  
-0.3059443444  
-0.2801524405  
-0.2427415423  
-0.1883300854  
-0.1111699192  
-0.006647258637  
0.1272023856  
0.2884611251  
0.4706396213  
0.662709356  
0.8499197096  
1.015328213  
1.141843661  
1.214487002  
1.222531371  
1.16117558  
1.032481495  
0.8454038239  
0.6148777164  
0.3600699191  
0.1020263601  
-0.1389595025  
-0.3458923505  
-0.5071804584  
-0.6180069019  
-0.6807794593  
-0.7045990813  
-0.7038223452  
-0.695917175  
-0.698899922  
-0.7286996544  
-0.7967970604  
-0.9084472157  
-1.061721637  
-1.247492846  
-1.450375788  
-1.650501504  
-1.825921301  
-1.955332363  
-2.020789272  
-2.010057929  
-1.918307129  
-1.74890715  
-1.513219537  
-1.229381824  
-0.9202219117  
-0.6105588787  
-0.3242255577  
-0.08120497389  
0.1047437939  
0.2276454074  
0.28983705  
0.3013927711  
0.2785175429  
0.2411413188  
0.2100482648  
0.2039538509  
0.2369379096  
0.3165959967  
0.443147747  
0.6096039267  
0.8029274062  
1.00598069  
1.199944049  
1.366829106  
1.491724281  
1.564467118  
1.580550829  
1.541192432  
1.452634261  
1.324846001  
1.169877033  
1.000133266  
0.8268304815  
0.6588251763  
0.5019400128  
0.3588165927  
0.2292426383  
0.110837703  
-4.507513775e-05  
-0.1073653856  
-0.2145284274  
-0.3237100486  
-0.4354418865  
-0.5484707746  
-0.6598821448  
-0.7654389059  
-0.8600725667  
-0.9384667555  
-0.9956626684  
-1.027631022  
-1.031764933  
-1.007254922  
-0.9553117196  
-0.8792284748  
-0.7842596788  
-0.6773227769  
-0.5665291786  
-0.4605740413  
-0.3680162298  
-0.2965089382  
-0.2520449338  
-0.2382923655  
-0.2561012829  
-0.3032498988  
-0.3744926351  
-0.4619306099  
-0.5557002904  
-0.6449368266  
-0.7189090921  
-0.7682154343  
-0.7858833752  
-0.7682322801  
-0.7153689705  
-0.6312321108  
-0.5231631308  
-0.4010402775  
-0.2760883239  
-0.1595225088  
-0.06120431675  
0.01149668077  
0.05449649911  
0.06734836114  
0.05313398512  
0.01794847116  
-0.02991026017  
-0.08089828998  
-0.1251767953  
-0.1534304317  
-0.1574693086  
-0.1305987057  
-0.0677877725  
0.03428319475  
0.1772007145  
0.3607442907  
0.5827093299  
0.8386368967  
1.121511601  
1.421526236  
1.726058022  
2.019952046  
2.286211833  
2.507103394  
2.665605556  
2.74708045  
2.740948222  
2.64213911  
2.452096452  
2.179138582  
1.838080209  
1.449103961  
1.035983042  
0.623852337  
0.2367952248  
-0.1044582735  
-0.3844358008  
-0.5941985273  
-0.7318471092  
-0.8022165793  
-0.8158370297  
-0.7873221481  
-0.7334164867  
-0.6709705414  
-0.6150912495  
-0.5776819382  
-0.5665110223  
-0.5848660237  
-0.6317669696  
-0.7026407477  
-0.7903091022  
-0.8861250422  
-0.9810935788  
-1.066844768  
-1.136370721  
-1.18448349  
-1.208004879  
-1.205720534  
-1.178165356  
-1.127300964  
-1.056143062  
-0.9683811545  
-0.868018295  
-0.7590363817  
-0.6451010769  
-0.5293051382  
-0.4139595839  
-0.3004602212  
-0.1892465662  
-0.0798799202  
0.02873688348  
0.1380107905  
0.2491991542  
0.3628975731  
0.4785526325  
0.5940862846  
0.7057256568  
0.8080958715  
0.8946170785  
0.9581809273  
0.9920432197  
0.9908225529  
0.9514572563  
0.8739755903  
0.7619391962  
0.6224664339  
0.4657905363  
0.3043775538  
0.1516919299  
0.02074809024  
-0.07737193455  
-0.134853376  
-0.1481573936  
-0.1185688155  
-0.0522088085  
0.04050694522  
0.1459045062  
0.2484606836  
0.3324250488  
0.3834579588  
0.3901031498  
0.3449268877  
0.2452115577  
0.09314552799  
-0.1044756832  
-0.3369717879  
-0.5908070173  
-0.8507862637  
-1.101277386  
-1.327335754  
-1.515638154  
-1.655183285  
-1.737742942  
-1.758096538  
-1.714092201  
-1.606586953  
-1.439309795  
-1.218674596  
-0.9535460831  
-0.6549409866  
-0.3356383307  
-0.009670318958  
0.3083245846  
0.603872158  
0.8635250197  
1.075745437  
1.231722034  
1.32602201  
1.356989839  
1.326824631  
1.241311457  
1.109219459  
0.9414267032  
0.7498693445  
0.5464371001  
0.3419361193  
0.1452354151  
-0.03731234277  
-0.2021345998  
-0.3483695204  
-0.4775046469  
-0.5927819148  
-0.6984567484  
-0.7990071473  
-0.8983784881  
-0.9993467415  
-1.103052733  
-1.208748011  
-1.313761826  
-1.413688629  
-1.502772713  
-1.574456542  
-1.622050104  
-1.639461069  
-1.621924346  
-1.566655659  
-1.47334943  
-1.344449016  
-1.185125873  
-1.002929002  
-0.8071022109  
-0.6076145841  
-0.4139883026  
-0.2340626218  
-0.07285070594  
0.06833006267  
0.1923033506  
0.3059300334  
0.4194104482  
0.5450209399  
0.6953994427  
0.8815792242  
1.111022851  
1.385925951  
1.702059672  
2.048350465  
2.407315835  
2.756363057  
3.069839067  
3.321605992  
3.487855371  
3.549805474  
3.495953784  
3.323589823  
3.039374396  
2.658891019  
2.205219629  
1.706690059  
1.194072749  
0.6975367339  
0.2437226699  
-0.1467330163  
-0.4609506137  
-0.6946401926  
-0.8519345719  
-0.9442512542  
-0.9883266177  
-1.003659976  
-1.009673711  
-1.022936333  
-1.054793421  
-1.109714534  
-1.184584076  
-1.269056884  
-1.346970985  
-1.398664574  
-1.403928634  
-1.345215678  
-1.210678041  
-0.996604034  
-0.7088877425  
-0.3632779181  
0.01568806371  
0.3969800901  
0.7463476172  
1.030169546  
1.219403725  
1.293121897  
1.241183485  
1.06569494  
0.7810745153  
0.4127093426  
-0.005625159733  
-0.435264  
-0.8366525341  
-1.173377408  
-1.415775942  
-1.543742039  
-1.548444572  
-1.432816978  
-1.210815501  
-0.9055707619  
-0.5466792638  
-0.1669471728  
0.2010390839  
0.5281591144  
0.7914716018  
0.9761316252  
1.076333074  
1.095211468  
1.04375639  
0.938905417  
0.8010723254  
0.6514351228  
0.5093217583  
0.3900087251  
0.3031909505  
0.2522654673  
0.2344719891  
0.2418001018  
0.2624845149  
0.2828338188  
0.2891220946  
0.2692848535  
0.2142250159  
0.1186157965  
-0.01881874021  
-0.1954848162  
-0.4054379787  
-0.6400920726  
-0.8889759113  
-1.140433902  
-1.382218249  
-1.601982183  
-1.787724376  
-1.928260351  
-2.013787214  
-2.036581692  
-1.991807644  
-1.878359793  
-1.699607692  
-1.463882137  
-1.184542237  
-0.8794961996  
-0.5701207058  
-0.2796095903  
-0.03088095449  
0.1557438532  
0.26481576  
0.2876885871  
0.2238320731  
0.0813097446  
-0.123689113  
-0.3682719404  
-0.6250866143  
-0.8651657983  
-1.06104709  
-1.189818805  
-1.235724486  
-1.192010906  
-1.061779739  
-0.8577156289  
-0.6006964211  
-0.3174139732  
-0.03727614444  
0.2110650699  
0.4031328456  
0.5215719706  
0.5582342465  
0.515122676  
0.4040421386  
0.2449849883  
0.06344602757  
-0.1129841172  
-0.2582783055  
-0.3513882745  
-0.3789225571  
-0.3367176839  
-0.2300742019  
-0.07263461593  
0.1159196304  
0.3130056231  
0.4966327333  
0.6487373518  
0.7578623584  
0.8208008869  
0.8429731019  
0.837504382  
0.8231548697  
0.8214197801  
0.8532292685  
0.9357178609  
1.079525554  
1.286994607  
1.551502828  
1.858014571  
2.184759062  
2.505803524  
2.794166168  
3.025057486  
3.178814289  
3.243152308  
3.214445155  
3.097877678  
2.906467874  
2.659109828  
2.37791318  
2.085212296  
1.800658263  
1.538787341  
1.307396291  
1.106927662  
0.9309282779  
0.767497495  
0.6014842353  
0.4171170056  
0.200664305  
-0.05723881227  
-0.359934733  
-0.7039648497  
-1.07925543  
-1.470213495  
-1.857540213  
-2.2204888  
-2.539236126  
-2.797040631  
-2.98191699  
-3.087638673  
-3.113992512  
-3.066325752  
-2.954516149  
-2.791567337  
-2.592061761  
-2.370685384  
-2.141000672  
-1.914574214  
-1.700491066  
-1.505221684  
-1.332754955  
-1.184894496  
-1.061611672  
-0.961375889  
-0.881425904  
-0.8179773579  
-0.7664017377  
-0.7214274724  
-0.6774061675  
-0.6286747696  
-0.5700128625  
-0.4971498968  
-0.407265116  
-0.2993861235  
-0.1746145471  
-0.03610948446  
0.1111939044  
0.2611116888  
0.406923453  
0.5421754098  
0.6614471914  
0.7609742371  
0.8390237125  
0.8959652831  
0.9340298843  
0.9567963465  
0.9684958397  
0.9732485292  
0.9743629956  
0.9738142828  
0.9719796073  
0.9676741105  
0.9584684917  
0.9412226135  
0.9127399255  
0.8704192379  
0.8127957629  
0.7398794945  
0.6532443504  
0.5558632036  
0.4517379597  
0.3453983009  
0.2413702097  
0.1437040332  
0.05564330361  
-0.02053224472  
-0.08348441847  
-0.1326549606  
-0.1680268371  
-0.1898845188  
-0.1986418264  
-0.1947791077  
-0.1789100243  
-0.1519448155  
-0.1153118125  
-0.07115618633  
-0.02245405269  
0.02702235717  
0.07290855735  
0.1106185734  
0.1358374601  
0.1450623815  
0.1361011568  
0.108441894  
0.06341975149  
0.004136473558  
-0.06486184812  
-0.138113504  
