-0.1658047638  
0.3845440391  
0.9055004642  
1.372535046  
1.765928813  
2.072488195  
2.286470402  
2.409599951  
2.450188839  
2.421508982  
2.339646353  
2.221171696  
2.080934041  
1.93030332  
1.776083278  
1.62022933  
1.460388578  
1.291156383  
1.105849329  
0.8985237957  
0.6659275694  
0.4090940461  
0.1343236251  
-0.146625388  
-0.4172005628  
-0.6575275164  
-0.846537854  
-0.9644972267  
-0.9956109797  
-0.9303682747  
-0.7672908554  
-0.513826597  
-0.1862191522  
0.1916715841  
0.5905072267  
0.9783302161  
1.323811337  
1.599502034  
1.784681406  
1.867454568  
1.845837875  
1.72770223  
1.529593383  
1.274587209  
0.9894685264  
0.7015930408  
0.4358290808  
0.2119554678  
0.04280938919  
-0.06662037911  
-0.1190993996  
-0.1241294358  
-0.09619359754  
-0.05254277041  
-0.01083667405  
0.01305334538  
0.006809719036  
-0.03716931406  
-0.1213101374  
-0.2430843049  
-0.3958106914  
-0.5698599869  
-0.7540624522  
-0.9370965547  
-1.108668732  
-1.260347573  
-1.385977755  
-1.481674694  
-1.545476897  
-1.576763995  
-1.575613676  
-1.542235381  
-1.476614079  
-1.378440172  
-1.247340115  
-1.083355945  
-0.8875638866  
-0.6627022662  
-0.4136533312  
-0.147660737  
0.1257964969  
0.3954918761  
0.6492540001  
0.8749801438  
1.061726949  
1.200720404  
1.286155617  
1.315689455  
1.290568319  
1.21541238  
1.09769918  
0.9470380119  
0.7743322414  
0.5909257642  
0.4078038876  
0.2349050757  
0.0805570807  
-0.04894677988  
-0.1496434828  
-0.2200594073  
-0.2612374986  
-0.2766070972  
-0.2716852483  
-0.2535959345  
-0.2304065302  
-0.2103214997  
-0.2007855118  
-0.2075977957  
-0.2341398104  
-0.280836904  
-0.3449527239  
-0.4207731674  
-0.5001985541  
-0.5736894088  
-0.631461171  
-0.6647795313  
-0.6671783913  
-0.635426204  
-0.5700913174  
-0.4756121823  
-0.3598368365  
-0.2330779119  
-0.1067922074  
0.007941858097  
0.1019466423  
0.1692490007  
0.2079701324  
0.2206585635  
0.2139787079  
0.1977789408  
0.1836226262  
0.1829761973  
0.2052861676  
0.2562310821  
0.3364141705  
0.4407215494  
0.5584988165  
0.6745800934  
0.7710797228  
0.8297519366  
0.8346089738  
0.7744287108  
0.644793807  
0.4493152231  
0.1998220213  
-0.08458075819  
-0.3795132495  
-0.6581527286  
-0.8945377583  
-1.066890298  
-1.160494419  
-1.169710124  
-1.098817032  
-0.9615440035  
-0.7793313797  
-0.5785474916  
-0.3870443083  
-0.2305221617  
-0.1292097027  
-0.09531740951  
-0.1315993741  
-0.2312111682  
-0.3788614844  
-0.5530597375  
-0.7291401746  
-0.882616277  
-0.9924009434  
-1.043468197  
-1.028609923  
-0.9490913237  
-0.8141655036  
-0.6395594266  
-0.4451864032  
-0.2524170164  
-0.08130014719  
0.05190112973  
0.1365545547  
0.1686716646  
0.1509996876  
0.09223683522  
0.00551978246  
-0.09358661494  
-0.1892877406  
-0.2676615568  
-0.3183798067  
-0.3358443631  
-0.3196038193  
-0.2740377521  
-0.2073772437  
-0.1302204899  
-0.05377479664  
0.01192222144  
0.05955049592  
0.08559797445  
0.09084325555  
0.08016397615  
0.0616952  
0.04545478696  
0.04164187785  
0.05884907598  
0.1024697336  
0.1735449571  
0.268243224  
0.378090717  
0.4909430096  
0.5925949088  
0.6688108338  
0.7074954516  
0.7006731604  
0.6459765054  
0.5473879708  
0.415093685  
0.2644258163  
0.1140212224  
-0.01656943652  
-0.1094767185  
-0.1509418702  
-0.1332170062  
-0.0556482837  
0.07523037444  
0.2466131093  
0.4412241655  
0.6397411477  
0.8234914748  
0.9770225293  
1.090185016  
1.159425314  
1.188119291  
1.185902975  
1.16711813  
1.148592502  
1.147072537  
1.176656115  
1.246566799  
1.359554398  
1.511112393  
1.68960236  
1.877263855  
2.051979225  
2.189585743  
2.266476527  
2.262201896  
2.161792481  
1.957560824  
1.650194145  
1.249022078  
0.7714390968  
0.2415323152  
-0.3119430803  
-0.8580341937  
-1.366261102  
-1.809211968  
-2.164809954  
-2.418028002  
-2.561888318  
-2.597670266  
-2.534328258  
-2.387205741  
-2.176216563  
-1.923694435  
-1.652166643  
-1.382288245  
-1.131150336  
-0.9111316166  
-0.7293857045  
-0.5879787334  
-0.4846204979  
-0.4138561187  
-0.368536734  
-0.3413491124  
-0.3261920904  
-0.3192011376  
-0.3192824637  
-0.3280777153  
-0.3493763504  
-0.3880644012  
-0.4487812036  
-0.5345000169  
-0.6452801262  
-0.7774078521  
-0.9231155071  
-1.070964547  
-1.206902964  
-1.315886024  
-1.383857831  
-1.399826724  
-1.357720586  
-1.257736185  
-1.106928754  
-0.9189003671  
-0.7125597678  
-0.5100526665  
-0.3340943008  
-0.2050319678  
-0.1380199489  
-0.1407053441  
-0.2117628034  
-0.3405332088  
-0.5078785084  
-0.6882020402  
-0.8524302933  
-0.9716058508  
-1.020644333  
-0.9817546631  
-0.8470673026  
-0.6200714378  
-0.3156414106  
0.04140285536  
0.4190482939  
0.7818201418  
1.095008393  
1.328847596  
1.462092848  
1.484524447  
1.398070347  
1.216412358  
0.9631629711  
0.6688795911  
0.3673324843  
0.09151782039  
-0.1300785983  
-0.2765206485  
-0.3364400695  
-0.3088447136  
-0.2026969689  
-0.0353851818  
0.1696645061  
0.3859085407  
0.5867828446  
0.7486177004  
0.8530716735  
0.8888576466  
0.8526239617  
0.7489668145  
0.5896256254  
0.3920079906  
0.1772344083  
-0.03207610943  
-0.2140463027  
-0.34959399  
-0.4241374046  
-0.4288101854  
-0.3611214766  
-0.2250325953  
-0.03047540252  
0.2076298708  
0.4707540402  
0.7384228772  
0.9900255892  
1.206616518  
1.37256022  
1.476872851  
1.514134759  
1.484877275  
1.395393972  
1.256977125  
1.084648771  
0.8954979184  
0.7068068563  
0.5341646807  
0.3897863915  
0.2812445097  
0.2107669768  
0.1752056256  
0.1666873335  
0.1738843767  
0.1837440012  
0.1834691899  
0.1624844231  
0.1141243717  
0.03680863336  
-0.06547985334  
-0.1834939267  
-0.303790282  
-0.4104383217  
-0.4871655816  
-0.5196512491  
-0.497658811  
-0.4167148017  
-0.2790859443  
-0.09390316021  
0.1236029967  
0.353674091  
0.5742058019  
0.763249932  
0.9015149247  
0.9745254379  
0.974161921  
0.8993875002  
0.7560796644  
0.5560274732  
0.3152441742  
0.05186357831  
-0.2160779779  
-0.4726836983  
-0.7057752206  
-0.907848542  
-1.076307031  
-1.213002592  
-1.3231985  
-1.414138187  
-1.493448003  
-1.567602068  
-1.640655917  
-1.713406562  
-1.783073774  
-1.843533711  
-1.886068117  
-1.900527097  
-1.876774485  
-1.806229805  
-1.683323329  
-1.506672799  
-1.279826505  
-1.011440188  
-0.7148444138  
-0.4069996805  
-0.106943519  
0.1661135826  
0.3948242306  
0.5656214235  
0.670271588  
0.7068489316  
0.6799890192  
0.6003665662  
0.4834437709  
0.3476281071  
0.2120711422  
0.09437398071  
0.008492505102  
-0.0368884498  
-0.03931046871  
-0.002696824555  
0.06330562374  
0.1447157193  
0.2251566519  
0.2880951278  
0.3190800839  
0.3077112442  
0.2490642583  
0.1444086191  
0.001125043362  
-0.1681510074  
-0.3470403204  
-0.517387439  
-0.6614170444  
-0.7638163211  
-0.8134790613  
-0.8047075192  
-0.7377432313  
-0.6185830272  
-0.4581300414  
-0.2708066704  
-0.07282200073  
0.1196824664  
0.2923825391  
0.4342108034  
0.5383350641  
0.6025835573  
0.6293047628  
0.624711764  
0.597823909  
0.5591497247  
0.5192860856  
0.4875910059  
0.4710888924  
0.4737129284  
0.4959663338  
0.5350293993  
0.5852881388  
0.6392219807  
0.6885381957  
0.7254053178  
0.7436323112  
0.7396209834  
0.712948919  
0.6664929421  
0.6060419734  
0.5394473016  
0.4754152201  
0.4221247389  
0.385879621  
0.37002669  
0.3743198084  
0.3948613025  
0.4246527402  
0.4546769751  
0.475357718  
0.4781464703  
0.4569868499  
0.4093942005  
0.3369639374  
0.2452078412  
0.1427371764  
0.03990236578  
-0.05287432597  
-0.1268289801  
-0.1763506042  
-0.1999990925  
-0.2008769998  
-0.1862860759  
-0.1667031181  
-0.1542274405  
-0.1607397328  
-0.1960199966  
-0.2661447579  
-0.3723735417  
-0.5107135389  
-0.6722277756  
-0.8440489654  
-1.010960816  
-1.157326732  
-1.269103499  
-1.335653354  
-1.351118215  
-1.315162391  
-1.232993595  
-1.114660024  
-0.9737281233  
-0.8255117474  
-0.6850968596  
-0.5654216537  
-0.4756592568  
-0.4201098378  
-0.3977449045  
-0.4024572548  
-0.423968123  
-0.4492814867  
-0.4644856529  
-0.4566709506  
-0.4157203616  
-0.3357451431  
-0.2159865435  
-0.06106505002  
0.1194400778  
0.3120423867  
0.500894667  
0.669646194  
0.8033807363  
0.8904064889  
0.9236780543  
0.9016740362  
0.8286309613  
0.7140873125  
0.5718004489  
0.4181597589  
0.2702742498  
0.1439835268  
0.05201754982  
0.002541888667  
-0.001727278036  
0.03626397034  
0.1084101075  
0.2025869614  
0.3042953992  
0.3985733457  
0.471947024  
0.5141415218  
0.5193358655  
0.4867952868  
0.4208085771  
0.3299516565  
0.2257918178  
0.1212346517  
0.02874484053  
-0.04130026097  
-0.081899555  
-0.09019513555  
-0.06762884596  
-0.0194978406  
0.04599249142  
0.1190251663  
0.1896013205  
0.2488985227  
0.2903691872  
0.3104418341  
0.3087504487  
0.2879036348  
0.2528509018  
0.2099766211  
0.1660587561  
0.1272586537  
0.09827260637  
0.08176107679  
0.07811355574  
0.0855684862  
0.1006458118  
0.1188309319  
0.1353888375  
0.146201714  
0.1484887366  
0.1413114863  
0.1257706923  
0.1048534816  
0.08293867835  
0.06501003199  
0.05568619778  
0.05821060273  
0.07355763787  
0.09982166134  
0.132013588  
0.1623513884  
0.1810478115  
0.1775180857  
0.141879827  
0.06651007953  
-0.05256204993  
-0.2146677849  
-0.4141151266  
-0.6405125126  
-0.8798160767  
-1.115983383  
-1.333030604  
-1.517185531  
-1.658820585  
-1.75383537  
-1.804252754  
-1.817886188  
-1.807081953  
-1.786694993  
-1.771567492  
-1.773896814  
-1.80089043  
-1.853092907  
-1.92367998  
-1.99887932  
-2.059507619  
-2.083453403  
-2.048781032  
-1.937027514  
-1.736223668  
-1.443195243  
-1.064784974  
-0.6177863952  
-0.127551777  
0.3745695072  
0.8546505236  
1.280014709  
1.622971188  
1.863961362  
1.993698983  
2.014033651  
1.937434271  
1.7851868  
1.584572731  
1.36541812  
1.156484798  
0.982174523  
0.859946447  
0.7987534328  
0.7986179544  
0.85134574  
0.9421991066  
1.052247004  
1.161049431  
1.249309792  
1.301169779  
1.305898108  
1.258823621  
1.161475946  
1.02099782  
0.8489746167  
0.6598834728  
0.4693796415  
0.2926351124  
0.1429012683  
0.03042786832  
-0.03819771046  
-0.06028683172  
-0.03689211224  
0.0276516515  
0.1263981489  
0.2505615963  
0.3902922093  
0.5353847445  
0.6758776163  
0.8025229992  
0.9071493362  
0.9829525391  
1.024746354  
1.029216898  
0.9951775955  
0.9238172508  
0.8188806143  
0.6867184052  
0.5361195051  
0.3778614272  
0.2239504598  
0.0865731338  
-0.0231636174  
-0.09654743976  
-0.1284571059  
-0.118237825  
-0.07007486215  
0.0072531828  
0.1012702744  
0.197284712  
0.2802738528  
0.3369289453  
0.3575428657  
0.33745452  
0.2777934052  
0.1853791782  
0.07174432613  
-0.04859516481  
-0.1603904799  
-0.2501013595  
-0.3081481472  
-0.3306249242  
-0.320186573  
-0.2859492792  
-0.2423849084  
-0.2073537291  
-0.1995445225  
-0.2356894253  
-0.327965072  
-0.4819624475  
-0.6955444294  
-0.9587690233  
-1.254924473  
-1.562550589  
-1.858184686  
-2.119464223  
-2.328140467  
-2.472590024  
-2.549428237  
-2.563970568  
-2.529427767  
-2.464907656  
-2.392453372  
-2.333532774  
-2.305467838  
-2.3183493  
-2.372931717  
-2.459892686  
-2.560639795  
-2.649637655  
-2.697971299  
-2.677663629  
-2.566113914  
-2.349973313  
-2.027826845  
-1.61122  
-1.12380054  
-0.5986539605  
-0.07418807239  
0.4108281474  
0.8223271428  
1.135334789  
1.337024128  
1.427981058  
1.421521114  
1.341205493  
1.216996309  
1.080681143  
0.9612985023  
0.8812612304  
0.8537275863  
0.8815490292  
0.9578372631  
1.067964208  
1.192553218  
1.310936087  
1.404483117  
1.459309966  
1.467983651  
1.430075645  
1.351577793  
1.243424561  
1.119439684  
0.9941297592  
0.8806927117  
0.7895436308  
0.7275170207  
0.697777905  
0.7003107738  
0.732789779  
0.7915609564  
0.8725025207  
0.9715752536  
1.084990816  
1.209019093  
1.339565352  
1.471705756  
1.599386271  
1.715450599  
1.812100107  
1.881755566  
1.918215862  
1.917888314  
1.880843078  
1.811418211  
1.718192301  
1.613213486  
1.510526031  
1.424165617  
1.365902469  
1.343093105  
1.357004233  
1.401917438  
1.46522677  
1.528579404  
1.569942739  
1.566352838  
1.496947933  
1.345877812  
1.104652853  
0.7736160372  
0.362306651  
-0.1113093046  
-0.6226345874  
-1.143000903  
-1.642634646  
-2.093636548  
-2.472607203  
-2.762620919  
-2.954366686  
-3.046410188  
-3.044636174  
-2.961038162  
-2.812072918  
-2.616814641  
-2.395121543  
-2.165981331  
-1.94614133  
-1.749076372  
-1.584310209  
-1.457068422  
-1.368245467  
-1.314666536  
-1.289626987  
-1.283691458  
-1.285727914  
-1.284109256  
-1.268007185  
-1.228643472  
-1.16037077  
-1.061433563  
-0.9342958821  
-0.7854659164  
-0.6248159381  
-0.4644611877  
-0.3173334861  
-0.1956276368  
-0.1093155761  
-0.06492587024  
-0.06473299607  
-0.1064547523  
-0.1834820516  
-0.285598759  
-0.400089913  
-0.5130940897  
-0.6110312745  
-0.6819453906  
-0.7166122699  
-0.7093061259  
-0.6581580025  
-0.565101241  
-0.4354310049  
-0.2770718427  
-0.09965362032  
0.0864744464  
0.2711663103  
0.4452452214  
0.6010431006  
0.7326891175  
0.836173763  
0.9092379735  
0.9511665437  
0.9625622593  
0.945160732  
0.901722827  
0.8359861744  
0.7526542347  
0.6573425294  
0.5564265749  
0.4567345129  
0.3650690969  
0.2875768672  
0.2290484179  
0.192244795  
0.1773924247  
0.1819593965  
0.2008126566  
0.2267858114  
0.2516247523  
0.2672068358  
0.266857645  
0.2465647902  
0.2058691874  
0.1482643805  
0.08099031018  
0.0142050766  
-0.04037666558  
-0.07119257164  
-0.06864108992  
-0.02669704118  
0.05592352054  
0.1752663309  
0.3224034686  
0.4844520357  
0.6462052702  
0.7921370048  
0.9084789155  
0.9850536227  
1.016586544  
1.003302611  
0.9507316305  
0.8687598154  
0.7700980138  
0.6684079921  
0.5763768085  
0.5040293684  
0.4575131747  
0.4385109053  
0.4443296572  
0.4686049077  
0.5024775651  
0.5360291467  
0.5597401951  
0.5657615714  
0.5488186555  
0.5066609229  
0.4400366287  
0.3522587018  
0.2484764464  
0.1348080312  
0.01749007375  
-0.09783434672  
-0.2065931209  
-0.3055070464  
-0.3925647334  
-0.4668193375  
-0.5280869608  
-0.5766341056  
-0.6129253249  
-0.6374825596  
-0.6508650999  
-0.6537589178  
-0.6471299487  
-0.6323967462  
-0.6115682318  
-0.5873074823  
-0.5628942393  
-0.542086655  
-0.5288890174  
-0.527251153  
-0.5407299867  
-0.5721389955  
-0.6232189984  
-0.6943480143  
-0.7843103481  
-0.8901551073  
-1.00715539  
-1.128904081  
-1.24756055  
-1.354274111  
-1.439776957  
-1.495121186  
-1.512509603  
-1.48613057  
-1.41289404  
-1.29295454  
-1.12991816  
-0.9306734379  
-0.7048164752  
-0.4637308574  
-0.2194222005  
0.01673725742  
0.2351648969  
0.4289593615  
0.5943731747  
0.7308084547  
0.8403345164  
0.9268232217  
0.9948699152  
1.048687878  
1.091198245  
1.123473525  
1.144634044  
1.152210287  
1.142889622  
1.113486514  
1.061942034  
0.988140541  
0.8943791382  
0.7853896174  
0.6679003078  
