42.64716883  
50.85176554  
70.77295398  
124.1696129  
145.7673653  
8856.670138  
102599.8121  
25056.50983  
35051.37168  
17624.96718  
21373.98427  
36647.37066  
4947.746667  
1731.029988  
11121.12124  
11956.60553  
12941.59653  
39485.72969  
4832.971954  
15059.64949  
13391.94262  
14342.24253  
4616.43224  
1993.575076  
14216.28721  
8232.539792  
13496.97296  
1652.775983  
12436.92761  
7934.465374  
8308.665256  
412.1863751  
4993.77755  
5697.362515  
5805.845709  
450.3169953  
982.7658453  
993.3421877  
1486.175841  
484.9620816  
481.0597209  
1022.042001  
503.6081222  
194.1852246  
2693.506491  
2527.758447  
671.0772094  
156.7013247  
375.9816176  
315.7576669  
431.6218352  
412.7065585  
1196.115906  
872.3333337  
298.541071  
189.8901431  
422.5588679  
148.4169717  
335.2044588  
989.4669788  
337.2407709  
353.1916846  
294.1536457  
161.343251  
327.1055596  
41.37333283  
82.82205816  
26.28917327  
41.39617941  
0.528455619  
5.430992286  
5.62974457  
0.1212385702  
4.084998869  
4.73475243  
0.7146956428  
0.3436428023  
0.2826659529  
0.6541082877  
0.04703085139  
0.162503692  
0.0009120340673  
0.02120106731  
0.175078981  
0.007319936979  
0.04661240982  
0.02679242699  
0.008441029604  
0.02544199147  
0.004023960832  
0.004825381907  
0.007820141578  
0.006174763608  
0.005609450664  
0.009816110815  
0.00468520203  
0.008578795749  
0.007723967468  
0.006007050413  
0.007027303893  
0.0063372513  
0.005236359218  
0.006506900109  
0.006145360039  
0.005595184435  
0.006060268664  
0.005198438401  
0.005321210831  
0.005547360305  
0.005002612711  
0.005289394659  
0.005068635512  
0.004941257277  
0.004922939973  
0.004779833043  
0.004727418393  
0.004662043875  
0.004477781917  
0.004490455393  
0.004413815952  
0.004254589713  
0.004233620072  
0.00415082052  
0.004074810122  
0.004032954685  
0.003949675443  
0.003876313477  
0.003822998099  
0.003738424865  
0.003681488766  
0.003627956198  
0.003560268923  
0.00351577273  
0.003452963696  
0.003396367279  
0.003341249712  
0.003289618026  
0.003236508666  
0.003187840143  
0.003137499143  
0.003089004935  
0.003043242716  
0.002995208798  
0.002953612201  
0.0029096841  
0.002866473994  
0.002825614625  
0.002785002368  
0.002744838613  
0.002706387419  
0.002668958365  
0.002631757021  
0.002595750082  
0.00256017682  
0.002525695859  
0.002492071204  
0.002459053142  
0.002426334999  
0.002395027527  
0.002363932231  
0.002333430197  
0.002303862453  
0.002274501655  
0.002246019499  
0.002218038971  
0.002190754232  
0.002163760558  
0.00213849038  
0.002112006382  
0.002086457713  
0.002061579577  
0.002037815073  
0.002014065507  
0.001991002741  
0.001967973943  
0.001945421582  
0.001924103669  
0.001901668716  
0.001881004909  
0.001860014841  
0.00184011623  
0.001819964589  
0.001799923188  
0.001780656811  
0.00176211393  
0.001743499175  
0.001725004737  
0.001707295691  
0.001689560849  
0.001672398618  
0.001655019405  
0.001638724476  
0.001622420005  
0.001606519006  
0.001590526506  
0.001574848981  
0.001559255622  
0.001544496393  
0.001530081863  
0.001515536621  
0.001500847303  
0.001486692388  
0.001473390764  
0.00145957235  
0.001446245814  
0.00143291775  
0.001419813199  
0.001407407349  
0.001394545732  
0.001382572358  
0.001369792718  
0.001358407225  
0.001346868017  
0.001335111911  
0.001323495714  
0.00131253693  
0.001301213831  
0.001290483918  
0.001279901143  
0.001268781638  
0.001259248117  
0.001248868404  
0.001238468094  
0.001228367962  
0.001218760087  
0.001209531162  
0.00119996375  
0.00119003284  
0.001180710954  
0.001172120242  
0.001163266115  
0.001154558735  
0.00114556763  
0.001137789015  
0.001128088926  
0.001120347581  
0.001112126142  
0.001103994353  
0.001096081272  
0.001087984785  
0.001080746176  
0.001072665511  
0.001064924062  
0.001058012957  
0.001050438843  
0.001043085943  
0.001035902195  
0.00102866384  
0.001021958255  
0.001015215348  
0.001008218343  
0.001001548717  
0.0009948732353  
0.0009884283192  
0.0009826033328  
0.000975567309  
0.0009696791577  
0.0009633235912  
0.0009575032597  
0.0009513156918  
0.0009453687161  
0.0009398636094  
0.0009336080857  
0.0009280499737  
0.0009227556169  
0.000916973651  
0.0009112519194  
0.0009057145056  
0.0009004917804  
0.0008953323162  
0.0008901674811  
0.0008847256218  
0.0008798408013  
0.0008746647661  
0.0008699943219  
0.0008650231815  
0.0008599949363  
0.0008551638424  
0.0008503766962  
0.0008461537658  
0.0008412952074  
0.0008365849179  
0.0008322231031  
0.0008278135163  
0.0008233873293  
0.0008190039771  
0.0008146008649  
0.000810451392  
0.0008062681012  
0.0008024673919  
0.0007980168  
0.0007943287575  
0.0007903444884  
0.0007860607949  
0.0007822860578  
0.0007784396274  
0.0007747611578  
0.0007711020896  
0.0007668007138  
0.0007636712708  
0.0007598452472  
0.0007560945139  
0.0007527298707  
0.0007492052923  
0.0007460278553  
0.0007423262545  
0.0007388662726  
0.0007358031671  
0.0007321698205  
0.0007291879521  
0.0007256552842  
0.0007229842208  
0.0007195356826  
0.0007165389465  
0.0007134245481  
0.0007103087922  
0.0007071417883  
0.0007044560112  
0.0007014034643  
0.0006983252964  
0.0006954553262  
0.0006927118156  
0.0006898406518  
0.0006871815164  
0.0006843294156  
0.0006818328106  
0.0006788088187  
0.0006764136562  
0.0006735158306  
0.0006710836008  
0.0006682941544  
0.0006658894451  
0.0006634433159  
0.0006611602803  
0.0006586625477  
0.000656138545  
0.0006538832547  
0.0006511966652  
0.0006488733465  
0.0006465607372  
0.0006442850338  
0.0006421075895  
0.0006399297363  
0.0006374302568  
0.0006352874441  
0.0006333363143  
0.0006311555275  
0.000629017371  
0.0006268253829  
0.0006246177244  
0.0006228805378  
0.0006205815432  
0.0006189231441  
0.0006167459642  
0.0006149596672  
0.0006129747014  
0.0006111542426  
0.0006093056888  
0.0006073505179  
0.0006054184795  
0.0006034638577  
0.0006019898734  
0.0006000497715  
0.0005981960708  
0.0005965956231  
0.0005948055478  
0.0005930264512  
0.0005913908973  
0.0005895006885  
0.0005880570318  
0.000586378264  
0.000584953167  
0.0005834971499  
0.0005817429699  
0.0005800845163  
0.0005785910827  
0.0005772586688  
0.0005757756695  
0.0005742823528  
0.000572573508  
0.0005713733637  
0.0005701109387  
0.0005685382728  
0.0005670572138  
0.0005657961257  
0.0005643268237  
0.0005628970781  
0.0005618664731  
0.0005605146802  
0.0005592441366  
0.0005580764035  
0.0005568262176  
0.0005549950524  
0.0005540295101  
0.000553165427  
0.0005515578724  
0.0005506258475  
0.0005494441661  
0.0005484304037  
0.0005473244633  
0.0005460671705  
0.0005450949104  
0.0005440783688  
0.0005429794933  
0.0005417588415  
0.0005408606707  
0.0005395402462  
0.0005385761947  
0.0005375828226  
0.0005364622492  
0.0005358009309  
0.0005350195529  
0.0005340217109  
0.0005330247697  
0.0005321005238  
0.0005312065575  
0.0005301611666  
0.0005296802113  
0.0005285539351  
0.0005275599257  
0.0005267484991  
0.0005258542023  
0.000525261662  
0.0005241973267  
0.0005237731367  
0.0005229570237  
0.000521818831  
0.0005214094226  
0.0005206667657  
0.0005197930987  
0.0005192301902  
0.0005187442436  
0.0005177108173  
0.0005175036282  
0.0005163572803  
0.0005158718624  
0.0005151754452  
0.0005149200534  
0.0005139841859  
0.0005136474108  
0.000513017966  
0.0005120391076  
0.0005118338177  
0.0005109111524  
0.0005105366509  
0.0005099855903  
0.0005096087404  
0.0005090811084  
0.0005084660169  
0.0005082974922  
0.0005075605553  
0.0005070155095  
0.0005068240918  
0.0005063887837  
0.0005060276744  
0.0005054054692  
0.0005050729578  
0.0005047518994  
0.0005042499462  
0.0005038606123  
0.0005036414907  
0.0005032674473  
0.0005029442356  
0.0005022623459  
0.0005021939974  
0.0005020063021  
0.0005015031499  
0.0005012388682  
0.0005008744302  
0.0005006809634  
0.000500711294  
0.0005002648794  
0.000499884964  
0.0004998989557  
0.0004997393859  
0.0004996552556  
0.0004992674345  
0.0004989988745  
0.0004989321311  
0.0004987655844  
0.0004984280501  
0.0004987988595  
0.0004988691831  
0.0004985048064  
0.0004981386274  
0.0004983009957  
0.0004982040656  
0.000497794551  
0.000498024983  
0.0004976656389  
0.0004978562719  
0.0004978527515  
0.0004978933984  
0.0004976800056  
