-0.149125364  
-0.2798318795  
-0.3949794847  
-0.4795339916  
-0.5218342422  
-0.5149935108  
-0.4577557314  
-0.3547016965  
-0.2157589312  
-0.05506995065  
0.1106633852  
0.2641640335  
0.3896560971  
0.4747756206  
0.5120736927  
0.4999082482  
0.4426088527  
0.3498753301  
0.2354791036  
0.1154349287  
0.005878822531  
-0.07906721291  
-0.1291515131  
-0.1393161378  
-0.1103067143  
-0.04847610946  
0.03519052219  
0.1266968251  
0.2110773478  
0.274574104  
0.3066348083  
0.3014501986  
0.2588039817  
0.1841075179  
0.08761734036  
-0.01706006932  
-0.1149525364  
-0.1919056582  
-0.2366428669  
-0.2423968349  
-0.207876457  
-0.1374281047  
-0.04038766915  
0.07027715787  
0.1798129449  
0.2737364456  
0.3397970815  
0.3695698403  
0.3594704171  
0.3110833449  
0.2307986492  
0.128853702  
0.01794785525  
-0.08835055585  
-0.1771977602  
-0.2378699096  
-0.2628239105  
-0.2483414381  
-0.1947414005  
-0.106180744  
0.009884918842  
0.1435057881  
0.2832177632  
0.4171105701  
0.5339067208  
0.6239673488  
0.6801572235  
0.6984893702  
0.6784928303  
0.6232452602  
0.5390533277  
0.434783895  
0.320903319  
0.208313267  
0.1071161763  
0.02546071659  
-0.03138321784  
-0.06158946331  
-0.06689822492  
-0.05227615669  
-0.02515593495  
0.00563048055  
0.03107620796  
0.04319786619  
0.03605002792  
0.006414315066  
-0.04590064321  
-0.1181682871  
-0.2051968195  
-0.3000263912  
-0.3947401517  
-0.4812589905  
-0.5520163061  
-0.6004454701  
-0.6212662666  
-0.6105964594  
-0.5659541925  
-0.4862189543  
-0.3716293192  
-0.2238572639  
-0.04616861883  
0.1563627407  
0.3766560345  
0.6055452432  
0.8319124856  
1.043123827  
1.225803621  
1.366925129  
1.455126758  
1.482091716  
1.443785052  
1.341325451  
1.18129627  
0.9753590502  
0.7391531697  
0.4905674536  
0.2476012492  
0.02611752284  
-0.1621586588  
-0.3110691708  
-0.4206223589  
-0.4966434122  
-0.5495140438  
-0.5921946981  
-0.6378604166  
-0.697541155  
-0.7781696986  
-0.8813603968  
-1.00312231  
-1.134533406  
-1.263250202  
-1.375568305  
-1.458674145  
-1.502697854  
-1.502226483  
-1.457040338  
-1.3719853  
-1.256040498  
-1.120782649  
-0.9785456067  
-0.840603746  
-0.7156916762  
-0.6090874288  
-0.5223705399  
-0.4538373128  
-0.3994381234  
-0.354013541  
-0.3125780176  
-0.2714001388  
-0.2287073744  
-0.1849157835  
-0.1423876703  
-0.1048135749  
-0.07636439354  
-0.06078669085  
-0.06060558527  
-0.07654669526  
-0.1072416033  
-0.1492096091  
-0.1970786248  
-0.2439717874  
-0.2819950002  
-0.3027800299  
-0.2980704902  
-0.2603576788  
-0.1835881264  
-0.06395182454  
0.09928377659  
0.3029711904  
0.5394490651  
0.7962511944  
1.056334027  
1.298966506  
1.501341038  
1.640846805  
1.697816827  
1.65842468  
1.517323577  
1.27958358  
0.9615258196  
0.5901702426  
0.2011921612  
-0.1644909278  
-0.4651730601  
-0.6633165439  
-0.7303833257  
-0.6508623426  
-0.424909839  
-0.06917322105  
0.3843851044  
0.8915851385  
1.400707425  
1.858189521  
2.214653421  
2.430507293  
2.480437169  
2.35623218  
2.067599792  
1.640885938  
1.115863773  
0.5410060044  
-0.03216970912  
-0.5549774668  
-0.9869364033  
-1.299982949  
-1.481017386  
-1.532496246  
-1.471023808  
-1.324174716  
-1.125981766  
-0.9117276462  
-0.7127530773  
-0.552010129  
-0.4409887995  
-0.3784719106  
-0.3513266976  
-0.3372590126  
-0.3091702793  
-0.2405199449  
-0.1109071336  
0.08898274519  
0.3538869819  
0.6625884316  
0.9790433252  
1.256070225  
1.441260517  
1.48442423  
1.345577031  
1.00231563  
0.455409447  
-0.2683910591  
-1.116999806  
-2.017292265  
-2.882716669  
-3.6233608  
-4.157171396  
-4.420783204  
-4.378382425  
-4.027248421  
-3.399070687  
-2.556736236  
-1.586951717  
-0.5896882058  
0.3341005213  
1.094778431  
1.624666614  
1.885611484  
1.872547496  
1.612727233  
1.160903922  
0.5913110218  
-0.01233579704  
-0.5673807973  
-1.001924661  
-1.262493313  
-1.318868731  
-1.165727998  
-0.821181227  
-0.3227051388  
0.2787446946  
0.9255231204  
1.560051117  
2.130747871  
2.596554568  
2.929744435  
3.116976281  
3.158771339  
3.067750414  
2.866046429  
2.582291522  
2.248527353  
1.897289351  
1.559009551  
1.259813258  
1.019731392  
0.8513405837  
0.7588698745  
0.7378289602  
0.7752547991  
0.8506557244  
0.9377045354  
1.00665502  
1.027348804  
0.9725684666  
0.8213930684  
0.5621494836  
0.1945481409  
-0.2693476642  
-0.805545464  
-1.379990324  
-1.951733927  
-2.47706936  
-2.914154492  
-3.227553991  
-3.392131851  
-3.39580078  
-3.24079245  
-2.943302007  
-2.531578201  
-2.042729122  
-1.51866244  
-1.001673349  
-0.5302068087  
-0.1352735171  
0.1621114231  
0.3522399299  
0.4367161654  
0.4272371909  
0.3433940253  
0.2097950222  
0.05290528431  
-0.1020403538  
-0.2337025185  
-0.326620729  
-0.3723575301  
-0.3697284147  
-0.3241755139  
-0.2464087528  
-0.1505213444  
-0.05183149979  
0.03529057595  
0.09935060412  
0.133194624  
0.1348525643  
0.1076704057  
0.05973319805  
0.002663484871  
-0.05004148608  
-0.08491159862  
-0.09038260748  
-0.05840392945  
0.01445345206  
0.1265337532  
0.2713360206  
0.4384108142  
0.6147660038  
0.7865588319  
0.9408128407  
1.066888832  
1.157511864  
1.209206023  
1.222122146  
1.199335592  
1.145778871  
1.06704516  
0.9682882932  
0.8534348048  
0.7248417996  
0.5834374139  
0.4292899947  
0.2624609508  
0.08393333923  
-0.1035935767  
-0.295242979  
-0.4839492611  
-0.6609370119  
-0.8166194157  
-0.9417694585  
-1.028752333  
-1.072600622  
-1.071731916  
-1.028184738  
-0.9473352773  
-0.8371566241  
-0.7071630329  
-0.5672447475  
-0.4265982  
-0.2929370862  
-0.1720921594  
-0.0680314234  
0.01677792674  
0.08080649474  
0.122887403  
0.1418218374  
0.1363077043  
0.1052526202  
0.04843979178  
-0.03260266149  
-0.1337375356  
-0.2476179657  
-0.3635788685  
-0.4681867254  
-0.546479104  
-0.5837951275  
-0.5679544205  
-0.4914278067  
-0.3531054235  
-0.1592827011  
0.07640202286  
0.3341972097  
0.5905371339  
0.8211211768  
1.00432589  
1.124394008  
1.173875687  
1.154863017  
1.078768888  
0.9646225514  
0.8361083804  
0.7177980999  
0.6311748202  
0.5910940961  
0.6032856106  
0.6633239925  
0.7572787029  
0.8639660404  
0.9584741348  
1.016400817  
1.018127366  
0.9524242814  
0.8187805449  
0.6280438125  
0.4012193096  
0.1665731493  
-0.0445414938  
-0.2025113325  
-0.2841882732  
-0.2767811446  
-0.1802833057  
-0.008039720827  
0.2146714879  
0.4538531576  
0.6713420847  
0.8300333184  
0.8990204978  
0.8579021719  
0.699646711  
0.4316209244  
0.07466803155  
-0.3396075374  
-0.772930514  
-1.185235644  
-1.539659998  
-1.806974856  
-1.968896191  
-2.019876331  
-1.967197162  
-1.82941613  
-1.633428599  
-1.410573278  
-1.192325499  
-1.006151426  
-0.8720670608  
-0.8003308084  
-0.7905474135  
-0.832263492  
-0.9069319583  
-0.9909402085  
-1.059261943  
-1.089206052  
-1.06374114  
-0.9739411291  
-0.8202341929  
-0.6123035998  
-0.3676980003  
-0.109375469  
0.1374450819  
0.3486551377  
0.5043774782  
0.5913999075  
0.6046008182  
0.5472140163  
0.4299347981  
0.2690693184  
0.08404336049  
-0.1053127705  
-0.2812737562  
-0.4301523731  
-0.5433870629  
-0.6176838022  
-0.654268379  
-0.6574682429  
-0.632948524  
-0.5859755999  
-0.5200700684  
-0.4363046398  
-0.3333850142  
-0.2084776457  
-0.05859814266  
0.1177411904  
0.3189933964  
0.5394957985  
0.7691259507  
0.9938246322  
1.196971321  
1.361418025  
1.471866696  
1.517193182  
1.49231851  
1.399288847  
1.247358748  
1.05202627  
0.8331534803  
0.6124529893  
0.4107275066  
0.2452927719  
0.1279770599  
0.06399407806  
0.05183792355  
0.08417975618  
0.1495761091  
0.2346808373  
0.3265648134  
0.4147582629  
0.492665629  
0.5581415498  
0.6131459194  
0.6625619037  
0.7124055038  
0.7677553092  
0.8307951324  
0.8993420162  
0.9661771904  
1.019364628  
1.043599007  
1.022442026  
0.9411561218  
0.7897042392  
0.5654361368  
0.2749636058  
-0.06517246083  
-0.4292875337  
-0.7848323323  
-1.09594476  
-1.327859325  
-1.451564446  
-1.448020002  
-1.311278867  
-1.049976644  
-0.6869062207  
-0.2566615003  
0.1983387885  
0.6329034626  
1.004457209  
1.277999636  
1.429934167  
1.450258263  
1.342888341  
1.124175438  
0.8199465275  
0.461609362  
0.08195201052  
-0.2887342275  
-0.6256940663  
-0.9115786067  
-1.137028164  
-1.300072551  
-1.40461159  
-1.458363523  
-1.470686948  
-1.450654411  
-1.405651821  
-1.34065958  
-1.25822384  
-1.159018416  
-1.042794024  
-0.9094887955  
-0.7602494482  
-0.5981697834  
-0.4286090697  
-0.2590381951  
-0.09844064888  
0.04362611776  
0.1581606761  
0.2378505906  
0.2780331507  
0.2773249907  
0.2378203139  
0.1648196765  
0.06611835362  
-0.04903433951  
-0.171156948  
-0.291747179  
-0.4042937224  
-0.5049282771  
-0.5926125683  
-0.668827382  
-0.7368154704  
-0.8005014311  
-0.8632720687  
-0.9268298246  
-0.9903238066  
-1.049929612  
-1.09897747  
-1.128645301  
-1.1291422  
-1.091220038  
-1.00779274  
-0.8754116308  
-0.6953459581  
-0.4740723718  
-0.2230459351  
0.04226249057  
0.3039745012  
0.5438612533  
0.7455749678  
0.896742306  
0.9906090633  
1.02698593  
1.012335271  
0.9589679422  
0.8834429496  
0.8043885876  
0.7400377371  
0.7058270103  
0.7123816356  
0.7641571205  
0.8589145107  
0.9880741055  
1.137879735  
1.291192629  
1.429654243  
1.535928422  
1.595723976  
1.599364655  
1.542728371  
1.42749271  
1.260695813  
1.053730295  
0.8209274723  
0.5779368  
0.3401004696  
0.1209984576  
-0.06869168137  
-0.2219403903  
-0.3356805857  
-0.4106931088  
-0.4511161782  
-0.4636388518  
-0.4564639697  
-0.4381443752  
-0.4163849909  
-0.3969390587  
-0.3827116917  
-0.3731919231  
-0.3643157852  
-0.3488356329  
-0.3172170252  
-0.2590177339  
-0.1646352108  
-0.02722183865  
0.1554812128  
0.3796736762  
0.634666999  
0.902917098  
1.161043325  
1.38183305  
1.537084452  
1.600990652  
1.553667007  
1.384337373  
1.093703128  
0.6950776415  
0.2140087187  
-0.3137001189  
-0.8454295062  
-1.336290563  
-1.744218673  
-2.034956077  
-2.186221866  
-2.190462456  
-2.055753458  
-1.804687328  
-1.471371538  
-1.096962034  
-0.7243641403  
-0.3928751152  
-0.1335319575  
0.03418713437  
0.1038884266  
0.08188099035  
-0.01494402654  
-0.1625403871  
-0.3338295899  
-0.5028343333  
-0.6481794783  
-0.7554700366  
-0.8182702003  
-0.8376644347  
-0.8206207281  
-0.777561816  
-0.7196531131  
-0.6563295983  
-0.5934974344  
-0.5326978024  
-0.4713168674  
-0.4037391951  
-0.3231598863  
-0.2236719514  
-0.1021903187  
0.04016362608  
0.1975102929  
0.3596075012  
0.5131568406  
0.6437984141  
0.7384607873  
0.7876557403  
0.7873139476  
0.7398203235  
0.6540445682  
0.544319777  
0.4284970286  
0.3253570359  
0.2517688672  
0.2200338816  
0.2358251163  
0.2970489636  
0.393807242  
0.5094829881  
0.6228001191  
0.7105629479  
0.7507035894  
0.7252205276  
0.6226181662  
0.4395510848  
0.1814721584  
-0.1377660706  
-0.4972835755  
-0.8713265899  
-1.231933769  
-1.551793241  
-1.80696214  
-1.979146058  
-2.057301476  
-2.038393907  
-1.927251629  
-1.735562221  
-1.48015096  
-1.180776439  
-0.8577386869  
-0.5296244401  
-0.2114891748  
0.08626967553  
0.3582097902  
0.6032935694  
0.8236103183  
1.022625557  
1.203287981  
1.366375164  
1.509412386  
1.626419375  
1.708579293  
1.745762383  
1.728660258  
1.651153711  
1.512463472  
1.318648589  
1.083095232  
0.8258075099  
0.571504044  
0.3467471201  
0.1764916094  
0.08057922288  
0.07072145215  
0.1484649439  
0.30448883  
0.51938619  
0.7658534348  
1.011995498  
1.225292645  
1.376668291  
1.444095146  
1.41525076  
1.28887474  
1.074679607  
0.7918688216  
0.4665099541  
0.1281519712  
-0.1938335763  
-0.4737081441  
-0.6921774414  
-0.8382468347  
-0.9099395487  
-0.9138612418  
-0.8637396474  
-0.7781907024  
-0.6780320128  
-0.5835092746  
-0.5117766558  
-0.4749220201  
-0.4787474737  
-0.5224018086  
-0.5988666204  
-0.6961861513  
-0.7992560303  
-0.8919194704  
-0.9591107845  
-0.9887806317  
-0.9733822896  
-0.9107660415  
-0.8044026291  
-0.6629299736  
-0.4991174137  
-0.3283736104  
-0.1669897582  
-0.03031438755  
0.06894296087  
0.1221040243  
0.1254717296  
0.08074961758  
-0.005110618317  
-0.120615867  
-0.2509279078  
-0.3794346076  
-0.4895420211  
-0.5665050628  
-0.5991030463  
-0.5809646227  
-0.5113794017  
-0.3954797736  
-0.2437391687  
-0.0708154357  
0.1061393486  
0.269521017  
0.4034124563  
0.4955482833  
0.5388374103  
0.5322298016  
0.4807923802  
0.3949655798  
0.2890902273  
0.1793980306  
0.08173570235  
0.009341532974  
-0.02900686694  
-0.03021346774  
0.002729260103  
0.06121320943  
0.1323090022  
0.2007074628  
0.2510382458  
0.270243315  
0.249662428  
0.1865296322  
0.08464304735  
-0.04590882423  
-0.1899660651  
-0.3293210854  
-0.4452947899  
-0.5215157081  
-0.5465124629  
-0.5157244603  
-0.4326000513  
-0.3085629773  
-0.161773617  
-0.01479270793  
0.1085762447  
0.1868424691  
0.204257953  
0.1535842532  
0.0377231673  
-0.1301400467  
-0.3279963421  
-0.5279647444  
-0.7003698341  
-0.8183774489  
-0.8624775155  
-0.8240921836  
-0.707663127  
-0.5307831487  
-0.3222151711  
-0.1179858863  
0.0439538548  
0.1297230893  
0.1152512183  
-0.009170991087  
-0.2363142112  
-0.5419137868  
-0.8871853617  
-1.223667489  
-1.499717959  
-1.667709309  
-1.690826061  
-1.548418472  
-1.239070041  
-0.7809196616  
-0.2092015795  
0.4285767926  
1.079022915  
1.689788756  
2.215950636  
2.624885508  
2.898966792  
3.035809521  
3.046209882  
2.950321673  
2.772875412  
2.538373685  
2.267137224  
1.972868795  
1.662072471  
1.335294887  
0.9897986909  
0.62300568  
0.2359197306  
-0.1642429232  
-0.5628211577  
-0.9381921335  
-1.263951147  
-1.512440156  
-1.659013443  
-1.686278399  
-1.587544401  
-1.368845281  
-1.049133439  
-0.6585538504  
-0.2350271718  
0.1803546566  
0.5484265488  
0.836772727  
1.023555915  
1.099797773  
1.069810588  
0.9497610107  
0.7646479731  
0.5441936136  
0.3183131282  
0.1128626234  
-0.05370555102  
-0.1723068157  
-0.2435786017  
-0.2766480125  
-0.2865904054  
-0.2910498634  
-0.3066159577  
-0.3455624413  
-0.4134869985  
-0.5082220529  
-0.6201848399  
-0.7340853231  
-0.8317028425  
-0.8952632869  
-0.9108521954  
-0.8712917038  
-0.7779886619  
-0.6414200034  
-0.4801300459  
-0.3183538729  
-0.1825989736  
-0.0976871806  
-0.08286044468  
-0.1485590522  
-0.2943809616  
-0.5085720434  
-0.7691514893  
-1.046535586  
-1.307290442  
-1.518470339  
-1.651908148  
-1.687847854  
-1.617399604  
-1.443503628  
-1.180299579  
-0.8510542623  
-0.4849859931  
-0.1134921725  
0.2336814989  
0.5317951827  
0.7635715679  
0.9204933708  
1.002864352  
1.018740457  
0.9819899165  
0.9098367717  
0.8202847636  
0.7297898086  
0.6514706605  
0.5940375672  
0.5614824588  
0.5534642883  
0.5662120927  
0.5937265805  
0.6290357357  
0.6653024058  
0.696631349  
0.7185106755  
0.7279046431  
0.7230709848  
0.7032234389  
0.6681716618  
0.6180370064  
0.553119476  
0.473923711  
0.3813064883  
0.2766867241  
0.1622170377  
0.04085753235  
-0.08370834821  
