19.54448269  
17.94776937  
14.88379521  
13.93799963  
60.39631063  
1451.356688  
29196.27292  
65223.70051  
63447.17649  
37091.43256  
38303.95448  
4118.25545  
74.77954322  
20775.30578  
42.68481285  
7380.196594  
16736.41488  
4270.669744  
921.1053342  
401.9676075  
23498.33008  
485.4532396  
2811.702987  
9460.942602  
1596.718992  
6189.646425  
5043.389528  
19339.07443  
1962.629719  
9179.451864  
997.2782758  
10595.524  
5984.104947  
220.6015414  
1825.237369  
18719.37363  
8703.095825  
5433.8657  
1758.063959  
1774.493768  
337.9445752  
5699.630565  
777.5143661  
5707.294927  
937.1832741  
576.6300883  
1955.974104  
16818.0594  
3119.186697  
7285.603382  
5262.588507  
353.0228485  
1623.742956  
332.6528091  
238.6531853  
994.8863838  
986.1851033  
1362.124814  
5696.678508  
332.842409  
740.4590606  
141.0171202  
352.2676996  
64.15130044  
84.88797871  
133.4766075  
13.20652508  
38.11862664  
180.1215894  
0.5893285367  
62.91501771  
27.48481312  
11.73231522  
11.17038328  
13.72855092  
2.722300111  
13.44251246  
3.172145787  
6.612437733  
5.49495054  
6.315672962  
4.328287525  
4.859253462  
6.71687582  
4.062871921  
5.906938558  
4.300402531  
4.037610709  
3.533179937  
3.256313893  
2.78345321  
3.046957518  
2.741701787  
2.509528666  
2.534125912  
2.226887476  
2.200132989  
2.20481914  
1.988039137  
1.904613178  
1.833172786  
1.727021378  
1.672781452  
1.579405844  
1.53083566  
1.474223406  
1.409866805  
1.341771136  
1.289434415  
1.237919241  
1.194238588  
1.14330058  
1.101462364  
1.055199361  
1.016009688  
0.9763998596  
0.9402180173  
0.9056593372  
0.8731989547  
0.8432756463  
0.8136852091  
0.7837356532  
0.7565608603  
0.7308775284  
0.706141849  
0.6824427811  
0.6600438494  
0.6382728475  
0.6176650423  
0.5980603694  
0.5792169357  
0.5606500174  
0.5435916367  
0.5268949271  
0.5107863714  
0.4954634229  
0.480706227  
0.4665326076  
0.4529289132  
0.4398463443  
0.4272364675  
0.4151519709  
0.4035502559  
0.392332609  
0.3815343797  
0.3711132967  
0.3611459315  
0.3514615263  
0.3421443994  
0.3331577431  
0.3244950582  
0.3161328985  
0.3080479224  
0.3002569548  
0.2927403699  
0.2854447601  
0.2784127998  
0.271609091  
0.2650324481  
0.2586570544  
0.252508205  
0.2465549124  
0.2407723372  
0.2351998713  
0.2297700819  
0.224542106  
0.2194576272  
0.2145298417  
0.2097608666  
0.2051408816  
0.2006407836  
0.1962884545  
0.1920589949  
0.1879663664  
0.1839740415  
0.1801030366  
0.1763507136  
0.1726908246  
0.1691487299  
0.1657021118  
0.1623500094  
0.159103795  
0.1559339951  
0.1528601232  
0.149868338  
0.1469546574  
0.1441160657  
0.1413537981  
0.1386589251  
0.1360489027  
0.1335147808  
0.1310301612  
0.1286071689  
0.1262559884  
0.1239710001  
0.1217272953  
0.1195607976  
0.1174366762  
0.1153549023  
0.1133405983  
0.1113820334  
0.1094492343  
0.1075778385  
0.1057577637  
0.1039688545  
0.102224427  
0.1005290319  
0.09887433261  
0.0972434217  
0.0956681947  
0.09411752095  
0.09260630162  
0.09113836719  
0.08969134204  
0.08828034379  
0.08691149079  
0.08556061704  
0.08424451728  
0.08295932285  
0.0817026193  
0.08046930208  
0.07926676409  
0.07809124408  
0.07693515476  
0.07582085792  
0.07471182218  
0.07363680551  
0.07257444846  
0.07154564634  
0.07053563456  
0.06954129419  
0.06857458967  
0.06762496846  
0.06669848567  
0.06578394906  
0.06488983875  
0.06401541031  
0.0631580141  
0.06232156568  
0.06150692422  
0.0606982619  
0.05990259959  
0.05913208358  
0.05836819445  
0.05762383448  
0.05689944192  
0.05618320443  
0.05547490895  
0.05478784316  
0.05411659509  
0.0534547208  
0.05280451359  
0.05216575348  
0.0515384648  
0.05092644979  
0.05032460541  
0.04973178776  
0.04915630885  
0.0485802851  
0.0480258523  
0.04747380825  
0.04693367333  
0.04641085954  
0.04587941831  
0.0453755241  
0.04487793178  
0.04438372821  
0.04390226885  
0.04342263947  
0.04295291266  
0.04249873  
0.04204857986  
0.0416054163  
0.04117066002  
0.04074486269  
0.04032002549  
0.03990556391  
0.03949785824  
0.03910528816  
0.03871143229  
0.0383231413  
0.03794217776  
0.03756629583  
0.0372104882  
0.0368420484  
0.03648952915  
0.03613654363  
0.03579966813  
0.03546189759  
0.0351279039  
0.03479818745  
0.0344807506  
0.03416242414  
0.03385006691  
0.03354754022  
0.03324309633  
0.03294437105  
0.03265529812  
0.03236654195  
0.03208397922  
0.03180765108  
0.03153309493  
0.0312632201  
0.03099790348  
0.03073850283  
0.03048163354  
0.03022582786  
0.02997811529  
0.02972604422  
0.02948979596  
0.02925264308  
0.0290176245  
0.02878670582  
0.02855688676  
0.02833027419  
0.02811702  
0.02789841574  
0.02768408469  
0.02747358825  
0.02726352565  
0.02706488014  
0.02686254754  
0.02665733439  
0.02646505279  
0.02627430528  
0.02608502799  
0.02589526594  
0.02571101419  
0.02552743809  
0.02535303558  
0.02517563895  
0.02500091792  
0.0248305838  
0.02466026919  
0.02449586609  
0.0243315196  
0.02416684597  
0.02401057041  
0.02385280554  
0.0236976809  
0.02354232147  
0.02339620181  
0.0232475727  
0.02309760335  
0.02295516103  
0.02280937614  
0.02267614205  
0.02253876295  
0.0223970809  
0.02226827146  
0.02213320484  
0.02200671141  
0.02187605056  
0.02175263443  
0.02162677167  
0.02149640809  
0.02138080039  
0.02126329241  
0.02114309844  
0.02102399871  
0.02091213227  
0.02079802376  
0.02068452834  
0.02057804455  
0.02047115025  
0.02036350338  
0.02025735979  
0.02015135051  
0.02005070919  
0.01994660878  
0.01984839035  
0.01975318494  
0.01965438092  
0.01956006107  
0.01946780957  
0.01937284704  
0.01928140277  
0.01919461733  
0.01910729981  
0.01901767346  
0.01892875051  
0.01884700216  
0.01876408222  
0.01868272675  
0.0185997395  
0.01851659553  
0.0184354568  
0.0183643147  
0.01828390808  
0.01821000442  
0.01813600301  
0.01806135781  
0.01798803483  
0.0179150769  
0.01784714468  
0.01777541965  
0.0177090299  
0.01764177677  
0.01757636578  
0.0175099979  
0.01744384343  
0.01738166046  
0.01731970571  
0.01726044778  
0.01719872507  
0.01713977716  
0.01707978572  
0.01702237349  
0.01696334045  
0.01690978139  
0.0168549126  
0.01680190659  
0.01674876736  
0.01669521478  
0.01664375279  
0.01659445564  
0.01654519261  
0.01649442994  
0.01644606095  
0.01639913163  
0.01635036255  
0.01630416726  
0.01626068473  
0.01622038875  
0.01617526533  
0.01613069289  
0.01609202762  
0.01605023442  
0.01601042354  
0.01596820853  
0.01593027675  
0.01589217627  
0.01585221163  
0.01581811634  
0.01578163888  
0.01574281066  
0.01570827343  
0.01567718127  
0.01564424776  
0.01560911443  
0.01558109413  
0.01554732404  
0.01551818231  
0.01548730235  
0.01545867402  
0.01542893578  
0.01539910852  
0.01537302177  
0.01534725983  
0.01532168538  
0.01529608639  
0.01526821168  
0.01524603486  
0.01522501274  
0.01519695604  
0.01517790697  
0.01515660553  
0.01513570613  
0.01511978786  
0.01509630112  
0.0150747582  
0.01505579833  
0.01503773374  
0.01502081071  
0.01500775486  
0.01498990235  
0.01497464289  
0.01495739068  
0.01494219626  
0.01493184766  
0.01491592406  
0.01490367744  
0.01489616723  
0.01488137164  
0.01486781036  
0.01485843458  
0.01484781473  
0.01483866607  
0.01483070074  
0.01482131435  
0.01481313284  
0.0148104813  
0.01480179683  
0.0147962834  
0.01479079098  
0.01478684877  
0.01478260173  
0.01477752411  
0.0147757398  
0.01477110387  
0.01476841611  
0.01476897508  
0.0147664671  
0.01476735834  
