2.584975021  
3.985399139  
6.912669292  
12.58321566  
50.62511021  
1863.065805  
14550.18241  
3130.082703  
2953.865476  
1385.1279  
10154.02004  
22300.21324  
30387.9664  
24432.14988  
13918.9892  
25718.27479  
15070.93509  
25575.44595  
18820.96815  
16167.7376  
21484.75665  
8673.725581  
519.2740454  
10805.37458  
7090.566403  
22197.03487  
29542.81522  
42.67053342  
125.431967  
27105.00612  
5975.634648  
1516.45804  
9623.245032  
4668.03271  
16529.34349  
6770.909716  
1563.389735  
1406.347216  
8191.157328  
1982.62512  
2552.589584  
16495.79486  
349.749023  
1116.383887  
267.1809902  
1384.121844  
237.0943067  
4835.805824  
5830.163272  
10964.10616  
3227.001336  
2085.34658  
11005.22092  
1348.225341  
1178.692497  
5404.185114  
1556.390141  
308.6425905  
268.4296803  
17.47396899  
2755.375471  
253.0918707  
88.80155416  
332.1314959  
105.893205  
726.1012361  
47.38210839  
21.5772427  
73.74744912  
252.3550892  
17.54992579  
18.24171936  
18.28819083  
11.90818117  
11.24376063  
0.9861119142  
5.367152765  
2.580184304  
1.710918112  
2.381082581  
3.258164891  
3.19822782  
2.075841181  
1.753875979  
1.115907516  
1.874576008  
2.017357931  
2.071259026  
1.774871905  
1.28691874  
1.180760842  
1.076327664  
1.163497635  
1.230150262  
0.9907288604  
0.9396035323  
0.9727652024  
0.9316779629  
0.8595668829  
0.8405043066  
0.8081389612  
0.7723693861  
0.7484131497  
0.7132338645  
0.6996633623  
0.6590950828  
0.6467609997  
0.6211452477  
0.6055323468  
0.588012796  
0.5686680788  
0.5554092693  
0.5361003726  
0.5227397658  
0.5080015896  
0.4954243853  
0.4823622024  
0.4691227224  
0.4568539512  
0.4458220873  
0.4361062445  
0.424821107  
0.4148265415  
0.4055128776  
0.3960674124  
0.3871478904  
0.3785362566  
0.3704254146  
0.3625838622  
0.3549233694  
0.3475067411  
0.3403596994  
0.3334886374  
0.3268987936  
0.3204357017  
0.314237949  
0.3083112415  
0.3024791183  
0.2968848751  
0.2914177682  
0.2861160803  
0.2810352164  
0.2760651596  
0.2712603741  
0.2665934367  
0.262062432  
0.25765237  
0.2533731468  
0.2491997049  
0.2451825899  
0.2412615036  
0.2374572084  
0.2337461746  
0.2301158698  
0.2265726563  
0.22311917  
0.2198009831  
0.2165390374  
0.2133663826  
0.2102715225  
0.2072634672  
0.2043057182  
0.2014314658  
0.1986396869  
0.1959042547  
0.1932123296  
0.1906136962  
0.188070154  
0.185575925  
0.1831396026  
0.1807546104  
0.1784306145  
0.1761431276  
0.1739283132  
0.1717552245  
0.1696259879  
0.1675422469  
0.1654981427  
0.1635107765  
0.1615720681  
0.1596477998  
0.1577832356  
0.1559345571  
0.1541496063  
0.1523749366  
0.1506630659  
0.1489648815  
0.1473072759  
0.1456863839  
0.1440788501  
0.1425263363  
0.1409761026  
0.1394950435  
0.1380061555  
0.1365663196  
0.1351466685  
0.1337463954  
0.1323835294  
0.1310414337  
0.1297036067  
0.1284210622  
0.1271380612  
0.1258942179  
0.1246663929  
0.1234629199  
0.1222807985  
0.1211116291  
0.119964288  
0.1188479945  
0.1177393723  
0.1166512954  
0.1155909758  
0.1145326331  
0.1134934085  
0.112475973  
0.1114763363  
0.1104910634  
0.1095277317  
0.1085757663  
0.1076483146  
0.1067161621  
0.1058049127  
0.1049038513  
0.1040531019  
0.1031847381  
0.1023381058  
0.1015038224  
0.1006607047  
0.09986379265  
0.09905885191  
0.09827070956  
0.09748803325  
0.09672920227  
0.09599183879  
0.09523697027  
0.09450852306  
0.09379287438  
0.09308237167  
0.09237683994  
0.09168481871  
0.09101878491  
0.09034094321  
0.08968581359  
0.08904254934  
0.08839817553  
0.08777467711  
0.08714964948  
0.08654656377  
0.08591972891  
0.08533066829  
0.08474176023  
0.08415931707  
0.083584265  
0.08303548411  
0.08247151091  
0.08191472257  
0.08138074905  
0.08084154129  
0.0803200628  
0.07981291986  
0.0792926555  
0.07878581744  
0.07827639805  
0.07780455943  
0.07730511312  
0.07682532237  
0.07634559215  
0.07588395767  
0.07542301568  
0.07497420058  
0.07452047241  
0.07408143117  
0.07363784667  
0.0732052282  
0.07277983034  
0.0723602863  
0.07194607435  
0.07153174414  
0.07111922847  
0.07072494481  
0.07033198215  
0.06994752106  
0.0695603135  
0.06917649969  
0.0687974821  
0.06843295169  
0.06806496039  
0.06769191599  
0.06733976608  
0.06699482849  
0.06663241028  
0.06628861694  
0.06594325016  
0.0656206926  
0.06527602047  
0.06495886558  
0.06463130943  
0.06431407907  
0.06399105221  
0.06367671663  
0.06336420265  
0.0630588921  
0.06276775755  
0.06246085295  
0.06217367142  
0.06188123015  
0.06158326401  
0.06130567587  
0.06102834036  
0.06074155883  
0.06046444924  
0.06020055601  
0.05993155594  
0.0596662799  
0.05940568771  
0.05914379943  
0.05888807629  
0.05864159483  
0.05838686863  
0.05813807503  
0.05789233093  
0.05764545893  
0.0574049093  
0.05718756811  
0.05694396505  
0.05670992495  
0.05647635816  
0.05625273991  
0.05602945722  
0.05582158906  
0.05559676743  
0.05538552156  
0.05517447469  
0.05495742093  
0.05474714485  
0.05455106269  
0.054343905  
0.05414101274  
0.05394521389  
0.05374897166  
0.05356123257  
0.05336825382  
0.05316667763  
0.05299263678  
0.05280653119  
0.05261298668  
0.05243382548  
0.05225819317  
0.05208993256  
0.05191082467  
0.05173337399  
0.05156313194  
0.05139741501  
0.05122452908  
0.05106560277  
0.05091043354  
0.05074499801  
0.05057401796  
0.05042858477  
0.05027391441  
0.0501185133  
0.04996507111  
0.04981407098  
0.04966225306  
0.04951364776  
0.04937025906  
0.04922584824  
0.04908950953  
0.04894495708  
0.04880903884  
0.04866641846  
0.04853543342  
0.04840551174  
0.04827216471  
0.04813753973  
0.04801329695  
0.04789019717  
0.04775612436  
0.04763848214  
0.04751625162  
0.04738799321  
0.04726729905  
0.04714877572  
0.04703930187  
0.04692425519  
0.04680995049  
0.04669623062  
0.04659069351  
0.04648184296  
0.04635909565  
0.0462615802  
0.04615882096  
0.04605668535  
0.04594967876  
0.04584782847  
0.04574904066  
0.04565088089  
0.04555488594  
0.04545959102  
0.0453693534  
0.04527295972  
0.04518075344  
0.04509017717  
0.04500318487  
0.04490811491  
0.04481955115  
0.0447322566  
0.0446561733  
0.04456210228  
0.04448658751  
0.04440563795  
0.04432008873  
0.04423656984  
0.04416537258  
0.0440911233  
0.0440129002  
0.04394124554  
0.04386293296  
0.04378693802  
0.04372196272  
0.04364595883  
0.04357970895  
0.04351559336  
0.04344881579  
0.04338133605  
0.04331732518  
0.04325426215  
0.04319975175  
0.04313580043  
0.04306969459  
0.04301061506  
0.04296067682  
0.04289311073  
0.04284092408  
0.04278777688  
0.04273976324  
0.04268320713  
0.04262734939  
0.04257201712  
0.0425304489  
0.04247198233  
0.04242467516  
0.04237968716  
0.0423343762  
0.04229473924  
0.04224109413  
0.0422016877  
0.04215263677  
0.04212189001  
0.04207854156  
0.04203915156  
0.04199745056  
0.04196107371  
0.0419238785  
0.04188788139  
0.04185947714  
0.04182077675  
0.04179150993  
0.04175110473  
0.04172706432  
0.04169234114  
0.0416705243  
0.04164135598  
0.04162035045  
0.04158903179  
0.04156538233  
0.0415420472  
0.04151586306  
0.04149175563  
0.04146959555  
0.04144546335  
0.04143334464  
0.04140850989  
0.04139605931  
0.04137487381  
0.04135584486  
0.04134647954  
0.04132924257  
0.04131117869  
0.04130199619  
0.04129758918  
0.04127999515  
0.0412708017  
0.04125173233  
0.04125164493  
0.04125349773  
0.04123797415  
0.04123743185  
0.04122566543  
0.04121836188  
0.04121341957  
0.04121765184  
0.04122279443  
0.04120938252  
