142.8741756  
161.0865177  
199.4495385  
286.7318873  
417.9125448  
9394.396801  
25606.29619  
6149.913895  
10865.96868  
2038.700121  
17660.51124  
3370.507605  
4691.819267  
19731.97049  
3015.9135  
10564.46973  
6294.555121  
3826.825399  
3351.512813  
1138.240947  
1554.638163  
35430.35338  
8074.634531  
16853.37257  
3857.169231  
4329.19344  
11554.55185  
900.9412486  
21510.86491  
11926.36132  
17432.8109  
2971.945287  
928.1593073  
11444.76512  
3314.595681  
10657.14478  
16629.31899  
17994.0616  
4214.364226  
6918.404245  
8156.906512  
20163.32255  
6045.586337  
21515.2485  
917.9952558  
12374.63686  
15127.70516  
1313.99261  
11722.9509  
3256.834061  
2378.28574  
2807.441836  
9293.69021  
8444.729137  
2063.388325  
4247.647345  
6099.280748  
3613.650295  
292.3395477  
1117.72422  
1402.878297  
3186.067229  
452.9831509  
1329.51293  
403.5805413  
249.7827973  
756.110858  
281.7767108  
202.9703439  
187.0950662  
128.6311914  
17.68410825  
30.20309187  
43.10189742  
22.46344257  
17.67183078  
24.77906657  
6.939982348  
12.24471637  
13.18945902  
11.98571514  
10.63958923  
7.900782975  
7.82873256  
9.711660479  
7.411507062  
7.664328814  
8.221256776  
6.632756452  
6.565082756  
6.593189031  
6.309453049  
5.526315571  
5.547231407  
5.28016658  
5.244071351  
5.032963331  
4.856797513  
4.681700523  
4.571209684  
4.382016938  
4.210729623  
4.137956898  
4.024069317  
3.894637467  
3.756312915  
3.66200638  
3.564814408  
3.468912991  
3.383644972  
3.294630042  
3.212043877  
3.132089103  
3.057721226  
2.986458718  
2.911702695  
2.847417355  
2.783428549  
2.723320074  
2.66393639  
2.605583696  
2.550870528  
2.497459443  
2.4464866  
2.397027088  
2.349405003  
2.303555081  
2.259260141  
2.216084405  
2.174419879  
2.134100179  
2.095062813  
2.057324762  
2.020622712  
1.985095115  
1.950586309  
1.917215421  
1.88473474  
1.853227063  
1.822517884  
1.792735732  
1.763786591  
1.73564376  
1.708282661  
1.681557276  
1.655658792  
1.630362402  
1.605748849  
1.581766873  
1.558384927  
1.535600855  
1.513381284  
1.49173281  
1.470570574  
1.449945123  
1.429811851  
1.410157202  
1.390976672  
1.37221362  
1.353896161  
1.336003154  
1.3185108  
1.301411186  
1.284669742  
1.268339572  
1.252332004  
1.236691454  
1.221374438  
1.20637697  
1.191727187  
1.177355393  
1.163282361  
1.14952786  
1.136034258  
1.122807413  
1.109866646  
1.097174226  
1.0847146  
1.072526234  
1.060591935  
1.048845178  
1.037367283  
1.026083172  
1.015010983  
1.004153407  
0.9935028793  
0.9830271063  
0.9727916756  
0.9627265821  
0.9528164425  
0.9431278574  
0.9335653035  
0.9242254508  
0.9150131586  
0.9059755961  
0.8971071068  
0.8883802307  
0.8798222977  
0.8713891656  
0.8630935287  
0.8549624901  
0.8469685929  
0.8391007982  
0.8313557571  
0.8237673678  
0.816283068  
0.8089210794  
0.8016627152  
0.7945503145  
0.7875454802  
0.7806665056  
0.7738718184  
0.7671936221  
0.7606327733  
0.7541809394  
0.7477986871  
0.7415434828  
0.7353890944  
0.729286987  
0.7233256608  
0.7174351791  
0.7116127458  
0.7059212675  
0.70027562  
0.6947349341  
0.6892937736  
0.6839023662  
0.678618181  
0.6733849121  
0.6682308779  
0.6631734321  
0.658185604  
0.6532536076  
0.6483666487  
0.6436124002  
0.6388941097  
0.6342433006  
0.6296560404  
0.6251314069  
0.6206751877  
0.6162830911  
0.6119472772  
0.6076636418  
0.6034602098  
0.599307777  
0.5951896917  
0.5911425258  
0.5871542761  
0.5832283181  
0.579342776  
0.5755088839  
0.5717349476  
0.5680053911  
0.5643127381  
0.5606934045  
0.557103304  
0.5535843082  
0.55006654  
0.546618576  
0.5432173041  
0.5398713044  
0.5365655375  
0.5332793489  
0.5300440668  
0.5268612952  
0.5237187534  
0.5205985829  
0.5175264705  
0.5145014751  
0.5115054745  
0.5085540909  
0.5056155717  
0.5027408905  
0.4999210109  
0.4971034611  
0.494314246  
0.4915658261  
0.4888621975  
0.4861981043  
0.4835486168  
0.4809363353  
0.478355511  
0.4758225827  
0.4732968956  
0.4707934575  
0.4683529952  
0.4659231861  
0.4635246449  
0.4611570418  
0.4587996148  
0.4564933625  
0.4542046696  
0.4519628325  
0.4497243454  
0.4475117865  
0.4453266608  
0.4431665669  
0.4410474889  
0.4389331458  
0.43685919  
0.4348085976  
0.4327625494  
0.4307546627  
0.4287730454  
0.4268015204  
0.4248685464  
0.422954074  
0.4210728159  
0.4191862432  
0.4173280348  
0.4155088067  
0.41368695  
0.411898844  
0.4101373737  
0.4083828269  
0.4066619396  
0.4049454916  
0.4032628206  
0.4015757665  
0.399954046  
0.3983040195  
0.3966978144  
0.3950943602  
0.3935212612  
0.3919566777  
0.3904093089  
0.3888863887  
0.3873722314  
0.3858846411  
0.3844203909  
0.382959927  
0.3815231883  
0.380098378  
0.3786839292  
0.3772874439  
0.3759105256  
0.374548811  
0.3732046863  
0.3718888044  
0.3705587464  
0.3692689512  
0.3679742182  
0.3666859774  
0.3654333569  
0.3641986062  
0.3629643446  
0.3617569956  
0.3605613259  
0.359361752  
0.3581980004  
0.3570365261  
0.3558781638  
0.354755261  
0.3536240783  
0.3525129376  
0.3514300341  
0.3503340171  
0.3492745309  
0.3482037189  
0.3471585893  
0.34613608  
0.3451058742  
0.3440973181  
0.3430870933  
0.3420967603  
0.3411281899  
0.340160311  
0.3392171056  
0.338256634  
0.3373446692  
0.336419636  
0.335499307  
0.3346010124  
0.3337133257  
0.3328383148  
0.3319740927  
0.3311145377  
0.3302646184  
0.3294423902  
0.3285986225  
0.3277801511  
0.3269741096  
0.32617979  
0.3253848646  
0.3246121623  
0.3238556797  
0.3230931189  
0.3223380903  
0.3216041195  
0.3208725044  
0.3201532449  
0.3194376505  
0.3187316159  
0.3180418825  
0.3173588797  
0.3166795799  
0.3160180453  
0.3153600356  
0.3147097866  
0.3140594295  
0.3134278621  
0.3128057824  
0.312184956  
0.3115768059  
0.3109828363  
0.3103919715  
0.309813821  
0.3092342428  
0.3086684957  
0.3081132916  
0.3075659336  
0.3070106709  
0.306481803  
0.3059481759  
0.3054365966  
0.3049286035  
0.3044164525  
0.3039184464  
0.3034350253  
0.3029502471  
0.302477338  
0.3020161838  
0.3015510107  
0.3010955107  
0.3006641615  
0.3002166056  
0.2997955244  
0.2993706582  
0.2989482621  
0.298550248  
0.2981404858  
0.2977447744  
0.2973610763  
0.2969730877  
0.2966037178  
0.2962399804  
0.2958843993  
0.295521875  
0.2951857205  
0.294840291  
0.2945239712  
0.2941889996  
0.2938589908  
0.2935543174  
0.2932436412  
0.2929514243  
0.292656177  
0.2923769306  
0.2920990406  
0.2918213323  
0.2915510756  
0.2912858281  
0.2910354998  
0.2907863826  
0.2905480735  
0.2903169932  
0.2900911817  
0.28985276  
0.2896468724  
0.2894393986  
0.289233099  
0.2890468815  
0.2888436508  
0.2886601078  
0.2884824056  
0.2883135128  
0.2881494418  
0.2879807116  
0.2878417369  
0.2876969498  
0.287538964  
0.2874023464  
0.2872803568  
0.287144127  
0.2870395174  
0.2869337949  
0.2868226057  
0.2867311092  
0.2866379382  
0.2865413661  
0.2864756669  
0.2863981846  
0.2863243229  
0.2862675686  
0.2862039701  
0.2861604287  
0.2861145603  
0.2860730132  
0.2860409604  
0.2860089272  
0.2859938197  
0.2859742918  
0.2859557814  
0.285960048  
