0.1249925221  
0.3925000698  
0.6409428704  
0.8516993685  
1.009171873  
1.102347706  
1.125989216  
1.081287537  
0.9758769487  
0.8231530971  
0.6409264283  
0.4495181106  
0.2694867022  
0.1192490664  
0.012874125  
-0.04165002175  
-0.0434267778  
0.001226721293  
0.07961859238  
0.1744060888  
0.2660053418  
0.3353896778  
0.3668843897  
0.3505625301  
0.2838751992  
0.1722509963  
0.02854078271  
-0.1286641044  
-0.2776005384  
-0.3964598662  
-0.4665921628  
-0.4753315541  
-0.4179813328  
-0.2986696673  
-0.1299022938  
0.06910883561  
0.2751139179  
0.4640786064  
0.614514963  
0.7103931057  
0.7431767156  
0.7126918321  
0.6267107503  
0.4993591839  
0.3486326141  
0.1934358415  
0.05066179277  
-0.06725380582  
-0.1539013592  
-0.2093964761  
-0.2397678005  
-0.2554029699  
-0.2688502655  
-0.2923731849  
-0.3356750962  
-0.4041430383  
-0.4978832021  
-0.6116346508  
-0.7355414816  
-0.8566056908  
-0.9605620494  
-1.033880068  
-1.065583825  
-1.04866472  
-0.9809141456  
-0.8651160206  
-0.7086225301  
-0.5224181886  
-0.3198266168  
-0.115045401  
0.07831990773  
0.2485532092  
0.3868497611  
0.4879707106  
0.5505234205  
0.5768392141  
0.5725185828  
0.5456915276  
0.5060693648  
0.4638849638  
0.4288168141  
0.408987521  
0.4101306901  
0.4350054986  
0.4831135334  
0.5507503636  
0.6313892943  
0.7163636386  
0.7957780389  
0.8595596357  
0.8985333709  
0.9054270938  
0.8756860918  
0.8080201255  
0.7046347195  
0.5711046837  
0.4159142263  
0.2496880334  
0.08419469881  
-0.06879273678  
-0.1986706903  
-0.2970917698  
-0.3588459855  
-0.3824473706  
-0.3703283611  
-0.3286169718  
-0.2664984415  
-0.1952062106  
-0.1267640386  
-0.07260533862  
-0.04224956823  
-0.04219655612  
-0.07519080987  
-0.1399547178  
-0.2314457196  
-0.3415860375  
-0.4603877852  
-0.5773094548  
-0.6826437389  
-0.7687501856  
-0.8309455869  
-0.8679284507  
-0.8816739585  
-0.8768260132  
-0.859683445  
-0.8369372661  
-0.8143631361  
-0.7956737575  
-0.7817218766  
-0.770179439  
-0.7557662098  
-0.7309960966  
-0.6873564798  
-0.6167422939  
-0.5129456011  
-0.3729652032  
-0.1979412716  
0.006460860169  
0.2302956299  
0.4602196566  
0.6809181209  
0.876905793  
1.034451341  
1.143364636  
1.198370266  
1.199840758  
1.153756537  
1.07085423  
0.9650609229  
0.8514208303  
0.7438165106  
0.6528294901  
0.5840839344  
0.537347701  
0.5065543411  
0.4807704472  
0.4459810583  
0.3874240341  
0.2921209423  
0.1512176077  
-0.03823931539  
-0.2723647973  
-0.54048149  
-0.8261573362  
-1.109072248  
-1.36744175  
-1.580645985  
-1.731679415  
-1.809089723  
-1.808148602  
-1.731127994  
-1.586688051  
-1.388512021  
-1.153436241  
-0.8993603903  
-0.6432550499  
-0.3995305136  
-0.1789465911  
0.01184611584  
0.1701651569  
0.2966674994  
0.3944166845  
0.4678478123  
0.5218161746  
0.560870607  
0.5888137085  
0.6085576635  
0.6222119499  
0.6312915249  
0.6369608739  
0.6402037012  
0.6418769753  
0.6426401794  
0.6427928349  
0.6420878147  
0.6395960682  
0.6336911732  
0.6221853314  
0.6026299292  
0.5727403352  
0.5308753229  
0.4764951589  
0.4105019079  
0.3354013311  
0.2552344326  
0.1752736709  
0.1015179803  
0.04004304539  
-0.003706163661  
-0.02558227618  
-0.02327443189  
0.003359807884  
0.0522065721  
0.1190736849  
0.1981019446  
0.2823511301  
0.3644893658  
0.4374756524  
0.4951695281  
0.5327751348  
0.5470849394  
0.5365199024  
0.5009817588  
0.4415822674  
0.3603223408  
0.2598063015  
0.1430645048  
0.01352379143  
-0.1248544554  
-0.2673139845  
-0.407990339  
-0.5396555106  
-0.6536437222  
-0.7400634397  
-0.7883795293  
-0.7883778163  
-0.7314455261  
-0.6120465769  
-0.4291729645  
-0.1875278011  
0.1018018254  
0.4214039089  
0.7484522478  
1.056473808  
1.317842402  
1.50673816  
1.602200154  
1.590846756  
1.468863508  
1.242912179  
0.929778294  
0.5547289561  
0.148755165  
-0.2549622852  
-0.6249062256  
-0.9348768562  
-1.166948768  
-1.313335842  
-1.376906688  
-1.370287584  
-1.313682115  
-1.231710575  
-1.149712322  
-1.090015582  
-1.068692238  
-1.093253813  
-1.161605052  
-1.262404208  
-1.376787458  
-1.48120472  
-1.550967621  
-1.563992358  
-1.504177842  
-1.363932387  
-1.145460066  
-0.8606249376  
-0.5294202517  
-0.1772845475  
0.1683029707  
0.481437778  
0.7410495194  
0.9333353011  
1.053030359  
1.103388042  
1.094926102  
1.043216316  
0.9661163319  
0.8809056294  
0.801784526  
0.7380943872  
0.6934811545  
0.6660603203  
0.6494568703  
0.6344847784  
0.6111243889  
0.5704551173  
0.5062290683  
0.415863489  
0.3007577509  
0.1659368303  
0.0191576544  
-0.1303292446  
-0.2731351959  
-0.4009798379  
-0.5076542688  
-0.5895887539  
-0.6459810758  
-0.6785388034  
-0.6908985605  
-0.6878675602  
-0.6746001762  
-0.6558297693  
-0.635246578  
-0.6150671187  
-0.5958320827  
-0.5764151899  
-0.5542402367  
-0.5256709985  
-0.4865402627  
-0.4327839567  
-0.3611216233  
-0.2697325559  
-0.1588307655  
-0.03107337548  
0.1083122333  
0.2517286573  
0.3897974249  
0.5123108175  
0.6094776434  
0.6733194948  
0.6990226468  
0.6860322484  
0.6386639436  
0.5660692654  
0.4814700114  
0.4006777658  
0.3400545877  
0.3141593013  
0.3334187326  
0.4021865344  
0.5175245101  
0.6689561672  
0.8393100995  
1.006599077  
1.146725679  
1.236668888  
1.257693025  
1.198120391  
1.055251057  
0.8361075449  
0.556886355  
0.2411518859  
-0.08298479538  
-0.3863128421  
-0.6421169851  
-0.8294146417  
-0.9353919355  
-0.9567093541  
-0.8995255452  
-0.7782787834  
-0.6134247945  
-0.4285128785  
-0.2470268727  
-0.08946288976  
0.02895801213  
0.09964449708  
0.1209290295  
0.09734424163  
0.03806441396  
-0.04515827809  
-0.1401885136  
-0.2364456642  
-0.3262767271  
-0.4055547017  
-0.4734491862  
-0.5314710577  
-0.5820198347  
-0.6267495963  
-0.6651143915  
-0.6934085579  
-0.7045357676  
-0.6886004666  
-0.6342756693  
-0.5307348864  
-0.3698418505  
-0.1482152575  
0.1312075895  
0.458409284  
0.8165257166  
1.18309497  
1.532193721  
1.83716367  
2.073568196  
2.221932775  
2.269901185  
2.213499203  
2.057355304  
1.813889615  
1.501634942  
1.142976186  
0.7616648208  
0.38046503  
0.01922726467  
-0.306410268  
-0.5856234018  
-0.812363236  
-0.9848234605  
-1.104617385  
-1.175875754  
-1.204427341  
-1.197175844  
-1.161688143  
-1.105943983  
-1.038155333  
-0.9665582573  
-0.899077784  
-0.8428475078  
-0.8036054316  
-0.7850575303  
-0.7883310413  
-0.8116690512  
-0.8504601623  
-0.8976744522  
-0.9446911273  
-0.9824256337  
-1.002591512  
-0.9989178865  
-0.968115872  
-0.9104308267  
-0.8296849406  
-0.7327783876  
-0.6287316574  
-0.5273948781  
-0.4380289965  
-0.3679663425  
-0.3215468384  
-0.299494353  
-0.2988200006  
-0.3132640311  
-0.3342148331  
-0.351981459  
-0.3572304554  
-0.3424055369  
-0.3029120049  
-0.2379246413  
-0.1506862689  
-0.04824864638  
0.05932352465  
0.1601906285  
0.2422793336  
0.2949349239  
0.3104660283  
0.2853993552  
0.2212554761  
0.124748756  
0.007351178647  
-0.1157398389  
-0.2271284644  
-0.3090874318  
-0.3455484494  
-0.3239969768  
-0.2370520401  
-0.08353711582  
0.1310807859  
0.3949604699  
0.6908459462  
0.997619696  
1.292291839  
1.552206333  
1.757220771  
1.891620313  
1.945558113  
1.915867094  
1.806166475  
1.626267829  
1.390976504  
1.118430435  
0.82819196  
0.5393140453  
0.2686009097  
0.02924813277  
-0.1699997606  
-0.3251236491  
-0.4365383348  
-0.5083305835  
-0.5471535646  
-0.5609652877  
-0.5577837801  
-0.5446292441  
-0.5267748396  
-0.5073768682  
-0.4874935527  
-0.4664399374  
-0.4423870857  
-0.4130766384  
-0.376539552  
-0.3316845491  
-0.278683741  
-0.2191130288  
-0.1558331025  
-0.09265701512  
-0.03386409891  
0.01635145306  
0.05442522612  
0.07785993888  
0.08552475227  
0.07777463489  
0.05638742371  
0.02435852527  
-0.01441618644  
-0.05550188801  
-0.09427910712  
-0.1262565396  
-0.1473108785  
-0.1538627215  
-0.1430024885  
-0.112609457  
-0.06147999774  
0.01049303386  
0.1021112995  
0.210647234  
0.3316767897  
0.4590321186  
0.5849618349  
0.7005529704  
0.7964372896  
0.8637422839  
0.8952050209  
0.8862931284  
0.836157379  
0.7482372658  
0.6303533077  
0.4942123759  
0.354302806  
0.2262943218  
0.1251160976  
0.06296915692  
0.04758101198  
0.08095073441  
0.1588309035  
0.2710389299  
0.4026178596  
0.5356928458  
0.6517964866  
0.7343227711  
0.7707547378  
0.7543373419  
0.6849323763  
0.5689220359  
0.4181716316  
0.2482072362  
0.0758907105  
-0.0830406295  
-0.2161944458  
-0.3161457828  
-0.3812259049  
-0.415368855  
-0.4270659032  
-0.4276237306  
-0.4290437708  
-0.4418825429  
-0.473459869  
-0.5267058024  
-0.5998170318  
-0.686762803  
-0.7785017165  
-0.8646942624  
-0.9355706071  
-0.9836366906  
-1.004920748  
-0.9995575513  
-0.9716403919  
-0.9284036393  
-0.8789001301  
-0.8324420864  
-0.7970819006  
-0.7784092438  
-0.7788409989  
-0.7975220247  
-0.8307892104  
-0.8730912168  
-0.9181635464  
-0.9602141234  
-0.9949145336  
-1.020003133  
-1.035435922  
-1.043071907  
-1.045990449  
-1.04759948  
-1.050728598  
-1.056887533  
-1.065840792  
-1.075580767  
-1.082701591  
-1.083091332  
-1.072814051  
-1.049000722  
-1.010576087  
-0.9586637568  
-0.8965802091  
-0.8293887888  
-0.7630683466  
-0.7034058339  
-0.6547958204  
-0.6191263996  
-0.5949499328  
-0.5770905684  
-0.556791334  
-0.5224344379  
-0.4607905402  
-0.3586762806  
-0.2048400899  
0.008145654456  
0.2822379623  
0.612759432  
0.9879082432  
1.389095675  
1.792142694  
2.169287889  
2.491831656  
2.733161225  
2.87180876  
2.89416673  
2.796500201  
2.585940805  
2.280285637  
1.906537479  
1.498310826  
1.092366102  
0.7246757004  
0.426494546  
0.2209346114  
0.1204779582  
0.1257551198  
0.2257558606  
0.3994355002  
0.6185141476  
0.851084858  
1.065550483  
1.234375306  
1.337167847  
1.362708916  
1.309702363  
1.186217805  
1.007948301  
0.7956018373  
0.5718185012  
0.3580735678  
0.1719913992  
0.02542069584  
-0.07651660783  
-0.1353261875  
-0.1580994458  
-0.1557360465  
-0.1407594393  
-0.1250833393  
-0.1180733932  
-0.1251956506  
-0.147421928  
-0.1814606566  
-0.2207222912  
-0.2568378302  
-0.2814520302  
-0.2879775189  
-0.2730163859  
-0.2371874497  
-0.1852325842  
-0.1253534505  
-0.06789486474  
-0.02357105337  
-0.00154080337  
-0.007639737431  
-0.04309118105  
-0.1039280118  
-0.181248874  
-0.2623087139  
-0.3322882346  
-0.3764887141  
-0.3825987309  
-0.3426900578  
-0.2545963837  
-0.1224652528  
0.04362576609  
0.2289402084  
0.4160389457  
0.5871273168  
0.7264256519  
0.8222066424  
0.8681909719  
0.8641021878  
0.8153355304  
0.7318017176  
0.6261741348  
0.5118263396  
0.4007983165  
0.3021170166  
0.2207037646  
0.1570420283  
0.1075895826  
0.06585180175  
0.02388730541  
-0.02602806527  
-0.08987204754  
-0.1707543975  
-0.2683734972  
-0.3791376442  
-0.4969049817  
-0.6141921597  
-0.7236225547  
-0.819343189  
-0.8981545994  
-0.9601475681  
-1.008733285  
-1.050058676  
-1.091908692  
-1.142280653  
-1.207891853  
-1.292870671  
-1.39788155  
-1.519851956  
-1.652364955  
-1.786703477  
-1.913368808  
-2.023859302  
-2.112399865  
-2.177320763  
-2.221813184  
-2.253874883  
-2.285373911  
-2.330291527  
-2.402343257  
-2.512297618  
-2.66536495  
-2.859083748  
-3.08206192  
-3.313866859  
-3.526196593  
-3.685296575  
-3.755424884  
-3.702982734  
-3.500817931  
-3.132154701  
-2.593610471  
-1.896848607  
-1.068590258  
-0.1488900573  
0.8121753901  
1.75904467  
2.635932438  
3.392176429  
3.987040684  
4.393431169  
4.600084232  
4.612040466  
4.449383409  
4.144484016  
3.738121288  
3.274992153  
2.799156652  
2.349930672  
1.958655903  
1.646639605  
1.424380955  
1.292057624  
1.241085769  
1.256457275  
1.319494526  
1.410650731  
1.511996077  
1.609132065  
1.69232564  
1.756836225  
1.802449698  
1.832381534  
1.851771507  
1.866017612  
1.879231949  
1.893032453  
1.905871713  
1.912970998  
1.906891535  
1.878636851  
1.81913851  
1.720901186  
1.579558368  
1.395091787  
1.172506685  
0.9218080514  
0.6572344604  
0.3957816764  
0.155185095  
-0.04840169302  
-0.2027114898  
-0.3013125358  
-0.3448925399  
-0.34162902  
-0.3065313085  
-0.2597760865  
-0.2242076812  
-0.2223358379  
-0.2732118243  
-0.3896531753  
-0.5762122626  
-0.8282095092  
-1.131990967  
-1.466400468  
-1.805261936  
-2.120533069  
-2.385674814  
-2.578780014  
-2.685022286  
-2.69811022  
-2.620605197  
-2.463096809  
-2.242437768  
-1.97932704  
-1.695647355  
-1.411927493  
-1.14528125  
-0.9080538766  
-0.7072913624  
-0.5449942966  
-0.4190185769  
-0.3243792368  
-0.2546987153  
-0.2035282522  
-0.1653439801  
-0.1360916861  
-0.1132641415  
-0.09557303153  
-0.08236245582  
-0.07295003199  
-0.06606135951  
-0.0595315838  
-0.05033168447  
-0.03494716494  
-0.01003966243  
0.02674014478  
0.07594973027  
0.1357313849  
0.2015147162  
0.266133601  
0.3203922963  
0.3540259129  
0.3569468815  
0.3206174014  
0.2393555929  
0.1113991807  
-0.06043622015  
-0.2686053589  
-0.5012226729  
-0.7429712248  
-0.9764220794  
-1.183618698  
-1.347747351  
-1.454693187  
-1.494321011  
-1.461345952  
-1.355710254  
-1.182470415  
-0.9512145531  
-0.6751312786  
-0.3698307287  
-0.05207022317  
0.2614940125  
0.5554278343  
0.816434707  
1.034026463  
1.200945838  
1.31334728  
1.370763835  
1.375882476  
1.334168418  
1.253340048  
1.142744098  
1.0126327  
0.8733950213  
0.7347830575  
0.605188299  
0.4910333445  
0.3963458474  
0.3225656946  
0.2686238724  
0.231292018  
0.2057780929  
0.1865052401  
0.1679766575  
0.1456279829  
0.1165361567  
0.07989855351  
0.03720365119  
-0.007936301612  
-0.05027777383  
-0.08369574933  
-0.1020905224  
-0.1003260881  
-0.07506106678  
-0.02536122157  
0.04700201296  
0.1375992879  
0.2397360118  
0.3451219636  
0.4447282309  
0.5297091899  
0.5922661007  
0.6263576212  
0.6281791297  
0.5963811809  
0.5320366338  
0.4384005922  
0.3205173603  
0.1847577877  
0.03833166422  
-0.1111620072  
-0.2561340706  
-0.3893488926  
-0.5042180107  
-0.5950673171  
-0.6573937544  
-0.6881161381  
-0.6858188075  
-0.6509636198  
-0.5860298281  
-0.4955507726  
-0.3859914543  
-0.2654463885  
-0.1431339456  
-0.02870920352  
0.06857088101  
0.1407418207  
0.1820050315  
0.1894515038  
0.1635358174  
0.1082102529  
0.03065791653  
-0.05937468997  
-0.1506014664  
-0.2314654937  
-0.2915076737  
-0.3226545736  
-0.3202518665  
-0.283686733  
-0.2164985661  
-0.1259459481  
-0.022079959  
0.08355378269  
0.1794121548  
0.2554170707  
0.3041944868  
0.3218999662  
0.3085254201  
0.2676562949  
0.2057380941  
0.1309854175  
0.05212492501  
-0.02282749293  
-0.08756735765  
-0.1381277264  
-0.1730717248  
-0.1932552351  
-0.2012403284  
-0.2005003058  
-0.1945847968  
-0.1863977091  
-0.1777218757  
-0.1690538217  
-0.1597585676  
-0.1484749322  
-0.133675591  
-0.1142427565  
-0.08992481474  
-0.06158912925  
-0.03119553729  
-0.001520596674  
0.02432796581  
0.04349818775  
0.05396394778  
0.05495472193  
0.04716893904  
0.0327160992  
0.01480379431  
-0.002778291764  
-0.0162808771  
-0.02260082906  
-0.01977826197  
-0.00728546991  
0.01393147961  
0.04165792417  
