20.81445287  
24.42272703  
36.64662756  
87.34693586  
465.1189355  
539.7418002  
19551.31991  
30472.72409  
13354.86621  
4548.886066  
74749.76299  
29395.5697  
21179.28512  
21883.60774  
8608.220467  
16306.85357  
28948.73002  
10386.77638  
31717.77413  
41614.23532  
12714.29875  
4965.565099  
4998.290682  
3381.125735  
632.1862593  
2832.470658  
14296.05149  
1915.912132  
1863.518115  
14083.88503  
3712.606568  
2259.48797  
15721.5125  
1347.097625  
7321.799899  
459.1107993  
2265.522279  
3379.704412  
2703.133594  
127.163039  
2237.72447  
3712.279076  
647.2084521  
320.5577261  
2263.885402  
2670.207443  
887.7796449  
1163.874778  
86.13314739  
2357.45303  
415.0430121  
4928.452837  
326.6674817  
2371.815874  
4634.028935  
789.3896277  
10.51547942  
291.5216574  
534.8260986  
335.3055424  
398.4413434  
330.5391424  
52.79867403  
564.648629  
58.76968899  
81.57522778  
11.40758134  
88.05437787  
46.80598967  
24.7294754  
23.98581769  
6.789516969  
3.281552716  
0.2060337757  
0.04789241701  
0.5659934198  
1.990265199  
0.6669723744  
1.282142296  
0.9216309144  
0.2743718859  
0.1617678959  
0.3183371735  
0.516214822  
0.4123384075  
0.4404372012  
0.2209338253  
0.1940052407  
0.3241258485  
0.2496448941  
0.258288173  
0.2174236268  
0.241557835  
0.2048787043  
0.1934005632  
0.2099572646  
0.2093842602  
0.1985622981  
0.1880070211  
0.1907865285  
0.1912720841  
0.1869538215  
0.1825092815  
0.1862254478  
0.1763021677  
0.1711950947  
0.1713986366  
0.1672892729  
0.1627067516  
0.1597775206  
0.1576266026  
0.154779789  
0.1512856683  
0.1491235899  
0.1471260658  
0.1446799777  
0.1414674895  
0.1393174651  
0.1373254029  
0.1348263266  
0.1327053688  
0.1305384849  
0.1285985318  
0.1265041719  
0.1243867038  
0.1225374069  
0.1206126803  
0.1187773871  
0.1169891436  
0.1152538953  
0.1135416139  
0.1118384036  
0.1102412114  
0.1086460978  
0.1071173237  
0.1055452461  
0.1040682775  
0.1026340616  
0.1012111424  
0.09980610555  
0.09844513479  
0.09713616166  
0.09582328934  
0.09455544981  
0.09330410487  
0.09209063389  
0.09089320702  
0.08973008112  
0.08858165245  
0.08746693496  
0.08636754815  
0.08529444527  
0.08424556009  
0.08320874392  
0.08219911116  
0.08121164072  
0.08024315562  
0.07928538865  
0.07835522963  
0.07744430544  
0.07654243024  
0.07566932755  
0.07480303432  
0.07395439848  
0.07312566095  
0.07231211773  
0.07150757625  
0.07072216594  
0.06995245378  
0.06919666149  
0.06845437974  
0.06771889886  
0.06700814145  
0.06630164423  
0.06560917512  
0.06493203224  
0.06426497136  
0.06360833077  
0.06295948429  
0.06232732696  
0.06170321849  
0.06109440835  
0.06049095639  
0.05990061072  
0.05931837114  
0.058748231  
0.05818335575  
0.0576269959  
0.05708760554  
0.056553207  
0.05602786993  
0.05551247853  
0.0550025227  
0.05449871163  
0.05400487457  
0.0535190414  
0.05304127514  
0.05257134845  
0.05210439086  
0.05165162017  
0.05120196433  
0.05076023168  
0.05032832541  
0.0498976299  
0.0494736294  
0.04905785849  
0.04864851272  
0.04824605307  
0.04784646309  
0.04745613054  
0.04707271697  
0.0466928235  
0.04631655507  
0.04594697416  
0.04558573739  
0.04522470077  
0.04487237924  
0.04452757694  
0.0441815543  
0.04384087481  
0.04350833314  
0.04317815686  
0.0428571471  
0.04253720447  
0.04222091983  
0.04190790577  
0.04160108969  
0.04129989209  
0.04100074531  
0.04070702719  
0.04042052265  
0.04012717717  
0.03984988719  
0.03956899449  
0.03929292108  
0.03902157258  
0.03875345147  
0.03848913229  
0.03823156839  
0.03797366017  
0.03772020523  
0.03747050048  
0.03722215671  
0.03697862037  
0.03673932304  
0.03650321986  
0.03626271685  
0.0360355806  
0.03580432433  
0.0355775816  
0.03535593561  
0.03513430009  
0.03491619564  
0.03470483985  
0.03448945037  
0.0342797441  
0.03407795953  
0.03387101331  
0.03366790714  
0.03347124078  
0.03327092297  
0.03307927071  
0.03288817825  
0.03269451304  
0.03251047961  
0.03232460918  
0.0321411384  
0.03196584919  
0.03178509551  
0.03160324793  
0.03143296503  
0.03125838608  
0.03108922613  
0.03092168086  
0.03075485367  
0.03059349354  
0.03043033048  
0.03026635971  
0.03010706215  
0.02995438566  
0.02979901923  
0.02964976339  
0.02949570755  
0.02934429121  
0.0292003687  
0.029053152  
0.02890901667  
0.02876687383  
0.0286250665  
0.02848425147  
0.02834859121  
0.02821187651  
0.02807494545  
0.02794317668  
0.02781046066  
0.02768011014  
0.02755188161  
0.02742430551  
0.02730033651  
0.02717547135  
0.02705396287  
0.02693220461  
0.02681161724  
0.02669329631  
0.02657536252  
0.02645814252  
0.02634316625  
0.02623012762  
0.02611860942  
0.02600788796  
0.02589490232  
0.02579147126  
0.02568255045  
0.02557556526  
0.02547174697  
0.02536600723  
0.02526516949  
0.02516343431  
0.02506142322  
0.02496109126  
0.02486597935  
0.02476727066  
0.02467240999  
0.02457333521  
0.0244840216  
0.02438721889  
0.02429683629  
0.02420790069  
0.02411306437  
0.0240291289  
0.02394005212  
0.02385235086  
0.02376598274  
0.0236790233  
0.02359698611  
0.02351163701  
0.02343057705  
0.02335017276  
0.02327135812  
0.02318904531  
0.02311139878  
0.02303448962  
0.02295547878  
0.02288223643  
0.0228049273  
0.02273156795  
0.02265632558  
0.02258556892  
0.02251293661  
0.02243993304  
0.02237375246  
0.02230184711  
0.02223336382  
0.02216457774  
0.02209867374  
0.02203085421  
0.02196406426  
0.02190075475  
0.02183476823  
0.02176964562  
0.02170585669  
0.02164561114  
0.02158574974  
0.0215234293  
0.02146370228  
0.0214046889  
0.02134790045  
0.02128831402  
0.02122997545  
0.02117361462  
0.02112008858  
0.0210633746  
0.02100687927  
0.02095223894  
0.02090086323  
0.02084506637  
0.02079365915  
0.02074430487  
0.02069295745  
0.02064129803  
0.02059251586  
0.0205423705  
0.02049486546  
0.02044631942  
0.02040076199  
0.02035280719  
0.02030689258  
0.02025898017  
0.02021437511  
0.02016946037  
0.02012595345  
0.0200823338  
0.02003926719  
0.01999760778  
0.01995439336  
0.01991313197  
0.01987172757  
0.01983392644  
0.01979342204  
0.01975512822  
0.01971491405  
0.01967684732  
0.01964255772  
0.01960099035  
0.01956560428  
0.01953190201  
0.01949444719  
0.01945853649  
0.01942634688  
0.01938854429  
0.01935648349  
0.01932258096  
0.01929063992  
0.0192550969  
0.01922684085  
0.01919558763  
0.01916499832  
0.01913304826  
0.01910780262  
0.0190754058  
0.01904557661  
0.01901766049  
0.01899113954  
0.01896151845  
0.01893475635  
0.01890658581  
0.01888086844  
0.01885424231  
0.01883255137  
0.01880457741  
0.01878046871  
0.0187576816  
0.01873091963  
0.01870953875  
0.01868573795  
0.01866185098  
0.01864151499  
0.01862073531  
0.01859713744  
0.01857548272  
0.01855609124  
0.01853742091  
0.01852095813  
0.01849981323  
0.01848037147  
0.01846013922  
0.0184428162  
0.01842758683  
0.01840610494  
0.01839004915  
0.01837643968  
0.01836052451  
0.01834144241  
0.01832751955  
0.01831503164  
0.01829784366  
0.01828587907  
0.01827150966  
0.01825776471  
0.01824319045  
0.018232972  
0.01822223287  
0.01821092137  
0.01820032155  
0.01818589954  
0.01817804197  
0.01816641414  
0.01815943189  
0.01814666639  
0.01813767423  
0.0181277897  
0.01812070791  
0.01811337623  
0.01810528905  
0.01809896656  
0.01809202636  
0.01808459535  
0.01807821082  
0.01807471109  
0.01806655202  
0.01806184821  
0.01805663936  
0.01805642353  
0.01804902287  
0.01804685729  
0.0180443103  
0.01804295104  
0.01803989411  
0.01803692339  
0.01803498658  
0.01803431245  
0.01803214113  
0.01803481147  
0.01803476518  
