690.3664787  
730.8502997  
804.7359172  
937.4197922  
1575.604558  
10216.96165  
1744.379054  
9520.245247  
7617.939302  
1966.033854  
38285.80374  
37438.01003  
53556.71904  
19933.88201  
16178.411  
27338.9764  
117.2127249  
26501.44157  
18517.05049  
29957.97292  
4685.646786  
1870.534577  
3121.439064  
3247.446102  
33319.61785  
5936.926142  
2894.34798  
5532.59084  
1276.180051  
2627.696935  
7541.614833  
10360.96028  
8634.971768  
16964.58217  
2389.762849  
5649.270991  
6065.26761  
2644.481642  
233.4233536  
4507.607259  
3995.324962  
1221.602069  
486.6632899  
65.08996209  
2116.230059  
190.0080728  
2074.014701  
2616.781832  
519.2882598  
4409.266742  
6914.931931  
12843.76407  
355.8203567  
1416.523499  
1521.356956  
523.7931448  
1627.096215  
1239.074031  
5709.352274  
1684.406533  
984.3294183  
308.8999765  
52.05033483  
60.99135985  
564.0930885  
284.0951427  
31.02985738  
26.88721002  
104.6122464  
50.84226593  
27.05512607  
73.79349266  
44.28086716  
10.53664859  
12.57168745  
10.27761256  
14.17542365  
4.154925036  
11.69536231  
5.73921133  
11.04706012  
8.055635065  
9.551654266  
7.137779714  
5.799304215  
4.642496258  
5.060351759  
4.355071206  
4.833233636  
4.31062137  
4.436097021  
3.984122398  
3.772872938  
3.526410321  
3.473418316  
3.31942223  
3.217066051  
3.071970827  
2.848196795  
2.728256932  
2.659163191  
2.576976799  
2.461363965  
2.377832418  
2.295128599  
2.207992976  
2.146978537  
2.053257929  
1.983199565  
1.927048118  
1.860834595  
1.799314961  
1.741108497  
1.68794872  
1.63923512  
1.586215829  
1.539265276  
1.493937822  
1.451675902  
1.409797516  
1.371098269  
1.333042326  
1.296708736  
1.261735385  
1.228202633  
1.196413371  
1.165295951  
1.135828109  
1.107315277  
1.079838377  
1.053425054  
1.028097331  
1.00366408  
0.9801260389  
0.9572960013  
0.9352997113  
0.9141621991  
0.8937068796  
0.8739620249  
0.8548243783  
0.8363992439  
0.8185781335  
0.8013080607  
0.7846182398  
0.7684803776  
0.752829524  
0.737682402  
0.7229962818  
0.7087682136  
0.694985262  
0.6816054416  
0.6686313066  
0.6560407121  
0.643825783  
0.6319610148  
0.6204377837  
0.6092502014  
0.598376166  
0.5878075253  
0.5775376193  
0.5675459682  
0.5578327564  
0.5483764137  
0.5391746149  
0.530226408  
0.5215064745  
0.513018043  
0.5047508861  
0.4966991224  
0.4888474923  
0.481201045  
0.4737411079  
0.4664713078  
0.4593829515  
0.452463441  
0.4457206008  
0.4391350604  
0.4327073912  
0.4264357327  
0.4203066117  
0.4143266827  
0.4084862539  
0.402779638  
0.39719912  
0.3917550219  
0.3864273006  
0.3812213665  
0.3761293134  
0.3711506517  
0.3662880561  
0.3615242514  
0.3568631223  
0.3523061314  
0.3478448408  
0.3434805882  
0.3392052726  
0.3350193911  
0.3309265647  
0.3269102923  
0.3229806217  
0.3191292009  
0.3153571644  
0.3116602494  
0.3080391742  
0.3044890276  
0.3010090835  
0.2975967538  
0.294252378  
0.2909721071  
0.2877533522  
0.2845988931  
0.2815003523  
0.2784661007  
0.2754855457  
0.2725611141  
0.269692838  
0.2668752497  
0.2641108699  
0.2613950108  
0.2587307504  
0.2561116777  
0.2535436036  
0.2510181034  
0.2485395349  
0.2461037933  
0.2437111553  
0.2413607115  
0.2390489555  
0.23677625  
0.2345489914  
0.2323549976  
0.2301984142  
0.2280816062  
0.225999118  
0.2239478761  
0.2219348342  
0.2199520985  
0.2180045511  
0.2160890299  
0.2142035696  
0.2123472412  
0.2105219143  
0.2087258056  
0.2069612758  
0.2052206956  
0.2035124521  
0.2018285989  
0.2001723599  
0.1985410245  
0.1969339219  
0.1953519288  
0.1937960893  
0.1922634154  
0.1907535863  
0.1892699232  
0.1878033841  
0.186360166  
0.1849417723  
0.1835431362  
0.1821638747  
0.180808672  
0.1794694383  
0.178152649  
0.1768531893  
0.1755739171  
0.1743143994  
0.1730713159  
0.1718492695  
0.1706399058  
0.1694478835  
0.1682760721  
0.1671221254  
0.1659801271  
0.1648582036  
0.16374935  
0.1626567581  
0.1615801839  
0.1605181482  
0.1594701935  
0.1584393924  
0.1574187387  
0.1564151148  
0.1554238858  
0.1544450575  
0.15348178  
0.1525300809  
0.151593725  
0.1506658535  
0.149754548  
0.1488502491  
0.147964182  
0.147086561  
0.1462195511  
0.1453680876  
0.1445247151  
0.1436912475  
0.1428700576  
0.1420600432  
0.1412618309  
0.1404712926  
0.1396939356  
0.138923565  
0.1381656111  
0.1374158669  
0.1366773586  
0.135945917  
0.1352266289  
0.1345140019  
0.1338119677  
0.1331182439  
0.1324329832  
0.1317581323  
0.1310895678  
0.1304315274  
0.1297788821  
0.1291375186  
0.1285015106  
0.1278741745  
0.1272567302  
0.1266451969  
0.1260417978  
0.1254458774  
0.1248590577  
0.1242766186  
0.1237030418  
0.1231338591  
0.1225726467  
0.1220232082  
0.1214736543  
0.1209328912  
0.1204025828  
0.1198728269  
0.1193536571  
0.1188413435  
0.11833396  
0.1178334934  
0.1173388669  
0.1168481682  
0.1163634943  
0.1158888381  
0.1154168339  
0.1149517951  
0.1144914037  
0.1140365746  
0.1135880032  
0.1131449874  
0.1127057654  
0.1122735345  
0.1118468829  
0.1114238582  
0.1110074977  
0.1105950345  
0.1101874691  
0.1097854506  
0.1093905586  
0.1089953457  
0.1086098517  
0.1082258238  
0.1078469191  
0.1074745595  
0.1071045916  
0.1067405143  
0.1063807986  
0.1060252738  
0.1056744773  
0.1053277905  
0.1049852806  
0.1046462939  
0.1043135879  
0.1039832083  
0.1036579509  
0.1033358814  
0.1030174045  
0.1027029309  
0.102392775  
0.1020883519  
0.1017859183  
0.1014881232  
0.1011932709  
0.1009023267  
0.1006142193  
0.1003325692  
0.1000509187  
0.09977553813  
0.09950087234  
0.09923265762  
0.09896794458  
0.09870360854  
0.09844428175  
0.09819034292  
0.09793945177  
0.09768957642  
0.09744329577  
0.0972018461  
0.09696336363  
0.09672645621  
0.09649518329  
0.09626448245  
0.09603753741  
0.09581406185  
0.0955956953  
0.0953788882  
0.09516295246  
0.09495205688  
0.09474631531  
0.09454073046  
0.09433860445  
0.0941381997  
0.09394231268  
0.09374964953  
0.09355786974  
0.0933684105  
0.09318400553  
0.09300401509  
0.09282297166  
0.09264583159  
0.09247253677  
0.09230291488  
0.09213259709  
0.09196637765  
0.0918027686  
0.09164024643  
0.09148316187  
0.09132847097  
0.09117625946  
0.09102449367  
0.0908755639  
0.0907307214  
0.09058845191  
0.09044787074  
0.09030972843  
0.0901730216  
0.09004227662  
0.08991056281  
0.08978288747  
0.08965647588  
0.08953308465  
0.08941076743  
0.08929345877  
0.08917566214  
0.08906060389  
0.08895041827  
0.08884086217  
0.08873399435  
0.08863079771  
0.08852679419  
0.0884263102  
0.08832886503  
0.08823300325  
0.08814155541  
0.08804817928  
0.08795962028  
0.08787346741  
0.08778876045  
0.08770684557  
0.08762580262  
0.08754900355  
0.08747152967  
0.08739783458  
0.08732798364  
0.08725677036  
0.0871920439  
0.08712506259  
0.0870615292  
0.08700168521  
0.08694437191  
0.08688628237  
0.08683190056  
0.08677873359  
0.08672964619  
0.08668287597  
0.08663551789  
0.08659017084  
0.08654993241  
0.08650962746  
0.08647195203  
0.08643548159  
0.08640196349  
0.08636971623  
0.08634068477  
0.08631448845  
0.08628870552  
0.08626418864  
0.0862424859  
0.0862240931  
0.08620695274  
0.08619044349  
0.08617865697  
0.08616789265  
0.08615805219  
0.08614954671  
0.08614520764  
0.08614125079  
0.08614164495  
