376.7075315  
397.5849097  
444.9654339  
556.6347886  
907.5304468  
1673.4528  
13626.83594  
36223.75048  
16215.22315  
5725.046706  
102.7919145  
1596.82863  
10288.95366  
17966.66426  
33419.23126  
12760.59127  
24331.84924  
40179.24596  
24704.66895  
23360.79589  
1490.227627  
1637.256121  
5288.099302  
2801.703422  
4111.732485  
3669.101525  
7537.767075  
15389.0475  
17732.89757  
6550.425609  
1483.641171  
1485.329495  
6923.041311  
3074.511611  
23726.16693  
19852.87613  
5090.655154  
1078.672712  
1496.711901  
2721.242162  
3394.370354  
7396.674948  
5791.121637  
4026.386749  
4133.201398  
2363.004707  
7328.04995  
8880.667798  
18331.41771  
1874.791532  
5184.264741  
2477.011759  
414.8885417  
166.8055457  
844.0292144  
3077.504028  
731.9710365  
7303.414162  
1737.686905  
59.77918876  
570.5845618  
1175.458066  
380.9452756  
864.2336497  
109.2445152  
147.8499903  
34.13682696  
34.43107377  
83.62427111  
97.87298958  
194.8957348  
6.65283641  
46.59994685  
34.49466319  
5.137935396  
22.44626417  
14.88681637  
2.300499406  
11.10814284  
5.900473558  
4.32991355  
5.968111555  
6.700386182  
4.130070269  
8.604083081  
6.597347147  
4.177922489  
4.110154894  
4.613221495  
4.079489162  
3.876690938  
3.972288509  
3.721107098  
3.493245448  
3.068998252  
3.245662134  
2.981095956  
2.982429556  
2.791381802  
2.637138727  
2.568286393  
2.460236635  
2.345823634  
2.322467753  
2.202113353  
2.136169037  
2.054504863  
1.9954357  
1.904712123  
1.867850856  
1.800821686  
1.744107884  
1.693922223  
1.640413703  
1.583953672  
1.544247058  
1.49836965  
1.454960888  
1.414881333  
1.376002869  
1.336472708  
1.300769244  
1.267162899  
1.233026031  
1.201660028  
1.171811486  
1.141274492  
1.113434759  
1.086403669  
1.060241376  
1.034888193  
1.010458779  
0.9870031967  
0.9643226  
0.9426519366  
0.9215564878  
0.9013638735  
0.8817960043  
0.8625660262  
0.8443802136  
0.8265832698  
0.8094009756  
0.7927139601  
0.7767253049  
0.7611361458  
0.7460920872  
0.7315059953  
0.7173039118  
0.7035229922  
0.690263622  
0.6773096445  
0.6647542976  
0.6525959339  
0.6407438464  
0.629256851  
0.6181173342  
0.6072695276  
0.5967273074  
0.5864879729  
0.5764945696  
0.5667882857  
0.5573444229  
0.5481605626  
0.5392317425  
0.5305303441  
0.5220389425  
0.5137735077  
0.5057157973  
0.4978516034  
0.4902074409  
0.4827483954  
0.47547456  
0.4683730706  
0.4614584468  
0.4546866507  
0.4481049335  
0.4416615015  
0.4353689565  
0.4292341152  
0.4232398411  
0.4173722999  
0.4116591068  
0.406061267  
0.4005845984  
0.3952329604  
0.3900262369  
0.3849073977  
0.3799041804  
0.3750142584  
0.370231628  
0.365563208  
0.3609534662  
0.3564788113  
0.3520832969  
0.3477893722  
0.3435759878  
0.3394586336  
0.3354200939  
0.3314571156  
0.3275820086  
0.3237713631  
0.3200569298  
0.3163972082  
0.3128245699  
0.3093158438  
0.3058783163  
0.3024953661  
0.2991867113  
0.2959468575  
0.2927605302  
0.2896286208  
0.2865594751  
0.2835488537  
0.2805954903  
0.2777052301  
0.2748557651  
0.2720671229  
0.2693126208  
0.2666259484  
0.2639771665  
0.2613728017  
0.2588144922  
0.2563064046  
0.2538399718  
0.251418695  
0.2490416875  
0.2466923628  
0.2443940159  
0.2421280747  
0.2399141227  
0.2377197846  
0.2355797926  
0.233468225  
0.2313867378  
0.2293400019  
0.2273364194  
0.2253565675  
0.2234094787  
0.2214964572  
0.2196042288  
0.2177526306  
0.2159361969  
0.2141375612  
0.2123746236  
0.2106338181  
0.2089182241  
0.2072364337  
0.2055674174  
0.203939286  
0.2023244266  
0.2007471122  
0.1991854054  
0.197646463  
0.1961356784  
0.1946451077  
0.1931799797  
0.191731073  
0.190304968  
0.1888995641  
0.1875152927  
0.1861482312  
0.1848129359  
0.1834869166  
0.1821811244  
0.1808909145  
0.1796295956  
0.178375863  
0.1771452276  
0.1759280751  
0.1747339522  
0.1735575268  
0.1723857761  
0.1712408005  
0.170111772  
0.1689937293  
0.1678951773  
0.1668112205  
0.1657370062  
0.1646743281  
0.1636411204  
0.1626111659  
0.1616027686  
0.1605922765  
0.1596116349  
0.158641834  
0.1576770947  
0.1567265929  
0.1557929748  
0.1548685355  
0.1539581667  
0.153060064  
0.1521738824  
0.1512945503  
0.1504384505  
0.1495799824  
0.1487409474  
0.1479102191  
0.1470877602  
0.1462785706  
0.1454897817  
0.144692137  
0.143915649  
0.1431447503  
0.1423867807  
0.1416388921  
0.1409012878  
0.1401739145  
0.1394457653  
0.138734105  
0.1380356326  
0.1373398942  
0.1366459558  
0.1359744706  
0.1353063697  
0.1346447082  
0.1339953745  
0.1333474979  
0.1327140571  
0.1320887746  
0.1314592685  
0.1308526787  
0.1302444514  
0.1296475135  
0.1290536623  
0.1284665092  
0.1278920148  
0.1273238468  
0.1267599773  
0.1262062903  
0.1256593557  
0.1251186029  
0.1245810162  
0.1240559018  
0.1235241345  
0.1230153326  
0.1225007128  
0.1220041324  
0.1214965643  
0.1210079583  
0.1205266491  
0.1200379902  
0.1195651661  
0.1190974637  
0.1186382556  
0.1181801179  
0.1177287243  
0.1172823306  
0.1168361486  
0.116405063  
0.1159733176  
0.11555191  
0.1151241581  
0.1147170189  
0.1143037342  
0.1138930946  
0.1134983087  
0.1131012238  
0.1127130828  
0.1123202962  
0.1119428977  
0.1115650704  
0.1111987916  
0.1108270595  
0.1104691286  
0.1101118601  
0.1097498534  
0.1094023094  
0.1090606045  
0.1087187931  
0.1083742191  
0.1080466154  
0.1077182998  
0.1073901498  
0.107072614  
0.1067572441  
0.1064431564  
0.1061284444  
0.1058287651  
0.1055318182  
0.1052289582  
0.1049337723  
0.1046510504  
0.1043606495  
0.104080232  
0.1037947537  
0.1035221725  
0.1032544976  
0.1029884634  
0.1027186529  
0.1024568963  
0.1021967794  
0.1019486212  
0.1016945753  
0.101445538  
0.1012037814  
0.1009593754  
0.1007229844  
0.1004938486  
0.1002510757  
0.1000277056  
0.09979947941  
0.09957668851  
0.09936122727  
0.09914454523  
0.09892786224  
0.098719919  
0.098513701  
0.0983092632  
0.0981079542  
0.09791189156  
0.09771821002  
0.09751784193  
0.09732905196  
0.09714441192  
0.09696177777  
0.09677866337  
0.09660178734  
0.09642464498  
0.09624890904  
0.09608444815  
0.09591272106  
0.09574692047  
0.09558960568  
0.09542437912  
0.09527229431  
0.09511271899  
0.09496456306  
0.09481291759  
0.09467004879  
0.09452539476  
0.09438339647  
0.09424176028  
0.09410929509  
0.0939727053  
0.09384265346  
0.09371454909  
0.09358723119  
0.09346449739  
0.09333906087  
0.09322054364  
0.09310604848  
0.09298920448  
0.09287715106  
0.09276767296  
0.09265894637  
0.09255422847  
0.09244793308  
0.09234788015  
0.09224873313  
0.0921581384  
0.09206075833  
0.09197140697  
0.09188153938  
0.09179458533  
0.09171117505  
0.09163116983  
0.09155112889  
0.09147387582  
0.09139345853  
0.09132191159  
0.09125180951  
0.09118287526  
0.09111667931  
0.09104983322  
0.09099162201  
0.09092541069  
0.09087532687  
0.09081006049  
0.09076172697  
0.09070982986  
0.09066368073  
0.09061508692  
0.0905675694  
0.09052826725  
0.09048310998  
0.0904477648  
0.09040613669  
0.09036987658  
0.09033839304  
0.09030854976  
0.09027855865  
0.09025207767  
0.09023272318  
0.09020430775  
0.09018885882  
0.09017151106  
0.0901573753  
0.09013803855  
0.09012622064  
0.09012150212  
0.0901170746  
0.09011016349  
0.09011096741  
0.09010413326  
