135.6023041  
157.4695606  
185.2440837  
243.410574  
1703.932453  
11183.29004  
14011.92477  
18594.12165  
12.86397712  
4706.168011  
20090.72005  
247.7020997  
14769.30026  
22936.46651  
4134.916368  
7552.244708  
9277.839153  
9409.430511  
41165.52148  
22541.80273  
1236.771062  
11798.97812  
34043.06619  
6156.385833  
1204.833944  
1367.259782  
18000.93075  
10338.83606  
29360.88575  
2837.857125  
1945.488429  
1579.800446  
8871.970698  
11626.00361  
257.1204122  
543.746861  
14203.10655  
13030.28174  
2909.945753  
10781.36062  
3061.08772  
11636.24345  
3398.353625  
13192.38432  
1338.536422  
1913.757596  
697.0358555  
603.3241578  
1381.122362  
8414.184342  
3545.002287  
4663.258227  
11303.35342  
1163.842965  
2787.456564  
1534.969558  
1355.33136  
4401.429807  
8240.103989  
7871.732268  
1753.379481  
2281.480378  
2729.993802  
358.0814991  
1008.329263  
77.48357895  
93.71354226  
199.0780166  
141.7295288  
424.8497317  
134.3998928  
148.0246463  
231.5284683  
30.68569232  
7.654359215  
9.12691875  
4.924357972  
6.596200256  
0.1990567612  
14.37419485  
0.9870245041  
0.7700349219  
0.8006754957  
6.994167906  
1.150014543  
3.583009401  
2.049481904  
2.588462289  
2.600848553  
1.813484947  
3.305418504  
2.244620411  
2.423698536  
1.830749722  
2.530166965  
2.177127857  
2.09799804  
2.273631021  
2.238527652  
2.106065446  
2.113014726  
2.049481145  
2.009575092  
1.990717141  
1.938719267  
1.901783865  
1.918157936  
1.878239618  
1.833210804  
1.82631939  
1.787657006  
1.763928836  
1.742723286  
1.706252539  
1.690596036  
1.666694725  
1.644444701  
1.618132957  
1.59749891  
1.577114515  
1.555642321  
1.53470347  
1.515458907  
1.496001375  
1.47552063  
1.456755731  
1.435648676  
1.41747127  
1.399054148  
1.382108634  
1.363750308  
1.346598752  
1.329822645  
1.312972591  
1.296795569  
1.280523382  
1.264919275  
1.249335832  
1.2341863  
1.219278902  
1.204724932  
1.190118635  
1.176001363  
1.16223869  
1.148567212  
1.135202928  
1.122051778  
1.109161665  
1.096413503  
1.084037932  
1.071751799  
1.059750744  
1.047986526  
1.036357051  
1.024954322  
1.013748557  
1.002732716  
0.9919005066  
0.9812681537  
0.9708111628  
0.9605154689  
0.9504134675  
0.9404887784  
0.9307179288  
0.9211133162  
0.9116665146  
0.9023809655  
0.8932293976  
0.8842437802  
0.8754165519  
0.8667151375  
0.8581619904  
0.8497294291  
0.8414536103  
0.8333071916  
0.8252905384  
0.8173973563  
0.809632734  
0.8019813209  
0.794465263  
0.7870530388  
0.7797650387  
0.7725845149  
0.7655147124  
0.7585547984  
0.7517032971  
0.744951033  
0.7383094324  
0.7317630751  
0.7253152919  
0.7189651005  
0.712711616  
0.7065450801  
0.7004732496  
0.6944907157  
0.6885947981  
0.6827923391  
0.6770663189  
0.6714212862  
0.6658732769  
0.6603924476  
0.6549973359  
0.6496711843  
0.6444248624  
0.6392555155  
0.6341599576  
0.6291309954  
0.6241744309  
0.6192893869  
0.6144708454  
0.6097196845  
0.6050350638  
0.6004169988  
0.5958490921  
0.5913548162  
0.5869203367  
0.5825451443  
0.5782317861  
0.5739787518  
0.5697771212  
0.565635204  
0.5615486249  
0.5575096784  
0.553530283  
0.5496072883  
0.5457289642  
0.5419065191  
0.5381303819  
0.5343992528  
0.5307294561  
0.5271002336  
0.5235162733  
0.5199825955  
0.5164888367  
0.5130412782  
0.5096354268  
0.5062810001  
0.5029594011  
0.4996893053  
0.4964507926  
0.493262473  
0.4901080887  
0.486995272  
0.483918444  
0.480875796  
0.4778880022  
0.4749154811  
0.4719911079  
0.4691017762  
0.46624766  
0.4634204986  
0.4606462374  
0.4578922032  
0.4551767059  
0.4524878116  
0.4498275499  
0.4472030252  
0.4446145861  
0.4420570819  
0.4395270344  
0.4370306492  
0.4345595938  
0.432121775  
0.4297106357  
0.4273224875  
0.4249696285  
0.4226406021  
0.420341935  
0.4180639371  
0.4158188122  
0.4136015844  
0.411403548  
0.4092330666  
0.4070852529  
0.404967045  
0.4028712838  
0.4008032164  
0.3987475824  
0.3967239427  
0.3947264108  
0.3927459373  
0.3907930776  
0.388852773  
0.386938472  
0.3850473135  
0.383181219  
0.3813349648  
0.3795022076  
0.3776946977  
0.3759068142  
0.3741391487  
0.3723975341  
0.3706595166  
0.3689529964  
0.3672615844  
0.3655899599  
0.3639380349  
0.3623057732  
0.3606849294  
0.3590867119  
0.3575051768  
0.3559392488  
0.3543960844  
0.3528641171  
0.3513553731  
0.3498565972  
0.3483762977  
0.3469158771  
0.3454621804  
0.3440349426  
0.3426193932  
0.3412187764  
0.3398279798  
0.3384558129  
0.3371053926  
0.3357666124  
0.3344363957  
0.3331255697  
0.3318241645  
0.3305438228  
0.3292719073  
0.3280150643  
0.326777137  
0.3255405835  
0.3243270533  
0.323126966  
0.3219384064  
0.3207614979  
0.3195939047  
0.3184429649  
0.3173066037  
0.3161800823  
0.3150648361  
0.313964035  
0.3128742184  
0.3117955468  
0.3107298788  
0.3096691531  
0.3086267848  
0.3076009036  
0.3065789215  
0.3055639788  
0.3045698499  
0.303577332  
0.3026008895  
0.3016353272  
0.3006819755  
0.2997387603  
0.2987955507  
0.2978726432  
0.2969602821  
0.2960596078  
0.295158629  
0.2942760637  
0.29339629  
0.2925368739  
0.2916796626  
0.2908308688  
0.289994702  
0.2891683993  
0.2883492748  
0.2875438591  
0.2867404772  
0.2859523013  
0.2851648446  
0.2843957508  
0.2836328501  
0.2828776072  
0.2821280903  
0.2813918184  
0.28065858  
0.2799383048  
0.2792234014  
0.2785214614  
0.2778209953  
0.2771344592  
0.2764508135  
0.2757817951  
0.2751161682  
0.2744563147  
0.2738110799  
0.2731676857  
0.2725327631  
0.2719091864  
0.2712908254  
0.2706783077  
0.270076189  
0.2694808624  
0.2688926239  
0.2683107124  
0.2677358479  
0.2671674704  
0.2666111679  
0.2660570611  
0.2655084163  
0.2649685897  
0.2644373633  
0.2639134839  
0.2633901566  
0.262877977  
0.2623733901  
0.2618784324  
0.2613802974  
0.2608957606  
0.2604223185  
0.2599491765  
0.25948056  
0.2590236567  
0.2585703864  
0.2581244837  
0.2576849712  
0.2572501936  
0.2568232347  
0.2564023577  
0.255986258  
0.2555713184  
0.2551723244  
0.2547749278  
0.254380831  
0.2539953473  
0.2536185459  
0.25324192  
0.252873463  
0.2525133723  
0.2521556298  
0.25180754  
0.2514606119  
0.2511219534  
0.2507905195  
0.250463277  
0.2501436389  
0.2498216008  
0.2495148709  
0.2492105866  
0.2489134034  
0.2486142121  
0.2483275091  
0.2480416356  
0.2477685136  
0.2474938046  
0.2472250761  
0.2469650055  
0.2467047778  
0.2464569101  
0.2462175319  
0.2459731366  
0.2457398355  
0.2455082063  
0.2452835258  
0.2450642417  
0.2448495689  
0.2446413945  
0.2444323554  
0.2442359911  
0.244042224  
0.2438547143  
0.243670856  
0.2434927698  
0.2433185369  
0.2431516383  
0.2429903037  
0.2428311278  
0.2426780617  
0.2425309121  
0.2423846666  
0.24224618  
0.2421076285  
0.2419856013  
0.2418620519  
0.2417378709  
0.2416274231  
0.2415169363  
0.2414156371  
0.2413158714  
0.2412246972  
0.241133468  
0.2410475175  
0.2409675444  
0.2408939888  
0.240823612  
0.2407573488  
0.2406988175  
0.2406433683  
0.2405900771  
0.2405466258  
0.2405077478  
0.2404693716  
0.2404408139  
0.2404125055  
0.2403870762  
0.2403749617  
0.2403614115  
0.2403534217  
0.2403464645  
