-0.02637868284  
-0.3122863696  
-0.5949818008  
-0.8687471538  
-1.124309357  
-1.348317539  
-1.524098222  
-1.633653765  
-1.660587028  
-1.593423572  
-1.428681036  
-1.173036787  
-0.8441172057  
-0.4696156737  
-0.08479332396  
0.2713503088  
0.5606833288  
0.7506601389  
0.8184388869  
0.7538282612  
0.5606092868  
0.2561208192  
-0.1308548308  
-0.5635292934  
-1.001401065  
-1.404812853  
-1.73919013  
-1.978470201  
-2.107370048  
-2.122294044  
-2.030915061  
-1.850542139  
-1.605588583  
-1.324457746  
-1.036239416  
-0.7675739594  
-0.5399782322  
-0.3678968734  
-0.2576024416  
-0.2070356684  
-0.2065477169  
-0.2404397048  
-0.2891243054  
-0.3316757249  
-0.3484942749  
-0.3237891714  
-0.2476203955  
-0.117247272  
0.06237701194  
0.2790373842  
0.514589946  
0.7470606098  
0.9532747231  
1.11170843  
1.205215311  
1.223298798  
1.163605049  
1.032465756  
0.8443544419  
0.620335422  
0.3856490795  
0.1667427877  
-0.01188108512  
-0.1305978325  
-0.1769831935  
-0.1472071448  
-0.04630192026  
0.1127179156  
0.3107923323  
0.5255089018  
0.7341873937  
0.9169024418  
1.059016938  
1.152855512  
1.198300518  
1.202228983  
1.176906646  
1.13761309  
1.099869003  
1.076711322  
1.076442555  
1.101200867  
1.146560952  
1.202230273  
1.2537056  
1.284643565  
1.279549872  
1.226381073  
1.118626477  
0.9565520607  
0.7473930094  
0.5044636567  
0.2452988933  
-0.01087881911  
-0.24596477  
-0.4456175403  
-0.6013061938  
-0.7114153389  
-0.7812234049  
-0.8217406617  
-0.8475897742  
-0.8742737106  
-0.9152801654  
-0.9795247561  
-1.069573183  
-1.180955911  
-1.302730072  
-1.419211313  
-1.512613922  
-1.56616412  
-1.567179694  
-1.509588803  
-1.395430797  
-1.23507863  
-1.046062402  
-0.8506526226  
-0.6725365537  
-0.5330709901  
-0.4477096426  
-0.4231552104  
-0.4557249495  
-0.5312470683  
-0.6265696071  
-0.7125414242  
-0.7580889527  
-0.7348325975  
-0.6215907635  
-0.4080942678  
-0.0973397627  
0.2938353177  
0.7361151175  
1.190884578  
1.614859514  
1.96554928  
2.206810377  
2.313717844  
2.276042589  
2.099834212  
1.806843293  
1.43185544  
1.018276344  
0.6125878417  
0.2584307524  
-0.008853272144  
-0.1664900548  
-0.2067791403  
-0.1375358334  
0.01954074461  
0.2322751267  
0.4626764766  
0.6721616572  
0.8266078383  
0.9005620675  
0.8800812011  
0.7639172758  
0.5629890258  
0.2983424255  
-0.002030969908  
-0.3070031616  
-0.5862231426  
-0.8136248221  
-0.9701410028  
-1.045384553  
-1.038189426  
-0.9560759616  
-0.8138065302  
-0.6312688728  
-0.4309944952  
-0.2355643623  
-0.06520084352  
0.06425804017  
0.1428034451  
0.1670303309  
0.1401482074  
0.07126578823  
-0.02599266187  
-0.1353821786  
-0.2402315131  
-0.3256688055  
-0.3805996014  
-0.399162569  
-0.3814497165  
-0.333375136  
-0.2656981186  
-0.1923296062  
-0.1281709773  
-0.08680812409  
-0.07841826876  
-0.1082031224  
-0.1755970892  
-0.2743414703  
-0.3934255459  
-0.518701298  
-0.6349246648  
-0.7278856059  
-0.7863184012  
-0.8032941382  
-0.7769417679  
-0.7104157011  
-0.6111679865  
-0.4896953519  
-0.3579518777  
-0.2277226539  
-0.1091553737  
-0.009662617568  
0.06668941098  
0.1192790104  
0.1505387921  
0.1651817083  
0.1691890755  
0.1687273592  
0.1691340039  
0.1741363386  
0.185389453  
0.2023835754  
0.2227376305  
0.2428195156  
0.2585905604  
0.2665486335  
0.264610871  
0.2527899146  
0.2335281388  
0.2116261371  
0.1937327609  
0.1874598378  
0.2002490045  
0.2381439434  
0.3046758893  
0.4000479787  
0.5207578303  
0.659757131  
0.8071280832  
0.9512057719  
1.079977486  
1.182563681  
1.250543034  
1.278937853  
1.266708577  
1.216694457  
1.13501936  
1.030067053  
0.9112007782  
0.787420524  
0.6661662014  
0.5524438238  
0.4483840402  
0.3532993229  
0.2641985948  
0.1766841601  
0.08608506349  
-0.01134714856  
-0.1173515328  
-0.230858509  
-0.3475972123  
-0.460205274  
-0.5588474686  
-0.6323063419  
-0.6694186101  
-0.6606831637  
-0.5998512726  
-0.4852401645  
-0.3206008884  
-0.1153704139  
0.1157683914  
0.3540075087  
0.5781214058  
0.7665644315  
0.8997394071  
0.9621719103  
0.9443256192  
0.8438711269  
0.6662376446  
0.4244074309  
0.137925924  
-0.1687512243  
-0.4684538842  
-0.7338292734  
-0.93998424  
-1.067011008  
-1.102143014  
-1.041328256  
-0.8900267346  
-0.6631192908  
-0.383863517  
-0.08192526948  
0.2093492608  
0.4562193923  
0.6280543571  
0.7006978331  
0.6593133043  
0.500344114  
0.2323401078  
-0.1245323073  
-0.5402697196  
-0.9779808812  
-1.397681747  
-1.760552107  
-2.033150394  
-2.191115496  
-2.221906878  
-2.126251324  
-1.918112952  
-1.623159842  
-1.275903151  
-0.9158061385  
-0.5828174574  
-0.3128254694  
-0.1335751167  
-0.06150221937  
-0.09988453479  
-0.2385207052  
-0.4549924662  
-0.7173601922  
-0.9879758208  
-1.227946985  
-1.40169868  
-1.481063988  
-1.448396833  
-1.298317896  
-1.037909345  
-0.6853686938  
-0.2673525395  
0.1845845235  
0.6379340829  
1.063015249  
1.436074318  
1.741328691  
1.971744765  
2.128520678  
2.219474364  
2.256640385  
2.253509443  
2.222360913  
2.172077882  
2.10677728  
2.02540977  
1.92236789  
1.788975241  
1.615615074  
1.394162995  
1.120362305  
0.7957654595  
0.428936779  
0.03568738814  
-0.3617514658  
-0.7365994856  
-1.060239013  
-1.305492977  
-1.450038831  
-1.479538034  
-1.390001296  
-1.189043114  
-0.8957515178  
-0.5391068705  
-0.155066087  
0.2173825925  
0.5407056628  
0.7832989993  
0.9233245542  
0.9514061859  
0.8717759693  
0.7016965309  
0.4692069535  
0.2095000345  
-0.03961202891  
-0.2425250586  
-0.370303031  
-0.4042110306  
-0.3378391056  
-0.1775783689  
0.05857130899  
0.3436641815  
0.6455320466  
0.9310289291  
1.170218775  
1.339934338  
1.426268662  
1.425713846  
1.344869448  
1.198847975  
1.008671605  
0.7980981232  
0.5903363179  
0.4051231545  
0.2565200761  
0.1516816975  
0.09067039545  
0.06725639475  
0.07049281951  
0.086785796  
0.1021232926  
0.1041580558  
0.0838639571  
0.0365956084  
-0.03752671244  
-0.1338955808  
-0.2442585757  
-0.3579438831  
-0.4632882916  
-0.5490645718  
-0.6057347031  
-0.6264032523  
-0.6074071627  
-0.5485229498  
-0.4528549674  
-0.326453849  
-0.1777785246  
-0.01707970475  
0.1442493297  
0.2942907317  
0.4212212635  
0.513919762  
0.5625977783  
0.559453453  
0.4993276331  
0.3803179954  
0.2042675802  
-0.02295109097  
-0.291453227  
-0.587713683  
-0.8953207278  
-1.196071204  
-1.471342279  
-1.703598068  
-1.877870604  
-1.983069453  
-2.012952261  
-1.966654721  
-1.848726293  
-1.668668596  
-1.440039297  
-1.179236718  
-0.9040974442  
-0.6324620944  
-0.3808479239  
-0.1633259468  
0.009311754492  
0.1300780504  
0.1960193651  
0.2081848643  
0.1713734177  
0.09372903319  
-0.01380847783  
-0.1381614239  
-0.2648959383  
-0.3791360709  
-0.4666188064  
-0.5148719202  
-0.514474284  
-0.4602878273  
-0.3525316527  
-0.1975035177  
-0.007777712834  
0.1983061752  
0.3979432041  
0.5659657531  
0.6776130833  
0.7117046384  
0.6538380784  
0.4991518074  
0.2541901324  
-0.0625327475  
-0.4215185555  
-0.7848695472  
-1.110279463  
-1.355997572  
-1.486136655  
-1.475605543  
-1.313936001  
-1.007372959  
-0.5788615849  
-0.06581815323  
0.4840939321  
1.018650689  
1.487467405  
1.848234525  
2.071939977  
2.146336517  
2.077188059  
1.88714725  
1.612438001  
1.297838714  
0.9906957898  
0.734794895  
0.5649409689  
0.5029311771  
0.5554114828  
0.7138088989  
0.9562222472  
1.25091361  
1.560813089  
1.848369232  
2.080058894  
2.229986754  
2.282159225  
2.231252619  
2.081931472  
1.846960678  
1.54452892  
1.195256569  
0.8193918234  
0.4345792179  
0.05448817063  
-0.3115933799  
-0.6582705151  
-0.9828574851  
-1.283814683  
-1.559170175  
-1.805266219  
-2.016092249  
-2.183368532  
-2.297379119  
-2.348426385  
-2.328636981  
-2.233795091  
-2.064824834  
-1.828607332  
-1.537919794  
-1.210414329  
-0.8667416752  
-0.5280836139  
-0.2134845048  
0.062579639  
0.2919489802  
0.4735223635  
0.6128264368  
0.7204571773  
0.8096354724  
0.893320659  
0.9813847961  
1.07839499  
1.18241814  
1.28511833  
1.373150542  
1.430628511  
1.44222767  
1.396350341  
1.287761945  
1.119181046  
0.9014902622  
0.6524973232  
0.3944344554  
0.1506066493  
-0.058194388  
-0.2168843164  
-0.3183031434  
-0.3640465525  
-0.3637560421  
-0.3329904774  
-0.2900726694  
-0.2524800277  
-0.2334622895  
-0.2395054582  
-0.2691343685  
-0.3132925386  
-0.357235675  
-0.3836195461  
-0.3762036254  
-0.3234985652  
-0.221656035  
-0.07605931886  
0.09871957217  
0.2806341726  
0.443269679  
0.5598499411  
0.6074498638  
0.5707285909  
0.4445591922  
0.2351342058  
-0.04060723912  
-0.3571057443  
-0.6834992777  
-0.9875721176  
-1.239748509  
-1.416535183  
-1.50297431  
-1.493841121  
-1.393573337  
-1.215042355  
-0.9775147143  
-0.7041608894  
-0.4195014385  
-0.1471282683  
0.09211204956  
0.2813461355  
0.4083666352  
0.4658778025  
0.4514605365  
0.3673688867  
0.2202780475  
0.02099007473  
-0.21593358  
-0.4727059155  
-0.7291151773  
-0.9636655859  
-1.155085563  
-1.284108578  
-1.33538835  
-1.29929023  
-1.17329778  
-0.9627611854  
-0.6808074468  
-0.3472884684  
0.01314209799  
0.373654792  
0.7082318949  
0.9946272603  
1.21684804  
1.366813388  
1.444899348  
1.459289  
1.42421391  
1.35735492  
1.276798299  
1.198047484  
1.131552792  
1.081147495  
1.043651111  
1.009671674  
0.9654615714  
0.8955146282  
0.785459692  
0.6247844811  
0.4089433312  
0.1405335405  
-0.1706086979  
-0.5083966352  
-0.8523438364  
-1.179980954  
-1.469437932  
-1.701815585  
-1.863022783  
-1.944882219  
-1.945426564  
-1.868456062  
-1.722531287  
-1.519624402  
-1.273691798  
-0.9993652241  
-0.7109222531  
-0.4215663836  
-0.1430194123  
0.1146895093  
0.3433410926  
0.5366487732  
0.6904630195  
0.8030371383  
0.8752996407  
0.9110113435  
0.9166948582  
0.9012117962  
0.8749648137  
0.8487533773  
0.8324030917  
0.8333736713  
0.8555713516  
0.8985827497  
0.9575065464  
1.023456975  
1.084692527  
1.12824842  
1.141809054  
1.11557299  
1.043815877  
0.9259180568  
0.7667253267  
0.5761881294  
0.3683445647  
0.1598073332  
-0.03205219974  
-0.19097697  
-0.3035433352  
-0.3605306588  
-0.3578325043  
-0.2968262817  
-0.1842181815  
-0.03139861741  
0.1466104524  
0.3325028807  
0.5082129679  
0.6565022066  
0.7624871268  
0.8149830311  
0.8075570554  
0.7391872163  
0.6144530712  
0.4431916745  
0.2396301753  
0.02103350095  
-0.1940210465  
-0.3875748834  
-0.5442233296  
-0.6528142578  
-0.707699667  
-0.7093591462  
-0.6642906233  
-0.5841483025  
-0.4842235369  
-0.3814479441  
-0.2921624738  
-0.2299671669  
-0.2039149859  
-0.217316127  
-0.2673173837  
-0.3453034751  
-0.4380815159  
-0.5296802125  
-0.6035128873  
-0.6446145372  
-0.6416364649  
-0.5883355185  
-0.4843619628  
-0.3352417954  
-0.1515911423  
0.05232781128  
0.260476264  
0.457067307  
0.6284667302  
0.764714173  
0.8604591773  
0.9152362197  
0.9330559901  
0.9214302768  
0.8899913576  
0.8489227533  
0.8074388172  
0.7725064054  
0.7479687426  
0.7341612634  
0.7280268063  
0.7236857253  
0.7133571267  
0.6884932657  
0.6409659615  
0.564179367  
0.4539619245  
0.3091545442  
0.1318274367  
-0.07287876585  
-0.2972612065  
-0.5318447616  
-0.7663570955  
-0.9907501468  
-1.196163102  
-1.375695809  
-1.524914351  
-1.642025684  
-1.727731008  
-1.784778574  
-1.81729637  
-1.829999213  
-1.827380633  
-1.812988811  
-1.78888303  
-1.755337183  
-1.710822598  
-1.652284989  
-1.575671628  
-1.476667567  
-1.351539183  
-1.197988879  
-1.015913712  
-0.8079410335  
-0.5796742435  
-0.3395623175  
-0.09838740889  
0.1316001891  
0.3378413822  
0.5087860032  
0.6352296757  
0.7114985247  
0.7363239017  
0.7132737302  
0.6506550065  
0.5608600038  
0.4592117322  
0.3624179736  
0.2868155234  
0.246613712  
0.252366745  
0.3098469365  
0.4194845623  
0.5764147466  
0.7711014815  
0.9904477433  
1.219190897  
1.441403705  
1.641899569  
1.807396022  
1.92735469  
1.994492223  
2.005019698  
1.958701154  
1.858816182  
1.712099193  
1.528638185  
1.321682789  
1.107250502  
0.903389951  
0.7290249593  
0.6023351647  
0.5387585055  
0.5488121825  
0.6360185698  
0.7953138782  
1.012269877  
1.263442479  
1.517981818  
1.740460192  
1.894687945  
1.94807408  
1.875969437  
1.665369813  
1.317394644  
0.8481137286  
0.2874815005  
-0.3235552689  
-0.9374886472  
-1.505655068  
-1.983922403  
-2.33788661  
-2.546891333  
-2.606313413  
-2.527817237  
-2.337557833  
-2.072598215  
-1.776037822  
-1.491518387  
-1.257832266  
-1.104336485  
-1.047711542  
-1.090434615  
-1.221077083  
-1.416307823  
-1.644248054  
-1.8687059  
-2.053686616  
-2.167636186  
-2.186879554  
-2.097911599  
-1.898335204  
-1.596443127  
-1.209604898  
-0.7617722221  
-0.2804933658  
0.2061441955  
0.6722514193  
1.096254803  
1.462205457  
1.760235574  
1.986221735  
2.14085381  
2.228329304  
2.254937865  
2.227771853  
2.153729052  
2.038912068  
1.888433426  
1.706571387  
1.497150912  
1.264035004  
1.011566684  
0.7448766907  
0.4699852168  
0.1936963704  
-0.07668553441  
-0.333729312  
-0.5702786877  
-0.7797780297  
-0.9564854477  
-1.095563099  
-1.193064695  
-1.245884332  
-1.251743949  
-1.209301945  
-1.118404452  
-0.9805033071  
-0.7991650589  
-0.5805726777  
-0.3338807693  
-0.07127992126  
0.1923493407  
0.4402495309  
0.6550544937  
0.820398519  
0.9226994901  
0.9528602257  
0.9076537949  
0.790538691  
0.611742581  
0.3875323264  
0.1386965209  
-0.1116123273  
-0.3404284814  
-0.5276067481  
-0.6581887548  
-0.7241730605  
-0.7254193356  
-0.6695336457  
-0.5707080052  
-0.4476242367  
-0.3207082328  
-0.2090876504  
-0.1276820094  
-0.08487591032  
-0.08112872781  
-0.1087694559  
-0.1530652315  
-0.1944484784  
-0.2116101659  
-0.1850367536  
-0.1004619946  
0.04829789656  
0.2575885716  
0.5135526751  
0.793289446  
1.067434888  
1.30383519  
1.471847499  
1.546657529  
1.512998376  
1.367744403  
1.120947911  
0.7951619267  
0.4230691627  
0.04370431047  
-0.3022534143  
-0.5775181437  
-0.7528899678  
-0.8109993033  
-0.7485787679  
-0.5769721191  
-0.3207855988  
-0.01485097087  
0.3001066659  
0.5825595478  
0.7953557314  
0.9103374628  
0.9118060362  
0.7983928235  
0.5831203174  
0.2916330956  
-0.04114274431  
-0.3754950681  
-0.6719742135  
-0.8963619844  
-1.023913986  
-1.042329981  
-0.9530896517  
-0.7709932511  
-0.5219880052  
-0.2395922767  
0.03959742826  
0.28069839  
0.4550038304  
0.5435109074  
0.5390857708  
0.4469877969  
0.2837436427  
0.07454819914  
-0.150395136  
-0.3600909674  
-0.5269263006  
-0.6302617944  
-0.6589687965  
-0.6126281875  
-0.501271497  
-0.3437519493  
-0.1650099701  
0.007375560709  
0.1468909207  
0.2315652774  
0.2467941858  
0.1871817324  
0.05719048721  
-0.1294253715  
-0.3513310185  
-0.5822052277  
-0.793900934  
-0.9597703834  
-1.057743669  
-1.072805038  
-0.9985749839  
-0.8378305412  
-0.6019252466  
-0.3092226836  
0.0172354895  
0.352505376  
