80.97130564  
94.30129686  
123.5810014  
180.0116016  
231.5044182  
4552.201771  
19249.93382  
21448.30569  
32080.53721  
22610.24597  
27543.82051  
23188.10749  
5529.442465  
12100.50507  
34873.35283  
11495.80116  
48035.67406  
1111.636975  
6592.832098  
29489.47949  
2845.911906  
2524.670433  
10963.33166  
8879.041804  
2045.659447  
506.7742606  
5932.265717  
10921.74913  
14223.44151  
3207.872731  
3073.189025  
6514.446695  
1127.888991  
8585.643655  
8830.534475  
1155.751316  
1732.57671  
1092.619136  
677.2170342  
2895.652635  
1861.179902  
16183.67286  
293.6983915  
7178.234272  
9732.792243  
545.5682481  
2817.208287  
11175.32567  
924.2704603  
3650.437931  
4315.897307  
112.2658793  
4630.170383  
1726.113837  
89.74852066  
4902.100906  
4284.063599  
1262.854071  
3349.423256  
2141.290965  
2627.787685  
2722.236725  
1202.899848  
373.5486462  
63.0163285  
263.0124181  
298.0830452  
6.272584059  
74.82727883  
48.01126656  
113.332952  
68.21555023  
53.59973394  
9.801066512  
2.899883574  
18.23254959  
6.363896632  
7.15499178  
4.079899373  
7.965214973  
5.504937173  
2.245931126  
3.044368856  
1.733102273  
1.635769694  
2.873547122  
2.004058469  
2.066370205  
2.037622537  
1.928391033  
1.798678784  
1.53289705  
1.438414121  
1.374253972  
1.283465904  
1.215987598  
1.131414719  
1.102049219  
1.065397951  
1.000993019  
0.9180445858  
0.8867289944  
0.8258622319  
0.8088842141  
0.7778267982  
0.7397377208  
0.7068724527  
0.6778872577  
0.6554204961  
0.6301244298  
0.6047148226  
0.583827432  
0.5618012853  
0.5427373182  
0.5252922595  
0.5060230321  
0.4905457212  
0.4731374081  
0.4592947107  
0.4447479006  
0.4312583034  
0.4187834769  
0.4065536578  
0.3954391756  
0.3839557596  
0.3733770146  
0.3634725356  
0.3539475845  
0.3447714949  
0.3360189881  
0.3276463479  
0.3196439693  
0.3118620184  
0.3044926357  
0.297347346  
0.290587953  
0.2839767489  
0.2776337149  
0.2716095469  
0.2657723987  
0.2600773274  
0.2546769116  
0.2494255993  
0.2443668917  
0.239471704  
0.2347449376  
0.2301711677  
0.2257643109  
0.2214944541  
0.2173566423  
0.2133487654  
0.2094784315  
0.2057288212  
0.2020748675  
0.1985398134  
0.195118582  
0.1917957374  
0.188564278  
0.1854291291  
0.1823873478  
0.1794262518  
0.1765482199  
0.1737571064  
0.1710270887  
0.1683829219  
0.1658100572  
0.1632988711  
0.1608502028  
0.158478999  
0.1561507119  
0.1538961169  
0.1516893988  
0.1495457605  
0.147450041  
0.1454037727  
0.1434149222  
0.1414715769  
0.1395613174  
0.1377132633  
0.1358963659  
0.1341231801  
0.1323954218  
0.1307051086  
0.129053865  
0.1274337475  
0.125854475  
0.1243064877  
0.1227980878  
0.1213143949  
0.1198697  
0.118452971  
0.1170629537  
0.1157053488  
0.1143773558  
0.1130750726  
0.1117930752  
0.1105456567  
0.1093206356  
0.108119258  
0.1069441732  
0.1057896811  
0.1046576343  
0.1035519026  
0.1024599265  
0.1013868574  
0.1003393041  
0.0993165075  
0.09830402248  
0.09731155703  
0.0963433116  
0.09538745335  
0.09445221785  
0.09353602703  
0.09262620155  
0.09174118425  
0.09087047182  
0.0900112251  
0.08917411231  
0.08834284787  
0.08753607897  
0.08673163231  
0.08595220088  
0.08517802806  
0.08441413565  
0.08367222316  
0.08294345184  
0.08221678621  
0.08151153419  
0.08081213824  
0.08012691206  
0.07944785549  
0.07878408567  
0.078129638  
0.077489225  
0.07685257333  
0.07622749893  
0.07561539255  
0.07501511148  
0.074419369  
0.07383185574  
0.07325380655  
0.07268924639  
0.07213157459  
0.0715812356  
0.07103927784  
0.07050419703  
0.06997902294  
0.06945488503  
0.06894752921  
0.06844217947  
0.06795204152  
0.06745898289  
0.06697876159  
0.06650439863  
0.06603850758  
0.06557595163  
0.06511804442  
0.06467221915  
0.06423023318  
0.06379320707  
0.06336744993  
0.06293925848  
0.06252507052  
0.06211373306  
0.06170788235  
0.06130438157  
0.06091072948  
0.06052307067  
0.06013905048  
0.05975693587  
0.05938317402  
0.05901497774  
0.05864797838  
0.05828895903  
0.05793139403  
0.05758150833  
0.0572386069  
0.05689875281  
0.05656211163  
0.05623351891  
0.05590347946  
0.05558030367  
0.05526270776  
0.05494842936  
0.0546333237  
0.05433032347  
0.05402283123  
0.05372254804  
0.05343284247  
0.05313535673  
0.05285061871  
0.05256586417  
0.05228860702  
0.05200512188  
0.05173296667  
0.05146328707  
0.05119784712  
0.05093533237  
0.0506706065  
0.05041315718  
0.05016407026  
0.04991054149  
0.04966339085  
0.04941517192  
0.04917655852  
0.04893699288  
0.0486999142  
0.04846836721  
0.04823601652  
0.04800890526  
0.04778401837  
0.04756399905  
0.0473426064  
0.04712614402  
0.04691339852  
0.04670180563  
0.04648970366  
0.04628177783  
0.04607911539  
0.04587506131  
0.04567946156  
0.04547838143  
0.04528484729  
0.04509157502  
0.04490394324  
0.044716697  
0.04453068726  
0.04434679252  
0.04416564837  
0.0439860634  
0.04380695322  
0.04363175157  
0.04346186687  
0.04329134881  
0.04312206947  
0.04295650242  
0.04278813798  
0.04262730453  
0.0424636367  
0.04230526936  
0.04214822089  
0.04199192959  
0.04183733607  
0.04168821199  
0.04153263189  
0.04138768513  
0.04124017252  
0.04109460073  
0.04095055133  
0.04081013265  
0.04067205957  
0.04053242601  
0.04039701646  
0.0402635518  
0.04012645684  
0.04000141861  
0.03986573093  
0.03973767366  
0.03960917734  
0.03948495819  
0.03935834017  
0.0392372406  
0.03911540832  
0.03899564912  
0.03887582971  
0.03875977443  
0.03864530554  
0.03853329286  
0.03841653069  
0.03830746588  
0.03819690434  
0.03808510899  
0.03798156527  
0.0378726214  
0.03776705817  
0.03766397834  
0.03756000668  
0.03745969895  
0.03736139409  
0.03726057716  
0.03716372647  
0.03706770695  
0.03697089136  
0.03688322468  
0.03678420317  
0.03669265494  
0.03660198338  
0.03651422579  
0.03642639406  
0.03633879442  
0.03625480688  
0.03617097536  
0.0360880585  
0.03600371076  
0.0359210532  
0.03584112309  
0.03576344951  
0.03568387413  
0.03560775991  
0.03553128265  
0.03545517356  
0.03538156673  
0.03530758426  
0.03523541204  
0.03516788173  
0.03509523649  
0.03502438404  
0.03495915533  
0.03489184145  
0.03482371746  
0.03475761808  
0.03469397712  
0.03463197963  
0.03456568728  
0.03450796873  
0.03444536216  
0.03438744081  
0.03432874268  
0.03427000082  
0.03421274837  
0.03415438526  
0.03410427693  
0.03404623028  
0.03399508886  
0.03394013566  
0.03388803237  
0.03383838921  
0.03379106533  
0.03374006846  
0.0336900361  
0.03364378992  
0.03359606873  
0.03355128278  
0.03350444009  
0.03346293817  
0.03341903555  
0.03337698245  
0.03333394281  
0.03329333003  
0.03325416415  
0.03321534141  
0.03317546575  
0.03313669774  
0.03310130674  
0.03306621708  
0.03302987069  
0.03299841491  
0.03296045412  
0.03292570758  
0.03289442477  
0.03286443229  
0.03283452327  
0.03280329908  
0.03277389058  
0.03274599052  
0.03271670746  
0.03269134695  
0.03266474455  
0.03264326132  
0.032616965  
0.03259241245  
0.0325690704  
0.032547413  
0.03252596744  
0.03250137702  
0.03248362878  
0.03246400504  
0.03244528891  
0.03242715916  
0.03240837662  
0.03239294664  
0.03237514271  
0.03236287495  
0.03234940278  
0.03233139111  
0.03231896624  
0.03230640217  
0.0322971473  
0.03228571511  
0.03227537085  
0.03226657822  
0.03225842925  
0.03224743101  
0.03224022838  
0.03223266488  
0.03222724509  
0.03222002413  
0.03222105815  
0.0322158597  
0.03221241996  
0.03220792362  
0.03220738751  
0.03220570721  
0.03220464459  
