0.3450606295  
0.5164782678  
0.6765377624  
0.8156386041  
0.9263936411  
1.004368267  
1.048452138  
1.060831537  
1.046566422  
1.012846184  
0.9680277411  
0.9205847892  
0.8781104938  
0.8464922493  
0.8293525587  
0.8278117975  
0.840570446  
0.8642827397  
0.894141565  
0.9245823349  
0.9500049648  
0.9654175038  
0.9669315626  
0.9520648012  
0.9198366055  
0.8706775094  
0.8061899998  
0.7288209128  
0.641497388  
0.5472917702  
0.4491432237  
0.3496703348  
0.2510715644  
0.1551065749  
0.06312817802  
-0.02385567334  
-0.1051270182  
-0.1802226033  
-0.248928723  
-0.3113042164  
-0.3677140158  
-0.4188530228  
-0.4657455366  
-0.5096964297  
-0.5521933663  
-0.5947704528  
-0.6388408682  
-0.6855319975  
-0.735545479  
-0.7890597777  
-0.845697698  
-0.9045500799  
-0.9642539579  
-1.023100364  
-1.079154766  
-1.130366699  
-1.174658827  
-1.209996351  
-1.23443871  
-1.24619622  
-1.243707892  
-1.225748425  
-1.191571212  
-1.141073204  
-1.074951777  
-0.9948271181  
-0.9032868202  
-0.8038258113  
-0.700664305  
-0.5984481228  
-0.5018547608  
-0.4151437165  
-0.341711731  
-0.2837085411  
-0.2417633826  
-0.2148739822  
-0.2004666545  
-0.19463583  
-0.1925343111  
-0.1888750621  
-0.178480223  
-0.1568319546  
-0.1205454279  
-0.06772986126  
0.001808805213  
0.08653847514  
0.1833484472  
0.2878536991  
0.3948272274  
0.4987196045  
0.5942075084  
0.676726654  
0.7429311508  
0.7910381894  
0.8210185943  
0.8346148218  
0.8351760294  
0.827322146  
0.8164665892  
0.8082372475  
0.807853393  
0.8195245813  
0.8459311415  
0.8878499112  
0.94397285  
1.010940873  
1.083606856  
1.155495782  
1.219425935  
1.268215927  
1.29540648  
1.295906223  
1.266489567  
1.206088817  
1.115841302  
0.9988972537  
0.8600131989  
0.7049910843  
0.5400406175  
0.3711539455  
0.2035788182  
0.04145126857  
-0.1123588185  
-0.2562021665  
-0.3894087771  
-0.5119261676  
-0.6239080886  
-0.7253327  
-0.8157326876  
-0.8940854703  
-0.9588820487  
-1.00836844  
-1.040902644  
-1.055358458  
-1.051500794  
-1.030240841  
-0.9937311939  
-0.9452571673  
-0.8889457441  
-0.8293282302  
-0.7708259977  
-0.7172506271  
-0.671385755  
-0.6347278219  
-0.6074240238  
-0.5884058848  
-0.5756968128  
-0.5668324083  
-0.5593208105  
-0.5510637906  
-0.5406629403  
-0.527571247  
-0.5120570419  
-0.4950086162  
-0.4776096027  
-0.4609600563  
-0.4457172332  
-0.4318267264  
-0.4184063195  
-0.4038083402  
-0.3858599119  
-0.362241771  
-0.3309470261  
-0.2907262429  
-0.2414470852  
-0.1842815  
-0.1216772325  
-0.05709674841  
0.005447966751  
0.06200539054  
0.1093432474  
0.1455523065  
0.1704832033  
0.1859410042  
0.195583808  
0.2045222429  
0.2186725936  
0.2439459686  
0.2853954699  
0.3464516109  
0.4283592176  
0.5299021786  
0.6474625565  
0.7753929121  
0.9066529282  
1.033600713  
1.148831787  
1.245937137  
1.32008712  
1.368373406  
1.389885705  
1.385544123  
1.357737775  
1.309845646  
1.245725027  
1.169241146  
1.083896045  
0.9925849357  
0.8974924414  
0.8001034175  
0.7013025115  
0.601522173  
0.5009020766  
0.399429348  
0.2970492131  
0.1937338782  
0.08951671463  
-0.01549332144  
-0.1211125614  
-0.2270813271  
-0.3330524705  
-0.4385730172  
-0.543048394  
-0.6457035439  
-0.7455361565  
-0.8412779879  
-0.9313668603  
-1.013942151  
-1.08687517  
-1.147841464  
-1.194446052  
-1.22439995  
-1.235734876  
-1.227046056  
-1.197722579  
-1.148137083  
-1.079749336  
-0.9951000883  
-0.8976671099  
-0.7915926262  
-0.6813086474  
-0.5710995194  
-0.4646706182  
-0.3647906512  
-0.2730619764  
-0.1898615817  
-0.1144626038  
-0.04531176895  
0.01958305032  
0.08223248901  
0.1442821934  
0.2067410826  
0.2698560889  
0.3331539455  
0.3956294337  
0.4560205816  
0.5131162134  
0.5660150401  
0.614284253  
0.6579741065  
0.697495931  
0.7333772572  
0.7659602726  
0.7951015723  
0.8199506713  
0.8388565531  
0.8494394798  
0.8488227239  
0.8340015314  
0.8022850912  
0.7517451028  
0.6815950139  
0.5924330075  
0.486309605  
0.3666030246  
0.2377210877  
0.1046716593  
-0.0274354139  
-0.1538764609  
-0.2707343243  
-0.3751811575  
-0.4656081323  
-0.5415847996  
-0.6036765782  
-0.6531647744  
-0.6917247805  
-0.7211174074  
-0.7429535814  
-0.7585538896  
-0.7689206407  
-0.7748101531  
-0.7768667046  
-0.7757853056  
-0.7724467411  
-0.7679895544  
-0.7637960319  
-0.7613820708  
-0.7622099013  
-0.7674578964  
-0.7777881907  
-0.793161927  
-0.8127403775  
-0.8349007684  
-0.8573669889  
-0.8774461333  
-0.8923352573  
-0.8994515988  
-0.8967368449  
-0.882893973  
-0.8575142501  
-0.8210857474  
-0.7748845825  
-0.7207687646  
-0.6609110607  
-0.5975167746  
-0.5325652579  
-0.4676131368  
-0.4036772936  
-0.3412067974  
-0.280128994  
-0.2199465913  
-0.1598628277  
-0.09889319402  
-0.03595549269  
0.03008039314  
0.1003798815  
0.1761470072  
0.2586284114  
0.3490879517  
0.4487353074  
0.5586052651  
0.6793779499  
0.8111804496  
0.9533816776  
1.104426144  
1.261742595  
1.421752475  
1.579998133  
1.731391005  
1.87056188  
1.99227858  
2.091894689  
2.165763388  
2.211576413  
2.228571264  
2.217582083  
2.180909919  
2.122031859  
2.045167552  
1.954765866  
1.85497582  
1.749170894  
1.639603331  
1.527234579  
1.41177878  
1.291946069  
1.165861529  
1.031585944  
0.8876611077  
0.7335910544  
0.5701719408  
0.3996184768  
0.225460227  
0.05221460574  
-0.1151087836  
-0.2715993337  
-0.4130406136  
-0.5364085118  
-0.6402100899  
-0.7245992965  
-0.7912650881  
-0.8431196224  
-0.8838336648  
-0.9173102234  
-0.9471711833  
-0.9763431734  
-1.006789594  
-1.039425416  
-1.074198856  
-1.110318084  
-1.146554775  
-1.18157447  
-1.214223711  
-1.243735926  
-1.269824716  
-1.292665155  
-1.312782925  
-1.330881588  
-1.347648746  
-1.363579392  
-1.378844319  
-1.393223455  
-1.406101988  
-1.416527206  
-1.42330797  
-1.425133886  
-1.420704959  
-1.408849248  
-1.388620636  
-1.359378976  
-1.320839362  
-1.273098939  
-1.216638507  
-1.152300834  
-1.081245524  
-1.004882179  
-0.9247870856  
-0.8426101017  
-0.7599785282  
-0.6784081763  
-0.5992306397  
-0.5235370722  
-0.452147013  
-0.385588369  
-0.3240896161  
-0.2675735984  
-0.2156483179  
-0.1675895259  
-0.1223265801  
-0.078437662  
-0.03417360006  
0.01247580453  
0.06365459224  
0.1214586856  
0.187690149  
0.2635868327  
0.3495463762  
0.4449017956  
0.5477891346  
0.6551461371  
0.7628752862  
0.866172688  
0.9599958812  
1.039632045  
1.101288231  
1.142620481  
1.163121572  
1.164296756  
1.149581041  
1.123992095  
1.093546462  
1.064513964  
1.042601693  
1.032182531  
1.035685503  
1.053235221  
1.08260447  
1.119499097  
1.158138056  
1.192056361  
1.215014042  
1.221887439  
1.209404477  
1.176619415  
1.12505361  
1.058477042  
0.98236417  
0.9030999936  
0.8270541796  
0.7596560769  
0.7046093639  
0.6633510074  
0.6348383173  
0.6156883224  
0.6006433534  
0.5832977916  
0.5569832295  
0.5156847076  
0.4548682281  
0.3721072532  
0.2674257273  
0.1433256426  
0.004487495015  
-0.1428016791  
-0.2914218912  
-0.4342863947  
-0.5651866325  
-0.6795045503  
-0.7746967353  
-0.8504870888  
-0.9087419874  
-0.9530540215  
-0.9880898962  
-1.018808016  
-1.04964818  
-1.08382895  
-1.122840601  
-1.16621568  
-1.211602468  
-1.255127035  
-1.291980792  
-1.317143331  
-1.326128372  
-1.31563478  
-1.2840141  
-1.231487337  
-1.160087586  
-1.073346955  
-0.9757887392  
-0.87230614  
-0.7675293472  
-0.6652721233  
-0.5681376828  
-0.4773334041  
-0.3927018018  
-0.3129510747  
-0.2360304653  
-0.1595783216  
-0.08137338349  
0.0002919624758  
0.08635769413  
0.1768988899  
0.2711746038  
0.3678105169  
0.4650612578  
0.5611057579  
0.6543215588  
0.7434920245  
0.8279157019  
0.9074082388  
0.9821982043  
1.052740752  
1.119480402  
1.182596777  
1.241773072  
1.296018781  
1.34357586  
1.381919591  
1.407866599  
1.417789444  
1.407914394  
1.374696812  
1.315225733  
1.227630993  
1.111438209  
0.9678308239  
0.7997747577  
0.6119703629  
0.4106219182  
0.2030263889  
-0.00298507098  
-0.199698699  
-0.3801922905  
-0.5389516056  
-0.6723506164  
-0.7789306388  
-0.8594456764  
-0.9166519089  
-0.9548787142  
-0.9794258525  
-0.9958693155  
-1.009364546  
-1.024034402  
-1.042521453  
-1.065759555  
-1.092981265  
-1.12196301  
-1.149451954  
-1.171718212  
-1.185149108  
-1.186795973  
-1.174809384  
-1.148701375  
-1.109404096  
-1.0591378  
-1.001104981  
-0.9390673475  
-0.8768687134  
-0.8179656139  
-0.76502903  
-0.719665014  
-0.6822739278  
-0.6520627767  
-0.6271951071  
-0.6050492263  
-0.5825463333  
-0.5565005095  
-0.5239525299  
-0.4824393187  
-0.4301794138  
-0.3661537037  
-0.2900882312  
-0.2023485078  
-0.1037842659  
0.00445094348  
0.1210535498  
0.2446737474  
0.3739475271  
0.5074489674  
0.6435810715  
0.7804416392  
0.9156975001  
1.04652806  
1.169663104  
1.281547765  
1.378627318  
1.457729814  
1.516490389  
1.553747489  
1.569840895  
1.566735135  
1.547929448  
1.51812882  
1.482701234  
1.446977384  
1.415479646  
1.39118822  
1.374957921  
1.365185688  
1.35779392  
1.34656767  
1.323821052  
1.281328664  
1.211414531  
1.108063376  
0.9679055785  
0.7909404201  
0.5808841107  
0.3450770727  
0.09393698309  
-0.1599961898  
-0.403320316  
-0.6231972252  
-0.8087626733  
-0.9523503401  
-1.050368125  
-1.103705406  
-1.11761177  
-1.101052705  
-1.06561835  
-1.024116533  
-0.9890307386  
-0.9710331528  
-0.9777403195  
-1.01286877  
-1.07588028  
-1.162155142  
-1.263653496  
-1.369966317  
-1.469607835  
-1.551383947  
-1.605663156  
-1.625401659  
-1.606812177  
-1.549620519  
-1.45690375  
-1.334559024  
-1.190493664  
-1.033650797  
-0.8730020222  
-0.71662669  
-0.570981117  
-0.4404242713  
-0.3270370854  
-0.2307200824  
-0.1495325524  
-0.0801960883  
-0.01868511509  
0.03918694455  
0.09725810647  
0.1586409957  
0.2255060491  
0.2990221239  
0.3794333254  
0.4662282857  
0.558355559  
0.6544363955  
0.7529401223  
0.852304927  
0.950994693  
1.047513483  
1.140386752  
1.228144875  
1.309322995  
1.3824895  
1.44630053  
1.499574855  
1.541365569  
1.571001201  
1.588091267  
1.592475547  
1.58412811  
1.563033109  
1.529056656  
1.481857309  
1.420859439  
1.345308676  
1.254422384  
1.14760397  
1.024701096  
0.8862504308  
0.7336600175  
0.5692885335  
0.396384007  
0.2188843081  
0.04109579543  
-0.1327042634  
-0.2986832899  
-0.4538159131  
-0.5961401345  
-0.7248553058  
-0.8402524447  
-0.943479142  
-1.03618244  
-1.120086821  
-1.196575447  
-1.266347987  
-1.329217491  
-1.384080116  
-1.429072202  
-1.461903115  
-1.480301967  
-1.482530565  
-1.467858552  
-1.43693694  
-1.391985031  
-1.336746597  
-1.276199694  
-1.216039762  
-1.161991307  
-1.119037553  
-1.090679031  
-1.078328259  
-1.080953626  
-1.095032315  
-1.114860455  
-1.133190026  
-1.142126802  
-1.13417417  
-1.103275403  
-1.045697281  
-0.9606186724  
-0.8503203165  
-0.7199324661  
-0.5767684681  
-0.4293328456  
-0.2861506963  
-0.154591306  
-0.03986647244  
0.05564664586  
0.1326596426  
0.1947732293  
0.2478587669  
0.2991301963  
0.3560470291  
0.4252239819  
0.5114988081  
0.617296474  
0.7423584727  
0.8838591322  
1.036865174  
1.195050102  
1.351538375  
1.499747272  
1.634106875  
1.75055905  
1.846793366  
1.922203257  
1.977610205  
2.014817261  
2.036088556  
2.043644182  
2.039247705  
2.023943756  
1.997968478  
1.960824465  
1.911486908  
1.848686559  
1.771212973  
1.678185172  
1.569247188  
1.444671903  
1.305371396  
1.152829031  
0.9889843851  
0.816103758  
0.6366617263  
0.4532513005  
0.2685297041  
0.08519692487  
-0.09402417459  
-0.2664124986  
-0.4293084273  
-0.5802192167  
-0.7169663025  
-0.8378700765  
-0.9419391595  
-1.029034793  
-1.099976293  
-1.15655328  
-1.201426145  
-1.23791285  
-1.269675986  
-1.300342858  
-1.333107305  
-1.370359773  
-1.413408967  
-1.462322489  
-1.51592157  
-1.571926498  
-1.627236709  
-1.678307729  
-1.721568298  
-1.753827356  
-1.772619159  
-1.776437639  
-1.764844048  
-1.73843892  
-1.6987109  
-1.647792802  
-1.588160937  
-1.522320488  
-1.452518333  
-1.380511796  
-1.307423511  
-1.233681536  
-1.159057022  
-1.082778286  
-1.003708914  
-0.9205617562  
-0.832127183  
-0.7374852366  
-0.6361803685  
-0.5283415609  
-0.4147286844  
-0.2967053037  
-0.1761403772  
-0.05524161267  
0.06364918213  
0.1782847363  
0.28673194  
0.3875626407  
0.4799840888  
0.5639014515  
0.639901154  
0.7091562983  
0.7732710458  
0.8340794006  
0.8934225298  
0.9529395361  
1.0138849  
1.076998503  
1.142439662  
1.209786035  
1.278087011  
1.345965487  
1.411743013  
1.473574494  
1.529577386  
1.577944442  
1.617043369  
1.645500321  
1.662278028  
1.666756103  
1.658809108  
1.638887424  
1.608078689  
1.568139924  
1.521475555  
1.471038205  
1.420150646  
1.372234356  
1.330472833  
1.297427922  
1.274661477  
1.262407142  
1.259350472  
1.262560232  
1.267600746  
1.268836624  
1.259908281  
1.234337893  
1.186197349  
1.110760485  
1.00505642  
0.8682522438  
0.7018122006  
0.5094097716  
0.2965963378  
0.07028317308  
-0.1619091019  
-0.3923387835  
-0.6139818672  
-0.8209437206  
-1.008783807  
-1.174633021  
-1.31710632  
-1.436054034  
-1.532212788  
-1.606831115  
-1.661337173  
-1.697110202  
-1.715379515  
-1.71726084  
-1.703896034  
-1.676658764  
-1.637355261  
-1.588376944  
-1.532746463  
-1.474042052  
-1.416191983  
-1.363169027  
-1.318620213  
-1.285491609  
-1.265696988  
-1.25988041  
-1.267306379  
-1.285890914  
-1.312366332  
-1.342567054  
-1.371792172  
-1.395207453  
-1.408243717  
-1.406951636  
-1.388279549  
-1.350259924  
-1.292092778  
-1.214131748  
-1.117786498  
-1.005357598  
-0.8798278751  
-0.7446305955  
-0.6034046237  
-0.4597597391  
-0.3170557455  
-0.1782024994  
-0.04549062188  
0.07954173126  
0.1961934601  
0.3046335377  
0.4058615042  
0.5015998131  
0.5941057886  
0.6859162486  
0.77954001  
0.8771207487  
0.98010592  
1.088959806  
1.202956614  
1.320094776  
1.437141576  
1.549825287  
1.653158124  
1.741861324  
1.810847924  
1.855703126  
1.873114701  
1.86118898  
1.819625822  
1.74972537  
1.65423751  
1.537072718  
1.402921965  
1.256838137  
1.10383334  
0.9485374094  
0.7949575941  
0.6463457295  
0.5051771488  
0.373212679  
0.2516149031  
0.1410831328  
0.04197193953  
-0.04562216267  
-0.121823036  
-0.1869710778  
-0.2416442973  
-0.2866783193  
-0.3231681161  
-0.3524321294  
-0.3759434249  
-0.3952255589  
-0.4117390056  
-0.4267759616  
-0.4413881631  
-0.4563586557  
-0.4722215844  
-0.4893249582  
-0.5079123214  
-0.5281866134  
-0.5503488088  
-0.5745698804  
-0.6009009344  
-0.6291319723  
-0.6586213039  
-0.6881446703  
-0.7158020824  
-0.7390342536  
-0.7547626931  
-0.7596692283  
-0.7505814527  
-0.7249172667  
-0.6811247319  
-0.6190295123  
-0.5400326903  
-0.4471012166  
-0.3445433533  
-0.2375848271  
