------------------------------------------
Setting up environment variables
---
LD_LIBRARY_PATH is .:/opt/software/fix/1.065/MATLAB_Compiler_Runtime/v83/runtime/glnxa64:/opt/software/fix/1.065/MATLAB_Compiler_Runtime/v83/bin/glnxa64:/opt/software/fix/1.065/MATLAB_Compiler_Runtime/v83/sys/os/glnxa64
Warning: Name is nonexistent or not a directory: /usr/local/fsl/etc/matlab
[> In path at 109
  In startup at 1] 
Warning: Name is nonexistent or not a directory: /usr/local/fmrib/fmt
[> In path at 109
  In startup at 2] 
/home/mpib/LNDG/StateSwitch/WIP_rest/preproc/B_data/D_preproc/1247/preproc/rest/FEAT.feat/
    25     1

    25     2

    25     3

    25     4

    25     5

    25     6

    25     7

    25     8

    25     9

    25    10

    25    11

    25    12

    25    13

    25    14

    25    15

    25    16

    25    17

    25    18

    25    19

    25    20

    25    21

    25    22

    25    23

    25    24

    25    25

End of Matlab Script
