9804.340073  
9795.45623  
9786.935856  
9779.108517  
9772.260822  
9766.620423  
9762.344234  
9759.511466  
9758.121556  
9758.096856  
9759.289597  
9761.492635  
9764.453392  
9767.890243  
9771.510811  
9775.031203  
9778.195364  
9780.793372  
9782.677422  
9783.774001  
9784.091019  
9783.718483  
9782.822043  
9781.629093  
9780.408057  
9779.442291  
9779.000884  
9779.309369  
9780.523647  
9782.71032  
9785.836283  
9789.769246  
9794.289687  
9799.113251  
9803.921151  
9808.394951  
9812.25141  
9815.272948  
9817.329832  
9818.391248  
9818.524094  
9817.879915  
9816.672151  
9815.147198  
9813.553321  
9812.111863  
9810.994337  
9810.308046  
9810.091508  
9810.319228  
9810.914229  
9811.76555  
9812.74755  
9813.73785  
9814.631312  
9815.348548  
9815.838495  
9816.075887  
9816.055279  
9815.783851  
9815.275177  
9814.545755  
9813.615167  
9812.509761  
9811.268765  
9809.950887  
9808.639201  
9807.442204  
9806.489562  
9805.922134  
9805.876927  
9806.469001  
9807.773001  
9809.807598  
9812.525752  
9815.813178  
9819.496006  
9823.357172  
9827.159711  
9830.673697  
9833.703015  
9836.107935  
9837.820054  
9838.847297  
9839.268181  
9839.216124  
9838.856277  
9838.358128  
9837.868163  
9837.486325  
9837.249803  
9837.126351  
9837.017895  
9836.774001  
9836.213024  
9835.148166  
9833.414795  
9830.895473  
9827.539536  
9823.374751  
9818.509766  
9813.127185  
9807.468238  
9801.811028  
9796.445055  
9791.645029  
9787.646932  
9784.628978  
9782.699226  
9781.890862  
9782.165014  
9783.420213  
9785.50676  
9788.243948  
9791.437935  
9794.898253  
9798.451442  
9801.950697  
9805.28128  
9808.361705  
9811.141471  
9813.596154  
9815.720974  
9817.52396  
9819.019677  
9820.224274  
9821.152557  
9821.817152  
9822.229823  
9822.404501  
9822.361284  
9822.130571  
9821.756247  
9821.296961  
9820.824898  
9820.421541  
9820.170809  
9820.150073  
9820.420359  
9821.017044  
9821.94252  
9823.162167  
9824.604375  
9826.164989  
9827.71577  
9829.115941  
9830.225484  
9830.918477  
9831.094943  
9830.689705  
9829.677275  
9828.072281  
9825.925482  
9823.316016  
9820.3409  
9817.103337  
9813.701195  
9810.217385  
9806.713273  
9803.226197  
9799.771267  
9796.347367  
9792.946306  
9789.563778  
9786.210201  
9782.919527  
9779.754142  
9776.80455  
9774.183277  
9772.013186  
9770.41155  
9769.471898  
9769.246211  
9769.730306  
9770.854991  
9772.484863  
9774.425853  
9776.44128  
9778.2751  
9779.679997  
9780.447003  
9780.433036  
9779.582791  
9777.941724  
9775.657996  
9772.972323  
9770.196286  
9767.681069  
9765.780072  
9764.809627  
9765.012948  
9766.531778  
9769.38983  
9773.490381  
9778.628643  
9784.517366  
9790.822356  
9797.202956  
9803.351929  
9809.029065  
9814.084066  
9818.465614  
9822.216037  
9825.452795  
9828.340466  
9831.057842  
9833.765648  
9836.579818  
9839.554219  
9842.674887  
9845.865877  
9849.004784  
9851.944691  
9854.538311  
9856.660137  
9858.223091  
9859.187419  
9859.561174  
9859.393093  
9858.760022  
9857.751827  
9856.45682  
9854.950461  
9853.289057  
9851.509167  
9849.632  
9847.671285  
9845.642225  
9843.569042  
9841.489072  
9839.451957  
9837.513862  
9835.727468  
9834.129812  
9832.730467  
9831.502837  
9830.38089  
9829.262783  
9828.021629  
9826.522223  
9824.641508  
9822.289501  
9819.427312  
9816.078971  
9812.334818  
9808.345367  
9804.306112  
9800.435137  
9796.946657  
9794.024158  
9791.797054  
9790.324195  
9789.586627  
9789.490654  
9789.880692  
9790.560188  
9791.317528  
9791.953429  
9792.305979  
9792.270083  
9791.808819  
9790.955435  
9789.806181  
9788.505291  
9787.224553  
9786.140487  
9785.412373  
9785.16394  
9785.470878  
9786.355337  
9787.78745  
9789.692923  
9791.965009  
9794.478683  
9797.104769  
9799.722171  
9802.226758  
9804.536253  
9806.591239  
9808.352894  
9809.798717  
9810.917604  
9811.705487  
9812.162608  
9812.292892  
9812.105315  
9811.616697  
9810.854915  
9809.861418  
9808.691909  
9807.414533  
9806.105326  
9804.841258  
9803.691906  
9802.710998  
9801.929444  
9801.351136  
9800.952601  
9800.686771  
9800.490598  
9800.295392  
9800.038419  
9799.673871  
9799.181555  
9798.571867  
9797.886416  
9797.194161  
9796.583837  
9796.153792  
9796.000838  
9796.209622  
9796.843812  
9797.940036  
9799.504983  
9801.515588  
9803.921832  
9806.651532  
9809.616228  
9812.717528  
9815.853239  
9818.922842  
9821.832035  
9824.496244  
9826.843076  
9828.81375  
9830.363702  
9831.462516  
9832.093381  
9832.252306  
9831.9474  
9831.198275  
9830.035758  
9828.501967  
9826.650517  
9824.546753  
9822.267637  
9819.900922  
9817.543373  
9815.297621  
9813.267668  
9811.553064  
9810.242115  
9809.404665  
9809.085256  
9809.297444  
9810.020292  
9811.19763  
9812.74062  
9814.533737  
9816.443761  
9818.331035  
9820.061753  
9821.519949  
9822.617564  
9823.301346  
9823.555487  
9823.399613  
9822.88222  
9822.070479  
9821.037858  
9819.851428  
9818.560844  
9817.190915  
9815.739082  
9814.178492  
9812.466315  
9810.556226  
9808.413032  
9806.026983  
9803.425263  
9800.678355  
9797.899721  
9795.238362  
9792.864817  
9790.952361  
9789.656007  
9789.092347  
9789.323211  
9790.345592  
9792.089364  
9794.423115  
9797.167054  
9800.11118  
9803.035882  
9805.732185  
9808.018917  
9809.754913  
9810.845386  
9811.242487  
9810.941314  
9809.973105  
9808.397654  
9806.29684  
9803.770452  
9800.934719  
9797.923025  
9794.887363  
9791.998733  
9789.44466  
9787.42225  
9786.126312  
9785.732876  
9786.379936  
9788.14796  
9791.043401  
9794.988544  
9799.820267  
9805.299227  
9811.129366  
9816.985782  
9822.547602  
9827.531246  
9831.7191  
9834.979289  
9837.273223  
9838.649849  
9839.227512  
9839.16669  
9838.638336  
9837.79345  
9836.739283  
9835.52634  
9834.148426  
9832.555428  
9830.676265  
9828.447314  
9825.840726  
9822.886723  
9819.685269  
9816.404246  
9813.263774  
9810.508893  
9808.375029  
9807.051989  
9806.652633  
9807.191671  
9808.578335  
9810.624229  
9813.065299  
9815.594512  
9817.900038  
9819.703239  
9820.79081  
9821.036662  
9820.410908  
9818.975411  
9816.867419  
9814.274494  
9811.404922  
9808.458302  
9805.600432  
9802.945884  
9800.550185  
9798.412106  
9796.484989  
9794.694942  
9792.962798  
9791.226245  
9789.458739  
9787.682113  
9785.970929  
9784.447473  
9783.267865  
9782.601005  
9782.603116  
9783.391551  
9785.021843  
9787.471767  
9790.635275  
9794.328064  
9798.304656  
9802.285259  
9805.989016  
9809.16894  
9811.643518  
9813.319922  
9814.205098  
9814.402564  
9814.094991  
9813.514944  
9812.908073  
9812.49451  
9812.43448  
9812.80383  
9813.583392  
9814.664152  
9815.867414  
9816.976742  
9817.776569  
9818.090993  
9817.816538  
9816.94321  
9815.560529  
9813.847288  
9812.046624  
9810.430402  
9809.258407  
9808.738865  
9808.996417  
9810.052505  
9811.821096  
9814.120228  
9816.697442  
9819.264883  
9821.538594  
9823.275895  
9824.305156  
9824.543803  
9824.002221  
9822.773615  
9821.012214  
9818.903898  
9816.634436  
9814.360678  
9812.189322  
9810.1663  
9808.27794  
9806.462973  
9804.63267  
9802.695008  
9800.57844  
9798.251089  
9795.732222  
9793.094444  
9790.456792  
9787.970519  
9785.800514  
9784.105868  
9783.022918  
9782.653356  
9783.058702  
9784.261103  
9786.249144  
9788.986392  
9792.42006  
9796.487488  
9801.118679  
9806.234514  
9811.741265  
9817.52332  
9823.436445  
9829.30452  
9834.921763  
9840.061866  
9844.493939  
9848.00377  
9850.417676  
9851.625155  
9851.596683  
9850.393025  
9848.16391  
9845.135312  
9841.586387  
9837.819049  
9834.12411  
9830.74885  
9827.870694  
9825.58067  
9823.879036  
9822.683403  
9821.847895  
9821.190221  
9820.522323  
9819.680003  
9818.547116  
9817.070954  
9815.266974  
9813.21271  
9811.032317  
9808.874615  
9806.88828  
9805.198191  
9803.88633  
9802.980041  
9802.448879  
9802.210186  
9802.141996  
9802.101051  
9801.942931  
9801.541374  
9800.8041  
9799.683255  
9798.179523  
9796.339953  
9794.250428  
9792.024218  
9789.788464  
9787.670309  
9785.784177  
9784.22126  
9783.041911  
9782.271321  
9781.898633  
9781.879476  
9782.141925  
9782.595604  
9783.14352  
9783.695754  
9784.183775  
9784.57362  
9784.876012  
9785.151317  
9785.507888  
9786.092756  
9787.075031  
9788.623413  
9790.880534  
9793.937659  
9797.813711  
9802.442286  
9807.669375  
9813.262916  
9818.933576  
9824.364274  
9829.244367  
9833.303654  
9836.341228  
9838.244874  
9838.998404  
9838.676059  
9837.425302  
9835.441085  
9832.936068  
9830.111654  
9827.134392  
9824.12138  
9821.136346  
9818.196484  
9815.287982  
9812.387019  
9809.481814  
9806.591592  
9803.778657  
9801.151353  
9798.857036  
9797.066192  
9795.950239  
9795.656579  
9796.284998  
9797.869324  
9800.367113  
9803.659132  
9807.558688  
9811.829254  
9816.207802  
9820.43035  
9824.256132  
9827.487252  
9829.981533  
9831.657601  
9832.49245  
9832.512948  
9831.783581  
9830.392944  
9828.441484  
9826.032306  
9823.266054  
9820.23985  
9817.049463  
9813.79321  
9810.575841  
9807.510777  
9804.719506  
9802.327582  
9800.457527  
9799.219335  
9798.70005  
9798.95376  
9799.993483  
9801.785966  
9804.250016  
9807.258522  
9810.643916  
9814.20659  
9817.725633  
9820.971329  
9823.7188  
9825.762334  
9826.929771  
9827.096317  
9826.19682  
9824.235477  
9821.291643  
9817.520585  
9813.148167  
9808.458902  
9803.777577  
9799.445414  
9795.792441  
9793.108638  
9791.616652  
9791.449075  
9792.632999  
9795.083962  
9798.610295  
9802.92793  
9807.684436  
9812.48998  
9816.951996  
9820.709954  
9823.466539  
9825.011902  
9825.238638  
9824.146169  
9821.834686  
9818.489829  
9814.360604  
9809.733363  
9804.905074  
9800.158768  
9795.743283  
9791.858812  
9788.648541  
9786.196196  
9784.528453  
9783.621186  
9783.408207  
9783.791688  
9784.653377  
9785.866224  
9787.306065  
9788.862951  
9790.451734  
9792.020995  
9793.559519  
9795.099099  
9796.712736  
9798.50754  
9800.612269  
9803.160118  
9806.268366  
9810.017066  
9814.429567  
9819.457876  
9824.975411  
9830.779046  
9836.601335  
9842.132096  
9847.047545  
9851.043583  
9853.869289  
9855.356156  
9855.439124  
9854.166286  
9851.695532  
9848.278297  
9844.232011  
9839.904605  
9835.635455  
9831.717633  
9828.366166  
9825.696356  
9823.714697  
9822.32366  
9821.339445  
9820.520544  
9819.603356  
9818.340303  
9816.53553  
9814.073549  
9810.937075  
9807.211531  
9803.075556  
9798.778459  
9794.607552  
9790.849447  
9787.750684  
9785.482938  
9784.117873  
9783.615328  
9783.826932  
9784.514908  
9785.383958  
9786.12198  
9786.444109  
9786.134029  
9785.076616  
9783.277313  
9780.865127  
9778.078691  
9775.237038  
9772.698853  
9770.815747  
9769.885766  
9770.113442  
9771.581641  
9774.238876  
9777.903479  
9782.283949  
9787.012341  
9791.686346  
9795.914494  
9799.358947  
9801.771095  
9803.016182  
9803.085014  
9802.092368  
9800.263256  
9797.909334  
9795.39853  
9793.121083  
9791.455081  
9790.734281  
9791.220193  
9793.080192  
9796.372742  
9801.040496  
9806.911881  
9813.711232  
9821.077396  
9828.590017  
9835.802115  
9842.27682  
9847.625354  
9851.542735  
9853.837589  
9854.452378  
9853.471467  
9851.115168  
9847.71981  
9843.705466  
9839.534451  
9835.665199  
9832.506701  
9830.378808  
9829.482927  
9829.886361  
9831.521838  
9834.201553  
9837.643434  
9841.505676  
9845.424644  
9849.051234  
9852.081251  
9854.276598  
9855.475796  
9855.594059  
9854.614921  
9852.576391  
9849.555521  
9845.654669  
9840.992262  
9835.699223  
9829.920783  
9823.82176  
9817.592401  
9811.451348  
9805.642725  
9800.425458  
9796.05446  
9792.755485  
9790.696888  
9789.962964  
9790.533851  
9792.276288  
9794.948147  
9798.217399  
9801.693734  
9804.968856  
9807.659841  
9809.449431  
9810.117457  
9809.559266  
9807.78899  
9804.928156  
9801.182271  
9796.809797  
9792.088636  
9787.285338  
9782.630933  
9778.306056  
9774.435929  
9771.094151  
9768.31297  
9766.096914  
9764.436757  
9763.321159  
9762.744468  
9762.709989  
9763.229219  
9764.318109  
9765.991866  
9768.259654  
9771.120396  
9774.560115  
9778.55099  
9783.051596  
9788.00779  
9793.35348  
9799.01092  
9804.890381  
9810.889411  
9816.892216  
9822.76979  
9828.381306  
9833.577135  
9838.203419  
9842.108004  
9845.147168  
9847.192773  
9848.139214  
9847.910194  
9846.465073  
9843.804968  
9839.978403  
9835.08633  
9829.285735  
9822.790878  
9815.870721  
9808.84136  
9802.052366  
9795.866724  
9790.635081  
9786.666061  
9784.195552  
9783.358708  
9784.168741  
9786.506221  
9790.121851  
9794.653895  
9799.659759  
9804.658953  
9809.182999  
9812.826386  
9815.292215  
9816.426435  
9816.235884  
9814.887311  
9812.687018  
9810.043394  
9807.416961  
9805.264286  
9803.982995  
9803.864953  
9805.063611  
9807.579351  
9811.264303  
9815.845303  
9820.961133  
9826.20842  
9831.189488  
9835.555686  
9839.040515  
9841.478966  
9842.811772  
9843.075564  
9842.382157  
9840.891594  
9838.783934  
9836.234639  
9833.396999  
9830.393369  
9827.315188  
9824.229895  
9821.191724  
9818.25297  
9815.472421  
9812.918695  
9810.667541  
9808.793555  
9807.35806  
9806.395786  
9805.903208  
9805.831105  
9806.083148  
9806.521292  
9806.977479  
9807.270402  
9807.225038  
9806.692734  
9805.569294  
9803.8091  
9801.433745  
9798.534269  
9795.266673  
9791.841032  
9788.504942  
9785.522558  
9783.150867  
9781.615226  
9781.086559  
9781.662494  
9783.35496  
9786.085967  
9789.692692  
9793.941935  
9798.552654  
9803.2242  
