-0.01518530448  
-0.3452746143  
-0.6606050076  
-0.9451980795  
-1.186266396  
-1.375512099  
-1.509826185  
-1.591337423  
-1.626833259  
-1.626674498  
-1.603375409  
-1.570057499  
-1.538981  
-1.520302515  
-1.521197772  
-1.545378299  
-1.59302779  
-1.66109099  
-1.743864345  
-1.83378638  
-1.92235641  
-2.001078274  
-2.062373597  
-2.100382491  
-2.111587104  
-2.095211473  
-2.053338873  
-1.990731138  
-1.914336876  
-1.832523651  
-1.754101096  
-1.68723103  
-1.638344853  
-1.611205416  
-1.606226374  
-1.620153322  
-1.64616126  
-1.674370596  
-1.692757118  
-1.688351075  
-1.648617577  
-1.562864012  
-1.423533289  
-1.227223334  
-0.9753279829  
-0.6742164216  
-0.334926538  
0.02761375875  
0.3957412345  
0.7504800269  
1.073084768  
1.346539352  
1.556889161  
1.694270717  
1.75359006  
1.734804438  
1.642834699  
1.487139632  
1.281021991  
1.040727674  
0.7843978455  
0.5309380169  
0.2988341983  
0.1049736132  
-0.03648095463  
-0.1151145351  
-0.1250788959  
-0.06564107498  
0.05863270739  
0.2381384899  
0.4589606529  
0.7040554255  
0.954807458  
1.192808398  
1.401667538  
1.568619437  
1.685715625  
1.75041633  
1.76548528  
1.738191813  
1.678918958  
1.599394046  
1.510814472  
1.422156509  
1.338946468  
1.26269548  
1.191073682  
1.118795807  
1.039059546  
0.9452801334  
0.8328094883  
0.7003589976  
0.5508485007  
0.3915507357  
0.233479153  
0.09011509344  
-0.02433001937  
-0.09685753044  
-0.1175281545  
-0.08094899909  
0.01281315231  
0.1580094753  
0.3436887634  
0.5547876086  
0.7736786196  
0.9819508172  
1.162203819  
1.299648129  
1.383354665  
1.407052401  
1.369443649  
1.274051071  
1.128672682  
0.9445050444  
0.7350681556  
0.5149915589  
0.2987771642  
0.09960444792  
-0.07173684079  
-0.2077147399  
-0.3046609047  
-0.3630461599  
-0.3873785015  
-0.385717836  
-0.3688137417  
-0.3489310801  
-0.338476334  
-0.3485493188  
-0.3876119363  
-0.4604195951  
-0.5673698303  
-0.7043699404  
-0.8632547423  
-1.032718938  
-1.199652756  
-1.350709967  
-1.473904435  
-1.560031426  
-1.603710153  
-1.603932032  
-1.564038255  
-1.491146288  
-1.395112255  
-1.287184123  
-1.178525778  
-1.078816774  
-0.9951017656  
-0.931030443  
-0.8865738139  
-0.8582361695  
-0.8397031606  
-0.8228606183  
-0.7990024772  
-0.760100864  
-0.6999569938  
-0.6150810902  
-0.5052140676  
-0.3733983741  
-0.2256146611  
-0.07002363857  
0.08406527142  
0.2273770946  
0.3518134885  
0.4514193504  
0.5230296647  
0.5665060818  
0.5845604661  
0.58218243  
0.5657881174  
0.5422175959  
0.5177431412  
0.4972355533  
0.4836024471  
0.4775730422  
0.4778389404  
0.4815012901  
0.4847335761  
0.4835441335  
0.474500686  
0.4553095747  
0.4251618133  
0.3848087423  
0.336373467  
0.28295497  
0.2280970968  
0.1752375061  
0.1272108252  
0.08590679199  
0.05209330395  
0.02543876294  
0.004675436073  
-0.01214185912  
-0.02735581462  
-0.04346532189  
-0.06296436838  
-0.08825608912  
-0.1216371372  
-0.1652763393  
-0.2211468914  
-0.2908631294  
-0.3753851265  
-0.474623078  
-0.5870080008  
-0.7091008695  
-0.835373588  
-0.958244394  
-1.068445325  
-1.155720595  
-1.209818473  
-1.221641551  
-1.184415739  
-1.094672898  
-0.9528981478  
-0.7637088785  
-0.5355137753  
-0.2796802688  
-0.009330647954  
0.262072927  
0.5221266931  
0.7606779123  
0.9706286832  
1.148262028  
1.293066992  
1.407128658  
1.494241629  
1.558901048  
1.605382442  
1.637060487  
1.656073488  
1.663361117  
1.659024822  
1.642906205  
1.615216346  
1.577068215  
1.530759266  
1.479723431  
1.42814102  
1.380238887  
1.339426226  
1.307410022  
1.283475417  
1.264093696  
1.242969319  
1.211575916  
1.160148327  
1.079017467  
0.9601137945  
0.7984238793  
0.5931691013  
0.3485106441  
0.07363251078  
-0.2178617199  
-0.5092121063  
-0.7822901131  
-1.019709363  
-1.206975447  
-1.334393375  
-1.39842919  
-1.402322441  
-1.35580979  
-1.273947697  
-1.175161359  
-1.078751838  
-1.002199355  
-0.9586429955  
-0.9549078351  
-0.9903991154  
-1.057050224  
-1.140383692  
-1.221557769  
-1.2801298  
-1.297151499  
-1.258136288  
-1.155468808  
-0.9898685357  
-0.7706952163  
-0.515014386  
-0.2455584619  
0.01213607333  
0.2330020281  
0.3956726104  
0.4851854387  
0.4948335581  
0.4268865186  
0.2921277272  
0.1083190971  
-0.1021884206  
-0.3153196796  
-0.5082304942  
-0.6619555195  
-0.7634183969  
-0.8065847701  
-0.7926547037  
-0.729335887  
-0.6293378292  
-0.5083459321  
-0.3827602006  
-0.2675050033  
-0.1741893964  
-0.1098345099  
-0.07629033513  
-0.07037665043  
-0.08468268864  
-0.1088886619  
-0.1313832485  
-0.1409776061  
-0.1284502033  
-0.08774607327  
-0.0166767671  
0.08294188237  
0.2057087437  
0.3435052924  
0.4866931626  
0.6254190434  
0.7508594248  
0.8562193921  
0.9373635434  
0.99303304  
1.024643557  
1.035758732  
1.031349917  
1.016974689  
0.9980214862  
0.9790918737  
0.9635971408  
0.9535489769  
0.9495253642  
0.9507455343  
0.9551997827  
0.9598028463  
0.9605509693  
0.9527288646  
0.9311869787  
0.8907547178  
0.8268072486  
0.7359720119  
0.6169151192  
0.47108986  
0.3033077238  
0.1219675954  
-0.0611635699  
-0.2317119005  
-0.3739575637  
-0.4725170379  
-0.5142340553  
-0.4900449574  
-0.3965330453  
-0.2369334186  
-0.02139317354  
0.2335939334  
0.5065483309  
0.7730134869  
1.007974588  
1.188380602  
1.295449732  
1.316487699  
1.245999277  
1.08599469  
0.845499975  
0.5393840095  
0.1867051807  
-0.1911892731  
-0.572558059  
-0.936949584  
-1.266517636  
-1.546894325  
-1.767631267  
-1.922257785  
-2.008057769  
-2.025683022  
-1.97868761  
-1.873055515  
-1.716744948  
-1.519253915  
-1.291175568  
-1.043724706  
-0.7882126975  
-0.5354944531  
-0.2954078024  
-0.07627908225  
0.1154520019  
0.2754222903  
0.4013262606  
0.4926758742  
0.5504035693  
0.5763676167  
0.5728702492  
0.5422777777  
0.4868270848  
0.4086470005  
0.3099844818  
0.1935727808  
0.06302982564  
-0.07681629794  
-0.2198097761  
-0.3586191615  
-0.4851915375  
-0.591467106  
-0.6702620288  
-0.7161713151  
-0.7263285785  
-0.7008843218  
-0.6430864588  
-0.5589229768  
-0.4563660782  
-0.3443194567  
-0.2314357201  
-0.1249899286  
-0.03000244651  
0.05124613027  
0.1192365913  
0.1767495258  
0.2280227257  
0.2776632939  
0.3295173977  
0.3856977672  
0.4459357093  
0.507388984  
0.5649465127  
0.6119781938  
0.6414229236  
0.6470185745  
0.6244846638  
0.5724325596  
0.4928630873  
0.3911413765  
0.2754560051  
0.1558256855  
0.04282652744  
-0.05376881408  
-0.1262178032  
-0.1697098373  
-0.182801218  
-0.1673359299  
-0.1278856398  
-0.07082376329  
-0.003208049355  
0.06832646267  
0.1384826788  
0.2038819369  
0.2632481976  
0.3171980882  
0.3677209003  
0.4174797737  
0.46908013  
0.5244419338  
0.5843796684  
0.6484253994  
0.7148956281  
0.7811382813  
0.843878559  
0.8995831559  
0.9447708838  
0.976242527  
0.9912200209  
0.9874366941  
0.9632081824  
0.9175329609  
0.8502280867  
0.7621012932  
0.6551173186  
0.5325072692  
0.3987496246  
0.2593967953  
0.1207212418  
-0.01080635364  
-0.1291287746  
-0.2292393961  
-0.3077453628  
-0.3632661318  
-0.3966035687  
-0.410651498  
-0.4100630806  
-0.4007076725  
-0.3889954064  
-0.3811636535  
-0.3825878684  
-0.3972208921  
-0.427191599  
-0.4726039502  
-0.5315466553  
-0.6003001615  
-0.6737112331  
-0.7456976844  
-0.8098268705  
-0.8599114317  
-0.8905632518  
-0.8976294763  
-0.8784732504  
-0.8320581943  
-0.7588253822  
-0.6603920385  
-0.5391290945  
-0.3977013926  
-0.2386647665  
-0.06422815298  
0.1237632501  
0.3235950173  
0.5332287469  
0.7497199344  
0.9686343541  
1.183626835  
1.386324819  
1.566614368  
1.713368443  
1.815559839  
1.863616268  
1.850822013  
1.774522469  
1.636912211  
1.445233371  
1.211304883  
0.9504105602  
0.6796721996  
0.4161436338  
0.1748907321  
-0.03266496565  
-0.1998876789  
-0.3254010289  
-0.4128366047  
-0.4699153471  
-0.5070118055  
-0.5354495065  
-0.565768883  
-0.6062497718  
-0.6618702502  
-0.7338511453  
-0.8198002983  
-0.9143951205  
-1.010468209  
-1.100287077  
-1.176825784  
-1.234816215  
-1.271451232  
-1.286640407  
-1.282818809  
-1.2643681  
-1.236768106  
-1.205621361  
-1.175713431  
-1.150237131  
-1.130295215  
-1.114728912  
-1.100290363  
-1.082122496  
-1.054477696  
-1.011573047  
-0.9484928706  
-0.8620125614  
-0.7512556744  
-0.6180962978  
-0.4672413908  
-0.3059673247  
-0.1434920065  
0.009953387861  
0.1442922064  
0.2508780122  
0.3237220965  
0.3605139092  
0.363258951  
0.3384044581  
0.2963826883  
0.2505562276  
0.2156747877  
0.2059853429  
0.2332526199  
0.3049471522  
0.4228754816  
0.5824641076  
0.7728507393  
0.9778052646  
1.177394677  
1.350208486  
1.475856279  
1.53742507  
1.523572211  
1.429988356  
1.260037537  
1.024494419  
0.7404368951  
0.429415539  
0.1151610211  
-0.1788921523  
-0.4319761612  
-0.627978896  
-0.7568260425  
-0.8151636046  
-0.8062771854  
-0.7393197444  
-0.6279758726  
-0.488750474  
-0.3390943205  
-0.1955677042  
-0.07223072071  
0.02059745856  
0.0771429991  
0.09649690731  
0.08248454828  
0.0431447354  
-0.01010974355  
-0.06352935761  
-0.1021973783  
-0.1112239426  
-0.07690527448  
0.01220213366  
0.1643398516  
0.3837626868  
0.6701365028  
1.018152311  
1.417369964  
1.852344911  
2.30305137  
2.745641789  
3.153560034  
3.498988349  
3.7546117  
3.895601048  
3.901722699  
3.759390084  
3.463488285  
3.01874302  
2.440445729  
1.754335507  
0.9955429359  
0.2065383711  
-0.5658230278  
-1.273982517  
-1.873770729  
-2.328523471  
-2.612759676  
-2.714969226  
-2.639115574  
-2.40458109  
-2.044457611  
-1.602295102  
-1.127629026  
-0.6707871271  
-0.2776034936  
0.01531019607  
0.1841394644  
0.2198463453  
0.1283229644  
-0.07125250926  
-0.3495807164  
-0.6714531455  
-1.000415436  
-1.303225171  
-1.553542789  
-1.73439761  
-1.83919675  
-1.871245942  
-1.841978052  
-1.768242906  
-1.669132901  
-1.562835408  
-1.463986327  
-1.381844104  
-1.319524423  
-1.274270812  
-1.238669395  
-1.202491093  
-1.154840846  
-1.086211392  
-0.9901251946  
-0.864115084  
-0.7099291141  
-0.5329994628  
-0.3413192688  
-0.1439923793  
0.05026507856  
0.2343748078  
0.4036935002  
0.5562282937  
0.6922811423  
0.8136330944  
0.9224738062  
1.020309155  
1.107106566  
1.180838457  
1.23754413  
1.271893081  
1.278141916  
1.251313342  
1.18836207  
1.089116358  
0.9568262938  
0.79819537  
0.6229150693  
0.4427406346  
0.2702709425  
0.117604733  
-0.004948442197  
-0.08993199984  
-0.133457914  
-0.1355267988  
-0.09993633594  
-0.03381213282  
0.05314526671  
0.1496223347  
0.243758282  
0.3242304431  
0.3812731927  
0.4075599381  
0.398886489  
0.3546013287  
0.2777345169  
0.174796211  
0.0552286281  
-0.06945988784  
-0.1868344922  
-0.2848426409  
-0.3531668951  
-0.3844677032  
-0.3753459132  
-0.3268905988  
-0.2447037103  
-0.1383528658  
-0.02029510353  
0.09561897295  
0.1958787146  
0.2690385498  
0.3072031436  
0.3070212781  
0.270041622  
0.202325824  
0.1133835485  
0.01454599789  
-0.08294891999  
-0.1698680617  
-0.2405532306  
-0.2938559724  
-0.3332390743  
-0.3659643138  
-0.4014341275  
-0.4489342554  
-0.5151058356  
-0.6015924846  
-0.7033106779  
-0.8077128478  
-0.895319753  
-0.94159052  
-0.9199970332  
-0.8059743665  
-0.5812116783  
-0.2376644961  
0.2193628524  
0.7696462354  
1.378379246  
1.998574431  
2.575385012  
3.051897739  
3.375702612  
3.505382326  
3.416016606  
3.10290432  
2.582930117  
1.893331365  
1.087978515  
0.2316682664  
-0.6068319002  
-1.362040678  
-1.978404039  
-2.415505449  
-2.651273061  
-2.682930066  
-2.525753005  
-2.20998546  
-1.776444664  
-1.271501682  
-0.7420534523  
-0.2310815657  
0.225815401  
0.6026570984  
0.8840605903  
1.065037756  
1.149838109  
1.150103038  
1.082626021  
0.9669980511  
0.8233544018  
0.6704191636  
0.5239584344  
0.3957028213  
0.2927900318  
0.2176820592  
0.1685404554  
0.1399868445  
0.1241499204  
0.1119158381  
0.09423936786  
0.06341467827  
0.01415604595  
-0.05560770462  
-0.1443141836  
-0.2467952848  
-0.3547552063  
-0.4576527685  
-0.543915979  
-0.6023544388  
-0.6236019437  
-0.6014169565  
-0.5336655205  
-0.4228521085  
-0.2760915431  
-0.1045205605  
0.07783027043  
0.2555500132  
0.4135741436  
0.5389044835  
0.6220729281  
0.6581683655  
0.6472606229  
0.5941771626  
0.5076666946  
0.3990608956  
0.2806615003  
0.1640776738  
0.05876416328  
-0.02901791177  
-0.09668879274  
-0.1452275786  
-0.1784998102  
-0.2021523587  
-0.2223210456  
-0.2443374064  
-0.2717080021  
-0.3055003328  
-0.3442684491  
-0.3844958679  
-0.4214775915  
-0.4504648269  
-0.4678541233  
-0.4721912535  
-0.4647749302  
-0.4497426682  
-0.4335755726  
-0.4240816926  
-0.4290193338  
-0.4545600396  
-0.5038861784  
-0.5761423288  
-0.665968605  
-0.7637273741  
-0.8564343721  
-0.9292977107  
-0.9676596393  
-0.9590711402  
-0.8952001624  
-0.7732848647  
-0.5969065152  
-0.3759474778  
-0.125727115  
0.134600749  
0.3841678496  
0.6027509007  
0.7730539684  
0.8826074406  
0.925038011  
0.9005405667  
0.8155276429  
0.6815207747  
0.513476045  
0.3278045041  
0.1403828291  
-0.03517043178  
-0.188700167  
-0.3140962268  
-0.4091926774  
-0.4750838305  
-0.5150129594  
-0.5330820048  
-0.5330180474  
-0.5172211021  
-0.4862772357  
-0.4389795682  
-0.3728633834  
-0.285123448  
-0.1737327857  
-0.03853844479  
0.1178693491  
0.2897116844  
0.4680965696  
0.6416385649  
0.7975620208  
0.9231383792  
1.007267365  
1.041981647  
1.023648974  
0.9537267788  
0.8389198519  
0.6907359312  
0.52445422  
0.3576240847  
0.2082675624  
0.09297656223  
0.02512981593  
0.01343188624  
0.06093913796  
0.1646951948  
0.316020471  
0.5014190197  
0.7040249353  
0.9053942712  
1.087462202  
1.234415078  
1.334271785  
1.379981294  
1.369925529  
1.307769238  
1.201715275  
1.063261247  
0.9056636381  
0.7422943619  
0.5851224308  
0.4435015596  
0.3233958665  
0.2271074136  
0.1534900706  
0.09856928384  
0.05644046988  
0.02028770265  
-0.01661637376  
-0.06007341194  
-0.1143389772  
-0.1817807207  
-0.2627759763  
-0.3558163729  
-0.4577521456  
-0.5641138916  
-0.669472099  
-0.7678059061  
-0.8528920399  
-0.9187175332  
-0.9599448955  
-0.9724054669  
-0.9536193808  
-0.9032528008  
-0.8234563108  
-0.7189775569  
-0.5969876356  
-0.4665784098  
-0.337957425  
-0.2214251846  
-0.1262591366  
-0.05968995062  
-0.02612212886  
-0.02674251856  
-0.05957884615  
-0.1200088831  
-0.2016101073  
-0.2972026249  
-0.3998730951  
-0.5037968408  
-0.6046892686  
-0.6998168687  
-0.7875755766  
-0.8667521943  
-0.9356354943  
-0.9912174534  
-1.028687088  
-1.041408787  
-1.021451725  
-0.9606598506  
-0.852122592  
-0.6918076327  
-0.4800594204  
-0.2226785834  
0.06870883212  
0.3771180621  
0.6815718662  
0.9592103167  
1.187922238  
1.349104781  
1.430171868  
1.426396934  
1.341801305  
1.188909019  
0.9873684988  
0.7616086448  
0.5378476654  
0.3408747339  
0.1910519061  
0.1019505057  
0.07896014338  
0.119013678  
0.2114654446  
0.339926672  
0.4847840139  
