0.2293035594  
0.2305378228  
0.2375540115  
0.2538938507  
0.2814958519  
0.320464716  
0.3691484425  
0.4245100253  
0.4827185466  
0.5398490403  
0.5925609091  
0.6386284463  
0.6772245497  
0.7088986902  
0.7352535742  
0.7583823495  
0.780171653  
0.8016114075  
0.8222546599  
0.8399376606  
0.8508523841  
0.8499514508  
0.8316613076  
0.7907744622  
0.7233669941  
0.6276001793  
0.5042496406  
0.356880023  
0.191615068  
0.01656016543  
-0.1590623485  
-0.3259108702  
-0.4755290319  
-0.6012093257  
-0.6986341836  
-0.7662205093  
-0.8051686937  
-0.8192389747  
-0.8143175029  
-0.7978166536  
-0.7779831169  
-0.7631493805  
-0.7609610555  
-0.7776171868  
-0.8171384191  
-0.8807318146  
-0.9662971626  
-1.068172265  
-1.177191831  
-1.281140913  
-1.365636197  
-1.415421171  
-1.415982884  
-1.355347147  
-1.225834053  
-1.025533368  
-0.7592674693  
-0.4388477363  
-0.08250444569  
0.2864975468  
0.6419733085  
0.9574222515  
1.208841833  
1.37739556  
1.451610352  
1.428810769  
1.315604499  
1.127342059  
0.8866106652  
0.6209321223  
0.3599367195  
0.1323347371  
-0.03697633496  
-0.1293428035  
-0.1340906235  
-0.04938570866  
0.1178281621  
0.352785753  
0.6346019645  
0.938520745  
1.238448976  
1.509492586  
1.730250985  
1.884613679  
1.96292342  
1.962399746  
1.886835317  
1.745634427  
1.552350254  
1.322924299  
1.073847897  
0.8204702498  
0.575646276  
0.3488425741  
0.1457852981  
-0.03138066392  
-0.1834896613  
-0.3134635151  
-0.425282147  
-0.5229998497  
-0.6099710285  
-0.6883718966  
-0.7590849224  
-0.8219218775  
-0.8761079027  
-0.920892898  
-0.9561553651  
-0.9828424289  
-1.003139599  
-1.020308256  
-1.038204794  
-1.060551862  
-1.090098798  
-1.127847782  
-1.172504003  
-1.22029785  
-1.265270169  
-1.300003399  
-1.316731299  
-1.308647213  
-1.271203079  
-1.203159316  
-1.107179352  
-0.9898277495  
-0.8609235199  
-0.7323204311  
-0.6162837852  
-0.5237120093  
-0.4624936576  
-0.4362797161  
-0.4438682437  
-0.4793272822  
-0.532829247  
-0.5920585467  
-0.6439571029  
-0.6765069919  
-0.6802498488  
-0.6493094651  
-0.5817542306  
-0.4792963103  
-0.3464239923  
-0.1891777792  
-0.01384511421  
0.1741470696  
0.3709165948  
0.5742619202  
0.7832215326  
0.9971967353  
1.214826785  
1.432911203  
1.645645372  
1.844394679  
2.018137888  
2.154560468  
2.241671511  
2.269679567  
2.232798026  
2.13063793  
1.968899686  
1.759162904  
1.517741928  
1.26372426  
1.016462663  
0.7929156668  
0.6052537779  
0.4591531215  
0.3530786061  
0.2787275645  
0.222577026  
0.1683354409  
0.09989190305  
0.004294494603  
-0.1257488895  
-0.2902836612  
-0.4817154839  
-0.6857098987  
-0.8832645135  
-1.053612467  
-1.177508079  
-1.240340281  
-1.234559945  
-1.161020075  
-1.028995206  
-0.8548681062  
-0.659706717  
-0.466097548  
-0.2947758719  
-0.1615571071  
-0.07508406677  
-0.03570891248  
-0.03568805694  
-0.06063704604  
-0.09199864465  
-0.1101475518  
-0.09764260939  
-0.04215694892  
0.06133798881  
0.2094355496  
0.3903476289  
0.5851134087  
0.7698021574  
0.9183924248  
1.005967071  
1.011816611  
0.9220985299  
0.7317439856  
0.4454205126  
0.07747047801  
-0.3491497877  
-0.8047965354  
-1.255721161  
-1.667046973  
-2.005861786  
-2.244119885  
-2.361127874  
-2.345357515  
-2.195459499  
-1.920373845  
-1.538531946  
-1.076222306  
-0.5652682937  
-0.04023272191  
0.4645746517  
0.9180001955  
1.294569783  
1.57637801  
1.75416513  
1.827492384  
1.8040393  
1.698127772  
1.528709854  
1.317070178  
1.084534706  
0.8504615569  
0.630723765  
0.4367985067  
0.2755039712  
0.1493095016  
0.0570793445  
-0.004927851902  
-0.04200458717  
-0.06004046611  
-0.06478998397  
-0.06140551457  
-0.05422284696  
-0.0467362638  
-0.04166821339  
-0.04103729209  
-0.04617227129  
-0.05761699419  
-0.07496840026  
-0.09669671027  
-0.1200258568  
-0.1409646147  
-0.1545709725  
-0.1554366596  
-0.1384107254  
-0.09943933992  
-0.03642679956  
0.05005379089  
0.1563333805  
0.2756174927  
0.3984159185  
0.5134118658  
0.6086834263  
0.6731209255  
0.6978478922  
0.6774289364  
0.6106910094  
0.5010066149  
0.3559985257  
0.1866768456  
0.0061220264  
-0.1721084615  
-0.3356426142  
-0.4747847478  
-0.5836439782  
-0.6607430113  
-0.7090150409  
-0.7352052401  
-0.7487366364  
-0.7602112814  
-0.7797339405  
-0.81528799  
-0.8713897273  
-0.9481994552  
-1.041226727  
-1.141681643  
-1.23744324  
-1.314535678  
-1.358927318  
-1.358440184  
-1.30450238  
-1.193523  
-1.027691563  
-0.815077436  
-0.5689906701  
-0.3066656769  
-0.04741656126  
0.1895119243  
0.3871286696  
0.532629036  
0.6188252837  
0.6448822934  
0.6162516613  
0.5438265466  
0.4424218882  
0.3288011814  
0.2195202111  
0.1288965535  
0.06738296306  
0.04056209253  
0.04889540933  
0.08823376967  
0.1509784993  
0.2277006077  
0.3089294028  
0.386824702  
0.4564485169  
0.5164425716  
0.5689917825  
0.6191047681  
0.6733421005  
0.7382181416  
0.818582646  
0.916260596  
1.029215646  
1.151403054  
1.273350931  
1.383391641  
1.469343578  
1.520363949  
1.528657459  
1.490749959  
1.408112677  
1.28702366  
1.137694519  
0.9728187997  
0.8057705769  
0.6487759451  
0.5113406616  
0.3991852002  
0.3138419133  
0.2529310755  
0.211036691  
0.1809805664  
0.1552462746  
0.1272848076  
0.0924675984  
0.04855431583  
-0.004391233665  
-0.06455196701  
-0.129230946  
-0.1958241976  
-0.2626676504  
-0.3295579089  
-0.3978147363  
-0.4698699877  
-0.5484394043  
-0.6354661183  
-0.7310323604  
-0.8325174624  
-0.9341878299  
-1.027387641  
-1.101356596  
-1.144628415  
-1.146805911  
-1.100472045  
-1.002906834  
-0.857323048  
-0.6733421196  
-0.4665708756  
-0.2572342684  
-0.06798659493  
0.07885722545  
0.1643028397  
0.1754703704  
0.1077598041  
-0.03395707969  
-0.2353617539  
-0.4740197817  
-0.7218970237  
-0.9487925333  
-1.12624079  
-1.231369263  
-1.250159  
-1.179620823  
-1.028544672  
-0.8166564281  
-0.5722465089  
-0.3285741842  
-0.1194994408  
0.02504424809  
0.08311821797  
0.04381792822  
-0.09114396504  
-0.3075219662  
-0.5802715071  
-0.8766683235  
-1.160370123  
-1.395845133  
-1.552564657  
-1.608406596  
-1.551857302  
-1.382779877  
-1.111739466  
-0.7580692484  
-0.3470392203  
0.09342377282  
0.5359743919  
0.9565976729  
1.336549337  
1.663278676  
1.930344223  
2.136429753  
2.283765778  
2.376273583  
2.417818815  
2.410888057  
2.355933113  
2.251482151  
2.094986142  
1.884230123  
1.619025651  
1.302849111  
0.9440779002  
0.5565244867  
0.159100087  
-0.2254769227  
-0.5727783336  
-0.8593615336  
-1.065653825  
-1.17864135  
-1.193897089  
-1.116624579  
-0.9614729746  
-0.7510612905  
-0.5133589223  
-0.2782091558  
-0.07346410318  
0.07875305512  
0.1651114692  
0.1829955592  
0.1409804301  
0.05771836946  
-0.04064172401  
-0.1241957214  
-0.1636718738  
-0.1348676739  
-0.02249619404  
0.1771338256  
0.454997813  
0.7899930615  
1.151286352  
1.502043651  
1.804050371  
2.022579341  
2.130820888  
2.113274705  
1.967638375  
1.704952339  
1.348009791  
0.9282955652  
0.4819122418  
0.04508062355  
-0.3501380287  
-0.6793370201  
-0.9280250831  
-1.092413979  
-1.178721018  
-1.201181092  
-1.179150954  
-1.133779801  
-1.084770839  
-1.047686336  
-1.032139622  
-1.041072345  
-1.071105404  
-1.11382924  
-1.157746777  
-1.190515849  
-1.20112392  
-1.181681797  
-1.128574813  
-1.042872828  
-0.9299664735  
-0.7985651601  
-0.6592375213  
-0.5227501862  
-0.3984740088  
-0.2930854041  
-0.2097514506  
-0.1479004815  
-0.1035829237  
-0.07035371972  
-0.04052603063  
-0.006599529252  
0.03735770552  
0.09457585142  
0.1648715601  
0.2444760249  
0.3264213533  
0.4014534048  
0.4593484839  
0.4904465445  
0.487198595  
0.4454935839  
0.3655809589  
0.252424192  
0.1154357965  
-0.0324056137  
-0.1759454512  
-0.2995841528  
-0.3891076484  
-0.4333811404  
-0.4256811227  
-0.3644830395  
-0.2536086094  
-0.1017318285  
0.07868249517  
0.272827239  
0.4651895625  
0.6411373793  
0.7882446999  
0.8971941038  
0.9621841507  
0.9808268143  
0.9536351873  
0.8832433425  
0.7735384314  
0.6289067723  
0.4537402986  
0.2522948849  
0.02892296965  
-0.2113915672  
-0.4623480645  
-0.7156723853  
-0.9607077763  
-1.184416545  
-1.371922419  
-1.507590051  
-1.576580055  
-1.566668203  
-1.470079854  
-1.285036868  
-1.016731881  
-0.6775175623  
-0.2862025559  
0.1335163634  
0.5553244086  
0.952966137  
1.302979312  
1.587107122  
1.794040637  
1.920270761  
1.96992179  
1.953634444  
1.886663971  
1.786507154  
1.670390405  
1.553002345  
1.444746718  
1.35074285  
1.270664102  
1.19936806  
1.128195858  
1.046689673  
0.9444944782  
0.8131584307  
0.6476099548  
0.4471468073  
0.2158321219  
-0.03769901692  
-0.3009887259  
-0.5589379837  
-0.7952895202  
-0.9942380888  
-1.142038267  
-1.228424794  
-1.247755348  
-1.19975018  
-1.089774141  
-0.9286091951  
-0.7317282511  
-0.5180963138  
-0.308593595  
-0.124174707  
0.01607318418  
0.09677913889  
0.1078562454  
0.04560592903  
-0.08678548771  
-0.2794470565  
-0.5167148826  
-0.7786632352  
-1.043100244  
-1.287832107  
-1.492920994  
-1.642699691  
-1.727275368  
-1.743361885  
-1.694324469  
-1.589439257  
-1.442454433  
-1.269636941  
-1.087556515  
-0.9108915908  
-0.7505459659  
-0.6123285883  
-0.4963723523  
-0.3973772415  
-0.305652717  
-0.2088193242  
-0.09394322014  
0.05018900867  
0.230966635  
0.4503264043  
0.7038359351  
0.9806267755  
1.264221021  
1.534155625  
1.768208889  
1.944960167  
2.046346079  
2.05990236  
1.980392322  
1.81062407  
1.561348964  
1.25024058  
0.9000944881  
0.5364667136  
0.1850217956  
-0.1310696454  
-0.3933900603  
-0.5899267658  
-0.7159308497  
-0.7739186634  
-0.7728248959  
-0.7264521835  
-0.651423998  
-0.5649149233  
-0.4824400949  
-0.4159844768  
-0.3726784705  
-0.3541818849  
-0.3568015771  
-0.3723233411  
-0.3893977279  
-0.3953076215  
-0.377858772  
-0.3271722974  
-0.2371420538  
-0.1064012391  
0.06129972752  
0.2573401558  
0.4690451829  
0.6809570431  
0.8764137115  
1.039242239  
1.155382548  
1.214280544  
1.209908282  
1.141312401  
1.012675804  
0.8328781944  
0.6146311112  
0.3732755941  
0.1253697945  
-0.1127889241  
-0.3265744544  
-0.5042306931  
-0.6377596361  
-0.7234008781  
-0.7616867894  
-0.7570593013  
-0.7171121827  
-0.65154568  
-0.5709582649  
-0.4856249704  
-0.4043928679  
-0.3338304472  
-0.2777104191  
-0.2368827118  
-0.209518622  
-0.1916746908  
-0.1780808078  
-0.1630279626  
-0.1412160992  
-0.1084675429  
-0.06219272334  
-0.001586627024  
0.07246404233  
0.1577042789  
0.2509938023  
0.3488543193  
0.447974745  
0.5455848643  
0.6396554308  
0.7288805693  
0.8124761869  
0.8898379128  
0.9601378332  
1.021946406  
1.072960324  
1.109899057  
1.128613278  
1.124397804  
1.092485212  
1.028668504  
0.9299685045  
0.7952738861  
0.6258616287  
0.4257287416  
0.2016878712  
-0.03682873556  
-0.2782448755  
-0.5095844171  
-0.7174377117  
-0.8890582427  
-1.013504563  
-1.082702281  
-1.092308096  
-1.042271564  
-0.9370212612  
-0.785225093  
-0.5991331343  
-0.3935653039  
-0.1846363858  
0.01165013256  
0.1807906157  
0.3110077648  
0.3941986093  
0.4265093869  
0.4085011998  
0.3449047728  
0.244005019  
0.116749968  
-0.02433828246  
-0.1663275972  
-0.2970106229  
-0.4059173067  
-0.4851204814  
-0.5297842725  
-0.5384120211  
-0.5127878972  
-0.4576383334  
-0.3800372409  
-0.2886284894  
-0.1927465445  
-0.1015182157  
-0.02303719325  
0.03630551148  
0.07227042424  
0.08297566657  
0.06883150211  
0.03225402011  
-0.02280202886  
-0.09141489118  
-0.1682914437  
-0.2483035497  
-0.3269113994  
-0.4004339338  
-0.4661554952  
-0.5222870716  
-0.5678333532  
-0.6024105709  
-0.6260711233  
-0.6391905444  
-0.6424299962  
-0.6367823948  
-0.6236794254  
-0.6051111902  
-0.5837075671  
-0.5627292702  
-0.5459323616  
-0.5372755548  
-0.5405000636  
-0.5586095708  
-0.5933189001  
-0.6445561117  
-0.710101871  
-0.7854420986  
-0.8638780366  
-0.936933048  
-0.9950188969  
-1.028325019  
-1.027831925  
-0.9863594301  
-0.8995090769  
-0.7664031858  
-0.5901082491  
-0.3776685315  
-0.1397168447  
0.1103357053  
0.3574778599  
0.5865417689  
0.783767004  
0.938321872  
1.04359086  
1.098046161  
1.1055812  
1.075190741  
1.020006581  
0.9557495363  
0.8987548649  
0.8638139267  
0.8620873826  
0.8993965678  
0.9751507666  
1.082084598  
1.206920652  
1.331898918  
1.43703265  
1.502793974  
1.51291042  
1.4568521  
1.331668623  
1.142887044  
0.9042967443  
0.6366117874  
0.3651416663  
0.1167729934  
-0.08337561285  
-0.2151601921  
-0.2660650502  
-0.2329385427  
-0.122560744  
0.049033687  
0.2584083251  
0.4775219928  
0.6771073351  
0.830229174  
0.9155542646  
0.9199511469  
0.840105677  
0.6829586738  
0.4649440364  
0.2101136805  
-0.05259526895  
-0.2926427905  
-0.4813170998  
-0.5949298657  
-0.6174067334  
-0.5420065986  
-0.3719689183  
-0.1200548778  
0.1929600596  
0.5406351909  
0.8937701865  
1.223520672  
1.504332864  
1.716373301  
1.847157367  
1.892226682  
1.854817651  
1.74463695  
1.575936742  
1.365217026  
1.128889538  
0.8812410781  
0.6329855575  
0.3905629077  
0.1562497937  
-0.07101224023  
-0.2942725725  
-0.516965519  
-0.7413758269  
-0.9674286175  
-1.192028152  
-1.409055055  
-1.609994708  
-1.785088787  
-1.924789826  
-2.021260823  
-2.069662407  
-2.068996307  
-2.022372908  
-1.936657094  
-1.821547237  
-1.688255273  
-1.547994546  
-1.410536173  
-1.283056167  
-1.169456215  
-1.070271019  
-0.9831379081  
-0.9037568088  
-0.8271436533  
-0.7489536144  
-0.666635287  
-0.5801977891  
-0.4924470111  
-0.4086514076  
-0.335663215  
-0.2806788851  
-0.2498361407  
-0.2469083143  
-0.2723547501  
-0.322896662  
-0.3917387034  
-0.4694124944  
-0.5451242051  
-0.6083806699  
-0.6506305909  
-0.6666158618  
-0.6551991941  
-0.6195033482  
-0.5663080573  
-0.5048074281  
-0.4449105174  
-0.3953798987  
-0.3621348035  
-0.3470020231  
-0.3471657519  
-0.3554042974  
-0.3611084913  
-0.351916298  
-0.3157077664  
-0.2426233599  
-0.1267905997  
0.03253309766  
0.2305782699  
0.4575079228  
0.6995909729  
0.9409271169  
1.165425634  
1.358732303  
1.509805838  
1.611925479  
1.663015311  
1.665284773  
1.624322014  
1.547838773  
1.444334654  
1.321922732  
1.187531112  
1.046585925  
0.9031820277  
0.7606555103  
0.6223622644  
0.4924526624  
0.376406891  
0.2811559646  
0.2146998435  
0.1852184585  
0.1998108603  
0.2630599268  
0.3756904987  
0.5335952671  
0.7274634657  
0.9431450246  
1.162800776  
1.366715996  
1.53556698  
1.652834063  
1.706979292  
1.693074011  
1.613565055  
1.478037808  
1.301938466  
1.104394927  
0.9054120551  
0.7228280027  
0.5694644504  
0.4509017896  
0.364247843  
0.2981239681  
0.2339444499  
0.1483863903  
0.01675076821  
-0.1831914113  
-0.4673761836  
-0.8421870798  
-1.302222772  
-1.829449204  
-2.393947865  
-2.956238854  
-3.470967603  
-3.891573295  
-4.175384108  
-4.288533302  
-4.210070561  
-3.93473359  
-3.473990528  
-2.855174509  
-2.118789794  
-1.314288394  
-0.4948549911  
