------------------------------------------
Setting up environment variables
---
LD_LIBRARY_PATH is .:/opt/software/fix/1.065/MATLAB_Compiler_Runtime/v83/runtime/glnxa64:/opt/software/fix/1.065/MATLAB_Compiler_Runtime/v83/bin/glnxa64:/opt/software/fix/1.065/MATLAB_Compiler_Runtime/v83/sys/os/glnxa64
Warning: Name is nonexistent or not a directory: /usr/local/fsl/etc/matlab
[> In path at 109
  In startup at 1] 
Warning: Name is nonexistent or not a directory: /usr/local/fmrib/fmt
[> In path at 109
  In startup at 2] 
/home/mpib/LNDG/StateSwitch/WIP_rest/preproc/B_data/D_preproc/1240/preproc/rest/FEAT.feat/
    27     1

    27     2

    27     3

    27     4

    27     5

    27     6

    27     7

    27     8

    27     9

    27    10

    27    11

    27    12

    27    13

    27    14

    27    15

    27    16

    27    17

    27    18

    27    19

    27    20

    27    21

    27    22

    27    23

    27    24

    27    25

    27    26

    27    27

End of Matlab Script
