0.4004896808  
0.6288714956  
0.8279057393  
0.9705011915  
1.037107331  
1.018450082  
0.9168466491  
0.7459222928  
0.5288002167  
0.2950346009  
0.07673522759  
-0.09556796256  
-0.1967772206  
-0.2103000714  
-0.12997262  
0.03936572327  
0.2826711989  
0.5767261045  
0.893112203  
1.20174473  
1.474530045  
1.688707555  
1.829479776  
1.891628712  
1.879912994  
1.808203827  
1.697440786  
1.572641741  
1.459327548  
1.37979603  
1.349726966  
1.375586232  
1.453202113  
1.567769067  
1.695341595  
1.80569013  
1.866184483  
1.846207771  
1.721516612  
1.477916926  
1.113722748  
0.6405987851  
0.08262742059  
-0.526315913  
-1.146542024  
-1.737317726  
-2.26177886  
-2.691260217  
-3.008445465  
-3.208891145  
-3.300729831  
-3.302643028  
-3.24043251  
-3.142745044  
-3.036600305  
-2.943397331  
-2.875981287  
-2.837167872  
-2.819907388  
-2.809000719  
-2.784063356  
-2.723251896  
-2.607165095  
-2.422335675  
-2.163793987  
-1.836346397  
-1.454397283  
-1.040376123  
-0.6220026061  
-0.2288056828  
0.1116076453  
0.377022465  
0.5533489716  
0.6362736774  
0.6316333045  
0.5544979608  
0.4271287969  
0.2761050003  
0.1290330077  
0.01127474112  
-0.05688502757  
-0.06228900761  
4.413839672e-05  
0.1269522185  
0.3081657785  
0.5281465241  
0.7684215352  
1.010069596  
1.23599861  
1.4327336  
1.591505711  
1.708560005  
1.784736609  
1.824462511  
1.834401791  
1.822016834  
1.794299472  
1.756871536  
1.713559197  
1.666457747  
1.616400635  
1.563676154  
1.50879987  
1.453149405  
1.399299489  
1.350974314  
1.31260353  
1.288548894  
1.28214338  
1.294717  
1.324801549  
1.367676295  
1.415377762  
1.457215982  
1.480771781  
1.473260232  
1.423094444  
1.321438321  
1.163532649  
0.9495927381  
0.6851337215  
0.3806542779  
0.05069006864  
-0.2876614792  
-0.616563202  
-0.9193835081  
-1.182512042  
-1.396809848  
-1.558508376  
-1.669434975  
-1.736543588  
-1.770808811  
-1.785632827  
-1.794963667  
-1.811365232  
-1.844280688  
-1.898700157  
-1.974392735  
-2.065800423  
-2.16261504  
-2.25096614  
-2.315108818  
-2.339402713  
-2.310368684  
-2.218573595  
-2.060101671  
-1.837422936  
-1.559511071  
-1.241165375  
-0.9015758134  
-0.562287073  
-0.2447901681  
0.03194533841  
0.2536759857  
0.4125110241  
0.5077232326  
0.5456038738  
0.5383681901  
0.5022523115  
0.4550747957  
0.4136143133  
0.391202193  
0.3958844706  
0.4294328208  
0.4873452494  
0.5598218926  
0.6335461309  
0.6939846027  
0.7278429698  
0.7252857254  
0.6816040015  
0.5980793  
0.4819536897  
0.3455231352  
0.2045317294  
0.0761062829  
-0.02344937478  
-0.08071091614  
-0.08676587305  
-0.03824685126  
0.06233201552  
0.2069237877  
0.3828942073  
0.5744071719  
0.7640607877  
0.9345792682  
1.070379279  
1.158866909  
1.19137553  
1.16368696  
1.076142809  
0.9333725128  
0.7437066254  
0.5183504483  
0.2704005607  
0.01379719238  
-0.2377030227  
-0.4714677566  
-0.6767631602  
-0.845326164  
-0.9716859779  
-1.053234403  
-1.090054123  
-1.084533426  
-1.040832748  
-0.964272964  
-0.8607191737  
-0.7360414275  
-0.5957101423  
-0.4445563794  
-0.2867164517  
-0.1257175799  
0.03532513341  
0.1934904369  
0.345864726  
0.4894632197  
0.6212833117  
0.7385080836  
0.8388112188  
0.9207077956  
0.9838683878  
1.029291264  
1.059286299  
1.077207114  
1.086962377  
1.092357176  
1.096365116  
1.100470019  
1.10419134  
1.104914102  
1.098071979  
1.077692624  
1.037241498  
0.9706463615  
0.8733606213  
0.7432989469  
0.5815061077  
0.3924486228  
0.1838795396  
-0.03371573303  
-0.2480334118  
-0.4461090971  
-0.6155897337  
-0.7459683683  
-0.8296455717  
-0.8627141412  
-0.8453762829  
-0.7819766394  
-0.6806383223  
-0.5525572635  
-0.4110166557  
-0.2702231227  
-0.1440595373  
-0.04487785221  
0.01756941922  
0.03695488041  
0.01087737349  
-0.05900211349  
-0.1672227477  
-0.3051471523  
-0.4618937064  
-0.6254682836  
-0.7839779485  
-0.926785503  
-1.045476011  
-1.134530842  
-1.191640811  
-1.217640628  
-1.216085305  
-1.192545043  
-1.153714205  
-1.106450192  
-1.056864974  
-1.009570375  
-0.9671549226  
-0.9299501336  
-0.8960862649  
-0.8618293367  
-0.822143394  
-0.7714109172  
-0.7042278667  
-0.6161916562  
-0.5045936416  
-0.3689533814  
-0.2113395105  
-0.03643519906  
0.148656302  
0.3348617993  
0.5118089507  
0.6686656422  
0.7950666101  
0.8820514058  
0.9229082416  
0.9138461829  
0.8544161803  
0.747639951  
0.5998236947  
0.4200831525  
0.2196215923  
0.01084631416  
-0.193591962  
-0.3817347169  
-0.5431418629  
-0.6695303092  
-0.7551914629  
-0.7971565189  
-0.7951416242  
-0.7512917576  
-0.669793607  
-0.5564072581  
-0.4179775331  
-0.261963795  
-0.09600907654  
0.07243871565  
0.23646984  
0.3900327609  
0.5282329619  
0.6476120721  
0.7463830369  
0.8245769866  
0.8840599653  
0.9283700309  
0.9623504462  
0.991571502  
1.021591957  
1.057128035  
1.101244501  
1.154690069  
1.215503347  
1.278974467  
1.338026336  
1.383979554  
1.407641925  
1.400568083  
1.356320415  
1.27153171  
1.146614351  
0.9859706541  
0.7976731349  
0.5926359314  
0.3833788149  
0.1825636988  
0.00149881011  
-0.1511802368  
-0.2704678747  
-0.355467198  
-0.4093238161  
-0.4386402104  
-0.4524573755  
-0.460955563  
-0.474041897  
-0.5000211044  
-0.5445145151  
-0.6097551549  
-0.6943364812  
-0.7934350743  
-0.8994599799  
-1.003030912  
-1.094157607  
-1.163466205  
-1.203312894  
-1.20866252  
-1.177616342  
-1.111556656  
-1.014888037  
-0.8944383265  
-0.758607981  
-0.616383058  
-0.4763462878  
-0.345807096  
-0.2301498086  
-0.1324695721  
-0.05352013645  
0.008036638386  
0.055129618  
0.09160194313  
0.1214519201  
0.1480899769  
0.1737129539  
0.1988704932  
0.2222880607  
0.2409739969  
0.2506128528  
0.2462039462  
0.222879278  
0.176802337  
0.1060340968  
0.01123890627  
-0.1038835802  
-0.2325222068  
-0.3650983391  
-0.4900136502  
-0.5947495152  
-0.6672068383  
-0.6971173972  
-0.6773577764  
-0.6049754947  
-0.4817848805  
-0.3144198451  
-0.1138290643  
0.1057473101  
0.3281945184  
0.537154865  
0.7176646185  
0.8575986068  
0.9487350547  
0.9873445409  
0.9742564474  
0.9144452356  
0.8162395395  
0.6903017415  
0.5485384635  
0.4030737734  
0.2653946254  
0.1457015917  
0.05246770022  
-0.007856635017  
-0.03105290463  
-0.01532221937  
0.03851584444  
0.126833988  
0.2430694298  
0.3777599424  
0.5188469311  
0.6523294621  
0.7633122618  
0.8374017071  
0.8623393008  
0.8296707264  
0.7361963918  
0.5849569659  
0.3855163819  
0.1534073966  
-0.09128675595  
-0.3260946488  
-0.528817611  
-0.6803402291  
-0.7671883529  
-0.7834481174  
-0.7317385272  
-0.623057417  
-0.4754870931  
-0.3119146968  
-0.1570749924  
-0.03431689391  
0.03745085294  
0.0462188324  
-0.01159997724  
-0.1307810736  
-0.2980758005  
-0.4940513013  
-0.6957156418  
-0.8795707791  
-1.024659254  
-1.115215527  
-1.142562274  
-1.106014744  
-1.012704115  
-0.876356504  
-0.71522285  
-0.5494539081  
-0.3982989705  
-0.2775079905  
-0.1972903189  
-0.1611070523  
-0.1654393198  
-0.2005434127  
-0.2520699272  
-0.3032922121  
-0.3376149116  
-0.3410122789  
-0.3040330291  
-0.2231197126  
-0.1010697769  
0.05339935479  
0.2268851333  
0.4031316093  
0.5651787095  
0.6975133244  
0.7879261603  
0.8288314698  
0.8178983369  
0.7579572252  
0.6562396454  
0.5231213812  
0.3705839681  
0.2106507843  
0.05402524501  
-0.09088232108  
-0.2184370858  
-0.3257467793  
-0.4121889469  
-0.4786294889  
-0.5265046871  
-0.556960265  
-0.5702057499  
-0.5652006013  
-0.539729339  
-0.4908379496  
-0.4155546983  
-0.3117627571  
-0.1790657499  
-0.01948670245  
0.1621247721  
0.3580770554  
0.5582352696  
0.7508068623  
0.9234368775  
1.064471527  
1.164252363  
1.216270669  
1.218036081  
1.171552372  
1.083309234  
0.96378278  
0.8264592136  
0.686474693  
0.5589994391  
0.4575259161  
0.3922556579  
0.368775007  
0.3871792439  
0.4417925439  
0.5215369915  
0.6109581827  
0.6918197231  
0.7451111624  
0.7532558557  
0.7022613694  
0.5835653752  
0.3953352911  
0.1430575111  
-0.160686194  
-0.4972428543  
-0.8436292292  
-1.174794123  
-1.466158314  
-1.696143031  
-1.848396218  
-1.913465357  
-1.889714749  
-1.783384675  
-1.607784728  
-1.381717611  
-1.127314523  
-0.8675491279  
-0.6237192291  
-0.4132031533  
-0.2477576625  
-0.1325610859  
-0.06610971456  
-0.04096833053  
-0.04526037094  
-0.06469225236  
-0.08482589138  
-0.0932864224  
-0.0815923729  
-0.04636181805  
0.01028454744  
0.08115766556  
0.1552182593  
0.2193861012  
0.2606766836  
0.2683546431  
0.2357912596  
0.1617599292  
0.0509848316  
-0.08613796224  
-0.2346035017  
-0.3765098527  
-0.4931869414  
-0.5674654877  
-0.585792652  
-0.539925948  
-0.4279976256  
-0.2548173872  
-0.03138311559  
0.2263388182  
0.4992140808  
0.7670936896  
1.011066992  
1.215536904  
1.369852215  
1.469314355  
1.515409407  
1.515246242  
1.480265305  
1.424390326  
1.361859748  
1.305048541  
1.262573989  
1.237970736  
1.229127393  
1.228585945  
1.224666682  
1.203278097  
1.150143716  
1.053144139  
0.904422219  
0.7019549704  
0.4503635002  
0.1608409782  
-0.1497964862  
-0.4608087249  
-0.7497601929  
-0.9949864228  
-1.177997122  
-1.285520032  
-1.310964079  
-1.255138002  
-1.126183813  
-0.9387451269  
-0.7124942463  
-0.4701861614  
-0.2354553765  
-0.03057579386  
0.1255988082  
0.2193089835  
0.2430331579  
0.1959798899  
0.08388102671  
-0.08190119193  
-0.2858619147  
-0.5102860734  
-0.7374005932  
-0.9514940439  
-1.140718708  
-1.29833504  
-1.423202594  
-1.519428097  
-1.595188869  
-1.660888127  
-1.726896899  
-1.801221174  
-1.887464972  
-1.983426178  
-2.080590139  
-2.164648909  
-2.21703013  
-2.217253558  
-2.1458067  
-1.987132986  
-1.732308156  
-1.380998671  
-0.9424117586  
-0.4350726445  
0.1145542946  
0.6744353081  
1.210023294  
1.687608316  
2.077547586  
2.357001109  
2.511865926  
2.537755615  
2.43996647  
2.232527281  
1.936519038  
1.57790671  
1.185157808  
0.7868969645  
0.4098050598  
0.0769118857  
-0.1936419151  
-0.3893426903  
-0.5035749401  
-0.5354745171  
-0.4894399022  
-0.37438173  
-0.2027891224  
0.01031900275  
0.2484849977  
0.4948892154  
0.7333665001  
0.949297895  
1.130361872  
1.267097983  
1.353262899  
1.385982681  
1.365686103  
1.295842179  
1.182534079  
1.033881573  
0.8593818276  
0.6691917371  
0.4734126806  
0.2814260916  
0.1013114456  
-0.06059229126  
-0.199978232  
-0.3146743881  
-0.4045693528  
-0.4713595007  
-0.5181513311  
-0.5489578347  
-0.5681356219  
-0.5798312512  
-0.5874928624  
-0.593497361  
-0.5989457459  
-0.6036376075  
-0.6062287827  
-0.6045499239  
-0.5960384071  
-0.5782249298  
-0.5492025363  
-0.5080135014  
-0.4548903065  
-0.3913141818  
-0.3198733833  
-0.2439382089  
-0.1671918366  
-0.09309380001  
-0.02435414539  
0.03748220534  
0.09226891235  
0.1412402339  
0.1867302795  
0.2316471992  
0.2787738863  
0.330000419  
0.3856248014  
0.4438547588  
0.5006345695  
0.5498642903  
0.5840389369  
0.5952404853  
0.5763753486  
0.5224661339  
0.4318035914  
0.3067461619  
0.1540071311  
-0.01567694979  
-0.1884983077  
-0.3490641582  
-0.4822245488  
-0.5750045744  
-0.6183440292  
-0.6083864632  
-0.5471002841  
-0.4421212861  
-0.3058166441  
-0.1536934001  
-0.002382575841  
0.1325070087  
0.2383370237  
0.306907635  
0.3352222666  
0.325452509  
0.284135876  
0.220760653  
0.1459945387  
0.06987248646  
0.0002521767212  
-0.05819696379  
-0.1043224537  
-0.1400989474  
-0.1696329153  
-0.1977848304  
-0.2287053911  
-0.2645965231  
-0.3049742662  
-0.3465952572  
-0.3840912593  
-0.4111965622  
-0.4223311757  
-0.4142226753  
-0.3872133519  
-0.3459517057  
-0.2992741465  
-0.2592124563  
-0.2392523059  
-0.252086266  
-0.3072358773  
-0.4089438421  
-0.5547232834  
-0.7348431578  
-0.932901004  
-1.127443495  
-1.294440049  
-1.410269454  
-1.45479631  
-1.41408886  
-1.282396354  
-1.063093895  
-0.7684732516  
-0.4184100458  
-0.03811304652  
0.3447357075  
0.7030465465  
1.013200879  
1.257373418  
1.425052487  
1.51360869  
1.527925699  
1.479208221  
1.383201875  
1.258088863  
1.122354709  
0.9928750795  
0.8834161104  
0.8036601096  
0.7587799633  
0.7495164531  
0.7726638214  
0.8218341964  
0.8883776385  
0.962346345  
1.033420557  
1.091751869  
1.128687545  
1.137372143  
1.113214573  
1.054205116  
0.9610639715  
0.8371933766  
0.6884107674  
0.5224523634  
0.348270992  
0.1751710211  
0.01185912144  
-0.1344673255  
-0.2588980896  
-0.3593264806  
-0.4366220912  
-0.4944220578  
-0.5385508046  
-0.5761312991  
-0.6145190385  
-0.6602017837  
-0.7178336654  
-0.7895559225  
-0.8747098472  
-0.9699901834  
-1.070022139  
-1.168267977  
-1.258112912  
-1.333954332  
-1.392104719  
-1.431349914  
-1.453060718  
-1.460826028  
-1.459658733  
-1.454906836  
-1.451051357  
-1.450607773  
-1.453340066  
-1.455941072  
-1.452280391  
-1.434202593  
-1.392779127  
-1.319826809  
-1.209441206  
-1.059292175  
-0.8714395036  
-0.6525055797  
-0.4131407424  
-0.1668289582  
0.07179029044  
0.2888432661  
0.4730693022  
0.6173011557  
0.7193248889  
0.7819655896  
0.8123883178  
0.8207096094  
0.8181619146  
0.8151131622  
0.8192787814  
0.8344259281  
0.859799703  
0.8903570007  
0.9177692632  
0.932019003  
0.923324033  
0.884047854  
0.8102894433  
0.7028914898  
0.5676991693  
0.4150419816  
0.2585373005  
0.1134021775  
-0.005447497309  
-0.08523286585  
-0.116816531  
-0.09570065789  
-0.0224053974  
0.09774876226  
0.2553732663  
0.4380943194  
0.6318078162  
0.8219271636  
0.9944819857  
1.136995179  
1.239096138  
1.292916651  
1.293307239  
1.23795709  
1.127464358  
0.9653858728  
0.758258516  
0.5155496  
0.2494824554  
-0.02534229171  
-0.2925610296  
-0.5349305303  
-0.735446708  
-0.8786352549  
-0.9518990451  
-0.9467789876  
-0.8599775734  
-0.6940073193  
-0.4573429033  
-0.1640257746  
0.1672700445  
0.5146526053  
0.8547568128  
1.164650504  
1.423692844  
1.615143862  
1.727353214  
1.754414639  
1.696239221  
1.55807381  
1.349569167  
1.083544829  
0.7746388303  
0.4380183662  
0.08831018707  
-0.2611527022  
-0.5987221321  
-0.9145022889  
-1.200168662  
-1.448674226  
-1.653973559  
-1.810888442  
-1.915196403  
-1.963964945  
-1.956085797  
-1.892908275  
-1.778824325  
-1.621643593  
-1.432607698  
-1.225940028  
-1.017900683  
-0.8253919232  
-0.6642524205  
-0.5474398361  
-0.4833560177  
-0.4745582943  
-0.5170904878  
-0.6005710895  
-0.7091000903  
-0.8229195448  
-0.920647989  
-0.9818315657  
-0.989477976  
-0.9322443072  
-0.8059658894  
-0.6143167702  
-0.368486287  
-0.08590637327  
0.2118012507  
0.5013939894  
0.7607386785  
0.9713368216  
1.120311516  
1.20160848  
1.216272287  
1.171816649  
1.080810605  
0.9589395651  
0.822831072  
0.6879752215  
0.5670114865  
0.4685887773  
0.3968941792  
0.3518385421  
0.3297886702  
0.3246701575  
0.3292277398  
0.336233616  
0.3394813503  
0.3344516574  
0.3186109237  
0.2913651254  
0.2537506577  
0.207955145  
0.1567852235  
