-0.1166753537  
-0.02305526977  
0.05857066568  
0.1153947254  
0.136907247  
0.1157845001  
0.04850894666  
-0.06429410289  
-0.2178335782  
-0.4034273367  
-0.6090740269  
-0.8202774545  
-1.021090431  
-1.195304906  
-1.327724146  
-1.40542707  
-1.41892623  
-1.363143912  
-1.238091727  
-1.049210778  
-0.8072996988  
-0.5280059944  
-0.2308854492  
0.06192861392  
0.3273838055  
0.5433756457  
0.6906930693  
0.7548627779  
0.7277275067  
0.6085732813  
0.4046526423  
0.130999723  
-0.1905191982  
-0.5328744831  
-0.8661564426  
-1.160267694  
-1.387763131  
-1.526538344  
-1.562056358  
-1.488850016  
-1.31109201  
-1.042149731  
-0.7031427416  
-0.3206509233  
0.07616059241  
0.4586732937  
0.80181487  
1.086572204  
1.301702156  
1.444445897  
1.520151887  
1.540889612  
1.523243315  
1.485600858  
1.445310547  
1.416102788  
1.406126405  
1.416878814  
1.443166519  
1.474089013  
1.494905082  
1.489501583  
1.44310527  
1.344835571  
1.189729067  
0.9799317914  
0.7248694069  
0.4403632949  
0.1467953384  
-0.1334283515  
-0.3787717564  
-0.5714235075  
-0.6997102514  
-0.7597319344  
-0.7559808574  
-0.7008440057  
-0.6130460049  
-0.5152198596  
-0.430932155  
-0.3815478908  
-0.3833550361  
-0.4453325399  
-0.5678540015  
-0.7425099324  
-0.9530617367  
-1.177401545  
-1.390261046  
-1.56630106  
-1.683191053  
-1.724269315  
-1.680466331  
-1.55125916  
-1.344570337  
-1.075657281  
-0.7651800858  
-0.4367251583  
-0.1141195836  
0.1811085975  
0.4318192903  
0.6266732447  
0.7607291837  
0.8352335731  
0.8566963932  
0.835452332  
0.7839468046  
0.715023307  
0.6404419331  
0.5698069415  
0.5099973299  
0.4650981033  
0.4367533806  
0.4247851035  
0.4279125251  
0.4443945609  
0.4724682066  
0.5105162092  
0.5569655986  
0.6099888771  
0.6671295326  
0.7249840328  
0.7790594939  
0.8239017265  
0.8534892902  
0.8618677106  
0.843901443  
0.7960110313  
0.7167536793  
0.6071240617  
0.4705163121  
0.3123587869  
0.1394788397  
-0.04065070412  
-0.2206631819  
-0.39388088  
-0.5546455893  
-0.6983567852  
-0.8212578707  
-0.9200719907  
-0.9916414586  
-1.032713438  
-1.039994548  
-1.010536957  
-0.9424194958  
-0.8356135507  
-0.6928558298  
-0.5203161252  
-0.3278512466  
-0.1287074403  
0.06138083942  
0.2256550887  
0.3481677683  
0.4157543069  
0.4198360667  
0.3577595908  
0.2334404584  
0.0571761212  
-0.1553777776  
-0.3849403612  
-0.6108104887  
-0.8132335071  
-0.9755939919  
-1.086137059  
-1.139003198  
-1.134465741  
-1.078400315  
-0.9811109053  
-0.8557321705  
-0.7164645185  
-0.5768809116  
-0.4485114432  
-0.3398269918  
-0.2556665106  
-0.1970782756  
-0.1614922738  
-0.1431309109  
-0.133576645  
-0.1224286024  
-0.09804992045  
-0.04842163667  
0.03787368485  
0.17051695  
0.3561938023  
0.5973076038  
0.8908041374  
1.227317363  
1.59083813  
1.959099904  
2.304784845  
2.597558467  
2.806797206  
2.904753465  
2.869795595  
2.68930937  
2.36184674  
1.898200304  
1.32117631  
0.6640366932  
-0.03226015752  
-0.7227289191  
-1.362510826  
-1.911048325  
-2.335787467  
-2.61501276  
-2.739516438  
-2.712969287  
-2.551003014  
-2.279172861  
-1.930077978  
-1.539979821  
-1.145294703  
-0.7793061458  
-0.4693983983  
-0.2350204928  
-0.08652114363  
-0.02488521694  
-0.04234193686  
-0.1237332735  
-0.2484722794  
-0.3928963397  
-0.5327819475  
-0.6457828258  
-0.7135618727  
-0.7234293543  
-0.6693260218  
-0.552078323  
-0.3789296171  
-0.1624114474  
0.08127116267  
0.3341433991  
0.5784134824  
0.798240324  
0.9811199174  
1.118771514  
1.207467782  
1.247846403  
1.244304054  
1.204139953  
1.136594689  
1.051945719  
0.9607661127  
0.8733704945  
0.7994458102  
0.747779556  
0.7259907693  
0.7401615446  
0.7943250069  
0.8897997593  
1.024454192  
1.192047906  
1.381827797  
1.578576368  
1.763263257  
1.914361293  
2.009791148  
2.029310931  
1.957076987  
1.784004836  
1.509553906  
1.14259673  
0.7011498443  
0.2108984425  
-0.2973638784  
-0.7910872751  
-1.239659285  
-1.617940077  
-1.909121205  
-2.1064825  
-2.213793763  
-2.244282528  
-2.21833619  
-2.16026171  
-2.094605484  
-2.042550754  
-2.018927878  
-2.030248342  
-2.074013587  
-2.13936544  
-2.208943352  
-2.261643742  
-2.27586401  
-2.232767534  
-2.119113475  
-1.929291386  
-1.666309341  
-1.341644163  
-0.9740105005  
-0.5872496891  
-0.2076151907  
0.1391766633  
0.4307758345  
0.6505768724  
0.7893836255  
0.8461899694  
0.8280275784  
0.7489164998  
0.6280867147  
0.4876750512  
0.3502006935  
0.2360903568  
0.1615511038  
0.1370100974  
0.1662887475  
0.2465775461  
0.369185246  
0.5209452992  
0.6860844748  
0.8483069631  
0.9928299146  
1.108106704  
1.187045602  
1.227567968  
1.232474162  
1.208651912  
1.165774242  
1.114675645  
1.065660216  
1.026986381  
1.003731475  
0.9972093805  
1.004995577  
1.021542346  
1.039274433  
1.049986114  
1.04631436  
1.02306045  
0.9781502779  
0.9130981509  
0.8328833053  
0.7452830828  
0.659737195  
0.5859306578  
0.5322944313  
0.5046541211  
0.5052188583  
0.5320735622  
0.5792444581  
0.637350327  
0.6947483569  
0.7390279307  
0.75864778  
0.7444921588  
0.6911324676  
0.5976181542  
0.467676584  
0.3093008289  
0.1337721448  
-0.04575007063  
-0.2158797678  
-0.3646674673  
-0.4830553952  
-0.5659250313  
-0.6126078056  
-0.6267929684  
-0.6158679354  
-0.5897838915  
-0.5596268992  
-0.5360884328  
-0.5280514188  
-0.5414809071  
-0.5787699901  
-0.6386037469  
-0.7163577269  
-0.804951974  
-0.8960266641  
-0.9812757221  
-1.053720434  
-1.108771228  
-1.14490007  
-1.163850044  
-1.170332603  
-1.171280996  
-1.174736648  
-1.188547866  
-1.219049576  
-1.269911186  
-1.341323466  
-1.429635634  
-1.527512985  
-1.624602994  
-1.708643813  
-1.76687507  
-1.787592961  
-1.761643805  
-1.683677102  
-1.552986321  
-1.373830874  
-1.155173832  
-0.9098654657  
-0.6533377719  
-0.4019802591  
-0.1713691507  
0.02543312053  
0.1792933641  
0.2859623642  
0.3464487364  
0.3667350726  
0.3568880274  
0.3296458527  
0.2986675229  
0.2766709437  
0.2737050876  
0.295798929  
0.3441837732  
0.415204525  
0.5009519869  
0.5905400778  
0.6718430923  
0.7334534269  
0.7665526711  
0.7664181814  
0.7333027674  
0.6725522678  
0.5938970551  
0.5100253137  
0.4346281039  
0.3802239111  
0.3560988665  
0.3666974068  
0.410745238  
0.4812576985  
0.5664765746  
0.6516112264  
0.7211400226  
0.7613326361  
0.7626170223  
0.7214169248  
0.6411843327  
0.5324400499  
0.411815057  
0.30019052  
0.2201945535  
0.1933809853  
0.237447356  
0.3638519528  
0.5761067322  
0.8689360301  
1.228382328  
1.632825373  
2.054782922  
2.463299086  
2.826662461  
3.115210005  
3.30393797  
3.374712427  
3.317864964  
3.133057405  
2.829313614  
2.424227336  
1.942402238  
1.413264637  
0.8684618374  
0.3390932266  
-0.146935679  
-0.5671647281  
-0.9062088756  
-1.156606314  
-1.318831162  
-1.40051244  
-1.41500679  
-1.37953233  
-1.313117391  
-1.234609874  
-1.160954631  
-1.105881525  
-1.079073208  
-1.085805125  
-1.126997921  
-1.199593155  
-1.297143907  
-1.410554591  
-1.528894344  
-1.640266239  
-1.732710927  
-1.795139919  
-1.818264685  
-1.795478031  
-1.723607891  
-1.603453311  
-1.439993754  
-1.242208818  
-1.02245019  
-0.7954039159  
-0.5767197128  
-0.3814484166  
-0.2224866754  
-0.1092222221  
-0.04656842639  
-0.0345257662  
-0.06833093564  
-0.1391725343  
-0.2353662347  
-0.3438103135  
-0.4515184804  
-0.5470028081  
-0.6213302436  
-0.6687242187  
-0.6866721944  
-0.6755706666  
-0.6380290668  
-0.5779810069  
-0.4997951032  
-0.4075373268  
-0.3045162797  
-0.1931760349  
-0.07530596264  
0.04748691796  
0.1731840692  
0.2987918875  
0.4199567968  
0.5308729717  
0.62455168  
0.6934442277  
0.7303482445  
0.7294603035  
0.6874159544  
0.6041273652  
0.4832744975  
0.3323280716  
0.1620729495  
-0.01433417698  
-0.1826687391  
-0.3291358316  
-0.4418635829  
-0.5121990761  
-0.5356369228  
-0.5122660743  
-0.4466927588  
-0.3474536612  
-0.2260256461  
-0.09555037629  
0.03055465135  
0.1399492641  
0.2225510479  
0.2714396724  
0.2834341798  
0.2593250768  
0.2037727521  
0.1249128285  
0.03370752594  
-0.05691030856  
-0.1330516759  
-0.1810099165  
-0.1884627962  
-0.1456689496  
-0.04658136874  
0.1102380319  
0.3210136577  
0.5765755333  
0.8626866662  
1.160918598  
1.450046398  
1.70787284  
1.913298457  
2.048413986  
2.100372088  
2.062783339  
1.936453013  
1.729337817  
1.455712101  
1.134646254  
0.7879801739  
0.438067294  
0.105564442  
-0.1924405554  
-0.4437480361  
-0.6416767343  
-0.784979759  
-0.8771086356  
-0.9250051924  
-0.9376289383  
-0.9244675042  
-0.8942504088  
-0.8540256888  
-0.8086944777  
-0.7610061745  
-0.7119346118  
-0.6613063556  
-0.6085143486  
-0.5531623116  
-0.4954995511  
-0.4365856254  
-0.3781596942  
-0.3222698867  
-0.2707615004  
-0.2247437171  
-0.1841622322  
-0.1475811967  
-0.112241933  
-0.0744038785  
-0.0299290495  
0.02496994196  
0.0929494409  
0.1748317964  
0.2691138669  
0.371771606  
0.4764119377  
0.5747713337  
0.6575123115  
0.7152269537  
0.7395225305  
0.7240597274  
0.6654092412  
0.5636274738  
0.4224830489  
0.2493045115  
0.05447192111  
-0.1493911928  
-0.348443977  
-0.5287713222  
-0.6775419418  
-0.7840894039  
-0.8408333853  
-0.8439654135  
-0.7938546806  
-0.6951275327  
-0.5563897556  
-0.3895911938  
-0.209042627  
-0.03014244852  
0.132102131  
0.264622516  
0.3577376311  
0.4063249742  
0.4105270743  
0.3758516236  
0.3125934749  
0.2345796952  
0.1573635214  
0.09606271505  
0.06314135702  
0.06645034176  
0.1078353969  
0.1825622729  
0.2796920264  
0.3834058698  
0.4751308436  
0.536175245  
0.550514221  
0.5072994298  
0.402724615  
0.2409448388  
0.03389350353  
-0.1999829748  
-0.4379279775  
-0.6556849675  
-0.830549025  
-0.9442169993  
-0.9850725239  
-0.9495932731  
-0.842725939  
-0.6772062457  
-0.4719513257  
-0.2497645647  
-0.03467621189  
0.1507370333  
0.2877224298  
0.3631541568  
0.3706031759  
0.3106145802  
0.1902412192  
0.02196575521  
-0.1778006228  
-0.3904209405  
-0.5967506073  
-0.7786952732  
-0.9205127912  
-1.00979174  
-1.0381308  
-1.001520103  
-0.9005035086  
-0.7401192893  
-0.5296569606  
-0.2822082562  
-0.01397779411  
0.2566760729  
0.5104773541  
0.7287239857  
0.8949315987  
0.9965054484  
1.026226181  
0.9833500208  
0.8741169858  
0.7115222655  
0.5142807026  
0.3050387513  
0.1079899938  
-0.05384689417  
-0.1613500341  
-0.2016640463  
-0.1698826376  
-0.06980040741  
0.08640240401  
0.2795316702  
0.4856346374  
0.6788742125  
0.8346261034  
0.9324053697  
0.9582425707  
0.906198636  
0.7788530367  
0.5867260946  
0.3467565574  
0.08006660503  
-0.190655854  
-0.4437911157  
-0.6611152055  
-0.8295229158  
-0.9419928124  
-0.9977140514  
-1.001454812  
-0.9623144959  
-0.8920896525  
-0.8035081512  
-0.7085729709  
-0.617218615  
-0.5364243236  
-0.4698220458  
-0.4178038586  
-0.378021613  
-0.3461625493  
-0.316837842  
-0.2844472818  
-0.243896228  
-0.1910878909  
-0.1231640116  
-0.03851799208  
0.06336587804  
0.1821501624  
0.3168857052  
0.4661588371  
0.6281019047  
0.8002415618  
0.9792196003  
1.160435525  
1.337712593  
1.503088872  
1.646840066  
1.757811805  
1.824099919  
1.834061969  
1.777577576  
1.647419343  
1.44055003  
1.159155403  
0.8112098634  
0.410448734  
-0.02432929822  
-0.4706032307  
-0.9039895693  
-1.300423317  
-1.638387701  
-1.900926661  
-2.0771701  
-2.163192083  
-2.162094911  
-2.083330839  
-1.94138232  
-1.753991876  
-1.540196701  
-1.318432159  
-1.104921672  
-0.9125387598  
-0.7501914734  
-0.6227459968  
-0.5313707323  
-0.4741737764  
-0.4469497959  
-0.4438983543  
-0.4581906205  
-0.4823560965  
-0.5084922362  
-0.5283956272  
-0.533702348  
-0.5161558113  
-0.468069531  
-0.3829971739  
-0.256551722  
-0.0872524959  
0.1227598975  
0.3673321976  
0.6363604761  
0.9164054746  
1.191844476  
1.446460644  
1.665268308  
1.83632043  
1.952216357  
2.011054232  
2.016656971  
1.97798706  
1.907808204  
1.820770285  
1.731177645  
1.6507888  
1.586968144  
1.541491423  
1.510211272  
1.483644979  
1.448437319  
1.389496045  
1.292499839  
1.14642052  
0.9456883833  
0.6916580764  
0.3931609287  
0.06600728946  
-0.2685034225  
-0.5859073779  
-0.861424207  
-1.072973964  
-1.203944052  
-1.245350691  
-1.197093946  
-1.068141282  
-0.8756147385  
-0.6428928189  
-0.396987063  
-0.1655223022  
0.02628520434  
0.1582822172  
0.2173439808  
0.198437477  
0.1046828913  
-0.05353643238  
-0.2602605604  
-0.4961731118  
-0.7410327098  
-0.976006786  
-1.185593112  
-1.358914963  
-1.490270789  
-1.578917673  
-1.628189654  
-1.64413692  
-1.633930378  
-1.604304576  
-1.560276795  
-1.504347349  
-1.436290898  
-1.353543941  
-1.252113667  
-1.127842133  
-0.9777847303  
-0.801482784  
-0.6018808501  
-0.3857208778  
-0.1633213588  
0.0522608991  
0.2465843221  
0.4055062729  
0.5169628931  
0.5725831116  
0.5689033571  
0.5080061886  
0.3974903545  
0.249763092  
0.08077292711  
-0.09167387288  
-0.2497610399  
-0.377466068  
-0.462087399  
-0.4953375272  
-0.4738970413  
-0.3994107095  
-0.2779705726  
-0.1191993955  
0.0649243642  
0.2613274366  
0.4570443563  
0.6402276285  
0.8008804229  
0.9312809889  
1.026111606  
1.082344865  
1.098967788  
1.076648103  
1.017408232  
0.9243981967  
0.8017809732  
0.6547308829  
0.4895177421  
0.3135854943  
0.1355640448  
-0.03486919077  
-0.187347112  
-0.3114051351  
-0.3972920668  
-0.4369364728  
-0.4249652389  
-0.3596235908  
-0.2434692448  
-0.08368374368  
0.1080924144  
0.3164610634  
0.5234813855  
0.7103245482  
0.8592059983  
0.9553891684  
0.9890221199  
0.9565629361  
0.8615813471  
0.7147753849  
0.5331463971  
0.3383581597  
0.1544303059  
0.005005492448  
-0.0894931926  
-0.1144558406  
-0.06309037768  
0.06245745879  
0.2510497445  
0.4836277443  
0.7353029952  
0.9782322821  
1.184915866  
1.331485808  
1.400542222  
1.383163913  
1.279810301  
1.100008294  
0.8608808996  
0.5847551826  
0.2961969517  
0.01891435434  
-0.2270308846  
-0.4273319408  
-0.5746122348  
-0.6685584308  
-0.7150859217  
-0.7247362172  
-0.7106182702  
-0.6862493387  
-0.6636297378  
-0.6518160243  
-0.6561538954  
-0.6782049061  
-0.7162704845  
-0.7663518545  
-0.8233001899  
-0.8819337307  
-0.9379190667  
-0.9882835573  
-1.031523208  
-1.067339875  
-1.09611633  
-1.118282677  
-1.133735301  
-1.141435533  
-1.139290738  
-1.124335365  
-1.09318267  
-1.042660495  
-0.9704981915  
-0.8759446398  
-0.760185162  
-0.6264820418  
-0.4799994497  
-0.3273280024  
-0.1757802634  
-0.03255914835  
0.09608153519  
0.2055596061  
0.2934712026  
0.3598091295  
0.4068779144  
0.4389119405  
0.461465336  
0.4806522802  
0.5023427359  
0.5314157263  
0.5711528073  
0.6228468213  
0.6856424123  
0.7566371263  
0.8311896935  
0.903415428  
0.9667946486  
1.014823682  
1.041660778  
1.042687533  
1.014955386  
0.9574674833  
0.8712921783  
0.7594810729  
0.62681536  
0.479397924  
0.3241299215  
0.1681176998  
