29.54245405  
34.8474144  
44.50362655  
61.00258153  
280.9043989  
866.0409752  
11019.9668  
50219.50868  
479.1719712  
22454.70369  
25565.03833  
20800.92985  
13482.46038  
7234.686634  
12014.94557  
7596.193801  
10666.05759  
6971.699904  
33449.92937  
6870.267307  
21336.19169  
6670.595654  
4918.643411  
26264.08787  
37034.91915  
7070.47524  
2325.938616  
2128.907017  
5296.625965  
39769.14018  
106.4467154  
11138.63218  
1754.748949  
4750.805538  
1684.097686  
589.6736948  
13503.35998  
23012.70139  
7356.501  
2629.613927  
460.5289842  
11915.22916  
210.8907444  
1610.837903  
5.955586728  
1148.63212  
1988.881967  
1454.487362  
271.4151963  
3490.047466  
30.77438139  
4301.806469  
4066.382346  
767.0458964  
373.9442871  
1602.933436  
312.1662861  
398.9778348  
929.1296677  
583.3393417  
1192.896867  
264.6688325  
167.4169293  
103.3908126  
52.16782184  
152.6045339  
105.6499825  
46.88953439  
36.72256625  
12.06541408  
1.836959865  
10.44845043  
0.4386359006  
2.536547164  
2.052183224  
2.96804415  
0.01754288827  
0.7201376676  
0.02563086834  
0.4473562471  
0.4785954543  
0.280461437  
0.2516712839  
0.1090135645  
0.130013792  
0.2690218221  
0.1579168828  
0.1586976289  
0.1297320594  
0.2100517573  
0.1541951868  
0.1367722765  
0.1557466909  
0.1427080628  
0.1314125487  
0.1368295818  
0.131449236  
0.1359619844  
0.1262777727  
0.1229580492  
0.1217566569  
0.1195489935  
0.1172611408  
0.1105438197  
0.1098897518  
0.1087185184  
0.1039291197  
0.1037216566  
0.100954057  
0.09927008627  
0.09677996752  
0.09426074135  
0.09376640764  
0.09157703436  
0.0899782851  
0.08798908646  
0.08628026939  
0.08509970846  
0.08327916517  
0.08200844162  
0.08066201254  
0.07926297732  
0.07793837595  
0.07663737843  
0.07541088946  
0.07417399039  
0.07299446588  
0.07185624176  
0.0707297981  
0.06964430168  
0.06858903112  
0.06753677054  
0.06654259011  
0.06554891887  
0.06458527371  
0.06366506451  
0.06275196509  
0.06185491174  
0.06098963031  
0.0601377441  
0.05931598969  
0.05849356645  
0.0577035783  
0.05692565564  
0.05617504078  
0.05543440842  
0.05470928684  
0.05400248379  
0.05330719942  
0.05263032509  
0.05196638485  
0.05131422455  
0.05067968609  
0.05005619816  
0.04944485349  
0.04884861689  
0.04826167614  
0.04769092742  
0.04712750627  
0.04657323412  
0.04603396778  
0.04550393522  
0.04498354288  
0.04447725356  
0.04397543738  
0.04348352815  
0.04300056967  
0.04253100794  
0.04206502144  
0.04161268785  
0.04116448667  
0.04072484721  
0.04029583065  
0.03987237035  
0.03945659279  
0.03904755439  
0.0386488164  
0.03825401872  
0.03786676335  
0.03749089494  
0.03711279994  
0.03674730813  
0.03638535781  
0.03603353166  
0.03568197187  
0.03534110693  
0.03499982692  
0.03466811553  
0.03434363467  
0.03402214379  
0.03370856744  
0.0333959261  
0.03309126315  
0.03278947658  
0.0324916581  
0.03220251313  
0.03191776504  
0.03163468917  
0.03135715974  
0.03108296857  
0.03081169092  
0.03054903915  
0.03028707962  
0.03003024961  
0.02977675125  
0.02952647366  
0.02928246297  
0.02903907778  
0.02880230569  
0.02856760626  
0.02833703092  
0.02810901332  
0.02788431302  
0.02766185587  
0.02744568511  
0.02722840011  
0.02701758463  
0.02680939447  
0.02660554572  
0.02639967456  
0.02619912657  
0.02600258941  
0.02580761074  
0.02561719201  
0.02542815897  
0.02524340621  
0.0250577551  
0.02487574281  
0.02469793625  
0.02451759162  
0.02434310531  
0.02417329457  
0.02400599827  
0.02383672666  
0.02367243461  
0.02351038518  
0.02335128508  
0.02319125049  
0.0230349823  
0.02288094734  
0.02272836143  
0.02257961476  
0.02242761662  
0.02228185379  
0.0221378508  
0.02199688019  
0.02185552815  
0.02171594197  
0.02157872411  
0.02144343131  
0.021308757  
0.02117745684  
0.02104661898  
0.02091729385  
0.02078974557  
0.02066239084  
0.02054056911  
0.02041601938  
0.02029608178  
0.02017546531  
0.02005802155  
0.01994161145  
0.01982583922  
0.01971278583  
0.01960094167  
0.01948649216  
0.01938043963  
0.01927145551  
0.01916587803  
0.01905698992  
0.01895282298  
0.01884827114  
0.01874874984  
0.01864493441  
0.01854573865  
0.01844846978  
0.01835030613  
0.01825567781  
0.0181590038  
0.018063079  
0.01797189736  
0.01788036728  
0.01778922533  
0.01769936186  
0.01761177684  
0.01752110049  
0.0174374848  
0.01735044089  
0.01726516571  
0.0171824208  
0.0171016468  
0.01701763249  
0.01693814362  
0.01685753866  
0.01677712369  
0.01669864544  
0.01662188822  
0.01654653002  
0.01647025098  
0.01639607058  
0.016321837  
0.01624905902  
0.01617654406  
0.0161037085  
0.0160325901  
0.01596505867  
0.01589486205  
0.01582737506  
0.01575811719  
0.01569239491  
0.0156277206  
0.01556008966  
0.01549577372  
0.01543389294  
0.01537094046  
0.01530816578  
0.01524583556  
0.0151848091  
0.01512353202  
0.01506563159  
0.0150051413  
0.01494607402  
0.01488809828  
0.01483266479  
0.01477588658  
0.01471842779  
0.01466374064  
0.01460846813  
0.01455485881  
0.01450209287  
0.01444974859  
0.0143968117  
0.0143443615  
0.01429444418  
0.0142425463  
0.01419384663  
0.0141426678  
0.01409530421  
0.01404672147  
0.01399733132  
0.01395054032  
0.0139047738  
0.01385819497  
0.01381164323  
0.01376673062  
0.01372274658  
0.01367927236  
0.01363317151  
0.01359038262  
0.01354812578  
0.01350521122  
0.01346364182  
0.01342199029  
0.01338120101  
0.01334009293  
0.01330131192  
0.01326013562  
0.01322178955  
0.01318338863  
0.0131454292  
0.01310729967  
0.01307009442  
0.01303108723  
0.01299516001  
0.0129600015  
0.01292265151  
0.01288945342  
0.01285459991  
0.01281788652  
0.01278624946  
0.01275043704  
0.01271840424  
0.01268517439  
0.0126520838  
0.01262059056  
0.01258857988  
0.01255706596  
0.01252502767  
0.01249429469  
0.01246542529  
0.01243429689  
0.01240582869  
0.0123772845  
0.01234538034  
0.01231952027  
0.01228925511  
0.01226197392  
0.01223490867  
0.01220763429  
0.01218060634  
0.01215552823  
0.01212911349  
0.01210170556  
0.01207742884  
0.01205258842  
0.01202781824  
0.01200098674  
0.01197634236  
0.01195472391  
0.01192969967  
0.01190679125  
0.01188238523  
0.01186055548  
0.01183950117  
0.01181769791  
0.01179480041  
0.01177402871  
0.01175110347  
0.01173140656  
0.01170985197  
0.01169097097  
0.01167102135  
0.0116505275  
0.01163083637  
0.01161272978  
0.01159399941  
0.0115750591  
0.01155628011  
0.01153762351  
0.01152125456  
0.01150299248  
0.01148715567  
0.01146938626  
0.01145223684  
0.01143733655  
0.0114194264  
0.01140489925  
0.01138861862  
0.01137251441  
0.01135997314  
0.01134326009  
0.01132705848  
0.01131488975  
0.01130051508  
0.01128654266  
0.01127292899  
0.01125982377  
0.01124721741  
0.01123363291  
0.01122130162  
0.01120905627  
0.01119705338  
0.01118465933  
0.01117400345  
0.0111627828  
0.01115150459  
0.01114102794  
0.01113155585  
0.01111947811  
0.01110982585  
0.01109964613  
0.01108966381  
0.01108150384  
0.01107175399  
0.01106291559  
0.01105427314  
0.01104459373  
0.0110362598  
0.01102869552  
0.01102170435  
0.01101288118  
0.01100621408  
0.01099982976  
0.0109917923  
0.01098624186  
0.01097902297  
0.01097380022  
0.01096787898  
0.01096310637  
0.01095643632  
0.01095112076  
0.01094654507  
0.01094037233  
0.01093631857  
0.01093149723  
0.01092887402  
0.01092513347  
0.0109207032  
0.01091826315  
0.0109148938  
0.01091113133  
0.01090987127  
0.01090660138  
0.01090516141  
0.01090207034  
0.01089954326  
0.01089789709  
0.01089688052  
0.0108968294  
0.01089482761  
0.01089378195  
0.01089286768  
0.01089192449  
0.01089282036  
