397.1760641  
435.6306487  
515.3595876  
716.4980627  
1884.580386  
12964.54792  
115940.0008  
126.4828859  
12.21125668  
107866.0419  
2978.603761  
5383.170604  
30578.47671  
22748.18935  
26971.57247  
1103.029918  
5630.357364  
6840.804141  
4302.500848  
6897.81488  
13692.66548  
11514.9493  
2135.254371  
7810.922429  
7416.404674  
5202.990307  
4646.613325  
2606.71716  
5342.195944  
9663.193995  
1759.947976  
10916.23345  
1023.553293  
2847.603427  
2425.690575  
1965.58644  
2264.860545  
3537.12498  
4336.209539  
3742.554052  
4420.893637  
1862.806436  
3301.751741  
1361.355842  
405.6272063  
4532.138308  
14.25691954  
717.7388177  
620.3854974  
1056.868221  
605.4323307  
2374.393131  
2693.674099  
564.7683875  
71.09461633  
176.6430065  
517.5614869  
4.951454282  
7.349179362  
685.4697629  
108.5094538  
1091.942449  
186.3371511  
419.3759529  
272.9991763  
66.44683366  
30.81200284  
35.4173674  
3.092233023  
23.35116398  
30.2243208  
30.60853685  
4.432621166  
14.57632516  
4.558808803  
9.690813757  
1.731936976  
12.09467458  
2.770231908  
3.920961308  
4.710444191  
2.231903858  
3.404665335  
2.424547708  
2.593511045  
3.051228254  
2.412007626  
2.363539512  
2.261193483  
2.596990576  
1.95407949  
2.074135838  
1.807977488  
1.823852477  
1.68684258  
1.538559067  
1.550886968  
1.413645839  
1.388938202  
1.306070806  
1.279135882  
1.206842238  
1.153958721  
1.104970523  
1.053846334  
1.010183924  
0.9675222009  
0.9229628397  
0.8869047347  
0.8507133737  
0.8141441868  
0.781845169  
0.7558643718  
0.7224483214  
0.6984476412  
0.6706573888  
0.6456031402  
0.6232073424  
0.6000324169  
0.5774294339  
0.5577503215  
0.5379145301  
0.5199068805  
0.5017567051  
0.4847191472  
0.4686738536  
0.4534672902  
0.4383753037  
0.4242568502  
0.4108852736  
0.3977350739  
0.3852293089  
0.3732339961  
0.361785428  
0.35081855  
0.3401967976  
0.3300659139  
0.3203478189  
0.3109326888  
0.3019413769  
0.2932652348  
0.2849968823  
0.276943769  
0.2692208419  
0.2617567942  
0.2545831094  
0.2476766523  
0.241015036  
0.2345802773  
0.2283745537  
0.222401448  
0.2166064774  
0.2110456755  
0.2056418894  
0.2004439052  
0.1954072221  
0.1905310042  
0.1858449666  
0.1812868559  
0.1768865306  
0.1726269328  
0.168497413  
0.1645037495  
0.1606399766  
0.1568875199  
0.153268001  
0.149748605  
0.1463363362  
0.1430331984  
0.1398206932  
0.1367154597  
0.1336947888  
0.1307723677  
0.1279211788  
0.1251732356  
0.1224830731  
0.1198879962  
0.1173569425  
0.114908789  
0.1125140923  
0.1101973867  
0.107933012  
0.1057527811  
0.1036184757  
0.1015440259  
0.09952613274  
0.09755432687  
0.09564700207  
0.09379507704  
0.09197401239  
0.09022027927  
0.08850841249  
0.08682745433  
0.08519569695  
0.08361360989  
0.08206686695  
0.08055545073  
0.07908498843  
0.07766232793  
0.07625811743  
0.07489261984  
0.07356647561  
0.07227126975  
0.07100972841  
0.06977493905  
0.06856565112  
0.06738930554  
0.06624875744  
0.06512556754  
0.06403151012  
0.06296197029  
0.06192299341  
0.06090421582  
0.05989957669  
0.05892745274  
0.05798348002  
0.05705314827  
0.05614855657  
0.05525661065  
0.05438915009  
0.05353952058  
0.05270745311  
0.0518994682  
0.05110817036  
0.05033121947  
0.04956943364  
0.04882722868  
0.04810198273  
0.04739075743  
0.04669191794  
0.04600888321  
0.04533795976  
0.04469193206  
0.04405159928  
0.0434224786  
0.04280771211  
0.04220680624  
0.04161736883  
0.04103877172  
0.04047449057  
0.0399184816  
0.03937732517  
0.03885122926  
0.03832639188  
0.0378167933  
0.03731875018  
0.03682803665  
0.03634760143  
0.03587318923  
0.03540292294  
0.03495186734  
0.03451000968  
0.03406930539  
0.03364210853  
0.03322199864  
0.03280749207  
0.03240374747  
0.03200693519  
0.03161435578  
0.03123234082  
0.0308609023  
0.0304923526  
0.03012586715  
0.02977222129  
0.02942539611  
0.02907975473  
0.02874446068  
0.02841422689  
0.0280902532  
0.02776905677  
0.02745521954  
0.02715011464  
0.02684978449  
0.02655307886  
0.0262606316  
0.02597421752  
0.02569392736  
0.02541491033  
0.02514194847  
0.02487720888  
0.02461482494  
0.02435435431  
0.02410039163  
0.02385163473  
0.02360675492  
0.0233663884  
0.02313024831  
0.02289463948  
0.02266539086  
0.02243751483  
0.02221839018  
0.0220011136  
0.0217846107  
0.02157547135  
0.02136532497  
0.0211609252  
0.02096207005  
0.02076042738  
0.02056682931  
0.02037643975  
0.02018926466  
0.02000485577  
0.01982037508  
0.01964112197  
0.01946552831  
0.01928955807  
0.01911937072  
0.01895205079  
0.01878418423  
0.01862439014  
0.0184605708  
0.01830064719  
0.01814753761  
0.01799541784  
0.01784295513  
0.01769225536  
0.01755134973  
0.0174035535  
0.01726085641  
0.01712165846  
0.01698104257  
0.01684948681  
0.01671508818  
0.01658086934  
0.0164502666  
0.01632292167  
0.01620079348  
0.01607381476  
0.01595652081  
0.01583384073  
0.01571418869  
0.01559838717  
0.01548001246  
0.01536956204  
0.01525719491  
0.01514663904  
0.01504013117  
0.01493328953  
0.01482618471  
0.01472442923  
0.01462153609  
0.01452352039  
0.01442222013  
0.01432429066  
0.01422629044  
0.01413263855  
0.01404021884  
0.0139446163  
0.01385426163  
0.01376474797  
0.01367727556  
0.0135884767  
0.01350290477  
0.01342154204  
0.01333624282  
0.01325447615  
0.01317202156  
0.0130923091  
0.01301533294  
0.01293484485  
0.01285931607  
0.01278520257  
0.01271063742  
0.0126374685  
0.01256569859  
0.01249573014  
0.01242221611  
0.01235524243  
0.0122865267  
0.012220238  
0.01215583559  
0.01208772812  
0.01202463483  
0.01196046987  
0.0118981453  
0.01183311069  
0.0117763391  
0.01171612859  
0.0116569554  
0.01159820368  
0.01153924117  
0.01148503834  
0.01143108605  
0.01137454191  
0.01132013726  
0.0112674318  
0.01121550172  
0.01116441334  
0.01111238826  
0.01106401833  
0.01101161995  
0.01096296199  
0.01091570901  
0.0108689313  
0.01082034272  
0.01077739248  
0.01073016678  
0.01068562211  
0.01064101279  
0.01059921375  
0.01055822601  
0.01051564228  
0.01047576474  
0.0104337125  
0.01039365967  
0.01035660614  
0.01031420545  
0.01027621681  
0.01023893418  
0.01020398888  
0.01016598382  
0.01013007584  
0.0100972703  
0.01006270218  
0.0100259052  
0.009994367579  
0.00996267237  
0.009928077423  
0.00989563062  
0.009863920246  
0.00983219758  
0.009805623941  
0.009775330302  
0.009742658656  
0.009715805469  
0.00968907448  
0.009659650936  
0.009632951403  
0.009607014755  
0.00958026185  
0.009555066052  
0.009528760383  
0.00950587422  
0.009482457553  
0.00945773221  
0.009433855889  
0.009410462202  
0.00938994982  
0.00936829703  
0.009345726383  
0.009326824464  
0.009303909622  
0.009282589999  
0.009264588293  
0.009244395145  
0.009226680901  
0.00920597603  
0.009187780483  
0.009170186858  
0.009154574047  
0.009138602946  
0.009120578323  
0.009107142627  
0.009090130783  
0.009077131543  
0.009060453342  
0.009047283746  
0.009033125423  
0.009021744797  
0.00900582239  
0.008993991637  
0.008981947154  
0.00896853421  
0.008958625355  
0.008947585824  
0.008935887799  
0.008927256019  
0.008916249807  
0.008905905069  
0.008897745014  
0.008889524722  
0.008879790643  
0.0088738181  
0.008862693672  
0.008854783256  
0.008850318231  
0.008843904827  
0.008838808403  
0.008831986489  
0.008828381213  
0.008823607996  
0.008818240566  
0.008812739642  
0.008807910918  
0.008806059893  
0.008805515199  
0.008801406137  
0.008797852933  
0.008795422674  
0.008794465663  
0.008791953789  
0.008789681682  
0.008792039374  
0.008790140274  
