77.80133635  
88.03389063  
110.3222023  
159.7321631  
247.1903711  
2493.186787  
34372.75495  
28229.10317  
7909.380248  
9241.291064  
15046.33364  
26747.65314  
7691.61493  
11355.73911  
19931.78132  
15372.02273  
180.5389592  
13892.54919  
31358.79996  
17514.69539  
2755.017747  
2045.690271  
11504.75036  
306.4792739  
1862.217539  
6806.41045  
23461.19055  
4706.60565  
12632.17062  
840.9809366  
9869.403232  
125.2532101  
1518.133265  
5561.605923  
8349.644181  
12282.15809  
6130.612033  
10343.5556  
1852.610129  
9469.521254  
3275.14531  
3817.234251  
4220.541689  
14798.72393  
845.2033767  
9744.893518  
11039.25129  
7455.501281  
55.2637354  
473.8165719  
10224.49919  
8506.742766  
3507.647157  
4788.341165  
12535.34402  
8333.040572  
79.80510008  
568.929162  
1961.726712  
548.3197541  
757.3068143  
1648.529048  
2101.574335  
92.4110606  
608.101578  
99.9920915  
576.7365154  
139.1067575  
61.58621633  
45.80346402  
101.489376  
3.87192233  
16.39858258  
39.2409016  
16.22871307  
3.970574669  
4.56869608  
0.4990807556  
2.338414992  
6.450586634  
1.169320958  
1.020879388  
1.500943091  
2.84621282  
1.092382348  
1.31010328  
0.8245381268  
0.8502127675  
0.6140712429  
1.029998681  
0.9604489691  
0.4824743672  
0.6130985867  
0.6881373554  
0.5231347711  
0.4393484092  
0.5419766802  
0.4252703676  
0.443179516  
0.417536042  
0.3838763732  
0.3443624802  
0.3386818574  
0.3197560317  
0.3095660671  
0.2924384987  
0.2723407101  
0.2628535086  
0.2505995881  
0.2386283157  
0.2260836873  
0.2168660124  
0.206805793  
0.1982484566  
0.1874155269  
0.1816069499  
0.1718362936  
0.1647924077  
0.1582794558  
0.1521265708  
0.1445938822  
0.1393647079  
0.1340848415  
0.1283492024  
0.1233392402  
0.1186522606  
0.1140280611  
0.1095527572  
0.1057279033  
0.1016097771  
0.09795656809  
0.09419679457  
0.09095241393  
0.08760802662  
0.08452968227  
0.08153346582  
0.07872978589  
0.07597861007  
0.07339074934  
0.07089466937  
0.06849352067  
0.06624628029  
0.06403303311  
0.06195070159  
0.0599334437  
0.05800585045  
0.05613568204  
0.05437722793  
0.0526544676  
0.05101015428  
0.04943439249  
0.04791737546  
0.04645184913  
0.04504362377  
0.04369307286  
0.04238826425  
0.04113408385  
0.03992288609  
0.03875925219  
0.03763349509  
0.03654992293  
0.03550634409  
0.03449628843  
0.03352354552  
0.03258484495  
0.03167580294  
0.03079969054  
0.02995438489  
0.02913613857  
0.02834299851  
0.02757832732  
0.02683879677  
0.02612477711  
0.0254318754  
0.0247607658  
0.0241135967  
0.02348774135  
0.02287724038  
0.02228865265  
0.02171793418  
0.02116619328  
0.0206313927  
0.02011058122  
0.01960816292  
0.01912043657  
0.01864509918  
0.0181857239  
0.01773960754  
0.01730786827  
0.01688729019  
0.01647933133  
0.01608291301  
0.01570065487  
0.01532636896  
0.01496386328  
0.01461067661  
0.01426865411  
0.01393481129  
0.01361134034  
0.01329611196  
0.01298978304  
0.01269243279  
0.01240253962  
0.01212076734  
0.01184710261  
0.01157948902  
0.01131968753  
0.01106659315  
0.01082062798  
0.01058116303  
0.01034721473  
0.01012033272  
0.009898443819  
0.009682772737  
0.009472789621  
0.009267449676  
0.009067486149  
0.008872873733  
0.008684293155  
0.008497931541  
0.008317884895  
0.008141623174  
0.007970483288  
0.00780262606  
0.007639523757  
0.007479734792  
0.007324420564  
0.007172710477  
0.007023933741  
0.006880458495  
0.006739145054  
0.006600899343  
0.006465923122  
0.006334495473  
0.006205964657  
0.006080935155  
0.005958156107  
0.005838450748  
0.00572165907  
0.005606654857  
0.005495905921  
0.005385762601  
0.005279238476  
0.005174749747  
0.005073346149  
0.004973291455  
0.004875831257  
0.004780333053  
0.004687651634  
0.004596234409  
0.004506978768  
0.004419128286  
0.004334041538  
0.004250164606  
0.004168552714  
0.004088948371  
0.004010997195  
0.003934007545  
0.003858528406  
0.003785952494  
0.00371338993  
0.00364324914  
0.003574265526  
0.003507476353  
0.00344028906  
0.003375374726  
0.003312804155  
0.00325060652  
0.003188990832  
0.003130242958  
0.003071620741  
0.003014633043  
0.002958339638  
0.002903423234  
0.002849892731  
0.002796747725  
0.002745148019  
0.002694250625  
0.002644262396  
0.002596463262  
0.002547994852  
0.002501705414  
0.002455604341  
0.002410636892  
0.002366261068  
0.002322934208  
0.002280477398  
0.002238860695  
0.002198099172  
0.002157505099  
0.002118646249  
0.002080111078  
0.002042284521  
0.002004916332  
0.001968499354  
0.001932878383  
0.001897507821  
0.001863386971  
0.001829286701  
0.001796120299  
0.001763623587  
0.001731745666  
0.001700388368  
0.001669374316  
0.001638834047  
0.001610226505  
0.001580176951  
0.001551690105  
0.00152367772  
0.00149618618  
0.001468848002  
0.001442509656  
0.001416041921  
0.001390415259  
0.001365186778  
0.001340728873  
0.00131622368  
0.001292329891  
0.001268820155  
0.001245488013  
0.001223002814  
0.001200666239  
0.001179021612  
0.001157198433  
0.001136152063  
0.00111558717  
0.00109518081  
0.001075206541  
0.001055371444  
0.00103625198  
0.001017029863  
0.0009986299199  
0.0009801289743  
0.000961946649  
0.0009441026433  
0.0009267765249  
0.0009093858498  
0.0008925635002  
0.0008759834845  
0.0008598298261  
0.0008435001842  
0.0008277612603  
0.0008124821909  
0.0007972633547  
0.0007824066737  
0.0007673517116  
0.0007528209606  
0.0007387210973  
0.0007246709024  
0.0007111679665  
0.0006973933569  
0.0006841555172  
0.000671068383  
0.0006581275975  
0.000645581482  
0.0006330654602  
0.0006205285256  
0.0006087236055  
0.0005967610753  
0.0005851803495  
0.0005738061756  
0.0005623296078  
0.0005513196561  
0.0005404064367  
0.0005298653193  
0.0005193502301  
0.000508796819  
0.0004986694955  
0.0004887133837  
0.0004785827946  
0.0004691367289  
0.0004595341224  
0.0004499252995  
0.0004407186546  
0.0004317142377  
0.0004226751967  
0.000414012884  
0.0004051795503  
0.0003966691975  
0.0003884572273  
0.0003801785771  
0.0003719976702  
0.0003640785362  
0.0003564719995  
0.0003484442727  
0.0003409836291  
0.0003335414634  
0.0003261196118  
0.0003191308838  
0.0003118152283  
0.0003050667814  
0.0002981280881  
0.0002913745811  
0.0002844892419  
0.0002780895614  
0.0002717038715  
0.0002655133946  
0.000259164021  
0.0002532442025  
0.000247148183  
0.0002412325911  
0.0002354698382  
0.0002296703647  
0.0002241790493  
0.0002187428207  
0.0002133937102  
0.0002080969449  
0.0002027961553  
0.0001977035248  
0.0001926145899  
0.0001877268668  
0.0001828381897  
0.0001779643626  
0.0001733609092  
0.0001688069522  
0.0001643242189  
0.0001597606379  
0.0001553947874  
0.0001511248707  
0.0001469389528  
0.0001428014634  
0.00013879619  
0.000134749942  
0.0001308253605  
0.0001270899598  
0.0001232723997  
0.0001196507136  
0.0001160588431  
0.0001124146557  
0.0001090012229  
0.0001056264577  
0.0001022500601  
9.89562288e-05  
9.584242719e-05  
9.26735264e-05  
8.961433443e-05  
8.655784712e-05  
8.366135907e-05  
8.084366393e-05  
7.796820299e-05  
7.516645427e-05  
7.261609967e-05  
6.980786862e-05  
6.728660565e-05  
6.486255597e-05  
6.231524458e-05  
5.997305771e-05  
5.766392173e-05  
5.531912799e-05  
5.307599209e-05  
5.09705377e-05  
4.890346624e-05  
4.683236169e-05  
4.479770311e-05  
4.283935375e-05  
4.095991284e-05  
3.906672242e-05  
3.733056585e-05  
3.556321808e-05  
3.391579068e-05  
3.233701391e-05  
3.077957176e-05  
2.923876809e-05  
2.774969694e-05  
2.635742938e-05  
2.497533043e-05  
2.370405535e-05  
2.239822146e-05  
2.120665565e-05  
2.002358041e-05  
1.889678402e-05  
1.784039423e-05  
1.679158183e-05  
1.581700845e-05  
1.493205255e-05  
1.401393216e-05  
1.325322239e-05  
1.247822465e-05  
1.173235398e-05  
1.104227892e-05  
1.040471061e-05  
9.816270715e-06  
9.279518624e-06  
8.815779723e-06  
8.375023098e-06  
7.979078156e-06  
7.606501082e-06  
7.312193499e-06  
7.052913439e-06  
6.83205098e-06  
6.684339841e-06  
6.554002457e-06  
6.49406583e-06  
6.457182045e-06  
