-0.0125020582  
-0.07121405892  
-0.1305307979  
-0.1897711135  
-0.2476958265  
-0.3023553596  
-0.351067468  
-0.3905462483  
-0.4171841889  
-0.4274624638  
-0.4184392565  
-0.3882516876  
-0.3365549926  
-0.2648239097  
-0.1764522674  
-0.0766161878  
0.02811094505  
0.1303596365  
0.2227207691  
0.2985654635  
0.3528237032  
0.3826100318  
0.3876106042  
0.370157075  
0.3349755471  
0.2886203266  
0.2386673429  
0.1927619357  
0.1576491635  
0.1383168568  
0.1373676313  
0.1547044067  
0.187582071  
0.2310063803  
0.2784361629  
0.3226800444  
0.3568709245  
0.3753765898  
0.3745212052  
0.3530244273  
0.3121033785  
0.2552265463  
0.1875751274  
0.1152878491  
0.04460860628  
-0.01893848954  
-0.07123331351  
-0.1100125265  
-0.1350324833  
-0.1479334595  
-0.1518371824  
-0.1507436962  
-0.1488222164  
-0.149702091  
-0.1558648473  
-0.1682237088  
-0.1859533853  
-0.2065854073  
-0.2263628574  
-0.2407964893  
-0.2453537574  
-0.2361721775  
-0.2107085334  
-0.1682203334  
-0.1100160817  
-0.03943007471  
0.03847332499  
0.1174401078  
0.1907288922  
0.2518941698  
0.2955416616  
0.3179556825  
0.3175172957  
0.2948656331  
0.2527767456  
0.1957866697  
0.129612933  
0.0604521722  
-0.005751383416  
-0.06397054581  
-0.1106118886  
-0.1438298534  
-0.1636018296  
-0.1715734812  
-0.170708123  
-0.1647920959  
-0.1578735704  
-0.153706551  
-0.1552684181  
-0.1644059929  
-0.1816412557  
-0.2061441369  
-0.2358621817  
-0.2677765463  
-0.2982409293  
-0.3233609104  
-0.3393722747  
-0.342980171  
-0.3316398423  
-0.3037643645  
-0.2588583233  
-0.1975762241  
-0.1217164402  
-0.03415024522  
0.06131102171  
0.1601110282  
0.2572060436  
0.3473850619  
0.4256400269  
0.4875694396  
0.5297821878  
0.5502621449  
0.5486462098  
0.5263707515  
0.4866460971  
0.4342413567  
0.3750816131  
0.3156840362  
0.2624908806  
0.2211715308  
0.1959854123  
0.1892848089  
0.2012317828  
0.2297761085  
0.270904808  
0.319133719  
0.3681800272  
0.4117302694  
0.4441887912  
0.461314865  
0.4606532277  
0.4417123637  
0.4058691979  
0.3560372944  
0.2961543945  
0.2305851194  
0.1635368409  
0.09857812128  
0.03832461173  
-0.01566859164  
-0.0628209903  
-0.103280721  
-0.1375911521  
-0.1663463926  
-0.1899155765  
-0.2082905558  
-0.2210932745  
-0.2277405821  
-0.2277280859  
-0.2209774056  
-0.208171065  
-0.190994543  
-0.1722256247  
-0.1556309085  
-0.145657174  
-0.1469509557  
-0.1637598494  
-0.1993030436  
-0.255206527  
-0.3310893135  
-0.4243848994  
-0.5304346205  
-0.6428537751  
-0.7541371993  
-0.8564165696  
-0.9422638876  
-1.005428963  
-1.041394315  
-1.047678279  
-1.023842635  
-0.971227069  
-0.8924647042  
-0.7908897496  
-0.6699495935  
-0.5327434431  
-0.3817835962  
-0.2190316206  
-0.04620542525  
0.134696219  
0.3207568939  
0.5075367867  
0.6886419096  
0.8555992985  
0.9981255224  
1.104816862  
1.164209948  
1.166103149  
1.102956744  
0.9711745996  
0.7720614441  
0.5122835679  
0.2037319141  
-0.1372437436  
-0.4911517231  
-0.8370939495  
-1.15469116  
-1.425972072  
-1.636978101  
-1.778886879  
-1.848515585  
-1.848160683  
-1.784807373  
-1.668839828  
-1.512438703  
-1.327902098  
-1.126119356  
-0.9154127466  
-0.7008959501  
-0.4844277191  
-0.2651468041  
-0.04048908157  
0.1924804506  
0.4356447352  
0.6885509893  
0.9474858819  
1.205077886  
1.450519242  
1.670407019  
1.850115112  
1.975521976  
2.034864296  
2.020462866  
1.930076254  
1.767684236  
1.543583248  
1.273755893  
0.9785824283  
0.6810357275  
0.4045680155  
0.1709261216  
-0.001865251981  
-0.1011423027  
-0.1207031502  
-0.06128184617  
0.06963064417  
0.2585720984  
0.487409109  
0.735005823  
0.9791106371  
1.198283228  
1.373704178  
1.490707965  
1.53992089  
1.517897219  
1.427198179  
1.275901964  
1.076575953  
0.8448152885  
0.5974868091  
0.3508735185  
0.1189364685  
-0.08808940666  
-0.2645800531  
-0.4097580084  
-0.5272404373  
-0.6239574245  
-0.7085882691  
-0.7897564781  
-0.8742585387  
-0.9656105835  
-1.063153187  
-1.16187054  
-1.252972198  
-1.325160555  
-1.366396792  
-1.365899117  
-1.316064116  
-1.214014555  
-1.062532752  
-0.8702318788  
-0.6509345638  
-0.4223377057  
-0.2041503114  
-0.01595236592  
0.1249435684  
0.2053582958  
0.2176196129  
0.1602963091  
0.03823042837  
-0.1380971114  
-0.3537659452  
-0.5910119391  
-0.8310165385  
-1.055685918  
-1.249220817  
-1.399322361  
-1.497929965  
-1.54145012  
-1.530500384  
-1.469249562  
-1.364482573  
-1.224542843  
-1.058295689  
-0.8742466799  
-0.6798930701  
-0.4813426336  
-0.2831906764  
-0.08859665264  
0.1005031418  
0.2831217789  
0.4589420908  
0.6280649739  
0.7907949601  
0.9474600999  
1.09824405  
1.243028285  
1.381236114  
1.511691747  
1.632518166  
1.74110312  
1.834155758  
1.907874107  
1.958223673  
1.981307993  
1.973797187  
1.933369231  
1.859100939  
1.751756817  
1.613924687  
1.449965921  
1.265765733  
1.068299617  
0.8650534088  
0.6633573907  
0.4697166046  
0.2892205297  
0.1251084417  
-0.02144472323  
-0.151293254  
-0.2670349296  
-0.3725215105  
-0.4722224141  
-0.5705466245  
-0.6712084134  
-0.7767381891  
-0.8881958608  
-1.005128059  
-1.125760257  
-1.247373291  
-1.366795229  
-1.48090844  
-1.58706951  
-1.683372608  
-1.768700216  
-1.842558459  
-1.904738126  
-1.954877098  
-1.992024559  
-2.014310676  
-2.018810028  
-2.001647575  
-1.958366212  
-1.884499836  
-1.776286706  
-1.63139747  
-1.449564989  
-1.233005032  
-0.9865362081  
-0.7173738893  
-0.4345970463  
-0.1483539351  
0.1310908486  
0.394344433  
0.6337713311  
0.8441531069  
1.023033185  
1.170696665  
1.289780657  
1.384583285  
1.460152803  
1.521302234  
1.571681255  
1.613056484  
1.644907172  
1.664411264  
1.666836053  
1.646298111  
1.596788488  
1.513318978  
1.393029226  
1.236070704  
1.046124303  
0.8304439747  
0.5993837953  
0.365448  
0.1419654731  
-0.0584373102  
-0.2253472421  
-0.3518431244  
-0.4353367783  
-0.4778298999  
-0.4855327116  
-0.4678710765  
-0.4360239073  
-0.401205514  
-0.3729522915  
-0.3576921091  
-0.3578251545  
-0.3714755368  
-0.3929529096  
-0.4138528018  
-0.4246139927  
-0.4162655755  
-0.3820674983  
-0.3187660771  
-0.2272493198  
-0.1124958342  
0.01716154292  
0.1513250642  
0.2791311798  
0.3908783392  
0.479398984  
0.5409386267  
0.5754142704  
0.5860307127  
0.5783633678  
0.5591116778  
0.5347778808  
0.5105519316  
0.489602896  
0.4729220035  
0.459721839  
0.4482856329  
0.4370675596  
0.4257802021  
0.4162089529  
0.4125356325  
0.421051953  
0.4492610004  
0.5044944415  
0.5922691219  
0.7146821034  
0.8691496826  
1.04775654  
1.237394195  
1.420734309  
1.577954495  
1.689002156  
1.736086569  
1.706034583  
1.592167406  
1.395400016  
1.124388256  
0.7946710393  
0.4269222431  
0.04453425435  
-0.3291287962  
-0.6734258008  
-0.9727175509  
-1.217916287  
-1.407110678  
-1.545205869  
-1.642666493  
-1.713567987  
-1.773264308  
-1.836016816  
-1.912911944  
-2.010344945  
-2.129243178  
-2.265087789  
-2.408671161  
-2.547444577  
-2.667222012  
-2.753993045  
-2.795598985  
-2.783067169  
-2.711460447  
-2.580180907  
-2.392736903  
-2.156053254  
-1.879456021  
-1.573499525  
-1.248800081  
-0.9150429728  
-0.5802804405  
-0.250602186  
0.0698101884  
0.3782884834  
0.673035249  
0.9523765421  
1.214061754  
1.45475066  
1.669807946  
1.853455921  
1.999279766  
2.101008463  
2.153442708  
2.153370449  
2.100299471  
1.996876862  
1.848909966  
1.664970203  
1.455639521  
1.232508765  
1.007085959  
0.7897712719  
0.5890436105  
0.4109585143  
0.2589974403  
0.1342528554  
0.03588035067  
-0.03829249086  
-0.09110895866  
-0.1254941511  
-0.1440130578  
-0.1486230521  
-0.1406270687  
-0.1207994599  
-0.08962936429  
-0.04762160589  
0.00441329177  
0.06512871485  
0.1325066375  
0.2038307332  
0.2757606664  
0.3445002646  
0.4060208365  
0.4563218745  
0.4916946807  
0.5089708203  
0.5057293613  
0.4804496284  
0.4326056222  
0.3626897543  
0.2721740869  
0.1634166763  
0.03952318111  
-0.09581981977  
-0.2385244627  
-0.3842820598  
-0.5287383973  
-0.6676574557  
-0.7970700046  
-0.9134152783  
-1.013662007  
-1.095412774  
-1.156969681  
-1.197356976  
-1.216285567  
-1.214045853  
-1.191344625  
-1.149094672  
-1.088185924  
-1.00928246  
-0.9126830566  
-0.7982854747  
-0.6656709483  
-0.5143179612  
-0.3439187398  
-0.1547552354  
0.05192165133  
0.2735791645  
0.5062121978  
0.744323175  
0.9810912741  
1.208725237  
1.418970862  
1.603717501  
1.755641511  
1.868818108  
1.939237172  
1.965161647  
1.947300417  
1.888763093  
1.794796042  
1.672322146  
1.529312485  
1.374052263  
1.214374125  
1.056933609  
0.9066156163  
0.7661435847  
0.6359377534  
0.5142529481  
0.3975771288  
0.2812470666  
0.160208695  
0.02982510197  
-0.1133595404  
-0.2709995971  
-0.4425307496  
-0.6250114791  
-0.8132313894  
-1.000071637  
-1.177076072  
-1.335165547  
-1.465426606  
-1.559889112  
-1.612221524  
-1.61828568  
-1.576505943  
-1.488032888  
-1.356706751  
-1.188832451  
-0.9928071465  
-0.7786363882  
-0.5573797501  
-0.3405657042  
-0.1396042533  
0.03477598999  
0.1730570248  
0.2674054225  
0.3120895956  
0.3038241243  
0.2420271953  
0.1289775413  
-0.03015633212  
-0.2274297681  
-0.452401829  
-0.6925952787  
-0.934131211  
-1.162529558  
-1.363634203  
-1.524609805  
-1.634921104  
-1.687212132  
-1.677975895  
-1.607923323  
-1.481980249  
-1.308877948  
-1.100347566  
-0.8699833075  
-0.6318871831  
-0.399248967  
-0.1830217136  
0.009140023063  
0.1735562208  
0.3107296702  
0.4250777654  
0.5242321025  
0.6180105763  
0.717192475  
0.8322393889  
0.9720931479  
1.143144052  
1.348430435  
1.58709985  
1.854127301  
2.140289681  
2.432393308  
2.713766368  
2.965042632  
3.165258624  
3.293274945  
3.329487121  
3.257740777  
3.067294599  
2.754621024  
2.324789554  
1.792181075  
1.180310808  
0.5206424834  
-0.1496193484  
-0.7906166697  
-1.363510457  
-1.834344275  
-2.177609857  
-2.37904497  
-2.437246196  
-2.363822069  
-2.182007057  
-1.923857582  
-1.62636232  
-1.32696859  
-1.059111329  
-0.8483513806  
-0.7096501572  
-0.6461418908  
-0.6495620463  
-0.7022378244  
-0.780323084  
-0.8577806293  
-0.9105064815  
-0.9199800869  
-0.8759076709  
-0.7774926085  
-0.6331826965  
-0.4589940384  
-0.2757211487  
-0.1055186061  
0.03157877527  
0.1206403823  
0.1538705948  
0.1313977233  
0.06075270218  
-0.04481469367  
-0.1688430016  
-0.2945303163  
-0.4074518741  
-0.4976708766  
-0.5608981044  
-0.5985345322  
-0.6166444064  
-0.62408153  
-0.6301499203  
-0.6422416928  
-0.663898611  
-0.6936509503  
-0.7248405683  
-0.746454786  
-0.7448160759  
-0.7058219803  
-0.617342084  
-0.4713630016  
-0.2655272871  
-0.003833506837  
0.303587753  
0.6415447236  
0.9914904891  
1.333567061  
1.648657271  
1.920146146  
2.135182332  
2.285322521  
2.366584895  
2.379011722  
2.325929035  
2.213096145  
2.047931514  
1.838932781  
1.595335034  
1.326977549  
1.044281771  
0.7582108417  
0.4800891056  
0.221187735  
-0.007944025547  
-0.1983613002  
-0.3437039566  
-0.4411100649  
-0.491882277  
-0.5017410189  
-0.4805503781  
-0.4414733801  
-0.3996055706  
-0.3702159051  
-0.3668053493  
-0.3992205993  
-0.4720918532  
-0.5838181233  
-0.7262798328  
-0.8853621715  
-1.042286386  
-1.175628649  
-1.263834166  
-1.287940484  
-1.234204716  
-1.096298216  
-0.8767831834  
-0.5876340497  
-0.2496742363  
0.1090852644  
0.4560894342  
0.7576080949  
0.9824798895  
1.105791951  
1.112038739  
0.9973433015  
0.770411009  
0.4520404661  
0.07319648975  
-0.3281593872  
-0.7111148454  
-1.036241014  
-1.269863502  
-1.387651432  
-1.377085964  
-1.238538479  
-0.9848666416  
-0.6396343457  
-0.2342318493  
0.1957017286  
0.6140978133  
0.9880523646  
1.290809235  
1.50383473  
1.617841332  
1.632734185  
1.556610232  
1.404007024  
1.193695978  
0.9463101757  
0.6821036307  
0.4190849381  
0.1716995882  
-0.0498501237  
-0.2396469932  
-0.3955514746  
-0.5182992398  
-0.6103969913  
-0.6750435805  
-0.715254704  
-0.7333420696  
-0.7308175564  
-0.7086946902  
-0.6680978824  
-0.6110094777  
-0.5409558902  
-0.4634379184  
-0.385954822  
-0.3175403936  
-0.2678357713  
-0.245807867  
-0.2583189274  
-0.3087932717  
-0.3962360565  
-0.5148176078  
-0.6541541022  
-0.8002962013  
-0.9373231709  
-1.04932257  
-1.122463503  
-1.146849901  
-1.117852534  
-1.036716831  
-0.9103433697  
-0.7502806985  
-0.5710944817  
-0.3883741713  
-0.2166901251  
-0.06781231841  
0.05054686506  
0.1353146417  
0.1879167611  
0.2134883185  
0.2196177187  
0.2148561955  
0.2072491065  
0.2031160477  
0.2062455571  
0.2175907922  
0.2354651434  
0.2561655434  
0.274887402  
0.2867786689  
0.2879581323  
0.2763541388  
0.2522390377  
0.2183840922  
0.1798058501  
0.1431230401  
0.1156058304  
0.1040331692  
0.1135215747  
0.1465003801  
0.2020169752  
0.2755091465  
0.3591387425  
0.4426902666  
0.5149450775  
0.5653590921  
0.5857915734  
0.5720062819  
0.5246770176  
0.4496939757  
0.3576607948  
0.262621148  
0.1801642691  
0.1251926886  
0.1096822824  
0.1407974671  
0.2196593489  
0.3409762602  
0.4935988523  
0.6619246141  
0.8279402594  
0.9735966078  
1.083166427  
1.145249374  
1.154154141  
1.110484318  
1.020879597  
0.8969869607  
0.7538295969  
0.6078194069  
0.4746843192  
0.3675794977  
0.2956002978  
0.2628598084  
0.2682105663  
0.3056030385  
0.3650112929  
0.4337861866  
0.4982622417  
0.5454238214  
0.5644339384  
0.5478560756  
0.4924354107  
0.3993605006  
0.2739827195  
0.1250435123  
-0.03648733369  
-0.1988171454  
-0.3507886781  
-0.4832137028  
-0.5899022598  
-0.6682661614  
-0.7194162086  
-0.7477579122  
-0.7601462036  
-0.7647305632  
-0.7696608037  
-0.7818434742  
-0.8059321019  
-0.8436960719  
-0.8938544876  
-0.9523978056  
-1.013332408  
-1.069731666  
-1.114916287  
-1.143579552  
-1.152671678  
-1.141902027  
-1.113779  
-1.0731856  
-1.026560119  
-0.9808150812  
-0.9421814649  
-0.9151588529  
-0.9017454541  
-0.9010731387  
-0.9094985009  
-0.9211348722  
-0.9287300143  
-0.9247478715  
-0.9024819246  
-0.8570214395  
-0.7859295069  
-0.6895416628  
-0.5708478363  
-0.4350008263  
-0.2885412166  
-0.1384726701  
0.008667188047  
0.147595901  
0.2748330339  
0.3889290975  
0.4903771258  
0.5812272395  
0.6644974348  
0.7434771516  
0.8210337512  
0.8990366405  
0.9779720691  
1.056804023  
1.133087527  
1.203307919  
1.263392176  
1.309303432  
1.337638856  
1.346136044  
1.334020825  
1.302147181  
1.252913536  
1.189959663  
1.117696717  
1.04072396  
0.9632167331  
0.8883706526  
0.8179704796  
0.7521611051  
0.6894421357  
0.626904737  
0.560678682  
0.4865416396  
0.400605019  
0.2999910843  
0.1833990325  
0.05148325103  
-0.09301551533  
-0.2454178499  
-0.3995111408  
-0.5481701709  
-0.6841083655  
-0.8006587105  
-0.8924827879  
-0.9561112568  
-0.9902498856  
-0.9958125825  
-0.9756948639  
-0.9343267663  
-0.8770818661  
-0.8096316628  
-0.7373434996  
-0.6647937682  
-0.5954612131  
-0.5316123298  
-0.4743725827  
