1288.63723  
1394.973293  
1592.019425  
1997.354457  
3584.628469  
14271.70841  
4702.551258  
327.0659503  
2540.194816  
50566.47874  
9911.117474  
1000.734254  
8658.23943  
48707.24078  
1575.266545  
4450.856776  
36011.91985  
973.0841399  
71466.3627  
1928.657449  
1409.112867  
944.403677  
6952.315164  
10363.55571  
19132.00532  
2413.427803  
8755.676624  
17833.36704  
3167.652454  
3186.721643  
2000.759265  
9498.58757  
2331.242589  
460.079283  
1892.0328  
2519.667809  
7486.666423  
17469.11296  
2882.278276  
8945.57456  
4214.592648  
9773.456252  
10073.57739  
469.3741141  
1653.107284  
4275.350038  
1840.718857  
11003.31782  
2723.172285  
4864.012828  
17517.67423  
259.095444  
53.53945076  
294.4381564  
438.5978248  
1194.704839  
890.2966959  
3558.897084  
8787.737785  
243.2157585  
223.4351477  
2713.313895  
1903.87449  
584.9903938  
453.9154319  
234.8897209  
22.20691222  
91.62464964  
18.78922948  
100.5295909  
27.01765235  
57.15214796  
16.73658935  
18.296337  
13.32131922  
42.14571511  
16.93443149  
32.41228989  
24.75419373  
12.13297534  
8.584336354  
11.11578564  
11.1731067  
9.541343648  
8.9742027  
8.413190638  
8.102156704  
5.767911284  
5.495475909  
5.511305546  
6.000495349  
5.325159222  
4.776579823  
4.354058655  
4.01531309  
3.916386743  
3.775204225  
3.377147271  
3.383393224  
3.317752376  
3.103195836  
2.963095527  
2.825864988  
2.700464014  
2.585950462  
2.500790623  
2.401340419  
2.295977658  
2.217787799  
2.112140441  
2.03583452  
1.960008078  
1.889043813  
1.821287111  
1.753322608  
1.689660469  
1.63127382  
1.574958613  
1.524008383  
1.473214355  
1.425792767  
1.37816014  
1.335257517  
1.29313117  
1.253041152  
1.214921872  
1.178447708  
1.143544558  
1.110596422  
1.078671878  
1.047729096  
1.018241777  
0.9899795131  
0.9628800429  
0.9368910322  
0.9119521206  
0.8878647956  
0.8646473562  
0.8424835833  
0.8210635232  
0.800469828  
0.7806468115  
0.7614748643  
0.7430651327  
0.725290878  
0.708107281  
0.6915672909  
0.6756023497  
0.6601332665  
0.6452450571  
0.6308148359  
0.616895962  
0.6034181544  
0.5903841472  
0.5777393946  
0.5655556106  
0.553734361  
0.5422923997  
0.5311670422  
0.5204211859  
0.5099862413  
0.4998708224  
0.4900443434  
0.4805381963  
0.471304535  
0.4623300981  
0.4536185151  
0.4451693135  
0.4369373593  
0.4289583655  
0.421208899  
0.4136558187  
0.4063103343  
0.3991702579  
0.392238976  
0.3854804842  
0.3789060542  
0.3725022907  
0.3662581687  
0.3601927764  
0.3542757345  
0.3485164355  
0.3428868675  
0.3374108607  
0.332078671  
0.3268785711  
0.3218120767  
0.3168590935  
0.3120273519  
0.3073135105  
0.3027121414  
0.2982115596  
0.2938315117  
0.2895517336  
0.285367922  
0.2812863478  
0.2772882619  
0.2733952846  
0.2695788815  
0.2658597284  
0.2622075312  
0.2586482012  
0.255175224  
0.2517637769  
0.2484328502  
0.2451773594  
0.2419776871  
0.2388647925  
0.2358058271  
0.2328233568  
0.2298944768  
0.2270262485  
0.2242187136  
0.2214826037  
0.2187792794  
0.2161354358  
0.2135597841  
0.2110211005  
0.2085446195  
0.2061052954  
0.2037251416  
0.2013898757  
0.1990891127  
0.1968460352  
0.1946435909  
0.1924859078  
0.1903599756  
0.188283568  
0.1862351274  
0.1842401295  
0.1822713724  
0.1803482982  
0.178448325  
0.1765843394  
0.1747608647  
0.1729788036  
0.1712148983  
0.169484058  
0.1677857684  
0.1661269612  
0.164477312  
0.162876828  
0.1612991154  
0.1597426566  
0.1582170171  
0.1567147842  
0.1552418638  
0.1537875867  
0.152367777  
0.1509607012  
0.1495957886  
0.1482424503  
0.1469057492  
0.1456027925  
0.1443119647  
0.1430489182  
0.1417963742  
0.1405713254  
0.1393839396  
0.1381864654  
0.1370202923  
0.1358754687  
0.1347432327  
0.1336237211  
0.1325383643  
0.1314586047  
0.130402909  
0.1293508263  
0.128324804  
0.1273091179  
0.1263201119  
0.125337599  
0.1243737368  
0.1234228201  
0.1224860915  
0.1215619218  
0.1206480746  
0.1197561679  
0.1188778438  
0.1180065542  
0.1171524474  
0.1163088617  
0.1154836699  
0.114660665  
0.113860962  
0.1130540756  
0.1122765137  
0.1115028869  
0.1107392894  
0.1099879297  
0.1092551312  
0.1085255716  
0.107805081  
0.107102842  
0.1063968018  
0.1057109633  
0.10503236  
0.1043667931  
0.1037017687  
0.1030518545  
0.1024101574  
0.1017752083  
0.1011534111  
0.1005385414  
0.09992504157  
0.09932720112  
0.09874394621  
0.09815869125  
0.09758509608  
0.09701545584  
0.09645674947  
0.09590453752  
0.09535750736  
0.09482122331  
0.0942933713  
0.09376640939  
0.09325305025  
0.09274767022  
0.0922435067  
0.09174910384  
0.09126452987  
0.09077688564  
0.09029825428  
0.0898299643  
0.089366987  
0.08890567391  
0.08845618985  
0.0880098651  
0.08757085315  
0.08713164617  
0.08670584867  
0.08628731351  
0.08586741744  
0.08544977976  
0.08503837124  
0.08463747937  
0.08424658454  
0.08384456402  
0.08346792932  
0.083084906  
0.08270470399  
0.08233381488  
0.08196815325  
0.08160589313  
0.08124996958  
0.08089468879  
0.08054982723  
0.08020522644  
0.07986468546  
0.07952903573  
0.07919064915  
0.07886534396  
0.07854492312  
0.07822627437  
0.07791161316  
0.07760054998  
0.07729486776  
0.0769888708  
0.07669273304  
0.07639692157  
0.07610288587  
0.07581601041  
0.07553000637  
0.07525171266  
0.07497990519  
0.07470099737  
0.07443674442  
0.07416442885  
0.07390160383  
0.07364520361  
0.07338669383  
0.073133887  
0.07288773106  
0.07263568276  
0.07239699964  
0.07215894495  
0.07191515911  
0.07168676196  
0.071454472  
0.07122442716  
0.07099685994  
0.07077740721  
0.07056201679  
0.0703471581  
0.07013288446  
0.06992023092  
0.0697153364  
0.06951072212  
0.06931011995  
0.0691120073  
0.06891010433  
0.06871521712  
0.0685283266  
0.06833604271  
0.06814792124  
0.06796706808  
0.06778822369  
0.06761143249  
0.06743785231  
0.06726098802  
0.06708712833  
0.06691690058  
0.06675139099  
0.06659079443  
0.06642924526  
0.06626637831  
0.06611504706  
0.06595808243  
0.06580689545  
0.06565916958  
0.06550774488  
0.06536149739  
0.0652223858  
0.06508045944  
0.06494232624  
0.06480166255  
0.06467073908  
0.06453940045  
0.06440826438  
0.06427725605  
0.06415182371  
0.06402939333  
0.06390310064  
0.06378754682  
0.06367027137  
0.06354975477  
0.06343829671  
0.0633210671  
0.06321815229  
0.06310644942  
0.06299974532  
0.06290020627  
0.06279683066  
0.06269359435  
0.06260030593  
0.06249910621  
0.06240312724  
0.06231074488  
0.0622172667  
0.0621303021  
0.0620402512  
0.06195584894  
0.06187462661  
0.06178850635  
0.06170647015  
0.06163041815  
0.06155682181  
0.06148024596  
0.06140410241  
0.06134030963  
0.06126593583  
0.0611999533  
0.06112688407  
0.06106150423  
0.06100164127  
0.06093880347  
0.06087981508  
0.06081984376  
0.0607638201  
0.06071105003  
0.0606575159  
0.06060917813  
0.06055416455  
0.06050817074  
0.06046238076  
0.06041879835  
0.06037192409  
0.06033344244  
0.06028857588  
0.06025268902  
0.06021935176  
0.06017988389  
0.06014770962  
0.06011531133  
0.06008558195  
0.06005401254  
0.06002854295  
0.06000126897  
0.05997670103  
0.0599546087  
0.05993873696  
0.05991437124  
0.05989352432  
0.05988061678  
0.0598698121  
0.05985071193  
0.05983954567  
0.05983441164  
0.05982588959  
0.05981560807  
0.05980919327  
0.05980648044  
0.05980081632  
0.0597990767  
