41.31207218  
40.30264041  
40.05574022  
38.08168831  
33.06590006  
3086.338484  
7720.349784  
1426.330973  
10601.63178  
51665.11899  
28281.07396  
43186.68413  
34125.86103  
4659.480146  
13821.98016  
3516.902119  
11651.09127  
577.549141  
2120.378265  
14530.81834  
12561.10372  
16397.4801  
3980.475651  
45495.91829  
4778.4032  
5083.549588  
5110.337365  
4982.049623  
16621.80349  
3635.646046  
3865.503393  
243.0040156  
2039.513673  
17402.35238  
812.5679588  
4674.229035  
2177.755483  
3447.388857  
15441.5668  
6232.689592  
3937.614508  
3647.024128  
163.634726  
1778.254746  
2764.994933  
4730.629202  
948.1987859  
2058.797399  
5682.947342  
4256.167811  
11999.7553  
13154.18546  
503.6811613  
10571.44439  
2046.657987  
1504.330016  
299.9242883  
1243.164966  
268.1908775  
392.884311  
3373.493391  
757.6033964  
1271.790347  
2646.829846  
514.6932176  
139.0788446  
27.12283123  
430.3850332  
108.2381098  
23.15995406  
65.03839801  
53.19667817  
20.67858663  
10.68150131  
0.5711399856  
5.420448662  
2.304919867  
4.818127198  
1.289708274  
0.9117006853  
1.293982679  
1.340860168  
1.080029424  
1.256062064  
1.695918443  
0.5866542988  
0.924702989  
0.5669676065  
0.508984159  
0.4622310205  
0.4121721521  
0.4065958902  
0.3742426036  
0.3575640701  
0.3877127409  
0.3031428809  
0.3166023421  
0.2846088817  
0.2918776667  
0.2797454916  
0.2722145339  
0.2527120188  
0.2262115299  
0.2167222683  
0.2042037806  
0.1975602617  
0.1912597035  
0.1807990367  
0.1762422418  
0.1680756228  
0.1587131457  
0.1516293443  
0.1450145111  
0.1377930531  
0.1343034685  
0.1293212667  
0.1228501009  
0.1182349405  
0.1139495817  
0.1086150989  
0.1048850458  
0.100512559  
0.09706684773  
0.09314387676  
0.09005913811  
0.08690704884  
0.08386279732  
0.0807912485  
0.07815039996  
0.07527284024  
0.0728265921  
0.07035537578  
0.06805550486  
0.06582154465  
0.06367744644  
0.06157825125  
0.05969032871  
0.05774311203  
0.05590909811  
0.05420965655  
0.05255431142  
0.05091050853  
0.04940405604  
0.04790946195  
0.04647542159  
0.04511654437  
0.04382001884  
0.04254900954  
0.04132423936  
0.04015099103  
0.03902448556  
0.03793484639  
0.03688627247  
0.03587510197  
0.03489249014  
0.03395545506  
0.03304526521  
0.03216396301  
0.03131471772  
0.03049599016  
0.02970446986  
0.02893876311  
0.028198734  
0.02748192584  
0.02678989738  
0.02612127114  
0.02547164518  
0.02484418239  
0.02423545545  
0.02364772198  
0.02307557743  
0.0225245296  
0.02198778411  
0.02146996603  
0.02096639836  
0.02047770884  
0.02000530071  
0.019545366  
0.01910050791  
0.01866758637  
0.01824681919  
0.01783938704  
0.01744334419  
0.01705883156  
0.01668565005  
0.01632323222  
0.01596826044  
0.01562614386  
0.01529214151  
0.01496750893  
0.01465240051  
0.01434589124  
0.01404734468  
0.01375673528  
0.013474006  
0.01319838938  
0.01293097762  
0.01267017021  
0.0124161871  
0.01216883408  
0.01192868792  
0.01169314048  
0.01146429257  
0.01124152891  
0.01102443807  
0.01081225418  
0.01060580794  
0.01040475632  
0.01020778437  
0.01001673993  
0.009829478184  
0.009647453205  
0.009468922085  
0.009295635037  
0.009125980012  
0.008960659474  
0.008798825298  
0.008641766848  
0.008487868673  
0.008337389268  
0.008190405236  
0.008046462638  
0.007906782156  
0.007769619087  
0.007635645841  
0.007505460085  
0.007377323016  
0.007252010683  
0.00713017719  
0.007010623528  
0.006893808472  
0.00677967985  
0.006667166915  
0.00655867523  
0.006451810558  
0.00634677723  
0.006244089907  
0.006143675771  
0.00604660077  
0.005950520975  
0.005857087745  
0.005764774315  
0.00567428777  
0.005586233984  
0.005499928134  
0.005415783777  
0.005333123541  
0.005251726537  
0.005172537487  
0.005094777764  
0.005018688026  
0.004943902345  
0.004870169842  
0.004799312644  
0.004728431405  
0.004659635861  
0.004592084233  
0.004525881019  
0.004461578889  
0.004397511923  
0.004335346312  
0.004273599163  
0.004213917972  
0.004154904003  
0.004097389628  
0.004040406869  
0.003985526853  
0.003930579611  
0.003876955594  
0.003824613643  
0.003773389185  
0.003722931921  
0.003672976049  
0.003624292065  
0.003576395672  
0.003529611684  
0.003483938628  
0.003438605406  
0.003394089872  
0.003350532176  
0.003307700862  
0.003265410102  
0.003224344544  
0.003184052539  
0.003144044163  
0.003104961283  
0.003066787826  
0.003028820577  
0.00299182296  
0.002955417119  
0.002919686301  
0.002884795549  
0.00284958774  
0.002815634289  
0.002782776757  
0.002749497464  
0.002717465675  
0.002685962236  
0.002654565561  
0.002624175301  
0.002593635722  
0.002564469389  
0.002535112111  
0.002506695935  
0.002478563452  
0.002450648294  
0.002423528808  
0.00239699512  
0.002370573784  
0.002344675777  
0.002319027897  
0.002294233484  
0.002269471963  
0.002245280682  
0.002221366554  
0.002198003718  
0.002175083467  
0.002152596122  
0.002129785385  
0.002107982109  
0.002086533897  
0.002064928567  
0.002044209115  
0.002023665874  
0.002003499979  
0.001983584906  
0.001963866457  
0.001944344072  
0.001925379283  
0.00190678565  
0.001888057029  
0.00186997765  
0.001851931841  
0.001834784336  
0.001817165949  
0.001800355909  
0.001783302671  
0.001767121033  
0.001750836442  
0.001734797546  
0.00171889897  
0.00170341063  
0.00168842932  
0.001673321977  
0.001658260334  
0.001644034733  
0.001629268714  
0.001615030505  
0.00160095868  
0.001587416905  
0.001574110128  
0.001560718055  
0.001547693377  
0.00153459907  
0.001522027126  
0.001509288206  
0.00149694474  
0.001485045571  
0.001472949304  
0.001461138302  
0.001449891973  
0.001438264612  
0.001426997351  
0.001415888942  
0.001404990983  
0.0013943404  
0.001383634724  
0.001373134796  
0.001362808206  
0.001352809631  
0.001342926979  
0.00133300046  
0.001323473231  
0.001314117907  
0.001304358559  
0.001295159466  
0.001286030809  
0.001277011417  
0.001268278694  
0.001259595705  
0.001250828997  
0.001242679613  
0.001234231893  
0.001225988579  
0.001218087673  
0.001209843334  
0.001202083019  
0.001194488524  
0.00118703042  
0.001179573244  
0.001172226389  
0.00116480716  
0.001158019062  
0.001150851564  
0.001144104114  
0.001137350604  
0.001130568058  
0.001123921292  
0.001117357718  
0.001111175199  
0.001104748159  
0.001098472953  
0.001092614711  
0.001086581936  
0.001080690816  
0.00107495743  
0.001069076419  
0.001063593126  
0.001058048385  
0.00105256468  
0.001047262723  
0.001042083655  
0.001036758858  
0.001031881922  
0.001026812653  
0.001022037436  
0.00101707555  
0.001012480669  
0.001007911809  
0.001003107707  
0.0009986761646  
0.0009943763926  
0.0009898371877  
0.0009857476661  
0.0009813690972  
0.0009774224491  
0.0009732710633  
0.0009695704761  
0.0009655058353  
0.0009618053358  
0.0009578649736  
0.0009542401561  
0.0009505766807  
0.0009471892269  
0.0009434572645  
0.0009403634223  
0.0009372146115  
0.0009336988724  
0.0009307426282  
0.0009275816751  
0.0009245372726  
0.0009215454453  
0.0009186794385  
0.0009156553237  
0.0009127868224  
0.000910183078  
0.0009076247129  
0.0009049676501  
0.0009024331989  
0.0008999549629  
0.0008974268646  
0.0008950686311  
0.0008928256416  
0.0008905494398  
0.0008884544682  
0.0008862255512  
0.0008843720485  
0.0008823534513  
0.0008803800931  
0.0008785140827  
0.0008767233633  
0.0008748305449  
0.0008731958085  
0.0008716032011  
0.0008701537343  
0.0008685339337  
0.0008670153829  
0.0008654426118  
0.0008642908705  
0.0008628565353  
0.0008616236458  
0.0008603835316  
0.0008591101897  
0.0008582844964  
0.0008571044528  
0.0008563585343  
0.0008551778418  
0.0008542702615  
0.0008536515628  
0.0008527270105  
0.0008519831693  
0.0008515398448  
0.0008507766111  
0.00085027283  
0.0008498499826  
0.0008492136775  
0.0008488717618  
0.0008484604011  
0.0008483470915  
0.0008479595598  
0.0008476804916  
0.0008476945223  
0.0008477387813  
0.0008476339445  
