58.01386412  
66.35754078  
82.87524202  
135.0264295  
743.6865827  
4638.249821  
43017.65405  
4678.301921  
55849.13775  
12546.2987  
37110.7008  
32311.80691  
24297.15504  
61453.43789  
28133.5423  
3097.776886  
27905.96098  
3615.635061  
19263.28173  
1552.608901  
8234.518156  
593.5487304  
13571.93079  
3058.722284  
2402.79118  
3330.526936  
4607.473196  
4335.569322  
184.3334123  
3531.883787  
895.0624786  
280.0785996  
2366.001904  
61.40806678  
8072.191302  
6931.744053  
5300.044739  
3005.07564  
1513.743424  
712.4956864  
15071.62318  
373.2950302  
3199.278245  
889.067917  
621.2148261  
1999.35258  
5520.921267  
5598.941926  
1493.600146  
1278.256715  
839.5583231  
63.25487438  
6041.07381  
303.9907575  
578.0402258  
1189.105703  
3307.762492  
2353.271791  
219.0145442  
310.7486935  
23.56835868  
1366.846485  
594.9910595  
127.8940187  
22.88071663  
107.338201  
55.90490602  
31.78235612  
15.08037809  
22.21641648  
5.124125447  
4.955302719  
2.770899393  
1.248672932  
12.49019492  
23.91070375  
14.0590059  
5.403610381  
8.296998846  
5.687796996  
7.763209868  
6.925278171  
5.123171576  
4.684775963  
3.848896817  
4.933420803  
4.416389341  
4.585552896  
4.385940175  
4.401218527  
4.098743089  
3.885524994  
3.945768621  
3.640958627  
3.680428276  
3.481346335  
3.378181727  
3.241300227  
3.17787851  
3.126949768  
3.024156081  
2.94121474  
2.856322554  
2.7973656  
2.722575697  
2.656281802  
2.599289696  
2.532520057  
2.476513107  
2.417993434  
2.364482259  
2.319771517  
2.268280008  
2.21942356  
2.173842721  
2.128301094  
2.086184574  
2.044333389  
2.00598531  
1.966065405  
1.929570935  
1.892741399  
1.857320072  
1.82399246  
1.790875645  
1.759031875  
1.728351558  
1.69829724  
1.669091984  
1.640779709  
1.613309505  
1.586540676  
1.560668799  
1.535403885  
1.51081708  
1.486978609  
1.463786433  
1.441085753  
1.419005955  
1.397481966  
1.376587191  
1.356100119  
1.336261753  
1.316816677  
1.297917793  
1.279405244  
1.26136508  
1.243740128  
1.226551551  
1.209724885  
1.193337189  
1.177303164  
1.161628982  
1.146296004  
1.1313036  
1.116646404  
1.102343504  
1.088304504  
1.074592585  
1.061148628  
1.048017482  
1.035157692  
1.022550708  
1.010219049  
0.9981131405  
0.9862837501  
0.9746574702  
0.9633266586  
0.9521714361  
0.9412520772  
0.9305508481  
0.9200322039  
0.9097278433  
0.8996269194  
0.8897269652  
0.8799982718  
0.8704584507  
0.8610835187  
0.8519179178  
0.8428970481  
0.8340225485  
0.8253430625  
0.8168049274  
0.8084326439  
0.8002049631  
0.7921066948  
0.7841556788  
0.776358619  
0.768694586  
0.7611404439  
0.7537405884  
0.7464794629  
0.7392962335  
0.7322453457  
0.7253375134  
0.7185202306  
0.7118556609  
0.7052684183  
0.6987995054  
0.6924319028  
0.6861757122  
0.6800146146  
0.6739477489  
0.6679747304  
0.6621056885  
0.6563394656  
0.6506461029  
0.6450325459  
0.6395197963  
0.6341033431  
0.6287593909  
0.6234907405  
0.6183041826  
0.6132056041  
0.608181949  
0.6032364958  
0.59836557  
0.5935601223  
0.588821732  
0.5841598336  
0.5795778541  
0.5750418381  
0.5705779736  
0.5661914026  
0.5618542001  
0.5575803227  
0.5533751661  
0.549225312  
0.5451295916  
0.5410930033  
0.5371191692  
0.533206221  
0.5293274828  
0.5255150783  
0.5217594894  
0.518069685  
0.5144095985  
0.5107967026  
0.5072412365  
0.5037347378  
0.5002605111  
0.4968409261  
0.4934708821  
0.4901462044  
0.4868789077  
0.4836258974  
0.4804289359  
0.4772827325  
0.4741681538  
0.4710814338  
0.4680703713  
0.4650824771  
0.4621292412  
0.4592083089  
0.4563437422  
0.4534905368  
0.4506912237  
0.4479258514  
0.4451915492  
0.442488683  
0.4398383983  
0.4371939331  
0.4345846306  
0.4320206351  
0.4294856953  
0.4269840241  
0.4245188444  
0.4220723857  
0.4196690029  
0.4172823881  
0.4149354388  
0.4125984517  
0.4103238018  
0.408048057  
0.4058022203  
0.4035889725  
0.4013960101  
0.3992334339  
0.3971125128  
0.3949955218  
0.392913794  
0.3908542344  
0.3888140249  
0.3868224003  
0.3847970855  
0.3828639185  
0.3809189089  
0.378999025  
0.3771008495  
0.3752333242  
0.373373926  
0.3715524798  
0.3697421948  
0.3679501933  
0.3661862261  
0.3644421959  
0.3627087227  
0.3610030899  
0.3593150098  
0.3576456804  
0.3560153836  
0.3543634688  
0.3527518006  
0.351171508  
0.3495903931  
0.3480364242  
0.3465019209  
0.3449658971  
0.3434695309  
0.3419866097  
0.3405030452  
0.339065716  
0.3376157431  
0.3362027809  
0.3348016404  
0.3333963655  
0.3320345089  
0.3306726808  
0.3293169649  
0.3279934698  
0.3266805058  
0.3253892908  
0.3241030138  
0.3228293908  
0.3215851835  
0.3203258936  
0.3191000723  
0.3178873612  
0.3166848469  
0.3154993324  
0.3143290211  
0.3131713611  
0.3120128574  
0.3108734629  
0.3097585374  
0.3086459903  
0.3075525229  
0.306465553  
0.3053912548  
0.3043267134  
0.3032835591  
0.3022519972  
0.3012124995  
0.3002039762  
0.2991935378  
0.2982004021  
0.2972199865  
0.2962538638  
0.2952870097  
0.2943417836  
0.2934046762  
0.2924799538  
0.2915565114  
0.2906633072  
0.2897649951  
0.288871034  
0.2879882914  
0.2871353977  
0.2862646217  
0.2854335738  
0.2845891992  
0.2837538695  
0.2829402999  
0.2821288754  
0.2813385652  
0.2805442513  
0.2797681726  
0.2789894981  
0.2782198225  
0.2774807244  
0.2767273505  
0.2759847584  
0.2752517902  
0.2745380777  
0.2738396041  
0.2731331486  
0.2724321825  
0.2717555383  
0.2710666954  
0.2704057458  
0.2697480123  
0.2690828811  
0.2684380808  
0.2678104619  
0.2671788635  
0.2665483917  
0.2659333517  
0.2653278459  
0.2647348343  
0.2641411887  
0.2635541312  
0.262977045  
0.2624074249  
0.261846269  
0.2612904643  
0.2607430458  
0.2601998185  
0.2596627044  
0.2591409799  
0.2586145251  
0.2581075607  
0.2575922778  
0.2570905897  
0.2566010789  
0.2561294203  
0.2556342383  
0.255171865  
0.254695613  
0.2542407934  
0.2537853384  
0.253343008  
0.2528972354  
0.2524665204  
0.2520316401  
0.251614431  
0.2512047886  
0.2507870202  
0.2503878158  
0.2499878044  
0.2496044539  
0.2492230889  
0.2488285486  
0.2484706714  
0.2480946559  
0.2477415353  
0.247385202  
0.2470292797  
0.2466947006  
0.2463477912  
0.2460134164  
0.2457006564  
0.2453827393  
0.2450563168  
0.2447416603  
0.2444492319  
0.2441398383  
0.2438464443  
0.2435593632  
0.2432897145  
0.2430174005  
0.242737505  
0.2424762465  
0.2422172792  
0.2419599475  
0.241715847  
0.2414615631  
0.2412348375  
0.2410055644  
0.2407765529  
0.2405491687  
0.2403309161  
0.2401189101  
0.2399162743  
0.2397203588  
0.2395148875  
0.2393271224  
0.2391441997  
0.238963844  
0.2387911009  
0.2386130414  
0.2384461265  
0.2382959235  
0.2381394275  
0.237990233  
0.2378408117  
0.2377075633  
0.2375621523  
0.2374477321  
0.2373090148  
0.2371997264  
0.237073157  
0.2369681083  
0.236856402  
0.2367617583  
0.2366681992  
0.2365748579  
0.2365054665  
0.236407612  
0.2363332971  
0.2362675037  
0.2361999727  
0.236142643  
0.236086799  
0.2360336453  
0.2359797486  
0.2359505871  
0.2359072423  
0.2358803774  
0.235850348  
0.2358339798  
0.2358067436  
0.235798021  
0.2357908308  
0.235793712  
