9478.204238  
9487.762707  
9496.683793  
9504.259568  
9509.900068  
9513.19206  
9513.941206  
9512.193138  
9508.230902  
9502.548687  
9495.804071  
9488.753317  
9482.175997  
9476.796496  
9473.21048  
9471.824054  
9472.812489  
9476.10322  
9481.385693  
9488.147359  
9495.732418  
9503.416498  
9510.488719  
9516.330873  
9520.483605  
9522.690844  
9522.916486  
9521.331075  
9518.270673  
9514.174133  
9509.508625  
9504.694997  
9500.044621  
9495.717769  
9491.709741  
9487.866526  
9483.926732  
9479.582209  
9474.546538  
9468.619534  
9461.736561  
9453.994249  
9445.648467  
9437.085088  
9428.768886  
9421.179442  
9414.745154  
9409.786372  
9406.476805  
9404.82918  
9404.706515  
9405.856167  
9407.959926  
9410.691046  
9413.768243  
9416.997575  
9420.295622  
9423.690587  
9427.301932  
9431.302524  
9435.870152  
9441.136919  
9447.145016  
9453.816582  
9460.94281  
9468.19469  
9475.154284  
9481.362341  
9486.375657  
9489.825744  
9491.470335  
9491.229797  
9489.202981  
9485.659587  
9481.009801  
9475.755357  
9470.428719  
9465.529229  
9461.465251  
9458.510513  
9456.78067  
9456.232867  
9456.687617  
9457.868833  
9459.455246  
9461.134605  
9462.652254  
9463.846377  
9464.665045  
9465.162989  
9465.479673  
9465.803153  
9466.32655  
9467.2049  
9468.519951  
9470.258817  
9472.31015  
9474.478234  
9476.512692  
9478.148925  
9479.152714  
9479.361964  
9478.718981  
9477.288323  
9475.257292  
9472.918871  
9470.639238  
9468.814165  
9467.820008  
9467.965566  
9469.450771  
9472.337391  
9476.535082  
9481.804491  
9487.777087  
9493.989434  
9499.928323  
9505.081749  
9508.990391  
9511.293973  
9511.767543  
9510.343688  
9507.118176  
9502.338363  
9496.37553  
9489.684278  
9482.753546  
9476.054948  
9469.994441  
9464.873135  
9460.86187  
9457.992534  
9456.167062  
9455.182678  
9454.769764  
9454.637237  
9454.519061  
9454.215369  
9453.62248  
9452.74735  
9451.70431  
9450.69421  
9449.968891  
9449.785906  
9450.360353  
9451.821213  
9454.179462  
9457.313649  
9460.976266  
9464.821031  
9468.447803  
9471.458887  
9473.518167  
9474.403757  
9474.045421  
9472.540262  
9470.143347  
9467.234046  
9464.262801  
9461.686183  
9459.900437  
9459.183791  
9459.656847  
9461.267227  
9463.800994  
9466.918829  
9470.211122  
9473.262795  
9475.717554  
9477.331042  
9478.004604  
9477.794535  
9476.895774  
9475.603137  
9474.256862  
9473.181581  
9472.628697  
9472.731524  
9473.480151  
9474.719994  
9476.173987  
9477.484916  
9478.271089  
9478.186825  
9476.978403  
9474.526967  
9470.872077  
9466.21225  
9460.882663  
9455.313392  
9449.974377  
9445.315228  
9441.708491  
9439.404338  
9438.502637  
9438.945978  
9440.533804  
9442.955241  
9445.835462  
9448.789038  
9451.472878  
9453.631839  
9455.131208  
9455.972163  
9456.288509  
9456.325501  
9456.403567  
9456.87181  
9458.057278  
9460.216495  
9463.495677  
9467.904824  
9473.309296  
9479.440268  
9485.922934  
9492.318851  
9498.176857  
9503.085602  
9506.720314  
9508.877203  
9509.490655  
9508.631032  
9506.483869  
9503.314315  
9499.422998  
9495.100745  
9490.589696  
9486.056894  
9481.584245  
9477.175525  
9472.778432  
9468.316723  
9463.72626  
9458.988128  
9454.152772  
9449.350913  
9444.789361  
9440.732333  
9437.471388  
9435.288652  
9434.418958  
9435.016452  
9437.130294  
9440.692602  
9445.519897  
9451.32749  
9457.75457  
9464.396726  
9470.841899  
9476.705895  
9481.66384  
9485.474876  
9487.998171  
9489.199407  
9489.147671  
9488.003639  
9486.000308  
9483.418309  
9480.557979  
9477.710727  
9475.132387  
9473.021032  
9471.501564  
9470.618752  
9470.339561  
9470.564373  
9471.145712  
9471.911722  
9472.691109  
9473.335746  
9473.737757  
9473.838677  
9473.629872  
9473.144941  
9472.446302  
9471.60921  
9470.706748  
9469.798859  
9468.927456  
9468.11816  
9467.387533  
9466.753455  
9466.245561  
9465.912502  
9465.823509  
9466.062976  
9466.718266  
9467.862371  
9469.534386  
9471.72138  
9474.345205  
9477.257379  
9480.243777  
9483.039591  
9485.353282  
9486.89679  
9487.418267  
9486.733005  
9484.74832  
9481.478955  
9477.050761  
9471.691802  
9465.711922  
9459.472897  
9453.35283  
9447.708734  
9442.841637  
9438.968167  
9436.201608  
9434.544542  
9433.893811  
9434.057119  
9434.779609  
9435.777527  
9436.775411  
9437.542883  
9437.926881  
9437.875632  
9437.451174  
9436.828246  
9436.278908  
9436.143516  
9436.79061  
9438.569617  
9441.76169  
9446.534444  
9452.90653  
9460.727082  
9469.673684  
9479.270335  
9488.924592  
9497.980606  
9505.782649  
9511.742239  
9515.401132  
9516.482928  
9514.926819  
9510.899399  
9504.782454  
9497.137888  
9488.652992  
9480.072079  
9472.121523  
9465.436454  
9460.496999  
9457.581253  
9456.740379  
9457.798979  
9460.381204  
9463.960087  
9467.924769  
9471.65795  
9474.614093  
9476.388477  
9476.767778  
9475.754874  
9473.563801  
9470.584893  
9467.324398  
9464.327027  
9462.092754  
9461.000427  
9461.250256  
9462.834421  
9465.540799  
9468.98959  
9472.697102  
9476.156604  
9478.923018  
9480.687624  
9481.330244  
9480.940206  
9479.802169  
9478.348792  
9477.087509  
9476.512984  
9477.019173  
9478.825187  
9481.927041  
9486.083511  
9490.839045  
9495.581048  
9499.623563  
9502.305343  
9503.08805  
9501.640152  
9497.89412  
9492.068277  
9484.649649  
9476.339657  
9467.969895  
9460.399089  
9454.405377  
9450.588334  
9449.293996  
9450.572831  
9454.176002  
9459.590053  
9466.10475  
9472.904564  
9479.170881  
9484.181124  
9487.391503  
9488.492735  
9487.432124  
9484.400277  
9479.785796  
9474.105682  
9467.922626  
9461.761899  
9456.040258  
9451.017428  
9446.776662  
9443.236638  
9440.191469  
9437.371263  
9434.512261  
9431.423888  
9428.040663  
9424.449604  
9420.887871  
9417.710893  
9415.33633  
9414.17376  
9414.552486  
9416.660486  
9420.505387  
9425.904686  
9432.507056  
9439.841145  
9447.383472  
9454.633635  
9461.184089  
9466.772768  
9471.310202  
9474.877044  
9477.693521  
9480.06651  
9482.324007  
9484.748304  
9487.519173  
9490.676425  
9494.107821  
9497.563885  
9500.696999  
9503.118078  
9504.461527  
9504.447921  
9502.934414  
9499.944882  
9495.675084  
9490.472079  
9484.791298  
9479.13775  
9474.000536  
9469.790468  
9466.78997  
9465.12236  
9464.744462  
9465.462804  
9466.970072  
9468.895534  
9470.861164  
9472.534865  
9473.672762  
9474.144812  
9473.940724  
9473.1565  
9471.964874  
9470.575509  
9469.192216  
9467.974717  
9467.011495  
9466.308422  
9465.794766  
9465.345342  
9464.814555  
9464.075703  
9463.058035  
9461.774063  
9460.331292  
9458.9251  
9457.813031  
9457.274131  
9457.559764  
9458.844435  
9461.185165  
9464.497154  
9468.550543  
9472.989937  
9477.374508  
9481.233016  
9484.125903  
9485.705199  
9485.763677  
9484.266065  
9481.358154  
9477.352656  
9472.694084  
9467.907544  
9463.538371  
9460.090183  
9457.968785  
9457.43814  
9458.592676  
9461.348126  
9465.450958  
9470.504556  
9476.009006  
9481.410419  
9486.155329  
9489.745586  
9491.789196  
9492.04289  
9490.442341  
9487.116683  
9482.384553  
9476.730284  
9470.760464  
9465.143384  
9460.536016  
9457.505829  
9456.456211  
9457.565421  
9460.748371  
9465.648837  
9471.666232  
9478.016787  
9483.823849  
9488.227485  
9490.499478  
9490.148019  
9486.996466  
9481.223209  
9473.354563  
9464.209092  
9454.799017  
9446.200976  
9439.41377  
9435.223272  
9434.094409  
9436.106581  
9440.942735  
9447.934408  
9456.156451  
9464.557619  
9472.107524  
9477.937885  
9481.456922  
9482.420026  
9480.946741  
9477.482767  
9472.714174  
9467.448715  
9462.483886  
9458.482951  
9455.878413  
9454.817326  
9455.155365  
9456.498762  
9458.285119  
9459.888433  
9460.730419  
9460.379897  
9458.625207  
9455.509401  
9451.324758  
9446.569401  
9441.874646  
9437.915282  
9435.316704  
9434.571835  
9435.978587  
9439.604429  
9445.280696  
9452.625092  
9461.087753  
9470.013977  
9478.715742  
9486.543994  
9492.954409  
9497.560282  
9500.167774  
9500.79031  
9499.640729  
9497.101837  
9493.678099  
9489.933476  
9486.422145  
9483.620265  
9481.867432  
9481.325493  
9481.960893  
9483.553339  
9485.730134  
9488.021722  
9489.930687  
9491.004305  
9490.900071  
9489.43478  
9486.61014  
9482.611651  
9477.78162  
9472.570894  
9467.477082  
9462.978461  
9459.473081  
9457.231109  
9456.366079  
9456.827661  
9458.415327  
9460.809623  
9463.615649  
9466.412616  
9468.802959  
9470.455554  
9471.138807  
9470.740837  
9469.275746  
9466.876207  
9463.773885  
9460.27008  
9456.699836  
9453.393157  
9450.637527  
9448.645799  
9447.533384  
9447.307673  
9447.87153  
9449.040846  
9450.574231  
9452.21119  
9453.713464  
9454.903665  
9455.69518  
9456.10865  
9456.271915  
9456.402894  
9456.77744  
9457.686434  
9459.388231  
9462.063393  
9465.778333  
9470.46338  
9475.908699  
9481.778971  
9487.645149  
9493.029154  
9497.455911  
9500.505944  
9501.862121  
9501.344887  
9498.932109  
9494.761542  
9489.11625  
9482.395212  
9475.073025  
9467.653587  
9460.623061  
9454.40729  
9449.33778  
9445.629516  
9443.372051  
9442.534056  
9442.979751  
9444.494752  
9446.817621  
9449.673227  
9452.803875  
9455.994672  
9459.090412  
9462.002495  
9464.705592  
9467.225261  
9469.618783  
9471.952491  
9474.279263  
9476.619857  
9478.951069  
9481.202856  
9483.264885  
9485.001689  
9486.27399  
9486.962724  
9486.991676  
9486.344675  
9485.07418  
9483.299203  
9481.192559  
9478.958881  
9476.806808  
9474.919598  
9473.428999  
9472.396724  
9471.80673  
9471.569911  
9471.540569  
9471.542325  
9471.399357  
9470.968009  
9470.163693  
9468.978529  
9467.486913  
9465.837739  
9464.234375  
9462.905394  
9462.070453  
9461.906719  
9462.521019  
9463.932155  
9466.066095  
9468.764882  
9471.807708  
9474.940701  
9477.910702  
9480.497382  
9482.538598  
9483.945054  
9484.702114  
9484.859048  
9484.50811  
9483.757865  
9482.706079  
9481.41774  
9479.912712  
9478.165761  
9476.119361  
9473.707085  
9470.883245  
9467.652905  
9464.095934  
9460.379527  
9456.75509  
9453.538203  
9451.072996  
9449.685311  
9449.631202  
9451.048685  
9453.920867  
9458.057329  
9463.098481  
9468.544304  
9473.805413  
9478.270781  
9481.383642  
9482.715256  
9482.025888  
9479.303483  
9474.77345  
9468.876447  
9462.215993  
9455.48209  
9449.36082  
9444.442597  
9441.142326  
9439.643439  
9439.874579  
9441.523005  
9444.08334  
9446.934826  
9449.435757  
9451.021175  
9451.288987  
9450.061689  
9447.414373  
9443.665039  
9439.32905  
9435.044985  
9431.483586  
9429.253691  
9428.819288  
9430.439633  
9434.140387  
9439.718627  
9446.779318  
9454.796051  
9463.185507  
9471.383786  
9478.913161  
9485.430047  
9490.748828  
9494.840043  
9497.805727  
9499.838005  
9501.168845  
9502.019959  
9502.560483  
9502.878633  
9502.970495  
9502.746438  
9502.052834  
9500.704838  
9498.524735  
9495.37994  
9491.215457  
9486.076486  
9480.118515  
9473.603873  
9466.885143  
9460.377428  
9454.522135  
9449.746062  
9446.419497  
9444.817622  
9445.088812  
9447.233569  
9451.096576  
9456.373688  
9462.634209  
9469.357202  
9475.97911  
9481.948139  
9486.77986  
9490.107598  
9491.721411  
9491.590295  
9489.864061  
9486.853824  
9482.9929  
9478.782562  
9474.729695  
9471.284501  
9468.786917  
9467.429083  
9467.239154  
9468.088337  
9469.719712  
9471.793876  
9473.944031  
9475.831579  
9477.193661  
9477.875316  
9477.842018  
9477.171418  
9476.026956  
9474.618903  
9473.16041  
9471.826854  
9470.725959  
9469.883998  
9469.250469  
9468.720013  
9468.167173  
9467.487007  
9466.633258  
9465.645953  
9464.661987  
9463.905025  
9463.655045  
9464.201347  
9465.786598  
9468.551406  
9472.489731  
9477.424028  
9483.006394  
9488.747533  
9494.070791  
9498.384015  
9501.158541  
9502.002984  
9500.720024  
9497.336734  
9492.103418  
9485.460791  
9477.980642  
9470.289214  
9462.985385  
9456.566022  
9451.36963  
9447.545995  
9445.055099  
9443.693857  
9443.144764  
9443.03759  
9443.013632  
9442.782285  
9442.161788  
9441.099019  
9439.666995  
9438.042493  
9436.469096  
9435.212992  
9434.519235  
9434.575448  
9435.488022  
9437.273251  
9439.86312  
9443.122976  
9446.876562  
9450.933145  
9455.111645  
9459.257818  
9463.252373  
9467.009798  
9470.469653  
9473.583528  
9476.301442  
9478.561527  
9480.285817  
9481.383639  
9481.762349  
9481.343654  
9480.082331  
9477.983785  
9475.116799  
9471.618747  
9467.691885  
9463.590725  
9459.602193  
9456.02121  
9453.124955  
9451.14891  
9450.267311  
9450.579601  
9452.103385  
9454.773723  
9458.447967  
9462.915156  
9467.909198  
9473.125347  
9478.239577  
9482.930596  
9486.903755  
9489.915601  
9491.797036  
9492.472407  
9491.971544  
9490.432012  
9488.089593  
9485.25665  
9482.289523  
9479.548341  
9477.353968  
9475.947846  
9475.460621  
9475.894472  
9477.1223  
9478.904511  
9480.921514  
9482.817534  
9484.24972  
9484.935421  
9484.690946  
9483.456374  
9481.302992  
9478.422663  
9475.101013  
9471.678514  
9468.50535  
9465.896298  
9464.091864  
9463.230526  
9463.335298  
9464.315586  
9465.983329  
9468.0804  
9470.313064  
9472.388647  
9474.049588  
9475.100726  
9475.426971  
9474.999911  
9473.873418  
9472.169969  
9470.060079  
9467.738293  
9465.39904  
9463.215433  
9461.323362  
9459.812229  
9458.722624  
9458.05023  
9457.754513  
9457.770229  
9458.019709  
9458.42422  
9458.912937  
9459.42892  
9459.93192  
9460.398506  
9460.820058  
9461.19965  
9461.548404  
9461.881991  
9462.217518  
9462.57104  
9462.955545  
9463.379521  
