32.87421824  
39.23475273  
52.68256599  
98.56588901  
414.3197679  
1476.78654  
26231.62936  
22078.85377  
24218.49955  
58252.1112  
38259.11564  
92117.51282  
22315.46953  
3522.631695  
32875.31316  
2554.537233  
17625.79517  
12213.3551  
5317.492827  
9385.385892  
2339.196941  
3402.576262  
3057.527134  
102.8333653  
8664.610279  
269.5902071  
9460.463202  
6288.935674  
4689.203713  
16065.88248  
291.2125873  
6939.788965  
3626.908087  
2527.911003  
4902.072025  
1727.034158  
1722.68307  
1579.34703  
2243.57836  
2746.675444  
2858.868664  
458.8653053  
4399.31545  
1201.189177  
1857.615219  
4502.996755  
604.4880511  
2315.84575  
399.4055056  
478.6461113  
798.7693111  
41.89441075  
1102.977344  
193.8091293  
1502.040409  
510.7965876  
98.32489376  
3818.47675  
152.8543812  
2847.948268  
848.0286077  
750.2911498  
1238.800032  
283.5849861  
1347.189222  
415.7067338  
79.88620566  
265.9496347  
98.97469038  
236.2518769  
46.12845974  
8.037521878  
31.14251494  
1.500313991  
19.35302726  
4.645721627  
6.119608368  
1.538205516  
1.087264712  
5.183671232  
2.223104233  
0.6695882058  
0.1455686185  
0.6746353826  
1.05408561  
0.3792789598  
0.4548997582  
0.09511914153  
0.2995280575  
0.3871011685  
0.2588957731  
0.3101248987  
0.1525259861  
0.2289333664  
0.2369634831  
0.2051384596  
0.197370692  
0.1369032745  
0.1707915151  
0.162669913  
0.1524638067  
0.1461850398  
0.1166876625  
0.1287396891  
0.1230790067  
0.1173570078  
0.1131378807  
0.1003487056  
0.09940426395  
0.09593790009  
0.09372605946  
0.08775127174  
0.08149717515  
0.08113274472  
0.07690754337  
0.0748572934  
0.07119484988  
0.06753686328  
0.06621490686  
0.06323532194  
0.0614410739  
0.05908638533  
0.05651629011  
0.05472285449  
0.0527134969  
0.0512863138  
0.04938429834  
0.04762304768  
0.04610644446  
0.04454117787  
0.04334773808  
0.04189716434  
0.04053723618  
0.03932502803  
0.03810987849  
0.03704956165  
0.03591402101  
0.03486050056  
0.03385460855  
0.03288364024  
0.03199834246  
0.03109033716  
0.03024545898  
0.02941389101  
0.02862004613  
0.02788836759  
0.02714529537  
0.02644758356  
0.02576611024  
0.02511161786  
0.02449011683  
0.02388029515  
0.02330045265  
0.02273089747  
0.02218831739  
0.02166261841  
0.02115308158  
0.02066562066  
0.02018739689  
0.01973035392  
0.01928735372  
0.0188565678  
0.01844422543  
0.01803934331  
0.01765079227  
0.01727349699  
0.01690788687  
0.01655460401  
0.01620944982  
0.01587882305  
0.0155544197  
0.01524190486  
0.01493702314  
0.0146416607  
0.01435504355  
0.01407699569  
0.01380766272  
0.01354473659  
0.01328905849  
0.01304154704  
0.01279962476  
0.01256654788  
0.01233801497  
0.01211510777  
0.01189959344  
0.01168830727  
0.01148550301  
0.01128590987  
0.01109084196  
0.01090166034  
0.01071857903  
0.0105389216  
0.01036390248  
0.01019471273  
0.01002679503  
0.009864815696  
0.009706557186  
0.009553753653  
0.009402818396  
0.00925639308  
0.009113902998  
0.008973452203  
0.008836316284  
0.008702879081  
0.008573316482  
0.00844602286  
0.008322661179  
0.008199867037  
0.008083605168  
0.007965834937  
0.007852756128  
0.007742733041  
0.007634301873  
0.00752758902  
0.007424873437  
0.007323903696  
0.007223933066  
0.007127420825  
0.007032217159  
0.006939725749  
0.006848401305  
0.0067597544  
0.006673019286  
0.006587371354  
0.006503347786  
0.006422736917  
0.006341650014  
0.006263867428  
0.006186106522  
0.006111622097  
0.006038692875  
0.00596495273  
0.005895135426  
0.005824509255  
0.005756143689  
0.005689671826  
0.005624099765  
0.005559621787  
0.005497454155  
0.005434937393  
0.005374246565  
0.005314658836  
0.005256253  
0.005199663273  
0.005142783458  
0.005087945012  
0.00503294365  
0.004980066072  
0.004927425916  
0.004876455211  
0.004825590388  
0.004776650295  
0.004728268636  
0.004680488353  
0.004633158158  
0.004587215967  
0.004541952835  
0.004497120309  
0.004453890761  
0.004411035882  
0.004368653835  
0.004326837052  
0.00428662294  
0.004246367941  
0.004206686216  
0.00416824684  
0.00412987454  
0.004093028352  
0.004056015492  
0.004019561279  
0.003984333086  
0.003949371566  
0.003914703712  
0.003879882897  
0.003847101675  
0.003814275501  
0.003781990462  
0.003750198219  
0.003718493488  
0.00368791686  
0.00365791526  
0.003628357957  
0.003598111451  
0.003569865035  
0.003541382975  
0.003513414126  
0.003485722064  
0.003458445204  
0.003432108789  
0.003405778791  
0.003379548861  
0.003353821121  
0.003328414843  
0.003303718108  
0.003279455817  
0.003255382854  
0.003232418134  
0.003208879381  
0.003185306404  
0.003163248158  
0.003140602214  
0.003118975935  
0.003096620055  
0.003075869889  
0.003054872042  
0.003033796815  
0.003013557843  
0.002993415397  
0.002973268428  
0.002954397554  
0.00293484584  
0.002915161411  
0.002896613141  
0.002878936948  
0.002860306464  
0.00284287034  
0.002824880779  
0.002806972806  
0.002790310347  
0.002772914991  
0.00275641012  
0.002740045128  
0.002723392615  
0.002707180806  
0.002691765463  
0.002675755752  
0.002660470174  
0.002644807269  
0.002630849893  
0.002616367701  
0.002601011468  
0.00258649015  
0.002572701146  
0.002558521844  
0.002544940125  
0.002531646094  
0.002517658542  
0.00250500673  
0.002491611945  
0.002478460443  
0.002465962393  
0.002453712258  
0.002440969977  
0.002429015223  
0.002417057233  
0.002404435083  
0.002393237267  
0.002381976688  
0.002370059922  
0.002359200933  
0.00234812686  
0.00233723055  
0.002326072112  
0.002315615771  
0.002305321107  
0.00229477659  
0.002284210683  
0.002273913297  
0.0022639608  
0.002254423692  
0.002244603403  
0.002235056226  
0.002225636167  
0.002216250984  
0.002206742989  
0.002197762697  
0.002189248368  
0.002180189887  
0.002171132485  
0.002162890873  
0.002154455851  
0.002145917279  
0.002136964232  
0.002129520992  
0.002121735807  
0.002113392359  
0.002105950469  
0.002098135263  
0.002090141765  
0.002082809897  
0.002075767309  
0.00206845125  
0.00206128489  
0.00205398738  
0.002046965967  
0.002039721737  
0.002033236069  
0.002026517785  
0.002019724627  
0.002013562366  
0.002006762976  
0.00200050752  
0.001994138625  
0.001987874926  
0.001981793036  
0.001975722569  
0.001969734384  
0.001963790346  
0.001958579164  
0.001952808106  
0.001947058417  
0.001941519795  
0.001936445998  
0.001931363293  
0.001925403062  
0.001920053665  
0.001915436879  
0.001910260687  
0.001905216787  
0.001900442878  
0.001895682894  
0.001890984798  
0.001886338155  
0.001881454755  
0.001877121544  
0.001872808295  
0.001867931439  
0.001864055872  
0.001859946067  
0.001855671271  
0.001851528844  
0.001847326637  
0.001843309458  
0.001839438216  
0.00183569371  
0.001831998757  
0.001827983031  
0.00182436941  
0.001820668082  
0.001817482161  
0.001813927502  
0.001810634539  
0.001807164897  
0.001803861507  
0.001800894495  
0.001797842883  
0.001794722223  
0.001791641222  
0.001788665593  
0.001785986903  
0.001782762665  
0.001779961388  
0.001777472903  
0.001774781997  
0.001772274214  
0.001769408709  
0.001767519451  
0.001765052382  
0.001762369106  
0.001760178076  
0.001757991731  
0.001756109624  
0.001753433098  
0.001751348267  
0.001749416055  
0.001747598811  
0.001745297799  
0.001744069607  
0.00174172078  
0.001740073741  
0.001738258746  
0.001736588012  
0.001735206762  
0.001733345144  
0.001732138651  
0.001730362053  
0.001729360814  
0.00172776586  
0.00172673446  
0.00172531407  
0.001724273857  
0.001723113045  
0.001722047416  
0.001720850443  
0.001719516208  
0.001718575531  
0.001718128155  
0.001717095451  
0.00171655899  
0.0017158789  
0.001714665002  
0.001714495417  
0.001714019442  
0.001713039411  
0.001713263133  
0.001712133553  
0.001711806107  
0.001711642961  
0.001711099417  
0.001711436246  
0.001711438289  
0.001710844082  
0.001710867887  
0.001710744388  
