0.6629420507  
1.4169774  
2.110835599  
2.693244986  
3.125314025  
3.384701997  
3.467666514  
3.388737289  
3.178122478  
2.877244817  
2.533066612  
2.191984685  
1.89412328  
1.668750619  
1.531360428  
1.482717556  
1.509877525  
1.588931511  
1.689014635  
1.776974294  
1.822044362  
1.799922637  
1.695752343  
1.505706021  
1.237050596  
0.9067893337  
0.5391470177  
0.1622842147  
-0.1952968885  
-0.5082032481  
-0.7570435014  
-0.930437251  
-1.025973462  
-1.050029936  
-1.01655186  
-0.9449644903  
-0.8575072042  
-0.7763192989  
-0.7206362801  
-0.7044295548  
-0.7347720623  
-0.8111153899  
-0.9255738803  
-1.064156497  
-1.208802542  
-1.33994272  
-1.439259713  
-1.492263275  
-1.490341513  
-1.431981715  
-1.322994218  
-1.175680919  
-1.007061174  
-0.8363917509  
-0.6823366302  
-0.5601992509  
-0.4796413922  
-0.4432304129  
-0.446077476  
-0.4766205808  
-0.5184735447  
-0.5530661633  
-0.562677115  
-0.5333946437  
-0.4575314554  
-0.3351110292  
-0.1741726518  
0.01016373986  
0.1977368763  
0.3661789914  
0.4941131825  
0.5642185197  
0.5657096475  
0.4958566993  
0.3603478378  
0.1724692617  
-0.04874598083  
-0.2810820501  
-0.5020295102  
-0.6915596698  
-0.8344139138  
-0.9216058198  
-0.9509776794  
-0.9268137389  
-0.8586122348  
-0.7592596533  
-0.6428941902  
-0.5227784758  
-0.4094701915  
-0.3095271309  
-0.2249093525  
-0.1531212813  
-0.08807523753  
-0.02153171505  
0.0550729862  
0.148680082  
0.2628113962  
0.3962071785  
0.5421299747  
0.6884920691  
0.8188739947  
0.9143749659  
0.9561155182  
0.9280971361  
0.8200462696  
0.6298334757  
0.3650551073  
0.04347442289  
-0.3078894567  
-0.6550259242  
-0.9603968771  
-1.187223865  
-1.304096852  
-1.289297223  
-1.134226923  
-0.8454030234  
-0.4446569385  
0.03261939864  
0.5410364441  
1.030213482  
1.450609001  
1.759432498  
1.925859047  
1.934826007  
1.788889699  
1.507875811  
1.126348623  
0.6892438215  
0.2462460663  
-0.1543343581  
-0.4713708462  
-0.6756540535  
-0.7529689253  
-0.705149904  
-0.5490512009  
-0.3136379327  
-0.03567457324  
0.2453886332  
0.4926039234  
0.6761151456  
0.7765741573  
0.7869934827  
0.7128669491  
0.5706298043  
0.3847387887  
0.1838281354  
-0.003512236802  
-0.1527477071  
-0.2466692639  
-0.2775055521  
-0.247618266  
-0.1687360122  
-0.0598533766  
0.05587837148  
0.1548202454  
0.2165568538  
0.2271246272  
0.1813036469  
0.08364286832  
-0.05193483977  
-0.2039127685  
-0.3461287232  
-0.4514952575  
-0.4960113271  
-0.4625137025  
-0.3436477039  
-0.1436182431  
0.1215458775  
0.4253367682  
0.7335815467  
1.008438236  
1.213063103  
1.316384816  
1.297336652  
1.14797429  
0.8750277567  
0.4996213664  
0.05515037635  
-0.4164554076  
-0.8696237642  
-1.26055516  
-1.552451443  
-1.71985313  
-1.751507931  
-1.651384221  
-1.437712242  
-1.140206299  
-0.7958836061  
-0.4440908382  
-0.1214431463  
0.1426189251  
0.3290575041  
0.4308509228  
0.4528480517  
0.4099715117  
0.3241211449  
0.2202957205  
0.1225409735  
0.05032170749  
0.01581196325  
0.02245369376  
0.064901222  
0.1302909084  
0.2005837963  
0.2555758593  
0.2761448178  
0.2472535173  
0.160318702  
0.0146486344  
-0.1822141323  
-0.4152575351  
-0.6637584741  
-0.9037941592  
-1.111187559  
-1.264527461  
-1.347894094  
-1.352947031  
-1.280123783  
-1.138771053  
-0.9461682497  
-0.7255266663  
-0.5031712485  
-0.3052376077  
-0.1542736921  
-0.06619141466  
-0.04798306634  
-0.09654776058  
-0.1988351414  
-0.3333660196  
-0.4729754601  
-0.5884706572  
-0.652730945  
-0.6447022667  
-0.5527054237  
-0.3765759103  
-0.1282730111  
0.1691882868  
0.484401939  
0.781509424  
1.024908493  
1.184098883  
1.23799105  
1.17806805  
1.009923607  
0.7529307872  
0.4380421349  
0.1039764468  
-0.2077122823  
-0.4580386679  
-0.6157327249  
-0.6614279227  
-0.5903012724  
-0.4127880326  
-0.1532447266  
0.1532869364  
0.4657953084  
0.7428662048  
0.9483500101  
1.056347719  
1.054821388  
0.9473264628  
0.7526038767  
0.5020814885  
0.2356083019  
-0.003984685717  
-0.1767718927  
-0.2512525308  
-0.2087617807  
-0.04618475158  
0.223383618  
0.5721011262  
0.9607414629  
1.343502514  
1.673615499  
1.909021136  
2.01740048  
1.97995202  
1.793488286  
1.470645113  
1.038246794  
0.5340850739  
0.002559450229  
-0.5102687749  
-0.9616192895  
-1.316355431  
-1.550300863  
-1.652198233  
-1.62414621  
-1.480555857  
-1.245822677  
-0.9510565633  
-0.630279897  
-0.3165666732  
-0.03856096851  
0.1822596755  
0.3332899856  
0.411353168  
0.4221035731  
0.37841547  
0.298009079  
0.2006424073  
0.1052384713  
0.02729570918  
-0.02308759844  
-0.04236307924  
-0.03372074289  
-0.006322273608  
0.02631622895  
0.04855922777  
0.04521670732  
0.004079409196  
-0.08191203607  
-0.2131916575  
-0.3830118984  
-0.5779193248  
-0.7792517392  
-0.9654858888  
-1.115136755  
-1.209816839  
-1.237010275  
-1.192138598  
-1.079566881  
-0.9123501664  
-0.7106905954  
-0.4992832679  
-0.303888651  
-0.1476372122  
-0.04759614162  
-0.01215090809  
-0.03961274315  
-0.1183201568  
-0.2282537856  
-0.3439700522  
-0.438434057  
-0.4871975614  
-0.4722940871  
-0.3852514467  
-0.2287613333  
-0.01672219922  
0.227369385  
0.4734660421  
0.6890319119  
0.8435352013  
0.9127432782  
0.8822088118  
0.749471587  
0.5246782818  
0.2295540552  
-0.1051089088  
-0.4431046912  
-0.747109024  
-0.9830635431  
-1.124123417  
-1.153694835  
-1.067262582  
-0.872824795  
-0.5899545625  
-0.2476277751  
0.1189172737  
0.4719517729  
0.7752680863  
0.9980564927  
1.118273537  
1.125170525  
1.02072825  
0.8197944522  
0.5488450602  
0.2434069474  
-0.05568840268  
-0.3068992144  
-0.4729518975  
-0.5256470662  
-0.4498839244  
-0.246333301  
0.0676938173  
0.4594438901  
0.8839638308  
1.289106007  
1.621731168  
1.83434393  
1.891288197  
1.77366666  
1.482266166  
1.038049414  
0.4800797182  
-0.1388884629  
-0.7586065085  
-1.318516798  
-1.764972847  
-2.057551836  
-2.17362038  
-2.110565595  
-1.885414763  
-1.531953109  
-1.095753017  
-0.6278689667  
-0.1780784567  
0.2113697945  
0.5106468051  
0.7052353645  
0.7964979656  
0.79993879  
0.7415367611  
0.6527833174  
0.5652407199  
0.505472489  
0.4910998324  
0.5285274752  
0.6126069408  
0.7281788192  
0.8531471684  
0.9625241645  
1.032750866  
1.045592676  
0.9910194614  
0.8686551353  
0.6876487929  
0.4650553662  
0.2230666217  
-0.01441996359  
-0.2253134393  
-0.3923707847  
-0.5053105745  
-0.5617417305  
-0.5668282099  
-0.5318435947  
-0.4719397699  
-0.4035338889  
-0.3417861494  
-0.2985554368  
-0.2811189105  
-0.2917817841  
-0.3283401037  
-0.3852131933  
-0.454959387  
-0.5298596415  
-0.603269038  
-0.6705174429  
-0.7292467812  
-0.7792005459  
-0.8215749816  
-0.858129477  
-0.8902665205  
-0.9182917134  
-0.9409938908  
-0.9556257408  
-0.9582567044  
-0.9444260484  
-0.909943206  
-0.8516943778  
-0.7683048876  
-0.6605666071  
-0.5315695824  
-0.3865458129  
-0.2324707127  
-0.07749281156  
0.06973424986  
0.2007461854  
0.3079344564  
0.3851595986  
0.4282865621  
0.4356298648  
0.4082844492  
0.3503038582  
0.2686888746  
0.1731120676  
0.07535733657  
-0.01155524712  
-0.07452583077  
-0.1017250446  
-0.0840007532  
-0.01617486698  
0.1019867188  
0.2652818492  
0.463200347  
0.6807124002  
0.8996798155  
1.100741444  
1.265451494  
1.378408342  
1.429083012  
1.413103208  
1.332818071  
1.197057029  
1.02009901  
0.8199946904  
0.616431481  
0.4284138811  
0.2720357933  
0.1586161572  
0.09342447753  
0.07515182191  
0.09619063649  
0.1437039267  
0.2013580036  
0.251495707  
0.2774976886  
0.2660096767  
0.2087486374  
0.1036335488  
-0.04491667106  
-0.2265817372  
-0.4265443144  
-0.6275286857  
-0.8121719896  
-0.9653924246  
-1.076412921  
-1.140131444  
-1.157637413  
-1.135795848  
-1.08596015  
-1.022013016  
-0.9580348204  
-0.9059685067  
-0.8736461907  
-0.8634822661  
-0.8720544268  
-0.8906215468  
-0.9065201174  
-0.905193412  
-0.8725569326  
-0.7973107319  
-0.6728541027  
-0.4985033662  
-0.2798532444  
-0.02823132918  
0.2406296739  
0.5084977476  
0.7568205535  
0.9688706861  
1.131575283  
1.236804979  
1.282021225  
1.270229304  
1.209329791  
1.110967422  
0.9890614284  
0.8581722093  
0.7318893097  
0.6213838616  
0.5342484438  
0.473731605  
0.4384224842  
0.4224377519  
0.4161033004  
0.4070968728  
0.3819574568  
0.3278425726  
0.2343462077  
0.0951879989  
-0.09044652497  
-0.317100171  
-0.572928341  
-0.8403618329  
-1.097535256  
-1.320392539  
-1.48528276  
-1.571761675  
-1.565295846  
-1.459509653  
-1.257672179  
-0.9731671684  
-0.62880205  
-0.2549569842  
0.1132887625  
0.439762537  
0.691145092  
0.8407744857  
0.8718558786  
0.7796318448  
0.5722340044  
0.2700650392  
-0.09624365203  
-0.4890620625  
-0.8678033817  
-1.193278708  
-1.431847118  
-1.55886435  
-1.561031234  
-1.437405281  
-1.199003032  
-0.8671113819  
-0.4705774143  
-0.04246657839  
0.383478983  
0.7761436965  
1.109748205  
1.36571678  
1.533580375  
1.610950184  
1.602690128  
1.519517171  
1.376272433  
1.1901192  
0.9788675358  
0.759566386  
0.5474188533  
0.3550461392  
0.1920476681  
0.06479831464  
-0.02356905181  
-0.07303672887  
-0.08645878559  
-0.06919193811  
-0.02859315829  
0.02661173594  
0.08708714903  
0.1437246671  
0.1885000073  
0.2152444317  
0.2202553281  
0.2026294542  
0.1642712636  
0.1095470962  
0.04460572943  
-0.02353964014  
-0.08805076957  
-0.1432634922  
-0.1854766245  
-0.2134025935  
-0.2281885919  
-0.2329992068  
-0.232228885  
-0.2305016536  
-0.2316423088  
-0.2378437198  
-0.2492035142  
-0.2637514776  
-0.2779768079  
-0.2877680704  
-0.2895721262  
-0.2815306927  
-0.2643270653  
-0.2415293602  
-0.2192903748  
-0.2054111797  
-0.2078809388  
-0.2331420119  
-0.2843958026  
-0.3602865928  
-0.4542612683  
-0.5547977809  
-0.6465616295  
-0.7123754755  
-0.7357608448  
-0.7036554521  
-0.6089017369  
-0.4520689567  
-0.2422788525  
0.003175402255  
0.2604272677  
0.5017122104  
0.6987702659  
0.8265385465  
0.8666156709  
0.8100070096  
0.6587449236  
0.4261270595  
0.1354979348  
-0.182291492  
-0.4924543041  
-0.7604191382  
-0.9560403871  
-1.057346904  
-1.05334908  
-0.945545809  
-0.7479415266  
-0.4855424564  
-0.1915115389  
0.09669710744  
0.3417685568  
0.5109975638  
0.5802586283  
0.5370121123  
0.3819630981  
0.1291828918  
-0.1953389993  
-0.5565401804  
-0.9141982781  
-1.227451878  
-1.459394717  
-1.581214846  
-1.575396347  
-1.437619501  
-1.177156691  
-0.815734199  
-0.3850204628  
0.07694959119  
0.5299755544  
0.9360182076  
1.263157459  
1.488726003  
1.60130052  
1.601363807  
1.500627629  
1.320149434  
1.087539233  
0.833620689  
0.588958396  
0.3806592665  
0.2297899985  
0.1496492011  
0.1450311646  
0.2124662065  
0.3413383943  
0.5156574754  
0.7162225513  
0.922878283  
1.116585116  
1.281088368  
1.404026397  
1.477445878  
1.497755734  
1.465253333  
1.383394521  
1.257980634  
1.09643397  
0.9072412737  
0.6996035844  
0.4832354218  
0.2682070513  
0.06472523377  
-0.1172732653  
-0.2687515452  
-0.38241195  
-0.4536334336  
-0.4813585543  
-0.4687025086  
-0.4231301579  
-0.3560432045  
-0.2817544057  
-0.2159064405  
-0.1735270001  
-0.166975658  
-0.2040948162  
-0.2868716126  
-0.410849111  
-0.5654199455  
-0.7350101088  
-0.901019217  
-1.044254478  
-1.147518065  
-1.197964909  
-1.188894661  
-1.120704433  
-1.000863444  
-0.8429306134  
-0.6647606503  
-0.486194613  
-0.3265728374  
-0.2024410988  
-0.1257734636  
-0.1029170164  
-0.1343595152  
-0.215267579  
-0.3366296227  
-0.4867526009  
-0.6528502732  
-0.8224497276  
-0.9844450145  
-1.129698211  
-1.251192265  
-1.343827734  
-1.404022056  
-1.42926968  
-1.417818536  
-1.368569525  
-1.281209581  
-1.156555203  
-0.9969946282  
-0.8068978296  
-0.5928561386  
-0.3636473715  
-0.1298709239  
0.0967313019  
0.304185837  
0.48130337  
0.6186428785  
0.7092854328  
0.7492988705  
0.737867406  
0.677093032  
0.5715666849  
0.4278263741  
0.2538370349  
0.05858455571  
-0.1481588764  
-0.3559391623  
-0.5536694686  
-0.7297693865  
-0.8725072578  
-0.9706460727  
-1.014401113  
-0.9966154795  
-0.9139935372  
-0.7681298922  
-0.5661042536  
-0.3204174328  
-0.04816523389  
0.2305291055  
0.4946700841  
0.7248303773  
0.9055314266  
1.027173477  
1.087208379  
1.090338731  
1.047691954  
0.9750941599  
0.8906877765  
0.8122752328  
0.7547841542  
0.7282449532  
0.7365730139  
0.7773176288  
0.8423937294  
0.919634954  
0.9949163125  
1.054483632  
1.087119674  
1.085816334  
1.048704432  
0.979121609  
0.8848432671  
0.7766318737  
0.6663650026  
0.5650819353  
0.4812564485  
0.4196013395  
0.3805736988  
0.3606480891  
0.353278889  
0.3503597543  
0.3438981177  
0.3275906619  
0.2980182804  
0.2552272455  
0.2026136491  
0.1461247615  
0.09294285275  
0.04989910715  
0.02192481067  
0.01084934589  
0.01477965304  
0.02821348431  
0.04288754914  
0.04924221919  
0.03825472531  
0.003323647599  
-0.05814097739  
-0.1437199783  
-0.245804316  
-0.352295346  
-0.4481099852  
-0.5172848995  
-0.5453191252  
-0.5213995282  
-0.4401269862  
-0.3024563216  
-0.115712122  
0.1073149136  
0.3500014932  
0.5939735747  
0.8212467834  
1.016085123  
1.166291239  
1.263774562  
1.304420045  
1.287404712  
1.214238232  
1.087832107  
0.9118827872  
0.6907402504  
0.429804844  
0.1363160672  
-0.1797269237  
-0.5048559987  
-0.821990034  
-1.111113169  
-1.350886973  
-1.521107425  
-1.605683805  
-1.595698947  
-1.491943598  
-1.306393152  
-1.062161694  
-0.7917154782  
-0.5333971103  
-0.3266078026  
-0.2062832137  
-0.1974609749  
-0.3108128901  
-0.539932492  
-0.8609408864  
-1.234665098  
-1.611229578  
-1.936540343  
-2.159789095  
-2.24091911  
-2.156941339  
-1.906105103  
-1.509209823  
-1.007759554  
-0.4591066186  
0.07081705835  
0.5162028002  
0.8202978639  
0.9433078148  
0.8681320303  
0.6030947206  
0.1812571305  
-0.3436296492  
-0.9040049875  
-1.427268027  
-1.845276121  
-2.103263712  
-2.167010167  
-2.027291277  
-1.701040097  
-1.229079219  
-0.6707413774  
-0.09609629052  
0.4231949703  
0.8231963422  
1.055995169  
1.095911964  
0.942846971  
0.6223357037  
0.182331452  
-0.3128813255  
-0.7908619205  
-1.180246338  
-1.419877388  
-1.466678174  
-1.301289751  
-0.9307446776  
-0.3878499921  
0.27267387  
0.9808149422  
1.659844424  
2.235780058  
2.646554298  
2.849744403  
2.827884656  
2.590694492  
2.173931568  
1.635016744  
1.045984528  
0.4846526795  
0.02513665927  
-0.2710938872  
-0.3624920869  
-0.2321676111  
0.1104771492  
0.6313327537  
1.276076971  
1.976925513  
2.660684542  
3.257044387  
3.706070848  
3.964026091  
4.006931843  
3.831627255  
3.45441919  
2.907738394  
2.235415917  
1.48729071  
0.7138848949  
-0.03827227389  
-0.7302212919  
-1.332832327  
-1.827724684  
-2.206981306  
-2.471931649  
-2.631295891  
-2.699028785  
-2.692133689  
-2.628655797  
-2.526005287  
-2.399688274  
-2.262443672  
-2.123802749  
-1.989992195  
-1.86415086  
-1.746786168  
-1.636407966  
-1.53025704  
-1.425078103  
-1.317830554  
