0.4273565109  
0.7191491958  
0.9909375101  
1.222839354  
1.39971951  
1.5130159  
1.561740033  
1.552531864  
1.498791912  
1.419016235  
1.334562486  
1.267133925  
1.236279029  
1.257195659  
1.339073014  
1.484124161  
1.687390255  
1.937306135  
2.216927614  
2.505689578  
2.78147576  
3.022800466  
3.210874394  
3.331351087  
3.375598559  
3.341384368  
3.232912943  
3.060249879  
2.83818445  
2.584673278  
2.319020101  
2.059969565  
1.823906558  
1.623322536  
1.465688867  
1.3528291  
1.280846467  
1.240602123  
1.21869232  
1.198847905  
1.16362365  
1.096234992  
0.9823828515  
0.8119016043  
0.5800710755  
0.2884617189  
-0.05479823773  
-0.4353878124  
-0.8338069662  
-1.226983209  
-1.590345241  
-1.900199778  
-2.136159509  
-2.283386957  
-2.334375299  
-2.29004019  
-2.15995721  
-1.961673287  
-1.719125019  
-1.460318004  
-1.214526101  
-1.009325264  
-0.8678222949  
-0.8064000047  
-0.8332524035  
-0.9478553791  
-1.141411844  
-1.39817372  
-1.697433113  
-2.015905914  
-2.330194055  
-2.619027636  
-2.865043356  
-3.05593183  
-3.184892042  
-3.25041475  
-3.255509301  
-3.206542609  
-3.111883633  
-2.980561879  
-2.821114428  
-2.640744513  
-2.444876525  
-2.237104877  
-2.019493081  
-1.7931241  
-1.5587659  
-1.317518421  
-1.071314128  
-0.823173481  
-0.577169637  
-0.3381115613  
-0.1110001938  
0.09963224361  
0.2903855175  
0.4595170188  
0.6072237397  
0.7356295924  
0.8484432078  
0.9503514743  
1.046230407  
1.140307853  
1.235408953  
1.332414928  
1.430015324  
1.524806931  
1.611714333  
1.684680813  
1.737529424  
1.764875535  
1.762968914  
1.730355072  
1.668273365  
1.58073404  
1.47425774  
1.357294485  
1.239368236  
1.130030026  
1.037724006  
0.96868416  
0.926002737  
0.9089947402  
0.9129701852  
0.9294985133  
0.9471832581  
0.952920983  
0.9335265849  
0.8775546501  
0.7770907674  
0.6292602109  
0.4372079199  
0.2103547621  
-0.03617405525  
-0.2829540247  
-0.5083711755  
-0.6911867264  
-0.8132395124  
-0.8618943175  
-0.8318928609  
-0.7262896473  
-0.5563296604  
-0.3402211869  
-0.1009668823  
0.1364699369  
0.3482679782  
0.5146791728  
0.6223822947  
0.6659321522  
0.6481058269  
0.5791436585  
0.4750091286  
0.3549612876  
0.2388113339  
0.1442745285  
0.08477727611  
0.06802021103  
0.09543928014  
0.1625786498  
0.2602432183  
0.3761936582  
0.4970725094  
0.6102492314  
0.7053075782  
0.7749746562  
0.8154224006  
0.8259577235  
0.8082456997  
0.7652651173  
0.7002322215  
0.6157170879  
0.5131147006  
0.3925646913  
0.2533169569  
0.09444456923  
-0.08424761602  
-0.2813188759  
-0.4929917538  
-0.7128126844  
-0.9317820154  
-1.138973852  
-1.322580575  
-1.47124415  
-1.57549029  
-1.629033473  
-1.629763504  
-1.580228025  
-1.487527586  
-1.362603759  
-1.219000275  
-1.071255937  
-0.9331437094  
-0.8160086292  
-0.7274219765  
-0.6703646898  
-0.6430348968  
-0.6393156083  
-0.649833609  
-0.6634468022  
-0.6689624952  
-0.6568331809  
-0.6206063727  
-0.5579330264  
-0.4710090764  
-0.3664009834  
-0.2542882057  
-0.147227587  
-0.05859697392  
-0.0009131751542  
0.0157883207  
-0.01468366295  
-0.09370846456  
-0.2173947123  
-0.3766793713  
-0.5579833085  
-0.7443664161  
-0.9170738363  
-1.057328852  
-1.14819053  
-1.176291265  
-1.13326265  
-1.016693838  
-0.8305043942  
-0.5846860302  
-0.2944224395  
0.02131089514  
0.3415218508  
0.6451526219  
0.9129900038  
1.129334575  
1.283245307  
1.369262013  
1.387543231  
1.343450486  
1.246667024  
1.109984694  
0.9479200752  
0.7753308586  
0.606180008  
0.4525573027  
0.3240208522  
0.2272810131  
0.1661773212  
0.141897048  
0.1533425631  
0.197560833  
0.2701734836  
0.3657536833  
0.4781357041  
0.6006717473  
0.7264519063  
0.8485283908  
0.9601664084  
1.055137824  
1.128040489  
1.174631983  
1.192125532  
1.17940813  
1.137138314  
1.067695293  
0.9749705612  
0.8640148947  
0.740571785  
0.6105544312  
0.4795167708  
0.3521849682  
0.2320975834  
0.1214043276  
0.02083494992  
-0.07014686917  
-0.1530287061  
-0.2298097427  
-0.3024898342  
-0.3725594321  
-0.4405604111  
-0.5057894916  
-0.5662035375  
-0.6185609708  
-0.6587955595  
-0.6825975778  
-0.6861308912  
-0.6667827678  
-0.6238444634  
-0.5590018518  
-0.4765426914  
-0.3832251269  
-0.2877901066  
-0.2001536588  
-0.1303766991  
-0.08751944994  
-0.0785529692  
-0.1074467694  
-0.1745819349  
-0.2765701644  
-0.4065117234  
-0.5546786474  
-0.7095371494  
-0.8589909154  
-0.9916884483  
-1.098232991  
-1.172151076  
-1.21049723  
-1.214042894  
-1.187030502  
-1.13655022  
-1.071623069  
-1.002119997  
-0.9376432633  
-0.8864999177  
-0.8548636213  
-0.8461913616  
-0.8609387814  
-0.8965599715  
-0.9477793366  
-1.007080908  
-1.065372815  
-1.112756062  
-1.13935161  
-1.136117844  
-1.095613125  
-1.012646681  
-0.8847818167  
-0.7126417535  
-0.5000154026  
-0.2537300569  
0.01668873503  
0.2995544016  
0.581722004  
0.849414617  
1.089119989  
1.288511412  
1.437333661  
1.52821072  
1.55730492  
1.524793692  
1.435091194  
1.296783657  
1.12223611  
0.9268557903  
0.728033066  
0.5438168218  
0.3914072366  
0.2856078919  
0.2373828831  
0.2526831704  
0.3316867429  
0.4685660799  
0.6518303379  
0.8652455878  
1.089236463  
1.302643801  
1.484649099  
1.616657704  
1.683954744  
1.676953037  
1.59192611  
1.431170342  
1.202599059  
0.9188468254  
0.5960061391  
0.2521354906  
-0.09428755811  
-0.4258209993  
-0.7272861144  
-0.9866752272  
-1.195691283  
-1.349906998  
-1.448592082  
-1.494259007  
-1.492031332  
-1.448917716  
-1.373082526  
-1.273186474  
-1.157838902  
-1.03518086  
-0.9126005044  
-0.7965555  
-0.6924567626  
-0.604602764  
-0.5361044875  
-0.4888119121  
-0.4632232183  
-0.4583950311  
-0.4718863286  
-0.4997597392  
-0.5366708977  
-0.576087218  
-0.6106294377  
-0.6325477367  
-0.6343022153  
-0.6092157158  
-0.5521304912  
-0.4600120275  
-0.3324146335  
-0.171752211  
0.01669270657  
0.2250425288  
0.4433781732  
0.6605448026  
0.8651236378  
1.04647335  
1.195727649  
1.306623067  
1.376058084  
1.40430897  
1.394877448  
1.353987339  
1.289790438  
1.211389346  
1.127789447  
1.046909446  
0.974761692  
0.9148765403  
0.8680315131  
0.8322847886  
0.8032998186  
0.7749129081  
0.739875074  
0.690710046  
0.6205995314  
0.5242340468  
0.3985490885  
0.2432809365  
0.0612747291  
-0.1414993864  
-0.3562594402  
-0.5720558003  
-0.7767048659  
-0.9579436998  
-1.104695509  
-1.20829263  
-1.263526977  
-1.26936149  
-1.229207296  
-1.150692357  
-1.044922889  
-0.925305968  
-0.8060564101  
-0.7005724476  
-0.6198833087  
-0.5713683166  
-0.5579228992  
-0.5776894792  
-0.6243922354  
-0.6882352187  
-0.757248901  
-0.8189042861  
-0.8617710853  
-0.8770077087  
-0.8594762291  
-0.808344038  
-0.7270994133  
-0.6229963001  
-0.5060151604  
-0.3875013324  
-0.2786708893  
-0.1891935903  
-0.1260407591  
-0.09273415366  
-0.08908273393  
-0.1114080174  
-0.1531924362  
-0.2060468386  
-0.2608283757  
-0.3087647397  
-0.3424283905  
-0.3564556648  
-0.3479421205  
-0.3165128505  
-0.2640851824  
-0.1944189459  
-0.1125267206  
-0.02405026162  
0.06531419493  
0.1502917937  
0.2263582617  
0.2899453453  
0.3385197617  
0.3705905524  
0.3856703909  
0.3842267833  
0.3676385012  
0.3381531347  
0.2988375743  
0.2534856926  
0.2064672158  
0.1624875698  
0.126268212  
0.1021499643  
0.09366416406  
0.1031223067  
0.1312720465  
0.1770879187  
0.2377250053  
0.3086625304  
0.3840253032  
0.457053214  
0.5206639829  
0.5680490394  
0.5932372422  
0.5915758488  
0.5600868516  
0.4976863668  
0.4052702365  
0.2856735529  
0.1435289455  
-0.01495039669  
-0.1822612123  
-0.3499584865  
-0.5090681256  
-0.6505662028  
-0.7659201109  
-0.8476770993  
-0.8900597054  
-0.8895219504  
-0.8451846532  
-0.7590885082  
-0.6361930053  
-0.4840820967  
-0.3123741163  
-0.1318793177  
0.04641649193  
0.2124242935  
0.3579408535  
0.4774327356  
0.5684988548  
0.6319555695  
0.6715252224  
0.6931833377  
0.7042484931  
0.7123476312  
0.7243930423  
0.7457051899  
0.7793846765  
0.8259944383  
0.8835746043  
0.9479542061  
1.013299724  
1.072816312  
1.119498094  
1.146857327  
1.149541985  
1.12381589  
1.067859654  
0.9819041443  
0.8681943491  
0.7308114264  
0.5753677025  
0.4086055372  
0.2379109448  
0.07078183448  
-0.08572350832  
-0.2255294447  
-0.3440112185  
-0.4383625377  
-0.5078071027  
-0.5536226065  
-0.5789598618  
-0.5884660194  
-0.5877471507  
-0.582726324  
-0.5789786085  
-0.5811247892  
-0.5923739741  
-0.6142634702  
-0.646647079  
-0.6879089797  
-0.7353748468  
-0.7858411035  
-0.8361278212  
-0.8835616257  
-0.9263069351  
-0.9634912877  
-0.9951202614  
-1.021804964  
-1.044377675  
-1.063488568  
-1.079269308  
-1.091163255  
-1.097945202  
-1.097955631  
-1.089492052  
-1.071281096  
-1.042919753  
-1.005182766  
-0.9601022227  
-0.910775994  
-0.8609089958  
-0.8141429755  
-0.7732960433  
-0.7396364827  
-0.7123485833  
-0.6883133191  
-0.662282421  
-0.6274663037  
-0.5764788444  
-0.5025188198  
-0.4006059991  
-0.2686763281  
-0.1083379839  
0.07487504562  
0.27182283  
0.4706690984  
0.6582690714  
0.8218573747  
0.9507958104  
1.038110433  
1.081571734  
1.084124606  
1.053579147  
1.001575177  
0.9419436779  
0.8887105241  
0.8540146299  
0.8462628713  
0.868802004  
0.9193129144  
0.9900288596  
1.068752275  
1.140529081  
1.189734229  
1.202274262  
1.167581921  
1.080133207  
0.9402784015  
0.7542836086  
0.5336029577  
0.2935009727  
0.05122547914  
-0.1760002007  
-0.3729056995  
-0.5277708151  
-0.6335098374  
-0.6881403141  
-0.6946073929  
-0.6600367541  
-0.5945536082  
-0.5098339557  
-0.4176043746  
-0.3282657471  
-0.2498084293  
-0.1871313513  
-0.141817065  
-0.1123557688  
-0.09476602599  
-0.08350026017  
-0.07250790577  
-0.05630440421  
-0.03091125319  
0.005455075203  
0.05202669009  
0.1054993599  
0.1603983409  
0.2097445141  
0.2459166761  
0.2615904066  
0.2506369346  
0.2088581449  
0.1344857311  
0.02840187911  
-0.1059226794  
-0.2627380031  
-0.4344998297  
-0.6124591483  
-0.7872852209  
-0.949654944  
-1.090777618  
-1.202836211  
-1.27935176  
-1.315480413  
-1.308257369  
-1.256790602  
-1.162395416  
-1.028642535  
-0.8612930613  
-0.6680807976  
-0.4583284889  
-0.2423913687  
-0.03096315138  
0.1657082493  
0.3386053304  
0.4806448943  
0.587201495  
0.6563811628  
0.6890057847  
0.6883085526  
0.659381085  
0.6084555954  
0.5421347107  
0.4666745453  
0.3874295306  
0.3085288963  
0.2328127353  
0.1620192228  
0.09714466896  
0.03890559453  
-0.01182242633  
-0.05368243092  
-0.08470455326  
-0.1024134911  
-0.1041536236  
-0.08758941413  
-0.05127786017  
0.004791850375  
0.07881653611  
0.1670402442  
0.2639306119  
0.3626568549  
0.4558398956  
0.5364569465  
0.5987783663  
0.6391781758  
0.6566920325  
0.6532129461  
0.6332856185  
0.6035148996  
0.5716572744  
0.5455215245  
0.5318282277  
0.5351761188  
0.5572533492  
0.5963934029  
0.6475365602  
0.7025949519  
0.7511975757  
0.781735313  
0.7826032068  
0.7435154072  
0.6567763741  
0.5183536924  
0.3286529886  
0.09288323577  
-0.179055981  
-0.4731815885  
-0.7725195805  
-1.058586074  
-1.313137784  
-1.520008288  
-1.666830476  
-1.746435158  
-1.757741476  
-1.706000938  
-1.602324167  
-1.462506977  
-1.305261324  
-1.150042772  
-1.014718374  
-0.91336903  
-0.8545000268  
-0.8399134441  
-0.8644052006  
-0.9163511839  
-0.9791439115  
-1.033300759  
-1.058998003  
-1.038697745  
-0.9595281121  
-0.8150988749  
-0.6065015317  
-0.3423645422  
-0.03794289975  
0.2866334209  
0.6087199755  
0.9058121966  
1.158144384  
1.350894374  
1.475703792  
1.531346192  
1.523463355  
1.46344559  
1.3666214  
1.250029842  
1.130078123  
1.020400402  
0.9301969551  
0.8632454289  
0.8176915936  
0.7866101447  
0.7592325644  
0.7226468422  
0.663730816  
0.5710585797  
0.4365410549  
0.2566015792  
0.03277051114  
-0.2283490534  
-0.5156999243  
-0.8148670693  
-1.109497646  
-1.382860256  
-1.619362269  
-1.805869771  
-1.932709606  
-1.99428158  
-1.989261017  
-1.920414243  
-1.794081943  
-1.619415568  
-1.407455333  
-1.170144362  
-0.9193725445  
-0.6661224753  
-0.4197826959  
-0.1876724665  
0.02518944522  
0.2160815621  
0.384348744  
0.5309902117  
0.6581290793  
0.7684328731  
0.8645619774  
0.9487181706  
1.022340171  
1.085976118  
1.139331864  
1.181460095  
1.21104831  
1.22673954  
1.227428098  
1.212486859  
1.181897852  
1.136288747  
1.076883832  
1.005422647  
0.9240519228  
0.8352517785  
0.7417858014  
0.6466757587  
0.5531773869  
0.4647175202  
0.384759868  
0.3165754057  
0.2629139776  
0.225614522  
0.2052070646  
0.2005886834  
0.2088625825  
0.2254059064  
0.2442173367  
0.2585256949  
0.2616067177  
0.2476949259  
0.2128357816  
0.1555357143  
0.07705748271  
-0.01870527705  
-0.1258022544  
-0.2371736945  
-0.3458202854  
-0.4460023334  
-0.5342413512  
-0.6099300393  
-0.6754050897  
-0.7354469656  
-0.7962613333  
-0.8641077038  
-0.9438204193  
-1.037487121  
-1.143559237  
-1.256578793  
-1.367628609  
-1.465460134  
-1.53815616  
-1.575064029  
-1.568684771  
-1.516190493  
-1.42030773  
-1.289370899  
-1.13650737  
-0.978045137  
-0.8313454018  
-0.7123820489  
-0.6334124316  
-0.6010940954  
-0.6153253919  
-0.6689885128  
-0.7486469447  
-0.8361045932  
-0.9106147228  
-0.9514401956  
-0.9404199498  
-0.8642006237  
-0.7158625779  
-0.4957388553  
-0.2113650874  
0.1233975433  
0.4899132127  
0.8667578916  
1.231872988  
1.564617597  
1.847481827  
2.067303059  
2.215911894  
2.290206576  
2.291747724  
2.22600264  
2.101393822  
1.928297611  
1.71812527  
1.482541228  
1.232861919  
0.9796146494  
0.7322102743  
0.4986836325  
0.2854640837  
0.09715252188  
-0.06366644621  
-0.1965464633  
-0.3031637189  
-0.3871087606  
-0.4534515479  
-0.508071953  
-0.556812484  
-0.6045512798  
-0.65431804  
-0.7066182542  
-0.7590865871  
-0.8065789213  
-0.8417281396  
-0.8559301193  
-0.8406418144  
-0.788815522  
-0.69626501  
-0.5627440826  
-0.3925626418  
-0.194617898  
0.01819173488  
0.2301205237  
0.4241621206  
0.5838719323  
0.6951921935  
0.7480490917  
0.7375198489  
0.6644272988  
0.5352909116  
0.3616535326  
0.1588652764  
-0.05551469586  
-0.2635124664  
-0.4485224793  
-0.5968866328  
-0.6990965965  
-0.7505217327  
-0.7515963763  
-0.7074734859  
-0.6272102337  
-0.5225925045  
-0.4067386172  
-0.2926424897  
-0.1918143959  
-0.113166841  
-0.06225383925  
-0.0409476965  
-0.0475635936  
-0.07741640973  
-0.1237171244  
-0.1786888088  
-0.2347428167  
-0.2855450291  
-0.326815804  
-0.3567409208  
-0.3759277249  
-0.3869148032  
-0.3933111853  
-0.3987189177  
-0.4056282157  
-0.4144918767  
-0.423167095  
-0.4268603623  
-0.4186189563  
-0.3903276566  
-0.3340760881  
-0.2436822536  
-0.1161255447  
0.04735735878  
0.24072154  
0.4532282113  
0.670252803  
0.8746978768  
1.048840123  
1.176361952  
1.244290135  
1.244581432  
1.175134616  
1.040096064  
0.8494211547  
0.6177546434  
0.3627822969  
0.1032811374  
