0.0657128044  
0.2802865328  
0.4759325159  
0.6456677417  
0.7864752294  
0.8996323968  
0.9901578041  
1.065431064  
1.133242494  
1.199644138  
1.267055226  
1.333003434  
1.389831443  
1.425483444  
1.425315292  
1.374667348  
1.261810716  
1.080773988  
0.8335586803  
0.5313327988  
0.1943311743  
-0.1496364936  
-0.4679213504  
-0.7267284587  
-0.8952697151  
-0.9498405889  
-0.87722601  
-0.6769738111  
-0.3621513011  
0.04156292736  
0.4983729536  
0.966188816  
1.401282623  
1.763236339  
2.019530657  
2.149204576  
2.145160253  
2.014777288  
1.778818915  
1.468733518  
1.122708194  
0.780948971  
0.4807673617  
0.2520741087  
0.113853117  
0.07202917712  
0.1190369013  
0.2351244219  
0.3912424159  
0.5531204092  
0.6859842776  
0.7592850015  
0.7507446965  
0.6492024584  
0.45585785  
0.1837872341  
-0.1441601938  
-0.4987114512  
-0.8482659213  
-1.163085663  
-1.419039445  
-1.600347654  
-1.701075316  
-1.725209811  
-1.685447345  
-1.600939995  
-1.49439769  
-1.388968172  
-1.30534742  
-1.259455048  
-1.260913579  
-1.312450779  
-1.410155595  
-1.544462728  
-1.701605307  
-1.86528872  
-2.018337954  
-2.144119448  
-2.227671551  
-2.256494399  
-2.221092226  
-2.115339817  
-1.936804272  
-1.68705762  
-1.372016483  
-1.002209904  
-0.5928718632  
-0.1636702125  
0.2620672329  
0.6587448548  
1.000496366  
1.26367377  
1.429564769  
1.486975452  
1.434256444  
1.280383644  
1.044778999  
0.755730342  
0.4475165445  
0.1564879758  
-0.08335137883  
-0.2446729825  
-0.310400654  
-0.2759681182  
-0.1498741813  
0.04761276131  
0.2874161522  
0.5358822595  
0.7595981798  
0.9300791982  
1.027577207  
1.043416116  
0.9805195971  
0.8520768112  
0.6786347388  
0.4841388056  
0.2916383615  
0.119406058  
-0.02186800804  
-0.1303360616  
-0.2125044021  
-0.2811297193  
-0.3519021152  
-0.4394957013  
-0.5537539613  
-0.6966738821  
-0.8607817022  
-1.029225173  
-1.17760062  
-1.277302406  
-1.299804995  
-1.221252234  
-1.026584157  
-0.7125173263  
-0.2889443061  
0.2215090069  
0.7856904192  
1.363550185  
1.912645735  
2.392877986  
2.770793663  
3.022878884  
3.137470868  
3.115105515  
2.96736902  
2.714525957  
2.382352177  
1.998690895  
1.590240501  
1.180023568  
0.7858363075  
0.4197877768  
0.08887945753  
-0.2036638844  
-0.4566477924  
-0.6692050317  
-0.8395012669  
-0.9641678023  
-1.038559304  
-1.057766426  
-1.018149229  
-0.9190064876  
-0.7639699726  
-0.5617484088  
-0.32599205  
-0.07421820201  
0.1740287234  
0.3994963896  
0.5855609945  
0.7201701966  
0.7970369473  
0.8159029751  
0.7818580435  
0.7039204447  
0.5932041967  
0.4610500829  
0.3174821802  
0.1702708004  
0.02468622776  
-0.1160874236  
-0.2500774502  
-0.3754550077  
-0.489601241  
-0.5885385961  
-0.6669234477  
-0.7186129218  
-0.7377244124  
-0.7199814317  
-0.66404795  
-0.5725925648  
-0.4527940233  
-0.3161555949  
-0.1775750595  
-0.05376557353  
0.03875962086  
0.08585204735  
0.07771065576  
0.0103747594  
-0.1135182764  
-0.2848463468  
-0.4889826598  
-0.7075435795  
-0.9206336872  
-1.109283832  
-1.257711436  
-1.355082449  
-1.396502642  
-1.383114362  
-1.321299505  
-1.221184012  
-1.094689186  
-0.9535324065  
-0.8074964687  
-0.6633015962  
-0.5242209171  
-0.3904726662  
-0.2602473279  
-0.131115837  
-0.001479299055  
0.1282285292  
0.2548722704  
0.3725821473  
0.4733654078  
0.5482513335  
0.5886910611  
0.5880192989  
0.5426450454  
0.4528139688  
0.3228065489  
0.1605663327  
-0.02317979895  
-0.216138813  
-0.4058211283  
-0.5808717764  
-0.7321648468  
-0.8535570892  
-0.9422001381  
-0.9984195302  
-1.02521826  
-1.027467244  
-1.010964367  
-0.9814691904  
-0.9438537461  
-0.9015228244  
-0.8561251941  
-0.8076215306  
-0.7546515127  
-0.6951359028  
-0.6269749951  
-0.5487470552  
-0.460245998  
-0.3627838687  
-0.2592075854  
-0.1536159682  
-0.05081988649  
0.04435672601  
0.127830726  
0.1969497068  
0.2510045099  
0.2914671557  
0.3219314051  
0.3477330494  
0.3753160042  
0.4114356711  
0.4622995393  
0.5327947662  
0.6258878012  
0.7422841187  
0.8803706952  
1.036432427  
1.205087575  
1.379853928  
1.553755009  
1.719866582  
1.87173618  
2.003632282  
2.110616513  
2.18847535  
2.233569831  
2.242703659  
2.21307311  
2.142382829  
2.029132777  
1.873072992  
1.675710732  
1.440793809  
1.174606627  
0.8859853171  
0.5859573039  
0.2870298716  
0.002155789108  
-0.2564759839  
-0.478654857  
-0.6572063948  
-0.7886893374  
-0.8736384346  
-0.9162810635  
-0.9237400332  
-0.9048613978  
-0.8687928653  
-0.8235892207  
-0.775055211  
-0.7260467363  
-0.676399999  
-0.6234924596  
-0.563386052  
-0.492324909  
-0.4082826797  
-0.3122377462  
-0.2088503374  
-0.1063325822  
-0.01548391359  
0.05202008079  
0.08574735905  
0.07864182311  
0.02874309507  
-0.05993065572  
-0.1775241292  
-0.3095883162  
-0.4392019427  
-0.5496169342  
-0.6269350843  
-0.6623167204  
-0.6533015574  
-0.6040227276  
-0.524287827  
-0.4277436813  
-0.3295009726  
-0.2437060711  
-0.1814949107  
-0.1496976399  
-0.1504503964  
-0.1816760659  
-0.2382394253  
-0.3133997047  
-0.4002353593  
-0.4926707981  
-0.5859706743  
-0.6766191358  
-0.7617540772  
-0.8383782841  
-0.9026503886  
-0.9495173366  
-0.9728536866  
-0.9661404997  
-0.9235766416  
-0.8413833814  
-0.7190307102  
-0.560068351  
-0.3723654961  
-0.1676255427  
0.03978075904  
0.2345072901  
0.402186203  
0.5313275672  
0.6148603965  
0.6510606369  
0.6437204328  
0.6015557064  
0.536929553  
0.464088755  
0.3971854168  
0.3483526368  
0.3260851011  
0.3341397466  
0.371095207  
0.4306038179  
0.5023206747  
0.5734102753  
0.6303941431  
0.6611864954  
0.6569629692  
0.6136449707  
0.5327300097  
0.4213083085  
0.2912212301  
0.1574187111  
0.03575526158  
-0.05946562875  
-0.1177697491  
-0.1342556355  
-0.1104669175  
-0.05420763016  
0.02167565325  
0.101357976  
0.1686085384  
0.2094079831  
0.214165025  
0.1791408819  
0.1068464925  
0.005357056837  
-0.1133121589  
-0.2354473549  
-0.3480934967  
-0.441276722  
-0.5096045192  
-0.5529775515  
-0.5763190458  
-0.5883856324  
-0.5998942448  
-0.6213288121  
-0.6607813826  
-0.7222362973  
-0.8045724567  
-0.9014593766  
-1.002146837  
-1.093053487  
-1.159837429  
-1.189658994  
-1.173221135  
-1.106279113  
-0.9903463666  
-0.832500906  
-0.6443295511  
-0.4401841276  
-0.2350712788  
-0.04251693047  
0.1272294825  
0.2683580854  
0.3798631563  
0.4650865213  
0.5305274889  
0.5841745265  
0.6336280291  
0.6843402166  
0.7382684751  
0.7931347003  
0.8424227749  
0.8761377725  
0.8822119596  
0.8484018162  
0.7644232117  
0.6240290127  
0.4267521379  
0.1790437588  
-0.1053932812  
-0.4062031366  
-0.697909361  
-0.952278453  
-1.141312518  
-1.240519956  
-1.232111225  
-1.107689091  
-0.870021024  
-0.5336009409  
-0.1237732439  
0.3255806533  
0.77562051  
1.187016864  
1.524755429  
1.76263911  
1.886824483  
1.897829921  
1.810649298  
1.652853047  
1.460866497  
1.27490833  
1.13327196  
1.066776718  
1.094204569  
1.219390083  
1.430430802  
1.701128585  
1.99448109  
2.267704378  
2.478066075  
2.588680354  
2.573455283  
2.420491266  
2.133505326  
1.731134169  
1.244275355  
0.7119115181  
0.1760530359  
-0.3234959438  
-0.7538033462  
-1.092350235  
-1.328993557  
-1.466217594  
-1.517709009  
-1.505590663  
-1.456742132  
-1.398799523  
-1.356387686  
-1.348108378  
-1.384625955  
-1.468050934  
-1.59257663  
-1.746158538  
-1.912893999  
-2.075666151  
-2.218626733  
-2.329163094  
-2.399099581  
-2.425060886  
-2.408031525  
-2.352300089  
-2.264055301  
-2.149912476  
-2.01566346  
-1.865446794  
-1.701474234  
-1.524306537  
-1.333592001  
-1.129082062  
-0.9116911561  
-0.6843492057  
-0.4524753219  
-0.2238917501  
-0.008231891793  
0.1841368093  
0.3434480513  
0.4619295815  
0.5350005081  
0.5620637722  
0.5467983607  
0.4968835579  
0.4232373413  
0.3388977732  
0.2576927501  
0.1928828127  
0.1559230453  
0.1554297314  
0.1964422567  
0.2799717234  
0.4029020924  
0.5581991576  
0.73544639  
0.9216935439  
1.102573048  
1.263623275  
1.391694262  
1.476296951  
1.510738895  
1.492881709  
1.425422004  
1.315632757  
1.174591325  
1.015994829  
0.854694975  
0.7051515422  
0.579969777  
0.4886764877  
0.4368510789  
0.4256872816  
0.4519769283  
0.5085287248  
0.584938374  
0.6686544465  
0.7462231014  
0.8046239897  
0.8325618419  
0.8216180654  
0.7671367121  
0.6687741086  
0.5306290532  
0.3609394417  
0.1713583009  
-0.0241603385  
-0.2107376159  
-0.3741364808  
-0.5023093586  
-0.5868150701  
-0.623888387  
-0.6150470631  
-0.5670898113  
-0.4914287584  
-0.402795072  
-0.3173912465  
-0.2507196258  
-0.2153563146  
-0.2190008328  
-0.2631060241  
-0.3423864416  
-0.4453131137  
-0.5556217762  
-0.6546265189  
-0.7240356454  
-0.7487898096  
-0.7194811417  
-0.6339153326  
-0.4975376034  
-0.3226390713  
-0.1264554909  
0.07147370217  
0.252254878  
0.4003507103  
0.5055913332  
0.5641489977  
0.5783527144  
0.5554208041  
0.5054406668  
0.4389938008  
0.3649478407  
0.288823939  
0.2120700011  
0.1323182418  
0.04455621135  
-0.0571033069  
-0.1774364167  
-0.3183763282  
-0.4778858652  
-0.6497076461  
-0.8240241787  
-0.9889005235  
-1.132219259  
-1.24368763  
-1.316536004  
-1.348558533  
-1.342299358  
-1.304380386  
-1.24409803  
-1.17160833  
-1.096044337  
-1.023937948  
-0.9582692076  
-0.8982776475  
-0.8401220673  
-0.778195499  
-0.7068883024  
-0.6224141542  
-0.5243312481  
-0.4164280215  
-0.3067034959  
-0.2063635711  
-0.1278893852  
-0.08245749784  
-0.0771059816  
-0.1121669949  
-0.1794920219  
-0.2619244609  
-0.334286574  
-0.3659450972  
-0.3246932172  
-0.18150158  
0.08458698321  
0.4821507667  
1.004430965  
1.628249965  
2.315128613  
3.014550537  
3.669025888  
4.220270816  
4.615743242  
4.814609536  
4.792384503  
4.543644956  
4.082512516  
3.44092313  
2.664963351  
1.809847608  
0.9342043645  
0.09438090704  
-0.6605360725  
-1.292536156  
-1.776983106  
-2.103351393  
-2.274483983  
-2.304679176  
-2.216945915  
-2.0398498  
-1.80432576  
-1.540776634  
-1.276684918  
-1.034842983  
-0.8322710539  
-0.6797470091  
-0.5818714875  
-0.5375741518  
-0.5409291839  
-0.5822069381  
-0.6490752226  
-0.7279008527  
-0.8050821864  
-0.8683373837  
-0.9078708477  
-0.91729083  
-0.8941910033  
-0.8402933787  
-0.7611186738  
-0.6651986667  
-0.5629323879  
-0.4652165176  
-0.3820511726  
-0.3212924762  
-0.287734143  
-0.2826042097  
-0.3035261916  
-0.3449383961  
-0.3988520087  
-0.4558740415  
-0.5063229475  
-0.5413080974  
-0.5536744516  
-0.5386712255  
-0.4943403994  
-0.4215679409  
-0.3238393696  
-0.2067552118  
-0.07738042452  
0.0564654328  
0.186915368  
0.3066823365  
0.409561271  
0.4908146677  
0.5474146287  
0.5781760998  
0.5837604525  
0.5665713286  
0.5305094697  
0.4806093807  
0.4225642023  
0.3621803357  
0.3048314185  
0.2549889448  
0.2159116438  
0.1895311207  
0.1765732343  
0.1768440958  
0.189621357  
0.2140351837  
0.2493218647  
0.2948650752  
0.3500081525  
0.4136410943  
0.4836906266  
0.55663812  
0.6272447685  
0.6886303348  
0.7327811755  
0.7514969654  
0.7376547128  
0.6866016466  
0.59739941  
0.4736419835  
0.3236132496  
0.1596518072  
-0.003272359472  
-0.1495941401  
-0.2655021756  
-0.3411901087  
-0.3725970616  
-0.3622835036  
-0.3192039221  
-0.2573819926  
-0.1936399548  
-0.1447628332  
-0.124598108  
-0.1415873395  
-0.1972192494  
-0.2856761327  
-0.3947811881  
-0.5080648021  
-0.6076108845  
-0.6771495695  
-0.7048621424  
-0.6853720081  
-0.6206063707  
-0.5193708816  
-0.3957588998  
-0.2667022775  
-0.1491269117  
-0.05725729061  
-0.0005130520427  
0.0176417589  
-0.0002499024748  
-0.04660531958  
-0.1105272563  
-0.1799016812  
-0.2434355678  
-0.2922527324  
-0.3207972588  
-0.3269988364  
-0.311766163  
-0.2780820548  
-0.229996298  
-0.171796705  
-0.1075575029  
-0.04111399161  
0.02364754707  
0.08239738335  
0.1301036972  
0.1611690247  
0.1700382576  
0.1522598327  
0.105805527  
0.03231399995  
-0.06206291507  
-0.1665552578  
-0.26656358  
-0.3453637497  
-0.3865015943  
-0.3765103299  
-0.3074685828  
-0.1788997286  
0.001379212088  
0.2177155014  
0.4483661612  
0.6683338529  
0.8528437213  
0.9809302306  
1.038545956  
1.020661318  
0.932043492  
0.7865583766  
0.6051223912  
0.4126349984  
0.234390839  
0.09252874869  
0.003063299048  
-0.0260871565  
0.004174569505  
0.0846875166  
0.1997021809  
0.3293589028  
0.4525281557  
0.5496093945  
0.604882247  
0.6081610427  
0.5556058672  
0.4497031182  
0.2985526153  
0.1146491677  
-0.086614107  
-0.2885158808  
-0.474463  
-0.6293013047  
-0.7403874919  
-0.7984731237  
-0.7983811448  
-0.7394822293  
-0.6259178619  
-0.4665202655  
-0.2743095496  
-0.06556512788  
0.141578257  
0.3288872627  
0.4799749651  
0.5821982167  
0.6282095639  
0.6169064033  
0.5536081884  
0.4493552026  
0.3194165074  
0.1812007055  
0.05186022815  
-0.0540552436  
-0.1265464204  
-0.1614364893  
-0.1607750363  
-0.1323563085  
-0.08840836723  
-0.04368697674  
-0.01324690141  
-0.01022502725  
-0.04394694272  
-0.1186013817  
-0.2326678977  
-0.3791174294  
-0.5463495417  
-0.7196975173  
-0.8832697115  
-1.021870454  
-1.122756494  
-1.176998464  
-1.180322912  
-1.133348322  
-1.041250489  
-0.9129102103  
-0.759706782  
-0.5941087525  
-0.4282412483  
-0.2726120467  
-0.1351151038  
-0.02045548735  
0.07000909335  
0.1379649885  
0.1874777373  
0.2240698005  
0.2536649118  
0.281594775  
0.3117686406  
0.3461536616  
0.3846022479  
0.4250480071  
0.4640088725  
0.4972926858  
0.5207811792  
0.5311462331  
0.52636463  
0.5059589901  
0.4709121492  
0.4232886324  
0.3656557202  
0.3004336573  
0.2293233378  
0.1529759936  
0.0709738238  
-0.01780543391  
-0.1145371558  
-0.2196061108  
-0.3317587024  
-0.447472689  
-0.5606834567  
-0.6630059916  
-0.7444502125  
-0.794582203  
-0.8039264198  
-0.7654128141  
-0.6756315578  
-0.5356463415  
-0.3512564674  
-0.1326090651  
0.1067716726  
0.3514048347  
0.5855269877  
0.7947647086  
0.9675679552  
1.096239104  
1.177424445  
1.21203998  
1.204704496  
1.162777505  
1.095165617  
1.011088658  
0.9189282049  
0.8253412559  
0.7346771886  
0.6487998293  
0.5672680977  
0.4878528402  
0.4072833121  
0.3221106999  
0.2295384927  
0.1281132055  
0.01812793542  
-0.09826693051  
-0.2173098001  
-0.3341380085  
-0.4434956835  
-0.5404971954  
-0.6213267661  
-0.6837833837  
-0.7275501871  
-0.7542060769  
-0.7669552064  
-0.7701434613  
-0.7686310358  
-0.767096771  
-0.769359033  
-0.7777917198  
-0.7928688084  
-0.8128913891  
-0.8339291494  
-0.8499885352  
-0.8534164097  
-0.8355569099  
-0.7876160563  
-0.7016912374  
-0.571895542  
-0.3954535499  
-0.173650658  
0.08750657205  
0.3770234256  
0.6791676017  
0.9742590421  
1.24001688  
1.453394828  
1.592746423  
1.640162695  
1.583689638  
1.419180019  
1.151492766  
0.7948329078  
0.3720860427  
-0.08685571503  
-0.54765125  
-0.9747073215  
-1.334636415  
-1.599592429  
-1.750052652  
-1.776716211  
-1.681290049  
-1.476067464  
-1.182376785  
-0.8280993753  
-0.4445841627  
-0.0633288334  
