0.5848432781  
1.544390778  
2.443437379  
3.230155057  
3.863298603  
4.315771037  
4.576537261  
4.650754039  
4.558183989  
4.330198191  
4.005819834  
3.627339593  
3.236041999  
2.868496361  
2.553741799  
2.311551178  
2.151803174  
2.074850875  
2.072726576  
2.130893721  
2.230331967  
2.349692652  
2.467354751  
2.563219057  
2.62017285  
2.625156758  
2.569846339  
2.450936879  
2.270076748  
2.033469269  
1.751201397  
1.436339596  
1.103862262  
0.7694899505  
0.4485075632  
0.1546482133  
-0.1008541394  
-0.3099874911  
-0.4683860065  
-0.5754289749  
-0.634014769  
-0.6500425625  
-0.6316775366  
-0.5884783245  
-0.5304947396  
-0.4674293998  
-0.4079331617  
-0.3590982987  
-0.3261529865  
-0.3123544771  
-0.3190516405  
-0.3458764327  
-0.3910127125  
-0.4515245913  
-0.5237190808  
-0.603523187  
-0.6868814934  
-0.7701560005  
-0.8505148087  
-0.9262626769  
-0.9970792748  
-1.06409422  
-1.129763976  
-1.197502508  
-1.271091385  
-1.353895196  
-1.447998361  
-1.553377828  
-1.667264378  
-1.783847573  
-1.894422948  
-1.988029389  
-2.052559602  
-2.076220019  
-2.049158517  
-1.965029687  
-1.822244055  
-1.624694399  
-1.38180297  
-1.10785403  
-0.8206508447  
-0.5396772417  
-0.2839976762  
-0.07016549256  
0.08957076685  
0.1885350923  
0.2262239071  
0.2081564287  
0.1450399057  
0.05136632056  
-0.05635639817  
-0.1615091947  
-0.2491744615  
-0.3076399337  
-0.329453016  
-0.311937641  
-0.257148511  
-0.1713253196  
-0.06393752337  
0.05353058207  
0.1689135015  
0.2706576172  
0.3489433194  
0.3965364163  
0.409304077  
0.3863894658  
0.3300438356  
0.2451934003  
0.1388121937  
0.01919061273  
-0.1048127155  
-0.2244564724  
-0.3316930534  
-0.4196070994  
-0.482722222  
-0.5172007912  
-0.5209521675  
-0.4937048047  
-0.4370341717  
-0.3543645387  
-0.2509089924  
-0.1335166339  
-0.01038265908  
0.1094234111  
0.2166189988  
0.3025419275  
0.3600956812  
0.3847123845  
0.3751786062  
0.3341904455  
0.2684897985  
0.1884778306  
0.1072683505  
0.0392256962  
-0.001885795235  
-0.004902256124  
0.03684405482  
0.1240653361  
0.2507619292  
0.4043750658  
0.5669427713  
0.7171834163  
0.8332996618  
0.8961250328  
0.8921711096  
0.816087132  
0.672104123  
0.474152092  
0.2445591095  
0.01140651161  
-0.195092997  
-0.3467206368  
-0.4212522926  
-0.4057254576  
-0.2984630425  
-0.1095140779  
0.1405750336  
0.4234799522  
0.7069148526  
0.9589685466  
1.152318977  
1.267715829  
1.296248554  
1.240110438  
1.111810655  
0.9320020941  
0.7263113579  
0.5216546706  
0.3425918168  
0.208220627  
0.1300106959  
0.1108105452  
0.1450854727  
0.220252582  
0.3188555707  
0.4212030296  
0.5080752827  
0.5631252386  
0.5746781471  
0.536744829  
0.4491923281  
0.3171413617  
0.1497671242  
-0.04127330504  
-0.2435136651  
-0.4452005468  
-0.6364868169  
-0.8101486764  
-0.9618063963  
-1.089680867  
-1.194004862  
-1.276229135  
-1.338203342  
-1.381463129  
-1.406762993  
-1.413886502  
-1.401766178  
-1.368842858  
-1.313585951  
-1.235061989  
-1.133436629  
-1.010313181  
-0.8688527466  
-0.7136404916  
-0.5503274176  
-0.3851102746  
-0.2241225788  
-0.07285073309  
0.06434614411  
0.1845277997  
0.2862472391  
0.3693973729  
0.4348755653  
0.4841285243  
0.5186740456  
0.5396741166  
0.5476574509  
0.5424263517  
0.5231738332  
0.4887827339  
0.4382542828  
0.3711816864  
0.2881766647  
0.1911637096  
0.08347394491  
-0.03029045411  
-0.1446212292  
-0.2536394812  
-0.3517323434  
-0.4341879769  
-0.4977235149  
-0.5408205372  
-0.5638038105  
-0.5686530878  
-0.5585661814  
-0.5373346984  
-0.5086577263  
-0.4754765348  
-0.439480051  
-0.4008483676  
-0.358312973  
-0.3095142925  
-0.2516353985  
-0.1821773718  
-0.09977416224  
-0.0048751959  
0.09983603632  
0.2093788356  
0.3168292459  
0.4140552895  
0.4927516301  
0.5456287287  
0.5675803591  
0.5566318095  
0.5145222801  
0.4467938506  
0.362347326  
0.2724994411  
0.1896543248  
0.1257531729  
0.09071432852  
0.09108331158  
0.1290646718  
0.2020907601  
0.3029830202  
0.4206931822  
0.5415405481  
0.6507804494  
0.7343251186  
0.7803807533  
0.7808247983  
0.7321410654  
0.6358195464  
0.4981690224  
0.3295877639  
0.1433785026  
-0.04573847783  
-0.2232289464  
-0.3762802654  
-0.4950890803  
-0.5737403354  
-0.6106075724  
-0.6082157344  
-0.5726205662  
-0.5123879193  
-0.4373197165  
-0.3571042853  
-0.2800687052  
-0.2122010603  
-0.1565662354  
-0.113182565  
-0.07937302052  
-0.05050651527  
-0.02103355028  
0.01436158311  
0.05965206393  
0.1165859189  
0.1841463085  
0.2584506593  
0.3331029722  
0.3999493655  
0.4501412457  
0.47535119  
0.4689663997  
0.4271054531  
0.3492937859  
0.2387143139  
0.1019910517  
-0.05147642268  
-0.2105259074  
-0.3634762466  
-0.499414996  
-0.6093761053  
-0.6872473595  
-0.7302894245  
-0.7392116235  
-0.7178076001  
-0.6722155101  
-0.6099308495  
-0.5387191652  
-0.465604162  
-0.396091082  
-0.3337340006  
-0.2801134693  
-0.235211889  
-0.198106929  
-0.1678410679  
-0.1442864232  
-0.1288095833  
-0.124591277  
-0.1364691494  
-0.1702985862  
-0.2318919638  
-0.3256959458  
-0.453435834  
-0.612981852  
-0.797683077  
-0.9963526104  
-1.193982239  
-1.373157336  
-1.515992758  
-1.606324157  
-1.631825867  
-1.585715024  
-1.467752013  
-1.284373065  
-1.047907104  
-0.7749932746  
-0.4844336513  
-0.1948303636  
0.07767101306  
0.3211560182  
0.5290147672  
0.7001779368  
0.8385041089  
0.9514808626  
1.048443091  
1.138623061  
1.229331926  
1.324548827  
1.42411698  
1.523649965  
1.615144578  
1.688185604  
1.731550604  
1.734977174  
1.690810839  
1.595312446  
1.44942854  
1.258921237  
1.03384857  
0.7874707541  
0.5347535858  
0.2906706492  
0.06854463776  
-0.1213492567  
-0.2727403869  
-0.3837736548  
-0.4568300748  
-0.4978139899  
-0.5150188526  
-0.517740373  
-0.5148438259  
-0.5134660261  
-0.5180472139  
-0.5297990335  
-0.5466961667  
-0.5639687097  
-0.5750338608  
-0.5727266743  
-0.5506581959  
-0.5044934663  
-0.4329526041  
-0.3383813619  
-0.2267728635  
-0.1072143742  
0.009189414554  
0.1107759217  
0.1869866452  
0.2299675211  
0.2358936382  
0.205775884  
0.1456256519  
0.06589874817  
-0.01973426477  
-0.09613969667  
-0.1487820989  
-0.1657939886  
-0.1397629724  
-0.06895318304  
0.04223920807  
0.1837048559  
0.3408939814  
0.4967960406  
0.6343668302  
0.7390620878  
0.8011086667  
0.8171442815  
0.7909580245  
0.73315163  
0.6597167381  
0.5896691154  
0.5420458527  
0.5326716719  
0.571183106  
0.6587849057  
0.7871289354  
0.9385756411  
1.087910384  
1.205354074  
1.260500094  
1.226675944  
1.0850761  
0.8280641107  
0.461086384  
0.002873203954  
-0.5162033913  
-1.057418665  
-1.578219985  
-2.037346387  
-2.399828855  
-2.641154001  
-2.750000211  
-2.729189502  
-2.594740276  
-2.373223675  
-2.097841213  
-1.803839221  
-1.523921869  
-1.284318197  
-1.102000362  
-0.9833835663  
-0.9245726725  
-0.9130127539  
-0.9301936088  
-0.9549516102  
-0.9668390834  
-0.949095263  
-0.8908323928  
-0.7882123807  
-0.6445365708  
-0.4693562279  
-0.2768020837  
-0.08343454535  
0.09406945813  
0.2410700329  
0.3467317552  
0.4051915784  
0.4160636369  
0.3842489231  
0.3191269626  
0.2332521499  
0.1407248085  
0.05543250434  
-0.01063700232  
-0.04881388105  
-0.05473782963  
-0.02880395905  
0.02400498237  
0.09487302044  
0.1724276422  
0.2443751138  
0.2992991725  
0.3283772071  
0.3267871861  
0.29457516  
0.2368519873  
0.163236279  
0.08659445063  
0.02121672899  
-0.01933633396  
-0.02440583601  
0.01189170003  
0.08940895502  
0.201556819  
0.3358534673  
0.4754338364  
0.6013210822  
0.6951862865  
0.7421771042  
0.7333942831  
0.6676032437  
0.5518838668  
0.4010652789  
0.2359798149  
0.08076871388  
-0.04038832376  
-0.106625934  
-0.1033300159  
-0.02421415975  
0.1277679828  
0.3408053167  
0.5958243156  
0.8690320758  
1.135014204  
1.369913466  
1.554241395  
1.674944168  
1.726473606  
1.710797581  
1.636418615  
1.516627332  
1.36729752  
1.204580407  
1.042833781  
0.8930456287  
0.7619445527  
0.6518283449  
0.561067439  
0.4851298395  
0.4178993307  
0.3530516023  
0.2852612715  
0.2110585334  
0.1292316922  
0.0407591069  
-0.05166845713  
-0.1444034585  
-0.2336995832  
-0.3164999347  
-0.3909892535  
-0.4568198271  
-0.5149605745  
-0.5672248654  
-0.6155740262  
-0.6613676811  
-0.7047286131  
-0.7441883373  
-0.7767310283  
-0.7982825163  
-0.8045860467  
-0.7923571709  
-0.7604970146  
-0.7111416486  
-0.6502981008  
-0.587872475  
-0.53698727  
-0.5125810218  
-0.5294252341  
-0.5997953465  
-0.7311394101  
-0.9241133836  
-1.171338637  
-1.457160241  
-1.758549865  
-2.047131498  
-2.292137218  
-2.463932219  
-2.53766444  
-2.496525934  
-2.334175328  
-2.055958159  
-1.678732852  
-1.229307756  
-0.7416652989  
-0.253329638  
0.1986655301  
0.5817229168  
0.8710557537  
1.052106187  
1.121764844  
1.088258664  
0.9697914836  
0.7921190926  
0.5853751155  
0.3805340224  
0.2059241622  
0.08418221794  
0.02998809019  
0.04880994809  
0.136773963  
0.2816504909  
0.464792153  
0.6637809516  
0.8554133411  
1.018657966  
1.137188808  
1.201175191  
1.208103413  
1.162533621  
1.074855935  
0.9592392436  
0.8310893055  
0.7044037769  
0.5894418505  
0.4910520214  
0.4079598682  
0.333114178  
0.2550740558  
0.1602421626  
0.03559126613  
-0.1285282837  
-0.3359684119  
-0.5831546637  
-0.8585656741  
-1.143456059  
-1.413765552  
-1.642994955  
-1.805616299  
-1.880550824  
-1.854175763  
-1.722413525  
-1.49159172  
-1.177938562  
-0.8058062933  
-0.4048744051  
-0.006745986562  
0.3585728374  
0.6658699069  
0.8971688748  
1.043166343  
1.103556202  
1.086262374  
1.005794592  
0.8809758278  
0.7324081214  
0.5799867102  
0.4407750808  
0.3274522989  
0.2474661744  
0.2029020863  
0.1910157011  
0.2052717073  
0.2367041035  
0.2753868826  
0.3118066289  
0.3379894112  
0.348251385  
0.3395463989  
0.3114146272  
0.2656100373  
0.2055107481  
0.1354373042  
0.05999983331  
-0.01644286559  
-0.09013111086  
-0.1580722952  
-0.2180230506  
-0.2683554212  
-0.3078617764  
-0.3355866844  
-0.3507105996  
-0.3525471968  
-0.3406375458  
-0.314930282  
-0.275996333  
-0.2252162336  
-0.1648948732  
-0.09825434178  
-0.02927752058  
0.0375923714  
0.09785804722  
0.1474388716  
0.183132904  
0.2029969566  
0.2065928333  
0.1950500084  
0.1709410312  
0.1379770478  
0.1005791138  
0.06337326857  
0.03069380654  
0.006150817285  
-0.007691727027  
-0.009488030978  
0.0008531182047  
0.02226114173  
0.05269308551  
0.08937049806  
0.1290456906  
0.1682602553  
0.203589987  
0.2318697263  
0.2504069525  
0.2571769913  
0.2509986095  
0.2316766182  
0.2000808408  
0.1581422325  
0.108739231  
0.05546846182  
0.002310584437  
-0.04677583939  
-0.08827254079  
-0.1194760459  
-0.1387552181  
-0.1456570971  
-0.140828005  
-0.1257814966  
-0.102544455  
-0.07327891547  
-0.03993819086  
-0.004055506483  
0.03330451294  
0.07141635899  
0.1096212358  
0.1470041221  
0.1821022826  
0.212762485  
0.2362113718  
0.249381499  
0.2494453377  
0.2344927027  
0.2041788493  
0.1602238342  
0.1065839912  
0.04920648763  
-0.004665603108  
-0.04758177132  
-0.07321839238  
-0.07774772339  
-0.06097473954  
-0.0270237568  
0.01565000807  
0.05498604829  
0.07677859835  
0.06669993308  
0.01261455224  
-0.09316290729  
-0.2520581897  
-0.4581991241  
-0.6983922858  
-0.953214166  
-1.199102137  
-1.411206958  
-1.56659416  
-1.647323442  
-1.642940012  
-1.551977376  
-1.382248175  
-1.149870472  
-0.8771927384  
-0.5899354359  
-0.3139883699  
-0.07234443357  
0.1174108831  
0.2447371546  
0.3067305342  
0.3076849825  
0.2577771255  
0.1711497512  
0.06372235532  
-0.04893624675  
-0.1533836169  
-0.2395499303  
-0.3013488755  
-0.3366918628  
-0.3469959659  
-0.3363611492  
-0.3105924054  
-0.2762371389  
-0.2397634998  
-0.2069588393  
-0.1825544727  
-0.1700444613  
-0.1716478005  
-0.1883278585  
-0.2198283625  
-0.2646741471  
-0.3201601891  
-0.382344609  
-0.4460972615  
-0.5052611297  
-0.5529688194  
-0.5821203892  
-0.5860145117  
-0.5590663858  
-0.4975255716  
-0.4001051078  
-0.2683968728  
-0.1070147235  
0.07659628733  
0.2726828391  
0.4699895722  
0.6567595481  
0.8218119884  
0.9555689346  
1.05090302  
1.103721057  
1.113204428  
1.081727085  
1.014454257  
0.9187047109  
0.8031647607  
0.6770557206  
0.5493311498  
0.4279935567  
0.3195694617  
0.2287610733  
0.1582870186  
0.1088790208  
0.07942668134  
0.06723190532  
0.06835102936  
0.07800540372  
0.09103892251  
0.1023960083  
0.1076017043  
0.1031980887  
0.08710829469  
0.05887615376  
0.01974696977  
-0.02743142005  
-0.07850147841  
-0.1284471077  
-0.1719699303  
-0.2041069221  
-0.2208127608  
-0.2194260968  
-0.1989483713  
-0.1600835381  
-0.105061035  
-0.03724373155  
0.03938620768  
0.1207868376  
0.2033580468  
0.284306464  
0.3618047045  
0.4349423588  
0.5034773059  
0.5674583537  
0.6268108002  
0.6809667039  
0.7286426151  
0.7678073018  
0.7958696076  
0.8100434389  
0.8078397623  
0.7875781587  
0.7488293598  
0.6926882712  
0.6218325062  
0.5403255576  
0.4532144563  
0.3659677277  
0.2838503352  
0.2113392645  
0.1516495766  
0.1064638461  
0.07585549939  
0.05842431484  
0.05158443051  
0.0519450222  
0.05572336819  
0.05911175047  
0.0585693742  
0.05101619632  
0.03393465129  
0.005410447993  
-0.03586512044  
-0.09057320714  
-0.1587258482  
-0.2395779831  
-0.3315243421  
-0.4320039996  
-0.5374612821  
-0.6434184039  
-0.7446875418  
-0.835738752  
-0.911213127  
-0.9665222563  
-0.9984674998  
-1.005762472  
-0.9893847527  
-0.9526498316  
-0.9009738574  
-0.8413228536  
-0.7813872681  
-0.7286091686  
-0.6891767036  
-0.6671529641  
-0.6638802181  
-0.677763875  
-0.7044865437  
-0.7376370367  
-0.769671853  
-0.7930606599  
-0.8014570636  
-0.7907038986  
-0.7595293948  
-0.7098205722  
-0.6464451721  
-0.5766304355  
-0.5090245376  
-0.4525468742  
-0.4152207908  
-0.4031316578  
-0.4196580318  
-0.4650597713  
-0.5364574403  
-0.6281789344  
-0.7324147286  
-0.8400673308  
-0.9416772918  
-1.028333923  
-1.09244228  
-1.128310872  
-1.132504472  
-1.103959232  
-1.043886797  
-0.9554902538  
-0.8435468796  
-0.7139010968  
-0.5729107278  
-0.4268923863  
-0.2816007467  
-0.1417731556  
-0.01076995256  
0.1096645218  
0.2194882822  
0.3202967215  
0.4150783548  
0.5078082271  
0.6028996195  
0.7045661945  
0.816137408  
0.9394354169  
1.074268714  
1.218143039  
1.366244542  
1.511732258  
1.646346746  
1.761268845  
1.848172671  
1.900328931  
1.913622581  
1.887346139  
1.824620761  
1.73237807  
1.620831004  
1.502486957  
1.390781496  
1.298480301  
1.236054955  
1.210235474  
1.222941377  
1.270759274  
1.345052668  
1.432720139  
1.517525206  
1.581828619  
1.608507607  
1.582801854  
1.493841259  
1.33565346  
1.107533313  
0.8137535184  
0.4627156352  
0.06572109124  
-0.3643925925  
-0.8144842543  
-1.271984762  
-1.725285168  
-2.163589437  
-2.576367554  
-2.952599918  
-3.280110561  
-3.545287173  
-3.733405509  
-3.829675018  
-3.820936089  
-3.697783839  
-3.456739703  
-3.102036169  
-2.646581675  
-2.111807013  
-1.526254584  
-0.923028469  
