1215.029881  
1384.931438  
1739.294648  
2552.639687  
5822.231156  
50261.15308  
18824.84182  
14091.16961  
7664.716751  
47313.25694  
4539.217838  
1275.189172  
22403.18587  
9182.343771  
34448.23906  
12731.30094  
31723.47953  
10235.11243  
8600.611238  
29977.62662  
15148.61773  
5265.210095  
5520.202798  
13231.94868  
15708.69955  
1016.455461  
1078.428689  
2835.778486  
9509.33229  
1503.207421  
1750.577265  
2159.958038  
2625.132307  
6481.763106  
7007.1675  
490.1725392  
2692.460389  
354.7689711  
5886.546121  
3315.898876  
3141.437995  
9234.136593  
1082.377109  
4743.407374  
4077.80174  
1288.577453  
1518.951933  
397.3237213  
8919.328087  
3235.09141  
3119.707578  
10080.5775  
1520.827611  
346.6890015  
918.7933405  
2137.312562  
1110.311129  
223.7540153  
3680.762649  
3338.911147  
391.4416479  
989.6772098  
720.8423877  
257.2910105  
477.3935922  
93.69591934  
189.8522657  
198.0213913  
139.6206367  
29.71644929  
61.25622922  
11.89023774  
48.93090304  
34.46830101  
41.99021026  
21.9756131  
17.85510387  
3.069742859  
9.108702116  
1.135925684  
5.832625708  
3.113731788  
4.647098577  
4.375983794  
3.964056513  
3.571908425  
3.340212912  
2.173161113  
2.287465619  
1.795706763  
1.876937299  
1.609070508  
1.792945922  
1.929052547  
1.629288408  
1.77068233  
1.605343872  
1.47735469  
1.47001257  
1.394639829  
1.415715366  
1.3100498  
1.357870193  
1.281667513  
1.251267687  
1.236745807  
1.209694539  
1.157306043  
1.12390991  
1.101705276  
1.072142186  
1.046146563  
1.025123818  
1.00309026  
0.9808280128  
0.9591905213  
0.9391281835  
0.9158182518  
0.8965722733  
0.8794078055  
0.8602354086  
0.8438322914  
0.8266185623  
0.8101168715  
0.794747588  
0.7794802166  
0.7645688141  
0.7496751964  
0.736215459  
0.7225381635  
0.709232467  
0.6968191546  
0.6845646216  
0.6727269962  
0.6610968461  
0.6500274343  
0.6389833966  
0.6284101934  
0.6180709504  
0.6081172103  
0.598281364  
0.5888245068  
0.579588092  
0.570618639  
0.5618773452  
0.553348024  
0.5450222189  
0.5369342657  
0.5290191991  
0.5213318723  
0.5138104924  
0.5064807821  
0.4993299284  
0.4923437557  
0.4855325248  
0.4788644639  
0.4723620284  
0.4660180288  
0.4598012156  
0.4537414163  
0.4477978042  
0.4420021441  
0.4363366592  
0.4307763031  
0.4253501527  
0.4200351878  
0.4148388394  
0.4097505099  
0.4047702508  
0.3998941065  
0.3951153108  
0.3904245566  
0.3858433049  
0.3813519987  
0.3769519913  
0.3726403819  
0.3684082375  
0.36425784  
0.3601922776  
0.3562095342  
0.3522913526  
0.3484540537  
0.3446944277  
0.3410066016  
0.337373126  
0.3338164192  
0.3303307744  
0.3269020944  
0.3235336059  
0.3202335309  
0.3169864165  
0.3138020549  
0.3106643239  
0.3075893731  
0.3045738624  
0.301591008  
0.2986774426  
0.2958107046  
0.2929913589  
0.2902186467  
0.2874927033  
0.284816326  
0.2821867595  
0.2795973512  
0.2770465528  
0.2745433761  
0.272080438  
0.2696501912  
0.2672672431  
0.2649235854  
0.2626090488  
0.260332106  
0.2581010243  
0.2558983584  
0.2537339034  
0.2515957629  
0.2494944057  
0.2474272339  
0.2453919987  
0.2433799717  
0.2414117921  
0.2394614023  
0.2375501647  
0.2356633928  
0.2337976675  
0.2319690551  
0.2301625489  
0.2283831682  
0.2266334565  
0.224904326  
0.2232002254  
0.2215209499  
0.2198774368  
0.21823822  
0.2166347623  
0.215050938  
0.2134864601  
0.2119489476  
0.2104358312  
0.2089382998  
0.2074588313  
0.205999815  
0.2045645241  
0.2031523943  
0.2017520965  
0.2003771199  
0.1990182446  
0.1976722437  
0.1963543559  
0.1950494052  
0.1937584655  
0.1924930783  
0.1912357515  
0.1900011362  
0.1887785785  
0.1875777595  
0.1863860326  
0.1852097965  
0.1840520131  
0.1829132141  
0.1817800807  
0.1806698816  
0.1795647129  
0.1784816002  
0.177405487  
0.1763484142  
0.1753030572  
0.1742749044  
0.173252661  
0.1722461521  
0.1712544765  
0.1702705875  
0.1693011442  
0.1683448372  
0.1673984541  
0.1664649371  
0.1655422252  
0.1646310046  
0.1637361263  
0.1628435702  
0.1619664415  
0.1610990888  
0.1602399454  
0.1593923308  
0.1585599219  
0.1577336282  
0.1569191355  
0.1561116405  
0.1553072106  
0.1545235291  
0.1537496927  
0.1529706692  
0.1522164117  
0.1514719481  
0.1507219551  
0.1499830845  
0.1492614679  
0.1485468415  
0.1478353424  
0.1471411636  
0.14644689  
0.1457582531  
0.1450825727  
0.1444192288  
0.1437572361  
0.1431049116  
0.1424630459  
0.1418222992  
0.1411926666  
0.140569869  
0.1399499953  
0.1393466283  
0.1387423892  
0.138149634  
0.1375557956  
0.1369757151  
0.1364046561  
0.1358360535  
0.135271108  
0.1347148433  
0.1341634807  
0.1336226097  
0.1330839521  
0.1325528691  
0.1320281792  
0.1315110572  
0.1309943564  
0.1304877426  
0.1299916233  
0.1294942686  
0.1289996152  
0.1285192865  
0.1280356303  
0.1275613346  
0.1270926473  
0.1266312139  
0.1261701323  
0.1257205131  
0.1252676151  
0.124830739  
0.1243901119  
0.1239555191  
0.1235287984  
0.1231034495  
0.1226920173  
0.1222748503  
0.1218674504  
0.1214583435  
0.1210586923  
0.1206638156  
0.1202691665  
0.1198881571  
0.1195017644  
0.1191226139  
0.1187527216  
0.1183840907  
0.1180176943  
0.1176548565  
0.1173042275  
0.1169513972  
0.1166053654  
0.1162557689  
0.1159146234  
0.1155792356  
0.1152452714  
0.1149154594  
0.1145896851  
0.1142721213  
0.1139526851  
0.1136384785  
0.1133315689  
0.1130245217  
0.1127203438  
0.1124235225  
0.1121280748  
0.1118344209  
0.1115443604  
0.1112602769  
0.110980469  
0.1107023403  
0.1104253236  
0.1101553986  
0.1098839725  
0.1096196787  
0.109357686  
0.1090981406  
0.108843879  
0.108591989  
0.1083441076  
0.1080975023  
0.1078542187  
0.1076176559  
0.1073791836  
0.1071460026  
0.1069132018  
0.106685377  
0.1064566548  
0.1062431513  
0.1060223505  
0.1058047869  
0.1055928527  
0.1053833526  
0.1051769436  
0.1049692803  
0.1047684264  
0.1045663129  
0.1043738415  
0.1041786283  
0.1039896221  
0.1038011906  
0.1036154756  
0.1034346459  
0.10325095  
0.1030733276  
0.1028990445  
0.1027270977  
0.1025621893  
0.102391595  
0.1022275454  
0.1020655129  
0.1019048367  
0.1017455334  
0.1015923491  
0.1014424468  
0.1012924048  
0.1011429097  
0.1009982279  
0.1008571924  
0.1007180949  
0.1005784572  
0.1004410243  
0.1003125563  
0.1001818508  
0.1000547208  
0.09992694435  
0.09980133365  
0.09968334831  
0.09956402656  
0.09944920614  
0.09933459251  
0.09922028419  
0.09910940776  
0.09900381426  
0.09890225525  
0.09879824748  
0.09869416341  
0.09859792712  
0.0985032949  
0.09840329903  
0.09831316132  
0.09822672689  
0.09813480887  
0.09805160597  
0.09796975902  
0.09788264269  
0.09780555716  
0.09773154174  
0.09765687895  
0.09758647268  
0.09751421392  
0.09744564389  
0.0973783701  
0.09731359635  
0.09725047388  
0.09719416519  
0.09713359025  
0.09707948155  
0.09702305679  
0.09697550774  
0.0969248293  
0.09687563525  
0.09682900215  
0.09678347127  
0.09674673808  
0.09670737414  
0.09666876312  
0.09663180647  
0.09659710342  
0.09656850341  
0.0965373192  
0.09651147835  
0.09648748777  
0.0964602681  
0.09643912951  
0.09642395636  
0.09640486183  
0.09639497306  
0.09638084559  
0.09636670704  
0.09635760599  
0.09635173845  
0.09634750682  
0.09634351795  
0.09634313846  
