0.1427531349  
0.1506164758  
0.1507541828  
0.1387463871  
0.1141877743  
0.08168406622  
0.05083513065  
0.0351728515  
0.05019393333  
0.1107922804  
0.2285248132  
0.4091674673  
0.650985159  
0.9440372149  
1.270667992  
1.607144457  
1.92624665  
2.200429659  
2.405133834  
2.52175916  
2.539910764  
2.458600554  
2.286269699  
2.039658738  
1.741712296  
1.418833448  
1.09787898  
0.8033046042  
0.5548108314  
0.3657491  
0.2424227577  
0.1842768957  
0.1848383327  
0.233193159  
0.3157288707  
0.4178708417  
0.5255916803  
0.6265449403  
0.7107532483  
0.7708807336  
0.8021654434  
0.8021425284  
0.7702777001  
0.70762115  
0.6165237963  
0.5004693224  
0.3639408668  
0.2123160935  
0.05170019422  
-0.1113295267  
-0.2700819051  
-0.4181951082  
-0.5501020981  
-0.661450717  
-0.7494113722  
-0.8128190073  
-0.8521451464  
-0.8693150373  
-0.8674380336  
-0.8505131565  
-0.823189466  
-0.79061808  
-0.7583944835  
-0.7325643278  
-0.7195940903  
-0.7262232552  
-0.7591060765  
-0.8241931419  
-0.9258594451  
-1.065867049  
-1.242306549  
-1.448716337  
-1.673601433  
-1.900524811  
-2.108912636  
-2.275579734  
-2.376887493  
-2.391320556  
-2.302169099  
-2.099971062  
-1.78434189  
-1.364896449  
-0.8610853957  
-0.3008811515  
0.2815525173  
0.8489697456  
1.364551553  
1.795409209  
2.115660592  
2.308745231  
2.368725723  
2.300479062  
2.118815456  
1.846668707  
1.512616796  
1.148022717  
0.7841097249  
0.4492602995  
0.1667655467  
-0.04680014192  
-0.1824893659  
-0.2391508242  
-0.2229099496  
-0.1460375902  
-0.02537192719  
0.119571974  
0.2685989971  
0.4027724977  
0.5060998115  
0.5668462188  
0.5783352391  
0.5391927497  
0.4530215639  
0.327563533  
0.1734500488  
0.002714462916  
-0.1727652551  
-0.3426837673  
-0.49941193  
-0.6386385363  
-0.7594769032  
-0.8640233807  
-0.9564413991  
-1.041720554  
-1.124307983  
-1.206849774  
-1.289268852  
-1.368366177  
-1.438062402  
-1.490287508  
-1.516421399  
-1.509077631  
-1.463944479  
-1.381339816  
-1.267155126  
-1.132925149  
-0.9948733322  
-0.8719462872  
-0.7830159945  
-0.7436051975  
-0.7626086947  
-0.8395471072  
-0.962886291  
-1.109818285  
-1.247751965  
-1.337491759  
-1.337830856  
-1.211041288  
-0.9285401857  
-0.4759544279  
0.1432194605  
0.9059658532  
1.770502385  
2.679484319  
3.565369599  
4.357319276  
4.988809051  
5.40495788  
5.568643231  
5.464624281  
5.101145558  
4.508864187  
3.737278136  
2.849159036  
1.913735631  
0.9994803913  
0.1673734209  
-0.5346084469  
-1.075229662  
-1.441651251  
-1.638989993  
-1.687982486  
-1.621188513  
-1.478254143  
-1.300855726  
-1.127886439  
-0.9913788756  
-0.9135615217  
-0.9052359504  
-0.9655702619  
-1.083201472  
-1.23843699  
-1.40624312  
-1.559659563  
-1.673214755  
-1.725997899  
-1.704041833  
-1.601781667  
-1.422464909  
-1.177488211  
-0.8847948547  
-0.5665388779  
-0.2463475279  
0.05347267826  
0.3144127531  
0.5236101536  
0.674849278  
0.7686049883  
0.8111777495  
0.8130773918  
0.7869483312  
0.7453621288  
0.6988351302  
0.654379399  
0.6147811499  
0.5787083591  
0.5415809304  
0.4970120234  
0.4385517577  
0.3614034958  
0.2637883725  
0.1477219613  
0.01905122365  
-0.1132551514  
-0.2384405815  
-0.3456871196  
-0.4259311228  
-0.4734558712  
-0.4869747661  
-0.4700111793  
-0.4304983269  
-0.379644572  
-0.3302463727  
-0.2946977701  
-0.283021701  
-0.3012310546  
-0.3502783914  
-0.4257620002  
-0.5184529022  
-0.6155505627  
-0.7025084838  
-0.7651368084  
-0.7916932717  
-0.7746423368  
-0.7118259943  
-0.6068817737  
-0.468837961  
-0.3109516592  
-0.1489471369  
0.001078727318  
0.1247914627  
0.2114899376  
0.255430384  
0.2564451286  
0.2197406049  
0.1549407699  
0.07452062187  
-0.008138109117  
-0.08074826574  
-0.1338878743  
-0.1622639222  
-0.1652786662  
-0.1468435133  
-0.1144609435  
-0.07776105943  
-0.04673181232  
-0.02993245918  
-0.03298946769  
-0.05760233808  
-0.1012245561  
-0.1574493455  
-0.2170327738  
-0.2693867863  
-0.3042847488  
-0.3135233465  
-0.2922659243  
-0.2398657374  
-0.1600397048  
-0.06037036418  
0.04878934538  
0.1558311458  
0.2496021505  
0.3210506844  
0.3645599991  
0.3787684607  
0.3667671083  
0.3356383471  
0.2954144495  
0.2576119131  
0.2335406795  
0.2326470768  
0.2611030853  
0.3208391356  
0.4091359849  
0.5188281962  
0.6390760283  
0.7565977492  
0.8572178807  
0.9275155588  
0.9564113427  
0.9364828059  
0.8648922498  
0.7438132184  
0.5803242098  
0.3857868961  
0.17476796  
-0.03636683622  
-0.2310634539  
-0.3942017852  
-0.5135880482  
-0.5811324811  
-0.5936124747  
-0.5529157327  
-0.46574973  
-0.3428400734  
-0.1977179176  
-0.04523361061  
0.1000261968  
0.2252243949  
0.320492468  
0.3797394926  
0.4009656125  
0.3860693009  
0.3401930696  
0.2707436646  
0.1862225178  
0.09506753292  
0.004660621141  
-0.07935865259  
-0.1534011739  
-0.2158490716  
-0.2666537181  
-0.3067188716  
-0.3372285972  
-0.3590622451  
-0.372428758  
-0.3767911829  
-0.3710992058  
-0.3542552512  
-0.3257246844  
-0.2861078305  
-0.2375545654  
-0.1838777708  
-0.1303078765  
-0.08290202332  
-0.04768350206  
-0.02967042857  
-0.03196622845  
-0.055098493  
-0.09674703523  
-0.1519493359  
-0.213755108  
-0.2742569671  
-0.3257934556  
-0.3621539891  
-0.3795302622  
-0.3770654293  
-0.3568810785  
-0.32357771  
-0.2832938692  
-0.2424870761  
-0.2066693716  
-0.1793215856  
-0.1611948135  
-0.1501400479  
-0.1415052645  
-0.1290478339  
-0.1062048018  
-0.06750642328  
-0.009877351278  
0.06641140961  
0.1573325788  
0.2553257582  
0.350163547  
0.4303308289  
0.4847238035  
0.5043947266  
0.4840659367  
0.4231457199  
0.3260629213  
0.2018402317  
0.06294183276  
-0.07644915029  
-0.2024671031  
-0.303592388  
-0.3723688697  
-0.4065030428  
-0.409176355  
-0.3884786825  
-0.3560582362  
-0.3251482109  
-0.3082955078  
-0.3151281243  
-0.3505233934  
-0.4134711895  
-0.4968446181  
-0.5881341595  
-0.6710727138  
-0.7279339127  
-0.7421760894  
-0.7010440775  
-0.5977452062  
-0.4328570813  
-0.2147425401  
0.04111472442  
0.3137838571  
0.579358822  
0.8138800294  
0.9963170842  
1.111192379  
1.150483578  
1.114552298  
1.011972791  
0.8582928637  
0.6739186643  
0.4814150765  
0.3025916354  
0.1557951355  
0.05373490326  
0.002146548872  
-0.0005744990519  
0.03726642677  
0.1021641676  
0.1775646022  
0.2463253913  
0.2931508572  
0.3066609657  
0.2808274935  
0.2155824285  
0.1165781525  
-0.005866126644  
-0.1384377601  
-0.2668585539  
-0.3779655535  
-0.4615446891  
-0.5116541146  
-0.5272723801  
-0.512187594  
-0.4741947127  
-0.4237333412  
-0.3722031631  
-0.3302200527  
-0.306077699  
-0.3046420936  
-0.3268206745  
-0.3696630514  
-0.4270461804  
-0.4908099331  
-0.552142994  
-0.6029807814  
-0.6372093314  
-0.6514671171  
-0.6454445488  
-0.6216450145  
-0.5846692612  
-0.5401581162  
-0.4935740486  
-0.4490665045  
-0.4085785109  
-0.3713949139  
-0.3341786004  
-0.291519988  
-0.2368781615  
-0.1637910922  
-0.06710594647  
0.0559429601  
0.2050188389  
0.3764386762  
0.5634370648  
0.7569013929  
0.9464406608  
1.121611837  
1.273113629  
1.39375916  
1.479090838  
1.527592968  
1.540490823  
1.521246759  
1.474866609  
1.407170555  
1.324175515  
1.231662172  
1.134979937  
1.039048386  
0.9484815268  
0.8677059528  
0.8009927641  
0.7522812523  
0.7247932564  
0.7204689547  
0.7393104751  
0.7787872508  
0.833455234  
0.8949253417  
0.9522652689  
0.9928553856  
1.003614954  
0.9724584501  
0.8897754712  
0.7497144473  
0.5510711637  
0.2976331427  
-0.002083987096  
-0.3356735486  
-0.6881283306  
-1.043403434  
-1.386010984  
-1.702447253  
-1.982242114  
-2.218532947  
-2.408116164  
-2.551036363  
-2.649811794  
-2.708490659  
-2.731680366  
-2.723743464  
-2.688250789  
-2.62776373  
-2.543923921  
-2.43779259  
-2.310328191  
-2.162876264  
-1.997561184  
-1.81749607  
-1.626765259  
-1.430182128  
-1.232884033  
-1.039819956  
-0.8552498944  
-0.6823201849  
-0.5228043958  
-0.3770289302  
-0.2440090289  
-0.1217575857  
-0.007717370194  
0.1007365137  
0.2058118405  
0.3088782198  
0.4101836125  
0.5087155824  
0.602256537  
0.6875930834  
0.7608849005  
0.8181326373  
0.8557052809  
0.8708546244  
0.8621770017  
0.8299427374  
0.7762675013  
0.7050930514  
0.6219788303  
0.5337182218  
0.4478300972  
0.3719822818  
0.3134186411  
0.2784418837  
0.2720206838  
0.2975228202  
0.3565922895  
0.4491260955  
0.5733137096  
0.7256963665  
0.9012069948  
1.093188043  
1.293408979  
1.492142058  
1.678365306  
1.840162318  
1.96537568  
2.042515023  
2.061871973  
2.016742373  
1.904588188  
1.727965549  
1.495024508  
1.219434779  
0.9196466077  
0.61748468  
0.336180669  
0.09802652529  
-0.07807830206  
-0.1788794182  
-0.1985170089  
-0.1395035112  
-0.01276733959  
0.1633117545  
0.3647868514  
0.5647574037  
0.7364102225  
0.8561033885  
0.9061174952  
0.876703936  
0.7671737924  
0.5858745018  
0.3490505419  
0.07875041702  
-0.1999569306  
-0.4620706261  
-0.6856528398  
-0.8543357689  
-0.9590238438  
-0.9986034733  
-0.9795931282  
-0.9148363646  
-0.821455476  
-0.7183749164  
-0.6237728213  
-0.5527974709  
-0.5158413979  
-0.5175531844  
-0.5566807415  
-0.6266868879  
-0.7170247157  
-0.8148302547  
-0.9068124048  
-0.9810544332  
-1.028522831  
-1.044088622  
-1.026974366  
-0.9806000633  
-0.9118582755  
-0.8299723593  
-0.7450667102  
-0.6666806641  
-0.6023926701  
-0.5567737076  
-0.530774401  
-0.5216578583  
-0.5234642839  
-0.5279566392  
-0.5259179707  
-0.5086092193  
-0.469202432  
-0.4039580029  
-0.3129986147  
-0.2005445027  
-0.07456979604  
0.05407937126  
0.1730020274  
0.269809538  
0.3337369402  
0.3570834431  
0.3362818923  
0.2724569841  
0.1713941075  
0.04292667044  
-0.1001767134  
-0.2436932624  
-0.3735900489  
-0.4776428371  
-0.5468202464  
-0.5762726448  
-0.5658063659  
-0.5198044158  
-0.4465894842  
-0.3573413377  
-0.2646825308  
-0.1811234367  
-0.1175564014  
-0.08197540195  
-0.07859625032  
-0.1074509324  
-0.1645322407  
-0.2424238631  
-0.3313393942  
-0.4204188339  
-0.4990839709  
-0.5582857817  
-0.5914578523  
-0.5950773905  
-0.5687690884  
-0.5149822839  
-0.4383282378  
-0.3447148199  
-0.2404335859  
-0.1313685021  
-0.02242130119  
0.08276642953  
0.1818025191  
0.2733025629  
0.3565214218  
0.4309705494  
0.4961423471  
0.5513949615  
0.5960440081  
0.6296131598  
0.6521747197  
0.6646724373  
0.6691071692  
0.6685183395  
0.6666982974  
0.6676718525  
0.6750052672  
0.6910744808  
0.7164387307  
0.7494606023  
0.7862878018  
0.8212376826  
0.847576545  
0.8585751999  
0.8486961942  
0.8147032178  
0.7564896834  
0.6774681359  
0.5843999888  
0.4866648171  
0.3950389763  
0.3201560938  
0.2708763859  
0.2528283236  
0.2673548579  
0.3110709546  
0.3761216874  
0.4511389478  
0.5227858532  
0.5776676403  
0.6043404686  
0.5951131141  
0.5473532251  
0.4641000768  
0.3538476796  
0.2295267701  
0.1067942299  
0.001878454649  
-0.07072000911  
-0.1003514571  
-0.08183505367  
-0.01635734281  
0.08849522381  
0.2195726356  
0.3597517178  
0.49005609  
0.5920152023  
0.6499481143  
0.6528611797  
0.5957352508  
0.480047376  
0.313495788  
0.108993057  
-0.1169078272  
-0.3459387464  
-0.5601397369  
-0.743742495  
-0.8847112614  
-0.9757964079  
-1.015034519  
-1.005687767  
-0.9556826551  
-0.8766442885  
-0.7826493557  
-0.688832127  
-0.6099396578  
-0.5589685414  
-0.5459443431  
-0.5769256379  
-0.653282947  
-0.7713212646  
-0.9222748912  
-1.092734067  
-1.265506665  
-1.420916148  
-1.538475244  
-1.598824784  
-1.585790569  
-1.488330481  
-1.302158076  
-1.030805381  
-0.6859416762  
-0.2868321171  
0.1410704124  
0.5682950081  
0.9640736276  
1.299305744  
1.549412273  
1.6967424  
1.732227337  
1.656084783  
1.477518488  
1.213455389  
0.8865322952  
0.5225935692  
0.1480405501  
-0.2126482692  
-0.5389501502  
-0.8156854928  
-1.033669305  
-1.189653719  
-1.285651219  
-1.327835776  
-1.325201433  
-1.288212834  
-1.227584547  
-1.153339997  
-1.074173345  
-0.9971408599  
-0.9276001551  
-0.8693442517  
-0.8248108124  
-0.7953090543  
-0.7811829678  
-0.7818935171  
-0.7960150419  
-0.8211626864  
-0.8539121715  
-0.8897395739  
-0.9230517969  
-0.9473310887  
-0.9554136713  
-0.9399164219  
-0.8937734387  
-0.8108504406  
-0.686588453  
-0.5185889803  
-0.307100788  
-0.05531496955  
0.230561715  
0.5415065021  
0.8661558415  
1.191534644  
1.503990575  
1.790254588  
2.03852997  
2.239486148  
2.387054579  
2.478920249  
2.516637786  
2.505348125  
2.453095492  
2.369819886  
2.266140273  
2.152048339  
2.035714336  
1.922532961  
1.814578489  
1.710542463  
1.606207356  
1.495392032  
1.371272546  
1.227871014  
1.061504609  
0.8719442352  
0.6630736036  
0.4428944904  
0.2228390024  
0.01641905886  
-0.162598329  
-0.3022420336  
-0.3943083762  
-0.4359197882  
-0.4304111369  
-0.3873500508  
-0.3216424338  
-0.2518019345  
-0.1976071504  
-0.1774573488  
-0.2058125429  
-0.2910875914  
-0.4343143343  
-0.6287933404  
-0.8607856078  
-1.111178222  
-1.357882825  
-1.578639186  
-1.753828235  
-1.868906359  
-1.91610472  
-1.895190866  
-1.813177809  
-1.683055785  
-1.521748814  
-1.347610447  
-1.177822377  
-1.02609277  
-0.9009682164  
-0.8049874148  
-0.7347848605  
-0.6820863133  
-0.635425974  
-0.5823106714  
-0.5114940191  
-0.4150137317  
-0.2896969204  
-0.1379198796  
0.03248536755  
0.2091550801  
0.3768088461  
0.519326065  
0.6220014144  
0.6736546911  
0.6683156828  
0.6062615348  
0.4942468068  
0.3449110242  
0.1754089713  
0.005449939985  
-0.1450288934  
-0.2582475462  
-0.320742001  
-0.3250161506  
-0.2704746074  
-0.1635211841  
-0.0167976075  
0.1523286725  
0.3238463399  
0.4774847205  
0.5950877465  
0.6626920352  
0.6720537534  
0.6214418596  
0.5156405963  
0.3651841572  
0.184957056  
-0.007626934606  
-0.1946253442  
-0.359496543  
-0.4887283579  
-0.5730105896  
-0.6078458093  
-0.5935959254  
-0.5350032629  
-0.4403068069  
-0.3200816617  
-0.1859670753  
-0.04942754382  
0.07932775414  
0.1921674498  
0.283540787  
0.3506331628  
0.3932008075  
0.4131245463  
0.4137618644  
0.3991986029  
0.3735098555  
0.3401322091  
0.3014394596  
0.2585758946  
0.2115594776  
0.159633961  
0.1017923441  
0.03736327199  
-0.03343512514  
-0.1091121151  
-0.1867490589  
-0.2621254973  
-0.3301189716  
-0.3853076809  
-0.422688189  
-0.4383804416  
-0.4302067355  
-0.3980325275  
-0.3438156144  
-0.2713568677  
-0.1857828139  
-0.09285358825  
0.001786745331  
0.09329538063  
0.1781275474  
0.2542775926  
0.3212135527  
0.379544546  
0.4304797558  
0.4751996235  
0.514264479  
0.547199932  
0.572328648  
0.5869301153  
0.58768998  
0.5713801955  
0.5356435322  
0.4797331417  
0.4050530439  
0.3153740387  
0.2166452679  
0.1163929275  
0.0227759675  
-0.05657108978  
-0.1157222593  
-0.1514747091  
-0.1639984266  
-0.1569886299  
-0.137254729  
-0.1137741016  
-0.09634124689  
-0.0940052085  
-0.1135410088  
-0.1582174482  
-0.2270709189  
-0.314823424  
-0.4124862593  
-0.5085726632  
-0.5907391065  
-0.6476009375  
-0.6704385571  
-0.6545182788  
-0.5998218069  
-0.5110691239  
-0.3970379403  
-0.2692994933  
