0.5613327706  
-0.1799523453  
-0.9007435826  
-1.583897458  
-2.214394097  
-2.779857996  
-3.270738867  
-3.680172404  
-4.003601728  
-4.238296444  
-4.382902179  
-4.437169372  
-4.401931757  
-4.279363594  
-4.073480638  
-3.790766807  
-3.440796882  
-3.036665853  
-2.595094985  
-2.13606597  
-1.681962967  
-1.256224294  
-0.8816188429  
-0.5783292761  
-0.3620609023  
-0.2424390115  
-0.2218911992  
-0.2952113998  
-0.4498760979  
-0.6671165783  
-0.9236343189  
-1.193781466  
-1.451956601  
-1.674951029  
-1.843988171  
-1.946243731  
-1.975703552  
-1.933309605  
-1.826417922  
-1.667690246  
-1.473564709  
-1.262529937  
-1.053367144  
-0.8635279245  
-0.7077974319  
-0.5972817086  
-0.538771246  
-0.5344632133  
-0.582017572  
-0.6749152354  
-0.8030575064  
-0.9535870667  
-1.111870693  
-1.262586779  
-1.390856766  
-1.483331836  
-1.529152523  
-1.52069423  
-1.454042757  
-1.329137208  
-1.149611392  
-0.9223510504  
-0.6568470892  
-0.3644355454  
-0.05751856249  
0.2511651925  
0.5491575623  
0.8247944765  
1.067618406  
1.268746121  
1.421217536  
1.520374436  
1.564245194  
1.553923268  
1.493851262  
1.391932086  
1.259386412  
1.110274106  
0.9606778577  
0.8275605925  
0.7273915601  
0.6746645334  
0.6804779567  
0.7513329801  
0.8883012818  
1.086675492  
1.336150948  
1.621549685  
1.92402926  
2.222659862  
2.496260856  
2.7252982  
2.893699303  
2.990394002  
3.010435469  
2.955549229  
2.834041519  
2.660002721  
2.451851998  
2.230334024  
2.016137168  
1.827413183  
1.677496248  
1.573138624  
1.513557672  
1.490485964  
1.489305837  
1.491180639  
1.475945137  
1.425348542  
1.326189175  
1.172817157  
0.9685573679  
0.725757394  
0.4643443932  
0.2090321199  
-0.01444675623  
-0.1835314187  
-0.2827784982  
-0.3068918912  
-0.2622903918  
-0.166869524  
-0.04788887388  
0.06175866824  
0.1283838865  
0.1227123502  
0.02465321129  
-0.1731521079  
-0.4636114307  
-0.82562444  
-1.226685122  
-1.627297939  
-1.986558273  
-2.268059575  
-2.445209573  
-2.505139168  
-2.450562797  
-2.299304585  
-2.08152441  
-1.835077091  
-1.599685494  
-1.410841491  
-1.294350579  
-1.262382138  
-1.311605006  
-1.423728035  
-1.568348799  
-1.707687463  
-1.802486025  
-1.818191933  
-1.730486175  
-1.529323089  
-1.220880199  
-0.8271300377  
-0.3830763189  
0.06791544346  
0.4800382006  
0.8113268618  
1.029438073  
1.116079203  
1.069495086  
0.9046829293  
0.6513399362  
0.3498633366  
0.04598406395  
-0.2152293962  
-0.3951687738  
-0.4665449947  
-0.4166901768  
-0.2489215851  
0.0181519572  
0.353237366  
0.7164955925  
1.064638488  
1.35631361  
1.557102718  
1.643491147  
1.6053741  
1.446809427  
1.184990214  
0.8476568955  
0.4693205179  
0.08685813868  
-0.2649313526  
-0.557232483  
-0.770111438  
-0.8940916937  
-0.9303107106  
-0.8893368674  
-0.7889250002  
-0.6510996646  
-0.4990069451  
-0.3539752888  
-0.2331347044  
-0.1478385672  
-0.1029782492  
-0.09715631987  
-0.1235701184  
-0.1714026895  
-0.2274607871  
-0.2778663382  
-0.3095961036  
-0.3117731369  
-0.2766331685  
-0.2001481241  
-0.08231614022  
0.07286334595  
0.2577185581  
0.4615199181  
0.6713655548  
0.873283307  
1.053500421  
1.199757494  
1.302551038  
1.356133434  
1.359142461  
1.314740061  
1.23021495  
1.116079598  
0.9847655951  
0.849095238  
0.7207461802  
0.6089282223  
0.5194549652  
0.4543383665  
0.4119332293  
0.3875794048  
0.3746154049  
0.3655744523  
0.353371088  
0.3323120978  
0.2987835578  
0.2515663981  
0.1917809658  
0.1225045614  
0.04818781627  
-0.0260382961  
-0.09504786889  
-0.1543066984  
-0.2003185807  
-0.2309093202  
-0.2453698892  
-0.2444725757  
-0.2304158475  
-0.2067116766  
-0.1780325041  
-0.1500069578  
-0.128952521  
-0.1214956083  
-0.1340869009  
-0.1723879892  
-0.2405679052  
-0.3405850919  
-0.4715393855  
-0.6292172406  
-0.8059326585  
-0.9907698766  
-1.170242945  
-1.329368489  
-1.45305788  
-1.527676381  
-1.542590648  
-1.491504038  
-1.373401176  
-1.192965404  
-0.960404209  
-0.6906847576  
-0.4022597773  
-0.1154121509  
0.1495899622  
0.3743574366  
0.5440646983  
0.6487864549  
0.6843915308  
0.6528913171  
0.5622407704  
0.425612173  
0.2602104842  
0.08575260222  
-0.07725800221  
-0.2093036594  
-0.2935013124  
-0.3170002067  
-0.2719840558  
-0.1562155732  
0.02691678148  
0.2688298449  
0.556584008  
0.8740371125  
1.203179909  
1.525519351  
1.823402777  
2.081154569  
2.285973683  
2.428535081  
2.503294257  
2.50850995  
2.446033731  
2.320925905  
2.140962644  
1.916101274  
1.65793929  
1.379196705  
1.093222135  
0.8134876756  
0.5530449547  
0.3239060467  
0.1363271889  
-0.001974272277  
-0.08660747338  
-0.1171987888  
-0.09784541617  
-0.03719702487  
0.05195369249  
0.1536173325  
0.2500634779  
0.3236643712  
0.3589082787  
0.344317487  
0.2739741776  
0.148402054  
-0.02537252043  
-0.2346241472  
-0.4625198413  
-0.69027599  
-0.8995695607  
-1.074843856  
-1.205171503  
-1.285411419  
-1.316508985  
-1.304938026  
-1.26143014  
-1.199208259  
-1.132039706  
-1.072391347  
-1.029943036  
-1.010603009  
-1.016094313  
-1.044057998  
-1.088577811  
-1.140972684  
-1.19074074  
-1.226547754  
-1.237209002  
-1.212658156  
-1.144895348  
-1.028924146  
-0.8636248029  
-0.6524695425  
-0.4039623053  
-0.1316291939  
0.1465745581  
0.4095004909  
0.6346898219  
0.8007291055  
0.889844104  
0.8903637096  
0.7986795136  
0.620343436  
0.3700690533  
0.07050887793  
-0.2500692626  
-0.5609647525  
-0.8326467963  
-1.040282704  
-1.166678985  
-1.204203816  
-1.155413351  
-1.032290775  
-0.8542336776  
-0.6451028206  
-0.4297914323  
-0.2308297937  
-0.06552579642  
0.05596189452  
0.1313755644  
0.1659078831  
0.1706763649  
0.1604542117  
0.1510400657  
0.156730572  
0.1882619378  
0.2515047252  
0.347051244  
0.4706624667  
0.6144064113  
0.7682400633  
0.9217007164  
1.065441865  
1.192367607  
1.298227393  
1.38166709  
1.443792483  
1.487393177  
1.51602145  
1.533092209  
1.541148372  
1.541388748  
1.533474148  
1.515598573  
1.484775172  
1.437254326  
1.369041508  
1.276447566  
1.156664775  
1.008324359  
0.8320214932  
0.6307425568  
0.4101442425  
0.1785777572  
-0.05319334048  
-0.2726517628  
-0.4665482752  
-0.6222142774  
-0.7290342221  
-0.7798693379  
-0.7722092759  
-0.7088398191  
-0.597861679  
-0.4519934798  
-0.287214241  
-0.1208994663  
0.03028428007  
0.1524025183  
0.2358943555  
0.2765696232  
0.2758171774  
0.2399974044  
0.1791683943  
0.1053494116  
0.03065647053  
-0.03440454811  
-0.08220713155  
-0.1086709068  
-0.1132780429  
-0.09852827531  
-0.06897572461  
-0.03010480584  
0.01272947339  
0.05510216129  
0.09393929031  
0.1275279445  
0.1551940183  
0.1767770594  
0.1920705704  
0.2003992914  
0.2004539583  
0.1904366363  
0.1684874084  
0.1332931732  
0.08473425238  
0.0243902233  
-0.04423491044  
-0.1158678195  
-0.1840136723  
-0.2418319544  
-0.2832015634  
-0.3037719793  
-0.3018147327  
-0.2786875389  
-0.2387976198  
-0.1890541225  
-0.1378758945  
-0.09391119799  
-0.06468909302  
-0.05542715059  
-0.06821422551  
-0.1016957676  
-0.151321571  
-0.21012519  
-0.2698905785  
-0.3225111265  
-0.3613359552  
-0.3822732003  
-0.3844837551  
-0.37055615  
-0.3461503809  
-0.3191494796  
-0.2984567516  
-0.2926032483  
-0.3083513631  
-0.3494958507  
-0.4160127222  
-0.5036736027  
-0.6041952627  
-0.7059113659  
-0.7949223151  
-0.856596301  
-0.8772714741  
-0.845978495  
-0.7559675873  
-0.6058719199  
-0.4003327831  
-0.149978768  
0.1292735676  
0.4175719143  
0.6929991875  
0.9337877684  
1.120611272  
1.238707065  
1.279535604  
1.241781836  
1.131540142  
0.9616433975  
0.7502000591  
0.518507859  
0.2886131722  
0.08081293951  
-0.0885633826  
-0.2088125441  
-0.2757418986  
-0.2916642845  
-0.2645412019  
-0.2063975233  
-0.1312641232  
-0.0529615737  
0.01695148645  
0.07073323868  
0.105331964  
0.1224150014  
0.1276226853  
0.1291738003  
0.1360779651  
0.1562818247  
0.1950675855  
0.2539678791  
0.330377477  
0.4179143197  
0.5074478885  
0.5886035289  
0.6514728434  
0.6882490939  
0.6945004149  
0.66988605  
0.6182122029  
0.5468389262  
0.4655392988  
0.3850185415  
0.3153222204  
0.2643811908  
0.2369012488  
0.2337514573  
0.2519104975  
0.284972924  
0.3241147343  
0.3593928123  
0.3811674685  
0.3815044417  
0.3553304958  
0.3012228672  
0.2217166112  
0.1230882593  
0.01464243032  
-0.09243582513  
-0.1864808866  
-0.2568553432  
-0.2953356798  
-0.2972041327  
-0.2618557677  
-0.1928722246  
-0.09750311881  
0.01434804534  
0.1314939396  
0.2429846591  
0.3395510912  
0.4147398001  
0.4655749678  
0.4926389327  
0.4995745514  
0.4920823254  
0.4766140992  
0.4589682464  
0.4430479432  
0.4300015884  
0.4178984255  
0.4020081959  
0.3756529551  
0.3314804851  
0.2629692759  
0.1659025053  
0.03956844066  
-0.1125218473  
-0.2825372594  
-0.4588874056  
-0.627410252  
-0.7730134052  
-0.881576576  
-0.9418551537  
-0.9471044608  
-0.8962030097  
-0.7940832769  
-0.6513819224  
-0.4833318159  
-0.3080018446  
-0.1441304552  
-0.008810649029  
0.08461986778  
0.1282034925  
0.1202513457  
0.06536177264  
-0.02645434304  
-0.141400913  
-0.2640408188  
-0.3796420108  
-0.4763500079  
-0.5468547775  
-0.589281237  
-0.6071670411  
-0.6084916982  
-0.60394046  
-0.6046326119  
-0.6197040443  
-0.6541293715  
-0.7071725954  
-0.7717571327  
-0.8349199381  
-0.8793522294  
-0.8858544766  
-0.8363724934  
-0.7171866326  
-0.5217512702  
-0.2527234081  
0.07719182091  
0.4458006932  
0.8233986059  
1.17597045  
1.469236124  
1.67300223  
1.765221469  
1.735172193  
1.585268898  
1.331195968  
1.000287721  
0.6283288872  
0.2551738318  
-0.08022016099  
-0.3446620956  
-0.5148173552  
-0.5799403594  
-0.5428619344  
-0.419105401  
-0.2342786438  
-0.02013804423  
0.1900659846  
0.3662859954  
0.4857265404  
0.5356781971  
0.514778095  
0.4325808168  
0.3075953696  
0.164162025  
0.02869954635  
-0.07406779044  
-0.1243546981  
-0.1095890736  
-0.0254681798  
0.124238485  
0.3289610239  
0.5733613934  
0.839702372  
1.110128937  
1.368528038  
1.601727567  
1.799969913  
1.956742043  
2.068151638  
2.132115519  
2.147614471  
2.114225593  
2.03203534  
1.901939024  
1.726206779  
1.509137376  
1.257582558  
0.9811483687  
0.6919218914  
0.4037040199  
0.1307931277  
-0.1135106777  
-0.3184618623  
-0.477231324  
-0.5878354635  
-0.653472833  
-0.6821804259  
-0.6858329401  
-0.6786213041  
-0.6752137139  
-0.6888593849  
-0.7296973038  
-0.8035105598  
-0.9110689897  
-1.048162177  
-1.206253381  
-1.373676493  
-1.537155811  
-1.683431973  
-1.80077663  
-1.880178304  
-1.91610085  
-1.906739854  
-1.853809628  
-1.761958049  
-1.637947856  
-1.489755052  
-1.325730077  
-1.153932961  
-0.9816866909  
-0.815378301  
-0.6604457576  
-0.5214778278  
-0.4023545528  
-0.3063249994  
-0.2359735594  
-0.1930439879  
-0.1781411736  
-0.1903492722  
-0.2268771811  
-0.2828009447  
-0.3510244546  
-0.4225081957  
-0.4868247527  
-0.5329839766  
-0.5504761041  
-0.5303898443  
-0.4664639428  
-0.3559186002  
-0.1999373026  
-0.003724436259  
0.2238676452  
0.4711176583  
0.7245022638  
0.9699344757  
1.194036861  
1.385307341  
1.535080905  
1.638195562  
1.693338527  
1.70302808  
1.673265164  
1.612870046  
1.53255974  
1.443826826  
1.357714574  
1.283585989  
1.228014863  
1.193921358  
1.180089659  
1.181161541  
1.188176483  
1.189649452  
1.173110218  
1.126931958  
1.042232283  
0.9145424004  
0.7449987821  
0.5407931035  
0.3147625735  
0.08408832062  
-0.1317576064  
-0.3135539664  
-0.445006235  
-0.5151408795  
-0.5200394054  
-0.4636034496  
-0.3572178175  
-0.2183081087  
-0.06800215815  
0.07176529734  
0.1812867078  
0.2457807175  
0.2573845769  
0.2161225561  
0.1297499321  
0.01249553977  
-0.1170732144  
-0.2387496924  
-0.3335343621  
-0.3862330931  
-0.3874461227  
-0.3346976557  
-0.2325921921  
-0.09203646598  
0.07131524582  
0.2391207814  
0.3925946804  
0.5146273518  
0.5915123511  
0.614106603  
0.5783602248  
0.4852484681  
0.3402438069  
0.1524679723  
-0.06627227429  
-0.3024579202  
-0.5417267435  
-0.7696387324  
-0.972357308  
-1.137311722  
-1.253890836  
-1.314195428  
-1.313810008  
-1.252515105  
-1.134785593  
-0.9699381621  
-0.7717794324  
-0.5576733569  
-0.3470442994  
-0.159420251  
-0.0122259624  
0.08138800495  
0.1143620121  
0.08688863689  
0.006697411864  
-0.1116613394  
-0.2484844046  
-0.3813763286  
-0.4881674572  
-0.5498985278  
-0.553435999  
-0.4933202938  
-0.3725536699  
-0.2021851564  
0.0002609721274  
0.2132978848  
0.4145496902  
0.5839310409  
0.7064378942  
0.7741401463  
0.787073128  
0.7529161363  
0.6855241019  
0.6025773025  
0.5227163354  
0.4626434402  
0.4346032312  
0.4446545185  
0.4919462047  
0.5690976433  
0.6635657398  
0.7597739387  
0.8416418877  
0.8951150822  
0.9103010514  
0.8829000811  
0.81473283  
0.7133090069  
0.590538658  
0.4608166006  
0.3387986769  
0.2372370721  
0.1652091771  
0.1270094295  
0.1218540311  
0.1444090835  
0.1860001556  
0.2362846906  
0.2850534656  
0.3238508797  
0.3471298065  
0.3527616504  
0.3418412545  
0.3178514321  
0.2854038686  
0.248798882  
0.2107356581  
0.1714171768  
0.1282706661  
0.07633839208  
0.009301967821  
-0.07905444599  
-0.1931858123  
-0.3342732997  
-0.4991325624  
-0.6798040615  
-0.8639395935  
-1.03599884  
-1.179111012  
-1.277347699  
-1.318076119  
-1.294008652  
-1.204621952  
-1.056677838  
-0.8637159082  
-0.6445385502  
-0.4208630202  
-0.214464684  
-0.04420475335  
0.07660130467  
0.1420805516  
0.1546578431  
0.1246986407  
0.06899460888  
0.008257048939  
-0.03598992657  
-0.04467952471  
-0.004142826441  
0.09172453285  
0.2403968855  
0.4309090737  
0.6452888896  
0.8610030397  
1.054049799  
1.202244686  
1.288213178  
1.301659767  
1.240627107  
1.111578748  
0.9283771115  
0.7103267824  
0.4796332836  
0.2586535451  
0.06732332643  
-0.07891103567  
-0.1704491596  
-0.2040731106  
-0.1827113625  
-0.1145611496  
-0.01176003208  
0.1111691757  
0.2388931008  
0.35670157  
0.4516881801  
0.513638423  
0.5356062448  
0.5142054959  
0.4496599147  
0.3456270469  
0.2088348173  
0.04853369474  
-0.1242234113  
-0.2974297519  
-0.4590935671  
-0.5982265538  
-0.7057970957  
-0.775515162  
-0.8043877564  
-0.7929310754  
-0.7450288713  
-0.6674228089  
-0.5689028287  
-0.4592844532  
-0.3483109939  
-0.2446023497  
-0.1547886509  
-0.08291820313  
-0.0301987558  
0.004914766748  
0.02630500246  
0.03952625403  
0.05096051076  
0.06691227893  
0.09273809404  
0.1321100351  
0.1865153472  
0.2550302762  
0.3344096511  
0.4194903005  
0.5038433172  
0.5806062024  
0.6433828265  
0.6870571568  
0.7084419104  
0.7066172384  
0.6829360883  
0.6406809503  
0.5844351633  
0.5192798854  
0.4499567923  
0.3801523138  
0.3120191787  
0.2460378797  
0.1812294959  
0.1156727461  
0.04723611227  
-0.0256313652  
-0.1031975626  
-0.1839892012  
-0.2646605548  
-0.3402453821  
-0.4047522987  
-0.4520267644  
-0.4767135956  
-0.4751803308  
-0.4462240667  
-0.3914354467  
-0.315159217  
-0.2240363167  
-0.1261980198  
