0.4090855438  
-0.172653774  
-0.7245210379  
-1.217349932  
-1.627554785  
-1.939144103  
-2.144791222  
-2.245864445  
-2.251483993  
-2.176817474  
-2.040875126  
-1.864157264  
-1.666443953  
-1.464986304  
-1.273280695  
-1.100454907  
-0.9512850744  
-0.8267009862  
-0.7246458192  
-0.6411182717  
-0.5712300461  
-0.5101486004  
-0.4538350205  
-0.3995382452  
-0.3460321993  
-0.2936128222  
-0.2439177421  
-0.1995787513  
-0.1637839292  
-0.1397661629  
-0.1302777388  
-0.1370896521  
-0.1605620057  
-0.1993468671  
-0.2502830644  
-0.3085147396  
-0.3678639598  
-0.4214600304  
-0.4625445928  
-0.4853925449  
-0.4861988095  
-0.4638069923  
-0.4201270088  
-0.3601531246  
-0.2915189253  
-0.2236279528  
-0.1664406424  
-0.1290882256  
-0.1185205538  
-0.1383882195  
-0.1883613071  
-0.2639976291  
-0.3572119251  
-0.457287084  
-0.552297063  
-0.6307270012  
-0.6830538925  
-0.7030614067  
-0.6886786964  
-0.6422383168  
-0.5700997641  
-0.4817160693  
-0.3882632657  
-0.301037291  
-0.2298518599  
-0.1816511854  
-0.1595366048  
-0.162331449  
-0.1847578578  
-0.2181882885  
-0.2518748854  
-0.274506276  
-0.2758787214  
-0.2484593444  
-0.1886355305  
-0.09747872216  
0.01909343963  
0.1507993565  
0.2840824281  
0.4036749087  
0.4944696402  
0.5434604016  
0.5415059559  
0.4846874673  
0.3750671793  
0.2207275058  
0.03506624315  
-0.164591517  
-0.3588944419  
-0.5286517848  
-0.6570211926  
-0.7314166882  
-0.744877189  
-0.6967269193  
-0.5924334192  
-0.4427109924  
-0.2620009846  
-0.06655088035  
0.1276141169  
0.3065526967  
0.4598528472  
0.5814795411  
0.669958462  
0.7279221779  
0.7611473051  
0.7772814066  
0.7844795797  
0.7901716391  
0.8001340259  
0.8179596065  
0.8449517277  
0.8803897308  
0.9220414163  
0.9667986199  
1.011292177  
1.052377039  
1.087442424  
1.114530797  
1.132319007  
1.140041967  
1.137418939  
1.124672507  
1.102642861  
1.072998927  
1.038468779  
1.00300914  
0.9718028631  
0.9510271622  
0.9473157385  
0.9669772487  
1.015008218  
1.094077816  
1.203618323  
1.339222081  
1.492489638  
1.65140741  
1.801291039  
1.926187349  
2.010606215  
2.041325577  
2.009038998  
1.909575144  
1.74450763  
1.521022665  
1.251042246  
0.9497108683  
0.6334467942  
0.3178454607  
0.01575129373  
-0.2642135123  
-0.5184203042  
-0.7481881515  
-0.9589284554  
-1.158605521  
-1.355769357  
-1.557472957  
-1.767417829  
-1.984629306  
-2.202899405  
-2.411089076  
-2.594277632  
-2.735598979  
-2.818507808  
-2.82915659  
-2.758538463  
-2.604102118  
-2.370603328  
-2.070076724  
-1.720937143  
-1.34630683  
-0.971801479  
-0.6230412227  
-0.3231861486  
-0.09077602484  
0.06188996465  
0.1296871528  
0.1148348417  
0.02635224447  
-0.1211323425  
-0.3090166101  
-0.5166400937  
-0.7232541287  
-0.9098583862  
-1.060741754  
-1.164600862  
-1.215174174  
-1.211350078  
-1.156790497  
-1.059120169  
-0.928783134  
-0.7776914438  
-0.6178050526  
-0.4597936639  
-0.3119146323  
-0.179245293  
-0.06333567004  
0.03765482782  
0.1283618829  
0.2152358333  
0.3052948205  
0.4047868192  
0.5179440382  
0.646019711  
0.7867535538  
0.9343638851  
1.080093052  
1.213244195  
1.322575245  
1.397872389  
1.431463665  
1.419469215  
1.362577817  
1.266233812  
1.140170757  
0.9973360571  
0.8523279624  
0.7195444758  
0.6112930517  
0.5361195228  
0.4975992689  
0.4937727412  
0.5173262001  
0.5565023567  
0.5966407003  
0.6221320724  
0.6185331536  
0.5745296138  
0.483507819  
0.3444927046  
0.1623656805  
-0.0526638535  
-0.2862198587  
-0.5213736719  
-0.7404695984  
-0.9269020508  
-1.066628942  
-1.149256406  
-1.168618175  
-1.1228498  
-1.014052212  
-0.8476529212  
-0.6316276831  
-0.3757099212  
-0.09068879371  
0.2121488322  
0.521433242  
0.8260160596  
1.115216101  
1.379069498  
1.608618927  
1.796255802  
1.93609472  
2.024328779  
2.059508216  
2.04266966  
1.97727279  
1.868923652  
1.724895939  
1.553502585  
1.363389386  
1.162839853  
0.959185935  
0.7583835844  
0.5648130589  
0.3812991605  
0.2093476588  
0.04952491626  
-0.09808133865  
-0.2334004047  
-0.3560064334  
-0.46488673  
-0.5583922545  
-0.6343943703  
-0.6906023455  
-0.7250103054  
-0.7363960156  
-0.7247828695  
-0.6917849534  
-0.6407549368  
-0.5767039666  
-0.5059618589  
-0.4356163154  
-0.3727976189  
-0.3238940161  
-0.2938164857  
-0.2854119434  
-0.2991388213  
-0.3330368862  
-0.3830321158  
-0.4435298713  
-0.5082288801  
-0.5710298081  
-0.6269160052  
-0.6726556285  
-0.7072251256  
-0.7318560182  
-0.7497150614  
-0.7652341014  
-0.7832143692  
-0.8078330243  
-0.8417389715  
-0.8853754988  
-0.9366649665  
-0.991100535  
-1.042245685  
-1.082544841  
-1.104320343  
-1.100781095  
-1.06689348  
-0.9999781673  
-0.8999619648  
-0.7692784853  
-0.6124733447  
-0.4356141919  
-0.2456351094  
-0.04972295187  
0.1451437603  
0.3324796026  
0.5064053528  
0.6616397889  
0.7934602671  
0.8977172605  
0.9709702109  
1.010774748  
1.016086066  
0.9877095034  
0.9286847779  
0.8444665613  
0.7428057184  
0.6332550362  
0.5263089598  
0.4322573652  
0.3598955372  
0.315302961  
0.3008909495  
0.3149135507  
0.3515678731  
0.4017157444  
0.4541454953  
0.4972111465  
0.5205942374  
0.5169027413  
0.482836625  
0.4197249243  
0.3333172109  
0.2328473391  
0.1295305523  
0.034716564  
-0.04197416659  
-0.09422681205  
-0.120031838  
-0.121941759  
-0.1065186326  
-0.08305775057  
-0.06179758856  
-0.05190742547  
-0.05960694848  
-0.08674033728  
-0.1300640121  
-0.1813952505  
-0.2286237712  
-0.2574542358  
-0.2536140812  
-0.2051912763  
-0.1047441256  
0.04916359376  
0.2512309672  
0.4896232176  
0.7470926369  
1.00285534  
1.234970818  
1.422876376  
1.54974864  
1.604367876  
1.582254612  
1.485963123  
1.324525765  
1.112162208  
0.8664594882  
0.6062935097  
0.3497579779  
0.1123745621  
-0.09422806801  
-0.2630364985  
-0.3917525222  
-0.4823190074  
-0.5400022964  
-0.5722014883  
-0.5871747963  
-0.5928681067  
-0.5959777845  
-0.6013487074  
-0.6117337811  
-0.6278856227  
-0.6489013561  
-0.6727222719  
-0.696660959  
-0.7178710638  
-0.7336788956  
-0.7417545023  
-0.7401370178  
-0.7271640631  
-0.7013809756  
-0.6614962535  
-0.6064501052  
-0.5356108285  
-0.4490866402  
-0.3480845972  
-0.235241946  
-0.1148161842  
0.007346656343  
0.1241341733  
0.2277807438  
0.3107358995  
0.3666826105  
0.3915684054  
0.3844737505  
0.348167593  
0.2892104072  
0.2175290821  
0.1454622458  
0.08634026211  
0.05275022976  
0.05469711112  
0.09789626164  
0.18244098  
0.3020872786  
0.4442830648  
0.5910474899  
0.7206421272  
0.8099149395  
0.8370609822  
0.7844986281  
0.6414833631  
0.406132066  
0.08654302504  
-0.2991901167  
-0.72413428  
-1.154766261  
-1.554092233  
-1.885291215  
-2.115449833  
-2.218959472  
-2.180158721  
-1.99491793  
-1.671006282  
-1.22722584  
-0.6914680172  
-0.09796374871  
0.515901994  
1.112833638  
1.658552538  
2.124140954  
2.487609737  
2.734654893  
2.858648653  
2.860028248  
2.745282466  
2.525745659  
2.216393098  
1.83477735  
1.400146683  
0.93276704  
0.4533612686  
-0.01741375696  
-0.4595435494  
-0.8543541468  
-1.185343296  
-1.439098565  
-1.606216243  
-1.682072222  
-1.667326422  
-1.568018327  
-1.395197999  
-1.164066974  
-0.8927061987  
-0.6005116101  
-0.3065247308  
-0.02784927578  
0.2216495614  
0.4322067865  
0.5984947677  
0.7194194191  
0.7974265803  
0.8374554572  
0.8457026974  
0.8283968602  
0.7907630678  
0.7363208264  
0.6666067274  
0.5813379897  
0.4789687374  
0.3575206687  
0.2155297011  
0.05295749944  
-0.1281120479  
-0.3231091972  
-0.525008709  
-0.7247643708  
-0.9120907802  
-1.076473058  
-1.208252711  
-1.299634416  
-1.345463341  
-1.343651575  
-1.295215748  
-1.203915052  
-1.075560299  
-0.9171234934  
-0.7357750455  
-0.5380275832  
-0.3291080505  
-0.1126624395  
0.1091651901  
0.335301419  
0.565033953  
0.7971541083  
1.029096091  
1.256237419  
1.471485491  
1.665267278  
1.825959768  
1.940762062  
1.996936534  
1.983308976  
1.891862308  
1.719226676  
1.467867917  
1.146786103  
0.7715492607  
0.3635875732  
-0.05128118999  
-0.4449917186  
-0.7898589469  
-1.061390788  
-1.240954433  
-1.317935225  
-1.29104834  
-1.168594522  
-0.9675451214  
-0.7115356421  
-0.4279962641  
-0.1447865922  
0.1132037185  
0.3270128488  
0.4856884171  
0.5871897489  
0.6379820166  
0.6513635891  
0.644798136  
0.6366540669  
0.6428399232  
0.6738751472  
0.7328340722  
0.8144942514  
0.9058236677  
0.9877382865  
1.037867412  
1.033908775  
0.9570745988  
0.795109271  
0.5444373833  
0.2111286421  
-0.1894425413  
-0.6341705604  
-1.094785528  
-1.541019902  
-1.94390975  
-2.27878335  
-2.527531807  
-2.679904956  
-2.733726109  
-2.694085269  
-2.571721621  
-2.380913212  
-2.137235722  
-1.855545852  
-1.548474739  
-1.225613207  
-0.8934226555  
-0.5558054431  
-0.2151368509  
0.1264839759  
0.4660386789  
0.7986814462  
1.117285384  
1.412530585  
1.673500205  
1.888691134  
2.047268908  
2.140372509  
2.162286183  
2.111318999  
1.990292601  
1.806587154  
1.571760743  
1.300800308  
1.011068513  
0.7210707609  
0.4491143493  
0.2119659339  
0.02360088517  
-0.1058950387  
-0.1711645865  
-0.1721145244  
-0.1140555712  
-0.007426575347  
0.1329477325  
0.2890209058  
0.4410575713  
0.5694302574  
0.656503318  
0.6884386158  
0.6567035309  
0.5591131997  
0.4002473216  
0.1911772418  
-0.05151979802  
-0.3073641663  
-0.5540353382  
-0.7696847452  
-0.9352305447  
-1.036372503  
-1.065100371  
-1.020502549  
-0.9087958173  
-0.7425454485  
-0.5391884475  
-0.3190178424  
-0.1028794226  
0.09014547015  
0.2447900604  
0.3511473887  
0.4055214708  
0.4104986958  
0.3742592509  
0.3092228979  
0.2302361994  
0.1525386074  
0.0897776684  
0.05232989889  
0.04610940219  
0.07201692986  
0.1260505621  
0.2000410562  
0.28289366  
0.3621524075  
0.425688014  
0.4632902243  
0.4679794931  
0.4368736823  
0.3715329541  
0.2777294696  
0.1646939512  
0.04392579056  
-0.0722738274  
-0.1723714255  
-0.2470721217  
-0.2905025537  
-0.3009569171  
-0.2811037353  
-0.2376179218  
-0.1802890003  
-0.1206911032  
-0.07060595989  
-0.04036393742  
-0.03734137663  
-0.06478188246  
-0.1211216975  
-0.1998902473  
-0.2902514996  
-0.3781060058  
-0.4476703268  
-0.4833489865  
-0.4716922819  
-0.403213569  
-0.2738445929  
-0.08585416028  
0.1519058652  
0.4244770085  
0.7119650469  
0.9913060441  
1.238443264  
1.430690103  
1.549029849  
1.580083914  
1.517544421  
1.362898309  
1.125360605  
0.821019338  
0.4712886698  
0.100824939  
-0.2648480058  
-0.6017583255  
-0.8896808634  
-1.113865713  
-1.266127621  
-1.345181399  
-1.356214352  
-1.309768404  
-1.220092954  
-1.103193523  
-0.9748184589  
-0.8486490588  
-0.7348992315  
-0.639479717  
-0.5638006184  
-0.5051869009  
-0.457824773  
-0.4140430385  
-0.3657630698  
-0.3058817318  
-0.2294092654  
-0.1342250358  
-0.02136359007  
0.105160579  
0.238944762  
0.3720743617  
0.4961539789  
0.603325399  
0.6871425094  
0.7431988021  
0.7694462814  
0.766218478  
0.7359862924  
0.6829399208  
0.6124784036  
0.5307051707  
0.443987855  
0.3586158836  
0.2805604197  
0.2152924025  
0.1676232931  
0.1415152466  
0.139837767  
0.1640729396  
0.2140060562  
0.2874578568  
0.3801503308  
0.4857544526  
0.5961930537  
0.7021866312  
0.7940256968  
0.8624641232  
0.8996411744  
0.8998842186  
0.8602902131  
0.7809757937  
0.6649798704  
0.5178148053  
0.3467579344  
0.1599896406  
-0.03426410626  
-0.2284748678  
-0.4162986426  
-0.5927703527  
-0.7541967762  
-0.8978125762  
-1.021312265  
-1.122383379  
-1.198385607  
-1.246260705  
-1.262733587  
-1.244776697  
-1.190256507  
-1.098636577  
-0.9715816662  
-0.8133165696  
-0.6306383776  
-0.4325264373  
-0.2293915543  
-0.03203872593  
0.1494870394  
0.3070104218  
0.4351045976  
0.5316074635  
0.5976852187  
0.6374271806  
0.6570458947  
0.6637873647  
0.6647383993  
0.665691893  
0.6702548999  
0.6793211518  
0.6909853397  
0.7009026569  
0.7030334188  
0.6906619603  
0.6575361502  
0.5989492882  
0.5126345058  
0.3993106569  
0.2628398629  
0.1099422833  
-0.05045601245  
-0.2081880596  
-0.3529488779  
-0.4754159916  
-0.568223957  
-0.6266559985  
-0.6489818482  
-0.6363999197  
-0.5926031825  
-0.52306744  
-0.4341598373  
-0.3322327664  
-0.2228229664  
-0.1100872814  
0.003452806106  
0.1168482261  
0.2303527546  
0.3448494418  
0.4611615406  
0.5793778239  
0.6982977183  
0.8150861804  
0.9251650524  
1.022378195  
1.09937663  
1.148202228  
1.160983912  
1.130706489  
1.051982695  
0.9217835538  
0.740066296  
0.5102732853  
0.2396197505  
-0.06086274177  
-0.3766036596  
-0.6901194333  
-0.9820119444  
-1.232311908  
-1.4220897  
-1.535196897  
-1.559961845  
-1.490647142  
-1.328448837  
-1.081890182  
-0.7664947769  
-0.4037287607  
-0.01928214379  
0.3591440525  
0.7043182462  
0.9919547779  
1.202923765  
1.324944705  
1.353590979  
1.292507586  
1.152821914  
0.9518390834  
0.7111587623  
0.4544307638  
0.204989929  
-0.01637937331  
-0.1933257816  
-0.3152697497  
-0.3780702607  
-0.3839846803  
-0.3409404405  
-0.2612317644  
-0.159818068  
-0.05243340381  
0.04625368306  
0.1242155507  
0.1731903499  
0.1892483218  
0.1727577707  
0.1278046159  
0.06118538122  
-0.01885605968  
-0.1039237631  
-0.1866338025  
-0.2614555197  
-0.325148019  
-0.3767562349  
-0.4172022927  
-0.4485780556  
-0.4732688872  
-0.4930632998  
-0.5083993573  
-0.517857188  
-0.5179901561  
-0.5035265705  
-0.4679281621  
-0.4042605273  
-0.3062797013  
-0.1696213652  
0.007058450386  
0.2211282787  
0.4653603842  
0.727773984  
0.9920261886  
1.238379204  
1.445216458  
1.59099499  
1.656460889  
1.626877457  
1.494014568  
1.25762061  
0.9261473286  
0.5165712104  
0.05326688393  
-0.4340090482  
-0.912825535  
-1.351181142  
-1.72064772  
-1.999159379  
-2.17310291  
-2.238428308  
-2.200643066  
-2.073687511  
-1.877827378  
-1.636868521  
-1.375046876  
-1.114016651  
-0.8703411674  
-0.6538069824  
-0.4667699853  
-0.3046046072  
-0.1571538481  
-0.0109536366  
0.148110752  
0.3320995046  
0.5486663886  
0.7993782748  
1.078940679  
1.375419766  
1.671408713  
1.94596943  
2.177060629  
2.344127334  
2.430505603  
2.425343742  
2.324808021  
2.132469563  
1.858852065  
1.520260421  
1.137081894  
0.7317956384  
0.326958307  
-0.05658849434  
-0.4011308017  
-0.6929912413  
-0.9229248292  
-1.086056287  
-1.18147104  
-1.211591269  
-1.181482082  
-1.098190111  
-0.97017614  
-0.8068515337  
-0.6182014567  
-0.4144163867  
-0.2055044373  
-0.0008278107431  
0.1914261933  
0.3647842485  
0.5149680276  
0.640196847  
0.7412050464  
0.8209134867  
0.8837083061  
0.9343963309  
0.9769324363  
1.013129403  
1.041557697  
1.056872466  
1.049772411  
1.00770798  
0.9163566089  
0.7617578529  
0.5328675812  
0.2241890513  
-0.1619250446  
-0.6137176462  
-1.109559057  
-1.618808062  
-2.104040478  
-2.524497669  
-2.840393013  
-3.017558805  
-3.03179578  
-2.872312375  
-2.543683137  
-2.065988599  
-1.473018119  
-0.8087106882  
-0.1222979171  
