5790.298077  
6153.309323  
6896.119094  
8434.190073  
13090.87076  
17029.25357  
14915.07482  
41023.9327  
28204.10336  
38987.41728  
27988.51655  
37019.24719  
21253.37278  
2089.370162  
15113.75651  
12764.57735  
5243.457041  
10844.52724  
4664.239724  
12601.82614  
29792.39051  
11903.72542  
549.0883485  
6714.155907  
3703.381067  
3407.359069  
614.3618587  
954.7226901  
1438.631833  
5584.832338  
4918.401754  
4513.804236  
9843.268165  
3003.288674  
869.120935  
2711.377979  
5090.973286  
4561.125065  
2203.952752  
101.9198241  
3800.491571  
3155.160799  
895.348836  
3226.328633  
2074.461322  
8899.567035  
5184.633676  
8407.66071  
4909.751774  
303.8045429  
1248.124733  
507.0278883  
576.1356541  
3903.990975  
3.322637993  
2111.259966  
86.57331772  
464.8918393  
812.4922627  
94.57224467  
306.8509179  
455.4983021  
246.9721352  
299.3457465  
548.9531182  
559.9972622  
159.8701827  
70.44937217  
77.35509569  
120.3421551  
70.91810417  
138.8628428  
101.2490405  
86.22860405  
82.34264063  
66.93583665  
54.60471792  
49.72771376  
51.39670755  
46.15340883  
40.3835829  
38.56184034  
32.62047851  
30.53828422  
28.69526356  
26.69735755  
23.8373365  
22.32572377  
20.810049  
20.75581151  
18.96384261  
17.39754888  
16.69569773  
15.48637167  
14.88701703  
13.91689019  
13.18472383  
12.48537425  
11.79257958  
11.14411813  
10.62974141  
10.10300639  
9.574896386  
9.125766668  
8.665044593  
8.270433996  
7.898252962  
7.537557011  
7.204492241  
6.891874906  
6.599604194  
6.321902153  
6.062618056  
5.803042991  
5.574518299  
5.349261266  
5.132023081  
4.935314378  
4.745393233  
4.561321217  
4.390153263  
4.224937657  
4.067577304  
3.91909359  
3.778997001  
3.642680907  
3.513044379  
3.389417098  
3.272121433  
3.159869682  
3.051802497  
2.949144762  
2.850406825  
2.756170493  
2.665846581  
2.579491142  
2.496388219  
2.416845357  
2.340387613  
2.267121642  
2.19671559  
2.129077898  
2.064079119  
2.00161513  
1.941527838  
1.883744869  
1.828093038  
1.774590546  
1.723024732  
1.673338123  
1.625522365  
1.579418301  
1.53491284  
1.492001299  
1.450650105  
1.410695598  
1.372135157  
1.334935789  
1.298976822  
1.26427373  
1.230723467  
1.198280236  
1.166913517  
1.136605391  
1.107267781  
1.078879309  
1.051414342  
1.024829139  
0.9990924284  
0.9741841429  
0.9500220979  
0.926644827  
0.903961171  
0.8819823292  
0.8606900054  
0.8400312911  
0.8200127977  
0.8005872664  
0.7817212668  
0.7634327963  
0.7456610721  
0.7284375321  
0.7116784448  
0.6954349729  
0.679641283  
0.6642970058  
0.6493866095  
0.6349064226  
0.6208172168  
0.6071380781  
0.593819353  
0.5808799724  
0.5682814803  
0.5560397124  
0.5441166373  
0.532519789  
0.5212334572  
0.5102472677  
0.4995455629  
0.4891232556  
0.4789928669  
0.4690976277  
0.4594931119  
0.4501139058  
0.4409677323  
0.4320658166  
0.4233793931  
0.4149241386  
0.4066728459  
0.3986357691  
0.3908022135  
0.3831295735  
0.3756796038  
0.3683968666  
0.3613007758  
0.354353995  
0.3475968396  
0.3409984568  
0.3345520263  
0.3282525648  
0.3221061475  
0.316113606  
0.3102501801  
0.3045287705  
0.2989336172  
0.2934794368  
0.2881468963  
0.2829234808  
0.2778317979  
0.2728478337  
0.2679772534  
0.2632142123  
0.2585595274  
0.2540154084  
0.2495654218  
0.2452076716  
0.2409505986  
0.2367902114  
0.2327129318  
0.2287326079  
0.2248345683  
0.2210221971  
0.2172879124  
0.2136309754  
0.2100604217  
0.2065539631  
0.2031281628  
0.1997626363  
0.1964764059  
0.193264694  
0.1901169717  
0.1870291709  
0.183998575  
0.1810377604  
0.1781403781  
0.1752938333  
0.1725065168  
0.1697805822  
0.1671032763  
0.1644891046  
0.1619167503  
0.15939826  
0.1569282709  
0.1545066153  
0.1521318877  
0.1498091396  
0.147531614  
0.1452889467  
0.1430907614  
0.1409406937  
0.138835149  
0.136761279  
0.1347298349  
0.1327351275  
0.1307797986  
0.128863291  
0.1269850387  
0.1251320752  
0.1233238481  
0.1215428261  
0.1197993275  
0.1180839593  
0.1164047737  
0.1147525157  
0.1131271603  
0.1115300116  
0.1099729587  
0.1084385748  
0.1069256561  
0.1054482835  
0.1039942306  
0.1025660267  
0.1011661983  
0.09978673918  
0.09843615664  
0.09710409966  
0.09580169711  
0.09451787008  
0.09325764513  
0.09201702112  
0.09080397518  
0.08960341581  
0.08842859546  
0.0872793248  
0.08613876536  
0.08502165438  
0.08392845338  
0.08284598524  
0.08178554923  
0.08074933834  
0.07972336558  
0.07871319059  
0.07772788252  
0.07675207019  
0.07579436424  
0.07485414885  
0.07393159936  
0.07301812358  
0.07212363782  
0.07124411839  
0.07037806091  
0.06952084836  
0.06868817061  
0.06786327634  
0.06705355111  
0.06625807944  
0.06547384595  
0.06470051286  
0.06394112398  
0.06319411364  
0.06246199583  
0.06173847745  
0.06102630449  
0.06032522856  
0.05963910174  
0.05895838583  
0.05829496831  
0.0576364777  
0.05699160114  
0.05635795895  
0.05572890658  
0.05511731973  
0.05450784357  
0.05391504033  
0.0533308257  
0.05274794491  
0.05217957756  
0.05162012593  
0.05107380866  
0.05052706526  
0.04999650831  
0.04946907947  
0.04895302972  
0.04844538903  
0.04794106443  
0.04745234782  
0.04696238456  
0.0464837354  
0.04601330868  
0.04555026409  
0.04509457883  
0.04464560805  
0.04420377163  
0.04376479862  
0.04333648805  
0.04291656221  
0.04250568647  
0.04209247288  
0.0416896463  
0.041293424  
0.0409062822  
0.04051909579  
0.04013948453  
0.0397690765  
0.03940114691  
0.03903881716  
0.03868208411  
0.03833445324  
0.0379874045  
0.03765218346  
0.03731603475  
0.03699054044  
0.03666196516  
0.03634470509  
0.03602870024  
0.03572275538  
0.03541799835  
0.03512206447  
0.03482509186  
0.03453741763  
0.03425076314  
0.03396725192  
0.03369368281  
0.0334217562  
0.03315519258  
0.0328932446  
0.03263146944  
0.03237806723  
0.03212479975  
0.0318793161  
0.03163615917  
0.03139804292  
0.03116225038  
0.0309311149  
0.03070552743  
0.0304791619  
0.03025932488  
0.03004317487  
0.0298312082  
0.0296230016  
0.02941589606  
0.02921517312  
0.02901753305  
0.02882033855  
0.02862617847  
0.02843967089  
0.02825303707  
0.0280706902  
0.02789352038  
0.02771684967  
0.02754352378  
0.02737700559  
0.02720665772  
0.02704281202  
0.026884785  
0.02672821433  
0.02657141968  
0.02641948291  
0.02626909111  
0.02612458549  
0.02597953263  
0.0258427081  
0.02570553232  
0.02556824597  
0.02543625695  
0.02530800097  
0.02517864714  
0.02505436406  
0.02493275235  
0.02481420121  
0.02469793561  
0.02458320389  
0.0244725791  
0.02436409711  
0.02425761656  
0.02415126133  
0.02405066681  
0.02395186869  
0.0238531133  
0.02376212002  
0.0236681861  
0.02357924705  
0.02348987574  
0.0234060182  
0.02332139847  
0.023243552  
0.02316675466  
0.02309014299  
0.0230149557  
0.02294543133  
0.0228732906  
0.02280859986  
0.02274158882  
0.02267855361  
0.02261995469  
0.02255955088  
0.02250491413  
0.02244734092  
0.02239786529  
0.02234725373  
0.02230018415  
0.02225465239  
0.02221135377  
0.02216803642  
0.02213087166  
0.02209210934  
0.02205779727  
0.0220262475  
0.02199439131  
0.02196455018  
0.02193777199  
0.02191025008  
0.02188901067  
0.0218666864  
0.0218490983  
0.02183110187  
0.02181752066  
0.02180429755  
0.02179271204  
0.02178353911  
0.02177596464  
0.02177080944  
0.02176847047  
0.02176371175  
