22,-0.0024729,0.012034,0.01752,-0.99119,0.00078274,-1.96,0.97741,-0.76996,3.6863,-0.12551,3.2164,8.88e-05,0.40824,3.0869,0.017455,3.9493,0.0040217,0.99126,0.045949,0.025225,0.020695,0.017448,0.37576,0.31852,0.26103,0.019661,0.0044036,0.0031809,0.017446,0.51134,0.21285,0.10887,239.81,4758.9,7321.4,6496.8,18818,0.34389,0.074434,0.34389,0.94488,1.9442,0.44954,0.16577,0.012708,41,128.8,3374,2.7564e+05,5.8044,36.048,91098,11151,8424,0.91265,0.93255,0.20455,0.15195,0.11216,0.58463,96393,37841,0.0010197,0.00051938,0,0.065784,0,0.058725,0.0025298,0.025694,0.0054727,0.035952,0.597,0.082665,0.25713,0.25526,0.39733,0.25431,0.26168,0.49095,0.20143,0.28219,0.49835,0.18359,55.106,6.8663,16325,51478,50777,0.046858,0.033489,0.028466,0.23216,0.2125,0.073898,0.44089,0.43997,0.099216,0.62696,0.63532,0.1125,0.77271,0.78247,0.1183,0.0026949,0.0019154,0.040455,0.003663,0.039517,-0.049483,0.0069174,0.0050715,0.049194,0.0088583,0.054266,-0.06383,0.013735,0.010343,0.057841,0.015948,0.069387,-0.078046,0.0016434,0.0011668,0.055014,0.0060061,0.032576,-0.039294,0.0041882,0.0030445,0.064078,0.010836,0.045492,-0.050422,0.0080568,0.0059704,0.071721,0.016567,0.058162,-0.06178,0.001051,0.0007482,0.0315,0.00035993,0.021483,-0.030062,0.0027553,0.0020446,0.040902,0.0034232,0.029195,-0.03933,0.0057024,0.0043899,0.051537,0.0083008,0.037194,-0.047403,5.101e-07,3.4183e-07,0.00015102,-0.0030868,0.014858,-0.0089953,3.1937e-05,2.129e-05,0.0030714,-0.0037368,0.019709,-0.017319,0.00023851,0.00016181,0.011204,-0.0033911,0.026261,-0.022069,0.38893,74,74,40,988,3,3,3,0.645
22,-0.0027489,0.013134,0.019114,-0.99039,0.00090628,-1.957,0.976,-0.14421,4.5879,-0.041572,3.1514,0.0020748,0.65688,4.7438,0.019136,6.7743,0.0068985,0.99042,0.070727,0.02801,0.018352,0.012666,0.33934,0.30722,0.28163,0.042187,0.010029,0.0059939,0.013597,0.50238,0.23327,0.019455,39.722,758.74,1739.4,9533.8,12072,0.40199,0.26363,0.40199,1.1389,1.3771,0.46176,0.17271,0.014768,54,60.722,2270,97819,6.6762,47.16,61290,13608,2214,0.91727,0.93864,0.25925,0.19612,0.13488,0.81601,26037,15549,0.0014828,0.00068677,0,0.1303,0,0.092927,0.050845,0.19537,0.077424,0.30571,0.68186,3.4898,4.6424,0.29594,0.29454,0.25952,0.4254,0.24213,0.15049,0.45119,0.24619,0.1384,32.756,7.0072,17351,38925,38049,0.31544,0.28517,0.11294,0.63294,0.61368,0.11874,0.78704,0.78769,0.10439,0.86319,0.87494,0.091286,0.90346,0.91684,0.081522,0.070023,0.08197,0.61954,0.27315,0.24925,0.12462,0.13607,0.15529,0.57034,0.33028,0.29932,0.13295,0.20458,0.22998,0.50778,0.3635,0.33373,0.14135,0.043888,0.050921,0.86591,0.26371,0.22341,0.091013,0.084742,0.096544,0.76415,0.30731,0.26412,0.098915,0.12498,0.14144,0.65571,0.32799,0.29155,0.10973,0.023973,0.027418,0.42348,0.12673,0.12664,0.059273,0.049541,0.056156,0.43344,0.1691,0.16352,0.07243,0.07922,0.088844,0.42198,0.20177,0.19133,0.080108,0.002162,0.0036314,0.37726,0.048119,0.062906,0.096827,0.0060222,0.0097695,0.34135,0.058118,0.075682,0.1239,0.011659,0.018235,0.32277,0.071211,0.091738,0.14452,0.38449,74,74,40,988,3,3,3,0.645
22,-0.0022451,0.010655,0.015605,-0.99216,0.00055965,-1.9664,0.98191,0.0048589,3.1607,0.026777,3.2809,5.9619e-05,0.32324,2.5848,0.015607,3.2463,0.0033058,0.99219,0.036564,0.015269,0.011313,0.0090035,0.39314,0.32005,0.25101,0.020539,0.0039109,0.0022979,0.0090578,0.52099,0.20939,0.14875,228.19,5711.2,14091,25191,45223,0.2712,0.075959,0.2712,0.84015,1.3527,0.45745,0.15637,0.013166,43,191.14,6090,8.6603e+05,6.0844,38.932,1.6443e+05,18063,17982,0.90754,0.92225,0.49811,0.39028,0.32524,0.90781,89056,43200,0.0013967,0.00066661,0,0.046915,0,0.044938,0.001351,0.014654,0.00011099,0.012659,2.3695,3.103,0.023313,0.25248,0.393,0.25174,0.27397,0.45149,0.20038,0.27371,0.47422,0.19463,63.791,6.797,14119,53112,51995,0.11452,0.091972,0.094917,0.35939,0.34554,0.15608,0.62154,0.63004,0.19083,0.81534,0.82789,0.19961,0.91849,0.92798,0.19186,0.0098409,0.0071394,0.20156,0.048488,0.065541,-0.086044,0.020226,0.014823,0.19625,0.061738,0.084857,-0.11095,0.034072,0.025281,0.19577,0.076384,0.10421,-0.13428,0.0041588,0.0030751,0.18994,0.030814,0.041007,-0.054979,0.0090826,0.0066582,0.18959,0.040708,0.055237,-0.074772,0.015624,0.011515,0.18976,0.050887,0.070432,-0.092233,0.0053046,0.0038254,0.21692,0.036557,0.047855,-0.063569,0.010996,0.0080927,0.22271,0.049177,0.061146,-0.080646,0.018588,0.01392,0.2292,0.062497,0.073054,-0.095597,0.00037748,0.00023882,0.15248,0.0099285,0.022474,-0.023583,0.00094368,0.00059932,0.12382,0.0098994,0.028978,-0.034269,0.0020038,0.001272,0.12842,0.013582,0.037009,-0.049247,0.44195,74,74,40,988,3,3,3,0.645
22,-0.0015526,0.0077441,0.011179,-0.99439,0.00067258,-1.9584,0.96945,-0.17289,3.1474,-0.037441,3.2617,2.0167e-05,0.31634,3.0035,0.01107,3.8491,0.0039197,0.99446,0.052078,0.031446,0.025495,0.021501,0.44886,0.26292,0.23685,0.019731,0.0058384,0.0039576,0.021843,0.54378,0.090538,0.38834,289.88,3044.4,5366.7,4914.7,13617,0.36307,0.14943,0.36307,1.0474,1.9266,0.42715,0.13142,0.0086967,66,52.197,1466,49163,5.3703,31.575,39582,29079,7047,0.91813,0.94192,0.16716,0.11579,0.11542,0.58779,33654,19534,0.0010714,0.0004818,0,0.041583,0,0.049242,0.0059579,0.022842,0.0075928,0.023028,1.346,1.9243,0.2253,0.26194,0.34235,0.25804,0.31105,0.38057,0.16355,0.32965,0.36026,0.16651,25.33,6.967,20265,42853,41984,0.19764,0.18039,0.081978,0.48396,0.48708,0.10518,0.70633,0.72351,0.10853,0.83556,0.8556,0.10237,0.9004,0.91423,0.094123,0.028952,0.030922,0.29676,0.11666,0.13131,0.040501,0.058325,0.064507,0.28321,0.14608,0.17264,0.080978,0.091272,0.10382,0.26245,0.16697,0.20682,0.12674,0.0072422,0.0078305,0.16553,0.041956,0.065004,0.025803,0.016597,0.019945,0.17338,0.058563,0.095121,0.083718,0.028439,0.036407,0.17286,0.072877,0.12403,0.1423,0.01969,0.021147,0.40295,0.11113,0.10979,0.034892,0.037761,0.040851,0.38275,0.13709,0.13654,0.04872,0.057372,0.062477,0.35404,0.15488,0.15575,0.063084,0.0020206,0.0019454,0.40847,0.048307,0.051436,-0.0064551,0.0049017,0.0047818,0.32187,0.050351,0.062745,-0.0053848,0.0081718,0.0080287,0.26209,0.05247,0.072757,-0.0046179,0.4411,74,74,40,988,3,3,3,0.645
22,-0.0024215,0.011552,0.016916,-0.9915,0.00061076,-1.9649,0.98178,-0.2967,3.7603,-0.026259,3.2372,0.00035088,0.475,3.6467,0.016932,4.7017,0.0047879,0.99153,0.037167,0.016108,0.0132,0.011007,0.37254,0.34609,0.24459,0.020514,0.0028992,0.0021982,0.011176,0.51831,0.26111,0.18262,217.71,10502,15159,15810,41689,0.34898,0.18566,0.34898,0.98784,1.4182,0.45671,0.16415,0.013816,61,81.951,2504,1.1727e+05,6.1091,42.092,67608,25488,10800,0.91456,0.93608,0.092007,0.066252,0.044027,0.34123,68533,30317,0.0010632,0.00051099,0,0.080999,0,0.053401,0.0054614,0.0092652,0.0041629,0.00043526,0.72509,0.13792,1.615,0.25525,0.3625,0.26123,0.27893,0.41058,0.20672,0.29598,0.40105,0.20058,45.073,7.0531,20784,57542,56324,0.11486,0.10272,0.063216,0.34324,0.34351,0.098983,0.58438,0.60145,0.11914,0.7686,0.79043,0.12495,0.89186,0.90798,0.1237,0.0014996,0.0011372,0.020395,-0.0024983,0.038695,-0.033425,0.0040902,0.0031699,0.026353,-0.00040384,0.052568,-0.044468,0.0089366,0.0071265,0.034096,0.0041535,0.067012,-0.055691,0.0006752,0.00051295,0.020477,-0.0016906,0.029047,-0.02627,0.0019569,0.0015321,0.027125,-2.056e-05,0.039751,-0.029966,0.0041231,0.0033387,0.033253,0.0025274,0.050799,-0.034874,0.00068365,0.00051796,0.018564,-0.0021826,0.02302,-0.019601,0.0017088,0.0013077,0.022981,-0.0013863,0.029907,-0.029425,0.0039185,0.0030754,0.032085,0.0019813,0.037566,-0.039983,0.00014074,0.00010633,0.03775,0.0011457,0.017005,-0.01204,0.0004245,0.00033014,0.036987,0.0014262,0.021678,-0.014333,0.00090567,0.00071988,0.038542,0.0021482,0.027775,-0.017357,0.41606,74,74,40,988,3,3,3,0.645
22,-0.0021841,0.010754,0.015577,-0.99217,0.0008239,-1.9578,0.97319,-0.85015,4.275,-0.12969,3.1917,0.00090541,0.56654,4.5555,0.015435,6.1072,0.0062192,0.99227,0.046399,0.028866,0.023503,0.019876,0.40001,0.27065,0.28424,0.016564,0.0051794,0.0035341,0.019822,0.52906,0.12812,0.057007,346.76,3322,5678.1,5086.3,14434,0.25662,0.1137,0.25662,1.1376,1.1466,0.45663,0.15516,0.011758,45,66.711,1361,44795,5.1683,31.275,36747,10908,7101,0.91853,0.94156,0.19683,0.13547,0.13035,0.66158,49664,25372,0.00086228,0.00042285,0,0.056088,0,0.05643,0.0075998,0.0078149,0.018784,0.0042997,0.40816,1.0434,0.62554,0.25134,0.36565,0.28148,0.28323,0.45578,0.23169,0.28904,0.46071,0.22382,49.64,7.6001,15731,28050,26782,0.042594,0.035896,0.01451,0.24824,0.2354,0.04431,0.50624,0.49667,0.063884,0.68204,0.68029,0.068629,0.81633,0.82272,0.070086,0.0019477,0.0015723,0.016396,-0.00020095,0.049064,-0.03943,0.0051454,0.0042739,0.02052,0.0022612,0.068816,-0.048577,0.0097641,0.0082814,0.023059,0.0047359,0.087818,-0.05462,0.00049251,0.00048841,0.0092456,-0.0024157,0.032272,-0.0010135,0.0016794,0.0016877,0.014409,-0.0010204,0.044582,0.0009006,0.003639,0.0037077,0.018166,0.00070475,0.05741,0.0044338,0.00070209,0.00051079,0.011801,-0.0016089,0.02995,-0.02608,0.0012575,0.00092091,0.010469,-0.0026506,0.040789,-0.033522,0.0024621,0.0018251,0.012478,-0.0022245,0.051088,-0.048283,0.00075305,0.00057311,0.12503,0.014837,0.035698,-0.039581,0.0022629,0.0017087,0.12204,0.01936,0.047775,-0.047066,0.0039171,0.0029492,0.10318,0.020655,0.059184,-0.052917,0.33517,74,74,40,988,3,3,3,0.645
22,-0.0030569,0.01444,0.021055,-0.98941,0.000874,-1.9581,0.97902,-0.455,3.5065,-0.040307,3.2857,6.6262e-05,0.46415,3.1899,0.021129,4.0336,0.0041075,0.98942,0.036454,0.012391,0.0091661,0.0073697,0.34663,0.29615,0.3216,0.023224,0.0031967,0.0017896,0.0074086,0.48787,0.18747,0.0039104,166.35,8198.4,22116,36237,66718,0.28884,0.093983,0.28884,1.0657,1.5072,0.4623,0.18226,0.016334,31,223.87,3079,4.0165e+05,3.5124,14.968,83133,49788,18171,0.9059,0.91899,0.4698,0.36547,0.28445,0.9241,88971,42960,0.0015257,0.00064193,0,0.061523,0,0.057118,0.0051727,0.0025228,0.0049337,0.0096818,2.659,1.4021,2.0105,0.27493,0.38338,0.24145,0.31258,0.43949,0.17926,0.323,0.44095,0.17813,63.431,6.5191,14449,47636,46679,0.098669,0.082176,0.072643,0.36706,0.36154,0.1416,0.63633,0.65362,0.17354,0.81898,0.84016,0.1781,0.91639,0.93141,0.17003,0.010911,0.0092972,0.19851,0.051814,0.079944,-0.055178,0.022672,0.019589,0.19541,0.066921,0.10152,-0.065043,0.036211,0.031941,0.18481,0.077521,0.1197,-0.06821,0.0061918,0.005602,0.2512,0.047027,0.05935,-0.026291,0.01275,0.011505,0.23642,0.057988,0.075423,-0.034714,0.020237,0.018342,0.21833,0.065861,0.090176,-0.040146,0.0041575,0.0033126,0.15102,0.025211,0.051665,-0.048321,0.0091153,0.0075328,0.16399,0.036548,0.066271,-0.052937,0.015055,0.012951,0.1649,0.045166,0.077399,-0.051657,0.00056209,0.00038256,0.20168,0.015576,0.020277,-0.027388,0.0012702,0.00087349,0.14805,0.014119,0.025092,-0.035844,0.0021202,0.0014872,0.1207,0.01386,0.030954,-0.041823,0.39829,74,74,40,988,3,3,3,0.645
22,-0.0032324,0.016021,0.023093,-0.98837,0.0013767,-1.9468,0.96973,-0.30739,4.3776,-0.076861,3.1509,0.0014356,0.63522,4.192,0.022916,6.3723,0.0064891,0.98853,0.058575,0.035586,0.029659,0.025212,0.30828,0.31074,0.32514,0.021161,0.0056098,0.0042504,0.024816,0.46637,0.26968,0.0030878,156.21,2134.2,3059.2,2437.5,7787.8,0.29823,0.13733,0.29823,1.0763,1.2848,0.41393,0.18926,0.017537,33,112.61,2765,2.3403e+05,5.1747,28.662,74655,14391,5400,0.91357,0.93527,0.30762,0.25137,0.12925,0.87345,88170,24669,0.0010608,0.00042483,0,0.083471,0,0.076886,0.0089246,0.011512,0.0093832,0.020371,0.75249,0.4688,0.5236,0.27006,0.34876,0.27847,0.32383,0.38491,0.23377,0.34347,0.38659,0.22715,50.418,7.5188,42116,1.314e+05,1.3107e+05,0.10515,0.075151,0.040573,0.2824,0.27749,0.057094,0.45222,0.48531,0.064638,0.59449,0.63315,0.067755,0.70587,0.74518,0.068642,0.0072262,0.0045097,0.068902,0.021805,0.046411,-0.069632,0.016748,0.010722,0.075652,0.032602,0.065039,-0.088567,0.030147,0.01964,0.08064,0.044026,0.081407,-0.11133,0.0032583,0.0020477,0.069281,0.015051,0.031216,-0.048269,0.0078886,0.0050556,0.076661,0.022859,0.044473,-0.060945,0.014369,0.0094465,0.081245,0.030815,0.057096,-0.075884,0.0023978,0.0014043,0.045648,0.0080042,0.027012,-0.040325,0.0051882,0.0030986,0.04892,0.011707,0.035928,-0.054462,0.0094284,0.0057342,0.054124,0.016869,0.04305,-0.070311,0.0015701,0.0010578,0.29526,0.035628,0.036725,-0.03273,0.0044147,0.0030394,0.26968,0.043379,0.047505,-0.040771,0.0087177,0.0060207,0.2601,0.054235,0.059013,-0.052628,0.37955,74,74,40,988,3,3,3,0.645
22,-0.0023532,0.011246,0.016456,-0.99173,0.00061556,-1.9647,0.98112,-0.79951,4.7199,-0.041919,3.2036,0.00070776,0.41214,3.2079,0.016474,4.2256,0.004303,0.99175,0.042018,0.018036,0.01474,0.01241,0.3365,0.37382,0.24872,0.022967,0.0032417,0.0023048,0.012453,0.45085,0.26007,0.22812,196.08,9427.4,15449,14595,39668,0.28303,0.14156,0.28303,0.64862,1.9843,0.4512,0.16044,0.01252,39,47.59,1232,39566,5.4728,32.535,33264,7803,2808,0.92008,0.94649,0.10069,0.068254,0.043136,0.70563,55733,21034,0.00078547,0.00040697,0,0.057967,0,0.07323,0.0087514,0.017588,0.0039968,0.011786,0.35672,0.29578,0.165,0.23716,0.35414,0.28819,0.19813,0.48535,0.26688,0.20755,0.5064,0.24747,48.281,7.7811,17398,26505,25532,0.056957,0.044375,0.012939,0.1729,0.13932,0.020581,0.35313,0.32024,0.029717,0.54475,0.52625,0.036553,0.6847,0.68181,0.039201,0.0068651,0.0057717,0.038539,0.015514,0.066649,-0.062473,0.018622,0.016007,0.049524,0.028643,0.088892,-0.075268,0.035651,0.031048,0.056145,0.041692,0.10925,-0.088853,0.0012075,0.0010129,0.015115,0.0015148,0.047922,-0.02551,0.0034147,0.0029457,0.019537,0.0042837,0.061675,-0.031619,0.006524,0.0057841,0.021718,0.0067518,0.074753,-0.032825,0.0032892,0.0026398,0.036866,0.010021,0.039747,-0.048673,0.0077885,0.0063894,0.043236,0.016294,0.051443,-0.058729,0.014421,0.012045,0.048738,0.023429,0.061716,-0.069932,0.0023685,0.0021189,0.26223,0.042031,0.036913,-0.029121,0.0074482,0.0066925,0.26787,0.057665,0.049667,-0.035877,0.014865,0.01333,0.26111,0.072988,0.061887,-0.045985,0.32132,74,74,40,988,3,3,3,0.645
22,-0.0018775,0.0090092,0.013177,-0.99338,0.00051534,-1.9671,0.98025,-1.0005,5.0203,-0.10623,3.1211,0.00207,0.3683,3.2051,0.013178,4.3143,0.0043934,0.9934,0.042203,0.020016,0.015488,0.012859,0.40875,0.32465,0.2255,0.021178,0.0044368,0.0025933,0.012883,0.52279,0.19335,0.39449,230.28,5012.4,12113,13614,30970,0.35789,0.14441,0.35789,1.4483,1.4953,0.54388,0.14327,0.0092572,44,112.98,2685,1.9937e+05,4.8195,26.557,72495,34128,17955,0.91753,0.93996,0.28676,0.19754,0.208,0.79608,54594,26767,0.0010893,0.00042166,0,0.044834,0,0.058229,0.0074395,0.041427,0.0019703,0.070697,0.64459,0.018969,0.23415,0.24709,0.34489,0.3074,0.27453,0.36736,0.30639,0.29798,0.36646,0.28711,47.088,8.2999,14527,33202,32057,0.094879,0.085186,0.051201,0.27899,0.27584,0.078886,0.46429,0.47401,0.092814,0.62014,0.63421,0.098848,0.74842,0.76493,0.10179,0.008426,0.0089503,0.11236,0.03183,0.070996,0.025852,0.018654,0.01964,0.11785,0.044594,0.095452,0.029757,0.033277,0.034403,0.12449,0.059376,0.11968,0.024543,0.0066286,0.0074881,0.19712,0.043365,0.067034,0.047308,0.014571,0.016321,0.19803,0.057733,0.089704,0.05962,0.025716,0.028193,0.20336,0.074331,0.11229,0.061059,0.0017313,0.0014094,0.046097,0.004968,0.032301,-0.035409,0.003715,0.0030265,0.04899,0.0074329,0.04058,-0.044888,0.0065139,0.0053846,0.052297,0.010471,0.04818,-0.05363,6.61e-05,5.278e-05,0.017385,-0.0010154,0.020951,-0.01701,0.00040715,0.00032302,0.034784,0.001194,0.029505,-0.023505,0.0012493,0.00099002,0.052129,0.0048652,0.040599,-0.033356,0.39272,74,74,40,988,3,3,3,0.645
22,-0.0039987,0.01906,0.027528,-0.98613,0.0016009,-1.9431,0.97049,0.46346,5.0455,0.094816,3.1643,0.0018457,0.93347,5.6149,0.027583,9.3982,0.0095704,0.98619,0.078617,0.027542,0.017846,0.012791,0.29328,0.253,0.37961,0.046857,0.0094263,0.004986,0.012842,0.44826,0.14966,0.031906,26.824,781.71,2405.9,9935.6,13151,0.44383,0.243,0.44383,0.95576,0.99018,0.31909,0.20755,0.021323,51,80.471,2108,1.1566e+05,5.0689,28.138,56916,35478,3456,0.91713,0.93866,0.047196,0.032581,0.054024,0.17567,30499,20140,0.0011984,0.00058982,0,0.057015,0,0.058043,0.015319,0.017635,0.02056,0.011707,2.9649,5.1468,1.8867,0.26842,0.30052,0.24662,0.31309,0.24813,0.13857,0.31884,0.24373,0.12586,14.964,6.6586,7382.2,16935,15119,0.38401,0.39216,0.18466,0.73842,0.78037,0.18605,0.83202,0.86498,0.14821,0.88449,0.9079,0.12563,0.92927,0.94398,0.11262,0.0060082,0.0052597,0.071394,0.018715,0.060237,-0.040723,0.013356,0.012167,0.075188,0.026606,0.079297,-0.038861,0.023308,0.021714,0.077698,0.034631,0.097114,-0.037919,0.0023585,0.0021246,0.062497,0.010426,0.038832,-0.020642,0.0053655,0.0052126,0.064981,0.014691,0.05239,-0.0078947,0.0094887,0.0096095,0.066863,0.019182,0.066364,0.0045765,0.0036304,0.0031205,0.086132,0.016862,0.045829,-0.035336,0.0079633,0.0069326,0.093574,0.02458,0.058503,-0.043164,0.013435,0.011809,0.096115,0.031259,0.068196,-0.049224,1.9251e-05,1.455e-05,0.0045117,-0.0022288,0.0084847,-0.011235,0.00017448,0.00013904,0.013283,-0.0016274,0.013476,-0.016621,0.00080656,0.00067048,0.02999,0.0012599,0.020959,-0.024164,0.50287,74,74,40,988,3,3,3,0.645
22,-0.0029305,0.014039,0.020522,-0.98968,0.0008377,-1.9589,0.97938,-0.29968,2.9579,-0.0029323,3.2941,2.1845e-05,0.43326,3.0179,0.020568,3.9499,0.0040223,0.98971,0.049113,0.024888,0.017416,0.013414,0.33359,0.32372,0.29458,0.02315,0.0073622,0.0039883,0.013601,0.48801,0.2433,0.0070906,146.81,1386.2,4003.6,9443.5,14981,0.22571,0.11581,0.22571,1.512,1.5139,0.49778,0.1802,0.016241,44,158.68,4689,5.0812e+05,5.9591,38.061,1.266e+05,22491,12933,0.89829,0.9114,0.41242,0.32683,0.21348,0.84897,75226,38962,0.0011864,0.00056852,0,0.057734,0,0.055915,0.002416,0.0081946,0.00311,0.014725,0.9505,0.26722,1.351,0.24911,0.41182,0.26098,0.25323,0.48646,0.23782,0.2605,0.49512,0.227,74.966,7.0465,16280,64072,63237,0.051317,0.043385,0.03817,0.21943,0.20987,0.085521,0.41178,0.40775,0.11346,0.57443,0.56855,0.1262,0.71011,0.70154,0.13311,0.0072483,0.0072015,0.13323,0.03068,0.065324,-0.0017664,0.015458,0.015806,0.1346,0.040973,0.085369,0.0080493,0.025307,0.026604,0.13049,0.048717,0.10257,0.022357,0.0056226,0.0057449,0.23046,0.042196,0.060806,0.0050357,0.011027,0.011545,0.20658,0.048988,0.075775,0.013733,0.016909,0.01812,0.1843,0.053148,0.088468,0.024838,0.0004835,0.00027136,0.017743,-0.0041571,0.0245,-0.029055,0.00099265,0.0005627,0.018042,-0.0053289,0.02966,-0.0382,0.0015778,0.00090674,0.01746,-0.0067424,0.033307,-0.045077,0.0011422,0.0011853,0.41404,0.035375,0.044693,0.0057715,0.003621,0.0038008,0.42638,0.04902,0.060088,0.0096633,0.0073351,0.007868,0.42187,0.062984,0.077329,0.018025,0.37992,74,74,40,988,3,3,3,0.645
22,-0.0026616,0.01302,0.018812,-0.99054,0.0011359,-1.9507,0.96934,0.01536,3.4379,-0.037148,3.2706,2.8529e-05,0.66548,4.8517,0.018776,7.4393,0.0075756,0.9906,0.084569,0.03555,0.024502,0.01843,0.31831,0.2874,0.31443,0.044698,0.010665,0.0059597,0.018532,0.45879,0.19664,0.0021621,35.447,682.8,1852.1,5222.3,7793.4,0.1862,0.36872,0.36872,0.72223,1.5857,0.42066,0.17104,0.014648,42,74.024,2513,1.4858e+05,6.1598,39.298,67851,4914,3321,0.91955,0.94032,0.074266,0.053116,0.070349,0.54564,28258,15770,0.0011395,0.00053011,0,0.059663,0,0.066401,0.0059659,0.019808,0.0043388,0.052637,1.1012,2.7398,1.1176,0.26041,0.30203,0.23538,0.32218,0.22178,0.066135,0.31606,0.22552,0.062415,10.033,6.3552,8970.1,18383,17008,0.47942,0.47867,0.16682,0.82178,0.8418,0.14983,0.93732,0.95337,0.12082,0.96866,0.97774,0.099558,0.98327,0.9885,0.086227,0.0054989,0.004738,0.047283,0.013851,0.062584,-0.040615,0.01541,0.013763,0.062773,0.027627,0.084492,-0.045033,0.030493,0.02761,0.073557,0.042398,0.10659,-0.051051,0.0038025,0.0034822,0.072911,0.017569,0.058486,-0.02036,0.010725,0.010269,0.093993,0.032066,0.078672,-0.014993,0.021308,0.020764,0.10865,0.047682,0.099246,-0.011564,0.0016964,0.0012558,0.029125,0.0037803,0.03124,-0.042873,0.0046847,0.003494,0.039834,0.0093407,0.041697,-0.057541,0.0091851,0.0068463,0.047549,0.015366,0.051672,-0.072635,0,0,0,-0.0023327,0.0090641,0,0,0,0,-0.00313,0.012731,0,0,0,0,-0.0040688,0.017901,0,0.537,74,74,40,988,3,3,3,0.645
22,-0.0045107,0.021681,0.03144,-0.98414,0.0016395,-1.9423,0.97358,1.4243,8.0661,0.049424,3.0448,0.0060243,0.91078,5.1375,0.031364,8.9307,0.0090944,0.9843,0.066369,0.028033,0.021418,0.016926,0.26263,0.29436,0.37759,0.036757,0.0066209,0.0045457,0.017495,0.40381,0.22895,0.03016,50.754,1586.5,2788.6,5319,9745.5,0.42268,0.34862,0.42268,0.53863,2.5907,0.44999,0.2252,0.024471,36,145.69,2336,1.9298e+05,3.9041,18.556,63072,31158,19386,0.91419,0.93521,0.20964,0.14522,0.13169,0.65513,31062,18535,0.0018086,0.00094093,0,0.039871,0,0.052309,0.0067942,0.018332,0.009038,0.022259,0.73174,2.1554,1.7246,0.27105,0.29302,0.2428,0.33225,0.22235,0.14278,0.33316,0.21721,0.13257,32.686,6.5555,7269.9,16976,15593,0.4626,0.46965,0.25092,0.78531,0.80909,0.2232,0.86829,0.88588,0.17447,0.92639,0.93619,0.14842,0.94854,0.95479,0.12967,0.0081413,0.0076047,0.10913,0.0305,0.074805,-0.030478,0.019233,0.018257,0.12213,0.046505,0.098546,-0.031668,0.03445,0.03301,0.12954,0.062202,0.12153,-0.032946,0.0038677,0.0032917,0.11561,0.022538,0.055537,-0.045362,0.008501,0.0074169,0.11613,0.030022,0.071861,-0.051026,0.014539,0.01302,0.11557,0.037249,0.088436,-0.052222,0.0042736,0.004313,0.11437,0.022325,0.051689,0.0032394,0.011128,0.011258,0.1475,0.040075,0.071488,0.0057031,0.021017,0.021187,0.1696,0.058176,0.089277,0.004974,0,0,0,-0.0029267,0.0048063,0,1.0334e-06,7.7356e-07,8.8743e-05,-0.0039141,0.0083268,-0.011737,1.9759e-05,1.4723e-05,0.00082875,-0.0049471,0.013505,-0.014154,0.40061,74,74,40,988,3,3,3,0.645
22,-0.0033068,0.015871,0.023197,-0.98832,0.0009618,-1.9559,0.97905,0.023492,4.0009,0.044096,3.2493,0.00031532,0.59987,3.9298,0.023253,5.5041,0.005605,0.98836,0.055817,0.028374,0.019683,0.014594,0.277,0.36657,0.30208,0.025986,0.0085213,0.005057,0.014788,0.43088,0.33059,0.0012382,112.94,986.74,2355.4,7760.5,11216,0.39221,0.14971,0.39221,0.66962,1.9553,0.40723,0.19155,0.018533,65,32.831,749,11369,5.1465,32.157,20223,10719,4644,0.92009,0.9459,0.09335,0.06052,0.09144,0.45628,23845,14396,0.0011205,0.00051629,0,0.047381,0,0.072492,0.0090581,0.043595,0.0060868,0.036546,1.7188,4.5398,3.2076,0.27198,0.30794,0.26211,0.39871,0.23851,0.10744,0.40656,0.23222,0.10003,19.633,7.077,7553.2,11957,10305,0.37411,0.37347,0.10684,0.71003,0.73185,0.10625,0.83463,0.85278,0.088295,0.89288,0.9062,0.075317,0.92589,0.93564,0.066639,0.012848,0.012237,0.090671,0.038837,0.081849,-0.031694,0.02876,0.028093,0.096152,0.054801,0.1101,-0.020824,0.049991,0.049975,0.098971,0.070348,0.13661,-0.00035732,0.0065689,0.0058395,0.10337,0.031019,0.069975,-0.048356,0.012531,0.011247,0.090131,0.034981,0.086094,-0.056773,0.019232,0.017422,0.080482,0.038136,0.10104,-0.061993,0.0062444,0.0063697,0.087984,0.025787,0.046007,0.010275,0.016144,0.016782,0.11266,0.044803,0.067713,0.027601,0.03066,0.032483,0.13027,0.064793,0.08859,0.05282,3.4945e-05,2.7712e-05,0.0048637,-0.0013825,0.014853,-0.015558,0.0001431,0.00011348,0.0064695,-0.0015328,0.021091,-0.015558,0.00026386,0.00020925,0.0058266,-0.0021602,0.028316,-0.015558,0.43329,74,74,40,988,3,3,3,0.645
22,-0.0018771,0.0093333,0.013436,-0.99325,0.00083862,-1.955,0.96829,-0.10634,3.0736,0.00058695,3.2762,2.4586e-06,0.35065,3.035,0.013322,3.9135,0.0039852,0.99333,0.055334,0.032921,0.027045,0.02277,0.43012,0.25709,0.2598,0.020778,0.0055978,0.004113,0.022499,0.54805,0.094676,0.14562,226.22,3033.5,4546.7,4183.4,11991,0.29809,0.085109,0.29809,1.0373,1.4768,0.48532,0.14433,0.010345,51,114.43,4935,4.749e+05,6.8349,48.122,1.3324e+05,12393,3726,0.91386,0.93463,0.35179,0.25001,0.23647,0.85496,47461,26791,0.0012213,0.00052755,0,0.054568,0,0.050261,0.0012244,0.029922,0.0079578,0.036144,0.94304,0.36613,0.61899,0.25904,0.37172,0.26752,0.2946,0.42882,0.22342,0.30166,0.43343,0.2196,44.901,7.2231,12770,32504,31439,0.11389,0.10135,0.072458,0.34515,0.33959,0.11506,0.55985,0.5675,0.13195,0.72632,0.73987,0.13649,0.84602,0.85902,0.13565,0.01785,0.017716,0.28064,0.085448,0.11006,-0.0043665,0.035535,0.035197,0.26467,0.10531,0.13958,-0.0071755,0.055931,0.055044,0.24669,0.12062,0.16386,-0.014476,0.0084536,0.0093625,0.29638,0.06223,0.084757,0.04323,0.017556,0.019278,0.28131,0.07772,0.10794,0.051908,0.028647,0.030889,0.26708,0.091519,0.12821,0.050876,0.0092113,0.0082167,0.28915,0.060806,0.069709,-0.044025,0.017493,0.015562,0.27196,0.073909,0.086396,-0.057037,0.026572,0.023637,0.25152,0.082981,0.098626,-0.067332,0.00018526,0.00013696,0.057444,0.0026302,0.022294,-0.022568,0.00051619,0.00037957,0.051991,0.0027895,0.029097,-0.025059,0.00093129,0.00068362,0.045815,0.002537,0.037828,-0.030903,0.43638,74,74,40,988,3,3,3,0.645
22,-0.0028871,0.013983,0.020363,-0.98976,0.00089572,-1.9575,0.97776,-0.64427,3.7873,-0.095251,3.235,0.00035013,0.59248,4.1485,0.020355,5.5244,0.0056256,0.98981,0.043276,0.024029,0.019532,0.016359,0.31002,0.3469,0.301,0.018275,0.0043695,0.0031064,0.016327,0.45612,0.27664,0.0071684,249.35,4108,6642.6,6742.8,17743,0.24316,0.10673,0.24316,0.95864,1.3533,0.41797,0.17811,0.015695,54,71.667,1001,34830,3.247,14.124,27027,20574,13095,0.91417,0.93487,0.31168,0.22781,0.21935,0.80212,56710,27020,0.00099688,0.00047945,0,0.054074,0,0.053591,0.00014975,0.0093647,0.0038119,0.015404,1.1099,0.82479,1.0293,0.24697,0.37826,0.27573,0.26483,0.46961,0.21492,0.2694,0.48333,0.20457,40.339,7.4448,14216,34562,33090,0.072192,0.05864,0.036229,0.32044,0.29435,0.084262,0.57919,0.5681,0.10767,0.76169,0.76965,0.11291,0.88398,0.89572,0.1118,0.00038313,0.00027543,0.0047513,-0.0077097,0.025822,-0.020072,0.0011449,0.0008426,0.0067263,-0.0091515,0.034119,-0.032422,0.0029226,0.0022061,0.010168,-0.0091938,0.042303,-0.045916,0.00013012,9.5928e-05,0.0035984,-0.0055852,0.020984,-0.020336,0.00067984,0.000511,0.0085927,-0.0056529,0.028221,-0.027293,0.0018215,0.0013981,0.013395,-0.0049659,0.035783,-0.033959,0.00025301,0.0001795,0.0062646,-0.0049046,0.015401,-0.014424,0.00046507,0.0003316,0.0057033,-0.0065811,0.019315,-0.019113,0.0011011,0.00080798,0.008221,-0.00701,0.022613,-0.031128,0,0,0,-0.0028123,0.0050869,0,0,0,0,-0.0037735,0.0069108,0,0,0,0,-0.0049053,0.0093023,0,0.4188,74,74,40,988,3,3,3,0.645
22,-0.0028281,0.014245,0.020561,-0.98966,0.0013131,-1.9472,0.96754,-1.3465,6.9896,-0.092293,3.0822,0.0039768,0.64989,4.5252,0.020584,6.4599,0.0065783,0.9897,0.072608,0.044279,0.033638,0.026765,0.30168,0.35334,0.27401,0.026515,0.010334,0.0067897,0.027328,0.45858,0.30962,0.019267,102.1,659.48,1260.2,2184.8,4207.3,0.21929,0.15283,0.21929,0.84664,1.5372,0.43869,0.17982,0.016349,38,69.421,889,33977,3.0645,12.078,24003,15606,13203,0.91989,0.94621,0.19118,0.1242,0.16065,0.69097,31217,21738,0.00089977,0.00037863,0,0.052439,0,0.083112,0.001456,0.0093848,0.012325,0.0085755,1.2276,0.34164,0.087547,0.23137,0.34576,0.30457,0.25111,0.42617,0.2458,0.26854,0.42315,0.23125,40.176,8.2234,7724.8,12692,9624.5,0.13793,0.14087,0.043253,0.2794,0.29558,0.045908,0.40996,0.43328,0.047622,0.53257,0.55133,0.049328,0.62983,0.64441,0.049775,0.042231,0.047009,0.32725,0.15102,0.16484,0.13619,0.079937,0.09209,0.29345,0.1773,0.20637,0.23335,0.12092,0.14154,0.26287,0.19584,0.23864,0.3151,0.022485,0.027304,0.38855,0.12379,0.13205,0.19698,0.046538,0.058006,0.36755,0.1547,0.1723,0.28881,0.07401,0.092809,0.34009,0.17811,0.20509,0.36148,0.019234,0.019233,0.29758,0.094032,0.099564,-3.2906e-05,0.032841,0.033737,0.25166,0.10252,0.11688,0.025116,0.046376,0.048559,0.21636,0.107,0.12811,0.050105,0.00051163,0.00047123,0.078193,0.0089559,0.034476,-0.016352,0.0017281,0.001613,0.08579,0.013473,0.045861,-0.01702,0.0035171,0.0033642,0.08528,0.017387,0.057438,-0.013458,0.36676,74,74,40,988,3,3,3,0.645
22,-0.0039594,0.019831,0.028675,-0.98554,0.0017175,-1.9411,0.96959,0.033831,4.926,0.020886,3.1352,0.0023012,0.7765,4.5766,0.02873,6.5858,0.0067065,0.98562,0.085206,0.046218,0.034685,0.027415,0.23112,0.3389,0.34602,0.036718,0.011392,0.0073132,0.028532,0.35149,0.32378,0.019328,45.151,467.04,1012.7,1799.8,3325.4,0.18394,0.1897,0.1897,0.7878,1.0166,0.40929,0.212,0.021967,39,70.256,2236,1.2715e+05,5.8628,35.884,60372,7020,3186,0.91826,0.94418,0.21839,0.14313,0.13551,0.87076,23882,16184,0.00080921,0.00037218,0,0.052647,0,0.083829,0.010423,0.0074055,0.0097247,0.06998,3.1811,6.2021,3.3575,0.23075,0.31012,0.35978,0.25238,0.2503,0.46314,0.25934,0.25749,0.45096,31.967,9.7141,9693,15120,11654,0.11088,0.10773,0.034473,0.26902,0.27424,0.043826,0.38853,0.39859,0.044746,0.47117,0.48267,0.043268,0.55291,0.56364,0.043323,0.05242,0.056577,0.40273,0.18844,0.18099,0.12541,0.099333,0.10768,0.36154,0.22176,0.21772,0.17129,0.15063,0.1641,0.32466,0.24589,0.24718,0.2205,0.024827,0.026556,0.42535,0.13662,0.13185,0.073627,0.046295,0.04918,0.3625,0.15319,0.15535,0.083203,0.068796,0.072683,0.31343,0.16424,0.17472,0.088523,0.024837,0.026572,0.38099,0.12239,0.11847,0.075602,0.049752,0.054114,0.37798,0.15809,0.14964,0.12365,0.079108,0.087223,0.36591,0.18752,0.17465,0.17721,0.0027556,0.0034488,0.41754,0.057687,0.049108,0.10795,0.007613,0.0096545,0.37471,0.069163,0.062393,0.15619,0.014218,0.01823,0.34181,0.081675,0.077995,0.2066,0.40418,74,74,40,988,3,3,3,0.645
22,-0.004056,0.022794,0.031683,-0.98401,0.0042771,-1.8992,0.93006,0.41122,4.139,0.051417,3.1341,0.0015556,0.6036,3.4994,0.029692,5.0028,0.0050945,0.98512,0.12084,0.084815,0.068978,0.057782,0.21738,0.33634,0.33658,0.030145,0.013896,0.010075,0.055583,0.33881,0.32438,0.020555,67.403,298.76,473.6,425.44,1265.9,0.37283,0.19117,0.37283,0.43414,1.4601,0.28595,0.21548,0.021015,81,10.556,171,733.45,3.1745,15.091,4617,3267,2565,0.92276,0.95085,0.067017,0.041292,0.058296,0.27312,21268,14271,0.00081304,0.00036858,0,0.048991,0,0.067427,0.010155,0.038844,0.016842,0.10206,4.0947,4.7989,1.0106,0.24051,0.31988,0.29765,0.28161,0.294,0.19484,0.28083,0.29361,0.19044,20.54,8.0366,5516.4,7369.7,5009.1,0.30491,0.30749,0.056839,0.55082,0.55891,0.053801,0.6351,0.64036,0.043856,0.69013,0.69309,0.038,0.75211,0.753,0.035334,0.0060029,0.0061767,0.027653,0.011551,0.067028,0.019546,0.014419,0.014665,0.031465,0.018355,0.087854,0.015725,0.026132,0.026281,0.033771,0.025139,0.10764,0.0065529,0.0018223,0.0019967,0.018719,0.0040803,0.042069,0.047401,0.005949,0.0063597,0.02793,0.010636,0.059028,0.044187,0.012136,0.012727,0.03315,0.016984,0.076296,0.039311,0.0033074,0.0034016,0.030419,0.0091412,0.047482,0.012831,0.006023,0.0061675,0.027436,0.010231,0.057953,0.012826,0.0090504,0.0092184,0.0251,0.010944,0.065921,0.011894,0.00087323,0.00077841,0.079333,0.01295,0.028657,-0.037843,0.0030379,0.0027031,0.089653,0.019933,0.038242,-0.05013,0.006251,0.0055928,0.090103,0.026056,0.048629,-0.059978,0.42386,74,74,40,988,3,3,3,0.645
22,-0.0041035,0.020534,0.029558,-0.9851,0.0018937,-1.9381,0.96744,0.11547,3.1004,0.027368,3.3036,2.5847e-06,0.53657,3.1169,0.029576,4.0357,0.0041097,0.9852,0.076749,0.041707,0.033121,0.027986,0.24042,0.30944,0.37663,0.032218,0.0082271,0.0049865,0.028075,0.36799,0.26509,0.042747,59.883,955.32,2167.2,1871.6,5054.7,0.12864,0.11231,0.12864,0.54332,0.55199,0.28605,0.21593,0.021415,28,116.18,3032,3.2539e+05,4.9674,25.794,81864,5832,945,0.9181,0.94147,0.19291,0.13378,0.10932,0.77932,82436,35984,0.000648,0.00034365,0,0.066518,0,0.083876,0.0044903,0.0095695,0.0010151,0.016454,0.52804,0.56451,1.3371,0.24674,0.32787,0.31971,0.28203,0.34148,0.33143,0.29931,0.33134,0.32864,47.173,8.6322,16607,30212,28883,0.042074,0.036658,0.014325,0.16938,0.15715,0.030218,0.35396,0.35006,0.044644,0.53312,0.54185,0.053614,0.70983,0.73021,0.060909,0.0042897,0.0042425,0.036092,0.008966,0.063113,-0.0035739,0.011688,0.012567,0.046588,0.018236,0.083936,0.033509,0.022417,0.025636,0.052911,0.027439,0.10339,0.08206,0.0022586,0.0027471,0.042376,0.0081444,0.048745,0.065175,0.0079513,0.0098282,0.068183,0.021675,0.072257,0.093032,0.017116,0.021727,0.085399,0.036137,0.095327,0.13871,0.0011242,0.00081514,0.018884,0.00066123,0.038655,-0.044166,0.002812,0.0020515,0.023396,0.0027419,0.046927,-0.057073,0.0048194,0.0035601,0.024412,0.0038845,0.052846,-0.065737,0.00090693,0.00068024,0.15049,0.018336,0.017837,-0.031049,0.0016306,0.0012127,0.087891,0.013081,0.020776,-0.036442,0.0020701,0.0015327,0.054501,0.0090156,0.025613,-0.038967,0.33981,74,74,40,988,3,3,3,0.645
22,-0.0026676,0.013068,0.018879,-0.99051,0.0011131,-1.9514,0.97007,-0.17992,3.8369,-0.025928,3.1916,0.00088526,0.53097,3.8579,0.018904,5.6162,0.0057191,0.99054,0.062411,0.030449,0.022969,0.018504,0.34646,0.31074,0.28257,0.029931,0.0072746,0.0043932,0.018626,0.50485,0.23498,0.025922,84.874,1457.7,3395.9,5050.2,9989.5,0.33337,0.26121,0.33337,0.38068,1.8603,0.31466,0.17194,0.014902,39,38.744,540,13891,3.3428,13.37,14580,13554,5616,0.9215,0.94856,0.052032,0.035644,0.015309,0.53174,24699,15718,0.00084298,0.00041843,0,0.046135,0,0.056903,0.0015418,0.0064714,0.015796,0.02537,0.93013,0.0168,0.51051,0.24004,0.30958,0.27327,0.27614,0.20556,0.11866,0.23633,0.16031,0.0887,31.428,7.3784,14103,22602,21882,0.42744,0.53031,0.089556,0.68416,0.7588,0.075109,0.78165,0.83583,0.060666,0.87825,0.90897,0.054351,0.93736,0.95369,0.049496,0.00044,0.00030675,0.0022781,-0.004771,0.041189,-0.025697,0.0016577,0.0012113,0.0040659,-0.004891,0.055713,-0.037638,0.0045891,0.0035556,0.0066655,-0.0035588,0.071442,-0.047308,0,0,0,-0.0041907,0.028599,0,1.5076e-06,1.0115e-06,7.9554e-06,-0.0055451,0.039856,-0.017907,8.1512e-05,5.5075e-05,0.00025026,-0.0067618,0.051897,-0.030311,0.00044,0.00030675,0.0045485,-0.0023596,0.028831,-0.025697,0.0016562,0.0012103,0.0084793,-0.00099079,0.037916,-0.037596,0.004505,0.0034987,0.014042,0.0024002,0.047357,-0.046094,0,0,0,-0.0018038,0.008618,0,0,0,0,-0.0024204,0.012311,0,2.5603e-06,1.8156e-06,4.1479e-05,-0.0031337,0.017776,-0.014195,0.34569,74,74,40,988,3,3,3,0.645
