0.1781080367  
-0.2198176176  
-0.6000714603  
-0.9461861564  
-1.244268317  
-1.483920961  
-1.658843453  
-1.767067864  
-1.810838946  
-1.796183878  
-1.732228781  
-1.630353134  
-1.503248251  
-1.363970141  
-1.225039969  
-1.097645443  
-0.990987322  
-0.9117992918  
-0.8640560563  
-0.8488934662  
-0.8647290294  
-0.9075787658  
-0.9715417959  
-1.049403683  
-1.133321931  
-1.215509132  
-1.288873783  
-1.34754415  
-1.387236759  
-1.405437751  
-1.401393351  
-1.375920659  
-1.331078459  
-1.269749345  
-1.195192285  
-1.110629218  
-1.018912984  
-0.9223132167  
-0.8224360768  
-0.7202749889  
-0.6163656201  
-0.5110137152  
-0.4045490582  
-0.2975603566  
-0.1910803563  
-0.08667125109  
0.0135823066  
0.1071990954  
0.191506148  
0.263915526  
0.3222144205  
0.3648341193  
0.3910509511  
0.4010776832  
0.3960456655  
0.3778562323  
0.348936006  
0.3119324772  
0.2693871212  
0.2234585963  
0.175726024  
0.1271177704  
0.07797817383  
0.02826309383  
-0.02217428072  
-0.07325199604  
-0.1243497325  
-0.1740812586  
-0.2201988018  
-0.2596570808  
-0.2888405807  
-0.3039271336  
-0.3013385549  
-0.2782206792  
-0.2328728102  
-0.1650682572  
-0.07621930692  
0.03064801651  
0.1511013066  
0.2796719618  
0.4103288813  
0.5370043761  
0.6540977489  
0.7568984432  
0.8418776829  
0.9068308599  
0.950860462  
0.9742264148  
0.9780958395  
0.9642500729  
0.9347979699  
0.8919402137  
0.8378313003  
0.7745384427  
0.7041039556  
0.6286796073  
0.5506969393  
0.4730114545  
0.3989945829  
0.332519341  
0.2778358934  
0.2393292555  
0.2211931977  
0.2270457808  
0.2595403716  
0.3200116162  
0.4082030928  
0.5221041431  
0.6579144178  
0.8101486449  
0.9718707413  
1.135045867  
1.290984773  
1.430859662  
1.546248891  
1.62969312  
1.675215552  
1.678780864  
1.6386533  
1.555617619  
1.433032936  
1.276678834  
1.094389987  
0.8954697681  
0.6899094439  
0.4874704832  
0.2967099598  
0.1240466506  
-0.02700440842  
-0.1563294213  
-0.2673352244  
-0.3666460361  
-0.4633597604  
-0.5679101965  
-0.690640941  
-0.8402471254  
-1.022267125  
-1.237830969  
-1.482845542  
-1.747763245  
-2.018014515  
-2.27509894  
-2.498266335  
-2.66660123  
-2.761301289  
-2.767872455  
-2.677970465  
-2.490642844  
-2.212788009  
-1.858739139  
-1.448987719  
-1.008181505  
-0.5626170086  
-0.1375464894  
0.2453679386  
0.5701199863  
0.8276848929  
1.016430802  
1.141587803  
1.213869488  
1.247463648  
1.25769138  
1.258668985  
1.261312736  
1.271931902  
1.291597616  
1.316340193  
1.338102704  
1.346293827  
1.329686144  
1.27838445  
1.18557379  
1.048807791  
0.8706702797  
0.6587288229  
0.4248140379  
0.1837296355  
-0.04840254509  
-0.2559450197  
-0.425442593  
-0.5470167322  
-0.6152958153  
-0.6297944599  
-0.5947481964  
-0.5184611024  
-0.4122899465  
-0.2894248048  
-0.1636156343  
-0.04800326384  
0.04585356556  
0.1086723978  
0.1338702229  
0.1177192881  
0.05930935862  
-0.03962553678  
-0.174951048  
-0.3404022735  
-0.5278645168  
-0.72767436  
-0.9289769847  
-1.120173014  
-1.289496791  
-1.425724511  
-1.519000562  
-1.561709167  
-1.549307266  
-1.480990449  
-1.360084003  
-1.194048821  
-0.9940506621  
-0.7740901917  
-0.5497576962  
-0.3367389367  
-0.1492488216  
0.001415655061  
0.1080045587  
0.167985446  
0.1836474272  
0.1616459951  
0.1120348965  
0.04694606452  
-0.02091493704  
-0.07973178827  
-0.1198079388  
-0.1344194104  
-0.1201886352  
-0.07697780139  
-0.007364743424  
0.08417776909  
0.1922353569  
0.3113678871  
0.4368478821  
0.5651012681  
0.6938259568  
0.8217811198  
0.9483449842  
1.07293065  
1.194409483  
1.310658741  
1.418335768  
1.512939923  
1.589159731  
1.641462157  
1.664837546  
1.655570648  
1.611928385  
1.534635481  
1.427062299  
1.295077545  
1.14656809  
0.9906807108  
0.8368682115  
0.6938706696  
0.5687538363  
0.4661414396  
0.3877463378  
0.3322729003  
0.2957113664  
0.2719981915  
0.2539510398  
0.2343661991  
0.2071152045  
0.1680947495  
0.1158797546  
0.0519870899  
-0.01931019969  
-0.09159597148  
-0.1572859775  
-0.2088345928  
-0.2399951148  
-0.2469737338  
-0.229284067  
-0.1901813356  
-0.1365790384  
-0.07844865268  
-0.02773760705  
0.003051471724  
0.00246161908  
-0.03835243333  
-0.1242905314  
-0.255398397  
-0.4265126796  
-0.6275272831  
-0.8442677624  
-1.059881812  
-1.25658366  
-1.417542613  
-1.528682779  
-1.580172446  
-1.567426446  
-1.4914933  
-1.358803705  
-1.180313472  
-0.970175244  
-0.7441123254  
-0.5177063335  
-0.3048129962  
-0.1162896659  
0.04083067453  
0.1636435273  
0.2531670965  
0.313682713  
0.3517435334  
0.375001994  
0.391019944  
0.4062036064  
0.4249820572  
0.4493191534  
0.4785782396  
0.5097445978  
0.5379520155  
0.5572441212  
0.5614697587  
0.5452096543  
0.5046263377  
0.4381275784  
0.3467755424  
0.2343721996  
0.1072158333  
-0.02645762984  
-0.1572746652  
-0.275674667  
-0.3728914232  
-0.4418324311  
-0.4777548843  
-0.4786570331  
-0.4453360023  
-0.3811363318  
-0.2914336338  
-0.1829413106  
-0.06295519549  
0.06136802151  
0.1835917871  
0.2983949161  
0.4017417081  
0.4908598237  
0.5640493046  
0.6204130889  
0.6595621245  
0.6813682287  
0.6858054214  
0.6728944222  
0.6427505713  
0.5957032739  
0.5324468646  
0.4541901665  
0.3627597293  
0.260644522  
0.1509724818  
0.03741856279  
-0.07593487761  
-0.1847757433  
-0.2847613671  
-0.3717374588  
-0.4419654244  
-0.4923763841  
-0.5208323691  
-0.5264006373  
-0.5096099304  
-0.4726543173  
-0.4194938686  
-0.3558024422  
-0.2887189964  
-0.226374865  
-0.1772068297  
-0.1491014566  
-0.1484474888  
-0.1792166663  
-0.2421978125  
-0.3345043446  
-0.4494754912  
-0.5770086268  
-0.7043408165  
-0.8172109189  
-0.9012813197  
-0.9436515336  
-0.9342888255  
-0.8671796457  
-0.7410674265  
-0.5596748155  
-0.3313904466  
-0.06845136014  
0.2142652183  
0.5007045862  
0.7751755294  
1.023791159  
1.23566901  
1.403749053  
1.525165913  
1.601142621  
1.636427855  
1.638349192  
1.615590012  
1.576825135  
1.529381687  
1.478073227  
1.424366021  
1.36599604  
1.297115797  
1.208998131  
1.091241412  
0.9333723528  
0.726655985  
0.4658905515  
0.1509334774  
-0.2122747573  
-0.6113850419  
-1.028117506  
-1.439544771  
-1.820086564  
-2.143986172  
-2.387983448  
-2.533841585  
-2.570393599  
-2.494821527  
-2.312989677  
-2.038762165  
-1.692399912  
-1.29823969  
-0.8819752663  
-0.4679212413  
-0.07662138531  
0.2768622754  
0.5837821175  
0.8415644938  
1.052788918  
1.223484598  
1.36106154  
1.472243328  
1.561345468  
1.629192705  
1.672840172  
1.686133954  
1.661000708  
1.589234665  
1.464479042  
1.284059539  
1.05036685  
0.7715502761  
0.4614001381  
0.1384177273  
-0.1758127989  
-0.4587344495  
-0.6891462688  
-0.8494504519  
-0.9275675497  
-0.9182933694  
-0.8239794404  
-0.6544697348  
-0.4263347916  
-0.1614821696  
0.1147063152  
0.3755502279  
0.5953785894  
0.7517778726  
0.8276149943  
0.8126610506  
0.7046827526  
0.5098739389  
0.2425622221  
-0.07583057599  
-0.4185362772  
-0.7557637113  
-1.057411038  
-1.295898942  
-1.448825772  
-1.501140517  
-1.446563207  
-1.288076567  
-1.037417936  
-0.713648172  
-0.3409905979  
0.05376636925  
0.4439427942  
0.8053903975  
1.118367945  
1.368698791  
1.548150308  
1.654102606  
1.688666191  
1.657485999  
1.568461966  
1.430612696  
1.253221156  
1.045340714  
0.8156294979  
0.5724383518  
0.3239936793  
0.07854827093  
-0.1556452496  
-0.370594106  
-0.559069846  
-0.715288354  
-0.8356341659  
-0.9192784158  
-0.9685190043  
-0.9887394343  
-0.9879091192  
-0.9756595592  
-0.9620359446  
-0.9560979608  
-0.9645794735  
-0.9908273125  
-1.034198328  
-1.090027983  
-1.150204602  
-1.20426897  
-1.240891268  
-1.249509174  
-1.221872864  
-1.153272214  
-1.04325012  
-0.8956953228  
-0.7183067263  
-0.5215095586  
-0.3170073593  
-0.1161979077  
0.07128119571  
0.2386534578  
0.3825651274  
0.5030415993  
0.6028499881  
0.6864087927  
0.758449094  
0.8226836668  
0.8807372824  
0.9315497545  
0.9713786731  
0.9944137382  
0.9939221929  
0.9637148108  
0.8996901184  
0.8011506532  
0.6716475205  
0.5191531062  
0.3554766328  
0.1949745773  
0.05270889028  
-0.05767095167  
-0.1259959186  
-0.1472666487  
-0.1226550679  
-0.05964008146  
0.02879757886  
0.1258360008  
0.2131041694  
0.2732873627  
0.2926520645  
0.26312752  
0.1836188516  
0.06036078924  
-0.09374730703  
-0.2607349982  
-0.4198599065  
-0.5502888885  
-0.6338037373  
-0.6571619023  
-0.6138061979  
-0.5047127887  
-0.3382700379  
-0.1292308135  
0.1031312731  
0.337403889  
0.5526593956  
0.7309832341  
0.8595929832  
0.9322866175  
0.9500516822  
0.9207554368  
0.8579679772  
0.7790696979  
0.7028758973  
0.6470878316  
0.6258773555  
0.6479133481  
0.7150617079  
0.8219227813  
0.9562539152  
1.100221513  
1.232342577  
1.329883455  
1.371454484  
1.33951012  
1.222479077  
1.016307502  
0.7252291823  
0.3616936171  
-0.05455864617  
-0.4981767282  
-0.9404665782  
-1.352009232  
-1.705346605  
-1.97744886  
-2.151694715  
-2.219151057  
-2.179023984  
-2.038257615  
-1.810367621  
-1.513694989  
-1.169336602  
-0.7990500879  
-0.4234040451  
-0.06040141424  
0.2753106114  
0.5726189458  
0.8236134415  
1.022930798  
1.166993505  
1.253370282  
1.280437561  
1.247424376  
1.154846708  
1.00520482  
0.8037767663  
0.5592691436  
0.2841278358  
-0.005664206403  
-0.2913682998  
-0.5528195277  
-0.7701711866  
-0.9258305237  
-1.006339483  
-1.003919689  
-0.9174753461  
-0.7529036378  
-0.5226606804  
-0.2446406304  
0.05949892357  
0.3663604394  
0.6529558345  
0.8987422656  
1.087349803  
1.20785187  
1.25548462  
1.231775196  
1.14411518  
1.004829471  
0.8298467062  
0.6370899748  
0.4447264631  
0.2694205084  
0.1247410128  
0.01986707217  
-0.04127352948  
-0.06033003349  
-0.04425190927  
-0.004405960412  
0.04485398873  
0.08802985463  
0.1105214172  
0.1006332817  
0.05126427488  
-0.03896530441  
-0.1653210119  
-0.3174094534  
-0.4804284735  
-0.6370768519  
-0.7698646816  
-0.8634990382  
-0.9069966906  
-0.8952270881  
-0.8296444629  
-0.7181261026  
-0.5739442339  
-0.4140378858  
-0.2568528098  
-0.1200688338  
-0.0185300313  
0.03734839514  
0.04250913454  
-0.002553130093  
-0.0922921144  
-0.2171810429  
-0.3651375562  
-0.5230785496  
-0.6783793927  
-0.8200488812  
-0.9395196926  
-1.031001115  
-1.091439843  
-1.12017612  
-1.118417874  
-1.088666771  
-1.034197688  
-0.9586707741  
-0.8658985072  
-0.759739591  
-0.6440725843  
-0.5227771676  
-0.3996625497  
-0.278304055  
-0.1617899755  
-0.05242152123  
0.04856520187  
0.141171154  
0.2266143744  
0.307077547  
0.3852015716  
0.4633845986  
0.5429790399  
0.6235205512  
0.7021501964  
0.7733693331  
0.8292369153  
0.8600645945  
0.8555659418  
0.8063536349  
0.7056089361  
0.5506691383  
0.344296204  
0.09538705687  
-0.1810539523  
-0.4647482661  
-0.7317756473  
-0.956833586  
-1.115898757  
-1.188947542  
-1.162387075  
-1.030863652  
-0.7981668422  
-0.4770793848  
-0.08815149228  
0.3424705253  
0.7858903919  
1.213610899  
1.600558993  
1.927565281  
2.182967215  
2.363121629  
2.471776275  
2.518441554  
2.516038747  
2.478228906  
2.416854582  
2.339917287  
2.250407078  
2.146161734  
2.020761429  
1.865281026  
1.670598741  
1.429846949  
1.140589541  
0.8063373396  
0.4371416735  
0.04914011278  
-0.3368907492  
-0.6977688364  
-1.010599391  
-1.255524895  
-1.418126465  
-1.491135878  
-1.475216531  
-1.378714511  
-1.216447085  
-1.007723231  
-0.7738978742  
-0.5358438677  
-0.311680847  
-0.115085088  
0.04561490793  
0.1674962569  
0.2522981974  
0.3050746706  
0.332518432  
0.3412608062  
0.336463383  
0.3209258953  
0.2948588313  
0.2563259251  
0.2022425011  
0.1297230039  
0.0374828869  
-0.07298434086  
-0.1967246118  
-0.3253005653  
-0.4474871283  
-0.5506123281  
-0.6223413627  
-0.6526281538  
-0.6355059896  
-0.5703973848  
-0.462703586  
-0.323528947  
-0.1685489671  
-0.01613932237  
0.1149639813  
0.2081512187  
0.251218798  
0.2381023837  
0.1698202538  
0.05448224985  
-0.09363297254  
-0.2558147583  
-0.4112279862  
-0.539491035  
-0.6231816519  
-0.6499592123  
-0.614052989  
-0.5169531358  
-0.367243101  
-0.1796329012  
0.02667051955  
0.2300389243  
0.4087040572  
0.5429668025  
0.6171245575  
0.6208972018  
0.5502538704  
0.4075548394  
0.2010548262  
-0.05616548545  
-0.3476775537  
-0.6554177255  
-0.9614202398  
-1.249366637  
-1.505774653  
-1.720705788  
-1.887930363  
-2.004584677  
-2.070411988  
-2.086777943  
-2.055645984  
-1.978733624  
-1.857019286  
-1.690696712  
-1.47958898  
-1.223941715  
-0.9254161738  
-0.58807749  
-0.2191513162  
0.1706556297  
0.5673692812  
0.9545400352  
1.314525801  
1.630105266  
1.886199091  
2.071439802  
2.179374735  
2.209103047  
2.165267686  
2.057386837  
1.898621212  
1.70414779  
1.489360941  
1.268144797  
1.051447079  
0.8463339841  
0.6556416158  
0.4782584119  
0.3099822948  
0.1448199251  
-0.02345990011  
-0.1997403203  
-0.3861777107  
-0.5812277775  
-0.779230327  
-0.970641259  
-1.142892742  
-1.281795099  
-1.37329892  
-1.405397529  
-1.369908331  
-1.263881851  
-1.090439157  
-0.8588946389  
-0.5841220772  
-0.2852157321  
0.01640258107  
0.2992011395  
0.543803583  
0.7350112571  
0.8633092287  
0.9256664582  
0.9255127791  
0.8719011873  
0.777982731  
0.6590018098  
0.5301143421  
0.4043279652  
0.2908831977  
0.1942830794  
0.1141238562  
0.04572651949  
-0.01853116185  
-0.08740564527  
-0.1687838733  
-0.2678077433  
-0.38541515  
-0.5175348721  
-0.655057727  
-0.7845988865  
-0.8899435793  
-0.95396727  
-0.9607731004  
-0.8977397878  
-0.7572318372  
-0.537739477  
-0.2443412808  
0.1115577255  
0.5131339116  
0.9395842222  
1.367889747  
1.774708535  
2.13819549  
2.439583459  
2.664407231  
2.803306742  
2.85239159  
2.813193484  
2.692256798  
2.500440477  
2.25198894  
1.963453332  
1.65251003  
1.336753197  
1.032516993  
0.7538012734  
0.5113770138  
0.3121470741  
0.1588218268  
0.04995649517  
-0.01964783423  
-0.05821410201  
-0.07599954867  
-0.08415874986  
-0.09358513554  
-0.1138495246  
-0.1523579317  
-0.213787859  
-0.2998495795  
-0.4093507556  
-0.5385256213  
-0.6815506061  
-0.8311731671  
-0.9793673307  
-1.117981499  
-1.239322248  
-1.336687062  
-1.404836991  
-1.440423772  
-1.442370867  
-1.412176332  
-1.354099661  
-1.275159505  
-1.184872824  
-1.094674102  
-1.016995457  
-0.9640311109  
-0.9462934298  
-0.9711075895  
-1.041253463  
-1.153981621  
-1.300598624  
-1.466773663  
-1.633616344  
-1.779460735  
-1.882182772  
-1.921768297  
-1.882802101  
-1.756526897  
-1.54217983  
-1.247397101  
-0.8876231872  
-0.4845916336  
-0.06408014451  
0.3467562869  
0.7221285928  
1.040088092  
1.28444906  
1.445970249  
1.522720655  
1.519671906  
1.447645975  
1.32182086  
1.159999961  
0.9808660246  
0.8023778652  
0.6404344159  
0.5078685036  
0.4137936254  
0.3632858725  
0.3573794168  
0.3933353532  
0.4651500541  
0.5642699056  
0.6804659477  
0.8028167116  
0.920729233  
