0.1455230607  
0.2973153348  
0.4384680327  
0.5608226307  
0.6577201279  
0.7245579115  
0.7591471361  
0.7618147394  
0.7352364892  
0.6840196649  
0.6140722099  
0.5318410805  
0.4435165309  
0.3542969228  
0.2678239756  
0.1858583953  
0.108253025  
0.03322683069  
-0.04208325494  
-0.1208819811  
-0.2058821198  
-0.298517018  
-0.3983221734  
-0.5026034382  
-0.6064585146  
-0.7031850798  
-0.7850244066  
-0.8441650669  
-0.8738538649  
-0.8694632974  
-0.8293451703  
-0.7553357514  
-0.6528189515  
-0.5303187335  
-0.3986601638  
-0.2698019512  
-0.1554959177  
-0.06594209038  
-0.008625329409  
0.01251538181  
-0.002513073295  
-0.04983568502  
-0.1222377081  
-0.2100663765  
-0.3023707536  
-0.3881344318  
-0.4574468236  
-0.5024758809  
-0.5181508468  
-0.5025018257  
-0.4566512139  
-0.3844999665  
-0.2921747478  
-0.1873255869  
-0.07836145982  
0.0262983694  
0.118893461  
0.1928757607  
0.2433263379  
0.267231034  
0.2636222885  
0.2335880748  
0.1801585951  
0.1080695805  
0.02340319753  
-0.06689144796  
-0.1555756291  
-0.2357760628  
-0.3016569038  
-0.3490439722  
-0.3759222779  
-0.3827245947  
-0.3723442012  
-0.3498328707  
-0.3217932039  
-0.2955091529  
-0.2779196377  
-0.2745658175  
-0.2886620743  
-0.3204502598  
-0.3669412659  
-0.4221274765  
-0.4776503789  
-0.5238668973  
-0.5511593627  
-0.5513127188  
-0.5187401329  
-0.4513653479  
-0.3510010875  
-0.2231540646  
-0.07625133543  
0.07959798432  
0.2341237881  
0.3784653204  
0.5065235934  
0.6158717915  
0.7080435041  
0.7881308058  
0.8637239784  
0.9433436981  
1.034599848  
1.142379617  
1.267360262  
1.405125152  
1.546055035  
1.67606857  
1.778152236  
1.834485249  
1.828889354  
1.749250857  
1.589575093  
1.3513698  
1.044142208  
0.6849188351  
0.296822372  
-0.09311653539  
-0.4566617427  
-0.7672412967  
-1.002640193  
-1.147204258  
-1.193294556  
-1.141851212  
-1.002032868  
-0.7900121953  
-0.5271067756  
-0.2374904351  
0.0542333727  
0.3253190748  
0.5567993739  
0.7348504062  
0.8515167702  
0.9047786058  
0.8980185257  
0.8390100569  
0.738587063  
0.6091699046  
0.4633173526  
0.3124633276  
0.1659431583  
0.03039006136  
-0.090479956  
-0.1957147365  
-0.2866614878  
-0.3662867631  
-0.4383816028  
-0.506770586  
-0.574615979  
-0.6439101995  
-0.7151967284  
-0.7875427332  
-0.8587446968  
-0.925717611  
-0.9850044948  
-1.033322131  
-1.068061192  
-1.087677542  
-1.091915101  
-1.081837979  
-1.059672399  
-1.028478001  
-0.9917036029  
-0.9526768247  
-0.9141067379  
-0.8776536036  
-0.8436297942  
-0.8108682609  
-0.7767790434  
-0.7375982851  
-0.6888011183  
-0.6256491554  
-0.5438100915  
-0.4399895104  
-0.3125127086  
-0.1617842193  
0.009425245922  
0.1959102424  
0.3902034966  
0.5829959531  
0.7637799588  
0.9216727864  
1.046355798  
1.129040812  
1.163371615  
1.146163351  
1.077887342  
0.9628361891  
0.8089257304  
0.6271307959  
0.4305920429  
0.2334710115  
0.04966406509  
-0.1084918283  
-0.2313794018  
-0.3129983846  
-0.3514885114  
-0.3492190625  
-0.3124237677  
-0.2504187612  
-0.174495198  
-0.09660587078  
-0.0280000626  
0.02204076328  
0.04722349462  
0.04490744404  
0.0163481643  
-0.03350547847  
-0.09662729221  
-0.1628691709  
-0.221148399  
-0.2607420313  
-0.2725433324  
-0.2501564827  
-0.1907160181  
-0.0953429798  
0.03080598927  
0.1789097888  
0.3372473893  
0.4922814099  
0.6299625905  
0.7371323236  
0.8028766056  
0.8197003082  
0.784382591  
0.6984279637  
0.5680386959  
0.4036113938  
0.2187909245  
0.02917682738  
-0.1491845395  
-0.3013591443  
-0.4149730026  
-0.4813816092  
-0.4964487724  
-0.4608386379  
-0.3798106026  
-0.2625407353  
-0.1210636126  
0.03104490558  
0.1800813305  
0.3135728801  
0.4214244871  
0.4967372508  
0.536223637  
0.5401859617  
0.5120880345  
0.4577847957  
0.3845294073  
0.2998817331  
0.2106646131  
0.1221061507  
0.03726784844  
-0.04316455958  
-0.1207111171  
-0.1985681984  
-0.2808075913  
-0.3714076793  
-0.4732680781  
-0.5873499871  
-0.7120798252  
-0.8431148019  
-0.973528548  
-1.094409397  
-1.195808967  
-1.267924095  
-1.30235742  
-1.293281811  
-1.238349185  
-1.139199397  
-1.001492009  
-0.8344337931  
-0.6498480812  
-0.4608953496  
-0.2805991851  
-0.1203626857  
0.01133990971  
0.1099329522  
0.1752388625  
0.2114538537  
0.2265987672  
0.231502894  
0.2384446533  
0.2596091452  
0.3055300598  
0.3837030766  
0.4975183164  
0.6456347571  
0.8218706667  
1.01562856  
1.212815584  
1.397178482  
1.551916032  
1.661415658  
1.712931022  
1.698030646  
1.613660632  
1.462697025  
1.253925576  
1.001424364  
0.7234053932  
0.4406136569  
0.1744458208  
-0.05503588042  
-0.230980886  
-0.3413386578  
-0.3799830371  
-0.3472585813  
-0.2498938168  
-0.1002811385  
0.08479076145  
0.2858271045  
0.4825609877  
0.6559207976  
0.7898380245  
0.8726983228  
0.8982984633  
0.8662155948  
0.7815681253  
0.6542119625  
0.4974717711  
0.3265670322  
0.1569045379  
0.002429348046  
-0.1257905344  
-0.2206101844  
-0.2793818261  
-0.3040273484  
-0.3006127209  
-0.2785035191  
-0.2492041851  
-0.2250252161  
-0.2177211982  
-0.2372528538  
-0.290796996  
-0.3820924547  
-0.5111825724  
-0.6745507193  
-0.8656129643  
-1.075487859  
-1.293934587  
-1.510341869  
-1.714641854  
-1.898059688  
-2.053614668  
-2.176356267  
-2.263334695  
-2.313361376  
-2.326631161  
-2.304294831  
-2.248064686  
-2.15992418  
-2.041976457  
-1.896437704  
-1.725750505  
-1.532764518  
-1.320919521  
-1.094367937  
-0.8579892214  
-0.6172650963  
-0.3780181032  
-0.146047682  
0.07329688864  
0.2755347903  
0.4574040099  
0.617087897  
0.7542802676  
0.8700770944  
0.9667029775  
1.047108932  
1.114494431  
1.171814093  
1.221333698  
1.264298236  
1.300753522  
1.329545624  
1.348502848  
1.354777095  
1.345299865  
1.3172999  
1.268811847  
1.199112432  
1.109034572  
1.001112336  
0.8795423682  
0.7499638746  
0.6190814557  
0.4941644567  
0.3824824356  
0.2907204463  
0.2244394764  
0.1876218282  
0.182345791  
0.2086084469  
0.2643120618  
0.3454074666  
0.4461743723  
0.5596124188  
0.6779089094  
0.7929399286  
0.8967756005  
0.9821533712  
1.042895096  
1.074256224  
1.073185758  
1.038501357  
0.9709667954  
0.8732673569  
0.749881173  
0.6068410273  
0.4513829132  
0.2914966921  
0.135387437  
-0.009106379348  
-0.1351040405  
-0.2372136289  
-0.3119523623  
-0.3579898272  
-0.3761868171  
-0.3694110338  
-0.3421462057  
-0.2999484602  
-0.2488221997  
-0.194603704  
-0.1424381192  
-0.09642409382  
-0.05945746321  
-0.03328457671  
-0.01871846204  
-0.0159611173  
-0.02493901836  
-0.0455855515  
-0.0779903551  
-0.1224018811  
-0.1790816084  
-0.2480585121  
-0.328841431  
-0.4201774182  
-0.5199168196  
-0.6250249172  
-0.7317534821  
-0.8359418453  
-0.9333898158  
-1.020225126  
-1.093194833  
-1.149823555  
-1.188414492  
-1.207904379  
-1.207627051  
-1.187053426  
-1.14559107  
-1.082517247  
-0.9970826326  
-0.8887942738  
-0.7578377776  
-0.6055608402  
-0.4349274077  
-0.2508308556  
-0.06018257183  
0.1282865507  
0.3045161601  
0.4578788266  
0.5781290838  
0.6564325737  
0.6863492893  
0.6646474305  
0.5918360312  
0.4723489464  
0.3143433788  
0.1291251778  
-0.06973486986  
-0.2675189732  
-0.4495881481  
-0.6026078061  
-0.7156492064  
-0.7810695573  
-0.7950969853  
-0.7580726215  
-0.6743318722  
-0.551745788  
-0.4009688026  
-0.2344540591  
-0.06534127104  
0.09369678279  
0.2315295434  
0.3394649033  
0.4118831113  
0.4465437509  
0.4445356465  
0.4098880409  
0.3488926729  
0.2692263275  
0.1789995054  
0.08584251412  
-0.003836181719  
-0.0853308535  
-0.1558040719  
-0.2141245424  
-0.2604311698  
-0.2955024464  
-0.3200623132  
-0.3341445307  
-0.3366527067  
-0.3251911661  
-0.2962332331  
-0.2455990576  
-0.1691934466  
-0.06388119164  
0.07163160926  
0.2360733927  
0.425160666  
0.631541767  
0.84516643  
1.054071479  
1.245500973  
1.407235345  
1.528953709  
1.603465409  
1.627624394  
1.602803093  
1.534832875  
1.433402734  
1.31095708  
1.181220155  
1.057511897  
0.9510673712  
0.8695727427  
0.816118276  
0.7887174812  
0.7804838996  
0.7804567993  
0.7749973834  
0.7495852813  
0.690783579  
0.5881204472  
0.4356278395  
0.2328272739  
-0.01497899025  
-0.2971505328  
-0.5988351566  
-0.9026152184  
-1.190452989  
-1.445663602  
-1.654653327  
-1.808196779  
-1.902104156  
-1.937225405  
-1.918841773  
-1.85557834  
-1.758046298  
-1.637434685  
-1.504275482  
-1.367545347  
-1.234192585  
-1.109093784  
-0.9953593421  
-0.894842176  
-0.8086758273  
-0.7376740737  
-0.6824688828  
-0.643334248  
-0.6197337383  
-0.6097004672  
-0.6092286803  
-0.6118784894  
-0.6087639097  
-0.5890566972  
-0.541020824  
-0.453496234  
-0.317641098  
-0.1286642135  
0.1127601097  
0.3996789531  
0.7188566026  
1.051677421  
1.375896886  
1.668044458  
1.906159407  
2.072472829  
2.155634333  
2.152146036  
2.066776756  
1.91188985  
1.705766974  
1.470190241  
1.227622242  
0.9984005287  
0.7983401413  
0.637066085  
0.5172782866  
0.4349999142  
0.3807279425  
0.3412594295  
0.3018968241  
0.2487016998  
0.1704721654  
0.06020150247  
-0.08413945523  
-0.2595455958  
-0.4585759539  
-0.6704672773  
-0.8825574162  
-1.081797898  
-1.25615514  
-1.395740655  
-1.493570998  
-1.545924165  
-1.552324665  
-1.515212024  
-1.439399128  
-1.331406023  
-1.198758704  
-1.049319669  
-0.8906829973  
-0.7296704637  
-0.5719243467  
-0.4216139865  
-0.2812561084  
-0.1516641156  
-0.03203624164  
0.07979796472  
0.1869843233  
0.2931116174  
0.401582046  
0.5149487188  
0.6342967656  
0.7587587377  
0.8852483139  
1.008471317  
1.121253278  
1.215164437  
1.28139005  
1.311747714  
1.299723016  
1.241390693  
1.136081838  
0.9867115589  
0.7996940013  
0.584462271  
0.3526311481  
0.1169123058  
-0.1100836512  
-0.3170125949  
-0.4947947798  
-0.6373191124  
-0.7418006467  
-0.8087537452  
-0.841621876  
-0.8461244834  
-0.8294324069  
-0.7992756498  
-0.7630971998  
-0.7273455728  
-0.6969638277  
-0.6751073289  
-0.6630826938  
-0.6604790545  
-0.665451049  
-0.6750908148  
-0.6858510754  
-0.6939714961  
-0.695881743  
-0.6885631057  
-0.6698517786  
-0.6386713737  
-0.5951830275  
-0.540827299  
-0.4782507419  
-0.4110875898  
-0.3436112363  
-0.2802579226  
-0.2250716824  
-0.1811270224  
-0.1500092091  
-0.1314355112  
-0.1230976469  
-0.1207671687  
-0.1187015207  
-0.1103013516  
-0.08896759835  
-0.04903381828  
0.01334578468  
0.09950433566  
0.2078757279  
0.3340056359  
0.4709849709  
0.6102769122  
0.7428391665  
0.8603963988  
0.9566868638  
1.028487585  
1.076256537  
1.104261822  
1.120152336  
1.13397552  
1.15676372  
1.19885094  
1.268153532  
1.368650739  
1.49930491  
1.653596472  
1.819783827  
1.981892496  
2.121338536  
2.218996597  
2.257455818  
2.223163661  
2.108176009  
1.911274496  
1.638292227  
1.301610273  
0.9188816676  
0.5111687693  
0.1007292774  
-0.2912495479  
-0.6466807888  
-0.9521327137  
-1.19973699  
-1.387380106  
-1.518215215  
-1.59960999  
-1.641728539  
-1.65596409  
-1.653449495  
-1.643832257  
-1.634441575  
-1.629906285  
-1.63220792  
-1.641084343  
-1.654666179  
-1.670199717  
-1.684718896  
-1.695561884  
-1.70066433  
-1.69861675  
-1.688519139  
-1.66970627  
-1.641430128  
-1.602603345  
-1.551670053  
-1.486657143  
-1.405400841  
-1.305924538  
-1.186878606  
-1.047963947  
-0.890243309  
-0.716254622  
-0.5298928332  
-0.3360565169  
-0.1401082721  
0.05276101034  
0.2381499191  
0.4129215705  
0.5754299034  
0.7254366636  
0.8636995002  
0.9912919184  
1.1087619  
1.215284111  
1.307984905  
1.381599317  
1.428579805  
1.439712444  
1.405205268  
1.316129493  
1.16602028  
0.9524099746  
0.6780294169  
0.3514797724  
-0.01279534142  
-0.3952764335  
-0.7728400061  
-1.120772239  
-1.415102091  
-1.634956164  
-1.764653611  
-1.795264628  
-1.725446254  
-1.561450578  
-1.316312349  
-1.008328031  
-0.6590262549  
-0.2908880822  
0.07490502107  
0.4204248131  
0.7324328767  
1.003157489  
1.230354473  
1.416685386  
1.568542267  
1.694491607  
1.803574258  
1.90368207  
2.000226562  
2.095258733  
2.187132401  
2.27073186  
2.338200844  
2.380057742  
2.386529565  
2.348923361  
2.260861197  
2.119233057  
1.924774051  
1.682220078  
1.400056626  
1.089912883  
0.765695851  
0.4425580149  
0.1358047243  
-0.1401669599  
-0.3728318969  
-0.5523455591  
-0.6721660461  
-0.7294665422  
-0.7253119901  
-0.6645992422  
-0.5557440542  
-0.4101176615  
-0.2412555187  
-0.06387186122  
0.1072420511  
0.25834966  
0.3778098853  
0.456915645  
0.4904182036  
0.4766803458  
0.417425363  
0.317128948  
0.1821471659  
0.01971673202  
-0.1630090543  
-0.3597379098  
-0.5655071541  
-0.7767813993  
-0.9911909067  
-1.206974846  
-1.422279307  
-1.634463994  
-1.839588163  
-2.032215264  
-2.20560586  
-2.352310305  
-2.465074336  
-2.537921668  
-2.567216679  
-2.55251036  
-2.496997263  
-2.407458144  
-2.293655272  
-2.167231231  
-2.040251253  
-1.923601229  
-1.825468021  
-1.750155131  
-1.697411834  
-1.662405952  
-1.636352447  
-1.607721753  
-1.56386335  
-1.492799732  
-1.384944601  
-1.234481786  
-1.040221725  
-0.8058025036  
-0.5392293555  
-0.2518196462  
0.0432789303  
0.3327701894  
0.604851598  
0.850573871  
1.064730132  
1.246164343  
1.397467897  
1.524136078  
1.633321011  
1.732391462  
1.827519587  
1.922505066  
2.018025634  
2.111410518  
2.196970786  
2.266836781  
2.312166791  
2.324556082  
2.297433769  
2.227244673  
2.114247702  
1.9628116  
1.781163558  
1.580616229  
1.374371325  
1.176051944  
0.9981438719  
0.8505473463  
0.7394148289  
0.6664163899  
0.6285269676  
0.6183641524  
0.6250365868  
0.6354048731  
0.635617671  
0.6127381958  
0.5562844368  
0.4595070735  
0.3202700314  
0.1414392124  
-0.06925217913  
-0.29983879  
-0.5351799373  
-0.758329264  
-0.9520725328  
-1.100492874  
-1.190425581  
-1.212680849  
-1.162945589  
-1.042295003  
-0.8572751346  
-0.6195458355  
-0.3450922081  
-0.05305273085  
0.2357736534  
0.5006359621  
0.7226185648  
0.8863470593  
0.9814426183  
1.003537182  
0.9547201203  
0.8433057109  
0.6829095715  
0.4908908802  
0.2863214433  
0.08771073653  
-0.08922960986  
-0.2334838407  
-0.3400190746  
-0.4102701923  
-0.4517267578  
-0.476656194  
-0.5001271742  
-0.537599275  
-0.6024239501  
-0.7036148724  
-0.8442150275  
-1.02051313  
-1.22222197  
-1.433609062  
-1.635420823  
-1.807327627  
-1.930550496  
-1.990304802  
-1.97772736  
-1.891036703  
-1.735785469  
-1.524190843  
-1.273655543  
-1.004693589  
-0.7385403447  
-0.4947619394  
-0.2891476675  
-0.1321436502  
-0.02797139755  
0.02548872168  
0.03608612763  
0.01617970565  
-0.01901730481  
-0.0533039063  
-0.07134359807  
-0.06030505379  
-0.01112331086  
0.08071701572  
0.2149183827  
0.3866054994  
0.5869876701  
0.8043424856  
1.025189897  
1.235529688  
1.422019547  
1.57299788  
1.679280732  
1.734695325  
1.736339214  
1.684578371  
1.582824381  
1.437119288  
1.255588394  
1.04780056  
0.8240855113  
0.5948463765  
0.3699086017  
