0.3728376116  
0.2782259627  
0.1979105307  
0.1428306352  
0.1214137205  
0.1389256124  
0.1971395148  
0.2943518256  
0.4257021836  
0.5837312279  
0.759106909  
0.9414119438  
1.119908915  
1.284221062  
1.424875579  
1.533695579  
1.604053818  
1.631012929  
1.611384095  
1.54375204  
1.428481232  
1.267713568  
1.065351  
0.8270052608  
0.5598647422  
0.2724730342  
-0.02562269547  
-0.324335118  
-0.6136060421  
-0.8840251711  
-1.127443834  
-1.337515728  
-1.51008369  
-1.643376203  
-1.73796365  
-1.79649014  
-1.823198095  
-1.823312536  
-1.802364777  
-1.765547143  
-1.717179699  
-1.660366552  
-1.596871392  
-1.527229173  
-1.451054458  
-1.367493555  
-1.275731078  
-1.175469024  
-1.067292382  
-0.9528556361  
-0.8348626152  
-0.7168414029  
-0.6027506247  
-0.4964745082  
-0.4013102581  
-0.319503761  
-0.2519394679  
-0.1980195938  
-0.1557617747  
-0.122109886  
-0.09339866501  
-0.06592511023  
-0.0365244924  
-0.003073892717  
0.03514239433  
0.07726939867  
0.1209389124  
0.1625244543  
0.1975842888  
0.2214196243  
0.2296827437  
0.2189741202  
0.1873605618  
0.1347548392  
0.06313015688  
-0.02345728523  
-0.119051588  
-0.2161598169  
-0.3062855323  
-0.3805755359  
-0.4305443733  
-0.4488064878  
-0.4297485788  
-0.3700889472  
-0.2692661286  
-0.1296148323  
0.04368847215  
0.2429165527  
0.4582892009  
0.6786618191  
0.8923215219  
1.087862082  
1.255043096  
1.385580091  
1.473792472  
1.517056412  
1.516012687  
1.474507707  
1.399253444  
1.299225138  
1.184844367  
1.067004722  
0.9560443216  
0.8607611816  
0.7875839875  
0.7400059542  
0.7183418631  
0.7198664522  
0.7393160699  
0.7697003204  
0.8033197863  
0.8328661187  
0.852431279  
0.8583113067  
0.849453406  
0.8275071639  
0.7964580419  
0.7618983289  
0.7300588208  
0.7067495927  
0.6963838918  
0.7012459864  
0.7211176683  
0.7533355806  
0.7932526136  
0.8350256131  
0.8725915705  
0.9006450358  
0.9154487869  
0.9153110877  
0.9006621086  
0.8736964546  
0.8376482063  
0.7958463596  
0.750731413  
0.7030083304  
0.6511459657  
0.5913033491  
0.5177459375  
0.4237014516  
0.3025223573  
0.1489832638  
-0.03950346141  
-0.2619532939  
-0.5133231125  
-0.7845524977  
-1.063173456  
-1.334397646  
-1.582570403  
-1.792795311  
-1.952536848  
-2.053005321  
-2.090157163  
-2.06520373  
-1.984571741  
-1.859331791  
-1.704156564  
-1.535934911  
-1.372183786  
-1.229428015  
-1.121707576  
-1.059354612  
-1.048162859  
-1.08900311  
-1.177927304  
-1.306718703  
-1.46381975  
-1.635543867  
-1.807417269  
-1.965526021  
-2.097729587  
-2.19461407  
-2.25011502  
-2.2617535  
-2.230482821  
-2.160188916  
-2.05691663  
-1.927919612  
-1.780660044  
-1.621865345  
-1.456763261  
-1.288563544  
-1.118251464  
-0.9446892451  
-0.765013781  
-0.5752604757  
-0.3711187495  
-0.1487412949  
0.09452051661  
0.3595114594  
0.6448880759  
0.9469646268  
1.259804753  
1.575519413  
1.88474009  
2.177196087  
2.442347541  
2.670022447  
2.851022618  
2.977666538  
3.044264827  
3.047499135  
2.986706907  
2.864039288  
2.684479719  
2.455694147  
2.187704106  
1.892368395  
1.582702775  
1.272066017  
0.9732863279  
0.6977952092  
0.454863426  
0.2510148557  
0.08968390583  
-0.02885011115  
-0.107237291  
-0.1505766179  
-0.1657305424  
-0.1605094323  
-0.142827408  
-0.1198999232  
-0.09758052331  
-0.07989844591  
-0.06882821003  
-0.0643175493  
-0.06456117584  
-0.06645983384  
-0.06623945619  
-0.06012262736  
-0.04497524968  
-0.01885811945  
0.0186035584  
0.06606889887  
0.120575975  
0.1778691284  
0.232911445  
0.2805164111  
0.316007495  
0.3358069102  
0.3378751164  
0.3219295138  
0.2894123136  
0.2432114403  
0.1871866096  
0.1255510099  
0.06224030516  
0.0003238809763  
-0.05841218587  
-0.1136786935  
-0.1666388178  
-0.2196228175  
-0.2756378318  
-0.3377428303  
-0.4083793904  
-0.4887517862  
-0.578343135  
-0.674662381  
-0.7732352071  
-0.8678938775  
-0.9513145736  
-1.015772408  
-1.054012821  
-1.06015035  
-1.030476083  
-0.9640676257  
-0.8631144744  
-0.7329154118  
-0.581516235  
-0.4190341177  
-0.2567423374  
-0.1060062121  
0.02279115004  
0.1212198537  
0.1835654155  
0.2073014963  
0.1932491438  
0.145414801  
0.07055993806  
-0.02243053937  
-0.1233024244  
-0.2212231813  
-0.3055456919  
-0.3664932613  
-0.3957406235  
-0.3868775663  
-0.3357720906  
-0.2408257409  
-0.1031414689  
0.07341398529  
0.2822569126  
0.5142749661  
0.7581714776  
1.000993042  
1.228832104  
1.427680232  
1.584391926  
1.687658972  
1.728924733  
1.703123048  
1.609158143  
1.450057508  
1.232772823  
0.9676413126  
0.6675626722  
0.3469868193  
0.02082301019  
-0.2966031442  
-0.5924455491  
-0.8559884526  
-1.079023122  
-1.255926795  
-1.383502958  
-1.46062969  
-1.487830006  
-1.4668368  
-1.400255464  
-1.291367911  
-1.144103643  
-0.9631614628  
-0.7542231556  
-0.524184131  
-0.2813020979  
-0.03518739988  
0.2034376194  
0.423227701  
0.6129457992  
0.7623661239  
0.8632477962  
0.9102570981  
0.9017076385  
0.8399840829  
0.7315769415  
0.5866695653  
0.4183056601  
0.2411950987  
0.07029433672  
-0.08069484097  
-0.2007201962  
-0.2825033723  
-0.3232571576  
-0.3248994625  
-0.2937367561  
-0.2396466351  
-0.1748698967  
-0.1125425313  
-0.06515977373  
-0.04316025622  
-0.05378535639  
-0.1003637557  
-0.1820895219  
-0.294306791  
-0.4292450833  
-0.5770988614  
-0.7272869856  
-0.8697302253  
-0.9959591271  
-1.099924476  
-1.178403437  
-1.230965637  
-1.259537668  
-1.267643883  
-1.259464989  
-1.238872488  
-1.208597308  
-1.169670962  
-1.12122383  
-1.06067127  
-0.9842611324  
-0.887886819  
-0.768030169  
-0.6226926132  
-0.4521480291  
-0.2594066304  
-0.05030323644  
0.1668142099  
0.3817583396  
0.5834473008  
0.7610003532  
0.9048345763  
1.007627029  
1.06501605  
1.075969329  
1.042787651  
0.970765214  
0.8675752077  
0.7424809998  
0.6054879199  
0.466549936  
0.3349222435  
0.2187251408  
0.1247193369  
0.05828960528  
0.02356014662  
0.02357345294  
0.06042614685  
0.1353189052  
0.2484401901  
0.3987068308  
0.5833757391  
0.7976154786  
1.034135987  
1.282994568  
1.531681063  
1.765558511  
1.968683177  
2.124982058  
2.219687681  
2.240889945  
2.181019769  
2.038070799  
1.816366373  
1.526733713  
1.186001292  
0.8158166528  
0.4408723196  
0.08671413248  
-0.2226378668  
-0.4669942561  
-0.6319413708  
-0.7101998815  
-0.702224005  
-0.6159716688  
-0.4658603689  
-0.2710564043  
-0.05329980779  
0.1654587401  
0.3653144354  
0.5303015691  
0.6497050831  
0.7186657664  
0.7380544323  
0.7136735902  
0.6549437987  
0.5732632673  
0.4802795811  
0.3862837916  
0.2989254686  
0.2223713393  
0.1569854439  
0.09953412001  
0.0438646336  
-0.0180532167  
-0.09486203404  
-0.1944707955  
-0.3228125129  
-0.4828254417  
-0.6737946817  
-0.8911109427  
-1.126490569  
-1.36861273  
-1.604116278  
-1.818819931  
-1.999041019  
-2.132853107  
-2.211143492  
-2.228371513  
-2.182949984  
-2.077249598  
-1.91724738  
-1.711898103  
-1.472323124  
-1.210921295  
-0.9405022242  
-0.6735107267  
-0.421391019  
-0.1941058793  
0.0001959378048  
0.1553973886  
0.2675396347  
0.3348865608  
0.3579433454  
0.3394280222  
0.284170108  
0.1989336583  
0.09211275843  
-0.02669866876  
-0.1472767436  
-0.2594496115  
-0.353851974  
-0.4226865792  
-0.460410652  
-0.4642633556  
-0.4345578423  
-0.3746839478  
-0.2907925217  
-0.1911763497  
-0.08541142784  
0.01666820371  
0.1060272395  
0.1754043965  
0.2200827193  
0.2383457332  
0.2315828361  
0.2040055078  
0.162036888  
0.1134367762  
0.06628300637  
0.02794138326  
0.004151154039  
-0.001662077827  
0.0112320106  
0.04082888241  
0.082689148  
0.1305253385  
0.1769980522  
0.2146201939  
0.2366597398  
0.2379411842  
0.2154642292  
0.168768417  
0.1000354717  
0.0139108946  
-0.08292083096  
-0.182354824  
-0.2756204095  
-0.354089821  
-0.4100679207  
-0.4374813556  
-0.4324017946  
-0.3933458512  
-0.3213183342  
-0.219589243  
-0.09322909597  
0.05154742454  
0.2081379662  
0.3703149319  
0.5328722146  
0.6920606058  
0.8457324972  
0.9931670431  
1.134600431  
1.270528376  
1.400912843  
1.524437944  
1.637959943  
1.736286816  
1.812345658  
1.857767182  
1.863799249  
1.822454047  
1.727697167  
1.576517911  
1.369709359  
1.112240304  
0.8131584338  
0.4850333569  
0.1430176824  
-0.1963596073  
-0.5165105626  
-0.8020648814  
-1.039970001  
-1.220313874  
-1.336816402  
-1.386975865  
-1.371913791  
-1.295974809  
-1.166163794  
-0.9915042706  
-0.782387338  
-0.5499654946  
-0.3056108065  
-0.06045243736  
0.1750280783  
0.3913573891  
0.5804048838  
0.7356967917  
0.8527041093  
0.92906357  
0.9647160877  
0.9618995382  
0.9249744101  
0.8600642215  
0.7745158948  
0.6762257735  
0.5728832125  
0.4712266363  
0.3763933836  
0.291453745  
0.2171943251  
0.1521890999  
0.09314311591  
0.03549667059  
-0.02581553442  
-0.09551602637  
-0.177189458  
-0.2726104416  
-0.3813166996  
-0.5004654554  
-0.6250051622  
-0.7481447484  
-0.862051634  
-0.9587144485  
-1.030840511  
-1.072691239  
-1.08075142  
-1.054147862  
-0.9947838533  
-0.9071585719  
-0.7979181727  
-0.6751808142  
-0.5477219791  
-0.4241052794  
-0.3118709413  
-0.2168430361  
-0.1426424935  
-0.09044317523  
-0.05899452921  
-0.04488488112  
-0.0430304328  
-0.04731504986  
-0.05130630013  
-0.04898530991  
-0.03539162922  
-0.0071425302  
0.03723976707  
0.09719198975  
0.1701863778  
0.2519761509  
0.3369904734  
0.4188126245  
0.4907091712  
0.5461496813  
0.5792778994  
0.5853092941  
0.5608220071  
0.5039410984  
0.4144053915  
0.2935307713  
0.1440793055  
-0.02994635276  
-0.2235516306  
-0.431029478  
-0.6462398336  
-0.8628685976  
-1.074659664  
-1.275619294  
-1.460174189  
-1.623308  
-1.760677733  
-1.868705678  
-1.944662393  
-1.986721296  
-1.993989218  
-1.966496377  
-1.905135992  
-1.811562989  
-1.688034261  
-1.537233971  
-1.362073073  
-1.165512082  
-0.9504159752  
-0.7194769878  
-0.475210545  
-0.220033719  
0.04357697983  
0.312868244  
0.5845681034  
0.8546457951  
1.118136916  
1.369067025  
1.600521788  
1.80489221  
1.974303335  
2.101205643  
2.179095127  
2.203278849  
2.17160534  
2.085052409  
1.948078163  
1.768651171  
1.557913765  
1.329472098  
1.098355775  
0.8797387641  
0.6875462613  
0.5331077963  
0.424020796  
0.3633579681  
0.3493414685  
0.3755390591  
0.4315797785  
0.5043203753  
0.5793469517  
0.6426443918  
0.6822402111  
0.6896276024  
0.6608098164  
0.5968078899  
0.5035878272  
0.3913787422  
0.2734613666  
0.1645502684  
0.07896837862  
0.0288048188  
0.02231435663  
0.06272943613  
0.1476645401  
0.269190501  
0.4145901345  
0.5677162634  
0.7107946868  
0.8264528316  
0.8997307192  
0.9198140426  
0.8812759371  
0.7846748576  
0.636428657  
0.4479948631  
0.234464264  
0.01275961789  
-0.2003229222  
-0.3899829547  
-0.5449521786  
-0.6585210542  
-0.728936376  
-0.7591613657  
-0.7560522364  
-0.7290929958  
-0.6888885454  
-0.6456389966  
-0.6077957179  
-0.5810839023  
-0.5680003373  
-0.5678315585  
-0.5771530369  
-0.5907090838  
-0.6025122637  
-0.6070033459  
-0.600071303  
-0.5798021252  
-0.5468360237  
-0.5043093499  
-0.457381208  
-0.4124336478  
-0.3760770071  
-0.3541008716  
-0.3505448091  
-0.3670191835  
-0.4023991668  
-0.4529245315  
-0.5126997003  
-0.5745295055  
-0.6309493088  
-0.6752979444  
-0.702668575  
-0.7105782058  
-0.6992635214  
-0.6715445959  
-0.6322900075  
-0.587562259  
-0.5435796269  
-0.5056617451  
-0.4773110261  
-0.4595828219  
-0.4508198233  
-0.4467998513  
-0.4412614127  
-0.4267422942  
-0.3955963192  
-0.3410680016  
-0.2582815931  
-0.1450239929  
-0.002244269985  
0.1657915381  
0.3516847451  
0.5454123219  
0.7350868976  
0.9079115531  
1.051222661  
1.153542113  
1.205545246  
1.200870519  
1.136700859  
1.014079934  
0.8379220379  
0.6167282551  
0.3620137839  
0.0875068235  
-0.1918281872  
-0.4608560106  
-0.7053325305  
-0.9128761988  
-1.07376944  
-1.181523261  
-1.233172856  
-1.229287488  
-1.173722648  
-1.073134339  
-0.9363438087  
-0.77358792  
-0.5957459432  
-0.4136032775  
-0.2371929362  
-0.07526532918  
0.06509636823  
0.1787064199  
0.2623518097  
0.3147343672  
0.3363017499  
0.3289882997  
0.2959136585  
0.2410630657  
0.168985852  
0.08453953988  
-0.007315046889  
-0.101645188  
-0.1936299921  
-0.2786116524  
-0.3521322423  
-0.4099991959  
-0.4483848329  
-0.463986801  
-0.4542289731  
-0.4174861207  
-0.353301574  
-0.2625414732  
-0.1474533431  
-0.01158752719  
0.1404208945  
0.3032087035  
0.4711315267  
0.6387482963  
0.8012742237  
0.9549191602  
1.09707392  
1.226301218  
1.342140909  
1.444774815  
1.534611092  
1.611881232  
1.676331232  
1.727074862  
1.762643341  
1.781227683  
1.7810614  
1.760871241  
1.720288324  
1.660137065  
1.582517567  
1.490661981  
1.388565094  
1.280458178  
1.170219734  
1.060832475  
0.9539920078  
0.8499490466  
0.7476149757  
0.6449075975  
0.5392784955  
0.4283009851  
0.310213039  
0.1842936099  
0.05100859096  
-0.08810911087  
-0.230804105  
-0.3745900249  
-0.5172588563  
-0.6572902072  
-0.7940437518  
-0.9276725651  
-1.058761646  
-1.187746301  
-1.314245652  
-1.436457933  
-1.550784203  
-1.651803738  
-1.732674046  
-1.785936936  
-1.804640225  
-1.783604717  
-1.720624237  
-1.617371507  
-1.479824578  
-1.318078726  
-1.145520866  
-0.9774236621  
-0.8291428841  
-0.7141485716  
-0.6421756317  
-0.6177711107  
-0.6394543211  
-0.6996501614  
-0.7854107085  
-0.8798598878  
-0.9641704833  
-1.01982248  
-1.030844582  
-0.9857494752  
-0.8789070709  
-0.711214239  
-0.4899637162  
-0.2279714784  
0.05790930845  
0.3486787046  
0.6252378833  
0.8703248431  
1.070121246  
1.215349944  
1.301765089  
1.330026159  
1.305011775  
1.234712002  
1.128862095  
0.9975147615  
0.8497338483  
0.6925721466  
0.5304425985  
0.364956596  
0.195223165  
0.01857083043  
-0.1684162505  
-0.368679581  
-0.5834501652  
-0.8111654667  
-1.046697616  
-1.2810272  
-1.501436936  
-1.692262741  
-1.836150185  
-1.915708495  
-1.915395873  
-1.823420395  
-1.633434359  
-1.34579378  
-0.9682128153  
-0.5156843243  
-0.009641508016  
0.5235797672  
1.054832132  
1.554583425  
1.995395915  
2.354204712  
2.614119457  
2.765580067  
2.806748785  
2.743142157  
2.586592159  
2.353709814  
2.064069585  
1.738351166  
1.396652355  
1.057137408  
0.7351075207  
0.4425235817  
0.1879186159  
-0.02338240004  
-0.1888596108  
-0.3083315755  
-0.3835010844  
-0.4175806177  
-0.4150074414  
-0.3812262381  
-0.3225046199  
-0.2457420049  
-0.1582285066  
-0.06735543795  
0.01972321822  
0.09643798071  
0.1571304585  
0.1973067763  
0.2137978294  
0.204814802  
0.1699074416  
0.1098559053  
0.02652491973  
-0.07727783456  
-0.1979263686  
-0.3310754544  
-0.4717489478  
-0.6144416944  
-0.7532708597  
-0.8821927974  
-0.9952974554  
-1.087165835  
-1.153251346  
-1.190232684  
-1.196287094  
-1.171228848  
-1.116490077  
-1.034937465  
-0.9305510343  
-0.8080177779  
-0.6722983587  
-0.5282333897  
-0.3802370449  
-0.2321111144  
-0.08698028433  
