0.4055864482  
0.4168166156  
0.4467510488  
0.5079114888  
0.607440365  
0.7456287141  
0.9154720657  
1.103344909  
1.290719559  
1.456715792  
1.581105436  
1.647350966  
1.645215515  
1.572532679  
1.435847424  
1.249800982  
1.035296731  
0.8167125097  
0.61854289  
0.4619690505  
0.3618792783  
0.3247891921  
0.3479911995  
0.4200642252  
0.522664993  
0.6333349851  
0.7288632204  
0.7887026569  
0.7979046126  
0.7491195003  
0.6433830658  
0.4895951682  
0.3028018438  
0.1015976205  
-0.09491568591  
-0.2701097486  
-0.4122735687  
-0.5161543229  
-0.5833700869  
-0.6216832209  
-0.6432983238  
-0.6625099199  
-0.6931153402  
-0.746025112  
-0.8274607442  
-0.9380074956  
-1.072639901  
-1.22165139  
-1.372315761  
-1.510948669  
-1.62503101  
-1.705034419  
-1.745679628  
-1.74646231  
-1.711392775  
-1.648051783  
-1.566155418  
-1.475888987  
-1.386285777  
-1.303938913  
-1.232197785  
-1.170988239  
-1.117225123  
-1.065729722  
-1.010450764  
-0.9457840288  
-0.8677332473  
-0.7747218182  
-0.6679135151  
-0.5509891709  
-0.4294399448  
-0.309484021  
-0.1968297909  
-0.09549862128  
-0.006930608001  
0.07045126052  
0.141124282  
0.2117930875  
0.2902463317  
0.3839223374  
0.4984071977  
0.6361038362  
0.7953003087  
0.9697920246  
1.149157289  
1.319662815  
1.465712646  
1.571658267  
1.623745416  
1.611948008  
1.531462597  
1.383662739  
1.176380517  
0.923473353  
0.6437047151  
0.3590450883  
0.09258692901  
-0.1337286522  
-0.3013039539  
-0.3967800628  
-0.4134170979  
-0.3518229305  
-0.2199391108  
-0.03229619526  
0.1913808772  
0.4280783239  
0.6536797182  
0.8452418398  
0.9830815605  
1.052516602  
1.045065881  
0.9590497443  
0.7995501598  
0.5777824629  
0.309976428  
0.01590101887  
-0.2828318665  
-0.5645243997  
-0.8090773454  
-0.9995132798  
-1.123214885  
-1.172834575  
-1.146816599  
-1.049486407  
-0.890700264  
-0.6850486994  
-0.4506558258  
-0.2076193357  
0.02377687965  
0.2249689966  
0.3809447197  
0.481836395  
0.5240690141  
0.5109361475  
0.452454609  
0.3644882923  
0.2671464311  
0.1825994072  
0.1324922636  
0.1352496659  
0.2035557059  
0.3423492768  
0.5475915015  
0.8060270932  
1.096040282  
1.389565377  
1.65489371  
1.860091747  
1.976622133  
1.982759423  
1.866345787  
1.626521441  
1.274183482  
0.8310731646  
0.3275526964  
-0.2006491029  
-0.7163679983  
-1.18509301  
-1.578734149  
-1.878560832  
-2.076962035  
-2.17778764  
-2.19523461  
-2.151427154  
-2.072997718  
-1.987114574  
-1.917490223  
-1.880882148  
-1.884572255  
-1.925173252  
-1.98894147  
-2.053598342  
-2.091430034  
-2.073281603  
-1.972930978  
-1.771238436  
-1.459515577  
-1.041614532  
-0.5344326375  
0.03328698658  
0.6237325671  
1.194043218  
1.701064837  
2.10622208  
2.379888912  
2.504691426  
2.477338345  
2.308781645  
2.022714654  
1.652662174  
1.238074244  
0.8199442247  
0.4365176538  
0.1196002637  
-0.1081334885  
-0.2346097896  
-0.2585200638  
-0.1883156994  
-0.04027020698  
0.16404541  
0.4005032562  
0.6450314843  
0.8758070519  
1.074846007  
1.228910068  
1.329748287  
1.373782367  
1.361396889  
1.296011791  
1.18313498  
1.029529752  
0.8425987423  
0.6300353352  
0.3997114531  
0.1597425877  
-0.08137341739  
-0.3146654744  
-0.530753905  
-0.7201437496  
-0.8737861102  
-0.9838784494  
-1.044823668  
-1.054198134  
-1.013579162  
-0.929036833  
-0.8111427327  
-0.6743940755  
-0.5360348398  
-0.4143423906  
-0.3265536246  
-0.2866843335  
-0.3035359484  
-0.3792013355  
-0.5083274245  
-0.6783164517  
-0.8704997911  
-1.062195052  
-1.229416291  
-1.349886618  
-1.405951538  
-1.386986067  
-1.290945527  
-1.124826789  
-0.9039497227  
-0.6501485473  
-0.3891041178  
-0.1471673481  
0.05188668719  
0.1897566396  
0.2557844761  
0.2481215578  
0.1737772566  
0.04756747697  
-0.1098596675  
-0.2746276394  
-0.4225258732  
-0.531805468  
-0.5855575223  
-0.5734084364  
-0.492384088  
-0.3468976927  
-0.1479336261  
0.08841925301  
0.3428768012  
0.595073067  
0.8256360184  
1.018028119  
1.159973742  
1.244381408  
1.269687865  
1.239651982  
1.16262606  
1.050427772  
0.9169282391  
0.7765093955  
0.642559608  
0.5261489442  
0.4350257813  
0.3730360209  
0.3400032822  
0.3320815738  
0.342519261  
0.3627190785  
0.383468406  
0.3961561422  
0.3938389848  
0.3720049916  
0.328968771  
0.2658560232  
0.1862107649  
0.09531039399  
-0.0006778066805  
-0.09558483658  
-0.1840188425  
-0.2619408943  
-0.3269786517  
-0.3784531232  
-0.4171537084  
-0.4449215124  
-0.4641305135  
-0.4771388481  
-0.4858159038  
-0.4911713826  
-0.4931780811  
-0.4907601164  
-0.4819830851  
-0.4644025034  
-0.4355534668  
-0.3935127926  
-0.3374782815  
-0.2682715296  
-0.1886879257  
-0.1036072812  
-0.0197986195  
0.05460694459  
0.1109650281  
0.1412165636  
0.1391018728  
0.1013492525  
0.02861764565  
-0.07396794058  
-0.1968264943  
-0.3265650308  
-0.4472335153  
-0.5420790649  
-0.5955997889  
-0.5956485314  
-0.5352798489  
-0.4140689974  
-0.2386899819  
-0.02261020726  
0.2151003336  
0.4517389539  
0.663505637  
0.8282919822  
0.9283932132  
0.9527915721  
0.8987396956  
0.7724292189  
0.5886567006  
0.3695203193  
0.1422725638  
-0.06343789073  
-0.2186537565  
-0.2982158543  
-0.2835701818  
-0.1650081237  
0.05689154967  
0.3707752534  
0.7550555785  
1.179468898  
1.607549472  
1.999826804  
2.317474548  
2.526086373  
2.599185482  
2.521117768  
2.288969726  
1.913275406  
1.417361939  
0.8353588068  
0.2090295278  
-0.416253675  
-0.995964309  
-1.49081361  
-1.870573509  
-2.116895371  
-2.22479222  
-2.202628314  
-2.070616394  
-1.858041624  
-1.59954613  
-1.330946489  
-1.085095283  
-0.8882725235  
-0.7575279326  
-0.6992637557  
-0.7091733712  
-0.7735131308  
-0.8714843544  
-0.9784223944  
-1.069363717  
-1.12254909  
-1.122429045  
-1.061810492  
-0.9428742639  
-0.7769362888  
-0.5829785325  
-0.3851160487  
-0.2093015941  
-0.07968925254  
-0.01511732836  
-0.02618978567  
-0.1133764183  
-0.266433988  
-0.4652926459  
-0.6823545923  
-0.8859566176  
-1.044571514  
-1.13119979  
-1.127332896  
-1.025918255  
-0.8328648627  
-0.5667988717  
-0.2570506418  
0.05993445615  
0.345280194  
0.5628700472  
0.6842920349  
0.6928696643  
0.5861725076  
0.3766389304  
0.09019970585  
-0.236913261  
-0.5627442619  
-0.8449284694  
-1.046013786  
-1.13804251  
-1.105793736  
-0.9482719659  
-0.6782878026  
-0.3202720405  
0.09331655713  
0.5264176615  
0.9439824455  
1.316127431  
1.621277581  
1.847925703  
1.994855066  
2.069903951  
2.087561667  
2.065830538  
2.022891262  
1.974088412  
1.929689285  
1.893720419  
1.863985821  
1.833215137  
1.791066527  
1.726603692  
1.630815387  
1.498708997  
1.330643241  
1.132667987  
0.9158134237  
0.6944661951  
0.4840971114  
0.2987326555  
0.1486039349  
0.03836463392  
-0.03380253445  
-0.07602633932  
-0.1015382264  
-0.1265837121  
-0.1677826871  
-0.2393400146  
-0.3505551773  
-0.5040276295  
-0.6948463134  
-0.9109127348  
-1.134358613  
-1.343857978  
-1.517493218  
-1.635765108  
-1.684300084  
-1.655875148  
-1.551478106  
-1.380269046  
-1.158468768  
-0.9073477031  
-0.6505993714  
-0.4114736677  
-0.2100252258  
-0.06084085002  
0.02851685174  
0.05816929017  
0.03566470764  
-0.02514759267  
-0.105936596  
-0.1861843736  
-0.2456913291  
-0.2670196278  
-0.2376247728  
-0.1514493071  
-0.009817965403  
0.1784661127  
0.3978492714  
0.6275264971  
0.8435747391  
1.021514574  
1.13902261  
1.178508996  
1.129240184  
0.9887509855  
0.7633473644  
0.4676267901  
0.1230276025  
-0.2443961252  
-0.6067403465  
-0.9371936201  
-1.212804408  
-1.41672365  
-1.539668694  
-1.580449024  
-1.545518817  
-1.447667345  
-1.304048875  
-1.133843639  
-0.955857532  
-0.7863724454  
-0.6375082358  
-0.5162430047  
-0.4241948756  
-0.3581142295  
-0.3109716507  
-0.2734560647  
-0.2356578657  
-0.1887028394  
-0.1261221644  
-0.04481145001  
0.05453035565  
0.1675021906  
0.2865939336  
0.4021852763  
0.5037949041  
0.5814321729  
0.626872132  
0.6347255263  
0.6031684597  
0.5342711583  
0.433879209  
0.3110870289  
0.1773356653  
0.0452499497  
-0.07266807544  
-0.1653580652  
-0.2243865456  
-0.2448730274  
-0.2260484825  
-0.1713721076  
-0.08816758366  
0.01318684333  
0.1204768957  
0.2211230914  
0.3037723557  
0.3597993229  
0.3845204827  
0.3779463866  
0.3449253396  
0.2946256622  
0.2393696214  
0.1929588207  
0.1686757388  
0.1772547353  
0.2250909302  
0.3129831335  
0.4356051732  
0.5818369732  
0.735916787  
0.8793203115  
0.9930950723  
1.060348716  
1.068549545  
1.011313505  
0.8894351158  
0.7110050763  
0.4906157051  
0.2477439294  
0.004537954725  
-0.2167053804  
-0.3960662113  
-0.5181892387  
-0.5739233855  
-0.5611999742  
-0.4851077226  
-0.3571677781  
-0.1939499021  
-0.01520818861  
0.1582311291  
0.3065819978  
0.4129899356  
0.4650189825  
0.4556106108  
0.3834536812  
0.2527776866  
0.07264109959  
-0.1441736797  
-0.3825190785  
-0.6263187007  
-0.859961251  
-1.069499495  
-1.243583105  
-1.374071533  
-1.456324159  
-1.489203689  
-1.474845515  
-1.418266047  
-1.326868848  
-1.209887604  
-1.077774605  
-0.9415383284  
-0.8119951847  
-0.6989248064  
-0.6101358436  
-0.5505058513  
-0.5210824613  
-0.5184130553  
-0.5342634461  
-0.5559013262  
-0.5670476556  
-0.549525468  
-0.4855166233  
-0.3601935369  
-0.1644001838  
0.1030294395  
0.4337341181  
0.8094309497  
1.202886736  
1.580302089  
1.90490832  
2.141414786  
2.260703577  
2.24414145  
2.086840731  
1.799322932  
1.40724964  
0.949142382  
0.4723158393  
0.02751239542  
-0.3370618491  
-0.581512772  
-0.6790461376  
-0.6191414196  
-0.4086709531  
-0.07086126834  
0.3577482027  
0.8318734324  
1.302945711  
1.724699652  
2.058159331  
2.275406603  
2.361721087  
2.31593639  
2.14912861  
1.881946165  
1.541106601  
1.155590701  
0.7531226661  
0.3573601623  
-0.0139019774  
-0.3493874611  
-0.6439521843  
-0.8973575041  
-1.112540593  
-1.293729705  
-1.44474902  
-1.567775711  
-1.662699702  
-1.727134474  
-1.756997284  
-1.747504084  
-1.69436852  
-1.594988843  
-1.449418706  
-1.260986109  
-1.036487359  
-0.7859477302  
-0.522019443  
-0.2591145972  
-0.0124008612  
0.2032253758  
0.3740898911  
0.4885560591  
0.5376861066  
0.5157457849  
0.4205889727  
0.2539318281  
0.02152523085  
-0.2667967676  
-0.5972534553  
-0.9524990524  
-1.31233734  
-1.654812529  
-1.957686685  
-2.200230924  
-2.365200277  
-2.440768459  
-2.422165351  
-2.312737181  
-2.124188234  
-1.875844816  
-1.592906438  
-1.303798433  
-1.036889207  
-0.8169763067  
-0.6619869273  
-0.5803966782  
-0.5697471388  
-0.6165473941  
-0.697632831  
-0.7828601322  
-0.8388184102  
-0.8330859136  
-0.7384758832  
-0.5367378822  
-0.2212149826  
0.20185971  
0.7136020877  
1.284185984  
1.875831205  
2.446679128  
2.955118551  
3.36404266  
3.644597297  
3.778990855  
3.762103008  
3.601749967  
3.317602134  
2.938915214  
2.501348161  
2.043230518  
1.601702808  
1.209149138  
0.8902920973  
0.660244135  
0.5236816699  
0.4751740245  
0.5005600987  
0.5791543914  
0.6864732584  
0.7971254927  
0.8875414456  
0.9382440859  
0.9354521135  
0.8719415361  
0.7471395787  
0.5665749563  
0.3408173815  
0.08410571914  
-0.1871629397  
-0.4559226745  
-0.7058026851  
-0.9222832934  
-1.093619073  
-1.211517527  
-1.271566323  
-1.273415485  
-1.220716273  
-1.120812082  
-0.9841902381  
-0.8237181461  
-0.653710492  
-0.4888759139  
-0.3432390805  
-0.2291085643  
-0.1561789904  
-0.1308353353  
-0.1556991519  
-0.2294531918  
-0.346932156  
-0.4994810546  
-0.6755352018  
-0.8614097486  
-1.042240114  
-1.203035702  
-1.329796081  
-1.410617261  
-1.436719819  
-1.403305884  
-1.310169908  
-1.161961558  
-0.968055547  
-0.7419779368  
-0.5004024433  
-0.2617680719  
-0.0446155379  
0.1342007535  
0.2612511381  
0.3280189964  
0.3319459626  
0.2768782299  
0.1728206419  
0.03496018505  
-0.1179589739  
-0.265753822  
-0.3891767975  
-0.4722612933  
-0.5043167945  
-0.4813003883  
-0.4063539975  
-0.2893871158  
-0.145741744  
0.005920334014  
0.1462113781  
0.2577540665  
0.3276445261  
0.3492926951  
0.3233479499  
0.2575633227  
0.1656228971  
0.06509112579  
-0.02518651898  
-0.08784243173  
-0.1094740343  
-0.08249692997  
-0.006086853303  
0.1139010563  
0.2659815341  
0.4348644376  
0.603728131  
0.7565788928  
0.8803306544  
0.9662969624  
1.010933106  
1.015760492  
0.9865678256  
0.9320824635  
0.8623750236  
0.7872756003  
0.7150468951  
0.6515009234  
0.5996283616  
0.5597390939  
0.5300002351  
0.5072147507  
0.4876574191  
0.4677927258  
0.4447532471  
0.4165236222  
0.3818296728  
0.3398317403  
0.2897217204  
0.2303787267  
0.1601911637  
0.07713667413  
-0.02087485243  
-0.1354342745  
-0.2669498927  
-0.4139955288  
-0.5728323045  
-0.7372520758  
-0.8988097666  
-1.04749269  
-1.172741178  
-1.264727828  
-1.315708249  
-1.321250663  
-1.281137621  
-1.199796626  
-1.086127424  
-0.9527278879  
-0.8145636291  
-0.687235479  
-0.5850462779  
-0.5191342226  
-0.4959135493  
-0.5160578605  
-0.5741871138  
-0.6593216113  
-0.7560725431  
-0.8464249604  
-0.9118954853  
-0.935773667  
-0.9051687692  
-0.8125886199  
-0.6568631699  
-0.443310371  
-0.1831493297  
0.1077308264  
0.4104637122  
0.7051313833  
0.9726860061  
1.196658782  
1.364493729  
1.468414827  
1.50579846  
1.479077823  
1.395249333  
1.265056645  
1.101952689  
0.9209220046  
0.7372341569  
0.5652032553  
0.4170211293  
0.3017440211  
0.2245084486  
0.1860752278  
0.1827551951  
0.2067980387  
0.2472267614  
0.2910950019  
0.3250522906  
0.3370490623  
0.3179893504  
0.2630810342  
0.1727064805  
0.05262465645  
-0.08654093253  
-0.2305228372  
-0.3631804484  
-0.4686138864  
-0.5333017964  
-0.5479833615  
-0.5089775919  
-0.4187637181  
-0.2857155335  
-0.1230440166  
0.0529074864  
0.2247419492  
0.3761822471  
0.494017156  
0.5695539171  
0.599423043  
0.5856486142  
0.5350248719  
0.4579325318  
0.3667895991  
0.2743565616  
0.1921326862  
0.1290146956  
0.09036889834  
0.07758952208  
0.08814929652  
0.1161042034  
0.1529692133  
0.1888445968  
0.2136563352  
0.2183812575  
0.1961189501  
0.1429047578  
0.05817041492  
-0.05519041055  
-0.1911518895  
-0.3412517314  
-0.495547458  
-0.6437140327  
-0.7761353797  
-0.8848440514  
-0.9641757415  
-1.011075661  
-1.025036804  
-1.007710952  
-0.9623187883  
-0.8929882182  
-0.8041793658  
-0.7003062774  
-0.5856466769  
-0.4645010116  
-0.3415394284  
-0.2221810189  
-0.1128408887  
-0.02086901846  
0.04590893755  
0.08007231617  
0.0758140493  
0.03029461352  
-0.05514498016  
-0.1741625981  
-0.3152648065  
-0.4624694295  
-0.5967966647  
-0.6984539294  
-0.7494314327  
-0.7361184742  
-0.6515060757  
-0.4966046431  
-0.2807749973  
-0.02087799055  
0.2606784524  
0.5387232848  
0.7885240366  
0.9889109512  
1.124862269  
1.189150756  
1.182850457  
1.11465548  
0.999185651  
0.8545917095  
0.6998677989  
0.552298944  
0.4254102946  
0.3276795951  
0.2621195742  
0.2266964081  
0.2154112947  
0.2197997475  
0.2305669935  
0.2390850761  
