-0.1911988281  
-0.1279691176  
-0.0739773722  
-0.03616272676  
-0.0190932564  
-0.02426027616  
-0.04981981807  
-0.09083119664  
-0.1399466229  
-0.1884569693  
-0.2275331928  
-0.2494910088  
-0.2488866451  
-0.2232933003  
-0.1736538928  
-0.1041559024  
-0.02165993359  
0.06523538319  
0.1473635237  
0.2162185274  
0.2650865866  
0.2899180746  
0.2898294541  
0.2671825189  
0.2272263016  
0.1773766208  
0.1262296635  
0.08245028537  
0.05369492132  
0.04569219451  
0.06160789209  
0.1017464888  
0.1636170584  
0.242323377  
0.3312104483  
0.4226649884  
0.5089643354  
0.5830711772  
0.639280099  
0.6736737615  
0.6843465314  
0.6714112356  
0.6368143614  
0.5840063938  
0.517520089  
0.4425153702  
0.3643333656  
0.2881003296  
0.2183972242  
0.1590146347  
0.1127797389  
0.08146708067  
0.0657657498  
0.06531171729  
0.07877002184  
0.1039637506  
0.1380514974  
0.1777466718  
0.2195658868  
0.260101842  
0.2962902946  
0.3256523983  
0.3464853364  
0.3579701264  
0.3601864255  
0.3540193375  
0.3409742343  
0.3229156901  
0.3017702158  
0.2792327752  
0.2565240467  
0.234232818  
0.2122657859  
0.1899154506  
0.1660275772  
0.1392379137  
0.1082450811  
0.07206039286  
0.03021019566  
-0.01714568006  
-0.06919246107  
-0.1245293064  
-0.1813105341  
-0.2374328328  
-0.2907402367  
-0.3392133653  
-0.3811318987  
-0.4151936073  
-0.4405888892  
-0.4570384956  
-0.4647901937  
-0.4645961314  
-0.457654315  
-0.445530178  
-0.4300450014  
-0.4131399623  
-0.3967126066  
-0.3824441327  
-0.371633657  
-0.365052492  
-0.3628574241  
-0.3645649479  
-0.3691121885  
-0.3749906775  
-0.380446527  
-0.383720679  
-0.3832913636  
-0.3780888056  
-0.3676481761  
-0.3521737978  
-0.3325160264  
-0.31005224  
-0.2864989517  
-0.2636778035  
-0.2432754403  
-0.2266231644  
-0.2145343887  
-0.2072148484  
-0.2042589776  
-0.2047225538  
-0.2072665498  
-0.2103365208  
-0.212368467  
-0.2119721937  
-0.2080845809  
-0.200068676  
-0.1877420308  
-0.1713476137  
-0.1514603112  
-0.128852913  
-0.1043417314  
-0.07863266362  
-0.05219209337  
-0.0251654458  
0.002643165645  
0.03172669496  
0.0627633416  
0.09645625255  
0.1333412556  
0.1735934395  
0.216860102  
0.2621539055  
0.3078220095  
0.351616214  
0.3908596188  
0.422697897  
0.4444176597  
0.4537883248  
0.4493837916  
0.4308451945  
0.3990351284  
0.3560587914  
0.3051354933  
0.2503304556  
0.1961652601  
0.1471591267  
0.1073482001  
0.07984564286  
0.06649234699  
0.06765263274  
0.08216924352  
0.1074903714  
0.139955501  
0.1751962413  
0.2086143721  
0.2358714657  
0.2533327523  
0.2584187172  
0.2498211107  
0.2275654334  
0.1929215452  
0.1481855047  
0.09636624919  
0.04082452157  
-0.01507961658  
-0.06829231618  
-0.1162931771  
-0.1572164598  
-0.1898833964  
-0.2137479686  
-0.2287905693  
-0.235389266  
-0.2341948728  
-0.2260356312  
-0.211855973  
-0.1926878857  
-0.16964733  
-0.1439284481  
-0.1167902609  
-0.08950841385  
-0.06330259116  
-0.03923404226  
-0.01809461461  
-0.0003109689953  
0.01411955313  
0.02563041874  
0.03502318713  
0.04333477829  
0.05165006775  
0.06088587694  
0.07157975126  
0.08371750732  
0.09663859677  
0.1090351108  
0.1190627961  
0.1245484171  
0.1232791804  
0.1133320273  
0.09340024229  
0.06306715319  
0.02298825147  
-0.02505430274  
-0.07823883354  
-0.1329304916  
-0.1850263483  
-0.2303808353  
-0.2652606398  
-0.2867746247  
-0.2932245258  
-0.2843298023  
-0.2612951122  
-0.2267058921  
-0.1842625891  
-0.1383740892  
-0.09366311758  
-0.05443069081  
-0.02415412877  
-0.005064196431  
0.002127226447  
-0.001667426617  
-0.01400120948  
-0.03116789503  
-0.04863054279  
-0.06155448825  
-0.06539070411  
-0.0564330228  
-0.03229038357  
0.007779984417  
0.06272194171  
0.129721622  
0.2044525372  
0.2814793502  
0.3547957837  
0.418430359  
0.4670595564  
0.4965619009  
0.5044583064  
0.4901868828  
0.455187768  
0.4027829042  
0.3378708992  
0.26645856  
0.19508543  
0.1301975093  
0.07753289412  
0.041582493  
0.02517693098  
0.02923932363  
0.0527243304  
0.09274309055  
0.1448650484  
0.2035546001  
0.2627056706  
0.3162197955  
0.3585700126  
0.385305424  
0.3934418986  
0.3817138064  
0.3506553854  
0.3025159045  
0.2410087934  
0.1709264076  
0.09765800873  
0.02664931349  
-0.03712842984  
-0.08965714772  
-0.1282466601  
-0.1517652122  
-0.1607014946  
-0.1570533531  
-0.1440532086  
-0.1257612381  
-0.1065779815  
-0.09072276004  
-0.08175180345  
-0.08216337195  
-0.09314444777  
-0.1144790701  
-0.1446369723  
-0.1810185021  
-0.2203241664  
-0.2590014045  
-0.2937020147  
-0.3216966791  
-0.3411906714  
-0.3515055885  
-0.3531070741  
-0.3474837103  
-0.3368973222  
-0.3240460174  
-0.3116892303  
-0.3022879151  
-0.2977056253  
-0.2990148115  
-0.3064227551  
-0.3193268954  
-0.3364798381  
-0.3562341846  
-0.3768253865  
-0.3966460792  
-0.4144630394  
-0.4295541738  
-0.4417348033  
-0.4512880074  
-0.458801319  
-0.4649604323  
-0.4703286105  
-0.4751649845  
-0.4793090636  
-0.4821706191  
-0.4828080121  
-0.4801004799  
-0.4729674874  
-0.4605936539  
-0.4426197387  
-0.4192448871  
-0.3912275313  
-0.3597755713  
-0.3263447074  
-0.2923869807  
-0.2590905745  
-0.2271754316  
-0.1967746937  
-0.1674287093  
-0.1382024151  
-0.1078859467  
-0.07525574282  
-0.03933432302  
0.0003935057662  
0.04385488475  
0.09036794439  
0.1387328034  
0.1874091574  
0.2347487807  
0.2792372781  
0.3197014389  
0.3554459666  
0.3863034454  
0.4125885828  
0.4349733624  
0.4543103795  
0.4714359223  
0.4869948242  
0.501308748  
0.5143177593  
0.5255952767  
0.534439236  
0.5400153147  
0.5415296465  
0.5384073083  
0.5304409296  
0.5178886853  
0.5015054061  
0.4825027358  
0.4624350917  
0.4430327914  
0.4259989361  
0.4128023522  
0.4044856553  
0.401530263  
0.4037806646  
0.4104543812  
0.4202271088  
0.4313898024  
0.4420513265  
0.4503675826  
0.4547604995  
0.4541009389  
0.4478317546  
0.4360112618  
0.4192762362  
0.398727449  
0.375754755  
0.3518326846  
0.3283134619  
0.3062508192  
0.2862813306  
0.2685755638  
0.2528620334  
0.2385114046  
0.2246596705  
0.2103400035  
0.1946007198  
0.1765887167  
0.1555972828  
0.1310803605  
0.1026570084  
0.07012778565  
0.03351930871  
-0.006836775635  
-0.05019754379  
-0.09530573249  
-0.1403327161  
-0.182897519  
-0.220210464  
-0.2493370241  
-0.2675760519  
-0.2728929428  
-0.2643489516  
-0.2424361878  
-0.2092420779  
-0.1683887169  
-0.1247296662  
-0.08382544008  
-0.05126508775  
-0.03193207843  
-0.02932853581  
-0.04506859735  
-0.07862418804  
-0.1273725447  
-0.186936824  
-0.2517746806  
-0.3159196575  
-0.3737560365  
-0.4207169105  
-0.4537936839  
-0.4717985788  
-0.47534548  
-0.4665838452  
-0.4487373403  
-0.4255436081  
-0.4006930444  
-0.377355975  
-0.3578613552  
-0.3435644561  
-0.3348919304  
-0.3315273974  
-0.3326799772  
-0.3373659864  
-0.3446432929  
-0.3537522323  
-0.364153085  
-0.3754570162  
-0.3872998689  
-0.3991835897  
-0.4103524318  
-0.4197371636  
-0.4259927999  
-0.4276359645  
-0.4232636284  
-0.4118215839  
-0.392860345  
-0.3667494667  
-0.3347823753  
-0.2991518019  
-0.2627836535  
-0.2290401265  
-0.2013253346  
-0.1826450278  
-0.1751827955  
-0.1799578243  
-0.1966083122  
-0.2233521128  
-0.2571262221  
-0.2939001283  
-0.3291233919  
-0.3582547445  
-0.3772995524  
-0.383287603  
-0.3746214809  
-0.3512509679  
-0.3146451523  
-0.2675664142  
-0.2136744416  
-0.1570144283  
-0.1014598505  
-0.0501878454  
-0.005258416692  
0.03263479948  
0.0642146088  
0.09145287119  
0.1172094281  
0.1447216399  
0.1770171378  
0.2163334459  
0.2636229815  
0.3182385237  
0.3778369782  
0.4385474053  
0.4953871269  
0.542885316  
0.5758377754  
0.5900827073  
0.5831925946  
0.5549613966  
0.5076131363  
0.4456719406  
0.3755081044  
0.3045965363  
0.2406065264  
0.1904337329  
0.1593284522  
0.1502458736  
0.1635105585  
0.1968557934  
0.2458147302  
0.3044107873  
0.3660293736  
0.4243484919  
0.4741730861  
0.5120659635  
0.5366803984  
0.548759145  
0.5508198778  
0.5465772807  
0.5402210567  
0.5356491948  
0.535791913  
0.5421249036  
0.5544439907  
0.5709303798  
0.588491004  
0.6033125925  
0.6115411361  
0.6099733768  
0.5966490476  
0.5712478256  
0.535224056  
0.4916572591  
0.4448252267  
0.399572334  
0.360556598  
0.3314867998  
0.3144681653  
0.3095560911  
0.3145902709  
0.325348448  
0.3360049818  
0.3398454982  
0.3301524443  
0.3011314838  
0.2487744071  
0.1715279985  
0.07067665331  
-0.04961361737  
-0.182620114  
-0.319712057  
-0.4512646776  
-0.567720883  
-0.6606814034  
-0.7238799443  
-0.7539220031  
-0.7506873241  
-0.7173384572  
-0.6599326929  
-0.5866775013  
-0.5069341671  
-0.4300995733  
-0.3645135354  
-0.3165435772  
-0.289964488  
-0.2857042013  
-0.3019788785  
-0.334775265  
-0.3785906177  
-0.4273086478  
-0.4750726494  
-0.5170290232  
-0.5498427295  
-0.5719270089  
-0.5833819265  
-0.5856819902  
-0.5811917954  
-0.5726028256  
-0.5624000439  
-0.552435905  
-0.5436788449  
-0.5361474137  
-0.5290288572  
-0.5209308859  
-0.5102105462  
-0.4953226012  
-0.4751234914  
-0.4490940624  
-0.4174597839  
-0.3812069724  
-0.3420003177  
-0.3020216081  
-0.2637538752  
-0.2297246764  
-0.2022301379  
-0.1830645229  
-0.1732643523  
-0.1729091692  
-0.1809954129  
-0.1954178372  
-0.2130793205  
-0.2301412562  
-0.2423995716  
-0.2457628549  
-0.236769512  
-0.2130819763  
-0.1738759441  
-0.1200599453  
-0.05427138085  
0.01936711934  
0.09571628986  
0.169254205  
0.2347903434  
0.2881587959  
0.3267804352  
0.3500017893  
0.3591604905  
0.3573489436  
0.3489229083  
0.3388127969  
0.3317603355  
0.3315895039  
0.3406327593  
0.3594108837  
0.3866070838  
0.4193467218  
0.4537334605  
0.4855508734  
0.5110067646  
0.5274018895  
0.5335949975  
0.5301942289  
0.5194286314  
0.5047238608  
0.4900485779  
0.4791545465  
0.4748272366  
0.4783086716  
0.4889772316  
0.5043728512  
0.5205603172  
0.5327805361  
0.5362861942  
0.5272055139  
0.5032928167  
0.4644163547  
0.4126958558  
0.3522471867  
0.2885754465  
0.2277091649  
0.1752248512  
0.1353296648  
0.1101661667  
0.0994675888  
0.1006284101  
0.1091879547  
0.1196459437  
0.1264785108  
0.1251657509  
0.1130645967  
0.08995237226  
0.05815114328  
0.02218869472  
-0.01194987535  
-0.03786367163  
-0.04989595597  
-0.04422206324  
-0.01967047992  
0.02185663888  
0.07545468409  
0.1337662612  
0.1879335752  
0.2288085709  
0.248231694  
0.2401846555  
0.2016440454  
0.1330137534  
0.03807481707  
-0.0765237927  
-0.2021618128  
-0.3293871504  
-0.4491363867  
-0.553870591  
-0.6384658324  
-0.700750507  
-0.7416193941  
-0.7647275827  
-0.7758041971  
-0.7817006808  
-0.7892972504  
-0.8044328239  
-0.8310064773  
-0.8703730424  
-0.9211299955  
-0.9793039064  
-1.038923669  
-1.092878097  
-1.133928188  
-1.15572206  
-1.153661885  
-1.125498995  
-1.071582587  
-0.9947405566  
-0.8998353921  
-0.7930713918  
-0.681174632  
-0.5705652131  
-0.4666389687  
-0.3732458874  
-0.2924169578  
-0.2243604179  
-0.1676899385  
-0.1198492227  
-0.0776475939  
-0.03782191835  
0.002447775261  
0.04515459621  
0.09124551983  
0.1406118059  
0.1922599607  
0.2446453902  
0.2960931379  
0.3452390898  
0.3914014818  
0.4348280919  
0.4767593011  
0.5192995563  
0.5651223721  
0.617041537  
0.6775359358  
0.748289267  
0.8298301434  
0.9213247528  
1.020550379  
1.124064859  
1.22754126  
1.326223458  
1.415437894  
1.491097426  
1.550112218  
1.59067655  
1.612367454  
1.616070831  
1.603733103  
1.577987459  
1.541712062  
1.497592  
1.447744069  
1.393468678  
1.335154838  
1.27235214  
1.203995284  
1.128732538  
1.045312222  
0.9529588582  
0.8516767278  
0.7424387323  
0.6272194587  
0.5088725857  
0.3908628639  
0.2768925754  
0.1704692994  
0.07448263806  
-0.009157465001  
-0.07975803037  
-0.1379297794  
-0.1854982038  
-0.2252573788  
-0.2605945906  
-0.2950434165  
-0.3318318986  
-0.3734961816  
-0.4216213198  
-0.4767433675  
-0.5384347227  
-0.6055427029  
-0.6765366466  
-0.7498905523  
-0.8244275163  
-0.8995441895  
-0.9752763645  
-1.052177585  
-1.13104006  
-1.212499824  
-1.296621627  
-1.382549815  
-1.468309549  
-1.550838395  
-1.62625811  
-1.690380426  
-1.73937757  
-1.770512564  
-1.782806204  
-1.777510437  
-1.758282581  
-1.730995645  
-1.70317136  
-1.683092693  
-1.678698441  
-1.696412388  
-1.740076818  
-1.810162311  
-1.903374046  
-2.012745703  
-2.128219853  
-2.237643148  
-2.328051543  
-2.387060002  
-2.404163052  
-2.371768427  
-2.285838263  
-2.14606792  
-1.955626068  
-1.72052723  
-1.448780422  
-1.149460301  
-0.831850364  
-0.5047608808  
-0.1760919646  
0.1473665157  
0.4599342547  
0.7569229937  
1.034484891  
1.289498654  
1.519548169  
1.722986256  
1.899068188  
2.048084522  
2.171431056  
2.271553854  
2.351733134  
2.415710714  
2.467204984  
2.509387532  
2.544423769  
2.573164365  
2.595066991  
2.608376354  
2.610548059  
2.598849632  
2.571036659  
2.525980581  
2.464124081  
2.387675019  
2.300482945  
2.207602301  
2.114606088  
2.026751861  
1.948140215  
1.881013694  
1.825319494  
1.778635459  
1.736491878  
1.6930623  
1.642132353  
1.578196728  
1.49751517  
1.398924579  
1.284268715  
1.158316553  
1.028153638  
0.9021065264  
0.7883418892  
0.6933699576  
0.620699893  
0.5699083139  
0.5363145535  
0.5113813849  
0.4838363498  
0.441379448  
0.3727407852  
0.2697586738  
0.1291336209  
-0.0464755884  
-0.2482521666  
-0.4620391158  
-0.6701298297  
-0.8538513495  
-0.9965875052  
-1.086833508  
-1.120803235  
-1.1041557  
-1.052503339  
-0.9905020565  
-0.9495224375  
-0.9640928731  
-1.067495438  
-1.28704372  
-1.63965115  
-2.128311568  
-2.740023321  
-3.445546889  
-4.201150966  
-4.952247182  
-5.638561134  
-6.200253582  
-6.584261967  
-6.75007064  
-6.674178401  
-6.352688874  
-5.801702041  
-5.055462963  
-4.162541743  
-3.180546445  
-2.170068613  
-1.188627615  
-0.2853442988  
0.5030514851  
1.154480545  
1.661899543  
2.031907647  
2.281917395  
2.436364175  
2.52254697  
2.566664085  
2.590550481  
2.609466281  
2.631126765  
2.655962086  
2.678432979  
2.68911185  
2.677135678  
2.632649042  
2.548872922  
2.423525728  
2.259441055  
2.064343588  
1.849870229  
1.630027705  
1.419340993  
1.230974039  
1.07509176  
0.9576831408  
0.8799836855  
0.8385398736  
0.8258761092  
0.8316319643  
0.8439959518  
0.8512286584  
0.8430798662  
0.8119310901  
0.7535494958  
0.6673946114  
0.5564799552  
0.4268374972  
0.2866823677  
0.1453859044  
0.01238647257  
-0.1038443887  
-0.1966784622  
-0.261966312  
-0.2983830884  
-0.3074668697  
-0.2933645838  
-0.262314341  
-0.2219417779  
-0.1804301075  
-0.1456602164  
-0.1243937966  
-0.1215839514  
-0.1398710532  
-0.179320685  
-0.2374221365  
-0.309361133  
-0.388543552  
-0.4673254533  
-0.5378785413  
-0.593106858  
-0.627501066  
-0.6378474548  
-0.6236790103  
-0.5874159995  
-0.5341561584  
-0.4711158188  
-0.4067879315  
-0.3498861681  
-0.3082194392  
-0.2876263274  
-0.2911121551  
-0.3183275733  
-0.3654629526  
-0.4256066242  
-0.4895373025  
-0.5468579205  
-0.587329741  
-0.6022239077  
-0.5854927638  
-0.534597015  
-0.4508588924  
-0.3392890585  
-0.2079149436  
-0.06671225336  
