9328.73876  
9333.182482  
9337.570649  
9341.831369  
9345.875904  
9349.595612  
9352.863945  
9355.544023  
9357.501119  
9358.618561  
9358.814797  
9358.059124  
9356.383295  
9353.886909  
9350.735079  
9347.148035  
9343.383348  
9339.712717  
9336.395983  
9333.655556  
9331.654481  
9330.480902  
9330.140837  
9330.560172  
9331.595381  
9333.051694  
9334.706166  
9336.332884  
9337.72728  
9338.726784  
9339.225599  
9339.182306  
9338.619796  
9337.61801  
9336.300748  
9334.818491  
9333.329443  
9331.981279  
9330.895726  
9330.157823  
9329.810928  
9329.857858  
9330.267542  
9330.985905  
9331.948961  
9333.095835  
9334.379375  
9335.772414  
9337.26843  
9338.876371  
9340.610354  
9342.476138  
9344.45685  
9346.501045  
9348.515958  
9350.368198  
9351.893245  
9352.913358  
9353.262278  
9352.813375  
9351.506945  
9349.371915  
9346.537451  
9343.231193  
9339.762574  
9336.492049  
9333.789397  
9331.986246  
9331.329504  
9331.942631  
9333.801106  
9336.726563  
9340.401672  
9344.404633  
9348.259349  
9351.494681  
9353.704808  
9354.602118  
9354.055114  
9352.105777  
9348.963637  
9344.97737  
9340.587633  
9336.267841  
9332.461174  
9329.522607  
9327.674021  
9326.978505  
9327.337257  
9328.509058  
9330.149348  
9331.863049  
9333.263504  
9334.029205  
9333.950431  
9332.959522  
9331.140848  
9328.719377  
9326.029696  
9323.469792  
9321.445868  
9320.315315  
9320.335235  
9321.622985  
9324.133626  
9327.657374  
9331.837493  
9336.207045  
9340.240503  
9343.41463  
9345.271712  
9345.477685  
9343.868071  
9340.475513  
9335.534715  
9329.4631  
9322.818347  
9316.237077  
9310.361666  
9305.764032  
9302.87625  
9301.937225  
9302.96301  
9305.745151  
9309.877879  
9314.810821  
9319.920266  
9324.589384  
9328.286428  
9330.630327  
9331.434839  
9330.72573  
9328.729292  
9325.834635  
9322.535881  
9319.362919  
9316.810692  
9315.276745  
9315.015057  
9316.111475  
9318.482716  
9321.897559  
9326.015767  
9330.438207  
9334.760631  
9338.623669  
9341.752733  
9343.983473  
9345.270807  
9345.681858  
9345.375319  
9344.571142  
9343.515561  
9342.44624  
9341.562046  
9341.000866  
9340.827508  
9341.032338  
9341.53989  
9342.225576  
9342.937759  
9343.521875  
9343.843394  
9343.806596  
9343.36678  
9342.534663  
9341.37257  
9339.983407  
9338.494297  
9337.037532  
9335.731857  
9334.666962  
9333.893467  
9333.419749  
9333.21565  
9333.222167  
9333.364933  
9333.568985  
9333.772061  
9333.934183  
9334.04206  
9334.10801  
9334.164072  
9334.252895  
9334.417564  
9334.692426  
9335.096602  
9335.631218  
9336.280364  
9337.015084  
9337.799022  
9338.594171  
9339.365372  
9340.082654  
9340.72126  
9341.259947  
9341.678617  
9341.956589  
9342.072659  
9342.007562  
9341.748717  
9341.296308  
9340.669242  
9339.909084  
9339.08044  
9338.266645  
9337.56074  
9337.052686  
9336.814722  
9336.887551  
9337.270096  
9337.915193  
9338.732642  
9339.599879  
9340.378916  
9340.937065  
9341.1682  
9341.010855  
9340.459956  
9339.570034  
9338.448969  
9337.243184  
9336.116343  
9335.224977  
9334.69488  
9334.60192  
9334.960511  
9335.721343  
9336.778905  
9337.987462  
9339.183126  
9340.208438  
9340.935751  
9341.285752  
9341.238304  
9340.83397  
9340.16601  
9339.364175  
9338.57283  
9337.926927  
9337.529502  
9337.4344  
9337.636793  
9338.073078  
9338.630007  
9339.161701  
9339.511769  
9339.537077  
9339.129536  
9338.232603  
9336.850077  
9335.046004  
9332.935768  
9330.669939  
9328.413127  
9326.321113  
9324.519427  
9323.086328  
9322.042692  
9321.349994  
9320.91681  
9320.613069  
9320.290073  
9319.80389  
9319.038891  
9317.928177  
9316.467945  
9314.723312  
9312.82428  
9310.951655  
9309.314342  
9308.120715  
9307.547998  
9307.714224  
9308.657224  
9310.324617  
9312.576876  
9315.203984  
9317.953505  
9320.56627  
9322.814037  
9324.533097  
9325.648221  
9326.182708  
9326.252874  
9326.047566  
9325.796332  
9325.731432  
9326.05018  
9326.883871  
9328.278258  
9330.188519  
9332.48905  
9334.995738  
9337.496486  
9339.784415  
9341.687998  
9343.09339  
9343.955778  
9344.298844  
9344.203576  
9343.789502  
9343.192454  
9342.543267  
9341.951057  
9341.493479  
9341.214754  
9341.130323  
9341.236015  
9341.518685  
9341.965208  
9342.567654  
9343.32344  
9344.230682  
9345.280374  
9346.447745  
9347.685586  
9348.921879  
9350.063125  
9351.003629  
9351.639356  
9351.884139  
9351.685143  
9351.034582  
9349.975186  
9348.598083  
9347.033055  
9345.432565  
9343.951995  
9342.729184  
9341.866471  
9341.417845  
9341.383022  
9341.708918  
9342.298075  
9343.022375  
9343.739878  
9344.312411  
9344.621663  
9344.581915  
9344.148378  
9343.320559  
9342.140728  
9340.688057  
9339.069232  
9337.406514  
9335.824263  
9334.435093  
9333.326654  
9332.550341  
9332.113133  
9331.973605  
9332.043299  
9332.193871  
9332.270254  
9332.109069  
9331.5608  
9330.513447  
9328.91468  
9326.789242  
9324.248373  
9321.488785  
9318.779602  
9316.437405  
9314.790992  
9314.139492  
9314.708685  
9316.611497  
9319.818769  
9324.145692  
9329.257707  
9334.697275  
9339.929961  
9344.405356  
9347.625527  
9349.21217  
9348.962591  
9346.885956  
9343.213132  
9338.377119  
9332.965133  
9327.647738  
9323.093957  
9319.883876  
9318.430811  
9318.924419  
9321.302893  
9325.258743  
9330.277584  
9335.704712  
9340.830273  
9344.981231  
9347.607412  
9348.350073  
9347.083947  
9343.927765  
9339.222792  
9333.4832  
9327.326097  
9321.391358  
9316.262365  
9312.398176  
9310.085552  
9309.41598  
9310.289305  
9312.441735  
9315.492855  
9319.004088  
9322.539945  
9325.723696  
9328.280402  
9330.06255  
9331.056193  
9331.368358  
9331.198942  
9330.802145  
9330.443615  
9330.359434  
9330.722511  
9331.620355  
9333.046521  
9334.905836  
9337.031756  
9339.212563  
9341.222322  
9342.851955  
9343.936384  
9344.374239  
9344.138196  
9343.275092  
9341.89669  
9340.162867  
9338.259962  
9336.377425  
9334.685747  
9333.318278  
9332.358842  
9331.836061  
9331.724628  
9331.952671  
9332.414008  
9332.983526  
9333.5338  
9333.951072  
9334.148949  
9334.078429  
9333.733352  
9333.150732  
9332.406028  
9331.603807  
9330.864809  
9330.310723  
9330.048498  
9330.155878  
9330.670085  
9331.581119  
9332.830759  
9334.317703  
9335.908472  
9337.453015  
9338.803209  
9339.832081  
9340.451227  
9340.624038  
9340.372926  
9339.779074  
9338.974532  
9338.127115  
9337.419788  
9337.026864  
9337.090072  
9337.697592  
9338.869091  
9340.5492  
9342.610687  
9344.867548  
9347.096775  
9349.066168  
9350.564618  
9351.430704  
9351.575426  
9350.995545  
9349.77537  
9348.076261  
9346.115283  
9344.135881  
9342.374818  
9341.030384  
9340.236451  
9340.046288  
9340.428285  
9341.273959  
9342.416614  
9343.657384  
9344.794397  
9345.650412  
9346.094754  
9346.056521  
9345.527539  
9344.555293  
9343.227764  
9341.653142  
9339.938247  
9338.169427  
9336.399027  
9334.639623  
9332.866583  
9331.028287  
9329.06195  
9326.912136  
9324.548727  
9321.981156  
9319.266512  
9316.509961  
9313.857379  
9311.480937  
9309.559814  
9308.258519  
9307.705862  
9307.977318  
9309.083172  
9310.963916  
9313.493586  
9316.490646  
9319.73517  
9322.99046  
9326.026568  
9328.643109  
9330.688901  
9332.076038  
9332.786981  
9332.873682  
9332.448995  
9331.671224  
9330.723783  
9329.792431  
9329.042894  
9328.601809  
9328.543326  
9328.88314  
9329.580691  
9330.548934  
9331.670286  
9332.816184  
9333.867356  
9334.731617  
9335.356611  
9335.73555  
9335.905161  
9335.936439  
9335.919611  
9335.94609  
9336.090284  
9336.394435  
9336.859043  
9337.440634  
9338.057324  
9338.601571  
9338.958044  
9339.02387  
9338.72791  
9338.045831  
9337.008247  
9335.700348  
9334.2526  
9332.823647  
9331.577852  
9330.660747  
9330.176312  
9330.1697  
9330.618428  
9331.433748  
9332.472364  
9333.55713  
9334.503745  
9335.149567  
9335.380017  
9335.148525  
9334.486512  
9333.501675  
9332.364299  
9331.283393  
9330.47584  
9330.133153  
9330.390606  
9331.303567  
9332.834688  
9334.854113  
9337.153121  
9339.469385  
9341.520691  
9343.042338  
9343.823149  
9343.735042  
9342.7521  
9340.956388  
9338.529831  
9335.733226  
9332.875226  
9330.27565  
9328.227911  
9326.965527  
9326.636987  
9327.291828  
9328.879284  
9331.258993  
9334.22164  
9337.516205  
9340.879801  
9344.065985  
9346.868084  
9349.13506  
9350.778662  
9351.772228  
9352.142374  
9351.955878  
9351.304331  
9350.289064  
9349.008471  
9347.548882  
9345.97966  
9344.352034  
9342.700966  
9341.048691  
9339.408925  
9337.790554  
9336.200326  
9334.644177  
9333.127524  
9331.654738  
9330.228549  
9328.849808  
9327.518075  
9326.233233  
9324.998104  
9323.821798  
9322.72327  
9321.73442  
9320.901912  
9320.286932  
9319.962194  
9320.005861  
9320.492416  
9321.481208  
9323.003887  
9325.052551  
9327.570731  
9330.449375  
9333.529478  
9336.612368  
9339.477389  
9341.905384  
9343.705361  
9344.740476  
9344.949338  
9344.358735  
9343.085015  
9341.322854  
9339.322203  
9337.356232  
9335.684592  
9334.517634  
9333.987029  
9334.127597  
9334.873356  
9336.068664  
9337.492692  
9338.893572  
9340.026627  
9340.690755  
9340.757194  
9340.186299  
9339.029886  
9337.419252  
9335.541083  
9333.605622  
9331.812315  
9330.318727  
9329.217512  
9328.524933  
9328.182452  
9328.070522  
9328.032103  
9327.901684  
9327.534943  
9326.83434  
9325.76664  
9324.369911  
9322.749244  
9321.062249  
9319.4969  
9318.245333  
9317.477724  
9317.319887  
9317.837699  
9319.030064  
9320.830785  
9323.118448  
9325.73235  
9328.491913  
9331.216855  
9333.745604  
9335.950049  
9337.745502  
9339.095222  
9340.009828  
9340.542016  
9340.777558  
9340.823545  
9340.794911  
9340.800382  
9340.929073  
9341.238957  
9341.748545  
9342.432916  
9343.225079  
9344.022958  
9344.701734  
9345.130258  
9345.189704  
9344.791723  
9343.893604  
9342.507693  
9340.703539  
9338.601959  
9336.361802  
9334.161117  
9332.175763  
9330.558467  
9329.42167  
9328.826418  
9328.778762  
9329.233618  
9330.104896  
9331.279763  
9332.634352  
9334.048441  
9335.416903  
9336.656872  
9337.710211  
9338.542204  
9339.137488  
9339.49509  
9339.623714  
9339.5385  
9339.259399  
9338.811075  
9338.22344  
9337.532078  
9336.777587  
9336.00359  
9335.253406  
9334.566045  
9333.972341  
9333.492264  
9333.134015  
9332.895128  
9332.765169  
9332.729111  
9332.770302  
9332.871812  
9333.015639  
9333.17973  
9333.333664  
9333.434585  
9333.425033  
9333.234487  
9332.785601  
9332.005126  
9330.838314  
9329.264514  
9327.310774  
9325.060323  
9322.653089  
9320.276897  
9318.149358  
9316.49243  
9315.503258  
9315.325727  
9316.027644  
9317.587613  
9319.894341  
9322.758867  
9325.938151  
9329.166386  
9332.188977  
9334.793734  
9336.834323  
9338.242562  
9339.028021  
9339.265929  
9339.076339  
9338.598863  
9337.967962  
9337.293265  
9336.648018  
9336.066929  
9335.552766  
9335.088896  
9334.654375  
9334.23736  
9333.843596  
9333.497961  
9333.238844  
9333.106999  
9333.131986  
9333.320034  
9333.647021  
9334.059185  
9334.482493  
9334.83945  
9335.070221  
9335.153463  
9335.121888  
9335.068002  
9335.137202  
9335.50768  
9336.35937  
9337.83661  
9340.011052  
9342.85199  
9346.210668  
9349.823086  
9353.333047  
9356.333583  
9358.421482  
9359.257121  
9358.62021  
9356.45221  
9352.877776  
9348.200762  
9342.873985  
9337.446255  
9332.493704  
9328.54522  
9326.012689  
9325.136241  
9325.952604  
9328.29102  
9331.79733  
9335.982524  
9340.288541  
9344.161953  
9347.12494  
9348.833942  
9349.118286  
9347.994293  
9345.653963  
9342.430977  
9338.749822  
9335.065838  
9331.804761  
9329.310068  
9327.804606  
9327.370704  
9327.950191  
9329.3628  
9331.339098  
9333.56242  
9335.713476  
9337.511397  
9338.746026  
9339.297939  
9339.144512  
9338.352605  
9337.060068  
9335.449683  
9333.719962  
9332.05717  
9330.612282  
9329.485776  
9328.721311  
9328.308374  
9328.192229  
9328.288795  
9328.501532  
9328.737364  
9328.919351  
9328.994506  
9328.936307  
9328.742423  
9328.428903  
9328.022571  
9327.553454  
9327.04853  
9326.527922  
9326.003525  
9325.479858  
9324.956196  
9324.429169  
9323.894875  
9323.350072  
9322.792411  
9322.220037  
9321.631225  
9321.024676  
9320.400967  
9319.765308  
9319.131108  
9318.523643  
9317.982631  
9317.562682  
9317.330719  
9317.360108  
9317.721786  
9318.47355  
9319.649031  
9321.248216  
9323.231414  
9325.517897  
9327.989971  
9330.502203  
9332.894758  
9335.009143  
9336.704292  
9337.870986  
9338.442832  
9338.402759  
9337.784659  
9336.670446  
9335.18331  
9333.47835  
9331.731571  
9330.128283  
9328.851444  
9328.070252  
9327.929159  
9328.537245  
9329.958279  
9332.201853  
9335.216553  
9338.886328  
9343.03146  
9347.415445  
9351.758604  
9355.758649  
9359.117273  
9361.5708  
9362.921728  
9363.067254  
9362.020437  
9359.91994  
9357.025287  
9353.696201  
9350.356733  
9347.447283  
9345.369698  
9344.432305  
9344.802493  
9346.473973  
9349.254381  
9352.776585  
9356.53364  
9359.934309  
9362.372884  
9363.30482  
9362.318575  
9359.194131  
9353.940188  
9346.804588  
9338.255794  
9328.937087  
9319.598581  
9311.015033  
9303.899405  
9298.822865  
9296.150957  
9296.004028  
9298.246825  
9302.508478  
9308.230409  
9314.735823  
9321.311969  
9327.29444  
9332.142731  
9335.497413  
9337.211987  
9337.355908  
9336.189377  
9334.114491  
9331.610407  
9329.162383  
9327.195042  
9326.019139  
9325.798699  
9326.54205  
9328.116329  
9330.281435  
