-0.1921081307  
-0.6677531945  
-1.122286579  
-1.535840946  
-1.892920948  
-2.183785061  
-2.404996527  
-2.559099817  
-2.653527125  
-2.698943374  
-2.707329299  
-2.69012123  
-2.656691344  
-2.613382673  
-2.563192646  
-2.506081927  
-2.439784249  
-2.360892424  
-2.265996873  
-2.152640645  
-2.019926019  
-1.86870948  
-1.70139009  
-1.521416378  
-1.332659956  
-1.138841917  
-0.9431556444  
-0.748167614  
-0.556003503  
-0.368744472  
-0.1888844926  
-0.01970287006  
0.134599741  
0.2691005526  
0.3786859788  
0.4588671837  
0.5067164283  
0.5217430305  
0.5065188233  
0.4668846091  
0.411651467  
0.3517993626  
0.2992590881  
0.2654494342  
0.259792596  
0.2884183729  
0.3532732471  
0.4517451364  
0.5768680756  
0.7180577972  
0.8622686055  
0.9954086333  
1.103817652  
1.175644003  
1.201969252  
1.177598123  
1.101472633  
0.9767175272  
0.8103633357  
0.6127934943  
0.3969848939  
0.1775804133  
-0.03014922124  
-0.2114211262  
-0.353071728  
-0.4446469394  
-0.4793553951  
-0.4547938181  
-0.3733326468  
-0.2420902683  
-0.07242824769  
0.1210076713  
0.3216558353  
0.5126669151  
0.6786285499  
0.8071713082  
0.8902450823  
0.9249008857  
0.9134543384  
0.8629936194  
0.7842959837  
0.6902842914  
0.5942400563  
0.5080165053  
0.4405179684  
0.3966561743  
0.3769518479  
0.3778208612  
0.3925166319  
0.4125478604  
0.4293511844  
0.4359215008  
0.4281235853  
0.4054344393  
0.3710100959  
0.3310183002  
0.2933892625  
0.2661770988  
0.255854749  
0.2658379195  
0.2955330554  
0.340086061  
0.3908993651  
0.43683676  
0.465920579  
0.4672292705  
0.4326829675  
0.3584225858  
0.2455593749  
0.1001986992  
-0.06725470582  
-0.2433658651  
-0.4133100709  
-0.5626270113  
-0.678834088  
-0.7527132314  
-0.7791301441  
-0.757356489  
-0.6909194522  
-0.5870706184  
-0.4559943093  
-0.3098671503  
-0.1618674612  
-0.02520323319  
0.0878133182  
0.1666226726  
0.2031985408  
0.1927252113  
0.1341319519  
0.03041113827  
-0.1113570489  
-0.280362482  
-0.4628405788  
-0.6432746926  
-0.805954831  
-0.9367423881  
-1.024842571  
-1.064322067  
-1.055134387  
-1.003425165  
-0.9210072315  
-0.8239759267  
-0.7305944009  
-0.658698302  
-0.6229690992  
-0.6324732603  
-0.6888702428  
-0.7856046209  
-0.908263942  
-1.03612722  
-1.144720118  
-1.209041139  
-1.206989602  
-1.122491477  
-0.9478314357  
-0.6848375507  
-0.3447304039  
0.05333507535  
0.4847882875  
0.9228155621  
1.341661122  
1.719555505  
2.040805271  
2.29677962  
2.485708905  
2.611429904  
2.681395779  
2.704378765  
2.688331705  
2.638800798  
2.558176316  
2.445852814  
2.299210752  
2.115152922  
1.891833178  
1.630183184  
1.334899512  
1.014673721  
0.6816003738  
0.3498723482  
0.03399380363  
-0.2531448997  
-0.5019949926  
-0.7075640917  
-0.8699218078  
-0.9939165688  
-1.088169104  
-1.163533333  
-1.231276052  
-1.301278527  
-1.380536721  
-1.472157117  
-1.574990071  
-1.683894249  
-1.790571469  
-1.884792938  
-1.955820596  
-1.993804031  
-1.990945574  
-1.942297163  
-1.846105351  
-1.703708843  
-1.519063444  
-1.298022117  
-1.047525996  
-0.7748771955  
-0.4872054157  
-0.191214729  
0.1067715985  
0.4005509349  
0.6836481414  
0.9489521187  
1.188505604  
1.393582205  
1.555091466  
1.66431209  
1.713876057  
1.698858282  
1.617805838  
1.473517298  
1.273413771  
1.029395593  
0.7571402933  
0.4748854496  
0.201810542  
-0.04379586609  
-0.2463742326  
-0.3946938973  
-0.4830119107  
-0.511621892  
-0.4867068278  
-0.4194871002  
-0.3247630564  
-0.2190056971  
-0.1182490079  
-0.03604392572  
0.01826263845  
0.0406840692  
0.03303346056  
0.002581778407  
-0.03903348564  
-0.07749849645  
-0.09789405332  
-0.08687536505  
-0.03467153719  
0.06337000714  
0.2058807352  
0.3853513463  
0.5887969216  
0.7991348858  
0.9970995998  
1.163452335  
1.281215835  
1.337648218  
1.32572732  
1.244949327  
1.1013727  
0.9068890873  
0.6778394444  
0.4331414157  
0.1921651012  
-0.02737544467  
-0.2112635941  
-0.350140239  
-0.4402250863  
-0.4833274275  
-0.4861613105  
-0.4590859676  
-0.4144318905  
-0.3646629083  
-0.3206148835  
-0.2900584777  
-0.2767751186  
-0.2802643699  
-0.2961157298  
-0.316962572  
-0.3338795046  
-0.3379812822  
-0.321996089  
-0.2815515048  
-0.2159957516  
-0.1286275065  
-0.02630588641  
0.08147074297  
0.183872895  
0.2702163384  
0.3313668856  
0.3608684011  
0.3556214453  
0.3160426869  
0.2457103871  
0.1505947817  
0.03803965597  
-0.08431351311  
-0.2094616716  
-0.331690918  
-0.446854079  
-0.5522799475  
-0.646374378  
-0.7280650059  
-0.7962298652  
-0.8492842225  
-0.8850210011  
-0.9007693768  
-0.8938459503  
-0.8621965321  
-0.8051095037  
-0.7238184066  
-0.6218647511  
-0.5051118704  
-0.3813697925  
-0.2596714802  
-0.1492931168  
-0.0586613598  
0.005679122015  
0.03990401722  
0.04342532702  
0.01903785509  
-0.02731811417  
-0.08711956795  
-0.1500637619  
-0.205008627  
-0.2409527512  
-0.247961951  
-0.2179863093  
-0.1455315635  
-0.02815378785  
0.1332176795  
0.3341500925  
0.5667777778  
0.8200898215  
1.080451693  
1.33237516  
1.559509757  
1.745842669  
1.877004159  
1.94160193  
1.932433385  
1.847442933  
1.690281325  
1.470353632  
1.202291226  
0.9048328689  
0.5991902737  
0.307031279  
0.04828138649  
-0.1609991311  
-0.3103968955  
-0.3963493334  
-0.4225544612  
-0.3995076796  
-0.34315622  
-0.2728247811  
-0.2086339476  
-0.1687691585  
-0.1669593918  
-0.2105194075  
-0.2992644231  
-0.4254453944  
-0.5747574598  
-0.728272802  
-0.8650440541  
-0.965004312  
-1.011753946  
-0.9948325798  
-0.9111611275  
-0.7654498498  
-0.5695382531  
-0.3407607462  
-0.0996074496  
0.1329926993  
0.3383704076  
0.502419465  
0.6172066228  
0.6816795386  
0.7014235353  
0.6875171973  
0.6546949136  
0.6190820024  
0.5958246719  
0.5969500081  
0.6297197889  
0.6956884294  
0.7905805743  
0.9049626434  
1.025618663  
1.137415427  
1.225401177  
1.276841338  
1.282910976  
1.239799497  
1.149074579  
1.017244379  
0.8545930915  
0.6734439886  
0.4861353035  
0.3030180384  
0.13080674  
-0.02842932417  
-0.1774550914  
-0.3231677837  
-0.4751002925  
-0.6433580346  
-0.8363073023  
-1.0584196  
-1.308631868  
-1.579520307  
-1.857470492  
-2.123832146  
-2.356923324  
-2.534588643  
-2.636936095  
-2.648871579  
-2.562061213  
-2.376078841  
-2.098609248  
-1.744716326  
-1.335316877  
-0.8950947953  
-0.4501287808  
-0.02553086939  
0.356656133  
0.6791049757  
0.9302752502  
1.104871357  
1.203705483  
1.233053202  
1.203597878  
1.129101888  
1.024931538  
0.9065663511  
0.7882044362  
0.6815859457  
0.5951076417  
0.5333129164  
0.49679917  
0.4825423349  
0.4846120805  
0.495188585  
0.5057666581  
0.5083873578  
0.4967422572  
0.4669858213  
0.4181531051  
0.3521199619  
0.2731165419  
0.1868734795  
0.09954956518  
0.01661013489  
-0.05815157575  
-0.1232929811  
-0.1799809164  
-0.2317860357  
-0.2840422386  
-0.3428678302  
-0.413994699  
-0.5015925798  
-0.6072556846  
-0.7293108367  
-0.862556564  
-0.9984644854  
-1.125831932  
-1.231804735  
-1.303137475  
-1.327546122  
-1.294990587  
-1.198744288  
-1.036135711  
-0.8088944149  
-0.5230799137  
-0.1886245672  
0.1814439655  
0.5719899806  
0.9668605128  
1.349953313  
1.706168479  
2.022169587  
2.286928473  
2.492044534  
2.631889767  
2.703618193  
2.707104552  
2.644861069  
2.521944835  
2.345852284  
2.12636164  
1.875260835  
1.605904745  
1.332546842  
1.069446942  
0.8297767593  
0.6244280664  
0.4608519348  
0.3421080635  
0.2662921946  
0.2264974521  
0.2114029716  
0.2064897517  
0.1958193275  
0.1641558039  
0.09920771973  
-0.00636462257  
-0.153459955  
-0.3358607019  
-0.5405317956  
-0.7489574282  
-0.9393841055  
-1.089737817  
-1.180812928  
-1.199284265  
-1.140066  
-1.007625223  
-0.815963281  
-0.5872034589  
-0.3488998984  
-0.130418572  
0.04111062307  
0.1446722278  
0.1684794522  
0.1118210803  
-0.01467180523  
-0.1904275655  
-0.3878159201  
-0.5760946586  
-0.7258443043  
-0.8132179488  
-0.8233641161  
-0.7525196943  
-0.6084767498  
-0.4093584103  
-0.1809435672  
0.04705867792  
0.2451909255  
0.3882792601  
0.4587215941  
0.4485986886  
0.3603539509  
0.2060072008  
0.00509140541  
-0.218328807  
-0.4390925131  
-0.6343182761  
-0.7862516271  
-0.8842222094  
-0.9254895156  
-0.9149277511  
-0.8636895067  
-0.7870792316  
-0.7020244362  
-0.6245166148  
-0.5673977105  
-0.5388014629  
-0.5414186685  
-0.5726478982  
-0.6255338635  
-0.6903068333  
-0.7562276738  
-0.8134408412  
-0.8545320484  
-0.875567289  
-0.8764686403  
-0.8607143285  
-0.8344411003  
-0.8051203795  
-0.7800585922  
-0.7649509237  
-0.7627442158  
-0.7729718572  
-0.7916551176  
-0.8117870858  
-0.824302867  
-0.8193980184  
-0.7879789742  
-0.7230460985  
-0.6208105587  
-0.4813900425  
-0.3089944969  
-0.1116010083  
0.09985809257  
0.3126498883  
0.5136048196  
0.6905110187  
0.8333777424  
0.9354211965  
0.9936708188  
1.009157247  
0.9866803281  
0.9342021015  
0.8619665237  
0.7814509943  
0.7042720668  
0.641167342  
0.6011368373  
0.5908207955  
0.6141374728  
0.6721898121  
0.7633881135  
0.8837616767  
1.027365871  
1.186753533  
1.353433255  
1.518309253  
1.672096618  
1.80571991  
1.910739898  
1.979815531  
2.007227459  
1.989429582  
1.925583251  
1.817997017  
1.67236209  
1.497699017  
1.305932035  
1.111070386  
0.9280113588  
0.7710800426  
0.6524470633  
0.5806399247  
0.5593558032  
0.5867896626  
0.6556152977  
0.7536767061  
0.8653512042  
0.9734211584  
1.061214093  
1.114708571  
1.124293547  
1.085916298  
1.001437288  
0.8781368296  
0.7274472565  
0.563113167  
0.3990642514  
0.2473237223  
0.1162878999  
0.00960802853  
-0.07415652082  
-0.141101609  
-0.200826293  
-0.2647864463  
-0.3443816383  
-0.4490826922  
-0.5848415302  
-0.7530061416  
-0.9498672957  
-1.166883453  
-1.391542214  
-1.608733813  
-1.802468441  
-1.957720681  
-2.062193506  
-2.107785611  
-2.091610109  
-2.016439066  
-1.890522814  
-1.726798692  
-1.541564286  
-1.352753546  
-1.177989015  
-1.032637982  
-0.9280677214  
-0.8703233215  
-0.8593806579  
-0.8890857235  
-0.9477995469  
-1.019701316  
-1.086606304  
-1.130082033  
-1.133625833  
-1.084627864  
-0.9758874828  
-0.8065058769  
-0.5820489934  
-0.3139864636  
-0.01849428565  
0.2852159121  
0.5768190018  
0.8368233229  
1.04831779  
1.198356705  
1.278841045  
1.286881448  
1.224638883  
1.098729105  
0.919304771  
0.6989496791  
0.4515206967  
0.1910599229  
-0.06912879034  
-0.3171803202  
-0.543120068  
-0.7390659211  
-0.899231093  
-1.019758901  
-1.098477166  
-1.134620788  
-1.128600002  
-1.08184142  
-0.996750107  
-0.8767773663  
-0.726569658  
-0.5521501534  
-0.3610583516  
-0.1623626521  
0.03352402088  
0.2152871624  
0.3714115292  
0.4911329989  
0.5655199954  
0.5885872983  
0.5582576222  
0.4770184457  
0.3521341675  
0.1953321143  
0.02195003217  
-0.1503868673  
-0.3034082301  
-0.4199755214  
-0.4857688106  
-0.4906824644  
-0.4297637202  
-0.3036077089  
-0.1181747972  
0.1159033892  
0.3844280458  
0.6709967446  
0.9584540026  
1.230293341  
1.471862433  
1.671299919  
1.820139439  
1.913587466  
1.950482965  
1.933006045  
1.866194739  
1.757337222  
1.615323239  
1.449998321  
1.271580042  
1.090156752  
0.9152767258  
0.7556286152  
0.6187985844  
0.5110715808  
0.4372610527  
0.4005519012  
0.4023337151  
0.4420386596  
0.5169856834  
0.6222702543  
0.7507283335  
0.8930240878  
1.037905242  
1.172664978  
1.283817974  
1.357999352  
1.383029453  
1.349078053  
1.249809231  
1.08337859  
0.8531428565  
0.5679393962  
0.2418494852  
-0.106609192  
-0.455838831  
-0.7829658561  
-1.065928699  
-1.285625347  
-1.427872756  
-1.48492328  
-1.456341335  
-1.34910267  
-1.17687757  
-0.9585725029  
-0.7162983459  
-0.4730095431  
-0.2501053188  
-0.06529937442  
0.06901061454  
0.1466646074  
0.167888147  
0.1386791923  
0.06956362149  
-0.02609087133  
-0.1339453516  
-0.2404949208  
-0.3345752758  
-0.408393163  
-0.4579904154  
-0.4831328018  
-0.4866997333  
-0.4737277798  
-0.4502956861  
-0.4224641184  
-0.3954461113  
-0.3731332411  
-0.3580384508  
-0.3516044455  
-0.354771173  
-0.3686190107  
-0.3949011303  
-0.4362812762  
-0.4961653329  
-0.5781110713  
-0.6848754708  
-0.8173016248  
-0.9732483561  
-1.14685233  
-1.328312994  
-1.504353074  
-1.65937321  
-1.777172314  
-1.843015332  
-1.845717326  
-1.779406479  
-1.644643753  
-1.448692263  
-1.20483989  
-0.9308493625  
-0.6467425239  
-0.372254745  
-0.1243194277  
0.08501366678  
0.2499393486  
0.3713284828  
0.4561819984  
0.5162091101  
0.5657574198  
0.6194211679  
0.6896912521  
0.7849930052  
0.9083905856  
1.057124934  
1.223029098  
1.393722982  
1.554380999  
1.689803814  
1.78646962  
1.834278017  
1.827754153  
1.766569289  
1.655345484  
1.502827271  
1.320585837  
1.121482859  
0.9181532291  
0.7217219131  
0.5409387376  
0.3818081027  
0.2477139624  
0.1399354583  
0.05839423984  
0.002443632604  
-0.02850699254  
-0.03466278677  
-0.01588691819  
0.02789124245  
0.09601036108  
0.1863118077  
0.2944751949  
0.4136283872  
0.5343900901  
0.6453843673  
0.734217823  
0.7887956302  
0.7987898473  
0.7570563596  
0.6607721457  
0.5121213884  
0.318413819  
0.09160820723  
-0.1527270705  
-0.3968762414  
-0.6227069032  
-0.8134610594  
-0.9554085603  
-1.039183335  
-1.060656124  
-1.021263733  
-0.9277677362  
-0.7914703897  
-0.6269935415  
-0.4507485733  
-0.2792711475  
-0.1276142997  
-0.007949164018  
0.07146264059  
0.1068542286  
0.0990481275  
0.05309393296  
-0.02248069067  
-0.1166955395  
-0.217296573  
-0.3119634233  
-0.3894306312  
-0.4404493088  
-0.4585070703  
-0.4402869754  
-0.3858270252  
-0.2983997047  
-0.1841083841  
-0.05125410478  
0.09049002806  
0.2310172225  
0.3607494762  
0.4715413766  
0.5574124312  
0.615036655  
0.643920026  
0.6462381435  
0.6263596411  
0.5900943968  
0.5437910994  
0.4933808004  
0.4435233063  
0.396974886  
0.3542614856  
0.3137186048  
0.2718884751  
0.2242127326  
0.165919665  
0.0929783098  
0.002963040755  
-0.1042782599  
-0.226272766  
-0.3579271697  
-0.4918966445  
-0.6192626155  
-0.7304293313  
-0.8161203779  
-0.8683401647  
-0.8811913554  
-0.851449261  
-0.778848566  
-0.666074152  
-0.5184784511  
-0.3436026685  
-0.1505603719  
0.05062557267  
0.2496560242  
0.4365323703  
0.6020256792  
0.7380499398  
0.8379590707  
0.8967797925  
0.9114280128  
0.8809111232  
0.8065269775  
0.6920350222  
0.5437631486  
0.3705882271  
0.183739769  
-0.003637203818  
-0.1771751554  
-0.3222381363  
-0.4250849246  
-0.4741516606  
-0.4613185131  
-0.3830267596  
-0.2410787408  
-0.04300267024  
0.1981158419  
0.4643556486  
0.734209409  
0.9842544669  
1.191098186  
1.333404355  
1.393811794  
1.360554753  
1.228642176  
1.000474651  
0.6858768403  
0.301520076  
-0.1301951706  
-0.5827049575  
-1.027181112  
-1.434620216  
-1.777981307  
-2.034204172  
-2.18597875  
-2.223106188  
-2.143343572  
-1.952625115  
-1.664605025  
-1.299531295  
-0.8825046622  
-0.4412704256  
-0.003754760645  
