0.1444107658  
1.058398805  
1.923048313  
2.694874947  
3.338493991  
3.829381668  
4.155471016  
4.317415415  
4.327591592  
4.208021363  
3.987529523  
3.698507218  
3.373665698  
3.043123856  
2.732094904  
2.459338636  
2.236428171  
2.067800483  
1.951453792  
1.880134847  
1.842817512  
1.826284217  
1.816665095  
1.80080793  
1.76740783  
1.707866613  
1.616848982  
1.492558393  
1.336721913  
1.154306484  
0.952970715  
0.7422849629  
0.5327649184  
0.334796328  
0.1575539087  
0.008040538763  
-0.1096119657  
-0.1944812884  
-0.2487470214  
-0.2771357574  
-0.2859716569  
-0.2819866868  
-0.2710673287  
-0.2571614762  
-0.2415504139  
-0.2226443594  
-0.1963638281  
-0.1570874132  
-0.09902134411  
-0.01777470416  
0.08813931023  
0.2161427535  
0.3590258769  
0.5051091187  
0.6391855259  
0.7441398714  
0.803051472  
0.8014888942  
0.7296704182  
0.5841708482  
0.3689284018  
0.09538543152  
-0.2182707393  
-0.5486676719  
-0.869439054  
-1.153751982  
-1.376906559  
-1.518689831  
-1.565271716  
-1.510467318  
-1.356293431  
-1.112815338  
-0.7973581855  
-0.4331965153  
-0.04784717821  
0.3288802466  
0.6669635081  
0.938260934  
1.118503435  
1.189103272  
1.138668258  
0.9641067331  
0.6712182835  
0.2746603685  
-0.2027896027  
-0.7316975335  
-1.278119028  
-1.806295526  
-2.281686751  
-2.674043513  
-2.960193044  
-3.126199587  
-3.168622739  
-3.09466921  
-2.921192132  
-2.67261956  
-2.378036006  
-2.067781423  
-1.769990209  
-1.507499797  
-1.295530283  
-1.140415519  
-1.039528348  
-0.9823830998  
-0.9527130287  
-0.9312234596  
-0.8986038443  
-0.8383818289  
-0.7392197168  
-0.5963602964  
-0.4120512728  
-0.1949427184  
0.04140939122  
0.2806696297  
0.506139645  
0.7030931318  
0.860685532  
0.9731869369  
1.040381051  
1.067123244  
1.062171004  
1.036515282  
1.001488841  
0.9669775301  
0.9399936522  
0.923835628  
0.9179197912  
0.9182784099  
0.9185961415  
0.9115963242  
0.8905087437  
0.8503968062  
0.7891163703  
0.7077868748  
0.610717089  
0.5048271392  
0.3986763814  
0.3012637062  
0.2207796137  
0.163480332  
0.1328426129  
0.1290833993  
0.1491064294  
0.1868672438  
0.234116172  
0.2814174534  
0.3193475367  
0.3397268772  
0.3367384907  
0.3078022704  
0.2540683856  
0.1804386009  
0.09506977747  
0.008375922879  
-0.06839578425  
-0.1248451406  
-0.1531470609  
-0.1495741182  
-0.1155575495  
-0.05806160299  
0.01085992378  
0.07535283429  
0.1178028357  
0.1213744017  
0.07271300051  
-0.03560415656  
-0.2032667622  
-0.4214355643  
-0.6731359998  
-0.9348956109  
-1.179428502  
-1.37904042  
-1.509260417  
-1.552153048  
-1.498817286  
-1.350662445  
-1.119262574  
-0.8248024672  
-0.4933535566  
-0.1534051758  
0.167811616  
0.4476521573  
0.6705348791  
0.8292495957  
0.9249432332  
0.9658754292  
0.9652329042  
0.9384129514  
0.9002686915  
0.8627815109  
0.8335136643  
0.8150488383  
0.8054256649  
0.7994063699  
0.7902731918  
0.7717738479  
0.7398177595  
0.6936086953  
0.6360118111  
0.5730987057  
0.512987626  
0.464209993  
0.4339362858  
0.4263944082  
0.4417996097  
0.4759959075  
0.5209002165  
0.5656732159  
0.5984357698  
0.6082250178  
0.5868688225  
0.5304423678  
0.4400614109  
0.3218607005  
0.1861504777  
0.04586560433  
-0.08542758616  
-0.1956843391  
-0.276321238  
-0.3236558412  
-0.339589654  
-0.3314436599  
-0.3109401416  
-0.2924918744  
-0.2910555202  
-0.3198593934  
-0.3883601869  
-0.5007135395  
-0.654991467  
-0.8432361801  
-1.052339351  
-1.265594921  
-1.4646969  
-1.63189329  
-1.752001273  
-1.81403643  
-1.812274704  
-1.746659033  
-1.622571877  
-1.450061199  
-1.242679109  
-1.016118732  
-0.786805752  
-0.5706089787  
-0.3817361335  
-0.2318727483  
-0.1295478909  
-0.07970804928  
-0.0834600781  
-0.1379726249  
-0.2365416916  
-0.3688513955  
-0.5214742424  
-0.6786657944  
-0.8234503253  
-0.938981272  
-1.010080779  
-1.024811  
-0.9758984434  
-0.8617940858  
-0.6871983271  
-0.4629141264  
-0.2049700697  
0.06691807406  
0.3314043306  
0.5678450929  
0.7586121706  
0.8910823258  
0.9590265027  
0.9632129435  
0.911136889  
0.8159172535  
0.6945088465  
0.5654980554  
0.446761562  
0.3533281106  
0.2956889958  
0.278777364  
0.3017052661  
0.3582355795  
0.4378972289  
0.527540061  
0.6131109145  
0.6814067871  
0.7216071458  
0.7264163825  
0.6927345722  
0.6218220247  
0.519004027  
0.3929826203  
0.2548759992  
0.1170856262  
-0.007880215766  
-0.1085532169  
-0.1755219886  
-0.2022785388  
-0.1858308804  
-0.1270570977  
-0.03075306024  
0.09463807013  
0.2376204118  
0.3845593158  
0.5208538731  
0.6322953704  
0.7064755861  
0.73410841  
0.7100844468  
0.6341291827  
0.5109276566  
0.3496891491  
0.1631492179  
-0.03385385511  
-0.2260790014  
-0.3996095488  
-0.5433852755  
-0.6503205679  
-0.7178563322  
-0.7478952594  
-0.7461348111  
-0.7209468815  
-0.6819842914  
-0.6387440905  
-0.5993041171  
-0.5694206573  
-0.5520624112  
-0.5474254077  
-0.5533459268  
-0.5659970711  
-0.5807149338  
-0.5927971605  
-0.5981592983  
-0.5937712561  
-0.5778628062  
-0.549932635  
-0.5106185582  
-0.4615091285  
-0.4049529712  
-0.3438932413  
-0.2817188895  
-0.2221047642  
-0.168788522  
-0.1252443216  
-0.09424382893  
-0.07733318666  
-0.07430410145  
-0.08276110694  
-0.09791535998  
-0.1127006355  
-0.1182919763  
-0.1050095176  
-0.06353342273  
0.01371268556  
0.1312213913  
0.2893301761  
0.4835925888  
0.7047763894  
0.9395160277  
1.171580754  
1.383615413  
1.55912261  
1.684406085  
1.750198612  
1.752730572  
1.694072286  
1.58170223  
1.427352963  
1.245302436  
1.050366605  
0.8558863584  
0.6720000365  
0.5044569294  
0.3541329491  
0.2173071435  
0.08663641744  
-0.04732489152  
-0.1943007931  
-0.3624330406  
-0.5566545664  
-0.7775144537  
-1.020602503  
-1.276642933  
-1.532214617  
-1.771001193  
-1.975418882  
-2.128415491  
-2.215258893  
-2.225130656  
-2.152374943  
-1.99729311  
-1.766418351  
-1.472238522  
-1.132396722  
-0.7684183071  
-0.4040595455  
-0.06341845553  
0.2310624257  
0.460500199  
0.6112232825  
0.67599595  
0.6546773028  
0.5542295618  
0.3880322725  
0.1745680528  
-0.06442015625  
-0.3061100255  
-0.5288842024  
-0.7144737029  
-0.8497012493  
-0.927639874  
-0.9480349205  
-0.9169454232  
-0.8456649952  
-0.7490405188  
-0.6434333155  
-0.5445620268  
-0.465512682  
-0.4151736466  
-0.3972838318  
-0.4101992773  
-0.4474131166  
-0.4987171003  
-0.551845828  
-0.5943584217  
-0.6154771083  
-0.607645783  
-0.5675472717  
-0.4964724892  
-0.3999707379  
-0.2868589504  
-0.1677330988  
-0.05322793515  
0.04771362969  
0.1292704867  
0.189661555  
0.2313916819  
0.2607788481  
0.2868363838  
0.3196810273  
0.3687115346  
0.440870514  
0.5392450888  
0.6622663014  
0.8036483159  
0.9530847126  
1.097635392  
1.223591197  
1.318553631  
1.373407744  
1.383893888  
1.351526884  
1.283694333  
1.192914684  
1.095301356  
1.008448893  
0.9489877159  
0.9301464642  
0.9596393989  
1.038179461  
1.158821862  
1.307281413  
1.463209929  
1.602330451  
1.699203734  
1.730326086  
1.677188614  
1.528943448  
1.284312179  
0.9524936235  
0.552871468  
0.1135232347  
-0.3313831382  
-0.7450314177  
-1.091885884  
-1.341661079  
-1.472850116  
-1.4754081  
-1.352205525  
-1.119091365  
-0.8034844674  
-0.4416498358  
-0.0749377307  
0.2545885504  
0.5086612248  
0.6569223082  
0.680198464  
0.5725486912  
0.341861919  
0.008928675416  
-0.3948939842  
-0.8311858651  
-1.258702136  
-1.637887609  
-1.935136023  
-2.126312049  
-2.199141238  
-2.154206612  
-2.004465422  
-1.773367935  
-1.491842501  
-1.194510189  
-0.9156038707  
-0.6850606581  
-0.5252291305  
-0.4485559243  
-0.4564739602  
-0.5395968111  
-0.6791585482  
-0.8495187621  
-1.021426068  
-1.165677411  
-1.256729861  
-1.275868469  
-1.213543241  
-1.070599298  
-0.8582308416  
-0.5966537551  
-0.3126369126  
-0.03618729724  
0.2031978151  
0.3802384826  
0.4770367745  
0.4852933783  
0.4072536416  
0.255270026  
0.05002833444  
-0.1822803723  
-0.4134531508  
-0.6169230848  
-0.7710291941  
-0.8614705516  
-0.8825987971  
-0.8374173338  
-0.7363396334  
-0.5949463476  
-0.4311244755  
-0.2620608696  
-0.101552011  
0.04197263926  
0.1664217524  
0.2759241493  
0.379652969  
0.4898289035  
0.6192235485  
0.7785409707  
0.9740922206  
1.206070099  
1.467685664  
1.745269256  
2.019322845  
2.266394049  
2.461531  
2.581030833  
2.605152984  
2.520495907  
2.32175681  
2.01270552  
1.60623233  
1.123500511  
0.592264439  
0.04454602024  
-0.4860898278  
-0.9673918734  
-1.371115121  
-1.675287223  
-1.865850475  
-1.937544359  
-1.893985902  
-1.746979144  
-1.515186765  
-1.222307299  
-0.8949692086  
-0.5605367469  
-0.2450080021  
0.02884364642  
0.2429701563  
0.3851213127  
0.4494549834  
0.4366625372  
0.3536292931  
0.2126738023  
0.03039685223  
-0.1737715364  
-0.3792169863  
-0.5658769352  
-0.7159044375  
-0.8151171734  
-0.8540960817  
-0.8288143337  
-0.7407521825  
-0.5964712089  
-0.4067467679  
-0.1853442738  
0.05235806255  
0.2907578552  
0.5152475608  
0.7131412526  
0.8742580313  
0.9911592546  
1.059087991  
1.075735934  
1.040928619  
0.9563568699  
0.825403776  
0.6531159383  
0.4462615785  
0.2134379623  
-0.03489542444  
-0.2865374578  
-0.5279097666  
-0.7446973694  
-0.9227557492  
-1.049222606  
-1.11372013  
-1.109504814  
-1.034424999  
-0.8915214854  
-0.6891826733  
-0.4407834941  
-0.1637930813  
0.1215664742  
0.3940258164  
0.633154455  
0.8212546441  
0.9450461963  
0.9969724665  
0.9759553676  
0.8875192996  
0.743225257  
0.5594786541  
0.3558060983  
0.1527982243  
-0.03007563729  
-0.1765098873  
-0.2750376577  
-0.3201259392  
-0.312557035  
-0.2590575528  
-0.1712201848  
-0.06387621984  
0.04686533313  
0.1456398308  
0.2196274323  
0.2599140749  
0.2622198252  
0.2269554049  
0.1586131149  
0.06464819622  
-0.04595273714  
-0.1641698744  
-0.282278301  
-0.394800971  
-0.4989677231  
-0.594653257  
-0.683836786  
-0.7697152522  
-0.8556622891  
-0.9441854674  
-1.036095984  
-1.129974099  
-1.222019418  
-1.306283691  
-1.37521695  
-1.420457991  
-1.433730511  
-1.407763063  
-1.337110519  
-1.218833239  
-1.052987076  
-0.8429074836  
-0.595301833  
-0.3201424269  
-0.03037152895  
0.2585898504  
0.5295514128  
0.7644900837  
0.9457054272  
1.057186532  
1.08609128  
1.024244155  
0.8694694206  
0.6265953126  
0.307912359  
-0.06705527752  
-0.4725745928  
-0.8785226641  
-1.252894669  
-1.564781319  
-1.787501747  
-1.901513973  
-1.89672695  
-1.773872091  
-1.544704664  
-1.230939982  
-0.8620118174  
-0.4718957003  
-0.09535701613  
0.2358739885  
0.4965586249  
0.6705727302  
0.7523959721  
0.7472919848  
0.6701983367  
0.5435051201  
0.3940491382  
0.2497245384  
0.1361564794  
0.07382825418  
0.07598544981  
0.1475127079  
0.2848359527  
0.4767766712  
0.7061875078  
0.9521001525  
1.192110008  
1.404721977  
1.571410525  
1.678233038  
1.716892596  
1.68520757  
1.587026645  
1.431644347  
1.232813886  
1.007457946  
0.7741781982  
0.5516792198  
0.3571964617  
0.2050404731  
0.1053636273  
0.06323894226  
0.07814967707  
0.143957838  
0.2493823708  
0.3789717744  
0.5145274705  
0.6368387029  
0.7275833074  
0.7711948567  
0.7564922778  
0.6778944107  
0.5360638539  
0.3379081826  
0.09593163648  
-0.1729860083  
-0.4492424399  
-0.7123906773  
-0.9430462938  
-1.124594599  
-1.244542641  
-1.295397493  
-1.275028672  
-1.1865398  
-1.037725094  
-0.8402269714  
-0.6085108027  
-0.3587809597  
-0.1078948701  
0.1276454971  
0.332631107  
0.4940127215  
0.6016825283  
0.6491979152  
0.6343561765  
0.5596049325  
0.4321486034  
0.2636821694  
0.06966521587  
-0.1318901617  
-0.3220618973  
-0.4829653326  
-0.5997907827  
-0.6626699503  
-0.6680837811  
-0.6195559824  
-0.5274783121  
-0.4079888357  
-0.2810151302  
-0.1677081354  
-0.08759939157  
-0.05590178004  
-0.08135498934  
-0.164952854  
-0.2997729204  
-0.4719407301  
-0.6626024871  
-0.8506067464  
-1.015482629  
-1.140249875  
-1.213624007  
-1.231287087  
-1.196037421  
-1.116819034  
-1.006842506  
-0.8811099097  
-0.7538093378  
-0.6360058898  
-0.5340469491  
-0.4489210134  
-0.3766823307  
-0.3098318429  
-0.2393963059  
-0.1573152048  
-0.05868226313  
0.05656329798  
0.1828440851  
0.3092053653  
0.4206387384  
0.5002673956  
0.5320503363  
0.5035653478  
0.4084023519  
0.2477536545  
0.03091315849  
-0.2254424766  
-0.499097873  
-0.7650194998  
-0.998542761  
-1.178543163  
-1.290094898  
-1.326241685  
-1.288578198  
-1.186606384  
-1.035969538  
-0.8558673759  
-0.6660665905  
-0.4839964139  
-0.3223646501  
-0.187657378  
-0.0797243967  
0.007529699638  
0.08448436262  
0.163481798  
0.2562374405  
0.3713989219  
0.5126459203  
0.6776311862  
0.857912411  
1.039898577  
1.206655597  
1.340314519  
1.424741856  
1.448065632  
1.404733888  
1.296774784  
1.134084002  
0.9336698856  
0.7179087681  
0.512013699  
0.3409923689  
0.2264664084  
0.183739356  
0.2194901952  
0.3304158685  
0.5030483768  
0.7148401016  
0.9364681166  
1.13513817  
1.278554113  
1.339078845  
1.297567438  
1.146355649  
0.8909448673  
0.5500845941  
0.1541348987  
-0.2581784714  
-0.6442592079  
-0.9628553304  
-1.179300766  
-1.270099373  
-1.226192906  
-1.054439209  
-0.7770804979  
-0.4292313677  
-0.05471338475  
0.2992106723  
0.5875304577  
0.7728412425  
0.8297086083  
0.7474948848  
0.5313364595  
0.2012129281  
-0.2107162192  
-0.6641166747  
-1.115272662  
-1.5220573  
-1.848477704  
-2.068263495  
-2.167126262  
-2.143527675  
-2.007947694  
-1.780872782  
-1.489827289  
-1.165883496  
-0.8400929573  
-0.5402443974  
-0.2882734691  
-0.09852619983  
0.02301126981  
0.07856311217  
0.07758360081  
0.03513310813  
-0.03018333634  
-0.0984860193  
-0.1508786989  
-0.1714809662  
-0.1490665122  
-0.07815727119  
0.04052071133  
0.2002496574  
0.3891843776  
0.591766187  
0.7905431285  
0.9681694793  
1.109366865  
1.202594278  
1.2412214  
1.224065108  
1.155223965  
1.04325298  
0.8998112601  
0.7379935619  
0.5705969501  
0.4085857124  
0.2599596614  
0.1291895917  
0.01725635497  
-0.07774557559  
-0.1595857666  
-0.2326491147  
-0.3006989493  
-0.3658621864  
-0.4280153541  
-0.4846544626  
-0.5312713452  
-0.5621552184  
-0.5714734685  
-0.5544592069  
-0.5084922499  
-0.4339107477  
-0.3344133986  
-0.2169910571  
-0.09138870393  
0.03083399933  
0.1375156535  
0.2172235725  
0.2605209543  
0.261023875  
0.2161108587  
0.1272055445  
-0.0003745059668  
-0.1579827525  
-0.3345285633  
-0.5175616882  
-0.6944273021  
-0.8533535551  
-0.9843660601  
-1.079954229  
-1.135448418  
-1.149102741  
-1.121939304  
-1.057376367  
-0.9607316972  
-0.8386464828  
-0.6984936089  
-0.547800746  
-0.3937225223  
-0.2425826678  
-0.09950012828  
0.03188081897  
0.1495248469  
0.2529912414  
0.3432530222  
0.4223453906  
0.4928656227  
0.5573900161  
0.6178651317  
0.6750831068  
0.7283232905  
0.775254644  
0.8121169522  
0.834207921  
0.8365920469  
0.8149356769  
0.7663462472  
0.6900445658  
0.5877707266  
0.4638262238  
0.3247358745  
0.1785683182  
