-0.310878494  
-0.04438227409  
0.2103262294  
0.4411187082  
0.6372481379  
0.7900938806  
0.8937984622  
0.9457191784  
0.946659529  
0.9008216193  
0.8154599224  
0.7002555999  
0.5664418701  
0.4257655449  
0.2893901284  
0.1668508731  
0.06519147149  
-0.01162572953  
-0.06295590656  
-0.09133280016  
-0.101967851  
-0.1019463693  
-0.09922077649  
-0.1015157482  
-0.1152866685  
-0.1448406315  
-0.1917454271  
-0.2545841371  
-0.329100513  
-0.4087394679  
-0.4855083035  
-0.5511044714  
-0.598148673  
-0.6214101806  
-0.6188314141  
-0.5922199924  
-0.5474381033  
-0.4940332776  
-0.4442292914  
-0.4113598253  
-0.4078456807  
-0.442946113  
-0.5205615145  
-0.6374325144  
-0.7820522047  
-0.9345983212  
-1.068050528  
-1.150555252  
-1.148874417  
-1.032620425  
-0.7787677646  
-0.37584796  
0.172804514  
0.8473443872  
1.611654598  
2.415724829  
3.200054234  
3.901656056  
4.460977012  
4.8288505  
4.972537433  
4.879995151  
4.561704281  
4.049741115  
3.394140607  
2.657005827  
1.905155122  
1.20228296  
0.6017266815  
0.1407819118  
-0.1626896561  
-0.3109863246  
-0.3246312732  
-0.238184296  
-0.09447260148  
0.06183256175  
0.1904025382  
0.2603108174  
0.2533721003  
0.1654007062  
0.005391711577  
-0.2070957588  
-0.4458209609  
-0.682338018  
-0.8903659722  
-1.049430027  
-1.14729659  
-1.180975019  
-1.156250266  
-1.085974204  
-0.9874575963  
-0.8794632098  
-0.7792617318  
-0.7001860607  
-0.6500145794  
-0.6303287598  
-0.6368745268  
-0.6607719065  
-0.6903399257  
-0.7132200831  
-0.7184737135  
-0.698378767  
-0.6496699474  
-0.5741170009  
-0.4783786402  
-0.3731908912  
-0.2719925401  
-0.1891998183  
-0.1383044364  
-0.1300560718  
-0.170917968  
-0.262009416  
-0.3986554448  
-0.5706368058  
-0.7631413252  
-0.9583263836  
-1.137353106  
-1.282632482  
-1.380038123  
-1.420766539  
-1.402591519  
-1.330316491  
-1.215304261  
-1.074134517  
-0.9265109703  
-0.7926988333  
-0.6908377264  
-0.6344772962  
-0.6307074854  
-0.6791531328  
-0.7719494261  
-0.8947442371  
-1.028569666  
-1.152302893  
-1.245402898  
-1.290534148  
-1.275710105  
-1.195709275  
-1.052589043  
-0.8552575674  
-0.6182145429  
-0.3596528312  
-0.09921612214  
0.144299531  
0.3549847214  
0.5213766509  
0.6373669338  
0.7024110932  
0.7210714687  
0.7020050518  
0.6565860312  
0.5973480535  
0.5364546172  
0.4843665024  
0.4488353842  
0.4343097865  
0.4417590728  
0.4689196079  
0.5108803153  
0.5609366283  
0.611590007  
0.6555832702  
0.6868541217  
0.7012954093  
0.6972419809  
0.6756165219  
0.6397270275  
0.5947317537  
0.5468533536  
0.5024292608  
0.4669572628  
0.4442414023  
0.4357988908  
0.4405966577  
0.4551726847  
0.4741321321  
0.4909470104  
0.4989460149  
0.4923501825  
0.4672033886  
0.4220525897  
0.3582861316  
0.2800729966  
0.1939041471  
0.1078141244  
0.03036785233  
-0.0304223614  
-0.06812897582  
-0.07872733207  
-0.06111048158  
-0.01721270437  
0.0482635792  
0.1284927778  
0.2154522402  
0.3010173883  
0.3780655025  
0.441433514  
0.4885914498  
0.5199077444  
0.5384500484  
0.5493257918  
0.558637295  
0.572196331  
0.5941928083  
0.6260505021  
0.6656786544  
0.7072979385  
0.7419389476  
0.7585973618  
0.7459230661  
0.6942221293  
0.5974471421  
0.4548599599  
0.2720325247  
0.06095347969  
-0.1608657396  
-0.3722507121  
-0.5509670549  
-0.6767496925  
-0.7342860944  
-0.7157267986  
-0.6222766139  
-0.4646006298  
-0.2618902499  
-0.03968038565  
0.1733269212  
0.3490013431  
0.4635723391  
0.5009128718  
0.4548376852  
0.33008412  
0.1417983809  
-0.08641353301  
-0.3255860456  
-0.5452426478  
-0.7174316352  
-0.8204036207  
-0.8414182671  
-0.7783093044  
-0.6396273508  
-0.4433646534  
-0.214496951  
0.0182947608  
0.2262334542  
0.3838989274  
0.4720528757  
0.4795441526  
0.4040768809  
0.2518855059  
0.03644394477  
-0.2234927373  
-0.5061865506  
-0.7892010887  
-1.051405374  
-1.27449263  
-1.443940974  
-1.549445109  
-1.584926603  
-1.548284125  
-1.441024665  
-1.267926813  
-1.036770635  
-0.7581609021  
-0.4453655955  
-0.1140869061  
0.217964697  
0.531757847  
0.8079485107  
1.028164667  
1.176494697  
1.241013442  
1.215160318  
1.098769752  
0.8985863954  
0.6281271684  
0.3068584268  
-0.04128825207  
-0.3899318228  
-0.7125889747  
-0.9851364665  
-1.188089148  
-1.30847552  
-1.341083391  
-1.288931402  
-1.16290151  
-0.9805619967  
-0.7642762122  
-0.5388019523  
-0.3286346366  
-0.1553547195  
-0.03531705255  
0.02208816976  
0.01536630115  
-0.04907250669  
-0.1578412716  
-0.292349601  
-0.4312108265  
-0.5529891846  
-0.6389296696  
-0.6753289827  
-0.6552168299  
-0.5791355518  
-0.4549075266  
-0.2964193074  
-0.1216134108  
0.05005242765  
0.2002847273  
0.3144312674  
0.3833828077  
0.4046528919  
0.3825014581  
0.327102503  
0.2529020187  
0.176422352  
0.1138506019  
0.07876002038  
0.08029488497  
0.1220612467  
0.201863996  
0.3122817143  
0.441969624  
0.5774481372  
0.7051117726  
0.8131194412  
0.8929264731  
0.9402268467  
0.9552195105  
0.9421947884  
0.9085607926  
0.8634752215  
0.8163302975  
0.7753164436  
0.7462714018  
0.7319664991  
0.7319128126  
0.7426631067  
0.7585582777  
0.7727611965  
0.7784316722  
0.7698386158  
0.7432787503  
0.6976387676  
0.6345642795  
0.5581770588  
0.4744233207  
0.3901296088  
0.311909015  
0.2450854513  
0.1927840745  
0.155340783  
0.1301179506  
0.1117734192  
0.09296145344  
0.06538838612  
0.02108183731  
-0.04629295687  
-0.140251899  
-0.2606264129  
-0.403137032  
-0.559510019  
-0.7181381081  
-0.8652333156  
-0.9863585488  
-1.068144475  
-1.099996418  
-1.07555751  
-0.9937323628  
-0.8591206403  
-0.6817462798  
-0.4761003285  
-0.2595640812  
-0.05038740885  
0.1345409752  
0.2818411412  
0.3834105669  
0.4375528193  
0.4492696529  
0.4296216138  
0.3942102049  
0.360932449  
0.3472992668  
0.3676876527  
0.4309049378  
0.5384468921  
0.6837306585  
0.8524540006  
1.024097836  
1.174384707  
1.278410556  
1.314014597  
1.264939389  
1.123326947  
0.891193872  
0.5806512355  
0.2128128067  
-0.184482603  
-0.5798460323  
-0.9420009888  
-1.243444954  
-1.463625476  
-1.591225018  
-1.625253671  
-1.574831529  
-1.45770175  
-1.297710553  
-1.121589122  
-0.9554838876  
-0.8216935184  
-0.7360243608  
-0.7060916525  
-0.7307563605  
-0.800727292  
-0.900213623  
-1.009376682  
-1.107225341  
-1.174562719  
-1.196600101  
-1.164897129  
-1.078400743  
-0.9434731842  
-0.7729439672  
-0.5843354079  
-0.3975386694  
-0.2322429586  
-0.1054767349  
-0.02956154617  
-0.01073726651  
-0.04858014105  
-0.136285323  
-0.2617136964  
-0.4090579372  
-0.5609007095  
-0.7003866324  
-0.8132765231  
-0.8896117725  
-0.9248307653  
-0.9202000192  
-0.8825356623  
-0.8232292738  
-0.7566969834  
-0.6984277853  
-0.6628391532  
-0.6611911352  
-0.6998160111  
-0.7788822785  
-0.8918705527  
-1.025866704  
-1.162676955  
-1.28066382  
-1.357108241  
-1.370828964  
-1.304720219  
-1.147893814  
-0.8971202343  
-0.5573912062  
-0.1414875434  
0.331357236  
0.8375353659  
1.351587465  
1.848827334  
2.307699986  
2.711594281  
3.049883295  
3.318132742  
3.517515256  
3.653599832  
3.734773854  
3.77055804  
3.770088843  
3.740966873  
3.688587271  
3.615977566  
3.524073378  
3.412299698  
3.279304192  
3.123670633  
2.944506754  
2.741794377  
2.516515564  
2.270566761  
2.006513159  
1.727294389  
1.435921468  
1.135268055  
0.8279716555  
0.516469459  
0.2031722379  
-0.1092738623  
-0.4176657948  
-0.7179300616  
-1.004896518  
-1.272201896  
-1.512412036  
-1.717379359  
-1.878850252  
-1.989286471  
-2.042825938  
-2.036266988  
-1.969939679  
-1.848320299  
-1.680264369  
-1.478757663  
-1.260180371  
-1.043088501  
-0.8466521232  
-0.6888853275  
-0.5848907651  
-0.5453130581  
-0.5751992601  
-0.6734060124  
-0.8326349352  
-1.040079467  
-1.278633157  
-1.52850058  
-1.769051619  
-1.980706251  
-2.146678128  
-2.25440185  
-2.29652415  
-2.271393073  
-2.18301696  
-2.040526875  
-1.857188734  
-1.649093103  
-1.43361396  
-1.227790889  
-1.04677006  
-0.9024422218  
-0.8023968632  
-0.7493208612  
-0.7408700506  
-0.7700720048  
-0.8262059519  
-0.8960729509  
-0.9655386988  
-1.021141964  
-1.051598249  
-1.048999153  
-1.009554096  
-0.9337844139  
-0.826143581  
-0.6941321257  
-0.547038568  
-0.3945082889  
-0.2451552702  
-0.1054287225  
0.02107441597  
0.1337823625  
0.2347603814  
0.3278651584  
0.4175844722  
0.507782943  
0.6005854385  
0.6955972976  
0.7896265756  
0.8769696965  
0.9502347433  
1.001575508  
1.024147666  
1.013536028  
0.9689031234  
0.8936585147  
0.7954933007  
0.685729659  
0.5780538324  
0.4867720376  
0.4248448486  
0.4019663222  
0.4229978934  
0.4869944243  
0.5870156491  
0.7107902902  
0.8421820093  
0.9632956279  
1.056948737  
1.109162075  
1.111324564  
1.061682545  
0.9659257473  
0.8367215562  
0.692217823  
0.5536970487  
0.4426479021  
0.3776818483  
0.3717075738  
0.429787618  
0.5480050117  
0.7135457507  
0.9060299192  
1.099939714  
1.267852883  
1.384044443  
1.427980191  
1.387211553  
1.259278717  
1.052336021  
0.7844163261  
0.481406719  
0.1740197082  
-0.1058693151  
-0.3290105844  
-0.4722196712  
-0.5210232004  
-0.4711941017  
-0.3290038647  
-0.1102140513  
0.1620259437  
0.4600573581  
0.7549485295  
1.019683685  
1.231881032  
1.37575095  
1.443091384  
1.433295216  
1.352445479  
1.211723751  
1.025397567  
0.8087136846  
0.5759763727  
0.3390664417  
0.1065448438  
-0.1166036951  
-0.3286221854  
-0.5301615226  
-0.7231652179  
-0.9096898388  
-1.090848226  
-1.266080024  
-1.432833683  
-1.586720128  
-1.722088222  
-1.832894893  
-1.913707477  
-1.960660396  
-1.972133359  
-1.949068756  
-1.894827511  
-1.814610601  
-1.71456609  
-1.600759434  
-1.478207085  
-1.350194289  
-1.218024086  
-1.081251524  
-0.9383790648  
-0.7878621583  
-0.6292112942  
-0.4639452683  
-0.2961458356  
-0.1324759602  
0.01842534698  
0.1470816833  
0.2446931916  
0.3047422168  
0.324378237  
0.3053234033  
0.254056578  
0.1812152421  
0.1002637529  
0.02562192862  
-0.02944347375  
-0.05481154824  
-0.04504269476  
-0.0001947526161  
0.07423210898  
0.1682097744  
0.2688002886  
0.3622126899  
0.4359434349  
0.4806553764  
0.4914865116  
0.4685924814  
0.4168576334  
0.344851662  
0.2632297707  
0.1828637815  
0.1130310366  
0.05995350507  
0.02592264332  
0.009133246574  
0.004236484316  
0.003486312408  
-0.001730944801  
-0.01923262282  
-0.05453815414  
-0.109764761  
-0.1830884948  
-0.2688559906  
-0.3583071134  
-0.4407991776  
-0.5053223442  
-0.5420810424  
-0.5439046016  
-0.5072810149  
-0.4328800673  
-0.3255113255  
-0.1935459914  
-0.04791223633  
0.09918810508  
0.2356368416  
0.3506690906  
0.4358955384  
0.485977645  
0.4989164339  
0.4759705084  
0.421258512  
0.341136294  
0.2434433655  
0.1367238579  
0.02948534876  
-0.07044458558  
-0.1564187607  
-0.2233320806  
-0.2678151902  
-0.2882942669  
-0.2849078514  
-0.2593191412  
-0.2144303821  
-0.154042828  
-0.08250135103  
-0.00434303099  
0.07600806369  
0.1544770362  
0.2275142099  
0.2921849459  
0.3462395475  
0.3881296158  
0.4170415728  
0.4329226621  
0.436529737  
0.4294486783  
0.414089653  
0.3935962689  
0.3716665539  
0.3522443779  
0.3391349495  
0.3355335525  
0.3435853337  
0.3640037815  
0.3958603178  
0.436578663  
0.4821790731  
0.5277350506  
0.5680099505  
0.5981552719  
0.6143718405  
0.6144109921  
0.5978366149  
0.5659932577  
0.5216845119  
0.4686423068  
0.4108627238  
0.3519559384  
0.2946204439  
0.2403434886  
0.1893659866  
0.1409067919  
0.09358252702  
0.04590875203  
-0.003224556076  
-0.05421990305  
-0.1066586125  
-0.1594109328  
-0.2109612269  
-0.2598270395  
-0.3050026342  
-0.3462665059  
-0.3842970938  
-0.4205417539  
-0.4568531577  
-0.4949702726  
-0.5359524793  
-0.579705367  
-0.6247011042  
-0.6679764068  
-0.7054316111  
-0.7323765392  
-0.7442423626  
-0.7373177883  
-0.7093798026  
-0.6601049322  
-0.59118899  
-0.5061618147  
-0.4099418649  
-0.3082296256  
-0.2068430516  
-0.1111287025  
-0.02553041818  
0.04661977399  
0.1031128748  
0.1427019462  
0.1648681545  
0.1696028125  
0.1572847376  
0.128697692  
0.08517936985  
0.0288621243  
-0.03710553871  
-0.108442068  
-0.1798290023  
-0.2452483616  
-0.2985800541  
-0.3343691749  
-0.3486489408  
-0.3396537663  
-0.3082677868  
-0.2580866709  
-0.1950243591  
-0.1264953498  
-0.06027668878  
-0.003242972182  
0.03981657874  
0.06705579497  
0.07992911472  
0.08294226374  
0.08280428374  
0.08710164435  
0.1027106032  
0.1342296137  
0.1827332795  
0.2451031139  
0.3140926496  
0.3791874203  
0.4281380118  
0.4489531387  
0.4320238823  
0.3720191237  
0.2692126634  
0.1299849907  
-0.03362242759  
-0.2052723541  
-0.3664315259  
-0.4988913894  
-0.5873249686  
-0.6214890442  
-0.5977163022  
-0.5194743048  
-0.3968949083  
-0.2453635405  
-0.08336128599  
0.07008356723  
0.1979820329  
0.287613241  
0.3320871515  
0.3310419998  
0.2903991993  
0.2212322511  
0.1379655675  
0.05615746287  
-0.009793187913  
-0.04869308405  
-0.05407514089  
-0.02500912942  
0.03390747118  
0.1133291547  
0.2005900567  
0.2815659694  
0.3426866345  
0.3728314242  
0.3648218532  
0.3163559174  
0.2302215434  
0.1138416507  
-0.02181290422  
-0.1637214766  
-0.2985175916  
-0.414129609  
-0.501147773  
-0.553712535  
-0.5698586893  
-0.5512933987  
-0.502683584  
-0.4306380741  
-0.3425441492  
-0.2454840386  
-0.1453906999  
-0.04657094335  
0.04837363827  
0.1382680953  
0.2228062753  
0.3018946361  
0.3750344222  
0.4408887696  
0.497135238  
0.5406292792  
0.5678455161  
0.5755061282  
0.5612532393  
0.5242488085  
0.4655517145  
0.3882200279  
0.2970999436  
0.1983406215  
0.09874051479  
0.005011980463  
-0.07688943117  
-0.1422732912  
-0.1880121577  
-0.2125824231  
-0.2159174351  
-0.1991243484  
-0.1641598956  
-0.1135709241  
-0.05035047304  
0.02205420756  
0.0996130422  
0.177524096  
0.2500727698  
0.3106368303  
0.3519388218  
0.3665854791  
0.3478870982  
0.290867583  
0.1933313934  
0.05680945535  
-0.1128289826  
-0.3052541339  
-0.5061740043  
-0.6984833444  
-0.8639890043  
-0.9855462064  
-1.049350375  
-1.047051399  
-0.9773741967  
-0.8469454124  
-0.670119673  
-0.4677221441  
-0.2647894628  
-0.08753781155  
0.04007469794  
0.09972830484  
0.0815735127  
-0.01392086962  
-0.1754261896  
-0.3816680036  
-0.6037147538  
-0.8083656417  
-0.9622022031  
-1.035732593  
-1.00707461  
-0.8646875894  
-0.6088179054  
-0.2515188372  
0.1846762465  
0.6691754055  
1.166479875  
1.639619198  
2.053472753  
2.377643026  
2.58865429  
2.671364035  
2.619597389  
2.436059622  
2.1316674  
1.724413689  
1.237908828  
0.6997044344  
0.1394991436  
-0.4126868061  
-0.9282980907  
-1.381891693  
-1.752572699  
-2.025130852  
-2.190788654  
-2.247521777  
-2.199904945  
-2.058498536  
-1.838830426  
-1.560039478  
-1.243320046  
-0.910281829  
-0.5813721296  
-0.2744830661  
-0.003866827977  
0.2205856843  
0.3936420791  
0.5146040221  
0.5868043031  
0.6167915442  
0.6132996273  
0.5861333923  
0.5450883  
0.4990071025  
0.4550822753  
0.4184500834  
0.3920785236  
0.3769386945  
0.3723842864  
