0.00102650929  
-0.4951279022  
-0.9454283551  
-1.313989729  
-1.574502563  
-1.713063209  
-1.729406426  
-1.636381464  
-1.457774353  
-1.224787588  
-0.9716803212  
-0.7311906579  
-0.5303807563  
-0.3874791743  
-0.3101437132  
-0.2953320448  
-0.3307427783  
-0.3975302704  
-0.473820051  
-0.5384335704  
-0.574227454  
-0.570534634  
-0.524366688  
-0.440253824  
-0.3288433652  
-0.2045677725  
-0.08284946633  
0.02265615542  
0.1022978702  
0.1518016071  
0.1726057122  
0.1711848895  
0.1575576796  
0.1433166183  
0.1395589278  
0.1550897665  
0.1951687458  
0.2609578056  
0.3496635688  
0.4552572437  
0.569552632  
0.6834017061  
0.7877757693  
0.8745818233  
0.9371370018  
0.9703479083  
0.9706739126  
0.9360370514  
0.8657987248  
0.7608985632  
0.6241589407  
0.4606797199  
0.2781883184  
0.08714859453  
-0.09953401201  
-0.2673282615  
-0.401418652  
-0.488474289  
-0.5186113394  
-0.4872552572  
-0.39655704  
-0.2560626013  
-0.08241931582  
0.1019481488  
0.2711099693  
0.3986041717  
0.4607349539  
0.4397616202  
0.3265195515  
0.1221020859  
-0.1616797683  
-0.5031455385  
-0.8728470957  
-1.236667748  
-1.559547164  
-1.809368639  
-1.96051411  
-1.996655084  
-1.912428581  
-1.713816153  
-1.417204476  
-1.047293842  
-0.6341606265  
-0.2098963003  
0.1947295279  
0.5531433503  
0.845049451  
1.057513943  
1.185022181  
1.228627935  
1.194454726  
1.091879861  
0.9317475861  
0.7249264988  
0.4814053978  
0.2100198792  
-0.08124395007  
-0.3845461573  
-0.6913117917  
-0.9914663211  
-1.273006895  
-1.522093997  
-1.723720182  
-1.862906475  
-1.926271094  
-1.903733015  
-1.790085605  
-1.586178367  
-1.29949882  
-0.9440385201  
-0.5394209916  
-0.1093728737  
0.3202848999  
0.7239010894  
1.078262213  
1.364610365  
1.57021439  
1.689326812  
1.723467186  
1.681009603  
1.576140021  
1.427311489  
1.255345216  
1.081383395  
0.9248877754  
0.8018709605  
0.7235435158  
0.6954852516  
0.7174245114  
0.7836277213  
0.8838459506  
1.004698604  
1.131330844  
1.249153359  
1.345455656  
1.410712743  
1.439442846  
1.430518874  
1.386920001  
1.314971849  
1.223191744  
1.120897893  
1.016780345  
0.9176233159  
0.8273488366  
0.7465088997  
0.6722839274  
0.5989706022  
0.5188970541  
0.4236202517  
0.3052465454  
0.1577020414  
-0.02221049667  
-0.234092897  
-0.4736419367  
-0.7327796369  
-1.000177348  
-1.262112341  
-1.503538585  
-1.709268178  
-1.865135687  
-1.959059247  
-1.981927234  
-1.928255907  
-1.79662679  
-1.589883005  
-1.315135473  
-0.9835772736  
-0.61014682  
-0.2130295389  
0.1869981196  
0.5674080901  
0.9049628063  
1.176973591  
1.362752541  
1.445203246  
1.412442307  
1.259292307  
0.9884577132  
0.6111819865  
0.1472127922  
-0.3760407296  
-0.9251821768  
-1.463247272  
-1.952669158  
-2.358505198  
-2.651564559  
-2.811096066  
-2.82670358  
-2.699274407  
-2.440797838  
-2.073104776  
-1.625680069  
-1.132795104  
-0.6302806295  
-0.1522901613  
0.2716192534  
0.6188265549  
0.8751835297  
1.035671601  
1.104141326  
1.092224536  
1.017557476  
0.9015234068  
0.7667414084  
0.6345655797  
0.5228290844  
0.4440524052  
0.404301257  
0.4027904609  
0.4322919742  
0.4802921599  
0.5307803695  
0.5664713437  
0.571202257  
0.5322293698  
0.4421379065  
0.3001279626  
0.1125103675  
-0.107668904  
-0.3418202241  
-0.5677102539  
-0.7618051498  
-0.9018069701  
-0.9690607974  
-0.9505719758  
-0.840404722  
-0.6403341204  
-0.3597131816  
-0.01460701629  
0.3736719346  
0.7804420491  
1.179739639  
1.546409948  
1.858023704  
2.096478846  
2.249196089  
2.309852297  
2.278630635  
2.161998787  
1.972036701  
1.725368713  
1.441753887  
1.14243232  
0.8483318152  
0.5782826081  
0.3473914142  
0.165741149  
0.037565612  
-0.03898352574  
-0.0714222924  
-0.07188606199  
-0.05553981547  
-0.03862360604  
-0.03635269183  
-0.06093346745  
-0.1199477105  
-0.2153148083  
-0.3429749248  
-0.4933402334  
-0.6524616987  
-0.8037712116  
-0.9301669473  
-1.016189558  
-1.049999907  
-1.024923901  
-0.9403656269  
-0.8019901783  
-0.6211587304  
-0.4137032385  
-0.1982040966  
0.006015975285  
0.1809261796  
0.3116054008  
0.3876374327  
0.4039350863  
0.3609169454  
0.2640566058  
0.1228923691  
-0.05033055261  
-0.242205617  
-0.4396683602  
-0.6312693857  
-0.8080740807  
-0.964090898  
-1.096226295  
-1.203813059  
-1.287833209  
-1.349984066  
-1.391759232  
-1.413692785  
-1.414898721  
-1.392976405  
-1.344298867  
-1.264649605  
-1.150096565  
-0.9979912416  
-0.8079094992  
-0.5824038318  
-0.3274072403  
-0.05221691992  
0.2309824198  
0.5080283583  
0.7640280128  
0.9847994106  
1.158338579  
1.276128164  
1.334119137  
1.333255308  
1.279467849  
1.18310526  
1.057863576  
0.9193090941  
0.7831524888  
0.6634643367  
0.5710317537  
0.5120542643  
0.487346896  
0.492164939  
0.5167173177  
0.547330441  
0.5681796149  
0.5633933673  
0.519307966  
0.426584898  
0.2819084513  
0.08902032595  
-0.1411061791  
-0.3910313418  
-0.6385131153  
-0.8589216197  
-1.028108866  
-1.125396777  
-1.13628676  
-1.054519578  
-0.8832085852  
-0.634864792  
-0.3303008973  
0.003458094678  
0.3360023112  
0.6367427783  
0.878112739  
1.038381777  
1.103778996  
1.069715277  
0.9410130515  
0.7311824565  
0.4608755812  
0.1557310242  
-0.1561292269  
-0.4466990999  
-0.6905295019  
-0.8668137195  
-0.9609711407  
-0.9656371881  
-0.8810285404  
-0.7147009306  
-0.4807566463  
-0.198588155  
0.108727602  
0.4162716  
0.6992273479  
0.9348012002  
1.104000224  
1.193141165  
1.194990121  
1.10944191  
0.9436597542  
0.7116419055  
0.4332018408  
0.1324098675  
-0.1644126768  
-0.4309900123  
-0.6434824583  
-0.7827347137  
-0.8361398155  
-0.798893158  
-0.6744735907  
-0.4742649232  
-0.2163331529  
0.07651482204  
0.3791684897  
0.6668634171  
0.9177170456  
1.114845517  
1.24781144  
1.313242519  
1.314580146  
1.261029244  
1.165888346  
1.044517948  
0.9122356766  
0.7824204208  
0.6650595676  
0.565899601  
0.4862395117  
0.4233506985  
0.3713760327  
0.3225426706  
0.2684776358  
0.2014402325  
0.1153200248  
0.006299210187  
-0.1268338467  
-0.2827005989  
-0.4575984325  
-0.6459223669  
-0.8406495903  
-1.033812347  
-1.216921349  
-1.381333921  
-1.518597629  
-1.620800576  
-1.680987689  
-1.693653497  
-1.655308854  
-1.565078263  
-1.425240743  
-1.241603118  
-1.023593952  
-0.7839754767  
-0.5381133504  
-0.3028164365  
-0.09481216345  
0.07098191329  
0.1831905148  
0.2354771614  
0.2275726235  
0.1656531432  
0.06195410971  
-0.06637981182  
-0.1991033111  
-0.315140465  
-0.3950296456  
-0.4232353783  
-0.3900358471  
-0.2927336203  
-0.1360460695  
0.06837177156  
0.3032027383  
0.5473649287  
0.7782999014  
0.9743604652  
1.117027178  
1.19270551  
1.193924815  
1.119836506  
0.9760064659  
0.7735632071  
0.5278505919  
0.256763438  
-0.0210250157  
-0.287748454  
-0.5279698831  
-0.729633223  
-0.8846671751  
-0.9891573097  
-1.0431166  
-1.049963436  
-1.015798559  
-0.9485988498  
-0.8574169301  
-0.7516515305  
-0.6404244742  
-0.532066428  
-0.4337001213  
-0.3509056889  
-0.2874399735  
-0.2450321252  
-0.223255417  
-0.2195123626  
-0.2291785425  
-0.2459247222  
-0.2622357228  
-0.2701000435  
-0.2618225584  
-0.2308763463  
-0.1726771665  
-0.08519339495  
0.03072887854  
0.1713660643  
0.3304773259  
0.4999815485  
0.670869704  
0.8342343543  
0.9822635719  
1.109070949  
1.211230222  
1.28794742  
1.340844083  
1.373393327  
1.390097435  
1.395553755  
1.393553703  
1.386379795  
1.374433343  
1.356265505  
1.329032068  
1.289314939  
1.234173335  
1.162256614  
1.074747847  
0.9759435007  
0.8732952247  
0.77682109  
0.6978892992  
0.6474970104  
0.6342582268  
0.6624200429  
0.7302370404  
0.8290474344  
0.9433062888  
1.051719739  
1.129449506  
1.151189913  
1.094749183  
0.944643648  
0.695167705  
0.3524103624  
-0.06517152131  
-0.5278535267  
-0.997384262  
-1.431109997  
-1.786983684  
-2.028813747  
-2.131038188  
-2.082347853  
-1.887623145  
-1.567875584  
-1.158141837  
-0.703587437  
-0.2542790762  
0.1406898982  
0.4389786083  
0.609941261  
0.6381057865  
0.524768443  
0.2875034706  
-0.04229817916  
-0.4235379148  
-0.8106120628  
-1.15902751  
-1.430722816  
-1.598432701  
-1.64857055  
-1.582323508  
-1.414880515  
-1.172954108  
-0.8909863544  
-0.6065571733  
-0.355627109  
-0.1682067217  
-0.06498708837  
-0.05531793013  
-0.1366973526  
-0.2957788954  
-0.5106614226  
-0.7541000867  
-0.9971733163  
-1.212895044  
-1.379320358  
-1.481776052  
-1.513990271  
-1.478054117  
-1.383323171  
-1.244472451  
-1.079058648  
-0.9049355528  
-0.7379037601  
-0.5898895481  
-0.4678590257  
-0.3735493657  
-0.3039847266  
-0.252618447  
-0.210886803  
-0.1698857689  
-0.1219240736  
-0.06171141178  
0.01296379943  
0.1011316812  
0.1990869484  
0.3012656635  
0.4013946392  
0.4937152441  
0.5740899401  
0.6408313367  
0.6951496176  
0.7411566332  
0.7854466529  
0.8363037889  
0.9026516568  
0.9928567322  
1.113538937  
1.268512777  
1.457982328  
1.678084688  
1.920847706  
2.174576623  
2.424660522  
2.65472575  
2.848036182  
2.989005646  
3.064649883  
3.065827405  
2.988129699  
2.832298188  
2.604138892  
2.313935837  
1.975435793  
1.604540662  
1.217857155  
0.8312780442  
0.4587476077  
0.1113281486  
-0.2033418064  
-0.4811933133  
-0.7214857942  
-0.9262599194  
-1.099568149  
-1.246607321  
-1.37285351  
-1.483304079  
-1.581902414  
-1.671187063  
-1.752180066  
-1.824494743  
-1.886616866  
-1.936293529  
-1.970959058  
-1.988126194  
-1.985689353  
-1.962100604  
-1.91640813  
-1.84817889  
-1.757334506  
-1.643962544  
-1.50816318  
-1.349987566  
-1.169512686  
-0.9670742087  
-0.7436446518  
-0.5013116419  
-0.243789506  
0.02314151119  
0.2913692043  
0.5504643915  
0.7880414553  
0.9905237409  
1.144266217  
1.236980081  
1.259290132  
1.206251266  
1.078586094  
0.8834318485  
0.6344162468  
0.350952596  
0.05675151111  
-0.2223451821  
-0.4609838305  
-0.6370752222  
-0.7343594285  
-0.7444137351  
-0.6678016238  
-0.5141674118  
-0.3012270696  
-0.05274057577  
0.204278724  
0.442777769  
0.638865496  
0.7745996289  
0.8399693131  
0.8338307766  
0.7636766598  
0.6442789107  
0.4954243755  
0.3390528466  
0.1962160117  
0.0842820546  
0.01476487386  
-0.007930125057  
0.01331106631  
0.06917945825  
0.1457137524  
0.2266639416  
0.2960933546  
0.3407937523  
0.3521832821  
0.3273902486  
0.2694080842  
0.18632546  
0.08980007236  
-0.006960520443  
-0.09135305126  
-0.1533312122  
-0.1868408348  
-0.1905355058  
-0.167691221  
-0.1253646751  
-0.07298181213  
-0.02060899594  
0.02279090339  
0.05083635887  
0.06070425907  
0.05349007808  
0.03392082948  
0.009510449541  
-0.01066980333  
-0.01740347025  
-0.002693558163  
0.03910453648  
0.110508056  
0.2105584915  
0.3348790146  
0.4760892178  
0.6244687311  
0.768778504  
0.897147223  
0.9979546172  
1.060669541  
1.076621924  
1.039685649  
0.946859459  
0.7987030833  
0.5995852994  
0.3576850595  
0.08469817288  
-0.2047854921  
-0.4942247025  
-0.7663341844  
-1.004460663  
-1.193990431  
-1.323625227  
-1.386376363  
-1.380159797  
-1.307910991  
-1.177219681  
-0.9995428482  
-0.7890995538  
-0.5616045185  
-0.3329883976  
-0.1182447619  
0.06949078932  
0.2195764453  
0.3242159546  
0.3785526806  
0.3805917573  
0.3310119421  
0.2329436842  
0.0917548486  
-0.08514588609  
-0.2884987028  
-0.5074265889  
-0.729757763  
-0.942485476  
-1.132388777  
-1.286801442  
-1.394487706  
-1.446538626  
-1.437190739  
-1.364449851  
-1.230426568  
-1.041311588  
-0.8069662211  
-0.5401534977  
-0.2554872975  
0.03178964624  
0.3070574478  
0.5574611367  
0.7728223561  
0.946232937  
1.074292365  
1.156990823  
1.197303113  
1.200563728  
1.17373089  
1.124632376  
1.061269081  
0.9912415174  
0.9213096196  
0.8570988418  
0.8029194921  
0.7616872372  
0.7349019579  
0.7226796582  
0.7238214986  
0.7359253038  
0.7555528614  
0.7784555035  
0.7998643957  
0.8148370797  
0.8186347951  
0.8071046629  
0.7770134804  
0.72631424  
0.6543001765  
0.5616385123  
0.4502836523  
0.3232864466  
0.1845411798  
0.03848719745  
-0.1101736071  
-0.2567411253  
-0.3967255614  
-0.5260239542  
-0.6410501707  
-0.7388584352  
-0.817253939  
-0.8749131986  
-0.9114964705  
-0.927743636  
-0.9255163941  
-0.9077579684  
-0.8783399036  
-0.8417887036  
-0.8028894419  
-0.7662039462  
-0.7355601523  
-0.7135751598  
-0.7012997059  
-0.6980357811  
-0.7013877752  
-0.7075471395  
-0.7117859244  
-0.7090973121  
-0.6948847586  
-0.6656032547  
-0.619238446  
-0.5555553559  
-0.4760633508  
-0.3837020312  
-0.2822908152  
-0.1758256216  
-0.06773267469  
0.03980280386  
0.1463115063  
0.2532386429  
0.3638034415  
0.482511706  
0.614361142  
0.7638310066  
0.9337700315  
1.124337438  
1.332155875  
1.549818137  
1.765867078  
1.965319121  
2.130740553  
2.243813162  
2.287265961  
2.246966917  
2.113942135  
1.886050333  
1.569062911  
1.176935962  
0.7311589952  
0.2591675459  
-0.2080710087  
-0.6390430701  
-1.004912026  
-1.282567921  
-1.457099417  
-1.523336412  
-1.486229462  
-1.359987847  
-1.166077675  
-0.9303415548  
-0.6796451766  
-0.438510356  
-0.2262160331  
-0.05476443381  
0.0720089247  
0.1580849669  
0.2137446715  
0.2531484965  
0.29139094  
0.341492901  
0.411791909  
0.5041277817  
0.6131011082  
0.7265184099  
0.8269505007  
0.8941909994  
0.9082330508  
0.8523480558  
0.715811032  
0.4958789273  
0.1987497044  
-0.1606408357  
-0.5599424958  
-0.9716625004  
-1.366066563  
-1.714337622  
-1.991580663  
-2.179323274  
-2.267214027  
-2.253761012  
-2.146063079  
-1.958628267  
-1.711450678  
-1.427621558  
-1.130766313  
-0.8426041886  
-0.5808951255  
-0.357979966  
-0.1800281453  
-0.04705294147  
0.04637328868  
0.1098009054  
0.1551732506  
0.1948957025  
0.2399315212  
0.2981556907  
0.3731544807  
0.4636209783  
0.5634220742  
0.6623381167  
0.7474022595  
0.804678589  
0.8212663306  
0.7872641574  
0.6974376604  
0.5523395102  
0.3587177574  
0.1291207447  
-0.1192610224  
-0.3663737301  
-0.5914626667  
-0.7753130701  
-0.9022561874  
-0.9616640734  
-0.9487558131  
-0.8646195759  
-0.7155258887  
-0.5116876003  
-0.2657283922  
0.008870265089  
0.2990629978  
0.593107176  
0.8808945136  
1.153797134  
1.404166517  
1.624695424  
1.807898839  
1.945919323  
2.030803066  
2.055272837  
2.013898472  
1.90445981  
1.729216103  
1.495784388  
1.217350922  
0.9120594706  
0.6015428737  
0.3087165179  
0.05512909024  
-0.1417796921  
-0.2710566017  
-0.3298714632  
-0.324093478  
-0.2676589964  
-0.1807738591  
-0.08716857777  
-0.01078996966  
0.02758369831  
0.01330086869  
-0.06007855279  
-0.1898899936  
-0.3647955824  
-0.5664653095  
-0.772247026  
-0.9584071094  
-1.10345338  
-1.191042279  
-1.212067969  
-1.165651607  
-1.058940444  
-0.9058075734  
-0.7247033834  
-0.5360042233  
-0.359281424  
-0.2108752782  
-0.1020833797  
-0.03817500966  
-0.01829224045  
-0.03617470625  
-0.08153075028  
-0.1417989859  
-0.2040336072  
