-0.5115790383  
1.108644023  
2.628359826  
3.954337831  
5.015020936  
5.767702118  
6.201740305  
6.337549095  
6.221699557  
5.919071616  
5.503345823  
5.04728459  
4.61417079  
4.251474965  
3.987398152  
3.830422511  
3.771575291  
3.788699929  
3.851854285  
3.92887806  
3.990302483  
4.012976004  
3.982105731  
3.89168487  
3.743557117  
3.545542092  
3.309110172  
3.047091567  
2.77180118  
2.49378505  
2.221276426  
1.96025978  
1.714955334  
1.488502795  
1.283603372  
1.102957735  
0.949402356  
0.8257300364  
0.7342820458  
0.6763986941  
0.651887009  
0.658617149  
0.6923396296  
0.7467684879  
0.8139239721  
0.8846916019  
0.94951673  
0.9991521417  
1.025384634  
1.021652037  
0.983515714  
0.9089605264  
0.7985117657  
0.6551698273  
0.4841953905  
0.2927417162  
0.08937431291  
-0.1165128529  
-0.3153442579  
-0.498052923  
-0.6567523649  
-0.7853605084  
-0.8801006397  
-0.9398391772  
-0.9662110215  
-0.9635079381  
-0.9383243131  
-0.8989900899  
-0.8548359515  
-0.8153600481  
-0.7893812912  
-0.7842602374  
-0.8052737167  
-0.8551817099  
-0.9340519235  
-1.039321419  
-1.166103091  
-1.307681413  
-1.456146126  
-1.603105573  
-1.740404203  
-1.860791351  
-1.958478741  
-2.029562848  
-2.072266231  
-2.087003697  
-2.076252355  
-2.044269578  
-1.996643999  
-1.939753825  
-1.880151885  
-1.823939781  
-1.776183102  
-1.74042253  
-1.718339984  
-1.709593288  
-1.711877483  
-1.72117898  
-1.732242583  
-1.739166955  
-1.736098589  
-1.717916712  
-1.680835284  
-1.622840987  
-1.543892663  
-1.445861961  
-1.332215836  
-1.207487383  
-1.07661183  
-0.9442419782  
-0.8141477973  
-0.6888009295  
-0.5692165394  
-0.4550906991  
-0.3451990482  
-0.2380094839  
-0.1323954652  
-0.02832019163  
0.07263063172  
0.1669834981  
0.2494621222  
0.313447817  
0.3517881934  
0.3578626553  
0.3267752699  
0.2564942552  
0.1487595887  
0.009586456025  
-0.1507746425  
-0.3184702208  
-0.4772692936  
-0.6102667881  
-0.701865396  
-0.7397901968  
-0.7168360091  
-0.6320674057  
-0.4912573206  
-0.3064397115  
-0.09458338286  
0.1244590693  
0.3304639291  
0.5054344719  
0.6359201726  
0.7146811196  
0.7414492438  
0.7226658071  
0.6702415707  
0.5995439329  
0.5269472818  
0.4673353998  
0.4319691751  
0.4270328912  
0.4530830255  
0.5054448318  
0.5754450082  
0.6522416916  
0.7249030863  
0.7843770182  
0.8250048195  
0.8453402053  
0.848155597  
0.83966176  
0.8280983939  
0.821968923  
0.8282383631  
0.8508116801  
0.8895706902  
0.9401313771  
0.9943764929  
1.041679099  
1.070615893  
1.070901914  
1.035213261  
0.9606259237  
0.8494077549  
0.7090499494  
0.5515060795  
0.3917512117  
0.2458591534  
0.128883931  
0.05284276746  
0.02509546656  
0.04733933784  
0.1153699174  
0.2196300295  
0.3464592859  
0.4798711885  
0.6035985973  
0.7031232759  
0.767411917  
0.7901202727  
0.7701205153  
0.7112962777  
0.6216545617  
0.511916706  
0.3937991403  
0.2782591494  
0.1739607271  
0.08618550278  
0.01633158653  
-0.03792583703  
-0.08189401524  
-0.1226478111  
-0.1675766123  
-0.2229247534  
-0.292580366  
-0.3773071413  
-0.474543602  
-0.5788121613  
-0.6826549398  
-0.7779492842  
-0.8573630025  
-0.9157069618  
-0.9509491683  
-0.9646824803  
-0.9619775449  
-0.9506089448  
-0.9397721848  
-0.9385132603  
-0.9540981142  
-0.9906262482  
-1.048111304  
-1.122197981  
-1.204582617  
-1.284092819  
-1.348267733  
-1.385197687  
-1.385355974  
-1.343115342  
-1.257739108  
-1.133668774  
-0.9800729852  
-0.8097253627  
-0.6373721627  
-0.4778439803  
-0.3441757275  
-0.2460284596  
-0.1886041805  
-0.1722048963  
-0.1924637297  
-0.2411824301  
-0.307610781  
-0.3799665106  
-0.4469606662  
-0.4991108705  
-0.5296870979  
-0.5352027453  
-0.5154335824  
-0.4730415519  
-0.4129013301  
-0.3412844154  
-0.2650305248  
-0.19080076  
-0.1245012903  
-0.07086870804  
-0.03322284507  
-0.01332232106  
-0.01130412857  
-0.02566274252  
-0.05327042863  
-0.08947622161  
-0.1283042286  
-0.1628187021  
-0.1856661649  
-0.1897883712  
-0.1692644185  
-0.1201699251  
-0.04132705233  
0.06518962344  
0.1939141787  
0.3363051662  
0.481502297  
0.6174790737  
0.7324401319  
0.8162722361  
0.8618356601  
0.8659011937  
0.8295751876  
0.758138675  
0.6603145144  
0.5470791392  
0.4301754515  
0.3205695249  
0.2270661868  
0.1552917898  
0.1071754138  
0.08099389721  
0.07193411549  
0.07307032593  
0.0765864146  
0.07502413203  
0.06237350141  
0.0348376293  
-0.008828688632  
-0.06742509339  
-0.1378148813  
-0.2156965803  
-0.296502616  
-0.3762352023  
-0.4520922693  
-0.5227811986  
-0.5884651364  
-0.6503873371  
-0.7102379977  
-0.7694184404  
-0.8283481643  
-0.8859557289  
-0.9394799368  
-0.9846263714  
-1.016081634  
-1.02830643  
-1.016486359  
-0.9774687868  
-0.9105290887  
-0.817805369  
-0.7043132241  
-0.5775033847  
-0.4464128343  
-0.3205205925  
-0.2084821265  
-0.1169412655  
-0.04960127687  
-0.006726070525  
0.01485830683  
0.02124006889  
0.02044504209  
0.02116472416  
0.0313675458  
0.05700479461  
0.1010183605  
0.1627969709  
0.2381669635  
0.3199253858  
0.3988374174  
0.4649493474  
0.5090277991  
0.5239115628  
0.5055810867  
0.4537930336  
0.3722090337  
0.2679893534  
0.1509407407  
0.03234065588  
-0.07640004855  
-0.1650414754  
-0.22563311  
-0.2533082059  
-0.2466850665  
-0.2078530226  
-0.1419659608  
-0.05654970464  
0.03941049778  
0.1364490942  
0.2255861792  
0.2991624454  
0.3514976879  
0.3793159187  
0.3819369311  
0.3612413005  
0.3214255314  
0.2685854068  
0.2101686922  
0.1543197037  
0.109163873  
0.08206698379  
0.07891572178  
0.1034677026  
0.1568282594  
0.2371157753  
0.3393707702  
0.4557539008  
0.5760572358  
0.6885087106  
0.7808227809  
0.841414537  
0.8606332468  
0.8318937275  
0.7525470196  
0.6243635401  
0.4535477308  
0.250261658  
0.02766623651  
-0.1993913158  
-0.415902328  
-0.6082525629  
-0.7656026401  
-0.8809060252  
-0.951456409  
-0.9788666628  
-0.9685236991  
-0.9285834351  
-0.8686822777  
-0.7985450876  
-0.726714506  
-0.6595774228  
-0.6008349441  
-0.5514734834  
-0.5102206365  
-0.4743944651  
-0.4409599895  
-0.4076202248  
-0.3736951188  
-0.3406437084  
-0.3120814836  
-0.2932903772  
-0.2902541535  
-0.3084037459  
-0.3512640502  
-0.4192778295  
-0.5090441706  
-0.6131556289  
-0.7207390921  
-0.8186878911  
-0.8934274791  
-0.932983507  
-0.929016431  
-0.8784912228  
-0.7846594146  
-0.6571522658  
-0.5110854269  
-0.3652662308  
-0.2397110169  
-0.1528338509  
-0.1187135801  
-0.1448594221  
-0.2308276567  
-0.3679375724  
-0.5401369979  
-0.7259488434  
-0.9012263219  
-1.042335619  
-1.129320847  
-1.148602197  
-1.094812085  
-0.9715226437  
-0.7907385361  
-0.5712524942  
-0.3360800038  
-0.1093604629  
0.08684519375  
0.2354010983  
0.3261957913  
0.3572147428  
0.3344546205  
0.2707326539  
0.1835932098  
0.09263620062  
0.01668567664  
-0.02879884869  
-0.03369574497  
0.005676431234  
0.08644228162  
0.2000025934  
0.333646109  
0.4726477335  
0.6025116563  
0.7110176185  
0.7897842274  
0.8351335568  
0.8481966707  
0.8342978879  
0.8017640884  
0.7603994026  
0.7198756135  
0.6882928358  
0.6711247999  
0.6706501421  
0.6859329652  
0.7132721532  
0.7470161211  
0.7805607393  
0.8073531402  
0.8217461405  
0.81958516  
0.7984749846  
0.757736008  
0.6981075789  
0.621306386  
0.5295382715  
0.4250793919  
0.3099923325  
0.186023573  
0.05467516173  
-0.08258475307  
-0.224034094  
-0.3674185427  
-0.5097327285  
-0.6471427179  
-0.7750621461  
-0.8883958906  
-0.9819230273  
-1.050780478  
-1.090978833  
-1.099895213  
-1.076675509  
-1.022497839  
-0.9406490438  
-0.8364137571  
-0.7167477675  
-0.5897756116  
-0.4641290257  
-0.3482009878  
-0.2493609894  
-0.1732420969  
-0.1231559886  
-0.09974146053  
-0.1008902144  
-0.1219880814  
-0.1564716104  
-0.1966403901  
-0.2346401916  
-0.2635061308  
-0.2781135118  
-0.2759210412  
-0.2573904109  
-0.2260141105  
-0.1879355739  
-0.1511869012  
-0.1246471204  
-0.1168260901  
-0.1346441779  
-0.1823446564  
-0.2607037403  
-0.3666305746  
-0.4932366538  
-0.630385139  
-0.765669613  
-0.8857290374  
-0.9777472526  
-1.030961777  
-1.037996129  
-0.9958411166  
-0.9063604161  
-0.7762262148  
-0.616286486  
-0.4404367476  
-0.2641193446  
-0.1026415033  
0.03047760064  
0.1249230876  
0.1746008133  
0.1781315692  
0.1387926593  
0.06393739806  
-0.03600209406  
-0.1487764996  
-0.2616855324  
-0.3628694357  
-0.4423962942  
-0.4930376979  
-0.5107030659  
-0.4945166033  
-0.4465883272  
-0.3715438534  
-0.2758832766  
-0.1672679586  
-0.05378696559  
0.05671846513  
0.1572409514  
0.2420579119  
0.3070409744  
0.349805616  
0.3697180887  
0.3677743165  
0.3463686349  
0.3089981049  
0.2599267336  
0.2038377514  
0.1455128395  
0.08954476935  
0.04009177142  
0.0006889222273  
-0.02590945292  
-0.03784054265  
-0.03421452186  
-0.01516178186  
0.01816063322  
0.06360945081  
0.1181527181  
0.1780329161  
0.2389929476  
0.2965518805  
0.3463227251  
0.3843305849  
0.4073058494  
0.4129373548  
0.4000357644  
0.3686270587  
0.3199335617  
0.2562955377  
0.1810136719  
0.09814561793  
0.01228775251  
-0.07165030081  
-0.1486578243  
-0.2138152461  
-0.2624609127  
-0.2903568825  
-0.293845941  
-0.2700282519  
-0.2169720023  
-0.133954213  
-0.02173031402  
0.1171938245  
0.2783409727  
0.4551332881  
0.6389356026  
0.8193130716  
0.9845442955  
1.122377772  
1.220998502  
1.270108124  
1.262006194  
1.192520976  
1.061676511  
0.8739622834  
0.6381533198  
0.3666792259  
0.07458517548  
-0.2217878822  
-0.5062612863  
-0.7642367646  
-0.9839083435  
-1.15714031  
-1.279913733  
-1.35232561  
-1.378157224  
-1.36411873  
-1.318856419  
-1.251884917  
-1.172555498  
-1.089177055  
-1.00837495  
-0.9347136047  
-0.8706004947  
-0.8164444154  
-0.7710157079  
-0.731950107  
-0.6963269305  
-0.661250554  
-0.6243711665  
-0.584297187  
-0.540839173  
-0.4950776031  
-0.4492258493  
-0.4063136501  
-0.3697175384  
-0.3426057897  
-0.3273665992  
-0.3251189264  
-0.3353750159  
-0.3559389547  
-0.3830675263  
-0.4118991775  
-0.4370970338  
-0.4536181863  
-0.457500866  
-0.4465233993  
-0.4206328779  
-0.38204761  
-0.3349904014  
-0.2850918517  
-0.2385278346  
-0.2010263678  
-0.1769028577  
-0.1682881742  
-0.1746750118  
-0.1928883618  
-0.2174828731  
-0.2415269544  
-0.2576700062  
-0.259305375  
-0.2416703634  
-0.2026905711  
-0.1434345733  
-0.06809798358  
0.01649186768  
0.1017752517  
0.1786379034  
0.2386783848  
0.275385962  
0.2850291654  
0.2671488458  
0.2245651554  
0.1629158419  
0.08980573222  
0.01369777156  
-0.05726934609  
-0.1163698448  
-0.1591134708  
-0.1837027122  
-0.191066365  
-0.1844840575  
-0.1688878568  
-0.1499572394  
-0.1331635423  
-0.1229044811  
-0.1218621774  
-0.1306610561  
-0.1478695043  
-0.1703091763  
-0.1936172473  
-0.2129613651  
-0.2237844424  
-0.2224685784  
-0.2068328217  
-0.1763925288  
-0.1323626245  
-0.07741730365  
-0.01525757431  
0.04993686805  
0.1140928687  
0.1737661457  
0.2265239231  
0.2711579414  
0.3076743207  
0.3370908306  
0.3610774934  
0.3815085005  
0.3999926624  
0.4174784601  
0.4339952998  
0.4485726784  
0.4593636629  
0.46394548  
0.4597549495  
0.4445816081  
0.4170391524  
0.3769283161  
0.325424736  
0.2650572015  
0.1994611253  
0.1329533096  
0.06997227071  
0.01448665981  
-0.03054757304  
-0.06358681302  
-0.08469731302  
-0.09550572171  
-0.09891798048  
-0.09863255907  
-0.09852403311  
-0.101976537  
-0.1112700144  
-0.1271052486  
-0.1483440063  
-0.1720124663  
-0.1935870603  
-0.2075436144  
-0.2081120918  
-0.1901551445  
-0.1500607797  
-0.08653177294  
-0.001141330375  
0.1014225332  
0.2135065472  
0.3250526399  
0.4245312213  
0.5001638266  
0.5413018072  
0.5397941334  
0.4911597319  
0.3954096342  
0.2573745518  
0.08648032678  
-0.1040454307  
-0.2984564337  
-0.4801384471  
-0.6334215698  
-0.7453639478  
-0.8072719092  
-0.8157691304  
-0.7732784295  
-0.6878362168  
-0.5722391379  
-0.4426170648  
-0.3165925492  
-0.2112274095  
-0.1410176816  
-0.1161744319  
-0.1414127504  
-0.2153932341  
-0.3309133075  
-0.4758000679  
-0.6344254528  
-0.7896202579  
-0.92476021  
-1.025743976  
-1.082617563  
-1.090635819  
-1.050651468  
-0.9687888722  
-0.8554896098  
-0.7240746787  
-0.5890330506  
-0.4642644374  
-0.3615111102  
-0.2891494748  
-0.2514564657  
-0.2484116709  
-0.2760001445  
-0.3269365491  
-0.3916808832  
-0.4596156288  
-0.5202299284  
-0.5641794382  
-0.5841506927  
-0.5754356954  
-0.5362157905  
-0.4675527166  
-0.3731183511  
-0.2587259343  
-0.1317242047  
-0.0003160269472  
0.1271258878  
0.2426932358  
0.3395064726  
0.4121612139  
0.4570624797  
0.4726282497  
0.4593655707  
0.4198193832  
0.3583679741  
0.2808795692  
0.1942359967  
0.1057188367  
0.02233523799  
-0.04988680375  
-0.1065322303  
-0.1452805898  
-0.1661524145  
-0.1714689135  
-0.1654944378  
-0.1537984956  
-0.1424075798  
-0.13685743  
-0.1412909304  
-0.1577383214  
-0.1857087937  
-0.2221621425  
-0.2618960654  
-0.2982970997  
-0.3243523713  
-0.3337746877  
-0.3220577935  
-0.2873025782  
-0.2306664819  
-0.1563622639  
-0.07119686025  
0.01629952885  
0.09700885658  
0.162472482  
0.2060553879  
0.2238608374  
0.2152504264  
0.1829087144  
0.1324357469  
0.07152602433  
0.008871138021  
-0.04706763861  
-0.08923466853  
-0.1129272156  
-0.1163880973  
-0.1009640434  
-0.07080408273  
-0.03215927238  
0.007612027253  
0.04118329563  
0.06236663183  
0.06703059755  
0.05369735149  
0.02372626315  
-0.01892746193  
-0.06834260592  
-0.1175553779  
-0.1596453753  
-0.1888065688  
-0.2012691018  
-0.1959103603  
-0.1744782352  
-0.1413804888  
-0.1030615586  
-0.06705858354  
-0.04085839591  
-0.03073680836  
-0.04072824287  
-0.07189951697  
-0.122030175  
-0.1857498418  
-0.2551367234  
-0.3206781559  
-0.372483716  
-0.4015812186  
-0.4011137  
-0.3672796805  
-0.2998939324  
-0.2024863818  
-0.08193328524  
0.05233925371  
0.189455128  
0.31836819  
0.4291331639  
0.5140115806  
0.5682800495  
0.5906383257  
0.583175258  
0.5509214664  
0.5010591395  
0.4418938481  
0.3817498987  
0.3279117464  
0.2857641059  
0.2582194859  
0.2454995157  
0.2452720255  
0.2531162609  
0.2632306227  
0.2692877463  
0.2653135739  
0.2464827859  
0.2097300263  
0.1541108609  
0.08087908349  
-0.006711638418  
-0.1038533091  
-0.2047984825  
-0.3035616613  
-0.3946136227  
-0.473475606  
-0.5371498628  
-0.5843293769  
-0.6153846227  
-0.6321460279  
-0.6375302734  
-0.6350709768  
-0.6284455139  
-0.6210537736  
-0.6157086787  
-0.6144808994  
-0.618687765  
-0.6290144217  
-0.645719041  
-0.6688577502  
-0.6984681343  
-0.734649805  
-0.7775179654  
-0.8270059725  
-0.8825669372  
-0.9428196304  
-1.005240936  
-1.065976863  
-1.119881848  
-1.160823606  
-1.182269677  
-1.178110528  
-1.143618886  
-1.076397579  
-0.9771574624  
-0.8501480054  
-0.7031161  
-0.5467115303  
-0.3933504595  
-0.2556253086  
-0.14445189  
-0.06719212503  
-0.02606638664  
-0.01711783654  
-0.02998187156  
-0.04860119448  
-0.05290570314  
-0.02133360238  
0.06607586039  
0.2243969742  
0.4608085393  
0.7723242182  
1.14468657  
1.55270549  
1.962153042  
2.333098589  
2.624324294  
2.798317982  
2.826145028  
2.691515789  
2.39342121  
1.946875424  
1.381589564  
0.7386959797  
0.06595061366  
