25.26849283  
21.83446001  
15.88655612  
8.790370404  
49.38324071  
2154.072503  
3882.185902  
7368.98856  
16246.30958  
65719.33662  
22700.22735  
40431.88867  
19198.47781  
61996.0225  
12212.26069  
2324.718599  
17569.46063  
6758.103801  
4464.896282  
13347.59085  
7826.878288  
10198.588  
21036.67644  
22273.23801  
8341.949299  
3200.432028  
2046.473385  
1026.32238  
1678.439276  
4011.98113  
4916.461083  
23321.30957  
8491.187779  
8408.137669  
7471.098751  
7716.094271  
1958.590657  
3617.008366  
584.0436664  
3194.455939  
591.2542991  
866.3194402  
5516.00462  
2475.431683  
274.5214554  
1648.155384  
391.7069463  
1559.084786  
1514.310889  
1873.400019  
6809.415036  
2231.870699  
192.0671328  
4003.689392  
200.672191  
161.289043  
296.3786701  
2959.095165  
1425.707202  
473.2778946  
2470.833926  
379.1751167  
480.7501998  
10.16292812  
203.8781527  
116.5418802  
100.8461842  
82.94034882  
26.73695149  
8.487320381  
52.94590583  
34.33458527  
21.98377044  
15.86992035  
17.9349834  
23.68746892  
18.94970606  
9.529979576  
7.749798284  
7.620423308  
11.15711957  
9.59704203  
7.090128649  
5.928655449  
7.135325008  
6.521196856  
5.777696728  
5.772681375  
5.005844398  
4.920737093  
4.762294735  
4.240068746  
4.02484599  
3.846067737  
3.621238591  
3.604940876  
3.422139747  
3.262481035  
3.118085095  
2.92983206  
2.781693695  
2.686189624  
2.566058703  
2.455003763  
2.348621553  
2.252816129  
2.162439633  
2.072120406  
1.993735383  
1.918885177  
1.84117611  
1.769899265  
1.703535846  
1.640380391  
1.582176776  
1.525443821  
1.472096572  
1.42012369  
1.370870321  
1.32617995  
1.281061152  
1.238749343  
1.197905533  
1.160252911  
1.122943841  
1.087844681  
1.054033264  
1.021675904  
0.9903254335  
0.9606602149  
0.9324085288  
0.9050349326  
0.8787112795  
0.8535688243  
0.8293790071  
0.806014875  
0.7837590147  
0.7622760655  
0.7416003436  
0.7216389587  
0.7024496018  
0.6840304158  
0.6662294797  
0.6490832026  
0.6325810617  
0.6166076171  
0.601222858  
0.5863717333  
0.572053265  
0.558208432  
0.544824391  
0.5318952196  
0.519409374  
0.507320942  
0.4956343459  
0.4843255768  
0.4733764863  
0.4627726406  
0.452515929  
0.4425826481  
0.4329572341  
0.4236204821  
0.4145771898  
0.4058083017  
0.3972991483  
0.3890516106  
0.381045388  
0.3732734671  
0.365735718  
0.3584091611  
0.351296645  
0.3443831315  
0.3376729454  
0.3311461674  
0.3248052007  
0.3186395304  
0.3126390854  
0.3068068057  
0.3011312016  
0.2956194129  
0.2902418696  
0.2850096264  
0.2799198243  
0.2749574938  
0.2701306909  
0.2654273208  
0.2608411415  
0.2563742466  
0.2520208583  
0.2477803338  
0.2436404513  
0.2395997333  
0.2356681854  
0.2318318996  
0.2280834468  
0.2244317729  
0.2208638353  
0.2173780146  
0.2139842301  
0.2106675158  
0.2074208863  
0.2042555019  
0.20116477  
0.1981450768  
0.1951952031  
0.1923085841  
0.1894911811  
0.1867299875  
0.1840405157  
0.1814036914  
0.1788258597  
0.1763074968  
0.1738411965  
0.1714294519  
0.1690683788  
0.1667595216  
0.1644994517  
0.162288706  
0.1601232176  
0.1580029385  
0.1559261602  
0.1538952646  
0.1519052664  
0.1499581279  
0.1480447794  
0.1461707641  
0.1443393629  
0.1425421767  
0.1407802571  
0.1390531558  
0.1373642602  
0.1357043661  
0.1340778697  
0.1324833121  
0.1309223326  
0.1293843488  
0.1278825365  
0.1264053404  
0.1249566859  
0.123536226  
0.1221420266  
0.1207739021  
0.1194331264  
0.1181142151  
0.1168207099  
0.115550675  
0.1143071778  
0.1130814031  
0.1118806556  
0.1106992635  
0.1095412687  
0.1084012068  
0.1072813423  
0.1061868268  
0.1051060553  
0.1040444415  
0.1030042383  
0.1019796579  
0.1009708664  
0.09998359108  
0.09901174555  
0.09805638232  
0.09711907905  
0.09619510783  
0.09528849481  
0.09439492697  
0.09351500193  
0.09265007425  
0.09180401712  
0.09096948998  
0.09014686759  
0.08934276864  
0.0885479492  
0.08776369618  
0.08699298818  
0.08623793833  
0.08549369047  
0.08475853873  
0.08403777785  
0.08332688862  
0.08262887793  
0.08194363117  
0.08126841275  
0.08059856  
0.0799440683  
0.07929879977  
0.07866328513  
0.07803618672  
0.07741789055  
0.0768116215  
0.0762172556  
0.07562678898  
0.07504384917  
0.07447442653  
0.07391250783  
0.07335727812  
0.07281379797  
0.07227473052  
0.07174603655  
0.07122471562  
0.07070931936  
0.07020246908  
0.06970147994  
0.06920944567  
0.06872532065  
0.06824853893  
0.06777867442  
0.06731286166  
0.06685607636  
0.06640499668  
0.06595980687  
0.06552381863  
0.0650903605  
0.06466751964  
0.06424755714  
0.06383437789  
0.06342497688  
0.06302193087  
0.06262664224  
0.0622328775  
0.06184911343  
0.06147051006  
0.06109647547  
0.06072485661  
0.0603605317  
0.06000188345  
0.05964826138  
0.05929674485  
0.05895478122  
0.05861336508  
0.05827844666  
0.05794716842  
0.05762097818  
0.05729939313  
0.05698298802  
0.05667071052  
0.05636139819  
0.05605550826  
0.05575594795  
0.05546099564  
0.05516767165  
0.05487814977  
0.05459592157  
0.05431359947  
0.05403553885  
0.05376449843  
0.05349339604  
0.05322695484  
0.05296466371  
0.05270621184  
0.05245119092  
0.05219885786  
0.05195211887  
0.05170421744  
0.05146231507  
0.05122496456  
0.0509900924  
0.05075728262  
0.05052719426  
0.05030164814  
0.05007925071  
0.04985824097  
0.04964030831  
0.04942536285  
0.04921352253  
0.04900684649  
0.04880079515  
0.04859699865  
0.04839718515  
0.04819894548  
0.048003757  
0.04781051663  
0.0476223627  
0.04743463122  
0.04724935775  
0.04706826665  
0.04688738104  
0.04671072824  
0.04653610136  
0.04636300549  
0.04619133666  
0.04602504989  
0.04586047113  
0.04569610572  
0.04553580357  
0.04537738912  
0.04522050875  
0.04506499215  
0.04491372914  
0.04476160667  
0.04461534401  
0.04446977146  
0.0443239321  
0.04418211769  
0.04404280559  
0.04390469008  
0.04376995492  
0.04363506665  
0.04350424114  
0.04337326231  
0.04324421899  
0.04311998625  
0.04299560938  
0.04287150851  
0.0427510816  
0.04263159742  
0.04251546655  
0.04239945154  
0.04228527562  
0.04217476641  
0.04206416328  
0.04195473891  
0.04184643147  
0.041741859  
0.04163793669  
0.04153962473  
0.04143657771  
0.04133637139  
0.04124164407  
0.04114516729  
0.04105129819  
0.04095955765  
0.04086816278  
0.04077954354  
0.04069053445  
0.04060457257  
0.04052057945  
0.04043584352  
0.04035668251  
0.04027526447  
0.04019633867  
0.04011819391  
0.0400426807  
0.03996771567  
0.03989399716  
0.0398230166  
0.03975305753  
0.03968451933  
0.0396153386  
0.03955035555  
0.03948469356  
0.03942337641  
0.03935985791  
0.03929748225  
0.03923914063  
0.03918138674  
0.03912497568  
0.03906965274  
0.03901542118  
0.03896131065  
0.03891077613  
0.03885848614  
0.03881141679  
0.03876159341  
0.03871743204  
0.03867082332  
0.03862592278  
0.03858356851  
0.03854269869  
0.03850050865  
0.03846329428  
0.03842364046  
0.03838833275  
0.03835247832  
0.03831791518  
0.03828396988  
0.03825135473  
0.03822291044  
0.03819259178  
0.0381644759  
0.03813814041  
0.03811195643  
0.03808512128  
0.03806179918  
0.03804030992  
0.03801957666  
0.03800016634  
0.03797881052  
0.03796307782  
0.03794594753  
0.03792879821  
0.03791568802  
0.0379026112  
0.03788904622  
0.03787903356  
0.03786965492  
0.03786117893  
0.03785356298  
0.03784700788  
0.03784203109  
0.03783681648  
0.03783459468  
0.03783282731  
0.0378325969  
