-0.4503609344  
-0.8695513551  
-1.274681663  
-1.652013373  
-1.989098187  
-2.275380286  
-2.502739586  
-2.665949693  
-2.763030298  
-2.795464987  
-2.768246428  
-2.689711014  
-2.571126971  
-2.426015919  
-2.269211474  
-2.11569774  
-1.979307301  
-1.871392696  
-1.799620641  
-1.76703099  
-1.771504853  
-1.805743132  
-1.857808911  
-1.912213925  
-1.951467271  
-1.957940867  
-1.915854448  
-1.813159818  
-1.643109039  
-1.405314093  
-1.106158464  
-0.7584943795  
-0.3806368162  
0.005256202385  
0.3752511478  
0.7059355279  
0.976695558  
1.171722302  
1.281521945  
1.30376222  
1.243361842  
1.11181953  
0.9258657088  
0.705608845  
0.4723973626  
0.2466536657  
0.04593263567  
-0.1165778684  
-0.2329601037  
-0.300800253  
-0.3227672591  
-0.3056361856  
-0.2589237688  
-0.1933392187  
-0.1192746802  
-0.04552749106  
0.02159215206  
0.07869030843  
0.1252438615  
0.1631502409  
0.1959855558  
0.2281265713  
0.2638923899  
0.3068366352  
0.3592853518  
0.42215852  
0.4950559854  
0.5765523139  
0.6646021054  
0.7569640299  
0.8515462383  
0.9466207376  
1.040876791  
1.133329073  
1.223124577  
1.309313496  
1.390652214  
1.465493585  
1.53180397  
1.587308353  
1.629743379  
1.657169332  
1.668284192  
1.662672038  
1.640937834  
1.604695511  
1.556399146  
1.499041307  
1.435756817  
1.369393863  
1.302114957  
1.235091414  
1.168336255  
1.100706037  
1.030071245  
0.9536345912  
0.8683579686  
0.7714368335  
0.6607664751  
0.5353386612  
0.3955194849  
0.2431767059  
0.08164171784  
-0.08448932684  
-0.2496950642  
-0.4079665611  
-0.5533013152  
-0.680199044  
-0.7841086367  
-0.861783349  
-0.9115089718  
-0.9331882166  
-0.9282777243  
-0.8995893545  
-0.8509849224  
-0.7869962476  
-0.7124196099  
-0.6319235381  
-0.5497143071  
-0.4692917914  
-0.3933154878  
-0.3235951941  
-0.2611870249  
-0.2065778688  
-0.1599200677  
-0.1212619374  
-0.09073582319  
-0.06865759397  
-0.05550930703  
-0.05180365465  
-0.05784546343  
-0.07343374137  
-0.09756124648  
-0.1281838738  
-0.162120706  
-0.1951362924  
-0.2222283162  
-0.2381126824  
-0.2378603758  
-0.2176173668  
-0.175307737  
-0.1112182406  
-0.0283670207  
0.0674282875  
0.167827371  
0.2625944201  
0.3405393869  
0.390684491  
0.4035324786  
0.3722888227  
0.29387625  
0.1695948475  
0.005312709356  
-0.1888745489  
-0.3995124601  
-0.6111103999  
-0.8077688919  
-0.9749207414  
-1.100955496  
-1.178509398  
-1.205239485  
-1.183968088  
-1.122177114  
-1.030925377  
-0.923350441  
-0.8129779068  
-0.7120844248  
-0.6303464232  
-0.5739502243  
-0.5452578803  
-0.5430340964  
-0.5631440606  
-0.5995622379  
-0.6455091725  
-0.6945122311  
-0.7412327684  
-0.781957815  
-0.8147220135  
-0.8390960719  
-0.855739139  
-0.8658340043  
-0.8705426764  
-0.8705830518  
-0.8660032451  
-0.8561705875  
-0.8399470677  
-0.8159902137  
-0.7830918147  
-0.7404769878  
-0.6879890321  
-0.6261332501  
-0.5559682236  
-0.4788823145  
-0.3963005141  
-0.3093909341  
-0.2188276877  
-0.1246518659  
-0.02626112281  
0.0774813232  
0.1880341798  
0.3069044635  
0.4353509788  
0.5741164898  
0.7232108795  
0.8817790942  
1.048057013  
1.219409196  
1.392443119  
1.563174327  
1.727224963  
1.880037273  
2.017083352  
2.134066931  
2.227109423  
2.29291816  
2.328950451  
2.333563835  
2.306162479  
2.247333235  
2.158959295  
2.044293694  
1.907969883  
1.755921961  
1.595188818  
1.433585636  
1.279239867  
1.140004493  
1.022783941  
0.932834719  
0.8731137698  
0.8437624204  
0.8418150029  
0.8612016704  
0.8930927664  
0.9265890687  
0.949721093  
0.9506699499  
0.9190877016  
0.8473649394  
0.7316867708  
0.5727306327  
0.375893958  
0.1509852633  
-0.08861785564  
-0.3272813219  
-0.5487651063  
-0.7380311771  
-0.8829931284  
-0.9759916395  
-1.014788581  
-1.002933283  
-0.9494201878  
-0.8676492218  
-0.7737904344  
-0.6847451664  
-0.6159564952  
-0.5793538941  
-0.5817153023  
-0.6236763174  
-0.6995403042  
-0.7979357446  
-0.903250318  
-0.9976663686  
-1.06353647  
-1.085787826  
-1.054035414  
-0.9641315176  
-0.8189331106  
-0.6281996597  
-0.4076180102  
-0.1770954031  
0.04147070952  
0.2266546931  
0.3598913121  
0.4274939105  
0.422071031  
0.3431793132  
0.1971654392  
-0.003749259  
-0.2430002207  
-0.5016065481  
-0.760238007  
-1.001172858  
-1.209913575  
-1.376308282  
-1.495081524  
-1.565782372  
-1.592208627  
-1.581447576  
-1.54268308  
-1.485944077  
-1.420940248  
-1.356105139  
-1.297911204  
-1.250488525  
-1.215525246  
-1.192407228  
-1.178535478  
-1.169754949  
-1.160842758  
-1.146006041  
-1.119367389  
-1.075413827  
-1.00940607  
-0.9177346713  
-0.7982148245  
-0.6503054811  
-0.4752324909  
-0.2759984986  
-0.05727116453  
0.1748551284  
0.4132090565  
0.6499785371  
0.8771915585  
1.087201877  
1.27313081  
1.429232827  
1.551158031  
1.636107546  
1.682884773  
1.691863854  
1.664896811  
1.605178728  
1.517088549  
1.406003861  
1.278088559  
1.140037816  
0.9987773923  
0.8611105242  
0.733331478  
0.6208319473  
0.5277501526  
0.4567130483  
0.4087193726  
0.3832086673  
0.3783152628  
0.3912984633  
0.4190819814  
0.4588263497  
0.5084268505  
0.5668421389  
0.6341680726  
0.7114253809  
0.8000642032  
0.9012639599  
1.015132734  
1.139966606  
1.271711828  
1.403769767  
1.527222885  
1.6315027  
1.705436962  
1.738548859  
1.72242394  
1.651941404  
1.526169535  
1.348770862  
1.127833748  
0.8751276177  
0.6048745919  
0.3321968163  
0.07145822148  
-0.1652736526  
-0.3694292383  
-0.5366457267  
-0.6668948756  
-0.7640344842  
-0.8348680223  
-0.8878649748  
-0.9317445052  
-0.9741269265  
-1.020444496  
-1.073256216  
-1.132039978  
-1.193465809  
-1.252077755  
-1.301265469  
-1.334352243  
-1.345650297  
-1.331316441  
-1.289908671  
-1.222584229  
-1.132940687  
-1.026551168  
-0.9102881141  
-0.7915415014  
-0.6774456013  
-0.5742100846  
-0.4866137726  
-0.4176984029  
-0.3686566795  
-0.3388862153  
-0.326166743  
-0.3269139201  
-0.3364710306  
-0.3494105873  
-0.3598347204  
-0.3616813518  
-0.3490419763  
-0.3165078275  
-0.2595443552  
-0.1748931313  
-0.06096809013  
0.08178746654  
0.2506411625  
0.440461074  
0.6438095217  
0.8512677224  
1.052002206  
1.234540811  
1.387697739  
1.501553149  
1.568381457  
1.58341142  
1.545321117  
1.45640148  
1.322358984  
1.151784496  
0.9553465109  
0.7448133863  
0.5320188771  
0.3278840527  
0.1416003276  
-0.01996655268  
-0.1526097074  
-0.2548608409  
-0.327841749  
-0.3749389229  
-0.4013504651  
-0.4135525554  
-0.418725674  
-0.4241566579  
-0.4366403725  
-0.4618886902  
-0.5039700963  
-0.5648135126  
-0.6438249084  
-0.7376787189  
-0.8403500818  
-0.9434390755  
-1.036815902  
-1.109572486  
-1.151218195  
-1.153000396  
-1.10919864  
-1.018207114  
-0.8832314608  
-0.7124523  
-0.5185740885  
-0.3177494249  
-0.1279679627  
0.03292529621  
0.1493500932  
0.2099788356  
0.2093266609  
0.1487190516  
0.0364832737  
-0.1126955111  
-0.2792065531  
-0.4405827908  
-0.5739761887  
-0.6587536007  
-0.6789089219  
-0.6249982966  
-0.4953654511  
-0.2964998807  
-0.0424740752  
0.2464897151  
0.5461705197  
0.830969034  
1.076708233  
1.263278616  
1.376824592  
1.411209742  
1.368582317  
1.258974816  
1.098983798  
0.909691641  
0.7140877904  
0.534314313  
0.3890811732  
0.2915729903  
0.2481082776  
0.2577066398  
0.3125972325  
0.3995729114  
0.5019870911  
0.6021055783  
0.6834851323  
0.7330658527  
0.7427083323  
0.7100036508  
0.6382857253  
0.5358894752  
0.4147968757  
0.2888853528  
0.1720314425  
0.07632098091  
0.0105947362  
-0.0205132861  
-0.01694700203  
0.0169965923  
0.07342291354  
0.1419991864  
0.2113427624  
0.27045028  
0.3099820483  
0.3232482454  
0.3067935928  
0.2605342014  
0.187468187  
0.09303355025  
-0.01576863093  
-0.131346339  
-0.2464469333  
-0.3549264539  
-0.4522719977  
-0.5358414557  
-0.604820353  
-0.6599397372  
-0.7030228535  
-0.7364443581  
-0.7625820775  
-0.7833295772  
-0.7997303161  
-0.8117555023  
-0.8182412307  
-0.8169788188  
-0.8049368622  
-0.7785886378  
-0.7343115046  
-0.6688185027  
-0.5795932074  
-0.4652807086  
-0.326001885  
-0.1635601595  
0.01848954893  
0.214923113  
0.419086075  
0.6232723287  
0.8192166299  
0.9986616232  
1.153947103  
1.278567818  
1.367655551  
1.418330746  
1.429903948  
1.40389727  
1.343891534  
1.255204471  
1.144432048  
1.018892716  
0.8860225034  
0.7527824766  
0.6251349638  
0.5076395349  
0.4032153203  
0.3130879935  
0.2369250603  
0.1731407823  
0.1193169569  
0.07268360424  
0.03058232058  
-0.009157584564  
-0.04798908493  
-0.08659162813  
-0.1250013126  
-0.1628822915  
-0.1998884088  
-0.2360302089  
-0.2719699323  
-0.3091609579  
-0.3497973137  
-0.3965534658  
-0.4521476973  
-0.5187944892  
-0.5976383711  
-0.6882667768  
-0.7884059163  
-0.8938623784  
-0.9987502444  
-1.095990442  
-1.178029264  
-1.23768525  
-1.269008767  
-1.268032417  
-1.233311667  
-1.166168883  
-1.07060999  
-0.9529183976  
-0.820980402  
-0.6834270807  
-0.5487014099  
-0.4241600183  
-0.3153191087  
-0.2253223596  
-0.1546856292  
-0.101340506  
-0.0609633974  
-0.0275536645  
0.00580012911  
0.04604242837  
0.09924571351  
0.1697693088  
0.2595629521  
0.3676991904  
0.4901951351  
0.6201653943  
0.7483266956  
0.863825685  
0.955338608  
1.012337324  
1.026393703  
0.9923593646  
0.9092669569  
0.7808011896  
0.6152454966  
0.424859534  
0.2247315245  
0.03121581111  
-0.1398572458  
-0.2749701031  
-0.3644681614  
-0.4036562609  
-0.3932814369  
-0.3393338955  
-0.252190073  
-0.1452169446  
-0.03303251202  
0.0703371955  
0.1531539521  
0.2072898047  
0.229025821  
0.2192299947  
0.1829416769  
0.1284392873  
0.06595826115  
0.006251710335  
-0.04080331689  
-0.06737617507  
-0.06849544514  
-0.04243930892  
0.009300466166  
0.08241895632  
0.1704609935  
0.2656157874  
0.3595263556  
0.4440073541  
0.5116098405  
0.5560183466  
0.5722970231  
0.5570386815  
0.5084716334  
0.4265801515  
0.3132565224  
0.1724820328  
0.01048585043  
-0.1641880237  
-0.3407909568  
-0.5067306286  
-0.6482327087  
-0.7513027461  
-0.8029305242  
-0.7924368816  
-0.712807984  
-0.5618459797  
-0.3429661023  
-0.06549782205  
0.2555968264  
0.6006120518  
0.9465342559  
1.268901873  
1.543901316  
1.75048144  
1.872260218  
1.899019593  
1.827627737  
1.662301168  
1.414185489  
1.100318194  
0.7420971363  
0.3634253352  
-0.01126259378  
-0.3589024775  
-0.6594513897  
-0.8971546225  
-1.061353815  
-1.146807331  
-1.153565706  
-1.086464398  
-0.9543459975  
-0.7691135174  
-0.5447320027  
-0.2962512507  
-0.03892271391  
0.2125650887  
0.4447199617  
0.6457577836  
0.806010726  
0.9182403219  
0.9778695017  
0.9831239686  
0.9350723963  
0.8375467489  
0.696926732  
0.5217824772  
0.3223837154  
0.1100884557  
-0.1033394084  
-0.3064483517  
-0.4887933705  
-0.6415558437  
-0.7580421314  
-0.8340237165  
-0.8678963568  
-0.8606416291  
-0.8156043765  
-0.7380937956  
-0.6348422761  
-0.5133655493  
-0.3812674383  
-0.2455578725  
-0.1120388181  
0.01517622394  
0.1339512645  
0.2441865708  
0.3476178847  
0.4473671863  
0.5472750547  
0.6510821446  
0.7615574808  
0.8796836442  
1.004015952  
1.130328492  
1.251623547  
1.358546199  
1.440191854  
1.485236475  
1.483273823  
1.426194587  
1.309429271  
1.132877415  
0.9013678044  
0.6245619563  
0.3162592413  
-0.006833976316  
-0.3267536743  
-0.6261497794  
-0.8901518524  
-1.10798637  
-1.274123665  
-1.38879098  
-1.4577601  
-1.491416599  
-1.503214664  
-1.507707368  
-1.518406137  
-1.545761801  
-1.595544384  
-1.667863023  
-1.756984228  
-1.85199461  
-1.938253568  
-1.999448973  
-2.019987429  
-1.987394124  
-1.894376864  
-1.740245903  
-1.531473398  
-1.281276905  
-1.008263375  
-0.734292232  
-0.4818409518  
-0.2712267759  
-0.1180597359  
-0.03128163785  
-0.01205019349  
-0.05362331466  
-0.1422402219  
-0.2588735475  
-0.3815965337  
-0.4882383881  
-0.5589703693  
-0.5784920449  
-0.5375588917  
-0.4336999051  
-0.2710976654  
-0.05971188647  
0.1861612394  
0.4496625777  
0.7132104808  
0.9601788854  
1.176238966  
1.350262199  
1.47476957  
1.545984963  
1.563584542  
1.530273926  
1.451292185  
1.333932908  
1.18711164  
1.020971589  
0.8464929517  
0.6750392156  
0.5177993937  
0.3851062043  
0.285643618  
0.2256232221  
0.2080348693  
0.2320989527  
0.2930610549  
0.3824208442  
0.488650631  
0.5983697651  
0.697882985  
0.7748963658  
0.820198903  
0.8290583987  
0.8021120498  
0.7455844278  
0.6707465748  
0.5926434344  
0.5282188182  
0.4940656738  
0.504092029  
0.5674258064  
0.6868554271  
0.858049704  
1.069690047  
1.304535094  
1.541302509  
1.757138068  
1.930351727  
2.043059844  
2.083372635  
2.046827356  
1.936868049  
1.764304898  
1.545832186  
1.301817798  
1.053677733  
0.8212168273  
0.6203024454  
0.4611929789  
0.3477325339  
0.2774826305  
0.2427282645  
0.2321446683  
0.2328392938  
0.2324215863  
0.2207756729  
0.1912839044  
0.1413417042  
0.07215125495  
-0.01210670189  
-0.1055184465  
-0.2018394518  
-0.2957868991  
-0.3839973004  
-0.4655098176  
-0.5417259347  
-0.6159097612  
-0.6923613028  
-0.7754461613  
-0.8686674607  
-0.9739477725  
-1.091213093  
-1.218327682  
-1.351340262  
-1.484968761  
-1.613214297  
-1.729991746  
-1.82968135  
-1.907537537  
-1.959924637  
-1.984382626  
-1.979557371  
-1.945039075  
-1.881165214  
-1.788832122  
-1.669359556  
-1.524425312  
-1.356085148  
-1.166863046  
-0.9598955877  
-0.7390906698  
-0.5092654494  
-0.2762141775  
-0.04667416816  
0.1718464336  
0.3713766679  
0.5439285016  
0.6820310673  
0.7793109348  
0.8310423761  
0.8346038131  
0.789773364  
0.6988190125  
0.5663755487  
0.3991037446  
0.2051886885  
-0.006271544319  
-0.2259025315  
-0.4446500083  
-0.6542597054  
-0.8476115075  
-1.018879768  
-1.163544759  
-1.278287751  
-1.360830685  
-1.409775492  
-1.424499791  
-1.40513368  
-1.35262368  
-1.268853317  
-1.156768571  
-1.020441758  
-0.8650100913  
-0.6964497167  
-0.5211652007  
-0.3454328108  
-0.1747592444  
-0.01325620841  
0.1368562149  
0.2755183411  
0.4047959867  
0.528515757  
0.6515998894  
0.77918693  
0.9156628901  
1.063758913  
1.223862543  
1.393665852  
1.568224376  
1.740431773  
1.901852026  
2.043787336  
2.158422035  
2.239864994  
2.284927933  
2.293515619  
2.268567771  
2.215555921  
2.141621089  
2.054478552  
1.961268277  
1.867523567  
1.776421868  
1.688428138  
1.601380841  
1.511006282  
1.411763414  
1.297895822  
1.164511648  
1.00852883  
0.8293414612  
0.6291082653  
0.4126318026  
0.1868509982  
-0.03996195104  
-0.2591745091  
-0.4627904248  
-0.6443243856  
-0.7994419978  
-0.9262811244  
-1.025440011  
-1.099652747  
-1.153217919  
-1.191281695  
-1.219083368  
-1.241259106  
-1.261292737  
-1.281164212  
-1.301215211  
-1.320226311  
-1.33567194  
-1.344105326  
-1.341622705  
-1.324350799  
-1.288909131  
-1.232813588  
-1.154781185  
-1.0549223  
-0.9347992358  
-0.7973529849  
-0.6466961687  
-0.4878003705  
-0.326098033  
