0.5925891014  
3.107436075  
12.87977854  
47.14880965  
245.549729  
8338.766034  
4722.070263  
31758.69347  
3564.940004  
4493.390559  
8109.4346  
15659.73216  
23589.01827  
21322.51508  
9918.342128  
369.3825622  
30853.77939  
2285.184273  
4931.726153  
817.604432  
1007.592587  
16434.78662  
19642.48988  
2092.568762  
1902.227376  
16043.30346  
8135.531981  
42182.3879  
1314.829555  
13285.3337  
5538.51895  
3837.153761  
5609.004442  
370.1689325  
2102.221522  
794.0718578  
3691.051136  
6112.859737  
6975.255603  
10086.93589  
8664.202157  
1842.873545  
16018.90664  
3267.154604  
8266.93865  
8952.066675  
2624.781205  
20796.77139  
2383.788722  
4874.161959  
5233.164422  
6425.152272  
7127.421033  
4012.791658  
19978.367  
9506.52969  
5027.530968  
536.0520925  
5681.105908  
2024.480148  
2151.221378  
1359.40596  
439.4320163  
0.9602654691  
273.9090502  
546.4857902  
133.8998533  
684.7431286  
129.7247116  
161.1401551  
2.479698914  
33.72431176  
32.00577214  
37.06424369  
14.74091764  
20.25758184  
10.2059934  
6.203771636  
12.10470451  
5.400658186  
5.462475334  
2.677412297  
4.344157837  
4.310966927  
4.259606548  
2.866981566  
1.995186783  
2.441229317  
2.165338482  
1.760010884  
1.662743764  
1.736048859  
1.80391044  
1.521176963  
1.302578137  
1.308632139  
1.236290574  
1.150522054  
1.105166317  
1.021755438  
0.9754570459  
0.8950269631  
0.8697753554  
0.8334901703  
0.8032107405  
0.7634164547  
0.72479609  
0.6881022235  
0.6619456294  
0.6337135765  
0.6065576051  
0.583897692  
0.5571486067  
0.5377835415  
0.5129320039  
0.4940210545  
0.4757052336  
0.4564688821  
0.4393295814  
0.4233419355  
0.4082046301  
0.3937982188  
0.3801715126  
0.3671685342  
0.3543243366  
0.3422151712  
0.330410156  
0.3194239501  
0.3089873808  
0.2989354322  
0.2893108248  
0.2801098136  
0.2713100692  
0.2628243214  
0.2547557469  
0.2470952779  
0.2395928357  
0.2324357739  
0.2255954152  
0.2190231237  
0.2127210353  
0.2066186544  
0.2007659436  
0.1951437467  
0.1897544309  
0.1845428034  
0.1794936874  
0.1746539737  
0.1700003697  
0.1654932499  
0.1611658127  
0.1569784719  
0.1529420597  
0.1490419188  
0.1452685068  
0.1416341811  
0.1381188913  
0.1347191905  
0.1314290699  
0.1282546237  
0.1251863027  
0.1222092735  
0.1193229928  
0.1165435212  
0.1138431672  
0.1112249237  
0.1086877891  
0.1062303857  
0.103853929  
0.101545516  
0.09930124476  
0.09713399514  
0.0950245079  
0.09298998046  
0.09099535052  
0.08906696606  
0.08720377704  
0.08537956244  
0.083616552  
0.08190242751  
0.08023241534  
0.07861220386  
0.07703193568  
0.07550617862  
0.07401102879  
0.07256340904  
0.07115254506  
0.06977986528  
0.06843861933  
0.06714039134  
0.0658683539  
0.06463667326  
0.0634359815  
0.06225987853  
0.06112927026  
0.06001286796  
0.0589309988  
0.05787340054  
0.05684729182  
0.0558381605  
0.05486437507  
0.05390337322  
0.05297705068  
0.05206458112  
0.05118104458  
0.0503127782  
0.04947133199  
0.04864081359  
0.04783708581  
0.04705132919  
0.04628451255  
0.04552978865  
0.04479541671  
0.04408129555  
0.04338619076  
0.04269991972  
0.04202945802  
0.04137679909  
0.04073859512  
0.04010943187  
0.03950052628  
0.03890455821  
0.03832290811  
0.03774694863  
0.03719008154  
0.03664494444  
0.03610824718  
0.03558219594  
0.03507249485  
0.03457064881  
0.03407773619  
0.0335946217  
0.03312787803  
0.03266547242  
0.0322099886  
0.03177141617  
0.03133213663  
0.03091361193  
0.03049462252  
0.03008500296  
0.0296882338  
0.02929613761  
0.02890908886  
0.02853305504  
0.02816150478  
0.02780419766  
0.02744681186  
0.02709976389  
0.02676133916  
0.02642298097  
0.02609259521  
0.02577115631  
0.02545719235  
0.02514770051  
0.02484081994  
0.02454132402  
0.02425083921  
0.0239659824  
0.0236823664  
0.0234074989  
0.02313518539  
0.02286594845  
0.02260571662  
0.02234731184  
0.02209502946  
0.0218457071  
0.02160062052  
0.02136096546  
0.02112853229  
0.02090009912  
0.02066736413  
0.02044681938  
0.02022489284  
0.0200113233  
0.01979934065  
0.01958892929  
0.01938950729  
0.01918445425  
0.01899189162  
0.01879770867  
0.01860318627  
0.01841337787  
0.01823452608  
0.01804886133  
0.01787448973  
0.01769691531  
0.017526274  
0.0173516801  
0.0171877458  
0.01702138048  
0.01686264066  
0.0167022305  
0.01654783809  
0.01639356082  
0.01624048245  
0.01609314011  
0.0159463374  
0.01580261773  
0.01566277522  
0.01551979783  
0.01538186557  
0.01524989186  
0.01511615838  
0.01498545187  
0.01485482668  
0.01472841341  
0.0146071361  
0.01447950788  
0.01435837381  
0.01423928787  
0.01412089848  
0.01400209872  
0.01389416204  
0.01377662671  
0.01367101846  
0.01355849457  
0.01345397451  
0.01334713315  
0.01324086661  
0.01314454863  
0.01304170292  
0.01294233297  
0.0128463445  
0.01274947375  
0.01265018842  
0.01255828745  
0.01246987779  
0.01237718379  
0.01228391678  
0.01219720835  
0.01210862928  
0.01202676908  
0.01194251751  
0.01185823704  
0.01177630656  
0.01169513909  
0.01161585378  
0.01153812315  
0.01145945305  
0.01138378476  
0.01130992967  
0.01123489323  
0.01116362405  
0.01109154508  
0.01102014769  
0.01095124514  
0.01088248365  
0.01081488919  
0.0107475791  
0.01068200888  
0.01061501667  
0.01055434945  
0.01048858323  
0.01042493927  
0.01036546625  
0.01030312454  
0.01024366797  
0.0101853788  
0.01012644342  
0.01006912096  
0.01001599242  
0.009958347873  
0.009905466547  
0.009851022869  
0.009797266222  
0.009743863977  
0.009692140397  
0.009640384553  
0.009591997254  
0.00954148939  
0.009493718439  
0.009444198804  
0.009397537169  
0.009350240277  
0.0093020903  
0.009258762125  
0.009214131496  
0.009171148315  
0.009123915402  
0.009080906702  
0.009041060493  
0.009000248009  
0.008958570615  
0.008915623988  
0.008879114526  
0.008839440935  
0.008797568355  
0.00876147345  
0.008723103373  
0.008685751841  
0.008649433515  
0.008612834304  
0.008574591437  
0.00854210146  
0.008509075394  
0.008476140205  
0.008442264682  
0.008409950108  
0.008376693787  
0.008344085685  
0.008311622329  
0.008280927797  
0.008251760485  
0.008220447392  
0.008193322551  
0.008163605264  
0.008132506417  
0.00810429713  
0.008076782215  
0.008049415408  
0.008022269211  
0.007997231138  
0.007972681021  
0.007943238787  
0.007918758922  
0.007892927002  
0.007871554573  
0.007847525127  
0.007824152441  
0.007800683577  
0.007778446475  
0.007754400933  
0.007733376606  
0.007710860632  
0.007688908722  
0.007668505743  
0.007648057375  
0.007626655339  
0.007608232069  
0.007586913679  
0.007569610672  
0.007550566447  
0.007532412457  
0.007514491875  
0.007496391289  
0.007479846773  
0.007462951026  
0.007446568142  
0.007429404133  
0.00741339984  
0.007397710666  
0.007383268697  
0.007367580606  
0.007351343131  
0.007338099815  
0.007325260277  
0.007311224217  
0.007299097397  
0.007282191653  
0.007271619249  
0.007259114108  
0.007248168366  
0.007234636662  
0.007223539649  
0.007213060069  
0.007202883052  
0.007191673521  
0.007180333982  
0.007169956482  
0.007161018078  
0.007150224932  
0.00714212703  
0.007133133348  
0.007124006723  
0.007117753467  
0.007108099259  
0.007101987519  
0.007095357939  
0.007088045155  
0.00707990796  
0.007072682116  
0.007067816223  
0.007061266877  
0.007056014358  
0.007051527812  
0.007046612682  
0.007040866211  
0.007035435144  
0.007032743373  
0.007027829543  
0.007023764179  
0.007021169407  
0.007017719783  
0.007014508472  
0.007011216187  
0.007009589683  
0.007008776293  
0.00700447808  
0.007005129966  
0.007002353676  
0.007004869529  
0.007000510182  
0.007000080655  
0.00700233972  
