122.0673483  
129.2502827  
149.3787737  
220.7554045  
592.4960029  
980.9978443  
592.7712748  
27860.79158  
74101.44159  
76426.47623  
51666.53766  
53076.91026  
3690.324654  
5196.922958  
21842.88524  
5654.655036  
26334.39114  
1480.420061  
7685.385383  
15370.64179  
15164.62992  
5908.784033  
9265.710175  
652.0036321  
6747.651227  
1464.849331  
10735.50882  
1452.843967  
2668.471772  
2278.225352  
1230.418022  
1288.104052  
105.7968015  
495.2123161  
2278.430987  
7533.140466  
1918.843959  
2856.17942  
1193.643185  
254.532086  
4027.665284  
3202.971003  
2339.602708  
1226.622949  
8050.309796  
5490.487202  
343.7721213  
2020.660442  
1595.279018  
863.6107115  
370.9884102  
834.1753921  
2548.927762  
757.7853446  
514.5799208  
374.426642  
585.3146622  
1698.112441  
108.6473444  
875.0395142  
98.03419493  
71.87371061  
98.37960981  
20.1565934  
46.67532312  
71.6887004  
58.84291905  
55.97337426  
33.33590397  
168.0661097  
28.76546226  
3.192298553  
46.82299721  
44.02765241  
12.70253863  
10.74974028  
4.431412455  
14.96502882  
8.452952785  
12.34412094  
7.204247601  
6.497367492  
5.479330318  
4.476997192  
5.577381442  
4.723534072  
5.005109774  
4.347228533  
4.053869803  
3.381619571  
3.394069525  
2.980397899  
3.12247299  
2.971835816  
2.69560071  
2.647841269  
2.427921837  
2.30055323  
2.26877569  
2.123835519  
2.056321648  
1.909672681  
1.83198742  
1.753919366  
1.68083467  
1.638936778  
1.540881395  
1.504316968  
1.435342215  
1.405878176  
1.352349754  
1.291314991  
1.246045706  
1.207727133  
1.169773204  
1.132453913  
1.098588433  
1.060741462  
1.031099055  
0.9966491003  
0.9661882221  
0.9395690368  
0.9132223089  
0.8874133669  
0.8614405097  
0.8382755648  
0.8163898144  
0.7938252304  
0.7732547607  
0.7534018155  
0.7341781771  
0.7155746693  
0.6981334667  
0.680933833  
0.6647730278  
0.6488219177  
0.6338971805  
0.6193545812  
0.6051402434  
0.5915696252  
0.5785364115  
0.565879563  
0.5537399813  
0.5419926423  
0.5305744014  
0.5196096578  
0.5089812239  
0.4986929248  
0.4887394882  
0.4791220425  
0.4697979051  
0.4607574667  
0.4519964722  
0.4434971  
0.4352697628  
0.4272929146  
0.4195312815  
0.4120119462  
0.4047148954  
0.3976116452  
0.3907325617  
0.3840346234  
0.3775148719  
0.3711934795  
0.3650419872  
0.3590597507  
0.3532336019  
0.3475537529  
0.3420289107  
0.3366570084  
0.3314161396  
0.3263181187  
0.3213479012  
0.3165046615  
0.3117722033  
0.3071657268  
0.302668467  
0.2982837724  
0.2940046878  
0.2898270133  
0.2857498878  
0.2817752664  
0.2778838597  
0.2740962978  
0.2703846773  
0.2667606612  
0.2632140408  
0.2597545161  
0.2563673488  
0.2530572991  
0.2498151334  
0.2466531592  
0.2435603847  
0.240528024  
0.237557782  
0.2346569552  
0.2318191403  
0.2290356479  
0.2263080032  
0.2236434017  
0.2210270145  
0.2184653784  
0.2159526535  
0.2134949446  
0.21109105  
0.2087293216  
0.2064047501  
0.2041409225  
0.2019157677  
0.1997311389  
0.1975862431  
0.1954844613  
0.1934213458  
0.1914066462  
0.189420376  
0.1874672296  
0.1855571604  
0.1836755953  
0.1818372803  
0.1800283  
0.1782472261  
0.1765017205  
0.1747939928  
0.1731055269  
0.1714496606  
0.1698244697  
0.1682280202  
0.1666595298  
0.1651137199  
0.1636022572  
0.1621068476  
0.1606499494  
0.1591998108  
0.157782301  
0.1563941145  
0.1550238798  
0.1536724692  
0.1523490218  
0.1510437198  
0.1497615287  
0.148500383  
0.1472579651  
0.1460331147  
0.1448368109  
0.1436506431  
0.1424839244  
0.1413398283  
0.1402064776  
0.1390926515  
0.1380029467  
0.1369202129  
0.1358606846  
0.1348157115  
0.1337882984  
0.13277629  
0.1317747892  
0.1307986473  
0.1298251878  
0.1288696051  
0.127928382  
0.1270036021  
0.1260833965  
0.1251887871  
0.1243021912  
0.1234309902  
0.122565201  
0.1217157048  
0.1208825406  
0.1200528027  
0.1192406193  
0.1184357094  
0.1176477088  
0.1168686685  
0.1161007055  
0.1153435616  
0.1145932581  
0.1138541709  
0.1131331844  
0.1124124954  
0.1117034025  
0.1110081021  
0.1103182546  
0.1096390039  
0.1089645791  
0.1083063106  
0.1076556138  
0.1070088584  
0.1063788675  
0.1057511179  
0.105132252  
0.104522719  
0.1039207794  
0.1033248578  
0.1027394926  
0.1021618379  
0.1015884209  
0.1010283658  
0.1004700344  
0.09991856843  
0.09937822675  
0.0988406179  
0.09831321926  
0.09779016722  
0.09727476404  
0.09676488191  
0.09626624136  
0.09576702571  
0.09528133004  
0.09479774118  
0.09432165119  
0.09384681975  
0.09338080088  
0.0929238704  
0.09246758062  
0.09202104169  
0.09157457176  
0.09114319909  
0.09070999181  
0.09028160034  
0.08986002934  
0.08944168199  
0.08903137296  
0.08862592187  
0.08822399846  
0.08782908675  
0.08743862554  
0.08705146939  
0.08666495024  
0.0862920651  
0.08591643404  
0.08554777823  
0.0851858294  
0.08482775227  
0.08447586994  
0.08412152322  
0.08377464181  
0.08343454186  
0.08309668982  
0.08276132308  
0.08243190945  
0.08210443102  
0.08178244199  
0.081468236  
0.08115067656  
0.08084254413  
0.08053239848  
0.08022924615  
0.07993313942  
0.07963476994  
0.07934173374  
0.07905345176  
0.07876855563  
0.07848451905  
0.07820776506  
0.07793160187  
0.07765796907  
0.07739325558  
0.07712832583  
0.07686344867  
0.07660217679  
0.07635196493  
0.0760972899  
0.07584718251  
0.07560282547  
0.07535861362  
0.07511844464  
0.07488065762  
0.07464552561  
0.07441686643  
0.07418313821  
0.0739546874  
0.07373309044  
0.07351179279  
0.07329719098  
0.07308333136  
0.07286945782  
0.07266111883  
0.07245009679  
0.07224564724  
0.07204443562  
0.07184435531  
0.07164740095  
0.07145377341  
0.07126238257  
0.07107102075  
0.07088286491  
0.0707017254  
0.07051800515  
0.07034089046  
0.07016336278  
0.06998451993  
0.06981364252  
0.06964671858  
0.0694723086  
0.06930614244  
0.0691416832  
0.06897882223  
0.06882522704  
0.06866394375  
0.06850678226  
0.06835486393  
0.06820669322  
0.06805588646  
0.06790854523  
0.06776528209  
0.06761687401  
0.06747889064  
0.06734148172  
0.06720478923  
0.06707102605  
0.0669371696  
0.06680660068  
0.06667396816  
0.06655167257  
0.0664259945  
0.06630146243  
0.06617857193  
0.06605620248  
0.06594036758  
0.06582795044  
0.06571547606  
0.06560042448  
0.06549268715  
0.06538485228  
0.06527479864  
0.06517157758  
0.06506552728  
0.06496354179  
0.06486608079  
0.06476858896  
0.06467515259  
0.0645775516  
0.06448772971  
0.06439491798  
0.06430328801  
0.06421730165  
0.06413046143  
0.06404641879  
0.0639666554  
0.06388122224  
0.06380371002  
0.06372387166  
0.06364700303  
0.06357408727  
0.06350248816  
0.06342875865  
0.06335998217  
0.06329018067  
0.06322356056  
0.06315891833  
0.06309418327  
0.06303629664  
0.06297190803  
0.06291318802  
0.06285580053  
0.0628012174  
0.06274526187  
0.06269093895  
0.06264248143  
0.0625940427  
0.06254264894  
0.06249512627  
0.0624514658  
0.06240932683  
0.06236596006  
0.06232045852  
0.06228380037  
0.06224651948  
0.06221008334  
0.06217210475  
0.06214096549  
0.06210695309  
0.06207602727  
0.06205082291  
0.06202075025  
0.06199412364  
0.06197041367  
0.0619456148  
0.06192327283  
0.06190235085  
0.061885333  
0.06186492068  
0.06184918498  
0.06183721677  
0.06181908248  
0.06181097998  
0.06180203352  
0.06179192929  
0.06178049706  
0.06177411883  
0.06177123244  
0.0617685377  
0.06176426914  
0.06176456077  
