138.9705638  
142.7513164  
155.8449515  
191.1677017  
129.0952597  
121.6392475  
7052.042214  
12893.76239  
176035.5247  
11412.39378  
40097.2537  
3747.175414  
18895.20649  
10816.29244  
14594.7083  
40613.66942  
18688.02279  
30661.66027  
2673.303578  
6101.674052  
335.5980557  
4344.197404  
16373.22428  
9014.891175  
12215.23581  
1523.828359  
1027.348742  
1123.344543  
3459.869107  
330.7574057  
1466.187346  
1217.144476  
143.9809055  
2218.239344  
1457.784982  
8209.868373  
817.2453239  
745.7857959  
148.1196738  
3883.862852  
196.9580952  
4419.315813  
958.4414018  
1480.021291  
3637.162959  
759.1805298  
308.9542898  
216.4416308  
102.1169306  
1340.473366  
966.5686853  
452.3569101  
2597.140362  
79.63831664  
47.14487657  
801.7656423  
411.365058  
229.8527409  
1317.525495  
944.3889624  
91.5257338  
278.4791335  
187.4235298  
115.6809539  
160.6482126  
118.1889884  
40.84868009  
45.2423274  
5.024201476  
2.315283639  
10.47051714  
5.679839263  
1.493259775  
2.822022711  
1.814103379  
2.035072813  
1.876708074  
2.294716877  
0.9667488251  
0.7916510198  
0.6428703858  
0.7760441971  
0.8944585882  
0.9978653163  
0.7084744277  
0.6435892453  
0.577777245  
0.4849497182  
0.5163639356  
0.4816477664  
0.4638171458  
0.3952199702  
0.3780248834  
0.3345383412  
0.3329489314  
0.314761051  
0.3018471029  
0.2827985136  
0.2712841971  
0.2492875862  
0.241413499  
0.2302061497  
0.2193528788  
0.2019851671  
0.1944556428  
0.1869089  
0.1791997859  
0.170606246  
0.1634808911  
0.1563584492  
0.1502405084  
0.1428354656  
0.1374049341  
0.1315711392  
0.1264816679  
0.121756913  
0.1168101724  
0.1123794467  
0.1078240074  
0.1038828311  
0.09996593054  
0.09621666627  
0.09268901649  
0.08953399549  
0.08622877913  
0.0831705533  
0.08029804358  
0.07745392091  
0.07485574165  
0.07233093914  
0.06988803405  
0.06757879438  
0.06531567426  
0.06320763225  
0.06117040333  
0.05921036094  
0.05732646565  
0.05552236216  
0.05378150991  
0.05212795475  
0.05052983441  
0.04898562607  
0.04750591154  
0.04607916898  
0.04471583618  
0.04339773918  
0.04213039471  
0.04090495953  
0.03972814989  
0.03859583667  
0.03750119114  
0.03644476339  
0.03543167174  
0.03444821009  
0.03349992318  
0.0325869424  
0.03170369498  
0.03085311933  
0.0300282529  
0.02922845731  
0.02845853115  
0.02771316111  
0.02699494084  
0.02629708542  
0.02562453698  
0.02497068622  
0.02434039853  
0.02372808881  
0.02313617055  
0.02255914873  
0.0220066107  
0.021467749  
0.02094212057  
0.02043840607  
0.01994691601  
0.01946978261  
0.01900884587  
0.0185593738  
0.01812226763  
0.01770132239  
0.01729168951  
0.01689059816  
0.01650476203  
0.01612904153  
0.01576545918  
0.01540919008  
0.01506431234  
0.01472968645  
0.01440330034  
0.01408701655  
0.01377712251  
0.0134792893  
0.01318592964  
0.012903338  
0.01262616307  
0.01235591614  
0.01209593791  
0.01183950353  
0.01159264428  
0.01135166359  
0.01111524839  
0.01088484657  
0.0106627712  
0.01044430263  
0.01023229324  
0.01002444449  
0.009822454067  
0.009628303359  
0.009434902105  
0.009247818191  
0.00906524636  
0.008887529583  
0.008715132195  
0.008545866422  
0.008380557944  
0.008217590657  
0.008060806752  
0.007906428375  
0.007757573868  
0.007610697575  
0.007467982442  
0.007327822874  
0.007191810904  
0.007057918617  
0.00692854755  
0.006800403479  
0.006677340729  
0.006555574217  
0.006436362989  
0.006319673931  
0.006207299633  
0.006096377803  
0.005986927051  
0.005881314312  
0.005777101697  
0.005677236525  
0.00557672415  
0.005479546271  
0.00538412937  
0.005291956277  
0.005201492016  
0.005111572918  
0.005024581883  
0.004939328026  
0.004855295524  
0.004774122785  
0.004694799332  
0.004615634397  
0.004539250086  
0.004464204572  
0.004390019894  
0.004317957017  
0.004248022074  
0.004179623628  
0.004111162075  
0.004044110456  
0.003979723927  
0.003915160209  
0.003853341693  
0.003792186883  
0.003732643807  
0.003673791  
0.003615728554  
0.003558782219  
0.003503995586  
0.00344977584  
0.003396538443  
0.003344031517  
0.003292870248  
0.003242165622  
0.003193393168  
0.003144126098  
0.003097438579  
0.003050441346  
0.003005528456  
0.00296080438  
0.002916391191  
0.002874082516  
0.002831136657  
0.002789796651  
0.002748702047  
0.002708679484  
0.00266929438  
0.002630392997  
0.002592889363  
0.002555648496  
0.002518970122  
0.002483533049  
0.002448245768  
0.00241354225  
0.002379194304  
0.002345829022  
0.002313935783  
0.002280908964  
0.002249453075  
0.002219421236  
0.002188109639  
0.00215803775  
0.002128111972  
0.002100091171  
0.002071265063  
0.002042993456  
0.00201537882  
0.001988861386  
0.001961922273  
0.001936390674  
0.001910363667  
0.001885839604  
0.001861076805  
0.00183597075  
0.001812489988  
0.001789138396  
0.001764789641  
0.001742648158  
0.001720472127  
0.001698370213  
0.001676907088  
0.001656437198  
0.001635039486  
0.001614470256  
0.001594313329  
0.001573975699  
0.001554539742  
0.001535311334  
0.001516431382  
0.00149805039  
0.001479735953  
0.001462035064  
0.001443531376  
0.0014262709  
0.00140928348  
0.001392379225  
0.001375573986  
0.001359648085  
0.001343230359  
0.00132782439  
0.001312057648  
0.001296632753  
0.001281769844  
0.001266976308  
0.001251815907  
0.001238196767  
0.001223482579  
0.001209714702  
0.001196370017  
0.001182207779  
0.00116914583  
0.001156062872  
0.001143420343  
0.00113094665  
0.001118233148  
0.001106216577  
0.001094026772  
0.001081836608  
0.001070667869  
0.001058867329  
0.001047829224  
0.001036340266  
0.001025245586  
0.001014711808  
0.001003867049  
0.0009936480411  
0.0009837003955  
0.0009730882634  
0.0009630218556  
0.0009530264221  
0.0009439659074  
0.0009337624292  
0.0009250298871  
0.0009158024683  
0.0009062155673  
0.0008972496414  
0.0008887344051  
0.0008800272571  
0.0008714982414  
0.0008630014962  
0.0008547145761  
0.0008461659565  
0.0008388232086  
0.0008303771295  
0.000822792756  
0.0008154666641  
0.0008076128821  
0.0008001607161  
0.000793056245  
0.0007859299154  
0.000778759122  
0.0007713609717  
0.0007650773589  
0.0007580546506  
0.000751324678  
0.0007446001281  
0.0007384586145  
0.0007323191002  
0.0007256424268  
0.00071973193  
0.0007136869532  
0.0007080151943  
0.0007019822507  
0.000696323811  
0.0006904706285  
0.0006846850328  
0.0006794890863  
0.0006738941675  
0.0006687847894  
0.0006635201563  
0.0006583938872  
0.0006535082153  
0.0006485152782  
0.0006437750899  
0.0006387108453  
0.0006340928839  
0.0006293335793  
0.000624971337  
0.0006206123873  
0.000615995889  
0.0006116268099  
0.0006075016905  
0.0006033093143  
0.0005989197898  
0.0005951178164  
0.000591502011  
0.0005873738022  
0.0005834696805  
0.0005800514089  
0.0005760015433  
0.0005728166634  
0.0005690351037  
0.0005657957293  
0.0005619563836  
0.0005587131146  
0.000555716302  
0.0005524546525  
0.0005494387593  
0.0005463521963  
0.0005427902886  
0.0005402138223  
0.0005372463202  
0.0005345519413  
0.0005316804642  
0.0005289572238  
0.0005262692229  
0.0005239619932  
0.0005212568454  
0.0005190199254  
0.0005162223003  
0.0005140039709  
0.0005117050031  
0.0005096095288  
0.0005072849565  
0.0005051638019  
0.0005033181806  
0.0005010507529  
0.0004995438443  
0.0004972156246  
0.0004953181969  
0.0004931958805  
0.0004919349486  
0.0004897725736  
0.0004883292357  
0.0004863614153  
0.0004849203229  
0.0004833806832  
0.0004822366359  
0.0004807252916  
0.0004795541153  
0.0004782460014  
0.000476651539  
0.0004755100839  
0.0004745462655  
0.0004730891987  
0.0004724383469  
0.0004712218163  
0.0004703371685  
0.0004694101628  
0.0004682314034  
0.0004675508227  
0.0004665257212  
0.0004661500749  
0.0004652481162  
0.0004649429433  
0.0004643751095  
0.000463912359  
0.0004634990384  
0.0004628949737  
0.0004624994942  
0.0004620978531  
0.000461753266  
0.000461589419  
0.0004614359307  
0.0004610680327  
0.0004608955637  
0.0004611795298  
0.0004609637386  
