48.50622217  
54.30803086  
67.66114442  
96.74754171  
176.3987731  
2591.472771  
12844.36163  
7130.759802  
26222.58881  
47626.48441  
26908.82755  
37736.6657  
26200.85269  
17641.02983  
16949.07044  
9711.82826  
41336.87585  
46222.10595  
614.5690992  
10200.6812  
11592.6305  
34219.80001  
3541.402327  
187.1748687  
3993.140101  
2706.865498  
3348.798319  
3765.884039  
1641.161385  
606.9225443  
2539.802987  
10611.74124  
2582.834347  
119.7012527  
4635.259434  
7698.382038  
11269.19643  
830.0482135  
1255.235397  
1176.553274  
2243.655844  
2279.894822  
10728.89657  
2122.511199  
8186.771282  
1467.121746  
520.2340709  
2351.681854  
934.0098852  
1572.936573  
817.5792534  
570.5968743  
1540.253597  
1030.634217  
1362.298034  
871.1316855  
495.3590245  
3748.338882  
3732.058127  
254.4124331  
491.2491076  
2.684668304  
444.702753  
195.5277609  
327.2551913  
71.57594474  
121.1228576  
93.32349917  
158.4522782  
19.73267876  
31.39449945  
12.65307428  
7.435559595  
2.024762335  
25.44082456  
1.328416355  
1.439580718  
6.281558982  
2.682100628  
1.575824756  
0.5600211352  
1.555847924  
1.252028509  
1.006166874  
0.9038908032  
1.354483466  
0.6938798565  
0.973743567  
0.706753009  
0.6553117934  
0.6814643644  
0.51230347  
0.4305332691  
0.4600399192  
0.4678115215  
0.4145937244  
0.3528605625  
0.383975474  
0.3478803079  
0.3390213959  
0.3036381323  
0.2897583171  
0.2796992989  
0.2653119718  
0.2538299314  
0.2422609561  
0.2305577175  
0.223601309  
0.2104437129  
0.203726518  
0.1955984875  
0.1873085006  
0.1798185188  
0.1725638114  
0.1658895476  
0.1595194924  
0.1545458588  
0.1479205918  
0.1425606485  
0.1380085178  
0.1333160708  
0.1290745057  
0.1242551622  
0.1203584514  
0.1166043416  
0.1127087726  
0.1091619579  
0.1057258678  
0.1025812497  
0.09950661514  
0.09656516468  
0.09371153376  
0.09101205147  
0.08847026698  
0.0859624355  
0.08361803534  
0.0813288478  
0.07916387748  
0.07707955843  
0.07504484642  
0.0731088383  
0.07125823798  
0.06946380721  
0.06773649874  
0.06607080985  
0.06448369667  
0.06293608345  
0.06145166412  
0.06000855024  
0.05862980493  
0.05729176234  
0.05600030484  
0.05475222777  
0.05354599781  
0.05238471075  
0.05125501644  
0.0501662869  
0.04911103903  
0.04808950909  
0.04710320351  
0.0461434164  
0.04521247789  
0.04431055132  
0.04343753802  
0.04259352412  
0.0417734483  
0.04097483186  
0.04020140485  
0.0394534882  
0.03872284833  
0.03801264937  
0.03732649529  
0.03665309207  
0.03600548342  
0.03537540756  
0.03475691194  
0.03416254705  
0.03358115816  
0.033010745  
0.03246005092  
0.03192333817  
0.03140041164  
0.03089098327  
0.03039451799  
0.02990851028  
0.02943841493  
0.02897962524  
0.02853013696  
0.0280917755  
0.02766478379  
0.02724746335  
0.02684259647  
0.02644645301  
0.02605892519  
0.02568012645  
0.0253098357  
0.024953509  
0.02459951497  
0.02425782463  
0.02392110643  
0.02359294384  
0.02326962813  
0.02295587305  
0.02264858954  
0.02234791771  
0.02205538571  
0.02176536037  
0.02148481364  
0.02120964691  
0.02094163338  
0.02067894608  
0.02042048174  
0.02016788432  
0.01991814629  
0.01967807335  
0.01943942297  
0.01920813544  
0.01897888425  
0.01875598207  
0.01853727133  
0.01832437275  
0.01811378823  
0.01790641209  
0.01770554201  
0.01750511263  
0.01731180308  
0.01711978487  
0.01693552471  
0.01675103877  
0.01657167213  
0.01639467797  
0.01622273024  
0.01605151004  
0.01588420914  
0.01571977624  
0.01556062608  
0.01540318401  
0.01524631571  
0.01509240103  
0.01494363381  
0.01479859491  
0.01465473263  
0.01451183531  
0.01437173231  
0.01423513729  
0.01410088114  
0.01396862126  
0.01383948848  
0.01371032458  
0.01358542445  
0.01346223164  
0.01334049574  
0.01321965966  
0.01310366351  
0.01298687189  
0.01287386875  
0.01276249332  
0.01265292083  
0.01254486733  
0.01243677284  
0.01233346447  
0.01223179513  
0.01212825107  
0.01203102045  
0.01193082698  
0.01183381237  
0.01173988566  
0.01164651326  
0.01155532722  
0.01146445073  
0.01137418225  
0.01128645963  
0.01120102029  
0.01111576736  
0.0110310145  
0.01094974047  
0.01086727875  
0.01078697478  
0.01070865209  
0.0106295745  
0.01055240683  
0.01047836512  
0.01040272158  
0.01032945905  
0.0102568331  
0.01018582506  
0.01011575718  
0.01004655076  
0.009979309511  
0.009909975939  
0.009844055036  
0.009779630346  
0.009714556408  
0.009651685064  
0.009589158041  
0.009527342038  
0.00946615453  
0.009405569659  
0.009348011403  
0.009287787001  
0.009231546408  
0.009175654707  
0.009118579708  
0.009062346001  
0.009008096402  
0.00895436775  
0.008901986196  
0.008849877036  
0.008799216794  
0.008747048953  
0.008697917543  
0.0086499419  
0.0086007997  
0.008550314896  
0.008503813235  
0.008456646465  
0.008410841374  
0.008363874283  
0.00831865995  
0.008275190861  
0.008231685774  
0.008189266584  
0.008145259329  
0.008104245759  
0.008062599235  
0.008021567794  
0.007979049947  
0.007939938831  
0.007899893  
0.007863153588  
0.007821651958  
0.007784582358  
0.007747327535  
0.007710127946  
0.007674913484  
0.007639760308  
0.007603778705  
0.007567812957  
0.007533628031  
0.007497430039  
0.00746475799  
0.007431373471  
0.007398798874  
0.007367469782  
0.007333294752  
0.007302613288  
0.007270167415  
0.007240215773  
0.007210642824  
0.007178977709  
0.007148932018  
0.007120408464  
0.007092298768  
0.007062776962  
0.007035306614  
0.007007569595  
0.00697850729  
0.006952126404  
0.006925057852  
0.006897351002  
0.006871507556  
0.006846338449  
0.006822144769  
0.006793817522  
0.006771480343  
0.006746392847  
0.006721735199  
0.006697581486  
0.006675331941  
0.006651083516  
0.006629608994  
0.00660502719  
0.006583113907  
0.00656205769  
0.006538296724  
0.006517603985  
0.006495991078  
0.0064755002  
0.006454387603  
0.006433951218  
0.006414301253  
0.006394269675  
0.006374792062  
0.00635510238  
0.006335902845  
0.006318458222  
0.00629866011  
0.00628001413  
0.006262097151  
0.006244646384  
0.0062268915  
0.006210019695  
0.00619178276  
0.006176269854  
0.006158476185  
0.006142284244  
0.006125959695  
0.00610915773  
0.006094886592  
0.006077624113  
0.006063757885  
0.006048381981  
0.006033518202  
0.006017620749  
0.006004816163  
0.005989716129  
0.005975824498  
0.005962814926  
0.005949524378  
0.005935595584  
0.005920517488  
0.005907978632  
0.005895252381  
0.005882459152  
0.005870681013  
0.005858050318  
0.005845717196  
0.005833870031  
0.005822430479  
0.005810143115  
0.005799901949  
0.005789987153  
0.005779341965  
0.005766361076  
0.005755747836  
0.005746494904  
0.005735553189  
0.005725487038  
0.005714959425  
0.005705870362  
0.005697832108  
0.005687469393  
0.00567791496  
0.005668629714  
0.005659829001  
0.005650586081  
0.005642624862  
0.005634177277  
0.005625925185  
0.005618634192  
0.005610437923  
0.005601976081  
0.00559485146  
0.005588061343  
0.005580412564  
0.005572617574  
0.005566513758  
0.005559500703  
0.005553687013  
0.005547676873  
0.005540681241  
0.005533764278  
0.005528994956  
0.005520645594  
0.005517350927  
0.005510113287  
0.005504933508  
0.005499758095  
0.005495134707  
0.005490568859  
0.005485815062  
0.005480648693  
0.005476821882  
0.005472421005  
0.005468302316  
0.005464022423  
0.005461134541  
0.005457314225  
0.005453014742  
0.00544852298  
0.00544635612  
0.005442879863  
0.005438201923  
0.00543598949  
0.005433308635  
0.005432207501  
0.005428996794  
0.005428346197  
0.005423504737  
0.005423010003  
0.00542101687  
0.00541791744  
0.005416650052  
0.00541452382  
0.005414204638  
0.005413731611  
0.005412413129  
0.00541202814  
0.005411541838  
0.005409526997  
0.005410206847  
0.005408775472  
0.005408150398  
0.005408450391  
