0.2765049517  
0.1848276834  
0.09235347435  
-0.002422171627  
-0.09993729055  
-0.1991899661  
-0.2975816485  
-0.3909848968  
-0.4740407098  
-0.5406530067  
-0.584620776  
-0.600338971  
-0.5834846678  
-0.5316029143  
-0.4445315125  
-0.3246036357  
-0.1766185488  
-0.007575649949  
0.1737863829  
0.3575963194  
0.5335404013  
0.6915611314  
0.8225204867  
0.9187761363  
0.9746489107  
0.9867751826  
0.9543376833  
0.8791812909  
0.7658133624  
0.6212759526  
0.4548727089  
0.2777329995  
0.1021918171  
-0.05900827934  
-0.1936709171  
-0.2912018199  
-0.3436761912  
-0.3468096686  
-0.3007107938  
-0.2102943716  
-0.08526520149  
0.06038457179  
0.2093631081  
0.3425028145  
0.4404921655  
0.4857769469  
0.4644223091  
0.367750705  
0.1935579196  
-0.05323625506  
-0.3606156042  
-0.7101967429  
-1.07863267  
-1.439573699  
-1.766009879  
-2.032773918  
-2.218935418  
-2.309838308  
-2.298541155  
-2.186488815  
-1.983318349  
-1.705813186  
-1.376108118  
-1.019365905  
-0.6611967618  
-0.3251481564  
-0.03056007589  
0.2089512136  
0.386227728  
0.5004823256  
0.5564691966  
0.5630885096  
0.5316903807  
0.4743425007  
0.4023187855  
0.3249954883  
0.2492439682  
0.1793225657  
0.1171729923  
0.0629810333  
0.01582590117  
-0.02572714414  
-0.06319115081  
-0.09792944109  
-0.1311000785  
-0.1637133976  
-0.1966982161  
-0.2308937308  
-0.2669118992  
-0.3048595068  
-0.3439755753  
-0.3822692245  
-0.4162813537  
-0.4410738822  
-0.4505309023  
-0.437983853  
-0.3971191231  
-0.3230476247  
-0.2133695615  
-0.06904515009  
0.1051071293  
0.3004216977  
0.5049665276  
0.7046616363  
0.8848213288  
1.031915637  
1.135306947  
1.188704665  
1.191101296  
1.147027904  
1.066060776  
0.9616150655  
0.8491721693  
0.7441799175  
0.6599092992  
0.6055758647  
0.5849963703  
0.5959782716  
0.6305431979  
0.6759617007  
0.7164659231  
0.7354137837  
0.717605814  
0.651449084  
0.5306719829  
0.3553689039  
0.1322335365  
-0.1260377528  
-0.4020887831  
-0.6758153224  
-0.9265868432  
-1.13550014  
-1.287383485  
-1.372315196  
-1.386488496  
-1.332354054  
-1.218059047  
-1.056293  
-0.8627170178  
-0.654199419  
-0.4470751668  
-0.2556346101  
-0.09098946819  
0.03959867605  
0.1329079831  
0.1895206585  
0.2132486486  
0.2103519386  
0.1886686341  
0.156772193  
0.1232305447  
0.09600587064  
0.08200919208  
0.08678302736  
0.1142813472  
0.166720434  
0.2444796472  
0.3460515825  
0.4680648536  
0.6054063747  
0.7514750165  
0.8985837573  
1.038509492  
1.163149456  
1.2652326  
1.338996608  
1.380741175  
1.389185367  
1.365561986  
1.313438117  
1.238281182  
1.146832616  
1.046379614  
0.9440251005  
0.8460480781  
0.7574306824  
0.6815860543  
0.6202869088  
0.5737600431  
0.5408896881  
0.5194691769  
0.5064403032  
0.498095308  
0.4902308073  
0.4782770081  
0.4574468516  
0.4229508715  
0.3703118087  
0.2957959314  
0.1969332324  
0.07306599456  
-0.07416245226  
-0.2404994559  
-0.4190556919  
-0.600648035  
-0.7745473234  
-0.9296077193  
-1.055680903  
-1.145151154  
-1.194387117  
-1.204864919  
-1.18374894  
-1.143749373  
-1.102167567  
-1.079143318  
-1.095243231  
-1.168642632  
-1.312248854  
-1.531162689  
-1.820869402  
-2.166501497  
-2.543387441  
-2.918937166  
-3.255750086  
-3.515613466  
-3.663942109  
-3.674080128  
-3.530884014  
-3.233063946  
-2.793904184  
-2.240196814  
-1.609475531  
-0.945879627  
-0.2951861331  
0.3003215783  
0.8064495392  
1.200530912  
1.473260539  
1.628724993  
1.682692792  
1.659494986  
1.588011551  
1.497389115  
1.413119825  
1.35401313  
1.330413815  
1.343811116  
1.387750532  
1.44977975  
1.514029373  
1.563965107  
1.584899782  
1.565919869  
1.501030949  
1.389478753  
1.235326978  
1.04649706  
0.8335002364  
0.6081319432  
0.3823158408  
0.16724026  
-0.02716775361  
-0.1924672743  
-0.3217159132  
-0.4093935868  
-0.4513545901  
-0.4448840034  
-0.3889081826  
-0.2843215937  
-0.134376033  
0.05498139513  
0.2749323322  
0.513864124  
0.7577766206  
0.9910201139  
1.197342494  
1.361143669  
1.46881419  
1.510015987  
1.478744087  
1.374047002  
1.200306967  
0.9670320656  
0.6881703676  
0.3809972666  
0.0646879613  
-0.2412866443  
-0.5187941088  
-0.7525300993  
-0.9312384726  
-1.048526019  
-1.10321774  
-1.099205819  
-1.04482427  
-0.9518191343  
-0.8340120147  
-0.7058174004  
-0.5807576525  
-0.470142801  
-0.3820536582  
-0.3207402539  
-0.2864838189  
-0.275936929  
-0.2828741027  
-0.299248731  
-0.3164145812  
-0.3263480068  
-0.3227161397  
-0.3016605137  
-0.2622088709  
-0.206279744  
-0.1382977134  
-0.0644939623  
0.008009146973  
0.07219825803  
0.1221191479  
0.1536667612  
0.1651140682  
0.15733358  
0.1336956287  
0.09966191746  
0.06214109929  
0.02867555829  
0.006557243006  
0.001961968078  
0.01918553105  
0.06006130705  
0.1236055142  
0.2059406183  
0.3005062637  
0.3985640985  
0.4899773852  
0.5642122455  
0.6115016888  
0.6240625912  
0.5972569042  
0.5305553403  
0.4281616674  
0.2991769426  
0.1572126334  
0.01941702933  
-0.09505421224  
-0.1670065666  
-0.1794310874  
-0.119738724  
0.01827486773  
0.233005171  
0.5143948908  
0.8442218585  
1.197364127  
1.543975942  
1.852364812  
2.092271605  
2.238174372  
2.272220498  
2.186407123  
1.983720177  
1.678062423  
1.29293849  
0.8590349899  
0.410962292  
-0.01646113678  
-0.3919478129  
-0.691060768  
-0.8987259227  
-1.010655201  
-1.033520195  
-0.9838804415  
-0.8860034973  
-0.7688460737  
-0.6625625055  
-0.5949352041  
-0.5881372076  
-0.6561846672  
-0.8033545142  
-1.023720334  
-1.301855815  
-1.614597495  
-1.933664438  
-2.228823921  
-2.47124683  
-2.636662559  
-2.707968312  
-2.676991539  
-2.545226776  
-2.323481596  
-2.030496545  
-1.690733141  
-1.331617937  
-0.9805834806  
-0.6622774409  
-0.3962511472  
-0.1953906922  
-0.06522232035  
-0.004118469812  
-0.004306390899  
-0.05347915078  
-0.1367441332  
-0.2386247966  
-0.3448362298  
-0.4436302443  
-0.526570671  
-0.5887187609  
-0.6282798214  
-0.6458685075  
-0.6435669947  
-0.6239837261  
-0.5894860537  
-0.5417242703  
-0.4814969973  
-0.4089329833  
-0.3238908914  
-0.2264586785  
-0.1173967062  
0.001584949298  
0.1277918921  
0.2577721876  
0.3877453658  
0.5141426832  
0.6341344131  
0.7460146887  
0.8493653844  
0.9449450293  
1.034332412  
1.119396728  
1.201711449  
1.282029268  
1.359949653  
1.433828458  
1.50096497  
1.558016644  
1.60155722  
1.62865734  
1.637379257  
1.627072923  
1.598436169  
1.553322228  
1.494351232  
1.424408954  
1.346139591  
1.261541045  
1.171741383  
1.077003652  
0.9769591077  
0.8710186188  
0.758883471  
0.641054935  
0.5192339384  
0.3965263205  
0.27740537  
0.16740947  
0.07261059728  
-0.001071288351  
-0.04862180636  
-0.06663282076  
-0.05385534403  
-0.01152417964  
0.05659553546  
0.1444399496  
0.2441287156  
0.3466267054  
0.4425035054  
0.5226988108  
0.5792117549  
0.6056484821  
0.5975985987  
0.5528211465  
0.4712607065  
0.3549279138  
0.2076776257  
0.03493509017  
-0.1566000703  
-0.3592425509  
-0.5645954402  
-0.7638115401  
-0.9478567606  
-1.107803674  
-1.23518056  
-1.322401109  
-1.363287288  
-1.353668126  
-1.292028004  
-1.180111134  
-1.023403653  
-0.8313573689  
-0.6172472171  
-0.3975641882  
-0.1909014655  
-0.01636596348  
0.1083806509  
0.1692414743  
0.1577097666  
0.07249948489  
-0.07950950774  
-0.2832332969  
-0.5163783188  
-0.7514477819  
-0.9585912361  
-1.108988468  
-1.178347576  
-1.150057235  
-1.017547824  
-0.7855006839  
-0.46969906  
-0.09548884668  
0.3049832887  
0.6964104205  
1.044384407  
1.319332596  
1.499825524  
1.57481983  
1.544562575  
1.420058925  
1.221210364  
0.973907004  
0.7064894719  
0.4460799669  
0.2152712748  
0.02959783936  
-0.103892634  
-0.1868450023  
-0.2285988433  
-0.2441912989  
-0.2516814049  
-0.2691996107  
-0.3121388451  
-0.3908674222  
-0.5092481296  
-0.6641255745  
-0.8458045271  
-1.03941204  
-1.226915874  
-1.389516684  
-1.510081302  
-1.575316083  
-1.577423168  
-1.515058968  
-1.393508942  
-1.224093874  
-1.02290064  
-0.8090041839  
-0.6023983303  
-0.4218682107  
-0.2830372476  
-0.1967947862  
-0.1682653584  
-0.1964162484  
-0.2743328277  
-0.3901194302  
-0.5283162578  
-0.6716582449  
-0.8029830667  
-0.9070511572  
-0.9720738129  
-0.9907699816  
-0.9608237418  
-0.8847115827  
-0.7689203466  
-0.6226909114  
-0.4564674146  
-0.280287861  
-0.1023583793  
0.07197213966  
0.2406697964  
0.404844177  
0.5679710687  
0.7346401218  
0.9090549545  
1.093547099  
1.287387388  
1.486131906  
1.681654961  
1.862905496  
2.017291688  
2.132478867  
2.198296867  
2.208422404  
2.161518802  
2.061611137  
1.917604796  
1.742006194  
1.549067092  
1.352674741  
1.164379991  
0.9919261299  
0.8385522279  
0.7032074783  
0.5816265805  
0.4680484179  
0.3572350739  
0.2463662934  
0.1364170738  
0.03269498778  
-0.05561483042  
-0.1168739683  
-0.1391632653  
-0.1128375482  
-0.03300960015  
0.09851613835  
0.272239709  
0.4711471053  
0.6721373595  
0.8485391577  
0.9733890869  
1.023001813  
0.9803013943  
0.8374081171  
0.5970789889  
0.2727582214  
-0.1127836579  
-0.5300571821  
-0.9463380488  
-1.329547948  
-1.651990453  
-1.893424076  
-2.043071854  
-2.100310653  
-2.073986681  
-1.980509122  
-1.841026845  
-1.678139624  
-1.512627898  
-1.360680537  
-1.232002453  
-1.12904216  
-1.047404732  
-0.9773309419  
-0.9059687794  
-0.8200465554  
-0.708511026  
-0.5647068294  
-0.387756651  
-0.1829474272  
0.03893289394  
0.2631714605  
0.4733493051  
0.6538342881  
0.7921405087  
0.8807614828  
0.9181973629  
0.9090075909  
0.8629015206  
0.7930222585  
0.7137211595  
0.6381986597  
0.5763936613  
0.533477948  
0.5091859657  
0.4980881446  
0.4907378934  
0.4754990982  
0.4407359216  
0.3769999555  
0.2788526974  
0.1460279839  
-0.01624356071  
-0.1977907025  
-0.3848310445  
-0.5618425927  
-0.7136726569  
-0.8275309346  
-0.8945680089  
-0.9107956164  
-0.8772435078  
-0.7993609642  
-0.6858058497  
-0.5468675983  
-0.392799348  
-0.2323685275  
-0.07186306329  
0.08528937815  
0.2382420991  
0.3878736704  
0.5355334238  
0.6816517624  
0.8244944882  
0.959341224  
1.078282512  
1.170731871  
1.224631812  
1.228184528  
1.171861605  
1.050343896  
0.8640719516  
0.6200889125  
0.3320041026  
0.01899998539  
-0.2960078972  
-0.5888208627  
-0.8366737009  
-1.020816767  
-1.128587579  
-1.154669769  
-1.101373873  
-0.9779304059  
-0.798944179  
-0.582280439  
-0.3467469732  
-0.1099241751  
0.1135347735  
0.3129243567  
0.4817498431  
0.6172928797  
0.7196621248  
0.7905741399  
0.8321555227  
0.8460041165  
0.8326843567  
0.791723892  
0.7220689939  
0.622851332  
0.4942780377  
0.338409068  
0.1596431583  
-0.0352257589  
-0.2374115052  
-0.4369374251  
-0.62369937  
-0.7885969395  
-0.9245266701  
-1.027063826  
-1.094728076  
-1.128801428  
-1.132760834  
-1.111468932  
-1.07028149  
-1.014264523  
-0.947658932  
-0.8736750954  
-0.7946230872  
-0.7123035086  
-0.6285251548  
-0.5455917983  
-0.466606589  
-0.3954764896  
-0.3365868271  
-0.2941719367  
-0.2714991772  
-0.2700227313  
-0.2886942189  
-0.3235845433  
-0.3679381081  
-0.4126916376  
-0.4474090559  
-0.4615083772  
-0.4456006554  
-0.3927352528  
-0.2993613362  
-0.1658597724  
0.003425342221  
0.200650183  
0.4153452039  
0.6355572314  
0.8490849041  
1.044634267  
1.212747459  
1.34641668  
1.44134354  
1.495877465  
1.510705007  
1.488393617  
1.432890306  
1.349073013  
1.242397236  
1.118664196  
0.9838747925  
0.8441294777  
0.7055048781  
0.573855764  
0.4545170297  
0.3519099904  
0.2691050182  
0.2074140333  
0.1661201102  
0.142427129  
0.1317017434  
0.1280230783  
0.1250025373  
0.1167650169  
0.09895705687  
0.06959944583  
0.0296277297  
-0.01700302518  
-0.06371021799  
-0.1021446057  
-0.1234088675  
-0.119467704  
-0.08452470812  
-0.01615847825  
0.0839691019  
0.2099424312  
0.3519994312  
0.4974435403  
0.6319482054  
0.7410505197  
0.8116444754  
0.8332864025  
0.7991612243  
0.7066339218  
0.5573627075  
0.3570187169  
0.1146966446  
-0.1578726855  
-0.4472010224  
-0.7389192687  
-1.018584765  
-1.272391262  
-1.48778461  
-1.653990762  
-1.762486558  
-1.807425858  
-1.786013686  
-1.698808785  
-1.549899413  
-1.346899423  
-1.100702289  
-0.8249530895  
-0.5352295615  
-0.2479680056  
0.02079061383  
0.256709397  
0.4483733196  
0.5882647143  
0.6733574587  
0.7052438161  
0.689756346  
0.6361273486  
0.5557880191  
0.4609689225  
0.3632888484  
0.2725273621  
0.1957337508  
0.1367877943  
0.09644342625  
0.07280516292  
0.06213950088  
0.05985293119  
0.06145866124  
0.06336266641  
0.06334867765  
0.06068402586  
0.05586891784  
0.05009599333  
0.04456234075  
0.03978819736  
0.03510611971  
0.02844347099  
0.0164649634  
-0.004930987975  
-0.03983583062  
-0.09141749976  
-0.1610361241  
-0.2475635442  
-0.3470535791  
-0.4528543008  
-0.5561673222  
-0.6470085054  
-0.7154211804  
-0.7527779698  
-0.7529614984  
-0.7132539789  
-0.6347904795  
-0.5225091172  
-0.3846023889  
-0.2315585392  
-0.0749316263  
0.07398021447  
0.2053483156  
0.3117651183  
0.3887958923  
0.4350878601  
0.4520351626  
0.4430923545  
0.4128556336  
0.3660908495  
0.3068589313  
0.2378988993  
0.1603526529  
0.07387448724  
-0.02291522417  
-0.1317247321  
-0.2537777615  
-0.3890518097  
-0.5357163061  
-0.6898773578  
-0.8456851328  
-0.9957821582  
-1.132015054  
-1.246285886  
-1.331393578  
-1.381737968  
-1.393774643  
-1.366183139  
-1.299739634  
-1.196960104  
-1.061587026  
-0.8980170218  
-0.7107552901  
-0.5039528458  
-0.2810706152  
-0.04467924696  
0.203604682  
0.4630476494  
0.7336003946  
1.015567922  
1.309148432  
1.613853694  
1.927840863  
2.247215971  
2.565402533  
2.87269387  
3.156122298  
3.399757094  
3.585525122  
3.694557605  
3.709011278  
3.614199072  
3.400794847  
3.066819285  
2.619084658  
2.073818249  
1.456255213  
0.7991199179  
0.1400657748  
-0.4816952709  
-1.02920834  
-1.471569647  
-1.787202424  
-1.966161869  
-2.011125311  
-1.936896752  
-1.768463583  
-1.537844296  
-1.280149762  
-1.029393952  
-0.8146240767  
-0.656890163  
-0.5674354424  
-0.5473027689  
-0.5883216303  
-0.675242942  
-0.7886208107  
-0.9079584674  
-1.01462615  
-1.094144858  
-1.137566675  
-1.141860934  
-1.109376081  
-1.046598955  
-0.9625122645  
-0.8668770027  
-0.7687275684  
-0.6752952151  
-0.591451094  
-0.5196753588  
-0.4604436298  
-0.4128753585  
-0.3754624209  
-0.346707651  
-0.3255475107  
-0.3115016657  
-0.3045486889  
-0.3047970578  
-0.3120477197  
-0.3253804316  
-0.3428637753  
-0.3614730959  
-0.3772500969  
-0.3856838169  
-0.3822530018  
-0.3630287193  
-0.3252392269  
-0.2676869412  
-0.1909562205  
-0.09737273859  
0.009271081357  
0.1241706834  
0.242071642  
0.3578355039  
0.4669329719  
0.5657887468  
0.6519460286  
0.7240502323  
0.7816781662  
0.8250713379  
0.8548362427  
0.8716731485  
0.8761802443  
0.86876394  
0.8496465175  
0.8189717468  
0.7769560237  
0.7240556909  
0.6611156687  
0.5894597079  
0.5109152537  
0.4277599917  
0.3425999769  
