-0.0279149282  
-0.1243752135  
-0.2180137477  
-0.3081054692  
-0.3939500655  
-0.4747575218  
-0.5495348056  
-0.6169913056  
-0.675477718  
-0.7229958387  
-0.7572743054  
-0.7759379942  
-0.7767451175  
-0.7578844576  
-0.7182883762  
-0.6579322878  
-0.5780652674  
-0.4813399529  
-0.371800087  
-0.2547129409  
-0.1362349396  
-0.02293782661  
0.07877723154  
0.1633091259  
0.2264663605  
0.2659729903  
0.2817943266  
0.2762347547  
0.253752273  
0.2205073906  
0.1836710168  
0.1505676478  
0.127765521  
0.1202253846  
0.1306337219  
0.1590245379  
0.2027540014  
0.2568390847  
0.3146253849  
0.3686937854  
0.4118716881  
0.4382143604  
0.443802305  
0.427257144  
0.3898934428  
0.3355121718  
0.2698618196  
0.1998700819  
0.1327595548  
0.07517312013  
0.03243074672  
0.008014997102  
0.003321214557  
0.01769725487  
0.04873535416  
0.09275008133  
0.1453579822  
0.2020669185  
0.2587860566  
0.312194491  
0.3599228556  
0.4005484715  
0.433421178  
0.4583767318  
0.4753955991  
0.4842882488  
0.4844587851  
0.4747957776  
0.453715632  
0.4193351837  
0.369753126  
0.30337583  
0.2192360826  
0.1172403561  
-0.001702322773  
-0.1356893669  
-0.2819732128  
-0.4372294304  
-0.5978898936  
-0.7604873559  
-0.9219398908  
-1.079715928  
-1.231842857  
-1.376733224  
-1.512855454  
-1.638300385  
-1.750322339  
-1.844964375  
-1.916872829  
-1.959388674  
-1.964969657  
-1.925942784  
-1.835522463  
-1.688968474  
-1.484719194  
-1.225296139  
-0.9178118659  
-0.5739362525  
-0.2092702039  
0.1578490985  
0.50797303  
0.822401704  
1.0850276  
1.283908238  
1.412355933  
1.469409557  
1.459642328  
1.392367436  
1.280389791  
1.138505478  
0.9819717362  
0.8251478664  
0.6804548351  
0.5577204375  
0.4639041216  
0.4031288384  
0.3768978178  
0.3843847603  
0.4226887933  
0.4870067755  
0.5707307595  
0.6655238359  
0.7614762144  
0.8474406788  
0.9116338765  
0.9425368491  
0.9300648475  
0.8668891475  
0.74975614  
0.5805792698  
0.3670878208  
0.1228538715  
-0.1334270882  
-0.3794096617  
-0.5912277089  
-0.7460677453  
-0.8248852605  
-0.8148998891  
-0.7115260556  
-0.519412656  
-0.2524105654  
0.06761589935  
0.4130194252  
0.7533910312  
1.059002703  
1.304205864  
1.470329759  
1.547687168  
1.536408108  
1.446001953  
1.293724556  
1.102006467  
0.8953210442  
0.6969548332  
0.5261237475  
0.3958330417  
0.3117307443  
0.2720601948  
0.2686505041  
0.288709962  
0.3171308778  
0.3388959028  
0.3412525554  
0.3153357451  
0.2570561263  
0.1671892521  
0.05072783065  
-0.08432610973  
-0.2284870663  
-0.3723540013  
-0.5079763431  
-0.6298129384  
-0.7351755213  
-0.8241442144  
-0.89900895  
-0.9633939207  
-1.021232598  
-1.075790474  
-1.128904293  
-1.180567912  
-1.228917865  
-1.270615298  
-1.301548774  
-1.3177228  
-1.316167478  
-1.295710168  
-1.257448957  
-1.204838965  
-1.143346172  
-1.079723243  
-1.020997325  
-0.9733544623  
-0.9410947235  
-0.9258632569  
-0.9262995778  
-0.9381977339  
-0.9551758504  
-0.9697529249  
-0.9746736282  
-0.9642300368  
-0.9353459996  
-0.8881914416  
-0.8261920185  
-0.7553819509  
-0.6831800704  
-0.6167905071  
-0.5614956831  
-0.5191676245  
-0.4872998827  
-0.4587831491  
-0.4225331786  
-0.3649427653  
-0.2719619451  
-0.1315076577  
0.06417461434  
0.3165860535  
0.6198205412  
0.960406818  
1.318222441  
1.668385799  
1.983915188  
2.238794371  
2.411063911  
2.485532205  
2.455770977  
2.325139851  
2.106711833  
1.822108957  
1.499360164  
1.170021337  
0.8658656336  
0.6154978921  
0.4412658158  
0.3568070601  
0.3655249709  
0.4601810909  
0.6236830459  
0.831016942  
1.052124999  
1.255421782  
1.411539751  
1.496852992  
1.496335079  
1.405378575  
1.230320323  
0.9875871088  
0.7015519003  
0.4013640163  
0.1171583859  
-0.1238538806  
-0.3008973636  
-0.4022815429  
-0.4268226573  
-0.3838562655  
-0.2918313953  
-0.175687902  
-0.06336973251  
0.01805210766  
0.04611852481  
0.006081408155  
-0.1070559663  
-0.2878155309  
-0.5209456321  
-0.7834273315  
-1.047521523  
-1.284432943  
-1.468104271  
-1.578617737  
-1.604763154  
-1.545420747  
-1.409585787  
-1.215043383  
-0.9858778828  
-0.7491730596  
-0.531353457  
-0.3546782821  
-0.2343647268  
-0.1767393003  
-0.1786566587  
-0.2282691966  
-0.3070194436  
-0.3925747144  
-0.4622800403  
-0.4966484479  
-0.4823812357  
-0.4145081304  
-0.2973325253  
-0.1440469088  
0.02493385395  
0.1847086227  
0.309328884  
0.3754851225  
0.3659561281  
0.2723494766  
0.09677735213  
-0.1477849595  
-0.4385260531  
-0.7451025921  
-1.032968262  
-1.267318677  
-1.417169509  
-1.459065525  
-1.379939905  
-1.178764675  
-0.8667749315  
-0.4662418867  
-0.007951596504  
0.4722619657  
0.9374869099  
1.353666669  
1.6930146  
1.936472363  
2.074952067  
2.109275028  
2.048894964  
1.909691633  
1.711202105  
1.473744973  
1.215859741  
0.9524031188  
0.6935261348  
0.4445839585  
0.2068898455  
-0.02092332122  
-0.2412216134  
-0.4557256875  
-0.6641985969  
-0.8636943136  
-1.048488274  
-1.210675208  
-1.341316931  
-1.431923815  
-1.476014355  
-1.470474702  
-1.416505414  
-1.319990492  
-1.191215229  
-1.043976424  
-0.8941778714  
-0.7580879646  
-0.6504699554  
-0.5827939437  
-0.5617319721  
-0.5881069006  
-0.6564146434  
-0.7549957482  
-0.8668690199  
-0.9711865063  
-1.045204621  
-1.066601  
-1.015935123  
-0.8789805383  
-0.64867823  
-0.3264556148  
0.07728730788  
0.5436324935  
1.046542391  
1.555099345  
2.036348908  
2.458453913  
2.793792945  
3.021662412  
3.130251105  
3.117683242  
2.991999424  
2.77010117  
2.475788816  
2.1371388  
1.783534575  
1.44269321  
1.138030333  
0.8866463168  
0.6981225906  
0.5742324184  
0.5095269343  
0.4926754174  
0.5083432484  
0.5393458801  
0.5687981877  
0.5820112836  
0.5679348377  
0.5200209052  
0.4364754052  
0.3199367676  
0.1766875273  
0.01555623794  
-0.1533192344  
-0.3197057698  
-0.4743183896  
-0.6096041699  
-0.7202078008  
-0.8031176295  
-0.8575377877  
-0.8845497222  
-0.8866543233  
-0.8672876586  
-0.8303868691  
-0.7800575397  
-0.7203796198  
-0.6553399954  
-0.5888575604  
-0.5248626937  
-0.4673617971  
-0.4204480012  
-0.3882057576  
-0.3745203659  
-0.3827832083  
-0.4155473846  
-0.4741651157  
-0.5584798874  
-0.6666049545  
-0.7948458271  
-0.9377636531  
-1.088401263  
-1.2386532  
-1.379749207  
-1.502834837  
-1.599592423  
-1.662879916  
-1.687325177  
-1.669830689  
-1.609938057  
-1.509985983  
-1.375040054  
-1.21254999  
-1.031749912  
-0.8428417825  
-0.6560327982  
-0.4805398191  
-0.3236907974  
-0.190257813  
-0.08212611663  
0.001629802317  
0.06425681211  
0.1104909819  
0.145503308  
0.1738098099  
0.1983363547  
0.219829998  
0.2367424907  
0.2456496854  
0.2421632606  
0.2221985733  
0.1833846593  
0.1263570275  
0.05566814703  
-0.01990056452  
-0.08776032281  
-0.1326707035  
-0.1385383073  
-0.09060534528  
0.02225655773  
0.2055099694  
0.4574839466  
0.7687366104  
1.122372344  
1.495324778  
1.860455315  
2.189211455  
2.45449756  
2.633402237  
2.709429771  
2.673984901  
2.52695368  
2.276370341  
1.937275069  
1.529972986  
1.077961313  
0.6058121616  
0.1372555362  
-0.3063494484  
-0.7070536046  
-1.050867092  
-1.327873282  
-1.532032526  
-1.66080531  
-1.714722097  
-1.696986932  
-1.613161228  
-1.47091864  
-1.279830031  
-1.051108845  
-0.7972476421  
-0.5315078544  
-0.2672379521  
-0.01705955347  
0.208009162  
0.3993857572  
0.5515994834  
0.6626904997  
0.7342622482  
0.7711420783  
0.7806747601  
0.7717297981  
0.7535368191  
0.7345192922  
0.7212650022  
0.7177875956  
0.7251657703  
0.7416097135  
0.7629132513  
0.7832407675  
0.796100709  
0.7953650808  
0.7761954459  
0.7357289078  
0.6734481111  
0.5911794417  
0.4927403348  
0.3832893847  
0.2684899313  
0.1536091055  
0.04269672855  
-0.06203071283  
-0.1605020063  
-0.2547380476  
-0.348436118  
-0.4462263983  
-0.5527100488  
-0.6713992656  
-0.8037138591  
-0.9481870755  
-1.099999973  
-1.250936276  
-1.389794851  
-1.50322509  
-1.576927865  
-1.597083065  
-1.551869717  
-1.432916465  
-1.236536997  
-0.9646096541  
-0.6250201269  
-0.2315906208  
0.1965186877  
0.6359211133  
1.060567153  
1.44366344  
1.759804141  
1.987150249  
2.109456639  
2.117743616  
2.011420136  
1.798699017  
1.496202755  
1.127737894  
0.7223177601  
0.3115913101  
-0.07306565514  
-0.4034945666  
-0.6573991399  
-0.8203980459  
-0.887231263  
-0.861987442  
-0.757324443  
-0.5927885774  
-0.3924465003  
-0.1821271906  
0.01339559048  
0.1729391917  
0.2808982581  
0.3284704117  
0.3140337039  
0.2426920206  
0.1250956902  
-0.02426557333  
-0.1890613741  
-0.3531556112  
-0.5024483977  
-0.6263145764  
-0.7185085984  
-0.7774678508  
-0.8060087785  
-0.810495194  
-0.7996065137  
-0.7828752889  
-0.7691998018  
-0.7655227002  
-0.7758527916  
-0.8007621841  
-0.8374133133  
-0.8801166523  
-0.9213179414  
-0.9528693896  
-0.9673908903  
-0.9594981119  
-0.9267176953  
-0.8699270905  
-0.7932579647  
-0.7034755221  
-0.6089302156  
-0.5182577977  
-0.439046167  
-0.3766775233  
-0.3335549073  
-0.3088271555  
-0.2986669316  
-0.2970428357  
-0.2968652268  
-0.2912975499  
-0.2750181536  
-0.245210604  
-0.2021125959  
-0.1490250406  
-0.09177373857  
-0.03769866354  
0.005658613215  
0.03197653263  
0.0374387376  
0.02170439946  
-0.01160768178  
-0.05498814617  
-0.09765251292  
-0.1266229717  
-0.1281356549  
-0.0891965478  
0.000891092921  
0.1491946388  
0.3581372316  
0.6248958731  
0.941243571  
1.293856067  
1.665048789  
2.033902463  
2.377702569  
2.673598595  
2.900371081  
3.040170476  
3.080074742  
3.013327425  
2.840108652  
2.567742985  
2.210288263  
1.787507995  
1.323310598  
0.8437838887  
0.3750360647  
-0.05894098494  
-0.4381512555  
-0.7480018094  
-0.9800943231  
-1.132317103  
-1.208257796  
-1.216045144  
-1.166795227  
-1.072910979  
-0.9464815433  
-0.7980115793  
-0.6356556287  
-0.4650314168  
-0.2895991081  
-0.1114826589  
0.06746791885  
0.2446074749  
0.4156655407  
0.574340793  
0.7124350792  
0.8205249594  
0.889079292  
0.9098264868  
0.8771360777  
0.7891669324  
0.6485770079  
0.4626595515  
0.242871808  
0.00382152588  
-0.2381423025  
-0.4665308538  
-0.6663001325  
-0.8252114143  
-0.9348317859  
-0.9910905493  
-0.9943805844  
-0.9492449587  
-0.8637423033  
-0.7485829517  
-0.6161397857  
-0.4794147912  
-0.3510339156  
-0.2423162698  
-0.1624694939  
-0.1179424856  
-0.1119935351  
-0.1445042175  
-0.2120756321  
-0.3084142104  
-0.424987451  
-0.5518836972  
-0.6787822846  
-0.7959155905  
-0.8948919138  
-0.9692832178  
-1.014908822  
-1.029801606  
-1.013917311  
-0.968663454  
-0.8963892147  
-0.7999477278  
-0.6824288873  
-0.5471143098  
-0.3976341174  
-0.238262505  
-0.0742393495  
0.08801401694  
0.2408940086  
0.375908074  
0.4842816206  
0.5578210324  
0.5899315302  
0.5766316315  
0.5173936886  
0.4156518343  
0.2788633851  
0.1180638203  
-0.05305215418  
-0.219443173  
-0.3662536878  
-0.480377699  
-0.5518415474  
-0.5748083408  
-0.5480634262  
-0.4749031927  
-0.3624397081  
-0.2204109917  
-0.0596761537  
0.1093833223  
0.2783015176  
0.4415695129  
0.5970989386  
0.7460074648  
0.8917367067  
1.038634917  
1.190223124  
1.347455387  
1.507298554  
1.661936896  
1.798815907  
1.901620316  
1.952124036  
1.93269161  
1.829091854  
1.633192021  
1.345093844  
0.9743300657  
0.5398573784  
0.06874694524  
-0.4063300523  
-0.8505509763  
-1.230889091  
-1.520053349  
-1.699874794  
-1.763664394  
-1.717193236  
-1.578126786  
-1.373941813  
-1.138594501  
-0.908335233  
-0.7172297888  
-0.5929570888  
-0.5534258078  
-0.6046470426  
-0.7401092405  
-0.9417230084  
-1.182174558  
-1.428358884  
-1.645435255  
-1.800973575  
-1.868687559  
-1.83131171  
-1.682315352  
-1.426311341  
-1.078186911  
-0.6611324704  
-0.2038664879  
0.2625592739  
0.7079894933  
1.106050185  
1.436394276  
1.686097467  
1.85011347  
1.93081591  
1.93674821  
1.880802949  
1.778092187  
1.643818363  
1.491407261  
1.331154726  
1.169522191  
1.009147441  
0.8495004047  
0.6880430469  
0.5216575856  
0.3480738757  
0.1670493536  
-0.01892629838  
-0.2045063344  
-0.3819794645  
-0.5422744016  
-0.6762964876  
-0.7763650895  
-0.8374726623  
-0.8581569472  
-0.8408148333  
-0.79140605  
-0.7185810848  
-0.6323911568  
-0.5427864862  
-0.4581537635  
-0.3841335838  
-0.3229075521  
-0.2730569412  
-0.2300138117  
-0.1870070336  
-0.1363450999  
-0.07081251732  
0.01505044501  
0.1239800996  
0.255490612  
0.4058890715  
0.5687931965  
0.7360240679  
0.8987233865  
1.048488569  
1.178348975  
1.283427439  
1.361215419  
1.411442066  
1.435607492  
1.436288099  
1.416380323  
1.378416616  
1.324088797  
1.254068256  
1.168124902  
1.065513654  
0.9455393358  
0.8081638338  
0.654535784  
0.487311339  
0.3107102021  
0.130259058  
-0.04772532608  
-0.2168383293  
-0.3713531413  
-0.5069213526  
-0.6210693226  
-0.7134238473  
-0.7855970525  
-0.8407732082  
-0.8830406185  
-0.9165988617  
-0.9449732781  
-0.9703652475  
-0.9932620058  
-1.012364981  
-1.024858284  
-1.026971109  
-1.014741163  
-0.9848517873  
-0.9353947368  
-0.8664338176  
-0.7802540825  
-0.6812486968  
-0.5754424678  
-0.4697127027  
-0.3708271034  
-0.2844340784  
-0.214187567  
-0.1611316699  
-0.1234853225  
-0.0968716901  
-0.07499919343  
-0.05071831873  
-0.01732059266  
0.03011111234  
0.09349956029  
0.1709342883  
0.2563585099  
0.339897907  
0.4088384466  
0.4491821573  
0.4475949996  
0.3934902023  
0.2809537152  
0.1102053705  
-0.1116523266  
-0.3707635492  
-0.6475653249  
-0.9186516108  
-1.159253186  
-1.346006557  
-1.459656518  
-1.487340854  
-1.424152006  
-1.273785702  
-1.04822039  
-0.7664789338  
-0.4526726303  
-0.1335842313  
0.1639167103  
0.4153255837  
0.6006059943  
0.7057550615  
0.7237770641  
0.6550389867  
0.5070688156  
0.2938774743  
0.03489185539  
-0.2464093999  
-0.5240914171  
-0.7715192834  
-0.9632259911  
-1.07679833  
-1.094693026  
-1.005839837  
-0.806900526  
-0.5030069212  
-0.1078687619  
0.3568528298  
0.8629143529  
1.377540647  
1.866006951  
2.294532595  
2.633208466  
2.858650487  
2.95610931  
2.920780623  
2.758168184  
2.483445504  
2.119862979  
1.696388832  
1.244822695  
0.7967169999  
0.380450328  
0.01876797012  
-0.2729405325  
-0.487454168  
-0.6255788704  
-0.6951056987  
-0.709046104  
-0.6834059932  
-0.6348030623  
-0.5782522175  
-0.5253833682  
-0.4833287821  
-0.4543646489  
-0.4363255049  
-0.4236791723  
-0.4090631059  
-0.3850293797  
-0.3457155887  
-0.2881876969  
-0.213245767  
-0.125576782  
-0.03323875317  
0.0534450077  
0.1234086203  
0.166542267  
0.1753180869  
0.1460769204  
0.0797780176  
-0.01791702438  
-0.1372625256  
-0.265668899  
-0.3893985015  
-0.4954810453  
-0.5735549145  
-0.6173636905  
-0.6256638836  
-0.6023955489  
-0.5560574879  
-0.4983726375  
-0.4424158521  
-0.4004983263  
-0.3821095391  
-0.3922649724  
-0.4305176094  
-0.4908047669  
-0.5621858273  
-0.6303599429  
-0.6797423991  
-0.6957869412  
-0.6671837095  
-0.5875914232  
-0.4566455101  
-0.2800673641  
-0.0689018128  
0.1620116439  
