13.60274879  
15.54865312  
23.46427769  
22.8131803  
229.0210135  
8299.442659  
23420.33926  
11590.90792  
18202.37846  
29520.56777  
9877.153343  
949.1407971  
22016.91712  
55497.43752  
5454.943968  
5348.35006  
86716.22537  
6887.794675  
8119.658595  
7439.20399  
11920.12934  
12335.85435  
2297.839637  
50.58470039  
31521.14967  
2060.455995  
4689.215193  
1455.535778  
7281.940959  
21383.32584  
10831.15305  
7656.12066  
4438.239402  
3820.504892  
4849.896686  
3972.164467  
584.2164981  
1309.93455  
7113.549821  
1459.868192  
5163.330535  
5210.179635  
7199.016487  
2286.732263  
5275.179958  
3262.172343  
4780.15476  
92.28063796  
122.8135193  
1286.379901  
1395.590893  
617.2636403  
1907.750387  
95.54590895  
644.883594  
2592.042579  
911.00928  
856.5389542  
14.35344843  
429.729411  
629.2752577  
1300.761276  
204.80745  
12.11791086  
182.368823  
164.4778181  
55.53348659  
33.18149029  
23.71165132  
27.30501815  
7.025649477  
38.4729176  
3.57821964  
5.18180819  
4.470736572  
3.177564743  
4.123996332  
2.083704702  
2.491888977  
2.509308286  
1.76555639  
0.6928825462  
1.632578623  
0.9059094431  
1.257414997  
1.568501464  
1.141567472  
1.268280864  
1.285741476  
1.254908702  
1.08496087  
1.178432318  
1.148491909  
1.052053222  
1.072105755  
0.9850469888  
0.9764089223  
0.9436745132  
0.9037737427  
0.9030820544  
0.8595799977  
0.8360293699  
0.8040838909  
0.7786854176  
0.7468401316  
0.7235755465  
0.7055260712  
0.6709438372  
0.6533252828  
0.6304421051  
0.6051681259  
0.5862699747  
0.5650126701  
0.5465444764  
0.5274780066  
0.5105308298  
0.4919732312  
0.4755553268  
0.4597237653  
0.4445789708  
0.4300027429  
0.4156558523  
0.4023082378  
0.3890913381  
0.376458121  
0.3643972551  
0.3527823401  
0.341592865  
0.3308311395  
0.3205943828  
0.3104877835  
0.3009266498  
0.2917464935  
0.2828050844  
0.274254333  
0.2660200024  
0.2580621864  
0.2503680513  
0.2429823015  
0.2358629436  
0.2289853888  
0.2223688321  
0.2159485311  
0.2097899326  
0.2038252181  
0.1980564585  
0.192511706  
0.1871295731  
0.1819474256  
0.1769351002  
0.1720877242  
0.1674007807  
0.1628711757  
0.158489813  
0.1542438458  
0.1501439493  
0.1461725834  
0.142328749  
0.1386076608  
0.1350043288  
0.1315129932  
0.1281291814  
0.1248562008  
0.1216801418  
0.1186075059  
0.1156244137  
0.1127319714  
0.109925917  
0.107202255  
0.1045647066  
0.10200104  
0.0995185079  
0.09710469654  
0.09476562331  
0.09248740925  
0.0902797184  
0.08813555574  
0.08605211943  
0.08402850075  
0.08205976446  
0.08015017859  
0.07829549166  
0.07648878697  
0.07473309802  
0.0730254059  
0.07136061638  
0.06974419423  
0.06817432637  
0.06664547845  
0.06516072697  
0.06370813298  
0.06230050314  
0.06092565781  
0.05958983461  
0.05829176191  
0.05701979301  
0.05578776161  
0.05458330814  
0.05341203564  
0.05227172941  
0.05115889748  
0.05007620888  
0.04901449505  
0.04798508469  
0.04698060301  
0.04600144343  
0.04504748872  
0.04411555087  
0.04320476816  
0.04231742395  
0.04145213534  
0.0406072993  
0.03978435189  
0.03897853941  
0.0381948094  
0.03742758298  
0.03668013969  
0.03595343578  
0.03523483494  
0.03453935586  
0.0338601074  
0.03319450442  
0.03254457418  
0.03191231182  
0.03129101836  
0.03068467064  
0.0300934009  
0.02951455928  
0.0289470168  
0.02839329522  
0.02785539064  
0.02732494644  
0.02681025748  
0.02630471789  
0.02581002176  
0.02532504225  
0.02485308883  
0.02439014629  
0.02393679099  
0.02349405728  
0.02306157569  
0.02263754601  
0.02222218369  
0.02181474156  
0.02141770939  
0.02102967655  
0.02064575623  
0.02027378504  
0.01990839584  
0.01955017844  
0.0191988617  
0.01885737028  
0.01852037851  
0.01819033073  
0.01786740119  
0.01755184102  
0.01724207554  
0.01693878868  
0.01664268757  
0.01635055536  
0.01606522353  
0.0157858571  
0.01551023794  
0.01524484012  
0.01497827817  
0.01472022379  
0.01446671583  
0.01421864353  
0.01397325623  
0.01373728247  
0.01350141095  
0.01327266866  
0.01304689787  
0.01282604081  
0.01260933387  
0.01239698921  
0.01218825943  
0.01198394796  
0.01178122802  
0.01158464065  
0.01139080229  
0.01120135971  
0.01101558696  
0.01083252512  
0.01065317592  
0.01047622744  
0.01030423576  
0.01013430803  
0.00996836797  
0.009804580874  
0.009643817986  
0.009485941893  
0.009332198385  
0.009179669085  
0.009030210334  
0.008883499835  
0.008738965225  
0.008598525667  
0.00845886162  
0.008322177097  
0.00818834253  
0.00805689427  
0.007927855078  
0.007799468009  
0.007675245085  
0.007552097409  
0.007432667219  
0.007313348887  
0.007197094663  
0.007083172251  
0.006970264611  
0.006860681152  
0.006751838696  
0.006644911772  
0.006539284908  
0.006437093283  
0.006335104912  
0.00623602589  
0.006138159543  
0.006041208148  
0.0059471388  
0.005853424108  
0.005762645305  
0.005672234461  
0.0055837757  
0.005496781906  
0.005411261003  
0.005327479791  
0.005244766866  
0.005162669869  
0.005083002835  
0.005004728409  
0.004926766418  
0.004850842805  
0.004776133315  
0.004702098008  
0.004630410936  
0.004558820499  
0.00448787047  
0.004419287982  
0.004351465001  
0.00428480824  
0.004219096752  
0.004155076616  
0.004091419743  
0.004028548964  
0.003967596141  
0.003906705803  
0.003847172605  
0.003788246223  
0.003731343386  
0.003673851862  
0.003618719022  
0.003563808706  
0.003509668597  
0.003456674545  
0.003403503785  
0.003352396992  
0.003302146671  
0.00325227095  
0.003203026569  
0.003154285005  
0.003107444481  
0.003060266404  
0.003013764547  
0.002969228791  
0.002924644367  
0.002880840798  
0.002837227802  
0.002795204986  
0.002752974908  
0.002711671794  
0.00267123854  
0.002632043705  
0.002592505974  
0.00255440865  
0.002515717817  
0.00247809626  
0.002442252976  
0.002406118868  
0.002370198677  
0.002335309855  
0.002300783688  
0.002266388272  
0.002233153403  
0.002200765293  
0.002168381596  
0.002136178698  
0.002105209918  
0.002074046975  
0.002044174935  
0.002014112261  
0.0019852155  
0.001956016825  
0.001927622085  
0.001899633733  
0.001872748085  
0.001845590153  
0.001818778381  
0.001792860444  
0.001767022712  
0.00174178613  
0.001717139333  
0.0016926888  
0.001668646507  
0.001644932022  
0.001621841918  
0.001599414759  
0.001576723291  
0.001554291647  
0.001533138277  
0.001511745537  
0.001490364807  
0.001470276273  
0.001450017155  
0.001430191473  
0.001410320573  
0.001391482115  
0.001372776992  
0.00135426277  
0.001335845903  
0.00131837419  
0.001300935621  
0.001283520929  
0.001266380308  
0.001250320584  
0.001234331688  
0.001218044514  
0.001202802833  
0.001187354324  
0.001172653215  
0.00115745066  
0.001143025412  
0.00112902018  
0.001115420564  
0.001101796411  
0.001088455041  
0.001075332308  
0.001062842475  
0.001050109917  
0.001037936312  
0.001026410791  
0.001014812839  
0.001003324572  
0.0009921241362  
0.0009819870588  
0.0009707920652  
0.0009606654765  
0.0009508328072  
0.0009408424284  
0.0009310758546  
0.0009219397838  
0.0009126227226  
0.0009036587959  
0.0008951914453  
0.0008866424584  
0.0008785981097  
0.0008707196679  
0.0008630931669  
0.0008554153372  
0.0008483333947  
0.0008412716304  
0.0008348742029  
0.0008282142506  
0.0008216197942  
0.000816015796  
0.0008103235756  
0.000804470498  
0.0007988715307  
0.0007940656102  
0.0007891981677  
0.000784144295  
0.0007798629892  
0.0007754330021  
0.0007712978235  
0.0007673501816  
0.0007639624542  
0.0007602135117  
0.0007572255195  
0.0007540018062  
0.0007510147995  
0.0007486451516  
0.0007458067995  
0.0007440781775  
0.0007420244604  
0.0007404421044  
0.0007389726502  
0.0007374488107  
0.0007362260228  
0.0007352230739  
0.0007346346183  
0.0007342632784  
0.000733878431  
0.0007333533838  
