------------------------------------------
Setting up environment variables
---
LD_LIBRARY_PATH is .:/opt/software/fix/1.065/MATLAB_Compiler_Runtime/v83/runtime/glnxa64:/opt/software/fix/1.065/MATLAB_Compiler_Runtime/v83/bin/glnxa64:/opt/software/fix/1.065/MATLAB_Compiler_Runtime/v83/sys/os/glnxa64
Warning: Name is nonexistent or not a directory: /usr/local/fsl/etc/matlab
[> In path at 109
  In startup at 1] 
Warning: Name is nonexistent or not a directory: /usr/local/fmrib/fmt
[> In path at 109
  In startup at 2] 
/home/mpib/LNDG/StateSwitch/WIP_rest/preproc/B_data/D_preproc/1124/preproc/rest/FEAT.feat/
    28     1

    28     2

    28     3

    28     4

    28     5

    28     6

    28     7

    28     8

    28     9

    28    10

    28    11

    28    12

    28    13

    28    14

    28    15

    28    16

    28    17

    28    18

    28    19

    28    20

    28    21

    28    22

    28    23

    28    24

    28    25

    28    26

    28    27

    28    28

End of Matlab Script
