-0.07363231062  
-0.2451850694  
-0.4119863499  
-0.5652364188  
-0.6969342907  
-0.8005355908  
-0.8715304495  
-0.907877745  
-0.9102707833  
-0.8821783537  
-0.8296527251  
-0.7608781026  
-0.6854807666  
-0.6136339363  
-0.55503096  
-0.5178171179  
-0.5076157672  
-0.5267614162  
-0.5738693481  
-0.6438319153  
-0.7282762002  
-0.8164719786  
-0.8966068369  
-0.9572880432  
-0.9890849322  
-0.9859039299  
-0.9459982964  
-0.8724392651  
-0.772949272  
-0.6590822111  
-0.5448141611  
-0.4447232269  
-0.371998718  
-0.3365566303  
-0.3435576887  
-0.3925680492  
-0.4775097766  
-0.5874461476  
-0.7080969317  
-0.8238623143  
-0.9200380546  
-0.9848659585  
-1.011075938  
-0.9966603354  
-0.9447483643  
-0.862605742  
-0.7599401646  
-0.646822575  
-0.5316089339  
-0.4192532897  
-0.3103401975  
-0.201033876  
-0.08398841763  
0.04993435028  
0.2094193793  
0.4003407852  
0.6237154941  
0.8743789909  
1.140667034  
1.40522836  
1.646911329  
1.843473288  
1.974721944  
2.025609689  
1.988791219  
1.866220669  
1.669509094  
1.418938303  
1.14123052  
0.8663775644  
0.6239472421  
0.4394077019  
0.3309678707  
0.3074043159  
0.3671578377  
0.4988339517  
0.6830172882  
0.8951217359  
1.108858426  
1.299818407  
1.448641858  
1.54333542  
1.58042334  
1.564780555  
1.508230417  
1.427127024  
1.339330409  
1.26103273  
1.203933446  
1.173181626  
1.166380307  
1.17380653  
1.179787921  
1.165028075  
1.109534817  
0.9957247095  
0.8112656018  
0.5512604315  
0.2194913173  
-0.171446504  
-0.6011145621  
-1.043174644  
-1.468061837  
-1.846049649  
-2.150361457  
-2.359973472  
-2.46182323  
-2.45219854  
-2.337185687  
-2.132152444  
-1.860326051  
-1.550615535  
-1.234887597  
-0.9449516134  
-0.709532021  
-0.5515132645  
-0.4857227074  
-0.5174715967  
-0.6420193485  
-0.8450322526  
-1.104021803  
-1.39064078  
-1.673618915  
-1.922035914  
-2.108580865  
-2.212428618  
-2.221397606  
-2.133115483  
-1.95504343  
-1.7033361  
-1.400675141  
-1.073340304  
-0.7478959879  
-0.4479271753  
-0.1912600749  
0.01196462944  
0.160112075  
0.2596761002  
0.3237745333  
0.3697664912  
0.4163484559  
0.4805736352  
0.5752241608  
0.7069171325  
0.8751971981  
1.072708532  
1.286373143  
1.499360842  
1.693507869  
1.851806004  
1.960589909  
2.011113048  
2.000338476  
1.930884158  
1.810212899  
1.649273599  
1.46085119  
1.257924343  
1.052282257  
0.8535844828  
0.6689601412  
0.5031200782  
0.3588839652  
0.2379378981  
0.1416352745  
0.07163037793  
0.03020576498  
0.02020239652  
0.04455155278  
0.1054813479  
0.203536307  
0.3365940776  
0.4990717806  
0.681502513  
0.8706221233  
1.050025007  
1.201394988  
1.306201421  
1.347698212  
1.312982959  
1.19486212  
0.9932332439  
0.7157738844  
0.3777609285  
0.0009761678269  
-0.3882432165  
-0.7616158812  
-1.091902644  
-1.355898067  
-1.537042524  
-1.627294879  
-1.628002181  
-1.549616979  
-1.410284583  
-1.233468576  
-1.044926843  
-0.8694485075  
-0.7277955902  
-0.6342643416  
-0.5952069632  
-0.6086873089  
-0.6653094692  
-0.7500692988  
-0.8449288981  
-0.9317294462  
-0.9949957315  
-1.024226501  
-1.015336387  
-0.9710610825  
-0.9002896144  
-0.8164559691  
-0.7352553976  
-0.6720588431  
-0.6394240199  
-0.6450828954  
-0.6907051724  
-0.7716038919  
-0.8773992132  
-0.9935060577  
-1.103189111  
-1.189842208  
-1.239128577  
-1.240663658  
-1.188999774  
-1.083817229  
-0.9293574683  
-0.7332649834  
-0.5051029101  
-0.2548475192  
0.008359609054  
0.2769778401  
0.5452624354  
0.8089139084  
1.064340647  
1.307764281  
1.534460047  
1.738366616  
1.912237061  
2.048375353  
2.139858199  
2.182012535  
2.173847252  
2.119096639  
2.026582788  
1.909718792  
1.785117239  
1.670446696  
1.581837352  
1.531242048  
1.524207581  
1.558471046  
1.623679373  
1.702365835  
1.772103256  
1.808567641  
1.789072113  
1.696044421  
1.519913602  
1.260937959  
0.9296753546  
0.5459871455  
0.1366997518  
-0.2677404634  
-0.6371504434  
-0.9454465942  
-1.173903274  
-1.313354233  
-1.365053944  
-1.340103206  
-1.257561143  
-1.14156276  
-1.017874352  
-0.9104122387  
-0.8381948228  
-0.8131458813  
-0.8389989536  
-0.9113834095  
-1.019014448  
-1.145728644  
-1.273035096  
-1.382778372  
-1.45954255  
-1.492482972  
-1.47639057  
-1.411909583  
-1.30497191  
-1.165607563  
-1.006371229  
-0.8406408661  
-0.6810482647  
-0.5382244417  
-0.4199813679  
-0.3309659704  
-0.2727205985  
-0.2440582468  
-0.2416039613  
-0.2603760879  
-0.2943057084  
-0.3366448246  
-0.3802718383  
-0.4179492448  
-0.4426100451  
-0.447751793  
-0.4279841305  
-0.3797121563  
-0.3018894745  
-0.1966945713  
-0.06996956076  
0.06876243657  
0.206834823  
0.3295852938  
0.4220595525  
0.4711053497  
0.4675753384  
0.4082850309  
0.2973658426  
0.1466915906  
-0.02482459003  
-0.1930951669  
-0.331734774  
-0.4156044225  
-0.4245357824  
-0.346674507  
-0.1808875626  
0.06220755786  
0.3608538819  
0.6844297328  
0.997149743  
1.262734091  
1.449408817  
1.534528391  
1.508135735  
1.374917595  
1.154199853  
0.8779308204  
0.5868526759  
0.325342608  
0.1355771696  
0.05179973033  
0.09545342389  
0.2718463786  
0.5688167549  
0.957612602  
1.39590356  
1.832570232  
2.213682947  
2.488925616  
2.617657604  
2.573855048  
2.349316949  
1.954734692  
1.418504172  
0.7834365052  
0.1017980619  
-0.5706913803  
-1.181142324  
-1.685275895  
-2.051987241  
-2.266146144  
-2.32933559  
-2.25848348  
-2.082641851  
-1.838391409  
-1.564544873  
-1.296879777  
-1.063634462  
-0.8823684242  
-0.7585769853  
-0.6861953551  
-0.6498463266  
-0.6284139465  
-0.5993536395  
-0.5430269183  
-0.4463711936  
-0.3053314195  
-0.125682419  
0.07785218726  
0.2840049412  
0.4684711888  
0.6079192106  
0.6838290033  
0.6855449805  
0.6120467062  
0.4721778438  
0.2833270885  
0.06879576192  
-0.1456890108  
-0.3357591839  
-0.4818709325  
-0.5719308446  
-0.60269426  
-0.5797633487  
-0.5162379995  
-0.4302786701  
-0.342006386  
-0.2702442723  
-0.2296129593  
-0.22841406  
-0.2675897344  
-0.3408644203  
-0.4359861455  
-0.5368262825  
-0.6259548577  
-0.6872904862  
-0.7084051023  
-0.6821728447  
-0.6075581955  
-0.4895023585  
-0.3379920221  
-0.1665270333  
0.009734495124  
0.1758601532  
0.3187830843  
0.4285113043  
0.4988003654  
0.5272910387  
0.5151910617  
0.4666435582  
0.3879301823  
0.2866701529  
0.1711189953  
0.04963056883  
-0.06971010896  
-0.1793157661  
-0.2722525766  
-0.3423856096  
-0.3845669399  
-0.3948900902  
-0.3710029509  
-0.312437304  
-0.2208868663  
-0.1003724703  
0.04278589536  
0.2002280454  
0.3620674895  
0.5176417846  
0.6564517734  
0.7692015359  
0.8488424183  
0.8914879023  
0.8970866362  
0.869740071  
0.8175819764  
0.7521804442  
0.6874732244  
0.638312413  
0.6187417108  
0.6401923321  
0.7098117567  
0.8291387868  
0.9933281703  
1.191079845  
1.405334224  
1.614718652  
1.795628313  
1.924718122  
1.98153883  
1.950991698  
1.825297766  
1.605225657  
1.300396872  
0.9286203705  
0.5143104548  
0.08617064835  
-0.3255845096  
-0.6921488637  
-0.9888598685  
-1.197445002  
-1.307565192  
-1.317525385  
-1.234128841  
-1.071751722  
-0.8507817253  
-0.5956204588  
-0.3324645274  
-0.08706508511  
0.1173496192  
0.261846582  
0.3331582439  
0.3245753534  
0.2363309233  
0.0754655049  
-0.1448228324  
-0.4062909255  
-0.6871795216  
-0.964046293  
-1.213783563  
-1.415664895  
-1.553241702  
-1.615909064  
-1.599971472  
-1.509076245  
-1.353936184  
-1.151332126  
-0.9224720305  
-0.6908587634  
-0.4798859877  
-0.3104226194  
-0.1986578475  
-0.1544551633  
-0.1804044327  
-0.2716766514  
-0.4166870607  
-0.5984786492  
-0.7966354911  
-0.9895063765  
-1.156452071  
-1.279876275  
-1.346815551  
-1.349943986  
-1.28791809  
-1.165081178  
-0.9906074955  
-0.7772359946  
-0.539774234  
-0.293558973  
-0.05306057316  
0.1692314675  
0.3635440057  
0.5231398515  
0.6442504928  
0.7256916505  
0.768283138  
0.7742026796  
0.7464001266  
0.6881776904  
0.6029961047  
0.4945056256  
0.3667674095  
0.2245665453  
0.0737106721  
-0.07880395241  
-0.2248459606  
-0.3554829417  
-0.4615780164  
-0.5345972222  
-0.567517019  
-0.5556896645  
-0.4975218425  
-0.3948437005  
-0.2528816817  
-0.07982401486  
0.1139824832  
0.3170923114  
0.5181312275  
0.7069042723  
0.8752931376  
1.01782037  
1.131827681  
1.217266459  
1.276181719  
1.311991737  
1.328711074  
1.330241241  
1.319839607  
1.299824253  
1.271527921  
1.235455542  
1.191583792  
1.139711588  
1.079779493  
1.012109298  
0.9375235544  
0.857364835  
0.7734340159  
0.6878982532  
0.6032027771  
0.5220144059  
0.4471945096  
0.3817718014  
0.3288710711  
0.2915500553  
0.2725000931  
0.2736052106  
0.2953929487  
0.3364488723  
0.392919362  
0.4582270359  
0.5231352372  
0.5762521326  
0.605002933  
0.5970180179  
0.5418029599  
0.4324702838  
0.267282268  
0.05073125387  
-0.2060638289  
-0.4857976161  
-0.7662836434  
-1.022535311  
-1.229399988  
-1.364436111  
-1.410664217  
-1.358818733  
-1.208791114  
-0.9700487994  
-0.6609488257  
-0.3070193952  
0.06158861595  
0.4131669304  
0.7176562439  
0.9496071911  
1.090559529  
1.130581357  
1.06883187  
0.9131401836  
0.6787149083  
0.386195173  
0.05931796734  
-0.2775030006  
-0.6014124594  
-0.8929453922  
-1.137312052  
-1.325085198  
-1.452315248  
-1.520159306  
-1.53415656  
-1.503281487  
-1.438895857  
-1.353690035  
-1.260665859  
-1.172184758  
-1.09908109  
-1.049852078  
-1.029934059  
-1.041120202  
-1.081187707  
-1.143814116  
-1.218871414  
-1.293144656  
-1.35147792  
-1.378288202  
-1.359313226  
-1.283405139  
-1.144151445  
-0.9410894345  
-0.6803265679  
-0.3744260165  
-0.04152162435  
0.2962863435  
0.6151043649  
0.8917348189  
1.10620931  
1.244041974  
1.297915269  
1.268574579  
1.164795848  
1.002400949  
0.8024262492  
0.5886570176  
0.3848337177  
0.2118746641  
0.0854889524  
0.01447246443  
-6.485159622e-05  
0.03553371308  
0.108692035  
0.2026099136  
0.2987888488  
0.379691463  
0.4311722383  
0.444325259  
0.4165105315  
0.3514303358  
0.2582908555  
0.1502032511  
0.04211039377  
-0.05143699386  
-0.1183018504  
-0.1502897181  
-0.1439832597  
-0.1008086314  
-0.02637943499  
0.07071227119  
0.1804125293  
0.2927573221  
0.3991924591  
0.493470402  
0.5720079167  
0.6337140524  
0.6793829036  
0.7108289209  
0.7299774533  
0.7381198534  
0.7355006835  
0.7213152207  
0.6941172814  
0.6525368753  
0.5961415195  
0.5262339596  
0.4463901376  
0.3625763768  
0.2827736522  
0.2161209321  
0.1716973079  
0.1571283796  
0.1772576447  
0.2331254781  
0.3214479178  
0.4347232396  
0.561974906  
0.6900530748  
0.8052887916  
0.8952675622  
0.9504385737  
0.9653069751  
0.9390317527  
0.8753301992  
0.7817244867  
0.6682432529  
0.5458076791  
0.4245407465  
0.3122785425  
0.2134984457  
0.1288157714  
0.05511000243  
-0.01376540543  
-0.08581478191  
-0.1694595377  
-0.2720500011  
-0.3985317334  
-0.5504514989  
-0.7254152407  
-0.9170499966  
-1.11545891  
-1.308083273  
-1.480877928  
-1.619646125  
-1.711410026  
-1.745686517  
-1.715554034  
-1.618440863  
-1.456568917  
-1.237026085  
-0.971460235  
-0.6754032122  
-0.3672615375  
-0.06703477772  
0.2051679216  
0.4307035733  
0.5939512632  
0.6837057622  
0.6942804457  
0.6261917172  
0.4863230462  
0.2875235868  
0.04763455685  
-0.2119844965  
-0.4682996704  
-0.6986399295  
-0.8827065674  
-1.004345463  
-1.052884471  
-1.023896986  
-0.919331586  
-0.7470230433  
-0.5196756871  
-0.2534846813  
0.03342388914  
0.3225373339  
0.5963213982  
0.8392891356  
1.038726939  
1.185074365  
1.272026575  
1.296437812  
1.258122665  
1.159625438  
1.00600327  
0.8046281103  
0.5649822733  
0.2983946578  
0.01766762347  
-0.2634389178  
-0.5308849915  
-0.7711528325  
-0.972121539  
-1.123929846  
-1.219728046  
-1.256231931  
-1.234007717  
-1.157448481  
-1.034438699  
-0.8757353151  
-0.6941218124  
-0.5034138057  
-0.3174010566  
-0.1488025293  
-0.008322795532  
0.09614771309  
0.1601203223  
0.1828664369  
0.1675175364  
0.1209018878  
0.05311485125  
-0.02316469164  
-0.09358825045  
-0.1432485879  
-0.1579355899  
-0.1254649886  
-0.03699467109  
0.111782196  
0.3196827772  
0.5794453592  
0.8776227493  
1.195044866  
1.507904823  
1.789465731  
2.012297928  
2.150906715  
2.184506182  
2.099674106  
1.89255355  
1.570307587  
1.151555062  
0.6656239181  
0.1505583392  
-0.3500075367  
-0.7908836318  
-1.129867393  
-1.332327926  
-1.375289986  
-1.250506436  
-0.9660810607  
-0.5463558183  
-0.0299678416  
0.53378914  
1.089947949  
1.583648939  
1.966043182  
2.199599067  
2.262142907  
2.149114653  
1.873738184  
1.465086496  
0.9642991783  
0.4194631878  
-0.1201595598  
-0.6097950853  
-1.01397279  
-1.309913578  
-1.489104821  
-1.556968617  
-1.530779435  
-1.436232099  
-1.303224184  
-1.161477761  
-1.036611436  
-0.9471590007  
-0.9028522425  
-0.9042920611  
-0.9439189413  
-1.00802463  
-1.079426334  
-1.140375625  
-1.1752719  
-1.172833334  
-1.127476864  
-1.039794147  
-0.9161445422  
-0.7674961264  
-0.6077400698  
-0.4517418488  
-0.3134058834  
-0.2039970612  
-0.1309127234  
-0.097016165  
-0.1005667608  
-0.1357081676  
-0.1934129482  
-0.2627357672  
-0.3322123692  
-0.3912243714  
-0.4311906803  
-0.4464494734  
-0.4347542539  
-0.3973429568  
-0.3385960646  
-0.2653366893  
-0.1858707727  
-0.108892505  
-0.0423935042  
0.007287129985  
0.03616168164  
0.04296263256  
0.02915590747  
-0.00136795646  
-0.04286595619  
-0.08845115124  
-0.1308351447  
-0.1629784048  
-0.1785847628  
-0.172386738  
-0.1402513927  
-0.07915344117  
0.01289822382  
0.1368878708  
0.2927098367  
0.478944597  
0.6925080929  
0.9282592353  
1.178666852  
1.433676929  
1.680892371  
1.906152888  
2.094530547  
2.231674922  
2.30537891  
2.307158561  
2.233617173  
2.08736176  
1.877283377  
1.61809774  
1.329129776  
1.03245305  
0.7505783917  
0.5039785656  
0.3087618928  
0.1748038484  
0.1045994686  
0.09300302351  
0.1279164925  
0.1918502998  
0.2641757799  
0.3237844885  
0.35181404  
0.3340816388  
0.2629041601  
0.1380572201  
-0.03325587452  
-0.2374409823  
-0.4564026444  
-0.670048508  
-0.8590582288  
-1.007541419  
-1.105207385  
-1.148752662  
-1.14225615  
-1.096530876  
-1.027516079  
-0.9539332355  
-0.8945337877  
-0.8653357769  
-0.8772383833  
-0.9343633798  
-1.033365345  
-1.163817836  
-1.309621573  
-1.451239972  
-1.568439898  
-1.643138376  
-1.661940135  
-1.61799474  
-1.511900748  
-1.351525357  
-1.150773934  
-0.9275079227  
-0.7009302881  
-0.4888490969  
-0.3052375946  
-0.1584591589  
-0.05041812962  
0.02327249282  
0.07215167913  
0.1090350727  
0.147719023  
0.2006568621  
0.27696999  
0.3810943185  
0.5122354843  
0.6646638432  
0.8287393487  
0.9924530252  
1.143193044  
1.269448039  
1.36218756  
1.415746442  
1.428140908  
1.400848078  
1.338159881  
1.246279268  
1.132341923  
1.003531283  
0.8663893216  
0.7264018168  
0.5878334644  
0.4537879765  
0.3263994332  
