458.1541846  
457.342789  
469.2931422  
480.7859084  
108.4785514  
3554.164045  
14190.09182  
39580.62575  
525.3732481  
12653.63131  
70290.72516  
28166.05508  
17625.23767  
8062.223582  
10039.48053  
15545.4881  
6132.730959  
1076.775945  
8122.523364  
46.57010709  
6327.95353  
23048.87655  
15064.588  
8452.478062  
14297.83238  
6636.834265  
18744.09411  
9894.124105  
1338.082535  
627.2119676  
272.8668077  
4778.069258  
2104.390133  
9279.123815  
24043.89191  
5820.146405  
355.5395806  
6012.885182  
668.0437069  
13242.777  
498.5911524  
2057.25195  
6686.163843  
3124.233601  
7442.830982  
6899.312738  
19510.1196  
3773.71266  
677.8001575  
3588.816648  
3633.014663  
1626.434717  
4296.419104  
467.6814409  
460.0912077  
117.9880538  
1023.432758  
851.4883242  
719.4003823  
115.1795479  
3654.549922  
1539.061246  
3907.564856  
801.4899984  
231.3270984  
77.42468523  
185.2112598  
192.5952279  
39.25093257  
183.0827029  
32.32800475  
46.06613363  
39.48794775  
22.72896861  
56.37502889  
25.39028549  
42.63725995  
13.93550576  
24.17693906  
17.22516446  
15.87341482  
14.8262165  
16.06107892  
13.7811222  
11.93301198  
10.04369606  
9.599491707  
8.718967114  
8.297003182  
6.978318215  
7.218558273  
6.839311052  
6.245863169  
5.895280365  
5.407651027  
5.182568141  
5.008876237  
4.700820021  
4.389041972  
4.153940142  
3.951373912  
3.700157624  
3.552752231  
3.357833853  
3.202217405  
3.049530132  
2.901279322  
2.75469116  
2.637662295  
2.518413957  
2.410274206  
2.305067604  
2.205396597  
2.115289332  
2.026403743  
1.940885222  
1.864735105  
1.787570829  
1.718951123  
1.652734543  
1.586822649  
1.527946973  
1.469685236  
1.415323405  
1.362535731  
1.314242715  
1.266173282  
1.221451099  
1.178478431  
1.137641331  
1.098448978  
1.061104868  
1.025308407  
0.9911246663  
0.9583059084  
0.9269996715  
0.8969559412  
0.868108666  
0.8405156661  
0.8140437343  
0.7886570937  
0.7642435757  
0.7407828214  
0.7183104406  
0.6966472377  
0.6758739867  
0.6558200258  
0.6365949368  
0.6180558124  
0.6002233622  
0.5830393058  
0.5664757475  
0.5505004597  
0.5351459349  
0.5202852505  
0.5059821853  
0.4921749779  
0.4788594894  
0.4659692715  
0.4535514907  
0.4415419209  
0.4299367027  
0.418716593  
0.4078805341  
0.3973989417  
0.3872620991  
0.3774337386  
0.3679392814  
0.3587580598  
0.3498561884  
0.341248412  
0.3328870972  
0.3248124275  
0.3169598543  
0.309359588  
0.3020061294  
0.2948550594  
0.287927975  
0.2812010442  
0.2746981832  
0.2683618593  
0.2622119186  
0.2562675906  
0.2504692732  
0.2448409762  
0.239384286  
0.2340649219  
0.2289102645  
0.2238906782  
0.219019116  
0.2142774831  
0.2096723077  
0.2051990854  
0.2008270477  
0.1965845657  
0.192463547  
0.1884433405  
0.1845289717  
0.180736476  
0.1770188578  
0.173393084  
0.169898683  
0.1664730555  
0.1631344248  
0.1598862178  
0.156705732  
0.1536239066  
0.1506131265  
0.1476727304  
0.1448082991  
0.1420126907  
0.1392889107  
0.1366452503  
0.1340501602  
0.1315141647  
0.129059213  
0.1266498789  
0.1242951293  
0.1219930941  
0.1197512934  
0.1175658951  
0.115432094  
0.1133500272  
0.1113116626  
0.1093133331  
0.1073668735  
0.1054759706  
0.1036174565  
0.1017931242  
0.1000254142  
0.09829046477  
0.09658386797  
0.09494104221  
0.09331549995  
0.09172656608  
0.09017695087  
0.08866020207  
0.08717115435  
0.0857190993  
0.08429805525  
0.08292333335  
0.08155173024  
0.08022026227  
0.07891713143  
0.07763730961  
0.0763872586  
0.07517177773  
0.07397019872  
0.07279420233  
0.07164730931  
0.07052292166  
0.06941575043  
0.06833602889  
0.06728301233  
0.06624179663  
0.06523511172  
0.06422699899  
0.06326143249  
0.06230785817  
0.06136735246  
0.06045068517  
0.05954514096  
0.05866143255  
0.05780572367  
0.05694565546  
0.05611697825  
0.05530225499  
0.05449774809  
0.05371678856  
0.05294777452  
0.05219357487  
0.05144997982  
0.05072535267  
0.05000966323  
0.04930519259  
0.0486228123  
0.04794753997  
0.04728516506  
0.04663530796  
0.04599498398  
0.04536969075  
0.0447523531  
0.04415263699  
0.04356207158  
0.04298400748  
0.04240875387  
0.0418447571  
0.04129386547  
0.04075985683  
0.04022748002  
0.03970256345  
0.03918100533  
0.03868421802  
0.03819253702  
0.03770496639  
0.03722240032  
0.03675703037  
0.0362916158  
0.03583729621  
0.03539732819  
0.0349547193  
0.03452650013  
0.03410581549  
0.03368385075  
0.03327978665  
0.03287907628  
0.03248122845  
0.03209317197  
0.03170942422  
0.03133829068  
0.03096709366  
0.03060329526  
0.03024739492  
0.0298974697  
0.02955127961  
0.02920649206  
0.02887811324  
0.02854577753  
0.02822533719  
0.0279053639  
0.02759672686  
0.0272858356  
0.02698330992  
0.02668721044  
0.02639100786  
0.02610401264  
0.02582200449  
0.02554341294  
0.02526818155  
0.02499643562  
0.024732876  
0.02447338856  
0.02421309149  
0.02395895904  
0.02370848415  
0.02346921126  
0.02322220678  
0.02298723078  
0.02274659964  
0.02252131484  
0.0222922046  
0.02207081988  
0.02185195524  
0.02163745277  
0.02142521083  
0.02121444856  
0.0210065112  
0.02080356546  
0.02060263915  
0.02040320738  
0.0202081891  
0.02002228194  
0.01983668377  
0.01964818239  
0.01946467626  
0.01928701649  
0.01910802039  
0.01893658594  
0.01876426656  
0.01859580749  
0.01842618286  
0.01826788029  
0.0181102666  
0.01794627256  
0.01779229244  
0.01763985569  
0.01748823152  
0.01733628072  
0.01719140395  
0.01704623177  
0.01690498117  
0.01676258069  
0.01662593699  
0.01649248971  
0.01635734761  
0.01622671781  
0.01609193144  
0.01596741528  
0.01584431123  
0.01571620662  
0.01559301602  
0.01547527116  
0.01535683212  
0.01524207385  
0.01512806677  
0.01501587333  
0.0149027801  
0.014792047  
0.0146845703  
0.01458196301  
0.01447585372  
0.01437026206  
0.01427204268  
0.01417093585  
0.01407471028  
0.01397091552  
0.01388251071  
0.01378730097  
0.01369850764  
0.0136088405  
0.01351892788  
0.01342885484  
0.01334195255  
0.01325494691  
0.0131724798  
0.01309244977  
0.01301274318  
0.01293243936  
0.01285616909  
0.01277559664  
0.01270262953  
0.01262972183  
0.01255917178  
0.01248456574  
0.0124120424  
0.01234226512  
0.01227344213  
0.01221155521  
0.01214233205  
0.01207900495  
0.01201246181  
0.01195207747  
0.01189222101  
0.01183315787  
0.01177421395  
0.01171597312  
0.01166073459  
0.0116028119  
0.01154513371  
0.0114967413  
0.011439678  
0.01139027178  
0.01133978953  
0.01128710045  
0.01123815165  
0.01119078645  
0.01114642521  
0.01110138956  
0.0110557726  
0.0110098868  
0.01096836591  
0.01092860608  
0.01088352311  
0.01084667772  
0.01080533538  
0.01076842457  
0.01073237806  
0.01069652291  
0.0106560913  
0.01062134567  
0.01058831054  
0.01055402067  
0.01052093922  
0.01049347957  
0.01046228376  
0.01042974209  
0.0104041629  
0.01037357293  
0.01034768765  
0.01032398836  
0.01029674223  
0.01027155987  
0.0102501683  
0.01022101602  
0.01020045419  
0.01018058784  
0.01015928598  
0.01014008202  
0.01012095764  
0.0101036245  
0.01008669618  
0.01006814855  
0.01005088132  
0.01003966599  
0.01002194456  
0.01000848863  
0.009994017781  
0.009983447342  
0.009971493553  
0.009961930605  
0.009948819456  
0.009941762914  
0.009932916205  
0.009926790108  
0.009918118672  
0.00991064497  
0.00990459474  
0.009899586496  
0.009897051933  
0.009894412556  
0.009890767447  
0.009891809104  
0.009884882368  
0.009886689979  
