318.9867117  
301.7469228  
284.089373  
227.0097453  
152.2153894  
3519.786684  
17613.93581  
101099.4943  
67288.45338  
10176.07603  
14759.65748  
9645.828995  
49419.50094  
24787.72203  
3721.570651  
8599.294767  
8187.553207  
20421.39896  
5020.50342  
8614.995557  
13369.84977  
5736.783012  
1137.298671  
1698.528552  
16235.13312  
5154.85335  
2136.510958  
2849.371006  
2281.469273  
2319.946768  
1905.028923  
10187.22507  
8.211681133  
2026.393999  
9280.780684  
4368.237668  
5095.229772  
200.223595  
2996.349486  
3581.096675  
1687.103607  
2238.251794  
1768.149431  
23.20361542  
3904.125445  
520.3994286  
1532.672174  
3239.333355  
5729.624354  
5072.12388  
2839.688352  
731.8400598  
102.9690516  
2206.099597  
1153.413264  
1299.21126  
1219.832664  
294.732564  
169.1400137  
456.6113011  
123.2526221  
430.9837711  
934.6041289  
874.0030754  
468.3745584  
34.29464359  
219.3661869  
272.8179774  
173.3620208  
47.91772115  
77.54939231  
137.4127732  
68.693367  
71.7026423  
69.52146854  
27.99066675  
44.56752145  
36.71916199  
37.48388807  
34.06245491  
25.0220718  
26.93319382  
22.42356178  
21.84106129  
16.64936169  
18.90368037  
16.49210583  
14.35678687  
14.29974226  
12.9370475  
12.15843418  
11.23720536  
10.9683647  
10.09827673  
9.556541168  
9.075104421  
8.595734459  
8.028425801  
7.614849833  
7.20025757  
6.858562941  
6.495565718  
6.191356138  
5.893859194  
5.606739162  
5.350674867  
5.103294223  
4.870683621  
4.653441852  
4.441285743  
4.253022242  
4.069179243  
3.899133005  
3.732982852  
3.579951553  
3.433140254  
3.301878574  
3.169274089  
3.042624141  
2.926545059  
2.814537047  
2.709477538  
2.60784695  
2.511358986  
2.42073199  
2.33293841  
2.250220847  
2.170592761  
2.09504861  
2.022268472  
1.953123888  
1.886601961  
1.823298823  
1.76286479  
1.704835458  
1.648997405  
1.595746673  
1.54467295  
1.495626308  
1.44845828  
1.403293953  
1.3599385  
1.318249509  
1.278160106  
1.239626241  
1.202554392  
1.16691141  
1.132560783  
1.099515444  
1.067686903  
1.037010368  
1.007479763  
0.9789648144  
0.9515201235  
0.9250007198  
0.8994341267  
0.8747636816  
0.8509400944  
0.8279285042  
0.8057235597  
0.7842491325  
0.7634922951  
0.7434325839  
0.7240377605  
0.705279683  
0.6871326328  
0.6695747582  
0.6525690247  
0.636125124  
0.6201865871  
0.6047547813  
0.5898099021  
0.5753181274  
0.5612844148  
0.5476704954  
0.534480539  
0.5216933044  
0.5092837665  
0.4972370142  
0.4855529481  
0.4742161699  
0.4632047812  
0.452530951  
0.4421509158  
0.4320710452  
0.4222770167  
0.4127720994  
0.4035253228  
0.394536253  
0.3857958296  
0.3773058377  
0.3690481694  
0.3610221112  
0.3532063552  
0.3456071061  
0.3382102496  
0.3310198734  
0.3240081575  
0.3171842176  
0.3105444358  
0.3040771042  
0.2977783951  
0.2916463158  
0.2856663121  
0.27984456  
0.274171718  
0.2686387794  
0.263249538  
0.2579934222  
0.2528655116  
0.2478700346  
0.2429939387  
0.2382422343  
0.2336087387  
0.2290805693  
0.2246698744  
0.2203596572  
0.2161553594  
0.2120494975  
0.2080433306  
0.2041306697  
0.2003102054  
0.196580043  
0.1929396265  
0.1893737139  
0.1859002795  
0.1825059731  
0.1791835857  
0.1759424594  
0.172773491  
0.1696742898  
0.1666476908  
0.1636822723  
0.1607903605  
0.1579562738  
0.1551876222  
0.1524834234  
0.1498331182  
0.1472426892  
0.1447074642  
0.1422296075  
0.1398004101  
0.1374273293  
0.1351030747  
0.1328283807  
0.1306002092  
0.1284212722  
0.1262887789  
0.1241978009  
0.1221533931  
0.1201488321  
0.1181893213  
0.1162671167  
0.1143843124  
0.1125401693  
0.1107321332  
0.1089630708  
0.1072282455  
0.1055295266  
0.1038626305  
0.1022302199  
0.1006294952  
0.0990631795  
0.09752430731  
0.09601644497  
0.09453840572  
0.09308831745  
0.09166846095  
0.0902724816  
0.08890874454  
0.08756467606  
0.08625200357  
0.08496162279  
0.08369579775  
0.08245443685  
0.081236589  
0.08004030612  
0.0788713127  
0.07771889134  
0.0765866918  
0.07547920696  
0.07439240307  
0.07332339533  
0.07227724697  
0.07124538703  
0.07023606972  
0.06924537497  
0.06826761144  
0.06731029098  
0.06637224076  
0.06545288581  
0.06454522329  
0.0636552866  
0.06277912705  
0.0619199183  
0.06107812938  
0.06025055948  
0.05943365055  
0.05863603571  
0.05785215213  
0.05707606057  
0.05631921408  
0.05557487538  
0.05484174652  
0.05412245194  
0.05341580776  
0.05271629983  
0.0520345135  
0.05136265446  
0.05070239392  
0.05005266521  
0.04941251586  
0.04878747541  
0.04816721821  
0.04756116451  
0.04696655688  
0.04637785838  
0.04580116205  
0.04523449048  
0.04467742721  
0.04412726177  
0.04358919297  
0.04305831605  
0.04253321148  
0.04201995391  
0.04151585543  
0.04101847334  
0.04052983958  
0.04004875476  
0.03957746145  
0.03911041752  
0.03865119998  
0.0382017473  
0.03775741888  
0.03732271557  
0.03689277624  
0.03647148893  
0.03605583399  
0.03564553661  
0.03524334223  
0.03484863744  
0.03445836135  
0.03407260848  
0.03369831626  
0.03332571103  
0.03296008663  
0.03260028946  
0.03224309767  
0.03189648038  
0.03155429034  
0.03121644344  
0.03088177978  
0.03055594777  
0.03023307582  
0.02991667018  
0.0296041017  
0.0292962041  
0.02899210267  
0.02869539676  
0.02840080291  
0.02811175488  
0.02782843412  
0.02754713156  
0.0272734733  
0.02700203689  
0.02673538408  
0.02647141669  
0.02621423471  
0.02595746608  
0.02570666621  
0.02545955495  
0.02521672787  
0.02497808632  
0.02474193157  
0.02450896529  
0.02428206741  
0.02405620233  
0.02383411824  
0.02361655418  
0.02340222278  
0.02319163856  
0.02298237952  
0.02277891239  
0.02257541932  
0.02237927293  
0.02218328229  
0.02199033745  
0.02180259367  
0.02161624037  
0.02143175476  
0.02125174116  
0.02107310402  
0.02089968816  
0.0207268762  
0.02055864328  
0.02039173453  
0.02022789422  
0.02006726329  
0.01990810109  
0.01975160206  
0.0195995781  
0.01944738082  
0.01929909685  
0.01915354689  
0.01900744204  
0.01886756861  
0.01872802372  
0.01859142816  
0.01845731874  
0.01832483808  
0.01819509214  
0.01806655526  
0.01794187627  
0.01781841188  
0.01769738273  
0.01757754723  
0.01746032352  
0.01734597715  
0.01723249067  
0.01712057216  
0.01701162245  
0.01690420716  
0.01679898993  
0.01669584303  
0.01659346186  
0.01649416177  
0.01639678362  
0.01630012987  
0.01620677006  
0.01611442352  
0.01602478467  
0.01593511251  
0.0158486458  
0.0157632776  
0.01568005812  
0.01559734322  
0.01551772774  
0.01543840751  
0.0153618926  
0.01528707407  
0.01521453876  
0.01514131601  
0.01507084517  
0.01500230533  
0.01493557598  
0.01486953271  
0.01480555007  
0.0147428827  
0.0146822342  
0.01462216623  
0.01456346544  
0.01450665013  
0.01445171768  
0.01439736376  
0.01434541755  
0.0142948509  
0.01424516819  
0.01419677849  
0.0141497027  
0.01410585384  
0.01406231393  
0.01401884207  
0.01397867163  
0.01393927  
0.01390054436  
0.01386440442  
0.01382885462  
0.01379385388  
0.01376210694  
0.01372968133  
0.01370002094  
0.01367066797  
0.0136419505  
0.01361769548  
0.01359329819  
0.01356718662  
0.01354591965  
0.01352458681  
0.01350527225  
0.01348662129  
0.01347019519  
0.01345381509  
0.0134389624  
0.01342521773  
0.01341412305  
0.01340378843  
0.01339458643  
0.01338554013  
0.01337822553  
0.01337302855  
0.01336859668  
0.01336516936  
0.01336223686  
0.01336325541  
