0.008965949794  
0.02354227265  
0.03837293768  
0.05420675584  
0.07110044221  
0.08815155407  
0.1033866652  
0.1138261487  
0.1157368859  
0.1050353892  
0.0778006027  
0.03082649555  
-0.03785988396  
-0.1285887597  
-0.2398099254  
-0.3680649107  
-0.5081770117  
-0.6536381594  
-0.7971433368  
-0.9312091724  
-1.048792477  
-1.143852214  
-1.21179123  
-1.249746005  
-1.25671871  
-1.233555969  
-1.182804119  
-1.108458709  
-1.015652249  
-0.9102961219  
-0.7986914215  
-0.6871329556  
-0.5815098161  
-0.486925257  
-0.4073544715  
-0.3453751721  
-0.3019997275  
-0.2766361896  
-0.2672083772  
-0.2704259537  
-0.2821966315  
-0.2981353685  
-0.3141092589  
-0.3267589911  
-0.3339180147  
-0.3348731532  
-0.3304266996  
-0.3227498466  
-0.3150379037  
-0.3110147675  
-0.3143585923  
-0.3281159573  
-0.3542018302  
-0.3930408075  
-0.4434158995  
-0.5025277946  
-0.5662629477  
-0.6296154654  
-0.687195384  
-0.7337433207  
-0.764570044  
-0.7758643503  
-0.7648387759  
-0.7297183512  
-0.6696136488  
-0.5843354288  
-0.4742342239  
-0.3401186676  
-0.1833013199  
-0.005772734702  
0.1895253172  
0.3984004324  
0.6151694042  
0.8325815449  
1.041979425  
1.233744062  
1.398026923  
1.525698703  
1.609429474  
1.644727809  
1.630797359  
1.571042836  
1.47310564  
1.348366591  
1.210908973  
1.076043761  
0.9585354129  
0.8707648738  
0.8210577934  
0.8124445834  
0.8420434361  
0.9012104142  
0.9764825375  
1.051239566  
1.107878006  
1.130227661  
1.105867363  
1.028001605  
0.8966136878  
0.7186986494  
0.5075198479  
0.2809740577  
0.05928783027  
-0.13762784  
-0.292779903  
-0.3942777465  
-0.4367811307  
-0.4220155184  
-0.3582964148  
-0.2591581631  
-0.1413197832  
-0.0223032797  
0.08192173363  
0.158927125  
0.2011752852  
0.2065707047  
0.1781829204  
0.1232480426  
0.05165965851  
-0.02577544129  
-0.09903187235  
-0.1602467446  
-0.2045995699  
-0.2306141442  
-0.2398837915  
-0.236341257  
-0.2252298286  
-0.2119964085  
-0.2012806175  
-0.1961732358  
-0.1978268306  
-0.2054537421  
-0.216660793  
-0.2280328442  
-0.235835208  
-0.2367039121  
-0.2282043367  
-0.2091621385  
-0.1797376493  
-0.1412294766  
-0.09566772361  
-0.0452733431  
0.008110471285  
0.06350621258  
0.1210958274  
0.1822680215  
0.2493634635  
0.3251487412  
0.4120771465  
0.5114466201  
0.6225973408  
0.7423017194  
0.8644787554  
0.9803399769  
1.078998297  
1.148507458  
1.177229852  
1.15534847  
1.076328145  
0.9380916289  
0.7437261599  
0.50159011  
0.224759648  
-0.07013462853  
-0.3645548015  
-0.6399863412  
-0.8799052181  
-1.071541108  
-1.207200396  
-1.284995512  
-1.308886132  
-1.288037759  
-1.2355928  
-1.167015674  
-1.098236128  
-1.043824726  
-1.015434638  
-1.020686716  
-1.062614863  
-1.139710094  
-1.246506798  
-1.374592112  
-1.513866872  
-1.65385815  
-1.784913952  
-1.899110755  
-1.990808613  
-2.056799551  
-2.096102889  
-2.109480923  
-2.098790371  
-2.066284426  
-2.013988627  
-1.94322588  
-1.854350801  
-1.746698692  
-1.61875393  
-1.468479009  
-1.293763709  
-1.092932092  
-0.8652425785  
-0.6113332816  
-0.3335605353  
-0.03618960306  
0.2745849068  
0.5908187163  
0.9031922418  
1.201575223  
1.475746589  
1.716223933  
1.915113227  
2.066915634  
2.16916739  
2.222838865  
2.232406961  
2.205552537  
2.152483346  
2.084918264  
2.014833344  
1.953098782  
1.908184944  
1.885102593  
1.884750047  
1.903774628  
1.935009978  
1.968450009  
1.992658042  
1.99642579  
1.970434967  
1.908699391  
1.809541049  
1.675955194  
1.515278057  
1.338213661  
1.157333511  
0.9852907035  
0.8330113025  
0.7081434314  
0.614009917  
0.5492164083  
0.50798537  
0.4811432057  
0.4576113683  
0.4261543473  
0.3771070557  
0.3038136734  
0.2035557419  
0.07784346123  
-0.06795453212  
-0.2255685889  
-0.385184204  
-0.5369730177  
-0.6725479152  
-0.7861100532  
-0.8751252544  
-0.9404548756  
-0.9859468084  
-1.017596331  
-1.042436942  
-1.067354486  
-1.098018357  
-1.138081408  
-1.188737061  
-1.248661765  
-1.314297861  
-1.38037136  
-1.440538063  
-1.488027123  
-1.516185485  
-1.518871728  
-1.490696229  
-1.427140753  
-1.324633654  
-1.180651485  
-0.993914932  
-0.7647072131  
-0.4953074235  
-0.1904614207  
0.1421904984  
0.4918676665  
0.8446935929  
1.184129235  
1.491832175  
1.748917302  
1.937515361  
2.042478634  
2.05301064  
1.964020193  
1.776972151  
1.500108108  
1.147954974  
0.7401508469  
0.2997198307  
-0.1490150185  
-0.5825988937  
-0.9804446313  
-1.32639722  
-1.609699398  
-1.825259419  
-1.973234465  
-2.058055873  
-2.087064589  
-2.069014741  
-2.012663942  
-1.925671674  
-1.81393031  
-1.681399179  
-1.530391903  
-1.362220537  
-1.178020103  
-0.9795757975  
-0.7699728318  
-0.5539358602  
-0.3377977616  
-0.1290815823  
0.06422024767  
0.2345594281  
0.3757908255  
0.4840191005  
0.558215561  
0.6005020746  
0.6160705247  
0.6127448965  
0.6002342553  
0.5891738092  
0.5900431164  
0.6120911448  
0.6623529382  
0.7448624349  
0.8601199139  
1.004864461  
1.172172159  
1.351881434  
1.531319684  
1.696283536  
1.83220747  
1.925426972  
1.964429599  
1.940982015  
1.851010962  
1.695148232  
1.478853861  
1.212087513  
0.9085416152  
0.5844903854  
0.2573732619  
-0.05575313459  
-0.3397178762  
-0.5825306998  
-0.7763298531  
-0.9178543649  
-1.008411912  
-1.053335947  
-1.061011205  
-1.041608591  
-1.005678956  
-0.9628130808  
-0.9205384572  
-0.8835932083  
-0.8536703082  
-0.8296524773  
-0.8082785993  
-0.785121712  
-0.7557080658  
-0.7165874499  
-0.6661587225  
-0.605117098  
-0.5364286127  
-0.464830264  
-0.3959421571  
-0.3351325502  
-0.2863462192  
-0.2511014658  
-0.227858218  
-0.2118886157  
-0.1957065574  
-0.1700236134  
-0.1250987588  
-0.05228621998  
0.0544599107  
0.1973567352  
0.3740389251  
0.5774152009  
0.7961623499  
1.015799389  
1.220197015  
1.393307955  
1.520884115  
1.591954948  
1.599882471  
1.542869265  
1.423916235  
1.250249588  
1.032358954  
0.7828025532  
0.5149565891  
0.2418797762  
-0.02458993875  
-0.274431396  
-0.4997146829  
-0.6946049291  
-0.8551688259  
-0.979077624  
-1.065308838  
-1.113907488  
-1.125840472  
-1.10294629  
-1.047936341  
-0.9643985591  
-0.8567461254  
-0.7300798706  
-0.589942086  
-0.4419922958  
-0.2916504333  
-0.1437666545  
-0.002383406157  
0.1293690804  
0.249229303  
0.355630747  
0.4474549158  
0.5237744565  
0.5836627646  
0.6261244864  
0.6501748344  
0.6550586395  
0.6405569889  
0.6073129668  
0.5570815164  
0.4928335342  
0.4186536769  
0.3394273434  
0.2603363852  
0.1862475984  
0.1210860102  
0.06731066638  
0.02559396104  
-0.005230353879  
-0.02791495531  
-0.0462778219  
-0.0644821667  
-0.08623163318  
-0.1140214873  
-0.1485655591  
-0.1885166547  
-0.2305299484  
-0.2696843086  
-0.3002089262  
-0.3164098465  
-0.3136605766  
-0.2893120764  
-0.2433647788  
-0.1788019709  
-0.1015114615  
-0.01978826451  
0.05653320845  
0.1172091542  
0.1528451705  
0.1561088672  
0.1227527034  
0.05230216737  
-0.05167471734  
-0.1817581509  
-0.3273041894  
-0.475433387  
-0.6122717127  
-0.7242879607  
-0.7995925186  
-0.8290511753  
-0.80710532  
-0.732224804  
-0.6069613066  
-0.4376215715  
-0.233604055  
-0.006494112859  
0.2309793647  
0.4660159394  
0.6867255787  
0.8829325412  
1.046734181  
1.172787675  
1.25832147  
1.30291873  
1.30812876  
1.276993863  
1.213560367  
1.122452365  
1.008546136  
0.8767650163  
0.7319876572  
0.579024746  
0.422633089  
0.2674987724  
0.1181643281  
-0.02112544417  
-0.1466654021  
-0.2555671246  
-0.3460550463  
-0.4176954719  
-0.4715165235  
-0.5099594999  
-0.5366434462  
-0.5559391011  
-0.5723835959  
-0.5900035867  
-0.6116351897  
-0.6383430718  
-0.6690414162  
-0.7004056476  
-0.7271256725  
-0.7425147421  
-0.7394246019  
-0.7113791193  
-0.6537766623  
-0.5650025944  
-0.4472722431  
-0.3070538678  
-0.1549653448  
-0.005088403785  
0.1262528674  
0.2221552445  
0.2670536006  
0.2486814325  
0.1598126756  
-0.0004255305076  
-0.2258787888  
-0.5034338991  
-0.8138690081  
-1.133422549  
-1.435929292  
-1.695308092  
-1.88812611  
-1.995969821  
-2.007346953  
-1.918919789  
-1.735922017  
-1.471700342  
-1.146443737  
-0.7852162514  
-0.4155098618  
-0.06457498614  
0.243187266  
0.488505584  
0.6589435789  
0.7498772037  
0.7646420336  
0.7138642901  
0.6140639899  
0.4857133285  
0.3509728281  
0.2313748221  
0.1457126382  
0.1083531245  
0.1281457245  
0.207996954  
0.3451119525  
0.5318128716  
0.7567709974  
1.006474992  
1.266724905  
1.523970932  
1.766372688  
1.984495  
2.171622783  
2.323750712  
2.439308244  
2.51873062  
2.563958275  
2.577952966  
2.564261908  
2.526661321  
2.468864138  
2.394270265  
2.305747723  
2.205417519  
2.094457762  
1.972946963  
1.839784948  
1.692726504  
1.528578557  
1.343565286  
1.133862035  
0.8962534365  
0.6288448256  
0.3317377525  
0.007560781116  
-0.33823783  
-0.6974049004  
-1.059248202  
-1.411336991  
-1.740490718  
-2.033939756  
-2.280543626  
-2.471897444  
-2.603198732  
-2.673742336  
-2.68696063  
-2.649993476  
-2.572812034  
-2.467003165  
-2.344360238  
-2.215462679  
-2.088438976  
-1.968092771  
-1.855513623  
-1.748250966  
-1.641022737  
-1.526864895  
-1.398557196  
-1.250095757  
-1.077992175  
-0.8821864494  
-0.6664183858  
-0.4380070305  
-0.2070508472  
0.01480707801  
0.2158663628  
0.3858607081  
0.5172305074  
0.6059738369  
0.6519636623  
0.6587051406  
0.632589751  
0.5818031778  
0.5150701742  
0.4404552266  
0.364409866  
0.2912014572  
0.2227959813  
0.1591789648  
0.09902174954  
0.04054904023  
-0.01757094115  
-0.07549409961  
-0.1317726771  
-0.18331444  
-0.2257584585  
-0.2541962941  
-0.2641188699  
-0.2524119613  
-0.2182125266  
-0.1634407558  
-0.09289687039  
-0.01384512393  
0.06486835364  
0.1340552468  
0.185604295  
0.2138491121  
0.2166543771  
0.1960334225  
0.1581633788  
0.1127619692  
0.07189403642  
0.04835431059  
0.05386622792  
0.09733716181  
0.1834402057  
0.3117174383  
0.4763554978  
0.6666468336  
0.868096762  
1.064011154  
1.237358486  
1.372652636  
1.457624044  
1.484470847  
1.450562845  
1.358536589  
1.215810508  
1.033629187  
0.8257792462  
0.6071625238  
0.3924017397  
0.1946327503  
0.02457960839  
-0.1100124795  
-0.2046137191  
-0.2578297481  
-0.2711009247  
-0.2482584962  
-0.1950105979  
-0.1184352665  
-0.02651122321  
0.0723051162  
0.1694645054  
0.256704781  
0.3264408512  
0.3721870262  
0.3889985014  
0.3738959914  
0.3262183355  
0.2478234139  
0.1430804671  
0.01859174786  
-0.117356137  
-0.255586286  
-0.3869878909  
-0.5035048769  
-0.5990307971  
-0.6700548463  
-0.7159636322  
-0.7389273065  
-0.7433867972  
-0.7352119152  
-0.7206617765  
-0.7053119927  
-0.6931304673  
-0.685840638  
-0.6826917639  
-0.6806529524  
-0.6750124991  
-0.6602670359  
-0.6311601866  
-0.5836991599  
-0.5159775728  
-0.4286900092  
-0.3252432728  
-0.2114644447  
-0.09493979621  
0.01590541113  
0.1128611517  
0.1889680543  
0.2394066662  
0.2621182065  
0.2581015344  
0.2313500481  
0.1884571541  
0.1379428288  
0.08938108456  
0.05242851043  
0.03584346083  
0.04659501525  
0.08913245572  
0.1648780308  
0.2719952048  
0.4054475592  
0.5573599146  
0.7176545257  
0.8749176354  
1.017418434  
1.134185764  
1.216030787  
1.256396963  
1.251943496  
1.20278921  
1.112383169  
0.987021996  
0.835080577  
0.6660573614  
0.4895625763  
0.314378436  
0.1477150512  
-0.00525427897  
-0.1415474041  
-0.2602050379  
-0.3618677151  
-0.4481710593  
-0.5210729742  
-0.5822158107  
-0.6324299013  
-0.6714453999  
-0.6978540186  
-0.7093339547  
-0.7030962187  
-0.676498046  
-0.6277353741  
-0.5565205864  
-0.4646426193  
-0.3563242416  
-0.2382969546  
-0.1195621246  
-0.01080650094  
0.07647269826  
0.1310920199  
0.1434324127  
0.1067005892  
0.01804148691  
-0.1206373786  
-0.3022672937  
-0.5147315458  
-0.7415385483  
-0.9630330979  
-1.158054499  
-1.305893103  
-1.388348048  
-1.391664551  
-1.308119247  
-1.13707392  
-0.8853445902  
-0.5668410847  
-0.2014852031  
0.1864717754  
0.5705649976  
0.924429582  
1.224072112  
1.449867176  
1.588079996  
1.631786462  
1.581126555  
1.442920667  
1.229714652  
0.9584152907  
0.6486705268  
0.3211801142  
-0.003901544078  
-0.308338332  
-0.5768677829  
-0.797910256  
-0.9639185802  
-1.071411256  
-1.12074406  
-1.115675469  
-1.062782128  
-0.970783646  
-0.8497920333  
-0.7105370255  
-0.5635869581  
-0.4185900843  
-0.2835943999  
-0.1644836047  
-0.06458518676  
0.01550238944  
0.07782733396  
0.1267330601  
0.1682626227  
0.2093579084  
0.2569466887  
0.3170076083  
0.3937277088  
0.4888532628  
0.6013220891  
0.7272102472  
0.8600195566  
0.9912629181  
1.111282719  
1.210220021  
1.279018133  
1.310374847  
1.299549508  
1.244947191  
1.148453795  
1.015468344  
0.8546573325  
0.6774089978  
0.4970366194  
0.3277443889  
0.1834320028  
0.07640522497  
0.0160893503  
0.007886784008  
0.05230155109  
0.1444730967  
0.2742351138  
0.4267591913  
0.5837821071  
0.7253352381  
0.8318037909  
0.8860834098  
0.875553095  
0.7936017089  
0.6404642843  
0.4232366576  
0.1550403398  
-0.1465632416  
-0.4616889177  
-0.7704686833  
-1.055276232  
-1.302508059  
-1.503675815  
-1.655653313  
-1.760101148  
-1.822185263  
-1.848850363  
-1.846964736  
-1.8216717  
-1.775243285  
-1.706635492  
-1.61182496  
-1.484865642  
-1.31948184  
-1.110921191  
-0.8577394512  
-0.5631978645  
-0.2360117299  
0.1097159319  
0.4554138046  
0.7797218653  
1.060719075  
1.278404045  
1.4170836  
1.467329399  
1.427234248  
1.302771241  
1.107205081  
0.8596303921  
0.5828272093  
0.3007218834  
0.03579504097  
-0.1932270563  
-0.3731268837  
-0.4971725308  
-0.5652611533  
-0.5832418931  
-0.5615853009  
-0.5136070521  
-0.4535218783  
-0.3945863252  
-0.3475606856  
-0.3196435528  
-0.313963142  
-0.3296068224  
-0.3621199763  
-0.4043516263  
-0.4474808323  
-0.482096929  
-0.499204224  
-0.4910613996  
-0.4518165792  
-0.3779278414  
-0.2683787181  
-0.1247227653  
0.04902013026  
0.2465956285  
0.4598610048  
0.6792470671  
0.8943337416  
1.094525646  
1.26980285  
1.411498682  
1.513039499  
1.57056469  
1.583338219  
1.553891052  
1.487834761  
1.393343771  
1.280338018  
1.159445827  
1.040857151  
0.9332131532  
0.842664089  
0.7722236319  
0.7215036153  
0.6868535433  
0.6618924293  
0.6383465699  
0.6070696129  
0.5591156093  
0.486716356  
0.3840603973  
0.2477976903  
0.07726182201  
-0.125576086  
-0.3563458899  
-0.6086325127  
-0.8743732237  
-1.14423196  
-1.407936698  
-1.654592612  
-1.873003838  
-2.052067766  
-2.181279927  
-2.25138109  
-2.255126564  
-2.188119361  
-2.049604245  
-1.843103329  
-1.576745557  
-1.263191093  
-0.9190658442  
-0.5638962516  
-0.2186085602  
0.09628501758  
0.3626193035  
0.56640137  
0.6992984206  
0.7595786511  
0.7523494674  
0.6890351381  
0.5861204703  
0.4632933437  
0.341203206  
0.2391267028  
0.1728114863  
0.1528064702  
0.1834711277  
0.2627928895  
0.3830169395  
0.5319761051  
0.6949158751  
