0.009053142255  
0.09379137371  
0.1753300935  
0.2530033084  
0.3267611057  
0.3971493594  
0.4650816146  
0.5314109367  
0.59638515  
0.6590938382  
0.7170474552  
0.7659956206  
0.8000752272  
0.8123100404  
0.795427809  
0.7428800558  
0.6499482239  
0.5147358435  
0.3389159371  
0.1280723463  
-0.1084266187  
-0.3580470369  
-0.6061535016  
-0.837398192  
-1.037277678  
-1.193661734  
-1.298106793  
-1.346778337  
-1.340851903  
-1.286341779  
-1.193345733  
-1.074820584  
-0.9450097346  
-0.8177501406  
-0.7048607256  
-0.6148455354  
-0.5520687493  
-0.5165235492  
-0.5042106025  
-0.5080619145  
-0.519265806  
-0.5287807481  
-0.5288037385  
-0.5139787911  
-0.4821522431  
-0.4345886465  
-0.3756181497  
-0.3117982475  
-0.2507390305  
-0.1997831028  
-0.1647572439  
-0.1489778087  
-0.1526658301  
-0.1728251122  
-0.203605842  
-0.2370676923  
-0.2642302639  
-0.2762541992  
-0.2655869276  
-0.2269346497  
-0.1579444293  
-0.05952223146  
0.06421972617  
0.2063712698  
0.357918113  
0.50862263  
0.6479971446  
0.766258473  
0.855163024  
0.9086584401  
0.9232930043  
0.8983701119  
0.8358459064  
0.7400062185  
0.6169738709  
0.4741080433  
0.3193644192  
0.1606865888  
0.00548636112  
-0.1397414283  
-0.2696421348  
-0.380069901  
-0.4680101542  
-0.5314024606  
-0.5689108061  
-0.5797022484  
-0.563280177  
-0.5194099826  
-0.448160639  
-0.3500425613  
-0.2262294616  
-0.07879312238  
0.08908265411  
0.2729831019  
0.4672823681  
0.6653157684  
0.8597202839  
1.042904717  
1.207606091  
1.347461454  
1.457535945  
1.534724239  
1.577994882  
1.588437176  
1.569113419  
1.524741074  
1.461241897  
1.385220512  
1.303432108  
1.222288313  
1.14745319  
1.083543603  
1.03393871  
1.000690315  
0.9844987656  
0.9847331505  
0.999465924  
1.025511772  
1.058484208  
1.092877959  
1.122229079  
1.139369022  
1.136817555  
1.107298993  
1.044383287  
0.9431724528  
0.8009693931  
0.617826432  
0.3968750292  
0.1443606495  
-0.1306632592  
-0.4169766838  
-0.702122078  
-0.9735142458  
-1.219607677  
-1.430959114  
-1.601059838  
-1.726824053  
-1.808659521  
-1.850139988  
-1.857306898  
-1.837731919  
-1.799451376  
-1.749945247  
-1.695288539  
-1.639588016  
-1.584758807  
-1.530663348  
-1.475552867  
-1.416732596  
-1.351338632  
-1.277094833  
-1.192946976  
-1.099477761  
-0.999058378  
-0.895725337  
-0.7947989281  
-0.7023226464  
-0.6243699657  
-0.5663444862  
-0.5323148815  
-0.524497555  
-0.5429142872  
-0.5852774032  
-0.6471040054  
-0.7220569337  
-0.8024764805  
-0.8800556765  
-0.946594146  
-0.9947575437  
-1.018761018  
-1.014902092  
-0.9818854721  
-0.9208924686  
-0.8353876229  
-0.7306753212  
-0.6132675334  
-0.4901270196  
-0.3678845276  
-0.2521256106  
-0.146829629  
-0.05402747562  
0.02628868144  
0.09600021985  
0.1584815851  
0.218041329  
0.2792913476  
0.3464936028  
0.4229898727  
0.510763615  
0.6101861362  
0.7199724139  
0.8373353773  
0.9583115657  
1.078222123  
1.192191486  
1.295678128  
1.384934784  
1.457368018  
1.51173492  
1.54817505  
1.568072632  
1.573766373  
1.568151161  
1.55421179  
1.534557211  
1.51099405  
1.484209088  
1.453585104  
1.41718559  
1.371917094  
1.313858941  
1.238750165  
1.142581294  
1.022256629  
0.8762525918  
0.7052099203  
0.5123783535  
0.3038411923  
0.0884497064  
-0.1225711556  
-0.3163707579  
-0.4795483824  
-0.5994739642  
-0.6657483942  
-0.6716282126  
-0.615231737  
-0.5003400313  
-0.3366223172  
-0.1391947767  
0.07252877548  
0.2766022249  
0.4507797561  
0.5749470238  
0.6334715853  
0.6171462042  
0.5244636394  
0.3620171333  
0.1439455914  
-0.1095385121  
-0.3743740008  
-0.625355751  
-0.8389828578  
-0.9960927129  
-1.083948506  
-1.097522214  
-1.039836368  
-0.9213299416  
-0.7583651971  
-0.5710887721  
-0.3809250373  
-0.2080366336  
-0.06905611739  
0.02465585746  
0.06803403228  
0.06254511337  
0.0156511891  
-0.0603899189  
-0.1502030278  
-0.2372380636  
-0.3057363453  
-0.3425125931  
-0.3383750244  
-0.2890562857  
-0.1956027007  
-0.06421172693  
0.09443128605  
0.2662289006  
0.435050666  
0.5842764658  
0.6983750466  
0.7643827946  
0.7731524325  
0.7202679831  
0.6065366752  
0.4380035352  
0.2254658787  
-0.0164755106  
-0.2707599238  
-0.5194816696  
-0.7456030857  
-0.9346062313  
-1.075871081  
-1.163637339  
-1.197418145  
-1.181821834  
-1.125787948  
-1.041336867  
-0.9419923645  
-0.8410584055  
-0.7499922964  
-0.6770561186  
-0.6264286071  
-0.597879341  
-0.5870380288  
-0.5862134967  
-0.5856541189  
-0.5750567129  
-0.5451513588  
-0.4891192288  
-0.4036778112  
-0.2896845711  
-0.1521819169  
0.0001131258494  
0.1558165476  
0.302226428  
0.4268611665  
0.5189659156  
0.5708016653  
0.5785640033  
0.542801946  
0.4683207442  
0.3635675279  
0.2396185308  
0.1088868312  
-0.01626004456  
-0.1248086726  
-0.2081742924  
-0.260925865  
-0.2811002075  
-0.2701047429  
-0.2322502762  
-0.1740083844  
-0.1031048033  
-0.0275667932  
0.04517222511  
0.1090230098  
0.1597831544  
0.1954592945  
0.2163391838  
0.2248419971  
0.2251546179  
0.2226938817  
0.223423042  
0.2330847401  
0.2564049597  
0.2963501841  
0.3535349893  
0.425857651  
0.5084522437  
0.5940086308  
0.6734724807  
0.7370740672  
0.775599444  
0.7817415637  
0.751370221  
0.6845065442  
0.5858538534  
0.4647506219  
0.3344977263  
0.211091602  
0.1114919471  
0.05161226427  
0.04428612864  
0.09747699769  
0.2129846634  
0.3858367272  
0.6044834123  
0.851795021  
1.10676323  
1.34670769  
1.549713469  
1.696997727  
1.77491131  
1.776320649  
1.701209047  
1.556440628  
1.354732985  
1.112993205  
0.8502464413  
0.5854339  
0.3353538115  
0.1129916491  
-0.07357739717  
-0.2216251251  
-0.3335324452  
-0.4159659703  
-0.4786167649  
-0.5326908978  
-0.589353743  
-0.6583186375  
-0.746728849  
-0.8584156596  
-0.9935817585  
-1.148877971  
-1.317815416  
-1.49143166  
-1.659111617  
-1.809483109  
-1.931319481  
-2.014403565  
-2.050314447  
-2.033118129  
-1.959936621  
-1.83135095  
-1.651606655  
-1.42856632  
-1.173366254  
-0.8997607777  
-0.623162139  
-0.3594280799  
-0.1234967338  
0.07199036088  
0.2179291146  
0.3096861255  
0.3476046003  
0.3369803968  
0.2874968751  
0.2121597222  
0.1258521867  
0.04367057185  
-0.02074935935  
-0.05672146813  
-0.05762830877  
-0.02154345932  
0.0487141051  
0.1460882385  
0.2602722613  
0.379054449  
0.4898407492  
0.5811622195  
0.644002162  
0.6727771044  
0.6658699645  
0.625672649  
0.5581391013  
0.4719182362  
0.3771862471  
0.284322644  
0.2025994377  
0.1390535553  
0.0976782357  
0.07904395912  
0.08038848294  
0.09616374178  
0.11895468  
0.1406406021  
0.153620745  
0.1519269405  
0.1320632893  
0.09343734804  
0.0383323412  
-0.02857092817  
-0.1010364899  
-0.1723373512  
-0.2363614965  
-0.2885627962  
-0.3266068278  
-0.3505859927  
-0.3627800854  
-0.3669964604  
-0.3676189879  
-0.3685345814  
-0.3721535363  
-0.3787075085  
-0.3859850563  
-0.3895735283  
-0.3835966693  
-0.3618263669  
-0.3189979941  
-0.2520713873  
-0.1612186606  
-0.05031891936  
0.07315085341  
0.1988719107  
0.3149765747  
0.409709704  
0.4731961802  
0.4990309485  
0.4854380186  
0.4357923006  
0.3584313399  
0.2657521476  
0.172746494  
0.09517192845  
0.04763583008  
0.04184978204  
0.08528386802  
0.1803776114  
0.3243623716  
0.5096743135  
0.7248415421  
0.9556856303  
1.186664328  
1.402175361  
1.587708131  
1.730750763  
1.821438842  
1.852965297  
1.821798674  
1.727766964  
1.574040669  
1.367037865  
1.116225981  
0.8337834192  
0.5340779806  
0.2329055074  
-0.05349575942  
-0.3096430749  
-0.5221155653  
-0.6808436295  
-0.7802180696  
-0.8198441966  
-0.8047971575  
-0.7452807208  
-0.6556629963  
-0.5529626034  
-0.4549249875  
-0.3779269167  
-0.3349627021  
-0.334007808  
-0.3769793947  
-0.4594948388  
-0.5714648588  
-0.6984983709  
-0.8239320432  
-0.9312165928  
-1.00633919  
-1.039917219  
-1.028653558  
-0.9759236229  
-0.8913813251  
-0.7896187947  
-0.6880545198  
-0.6043480626  
-0.5537199841  
-0.5465711318  
-0.5867723779  
-0.6708862059  
-0.788462931  
-0.9233793641  
-1.056030516  
-1.166063825  
-1.235241687  
-1.25000613  
-1.203363436  
-1.095794655  
-0.9350755039  
-0.7350241773  
-0.5133971109  
-0.289258765  
-0.08024639246  
0.0998393917  
0.2427501153  
0.3465538277  
0.4153574312  
0.458053713  
0.4863408762  
0.5123543549  
0.5463259215  
0.5946594633  
0.6587544751  
0.7347403748  
0.8141855193  
0.8856199437  
0.9366306102  
0.956169786  
0.9367005306  
0.8758205596  
0.7771293954  
0.65018367  
0.5095542987  
0.3731381772  
0.2599492774  
0.1877219054  
0.1706318757  
0.2174454103  
0.3303059503  
0.5042973341  
0.7278040317  
0.98359554  
1.250493115  
1.505396537  
1.725459841  
1.890168751  
1.983133912  
1.993430268  
1.916391024  
1.753804652  
1.513542805  
1.208682039  
0.8562329682  
0.4756200459  
0.08706554092  
-0.2899744918  
-0.638175425  
-0.9434115793  
-1.195452771  
-1.388257539  
-1.519886469  
-1.592084031  
-1.609615894  
-1.579464194  
-1.5099825  
-1.410115652  
-1.288748405  
-1.154237803  
-1.01413907  
-0.8751111829  
-0.7429546963  
-0.6227310415  
-0.5188899439  
-0.4353593348  
-0.3755493857  
-0.3422514294  
-0.3374464894  
-0.3620454016  
-0.4156205292  
-0.4961721077  
-0.6000041202  
-0.7217333424  
-0.8544667198  
-0.9901471776  
-1.120023472  
-1.235214909  
-1.327296458  
-1.388852599  
-1.4139378  
-1.398414308  
-1.340152184  
-1.239093836  
-1.097222422  
-0.9184450893  
-0.7084413632  
-0.4744838739  
-0.2252355315  
0.02949057508  
0.2790390269  
0.5123187168  
0.7183340003  
0.8868421553  
1.009112242  
1.07872815  
1.092351912  
1.050336014  
0.9570798291  
0.8210362492  
0.6543079177  
0.4718139804  
0.2900783368  
0.1257579881  
-0.005968049783  
-0.09292214651  
-0.1271974438  
-0.1059723183  
-0.03176450397  
0.08795539942  
0.2417562552  
0.4157420312  
0.5953615873  
0.7672946731  
0.9211616128  
1.050808728  
1.154972648  
1.237223547  
1.305169677  
1.369029886  
1.439760247  
1.527013987  
1.637228742  
1.772132429  
1.927908519  
2.095157432  
2.25968843  
2.404045079  
2.509559026  
2.558647951  
2.5370339  
2.435575216  
2.251455471  
1.988571239  
1.657083624  
1.272222066  
0.8525181624  
0.417754124  
-0.01309170778  
-0.4236031005  
-0.8011673883  
-1.137565082  
-1.428869406  
-1.674754773  
-1.877367815  
-2.040010665  
-2.165882935  
-2.257104608  
-2.314197445  
-2.336080085  
-2.320565137  
-2.265229056  
-2.168467324  
-2.030511301  
-1.854199313  
-1.645325301  
-1.412496338  
-1.166493988  
-0.9192468526  
-0.6825898494  
-0.4670225528  
-0.2806742012  
-0.12865788  
-0.01290609324  
0.06749614381  
0.1155675754  
0.1354351242  
0.1312915109  
0.1065256524  
0.0631947904  
0.001962581087  
-0.07748749643  
-0.1756478126  
-0.2921450555  
-0.4247061529  
-0.5683539881  
-0.7150594966  
-0.8539663879  
-0.9722440553  
-1.056457354  
-1.094288711  
-1.076319716  
-0.9975927779  
-0.8586650682  
-0.6659596852  
-0.4313182957  
-0.1707959985  
0.09714020989  
0.3537462309  
0.5821659888  
0.7693014821  
0.9071439251  
0.9933823224  
1.031238282  
1.028581764  
0.9964967507  
0.9475137146  
0.8937961531  
0.8455118932  
0.8096272482  
0.7892475013  
0.7835682556  
0.7883785162  
0.7970311349  
0.8016738402  
0.7945642809  
0.7692746966  
0.721614631  
0.6501892311  
0.5565244667  
0.4448091898  
0.3213037729  
0.1935377644  
0.06941451834  
-0.04365431623  
-0.1394950927  
-0.2137187229  
-0.2640426383  
-0.2903761688  
-0.2946941003  
-0.280725058  
-0.2535138138  
-0.2188843175  
-0.1828679094  
-0.1511298655  
-0.1284457676  
-0.1182662439  
-0.1224173297  
-0.1409650081  
-0.1722734273  
-0.2132526378  
-0.2597892726  
-0.3072916067  
-0.3513059153  
-0.3880984787  
-0.4151242078  
-0.4313042574  
-0.4370670791  
-0.4341388189  
-0.4251161077  
-0.4129006462  
-0.4000904924  
-0.388442519  
-0.3785133333  
-0.3695508702  
-0.3596709877  
-0.3462876226  
-0.3267370926  
-0.2989695827  
-0.2621805647  
-0.2172425202  
-0.1668425155  
-0.1152617551  
-0.06781258189  
-0.03000167037  
-0.006555673861  
-0.0004712625113  
-0.01226281195  
-0.03956990243  
-0.07721263081  
-0.1177382834  
-0.1524020187  
-0.1724612329  
-0.1705804857  
-0.1421547223  
-0.08630196247  
-0.006368717735  
0.09017936651  
0.1925037355  
0.2876896115  
0.3624514831  
0.40499317  
0.4067654746  
0.3638536431  
0.2777698795  
0.1555101953  
0.008842508319  
-0.1471037446  
-0.295758485  
-0.4212742747  
-0.5106213039  
-0.555291561  
-0.5523543003  
-0.5046820537  
-0.4202918292  
-0.3108932863  
-0.1898486453  
-0.06986376511  
0.03922566255  
0.1322044693  
0.2094671366  
0.277058324  
0.3457321228  
0.4291509785  
0.5414936717  
0.6948388926  
0.8967361229  
1.148343746  
1.44343473  
1.768443991  
2.103546244  
2.42464664  
2.705998611  
2.923104204  
3.055522284  
3.089227132  
3.018244875  
2.845385881  
2.582019288  
2.246932981  
1.864440227  
1.461938879  
1.067203483  
0.7056714194  
0.3979932267  
0.158075994  
-0.008202371669  
-0.1034875851  
-0.1386041316  
-0.1313933131  
-0.1048366698  
-0.08462612853  
-0.09641479557  
-0.1630126498  
-0.3018182814  
-0.5227538018  
-0.82695109  
-1.206336418  
-1.64419056  
-2.116641255  
-2.594929829  
-3.048220371  
-3.44662766  
-3.764127983  
-3.981016257  
-4.085638701  
-4.075213645  
-3.955670767  
-3.740562247  
-3.449206212  
-3.104330588  
-2.729513906  
-2.346746336  
-1.97439404  
-1.62578816  
-1.308550962  
-1.024681378  
-0.7713206702  
-0.5420397263  
-0.3284216132  
-0.1217326919  
0.08556422326  
0.2986132551  
0.5194165037  
0.7465852244  
0.9755757028  
1.199336957  
1.409262118  
1.596294425  
1.752047337  
1.869804766  
1.945283701  
1.977087041  
1.966804631  
1.918769316  
1.839500224  
1.736920518  
1.619428586  
1.494959526  
1.370126599  
1.249569437  
1.135571796  
1.028006012  
0.9246035517  
0.8215095617  
0.7140550346  
0.5976245879  
0.4685114097  
0.3246447437  
0.1660773592  
-0.004804937478  
-0.1833859081  
-0.3632068101  
-0.5365734533  
-0.6952964604  
-0.8314669863  
-0.9381761433  
-1.010085759  
-1.043826058  
-1.038173909  
-0.9940437306  
-0.9143105704  
-0.8035262456  
-0.6675770139  
-0.513325273  
-0.3482729165  
-0.1802528421  
-0.01713319253  
0.1334764663  
0.2645575189  
0.370063951  
0.4453582758  
0.4876787999  
0.4965705806  
0.4742234846  
0.4256171925  
0.3583981775  
0.2824450564  
0.2091063371  
0.1501614455  
0.1165881925  
0.1172888823  
0.1579228082  
0.2400207391  
0.3605010054  
0.5117003464  
0.6819294435  
0.8565263595  
1.019285571  
1.15411968  
1.246738898  
1.286161205  
1.265872406  
1.184483739  
1.045827945  
0.8584819883  
0.6347782948  
0.3894388236  
0.1380055236  
-0.1047423934  
-0.326191841  
-0.5169585973  
-0.6714978119  
-0.7882133999  
-0.8690818427  
-0.9188716611  
-0.944091039  
-0.9518216672  
-0.9486078332  
-0.9395523207  
-0.9277340046  
-0.9140102731  
-0.8972061034  
-0.874637667  
-0.8428614272  
-0.7985247925  
-0.7391589854  
-0.6637983486  
-0.5733152276  
-0.4704403085  
-0.3594614702  
