-0.269452217  
-0.2615704466  
-0.2528538412  
-0.2427266981  
-0.2307071139  
-0.2164422761  
-0.1997263377  
-0.1805081518  
-0.1588924945  
-0.1351416897  
-0.1096917342  
-0.08317412481  
-0.05644048761  
-0.03057378889  
-0.006862037768  
0.01328883628  
0.02850658873  
0.03768079464  
0.04023603133  
0.0364143171  
0.0275075502  
0.01598051262  
0.005423739548  
0.0002989933529  
0.005477165454  
0.02558793979  
0.06425337155  
0.1233104308  
0.2021321577  
0.2971722976  
0.4018333131  
0.5067325357  
0.6003744326  
0.6701981352  
0.7039043123  
0.6909107594  
0.6237683902  
0.4993455997  
0.3196157538  
0.09192026589  
-0.1713582151  
-0.4537057322  
-0.7358826923  
-0.9976758809  
-1.219800198  
-1.385729335  
-1.483252746  
-1.50557854  
-1.451872952  
-1.327193748  
-1.141838479  
-0.9102108212  
-0.6493366903  
-0.3772127219  
-0.1111605603  
0.1336482163  
0.3453501424  
0.5161470657  
0.6426053464  
0.7255066996  
0.7692949693  
0.7812107632  
0.7702219214  
0.7458878619  
0.7172750602  
0.6920505077  
0.6758218864  
0.6717923514  
0.680728179  
0.7012216794  
0.7301896595  
0.7635274763  
0.7968332444  
0.8261075932  
0.8483474782  
0.861974503  
0.8670443666  
0.8652258012  
0.8595512344  
0.8539694439  
0.8527503303  
0.8598178951  
0.8780852815  
0.9088800579  
0.9515486288  
1.003285559  
1.059248064  
1.112950104  
1.156914205  
1.183521627  
1.185958128  
1.159151053  
1.100566086  
1.010754283  
0.893556419  
0.7559011225  
0.6072051647  
0.4584026899  
0.3207159719  
0.2042928905  
0.1168920057  
0.06277162934  
0.04195946702  
0.0500030425  
0.07827646419  
0.1148244986  
0.1456724816  
0.1564489731  
0.1341319352  
0.0687027801  
-0.04550258418  
-0.2089246773  
-0.4165113662  
-0.6580961627  
-0.9193897308  
-1.18347149  
-1.432605683  
-1.650165796  
-1.822428048  
-1.940017389  
-1.998826942  
-2.00029834  
-1.951035716  
-1.861809903  
-1.746088554  
-1.618297188  
-1.492041278  
-1.378525215  
-1.28537527  
-1.2160067  
-1.169598643  
-1.141643854  
-1.124977217  
-1.11110233  
-1.091612336  
-1.059491488  
-1.010119404  
-0.9418413362  
-0.856056685  
-0.756828474  
-0.6501156022  
-0.5427570884  
-0.4413825655  
-0.3514257406  
-0.2763801169  
-0.2174147337  
-0.1733873512  
-0.1412403504  
-0.1167038446  
-0.09517859164  
-0.07265961284  
-0.04652804158  
-0.01609419204  
0.01720582123  
0.05000927251  
0.07758414742  
0.09467058441  
0.09647663095  
0.07966897698  
0.04319620854  
-0.01119310292  
-0.07883205706  
-0.1524593934  
-0.2229497732  
-0.2803596322  
-0.315146067  
-0.3193950889  
-0.2878800203  
-0.2188114199  
-0.1141703338  
0.02041563728  
0.1762340108  
0.3424100998  
0.5070682286  
0.6585824476  
0.7867632177  
0.8838494226  
0.9451988515  
0.9696244864  
0.959354582  
0.919659452  
0.8581993817  
0.7841936287  
0.7074939099  
0.637673189  
0.5831989624  
0.550765942  
0.5448166562  
0.5672839833  
0.6175469685  
0.6925859108  
0.7873231536  
0.8951039833  
1.008301606  
1.118987505  
1.219641032  
1.303833895  
1.366840605  
1.406113511  
1.421563292  
1.415592873  
1.392861964  
1.359770377  
1.323695257  
1.292054298  
1.27128698  
1.265885177  
1.277601113  
1.304948285  
1.343090102  
1.384145669  
1.417905382  
1.432872931  
1.417515676  
1.361567406  
1.257217344  
1.100043406  
0.8895753976  
0.6294328564  
0.3270321824  
-0.007070958248  
-0.3601192382  
-0.718234626  
-1.067515297  
-1.395029501  
-1.689613042  
-1.942413335  
-2.147170611  
-2.300250789  
-2.400483752  
-2.448862111  
-2.448176108  
-2.402633476  
-2.317504148  
-2.1988254  
-2.053147744  
-1.887333935  
-1.708376439  
-1.523210714  
-1.338516347  
-1.160484173  
-0.9945591388  
-0.8451705643  
-0.7154787517  
-0.6071669564  
-0.5203243203  
-0.453447937  
-0.4035873079  
-0.3666441448  
-0.3377987912  
-0.3120386884  
-0.284716495  
-0.2520687413  
-0.2116128534  
-0.1623576382  
-0.1047817546  
-0.04057104991  
0.02784897923  
0.09790953316  
0.167513632  
0.2355500753  
0.3021852715  
0.3688580576  
0.4379343341  
0.5120656125  
0.5933476712  
0.6824182327  
0.7776898123  
0.8748754906  
0.9669520971  
1.044626222  
1.097286744  
1.114339008  
1.086738211  
1.008488326  
0.8778726924  
0.6981926422  
0.4778845418  
0.2299488239  
-0.0292446672  
-0.2816339689  
-0.5093940417  
-0.6968690773  
-0.8322403364  
-0.9087179826  
-0.9251183423  
-0.8857658907  
-0.7997729841  
-0.6798090225  
-0.5405514177  
-0.3970257644  
-0.2630402199  
-0.1499022502  
-0.06552828162  
-0.01401960686  
0.004310552144  
-0.007488826075  
-0.0437206638  
-0.09692516185  
-0.1588074335  
-0.2211071492  
-0.276327462  
-0.3182942886  
-0.3425239911  
-0.3464327805  
-0.3294085571  
-0.2927838874  
-0.239724341  
-0.1750400657  
-0.104904176  
-0.03646397132  
0.02267945517  
0.06512175475  
0.08440577237  
0.0758182858  
0.03714058458  
-0.03075800951  
-0.1235884257  
-0.2336685211  
-0.3503533835  
-0.4608668183  
-0.5514699578  
-0.608850217  
-0.6215708334  
-0.5814072189  
-0.4844098889  
-0.3315512059  
-0.1288761677  
0.1128696824  
0.3791041575  
0.6526798453  
0.9154326766  
1.149861292  
1.34077253  
1.476738381  
1.551228614  
1.563302624  
1.517789708  
1.424918012  
1.299404428  
1.159064322  
1.023048568  
0.9098492208  
0.8352868583  
0.8106581511  
0.8412907104  
0.9256681268  
1.055293458  
1.215341978  
1.386096238  
1.545025219  
1.66929864  
1.738434494  
1.736743292  
1.655250725  
1.492812612  
1.256266179  
0.9595713018  
0.6220551195  
0.2660043328  
-0.08606036549  
-0.4140379728  
-0.7024542262  
-0.9419372206  
-1.129766295  
-1.269474871  
-1.369606354  
-1.441854081  
-1.49889559  
-1.552251569  
-1.610482847  
-1.677964215  
-1.754380317  
-1.834964787  
-1.911411164  
-1.973277904  
-2.009666501  
-2.010915514  
-1.97008114  
-1.884007717  
-1.753863856  
-1.585101403  
-1.386868208  
-1.17098299  
-0.950620175  
-0.7388941278  
-0.547517612  
-0.3856970443  
-0.2593746162  
-0.1708835414  
-0.1190112518  
-0.0994272707  
-0.105379328  
-0.1285513862  
-0.1599687609  
-0.1908451657  
-0.2133006764  
-0.2209012639  
-0.2090134512  
-0.1749820557  
-0.1181595298  
-0.03981949815  
0.05701851974  
0.1678352021  
0.2869276257  
0.4077920381  
0.5235823061  
0.627640876  
0.7140737049  
0.7783447325  
0.8178154069  
0.8321693465  
0.8236359667  
0.7969569137  
0.7590435753  
0.7183367101  
0.6839000782  
0.6643449102  
0.6667038452  
0.6954194749  
0.7515830224  
0.8325659994  
0.93212868  
1.041018006  
1.148012088  
1.241282014  
1.309893092  
1.34523248  
1.342161402  
1.299705177  
1.221187417  
1.113771312  
0.9874765677  
0.853813399  
0.7242336098  
0.6086217671  
0.5140385019  
0.4438906738  
0.3976188317  
0.3709360647  
0.3565485178  
0.3452366118  
0.3271339366  
0.2930149182  
0.2354343235  
0.1495794159  
0.03376592802  
-0.1104537623  
-0.2785350619  
-0.4634753414  
-0.6565443043  
-0.8481156978  
-1.028511236  
-1.188783005  
-1.32138718  
-1.420714017  
-1.483464573  
-1.50885753  
-1.49867716  
-1.457147822  
-1.390639419  
-1.307207374  
-1.215973869  
-1.126385495  
-1.047390801  
-0.986608516  
-0.9495674528  
-0.9391144429  
-0.9550703444  
-0.9942024584  
-1.050542242  
-1.116033076  
-1.181448096  
-1.237468472  
-1.275792657  
-1.290117225  
-1.276854438  
-1.235479518  
-1.16844497  
-1.08067924  
-0.9787333111  
-0.8697100082  
-0.7601391367  
-0.6549859347  
-0.5569399102  
-0.4661135067  
-0.3801962427  
-0.295040582  
-0.2055859105  
-0.1069616135  
0.004418912834  
0.1299574217  
0.2683359591  
0.4154352393  
0.5647450422  
0.7082025222  
0.8373316692  
0.944505231  
1.024118541  
1.073489615  
1.093331163  
1.087717255  
1.063537179  
1.029526037  
0.99501318  
0.9685775596  
0.9568225021  
0.963446649  
0.9887485867  
1.029645073  
1.080183972  
1.132476122  
1.177905418  
1.208432477  
1.217797785  
1.202455259  
1.162096395  
1.099703742  
1.021130333  
0.9342796501  
0.8480191449  
0.7709927487  
0.7105123616  
0.6716969416  
0.6569703803  
0.6659832076  
0.69594413  
0.7422904  
0.79956131  
0.8623177946  
0.9259512729  
0.9872383282  
1.044563254  
1.097774777  
1.147732349  
1.195632512  
1.242267635  
1.287368337  
1.329163913  
1.36426249  
1.387883608  
1.394399244  
1.378090325  
1.333961726  
1.258470879  
1.150008578  
1.009050961  
0.8379487238  
0.6404120099  
0.4208003463  
0.1833794577  
-0.06828334595  
-0.3316536775  
-0.6052071951  
-0.888038413  
-1.179189927  
-1.476822479  
-1.7774231  
-2.075223225  
-2.361986618  
-2.627256059  
-2.859071738  
-3.045089253  
-3.173947259  
-3.236693779  
-3.228055962  
-3.147357146  
-2.998935661  
-2.791994346  
-2.539872932  
-2.258841786  
-1.966551224  
-1.680332559  
-1.415546864  
-1.184182267  
-0.993847551  
-0.8472715359  
-0.7423509284  
-0.6727250525  
-0.6288044738  
-0.5991219451  
-0.5718577093  
-0.5363577052  
-0.4844794223  
-0.4116088222  
-0.3172255964  
-0.2049455924  
-0.08202092572  
0.04166242694  
0.1549767996  
0.2471825433  
0.3095900244  
0.3370333123  
0.3289421184  
0.2898321937  
0.2290997443  
0.1600927545  
0.09853168189  
0.06045285968  
0.05993352932  
0.1069012025  
0.2053597393  
0.3523055544  
0.5375430838  
0.744474466  
0.9518111995  
1.136010161  
1.274118881  
1.346661721  
1.340158802  
1.248942556  
1.076011054  
0.8328201977  
0.5380467642  
0.2155177408  
-0.1084067178  
-0.4076214629  
-0.6588896942  
-0.8439511489  
-0.9509126623  
-0.9748140949  
-0.9173918191  
-0.7861672585  
-0.5930653691  
-0.3528069598  
-0.08131067756  
0.2056917555  
0.4936983877  
0.7700758066  
1.024311286  
1.247957769  
1.434385179  
1.578472242  
1.676344803  
1.725263397  
1.72368184  
1.671480981  
1.570313934  
1.42397013  
1.238664275  
1.023130591  
0.788452912  
0.5475786343  
0.314526231  
0.1033427729  
-0.07308951512  
-0.2042576825  
-0.2830840135  
-0.3067079947  
-0.2768582094  
-0.1997469426  
-0.08546782038  
0.05305495754  
0.2014542296  
0.3454871682  
0.4725823466  
0.5731766761  
0.641657624  
0.6767771481  
0.6814771379  
0.6621395766  
0.6273595346  
0.5864218039  
0.5476962913  
0.5172029092  
0.4975764202  
0.4875934661  
0.4823688905  
0.4741959897  
0.4539185846  
0.4126277534  
0.3434059218  
0.2428422329  
0.1120511011  
-0.04299136766  
-0.2118721831  
-0.380886887  
-0.5347602853  
-0.6586791636  
-0.7403431367  
-0.771728727  
-0.7502944521  
-0.6794545849  
-0.5682454506  
-0.4302487786  
-0.2819187532  
-0.1405692961  
-0.0222903464  
0.05990845642  
0.09750075195  
0.08722631713  
0.03118949167  
-0.063701648  
-0.186841957  
-0.3253984881  
-0.4659558543  
-0.5960989041  
-0.7057847372  
-0.7883306364  
-0.8409515639  
-0.8648057407  
-0.8645738401  
-0.8476379753  
-0.8229582864  
-0.799774972  
-0.7862786899  
-0.7883909216  
-0.8087930903  
-0.8463329966  
-0.8959023198  
-0.9488322261  
-0.9938189851  
-1.018312817  
-1.01024169  
-0.9598935011  
-0.8617067327  
-0.7157314677  
-0.5284933011  
-0.3130722643  
-0.08827025156  
0.1231327788  
0.2969012458  
0.4103778829  
0.4456531676  
0.3924201779  
0.2500596804  
0.0285747249  
-0.2518815457  
-0.5629323212  
-0.8711925688  
-1.142386215  
-1.34580211  
-1.458446209  
-1.468239562  
-1.375760139  
-1.194213631  
-0.9476068744  
-0.6673882141  
-0.3880476216  
-0.1423566516  
0.04303855408  
0.1510200653  
0.1759179081  
0.1237260639  
0.01065490337  
-0.1396634953  
-0.2998375573  
-0.4426408583  
-0.5446151532  
-0.5888529498  
-0.5666387241  
-0.4778149803  
-0.3299581436  
-0.1366198223  
0.08502181653  
0.3166793355  
0.5412720655  
0.7447451485  
0.9172071324  
1.053342251  
1.152157714  
1.216228348  
1.250636231  
1.261827848  
1.256568363  
1.241130329  
1.220777087  
1.199557463  
1.180340107  
1.165021336  
1.154791358  
1.150382216  
1.15222755  
1.160506709  
1.175077055  
1.195341353  
1.220094158  
1.247422869  
1.274709966  
1.29877107  
1.316132408  
1.323424107  
1.317834394  
1.297549631  
1.262112452  
1.21261411  
1.151679212  
1.083212571  
1.011920309  
0.9426604289  
0.879686618  
0.8259059205  
0.7822482202  
0.747264363  
0.7170360053  
0.6854419912  
0.64478986  
0.5867516217  
0.5035103435  
0.3889632589  
0.2398278736  
0.05647293805  
-0.1566543694  
-0.3911109278  
-0.6350662779  
-0.8744017265  
-1.094174126  
-1.280271439  
-1.421047469  
-1.508721646  
-1.540342394  
-1.518184008  
-1.449507659  
-1.3457137  
-1.220987965  
-1.090620956  
-0.9692233666  
-0.8690716967  
-0.7988027909  
-0.7626176465  
-0.7600891745  
-0.7865660737  
-0.8341010803  
-0.8927322503  
-0.9519211036  
-1.001928172  
-1.034933838  
-1.045756168  
-1.03210334  
-0.9943755844  
-0.9351089556  
-0.8582058622  
-0.7681375044  
-0.6692766147  
-0.5654956953  
-0.4600876036  
-0.3559948051  
-0.2562503694  
-0.1644926125  
-0.08536093058  
-0.02462738843  
0.01106683233  
0.01489579331  
-0.01909427641  
-0.09471292759  
-0.2123566084  
-0.3680061876  
-0.5527306902  
-0.752885848  
-0.951085845  
-1.12789829  
-1.264083961  
-1.34307883  
-1.353355339  
-1.290280305  
-1.157147344  
-0.9651521255  
-0.7322610903  
-0.4810677239  
-0.2359160133  
-0.01967529028  
0.1493606952  
0.2599977832  
0.3097055996  
0.3049705079  
0.2603717454  
0.1965044792  
0.1370305537  
0.1052864597  
0.1209335161  
0.1971178683  
0.3385462508  
0.5407284863  
0.7904745113  
1.067545605  
1.347207982  
1.603302673  
1.811413782  
1.951703048  
2.011065218  
1.98437035  
1.874686081  
1.692538167  
1.454358116  
1.180374986  
0.892234102  
0.6106457255  
0.3533088873  
0.1333210492  
-0.04179881788  
-0.1704095731  
-0.2563840716  
-0.3081439853  
-0.3372059956  
-0.3564083735  
-0.3779875823  
-0.4117229832  
-0.4633494797  
-0.533435261  
-0.6168759399  
-0.703109588  
-0.7770658666  
-0.820792885  
-0.8156008677  
-0.7444962251  
-0.5946198818  
-0.3593870735  
-0.04005205456  
0.3535343691  
0.803098707  
1.283075637  
1.762597867  
2.208144086  
2.586564416  
2.868153569  
3.029444191  
3.055422302  
2.940940499  
2.691188751  
2.321194387  
1.854414632  
1.320586535  
0.7530621781  
0.1858966362  
-0.3490090704  
-0.8244467612  
-1.219883843  
-1.522713552  
-1.728696827  
-1.84157874  
-1.871974669  
-1.835673293  
-1.751578488  
-1.639521047  
-1.518182189  
-1.403347205  
-1.306638727  
-1.234836938  
-1.189794407  
-1.168912325  
-1.166054748  
-1.172764218  
-1.179612114  
-1.177512329  
-1.158874031  
-1.118475181  
-1.054004041  
-0.9662451162  
-0.8589293477  
-0.7382878063  
-0.6123795255  
-0.4902543377  
-0.3810381446  
-0.2929971108  
-0.232666145  
-0.204097862  
-0.2083038555  
-0.2429438099  
-0.3023139737  
-0.377655587  
-0.4578041045  
-0.5301304121  
-0.5817206549  
-0.6006753332  
-0.5774048072  
-0.5057589789  
-0.383853894  
-0.2144724882  
-0.004966252496  
0.2333517031  
0.4862666116  
0.7380511393  
0.9730286987  
1.177101212  
1.339066395  
1.451558927  
1.511513376  
1.520111621  
1.482253069  
1.405646758  
1.29967408  
1.174192045  
1.038444925  
0.9002180242  
0.765319908  
0.6374279593  
0.5182590561  
0.4079942023  
