-0.5623500032  
-0.2619642649  
0.03184173982  
0.3108868645  
0.5659592611  
0.7866427198  
0.9616281016  
1.079532135  
1.130139597  
1.105904371  
1.003453207  
0.8248468583  
0.5783367033  
0.2784612108  
-0.05461241517  
-0.3964816291  
-0.7204899794  
-1.000101788  
-1.211378939  
-1.335282465  
-1.359517808  
-1.279713701  
-1.09980501  
-0.8315749207  
-0.4934456712  
-0.1086564911  
0.2969402398  
0.6971949972  
1.067845194  
1.38834236  
1.643153564  
1.822471503  
1.922329571  
1.944201799  
1.894216024  
1.782137726  
1.620259616  
1.42234134  
1.202650953  
0.9751651516  
0.7529139227  
0.5474403423  
0.3683632922  
0.2229954033  
0.1160526661  
0.04945636084  
0.02229111672  
0.03094176465  
0.06947521197  
0.1302299385  
0.204602148  
0.2839333459  
0.360388376  
0.4276978516  
0.4816578764  
0.5202949369  
0.5436811628  
0.5534409044  
0.5520413901  
0.542015094  
0.5252705013  
0.5026336872  
0.473715682  
0.4371470786  
0.3911218233  
0.3341474927  
0.2658409559  
0.1875858688  
0.1028955463  
0.01736474747  
-0.06182369182  
-0.1267934543  
-0.1701407214  
-0.1861814002  
-0.1720682591  
-0.1285479238  
-0.06020242946  
0.02491984911  
0.116275657  
0.2022947437  
0.2721268852  
0.3174049184  
0.3337291383  
0.3215841598  
0.2864924438  
0.2383182454  
0.1897342408  
0.154072031  
0.1428339449  
0.1632645578  
0.2164002763  
0.2959614201  
0.3883543925  
0.4738909979  
0.5291393072  
0.5301242996  
0.4559577831  
0.2923616998  
0.03453332856  
-0.3111224705  
-0.7267228246  
-1.184223077  
-1.648196882  
-2.07975507  
-2.441061892  
-2.699857364  
-2.833331278  
-2.83082945  
-2.695009049  
-2.441310194  
-2.095829876  
-1.69193991  
-1.266131865  
-0.8536973875  
-0.4848072697  
-0.1815283337  
0.04392660248  
0.189525316  
0.2624492038  
0.2770329263  
0.2520394369  
0.2076969008  
0.1629320112  
0.1331577116  
0.1288389498  
0.1549116696  
0.2110204568  
0.2923891324  
0.3910994914  
0.4975320832  
0.6017217249  
0.6944722316  
0.7681165486  
0.8168998399  
0.8370394856  
0.8265332382  
0.7848461617  
0.7125891296  
0.611284834  
0.4832673911  
0.3317661856  
0.1611099953  
-0.02299739443  
-0.2132428788  
-0.4006195327  
-0.5746075903  
-0.723693891  
-0.8362520207  
-0.9017412469  
-0.912088223  
-0.8630847857  
-0.7555484275  
-0.5960212673  
-0.3968077242  
-0.175239452  
0.04784860292  
0.2502792399  
0.4111062114  
0.5132421619  
0.545770292  
0.5055828631  
0.3980587254  
0.236658962  
0.0414347426  
-0.1633599373  
-0.3522191396  
-0.5015153935  
-0.5923614276  
-0.6128138446  
-0.5591459356  
-0.4360286162  
-0.2556607143  
-0.03599545222  
0.2016357585  
0.4351443579  
0.6442037333  
0.8123225336  
0.9282663835  
0.9866960693  
0.9880506756  
0.9377747481  
0.8450894593  
0.7215306298  
0.579484271  
0.4308905526  
0.2862589172  
0.1540455274  
0.04038890478  
-0.05083666488  
-0.1177502189  
-0.1600400227  
-0.1784990904  
-0.1745753109  
-0.1499865892  
-0.1064397602  
-0.04545171542  
0.03172012223  
0.1240424892  
0.2305927634  
0.35035715  
0.4819750232  
0.6234492123  
0.7718455029  
0.9230428528  
1.071568976  
1.2105954  
1.332117163  
1.4273629  
1.487421312  
1.504029433  
1.47047248  
1.382452461  
1.238818088  
1.042044192  
0.7983559382  
0.517457129  
0.2118686703  
-0.1040490106  
-0.4152857921  
-0.7074240332  
-0.9677875665  
-1.186342472  
-1.356255086  
-1.474047859  
-1.539374842  
-1.554473582  
-1.52342496  
-1.451344578  
-1.343665192  
-1.205608092  
-1.041932879  
-0.85696159  
-0.6548411628  
-0.4399574176  
-0.2173562821  
0.006938516788  
0.2258323463  
0.4313581209  
0.6151687422  
0.7692742699  
0.8869154856  
0.9634120675  
0.9968403671  
0.9883939033  
0.942324688  
0.8654467255  
0.7662455879  
0.6537119715  
0.5360718204  
0.4196227669  
0.3078679513  
0.2011063192  
0.09655964209  
-0.01095317553  
-0.127884793  
-0.2605514755  
-0.413647923  
-0.5889495732  
-0.7843993997  
-0.9937644246  
-1.206918778  
-1.410747884  
-1.590547156  
-1.731722522  
-1.821539639  
-1.850683214  
-1.814392744  
-1.713034357  
-1.552033296  
-1.341220918  
-1.093706739  
-0.8244722028  
-0.5488997537  
-0.2814615599  
-0.03470969947  
0.1813078711  
0.3592086884  
0.49407954  
0.5830380649  
0.624713571  
0.6188136626  
0.5658815591  
0.4673234134  
0.3256908826  
0.1451510986  
-0.06799844058  
-0.3049044906  
-0.5539910745  
-0.8011590391  
-1.030405308  
-1.224857208  
-1.36810809  
-1.445725104  
-1.446737167  
-1.364892861  
-1.199535895  
-0.9559686979  
-0.6452477972  
-0.2834398764  
0.1095871251  
0.5116766123  
0.9000485485  
1.252936365  
1.551044905  
1.778726826  
1.924810958  
1.983087777  
1.952464148  
1.836860188  
1.644892596  
1.389381794  
1.086712437  
0.7560299815  
0.4182538756  
0.09489989477  
-0.193290137  
-0.4278466073  
-0.5941024688  
-0.6825958984  
-0.6901585839  
-0.6205174011  
-0.4842425296  
-0.297964776  
-0.08288892605  
0.1373055467  
0.3389348109  
0.500888576  
0.6069892755  
0.6478412629  
0.6219234304  
0.5357901906  
0.4033387923  
0.2442349708  
0.08167984734  
-0.06021476492  
-0.159134752  
-0.1970511826  
-0.1622081647  
-0.05039621705  
0.1346032407  
0.3814393497  
0.6723983578  
0.9852504682  
1.295506366  
1.578832877  
1.813350468  
1.981573524  
2.071791262  
2.078764726  
2.003689853  
1.853483502  
1.639523605  
1.376034467  
1.078364047  
0.7613948748  
0.438305836  
0.1198295499  
-0.1859253436  
-0.4731197083  
-0.7374165861  
-0.9750026519  
-1.181608426  
-1.351770338  
-1.478500842  
-1.553498563  
-1.567897165  
-1.513492528  
-1.38427578  
-1.178044683  
-0.8978329839  
-0.5528988026  
-0.1590646136  
0.2617328814  
0.6827146065  
1.074275797  
1.406567337  
1.652361962  
1.789868614  
1.805135109  
1.693726428  
1.461406933  
1.123719895  
0.7044514182  
0.2331487807  
-0.2580094515  
-0.7376052964  
-1.178184895  
-1.558857273  
-1.866936134  
-2.098420052  
-2.257262696  
-2.35357961  
-2.40108184  
-2.414156045  
-2.405066666  
-2.381733008  
-2.346453916  
-2.295785745  
-2.221616755  
-2.113260738  
-1.960234794  
-1.755234352  
-1.496795711  
-1.191132494  
-0.8527647782  
-0.5037328273  
-0.1714262054  
0.1147496518  
0.3273807693  
0.4451499931  
0.4563977055  
0.3615291126  
0.1738498004  
-0.08140965965  
-0.3697915851  
-0.6517254324  
-0.8874813458  
-1.042270141  
-1.090748554  
-1.020273554  
-0.8324428528  
-0.5427117185  
-0.1781706271  
0.2261540331  
0.631903483  
1.002209028  
1.306039168  
1.521500738  
1.637671116  
1.654850645  
1.583313189  
1.440883769  
1.249821482  
1.033533319  
0.813627723  
0.6077057048  
0.4281136866  
0.2817133155  
0.1705187593  
0.09296220398  
0.04542167215  
0.02369913119  
0.02414360484  
0.04426935025  
0.08280753814  
0.1392803259  
0.2132710917  
0.3036161493  
0.4077462914  
0.5213499217  
0.6384647353  
0.7519831348  
0.8544878362  
0.9392415248  
1.001137621  
1.037425742  
1.04804853  
1.035537975  
1.00447308  
0.960587489  
0.9097104796  
0.8567019885  
0.804601408  
0.7541348514  
0.703654392  
0.6495566114  
0.5870669501  
0.5112757422  
0.4182337694  
0.3059146406  
0.1748736927  
0.02849753604  
-0.1271930009  
-0.2841554621  
-0.4332296609  
-0.5651844955  
-0.6717476568  
-0.7464393416  
-0.7851292107  
-0.7862474981  
-0.7506694927  
-0.6813371242  
-0.5827304586  
-0.4602923212  
-0.3199229965  
-0.167611005  
-0.009237784963  
0.1494589254  
0.3028085357  
0.4451105242  
0.5705904079  
0.6734919418  
0.7483651976  
0.7905324881  
0.796724541  
0.7657791012  
0.6992739681  
0.601970993  
0.481921986  
0.3501382157  
0.2197849582  
0.1049386946  
0.01900109567  
-0.02701603534  
-0.02613382739  
0.02328985988  
0.1168123732  
0.2438628563  
0.3884775907  
0.5307694841  
0.6489677894  
0.7217944637  
0.7308917534  
0.6629790978  
0.511486907  
0.2774566632  
-0.03037773211  
-0.3963161732  
-0.7991234619  
-1.213954123  
-1.614551621  
-1.975451723  
-2.273981892  
-2.491881617  
-2.616431473  
-2.641057832  
-2.565444545  
-2.395206569  
-2.141219943  
-1.818716503  
-1.446203937  
-1.044302688  
-0.6345322889  
-0.2380935128  
0.1253223337  
0.4386601152  
0.6885178376  
0.8659788889  
0.9672079325  
0.9937204745  
0.9522670171  
0.8542938655  
0.7149721209  
0.5518382138  
0.3831436787  
0.2260710532  
0.0949892475  
-2.219945278e-05  
-0.0541878945  
-0.06843387773  
-0.04906718903  
-0.006756631978  
0.04507823997  
0.09227307777  
0.1220157167  
0.1247711693  
0.09570883995  
0.03543394216  
-0.05009673541  
-0.1504696208  
-0.2523888789  
-0.3416792348  
-0.4054392458  
-0.4339999921  
-0.4224141312  
-0.3712540956  
-0.2866309141  
-0.1794161187  
-0.06382857863  
0.04442304875  
0.1301586657  
0.1806294018  
0.1870456276  
0.1455502686  
0.0575272402  
-0.07075136849  
-0.2290474145  
-0.4045002163  
-0.5831682082  
-0.7515651038  
-0.8979899224  
-1.013495408  
-1.092417952  
-1.132438091  
-1.134235673  
-1.10081048  
-1.036620427  
-0.9466600894  
-0.835629729  
-0.7072856046  
-0.5640715868  
-0.4070609839  
-0.236208497  
-0.0508746353  
0.1494583496  
0.3643902669  
0.5918428733  
0.8274948374  
1.064507283  
1.293655269  
1.503897807  
1.683374822  
1.820723766  
1.906569204  
1.934963647  
1.904542606  
1.819176108  
1.687941828  
1.524360866  
1.344919064  
1.167057451  
1.006874802  
0.8769054242  
0.7842997787  
0.7297400147  
0.7072963358  
0.7053075753  
0.7082035042  
0.6990590926  
0.6624939002  
0.5875162717  
0.4698581996  
0.3134080372  
0.130473993  
-0.05924088004  
-0.2309027216  
-0.3577695687  
-0.4150079051  
-0.3835647655  
-0.2535627626  
-0.02669372192  
0.2827978834  
0.6487586797  
1.03543718  
1.401224731  
1.703425631  
1.903435841  
1.971686259  
1.891657555  
1.662395894  
1.299146333  
0.8319596589  
0.3023890549  
-0.2413185488  
-0.7499477089  
-1.179223027  
-1.4951224  
-1.677915376  
-1.72436893  
-1.647846409  
-1.476268791  
-1.248202264  
-1.007579414  
-0.7977689743  
-0.6557504258  
-0.6071897254  
-0.6630693756  
-0.8183213174  
-1.052648903  
-1.33344316  
-1.620368826  
-1.871024324  
-2.046874244  
-2.118646419  
-2.070440059  
-1.901982992  
-1.62870644  
-1.279656815  
-0.8935276745  
-0.5133853093  
-0.1808337027  
0.06955929978  
0.214796479  
0.2463395883  
0.1709743791  
0.009582675398  
-0.2059545574  
-0.4372399293  
-0.6445667253  
-0.7921278379  
-0.8525140211  
-0.8099521349  
-0.6619165099  
-0.4190181043  
-0.1032796796  
0.254857821  
0.6203323372  
0.9575321559  
1.234135465  
1.424280364  
1.510779328  
1.486234155  
1.353047418  
1.122482448  
0.8129809512  
0.4480190815  
0.05378207134  
-0.3430972857  
-0.7175313112  
-1.047586901  
-1.315632093  
-1.509040216  
-1.620459955  
-1.647760316  
-1.593674513  
-1.465245983  
-1.273105812  
-1.030641704  
-0.7530739453  
-0.4564912735  
-0.1568803653  
0.1308048145  
0.393460633  
0.6204920789  
0.8042578265  
0.940265097  
1.027127577  
1.066279412  
1.061551283  
1.018611342  
0.9444052199  
0.8466191871  
0.7332315051  
0.6121679276  
0.4910545004  
0.3770452794  
0.2766824155  
0.1957591074  
0.1391521797  
0.110625371  
0.1126221198  
0.1460652611  
0.2102327775  
0.3027237602  
0.4195656663  
0.5554491955  
0.7040831163  
0.8586155533  
1.012060389  
1.157684776  
1.289284239  
1.40134056  
1.48905309  
1.54828464  
1.575461807  
1.567506831  
1.52183096  
1.436441515  
1.310144822  
1.142835302  
0.9358105013  
0.6920535287  
0.4164339667  
0.115774989  
-0.2012216615  
-0.5241970714  
-0.8414660836  
-1.140455646  
-1.408198717  
-1.631890851  
-1.799522833  
-1.90056313  
-1.926749505  
-1.87292655  
-1.737908187  
-1.525262704  
-1.243887741  
-0.9082325317  
-0.5380145045  
-0.1573384953  
0.2068209429  
0.5267021435  
0.7762433325  
0.9336977764  
0.9840830641  
0.9211180997  
0.7483597998  
0.4793409877  
0.1366292592  
-0.2501267025  
-0.6469676745  
-1.018886655  
-1.333226667  
-1.562818948  
-1.68851337  
-1.700844616  
-1.600694576  
-1.398901522  
-1.114925712  
-0.7747379757  
-0.4081765384  
-0.04605086474  
0.2827296681  
0.5537491594  
0.749174675  
0.8591727578  
0.88254291  
0.8265232097  
0.7058000448  
0.540812855  
0.3555206783  
0.1748675958  
0.0221938107  
-0.08311853103  
-0.1275176577  
-0.1044693132  
-0.01482775967  
0.1336188462  
0.3273601432  
0.5489413112  
0.7790773268  
0.998802263  
1.191399467  
1.343858077  
1.44772412  
1.499281868  
1.499104982  
1.451127846  
1.361418205  
1.236889456  
1.084163121  
0.9087574478  
0.7147050053  
0.5046332599  
0.2802309659  
0.04299971819  
-0.2048939429  
-0.4598249396  
-0.7161533353  
-0.96601562  
-1.199523532  
-1.405375337  
-1.57180523  
-1.687749421  
-1.744088077  
-1.734798567  
-1.657859883  
-1.515804396  
-1.315829988  
-1.069454119  
-0.7917343073  
-0.500146281  
-0.213214696  
0.05095501112  
0.2761078884  
0.4490958959  
0.5608675002  
0.6070817618  
0.5883439865  
0.5100213391  
0.3817009651  
0.2163189973  
0.0290663464  
-0.1638534183  
-0.346511846  
-0.5044862611  
-0.6259476222  
-0.7025248797  
-0.7298848777  
-0.7079806027  
-0.6409590046  
-0.5367402124  
-0.40629568  
-0.2626984721  
-0.120025326  
0.007813078331  
0.1081984086  
0.1708431473  
0.1886368808  
0.1582957725  
0.08075779568  
-0.03867579625  
-0.1904684198  
-0.3612666077  
-0.5346027276  
-0.6919110277  
-0.813846029  
-0.8818582733  
-0.8799728396  
-0.7966187592  
-0.6263449377  
-0.3711986421  
-0.04153602887  
0.343932509  
0.7590246091  
1.171911384  
1.547813882  
1.852344296  
2.055139837  
2.133362563  
2.074609258  
1.878798761  
1.55873589  
1.139198586  
0.6545821299  
0.1453750911  
-0.3461378905  
-0.7803942724  
-1.124704053  
-1.356516851  
-1.465368932  
-1.453291307  
-1.333677129  
-1.128798249  
-0.8663807283  
-0.5757523137  
-0.2841224832  
-0.01351142822  
0.2212671936  
0.4133593788  
0.5633413039  
0.6775883694  
0.7659083148  
0.8388668996  
0.9052980557  
0.9704064462  
1.034768225  
1.094358692  
1.141568148  
1.166980011  
1.161579446  
1.118958563  
1.037137189  
0.9196141478  
0.775461761  
0.6183839188  
0.4648556243  
0.3316130958  
0.2328821156  
0.177781505  
0.1683476127  
0.1985190894  
0.2543224572  
0.3152960123  
0.3570210841  
0.3544482978  
0.2855885125  
0.1350463521  
-0.1031193797  
-0.4236374428  
-0.8096827595  
-1.234061308  
-1.661831518  
-2.054065518  
-2.372286064  
-2.583026727  
-2.661906055  
-2.596694032  
-2.388942046  
-2.053967148  
-1.619180426  
-1.120962525  
-0.6005031678  
-0.09913353585  
0.3462470476  
0.7070738908  
0.9658534784  
1.117429254  
1.168645137  
1.136504015  
1.045117331  
0.921887551  
0.7934687577  
0.6820534594  
0.6024741642  
0.5604964441  
0.5524831837  
0.5664385395  
0.5842480516  
0.5847686528  
0.5473282424  
0.455149909  
0.2982373936  
0.0753422498  
-0.2052291806  
-0.5260889008  
-0.8624343663  
-1.184715411  
-1.46195319  
-1.665318084  
-1.771506793  
-1.765513541  
-1.642453524  
-1.408201792  
-1.078770916  
-0.6785098076  
-0.2373438306  
0.2125727544  
