0.2794199027  
1.831239262  
3.282740316  
4.548256212  
5.5608018  
6.278268833  
6.686560426  
6.799378563  
6.654823773  
6.309388965  
5.83026683  
5.287038606  
4.743832184  
4.252884481  
3.850201831  
3.553661325  
3.36354356  
3.265194876  
3.233225988  
3.23654472  
3.243465589  
3.22621847  
3.16432966  
3.046567724  
2.871376871  
2.645929727  
2.384111932  
2.10385558  
1.824256008  
1.562905188  
1.33376341  
1.145775829  
1.002325436  
0.9014702054  
0.83682961  
0.7989175581  
0.7766850495  
0.7590496115  
0.7362197789  
0.7006703539  
0.6476981637  
0.5755290138  
0.4850379108  
0.3791638369  
0.2621347945  
0.1386497627  
0.01313632525  
-0.1108161296  
-0.23078084  
-0.3455480557  
-0.4549534036  
-0.5595212237  
-0.6600276274  
-0.7570618964  
-0.8506792713  
-0.9401978266  
-1.024166462  
-1.100493126  
-1.166692054  
-1.220206737  
-1.258717784  
-1.280419592  
-1.284195808  
-1.269714524  
-1.23743719  
-1.188588046  
-1.125116767  
-1.049683379  
-0.9657015034  
-0.877412653  
-0.7899659186  
-0.7094558024  
-0.6428266823  
-0.5976044513  
-0.5813838515  
-0.6010873361  
-0.6620313331  
-0.7668996092  
-0.9147856086  
-1.100462981  
-1.314084088  
-1.541431752  
-1.764801015  
-1.964491658  
-2.12077658  
-2.216127353  
-2.237402364  
-2.17768704  
-2.037496674  
-1.82512658  
-1.556060728  
-1.251463474  
-0.9359323738  
-0.6347766904  
-0.3711918228  
-0.1636682453  
-0.02400613099  
0.04383427055  
0.04388895769  
-0.0126420915  
-0.1090986081  
-0.2256853544  
-0.3420972566  
-0.4401009707  
-0.5057414099  
-0.5308892873  
-0.5139760632  
-0.4598376332  
-0.3787466982  
-0.2847640492  
-0.1936731451  
-0.1207467361  
-0.07863623197  
-0.07563757244  
-0.1145224796  
-0.1920660614  
-0.2993167125  
-0.4225702257  
-0.5449512288  
-0.6484053498  
-0.7159138969  
-0.7336584521  
-0.6928945674  
-0.5912890395  
-0.4335429096  
-0.2311678176  
-0.001397106504  
0.2346847657  
0.4546105316  
0.6372945575  
0.765738715  
0.8293008574  
0.8251734761  
0.758811502  
0.643193368  
0.4969655977  
0.3417128013  
0.1987273346  
0.08579619193  
0.01450539676  
-0.01146428121  
0.003268165282  
0.04680714306  
0.1022975188  
0.1511840185  
0.1768629207  
0.1680993443  
0.1215774727  
0.04308862987  
-0.05293117714  
-0.1455225784  
-0.2106796474  
-0.2256405236  
-0.1732616342  
-0.04569434487  
0.153323429  
0.4080327706  
0.6922563725  
0.9728483954  
1.214486005  
1.385034034  
1.460615095  
1.429523638  
1.294318989  
1.071708653  
0.7901957543  
0.4858448196  
0.1967920412  
-0.04262524519  
-0.2072231017  
-0.2849415026  
-0.2788150992  
-0.2065878259  
-0.09800616382  
0.009844069777  
0.07848380845  
0.07438738589  
-0.02521015786  
-0.2279520319  
-0.5241312851  
-0.886993999  
-1.27561695  
-1.640000072  
-1.927711  
-2.091147869  
-2.094392543  
-1.918653634  
-1.565494208  
-1.057341059  
-0.4351732473  
0.2463064816  
0.9253534951  
1.540757026  
2.039265191  
2.381815963  
2.54774857  
2.536464449  
2.366412786  
2.071637883  
1.696494981  
1.28935085  
0.8962034097  
0.5551047418  
0.2921117212  
0.1192124511  
0.03436873243  
0.02350269489  
0.06398495887  
0.1289971467  
0.1920677978  
0.2311031735  
0.2313775329  
0.1871139666  
0.1015515159  
-0.01439145229  
-0.1445604435  
-0.2706397901  
-0.3753856165  
-0.4454794782  
-0.4736304634  
-0.4596394932  
-0.4103009244  
-0.3382538816  
-0.2599479073  
-0.1930908375  
-0.1539443304  
-0.1548658401  
-0.2024396097  
-0.2964417111  
-0.4297665315  
-0.5893056701  
-0.7576492892  
-0.915370881  
-1.043583446  
-1.12643858  
-1.153231244  
-1.119852493  
-1.029392199  
-0.8918309262  
-0.7228455204  
-0.5419018181  
-0.3698684261  
-0.2264687042  
-0.1279151847  
-0.08501209257  
-0.1020021871  
-0.1762658261  
-0.2989358552  
-0.4562748478  
-0.6316412831  
-0.8077227321  
-0.9687198672  
-1.102167942  
-1.200150183  
-1.259769429  
-1.282844404  
-1.274948208  
-1.243978753  
-1.198538777  
-1.146394597  
-1.093271103  
-1.042157578  
-0.9931979224  
-0.944137294  
-0.8912122359  
-0.8302675026  
-0.757895335  
-0.6723679591  
-0.5741890109  
-0.4661729789  
-0.3530429892  
-0.2406138723  
-0.1347334122  
-0.04016364793  
0.04037967712  
0.1068401358  
0.1619674211  
0.2109399816  
0.2605102211  
0.3178036667  
0.3889516473  
0.477797378  
0.5848789811  
0.7068825315  
0.8366683525  
0.963886727  
1.07612234  
1.160404071  
1.204873022  
1.20039564  
1.141872935  
1.029095024  
0.8670111937  
0.6653946409  
0.4379379864  
0.2008963423  
-0.02854979728  
-0.2340296382  
-0.4016073718  
-0.5211319512  
-0.5871497654  
-0.5993188602  
-0.5622660476  
-0.4849341702  
-0.379491913  
-0.2599324209  
-0.1405275864  
-0.0342877619  
0.04837975149  
0.1006893933  
0.1200511159  
0.1081497244  
0.07052432116  
0.0157110963  
-0.04593737884  
-0.1036110808  
-0.1473896267  
-0.1694261686  
-0.1648066925  
-0.131994954  
-0.07281616851  
0.007982182129  
0.1035175185  
0.2057667512  
0.3066125398  
0.3987936564  
0.4766131134  
0.5363529742  
0.5763338525  
0.5966923369  
0.5989210896  
0.5853116486  
0.5584074591  
0.5205741788  
0.4737610565  
0.4194830309  
0.3590042686  
0.2936533086  
0.2251971093  
0.1561524105  
0.08996131004  
0.03093985675  
-0.01600506506  
-0.04590181916  
-0.05441840676  
-0.03864136866  
0.002170195922  
0.0660030045  
0.1477827955  
0.2394377311  
0.3303757408  
0.4083660763  
0.4607516131  
0.4758799938  
0.4445754923  
0.3614765947  
0.2260418809  
0.04307607342  
-0.1773491944  
-0.4205861164  
-0.6687004448  
-0.9022023534  
-1.102042661  
-1.251620996  
-1.338557949  
-1.356011323  
-1.303353661  
-1.186143795  
-1.015400746  
-0.8062875728  
-0.5764016  
-0.3439034587  
-0.1257363884  
0.06385464738  
0.2143283059  
0.319317825  
0.3765584919  
0.3873779039  
0.3558734541  
0.287962798  
0.1904772051  
0.07040898076  
-0.06557021955  
-0.2113314411  
-0.3612653458  
-0.510117589  
-0.6527717531  
-0.7840959946  
-0.8989388256  
-0.9923051657  
-1.059721486  
-1.097715364  
-1.104344632  
-1.079641891  
-1.025888487  
-0.9476335243  
-0.8514152819  
-0.7452078354  
-0.6376484103  
-0.5371383421  
-0.4509474977  
-0.3844278326  
-0.3404573892  
-0.3191485139  
-0.3178837876  
-0.3316431008  
-0.3535723022  
-0.3757366207  
-0.3899688627  
-0.3887139554  
-0.3658257853  
-0.3172189931  
-0.241343898  
-0.1394370954  
-0.0155178935  
0.1238785539  
0.2702294726  
0.4137884847  
0.5445181524  
0.6531171694  
0.732022193  
0.7762613304  
0.7840461511  
0.7570021479  
0.6999855451  
0.6205119487  
0.5278409576  
0.4318641092  
0.3419300234  
0.2657859591  
0.2087698267  
0.1733557674  
0.1591032626  
0.1629678654  
0.1799263194  
0.2037799353  
0.2280129534  
0.2465847652  
0.2545428501  
0.2484213628  
0.2263726262  
0.1881078091  
0.1346445035  
0.06799132894  
-0.009201170419  
-0.0939298291  
-0.1830528166  
-0.2734078452  
-0.361854838  
-0.445272414  
-0.5205601332  
-0.5846624757  
-0.6346614229  
-0.667910211  
-0.682210858  
-0.6759926536  
-0.6484450755  
-0.5995962753  
-0.5302945434  
-0.4421207283  
-0.3372483265  
-0.2182989157  
-0.08823604255  
0.04965834928  
0.191713006  
0.3337047161  
0.4706527204  
0.5966426482  
0.7047470198  
0.7871475521  
0.8355075961  
0.8416246152  
0.7983495076  
0.7006787043  
0.5469016674  
0.3396250546  
0.0864933959  
-0.1995811395  
-0.5008004184  
-0.79554205  
-1.060059412  
-1.270690498  
-1.406331244  
-1.450881682  
-1.395325283  
-1.239142454  
-0.9908118202  
-0.6673000457  
-0.2925410154  
0.1049131064  
0.494795854  
0.8482080591  
1.140493847  
1.353548628  
1.477291556  
1.51013975  
1.458493527  
1.33534167  
1.158226963  
0.9468777699  
0.720826534  
0.4973290602  
0.2898156949  
0.1070168279  
-0.04717664777  
-0.1731987563  
-0.2747600131  
-0.3574715014  
-0.4273640047  
-0.4895231203  
-0.5470227413  
-0.6002887793  
-0.6469740554  
-0.6823434302  
-0.7000914643  
-0.6934997806  
-0.6567617479  
-0.5863029356  
-0.4819014182  
-0.3474537316  
-0.1912460622  
-0.02564310402  
0.1338175485  
0.269860353  
0.3653217806  
0.4051918855  
0.3786227625  
0.2806227907  
0.1131894949  
-0.1143195758  
-0.3856820793  
-0.6791861175  
-0.9697631107  
-1.231646066  
-1.44124969  
-1.579909155  
-1.636118433  
-1.606980811  
-1.498657965  
-1.325741973  
-1.109613736  
-0.8759765874  
-0.6518471326  
-0.4623784612  
-0.3278784203  
-0.2613805302  
-0.2670524099  
-0.3396349496  
-0.4649684657  
-0.6215760138  
-0.7831145794  
-0.9214329513  
-1.009906659  
-1.026652199  
-0.9572764718  
-0.7968231119  
-0.5506786998  
-0.2343234858  
0.1280799604  
0.5061130561  
0.866283371  
1.175627013  
1.405303372  
1.533794324  
1.549328898  
1.451253633  
1.250176293  
0.9668733311  
0.6300738683  
0.2733777035  
-0.06833592292  
-0.3625913892  
-0.5826745988  
-0.7102784331  
-0.7371519584  
-0.6655942915  
-0.5077649053  
-0.2839402211  
-0.01996095682  
0.2557932708  
0.5155373605  
0.7349421832  
0.895421733  
0.9856212351  
1.001990229  
0.9484560724  
0.8353016145  
0.677463615  
0.4924768843  
0.2983727816  
0.1117403678  
-0.05379819774  
-0.1885978097  
-0.2874009446  
-0.349182967  
-0.376522959  
-0.3746314989  
-0.3502155085  
-0.3103539979  
-0.2615376072  
-0.2089896804  
-0.1563309004  
-0.1055980827  
-0.05756193869  
-0.01225449896  
0.03041352449  
0.07008525256  
0.1055500369  
0.1345885966  
0.1541089718  
0.1605603306  
0.1505738113  
0.1217054402  
0.07315107437  
0.006298998052  
-0.07501942363  
-0.1646611515  
-0.2547008116  
-0.3363316246  
-0.4010022793  
-0.4416317297  
-0.4537094354  
-0.4360635591  
-0.3911777544  
-0.3249410553  
-0.2458852082  
-0.1639791912  
-0.08920017513  
-0.0301113588  
0.007314942178  
0.02042284879  
0.01003121814  
-0.01998629029  
-0.06359082337  
-0.1137584557  
-0.1636936511  
-0.2078418946  
-0.2425042081  
-0.2659494944  
-0.2780600531  
-0.2796095994  
-0.2714149824  
-0.2535927489  
-0.2251575284  
-0.184101758  
-0.1280102128  
-0.05509671145  
0.03455427009  
0.137825078  
0.2478085437  
0.3537330968  
0.4417038488  
0.4962920098  
0.5027710525  
0.4496937154  
0.3313586903  
0.1497065783  
-0.08477212779  
-0.3533953968  
-0.6309960055  
-0.8888249567  
-1.098281067  
-1.234926731  
-1.282163915  
-1.233961163  
-1.096137531  
-0.885937833  
-0.6298897098  
-0.3602048342  
-0.110268084  
0.09012992272  
0.2190609601  
0.2655537717  
0.2310313266  
0.1288525367  
-0.01797032067  
-0.1805099799  
-0.3285243445  
-0.4351920076  
-0.4812344543  
-0.4577913804  
-0.3676215386  
-0.2244707255  
-0.05075238914  
0.1260723779  
0.2778094871  
0.3798651638  
0.4149258548  
0.3754491014  
0.2646163561  
0.09565913119  
-0.1102752451  
-0.3273584328  
-0.5288662704  
-0.6909531106  
-0.7958490953  
-0.8340327196  
-0.8051246  
-0.717428798  
-0.5862660593  
-0.4313998142  
-0.2739871896  
-0.1335121877  
-0.0251578152  
0.04204286058  
0.06605126904  
0.0516096555  
0.009068575311  
-0.04749688462  
-0.102573982  
-0.1415249587  
-0.1525937489  
-0.1283514641  
-0.06641071022  
0.0306006307  
0.1557378118  
0.2989204695  
0.4483692712  
0.5920611847  
0.7189870116  
0.8200737613  
0.8887047831  
0.9208433965  
0.9148521185  
0.8711106064  
0.7915784029  
0.6794051009  
0.5386748837  
0.3742963231  
0.1920369892  
-0.001390858734  
-0.1982525375  
-0.3898251432  
-0.5666133354  
-0.7187743999  
-0.8367521673  
-0.9120657869  
-0.9381589967  
-0.9112228909  
-0.8308539038  
-0.700466337  
-0.527377359  
-0.3225282612  
-0.09984548892  
0.1247238371  
0.3344234346  
0.5130613964  
0.6464225279  
0.7235974088  
0.7381080481  
0.6887085356  
0.5797480117  
0.4210275166  
0.2271042918  
0.01607180288  
-0.1921270633  
-0.377672215  
-0.5229540562  
-0.6145030162  
-0.6445220972  
-0.6118006177  
-0.5218677044  
-0.3863242725  
-0.2214386836  
-0.04618550533  
0.120010249  
0.2595096622  
0.3583725258  
0.4077076846  
0.4043174756  
0.3505927166  
0.2537546607  
0.1246099673  
-0.02395190941  
-0.1784835671  
-0.3263276152  
-0.4566280715  
-0.560969852  
-0.6336307307  
-0.6715447817  
-0.6740691264  
-0.6426794643  
-0.5806788398  
-0.4929672367  
-0.3858880947  
-0.2670825692  
-0.1453249017  
-0.03022051475  
0.06825122537  
0.1403975075  
0.1776423624  
0.1734373512  
0.1241654074  
0.02987840331  
-0.1052555614  
-0.2729145472  
-0.461051591  
-0.654801032  
-0.8377851315  
-0.9936957352  
-1.107981077  
-1.169407727  
-1.171335559  
-1.112511847  
-0.9972913601  
-0.8352568026  
-0.6402645795  
-0.4290533213  
-0.2195570713  
-0.02913591445  
0.127099384  
0.2376839734  
0.2957899094  
0.2997294654  
0.2529521675  
0.1635497239  
0.04335956242  
-0.09324158719  
-0.2307294544  
-0.3538720081  
-0.4491013029  
-0.5056939163  
-0.5166736674  
-0.4793655121  
-0.3955512482  
-0.2712249709  
-0.1159571338  
0.0580794958  
0.237332677  
0.4082439476  
0.5586155086  
0.6788529992  
0.7629083788  
0.8088332806  
0.8188273057  
0.7987846663  
0.7573540751  
0.7046401099  
0.6507056338  
0.6040876192  
0.5705461545  
0.5522474695  
0.54751714  
0.5512102437  
0.5556704407  
0.5521191597  
0.5322555167  
0.4898140457  
0.4217962579  
0.3291666154  
0.2168874931  
0.09324427632  
-0.03140641758  
-0.1462961025  
-0.2420083564  
-0.3120639776  
-0.3540291047  
-0.3699501926  
-0.3660207326  
-0.3515055636  
-0.3370975879  
-0.3329548018  
-0.3467559135  
-0.3820994322  
-0.4375201832  
-0.5063234927  
-0.5772879692  
-0.6361673037  
-0.6677899308  
-0.6584553482  
-0.5982944306  
-0.4832298343  
-0.3162547997  
-0.1078088023  
0.1248216064  
0.3590483194  
0.5693092861  
0.7298981249  
0.8179733224  
0.816380596  
0.7159455437  
0.5169471843  
0.2295889697  
-0.1266193135  
-0.5245143888  
-0.9318035854  
-1.314186849  
-1.638749545  
-1.877231657  
-2.008827418  
-2.022212019  
-1.916554001  
-1.701426208  
-1.395637712  
-1.02512588  
-0.6201772486  
-0.2122866604  
0.1689708568  
0.4987084189  
0.7588527771  
0.9393979076  
1.038704168  
1.062845102  
1.024130422  
0.9390308535  
0.8257639822  
0.7018744034  
0.5820866194  
0.476692877  
0.3906538652  
0.3234953493  
0.2699786916  
0.2214328736  
0.167536436  
0.09830402575  
0.00598582765  
-0.113373023  
-0.258938067  
-0.424803497  
-0.6004490505  
-0.7719039629  
-0.9234642215  
-1.039724194  
-1.107679684  
-1.118584723  
-1.069319023  
-0.963060009  
-0.8091380899  
-0.6220761312  
-0.4199079551  
-0.2219978406  
-0.04662642396  
0.09130701903  
0.182168463  
0.2227628658  
0.2166321303  
0.1734042236  
0.107277734  
0.03483903129  
-0.02747943406  
-0.06591309996  
-0.07149073381  
-0.04142657304  
0.02044761723  
0.1042878036  
0.1958104401  
0.2786072482  
0.3368388198  
0.3579068433  
0.3346646631  
0.266817306  
0.1612725374  
0.03135991386  
-0.1049722533  
-0.22772804  
-0.3178188035  
-0.3599469937  
-0.3449918375  
-0.2715163894  
-0.1461704227  
0.01708445689  
0.1988125488  
0.3767433185  
0.5288247734  
0.636243668  
0.6859768806  
0.6725157058  
0.5985191761  
0.4743188016  
0.3163760336  
0.1449120195  
-0.01892963364  
-0.1559583891  
-0.2514886157  
-0.2971761964  
-0.2919406762  
-0.2418552478  
-0.159075991  
-0.05997792344  
0.0371960498  
0.1148364846  
0.1582672131  
0.1575392622  
0.1084926984  
0.01299362224  
-0.1216544257  
-0.2839705924  
-0.4600295778  
