901.086494  
926.1564259  
982.1865883  
1091.327742  
1078.98381  
247.1669275  
3841.664831  
22629.30906  
13759.58006  
96903.79186  
92186.63963  
21188.44182  
34322.3253  
31552.40966  
31564.40364  
6542.14279  
2503.928182  
638.6067778  
6941.29558  
5567.659678  
254.9635806  
8844.572428  
4125.042575  
3155.573499  
239.0536453  
7961.968101  
416.0448099  
6157.236635  
3382.399459  
616.8817358  
1169.0077  
3649.396481  
733.3209781  
1932.000332  
5113.401097  
1300.242774  
6235.297246  
1579.381536  
8847.143683  
3278.770076  
3247.363974  
3035.142344  
558.1586545  
400.4084109  
904.0462995  
2742.308667  
1154.83701  
11100.82222  
348.2639846  
1674.886884  
2350.760413  
522.6776657  
160.1124606  
1777.636118  
3260.406292  
1904.838177  
3550.201726  
111.560407  
12.20628826  
2248.703721  
732.1737729  
226.1852956  
54.37658834  
500.2035708  
35.69969305  
73.20354881  
130.8822393  
14.14952913  
79.82432738  
15.27507679  
62.05980714  
11.96740407  
18.55577491  
3.494762962  
6.755017587  
10.49399188  
10.95730402  
10.26589003  
7.183319484  
2.919559366  
3.027027914  
7.048339363  
5.557388039  
5.142172418  
7.811136695  
4.886015664  
4.666931606  
4.466593524  
4.111235384  
3.337119685  
3.208192894  
3.386641329  
3.164352306  
3.017194435  
2.922074652  
2.605899506  
2.600239308  
2.431845934  
2.335511331  
2.189971136  
2.119590481  
1.999950138  
1.921720499  
1.850834114  
1.782738109  
1.690848163  
1.632900901  
1.560953943  
1.503867625  
1.43850099  
1.380752203  
1.32485142  
1.27655124  
1.2287122  
1.186888577  
1.142934812  
1.096903122  
1.057181995  
1.017027947  
0.9819618871  
0.9491035895  
0.9160531184  
0.8837773138  
0.8531549658  
0.8248002382  
0.7969884833  
0.7705322386  
0.7455744595  
0.7212617703  
0.6976016406  
0.6756679247  
0.6542229491  
0.6338681678  
0.6142194264  
0.5952916835  
0.5770378136  
0.559820118  
0.5429016794  
0.5268825838  
0.511366178  
0.496405027  
0.4819898344  
0.4682410338  
0.4548829276  
0.4420592086  
0.4296538139  
0.4177727345  
0.4062459986  
0.3951604179  
0.3844042981  
0.3740926215  
0.3641136185  
0.3544693297  
0.3451596605  
0.3361606892  
0.3274623172  
0.3190647802  
0.3109324457  
0.3030656201  
0.2954548289  
0.2880922479  
0.2809692054  
0.2740698852  
0.2673879618  
0.260915852  
0.2546462435  
0.2485683322  
0.2426844844  
0.2369686787  
0.2314342707  
0.22606208  
0.2208535711  
0.2158011149  
0.210892818  
0.2061359461  
0.2015114724  
0.197025538  
0.1926657501  
0.1884327325  
0.1843176415  
0.1803177496  
0.1764355223  
0.1726638635  
0.1689887198  
0.1654177777  
0.1619503318  
0.1585645617  
0.1552827879  
0.152085123  
0.1489731902  
0.145946722  
0.1429981081  
0.1401239692  
0.1373299425  
0.1346107292  
0.1319556602  
0.1293689493  
0.1268500609  
0.1243960496  
0.1220078583  
0.1196735027  
0.1173974578  
0.1151818067  
0.1130229355  
0.1109114605  
0.108856262  
0.106845984  
0.1048889895  
0.1029797633  
0.1011148072  
0.09929781802  
0.09751447119  
0.09578528381  
0.09409005544  
0.09243351849  
0.09081980435  
0.08923782883  
0.08769810876  
0.08619262639  
0.08471923793  
0.08327978588  
0.08187383247  
0.08049634106  
0.07915649471  
0.07784250617  
0.07655499257  
0.07530057713  
0.07406613811  
0.0728675457  
0.07169156076  
0.07054087385  
0.06941558709  
0.06831412027  
0.06723853169  
0.06618267227  
0.06514816261  
0.06413824653  
0.06314760805  
0.06218119977  
0.0612308056  
0.06029802008  
0.05939146259  
0.05849867734  
0.0576247997  
0.05677029722  
0.05593603723  
0.05511000121  
0.05430377747  
0.0535189929  
0.05274508986  
0.05198769418  
0.05124631039  
0.05051840869  
0.04980329337  
0.0491032425  
0.04841622304  
0.04774654278  
0.04708541699  
0.04643784694  
0.04580332757  
0.04518029485  
0.04456883466  
0.0439696767  
0.04338239559  
0.04280527507  
0.04223979359  
0.04168480634  
0.04114057954  
0.04060491566  
0.04007710898  
0.03956079876  
0.03905649629  
0.03855839834  
0.03807207982  
0.03759201645  
0.03712123709  
0.03665827198  
0.03620692023  
0.03575840051  
0.03532103286  
0.03489194527  
0.03446753428  
0.03405576403  
0.03364613075  
0.03324414804  
0.03285213232  
0.03246513077  
0.03208568339  
0.03171028228  
0.03134497345  
0.03098199903  
0.03062616023  
0.03027777778  
0.02993590302  
0.02959905867  
0.02926525735  
0.02894342921  
0.02862234427  
0.02830729116  
0.02799851598  
0.02769305524  
0.02739415245  
0.02709832962  
0.0268090276  
0.02652359715  
0.02624400406  
0.02596763454  
0.02569637614  
0.02542941756  
0.02516699268  
0.02490971329  
0.02465534216  
0.02440508453  
0.02415963565  
0.02391601604  
0.02367898983  
0.02344612495  
0.02321390675  
0.02298696822  
0.02276310605  
0.02254378727  
0.02232680312  
0.02211425711  
0.02190512448  
0.02169981572  
0.02149306888  
0.02129365193  
0.02109870957  
0.02090266307  
0.02071145019  
0.02052465471  
0.02033905664  
0.02015699014  
0.01997709923  
0.01980063517  
0.01962793792  
0.01945704709  
0.01928628337  
0.01912162382  
0.01895646567  
0.01879478691  
0.0186367817  
0.01847922811  
0.01832624993  
0.01817314261  
0.01802486351  
0.01787818483  
0.01773272172  
0.01759084741  
0.01745040847  
0.01731092787  
0.01717311498  
0.01704084136  
0.01690834705  
0.01677884462  
0.01664842702  
0.0165214462  
0.01639742769  
0.01627550389  
0.01615474416  
0.0160343948  
0.01591605935  
0.01580147952  
0.01568848544  
0.01557547447  
0.01546540929  
0.01535531293  
0.01524854958  
0.01514115393  
0.01503813753  
0.01493606747  
0.01483432578  
0.01473614889  
0.01463769626  
0.01453944252  
0.01444432732  
0.01435136563  
0.01425786975  
0.01416783269  
0.01407636863  
0.01398910555  
0.01390333336  
0.01381635829  
0.01373339072  
0.01364848943  
0.01356805804  
0.01348493032  
0.01340693645  
0.01332907683  
0.01325047489  
0.01317564407  
0.01310121161  
0.01302694599  
0.01295573034  
0.01288410988  
0.01281390707  
0.01274293934  
0.0126762292  
0.01260984608  
0.01254252657  
0.01247755009  
0.01241399621  
0.01235052923  
0.01228765267  
0.01222842538  
0.0121686873  
0.01210912343  
0.01205095844  
0.01199469064  
0.01193731995  
0.01188332983  
0.0118273477  
0.01177434529  
0.0117208972  
0.01166914093  
0.0116193046  
0.01156902709  
0.01151934558  
0.01147093547  
0.01142402149  
0.0113775551  
0.01133227271  
0.01128692086  
0.01124321265  
0.01119852274  
0.01115594902  
0.01111448475  
0.01107451238  
0.01103334222  
0.01099345652  
0.01095498643  
0.01091637307  
0.01087964743  
0.01084176734  
0.01080682394  
0.01077111616  
0.01073725936  
0.0107036414  
0.01067085871  
0.01063809521  
0.01060615992  
0.01057521339  
0.01054559152  
0.01051513341  
0.01048631068  
0.0104587825  
0.01043003982  
0.01040268189  
0.01037650611  
0.01035069313  
0.01032567062  
0.0103022006  
0.01027788788  
0.01025499963  
0.01023142897  
0.01021064845  
0.01018700694  
0.01016802328  
0.01014783016  
0.01012834599  
0.01010904146  
0.01009053954  
0.0100734003  
0.01005634532  
0.01003957218  
0.01002197689  
0.01000729544  
0.009993086273  
0.009977964238  
0.00996490133  
0.009952434414  
0.009939294189  
0.009927326072  
0.009915607578  
0.009904918338  
0.009896056956  
0.009885662298  
0.009877404575  
0.009868582565  
0.009858854755  
0.009851359013  
0.009845335454  
0.00983946234  
0.009832437048  
0.009827132626  
0.009822812116  
0.009818225576  
0.009815832622  
0.009812365539  
0.009810747616  
0.009807584274  
0.009806453384  
0.009804966416  
0.009806271901  
