-0.2616194368  
-0.1687773206  
-0.08075006459  
-0.002714284055  
0.06081804372  
0.1063274548  
0.1315589323  
0.1357225793  
0.1195842946  
0.08542859792  
0.03687558648  
-0.02144507585  
-0.08433633423  
-0.1465511689  
-0.2033185906  
-0.2508125425  
-0.2864988021  
-0.3093066746  
-0.3196073141  
-0.319004836  
-0.309973459  
-0.2954129091  
-0.2781844632  
-0.2607113343  
-0.2446926058  
-0.2309724597  
-0.2195676129  
-0.2098268021  
-0.2006789325  
-0.1909106167  
-0.1794133265  
-0.1653556211  
-0.14825037  
-0.1279153243  
-0.10435306  
-0.07758665102  
-0.04750033114  
-0.01373850589  
0.02431036485  
0.0674226544  
0.1163549773  
0.1715957576  
0.2330984944  
0.3000554894  
0.3707588885  
0.442591482  
0.5121616742  
0.5755781572  
0.6288349381  
0.668254506  
0.69092894  
0.6951015662  
0.6804231109  
0.6480556146  
0.60060566  
0.5418903277  
0.4765702716  
0.4096972321  
0.3462309061  
0.2905776904  
0.2462121313  
0.2154041698  
0.1990865386  
0.1968515013  
0.2070795313  
0.2271637062  
0.2538064267  
0.2833551299  
0.3121477391  
0.3368422236  
0.3547084979  
0.3638691015  
0.36346909  
0.3537665458  
0.3361244837  
0.3129017062  
0.287229346  
0.2626895258  
0.2429050592  
0.2310798739  
0.2295400564  
0.239330983  
0.2599390903  
0.2891882786  
0.3233554291  
0.3575153439  
0.3860898078  
0.4035492317  
0.4051683807  
0.3877372628  
0.3501075311  
0.2934733776  
0.221331304  
0.139092976  
0.053392121  
-0.02881583389  
-0.1012405182  
-0.1591656192  
-0.2001365458  
-0.2243055443  
-0.2343690134  
-0.235089481  
-0.2324794279  
-0.2327666843  
-0.2413142933  
-0.2616770298  
-0.2949628896  
-0.3396194428  
-0.3916917384  
-0.4455317986  
-0.4948409062  
-0.5338756372  
-0.5586039137  
-0.5676087501  
-0.5625465649  
-0.548067842  
-0.5311695299  
-0.5200625541  
-0.522718152  
-0.5453299514  
-0.5909467346  
-0.6585288712  
-0.7426268816  
-0.8337805272  
-0.9196374488  
-0.9866638699  
-1.022221593  
-1.016696251  
-0.965342415  
-0.8695236258  
-0.7370932323  
-0.5817920031  
-0.4216690367  
-0.2767092674  
-0.1659772947  
-0.1047021751  
-0.1017650651  
-0.1580225162  
-0.2657995365  
-0.4097229164  
-0.5688559986  
-0.7198852746  
-0.8409123956  
-0.9152765558  
-0.9347648088  
-0.9016343851  
-0.8289899254  
-0.7393066394  
-0.6611645885  
-0.624559723  
-0.6554271386  
-0.7701999988  
-0.9713049871  
-1.244432383  
-1.558212593  
-1.866607135  
-2.113925517  
-2.241932988  
-2.198155143  
-1.944203504  
-1.462853303  
-0.7626902535  
0.1205473168  
1.126366126  
2.175518617  
3.178911142  
4.048239671  
4.706855941  
5.099295254  
5.198067948  
5.006721201  
4.558758935  
3.912632479  
3.143617998  
2.333841532  
1.561940456  
0.8938388972  
0.3758581147  
0.030967324  
-0.1415547479  
-0.1632888755  
-0.071361639  
0.08836124896  
0.2684743082  
0.4265750418  
0.5303149222  
0.5604255156  
0.5115465126  
0.3910112916  
0.2160270532  
0.009846231079  
-0.2023833812  
-0.3974662029  
-0.557190775  
-0.6702211657  
-0.7327255365  
-0.7478221589  
-0.7240802658  
-0.6734208663  
-0.6088107838  
-0.5421273738  
-0.4824965409  
-0.4353094079  
-0.4019934337  
-0.3804947468  
-0.3663167712  
-0.3538934061  
-0.3380366198  
-0.3152051875  
-0.2843863526  
-0.2474525752  
-0.2089572444  
-0.1754064644  
-0.1541445469  
-0.1520379352  
-0.1741675824  
-0.2227462902  
-0.2964306377  
-0.3901319681  
-0.4953751078  
-0.6011526183  
-0.6951718661  
-0.7653273604  
-0.8012106656  
-0.7954643694  
-0.7448050759  
-0.6505892737  
-0.518849675  
-0.3597867627  
-0.1867816444  
-0.01502794649  
0.1400553381  
0.2644546096  
0.3470581856  
0.3808422217  
0.3636182787  
0.298253729  
0.1923357374  
0.05731548673  
-0.09277420084  
-0.2428814161  
-0.3785945581  
-0.4877016297  
-0.5614614187  
-0.595426117  
-0.5897152677  
-0.5487095997  
-0.4802005166  
-0.3941283815  
-0.3010704197  
-0.2107077158  
-0.1304875724  
-0.06468046557  
-0.01397029719  
0.02435433295  
0.05563582467  
0.08663438494  
0.1240488102  
0.1730147711  
0.2358326971  
0.3111390901  
0.3936847388  
0.4747783653  
0.5433538752  
0.5875180806  
0.5963448717  
0.5616460624  
0.4794290734  
0.3508067097  
0.182198944  
-0.0152253768  
-0.2267879668  
-0.4360521012  
-0.626806442  
-0.7849992272  
-0.9003206018  
-0.9672189164  
-0.9852180466  
-0.9585208186  
-0.8950048947  
-0.8048018175  
-0.6987089686  
-0.586695305  
-0.4767245396  
-0.3740518551  
-0.2810612273  
-0.1976132914  
-0.1217863858  
-0.05084153481  
0.01778315266  
0.08563834859  
0.1527285624  
0.2173595855  
0.2763671806  
0.3256721284  
0.3610390548  
0.3788937216  
0.3770496946  
0.3552168303  
0.3152108181  
0.2608314991  
0.1974421715  
0.1313248166  
0.06891500569  
0.01604306281  
-0.02271195115  
-0.04446621742  
-0.04822077404  
-0.03479454964  
-0.006531593181  
0.03315982933  
0.08034537704  
0.1311018776  
0.1819714139  
0.2302837943  
0.2743099469  
0.3132561403  
0.3471190981  
0.376443278  
0.4020385586  
0.4247007644  
0.4449839162  
0.4630473935  
0.4785992803  
0.4909265836  
0.4990103206  
0.5017077763  
0.4979691206  
0.4870793222  
0.4688850593  
0.4439822643  
0.41383427  
0.3807860401  
0.3479531765  
0.3189681133  
0.2975889226  
0.2871965818  
0.2902338332  
0.3076618181  
0.3385254143  
0.3797215715  
0.4260468298  
0.4705654685  
0.5052961596  
0.5221520831  
0.5140282098  
0.4758801207  
0.4056297839  
0.3047469946  
0.1783906605  
0.03506167609  
-0.1142098417  
-0.2570460668  
-0.3811218842  
-0.475592653  
-0.5323661739  
-0.5470450427  
-0.5194402665  
-0.4535843114  
-0.3572726148  
-0.2411957423  
-0.1177838232  
9.90130923e-05  
0.1004624736  
0.1733572122  
0.2117957159  
0.2123407065  
0.1753139726  
0.1046226843  
0.007228941732  
-0.1076809876  
-0.2297318922  
-0.3484972002  
-0.4546141427  
-0.5407564066  
-0.6023587928  
-0.638005698  
-0.649442821  
-0.6412053825  
-0.6199117042  
-0.5933059566  
-0.5691727247  
-0.5542598343  
-0.5533449066  
-0.5685684877  
-0.5991198236  
-0.6413180483  
-0.6890837049  
-0.7347407537  
-0.7700540883  
-0.7873698059  
-0.7807118117  
-0.7466895911  
-0.6850908771  
-0.5990766878  
-0.4949367056  
-0.381414183  
-0.2686893533  
-0.1671288255  
-0.08596001873  
-0.03204708502  
-0.008930029336  
-0.01626526735  
-0.0497559296  
-0.1015988382  
-0.1614066643  
-0.217496107  
-0.2583817442  
-0.2742875193  
-0.2584649553  
-0.2081501609  
-0.1250172944  
-0.01505880859  
0.11209657  
0.2443494877  
0.3686350091  
0.4725609497  
0.5459768891  
0.58225713  
0.5791301409  
0.5389491979  
0.4683595186  
0.377419667  
0.2782867543  
0.183649913  
0.1051213639  
0.05179715645  
0.02918370202  
0.0386235947  
0.07729146351  
0.1387418245  
0.2139267695  
0.2925208958  
0.3643566315  
0.420771109  
0.4556631071  
0.4661350957  
0.4526392984  
0.418644117  
0.3698985664  
0.3134418895  
0.2565247855  
0.2056222561  
0.1656785874  
0.1396850138  
0.1286085936  
0.1316413264  
0.1466785645  
0.1708999602  
0.2013369726  
0.2353075987  
0.2706703535  
0.3058643323  
0.3397873579  
0.3715628663  
0.4002942498  
0.4248781075  
0.4439424733  
0.4559250532  
0.4592751877  
0.4527405678  
0.4356599671  
0.4081993018  
0.3714727704  
0.327518882  
0.2791274712  
0.2295514855  
0.1821427306  
0.1399769895  
0.1055140975  
0.08034132686  
0.06502218283  
0.05905957594  
0.0609666158  
0.06843398043  
0.07857172182  
0.0882112467  
0.09424498332  
0.09397987297  
0.08548019879  
0.06785804434  
0.04146981805  
0.007977419031  
-0.02976550613  
-0.0680142074  
-0.1026121552  
-0.1295958992  
-0.1458488851  
-0.149701059  
-0.1413580525  
-0.1230665259  
-0.09895070226  
-0.07451380342  
-0.05585442429  
-0.04870689525  
-0.05746480509  
-0.08435257422  
-0.128910566  
-0.1879061295  
-0.2557107804  
-0.3251142951  
-0.3884531667  
-0.438863682  
-0.4714627258  
-0.4842293964  
-0.4784317965  
-0.4585081149  
-0.4314060559  
-0.4054819488  
-0.3891358763  
-0.3894179254  
-0.4108309521  
-0.4545393791  
-0.5181158534  
-0.595861734  
-0.6796592607  
-0.7601943176  
-0.8283627204  
-0.8766226227  
-0.9000802388  
-0.8971422458  
-0.8696471551  
-0.8224662343  
-0.7626635707  
-0.6983551714  
-0.6374626725  
-0.5865526955  
-0.5499393028  
-0.5291662011  
-0.5229329988  
-0.5274468075  
-0.5371215335  
-0.5455057197  
-0.5462808566  
-0.5341877079  
-0.5057407293  
-0.4596514882  
-0.396912075  
-0.3205569178  
-0.2351589554  
-0.1461587497  
-0.05913270472  
0.02088568287  
0.08994437814  
0.1455069578  
0.1865653716  
0.2135434584  
0.228036757  
0.2324563338  
0.229636236  
0.2224739241  
0.2136374608  
0.205361377  
0.1993317723  
0.1966424092  
0.1978016129  
0.2027726573  
0.2110314304  
0.2216503272  
0.2334058215  
0.2449288588  
0.2548980955  
0.2622717619  
0.2665277432  
0.2678848646  
0.2674423282  
0.2672025171  
0.2699336471  
0.278862916  
0.2972247337  
0.3277154356  
0.3719463655  
0.4299937751  
0.5001444053  
0.578926047  
0.6614531078  
0.7420729273  
0.8152443605  
0.8765138998  
0.9234323145  
0.9562315141  
0.9781105011  
0.9950269655  
1.014955021  
1.046684081  
1.098292601  
1.17552368  
1.280325402  
1.409820046  
1.555916024  
1.705701785  
1.842628055  
1.948376215  
2.005169593  
1.998213432  
1.917904422  
1.761459095  
1.533701427  
1.246858315  
0.9193601445  
0.5738035589  
0.2343508128  
-0.07606810794  
-0.3383653022  
-0.5393510624  
-0.6729770145  
-0.7406110273  
-0.7503506092  
-0.7155113409  
-0.6525351224  
-0.5786473957  
-0.5095995007  
-0.4578030994  
-0.4310957135  
-0.4322615291  
-0.4593120471  
-0.5064277202  
-0.5653527355  
-0.6270005148  
-0.6830021625  
-0.7269609628  
-0.7552553233  
-0.767305771  
-0.7653326091  
-0.7537067338  
-0.7380619112  
-0.7243558548  
-0.718058759  
-0.7235958398  
-0.7440999418  
-0.7814561606  
-0.8365489795  
-0.9095837099  
-1.000345518  
-1.108279478  
-1.232341475  
-1.370626086  
-1.519870777  
-1.674965898  
-1.828642663  
-1.971488816  
-2.092392688  
-2.179430763  
-2.221128389  
-2.207926721  
-2.133622717  
-1.996540729  
-1.800189693  
-1.553264469  
-1.268926639  
-0.9634425067  
-0.6543676933  
-0.3585482396  
-0.09025070241  
0.1402874994  
0.3276740725  
0.4714366785  
0.5753878713  
0.6464254614  
0.6930021148  
0.7235434809  
0.7450759841  
0.762273637  
0.7770340882  
0.7885975518  
0.7941239415  
0.789577523  
0.7707344767  
0.7341318695  
0.6778188569  
0.6018178904  
0.5082755951  
0.4013215451  
0.2867045975  
0.171280213  
0.0624228824  
-0.03257743626  
-0.1070989078  
-0.1557258146  
-0.1747313214  
-0.1624766516  
-0.1197094643  
-0.04971354387  
0.04173409334  
0.1466333404  
0.2552838747  
0.357046271  
0.4412882239  
0.498434018  
0.5209979128  
0.5044753732  
0.4479697661  
0.3544645743  
0.2306871765  
0.08656394571  
-0.06567904453  
-0.2126720788  
-0.3411916009  
-0.439435172  
-0.4981475952  
-0.5114789257  
-0.4774921857  
-0.3982754246  
-0.2796527908  
-0.1305447747  
0.03796523088  
0.2137487025  
0.3848197525  
0.5404845501  
0.672328272  
0.7749441627  
0.8463431193  
0.8879949591  
0.904514771  
0.9030241779  
0.8922710023  
0.8816008343  
0.8798899067  
0.8945653713  
0.9307957941  
0.9909403049  
1.074300854  
1.177193815  
1.293329019  
1.414459024  
1.531243441  
1.634259115  
1.715075168  
1.767305094  
1.787535624  
1.776026209  
1.737070525  
1.678919331  
1.613191684  
1.553736694  
1.514983233  
1.509893218  
1.547714238  
1.63181478  
1.757931393  
1.913166808  
2.076030506  
2.217702292  
2.304549608  
2.301729058  
2.177509174  
1.907788186  
1.480175448  
0.8970026713  
0.1767185255  
-0.6466839037  
-1.526279717  
-2.406647436  
-3.229612039  
-3.940551201  
-4.494430327  
-4.860721192  
-5.026528674  
-4.997502438  
-4.796433296  
-4.459781835  
-4.032669044  
-3.563081508  
-3.096108316  
-2.669005208  
-2.307701109  
-2.025125135  
-1.821436834  
-1.685959071  
-1.600375766  
-1.542606393  
-1.490724151  
-1.426329238  
-1.336940597  
-1.217155832  
-1.068549084  
-0.8984789543  
-0.7181314289  
-0.5402023079  
-0.3766429929  
-0.2368242362  
-0.1263658282  
-0.04673601543  
0.004417358699  
0.03236584101  
0.04405975406  
0.04682331954  
0.04721343196  
0.05022744454  
0.05893623328  
0.07454066964  
0.09675048766  
0.1243507713  
0.1557952342  
0.1896908083  
0.2250878317  
0.2615501423  
0.2990405855  
0.3376948959  
0.3775839275  
0.4185425467  
0.4601239329  
0.5016844078  
0.5425789015  
0.5823971871  
0.6211874448  
0.6596035661  
0.698947748  
0.7411117918  
0.7884450041  
0.8435920971  
0.9093370461  
0.988481558  
1.083742287  
1.197639029  
1.332309145  
1.489204542  
1.66862921  
1.869138194  
2.086858624  
2.314860477  
2.542737478  
2.756565146  
2.939386256  
3.072290192  
3.136065362  
3.113288823  
2.990600552  
2.760852745  
2.424781665  
1.991889326  
1.480319596  
0.9156550342  
0.3287150626  
-0.2473870421  
-0.7805557722  
-1.242955955  
-1.613745112  
-1.880928078  
-2.042110254  
-2.104072239  
-2.081277875  
-1.993563038  
-1.863364694  
-1.712889987  
-1.561606776  
-1.424365606  
-1.310343825  
-1.222872764  
-1.160072413  
-1.116118985  
-1.082880848  
-1.051656642  
-1.014741322  
-0.9666186549  
-0.9046511579  
-0.8292242025  
-0.7433981856  
-0.6521751599  
-0.5615459165  
-0.4774792664  
-0.4050202621  
-0.34761759  
-0.306743538  
-0.2818407505  
-0.2705518703  
-0.2691617644  
-0.2731688332  
-0.2778808224  
-0.2789534573  
-0.2728156532  
-0.2569431836  
-0.2299822604  
-0.1917449693  
-0.1431050614  
-0.08583448822  
-0.02241119355  
0.04418584666  
0.110682295  
0.1737204013  
0.230081805  
0.2769267999  
0.3120355253  
0.3340434898  
0.3426342158  
0.3386566874  
0.3241341649  
0.3021363363  
0.276511631  
0.2514960669  
0.2312337727  
0.2192709543  
0.2180938644  
0.2287807177  
0.2508241418  
0.2821578464  
0.3193990729  
0.3582669002  
0.394132219  
0.4226164609  
0.4401514497  
0.4444305765  
0.4346834319  
0.4117465175  
0.3779267358  
0.3366874672  
0.2922078807  
0.2488833416  
0.2108307274  
0.181460378  
0.163155946  
0.1570837292  
0.1631386443  
0.1800104212  
0.2053473894  
0.2359892748  
0.2682439045  
0.2981858924  
0.3219569527  
0.3360591658  
0.3376282591  
0.3246735936  
0.2962645888  
0.2526485238  
0.1952670584  
0.1266549583  
0.05020584323  
-0.03019421589  
-0.1106449847  
-0.1877701077  
-0.2592540185  
-0.324287308  
-0.3838357619  
-0.4406528893  
-0.4989871578  
-0.5639783342  
-0.6407823306  
-0.7335318485  
-0.8442681789  
-0.9720156253  
-1.112176027  
-1.256373355  
-1.392847456  
-1.507400838  
-1.584823177  
-1.610641685  
-1.57297459  
-1.464236851  
-1.282457517  
-1.031996314  
-0.7235479271  
-0.373391754  
-0.001978864204  
0.3679857183  
0.713712901  
1.014491184  
1.253569716  
1.419551943  
1.507158894  
1.517320092  
1.456635471  
1.336330246  
1.170885606  
0.9765311006  
0.7697860042  
0.5661958564  
0.3793534016  
0.2202384325  
0.09685866831  
0.01413674279  
-0.02602744873  
-0.02458818885  
0.01486965846  
0.08639158057  
0.1819550707  
0.291839454  
0.4051083013  
0.5102217218  
0.5957921027  
0.6514507112  
0.6687578352  
0.6420520345  
0.5691251078  
0.4516004611  
0.2949284009  
0.1079479842  
-0.09795394453  
-0.3100110984  
