28,-0.0023736,0.011317,0.016531,-0.99169,0.00065711,-1.9635,0.97992,-0.27486,5.0215,0.00026086,3.1445,0.0020005,0.47749,3.7099,0.016532,4.9735,0.0050646,0.99173,0.035456,0.01449,0.011911,0.010133,0.37179,0.3314,0.25992,0.0215,0.0027066,0.001874,0.010805,0.50973,0.23594,0.10679,195.32,12569,21012,16868,50645,0.14291,0.18514,0.18514,1.4036,3.7087,0.74429,0.16395,0.0096885,55,76.909,2090,95004,5.5946,34.979,56430,27108,6588,0.91775,0.93736,0.27336,0.20184,0.15568,0.79172,46097,20116,0.0008595,0.00045072,0,0.062571,0,0.060934,0.0027119,0.016902,0.00063155,0.010622,1.0379,2.7285,0.957,0.23771,0.34869,0.28985,0.21688,0.44738,0.26639,0.22492,0.46611,0.2518,48.472,7.8258,24558,57801,56601,0.056524,0.042303,0.027043,0.21026,0.18114,0.052194,0.37964,0.35255,0.066011,0.53698,0.52033,0.073987,0.64963,0.64807,0.076071,0.0053836,0.0046288,0.06631,0.016804,0.055376,-0.031271,0.011853,0.010796,0.068822,0.023479,0.073647,-0.026953,0.020242,0.019317,0.069378,0.02949,0.09018,-0.017354,0.003483,0.0029177,0.091764,0.018575,0.041654,-0.02724,0.0065882,0.0056671,0.079795,0.020335,0.052241,-0.02998,0.01011,0.0089877,0.070798,0.021384,0.062139,-0.028446,0.00085388,0.00060728,0.0219,-0.00022881,0.031909,-0.025028,0.0017257,0.0012295,0.021748,-0.00034989,0.040117,-0.031774,0.0029776,0.0021456,0.022805,1.1933e-05,0.046649,-0.04039,0.0010466,0.0011038,0.24677,0.025234,0.026754,0.0075248,0.0035418,0.0039019,0.26172,0.03744,0.041998,0.018866,0.0072098,0.0082253,0.26597,0.049525,0.057937,0.033638,0.39434,74,74,40,988,3,3,3,0.645
28,-0.0018174,0.0098685,0.013853,-0.99304,0.0015625,-1.9284,0.94192,-1.4877,11.129,-0.028494,3.0778,0.0067724,0.91373,7.9107,0.013316,13.766,0.014018,0.99333,0.074866,0.053323,0.04504,0.038215,0.40141,0.28889,0.2379,0.019612,0.007756,0.0064834,0.037939,0.54593,0.17374,0.18561,245.3,1455.6,1671.1,1332,4704.9,0.22514,0.11255,0.22514,2.1636,2.8003,0.68608,0.15596,0.010649,57,76.07,2385,1.1195e+05,6.0521,40.923,64395,22518,12312,0.91842,0.93614,0.19317,0.14074,0.11573,0.58016,26818,15380,0.0015236,0.00058893,0,0.061981,0,0.064188,0.0073143,0.015261,0.010096,0.011598,2.4847,4.0745,1.0929,0.28651,0.27441,0.25012,0.36243,0.26008,0.11742,0.38226,0.26003,0.10535,16.661,6.7533,14785,34787,34027,0.33601,0.3272,0.16465,0.71859,0.76311,0.1827,0.83092,0.86478,0.14799,0.91331,0.93379,0.12889,0.96184,0.97194,0.11536,0.012079,0.011896,0.15239,0.049237,0.088437,-0.0055666,0.027448,0.027483,0.16324,0.070513,0.11763,0.00064285,0.049059,0.049824,0.17222,0.093125,0.14693,0.010122,0.0021727,0.0020239,0.05863,0.0093942,0.043809,-0.012564,0.00618,0.0062982,0.076665,0.018801,0.061078,0.0048802,0.012472,0.01352,0.089455,0.029103,0.079898,0.028053,0.0097746,0.0097529,0.25677,0.060206,0.078976,-0.00071493,0.021535,0.022062,0.27798,0.085623,0.10783,0.010757,0.037475,0.038645,0.29398,0.11174,0.13455,0.017397,0.00013171,0.00011887,0.031808,0.00094407,0.01658,-0.0079361,0.0009869,0.00092062,0.074695,0.007955,0.025181,-0.0094569,0.0028751,0.0026959,0.10863,0.01717,0.035535,-0.011114,0.49795,74,74,40,988,3,3,3,0.645
28,-0.0019696,0.0097026,0.014016,-0.99296,0.00083034,-1.9561,0.96993,-0.34023,3.3107,-0.043199,3.2925,1.8186e-05,0.34894,2.9447,0.014013,3.7783,0.0038476,0.99299,0.067928,0.0318,0.023401,0.018469,0.38271,0.27051,0.27742,0.035759,0.0086739,0.0051614,0.019777,0.48036,0.096606,0.12005,79.837,1301.6,3162.3,6015.6,10560,0.33436,0.21681,0.33436,0.88261,0.91206,0.37513,0.14793,0.010112,54,48.778,2126,82625,7.0593,51.226,57402,3078,2970,0.92192,0.94505,0.13053,0.093577,0.049772,0.70778,32884,16916,0.0011486,0.00043571,0,0.059972,0,0.057916,0.0031641,0.027361,0.015823,0.03177,0.15262,0.53487,1.5485,0.28526,0.29087,0.24882,0.39435,0.28522,0.097497,0.39797,0.26287,0.075085,29.888,6.7181,23436,47315,46335,0.20664,0.20495,0.068086,0.52561,0.57244,0.08986,0.74243,0.79749,0.08891,0.8571,0.89472,0.081333,0.92957,0.94897,0.074968,0.041912,0.049311,0.35554,0.1575,0.1732,0.10622,0.082344,0.098978,0.32929,0.192,0.21813,0.15789,0.12953,0.15733,0.30576,0.22039,0.25667,0.20621,0.017058,0.023017,0.30951,0.094984,0.11562,0.13679,0.037009,0.050018,0.30871,0.12547,0.15268,0.18371,0.063555,0.085936,0.3065,0.15548,0.18991,0.23366,0.022581,0.023807,0.39886,0.12005,0.12237,0.02334,0.043077,0.047076,0.37389,0.14631,0.15352,0.050334,0.064546,0.071629,0.34047,0.16288,0.17534,0.069652,0.0022737,0.0024865,0.3692,0.047816,0.049013,0.015107,0.006237,0.0067256,0.31741,0.056764,0.060964,0.017292,0.011437,0.012246,0.29058,0.06721,0.074048,0.019751,0.41645,74,74,40,988,3,3,3,0.645
28,-0.0032864,0.015896,0.022978,-0.98843,0.0013004,-1.9485,0.97129,0.17204,4.5161,-0.020456,3.2525,0.00039064,0.95637,6.3136,0.022899,10.575,0.010769,0.98854,0.06558,0.025794,0.02033,0.016952,0.34345,0.2496,0.34462,0.036866,0.0052883,0.0032968,0.016884,0.50018,0.1382,0.0023317,52.278,2694.6,5632.2,6002.5,14382,0.42792,0.18506,0.42792,1.2746,1.6403,0.49842,0.18987,0.017709,40,132.35,3084,2.7541e+05,4.8336,26.44,83268,35451,15201,0.91857,0.93822,0.25495,0.17975,0.18431,0.72399,44107,22738,0.0014752,0.00069978,0,0.041085,0,0.050749,0.0025007,0.019468,0.013272,0.012007,1.0774,1.1628,2.5869,0.29212,0.26479,0.24532,0.38319,0.22579,0.12463,0.38953,0.22619,0.11261,19.277,6.6236,6993,16753,14627,0.26889,0.26107,0.15497,0.62496,0.6655,0.18688,0.78203,0.81633,0.16381,0.88819,0.91047,0.14742,0.93744,0.95112,0.13224,0.0062136,0.0052912,0.092196,0.022829,0.060745,-0.046991,0.013781,0.012153,0.096395,0.032113,0.083233,-0.051385,0.024577,0.022059,0.10147,0.042787,0.1053,-0.056521,0.0024673,0.0021036,0.078308,0.012509,0.039086,-0.02977,0.0053732,0.004677,0.078397,0.016598,0.052812,-0.0352,0.0098737,0.0088084,0.08329,0.022714,0.067957,-0.037867,0.0034844,0.0029879,0.10766,0.019117,0.043284,-0.033278,0.0077284,0.0069556,0.11733,0.027929,0.059547,-0.032027,0.013475,0.012307,0.12433,0.036961,0.074449,-0.034836,0.00026181,0.00019969,0.074361,0.0048279,0.021214,-0.026128,0.0011517,0.00089416,0.10252,0.010744,0.030013,-0.032974,0.0025005,0.0019548,0.11112,0.015564,0.038668,-0.040269,0.46425,74,74,40,988,3,3,3,0.645
28,-0.0025716,0.012444,0.01807,-0.99091,0.00091841,-1.9563,0.97426,0.017776,3.4846,0.030937,3.2746,9.9074e-09,0.39842,2.9702,0.017956,3.8244,0.0038945,0.99101,0.051641,0.025746,0.019572,0.015668,0.35579,0.29465,0.29648,0.025951,0.0063818,0.0040758,0.016677,0.50821,0.19153,0.023372,125.28,2027.3,4165.4,6748.9,13068,0.12105,0.17353,0.17353,1.4077,2.9236,0.64437,0.16757,0.013204,49,94.102,2911,1.7976e+05,6.1457,40.818,78597,18441,10746,0.91573,0.93153,0.34604,0.27679,0.1506,0.86158,55835,25667,0.00088359,0.00044273,0,0.085203,0,0.072538,0.0038719,0.012262,0.0045061,0.017459,1.1347,3.1215,1.3016,0.2567,0.34612,0.28577,0.25758,0.43712,0.27045,0.26305,0.446,0.2648,59.616,7.7159,34177,1.0447e+05,1.0387e+05,0.027273,0.017548,0.013809,0.16042,0.12284,0.042143,0.34375,0.28123,0.063258,0.52708,0.44865,0.076859,0.67803,0.60236,0.084028,0.010478,0.01051,0.13659,0.042236,0.072286,0.00071531,0.020508,0.021825,0.12602,0.050552,0.095606,0.019416,0.032717,0.036436,0.11867,0.058212,0.11801,0.042329,0.0079773,0.0089857,0.22243,0.051942,0.070368,0.026419,0.016226,0.019149,0.20798,0.063789,0.093905,0.048935,0.026374,0.032358,0.19545,0.074217,0.11717,0.075403,0.0020647,0.00122,0.056044,0.0081067,0.031003,-0.0393,0.0031542,0.0018696,0.04207,0.0059445,0.038584,-0.043513,0.0039194,0.0023451,0.03177,0.0031143,0.044701,-0.047624,0.00043632,0.00030452,0.10887,0.0092891,0.017304,-0.018312,0.001389,0.00096707,0.10863,0.012882,0.025375,-0.026724,0.0029215,0.002036,0.11406,0.017819,0.033698,-0.03743,0.40269,74,74,40,988,3,3,3,0.645
28,-0.0032653,0.01543,0.022522,-0.98866,0.00091629,-1.957,0.97945,-0.090462,3.2211,-0.013377,3.2852,3.8053e-05,0.4776,3.1708,0.022642,4.1371,0.0042129,0.98867,0.03667,0.01355,0.0097128,0.0072847,0.32486,0.32318,0.31402,0.023596,0.0040206,0.0025601,0.0077554,0.47674,0.25421,0.0011493,136.91,4713,9253,28709,42813,0.19937,0.20983,0.20983,0.65501,0.71624,0.26145,0.18833,0.015531,52,87.346,3704,2.6085e+05,6.9274,49.331,1.0001e+05,5751,4131,0.91374,0.9331,0.29003,0.22403,0.14808,0.79584,63210,25950,0.00087825,0.00043481,0,0.049936,0,0.044229,0.0031765,0.0065904,0.0010943,0.015672,0.3502,0.84337,0.18212,0.26445,0.35105,0.26441,0.30816,0.43689,0.19507,0.30717,0.45329,0.19279,40.6,7.1392,19614,58090,56957,0.049443,0.035997,0.026371,0.25063,0.22369,0.06936,0.51223,0.49784,0.099296,0.72564,0.7281,0.11146,0.86965,0.88347,0.11353,0.0057689,0.0052796,0.079217,0.019704,0.062085,-0.018606,0.013895,0.013259,0.089946,0.031217,0.082273,-0.013687,0.026259,0.025506,0.10034,0.044976,0.10265,-0.011286,0.0040246,0.0041394,0.11821,0.023701,0.052261,0.0053246,0.009857,0.010582,0.1331,0.036428,0.071034,0.018591,0.018651,0.020352,0.1456,0.050765,0.091116,0.030137,0.0017442,0.0011401,0.049873,0.006058,0.036063,-0.039779,0.004038,0.0026775,0.056735,0.010112,0.04624,-0.053132,0.0076317,0.0051719,0.065165,0.015755,0.055614,-0.067223,6.9664e-08,4.5719e-08,1.8311e-05,-0.002711,0.00803,-0.0092236,7.7353e-06,4.9844e-06,0.00063724,-0.0036787,0.0090798,-0.012903,7.3769e-05,4.7325e-05,0.003034,-0.004318,0.010427,-0.013506,0.44412,74,74,40,988,3,3,3,0.645
28,-0.0037332,0.017568,0.025709,-0.98705,0.00092397,-1.9562,0.98187,0.037569,2.7846,0.049644,3.3017,9.8686e-05,0.6774,4.2095,0.025843,5.813,0.0059196,0.98706,0.033049,0.0090483,0.0067042,0.0052679,0.28624,0.32993,0.3501,0.024276,0.002433,0.0014963,0.005525,0.42655,0.26673,0.0052908,135.29,12831,28600,58943,1.0051e+05,0.10286,0.13157,0.13157,1.2969,2.1934,0.57046,0.20099,0.019871,55,65.655,1591,78068,4.893,25.405,42957,37314,5400,0.91906,0.93803,0.23833,0.18249,0.10325,0.75496,58346,22815,0.0010998,0.00043104,0,0.058044,0,0.070359,0.0044171,0.035113,0.005149,0.044514,0.8979,1.4253,0.060847,0.28462,0.32334,0.25695,0.33801,0.38198,0.16805,0.37113,0.38025,0.15512,40.578,6.9376,21395,53217,52505,0.084383,0.067513,0.034043,0.35156,0.37181,0.073589,0.6242,0.67429,0.091524,0.79724,0.84275,0.092629,0.89803,0.92997,0.088675,0.0049726,0.0034085,0.051647,0.013612,0.052789,-0.061793,0.010269,0.0072377,0.050281,0.017224,0.068028,-0.0751,0.017098,0.01241,0.049417,0.020781,0.083158,-0.087219,0.0047692,0.0032843,0.10595,0.025389,0.048293,-0.05908,0.0093429,0.0066502,0.095422,0.029546,0.061341,-0.068568,0.014697,0.010843,0.086784,0.03271,0.074417,-0.075632,9.7067e-05,5.5517e-05,0.0020993,-0.0048523,0.026994,-0.019715,0.00037873,0.00022064,0.0040248,-0.0056139,0.034934,-0.025336,0.0010586,0.00063743,0.0068369,-0.0056164,0.041916,-0.036246,0.00010625,6.8637e-05,0.021124,0.00023487,0.006949,-0.016859,0.0005851,0.00038943,0.036458,0.0029384,0.011999,-0.026863,0.0015077,0.0010289,0.046903,0.0061308,0.018055,-0.03491,0.40565,74,74,40,988,3,3,3,0.645
28,-0.0032888,0.015801,0.022913,-0.98847,0.0011771,-1.9512,0.97398,-0.49487,3.3863,-0.10208,3.1995,0.0002323,0.47509,3.1297,0.022998,4.0038,0.0040772,0.98849,0.046787,0.021368,0.016359,0.013176,0.32238,0.30768,0.32219,0.025394,0.0051538,0.0033024,0.01389,0.45373,0.22792,0.00067289,123.39,2948.7,5931.5,9191.7,18196,0.16827,0.17693,0.17693,1.508,2.7507,0.61342,0.19006,0.014387,42,97.952,2467,1.5553e+05,5.3493,31.753,66609,22032,7182,0.91824,0.93722,0.25856,0.18988,0.16365,0.76122,59947,24884,0.00070666,0.00034631,0,0.063783,0,0.054243,0.0023797,0.021045,0.00058782,0.017044,0.48677,0.70902,0.69318,0.24877,0.33888,0.29699,0.2456,0.44315,0.26081,0.267,0.44696,0.24222,46.517,8.0187,22619,52964,51913,0.02482,0.018324,0.011891,0.17394,0.16273,0.043238,0.41033,0.42253,0.071448,0.6221,0.65096,0.085835,0.78523,0.81653,0.092078,0.0031252,0.0045793,0.038547,0.0060709,0.042223,0.11782,0.010817,0.015913,0.062898,0.020428,0.070737,0.16595,0.023439,0.03395,0.080449,0.03645,0.099899,0.20671,0.0027136,0.0042709,0.071594,0.013126,0.039603,0.13633,0.0092632,0.014668,0.11235,0.031913,0.069569,0.18843,0.019676,0.030778,0.13798,0.051249,0.099511,0.2362,0.00041153,0.00030843,0.010569,-0.0031915,0.020776,-0.021859,0.0015478,0.0012409,0.019533,-0.0011135,0.031922,-0.02751,0.003713,0.003137,0.028478,0.0023665,0.043292,-0.02887,0,0,0,-0.0025678,0.0051377,0,1.6085e-05,1.1137e-05,0.0011903,-0.0033851,0.0083332,-0.011376,0.00010978,7.6366e-05,0.0040553,-0.0038163,0.012494,-0.016429,0.40739,74,74,40,988,3,3,3,0.645
28,-0.0024099,0.012457,0.017789,-0.99106,0.0014544,-1.9407,0.95825,-0.11748,3.893,0.082103,3.2445,0.00017442,0.45962,3.4509,0.017704,4.4289,0.00451,0.99114,0.085402,0.046745,0.036231,0.030366,0.33992,0.31265,0.26695,0.034802,0.0099148,0.005619,0.030144,0.50335,0.22719,0.052789,61.529,764.49,2016.7,1931.4,4774.9,0.19046,0.093669,0.19046,1.049,1.1273,0.43992,0.16714,0.012694,60,42.883,970,22401,4.6468,25.984,26190,14310,11880,0.92196,0.9452,0.24342,0.16755,0.16715,0.8204,31416,17957,0.00083346,0.00037972,0,0.03611,0,0.039205,0.0066426,0.034909,0.0016821,0.052117,0.25348,0.28961,0.81954,0.27761,0.3035,0.25917,0.36278,0.3515,0.11627,0.38675,0.33595,0.10163,25.428,6.9976,19893,35581,34685,0.15843,0.15328,0.056578,0.40172,0.41607,0.074435,0.58942,0.61179,0.076502,0.71106,0.72901,0.073131,0.81391,0.82529,0.071142,0.018773,0.022539,0.1726,0.069315,0.10578,0.10773,0.043066,0.052808,0.18665,0.099834,0.14739,0.16316,0.073483,0.090739,0.188,0.12488,0.1837,0.21033,0.0093162,0.012325,0.18321,0.051645,0.083384,0.12537,0.023042,0.031581,0.20832,0.078742,0.12112,0.19778,0.041703,0.05751,0.21798,0.10328,0.15492,0.2561,0.0082281,0.0088944,0.15752,0.042315,0.061846,0.028411,0.018779,0.01996,0.17666,0.062681,0.084271,0.029295,0.031368,0.032932,0.17933,0.078252,0.10361,0.027959,0.0012292,0.0013193,0.21633,0.025915,0.033289,0.01025,0.0030941,0.0034185,0.17066,0.027787,0.040908,0.019542,0.005469,0.0060751,0.1506,0.031396,0.049145,0.026595,0.43421,74,74,40,988,3,3,3,0.645
28,-0.0024103,0.012971,0.018272,-0.99081,0.0021117,-1.9226,0.94044,1.1053,11.478,0.027743,2.9459,0.012297,1.1429,8.4615,0.018208,13.086,0.013299,0.99089,0.14332,0.068861,0.045667,0.034084,0.33098,0.25458,0.27266,0.06891,0.02347,0.012115,0.037279,0.4728,0.1207,0.052806,12.533,129.88,428.96,1306.3,1878.4,0.29617,0.41206,0.41206,1.1901,3.1722,0.69853,0.16904,0.0112,84,10.214,319,1406.3,6.1798,48.183,8613,2592,2295,0.92398,0.94845,0.048989,0.033135,0.022167,0.38653,18416,11293,0.00071054,0.00033587,0,0.095106,0,0.087972,0.038781,0.16482,0.086345,0.41417,0.61011,1.0901,1.043,0.28007,0.27575,0.28869,0.4334,0.23807,0.18539,0.46304,0.21862,0.1871,18.393,7.7946,13393,18564,17774,0.16948,0.15798,0.0327,0.42893,0.40421,0.04294,0.5507,0.54296,0.038617,0.65755,0.67225,0.036538,0.72714,0.75013,0.034339,0.021299,0.018646,0.1058,0.05832,0.092548,-0.05329,0.041219,0.036783,0.09652,0.069642,0.11738,-0.059778,0.06471,0.059157,0.089443,0.079425,0.14003,-0.057499,0.008814,0.0078027,0.093649,0.035564,0.061577,-0.032881,0.018557,0.01675,0.09064,0.045429,0.079328,-0.036574,0.030371,0.027907,0.085768,0.05333,0.095387,-0.036746,0.012275,0.010685,0.12697,0.048064,0.067894,-0.041757,0.024672,0.021789,0.12539,0.061823,0.088544,-0.049994,0.039322,0.035593,0.12146,0.073339,0.10614,-0.048866,0.00020933,0.00015858,0.019904,0.0018884,0.016998,-0.013034,0.00071803,0.00055262,0.021398,0.0029925,0.023388,-0.018851,0.0017641,0.0013925,0.026245,0.0054329,0.031365,-0.027299,0.42704,74,74,40,988,3,3,3,0.645
28,-0.0037081,0.017823,0.025866,-0.98697,0.0013511,-1.9478,0.97353,0.40685,3.2422,0.063679,3.2944,2.0658e-09,0.57573,3.5648,0.026031,4.6299,0.0047148,0.98697,0.062151,0.030979,0.02164,0.015976,0.27066,0.31339,0.35241,0.030909,0.0096275,0.0059243,0.017074,0.39533,0.23703,0.0068504,75.889,806.23,1820.6,6005.9,8709.2,0.17911,0.21362,0.21362,0.67138,0.70258,0.34867,0.20161,0.020059,55,92.164,1922,1.223e+05,4.5788,22.931,51894,47763,15309,0.9151,0.93185,0.30644,0.23044,0.19616,0.75097,61467,27444,0.00092917,0.00042509,0,0.080886,0,0.06838,0.0065792,0.00078611,0.0056189,0.016906,1.1518,2.0079,0.21254,0.2715,0.34,0.27032,0.30732,0.42056,0.21231,0.32755,0.42281,0.20065,41.83,7.2987,15388,44517,43686,0.04595,0.034974,0.028289,0.24361,0.24115,0.077819,0.48738,0.50299,0.10905,0.69548,0.71747,0.12331,0.83287,0.85726,0.1255,0.0029924,0.0023603,0.047429,0.0061863,0.044663,-0.039617,0.0081617,0.0064256,0.060984,0.014285,0.062374,-0.058455,0.016385,0.012916,0.072267,0.024044,0.080634,-0.076344,0.001731,0.0012588,0.058687,0.0069961,0.034001,-0.037101,0.0044435,0.0033277,0.069255,0.012601,0.047122,-0.050379,0.0089859,0.0068873,0.080971,0.020347,0.061553,-0.062565,0.00097107,0.00087294,0.032049,0.00063228,0.027998,-0.011072,0.0027291,0.0023252,0.04426,0.0044985,0.038035,-0.023544,0.0055073,0.004563,0.054279,0.0092252,0.047951,-0.035253,0.00029026,0.00022861,0.088065,0.0058547,0.011081,-0.015991,0.0010026,0.00078279,0.095333,0.0091504,0.017417,-0.02155,0.0019919,0.0015431,0.094562,0.011753,0.024174,-0.028277,0.44947,74,74,40,988,3,3,3,0.645
28,-0.0031207,0.014812,0.021541,-0.98916,0.0010067,-1.9549,0.97635,-0.094272,3.651,-0.042374,3.2412,0.0001772,0.49013,3.3274,0.021653,4.3018,0.0043807,0.98916,0.041357,0.017204,0.012553,0.0096332,0.34087,0.27003,0.34514,0.025237,0.0049983,0.0031611,0.01056,0.48126,0.13633,0.0015379,132.08,3302.5,6921.7,16974,27331,0.24389,0.26883,0.26883,1.1688,2.1242,0.56769,0.18405,0.015654,61,53.41,1528,42271,6.1637,43.397,41256,11205,10044,0.92065,0.94068,0.15083,0.10708,0.079634,0.58389,44265,20469,0.00090519,0.0003995,0,0.039304,0,0.050474,0.0048387,0.012492,0.0080841,0.035589,0.74235,1.2437,0.28243,0.2618,0.33873,0.27254,0.29171,0.44739,0.19408,0.29927,0.45606,0.18799,33.379,7.3587,15282,31380,30406,0.058057,0.047087,0.023494,0.32062,0.32399,0.06732,0.62796,0.66008,0.09236,0.81256,0.84371,0.0947,0.91019,0.92842,0.090154,0.0053678,0.0042339,0.055925,0.015358,0.057345,-0.053441,0.011329,0.0091155,0.055642,0.020132,0.074697,-0.065467,0.018909,0.015512,0.054819,0.024419,0.091647,-0.07437,0.0013509,0.001105,0.030105,0.0031674,0.031367,-0.025563,0.0034723,0.0028418,0.035573,0.0063122,0.042886,-0.037412,0.0067534,0.0055049,0.040001,0.010021,0.055537,-0.048549,0.0040169,0.0031289,0.087143,0.019224,0.048461,-0.046848,0.0078568,0.0062737,0.083755,0.023811,0.061635,-0.05375,0.012156,0.010007,0.078751,0.026968,0.072714,-0.056428,0,0,0,-0.0023557,0.010577,0,0,0,0,-0.0032765,0.013532,0,0,0,0,-0.0042582,0.017637,0,0.41882,74,74,40,988,3,3,3,0.645
28,-0.0018757,0.011112,0.015082,-0.99242,0.002638,-1.8939,0.90834,-0.45153,4.5547,0.010732,3.2182,0.0010447,0.6219,5.2187,0.014172,7.4338,0.00757,0.9929,0.1036,0.067212,0.054939,0.046101,0.37488,0.24539,0.27554,0.034289,0.0121,0.0088887,0.048917,0.49788,0.089751,0.080224,76.39,609.77,944.1,830.94,2461.9,0.36407,0.3084,0.36407,0.98213,2.1423,0.57992,0.14904,0.0094748,52,131.13,2991,2.7115e+05,4.527,22.962,80757,59670,22815,0.91753,0.93479,0.33399,0.2448,0.24398,0.75442,41866,24159,0.0013982,0.00058549,0,0.069162,0,0.052639,0.0095938,0.046902,0.0128,0.06571,0.12873,0.86478,1.3283,0.2863,0.28626,0.23956,0.35521,0.27247,0.13776,0.36009,0.28748,0.12478,20.348,6.4681,14445,42197,40829,0.25245,0.25941,0.18259,0.53726,0.58296,0.20161,0.72487,0.76077,0.19054,0.85959,0.88285,0.17904,0.93331,0.94687,0.16522,0.01536,0.017024,0.28599,0.079453,0.10435,0.045621,0.031132,0.034523,0.27327,0.099646,0.13404,0.059115,0.049488,0.054388,0.25641,0.11494,0.15887,0.064925,0.0044398,0.0040846,0.17683,0.03137,0.049192,-0.018071,0.0091219,0.0082214,0.16702,0.03869,0.063722,-0.029037,0.014753,0.013221,0.15617,0.044354,0.078378,-0.036769,0.010142,0.012161,0.39321,0.076601,0.092616,0.066684,0.019888,0.024123,0.3789,0.095883,0.11819,0.090384,0.031047,0.037355,0.35947,0.11109,0.13805,0.10354,0.00077813,0.00077812,0.27735,0.022391,0.031197,-1.3442e-06,0.0024829,0.0026171,0.27736,0.031145,0.042578,0.0089702,0.0047505,0.0051633,0.26493,0.038406,0.052859,0.018093,0.56536,74,74,40,988,3,3,3,0.645
28,-0.0035245,0.018049,0.025732,-0.98704,0.0020731,-1.9335,0.95887,-0.54584,2.9372,-0.11766,3.2863,2.3387e-05,0.62596,3.9176,0.025479,5.2537,0.00535,0.98724,0.090801,0.051255,0.040311,0.03357,0.27096,0.31844,0.32571,0.03517,0.010206,0.0063933,0.033124,0.42808,0.2791,0.0039307,53.402,620.92,1327.4,1384.3,3386.8,0.18884,0.10671,0.18884,1.0246,2.7105,0.43537,0.20051,0.019747,67,38.672,707,11992,3.9703,21.436,19089,10881,6669,0.92356,0.94775,0.11981,0.077934,0.0888,0.60848,24799,16360,0.00076615,0.00036124,0,0.040086,0,0.05524,0.0047606,0.017005,0.007436,0.019059,0.3474,0.42273,0.57864,0.26377,0.29773,0.29181,0.31415,0.34538,0.20625,0.32985,0.34626,0.18916,24.788,7.8788,11953,21633,20366,0.12132,0.1167,0.045071,0.36861,0.38798,0.071052,0.56298,0.58583,0.076014,0.70341,0.72038,0.075258,0.80795,0.82005,0.073466,0.013958,0.014785,0.1335,0.050599,0.090215,0.035056,0.030972,0.032539,0.13965,0.070389,0.12074,0.039321,0.051077,0.05367,0.13593,0.084697,0.14649,0.047777,0.0037189,0.0034608,0.07608,0.017796,0.050324,-0.022497,0.0096268,0.0091933,0.090538,0.029408,0.06983,-0.020879,0.018685,0.018345,0.1016,0.042293,0.08999,-0.010793,0.0086341,0.0094129,0.17195,0.045562,0.068414,0.041218,0.018488,0.020061,0.18093,0.062855,0.091156,0.049482,0.02881,0.031357,0.17134,0.072645,0.10872,0.060188,0.0016048,0.0019116,0.29381,0.03521,0.044034,0.040142,0.0039706,0.0047144,0.22783,0.03727,0.051883,0.050944,0.006539,0.0077435,0.18731,0.039099,0.058666,0.060241,0.46227,74,74,40,988,3,3,3,0.645
28,-0.0039125,0.020024,0.028513,-0.98563,0.002271,-1.9312,0.95935,0.091327,2.6845,0.0095792,3.3263,8.9155e-05,0.59189,3.5204,0.02821,4.539,0.0046222,0.98588,0.079571,0.049075,0.039915,0.03338,0.25793,0.28237,0.38326,0.027923,0.0087073,0.0063065,0.033497,0.41903,0.22338,0.048454,87.285,859.58,1366.4,1339.2,3653.1,0.20351,0.098948,0.20351,0.46146,0.86568,0.25002,0.21026,0.021912,39,198.97,3994,4.9091e+05,4.5656,23.773,1.0784e+05,53244,15768,0.90665,0.91834,0.29857,0.234,0.14593,0.62413,88829,41935,0.0010268,0.00048195,0,0.084773,0,0.066314,0.00089798,0.0014403,0.00098828,0.0092595,0.49479,0.91955,0.89739,0.26561,0.35235,0.27144,0.28181,0.42282,0.23411,0.30042,0.43196,0.21793,54.723,7.329,15832,69130,68296,0.046317,0.033244,0.038646,0.23675,0.20717,0.1025,0.465,0.44492,0.14101,0.6374,0.63284,0.15317,0.77187,0.78092,0.15763,0.0042504,0.002766,0.091305,0.015209,0.038217,-0.060749,0.0089872,0.0060779,0.09101,0.019977,0.051094,-0.074383,0.015431,0.010759,0.092237,0.025385,0.063926,-0.088104,0.0024658,0.0016754,0.1133,0.015132,0.030102,-0.043519,0.0054689,0.0038783,0.11552,0.02065,0.040527,-0.05294,0.0097909,0.0071619,0.11957,0.02716,0.051497,-0.063171,0.0017818,0.0010889,0.079699,0.0079682,0.023614,-0.04222,0.0034992,0.0021903,0.07691,0.0096634,0.031132,-0.051954,0.0055781,0.0035685,0.074511,0.0111,0.038192,-0.060654,2.841e-06,1.7435e-06,0.0011682,-0.0033179,0.0070659,-0.0082976,4.4485e-05,2.6904e-05,0.0057329,-0.0040684,0.0094999,-0.012643,0.00017676,0.00010594,0.011373,-0.0044101,0.012421,-0.016523,0.46688,74,74,40,988,3,3,3,0.645
28,-0.0022585,0.011564,0.016535,-0.99169,0.0013461,-1.9422,0.95843,0.74932,4.9219,0.022533,3.2341,0.00075662,0.67333,5.2493,0.01642,6.9781,0.0070916,0.99178,0.090495,0.048594,0.035281,0.027134,0.35977,0.24967,0.29664,0.041471,0.01388,0.0086703,0.029897,0.4787,0.085581,0.040323,48.662,459.87,974.36,2308.9,3792.3,0.19497,0.28831,0.28831,1.7163,2.7272,0.73095,0.16064,0.012197,62,60.435,2535,1.0729e+05,7.0991,53.507,68445,15795,3834,0.91968,0.9411,0.245,0.17183,0.15774,0.8035,39577,19524,0.00095962,0.00043175,0,0.049786,0,0.055777,0.0017475,0.00015499,0.0019526,0.01199,1.1617,1.8989,0.14911,0.25244,0.31895,0.27904,0.2687,0.41235,0.20031,0.27017,0.42646,0.20304,32.499,7.5342,13314,26950,25034,0.10093,0.081005,0.043728,0.36786,0.3488,0.082695,0.61487,0.62083,0.096821,0.77645,0.79639,0.096882,0.88911,0.90454,0.094285,0.0019285,0.0015921,0.021511,0.00035834,0.040439,-0.032338,0.0044947,0.0037715,0.023634,0.00161,0.054035,-0.04107,0.0081363,0.006851,0.025254,0.0030736,0.068067,-0.051136,0.0019129,0.0015813,0.045638,0.0070689,0.039835,-0.031891,0.0044107,0.0037135,0.048378,0.010389,0.052295,-0.039802,0.0079204,0.0067014,0.050226,0.013835,0.064948,-0.049079,1.563e-05,1.0798e-05,0.00036303,-0.0055502,0.017401,-0.013982,8.2212e-05,5.6798e-05,0.00093828,-0.0070304,0.02365,-0.013982,0.00018585,0.0001293,0.0012891,-0.0084785,0.030001,-0.014715,0,0,0,-0.0024391,0.0076974,0,1.7823e-06,1.2151e-06,0.00011926,-0.0033729,0.011041,-0.014394,3.294e-05,2.2859e-05,0.0011005,-0.0041738,0.015961,-0.015418,0.44138,74,74,40,988,3,3,3,0.645
28,-0.002825,0.013888,0.020131,-0.98987,0.0010582,-1.9534,0.97336,-0.24338,3.6541,-0.010615,3.2461,0.00014246,0.61909,4.3646,0.020079,6.0488,0.0061597,0.98995,0.057429,0.030459,0.024761,0.020736,0.32073,0.3312,0.29092,0.026049,0.0056785,0.0040502,0.02138,0.45954,0.24043,0.023101,123.02,2541.6,4090.2,4115.6,10871,0.088441,0.091963,0.091963,0.79757,3.062,0.55909,0.17701,0.01496,45,56.844,2205,1.0687e+05,6.4175,42.459,59535,4158,2214,0.92066,0.94164,0.24468,0.20225,0.038687,0.85947,57109,16319,0.0010067,0.00037654,0,0.10709,0,0.077922,0.0062415,0.016388,0.0041172,0.014551,0.2325,1.584,0.71348,0.23564,0.32041,0.31742,0.22521,0.37916,0.30789,0.20154,0.38187,0.36115,38.81,8.5703,39896,1.1702e+05,1.1646e+05,0.1039,0.070729,0.031454,0.36079,0.39746,0.056672,0.61577,0.70766,0.067754,0.78904,0.86955,0.068795,0.88755,0.93705,0.065767,0.027197,0.031632,0.21198,0.09546,0.11407,0.051372,0.053809,0.062101,0.19771,0.117,0.14336,0.062818,0.08511,0.098424,0.18459,0.1348,0.17085,0.078342,0.0087571,0.0081443,0.14599,0.044347,0.052614,-0.012652,0.018264,0.017052,0.13998,0.056055,0.069241,-0.015499,0.029644,0.028056,0.13135,0.065183,0.085605,-0.0153,0.018435,0.023485,0.29919,0.093016,0.10793,0.071022,0.03716,0.047355,0.29635,0.12006,0.13939,0.09233,0.059069,0.076187,0.28628,0.14215,0.16784,0.11899,5.2374e-06,2.707e-06,0.00078139,-0.0019223,0.011863,-0.015754,0.00010549,5.6342e-05,0.0049329,-0.0018594,0.016763,-0.022926,0.00063079,0.00034119,0.014725,7.9625e-05,0.022871,-0.029878,0.41169,74,74,40,988,3,3,3,0.645
28,-0.0028701,0.017636,0.023788,-0.98802,0.0047049,-1.873,0.89567,0.018299,2.9302,0.022016,3.3092,2.7396e-06,0.68676,4.6317,0.021941,6.2099,0.0063237,0.98901,0.12186,0.090949,0.07472,0.062852,0.28184,0.28568,0.31644,0.026979,0.014787,0.011099,0.063171,0.44601,0.22339,0.0027155,90.076,286.41,418.74,355.43,1151.3,0.41556,0.19647,0.41556,0.74603,1.0769,0.34754,0.18593,0.015677,42,25.952,900,18855,6.1454,39.175,24300,2079,1566,0.92423,0.9499,0.0875,0.057776,0.033376,0.63054,36297,14577,0.00081829,0.00034115,0,0.058352,0,0.097722,0.021565,0.00078967,0.062005,0.011322,1.7117,3.7151,2.7074,0.27875,0.27985,0.27106,0.46583,0.20624,0.089329,0.50856,0.18426,0.073727,23.18,7.3185,15927,19925,18741,0.18165,0.16669,0.029056,0.52818,0.56656,0.043835,0.70504,0.75266,0.040987,0.80456,0.84089,0.037063,0.8795,0.90452,0.034433,0.0052492,0.0043709,0.021617,0.0092754,0.071843,-0.049574,0.012714,0.010909,0.024682,0.014935,0.095949,-0.054086,0.02252,0.019741,0.025806,0.019755,0.11843,-0.05786,0.0027954,0.0024125,0.024623,0.007859,0.050096,-0.028359,0.0067092,0.0061097,0.027168,0.011968,0.066797,-0.02519,0.012941,0.012115,0.030297,0.017334,0.084408,-0.023425,0.0013257,0.0010689,0.011367,0.0016804,0.044665,-0.028428,0.0030164,0.002426,0.01271,0.0029743,0.059037,-0.034789,0.005209,0.0041639,0.013339,0.004103,0.070952,-0.044396,0.0011282,0.00088961,0.088933,0.015722,0.036512,-0.033012,0.003041,0.0024167,0.075128,0.018155,0.047439,-0.03779,0.0048054,0.0038215,0.059269,0.018052,0.058918,-0.041408,0.37281,74,74,40,988,3,3,3,0.645
28,-0.0030196,0.014784,0.02136,-0.98925,0.0012836,-1.9483,0.96949,0.15633,2.6392,-0.024351,3.3023,0.00012616,0.47876,3.2646,0.021463,4.2421,0.004311,0.98926,0.082418,0.036004,0.025322,0.019848,0.3535,0.22747,0.34125,0.042275,0.010271,0.0053467,0.019878,0.49966,0.085793,0.0014907,40.749,708.46,2346.5,4574.9,7671.2,0.11713,0.16279,0.16279,1.2429,1.4832,0.35862,0.18393,0.017012,50,35.7,712,14314,4.3419,22.359,19224,12015,6750,0.922,0.94639,0.16805,0.11484,0.088859,0.77799,26562,15278,0.00093557,0.00040018,0,0.068315,0,0.06677,0.00068038,0.009955,0.015842,0.005462,0.43208,0.17416,0.95795,0.26981,0.29477,0.26854,0.37151,0.27989,0.12966,0.41176,0.25875,0.11084,29.507,7.2505,19897,29727,28715,0.1743,0.17093,0.043057,0.55085,0.59195,0.070604,0.79542,0.83217,0.071414,0.90528,0.92557,0.064404,0.96157,0.97026,0.058139,0.0060993,0.0051029,0.03879,0.014439,0.063072,-0.043719,0.013074,0.010963,0.039197,0.019361,0.08281,-0.058595,0.023653,0.019795,0.041858,0.026358,0.10302,-0.077694,0.0030479,0.002503,0.041461,0.011067,0.041005,-0.031006,0.0058327,0.0048324,0.036476,0.012198,0.054265,-0.040933,0.010733,0.0088739,0.038805,0.016666,0.069008,-0.055947,0.0030514,0.0025999,0.040409,0.010345,0.047515,-0.030909,0.0072355,0.0061266,0.047083,0.016629,0.061737,-0.041535,0.012852,0.010867,0.050823,0.02258,0.074498,-0.052984,0,0,0,-0.0018335,0.010237,0,5.7874e-06,4.4968e-06,0.00022081,-0.0025023,0.015553,-0.011338,6.8855e-05,5.3498e-05,0.0013115,-0.0029447,0.022006,-0.011367,0.37905,74,74,40,988,3,3,3,0.645
28,-0.0051729,0.025992,0.037573,-0.98101,0.0022246,-1.9325,0.96994,0.73608,3.3569,0.17462,3.2243,5.0631e-05,0.58567,3.0206,0.037518,3.9429,0.0040152,0.98122,0.084117,0.048982,0.040188,0.033926,0.15537,0.33476,0.42946,0.032022,0.0083531,0.006035,0.034008,0.1773,0.32695,0.11242,57.518,847.8,1341.3,1155.7,3402.9,0.22683,0.12315,0.22683,0.80965,2.3834,0.50408,0.24351,0.028528,47,59,1449,61063,4.7779,24.99,39123,25569,3186,0.92073,0.94214,0.23123,0.18692,0.075491,0.8198,60020,19289,0.0010379,0.00042609,0,0.098985,0,0.059507,0.0012463,0.0058335,0.0012353,0.012031,1.8069,2.9265,1.3757,0.25765,0.30432,0.29451,0.30334,0.31147,0.24035,0.30521,0.32652,0.27054,49.841,7.9518,28647,83186,82515,0.14804,0.10239,0.048907,0.39448,0.35886,0.067619,0.57562,0.56928,0.069113,0.6984,0.71903,0.066448,0.80145,0.82924,0.064805,0.0037887,0.0021054,0.032223,0.0076351,0.044802,-0.059697,0.0077191,0.004267,0.030949,0.009307,0.056987,-0.076026,0.012104,0.0066536,0.028647,0.0098029,0.068234,-0.091382,0.00027307,0.00013953,0.0049678,-0.0034739,0.026342,-0.02157,0.00087258,0.00044365,0.0072977,-0.0036051,0.035248,-0.031898,0.0019154,0.00098345,0.0092616,-0.0034525,0.044183,-0.04468,0.0035082,0.001962,0.062131,0.014519,0.035544,-0.056182,0.0067293,0.0037618,0.058561,0.017472,0.043419,-0.068452,0.0097478,0.0054372,0.051553,0.017944,0.049896,-0.077883,7.3723e-06,3.8719e-06,0.0012003,-0.0019624,0.010588,-0.017554,0.00011724,6.1521e-05,0.005982,-0.0018311,0.013797,-0.021429,0.00046148,0.00024333,0.011755,-0.00096996,0.017672,-0.024743,0.39008,74,74,40,988,3,3,3,0.645
28,-0.0034323,0.016517,0.024018,-0.98791,0.0011657,-1.9515,0.97543,-0.48691,3.2558,-0.093617,3.3013,5.4722e-06,0.45229,2.9167,0.023999,3.7286,0.0037969,0.98799,0.061033,0.025878,0.019233,0.015297,0.29106,0.33518,0.31439,0.033337,0.0065592,0.0039258,0.015552,0.43399,0.28057,4.475e-06,61.911,1683.2,3897.2,6873.6,12517,0.054219,0.14815,0.14815,0.58364,0.62771,0.29552,0.19365,0.018421,56,64.161,3029,1.6224e+05,7.2359,53.579,81783,3213,2970,0.91974,0.93965,0.24407,0.18174,0.1291,0.79393,59160,20130,0.0007567,0.00043249,0,0.065633,0,0.069499,0.0021777,0.013861,0.0012875,0.021292,1.2213,0.21364,0.85648,0.24403,0.30095,0.31457,0.22812,0.33595,0.34426,0.226,0.34085,0.36614,49.662,8.4933,25709,60320,59559,0.07227,0.051808,0.030015,0.23089,0.18236,0.049756,0.41884,0.35903,0.063223,0.57793,0.52164,0.069126,0.70884,0.66555,0.072057,0.026599,0.0316,0.28441,0.10947,0.13512,0.09413,0.053726,0.062623,0.27081,0.13718,0.16947,0.10739,0.085513,0.09878,0.25443,0.15913,0.19949,0.12318,0.020288,0.026454,0.46402,0.12818,0.14164,0.13018,0.03921,0.05022,0.41226,0.15001,0.16691,0.15226,0.060594,0.07689,0.36834,0.16634,0.18938,0.17502,0.0033101,0.0023969,0.073699,0.01508,0.041624,-0.051918,0.0079365,0.0059309,0.086829,0.024446,0.056272,-0.064302,0.014206,0.010936,0.094456,0.03343,0.07005,-0.073525,0.0030001,0.0027491,0.61405,0.071745,0.059352,-0.016524,0.008423,0.0078799,0.54032,0.087409,0.077831,-0.017054,0.015599,0.014911,0.49956,0.1047,0.096662,-0.015129,0.4145,74,74,40,988,3,3,3,0.645
28,-0.0027711,0.013446,0.019524,-0.99018,0.0010014,-1.9546,0.97402,-0.078038,3.1845,0.0039428,3.2796,5.3531e-05,0.53834,3.8551,0.019461,5.1464,0.0052407,0.99026,0.06287,0.031039,0.021734,0.016722,0.38285,0.23944,0.31702,0.029799,0.0090628,0.0049492,0.016874,0.53293,0.09662,0.004423,91.622,986.69,2833.2,6558.1,10470,0.32959,0.1298,0.32959,0.79686,0.99437,0.39226,0.17588,0.013852,86,45.86,2638,82125,8.6703,78.471,71226,8532,7344,0.92258,0.94402,0.18859,0.12544,0.144,0.6183,38780,19000,0.0011153,0.00049475,0,0.049888,0,0.060064,0.010948,0.041463,0.02311,0.068699,0.14565,1.7824,1.9346,0.28553,0.26747,0.26217,0.38564,0.22076,0.14061,0.40671,0.21584,0.12745,20.152,7.0787,10111,20518,18680,0.24781,0.23931,0.11949,0.57717,0.6029,0.14439,0.74304,0.77049,0.13021,0.85123,0.87083,0.1182,0.90712,0.92011,0.10705,0.011489,0.011352,0.14262,0.046017,0.08849,-0.0063217,0.022199,0.021915,0.1299,0.054327,0.11075,-0.0084425,0.03406,0.033563,0.11765,0.059696,0.13133,-0.011431,0.0028373,0.0027244,0.075335,0.01405,0.052234,-0.010516,0.0057757,0.0055344,0.070501,0.016893,0.067319,-0.014693,0.0098636,0.0094119,0.069609,0.020696,0.083672,-0.019944,0.0084906,0.0084934,0.21946,0.051082,0.070438,0.00015079,0.016113,0.016119,0.20465,0.061576,0.086509,0.00020605,0.023869,0.023873,0.18424,0.067114,0.099465,0.00011773,0.0001616,0.00013411,0.038399,0.0017333,0.019219,-0.014332,0.0004787,0.00041161,0.035649,0.0019816,0.025509,-0.014207,0.00080107,0.00070146,0.029783,0.0013852,0.031197,-0.014961,0.49892,74,74,40,988,3,3,3,0.645
28,-0.0051354,0.024789,0.035951,-0.98184,0.0018185,-1.9385,0.97438,-0.35558,6.7995,0.00069188,3.054,0.0060165,0.94107,4.9475,0.036107,8.2326,0.0083835,0.98193,0.068258,0.025648,0.021248,0.017982,0.2314,0.29179,0.40898,0.041284,0.0044596,0.0033351,0.018751,0.36603,0.25375,0.08948,31.681,3110.8,4602.1,4074,11819,0.19438,0.15694,0.19438,1.0142,2.6876,0.52807,0.24724,0.029631,38,81.763,1477,95883,3.9736,17.08,39879,34479,5427,0.92079,0.94036,0.092725,0.071453,0.019658,0.40752,25850,14293,0.0010201,0.00047852,0,0.078335,0,0.064184,0.0043084,0.027725,0.00073887,0.026461,1.8325,1.7558,0.39873,0.25591,0.27434,0.24042,0.25841,0.26146,0.1117,0.24584,0.2299,0.089911,26.559,6.4915,34794,83559,83039,0.34371,0.38977,0.11862,0.66018,0.71415,0.11822,0.84357,0.88683,0.10581,0.93498,0.95664,0.092933,0.96638,0.9775,0.081634,0.0033466,0.0022097,0.029736,0.0060272,0.050446,-0.046342,0.0071748,0.0047037,0.030053,0.0081518,0.06419,-0.060475,0.011511,0.0075739,0.028461,0.0089342,0.076,-0.070601,0.0010334,0.0006549,0.01964,0.0010141,0.0331,-0.027783,0.0021432,0.0013512,0.018726,0.00096052,0.042955,-0.034912,0.0032481,0.0020445,0.016408,-1.2055e-05,0.051789,-0.039903,0.0020503,0.001388,0.037934,0.0065849,0.035734,-0.034845,0.0045992,0.0030788,0.041813,0.010134,0.046116,-0.047184,0.0078344,0.0052583,0.043286,0.013165,0.054795,-0.056877,0.00026291,0.00016686,0.044716,0.0037397,0.016054,-0.012728,0.00043972,0.00027824,0.02344,0.0012889,0.01913,-0.014417,0.00053275,0.00033654,0.014178,-0.00053843,0.022098,-0.014856,0.4176,74,74,40,988,3,3,3,0.645
28,-0.0038275,0.019379,0.027609,-0.98608,0.0023368,-1.9295,0.95675,0.52351,5.2735,0.031387,3.2462,0.00068129,0.99697,6.0813,0.026824,9.0995,0.0092475,0.98657,0.12303,0.055647,0.03863,0.029107,0.30997,0.20356,0.36868,0.061114,0.016687,0.0095791,0.030409,0.49218,0.080417,0.034481,13.973,212.03,556.28,1589.8,2372.7,0.29327,0.20309,0.29327,1.0764,2.453,0.60984,0.20711,0.021062,97,17.588,405,3485.3,4.5235,25.234,10935,8721,6021,0.92546,0.95037,0.045077,0.027775,0.038318,0.2486,22211,13314,0.00066012,0.00033801,0,0.0393,0,0.0628,0.0070851,0.0064797,0.0034957,0.032243,0.82637,0.49285,0.87838,0.2585,0.27961,0.31223,0.33835,0.28709,0.25152,0.34668,0.287,0.24553,19.291,8.4301,5244.3,8219,5300.1,0.16982,0.17403,0.050825,0.37007,0.37871,0.057468,0.51105,0.52088,0.05559,0.65428,0.66345,0.056395,0.75681,0.76385,0.05544,0.01242,0.012218,0.095701,0.03958,0.083783,-0.01531,0.026156,0.026087,0.095009,0.05184,0.10964,-0.003301,0.043459,0.043743,0.09318,0.062878,0.13332,0.010159,0.0019042,0.001749,0.031384,0.0058079,0.044062,-0.030413,0.0046105,0.0044595,0.034933,0.0092863,0.059611,-0.01862,0.0093357,0.0092784,0.040895,0.014937,0.075588,-0.0047354,0.0087675,0.0086591,0.14067,0.041527,0.066809,-0.0093548,0.016647,0.016655,0.13125,0.050104,0.083584,0.00043873,0.025867,0.026084,0.12394,0.057677,0.098496,0.0096401,0.0017485,0.0018102,0.2579,0.034554,0.037924,0.015802,0.0050335,0.0050884,0.23268,0.043086,0.048018,0.0062637,0.0086684,0.0087352,0.20005,0.04763,0.05665,0.0052308,0.48706,74,74,40,988,3,3,3,0.645
28,-0.0029631,0.015615,0.022068,-0.98889,0.0021213,-1.9291,0.95072,0.3523,3.0167,-0.011088,3.3009,3.4674e-05,0.6531,4.4371,0.021622,5.9241,0.0060327,0.98918,0.088605,0.056718,0.04691,0.039555,0.31784,0.29672,0.30234,0.028299,0.0090509,0.0068996,0.038846,0.47071,0.22539,0.0014605,92.286,861.29,1234.5,1068.5,3257.2,0.18207,0.095166,0.18207,0.96559,2.2709,0.43038,0.18644,0.01534,68,45.529,697,13706,3.4968,16.486,18819,10989,10989,0.92179,0.94486,0.18575,0.12425,0.13268,0.71174,32925,20154,0.00069785,0.00036447,0,0.058482,0,0.061953,0.0034162,0.025895,0.0095875,0.043586,1.3204,0.63573,0.60242,0.24899,0.32213,0.28656,0.24344,0.41327,0.25,0.24171,0.42446,0.24812,32.871,7.7371,13531,24765,23006,0.079932,0.07001,0.03155,0.2534,0.23749,0.051896,0.46453,0.4618,0.066639,0.66642,0.67767,0.075755,0.82386,0.83831,0.079592,0.0044772,0.0039992,0.045497,0.011326,0.058705,-0.030621,0.0086068,0.0078469,0.04123,0.012571,0.075456,-0.033213,0.014041,0.012933,0.039704,0.01454,0.092262,-0.036674,0.0022758,0.0020567,0.049465,0.0090743,0.039502,-0.020358,0.0048218,0.0045414,0.048181,0.011516,0.052397,-0.01668,0.008376,0.0080412,0.048389,0.014481,0.066229,-0.014469,0.0021939,0.0019369,0.046423,0.007922,0.041247,-0.022686,0.0037733,0.0032964,0.039233,0.0076404,0.051284,-0.03056,0.0056379,0.0048707,0.035625,0.0077257,0.060997,-0.039208,7.543e-06,5.6236e-06,0.0014673,-0.0021443,0.016348,-0.014258,8.1111e-05,6.1161e-05,0.0049448,-0.0023838,0.02129,-0.016555,0.00021639,0.00016432,0.006586,-0.0027308,0.026618,-0.01753,0.42896,74,74,40,988,3,3,3,0.645
28,-0.0037006,0.017705,0.025803,-0.987,0.0011796,-1.9512,0.97687,0.62466,4.4706,-0.010608,3.2616,0.00018089,0.72691,4.5111,0.025913,6.0399,0.0061381,0.98703,0.072707,0.033401,0.02228,0.015809,0.25375,0.36324,0.31302,0.036615,0.010871,0.0064343,0.016071,0.37868,0.33675,7.5039e-05,47.35,573.52,1340.9,6151.7,8114.2,0.12106,0.18598,0.18598,1.6389,1.8098,0.47169,0.20245,0.019357,58,80,3374,1.9774e+05,7.1269,53.047,91098,11718,8127,0.91917,0.94036,0.24607,0.17036,0.17166,0.74656,42328,22149,0.00082143,0.00040457,0,0.054878,0,0.064469,0.0055454,0.0025739,0.001943,0.0025841,1.0508,0.25079,0.8387,0.2428,0.30871,0.29776,0.23022,0.34469,0.29066,0.22554,0.35712,0.29621,31.972,8.0396,13840,31116,29889,0.1033,0.088515,0.054085,0.33663,0.31504,0.091452,0.55641,0.54594,0.10588,0.72692,0.73119,0.10961,0.85385,0.86139,0.10942,0.0099486,0.0093553,0.13411,0.040329,0.084308,-0.024196,0.018711,0.01792,0.1189,0.045854,0.10528,-0.021636,0.029657,0.028661,0.11124,0.052269,0.12487,-0.02105,0.0067463,0.0067729,0.19452,0.043696,0.071029,0.0013101,0.012385,0.012664,0.16417,0.047521,0.084992,0.009294,0.018671,0.019335,0.14309,0.050351,0.09754,0.017282,0.0029231,0.0023763,0.082047,0.014263,0.045564,-0.043038,0.006338,0.0053233,0.087417,0.020343,0.060514,-0.049001,0.011352,0.0097526,0.095156,0.028072,0.075255,-0.055608,0.00027922,0.00020614,0.072048,0.0050799,0.024202,-0.018276,0.00061954,0.0004542,0.050102,0.003775,0.032134,-0.025572,0.0011056,0.00080775,0.044638,0.0038411,0.040422,-0.035283,0.4704,74,74,40,988,3,3,3,0.645
28,-0.0044804,0.023975,0.033642,-0.98302,0.0036265,-1.9115,0.94456,0.077407,2.8971,0.037114,3.3029,3.8132e-06,0.71056,3.9458,0.032363,5.2622,0.0053586,0.98379,0.10691,0.065352,0.052552,0.043939,0.24971,0.27952,0.37016,0.036711,0.01189,0.0081653,0.043843,0.41453,0.22947,0.057803,41.138,405.76,712.77,678.8,1839.2,0.22102,0.13146,0.22102,0.44892,2.4406,0.37139,0.22975,0.024356,40,57.35,973,35896,3.7873,16.74,26271,18846,8856,0.92292,0.94643,0.15298,0.099272,0.095851,0.75368,38410,18602,0.00070376,0.00035177,0,0.047254,0,0.08277,0.0063159,0.035973,0.0013082,0.073403,4.0058,5.7811,2.0808,0.27525,0.287,0.2963,0.41385,0.29155,0.21351,0.4353,0.28453,0.19999,35.035,8,10698,15768,13279,0.090878,0.086995,0.025796,0.27095,0.2726,0.039904,0.53412,0.54839,0.055102,0.74764,0.76747,0.061117,0.87365,0.89036,0.060697,0.0054037,0.0057712,0.039489,0.012956,0.052396,0.029496,0.010139,0.010849,0.03493,0.014111,0.070778,0.038117,0.016368,0.017535,0.033283,0.016165,0.089473,0.048039,0.0049361,0.0053586,0.077156,0.022142,0.042861,0.035542,0.0092519,0.010073,0.066483,0.02441,0.05837,0.046238,0.014704,0.016101,0.061088,0.027374,0.075305,0.060122,0.00046383,0.00040954,0.007058,-0.0021766,0.029628,-0.014481,0.00083249,0.00073308,0.0062247,-0.0032039,0.039445,-0.017593,0.001505,0.0013084,0.0068389,-0.0036025,0.048351,-0.028123,3.8567e-06,3.0358e-06,0.0005395,-0.0018886,0.014641,-0.017842,5.4908e-05,4.3221e-05,0.0024073,-0.0022487,0.019106,-0.017842,0.00015881,0.00012501,0.0034759,-0.0026412,0.024185,-0.017842,0.37409,74,74,40,988,3,3,3,0.645
28,-0.0050184,0.024543,0.035543,-0.98205,0.0019593,-1.9366,0.97205,0.79503,4.9293,0.067724,3.2348,0.0007859,0.75142,3.9676,0.035796,5.5745,0.0056766,0.98208,0.086457,0.039509,0.030045,0.023945,0.22307,0.30706,0.3876,0.042979,0.009138,0.0059797,0.024178,0.36483,0.28213,0.072271,27.578,711.51,1338.1,2303.5,4381.4,0.10664,0.15175,0.15175,0.48377,0.48443,0.23051,0.24094,0.028798,79,37.025,1254,26490,5.958,41.004,33858,17604,11880,0.92331,0.94812,0.15205,0.097159,0.12094,0.58708,30629,19699,0.00071505,0.00037805,0,0.045093,0,0.050806,0.011916,0.01361,0.011421,0.01252,2.3086,1.6639,0.68089,0.25169,0.3173,0.27837,0.26795,0.39518,0.19814,0.26962,0.40838,0.19219,28.615,7.5159,7332.4,13928,11305,0.13408,0.12454,0.058209,0.27347,0.25854,0.061598,0.4133,0.40117,0.06521,0.56837,0.56218,0.07106,0.70753,0.70492,0.075179,0.0083492,0.0077999,0.093315,0.029407,0.074191,-0.035092,0.015693,0.014656,0.082681,0.03316,0.093377,-0.045136,0.024705,0.023287,0.076831,0.037271,0.11218,-0.047357,0.0034252,0.0030557,0.081883,0.017284,0.051039,-0.040528,0.0075174,0.0068273,0.082617,0.023169,0.066216,-0.045491,0.012991,0.01209,0.082545,0.028895,0.082034,-0.042216,0.0049,0.0047216,0.11404,0.025549,0.054166,-0.013952,0.0080073,0.0076648,0.091569,0.025293,0.065489,-0.019717,0.011164,0.010651,0.077589,0.024933,0.07552,-0.024384,2.3977e-05,2.2567e-05,0.0051296,-0.0018356,0.0083865,-0.0057279,0.00016809,0.00016386,0.01127,-0.0015441,0.012659,-0.0031486,0.0005494,0.00054656,0.018391,-0.00048615,0.017551,-0.00082529,0.45905,74,74,40,988,3,3,3,0.645
