261.5216568  
269.4195485  
286.4109223  
337.4520904  
580.4112625  
1748.598451  
10250.85753  
35161.98011  
10226.88646  
40860.15025  
40451.57307  
16427.68489  
37599.6293  
86413.65275  
47496.60085  
16781.161  
4393.899545  
6877.648519  
7879.570362  
43140.16759  
4848.788372  
4772.252019  
1808.767595  
2114.735197  
14024.67417  
3428.23971  
5283.881259  
520.818509  
8577.470939  
2329.774999  
816.3447352  
3108.361529  
278.4954767  
579.3662274  
302.3629167  
776.8045324  
657.7189418  
403.8683142  
1843.528911  
1599.18257  
1040.331519  
1663.889821  
1195.140196  
1717.011361  
1967.966495  
2841.930842  
2011.527269  
359.7203217  
81.65185723  
1776.155981  
528.3165819  
3018.408456  
253.9509856  
600.6626017  
407.4433948  
615.0085123  
17.77755765  
485.6857364  
91.97494938  
99.05170085  
308.5954219  
22.16583151  
197.6181925  
10.65446042  
297.4103279  
16.98731099  
62.43636612  
0.746163582  
12.60581376  
32.84472  
23.99097619  
1.997081848  
13.2480244  
2.880462626  
5.079985515  
10.1490522  
7.124282403  
3.33486911  
3.340732989  
4.878248173  
4.855156154  
4.919339524  
3.793061214  
3.688513994  
4.059313191  
3.738863566  
3.644893399  
3.480371275  
3.215647198  
3.131210657  
3.17019415  
2.975774766  
2.968263454  
2.871614274  
2.774251553  
2.702434151  
2.607381883  
2.535592239  
2.470917943  
2.408902547  
2.31902698  
2.252404358  
2.207984795  
2.146090624  
2.096282796  
2.041097443  
1.994762801  
1.949540857  
1.907778078  
1.859148985  
1.817848141  
1.780356001  
1.739945517  
1.702892501  
1.665379589  
1.632232513  
1.598072189  
1.565775707  
1.533943782  
1.504487559  
1.474561716  
1.446152778  
1.418901449  
1.392107145  
1.366257959  
1.340954431  
1.316951834  
1.293180408  
1.27047771  
1.248189241  
1.226669936  
1.205668174  
1.185375647  
1.16546464  
1.146263978  
1.127530076  
1.109302011  
1.091528944  
1.07427672  
1.057462169  
1.041066163  
1.025090883  
1.009513898  
0.9943439675  
0.979536099  
0.9651110715  
0.9510238226  
0.9372871082  
0.9238721642  
0.9107751351  
0.898000098  
0.8855073357  
0.8733007098  
0.8613821123  
0.8497340804  
0.8383559366  
0.8272255324  
0.8163405103  
0.8057034101  
0.795289986  
0.7851038579  
0.7751429561  
0.7653835308  
0.7558430467  
0.7464908162  
0.7373315184  
0.7283728305  
0.7196023469  
0.7110008236  
0.702573855  
0.6943186177  
0.6862353837  
0.6783007972  
0.6705192467  
0.6628942003  
0.6554224176  
0.6480901271  
0.6408996544  
0.6338540456  
0.6269275357  
0.6201345932  
0.6134677287  
0.6069311052  
0.6005077936  
0.5941972567  
0.5880167817  
0.5819382121  
0.5759612966  
0.5701112422  
0.5643519507  
0.5586967905  
0.5531345409  
0.5476783238  
0.5423074024  
0.537033277  
0.5318558594  
0.5267617606  
0.521749363  
0.5168207092  
0.5119782343  
0.5072170293  
0.5025386324  
0.4979234096  
0.4933991642  
0.4889416462  
0.4845574464  
0.480241827  
0.4759977443  
0.4718216776  
0.4677106557  
0.4636631104  
0.459675403  
0.4557660721  
0.4518941035  
0.4481036124  
0.4443580707  
0.4406743476  
0.4370478759  
0.4334701082  
0.4299510033  
0.4264839921  
0.4230683257  
0.4197085831  
0.4163856707  
0.4131236071  
0.4099079372  
0.4067367173  
0.4036120727  
0.4005304351  
0.3974954739  
0.394502661  
0.3915535223  
0.3886554466  
0.3857852738  
0.3829588288  
0.3801752017  
0.3774261774  
0.3747178798  
0.3720480078  
0.3694137236  
0.366812872  
0.3642564555  
0.3617293201  
0.3592330216  
0.3567773055  
0.354345697  
0.3519569347  
0.3496004524  
0.347266654  
0.3449690873  
0.3427068898  
0.3404690399  
0.3382587793  
0.3360719142  
0.3339288544  
0.3317980707  
0.3297064413  
0.3276417849  
0.3255983801  
0.3235900866  
0.3215910751  
0.3196291612  
0.3176908101  
0.3157762045  
0.3138876796  
0.3120191835  
0.310180275  
0.3083553865  
0.3065578191  
0.3047896725  
0.3030286236  
0.3013008013  
0.2995903477  
0.2979054038  
0.2962388732  
0.294589741  
0.2929613863  
0.2913557841  
0.289762234  
0.2881964386  
0.2866426647  
0.2851183682  
0.283613061  
0.2821106988  
0.2806359417  
0.2791751984  
0.2777322643  
0.2763046582  
0.2749002731  
0.2735106326  
0.2721362047  
0.2707766263  
0.269438056  
0.2681049598  
0.2667978565  
0.2655052117  
0.2642246931  
0.2629639289  
0.2617034275  
0.2604737507  
0.2592497975  
0.2580409928  
0.2568486526  
0.2556687151  
0.2545016182  
0.2533493864  
0.2522105784  
0.2510838158  
0.2499688819  
0.2488650878  
0.2477822147  
0.2467001039  
0.2456376757  
0.2445886052  
0.2435515887  
0.2425210023  
0.2415020904  
0.2404998093  
0.2395024924  
0.2385271852  
0.2375528359  
0.2365929374  
0.2356435184  
0.2347008741  
0.2337798617  
0.2328586866  
0.231951855  
0.2310556158  
0.2301679676  
0.2292906398  
0.2284280476  
0.2275691936  
0.2267201212  
0.2258829745  
0.2250511266  
0.2242360088  
0.2234231392  
0.2226234733  
0.221833166  
0.2210468527  
0.2202788203  
0.2195057726  
0.2187492535  
0.2180003858  
0.2172599507  
0.2165298581  
0.2158103043  
0.2150941928  
0.2143863205  
0.2136874268  
0.2129939299  
0.2123121465  
0.2116367586  
0.2109681717  
0.2103081424  
0.2096552655  
0.2090089763  
0.2083688751  
0.2077396413  
0.2071148225  
0.2065026661  
0.205892907  
0.2052843965  
0.2046920518  
0.2041055804  
0.2035233672  
0.2029450965  
0.202382491  
0.2018215321  
0.2012616105  
0.2007165931  
0.2001753301  
0.1996390417  
0.199112865  
0.1985855993  
0.1980679207  
0.1975584061  
0.1970586967  
0.196556394  
0.1960634073  
0.1955786302  
0.1950971284  
0.1946221371  
0.1941470832  
0.1936907868  
0.1932293893  
0.1927853096  
0.1923349596  
0.1918943573  
0.1914589906  
0.1910286699  
0.1906118074  
0.1901894727  
0.1897750044  
0.1893694686  
0.1889650353  
0.1885611074  
0.188175869  
0.1877873146  
0.1874038521  
0.1870274467  
0.1866548698  
0.1862862836  
0.1859241046  
0.1855667396  
0.1852170852  
0.1848718788  
0.1845270924  
0.1841910144  
0.1838573356  
0.1835293575  
0.1832031248  
0.1828871471  
0.182574507  
0.1822653344  
0.1819616009  
0.1816572585  
0.1813631679  
0.1810723231  
0.1807853991  
0.1805028475  
0.1802290668  
0.179951651  
0.179682795  
0.1794135128  
0.1791566085  
0.178898589  
0.1786499231  
0.1784030429  
0.1781555013  
0.1779170499  
0.1776858579  
0.1774526408  
0.1772288091  
0.1769997613  
0.1767887258  
0.1765734267  
0.1763638267  
0.1761538064  
0.1759527512  
0.1757562174  
0.1755624877  
0.1753708107  
0.175183196  
0.1750025908  
0.1748228806  
0.1746526635  
0.174477376  
0.1743094092  
0.1741457284  
0.1739894438  
0.1738339335  
0.1736851933  
0.1735390918  
0.173389055  
0.1732566421  
0.1731148157  
0.1729844361  
0.1728585652  
0.1727327601  
0.1726079326  
0.1724925953  
0.17238365  
0.1722693858  
0.1721632182  
0.1720640083  
0.1719647436  
0.1718623481  
0.1717705251  
0.1716883593  
0.1716016148  
0.1715194321  
0.1714461619  
0.1713716278  
0.1713005424  
0.1712343806  
0.1711722123  
0.1711177458  
0.1710585327  
0.1710119251  
0.1709625707  
0.1709174049  
0.1708775276  
0.1708385907  
0.1708022334  
0.1707752113  
0.1707463425  
0.1707231751  
0.1707057243  
0.1706894175  
0.1706769626  
0.1706640864  
0.1706628831  
0.1706602851  
