196.7028135  
212.4037478  
250.6714963  
358.5670816  
636.5472389  
151.1620318  
18418.14905  
8176.423266  
4557.102012  
61671.15106  
27276.0882  
19543.66975  
12236.43881  
24772.34652  
10936.83447  
11051.55444  
287.7086852  
23281.31365  
14983.77583  
15070.53954  
10021.65407  
13766.23239  
8171.039939  
2044.863259  
12375.42653  
11310.28246  
14180.45083  
4530.811375  
8402.540494  
7023.371744  
4800.22604  
4697.022115  
2808.554536  
4959.696487  
6102.348325  
4927.932719  
3307.471122  
6155.659469  
4369.053134  
11330.23532  
1873.630494  
6.878681515  
6575.0665  
17.02029554  
1661.108749  
9767.723539  
1459.902983  
829.4003451  
14354.13443  
1724.317485  
251.2932469  
13110.61602  
3182.395637  
351.146316  
7593.150729  
10609.4077  
496.9864856  
1066.430603  
5155.162171  
275.4224845  
798.2096585  
4289.944851  
850.074475  
107.8245116  
857.7089586  
143.2538445  
0.7464760126  
379.7391606  
15.67274816  
56.84730425  
122.6625759  
75.04975226  
49.08415931  
23.38527236  
19.301376  
0.2976161  
13.47890891  
8.586894915  
2.016472582  
0.5852432624  
2.634090354  
0.2510563507  
0.2611748096  
0.3650518043  
0.2809073616  
0.3380010368  
0.3272748509  
0.3521351417  
0.6286578775  
0.3300526359  
0.5112765674  
0.5925128879  
0.4956388723  
0.4116790467  
0.5345152882  
0.465081573  
0.4896548784  
0.4268186714  
0.4187978955  
0.4195124913  
0.397874798  
0.3817131016  
0.4020922643  
0.3703661932  
0.3713892517  
0.3716550777  
0.3624080435  
0.3571971846  
0.3546819959  
0.3493546887  
0.3480217466  
0.337531461  
0.3313390058  
0.3288392345  
0.3227402605  
0.3157055118  
0.3115023072  
0.3058175548  
0.3006542134  
0.2955108524  
0.2905621376  
0.2862917251  
0.2813148924  
0.2765614022  
0.2725983145  
0.2683742951  
0.2641744326  
0.2605580224  
0.2564356441  
0.2526106729  
0.2490387419  
0.2452637685  
0.2416585962  
0.2381619929  
0.234622199  
0.2313849475  
0.2280782061  
0.2247935641  
0.2216837048  
0.2186030391  
0.2155428815  
0.212645255  
0.2097512466  
0.2069163031  
0.2041898007  
0.2014806364  
0.198852573  
0.196268499  
0.1937244489  
0.1912710498  
0.1888353741  
0.1864410706  
0.1841234188  
0.1818365976  
0.1796122181  
0.177399587  
0.1752486358  
0.1731421151  
0.1710740858  
0.1690514036  
0.1670531118  
0.1651046253  
0.1632022076  
0.1613223282  
0.1594851121  
0.1576788368  
0.1559144634  
0.1541681479  
0.1524533395  
0.1507879974  
0.1491348971  
0.1475209377  
0.1459491355  
0.1443898696  
0.1428436685  
0.1413539162  
0.1398723265  
0.138426117  
0.1370052599  
0.1356023186  
0.1342245396  
0.1328770924  
0.1315515971  
0.1302428107  
0.128958635  
0.1276889564  
0.1264508423  
0.1252355923  
0.1240316768  
0.1228597017  
0.1216870976  
0.1205365972  
0.1194287663  
0.1183192802  
0.1172461327  
0.1161587519  
0.1151074061  
0.1140755936  
0.113054385  
0.11204328  
0.1110595549  
0.1100858257  
0.1091295198  
0.1081929985  
0.107257673  
0.1063439061  
0.1054506178  
0.1045552377  
0.1036818004  
0.1028202949  
0.1019765141  
0.1011428287  
0.1003224613  
0.09950993583  
0.09871143188  
0.09792340586  
0.0971529684  
0.09637848011  
0.09563303034  
0.09488706087  
0.0941541297  
0.09344067606  
0.09272490753  
0.09202004714  
0.09133361083  
0.09065119875  
0.08997634127  
0.08931065029  
0.0886613706  
0.08801656189  
0.08738055852  
0.08675525437  
0.08613655535  
0.08553069498  
0.08492740273  
0.08432500737  
0.08374200296  
0.08316561993  
0.08259373955  
0.08203338486  
0.08147313426  
0.08093216287  
0.08038482386  
0.07985356778  
0.07932390901  
0.078808557  
0.07829703933  
0.0777942074  
0.07728968836  
0.07679900697  
0.07630946359  
0.0758217841  
0.07534896018  
0.07488587555  
0.07441861732  
0.07396447416  
0.07350589266  
0.07306574996  
0.07262596031  
0.07219482417  
0.07176311556  
0.07133732511  
0.0709199484  
0.07051140248  
0.07009157318  
0.06969053002  
0.0692955261  
0.06889175842  
0.06851247803  
0.0681287357  
0.06774789277  
0.06737755513  
0.06699750607  
0.06663557574  
0.06627172105  
0.06591677262  
0.06556585771  
0.065215875  
0.06487613286  
0.06452891153  
0.06419022584  
0.06385933238  
0.06352960162  
0.06320485945  
0.06287960452  
0.06256571666  
0.06225282999  
0.0619362947  
0.06163769113  
0.06133247837  
0.06103489982  
0.06073914275  
0.06044488011  
0.0601525212  
0.059863904  
0.05958252289  
0.05930553192  
0.05902588675  
0.05875077644  
0.05848511801  
0.05821709326  
0.05795472975  
0.05769280144  
0.05743995002  
0.05717472273  
0.0569310629  
0.05667464123  
0.05643276326  
0.05618731804  
0.0559466473  
0.05571394954  
0.05547151929  
0.05523779909  
0.05501321621  
0.05477608815  
0.05455743158  
0.05433096804  
0.05410901181  
0.05389060627  
0.05367416921  
0.05346574806  
0.05325132414  
0.05304375675  
0.05283586305  
0.0526376687  
0.05243451268  
0.05223196209  
0.05204209837  
0.05184187206  
0.05164799926  
0.05145631654  
0.0512680336  
0.0510787627  
0.05089971877  
0.05072142226  
0.05053409919  
0.05035609092  
0.05017821843  
0.0500038892  
0.0498323339  
0.04966066308  
0.04949050503  
0.04932862273  
0.04916052334  
0.04899288979  
0.04883471646  
0.04868084071  
0.04852099135  
0.04836194069  
0.04820879502  
0.04805476884  
0.04790671298  
0.04775693189  
0.0476082487  
0.04746074725  
0.04731937181  
0.04718162944  
0.04704145329  
0.04689430461  
0.04675922184  
0.04663112871  
0.04648655448  
0.04635332511  
0.04622122456  
0.04609430583  
0.04596576136  
0.04583874379  
0.04571180497  
0.04558590218  
0.04546601607  
0.04534607019  
0.04522390371  
0.04510918635  
0.04499080417  
0.04487737871  
0.04475808346  
0.04464577349  
0.04453265908  
0.04442224137  
0.04431051903  
0.04420709958  
0.04410132383  
0.04399161162  
0.043891326  
0.0437855829  
0.04368434526  
0.04358658903  
0.04349121038  
0.04339582203  
0.04328917239  
0.04319918561  
0.04311188726  
0.04301647521  
0.04291863615  
0.04282922206  
0.04273859346  
0.04264924092  
0.04256733605  
0.0424775211  
0.04239840532  
0.0423103921  
0.04222317216  
0.04214713184  
0.04206506967  
0.04198861474  
0.04190916499  
0.04183212058  
0.04175750854  
0.04167505631  
0.04160903338  
0.04153174299  
0.04145914586  
0.0413929114  
0.04132432439  
0.04125624513  
0.04118412599  
0.04112019361  
0.04104892797  
0.04098800948  
0.04092383516  
0.04086299807  
0.04079980286  
0.04073852645  
0.04067822836  
0.04062147725  
0.0405635492  
0.04050794175  
0.04045181549  
0.04039115184  
0.04033819232  
0.04028807874  
0.04023214574  
0.04018287187  
0.04013295681  
0.04008732444  
0.0400347441  
0.03998638191  
0.03994038612  
0.03989678632  
0.0398467081  
0.03980816451  
0.03975990219  
0.0397197865  
0.0396853707  
0.03963576688  
0.03959586225  
0.0395609884  
0.03952551577  
0.03948446897  
0.03944848165  
0.03940776501  
0.03937907038  
0.03934375482  
0.0393084998  
0.03928098334  
0.03924690506  
0.03921869058  
0.03918876916  
0.03915909644  
0.03913307004  
0.03910825752  
0.03908432069  
0.03905380347  
0.03903347753  
0.03900632377  
0.03898339158  
0.03896400452  
0.0389406909  
0.03892385205  
0.03889910141  
0.03888039944  
0.03886202208  
0.03884589658  
0.03882696821  
0.03881264296  
0.03880193616  
0.03878529758  
0.0387771174  
0.03876090092  
0.03875168151  
0.03873649465  
0.03872715653  
0.03871921803  
0.03871585504  
0.03870503845  
0.03869537682  
0.03869014936  
0.03868744332  
0.03868474707  
0.03868230522  
0.03867856626  
0.03867329712  
0.03867365536  
0.03867133299  
