76.18538164  
89.99906072  
112.7540602  
134.206143  
585.6836187  
2941.837203  
23686.29409  
3299.349848  
51771.34528  
8635.690063  
29904.89096  
6736.843367  
40173.82504  
33795.41998  
5002.196045  
3317.254935  
15322.13891  
7337.500883  
14727.58711  
3205.629181  
3993.663083  
18079.88626  
6011.776083  
12665.98358  
9125.794073  
20604.72126  
20231.53856  
8715.943371  
15036.08939  
608.2209227  
8708.104308  
12231.10484  
13996.82282  
2303.998132  
6943.82823  
1464.716816  
73.11787812  
1525.754571  
1761.282156  
1901.000843  
2363.002123  
12476.04626  
4980.828816  
3851.838581  
4184.322654  
997.4103716  
3352.06085  
182.2571255  
12603.25897  
65.97989692  
8932.387659  
2901.433583  
881.7662824  
24.58244926  
624.1691803  
1680.962699  
2369.847627  
3372.140323  
1049.764611  
1170.17365  
276.6222296  
375.2208829  
727.8648574  
133.9303092  
344.1043159  
201.231887  
108.4958037  
76.97915739  
13.80553511  
7.390329714  
40.35809696  
19.3003803  
28.96067751  
5.347947892  
21.27498525  
6.071433256  
7.439619361  
12.19482731  
9.237658409  
3.791386058  
4.887682306  
3.834191411  
5.23893437  
4.376411347  
4.487428185  
4.147772406  
3.593980999  
3.488870686  
3.70076068  
3.439584579  
3.438193262  
3.20197497  
3.116153747  
3.012456627  
2.930830335  
2.903183229  
2.762925785  
2.645894345  
2.568387372  
2.494417257  
2.41864438  
2.345336285  
2.284625359  
2.222866765  
2.159626453  
2.114595406  
2.05773568  
2.005759139  
1.956707733  
1.911503678  
1.866338813  
1.822638302  
1.784337572  
1.745117023  
1.70403481  
1.669502427  
1.632477532  
1.598345057  
1.5657197  
1.534235923  
1.503559724  
1.473757746  
1.445464865  
1.41758104  
1.390898457  
1.365063653  
1.339949584  
1.315749465  
1.291976887  
1.269253412  
1.247160031  
1.225697903  
1.204815975  
1.184602459  
1.164849614  
1.145679136  
1.1271253  
1.109019787  
1.091411484  
1.074243684  
1.057585234  
1.041322932  
1.025552869  
1.010127479  
0.9951067299  
0.9804618185  
0.966158317  
0.9522416758  
0.938650313  
0.9253791706  
0.9124308213  
0.8997872045  
0.887436787  
0.8753797996  
0.8636150353  
0.8521185595  
0.8408540827  
0.8298561537  
0.8191125425  
0.8085903123  
0.7982983778  
0.7882377716  
0.7783972914  
0.7687579866  
0.7593219207  
0.7500731457  
0.7410332482  
0.7321941226  
0.7234993305  
0.7149955239  
0.7066736182  
0.6985025963  
0.6905038096  
0.6826573174  
0.6749851717  
0.667426846  
0.6600241849  
0.652781194  
0.6456641184  
0.638687113  
0.6318358283  
0.6251151125  
0.6185045736  
0.6120296305  
0.6056633674  
0.5994352964  
0.5932960729  
0.5872740147  
0.5813550331  
0.5755424479  
0.5698427589  
0.5642335721  
0.5587258879  
0.5533070204  
0.5479824876  
0.5427429858  
0.5376034828  
0.5325422524  
0.5275811337  
0.5226873639  
0.517881762  
0.5131430271  
0.5085063499  
0.5039234503  
0.4994117761  
0.494994336  
0.4906223927  
0.4863447983  
0.4821182989  
0.4779588936  
0.4738590664  
0.469839467  
0.4658674511  
0.4619660221  
0.4581145753  
0.4543543972  
0.4506172943  
0.4469521949  
0.4433335784  
0.4397734141  
0.4362494489  
0.4328082653  
0.4294011037  
0.4260413693  
0.4227458186  
0.4194813977  
0.4162812843  
0.413121645  
0.4099911937  
0.4069284579  
0.4038924625  
0.4009072688  
0.3979632492  
0.3950602267  
0.39219527  
0.3893749838  
0.3865946025  
0.3838529942  
0.3811442389  
0.3784711987  
0.3758364227  
0.373232327  
0.3706867998  
0.3681431323  
0.3656492199  
0.3631979804  
0.3607731612  
0.358372572  
0.3560174937  
0.353676646  
0.3513850269  
0.3491109057  
0.3468688016  
0.3446472779  
0.342463243  
0.340316874  
0.3381886443  
0.3360871848  
0.334014007  
0.3319635916  
0.3299489551  
0.3279578414  
0.3259984511  
0.3240280733  
0.3221092146  
0.3202251044  
0.3183547019  
0.316494407  
0.3146758397  
0.3128636912  
0.3110906885  
0.3093253575  
0.3075815587  
0.3058679877  
0.304168005  
0.30250209  
0.300836138  
0.2992102787  
0.297595867  
0.2959901944  
0.2944201766  
0.2928701553  
0.2913307875  
0.2898054068  
0.2882965744  
0.2868203067  
0.2853496811  
0.2839010726  
0.2824646881  
0.2810495319  
0.2796534994  
0.2782685839  
0.2769002666  
0.2755486073  
0.2742153468  
0.2728962533  
0.2715979466  
0.270305929  
0.269031653  
0.2677722974  
0.2665263229  
0.2653061137  
0.2640765742  
0.2628712725  
0.2616852847  
0.260512794  
0.2593515601  
0.2582016263  
0.2570672626  
0.2559479769  
0.2548351899  
0.2537422633  
0.2526507893  
0.2515829167  
0.2505213386  
0.2494650659  
0.2484373528  
0.2474204454  
0.2463979406  
0.2454049701  
0.2444093333  
0.2434257759  
0.2424601445  
0.2414988659  
0.240556091  
0.2396151787  
0.2386977139  
0.2377787916  
0.2368695263  
0.2359770822  
0.2350938901  
0.2342174616  
0.2333586203  
0.2324999811  
0.2316447049  
0.2308182546  
0.2299863901  
0.2291662322  
0.2283562803  
0.2275602522  
0.2267691705  
0.2259911997  
0.2252159482  
0.2244549333  
0.2236960797  
0.222940381  
0.2222125872  
0.2214823098  
0.2207528399  
0.2200451631  
0.2193378682  
0.2186426979  
0.2179489242  
0.2172651103  
0.216585944  
0.2159264456  
0.2152669963  
0.2146127971  
0.2139680664  
0.2133320355  
0.2126976148  
0.2120796106  
0.2114664946  
0.2108522374  
0.2102505639  
0.209662988  
0.2090771072  
0.2084896805  
0.2079129169  
0.2073460629  
0.2067878468  
0.2062464714  
0.2056849809  
0.2051470362  
0.2046145861  
0.2040816319  
0.203562276  
0.2030543971  
0.2025328125  
0.2020320219  
0.2015354159  
0.2010526845  
0.2005573862  
0.2000788119  
0.1996034101  
0.1991351545  
0.1986788695  
0.1982248488  
0.197766705  
0.1973227991  
0.196888362  
0.1964545151  
0.1960211805  
0.1955975993  
0.1951820845  
0.1947669708  
0.1943659348  
0.1939505624  
0.1935697684  
0.1931782161  
0.1927880077  
0.1924033382  
0.1920275394  
0.1916636198  
0.1912949568  
0.1909328627  
0.1905829505  
0.1902272524  
0.1898809324  
0.1895409828  
0.1892058525  
0.1888769683  
0.1885502571  
0.1882259094  
0.1879059642  
0.1876043812  
0.1872895469  
0.1869890142  
0.1866980667  
0.1863913701  
0.18610845  
0.1858279929  
0.1855441121  
0.1852693662  
0.1849994574  
0.1847327627  
0.1844692023  
0.1842073791  
0.1839573341  
0.1837047019  
0.1834624323  
0.1832144546  
0.1829822627  
0.1827526312  
0.1825221082  
0.1823018395  
0.1820795093  
0.1818710999  
0.1816534257  
0.1814515965  
0.1812490584  
0.1810519937  
0.1808518867  
0.1806669404  
0.1804697795  
0.1802865961  
0.1801131244  
0.1799426337  
0.1797623996  
0.1796022151  
0.1794404265  
0.1792826552  
0.1791234661  
0.1789706413  
0.1788261945  
0.1786835106  
0.1785516036  
0.178410208  
0.1782793561  
0.1781439157  
0.1780344435  
0.1779054356  
0.1777848808  
0.1776721455  
0.1775699036  
0.1774602867  
0.1773549272  
0.1772698154  
0.1771725626  
0.1770812184  
0.1770049303  
0.1769206623  
0.1768299838  
0.1767610423  
0.1766846771  
0.1766174742  
0.1765641746  
0.1764922247  
0.1764379764  
0.1763855783  
0.1763377516  
0.176290652  
0.1762505188  
0.1762081721  
0.1761764563  
0.176145788  
0.1761214404  
0.1760916276  
0.1760716519  
0.1760559658  
0.1760453194  
0.1760352629  
0.1760385685  
0.1760373514  
