511.7407769  
519.3148159  
552.4304765  
617.5094983  
351.4850918  
9827.586554  
7230.991373  
48010.6252  
2318.538089  
16068.33847  
22484.95853  
1466.817451  
45714.47861  
9979.938487  
17864.1735  
83304.69925  
4596.269264  
13471.89111  
2084.229676  
24444.97987  
11946.53793  
3940.830712  
21879.31501  
29089.48927  
3474.727233  
11284.83532  
1612.087672  
99.78322356  
776.2514442  
6447.949346  
1312.572966  
10712.62076  
4301.574926  
1869.999012  
5493.506771  
3208.440612  
3689.850477  
3571.697043  
6704.66929  
2774.086989  
7336.689553  
73.27913382  
468.4109939  
62.16633579  
3353.373832  
191.2390075  
535.621784  
281.9720962  
3381.182679  
1329.968213  
1751.080455  
5828.948555  
3039.789549  
2687.414654  
2934.772252  
405.217855  
1940.895083  
385.0934556  
2474.378903  
678.2468854  
717.9962804  
149.0975257  
277.552219  
435.5347841  
665.0248696  
164.5748496  
7.001624786  
30.81828838  
191.8754296  
13.08120764  
3.265469881  
59.88791394  
5.103756198  
10.97874487  
2.22105819  
7.895022697  
7.01589622  
0.3760311886  
0.5043226591  
2.171834535  
2.291457741  
4.573423479  
2.473766915  
3.495629821  
2.306133595  
2.568305323  
1.783817188  
1.982598968  
1.801612235  
1.571764717  
1.886715516  
1.729088607  
1.489706349  
1.374098695  
1.198412644  
1.240371272  
1.167748793  
1.18293685  
1.084425333  
1.063215063  
1.047057619  
1.026655503  
0.973641517  
0.9308168946  
0.8922296504  
0.8508899688  
0.8306156582  
0.8030224485  
0.7681570339  
0.7399034465  
0.7123416643  
0.6828516966  
0.6633818072  
0.6427511631  
0.6166416882  
0.5938579077  
0.576026594  
0.5553601491  
0.5381972798  
0.5202419862  
0.504311935  
0.4866815568  
0.4705463279  
0.4571448363  
0.44244579  
0.4286584931  
0.4157101629  
0.4026655902  
0.3898398505  
0.3783947936  
0.36722648  
0.3562132134  
0.34583072  
0.3355010453  
0.3255090533  
0.3163966951  
0.3071917617  
0.2985553541  
0.2902648217  
0.2820330312  
0.2741031806  
0.2666273278  
0.2593007112  
0.2522235963  
0.2454513836  
0.2388767436  
0.2325115069  
0.2263902403  
0.2203984584  
0.2146736156  
0.2091337254  
0.2037534355  
0.1985389223  
0.1935174326  
0.1886525559  
0.1839441389  
0.1793791084  
0.1749553743  
0.1706725038  
0.1665237224  
0.1625056382  
0.1586051823  
0.1548240868  
0.1511649425  
0.1476112115  
0.1441539872  
0.1408057261  
0.137563104  
0.1344068303  
0.1313498418  
0.1283730943  
0.1254857937  
0.1226828166  
0.1199618089  
0.1173167688  
0.1147389726  
0.1122412955  
0.1098101485  
0.1074468782  
0.1051487443  
0.102913541  
0.1007424746  
0.09862999357  
0.09656436549  
0.09456383807  
0.09261260159  
0.09071541634  
0.08886526819  
0.08706735517  
0.08531115288  
0.08360318141  
0.08193781372  
0.08031811664  
0.07873693225  
0.07719868859  
0.07569503377  
0.07423482492  
0.07280809607  
0.07141728898  
0.07005980647  
0.0687375183  
0.06744469315  
0.06618492696  
0.06495450137  
0.06375636643  
0.06258410318  
0.06144349393  
0.06032485273  
0.05923518913  
0.05817213194  
0.05713231552  
0.05611925533  
0.05512571806  
0.0541575705  
0.05321515218  
0.052290352  
0.05138412749  
0.05050227542  
0.04963971248  
0.04879373016  
0.04796998888  
0.04716282171  
0.04637458672  
0.04560154107  
0.04484830181  
0.04410815182  
0.04338688013  
0.04268092408  
0.04198948219  
0.04131401091  
0.04065215385  
0.04000683045  
0.03936988538  
0.03875101769  
0.03813933245  
0.03754513426  
0.03696345955  
0.036392735  
0.03583434484  
0.03528371321  
0.03474916264  
0.03422406745  
0.03370801346  
0.03320433613  
0.03271080108  
0.03222691954  
0.03175222436  
0.03128548747  
0.0308303774  
0.03038322455  
0.029946111  
0.02951432108  
0.02909374254  
0.02868220618  
0.02827736534  
0.02787740742  
0.0274898724  
0.0271062832  
0.02673233816  
0.02636313129  
0.02600179471  
0.02564834769  
0.02530234856  
0.02496124489  
0.0246264752  
0.02429642068  
0.02397519744  
0.02365798876  
0.02334759317  
0.0230416356  
0.02274376499  
0.02245038618  
0.0221598292  
0.02187608576  
0.02159813976  
0.02132436876  
0.02105613529  
0.02079233572  
0.02053512668  
0.0202787954  
0.02002895013  
0.01978328357  
0.01954352668  
0.01930544001  
0.01907222176  
0.01884229076  
0.01861988754  
0.01839627148  
0.01818053893  
0.01796546381  
0.01775651629  
0.01755004389  
0.0173458818  
0.01714763836  
0.01695134309  
0.01676000062  
0.01656868901  
0.01638298935  
0.01619975547  
0.01601842664  
0.0158417087  
0.01566646623  
0.01549420437  
0.01532483705  
0.01515867002  
0.01499790033  
0.01483647988  
0.01467947618  
0.01452354689  
0.01436954503  
0.01422002625  
0.01407270972  
0.01392496779  
0.01378320155  
0.01364197889  
0.01350269081  
0.01336519842  
0.01322964213  
0.01309925822  
0.01296858642  
0.01284016187  
0.01271322033  
0.01259030131  
0.01246756308  
0.01234722228  
0.01222746422  
0.01211322091  
0.01199638483  
0.01188447636  
0.01177252068  
0.01166210844  
0.01155399254  
0.01144985157  
0.01134604454  
0.01124192842  
0.01113982546  
0.01103959843  
0.01094076358  
0.01084555152  
0.01074887477  
0.01065492061  
0.0105629201  
0.01047118724  
0.01038116525  
0.01029378958  
0.01020549005  
0.01012009187  
0.01003549875  
0.009952169683  
0.00987045881  
0.009789122225  
0.009709343425  
0.009631986812  
0.009554871889  
0.009479093014  
0.009402958678  
0.009329782971  
0.009257282782  
0.009185202223  
0.00911409297  
0.009043664851  
0.008975982017  
0.008908761737  
0.008842749888  
0.008777079708  
0.008712843161  
0.00864796002  
0.008585772918  
0.008523860302  
0.008463951055  
0.008405347968  
0.008345413994  
0.008287126611  
0.0082305054  
0.008172508677  
0.008117102857  
0.008062968377  
0.008009250635  
0.007956871481  
0.007903479303  
0.007852529213  
0.007801917765  
0.007751027218  
0.007702207341  
0.007653518808  
0.007605340954  
0.00755850889  
0.007512438964  
0.007468133455  
0.007421164059  
0.007377095856  
0.007334341963  
0.007290604507  
0.007249755925  
0.0072075483  
0.007166443502  
0.007125771351  
0.007086446277  
0.007047059373  
0.007009150839  
0.006971373074  
0.006933819523  
0.006898012248  
0.006860080554  
0.006825311505  
0.006791008353  
0.006756553637  
0.00672228688  
0.006688924031  
0.006656288757  
0.0066240123  
0.006593122312  
0.006560796819  
0.006530080042  
0.006500493449  
0.006470431926  
0.006440773314  
0.006413555284  
0.006384862493  
0.006357237246  
0.00632920682  
0.006303351757  
0.006276167283  
0.00625183562  
0.00622514373  
0.006200907569  
0.006176692281  
0.006152813328  
0.006129961238  
0.006106356786  
0.006083716556  
0.006060769151  
0.006038912562  
0.006018096563  
0.005996927979  
0.005977725141  
0.005957478203  
0.005937628346  
0.00591721178  
0.005898225931  
0.00587950563  
0.005861639073  
0.005844736328  
0.005827667457  
0.005810427262  
0.005793301511  
0.005777742337  
0.005761962576  
0.005746622863  
0.005731985496  
0.005717202984  
0.005702013453  
0.005689078008  
0.005675272343  
0.005662339193  
0.005649164224  
0.005637300048  
0.005624213094  
0.005613894255  
0.005600970545  
0.005590305686  
0.005579822616  
0.005569937788  
0.005559708429  
0.005549955715  
0.005541221507  
0.005531884142  
0.005523307446  
0.005515143634  
0.005507245992  
0.005499420013  
0.005492105106  
0.005484993663  
0.005478217029  
0.005471870764  
0.005466420895  
0.005460472806  
0.005454778375  
0.005449522945  
0.005445183075  
0.005441373038  
0.005437650456  
0.005433298395  
0.005430759509  
0.005428100017  
0.005424744544  
0.00542243827  
0.005420119191  
0.005418495931  
0.005416471157  
0.005415537027  
0.005414969313  
0.005414394977  
0.005415075968  
