0.01723436212  
0.1329449268  
0.2144366188  
0.2308736232  
0.1638463061  
0.01163453257  
-0.2091390253  
-0.4647993879  
-0.7087589614  
-0.8879776529  
-0.950859731  
-0.8554497021  
-0.5767087238  
-0.1117418388  
0.5178907091  
1.267238219  
2.072374717  
2.857640905  
3.544750936  
4.062513181  
4.35579886  
4.392494173  
4.167464776  
3.702998184  
3.045704733  
2.260364746  
1.421629077  
0.6047528838  
-0.1233616661  
-0.7116349724  
-1.129860243  
-1.370775729  
-1.449019651  
-1.397254345  
-1.260105011  
-1.08681926  
-0.9236879329  
-0.807257012  
-0.7592258517  
-0.7836802274  
-0.8669844017  
-0.9803023205  
-1.084365852  
-1.135812793  
-1.094204683  
-0.9287406114  
-0.6237152104  
-0.1819307746  
0.3744505018  
1.005782273  
1.65931521  
2.275505241  
2.795380162  
3.167935288  
3.356518841  
3.34331413  
3.131313036  
2.743551088  
2.219782002  
1.611139978  
0.9736085398  
0.3612510991  
-0.179859697  
-0.616238506  
-0.9295965585  
-1.117275685  
-1.190644682  
-1.171868842  
-1.08966056  
-0.9746977946  
-0.8553777057  
-0.7544491301  
-0.68688567  
-0.6591392511  
-0.6697001426  
-0.7107103407  
-0.7702519992  
-0.8348828575  
-0.8920075986  
-0.9317485989  
-0.9481006683  
-0.9392918751  
-0.9074038806  
-0.8574192559  
-0.7959322047  
-0.7297862586  
-0.6648827534  
-0.6053476253  
-0.5531595262  
-0.5082504049  
-0.4690054429  
-0.433021508  
-0.3979491714  
-0.3622426404  
-0.3256711812  
-0.2895023907  
-0.2563345484  
-0.2296247974  
-0.2130173734  
-0.2096047535  
-0.2212683489  
-0.248218813  
-0.2888175472  
-0.3397052207  
-0.3962078447  
-0.4529447683  
-0.504530623  
-0.546259052  
-0.5746632957  
-0.5878802129  
-0.5857781393  
-0.5698530204  
-0.5429244885  
-0.508692841  
-0.4712250912  
-0.4344395721  
-0.4016488921  
-0.3752038678  
-0.3562674672  
-0.3447270008  
-0.3392443215  
-0.3374293917  
-0.3361197562  
-0.3317385876  
-0.3207024907  
-0.2998439682  
-0.2668103358  
-0.2203974194  
-0.1607781857  
-0.08959079746  
-0.009863690304  
0.07423150712  
0.1577820754  
0.2356567209  
0.3030876846  
0.3562398828  
0.3926903307  
0.411743216  
0.4145311471  
0.4038766962  
0.383927284  
0.3596080453  
0.3359684179  
0.3175145127  
0.3076232176  
0.3081231571  
0.3191012871  
0.3389608053  
0.3647181545  
0.3924901095  
0.4180946186  
0.437675388  
0.448254542  
0.4481356673  
0.4371001036  
0.4163772637  
0.3883975833  
0.3563776851  
0.3238032294  
0.29389319  
0.2691259438  
0.25089647  
0.2393528111  
0.233427695  
0.2310549817  
0.229530455  
0.2259562372  
0.2176998371  
0.2027970205  
0.1802415661  
0.1501248307  
0.1136136801  
0.07277704378  
0.03029778725  
-0.01088426954  
-0.04794204619  
-0.07849333271  
-0.1008533218  
-0.1141806563  
-0.1185056929  
-0.1146505676  
-0.1040584389  
-0.08856538012  
-0.07014865033  
-0.0506871331  
-0.03176431972  
-0.01453453255  
0.0003365536118  
0.01265950683  
0.02264568358  
0.03079081554  
0.03773794483  
0.04414328917  
0.05056466201  
0.05738107921  
0.06475359543  
0.07261975232  
0.08071862201  
0.08863503858  
0.09585376152  
0.1018174593  
0.1059822218  
0.1078678063  
0.1071030193  
0.1034636204  
0.09690176394  
0.08756273224  
0.07578588765  
0.06208711492  
0.04711726793  
0.03160211328  
0.016265226  
0.001743791623  
-0.01149087218  
-0.02319615411  
-0.03339161139  
-0.04235550123  
-0.05058087143  
-0.05869625706  
-0.06736095761  
-0.07714961528  
-0.08844682697  
-0.1013683103  
-0.1157234215  
-0.1310267783  
-0.1465597273  
-0.161472336  
-0.1749101702  
-0.1861486783  
-0.1947117536  
-0.2004586519  
-0.2036242953  
-0.2048080358  
-0.2049113544  
-0.2050335062  
-0.2063370826  
-0.2099015181  
-0.2165816973  
-0.2268866215  
-0.2408934118  
-0.2582041342  
-0.2779499341  
-0.2988427164  
-0.3192704825  
-0.3374281754  
-0.3514749448  
-0.3597048239  
-0.3607165237  
-0.3535706721  
-0.3379126416  
-0.3140509113  
-0.2829729488  
-0.2462901602  
-0.2061073141  
-0.1648226151  
-0.1248722962  
-0.0884487987  
-0.05722514151  
-0.03212776096  
-0.01319313551  
0.000457796757  
0.01051426154  
0.01924243703  
0.02914934674  
0.04258755259  
0.06135982044  
0.08638582504  
0.1174891745  
0.1533456448  
0.1916093004  
0.229206155  
0.2627545403  
0.2890503827  
0.3055450277  
0.3107381055  
0.3044274528  
0.2877744602  
0.2631731729  
0.2339445247  
0.2038971396  
0.1768199272  
0.1559765281  
0.1436721067  
0.1409510464  
0.1474616874  
0.1615067738  
0.1802671894  
0.2001695995  
0.2173472507  
0.2281359653  
0.2295418228  
0.2196236068  
0.1977419086  
0.1646460136  
0.1223877555  
0.07407147557  
0.02347188384  
-0.02543376113  
-0.06896003567  
-0.104171018  
-0.1292420611  
-0.1436748308  
-0.1483385177  
-0.145328147  
-0.137659312  
-0.1288405261  
-0.1223818633  
-0.1213083126  
-0.1277461373  
-0.1426399288  
-0.1656384833  
-0.1951636135  
-0.2286507465  
-0.2629225895  
-0.2946414128  
-0.3207729019  
-0.3389959041  
-0.3479996282  
-0.3476294158  
-0.3388641727  
-0.323632966  
-0.3045032956  
-0.2842886792  
-0.2656363538  
-0.2506537964  
-0.2406283135  
-0.2358782437  
-0.2357527929  
-0.238779366  
-0.2429331841  
-0.2459862158  
-0.2458848802  
-0.2410946765  
-0.2308611414  
-0.2153410137  
-0.1955827523  
-0.1733541324  
-0.1508382129  
-0.1302469361  
-0.11340854  
-0.1013991045  
-0.09428147141  
-0.09100126224  
-0.0894661667  
-0.08680720582  
-0.07978805234  
-0.06530629699  
-0.04090816854  
-0.005237867623  
0.04165326487  
0.09818978831  
0.1613725877  
0.2270854848  
0.2905664828  
0.3469780559  
0.3919918978  
0.422308995  
0.4360397572  
0.4328990299  
0.4141934069  
0.3826129297  
0.341865883  
0.2962122481  
0.2499665033  
0.2070330311  
0.1705324252  
0.1425537319  
0.1240524334  
0.1148860824  
0.1139694538  
0.1195118109  
0.129299106  
0.1409807246  
0.1523282673  
0.1614419089  
0.1668900035  
0.1677787303  
0.1637557045  
0.1549579607  
0.141918894  
0.1254506886  
0.106517401  
0.08611399031  
0.06516249073  
0.04443461496  
0.02450650334  
0.00574489465  
-0.01167669304  
-0.0277376892  
-0.04251664137  
-0.05613205623  
-0.06868970224  
-0.08024376842  
-0.09077686346  
-0.1002027581  
-0.1083858935  
-0.1151752424  
-0.1204396577  
-0.1240999844  
-0.1261463012  
-0.1266386866  
-0.1256876277  
-0.1234228537  
-0.1199544761  
-0.1153383291  
-0.1095560134  
-0.1025157631  
-0.09407686011  
-0.08409677385  
-0.07249114624  
-0.0592948023  
-0.04471232874  
-0.02914430481  
-0.01318050495  
0.002439944533  
0.01690059748  
0.02939993267  
0.03925004377  
0.04596466957  
0.04932269375  
0.04939479852  
0.04652773981  
0.04128804808  
0.03437509438  
0.02651561902  
0.01836024849  
0.01039773228  
0.002903051337  
-0.004074080693  
-0.01067592748  
-0.01716875991  
-0.02385212789  
-0.0309627999  
-0.03859263017  
-0.04663682292  
-0.05478108094  
-0.06253242069  
-0.06928719793  
-0.0744243103  
-0.07740730656  
-0.07787686902  
-0.07571765859  
-0.07108970314  
-0.06441692707  
-0.05634050316  
-0.04764244267  
-0.03915405099  
-0.03166752838  
-0.02585989665  
-0.02224413283  
-0.02114927068  
-0.02272854494  
-0.02699099459  
-0.03384239527  
-0.04312738484  
-0.05465943842  
-0.06823339519  
-0.08361719068  
-0.1005268331  
-0.1185930756  
-0.1373293746  
-0.1561171444  
-0.1742142989  
-0.1907959728  
-0.2050262421  
-0.2161530224  
-0.2236127779  
-0.2271282517  
-0.2267775617  
-0.2230198142  
-0.2166651495  
-0.208787489  
-0.2005875789  
-0.1932258668  
-0.1876496254  
-0.1844444198  
-0.1837390368  
-0.185181953  
-0.1880014068  
-0.1911409231  
-0.1934515615  
-0.1939078381  
-0.1918080115  
-0.186917353  
-0.1795265446  
-0.1704031362  
-0.1606405658  
-0.1514266874  
-0.1437704402  
-0.1382391963  
-0.13475857  
-0.1325227274  
-0.1300392107  
-0.1253151028  
-0.1161574814  
-0.1005430473  
-0.07699221225  
-0.04488141675  
-0.00463493959  
0.04223871569  
0.09327589302  
0.1453290487  
0.194933013  
0.2387045663  
0.2737113183  
0.2977553077  
0.3095382823  
0.308700358  
0.295745976  
0.2718880126  
0.23885154  
0.1986731606  
0.1535270148  
0.1055929252  
0.05697054681  
0.009629550476  
-0.0346161322  
-0.0741286583  
-0.1074697608  
-0.1334399888  
-0.151128982  
-0.15997391  
-0.1598145867  
-0.1509340417  
-0.1340723313  
-0.1104050797  
-0.08148400375  
-0.04913852102  
-0.01534821193  
0.01790485753  
0.04878758258  
0.07575679672  
0.09767409778  
0.1138847943  
0.1242510021  
0.1291393931  
0.1293646013  
0.1260941789  
0.1207246986  
0.1147400581  
0.1095616713  
0.1064033372  
0.1061407708  
0.1092069555  
0.1155223892  
0.1244714208  
0.1349291883  
0.1453455684  
0.1538834825  
0.1586047539  
0.1576900367  
0.1496706803  
0.1336464403  
0.1094613636  
0.07780984653  
0.04025098525  
-0.0008774883389  
-0.04264615355  
-0.08180446419  
-0.1151060933  
-0.1396476231  
-0.1531804194  
-0.1543498324  
-0.1428300428  
-0.1193369558  
-0.08551670963  
-0.04372906746  
0.003237998686  
0.05247888325  
0.1012565209  
0.147221607  
0.1885380766  
0.2239055901  
0.2524929143  
0.2738144362  
0.2875944418  
0.2936643284  
0.2919325907  
0.2824433176  
0.2655204796  
0.2419666199  
0.2132619731  
0.181706364  
0.1504386624  
0.123294468  
0.104484818  
0.09811354372  
0.1075924124  
0.1350359467  
0.1807383864  
0.2428325402  
0.3172132137  
0.3977687898  
0.4769200906  
0.5464130619  
0.5982684615  
0.625758329  
0.6242683613  
0.5919174323  
0.5298360073  
0.4420576696  
0.3350345341  
0.2168423401  
0.09619121606  
-0.01861846842  
-0.1206460943  
-0.2050389801  
-0.2694429979  
-0.3140547066  
-0.3413251976  
-0.3553784444  
-0.361246203  
-0.3640421408  
-0.3682038665  
-0.3769111701  
-0.3917589246  
-0.4127180179  
-0.4383743268  
-0.4663879177  
-0.4940856043  
-0.5190773595  
-0.5397881448  
-0.5558085493  
-0.5680027731  
-0.5783497461  
-0.5895411745  
-0.6044051501  
-0.6252564758  
-0.6532969011  
-0.6881859909  
-0.7278856165  
-0.7688378829  
-0.8064832448  
-0.8360633258  
-0.8535931925  
-0.8568416444  
-0.8461338466  
-0.8247972917  
-0.7991083891  
-0.777668497  
-0.7702292422  
-0.7860889141  
-0.8322803274  
-0.9118443087  
-1.022512199  
-1.156107236  
-1.298895003  
-1.432982677  
-1.538703283  
-1.59773167  
-1.596511991  
-1.529452005  
-1.401284832  
-1.228047367  
-1.036267114  
-0.8601881609  
-0.7371744425  
-0.7017545634  
-0.7790740545  
-0.9787409183  
-1.290130183  
-1.680132629  
-2.09407885  
-2.460148684  
-2.697066348  
-2.724320243  
-2.473664529  
-1.900304467  
-0.9920567771  
0.2250835647  
1.686118205  
3.291471428  
4.916406037  
6.424385619  
7.682681779  
8.578111949  
9.030700608  
9.003316562  
8.505919097  
7.593836318  
6.360384096  
4.924957376  
3.418351646  
1.967406252  
0.6810665161  
-0.3603585735  
-1.111528628  
-1.563491953  
-1.740423174  
-1.692547943  
-1.486580678  
-1.195220546  
-0.8872242086  
-0.6193229975  
-0.4308527058  
-0.3414748865  
-0.3518903137  
-0.4470344786  
-0.6009592449  
-0.7824776367  
-0.9606619297  
-1.109436773  
-1.210744573  
-1.256041975  
-1.246161465  
-1.189806781  
-1.101107295  
-0.9967347009  
-0.8930746384  
-0.8038610193  
-0.7385585014  
-0.701617167  
-0.6925840542  
-0.7069209992  
-0.7373054303  
-0.7751453419  
-0.8120513011  
-0.8410513274  
-0.8574078642  
-0.8589726439  
-0.8460975737  
-0.8211798537  
-0.7879660487  
-0.7507545587  
-0.7136322487  
-0.6798561494  
-0.6514550914  
-0.6290787887  
-0.6120880114  
-0.5988364361  
-0.5870790007  
-0.5744257354  
-0.5587669673  
-0.5386052013  
-0.5132543358  
-0.4828876395  
-0.4484463757  
-0.4114344619  
-0.3736468979  
-0.3368797266  
-0.3026699962  
-0.2721037388  
-0.2457156255  
-0.223486529  
-0.2049287948  
-0.189235985  
-0.1754642241  
-0.1627125436  
-0.1502692315  
-0.1377062663  
-0.1249073006  
-0.1120367756  
-0.09945776328  
-0.08762489209  
-0.07697016812  
-0.06780640924  
-0.06026106065  
-0.05424921316  
-0.04948370333  
-0.04551559787  
-0.04179359079  
-0.03772932765  
-0.03275837874  
-0.02639005731  
-0.01824291254  
-0.008065052933  
0.004255094953  
0.0186850228  
0.03504914499  
0.05302943856  
0.07216859188  
0.09187596793  
0.1114407146  
0.1300541954  
0.1468466619  
0.1609387108  
0.1715078866  
0.1778666201  
0.1795454009  
0.1763725075  
0.1685383284  
0.1566334582  
0.1416492148  
0.124932311  
0.1080908928  
0.09285641725  
0.08090951991  
0.07369136807  
0.0722210008  
0.07694783447  
0.08766275822  
0.1034903664  
0.1229728202  
0.1442441757  
0.165280443  
0.1841952061  
0.1995411871  
0.2105704048  
0.2174069678  
0.2210945493  
0.2234970145  
0.2270513601  
0.2343966734  
0.2479271246  
0.2693326327  
0.2992019395  
0.3367593006  
0.3797884845  
0.424776117  
0.4672690045  
0.5024057461  
0.5255535384  
0.5329567412  
0.5223008972  
0.4931015172  
0.4468535918  
0.3869130403  
0.3181202848  
0.2462209666  
0.1771612355  
0.1163634253  
0.06808237378  
0.03493201649  
0.01764551122  
0.01509455228  
0.02455542951  
0.04217168414  
0.0635395357  
0.08432143817  
0.1007985178  
0.1102825792  
0.1113343104  
0.1037725834  
0.08848403108  
0.06708556522  
0.04150567167  
0.0135628333  
-0.01538395844  
-0.04465464592  
-0.07430492134  
-0.1050178237  
-0.1378546195  
-0.173916355  
-0.2139764636  
-0.2581536381  
-0.305682801  
-0.3548280349  
-0.4029576422  
-0.446778329  
-0.4826992331  
-0.5072802304  
-0.5177000189  
-0.5121829962  
-0.4903181703  
-0.4532217039  
-0.4035145131  
-0.3451066749  
-0.282811141  
-0.2218333434  
-0.1672014544  
-0.1232131185  
-0.09297478253  
-0.07809541858  
-0.07857493808  
-0.09289613779  
-0.1182995891  
-0.1511927599  
-0.1876227259  
-0.2237421577  
-0.2561962054  
-0.2823848615  
-0.3005751904  
-0.3098692848  
-0.3100598376  
-0.3014193318  
-0.2844808231  
-0.2598582321  
-0.2281445939  
-0.1899017919  
-0.145736225  
-0.09643118702  
-0.04309834311  
0.01270049258  
0.06889681008  
0.122957667  
0.1720294508  
0.2131777337  
0.2436895914  
0.2613975925  
0.2649744034  
0.2541505638  
0.2298190874  
0.1940042776  
0.1496942115  
0.1005559335  
0.05056894117  
0.003623805533  
-0.03686241226  
-0.06826693764  
-0.08898109152  
-0.09850593033  
-0.09741945346  
-0.08722704575  
-0.07011944134  
-0.04867555832  
-0.02554847786  
-0.003173975118  
0.01646654451  
0.03200588999  
0.0427620721  
0.04872107644  
0.05044297593  
0.04890972534  
0.0453389862  
0.04098975625  
0.03698389376  
0.03416471503  
0.03300688151  
0.03358557583  
0.03560605539  
0.03848499886  
0.0414739806  
0.04380267357  
0.0448248973  
0.04414320259  
0.04169392972  
0.0377795171  
0.03303793253  
0.02835387377  
0.02472070905  
0.02307354684  
0.02411598356  
0.02817176624  
0.03508245838  
0.04417575499  
0.05431025966  
0.06399871981  
0.07159411984  
0.07551638423  
0.07448674753  
0.06773622695  
0.05515622285  
0.03736458875  
0.01567415458  
-0.008037075713  
-0.03154136054  
-0.05253416293  
-0.06892876607  
-0.07913005187  
-0.08224994017  
-0.07822869939  
-0.06784510738  
-0.05261058431  
-0.03456219689  
-0.01598395919  
0.0009032727012  
0.01423284263  
0.02272410903  
0.02581592151  
0.02368575135  
0.01715212154  
0.007481288253  
-0.003864712854  
-0.01549479288  
-0.02632065383  
-0.03571531565  
-0.04357091914  
-0.05025229445  
-0.05645762985  
-0.06301935468  
-0.07068426161  
-0.07991886589  
-0.090776405  
-0.1028483294  
-0.1153097119  
-0.1270435865  
-0.1368208283  
-0.1434974315  
-0.1461940674  
-0.1444251392  
-0.1381574406  
-0.127793748  
-0.1140890405  
-0.09802108615  
-0.08064171596  
-0.06293685804  
-0.04571847799  
-0.02956264754  
