0.08451738551  
0.6390533582  
1.161769729  
1.627932742  
2.018527933  
2.321857544  
2.534161803  
2.659227456  
2.707084957  
2.692053027  
2.630467153  
2.538443205  
2.430017211  
2.315889863  
2.202895705  
2.094180469  
1.989951291  
1.888580966  
1.787806645  
1.685778496  
1.581766521  
1.476422376  
1.371595792  
1.269782873  
1.173380669  
1.083922924  
1.001496236  
0.9244713154  
0.8496292561  
0.7726741109  
0.6890457465  
0.5948858906  
0.4879823047  
0.3685078189  
0.2394116201  
0.106382886  
-0.02263928331  
-0.1383417338  
-0.2311749633  
-0.2926004326  
-0.3162600924  
-0.2989024703  
-0.2409444835  
-0.1465803843  
-0.02343919479  
0.1181692742  
0.266312198  
0.4086610834  
0.5337260981  
0.6319596016  
0.6966014749  
0.7241828277  
0.7146596859  
0.6711861997  
0.5995895082  
0.5076235457  
0.4041157985  
0.2980941933  
0.197991612  
0.1109851583  
0.04251517854  
-0.004010140626  
-0.02732459635  
-0.02825720575  
-0.009551520423  
0.02441450271  
0.06798998498  
0.1146680787  
0.1575430911  
0.1897921714  
0.2051648037  
0.1984583346  
0.1659422457  
0.105709399  
0.01790894717  
-0.0951656279  
-0.2291673859  
-0.3779578249  
-0.5340546745  
-0.689219839  
-0.835142798  
-0.9641640657  
-1.069954436  
-1.148074558  
-1.196364847  
-1.215094567  
-1.206869637  
-1.176291136  
-1.129411196  
-1.073049856  
-1.014047315  
-0.9585523733  
-0.9114223004  
-0.8758089335  
-0.8529716275  
-0.8423306539  
-0.8417432339  
-0.8479572549  
-0.8571667407  
-0.8656004992  
-0.8700524524  
-0.8682890989  
-0.8592870672  
-0.8432693626  
-0.8215576153  
-0.7962660728  
-0.7698962838  
-0.7448957373  
-0.723250707  
-0.7061655852  
-0.6938734163  
-0.6855841227  
-0.6795806572  
-0.6734180275  
-0.6642009204  
-0.6488895972  
-0.6245990466  
-0.5888636632  
-0.5398456552  
-0.4764942812  
-0.3986545017  
-0.3071300985  
-0.2037181545  
-0.09119084994  
0.02676349401  
0.1456806002  
0.2605405667  
0.3660893465  
0.4572414674  
0.5295458481  
0.5796556813  
0.6057386312  
0.6077665012  
0.5876180135  
0.5489624851  
0.496928491  
0.4375833639  
0.3772998266  
0.3220908056  
0.2770118587  
0.2457136327  
0.2301943179  
0.2307849673  
0.2463326822  
0.2745503198  
0.3124355642  
0.3567062538  
0.4041549383  
0.4518992207  
0.4974931617  
0.5389232468  
0.5745216818  
0.6028461303  
0.6225839659  
0.632517474  
0.6315678524  
0.6189204944  
0.5941974187  
0.5576347554  
0.5102175483  
0.4537198915  
0.3906308687  
0.3239445998  
0.2568497966  
0.1923585158  
0.1329344727  
0.08020170898  
0.03479035174  
-0.003638079267  
-0.03617095639  
-0.0642681762  
-0.08928096573  
-0.1119733827  
-0.13212857  
-0.1483407644  
-0.1580542891  
-0.1578674304  
-0.1440790351  
-0.1133959178  
-0.0636999972  
0.005263510799  
0.09139845028  
0.1900865917  
0.2943867694  
0.3956258394  
0.4843214657  
0.5513374926  
0.5891072047  
0.5927595393  
0.5609582566  
0.4963107234  
0.4052442856  
0.29732825  
0.1841008803  
0.07753515888  
-0.01164791932  
-0.07557593227  
-0.1104916578  
-0.1174657053  
-0.1024281117  
-0.0754557693  
-0.04940016249  
-0.03800958795  
-0.05381227879  
-0.1060703644  
-0.1991131428  
-0.3313244688  
-0.4949576089  
-0.6768418633  
-0.8598960062  
-1.025244698  
-1.154627971  
-1.232754241  
-1.249240311  
-1.19986696  
-1.086969895  
-0.9189499913  
-0.7090000586  
-0.4732866905  
-0.22889028  
0.00818144218  
0.2246124981  
0.4108279715  
0.561393447  
0.6747684806  
0.7525676737  
0.798508223  
0.8172853831  
0.8135816186  
0.7913691247  
0.7535924865  
0.7022250696  
0.6386229341  
0.5640493653  
0.4802140973  
0.3896814627  
0.2960454931  
0.2038200156  
0.1180646619  
0.04380694802  
-0.0146153442  
-0.05416828492  
-0.07357997071  
-0.07354348484  
-0.05664264107  
-0.02699632879  
0.0102991512  
0.04985460689  
0.08667614543  
0.1167612478  
0.1375231221  
0.1479885006  
0.1487638381  
0.1417911568  
0.1299500526  
0.1165657697  
0.1049019235  
0.09769794137  
0.09680321639  
0.1029281568  
0.1155399984  
0.132886781  
0.152138044  
0.1696359308  
0.1812234929  
0.1826408303  
0.1699602651  
0.1400374053  
0.09093008996  
0.02224356282  
-0.06465667648  
-0.1666231536  
-0.2789297981  
-0.3957321777  
-0.5107526629  
-0.6181301061  
-0.7133338816  
-0.7939910603  
-0.8604869194  
-0.9161927639  
-0.9672302942  
-1.021734116  
-1.088667431  
-1.176322465  
-1.290714207  
-1.434114385  
-1.603997173  
-1.792613512  
-1.987350114  
-2.171905594  
-2.328193719  
-2.438755366  
-2.489352913  
-2.471354916  
-2.38352282  
-2.23283976  
-2.034161704  
-1.808603419  
-1.580782329  
-1.375212473  
-1.212330955  
-1.104726401  
-1.054186119  
-1.050110995  
-1.069701895  
-1.080072263  
-1.042186772  
-0.9161998766  
-0.6675324891  
-0.2728425633  
0.2750336349  
0.9639839331  
1.761998915  
2.619306196  
3.473148041  
4.254666588  
4.897022805  
5.343629133  
5.55531733  
5.515390719  
5.231796217  
4.736101087  
4.079405749  
3.325827576  
2.544507345  
1.801307689  
1.151373138  
0.6335269783  
0.2671871589  
0.05203506432  
-0.02970982119  
-0.008951716714  
0.07589570521  
0.1849075161  
0.2821401982  
0.3399128948  
0.341409148  
0.281427923  
0.165395736  
0.007007149558  
-0.1749978524  
-0.3603316997  
-0.5303801741  
-0.6707112437  
-0.7725874487  
-0.8334034944  
-0.8561217689  
-0.8479501273  
-0.818563306  
-0.7782161382  
-0.7360663051  
-0.6989330213  
-0.6706491649  
-0.6520219577  
-0.6413375458  
-0.6352564236  
-0.6298976171  
-0.6218962665  
-0.6092480961  
-0.5917874839  
-0.5712344776  
-0.5508163895  
-0.5345495063  
-0.5263214585  
-0.5289598575  
-0.543468314  
-0.568591477  
-0.6008040706  
-0.6347607855  
-0.664133254  
-0.6827192841  
-0.6856226456  
-0.6703001492  
-0.6372718748  
-0.5903556019  
-0.5363359341  
-0.4841004896  
-0.4433483991  
-0.4230581483  
-0.4299474218  
-0.4671805324  
-0.5335325776  
-0.6231734132  
-0.7261335176  
-0.8294132664  
-0.918591914  
-0.9797140592  
-1.001177817  
-0.9753405132  
-0.899591832  
-0.7767283871  
-0.6145684924  
-0.4248575386  
-0.2216404663  
-0.01935884078  
0.1690360518  
0.3336487969  
0.4686503383  
0.5725830587  
0.6479335438  
0.7000787338  
0.7357923146  
0.7616077651  
0.782320236  
0.7999109201  
0.8130781596  
0.8174816363  
0.8066373545  
0.7733269  
0.7112648762  
0.6167159008  
0.4897717805  
0.3350413318  
0.1615973924  
-0.01783430684  
-0.1883403121  
-0.3347164823  
-0.443505274  
-0.5048398404  
-0.5138108677  
-0.4711493491  
-0.3831062088  
-0.2605840439  
-0.1176359759  
0.03040902486  
0.1689337611  
0.285832237  
0.3728877045  
0.426548877  
0.448026275  
0.4427279078  
0.4191340408  
0.3873065917  
0.3572262712  
0.3372199768  
0.3326667536  
0.3451725178  
0.372301673  
0.4079157753  
0.4430477654  
0.4672113386  
0.4699610236  
0.4424954685  
0.3790803313  
0.2781009752  
0.1425799809  
-0.01991399767  
-0.1979883118  
-0.3776861083  
-0.5441382273  
-0.6833992736  
-0.7842228576  
-0.8395429356  
-0.8474600634  
-0.8115868186  
-0.740709405  
-0.647787697  
-0.5484144782  
-0.4589261646  
-0.3943833027  
-0.3666748285  
-0.3829649734  
-0.444683764  
-0.5471827633  
-0.6801180559  
-0.8285280909  
-0.9745012282  
-1.099245497  
-1.185320233  
-1.218753937  
-1.190775543  
-1.098931929  
-0.9474277413  
-0.7466309022  
-0.5118041852  
-0.2612208246  
-0.01393264175  
0.2125092616  
0.4040615032  
0.5516557159  
0.6519398885  
0.7072194588  
0.7246483599  
0.7148288679  
0.6900517256  
0.6624558925  
0.6423774363  
0.6371073268  
0.6501978367  
0.6813727341  
0.726984246  
0.7808995695  
0.8356336361  
0.8835366363  
0.917848523  
0.9334783638  
0.9274323313  
0.8988704924  
0.8488392576  
0.7797809022  
0.6949380925  
0.5977864342  
0.4915950143  
0.3791990148  
0.2629925304  
0.1451244637  
0.02781936496  
-0.08628076675  
-0.1938580955  
-0.2908487798  
-0.3726131681  
-0.4343659317  
-0.4718111837  
-0.4818957796  
-0.4635414756  
-0.4182097824  
-0.350175259  
-0.2664089933  
-0.176049181  
-0.08949725017  
-0.01724723736  
0.0313921984  
0.04949447589  
0.033460702  
-0.01643837395  
-0.09600475644  
-0.1975565337  
-0.3108026535  
-0.4240385869  
-0.5254841566  
-0.604592144  
-0.6531537574  
-0.666068338  
-0.6416948959  
-0.5817629259  
-0.4908800688  
-0.3757287905  
-0.2440757081  
-0.1037496792  
0.03827208723  
0.1765378415  
0.3074665872  
0.4293280719  
0.5418766721  
0.6457128483  
0.7414837147  
0.8290807321  
0.9069786444  
0.9718615352  
1.018630843  
1.040830515  
1.031463704  
0.9840838959  
0.8940103141  
0.7594543909  
0.5823657158  
0.3688216327  
0.12886196  
-0.1242522073  
-0.3752769066  
-0.6085569774  
-0.8097104716  
-0.9671870805  
-1.073467515  
-1.125745859  
-1.126011213  
-1.080546002  
-0.9989452603  
-0.8928190946  
-0.7743928062  
-0.6551860903  
-0.544949978  
-0.4509597817  
-0.3777006708  
-0.326934649  
-0.298065493  
-0.2887014924  
-0.2953020834  
-0.3138020599  
-0.3401322157  
-0.3705893298  
-0.4020389321  
-0.4319690607  
-0.4584435763  
-0.4799967221  
-0.4955328067  
-0.504267359  
-0.5057342283  
-0.4998534919  
-0.4870416601  
-0.4683211672  
-0.4453727397  
-0.4204957189  
-0.3964379412  
-0.3760979591  
-0.362115662  
-0.3564184083  
-0.3597812363  
-0.3715020634  
-0.389243356  
-0.4091146132  
-0.4259983443  
-0.434102163  
-0.4276771481  
-0.4018090672  
-0.3531666897  
-0.2806070401  
-0.1855303891  
-0.07193230386  
0.05386567895  
0.1837921879  
0.3088367705  
0.4200083279  
0.509328009  
0.5707441044  
0.6008661043  
0.5994183647  
0.5693679823  
0.5166794564  
0.4497235394  
0.3783871702  
0.3129764011  
0.2630356665  
0.236233865  
0.2374427269  
0.2681456631  
0.3262443982  
0.4063017007  
0.500196197  
0.5980971989  
0.6896520205  
0.7652173463  
0.8169853355  
0.8398645471  
0.8319971615  
0.7948636591  
0.7329689079  
0.6531605157  
0.5636876133  
0.4731343015  
0.3893716036  
0.3186796143  
0.265140603  
0.2303786529  
0.2136534475  
0.2122702995  
0.2222229153  
0.2389462691  
0.258057739  
0.2759702688  
0.2902923513  
0.299964609  
0.305147774  
0.3068982791  
0.3067234495  
0.3061103302  
0.3061257486  
0.3071666974  
0.3088908993  
0.3103400524  
0.3101994373  
0.3071363773  
0.3001324518  
0.2887321451  
0.2731534538  
0.2542393826  
0.233257037  
0.2115933036  
0.1904082602  
0.1703246737  
0.1512164724  
0.1321459844  
0.1114640452  
0.0870479079  
0.0566464948  
0.01825109598  
-0.02956701211  
-0.08741691209  
-0.1549860405  
-0.2310899325  
-0.3138551647  
-0.4009983198  
-0.4901431191  
-0.5791117166  
-0.6661477368  
-0.7500204266  
-0.8300092975  
-0.9057807019  
-0.977179463  
-1.043998314  
-1.105770626  
-1.161634798  
-1.210311834  
-1.250191554  
-1.279535969  
-1.29674509  
-1.300644029  
-1.290741443  
-1.267389185  
-1.231822982  
-1.18605466  
-1.132626965  
-1.07426722  
-1.013482811  
-0.9521797765  
-0.8913632919  
-0.8309880418  
-0.7699955317  
-0.7065501332  
-0.6384460924  
-0.5636358886  
-0.4807870085  
-0.3897831118  
-0.2920662439  
-0.1907609042  
-0.09052483817  
0.002857013133  
0.08309379415  
0.1441468637  
0.1810054619  
0.1903759464  
0.1711786088  
0.124790502  
0.05499097054  
-0.03234165464  
-0.129745072  
-0.2287979567  
-0.3207673754  
-0.3971939746  
-0.450381427  
-0.4737823933  
-0.462322751  
-0.4127107962  
-0.3237942292  
-0.1969728814  
-0.03663762921  
0.1494594392  
0.3500430452  
0.5505310531  
0.7337746178  
0.8814044997  
0.9757852424  
1.002430431  
0.9526104313  
0.8257844463  
0.6314077041  
0.3896841765  
0.1309159649  
-0.1067384072  
-0.2810402337  
-0.3506811412  
-0.2809694705  
-0.04943135819  
0.3495109134  
0.9015988292  
1.572191195  
2.30842783  
3.044079122  
3.706591575  
4.225490852  
4.541023534  
4.611811353  
4.420399249  
3.975852095  
3.312992469  
2.488362962  
1.573505434  
0.6465200888  
-0.2169063562  
-0.9517751119  
-1.510298987  
-1.865945965  
-2.014649812  
-1.973288832  
-1.775868639  
-1.468112356  
-1.101299103  
-0.7261632481  
-0.38758611  
-0.1205801555  
0.05212200204  
0.1208160913  
0.0880484398  
-0.03339723997  
-0.2233579279  
-0.4575531033  
-0.7108130486  
-0.9599098961  
-1.185689159  
-1.37434947  
-1.517819648  
-1.61334108  
-1.662429349  
-1.669496895  
-1.640412178  
-1.581254555  
-1.49745902  
-1.393432196  
-1.272623885  
-1.137932062  
-0.9922725389  
-0.8391039239  
-0.6827536673  
-0.5284352935  
-0.3819410722  
-0.2490855227  
-0.135013573  
-0.04353904456  
0.02335364563  
0.0657484725  
0.0857409658  
0.08711439707  
0.07481883671  
0.05435804862  
0.03116813378  
0.01007536302  
-0.005125871882  
-0.01194679723  
-0.009332312483  
0.002352816055  
0.02146641695  
0.04534554921  
0.07066392514  
0.09386326637  
0.1116280087  
0.1213483881  
0.1215274761  
0.1120673759  
0.09438527734  
0.07132264556  
0.04683681572  
0.02547801473  
0.01170510124  
0.009110027596  
0.01964757224  
0.04298397556  
0.0760793327  
0.1130950577  
0.1456788191  
0.1636360464  
0.1559378857  
0.1119723815  
0.02288700457  
-0.1171031959  
-0.309615125  
-0.5513278568  
-0.8336289439  
-1.142762174  
-1.460473199  
-1.765145022  
-2.033351195  
-2.241721765  
-2.36897038  
-2.397908305  
-2.317231848  
-2.122898871  
-1.818903599  
-1.417331261  
-0.9376515636  
-0.4052761999  
0.1504883207  
0.6988891429  
1.210315119  
1.658761393  
2.023892612  
2.292503468  
2.459225486  
2.52644234  
2.503455994  
2.405032332  
2.249527907  
2.056821754  
1.846294299  
1.63504893  
1.436561738  
1.259842245  
1.10915763  
0.9842995058  
0.8813163384  
0.7936083076  
0.7132286207  
0.6322593909  
0.5440938946  
0.4444836028  
0.3322443839  
0.2095245363  
0.08160656597  
-0.0437360434  
-0.1572740723  
-0.2496063372  
-0.3125514166  
-0.3404472076  
-0.3311906991  
-0.286854874  
-0.2137740767  
-0.1220617479  
-0.02458899925  
0.06445989214  
0.1312790947  
0.1641685409  
0.1550572377  
0.1006074021  
0.002746330494  
-0.1314749058  
-0.2906850917  
-0.4605635207  
-0.6255959079  
-0.7709698088  
-0.8843550562  
-0.9573153812  
-0.9861717196  
-0.9721997041  
-0.9211722001  
-0.8423317879  
-0.7469628514  
-0.646791439  
-0.5524413085  
-0.4721487487  
-0.4108979193  
-0.3700535281  
-0.3475014849  
-0.3382426735  
-0.3353212605  
-0.330963575  
-0.3177702647  
-0.2898176345  
-0.2435539435  
-0.1783834274  
-0.09687705686  
-0.004585921318  
0.09053735456  
0.1790439746  
0.251137786  
0.2979291418  
0.3126487357  
0.2916618429  
0.2351437725  
0.1473037548  
0.03611287634  
-0.08745641494  
-0.2105862517  
-0.320030741  
-0.4036032553  
-0.451548729  
-0.4576188931  
-0.4197166761  
-0.3400478469  
-0.2247758895  
-0.08324927928  
0.07308058916  
0.2318941611  
0.381250355  
0.5106889856  
0.6120958655  
0.6802598239  
0.7131024235  
0.7115910398  
0.6793821769  
0.622241604  
0.5473187392  
0.4623241895  
0.374680037  
0.2907110244  
0.2149322594  
0.1495087786  
0.09395203996  
0.04510622043  
-0.002525377688  
-0.05612663054  
-0.1236025179  
-0.2123894013  
-0.328167663  
-0.473633232  
-0.6475037918  
-0.8439277315  
-1.052437483  
-1.258505142  
-1.444713759  
-1.592430257  
-1.683821534  
-1.703952591  
-1.642707704  
-1.496256654  
-1.267837424  
-0.9677314941  
-0.6123876252  
-0.2227922667  
0.1777105757  
