26,-0.0029294,0.014483,0.020976,-0.98945,0.0011467,-1.9515,0.97228,-0.11381,2.4741,-0.089711,3.3245,0.00022352,0.44599,3.0795,0.020932,4.0114,0.004085,0.98952,0.058786,0.034043,0.027015,0.022794,0.31086,0.33042,0.30062,0.023651,0.006925,0.0042055,0.023323,0.45905,0.26402,0.0066096,140,1654,3636.5,3153.3,8584.6,0.07727,0.19869,0.19869,0.37076,0.58704,0.23698,0.18068,0.015775,43,78.581,2467,1.3929e+05,6.1344,39.405,66609,6102,4806,0.9077,0.9339,0.33261,0.26009,0.1717,0.89752,85155,24932,0.00077129,0.00038185,0,0.067629,0,0.052727,0.0042024,0.018446,0.0088176,0.024041,0.93707,1.2496,0.096592,0.19583,0.42594,0.28072,0.20455,0.51909,0.21409,0.21041,0.54774,0.19028,54.127,7.5794,30843,82019,81318,0.036136,0.026561,0.014652,0.22159,0.18048,0.047241,0.46568,0.40531,0.070359,0.63841,0.59195,0.077141,0.76205,0.74384,0.078726,0.012347,0.009991,0.12761,0.045076,0.060719,-0.053005,0.025842,0.022061,0.12648,0.058831,0.083415,-0.053024,0.042033,0.037372,0.12181,0.069839,0.10422,-0.049459,0.0084265,0.0070268,0.19817,0.05072,0.060784,-0.039519,0.018216,0.016088,0.1966,0.066584,0.082787,-0.03572,0.029733,0.027559,0.18604,0.078052,0.10317,-0.027214,0.0034955,0.0025442,0.070579,0.014752,0.025159,-0.038027,0.0068976,0.0050505,0.068828,0.018537,0.033967,-0.04815,0.010905,0.008051,0.066243,0.021599,0.041312,-0.05707,0.00042495,0.00041998,0.090281,0.0082137,0.016761,-0.00081271,0.0015188,0.0014951,0.10095,0.01336,0.02514,-0.0014748,0.0029466,0.0028578,0.097159,0.016577,0.031652,-0.0037199,0.34726,74,74,40,988,3,3,3,0.645
26,-0.0024258,0.012302,0.017625,-0.99114,0.0012792,-1.9456,0.96303,-0.070991,2.7931,0.037725,3.285,6.424e-06,0.39035,2.9713,0.017224,3.7712,0.0038404,0.99138,0.068609,0.038276,0.031247,0.026336,0.37291,0.28966,0.26899,0.029141,0.0069976,0.0049452,0.027352,0.54594,0.2113,0.03083,88.686,1545.6,2500.5,2238.9,6374.5,0.07925,0.16817,0.16817,0.34891,0.54035,0.21959,0.16379,0.012476,51,62.784,1305,40197,4.889,28.859,35235,15147,10503,0.9118,0.9378,0.23692,0.16793,0.16524,0.73343,47502,21980,0.00087281,0.00038671,0,0.054941,0,0.064442,0.0045369,0.00013507,0.0084291,0.0016056,1.0392,1.3813,0.16134,0.19321,0.42562,0.28988,0.21984,0.5537,0.19767,0.22856,0.56003,0.18585,42.493,7.8267,15070,32211,31266,0.038163,0.032994,0.015389,0.27994,0.28423,0.059354,0.57815,0.60571,0.086876,0.78451,0.81592,0.094277,0.90494,0.92175,0.092977,0.0036479,0.0030102,0.037498,0.0073642,0.040203,-0.040193,0.0078321,0.0064317,0.038123,0.010061,0.056459,-0.054324,0.01369,0.011206,0.039457,0.01341,0.071797,-0.07084,0.0014219,0.0011588,0.033258,0.0037924,0.030996,-0.026732,0.003071,0.0025359,0.032964,0.0049117,0.043032,-0.032945,0.0054004,0.004473,0.033605,0.0064266,0.055526,-0.042208,0.002226,0.0018514,0.044701,0.0072428,0.024072,-0.030026,0.0047612,0.0038958,0.04725,0.0104,0.034868,-0.043031,0.0082896,0.0067333,0.050082,0.014126,0.043916,-0.05654,0,0,0,-0.002344,0.014187,0,0,0,0,-0.0033099,0.018222,0,9.0084e-07,6.5759e-07,2.9542e-05,-0.0043023,0.022731,-0.015686,0.39032,74,74,40,988,3,3,3,0.645
26,-0.0030197,0.014807,0.021525,-0.98917,0.0010427,-1.9541,0.97548,0.20223,2.4955,0.11942,3.3156,0.00029261,0.44069,3.0094,0.021402,3.8112,0.003881,0.98929,0.059553,0.0284,0.023568,0.01982,0.27721,0.38371,0.28025,0.029925,0.0048049,0.0037577,0.020343,0.41484,0.35032,0.01431,80.5,3049.7,4229.6,3988.5,11349,0.16239,0.13936,0.16239,0.83614,1.7968,0.47208,0.18267,0.015898,38,130.84,2004,1.608e+05,3.5852,15.372,54108,37908,18711,0.90473,0.92692,0.39337,0.31209,0.22505,0.87157,56789,29388,0.0013319,0.00052994,0,0.096048,0,0.068456,0.0014047,0.033916,0.0024342,0.046839,1.3394,0.57843,1.2625,0.21172,0.40897,0.27485,0.24104,0.48531,0.20944,0.26017,0.48728,0.1909,46.911,7.4208,28160,92698,91970,0.075081,0.073239,0.04073,0.32529,0.35208,0.092786,0.57109,0.61208,0.11545,0.74214,0.77276,0.11998,0.84593,0.86943,0.11693,0.0085956,0.0069537,0.11886,0.033454,0.053686,-0.047867,0.01999,0.016324,0.1309,0.049906,0.075112,-0.062958,0.03602,0.029548,0.13966,0.067179,0.096043,-0.079047,0.0037049,0.0030321,0.11658,0.022164,0.043726,-0.03004,0.008637,0.0072008,0.12472,0.03202,0.058636,-0.037598,0.015884,0.013313,0.13297,0.04329,0.074296,-0.047038,0.004498,0.0036304,0.12151,0.023988,0.030093,-0.034603,0.010338,0.0083688,0.13802,0.036671,0.044031,-0.045998,0.018028,0.014676,0.14653,0.048578,0.056729,-0.056412,0.00039261,0.00029115,0.1116,0.0086008,0.018928,-0.017194,0.0015164,0.0011307,0.13485,0.015477,0.026706,-0.02799,0.0034884,0.0026089,0.1539,0.023702,0.035103,-0.037123,0.38788,74,74,40,988,3,3,3,0.645
26,-0.0033709,0.016072,0.023532,-0.98815,0.00089747,-1.9573,0.98075,-0.11882,2.4483,0.0055287,3.3143,0.00032104,0.45369,2.9472,0.02365,3.8676,0.0039305,0.98816,0.0586,0.024131,0.016341,0.011886,0.25191,0.38023,0.30957,0.033482,0.007881,0.0045611,0.01237,0.37473,0.35913,0.00086799,60.93,1122.1,2746.9,10625,14556,0.087039,0.12867,0.12867,0.68321,0.92955,0.31515,0.19272,0.017535,49,120.59,2897,2.0018e+05,5.1849,31.335,78219,27297,19251,0.90531,0.92539,0.28495,0.21627,0.17611,0.65874,66748,29225,0.0012176,0.00047846,0,0.057668,0,0.055122,0.0036067,1.0873e-06,0.0070211,0.0032638,0.96056,0.64124,0.67047,0.19937,0.4331,0.27278,0.22124,0.50706,0.20622,0.22791,0.51779,0.19359,46.838,7.3649,14740,49763,48602,0.068789,0.063336,0.042204,0.31376,0.32656,0.10122,0.56849,0.60571,0.12997,0.74196,0.77899,0.13566,0.83929,0.86671,0.1312,0.0054572,0.0045326,0.085347,0.018826,0.04279,-0.038686,0.01189,0.0099794,0.088058,0.026059,0.057915,-0.048622,0.020686,0.017668,0.090711,0.033843,0.072857,-0.056034,0.002912,0.0022356,0.10363,0.017045,0.038543,-0.042128,0.0071518,0.0054993,0.1168,0.026637,0.052743,-0.0561,0.013118,0.010121,0.12419,0.036054,0.066484,-0.070892,0.0025413,0.0022935,0.077644,0.011282,0.022909,-0.014603,0.0052408,0.0048888,0.079134,0.015149,0.031203,-0.013042,0.0086946,0.0085029,0.079922,0.018941,0.038992,-0.0053268,3.9278e-06,3.5146e-06,0.0012627,-0.002786,0.0059245,-0.004473,7.5018e-05,6.5208e-05,0.0075446,-0.0030858,0.0097584,-0.0075823,0.0003666,0.00030899,0.018291,-0.0021278,0.014527,-0.012975,0.41943,74,74,40,988,3,3,3,0.645
26,-0.0026567,0.012696,0.018359,-0.99077,0.0010131,-1.9538,0.97202,1.085,13.657,-0.0065243,2.8927,0.014652,1.3098,9.6642,0.018331,20.554,0.02093,0.99082,0.044829,0.01892,0.014229,0.011418,0.38415,0.2434,0.32855,0.024899,0.004644,0.0028037,0.011549,0.54994,0.11451,0.00012163,128.84,3656.2,8389.5,13385,25560,0.3982,0.50565,0.50565,1.0117,1.2773,0.43514,0.18925,0.013274,45,92.889,2659,1.6859e+05,5.6635,35.101,71793,22734,6210,0.91234,0.93568,0.12581,0.088127,0.10222,0.41305,33438,18270,0.0012904,0.00064442,0,0.041004,0,0.043206,0.019547,0.0067128,0.022943,0.00043312,1.4956,4.672,3.3541,0.22148,0.32339,0.2685,0.30536,0.26216,0.12962,0.32686,0.24726,0.11871,14.2,7.2495,7586.3,17181,16245,0.3039,0.29135,0.13417,0.73367,0.76551,0.17031,0.88082,0.90198,0.14491,0.94135,0.95406,0.12385,0.96994,0.97711,0.10911,0.021552,0.02451,0.24255,0.088736,0.1153,0.079581,0.04502,0.051949,0.23992,0.11566,0.15295,0.11712,0.072893,0.083963,0.23001,0.13707,0.18398,0.14124,0.0097277,0.0092402,0.2491,0.062077,0.083346,-0.020758,0.02221,0.021611,0.26101,0.086527,0.11216,-0.014549,0.037041,0.036635,0.25236,0.10398,0.13759,-0.0071448,0.011817,0.015263,0.2598,0.06668,0.080276,0.12055,0.023878,0.031499,0.25944,0.086667,0.1086,0.1715,0.038272,0.050157,0.25315,0.10382,0.13083,0.20417,7.5232e-06,6.6526e-06,0.0017403,-0.0022597,0.013942,-0.0050073,8.8519e-05,8.0485e-05,0.0064061,-0.0024513,0.018939,-0.0050828,0.00033385,0.00030987,0.011986,-0.0020397,0.023281,-0.0059467,0.46675,74,74,40,988,3,3,3,0.645
26,-0.0037468,0.019098,0.027227,-0.98628,0.0021238,-1.9333,0.96021,0.26376,2.6614,0.071769,3.3294,0.00033999,0.45696,2.7915,0.026743,3.4573,0.0035207,0.98661,0.083474,0.049643,0.041297,0.035112,0.28714,0.2651,0.36946,0.030233,0.0077608,0.0058318,0.034474,0.44346,0.17927,0.026148,71.505,1117,1576.1,1265.6,4030.9,0.11866,0.10199,0.11866,0.90395,1.5464,0.48255,0.20497,0.020158,38,159.08,5721,8.5469e+05,5.9097,35.96,1.5447e+05,3483,2700,0.88333,0.8939,0.44799,0.38977,0.14875,0.84511,97528,42239,0.0017053,0.00081189,0,0.072777,0,0.070267,0.00048165,0.023736,0.0010928,0.026776,1.0236,0.78114,1.6954,0.18219,0.3911,0.32894,0.18052,0.42324,0.32299,0.17345,0.42533,0.34015,95.404,8.8815,27242,1.91e+05,1.9065e+05,0.075489,0.054825,0.046627,0.25436,0.22756,0.082611,0.42623,0.41077,0.098105,0.57333,0.56279,0.10554,0.69819,0.69389,0.10988,0.01631,0.023557,0.2568,0.077244,0.10825,0.13018,0.033268,0.045929,0.24804,0.097948,0.13452,0.1459,0.054456,0.072337,0.24041,0.11734,0.15823,0.15536,0.015129,0.022839,0.54205,0.11866,0.15882,0.14212,0.029867,0.043675,0.49108,0.14149,0.18646,0.16577,0.047795,0.067598,0.45557,0.16282,0.21067,0.1812,0.0005007,0.00025672,0.015401,-0.0036176,0.0034767,-0.023977,0.00098036,0.0004914,0.014903,-0.0048636,0.0060421,-0.032119,0.0016611,0.00082572,0.015372,-0.0058054,0.0089726,-0.041448,0.00067959,0.00046083,0.21995,0.018048,0.017003,-0.027283,0.002449,0.0017754,0.24796,0.029256,0.026616,-0.032429,0.0051628,0.0039915,0.25934,0.040077,0.036663,-0.034745,0.39051,74,74,40,988,3,3,3,0.645
26,-0.003329,0.015966,0.023223,-0.98831,0.0010758,-1.9535,0.97656,0.25649,2.525,0.028152,3.3305,0.00037576,0.55509,3.638,0.023234,4.7938,0.0048817,0.98837,0.042936,0.021922,0.017525,0.014543,0.29929,0.3431,0.31612,0.019867,0.0042619,0.0029106,0.014444,0.43527,0.27368,0.0028294,219.9,4343,7865.4,8955.2,21384,0.20074,0.11777,0.20074,0.99257,1.2723,0.45639,0.19094,0.017996,54,51.815,1210,34612,5.0932,29.64,32670,18576,4536,0.91176,0.94024,0.1878,0.12905,0.12837,0.62737,37891,20729,0.00076193,0.0003715,0,0.070846,0,0.067338,3.6518e-05,0.0081541,0.0087738,0.011682,0.090689,1.0007,0.74348,0.19849,0.42027,0.27629,0.23754,0.54242,0.17073,0.25476,0.53894,0.15766,38.608,7.4599,13535,25432,23555,0.058059,0.05993,0.020181,0.26617,0.28632,0.048646,0.51299,0.54657,0.066445,0.70387,0.73293,0.072912,0.83271,0.85179,0.073748,0.0013117,0.001028,0.011622,-0.002531,0.039115,-0.032599,0.0028879,0.002275,0.012117,-0.0030438,0.055643,-0.04186,0.0052786,0.0041821,0.013114,-0.0030409,0.071816,-0.054844,0.0010533,0.00082748,0.021236,0.0012332,0.041608,-0.028411,0.0023424,0.001858,0.021673,0.0018112,0.057628,-0.037102,0.004455,0.0035538,0.023896,0.003386,0.073231,-0.049993,0.00025845,0.00020049,0.0044736,-0.0040166,0.014719,-0.016287,0.00054527,0.00041671,0.0046645,-0.0051502,0.021319,-0.019317,0.00080819,0.00061653,0.0042088,-0.0065669,0.027549,-0.022063,0,0,0,-0.0021732,0.007973,0,2.8667e-07,2.1804e-07,1.6334e-05,-0.0030657,0.01174,-0.011837,1.542e-05,1.1788e-05,0.00043587,-0.0038935,0.016442,-0.011888,0.37078,74,74,40,988,3,3,3,0.645
26,-0.0027976,0.013928,0.020142,-0.98987,0.0011427,-1.9512,0.97122,0.80424,3.9907,0.092648,3.2314,0.00012721,0.50433,3.5582,0.020049,4.5865,0.0046705,0.98996,0.057382,0.035041,0.02907,0.024773,0.31264,0.34322,0.28815,0.021063,0.0057843,0.0042036,0.024944,0.43135,0.27275,0.028844,192.84,2425.4,3782.5,2917.2,9318.6,0.12865,0.074028,0.12865,1.8982,3.0352,0.80331,0.17712,0.013707,54,101.94,4075,3.062e+05,6.9618,50.273,1.1002e+05,10854,6210,0.90546,0.93045,0.33622,0.25672,0.20046,0.81911,60131,26785,0.0013274,0.00053825,0,0.066234,0,0.049822,0.0052546,0.016095,0.0062301,0.016925,0.91526,0.92353,0.4325,0.21255,0.40958,0.2824,0.2423,0.48847,0.20672,0.27065,0.49057,0.18537,54.94,7.6249,21072,70323,69632,0.074269,0.067691,0.044231,0.31286,0.31887,0.09797,0.54588,0.57173,0.12115,0.69813,0.72927,0.12391,0.81495,0.83983,0.12366,0.019859,0.029113,0.30148,0.094531,0.1355,0.18855,0.039107,0.056511,0.28114,0.11537,0.16994,0.22826,0.061375,0.087269,0.26125,0.13192,0.19882,0.26102,0.017317,0.027245,0.59821,0.13429,0.18074,0.21418,0.033332,0.052281,0.52843,0.15604,0.21442,0.26662,0.051545,0.080004,0.47372,0.17322,0.24206,0.30958,0.0016846,0.0011794,0.049962,0.0049552,0.019203,-0.038328,0.0043232,0.0030805,0.063366,0.010677,0.03017,-0.051099,0.0079511,0.0057715,0.070947,0.016079,0.040522,-0.062666,0.00085685,0.00068815,0.26739,0.023079,0.025742,-0.018646,0.0021582,0.0017031,0.21069,0.024822,0.032299,-0.026548,0.0038857,0.0030355,0.1882,0.0283,0.039688,-0.034105,0.39577,74,74,40,988,3,3,3,0.645
26,-0.0047416,0.022592,0.032941,-0.98337,0.0013955,-1.9457,0.97859,2.6015,18.852,0.023155,3.1399,0.0043713,1.278,7.0086,0.033182,11.521,0.011732,0.98339,0.047342,0.021414,0.01671,0.013614,0.24382,0.27669,0.43378,0.024505,0.00458,0.0030378,0.01358,0.38846,0.20244,0.087659,114.12,3213.5,6081.3,8428.5,17838,0.26728,0.36572,0.36572,0.35158,1.1258,0.28692,0.23921,0.028464,47,117.11,4992,5.2651e+05,6.6026,44.734,1.3478e+05,7506,1944,0.9059,0.92688,0.35876,0.27183,0.21363,0.82168,66035,35100,0.0012374,0.00049164,0,0.058477,0,0.057288,0.0079261,0.025267,0.009049,0.029922,1.9049,2.2685,0.76269,0.21422,0.37674,0.28732,0.2395,0.42489,0.22693,0.26607,0.43936,0.20362,49.4,7.7577,15704,47773,46847,0.10598,0.08537,0.061371,0.30092,0.28784,0.091623,0.47486,0.48602,0.10247,0.60853,0.62991,0.10501,0.71817,0.73936,0.10596,0.0091248,0.0086555,0.13469,0.037349,0.05892,-0.017524,0.020394,0.019165,0.14255,0.052922,0.082865,-0.026836,0.034377,0.032027,0.14228,0.065548,0.10467,-0.037314,0.0040557,0.0039962,0.13622,0.025741,0.049927,-0.003331,0.0090259,0.0088788,0.13913,0.035013,0.067719,-0.0049102,0.016008,0.015625,0.14304,0.045205,0.085485,-0.0090717,0.0046936,0.0043967,0.13535,0.026192,0.032116,-0.015146,0.010308,0.0095385,0.1469,0.037787,0.046153,-0.022922,0.016719,0.015242,0.14505,0.045767,0.058052,-0.032551,0.00037555,0.0002627,0.11395,0.0083851,0.017419,-0.025011,0.0011007,0.00077492,0.10448,0.010526,0.024363,-0.030822,0.0018082,0.0012707,0.08515,0.010207,0.03042,-0.035056,0.37079,74,74,40,988,3,3,3,0.645
26,-0.0033908,0.016309,0.023632,-0.9881,0.0012515,-1.9497,0.97316,0.18314,2.5941,0.14251,3.3084,0.00016587,0.48723,3.158,0.023755,4.069,0.0041435,0.98811,0.057078,0.023338,0.017346,0.013614,0.30525,0.29413,0.34381,0.032814,0.006056,0.0038074,0.014131,0.45446,0.2085,0.0038112,66.79,2044.7,4285.5,8699.1,15097,0.092549,0.12565,0.12565,0.84143,0.96931,0.34673,0.19389,0.018711,39,137.51,2085,1.707e+05,3.7317,16.358,56295,41769,14877,0.90739,0.92909,0.32855,0.25062,0.19438,0.7975,59590,29208,0.00082884,0.00041524,0,0.085941,0,0.061503,0.00022248,0.0058531,0.00070359,0.0081425,0.48064,0.50082,0.30344,0.19118,0.42195,0.2967,0.20127,0.50537,0.24911,0.20469,0.52809,0.2307,39.763,8.0108,16768,52736,51684,0.042141,0.03216,0.023867,0.22665,0.20836,0.067494,0.4577,0.44795,0.096594,0.66303,0.66741,0.11191,0.81907,0.83011,0.11819,0.0051477,0.0041847,0.074316,0.016475,0.041996,-0.037749,0.010357,0.0083097,0.070807,0.020083,0.055629,-0.052936,0.017523,0.013963,0.070931,0.025007,0.068926,-0.068224,0.0018932,0.0014748,0.062191,0.0082589,0.036219,-0.031073,0.0047918,0.0037843,0.07224,0.014159,0.05005,-0.040741,0.0091695,0.0073206,0.080139,0.02081,0.06388,-0.05081,0.0031633,0.0026484,0.089217,0.015181,0.022863,-0.025464,0.0060929,0.0050155,0.084924,0.018374,0.030443,-0.035122,0.0094967,0.0077144,0.080583,0.020882,0.03648,-0.044793,9.1207e-05,6.1465e-05,0.027066,-9.8669e-05,0.010184,-0.021394,0.00054235,0.00038221,0.05035,0.0031292,0.014682,-0.027017,0.0014807,0.0010833,0.068197,0.0073348,0.019856,-0.030679,0.45455,74,74,40,988,3,3,3,0.645
26,-0.0037766,0.019166,0.027338,-0.98622,0.0021779,-1.9323,0.95934,-0.041205,3.2796,-0.011912,3.2475,0.0001171,0.51174,3.1118,0.026991,4.0174,0.0040911,0.98649,0.097956,0.0448,0.035758,0.029423,0.27599,0.29868,0.33227,0.048337,0.0087165,0.0061975,0.029816,0.4319,0.24307,0.0070537,23.495,874.37,1467.3,1707.8,4073.7,0.077857,0.1157,0.1157,0.31268,0.35289,0.1804,0.20569,0.022205,32,205.28,6230,1.2043e+06,5.3834,29.999,1.6821e+05,3051,2349,0.90368,0.92312,0.35566,0.27429,0.21577,0.7856,76088,43470,0.0006704,0.00039443,0,0.10543,0,0.079926,0.0011267,0.023999,0.0011827,0.034986,1.1202,0.199,0.76576,0.14652,0.37736,0.39639,0.1126,0.40628,0.45056,0.10289,0.40479,0.47058,71.45,10.702,19610,70482,69503,0.030697,0.021015,0.019996,0.11501,0.091405,0.039391,0.25732,0.22604,0.062461,0.46188,0.43428,0.089663,0.6612,0.65056,0.10974,0.00035254,0.00023597,0.0058539,-0.0087926,0.0165,-0.019978,0.00099262,0.00071958,0.007805,-0.010742,0.023635,-0.027294,0.0021337,0.0015807,0.0099343,-0.012176,0.030297,-0.03409,0.00022586,0.00015976,0.0085338,-0.0053676,0.015615,-0.019382,0.00085165,0.00063476,0.014767,-0.0052423,0.023229,-0.0255,0.0019955,0.0014975,0.020059,-0.0045606,0.031108,-0.032459,0.00012668,7.6215e-05,0.0041094,-0.0065326,0.0066565,-0.010657,0.000141,8.4828e-05,0.0022604,-0.009062,0.0084491,-0.010657,0.00014146,8.5109e-05,0.0013806,-0.011477,0.0093946,-0.010657,0,0,0,-0.0029981,0.0086624,0,0,0,0,-0.0042334,0.012312,0,0,0,0,-0.0055109,0.015348,0,0.39988,74,74,40,988,3,3,3,0.645
26,-0.0041016,0.019351,0.028362,-0.9857,0.00098932,-1.9541,0.9824,-0.041575,3.6951,0.048915,3.2596,0.00016013,0.82688,4.8931,0.028499,6.5673,0.0066877,0.98574,0.04844,0.017307,0.011706,0.0084432,0.27535,0.30718,0.37045,0.029706,0.0055385,0.0032546,0.0085208,0.42374,0.23967,0.030961,76.915,2263.3,5517.9,22137,29996,0.18893,0.22124,0.22124,0.45761,1.3139,0.29886,0.21172,0.022443,31,134.06,3065,3.0136e+05,5.0574,27.315,82755,13014,5130,0.90935,0.93315,0.33069,0.24936,0.20502,0.8593,68103,29610,0.00093663,0.00037409,0,0.085302,0,0.076778,0.0040951,0.00034811,0.00010047,0.0066988,0.48171,0.49055,0.5826,0.19581,0.41165,0.2981,0.2253,0.4978,0.22257,0.23726,0.51396,0.19944,50.416,8.0486,20743,50938,49940,0.045731,0.041406,0.020088,0.25173,0.26346,0.058142,0.4764,0.50917,0.077982,0.62723,0.66002,0.082111,0.73715,0.75934,0.082506,0.0041637,0.0034504,0.046623,0.010021,0.043151,-0.036387,0.010274,0.0083661,0.054479,0.017396,0.060516,-0.053014,0.019086,0.015354,0.059923,0.025192,0.077717,-0.072194,0.0022574,0.0020188,0.057516,0.0097913,0.03882,-0.016719,0.0053347,0.00459,0.062379,0.014732,0.051363,-0.028497,0.0094108,0.0079028,0.063794,0.019009,0.063627,-0.04061,0.0015187,0.0011545,0.033223,0.0032196,0.019368,-0.028774,0.0035014,0.0027406,0.037854,0.0058844,0.027592,-0.034824,0.0064921,0.0051545,0.042728,0.0094336,0.035472,-0.043747,0.00038756,0.00027709,0.089206,0.0075885,0.02189,-0.023362,0.0014382,0.0010354,0.10356,0.012996,0.031901,-0.033089,0.0031836,0.0022972,0.11373,0.019021,0.042078,-0.044149,0.34881,74,74,40,988,3,3,3,0.645
26,-0.0027409,0.01303,0.019099,-0.99039,0.00066231,-1.9635,0.98251,-0.65865,3.5135,-0.17002,3.1967,0.00032223,0.43739,3.1557,0.019172,4.0929,0.0041679,0.9904,0.033057,0.016278,0.01285,0.010637,0.34297,0.32638,0.298,0.016308,0.0033976,0.002206,0.01074,0.49044,0.25963,0.011035,326.66,7093.7,13938,15755,37114,0.065667,0.07921,0.07921,0.42918,0.47947,0.20922,0.17343,0.014861,40,74.8,1186,58791,3.5855,15.223,32022,27027,8316,0.91114,0.936,0.20546,0.1455,0.12583,0.67381,38137,20223,0.00076145,0.00041439,0,0.062142,0,0.056813,7.4893e-05,0.0028627,0.0071138,0.0071128,0.087322,0.73285,0.27245,0.18348,0.42585,0.2915,0.20092,0.54827,0.22148,0.19207,0.56474,0.21977,44.172,7.8706,12666,26579,25344,0.032794,0.025472,0.013085,0.21594,0.1923,0.045303,0.45404,0.42727,0.067509,0.6291,0.60891,0.074806,0.72448,0.70866,0.073654,0.0047169,0.0038471,0.047976,0.011918,0.045984,-0.054448,0.012135,0.010469,0.058445,0.021557,0.068563,-0.05882,0.022697,0.020292,0.064729,0.031113,0.091044,-0.058491,0.001395,0.0010515,0.032284,0.0035929,0.039157,-0.040391,0.0035397,0.0027273,0.037597,0.0067782,0.054969,-0.053607,0.0065554,0.0051626,0.040364,0.0097632,0.071292,-0.061453,0.0022813,0.0017797,0.04533,0.0075273,0.022236,-0.040459,0.0045539,0.0035997,0.044719,0.0095643,0.03013,-0.05061,0.0074727,0.0059315,0.044673,0.011747,0.03688,-0.061582,0.0010406,0.0010159,0.21756,0.023327,0.024807,-0.004464,0.0040409,0.0041417,0.2643,0.040722,0.04387,0.0066799,0.0086693,0.0091976,0.28131,0.056699,0.062797,0.021766,0.36162,74,74,40,988,3,3,3,0.645
26,-0.0037621,0.019187,0.027517,-0.98613,0.0019962,-1.9358,0.96305,0.52296,3.3653,0.040325,3.2298,0.00017718,0.46475,2.8098,0.027303,3.6192,0.0036855,0.98633,0.084736,0.049078,0.039487,0.032966,0.22977,0.36099,0.32999,0.031786,0.0089219,0.0061608,0.032374,0.35218,0.34231,0.0059967,66.691,815.93,1424.1,1442.7,3750.1,0.064567,0.082713,0.082713,0.72303,0.85934,0.37904,0.20682,0.021013,36,179.67,5699,8.9401e+05,5.7173,33.802,1.5387e+05,8019,3051,0.89315,0.90784,0.42625,0.35285,0.1965,0.84241,75542,37419,0.0016147,0.00062991,0,0.051385,0,0.048884,0.00096515,0.045869,0.00050347,0.055566,0.37755,0.63706,0.26743,0.18985,0.41615,0.2999,0.20676,0.46142,0.27398,0.1966,0.49308,0.26936,62.617,8.0974,17772,85237,84332,0.076453,0.058372,0.049576,0.29601,0.28136,0.10093,0.53602,0.54813,0.12952,0.73213,0.7626,0.14148,0.8694,0.90323,0.14365,0.0082137,0.0061573,0.13577,0.03457,0.044044,-0.057934,0.016042,0.011752,0.12557,0.041114,0.056547,-0.078517,0.025239,0.018215,0.11698,0.046351,0.067535,-0.09858,0.0072052,0.0056098,0.27101,0.054131,0.052757,-0.047824,0.013925,0.010474,0.24037,0.0625,0.06389,-0.067513,0.021425,0.015567,0.21439,0.068207,0.073324,-0.088187,0.00096861,0.00052673,0.031279,-0.00019703,0.010407,-0.036839,0.0020088,0.0012223,0.032058,-2.0746e-05,0.015158,-0.040734,0.0035546,0.0025144,0.034535,0.00089668,0.019889,-0.040188,3.9903e-05,2.0809e-05,0.013558,-0.0017287,0.013042,-0.013312,0.00018327,9.4864e-05,0.019481,-0.0016625,0.017212,-0.018815,0.00041446,0.0002132,0.021857,-0.0017575,0.020352,-0.024531,0.4005,74,74,40,988,3,3,3,0.645
26,-0.0041021,0.02032,0.029316,-0.98522,0.0017871,-1.9399,0.96904,-2.9288,26.543,-0.028993,2.9172,0.017171,1.5076,8.7817,0.029411,17.362,0.01768,0.98528,0.079765,0.037746,0.028923,0.023783,0.24892,0.31183,0.36216,0.039139,0.0086239,0.0050929,0.024246,0.42408,0.29618,0.045081,36.509,796.12,1924.3,2359.2,5116.8,0.3862,0.52536,0.52536,1.008,1.1481,0.46653,0.22598,0.020875,58,20.241,847,12096,7.1371,53.247,22869,2322,1755,0.91543,0.94404,0.087947,0.060049,0.028959,0.50212,21443,12795,0.00090642,0.00041489,0,0.066659,0,0.077793,0.010788,0.03005,0.014883,0.064407,0.85611,2.2572,1.5373,0.19968,0.35076,0.29488,0.26968,0.281,0.16124,0.28121,0.27281,0.1605,20.67,7.9619,15821,23415,22581,0.27251,0.25856,0.053262,0.65064,0.67736,0.066864,0.84536,0.87563,0.061569,0.91372,0.93312,0.053221,0.93116,0.9464,0.046371,0.039155,0.053932,0.19508,0.11135,0.1421,0.26186,0.081034,0.10968,0.19118,0.1438,0.18526,0.32198,0.1289,0.16974,0.18007,0.1676,0.2197,0.3541,0.0042289,0.0038406,0.047941,0.015611,0.059929,-0.024693,0.011803,0.010851,0.061409,0.027955,0.081729,-0.0295,0.023068,0.021382,0.069574,0.040358,0.1034,-0.034645,0.034073,0.049377,0.33164,0.13477,0.1341,0.28915,0.071013,0.10113,0.34158,0.18085,0.1793,0.35772,0.11183,0.15543,0.32747,0.21307,0.21175,0.39855,0.00085268,0.00071454,0.087324,0.013016,0.027792,-0.020978,0.0027153,0.0024749,0.086992,0.018301,0.038591,-0.015587,0.0053859,0.0053459,0.085607,0.023397,0.050486,-0.0016821,0.3939,74,74,40,988,3,3,3,0.645
26,-0.0034087,0.019419,0.026927,-0.98643,0.003832,-1.9,0.92612,0.56115,3.1822,0.11481,3.2689,1.4521e-05,0.45596,2.8324,0.025863,3.5119,0.0035763,0.98705,0.12869,0.081477,0.067256,0.057114,0.242,0.31847,0.32102,0.040199,0.012806,0.0093437,0.056156,0.37275,0.27925,0.0031963,35.952,387.43,596.17,449.6,1469.8,0.10661,0.09018,0.10661,0.93742,1.0667,0.34145,0.20178,0.018994,41,99.585,1735,1.2746e+05,4.0866,18.086,46845,42309,6804,0.90731,0.93126,0.32249,0.25659,0.15562,0.84955,60992,24708,0.00088772,0.00041968,0,0.051754,0,0.04229,0.0051403,0.011378,0.0043114,0.010273,0.011236,0.9799,1.1788,0.21098,0.40399,0.2815,0.24875,0.47799,0.20668,0.26996,0.48891,0.18453,38.924,7.6006,20827,63468,62724,0.059857,0.048885,0.025433,0.27521,0.25955,0.061486,0.52895,0.5317,0.083751,0.72934,0.74898,0.092355,0.86944,0.89164,0.094128,0.0017806,0.0012672,0.019286,-0.00072327,0.039319,-0.041633,0.0055757,0.0041789,0.028597,0.0040785,0.054119,-0.051119,0.012354,0.010072,0.037518,0.01105,0.06937,-0.050003,0.0013587,0.0010148,0.033485,0.003461,0.042007,-0.032721,0.0043181,0.0033606,0.04884,0.010245,0.054885,-0.040059,0.0094622,0.0080268,0.062042,0.018843,0.069284,-0.035551,0.00042192,0.00025242,0.0089277,-0.0034618,0.014856,-0.02618,0.0012576,0.00081831,0.013151,-0.0029366,0.021634,-0.032897,0.0028622,0.0020286,0.018221,-0.0012945,0.027842,-0.038593,0,0,0,-0.0024074,0.007086,0,0,0,0,-0.0033994,0.010638,0,2.9793e-05,1.6792e-05,0.0010295,-0.0042088,0.014298,-0.012242,0.41029,74,74,40,988,3,3,3,0.645
26,-0.0031697,0.015571,0.022585,-0.98863,0.0011589,-1.9516,0.974,0.052182,2.9378,-0.00035415,3.306,1.204e-05,0.46323,3.0816,0.022551,3.8701,0.003941,0.98871,0.05519,0.030935,0.025816,0.021992,0.30025,0.34476,0.30083,0.02309,0.0050126,0.0037772,0.022284,0.45633,0.28973,0.0025609,140.77,2908.3,4183.9,3358.1,10592,0.087919,0.11621,0.11621,0.56931,0.95023,0.25502,0.1879,0.01717,44,82.023,2154,1.0901e+05,5.6866,35.57,58158,14175,6912,0.90922,0.93073,0.31787,0.2548,0.14109,0.84515,63500,26351,0.00088659,0.00044408,0,0.12891,0,0.10614,0.0033444,0.0036312,0.003194,0.00035696,0.2315,1.1462,0.32789,0.19327,0.41215,0.3017,0.21577,0.47893,0.26119,0.21277,0.50372,0.25175,57.951,8.1458,29470,93864,93372,0.044551,0.030464,0.018798,0.23237,0.18388,0.051553,0.45665,0.39897,0.071801,0.62394,0.57221,0.078459,0.73575,0.69299,0.079101,0.015242,0.016648,0.16394,0.058803,0.077107,0.027065,0.028697,0.03258,0.14616,0.067927,0.098851,0.049972,0.043861,0.051209,0.13228,0.074989,0.11788,0.074552,0.011196,0.013702,0.27402,0.070695,0.089315,0.057367,0.021759,0.027393,0.2444,0.082674,0.11145,0.083229,0.033758,0.043358,0.21981,0.091745,0.13076,0.11033,0.003575,0.0025761,0.075121,0.015534,0.022994,-0.039378,0.0067255,0.0048413,0.069841,0.018252,0.030506,-0.049322,0.009868,0.0069713,0.062384,0.019036,0.035554,-0.059777,0.00047077,0.00036974,0.10408,0.0095451,0.014018,-0.016637,0.0019308,0.0016607,0.13355,0.018253,0.025775,-0.015955,0.0042489,0.0038799,0.1458,0.026344,0.037617,-0.013507,0.3811,74,74,40,988,3,3,3,0.645
26,-0.0034333,0.016378,0.023947,-0.98794,0.00093543,-1.9564,0.98027,0.15755,3.3082,0.069559,3.2667,3.9026e-05,0.6602,4.2502,0.02408,5.5795,0.0056817,0.98795,0.047571,0.020939,0.015483,0.012473,0.30444,0.30424,0.34529,0.025246,0.0053346,0.002968,0.01249,0.4506,0.22149,0.0050875,120.67,2715.8,7191.6,11309,21337,0.08142,0.10958,0.10958,0.27104,0.36424,0.14785,0.1952,0.019073,42,73.119,1781,76396,5.6256,34.8,48087,6777,6264,0.91083,0.93756,0.29776,0.21846,0.18825,0.87341,45823,20348,0.00086241,0.00042564,0,0.081523,0,0.070981,0.0028484,0.00098197,0.0035112,0.0006898,0.12889,0.47087,0.36323,0.18907,0.41109,0.29572,0.21144,0.50038,0.22448,0.21306,0.51462,0.21085,44.314,7.9845,17398,37250,36044,0.062202,0.058537,0.022853,0.29571,0.29878,0.057125,0.57988,0.59633,0.07939,0.77703,0.79376,0.085077,0.88212,0.8972,0.082576,0.0027271,0.0020789,0.025541,0.0032287,0.03705,-0.04269,0.0061296,0.0046053,0.027184,0.0052128,0.050714,-0.060153,0.010512,0.0078585,0.027605,0.0067751,0.063665,-0.075765,0.0024809,0.0019139,0.052868,0.010362,0.044028,-0.037833,0.005137,0.0039343,0.050239,0.012683,0.055367,-0.050572,0.0084082,0.0064151,0.047671,0.014546,0.066274,-0.063041,9.5165e-05,6.3518e-05,0.0017412,-0.0050476,0.0083241,-0.020871,0.0004073,0.00027334,0.0036828,-0.0057955,0.013213,-0.024323,0.00095912,0.00065682,0.0052795,-0.0063468,0.017478,-0.030844,0.00015111,0.00010153,0.02909,0.0013371,0.014091,-0.025239,0.00058533,0.00039767,0.035251,0.0029565,0.020804,-0.027098,0.001145,0.00078656,0.03421,0.0036136,0.028124,-0.030586,0.3622,74,74,40,988,3,3,3,0.645
26,-0.0037181,0.021791,0.030146,-0.9848,0.0046627,-1.8902,0.91942,-0.98351,6.0458,-0.052493,3.1962,0.0017795,1.0336,5.9844,0.029769,8.1915,0.0083247,0.9851,0.16641,0.093512,0.069754,0.054683,0.20366,0.2645,0.36928,0.065117,0.023141,0.01522,0.059074,0.30853,0.21968,0.050086,10.163,94.282,200.92,367.84,673.78,0.2084,0.32562,0.32562,0.46403,0.63698,0.29691,0.2161,0.023022,41,37.463,916,21983,5.159,29.986,24732,8073,5049,0.91488,0.94441,0.16254,0.12517,0.063735,0.77394,21650,13421,0.0010362,0.00042138,1,0.16509,0,0.07584,0.05807,0.28706,0.098593,0.48935,0.026372,2.3107,2.5115,0.22553,0.33709,0.28751,0.33833,0.31789,0.14351,0.38339,0.26289,0.1191,25.535,7.7628,28133,57735,57234,0.23206,0.23708,0.047088,0.51726,0.54267,0.055187,0.69074,0.74242,0.052229,0.7861,0.83408,0.047537,0.84332,0.87259,0.043601,0.07636,0.077603,0.39497,0.22694,0.17833,0.009474,0.15373,0.15523,0.37654,0.28502,0.22917,0.0074623,0.23888,0.24,0.34644,0.32481,0.26876,0.0044848,0.049494,0.051379,0.58253,0.22931,0.17389,0.017316,0.098455,0.10299,0.53179,0.27679,0.21574,0.027069,0.15394,0.16124,0.48202,0.3122,0.24993,0.033889,0.021876,0.02233,0.22105,0.086702,0.074978,0.0060899,0.044588,0.044492,0.22266,0.11372,0.098931,-0.00080878,0.068828,0.068042,0.20925,0.1311,0.11703,-0.0050832,0.0049894,0.0038947,0.53049,0.085647,0.061853,-0.0363,0.013791,0.010805,0.45872,0.10426,0.081231,-0.047766,0.024424,0.019558,0.40304,0.11888,0.099461,-0.053527,0.37705,74,74,40,988,3,3,3,0.645
26,-0.0023437,0.014343,0.019568,-0.99016,0.0036035,-1.8845,0.90324,-2.3648,14.033,-0.061824,2.9588,0.011511,1.4592,10.772,0.018317,17.477,0.017761,0.99083,0.18222,0.092357,0.064316,0.048821,0.31541,0.23105,0.27769,0.079387,0.027516,0.015837,0.053106,0.47593,0.10584,0.013907,7.6475,79.966,212.91,546.21,847.33,0.26581,0.45586,0.45586,0.47355,0.65453,0.27019,0.17478,0.013814,87,16.333,388,3562.2,5.0496,29.223,10476,9963,4725,0.91602,0.94668,0.14254,0.089805,0.13529,1.6243,20251,12572,0.00061592,0.00031344,0,0.041196,0,0.066986,0.0013823,0.0020961,0.0247,0.038312,1.1069,0.71832,0.26972,0.18294,0.34217,0.34864,0.22169,0.3445,0.31061,0.22514,0.35035,0.30307,17.761,9.4133,6734,9865.7,7726.9,0.17065,0.16865,0.03944,0.35008,0.34512,0.042541,0.52951,0.52983,0.045601,0.66148,0.66586,0.045559,0.73485,0.73991,0.043272,0.038026,0.042467,0.22402,0.11752,0.11797,0.15937,0.075528,0.08348,0.2107,0.1453,0.1551,0.1844,0.1178,0.1287,0.19458,0.16581,0.18716,0.19741,0.013214,0.013949,0.17714,0.062232,0.076178,0.045412,0.027349,0.02906,0.16825,0.078001,0.10059,0.064986,0.044515,0.047389,0.15876,0.091367,0.12373,0.081809,0.021345,0.024122,0.24567,0.090243,0.079011,0.13158,0.043636,0.049066,0.24819,0.11874,0.10737,0.16187,0.067941,0.075758,0.23525,0.13811,0.12979,0.17962,0.0034663,0.0043955,0.41976,0.063007,0.061191,0.12665,0.0096558,0.011838,0.3658,0.077211,0.07864,0.14815,0.017887,0.021432,0.33618,0.092108,0.09592,0.1631,0.46124,74,74,40,988,3,3,3,0.645
26,-0.0023988,0.012963,0.018254,-0.99082,0.0021052,-1.9228,0.94057,0.99499,9.1065,0.025352,3.1687,0.0032613,1.1357,8.7262,0.016904,13.991,0.014218,0.99153,0.14135,0.068679,0.04859,0.037019,0.34748,0.21864,0.29962,0.064592,0.019435,0.011535,0.038699,0.50864,0.076448,0.0025757,12.91,175.12,426.92,1078.3,1693.8,0.11414,0.21463,0.21463,0.62239,0.94354,0.34875,0.16634,0.011808,76,14.737,202,1337.1,3.3297,15.345,5454,5400,2808,0.91629,0.94634,0.12652,0.079668,0.10037,0.62184,17372,11944,0.00056721,0.00029387,0,0.042901,0,0.061836,0.0059151,0.013759,0.030583,0.10066,0.56577,0.27976,0.77247,0.18692,0.34513,0.34631,0.23816,0.31836,0.34589,0.25113,0.3108,0.33855,18.262,9.3503,5743.9,7836.5,5523.2,0.10145,0.10338,0.019351,0.27874,0.2813,0.027957,0.4628,0.46336,0.032896,0.57488,0.57821,0.03268,0.64686,0.6506,0.031439,0.025981,0.026712,0.12633,0.071052,0.094572,0.029007,0.049134,0.050039,0.11313,0.083141,0.1215,0.023701,0.073646,0.074279,0.10041,0.090556,0.14553,0.013039,0.022473,0.023354,0.24864,0.098786,0.1064,0.037403,0.041637,0.042684,0.21142,0.11047,0.12932,0.029311,0.061284,0.06211,0.18039,0.11659,0.15009,0.018368,0.0034031,0.003271,0.032327,0.0096923,0.029399,-0.014319,0.0072826,0.007215,0.034188,0.013643,0.042441,-0.004782,0.012625,0.012595,0.03608,0.018071,0.054653,-0.0014711,0.0001052,8.6954e-05,0.010514,0.00018054,0.023809,-0.018292,0.00036424,0.0003032,0.011389,0.00046453,0.031249,-0.018829,0.00066843,0.00057319,0.010369,0.00028655,0.038765,-0.020509,0.4398,74,74,40,988,3,3,3,0.645
26,-0.0036209,0.017638,0.025631,-0.98709,0.0012338,-1.9501,0.97563,-0.35545,3.5369,-0.12497,3.2585,0.00012771,0.61003,3.8031,0.025676,4.9111,0.0050012,0.98715,0.06235,0.032124,0.025513,0.0211,0.27044,0.35428,0.31419,0.028693,0.0065012,0.0043871,0.021508,0.40336,0.30836,0.00075108,89.92,1775.6,3295.5,3649,8810.7,0.10724,0.10831,0.10831,0.14247,0.23138,0.11107,0.20028,0.019639,44,76.227,2928,1.9243e+05,6.3847,41.853,79056,2457,1917,0.91115,0.93402,0.24386,0.19679,0.085922,0.72219,50894,17708,0.0013861,0.00047198,0,0.1082,0,0.087322,0.0048534,0.017344,0.0072597,0.012245,0.019882,0.57899,0.40521,0.18688,0.37041,0.30454,0.19068,0.39409,0.25433,0.18091,0.39413,0.27901,49.687,8.2225,32204,99473,98972,0.16802,0.13704,0.060818,0.40835,0.41591,0.077717,0.62475,0.66575,0.084266,0.78437,0.8261,0.08461,0.88213,0.90948,0.081355,0.015928,0.012674,0.14696,0.057187,0.064407,-0.060806,0.034369,0.028613,0.15017,0.077307,0.089549,-0.065891,0.057228,0.04917,0.14805,0.094449,0.11241,-0.068351,0.010087,0.0073777,0.21178,0.058369,0.058808,-0.062032,0.021085,0.015502,0.20316,0.073866,0.075228,-0.08057,0.034752,0.026094,0.19411,0.087604,0.091482,-0.092498,0.0032183,0.0023477,0.05801,0.01238,0.022751,-0.037777,0.0077813,0.0060324,0.069317,0.020661,0.034721,-0.042733,0.013818,0.011429,0.074935,0.028202,0.04615,-0.041343,0.0026225,0.0029485,0.49739,0.059313,0.055401,0.017091,0.0072165,0.008205,0.42818,0.071663,0.071001,0.025221,0.013105,0.014683,0.38575,0.08364,0.084796,0.027639,0.3798,74,74,40,988,3,3,3,0.645
26,-0.0042361,0.023205,0.032676,-0.98351,0.0037438,-1.909,0.94097,1.1569,6.8686,0.070805,3.1835,0.0011161,1.0331,5.7122,0.032643,8.1622,0.0082949,0.98366,0.15778,0.081529,0.060505,0.048696,0.21746,0.33264,0.30977,0.062623,0.01885,0.010919,0.04775,0.36139,0.34449,0.01487,9.9,137.96,359.17,536.22,1044,0.22733,0.30438,0.30438,0.32626,0.71721,0.23727,0.2333,0.025662,53,28.981,1130,23658,6.85,48.899,30510,3456,2349,0.91723,0.94532,0.0016382,0.0011153,0.0419,0.25558,24997,14195,0.00086606,0.00040253,0,0.062947,0,0.060669,0.0082302,0.0089367,0.013343,0.020361,0.5708,1.1022,1.0239,0.19666,0.36132,0.28527,0.25258,0.37103,0.1135,0.26305,0.33703,0.094834,22.593,7.7022,14596,24072,23025,0.27734,0.29751,0.061924,0.65497,0.70827,0.076893,0.81717,0.85113,0.06799,0.89022,0.91214,0.059235,0.93232,0.9464,0.053039,0.0071513,0.0059032,0.040702,0.016668,0.052134,-0.047082,0.014747,0.012077,0.039747,0.021278,0.071634,-0.062402,0.02333,0.01906,0.037231,0.024102,0.088724,-0.07606,0.0052932,0.0045429,0.068551,0.021963,0.051791,-0.032488,0.010849,0.0091877,0.064478,0.027029,0.067513,-0.045312,0.017065,0.014325,0.058798,0.030117,0.081577,-0.056615,0.0018578,0.0013599,0.020656,0.0037603,0.022997,-0.037852,0.0038901,0.0028827,0.021376,0.0052622,0.033949,-0.044967,0.0062271,0.0047061,0.020831,0.0061327,0.043953,-0.052448,4.1963e-07,3.2494e-07,4.9094e-05,-0.0017286,0.0099913,-0.01093,1.4281e-05,1.1059e-05,0.00052269,-0.0023359,0.013599,-0.01093,8.9448e-05,6.9245e-05,0.0016242,-0.002723,0.017045,-0.011497,0.40857,74,74,40,988,3,3,3,0.645
26,-0.0045022,0.021408,0.031321,-0.9842,0.0011606,-1.95,0.9813,-0.12606,6.2277,0.012169,3.218,0.0016335,1.0159,5.7222,0.031457,8.1979,0.0083481,0.98425,0.040101,0.018406,0.015107,0.012748,0.23334,0.32981,0.39734,0.020987,0.0032698,0.0023511,0.012898,0.35399,0.30058,0.052025,171.48,6421.8,10269,9495.6,26359,0.13959,0.20481,0.20481,1.0472,1.2124,0.42015,0.23263,0.025458,67,47.224,1244,28819,5.6123,37.433,33588,15282,8775,0.91425,0.94361,0.24767,0.16232,0.1957,0.77329,25084,17636,0.00080869,0.00042667,0,0.045708,0,0.060193,0.0028,0.011567,0.012847,0.057362,0.20649,1.3035,0.95668,0.18621,0.40145,0.29723,0.19163,0.53374,0.18293,0.1899,0.54685,0.17605,30.415,8.0252,5849.6,11084,9361.2,0.11263,0.10715,0.044139,0.39619,0.39815,0.081642,0.64613,0.66013,0.094362,0.81472,0.82787,0.095156,0.90854,0.91701,0.090723,0.0024649,0.0022082,0.024625,0.00222,0.051123,-0.035151,0.0065782,0.006016,0.03112,0.0065805,0.07069,-0.039418,0.013232,0.01238,0.037064,0.01232,0.089983,-0.039509,0.0011702,0.0010209,0.0266,0.0020804,0.041233,-0.031866,0.0031247,0.002781,0.032598,0.0050556,0.05663,-0.035636,0.0059543,0.0053753,0.03601,0.0079357,0.071835,-0.038954,0.0012578,0.0011515,0.024548,0.0015244,0.029458,-0.018969,0.0032243,0.0030124,0.031099,0.0045177,0.040481,-0.02042,0.0066342,0.0063777,0.038955,0.0092967,0.05103,-0.016845,3.6935e-05,3.5747e-05,0.0075847,-0.0014077,0.016154,-0.0028412,0.00022929,0.00022265,0.01473,-0.00078736,0.023794,-0.0033434,0.00064349,0.00062653,0.020509,0.00023895,0.031749,-0.0040291,0.42459,74,74,40,988,3,3,3,0.645
26,-0.0056338,0.028786,0.04144,-0.97904,0.0029714,-1.9223,0.96348,-0.96984,8.4193,-0.012173,3.1765,0.0035132,1.2234,5.9813,0.041752,8.2082,0.0083417,0.9791,0.12654,0.068268,0.048593,0.037643,0.18054,0.23371,0.46243,0.053164,0.019283,0.011049,0.039827,0.25785,0.16493,0.15638,16.227,136.57,364.65,798.83,1316.9,0.1906,0.30365,0.30365,0.49321,0.60066,0.21291,0.2566,0.030447,44,38.909,773,17568,4.558,23.609,20871,12501,2916,0.91561,0.94713,0.18482,0.11543,0.13509,0.84415,24441,16495,0.00050299,0.00028687,0,0.05168,0,0.075597,0.0045219,0.0021673,0.026122,0.052667,1.5418,3.3125,2.0199,0.16503,0.33076,0.39557,0.12953,0.2321,0.59019,0.13096,0.22678,0.59692,29.612,10.681,6789.9,9362.8,5624.8,0.080902,0.080911,0.016863,0.14898,0.14849,0.016328,0.2069,0.2036,0.01607,0.28647,0.27894,0.017795,0.40849,0.3994,0.021695,0.012875,0.014115,0.068412,0.033793,0.072036,0.096701,0.02454,0.026554,0.061744,0.039459,0.094702,0.10471,0.037755,0.040383,0.056247,0.043755,0.11528,0.10552,0.011817,0.013173,0.14287,0.052388,0.075539,0.10948,0.022082,0.024343,0.12252,0.058734,0.094991,0.12344,0.03367,0.036703,0.1083,0.063952,0.11293,0.12823,0.00062998,0.00053512,0.0065393,-0.0015358,0.024965,-0.03364,0.0013353,0.0011444,0.0068497,-0.0018353,0.03577,-0.042287,0.0024829,0.0021502,0.0077539,-0.001671,0.045452,-0.054266,0.00042865,0.00040686,0.046817,0.0059258,0.027749,-0.011732,0.0011236,0.0010674,0.038393,0.0064358,0.035308,-0.013835,0.0016536,0.0015802,0.028031,0.0052848,0.042433,-0.013495,0.3806,74,74,40,988,3,3,3,0.645
26,-0.003569,0.016976,0.024748,-0.98754,0.0010625,-1.9536,0.9783,0.93905,7.2999,0.08327,3.1988,0.0024183,0.78198,4.9571,0.024834,7.1619,0.0072931,0.98757,0.049197,0.017735,0.013381,0.010609,0.30965,0.28805,0.35469,0.029915,0.0042861,0.0027482,0.010659,0.4563,0.20713,0.0098608,79.764,4114.4,8042.2,14958,27195,0.15533,0.28456,0.28456,1.0865,2.0958,0.52757,0.1999,0.018892,49,34.918,468,8433.6,3.1135,12.515,12636,8694,7884,0.91415,0.94397,0.1357,0.086239,0.078779,0.7033,27719,15599,0.00070473,0.0003757,0,0.038746,0,0.055287,0.0086571,0.013365,0.02325,0.03893,0.55565,0.61183,0.42544,0.19882,0.36827,0.28225,0.25262,0.3975,0.17312,0.25451,0.3995,0.16897,24.898,7.6208,6957.4,9677.8,6704.1,0.16747,0.16754,0.038242,0.45319,0.4521,0.054412,0.63156,0.63052,0.053739,0.7498,0.74991,0.051024,0.8414,0.84354,0.048954,0.002934,0.0027511,0.017078,0.0032062,0.053875,-0.037476,0.0090602,0.0086536,0.024973,0.010021,0.077701,-0.039365,0.019139,0.018442,0.031237,0.018147,0.10142,-0.041251,0.0019024,0.0017824,0.025196,0.0052455,0.057822,-0.032418,0.0063204,0.006047,0.038418,0.013564,0.08069,-0.032713,0.013628,0.013112,0.048021,0.022904,0.10322,-0.036445,0.00075861,0.0007133,0.0086265,-0.0010413,0.017936,-0.014757,0.001441,0.001383,0.0080981,-0.0016221,0.025275,-0.01159,0.002231,0.0021418,0.0076327,-0.0022848,0.032601,-0.013913,0.00027305,0.00025534,0.03267,0.0033154,0.018924,-0.01955,0.0013012,0.0012256,0.048704,0.0081961,0.028185,-0.021225,0.0033255,0.0032257,0.061754,0.014393,0.03823,-0.014322,0.39073,74,74,40,988,3,3,3,0.645
