-0.1477018599  
-0.2145333551  
-0.2712472039  
-0.3112925655  
-0.3303918222  
-0.3271077104  
-0.3030411513  
-0.2626266197  
-0.2125700181  
-0.1610035749  
-0.1164835407  
-0.08696634884  
-0.07889382449  
-0.09650800434  
-0.1414679827  
-0.2128013488  
-0.3071813043  
-0.419463461  
-0.5433982557  
-0.6724112558  
-0.8003375163  
-0.9220171812  
-1.033684926  
-1.133118019  
-1.219550661  
-1.2933953  
-1.355835621  
-1.408371424  
-1.452390466  
-1.488828878  
-1.517956722  
-1.539298842  
-1.551670636  
-1.553297012  
-1.541973705  
-1.515231771  
-1.470483561  
-1.405149231  
-1.316767654  
-1.203123828  
-1.062415794  
-0.893478319  
-0.6960705797  
-0.4712094788  
-0.2215045678  
0.04855721591  
0.3324442832  
0.6216033488  
0.9057084184  
1.173175684  
1.411926729  
1.610350885  
1.758389679  
1.848623269  
1.877230285  
1.844687511  
1.75609674  
1.621051469  
1.453016196  
1.268237264  
1.084271139  
0.9182665428  
0.7851814413  
0.6961361026  
0.6571037189  
0.6681182179  
0.7231169387  
0.8104783461  
0.9142204582  
1.015746762  
1.095945279  
1.137391863  
1.126387645  
1.054568815  
0.9198786607  
0.7267792264  
0.4856811542  
0.2116783635  
-0.07722031558  
-0.3621131274  
-0.6251932378  
-0.8514442461  
-1.029839071  
-1.153934042  
-1.221854908  
-1.23576033  
-1.200954318  
-1.124840619  
-1.015906916  
-0.8828902271  
-0.7341980902  
-0.5775842596  
-0.4200239464  
-0.2676743513  
-0.1258214672  
0.001273492085  
0.1106565009  
0.2010556691  
0.2732516653  
0.3303163382  
0.3775814534  
0.4222349727  
0.4725166732  
0.5365512857  
0.620970229  
0.7295188141  
0.8619025679  
1.013099166  
1.173327548  
1.328747643  
1.462868401  
1.558498753  
1.599989137  
1.575432527  
1.478490438  
1.309548706  
1.076004984  
0.7916175019  
0.4750054744  
0.1474988789  
-0.1693270358  
-0.4560847852  
-0.6976167197  
-0.8843740763  
-1.01296734  
-1.085871675  
-1.110399787  
-1.097169759  
-1.058355684  
-1.006014501  
-0.9507454189  
-0.9008361326  
-0.8619553768  
-0.8373250053  
-0.82823116  
-0.8346694802  
-0.8559319536  
-0.8909655845  
-0.9384201367  
-0.9963924291  
-1.061949831  
-1.130599975  
-1.195885084  
-1.249288379  
-1.280569751  
-1.278580301  
-1.232509759  
-1.133410701  
-0.9757994684  
-0.759060824  
-0.4884163933  
-0.1752416996  
0.1633896766  
0.5059460059  
0.8283697479  
1.106483606  
1.318590653  
1.447935771  
1.484706939  
1.427304089  
1.282700964  
1.06583621  
0.7980977548  
0.5050914279  
0.2139635882  
-0.04939308628  
-0.2629081532  
-0.4103867258  
-0.4828192022  
-0.4788281262  
-0.4042525559  
-0.2709623858  
-0.09510730885  
0.1049544178  
0.3107701446  
0.5056883549  
0.6763228919  
0.8134446676  
0.9122490903  
0.9720354895  
0.9954072107  
0.9871677443  
0.9531085926  
0.8988864577  
0.8291629191  
0.747111063  
0.654346435  
0.5512457888  
0.4375678679  
0.3132322679  
0.1790948418  
0.03755038886  
-0.1071675362  
-0.2490724861  
-0.3809206993  
-0.4950624308  
-0.5845330015  
-0.6442257694  
-0.6719486296  
-0.6691864443  
-0.6414021308  
-0.5977800191  
-0.5503834952  
-0.5127824255  
-0.4983049892  
-0.5181207721  
-0.5794249163  
-0.6839902058  
-0.8273289238  
-0.9986308969  
-1.181541136  
-1.355714112  
-1.498971285  
-1.589783551  
-1.609748253  
-1.545726431  
-1.391354631  
-1.147741622  
-0.8232835469  
-0.4326714961  
0.004730908334  
0.4668676245  
0.9310277652  
1.375663402  
1.781772664  
2.133734535  
2.419590655  
2.630871606  
2.762141452  
2.810455391  
2.774922463  
2.65650167  
2.458084035  
2.184826119  
1.8446121  
1.448484702  
1.010854916  
0.549340344  
0.0841303571  
-0.3631310402  
-0.7708696285  
-1.119352198  
-1.392491966  
-1.579440533  
-1.675752178  
-1.683933167  
-1.613285503  
-1.479039141  
-1.30085507  
-1.100872569  
-0.901515952  
-0.7233119491  
-0.5829478613  
-0.4917750889  
-0.4548865053  
-0.4708423333  
-0.5320256861  
-0.6255604239  
-0.7346661097  
-0.8403008199  
-0.9229320957  
-0.9642888183  
-0.9489688941  
-0.8658003963  
-0.7088903727  
-0.4782992498  
-0.1803149908  
0.1727097114  
0.5629621498  
0.9682280196  
1.363361038  
1.722115326  
2.01922093  
2.232553783  
2.34520629  
2.3472415  
2.236926342  
2.021260147  
1.715692738  
1.342999814  
0.9313889165  
0.5120008633  
0.1160537543  
-0.2280673755  
-0.497465002  
-0.6768272904  
-0.7597391943  
-0.7490595189  
-0.656320002  
-0.5002205385  
-0.304389819  
-0.09466907713  
0.1037710001  
0.2691560911  
0.3853644907  
0.4434571219  
0.442314835  
0.3883144567  
0.2940955476  
0.1765759203  
0.05447889682  
-0.05431537723  
-0.1352496529  
-0.1790763585  
-0.1830993352  
-0.1515079731  
-0.09477152489  
-0.02818497844  
0.03023598338  
0.06221687098  
0.0517207522  
-0.01284922919  
-0.1370186292  
-0.3193784603  
-0.5515795612  
-0.8191685904  
-1.103140248  
-1.3820085  
-1.634132013  
-1.840018547  
-1.984347408  
-2.057482341  
-2.056321717  
-1.984411249  
-1.851331315  
-1.671450489  
-1.462219044  
-1.242203393  
-1.029106958  
-0.8380065879  
-0.679993609  
-0.5613692855  
-0.4834531378  
-0.4429949965  
-0.4330943648  
-0.4444767416  
-0.4669242823  
-0.4906503573  
-0.5074274594  
-0.5113150651  
-0.4989209132  
-0.4691932027  
-0.4228361206  
-0.3615013823  
-0.2869411742  
-0.2003161006  
-0.1018074499  
0.009377761366  
0.1346121667  
0.2751431194  
0.4312424  
0.6013901685  
0.7817025264  
0.9657411868  
1.144799436  
1.308655482  
1.446703972  
1.549304  
1.609143157  
1.62240785  
1.589578899  
1.515729352  
1.41026769  
1.286144424  
1.158616573  
1.043699031  
0.9564828189  
0.9094965234  
0.9112941386  
0.9654157545  
1.069847012  
1.217040511  
1.394525966  
1.586058952  
1.773212245  
1.937247274  
2.061060498  
2.130986541  
2.138223323  
2.079704157  
1.958287324  
1.782229436  
1.564015588  
1.318696118  
1.06196384  
0.8082397272  
0.5690269302  
0.3517531381  
0.1592367262  
-0.01017317046  
-0.1618453713  
-0.3036334795  
-0.4443622461  
-0.5922431514  
-0.753428289  
-0.9308693855  
-1.123603031  
-1.326508665  
-1.530555357  
-1.723480258  
-1.890832875  
-2.017279597  
-2.0880562  
-2.090451311  
-2.015188605  
-1.857598217  
-1.618456866  
-1.304416077  
-0.9279507155  
-0.5068128712  
-0.0629976749  
0.3787120753  
0.7925233117  
1.153606396  
1.440091467  
1.634918353  
1.727347071  
1.713957677  
1.598997056  
1.39398598  
1.116579166  
0.7887549275  
0.4345231304  
0.07739697714  
-0.262043249  
-0.5681837073  
-0.8317177243  
-1.05010491  
-1.227084215  
-1.371320088  
-1.494396912  
-1.608485099  
-1.724035023  
-1.847871478  
-1.981952132  
-2.122964822  
-2.262775011  
-2.389610675  
-2.489750123  
-2.549427689  
-2.556656775  
-2.502718815  
-2.383153143  
-2.19817901  
-1.952574357  
-1.655126431  
-1.31779478  
-0.9547360803  
-0.58132359  
-0.2132380182  
0.1343410572  
0.447445151  
0.7139651385  
0.924262279  
1.071754649  
1.153452541  
1.170385428  
1.12783455  
1.035278321  
0.9059779805  
0.7561550492  
0.6037848392  
0.4670778991  
0.3627826341  
0.3044969386  
0.3011809802  
0.3560699739  
0.4661450272  
0.6222568618  
0.8099267263  
1.010757  
1.204315138  
1.370280078  
1.490612789  
1.551498648  
1.544836249  
1.469099314  
1.329477749  
1.13728707  
0.9087287288  
0.6631577398  
0.4210628682  
0.2020032947  
0.0227233703  
-0.1043537841  
-0.1721187181  
-0.1791803139  
-0.1296764219  
-0.03256399119  
0.09951798148  
0.2516635545  
0.4082432934  
0.5544306116  
0.6775705877  
0.7682881947  
0.8212424075  
0.8354804693  
0.8143634396  
0.7650718616  
0.6977434955  
0.6243077195  
0.5571304629  
0.507604807  
0.4848209745  
0.4944746884  
0.5381301495  
0.6129396426  
0.7118587224  
0.8243521835  
0.9375083847  
1.037450515  
1.110867178  
1.14649183  
1.136343451  
1.076589424  
0.9679268119  
0.8154454986  
0.6280051982  
0.4172129623  
0.1961429497  
-0.02204675685  
-0.2254208488  
-0.4043631065  
-0.55234728  
-0.6663221235  
-0.7467122843  
-0.7970696962  
-0.8234588665  
-0.8336778702  
-0.8364038025  
-0.840360084  
-0.8535623341  
-0.8826747992  
-0.9324955397  
-1.005556909  
-1.101842215  
-1.218621294  
-1.350414449  
-1.489127255  
-1.624393238  
-1.744159198  
-1.835532675  
-1.885872465  
-1.884051999  
-1.821791751  
-1.694901673  
-1.50427177  
-1.256434968  
-0.963568555  
-0.6428548694  
-0.3152000575  
-0.003389216706  
0.2701459034  
0.4857116264  
0.6286109568  
0.6909855867  
0.6729927565  
0.583127866  
0.4376105037  
0.2588585298  
0.0731954517  
-0.09196847496  
-0.2111596071  
-0.2637277323  
-0.236245462  
-0.124144693  
0.06762131977  
0.3249661241  
0.6260779745  
0.9436846559  
1.247920675  
1.509481197  
1.702699871  
1.808226056  
1.815011569  
1.721412969  
1.535306563  
1.273230706  
0.9586654777  
0.619644014  
0.2859545232  
-0.01378263127  
-0.254876489  
-0.4188963622  
-0.4953607921  
-0.4826267804  
-0.3879144636  
-0.226466283  
-0.01993936051  
0.2058146928  
0.4233545575  
0.6063872677  
0.7323658813  
0.7846916471  
0.7542993227  
0.6404707612  
0.4507978482  
0.200302573  
-0.09019009066  
-0.3962395596  
-0.6923056375  
-0.9543122953  
-1.161977858  
-1.300666321  
-1.362567385  
-1.347105256  
-1.260564936  
-1.115029455  
-0.9267852387  
-0.7144254864  
-0.4968829208  
-0.2916248002  
-0.1131954887  
0.02777470187  
0.125037265  
0.1766974106  
0.1847554238  
0.1543475915  
0.09281044773  
0.008711259166  
-0.08905098001  
-0.1919805894  
-0.292520103  
-0.3843646539  
-0.4625881395  
-0.5236127929  
-0.5650882707  
-0.5857251556  
-0.5851420826  
-0.5637480345  
-0.5226760398  
-0.4637660191  
-0.3895684163  
-0.3033390579  
-0.2089952179  
-0.1109958082  
-0.01413285388  
0.07676777262  
0.15722045  
0.2234908433  
0.2729953062  
0.3046306745  
0.3189746145  
0.3183197172  
0.3065089604  
0.2885827761  
0.2702701421  
0.2573850087  
0.2552127094  
0.2679700382  
0.2984194172  
0.3476926159  
0.4153379851  
0.499571405  
0.5976693016  
0.7064110023  
0.822475932  
0.9427006023  
1.064146291  
1.183954048  
1.299033819  
1.405665639  
1.499136592  
1.573532692  
1.621796405  
1.636111608  
1.608626863  
1.532439493  
1.402727424  
1.217848277  
0.9802250751  
0.6968433602  
0.3792352677  
0.04289938177  
-0.2938251265  
-0.6113139491  
-0.8904814903  
-1.114641089  
-1.271191805  
-1.352908355  
-1.358686198  
-1.293643418  
-1.16857398  
-0.9988178471  
-0.802686049  
-0.5996254372  
-0.4083269495  
-0.2449838033  
-0.1218708888  
-0.04637203505  
-0.02052864575  
-0.04111550055  
-0.1002076939  
-0.1861502296  
-0.2848197355  
-0.3810519942  
-0.460111445  
-0.5090789886  
-0.5180579573  
-0.4811040321  
-0.3968198368  
-0.2685522262  
-0.1041827788  
0.08449732307  
0.2827876898  
0.4743860892  
0.6429023196  
0.7734458976  
0.8541350103  
0.8773710694  
0.8407335412  
0.7473837029  
0.6059117218  
0.4296148373  
0.2352712386  
0.04151420013  
-0.1330276487  
-0.271641328  
-0.3612917521  
-0.3940563359  
-0.3680744377  
-0.2879088563  
-0.1642625814  
-0.01305998474  
0.1460428759  
0.2915912733  
0.4025309163  
0.460461969  
0.4517059317  
0.3689568436  
0.2123033585  
-0.01052130204  
-0.2847323998  
-0.5898942115  
-0.9019883435  
-1.195914149  
-1.448126524  
-1.639079806  
-1.755172944  
-1.789963966  
-1.744514274  
-1.626851652  
-1.450662229  
-1.233412918  
-0.994181738  
-0.7514870139  
-0.5213877252  
-0.3160749169  
-0.1430810297  
-0.00514996242  
0.09928639961  
0.1751549606  
0.229490308  
0.2700925255  
0.3042847793  
0.3379383715  
0.3748622216  
0.4166067336  
0.462649311  
0.5108865968  
0.5583018329  
0.6016781732  
0.6382186135  
0.6659730415  
0.6840153714  
0.6923659538  
0.6917118641  
0.6830086686  
0.6670831151  
0.6443350482  
0.6146265012  
0.577391024  
0.531949104  
0.4779560071  
0.4158747657  
0.3473539847  
0.2753905941  
0.2042037863  
0.1387983005  
0.08426184921  
0.04490311815  
0.0233819411  
0.01999876465  
0.03230184599  
0.05511967231  
0.0810627145  
0.1014572493  
0.1075898411  
0.092082302  
0.05018016136  
-0.01925963722  
-0.1132604657  
-0.2248037684  
-0.3435118777  
-0.4568516994  
-0.5516978197  
-0.6160260583  
-0.6404892348  
-0.6196367442  
-0.5525993627  
-0.4431419607  
-0.29907988  
-0.1311609232  
0.048415098  
0.2276014907  
0.3959969554  
0.5459983015  
0.6734446043  
0.7776805584  
0.8610380273  
0.9278450574  
0.9831490224  
1.031363328  
1.075095731  
1.114353427  
1.14628389  
1.165511625  
1.1650303  
1.137519698  
1.076871766  
0.9796747939  
0.8463867689  
0.6819797503  
0.4959068148  
0.3013396145  
0.1137559138  
-0.05095835191  
-0.1786241778  
-0.2588007474  
-0.2864203111  
-0.2627704282  
-0.1956417499  
-0.09858867275  
0.01063229944  
0.1122489232  
0.1869996086  
0.2186507315  
0.1961509414  
0.1151177557  
-0.02155988251  
-0.2040963625  
-0.417105568  
-0.6416404259  
-0.8576820123  
-1.046726127  
-1.194098109  
-1.29068253  
-1.333827806  
-1.327327036  
-1.280501516  
-1.206558663  
-1.120481039  
-1.036786659  
-0.9674879673  
-0.9205540648  
-0.8990675548  
-0.9011762347  
-0.9207829783  
-0.9488280648  
-0.9749058122  
-0.9889437189  
-0.9826590022  
-0.9505856178  
-0.8905404365  
-0.8035130417  
-0.6930661751  
-0.5644096596  
-0.42335505  
-0.27535691  
-0.1248065633  
0.02531776261  
0.1734344103  
0.3190238696  
0.462100198  
0.6026319314  
0.7400561915  
0.8729954038  
0.9992402434  
1.115987367  
1.220274546  
1.309505431  
1.381937113  
1.43701555  
1.475471099  
1.499135098  
1.510500977  
1.512106233  
1.50584381  
1.492342623  
1.470541722  
1.437558669  
1.388897612  
1.318997715  
1.222049711  
1.092969663  
0.9283915962  
0.7275204514  
0.4927220127  
0.2297417336  
-0.05248567245  
-0.342431079  
-0.6269005563  
-0.8921939758  
-1.125347242  
-1.31531953  
-1.453987926  
-1.536843495  
-1.563327515  
-1.53678884  
-1.464091437  
-1.354929965  
-1.22094381  
-1.074719437  
-0.9287786409  
-0.7946322704  
-0.681960262  
-0.5979646705  
-0.5469205857  
-0.5299352467  
-0.5449164885  
-0.5867459648  
-0.6476411965  
-0.7176917056  
-0.7855441567  
-0.8392074486  
-0.8669319407  
-0.8581132608  
-0.8041593064  
-0.6992531526  
-0.5409462272  
-0.3305263492  
-0.0731149507  
0.2225210023  
0.5444416806  
0.8782525497  
1.208014938  
1.517273033  
1.790117326  
2.012196714  
2.17161872  
2.259666142  
2.271309569  
2.205482331  
2.065130432  
1.857034151  
1.591433493  
1.281471439  
0.9424914349  
0.5912160719  
0.2448406737  
-0.07990977762  
-0.3677236229  
-0.6055920225  
-0.7835921723  
-0.8955180598  
-0.9393061613  
-0.9172223973  
-0.8357779872  
-0.7053619359  
-0.5395905961  
-0.3543974819  
-0.166905373  
0.005847074611  
0.1482414973  
0.24736198  
0.2941088021  
0.2840240981  
0.2177264569  
0.1008838824  
-0.05630202026  
-0.2400727484  
-0.4344600378  
-0.6228725839  
-0.7897400383  
-0.9220297569  
-1.010447208  
-1.05018062  
-1.041101485  
-0.9874013282  
-0.8967367654  
-0.7790105001  
-0.6449718625  
-0.5048400584  
-0.3671513618  
-0.2379709806  
-0.1205666451  
-0.015549158  
0.07859131248  
