0.2073514354  
0.2408799006  
0.2731950899  
0.2984634784  
0.3123638811  
0.3129309267  
0.301023131  
0.2803464985  
0.2570287931  
0.2388111885  
0.233960443  
0.2500565328  
0.2928123493  
0.3650800207  
0.4661726929  
0.5915823538  
0.7331311052  
0.8795379026  
1.017336022  
1.132049948  
1.209506587  
1.237163142  
1.20533179  
1.108199065  
0.944554691  
0.7181688833  
0.4377730089  
0.1166238491  
-0.228344493  
-0.5777439746  
-0.9112568708  
-1.20934499  
-1.454984124  
-1.635243286  
-1.742512142  
-1.775207073  
-1.737841943  
-1.640416677  
-1.49718731  
-1.324963039  
-1.141152318  
-0.9618277465  
-0.8000657142  
-0.6647828121  
-0.5602025673  
-0.4859843232  
-0.4379534777  
-0.4092722347  
-0.3918475628  
-0.3777405046  
-0.360376332  
-0.3353896708  
-0.3010246062  
-0.2580780394  
-0.2094486656  
-0.1594033418  
-0.112707135  
-0.07375649477  
-0.04584645494  
-0.03066019393  
-0.0280287209  
-0.035969168  
-0.0509673341  
-0.06844293253  
-0.08332331537  
-0.09064541385  
-0.08610720627  
-0.06651872572  
-0.03011218392  
0.0232895089  
0.09223757678  
0.1737204986  
0.263298338  
0.3552837377  
0.442970953  
0.5189404039  
0.5754825177  
0.6051909832  
0.6017611661  
0.5609769282  
0.4818155859  
0.3675230116  
0.2264523888  
0.07242708623  
-0.07559422511  
-0.1947100381  
-0.2601617897  
-0.2481934498  
-0.1394036077  
0.07784189522  
0.4044567304  
0.8286673546  
1.325488697  
1.857915624  
2.379873676  
2.840699891  
3.190663056  
3.386845364  
3.398587473  
3.21172782  
2.830992185  
2.280135605  
1.599745052  
0.8429414868  
0.06952559699  
-0.66066472  
-1.294299795  
-1.790152129  
-2.123010595  
-2.285459215  
-2.287371368  
-2.153304532  
-1.918269872  
-1.622565786  
-1.306447675  
-1.005384984  
-0.746508689  
-0.5466221862  
-0.4118904135  
-0.339043934  
-0.3177282151  
-0.3334811118  
-0.370785001  
-0.4156867916  
-0.4576114172  
-0.4901809225  
-0.5110483851  
-0.5209376347  
-0.5222144285  
-0.5173692579  
-0.5077848974  
-0.4930624216  
-0.471047368  
-0.4385305547  
-0.3924343207  
-0.3311904738  
-0.2559517743  
-0.17130446  
-0.0852452712  
-0.008331476407  
0.04790618151  
0.07303266505  
0.05988266168  
0.006402156788  
-0.0832453015  
-0.19859305  
-0.3239279413  
-0.4403878458  
-0.5288046085  
-0.5728441469  
-0.5619045815  
-0.4932557582  
-0.37300891  
-0.2156877684  
-0.04240581737  
0.1221087009  
0.2531969115  
0.330089817  
0.3392577518  
0.2767480535  
0.1491247437  
-0.02715511135  
-0.2278455841  
-0.4241910167  
-0.5868919972  
-0.6901745886  
-0.7153730093  
-0.6535250526  
-0.5066307162  
-0.287430106  
-0.01776650116  
0.2742049919  
0.5575640429  
0.8024389362  
0.9835994761  
1.083381143  
1.093608176  
1.016320095  
0.8632582511  
0.6542233179  
0.4145447393  
0.1719963265  
-0.04645199225  
-0.2176543085  
-0.3247314976  
-0.358669987  
-0.3189272454  
-0.213021621  
-0.05521266233  
0.1355122838  
0.33785525  
0.53070858  
0.6954284886  
0.8176276989  
0.8883161916  
0.9043223269  
0.8680188845  
0.7864687252  
0.6701616083  
0.5315351691  
0.3834844358  
0.2380188879  
0.105202507  
-0.007557641149  
-0.09584716638  
-0.1582317732  
-0.1959491543  
-0.2123877997  
-0.2124358481  
-0.2017890694  
-0.1862868716  
-0.1713403428  
-0.1614867356  
-0.1600921093  
-0.1692025153  
-0.1895304759  
-0.2205478861  
-0.2606587628  
-0.307415548  
-0.357754575  
-0.4082293599  
-0.4552301103  
-0.4951943081  
-0.5248110509  
-0.5412312205  
-0.5422935874  
-0.5267621555  
-0.4945610047  
-0.4469770749  
-0.3867849797  
-0.3182411617  
-0.2469009569  
-0.179221457  
-0.1219482215  
-0.08131761695  
-0.06215259751  
-0.06696788175  
-0.0952275811  
-0.1429053831  
-0.2024763689  
-0.2634291231  
-0.3133131126  
-0.3392565713  
-0.3298002697  
-0.2768204231  
-0.1772643054  
-0.03440127113  
0.1416642365  
0.3344083282  
0.5222974024  
0.6811245595  
0.7870580867  
0.8200443069  
0.7671309696  
0.6252139881  
0.402750951  
0.1200781751  
-0.1918746221  
-0.4944642571  
-0.745571836  
-0.904748401  
-0.9386405941  
-0.8259729876  
-0.5613701027  
-0.1573961861  
0.3555906031  
0.9319035355  
1.51512586  
2.04434096  
2.461244456  
2.717223377  
2.779461196  
2.635225321  
2.293727846  
1.78527092  
1.157759064  
0.4710288249  
-0.2102537605  
-0.8241834033  
-1.318683669  
-1.657138679  
-1.821879795  
-1.815149195  
-1.657510052  
-1.384044492  
-1.038963141  
-0.6694526428  
-0.3196354614  
-0.025455428  
0.1888904266  
0.3126178743  
0.3480650925  
0.3086705176  
0.215676583  
0.09415535898  
-0.03100994796  
-0.1386106246  
-0.2136279074  
-0.2485278175  
-0.2432967545  
-0.2043667984  
-0.1427274189  
-0.07160969529  
-0.004144636614  
0.04864367057  
0.07924841553  
0.08434864394  
0.0647295165  
0.0245567255  
-0.02979697379  
-0.09113545595  
-0.1527804252  
-0.2096607565  
-0.2589974756  
-0.3005122406  
-0.3361714024  
-0.369550483  
-0.4049516248  
-0.4464451558  
-0.496994617  
-0.5578084341  
-0.6280143205  
-0.7046983611  
-0.7832927515  
-0.8582455055  
-0.9238649174  
-0.9752075504  
-1.008875877  
-1.023602824  
-1.020534841  
-1.003157459  
-0.9768639628  
-0.9482141917  
-0.9239679226  
-0.91002161  
-0.9103835173  
-0.9263262759  
-0.9558446794  
-0.99350018  
-1.030701249  
-1.056411848  
-1.058227075  
-1.02371504  
-0.9418804333  
-0.8045885094  
-0.6077857247  
-0.3523648131  
-0.0445582366  
0.3042116262  
0.6780328918  
1.057709392  
1.422361735  
1.751263931  
2.025726714  
2.2308212  
2.356749992  
2.399708253  
2.362133881  
2.252317257  
2.083421386  
1.87203186  
1.636414271  
1.394683806  
1.163101716  
0.9546847591  
0.7782694539  
0.638105591  
0.5339925301  
0.4618936074  
0.4149217229  
0.3845369059  
0.3617951489  
0.3384914022  
0.3080643889  
0.2661818549  
0.2109761223  
0.1429406776  
0.06455665903  
-0.02026958026  
-0.106854095  
-0.1903716309  
-0.2664096461  
-0.3313801917  
-0.3827777149  
-0.4192801332  
-0.4407224656  
-0.4479787573  
-0.4427827392  
-0.427524039  
-0.4050355322  
-0.3783865765  
-0.3506759069  
-0.3248300668  
-0.3034051369  
-0.2883925123  
-0.2810503083  
-0.2817714883  
-0.2900195257  
-0.3043480488  
-0.3225219259  
-0.3417401279  
-0.3589464275  
-0.3711962969  
-0.3760341331  
-0.3718295866  
-0.3580194138  
-0.3352107403  
-0.3051229412  
-0.2703601949  
-0.234046842  
-0.1993656867  
-0.1690708734  
-0.1450448908  
-0.1279755442  
-0.1172009535  
-0.110759042  
-0.1056367497  
-0.0981872029  
-0.08465739597  
-0.06174113356  
-0.02708044269  
0.02036775863  
0.0801525293  
0.1503633632  
0.2278680536  
0.3087104037  
0.3885993335  
0.4634085824  
0.5296091323  
0.5845691754  
0.6266903708  
0.655372667  
0.6708372994  
0.6738535046  
0.6654381855  
0.6465817625  
0.6180577293  
0.5803418816  
0.5336467638  
0.4780513724  
0.4136902347  
0.3409505859  
0.2606348415  
0.1740471644  
0.08298651256  
-0.01035713497  
-0.1035840621  
-0.1943117188  
-0.2804079469  
-0.3601883154  
-0.4325425415  
-0.4969749183  
-0.5535470767  
-0.6027424085  
-0.6452757378  
-0.6818876404  
-0.7131632244  
-0.7394105635  
-0.7606252502  
-0.776548207  
-0.7868103685  
-0.7911335484  
-0.789549118  
-0.7825880053  
-0.7713891927  
-0.7576957337  
-0.7437165603  
-0.7318585198  
-0.7243608631  
-0.7228850305  
-0.7281296537  
-0.7395482058  
-0.7552386932  
-0.772049825  
-0.7859264855  
-0.7924621989  
-0.7876032805  
-0.7683939925  
-0.7336466565  
-0.6843992535  
-0.6240457592  
-0.5580652567  
-0.4933216537  
-0.436991092  
-0.3952355729  
-0.3718130213  
-0.3668576281  
-0.376065366  
-0.390506107  
-0.3971907935  
-0.3804359386  
-0.3239205331  
-0.2132108222  
-0.03841071676  
0.2034760984  
0.5068854623  
0.857092805  
1.230896719  
1.598620308  
1.92726436  
2.18443602  
2.342525755  
2.382534955  
2.296965133  
2.091303749  
1.783836387  
1.40376246  
0.9878408591  
0.5760236101  
0.2066769616  
-0.08794675898  
-0.2853731794  
-0.3752230619  
-0.3599158479  
-0.2537199351  
-0.08035617895  
0.1304533847  
0.3469751563  
0.539428231  
0.6834121456  
0.7623925489  
0.7690025292  
0.7050970032  
0.5806711662  
0.4118870755  
0.2185556704  
0.02144242153  
-0.1602386497  
-0.310852481  
-0.4196905907  
-0.4815557045  
-0.4966043378  
-0.4695720369  
-0.4085646698  
-0.3236454608  
-0.2254313542  
-0.1238918972  
-0.02747654583  
0.05737185992  
0.1263314926  
0.1770188706  
0.2086207688  
0.2214710634  
0.2166810219  
0.1959059038  
0.1612671366  
0.1154080972  
0.06161047566  
0.00386917405  
-0.05317322541  
-0.1045140867  
-0.1453257187  
-0.1717065366  
-0.1815456317  
-0.1753430883  
-0.1567992756  
-0.1329868112  
-0.1139704038  
-0.1118113594  
-0.1390078923  
-0.2065376  
-0.3217654595  
-0.4865597024  
-0.6959675082  
-0.9377636001  
-1.193070374  
-1.438101365  
-1.646886571  
-1.79466334  
-1.861470134  
-1.835399392  
-1.714971626  
-1.510182957  
-1.241952662  
-0.9399263461  
-0.6388346486  
-0.373847205  
-0.1755314024  
-0.06513143481  
-0.05086842978  
-0.1258634021  
-0.2680777383  
-0.4424028729  
-0.6047309777  
-0.7075502795  
-0.7063648898  
-0.566095312  
-0.2665743615  
0.1936638096  
0.7958850837  
1.502248118  
2.259421393  
3.004312461  
3.671186288  
4.199246919  
4.539678702  
4.661218216  
4.553532624  
4.227998875  
3.715837505  
3.063932976  
2.328975144  
1.570766697  
0.8456070358  
0.2006038609  
-0.3304270942  
-0.7290876251  
-0.9924623787  
-1.131336199  
-1.167007349  
-1.127282813  
-1.042280795  
-0.9406121247  
-0.84637452  
-0.7772194522  
-0.7435528479  
-0.748774082  
-0.790316717  
-0.8611979985  
-0.9517623919  
-1.051352743  
-1.14970502  
-1.237960953  
-1.309267484  
-1.359014681  
-1.384793243  
-1.386181418  
-1.364452933  
-1.322275856  
-1.263440903  
-1.192620357  
-1.115136342  
-1.036709207  
-0.963155081  
-0.9000182476  
-0.8521446219  
-0.8232264115  
-0.8153702251  
-0.828754029  
-0.8614369548  
-0.9093847474  
-0.9667430885  
-1.026365949  
-1.080565672  
-1.122014854  
-1.144699972  
-1.144803279  
-1.121390343  
-1.076786412  
-1.016560735  
-0.9490791385  
-0.8846334639  
-0.8342175327  
-0.8080630105  
-0.8140958681  
-0.8564916467  
-0.9345223806  
-1.041869634  
-1.166537555  
-1.291447681  
-1.39571582  
-1.456537762  
-1.451514128  
-1.361192262  
-1.171533023  
-0.8760106709  
-0.47706124  
0.01335003819  
0.5741739464  
1.176762602  
1.787285051  
2.369843478  
2.889948833  
3.317949748  
3.631986777  
3.820080027  
3.88107007  
3.824261761  
3.66781412  
3.436093869  
3.156367384  
2.855304874  
2.555801919  
2.274572338  
2.020836825  
1.796259508  
1.596076643  
1.411174628  
1.23072207  
1.044887857  
0.8471679184  
0.6359438701  
0.4150260659  
0.1931331298  
-0.01756470264  
-0.203542779  
-0.3522725181  
-0.4544045225  
-0.5054127169  
-0.506436988  
-0.4642101883  
-0.3901176294  
-0.2985806195  
-0.2050512381  
-0.1239588786  
-0.06692247131  
-0.04148213323  
-0.05049593465  
-0.0922325182  
-0.1610766361  
-0.2486826319  
-0.3453608358  
-0.4414706295  
-0.5286280287  
-0.6005788379  
-0.6536719199  
-0.6869208075  
-0.7017165244  
-0.7012831081  
-0.6899954664  
-0.672672598  
-0.6539439386  
-0.637753258  
-0.6270323324  
-0.6235462112  
-0.6278857276  
-0.639570215  
-0.6572209878  
-0.6787708986  
-0.7016827974  
-0.723170393  
-0.7404136569  
-0.7507762444  
-0.7520232707  
-0.7425364789  
-0.7215123273  
-0.6891184017  
-0.6465826298  
-0.596180713  
-0.5411078329  
-0.4852218195  
-0.4326764468  
-0.3874744073  
-0.3529917122  
-0.3315381968  
-0.3240123217  
-0.3297115221  
-0.3463315329  
-0.3701675959  
-0.3965089028  
-0.4201761936  
-0.4361437861  
-0.44016642  
-0.429326089  
-0.402423614  
-0.3601586855  
-0.3050672741  
-0.2412169196  
-0.1737019855  
-0.1079992657  
-0.04927437996  
-0.001733636075  
0.03188673462  
0.05062492193  
0.05534582611  
0.0485394789  
0.03389811079  
0.01573529654  
-0.001660245051  
-0.01463908955  
-0.02068192302  
-0.01869480669  
-0.009069603482  
0.006492464661  
0.02535470276  
0.04444885377  
0.0608197186  
0.07211551228  
0.07694882483  
0.0750673265  
0.06732567249  
0.05547087324  
0.04180060028  
0.02876199825  
0.01857383499  
0.0129397147  
0.01289375238  
0.0187971393  
0.03046336699  
0.0473724674  
0.06891065521  
0.09457925795  
0.1241239661  
0.1575615765  
0.1951078073  
0.2370305107  
0.2834784314  
0.3343310011  
0.3891147619  
0.4470055921  
0.5069187389  
0.5676585293  
0.6280859143  
0.6872538507  
0.7444672509  
0.7992510086  
0.8512210317  
0.8998956634  
0.944489124  
0.9837420318  
1.015836164  
1.038417274  
1.048730474  
1.043848723  
1.020960418  
0.9776748465  
0.9123129936  
0.8241600811  
0.7136719515  
0.582626877  
0.4342270801  
0.2731307393  
0.1053990398  
-0.06168003674  
-0.2199244959  
-0.3607741132  
-0.4759882927  
-0.5584891034  
-0.6032684914  
-0.6082374965  
-0.5748706137  
-0.5084932546  
-0.4180941918  
-0.315598169  
-0.2146189638  
-0.1288098772  
-0.07001307832  
-0.04648124738  
-0.06145981075  
-0.1124076213  
-0.1910501323  
-0.2843404092  
-0.3762704491  
-0.4503158483  
-0.4921786717  
-0.4924111876  
-0.4484805223  
-0.3658892163  
-0.2580872316  
-0.1450856575  
-0.05088464679  
-3.596397633e-05  
-0.0138224287  
-0.1066383633  
-0.2831664797  
-0.5368546559  
-0.8500174447  
-1.195642515  
-1.540702901  
-1.850519157  
-2.093518423  
-2.245646414  
-2.293716666  
-2.237135608  
-2.087698464  
-1.867467633  
-1.605062299  
-1.330956865  
-1.072559272  
-0.8498771455  
-0.6724859866  
-0.5383006254  
-0.4343482087  
-0.3394145249  
-0.2281234692  
-0.07577805893  
0.1368371969  
0.4194756595  
0.7699278523  
1.173406868  
1.603929243  
2.027474409  
2.406438952  
2.704690063  
2.892460552  
2.950353704  
2.871890982  
2.664273852  
2.347306311  
1.950706515  
1.510258085  
1.063396184  
0.6448710734  
0.2830706554  
-0.00255006396  
-0.202683245  
-0.3179904543  
-0.3576995361  
-0.3372939003  
-0.2757167319  
-0.1925189574  
-0.1053517401  
-0.02809473563  
0.03020846134  
0.0655752398  
0.07856567621  
0.07320150129  
0.05557137015  
0.0323702739  
0.009604795902  
-0.008366362682  
-0.01935976809  
-0.02344201375  
-0.02260528435  
-0.02014969117  
-0.01991085908  
-0.0254758343  
-0.03952183048  
-0.06336902129  
-0.09680206481  
-0.1381641197  
-0.1846786829  
-0.2329284355  
-0.2793900837  
-0.3209333629  
-0.3551945354  
-0.3807747336  
-0.3972389552  
-0.404935936  
-0.4046944801  
-0.3974683241  
-0.3840212383  
-0.3647217126  
-0.3395060314  
-0.3080227974  
-0.2699352146  
-0.2253149542  
-0.1750430167  
-0.1211141975  
-0.06675993763  
-0.0163349726  
0.02504759811  
0.05209327289  
0.06003751645  
0.04537626975  
0.006496425917  
-0.05590830961  
-0.1387181377  
-0.2365979704  
-0.3425273765  
-0.4485708468  
-0.5467858527  
-0.6301307463  
-0.6932355869  
-0.7329214356  
-0.7483966561  
-0.7411039238  
-0.7142581666  
-0.6721598085  
-0.6194025995  
-0.5601139748  
-0.4973464929  
-0.4327215131  
-0.3663616648  
-0.2971114119  
-0.2229871138  
-0.141759321  
-0.05156180349  
0.04858283378  
0.1584038755  
0.2762315715  
0.3990584689  
0.5227835118  
0.6425723677  
0.7532692731  
0.8497988096  
0.9275136219  
0.9824711987  
1.01164247  
1.013066834  
0.9859739843  
0.9308778153  
0.8496381881  
0.745465624  
0.6228408647  
0.4873175414  
0.3451960852  
0.2030783172  
