0.3451238245  
0.6196648031  
0.8780369364  
1.109014481  
1.303376714  
1.454359896  
1.557929624  
1.612865442  
1.620675308  
1.585356267  
1.513020133  
1.411431173  
1.289482795  
1.156660827  
1.022517384  
0.8961930324  
0.7859813376  
0.6989614133  
0.6406719441  
0.6148183373  
0.6230109398  
0.6645244693  
0.7360989037  
0.8318184808  
0.9431239551  
1.059009607  
1.166472896  
1.251239581  
1.298777454  
1.295534629  
1.230308145  
1.095594162  
0.8887497222  
0.6127764176  
0.2765902981  
-0.1053347075  
-0.5139479671  
-0.9271829402  
-1.321915303  
-1.676126578  
-1.970990436  
-2.192657264  
-2.333486121  
-2.392602094  
-2.37569733  
-2.294121432  
-2.163376458  
-2.001207983  
-1.825530103  
-1.652431694  
-1.494487321  
-1.35956472  
-1.250248153  
-1.163925023  
-1.09350437  
-1.028671793  
-0.9575152634  
-0.8683307422  
-0.7513939411  
-0.6004852898  
-0.4139947982  
-0.1954739382  
0.04644257041  
0.2987395671  
0.5452940646  
0.7685767438  
0.9516077023  
1.079943203  
1.143464118  
1.137745894  
1.06483107  
0.933274273  
0.7574371518  
0.5560800781  
0.3503951277  
0.1617122907  
0.00915851414  
-0.09244066879  
-0.1341359499  
-0.1137101072  
-0.03569324411  
0.08943386056  
0.2467508254  
0.4188851895  
0.5881901045  
0.7388187161  
0.8584173257  
0.9392256603  
0.9784914746  
0.978195176  
0.9441915166  
0.8849635784  
0.8102071165  
0.7294788459  
0.6511110538  
0.5815056514  
0.5248688505  
0.4833489366  
0.457474625  
0.4467486946  
0.4502510588  
0.467095097  
0.4966577669  
0.5385303528  
0.5922170118  
0.6566464801  
0.7296258465  
0.8073419288  
0.8840575286  
0.9520804573  
1.002071296  
1.023691221  
1.006533909  
0.941258471  
0.8207868803  
0.6414221642  
0.4037432869  
0.1131476169  
-0.2200531316  
-0.5810246073  
-0.9512911714  
-1.310047889  
-1.635797682  
-1.90816351  
-2.109706316  
-2.227574357  
-2.254802676  
-2.191130994  
-2.043224791  
-1.82426884  
-1.552932039  
-1.25179773  
-0.9453758181  
-0.6579006657  
-0.4111052935  
-0.222211242  
-0.1023427683  
-0.05553469234  
-0.07846974303  
-0.160972445  
-0.2872365286  
-0.4376501647  
-0.5910244682  
-0.7269675558  
-0.8281145148  
-0.8819494693  
-0.8819892407  
-0.8281892819  
-0.7265243698  
-0.5878313964  
-0.4260766483  
-0.2563176755  
-0.09265128269  
0.05356321895  
0.1749495308  
0.2686975806  
0.3364149816  
0.3833387445  
0.4170615999  
0.4460163259  
0.4779792617  
0.5188380832  
0.571808825  
0.637195379  
0.7127049559  
0.7942047634  
0.8767626709  
0.9557528615  
1.027810794  
1.091461329  
1.147302751  
1.197716923  
1.246162066  
1.296180875  
1.35031227  
1.409100665  
1.470388911  
1.529047134  
1.577177405  
1.604814014  
1.601004829  
1.555140314  
1.458341458  
1.30471212  
1.092291074  
0.8235862727  
0.5056244702  
0.1495316227  
-0.2302888884  
-0.6172716283  
-0.9939518435  
-1.34324746  
-1.649629024  
-1.900100032  
-2.084934598  
-2.19816663  
-2.237839456  
-2.206057797  
-2.108860786  
-1.955939508  
-1.760197536  
-1.537131347  
-1.304013903  
-1.078855607  
-0.8791631453  
-0.720538091  
-0.6152138879  
-0.57068991  
-0.5886140433  
-0.6641197381  
-0.7857624412  
-0.9361654031  
-1.093383727  
-1.232918722  
-1.330196648  
-1.36325113  
-1.315297457  
-1.176877785  
-0.9472817271  
-0.635037396  
-0.2573713968  
0.1613393083  
0.5919684978  
1.003631715  
1.366905373  
1.656926651  
1.855976974  
1.955248594  
1.955596887  
1.867174649  
1.708009249  
1.501695861  
1.274507663  
1.052265244  
0.8573707197  
0.7063630435  
0.6082885757  
0.564085746  
0.5670361871  
0.6042044108  
0.6586454486  
0.7120828449  
0.7476704604  
0.7524654534  
0.7192661503  
0.6475739523  
0.5435504274  
0.4189996451  
0.2895290659  
0.1721731149  
0.08283795892  
0.03394622951  
0.03263017605  
0.07972833329  
0.1697294761  
0.2916510109  
0.4306951306  
0.5704165389  
0.6950713629  
0.7917653645  
0.8521005819  
0.8730710568  
0.8570930678  
0.8111893585  
0.7454778238  
0.6712004741  
0.5986215394  
0.5351237835  
0.4837903884  
0.4427112483  
0.4051245721  
0.3603974334  
0.2957023533  
0.1981836772  
0.05727552918  
-0.1331470801  
-0.373126264  
-0.6557433927  
-0.9671841627  
-1.28777211  
-1.593877978  
-1.860486282  
-2.064072658  
-2.185445468  
-2.212145603  
-2.140087604  
-1.974225013  
-1.728124855  
-1.422523376  
-1.083041395  
-0.7373552731  
-0.412200011  
-0.1305724463  
0.09052828506  
0.2415538572  
0.3209353562  
0.334665417  
0.2950483867  
0.2188403941  
0.1250461748  
0.03266099208  
-0.04136039856  
-0.0837170433  
-0.08581393106  
-0.04423355625  
0.03935287645  
0.1587142811  
0.3039075019  
0.4623029071  
0.6196683956  
0.7612387297  
0.8727128456  
0.9411805191  
0.9559799559  
0.9094755809  
0.7977585127  
0.6212095627  
0.3848555545  
0.09842477788  
-0.2239835008  
-0.5646800166  
-0.9036257424  
-1.220061776  
-1.49439657  
-1.710144067  
-1.855663758  
-1.925453092  
-1.920780658  
-1.849525007  
-1.725190745  
-1.565206303  
-1.388707507  
-1.214111176  
-1.056822836  
-0.9274080502  
-0.8304960716  
-0.7645673569  
-0.7226510853  
-0.6937916313  
-0.6650502828  
-0.6237049902  
-0.5593004284  
-0.4652227564  
-0.3395747473  
-0.1852500175  
-0.009218511795  
0.1787803337  
0.3679093077  
0.5479455394  
0.7107399796  
0.8511959415  
0.967618701  
1.061429473  
1.136351266  
1.197246952  
1.248869305  
1.294771376  
1.336578162  
1.373747439  
1.403844796  
1.423249828  
1.42812848  
1.415460263  
1.383919114  
1.334408888  
1.270169678  
1.196436958  
1.119730579  
1.04692654  
0.984312714  
0.9367859012  
0.9073713823  
0.8971033275  
0.9052640679  
0.9298906455  
0.9683654951  
1.017948814  
1.07606311  
1.14025655  
1.207832887  
1.275232174  
1.337346199  
1.386973967  
1.414651989  
1.40901152  
1.357748995  
1.24913151  
1.073885009  
0.82714285  
0.5101348608  
0.1312732852  
-0.2936357004  
-0.7421833726  
-1.187137077  
-1.59901518  
-1.949131811  
-2.21270405  
-2.371586003  
-2.416255302  
-2.346784208  
-2.172681717  
-1.911654816  
-1.587498401  
-1.227418181  
-0.8591636825  
-0.5083470319  
-0.1962574008  
0.06160267921  
0.2561687219  
0.3846630113  
0.4497865284  
0.4584455307  
0.4202642712  
0.346117361  
0.2468749954  
0.132499999  
0.01153858097  
-0.1090136389  
-0.2235684884  
-0.327637506  
-0.417513757  
-0.4900525013  
-0.5426275703  
-0.5733003775  
-0.581150178  
-0.5666961961  
-0.5322891609  
-0.4823540067  
-0.4233652074  
-0.3635060301  
-0.3119811224  
-0.2780481638  
-0.2698710057  
-0.293344694  
-0.3510742945  
-0.4416674291  
-0.559464414  
-0.6947996955  
-0.8347791686  
-0.9645226988  
-1.068724965  
-1.133355338  
-1.147297092  
-1.103715667  
-1.000984629  
-0.8430522351  
-0.6391921244  
-0.4031662209  
-0.1518803406  
0.09630032103  
0.3234000859  
0.5136255889  
0.6549100834  
0.7400410894  
0.767238055  
0.7401406849  
0.6672177416  
0.5606614325  
0.4349192358  
0.3050300663  
0.1849634707  
0.08614438715  
0.01633962457  
-0.02099030521  
-0.02680634339  
-0.006094628259  
0.03299214421  
0.08030092696  
0.1250315991  
0.1570816804  
0.1682413316  
0.1531066076  
0.1096264061  
0.03925416032  
-0.05329115317  
-0.1605922514  
-0.2733423989  
-0.3813067609  
-0.4743144014  
-0.5432038624  
-0.5806307442  
-0.5816874825  
-0.5442896454  
-0.4693224014  
-0.3605364299  
-0.2242110794  
-0.06860265125  
0.09677937182  
0.2620157678  
0.4176862516  
0.5557467639  
0.6702966318  
0.758125547  
0.8189683895  
0.8553915994  
0.8723084863  
0.8761449243  
0.8737550382  
0.871228064  
0.8727723635  
0.8798552135  
0.8907723877  
0.9007471978  
0.9025956895  
0.8878855602  
0.8484355404  
0.7779300974  
0.6733878809  
0.536227927  
0.372721551  
0.1937211469  
0.01365024939  
-0.1511358711  
-0.2843979591  
-0.3721883455  
-0.4048271983  
-0.3783894451  
-0.2954533479  
-0.1649952096  
-0.001417330934  
0.1771667681  
0.3511529417  
0.5018672297  
0.6138480973  
0.676672879  
0.6860955685  
0.6443417984  
0.5595584134  
0.4445286345  
0.3148497126  
0.1868759133  
0.07569923694  
-0.006541372102  
-0.05183633601  
-0.05684640373  
-0.02282187058  
0.0450197703  
0.1384768157  
0.2475164742  
0.3613990702  
0.4696146219  
0.5625459635  
0.6318419292  
0.6705584815  
0.6731594487  
0.6355059854  
0.5549272421  
0.4304314488  
0.2630562641  
0.05628817394  
-0.1835610223  
-0.4471643597  
-0.7223040921  
-0.9943987173  
-1.247458019  
-1.465409005  
-1.633661766  
-1.740715875  
-1.779603934  
-1.748941162  
-1.653417043  
-1.503620912  
-1.315192574  
-1.107356991  
-0.9010080931  
-0.716551158  
-0.5717457901  
-0.4797977446  
-0.4479193121  
-0.4765116609  
-0.5590757247  
-0.6828539331  
-0.8301342786  
-0.9800952292  
-1.110967405  
-1.202318266  
-1.237191702  
-1.203891996  
-1.09722802  
-0.9190860756  
-0.6782956874  
-0.3897964621  
-0.07321785834  
0.248971141  
0.5535462181  
0.8186206342  
1.025557613  
1.160508424  
1.215461271  
1.188734348  
1.084902301  
0.9142048195  
0.6915371549  
0.435131005  
0.16506827  
-0.09824230217  
-0.3355197589  
-0.5299014997  
-0.6679931907  
-0.7406442416  
-0.7434217521  
-0.6767727953  
-0.5458760073  
-0.3601986033  
-0.1327772178  
0.1207362173  
0.3832204552  
0.6373467603  
0.866872216  
1.057870021  
1.199786081  
1.28622812  
1.315406888  
1.290178226  
1.217672721  
1.108548978  
0.9759340406  
0.8341516183  
0.6973782196  
0.578323094  
0.4870930935  
0.4302990859  
0.4105072299  
0.4260420115  
0.471154427  
0.5365273193  
0.6100666313  
0.6779191261  
0.7256575103  
0.7395592185  
0.707904325  
0.6222200605  
0.4783692051  
0.2773835808  
0.02592994351  
-0.2636938254  
-0.5741290103  
-0.8841134683  
-1.170215638  
-1.409023381  
-1.579602071  
-1.665944864  
-1.659106461  
-1.558698751  
-1.373475699  
-1.12083074  
-0.8251706847  
-0.5152834553  
-0.2209793192  
0.03057478348  
0.2183549428  
0.3303047161  
0.3650492094  
0.3322081432  
0.2511945832  
0.1485966724  
0.05446039689  
-0.00204158362  
0.003033715775  
0.08464498979  
0.2461535857  
0.4782760193  
0.7597839813  
1.059907254  
1.342138061  
1.568954169  
1.706802124  
1.730669971  
1.627619954  
1.398784903  
1.059561158  
0.6379861672  
0.1715100815  
-0.2973586549  
-0.725974045  
-1.076361159  
-1.3193107  
-1.437267871  
-1.425717395  
-1.292960489  
-1.058443583  
-0.7499251297  
-0.3999415097  
-0.04204702735  
0.2926931526  
0.5785740032  
0.7972278447  
0.9385818849  
1.000842616  
0.9896258635  
0.9164687799  
0.7969672696  
0.648801265  
0.489834967  
0.3364751566  
0.2023611177  
0.09743580634  
0.02739849097  
-0.006493453966  
-0.007294232067  
0.01803897014  
0.05931416582  
0.1040005418  
0.1383128997  
0.1484258742  
0.1217755707  
0.04832077892  
-0.07831810585  
-0.2599706263  
-0.4933874747  
-0.770158087  
-1.077120356  
-1.39727353  
-1.711121452  
-1.998354066  
-2.239693416  
-2.418732118  
-2.523550623  
-2.547933756  
-2.492026539  
-2.362339995  
-2.171061269  
-1.934736535  
-1.672433669  
-1.403602255  
-1.145857162  
-0.9129613879  
-0.7132624157  
-0.5487933851  
-0.4151672174  
-0.3023141239  
-0.1959820428  
-0.07982400915  
0.06217523465  
0.2432611671  
0.4717564639  
0.7495112407  
1.071135988  
1.424148174  
1.790008249  
2.145930192  
2.467224866  
2.729896076  
2.91316116  
3.001594102  
2.986642959  
2.867353326  
2.650245016  
2.348382097  
1.979792091  
1.565463704  
1.127192907  
0.685565314  
0.2583300655  
-0.1406468092  
-0.501749668  
-0.8193114211  
-1.090755158  
-1.315388537  
-1.493100193  
-1.623246208  
-1.703948214  
-1.731975148  
-1.703255258  
-1.613944586  
-1.461870923  
-1.24807084  
-0.9781046382  
-0.6628683424  
-0.3186470129  
0.03367629259  
0.3702445416  
0.6665024397  
0.8998336814  
1.052185834  
1.11230004  
1.07719725  
0.9526861833  
0.7527949645  
0.4981937314  
0.2138246295  
-0.07391672791  
-0.3400509632  
-0.5635271421  
-0.7290427937  
-0.827962418  
-0.8582558951  
-0.82357747  
-0.7317066059  
-0.59268238  
-0.4170024417  
-0.214195065  
0.007994930914  
0.2437200003  
0.4884928379  
0.7381942772  
0.9878974828  
1.230837655  
1.457803741  
1.657158356  
1.815560021  
1.919317836  
1.956170358  
1.917206218  
1.798572731  
1.602673525  
1.338604125  
1.021725204  
0.6723868756  
0.3139804894  
-0.02942300887  
-0.3355088777  
-0.5859048824  
-0.7678236484  
-0.8749895076  
-0.9077672538  
-0.8725564784  
-0.7806074116  
-0.6464824631  
-0.4864165185  
-0.3168112864  
-0.1530274122  
-0.008576920861  
0.1052908868  
0.179675289  
0.2079161217  
0.1854293129  
0.1096297666  
-0.01998317811  
-0.2015513387  
-0.4304378448  
-0.698783284  
-0.9951864507  
-1.304670347  
-1.609083258  
-1.88801177  
-2.120210079  
-2.285450322  
-2.366620161  
-2.351800222  
-2.236039065  
-2.022542149  
-1.723042687  
-1.357222149  
-0.9511748267  
-0.5350387174  
-0.1400520593  
0.2046242162  
0.4749242461  
0.6543583609  
0.7356305079  
0.7212083634  
0.6227737965  
0.4596490843  
0.2564349388  
0.04016534722  
-0.1626283262  
-0.3285929371  
-0.439654171  
-0.4843448552  
-0.4582728898  
-0.3637744354  
-0.208899303  
-0.005960991449  
0.230103842  
0.4833138931  
0.7379661829  
0.9795920241  
1.19551424  
1.375048818  
1.50947625  
1.591914047  
1.617236462  
1.582133348  
1.485367853  
1.32819295  
1.114842142  
0.8529603185  
0.5538078037  
0.2321113206  
-0.09454876134  
-0.4068125523  
-0.6850323081  
-0.9110237604  
-1.069862526  
-1.151509022  
-1.152011091  
-1.074105633  
-0.9271209807  
-0.7261491018  
-0.490585467  
-0.2421913064  
-0.002914364156  
0.2073040511  
0.3724617243  
0.4819946517  
0.5316826042  
0.5238820745  
0.4670951592  
0.3749295476  
0.2645570873  
0.1548325429  
0.06424854904  
0.008907613129  
0.0007152216795  
0.04595452598  
0.1444136163  
0.2891551322  
0.467008467  
0.6597604428  
0.8459631566  
1.003205325  
1.110605881  
1.151265326  
1.114380312  
0.9967492967  
0.8034561859  
0.5476093487  
0.2491368932  
-0.06725772306  
-0.3747345  
-0.6472451554  
-0.8623898843  
-1.003836381  
-1.063015547  
-1.039874595  
-0.9426144595  
-0.7864679159  
-0.5916958354  
-0.3810783158  
-0.1772284596  
-7.37491847e-05  
0.1351992911  
0.2195131655  
0.2504561326  
0.2320200861  
0.1736057449  
0.0884691875  
-0.008164575358  
-0.1010723737  
-0.176857725  
-0.2254349794  
-0.2410176763  
-0.2225539273  
-0.1735781191  
-0.1015404052  
-0.01671901132  
0.06915868888  
0.144406405  
0.1988289854  
0.2249538189  
0.2189211683  
0.1809308077  
0.1151957398  
0.02941597369  
-0.06617386148  
-0.1600555676  
-0.2408399392  
-0.298658745  
-0.326373123  
-0.3204561522  
-0.2814438651  
-0.2139107664  
-0.1259820222  
-0.02845087632  
0.06637806344  
0.1459938603  
0.198975056  
0.2161488524  
0.1915030448  
0.1227871235  
0.01176909166  
-0.1358622352  
-0.3108944585  
-0.50126722  
-0.6929535853  
-0.8710002224  
-1.020648104  
-1.128475565  
-1.183493751  
-1.178097177  
-1.10879506  
-0.9766316099  
-0.7872316607  
-0.5504185386  
-0.2794175028  
0.01030121531  
0.3024397664  
