1523.638891  
1616.4968  
1814.916108  
2198.839781  
2807.215281  
17940.61148  
4937.932184  
12985.40203  
108280.6741  
16259.10175  
1151.435765  
3793.699334  
96272.28054  
14457.18806  
27166.08533  
9193.515044  
13574.66777  
295.5390038  
22847.9108  
1331.458624  
15368.77122  
313.3226236  
11702.76159  
8755.916709  
2583.960787  
6314.580279  
1275.75949  
4136.319414  
2903.573693  
4345.580794  
2009.19719  
216.4441105  
6638.51729  
2435.286542  
1175.275871  
2739.705877  
7811.02168  
2676.484687  
3777.443161  
107.5794344  
5647.208352  
3033.42295  
7282.7867  
426.2713818  
222.419434  
475.6935935  
657.2960211  
971.8024028  
7268.283243  
443.3676587  
1286.664552  
117.2013665  
4685.819045  
561.9945782  
1108.877478  
731.7692521  
1408.008658  
1254.863803  
752.3668313  
336.3668818  
36.91913051  
38.24554644  
354.575614  
242.3675868  
69.79277713  
40.04624317  
133.9613833  
1.144652052  
41.80049099  
8.272725957  
0.7465108986  
8.217055798  
22.35521048  
3.482006512  
9.082263002  
0.9348430047  
4.563914042  
4.605113253  
2.896560548  
1.205695128  
1.001449466  
1.35066977  
1.06700648  
1.583926095  
1.366773006  
1.385459872  
1.361245976  
1.493045126  
1.563955861  
1.49502736  
1.335847176  
1.465178916  
1.455386493  
1.507070129  
1.407308539  
1.330108998  
1.365223236  
1.359653937  
1.331357732  
1.261101151  
1.269490934  
1.247912543  
1.219621574  
1.196484906  
1.181967597  
1.162281554  
1.147648208  
1.123372919  
1.104343997  
1.088219089  
1.070052956  
1.050698181  
1.032278312  
1.016394903  
0.9999350555  
0.9837073519  
0.9667687216  
0.9516534231  
0.9369595423  
0.9216658361  
0.9068008257  
0.8925119674  
0.8787203281  
0.8646453775  
0.8512602261  
0.838029914  
0.8252223335  
0.8126781208  
0.8003508809  
0.7882483035  
0.7765377913  
0.7650153244  
0.7537712217  
0.7427845428  
0.7320103042  
0.7214590149  
0.7111893263  
0.7010843713  
0.6912066435  
0.6815658219  
0.6721085337  
0.6628598247  
0.6538035284  
0.6449242917  
0.6362490064  
0.6277473248  
0.6194273574  
0.6112630607  
0.6032862734  
0.5954660171  
0.5878094917  
0.5803005949  
0.5729414736  
0.5657273677  
0.55866416  
0.5517354852  
0.5449482083  
0.5382932304  
0.5317647689  
0.5253678938  
0.519102873  
0.5129421355  
0.5069046461  
0.5009824864  
0.4951694982  
0.4894721677  
0.4838812513  
0.4783866104  
0.4729948652  
0.4677081512  
0.4625255955  
0.4574189981  
0.4524213633  
0.4475039632  
0.4426778333  
0.4379498521  
0.4332946098  
0.4287195127  
0.4242244196  
0.419815034  
0.4154757968  
0.4112149939  
0.407030326  
0.4029086374  
0.3988675007  
0.3948890678  
0.3909804164  
0.3871378007  
0.383358369  
0.379643818  
0.3759913022  
0.3723935568  
0.3688580839  
0.3653809767  
0.3619620021  
0.3585865581  
0.3552759381  
0.3520172151  
0.348824174  
0.3456604681  
0.3425558606  
0.3394994725  
0.3364892057  
0.3335312321  
0.3306139438  
0.3277429956  
0.3249138124  
0.3221326324  
0.3193893316  
0.3166912324  
0.3140331414  
0.3114098934  
0.3088342466  
0.3062895177  
0.3037867447  
0.3013217603  
0.2988897016  
0.2964966858  
0.2941388499  
0.2918137971  
0.289519815  
0.2872585651  
0.2850323125  
0.2828415923  
0.2806777828  
0.2785434234  
0.2764418337  
0.2743693994  
0.2723282374  
0.2703100172  
0.2683258536  
0.2663604091  
0.2644353362  
0.2625198425  
0.2606481398  
0.2587915323  
0.2569578492  
0.2551601361  
0.2533778203  
0.2516218592  
0.2498896757  
0.2481801476  
0.2464920915  
0.2448297943  
0.2431903776  
0.2415661007  
0.2399642152  
0.2383874966  
0.2368296109  
0.235289599  
0.2337745546  
0.2322747017  
0.2307953609  
0.2293333449  
0.2278935292  
0.2264689477  
0.2250695279  
0.2236760939  
0.2223071273  
0.2209561102  
0.2196247426  
0.2183078772  
0.2170021558  
0.2157144848  
0.2144451924  
0.2131887643  
0.2119512302  
0.2107338246  
0.2095230121  
0.2083239197  
0.2071485712  
0.2059794397  
0.2048313929  
0.2036903358  
0.2025715366  
0.2014606541  
0.2003634626  
0.1992768814  
0.1982095586  
0.1971559767  
0.1961084664  
0.1950732734  
0.1940546869  
0.193049237  
0.1920495676  
0.1910673928  
0.1900905593  
0.1891325779  
0.1881804481  
0.1872408292  
0.1863124964  
0.1853954523  
0.1844880758  
0.183591463  
0.1827040246  
0.1818314035  
0.1809622007  
0.1801119166  
0.1792642856  
0.178427783  
0.1776040141  
0.1767842632  
0.1759757537  
0.175175846  
0.1743893727  
0.173606564  
0.1728391048  
0.1720711478  
0.171320225  
0.1705737379  
0.1698344901  
0.1691033851  
0.1683826676  
0.1676694555  
0.1669656374  
0.1662701491  
0.1655808805  
0.1648994638  
0.1642260616  
0.1635594702  
0.1628999468  
0.1622504635  
0.1616095123  
0.1609705413  
0.1603354772  
0.1597165749  
0.1591022752  
0.1584932867  
0.1578901031  
0.157295747  
0.1567078458  
0.1561260878  
0.1555508296  
0.1549818871  
0.1544166085  
0.1538628791  
0.153308012  
0.1527657435  
0.1522282955  
0.1516965528  
0.151168289  
0.1506488475  
0.1501345356  
0.1496253476  
0.1491234769  
0.1486278839  
0.1481307152  
0.1476483757  
0.1471655815  
0.14669107  
0.1462211525  
0.1457522762  
0.1452969188  
0.1448417375  
0.1443941788  
0.1439507053  
0.1435073569  
0.1430746848  
0.1426486654  
0.1422218483  
0.1418003242  
0.1413892684  
0.1409770921  
0.1405759101  
0.1401714965  
0.1397824517  
0.1393890961  
0.1389986543  
0.1386169957  
0.1382328501  
0.1378678741  
0.1374929313  
0.137132003  
0.1367719718  
0.1364105932  
0.1360621019  
0.1357160376  
0.1353711187  
0.1350343766  
0.1346952376  
0.1343639393  
0.1340344665  
0.1337142439  
0.1333925507  
0.1330760242  
0.1327675752  
0.1324605478  
0.1321567559  
0.1318574715  
0.1315589974  
0.1312665271  
0.1309758693  
0.1306905051  
0.1304075843  
0.1301293158  
0.1298556006  
0.12958403  
0.1293173556  
0.1290563884  
0.1287940519  
0.1285338883  
0.1282797391  
0.1280308115  
0.1277843478  
0.1275376634  
0.127299935  
0.1270657166  
0.1268291063  
0.1266010695  
0.1263749801  
0.1261482895  
0.1259280173  
0.1257112509  
0.1254973574  
0.1252822078  
0.1250799189  
0.1248740783  
0.1246701178  
0.124474185  
0.1242798746  
0.1240849698  
0.1238980987  
0.1237069708  
0.1235230363  
0.1233451286  
0.1231695977  
0.1229862896  
0.1228179498  
0.1226491694  
0.1224847898  
0.1223217258  
0.1221627828  
0.1220037478  
0.1218470712  
0.121698023  
0.1215490882  
0.1214003194  
0.1212573295  
0.1211169258  
0.1209796466  
0.1208452605  
0.120711339  
0.1205856641  
0.1204545869  
0.1203302709  
0.1202091109  
0.1200906389  
0.119974189  
0.1198589519  
0.119746788  
0.1196389134  
0.1195363272  
0.1194293944  
0.1193294643  
0.1192355402  
0.1191364036  
0.1190428978  
0.1189528291  
0.118863252  
0.1187780083  
0.1186979178  
0.1186167491  
0.1185387144  
0.1184689772  
0.1183934173  
0.1183238021  
0.1182578818  
0.1181907618  
0.1181292257  
0.1180675086  
0.1180110575  
0.1179541067  
0.117900126  
0.1178513785  
0.1178022318  
0.1177593266  
0.1177160352  
0.1176765246  
0.1176380283  
0.1176020643  
0.1175705557  
0.1175411976  
0.117511653  
0.117488523  
0.1174631852  
0.1174424073  
0.1174256829  
0.1174105369  
0.1173972449  
0.1173810284  
0.1173754736  
0.1173708557  
0.1173661696  
0.1173650896  
