215.8657511  
232.9494704  
268.8737254  
343.5606387  
246.4498481  
1588.211778  
49067.7156  
22715.7068  
6535.914094  
9704.515565  
21959.41201  
16688.28672  
18603.01106  
33708.68161  
19157.45877  
2895.944327  
1893.495247  
11591.01694  
9295.17775  
765.2436071  
17649.17363  
20016.33274  
13458.05243  
26.26949423  
2513.377501  
8313.082922  
13949.0714  
8368.322702  
21611.79635  
13729.38291  
8957.567477  
8196.66203  
19257.99298  
12973.49112  
8954.247409  
15357.96157  
6535.262025  
702.433056  
3458.927448  
3575.39291  
5509.201614  
6915.237542  
2355.381836  
253.2873586  
2358.696134  
5465.741999  
10594.78577  
2614.767702  
2867.734865  
334.8280737  
1416.960556  
1065.181007  
2604.079938  
124.961957  
1107.006377  
371.6446986  
1033.784528  
73.87877026  
62.18536391  
1723.7412  
397.5865152  
67.98536966  
1951.17442  
146.9622302  
74.64260204  
107.9316053  
140.2347512  
242.4142252  
94.26095703  
2.050591035  
69.57107883  
92.11037169  
12.11210709  
26.25093715  
16.98814595  
31.25774386  
11.29385757  
5.449491264  
13.40931806  
6.957117734  
7.778253783  
8.438283639  
7.841598334  
6.3170972  
6.29282922  
5.303609566  
5.728974111  
4.010262178  
4.063839398  
3.724433441  
3.737574836  
3.190476429  
3.003731472  
2.625984689  
2.586734302  
2.379869482  
2.176010433  
2.096686642  
2.003122942  
1.841518824  
1.757847848  
1.631261144  
1.552270217  
1.465365326  
1.377221728  
1.321379737  
1.2556269  
1.188945531  
1.129150645  
1.074400489  
1.022008593  
0.9741226082  
0.9291621922  
0.8860126665  
0.8478811842  
0.8075781912  
0.7731004778  
0.741302536  
0.7085548518  
0.6795355166  
0.6517797615  
0.6250193468  
0.6001393221  
0.5764077002  
0.553887087  
0.5323970561  
0.5125518025  
0.4933829334  
0.4750125508  
0.4579125962  
0.4414082014  
0.4256336688  
0.4107909794  
0.3965899094  
0.3829462086  
0.3700015089  
0.357688086  
0.3458081035  
0.3345243456  
0.3237582142  
0.313393826  
0.3035095452  
0.2940378632  
0.2849727711  
0.276247809  
0.267927982  
0.2599066689  
0.2522081069  
0.2448457946  
0.2377578939  
0.2309293221  
0.2243837202  
0.218088208  
0.2120210492  
0.2061849535  
0.2005672443  
0.1951555769  
0.1899460281  
0.1849186234  
0.1800707935  
0.1753957799  
0.1708883297  
0.1665368425  
0.1623308739  
0.1582796308  
0.1543534402  
0.1505632956  
0.1469057451  
0.1433661838  
0.1399413552  
0.1366338459  
0.1334260903  
0.1303253192  
0.1273243634  
0.12441395  
0.1215989759  
0.1188705279  
0.1162248253  
0.1136577457  
0.1111743426  
0.1087648119  
0.1064252504  
0.1041546985  
0.1019529717  
0.09981707506  
0.09773675473  
0.09571989085  
0.09376491729  
0.09186011115  
0.09001269568  
0.08821771395  
0.08646925098  
0.08476869956  
0.08312273456  
0.08151335389  
0.0799471843  
0.0784277369  
0.07694884564  
0.0755075646  
0.07410277744  
0.07273911641  
0.07140795496  
0.07011041601  
0.06885020003  
0.06761894662  
0.06642006583  
0.06525362652  
0.06410882335  
0.06300040213  
0.06191625954  
0.06085665285  
0.0598290421  
0.05882208421  
0.05783860918  
0.05688246371  
0.0559491745  
0.05503361139  
0.05414279379  
0.05327267966  
0.05242025806  
0.05159179947  
0.05078048104  
0.04998756227  
0.04921317597  
0.04845485435  
0.0477189067  
0.04699436492  
0.04628653786  
0.04559341601  
0.04491796898  
0.04425678953  
0.04361042568  
0.04297592276  
0.04235666143  
0.04175070892  
0.04115841327  
0.04057785229  
0.0400094337  
0.03945378645  
0.03891011323  
0.03837484744  
0.03785221744  
0.03734372151  
0.03683997639  
0.03634873573  
0.0358696937  
0.03539896577  
0.03493822248  
0.03448364326  
0.03404139038  
0.03360734169  
0.03318025857  
0.03276294104  
0.03235221475  
0.03195258317  
0.03155860738  
0.03117012577  
0.03079286599  
0.03042373884  
0.03005751185  
0.02969874026  
0.02934848636  
0.02900545583  
0.02866577316  
0.02833400023  
0.02800879568  
0.02768896769  
0.02737569348  
0.02706725907  
0.02676633641  
0.02646973332  
0.02617640969  
0.02589091942  
0.02561003501  
0.0253332932  
0.0250628515  
0.02479556822  
0.02453550811  
0.02427586344  
0.02402462655  
0.0237759373  
0.02353167713  
0.0232911803  
0.02305687527  
0.02282448349  
0.0225948536  
0.02237278164  
0.02215325662  
0.02193741668  
0.02172433461  
0.02151400107  
0.02130980891  
0.02110672995  
0.02090606425  
0.02071364934  
0.02051863773  
0.0203302387  
0.02014448628  
0.01996037746  
0.01978002934  
0.01960321144  
0.01942947621  
0.01925712162  
0.01908810156  
0.01892126389  
0.01875838282  
0.01859709857  
0.01843890187  
0.01828284008  
0.018129118  
0.01797708539  
0.01783024363  
0.01768341597  
0.0175393162  
0.01739820288  
0.01725769157  
0.01712027927  
0.01698481432  
0.01685110195  
0.01672091282  
0.01659042438  
0.01646282061  
0.01633797118  
0.01621333693  
0.01609262352  
0.01597233202  
0.01585429006  
0.01573789929  
0.01562339746  
0.01551102766  
0.01540103738  
0.01529096342  
0.01518271989  
0.01507526597  
0.01497182715  
0.0148677849  
0.01476627222  
0.01466669313  
0.01456774828  
0.01447063082  
0.01437395598  
0.01428107011  
0.01418620455  
0.01409530725  
0.01400484074  
0.01391674387  
0.01382808342  
0.01374075693  
0.01365634691  
0.01357290185  
0.01348921857  
0.01340825748  
0.01332785676  
0.0132471407  
0.01316968707  
0.01309208316  
0.01301661954  
0.01294117322  
0.01286804946  
0.01279583002  
0.01272349337  
0.01265357525  
0.01258340342  
0.01251505087  
0.01244673589  
0.01238014726  
0.01231504138  
0.0122495308  
0.01218586242  
0.01212425675  
0.01206133896  
0.01199964949  
0.01193986345  
0.01187972238  
0.01182092654  
0.01176279894  
0.0117067217  
0.01165056346  
0.0115958653  
0.01154122564  
0.01148732129  
0.01143420364  
0.01138152093  
0.01132918908  
0.01128040656  
0.01122991215  
0.01118075471  
0.01113247266  
0.01108466648  
0.01103755062  
0.01099178084  
0.01094601083  
0.01090012116  
0.01085637112  
0.01081203093  
0.01076933306  
0.01072729161  
0.01068603608  
0.01064493618  
0.0106038797  
0.01056465474  
0.01052562431  
0.01048620104  
0.01044880536  
0.010409647  
0.0103738415  
0.01033727298  
0.01030119817  
0.01026558294  
0.01023239129  
0.01019756207  
0.01016427412  
0.01013124106  
0.01009852699  
0.01006715645  
0.010035843  
0.01000448961  
0.00997503283  
0.009943790341  
0.009914587742  
0.009885912405  
0.009856631578  
0.009830146686  
0.009801776961  
0.009775383841  
0.009748641773  
0.009722349718  
0.009697823955  
0.009671857429  
0.009647082928  
0.009623295896  
0.009600754059  
0.009576986347  
0.009554156373  
0.009532217737  
0.009509902868  
0.009488463718  
0.009467694013  
0.009447060188  
0.009426382003  
0.009406462219  
0.009387212895  
0.009368319954  
0.009349762483  
0.009331181595  
0.009314398058  
0.009296418365  
0.009279334002  
0.009263419701  
0.009247205409  
0.009232258435  
0.009216263102  
0.009202335525  
0.009186523944  
0.009172611008  
0.009159752924  
0.009144982149  
0.009132489751  
0.009119769541  
0.009108422495  
0.009095876754  
0.009084330794  
0.009073478626  
0.009062912281  
0.009052112417  
0.009042592679  
0.009031843559  
0.009024090553  
0.009014372965  
0.009005541675  
0.008997438159  
0.008988901962  
0.008982744901  
0.008974732068  
0.008968365154  
0.008961346909  
0.008955736801  
0.008949237113  
0.008945584879  
0.008939664385  
0.008935285628  
0.008930569305  
0.008927466729  
0.008923173722  
0.008920323319  
0.008917131801  
0.008914175469  
0.008912549279  
0.008910294623  
0.008908130538  
0.008907807298  
0.008905952423  
0.008906297277  
0.008905300314  
