66.74346965  
84.7270008  
128.8782209  
247.4767553  
601.8638474  
4944.843336  
9635.33256  
78728.74173  
12775.28782  
27480.62973  
26335.74339  
19412.62216  
12833.01635  
11910.19392  
15636.80303  
2756.538722  
13929.06141  
12927.88566  
7924.144228  
32126.75678  
66901.46715  
2722.809046  
5473.986075  
8288.826555  
1716.779984  
3639.110149  
7657.492875  
624.0694004  
3688.915115  
20068.61187  
8295.018105  
11851.5588  
120.7134762  
10466.98691  
9380.562433  
277.5768657  
3712.421095  
663.9137944  
455.4148827  
93.05453364  
273.0730122  
829.6836705  
8168.898131  
2658.831047  
650.94873  
632.8768258  
4361.538844  
2605.004231  
163.445011  
40.89556356  
2453.360134  
43.13820991  
138.4270073  
1628.634579  
2549.08004  
1018.929773  
731.1763799  
60.95512404  
150.9466344  
255.9468766  
78.92291538  
374.6713066  
511.4153938  
58.13739935  
167.0955431  
16.87590791  
10.24228354  
16.05784458  
41.26085796  
39.28653374  
20.84389899  
13.52190378  
1.523461714  
10.69016783  
3.985659328  
1.475145572  
9.867696478  
7.149996838  
3.482634123  
3.719867308  
2.197919696  
2.302730754  
2.384113579  
2.77452246  
3.397278902  
2.777558248  
2.385402866  
2.668321966  
2.302329362  
2.368555086  
2.199899387  
2.328487016  
2.101728406  
2.066288999  
2.072094547  
2.000684719  
1.862841556  
1.899021664  
1.793984987  
1.773077253  
1.710170152  
1.679775063  
1.650350255  
1.607930922  
1.56540984  
1.529356665  
1.501741969  
1.45818281  
1.435882651  
1.398199479  
1.366384974  
1.343732957  
1.312547794  
1.289590903  
1.262510084  
1.236161872  
1.212998652  
1.188083185  
1.165839477  
1.144574037  
1.122112198  
1.101387666  
1.081715409  
1.062380884  
1.043358828  
1.025023206  
1.007442621  
0.9898588965  
0.9729485067  
0.9566887076  
0.9407496181  
0.9252089119  
0.9102231723  
0.8955843497  
0.8813095411  
0.8674420674  
0.853939141  
0.840735191  
0.8278585652  
0.8153731403  
0.8031696353  
0.7912750052  
0.779628372  
0.7683097714  
0.7572600543  
0.7464660667  
0.7359186964  
0.7256278218  
0.715595297  
0.7057648444  
0.6961761092  
0.6867837251  
0.6776167051  
0.6686536241  
0.6598874742  
0.6513127924  
0.6429238545  
0.6347183028  
0.6266794043  
0.6188244515  
0.6111307596  
0.6035919468  
0.5962061116  
0.5889781329  
0.5818981297  
0.5749654519  
0.5681648252  
0.5615140572  
0.5549773995  
0.5485789699  
0.5422968373  
0.5361509293  
0.5301094925  
0.5241934306  
0.518380952  
0.5126751938  
0.5070893094  
0.50161595  
0.4962397951  
0.4909280319  
0.4857460352  
0.4806588258  
0.4756573768  
0.4707481289  
0.465919521  
0.4611825359  
0.4565242222  
0.4519632044  
0.4474586663  
0.4430423794  
0.4387133385  
0.4344442617  
0.4302497923  
0.4261313422  
0.4220783795  
0.4180929266  
0.4141733658  
0.410321781  
0.4065285922  
0.402798682  
0.3991338604  
0.3955205794  
0.3919760437  
0.388473952  
0.3850469624  
0.3816583432  
0.378337588  
0.3750560085  
0.3718304177  
0.3686603469  
0.3655237086  
0.3624451163  
0.3594199886  
0.3564345313  
0.3534884382  
0.3505967218  
0.3477372983  
0.3449313729  
0.3421657919  
0.3394349122  
0.3367442854  
0.3341130675  
0.3314927325  
0.3289147572  
0.3263982665  
0.3238964912  
0.32144128  
0.3190100646  
0.3166069412  
0.3142611772  
0.3119279786  
0.3096463679  
0.3073834817  
0.3051636706  
0.3029630521  
0.3007967598  
0.2986564144  
0.296550282  
0.2944624537  
0.2924272014  
0.2903950259  
0.2884076927  
0.286430399  
0.284500065  
0.2825758612  
0.2806836968  
0.2788242997  
0.2769776851  
0.2751579053  
0.2733696887  
0.2716037356  
0.2698615852  
0.2681368361  
0.2664327666  
0.2647531556  
0.2630942742  
0.2614611646  
0.259843114  
0.2582538093  
0.2566724902  
0.2551206321  
0.2535771319  
0.2520671503  
0.2505708164  
0.2490891651  
0.2476307222  
0.2461869263  
0.2447654626  
0.2433620315  
0.2419764668  
0.2405951828  
0.2392397827  
0.2379007306  
0.2365839287  
0.2352792686  
0.2339819697  
0.2327137826  
0.2314500327  
0.2302051267  
0.2289760725  
0.2277575715  
0.2265576015  
0.2253733707  
0.2242050055  
0.2230433304  
0.2219033801  
0.2207701851  
0.2196435077  
0.2185398774  
0.2174551295  
0.2163716888  
0.2153051054  
0.2142570253  
0.213219232  
0.2121835946  
0.2111706576  
0.2101651509  
0.2091709412  
0.2081915804  
0.2072170394  
0.2062559441  
0.205301481  
0.2043641248  
0.2034399614  
0.2025208234  
0.2016171702  
0.2007175612  
0.1998363058  
0.1989508803  
0.1980850037  
0.1972363464  
0.1963889727  
0.1955563564  
0.1947320091  
0.1939057698  
0.1931027657  
0.1922952186  
0.1915062748  
0.1907204441  
0.1899525789  
0.1891860964  
0.1884319097  
0.1876828146  
0.1869408566  
0.1862166996  
0.1854868899  
0.1847764197  
0.1840706935  
0.1833754123  
0.1826712629  
0.1819887981  
0.1813271332  
0.1806493034  
0.1799920216  
0.1793376925  
0.1786880439  
0.1780557529  
0.1774238579  
0.1767983512  
0.1761822004  
0.1755729454  
0.1749737162  
0.1743693892  
0.173776688  
0.1731926794  
0.1726204596  
0.1720452313  
0.1714793228  
0.1709232534  
0.1703752128  
0.169832578  
0.1692862391  
0.1687595656  
0.1682226548  
0.1677069656  
0.1671966938  
0.1666851585  
0.1661750047  
0.1656802583  
0.1651898887  
0.1646985342  
0.164218527  
0.1637444683  
0.1632765961  
0.1628038816  
0.1623482381  
0.1618919508  
0.1614471931  
0.1610037017  
0.1605638125  
0.1601330503  
0.1597073596  
0.1592821422  
0.1588621897  
0.1584459198  
0.1580417956  
0.1576386472  
0.1572380399  
0.1568452827  
0.1564553337  
0.1560716605  
0.1556962803  
0.1553143218  
0.1549532629  
0.1545816951  
0.1542202704  
0.1538590774  
0.1535108787  
0.1531594807  
0.1528185315  
0.1524754346  
0.1521420744  
0.1518133004  
0.1514817944  
0.1511656634  
0.1508392697  
0.1505328895  
0.1502194753  
0.1499092975  
0.1496115244  
0.149313352  
0.1490155464  
0.1487307019  
0.1484357747  
0.1481539424  
0.1478824942  
0.147607114  
0.147332517  
0.1470718303  
0.1468049333  
0.1465468928  
0.1462861963  
0.1460362765  
0.1457838461  
0.1455403399  
0.1453018761  
0.1450624952  
0.144826132  
0.1445999093  
0.1443695951  
0.1441482951  
0.1439318956  
0.1437120367  
0.1434973309  
0.1432895977  
0.1430861342  
0.1428779104  
0.1426833662  
0.1424853945  
0.1422949938  
0.1421013328  
0.1419210122  
0.1417311095  
0.1415500989  
0.1413763019  
0.1412089302  
0.1410368934  
0.1408667852  
0.140702042  
0.1405464179  
0.1403927964  
0.1402338603  
0.1400925951  
0.1399379561  
0.1397907113  
0.1396490302  
0.1395140319  
0.1393808941  
0.1392451386  
0.1391126071  
0.1389889895  
0.1388625177  
0.138746804  
0.1386289466  
0.1385159723  
0.1384045859  
0.1382981825  
0.1381955883  
0.1380963244  
0.137999094  
0.1378976225  
0.1378014674  
0.1377155558  
0.1376280627  
0.1375426772  
0.1374661773  
0.1373851591  
0.1373121655  
0.1372406428  
0.1371648858  
0.1371020547  
0.1370389342  
0.1369758946  
0.1369152873  
0.1368595546  
0.1368130384  
0.1367610948  
0.1367156614  
0.1366704868  
0.1366316485  
0.1365895568  
0.1365610258  
0.1365238  
0.1365003187  
0.1364658972  
0.1364404293  
0.1364272497  
0.1364046846  
0.1363882403  
0.1363725678  
0.1363646165  
0.1363513136  
0.1363573453  
0.136353357  
