1.001926674  
2.339180026  
5.436025783  
14.12585244  
83.12721433  
1589.900365  
36642.17592  
6733.105176  
33624.02446  
8895.258999  
2611.557197  
32631.99385  
43962.33064  
12238.60076  
682.8979654  
17612.49189  
9110.53219  
28860.25638  
20872.12626  
6982.01215  
2150.657849  
5395.677246  
6498.793945  
1800.844532  
13204.26076  
5405.593853  
6898.986853  
4668.638754  
2188.529871  
11147.91099  
13752.25611  
4308.586888  
2217.375402  
6445.18725  
16129.19415  
8712.862607  
5135.463487  
7114.026511  
3225.282854  
17945.27048  
3384.110225  
4483.982815  
3722.655297  
4897.928826  
10686.51868  
2995.733621  
2778.936206  
14882.28148  
1370.320285  
8114.697881  
3089.468823  
2698.733805  
135.1520761  
1418.642708  
954.2838437  
1090.537992  
987.3887789  
1046.355496  
3591.895965  
573.4876354  
1156.651074  
1139.691326  
820.428129  
1656.82633  
888.8188868  
271.7501702  
316.2294516  
507.5594362  
184.1413931  
43.46045871  
35.40050888  
6.03135458  
19.08592047  
5.171045767  
2.372316935  
27.33013699  
5.40409449  
1.662733709  
2.203743047  
1.93861648  
1.031786614  
2.11768162  
2.920240454  
3.355729168  
1.412343248  
0.9794920244  
1.203298829  
0.761290406  
1.039042305  
1.027363026  
1.181364149  
1.183164209  
1.178156398  
0.9561316081  
0.880366519  
0.7783479308  
0.8334308823  
0.8175511619  
0.8282690088  
0.7981962063  
0.7594172193  
0.7452624878  
0.7113874284  
0.6745957735  
0.667017482  
0.659829852  
0.650736659  
0.635318526  
0.6102445335  
0.5960286125  
0.5800965519  
0.5648060576  
0.5537040325  
0.5407349055  
0.5279168804  
0.5197820488  
0.5083338148  
0.4970199582  
0.485739822  
0.4749396574  
0.4656344963  
0.4569244372  
0.4481886763  
0.4401869261  
0.4317025805  
0.4231876147  
0.4149814876  
0.4073526462  
0.4003800787  
0.3930103628  
0.3862993946  
0.3795703585  
0.3729974242  
0.3666383262  
0.3604360854  
0.3544491843  
0.3485999589  
0.3429308247  
0.3374931487  
0.3322127351  
0.3269973256  
0.3219167543  
0.3169951087  
0.3121813273  
0.307485778  
0.3029133368  
0.2984749698  
0.29414628  
0.2898961614  
0.2857882125  
0.2817433092  
0.277810421  
0.2739632967  
0.2702206245  
0.2665665573  
0.2629852297  
0.2594879443  
0.2560744322  
0.2527174415  
0.2494552256  
0.2462562314  
0.2431300805  
0.2400771421  
0.2370781656  
0.2341519189  
0.2312865835  
0.2284809298  
0.2257253443  
0.2230321521  
0.2203954139  
0.2178157632  
0.2152823401  
0.2127947248  
0.2103669219  
0.2079819257  
0.2056427575  
0.2033463865  
0.2010986029  
0.198890272  
0.1967266361  
0.194609713  
0.1925250327  
0.1904722349  
0.1884729274  
0.186500597  
0.184572403  
0.182674413  
0.1808046322  
0.1789743535  
0.1771749297  
0.1754061467  
0.1736765479  
0.1719596534  
0.1702966161  
0.1686472331  
0.1670206855  
0.1654360602  
0.1638683523  
0.1623312299  
0.1608167397  
0.1593341621  
0.1578699879  
0.1564285166  
0.1550124803  
0.1536171798  
0.152245326  
0.1509001657  
0.1495765861  
0.1482712234  
0.1469823843  
0.1457230494  
0.1444782332  
0.1432546176  
0.1420499062  
0.1408607077  
0.1396956279  
0.1385489206  
0.1374079291  
0.1362889517  
0.1351893511  
0.1341075402  
0.1330419622  
0.1319892012  
0.1309554008  
0.1299297786  
0.1289281984  
0.1279406549  
0.1269574524  
0.126000911  
0.1250503148  
0.1241155818  
0.1231949186  
0.1222839452  
0.1213879225  
0.1205002331  
0.1196328766  
0.1187748824  
0.1179308068  
0.1170883712  
0.1162712945  
0.1154557484  
0.1146554007  
0.1138657923  
0.1130875161  
0.1123170394  
0.1115574499  
0.1108127896  
0.1100742732  
0.1093372353  
0.1086244962  
0.1079126055  
0.107211048  
0.10652161  
0.1058420716  
0.1051656454  
0.1045057833  
0.1038504776  
0.1031941462  
0.1025640622  
0.1019283669  
0.1013092555  
0.1006886514  
0.1000832972  
0.09948582006  
0.09889261754  
0.09830726178  
0.09773142982  
0.09716547519  
0.09659877062  
0.09604617369  
0.09549480898  
0.09495369725  
0.094417059  
0.09388783001  
0.09336742105  
0.09285025778  
0.09234342373  
0.09184073469  
0.09133702529  
0.09084775951  
0.0903653925  
0.08988485267  
0.08940863753  
0.08893768476  
0.08847731104  
0.08802193785  
0.08757278665  
0.08712265248  
0.08668310612  
0.08624876062  
0.08581505229  
0.08539087766  
0.08497099881  
0.08455773076  
0.08414489852  
0.08373677069  
0.08333334371  
0.08294160436  
0.08254511444  
0.08215673979  
0.08177583467  
0.08139849022  
0.08102415621  
0.08065290016  
0.08028599213  
0.07992529763  
0.07956829775  
0.07921454593  
0.07886933048  
0.0785205923  
0.07817585507  
0.07784097429  
0.07750795206  
0.07717827514  
0.07685134161  
0.07652901218  
0.0762071447  
0.07589263225  
0.07558197146  
0.07527235239  
0.07497291085  
0.07466787172  
0.07437110084  
0.07407423427  
0.07378432106  
0.07349840352  
0.07321060391  
0.07293285627  
0.07265485953  
0.072376976  
0.07210737781  
0.07183568633  
0.0715687905  
0.07130841515  
0.07104523067  
0.07079109107  
0.07053325955  
0.07028177393  
0.07003451399  
0.06979121998  
0.06954657696  
0.0693040355  
0.06906718485  
0.0688337065  
0.06860038405  
0.06837209289  
0.06814019386  
0.06791764166  
0.06769673817  
0.06747417308  
0.0672604073  
0.06704445982  
0.06683360889  
0.0666224744  
0.06641346423  
0.06621175638  
0.06600886111  
0.06580282816  
0.06561038289  
0.06541433172  
0.06522013906  
0.06502903126  
0.06483936049  
0.06465001515  
0.06446848727  
0.06428567989  
0.06410406975  
0.06392415593  
0.06374776451  
0.06357090676  
0.06340126531  
0.06323523168  
0.06306555415  
0.06289605979  
0.06273395942  
0.06257246976  
0.06240869585  
0.06224841688  
0.06209552771  
0.06194058601  
0.06178650015  
0.06163760203  
0.06148660996  
0.06133889091  
0.06119373676  
0.06105290073  
0.06090803841  
0.06076784775  
0.0606310555  
0.06049217217  
0.06035696893  
0.0602227783  
0.06009241071  
0.05996220749  
0.05983055354  
0.05970702158  
0.0595808348  
0.05945833083  
0.05934019292  
0.05921979813  
0.05910196076  
0.05898534157  
0.05886622665  
0.05875087297  
0.0586406961  
0.05852918132  
0.05841967171  
0.05831130438  
0.05820673344  
0.05810462537  
0.057998825  
0.05789752164  
0.05779604873  
0.05769612  
0.05760056127  
0.05750492495  
0.0574110922  
0.05732041806  
0.05722843868  
0.05713182054  
0.057050463  
0.05695739957  
0.05687289352  
0.0567881425  
0.0567082323  
0.05662407008  
0.05654387595  
0.05646531231  
0.05638641646  
0.05630936569  
0.05623325468  
0.05616273483  
0.05608719175  
0.05601638181  
0.05594646194  
0.05587776824  
0.05581012702  
0.055742343  
0.05567951252  
0.05561655173  
0.05555301249  
0.05549066463  
0.05543411128  
0.0553751339  
0.05531667338  
0.05526158951  
0.0552057088  
0.05515180169  
0.05509538764  
0.05504937851  
0.0549979531  
0.05495149673  
0.05490289737  
0.05485823331  
0.05480925065  
0.05476533425  
0.05472532857  
0.05468234369  
0.0546428323  
0.05460320861  
0.0545620532  
0.05452663696  
0.05449289352  
0.05445616875  
0.05442387616  
0.05439254838  
0.05436196924  
0.05433192167  
0.05430404582  
0.05427509119  
0.05424764559  
0.05422159302  
0.0541986801  
0.0541749971  
0.05415344307  
0.05413424438  
0.0541134525  
0.05409511285  
0.05407595719  
0.0540598415  
0.05404731664  
0.0540333053  
0.05401995573  
0.05400873189  
0.0539957264  
0.05398459682  
0.0539784428  
0.05396875598  
0.05396413153  
0.05395703498  
0.05395514265  
0.05395259235  
0.0539476552  
0.05394699918  
