0.214301562  
0.7125494133  
1.173919635  
1.564206995  
1.856718884  
2.035177883  
2.095387986  
2.045492111  
1.904763647  
1.701105483  
1.467556254  
1.238254296  
1.044347655  
0.9103750194  
0.8515416709  
0.8722219784  
0.9658432794  
1.116117218  
1.299444481  
1.488118814  
1.653911832  
1.771554028  
1.821680495  
1.79288202  
1.682656964  
1.497212436  
1.250215708  
0.9607531902  
0.6508185085  
0.3427148563  
0.05671817412  
-0.1907195833  
-0.3880646455  
-0.5290451452  
-0.6123403481  
-0.6407869179  
-0.6203258232  
-0.5589363973  
-0.465741495  
-0.3503939129  
-0.2227640333  
-0.09286437632  
0.02914011718  
0.1329874111  
0.208598437  
0.2466706007  
0.239577816  
0.1825121156  
0.07465252979  
-0.0798530478  
-0.2713478055  
-0.4847799109  
-0.7005894102  
-0.8963661539  
-1.049143831  
-1.138074405  
-1.147120059  
-1.067384477  
-0.8987201386  
-0.6503194839  
-0.3401641626  
0.006657756675  
0.3605719447  
0.6907444173  
0.9684801187  
1.170348065  
1.280601673  
1.292575814  
1.208909565  
1.040589048  
0.8049982992  
0.5233071701  
0.2175966741  
-0.0918348246  
-0.3886054054  
-0.6615335842  
-0.9049438312  
-1.118017716  
-1.303373598  
-1.465182329  
-1.607170607  
-1.730905723  
-1.83465477  
-1.91304232  
-1.957561123  
-1.957869519  
-1.903652132  
-1.786752024  
-1.603207484  
-1.354859776  
-1.050246578  
-0.7046098737  
-0.3389665601  
0.02167115005  
0.3507071333  
0.6227325961  
0.8162945531  
0.9163387238  
0.9160211654  
0.8176865582  
0.6328812  
0.3814216422  
0.0896046974  
-0.2122432334  
-0.4926145449  
-0.7217828007  
-0.8745818482  
-0.9327358426  
-0.8865226763  
-0.7356180056  
-0.4890635435  
-0.164370202  
0.2141382205  
0.6175706928  
1.01507039  
1.376513238  
1.675048482  
1.889228032  
2.004537014  
2.014218061  
1.919322867  
1.728083545  
1.454680847  
1.117643121  
0.7380448574  
0.3377526206  
-0.06212277337  
-0.4424202936  
-0.7867313977  
-1.081800854  
-1.317612925  
-1.487249482  
-1.586655055  
-1.614405693  
-1.571533167  
-1.461439935  
-1.28986096  
-1.064813102  
-0.7964370392  
-0.4966733775  
-0.1787164038  
0.1437382949  
0.4573995674  
0.7503192791  
1.012748828  
1.237742878  
1.421422192  
1.562813127  
1.66328053  
1.725626828  
1.753013098  
1.7478795  
1.711083158  
1.64141959  
1.535661006  
1.389143479  
1.196853296  
0.9548659241  
0.6619190386  
0.3208603085  
-0.0602943889  
-0.4679091531  
-0.8830388832  
-1.282548907  
-1.640965824  
-1.932891358  
-2.135699828  
-2.232185322  
-2.212817178  
-2.077274828  
-1.835037077  
-1.504884435  
-1.113335766  
-0.6921582575  
-0.2752320285  
0.1048659766  
0.42015986  
0.6500291201  
0.7831120086  
0.8181005953  
0.7633623005  
0.6354341865  
0.4566261824  
0.2520459984  
0.04645887842  
-0.1385958917  
-0.2870566106  
-0.3896803265  
-0.4443311523  
-0.4552341245  
-0.4313629113  
-0.3842833808  
-0.3258027198  
-0.2658451588  
-0.2108941978  
-0.1632352784  
-0.1210965005  
-0.07962238202  
-0.03245378656  
0.02639805869  
0.1007458496  
0.1908555716  
0.29275801  
0.3983845117  
0.4965139193  
0.57436685  
0.6195756632  
0.622205078  
0.5764709957  
0.481896413  
0.3437133561  
0.1724651891  
-0.01712832183  
-0.2078511315  
-0.3819819248  
-0.5233044594  
-0.6188834036  
-0.6603977479  
-0.6448940874  
-0.5749120022  
-0.4580149837  
-0.3058296915  
-0.132721748  
0.04571090933  
0.2141671728  
0.359050688  
0.469620597  
0.5388077694  
0.5636435692  
0.5452795032  
0.4886266385  
0.4016742914  
0.2945462243  
0.1784227956  
0.0644142941  
-0.03748104695  
-0.1192508318  
-0.1754736953  
-0.2036230212  
-0.2040300438  
-0.1795390894  
-0.1349059136  
-0.07601603176  
-0.00903024502  
0.06043047041  
0.1279670146  
0.1908648362  
0.2482733752  
0.3011040979  
0.3516499463  
0.403004364  
0.4583540834  
0.5202634408  
0.5900444224  
0.6673246242  
0.7498563094  
0.8336126025  
0.9131560883  
0.9822201851  
1.034425844  
1.064033858  
1.066618466  
1.039573059  
0.98236583  
0.8965231333  
0.7853284666  
0.6532993003  
0.5055122403  
0.3468995634  
0.1816256845  
0.01265900197  
-0.1583773545  
-0.3310434254  
-0.50562587  
-0.6824666431  
-0.861197533  
-1.040035816  
-1.215296627  
-1.381255246  
-1.530436524  
-1.654343099  
-1.744538362  
-1.793961353  
-1.798242535  
-1.756819249  
-1.673616366  
-1.557138531  
-1.419876564  
-1.277058802  
-1.14486408  
-1.038329869  
-0.9692383609  
-0.9443167163  
-0.964024701  
-1.02216055  
-1.106392024  
-1.199677903  
-1.28240953  
-1.335000973  
-1.340553418  
-1.287227469  
-1.169969928  
-0.9913561806  
-0.7614005135  
-0.4963905104  
-0.2168668889  
0.05493154828  
0.2978381626  
0.4943330296  
0.6326164113  
0.7078779652  
0.72263946  
0.6861351693  
0.612848296  
0.520421549  
0.4272479924  
0.3500688156  
0.301904203  
0.2905843069  
0.3180496781  
0.3804910583  
0.4692653797  
0.5724354464  
0.6766776015  
0.7692818532  
0.8399274836  
0.8820129989  
0.8933357858  
0.8760652165  
0.8360490223  
0.7816031981  
0.7220138503  
0.6660309055  
0.6206218469  
0.5902068159  
0.576504212  
0.578995748  
0.5959036748  
0.6254662955  
0.6672167304  
0.7229867995  
0.7973344299  
0.8972656966  
1.031162129  
1.207051222  
1.430434735  
1.702048758  
2.015934865  
2.358240179  
2.70704704  
3.033421037  
3.303676284  
3.482673679  
3.537778715  
3.442998028  
3.182722086  
2.754538267  
2.17067887  
1.457815871  
0.6551582976  
-0.1889694067  
-1.021698602  
-1.79076845  
-2.449638846  
-2.961935792  
-3.304703022  
-3.470089335  
-3.465330576  
-3.311099454  
-3.038521853  
-2.685278679  
-2.291334016  
-1.89482201  
-1.528557236  
-1.217503651  
-0.9774049226  
-0.8145833304  
-0.726788828  
-0.7048461976  
-0.7348029528  
-0.8002413576  
-0.8844579336  
-0.9722776913  
-1.051357092  
-1.11290071  
-1.151834174  
-1.166504412  
-1.158045967  
-1.12956394  
-1.085263423  
-1.029647116  
-0.9668715739  
-0.9002925651  
-0.8322184657  
-0.7638576717  
-0.6954221196  
-0.6263454383  
-0.5555777645  
-0.4819190687  
-0.4043442838  
-0.3223050769  
-0.2359623352  
-0.1463177236  
-0.05523327327  
0.03469917488  
0.1204200146  
0.1987869922  
0.267039142  
0.32325593  
0.3667549287  
0.3983260803  
0.420249913  
0.4360554751  
0.4500261566  
0.4665245138  
0.4891965913  
0.5202278987  
0.5597458589  
0.605516681  
0.6529984068  
0.6957962687  
0.72645966  
0.737537359  
0.7227240352  
0.677939145  
0.6021550814  
0.4978337584  
0.3708887047  
0.2301622492  
0.0864704756  
-0.04864968747  
-0.1643147088  
-0.2516073171  
-0.3046275145  
-0.3211440181  
-0.3027596477  
-0.2545712848  
-0.1843900608  
-0.1016243049  
-0.01600525491  
0.06367860684  
0.1306731732  
0.1810188169  
0.2139112103  
0.2316145028  
0.2389572883  
0.2424901724  
0.2494239642  
0.2664891405  
0.2988732151  
0.3493698229  
0.4178556764  
0.5011703522  
0.5934167798  
0.6866540132  
0.7719029377  
0.8403361299  
0.8844977809  
0.8993881709  
0.883251322  
0.8379490093  
0.7688324532  
0.6841197752  
0.5938196124  
0.5083441673  
0.4369888388  
0.3864846102  
0.3598536294  
0.3557423953  
0.368380319  
0.3881936947  
0.4030492874  
0.3999762562  
0.367151983  
0.2958686385  
0.1821983107  
0.02808594622  
-0.1583264144  
-0.3632427868  
-0.568586245  
-0.7540693895  
-0.8996805931  
-0.9882663999  
-1.007841498  
-0.9533009058  
-0.8272720901  
-0.6399861217  
-0.408159955  
-0.1530606469  
0.1020024269  
0.3343905647  
0.5247019723  
0.6588346643  
0.7292922487  
0.7355898004  
0.6837434692  
0.5849650165  
0.4537832963  
0.3058860274  
0.1559950645  
0.01607061866  
-0.1059386433  
-0.2066583854  
-0.28715059  
-0.3521389013  
-0.4087817508  
-0.4651772691  
-0.528871245  
-0.6055551053  
-0.6981383962  
-0.8062880495  
-0.9264604373  
-1.052377608  
-1.175843419  
-1.287757152  
-1.379185873  
-1.442343246  
-1.471386712  
-1.462956967  
-1.416431894  
-1.33390925  
-1.219956402  
-1.081171487  
-0.9256154246  
-0.7621811159  
-0.5999400272  
-0.4475125638  
-0.3125041966  
-0.2010259329  
-0.1173358557  
-0.06360358347  
-0.03983146452  
-0.0439108898  
-0.07184280043  
-0.1180810455  
-0.1759964982  
-0.2384072024  
-0.2981438515  
-0.3485846447  
-0.3841228446  
-0.4005106407  
-0.3950386339  
-0.3665558296  
-0.3153144796  
-0.2426834625  
-0.1507764259  
-0.04205447804  
0.08101525454  
0.2161906176  
0.3615269323  
0.515266532  
0.6755729964  
0.8401485302  
1.005819474  
1.168203311  
1.321529398  
1.458715589  
1.571744182  
1.652322731  
1.692793823  
1.687159095  
1.632097123  
1.527792234  
1.378430895  
1.192240066  
0.9810167696  
0.7591556077  
0.5422717389  
0.3455796019  
0.182230461  
0.06184229334  
-0.01058888269  
-0.0352201609  
-0.0172742099  
0.03366966834  
0.1048939582  
0.1821119372  
0.2511508862  
0.2995328849  
0.3177370109  
0.3000023746  
0.2446006678  
0.1535990884  
0.03221227356  
-0.1121078535  
-0.2706498393  
-0.4343437557  
-0.5944328282  
-0.7428695732  
-0.8724254407  
-0.9766021173  
-1.049441432  
-1.085376007  
-1.079239562  
-1.026519317  
-0.9238582663  
-0.7697847575  
-0.565535276  
-0.315827501  
-0.02940969095  
0.2807806861  
0.5979719693  
0.9024669327  
1.173087329  
1.389023624  
1.531902633  
1.587822878  
1.549100704  
1.415470274  
1.19455711  
0.9015103474  
0.5577983847  
0.189267829  
-0.1763285697  
-0.512051965  
-0.7944410595  
-1.005787041  
-1.135765909  
-1.18222169  
-1.15102235  
-1.055015712  
-0.9122234616  
-0.7435169232  
-0.5700793661  
-0.4109621339  
-0.2810560157  
-0.1897180735  
-0.1401950734  
-0.1298990784  
-0.1514454055  
-0.1942800862  
-0.2466281352  
-0.2974761863  
-0.338281378  
-0.3641598728  
-0.3744061559  
-0.3722603584  
-0.3640120359  
-0.3575858005  
-0.360865911  
-0.3800415769  
-0.4182544473  
-0.4747810458  
-0.544891395  
-0.6204148535  
-0.6909342257  
-0.7454080621  
-0.7739712392  
-0.7696041621  
-0.7294072512  
-0.6552484443  
-0.5536832829  
-0.4351288866  
-0.3124319265  
-0.1990229519  
-0.1069698351  
-0.04520090437  
-0.0181911266  
-0.02528925197  
-0.06079952083  
-0.1147789819  
-0.1744402305  
-0.2259358788  
-0.2562730577  
-0.2550804749  
-0.2159974937  
-0.1375076696  
-0.02312938396  
0.1190416841  
0.2773368351  
0.4379308747  
0.5864559049  
0.7096150315  
0.7965866608  
0.8400832651  
0.8369409501  
0.7882126277  
0.698794882  
0.5766638131  
0.4318432828  
0.275262567  
0.1176400695  
-0.03147166855  
-0.1643724677  
-0.2755909855  
-0.3619262861  
-0.4222110361  
-0.4568424237  
-0.4672071631  
-0.4550795996  
-0.4220991829  
-0.3694068174  
-0.2974917977  
-0.2062478741  
-0.09524064262  
0.03586418726  
0.1867974478  
0.3561623804  
0.5409944557  
0.7364581033  
0.9357657461  
1.130334503  
1.310190485  
1.464611961  
1.582950107  
1.655560402  
1.674752054  
1.635660503  
1.536939745  
1.381198566  
1.175104862  
0.9291362404  
0.6569683858  
0.3745384482  
0.09885763724  
-0.1533378075  
-0.366968295  
-0.5299103872  
-0.6340808996  
-0.6762108169  
-0.6582111819  
-0.5870975915  
-0.4744414389  
-0.335414089  
-0.1874611759  
-0.04874761004  
0.06349986491  
0.1345926925  
0.1537632874  
0.1151854233  
0.01852268503  
-0.1310555839  
-0.3234168748  
-0.544489685  
-0.7776924867  
-1.005591945  
-1.211622425  
-1.381667376  
-1.505339501  
-1.576801071  
-1.595059341  
-1.563699705  
-1.490124346  
-1.384386866  
-1.257808033  
-1.121544231  
-0.985301091  
-0.8563579915  
-0.7390084471  
-0.6344712971  
-0.5412479015  
-0.4558301808  
-0.3736460639  
-0.2900657947  
-0.2013139032  
-0.1051796845  
-0.001410889396  
0.1082079111  
0.2200738437  
0.3292223911  
0.4299183935  
0.5162821963  
0.5828895499  
0.6252689884  
0.6402899077  
0.6264314411  
0.583960635  
0.5150185726  
0.4236322679  
0.3156508268  
0.1985592165  
0.08116701686  
-0.02686171748  
-0.1156329057  
-0.1757694326  
-0.1992211091  
-0.1800374161  
-0.1150175449  
-0.004127924378  
0.1493832584  
0.3391964689  
0.5564432398  
0.7904736295  
1.029757545  
1.262801039  
1.478942563  
1.66894302  
1.825305876  
1.942328973  
2.015927057  
2.043327685  
2.022752194  
1.953178391  
1.834303941  
1.666722086  
1.452321514  
1.194819339  
0.900325343  
0.5777727826  
0.2390832079  
-0.1010652155  
-0.4259317706  
-0.7178593469  
-0.9597979716  
-1.137057617  
-1.239057654  
-1.260865117  
-1.204269612  
-1.078211696  
-0.8984352295  
-0.6863468765  
-0.4671546169  
-0.2674528577  
-0.1125442401  
-0.02377438479  
-0.01623513969  
-0.09710015448  
-0.2648250958  
-0.5093031051  
-0.812959278  
-1.15265128  
-1.502115507  
-1.834659154  
-2.125753683  
-2.355234293  
-2.508844932  
-2.579017605  
-2.564838009  
-2.471308789  
-2.308080533  
-2.087898566  
-1.825013834  
-1.533797751  
-1.22771258  
-0.9187261219  
-0.6171587525  
-0.3318583572  
-0.07055554933  
0.1597960443  
0.3528382949  
0.5029377635  
0.6056326811  
0.6583837303  
0.6614753357  
0.6188949076  
0.5389417091  
0.4343736095  
0.3219240072  
0.2211179373  
0.152448179  
0.1350707477  
0.1842992065  
0.309244307  
0.5109598629  
0.7814152628  
1.103526517  
1.452327319  
1.797211734  
2.105004774  
2.343510067  
2.48507279  
2.509716707  
2.407442789  
2.179390509  
1.83774035  
1.404382457  
0.9085490015  
0.3837457592  
-0.135612346  
-0.6174509079  
-1.034775311  
-1.36763046  
-1.604116826  
-1.74044949  
-1.78016196  
-1.73268035  
-1.611521347  
-1.432413474  
-1.21159336  
-0.9644709594  
-0.7047740392  
-0.4441826472  
-0.19239294  
0.04254243267  
0.25374993  
0.4351317091  
0.5811631355  
0.6869733376  
0.7487154613  
0.7641848075  
0.7335319058  
0.659924777  
0.5499807804  
0.4138135765  
0.264601681  
0.1176612092  
-0.01092616503  
-0.105976221  
-0.1549633157  
-0.1496365419  
-0.08727028652  
0.02866488031  
0.1885201488  
0.377235656  
0.575780798  
0.7631406473  
0.9186068957  
1.024113652  
1.0663425  
1.038321676  
0.9403352263  
0.7800154024  
0.571597567  
0.3344113437  
0.09077644387  
-0.1364533686  
-0.326422425  
-0.4625902559  
-0.5345454224  
-0.5391277774  
-0.4806935204  
-0.3705097827  
-0.2253324757  
-0.0653448593  
0.08830114062  
0.2160308492  
0.3021713548  
0.3367499263  
0.3165482827  
0.2452780147  
0.1328577871  
-0.006101928606  
-0.1543935062  
-0.294605145  
-0.4114774975  
-0.4939171561  
-0.5363856101  
-0.5395020029  
-0.5097832748  
-0.4585886274  
-0.400424834  
-0.3508640754  
-0.3243645093  
-0.3322869557  
-0.3813704231  
-0.4728357191  
-0.6022191874  
-0.7599139905  
-0.9323117511  
-1.103367645  
-1.256365327  
-1.375652985  
-1.448136365  
-1.464391473  
-1.41929478  
-1.312167832  
-1.146488591  
-0.9292757434  
-0.6702771275  
-0.3810894533  
-0.0743492169  
0.2369488385  
0.5399596083  
0.8223209701  
1.072380734  
1.279366532  
1.433589776  
1.526740803  
1.552319294  
1.506188833  
1.387223568  
1.197954019  
0.9450992634  
0.6398533377  
0.2978105358  
-0.06157579787  
-0.416027033  
-0.7419543525  
-1.016349374  
-1.218864038  
-1.333869604  
-1.352214462  
-1.272430657  
-1.101184771  
-0.8528522534  
-0.5481942744  
-0.2122717061  
0.1281747901  
