-0.048200348  
-1.138405654  
-2.161247666  
-3.055670772  
-3.774210286  
-4.287654714  
-4.587350981  
-4.684948099  
-4.609712637  
-4.403897458  
-4.116865081  
-3.798827003  
-3.495022539  
-3.241054084  
-3.059883225  
-2.960722609  
-2.939769977  
-2.982515233  
-3.06714258  
-3.16846087  
-3.261797141  
-3.326336287  
-3.347529736  
-3.318371622  
-3.239496365  
-3.118224419  
-2.966803577  
-2.800164005  
-2.633538175  
-2.480265655  
-2.350055164  
-2.247871611  
-2.173547563  
-2.122090586  
-2.084603312  
-2.049641902  
-2.004825663  
-1.938476475  
-1.841087545  
-1.706466137  
-1.532416508  
-1.320928673  
-1.077863541  
-0.812201252  
-0.5349615362  
-0.2579317828  
0.007643544133  
0.252257022  
0.4690888905  
0.6545987296  
0.8086941011  
0.9344572388  
1.037460145  
1.124749723  
1.203632621  
1.280422001  
1.359322854  
1.441625202  
1.525344201  
1.605382249  
1.674224021  
1.723085981  
1.7433684  
1.728212332  
1.673917568  
1.581001069  
1.454713694  
1.304906961  
1.145235175  
0.9917657046  
0.8611856575  
0.7688111627  
0.7266858543  
0.742000802  
0.8160536229  
0.9438785604  
1.114595768  
1.312436227  
1.518314142  
1.711765371  
1.873040112  
1.985117369  
2.035440993  
2.017222064  
1.930172186  
1.780616063  
1.58097032  
1.348629811  
1.10434788  
0.8702442247  
0.6676108993  
0.5147092398  
0.4247792274  
0.4044790379  
0.4529426608  
0.5616208831  
0.7149660327  
0.891965256  
1.068397157  
1.219594303  
1.323409044  
1.363023522  
1.329234813  
1.22188642  
1.050209881  
0.8319733746  
0.5914854288  
0.3566729916  
0.1555810507  
0.01274310711  
-0.0540844114  
-0.03639919837  
0.06374425686  
0.2337732156  
0.4520102605  
0.6902787314  
0.9173652865  
1.102877834  
1.220988554  
1.253565911  
1.192281944  
1.039439082  
0.8074133036  
0.5168253435  
0.1937069501  
-0.1339258583  
-0.4396262559  
-0.701690401  
-0.9055501902  
-1.045069963  
-1.122622582  
-1.147978982  
-1.136226348  
-1.105053483  
-1.071837647  
-1.050949073  
-1.051678752  
-1.077047427  
-1.123653981  
-1.18252783  
-1.240814021  
-1.284032174  
-1.29851863  
-1.2737138  
-1.203942775  
-1.089455854  
-0.9365913829  
-0.7570715022  
-0.5665420716  
-0.3826061182  
-0.222614037  
-0.1015430326  
-0.0302365502  
-0.01422385771  
-0.05325314418  
-0.1415521082  
-0.2687446  
-0.421262476  
-0.5840369491  
-0.7422352794  
-0.8828224974  
-0.9957647886  
-1.074759476  
-1.117443456  
-1.125104974  
-1.101984973  
-1.054295635  
-0.9891143344  
-0.913305438  
-0.8326053615  
-0.7509874483  
-0.6703660711  
-0.5906525671  
-0.5101515308  
-0.4262112232  
-0.3360422333  
-0.237576456  
-0.1302435559  
-0.01554274665  
0.1026816594  
0.2183369986  
0.32355004  
0.4094987329  
0.4675055844  
0.4902805492  
0.4731476462  
0.4150853987  
0.3194149811  
0.1939997074  
0.05087215236  
-0.09472026565  
-0.2257942268  
-0.3254854664  
-0.3790722036  
-0.3759212097  
-0.311083873  
-0.1863000233  
-0.01023552431  
0.2021499375  
0.4310784165  
0.6541339448  
0.8488964009  
0.9957109874  
1.080206518  
1.095227613  
1.041883805  
0.9295386559  
0.7747083965  
0.5989918932  
0.4262948162  
0.2797121644  
0.1784912842  
0.1354980351  
0.1555149073  
0.2346273767  
0.3607505796  
0.5152372642  
0.6753243833  
0.8170951601  
0.9185565904  
0.9624222642  
0.9382751229  
0.8438324092  
0.6852057229  
0.4761557314  
0.2364638965  
-0.01032117786  
-0.2395032025  
-0.4278758898  
-0.5561080796  
-0.6106182905  
-0.5847791359  
-0.4793758072  
-0.3023172724  
-0.06769556721  
0.2056775194  
0.4960768189  
0.7808211762  
1.038214055  
1.249293407  
1.399276583  
1.478602634  
1.483521068  
1.416205336  
1.284398849  
1.1006461  
0.8811526445  
0.6443770734  
0.4094632019  
0.1946204626  
0.01560225174  
-0.1155976214  
-0.191709419  
-0.2107223613  
-0.1759277284  
-0.09546037644  
0.01861959147  
0.151619901  
0.2877519505  
0.4117562784  
0.5104304405  
0.5739101036  
0.5965497266  
0.5773131967  
0.5196348313  
0.4307760014  
0.3207612974  
0.2010318773  
0.08299325679  
-0.02335641765  
-0.1105538124  
-0.1744032595  
-0.2142479186  
-0.2327556828  
-0.235277294  
-0.2288851398  
-0.2212359262  
-0.2194346386  
-0.2290392035  
-0.2533386809  
-0.2929864146  
-0.3460076536  
-0.4081447881  
-0.4734838971  
-0.5352412481  
-0.5866000953  
-0.6214898203  
-0.6352122877  
-0.6248671506  
-0.5895331558  
-0.5302435997  
-0.4497637385  
-0.3522566862  
-0.2428695126  
-0.1273197872  
-0.01151420154  
0.09875966118  
0.1980824621  
0.2815677382  
0.3449884167  
0.3848709673  
0.3985725318  
0.3843731602  
0.341555772  
0.2704958325  
0.1727278073  
0.0509810472  
-0.09083992564  
-0.2477369813  
-0.4137625139  
-0.582244596  
-0.7460604885  
-0.8979569162  
-1.030904379  
-1.138454336  
-1.215088833  
-1.256541876  
-1.260070157  
-1.224661226  
-1.151156833  
-1.042278654  
-0.9025447021  
-0.7380695848  
-0.5562488054  
-0.3653401069  
-0.1739719242  
0.009401258535  
0.1770430288  
0.322435204  
0.4406919303  
0.5288463175  
0.5859826003  
0.6132074557  
0.6134648919  
0.5912122471  
0.5519994417  
0.5019910143  
0.447474635  
0.3944025064  
0.3479992246  
0.3124609666  
0.2907639199  
0.2845734713  
0.2942565709  
0.3189655842  
0.3567855665  
0.40490394  
0.4597936008  
0.5173975436  
0.5732897119  
0.622848309  
0.661414058  
0.68447466  
0.6878720597  
0.66804504  
0.6223035623  
0.5491125771  
0.448369184  
0.3216258009  
0.1722253187  
0.005311197618  
-0.1723179363  
-0.3525134122  
-0.5262371621  
-0.6841385124  
-0.8171996817  
-0.9173881559  
-0.9782437607  
-0.9953491295  
-0.9666220289  
-0.8924215873  
-0.7754516685  
-0.6204886775  
-0.4339807286  
-0.2235622251  
0.002448646604  
0.2355185748  
0.4672936989  
0.6898955312  
0.8961168774  
1.079540095  
1.234603737  
1.356672069  
1.442122441  
1.488496601  
1.494694893  
1.461212841  
1.390359323  
1.286406055  
1.155598251  
1.005986694  
0.8470279378  
0.6889757386  
0.5420874619  
0.4157175965  
0.3174185522  
0.2521378399  
0.2216483241  
0.2242839826  
0.2550409542  
0.3060502787  
0.3673689642  
0.4280026283  
0.4770346806  
0.5047301578  
0.5034763705  
0.4684655351  
0.3980482341  
0.2937369811  
0.1598954382  
0.00317099909  
-0.1682387341  
-0.3453777979  
-0.5192946144  
-0.6816945769  
-0.8254338837  
-0.9448403531  
-1.035863912  
-1.09608175  
-1.124609429  
-1.12194163  
-1.089766696  
-1.030763523  
-0.9484010953  
-0.8467254124  
-0.7301379273  
-0.6031519629  
-0.47013385  
-0.3350492534  
-0.2012300154  
-0.07120668559  
0.05335852708  
0.1716207283  
0.2833590669  
0.3886619696  
0.4875263933  
0.5794349904  
0.6629893207  
0.7356686719  
0.7937950308  
0.8327311797  
0.8473310222  
0.8325900691  
0.7844290482  
0.7004962849  
0.5808734205  
0.4285596539  
0.2496353818  
0.05305919234  
-0.1499218621  
-0.34669417  
-0.5244357554  
-0.6713891401  
-0.7780825656  
-0.83836056  
-0.850089642  
-0.8154463227  
-0.7407441472  
-0.6358138005  
-0.5129930619  
-0.3858366409  
-0.2676830358  
-0.1702351574  
-0.1022902057  
-0.06878515356  
-0.07022619371  
-0.102602258  
-0.1577831086  
-0.2243798758  
-0.289002538  
-0.3377870034  
-0.3580487568  
-0.339890704  
-0.2775797275  
-0.1705321132  
-0.02374810501  
0.1523790074  
0.3429259423  
0.5299173539  
0.6942948555  
0.8181771716  
0.8871434085  
0.8922479151  
0.831497268  
0.7105316583  
0.542371801  
0.3461985253  
0.1452528522  
-0.03590133801  
-0.1744391961  
-0.2522389554  
-0.2583591279  
-0.1906512832  
-0.05626579011  
0.1290700479  
0.3429275825  
0.5589910746  
0.7504221498  
0.8933383298  
0.9699052345  
0.9706162341  
0.895444573  
0.7536998032  
0.5626191309  
0.3449127815  
0.1256125888  
-0.07130514525  
-0.2260487031  
-0.3254496669  
-0.3643899192  
-0.3460584938  
-0.2810478436  
-0.1854689178  
-0.07842123677  
0.02081788638  
0.09544822755  
0.133306723  
0.1282646107  
0.08072890116  
-0.002743518406  
-0.110609993  
-0.22806995  
-0.3391090926  
-0.4285962828  
-0.484189028  
-0.4978637231  
-0.4669127312  
-0.3943317198  
-0.2885584571  
-0.1625767655  
-0.03246458343  
0.08449674088  
0.1719641328  
0.2166995997  
0.2104905061  
0.1515607517  
0.04522976712  
-0.09634200911  
-0.2553768249  
-0.4105707432  
-0.5398407659  
-0.6233511846  
-0.6464115353  
-0.6017740758  
-0.4909743585  
-0.3244322145  
-0.1202642122  
0.09808134849  
0.3050284166  
0.4764501177  
0.5930708299  
0.643155067  
0.6240614621  
0.5424204075  
0.4128970892  
0.2557675685  
0.09370228732  
-0.05170363948  
-0.1630851661  
-0.2296413612  
-0.2482836615  
-0.2234563258  
-0.1657100154  
-0.08932712266  
-0.009445616636  
0.06077844744  
0.1124902146  
0.1425292527  
0.1536911263  
0.1538675412  
0.1542543812  
0.1669968445  
0.2027178283  
0.2683761702  
0.3658385495  
0.4913631219  
0.6360856725  
0.7873505467  
0.9306415042  
1.051743201  
1.138766062  
1.183704254  
1.183311766  
1.139189607  
1.057157705  
0.9460576671  
0.8162558242  
0.6780976236  
0.5405976601  
0.4105243743  
0.292000284  
0.1866013845  
0.09387911265  
0.01213268032  
-0.06072116725  
-0.1263818974  
-0.1856209858  
-0.238046398  
-0.2821869194  
-0.3158476059  
-0.336646233  
-0.3426062972  
-0.3327004685  
-0.3072318104  
-0.2679992244  
-0.2182189768  
-0.1622221931  
-0.104982738  
-0.05154522618  
-0.00644271005  
0.02681744959  
0.04613096221  
0.05099861007  
0.04251747233  
0.02319371517  
-0.003422459741  
-0.03320742888  
-0.06198855261  
-0.08605689672  
-0.1026037532  
-0.1100222266  
-0.1080487084  
-0.09771546165  
-0.08112785678  
-0.06109124655  
-0.04064139862  
-0.02255033043  
-0.008864063537  
-0.000567472571  
0.0025864753  
0.002038644731  
0.0001777573746  
-7.283702093e-05  
0.004215596145  
0.0154326165  
0.03495080413  
0.06280517611  
0.09758740784  
0.1365814394  
0.1761101466  
0.2120531424  
0.2404347864  
0.2579770714  
0.2625414887  
0.2533547021  
0.2310118963  
0.1972433389  
0.154501304  
0.1054545847  
0.05248274723  
-0.002730534453  
-0.05941695554  
-0.1177385253  
-0.1785645601  
-0.2430833694  
-0.3123132406  
-0.3866013565  
-0.4652210607  
-0.5461389986  
-0.6260097887  
-0.7004092392  
-0.7642785104  
-0.8125239047  
-0.8406729779  
-0.8455009844  
-0.8255204415  
-0.7812698101  
-0.7153392126  
-0.6321416033  
-0.5374314531  
-0.437660879  
-0.3392412437  
-0.2478132182  
-0.1676280639  
-0.1011252185  
-0.04874552307  
-0.009023931667  
0.02107375424  
0.04561635024  
0.06905628588  
0.09555857919  
0.1284045603  
0.1695636927  
0.2194784935  
0.2770979814  
0.3401369667  
0.4055158524  
0.4699023705  
0.5302534838  
0.5842779428  
0.6307198393  
0.6694240823  
0.7011668175  
0.7272710772  
0.7490793081  
0.7673747235  
0.7818702259  
0.7908664308  
0.7911675897  
0.7783141386  
0.7471235643  
0.692489504  
0.6103332841  
0.4985685205  
0.3579137322  
0.1924107935  
0.009520758604  
-0.1802580391  
-0.3642491504  
-0.5288542735  
-0.6610535134  
-0.7499618612  
-0.7882228967  
-0.773030711  
-0.7066246124  
-0.5961555287  
-0.4529294254  
-0.2911111951  
-0.1260597896  
0.02747883059  
0.1570607939  
0.2538933545  
0.313646101  
0.3366364178  
0.3273777149  
0.2935922345  
0.2448640346  
0.1911555879  
0.1414213085  
0.1025189674  
0.07856701516  
0.07079054212  
0.0778241679  
0.09638241246  
0.1221274931  
0.1505809861  
0.1779248805  
0.2015848438  
0.2205424865  
0.2353667117  
0.2480141073  
0.2614419598  
0.2791171357  
0.3044761931  
0.3403827121  
0.388631918  
0.4495262543  
0.5215752233  
0.6013494045  
0.68355044  
0.7613189247  
0.8268063852  
0.8719782515  
0.8895798942  
0.874144776  
0.8229030761  
0.7364382194  
0.6189481682  
0.4780486784  
0.324090853  
0.1690745239  
0.0252888157  
-0.09612917309  
-0.186507452  
-0.240629551  
-0.25726767  
-0.2391632387  
-0.1924879467  
-0.1258534607  
-0.04903153712  
0.02842384257  
0.09846064467  
0.1555295745  
0.1971792491  
0.2241803917  
0.2401699509  
0.2508965947  
0.2631857581  
0.2837749221  
0.3181923945  
0.3698224363  
0.4392870127  
0.5242093305  
0.6193886402  
0.7173445128  
0.8091600315  
0.8855041549  
0.9377015488  
0.9587167227  
0.9439341971  
0.8916413028  
0.8031698669  
0.6826900577  
0.5367041923  
0.3733085706  
0.2013358356  
0.02949233047  
-0.1344175115  
-0.2840792769  
-0.4150234018  
-0.5247420532  
-0.6125678876  
-0.6793965834  
-0.7272940905  
-0.7590833177  
-0.7779554227  
-0.7871649175  
-0.7898075272  
-0.7886971702  
-0.7862892868  
-0.7846530751  
-0.7854362189  
-0.7898321589  
-0.7985327199  
-0.8116997515  
-0.8289707261  
-0.8495319305  
-0.8722613067  
-0.8959536762  
-0.9195777355  
-0.9425318739  
-0.9648274648  
-0.9871428072  
-1.010713676  
-1.037030706  
-1.067382569  
-1.102312575  
-1.141066493  
-1.181180668  
-1.218283079  
-1.246225002  
-1.25756351  
-1.244379101  
-1.199339761  
-1.116871248  
-0.9942453077  
-0.8324028665  
-0.636337194  
-0.4149302801  
-0.1802040844  
0.05394747602  
0.2734035335  
0.4656033895  
0.6212180541  
0.7354382371  
0.8086583235  
0.8464176815  
0.8585845972  
0.8578640419  
0.857859226  
0.8709634934  
0.906407155  
0.9687757343  
1.05721427  
1.16545463  
1.282650041  
1.394878902  
1.487079053  
1.545114588  
1.557655349  
1.517620157  
1.422990701  
1.276929108  
1.087245386  
0.8653528057  
0.6249145284  
0.3804071918  
0.1457995094  
-0.06648901468  
-0.2462981316  
-0.3860899117  
-0.4810428474  
-0.528980986  
-0.5302423044  
-0.4875740333  
-0.4060849133  
-0.293227569  
-0.1587318385  
-0.01438565045  
0.126459052  
0.2497111262  
0.3417311505  
0.3907950453  
0.3886895421  
0.3321999153  
0.2242412604  
0.07437272765  
-0.1014973357  
-0.2823024708  
-0.4438664494  
-0.5616167055  
-0.6136555573  
-0.5837817351  
-0.4640364651  
-0.2563638317  
0.02689674214  
0.363843487  
0.7251253595  
1.077116826  
1.385773893  
1.620682851  
1.758783889  
1.787274284  
1.705306052  
1.524258742  
1.266534099  
0.9630303725  
0.6496049515  
0.3629614364  
0.1364638824  
-0.003636102809  
-0.04112432723  
0.02842157866  
0.1972091818  
0.4461654435  
0.7470935241  
1.065782702  
1.365727232  
1.61203425  
1.775117067  
1.833778345  
1.777363565  
1.6067751  
1.33422555  
0.9817640034  
0.5787429116  
0.1584799775  
-0.2454985775  
-0.6031988612  
-0.8914524069  
-1.09633925  
-1.21444209  
-1.252762392  
-1.227287632  
-1.160410901  
-1.07754019  
-1.003381277  
-0.9584069583  
-0.9560295769  
-1.000880319  
-1.088427842  
-1.20598694  
-1.334942586  
-1.453832502  
-1.54181495  
-1.581992765  
-1.564102308  
-1.486162736  
-1.354886859  
-1.184786449  
-0.9961630027  
-0.8122769007  
-0.6561411583  
-0.547390182  
-0.4996788484  
-0.5189390188  
-0.6027108961  
-0.7405813629  
-0.9156154549  
-1.106517145  
-1.290179779  
-1.444251244  
-1.549358713  
-1.590736738  
-1.559098504  
-1.450742117  
-1.267002329  
-1.013243705  
-0.6976734822  
-0.330219485  
0.0783037167  
0.5166242979  
0.9730117333  
1.434947162  
1.888647957  
2.318688106  
2.707926063  
3.037953103  
3.29012491  
3.447144673  
3.495025475  
3.425149279  
3.236065256  
2.934676832  
2.536528536  
2.06500276  
1.549459162  
1.022473552  
