0.2533546954  
0.854824408  
1.410324501  
1.880379821  
2.235578712  
2.459835742  
2.551850139  
2.524607277  
2.403042226  
2.220248836  
2.012804642  
1.815905683  
1.658976381  
1.562332553  
1.535298252  
1.575930694  
1.672278097  
1.804884496  
1.950078  
2.083530751  
2.183549458  
2.23366888  
2.22424425  
2.152927427  
2.024075477  
1.84730947  
1.635541196  
1.402840471  
1.162479904  
0.9254680981  
0.6997340668  
0.4900144068  
0.2983836052  
0.1252465609  
-0.02945585191  
-0.1650839334  
-0.2794342987  
-0.3683661031  
-0.4260058725  
-0.4455340658  
-0.4204492407  
-0.3460975759  
-0.2212200473  
-0.04923376379  
0.1610089006  
0.3951783008  
0.6342377537  
0.8560022417  
1.037332101  
1.156713294  
1.196881057  
1.147123494  
1.004928452  
0.7766968426  
0.4773866275  
0.1290726179  
-0.241398097  
-0.6053970036  
-0.9357294895  
-1.209674315  
-1.411418373  
-1.533575466  
-1.577597156  
-1.553039566  
-1.475828944  
-1.365803604  
-1.243910214  
-1.129456295  
-1.037821568  
-0.9789083023  
-0.9565106856  
-0.9686091668  
-1.008480607  
-1.06635226  
-1.131324018  
-1.193199698  
-1.243967556  
-1.27871903  
-1.295926349  
-1.297102639  
-1.285988561  
-1.267453713  
-1.246356157  
-1.226563597  
-1.210310097  
-1.197957498  
-1.188171921  
-1.178425983  
-1.165688144  
-1.14713958  
-1.120756168  
-1.085649187  
-1.042100362  
-0.9913055317  
-0.934907756  
-0.874420463  
-0.8106924639  
-0.7435276744  
-0.6715607233  
-0.5924144987  
-0.5031329271  
-0.4008204012  
-0.2833631053  
-0.1501219455  
-0.002462406914  
0.1559642283  
0.3192705329  
0.4797070764  
0.6283486812  
0.7559933164  
0.8541994867  
0.9163128906  
0.9383628638  
0.9197113628  
0.8633538145  
0.7758185486  
0.6666450534  
0.5474818369  
0.4308978411  
0.3290239564  
0.2522117522  
0.2078699893  
0.1996369188  
0.2270349558  
0.2856434017  
0.3678137559  
0.4638079919  
0.5632417304  
0.6565840832  
0.7365318006  
0.7990090017  
0.8436609494  
0.8737324613  
0.8953587944  
0.9163634114  
0.9447514873  
0.9871335226  
1.047330987  
1.125398911  
1.217218077  
1.314745841  
1.406902888  
1.480974793  
1.524328262  
1.526206025  
1.479327137  
1.381074634  
1.234077255  
1.046117305  
0.829346741  
0.5989251963  
0.3712562891  
0.1620501513  
-0.01553026767  
-0.1523987076  
-0.2445494155  
-0.2934279558  
-0.3056044275  
-0.2918243537  
-0.2655459751  
-0.2411700174  
-0.2321808814  
-0.2494405251  
-0.2998333454  
-0.3854373649  
-0.5033047342  
-0.6458662562  
-0.801918179  
-0.9580349602  
-1.100260784  
-1.215857882  
-1.294902861  
-1.33155527  
-1.32482522  
-1.278770553  
-1.202068081  
-1.107016991  
-1.008058545  
-0.9199835965  
-0.8560154347  
-0.8260002537  
-0.8349252355  
-0.8819615142  
-0.960191821  
-1.057096005  
-1.155798333  
-1.236965528  
-1.281162075  
-1.271388338  
-1.195483366  
-1.048067143  
-0.8317226087  
-0.5572358003  
-0.2427929477  
0.08779801651  
0.4076761872  
0.6899701329  
0.9109355132  
1.052780254  
1.105811075  
1.069622442  
0.9531727099  
0.7737408159  
0.5549059097  
0.323806859  
0.1080276525  
-0.06750692997  
-0.1832478461  
-0.2270573842  
-0.1953128023  
-0.09300702804  
0.06715273072  
0.266504237  
0.4828118631  
0.692975758  
0.8757249761  
1.013994671  
1.096691938  
1.119673045  
1.085821748  
1.004254339  
0.8887650869  
0.7557231335  
0.6217062438  
0.5011760558  
0.4044908313  
0.3365234108  
0.2960498994  
0.2760001982  
0.2645233574  
0.246737907  
0.2069314697  
0.1309214932  
0.008259068566  
-0.1660122226  
-0.3902752643  
-0.6560927404  
-0.9488234693  
-1.249031571  
-1.534503388  
-1.782620144  
-1.972783781  
-2.088586294  
-2.119467137  
-2.061671514  
-1.918405161  
-1.699230321  
-1.418805835  
-1.095185155  
-0.7479246072  
-0.3962626139  
-0.05759258678  
0.2535942241  
0.5262398389  
0.7527232269  
0.9284614424  
1.051263272  
1.120634673  
1.137218851  
1.10250934  
1.018893956  
0.8900098608  
0.7212890418  
0.5205398886  
0.298346813  
0.06810987716  
-0.1544230862  
-0.3521619494  
-0.5081758091  
-0.607516271  
-0.6391079171  
-0.5974214917  
-0.4836205153  
-0.3059629838  
-0.07931704878  
0.1761937615  
0.437285352  
0.6800733151  
0.8827474264  
1.028024482  
1.105002859  
1.110220908  
1.047769936  
0.9284976427  
0.7684511785  
0.5867972887  
0.403518496  
0.2371858817  
0.1030631767  
0.01171557555  
-0.03177316325  
-0.02797341295  
0.0172649548  
0.09362524437  
0.1874604145  
0.2831266004  
0.3644266644  
0.4160714081  
0.4251153362  
0.382282226  
0.2831210755  
0.1288850856  
-0.07297446764  
-0.3088320882  
-0.5595185155  
-0.8016387555  
-1.009535324  
-1.157814396  
-1.224185479  
-1.192338613  
-1.054472068  
-0.8131036367  
-0.4818375211  
-0.08485434578  
0.3449258812  
0.7689116757  
1.146819856  
1.441120867  
1.621382278  
1.667938953  
1.574359978  
1.348340204  
1.010850766  
0.593603136  
0.1351645336  
-0.3237944333  
-0.7454542173  
-1.099334126  
-1.365689152  
-1.537360151  
-1.619825074  
-1.629478005  
-1.590421557  
-1.530247263  
-1.475461903  
-1.447218566  
-1.457997979  
-1.509695858  
-1.5933993  
-1.690840121  
-1.777305138  
-1.82554552  
-1.810104029  
-1.711417057  
-1.519111424  
-1.234014474  
-0.8686149711  
-0.4459113897  
0.003173367375  
0.4434385261  
0.8396213154  
1.160600666  
1.383042782  
1.49403159  
1.492365995  
1.388409334  
1.202560819  
0.9625888447  
0.7002153225  
0.4474034933  
0.2328132128  
0.07884891986  
-0.0004040068166  
-0.0001422772199  
0.07530182442  
0.2136354999  
0.3965859411  
0.602405362  
0.8085641067  
0.9943170895  
1.142857045  
1.242839089  
1.289146128  
1.282865106  
1.230525747  
1.142750507  
1.032516862  
0.9132817664  
0.7972069235  
0.6937376112  
0.6086772172  
0.543879595  
0.4975526418  
0.4650747019  
0.4401801487  
0.4162830658  
0.387713444  
0.3506636829  
0.3036911142  
0.247724807  
0.1855962222  
0.1212256525  
0.05862435313  
0.0009416692914  
-0.05025647472  
-0.09533491296  
-0.1364871471  
-0.1772114351  
-0.2214745721  
-0.2727424166  
-0.3330857646  
-0.4025540637  
-0.4789821188  
-0.5582771027  
-0.6351740505  
-0.70432498  
-0.7615172916  
-0.8047816749  
-0.8351511146  
-0.8568710158  
-0.8769744708  
-0.9042248825  
-0.9475638351  
-1.014300534  
-1.108341214  
-1.228794291  
-1.369220465  
-1.517729813  
-1.65800002  
-1.771117251  
-1.838020769  
-1.842217356  
-1.772349127  
-1.624223317  
-1.401958698  
-1.118044945  
-0.7922533802  
-0.4495258004  
-0.1171131452  
0.1786511597  
0.4154889127  
0.577813121  
0.6585085881  
0.6596298402  
0.5919679556  
0.473569455  
0.3274356808  
0.1787304613  
0.05185606662  
-0.03225572236  
-0.05832804198  
-0.01820491661  
0.08851681892  
0.254699968  
0.4666387117  
0.7056378475  
0.9500231604  
1.177353732  
1.366628998  
1.500294717  
1.565862076  
1.557014989  
1.474109329  
1.324032664  
1.119452257  
0.877523276  
0.6182013187  
0.3623256213  
0.1296693967  
-0.06285063487  
-0.2026361956  
-0.2824013648  
-0.3006282249  
-0.2614523673  
-0.1740291426  
-0.05145400785  
0.09062461247  
0.2355623156  
0.3672714606  
0.4716250842  
0.5375854546  
0.5579455145  
0.5296483772  
0.4536641909  
0.3344721954  
0.1792513333  
-0.003117774337  
-0.2030794485  
-0.4113266817  
-0.6194880483  
-0.8205156608  
-1.008720618  
-1.179514394  
-1.328920112  
-1.453008665  
-1.547387019  
-1.606925948  
-1.625800616  
-1.597943056  
-1.517857257  
-1.381722796  
-1.188598922  
-0.9415317755  
-0.6483213345  
-0.3217496394  
0.02086744517  
0.3588419836  
0.6699299003  
0.9326139347  
1.128570466  
1.245010893  
1.276537334  
1.226240931  
1.105815934  
0.9346291883  
0.7377984826  
0.5434825523  
0.3796964838  
0.2710389165  
0.2357386757  
0.2833924709  
0.4136792797  
0.6162235919  
0.8716341615  
1.153605009  
1.43181501  
1.675308702  
1.855940354  
1.951473966  
1.947987662  
1.841278254  
1.637127512  
1.350397324  
1.003083302  
0.6215866295  
0.2335688906  
-0.1352059151  
-0.463612085  
-0.7371445702  
-0.9488871797  
-1.099373195  
-1.195413565  
-1.248109595  
-1.270393601  
-1.274537975  
-1.270005919  
-1.26204103  
-1.251178976  
-1.233758294  
-1.2033109  
-1.152562276  
-1.07566212  
-0.9702376619  
-0.8388785445  
-0.6897636244  
-0.5362940598  
-0.3957589981  
-0.2872127763  
-0.2288942461  
-0.2355723072  
-0.3162249076  
-0.4723939086  
-0.6974628981  
-0.9769572783  
-1.289810209  
-1.610429408  
-1.911254307  
-2.165486395  
-2.349638505  
-2.445618826  
-2.442135083  
-2.335323412  
-2.128605803  
-1.831883006  
-1.460265781  
-1.032519671  
-0.5694811269  
-0.092608966  
0.3772149136  
0.8205548007  
1.220021136  
1.560630748  
1.830064441  
2.018898288  
2.120894406  
2.133370299  
2.057607712  
1.899212398  
1.668306479  
1.379414247  
1.050949515  
0.7042392006  
0.3621266523  
0.04724349036  
-0.2198641715  
-0.4225420502  
-0.5495245746  
-0.5959214839  
-0.5635473892  
-0.4605255778  
-0.3002180352  
-0.09959398549  
0.122725485  
0.3485193836  
0.5618232791  
0.7503676581  
0.9064079994  
1.02687085  
1.112814189  
1.168319869  
1.199011634  
1.210461025  
1.206739635  
1.18939644  
1.157037192  
1.105617203  
1.029432348  
0.9226601023  
0.7812056956  
0.6045261731  
0.3970589367  
0.1689384349  
-0.06426610602  
-0.2828708068  
-0.4654015569  
-0.5916487247  
-0.6460458805  
-0.6208199219  
-0.5183672746  
-0.3523385481  
-0.1470856987  
0.06464824772  
0.2456402127  
0.3592658646  
0.3750629001  
0.2739591745  
0.05231109731  
-0.2759969432  
-0.6798897329  
-1.114041136  
-1.524170286  
-1.854076206  
-2.053456664  
-2.085388886  
-1.932328218  
-1.599665437  
-1.116192436  
-0.5313142702  
0.09070764134  
0.6786954662  
1.163598487  
1.487350951  
1.61030956  
1.516243668  
1.214226229  
0.7372251903  
0.1376767564  
-0.5192676968  
-1.163846424  
-1.730009126  
-2.162873437  
-2.424394574  
-2.496646867  
-2.382445549  
-2.103428228  
-1.696042296  
-1.206100653  
-0.6827302643  
-0.1725145136  
0.2854501756  
0.6630521123  
0.9449379838  
1.128525355  
1.222452857  
1.243848777  
1.214907396  
1.15930233  
1.098901932  
1.051175417  
1.027525851  
1.032627799  
1.064715872  
1.116645469  
1.177474155  
1.234295068  
1.274050168  
1.285124032  
1.258569347  
1.188903843  
1.074488622  
0.9175290103  
0.7237848275  
0.5020672433  
0.2635860144  
0.02118764904  
-0.2114910925  
-0.4209547907  
-0.5948357515  
-0.7229162423  
-0.7980976321  
-0.8172365316  
-0.7817153935  
-0.697629131  
-0.5754950408  
-0.4294372386  
-0.2758815764  
-0.1318735545  
-0.01319527615  
0.06745555583  
0.1019898011  
0.08790332097  
0.02854290945  
-0.06740967973  
-0.1871887075  
-0.3157771516  
-0.4380544333  
-0.5409595527  
-0.6153475728  
-0.6572569739  
-0.668407184  
-0.6558442955  
-0.6307993503  
-0.6069269458  
-0.5982082301  
-0.6168158461  
-0.6712693298  
-0.7651443625  
-0.8964915463  
-1.05803361  
-1.238075684  
-1.421952534  
-1.593796648  
-1.738337112  
-1.842499323  
-1.896593679  
-1.894984073  
-1.836200581  
-1.72255539  
-1.559386344  
-1.354086437  
-1.115097698  
-0.8510148801  
-0.569902881  
-0.2789039706  
0.01588839561  
0.3093085557  
0.5968326919  
0.8742233235  
1.13717877  
1.381079799  
1.600886895  
1.79121143  
1.946585347  
2.061881879  
2.132860802  
2.156750811  
2.132786407  
2.062607579  
1.950433637  
1.802939648  
1.62882553  
1.438076201  
1.240992659  
1.047124114  
0.8642265358  
0.6974247129  
0.5487076332  
0.4168495098  
0.2977841775  
0.1853876067  
0.0725548523  
-0.04760193819  
-0.1805965606  
-0.3296527566  
-0.4951302475  
-0.6743792659  
-0.8620046584  
-1.050458562  
-1.230858268  
-1.393868888  
-1.530529687  
-1.632921163  
-1.694628665  
-1.711001573  
-1.679252665  
-1.598459413  
-1.469533194  
-1.295205037  
-1.080026638  
-0.8303723676  
-0.5543840921  
-0.261800346  
0.03639243439  
0.3284980336  
0.6028376791  
0.8485960695  
1.056691787  
1.220550156  
1.33666293  
1.404828998  
1.428030603  
1.411938893  
1.364109947  
1.292981579  
1.206804881  
1.11268235  
1.015839379  
0.9192338717  
0.8235660333  
0.7276597543  
0.6291568115  
0.5253821483  
0.414244707  
0.2950021517  
0.1687579401  
0.03858718624  
-0.09072729182  
-0.2133293765  
-0.3231913755  
-0.4151419544  
-0.4858368012  
-0.5345096113  
-0.56336163  
-0.5774764148  
-0.5842683709  
-0.5924953344  
-0.6109654296  
-0.6471296007  
-0.7057551898  
-0.7878896648  
-0.8902956897  
-1.005466698  
-1.122252665  
-1.22705075  
-1.305417945  
-1.343915782  
-1.331936183  
-1.263271985  
-1.13721991  
-0.959040773  
-0.7397083797  
-0.4949581046  
-0.2437247388  
-0.006154832932  
0.1985723809  
0.354363506  
0.4500171269  
0.4805010584  
0.4475449494  
0.3595016522  
0.2304593053  
0.07873013291  
-0.07512309217  
-0.2105039723  
-0.3089957699  
-0.3563205197  
-0.3438464938  
-0.2694542341  
-0.1376997073  
0.0407574964  
0.250386959  
0.4725227789  
0.6874130233  
0.8763262559  
1.023484567  
1.117593975  
1.152805759  
1.129017651  
1.051513374  
0.9300010605  
0.7772138483  
0.6072771896  
0.4340393092  
0.2696137912  
0.1232715219  
0.0008262880744  
-0.09547147913  
-0.1665404809  
-0.2156954981  
-0.2476261625  
-0.267324663  
-0.279105173  
-0.2859071991  
-0.2889402901  
-0.2877452954  
-0.2806304515  
-0.2653943612  
-0.2401997994  
-0.2044398669  
-0.1594256721  
-0.1087595985  
-0.05831075624  
-0.01576464429  
0.01021539992  
0.01110007314  
-0.02026294834  
-0.08846280468  
-0.194555109  
-0.33547236  
-0.5039029996  
-0.6886912997  
-0.8757183632  
-1.049179147  
-1.193129143  
-1.293096891  
-1.337603857  
-1.319396334  
-1.236260346  
-1.09131048  
-0.8927242653  
-0.6529546778  
-0.3875063024  
-0.1134194482  
0.1523604599  
0.3945432377  
0.6008016745  
0.762697175  
0.8761254806  
0.9412682643  
0.9620868759  
0.945451543  
0.9000535313  
0.8352405072  
0.7599237521  
0.6816830603  
0.6061381102  
0.536628001  
0.4741757532  
0.4177115935  
0.3644819195  
0.3105797582  
0.2515532327  
0.1830344018  
0.1013684088  
0.004209854981  
-0.108934055  
-0.2362706682  
-0.3734421405  
-0.5134688448  
-0.6470010121  
-0.7629031057  
-0.8491965078  
-0.8943106812  
-0.888529518  
-0.8254623994  
-0.7033400413  
-0.5258916182  
-0.302640984  
-0.04846633416  
0.2175807832  
0.4741290392  
0.6997917435  
0.8756500061  
0.9875495179  
1.027878325  
0.9965270615  
0.9008649614  
0.7546820097  
0.5762356902  
0.3856658919  
0.2021720945  
0.04137296556  
-0.08672754015  
-0.1788396995  
-0.2383922363  
-0.274414553  
-0.2995082448  
-0.3272288989  
-0.3693342414  
-0.433352838  
-0.5208977156  
-0.6270257451  
-0.7407476126  
-0.8466233744  
-0.9271938012  
-0.965836741  
-0.9495906001  
-0.871474393  
-0.7319288439  
-0.5391353508  
-0.3081642176  
-0.05908281048  
0.1856714596  
0.4042478893  
0.5782117485  
0.6948233134  
0.7484410941  
0.7408807051  
0.6807129036  
0.581657364  
0.4603770856  
0.3340101127  
0.2178479821  
0.1234814536  
0.05765181525  
0.02193104839  
0.01318968564  
0.02471482911  
