0.2309543602  
-0.2515751614  
-0.698230614  
-1.077976428  
-1.367645189  
-1.554379547  
-1.63662762  
-1.623599691  
-1.533319541  
-1.389617394  
-1.218556084  
-1.044841511  
-0.8887500702  
-0.763988013  
-0.6767391556  
-0.625946175  
-0.604681914  
-0.6023030012  
-0.6069675695  
-0.6080731551  
-0.5982122942  
-0.5743440273  
-0.5380290599  
-0.494743261  
-0.4524316428  
-0.4195923504  
-0.4032372596  
-0.4070961104  
-0.4303802156  
-0.467317386  
-0.507564499  
-0.5374486161  
-0.5418739303  
-0.5066238387  
-0.4207278193  
-0.2785495046  
-0.08127152415  
0.1624507097  
0.4368166392  
0.7201861201  
0.9872489335  
1.211810928  
1.369871334  
1.442600363  
1.418840672  
1.296790374  
1.084621074  
0.7999218296  
0.4679978594  
0.1192077992  
-0.2143603458  
-0.5024668514  
-0.7201253103  
-0.8504090631  
-0.8863166562  
-0.8314666792  
-0.6995402197  
-0.512547783  
-0.2981567597  
-0.08641557957  
0.09370098832  
0.2174899724  
0.2670747996  
0.2330184901  
0.1148328653  
-0.07961484183  
-0.3356571391  
-0.6340674515  
-0.9536313188  
-1.273664453  
-1.576127525  
-1.847074519  
-2.077292428  
-2.262128384  
-2.400639994  
-2.494294039  
-2.545513316  
-2.556355199  
-2.527577578  
-2.458239332  
-2.345884884  
-2.187240984  
-1.979260967  
-1.720291155  
-1.41112263  
-1.055712446  
-0.6614406744  
-0.2388425419  
0.1991319375  
0.6382126734  
1.064064501  
1.463509789  
1.825528475  
2.141900618  
2.407437871  
2.619811127  
2.779068169  
2.886974512  
2.946330784  
2.96040785  
2.932599414  
2.866337346  
2.765243257  
2.63344018  
2.475906153  
2.298733317  
2.109187855  
1.915481313  
1.726245032  
1.549752822  
1.3929948  
1.260761831  
1.154899138  
1.073896168  
1.012919446  
0.9643411977  
0.91873571  
0.8662239063  
0.7979912703  
0.7077527838  
0.5929343298  
0.4553628029  
0.30132671  
0.1409577905  
-0.01301517025  
-0.1469900954  
-0.2484558068  
-0.3079188332  
-0.3205078551  
-0.2870038404  
-0.2141231691  
-0.1139825129  
-0.002791145418  
0.101075223  
0.1793732555  
0.2163588709  
0.2009114344  
0.1281210813  
0.0001208779238  
-0.1739656096  
-0.3789695824  
-0.5954202728  
-0.8018801892  
-0.9775911854  
-1.105112557  
-1.172608842  
-1.17550335  
-1.117261272  
-1.009179254  
-0.8691755439  
-0.7196878989  
-0.5849229093  
-0.4877645028  
-0.4467323154  
-0.4733703876  
-0.5704195372  
-0.7310417183  
-0.9392372998  
-1.17145236  
-1.399227093  
-1.592585873  
-1.723774801  
-1.770890833  
-1.720940215  
-1.571920629  
-1.333632679  
-1.02706487  
-0.6823672533  
-0.3356130891  
-0.02468208398  
0.2152586528  
0.3561471307  
0.3807479168  
0.2852254691  
0.0802006397  
-0.2098915014  
-0.5491300799  
-0.8938976238  
-1.19770852  
-1.416517548  
-1.513864245  
-1.465225096  
-1.261023867  
-0.9079225843  
-0.4282289602  
0.1425039151  
0.7593790799  
1.373058596  
1.935053021  
2.402740186  
2.743510699  
2.937571401  
2.979125286  
2.875873437  
2.647009217  
2.320056607  
1.927048204  
1.500582784  
1.070288702  
0.6601126303  
0.2867166987  
-0.04093521563  
-0.320878302  
-0.5565812579  
-0.7548590387  
-0.9236537552  
-1.070052891  
-1.198838833  
-1.311751003  
-1.407502142  
-1.482462218  
-1.53182215  
-1.550968828  
-1.536795756  
-1.488703311  
-1.409094056  
-1.303291527  
-1.178893786  
-1.044689166  
-0.9093244674  
-0.779964727  
-0.6611750695  
-0.5542258398  
-0.4569323444  
-0.364075633  
-0.2683316753  
-0.1615735717  
-0.03634169885  
0.1127423039  
0.2878281783  
0.4871359068  
0.7047941757  
0.931251643  
1.154192473  
1.359839775  
1.534467051  
1.665926281  
1.745002042  
1.76644014  
1.729536166  
1.638240178  
1.500782402  
1.328876846  
1.136609718  
0.9391259635  
0.7512502327  
0.5861718482  
0.4543009149  
0.3623923764  
0.3129994218  
0.3043011972  
0.3303077124  
0.3814413706  
0.445441994  
0.5085423895  
0.5568204213  
0.5776246809  
0.5609488335  
0.5006181133  
0.395165486  
0.2482764443  
0.06872425344  
-0.130247953  
-0.332068062  
-0.5184261263  
-0.6711600615  
-0.7742460414  
-0.815660255  
-0.7888846654  
-0.6938585781  
-0.5372225268  
-0.3318028533  
-0.09537126938  
0.1511919969  
0.3861111083  
0.5890336039  
0.7431723036  
0.8369978745  
0.8652746655  
0.8293231119  
0.7364946295  
0.5989450747  
0.4318948969  
0.2516151632  
0.07341870203  
-0.09008374476  
-0.2302478479  
-0.343033299  
-0.428971805  
-0.4925022384  
-0.5408060816  
-0.5823277105  
-0.6252090439  
-0.6758558841  
-0.7378340272  
-0.8112327213  
-0.892560477  
-0.9751654122  
-1.05009692  
-1.107277726  
-1.136810105  
-1.13024368  
-1.081639854  
-0.9883140937  
-0.8511747895  
-0.6746514164  
-0.4662471514  
-0.2358016309  
0.005426241893  
0.2457245589  
0.4738314727  
0.6796830224  
0.854937055  
0.9932620192  
1.090400881  
1.144055299  
1.153661236  
1.120121411  
1.045557612  
0.9331324248  
0.7869518696  
0.6120501411  
0.4144188599  
0.201038269  
-0.0201424283  
-0.2403287782  
-0.4501310777  
-0.6399622011  
-0.8005610013  
-0.923607999  
-1.002371112  
-1.032314326  
-1.011596106  
-0.9413890952  
-0.8259705917  
-0.6725547725  
-0.4908651523  
-0.2924685037  
-0.08992986119  
0.1041441907  
0.2780773255  
0.4220208727  
0.5286838437  
0.5938249678  
0.6164548497  
0.5987341397  
0.5455798819  
0.4640307271  
0.3624428811  
0.2496121375  
0.1339187208  
0.02259076359  
-0.0788365825  
-0.1668109388  
-0.2397894425  
-0.2980101446  
-0.3430615371  
-0.3773258565  
-0.4033806721  
-0.4234531851  
-0.4390079673  
-0.4505158263  
-0.4574297779  
-0.4583556414  
-0.4513678855  
-0.4344063069  
-0.4056726617  
-0.3639608881  
-0.3088603639  
-0.2408103923  
-0.1610138511  
-0.07124197755  
0.02640940304  
0.1297522902  
0.2366630175  
0.3451301693  
0.4531799888  
0.5586991228  
0.6592113412  
0.7516668707  
0.8323235613  
0.8967813857  
0.9402028555  
0.9577293214  
0.9450517117  
0.8990717128  
0.818555168  
0.7046785907  
0.5613663127  
0.3953427902  
0.215861548  
0.03410454672  
-0.1377010432  
-0.2873684952  
-0.4039250112  
-0.4787490101  
-0.5065345611  
-0.4859640348  
-0.4200064157  
-0.3157787251  
-0.1839706152  
-0.03787531865  
0.1078867004  
0.2388191744  
0.3420274777  
0.4075580442  
0.4294487144  
0.4063692823  
0.3417693615  
0.2435182771  
0.1230700358  
-0.005757979058  
-0.1282432875  
-0.2303002216  
-0.2999251043  
-0.3283902417  
-0.3110642343  
-0.2477861867  
-0.1427712952  
-0.004086683541  
0.1572196292  
0.3282215235  
0.4953291188  
0.6454734268  
0.7671670985  
0.8513529967  
0.891994508  
0.8863930136  
0.8352408163  
0.7424396418  
0.6147223415  
0.4611103783  
0.2922497743  
0.1196529503  
-0.04513062701  
-0.1913716903  
-0.3100173781  
-0.3944806766  
-0.4413002307  
-0.4505807171  
-0.4261370819  
-0.3752632707  
-0.3080850711  
-0.2364994518  
-0.1727598384  
-0.127839582  
-0.1097531753  
-0.1220682713  
-0.1628531489  
-0.2242704223  
-0.2929843478  
-0.3514363952  
-0.379919817  
-0.3592689832  
-0.2738366903  
-0.1143667477  
0.119668286  
0.4186709718  
0.762763511  
1.123026286  
1.464094235  
1.747870772  
1.9379501  
2.004201525  
1.926919739  
1.699958849  
1.332392326  
0.8483979643  
0.2853050025  
-0.3100274325  
-0.8861039946  
-1.392383046  
-1.784883672  
-2.031112277  
-2.113686601  
-2.032194754  
-1.803061953  
-1.457444383  
-1.037439535  
-0.5911151301  
-0.1670067098  
0.191212212  
0.4492301424  
0.5852467341  
0.5914583101  
0.4738079744  
0.2501680062  
-0.05267802141  
-0.4027548518  
-0.7667651018  
-1.113604297  
-1.417114251  
-1.657835695  
-1.823695353  
-1.90972742  
-1.917063032  
-1.851485383  
-1.721866998  
-1.538756594  
-1.31329477  
-1.056530079  
-0.7791058074  
-0.491200497  
-0.2025662457  
0.07749075324  
0.3403000471  
0.5782311947  
0.7852663061  
0.9576346564  
1.094342629  
1.197431167  
1.271829386  
1.324735547  
1.364560168  
1.399550457  
1.436314268  
1.478487879  
1.525809372  
1.573800189  
1.614166248  
1.635918021  
1.627064246  
1.576639155  
1.47673813  
1.324214837  
1.121735169  
0.8779757719  
0.6068826905  
0.3260753306  
0.05460260292  
-0.1896009087  
-0.3921770446  
-0.5443300274  
-0.6440202253  
-0.6961712579  
-0.7118408452  
-0.7064799194  
-0.6975308537  
-0.7017268717  
-0.7324964382  
-0.7978448909  
-0.899038804  
-1.030261969  
-1.179301767  
-1.329151138  
-1.46029728  
-1.553363135  
-1.591740184  
-1.563839487  
-1.464670088  
-1.296533438  
-1.0687661  
-0.7965775882  
-0.4991669764  
-0.1973822618  
0.08875131357  
0.3423052111  
0.5512253778  
0.7093967129  
0.8168801238  
0.8793210008  
0.9066438119  
0.9112422575  
0.9059372109  
0.9019935808  
0.9074826795  
0.9262100163  
0.9573509161  
0.9958366049  
1.033423361  
1.060285912  
1.066900747  
1.045938283  
0.9938831605  
0.9121305391  
0.8073719363  
0.691182906  
0.5788298422  
0.4874343283  
0.433714052  
0.4316116934  
0.4901282874  
0.611687187  
0.7912691291  
1.016484477  
1.268605777  
1.524460075  
1.758951336  
1.947899565  
2.070819555  
2.113269472  
2.068459542  
1.937887608  
1.730936934  
1.463473745  
1.155661602  
0.8292897254  
0.5050020251  
0.1998182675  
-0.07470600645  
-0.3134197582  
-0.5174986515  
-0.6933845212  
-0.8509175914  
-1.000980868  
-1.153038101  
-1.312974291  
-1.481605906  
-1.654113448  
-1.820512474  
-1.967107405  
-2.078712275  
-2.141286468  
-2.1445762  
-2.084316694  
-1.963635698  
-1.793388603  
-1.591332677  
-1.38021306  
-1.184994236  
-1.029611487  
-0.9336899001  
-0.909695558  
-0.960929487  
-1.080668884  
-1.252599478  
-1.452506781  
-1.651022302  
-1.817072791  
-1.921585082  
-1.940966825  
-1.859919024  
-1.67323524  
-1.386379352  
-1.014812991  
-0.5821963922  
-0.117742703  
0.3469090683  
0.7808984054  
1.157032923  
1.454058174  
1.658097135  
1.763192476  
1.77099486  
1.689749171  
1.532801609  
1.316870418  
1.060320583  
0.7816267485  
0.4981627714  
0.225369657  
-0.02370762013  
-0.2385701709  
-0.4111929503  
-0.5358304981  
-0.6087821695  
-0.6281886349  
-0.5938797137  
-0.5072868122  
-0.3713915266  
-0.1906802514  
0.02892310549  
0.2801778493  
0.5546993439  
0.8431844586  
1.135659786  
1.421745625  
1.690906949  
1.932695992  
2.137002228  
2.294335345  
2.39617956  
2.435443451  
2.407014267  
2.30838564  
2.140300558  
1.907302056  
1.618073395  
1.285442623  
0.925949013  
0.5589184811  
0.2050625193  
-0.1152973103  
-0.3842190364  
-0.5880972729  
-0.7193428299  
-0.7775117904  
-0.7696959409  
-0.7100373779  
-0.6183644475  
-0.5180566401  
-0.4333580307  
-0.386457029  
-0.3946901551  
-0.4682374945  
-0.6086227287  
-0.8082400113  
-1.050994852  
-1.314006146  
-1.570169845  
-1.791269072  
-1.951239789  
-2.029174682  
-2.011693895  
-1.894385433  
-1.682156411  
-1.388479106  
-1.03366501  
-0.6424246262  
-0.2410504405  
0.1454033327  
0.4955859682  
0.7936813439  
1.030417194  
1.203194616  
1.315392034  
1.375011363  
1.392900976  
1.38082727  
1.349667642  
1.307961122  
1.260975948  
1.210391952  
1.154586969  
1.089456753  
1.009605857  
0.9097335976  
0.7859952169  
0.6371380005  
0.4652512533  
0.2760153401  
0.0784040118  
-0.1161261311  
-0.2948614162  
-0.4453165278  
-0.5567830885  
-0.6217328313  
-0.6368851998  
-0.6037813591  
-0.5287725713  
-0.4224093447  
-0.2982849238  
-0.171486828  
-0.05682775279  
0.03289468255  
0.08839998754  
0.1049767072  
0.08295015974  
0.02749886266  
-0.05215376924  
-0.1440637836  
-0.2352253362  
-0.313339516  
-0.3684515602  
-0.3942374695  
-0.3887795511  
-0.3547288006  
-0.2988580805  
-0.2310807155  
-0.1630895995  
-0.10680928  
-0.07287898877  
-0.06935642393  
-0.1007959713  
-0.1677892841  
-0.2669871396  
-0.3915501082  
-0.5319392173  
-0.6769061945  
-0.8145631621  
-0.9333975936  
-1.023153846  
-1.07551592  
-1.084580648  
-1.047119417  
-0.9626639147  
-0.8334354476  
-0.6641573647  
-0.4617576954  
-0.2349805622  
0.006086067605  
0.2505627543  
0.4873881577  
0.7059601722  
0.8967657974  
1.051947798  
1.165758586  
1.234854613  
1.258405042  
1.238003605  
1.17740896  
1.082148914  
0.9590479816  
0.8157418742  
0.6602277879  
0.5004987649  
0.3442659659  
0.1987682515  
0.07062719748  
-0.03428944621  
-0.111045037  
-0.1558788987  
-0.1665212906  
-0.142557984  
-0.08577707381  
-0.00042245849  
0.1067348827  
0.2265912602  
0.3482131535  
0.4596538898  
0.5490340927  
0.6057776701  
0.6218530147  
0.5928511919  
0.5187304251  
0.4040877717  
0.2578788127  
0.09258139506  
-0.0771239007  
-0.2360011228  
-0.3700286878  
-0.4680538383  
-0.5231081529  
-0.5331945959  
-0.5014355915  
-0.4355626487  
-0.3468137397  
-0.2483994535  
-0.1537532816  
-0.07480901136  
-0.02054193838  
0.004039028828  
-0.001675814003  
-0.03406972539  
-0.08602701526  
-0.1480844336  
-0.2098291449  
-0.2613317422  
-0.2944223864  
-0.3036444916  
-0.2867787401  
-0.2448994493  
-0.1819880728  
-0.104198545  
-0.01889656547  
0.06637606075  
0.1448593697  
0.2113392071  
0.2626273921  
0.2977221717  
0.3176609982  
0.3251177548  
0.3238369981  
0.3179937028  
0.3115940432  
0.3079849357  
0.309539038  
0.317528278  
0.3321766685  
0.3528398288  
0.3782598001  
0.4068184062  
0.4367294513  
0.466139643  
0.4931103354  
0.5155208348  
0.5309107427  
0.5363508571  
0.5283848446  
0.5031153914  
0.4564595987  
0.3845812671  
0.2844679186  
0.1545803934  
-0.004512649725  
-0.189625083  
-0.3946757966  
-0.6107250116  
-0.8263808257  
-1.028569586  
-1.203627205  
-1.338600834  
-1.422621393  
-1.448173219  
-1.412095839  
-1.316168149  
-1.167175442  
-0.9764263993  
-0.7587488048  
-0.5310758685  
-0.3107730962  
-0.1139098565  
0.04632441312  
0.1608731649  
0.225590029  
0.241460733  
0.2142585946  
0.1536929358  
0.07217012512  
-0.01666580054  
-0.09943398519  
-0.1643795627  
-0.2024450813  
-0.2079517663  
-0.1788422983  
-0.1164946552  
-0.02518062139  
0.08872809718  
0.2176746401  
0.3538204298  
0.4898251008  
0.6194213873  
0.7377439043  
0.8414138337  
0.9284194623  
0.997855752  
1.049596193  
1.083969133  
1.101497536  
1.102730191  
1.088177157  
1.058336002  
1.013780731  
0.9552751662  
0.8838806709  
0.8010287184  
0.7085374323  
0.6085771982  
0.503581827  
0.3961248179  
0.288774004  
0.1839431426  
0.08375589078  
-0.01006776434  
-0.09628772626  
-0.1741813971  
-0.2435356378  
-0.3045873057  
-0.3579250645  
-0.4043468183  
-0.4446984321  
-0.4797040798  
-0.5098167  
-0.5351038847  
-0.5551993497  
-0.5693198058  
-0.576354727  
-0.5750170907  
-0.5640290575  
-0.542309137  
-0.5091372043  
-0.4642605866  
-0.4079309885  
-0.3408667937  
-0.2641653357  
-0.179191446  
-0.08748278221  
0.00929256092  
0.1092967426  
0.2104015875  
0.3100030473  
0.4048179464  
0.4907258387  
0.5627215322  
0.6150411418  
0.6414944893  
0.6360039034  
0.5933135938  
0.5097842696  
0.3841683498  
0.2182484464  
0.01721487887  
-0.2102931398  
-0.4525392814  
-0.6954230637  
-0.9235328762  
-1.121413973  
-1.274907448  
-1.372415683  
-1.405939523  
-1.371782862  
-1.270844813  
-1.108479038  
-0.8939487268  
-0.6395477014  
-0.359490809  
-0.06869072475  
0.2184477891  
