0.7298382725  
0.7914829806  
0.8493105932  
0.8971035118  
0.9292998068  
0.9417812167  
0.9326114355  
0.9026170084  
0.855702834  
0.798812087  
0.7414660687  
0.6948744051  
0.6706645404  
0.6793414825  
0.7286557044  
0.822091712  
0.9577174095  
1.127607164  
1.317997597  
1.510251086  
1.682580026  
1.812369232  
1.878828374  
1.865627836  
1.763155023  
1.57005353  
1.293800798  
0.9502095067  
0.5618901391  
0.1558652499  
-0.2393539692  
-0.5968380746  
-0.8940562516  
-1.11508242  
-1.251929115  
-1.304887114  
-1.281887623  
-1.197041312  
-1.068601362  
-0.9166644516  
-0.7609194228  
-0.6187108047  
-0.5036211846  
-0.4246611042  
-0.3860780051  
-0.3876969801  
-0.4256569257  
-0.4933747132  
-0.5825745052  
-0.6842444448  
-0.7894418069  
-0.8898961718  
-0.9784343075  
-1.049264823  
-1.098183671  
-1.122757595  
-1.122517251  
-1.099156884  
-1.056699866  
-1.001559548  
-0.9423903329  
-0.8896538033  
-0.854828672  
-0.8492596708  
-0.8827170724  
-0.9617994266  
-1.088401256  
-1.258493736  
-1.461485438  
-1.680367215  
-1.892777727  
-2.072966133  
-2.19450853  
-2.233471885  
-2.171614573  
-1.999164675  
-1.716733532  
-1.33601548  
-0.8790895802  
-0.3763467551  
0.1367366315  
0.6235505021  
1.050495965  
1.390727684  
1.626963413  
1.7529621  
1.773470842  
1.702695499  
1.561557053  
1.374206654  
1.164366806  
0.9520898642  
0.7514422925  
0.5694503297  
0.4064287119  
0.2575641298  
0.1154124407  
-0.02719199409  
-0.1743823229  
-0.3252018642  
-0.4726524774  
-0.6040672227  
-0.7027764779  
-0.7508115138  
-0.7321843769  
-0.6361689024  
-0.4599858615  
-0.2103728123  
0.09630769873  
0.4355281592  
0.7774717946  
1.090921121  
1.347572946  
1.526094687  
1.615263033  
1.615651653  
1.539565625  
1.409197412  
1.25327983  
1.102747345  
0.9861021375  
0.9252024094  
0.9321441847  
1.007693768  
1.141485382  
1.313889258  
1.499189873  
1.669511263  
1.798831643  
1.8664432  
1.859351853  
1.773315687  
1.612480639  
1.387812854  
1.114717958  
0.810351124  
0.4911216236  
0.1708172331  
-0.1403918615  
-0.4360033471  
-0.7124178792  
-0.9676436229  
-1.199839386  
-1.406071533  
-1.581592141  
-1.719810094  
-1.81298025  
-1.853469619  
-1.835349821  
-1.756001858  
-1.617404079  
-1.426848355  
-1.196918826  
-0.9447017571  
-0.6903118269  
-0.4549268379  
-0.2585936052  
-0.1180822465  
-0.04505961235  
-0.04479372319  
-0.1155310851  
-0.248599793  
-0.4292160896  
-0.6378894762  
-0.8522845234  
-1.049340792  
-1.207457331  
-1.308533856  
-1.339683123  
-1.294455329  
-1.173454594  
-0.9842718417  
-0.7407302722  
-0.4614862245  
-0.168118842  
0.1171078562  
0.3735632251  
0.5843745074  
0.7380958753  
0.8296894871  
0.8606891068  
0.8385074446  
0.7749972128  
0.6844824611  
0.5815658435  
0.479066552  
0.3864170822  
0.3087710181  
0.2469532843  
0.1982312367  
0.1577295768  
0.120206727  
0.08182814703  
0.04157842128  
0.002016143864  
-0.03080884199  
-0.04829262238  
-0.04093225504  
-0.0004200568631  
0.07820079347  
0.194719034  
0.3426500785  
0.5090991331  
0.6757167435  
0.8206798073  
0.9214688579  
0.9580675351  
0.9161196012  
0.7895629436  
0.5823075996  
0.3086530554  
-0.007695012816  
-0.3359364681  
-0.6415687886  
-0.8904256684  
-1.052840572  
-1.10737711  
-1.043608184  
-0.8635798439  
-0.5817349111  
-0.2233219388  
0.1784975033  
0.5864539263  
0.9633643381  
1.276170962  
1.499305144  
1.616978985  
1.624166447  
1.526246001  
1.337445676  
1.078410869  
0.7732940074  
0.4468178976  
0.1217008041  
-0.1832523617  
-0.4542275093  
-0.6826467644  
-0.8647062125  
-1.000429831  
-1.092521265  
-1.145272797  
-1.163733883  
-1.153245021  
-1.119329002  
-1.067836717  
-1.005170307  
-0.9383933236  
-0.8750593234  
-0.8226719913  
-0.7877890567  
-0.7748908115  
-0.785236503  
-0.8159744395  
-0.8597671451  
-0.9051420478  
-0.9376391705  
-0.9416913081  
-0.9030060395  
-0.8110833532  
-0.6614287359  
-0.4570264948  
-0.2087111484  
0.06574131995  
0.343780393  
0.6012365871  
0.8160025513  
0.9716335426  
1.060228893  
1.084043176  
1.055460546  
0.9952354837  
0.9292037147  
0.8839604021  
0.8821859928  
0.9384173415  
1.056001154  
1.22579042  
1.426869191  
1.629250834  
1.79815444  
1.899208023  
1.903753443  
1.793409993  
1.563167695  
1.222523382  
0.7944759575  
0.3125410273  
-0.1837508713  
-0.6541799753  
-1.063185618  
-1.384442286  
-1.604003495  
-1.721588967  
-1.74986297  
-1.711872018  
-1.637058466  
-1.556483889  
-1.497982326  
-1.481965941  
-1.518481563  
-1.605927139  
-1.731564701  
-1.873712476  
-2.005239227  
-2.097794174  
-2.126128964  
-2.071851415  
-1.926065786  
-1.690546663  
-1.37732117  
-1.006790673  
-0.6047463096  
-0.1987851337  
0.185293578  
0.526560954  
0.8110656028  
1.03272815  
1.192983714  
1.299343812  
1.363221963  
1.397445983  
1.413912068  
1.42176559  
1.426354782  
1.429071413  
1.427993048  
1.419128354  
1.397965784  
1.360992823  
1.306897648  
1.237225975  
1.156401659  
1.071119668  
0.9892507282  
0.9184632576  
0.864814284  
0.8315567608  
0.8183701028  
0.8211426831  
0.8323581173  
0.8420287211  
0.8390597578  
0.8128505392  
0.7549181416  
0.6603154575  
0.5286480064  
0.3645371666  
0.177451654  
-0.01910109592  
-0.2089363177  
-0.3749644938  
-0.5011555119  
-0.5744626967  
-0.5864654057  
-0.5345198078  
-0.4222717156  
-0.2594645798  
-0.06105436022  
0.154254046  
0.3658852234  
0.5534677037  
0.6988689302  
0.7879806704  
0.8120642235  
0.7685357716  
0.6611257179  
0.499410697  
0.2977792634  
0.07395152581  
-0.1528119443  
-0.3636154455  
-0.5417747591  
-0.6744127789  
-0.7536539613  
-0.7772913242  
-0.748871405  
-0.6771925253  
-0.5752807175  
-0.4589678853  
-0.3452289676  
-0.2504675588  
-0.1889177947  
-0.171324332  
-0.2040062978  
-0.2883728218  
-0.4209020783  
-0.5935666712  
-0.79463218  
-1.009761507  
-1.223312896  
-1.419728944  
-1.584897854  
-1.707369029  
-1.779322026  
-1.797182759  
-1.76182938  
-1.678357591  
-1.555412708  
-1.404163692  
-1.237020573  
-1.066247669  
-0.9026362081  
-0.7544030298  
-0.6264566029  
-0.5201360766  
-0.4334448871  
-0.3617612962  
-0.2989075121  
-0.2384276252  
-0.1748619945  
-0.1048227512  
-0.02768982946  
0.05419911435  
0.1359009865  
0.2107136877  
0.2713806227  
0.3114528091  
0.326572456  
0.3154570335  
0.2803992793  
0.227197847  
0.1645125601  
0.1027497086  
0.05266408045  
0.02390175012  
0.02372463952  
0.05611740603  
0.1213965999  
0.2163664868  
0.3349545891  
0.4691858269  
0.6103062079  
0.7498492377  
0.8804669425  
0.9964130363  
1.093639748  
1.169554165  
1.222550123  
1.251478313  
1.255208281  
1.232422837  
1.18171244  
1.101970515  
0.9930069574  
0.8562417471  
0.6953116234  
0.5164147801  
0.328274829  
0.1416597045  
-0.03152240078  
-0.1794409218  
-0.291710942  
-0.360694698  
-0.3825397307  
-0.3577631068  
-0.2912812595  
-0.1918489281  
-0.07097024988  
0.05858197356  
0.1844315788  
0.2962190226  
0.3869431728  
0.4538184642  
0.4985127904  
0.5267142987  
0.5470596951  
0.5695614296  
0.6037472181  
0.656773989  
0.7318048803  
0.8269082393  
0.9346848078  
1.04272924  
1.134915905  
1.193381684  
1.20096346  
1.143771115  
1.013540952  
0.8094141908  
0.5388673151  
0.2176044497  
-0.131624373  
-0.4811884717  
-0.8014847513  
-1.064246486  
-1.245857292  
-1.330246277  
-1.311003087  
-1.192428794  
-0.9893760401  
-0.7258729698  
-0.4326701546  
-0.1439842  
0.106197177  
0.287830745  
0.3781324958  
0.3641155536  
0.2440656673  
0.02778808189  
-0.2644025799  
-0.6038297495  
-0.9564994664  
-1.286700468  
-1.560753198  
-1.750503506  
-1.836175443  
-1.808285096  
-1.668432622  
-1.428903588  
-1.111157136  
-0.7433946066  
-0.3574932076  
0.01434327895  
0.3428556749  
0.6045617173  
0.7838698457  
0.8742599581  
0.8784371081  
0.8074731797  
0.6790695096  
0.5151656525  
0.3392009048  
0.1733507768  
0.03608371884  
-0.05969823584  
-0.1077240807  
-0.1085449216  
-0.06887523586  
-0.0002302787955  
0.08292136774  
0.1652048673  
0.2323060014  
0.2726089696  
0.278317974  
0.2459799375  
0.1764019402  
0.07406232128  
-0.053839793  
-0.19850688  
-0.3506616165  
-0.5014965986  
-0.6433655633  
-0.7701587739  
-0.8773842511  
-0.9620130869  
-1.022187596  
-1.056882733  
-1.065625564  
-1.048328245  
-1.005271734  
-0.9372263592  
-0.8456675645  
-0.733025762  
-0.602886549  
-0.4600819018  
-0.3106178239  
-0.1614201129  
-0.01991273695  
0.1065346856  
0.2112240387  
0.2887457685  
0.3355164382  
0.3501932344  
0.3339085514  
0.2903117457  
0.2254054239  
0.1471826725  
0.06508000648  
-0.01072799751  
-0.07016052932  
-0.1041357696  
-0.1054899751  
-0.0698136474  
0.003888853803  
0.1128286185  
0.2504449003  
0.4068661917  
0.5698244809  
0.725965929  
0.8624154563  
0.9684007305  
1.036690753  
1.064619239  
1.054486373  
1.01324764  
0.9514727641  
0.8817208248  
0.8165509008  
0.7664821279  
0.73823094  
0.7335178054  
0.7486570702  
0.7750058914  
0.8002252842  
0.8101631738  
0.7910751177  
0.7318538616  
0.6259289292  
0.4725733392  
0.2774289723  
0.0521965394  
-0.1864615464  
-0.4186482518  
-0.6233661327  
-0.7808007104  
-0.8744981459  
-0.8932036449  
-0.8321837226  
-0.6939079192  
-0.488028108  
-0.230661169  
0.0569729652  
0.3504335171  
0.6243084419  
0.8546176629  
1.021146067  
1.109464185  
1.112416382  
1.030893484  
0.8737856782  
0.6570836667  
0.4022094643  
0.1337390626  
-0.1232384965  
-0.34581951  
-0.51574869  
-0.6213457325  
-0.6586781557  
-0.6318392996  
-0.5523055528  
-0.4374453679  
-0.3083673023  
-0.1873606991  
-0.09523657525  
-0.04888272139  
-0.0593249713  
-0.130507681  
-0.2589346552  
-0.4341913012  
-0.6402517811  
-0.8574013833  
-1.064498991  
-1.241298194  
-1.370532156  
-1.439523293  
-1.441156261  
-1.37414315  
-1.242636953  
-1.055306585  
-0.8240837687  
-0.5627893697  
-0.2858550248  
-0.007290986896  
0.2600082236  
0.5046210055  
0.7166812334  
0.8878076616  
1.011018011  
1.080743946  
1.093025463  
1.04590179  
0.9399316191  
0.7787380248  
0.5694211525  
0.3226904276  
0.05259062431  
-0.2242363511  
-0.4897445428  
-0.7260296911  
-0.9170649314  
-1.050402662  
-1.118615655  
-1.120259165  
-1.060197591  
-0.9492110366  
-0.8028907811  
-0.639936179  
-0.4800357034  
-0.3415889667  
-0.2395465221  
-0.1836537362  
-0.1773223392  
-0.2173037046  
-0.2942115288  
-0.393848214  
-0.4991578063  
-0.5925464693  
-0.6582368873  
-0.6843211441  
-0.6642067222  
-0.5972378302  
-0.4884080019  
-0.347224739  
-0.1859193536  
-0.01731755942  
0.1472654677  
0.2997542519  
0.4363706879  
0.5578698826  
0.6689334303  
0.7768657523  
0.8898445216  
1.015053985  
1.157036665  
1.316520222  
1.489906184  
1.669454772  
1.844084377  
2.000614646  
2.12522039  
2.204869034  
2.22855149  
2.18819694  
2.079231102  
1.900816617  
1.655856743  
1.35085197  
0.9956692506  
0.6032574164  
0.1892704965  
-0.2284532667  
-0.630632516  
-0.9975484627  
-1.310299346  
-1.552231028  
-1.710383999  
-1.776765038  
-1.749231517  
-1.631826002  
-1.434466382  
-1.172007336  
-0.8628008448  
-0.5269661418  
-0.1846288996  
0.1456122069  
0.4477966177  
0.7091816902  
0.9203055885  
1.074644589  
1.168052407  
1.198196582  
1.164179621  
1.066464082  
0.9071240001  
0.690343079  
0.4229977671  
0.1151161401  
-0.2199809105  
-0.5660156137  
-0.9046186123  
-1.216684056  
-1.484056513  
-1.691339319  
-1.827548037  
-1.887370558  
-1.871833658  
-1.788272916  
-1.649597383  
-1.472948021  
-1.277920933  
-1.084579972  
-0.9114952911  
-0.7740220614  
-0.6829955274  
-0.6439474429  
-0.6568926907  
-0.7166647061  
-0.813729734  
-0.9353594348  
-1.067027944  
-1.193873714  
-1.30207184  
-1.379984064  
-1.418973566  
-1.413817541  
-1.362702645  
-1.266833  
-1.129743159  
-0.9564363853  
-0.7524975748  
-0.5233274744  
-0.2736271668  
-0.007206134168  
0.2728547029  
0.5637327049  
0.8621926952  
1.163858666  
1.462602771  
1.750217206  
2.016496243  
2.249785362  
2.437991084  
2.569928124  
2.636837401  
2.63383211  
2.561023533  
2.424108896  
2.234260421  
2.007268606  
1.761996912  
1.518331532  
1.294886694  
1.106799188  
0.9639260095  
0.8697269313  
0.821006071  
0.8085693188  
0.8187090097  
0.8352992535  
0.8421986789  
0.8255899764  
0.7759122991  
0.6890893346  
0.5668750819  
0.4162723959  
0.2481332484  
0.07517798807  
-0.09023444062  
-0.2382095799  
-0.3629390376  
-0.4635701958  
-0.5441690044  
-0.6127917522  
-0.6798109798  
-0.7557952718  
-0.8492993489  
-0.9649549795  
-1.102197249  
-1.254856201  
-1.411698811  
-1.55785162  
-1.676882898  
-1.753217458  
-1.774507854  
-1.733593861  
-1.629750569  
-1.46904214  
-1.263736009  
-1.030875808  
-0.79022476  
-0.5618827947  
-0.3639083023  
-0.2102609914  
-0.109322592  
-0.06316942753  
-0.06764081321  
-0.1131673017  
-0.1862054992  
-0.2710677237  
-0.3519016977  
-0.4145620854  
-0.4481617362  
-0.4461319077  
-0.406698  
-0.3327512995  
-0.2311701305  
-0.1116987692  
0.01446017008  
0.1361596479  
0.2437502434  
0.330279144  
0.3923029153  
0.4302248495  
0.4481073376  
0.4529810743  
0.4537339338  
0.4597165957  
0.4792526166  
0.518257553  
0.5791749686  
0.6603929368  
0.7562527197  
0.8576668666  
0.9532798  
1.031013293  
1.079769313  
1.091048832  
1.060221743  
0.9872668275  
0.8768497068  
0.7377315371  
0.5815877826  
0.4214145869  
0.2697648996  
0.1370698099  
0.03029280052  
-0.04789121492  
-0.09928739491  
-0.1297291485  
-0.1480588114  
-0.1647086912  
-0.1900886005  
-0.2330151632  
-0.2994030827  
-0.3913934174  
-0.5070323554  
-0.6405309029  
-0.7830662208  
-0.9239999444  
-1.052347651  
-1.158297425  
-1.234564662  
-1.277406035  
-1.287143802  
-1.268124323  
-1.228101061  
-1.177101921  
-1.125917264  
-1.084383282  
-1.059688732  
-1.054923398  
-1.068099499  
-1.091808175  
-1.113628051  
-1.117311097  
-1.084658438  
-0.9979059755  
-0.8423440392  
-0.6088287545  
-0.2958171941  
0.08939954687  
0.5305259466  
1.003262712  
1.477442499  
1.920075032  
2.298943464  
2.586270226  
2.761956476  
2.815919235  
2.749192385  
2.573615235  
2.310151975  
1.986090765  
1.631530957  
1.27567602  
0.9434662879  
0.6530154603  
0.4141808912  
0.2284099393  
0.08979941732  
-0.01286985626  
-0.09351008885  
-0.1659626127  
-0.2415395951  
-0.3272437675  
-0.4249056637  
-0.5313200895  
-0.6392865972  
-0.7393303976  
-0.821767622  
-0.8787367505  
-0.905853117  
-0.9031985893  
-0.8754976955  
-0.8314572453  
-0.7823853236  
-0.7403278475  
-0.7160177992  
-0.7169753642  
-0.7460600542  
-0.8007043591  
-0.8729649784  
-0.9503902705  
-1.017597611  
-1.058332723  
-1.05772902  
-1.004437753  
-0.8923277982  
-0.7215161021  
-0.4985793459  
-0.2359260228  
0.04957855249  
0.3385309144  
0.611178733  
0.8495818135  
1.039446726  
1.171420581  
1.241698688  
1.25191877  
1.208418376  
1.121010627  
1.001496959  
0.8621465356  
0.7143506619  
0.5676136958  
0.4289648566  
0.3028067193  
0.1911412286  
