254.10444  
250.5875949  
244.2998825  
247.5399414  
340.0883281  
3134.864396  
5896.023826  
26657.83312  
64527.69445  
17083.10179  
7942.126429  
6890.556034  
21069.68123  
18481.0626  
12235.40042  
4479.421981  
10491.533  
21530.96737  
6285.898049  
18329.82092  
27982.99262  
29724.90637  
18455.04332  
1349.608301  
21052.46444  
873.2197355  
3688.826403  
5067.189297  
15165.61411  
13622.22773  
4154.220814  
11833.96561  
9811.416065  
3975.277824  
2610.395313  
9126.964343  
1570.540927  
2811.181955  
1169.092429  
292.804773  
8442.707428  
6632.574617  
8747.700501  
198.0683603  
781.4462088  
318.9480547  
2027.731174  
502.8048343  
750.3281411  
1892.097608  
761.7451019  
782.9147333  
324.0031001  
3081.869773  
6189.592222  
1292.325231  
1243.406761  
2839.099761  
1759.216445  
1045.865072  
1664.115871  
80.53955123  
3369.872688  
1147.767116  
97.32256744  
55.13583505  
286.3943041  
44.37387215  
25.26132057  
216.9108648  
54.46982301  
11.45535506  
15.65529131  
24.68050936  
23.67961047  
16.81007956  
1.547132082  
4.239828413  
6.363747124  
5.585779472  
4.128937702  
4.904517253  
4.920914856  
4.371883176  
2.932608263  
3.049299126  
3.20967511  
3.39149642  
2.527434899  
2.726091394  
2.669840654  
2.708309386  
2.267604162  
2.123691847  
2.003538046  
1.879417711  
1.832614542  
1.701610551  
1.679571007  
1.570647387  
1.457519715  
1.411879866  
1.356356481  
1.27810333  
1.202471691  
1.17290231  
1.109900027  
1.068310268  
1.021650876  
0.9811345892  
0.9430367029  
0.9024813989  
0.8678497879  
0.8314009645  
0.8008632004  
0.7694407382  
0.7406662178  
0.7116202477  
0.6856684047  
0.6611793185  
0.6362717794  
0.6131615983  
0.5916423649  
0.5708719111  
0.5507461245  
0.5318200339  
0.5135366916  
0.4962869979  
0.4796233321  
0.4637529689  
0.4485895807  
0.4339733896  
0.4199114367  
0.4065421825  
0.3936434729  
0.3813406512  
0.3695038001  
0.3580706445  
0.3471822058  
0.3366211992  
0.3265422859  
0.3168030095  
0.3074491866  
0.2984573925  
0.2897970925  
0.281450834  
0.2734121255  
0.2656726395  
0.2581985811  
0.2510103326  
0.2440480425  
0.2373390076  
0.2308808884  
0.2246275209  
0.2186021728  
0.2127740047  
0.2071421887  
0.2017116883  
0.1964560781  
0.1913597606  
0.1864522352  
0.1816942412  
0.1770982806  
0.1726294134  
0.1683262968  
0.1641442769  
0.1601002854  
0.1561792104  
0.1523873471  
0.1487007302  
0.1451356536  
0.1416789803  
0.1383263654  
0.1350699813  
0.1319135081  
0.1288570188  
0.1258738472  
0.1229964163  
0.1201894274  
0.1174795612  
0.1148372646  
0.1122625266  
0.1097711403  
0.1073473293  
0.1049952619  
0.1027016792  
0.1004774782  
0.09831023644  
0.09620494237  
0.09415755671  
0.09216332605  
0.09022278895  
0.08834004879  
0.08649771935  
0.08471011275  
0.08296377127  
0.08127111284  
0.07962333309  
0.0780112992  
0.07644091657  
0.07491846069  
0.07342835965  
0.07197727713  
0.07055821693  
0.06918437384  
0.06783499224  
0.06652601367  
0.06524703255  
0.0639987317  
0.06278396048  
0.06159704381  
0.06043119771  
0.05930080533  
0.05820598844  
0.05712428596  
0.0560725477  
0.05504233409  
0.05403990457  
0.05305908493  
0.05209915223  
0.05117184782  
0.05025086264  
0.04936290457  
0.04849450728  
0.0476379523  
0.04680786869  
0.04599275803  
0.04519877901  
0.04441528776  
0.04365253023  
0.04290954692  
0.0421824728  
0.04147105317  
0.04077624674  
0.04009137681  
0.03942483851  
0.03877228645  
0.03813684248  
0.03751182955  
0.03689864395  
0.03629894824  
0.03571408565  
0.03514254584  
0.03458230825  
0.03402929708  
0.03349005642  
0.03296336732  
0.03244423135  
0.03193980089  
0.03144203076  
0.03095657676  
0.0304776554  
0.03001235161  
0.02956074426  
0.0291080661  
0.02867005434  
0.02823835541  
0.02781606502  
0.02740451661  
0.02699813356  
0.02660022563  
0.02620738166  
0.02582860377  
0.02545379542  
0.02508230787  
0.02472364064  
0.02436686474  
0.02402263358  
0.02368004481  
0.02334950116  
0.02301656923  
0.02269969643  
0.0223807126  
0.02206936621  
0.02176820726  
0.02146611733  
0.02117498995  
0.02088546265  
0.02060387902  
0.02032628827  
0.020051718  
0.01978699581  
0.0195252106  
0.01926558306  
0.01901125157  
0.01876200412  
0.0185193184  
0.01827866278  
0.01804306614  
0.01780968659  
0.01758472005  
0.01735953572  
0.01713985991  
0.01692389915  
0.01671320921  
0.01650266953  
0.01629692049  
0.01609742354  
0.01589824343  
0.01570416138  
0.0155132914  
0.01532760049  
0.01514097822  
0.01495885401  
0.01478256807  
0.01460253368  
0.01443113626  
0.01426099659  
0.01409342675  
0.01393110402  
0.01376851076  
0.01361068377  
0.01345381291  
0.01330182748  
0.01314861553  
0.01300304613  
0.01285391001  
0.01270991819  
0.01256775706  
0.01242881359  
0.01229065618  
0.01215807655  
0.01202546377  
0.01189451536  
0.01176503493  
0.01163947872  
0.0115148221  
0.01139367886  
0.01127323485  
0.01115476458  
0.01103922889  
0.01092229358  
0.01081077599  
0.0106990498  
0.01058982132  
0.01048053019  
0.01037627281  
0.01027282902  
0.01016847983  
0.01006709964  
0.009966086904  
0.009867909185  
0.009772814091  
0.009677687667  
0.009583600425  
0.009490280822  
0.009400903807  
0.009310450579  
0.009224945328  
0.009138011494  
0.00905073901  
0.008968804541  
0.008886187728  
0.008803455603  
0.008724536519  
0.008645819928  
0.008567365798  
0.008492098597  
0.00841625328  
0.008339730914  
0.008267834366  
0.008195601198  
0.008124847165  
0.008054804226  
0.007986628053  
0.00791949029  
0.007852371317  
0.007786947878  
0.007722808322  
0.007658791295  
0.007595952114  
0.007533478905  
0.007471190329  
0.007413426514  
0.007354348332  
0.007296168417  
0.007237916391  
0.007181624167  
0.007126479161  
0.007073037625  
0.007017754243  
0.006964553207  
0.006912457012  
0.006861793024  
0.006810657987  
0.006760556425  
0.00671059257  
0.006664986797  
0.006615606226  
0.006569442834  
0.006522737631  
0.006478000712  
0.006434450737  
0.006390112773  
0.006347118216  
0.006304186529  
0.006260916131  
0.006219988228  
0.006180044335  
0.006139535472  
0.006100635652  
0.006061872733  
0.006022721631  
0.00598611017  
0.005950430276  
0.00591371875  
0.005878840127  
0.005842266228  
0.005806975356  
0.005774101689  
0.00574069961  
0.005709467853  
0.005675876969  
0.005644286309  
0.005612439707  
0.005581788337  
0.005551471492  
0.005522490652  
0.005493735329  
0.005464953775  
0.00543826926  
0.005408387825  
0.005381995698  
0.005355598892  
0.005330133932  
0.005302306466  
0.005278729408  
0.005254928466  
0.005228908942  
0.005205695993  
0.005181190812  
0.00515921737  
0.005136004713  
0.005114930417  
0.005094968767  
0.005072913384  
0.005052453074  
0.005032098489  
0.005011290546  
0.004991972514  
0.004973941324  
0.00495410267  
0.004937548069  
0.004919785186  
0.004902226838  
0.004883897087  
0.004868094389  
0.004851768067  
0.004835840236  
0.004820570454  
0.004805088163  
0.004790099867  
0.004778031966  
0.00476286886  
0.004748347846  
0.004736531562  
0.004722639048  
0.004710255455  
0.004698510985  
0.004686840069  
0.00467573864  
0.004665548091  
0.004653921476  
0.004644012045  
0.004633653349  
0.00462521998  
0.004615944639  
0.004606438578  
0.004597742811  
0.004588875359  
0.004581295487  
0.004574444219  
0.004568940283  
0.004560096959  
0.004554964771  
0.00454894106  
0.004542831154  
0.004538087113  
0.004532785563  
0.004527047378  
0.004522514558  
0.004517840915  
0.004514291944  
0.004510231735  
0.004508095987  
0.004504698447  
0.004502955944  
0.004501182274  
0.004498180424  
0.004496353557  
0.004495926276  
0.004495754706  
0.004494561199  
0.00449386809  
