0.3474848572  
0.3691741449  
0.383179905  
0.3787042961  
0.3465997222  
0.2803851128  
0.1770798505  
0.03773896681  
-0.1323701425  
-0.3240127838  
-0.5246618641  
-0.7195836642  
-0.893237702  
-1.030888826  
-1.120243269  
-1.152952353  
-1.12577815  
-1.041282418  
-0.9079198915  
-0.7394879274  
-0.5539721952  
-0.3718813536  
-0.2142471503  
-0.1005082853  
-0.04651173957  
-0.06285643083  
-0.1537800048  
-0.3167002919  
-0.542466028  
-0.81627439  
-1.119135603  
-1.429714625  
-1.726326747  
-1.988872448  
-2.200518438  
-2.3489704  
-2.427247228  
-2.433923164  
-2.372878325  
-2.252618573  
-2.085270598  
-1.885359051  
-1.668483393  
-1.449980183  
-1.243670186  
-1.060758454  
-0.9089637864  
-0.7919470353  
-0.7090791194  
-0.6556115284  
-0.6232465861  
-0.6010943165  
-0.5769452944  
-0.5387410326  
-0.4760905355  
-0.3816511156  
-0.2521846267  
-0.08914320081  
0.1013278226  
0.3090044944  
0.5207482328  
0.7220979195  
0.8990788396  
1.039977894  
1.136843802  
1.186484219  
1.190807734  
1.15644942  
1.093722594  
1.015041774  
0.9330299717  
0.8585961381  
0.7992594842  
0.7579797585  
0.732670095  
0.7164955609  
0.6989218459  
0.667394875  
0.6094172089  
0.5147358641  
0.3773287923  
0.1968862841  
-0.02044635748  
-0.2622072998  
-0.5106654139  
-0.7446777436  
-0.9421350882  
-1.082689457  
-1.150398853  
-1.135915557  
-1.037899231  
-0.8634191067  
-0.6272523095  
-0.3501302776  
-0.05614866946  
0.2303253709  
0.4878157123  
0.7005172023  
0.8602807723  
0.9674969067  
1.030735865  
1.065172744  
1.090029235  
1.12541572  
1.189038096  
1.293291625  
1.443168513  
1.635311721  
1.85834639  
2.094429857  
2.321766505  
2.517688534  
2.661827272  
2.738890501  
2.740650486  
2.666862324  
2.525044902  
2.329182552  
2.097617042  
1.850468255  
1.606992722  
1.38325349  
1.19040688  
1.033802717  
0.912932773  
0.8221715308  
0.7521081713  
0.6912383952  
0.6277358266  
0.5510716227  
0.4532824169  
0.3297790025  
0.1796650685  
0.005594740222  
-0.1867344398  
-0.3893409561  
-0.5928491484  
-0.7874064762  
-0.9635429997  
-1.112927607  
-1.2289906  
-1.307405669  
-1.346422863  
-1.34705497  
-1.313095579  
-1.250956298  
-1.169301976  
-1.078475169  
-0.9897208754  
-0.9142490955  
-0.8622063791  
-0.8416585716  
-0.8577064265  
-0.9118529537  
-1.001737329  
-1.121289907  
-1.261339242  
-1.410610578  
-1.557013701  
-1.689064524  
-1.797251321  
-1.875164971  
-1.920236106  
-1.933969532  
-1.921636679  
-1.89147214  
-1.853458676  
-1.817896585  
-1.793910638  
-1.788132762  
-1.803707436  
-1.839765708  
-1.891426128  
-1.950311548  
-2.005512849  
-2.044855132  
-2.056301313  
-2.029314987  
-1.956007815  
-1.83195823  
-1.656613944  
-1.433274978  
-1.168685423  
-0.8723330421  
-0.5555397168  
-0.2304845499  
0.09075845515  
0.3970722594  
0.6789936056  
0.9292105204  
1.142866541  
1.317677807  
1.453867038  
1.553956391  
1.622417293  
1.665221648  
1.689308382  
1.701996968  
1.710389745  
1.720790093  
1.738191236  
1.765862991  
1.805081099  
1.85501675  
1.912805857  
1.973795897  
2.031943146  
2.080345528  
2.111847635  
2.11967681  
2.098039972  
2.042632412  
1.951004551  
1.822753047  
1.659527651  
1.464855531  
1.243823178  
1.002664583  
0.7483073677  
0.487951724  
0.2287182533  
-0.02259856  
-0.2596657705  
-0.4766570209  
-0.6682498934  
-0.8296198371  
-0.9564852416  
-1.045246213  
-1.093218832  
-1.098969926  
-1.06269034  
-0.9865627191  
-0.875021038  
-0.7348407764  
-0.5749794554  
-0.4061462489  
-0.240096073  
-0.08869969943  
0.03711512533  
0.1284268098  
0.1792558582  
0.187235348  
0.1539165576  
0.08464959303  
-0.01195153387  
-0.1249060398  
-0.2420060212  
-0.3510458955  
-0.4409940039  
-0.502947797  
-0.5307779414  
-0.5214024338  
-0.4746979658  
-0.3931155801  
-0.2811005062  
-0.1444423979  
0.01033199247  
0.1764209746  
0.3470295497  
0.5154631124  
0.6750923417  
0.8192718039  
0.941314634  
1.034615614  
1.092987383  
1.111210286  
1.085744508  
1.015508935  
0.902556542  
0.7525005567  
0.57453281  
0.38094892  
0.1861508608  
0.005207520311  
-0.1478715619  
-0.2619138784  
-0.3301429535  
-0.3512536005  
-0.3297959022  
-0.2757438188  
-0.2032506432  
-0.1287243375  
-0.0684672033  
-0.03622217701  
-0.04098492706  
-0.08543729314  
-0.1652683663  
-0.2695278918  
-0.3820025717  
-0.4834423589  
-0.5543359068  
-0.5778302933  
-0.5423611862  
-0.4435973051  
-0.2853932207  
-0.07959703167  
0.1552664337  
0.3962567093  
0.618880605  
0.8001478277  
0.9213724677  
0.9703298868  
0.9424850002  
0.8411638274  
0.6767026616  
0.464765873  
0.224138902  
-0.02564876753  
-0.2664992445  
-0.4834572229  
-0.6657489304  
-0.8071202239  
-0.9055418574  
-0.9624476645  
-0.9817478945  
-0.9688314634  
-0.9297524691  
-0.8707164076  
-0.7978724665  
-0.7173680299  
-0.6355167428  
-0.5589433383  
-0.4945490117  
-0.449216563  
-0.429217771  
-0.4393939077  
-0.4822335516  
-0.5570272204  
-0.659299585  
-0.7806780706  
-0.909309023  
-1.030854196  
-1.129963952  
-1.192085062  
-1.205345429  
-1.16224854  
-1.060912584  
-0.9056529469  
-0.7067696262  
-0.4795545918  
-0.2426175269  
-0.01575648487  
0.182347664  
0.336279221  
0.4355937188  
0.4758448467  
0.4588043833  
0.3918880416  
0.2868922948  
0.158274855  
0.02126419632  
-0.1099096915  
-0.2234060925  
-0.3106034335  
-0.3663150858  
-0.3884378901  
-0.3771903583  
-0.3341714293  
-0.2614793534  
-0.1611180482  
-0.034818492  
0.1156745972  
0.2879392784  
0.4780109493  
0.6795619825  
0.88337928  
1.077360478  
1.247157001  
1.377455407  
1.453772232  
1.464506438  
1.402910777  
1.268638593  
1.068547318  
0.816558402  
0.5325101913  
0.2401161826  
-0.03571447569  
-0.2718083342  
-0.4494916053  
-0.556753918  
-0.5895124581  
-0.5517688459  
-0.4546702806  
-0.3146368094  
-0.1508583951  
0.0174284936  
0.173482344  
0.3050373188  
0.4054672502  
0.4740229042  
0.5151768997  
0.5372610762  
0.5506756076  
0.5659939288  
0.592278992  
0.6358610254  
0.6997197788  
0.7835118482  
0.8841376133  
0.9966880628  
1.115520694  
1.235245849  
1.35140651  
1.460739981  
1.560989637  
1.650337398  
1.72661968  
1.786521031  
1.824982862  
1.834987791  
1.807852665  
1.734039812  
1.604398244  
1.411674844  
1.152040803  
0.8263915312  
0.441180927  
0.00861927256  
-0.4538358069  
-0.9246630088  
-1.380006144  
-1.795733142  
-2.14957449  
-2.423079627  
-2.60317075  
-2.683140709  
-2.663012363  
-2.549277034  
-2.354080702  
-2.094005967  
-1.788586554  
-1.458727924  
-1.125164369  
-0.8070536702  
-0.5207969619  
-0.2791098407  
-0.09038473304  
0.04165527662  
0.1179894159  
0.1440156854  
0.1289504471  
0.08491623959  
0.02577469687  
-0.03424476926  
-0.08197817493  
-0.1067103449  
-0.1013203479  
-0.06307242848  
0.006097339833  
0.09983407188  
0.2081613663  
0.3187377769  
0.4184161994  
0.4949138875  
0.5383753999  
0.5426173121  
0.5059060102  
0.4311556215  
0.3255397191  
0.199577445  
0.06581594218  
-0.06270169913  
-0.1739837629  
-0.2584621577  
-0.3100144353  
-0.326538499  
-0.3100103416  
-0.2660646941  
-0.2031600712  
-0.1314540229  
-0.06155119566  
-0.003273945508  
0.03538672839  
0.04902209982  
0.03517906974  
-0.005670864609  
-0.07053994055  
-0.1546304818  
-0.2522231654  
-0.3576061859  
-0.4658926719  
-0.5736023764  
-0.6789132137  
-0.781542982  
-0.8822867799  
-0.98229718  
-1.082234258  
-1.181450397  
-1.277369216  
-1.365194959  
-1.438030175  
-1.487419269  
-1.504267766  
-1.480001555  
-1.407816807  
-1.283823627  
-1.107907972  
-0.8841723314  
-0.6208738262  
-0.3298389115  
-0.02542552841  
0.2768564018  
0.5618900802  
0.8164707214  
1.030607625  
1.198448613  
1.318711143  
1.394561824  
1.432977814  
1.443662308  
1.437661288  
1.425863405  
1.417580744  
1.419391839  
1.434402443  
1.462020985  
1.498278073  
1.536634432  
1.569173534  
1.587991816  
1.586591866  
1.561052901  
1.510803413  
1.438847393  
1.351404322  
1.256975827  
1.164978399  
1.084129398  
1.020844272  
0.9779089828  
0.953662084  
0.9418677746  
0.9323428938  
0.9122994626  
0.8682339211  
0.7880946903  
0.6634013018  
0.4909658662  
0.2739294182  
0.02188879731  
-0.2499332821  
-0.5224005114  
-0.7748297941  
-0.9876673386  
-1.145064852  
-1.236978029  
-1.260444818  
-1.219862279  
-1.126221641  
-0.9954366343  
-0.846042956  
-0.6966448273  
-0.5635092201  
-0.4586861624  
-0.3889119979  
-0.3554221891  
-0.3546412137  
-0.3795559203  
-0.4214741498  
-0.471827027  
-0.5236633552  
-0.5725881714  
-0.6169927022  
-0.6575915703  
-0.6964073967  
-0.7354672441  
-0.7755233165  
-0.8151126559  
-0.850204334  
-0.8745557491  
-0.8807653211  
-0.8618444409  
-0.8130255615  
-0.7334257128  
-0.6272043202  
-0.5039084085  
-0.3778088135  
-0.2662419159  
-0.1871153636  
-0.1559418661  
-0.1828529807  
-0.2701269262  
-0.4106958036  
-0.5879892252  
-0.7772826509  
-0.9484670546  
-1.069938022  
-1.113080764  
-1.056708355  
-0.8907689619  
-0.6187084541  
-0.2580538454  
0.1609728346  
0.5987081186  
1.010773637  
1.3536548  
1.590363033  
1.695377523  
1.658158087  
1.484715646  
1.197005933  
0.8302222797  
0.4283630495  
0.03868780946  
-0.2941774932  
-0.5336766661  
-0.6555996612  
-0.6506380628  
-0.5249510401  
-0.2987173025  
-0.002949352827  
0.32494551  
0.6462108641  
0.9257046428  
1.136111166  
1.260888323  
1.295602793  
1.247554375  
1.133825346  
0.9781023814  
0.8067587858  
0.6447982758  
0.5122376765  
0.4214309917  
0.3756973815  
0.3694058831  
0.3894641192  
0.4179460253  
0.4354351505  
0.4245572796  
0.3731526973  
0.2766033779  
0.1389645838  
-0.02727804455  
-0.2027815413  
-0.3640091205  
-0.4865930042  
-0.5488909824  
-0.5352183278  
-0.4382904747  
-0.260530865  
-0.01408043295  
0.2804824826  
0.5965094567  
0.9043886583  
1.174961731  
1.382787  
1.508835657  
1.542302159  
1.481341684  
1.332714015  
1.11044864  
0.8337803525  
0.5246680065  
0.2052574871  
-0.1043944459  
-0.3880606311  
-0.6343943951  
-0.837232918  
-0.995205332  
-1.110796369  
-1.189062913  
-1.23624824  
-1.258504584  
-1.260911096  
-1.246906527  
-1.218176078  
-1.174967296  
-1.116730089  
-1.042936967  
-0.9539234006  
-0.8515656338  
-0.739675532  
-0.6240075436  
-0.5118710107  
-0.4113667358  
-0.3303725707  
-0.275424106  
-0.2506641313  
-0.2570483445  
-0.2919538165  
-0.3492771478  
-0.4200539834  
-0.4935382632  
-0.558610358  
-0.6053236593  
-0.6263662217  
-0.6182207928  
-0.5818315247  
-0.5226667333  
-0.4501345924  
-0.3764154998  
-0.314854007  
-0.2781316271  
-0.2764604667  
-0.31605014  
-0.3980689568  
-0.5182302808  
-0.6670724263  
-0.830889226  
-0.9931852787  
-1.136467563  
-1.244137997  
-1.302258473  
-1.300972757  
-1.235437418  
-1.106174109  
-0.9188345861  
-0.6834474025  
-0.4132595451  
-0.1233388369  
0.1709025069  
0.455079846  
0.716986461  
0.9474097769  
1.140561697  
1.294116702  
1.408885613  
1.488201504  
1.5370927  
1.561366753  
1.566713042  
1.557925531  
1.538348856  
1.509614253  
1.471705635  
1.423349646  
1.362679587  
1.288082131  
1.199098006  
1.097214837  
0.9864117672  
0.8733033172  
0.7668187322  
0.6773821528  
0.6156692246  
0.5910781112  
0.6101217295  
0.6749932049  
0.7825422142  
0.9238761424  
1.084714709  
1.246523139  
1.388338743  
1.489091251  
1.530139887  
1.497689636  
1.384771362  
1.192486908  
0.9303425062  
0.6155864516  
0.2715977249  
-0.0744840685  
-0.3946299223  
-0.6629388268  
-0.8584608211  
-0.9674771504  
-0.9849827162  
-0.9151919951  
-0.7710147879  
-0.5725684428  
-0.3448992578  
-0.1151724303  
0.09033582836  
0.2491099579  
0.3447927457  
0.3688374364  
0.3212220061  
0.2101421645  
0.05073417475  
-0.1370306847  
-0.3309974548  
-0.5096992114  
-0.6550793083  
-0.754709101  
-0.803214899  
-0.8027271426  
-0.7623057722  
-0.6964324539  
-0.6227940537  
-0.5596786174  
-0.5233685149  
-0.5258977497  
-0.5734786975  
-0.6658163194  
-0.7963627837  
-0.9534397785  
-1.122017331  
-1.285858636  
-1.429676668  
-1.540994012  
-1.61142797  
-1.637258033  
-1.619235979  
-1.561730674  
-1.471405629  
-1.355689456  
-1.221323532  
-1.073231757  
-0.913913795  
-0.7434381592  
-0.5600222561  
-0.361072829  
-0.1444892265  
0.09002137702  
0.3398637368  
0.5989218028  
0.8575111112  
1.102964415  
1.32079028  
1.496257055  
1.616175279  
1.670627414  
1.654386555  
1.567807531  
1.417052601  
1.213601929  
0.9731052159  
0.7137201338  
0.4541618879  
0.2117132839  
0.000476609881  
-0.1699291066  
-0.2950383226  
-0.3755325042  
-0.416569054  
-0.4265827944  
-0.4157531846  
-0.3943895674  
-0.3714749202  
-0.3535881047  
-0.3443484248  
-0.3444314683  
-0.3521090204  
-0.3641710853  
-0.3770292164  
-0.3877544715  
-0.3948469062  
-0.3985620792  
-0.400735419  
-0.4041230783  
-0.4114152902  
-0.4241080228  
-0.4415070372  
-0.4600896038  
-0.4734034177  
-0.4725904129  
-0.4474940291  
-0.3882028363  
-0.286785902  
-0.1389294175  
0.05480759769  
0.288350651  
0.5502109256  
0.8243424836  
1.091652692  
1.331963334  
1.526151706  
1.658201591  
1.716903583  
1.697003511  
1.599699195  
1.432441433  
1.208100859  
0.943624832  
0.6583401721  
0.3721085735  
0.1035190345  
-0.1316986589  
-0.3218951655  
-0.4602549192  
-0.5450309681  
-0.5792759055  
-0.5701174306  
-0.5276874023  
-0.4638440984  
-0.390821428  
-0.3199670628  
-0.2606778755  
-0.2196449576  
-0.2004327512  
-0.2034264986  
-0.2261016825  
-0.2635608171  
-0.309267257  
-0.3558844674  
-0.3961382676  
-0.4236299753  
-0.4335289323  
-0.4230864145  
-0.3919180263  
-0.3420314747  
-0.2775727091  
-0.2043050366  
-0.1288680398  
-0.05788673851  
0.00295343066  
0.04973857935  
0.08093915626  
0.09768333357  
0.1036369751  
0.1044762927  
0.1070208057  
0.1181534913  
0.1436919429  
0.187398767  
0.2503002579  
0.3304206059  
0.4229801792  
0.5210311557  
0.6164085164  
0.7008489122  
0.7670855946  
0.8097604419  
0.8260181326  
0.815720979  
0.7812823259  
0.7271910182  
0.6593201238  
0.5841514858  
0.508038639  
0.4365843922  
0.3742019282  
0.323863716  
0.287026653  
0.2636951035  
0.2525798422  
0.2513170528  
0.2567289567  
0.2651077302  
0.2725280105  
0.2751772558  
0.2696964149  
0.2534994643  
0.225039598  
0.1839629893  
0.1311179898  
0.06838296058  
-0.001685023041  
-0.07634160212  
-0.1532221434  
-0.2308899471  
-0.3092501648  
-0.3897404336  
-0.4752165693  
-0.5695204476  
-0.6767531277  
-0.8003440922  
-0.9420565536  
-1.101086208  
-1.273428563  
-1.451653218  
-1.62517524  
-1.78104265  
-1.905180582  
-1.98395238  
-2.005838324  
-1.962994672  
-1.852467218  
-1.676855477  
-1.444305413  
-1.167789689  
-0.8637509405  
-0.5502603808  
-0.2449474227  
0.03702575452  
0.2846467253  
0.4921463239  
0.6593375168  
0.7911322595  
0.8963059819  
0.9856860324  
1.070045269  
1.158023091  
1.254415651  
1.359110843  
1.466855446  
1.567911127  
1.649502642  
1.697844412  
1.700418694  
1.648141442  
1.537062565  
1.36931987  
1.153189954  
0.9022201854  
0.6335881866  
