2838.506381  
3140.885553  
3798.368214  
5323.232024  
9949.276783  
30416.67516  
50049.81385  
64249.19546  
17964.82171  
10940.43505  
8172.280377  
1963.943178  
6111.322069  
22077.1175  
47481.35098  
11108.48518  
4561.982557  
22545.09616  
1077.000256  
11899.16798  
251.674285  
8074.24937  
4700.103382  
2856.72174  
1049.469028  
178.8449229  
2781.935446  
7594.115646  
1857.145656  
3549.240215  
1079.731996  
2406.190488  
298.8384456  
5148.130735  
383.0856036  
6479.653429  
6004.338559  
879.2698629  
6593.659334  
444.1138061  
3961.544397  
6676.990543  
434.8728824  
4328.186677  
13586.19936  
1723.489915  
3333.244008  
7032.592749  
1831.642873  
2608.281157  
12563.77508  
16354.83185  
134.1414457  
4469.147737  
1649.065415  
3070.402458  
1023.386253  
1295.784526  
66.99804957  
277.0482589  
196.7819805  
828.6216567  
170.970794  
236.8456424  
133.4304324  
374.1597907  
107.7817285  
55.08212175  
60.11390036  
2.959870187  
28.18387876  
2.946634868  
10.22182752  
23.97183262  
28.07624482  
14.56678779  
11.78003759  
13.03926349  
6.558747441  
8.119383491  
12.69856023  
8.505467005  
9.274410382  
8.119012348  
8.650628862  
8.311390486  
7.576222388  
7.138527186  
7.320305343  
6.36195976  
6.786755399  
6.417556235  
6.037932315  
6.066802436  
6.153864838  
5.773446923  
5.578012712  
5.563762776  
5.318858625  
5.269284481  
5.054014384  
4.979730751  
4.834131009  
4.721640689  
4.630345305  
4.522582373  
4.427063949  
4.338069715  
4.230481328  
4.143245843  
4.059321179  
3.973203536  
3.892040602  
3.820908463  
3.740561909  
3.666635971  
3.600048418  
3.530861862  
3.464293249  
3.400542597  
3.336523382  
3.277869978  
3.219654944  
3.16149373  
3.106658061  
3.052699667  
3.001227252  
2.950569086  
2.901295683  
2.853617227  
2.807060922  
2.761962901  
2.717902817  
2.67498554  
2.632917242  
2.592348855  
2.552498297  
2.513711162  
2.476009514  
2.439249221  
2.40336143  
2.36833372  
2.334140395  
2.300798993  
2.268227747  
2.236429786  
2.205339051  
2.174970676  
2.145288635  
2.116337329  
2.087939074  
2.060191878  
2.03314745  
2.006603471  
1.980636243  
1.955261841  
1.930458586  
1.906166122  
1.882350033  
1.859046171  
1.836219052  
1.813879201  
1.791947622  
1.770536565  
1.749510061  
1.728925469  
1.708749688  
1.688934189  
1.669540915  
1.650522325  
1.631825637  
1.613553898  
1.595586847  
1.578010751  
1.560693345  
1.543732917  
1.527105564  
1.510741434  
1.494721779  
1.478989482  
1.463540077  
1.448337234  
1.433430892  
1.418781955  
1.404379481  
1.39024448  
1.37634605  
1.362712369  
1.349269354  
1.336101387  
1.323151465  
1.310379689  
1.297866257  
1.28556515  
1.273449389  
1.261538702  
1.249843978  
1.238317791  
1.22696576  
1.215806405  
1.204864007  
1.194058953  
1.183409641  
1.172955936  
1.16269921  
1.152556961  
1.142608484  
1.132764932  
1.123129463  
1.113581614  
1.104249741  
1.095023208  
1.085933538  
1.076979608  
1.068159237  
1.059488122  
1.050939214  
1.042506674  
1.034211123  
1.026025192  
1.017975039  
1.010031711  
1.002197299  
0.9944714526  
0.9868784084  
0.9793815786  
0.9719922185  
0.9647169695  
0.9575376187  
0.9504435737  
0.9434818263  
0.9365948627  
0.9298075743  
0.9231088454  
0.9165338863  
0.9100198434  
0.903596981  
0.8972530331  
0.8910048829  
0.8848394695  
0.878752233  
0.8727545797  
0.8668433807  
0.8610132615  
0.8552504985  
0.8495708238  
0.8439535725  
0.8384248055  
0.8329603717  
0.8275656449  
0.8222348958  
0.8169680895  
0.8117898543  
0.8066707348  
0.8016058085  
0.7966400506  
0.7916904777  
0.7868384709  
0.7820490445  
0.7772970771  
0.7725985647  
0.768012288  
0.7634242567  
0.7589199678  
0.754464256  
0.7500615769  
0.7457342735  
0.7414435989  
0.7371972606  
0.733023505  
0.7288808664  
0.7247982223  
0.7207660124  
0.7167841408  
0.7128409832  
0.7089702775  
0.7051098513  
0.7013137081  
0.697554002  
0.6938583408  
0.6902053893  
0.686584771  
0.6829944302  
0.6794700275  
0.6759758173  
0.6725342266  
0.6691213655  
0.6657405517  
0.6624244411  
0.6591345615  
0.6558735887  
0.6526602859  
0.6494811086  
0.6463252257  
0.643236173  
0.6401484753  
0.6371381213  
0.6341199959  
0.6311556633  
0.6282314642  
0.6253552787  
0.6224683977  
0.6196423333  
0.6168446947  
0.614073756  
0.611337251  
0.6086245229  
0.6059687556  
0.603305941  
0.6007056448  
0.5981124863  
0.5955526682  
0.5930264134  
0.5905295312  
0.5880465604  
0.58562531  
0.5831930055  
0.5808093227  
0.5784519236  
0.5761033855  
0.5738154568  
0.5715160736  
0.5692718091  
0.567040576  
0.5648447771  
0.5626517069  
0.5604917488  
0.55834546  
0.5562569238  
0.5541565336  
0.5520835265  
0.5500552862  
0.5480258266  
0.5460600515  
0.5440633747  
0.5421230198  
0.5401688366  
0.5382719414  
0.5363954703  
0.5345317042  
0.5326824178  
0.530836489  
0.5290292734  
0.5272513152  
0.5254842439  
0.5237591652  
0.5220382845  
0.520323924  
0.5186443529  
0.5169813098  
0.5153390228  
0.5136880654  
0.512097031  
0.510491494  
0.5089118096  
0.5073620038  
0.5058289045  
0.5042988364  
0.5027896271  
0.5012967745  
0.4998329923  
0.4983663843  
0.4969369962  
0.4955114851  
0.4941108033  
0.4927202219  
0.4913449362  
0.4899936604  
0.4886423632  
0.4873311834  
0.486019546  
0.48472602  
0.4834541973  
0.4821822185  
0.4809332447  
0.4796821443  
0.4784688621  
0.4772611916  
0.476073972  
0.4749018094  
0.4737384722  
0.4725905964  
0.4714550773  
0.470327447  
0.4692158059  
0.4681334616  
0.4670388813  
0.4659751621  
0.4649189554  
0.4638811971  
0.4628671213  
0.4618366738  
0.4608556324  
0.4598567749  
0.4588705506  
0.4579322062  
0.4569631354  
0.4560240493  
0.4550996193  
0.4541954802  
0.4532693989  
0.4523920693  
0.4515143925  
0.4506475375  
0.4497978595  
0.448948217  
0.4481227177  
0.4473007987  
0.4464956896  
0.4456980787  
0.4449148753  
0.4441461923  
0.4433816495  
0.4426120624  
0.4418958986  
0.4411582327  
0.4404297743  
0.4397297656  
0.4390241414  
0.4383457344  
0.4376634556  
0.4369919049  
0.4363385594  
0.4357017285  
0.4350455144  
0.4344366684  
0.4338436184  
0.4332359883  
0.4326376063  
0.4320492369  
0.4314874816  
0.4309156621  
0.4303631335  
0.429804007  
0.4292739902  
0.4287613006  
0.4282403048  
0.4277423861  
0.4272486329  
0.4267606355  
0.4262793204  
0.4258210331  
0.4253617903  
0.4249239667  
0.4244864031  
0.4240597886  
0.4236320877  
0.4232302781  
0.4228422252  
0.4224328503  
0.4220598878  
0.4216873747  
0.4213117936  
0.4209716504  
0.4206250838  
0.4203000357  
0.419950445  
0.4196406929  
0.4193457708  
0.4190586043  
0.418744082  
0.4184561101  
0.4181936276  
0.4179388711  
0.417667026  
0.4174265962  
0.4172004269  
0.4169565346  
0.4167530937  
0.416541203  
0.4163327465  
0.4161350756  
0.415961754  
0.4157697083  
0.4156143159  
0.4154468183  
0.4153086668  
0.4151523797  
0.415014955  
0.414905635  
0.4147945407  
0.4146894888  
0.4145910821  
0.4145012689  
0.4144173326  
0.4143461752  
0.4142886322  
0.4142209134  
0.4141744043  
0.4141383528  
0.4141109221  
0.4140834743  
0.4140803818  
0.4140576975  
