1685.051332  
1785.646145  
1981.277317  
2361.913723  
3393.806793  
10552.85685  
1976.014634  
8174.228346  
248.3245456  
14233.5803  
2071.775562  
25592.49748  
18088.52663  
14964.89097  
6115.652069  
1846.000872  
46097.27885  
58951.47535  
8401.987159  
1145.320291  
5672.778323  
416.4732866  
15144.19965  
9140.391431  
5203.121859  
3687.053573  
3868.389837  
19429.03302  
8719.782524  
6949.499056  
21541.97407  
20563.99077  
5716.171611  
4994.290222  
25089.8799  
2850.000274  
6.939760253  
454.6920705  
8194.332078  
8816.200897  
2144.378542  
4699.12839  
7673.374881  
3556.469577  
2412.261685  
127.4613476  
10714.24551  
3352.19601  
1501.792629  
905.8172453  
1720.374426  
560.0960814  
8432.528846  
3103.754833  
767.9023241  
1612.462134  
14852.74576  
6219.945643  
88.0838801  
277.1425593  
3197.137291  
178.8673145  
539.1727249  
683.1254969  
660.1648262  
152.1808832  
57.67153444  
65.41803195  
134.7171515  
156.362218  
113.7741556  
97.90427035  
49.02720273  
32.89631281  
58.89235126  
26.3294708  
28.85344386  
15.10955568  
18.23400575  
13.23767676  
16.52560401  
19.6612446  
14.20639806  
24.38789112  
16.26973949  
15.3358337  
14.87173418  
13.45781302  
12.66500663  
12.18013738  
11.61520527  
10.87742576  
10.23984466  
9.525472264  
9.086205805  
8.469050307  
7.975684964  
7.783454454  
7.41675093  
7.034122894  
6.651008121  
6.404187791  
6.08487584  
5.781394995  
5.530573756  
5.293766924  
5.073365661  
4.830357514  
4.645307386  
4.449014985  
4.266212828  
4.086556321  
3.924217085  
3.767279948  
3.618966068  
3.475946993  
3.343978573  
3.216446854  
3.094781468  
2.980196314  
2.871137795  
2.766949098  
2.666883498  
2.573016291  
2.481263836  
2.39521236  
2.311691363  
2.233713765  
2.157334891  
2.085123658  
2.015797718  
1.949645908  
1.886121747  
1.825291583  
1.766759809  
1.710966495  
1.657254182  
1.605734328  
1.55618223  
1.508672023  
1.4629605  
1.419064817  
1.376816451  
1.336212329  
1.29705381  
1.259414864  
1.223216508  
1.188247061  
1.154608725  
1.122201641  
1.090963122  
1.060779281  
1.031718206  
1.003629451  
0.9765605514  
0.9503914812  
0.9251468255  
0.9007211357  
0.8771282082  
0.854348152  
0.8322913737  
0.8110248301  
0.7903911309  
0.7704682331  
0.751150817  
0.7324823099  
0.7143840709  
0.6968740875  
0.6799140415  
0.663477428  
0.6475588044  
0.6320925445  
0.6171487637  
0.6026293205  
0.5885534749  
0.574900292  
0.5616352825  
0.5487809046  
0.5363142088  
0.5242086343  
0.5124241472  
0.5009978123  
0.4899032389  
0.479110229  
0.4686219512  
0.4584444314  
0.4485558443  
0.438923501  
0.4295645235  
0.4204840389  
0.4116188504  
0.402993798  
0.3946109319  
0.3864652743  
0.3785189579  
0.3707791298  
0.3632554482  
0.3559241588  
0.3487869816  
0.3418430127  
0.3350592494  
0.3284490191  
0.3220272282  
0.3157619465  
0.3096439936  
0.3036862337  
0.2978786984  
0.2922030415  
0.2866701945  
0.2812806622  
0.2760377767  
0.2708946358  
0.2658894361  
0.2610055598  
0.2562288845  
0.2515610578  
0.2470235774  
0.2425772156  
0.2382544045  
0.2340182329  
0.2298834233  
0.2258383716  
0.2218887245  
0.2180358958  
0.2142607543  
0.2105682635  
0.2069784514  
0.2034468896  
0.2000068745  
0.1966490497  
0.193347784  
0.190138017  
0.1869853609  
0.1839018174  
0.180892382  
0.1779385664  
0.1750669155  
0.1722278982  
0.1694737556  
0.1667617943  
0.1641234388  
0.1615212568  
0.1589944453  
0.1565110041  
0.154074762  
0.151687784  
0.1493576368  
0.147073381  
0.1448314117  
0.1426477241  
0.1404929812  
0.138392323  
0.136320415  
0.1342993678  
0.1323160826  
0.1303723129  
0.1284750232  
0.1266139241  
0.1247818476  
0.1229866709  
0.1212225958  
0.119502178  
0.1178072082  
0.1161514206  
0.1145214237  
0.1129231908  
0.1113587326  
0.109826042  
0.1083155264  
0.1068328689  
0.1053915732  
0.1039573342  
0.1025664368  
0.1011921436  
0.09984612361  
0.09851551375  
0.09722642395  
0.0959461311  
0.09470055576  
0.09346802185  
0.09226346009  
0.09108241692  
0.08991648206  
0.08877606142  
0.08765901061  
0.08654867533  
0.08546686393  
0.08440783367  
0.08335473262  
0.08233518856  
0.08132965454  
0.08033311836  
0.0793555625  
0.07840378414  
0.07746651185  
0.07653646437  
0.07562331892  
0.07473462852  
0.07385841487  
0.07300496252  
0.07214884624  
0.07131755941  
0.07049086611  
0.06969020885  
0.06890308751  
0.06811843278  
0.06735525134  
0.06659692767  
0.06585253454  
0.06513022587  
0.0644098836  
0.06370294428  
0.06301138297  
0.06232856956  
0.06166103608  
0.06100197989  
0.06034269615  
0.05970990891  
0.05908087849  
0.05845952232  
0.0578548669  
0.05725576353  
0.05666241199  
0.05608422147  
0.05550953496  
0.05494996361  
0.05439757801  
0.05385627234  
0.05332330727  
0.05279020097  
0.05227547387  
0.05176758906  
0.0512566383  
0.05077116365  
0.05027608137  
0.04979707636  
0.04933124757  
0.04886411479  
0.04840540421  
0.04795566799  
0.04751131203  
0.04707674099  
0.04664738658  
0.04622124887  
0.04580681455  
0.04539369973  
0.04498406829  
0.04459396405  
0.04420000114  
0.04381942752  
0.04343337285  
0.04305872763  
0.04268995772  
0.04232969861  
0.04197127574  
0.04161703331  
0.04127371714  
0.04093535485  
0.04059259546  
0.04026573599  
0.03993371967  
0.03961767734  
0.03929196216  
0.03898462744  
0.03867243499  
0.03837255695  
0.03807691449  
0.03778695772  
0.03749341063  
0.03721236277  
0.03693355725  
0.03665392788  
0.03637918324  
0.03611582752  
0.03584833146  
0.03558886413  
0.03533419154  
0.03508652378  
0.03483669043  
0.0345897725  
0.03434957434  
0.03411595094  
0.03388347081  
0.03364992199  
0.03342180294  
0.03320180222  
0.03298366039  
0.03276700321  
0.03255513826  
0.03234383313  
0.03213680678  
0.03193430986  
0.03173487367  
0.03153666337  
0.03134582961  
0.03115121841  
0.03096073526  
0.03078173285  
0.03059752342  
0.03042081748  
0.03024195071  
0.03006899442  
0.02989685635  
0.02973293735  
0.02956330683  
0.02940208383  
0.02924448054  
0.0290803748  
0.02893366308  
0.02877943083  
0.0286279852  
0.02847803588  
0.02833493605  
0.02819113468  
0.02805208883  
0.02791495624  
0.02778411562  
0.0276471325  
0.02751777993  
0.0273890919  
0.0272606854  
0.02713703391  
0.02701365041  
0.02689618736  
0.026781788  
0.02666553193  
0.02655246872  
0.02644014438  
0.02633259479  
0.02622760208  
0.02612205452  
0.02601929856  
0.0259157231  
0.02581814225  
0.02571963536  
0.02562483751  
0.02553354247  
0.02544219909  
0.02535423715  
0.02526409371  
0.02518045297  
0.02509651009  
0.02501632055  
0.02493567366  
0.02485389075  
0.0247776457  
0.02470407848  
0.02463058006  
0.02455995851  
0.02449408117  
0.02442370176  
0.02435447155  
0.0242944359  
0.02423174789  
0.02416953179  
0.02411366508  
0.02405662976  
0.0239980376  
0.02394514593  
0.02389010193  
0.02383902742  
0.02378775028  
0.02374206622  
0.02369713272  
0.02365439885  
0.02361169049  
0.02356619416  
0.02353151485  
0.02348999723  
0.02345421913  
0.0234196862  
0.02338506448  
0.02334967829  
0.02332080977  
0.02329512043  
0.02326593739  
0.02323834297  
0.02321079485  
0.02319013025  
0.02316947555  
0.02315009166  
0.02313563606  
0.0231140889  
0.02310002217  
0.02308211021  
0.02306964865  
0.02305837823  
0.0230520694  
0.02304015433  
0.0230362483  
0.02302857406  
0.02302644607  
0.02302655856  
0.02302609057  
