-0.2319701641  
-0.3800960232  
-0.518995983  
-0.6400072812  
-0.7363044939  
-0.8034476319  
-0.8396328066  
-0.8456428556  
-0.8245607342  
-0.781304012  
-0.7220930566  
-0.6539219927  
-0.5840939509  
-0.5198436801  
-0.4680350663  
-0.4348905993  
-0.4257011406  
-0.4444803996  
-0.4935544357  
-0.5731005977  
-0.6807158656  
-0.8111005542  
-0.9559748055  
-1.104316781  
-1.242991597  
-1.357770326  
-1.434678806  
-1.461543512  
-1.429553159  
-1.334619682  
-1.178334401  
-0.9683441604  
-0.7180358735  
-0.4455269097  
-0.1720287958  
0.08024175298  
0.2903563351  
0.4409063004  
0.5198860027  
0.5219994942  
0.4492145462  
0.3105102348  
0.1208451662  
-0.1005181996  
-0.3321166239  
-0.5525566508  
-0.7426762559  
-0.8873565602  
-0.97677179  
-1.006979107  
-0.9798039345  
-0.9020907098  
-0.7844493117  
-0.6396838177  
-0.4811160472  
-0.3210225227  
-0.1693565579  
-0.03289387163  
0.08512694418  
0.1848723193  
0.2693471254  
0.3434998484  
0.4131540726  
0.4839203704  
0.5602313756  
0.6446321472  
0.7374028876  
0.8365434561  
0.9381048599  
1.036800048  
1.126797012  
1.2025811  
1.259756927  
1.295695439  
1.309929312  
1.304262551  
1.282570616  
1.250327922  
1.213917164  
1.179798897  
1.153655193  
1.139593294  
1.139522793  
1.152779987  
1.176052597  
1.203635575  
1.228001087  
1.240622184  
1.232971905  
1.197579977  
1.129007056  
1.024622723  
0.8850695309  
0.714343205  
0.5194675255  
0.3098037026  
0.09607056958  
-0.1107777074  
-0.3006816474  
-0.465443752  
-0.5994142807  
-0.6998141866  
-0.7666626964  
-0.8023474472  
-0.8109395209  
-0.7973627241  
-0.7665738952  
-0.7228896575  
-0.6695575991  
-0.6086284829  
-0.5411460303  
-0.4675731163  
-0.3883757154  
-0.3046288729  
-0.218504505  
-0.133522364  
-0.05448243384  
0.01295171664  
0.06298370087  
0.09063077476  
0.09274136396  
0.0688971837  
0.02202957728  
-0.04141319127  
-0.1118410051  
-0.1774487658  
-0.2256310294  
-0.2447102579  
-0.2257542111  
-0.1641984041  
-0.06100370599  
0.07687794958  
0.2368758697  
0.4020393655  
0.5530271181  
0.6706120094  
0.7383745858  
0.7451690255  
0.6869856603  
0.5678795015  
0.3997572214  
0.2010045612  
-0.005913673205  
-0.1975343747  
-0.3527223129  
-0.4557159696  
-0.4984101523  
-0.4814920352  
-0.4142349973  
-0.3129679938  
-0.1984613917  
-0.09267016375  
-0.01535985288  
0.01882513014  
0.002382242034  
-0.06424325921  
-0.1731462602  
-0.3106118932  
-0.4595843379  
-0.6024990042  
-0.7239819679  
-0.8129673094  
-0.8639211922  
-0.8770365556  
-0.8574558027  
-0.8137475804  
-0.7559812217  
-0.6937917679  
-0.6347920879  
-0.5835879189  
-0.5415311971  
-0.5071735128  
-0.4772499993  
-0.4479381918  
-0.4160966576  
-0.3802038526  
-0.3408215961  
-0.3004899312  
-0.2631154084  
-0.232993802  
-0.2136989964  
-0.2070837187  
-0.2126050905  
-0.2271337173  
-0.245279168  
-0.2601912889  
-0.2646813569  
-0.2524615194  
-0.2192740158  
-0.1637057306  
-0.08755086637  
0.004342579112  
0.1047143059  
0.2048997098  
0.2960465511  
0.3703332252  
0.4220101013  
0.4481090151  
0.4487418762  
0.4269578638  
0.3882235348  
0.3396091671  
0.2888249081  
0.2432318248  
0.2089641469  
0.1902431197  
0.1889457389  
0.2044503887  
0.2337361858  
0.2717164367  
0.3117470048  
0.3462707069  
0.3675366954  
0.3683626463  
0.3428783123  
0.287215886  
0.2000893346  
0.08320950675  
-0.05851709285  
-0.2170501424  
-0.3815807151  
-0.5391942081  
-0.6758228784  
-0.777418757  
-0.8312678786  
-0.8273174918  
-0.7593787429  
-0.6260749277  
-0.4313927186  
-0.184752078  
0.0994581111  
0.4028743641  
0.7046148389  
0.9830756343  
1.217895064  
1.391899371  
1.49281429  
1.514563308  
1.458001028  
1.330979066  
1.147722829  
0.9275556888  
0.6930826304  
0.4680045861  
0.2747750791  
0.1323358623  
0.0541659433  
0.04685786443  
0.1093740641  
0.2330917754  
0.4026338415  
0.5974364378  
0.7938750637  
0.9677473157  
1.096828682  
1.163221268  
1.155222157  
1.068494571  
0.9064059481  
0.6795052931  
0.4042060551  
0.1008691375  
-0.2084717166  
-0.5024349281  
-0.7623834587  
-0.9740224825  
-1.128350283  
-1.221884057  
-1.256211335  
-1.236999539  
-1.172667753  
-1.072949093  
-0.9475705671  
-0.8052260914  
-0.6529441422  
-0.4958938974  
-0.3375714954  
-0.1802690265  
-0.02568332856  
0.1244777238  
0.2680239569  
0.4020295532  
0.5228424164  
0.6263377958  
0.7083604903  
0.7652568824  
0.794401879  
0.7946139634  
0.7663832762  
0.7118686046  
0.6346713113  
0.5394167721  
0.4312250356  
0.3151477575  
0.1956791507  
0.07640624493  
-0.0401500565  
-0.1524846271  
-0.259885251  
-0.3620728405  
-0.4588003339  
-0.5494782837  
-0.632902585  
-0.7071419883  
-0.769596552  
-0.8172264784  
-0.8469086365  
-0.8558628682  
-0.8420838795  
-0.8047021483  
-0.7442354689  
-0.6626850152  
-0.5634756904  
-0.4512446554  
-0.3315143226  
-0.2102842434  
-0.09358674605  
0.01295269474  
0.1045256829  
0.177492329  
0.2296609608  
0.2604855049  
0.2711683496  
0.2646589788  
0.2455325636  
0.2197348683  
0.1941851616  
0.1762359338  
0.1730068414  
0.1906358621  
0.2334932942  
0.3034548276  
0.3993017877  
0.5163634864  
0.6464564494  
0.7782033894  
0.8977393147  
0.9897879964  
1.039055298  
1.031808727  
0.9575068437  
0.8102995746  
0.5902022189  
0.3037805933  
-0.03580514809  
-0.4094716902  
-0.7936114227  
-1.162125398  
-1.48892393  
-1.750624822  
-1.929139345  
-2.013815186  
-2.002819986  
-1.903543981  
-1.731901607  
-1.510571426  
-1.266361241  
-1.027015113  
-0.8178916343  
-0.6589540713  
-0.5624799556  
-0.5318058422  
-0.5612662844  
-0.6373030014  
-0.7405591711  
-0.8486432883  
-0.9391510601  
-0.9925336998  
-0.9944305688  
-0.9371989112  
-0.8205046114  
-0.65096021  
-0.4409539975  
-0.2068818196  
0.03292832834  
0.2603255997  
0.4592171148  
0.6170401131  
0.7257063603  
0.7820032113  
0.7874753877  
0.7478880668  
0.6723831918  
0.5724449726  
0.4607881008  
0.3502551239  
0.252789832  
0.1785397907  
0.135120425  
0.1270774782  
0.1555901461  
0.2184247757  
0.3101854353  
0.4228574261  
0.5466293093  
0.6709417913  
0.7856821658  
0.8823972022  
0.9553932052  
1.002556423  
1.025779364  
1.030879282  
1.026973386  
1.025348448  
1.037922878  
1.075478913  
1.145896088  
1.252627115  
1.393652436  
1.561107591  
1.741685746  
1.917822235  
2.069561939  
2.176903584  
2.22232521  
2.193175949  
2.08359175  
1.895659134  
1.639635894  
1.333155796  
0.9994853878  
0.6650164488  
0.35631501  
0.09707815886  
-0.09460618849  
-0.2083369913  
-0.2425548679  
-0.2046139084  
-0.109761342  
0.02085103499  
0.1628628226  
0.2917712031  
0.385978795  
0.429435845  
0.4135490098  
0.338120054  
0.2112055392  
0.04792591177  
-0.1316212673  
-0.3050744954  
-0.4507903482  
-0.5507247698  
-0.5928459923  
-0.5727755225  
-0.4944487147  
-0.3697170157  
-0.2169496074  
-0.05879966125  
0.08056606648  
0.1784345306  
0.2163348014  
0.1823020778  
0.07234123476  
-0.1090763648  
-0.3495276859  
-0.6300749384  
-0.9274187756  
-1.216484244  
-1.47311266  
-1.676531938  
-1.811333295  
-1.868764865  
-1.847246109  
-1.752116883  
-1.59472383  
-1.391015207  
-1.159843457  
-0.921182891  
-0.6944484706  
-0.4970508552  
-0.3432688932  
-0.2434811993  
-0.2037383045  
-0.2256446962  
-0.3064995482  
-0.4396446913  
-0.6149875998  
-0.8196739304  
-1.038890257  
-1.256786659  
-1.457502285  
-1.626250284  
-1.750407092  
-1.820524416  
-1.83117242  
-1.78150776  
-1.675480617  
-1.521626099  
-1.332408139  
-1.123150219  
-0.9106444159  
-0.7115599281  
-0.5408274945  
-0.4101705635  
-0.3269685402  
-0.2935703649  
-0.307153341  
-0.3601369384  
-0.441092644  
-0.5360378  
-0.6299492232  
-0.7083125395  
-0.7585452206  
-0.771127847  
-0.7403656482  
-0.6647170192  
-0.5467115175  
-0.3925049691  
-0.2111495791  
-0.01369132631  
0.1878250649  
0.381337814  
0.5556820568  
0.7013759033  
0.8112365502  
0.8808191206  
0.9086457736  
0.8962270441  
0.8478758515  
0.7703195444  
0.6721398409  
0.5630746672  
0.453246836  
0.3523761421  
0.269063832  
0.2102097189  
0.1806281047  
0.1828901305  
0.2173997764  
0.2826722527  
0.3757634858  
0.4927699524  
0.6293284618  
0.7810401436  
0.9437723938  
1.113813785  
1.287896846  
1.463107777  
1.636747821  
1.806187018  
1.968764486  
2.121757293  
2.262433643  
2.388170171  
2.496615329  
2.585846806  
2.654507436  
2.70188065  
2.727905103  
2.733132842  
2.718649836  
2.685985853  
2.637024798  
2.573934089  
2.499102734  
2.415070413  
2.324416097  
2.22958876  
2.132652178  
2.0349628  
1.936801919  
1.837031169  
1.73284858  
1.619721353  
1.491583995  
1.341325377  
1.161564683  
0.9456562201  
0.6887964584  
0.389090191  
0.04839482692  
-0.3272095346  
-0.7274379679  
-1.138362719  
-1.543486929  
-1.925225354  
-2.266620764  
-2.553086173  
-2.773945318  
-2.923567563  
-3.001947437  
-3.014633576  
-2.972017306  
-2.888046622  
-2.778528628  
-2.659225108  
-2.543964322  
-2.443014776  
-2.36190621  
-2.3008592  
-2.254877329  
-2.21451187  
-2.167197752  
-2.099009236  
-1.996623784  
-1.849254771  
-1.650325702  
-1.398664038  
-1.099074558  
-0.7622089  
-0.4037408449  
-0.04293918361  
0.2991818997  
0.6019218335  
0.8468989716  
1.019772775  
1.111485344  
1.118890869  
1.044747759  
0.8971096626  
0.6882572848  
0.4333386525  
0.1489222499  
-0.1483552388  
-0.4429130685  
-0.7210350497  
-0.9713647395  
-1.18512448  
-1.356142526  
-1.48078107  
-1.557843259  
-1.588498688  
-1.57623516  
-1.5267945  
-1.448022664  
-1.34957308  
-1.24239223  
-1.137978286  
-1.047430816  
-0.9803777275  
-0.9438965654  
-0.9415860115  
-0.9729321751  
-1.033094541  
-1.113183094  
-1.201031744  
-1.282392231  
-1.342418073  
-1.367248398  
-1.345493258  
-1.269430897  
-1.135762972  
-0.9458482606  
-0.7054124845  
-0.423788223  
-0.1128221342  
0.2143866008  
0.5447471045  
0.8662697895  
1.168891824  
1.444961239  
1.689385484  
1.899499254  
2.074732799  
2.216176011  
2.326142554  
2.40777918  
2.464776562  
2.501147331  
2.521068137  
2.528718569  
2.528085786  
2.522709546  
2.515367279  
2.50773828  
2.500101404  
2.491135907  
2.477899267  
2.456018507  
2.420121612  
2.364478812  
2.283790294  
2.174028909  
2.033226215  
1.862081576  
1.664305277  
1.446614781  
1.218353778  
0.9907567109  
0.7758941967  
0.5854254742  
0.4292627557  
0.3143084569  
0.2434168604  
0.2147193  
0.2214221226  
0.2521539009  
0.2918616743  
0.3232057126  
0.3283417508  
0.2909031699  
0.1979794939  
0.04185561802  
-0.178706879  
-0.4578185361  
-0.7825615727  
-1.13386433  
-1.488083402  
-1.819155459  
-2.101100668  
-2.310610425  
-2.429448779  
-2.446402874  
-2.358567135  
-2.171818038  
-1.90041441  
-1.565755138  
-1.194429023  
-0.8157393663  
-0.4589785042  
-0.1507279188  
0.08753051707  
0.2412376419  
0.3038426035  
0.2770383093  
0.1701545913  
-0.001199027038  
-0.217058077  
-0.455350846  
-0.6941917485  
-0.9139489527  
-1.09886227  
-1.238036521  
-1.325757028  
-1.361153095  
-1.347323313  
-1.290136549  
-1.196909829  
-1.075221057  
-0.9320218844  
-0.7731751472  
-0.6034425412  
-0.4268502616  
-0.2472949188  
-0.06919074  
0.1020323095  
0.2597482118  
0.3963661777  
0.5039857409  
0.5753872088  
0.6051998944  
0.5910302355  
0.534335201  
0.4408400852  
0.3203829294  
0.1861415029  
0.05331635369  
-0.06257807006  
-0.1475874324  
-0.1910934746  
-0.1872321204  
-0.1357505828  
-0.04215329948  
0.08288919927  
0.2248137882  
0.3669579139  
0.4926425302  
0.5872680355  
0.6401558804  
0.6458816704  
0.6049338231  
0.5236038387  
0.4131289598  
0.2881940201  
0.1650026331  
0.0591640646  
-0.01631761034  
-0.05268350056  
-0.0464770925  
0.0001226351585  
0.07972001609  
0.1808191768  
0.2894591642  
0.3911438804  
0.4727897027  
0.5244225126  
0.5403861122  
0.519920836  
0.4670354014  
0.3897279686  
0.2986858149  
0.2056720866  
0.1218455935  
0.05625446864  
0.01471254944  
-0.0008127871252  
0.007757242775  
0.03509695405  
0.07337086973  
0.1133831253  
0.1457890419  
0.1622021465  
0.1560697601  
0.1232380066  
0.06218887045  
-0.02600961357  
-0.1379818651  
-0.2684745777  
-0.4108535201  
-0.5576321575  
-0.7009817919  
-0.8332276636  
-0.9473103369  
-1.037228284  
-1.098430272  
-1.128150611  
-1.125629728  
-1.09218454  
-1.031091451  
-0.9472502297  
-0.8466489213  
-0.7356606321  
-0.6202619801  
-0.5052672051  
-0.3936990826  
-0.2864066763  
-0.1819953499  
-0.07712841943  
0.03283859782  
0.1529591373  
0.2876529214  
0.4396681378  
0.6092154221  
0.7934142254  
0.9861425466  
1.178349252  
1.358798536  
1.515165138  
1.635346312  
1.708832798  
1.727954531  
1.688862804  
1.592127332  
1.442880078  
1.250503272  
1.027898493  
0.7904210999  
0.5545767431  
0.3366219256  
0.1511694676  
0.009933646509  
-0.07928441494  
-0.1132843489  
-0.0937587437  
-0.02714577143  
0.07595258025  
0.2017578909  
0.3346234614  
0.4585448522  
0.5587201671  
0.62298794  
0.6429867123  
0.6148861128  
0.5396213289  
0.4225906785  
0.2728723133  
0.1020733445  
-0.07703835286  
-0.2519281751  
-0.4115454967  
-0.5472805312  
-0.6535459901  
-0.7279440342  
-0.7710653883  
-0.7859865979  
-0.7775921348  
-0.7518255486  
-0.7149778655  
-0.6730968729  
-0.6315456339  
-0.594726284  
-0.5659391185  
-0.5473490932  
-0.5400102983  
-0.5439097652  
-0.5580261996  
-0.5803854927  
-0.6081403193  
-0.6376842993  
-0.6648352462  
-0.6850876141  
-0.6939460027  
-0.6873077171  
-0.6618660092  
-0.6154843401  
-0.5474889499  
-0.4588408106  
-0.3521533337  
-0.2315408814  
-0.1023234286  
0.02940058508  
0.1572511813  
0.2750821308  
0.3774602649  
0.4600597286  
0.5199369647  
0.5556689789  
0.5673661151  
0.5565678667  
0.5260612881  
0.4796543512  
0.4219311515  
0.3580114178  
0.2933159024  
0.2333304462  
0.1833425777  
0.1481361285  
0.131622193  
0.1364239889  
0.1634283156  
0.2113801839  
0.2765862899  
0.3528205452  
0.431505488  
0.5022303206  
0.5535966002  
0.5743522629  
0.5546977426  
0.4876110623  
0.3700071585  
0.203548455  
-0.005040097209  
-0.2442465074  
-0.4986337326  
-0.7502232845  
-0.9802350824  
-1.170971364  
-1.307615827  
-1.37971134  
-1.382146829  
-1.315541939  
-1.186002868  
-1.004312192  
-0.7846774244  
-0.5432258572  
-0.2964218943  
-0.05961592517  
0.1541464788  
0.3349429363  
0.4763898784  
0.5756692185  
0.6332376316  
0.6523072289  
0.6382089475  
0.597728449  
0.5384976774  
0.4684713114  
0.3955145389  
0.3270730738  
0.2699040895  
0.229829112  
0.2114834205  
0.2180564074  
0.2510292181  
0.3099462518  
0.3922682105  
0.4933491969  
0.606591468  
0.7237981509  
0.8357190876  
0.9327672554  
1.005835063  
1.047130795  
1.0509395  
1.014203052  
0.9368612388  
0.8218843364  
0.6749994769  
0.5041376906  
0.318668771  
0.1285158654  
-0.05673178178  
-0.2286160652  
-0.3804146234  
-0.5075085336  
-0.6074798006  
-0.6799693297  
-0.7263385209  
-0.7492148258  
-0.7520031612  
-0.7384324689  
-0.7122053783  
-0.6767689105  
-0.6352075301  
-0.5902346533  
-0.544241596  
-0.4993520377  
-0.4574540533  
