360.2998653  
362.0251021  
376.3076477  
385.6000013  
93.68648941  
1991.790375  
5001.786532  
17752.39665  
11405.78602  
31654.05759  
14210.19906  
6022.359498  
23450.04001  
18291.18912  
12848.83877  
10265.45332  
1551.028277  
2023.996373  
3477.583745  
45850.81407  
3735.32478  
6956.694672  
5602.328307  
28.26343932  
1965.082673  
27139.75556  
2533.866202  
19647.10658  
15087.04855  
10438.626  
7081.169765  
4463.10864  
2194.677576  
12260.71221  
6607.626449  
37347.74647  
1706.457431  
8113.891884  
3410.587842  
10671.10157  
1991.180896  
8053.47013  
1413.248939  
5084.486329  
12897.57473  
753.4204688  
1568.860256  
8695.308338  
10470.53002  
6822.573674  
1372.355256  
4179.58859  
14796.50748  
292.7073095  
2720.31954  
2484.127684  
471.1991486  
1232.616731  
4982.781369  
0.9195622862  
492.5245081  
15.76320173  
15.15018305  
728.338859  
452.344687  
520.5357839  
28.17551874  
5.729080563  
288.5395828  
54.04524086  
20.96804208  
11.31754222  
5.208614387  
12.49867657  
8.413221811  
4.91543128  
5.812453164  
20.63800217  
22.39354318  
10.24359622  
5.512338436  
7.042739071  
7.93215922  
5.239662877  
5.880849686  
4.276984824  
3.724619381  
4.800279121  
4.296802185  
3.797645995  
3.717496483  
3.54535076  
3.457873645  
3.224048722  
3.175199032  
2.911745697  
2.785649528  
2.690743974  
2.584205175  
2.523031274  
2.412611526  
2.338746708  
2.243519277  
2.153937483  
2.084498471  
2.016395188  
1.942441347  
1.874986513  
1.816848693  
1.757074198  
1.692787866  
1.642642931  
1.59294441  
1.54127297  
1.496257979  
1.450876415  
1.408369431  
1.366998908  
1.328150058  
1.29059231  
1.255430484  
1.220686834  
1.187461749  
1.15617464  
1.125507452  
1.096802926  
1.068486144  
1.041619846  
1.01574965  
0.9909252758  
0.9667829381  
0.9436179193  
0.92126089  
0.8997979637  
0.8790498341  
0.8590318014  
0.8396393034  
0.8209841379  
0.8029248753  
0.7855365563  
0.7686511256  
0.7523479384  
0.7365736294  
0.7213235405  
0.7065404878  
0.6922401329  
0.6783667726  
0.6649342248  
0.6519152506  
0.6393030227  
0.6270261315  
0.6151548704  
0.6036251343  
0.5924386262  
0.5815705279  
0.5710173023  
0.5607527244  
0.5507854571  
0.5410915024  
0.5316826232  
0.5225030055  
0.513601578  
0.504940467  
0.496479574  
0.4882559068  
0.4802735513  
0.4724857004  
0.4649138105  
0.4574999747  
0.4503001926  
0.4432754  
0.4364230727  
0.4297542208  
0.4232301158  
0.4168729671  
0.4106821571  
0.4046440804  
0.3987348811  
0.3929546648  
0.387345846  
0.3818376279  
0.3764684875  
0.371226108  
0.3661016241  
0.3610886178  
0.3561944029  
0.3513963032  
0.346729105  
0.3421529956  
0.337671282  
0.3332852682  
0.3289998164  
0.3248059027  
0.3207128446  
0.316687366  
0.3127618612  
0.3089047262  
0.3051348513  
0.3014404135  
0.2978296528  
0.2942795727  
0.2908121164  
0.2874066402  
0.2840806373  
0.2808045577  
0.277615804  
0.2744635491  
0.2713860744  
0.2683630187  
0.2653943601  
0.2625054588  
0.2596504334  
0.2568555389  
0.2541071764  
0.2514099571  
0.2487676777  
0.2461793763  
0.2436358575  
0.241134333  
0.2386799055  
0.2362734364  
0.2338929783  
0.2315631487  
0.2292887159  
0.2270381106  
0.2248387096  
0.2226726073  
0.2205449195  
0.2184564296  
0.2163977616  
0.2143744724  
0.212382368  
0.2104330892  
0.2085107503  
0.2066300847  
0.2047691527  
0.2029486466  
0.2011525028  
0.1993729239  
0.1976500128  
0.1959391449  
0.1942616855  
0.1925988397  
0.1909721279  
0.1893728812  
0.1877938989  
0.1862289842  
0.1847093443  
0.183207697  
0.1817233029  
0.1802691627  
0.1788418278  
0.1774212733  
0.1760305251  
0.1746665018  
0.1733170843  
0.1719794926  
0.1706732768  
0.1693861562  
0.1681130367  
0.1668641864  
0.1656210404  
0.1644158518  
0.1632107705  
0.1620358141  
0.1608717181  
0.1597251729  
0.1586022695  
0.1574815587  
0.1563929949  
0.1553047034  
0.15423414  
0.1531849078  
0.1521527536  
0.1511367377  
0.150124487  
0.1491278377  
0.1481495241  
0.1471854541  
0.1462354791  
0.1452875976  
0.1443705417  
0.1434525976  
0.1425589422  
0.1416602705  
0.1407765206  
0.1399168135  
0.1390657971  
0.1382142557  
0.1373972305  
0.1365756114  
0.1357649009  
0.134960566  
0.1341693951  
0.1333967543  
0.1326325159  
0.1318712852  
0.1311213539  
0.1303866239  
0.1296589251  
0.1289470331  
0.128230803  
0.1275331556  
0.1268362716  
0.1261516738  
0.1254848346  
0.1248194862  
0.1241567704  
0.123515538  
0.1228763364  
0.1222438569  
0.1216163394  
0.1210105944  
0.1203921124  
0.1197945435  
0.1191962646  
0.1186105472  
0.1180364919  
0.117462383  
0.116909227  
0.1163486153  
0.1157988103  
0.1152522401  
0.1147175718  
0.1141899466  
0.1136553977  
0.1131427814  
0.1126358874  
0.112132623  
0.1116277882  
0.1111376703  
0.1106588657  
0.1101732473  
0.1097029671  
0.1092354214  
0.1087679429  
0.1083168157  
0.1078660138  
0.1074131619  
0.1069743432  
0.1065433057  
0.1061098646  
0.1056873676  
0.1052607806  
0.1048458419  
0.1044436904  
0.10404083  
0.1036434238  
0.1032429395  
0.102847926  
0.1024699478  
0.1020959007  
0.1017126071  
0.1013407432  
0.1009810352  
0.1006143536  
0.1002610552  
0.09990992079  
0.09956385633  
0.09920833105  
0.09886760202  
0.09853710083  
0.09820271453  
0.09786868966  
0.09755463749  
0.09723429944  
0.09691077626  
0.09659740525  
0.09629242609  
0.09598907392  
0.09568709662  
0.09538826316  
0.09509516165  
0.09480632231  
0.09452272114  
0.09423634128  
0.09396553089  
0.09367766917  
0.09341178872  
0.09315124607  
0.09288037641  
0.09261351724  
0.09235667119  
0.0921106458  
0.09185919275  
0.09160425876  
0.09136074715  
0.09112133769  
0.09087828473  
0.09064420108  
0.09041348833  
0.09017746235  
0.0899553398  
0.08973186614  
0.0895091621  
0.08929473811  
0.0890782899  
0.08886367214  
0.08865981296  
0.08844823253  
0.08824724121  
0.08804726059  
0.08785107815  
0.08765734235  
0.08746241688  
0.08727423434  
0.08708369478  
0.08690019016  
0.0867249592  
0.08654666892  
0.0863664771  
0.08619785666  
0.08602132893  
0.08585634021  
0.08568769592  
0.08553211086  
0.08536363704  
0.08520863034  
0.08504877193  
0.08490059114  
0.08474489926  
0.0845969787  
0.08445113905  
0.08430902754  
0.08416905762  
0.08402899304  
0.08389259999  
0.08375326276  
0.08362656376  
0.08349869857  
0.08336899053  
0.08324449157  
0.08311768412  
0.08299994987  
0.08288332762  
0.0827717111  
0.08265176499  
0.08253936228  
0.08243351878  
0.08232345971  
0.08221982853  
0.08211753414  
0.08201372038  
0.0819162904  
0.08181857731  
0.08172544203  
0.0816371911  
0.0815433787  
0.08145056613  
0.08137089455  
0.0812800089  
0.08119954513  
0.08112343546  
0.08104367332  
0.08095842247  
0.08089445976  
0.08082463609  
0.0807539802  
0.08068836621  
0.08061962811  
0.08055307107  
0.08048838128  
0.08043112118  
0.08037041845  
0.08031749967  
0.08026354472  
0.08021206995  
0.08016131323  
0.08010986167  
0.08006476087  
0.08001955433  
0.07997806183  
0.07994220429  
0.07990032829  
0.07985802123  
0.07982632932  
0.07979422762  
0.07976388956  
0.07973497318  
0.07970570899  
0.07967937645  
0.07965713745  
0.07963792358  
0.07961275483  
0.07959864538  
0.07957681049  
0.07956883769  
0.07955634328  
0.07954579326  
0.07953825997  
0.07953074026  
0.07953061665  
0.07952515759  
0.07951983994  
