48.0145576  
71.07275405  
120.2389395  
216.8934392  
732.0324531  
4084.024009  
4617.21481  
35969.68668  
13250.11811  
40920.49332  
2816.381903  
38592.62898  
1004.424961  
20153.52693  
40117.84238  
14241.34628  
18718.9646  
16998.75938  
2232.362584  
18149.28873  
22577.42681  
50487.46803  
7354.43639  
8888.819769  
2473.676247  
12821.12168  
2431.735579  
4399.769951  
10176.91443  
854.5754675  
10032.59709  
3161.641615  
6048.999639  
8649.98547  
527.764324  
2348.318425  
4648.176382  
2879.097469  
3492.723376  
4819.534674  
4011.145454  
4317.344964  
5639.069184  
1041.648126  
390.7235833  
1158.500304  
5345.983183  
3415.249457  
1574.99571  
2254.210921  
863.8723661  
1573.64678  
231.4171527  
25.05143088  
5871.666233  
1326.993713  
2637.153546  
692.5883574  
960.2277923  
90.264452  
317.7037111  
725.7984977  
279.1444752  
206.2158097  
51.01729575  
279.8513123  
3.692350626  
2.199036179  
11.71925287  
28.81462117  
17.93510389  
17.16187395  
12.89411629  
10.30993825  
0.9495497577  
0.4818521107  
0.2566184448  
0.1581931127  
0.6720364835  
0.3183165849  
0.09705462138  
0.3186232851  
0.4035523114  
0.3500824822  
0.320971763  
0.3659123027  
0.5596793996  
0.3058951582  
0.3177479482  
0.3992724847  
0.4874163773  
0.4061560867  
0.4136879523  
0.432501125  
0.4520831134  
0.4679279133  
0.4324338552  
0.4038448868  
0.4258331938  
0.4401298607  
0.4364386513  
0.4227448117  
0.4280974865  
0.4245278107  
0.4157623108  
0.4123740884  
0.4144004908  
0.4090945814  
0.405617538  
0.4006045025  
0.3957684798  
0.3939100096  
0.3889915098  
0.3844381629  
0.3814724559  
0.3765308873  
0.372775432  
0.3689804654  
0.3643457987  
0.3606191369  
0.3565977302  
0.3523898446  
0.3482452647  
0.3444388838  
0.3403875225  
0.3366604488  
0.3326225457  
0.3288073215  
0.3250675968  
0.3213652688  
0.3175322624  
0.3138026468  
0.3102158756  
0.3066223754  
0.3031199519  
0.2996113759  
0.2961539968  
0.292780035  
0.289436666  
0.2861145605  
0.282876414  
0.2796875679  
0.2765272087  
0.2734266199  
0.2703568323  
0.2673551519  
0.2643829978  
0.2614579832  
0.2585897642  
0.2557588305  
0.2529795154  
0.2502287309  
0.2475207621  
0.2448687393  
0.2422471779  
0.2396647092  
0.2371403138  
0.2346380065  
0.2321781552  
0.2297659883  
0.2273754445  
0.2250238069  
0.2227348845  
0.2204557141  
0.2182227051  
0.2160195555  
0.2138530997  
0.2117203469  
0.2096201449  
0.2075590956  
0.2055204159  
0.2035184629  
0.2015520769  
0.1995964166  
0.1976865659  
0.1958065956  
0.1939491598  
0.1921229942  
0.1903214538  
0.1885454936  
0.1868076037  
0.1850825776  
0.1833973525  
0.1817271178  
0.1800799554  
0.1784692132  
0.1768679435  
0.175304404  
0.1737526855  
0.1722255188  
0.1707335911  
0.1692458809  
0.1677872429  
0.1663448866  
0.1649307577  
0.1635351518  
0.1621517623  
0.1608045561  
0.1594650484  
0.1581473622  
0.1568425138  
0.155563269  
0.1542995869  
0.1530568825  
0.1518309953  
0.1506228938  
0.1494204993  
0.1482416931  
0.1470857447  
0.145936917  
0.1448126467  
0.143701034  
0.1425988871  
0.1415159255  
0.1404482232  
0.1393932705  
0.13835459  
0.1373260899  
0.1363184876  
0.1353175307  
0.1343314906  
0.1333571292  
0.1323973075  
0.1314517589  
0.1305147676  
0.1295936962  
0.1286764915  
0.1277816461  
0.1268928048  
0.1260163485  
0.1251578079  
0.1243062576  
0.123463818  
0.1226277589  
0.1218027037  
0.1210021468  
0.1202001201  
0.1194118593  
0.1186326801  
0.1178594054  
0.1170936423  
0.1163472934  
0.1156028405  
0.1148686577  
0.114145668  
0.1134350957  
0.1127258249  
0.1120307747  
0.1113437903  
0.1106617467  
0.1099921237  
0.1093237642  
0.1086690335  
0.1080184124  
0.1073795202  
0.1067525565  
0.1061257064  
0.1055124072  
0.1048967306  
0.1042920085  
0.1037005211  
0.1031146225  
0.1025299413  
0.1019558361  
0.1013863001  
0.1008249258  
0.1002725892  
0.09972378856  
0.09918263237  
0.09864945656  
0.09811523297  
0.09759758766  
0.09707850906  
0.0965689186  
0.09606981328  
0.0955622624  
0.09506940284  
0.09458424441  
0.09409821703  
0.09361846901  
0.09314929108  
0.09268666063  
0.09222468716  
0.09176571551  
0.09131663449  
0.09086933337  
0.09043258293  
0.0900016727  
0.08956758559  
0.08914059158  
0.08871406887  
0.08830188223  
0.08788991471  
0.08748204137  
0.08707859486  
0.086682514  
0.08628951547  
0.08589508972  
0.08551342642  
0.08513220143  
0.08476130234  
0.08438332942  
0.08401742876  
0.0836499318  
0.0832923102  
0.08293571879  
0.08258612199  
0.08223410435  
0.08189011371  
0.08155060443  
0.08121144495  
0.08088028821  
0.0805452364  
0.08022124371  
0.079902135  
0.07958072404  
0.07926507096  
0.0789499691  
0.07864432573  
0.07833755523  
0.07803006776  
0.07773539736  
0.07744277571  
0.07715462164  
0.07685848491  
0.07657108621  
0.07628531247  
0.07601033315  
0.07573331432  
0.07545797185  
0.07518891734  
0.07492126098  
0.07465738401  
0.07439136929  
0.07413566085  
0.07387642874  
0.07362361519  
0.07336891735  
0.0731207764  
0.07287774169  
0.07263135255  
0.07239254898  
0.072157108  
0.07192253488  
0.0716850189  
0.07145576178  
0.07122928543  
0.07100115773  
0.07078011694  
0.07056334484  
0.070344896  
0.07013465248  
0.06991709797  
0.06970258638  
0.06949364928  
0.06929320966  
0.06908856369  
0.06888623391  
0.06868681977  
0.06849256939  
0.06829614619  
0.06810692615  
0.06791179807  
0.06772441535  
0.06754200456  
0.06735618372  
0.06717720097  
0.06699423454  
0.06681450198  
0.06664070302  
0.06646792101  
0.06629644638  
0.06612643205  
0.06596172838  
0.06579488891  
0.06562778087  
0.06546863549  
0.06530621649  
0.06514847899  
0.06499032161  
0.06483791852  
0.06468443861  
0.06453802471  
0.06438709069  
0.06423974536  
0.0640919901  
0.06395189667  
0.06380876168  
0.06366946444  
0.06353400333  
0.06339566172  
0.06325475936  
0.06312568864  
0.06299580757  
0.06286373088  
0.0627339651  
0.06261019838  
0.06248193484  
0.06236352164  
0.06223932403  
0.06211990434  
0.06199953615  
0.06188112592  
0.06176731398  
0.06165280826  
0.06153994171  
0.06142858709  
0.06132186817  
0.06121258885  
0.06110939774  
0.06100451789  
0.06090113069  
0.0607946291  
0.06070110232  
0.06059774977  
0.06049885084  
0.06040381721  
0.06031644864  
0.06021863831  
0.06013204963  
0.06003611806  
0.05994557308  
0.0598635418  
0.05977647928  
0.05969077789  
0.05960747648  
0.05952729099  
0.05944553417  
0.05936258488  
0.05929149066  
0.0592125523  
0.05913395132  
0.05906307191  
0.05898919958  
0.05891876867  
0.05884597474  
0.05877757834  
0.05871167739  
0.05864664845  
0.05857967059  
0.05852075282  
0.05846035354  
0.05839328461  
0.05833222646  
0.05827761746  
0.05822048081  
0.05816463618  
0.0581088367  
0.05805522881  
0.05800951605  
0.05795442973  
0.05790407726  
0.05785704131  
0.05780788417  
0.05776413067  
0.05771523506  
0.0576733598  
0.05762793725  
0.0575868528  
0.05754926646  
0.05750966127  
0.05747466296  
0.05743857128  
0.05740109001  
0.05736515792  
0.05733424403  
0.05730055598  
0.05727347856  
0.05723882281  
0.05721439386  
0.05718559493  
0.05716506566  
0.05713742799  
0.05711335759  
0.05708717889  
0.05707108507  
0.05705045311  
0.05703240922  
0.05701486586  
0.05699584142  
0.0569791621  
0.05696622741  
0.05695216137  
0.0569415705  
0.05693049851  
0.05692402615  
0.05691518758  
0.05690457674  
0.05689711168  
0.05689381777  
0.05689033622  
0.05688568028  
0.056886288  
0.05688543492  
