-0.2937736927  
0.2318165537  
0.7269469037  
1.16447719  
1.52204023  
1.783777348  
1.941439728  
1.994749907  
1.950985826  
1.823843097  
1.631712402  
1.395564991  
1.136709378  
0.8746685486  
0.6254541559  
0.400406216  
0.2057659337  
0.04294517018  
-0.09054538696  
-0.1997142484  
-0.2904853379  
-0.368150419  
-0.4361277553  
-0.4952235596  
-0.5435024892  
-0.5767694057  
-0.5895514921  
-0.5764014802  
-0.5332736681  
-0.458735018  
-0.354780418  
-0.2271135342  
-0.08482099566  
0.06051304841  
0.1961424164  
0.3097330915  
0.3909572462  
0.4328756198  
0.4328857707  
0.3931190898  
0.320208763  
0.224456485  
0.1185060799  
0.01570922753  
-0.07160578312  
-0.1337173427  
-0.1647170168  
-0.1631831117  
-0.1322117421  
-0.07878930031  
-0.012604301  
0.05552749492  
0.1154001888  
0.1590306349  
0.1818872555  
0.1835346579  
0.167551461  
0.1407384525  
0.1117141089  
0.08914467388  
0.07990668726  
0.08752982689  
0.1112194732  
0.1456795872  
0.1818325027  
0.2083533964  
0.2137972094  
0.1889868701  
0.1292317235  
0.03597860413  
-0.08243428647  
-0.2111429428  
-0.3302424639  
-0.4172551617  
-0.4502483633  
-0.4111633431  
-0.2888619907  
-0.0814194697  
0.20271666  
0.5449126115  
0.9179310234  
1.288735727  
1.622182392  
1.885135206  
2.050464147  
2.100396236  
2.028773214  
1.841902115  
1.557866781  
1.204387448  
0.815474156  
0.4273325354  
0.07402303114  
-0.2165337114  
-0.4256894969  
-0.5459373122  
-0.5812474551  
-0.5458688949  
-0.4617304008  
-0.3548658882  
-0.2513182025  
-0.173166702  
-0.1352198674  
-0.1428781906  
-0.1914834849  
-0.2672565031  
-0.3496866644  
-0.4150108637  
-0.4402689337  
-0.4072962193  
-0.3060556099  
-0.1367755062  
0.08942231324  
0.3515290997  
0.6211242063  
0.8659724111  
1.054198535  
1.158432335  
1.159349153  
1.048103131  
0.8273557233  
0.5108097802  
0.1213580602  
-0.3118276628  
-0.7568353457  
-1.18266744  
-1.562530295  
-1.876348021  
-2.112232532  
-2.266796117  
-2.344359986  
-2.355254782  
-2.313521135  
-2.234368374  
-2.131777764  
-2.016570616  
-1.895209645  
-1.769448208  
-1.636866507  
-1.492141446  
-1.328864882  
-1.141544936  
-0.9275020515  
-0.6882904844  
-0.4303976314  
-0.1650614825  
0.09280652587  
0.3264585557  
0.5196438987  
0.6590678903  
0.7365892419  
0.7507562731  
0.7074341602  
0.6193495006  
0.5046096484  
0.3843814315  
0.280068068  
0.210411928  
0.1889460883  
0.2221824037  
0.3087951744  
0.4399060477  
0.6004023007  
0.7710835154  
0.9312898058  
1.061632223  
1.146430718  
1.175539134  
1.145342259  
1.05883277  
0.9248308722  
0.7565244408  
0.5695854683  
0.3801559153  
0.2030045819  
0.05007049672  
-0.0704531977  
-0.1544350384  
-0.2015919057  
-0.2148547057  
-0.1994722014  
-0.1620445507  
-0.1096304138  
-0.04902034544  
0.01375748233  
0.07372985546  
0.1271065849  
0.1713184761  
0.2050217149  
0.2281178608  
0.2417783349  
0.2484474012  
0.2517674602  
0.2563613713  
0.2674318677  
0.2901635681  
0.3289751631  
0.3866946413  
0.4637914543  
0.557798822  
0.6630569083  
0.7708741056  
0.8701379172  
0.9483510262  
0.9929917664  
0.9930402047  
0.9404660826  
0.8315173504  
0.6675589944  
0.4554122719  
0.2070509578  
-0.06128219724  
-0.3304867138  
-0.5803965354  
-0.7917564415  
-0.9481754656  
-1.037835044  
-1.05477124  
-0.9995791575  
-0.879441824  
-0.7074826303  
-0.5014866788  
-0.2821117233  
-0.07078504217  
0.1125008824  
0.2512528249  
0.334167387  
0.3562671236  
0.3193362914  
0.2316119743  
0.1067547918  
-0.03777674471  
-0.1827853825  
-0.3095630275  
-0.4020652375  
-0.4487572588  
-0.4439408351  
-0.3884016834  
-0.2893147423  
-0.159414847  
-0.01552769379  
0.1233665399  
0.2383294134  
0.3126669502  
0.333890943  
0.2952152604  
0.1964243578  
0.04398766238  
-0.1495742911  
-0.3670253952  
-0.5882930034  
-0.7926747708  
-0.9611217109  
-1.07832956  
-1.134370239  
-1.125689517  
-1.055332253  
-0.9323696335  
-0.770613513  
-0.5867694724  
-0.3982831112  
-0.2211572413  
-0.06804068739  
0.05316667951  
0.1399824962  
0.1952167675  
0.22605163  
0.2424918407  
0.2554074886  
0.2744879835  
0.3064276548  
0.353645126  
0.4137604114  
0.479922929  
0.5419554195  
0.5881339489  
0.6073206916  
0.5910822124  
0.5354401392  
0.4419422669  
0.3178527462  
0.175410851  
0.03026111371  
-0.1007103539  
-0.201792817  
-0.2607466935  
-0.2706143585  
-0.2307785092  
-0.1471147102  
-0.03122727001  
0.1010955415  
0.2319617528  
0.3436886099  
0.4210047046  
0.4528544567  
0.4335944475  
0.3634571745  
0.2482915694  
0.09866364908  
-0.07149267127  
-0.2464791028  
-0.4104724896  
-0.5489995542  
-0.6501376321  
-0.7053480516  
-0.7099487861  
-0.6632413417  
-0.5683796078  
-0.4320289575  
-0.2638711181  
-0.07599026337  
0.1178570225  
0.3030989186  
0.4653313834  
0.5914203238  
0.6706593314  
0.6959013413  
0.6645211153  
0.579070709  
0.447474851  
0.2826717765  
0.10164378  
-0.07610075825  
-0.2304822777  
-0.3430154481  
-0.3989448705  
-0.389055507  
-0.3109264166  
-0.1694272519  
0.02362112082  
0.250624278  
0.4900848604  
0.7189598725  
0.9152184344  
1.060279093  
1.141036231  
1.151218939  
1.091909633  
0.9711725155  
0.8028320505  
0.6045642764  
0.3955647329  
0.1940828721  
0.01517520822  
-0.1310342813  
-0.2403461644  
-0.3145994544  
-0.360906447  
-0.3901362787  
-0.414882164  
-0.4472387886  
-0.4967469576  
-0.5688006242  
-0.6638016449  
-0.7771574624  
-0.9001145168  
-1.021276335  
-1.128526768  
-1.211033077  
-1.260965178  
-1.274661626  
-1.253012161  
-1.201037018  
-1.126715421  
-1.039309487  
-0.9474794193  
-0.8575485385  
-0.7722559864  
-0.6902221924  
-0.6062756777  
-0.5125767643  
-0.4003768126  
-0.2620979082  
-0.09334566295  
0.1055035231  
0.3284812054  
0.564151381  
0.7967127947  
1.007938311  
1.179655397  
1.296376786  
1.347618101  
1.329539451  
1.245597845  
1.106102671  
0.9267212226  
0.7261960936  
0.52362727  
0.3358023586  
0.1749905598  
0.0475857448  
-0.04619168692  
-0.1115065606  
-0.1571891937  
-0.1934145587  
-0.2292025467  
-0.2702081009  
-0.3172111997  
-0.3655975392  
-0.4059482349  
-0.4256701813  
-0.4113939492  
-0.351760289  
-0.2401069263  
-0.07657804334  
0.1307173512  
0.3657739286  
0.6060308279  
0.8248684363  
0.9949336067  
1.09185467  
1.097821427  
1.004511564  
0.8149318643  
0.5438699461  
0.2168341011  
-0.1324288543  
-0.4655812781  
-0.7440679167  
-0.9337144539  
-1.008952316  
-0.9561666507  
-0.7757195654  
-0.4823631634  
-0.1039636253  
0.321356794  
0.749347491  
1.134539671  
1.435368058  
1.6188684  
1.664378074  
1.565778655  
1.332007378  
0.9857665396  
0.5606292851  
0.09690452989  
-0.3631837215  
-0.7803746685  
-1.122700164  
-1.368719364  
-1.509283827  
-1.547673511  
-1.498155777  
-1.383223523  
-1.229941759  
-1.065943797  
-0.915601638  
-0.796904422  
-0.7194173157  
-0.6835431757  
-0.68114605  
-0.6973657153  
-0.7133486402  
-0.709445465  
-0.6684315167  
-0.5782869516  
-0.434145033  
-0.2391670206  
-0.004233160346  
0.2534862677  
0.5128532869  
0.7516521415  
0.9496441906  
1.091349412  
1.168193321  
1.179719185  
1.133688791  
1.045069024  
0.9340041616  
0.823043917  
0.7339763537  
0.6846703733  
0.6863489958  
0.7416628354  
0.8438539702  
0.9771456441  
1.118360628  
1.239607718  
1.311717684  
1.308010232  
1.207925685  
1.000021556  
0.6839595089  
0.2711833444  
-0.2158201559  
-0.7455941269  
-1.280874165  
-1.782429931  
-2.213124143  
-2.541664452  
-2.745619575  
-2.813353479  
-2.744716005  
-2.550463866  
-2.250586258  
-1.871808539  
-1.444628173  
-1.000266936  
-0.5678895449  
-0.1723466055  
0.1673620454  
0.4388540661  
0.6363767367  
0.7601848421  
0.8154348744  
0.8108043071  
0.7570078099  
0.665413372  
0.546892952  
0.4110074398  
0.2655940818  
0.1167490509  
-0.03084593429  
-0.1733476916  
-0.3070661396  
-0.4278052363  
-0.5304107369  
-0.6086076783  
-0.6552343711  
-0.662856954  
-0.6247301929  
-0.5359404642  
-0.3945870164  
-0.2027830605  
0.03271690311  
0.3004032636  
0.5844980866  
0.8660349355  
1.124436409  
1.339415103  
1.492966203  
1.571222742  
1.565909942  
1.475250653  
1.304188636  
1.06393067  
0.7708611054  
0.4449926082  
0.1081368459  
-0.2179814033  
-0.5134503033  
-0.7615811124  
-0.9498740231  
-1.070506511  
-1.120353212  
-1.100615875  
-1.016169781  
-0.8747491858  
-0.6860881536  
-0.4611154074  
-0.2112591833  
0.05210754064  
0.3180756813  
0.5765040413  
0.818251027  
1.035369447  
1.221307819  
1.371124847  
1.481707183  
1.551970461  
1.582988856  
1.578003392  
1.542259125  
1.482639211  
1.407076573  
1.323789178  
1.240384723  
1.16294999  
1.095236007  
1.038062409  
0.9890642078  
0.9428432426  
0.8915585515  
0.825914771  
0.7364423639  
0.6149376622  
0.4558561356  
0.2574800845  
0.02269006744  
-0.2408018141  
-0.5208150553  
-0.8016422775  
-1.065503335  
-1.29434097  
-1.471776121  
-1.584986872  
-1.626297601  
-1.594281728  
-1.49422946  
-1.337902231  
-1.142568706  
-0.9293928006  
-0.7213222422  
-0.5406989118  
-0.4068339973  
-0.3338461643  
-0.3290227759  
-0.3919375143  
-0.5144617137  
-0.6817271658  
-0.8739518298  
-1.068922442  
-1.24483367  
-1.383090362  
-1.470695114  
-1.501844183  
-1.478496458  
-1.409786177  
-1.310355969  
-1.197835984  
-1.089842642  
-1.000960041  
-0.9401832308  
-0.9092440742  
-0.9021022027  
-0.9057296357  
-0.902082998  
-0.8709930397  
-0.7935323742  
-0.6553507661  
-0.4494526073  
-0.1779690904  
0.1473575163  
0.5060943749  
0.871314807  
1.212766769  
1.500558798  
1.708831689  
1.818892088  
1.821380725  
1.717193141  
1.517077487  
1.240029324  
0.9107770785  
0.5567670549  
0.2051110213  
-0.1200692757  
-0.3995933868  
-0.6202732676  
-0.7750588732  
-0.8624228558  
-0.8852215108  
-0.8493535873  
-0.7625001146  
-0.6331684648  
-0.4701719752  
-0.2825231748  
-0.0796417474  
0.1283316849  
0.3303124042  
0.5143551679  
0.6681395393  
0.7798909512  
0.8396350007  
0.8405975733  
0.7805094954  
0.6625437099  
0.495686043  
0.2943708658  
0.07739478492  
-0.1338381904  
-0.3175140638  
-0.4537893979  
-0.5270448446  
-0.5277255577  
-0.4535286258  
-0.3097979835  
-0.1090731014  
0.1301414531  
0.3852498383  
0.6318666468  
0.8463039733  
1.0079942  
1.101603464  
1.118643436  
1.058419007  
0.9282273959  
0.7427559748  
0.5227242655  
0.2928559222  
0.07935419452  
-0.09289532703  
-0.2031194236  
-0.2371213699  
-0.1891301702  
-0.0627424445  
0.1292181042  
0.3659803003  
0.6211755128  
0.8659963035  
1.072791822  
1.218631293  
1.288325029  
1.276459802  
1.188129773  
1.038209855  
0.8492616862  
0.6483525076  
0.463248901  
0.3185379798  
0.232254749  
0.213492112  
0.2613313953  
0.3652099841  
0.5066409778  
0.661969238  
0.8057435288  
0.9141872572  
0.9682835214  
0.9560566836  
0.8738114791  
0.7262226619  
0.5253609328  
0.2888731929  
0.03762310593  
-0.2068449369  
-0.4247007457  
-0.5997978575  
-0.7210396247  
-0.7830659758  
-0.7862629681  
-0.7362059258  
-0.6426780428  
-0.5184316966  
-0.377870147  
-0.2357843803  
-0.1062471119  
-0.0017244008  
0.06758407694  
0.09420485549  
0.07366875245  
0.004671277045  
-0.1108890797  
-0.2679589292  
-0.45852362  
-0.6719533079  
-0.8955697216  
-1.11545475  
-1.317500027  
-1.488644539  
-1.618205227  
-1.699132257  
-1.729035504  
-1.710770883  
-1.652459391  
-1.566847156  
-1.46999659  
-1.379427411  
-1.311875323  
-1.280968428  
-1.295105577  
-1.355870945  
-1.457232495  
-1.585722892  
-1.721642728  
-1.841230854  
-1.91956524  
-1.933879061  
-1.866861434  
-1.709502722  
-1.463052451  
-1.139764636  
-0.7622285592  
-0.3612702527  
0.02738799543  
0.3673267674  
0.6259996365  
0.7790256775  
0.8136241288  
0.730680006  
0.5450655131  
0.2841457235  
-0.01542262995  
-0.3121595057  
-0.5649330398  
-0.7381104022  
-0.8059739483  
-0.7557958967  
-0.5891491824  
-0.3213041482  
0.02116267294  
0.4041589244  
0.7906938096  
1.145618138  
1.439830629  
1.65335659  
1.776952994  
1.812081808  
1.769389082  
1.666026241  
1.52230914  
1.358289364  
1.190782842  
1.031289586  
0.8850974679  
0.7516142474  
0.6258133612  
0.5004668978  
0.368745426  
0.2266919809  
0.07512201244  
-0.07941362353  
-0.2247988032  
-0.3446791117  
-0.4207625877  
-0.4357565386  
-0.3764870575  
-0.2366762482  
-0.01893059507  
0.2644596646  
0.5920855465  
0.9353719026  
1.261692871  
1.53825756  
1.736246865  
1.834616941  
1.823021824  
1.703427415  
1.490154971  
1.20833406  
0.8909528491  
0.5749063783  
0.2965850546  
0.08759185209  
-0.02882710626  
-0.04018641306  
0.05428184706  
0.2441939514  
0.5099426426  
0.825663381  
1.162751008  
1.493417047  
1.793772168  
2.046034666  
2.239608719  
2.370967685  
2.44245959  
2.460314547  
2.432244414  
2.365074465  
2.262822403  
2.125544679  
1.949149174  
1.726206211  
1.447607664  
1.104833861  
0.6924198088  
0.2102591754  
-0.334677479  
-0.9274811078  
-1.545511227  
-2.159690592  
-2.736800682  
-3.242504039  
-3.644781698  
-3.917350999  
-4.042672527  
-4.014156861  
-3.837286813  
-3.529488947  
-3.118719202  
-2.640889037  
-2.136386907  
-1.646067594  
-1.207170297  
-0.8496230361  
-0.5931869871  
-0.4457954709  
-0.403294406  
-0.4506331714  
-0.5643515831  
-0.7160395361  
-0.8762976965  
-1.018650974  
-1.122874761  
-1.177258241  
-1.179496925  
-1.136107427  
-1.060498413  
-0.9700184093  
-0.8824989322  
-0.8128466195  
-0.77027342  
-0.7565907373  
-0.7658611212  
-0.7854282511  
-0.7981399837  
-0.7853766798  
-0.7303612924  
-0.6211935981  
-0.4531234432  
-0.2296813674  
0.0374831025  
0.3300178248  
0.6252862129  
0.8993953902  
1.130351887  
1.30086492  
1.400394635  
1.426177705  
1.383125556  
1.282687344  
1.140881762  
0.9758679774  
0.8054197896  
0.6446917535  
0.5045713582  
0.3908134629  
0.3040179588  
0.2403627475  
0.1929201742  
0.1532991972  
0.1133152746  
0.06645016062  
0.008888087069  
-0.05999022663  
-0.1376527015  
-0.2189516918  
-0.2970004056  
-0.3642032764  
-0.4132861317  
-0.4381404675  
-0.4344047856  
-0.399718926  
-0.3336773217  
-0.237557757  
-0.1139071741  
0.03388657335  
0.2019461923  
0.3861109079  
0.5819758329  
0.7847730232  
0.9891771573  
1.189103553  
1.377618857  
1.547035577  
1.689259483  
1.796391516  
1.861536417  
1.879729602  
1.848827005  
1.770202362  
1.649089464  
1.494452255  
1.318313493  
1.134557774  
0.9573239346  
0.7991679973  
0.6692428115  
0.5717839799  
0.5051649834  
0.4617175749  
0.4284554552  
0.3886680536  
0.3242494662  
0.2184857676  
0.05892992478  
-0.160048167  
-0.4354562777  
-0.7549438186  
-1.097354753  
-1.434615869  
-1.734816308  
-1.966151344  
-2.10126879  
-2.121429279  
-2.019891763  
-1.803968687  
-1.495337884  
-1.128408216  
-0.7467745452  
-0.3981079346  
-0.1280528114  
0.02607722574  
0.04091060235  
-0.08892082801  
-0.34898429  
-0.7059342761  
-1.111118848  
-1.506539876  
-1.832392863  
-2.035132251  
-2.074881541  
-1.931031382  
-1.605163107  
-1.120806535  
-0.520062524  
0.1423782158  
