159.4139472  
168.7043238  
184.5617854  
186.6315986  
108.2647235  
5819.031328  
28759.04645  
3127.953283  
94853.93665  
40148.56846  
43152.18965  
48132.20108  
24350.64293  
12240.6778  
26871.08126  
16267.85231  
1869.500054  
4192.521467  
18905.8523  
9807.945128  
8208.760609  
5106.489671  
4225.161373  
3965.515329  
2157.593754  
4072.261112  
1506.529957  
4604.703273  
5214.318045  
1107.638867  
8937.323628  
7186.378048  
1756.255375  
8314.215931  
4104.094929  
1984.607657  
1700.829414  
1626.329171  
210.6067052  
1059.895605  
1545.818991  
1780.174181  
338.2295875  
239.5679604  
691.6190606  
2516.020322  
655.418721  
580.5276472  
162.8249597  
564.6355055  
3301.538043  
211.6632823  
2344.131873  
1245.04896  
872.9304919  
502.7508574  
5904.799431  
731.8130428  
2542.366526  
293.3056171  
1029.298877  
729.1791455  
1487.246602  
205.309053  
59.43169473  
8.733891781  
203.6894715  
171.7522056  
62.96493427  
1.469611014  
8.386544933  
31.00208843  
21.9555944  
31.67360616  
5.576208185  
1.433156254  
7.701600556  
13.52928527  
5.428095619  
1.791224531  
3.758897132  
5.722613617  
3.805031949  
4.553097969  
2.951872457  
2.867721785  
2.871450253  
3.261268285  
2.636475503  
2.235334744  
2.271799926  
2.304811228  
2.160559257  
1.986778161  
1.828903398  
1.739040552  
1.697542349  
1.65106712  
1.519276671  
1.439586045  
1.417729092  
1.350918902  
1.28015882  
1.226487841  
1.17178832  
1.12491403  
1.089920895  
1.044435205  
1.000661477  
0.9605910971  
0.9268347372  
0.8934881761  
0.8608802145  
0.8276328138  
0.800735244  
0.7729811441  
0.7471603197  
0.7208366615  
0.6963476024  
0.6742325023  
0.6527682748  
0.6319419871  
0.6120168646  
0.5928416822  
0.5747804772  
0.5577545489  
0.5411312101  
0.5251910781  
0.5098244069  
0.4954108923  
0.4814823162  
0.468087527  
0.4550755097  
0.4427655603  
0.4308688515  
0.4195121382  
0.4085281439  
0.3979314983  
0.3877189032  
0.377962735  
0.3685251358  
0.3594485527  
0.3506698233  
0.34220274  
0.3340449316  
0.3261663848  
0.3185866472  
0.311235242  
0.3041243663  
0.2972724757  
0.2906409167  
0.2842412433  
0.2780321016  
0.2720174905  
0.2662122608  
0.2605838875  
0.2551379672  
0.2498552318  
0.2447200577  
0.2397685109  
0.2349507399  
0.2302931871  
0.2257628513  
0.2213601793  
0.2170916803  
0.2129490279  
0.2089333736  
0.2050255336  
0.2012200427  
0.1975442563  
0.1939550003  
0.1904634247  
0.1870689851  
0.1837682396  
0.1805542017  
0.1774336696  
0.1743885417  
0.1714271893  
0.1685465742  
0.1657295059  
0.1629982089  
0.1603327566  
0.1577217314  
0.1551883025  
0.1527188281  
0.1503161685  
0.1479627886  
0.1456705271  
0.1434340251  
0.1412552874  
0.1391256805  
0.1370432579  
0.1350073299  
0.1330357494  
0.1310918975  
0.1292055935  
0.1273558038  
0.1255496551  
0.1237798877  
0.1220553374  
0.1203689896  
0.1187212033  
0.1171109484  
0.1155273717  
0.1139880227  
0.1124768314  
0.111002425  
0.1095586882  
0.1081444362  
0.1067605135  
0.1053991255  
0.1040728906  
0.1027773989  
0.1015067618  
0.1002606195  
0.09903349411  
0.09784465107  
0.09666664831  
0.09551662008  
0.09439572961  
0.09328543973  
0.09221193564  
0.09114894552  
0.09010804657  
0.08909113883  
0.08808679751  
0.08710225615  
0.08614377624  
0.08520382126  
0.08427026006  
0.08336427282  
0.0824687384  
0.08159508513  
0.08073401077  
0.0798895126  
0.07906296824  
0.07824930811  
0.07745221113  
0.07666132076  
0.07589445793  
0.07514225626  
0.07439448809  
0.07366236021  
0.07294727958  
0.07224092356  
0.07154764867  
0.07086906823  
0.07019468013  
0.06953698493  
0.06889186782  
0.06825789917  
0.06763104811  
0.06701767853  
0.06641155467  
0.0658167598  
0.06523146491  
0.06465946238  
0.06409054409  
0.06353763445  
0.0629822953  
0.06244996684  
0.06192175413  
0.06140254869  
0.06088647833  
0.06037950174  
0.05988074421  
0.05939033887  
0.05891165998  
0.05843891319  
0.05797062558  
0.05751216895  
0.05706349652  
0.05661597044  
0.05617342878  
0.05574210315  
0.05531766568  
0.05489910699  
0.05448521425  
0.05407858109  
0.05367923912  
0.0532823958  
0.05289715943  
0.0525145416  
0.05213754662  
0.05176300331  
0.05139735295  
0.05103580194  
0.05068118752  
0.05032970937  
0.04998422832  
0.04964495157  
0.04930454813  
0.04897492547  
0.04864810707  
0.04832864475  
0.04801309992  
0.04769935608  
0.04739513924  
0.0470906159  
0.04678560964  
0.04649436504  
0.04620440307  
0.04591758078  
0.04563358535  
0.04535297108  
0.04507976346  
0.04480392839  
0.04453822477  
0.04427392875  
0.04401543412  
0.04375816633  
0.04350178286  
0.04324974621  
0.04300516853  
0.04276170744  
0.0425196698  
0.04228151459  
0.04204875701  
0.04181406994  
0.04158618042  
0.04136420188  
0.04114239267  
0.04092180182  
0.04070555324  
0.04049115807  
0.04028358874  
0.04007325489  
0.03987214746  
0.03966632702  
0.03947057835  
0.03927211638  
0.03907746914  
0.03888734478  
0.03869792588  
0.03850996581  
0.03832629076  
0.03814421089  
0.03796336222  
0.03778460425  
0.03760994274  
0.03743579442  
0.03726453237  
0.0370996422  
0.03693292191  
0.03676995041  
0.03660778313  
0.03644554285  
0.03628726017  
0.03613308181  
0.03597740971  
0.03582393895  
0.03567898505  
0.03552751842  
0.03537950699  
0.03523790557  
0.03509492231  
0.03495311628  
0.03481845418  
0.03467518324  
0.03454550791  
0.03440938225  
0.03427556565  
0.0341446435  
0.03401604754  
0.03389124233  
0.03376502003  
0.03364192081  
0.03352233409  
0.03339920073  
0.03328073699  
0.03316288203  
0.03304574994  
0.03293309111  
0.03282078007  
0.03270676289  
0.03259536408  
0.03248817321  
0.03238225649  
0.03227568648  
0.03217399584  
0.03206984942  
0.03196814585  
0.03186969394  
0.03176953556  
0.03166912083  
0.03157266778  
0.0314803683  
0.03138648728  
0.03129486475  
0.03120183045  
0.03111349589  
0.03102447239  
0.03093436193  
0.03084987126  
0.0307631522  
0.0306782883  
0.03060319208  
0.03051922413  
0.0304373113  
0.03035740532  
0.03027909644  
0.03020229684  
0.03012441687  
0.0300472457  
0.02997379882  
0.0299030822  
0.02983211298  
0.02976229436  
0.02969310555  
0.02962230046  
0.02955726932  
0.02948868237  
0.02942530351  
0.02935815983  
0.02929567171  
0.02923377049  
0.02917058975  
0.02911207132  
0.02905226515  
0.02899519883  
0.02893530594  
0.02888079855  
0.02882280108  
0.0287665093  
0.02871399386  
0.02866415187  
0.02860886618  
0.02855773961  
0.02850617533  
0.02845948088  
0.02840740517  
0.02836267012  
0.02831565195  
0.02827074538  
0.02822464481  
0.0281797471  
0.02813303591  
0.02809516276  
0.02805379777  
0.02801349868  
0.02797125043  
0.02792929799  
0.02789331884  
0.02785659008  
0.02781963556  
0.02778343344  
0.02774798399  
0.027712688  
0.02768138  
0.02764872786  
0.02761371682  
0.02758136521  
0.02755143792  
0.02752543385  
0.02749578397  
0.0274663087  
0.0274375798  
0.02741690866  
0.02738709771  
0.02736123541  
0.02733838919  
0.02731319652  
0.02729301324  
0.02726865017  
0.02725193897  
0.02722764611  
0.02720903936  
0.0271879651  
0.02716904262  
0.02715142178  
0.02713616041  
0.02711765889  
0.02710522851  
0.02708999086  
0.02707418103  
0.02706345531  
0.02705104486  
0.02703828022  
0.02703011905  
0.0270167256  
0.02700651243  
0.02699785725  
0.02699060679  
0.02698481101  
0.02697254915  
0.02696881557  
0.02696447439  
0.02695859405  
0.02695558026  
0.02695300321  
0.02695137306  
0.0269471176  
0.0269476135  
0.02694514293  
