106.0850238  
116.3789599  
139.3277283  
180.8929184  
261.3490414  
3691.881396  
43488.99762  
11079.66091  
42404.87915  
26807.38346  
117876.2495  
14884.20655  
7548.840511  
14835.4079  
253.095331  
7504.708959  
14988.33294  
25054.61482  
19868.52324  
13366.05655  
8126.090046  
10838.05996  
991.0953388  
8882.207824  
3783.607109  
9140.257297  
739.6456205  
1164.753356  
2533.67002  
3301.532195  
2544.713392  
5401.344422  
3122.177448  
175.690169  
4390.575525  
3864.608982  
5391.626055  
2394.06783  
4005.605813  
1703.544994  
2596.393268  
1391.22224  
858.6139428  
5468.358691  
1333.461334  
52.24162509  
2614.309199  
2808.759467  
2213.853277  
785.6274164  
780.2820248  
3835.890413  
3702.311495  
92.44921381  
3002.241357  
2927.099285  
1693.88037  
681.7123704  
754.7846088  
201.9940257  
433.6142909  
624.3676747  
7.441487136  
359.5489235  
677.9372005  
60.69893483  
145.5998088  
192.2373418  
49.68277901  
28.96242394  
65.22925025  
7.129742392  
13.47306415  
23.51518702  
17.24062575  
0.1654007594  
9.558604604  
6.983010022  
6.221745771  
5.733250274  
4.203456382  
3.574594196  
3.417266162  
2.383518443  
2.859320024  
2.887766726  
3.658237221  
2.25464026  
1.897674428  
1.922097362  
1.83709873  
1.980593114  
1.753715456  
1.607144903  
1.605449708  
1.438661665  
1.379047233  
1.283855177  
1.222659184  
1.198209421  
1.124193987  
1.074596089  
1.026061051  
0.980952783  
0.9381893265  
0.899374816  
0.8597203588  
0.8342980221  
0.8032095975  
0.7706376326  
0.7366192009  
0.7149199302  
0.6889951173  
0.6662548917  
0.6417076681  
0.6208061091  
0.6009453067  
0.5820249486  
0.5624217785  
0.5457216252  
0.5290637799  
0.5138385557  
0.4978700052  
0.4840569233  
0.4697097897  
0.4570554868  
0.4443418266  
0.4323843486  
0.4207832165  
0.4099754253  
0.3992531985  
0.3891283714  
0.3793387944  
0.3700453983  
0.3610049459  
0.3523419366  
0.344076258  
0.3360813678  
0.3283349551  
0.3209249252  
0.3137375145  
0.3068599757  
0.3002117705  
0.2937674066  
0.287575516  
0.2815881948  
0.2757765673  
0.2701690945  
0.2647709219  
0.2595096092  
0.2544381414  
0.2495168118  
0.2447656897  
0.240141415  
0.2356776556  
0.2313380749  
0.2271375128  
0.2230568556  
0.2191011677  
0.2152600343  
0.21152045  
0.2078927267  
0.204377198  
0.2009450957  
0.1976156589  
0.1943650777  
0.1912202017  
0.1881512846  
0.1851635877  
0.182260916  
0.1794326239  
0.1766740182  
0.1739830689  
0.1713665993  
0.1688124589  
0.1663226143  
0.1638979462  
0.1615308018  
0.1592193477  
0.1569739572  
0.1547748152  
0.1526251278  
0.1505255819  
0.1484776377  
0.1464757186  
0.144524578  
0.1426103781  
0.1407479106  
0.1389198781  
0.1371394141  
0.1353912509  
0.1336894301  
0.1320179057  
0.1303791603  
0.1287875481  
0.1272237479  
0.1256857819  
0.1241890355  
0.1227163554  
0.121282291  
0.1198819853  
0.1184944971  
0.1171427599  
0.1158185638  
0.1145194956  
0.1132492043  
0.1120021421  
0.1107769389  
0.1095777157  
0.1084018257  
0.1072455033  
0.1061196777  
0.1050064512  
0.1039192331  
0.1028444452  
0.1018009241  
0.1007690016  
0.09975998493  
0.09876687454  
0.09779023987  
0.09683040675  
0.09588689665  
0.09497099691  
0.09405970962  
0.09316865153  
0.09229098805  
0.09143437778  
0.09058854176  
0.08975528548  
0.08893998705  
0.08813632655  
0.08734559763  
0.08656993806  
0.08580076442  
0.08505079456  
0.08431416158  
0.08359152628  
0.08287471485  
0.0821722957  
0.08148171438  
0.08080025388  
0.08013081345  
0.07946911009  
0.07882523605  
0.07818099084  
0.07755737962  
0.07693868457  
0.0763285466  
0.07573051196  
0.0751376297  
0.0745592286  
0.07399096884  
0.07341920062  
0.07286591602  
0.0723161559  
0.07177875836  
0.07124715954  
0.07072952465  
0.07021210092  
0.0697030019  
0.06920317419  
0.06870857384  
0.06822411649  
0.06775080062  
0.06727627639  
0.06681103228  
0.0663523449  
0.06590287054  
0.06545492526  
0.06501525301  
0.06458144522  
0.06415458486  
0.06373275591  
0.06331963098  
0.0629124446  
0.06250494777  
0.06210598513  
0.06171569734  
0.06132707321  
0.06094366287  
0.06056563036  
0.06019719959  
0.05982767913  
0.05946291245  
0.05910722627  
0.05875717627  
0.05840789007  
0.05806517617  
0.05772812702  
0.05739040166  
0.05706033241  
0.05674157577  
0.05641605876  
0.05609945988  
0.05578710012  
0.05547573761  
0.05517119157  
0.05487216094  
0.05457506957  
0.05428290635  
0.05399037907  
0.05370501003  
0.05342377426  
0.05314492964  
0.05286903816  
0.05259614107  
0.05232821846  
0.05206229202  
0.05180325931  
0.05154191029  
0.05128970677  
0.05103825351  
0.05078548585  
0.05054103713  
0.05029849724  
0.05005842136  
0.04982259658  
0.04958528137  
0.04935708035  
0.04912905829  
0.04890661433  
0.04868210028  
0.04846226218  
0.04824698076  
0.04803062115  
0.04781732188  
0.04761183731  
0.04740198493  
0.04719815197  
0.04699403436  
0.04679656892  
0.04659981625  
0.04640285519  
0.04620832374  
0.04601986943  
0.04583315638  
0.04564854399  
0.04546053155  
0.04528165338  
0.04510274622  
0.04493171558  
0.04475370838  
0.04458344189  
0.04440796564  
0.04424068412  
0.04407807773  
0.04391228418  
0.04375026722  
0.04358879638  
0.0434309591  
0.04327428797  
0.04311991477  
0.04296724421  
0.04281464341  
0.04266290903  
0.04251861953  
0.04236948707  
0.04222711092  
0.04208644114  
0.04194795047  
0.04180562545  
0.04166930751  
0.04153363494  
0.04140202123  
0.04126910324  
0.04113839493  
0.0410094859  
0.04088232576  
0.04075916006  
0.04063320864  
0.04051123391  
0.04038848167  
0.04026729491  
0.04015020489  
0.04003310767  
0.03991769509  
0.03980402849  
0.03969138747  
0.03958144884  
0.03947277746  
0.03936175278  
0.03925629271  
0.0391498582  
0.03904681449  
0.03894261451  
0.03884322987  
0.03873985926  
0.0386462373  
0.03854313423  
0.03844709096  
0.03835262145  
0.03825730324  
0.03816530022  
0.03807301617  
0.03798481303  
0.03789362845  
0.03780678167  
0.03772307227  
0.03763531777  
0.03755213321  
0.03746764736  
0.03738505211  
0.03730486942  
0.03722455048  
0.03714832344  
0.03706811042  
0.0369934801  
0.03691634551  
0.03684337389  
0.03676908843  
0.03669951112  
0.03662777451  
0.03655578293  
0.03648922826  
0.03641875187  
0.03635172158  
0.03628247408  
0.03622097228  
0.03615562543  
0.03609301812  
0.03603370039  
0.03597147948  
0.03591110068  
0.03585353561  
0.03579211808  
0.03573754842  
0.03568240304  
0.03562558246  
0.03557418152  
0.03551914684  
0.03546916685  
0.03541730184  
0.03536509163  
0.03531670961  
0.03526684137  
0.0352205856  
0.03516855632  
0.03512424376  
0.03507968273  
0.03503652352  
0.03499506849  
0.03495020716  
0.03491039654  
0.03486893279  
0.03482965411  
0.03478793031  
0.03475080264  
0.03471489677  
0.03467737805  
0.03464484259  
0.03460881377  
0.03457548073  
0.03454205712  
0.03450794867  
0.03448020521  
0.03444763759  
0.03442054687  
0.03438854455  
0.03435888613  
0.03433348374  
0.03430955653  
0.03428307978  
0.03425533317  
0.03423310383  
0.03421087444  
0.03419169578  
0.03416682704  
0.03414670542  
0.03412695798  
0.03410638323  
0.03408905801  
0.03407226531  
0.03405460448  
0.03403804686  
0.03402289756  
0.03400992009  
0.03399663187  
0.03398303431  
0.03397375379  
0.03395809332  
0.0339507613  
0.03394249273  
0.0339292065  
0.03392449084  
0.03391711966  
0.03390808745  
0.03390208726  
0.03389790461  
0.03389604157  
0.03388887153  
0.03388911079  
0.03388650559  
0.03388336955  
0.03388483834  
