-0.1420147995  
-0.09160681439  
-0.05105192746  
-0.02923024386  
-0.03306337925  
-0.06684781927  
-0.1319085462  
-0.226610675  
-0.3467128528  
-0.4860055347  
-0.6371346951  
-0.7924960025  
-0.9450692389  
-1.089095707  
-1.220507683  
-1.337071751  
-1.438257805  
-1.524865526  
-1.59849443  
-1.660948378  
-1.713675104  
-1.757321652  
-1.791477272  
-1.814625408  
-1.824314181  
-1.817502944  
-1.791037806  
-1.742186042  
-1.669151536  
-1.571512036  
-1.450514213  
-1.309195446  
-1.152306108  
-0.9860350879  
-0.8175580708  
-0.6544453137  
-0.5039758803  
-0.3724333903  
-0.2644430336  
-0.1824410515  
-0.1263307107  
-0.09339855357  
-0.07850663594  
-0.0745797863  
-0.07333949235  
-0.06623007189  
-0.04542437677  
-0.00480887677  
0.05918885446  
0.147029443  
0.2558323813  
0.3795287345  
0.5093950046  
0.6349141018  
0.7448740946  
0.8285862916  
0.8770815598  
0.8841549601  
0.8471381  
0.7673085396  
0.6498859204  
0.5036137466  
0.3399583436  
0.1720147571  
0.01323045814  
-0.1239185894  
-0.2291501337  
-0.2953701761  
-0.3193217977  
-0.3018267516  
-0.2475849924  
-0.1645751569  
-0.06311378701  
0.04529133076  
0.1491737005  
0.2382695754  
0.3044869731  
0.3425866051  
0.3505164938  
0.3293952553  
0.2831775848  
0.2180732778  
0.1418054825  
0.06279836178  
-0.01060932665  
-0.07086543946  
-0.1117605124  
-0.1288138357  
-0.1194775586  
-0.08316109379  
-0.02109291725  
0.06395507782  
0.1680479409  
0.2865401613  
0.4145474303  
0.5473984132  
0.6810196176  
0.8122043685  
0.9387407282  
1.059379283  
1.173641235  
1.28149801  
1.38296647  
1.477685393  
1.564547801  
1.641461843  
1.705296974  
1.752055607  
1.777264287  
1.77655609  
1.746370123  
1.684667747  
1.591558368  
1.469716585  
1.324505682  
1.163748856  
0.9971419598  
0.8353548911  
0.6889215303  
0.5670532461  
0.4765376638  
0.4208821615  
0.3998346378  
0.4093664251  
0.442142896  
0.4884288476  
0.537318091  
0.5781199985  
0.601712354  
0.6016658908  
0.5749825518  
0.5223444297  
0.447841384  
0.3582273364  
0.2618217576  
0.1672265072  
0.08205601268  
0.0118559376  
-0.04062589226  
-0.07573750938  
-0.09676104565  
-0.1093531851  
-0.1206850573  
-0.1384412753  
-0.1698286338  
-0.2207438054  
-0.2951974094  
-0.3950525174  
-0.5200703475  
-0.6682055836  
-0.8360647806  
-1.01941967  
-1.213674617  
-1.414214181  
-1.616586564  
-1.816527324  
-2.009859288  
-2.192327316  
-2.359444782  
-2.506425333  
-2.628242372  
-2.71984978  
-2.776548598  
-2.794463307  
-2.771063794  
-2.705651811  
-2.599734005  
-2.457205483  
-2.284295677  
-2.089258484  
-1.881807731  
-1.672355982  
-1.471129315  
-1.287249995  
-1.127902525  
-0.9976813023  
-0.8982042778  
-0.8280420173  
-0.7829821592  
-0.7565888656  
-0.7409939911  
-0.7278194447  
-0.7091112439  
-0.6781711202  
-0.6301852807  
-0.5625818796  
-0.4750847735  
-0.3694800221  
-0.2491432467  
-0.1184174135  
0.01806800413  
0.1560277271  
0.2920186477  
0.4237360688  
0.5500881391  
0.6710462816  
0.7873175527  
0.8999071043  
1.009641231  
1.11674623  
1.22054815  
1.319346113  
1.410481869  
1.4906018  
1.556073261  
1.603497198  
1.63024302  
1.634930809  
1.617781682  
1.58079274  
1.527684838  
1.463634316  
1.394804947  
1.327723219  
1.268585661  
1.222568423  
1.193233053  
1.18210406  
1.188477659  
1.209484765  
1.240412498  
1.275237848  
1.307320307  
1.330162151  
1.338147364  
1.327178304  
1.295125388  
1.242050316  
1.17017731  
1.083623012  
0.9879218483  
0.8894130108  
0.794560457  
0.7092920332  
0.6384290162  
0.5852693795  
0.5513580622  
0.5364519552  
0.5386671309  
0.5547552116  
0.580469561  
0.6109488799  
0.6410742596  
0.6657659503  
0.6802051774  
0.6799975192  
0.6613069078  
0.6209982423  
0.5568301666  
0.46771144  
0.3540114415  
0.2178866731  
0.06354719338  
-0.1026195456  
-0.272160307  
-0.43496304  
-0.5799817231  
-0.6962512164  
-0.7740836766  
-0.806315001  
-0.78941394  
-0.7242703541  
-0.6165165986  
-0.4762780114  
-0.3173404064  
-0.1558086397  
-0.008408728457  
0.1093478556  
0.1848893537  
0.2099635567  
0.1814784939  
0.1016918483  
-0.02226921585  
-0.1794761634  
-0.3566862024  
-0.5400318474  
-0.7166510721  
-0.8760439627  
-1.010964308  
-1.117753742  
-1.196104619  
-1.248338698  
-1.278353563  
-1.290443451  
-1.288209308  
-1.273759489  
-1.247331189  
-1.207408789  
-1.151304936  
-1.076095211  
-0.9797367168  
-0.8621454012  
-0.726019345  
-0.5772310805  
-0.4246642558  
-0.2794823224  
-0.1538976385  
-0.05960738693  
-0.006123805955  
0.0007369947411  
-0.04003706959  
-0.1241436286  
-0.2421736322  
-0.3805332445  
-0.5229867099  
-0.6526175469  
-0.7539554479  
-0.8149666482  
-0.8286486611  
-0.793993343  
-0.7161981665  
-0.6060818643  
-0.4787871745  
-0.351933673  
-0.2434524912  
-0.1693815567  
-0.1418829316  
-0.1677227807  
-0.2473842211  
-0.3749072342  
-0.5384567853  
-0.7215387157  
-0.9047145705  
-1.067607723  
-1.19097937  
-1.258649644  
-1.259071921  
-1.186410738  
-1.041038896  
-0.8294356228  
-0.5635245793  
-0.2595487748  
0.06338302868  
0.3849329462  
0.6851885918  
0.9462039598  
1.153303953  
1.296069766  
1.368959496  
1.371542917  
1.308363812  
1.188470121  
1.024649441  
0.8324451004  
0.6290032354  
0.4318331858  
0.2575419419  
0.12062279  
0.03237211252  
6.528726384e-06  
0.02605580422  
0.1080927025  
0.2388517414  
0.4067560239  
0.5968399343  
0.7920276593  
0.9746567336  
1.128122984  
1.238481228  
1.295815491  
1.295226312  
1.237286461  
1.127906288  
0.9775955998  
0.8002107391  
0.6113333561  
0.4264949949  
0.2594782584  
0.1209209193  
0.01740684767  
-0.04884574443  
-0.07968303616  
-0.08016609003  
-0.05734022454  
-0.01882416807  
0.02854006771  
0.07976378887  
0.1323478359  
0.1863952918  
0.2442003969  
0.3094061011  
0.3858930243  
0.4766026032  
0.5825063062  
0.701904061  
0.8301833538  
0.9600833936  
1.082437112  
1.187273289  
1.265113675  
1.308261  
1.311878355  
1.274690167  
1.199200622  
1.091400637  
0.9599971405  
0.8153039989  
0.6679518214  
0.5276170908  
0.4019560667  
0.2958938218  
0.2113522697  
0.1474356463  
0.1010059123  
0.06752922238  
0.04203133336  
0.01998579241  
-0.002003948693  
-0.02584207379  
-0.05191707715  
-0.0793928602  
-0.1067216058  
-0.1322346779  
-0.1546843071  
-0.1735974279  
-0.1893748378  
-0.2031093694  
-0.2161664554  
-0.2296336421  
-0.2437673597  
-0.2575831439  
-0.2687122299  
-0.2735993519  
-0.2680522663  
-0.2480832991  
-0.2109195932  
-0.1560068145  
-0.08581741197  
-0.006289582297  
0.07323984646  
0.1406555152  
0.1822221817  
0.1841521778  
0.1343980675  
0.02441989759  
-0.1493211659  
-0.38438733  
-0.6720737842  
-0.9978895407  
-1.342786354  
-1.685002748  
-2.00230849  
-2.274351137  
-2.484807208  
-2.62304415  
-2.685074625  
-2.673672509  
-2.597643549  
-2.470362281  
-2.307790182  
-2.126255332  
-1.940326583  
-1.761072364  
-1.594950163  
-1.443471193  
-1.303662119  
-1.169224626  
-1.032196462  
-0.8848357878  
-0.7214260918  
-0.5397216516  
-0.3418051616  
-0.134236555  
0.07253621832  
0.2654018261  
0.4302738682  
0.5540004205  
0.6262217536  
0.6409345832  
0.5975547489  
0.5013446887  
0.3631594656  
0.1985456392  
0.02630259247  
-0.1333264605  
-0.2606289049  
-0.3383503578  
-0.353375025  
-0.2979924817  
-0.17062446  
0.02402553397  
0.2754149044  
0.5681152164  
0.8831663149  
1.199685311  
1.496571115  
1.754147331  
1.955612101  
2.088198633  
2.143975526  
2.120263466  
2.019663907  
1.84972352  
1.622271369  
1.352474789  
1.057670944  
0.75605008  
0.4652651431  
0.2010764704  
-0.02386348593  
-0.2009607891  
-0.326259919  
-0.400570143  
-0.4290868492  
-0.4205255793  
-0.3858422152  
-0.3366790804  
-0.2837226643  
-0.2351900216  
-0.1956609335  
-0.1654288872  
-0.1404918824  
-0.1132058264  
-0.07353375073  
-0.01073104182  
0.0847759422  
0.2195760662  
0.3958091715  
0.6102750963  
0.854265098  
1.114160135  
1.372734255  
1.610982827  
1.810236401  
1.954267154  
2.031106761  
2.03434353  
1.96373791  
1.825113148  
1.629561009  
1.392109667  
1.13005257  
0.8611691956  
0.6020602854  
0.3667838857  
0.1659103947  
0.006053601704  
-0.1101375201  
-0.18359598  
-0.2181642945  
-0.2197563472  
-0.1954561254  
-0.1526599068  
-0.09831811589  
-0.03833152244  
0.02288368434  
0.08264328065  
0.1400534772  
0.1958740918  
0.2521916996  
0.3119174296  
0.3781360353  
0.453367263  
0.5388219455  
0.6337556693  
0.7350242494  
0.8369459356  
0.9315225079  
1.009043168  
1.059011437  
1.071295473  
1.037341563  
0.9512835332  
0.8107770952  
0.6174334564  
0.3767807239  
0.09776166995  
-0.2081629333  
-0.5281723573  
-0.8493473197  
-1.159864038  
-1.449978084  
-1.712686092  
-1.944020526  
-2.142961241  
-2.311019733  
-2.451563602  
-2.568987491  
-2.667831788  
-2.751954168  
-2.823841143  
-2.884137621  
-2.93143515  
-2.962350511  
-2.971887154  
-2.954046495  
-2.90262813  
-2.812137929  
-2.678694175  
-2.500824443  
-2.280045343  
-2.021141158  
-1.732081572  
-1.423569622  
-1.108255785  
-0.799690383  
-0.5111361219  
-0.2543719784  
-0.03862494434  
0.1302418606  
0.2501994068  
0.3231261087  
0.3544944018  
0.3527004327  
0.328138496  
0.2921194966  
0.255758479  
0.2289543116  
0.219554626  
0.2327873827  
0.2709936087  
0.3336630933  
0.4177418232  
0.5181510165  
0.628436457  
0.741467954  
0.8501050012  
0.9477747501  
1.028913012  
1.089271242  
1.126089288  
1.138172089  
1.125898456  
1.091191121  
1.037463067  
0.9695338198  
0.893490409  
0.8164634194  
0.7462840045  
0.691005107  
0.6582946785  
0.654736874  
0.6851124798  
0.7517410672  
0.8539931971  
0.9880495776  
1.146980853  
1.321168866  
1.499049791  
1.668117915  
1.816080128  
1.932044583  
2.007596255  
2.037640697  
2.020915229  
1.960102091  
1.86152922  
1.734489364  
1.590247893  
1.440844153  
1.297820858  
1.171007477  
1.067492983  
0.9908911306  
0.9409771293  
0.9137304237  
0.9017793864  
0.895203324  
0.8826036429  
0.8523431645  
0.7938209519  
0.6986613785  
0.5616987434  
0.3816645354  
0.1615097902  
-0.09166558261  
-0.3670728528  
-0.6510419156  
-0.9281123144  
-1.182305151  
-1.398474651  
-1.563609848  
-1.66797368  
-1.705971072  
-1.676651227  
-1.583794142  
-1.435561421  
-1.243737928  
-1.022638159  
-0.7877906386  
-0.5545399252  
-0.3367286082  
-0.1455981338  
0.01096148008  
0.1287458607  
0.2071282785  
0.2485543419  
0.2577319549  
0.240649688  
0.2035733291  
0.1521620602  
0.0908274778  
0.02240032817  
-0.05187382093  
-0.1320435525  
-0.2189435493  
-0.3135769508  
-0.4165016472  
-0.5273258188  
-0.6443909158  
-0.7646852158  
-0.8839868461  
-0.997209107  
-1.098878264  
-1.18367874  
-1.246981868  
-1.285299874  
-1.296615212  
-1.280566929  
-1.238489243  
-1.173318625  
-1.089395048  
-0.9921802801  
-0.8879209404  
-0.7832653894  
-0.6848538526  
-0.5988844302  
-0.5306692128  
-0.4841989481  
-0.4617487519  
-0.4635615763  
-0.4876615902  
-0.5298410504  
-0.5838596207  
-0.6418628244  
-0.6950172709  
-0.7343042894  
-0.7514051659  
-0.7395711697  
-0.6943794622  
-0.6142722742  
-0.5008082717  
-0.3585867011  
-0.1948495844  
-0.01881399956  
0.1591880654  
0.3286525331  
0.4798210921  
0.6044758095  
0.6965341354  
0.752408004  
0.7711188622  
0.7542006923  
0.7054342334  
0.6304791038  
0.5364472522  
0.4314723123  
0.3242833694  
0.2237926731  
0.1386819357  
0.0769702483  
0.04555685418  
0.04974377048  
0.09276892509  
0.1754026182  
0.2956710223  
0.4487766135  
0.6272732575  
0.8215183008  
1.020396446  
1.212258843  
1.385982317  
1.53202665  
1.643355633  
1.716093042  
1.7498222  
1.747473057  
1.71481003  
1.659578172  
1.590424096  
1.515736861  
1.442567777  
1.375779047  
1.317536869  
1.26721653  
1.221724669  
1.176187082  
1.124894013  
1.062359238  
0.984330475  
0.8885977102  
0.7754770301  
0.6478925125  
0.5110456172  
0.3717192708  
0.2373191994  
0.1148041065  
0.00966026611  
-0.07492267278  
-0.138549482  
-0.1837203403  
-0.2155236971  
-0.2409643177  
-0.2680342127  
-0.3046541953  
-0.3576407715  
-0.4318307718  
-0.5294798225  
-0.6499905491  
-0.7899946218  
-0.9437511077  
-1.103789731  
-1.261706411  
-1.409003209  
-1.537875579  
-1.641875537  
-1.716388429  
-1.7589118  
-1.76913337  
-1.748829863  
-1.701617382  
-1.632589697  
-1.547871622  
-1.454111707  
-1.357946356  
-1.265446603  
-1.181588821  
-1.109787592  
-1.051534059  
-1.006201739  
-0.9710664033  
-0.9415710546  
-0.9118453233  
-0.87544515  
-0.8262382083  
-0.7593298211  
-0.6718931224  
-0.5637733818  
-0.4377467563  
-0.2993650743  
-0.156371944  
-0.01774232111  
0.1075310925  
0.2117443999  
0.2896811688  
0.3395231961  
0.3633083211  
0.3668472171  
0.3590739985  
0.3508977992  
0.3537013203  
0.3776822345  
0.4302829198  
0.5149352409  
0.6303332328  
0.7703519095  
0.924672559  
1.080046602  
1.222046102  
1.337070829  
1.414315521  
1.44741945  
1.435525791  
1.383571416  
1.301730668  
1.204057621  
1.106498492  
1.024545932  
0.9708761267  
0.9533250277  
0.973518784  
1.026392632  
1.1006922  
1.180420877  
1.247031497  
1.282061397  
1.269819988  
1.199732804  
1.067993802  
0.8782704609  
0.6413643579  
0.3738771634  
0.09608758575  
-0.1706369271  
-0.4065102672  
-0.5956952457  
-0.728039373  
-0.7999690435  
-0.8144663682  
-0.7801955949  
-0.7099669189  
-0.6188166932  
-0.5220015764  
-0.4331933845  
-0.3631030263  
-0.3186591055  
-0.3027795765  
-0.3146749668  
-0.3505566865  
-0.4045800935  
-0.4698534936  
-0.5393617511  
-0.6066974957  
-0.6665543315  
-0.7149752025  
-0.7493993871  
-0.7685724574  
-0.7723844491  
-0.7616942617  
-0.7381726159  
-0.7041649281  
-0.6625595625  
-0.6166283827  
-0.5698046927  
-0.5253856344  
-0.4861637431  
-0.454024161  
-0.4295726625  
-0.4118689767  
-0.3983458388  
-0.3849664623  
-0.3666478701  
-0.3379193537  
-0.2937472676  
-0.2304080961  
-0.1462729382  
-0.04236193783  
0.07745054827  
0.2066413119  
0.3366656317  
0.4579383333  
0.5610321836  
0.6379277865  
0.6831134492  
0.6943629979  
0.6730544107  
0.6239796115  
0.5546579764  
0.4742677923  
0.3923643748  
0.3175877755  
0.256560967  
0.2131544064  
0.188208533  
0.1797431006  
0.183588571  
0.1943110698  
0.2062629025  
0.2145745223  
0.2159280672  
0.2089952562  
0.1944967796  
0.174891963  
0.1537797219  
0.1351295094  
0.1224815906  
0.1182505231  
0.123243041  
0.1364547605  
0.1551666213  
0.1753110169  
0.1920357712  
0.2003787309  
0.1959454332  
0.1754978613  
0.1373839129  
0.081759093  
0.01059069052  
-0.07253593412  
-0.1627701203  
-0.2544511803  
-0.3416059243  
-0.4184281709  
-0.4797004298  
-0.5211228617  
-0.539536726  
-0.5330470732  
-0.5010507836  
-0.4442027656  
-0.3643322458  
-0.2643391594  
-0.148077475  
-0.02023917765  
0.1137757761  
0.248005732  
0.3761171477  
0.4916477092  
0.5883233098  
0.6604370398  
0.703282003  
0.7135936815  
0.6899482372  
0.6330617689  
0.5459081221  
0.4336303093  
0.3032005441  
0.1628575349  
0.02136404029  
