-0.1760105099  
-0.417355001  
-0.6400566284  
-0.8289487815  
-0.9727159235  
-1.065252547  
-1.106368061  
-1.101742215  
-1.062123028  
-1.001876697  
-0.9370761106  
-0.88337562  
-0.8539582811  
-0.857824258  
-0.8986491715  
-0.9743620829  
-1.07750221  
-1.196297523  
-1.316327304  
-1.422536419  
-1.501325035  
-1.542430888  
-1.540339487  
-1.495033634  
-1.411967652  
-1.30128003  
-1.176343414  
-1.051863146  
-0.9417853792  
-0.8573130544  
-0.8053100282  
-0.7873139996  
-0.7993042101  
-0.8322475269  
-0.8733472197  
-0.9078182324  
-0.9209300259  
-0.9000408195  
-0.8363292319  
-0.7260036721  
-0.5708162362  
-0.3778427375  
-0.1585632864  
0.07259564431  
0.3000480243  
0.5088960138  
0.6865869235  
0.824150823  
0.916872969  
0.9643330676  
0.9698511705  
0.9394555713  
0.8805757714  
0.8006674  
0.706015605  
0.6009006083  
0.4872585768  
0.3648902119  
0.2321692016  
0.08713523983  
-0.07122543425  
-0.241734827  
-0.4200460982  
-0.5981329136  
-0.7643853686  
-0.9043555225  
-1.002116117  
-1.042072489  
-1.011017157  
-0.9001329843  
-0.7066652528  
-0.4349912534  
-0.09689796411  
0.289022675  
0.6988294832  
1.105389882  
1.480992445  
1.800093189  
2.041866713  
2.192252674  
2.245259304  
2.203384508  
2.077123599  
1.883653061  
1.644852121  
1.384918799  
1.127840686  
0.8950060608  
0.7032018064  
0.5631854304  
0.4789653623  
0.4478283866  
0.4610870546  
0.5054371668  
0.564763821  
0.6221831828  
0.6620935667  
0.6719980986  
0.6439068486  
0.5751525223  
0.4685384031  
0.3318079316  
0.1765104525  
0.01641211644  
-0.1343363624  
-0.263038478  
-0.3600510416  
-0.419932447  
-0.441989599  
-0.4301555537  
-0.3922229632  
-0.3385509029  
-0.2804338174  
-0.2283767898  
-0.1905256658  
-0.1714883809  
-0.1717143852  
-0.1875296764  
-0.2118173603  
-0.2352424203  
-0.2478371307  
-0.2407140413  
-0.2076341598  
-0.1462080788  
-0.05853176491  
0.04884036732  
0.1655948804  
0.2789334178  
0.375247681  
0.4419568435  
0.4692460128  
0.4514577992  
0.387940599  
0.2832346293  
0.1465654936  
-0.009277134865  
-0.1695231086  
-0.3192520867  
-0.4452122666  
-0.5373965574  
-0.5901619626  
-0.6027623453  
-0.5792320211  
-0.527668859  
-0.4590204893  
-0.3855622618  
-0.319281709  
-0.2703833539  
-0.2461165215  
-0.2500508609  
-0.2818858254  
-0.3377693536  
-0.4110523542  
-0.4933439056  
-0.5756879353  
-0.649699214  
-0.7084941471  
-0.7473201047  
-0.7638225442  
-0.7579649762  
-0.7316651251  
-0.6882431786  
-0.6317982414  
-0.5666237077  
-0.4967435799  
-0.4256222727  
-0.3560508024  
-0.2901932598  
-0.2297296438  
-0.1760424087  
-0.1303802099  
-0.09395823151  
-0.06795895629  
-0.0534419017  
-0.0511693147  
-0.06138358207  
-0.08357856691  
-0.1163030154  
-0.1570412303  
-0.2022058221  
-0.2472620766  
-0.2870047792  
-0.3159792262  
-0.3290262779  
-0.3219105914  
-0.2919646432  
-0.2386667234  
-0.1640573394  
-0.07289754807  
0.02750623042  
0.1278485859  
0.2177413918  
0.2869199438  
0.3266150374  
0.3309070113  
0.2978544525  
0.2301991026  
0.135490266  
0.0255388761  
-0.08477551781  
-0.1792280291  
-0.2422795526  
-0.2611355573  
-0.2275284983  
-0.1389399351  
0.0009267708391  
0.1825169675  
0.3915921398  
0.6110280371  
0.8229876593  
1.011147015  
1.162664651  
1.269626241  
1.329779057  
1.346486863  
1.327938578  
1.285758094  
1.233224978  
1.183357544  
1.147121217  
1.131986419  
1.141000097  
1.17247436  
1.220295372  
1.274792891  
1.324037354  
1.35538248  
1.357057148  
1.319601969  
1.23698314  
1.107260212  
0.9327455334  
0.7196706958  
0.4774285352  
0.217520091  
-0.04763849333  
-0.3058944493  
-0.5463762567  
-0.760263476  
-0.9412473902  
-1.085698322  
-1.192568243  
-1.263101789  
-1.300419729  
-1.309037879  
-1.294358195  
-1.262155121  
-1.218062703  
-1.167074916  
-1.113068773  
-1.05839164  
-1.00355986  
-0.9471394536  
-0.8858661544  
-0.8150467724  
-0.729246395  
-0.6232110442  
-0.4929265837  
-0.3366716684  
-0.155896953  
0.04423150153  
0.2547594733  
0.4634086988  
0.6555805195  
0.8158120696  
0.9295216498  
0.9848383733  
0.9742667753  
0.8959589807  
0.7543959075  
0.5603568835  
0.3301370053  
0.08407062747  
-0.1554918604  
-0.3665242552  
-0.529713246  
-0.6306084443  
-0.6612629606  
-0.6211582952  
-0.5172891779  
-0.3633843299  
-0.1783547996  
0.01584764339  
0.196696608  
0.3435821235  
0.440020606  
0.4753273978  
0.445565985  
0.3536931915  
0.2089286502  
0.02546778893  
-0.1792545835  
-0.3865190326  
-0.5782528183  
-0.738722455  
-0.8558417697  
-0.9220017521  
-0.9344009374  
-0.8949117487  
-0.8095592955  
-0.6877056094  
-0.5410414322  
-0.3824906879  
-0.2251038585  
-0.08102596418  
0.03940557744  
0.1283801608  
0.1811040387  
0.1960383606  
0.1748634361  
0.1221764784  
0.04495075599  
-0.0481974402  
-0.1478601404  
-0.2447249383  
-0.3304005959  
-0.3981040575  
-0.4431330207  
-0.4630833616  
-0.4578043968  
-0.42911136  
-0.3803115228  
-0.3156204932  
-0.2395588042  
-0.1564117312  
-0.06983199868  
0.01737495538  
0.1032621416  
0.1865686216  
0.2664209545  
0.341974324  
0.4120847949  
0.4750872302  
0.5287436706  
0.5703884174  
0.5972596468  
0.6069789577  
0.5980846047  
0.570536497  
0.5260810103  
0.4683968191  
0.402962688  
0.336642606  
0.2770219308  
0.2315741507  
0.2067768395  
0.207297788  
0.2353827691  
0.290531793  
0.3695293321  
0.4668161996  
0.575164163  
0.6865468171  
0.7930817667  
0.8879102168  
0.965887701  
1.02399297  
1.061409898  
1.079293195  
1.080261068  
1.06772033  
1.045127824  
1.015319696  
0.9800051503  
0.9395079988  
0.8927882557  
0.8377425496  
0.7717320613  
0.6922608187  
0.5976941272  
0.4879094039  
0.3647635131  
0.2322978282  
0.09661211301  
-0.03459697209  
-0.1528104564  
-0.2496914334  
-0.3182038848  
-0.3536987277  
-0.3548076972  
-0.3239958104  
-0.2676554802  
-0.1956753543  
-0.120488462  
-0.05567429989  
-0.01426810017  
-0.006985179772  
-0.04059586013  
-0.1167005865  
-0.2311004355  
-0.3739035734  
-0.5304079593  
-0.6826869121  
-0.8117078322  
-0.8997248709  
-0.9326258892  
-0.9019250593  
-0.8061146502  
-0.6511766455  
-0.4501777602  
-0.2219798335  
0.01076510579  
0.2240828613  
0.3953001911  
0.5055036088  
0.5415549895  
0.4974536036  
0.3749338809  
0.1832692573  
-0.06164365601  
-0.3388044782  
-0.6240543542  
-0.8922622764  
-1.119570246  
-1.285509748  
-1.374832079  
-1.378903868  
-1.296542494  
-1.134204909  
-0.9054770227  
-0.629876799  
-0.3310478192  
-0.03450719249  
0.2348312794  
0.4550745856  
0.609413329  
0.6875637006  
0.686398007  
0.6096853882  
0.467010009  
0.2720529352  
0.04054019251  
-0.2118014352  
-0.4709537095  
-0.72573346  
-0.9682134405  
-1.193456786  
-1.398721776  
-1.582378787  
-1.742823758  
-1.877645002  
-1.983215721  
-2.054787055  
-2.087027461  
-2.074867331  
-2.014458976  
-1.904039692  
-1.744548811  
-1.539890725  
-1.296847873  
-1.024682287  
-0.7345320343  
-0.4387024673  
-0.1499300237  
0.119344648  
0.3576908072  
0.5554171963  
0.7053397799  
0.803567282  
0.850240357  
0.8500996951  
0.8127111883  
0.7521810298  
0.6862195937  
0.6345132323  
0.616481191  
0.6486358828  
0.7419088624  
0.8993750854  
1.114845049  
1.37272102  
1.649351036  
1.915895653  
2.142435467  
2.302806558  
2.379416483  
2.367215746  
2.276014826  
2.13052734  
1.967839164  
1.832387557  
1.76900498  
1.814946813  
1.99213358  
2.300920766  
2.716632659  
3.189763975  
3.650242399  
4.015540838  
4.201757172  
4.136214032  
3.769754842  
3.086774296  
2.111229192  
0.9073645902  
-0.4253691755  
-1.762847189  
-2.971021637  
-3.922923121  
-4.515505932  
-4.683842193  
-4.410507347  
-3.728665667  
-2.718324332  
-1.496249904  
-0.2010145083  
1.024633384  
2.051508565  
2.779327689  
3.14756672  
3.140525013  
2.78619697  
2.149491077  
1.321136132  
0.4041454071  
-0.5000802985  
-1.304049816  
-1.943323063  
-2.381555052  
-2.611177935  
-2.650121698  
-2.535501649  
-2.315541887  
-2.041107474  
-1.758121057  
-1.501853608  
-1.293681127  
-1.140467358  
-1.036312639  
-0.9660967302  
-0.9100284958  
-0.8483645144  
-0.7655339575  
-0.6530705749  
-0.5110130202  
-0.3476966494  
-0.1781260476  
-0.02129138349  
0.1030483966  
0.1775940978  
0.1902379179  
0.1359193495  
0.01738431583  
-0.1551960362  
-0.3656226273  
-0.5938158704  
-0.818359874  
-1.01906555  
-1.179195998  
-1.287089722  
-1.337015448  
-1.329222703  
-1.269268934  
-1.166791655  
-1.033954464  
-0.8838129192  
-0.7288241874  
-0.5796720436  
-0.4445161108  
-0.3286865532  
-0.2347871394  
-0.1631043325  
-0.1122019316  
-0.07955491236  
-0.06211854871  
-0.0567367868  
-0.06036095795  
-0.07007758563  
-0.08300470977  
-0.09611616736  
-0.1060871584  
-0.1092304327  
-0.1015692674  
-0.07907576208  
-0.03804540802  
0.02443402844  
0.1099937822  
0.2185602249  
0.3480674094  
0.4943766053  
0.6514217684  
0.8116017064  
0.9663652631  
1.106952526  
1.22519177  
1.314272882  
1.369407969  
1.388293493  
1.37133153  
1.321572021  
1.2443899  
1.146927629  
1.037367112  
0.9241084875  
0.8149486843  
0.7163481424  
0.6328622229  
0.5667998165  
0.5181421187  
0.4847297886  
0.4626877252  
0.4470379126  
0.4324287238  
0.4138830359  
0.3874789874  
0.3508796896  
0.303639985  
0.2472649299  
0.1850095543  
0.1214579545  
0.06193828373  
0.01186311617  
-0.02392461081  
-0.04170921599  
-0.03930472902  
-0.01625943343  
0.02614549072  
0.08508678969  
0.1565318353  
0.2356684635  
0.3173626135  
0.3965896506  
0.46879523  
0.5301557262  
0.5777197889  
0.6094394224  
0.6241058618  
0.6212196217  
0.6008302298  
0.5633757551  
0.5095641685  
0.4403127869  
0.3567585243  
0.2603422594  
0.152947086  
0.03705574258  
-0.08409880945  
-0.2064537355  
-0.3251312149  
-0.4345904372  
-0.5289227471  
-0.6022844835  
-0.6494285874  
-0.6662805782  
-0.6504865084  
-0.6018479489  
-0.5225793958  
-0.4173269464  
-0.2929226467  
-0.1578826465  
-0.02168919597  
0.1060653883  
0.2165836164  
0.3026997994  
0.3595574316  
0.385036031  
0.379870053  
0.3474533632  
0.2933397593  
0.224512999  
0.1485080278  
0.07250756232  
0.002516454997  
-0.05727358883  
-0.1048549338  
-0.1404637306  
-0.1663372897  
-0.1861990184  
-0.2045656312  
-0.2259682584  
-0.2542104398  
-0.2917685655  
-0.3394251759  
-0.3961813855  
-0.4594572067  
-0.5255456054  
-0.5902344236  
-0.6495037195  
-0.7001665104  
-0.7403622371  
-0.7698063799  
-0.7897630566  
-0.8027354613  
-0.8119330724  
-0.8205969584  
-0.8313006754  
-0.8453434742  
-0.8623452607  
-0.880120526  
-0.8948670721  
-0.9016536371  
-0.8951459755  
-0.8704662654  
-0.8240583034  
-0.7544141177  
-0.6625432503  
-0.5520884122  
-0.4290470426  
-0.3011154678  
-0.1767375266  
-0.06398440117  
0.03056558758  
0.1027744138  
0.1515638106  
0.1790952729  
0.1904672843  
0.1929549183  
0.1949046912  
0.204440715  
0.2281789719  
0.2701549418  
0.3311220127  
0.4083388216  
0.4958751314  
0.5853864015  
0.6672391993  
0.7318150158  
0.7707960444  
0.778255238  
0.7513993424  
0.6908805856  
0.600667276  
0.4875157152  
0.3601461625  
0.2282652196  
0.1015655674  
-0.01116706838  
-0.1027413721  
-0.1679996946  
-0.2039950197  
-0.2099291621  
-0.1869124608  
-0.1376062574  
-0.06580575337  
0.02397454796  
0.1268814663  
0.238047588  
0.3528511184  
0.4671142209  
0.5772445053  
0.6803223578  
0.7741326324  
0.8571435076  
0.9284302104  
0.987543239  
1.034342817  
1.06882063  
1.090935004  
1.10050493  
1.097178779  
1.080504238  
1.050089729  
1.005835188  
0.9481835229  
0.8783477448  
0.7984479844  
0.7115213235  
0.6213846038  
0.5323469593  
0.4488104883  
0.3748081082  
0.3135459577  
0.2670160709  
0.2357365466  
0.2186584876  
0.213249084  
0.215750296  
0.2215693404  
0.2257638675  
0.2235586083  
0.2108396231  
0.184574272  
0.1431139319  
0.08635276757  
0.0157324271  
-0.06591269372  
-0.1546431144  
-0.2458088434  
-0.3345139858  
-0.4160974792  
-0.4865805376  
-0.5430325264  
-0.5838156034  
-0.6086717884  
-0.6186537919  
-0.6158989279  
-0.6032866123  
-0.584024826  
-0.5612278828  
-0.5375518153  
-0.5149370388  
-0.4945019192  
-0.4765954483  
-0.4609892827  
-0.4471726041  
-0.4346749739  
-0.423351157  
-0.4135602712  
-0.4061854018  
-0.4024828845  
-0.403777689  
-0.4110575473  
-0.4245508875  
-0.4433823464  
-0.4653956866  
-0.4872090358  
-0.5045405003  
-0.5127767361  
-0.5077249349  
-0.4864406149  
-0.4480006731  
-0.3940784294  
-0.3292032139  
-0.2606148287  
-0.1976793182  
-0.1509030197  
-0.1306344364  
-0.145614905  
-0.2015696409  
-0.3000578102  
-0.4377757706  
-0.6064781867  
-0.7935910506  
-0.9835113377  
-1.159458954  
-1.305671747  
-1.409619447  
-1.463905911  
-1.467507599  
-1.426092923  
-1.351275127  
-1.258823926  
-1.166039445  
-1.088655003  
-1.037756311  
-1.017237019  
-1.022271304  
-1.039145104  
-1.046581749  
-1.018458941  
-0.9275668536  
-0.7498819439  
-0.4687021806  
-0.07800186887  
0.4155465685  
0.9922360452  
1.620774608  
2.261346716  
2.869880907  
3.40292417  
3.822455315  
4.099988128  
4.219430004  
4.178370353  
3.987692606  
3.669657585  
3.25480777  
2.778171071  
2.275316192  
1.778765986  
1.315194403  
0.9036597611  
0.5549727438  
0.2721199364  
0.05153935464  
-0.1150499854  
-0.2385838706  
-0.330664131  
-0.4018858956  
-0.4606474549  
-0.5125097262  
-0.5600955421  
-0.6034370312  
-0.6406582562  
-0.6688346902  
-0.6848886588  
-0.6863961344  
-0.6722034128  
-0.6427932513  
-0.6003747595  
-0.5486996484  
-0.4926458136  
-0.4376265211  
-0.3889011833  
-0.3508889366  
-0.3265627027  
-0.3170239892  
-0.3213196293  
-0.3365438143  
-0.3582335367  
-0.381016537  
-0.3994415819  
-0.4088728313  
-0.4063203877  
-0.3910724433  
-0.3650060388  
-0.3325074783  
-0.2999767185  
-0.2749601184  
-0.2650196252  
-0.2764986985  
-0.3133633327  
-0.3763087365  
-0.462281409  
-0.5645138964  
-0.6730933234  
-0.7760065046  
-0.8605333172  
-0.9148061734  
-0.9293284138  
-0.8982450693  
-0.8201967055  
-0.6986386787  
-0.541572024  
-0.3607206621  
-0.1702437059  
0.01486311036  
0.1804838497  
0.3150123986  
0.4106925085  
0.4645036769  
0.4784788617  
0.4593959938  
0.4178780627  
0.3669963752  
0.3205445129  
0.2911949374  
0.2887737714  
0.3188825137  
0.3820538405  
0.4735724763  
0.583995541  
0.7003277187  
0.8077022504  
0.8913577473  
0.9386542496  
0.9408495889  
0.8943974509  
0.8015827578  
0.6703896418  
0.513611339  
0.3472957621  
0.1887272385  
0.05419270346  
-0.04317584483  
-0.09520048873  
-0.09986075633  
-0.06172672069  
0.008450237471  
0.09495688982  
0.1790243717  
0.2411891435  
0.2638381331  
0.2336146996  
0.1433835921  
-0.006506279888  
-0.2078499882  
-0.4451819503  
-0.6973001635  
-0.9395658887  
-1.14671414  
-1.295840773  
-1.369194802  
-1.356421805  
-1.25595909  
-1.075387326  
-0.8306865747  
-0.5444676392  
-0.2434028758  
0.04482497709  
0.2946673603  
0.4855556907  
0.6040966757  
0.6453540002  
0.6130870249  
0.5189458647  
0.3807608229  
0.2201800436  
0.05996981954  
-0.07866498388  
-0.1784193897  
-0.2276109941  
-0.2211169098  
-0.1604638607  
-0.05311055977  
0.08891602987  
0.2508213698  
0.4170179625  
