-0.184475889  
-0.1063775482  
-0.02799361442  
0.05490758974  
0.1457360033  
0.2462147917  
0.355671658  
0.4706016091  
0.5846089416  
0.6887795592  
0.7724989619  
0.8246652616  
0.8351723745  
0.7965056589  
0.7052331785  
0.5631801924  
0.3780821318  
0.1635681459  
-0.06161209203  
-0.2750924837  
-0.4530234253  
-0.5726220152  
-0.6148634478  
-0.566986827  
-0.4245005503  
-0.192394564  
0.1146461579  
0.4731153096  
0.8526022152  
1.218593147  
1.535854486  
1.772030387  
1.901039803  
1.905872733  
1.78045846  
1.530373948  
1.172314607  
0.7323807678  
0.2434059617  
-0.2583844505  
-0.736974956  
-1.16002736  
-1.501823225  
-1.74539176  
-1.883609441  
-1.919210847  
-1.863758211  
-1.735745897  
-1.558094514  
-1.355368114  
-1.15102483  
-0.9650293933  
-0.8120780261  
-0.7005926613  
-0.6325563831  
-0.6041509794  
-0.6070413631  
-0.6301102717  
-0.6613728905  
-0.6897959757  
-0.7067839756  
-0.7071405234  
-0.6894023134  
-0.655530581  
-0.6100461751  
-0.5587731352  
-0.5074001959  
-0.4601090565  
-0.4184895355  
-0.3809300329  
-0.342574796  
-0.2958937179  
-0.2317589377  
-0.1409071436  
-0.01553439034  
0.1491758218  
0.3538766699  
0.5943969895  
0.8617286282  
1.142704815  
1.421290891  
1.680333301  
1.903540485  
2.07741507  
2.192868027  
2.246284931  
2.239871482  
2.181236868  
2.082256398  
1.957384836  
1.821657744  
1.688686694  
1.568935154  
1.468527987  
1.388753959  
1.32631821  
1.274267054  
1.223420559  
1.164052031  
1.087543486  
0.9877504457  
0.8618777676  
0.7107608692  
0.5385523943  
0.3519118432  
0.1588879388  
-0.0323066077  
-0.2144005516  
-0.3818805258  
-0.5314174525  
-0.6618770808  
-0.7739718995  
-0.8696714396  
-0.9515154287  
-1.021975939  
-1.082991306  
-1.135730879  
-1.18061046  
-1.21750273  
-1.246079953  
-1.266167052  
-1.278022517  
-1.282475132  
-1.280874818  
-1.274881313  
-1.266123367  
-1.255816628  
-1.244419434  
-1.231411291  
-1.215249695  
-1.193530375  
-1.163345139  
-1.12177919  
-1.06648022  
-0.9962094257  
-0.9112662132  
-0.8137365468  
-0.7074818635  
-0.5978820887  
-0.4913310763  
-0.3945660605  
-0.3138979937  
-0.2544615644  
-0.2195780478  
-0.2103259317  
-0.2253646975  
-0.2610519889  
-0.3118137627  
-0.370728875  
-0.4302384034  
-0.4828902534  
-0.5220242204  
-0.5423371667  
-0.5402694546  
-0.5142047198  
-0.4644935821  
-0.3933252404  
-0.3044938993  
-0.2030897846  
-0.09514721814  
0.01275184113  
0.113894266  
0.2019022964  
0.2712217291  
0.31763822  
0.338763391  
0.3344429384  
0.3070103436  
0.261304671  
0.2044020289  
0.1450309502  
0.09270311522  
0.05663180961  
0.04459083999  
0.06184772544  
0.1103759609  
0.1884739859  
0.2908856955  
0.4094502364  
0.5341900977  
0.6547054151  
0.7616542352  
0.8480897576  
0.91043561  
0.9489368334  
0.9675028118  
0.9729700654  
0.9738811213  
0.9789952208  
0.9957483558  
1.028923899  
1.079740229  
1.145497146  
1.219843181  
1.293616652  
1.356135057  
1.396730154  
1.406303609  
1.378678436  
1.311539752  
1.20686235  
1.070750409  
0.9127408183  
0.7446730287  
0.5792879645  
0.4287401619  
0.3032244808  
0.2098664967  
0.1520075582  
0.1289419465  
0.1361239751  
0.1657620131  
0.2077626419  
0.2508457234  
0.2837514983  
0.2963820001  
0.2807721616  
0.2318080037  
0.1476371821  
0.02973204759  
-0.1173721815  
-0.286633132  
-0.4692974437  
-0.6558309959  
-0.8369168805  
-1.004387161  
-1.152014869  
-1.276056497  
-1.375502685  
-1.451992088  
-1.509396728  
-1.553124313  
-1.589212224  
-1.623320338  
-1.65975291  
-1.700614932  
-1.745241944  
-1.789983415  
-1.828396531  
-1.851858404  
-1.850556706  
-1.814773963  
-1.736307513  
-1.609884699  
-1.4343482  
-1.213456089  
-0.9561235124  
-0.6760158813  
-0.3904689563  
-0.1188075047  
0.1197823521  
0.3085709324  
0.4354959778  
0.4949585075  
0.4888890536  
0.4268932637  
0.3253704041  
0.2056426258  
0.09131196577  
0.005156336465  
-0.03399813917  
-0.01399043018  
0.06881094397  
0.2087879104  
0.3916526768  
0.596284299  
0.7975841575  
0.9699461426  
1.090836771  
1.14395727  
1.121502748  
1.025190741  
0.8659091876  
0.6620412404  
0.4367554008  
0.2146840696  
0.01851797481  
-0.1339629369  
-0.2319628232  
-0.2725710484  
-0.2603823533  
-0.2059635269  
-0.1234614509  
-0.02779670229  
0.06807029176  
0.155334347  
0.2306418609  
0.2962938031  
0.3593688236  
0.4299346477  
0.5187120876  
0.6345952969  
0.7824873407  
0.9618106468  
1.165955109  
1.382744351  
1.595841643  
1.786855469  
1.937808579  
2.033563986  
2.063847726  
2.024552589  
1.918158038  
1.753210624  
1.54300218  
1.303658155  
1.051949676  
0.80318537  
0.5694805164  
0.3586464889  
0.1738202888  
0.01383942851  
-0.1257773542  
-0.2514381512  
-0.3699559445  
-0.4871606522  
-0.6068568945  
-0.7302782553  
-0.8560724009  
-0.9807623379  
-1.099546572  
-1.207243937  
-1.299207105  
-1.372019473  
-1.423880893  
-1.454640123  
-1.465517769  
-1.458612395  
-1.436336298  
-1.400912378  
-1.354060349  
-1.296938546  
-1.230354804  
-1.155190222  
-1.072926514  
-0.9861404411  
-0.8988223329  
-0.8163953947  
-0.7453712405  
-0.6926436864  
-0.6644977233  
-0.6654794564  
-0.6973055932  
-0.7580361472  
-0.8416766316  
-0.9383627263  
-1.03515328  
-1.117398906  
-1.170521403  
-1.181980418  
-1.143118404  
-1.050612107  
-0.9072525486  
-0.7218989009  
-0.5085486778  
-0.2846359341  
-0.06876017821  
0.121807375  
0.2734712401  
0.3781554866  
0.434325588  
0.4470492545  
0.4270729426  
0.3890561723  
0.3492661071  
0.3230867714  
0.322738613  
0.3555572995  
0.4230644581  
0.5209437263  
0.639867109  
0.7670104495  
0.8879685044  
0.9887887406  
1.057810175  
1.087089427  
1.073266282  
1.01782369  
0.9267858989  
0.8099594609  
0.6798545906  
0.550434946  
0.4358116997  
0.3489848045  
0.300686959  
0.2983879711  
0.3454943102  
0.4407907189  
0.5782115491  
0.7469713792  
0.9321771378  
1.115900604  
1.278740443  
1.401736095  
1.468471624  
1.467107113  
1.392036968  
1.244897696  
1.03469518  
0.7769565185  
0.4919534122  
0.2022199167  
-0.07029627716  
-0.3070001042  
-0.4949066945  
-0.6280131686  
-0.7075637848  
-0.7411905218  
-0.7410635403  
-0.7214183327  
-0.6958746144  
-0.6750190406  
-0.664671524  
-0.6650988238  
-0.6713058414  
-0.6742894747  
-0.6630424273  
-0.6269042697  
-0.5578519362  
-0.4523232083  
-0.3122671566  
-0.1452387967  
0.03645736366  
0.2174262756  
0.3813605052  
0.5133705061  
0.6020939689  
0.6412503849  
0.6304113282  
0.574899104  
0.4848472948  
0.3736214245  
0.2558552388  
0.1454289627  
0.0536793242  
-0.0118878398  
-0.04826450227  
-0.05691713648  
-0.04316894543  
-0.01512492527  
0.01765013261  
0.04547331027  
0.05972964845  
0.05375717616  
0.0233612613  
-0.03302689033  
-0.1144964723  
-0.2180263518  
-0.338958645  
-0.4715019743  
-0.6092123125  
-0.7454173828  
-0.8735847327  
-0.9876639291  
-1.082403203  
-1.153657635  
-1.19866246  
-1.216250862  
-1.206967713  
-1.173025086  
-1.118104396  
-1.046969619  
-0.9649500709  
-0.8773516469  
-0.788861406  
-0.7030586857  
-0.6220897496  
-0.5465618177  
-0.4756744051  
-0.4075572258  
-0.3397577867  
-0.2697993917  
-0.1957118687  
-0.11647128  
-0.03226670031  
0.05540880447  
0.1438636805  
0.2294540546  
0.3079378649  
0.3748750553  
0.4260086438  
0.4576157072  
0.4667859722  
0.451639561  
0.4114950368  
0.3469966996  
0.2602141317  
0.1547071099  
0.03554027791  
-0.09078270647  
-0.2164984049  
-0.3329009769  
-0.4308068498  
-0.5011505234  
-0.5356620042  
-0.5275705366  
-0.4722558698  
-0.3677608233  
-0.2151116564  
-0.01840122957  
0.2153603329  
0.4766164332  
0.7538025916  
1.033980427  
1.303539251  
1.548871702  
1.757040247  
1.916385103  
2.017104037  
2.05178247  
2.01589362  
1.9082419  
1.731300945  
1.491401396  
1.198701069  
0.8668664702  
0.512434922  
0.1538530946  
-0.1897630801  
-0.5000759297  
-0.7610229425  
-0.9602261471  
-1.090144699  
-1.148820222  
-1.140096048  
-1.07327001  
-0.9621659533  
-0.8237187966  
-0.6762027195  
-0.5372907245  
-0.422165053  
-0.3418945166  
-0.3022776014  
-0.3033074052  
-0.3393178754  
-0.3998361813  
-0.471014999  
-0.5375203868  
-0.5845832478  
-0.6000033765  
-0.575795054  
-0.5092648386  
-0.4033543125  
-0.2661891855  
-0.1098796147  
0.05126065385  
0.2028317643  
0.3324863429  
0.4317710323  
0.497382369  
0.5316296801  
0.5420236392  
0.5400190909  
0.539103576  
0.5525121618  
0.5909038542  
0.6603815239  
0.7611611702  
0.8871264722  
1.026348375  
1.162531357  
1.277184267  
1.352197752  
1.372453813  
1.328077428  
1.215979608  
1.040451408  
0.812714334  
0.5494772162  
0.2707165584  
-0.002994831936  
-0.2532059332  
-0.4659460757  
-0.6333689636  
-0.7544390513  
-0.8345776781  
-0.8843328159  
-0.9172944165  
-0.9476155972  
-0.9875090361  
-1.045140185  
-1.123230523  
-1.218583817  
-1.32260356  
-1.422695047  
-1.504343428  
-1.553513108  
-1.559026635  
-1.514540158  
-1.419832437  
-1.281226123  
-1.111073322  
-0.9263962483  
-0.7468634972  
-0.5923915362  
-0.4806930967  
-0.4250764141  
-0.432803874  
-0.5041627203  
-0.6323785363  
-0.8043254957  
-1.001934292  
-1.204082821  
-1.388730046  
-1.535025499  
-1.62516127  
-1.64578294  
-1.588858431  
-1.451985871  
-1.238197802  
-0.9553737382  
-0.6154147628  
-0.2332967828  
0.1738561978  
0.5876481225  
0.9892165408  
1.360000118  
1.682533194  
1.941321861  
2.123810476  
2.22141545  
2.230517715  
2.153275719  
1.998074303  
1.779453196  
1.517392113  
1.235920092  
0.9611318744  
0.7187769314  
0.531696398  
0.4174276657  
0.3862858435  
0.4402041603  
0.5724900851  
0.7685601626  
1.007557946  
1.264659896  
1.513767188  
1.730261323  
1.893471702  
1.988593255  
2.007846054  
1.950780381  
1.823754273  
1.638697475  
1.411347382  
1.159217644  
0.8995459012  
0.647468564  
0.4146170445  
0.2082768021  
0.03115907551  
-0.1182344327  
-0.244740885  
-0.3553168291  
-0.4576442326  
-0.5587563597  
-0.6638546298  
-0.775458926  
-0.8929735644  
-1.012694109  
-1.128222271  
-1.231221625  
-1.312396693  
-1.362563507  
-1.373719392  
-1.339977932  
-1.258307675  
-1.12901883  
-0.9559709204  
-0.7464869634  
-0.5109935654  
-0.2624005724  
-0.01524716643  
0.2153231517  
0.4147082422  
0.5700222512  
0.6711943697  
0.7118864539  
0.6901106261  
0.6084658178  
0.4739233896  
0.2971712274  
0.09156248335  
-0.1282260942  
-0.3476603243  
-0.5537656925  
-0.7363148492  
-0.888623783  
-1.007876358  
-1.094933932  
-1.153684656  
-1.190046857  
-1.210801113  
-1.222431852  
-1.230157758  
-1.237299626  
-1.245058526  
-1.252703042  
-1.258105976  
-1.258501309  
-1.251301201  
-1.234820991  
-1.208770492  
-1.174431969  
-1.134518236  
-1.092728712  
-1.053130116  
-1.019470748  
-0.994561933  
-0.9798542435  
-0.9752518805  
-0.9792108691  
-0.9890515518  
-1.001424051  
-1.012793563  
-1.019857347  
-1.019785347  
-1.010251728  
-0.9892726273  
-0.9549025959  
-0.904907689  
-0.8365289218  
-0.7464497512  
-0.631029017  
-0.4868047825  
-0.3112053682  
-0.1033333269  
0.1353344448  
0.4005104771  
0.6850450678  
0.9793254332  
1.272096715  
1.551584956  
1.806729101  
2.028322782  
2.209843829  
2.347855878  
2.441922594  
2.49410152  
2.508145126  
2.488614833  
2.440095595  
2.36667138  
2.271737276  
2.158156484  
2.028640124  
1.886231209  
1.734687982  
1.578641218  
1.42342191  
1.274548054  
1.136957709  
1.014117762  
0.9072218243  
0.8146554882  
0.73189993  
0.6519602056  
0.5663064391  
0.4662412041  
0.3444792844  
0.1966996027  
0.02279666407  
-0.172418023  
-0.3792227608  
-0.5837638851  
-0.7695249947  
-0.9193028685  
-1.01739325  
-1.051649187  
-1.015098911  
-0.9068582735  
-0.7322154592  
-0.5018914677  
-0.2306366992  
0.06457523198  
0.3664299005  
0.6589048865  
0.9284060056  
1.164273076  
1.358641993  
1.505828464  
1.601452167  
1.641597776  
1.622285843  
1.539425503  
1.389337317  
1.169758644  
0.8811381675  
0.527935328  
0.1196144759  
-0.3289381314  
-0.7977547952  
-1.26291716  
-1.698384998  
-2.078283981  
-2.379349229  
-2.583179695  
-2.678013632  
-2.659806707  
-2.532515195  
-2.30761482  
-2.002960189  
-1.641178363  
-1.247809936  
-0.849369486  
-0.4714976295  
-0.1373085869  
0.134006662  
0.3282631693  
0.4370425454  
0.4580740672  
0.395234425  
0.2581133923  
0.06117274902  
-0.1774970234  
-0.4377225766  
-0.6989790048  
-0.9421392989  
-1.151059435  
-1.313818452  
-1.42347093  
-1.478237503  
-1.481115881  
-1.4389792  
-1.361318557  
-1.258786393  
-1.141768947  
-1.01915808  
-0.8974967441  
-0.7805535753  
-0.6693852855  
-0.5628099464  
-0.4581829136  
-0.3523503772  
-0.2425895621  
-0.1274145492  
-0.007103821881  
0.1160960129  
0.238131403  
0.3536080579  
0.4564980969  
0.5409570752  
0.6021431578  
0.636894564  
0.6441941758  
0.625328993  
0.583753684  
0.5246628486  
0.4543595727  
0.3794846742  
0.3062558001  
0.2397873063  
0.1836029317  
0.1394004468  
0.1070750865  
0.08500418836  
0.07052040677  
0.06050508264  
0.05200312473  
0.04275235808  
0.03156257927  
0.01847633206  
0.004691364432  
-0.007731944083  
-0.01633727808  
-0.0188174785  
-0.01356589571  
-0.0001082899386  
0.0206370108  
0.04635034934  
0.07355026269  
0.09808087107  
0.1157548214  
0.12309927  
0.1180556799  
0.1005529021  
0.07282929862  
0.03944710552  
0.006956561545  
-0.01676914211  
-0.02347191262  
-0.005603202239  
0.04255130979  
0.1238857842  
0.2377615814  
0.3797115786  
0.5416229316  
0.7124209869  
0.8792102091  
1.028741474  
1.149043786  
1.230999711  
1.269650283  
1.265028561  
1.222380252  
1.151695194  
1.066567284  
0.9825123812  
0.9149302487  
0.876977878  
0.877652441  
0.9203368327  
1.002060342  
1.113591042  
1.240383401  
1.364286293  
1.465797393  
1.526561692  
1.531766548  
1.472092337  
1.344938298  
1.15473124  
0.9122849952  
0.6333031656  
0.3362535702  
0.03996562869  
-0.2387059393  
-0.4867659024  
-0.6962601002  
-0.864590028  
-0.9939689958  
-1.090159669  
-1.160763397  
-1.213388317  
-1.254035592  
-1.285993732  
-1.309417659  
-1.321646874  
-1.318168523  
-1.294022269  
-1.245360597  
-1.17084257  
-1.072596098  
-0.956526801  
-0.8319080996  
-0.7102827853  
-0.603860222  
-0.5236695608  
-0.4777873914  
-0.4699555455  
-0.4988382827  
-0.5580747174  
-0.637148275  
-0.7229519979  
-0.8018039055  
-0.8616047016  
-0.8937767805  
-0.8946565673  
-0.8661048217  
-0.8152273106  
-0.7532127214  
-0.6934922753  
-0.6494800466  
-0.6322689092  
-0.648639528  
-0.6996968128  
-0.7803595257  
-0.8797756334  
-0.9826107203  
-1.071002052  
-1.126902081  
-1.134447057  
-1.082022549  
-0.9637391619  
-0.7801325428  
-0.5380303207  
-0.2496449536  
0.06892273639  
0.399544355  
0.7239907027  
1.025684611  
1.291058238  
1.510403204  
1.678159348  
1.792713348  
1.855791807  
1.87162023  
1.845984681  
1.785365862  
1.696221929  
1.584506436  
1.455424772  
1.313408311  
1.162251889  
1.005333557  
0.8458583386  
0.6870404367  
