0.06943995402  
-1.26725161  
-2.518231682  
-3.608453299  
-4.48074064  
-5.101599342  
-5.463793183  
-5.58543543  
-5.505865788  
-5.279040036  
-4.965508633  
-4.6241806  
-4.305054676  
-4.043850241  
-3.859147555  
-3.752225044  
-3.709367478  
-3.706093854  
-3.712491191  
-3.698785156  
-3.640284293  
-3.521035311  
-3.335758586  
-3.089932347  
-2.798198343  
-2.481471773  
-2.16332899  
-1.86629288  
-1.608589039  
-1.401838971  
-1.249962879  
-1.149353448  
-1.090181343  
-1.058524452  
-1.038918535  
-1.01688386  
-0.9810349485  
-0.9244643271  
-0.8452588169  
-0.7461226861  
-0.633261302  
-0.5147652284  
-0.3988158432  
-0.2920248041  
-0.1982011094  
-0.117734658  
-0.047674848  
0.01751174908  
0.08467632139  
0.1604235118  
0.2495374522  
0.3536714074  
0.4705418084  
0.5937850608  
0.7135466348  
0.8177380906  
0.8938100277  
0.9307882207  
0.9212634178  
0.863027218  
0.7600665544  
0.622728634  
0.466964163  
0.3127100632  
0.1815927712  
0.09424142699  
0.06758218055  
0.1124839065  
0.2321020662  
0.4211673561  
0.6663387595  
0.9476042796  
1.240540782  
1.519150827  
1.758888532  
1.939483847  
2.047182825  
2.076127122  
2.028706157  
1.914867621  
1.750517006  
1.555253213  
1.349780489  
1.153356413  
0.9816211314  
0.8450806484  
0.74839834  
0.6905414809  
0.6656808838  
0.6646598491  
0.6767671528  
0.6915250997  
0.7002368555  
0.6970783857  
0.6796256687  
0.6487987046  
0.6082744878  
0.5635504171  
0.5208023505  
0.4857609088  
0.4627717514  
0.4541573368  
0.4599519264  
0.4779964398  
0.5043513853  
0.5339184032  
0.5611590026  
0.5808096318  
0.5884908891  
0.5811578548  
0.5573647082  
0.517335874  
0.4628819626  
0.3971801595  
0.324465168  
0.2496582755  
0.1779627075  
0.1144568672  
0.06368695336  
0.02929305322  
0.01369468021  
0.01783240629  
0.0410259321  
0.08092442922  
0.1336068506  
0.1937928985  
0.255190434  
0.3109476273  
0.3541962634  
0.3786438674  
0.3791903675  
0.3524993915  
0.2974916198  
0.2156790832  
0.111293114  
-0.008868928661  
-0.1358888585  
-0.2594774357  
-0.3689882449  
-0.4545932575  
-0.5085011138  
-0.5260265483  
-0.5063757189  
-0.4529711557  
-0.3732384473  
-0.2778366894  
-0.1793951291  
-0.09092284116  
-0.02408448902  
0.01238870373  
0.01392296549  
-0.01922357202  
-0.08196735896  
-0.1650880835  
-0.2565205633  
-0.3430618497  
-0.4122578645  
-0.4541838968  
-0.4628635981  
-0.4371250329  
-0.3807628475  
-0.3020005194  
-0.2123369253  
-0.1249578379  
-0.05295682123  
-0.007612371012  
0.003022551851  
-0.02494382241  
-0.09089611545  
-0.1899596176  
-0.3137506893  
-0.4515124739  
-0.5914313286  
-0.7219577776  
-0.832969317  
-0.9166582062  
-0.9680846051  
-0.9853925413  
-0.9697239473  
-0.9248975945  
-0.856926541  
-0.7734238549  
-0.6829623336  
-0.5943894915  
-0.5161241976  
-0.4554479007  
-0.4178165491  
-0.4062394191  
-0.4208045362  
-0.4584167576  
-0.5128492661  
-0.5751491409  
-0.6344163479  
-0.6789142879  
-0.6974052596  
-0.6805564595  
-0.6222373081  
-0.520505799  
-0.3781367558  
-0.2025835038  
-0.005351329033  
0.1991634556  
0.3952211214  
0.56748182  
0.7027287097  
0.7913383779  
0.8283373656  
0.8139230726  
0.7534007861  
0.6565688572  
0.536651382  
0.408901897  
0.2890507766  
0.1917533713  
0.1291865702  
0.1099277064  
0.1381958254  
0.2135077572  
0.3307625429  
0.4807244411  
0.6508545861  
0.8264132269  
0.9917364037  
1.131585693  
1.232482537  
1.283906602  
1.279288184  
1.216695715  
1.09915657  
0.9345549651  
0.7350830966  
0.516245817  
0.2954810315  
0.09049547031  
-0.08252988991  
-0.2106754349  
-0.285726897  
-0.3051515149  
-0.2724210607  
-0.196609022  
-0.09127265444  
0.02726488485  
0.1420233099  
0.2375807288  
0.3021049693  
0.328902438  
0.3172737246  
0.2725475615  
0.2052829346  
0.1297433062  
0.06186164689  
0.01694736637  
0.007485432763  
0.04128394721  
0.1202596906  
0.2399915949  
0.3901350699  
0.5556108776  
0.7184501463  
0.8600131168  
0.963318469  
1.015171345  
1.007805332  
0.9398424329  
0.8164462947  
0.6486743684  
0.4521159305  
0.2450162312  
0.0461420163  
-0.1273473119  
-0.2617482057  
-0.3481862117  
-0.3833433686  
-0.3695243845  
-0.3140661945  
-0.2282177161  
-0.1256525436  
-0.02081589229  
0.0726967044  
0.1435448043  
0.1836996282  
0.1890659087  
0.1596448061  
0.0992597155  
0.0149231326  
-0.08406566104  
-0.1871781515  
-0.2837614935  
-0.3640780045  
-0.4202163943  
-0.4467786412  
-0.4413206217  
-0.4045060006  
-0.3399681888  
-0.2538999275  
-0.1543943011  
-0.05061227808  
0.04816176677  
0.133461742  
0.1984917762  
0.2387863059  
0.2525936491  
0.2409458156  
0.2074105659  
0.1575460863  
0.09815252093  
0.03641120875  
-0.02096922764  
-0.06849043631  
-0.1023923565  
-0.1209220406  
-0.1243222193  
-0.1145769936  
-0.09495996073  
-0.06948489982  
-0.04233254193  
-0.01734594018  
0.002346536027  
0.01454646431  
0.01803298449  
0.01246337748  
-0.001836703238  
-0.02413220533  
-0.05353962657  
-0.08924226755  
-0.1306144288  
-0.1772412692  
-0.2288380476  
-0.2850627214  
-0.3452740165  
-0.4082691976  
-0.472038852  
-0.5336120178  
-0.5890189015  
-0.6334146891  
-0.6613839866  
-0.6674138768  
-0.6465120467  
-0.5949120972  
-0.5107735668  
-0.3947960843  
-0.2506354577  
-0.08503294282  
0.09240189185  
0.2697987621  
0.4339682299  
0.5716410404  
0.6708513763  
0.7223154562  
0.7206261677  
0.665089393  
0.5600654364  
0.4147425059  
0.2423183921  
0.05869078923  
-0.1192082657  
-0.2752156437  
-0.3956440898  
-0.4706526942  
-0.4951177165  
-0.4688753373  
-0.3963446323  
-0.2856082871  
-0.1471218463  
0.007736255995  
0.1680406212  
0.3244179451  
0.4697486511  
0.5993881821  
0.7109637712  
0.8038308233  
0.8783511792  
0.9351640392  
0.9745963575  
0.9963249946  
0.9993529325  
0.9822675635  
0.9437261854  
0.8830449863  
0.8007675078  
0.6990876174  
0.5820336284  
0.4553575836  
0.326144319  
0.2021688809  
0.09110581482  
-0.0003087379803  
-0.06704441358  
-0.1063703497  
-0.1181954637  
-0.1051083801  
-0.07211272573  
-0.02608906859  
0.0249574846  
0.07277336589  
0.1097534978  
0.129762982  
0.1287846696  
0.1053207653  
0.06052046848  
-0.002007194038  
-0.07663320802  
-0.1563893953  
-0.2337731335  
-0.3016218766  
-0.3539217701  
-0.3864901519  
-0.3974217461  
-0.3872633902  
-0.3588899876  
-0.3170822595  
-0.2678751728  
-0.2177536199  
-0.1727946711  
-0.1378898226  
-0.1161378698  
-0.1085009068  
-0.1137649485  
-0.1288120243  
-0.1491372467  
-0.1695520141  
-0.1849411552  
-0.1909693229  
-0.1846398739  
-0.1646295942  
-0.1313657438  
-0.0868684946  
-0.03439884241  
0.02201471481  
0.07808012695  
0.1297085358  
0.1733866863  
0.2064292063  
0.2270980231  
0.2346367573  
0.2292297687  
0.2119377586  
0.1846300842  
0.1499208944  
0.1111042561  
0.0720476624  
0.03702973413  
0.01047653995  
-0.003401965917  
-0.001064337182  
0.01987244763  
0.06017152961  
0.1186321313  
0.1919512163  
0.2748598924  
0.3605578891  
0.4414327751  
0.5099919547  
0.559888936  
0.5868920036  
0.5896314771  
0.5699936588  
0.5330458312  
0.486463466  
0.4395021089  
0.4016253856  
0.3809822119  
0.3829532304  
0.4090103055  
0.4560916935  
0.5166510845  
0.5794094118  
0.630785986  
0.6568043173  
0.6452399381  
0.5876865901  
0.4812085414  
0.3293105953  
0.1420220912  
-0.06496673575  
-0.2720430112  
-0.4580673004  
-0.6031164263  
-0.6911682202  
-0.7123596087  
-0.6644593475  
-0.5533423629  
-0.3923726038  
-0.2007729537  
-0.001204760438  
0.183091927  
0.3312019493  
0.4270588198  
0.4612517876  
0.4318871869  
0.3444098512  
0.2104786152  
0.04609946737  
-0.1306551961  
-0.301986287  
-0.4524286739  
-0.570372067  
-0.6488666766  
-0.6857181125  
-0.6829317982  
-0.6457076873  
-0.5812080493  
-0.4973207744  
-0.4016294206  
-0.3006989221  
-0.1997408352  
-0.1026102905  
-0.01206445395  
0.06986007054  
0.1414589183  
0.2010901028  
0.2470670322  
0.2777525284  
0.2918204747  
0.2886199306  
0.2685531062  
0.2333829371  
0.1863846711  
0.132268583  
0.07686636591  
0.02658061088  
-0.01235541601  
-0.03471108886  
-0.03707616283  
-0.0185369876  
0.01892673028  
0.0704151487  
0.1285086867  
0.1840984765  
0.2275705288  
0.2501893589  
0.245510308  
0.2105679498  
0.1466602263  
0.05951877087  
-0.04117927804  
-0.1429843211  
-0.2323638686  
-0.2967076431  
-0.3263252257  
-0.3161249149  
-0.266672447  
-0.1844290048  
-0.08108936836  
0.027923963  
0.1255952877  
0.1957731521  
0.2255784546  
0.2073929001  
0.1401220688  
0.02954150274  
-0.1123364473  
-0.2687671536  
-0.4204352845  
-0.5479489011  
-0.6343070364  
-0.667005152  
-0.6395000127  
-0.5518627091  
-0.410583984  
-0.227598487  
-0.01872365405  
0.198252996  
0.4055563099  
0.5872367529  
0.7306007463  
0.8271580755  
0.8730346536  
0.8688980959  
0.8194792067  
0.7328255661  
0.6193822947  
0.4910345055  
0.3601641444  
0.2387682698  
0.1376773558  
0.06585661071  
0.02982423982  
0.03319968996  
0.07641551039  
0.1566284404  
0.2678892919  
0.4015673783  
0.5470539881  
0.6926819127  
0.8267956877  
0.9388586544  
1.020474806  
1.066184754  
1.073945907  
1.045214806  
0.9846236696  
0.8992750437  
0.7977622505  
0.6890235446  
0.5812008252  
0.4806428956  
0.3911928344  
0.3138543166  
0.2468827939  
0.1862826785  
0.1266551872  
0.06226288339  
-0.01181790969  
-0.09863251975  
-0.1985161248  
-0.3086428312  
-0.4230224893  
-0.532995258  
-0.6281837468  
-0.6978086947  
-0.7322166211  
-0.7244154959  
-0.67141858  
-0.5751659141  
-0.4428697893  
-0.2866725245  
-0.1226032827  
0.03107229639  
0.1559464505  
0.2357229679  
0.2583495027  
0.2177135943  
0.114658642  
-0.04284481034  
-0.2404351583  
-0.4588884188  
-0.676282908  
-0.8704813496  
-1.021629349  
-1.114327783  
-1.139224749  
-1.093839338  
-0.9825431299  
-0.8157499677  
-0.6084372516  
-0.3782417986  
-0.143361463  
0.07945025215  
0.2765740883  
0.4387163016  
0.5615006784  
0.6454234072  
0.695251682  
0.7189595571  
0.7263765425  
0.7277236955  
0.7322124089  
0.7468634131  
0.7756508445  
0.8190490577  
0.8740013403  
0.9342966044  
0.9912902399  
1.034896894  
1.054747792  
1.041405136  
0.9875181645  
0.8888133731  
0.7448209253  
0.5592725835  
0.3401015857  
0.09904562762  
-0.1491492156  
-0.3878669785  
-0.6000180269  
-0.7695871507  
-0.8831942303  
-0.9315144188  
-0.9104247987  
-0.8217136466  
-0.6732740716  
-0.4786887694  
-0.2562116221  
-0.0272117525  
0.1858173309  
0.3614565577  
0.4815690592  
0.5332412856  
0.5102274528  
0.4137117838  
0.2522705628  
0.04102418723  
-0.1999442722  
-0.4477191589  
-0.6789831254  
-0.8724707769  
-1.011149402  
-1.083883554  
-1.086393499  
-1.021430222  
-0.8981553788  
-0.7308543631  
-0.5371348488  
-0.3358716854  
-0.1451341097  
0.01965020042  
0.1471088208  
0.2307721672  
0.2693088794  
0.2661722939  
0.2287593955  
0.1672261601  
0.09313380051  
0.01809787074  
-0.04741346393  
-0.09502915319  
-0.1191002914  
-0.1170102299  
-0.08917398854  
-0.03880051327  
0.02853864078  
0.1054649212  
0.1834157944  
0.2533266423  
0.3063172714  
0.3343970477  
0.331145431  
0.2923627783  
0.2166307731  
0.1057248066  
-0.03518919819  
-0.1976420463  
-0.3703000758  
-0.5397481973  
-0.6916120413  
-0.8119093538  
-0.8885103757  
-0.9125190917  
-0.879395973  
-0.7896445621  
-0.6489498569  
-0.4677085985  
-0.2599866596  
-0.04201887553  
0.1695679888  
0.359583185  
0.5159278089  
0.6308533864  
0.7016864856  
0.7309165587  
0.725673652  
0.6966627291  
0.6567136131  
0.6191442027  
0.596148855  
0.5974010388  
0.629049049  
0.6931890149  
0.7878502939  
0.9074673046  
1.043726697  
1.186671307  
1.325883047  
1.451602699  
1.555647858  
1.632031644  
1.677243179  
1.690195457  
1.67189077  
1.624901595  
1.55276738  
1.45941328  
1.348690572  
1.224091569  
1.08866357  
0.9451039879  
0.7959897932  
0.6440657611  
0.4925055423  
0.3450797501  
0.2061670704  
0.08057623945  
-0.02679583338  
-0.1114526678  
-0.1698396317  
-0.1998814473  
-0.2014003993  
-0.176363095  
-0.1288981118  
-0.06505849451  
0.007633256938  
0.08083072534  
0.1461078884  
0.1957353454  
0.2233998134  
0.2247888953  
0.1980010031  
0.1437388084  
0.06527425452  
-0.03180750273  
-0.1400732777  
-0.2508794967  
-0.3551383839  
-0.4441739112  
-0.5105800538  
-0.5490199949  
-0.556875444  
-0.5346639407  
-0.4861469092  
-0.4180910671  
-0.3396680415  
-0.2615278633  
-0.1946368664  
-0.1490128746  
-0.1324938981  
-0.1497363741  
-0.2015580657  
-0.2847505997  
-0.3923960401  
-0.51466442  
-0.6399927079  
-0.756496021  
-0.8534143319  
-0.9224085697  
-0.9585123037  
-0.9606316297  
-0.9315187931  
-0.8772492772  
-0.8062756753  
-0.7282282788  
-0.6526200666  
-0.5876663413  
-0.5393684956  
-0.5109808747  
-0.5029164837  
-0.5130646315  
-0.537434261  
-0.5709934174  
-0.6085469802  
-0.6455041524  
-0.6784157881  
-0.7052195896  
-0.7251771711  
-0.7385619965  
-0.7461825862  
-0.7488594463  
-0.7469734484  
-0.7401687804  
-0.727274592  
-0.706443785  
-0.6754727485  
-0.6322450838  
-0.5751962614  
-0.5037267491  
-0.4184889561  
-0.3215102777  
-0.216127808  
-0.106762896  
0.001440431362  
0.1030520553  
0.1928172666  
0.2660944782  
0.3192300498  
0.3498375933  
0.3569820198  
0.3412661355  
0.3048126363  
0.2511796947  
0.1851917492  
0.1126941981  
0.04024907358  
-0.02525869384  
-0.07707122349  
-0.1090634194  
-0.116268678  
-0.09537982928  
-0.04515691476  
0.03331422551  
0.1365691261  
0.2589580647  
0.393082837  
0.5304422803  
0.6622201065  
0.7801131404  
0.8770990288  
0.9480449334  
0.9900876965  
1.002753444  
0.9878286209  
0.949027072  
0.8915270614  
0.8214729197  
0.7454913983  
0.670299668  
0.6024155117  
0.5479741547  
0.5125956227  
0.501294015  
0.5183454422  
0.5671056609  
0.6497464719  
0.7669316528  
0.9174632799  
1.097964398  
1.302656395  
1.523308753  
1.749412251  
1.96861604  
2.167419114  
2.332082037  
2.449694961  
2.509284  
2.502848434  
2.426201372  
2.279512  
2.067480762  
1.799113091  
1.487114865  
1.146976967  
0.7958374579  
0.4512371424  
0.1298933669  
-0.1534142436  
-0.3867576595  
-0.5617249173  
-0.6738073959  
-0.7225175399  
-0.7112491843  
-0.6469325077  
-0.5395077515  
-0.4012694665  
-0.2461141991  
-0.08872422414  
0.05628389143  
0.1752211349  
0.2561593795  
0.2897029912  
0.26964301  
0.1934347143  
0.06245320707  
-0.1180369744  
-0.3392176126  
-0.5893585908  
-0.8547324468  
-1.120731684  
-1.373084888  
-1.599043575  
-1.788428404  
-1.934396307  
-2.033869704  
-2.08755634  
-2.099575253  
-2.07674667  
-2.027620925  
-1.961388697  
-1.886802011  
-1.811233084  
-1.739985362  
-1.675929775  
-1.619478262  
-1.56889056  
-1.520839668  
-1.471140569  
-1.415548284  
-1.350502131  
-1.273728409  
-1.184628279  
-1.084395921  
-0.9758603082  
-0.863046133  
-0.7504961389  
-0.6424182486  
-0.541739641  
-0.4491883013  
-0.3625375343  
-0.2761658936  
-0.1810511385  
-0.06533938844  
0.08449598727  
0.2819165335  
0.5381604131  
0.8598877427  
1.24697148  
1.690793212  
2.173427451  
2.667980879  
3.140263435  
3.551740303  
3.863524502  
4.040951705  
4.058144162  
3.901878856  
3.574132757  
3.092806368  
2.490422431  
1.810833301  
1.10437032  
