1668.758298  
1766.282813  
1962.141552  
2361.670562  
3560.800603  
35.95396649  
70220.56252  
10423.52887  
49867.47473  
2533.358678  
4953.948325  
6162.590902  
513.4914925  
2541.283878  
42728.55084  
8131.966797  
18609.60671  
42219.75265  
2765.263052  
5579.447441  
21106.89577  
3742.451794  
4727.049195  
1988.532778  
3784.808464  
5795.292775  
15409.54665  
9167.65602  
21229.7829  
15694.40563  
2646.749388  
8236.449132  
3794.166906  
970.4771389  
1324.586695  
12276.38507  
5498.477967  
2894.541478  
966.7754205  
1768.132094  
4626.805536  
2573.576105  
1200.585008  
4815.360684  
1902.187073  
1979.454371  
1446.456983  
156.1973102  
3588.450179  
2018.544583  
11020.27619  
895.673849  
17300.26908  
493.8865749  
1444.398829  
123.1934903  
1722.655106  
1039.735362  
1562.707075  
912.0032206  
1017.212857  
1462.061173  
750.7425219  
688.4343257  
145.1487727  
92.7384806  
494.9167375  
59.98150348  
168.92611  
29.51996858  
2.366741752  
6.092214082  
17.62916778  
6.773238003  
2.130565861  
10.93591578  
4.21856269  
11.7693106  
2.128814005  
0.4630256717  
6.12077717  
3.902836084  
3.581430585  
3.688275424  
4.749182337  
3.207459293  
2.710615268  
2.510581645  
2.950265066  
2.829619101  
2.363121291  
2.437396904  
2.352380946  
2.204091579  
2.31560892  
2.055714239  
1.946080595  
1.913051365  
1.979993798  
1.950332813  
1.759627906  
1.71235612  
1.722481054  
1.560878016  
1.547931701  
1.47923594  
1.456016434  
1.396189263  
1.353918914  
1.314128501  
1.273060825  
1.232935699  
1.199749708  
1.171965505  
1.135959035  
1.101292865  
1.0710635  
1.043114258  
1.014787275  
0.9883494776  
0.961893243  
0.9358822497  
0.9119050857  
0.8887742  
0.8673367123  
0.8459993458  
0.8247875967  
0.8053590498  
0.7862829861  
0.767622084  
0.7496222257  
0.7325344195  
0.7157156973  
0.6997501639  
0.684320411  
0.669198929  
0.6547211519  
0.6407857988  
0.6270865629  
0.6139492437  
0.6011630245  
0.5888019366  
0.5768917306  
0.5652983818  
0.5540539232  
0.5431431869  
0.5325599071  
0.5222991232  
0.5123327887  
0.502649591  
0.4932418173  
0.48413296  
0.4752654716  
0.4666452434  
0.4582833696  
0.4501538924  
0.4422312917  
0.4345192509  
0.4270419901  
0.4197351582  
0.4126427381  
0.4057375396  
0.3989928148  
0.3924395726  
0.3860497162  
0.3798426746  
0.3737665997  
0.3678517328  
0.362100696  
0.3564824285  
0.3509863299  
0.3456409047  
0.3404250324  
0.3353249417  
0.3303574337  
0.3254988311  
0.3207639354  
0.3161393783  
0.3116059219  
0.3071897128  
0.3028936507  
0.2986586474  
0.2945273511  
0.29049444  
0.2865594507  
0.2827102216  
0.278931771  
0.275260235  
0.2716500796  
0.2681186859  
0.2646726614  
0.2612785966  
0.2579633768  
0.2547429131  
0.2515580948  
0.2484585208  
0.2454246088  
0.2424418588  
0.2395121507  
0.2366375131  
0.2338562065  
0.2311058412  
0.2284074963  
0.2257789731  
0.2231953921  
0.2206434283  
0.2181610606  
0.2157163074  
0.2133297058  
0.2109722175  
0.208667546  
0.2064079834  
0.2041995916  
0.2020215193  
0.1998741111  
0.1977802362  
0.1957102537  
0.1936918018  
0.1917169787  
0.1897514834  
0.1878450575  
0.1859614203  
0.1841199715  
0.1823030696  
0.1805066628  
0.1787633761  
0.1770435942  
0.1753471384  
0.1736887611  
0.1720405362  
0.1704534088  
0.1688700442  
0.1673172449  
0.1657872923  
0.1642783586  
0.1628060492  
0.161352591  
0.1599220153  
0.1585061858  
0.157128617  
0.1557647663  
0.1544223683  
0.1530937488  
0.1518124883  
0.1505347187  
0.1492819989  
0.1480496729  
0.1468220331  
0.1456243562  
0.1444429687  
0.1432848199  
0.1421501914  
0.1410169779  
0.1399055709  
0.1388090378  
0.137731884  
0.1366875089  
0.1356405903  
0.1346163817  
0.1336015396  
0.1325992199  
0.1316209644  
0.1306428609  
0.1296907533  
0.128752974  
0.127817576  
0.1269143013  
0.1260115206  
0.1251174293  
0.1242478212  
0.1233865165  
0.1225313702  
0.1216965793  
0.1208689659  
0.1200496899  
0.1192585923  
0.1184596158  
0.1176803034  
0.1169087188  
0.1161481984  
0.1153975738  
0.114660094  
0.1139384306  
0.1132134955  
0.1125006808  
0.1118040557  
0.1111090173  
0.110428974  
0.1097584713  
0.1090914724  
0.1084532405  
0.1077912365  
0.1071659382  
0.1065405747  
0.1059142484  
0.1052956016  
0.1046982942  
0.1040933274  
0.103512271  
0.1029265843  
0.1023604291  
0.1017859394  
0.1012330978  
0.1006807191  
0.1001280129  
0.09959537005  
0.09906690656  
0.09854514099  
0.09801866405  
0.09751338831  
0.09700243318  
0.09650877098  
0.09602091309  
0.09553273713  
0.09505581557  
0.09457576225  
0.09411682513  
0.09365236173  
0.09319219909  
0.09274695113  
0.09230930725  
0.09186793716  
0.0914272957  
0.09101236595  
0.09058060801  
0.09016313033  
0.08975752861  
0.08933809534  
0.08894801544  
0.08855002748  
0.08815726074  
0.08777176356  
0.08738584672  
0.08700140389  
0.0866306303  
0.0862606581  
0.08590681159  
0.08553533924  
0.08518438908  
0.0848406514  
0.08448156873  
0.0841393778  
0.08380200488  
0.08346621873  
0.08314770075  
0.08280768536  
0.08249003457  
0.08217179511  
0.08186152291  
0.08154434381  
0.0812346192  
0.08093004892  
0.08063726456  
0.08033988223  
0.08004303473  
0.07975999954  
0.07947424715  
0.07919332265  
0.07891730142  
0.07863625872  
0.07836083159  
0.07809470936  
0.07783337172  
0.07757295419  
0.07731172906  
0.07706379331  
0.07681138076  
0.0765537218  
0.076313582  
0.07606442039  
0.07583308984  
0.07559562639  
0.0753549397  
0.07512486167  
0.07489546333  
0.07467004755  
0.07445299076  
0.07423785712  
0.07401550317  
0.07379670717  
0.07359609344  
0.07338503255  
0.07317484773  
0.07297686143  
0.07277152018  
0.07257413697  
0.07237897075  
0.07218895915  
0.07200233316  
0.0718037016  
0.07161399951  
0.07144527195  
0.07126820467  
0.07107757313  
0.0708995122  
0.07072867839  
0.07056319552  
0.07038771991  
0.07022070817  
0.07005436897  
0.0698924527  
0.06973645497  
0.06958404202  
0.06942430398  
0.06927794818  
0.0691222195  
0.06897595924  
0.06882384328  
0.06867766133  
0.06853906463  
0.06839118976  
0.06826589722  
0.06813089321  
0.06799259163  
0.06785778314  
0.06773742393  
0.06760363568  
0.06748421993  
0.06735195002  
0.0672322895  
0.06710541058  
0.06699551776  
0.06687518315  
0.06676169124  
0.06664729995  
0.06653808972  
0.06642856243  
0.06631996578  
0.06622212949  
0.06611229327  
0.06600755076  
0.06591096805  
0.06580973671  
0.06572169137  
0.06562163234  
0.06552786099  
0.06544628929  
0.06535148671  
0.0652654224  
0.06517874338  
0.06509289813  
0.0650163418  
0.06492536287  
0.06484863564  
0.06477057902  
0.0646953991  
0.06463061299  
0.06454733848  
0.06448651844  
0.06441548516  
0.06434994205  
0.06428744366  
0.06422292327  
0.0641498161  
0.06409882911  
0.06403309006  
0.06397583465  
0.06392438328  
0.06386407334  
0.06381892937  
0.06376776457  
0.06371411046  
0.06366799927  
0.06362157642  
0.06357726394  
0.0635321596  
0.06348773161  
0.06345133052  
0.06341325594  
0.06337561975  
0.06333238241  
0.06330713051  
0.06327207472  
0.0632419561  
0.06321113529  
0.0631864001  
0.0631586179  
0.06313936905  
0.06311127454  
0.06309267063  
0.06306877188  
0.06305734775  
0.06303934594  
0.06302287079  
0.06300149726  
0.06299098438  
0.0629778578  
0.06297441677  
0.06295926326  
0.06295386962  
0.06295328894  
0.06294741816  
0.06294097807  
0.06293905444  
