9361.708093  
9361.688433  
9362.19557  
9363.66025  
9366.3459  
9370.297654  
9375.325333  
9381.023409  
9386.824904  
9392.081209  
9396.155749  
9398.517421  
9398.819814  
9396.954525  
9393.070951  
9387.559978  
9381.004419  
9374.103771  
9367.584611  
9362.109417  
9358.196558  
9356.162053  
9356.09004  
9357.834631  
9361.051053  
9365.250105  
9369.866972  
9374.334153  
9378.148359  
9380.923031  
9382.42083  
9382.563871  
9381.422763  
9379.188488  
9376.133038  
9372.565698  
9368.791609  
9365.077995  
9361.631696  
9358.589381  
9356.019702  
9353.935035  
9352.309245  
9351.09753  
9350.254654  
9349.748648  
9349.568261  
9349.723674  
9350.24118  
9351.153533  
9352.488096  
9354.255251  
9356.439153  
9358.992419  
9361.835579  
9364.861399  
9367.943349  
9370.947002  
9373.742805  
9376.218594  
9378.290238  
9379.909198  
9381.066144  
9381.790104  
9382.14334  
9382.21222  
9382.095137  
9381.888558  
9381.67278  
9381.498866  
9381.37853  
9381.2783  
9381.119045  
9380.781487  
9380.117563  
9378.966829  
9377.176362  
9374.622178  
9371.229624  
9366.990337  
9361.973491  
9356.329639  
9350.286273  
9344.134972  
9338.211148  
9332.867994  
9328.447109  
9325.248541  
9323.503226  
9323.350537  
9324.823359  
9327.842309  
9332.219836  
9337.674117  
9343.851385  
9350.354718  
9356.776499  
9362.731277  
9367.885957  
9371.984236  
9374.863169  
9376.460327  
9376.811251  
9376.037955  
9374.330181  
9371.92184  
9369.065687  
9366.009224  
9362.974523  
9360.14397  
9357.653046  
9355.589992  
9354.001416  
9352.901814  
9352.284743  
9352.133199  
9352.427167  
9353.147153  
9354.2733  
9355.78079  
9357.632982  
9359.774406  
9362.12556  
9364.581593  
9367.015766  
9369.288163  
9371.258665  
9372.802591  
9373.826465  
9374.281372  
9374.171317  
9373.554862  
9372.539243  
9371.267412  
9369.899759  
9368.593052  
9367.47973  
9366.65083  
9366.144934  
9365.944833  
9365.98227  
9366.149774  
9366.317634  
9366.353363  
9366.140666  
9365.59545  
9364.676755  
9363.391718  
9361.794434  
9359.979501  
9358.071639  
9356.212964  
9354.549458  
9353.217901  
9352.334016  
9351.982403  
9352.208344  
9353.011689  
9354.343043  
9356.102717  
9358.143111  
9360.275421  
9362.281136  
9363.928848  
9364.99574  
9365.292614  
9364.690087  
9363.142889  
9360.708558  
9357.556868  
9353.966875  
9350.30971  
9347.017136  
9344.537972  
9343.286656  
9343.590055  
9345.639686  
9349.45649  
9354.874316  
9361.546017  
9368.973094  
9376.556524  
9383.66308  
9389.698943  
9394.181025  
9396.796252  
9397.44052  
9396.231622  
9393.493962  
9389.716787  
9385.491231  
9381.434481  
9378.111026  
9375.961443  
9375.247869  
9376.023152  
9378.127193  
9381.210561  
9384.781519  
9388.269938  
9391.099453  
9392.758464  
9392.861243  
9391.19201  
9387.727378  
9382.635577  
9376.253704  
9369.046922  
9361.555335  
9354.335272  
9347.901909  
9342.679397  
9338.963343  
9336.89885  
9336.475249  
9337.537019  
9339.8086  
9342.929681  
9346.496718  
9350.106048  
9353.39424  
9356.071711  
9357.946609  
9358.937018  
9359.070736  
9358.473281  
9357.345771  
9355.935539  
9354.502913  
9353.288126  
9352.482162  
9352.204982  
9352.493709  
9353.301972  
9354.51055  
9355.947563  
9357.41553  
9358.72151  
9359.706031  
9360.266798  
9360.373674  
9360.072816  
9359.479231  
9358.758805  
9358.102453  
9357.696118  
9357.691248  
9358.180173  
9359.180241  
9360.629172  
9362.392467  
9364.281651  
9366.080569  
9367.575563  
9368.584852  
9368.982556  
9368.713671  
9367.798103  
9366.323429  
9364.428242  
9362.279303  
9360.046895  
9357.882825  
9355.904961  
9354.190798  
9352.780695  
9351.689433  
9350.92297  
9350.496025  
9350.445917  
9350.838479  
9351.763449  
9353.318842  
9355.586146  
9358.600463  
9362.321257  
9366.610204  
9371.2219  
9375.811744  
9379.962606  
9383.228603  
9385.191267  
9385.520486  
9384.031162  
9380.726193  
9375.817661  
9369.721084  
9363.021106  
9356.411519  
9350.616387  
9346.302428  
9343.994394  
9344.005318  
9346.391773  
9350.940816  
9357.191004  
9364.484913  
9372.046364  
9379.071939  
9384.82456  
9388.71693  
9390.37427  
9389.669036  
9386.724428  
9381.887847  
9375.679493  
9368.724313  
9361.676989  
9355.150024  
9349.653529  
9345.552881  
9343.04762  
9342.171609  
9342.811666  
9344.739944  
9347.653975  
9351.218412  
9355.102926  
9359.01246  
9362.707523  
9366.014089  
9368.824118  
9371.088969  
9372.808222  
9374.016795  
9374.772508  
9375.145676  
9375.21149  
9375.044981  
9374.717865  
9374.296263  
9373.838207  
9373.390275  
9372.98325  
9372.6274  
9372.30848  
9371.986086  
9371.595808  
9371.056363  
9370.281857  
9369.198358  
9367.762597  
9365.979671  
9363.916086  
9361.704506  
9359.537672  
9357.65036  
9356.290574  
9355.683337  
9355.992227  
9357.28507  
9359.510273  
9362.488818  
9365.925147  
9369.43674  
9372.599327  
9375.001614  
9376.301731  
9376.27669  
9374.857259  
9372.142466  
9368.391239  
9363.991996  
9359.41442  
9355.150234  
9351.651316  
9349.273749  
9348.235264  
9348.591494  
9350.233584  
9352.906688  
9356.246108  
9359.825634  
9363.211304  
9366.013489  
9367.930846  
9368.781036  
9368.515143  
9367.214944  
9365.07432  
9362.368145  
9359.413227  
9356.526781  
9353.987704  
9352.005605  
9350.700956  
9350.098432  
9350.133487  
9350.6706  
9351.530019  
9352.518893  
9353.462137  
9354.228629  
9354.749186  
9355.023943  
9355.118514  
9355.149884  
9355.264501  
9355.612086  
9356.319181  
9357.466409  
9359.072661  
9361.088462  
9363.399279  
9365.838248  
9368.206479  
9370.298249  
9371.927673  
9372.953497  
9373.298839  
9372.963291  
9372.025847  
9370.638062  
9369.008017  
9367.376815  
9365.990089  
9365.067914  
9364.776526  
9365.205392  
9366.352589  
9368.120603  
9370.3235  
9372.705029  
9374.96602  
9376.797917  
9377.918726  
9378.106874  
9377.228944  
9375.257489  
9372.276835  
9368.475816  
9364.128553  
9359.565678  
9355.139679  
9351.188935  
9348.00473  
9345.805185  
9344.718703  
9344.778181  
9345.92561  
9348.025321  
9350.883361  
9354.269702  
9357.940608  
9361.658555  
9365.208319  
9368.408608  
9371.119408  
9373.24575  
9374.738694  
9375.594352  
9375.851141  
9375.585391  
9374.90493  
9373.940413  
9372.834345  
9371.728088  
9370.748  
9369.991955  
9369.518133  
9369.33769  
9369.412815  
9369.660774  
9369.963954  
9370.184822  
9370.184128  
9369.840003  
9369.065482  
9367.822047  
9366.127341  
9364.055946  
9361.732918  
9359.32097  
9357.002715  
9354.960354  
9353.355291  
9352.310267  
9351.896187  
9352.12521  
9352.950836  
9354.274759  
9355.959469  
9357.84483  
9359.766471  
9361.573608  
9363.144127  
9364.395142  
9365.287929  
9365.826898  
9366.052974  
9366.03266  
9365.844443  
9365.564626  
9365.254691  
9364.951899  
9364.664648  
9364.373059  
9364.034731  
9363.594723  
9362.99828  
9362.204183  
9361.196745  
9359.994303  
9358.652737  
9357.263139  
9355.94356  
9354.825864  
9354.039259  
9353.692823  
9353.859552  
9354.56426  
9355.777071  
9357.413698  
9359.34245  
9361.397249  
9363.394913  
9365.15482  
9366.518428  
9367.366711  
9367.633503  
9367.31362  
9366.464857  
9365.203754  
9363.695434  
9362.138281  
9360.744635  
9359.719019  
9359.23572  
9359.417789  
9360.319703  
9361.915677  
9364.095693  
9366.670479  
9369.385948  
9371.94661  
9374.046146  
9375.402353  
9375.792478  
9375.084713  
9373.261388  
9370.430215  
9366.821143  
9362.768096  
9358.676916  
9354.982619  
9352.100883  
9350.379446  
9350.055562  
9351.224907  
9353.826107  
9357.643145  
9362.325617  
9367.424746  
9372.440887  
9376.877111  
9380.292564  
9382.349402  
9382.848071  
9381.746986  
9379.164681  
9375.364563  
9370.724376  
9365.694324  
9360.748888  
9356.33796  
9352.84276  
9350.54122  
9349.586112  
9349.997454  
9351.669124  
9354.387701  
9357.860561  
9361.749193  
9365.703708  
9369.394795  
9372.540097  
9374.923093  
9376.403788  
9376.921444  
9376.490488  
9375.191312  
9373.15764  
9370.562217  
9367.602147  
9364.484693  
9361.414163  
9358.580003  
9356.146278  
9354.242733  
9352.957677  
9352.333244  
9352.36346  
9352.995696  
9354.135711  
9355.6561  
9357.407767  
9359.233227  
9360.98067  
9362.51718  
9363.739826  
9364.58341  
9365.024122  
9365.078771  
9364.799874  
9364.267171  
9363.576705  
9362.828747  
9362.115993  
9361.513438  
9361.071076  
9360.8103  
9360.72429  
9360.782346  
9360.937374  
9361.135467  
9361.326137  
9361.471633  
9361.553914  
9361.578169  
9361.572266  
9361.582142  
9361.663751  
9361.872814  
9362.253965  
9362.831132  
9363.600913  
9364.530165  
9365.558794  
9366.607435  
9367.589233  
9368.423944  
9369.05208  
9369.446307  
9369.617965  
9369.616673  
9369.52247  
9369.431069  
9369.434172  
9369.598062  
9369.944282  
9370.436302  
9370.97542  
9371.407789  
9371.542665  
9371.180005  
9370.143666  
9368.315263  
9365.663151  
9362.261374  
9358.294673  
9354.047737  
9349.878999  
9346.18201  
9343.339091  
9341.673554  
9341.407028  
9342.627914  
9345.275402  
9349.141434  
9353.890446  
9359.094253  
9364.277538  
9368.967993  
9372.744851  
9375.280116  
9376.367863  
9375.93909  
9374.061473  
9370.925354  
9366.818943  
9362.096568  
9357.144271  
9352.346647  
9348.058014  
9344.579856  
9342.145424  
9340.911016  
9340.953101  
9342.269817  
9344.7855  
9348.357434  
9352.784145  
9357.815487  
9363.16468  
9368.522819  
9373.575867  
9378.023854  
9381.601252  
9384.097042  
9385.372485  
9385.374512  
9384.142909  
9381.809903  
9378.59162  
9374.77174  
9370.678647  
9366.658212  
9363.044873  
9360.133941  
9358.157971  
9357.269511  
9357.531825  
9358.918204  
9361.319466  
9364.558394  
9368.409004  
9372.618259  
9376.927646  
9381.092307  
9384.895935  
9388.160362  
9390.749505  
9392.568224  
9393.557271  
9393.685969  
9392.944562  
9391.337966  
9388.882412  
9385.605789  
9381.551664  
9376.786269  
9371.406734  
9365.548701  
9359.390927  
9353.154967  
9347.098551  
9341.502175  
9336.649622  
9332.804111  
9330.182797  
9328.932744  
9329.111721  
9330.676688  
9333.48208  
9337.288756  
9341.783159  
9346.605044  
9351.380699  
9355.758073  
9359.439662  
9362.209275  
9363.949436  
9364.647333  
9364.38879  
9363.341094  
9361.727292  
9359.795553  
9357.787908  
9355.912772  
9354.324913  
9353.115536  
9352.313316  
9351.895743  
9351.808242  
9351.987501  
9352.384479  
9352.982734  
9353.808493  
9354.929904  
9356.44519  
9358.461028  
9361.064509  
9364.293397  
9368.110057  
9372.384281  
9376.889155  
9381.312309  
9385.282441  
9388.408699  
9390.328102  
9390.754644  
9389.523103  
9386.62086  
9382.202537  
9376.584598  
9370.219616  
9363.653  
9357.467217  
9352.220379  
9348.386838  
9346.30699  
9346.15234  
9347.90963  
9351.385364  
9356.229632  
9361.975556  
9368.089259  
9374.024199  
9379.273684  
9383.416039  
9386.148179  
9387.305005  
9386.863911  
9384.935145  
9381.740585  
9377.58401  
9372.816884  
9367.80342  
9362.888462  
9358.370893  
9354.484444  
9351.386771  
9349.156721  
9347.798956  
9347.254544  
9347.415824  
9348.143608  
9349.284939  
9350.689774  
9352.22509  
9353.78542  
9355.299016  
9356.729375  
9358.07214  
9359.347978  
9360.592322  
9361.843309  
9363.129374  
9364.458332  
9365.809418  
9367.129792  
9368.336337  
9369.32302  
9369.973306  
9370.176244  
9369.844193  
9368.929596  
9367.438197  
9365.436256  
9363.050179  
9360.457919  
9357.872772  
9355.521505  
9353.619566  
9352.346809  
9351.827154  
9352.115097  
9353.191053  
9354.966028  
9357.294896  
9359.99605  
9362.874508  
9365.744759  
9368.450032  
9370.87529  
9372.952262  
9374.656379  
9375.996805  
9377.001853  
9377.7029  
9378.120002  
9378.251977  
9378.072856  
9377.535317  
9376.580438  
9375.151984  
9373.212529  
9370.75851  
9367.831366  
9364.522616  
9360.971608  
9357.355914  
9353.875404  
9350.732052  
9348.108232  
9346.146442  
9344.933358  
9344.490413  
9344.772285  
9345.67349  
9347.042205  
9348.699445  
9350.46101  
9352.159291  
9353.662188  
9354.886892  
9355.806947  
9356.452186  
9356.901839  
9357.272  
9357.699174  
9358.321921  
9359.262471  
9360.610161  
9362.408089  
9364.64414  
9367.247243  
9370.089323  
9372.993345  
9375.747258  
9378.123339  
9379.901623  
9380.895531  
9380.976965  
9380.097733  
9378.303999  
9375.740914  
9372.645531  
9369.327552  
9366.139266  
9363.43764  
9361.543105  
9360.700336  
9361.04635  
9362.590573  
9365.209883  
9368.659794  
9372.600501  
9376.634591  
9380.351528  
9383.373032  
9385.39362  
9386.21109  
9385.743497  
9384.03102  
9381.223307  
9377.554899  
9373.312863  
9368.801553  
9364.309529  
9360.082961  
9356.308423  
9353.106469  
9350.535352  
9348.602845  
9347.282876  
9346.533175  
9346.310274  
9346.579025  
9347.314987  
9348.499695  
9350.110092  
9352.104939  
9354.411556  
9356.916377  
9359.462382  
9361.855269  
9363.878596  
9365.316679  
9365.98221  
9365.744656  
9364.554818  
9362.461209  
9359.614868  
9356.26083  
9352.716289  
9349.337602  
9346.480122  
9344.455969  
9343.495565  
9343.718349  
9345.117014  
9347.557838  
9350.797501  
9354.514278  
9358.349696  
9361.954859  
9365.035134  
9367.386989  
9368.921634  
9369.672308  
9369.784002  
9369.487165  
9369.059258  
9368.779658  
9368.884587  
9369.528755  
9370.759565  
9372.507611  
9374.595404  
9376.762845  
9378.706  
9380.123227  
9380.761734  
9380.45756  
9379.162567  
9376.954495  
9374.02834  
9370.670393  
9367.218954  
9364.017654  
9361.368608  
9359.492285  
9358.500095  
9358.383416  
9359.020228  
9360.197798  
9361.647358  
