55.46462234  
63.1752691  
81.1044102  
128.4948968  
344.7397105  
137.6737072  
4474.120045  
4593.690096  
33913.81177  
17149.08686  
36130.17834  
66571.8177  
24337.66108  
36528.2838  
17304.63376  
9519.020957  
6912.690338  
8379.686625  
27717.12802  
15227.28171  
5294.029301  
25367.34621  
6514.854302  
3416.613635  
3078.095649  
18098.0865  
106.8841125  
1095.889695  
318.6590339  
12179.47402  
455.273166  
7395.089285  
1454.335872  
14453.25865  
2531.159634  
1857.799262  
2926.447896  
1470.905927  
3099.452699  
6403.286431  
3018.826651  
6892.489653  
5220.585929  
12526.76435  
1868.53215  
132.944042  
1527.554161  
3771.340269  
2210.67234  
1126.677421  
2254.627091  
1204.460744  
6541.026815  
766.0332065  
1328.233699  
3361.229034  
374.5000823  
2667.782943  
431.8688174  
311.5298195  
733.6050231  
464.9756083  
66.0243849  
808.1521347  
263.2030675  
41.36957529  
200.3746895  
74.03336384  
23.98919823  
78.99544721  
26.72868479  
14.68780944  
9.136497674  
11.5572415  
5.928806631  
11.55938082  
2.616013994  
4.479794602  
7.759582176  
3.040445442  
6.210884611  
3.683111761  
3.239351158  
3.716404364  
3.736141216  
2.106828775  
2.978829327  
2.675736589  
2.281961075  
2.679121427  
2.263979271  
1.972106521  
2.120347635  
1.899474854  
1.821647489  
1.828720216  
1.599174877  
1.491785264  
1.544473128  
1.40785493  
1.370894431  
1.303660763  
1.226008018  
1.173688145  
1.123977886  
1.065068891  
1.029579572  
0.9849077799  
0.9477493602  
0.9097018267  
0.8725444054  
0.8361672979  
0.8086553501  
0.7795857046  
0.7481933469  
0.7214662579  
0.6939806014  
0.6708993043  
0.6472213379  
0.6249069799  
0.6040099948  
0.5833560521  
0.5639656403  
0.5466141763  
0.5287865145  
0.5118524723  
0.4959564054  
0.4806947361  
0.4660379377  
0.4524291621  
0.4389861735  
0.4260492401  
0.4137953803  
0.4020350307  
0.3906641804  
0.3798872425  
0.3694849206  
0.3594313992  
0.3498046019  
0.3405579793  
0.3316712222  
0.3230996968  
0.3148557785  
0.3069171526  
0.2992497684  
0.2918674142  
0.2847567243  
0.2778967553  
0.2712603335  
0.2648518183  
0.2586956144  
0.2527268881  
0.2469555833  
0.2413822688  
0.2359920428  
0.2307802969  
0.225727721  
0.220848018  
0.2161186497  
0.2115499093  
0.2071083208  
0.2028054094  
0.1986471386  
0.1946096825  
0.1906953663  
0.1868794663  
0.1831951977  
0.1796408889  
0.1761523641  
0.1727890453  
0.1695068134  
0.1663350232  
0.1632369721  
0.1602322502  
0.1573131669  
0.1544769891  
0.1517189811  
0.1490169774  
0.1464075746  
0.1438624053  
0.1413968434  
0.1389735003  
0.1366115155  
0.134341097  
0.1321072865  
0.1299391399  
0.1278254546  
0.1257698972  
0.123742346  
0.1217787439  
0.1198733914  
0.1180083074  
0.1161798027  
0.1144028254  
0.1126760644  
0.1109758123  
0.1093281568  
0.1077092183  
0.1061379768  
0.1045947408  
0.1030972942  
0.1016311605  
0.100193505  
0.09878557401  
0.09741508406  
0.09607274951  
0.0947583662  
0.09347818466  
0.0922233412  
0.09098810549  
0.08979639056  
0.08861481996  
0.08746723642  
0.08633525703  
0.08523309891  
0.08416787559  
0.08309685813  
0.0820603178  
0.08105784275  
0.08005442755  
0.07909244266  
0.07813885677  
0.07719681617  
0.07628645638  
0.07539713079  
0.07451280348  
0.07364890156  
0.0727995254  
0.07197770414  
0.07115822656  
0.0703551792  
0.06957843232  
0.06881473626  
0.06806466806  
0.0673229864  
0.06660509272  
0.06588264287  
0.065188764  
0.06450145541  
0.06382984871  
0.06317323202  
0.06251894438  
0.06187900344  
0.06125898719  
0.06064402638  
0.06003239504  
0.05944278409  
0.05886458426  
0.058292979  
0.05773676678  
0.05718054723  
0.05663351364  
0.05610577601  
0.0555754084  
0.05505579648  
0.05454759247  
0.05405547533  
0.05356061309  
0.05308130934  
0.05260914248  
0.05214329269  
0.05168835329  
0.05123567298  
0.05078611946  
0.05035333657  
0.04991759299  
0.0494972304  
0.04908270559  
0.04867850228  
0.04827340087  
0.04787760991  
0.04748391053  
0.04710370849  
0.04672190236  
0.04635174725  
0.04598304203  
0.04561937206  
0.04526655099  
0.04491890493  
0.04457272445  
0.04423762098  
0.04390662992  
0.04357878604  
0.043250142  
0.0429375674  
0.04261693254  
0.04230650249  
0.04199994567  
0.0416991802  
0.04140673722  
0.04110767597  
0.04082524061  
0.04054172162  
0.04026247892  
0.03998702213  
0.03972334856  
0.03944393037  
0.03918552923  
0.03892466763  
0.03866751513  
0.03842069712  
0.0381645347  
0.0379191713  
0.03768229961  
0.0374452026  
0.03721059588  
0.03697516929  
0.03674444426  
0.03652086642  
0.03629905216  
0.03607788911  
0.03586006039  
0.03565026371  
0.03543877584  
0.03523685571  
0.03502797215  
0.0348227693  
0.03462892481  
0.03442881411  
0.03423702775  
0.03404738213  
0.03384877126  
0.03367354704  
0.03348589022  
0.0333032648  
0.03312419703  
0.03294988869  
0.03277453923  
0.03259923584  
0.0324311745  
0.03226826283  
0.0321001602  
0.03194082295  
0.03177620692  
0.03161276029  
0.03146329558  
0.03130856362  
0.03115547681  
0.03100377796  
0.03085481215  
0.03071044114  
0.0305657583  
0.03042379077  
0.03028219695  
0.03014405213  
0.03001031353  
0.02986591639  
0.02973892271  
0.02960570394  
0.02947575835  
0.02934718793  
0.02922130997  
0.02909340859  
0.02897258935  
0.02884919495  
0.02872629471  
0.0286115664  
0.02849253126  
0.02837808874  
0.0282680904  
0.02815026275  
0.02803790387  
0.02792844625  
0.02782069236  
0.02771749426  
0.02760965497  
0.02750453058  
0.02739965802  
0.02730153257  
0.02719444556  
0.02709874434  
0.02700134164  
0.02690327675  
0.02680368399  
0.0267149608  
0.02662323107  
0.02652782741  
0.02643829224  
0.02635242567  
0.02626779611  
0.0261789338  
0.02609080705  
0.02601296998  
0.02592794874  
0.02584141972  
0.02576083666  
0.02568580993  
0.02560258018  
0.02552651967  
0.02545474556  
0.02537366004  
0.02530520339  
0.0252239655  
0.02514929263  
0.02508355974  
0.02501018721  
0.02493915958  
0.02487347038  
0.02480427393  
0.02474173279  
0.02467460253  
0.02460885965  
0.0245467138  
0.02448451935  
0.0244195143  
0.0243622023  
0.02429911297  
0.02423992337  
0.02418354682  
0.02412092712  
0.0240668688  
0.02400968183  
0.02395537492  
0.02390276376  
0.02384742812  
0.02379674275  
0.02374523601  
0.02368975237  
0.02364503415  
0.02359593228  
0.02354403469  
0.02349733863  
0.02344998832  
0.0234029771  
0.0233598753  
0.02331763655  
0.02327138612  
0.02323001015  
0.02318497147  
0.02314415177  
0.0231017962  
0.02306092358  
0.02302518472  
0.02299036236  
0.02295219243  
0.02291151035  
0.02287638003  
0.02283960105  
0.02280707981  
0.02277041131  
0.02273883576  
0.0227061131  
0.02267600106  
0.02264140577  
0.0226121582  
0.02258104805  
0.02255620729  
0.02252567161  
0.02249624213  
0.02247116135  
0.02244137471  
0.02241584649  
0.02238907242  
0.02236833312  
0.02233884491  
0.02231331124  
0.02229680566  
0.02227372064  
0.02224722769  
0.02222818341  
0.02221269803  
0.02219018715  
0.02217127344  
0.02215045634  
0.02213209624  
0.02211942382  
0.02210538167  
0.02208664672  
0.02206890642  
0.02205235448  
0.02203996221  
0.02202703632  
0.02201561952  
0.02200107332  
0.02198931218  
0.02198252416  
0.02196841302  
0.02195956192  
0.02195268307  
0.02193977478  
0.02193569179  
0.02192469535  
0.02191917135  
0.02191185179  
0.02190618084  
0.02190237022  
0.02189629667  
0.02189616362  
0.02188891031  
0.02188783033  
0.02188788581  
0.02188496894  
0.0218835989  
0.02188658691  
