0.1449117007  
0.4528203037  
0.7325215719  
0.9621922091  
1.125531836  
1.213473733  
1.225006859  
1.166971196  
1.052908065  
0.901097323  
0.7320853932  
0.5660288804  
0.4202077581  
0.3070572958  
0.2329425142  
0.197824913  
0.1958285723  
0.2165975336  
0.2472079801  
0.2743569301  
0.2865010104  
0.2756276603  
0.2384423372  
0.1767820851  
0.09725361401  
0.01013457167  
-0.07227046474  
-0.1375726297  
-0.1752706735  
-0.1784574974  
-0.145030325  
-0.07823654782  
0.01352513103  
0.1176112659  
0.2186448641  
0.3004257095  
0.3479919334  
0.3495861937  
0.2982584496  
0.1929135313  
0.03866550825  
-0.153544388  
-0.3680388025  
-0.5860617276  
-0.7878202287  
-0.9546615346  
-1.071137347  
-1.126693911  
-1.116803968  
-1.043397102  
-0.9145399636  
-0.7434117746  
-0.5467126742  
-0.3427049681  
-0.1491324474  
0.01870191439  
0.149468544  
0.2367720299  
0.2794274767  
0.2810689094  
0.2491701691  
0.1936641216  
0.1253918051  
0.05462072957  
-0.01015379826  
-0.062964562  
-0.1006161649  
-0.1224510387  
-0.1297349299  
-0.1248310157  
-0.1103637631  
-0.0885323459  
-0.0607101972  
-0.02739250041  
0.01154755468  
0.05636717404  
0.1068823259  
0.1619679379  
0.2192564673  
0.2751384053  
0.3250754383  
0.3641844852  
0.3879757466  
0.3931166536  
0.3780445785  
0.3433166519  
0.2916127225  
0.227369733  
0.1561159395  
0.08360209164  
0.01491047844  
-0.0463282502  
-0.09842762294  
-0.1417792983  
-0.1785769942  
-0.2121947091  
-0.2463011073  
-0.2839040005  
-0.326467701  
-0.3732977516  
-0.4213060859  
-0.465216163  
-0.498197254  
-0.5128315626  
-0.5022763511  
-0.4614209452  
-0.3878738742  
-0.2826080745  
-0.1501688942  
0.001597955194  
0.1622548959  
0.3198266213  
0.4620648581  
0.5777387669  
0.6578162291  
0.6963764774  
0.6911713207  
0.6437861542  
0.5594018471  
0.4462040846  
0.3145424385  
0.1759228176  
0.04196859279  
-0.07655469418  
-0.1705567911  
-0.2332162813  
-0.2603174932  
-0.2503393453  
-0.2043125921  
-0.125499294  
-0.01895579669  
0.1089714699  
0.251147524  
0.4001146125  
0.5484743708  
0.6891787117  
0.8157354411  
0.9223211064  
1.003845904  
1.056016317  
1.075398106  
1.059542726  
1.007165677  
0.9183675766  
0.7948822371  
0.6402886402  
0.4601524783  
0.2620274204  
0.05529505597  
-0.1492152659  
-0.3398047838  
-0.5046928261  
-0.6329560162  
-0.7155623004  
-0.7463809484  
-0.7230787409  
-0.6477419431  
-0.5271379702  
-0.3725030934  
-0.1988206199  
-0.02360229087  
0.1347338176  
0.258746219  
0.3339027439  
0.3503336997  
0.3041593597  
0.19819682  
0.04189178209  
-0.1495623521  
-0.3568704008  
-0.5588798483  
-0.7351551194  
-0.868561587  
-0.9475112408  
-0.9675331265  
-0.9319377752  
-0.8514295458  
-0.7426918696  
-0.6261073192  
-0.5229072073  
-0.4521326368  
-0.4278492392  
-0.4569976382  
-0.5382075243  
-0.6617597138  
-0.8107078389  
-0.9630351407  
-1.094528672  
-1.181999958  
-1.206402906  
-1.155410775  
-1.025126694  
-0.8207035614  
-0.5557977984  
-0.2509727254  
0.06872306227  
0.3766587056  
0.6476191514  
0.8605160768  
1.000500222  
1.060248907  
1.040334139  
0.9487013048  
0.7993865226  
0.6107053496  
0.4031552896  
0.1973093639  
0.0119289736  
-0.1375266659  
-0.2398946632  
-0.2887687877  
-0.2824732671  
-0.2236274161  
-0.1184071437  
0.0243649333  
0.1941913054  
0.3798441858  
0.5702155208  
0.755013317  
0.9252740013  
1.073695374  
1.194770642  
1.284750336  
1.341450451  
1.363970071  
1.35234751  
1.307249366  
1.22973274  
1.121153084  
0.9832345603  
0.8182977748  
0.6296031877  
0.4217318242  
0.2008817119  
-0.02500394339  
-0.2464031478  
-0.4526872668  
-0.6329272281  
-0.7769415107  
-0.8764579721  
-0.9262241304  
-0.9248831553  
-0.8754406223  
-0.7852322902  
-0.6653377483  
-0.5294957778  
-0.3926404645  
-0.2692631321  
-0.1717867807  
-0.1092052442  
-0.08613350756  
-0.1024097241  
-0.1532665954  
-0.2300502785  
-0.3213579026  
-0.4144401663  
-0.4966853079  
-0.5570043106  
-0.5869597611  
-0.5815406499  
-0.53951376  
-0.4633634172  
-0.3588501021  
-0.2342761928  
-0.09954971791  
0.03483440051  
0.158806764  
0.2636216464  
0.3425827174  
0.3915346626  
0.4091078958  
0.3967059116  
0.3582594294  
0.2997874309  
0.2288108083  
0.1536734595  
0.08284137513  
0.0242133961  
-0.01549375928  
-0.03124899406  
-0.02008800565  
0.01866312423  
0.0833169081  
0.1699137527  
0.2724630155  
0.3833317771  
0.493763338  
0.5945007212  
0.6764951458  
0.7316376786  
0.7534817427  
0.73787933  
0.6834635409  
0.5919380005  
0.4680877484  
0.3195178941  
0.1560912319  
-0.01087714267  
-0.1696284683  
-0.3090544847  
-0.419783133  
-0.4951273697  
-0.5317900837  
-0.5302309832  
-0.494647583  
-0.4325522572  
-0.3539827757  
-0.2704109713  
-0.1934926391  
-0.1337643578  
-0.09945413287  
-0.09553244397  
-0.1231217829  
-0.1793301277  
-0.2575326721  
-0.3480727115  
-0.4393093625  
-0.5188974964  
-0.5751532653  
-0.5983688034  
-0.5819328927  
-0.5231385402  
-0.423597878  
-0.2892251805  
-0.1297915182  
0.04191039659  
0.2112089329  
0.3629080984  
0.4827311509  
0.5587241839  
0.5824941532  
0.5501592301  
0.4629103383  
0.3271069481  
0.1538853565  
-0.04173210723  
-0.2421430158  
-0.4287897892  
-0.5839566517  
-0.6925459401  
-0.7436593578  
-0.7317799051  
-0.6574315749  
-0.5271945246  
-0.3530614385  
-0.1511910925  
0.05982977711  
0.2609892557  
0.4349128329  
0.5676912594  
0.6502859522  
0.6792963792  
0.6570244507  
0.5908338315  
0.491898395  
0.3735331197  
0.2493480514  
0.1314676703  
0.02907295823  
-0.05257160228  
-0.1124819683  
-0.1536981964  
-0.1824764311  
-0.2070627154  
-0.2362317862  
-0.2777923277  
-0.3372629073  
-0.416869725  
-0.514988406  
-0.6260906707  
-0.7411747607  
-0.8486410696  
-0.9354913647  
-0.9887197802  
-0.9967492491  
-0.950746946  
-0.8457046941  
-0.6811603255  
-0.4615117425  
-0.195881312  
0.1024403489  
0.4169102621  
0.7289395115  
1.019276524  
1.269461752  
1.46323101  
1.587792782  
1.634864169  
1.601406789  
1.490004475  
1.308836359  
1.071235445  
0.7948291217  
0.5003019769  
0.2098501044  
-0.05456622354  
-0.2730327381  
-0.4293907347  
-0.512670597  
-0.5180846738  
-0.4474582277  
-0.3090168324  
-0.1165318039  
0.112099127  
0.3566826634  
0.5967640874  
0.8136097349  
0.9919138946  
1.121006005  
1.195430181  
1.214860358  
1.183387859  
1.108344598  
0.9988540306  
0.86437214  
0.7134390439  
0.5528379514  
0.3872672632  
0.2195532902  
0.05129618046  
-0.116181897  
-0.2808393634  
-0.4390699377  
-0.5852280504  
-0.711660423  
-0.8093001805  
-0.8687585189  
-0.8817693563  
-0.8427710865  
-0.7503491799  
-0.6082905423  
-0.4260152684  
-0.2182725629  
-0.004031995554  
0.1953077731  
0.358229374  
0.4656429281  
0.5033311393  
0.4639701494  
0.3484228247  
0.1660949675  
-0.06575016714  
-0.3236886103  
-0.5806850076  
-0.8092085019  
-0.9845718557  
-1.088076984  
-1.109575769  
-1.049117287  
-0.9174279842  
-0.7351167695  
-0.5306340377  
-0.3371601915  
-0.1887392096  
-0.1160689041  
-0.1424182126  
-0.2801811717  
-0.5285065827  
-0.8723582803  
-1.283215523  
-1.721439579  
-2.140124624  
-2.490078845  
-2.725393488  
-2.808980623  
-2.717398015  
-2.444348765  
-2.00235903  
-1.422344332  
-0.7510300754  
-0.04644673153  
0.6280116877  
1.210294375  
1.64637912  
1.896148494  
1.937757622  
1.769996827  
1.412404861  
0.9031590253  
0.2950437832  
-0.3499967169  
-0.9670734266  
-1.494649263  
-1.880256669  
-2.0851021  
-2.087146932  
-1.882488891  
-1.484972687  
-0.9242068252  
-0.2422359247  
0.510742854  
1.28116617  
2.016925725  
2.671741268  
3.20870102  
3.602620288  
3.841062829  
3.923993528  
3.862191532  
3.674719499  
3.385852537  
3.021900975  
2.608377759  
2.167849363  
1.718698685  
1.274839818  
0.8462746253  
0.4402360335  
0.06257714809  
-0.2809350567  
-0.5837259543  
-0.8381290621  
-1.035741737  
-1.16836055  
-1.229291487  
-1.214758418  
-1.125108224  
-0.9655693736  
-0.746364257  
-0.4821125316  
-0.1905941559  
0.1089855016  
0.3979457828  
0.6599959713  
0.8827229499  
1.058455997  
1.184355943  
1.261741521  
1.294784857  
1.288840494  
1.24875235  
1.17750002  
1.075487517  
0.9406518273  
0.7694101081  
0.5582822745  
0.3058485968  
0.01467148361  
-0.3072954848  
-0.6461344396  
-0.9824546115  
-1.292964638  
-1.552957211  
-1.739347926  
-1.833828175  
-1.825642596  
-1.713559915  
-1.506731397  
-1.224285841  
-0.893689177  
-0.5480720956  
-0.2228384549  
0.04803405811  
0.2355662131  
0.318838009  
0.2871898661  
0.1413430686  
-0.1066642557  
-0.4347013506  
-0.8127836128  
-1.206085325  
-1.578388188  
-1.895617101  
-2.129078508  
-2.258082604  
-2.27167771  
-2.16934052  
-1.960588204  
-1.663587114  
-1.302974147  
-0.9071582741  
-0.5054551012  
-0.1253640496  
0.2097046512  
0.4820559424  
0.6805840846  
0.8008941573  
0.844771189  
0.8191641589  
0.7348862724  
0.6052343559  
0.4446880482  
0.2678140556  
0.08842269648  
-0.0810169306  
-0.229745458  
-0.34893026  
-0.4317866476  
-0.4736570055  
-0.472067525  
-0.4267751391  
-0.3397665628  
-0.2152087628  
-0.05931217096  
0.1199111881  
0.3129860685  
0.5094094842  
0.6981660699  
0.8682887866  
1.009459171  
1.112609241  
1.170512992  
1.178338549  
1.134122279  
1.039132247  
0.8980568393  
0.7189671064  
0.5130075829  
0.2937678108  
0.07635069781  
-0.1238224318  
-0.2923833374  
-0.4174215103  
-0.490756176  
-0.5089084986  
-0.473604472  
-0.3917135112  
-0.2745680264  
-0.1367164004  
0.00575701179  
0.137156862  
0.2440778027  
0.3170294358  
0.3515368907  
0.3485610958  
0.3141363896  
0.2582910096  
0.1933662116  
0.1319974815  
0.08504645882  
0.05980029187  
0.05871262355  
0.07890860674  
0.1125219778  
0.1478415522  
0.1711123345  
0.1687240522  
0.1294740865  
0.04657455486  
-0.08089158724  
-0.247269805  
-0.4405053496  
-0.6431564474  
-0.8341219712  
-0.9908575098  
-1.09181674  
-1.118803898  
-1.058989575  
-0.9063741801  
-0.6625562643  
-0.3367746928  
0.05476509471  
0.4901574387  
0.9435298607  
1.387044317  
1.793013875  
2.135929268  
2.394281152  
2.552031994  
2.599673299  
2.534813721  
2.362279519  
2.093750346  
1.746959117  
1.344521717  
0.9124611733  
0.4785262819  
0.07037805059  
-0.286238388  
-0.5692418554  
-0.7617696372  
-0.8534340223  
-0.8411790789  
-0.7296482559  
-0.5310035904  
-0.2641630694  
0.0465089359  
0.3730061825  
0.6858408023  
0.9563981557  
1.159275398  
1.274390452  
1.288654484  
1.197028079  
1.002858013  
0.7174366891  
0.3588520093  
-0.04976740284  
-0.4824149158  
-0.91252745  
-1.315229423  
-1.669251605  
-1.958332052  
-2.171987352  
-2.305609322  
-2.359945598  
-2.34009318  
-2.254194028  
-2.112052017  
-1.923892068  
-1.699419628  
-1.447308422  
-1.175145881  
-0.8897666091  
-0.597864187  
-0.3066926581  
-0.02465382534  
0.2383931469  
0.47124913  
0.6619596929  
0.7988331716  
0.8717711434  
0.8737181689  
0.8019961681  
0.6592868404  
0.454075713  
0.2004160442  
-0.0830051263  
-0.3744347677  
-0.6510867926  
-0.8913938534  
-1.077200462  
-1.1956039  
-1.240210942  
-1.211628454  
-1.11713131  
-0.9695364145  
-0.7854427762  
-0.5830707991  
-0.3799869181  
-0.1910189062  
-0.02664820159  
0.107926425  
0.2129161473  
0.2932758553  
0.3573376441  
0.4149622334  
0.4754846752  
0.5457793249  
0.6287101843  
0.7222401513  
0.8193185049  
0.9085826862  
0.975799373  
1.005828969  
0.9848761085  
0.9027011778  
0.7545027108  
0.5422121411  
0.2750173503  
-0.03096964518  
-0.3538896849  
-0.6680125115  
-0.9461422826  
-1.162242295  
-1.294018571  
-1.325156151  
-1.246984525  
-1.059384803  
-0.7708662167  
-0.3978222473  
0.03694685809  
0.5062544043  
0.9808641545  
1.431893545  
1.833008859  
2.162218018  
2.403079584  
2.545280148  
2.584592246  
2.522333895  
2.364493139  
2.12072772  
1.803422166  
1.426919766  
1.006998468  
0.5605394727  
0.1053051598  
-0.3403376615  
-0.7578600282  
-1.129289097  
-1.438200526  
-1.670929497  
-1.817839757  
-1.874455489  
-1.842265241  
-1.728992459  
-1.548253801  
-1.318567508  
-1.061795322  
-0.8011801486  
-0.5591919798  
-0.3554277848  
-0.2048276968  
-0.1163673988  
-0.09239579316  
-0.128656238  
-0.2149762367  
-0.3365223577  
-0.4754711197  
-0.6128996881  
-0.7307064579  
-0.8133582819  
-0.8493046416  
-0.8319449938  
-0.7600672736  
-0.6377517859  
-0.4737755828  
-0.2805779957  
-0.07293669375  
0.1335336302  
0.3238915374  
0.485245834  
0.6078593244  
0.6858831949  
0.7176622726  
0.7055968802  
0.6556113372  
0.5762985506  
0.4778807304  
0.3710957245  
0.2661705909  
0.1719778976  
0.09545232422  
0.04132022255  
0.01210873016  
0.008412798181  
0.02929843044  
0.07279388354  
0.1363430877  
0.2171558113  
0.3124211757  
0.4193483538  
0.5350672858  
0.6564455295  
0.7798512136  
0.9009725759  
1.014722176  
1.11529341  
1.196381931  
1.251572999  
1.274881354  
1.261382675  
1.207876149  
1.113511662  
0.9802757304  
0.8132865363  
0.6207931525  
0.4138613528  
0.2057146486  
0.01075865931  
-0.1566343842  
-0.2834627416  
-0.3594180746  
-0.3780226636  
-0.3374256073  
-0.2407575115  
-0.09596958712  
0.08484739971  
0.2865574868  
0.4923850545  
0.6854525476  
0.8502525742  
0.9739192134  
1.047152029  
1.064728657  
1.0256072  
0.9326410597  
0.7920164366  
0.6124957659  
0.4045815561  
0.1796939075  
-0.0505957726  
-0.2752101507  
-0.4841246112  
-0.6688270173  
-0.8226957555  
-0.9413255398  
-1.022772632  
-1.067720107  
-1.079512966  
-1.064027337  
-1.029345863  
-0.9852120287  
-0.942273775  
-0.911165672  
-0.9014750581  
-0.9207267615  
-0.973447901  
-1.060476357  
-1.178582352  
-1.320487132  
-1.475331992  
-1.629567597  
-1.768225926  
-1.876442966  
-1.941090277  
-1.95232432  
-1.904869954  
-1.798846819  
-1.640017794  
-1.439400273  
-1.212222922  
-0.97637036  
-0.7504506121  
-0.5517380879  
-0.3942429152  
-0.2871431028  
-0.233782566  
-0.2313565377  
-0.2713122978  
-0.3404114016  
-0.4223044651  
-0.4994109749  
-0.5548719042  
-0.5743432267  
-0.5474110684  
-0.4685169676  
-0.3372804044  
-0.1582450073  
0.05988975487  
0.3054292598  
0.5650714465  
0.825342172  
1.073920667  
1.300707211  
1.49853082  
1.663460719  
1.794687145  
1.894053829  
1.965293376  
2.013081812  
2.04202798  
2.055741076  
2.056067233  
2.042621301  
2.012667517  
1.961397243  
1.882583441  
1.769570042  
1.616484796  
1.419544646  
1.178271906  
0.896462345  
0.582719695  
0.2504513677  
-0.08276266752  
-0.396407753  
-0.6687778522  
-0.8790729298  
-1.009588723  
-1.047739744  
-0.987652086  
-0.8311009314  
-0.5876502959  
-0.2739644492  
0.08762166032  
0.4710966591  
0.8490628821  
1.195037616  
1.485481805  
1.701361876  
1.82910625  
1.860941318  
1.794709749  
1.63327799  
1.383742919  
1.056589922  
0.6649344073  
0.2239042262  
-0.2498169052  
-0.7383843017  
-1.223165041  
-1.685214491  
-2.105908394  
-2.467736349  
-2.755238964  
-2.955989642  
-3.061493197  
-3.067890961  
-2.976347887  
-2.793051039  
-2.52880278  
-2.198238163  
-1.818749286  
-1.409225041  
-0.9887425042  
-0.5753089502  
