-0.1380093594  
-0.2268139759  
-0.3110105125  
-0.3854706219  
-0.446557067  
-0.4924731646  
-0.5232647719  
-0.540493279  
-0.5466712493  
-0.5445834577  
-0.5366494602  
-0.5244602454  
-0.5085693288  
-0.4885819359  
-0.4634995298  
-0.4322282498  
-0.3941226361  
-0.3494274464  
-0.299503075  
-0.2467627895  
-0.1943182522  
-0.14538767  
-0.1025888223  
-0.06725636753  
-0.03895537325  
-0.01530290789  
0.00780993615  
0.03560217648  
0.07346490132  
0.1258436513  
0.1951269339  
0.2807495427  
0.378683324  
0.4814433466  
0.5786554026  
0.6581373286  
0.7073810066  
0.7152261445  
0.6735096051  
0.5784521706  
0.4315747491  
0.2400022592  
0.0160882215  
-0.2236181527  
-0.4599536027  
-0.6730944598  
-0.8446417312  
-0.959601238  
-1.008001996  
-0.9859703115  
-0.8961164316  
-0.7471922551  
-0.5530619462  
-0.331109778  
-0.1002969623  
0.1209011922  
0.3164225527  
0.4741649419  
0.5869952748  
0.6531102959  
0.6757450679  
0.6623125155  
0.6231235404  
0.5698906133  
0.514224542  
0.4663219388  
0.4339799711  
0.4220373207  
0.4322339556  
0.4634687995  
0.5123326894  
0.5738244137  
0.6421118018  
0.7112498094  
0.7757649408  
0.8310834274  
0.8737819902  
0.9016857202  
0.9138468872  
0.9104351266  
0.8925764152  
0.8621604974  
0.8216220592  
0.7737004773  
0.7211750261  
0.6665854062  
0.6119414348  
0.5584779236  
0.5064767404  
0.4552346682  
0.4032084095  
0.3483809984  
0.2888363549  
0.223505531  
0.1529738245  
0.08021084047  
0.01105617768  
-0.04572260127  
-0.07893430363  
-0.07611230375  
-0.0252649502  
0.0829063463  
0.2526149284  
0.4807702304  
0.7553845539  
1.054986896  
1.349376038  
1.601838722  
1.77275249  
1.824244091  
1.725344619  
1.456913391  
1.015569089  
0.4159059142  
-0.309501596  
-1.112516892  
-1.934122524  
-2.710826392  
-3.381978208  
-3.896967026  
-4.221258235  
-4.340390584  
-4.261315522  
-4.010893707  
-3.631776913  
-3.176302099  
-2.6993215  
-2.251016861  
-1.870730091  
-1.582638254  
-1.39380344  
-1.294749878  
-1.262336238  
-1.264372439  
-1.265213734  
-1.231465447  
-1.136970927  
-0.9664273366  
-0.7171978927  
-0.3992070504  
-0.03305387401  
0.3532562674  
0.7284065696  
1.062074506  
1.328834848  
1.511189399  
1.601358462  
1.601726562  
1.52396837  
1.387078318  
1.214636766  
1.031711948  
0.8618043552  
0.724207354  
0.6320664652  
0.5913230329  
0.6006066054  
0.6520180891  
0.7326505762  
0.8266052052  
0.9172296794  
0.9892661859  
1.030661895  
1.033812126  
0.9961323345  
0.9199220156  
0.8116114484  
0.680534002  
0.5374657139  
0.3931506697  
0.2570461602  
0.1364441686  
0.03607772767  
-0.04180098834  
-0.09693485119  
-0.1303246161  
-0.1434120115  
-0.137369046  
-0.1126519811  
-0.0689126472  
-0.005280779849  
0.07902253019  
0.1838979878  
0.3075585819  
0.4459209175  
0.5923363716  
0.737818846  
0.8717628077  
0.9831126756  
1.061804632  
1.100261292  
1.094664401  
1.045763752  
0.9590418242  
0.8441427656  
0.7136281455  
0.581217403  
0.4597883815  
0.3594600944  
0.2860801709  
0.2403742128  
0.217904687  
0.2098635523  
0.2045579072  
0.1893613747  
0.152801359  
0.08645173628  
-0.01365317128  
-0.1463042838  
-0.3051808896  
-0.4796476528  
-0.6561442249  
-0.8199235075  
-0.9568771717  
-1.055197325  
-1.106653302  
-1.107368764  
-1.058042285  
-0.963653897  
-0.8327422016  
-0.6764043689  
-0.5071402958  
-0.3376940011  
-0.1799874495  
-0.04422914652  
0.06176621307  
0.1330309225  
0.1676708956  
0.166882183  
0.1347704507  
0.07798004714  
0.005159093274  
-0.07373881003  
-0.1482761207  
-0.2084484245  
-0.2456174663  
-0.253397578  
-0.2283922855  
-0.1706892323  
-0.08402996823  
0.02438910569  
0.1445109555  
0.2643605112  
0.3712542964  
0.4531544653  
0.4999964523  
0.5048467836  
0.464717079  
0.3809288523  
0.2589702699  
0.1078418668  
-0.06101486092  
-0.235075806  
-0.402190754  
-0.5519214619  
-0.6765923174  
-0.7718881746  
-0.8369393589  
-0.8738918806  
-0.8870681015  
-0.8818666773  
-0.8636111609  
-0.8365515592  
-0.8031991609  
-0.7640959327  
-0.7180556941  
-0.6628093068  
-0.5959192258  
-0.5157728231  
-0.42245482  
-0.3183185234  
-0.2081261068  
-0.09871315503  
0.001784727874  
0.08503821299  
0.1437785122  
0.1730042478  
0.1709332189  
0.1395361349  
0.08454099778  
0.01488233577  
-0.05834290221  
-0.1232847925  
-0.1689101225  
-0.1865070368  
-0.1709095776  
-0.1212341257  
-0.04102778478  
0.06221753788  
0.178118429  
0.2948693645  
0.4009152728  
0.4865675784  
0.5453232559  
0.5746747171  
0.5762978175  
0.5555682306  
0.5205120931  
0.4803395722  
0.4438211908  
0.4177581821  
0.4058149805  
0.4078957999  
0.4201768179  
0.4357945193  
0.4460657194  
0.4420631464  
0.4162636654  
0.3640191537  
0.2845972377  
0.1816157324  
0.06279706181  
-0.0609367094  
-0.1768856932  
-0.2723047857  
-0.3361883447  
-0.3608323183  
-0.3429539065  
-0.2842012707  
-0.1909879732  
-0.07368477726  
0.05471298518  
0.1802497261  
0.2897708971  
0.3725490389  
0.4215664209  
0.4342792123  
0.4127997092  
0.3634706092  
0.2959008174  
0.2216041514  
0.1524194672  
0.09891908565  
0.06901335167  
0.06693793695  
0.09274822233  
0.142393878  
0.2083483947  
0.2807213014  
0.3486781026  
0.4019796022  
0.432419671  
0.4349552899  
0.4083644918  
0.3553511301  
0.2820742529  
0.1971835174  
0.1105130624  
0.03161506404  
-0.03161848434  
-0.07407057595  
-0.09406459999  
-0.09349268724  
-0.07741352084  
-0.05316408491  
-0.02915822493  
-0.01355657037  
-0.01301186365  
-0.03169501043  
-0.07072822126  
-0.1281216627  
-0.1991790997  
-0.2773079852  
-0.3550693684  
-0.425301794  
-0.4821233318  
-0.521658956  
-0.542397353  
-0.545138859  
-0.5325697048  
-0.5085654356  
-0.4773634637  
-0.4427481458  
-0.4073987033  
-0.3725050228  
-0.3376969558  
-0.3012991565  
-0.2608475048  
-0.2137715731  
-0.158120935  
-0.09321094837  
-0.02007118318  
0.058378199  
0.1374602122  
0.2111705227  
0.2728460263  
0.3159767307  
0.3350435427  
0.326267944  
0.2881596395  
0.2218020671  
0.1308287595  
0.02111519961  
-0.09977080903  
-0.2232696627  
-0.3405923833  
-0.4434401178  
-0.5246196051  
-0.5784905592  
-0.6012397342  
-0.5909957779  
-0.5478071151  
-0.4735457471  
-0.371749884  
-0.2474526614  
-0.1069853049  
0.04225114759  
0.1920605546  
0.3338113662  
0.4588801932  
0.5591820877  
0.6277562377  
0.6593573982  
0.650990495  
0.6023088538  
0.515813119  
0.3968030834  
0.2530517809  
0.09422702933  
-0.06890831082  
-0.2254322091  
-0.365239585  
-0.4799467342  
-0.5636293287  
-0.6132904494  
-0.6290143232  
-0.6137721598  
-0.5728997119  
-0.5133060592  
-0.4424977845  
-0.3675475996  
-0.2941236733  
-0.2257334261  
-0.1632846772  
-0.1050649439  
-0.04716088972  
0.0156818546  
0.08887114739  
0.1765921213  
0.2804543378  
0.3984050293  
0.5241185096  
0.6470596648  
0.7532973608  
0.8270501621  
0.8528190365  
0.8178227673  
0.7143793118  
0.5418461319  
0.3077383985  
0.02778400586  
-0.2752203008  
-0.5736583188  
-0.838195757  
-1.041303827  
-1.160715614  
-1.182275532  
-1.101763783  
-0.9253927776  
-0.6689064992  
-0.3554033784  
-0.01222018838  
0.3326514196  
0.6540875222  
0.9327621773  
1.157068051  
1.323769787  
1.437322598  
1.508003123  
1.54917119  
1.574128532  
1.59309427  
1.610800743  
1.625133312  
1.627064486  
1.601932837  
1.531913266  
1.399299046  
1.190082108  
0.8972483346  
0.5232070336  
0.08091190133  
-0.4065866595  
-0.9081762582  
-1.38804621  
-1.809914627  
-2.141501663  
-2.358566625  
-2.447907119  
-2.408873044  
-2.253181371  
-2.003090826  
-1.688258673  
-1.341769717  
-0.9959696855  
-0.6786964193  
-0.4104415283  
-0.2027695682  
-0.05812697838  
0.02907034223  
0.07035473822  
0.0805526697  
0.07503046026  
0.06727387963  
0.06715036884  
0.08003975166  
0.1068657796  
0.1448983832  
0.189081692  
0.2335700393  
0.2731663249  
0.3043901748  
0.3260168828  
0.3390519906  
0.3461986099  
0.3510061871  
0.3569022671  
0.366334921  
0.3801950718  
0.3976192538  
0.416174863  
0.432343789  
0.4421885817  
0.4420311066  
0.4290163401  
0.4014789853  
0.3590779515  
0.3027332545  
0.2344345219  
0.156998233  
0.07384467529  
-0.0111763903  
-0.09391385805  
-0.17004352  
-0.2352515826  
-0.2855181657  
-0.3175325053  
-0.329196558  
-0.3201649764  
-0.2922856165  
-0.2498395228  
-0.1994481979  
-0.1495954224  
-0.1097516971  
-0.08918370039  
-0.09558726008  
-0.1337575333  
-0.2045009841  
-0.3040085455  
-0.4238255108  
-0.551489095  
-0.6717898717  
-0.7685181185  
-0.8264683091  
-0.8334316582  
-0.7818955271  
-0.6701971612  
-0.5029686868  
-0.2907949122  
-0.04912483765  
0.2034242622  
0.4471447893  
0.6634325673  
0.8368111077  
0.9565336634  
1.017578449  
1.020918052  
0.973066469  
0.8849699493  
0.7704162397  
0.6441642958  
0.5200534753  
0.4093235954  
0.3193626988  
0.2530388591  
0.2086821203  
0.1807291055  
0.1609183735  
0.1398772821  
0.1088726669  
0.06146535219  
-0.005174728467  
-0.0895028954  
-0.185521252  
-0.2834355818  
-0.370968842  
-0.4351748304  
-0.4644930395  
-0.4507332447  
-0.3906836145  
-0.2870624505  
-0.1486242409  
0.01063544012  
0.173108971  
0.3198285608  
0.4330220955  
0.498593578  
0.5081626621  
0.460326614  
0.3609582  
0.2224709943  
0.06215436406  
-0.1001697678  
-0.244837001  
-0.3549671716  
-0.4186606173  
-0.430448193  
-0.391819554  
-0.3107695618  
-0.2004860219  
-0.07737056109  
0.04127331983  
0.1395706671  
0.2050887229  
0.2302834334  
0.2132207772  
0.157508133  
0.07151366179  
-0.03298616013  
-0.1425119037  
-0.2436825353  
-0.3248893214  
-0.3776225122  
-0.3973273125  
-0.3837146301  
-0.3405345251  
-0.2748867164  
-0.1961862619  
-0.1149206408  
-0.04136826666  
0.01560519827  
0.04953517483  
0.05704036871  
0.03815187714  
-0.003744575611  
-0.06233985751  
-0.1291676822  
-0.1946269678  
-0.2491674931  
-0.2845107485  
-0.2947736549  
-0.2773480837  
-0.2334175069  
-0.1680038338  
-0.08949408209  
-0.008669198909  
0.06269101415  
0.1134623751  
0.1348673751  
0.1219617667  
0.07465741239  
-0.00190834208  
-0.09778503499  
-0.1993875257  
-0.29131599  
-0.3585766543  
-0.388849341  
-0.3744556245  
-0.3136845538  
-0.2112334446  
-0.07765404105  
0.07212184672  
0.2209712823  
0.352132216  
0.4517017127  
0.5106670639  
0.5261404803  
0.5015823347  
0.4460006452  
0.3722510351  
0.2947618074  
0.2270693642  
0.1796003598  
0.1580762994  
0.1628152071  
0.1890291807  
0.2280492223  
0.2692314411  
0.3021847443  
0.3189000914  
0.3153714618  
0.2924199912  
0.2555329143  
0.2137677497  
0.1778938219  
0.1581232873  
0.1618497796  
0.1918183026  
0.245083922  
0.3129770032  
0.3821214177  
0.4363646921  
0.4593137291  
0.4370801817  
0.3607734384  
0.2283409598  
0.04543787599  
-0.1748190935  
-0.4131974156  
-0.6465961604  
-0.8508664309  
-1.003779958  
-1.087730617  
-1.091769739  
-1.012721721  
-0.8552543169  
-0.6309586218  
-0.3566413953  
-0.05214255283  
0.2619403818  
0.5662712013  
0.8442311176  
1.082665401  
1.271888002  
1.405091546  
1.47739341  
1.484852744  
1.42375039  
1.290400632  
1.081612864  
0.7957872458  
0.4344745741  
0.004100918302  
-0.4825187564  
-1.005253021  
-1.536641928  
-2.042991437  
-2.486611907  
-2.82904689  
-3.034988093  
-3.076428987  
-2.936534447  
-2.612731261  
-2.118540206  
-1.483833618  
-0.7533338439  
0.01661480199  
0.7627877408  
1.420927218  
1.932129223  
2.249092339  
2.341523807  
2.200011482  
1.837808805  
1.290189538  
0.6112868785  
-0.1313309786  
-0.8638059315  
-1.514022844  
-2.019552452  
-2.334470293  
-2.434152338  
-2.317381563  
-2.005498073  
-1.538729751  
-0.9702521728  
-0.3588697595  
0.2386234909  
0.7742941518  
1.214192362  
1.541092335  
1.754579365  
1.868635012  
1.907240179  
1.898802262  
1.87036904  
1.842557596  
1.826003251  
1.819842712  
1.812400296  
1.783909438  
1.710750616  
1.570475984  
1.346776529  
1.033554663  
0.6374264971  
0.1782481263  
-0.3124629536  
-0.7949784868  
-1.226178179  
-1.565025078  
-1.777898194  
-1.843010551  
-1.753286985  
-1.517324473  
-1.158329644  
-0.7112413673  
-0.2184772187  
0.2750659912  
0.7270566163  
1.102152041  
1.375265543  
1.533325209  
1.575438033  
1.511575388  
1.360105451  
1.144623518  
0.8905754902  
0.6221324186  
0.3596836159  
0.1181829964  
-0.09358323914  
-0.2728573393  
-0.4220604098  
-0.5474539031  
-0.6575357304  
-0.7614041033  
-0.8672250986  
-0.9809579764  
-1.105392445  
-1.23954953  
-1.378460915  
-1.513330642  
-1.63208417  
-1.720269195  
-1.76227779  
-1.742811042  
-1.64848966  
-1.469473872  
-1.200950623  
-0.8443231124  
-0.407973478  
0.09252884446  
0.6348264077  
1.190797743  
1.728161618  
2.212566753  
2.610013322  
2.889451998  
3.025344525  
3.000004192  
2.805512267  
2.445029616  
1.933350234  
1.296593668  
0.5709743464  
-0.1993351158  
-0.9651402781  
-1.675775153  
-2.283006624  
-2.744937965  
-3.029557515  
-3.117562277  
-3.004142727  
-2.699510019  
-2.228085077  
-1.626403138  
-0.9399490711  
-0.2192506875  
0.4843624606  
1.12289591  
1.655322086  
2.050375868  
2.288307459  
2.361507236  
2.274042208  
2.040265985  
1.682717632  
1.229591293  
0.7120550961  
0.1616848852  
-0.3917668629  
-0.922100725  
-1.407803984  
-1.83255461  
-2.185158604  
-2.459012932  
-2.651257856  
-2.761803007  
-2.792409613  
-2.745982926  
-2.626186207  
-2.437409908  
-2.185059968  
-1.876055292  
-1.519381919  
-1.126524008  
-0.7116008763  
-0.29109875  
0.1168664008  
0.4937242313  
0.8219604894  
1.086787585  
1.277757166  
1.390094791  
1.425542714  
1.392545192  
1.305700063  
1.184465725  
1.051226892  
0.9288989026  
0.8383368914  
0.7958442488  
0.8111167688  
0.8858906925  
1.013527898  
1.179635028  
1.363694742  
1.541544105  
1.688405016  
1.782077244  
1.80587144  
1.75087338  
1.617209861  
1.414127328  
1.158858122  
0.8744227699  
0.5866721539  
0.3209859576  
0.09909086675  
-0.06355127962  
-0.1594328429  
-0.1895377244  
-0.1626805752  
-0.09377532642  
-0.001301542836  
0.09562624985  
0.1801534422  
0.2401042057  
0.2695716773  
0.2694519357  
0.2468353488  
0.2133827524  
0.1829127988  
0.1685991741  
0.180211619  
0.2218492347  
0.2905465677  
0.3760194336  
0.461630977  
0.526505623  
0.5485117474  
0.5077158617  
0.3898112048  
0.1889968618  
-0.09014267739  
-0.4321133168  
-0.81150391  
-1.195462028  
-1.547397137  
-1.831476666  
-2.017313947  
-2.084219689  
-2.024365547  
-1.844369782  
-1.564985995  
-1.218860396  
-0.8465803748  
-0.4915324407  
-0.1942516622  
0.01292705736  
0.1101555053  
0.09263997482  
-0.02888084628  
-0.2298545384  
-0.4755723241  
-0.7262452001  
-0.9427378146  
-1.09211078  
-1.152161214  
-1.114279167  
-0.9842235254  
-0.7807346168  
-0.5322146003  
-0.2720306844  
-0.03317793028  
0.1568609616  
0.2802637361  
0.3313851487  
0.3172884855  
0.2562156377  
0.1742922355  
0.1009854745  
0.06408206309  
0.08497031602  
0.1749902094  
0.3334152506  
0.5473753973  
0.7937166744  
1.042473968  
1.261400184  
1.42081624  
1.498023209  
1.480600346  
1.368098801  
1.171923066  
0.9134627746  
0.6208430855  
