154.6343903  
174.6835873  
211.9693974  
291.9268798  
670.3611104  
1743.866872  
40311.25772  
7650.100329  
64599.2978  
32698.22371  
4895.943161  
2273.223023  
2605.6388  
8956.602851  
59528.68459  
18063.65069  
23701.22463  
5284.292442  
9097.688022  
4866.842572  
24332.03117  
13598.52205  
8229.516366  
1921.285076  
16176.77493  
5907.684098  
2091.360361  
1739.484473  
46429.55103  
3967.640861  
443.5086194  
4767.888635  
1432.582335  
3766.70962  
5320.529147  
801.8732949  
1489.037342  
128.9585429  
2134.486431  
7198.074162  
6674.005231  
474.083447  
165.5498976  
7028.546979  
5934.613993  
780.1253611  
959.4560237  
296.7445746  
1835.783514  
11299.5671  
1341.928166  
2246.682573  
398.1636492  
199.6032191  
1099.658039  
681.3101279  
1138.196113  
2096.531392  
1150.19131  
415.479021  
215.2891142  
129.52824  
182.2405191  
751.0632255  
79.77671578  
30.22975039  
126.1840019  
19.49024344  
1.369722022  
33.19068227  
45.52825375  
24.41656907  
9.781324  
5.111686938  
3.339465246  
7.142965698  
2.461560709  
2.392471996  
10.53152352  
0.9740864047  
0.3274235409  
0.5920222744  
0.4628103369  
0.2367171109  
0.1258330512  
0.6753409374  
0.5609864497  
0.574585386  
0.5823839983  
0.6067031835  
0.3893938455  
0.3864074692  
0.3158360035  
0.2770421179  
0.2887292166  
0.2781980962  
0.3030989819  
0.2789381103  
0.2685582741  
0.2636882114  
0.2396933452  
0.238904521  
0.2307775173  
0.2226792728  
0.2232616291  
0.2128763787  
0.2107915618  
0.2062916119  
0.1969462226  
0.1921343082  
0.1832452143  
0.1796213067  
0.1736237741  
0.1702007322  
0.1662737479  
0.1625911052  
0.1590256902  
0.1554060299  
0.151674207  
0.1478404451  
0.1445160327  
0.141253519  
0.1381577944  
0.1352236839  
0.132472782  
0.1296081949  
0.1268572094  
0.1241650317  
0.1215216201  
0.1191141988  
0.1167888032  
0.1144909085  
0.1123385058  
0.1101928954  
0.1081486661  
0.1061365825  
0.104176615  
0.1022815996  
0.1004344635  
0.098668134  
0.09694153087  
0.09527233803  
0.09364857069  
0.09206143877  
0.09052536168  
0.08902330428  
0.08756984812  
0.08615340404  
0.08477655755  
0.08343579929  
0.08213569188  
0.08086668027  
0.07963017735  
0.07842302316  
0.07724773827  
0.0760980806  
0.07498220202  
0.07388968247  
0.07282768735  
0.07179129974  
0.07077982755  
0.06979072077  
0.06882075412  
0.06787835043  
0.06696038638  
0.0660631058  
0.06518310282  
0.06432111865  
0.06347883986  
0.06266500702  
0.06185625683  
0.06107065186  
0.06030074974  
0.05954574241  
0.05881284327  
0.05809387446  
0.05738416884  
0.056694019  
0.05601886199  
0.05535345826  
0.05470871771  
0.05407482402  
0.05344618249  
0.05283704263  
0.05223580052  
0.0516478851  
0.05107791231  
0.05050837634  
0.0499549924  
0.04941731672  
0.0488857663  
0.04835618968  
0.04784703723  
0.04734383587  
0.04685053163  
0.04636337658  
0.04588904284  
0.04542261007  
0.04496276511  
0.04451119918  
0.04407123414  
0.04363061308  
0.04320325377  
0.04278789715  
0.04237838173  
0.04197092992  
0.04156917678  
0.04117919285  
0.04079564793  
0.04041812658  
0.04004579135  
0.03967855088  
0.03931938486  
0.03896745207  
0.03861673524  
0.03827853199  
0.03794020166  
0.03760513395  
0.03728353652  
0.03696213534  
0.03664518565  
0.03633471809  
0.03602905049  
0.03572864475  
0.0354293669  
0.03514219344  
0.03485415005  
0.03457056092  
0.03429495383  
0.03402176023  
0.03375153291  
0.03348009544  
0.03321848992  
0.03296181569  
0.03270789335  
0.03245919955  
0.0322095461  
0.0319655566  
0.03172724416  
0.03149309691  
0.03126034631  
0.03102742917  
0.03080594516  
0.03058092359  
0.03035945612  
0.03014252855  
0.02993044381  
0.02971928162  
0.02951111843  
0.02930516925  
0.02910699199  
0.02890650895  
0.02870818144  
0.02851392496  
0.02832842857  
0.0281376147  
0.02795156013  
0.02776712554  
0.02758578259  
0.02740849086  
0.02723200596  
0.02705932028  
0.02688526557  
0.0267159377  
0.02654696803  
0.02638425  
0.02622214414  
0.02606266474  
0.02590494595  
0.0257483069  
0.02559472795  
0.02543903148  
0.02528787556  
0.02513808793  
0.02499431535  
0.02484785142  
0.02470620289  
0.02456327368  
0.0244263956  
0.02428767102  
0.02415277707  
0.02401520705  
0.0238857526  
0.02375635393  
0.02362374918  
0.02349643265  
0.02337178751  
0.02324564822  
0.02312699528  
0.02300257186  
0.0228844818  
0.02276377799  
0.02264649408  
0.02253118042  
0.02241604586  
0.02230394309  
0.02219122146  
0.02208137901  
0.02197207429  
0.02186495924  
0.02175774393  
0.02165442151  
0.02155070786  
0.02144691858  
0.02134456707  
0.02124496498  
0.02114638348  
0.02105060404  
0.02095257005  
0.02085592396  
0.02076157876  
0.02066998125  
0.02057445784  
0.02048472036  
0.02039496364  
0.02030666185  
0.02021720367  
0.02013192077  
0.02004476451  
0.01995939064  
0.01987650361  
0.01979259985  
0.01971082793  
0.01962931737  
0.01954733495  
0.01946967555  
0.01939209311  
0.01931392829  
0.01923533927  
0.01916093973  
0.01908628269  
0.0190127003  
0.01894100152  
0.01886949599  
0.01879670772  
0.01872673335  
0.01865342954  
0.01858694238  
0.01851990381  
0.0184514519  
0.01838441809  
0.01831840313  
0.01825205606  
0.01818914558  
0.01812484043  
0.01806093573  
0.01800014548  
0.01793698333  
0.01787858276  
0.01781575972  
0.01775519339  
0.01769787799  
0.01763922443  
0.01758292096  
0.01752869085  
0.01747101536  
0.01741435587  
0.0173605745  
0.01730537471  
0.01725400415  
0.01720134759  
0.01714946423  
0.01709650492  
0.01704611918  
0.0169950111  
0.01694412139  
0.01689534173  
0.01684550117  
0.01679867028  
0.01675061577  
0.01670279755  
0.01665959497  
0.01661402406  
0.01656715238  
0.01652269362  
0.01647595602  
0.01643380308  
0.01638950989  
0.01635070576  
0.01630588753  
0.01626317055  
0.01622483869  
0.01618101221  
0.01614229993  
0.01610069584  
0.01606290891  
0.01602436338  
0.01598771311  
0.01594810063  
0.01591517068  
0.01587449857  
0.01583863404  
0.01580535973  
0.01577166554  
0.01573281719  
0.01569866268  
0.01566577232  
0.01563095847  
0.0155979459  
0.01556552597  
0.01553295697  
0.01550227587  
0.01547187554  
0.01544003671  
0.01541006833  
0.01538057405  
0.01535151427  
0.01532267489  
0.01529242374  
0.01526542448  
0.01523673523  
0.0152070765  
0.01518295518  
0.0151567506  
0.01512805766  
0.01510222461  
0.01507800836  
0.01505106093  
0.0150270515  
0.0150008138  
0.01497873579  
0.01495567824  
0.01493144215  
0.01490828539  
0.01488409849  
0.0148639994  
0.01484174514  
0.01482172193  
0.01480075523  
0.01477992614  
0.01476004405  
0.01473705637  
0.0147176301  
0.01470039266  
0.01468127759  
0.01466204151  
0.01464434624  
0.01462819401  
0.01460852598  
0.01459035265  
0.01457377486  
0.01455586242  
0.01454177431  
0.01452513805  
0.01450996916  
0.01449813238  
0.01448070541  
0.01446601695  
0.01445001555  
0.0144383212  
0.01442561788  
0.01441278044  
0.01439871435  
0.01438615094  
0.01437291081  
0.01436167617  
0.01434917359  
0.0143372431  
0.0143275604  
0.01431648127  
0.01430538974  
0.01429447051  
0.01428660912  
0.01427659684  
0.01426729326  
0.01426025095  
0.01425105648  
0.01424530334  
0.01423477672  
0.01422880745  
0.01422008957  
0.01421617757  
0.01420741978  
0.01420138879  
0.01419805673  
0.01419074214  
0.01418550418  
0.01417865013  
0.01417604083  
0.01417101938  
0.01416560482  
0.01416152061  
0.01416041188  
0.01415412135  
0.01415439766  
0.01414931214  
0.01414664606  
0.01414831447  
0.01414413554  
0.01414227326  
0.01414173678  
0.01414160151  
0.01414044937  
0.01414067892  
