88.56678564  
99.55930432  
126.4876232  
188.3712041  
206.9141657  
2448.234912  
32017.59277  
50.91921177  
4838.554943  
5423.389829  
13863.38266  
23068.31528  
4442.039952  
4374.385607  
4095.719818  
4968.029238  
2392.41927  
2489.875667  
4432.21081  
112.1002871  
4411.00963  
4132.177246  
4808.519148  
5631.457238  
8894.657222  
641.6485196  
6126.020966  
12555.51717  
10560.0268  
17446.51536  
19123.36377  
26880.61386  
45067.88793  
11211.22362  
5804.346879  
11691.44569  
8106.694811  
3133.438126  
20622.04094  
13734.3921  
4908.985336  
25250.60051  
3129.938712  
4022.938304  
39718.28205  
2700.003309  
6854.879552  
1282.111322  
2104.822719  
5527.424131  
19665.66574  
3709.411726  
1188.990431  
5883.909454  
171.8753106  
3611.350765  
1083.693349  
114.0623472  
809.2961135  
2592.75867  
804.4010444  
12.15053718  
320.9754764  
494.2659528  
263.2117419  
445.1100479  
229.4576284  
8.0325751  
74.9157793  
51.71906701  
36.91504201  
19.30966129  
6.860355754  
3.725802868  
14.29537303  
12.71097944  
9.534210146  
13.48049692  
4.205642034  
4.922922204  
7.360309525  
5.901790003  
3.929013872  
3.580531471  
3.886900275  
3.723393464  
3.93574446  
3.268898243  
3.01585395  
3.072074797  
2.545778162  
2.508772651  
2.412107244  
2.248831862  
2.162767478  
2.023127863  
1.956876638  
1.798012246  
1.75311842  
1.665543064  
1.582586567  
1.498584783  
1.41751317  
1.342218742  
1.278380702  
1.216543835  
1.157232966  
1.108628046  
1.055072851  
1.011612062  
0.9689634558  
0.9256920072  
0.8837068193  
0.8483441134  
0.8132545627  
0.7791242154  
0.7479101879  
0.7167653002  
0.6888042924  
0.6617229336  
0.636092473  
0.612098635  
0.5887981386  
0.5670670138  
0.5461545127  
0.5258764011  
0.5070284241  
0.4887469189  
0.4717294538  
0.4550195679  
0.4392257078  
0.4242477523  
0.4097716825  
0.3959183934  
0.3828382168  
0.3702096883  
0.3581546513  
0.3465367857  
0.335412172  
0.3248137953  
0.3145996049  
0.3047584397  
0.2953750398  
0.2863559833  
0.2776736265  
0.2693113221  
0.2612978313  
0.2535787934  
0.2461610586  
0.2390401269  
0.2321443682  
0.2255221113  
0.2191153079  
0.2130056954  
0.2070342649  
0.2013591851  
0.1958352572  
0.1905050776  
0.185373834  
0.1804107082  
0.1756474477  
0.1710215623  
0.1665547219  
0.1622374947  
0.1580691615  
0.1540334791  
0.1501326354  
0.1463605495  
0.1426910265  
0.1391638684  
0.1357585349  
0.1324367812  
0.1292325471  
0.1261235941  
0.1230913605  
0.1201810855  
0.1173444018  
0.1146044621  
0.1119430151  
0.109352361  
0.1068507405  
0.1044136313  
0.1020530019  
0.09976673916  
0.09753290787  
0.0953769229  
0.09327541158  
0.09123941762  
0.0892582465  
0.08732893844  
0.08545210464  
0.08364009887  
0.08185577192  
0.08014528393  
0.07846844274  
0.07684015926  
0.07526440898  
0.0737192998  
0.07220992662  
0.07074850199  
0.06932101914  
0.06794407234  
0.06659340397  
0.06526603064  
0.06399680957  
0.06274739622  
0.06152699982  
0.06033962247  
0.05917858058  
0.05804888937  
0.05695692144  
0.05588254177  
0.0548365514  
0.05382678705  
0.05281924295  
0.05184434018  
0.05089668652  
0.04997814177  
0.04906191417  
0.0481940565  
0.04732441029  
0.04647951104  
0.04566726391  
0.04486995012  
0.04407670992  
0.04331741749  
0.04257021913  
0.04183864307  
0.0411227725  
0.04041033193  
0.03973610108  
0.03907239444  
0.03842166774  
0.03778433985  
0.03716657799  
0.0365476095  
0.03594477598  
0.03536379297  
0.03478980902  
0.03423884471  
0.03369166994  
0.03315366725  
0.03262810836  
0.03212016401  
0.03161167913  
0.03112035375  
0.03063857243  
0.03017310323  
0.0297055298  
0.02926243335  
0.02881565009  
0.02838445934  
0.02795772738  
0.02753903943  
0.02713045053  
0.02673064614  
0.026335659  
0.02595612927  
0.02557946239  
0.02520886207  
0.02484414639  
0.0244961342  
0.02415276055  
0.02380682334  
0.02347716235  
0.02314529852  
0.02282271241  
0.02250788383  
0.02219441279  
0.02189258524  
0.02159641947  
0.02131104031  
0.02101988888  
0.02074113918  
0.02045747598  
0.02018920947  
0.01992675267  
0.01966532791  
0.01940750626  
0.01915645651  
0.01890795838  
0.0186680303  
0.01842499951  
0.01819622181  
0.01796782242  
0.01774040366  
0.01751875039  
0.01730150066  
0.01708309714  
0.01688135342  
0.01666936763  
0.01646684362  
0.01626484111  
0.01606758223  
0.01588209154  
0.01569365801  
0.01550635845  
0.01532396873  
0.01514025364  
0.01497067191  
0.01479586542  
0.01462791957  
0.01445819689  
0.01429394384  
0.01413227102  
0.01396982627  
0.01381763453  
0.01366102596  
0.01351244906  
0.01336442502  
0.01322025374  
0.01307350639  
0.01293126024  
0.01279174437  
0.01265379472  
0.01251759919  
0.01238469262  
0.01225461557  
0.01212301264  
0.0120022418  
0.01187910973  
0.01176005001  
0.01163578899  
0.01151618789  
0.01140165816  
0.01128777663  
0.01117588249  
0.01106550156  
0.01095735373  
0.01084812336  
0.01074472297  
0.01063748675  
0.01053730135  
0.01043572521  
0.0103312766  
0.01023746306  
0.01014357402  
0.0100475545  
0.009955309164  
0.009862995295  
0.009772392217  
0.009683371874  
0.00959616611  
0.009514212558  
0.00942253742  
0.00934189436  
0.009260084007  
0.009177188956  
0.009101853392  
0.009023383707  
0.008944474438  
0.008868191022  
0.008793269862  
0.008719071695  
0.008644286827  
0.008573972455  
0.008502621322  
0.008435549007  
0.00836606485  
0.008298690247  
0.008231877406  
0.008165067196  
0.008101827458  
0.008039830354  
0.007974763588  
0.007913812202  
0.007852291535  
0.007795678967  
0.007735397016  
0.007678425079  
0.007620551745  
0.007570852834  
0.007513712427  
0.007457563333  
0.007403415654  
0.007347710009  
0.007294790725  
0.007246492286  
0.007195513599  
0.007148413778  
0.007098315218  
0.007045859865  
0.007000685581  
0.006956930809  
0.006912435478  
0.006867064882  
0.006820099004  
0.006773232831  
0.00673323542  
0.006691034711  
0.006645994795  
0.006606802743  
0.006564638011  
0.006525732419  
0.006484742857  
0.006445142499  
0.006406686998  
0.006370952189  
0.006334186106  
0.006297843388  
0.006262161169  
0.006227460191  
0.00619411117  
0.006159291836  
0.006125356283  
0.006092545137  
0.006058369291  
0.006028300152  
0.005997358489  
0.005963628643  
0.005937128903  
0.005903965575  
0.005876177244  
0.005844017206  
0.005818251445  
0.005791721233  
0.005760703395  
0.005735644111  
0.005709097911  
0.005685957728  
0.005660812168  
0.005633669511  
0.005607284059  
0.005584383866  
0.005559667448  
0.005536015556  
0.005512225167  
0.005490556642  
0.005470649273  
0.005447329364  
0.005424009125  
0.005402759809  
0.005383937197  
0.00536377743  
0.005344921819  
0.005327730583  
0.005307169489  
0.005286292291  
0.005268816643  
0.005253590349  
0.005234546848  
0.005216033348  
0.005199741108  
0.005184749079  
0.005171374819  
0.00515540444  
0.00513964653  
0.005122988317  
0.005109790973  
0.005096513965  
0.005083649687  
0.00507161905  
0.005054271135  
0.005040524682  
0.005028374273  
0.005019751254  
0.005006307815  
0.004991878952  
0.004983941541  
0.004973208884  
0.004961630978  
0.004950313784  
0.004943921775  
0.004934078476  
0.004924356251  
0.004920695902  
0.004908659767  
0.0048990675  
0.004892613086  
0.004885953813  
0.004878204624  
0.004872530279  
0.004863810711  
0.004858718142  
0.004851499781  
0.004847337144  
0.004841118953  
0.004838239604  
0.004829935112  
0.004827336445  
0.004824343404  
0.004819889927  
0.004816322266  
0.004810587583  
0.004811185122  
0.004807590286  
0.004801606755  
0.0048030578  
0.004802144117  
0.004799155631  
0.004800496151  
0.004800157928  
0.004801028481  
0.004795222781  
