-0.05906444393  
-0.06689928838  
-0.06689938957  
-0.05274431892  
-0.02129761039  
0.02651950419  
0.08560465294  
0.1473375867  
0.2009041012  
0.2350650796  
0.2400483372  
0.2092412535  
0.140386119  
0.03609107666  
-0.09643911101  
-0.2463856407  
-0.4008578735  
-0.5467096787  
-0.6723719202  
-0.769394593  
-0.8334871149  
-0.8649288469  
-0.8683051449  
-0.8516507253  
-0.8251418344  
-0.7995331475  
-0.7845652278  
-0.7875437346  
-0.8122581583  
-0.8583650516  
-0.9212970649  
-0.9927008744  
-1.061365258  
-1.11455307  
-1.139597022  
-1.125622403  
-1.065197323  
-0.9557218246  
-0.8003537129  
-0.6082893205  
-0.3942837496  
-0.1773440183  
0.02132989826  
0.1809944251  
0.2842946611  
0.3200954841  
0.2857742614  
0.1885555517  
0.04555834135  
-0.117617419  
-0.2697311101  
-0.3778962096  
-0.4122670333  
-0.3507657369  
-0.1831429029  
0.08631382411  
0.4379484521  
0.8380865489  
1.242542371  
1.601934355  
1.868158956  
2.001164135  
1.975041283  
1.782538756  
1.437246906  
0.9730443466  
0.4407567021  
-0.09761836089  
-0.5763944968  
-0.9344271451  
-1.122972124  
-1.112103374  
-0.8948123709  
-0.4881886604  
0.06845762744  
0.7183189339  
1.393981905  
2.025565874  
2.54899823  
2.913315952  
3.086065902  
3.056132269  
2.833746132  
2.447810143  
1.941059922  
1.36386735  
0.7676335394  
0.1987285285  
-0.3062175189  
-0.7231140492  
-1.04109428  
-1.261192373  
-1.393455661  
-1.453134942  
-1.456707272  
-1.41844397  
-1.348106374  
-1.2500827  
-1.124023373  
-0.9667130142  
-0.774718332  
-0.5471969327  
-0.2882295133  
-0.008163442864  
0.2763791293  
0.5438885522  
0.770552492  
0.9335875204  
1.014749626  
1.003369966  
0.8983446801  
0.7087058779  
0.4526003473  
0.1548071966  
-0.1568331128  
-0.4555147347  
-0.7194109815  
-0.9348147187  
-1.09793135  
-1.214978636  
-1.300543801  
-1.374402039  
-1.457280134  
-1.566253473  
-1.710523614  
-1.888331473  
-2.085611681  
-2.276724418  
-2.427325229  
-2.499057135  
-2.455462328  
-2.268272322  
-1.923108762  
-1.423667244  
-0.7936182087  
-0.07575069329  
0.6717069767  
1.381272496  
1.98414228  
2.418868363  
2.639557688  
2.622434207  
2.369754642  
1.91043534  
1.297191169  
0.6004817047  
-0.0999868435  
-0.7250707301  
-1.206010376  
-1.492909518  
-1.560726181  
-1.411957501  
-1.075658249  
-0.6029603156  
-0.05974957625  
0.4824642388  
0.956178247  
1.306670619  
1.498731414  
1.520428177  
1.383481488  
1.120299744  
0.7782153557  
0.4118742519  
0.07494258012  
-0.1876036968  
-0.3455087824  
-0.386749749  
-0.3181243134  
-0.1629341878  
0.04374211535  
0.2613858085  
0.4509366255  
0.581165188  
0.6335554535  
0.6049794961  
0.5078062656  
0.3675138505  
0.2182257889  
0.09692907391  
0.0373044413  
0.06412840394  
0.1891010809  
0.408709834  
0.7044022406  
1.044979979  
1.390800968  
1.699121312  
1.929763033  
2.050310328  
2.04013117  
1.892753304  
1.616384525  
1.232627065  
0.7736899664  
0.2785567437  
-0.2113562799  
-0.6564864102  
-1.022921136  
-1.285327411  
-1.428837867  
-1.449818495  
-1.355589965  
-1.163240502  
-0.8977261497  
-0.5894725001  
-0.2716738051  
0.02251788338  
0.2627295203  
0.4238852595  
0.4883280147  
0.4474055377  
0.3023547319  
0.06439035564  
-0.2460993665  
-0.6012259912  
-0.9680831072  
-1.311816933  
-1.599030855  
-1.801166844  
-1.897475458  
-1.877227792  
-1.740870485  
-1.499959762  
-1.175864348  
-0.7973830142  
-0.3975720478  
-0.01019500023  
0.3337552233  
0.6090191356  
0.7981789454  
0.8926929812  
0.892813651  
0.806500766  
0.6476103176  
0.4336678911  
0.1836177734  
-0.08413862372  
-0.3531880129  
-0.6099223101  
-0.8437530127  
-1.04685722  
-1.213650366  
-1.34021147  
-1.423837884  
-1.462859412  
-1.456716109  
-1.406246861  
-1.314035576  
-1.184657661  
-1.024653692  
-0.842135853  
-0.6460099173  
-0.4448835244  
-0.2458356461  
-0.05326585892  
0.1319193923  
0.3125933948  
0.4950120667  
0.6877255065  
0.8998851583  
1.139168857  
1.409609187  
1.709679637  
2.030953688  
2.357613183  
2.666963087  
2.930993958  
3.118884601  
3.200224321  
3.148616231  
2.94528707  
2.582259713  
2.064710802  
1.41215649  
0.6582206339  
-0.1511307652  
-0.9608555678  
-1.711393271  
-2.344139088  
-2.807298095  
-3.061495872  
-3.0844507  
-2.874105459  
-2.449712716  
-1.850618392  
-1.132754852  
-0.3631634085  
0.3868597832  
1.049196949  
1.56602476  
1.895744426  
2.017014883  
1.930426487  
1.657680909  
1.238452976  
0.7254190002  
0.1781130318  
-0.343599665  
-0.785682305  
-1.105064627  
-1.273289657  
-1.27841598  
-1.125143929  
-0.833319482  
-0.4351076052  
0.02877409456  
0.5133414678  
0.9737209224  
1.369240751  
1.666910626  
1.844007143  
1.889614329  
1.804989164  
1.602775565  
1.305146983  
0.9410832756  
0.5430693616  
0.143571805  
-0.2283117772  
-0.5496433531  
-0.805573422  
-0.9901699463  
-1.106105436  
-1.16326622  
-1.176544492  
-1.163142798  
-1.139809433  
-1.120401867  
-1.114121693  
-1.124611653  
-1.15001444  
-1.183867054  
-1.216650574  
-1.237680613  
-1.237010314  
-1.207055341  
-1.143717718  
-1.046875374  
-0.9202468344  
-0.7707107884  
-0.6072472832  
-0.4397031237  
-0.2775797549  
-0.1290015298  
2.142594738e-05  
0.1059838338  
0.1879552296  
0.2473589093  
0.2875563303  
0.3133062304  
0.3301713506  
0.3439326714  
0.360027592  
0.383037103  
0.4162276765  
0.4611502656  
0.517316024  
0.5819849246  
0.6501070024  
0.7144699175  
0.7661002748  
0.7949434165  
0.7908137059  
0.7445751644  
0.6494399747  
0.5022609005  
0.3046263771  
0.06358786845  
-0.2081426968  
-0.4926596088  
-0.7680208708  
-1.010067989  
-1.194752082  
-1.300746079  
-1.312036116  
-1.220156564  
-1.025769489  
-0.7393015539  
-0.3805045574  
0.02310399311  
0.4387911849  
0.8318818444  
1.169401133  
1.423618403  
1.575069676  
1.614641258  
1.544457995  
1.377437104  
1.135568822  
0.8471533188  
0.5433486474  
0.2544822913  
0.006607833987  
-0.181271992  
-0.2989903359  
-0.3458107071  
-0.3298175278  
-0.2662186614  
-0.1748425764  
-0.07716533556  
0.006710567664  
0.06074822519  
0.07499174512  
0.04667990391  
-0.019670032  
-0.1131844028  
-0.2184048248  
-0.317661848  
-0.3937130291  
-0.4322802249  
-0.4241445845  
-0.3665049548  
-0.2634137471  
-0.1252388781  
0.03279038135  
0.1927341646  
0.3365044172  
0.4484495341  
0.5176074014  
0.5392778455  
0.5156733501  
0.4555312087  
0.3727299673  
0.2840825465  
0.2066277028  
0.1548206218  
0.1380483784  
0.1588757753  
0.2123209082  
0.2863373221  
0.3634647158  
0.4234724829  
0.4466250087  
0.4170895615  
0.3259740998  
0.1734773027  
-0.03021917982  
-0.2655450511  
-0.5056267287  
-0.7196269588  
-0.8769235803  
-0.9515297922  
-0.9261244021  
-0.7950503151  
-0.5658142475  
-0.2587667063  
0.09503057765  
0.4575226364  
0.7884586144  
1.050587822  
1.214520089  
1.262529438  
1.190752477  
1.009472369  
0.7414574866  
0.4186378511  
0.07762703296  
-0.2452412292  
-0.518630313  
-0.7200229495  
-0.8381270737  
-0.8736150979  
-0.8381487614  
-0.7519305409  
-0.6401939219  
-0.5291813826  
-0.4422094628  
-0.3963600511  
-0.4002407563  
-0.4530692217  
-0.5451563129  
-0.6596394061  
-0.7751866751  
-0.8692315349  
-0.9212759658  
-0.9158026229  
-0.8444138399  
-0.7069417946  
-0.5114332882  
-0.2730740199  
-0.01224904274  
0.2479564934  
0.4844635206  
0.6767584381  
0.8090126244  
0.8715426162  
0.8615076224  
0.7828325473  
0.6454451091  
0.4639680995  
0.2560576885  
0.04057894683  
-0.1641912375  
-0.34217426  
-0.4807822133  
-0.5718059319  
-0.6118513634  
-0.6023203916  
-0.5489678377  
-0.4611040297  
-0.3505334893  
-0.2303373953  
-0.1136195236  
-0.01230993429  
0.0638780712  
0.1082597513  
0.1177276813  
0.09299703592  
0.03854771784  
-0.03773552364  
-0.1252079058  
-0.2113574432  
-0.2829134021  
-0.3270907791  
-0.3329010625  
-0.2924127529  
-0.20184082  
-0.06233516977  
0.1196594256  
0.3325643023  
0.5604039444  
0.784101084  
0.9832505727  
1.138202204  
1.232248411  
1.253640019  
1.197185627  
1.065187455  
0.8675635834  
0.6210861487  
0.3477813035  
0.07265163078  
-0.1790113691  
-0.3844167887  
-0.5258098058  
-0.5924363998  
-0.5816904238  
-0.4993051407  
-0.3585708198  
-0.1786912228  
0.01750064324  
0.2061653022  
0.3651077122  
0.4761267508  
0.5268141419  
0.5116313008  
0.4321765566  
0.2966868474  
0.1188562933  
-0.08383077528  
-0.292051235  
-0.4866653786  
-0.6505904741  
-0.7703686279  
-0.8372829526  
-0.8479625922  
-0.8044289296  
-0.7136194711  
-0.5864410846  
-0.4364658297  
-0.2783927567  
-0.1264392335  
0.007178846964  
0.1135153157  
0.1877661896  
0.2296413688  
0.243184959  
0.2360457308  
0.2182773798  
0.2008156454  
0.1938125882  
0.2050599434  
0.2387335136  
0.2946374044  
0.3680984173  
0.4505437434  
0.5307081876  
0.5963117124  
0.6359706341  
0.6410437726  
0.6071331725  
0.5349806654  
0.430604887  
0.3046385668  
0.1709462281  
0.04471936981  
-0.059660214  
-0.1306668285  
-0.1612761181  
-0.1499668773  
-0.1009123989  
-0.02335564494  
0.06975037006  
0.1636223873  
0.2437783665  
0.2981039292  
0.3185705431  
0.3023591258  
0.2522518641  
0.1762254375  
0.08630903759  
-0.003139415087  
-0.07753199276  
-0.1242509406  
-0.1346584223  
-0.1056565395  
-0.04055944626  
0.05088394353  
0.1533593522  
0.2477223352  
0.3134003168  
0.3311904429  
0.286083983  
0.1697087687  
-0.01798227596  
-0.2680778697  
-0.5632828142  
-0.879683305  
-1.18950153  
-1.464474632  
-1.679386351  
-1.815235013  
-1.861567478  
-1.817615183  
-1.69206799  
-1.501500043  
-1.267705441  
-1.014337122  
-0.7633865468  
-0.532042864  
-0.3304167481  
-0.160477499  
-0.01635896141  
0.1140350224  
0.2463934944  
0.3967510456  
0.5781556568  
0.7977719012  
1.054876657  
1.340062544  
1.635767925  
1.918086795  
2.159584979  
2.332759846  
2.41364579  
2.385111298  
2.239395569  
1.979569031  
1.619736489  
1.183958661  
0.7040178428  
0.2162891023  
-0.2419208986  
-0.6361669864  
-0.9383651951  
-1.129613967  
-1.202044317  
-1.159475518  
-1.01682435  
-0.7983234691  
-0.534747424  
-0.2599608761  
-0.007167589621  
0.1947029991  
0.3240690101  
0.3688648238  
0.3275621674  
0.2089295648  
0.03055467564  
-0.1836713562  
-0.4068115792  
-0.6124578313  
-0.778184237  
-0.8884203726  
-0.9363818219  
-0.9247777397  
-0.8651949341  
-0.7762151866  
-0.6805027893  
-0.601250883  
-0.5584669004  
-0.5656474522  
-0.6273249998  
-0.73789669  
-0.8819563126  
-1.036154372  
-1.172355204  
-1.261698026  
-1.27898086  
-1.206720263  
-1.038277587  
-0.7795266909  
-0.4487682776  
-0.07482889437  
0.3064509921  
0.6568663389  
0.9409976267  
1.131113499  
1.211102524  
1.178836423  
1.046580376  
0.8393688394  
0.5915490845  
0.341991978  
0.1286619346  
-0.01665976411  
-0.07273377555  
-0.03165827576  
0.1002669598  
0.3037079882  
0.5492891593  
0.8019132516  
1.025763633  
1.189232346  
1.269081035  
1.253274947  
1.142154588  
0.9478690398  
0.6922521104  
0.4035291665  
0.1123822121  
-0.1520404582  
-0.3656355115  
-0.5119392359  
-0.5835459667  
-0.582252427  
-0.5180445071  
-0.4071368352  
-0.2694347785  
-0.1257645246  
0.004734777469  
0.10676072  
0.1703223711  
0.191407103  
0.1718555396  
0.118510385  
0.04183401638  
-0.04580380893  
-0.1319125086  
-0.2055003895  
-0.2583350203  
-0.2857003848  
-0.286591342  
-0.2633760498  
-0.2210190818  
-0.1660292484  
-0.1053240988  
-0.04518774061  
0.009518790676  
0.05579925246  
0.09258514832  
0.1204547791  
0.1410950162  
0.1566340734  
0.1689760361  
0.1792611852  
0.1875489167  
0.1927647165  
0.1929191638  
0.1855377405  
0.1682354536  
0.1393122649  
0.0982758455  
0.04619287875  
-0.01419764231  
-0.0786277119  
-0.1416990388  
-0.1974628198  
-0.2401310195  
-0.2647956736  
-0.2680812005  
-0.248635075  
-0.2073920361  
-0.1475853945  
-0.0744771108  
0.005145781367  
0.08368037081  
0.1535487787  
0.208080216  
0.2423451354  
0.253851042  
0.2430022551  
0.2132634728  
0.1709771634  
0.1248260001  
0.0849613998  
0.06186623023  
0.0650682123  
0.1018164975  
0.1759005879  
0.2867594032  
0.4290239832  
0.5926115735  
0.7634153661  
0.9245873271  
1.058308143  
1.147898093  
1.180014617  
1.146677793  
1.046830123  
0.8871708909  
0.6820600928  
0.4524075929  
0.2235610049  
0.02236987173  
-0.1262709998  
-0.2029938763  
-0.1971673006  
-0.1092488293  
0.04812911503  
0.2506459636  
0.4644599028  
0.6499259947  
0.7665246761  
0.7783917733  
0.6597466635  
0.3994039911  
0.003621994336  
-0.5032749738  
-1.080777684  
-1.676500491  
-2.232435972  
-2.692351336  
-3.009264133  
-3.151877733  
-3.108954893  
-2.890883978  
-2.528162895  
-2.066965318  
-1.56247482  
-1.071018611  
-0.6422354976  
-0.3124865272  
-0.1005054142  
-0.00588604111  
-0.01053330427  
-0.08272718131  
-0.1830313275  
-0.2710430877  
-0.3118753067  
-0.2813889378  
-0.1694430853  
0.0192159015  
0.2663937991  
0.5438460538  
0.8179711775  
1.05500923  
1.225936106  
1.310371468  
1.29900719  
1.194353726  
1.009838333  
0.7675312502  
0.4949225641  
0.2212646956  
-0.02602178671  
-0.2244287915  
-0.3586248051  
-0.4217043059  
-0.4153851375  
-0.3492335283  
-0.2390861024  
-0.1049047916  
0.03167425216  
0.1498196716  
0.2317885795  
0.2647950626  
0.2423171512  
0.1647466125  
0.03934379265  
-0.1204849526  
-0.2965082255  
-0.4674909757  
-0.6113320555  
-0.707365855  
-0.7385904477  
-0.6936327097  
-0.5682255688  
-0.3660411928  
-0.09874162648  
0.2147934509  
0.5500438888  
0.8790864877  
1.173307199  
1.406299354  
1.556646758  
1.610276562  
1.562104953  
1.416770343  
1.188329034  
0.8989150917  
0.5764825332  
0.2518459  
-0.04466782244  
-0.2865716462  
-0.4541903855  
-0.5368730043  
-0.5341464717  
-0.4556223415  
-0.3196116412  
-0.1505784774  
0.02429162472  
0.1789666559  
0.2923910363  
0.351687904  
0.3542687297  
0.3084828378  
0.2326225455  
0.1523677863  
0.09695090894  
0.09457618625  
0.1677358763  
0.3291477662  
0.5789529055  
0.9036644089  
1.277106261  
1.66324922  
2.020597604  
2.307484255  
2.487496793  
2.534226599  
2.434634744  
2.190546066  
1.818092795  
1.345250314  
0.8079132785  
0.2451723704  
-0.3054489397  
-0.8120623837  
-1.251238616  
-1.609247832  
-1.881715288  
-2.071933506  
-2.188306111  
-2.241522658  
-2.242037324  
-2.198332361  
-2.116231131  
-1.999281577  
-1.849999184  
-1.671566403  
-1.469486613  
-1.252714634  
-1.03389162  
-0.8285065289  
-0.6530546895  
-0.5224807652  
-0.4473815691  
-0.4315369024  
-0.4702992986  
-0.5502729553  
-0.650469172  
-0.7448873969  
-0.8061797567  
-0.8098656343  
-0.7384171907  
-0.5845242495  
-0.3529689158  
-0.06072474242  
0.264816422  
0.5892803984  
0.8759434959  
1.090895361  
1.207944201  
1.212538482  
1.104091212  
0.8963493376  
0.615731466  
0.2978769806  
-0.01710111687  
-0.2899534358  
-0.4874655097  
-0.5867233018  
-0.5778942899  
-0.4651700764  
-0.265792326  
-0.007364773854  
0.2761195774  
0.5489324469  
0.7782827986  
0.9383665795  
1.013276818  
0.998439007  
0.9004650391  
0.7355372158  
0.5266386609  
0.3000975728  
