235.4229681  
256.2639235  
303.4247617  
420.8280743  
861.0556764  
648.9776538  
11126.05253  
2861.172235  
23079.87309  
30248.58244  
8217.079909  
19780.94326  
4965.659598  
643.5623964  
7078.376852  
15306.36516  
6343.244624  
10262.51935  
11166.96467  
1292.304083  
7200.007109  
4649.181121  
4270.915597  
907.4454905  
9121.081303  
3806.857922  
2901.331129  
7628.851185  
1620.453098  
4158.868246  
3924.541157  
1014.295705  
8126.424136  
1453.719164  
1245.763039  
170.4318791  
5652.51664  
1761.467313  
5142.168433  
714.9767299  
58435.97782  
6544.727107  
16834.56658  
11446.96461  
29622.43969  
22733.09616  
21007.59094  
27861.00222  
10442.52193  
2747.094415  
3672.045817  
8688.69001  
10786.88711  
5058.822619  
6276.096382  
2910.622908  
1592.779815  
3428.151559  
958.0943838  
2232.971462  
1084.262023  
125.1837778  
816.8466236  
636.4344867  
182.5406871  
313.3968603  
87.11282823  
290.4931262  
52.45430546  
30.21086451  
32.51996488  
5.962954102  
1.279350716  
29.77441174  
18.57855554  
6.831691525  
2.027644392  
0.2144386166  
0.9551528962  
0.6215914453  
0.3384482468  
0.528705586  
0.7493607553  
0.1181085315  
0.6523959896  
0.2929680754  
0.3377239703  
0.2631249939  
0.3019615921  
0.2954046835  
0.2782664578  
0.1775239435  
0.1963612612  
0.157412475  
0.1460933131  
0.1602695482  
0.1353094498  
0.1392446324  
0.1226522943  
0.1159125431  
0.1080303115  
0.105401268  
0.1017818527  
0.09372657001  
0.08864567633  
0.08419681403  
0.07956294427  
0.07560241689  
0.07209817593  
0.06930176355  
0.0663998426  
0.06296477212  
0.06034839856  
0.05795996795  
0.05566584713  
0.05317279219  
0.0512632167  
0.0491943229  
0.04727202038  
0.04545164118  
0.04390492978  
0.04224166727  
0.04073402149  
0.03935691554  
0.03806110279  
0.03675712789  
0.03551448105  
0.03435234905  
0.03325813522  
0.03223053557  
0.03123992027  
0.03027568259  
0.02937244209  
0.0284941189  
0.02765262527  
0.02685462352  
0.02609336159  
0.0253550797  
0.02466592845  
0.02399369183  
0.02334818811  
0.02273290078  
0.02213289082  
0.02156540082  
0.02101338128  
0.02048334098  
0.01997936167  
0.01948449022  
0.01901671998  
0.01855961476  
0.01811809141  
0.01769835448  
0.0172946919  
0.01689529477  
0.01651265352  
0.01614744923  
0.01579352602  
0.01544765616  
0.01512067169  
0.0147980709  
0.014485408  
0.01418405142  
0.01389339008  
0.01360909638  
0.01333670803  
0.01307421554  
0.01281356123  
0.01256474074  
0.0123248229  
0.01208841607  
0.01186109209  
0.01163833098  
0.01142453462  
0.01121530053  
0.01101448084  
0.01081588641  
0.0106236186  
0.01043799544  
0.01025561545  
0.01007998276  
0.009911082983  
0.00974223888  
0.009579719392  
0.009420980321  
0.009265912589  
0.009117053172  
0.008970089464  
0.00882628555  
0.008686196452  
0.008551557036  
0.008420606242  
0.008290187781  
0.008163169016  
0.008043093805  
0.007922615274  
0.007805172205  
0.007689643115  
0.00757920466  
0.007471028451  
0.007364554721  
0.007259136144  
0.007157107229  
0.007058728452  
0.0069628564  
0.006868918956  
0.006774543534  
0.006684017254  
0.006595548758  
0.006508802708  
0.006422375864  
0.006340208117  
0.006259861365  
0.006179714886  
0.0061046378  
0.006026566222  
0.005950220432  
0.005877586021  
0.005806581916  
0.00573647621  
0.00566752817  
0.005601471954  
0.005533794474  
0.005470560927  
0.005407107795  
0.005346827223  
0.005284370194  
0.005224417021  
0.005165739327  
0.005108349105  
0.005052364374  
0.00499779017  
0.004943203417  
0.004888963597  
0.004838227665  
0.004787061191  
0.004736526165  
0.004684800542  
0.004637711472  
0.004588772474  
0.004545288044  
0.004497498579  
0.004452815201  
0.004408533901  
0.004364522032  
0.004322373431  
0.004282165379  
0.00424080063  
0.004199275974  
0.004159297683  
0.004121236845  
0.004081780286  
0.004044520196  
0.004008258281  
0.003971438571  
0.003934235578  
0.003901029836  
0.003864547809  
0.003831702692  
0.003796425214  
0.003764272564  
0.003730913061  
0.003699104873  
0.00366859848  
0.0036383611  
0.003606846495  
0.003577546709  
0.003547773319  
0.003518045225  
0.00348974299  
0.003462148952  
0.003434048748  
0.003407142147  
0.003380595438  
0.003354187716  
0.003327385067  
0.003302856996  
0.003277476173  
0.003252988031  
0.003229287547  
0.003204332879  
0.00318025138  
0.003157612035  
0.003134246368  
0.003110655393  
0.003089524709  
0.003067395908  
0.003045438335  
0.003025093118  
0.003003557117  
0.002982347439  
0.002962694063  
0.002942956014  
0.002922055582  
0.002902923436  
0.002882509574  
0.002863274943  
0.002845799307  
0.002826961675  
0.002809467198  
0.002790766355  
0.002772710117  
0.002755456141  
0.002737656918  
0.002721180247  
0.002704611175  
0.002688894147  
0.002672148664  
0.002655676063  
0.002639897463  
0.002623606411  
0.00260947736  
0.00259410828  
0.002577100586  
0.002564280536  
0.002549690896  
0.00253559218  
0.002520630109  
0.00250677466  
0.002492220212  
0.002479873432  
0.002464970784  
0.002452852472  
0.002438226172  
0.002426787073  
0.002413687264  
0.002401599836  
0.002387822047  
0.002376885354  
0.002364715221  
0.002353600717  
0.002340096759  
0.002328898541  
0.002318068487  
0.002306581603  
0.002295188939  
0.002284714394  
0.002274044836  
0.002262265553  
0.00225252142  
0.002242035913  
0.002231085497  
0.00221959939  
0.00221055442  
0.002200622133  
0.002191206068  
0.002181316567  
0.002170908282  
0.00216134277  
0.002152905868  
0.002144270463  
0.002134296956  
0.002125520408  
0.002116310699  
0.002107542022  
0.002099399577  
0.002090642918  
0.002082633023  
0.00207552012  
0.002067221769  
0.002058082177  
0.002049956883  
0.002042511937  
0.002035223934  
0.002026299264  
0.002019437052  
0.0020119944  
0.002004515306  
0.001997788585  
0.001989824686  
0.001983979499  
0.001976256575  
0.001968432629  
0.001961224441  
0.001955323362  
0.001948227714  
0.001941611093  
0.00193554581  
0.001928453033  
0.001922919324  
0.001917499085  
0.001911380892  
0.001905105308  
0.00189790325  
0.001892255426  
0.001886859201  
0.001880515136  
0.001875845873  
0.001870151849  
0.001864300486  
0.001858233267  
0.001853237432  
0.001848510089  
0.001842177596  
0.001836965824  
0.001831593402  
0.001827247525  
0.001823280828  
0.001819227645  
0.001813349965  
0.001808633226  
0.001802477047  
0.001798771388  
0.001794555418  
0.001790134051  
0.001785110535  
0.001781439705  
0.001777194261  
0.0017724722  
0.001768479833  
0.001764324532  
0.001760040972  
0.001756741347  
0.00175179587  
0.001748800195  
0.001745005657  
0.001741376244  
0.001737549699  
0.00173391882  
0.001730211864  
0.001726537696  
0.00172336444  
0.001720974221  
0.00171689213  
0.001713359356  
0.001710074785  
0.001707082577  
0.001703796066  
0.001701007281  
0.001698344984  
0.001694740858  
0.001691981129  
0.001687707927  
0.001686701162  
0.001684488303  
0.001680389389  
0.001678629445  
0.00167611846  
0.00167303199  
0.001670915456  
0.001667815063  
0.001666453997  
0.001662461712  
0.001661793318  
0.001658118339  
0.001656501663  
0.001655053069  
0.001651667165  
0.001649691779  
0.001649013819  
0.001647592614  
0.001644862374  
0.001643543147  
0.001641182616  
0.001639849551  
0.001637851515  
0.001636127125  
0.001634784888  
0.001632687819  
0.001631316371  
0.001629374443  
0.001628142853  
0.001626335943  
0.001625768568  
0.00162443434  
0.001622558527  
0.001621636892  
0.001620116588  
0.001618882161  
0.00161895869  
0.001617314905  
0.001616380781  
0.00161526727  
0.001614362873  
0.001613132612  
0.00161266494  
0.001610984315  
0.001610600043  
0.001609548886  
0.001609422813  
0.001609724819  
0.00160925921  
0.001607718251  
0.001607826595  
0.00160742657  
0.001606056476  
0.001607096428  
0.001606054287  
0.001605451026  
0.00160522554  
0.00160517015  
0.00160500153  
0.001604363197  
0.001603900299  
0.001604664569  
