1289.266276  
1391.083477  
1610.584921  
2061.298451  
2947.80951  
13317.55132  
13049.10747  
2190.901704  
12921.28778  
76649.74078  
10253.5923  
52.99365823  
2841.195002  
281.9979311  
7767.050951  
21761.58218  
7181.640418  
3666.397811  
3373.016095  
7838.653506  
7209.487635  
20132.97871  
6066.469645  
1478.25885  
4871.62521  
263.8129799  
7658.552017  
13276.1052  
25442.13188  
269.0564479  
1107.440983  
16174.1289  
17966.70868  
1695.376069  
8710.627465  
11743.23746  
1304.880892  
2982.491207  
6259.248887  
6071.788064  
7404.482234  
16259.73716  
2871.845678  
13702.44807  
20322.00888  
6556.68936  
1869.558609  
1779.836475  
426.0198586  
8305.029762  
56.77462182  
8522.88699  
3972.186974  
1618.159463  
4391.990273  
2511.140542  
8779.433019  
4788.107557  
7567.604365  
4409.106773  
466.4314654  
1551.189054  
366.6386857  
1717.653248  
1912.750688  
233.2195497  
395.3188887  
205.2705903  
478.1931222  
37.88807209  
151.600541  
5.7702807  
22.41203277  
85.57266926  
70.36805163  
36.27575557  
82.35770051  
20.7220036  
1.333366513  
17.94530953  
4.558849231  
15.49770438  
13.37104488  
17.1532766  
5.454068557  
7.493435611  
10.38927671  
10.0671216  
7.60368362  
8.240502035  
8.052868663  
9.819282701  
8.018352347  
6.891105153  
7.830630141  
6.689028105  
6.6424998  
6.152150535  
5.924930113  
5.842929635  
5.426616082  
5.42061983  
5.03652185  
4.982940468  
4.76053597  
4.560605902  
4.443632731  
4.340874606  
4.209663259  
4.063795348  
3.936010047  
3.828344315  
3.709345903  
3.609848482  
3.500612958  
3.401801989  
3.304050123  
3.214625947  
3.128731212  
3.044375273  
2.96322556  
2.887858788  
2.814116178  
2.743670555  
2.674779949  
2.611463508  
2.547262335  
2.487079744  
2.428766647  
2.372672907  
2.318151483  
2.266110324  
2.21565676  
2.167143209  
2.120040101  
2.074440302  
2.030535579  
1.988252686  
1.947169292  
1.907472867  
1.868950039  
1.831841534  
1.795775207  
1.760770545  
1.726975032  
1.694120865  
1.662275678  
1.631444244  
1.6014333  
1.572350536  
1.544095799  
1.516678283  
1.490007769  
1.464086469  
1.438917398  
1.414422657  
1.390623717  
1.367436865  
1.344885775  
1.322926809  
1.301571379  
1.280771603  
1.260522903  
1.240751466  
1.221495591  
1.202775597  
1.184461058  
1.166644687  
1.149263732  
1.132295494  
1.115748845  
1.099583163  
1.08381091  
1.068428795  
1.053382764  
1.038719583  
1.024379419  
1.010366474  
0.9966751632  
0.9832900862  
0.9702064333  
0.9574050266  
0.944938244  
0.9326920322  
0.9207298295  
0.9089968123  
0.8975369243  
0.8863647793  
0.8753768483  
0.8646232806  
0.8540945781  
0.8438007725  
0.8337131849  
0.8238288695  
0.814135122  
0.8046649128  
0.7953641711  
0.7862561724  
0.7773200808  
0.7685535933  
0.759984801  
0.7515888851  
0.7433237636  
0.7352024428  
0.7272526376  
0.7194885059  
0.7118198365  
0.7043181046  
0.6969736476  
0.6897238023  
0.6826349699  
0.6756605728  
0.6688400248  
0.6621117267  
0.6555047669  
0.6490255784  
0.6426588719  
0.6364081432  
0.630268703  
0.6242172195  
0.618311953  
0.6124563213  
0.6067423083  
0.6010978431  
0.5955785226  
0.5901237812  
0.5847581693  
0.5795080862  
0.5743316244  
0.5692309479  
0.5642304331  
0.5592876096  
0.5544575318  
0.5496892449  
0.5450035098  
0.5403798726  
0.5358258923  
0.5313578312  
0.5269591061  
0.5226285901  
0.5183727758  
0.5141805015  
0.510040614  
0.5059864416  
0.5019780601  
0.4980121168  
0.4941460311  
0.4902946571  
0.4865246382  
0.4828310781  
0.4791573869  
0.4755546426  
0.4720102396  
0.4685148396  
0.4650731928  
0.4616649489  
0.4583246611  
0.4550163544  
0.451765914  
0.4485856634  
0.4454150018  
0.442292216  
0.4392163686  
0.4361962963  
0.4332205613  
0.4302741424  
0.4273757841  
0.4245118708  
0.4216956213  
0.4189070712  
0.4161660289  
0.4134688453  
0.410785896  
0.4081647445  
0.4055645439  
0.4030055289  
0.4004802724  
0.3979836202  
0.3955163699  
0.3931056544  
0.3906911543  
0.3883292685  
0.3860040129  
0.3837116973  
0.3814364889  
0.3791899174  
0.3769867147  
0.3748019999  
0.3726386717  
0.3705170761  
0.3684116149  
0.3663536022  
0.3642932176  
0.3622811125  
0.3602923226  
0.358305518  
0.356375994  
0.354461244  
0.3525683173  
0.3506834262  
0.3488457923  
0.3470180359  
0.3452192332  
0.343447398  
0.3416875618  
0.3399471112  
0.3382339858  
0.3365427036  
0.3348673252  
0.3332178966  
0.331603049  
0.3299846725  
0.328394552  
0.3268328581  
0.3252689596  
0.3237159423  
0.3222168055  
0.3207330438  
0.3192554703  
0.3177895041  
0.3163443071  
0.3149163854  
0.3135211712  
0.3121209736  
0.3107571348  
0.309400047  
0.308062937  
0.3067332381  
0.3054264797  
0.3041315552  
0.3028482964  
0.3015893574  
0.3003442071  
0.299110618  
0.2978973713  
0.296689885  
0.2955029871  
0.2943311838  
0.2931681997  
0.2920189492  
0.2908950367  
0.2897611844  
0.2886545733  
0.2875705255  
0.2864822134  
0.285424895  
0.2843756866  
0.2833248382  
0.282303577  
0.2812806688  
0.2802699497  
0.2792879541  
0.2782933573  
0.27732649  
0.2763797474  
0.2754217764  
0.2744933558  
0.2735666187  
0.2726538577  
0.2717520079  
0.2708566048  
0.2699777838  
0.2691057328  
0.2682438893  
0.2673944299  
0.2665580501  
0.2657386736  
0.2649166866  
0.2641056762  
0.2633112841  
0.2625211772  
0.2617386328  
0.2609739623  
0.2602086411  
0.2594550433  
0.2587228449  
0.257988713  
0.2572623677  
0.2565434296  
0.2558441186  
0.2551522965  
0.2544598973  
0.2537802396  
0.2531131227  
0.2524481766  
0.2517928321  
0.2511440653  
0.2505076683  
0.2498856662  
0.2492645247  
0.2486459393  
0.2480413417  
0.2474488457  
0.2468635333  
0.2462813821  
0.2456994328  
0.2451447667  
0.2445852233  
0.2440298146  
0.2434913349  
0.2429461877  
0.242433855  
0.2419058028  
0.2413788995  
0.2408785562  
0.2403743983  
0.2398915258  
0.2394097909  
0.2389259691  
0.2384525532  
0.2379878141  
0.2375309464  
0.2370728958  
0.2366321993  
0.2362010115  
0.2357590818  
0.2353452633  
0.2349259359  
0.2345044037  
0.2341046254  
0.2337076452  
0.2333100349  
0.2329300533  
0.2325438568  
0.2321716782  
0.2317991356  
0.2314340838  
0.2310982705  
0.2307354688  
0.2303989484  
0.2300574705  
0.2297310773  
0.2294056885  
0.2290898337  
0.2287729068  
0.2284512616  
0.2281650782  
0.227867124  
0.2275773993  
0.2273002573  
0.2270145556  
0.2267389003  
0.2264644645  
0.2262089686  
0.2259598519  
0.2257156802  
0.2254552229  
0.2252185963  
0.2249831766  
0.2247560224  
0.2245305372  
0.2243173852  
0.2241038362  
0.223896038  
0.2236970848  
0.2234981406  
0.2233068548  
0.2231132741  
0.2229399091  
0.2227714834  
0.22259534  
0.2224332714  
0.2222727115  
0.2221174054  
0.2219675018  
0.2218272618  
0.2216909713  
0.2215499519  
0.2214238703  
0.2213086824  
0.2211798233  
0.2210707864  
0.2209638226  
0.2208662644  
0.2207571096  
0.2206697403  
0.2205892194  
0.2205075399  
0.2204261514  
0.2203512787  
0.2202790074  
0.2202158934  
0.2201732529  
0.2201107355  
0.2200576925  
0.220022769  
0.2199833069  
0.2199449161  
0.2199261579  
0.2198982869  
0.2198840656  
0.2198725054  
0.2198635999  
0.2198606007  
