
Melodic Version 3.14

melodic -i /home/mpib/LNDG/StateSwitch/WIP_rest/preproc/B_data/D_preproc/2261/preproc/rest/2261_rest_feat_detrended_bandpassed.nii.gz -o /home/mpib/LNDG/StateSwitch/WIP_rest/preproc/B_data/D_preproc/2261/preproc/rest/FEAT.feat/filtered_func_data.ica --dimest=mdl -d 0 --tr=.645 --report --guireport=/home/mpib/LNDG/StateSwitch/WIP_rest/preproc/B_data/D_preproc/2261/preproc/rest/FEAT.feat/filtered_func_data.ica/report.html --nobet --bgthreshold=3 --mmthresh=0.5 --bgimage=/home/mpib/LNDG/StateSwitch/WIP_rest/preproc/B_data/D_preproc/2261/preproc/rest/anat2func.nii.gz -v --Ostats 
---------------------------------------------

Melodic results will be in /home/mpib/LNDG/StateSwitch/WIP_rest/preproc/B_data/D_preproc/2261/preproc/rest/FEAT.feat/filtered_func_data.ica

Create mask ... done
Reading data file /home/mpib/LNDG/StateSwitch/WIP_rest/preproc/B_data/D_preproc/2261/preproc/rest/2261_rest_feat_detrended_bandpassed  ...  done
  Estimating data smoothness ...  done 
  Removing mean image ... done
  Normalising by voxel-wise variance ... done
Excluding voxels with constant value ... done

  Data size : 988 x 49024

Starting PCA  ... done
Start whitening using  26 dimensions ... 
  retaining 84.635 percent of the variability 
 ... done

Starting ICA estimation using symm

  Step no. 1 change : 0.983147
  Step no. 2 change : 0.218402
  Step no. 3 change : 0.108646
  Step no. 4 change : 0.0356487
  Step no. 5 change : 0.0292418
  Step no. 6 change : 0.019069
  Step no. 7 change : 0.00735392
  Step no. 8 change : 0.00667122
  Step no. 9 change : 0.00926757
  Step no. 10 change : 0.0105973
  Step no. 11 change : 0.00850873
  Step no. 12 change : 0.00770434
  Step no. 13 change : 0.00774841
  Step no. 14 change : 0.00579768
  Step no. 15 change : 0.00327723
  Step no. 16 change : 0.00159456
  Step no. 17 change : 0.00120143
  Step no. 18 change : 0.000960043
  Step no. 19 change : 0.000817875
  Step no. 20 change : 0.000938702
  Step no. 21 change : 0.00112598
  Step no. 22 change : 0.00130353
  Step no. 23 change : 0.00142083
  Step no. 24 change : 0.00143335
  Step no. 25 change : 0.00132555
  Step no. 26 change : 0.00112359
  Step no. 27 change : 0.000882038
  Step no. 28 change : 0.000653992
  Step no. 29 change : 0.000469708
  Step no. 30 change : 0.000335237
  Step no. 31 change : 0.000242739
  Step no. 32 change : 0.000194264
  Step no. 33 change : 0.000187463
  Step no. 34 change : 0.000185966
  Step no. 35 change : 0.000188518
  Step no. 36 change : 0.000194153
  Step no. 37 change : 0.000202128
  Step no. 38 change : 0.000211851
  Step no. 39 change : 0.000222829
  Step no. 40 change : 0.000234623
  Step no. 41 change : 0.000246832
  Step no. 42 change : 0.000259069
  Step no. 43 change : 0.000270955
  Step no. 44 change : 0.000282111
  Step no. 45 change : 0.000292159
  Step no. 46 change : 0.000300718
  Step no. 47 change : 0.000307414
  Step no. 48 change : 0.000311896
  Step no. 49 change : 0.000313852
  Step no. 50 change : 0.000313043
  Step no. 51 change : 0.000309323
  Step no. 52 change : 0.000302665
  Step no. 53 change : 0.000293171
  Step no. 54 change : 0.000281075
  Step no. 55 change : 0.000266724
  Step no. 56 change : 0.000250554
  Step no. 57 change : 0.000233056
  Step no. 58 change : 0.000214739
  Step no. 59 change : 0.000196096
  Step no. 60 change : 0.000177575
  Step no. 61 change : 0.00015956
  Step no. 62 change : 0.000142362
  Step no. 63 change : 0.000126208
  Step no. 64 change : 0.000111253
  Step no. 65 change : 9.75842e-05
  Step no. 66 change : 8.52289e-05
  Step no. 67 change : 7.41702e-05
  Step no. 68 change : 6.43565e-05
  Step no. 69 change : 5.57122e-05
  Step no. 70 change : 4.81469e-05
  Convergence after 70 steps 

Sorting IC maps

Writing results to : 
  /home/mpib/LNDG/StateSwitch/WIP_rest/preproc/B_data/D_preproc/2261/preproc/rest/FEAT.feat/filtered_func_data.ica/melodic_IC
  /home/mpib/LNDG/StateSwitch/WIP_rest/preproc/B_data/D_preproc/2261/preproc/rest/FEAT.feat/filtered_func_data.ica/melodic_Tmodes
  /home/mpib/LNDG/StateSwitch/WIP_rest/preproc/B_data/D_preproc/2261/preproc/rest/FEAT.feat/filtered_func_data.ica/melodic_mix
  /home/mpib/LNDG/StateSwitch/WIP_rest/preproc/B_data/D_preproc/2261/preproc/rest/FEAT.feat/filtered_func_data.ica/melodic_FTmix
  /home/mpib/LNDG/StateSwitch/WIP_rest/preproc/B_data/D_preproc/2261/preproc/rest/FEAT.feat/filtered_func_data.ica/melodic_PPCA
  /home/mpib/LNDG/StateSwitch/WIP_rest/preproc/B_data/D_preproc/2261/preproc/rest/FEAT.feat/filtered_func_data.ica/melodic_ICstats
  /home/mpib/LNDG/StateSwitch/WIP_rest/preproc/B_data/D_preproc/2261/preproc/rest/FEAT.feat/filtered_func_data.ica/mask
...done
Creating report index page ...done


Running Mixture Modelling on Z-transformed IC maps ...
  IC map 1 ... 
   calculating mixture-model fit 
   saving probability map:    /home/mpib/LNDG/StateSwitch/WIP_rest/preproc/B_data/D_preproc/2261/preproc/rest/FEAT.feat/filtered_func_data.ica/stats/probmap_1
   saving mixture model fit:  /home/mpib/LNDG/StateSwitch/WIP_rest/preproc/B_data/D_preproc/2261/preproc/rest/FEAT.feat/filtered_func_data.ica/stats/MMstats_1
   re-scaling spatial maps ... 
   thresholding ... 
   alternative hypothesis test at p > 0.5
   saving thresholded Z-stats image:  /home/mpib/LNDG/StateSwitch/WIP_rest/preproc/B_data/D_preproc/2261/preproc/rest/FEAT.feat/filtered_func_data.ica/stats/thresh_zstat1
   creating report page ...    done
  IC map 2 ... 
   calculating mixture-model fit 
   saving probability map:    /home/mpib/LNDG/StateSwitch/WIP_rest/preproc/B_data/D_preproc/2261/preproc/rest/FEAT.feat/filtered_func_data.ica/stats/probmap_2
   saving mixture model fit:  /home/mpib/LNDG/StateSwitch/WIP_rest/preproc/B_data/D_preproc/2261/preproc/rest/FEAT.feat/filtered_func_data.ica/stats/MMstats_2
   re-scaling spatial maps ... 
   thresholding ... 
   alternative hypothesis test at p > 0.5
   saving thresholded Z-stats image:  /home/mpib/LNDG/StateSwitch/WIP_rest/preproc/B_data/D_preproc/2261/preproc/rest/FEAT.feat/filtered_func_data.ica/stats/thresh_zstat2
   creating report page ...    done
  IC map 3 ... 
   calculating mixture-model fit 
   saving probability map:    /home/mpib/LNDG/StateSwitch/WIP_rest/preproc/B_data/D_preproc/2261/preproc/rest/FEAT.feat/filtered_func_data.ica/stats/probmap_3
   saving mixture model fit:  /home/mpib/LNDG/StateSwitch/WIP_rest/preproc/B_data/D_preproc/2261/preproc/rest/FEAT.feat/filtered_func_data.ica/stats/MMstats_3
   re-scaling spatial maps ... 
   thresholding ... 
   alternative hypothesis test at p > 0.5
   saving thresholded Z-stats image:  /home/mpib/LNDG/StateSwitch/WIP_rest/preproc/B_data/D_preproc/2261/preproc/rest/FEAT.feat/filtered_func_data.ica/stats/thresh_zstat3
   creating report page ...    done
  IC map 4 ... 
   calculating mixture-model fit 
   saving probability map:    /home/mpib/LNDG/StateSwitch/WIP_rest/preproc/B_data/D_preproc/2261/preproc/rest/FEAT.feat/filtered_func_data.ica/stats/probmap_4
   saving mixture model fit:  /home/mpib/LNDG/StateSwitch/WIP_rest/preproc/B_data/D_preproc/2261/preproc/rest/FEAT.feat/filtered_func_data.ica/stats/MMstats_4
   re-scaling spatial maps ... 
   thresholding ... 
   alternative hypothesis test at p > 0.5
   saving thresholded Z-stats image:  /home/mpib/LNDG/StateSwitch/WIP_rest/preproc/B_data/D_preproc/2261/preproc/rest/FEAT.feat/filtered_func_data.ica/stats/thresh_zstat4
   creating report page ...    done
  IC map 5 ... 
   calculating mixture-model fit 
   saving probability map:    /home/mpib/LNDG/StateSwitch/WIP_rest/preproc/B_data/D_preproc/2261/preproc/rest/FEAT.feat/filtered_func_data.ica/stats/probmap_5
   saving mixture model fit:  /home/mpib/LNDG/StateSwitch/WIP_rest/preproc/B_data/D_preproc/2261/preproc/rest/FEAT.feat/filtered_func_data.ica/stats/MMstats_5
   re-scaling spatial maps ... 
   thresholding ... 
   alternative hypothesis test at p > 0.5
   saving thresholded Z-stats image:  /home/mpib/LNDG/StateSwitch/WIP_rest/preproc/B_data/D_preproc/2261/preproc/rest/FEAT.feat/filtered_func_data.ica/stats/thresh_zstat5
   creating report page ...    done
  IC map 6 ... 
   calculating mixture-model fit 
   saving probability map:    /home/mpib/LNDG/StateSwitch/WIP_rest/preproc/B_data/D_preproc/2261/preproc/rest/FEAT.feat/filtered_func_data.ica/stats/probmap_6
   saving mixture model fit:  /home/mpib/LNDG/StateSwitch/WIP_rest/preproc/B_data/D_preproc/2261/preproc/rest/FEAT.feat/filtered_func_data.ica/stats/MMstats_6
   re-scaling spatial maps ... 
   thresholding ... 
   alternative hypothesis test at p > 0.5
   saving thresholded Z-stats image:  /home/mpib/LNDG/StateSwitch/WIP_rest/preproc/B_data/D_preproc/2261/preproc/rest/FEAT.feat/filtered_func_data.ica/stats/thresh_zstat6
   creating report page ...    done
  IC map 7 ... 
   calculating mixture-model fit 
   saving probability map:    /home/mpib/LNDG/StateSwitch/WIP_rest/preproc/B_data/D_preproc/2261/preproc/rest/FEAT.feat/filtered_func_data.ica/stats/probmap_7
   saving mixture model fit:  /home/mpib/LNDG/StateSwitch/WIP_rest/preproc/B_data/D_preproc/2261/preproc/rest/FEAT.feat/filtered_func_data.ica/stats/MMstats_7
   re-scaling spatial maps ... 
   thresholding ... 
   alternative hypothesis test at p > 0.5
   saving thresholded Z-stats image:  /home/mpib/LNDG/StateSwitch/WIP_rest/preproc/B_data/D_preproc/2261/preproc/rest/FEAT.feat/filtered_func_data.ica/stats/thresh_zstat7
   creating report page ...    done
  IC map 8 ... 
   calculating mixture-model fit 
   saving probability map:    /home/mpib/LNDG/StateSwitch/WIP_rest/preproc/B_data/D_preproc/2261/preproc/rest/FEAT.feat/filtered_func_data.ica/stats/probmap_8
   saving mixture model fit:  /home/mpib/LNDG/StateSwitch/WIP_rest/preproc/B_data/D_preproc/2261/preproc/rest/FEAT.feat/filtered_func_data.ica/stats/MMstats_8
   re-scaling spatial maps ... 
   thresholding ... 
   alternative hypothesis test at p > 0.5
   saving thresholded Z-stats image:  /home/mpib/LNDG/StateSwitch/WIP_rest/preproc/B_data/D_preproc/2261/preproc/rest/FEAT.feat/filtered_func_data.ica/stats/thresh_zstat8
   creating report page ...    done
  IC map 9 ... 
   calculating mixture-model fit 
   saving probability map:    /home/mpib/LNDG/StateSwitch/WIP_rest/preproc/B_data/D_preproc/2261/preproc/rest/FEAT.feat/filtered_func_data.ica/stats/probmap_9
   saving mixture model fit:  /home/mpib/LNDG/StateSwitch/WIP_rest/preproc/B_data/D_preproc/2261/preproc/rest/FEAT.feat/filtered_func_data.ica/stats/MMstats_9
   re-scaling spatial maps ... 
   thresholding ... 
   alternative hypothesis test at p > 0.5
   saving thresholded Z-stats image:  /home/mpib/LNDG/StateSwitch/WIP_rest/preproc/B_data/D_preproc/2261/preproc/rest/FEAT.feat/filtered_func_data.ica/stats/thresh_zstat9
   creating report page ...    done
  IC map 10 ... 
   calculating mixture-model fit 
   saving probability map:    /home/mpib/LNDG/StateSwitch/WIP_rest/preproc/B_data/D_preproc/2261/preproc/rest/FEAT.feat/filtered_func_data.ica/stats/probmap_10
   saving mixture model fit:  /home/mpib/LNDG/StateSwitch/WIP_rest/preproc/B_data/D_preproc/2261/preproc/rest/FEAT.feat/filtered_func_data.ica/stats/MMstats_10
   re-scaling spatial maps ... 
   thresholding ... 
   alternative hypothesis test at p > 0.5
   saving thresholded Z-stats image:  /home/mpib/LNDG/StateSwitch/WIP_rest/preproc/B_data/D_preproc/2261/preproc/rest/FEAT.feat/filtered_func_data.ica/stats/thresh_zstat10
   creating report page ...    done
  IC map 11 ... 
   calculating mixture-model fit 
   saving probability map:    /home/mpib/LNDG/StateSwitch/WIP_rest/preproc/B_data/D_preproc/2261/preproc/rest/FEAT.feat/filtered_func_data.ica/stats/probmap_11
   saving mixture model fit:  /home/mpib/LNDG/StateSwitch/WIP_rest/preproc/B_data/D_preproc/2261/preproc/rest/FEAT.feat/filtered_func_data.ica/stats/MMstats_11
   re-scaling spatial maps ... 
   thresholding ... 
   alternative hypothesis test at p > 0.5
   saving thresholded Z-stats image:  /home/mpib/LNDG/StateSwitch/WIP_rest/preproc/B_data/D_preproc/2261/preproc/rest/FEAT.feat/filtered_func_data.ica/stats/thresh_zstat11
   creating report page ...    done
  IC map 12 ... 
   calculating mixture-model fit 
   saving probability map:    /home/mpib/LNDG/StateSwitch/WIP_rest/preproc/B_data/D_preproc/2261/preproc/rest/FEAT.feat/filtered_func_data.ica/stats/probmap_12
   saving mixture model fit:  /home/mpib/LNDG/StateSwitch/WIP_rest/preproc/B_data/D_preproc/2261/preproc/rest/FEAT.feat/filtered_func_data.ica/stats/MMstats_12
   re-scaling spatial maps ... 
   thresholding ... 
   alternative hypothesis test at p > 0.5
   saving thresholded Z-stats image:  /home/mpib/LNDG/StateSwitch/WIP_rest/preproc/B_data/D_preproc/2261/preproc/rest/FEAT.feat/filtered_func_data.ica/stats/thresh_zstat12
   creating report page ...    done
  IC map 13 ... 
   calculating mixture-model fit 
   saving probability map:    /home/mpib/LNDG/StateSwitch/WIP_rest/preproc/B_data/D_preproc/2261/preproc/rest/FEAT.feat/filtered_func_data.ica/stats/probmap_13
   saving mixture model fit:  /home/mpib/LNDG/StateSwitch/WIP_rest/preproc/B_data/D_preproc/2261/preproc/rest/FEAT.feat/filtered_func_data.ica/stats/MMstats_13
   re-scaling spatial maps ... 
   thresholding ... 
   alternative hypothesis test at p > 0.5
   saving thresholded Z-stats image:  /home/mpib/LNDG/StateSwitch/WIP_rest/preproc/B_data/D_preproc/2261/preproc/rest/FEAT.feat/filtered_func_data.ica/stats/thresh_zstat13
   creating report page ...    done
  IC map 14 ... 
   calculating mixture-model fit 
   saving probability map:    /home/mpib/LNDG/StateSwitch/WIP_rest/preproc/B_data/D_preproc/2261/preproc/rest/FEAT.feat/filtered_func_data.ica/stats/probmap_14
   saving mixture model fit:  /home/mpib/LNDG/StateSwitch/WIP_rest/preproc/B_data/D_preproc/2261/preproc/rest/FEAT.feat/filtered_func_data.ica/stats/MMstats_14
   re-scaling spatial maps ... 
   thresholding ... 
   alternative hypothesis test at p > 0.5
   saving thresholded Z-stats image:  /home/mpib/LNDG/StateSwitch/WIP_rest/preproc/B_data/D_preproc/2261/preproc/rest/FEAT.feat/filtered_func_data.ica/stats/thresh_zstat14
   creating report page ...    done
  IC map 15 ... 
   calculating mixture-model fit 
   saving probability map:    /home/mpib/LNDG/StateSwitch/WIP_rest/preproc/B_data/D_preproc/2261/preproc/rest/FEAT.feat/filtered_func_data.ica/stats/probmap_15
   saving mixture model fit:  /home/mpib/LNDG/StateSwitch/WIP_rest/preproc/B_data/D_preproc/2261/preproc/rest/FEAT.feat/filtered_func_data.ica/stats/MMstats_15
   re-scaling spatial maps ... 
   thresholding ... 
   alternative hypothesis test at p > 0.5
   saving thresholded Z-stats image:  /home/mpib/LNDG/StateSwitch/WIP_rest/preproc/B_data/D_preproc/2261/preproc/rest/FEAT.feat/filtered_func_data.ica/stats/thresh_zstat15
   creating report page ...    done
  IC map 16 ... 
   calculating mixture-model fit 
   saving probability map:    /home/mpib/LNDG/StateSwitch/WIP_rest/preproc/B_data/D_preproc/2261/preproc/rest/FEAT.feat/filtered_func_data.ica/stats/probmap_16
   saving mixture model fit:  /home/mpib/LNDG/StateSwitch/WIP_rest/preproc/B_data/D_preproc/2261/preproc/rest/FEAT.feat/filtered_func_data.ica/stats/MMstats_16
   re-scaling spatial maps ... 
   thresholding ... 
   alternative hypothesis test at p > 0.5
   saving thresholded Z-stats image:  /home/mpib/LNDG/StateSwitch/WIP_rest/preproc/B_data/D_preproc/2261/preproc/rest/FEAT.feat/filtered_func_data.ica/stats/thresh_zstat16
   creating report page ...    done
  IC map 17 ... 
   calculating mixture-model fit 
   saving probability map:    /home/mpib/LNDG/StateSwitch/WIP_rest/preproc/B_data/D_preproc/2261/preproc/rest/FEAT.feat/filtered_func_data.ica/stats/probmap_17
   saving mixture model fit:  /home/mpib/LNDG/StateSwitch/WIP_rest/preproc/B_data/D_preproc/2261/preproc/rest/FEAT.feat/filtered_func_data.ica/stats/MMstats_17
   re-scaling spatial maps ... 
   thresholding ... 
   alternative hypothesis test at p > 0.5
   saving thresholded Z-stats image:  /home/mpib/LNDG/StateSwitch/WIP_rest/preproc/B_data/D_preproc/2261/preproc/rest/FEAT.feat/filtered_func_data.ica/stats/thresh_zstat17
   creating report page ...    done
  IC map 18 ... 
   calculating mixture-model fit 
   saving probability map:    /home/mpib/LNDG/StateSwitch/WIP_rest/preproc/B_data/D_preproc/2261/preproc/rest/FEAT.feat/filtered_func_data.ica/stats/probmap_18
   saving mixture model fit:  /home/mpib/LNDG/StateSwitch/WIP_rest/preproc/B_data/D_preproc/2261/preproc/rest/FEAT.feat/filtered_func_data.ica/stats/MMstats_18
   re-scaling spatial maps ... 
   thresholding ... 
   alternative hypothesis test at p > 0.5
   saving thresholded Z-stats image:  /home/mpib/LNDG/StateSwitch/WIP_rest/preproc/B_data/D_preproc/2261/preproc/rest/FEAT.feat/filtered_func_data.ica/stats/thresh_zstat18
   creating report page ...    done
  IC map 19 ... 
   calculating mixture-model fit 
   saving probability map:    /home/mpib/LNDG/StateSwitch/WIP_rest/preproc/B_data/D_preproc/2261/preproc/rest/FEAT.feat/filtered_func_data.ica/stats/probmap_19
   saving mixture model fit:  /home/mpib/LNDG/StateSwitch/WIP_rest/preproc/B_data/D_preproc/2261/preproc/rest/FEAT.feat/filtered_func_data.ica/stats/MMstats_19
   re-scaling spatial maps ... 
   thresholding ... 
   alternative hypothesis test at p > 0.5
   saving thresholded Z-stats image:  /home/mpib/LNDG/StateSwitch/WIP_rest/preproc/B_data/D_preproc/2261/preproc/rest/FEAT.feat/filtered_func_data.ica/stats/thresh_zstat19
   creating report page ...    done
  IC map 20 ... 
   calculating mixture-model fit 
   saving probability map:    /home/mpib/LNDG/StateSwitch/WIP_rest/preproc/B_data/D_preproc/2261/preproc/rest/FEAT.feat/filtered_func_data.ica/stats/probmap_20
   saving mixture model fit:  /home/mpib/LNDG/StateSwitch/WIP_rest/preproc/B_data/D_preproc/2261/preproc/rest/FEAT.feat/filtered_func_data.ica/stats/MMstats_20
   re-scaling spatial maps ... 
   thresholding ... 
   alternative hypothesis test at p > 0.5
   saving thresholded Z-stats image:  /home/mpib/LNDG/StateSwitch/WIP_rest/preproc/B_data/D_preproc/2261/preproc/rest/FEAT.feat/filtered_func_data.ica/stats/thresh_zstat20
   creating report page ...    done
  IC map 21 ... 
   calculating mixture-model fit 
   saving probability map:    /home/mpib/LNDG/StateSwitch/WIP_rest/preproc/B_data/D_preproc/2261/preproc/rest/FEAT.feat/filtered_func_data.ica/stats/probmap_21
   saving mixture model fit:  /home/mpib/LNDG/StateSwitch/WIP_rest/preproc/B_data/D_preproc/2261/preproc/rest/FEAT.feat/filtered_func_data.ica/stats/MMstats_21
   re-scaling spatial maps ... 
   thresholding ... 
   alternative hypothesis test at p > 0.5
   saving thresholded Z-stats image:  /home/mpib/LNDG/StateSwitch/WIP_rest/preproc/B_data/D_preproc/2261/preproc/rest/FEAT.feat/filtered_func_data.ica/stats/thresh_zstat21
   creating report page ...    done
  IC map 22 ... 
   calculating mixture-model fit 
   saving probability map:    /home/mpib/LNDG/StateSwitch/WIP_rest/preproc/B_data/D_preproc/2261/preproc/rest/FEAT.feat/filtered_func_data.ica/stats/probmap_22
   saving mixture model fit:  /home/mpib/LNDG/StateSwitch/WIP_rest/preproc/B_data/D_preproc/2261/preproc/rest/FEAT.feat/filtered_func_data.ica/stats/MMstats_22
   re-scaling spatial maps ... 
   thresholding ... 
   alternative hypothesis test at p > 0.5
   saving thresholded Z-stats image:  /home/mpib/LNDG/StateSwitch/WIP_rest/preproc/B_data/D_preproc/2261/preproc/rest/FEAT.feat/filtered_func_data.ica/stats/thresh_zstat22
   creating report page ...    done
  IC map 23 ... 
   calculating mixture-model fit 
   saving probability map:    /home/mpib/LNDG/StateSwitch/WIP_rest/preproc/B_data/D_preproc/2261/preproc/rest/FEAT.feat/filtered_func_data.ica/stats/probmap_23
   saving mixture model fit:  /home/mpib/LNDG/StateSwitch/WIP_rest/preproc/B_data/D_preproc/2261/preproc/rest/FEAT.feat/filtered_func_data.ica/stats/MMstats_23
   re-scaling spatial maps ... 
   thresholding ... 
   alternative hypothesis test at p > 0.5
   saving thresholded Z-stats image:  /home/mpib/LNDG/StateSwitch/WIP_rest/preproc/B_data/D_preproc/2261/preproc/rest/FEAT.feat/filtered_func_data.ica/stats/thresh_zstat23
   creating report page ...    done
  IC map 24 ... 
   calculating mixture-model fit 
   saving probability map:    /home/mpib/LNDG/StateSwitch/WIP_rest/preproc/B_data/D_preproc/2261/preproc/rest/FEAT.feat/filtered_func_data.ica/stats/probmap_24
   saving mixture model fit:  /home/mpib/LNDG/StateSwitch/WIP_rest/preproc/B_data/D_preproc/2261/preproc/rest/FEAT.feat/filtered_func_data.ica/stats/MMstats_24
   re-scaling spatial maps ... 
   thresholding ... 
   alternative hypothesis test at p > 0.5
   saving thresholded Z-stats image:  /home/mpib/LNDG/StateSwitch/WIP_rest/preproc/B_data/D_preproc/2261/preproc/rest/FEAT.feat/filtered_func_data.ica/stats/thresh_zstat24
   creating report page ...    done
  IC map 25 ... 
   calculating mixture-model fit 
   saving probability map:    /home/mpib/LNDG/StateSwitch/WIP_rest/preproc/B_data/D_preproc/2261/preproc/rest/FEAT.feat/filtered_func_data.ica/stats/probmap_25
   saving mixture model fit:  /home/mpib/LNDG/StateSwitch/WIP_rest/preproc/B_data/D_preproc/2261/preproc/rest/FEAT.feat/filtered_func_data.ica/stats/MMstats_25
   re-scaling spatial maps ... 
   thresholding ... 
   alternative hypothesis test at p > 0.5
   saving thresholded Z-stats image:  /home/mpib/LNDG/StateSwitch/WIP_rest/preproc/B_data/D_preproc/2261/preproc/rest/FEAT.feat/filtered_func_data.ica/stats/thresh_zstat25
   creating report page ...    done
  IC map 26 ... 
   calculating mixture-model fit 
   saving probability map:    /home/mpib/LNDG/StateSwitch/WIP_rest/preproc/B_data/D_preproc/2261/preproc/rest/FEAT.feat/filtered_func_data.ica/stats/probmap_26
   saving mixture model fit:  /home/mpib/LNDG/StateSwitch/WIP_rest/preproc/B_data/D_preproc/2261/preproc/rest/FEAT.feat/filtered_func_data.ica/stats/MMstats_26
   re-scaling spatial maps ... 
   thresholding ... 
   alternative hypothesis test at p > 0.5
   saving thresholded Z-stats image:  /home/mpib/LNDG/StateSwitch/WIP_rest/preproc/B_data/D_preproc/2261/preproc/rest/FEAT.feat/filtered_func_data.ica/stats/thresh_zstat26
   creating report page ...    done

Writing results to : 
  /home/mpib/LNDG/StateSwitch/WIP_rest/preproc/B_data/D_preproc/2261/preproc/rest/FEAT.feat/filtered_func_data.ica/melodic_IC
  /home/mpib/LNDG/StateSwitch/WIP_rest/preproc/B_data/D_preproc/2261/preproc/rest/FEAT.feat/filtered_func_data.ica/melodic_Tmodes
  /home/mpib/LNDG/StateSwitch/WIP_rest/preproc/B_data/D_preproc/2261/preproc/rest/FEAT.feat/filtered_func_data.ica/melodic_mix
  /home/mpib/LNDG/StateSwitch/WIP_rest/preproc/B_data/D_preproc/2261/preproc/rest/FEAT.feat/filtered_func_data.ica/melodic_FTmix
  /home/mpib/LNDG/StateSwitch/WIP_rest/preproc/B_data/D_preproc/2261/preproc/rest/FEAT.feat/filtered_func_data.ica/melodic_PPCA
  /home/mpib/LNDG/StateSwitch/WIP_rest/preproc/B_data/D_preproc/2261/preproc/rest/FEAT.feat/filtered_func_data.ica/melodic_ICstats
  /home/mpib/LNDG/StateSwitch/WIP_rest/preproc/B_data/D_preproc/2261/preproc/rest/FEAT.feat/filtered_func_data.ica/mask
...done


 To view the output report point your web browser at /home/mpib/LNDG/StateSwitch/WIP_rest/preproc/B_data/D_preproc/2261/preproc/rest/FEAT.feat/filtered_func_data.ica/report/00index.html

finished!

