0.6867598647  
-0.01853778839  
-0.6838670765  
-1.261745141  
-1.715170039  
-2.021672122  
-2.175343512  
-2.186614913  
-2.079954712  
-1.889905863  
-1.656115563  
-1.418109397  
-1.210509902  
-1.059328066  
-0.9797049296  
-0.9752595161  
-1.038967544  
-1.155270624  
-1.303015503  
-1.458720581  
-1.59972576  
-1.706825072  
-1.766144824  
-1.770131144  
-1.717690064  
-1.613601829  
-1.467412276  
-1.292029284  
-1.102224895  
-0.913217822  
-0.7394264845  
-0.593449166  
-0.4852689802  
-0.4216636894  
-0.4057765493  
-0.4368690415  
-0.5102326105  
-0.6173409937  
-0.746283594  
-0.8825434661  
-1.010145132  
-1.113117658  
-1.177165473  
-1.191334123  
-1.149446301  
-1.051026738  
-0.9015380962  
-0.7118084323  
-0.496685254  
-0.2730852148  
-0.05772249674  
0.1351254775  
0.2954541416  
0.4186799686  
0.5059293446  
0.5634236758  
0.6010931638  
0.6306656871  
0.6635461028  
0.7088451316  
0.7718646785  
0.8532793566  
0.9491230767  
1.051558883  
1.150289065  
1.23433523  
1.293889502  
1.321898031  
1.315105953  
1.274409763  
1.204445813  
1.112546234  
1.007264575  
0.8967685118  
0.7874190207  
0.6828263457  
0.5835397149  
0.4874532216  
0.3908490168  
0.2898542715  
0.1820176201  
0.06766840855  
-0.04927761259  
-0.16129318  
-0.2580925649  
-0.3282978977  
-0.3616408825  
-0.3513275134  
-0.2960823976  
-0.2014218871  
-0.07981750703  
0.05040655216  
0.1673492323  
0.2486779934  
0.2751228487  
0.2337676313  
0.120519916  
-0.05864737585  
-0.2879559573  
-0.5435772218  
-0.7966103812  
-1.016871868  
-1.17688769  
-1.255517493  
-1.24065263  
-1.130634018  
-0.9342145376  
-0.6691215695  
-0.3595030714  
-0.03268660717  
0.2842539019  
0.567598183  
0.7993605448  
0.9686843992  
1.072161591  
1.113187587  
1.1005693  
1.046691007  
0.9655976888  
0.8712424678  
0.7761345061  
0.6904475126  
0.6215899926  
0.5741222019  
0.5498926211  
0.5482590417  
0.5663062147  
0.5990505474  
0.6396955803  
0.6799986115  
0.7108865188  
0.723317081  
0.7093808636  
0.6634960127  
0.5834955355  
0.4713776024  
0.3334979615  
0.1800855446  
0.02406674566  
-0.1206474502  
-0.2411879928  
-0.327708409  
-0.3749961065  
-0.3834074853  
-0.3589559794  
-0.3124892124  
-0.2580746025  
-0.2108286215  
-0.1844898393  
-0.1891370449  
-0.2293685824  
-0.3032394232  
-0.4021285068  
-0.5115928766  
-0.6131087727  
-0.686516537  
-0.7128413455  
-0.6771352069  
-0.5709339122  
-0.3939816652  
-0.1549387909  
0.1290739404  
0.4340798797  
0.7318210142  
0.9929655752  
1.190517833  
1.30297222  
1.316774905  
1.227798025  
1.041669718  
0.7729813549  
0.4435502617  
0.08001505771  
-0.2888982617  
-0.635121752  
-0.9337277869  
-1.16495433  
-1.315649827  
-1.380078552  
-1.360062738  
-1.264479544  
-1.108150471  
-0.9101990779  
-0.69201082  
-0.4749717064  
-0.2782232594  
-0.1166998886  
0.0002969359858  
0.06979552118  
0.09501471474  
0.08440447883  
0.05002637  
0.00552683042  
-0.03598341007  
-0.06378803344  
-0.07091069903  
-0.05475259459  
-0.01697814868  
0.03724662058  
0.1004813895  
0.1644325122  
0.2213076151  
0.2648958338  
0.2912458882  
0.298912515  
0.2888389677  
0.2639751217  
0.228752828  
0.1885103277  
0.1489318172  
0.1155021192  
0.09298425608  
0.08491204964  
0.09312702718  
0.1174103894  
0.1552982037  
0.2021534156  
0.251545897  
0.2959437516  
0.3276417931  
0.3398056682  
0.3274713228  
0.2883315973  
0.2231814141  
0.1359458904  
0.03328123536  
-0.07617234794  
-0.1827873421  
-0.2770280606  
-0.350492279  
-0.3967582832  
-0.4120000138  
-0.3952894071  
-0.3486384758  
-0.2767695961  
-0.1866969117  
-0.0871231035  
0.0122782843  
0.1016949828  
0.1720650232  
0.2159715674  
0.2284661874  
0.2077122662  
0.1553607648  
0.07655385672  
-0.0204713901  
-0.1251877863  
-0.2259167956  
-0.3111694447  
-0.3710423255  
-0.3984535989  
-0.3900682972  
-0.3467441797  
-0.2734139402  
-0.1783798477  
-0.07210952671  
0.03431816845  
0.1308778533  
0.2101158759  
0.2682525637  
0.305681025  
0.3267671975  
0.3389682057  
0.3514227305  
0.373252117  
0.411858026  
0.4715162985  
0.5524975179  
0.6508556796  
0.7589247964  
0.8664375001  
0.9620728746  
1.035177406  
1.077375171  
1.083790276  
1.053690351  
0.9904396097  
0.9007968313  
0.7937000035  
0.6787810285  
0.5648879054  
0.4588830207  
0.3649215994  
0.2842903752  
0.2157949571  
0.1565529868  
0.1029920266  
0.05183393405  
0.0008671714761  
-0.05064223076  
-0.1019395991  
-0.1511413691  
-0.1958608661  
-0.233931154  
-0.2640553035  
-0.2862165276  
-0.3017663773  
-0.3131433755  
-0.3232972988  
-0.3349620262  
-0.3499587127  
-0.3687171922  
-0.3901487924  
-0.4119084704  
-0.430997669  
-0.4445104498  
-0.4503197251  
-0.4474872719  
-0.4362543493  
-0.4176010479  
-0.3925092395  
-0.3611725639  
-0.3224497743  
-0.2738111574  
-0.2119156755  
-0.1337497103  
-0.03808406841  
0.07313571117  
0.1939301159  
0.3142965651  
0.4213019517  
0.5011504021  
0.5418934821  
0.5361944269  
0.4835020843  
0.3910210901  
0.2731082785  
0.1490367135  
0.03946807938  
-0.03771774548  
-0.07136916694  
-0.05989277818  
-0.0122684543  
0.05313198674  
0.1118104881  
0.1379648937  
0.1099425375  
0.0152245898  
-0.1461128684  
-0.360270549  
-0.6012666942  
-0.8349764791  
-1.024968938  
-1.139078402  
-1.155440673  
-1.066851545  
-0.8825609685  
-0.6271450466  
-0.3366208788  
-0.05251649278  
0.1850506466  
0.3440280199  
0.4056551213  
0.3673836895  
0.2430482332  
0.06032580131  
-0.1439741887  
-0.3299681919  
-0.4610431151  
-0.5095044419  
-0.4606702327  
-0.3148921449  
-0.08730191496  
0.1945631491  
0.4948233068  
0.7743858181  
0.9964102332  
1.131396899  
1.16123192  
1.081697403  
0.9031071871  
0.6489822643  
0.3529047485  
0.05394218569  
-0.2087605531  
-0.4014721013  
-0.5006419031  
-0.4962118431  
-0.3929273331  
-0.2093978042  
0.02497264641  
0.2747073277  
0.5038666487  
0.6816012938  
0.7867272202  
0.8105587927  
0.7575674973  
0.64382779  
0.4936057728  
0.3347805695  
0.1939371613  
0.09203089459  
0.04131061188  
0.04395317908  
0.09249304162  
0.1718340265  
0.2623415967  
0.3434138377  
0.3968982478  
0.4098233329  
0.3761002898  
0.2970605696  
0.1808612399  
0.04099123168  
-0.1058434182  
-0.242103498  
-0.3517493883  
-0.422239201  
-0.4459899223  
-0.4211540694  
-0.3516864952  
-0.2466989954  
-0.1192405218  
0.01536356125  
0.1413905912  
0.2446172872  
0.3139996757  
0.3429596735  
0.330140609  
0.2795169749  
0.199859531  
0.1035792268  
0.005079550248  
-0.08121418307  
-0.1428901833  
-0.1713711923  
-0.1632583297  
-0.120938292  
-0.05233003501  
0.0302509003  
0.1119791307  
0.1778814156  
0.215319443  
0.2161783673  
0.1784036755  
0.1066001498  
0.01157617368  
-0.09111931174  
-0.1834723746  
-0.2477401679  
-0.2692383217  
-0.2387412415  
-0.1541179457  
-0.02093195218  
0.1481043304  
0.3347622078  
0.5177810467  
0.6758152938  
0.7904130827  
0.8485541595  
0.8443712319  
0.7798136568  
0.6641788771  
0.5126156405  
0.3438741215  
0.1776587703  
0.03198337191  
-0.07909207363  
-0.1470537046  
-0.1696808883  
-0.1508983252  
-0.09982723771  
-0.02920758346  
0.04653658972  
0.1133047734  
0.1591307509  
0.1755605486  
0.1584679399  
0.1082440628  
0.0294090066  
-0.07025783958  
-0.1809015366  
-0.2919407206  
-0.3934062321  
-0.4771335326  
-0.5376826518  
-0.5729029404  
-0.5840614969  
-0.5755187547  
-0.5539694242  
-0.5273356902  
-0.5034580657  
-0.4887898738  
-0.4873110757  
-0.4998612068  
-0.5240217239  
-0.554594412  
-0.5845820991  
-0.6065107862  
-0.6138535923  
-0.6022881053  
-0.5705811148  
-0.5209368107  
-0.4587583592  
-0.3918600922  
-0.3292475813  
-0.2796730858  
-0.2501676822  
-0.2447857542  
-0.2637756667  
-0.3033067302  
-0.3558347277  
-0.4110543131  
-0.4573317774  
-0.4833468933  
-0.4797370619  
-0.440405346  
-0.363323697  
-0.2506969539  
-0.108496141  
0.05451251558  
0.2280288129  
0.4015403719  
0.5654700301  
0.7120219241  
0.8356257129  
0.9330346651  
1.003129528  
1.046549564  
1.065250411  
1.062069046  
1.040346008  
1.003631088  
0.9554733568  
0.8993059827  
0.8384041519  
0.7759139937  
0.714910624  
0.6584376659  
0.6094823068  
0.570813563  
0.5446852222  
0.5324066279  
0.5338809335  
0.5472096913  
0.5685325943  
0.5921935906  
0.6113181823  
0.6187471409  
0.6082346766  
0.5756620129  
0.5200680244  
0.4442252382  
0.3546114984  
0.2607022284  
0.1736380277  
0.1044457102  
0.06209294697  
0.05171014592  
0.0733159747  
0.12132782  
0.1850493949  
0.2501358082  
0.300900321  
0.3231283624  
0.30692214  
0.249045254  
0.1542456038  
0.03519439778  
-0.08911436296  
-0.1963430441  
-0.2647175391  
-0.2771665702  
-0.2249053315  
-0.1096860175  
0.05581991736  
0.2496987821  
0.4443130412  
0.6110554032  
0.7254154667  
0.771366202  
0.744157477  
0.6509302428  
0.5089769695  
0.3420030616  
0.1751546372  
0.02985810324  
-0.08042102609  
-0.1525877918  
-0.1939693387  
-0.2199904691  
-0.2499954485  
-0.3021359277  
-0.3884836344  
-0.5114902984  
-0.6626270132  
-0.8235626149  
-0.9696943796  
-1.075298668  
-1.119205523  
-1.089764895  
-0.9879966662  
-0.8281920648  
-0.6357664545  
-0.44274726  
-0.2817877156  
-0.1799051212  
-0.1532240345  
-0.2037921646  
-0.3191285918  
-0.4745898759  
-0.6380982412  
-0.776284869  
-0.8608357705  
-0.8738074465  
-0.810898738  
-0.6820879869  
-0.5095492005  
-0.3233192915  
-0.1555777344  
-0.03464760046  
0.02016702519  
0.001970796548  
-0.08266315779  
-0.2150812886  
-0.3680798818  
-0.5108874605  
-0.6147027356  
-0.6578356511  
-0.6295904553  
-0.5322640918  
-0.3809477659  
-0.2011516385  
-0.02464079452  
0.1159082764  
0.1925685145  
0.1872528894  
0.09538611741  
-0.07252112151  
-0.2917272569  
-0.5265634449  
-0.7357191091  
-0.8787592954  
-0.9228124093  
-0.8483140931  
-0.6527966667  
-0.3520082515  
0.02191028651  
0.4249492848  
0.8077464007  
1.123022801  
1.332690485  
1.413459854  
1.36002776  
1.185375428  
0.9182131499  
0.5981033372  
0.2691619485  
-0.02654290438  
-0.2548168272  
-0.393497057  
-0.4344327563  
-0.3831550786  
-0.2565576616  
-0.07916170613  
0.1212651601  
0.3179836677  
0.4888167271  
0.6185272148  
0.6998806773  
0.7334603711  
0.72645409  
0.69075892  
0.6407550698  
0.5910675891  
0.5545840604  
0.5409338868  
0.5555221926  
0.5991777031  
0.6683938624  
0.7560764145  
0.8526797029  
0.9475679438  
1.030422413  
1.092529309  
1.127794751  
1.133376049  
1.109875445  
1.061084577  
0.9933150271  
0.9144329591  
0.8327082741  
0.7556617402  
0.6890706806  
0.6362908319  
0.5980032042  
0.5724142887  
0.5558780142  
0.5437974073  
0.5316424524  
0.5158716093  
0.4945989543  
0.4678782866  
0.4375757854  
0.4068935506  
0.3796558491  
0.3595164712  
0.3492469719  
0.3502443735  
0.3623185716  
0.3837833371  
0.4118073302  
0.4429273054  
0.4736021225  
0.50069269  
0.5217431191  
0.5350213103  
0.5393034985  
0.5334866734  
0.5161321462  
0.4851258486  
0.4375977964  
0.3702177933  
0.2798806926  
0.1647141986  
0.02520474689  
-0.1348001034  
-0.3075153127  
-0.4812924653  
-0.6415034677  
-0.7722166797  
-0.858503674  
-0.8890567055  
-0.8586540686  
-0.7700218241  
-0.6346099252  
-0.4719772998  
-0.3076946099  
-0.1699018736  
-0.08498265389  
-0.07301426882  
-0.1438126401  
-0.2943658925  
-0.508288457  
-0.757609371  
-1.006781275  
-1.218359496  
-1.359423394  
-1.407599082  
-1.35551339  
-1.212766505  
-1.00489888  
-0.7694186987  
-0.5494867424  
-0.3863719715  
-0.3120380144  
-0.3432533119  
-0.47835645  
-0.6973085667  
-0.9650783463  
-1.237720384  
-1.470043631  
-1.623421458  
-1.672315617  
-1.608335367  
-1.441152821  
-1.196212557  
-0.9097930317  
-0.6224473873  
-0.3721143524  
-0.1881932021  
-0.08757481989  
-0.07320852533  
-0.1351999824  
-0.2539841256  
-0.4047091904  
-0.5618472624  
-0.7031174335  
-0.812063384  
-0.8790513698  
-0.9008036198  
-0.8789675444  
-0.8183318416  
-0.7253173526  
-0.6071522856  
-0.4718554556  
-0.3288141158  
-0.1894938237  
-0.06771029542  
0.02102628764  
0.06134755505  
0.04090867025  
-0.04615336858  
-0.1959906883  
-0.3929598589  
-0.6094711262  
-0.8082774375  
-0.947173157  
-0.9855712674  
-0.8918842101  
-0.6503616169  
-0.2659725361  
0.2338312113  
0.801136932  
1.373332861  
1.881879216  
2.262724494  
2.466604904  
2.467411689  
2.267080206  
1.896003519  
1.408782973  
0.8759137824  
0.3727724881  
-0.0322426853  
-0.2883994812  
-0.3703029073  
-0.2812664642  
-0.05181228299  
0.2663508184  
0.6097962875  
0.914560426  
1.127097955  
1.213100055  
1.162740569  
0.9915603841  
0.737004439  
0.4513944371  
0.1926986256  
0.01477339335  
-0.04123882097  
0.04699333171  
0.2802519758  
0.6385847225  
1.085244157  
1.572862818  
2.05064792  
2.471385682  
2.797191519  
3.003308804  
3.079639401  
3.030136374  
2.870461819  
2.624544311  
2.320693302  
1.987874257  
1.652605241  
1.336739408  
1.056222331  
0.8207769793  
0.6343534345  
0.4961124625  
0.4017223895  
0.3447296348  
0.3177968947  
0.3136688942  
0.3257785589  
0.3484727693  
0.3769363916  
0.4069234753  
0.4344555486  
0.4556250705  
0.4666280052  
0.4640311189  
0.4452405214  
0.4090515839  
0.3561157164  
0.2891815884  
0.2129999861  
0.1338623092  
0.05881301773  
-0.005342225317  
-0.05307660397  
-0.08106891219  
-0.08886126576  
-0.07913733942  
-0.05757625464  
-0.03227420126  
-0.01281337256  
-0.009075273145  
-0.02997064557  
-0.08226413909  
-0.1696509209  
-0.2922588514  
-0.4466256339  
-0.6261699176  
-0.8220691973  
-1.024386526  
-1.223264689  
-1.409989133  
-1.577795213  
-1.722298636  
-1.841584347  
-1.935965958  
-2.007529289  
-2.059547332  
-2.095866266  
-2.120343747  
-2.136383894  
-2.146606719  
-2.15268396  
-2.155332365  
-2.154461714  
-2.149442877  
-2.139418762  
-2.123612621  
-2.101536983  
-2.073067065  
-2.038357014  
-1.99764775  
-1.951011811  
-1.898152338  
-1.838318255  
-1.770394385  
-1.693176404  
-1.605765506  
-1.50800941  
-1.400858452  
-1.28654602  
-1.168511286  
-1.051046562  
-0.9387077826  
-0.835595882  
-0.7446306225  
-0.6669627301  
-0.6016495841  
-0.5456570388  
-0.4941980132  
-0.4413545225  
-0.3808864026  
-0.3070961834  
-0.2156191519  
-0.1040503908  
0.02770124917  
0.1773363421  
0.3404041334  
0.5108171911  
0.6815795558  
0.8456511164  
0.9968292884  
1.130532794  
1.244358234  
1.338331897  
1.414804263  
1.478004171  
1.533333439  
1.586518767  
1.642771037  
1.706096721  
1.778860279  
1.861670233  
1.953565336  
2.052466661  
2.15576164  
2.260910777  
2.365934442  
2.469659802  
2.571676616  
2.671979816  
2.770369146  
2.865725773  
2.955340542  
3.034468209  
3.096276773  
3.132281586  
3.133285208  
3.090724572  
2.998250285  
2.853262677  
2.658092888  
2.420550632  
2.153578055  
1.873931402  
1.599923383  
1.348499257  
1.132048621  
0.9555073483  
0.8143263233  
0.6938194819  
0.570218761  
0.4135123403  
0.19182159  
-0.1232282047  
-0.5509128908  
-1.096495771  
-1.747889764  
-2.474612123  
-3.229451508  
-3.95287246  
-4.579732678  
-5.047486257  
-5.304726178  
-5.318777886  
-5.081112729  
-4.609623275  
-3.947254084  
-3.157070542  
-2.314434846  
