0.04648874777  
-0.544364945  
-1.098142818  
-1.578414641  
-1.956373103  
-2.213591299  
-2.343461434  
-2.351202917  
-2.252521491  
-2.071199922  
-1.836005365  
-1.577352923  
-1.324154666  
-1.101189047  
-0.927210399  
-0.8139053876  
-0.7656559714  
-0.7800042813  
-0.8486404234  
-0.9587464143  
-1.094503892  
-1.238657687  
-1.37401403  
-1.484825269  
-1.558004417  
-1.584130438  
-1.558197932  
-1.480052948  
-1.354461606  
-1.190757229  
-1.002054412  
-0.80404569  
-0.6134634604  
-0.4463385717  
-0.3162354012  
-0.2326740117  
-0.1999329253  
-0.2164233683  
-0.2747296448  
-0.3623628889  
-0.4631563258  
-0.5591629058  
-0.63283275  
-0.6692040556  
-0.6578340816  
-0.5942181239  
-0.4805015326  
-0.3253771279  
-0.1431627343  
0.04785016132  
0.2275825204  
0.3766286081  
0.4786905537  
0.5226797339  
0.5042224455  
0.4263563148  
0.2993350206  
0.1395352749  
-0.03240774413  
-0.1940068916  
-0.3235938215  
-0.4029074916  
-0.4192933809  
-0.3672285923  
-0.2489904477  
-0.07438358166  
0.1404285222  
0.3748389827  
0.6062010413  
0.8124244378  
0.9744182645  
1.078092723  
1.115678692  
1.086224107  
0.9952544078  
0.8536858969  
0.676177661  
0.4792002845  
0.2790828671  
0.09032840645  
-0.07560127403  
-0.2109129886  
-0.3114866836  
-0.3763505079  
-0.4067798187  
-0.4052349819  
-0.3743557322  
-0.3162170993  
-0.2319608606  
-0.1218694  
0.01417320245  
0.1759443569  
0.362050792  
0.5691915801  
0.7917082322  
1.021529239  
1.248574952  
1.461582205  
1.649225866  
1.801358495  
1.910169044  
1.971060819  
1.983103163  
1.948990107  
1.874518847  
1.767689581  
1.637585648  
1.493225773  
1.342577852  
1.1918843  
1.045376118  
0.9053947222  
0.7728500796  
0.6478864005  
0.5306080073  
0.4216932397  
0.3227643567  
0.2364313865  
0.1659899224  
0.1148238875  
0.0856248248  
0.07957167588  
0.09563778827  
0.1301663608  
0.1768187885  
0.2269416718  
0.270326727  
0.2962820928  
0.2948700424  
0.2581567388  
0.181294416  
0.06329196662  
-0.09263636396  
-0.2791918667  
-0.4855844133  
-0.6985247532  
-0.9035149415  
-1.086289209  
-1.234253102  
-1.337763605  
-1.391114703  
-1.393127372  
-1.347268531  
-1.26129396  
-1.146437753  
-1.016225561  
-0.885043976  
-0.7666037638  
-0.6724728861  
-0.6108468139  
-0.5856950383  
-0.5963926608  
-0.6378893634  
-0.7013988698  
-0.775530989  
-0.8477408284  
-0.9059108693  
-0.9398797117  
-0.9427308825  
-0.9116803338  
-0.8484599736  
-0.7591494637  
-0.6534847661  
-0.5437206688  
-0.4431920978  
-0.3647388177  
-0.3191745495  
-0.3139679272  
-0.3522824704  
-0.432472212  
-0.5480829806  
-0.6883671628  
-0.8392480806  
-0.984655247  
-1.108088153  
-1.194262447  
-1.230671234  
-1.208894824  
-1.125520151  
-0.9825426979  
-0.7872048853  
-0.5512567207  
-0.2897089784  
-0.01921112718  
0.2437631254  
0.4847066549  
0.692612228  
0.8610503025  
0.9886412183  
1.078841135  
1.139064506  
1.179252358  
1.210084917  
1.241098508  
1.278987536  
1.326359894  
1.381156777  
1.436843513  
1.48337147  
1.508781038  
1.501215703  
1.451038533  
1.352720071  
1.206195145  
1.017460804  
0.798293545  
0.5651127126  
0.3371304128  
0.1340480849  
-0.02638291316  
-0.130582376  
-0.1708523267  
-0.146332602  
-0.0630822939  
0.06670120294  
0.2262139687  
0.3960949797  
0.5567185804  
0.6904102865  
0.7833234818  
0.8267312991  
0.817627494  
0.7585912208  
0.6569914827  
0.5236940285  
0.3714739299  
0.2133794692  
0.06126018879  
-0.07535323312  
-0.1899084296  
-0.278994973  
-0.3420447363  
-0.3806880913  
-0.3978994498  
-0.3971066749  
-0.3814211522  
-0.3531094103  
-0.3133859112  
-0.2625375326  
-0.200336236  
-0.1266525166  
-0.04213380273  
0.0511979582  
0.1495442356  
0.2472428155  
0.3370292089  
0.410652956  
0.459760545  
0.4769440128  
0.4567857971  
0.3967458115  
0.297736561  
0.1642921016  
0.004280402355  
-0.171813219  
-0.3519297053  
-0.5236743945  
-0.6755737835  
-0.7981761628  
-0.884863203  
-0.9322761164  
-0.9403312724  
-0.9118602177  
-0.8519612026  
-0.7671892731  
-0.6647179938  
-0.5515963082  
-0.4342024091  
-0.3179276262  
-0.207105693  
-0.1051294408  
-0.01467709526  
0.0620471722  
0.123153345  
0.1670453203  
0.1925701922  
0.1993114072  
0.1879491994  
0.1605970133  
0.1209869472  
0.07441773827  
0.02739088039  
-0.01305048942  
-0.04022773867  
-0.04883726507  
-0.03590601235  
-0.001495762592  
0.05100079538  
0.115080878  
0.1818968953  
0.2414915277  
0.28434769  
0.303013064  
0.2935392262  
0.2564745869  
0.1972015798  
0.1255124545  
0.05441942099  
-0.001670248631  
-0.02917858737  
-0.01765552838  
0.03819831335  
0.1371224119  
0.2707677772  
0.4241959907  
0.5774100399  
0.7077662797  
0.7929637147  
0.8142287654  
0.7592289135  
0.6242930018  
0.4155608075  
0.1488680697  
-0.1517170214  
-0.4565229462  
-0.7337825119  
-0.9535380867  
-1.091430475  
-1.131839763  
-1.069940036  
-0.9123801837  
-0.6764933107  
-0.3881495403  
-0.07855845962  
0.2195381353  
0.475753873  
0.6655207443  
0.7726844398  
0.7909396818  
0.7239762662  
0.5844053068  
0.3916772942  
0.1693368715  
-0.05798174236  
-0.267421455  
-0.4402740937  
-0.5636134178  
-0.6310573028  
-0.6426570274  
-0.6040304681  
-0.5249341183  
-0.4175290432  
-0.2946005896  
-0.1679694057  
-0.0472767399  
0.06073873996  
0.1524498828  
0.2270793277  
0.286070954  
0.3322554679  
0.3689584756  
0.3992160962  
0.4252110755  
0.4479908788  
0.467488766  
0.4827923379  
0.4925847526  
0.4956427049  
0.4912852552  
0.4796779378  
0.461933156  
0.4399933921  
0.4163178097  
0.3934352055  
0.3734476004  
0.3575762614  
0.3458326991  
0.3368791243  
0.3281133696  
0.3159750122  
0.2964445925  
0.2656663025  
0.2206159832  
0.1597217341  
0.08333434982  
-0.006024437452  
-0.1036978419  
-0.2032322978  
-0.2970121458  
-0.377116093  
-0.43631837  
-0.4690932442  
-0.4724995991  
-0.4468025449  
-0.3957274477  
-0.3262736105  
-0.2480723635  
-0.1723424841  
-0.1105361835  
-0.07284153347  
-0.06673037013  
-0.09573304193  
-0.1586427713  
-0.2492649417  
-0.3568012377  
-0.4668512037  
-0.5629578787  
-0.6285259594  
-0.6488981811  
-0.613333056  
-0.5166314679  
-0.3601898729  
-0.1523185741  
0.09224141377  
0.3535822727  
0.608535056  
0.8330188739  
1.00455068  
1.104638037  
1.120765749  
1.047768301  
0.8884330041  
0.6532945051  
0.3596699992  
0.03006071077  
-0.3098715123  
-0.6335394849  
-0.9156416061  
-1.134142322  
-1.271876538  
-1.317664301  
-1.266903563  
-1.121646145  
-0.8902060758  
-0.5863835103  
-0.228385593  
0.1624536796  
0.563070806  
0.9501031172  
1.301284291  
1.596735534  
1.820095391  
1.959441286  
2.00794977  
1.964258769  
1.832513465  
1.622082894  
1.346956312  
1.024859986  
0.6761286704  
0.3224180061  
-0.0146854089  
-0.3150553238  
-0.5613454756  
-0.7401487566  
-0.842920033  
-0.8666046391  
-0.8139085876  
-0.6931843186  
-0.5179095997  
-0.3057728825  
-0.07740291105  
0.1451947003  
0.3403867113  
0.4887263192  
0.5746828592  
0.5881316033  
0.5254486375  
0.3900875205  
0.1925387332  
-0.05035913014  
-0.3167380181  
-0.5815630929  
-0.8188792192  
-1.004257739  
-1.117198485  
-1.143254463  
-1.075653288  
-0.9162287425  
-0.6755432749  
-0.3721611936  
-0.03110390196  
0.3183615385  
0.6454069741  
0.9205272429  
1.118336384  
1.219964533  
1.214829467  
1.101568727  
0.8880545746  
0.590496998  
0.2317430549  
-0.1610214734  
-0.5589069676  
-0.9340003007  
-1.261801772  
-1.523179921  
-1.705659832  
-1.803959241  
-1.819772874  
-1.760891347  
-1.639804951  
-1.47200718  
-1.274212073  
-1.062709589  
-0.8520345235  
-0.6540779223  
-0.4776937526  
-0.3287698587  
-0.2106645912  
-0.124862021  
-0.07164838258  
-0.05064068223  
-0.06101888768  
-0.1013962878  
-0.1693514101  
-0.260725457  
-0.368882517  
-0.4841594327  
-0.5937311531  
-0.6820569043  
-0.7319758291  
-0.7263854339  
-0.6503123609  
-0.4930788012  
-0.2502137597  
0.07522753127  
0.4721961644  
0.9221659811  
1.40059331  
1.879142933  
2.328359291  
2.72041582  
3.031564858  
3.243987746  
3.346860325  
3.336591526  
3.216319575  
2.994868802  
2.685412637  
2.304093256  
1.868809338  
1.39829191  
0.9114934952  
0.4272402726  
-0.03598710906  
-0.4602844769  
-0.8287020393  
-1.125850968  
-1.338749409  
-1.457835969  
-1.478017026  
-1.399566262  
-1.228694852  
-0.9776339007  
-0.6641386854  
-0.310408206  
0.0585081773  
0.4166525549  
0.7392368603  
1.004619478  
1.195956918  
1.302351601  
1.31939227  
1.249067495  
1.099115143  
0.8819366431  
0.6132598556  
0.3107218758  
-0.007448410857  
-0.3235520648  
-0.6212673369  
-0.8862507341  
-1.106535712  
-1.272828404  
-1.378784537  
-1.421328814  
-1.401030056  
-1.322475991  
-1.194538769  
-1.030385005  
-0.8470714153  
-0.6646035428  
-0.5044106972  
-0.387284164  
-0.3309521133  
-0.3475614355  
-0.441430282  
-0.6074534141  
-0.8305106023  
-1.086131261  
-1.342507587  
-1.563755513  
-1.714111519  
-1.762582757  
-1.687437056  
-1.479879494  
-1.14632941  
-0.7088555687  
-0.2035624719  
0.3229845314  
0.8189455547  
1.233376403  
1.522600267  
1.655941215  
1.620009868  
1.420950955  
1.084274583  
0.6522615302  
0.1792234395  
-0.2747920692  
-0.651069309  
-0.8991806961  
-0.9829698643  
-0.884837442  
-0.607832722  
-0.1753426087  
0.3715418908  
0.9785970687  
1.584413612  
2.126985522  
2.550184907  
2.809426137  
2.875941829  
2.739285589  
2.407892247  
1.907740332  
1.279347012  
0.5734858273  
-0.1538905563  
-0.8469894178  
-1.455249078  
-1.937669766  
-2.266024282  
-2.426679689  
-2.420922068  
-2.263815034  
-1.981776123  
-1.609185349  
-1.184422526  
-0.7458040183  
-0.3278491854  
0.04170807329  
0.3438879189  
0.5692504948  
0.7175084185  
0.7961044614  
0.818040233  
0.7992948636  
0.7562347552  
0.7033492942  
0.6516169315  
0.607646393  
0.5736467251  
0.5481187956  
0.5270811229  
0.505551188  
0.4789984217  
0.4445110973  
0.4014841977  
0.3517367833  
0.299081407  
0.2484617845  
0.2048518877  
0.1721476227  
0.1522774387  
0.1446982487  
0.1463922833  
0.1523546561  
0.1564995656  
0.1528127192  
0.1365512084  
0.105269028  
0.05948402015  
0.002853637835  
-0.05818718194  
-0.1152898106  
-0.1594346164  
-0.1823737844  
-0.1780427742  
-0.1437308321  
-0.0808090852  
0.005112292614  
0.1046538322  
0.205711916  
0.2949690832  
0.3596552812  
0.3893299784  
0.3774232568  
0.3223192859  
0.2278106901  
0.1028452826  
-0.03941857899  
-0.1831314458  
-0.3116581953  
-0.4096162482  
-0.4647872744  
-0.4696508089  
-0.42235548  
-0.3270057255  
-0.1932532906  
-0.0352542519  
0.1298634676  
0.283814317  
0.40905183  
0.4905240504  
0.5171184097  
0.4826704252  
0.3864675606  
0.2332400466  
0.03265941473  
-0.2015747537  
-0.4529843265  
-0.7037965946  
-0.9365474696  
-1.135692932  
-1.289092807  
-1.389233378  
-1.434039646  
-1.427163072  
-1.377625852  
-1.298810192  
-1.206803267  
-1.118246845  
-1.047907408  
-1.006267246  
-0.9974827518  
-1.01805055  
-1.05646485  
-1.094040807  
-1.106923783  
-1.069120284  
-0.9562239762  
-0.7493548345  
-0.4387480566  
-0.02643655071  
0.4724631863  
1.030164177  
1.608407266  
2.162269874  
2.645149736  
3.014307383  
3.236230409  
3.291078712  
3.175581794  
2.903953001  
2.506661207  
2.027186249  
1.51715539  
1.030483013  
0.6172453929  
0.3180670025  
0.1596944782  
0.1522784751  
0.2886479197  
0.5455979172  
0.8869618616  
1.268022138  
1.64068114  
1.958739786  
2.182683458  
2.283453133  
2.244869071  
2.064543041  
1.753314043  
1.333411411  
0.8356548551  
0.2960767185  
-0.2476401983  
-0.7595506784  
-1.208374645  
-1.569758773  
-1.827764656  
-1.975547929  
-2.015272535  
-1.957342575  
-1.819068857  
-1.622911419  
-1.394426783  
-1.16008381  
-0.9450841573  
-0.7713373451  
-0.6557458469  
-0.6089236295  
-0.6344713406  
-0.7288766783  
-0.8820756005  
-1.078623832  
-1.299373514  
-1.523481954  
-1.730531811  
-1.902510434  
-2.025429917  
-2.090381912  
-2.093933719  
-2.037839524  
-1.928150895  
-1.773911335  
-1.585655201  
-1.373974588  
-1.148384444  
-0.9166527399  
-0.6846707201  
-0.4568269605  
-0.2367464134  
-0.02817960231  
0.1642012942  
0.3343463678  
0.4748819334  
0.577751944  
0.6354017043  
0.6423355943  
0.5967776701  
0.5021016952  
0.3677111894  
0.2090841536  
0.0468413678  
-0.09515918819  
-0.1925253244  
-0.2234881379  
-0.1720668747  
-0.03073921383  
0.1978383325  
0.5004057542  
0.8541245423  
1.228994074  
1.591363998  
1.908079277  
2.150656819  
2.298893623  
2.343351867  
2.286354225  
2.141333582  
1.930642703  
1.682158528  
1.425215883  
1.186488653  
0.9864581308  
0.8369857872  
0.7403462588  
0.6898238048  
0.6717299492  
0.6684703935  
0.6621312805  
0.6379644826  
0.5872070191  
0.5087451051  
0.4093723667  
0.3025982322  
0.2062111435  
0.1390056824  
0.1172127753  
0.1512261621  
0.2431519907  
0.3855954223  
0.5618869225  
0.747737429  
0.9140959846  
1.030797885  
1.070506721  
1.012395231  
0.8450806809  
0.5684309283  
0.1940239978  
-0.2557690989  
-0.7499560339  
-1.252047849  
-1.723766854  
-2.128885685  
-2.436780844  
-2.625313274  
-2.682757959  
-2.608603609  
-2.413197921  
-2.116318904  
-1.744874622  
-1.33002675  
-0.9040743125  
-0.4974473445  
-0.1361280823  
0.1602446215  
0.3794545942  
0.516928416  
0.5751723481  
0.5626012281  
0.4919829178  
0.378743693  
0.2393573366  
0.08998893356  
-0.05451159247  
-0.181257242  
-0.279656296  
-0.3415289728  
-0.3611233086  
-0.3351145235  
-0.2626656991  
-0.1455350552  
0.01178632103  
0.2019898763  
0.4150166215  
0.6383466673  
0.8575716419  
1.057263323  
1.222092103  
1.338104666  
1.394031206  
1.38246881  
1.30078633  
1.15162014  
0.9428677036  
0.6871504094  
0.4007656024  
0.1022422244  
-0.1893643306  
-0.4562327833  
-0.6833974547  
-0.8600355683  
-0.9802707885  
-1.043414025  
-1.053622121  
-1.019041891  
-0.9505661426  
-0.8603670245  
-0.7604025003  
-0.6610661322  
-0.5701452691  
-0.4921823112  
-0.428293217  
-0.3764483112  
-0.3321467892  
-0.2893911744  
-0.2418398825  
-0.1839720207  
-0.1121346522  
-0.02531153951  
0.07447725972  
0.1822341489  
0.2904941212  
0.3902617564  
0.4722467491  
0.5282554546  
0.5525243916  
0.5428046863  
0.5009958125  
0.4332044388  
0.3491552748  
0.2610004029  
0.1816527154  
0.1228715907  
0.09337763107  
0.09731478597  
0.1333177625  
0.1944150355  
0.2688326273  
0.3416593698  
0.3971730012  
0.4214984238  
0.4051890139  
0.3453025145  
0.2465764998  
0.1214376845  
-0.01125528703  
-0.1286420506  
-0.2071511437  
-0.2261932091  
-0.1716914707  
-0.03886702484  
0.1662037266  
0.4265761701  
0.7160514236  
1.002242383  
1.250673518  
1.429327051  
1.51296049  
1.486555714  
1.347383161  
1.10538743  
0.7818537677  
0.4065827231  
0.01400892554  
-0.3611422367  
-0.6880409026  
-0.9431948964  
-1.112717477  
-1.193173974  
-1.191003638  
-1.120697968  
-1.002098719  
-0.8572868235  
-0.7075175573  
-0.5706457919  
-0.4593390639  
-0.3802404793  
-0.334083303  
-0.3166106941  
-0.3200578229  
-0.3349006033  
-0.3515712347  
