27.95113726  
29.71274123  
31.71197885  
28.79530961  
113.7294941  
1919.073532  
10760.80819  
15408.70659  
28353.24072  
43436.90982  
4987.091909  
5921.264258  
26921.64994  
46805.02984  
7540.172391  
1451.459236  
22535.82083  
1518.807986  
5136.968993  
34896.4591  
6136.652209  
3190.208314  
6605.738755  
4475.680912  
10258.03773  
13675.73956  
4628.316524  
3709.541404  
583.4176217  
1957.821257  
22916.06742  
6867.660255  
2190.561905  
8074.742396  
26777.28818  
292.9666498  
7928.551936  
19736.30975  
8756.045297  
6501.928922  
3160.138794  
1297.650594  
4636.562007  
2140.054417  
9935.120589  
2904.403585  
3401.215114  
3991.216063  
6427.277968  
134.3745543  
939.7755854  
2659.136208  
2747.275881  
736.4969303  
6311.130337  
3016.85646  
1963.112386  
4462.726766  
795.0615063  
538.4756693  
185.7695419  
789.8240219  
235.9136401  
23.27161926  
4.324417356  
426.2376197  
233.7520433  
37.16830547  
5.609206627  
114.5496322  
25.05374956  
5.227462072  
15.88028193  
1.511745667  
6.511114205  
1.38331141  
6.747733014  
13.7014279  
3.800288445  
2.634093332  
4.985711748  
3.118923471  
3.218537552  
2.120837014  
1.789819555  
2.288477643  
2.365192214  
1.992222243  
2.085123855  
1.990703734  
2.114502177  
2.039834812  
2.008444511  
1.856186665  
1.741672812  
1.717596568  
1.718887739  
1.654446039  
1.598020159  
1.534448502  
1.488131054  
1.44000581  
1.406107073  
1.368959713  
1.329556605  
1.296415017  
1.264632738  
1.232305838  
1.201918151  
1.175339243  
1.143681438  
1.121166421  
1.094785633  
1.069016474  
1.042757978  
1.02174196  
0.9988720893  
0.9766831951  
0.9563378062  
0.9363505197  
0.9172003474  
0.8978585372  
0.8798981312  
0.8621704344  
0.8455405704  
0.8288044156  
0.8131280423  
0.797653552  
0.7825817204  
0.7683132513  
0.7543004883  
0.7407966812  
0.7276076803  
0.7147768196  
0.7023814267  
0.6903616072  
0.678657148  
0.6671754957  
0.6561154836  
0.6453611427  
0.6348654026  
0.6246804312  
0.6147639439  
0.6051019822  
0.5956898087  
0.5865141527  
0.5775758316  
0.5688575553  
0.5603747604  
0.5520795219  
0.5439996032  
0.5361361284  
0.5284450265  
0.5209415585  
0.513617042  
0.5064544661  
0.4994570896  
0.4926400968  
0.4859667001  
0.4794628353  
0.4730941227  
0.4668511964  
0.4607538628  
0.4548279963  
0.4489713991  
0.443290619  
0.4377038647  
0.4322514772  
0.4268970356  
0.4216618233  
0.416559874  
0.4115363972  
0.4066217925  
0.4018006682  
0.3970990082  
0.3924845104  
0.3879366674  
0.3835052314  
0.3791571055  
0.3748785615  
0.3706966404  
0.3666002427  
0.3625690279  
0.3586282822  
0.3547515971  
0.3509313699  
0.3472055253  
0.343546816  
0.3399473559  
0.3364257128  
0.3329588998  
0.3295594359  
0.3262233745  
0.3229382493  
0.3197096715  
0.316540026  
0.3134203389  
0.3103821597  
0.3073621364  
0.3044170363  
0.3015052797  
0.2986578309  
0.2958536587  
0.2931054312  
0.2903778948  
0.2877135606  
0.2850864868  
0.2825152664  
0.2799782678  
0.2774817581  
0.2750217702  
0.2726133819  
0.2702265963  
0.2678753438  
0.2655767474  
0.2633114077  
0.2610798288  
0.2588916329  
0.256718387  
0.2545889906  
0.2524998862  
0.2504225868  
0.2483949656  
0.2463890342  
0.2444113964  
0.2424790504  
0.240560181  
0.2386860368  
0.2368307405  
0.2349992538  
0.2331943675  
0.2314045443  
0.229657494  
0.2279293009  
0.2262202155  
0.2245442707  
0.2228974293  
0.2212620163  
0.2196642601  
0.2180789744  
0.2165102933  
0.2149765999  
0.2134559646  
0.2119492367  
0.2104805287  
0.2090310021  
0.2075840508  
0.2061653369  
0.2047634879  
0.2033891658  
0.2020336727  
0.2006893657  
0.1993617881  
0.1980500414  
0.1967628601  
0.1954996522  
0.1942440224  
0.1929985596  
0.1917750184  
0.1905685102  
0.1893805389  
0.188206651  
0.187042683  
0.1858935091  
0.184769946  
0.183658634  
0.182552389  
0.1814652759  
0.1803873423  
0.1793254247  
0.1782835362  
0.1772548608  
0.1762288383  
0.1752226454  
0.1742191044  
0.1732333997  
0.1722675548  
0.1712954649  
0.1703599104  
0.1694127228  
0.1685046902  
0.1675855111  
0.1666830188  
0.1657912352  
0.1649078273  
0.1640459023  
0.1631847152  
0.1623386603  
0.1614977372  
0.1606687123  
0.1598498549  
0.1590285488  
0.1582451874  
0.1574489802  
0.156679317  
0.1559033789  
0.155144253  
0.1543778433  
0.1536384081  
0.1529074096  
0.152175307  
0.1514586885  
0.1507513772  
0.1500434311  
0.149357916  
0.1486669447  
0.1479958259  
0.1473146641  
0.1466531954  
0.1460042969  
0.1453588656  
0.1447275522  
0.1440862832  
0.1434688596  
0.1428417675  
0.1422305071  
0.1416265253  
0.1410314305  
0.1404443886  
0.1398681868  
0.1392883468  
0.1387101768  
0.1381553487  
0.1375934758  
0.1370414559  
0.1365022165  
0.135960611  
0.135431529  
0.1349050597  
0.1343851218  
0.1338692253  
0.133363435  
0.1328600622  
0.1323620986  
0.1318673656  
0.1313948062  
0.1309044292  
0.1304259771  
0.1299621711  
0.1294958683  
0.1290401733  
0.1285792923  
0.1281399403  
0.1276972343  
0.1272566124  
0.1268231874  
0.1263881357  
0.1259668496  
0.1255523355  
0.1251361543  
0.1247235831  
0.124318107  
0.1239267708  
0.1235320308  
0.1231364414  
0.1227529154  
0.1223751218  
0.121990212  
0.1216224598  
0.121249049  
0.1208851821  
0.1205276138  
0.1201696633  
0.1198155114  
0.1194663323  
0.1191256991  
0.1187793541  
0.1184446928  
0.1181128034  
0.1177903049  
0.1174650853  
0.1171453449  
0.1168234746  
0.1165181971  
0.1162032942  
0.1158947585  
0.1155960372  
0.1153054876  
0.1150014347  
0.1147153384  
0.1144234235  
0.1141342543  
0.1138630061  
0.1135816132  
0.113307565  
0.11303744  
0.11276986  
0.1125112202  
0.1122393151  
0.1119867177  
0.1117372307  
0.1114920005  
0.1112401997  
0.1109926882  
0.1107615777  
0.1105160449  
0.1102844048  
0.1100487911  
0.1098259341  
0.109597455  
0.1093779474  
0.1091560054  
0.1089388425  
0.1087248138  
0.1085094031  
0.1083082388  
0.108100528  
0.1079000466  
0.1076991174  
0.1075019939  
0.1072995901  
0.1071203769  
0.1069358295  
0.1067449908  
0.1065577926  
0.1063767418  
0.1061976781  
0.1060270028  
0.1058553164  
0.105691279  
0.105521606  
0.1053521509  
0.10519898  
0.1050397191  
0.1048824948  
0.1047195991  
0.1045723459  
0.1044224412  
0.104280492  
0.1041329773  
0.1039973332  
0.1038627105  
0.1037258003  
0.1035916988  
0.1034540082  
0.1033330423  
0.1032052746  
0.1030839662  
0.1029590405  
0.1028388726  
0.1027218898  
0.1026077255  
0.1024905847  
0.1023826486  
0.1022783543  
0.1021722339  
0.1020689815  
0.1019675981  
0.1018698243  
0.1017722265  
0.1016809123  
0.101587755  
0.1014932632  
0.1014136776  
0.1013302562  
0.1012468292  
0.1011642056  
0.1010924303  
0.101011718  
0.1009403101  
0.1008662313  
0.1007977639  
0.1007316855  
0.1006650807  
0.1006054855  
0.1005374142  
0.1004850664  
0.1004302061  
0.1003717584  
0.1003218026  
0.1002707023  
0.1002190086  
0.1001794191  
0.1001367528  
0.1000871266  
0.1000551454  
0.1000211041  
0.09999168389  
0.09994989223  
0.09991818317  
0.09989137976  
0.09986601198  
0.09984281867  
0.09982116715  
0.09979914575  
0.09978686343  
0.0997677151  
0.09975718966  
0.09973888324  
0.09974189829  
0.09972063289  
0.09971893794  
0.09971385574  
0.09971552819  
