30.37559531  
40.41465354  
59.87229748  
91.13359523  
284.5898948  
9678.57092  
9860.541228  
6541.117763  
36621.02679  
90043.40881  
58366.68608  
28251.81743  
18520.01869  
19536.58863  
73.575911  
13501.01072  
58139.1933  
14293.00569  
5858.959548  
4246.882541  
414.2012221  
15169.16338  
9760.343707  
361.0989493  
2935.170891  
18001.52815  
397.6820562  
726.4781235  
7727.48284  
1228.311767  
1658.003823  
1076.776861  
1.633831861  
3226.140834  
3188.580824  
3069.790305  
4081.024156  
5244.725149  
4381.036076  
1099.375392  
773.3845542  
2202.487636  
3731.857117  
478.8803714  
109.1406601  
3084.67793  
1059.97473  
224.7792566  
4464.4087  
3867.547612  
633.8212263  
1456.785002  
922.9545748  
897.9125135  
426.4864743  
285.4210962  
569.60367  
1132.079389  
813.3985719  
501.7780363  
804.9622354  
211.3419473  
92.76444102  
389.184823  
438.5484462  
30.19867263  
31.54227999  
0.01909551817  
39.29286468  
11.03666463  
24.00115572  
9.072724353  
36.3798481  
5.321533649  
0.5892872953  
2.645262125  
0.1578867365  
2.446693529  
2.439075525  
0.1802427743  
1.491773058  
0.894747304  
1.064826017  
0.6682557694  
0.8617623535  
1.218341352  
0.7255732153  
0.8622402944  
0.5907546428  
0.6089337866  
0.5741187427  
0.4753412911  
0.5698096269  
0.4162414187  
0.4321006022  
0.3967358394  
0.3622459875  
0.3612494095  
0.3226792795  
0.318100091  
0.2944485911  
0.2765909101  
0.2662559122  
0.2500409092  
0.2436322095  
0.2286074308  
0.2190334863  
0.2084008241  
0.1993262237  
0.1915765955  
0.1801955834  
0.1744023957  
0.1658362687  
0.1586430861  
0.152320853  
0.1454680114  
0.1400418042  
0.1335379281  
0.1286581378  
0.1233043781  
0.1183876638  
0.1139277711  
0.1093792337  
0.1052761029  
0.1012943906  
0.09754831012  
0.09394162924  
0.09044621919  
0.08728943814  
0.08411483411  
0.08118913031  
0.07834489993  
0.07562084876  
0.0730508647  
0.07053383647  
0.06821266917  
0.06591798697  
0.06375365787  
0.06167654676  
0.0596586733  
0.05775714897  
0.05590908365  
0.05415031492  
0.05245554708  
0.05082459822  
0.04926817663  
0.04776005035  
0.04631535343  
0.04492400238  
0.04358578026  
0.04229798045  
0.04105577168  
0.03986252919  
0.03871034658  
0.03760256821  
0.03653197133  
0.03549923467  
0.03450995036  
0.03354564696  
0.03261891455  
0.03172370858  
0.03086025244  
0.03002972594  
0.02921985361  
0.0284390357  
0.02768441894  
0.02695981625  
0.02625479456  
0.02557119188  
0.02491070131  
0.02427336164  
0.02365469885  
0.0230541855  
0.02247535372  
0.0219141343  
0.02136910287  
0.02084190975  
0.02033055606  
0.01983356397  
0.01935425689  
0.0188876227  
0.01843338407  
0.01799567153  
0.0175693659  
0.01715618807  
0.01675423683  
0.01636514774  
0.01598505778  
0.01561867074  
0.01526086247  
0.01491327419  
0.01457571195  
0.01424656787  
0.01392756497  
0.013616609  
0.01331650702  
0.01302419538  
0.0127368844  
0.01246041053  
0.01218927247  
0.01192490401  
0.01166892476  
0.01142072934  
0.01117731429  
0.01094116017  
0.01071036144  
0.01048489922  
0.01026656856  
0.01005451669  
0.009846331892  
0.009643483143  
0.009445348221  
0.009252228822  
0.009065358203  
0.008883296523  
0.008705015112  
0.008531322757  
0.008360509918  
0.008195346485  
0.008033189302  
0.00787551598  
0.007721303447  
0.007571898882  
0.007424478922  
0.007282510694  
0.007141496184  
0.007004960928  
0.006871305442  
0.006740968037  
0.006614033434  
0.006489683124  
0.006367236132  
0.006250145239  
0.0061330272  
0.006018916827  
0.005908915821  
0.005799994996  
0.005693762094  
0.005589681307  
0.005489033552  
0.005389469453  
0.005291902464  
0.00519799151  
0.005105422429  
0.005013925386  
0.004926229728  
0.004838774613  
0.004753817825  
0.004670226648  
0.004589024335  
0.004509004719  
0.004430645321  
0.004353675127  
0.004278586806  
0.004205957214  
0.004133950982  
0.004063683302  
0.003995206186  
0.003927507177  
0.003861736221  
0.003796885884  
0.003732979618  
0.003670448405  
0.003610339663  
0.003549999669  
0.003491868988  
0.003434578932  
0.003378366693  
0.003321919357  
0.00326877109  
0.003216373607  
0.00316427439  
0.003113428765  
0.003063445808  
0.003013714465  
0.00296592461  
0.002919170205  
0.002872322244  
0.00282693094  
0.002783396868  
0.002739798315  
0.002696514154  
0.002655239323  
0.002612765418  
0.002573372265  
0.002533054335  
0.002493716382  
0.002455362603  
0.002418604785  
0.002381903167  
0.002345394852  
0.002309540906  
0.002275448596  
0.002240519943  
0.002206848664  
0.002174214115  
0.002141880587  
0.002109786115  
0.002078247276  
0.002048002414  
0.002018018921  
0.001988049761  
0.001958360462  
0.001930043112  
0.001902012616  
0.001874473462  
0.001847300601  
0.001821158882  
0.001794353026  
0.001768949991  
0.001743177487  
0.00171869158  
0.001694399385  
0.001669707913  
0.001646445336  
0.001623643196  
0.001600651153  
0.001578835759  
0.001556275735  
0.001535078108  
0.00151378209  
0.001492140677  
0.001471934111  
0.001451875006  
0.001431551539  
0.001411891578  
0.001392821181  
0.00137395804  
0.00135502561  
0.001336774758  
0.00131893449  
0.001301690637  
0.001283592138  
0.00126669594  
0.001250195968  
0.001233638504  
0.001217219797  
0.001201213071  
0.001184510853  
0.001169564377  
0.001154612138  
0.001139500705  
0.00112453866  
0.001110510787  
0.001095706267  
0.001081226111  
0.001068029367  
0.001054428787  
0.001040449434  
0.001027525232  
0.00101462313  
0.001001783928  
0.0009893851779  
0.0009767764756  
0.0009648916849  
0.0009527638431  
0.0009407117216  
0.0009298441928  
0.0009179677732  
0.0009070262255  
0.0008956892814  
0.0008845384801  
0.0008740508643  
0.0008637303782  
0.0008534468545  
0.0008427984647  
0.0008328758953  
0.0008231270074  
0.0008132749695  
0.0008038696656  
0.0007945701551  
0.0007852185168  
0.0007759338145  
0.0007672950502  
0.0007582611188  
0.000749414472  
0.0007411048414  
0.0007325673011  
0.0007240451004  
0.0007160911263  
0.0007080457125  
0.0006997515991  
0.0006923501588  
0.0006845696877  
0.0006767867931  
0.0006696679917  
0.000662441294  
0.0006552041814  
0.0006478050753  
0.0006411748411  
0.0006343605512  
0.0006274650501  
0.0006214709324  
0.0006144101078  
0.0006079730723  
0.0006017398059  
0.0005956883006  
0.0005892577913  
0.0005835473107  
0.000577437307  
0.0005717543087  
0.0005658001541  
0.0005604145933  
0.0005548525417  
0.000549277487  
0.0005440962965  
0.0005386548169  
0.0005336205766  
0.000528366694  
0.0005236312287  
0.0005187224031  
0.000513715611  
0.0005089476254  
0.0005043670293  
0.0005001024457  
0.0004955298445  
0.0004909272882  
0.0004866486244  
0.0004822372213  
0.0004778664326  
0.0004740314912  
0.0004700294055  
0.0004660376009  
0.000462155213  
0.0004584647526  
0.0004547679552  
0.0004508938699  
0.0004471884984  
0.0004438873566  
0.0004405641473  
0.0004367032141  
0.0004334246733  
0.0004303246225  
0.0004267316766  
0.0004242214448  
0.0004207801639  
0.0004176268715  
0.0004150647817  
0.0004121272811  
0.0004090032714  
0.0004063795136  
0.0004037307819  
0.0004011818127  
0.0003983803308  
0.0003958596424  
0.0003934621177  
0.0003910247322  
0.0003885649421  
0.0003864564312  
0.0003842099654  
0.0003821087468  
0.0003799291196  
0.0003778421115  
0.0003758968132  
0.0003740243857  
0.0003719264034  
0.0003701001315  
0.0003684330451  
0.0003666900866  
0.0003646897609  
0.0003632086509  
0.0003613453294  
0.0003600312717  
0.0003587967356  
0.0003572442346  
0.0003559332271  
0.0003544047964  
0.0003533841715  
0.0003519877981  
0.0003505181318  
0.0003498285375  
0.0003484454067  
0.0003474738365  
0.0003465474475  
0.0003457221359  
0.0003450085593  
0.0003440596091  
0.0003433591488  
0.0003424351566  
0.0003418739633  
0.0003410909871  
0.0003403228245  
0.000339860176  
0.0003395661988  
0.0003391499978  
0.0003386457541  
0.0003383349105  
0.0003380701868  
0.0003378105843  
0.0003375146061  
0.0003373059298  
0.0003371730446  
0.0003371372392  
0.00033720614  
