125.5080855  
129.1523671  
143.3760857  
186.8292286  
215.931293  
88.40152469  
17671.23104  
20236.11762  
86177.04449  
2963.278615  
105052.762  
3760.169354  
7444.29836  
8665.748668  
726.3145916  
950.6613284  
10679.64404  
8076.177065  
2409.933232  
33538.92969  
1810.318398  
3740.388106  
7873.860223  
357.3980248  
1460.193856  
1271.866864  
12015.46625  
5636.980063  
2154.770295  
2357.527225  
3460.527151  
722.4943609  
993.0310391  
2493.318634  
21260.86548  
5857.923605  
2009.073931  
4295.099759  
2556.376551  
1757.934495  
2593.079773  
2768.833096  
4032.158353  
1989.354794  
5001.798305  
6124.897538  
1504.951576  
9227.501367  
7204.568877  
17438.79317  
19.38037919  
4952.366279  
2106.60447  
40.79237337  
8368.693338  
3673.920842  
200.7293254  
1019.542535  
3227.24459  
6196.985923  
101.8294148  
1716.586958  
1080.063718  
881.5166009  
2148.941322  
122.0929314  
239.8116204  
98.29838142  
46.85718269  
14.71977098  
54.09938437  
8.756164912  
2.384162259  
10.62642931  
13.55937877  
1.461039289  
5.335962399  
3.290693656  
0.7887667039  
0.284430525  
0.1472802284  
0.1986556731  
0.6316593827  
0.1233924094  
0.15430851  
0.4811963388  
0.3426568156  
0.2230944832  
0.2245901674  
0.2346801783  
0.1578809977  
0.2668881359  
0.1740004262  
0.1328610404  
0.1616675235  
0.1368882318  
0.1305793165  
0.108184445  
0.1144887567  
0.1080344106  
0.09680035524  
0.09183597414  
0.08356368296  
0.07868135465  
0.07364501196  
0.06964754061  
0.06710030827  
0.06213582449  
0.0589378414  
0.05544898999  
0.05259459058  
0.05076207564  
0.04775011699  
0.04534827655  
0.04323631837  
0.04131138449  
0.03939363558  
0.03764084522  
0.03621090726  
0.03467540075  
0.03327131435  
0.03183514065  
0.03069778953  
0.02954928609  
0.02835710396  
0.02736969617  
0.02639079377  
0.02545903756  
0.02459396617  
0.02380147066  
0.02303933965  
0.02230297982  
0.02162737752  
0.0209744272  
0.02034213598  
0.01977439462  
0.01921838944  
0.0186935213  
0.01818912396  
0.01771339543  
0.01726442815  
0.01682762575  
0.01641479807  
0.01602626591  
0.015652663  
0.01529086686  
0.01494810398  
0.01462116775  
0.01430564572  
0.01400772122  
0.01371933874  
0.01343970869  
0.01317643308  
0.01292054056  
0.01267395399  
0.01243780888  
0.01221276582  
0.0119910388  
0.01178167279  
0.01157911401  
0.01138341334  
0.01119250077  
0.01100961714  
0.01083402894  
0.0106633402  
0.01049827032  
0.01033853987  
0.01018249488  
0.01003510158  
0.009887507888  
0.009749029111  
0.009610696412  
0.009479694628  
0.009350048311  
0.009224667953  
0.009104301362  
0.008986484968  
0.00887181579  
0.008760373872  
0.008650123981  
0.008544821654  
0.008442039773  
0.00834232663  
0.008243224178  
0.008148620955  
0.008055086964  
0.007964443051  
0.007876215141  
0.007790065363  
0.007705526667  
0.007624006412  
0.007542165209  
0.007463249413  
0.007385833997  
0.007310843154  
0.00723629005  
0.007164518739  
0.007093423644  
0.007026254432  
0.006958329997  
0.006891178266  
0.006825924152  
0.006762467394  
0.006700430379  
0.006639320285  
0.006579706459  
0.006521543019  
0.006462837702  
0.006407178858  
0.006350823577  
0.006296886165  
0.00624257306  
0.00618981565  
0.006138833781  
0.006088618947  
0.006039023812  
0.005988963814  
0.005941800871  
0.005893759062  
0.005848994603  
0.005802468841  
0.005757570822  
0.005713092065  
0.005670344814  
0.005626403801  
0.005586168057  
0.005544173866  
0.005503399871  
0.005462870187  
0.005423895148  
0.00538433628  
0.005346817046  
0.005308656151  
0.005271501115  
0.005235271816  
0.005199772719  
0.00516284061  
0.00512906871  
0.005094828883  
0.005060182297  
0.005027338262  
0.004994549905  
0.004962290862  
0.004930935659  
0.004898812284  
0.00486669646  
0.00483624187  
0.004805811795  
0.004776643281  
0.004748484361  
0.004717813213  
0.004689781859  
0.004660981139  
0.004633811733  
0.004605711905  
0.004577966755  
0.004551371195  
0.004526014196  
0.004499683204  
0.004473691352  
0.00444806542  
0.004423852975  
0.004398376578  
0.004373048361  
0.004349121477  
0.004325129062  
0.004301723864  
0.004278481978  
0.004255508204  
0.004233824724  
0.004210829044  
0.004188692953  
0.004166661767  
0.004145547751  
0.004123408483  
0.004102428812  
0.004081299932  
0.004061763311  
0.004040701695  
0.00402120985  
0.00400163805  
0.003981694982  
0.003962122986  
0.003942877721  
0.003924228137  
0.003905182728  
0.003887190295  
0.00386847464  
0.003851110172  
0.003833067423  
0.003815684094  
0.003797520467  
0.003781269587  
0.003763901169  
0.003747417689  
0.003729618466  
0.003713791358  
0.003697261084  
0.003681197246  
0.003664735973  
0.003649110919  
0.003634041262  
0.003618770077  
0.003602367786  
0.003588547466  
0.003573499089  
0.003558817169  
0.003543616884  
0.003530163425  
0.003515893304  
0.003501240306  
0.003488462615  
0.003473535156  
0.003459848492  
0.003446801398  
0.003433349464  
0.003419420904  
0.003407415543  
0.003394698164  
0.003381390741  
0.003368760415  
0.00335632202  
0.003343862486  
0.003333208252  
0.003319847541  
0.003308309025  
0.003296290199  
0.003284740769  
0.003273704824  
0.0032613528  
0.003250620294  
0.003239263475  
0.00322863134  
0.003216881861  
0.003206579165  
0.003196072157  
0.003184840743  
0.003174675306  
0.003164681723  
0.003154510002  
0.003144179433  
0.003133845769  
0.003124744586  
0.003114817449  
0.003104706816  
0.003095148388  
0.003086108733  
0.003076298242  
0.003067383993  
0.003057848001  
0.003049301101  
0.003039647586  
0.003031514501  
0.003022119676  
0.003012770279  
0.003005244122  
0.002995680684  
0.002987939553  
0.002979684616  
0.002972156653  
0.002963366937  
0.002955506449  
0.002947773202  
0.002939960453  
0.002931957081  
0.002924690054  
0.002916854073  
0.002910257789  
0.002901503251  
0.002894777012  
0.002886484694  
0.002879505357  
0.002873420017  
0.002866232481  
0.002859617373  
0.002851853402  
0.00284574271  
0.002838658984  
0.002832545851  
0.002825990545  
0.002819154843  
0.00281278494  
0.002806605676  
0.002801034309  
0.002793802896  
0.002788888975  
0.002782163852  
0.002776384497  
0.002770297037  
0.002764753712  
0.002759285491  
0.002754224484  
0.002747221517  
0.002743251097  
0.002737338884  
0.002732098919  
0.002726138768  
0.002720961461  
0.002716075465  
0.002710947986  
0.0027060565  
0.002701493989  
0.002696570611  
0.002690569541  
0.002686704874  
0.002681812706  
0.002677157368  
0.00267273946  
0.002667783885  
0.002663560676  
0.002659978608  
0.002655283997  
0.002651569184  
0.00264713336  
0.002642655758  
0.002638375615  
0.00263504764  
0.002631104958  
0.002626679021  
0.00262303824  
0.002619461647  
0.002614854474  
0.002611439693  
0.002608054267  
0.002604150085  
0.00260109297  
0.002597253164  
0.002594274618  
0.002591163635  
0.002587545886  
0.002584660786  
0.002581636256  
0.002578699218  
0.002574981415  
0.002571728254  
0.00256886414  
0.002566326092  
0.00256344091  
0.002560759514  
0.002558809173  
0.002555289281  
0.002553467903  
0.002550322098  
0.002547956722  
0.002545418828  
0.002543607968  
0.002540743175  
0.002538135437  
0.002535988267  
0.002533559124  
0.002532143644  
0.002530549451  
0.002527513716  
0.002525580771  
0.002523857868  
0.002521307121  
0.002520242743  
0.002518251562  
0.002517221497  
0.002514922177  
0.002513795632  
0.002511739892  
0.002510541852  
0.002509044889  
0.00250689621  
0.002507142949  
0.00250489987  
0.002503579711  
0.002502541769  
0.00250085446  
0.002499999399  
0.002499026463  
0.002497179935  
0.002497018909  
0.0024963136  
0.002494962253  
0.002493667907  
0.002493729734  
0.002492561349  
0.002491998855  
0.002491490611  
0.002490734099  
0.002489505719  
0.00248968566  
0.002488433472  
0.002488169375  
0.002488208378  
0.002488033535  
0.002487800038  
0.002488368194  
0.002487761976  
0.002486886289  
0.002486283498  
0.002486150021  
