0.3948270834  
1.133658187  
1.810415137  
2.374382302  
2.786294157  
3.02173113  
3.072752029  
2.947634843  
2.668888868  
2.26988809  
1.790672952  
1.273479041  
0.7585910963  
0.2809492834  
-0.1321660682  
-0.4622841073  
-0.6998004963  
-0.8431504348  
-0.8974155588  
-0.8726825875  
-0.7824283831  
-0.6421573581  
-0.4683414036  
-0.2776882492  
-0.08661984692  
0.08914794667  
0.2350678359  
0.338328157  
0.3885482593  
0.3785609079  
0.305121162  
0.1694535158  
-0.02254585356  
-0.260546478  
-0.530474276  
-0.8156525398  
-1.098252123  
-1.360884449  
-1.588160228  
-1.767993507  
-1.89251033  
-1.958457357  
-1.967076366  
-1.923496331  
-1.835742551  
-1.713515899  
-1.566917301  
-1.405288028  
-1.236312017  
-1.065489745  
-0.8960284681  
-0.7291395262  
-0.5646688423  
-0.4019536672  
-0.2407369968  
-0.08198804612  
0.07153483948  
0.2150885071  
0.3421938019  
0.445323713  
0.5169588428  
0.550881437  
0.5435082603  
0.4950560443  
0.4103256712  
0.2989194823  
0.1747908642  
0.0550877202  
-0.04160155121  
-0.09745198653  
-0.09775743962  
-0.03312883942  
0.09878442658  
0.2923451764  
0.5339391026  
0.8030285612  
1.074171772  
1.319806037  
1.513453807  
1.632969357  
1.663378577  
1.598943106  
1.444125992  
1.213329262  
0.9293735742  
0.6209023536  
0.3190185379  
0.05356476108  
-0.1504517802  
-0.2758619669  
-0.3153400047  
-0.2721635768  
-0.1596200662  
0.000856025159  
0.1825768819  
0.3571395339  
0.4981441759  
0.5846078954  
0.6036331956  
0.5520011126  
0.4364892511  
0.272892541  
0.08389825539  
-0.103898732  
-0.263468505  
-0.3708217175  
-0.4080849624  
-0.3657827422  
-0.244053458  
-0.05267602472  
0.1900706941  
0.4595508186  
0.7276312412  
0.9658904127  
1.148783771  
1.256395586  
1.276480969  
1.205571487  
1.049083269  
0.8204603989  
0.5394731975  
0.2299284275  
-0.08294478341  
-0.3751343698  
-0.6262159965  
-0.8212189226  
-0.9518021074  
-1.016635709  
-1.020988104  
-0.9755831431  
-0.8949045109  
-0.7951674204  
-0.6922189811  
-0.5996613896  
-0.5274090668  
-0.4808930694  
-0.4609649826  
-0.4645001967  
-0.4855436102  
-0.5167959804  
-0.5511637856  
-0.5830865278  
-0.6094385948  
-0.6298338386  
-0.6463293146  
-0.6626158573  
-0.6828652665  
-0.7104936793  
-0.7470944565  
-0.7917426018  
-0.8408135494  
-0.8883478952  
-0.9268829703  
-0.9486152304  
-0.9466543791  
-0.9161827648  
-0.8552949409  
-0.7653832287  
-0.6510331772  
-0.5194090737  
-0.3792713305  
-0.2397511614  
-0.1090958394  
0.006467193689  
0.1035364774  
0.1819509479  
0.2447197611  
0.2975160076  
0.347775202  
0.4035492319  
0.4722532941  
0.5594710265  
0.6679877081  
0.7971472533  
0.9426399274  
1.096737825  
1.248933233  
1.386937473  
1.49788943  
1.569645681  
1.592012026  
1.557777132  
1.463438275  
1.309577068  
1.100834929  
0.8455367402  
0.5550088455  
0.2426883606  
-0.07689108064  
-0.3891162379  
-0.6802455825  
-0.9382080562  
-1.153199491  
-1.318056163  
-1.42839583  
-1.482567275  
-1.481407301  
-1.427892556  
-1.326700085  
-1.183753276  
-1.005773205  
-0.7998883177  
-0.5733144392  
-0.333127405  
-0.08614358036  
0.161118845  
0.4023723025  
0.6314383447  
0.8420928096  
1.027925438  
1.182272517  
1.298282586  
1.369157479  
1.388599206  
1.351455704  
1.254505058  
1.097304445  
0.8829458515  
0.6186036569  
0.3157089013  
-0.01033892786  
-0.3409639278  
-0.6557120544  
-0.9339017655  
-1.156494574  
-1.30794172  
-1.377775972  
-1.361745167  
-1.262325347  
-1.088521696  
-0.8549975866  
-0.5806003461  
-0.286467443  
0.006062022196  
0.2775113271  
0.5120504395  
0.6988328035  
0.8327194946  
0.9143561366  
0.9495788409  
0.948246867  
0.9226625796  
0.885737403  
0.8491821487  
0.8219030989  
0.808855717  
0.8104783055  
0.8228186227  
0.838326243  
0.8472344737  
0.8393280633  
0.805852731  
0.7412881815  
0.6446940853  
0.5204077303  
0.3779297446  
0.2309621108  
0.09568584963  
-0.01155440948  
-0.07681222107  
-0.09103403062  
-0.05207625678  
0.03409281664  
0.1532687496  
0.2840856085  
0.4002565466  
0.4737653285  
0.4786444057  
0.3948308632  
0.2115718586  
-0.0701832754  
-0.4367917618  
-0.8626193188  
-1.312413895  
-1.745152534  
-2.118859404  
-2.395783922  
-2.547193683  
-2.557117117  
-2.424457069  
-2.16319299  
-1.800623652  
-1.373911812  
-0.925475999  
-0.4978668404  
-0.1288856677  
0.1524239117  
0.3284015908  
0.3937883591  
0.3551149598  
0.2287397305  
0.03790945472  
-0.1906063176  
-0.4298349292  
-0.6554231536  
-0.8476870021  
-0.9927459923  
-1.082771078  
-1.115492565  
-1.093202359  
-1.02148353  
-0.9079381672  
-0.7610606513  
-0.5894115633  
-0.4011130718  
-0.2036685107  
-0.004036560569  
0.1911216197  
0.3751361222  
0.54105841  
0.68152591  
0.7888373866  
0.8552824924  
0.8737492264  
0.8385631512  
0.7465127146  
0.5979096685  
0.3975551847  
0.1554189381  
-0.11314304  
-0.3877712981  
-0.6441905511  
-0.8559735462  
-0.9968950412  
-1.043664124  
-0.9787263951  
-0.7927906931  
-0.4867118564  
-0.07241636278  
0.4273509042  
0.9805485105  
1.548521528  
2.089629146  
2.563398211  
2.934737161  
3.177680504  
3.278174994  
3.235544508  
3.062400759  
2.782971888  
2.430057061  
2.040952091  
1.652885291  
1.298535628  
1.002246906  
0.7774177022  
0.6254232349  
0.536208101  
0.4904497911  
0.4629731959  
0.4269186262  
0.3580654421  
0.2386811998  
0.06034315635  
-0.1746760574  
-0.4536323231  
-0.7551199293  
-1.052161725  
-1.316140106  
-1.520961499  
-1.646853415  
-1.683246253  
-1.630322106  
-1.499010848  
-1.309470642  
-1.088264629  
-0.8646761285  
-0.6666712123  
-0.5171204567  
-0.4307761519  
-0.4124531154  
-0.456620996  
-0.5484561983  
-0.6661827349  
-0.7843169156  
-0.8773847436  
-0.9235489376  
-0.9076528979  
-0.8232788804  
-0.6735480593  
-0.4706006414  
-0.2338657744  
0.01260331015  
0.2433238964  
0.4346530668  
0.5676803798  
0.6303883416  
0.618796965  
0.5370241721  
0.3963255676  
0.2132876042  
0.007507515103  
-0.2008875486  
-0.3935386306  
-0.5556557657  
-0.6771397478  
-0.7529119576  
-0.7825300577  
-0.7692160809  
-0.7185329947  
-0.6369771909  
-0.5307398299  
-0.4048450976  
-0.2627734824  
-0.106616969  
0.0623345529  
0.2427151381  
0.4321362378  
0.6263647077  
0.8188591849  
1.000754167  
1.161365758  
1.289160038  
1.373054289  
1.403846035  
1.375547661  
1.286397702  
1.139360994  
0.942023989  
0.7058562721  
0.444930534  
0.1742802506  
-0.09188260466  
-0.3418016578  
-0.5674225717  
-0.7650417184  
-0.9352490239  
-1.08215969  
-1.212055305  
-1.331666709  
-1.446383439  
-1.558715762  
-1.66731126  
-1.766713208  
-1.847957198  
-1.899940087  
-1.911321513  
-1.872661737  
-1.778398883  
-1.628296132  
-1.428085694  
-1.189144532  
-0.9272345337  
-0.6604871261  
-0.4069381651  
-0.1820355319  
0.003484296232  
0.1449909744  
0.2443723085  
0.3094119056  
0.3521843705  
0.3867465652  
0.4264850781  
0.481542264  
0.5567785241  
0.6505955212  
0.7548601134  
0.8559892065  
0.9370360249  
0.9805135656  
0.9715061936  
0.9005816505  
0.7660372241  
0.5750778933  
0.3436845761  
0.09513658339  
-0.1426657458  
-0.3407200332  
-0.4727807887  
-0.5190288806  
-0.4689668002  
-0.3231443482  
-0.09339541314  
0.1984364836  
0.5231355864  
0.847755405  
1.139753262  
1.371038528  
1.521397729  
1.580817208  
1.550443291  
1.442053689  
1.27619297  
1.079249542  
0.8799143071  
0.7055216964  
0.5787407593  
0.5150393253  
0.5211698774  
0.5948171574  
0.7253418708  
0.8954533114  
1.083502348  
1.266101282  
1.420685194  
1.527764787  
1.572625871  
1.546377971  
1.446307779  
1.275619316  
1.042664873  
0.7598494339  
0.442365554  
0.1069081647  
-0.2295080776  
-0.5505492687  
-0.841363487  
-1.089154262  
-1.283574906  
-1.416973541  
-1.484515177  
-1.4842282  
-1.416985293  
-1.286455169  
-1.098989002  
-0.8634747592  
-0.591114012  
-0.2951186752  
0.00968724054  
0.3074024057  
0.5816951456  
0.8165818134  
0.9973131222  
1.111317015  
1.149145071  
1.105352033  
0.9792060321  
0.7751535586  
0.502961325  
0.1774544881  
-0.1821527511  
-0.5533562398  
-0.9118396156  
-1.233236394  
-1.49506355  
-1.678665506  
-1.770975715  
-1.765922063  
-1.665293809  
-1.478930387  
-1.224165842  
-0.9244938109  
-0.6075729212  
-0.3026975752  
-0.03800889003  
0.1622842009  
0.2803424219  
0.3065165076  
0.2402855511  
0.09021767223  
-0.1271072083  
-0.3890630338  
-0.6696059343  
-0.9422415059  
-1.182945873  
-1.372661604  
-1.499081879  
-1.557483065  
-1.550565237  
-1.4873579  
-1.381392091  
-1.248451589  
-1.104228144  
-0.9622440756  
-0.8322946751  
-0.7196215947  
-0.6248515554  
-0.5446703413  
-0.4730326458  
-0.4027049296  
-0.3268471785  
-0.2403900128  
-0.1410265104  
-0.02966126359  
0.08968641389  
0.2104818062  
0.3246573819  
0.4237940221  
0.5003452722  
0.5486902684  
0.5659031935  
0.5521334981  
0.510569053  
0.4470124627  
0.3691446941  
0.2855859575  
0.2049083006  
0.1346996717  
0.08082176282  
0.0469120197  
0.03418131713  
0.04148131141  
0.06560529935  
0.1017434592  
0.144034783  
0.1861199849  
0.2216770635  
0.2449031775  
0.2509479671  
0.2363131742  
0.1992274014  
0.139991467  
0.06127453643  
-0.03170523581  
-0.1311853543  
-0.2271159045  
-0.3077429873  
-0.3605126567  
-0.3732744329  
-0.3356681926  
-0.2405355824  
-0.08517187773  
0.1277974992  
0.3900847686  
0.6880649682  
1.003777304  
1.316551362  
1.605056642  
1.849555113  
2.034055163  
2.148083078  
2.18783226  
2.156519736  
2.063913034  
1.925075312  
1.758492278  
1.583831756  
1.419626508  
1.281161104  
1.178826714  
1.11712952  
1.094460526  
1.103611395  
1.132959763  
1.168143334  
1.19400621  
1.196558467  
1.164714234  
1.091620059  
0.9754064624  
0.8193162519  
0.6312293671  
0.4226466328  
0.2073113574  
-0.0003718135546  
-0.1869191112  
-0.3411690605  
-0.4553548872  
-0.5257615542  
-0.5529171221  
-0.5413386374  
-0.4989035165  
-0.4359189114  
-0.3640540883  
-0.2952124156  
-0.2404908972  
-0.2093039955  
-0.2087420045  
-0.2431802293  
-0.3141488965  
-0.4204098939  
-0.5582212324  
-0.7217079615  
-0.9033093329  
-1.094264509  
-1.285122291  
-1.46627011  
-1.628491533  
-1.763543308  
-1.864748869  
-1.927559564  
-1.950030405  
-1.933147405  
-1.88091135  
-1.800135783  
-1.69991201  
-1.590759855  
-1.483529505  
-1.388163062  
-1.312470309  
-1.261091458  
-1.234805234  
-1.230315625  
-1.240580899  
-1.255688662  
-1.264182201  
-1.254684154  
-1.217605037  
-1.146682645  
-1.040154855  
-0.9013387967  
-0.7385344518  
-0.5642141082  
-0.3935862512  
-0.2426998402  
-0.1263199667  
-0.05588141039  
-0.03777642514  
-0.07224143158  
-0.1529910088  
-0.2677162466  
-0.3993512333  
-0.5280059637  
-0.6333017416  
-0.6968110058  
-0.7042949731  
-0.6474244481  
-0.5247746078  
-0.3419566612  
-0.1108830057  
0.1517301197  
0.4264068354  
0.6932276504  
0.9340960682  
1.134668186  
1.285713284  
1.383741344  
1.430876334  
1.434037788  
1.403587334  
1.351677142  
1.290553696  
1.231045311  
1.181444321  
1.146887054  
1.129280446  
1.127706818  
1.139190679  
1.15965829  
1.18490113  
1.211369201  
1.23668689  
1.259797908  
1.280772595  
1.300337714  
1.319252154  
1.33767382  
1.354668697  
1.367966166  
1.374036828  
1.368487097  
1.346707072  
1.304671323  
1.239750267  
1.151359456  
1.041363873  
0.9141129878  
0.7760949353  
0.6352451248  
0.499984132  
0.3781238657  
0.275789815  
0.1965289179  
0.1407050749  
0.1053104611  
0.08420542618  
0.06878444383  
0.04899424465  
0.01457824773  
-0.04360388885  
-0.1323270767  
-0.255008553  
-0.4110731095  
-0.5957765208  
-0.8005141452  
-1.013585882  
-1.221340398  
-1.409555678  
-1.564922163  
-1.676429413  
-1.736521651  
-1.741877361  
-1.693730723  
-1.597703763  
-1.463167838  
-1.30222453  
-1.128419514  
-0.9553496497  
-0.7953201198  
-0.6582181068  
-0.5506981228  
-0.4757792462  
-0.4328510814  
-0.4180640625  
-0.4250276279  
-0.4456972213  
-0.4713342198  
-0.4934293616  
-0.5044913676  
-0.4986568209  
-0.472093963  
-0.4232150496  
-0.3527286985  
-0.2635710338  
-0.160751426  
-0.05111438744  
0.05697414965  
0.1540504268  
0.2301220262  
0.2753965534  
0.2811870709  
0.2409432549  
0.1513298633  
0.01323551421  
-0.1674579334  
-0.3795096171  
-0.6064914519  
-0.8276190188  
-1.019244892  
-1.156934626  
-1.217979134  
-1.184043259  
-1.043652326  
-0.7941650174  
-0.442912187  
-0.0072928392  
0.4862924633  
1.004616725  
1.510687135  
1.967375676  
2.341141795  
2.605421214  
2.743204654  
2.748506314  
2.626536113  
2.392584336  
2.069816432  
1.686310062  
1.271785417  
0.8544769007  
0.4585768975  
0.1025272702  
-0.2016629538  
-0.4481546398  
-0.6362056893  
-0.7686476151  
-0.8502343008  
-0.8862290412  
-0.8814883557  
-0.8401907968  
-0.7661750727  
-0.6637487172  
-0.5386885807  
-0.3991057478  
-0.2558807566  
-0.1224256549  
-0.01371566375  
0.05538824683  
0.07223100114  
0.02857408971  
-0.07752358647  
-0.240531058  
-0.447299289  
-0.678054255  
-0.9084989317  
-1.112753181  
-1.266708591  
-1.351288911  
-1.355097716  
-1.276007179  
-1.121444314  
-0.9073101772  
-0.6557134877  
-0.3918923439  
-0.1408012094  
0.07608700809  
0.2433160087  
0.3529547538  
0.404923063  
0.4061848492  
0.3689984238  
0.3085847232  
0.2406020979  
0.1788315196  
0.1334043479  
0.1097688759  
0.1084781621  
0.1257451408  
0.154593152  
0.1863583362  
0.2123066302  
0.2250847126  
0.219857159  
0.1949723009  
0.1521435339  
0.09616107804  
0.03423489199  
-0.02492472347  
-0.07214257406  
-0.09880828544  
-0.09779062995  
-0.06415184455  
0.004386752062  
0.1072496701  
0.241084673  
0.4000772042  
0.5764474313  
0.7610768239  
0.9441935626  
1.116037963  
1.267446413  
1.390315697  
1.477920699  
1.525069473  
1.528151222  
1.485103322  
1.395346885  
1.259748186  
1.080639009  
0.8618810571  
0.6089805177  
0.3291747248  
0.03142962695  
-0.2737012906  
-0.5744565832  
-0.8584615502  
-1.113567943  
-1.328828627  
-1.495537396  
-1.608169244  
-1.665073779  
-1.668798863  
-1.625944793  
-1.546518476  
-1.442833847  
-1.328078125  
-1.214719716  
-1.11296339  
-1.029493713  
-0.9666656477  
-0.9222892831  
-0.8900561389  
-0.8605498486  
-0.8227178818  
-0.7655927993  
-0.6800307332  
-0.5602089763  
-0.4046803052  
-0.2168185996  
-0.004608983594  
0.2201976881  
0.4434424657  
0.6502379658  
0.8267310124  
0.9617268955  
1.047942648  
1.082754745  
1.068340529  
1.011244711  
0.9214306183  
0.8109833427  
0.692643814  
0.5783767295  
0.4781544179  
0.3991024294  
0.3450783173  
0.3167111853  
0.3118376823  
0.3262341003  
0.3545021017  
0.3909395666  
0.4302660497  
0.4680867657  
0.5010484285  
0.5266748503  
0.5429941201  
0.5480348905  
0.5393719749  
0.5138538412  
0.467629006  
0.3965247772  
0.2967726671  
0.1659574379  
0.004057490734  
-0.1856591546  
-0.3960736409  
-0.6161695272  
-0.8316073017  
-1.025915281  
-1.182192769  
-1.285113531  
-1.322965377  
-1.289375599  
-1.184473701  
-1.01525017  
-0.795002209  
-0.5419371617  
-0.277079151  
