1203.650074  
1325.915322  
1581.296827  
2140.785723  
3470.954351  
7431.749705  
60509.64504  
25801.35344  
19499.68709  
12616.35106  
8411.009314  
13343.07744  
45445.1854  
25712.98108  
16453.58787  
15278.12132  
23145.5355  
12102.14988  
11562.09554  
26456.52114  
2413.600658  
942.7405976  
346.7822735  
4073.754812  
1174.168105  
2897.009917  
17090.74321  
2341.356984  
1435.354879  
3247.995347  
5326.742908  
217.3131131  
4520.504829  
12630.46371  
1415.322241  
3588.884974  
8072.040045  
4496.394452  
175.92123  
13193.83337  
5464.9391  
11258.44375  
1968.466189  
669.2437885  
171.1369523  
2756.950618  
3430.074915  
11200.88291  
1477.882186  
4080.475283  
2965.487662  
1492.090056  
2213.900243  
580.0532642  
1888.871248  
2035.616246  
241.7281221  
671.8221676  
2525.918825  
428.6835523  
1254.88427  
1770.952081  
1700.158919  
864.4244349  
88.95654552  
722.8275628  
258.0573765  
39.19911148  
51.6952625  
12.67864591  
26.66595884  
24.11070433  
14.91360507  
13.203593  
43.9412185  
21.6146106  
1.236292222  
2.969804585  
4.291327824  
4.192312729  
2.588376214  
1.851549033  
2.569937509  
3.207248265  
1.859779605  
2.72532455  
1.738051297  
1.527994432  
1.268880934  
0.9493698503  
0.9848953072  
0.9200361686  
0.8590658944  
0.8188483841  
0.727044  
0.6323962006  
0.6500453918  
0.5998462078  
0.5428931545  
0.5150756781  
0.4667352813  
0.4424007596  
0.4221627327  
0.3852661315  
0.3680993627  
0.3461284395  
0.3264602794  
0.3084851185  
0.2896350491  
0.2756738104  
0.2610012527  
0.2465646826  
0.2347243919  
0.2231792059  
0.212242224  
0.2018709622  
0.1934888438  
0.1850251529  
0.1775201338  
0.169372404  
0.1627259304  
0.156012622  
0.1496126961  
0.1436489025  
0.1383190782  
0.1332391284  
0.1284607515  
0.1239202649  
0.1194423189  
0.1152488356  
0.1113767086  
0.1076348309  
0.1041183059  
0.1008398055  
0.09770528728  
0.09469291048  
0.09183938313  
0.08913335645  
0.08653620045  
0.08404862885  
0.08169661314  
0.07944717797  
0.07728876631  
0.07522747892  
0.07326342136  
0.07137678367  
0.06957634531  
0.06783661746  
0.06617105554  
0.06457271315  
0.06304444147  
0.06157480706  
0.06015186251  
0.05879606991  
0.05748297216  
0.05622516709  
0.05500341873  
0.05383217174  
0.05270110948  
0.05161705957  
0.05056058004  
0.04954529625  
0.04856232607  
0.04761856077  
0.04670059838  
0.04581496473  
0.04495251562  
0.04412410736  
0.04332329169  
0.04254302707  
0.04178625741  
0.04105524025  
0.0403422361  
0.03965383003  
0.03898803031  
0.03833390954  
0.03770910364  
0.03709641091  
0.03650325967  
0.03592224133  
0.03536163535  
0.0348199712  
0.03428796723  
0.03377128322  
0.03325956176  
0.03278042482  
0.0322928155  
0.03183621076  
0.03137691143  
0.03093855026  
0.03050831055  
0.0300875906  
0.02967907101  
0.02927980087  
0.0288914198  
0.02851076868  
0.02813693463  
0.02777305311  
0.02742020159  
0.0270767813  
0.02673484513  
0.02640361013  
0.02608344261  
0.02576647513  
0.02545672599  
0.02515879328  
0.02486408877  
0.0245679545  
0.02428824983  
0.02401155092  
0.02374332608  
0.02347708553  
0.02321095938  
0.02295817595  
0.02271260935  
0.02247013339  
0.02222510119  
0.02199327835  
0.02176718697  
0.02153789777  
0.02131773024  
0.02110037018  
0.02088433227  
0.02067779446  
0.02047399184  
0.02027414232  
0.02007550108  
0.0198834377  
0.01969425849  
0.01950646034  
0.01932348451  
0.01914443672  
0.01896791516  
0.01879387532  
0.0186229952  
0.01845753943  
0.0182909657  
0.01813024699  
0.01797240812  
0.01781650328  
0.01766396859  
0.01751372454  
0.01736365964  
0.01721732899  
0.01707338225  
0.01693417347  
0.01679377721  
0.01666079194  
0.01652694957  
0.01639478819  
0.01626382735  
0.01613552551  
0.01600959105  
0.01588569621  
0.01576535966  
0.01564299064  
0.01552603628  
0.01541121993  
0.01529568798  
0.01518729918  
0.01507409291  
0.01496807336  
0.01485759686  
0.01475174547  
0.01464600338  
0.01454547154  
0.01444251386  
0.01434266072  
0.01424441451  
0.01414701654  
0.0140508324  
0.01395888426  
0.01386517934  
0.01377397164  
0.01368213757  
0.01359348263  
0.01350721577  
0.01341957388  
0.01333322145  
0.01325232184  
0.01316981339  
0.01309028862  
0.01300652737  
0.01292478167  
0.0128477706  
0.01277301677  
0.01269668154  
0.01262153325  
0.01254603232  
0.01247419798  
0.01240063793  
0.0123303432  
0.01226057789  
0.01219413549  
0.01212232118  
0.0120552565  
0.01199047348  
0.01192474169  
0.01185788811  
0.01179367888  
0.01173322836  
0.01167150436  
0.01160750323  
0.01154641815  
0.01148715223  
0.01142650894  
0.01136873134  
0.01130884156  
0.0112559415  
0.01119917524  
0.01114505036  
0.01108734243  
0.0110344809  
0.01097976856  
0.0109271249  
0.01087481297  
0.01082534776  
0.01077281258  
0.01072341078  
0.01067635544  
0.0106244231  
0.0105761739  
0.01052856109  
0.01048265719  
0.01043641143  
0.01038900245  
0.01034406621  
0.01030004252  
0.01025509351  
0.01021227185  
0.01016827578  
0.01012589733  
0.01008329733  
0.01004282002  
0.009999160455  
0.009959499812  
0.009918495564  
0.009879730048  
0.009841384583  
0.009803560019  
0.009760660636  
0.009726835699  
0.009687776286  
0.009653371612  
0.009617211317  
0.009578293476  
0.009542394878  
0.009505879631  
0.009474279163  
0.009439585028  
0.009405353753  
0.009372170989  
0.009337853453  
0.009306315877  
0.009274876547  
0.009239990301  
0.009210546505  
0.00917725505  
0.009149094703  
0.009119056552  
0.009088284754  
0.009060442763  
0.009030894048  
0.009000806307  
0.008971804764  
0.008944398821  
0.008916262764  
0.008890203728  
0.008860877807  
0.008835513918  
0.008811403933  
0.008783606428  
0.008757422485  
0.008730123884  
0.008705595021  
0.008679667444  
0.008657296024  
0.008632810072  
0.008606738061  
0.008582974358  
0.00856075184  
0.008536622065  
0.008514426179  
0.008491248859  
0.008470041581  
0.008449829379  
0.008427633355  
0.008404877279  
0.008383382819  
0.008362145207  
0.008342085443  
0.008323561197  
0.008302974742  
0.008284756639  
0.008262056211  
0.00824400368  
0.008226421024  
0.008207160916  
0.008188892205  
0.008170974928  
0.008150945641  
0.008133797829  
0.008116589551  
0.008096535115  
0.008083412951  
0.008064493235  
0.008050658846  
0.008031285062  
0.008016268366  
0.008002930744  
0.00798608788  
0.00796980352  
0.007954689218  
0.007939143213  
0.007926339122  
0.007911927945  
0.007898009877  
0.007879141038  
0.007868573307  
0.007855192247  
0.007842299739  
0.007828493241  
0.007815118433  
0.007804087884  
0.007792184185  
0.007779950316  
0.007767283111  
0.007755676546  
0.007742171648  
0.007729270865  
0.007720828851  
0.007710532183  
0.00769991588  
0.007686921507  
0.007676998635  
0.007667789107  
0.007655196013  
0.007646123296  
0.007636433864  
0.007627071393  
0.007618771347  
0.007607594554  
0.007599928852  
0.007590733919  
0.007583238591  
0.007573327975  
0.007567195232  
0.007558116352  
0.007549233658  
0.007544508038  
0.007535778179  
0.00752792236  
0.007520551644  
0.007514509338  
0.007508009579  
0.007499887227  
0.007495126604  
0.00748972683  
0.007483876868  
0.007475121577  
0.007470355084  
0.007465910626  
0.007459147918  
0.007452914776  
0.007449042659  
0.007444991759  
0.007437735393  
0.007434188243  
0.007431586358  
0.007428150721  
0.007424155145  
0.007419748831  
0.007416344858  
0.007412492794  
0.007409292508  
0.007407025762  
0.007403057213  
0.007399782271  
0.007397389803  
0.007395462326  
0.00739358455  
0.007392714229  
0.007390109149  
0.00738653113  
0.007388480131  
0.007385654149  
0.007383319521  
0.007382904597  
0.007380717497  
0.007381938897  
0.007379042008  
0.007380462203  
0.007379035555  
0.00737800644  
