-0.2440179764  
-1.127727571  
-1.956535682  
-2.678750911  
-3.253048189  
-3.65253424  
-3.867183975  
-3.904379252  
-3.787509621  
-3.552849283  
-3.245104889  
-2.912199128  
-2.599914594  
-2.347026466  
-2.181462972  
-2.117905191  
-2.157017538  
-2.28633867  
-2.482616324  
-2.715246239  
-2.950328706  
-3.154812797  
-3.300227635  
-3.365560473  
-3.338983213  
-3.218308361  
-3.010209767  
-2.728430014  
-2.391310025  
-2.019055033  
-1.631156919  
-1.244335785  
-0.8712607141  
-0.5201489827  
-0.1952176625  
0.1022172263  
0.3722511674  
0.6148575032  
0.8286125546  
1.009930452  
1.152957284  
1.250130989  
1.293310679  
1.275273784  
1.19131261  
1.040658585  
0.8274923846  
0.5613564132  
0.25689608  
-0.06705393489  
-0.3889362636  
-0.6863006656  
-0.9377816105  
-1.125000858  
-1.234176239  
-1.257286705  
-1.192681258  
-1.045111182  
-0.8252007262  
-0.5484467132  
-0.2338654113  
0.09757688654  
0.4246058186  
0.727216562  
0.9880876705  
1.193736257  
1.335366149  
1.409370224  
1.41747585  
1.366528446  
1.267934246  
1.136782329  
0.9906801577  
0.8483747567  
0.7282271293  
0.6466557174  
0.6166674373  
0.6466179515  
0.7393295672  
0.8916804637  
1.094739567  
1.334462381  
1.592894766  
1.849785068  
2.084425558  
2.277533054  
2.412964422  
2.479081675  
2.469632553  
2.384078564  
2.227369168  
2.009212321  
1.742972222  
1.444316292  
1.129783487  
0.8154096639  
0.5155337693  
0.241881088  
0.002975213188  
-0.1961052778  
-0.3536400676  
-0.4708973575  
-0.551543858  
-0.6009207607  
-0.6252620162  
-0.6309486536  
-0.6238623437  
-0.6088896884  
-0.5896178986  
-0.5682212764  
-0.5455241501  
-0.521219713  
-0.4941902275  
-0.4628883118  
-0.4257285606  
-0.381447619  
-0.3294005765  
-0.2697641933  
-0.2036413619  
-0.133049722  
-0.06080322665  
0.009703035122  
0.07479392515  
0.1308678808  
0.1747848856  
0.2042400859  
0.2180869427  
0.2165667846  
0.2014092374  
0.1757752902  
0.144029748  
0.1113586801  
0.08325727338  
0.06493386015  
0.06069705411  
0.07338964472  
0.1039323207  
0.151034212  
0.2110977518  
0.2783538637  
0.345207108  
0.4027970586  
0.4417335788  
0.4529705089  
0.4287586588  
0.3636127198  
0.2552002123  
0.1050622675  
-0.08094988602  
-0.2926149326  
-0.5157362173  
-0.7330333672  
-0.9255075436  
-1.074189945  
-1.162117711  
-1.176311244  
-1.109510404  
-0.9614035594  
-0.7391438077  
-0.4570193126  
-0.135246799  
0.2020080813  
0.5291618086  
0.8219726688  
1.060167573  
1.22955616  
1.323347976  
1.342470659  
1.294870626  
1.193920882  
1.056201413  
0.8990062985  
0.737977672  
0.5851943771  
0.4479862976  
0.3285752263  
0.2245257019  
0.1298388892  
0.03645431245  
-0.06413641481  
-0.1794198338  
-0.3147384634  
-0.4726353007  
-0.6526613914  
-0.8515846226  
-1.06385099  
-1.282161659  
-1.498010194  
-1.702112765  
-1.884699496  
-2.035717803  
-2.145038488  
-2.202777773  
-2.199839197  
-2.128696682  
-1.984418224  
-1.765802074  
-1.47644271  
-1.125518185  
-0.7280568215  
-0.3045362461  
0.1202852963  
0.5192615261  
0.8653106346  
1.134152923  
1.306995122  
1.372786516  
1.329728375  
1.185785409  
0.9581066813  
0.6713837603  
0.3553431622  
0.04167174301  
-0.2392436307  
-0.4613721251  
-0.6055217826  
-0.6609894266  
-0.6262129651  
-0.5084141572  
-0.3223277392  
-0.08823722229  
0.1704178383  
0.4295514833  
0.6667810841  
0.8633607775  
1.005555791  
1.085362015  
1.100571814  
1.054281525  
0.953949549  
0.8101895778  
0.6354583652  
0.4428053987  
0.2448189482  
0.05284171626  
-0.1234831133  
-0.27636798  
-0.3997751504  
-0.4891501543  
-0.5410859441  
-0.553030059  
-0.5231339193  
-0.4502718916  
-0.334280756  
-0.1763579009  
0.02044889603  
0.2507696729  
0.506589554  
0.7771858957  
1.04942089  
1.308411203  
1.538561433  
1.724865095  
1.854331311  
1.917358251  
1.908874887  
1.829084555  
1.68369021  
1.483551339  
1.243794345  
0.9824511963  
0.7187883897  
0.4714983815  
0.2569544103  
0.08771885751  
-0.02854117752  
-0.08961654792  
-0.09876041853  
-0.06412608984  
0.002260468821  
0.0859007379  
0.1714050448  
0.2441096483  
0.2915316948  
0.3045327007  
0.2780639762  
0.2114422051  
0.108139071  
-0.02485844611  
-0.1780338937  
-0.3405281223  
-0.5013950662  
-0.6507548962  
-0.7807240269  
-0.8860087551  
-0.9641064438  
-1.015114268  
-1.041188241  
-1.045751353  
-1.032580353  
-1.004921963  
-0.9647697799  
-0.9124364784  
-0.8464824515  
-0.7640292714  
-0.6614150213  
-0.5351135136  
-0.3827507365  
-0.2040828463  
-0.001748591861  
0.2183422856  
0.4470920545  
0.6728059435  
0.8822606778  
1.062134665  
1.200632819  
1.289075825  
1.323221402  
1.304103109  
1.238204531  
1.136908063  
1.015209262  
0.8898530198  
0.7770940074  
0.6904006463  
0.6384152179  
0.6235062164  
0.6411487527  
0.6802812173  
0.7246488865  
0.7549840806  
0.7517549052  
0.6980993299  
0.5825321869  
0.4010152395  
0.1580590994  
-0.1333243097  
-0.4528512031  
-0.7752375639  
-1.073198344  
-1.320775953  
-1.49654428  
-1.586249365  
-1.584543867  
-1.49560001  
-1.332553252  
-1.115867719  
-0.8708814686  
-0.6248552396  
-0.403911583  
-0.2302390972  
-0.1198735857  
-0.08127166047  
-0.1148021442  
-0.2131244568  
-0.3623605612  
-0.5438484526  
-0.7362558989  
-0.9177877752  
-1.068262764  
-1.170869367  
-1.213472368  
-1.189402536  
-1.097731697  
-0.9430562066  
-0.7348742744  
-0.4866353453  
-0.2145558103  
0.06370740924  
0.3304443331  
0.5692495245  
0.7662723169  
0.9112750497  
0.9984155312  
1.026684978  
0.9999400219  
0.9264994989  
0.8183268197  
0.6898402536  
0.5564657387  
0.4330678532  
0.332429997  
0.2639580014  
0.2327627033  
0.2392303192  
0.2791369048  
0.3442861738  
0.4235755602  
0.5043557348  
0.573897844  
0.6207883075  
0.636092916  
0.6141719238  
0.5530915887  
0.4546358113  
0.3239628215  
0.1689908244  
-0.0003850019513  
-0.173176099  
-0.3381862572  
-0.484876152  
-0.6041548582  
-0.6890866076  
-0.7354813575  
-0.7423431379  
-0.7121167234  
-0.6506796356  
-0.5670263169  
-0.472589738  
-0.3802099767  
-0.3027917643  
-0.2517566469  
-0.2354668565  
-0.2578198085  
-0.317246099  
-0.4063032131  
-0.5120142259  
-0.6169818927  
-0.7012288886  
-0.7445569434  
-0.729160529  
-0.6421297277  
-0.4775022845  
-0.2375343175  
0.06701885173  
0.4177014376  
0.7901614524  
1.15675992  
1.489626977  
1.763788909  
1.959927345  
2.06643053  
2.0804698  
2.007987794  
1.862647795  
1.66392029  
1.43461451  
1.198189812  
0.9762316947  
0.7863765406  
0.6409278584  
0.5462515017  
0.5029389246  
0.5066133648  
0.5491787524  
0.6202691313  
0.7086720752  
0.8035304654  
0.8952015388  
0.9757249034  
1.038936784  
1.080315922  
1.096680275  
1.085864222  
1.046482197  
0.9778385931  
0.8800073832  
0.7540442758  
0.6022763156  
0.4285685487  
0.2384925355  
0.03931224262  
-0.1602556576  
-0.3505135069  
-0.5214723021  
-0.663690569  
-0.7691901314  
-0.8323439253  
-0.8506443005  
-0.8252404104  
-0.761173221  
-0.6672376284  
-0.5554461722  
-0.4400958566  
-0.3364957375  
-0.2594415481  
-0.2215881414  
-0.2318790039  
-0.2942352372  
-0.4066838933  
-0.5610809631  
-0.743534381  
-0.9355384988  
-1.115765099  
-1.262328469  
-1.355306095  
-1.379200791  
-1.325037172  
-1.191801627  
-0.9869974669  
-0.7262015967  
-0.4316226492  
-0.1298045412  
0.1512531171  
0.3852185143  
0.5503844764  
0.6320911932  
0.6243015574  
0.5301355391  
0.3613215128  
0.1366452851  
-0.1203651709  
-0.3842079747  
-0.6302668951  
-0.8374083291  
-0.990017238  
-1.079257631  
-1.103459923  
-1.067655973  
-0.982386309  
-0.8619810941  
-0.7225753021  
-0.5801271921  
-0.4486714979  
-0.3389987894  
-0.2578725665  
-0.2078074179  
-0.1873635364  
-0.191854164  
-0.2143138883  
-0.2465866384  
-0.2803756726  
-0.3081539426  
-0.3238639996  
-0.3233759936  
-0.30471511  
-0.2680956256  
-0.2157958159  
-0.1519177064  
-0.0820481246  
-0.0128358186  
0.0485280981  
0.09493050009  
0.1200449578  
0.1191165609  
0.08974620642  
0.03260509125  
-0.04804668737  
-0.1441458706  
-0.2440167696  
-0.3330296738  
-0.394730974  
-0.4123703315  
-0.3706961253  
-0.2578125712  
-0.06688318063  
0.2025586111  
0.5438722805  
0.9432817427  
1.380577494  
1.830506426  
2.264682759  
2.653834925  
2.970133891  
3.189383625  
3.292878639  
3.268802251  
3.113096677  
2.829804696  
2.430920179  
1.935801602  
1.370203784  
0.7649704843  
0.1544078562  
-0.4256352174  
-0.939948078  
-1.356324685  
-1.647984706  
-1.795873252  
-1.790596295  
-1.633738107  
-1.338328564  
-0.9282832613  
-0.4367516883  
0.09655453299  
0.6288313482  
1.118099647  
1.527132623  
1.826918948  
1.999231683  
2.037980044  
1.949183566  
1.749588257  
1.464143114  
1.122702436  
0.7564043946  
0.3942369818  
0.06020016915  
-0.2285805981  
-0.4626374546  
-0.6398341535  
-0.7640989687  
-0.8435084078  
-0.8880931522  
-0.9077328857  
-0.910468469  
-0.9014585094  
-0.8826640771  
-0.8532406723  
-0.8104673062  
-0.7509921319  
-0.6721333133  
-0.5729752412  
-0.4550875056  
-0.3227372534  
-0.1826127414  
-0.0431056426  
0.08667796056  
0.198014183  
0.2835736973  
0.3382017907  
0.3593670385  
0.3472380267  
0.3044328114  
0.2354971484  
0.1462466405  
0.04306939347  
-0.06768667102  
-0.1801872511  
-0.2893905578  
-0.3911531802  
-0.4821985885  
-0.5600068714  
-0.6226999506  
-0.6689711272  
-0.6980918125  
-0.7099990249  
-0.7054366489  
-0.6860866748  
-0.6546469969  
-0.6147825089  
-0.5709248478  
-0.5279064759  
-0.4904616134  
-0.4626538896  
-0.4473127627  
-0.4455652724  
-0.4565590405  
-0.4774223992  
-0.5035008614  
-0.5288500748  
-0.546940134  
-0.5514900917  
-0.5373193293  
-0.5011123025  
-0.4419854168  
-0.3617562133  
-0.2648681738  
-0.1579524818  
-0.049056066  
0.05336592326  
0.1415800254  
0.2096495041  
0.2543052953  
0.2754544233  
0.2762310765  
0.2625572411  
0.2422546216  
0.2238405536  
0.2151757688  
0.222186942  
0.247860462  
0.2916739481  
0.3495618115  
0.4144170294  
0.477056352  
0.5274991799  
0.556370381  
0.5562156787  
0.5225498531  
0.4544995809  
0.3549701486  
0.2303426503  
0.08977028232  
-0.05579568016  
-0.1947189438  
-0.3157601919  
-0.4090204095  
-0.4666496803  
-0.483286963  
-0.4562421  
-0.3854495048  
-0.2732699037  
-0.1241964375  
0.05549068826  
0.2580702727  
0.474750487  
0.6960390121  
0.9121595396  
1.11351555  
1.291192625  
1.437498093  
1.546474623  
1.614334328  
1.639751038  
1.623952254  
1.570568301  
1.48525305  
1.375087266  
1.247859869  
1.111297241  
0.9723528646  
0.8366458084  
0.70811725  
0.5889281213  
0.4796043397  
0.3793725084  
0.2866325385  
0.1994735332  
0.1161657439  
0.03554833068  
-0.04272365263  
-0.1180996156  
-0.1892251107  
-0.2541714287  
-0.3107716474  
-0.3570087164  
-0.3914124356  
-0.4134050075  
-0.423551321  
-0.4236846568  
-0.4168635448  
-0.4071609193  
-0.3992674224  
-0.3979424401  
-0.4073444837  
-0.4303028306  
-0.4676273087  
-0.5175488471  
-0.5754058585  
-0.6336798251  
-0.6824433539  
-0.7102472207  
-0.7054044007  
-0.6575572127  
-0.559346421  
-0.4079652751  
-0.2063386549  
0.03628596334  
0.3045039244  
0.577750147  
0.8320649092  
1.042475783  
1.185708425  
1.242898367  
1.201939121  
1.059156057  
0.8200590251  
0.4990733531  
0.1182624419  
-0.2948060468  
-0.7097674117  
-1.096428185  
-1.427617981  
-1.68160128  
-1.843794548  
-1.907624057  
-1.874488374  
-1.752902859  
-1.556998387  
-1.304609117  
-1.015217244  
-0.7080064736  
-0.4002383497  
-0.1060927095  
0.1639551868  
0.4032307371  
0.6084973686  
0.7792635941  
0.9168875169  
1.023648131  
1.101902324  
1.153445611  
1.179148689  
1.178894497  
1.151818609  
1.096791307  
1.013063677  
0.9009761644  
0.7625988709  
0.6021908404  
0.4263799344  
0.243992804  
0.06552093587  
-0.09774662499  
-0.2348316467  
-0.3362801211  
-0.3953200291  
-0.4087926589  
-0.3777093704  
-0.3073293504  
-0.2067237976  
-0.0878659121  
0.03564652461  
0.1500654528  
0.2429616123  
0.3044996462  
0.3283329124  
0.3120306599  
0.2569954713  
0.1679289341  
0.05197226807  
-0.08232180777  
-0.2259843733  
-0.3704501266  
-0.5080843082  
-0.6323764259  
-0.7378512341  
-0.8197862858  
-0.87389586  
-0.8961133113  
-0.882609951  
-0.8300958857  
-0.7363877579  
-0.6011502571  
-0.4266528484  
-0.218349247  
0.01488088486  
0.2609653526  
0.5053830997  
0.732376595  
0.9264857673  
1.074202371  
1.165504965  
1.195040014  
1.162773194  
1.07400997  
0.9387750254  
0.7706590304  
0.5852923992  
0.3986684965  
0.2255553474  
0.07818171916  
-0.03463934294  
-0.1079019197  
-0.1403152408  
-0.1338207878  
-0.09284757493  
-0.02346355232  
0.06743888128  
0.1728143159  
0.2859279695  
0.4006167987  
0.5113834903  
0.6133902899  
0.7024415672  
0.775004605  
0.8283108364  
0.8605381363  
0.8710217568  
0.8604336999  
0.8308626508  
0.7857141453  
0.7294193731  
0.6669455545  
0.6031541724  
0.5421016361  
0.4863658096  
0.4365339914  
0.3909098016  
0.3455349773  
0.2945394947  
0.2308057898  
0.1468975989  
0.03615226513  
-0.1061861424  
-0.2819273167  
-0.4891369375  
-0.7217029284  
-0.9693645146  
-1.218244053  
-1.451880959  
-1.652683485  
-1.803673809  
-1.890329165  
-1.902303804  
-1.834817386  
-1.689492464  
-1.474508036  
-1.203993496  
-0.8966918662  
-0.5740170938  
-0.2577260336  
0.03251658337  
0.2813524589  
0.4794168733  
0.624246963  
0.7202450556  
0.7776706192  
0.8107668221  
0.8352623453  
0.8656090845  
0.9123562064  
0.9800864571  
1.066256893  
1.161188162  
1.249252543  
1.311145009  
1.326939137  
1.279480511  
1.157596371  
0.9586102611  
0.6897222683  
0.3679740179  
0.01873330248  
-0.32714606  
-0.6371299949  
-0.8812313052  
-1.036063435  
-1.088104853  
-1.035681267  
-0.8893532614  
-0.6706151779  
-0.4090895786  
-0.1386044113  
0.1072753742  
0.2996064941  
0.4177010906  
0.4514980367  
0.4023791841  
0.2823318663  
0.1116530004  
-0.08441889217  
-0.2795926255  
-0.4503213167  
-0.5789353756  
-0.6556630749  
-0.6792800282  
-0.656362688  
-0.599329278  
-0.523658587  
-0.4447674272  
-0.3750842579  
-0.321795858  
-0.2856187588  
-0.2607845812  
-0.236212  
-0.1976649473  
-0.1305277738  
-0.02274733997  
0.132550839  
0.3351810523  
0.5770807888  
0.8426986885  
1.110543207  
1.355693693  
1.552916918  
1.679949551  
1.720486294  
1.666466479  
1.519334951  
1.290123385  
0.9983361408  
0.6697962825  
0.3337414018  
0.01954813752  
-0.2465127094  
-0.4440748493  
-0.560720991  
-0.5930356316  
-0.5465827303  
-0.4348459084  
-0.2773044754  
-0.0969038012  
0.0827450955  
0.2400883791  
0.3579566338  
0.4252278342  
0.437658504  
0.3978343001  
0.3142785419  
0.199887069  
0.06992417719  
-0.06014436655  
-0.1766930485  
-0.2695820317  
-0.3332292025  
-0.3669822002  
-0.3747902837  
-0.3642518423  
-0.3451978377  
-0.3280237702  
-0.322009179  
-0.3338517418  
-0.3666041429  
-0.4191532209  
-0.4862929261  
-0.5593782598  
-0.6274619916  
-0.6787568414  
-0.7022253056  
-0.6890825074  
-0.634008946  
-0.5359065177  
-0.398099615  
-0.2279571552  
-0.03599465078  
0.1654149809  
