-0.5592601263  
-1.843614853  
-3.046208929  
-4.096728165  
-4.940139429  
-5.541754412  
-5.889762351  
-5.995011012  
-5.88818638  
-5.614912932  
-5.229529231  
-4.788425323  
-4.343815996  
-3.938687748  
-3.603404901  
-3.35422334  
-3.193643915  
-3.112328707  
-3.092114731  
-3.109610772  
-3.1398337  
-3.159434776  
-3.149197448  
-3.095619202  
-2.99155286  
-2.836001676  
-2.633260328  
-2.391632138  
-2.121969609  
-1.836248189  
-1.546340568  
-1.26308222  
-0.9956674888  
-0.7513418363  
-0.5353322803  
-0.3509289842  
-0.1996417063  
-0.08135131655  
0.005567714952  
0.0641669838  
0.09887372038  
0.1154086317  
0.1206316214  
0.1222653119  
0.1284630717  
0.147223811  
0.1856835678  
0.2493572253  
0.3414293104  
0.4621937975  
0.6087734745  
0.7751849064  
0.9528059411  
1.131222415  
1.29939018  
1.446961435  
1.565608318  
1.650135923  
1.699206954  
1.715528517  
1.705437152  
1.677913839  
1.643144014  
1.610837243  
1.588563457  
1.580389422  
1.586051176  
1.600833991  
1.616217569  
1.62121654  
1.604226481  
1.555078144  
1.466995716  
1.338099586  
1.172203211  
0.9787533075  
0.771889258  
0.5687529041  
0.3873057957  
0.2439808844  
0.1515321656  
0.1173949874  
0.1427952244  
0.2227050352  
0.3466224614  
0.5000107375  
0.6661716744  
0.8282397362  
0.9710440647  
1.08257879  
1.154948106  
1.184719865  
1.172726808  
1.123416651  
1.043921813  
0.9429914318  
0.8299809324  
0.7139681207  
0.6031119124  
0.5042295428  
0.4225941493  
0.3618757225  
0.3241772324  
0.3100957009  
0.3187824624  
0.3479870998  
0.3941112991  
0.4523173923  
0.5167218817  
0.5807399728  
0.6375762401  
0.680854498  
0.7053378376  
0.7076407477  
0.6868337048  
0.6448095256  
0.5863303914  
0.518670587  
0.4508513797  
0.3925275915  
0.3526264584  
0.3379306461  
0.3517920305  
0.3932018957  
0.456381856  
0.5310368125  
0.60326953  
0.657114002  
0.6765011417  
0.6474033658  
0.5598675739  
0.4096150569  
0.198963178  
-0.06309899264  
-0.3617420191  
-0.6779289958  
-0.9906285338  
-1.27931355  
-1.526367715  
-1.719061571  
-1.850821857  
-1.92162884  
-1.937508099  
-1.909247142  
-1.850545884  
-1.775912969  
-1.698634001  
-1.629100108  
-1.573714466  
-1.534490096  
-1.509346766  
-1.492976136  
-1.478109815  
-1.456952287  
-1.422534101  
-1.3698064  
-1.296321192  
-1.202444396  
-1.091138623  
-0.9673779609  
-0.8373529799  
-0.7076073209  
-0.5842570163  
-0.4723838287  
-0.3756808094  
-0.2963364148  
-0.2351275662  
-0.1916288088  
-0.1644635497  
-0.1515029582  
-0.1499666945  
-0.1564173743  
-0.1666650933  
-0.175661028  
-0.1774594456  
-0.1653447991  
-0.132182683  
-0.07102237058  
0.02406810368  
0.1570314152  
0.3288338725  
0.5366352372  
0.7732727766  
1.027207774  
1.283016516  
1.522449697  
1.725987532  
1.87474087  
1.952501059  
1.94766521  
1.854807227  
1.67565233  
1.419314916  
1.101725319  
0.7442808557  
0.3718790043  
0.01052831146  
-0.3151453134  
-0.5842179997  
-0.7813240075  
-0.8978349338  
-0.932237787  
-0.8897045388  
-0.780940651  
-0.6205187772  
-0.4249407105  
-0.2106961469  
0.007421865993  
0.2175535741  
0.411447274  
0.5845510359  
0.7355854256  
0.8657277785  
0.9775976593  
1.074203927  
1.158056532  
1.230535668  
1.291614615  
1.339935764  
1.373184399  
1.388690501  
1.38412086  
1.358157431  
1.311038134  
1.244872267  
1.163693239  
1.073210167  
0.9803030673  
0.892305786  
0.8161638509  
0.7575718019  
0.7201781974  
0.7049844098  
0.7099968394  
0.7302136652  
0.7579540263  
0.7835385619  
0.79624254  
0.7854599734  
0.7419198192  
0.65885175  
0.5329240099  
0.3648505802  
0.1595526954  
-0.07413245597  
-0.3242235711  
-0.5767175963  
-0.8169665782  
-1.031128058  
-1.207497253  
-1.337582636  
-1.416775793  
-1.44455817  
-1.424260531  
-1.362420426  
-1.267869737  
-1.150692564  
-1.021196616  
-0.8890166751  
-0.7624454714  
-0.6480162401  
-0.5503295065  
-0.4720982154  
-0.4143178899  
-0.3765279541  
-0.3570881919  
-0.3534368364  
-0.3623157264  
-0.3799734399  
-0.4023379114  
-0.4252092497  
-0.4444638179  
-0.456286158  
-0.4574171973  
-0.4454010637  
-0.4187962909  
-0.3773333264  
-0.3219775693  
-0.2548845474  
-0.1792405335  
-0.0989969484  
-0.01851452711  
0.05784035102  
0.1261194343  
0.1831779245  
0.2269973071  
0.2568762485  
0.2735060847  
0.2788734813  
0.2760296219  
0.2687295468  
0.2609731202  
0.2565184652  
0.2583978821  
0.2685142851  
0.2873535174  
0.3138727738  
0.3455567159  
0.3786851226  
0.4087457675  
0.4309830021  
0.4410057304  
0.4353849237  
0.4121655163  
0.3712228105  
0.3144149414  
0.245495405  
0.169786147  
0.093643006  
0.02376626446  
-0.03355850271  
-0.07320377718  
-0.0918290378  
-0.08831282185  
-0.06392795641  
-0.02222529937  
0.03136169083  
0.09015266618  
0.1470153865  
0.1952349582  
0.2293163978  
0.2456501407  
0.2429313794  
0.2222803039  
0.1870653319  
0.1424394957  
0.09466773529  
0.05033749365  
0.01555233527  
-0.004774342631  
-0.007453416796  
0.008680574641  
0.04273176001  
0.09195077558  
0.1521357251  
0.2181783154  
0.2846664115  
0.3464727132  
0.3992654911  
0.4398773393  
0.4665302744  
0.4788813431  
0.4779153466  
0.4657145421  
0.4451271766  
0.4194032118  
0.3918039059  
0.365251577  
0.3420345336  
0.3235850922  
0.3103487417  
0.3017540154  
0.2962748394  
0.291586734  
0.2848158132  
0.2728577259  
0.2527501062  
0.2220740455  
0.1793363249  
0.124297971  
0.05820276823  
-0.01614797531  
-0.09448529108  
-0.1713641752  
-0.24062894  
-0.2960252672  
-0.3318904885  
-0.3438598488  
-0.3294691183  
-0.2886005815  
-0.2236600208  
-0.1394679879  
-0.04283488758  
0.05813688028  
0.1549556291  
0.2397303999  
0.3061243823  
0.3501335078  
0.3705582755  
0.3691062065  
0.3500803497  
0.3196830648  
0.2850469098  
0.2531042143  
0.2295035539  
0.2177267235  
0.2185717404  
0.2301034321  
0.2481050554  
0.2669696507  
0.2809109069  
0.2852880914  
0.2778181548  
0.259443818  
0.2346663512  
0.2112317914  
0.1991551396  
0.2091816318  
0.2508825566  
0.3306774747  
0.4500848005  
0.6045210556  
0.782878768  
0.9680404809  
1.138310473  
1.269644956  
1.338398357  
1.324234908  
1.212802698  
0.9977907019  
0.6820793754  
0.2778157077  
-0.1945889609  
-0.7084078759  
-1.233194951  
-1.737687997  
-2.192628999  
-2.573149762  
-2.860501278  
-3.04296298  
-3.115969462  
-3.081551481  
-2.947307504  
-2.725133866  
-2.42991821  
-2.078373962  
-1.68808011  
-1.276749062  
-0.8616569156  
-0.4591389344  
-0.08408205735  
0.2506552075  
0.5348949876  
0.761802286  
0.928454014  
1.0361887  
1.090593846  
1.10106496  
1.079899782  
1.040979908  
0.9981923681  
0.9637789462  
0.9468385919  
0.9522343382  
0.9800545616  
1.025750188  
1.080934524  
1.134742644  
1.175547277  
1.192771073  
1.178524866  
1.128812856  
1.044136756  
0.9294162937  
0.7932561541  
0.6467084099  
0.5017244282  
0.3695670718  
0.2594315283  
0.1774562748  
0.1262841811  
0.1051839806  
0.11067091  
0.1374991121  
0.1798117433  
0.2322552084  
0.2908453686  
0.353452139  
0.4198241933  
0.4911549404  
0.5692752425  
0.6556326436  
0.7502318596  
0.8507510848  
0.9520153206  
1.045954854  
1.122119974  
1.168718887  
1.174075875  
1.128306477  
1.024988736  
0.8625397804  
0.6450866544  
0.3826224084  
0.09038778509  
-0.2125064257  
-0.5050625305  
-0.7667161182  
-0.979694587  
-1.131053915  
-1.21410558  
-1.229009177  
-1.18246634  
-1.086538931  
-0.956809804  
-0.8101553781  
-0.66247921  
-0.5267419929  
-0.4115569629  
-0.3205447749  
-0.2524749569  
-0.2021433672  
-0.1617917522  
-0.1228132606  
-0.07746559756  
-0.02032303288  
0.05074169626  
0.1341818129  
0.2250126255  
0.3156161148  
0.3969379068  
0.4598925634  
0.4967450577  
0.5022567073  
0.4744377057  
0.4148061186  
0.3281313578  
0.2217319845  
0.1044382321  
-0.0145979563  
-0.1270729465  
-0.2264952085  
-0.3088197821  
-0.3726735824  
-0.4191510519  
-0.4512564563  
-0.473076094  
-0.4888513412  
-0.5020912449  
-0.5148724889  
-0.5274415329  
-0.5381669692  
-0.5438465539  
-0.5403097233  
-0.5232151888  
-0.4889049699  
-0.4351815911  
-0.361874787  
-0.2711062188  
-0.167208338  
-0.05630464229  
0.05439336514  
0.1574630979  
0.246190614  
0.3154083567  
0.3621170785  
0.3858181053  
0.3884991873  
0.37430463  
0.3489211854  
0.3187912102  
0.2902659881  
0.2688036395  
0.2583348906  
0.2608594236  
0.2763125786  
0.3027093423  
0.3365186615  
0.3732071593  
0.4078642633  
0.4358288092  
0.4532272186  
0.4573768473  
0.4469997161  
0.4222590743  
0.384616121  
0.3365609623  
0.2812616088  
0.2221857645  
0.1627564901  
0.1060682132  
0.05470648029  
0.01065162439  
-0.02471409647  
-0.05055011144  
-0.06646255653  
-0.07240765879  
-0.06862469604  
-0.05560877693  
-0.03412614245  
-0.00524874676  
0.02958321914  
0.06853174602  
0.1093669025  
0.1495415604  
0.1863283154  
0.2170360027  
0.2392609731  
0.2511625479  
0.2517154808  
0.2409088059  
0.219846799  
0.1907420418  
0.1567898429  
0.1219207392  
0.09047358765  
0.0668019575  
0.05486964462  
0.05786993478  
0.07790508961  
0.1157614368  
0.1707934865  
0.2409307433  
0.3227988878  
0.4119429144  
0.5031386683  
0.5907703794  
0.6692369892  
0.7333844838  
0.7789164655  
0.8027749862  
0.803447628  
0.7811760752  
0.7380409167  
0.6778823946  
0.6060526716  
0.5289827744  
0.4536019033  
0.3866214498  
0.3337886668  
0.2991586319  
0.284506329  
0.2889499478  
0.3088793884  
0.3382133856  
0.3689930625  
0.3922596708  
0.3991189684  
0.3818643621  
0.3350022857  
0.2560331547  
0.1458646162  
0.008783351058  
-0.1480196728  
-0.3153235409  
-0.4829993414  
-0.6412471654  
-0.7817213596  
-0.8983967607  
-0.988043601  
-1.050248615  
-1.087007222  
-1.101986773  
-1.099601353  
-1.084083417  
-1.058718422  
-1.025354036  
-0.9842769573  
-0.9344354096  
-0.8739528248  
-0.8008128399  
-0.7135792159  
-0.6120155428  
-0.4974946854  
-0.3731248464  
-0.2435812704  
-0.1146782281  
0.007249376335  
0.1160522249  
0.2064575676  
0.274633928  
0.3185819571  
0.3382836486  
0.3356165747  
0.3140659276  
0.2782694004  
0.2334798141  
0.1850079781  
0.1377237401  
0.0956491924  
0.06171274417  
0.03764031311  
0.02400852632  
0.0204122767  
0.02572446976  
0.03839330566  
0.05673941782  
0.07920167402  
0.1045151391  
0.1317918091  
0.160505347  
0.1903894321  
0.2212861108  
0.2529538321  
0.2848953196  
0.3162272306  
0.345636501  
0.3714099286  
0.3915895332  
0.4041913744  
0.4074933644  
0.4003412463  
0.3824204776  
0.3544534077  
0.3182839872  
0.2768177663  
0.2338151422  
0.1935512953  
0.160372781  
0.1382227749  
0.1301638006  
0.1379946626  
0.1619982528  
0.2008591199  
0.2517738238  
0.3107312255  
0.3729397178  
0.4333297452  
0.4870868146  
0.5301269763  
0.5594675049  
0.5734553165  
0.5718300416  
0.5556291952  
0.526977399  
0.4887770526  
0.444379409  
0.3972574412  
0.3507296661  
0.3077501258  
0.270763104  
0.2416242399  
0.2215576895  
0.2111304334  
0.2102501021  
0.2181497759  
0.2333949475  
0.2539087092  
0.277048318  
0.2997390142  
0.3186863867  
0.3306500589  
0.3327678165  
0.3228915146  
0.2998890438  
0.2638633484  
0.2162447197  
0.1597232659  
0.09802131856  
0.03551870142  
-0.02324032964  
-0.074063353  
-0.1136118339  
-0.1397819916  
-0.1519281674  
-0.1508652912  
-0.1386616535  
-0.1182234887  
-0.09276877459  
-0.06523454744  
-0.03774948611  
-0.01125567157  
0.0146391579  
0.04153507936  
0.07182637342  
0.108071626  
0.1522259906  
0.2048658215  
0.2645505843  
0.3274583005  
0.3873845927  
0.4361650281  
0.4644889033  
0.4630227564  
0.4237042948  
0.3410115276  
0.2130259031  
0.04211782306  
-0.1648655003  
-0.3969533935  
-0.639915427  
-0.8775259601  
-1.09307881  
-1.270941165  
-1.397979972  
-1.464694312  
-1.46595145  
-1.401292142  
-1.274807576  
-1.094668223  
-0.8723802205  
-0.6218772664  
-0.3585312935  
-0.09814764268  
0.1440023622  
0.354087616  
0.5205393765  
0.634766312  
0.6917341942  
0.6903578797  
0.6336636811  
0.5286675927  
0.3859372332  
0.2188228103  
0.04240405494  
-0.1277830182  
-0.2771170215  
-0.3932235639  
-0.4671110739  
-0.4939670107  
-0.4735269874  
-0.4099518671  
-0.3112253487  
-0.1881537019  
-0.05308159742  
0.08150798613  
0.2043414801  
0.3064993643  
0.3822284951  
0.4293471711  
0.4492218853  
0.446350877  
0.4276338405  
0.4014222326  
0.3764845636  
0.3610041098  
0.3617043542  
0.3831916797  
0.427549595  
0.4942055175  
0.5800532119  
0.6797857009  
0.7863974728  
0.8917887262  
0.9874326059  
1.065052545  
1.117276561  
1.138248712  
1.124161589  
1.073694338  
0.9883063505  
0.8723563423  
0.7330004821  
0.5798172455  
0.424172694  
0.2783123228  
0.154252617  
0.06256878689  
0.01120871621  
0.004491080181  
0.04242820164  
0.120486249  
0.229838678  
0.3581054736  
0.4904929647  
0.6111878332  
0.7048502024  
0.7580115952  
0.7602310138  
0.7049209151  
0.5897751609  
0.4168351415  
0.1922371229  
-0.07427076201  
-0.3699706471  
-0.6798925486  
-0.9876050076  
-1.276031539  
-1.528338587  
-1.728873875  
-1.864166701  
-1.923941556  
-1.902067897  
-1.797350709  
-1.614028819  
-1.361877961  
-1.055835948  
-0.7151171806  
-0.3618506634  
-0.01934844801  
0.2898474301  
0.545950081  
0.733707227  
0.8438108043  
0.8737306757  
0.8279035459  
0.71721592  
0.5578313527  
0.3694942018  
0.1734654905  
-0.009668121155  
-0.1620926096  
-0.2705337598  
-0.3275183286  
-0.3319814027  
-0.2891638634  
-0.2098024282  
-0.1087121321  
-0.002897291919  
0.09057845203  
0.1567393018  
0.1845889964  
0.1685262423  
0.1090979754  
0.01296871777  
-0.1078880974  
-0.2377029239  
-0.3589344814  
-0.4545288916  
-0.5101203019  
-0.5158435553  
-0.4675098098  
-0.3669717431  
-0.2216343311  
-0.04319360239  
0.1541750703  
0.3558818832  
0.5488942491  
0.7232965778  
0.8731932449  
0.9968273265  
1.095935492  
1.17451219  
1.237232394  
1.28789066  
1.328151485  
1.356897329  
1.370293783  
1.362585435  
1.327455824  
1.25969736  
1.156843335  
1.020429125  
0.8565888869  
0.6758353805  
0.4919962214  
0.3204466751  
0.1759268824  
0.07029208122  
0.01059604881  
-0.002146402195  
0.02670210565  
0.08606654436  
0.1607202892  
0.2335041571  
0.2878476674  
0.310166183  
0.2917613651  
0.2299164988  
0.1280252719  
-0.005217194319  
-0.1574069752  
-0.3144973988  
-0.4629752717  
-0.5917798062  
-0.6936525675  
-0.765739807  
-0.8094029964  
-0.8293234317  
-0.8321326933  
-0.8248448598  
-0.8133983523  
-0.8015658089  
-0.7904060363  
-0.7783343682  
-0.7617429378  
-0.7360372651  
-0.696862337  
-0.6412808558  
-0.5686730348  
-0.4811988259  
-0.3837298173  
-0.2832696107  
-0.187952539  
-0.1057880881  
-0.04336659091  
-0.00473381927  
0.009370704488  
0.001797811757  
-0.02128875473  
-0.05119424337  
-0.07788670086  
-0.09143713421  
-0.08348006802  
-0.04849651782  
0.01528516664  
0.1055128776  
0.2159259716  
0.3371376616  
0.4579006364  
0.5666493999  
0.6531299557  
0.7098360416  
0.7330669896  
0.7234181045  
0.6856406041  
0.627887286  
0.5604787141  
