1690.312916  
1766.391265  
1954.425225  
2335.237594  
1968.785569  
9816.980777  
4167.056147  
89179.98772  
7613.637678  
27026.34564  
4639.709211  
10077.15273  
7663.904991  
16123.32465  
87.96227822  
5806.483516  
14549.98095  
36569.10119  
20572.96285  
7589.846496  
6314.42994  
10191.77637  
12786.12281  
186.4184406  
8252.303863  
10861.62801  
12548.52018  
78.40031914  
3782.940959  
3730.129241  
1817.678155  
3806.496494  
2673.992154  
1806.240538  
236.7466684  
3583.332728  
4792.970961  
211.0879217  
8336.160265  
6911.951153  
2991.785782  
5803.484388  
6851.394431  
7942.012407  
3999.397435  
4460.086797  
3327.207672  
12376.29878  
11468.79761  
2640.279008  
7257.76968  
3946.572478  
17322.95764  
232.6695342  
2139.147092  
2575.495377  
536.3887225  
3687.213394  
2230.620782  
1957.916914  
1538.638387  
2095.217982  
770.0294187  
952.3574644  
145.8111395  
300.0759312  
57.39410103  
762.6837926  
33.1345231  
706.1915644  
72.44633952  
462.4694159  
16.56661224  
349.5023508  
24.10005811  
205.767411  
30.52627124  
166.5382109  
16.9126867  
110.1650026  
28.50672487  
76.4680484  
34.08357736  
56.8092009  
29.74771081  
39.57846536  
28.74167637  
31.06173999  
26.63722651  
25.56512549  
24.24093348  
23.14947985  
20.0399549  
19.5206386  
17.93201007  
17.50528438  
15.82637104  
15.57035072  
14.3127376  
13.92656787  
12.73182896  
12.33916823  
11.66529793  
11.23815503  
10.55280055  
10.20395074  
9.633737144  
9.223368946  
8.704885058  
8.387712539  
8.029489124  
7.669581579  
7.304603704  
7.027984003  
6.739672948  
6.442509729  
6.154678903  
5.932991668  
5.705873098  
5.478457572  
5.243897882  
5.05027817  
4.858866535  
4.673301908  
4.492318707  
4.332500902  
4.178033619  
4.021432473  
3.876454087  
3.737392165  
3.60922918  
3.479717953  
3.361777251  
3.245890378  
3.137720588  
3.030155465  
2.928162064  
2.831709407  
2.739175208  
2.65007889  
2.564318893  
2.482523919  
2.403642629  
2.327930246  
2.2548453  
2.18504591  
2.117798315  
2.053135656  
1.990949214  
1.930985268  
1.873393566  
1.817755314  
1.764316928  
1.712739209  
1.662897784  
1.614953844  
1.568709865  
1.524050626  
1.481006072  
1.439370864  
1.39927136  
1.360463319  
1.323058201  
1.286887274  
1.251853869  
1.218045891  
1.185293639  
1.153677965  
1.123084425  
1.093436329  
1.064768054  
1.037005539  
1.010131786  
0.9840922438  
0.958876115  
0.9344265964  
0.9107233291  
0.8877648462  
0.8655058329  
0.8439186344  
0.8229891477  
0.8026962577  
0.7829685438  
0.7638481617  
0.7452936397  
0.7272736459  
0.7097752373  
0.6927842973  
0.6762729143  
0.6602206941  
0.6446581713  
0.6295210292  
0.6148130455  
0.6004977685  
0.5865931309  
0.5730640351  
0.5599044417  
0.5470999884  
0.5346796533  
0.5225668032  
0.510780915  
0.4992910406  
0.4881443105  
0.4772597005  
0.4666900196  
0.4563841238  
0.446346551  
0.4365536503  
0.4270289572  
0.4177598919  
0.4087162456  
0.3998915524  
0.3913039078  
0.3829145646  
0.3747601512  
0.3667914598  
0.3590211219  
0.3514481627  
0.3440504703  
0.3368615472  
0.3298332363  
0.3229606963  
0.3162703801  
0.3097383215  
0.3033582831  
0.2971305966  
0.2910508858  
0.2851231646  
0.2793266587  
0.2736550961  
0.2681405325  
0.2627249497  
0.2574524612  
0.2523020983  
0.2472608253  
0.2423378008  
0.2375204136  
0.2328336607  
0.2282361142  
0.223739582  
0.2193451957  
0.2150447553  
0.210850779  
0.2067399559  
0.2027333662  
0.1988025337  
0.1949521881  
0.1911875883  
0.187514525  
0.1839122757  
0.1803861064  
0.1769544681  
0.1735759578  
0.17027408  
0.1670367181  
0.1638770948  
0.1607798395  
0.1577469533  
0.154769763  
0.151866096  
0.1490156148  
0.1462374253  
0.1434959941  
0.1408255898  
0.1381996736  
0.1356260717  
0.1331163783  
0.1306538027  
0.1282366459  
0.1258689913  
0.1235488219  
0.1212811264  
0.1190536274  
0.1168637005  
0.1147184337  
0.1126151057  
0.1105623504  
0.108550426  
0.1065652291  
0.1046353641  
0.1027214619  
0.1008569219  
0.09902833246  
0.09722818644  
0.09546898058  
0.09374258733  
0.09205208845  
0.09038598738  
0.08875436188  
0.08715056065  
0.08559017399  
0.08404570314  
0.08253048225  
0.08104668863  
0.07958591378  
0.0781585986  
0.07675793559  
0.07537953327  
0.07402624384  
0.0726994486  
0.07139320212  
0.07011661546  
0.06886128546  
0.06762843782  
0.0664192903  
0.06522759897  
0.06405341984  
0.06290747611  
0.06177877587  
0.06067591713  
0.05959031321  
0.05851639066  
0.05747316766  
0.05644169965  
0.05542931887  
0.05443122127  
0.0534590781  
0.05249450377  
0.05155307889  
0.05062696863  
0.04971594818  
0.04881736961  
0.04793979609  
0.04707594844  
0.04623129962  
0.04539342886  
0.04457043048  
0.04376314822  
0.04297293362  
0.04219049309  
0.04142662177  
0.04067540148  
0.03993670385  
0.03920430593  
0.03849043716  
0.03778867532  
0.03709191518  
0.03641834762  
0.03574716795  
0.03508942481  
0.03444327129  
0.03380777563  
0.03318429366  
0.0325666955  
0.03196336664  
0.03136917702  
0.03078619286  
0.03021042333  
0.02964331493  
0.02908943022  
0.02854048989  
0.02800508111  
0.02747588048  
0.02695462252  
0.02644779016  
0.02593848188  
0.02544606933  
0.02495905908  
0.02447995835  
0.0240114291  
0.02354712247  
0.02309011094  
0.02264240115  
0.02220123679  
0.02176408487  
0.02133955716  
0.02092023055  
0.02050598662  
0.02010237725  
0.01969960816  
0.01930880422  
0.01891926676  
0.0185407861  
0.01816453624  
0.01779712702  
0.01743357126  
0.01708034649  
0.01672720771  
0.01638071038  
0.01604357279  
0.0157119553  
0.01538029599  
0.01506040262  
0.01474243613  
0.01443163719  
0.0141222371  
0.01382102343  
0.01352404324  
0.01323099408  
0.0129410723  
0.01266371789  
0.01238263066  
0.01210822559  
0.01184019656  
0.01157565137  
0.01131343168  
0.01105956846  
0.01080789076  
0.01056087955  
0.01031874326  
0.01007948672  
0.009841846903  
0.009610256127  
0.009383611278  
0.009163327392  
0.008942536458  
0.008727070843  
0.008516600448  
0.008306661685  
0.008101647432  
0.007901856114  
0.007703794419  
0.007509141636  
0.007318746064  
0.007132264775  
0.006947260272  
0.006768021454  
0.006590817624  
0.006417405412  
0.006246461842  
0.006076789432  
0.005912694491  
0.005751287102  
0.005593626775  
0.005436666999  
0.005284893306  
0.005135474134  
0.004990115799  
0.004843883197  
0.004703055315  
0.004564936899  
0.004428398819  
0.004295634795  
0.004165582885  
0.004038963573  
0.003913050005  
0.003792438027  
0.003671670348  
0.003554586999  
0.003439956553  
0.003328359288  
0.00321875281  
0.003112248233  
0.00300743289  
0.002905201065  
0.002804983186  
0.002707703783  
0.002612820948  
0.002519847429  
0.002430404926  
0.002341119301  
0.002255775491  
0.00217216939  
0.002089702968  
0.002011061846  
0.001934094734  
0.001859253561  
0.001786781495  
0.001716897176  
0.001648828896  
0.001583055531  
0.001519281544  
0.001457181938  
0.001397115351  
0.001339979424  
0.001283562761  
0.001230188335  
0.001178633502  
0.001129262349  
0.001081937494  
0.001036496857  
0.0009928046593  
0.0009514880487  
0.0009122577347  
0.0008743524803  
0.0008383118629  
0.0008052049628  
0.0007738011118  
0.0007444759722  
0.0007166444762  
0.0006907636307  
0.0006664242931  
0.0006448383394  
0.000625234717  
0.0006067759439  
0.000590259313  
0.0005766163989  
0.0005637971176  
0.0005534740666  
0.0005447736639  
0.0005386449114  
0.0005338949407  
0.0005308812958  
0.0005295362294  
