1942.527454  
2025.421223  
2246.482234  
2738.724787  
2533.66513  
947.1762413  
96849.14208  
63930.84725  
26632.29732  
15749.86077  
5282.061129  
125.0781745  
42414.01204  
19373.70555  
1384.150177  
6913.95561  
715.0064409  
17229.98369  
21767.26758  
12042.13572  
23210.37271  
8183.902617  
14970.1707  
6246.027016  
8641.725761  
614.3262074  
4936.011553  
1773.840744  
1974.561889  
500.7834603  
11162.42577  
9971.0944  
7847.191447  
1020.236785  
1841.335768  
8792.062242  
810.6958354  
45.8505965  
3418.702715  
1429.947819  
1360.620738  
2221.065354  
680.8648941  
1561.354831  
6589.035981  
74.15854158  
242.7157016  
1441.395564  
122.173859  
91.66691127  
1076.930916  
2211.793351  
830.4326491  
231.0442137  
956.6087054  
1127.239837  
147.0570118  
1264.930637  
578.9923882  
64.49879846  
473.0270182  
493.2808104  
338.8564396  
91.25076697  
724.2787088  
661.4479774  
11.52163522  
180.151182  
251.7464236  
136.9462185  
42.01092253  
37.08419775  
81.15821505  
88.42547452  
82.28226923  
48.16860053  
49.68680974  
35.82506214  
34.08947375  
40.37078933  
24.78869851  
25.96309413  
23.20948117  
23.69619493  
21.44911351  
20.21870211  
18.18420871  
18.88947848  
16.64196505  
15.68759856  
14.82544476  
13.58272397  
12.81636903  
12.20172857  
11.66183948  
10.74765818  
10.17966662  
9.627591481  
9.200193821  
8.663701947  
8.223589051  
7.859673781  
7.496103816  
7.134438961  
6.771579678  
6.471461985  
6.194658222  
5.92117568  
5.651926049  
5.422133463  
5.187605177  
4.973353808  
4.769053982  
4.570181965  
4.387882958  
4.212086788  
4.047766737  
3.893759848  
3.744202262  
3.602363781  
3.469729301  
3.343150137  
3.22172749  
3.105428009  
2.995285823  
2.889976716  
2.788824491  
2.693228264  
2.601718428  
2.513779957  
2.430098342  
2.350167962  
2.273455322  
2.200040216  
2.129323963  
2.061951043  
1.997404483  
1.935173578  
1.87549439  
1.818381577  
1.763493891  
1.710501705  
1.6597902  
1.611023982  
1.564047864  
1.518856786  
1.475340225  
1.433447796  
1.393048477  
1.354222437  
1.316658892  
1.280555302  
1.245752463  
1.212057628  
1.179612004  
1.148282187  
1.118056812  
1.088825091  
1.060548612  
1.033290695  
1.006920673  
0.9813912973  
0.9567201883  
0.9328586619  
0.9097552562  
0.8873957105  
0.865779531  
0.8448274425  
0.824494568  
0.8048313686  
0.7858228771  
0.7673320751  
0.7494260127  
0.7320622693  
0.7151987661  
0.6988824708  
0.6830232466  
0.6676624913  
0.6527184035  
0.6382399439  
0.6241374835  
0.6104830377  
0.597210997  
0.5842834541  
0.5717377509  
0.5595401893  
0.5476986742  
0.536184199  
0.5249831373  
0.5140761706  
0.5034763154  
0.4931714126  
0.4831317386  
0.4733665241  
0.4638610909  
0.4545710874  
0.4455592862  
0.4367997731  
0.4282481545  
0.4198820181  
0.4117833313  
0.4038595159  
0.3961454912  
0.3886545394  
0.3813159981  
0.3741661683  
0.3671928341  
0.3603894483  
0.353780771  
0.3472943862  
0.3409835715  
0.3348181226  
0.3288025855  
0.3229483601  
0.3172130947  
0.3116235429  
0.3061494721  
0.3008210981  
0.2956138652  
0.2905242757  
0.2855500377  
0.2806943106  
0.275956292  
0.2713152755  
0.2667823854  
0.2623351327  
0.258006229  
0.2537601398  
0.249622453  
0.245563302  
0.2416177263  
0.2377208376  
0.2339259076  
0.2302239789  
0.2265815197  
0.2230418814  
0.2195524033  
0.2161519727  
0.2128340697  
0.2095653621  
0.2063646969  
0.2032513416  
0.2001809056  
0.1971735469  
0.1942533694  
0.1913640468  
0.1885381682  
0.1857709959  
0.1830735218  
0.1804340907  
0.1778163198  
0.1752778014  
0.1727736675  
0.170343276  
0.1679449122  
0.1655958779  
0.1632864037  
0.1610221828  
0.1587998927  
0.156627999  
0.154516013  
0.152420044  
0.1503652437  
0.1483540214  
0.1463701164  
0.1444377302  
0.1425309131  
0.1406676639  
0.1388401485  
0.1370515749  
0.1352880874  
0.1335518453  
0.1318592483  
0.130197761  
0.1285501422  
0.1269486821  
0.1253546664  
0.1238220755  
0.1222950728  
0.1207939561  
0.1193301242  
0.1178878539  
0.1164718297  
0.1150752883  
0.1137037874  
0.112370399  
0.111043438  
0.1097508488  
0.1084768472  
0.1072163515  
0.1059933635  
0.10478274  
0.1035935166  
0.102427563  
0.101276925  
0.1001507097  
0.09903622896  
0.09794077092  
0.09686286177  
0.09580554676  
0.09477440205  
0.09375302543  
0.09275556835  
0.09176878031  
0.09079106853  
0.08983970583  
0.08889333966  
0.08797234208  
0.08707639955  
0.08618166528  
0.08529679745  
0.08442430093  
0.08357792424  
0.08274560614  
0.08191149688  
0.08110608896  
0.08030327234  
0.0795271141  
0.07875094635  
0.07798759973  
0.07725090226  
0.07650681218  
0.07578322243  
0.07507231327  
0.07436575596  
0.07366782295  
0.07299040596  
0.07231942063  
0.07166633252  
0.07100703211  
0.0703703603  
0.06975147231  
0.06912535449  
0.06851447944  
0.06791233073  
0.06732007358  
0.06673644979  
0.06615907041  
0.06559914609  
0.065039678  
0.06449530326  
0.06395021926  
0.06342837879  
0.06290162558  
0.06238400083  
0.06187799728  
0.06138404386  
0.06087780437  
0.06039650213  
0.05992184955  
0.05945075016  
0.05899231949  
0.05853465585  
0.05807500423  
0.05763655504  
0.05719768263  
0.05676809925  
0.05634764513  
0.05592871119  
0.05551603337  
0.05511499092  
0.05471837183  
0.05431954093  
0.05393136741  
0.05355630125  
0.05317516138  
0.0528065259  
0.05244244424  
0.0520802788  
0.05172344785  
0.05137701367  
0.05103612999  
0.05069512243  
0.05036760415  
0.05003742164  
0.04970940181  
0.04938999386  
0.04908610119  
0.04877035739  
0.0484668611  
0.04816363291  
0.04787338609  
0.04757624526  
0.04729076676  
0.04701473682  
0.04673323436  
0.04645528433  
0.04618599884  
0.0459170102  
0.04565273787  
0.0454028418  
0.04514648638  
0.04489848939  
0.0446526977  
0.04440643349  
0.04417608504  
0.04393843287  
0.04370637383  
0.04347729959  
0.04325490812  
0.04303523058  
0.0428163876  
0.04260316714  
0.04239340335  
0.04218646335  
0.04198169582  
0.04178024211  
0.0415818648  
0.04138798024  
0.04119856248  
0.0410092274  
0.04082506893  
0.04064000817  
0.04045955874  
0.04029218779  
0.04011247907  
0.0399503601  
0.03978005691  
0.0396177552  
0.03945171929  
0.03929570906  
0.03913941076  
0.03898833377  
0.03883733352  
0.03869084409  
0.03854660781  
0.03840264468  
0.03826624495  
0.03812774765  
0.03799395671  
0.03786139285  
0.03772888778  
0.03760237822  
0.03747799149  
0.0373620983  
0.0372357841  
0.03712113645  
0.03700745202  
0.03689358137  
0.03678380215  
0.03667846151  
0.03657282983  
0.03646870688  
0.03636777177  
0.03627283605  
0.03617719589  
0.03607706611  
0.0359850025  
0.03590065356  
0.03581110663  
0.03572685421  
0.03564099713  
0.03556233395  
0.03548404992  
0.03540799273  
0.03533356957  
0.03526000315  
0.03518277922  
0.03511988453  
0.03505586724  
0.0349876788  
0.03492802175  
0.03486490793  
0.03480738745  
0.03475441907  
0.0347004959  
0.03464385197  
0.03459718764  
0.03454801428  
0.03450637692  
0.03445876588  
0.03441235457  
0.03436706516  
0.03433410725  
0.03429973193  
0.0342650854  
0.03423813902  
0.03419750619  
0.03416706595  
0.03414092218  
0.0341156995  
0.03409379361  
0.0340693679  
0.03405588035  
0.03403410475  
0.03401762922  
0.03400381443  
0.03399511647  
0.03398318963  
0.03397628728  
0.03396666959  
0.03395831786  
0.03396322248  
0.03396292219  
