4.313461946  
13.17544799  
33.14032719  
91.88592453  
390.0953795  
1468.974782  
65772.5366  
5463.984596  
27449.8765  
15974.07851  
47572.01894  
708.4113209  
46017.53049  
24360.93195  
9715.165098  
47008.84151  
13077.49383  
122.4597033  
38246.50268  
10844.22297  
1361.351628  
3098.691554  
14514.55176  
1807.938244  
6910.873662  
7324.390644  
3897.804514  
2505.285468  
1857.710468  
4270.888432  
4411.659946  
3028.304689  
12443.3841  
297.768364  
1712.282221  
7469.594658  
5074.757026  
1981.7257  
6664.167501  
3469.214231  
2658.408259  
2495.549505  
4695.644495  
849.9452053  
2068.796973  
6389.511064  
725.9816547  
2110.701527  
1066.490796  
1849.803063  
216.5343331  
3270.261834  
17.64345493  
239.900819  
3857.858804  
815.4875978  
439.7146046  
529.3298646  
2538.916842  
403.0384212  
5.410105486  
799.8048871  
0.7474309812  
65.36092888  
412.7520534  
104.4867894  
14.08676565  
52.17937646  
43.40096691  
29.23318793  
9.374947283  
25.15513564  
13.62994647  
9.975992988  
12.49353903  
8.918764578  
3.617093841  
7.480566158  
2.917025474  
3.634083433  
4.18913963  
4.123328873  
3.081700454  
3.664841914  
2.506264336  
2.981453158  
2.93019005  
2.494604336  
2.524384108  
2.710886325  
2.486420893  
2.634825393  
2.501968854  
2.499740637  
2.590940848  
2.399017993  
2.369935856  
2.407581254  
2.313729011  
2.29620064  
2.255244805  
2.186382408  
2.172610057  
2.123331626  
2.063510277  
2.047615528  
2.009639307  
1.97319399  
1.946953781  
1.913094602  
1.882581849  
1.856612726  
1.825347541  
1.799159748  
1.770487724  
1.741337409  
1.716210468  
1.690363901  
1.663706408  
1.638951442  
1.614424717  
1.590696254  
1.567864496  
1.544199277  
1.521924623  
1.500745222  
1.479010082  
1.458303388  
1.437879552  
1.417848668  
1.398645667  
1.37952133  
1.360655127  
1.342631417  
1.324596594  
1.307136056  
1.289949778  
1.273029146  
1.256604943  
1.240492767  
1.224577414  
1.209165327  
1.193969777  
1.179067661  
1.164478073  
1.150194778  
1.136113358  
1.122388342  
1.108940919  
1.095686671  
1.082749978  
1.070008318  
1.057528424  
1.045271061  
1.033264689  
1.02144213  
1.009873603  
0.9984944941  
0.9873530302  
0.976391891  
0.9656246309  
0.9550841333  
0.9446805862  
0.9344916437  
0.924489472  
0.914655619  
0.9049710926  
0.8954867536  
0.8861502345  
0.8769840471  
0.867966713  
0.8590993884  
0.8504146999  
0.841844818  
0.8334319879  
0.8251578629  
0.817001735  
0.8090006423  
0.8011211251  
0.7933799244  
0.785753605  
0.7782682666  
0.7708886341  
0.7636278544  
0.7564928984  
0.7494498707  
0.7425705443  
0.7357452328  
0.7290452715  
0.7224594465  
0.7159666906  
0.7095794897  
0.703282506  
0.6970882074  
0.690968182  
0.6849911401  
0.6790563408  
0.6732257122  
0.6674901452  
0.6618263059  
0.6562575534  
0.650767092  
0.6453618359  
0.6400404556  
0.6347780159  
0.629611055  
0.6245189547  
0.6194920611  
0.614533758  
0.6096428093  
0.6048313992  
0.6001005399  
0.5954037768  
0.5908009541  
0.5862561315  
0.5817686479  
0.5773556674  
0.5729928432  
0.5686977856  
0.5644384334  
0.5602642452  
0.5561331302  
0.5520711524  
0.5480535467  
0.5441017342  
0.5401828742  
0.5363435572  
0.5325359043  
0.528781484  
0.5250818406  
0.5214375693  
0.5178175381  
0.5142602036  
0.5107445375  
0.5072865278  
0.5038762238  
0.5005007101  
0.4971436135  
0.4938657809  
0.4906168645  
0.4874293255  
0.4842650571  
0.4811244164  
0.4780340454  
0.4749992741  
0.4719793522  
0.4690137556  
0.466074944  
0.4631971539  
0.4603151407  
0.4575058357  
0.4547089092  
0.4519564921  
0.4492348675  
0.4465459834  
0.4438869657  
0.4412583447  
0.4386608181  
0.4361128768  
0.4335825325  
0.4310809318  
0.4286137225  
0.426174769  
0.4237626806  
0.4213912502  
0.41903385  
0.4167006394  
0.4144066975  
0.4121382553  
0.4098826471  
0.4076705708  
0.4054849196  
0.4033008318  
0.4011798211  
0.3990563921  
0.396975136  
0.3949019336  
0.3928568067  
0.3908353118  
0.3888465105  
0.3868730313  
0.3849200482  
0.3829888469  
0.3810847323  
0.3792049803  
0.3773250849  
0.3754806512  
0.3736789746  
0.3718728182  
0.3700940791  
0.3683209461  
0.3665840179  
0.3648707377  
0.363165705  
0.3614960805  
0.3598202579  
0.3581804981  
0.3565520574  
0.3549443081  
0.3533476597  
0.3517797978  
0.3502274282  
0.3487021714  
0.3471517822  
0.3456689728  
0.3441710647  
0.3427043007  
0.3412470789  
0.3398087266  
0.3383834534  
0.3369737273  
0.3355833333  
0.3342063035  
0.3328407615  
0.3314960673  
0.3301683333  
0.3288436383  
0.3275452431  
0.326261498  
0.3249792465  
0.3237231086  
0.3224810925  
0.3212472123  
0.3200252015  
0.3188221721  
0.3176170985  
0.3164406  
0.3152727495  
0.3141208714  
0.3129722676  
0.3118499493  
0.3107242675  
0.3096249188  
0.3085285593  
0.3074528034  
0.3063816885  
0.3053243052  
0.3042781787  
0.3032500879  
0.3022211457  
0.301198939  
0.3002106289  
0.2992154747  
0.2982400011  
0.2972649381  
0.2963242483  
0.2953573791  
0.294419667  
0.2934976634  
0.2925768505  
0.2916741167  
0.2907792913  
0.2898867629  
0.2890205008  
0.2881509552  
0.2872910151  
0.286443813  
0.2856075289  
0.284782103  
0.2839624107  
0.2831467232  
0.2823435197  
0.2815601593  
0.280771052  
0.2800038396  
0.2792362089  
0.2784763183  
0.277725633  
0.2769920171  
0.2762583133  
0.2755319123  
0.2748130245  
0.2741140173  
0.2734137337  
0.2727298645  
0.2720445837  
0.2713709701  
0.2707071441  
0.2700541322  
0.2694105719  
0.2687565125  
0.2681273481  
0.2675109487  
0.2668769195  
0.2662670358  
0.2656515062  
0.265063567  
0.2644773433  
0.2638892322  
0.2633122714  
0.2627496691  
0.2621806717  
0.2616294607  
0.2610809567  
0.2605405398  
0.2600176643  
0.2594916742  
0.2589680481  
0.258456539  
0.2579580724  
0.2574466808  
0.2569484298  
0.2564639616  
0.2559909699  
0.2555075867  
0.2550431621  
0.2545901307  
0.2541317344  
0.2536863561  
0.2532500246  
0.2528098025  
0.2523835394  
0.251957593  
0.2515468089  
0.2511217031  
0.2507263961  
0.2503308566  
0.2499302064  
0.2495468315  
0.2491683164  
0.2487900914  
0.2484213426  
0.2480637355  
0.2477114657  
0.2473440521  
0.2470021073  
0.2466590501  
0.2463257509  
0.2460003978  
0.2456745369  
0.2453530802  
0.2450488933  
0.2447312311  
0.2444367502  
0.2441387621  
0.2438539852  
0.243568768  
0.2432809613  
0.2430049217  
0.2427509781  
0.2424786246  
0.2422179814  
0.2419655436  
0.2417174287  
0.2414701756  
0.2412352601  
0.2410036929  
0.2407777505  
0.2405536651  
0.2403415126  
0.2401379033  
0.2399271413  
0.2397164716  
0.2395227847  
0.2393378574  
0.2391459732  
0.2389661753  
0.2387870783  
0.2386267371  
0.2384525178  
0.238287307  
0.2381389489  
0.2379848221  
0.2378393604  
0.2376889648  
0.2375711827  
0.2374313644  
0.2373018743  
0.2371742867  
0.2370604365  
0.2369395276  
0.2368491074  
0.2367401472  
0.2366412144  
0.2365440362  
0.236461001  
0.2363825216  
0.2362981497  
0.2362143164  
0.2361619604  
0.236089864  
0.2360229268  
0.2359790742  
0.2359256046  
0.2358757349  
0.235839702  
0.2358052284  
0.2357775364  
0.2357517905  
0.2357212839  
0.2357166317  
0.235699878  
0.2356954906  
0.2356906999  
