-0.2526895742  
0.8723805849  
1.936301231  
2.880739642  
3.659251459  
4.24155164  
4.615691612  
4.787922776  
4.78040848  
4.627216235  
4.369274746  
4.049038133  
3.705598365  
3.370856378  
3.067105999  
2.806194614  
2.590146184  
2.41296271  
2.263179932  
2.126752416  
1.989827854  
1.841091302  
1.67345243  
1.484991607  
1.279155681  
1.064287538  
0.8526055291  
0.6587939773  
0.4983227274  
0.385661931  
0.332520099  
0.3462435978  
0.4285338924  
0.5745984823  
0.7728902159  
1.005508191  
1.249308545  
1.47769445  
1.662966469  
1.779035917  
1.804226188  
1.723842759  
1.532184023  
1.233719816  
0.8432107933  
0.3847082839  
-0.1105298852  
-0.6070057938  
-1.068503981  
-1.46177725  
-1.759952838  
-1.945247908  
-2.010664799  
-1.960470664  
-1.809395792  
-1.580693126  
-1.303290613  
-1.008426027  
-0.7261737669  
-0.4822903008  
-0.2957386676  
-0.1771471558  
-0.1283235564  
-0.1428010153  
-0.2072706293  
-0.3036620765  
-0.4115583945  
-0.5106577769  
-0.5829818005  
-0.6146448749  
-0.5970224996  
-0.527292296  
-0.408348412  
-0.2481965321  
-0.05891856153  
0.1446364164  
0.3463121833  
0.5301342414  
0.681713369  
0.7894929266  
0.8457463821  
0.8472763485  
0.7957535111  
0.6976578845  
0.5638013288  
0.4084297233  
0.2479595222  
0.09941447871  
-0.02129436986  
-0.1010874874  
-0.1312571534  
-0.1086252183  
-0.03617270261  
0.07698482556  
0.2163160411  
0.3632519215  
0.4970950187  
0.5972617423  
0.6456042267  
0.6285175802  
0.5385754921  
0.3754727419  
0.1461411207  
-0.1359898845  
-0.4524940533  
-0.7820208256  
-1.102674433  
-1.394387507  
-1.640967942  
-1.831588503  
-1.961513113  
-2.032010724  
-2.049509127  
-2.024128835  
-1.967845649  
-1.892562576  
-1.808376263  
-1.722279404  
-1.637479441  
-1.553401178  
-1.46635461  
-1.370731261  
-1.260546234  
-1.131060579  
-0.9802491684  
-0.8098635728  
-0.6259253539  
-0.4385356703  
-0.2610037971  
-0.1083651619  
0.004532556909  
0.0651428629  
0.06524359254  
0.002592470775  
-0.118052676  
-0.2847386472  
-0.4790443217  
-0.6777034957  
-0.8549800275  
-0.9855318085  
-1.047421243  
-1.024886848  
-0.9105038896  
-0.7064122334  
-0.4244244497  
-0.08493181849  
0.2852775767  
0.6560586307  
0.9974350092  
1.283162223  
1.493863036  
1.619301091  
1.659467356  
1.624303009  
1.532054349  
1.406459164  
1.273133806  
1.155638228  
1.07180666  
1.030865559  
1.03180589  
1.063295012  
1.105204643  
1.131581606  
1.11467471  
1.029436089  
0.8578447425  
0.5923539193  
0.2379408634  
-0.1876464744  
-0.6555142613  
-1.128935813  
-1.567922394  
-1.934374559  
-2.197101305  
-2.335948441  
-2.344470968  
-2.230738049  
-2.016187239  
-1.732681905  
-1.418209924  
-1.111830446  
-0.8485541709  
-0.6548594688  
-0.5454202767  
-0.5214460572  
-0.5707934158  
-0.6698002874  
-0.7865203141  
-0.8849194738  
-0.9294483905  
-0.8894138968  
-0.7426329281  
-0.4779423513  
-0.09635615537  
0.38920251  
0.955446065  
1.571285854  
2.201019558  
2.807747984  
3.356611909  
3.817537403  
4.16725007  
4.390480289  
4.480349967  
4.438068123  
4.272084121  
3.996891907  
3.63165336  
3.198774605  
2.722500152  
2.227581191  
1.737979629  
1.275629745  
0.8592468139  
0.5032124228  
0.216638214  
0.002703729582  
-0.1415983313  
-0.2251841552  
-0.2620329117  
-0.2697609648  
-0.2677412903  
-0.2749594404  
-0.3078711292  
-0.3785348956  
-0.4932930702  
-0.652175885  
-0.849131234  
-1.073008949  
-1.309175897  
-1.541484922  
-1.754328941  
-1.934457238  
-2.072343897  
-2.162917386  
-2.205616796  
-2.203827547  
-2.163843115  
-2.093562549  
-2.001171338  
-1.894022712  
-1.777895884  
-1.656722353  
-1.532789197  
-1.407334294  
-1.281377977  
-1.156593543  
-1.036018057  
-0.9244347698  
-0.8283085834  
-0.7552526707  
-0.7130770514  
-0.7085532196  
-0.7460939044  
-0.8265625055  
-0.9464246664  
-1.097426759  
-1.266894971  
-1.438677538  
-1.594653041  
-1.716630216  
-1.788414875  
-1.797760338  
-1.737937629  
-1.608704312  
-1.416501405  
-1.173848685  
-0.8979909787  
-0.6089698098  
-0.3273650998  
-0.07200901146  
0.142026644  
0.3049222179  
0.4128924537  
0.4681868158  
0.4783564654  
0.4549046904  
0.4115438041  
0.3623167563  
0.319830408  
0.2938216452  
0.2902255461  
0.3108177924  
0.3534311638  
0.4126707651  
0.4809775961  
0.5498713391  
0.6111739841  
0.6580540862  
0.6857421725  
0.6918708062  
0.6764106255  
0.6412885737  
0.5897777425  
0.5258258626  
0.4534471172  
0.3763031571  
0.29753042  
0.219831318  
0.1457461402  
0.07802884106  
0.01996572242  
-0.02446748582  
-0.05070929751  
-0.05400643602  
-0.03006667871  
0.02413719468  
0.1095571497  
0.2244209852  
0.3639031831  
0.5202225924  
0.6832016962  
0.8412449371  
0.9826087974  
1.096787493  
1.1757933  
1.215147115  
1.214414861  
1.177213438  
1.110694556  
1.024575777  
0.9298997393  
0.8376731507  
0.757600848  
0.6970623447  
0.6604556343  
0.6489321463  
0.660529438  
0.6906260473  
0.7326054  
0.77864565  
0.8205104071  
0.8502759032  
0.8609557304  
0.8469856913  
0.8045803465  
0.7319596783  
0.6294502712  
0.4994483998  
0.3462470985  
0.1756987474  
-0.005268208476  
-0.189267459  
-0.369130534  
-0.5385903933  
-0.6928415607  
-0.8289032151  
-0.9456898343  
-1.043770787  
-1.124840612  
-1.190973579  
-1.243811033  
-1.283841088  
-1.309934303  
-1.319273166  
-1.307728728  
-1.270673392  
-1.204115465  
-1.105957689  
-0.9771534048  
-0.8225006134  
-0.6508756089  
-0.4747836372  
-0.3092110027  
-0.1699061239  
-0.07131166145  
-0.02445643289  
-0.03514819344  
-0.1027803439  
-0.2199573311  
-0.3730726168  
-0.5437681672  
-0.7111056094  
-0.8541549859  
-0.9546334538  
-0.9992255123  
-0.9812560867  
-0.9014935279  
-0.7679652497  
-0.5948365336  
-0.4005097484  
-0.205234793  
-0.02853941973  
0.1131427398  
0.2083632617  
0.2518193794  
0.2446767819  
0.1940423496  
0.1117169331  
0.01241991444  
-0.08824316331  
-0.1757795684  
-0.2385280281  
-0.2688784113  
-0.2638816145  
-0.2252139695  
-0.1585631757  
-0.07257229919  
0.02246707835  
0.1159763432  
0.1982998358  
0.2616296732  
0.3005506687  
0.3121798811  
0.2959720536  
0.2532570228  
0.1866669406  
0.09956951372  
-0.004380869105  
-0.1215001925  
-0.2481196787  
-0.3804440431  
-0.5143163789  
-0.6449598491  
-0.7668335364  
-0.8736599396  
-0.958691486  
-1.015213036  
-1.037217994  
-1.020176575  
-0.9617616693  
-0.8624082774  
-0.7255742872  
-0.5576557389  
-0.3675036218  
-0.1656040903  
0.0369857254  
0.2298087752  
0.4041137581  
0.5537435596  
0.6756752491  
0.7701251157  
0.8402187304  
0.8912649656  
0.9297473493  
0.9621811751  
0.9939978409  
1.028623283  
1.066861724  
1.106688383  
1.143460366  
1.17051692  
1.180101815  
1.164482535  
1.117118732  
1.033758523  
0.9133051794  
0.7583606854  
0.5753559491  
0.3742421357  
0.1677460436  
-0.02975171869  
-0.2036192474  
-0.3405186777  
-0.4299216808  
-0.4654293899  
-0.4457113357  
-0.3749229586  
-0.2625026514  
-0.1223256747  
0.0287414644  
0.1727216134  
0.2926550928  
0.374682157  
0.4098039876  
0.3950676925  
0.3339709921  
0.2359854697  
0.1152529942  
-0.01141865554  
-0.1269786173  
-0.2166439688  
-0.2701250561  
-0.2832324102  
-0.2586057921  
-0.2054305014  
-0.1381510575  
-0.07435487677  
-0.03211555203  
-0.02718143968  
-0.07044032525  
-0.1660373801  
-0.3104625407  
-0.4927569483  
-0.6958433349  
-0.8987896663  
-1.079701325  
-1.218796011  
-1.301228594  
-1.319221302  
-1.273190087  
-1.171689266  
-1.030178561  
-0.8687936383  
-0.7094554907  
-0.5727245653  
-0.4748925944  
-0.4256987437  
-0.4270215932  
-0.4727062994  
-0.549546041  
-0.6392530038  
-0.7211287049  
-0.7750480254  
-0.7843237631  
-0.7380807984  
-0.6328031837  
-0.4728851002  
-0.2701206202  
-0.04223748438  
0.1893191911  
0.4020299969  
0.5750470552  
0.6916544433  
0.7411718382  
0.7200684208  
0.6321650492  
0.4879564964  
0.3031473476  
0.09664217679  
-0.1117447588  
-0.3035502136  
-0.4636089388  
-0.5814468875  
-0.6519777472  
-0.6754551254  
-0.6567355566  
-0.6040131851  
-0.5272394832  
-0.436484484  
-0.340489042  
-0.2456155371  
-0.1553185378  
-0.07019145341  
0.01146824745  
0.09270236626  
0.1767391329  
0.2658383176  
0.3603571212  
0.4581768007  
0.5545973482  
0.6427151668  
0.714220122  
0.76050433  
0.7739025129  
0.7489056114  
0.6831569773  
0.5781072494  
0.439230187  
0.2757683146  
0.1000237241  
-0.07371396235  
-0.2305141912  
-0.3562518467  
-0.4390195441  
-0.4703434186  
-0.4460709938  
-0.3668242878  
-0.2379667514  
-0.06907487867  
0.1270344679  
0.3355975604  
0.5413977179  
0.7302428151  
0.8902707124  
1.012904952  
1.093359083  
1.130626418  
1.127006603  
1.087242021  
1.017446067  
0.9240026184  
0.8126137836  
0.6876740869  
0.552034153  
0.4071903765  
0.2538281583  
0.09258525361  
-0.07512992907  
-0.2464465423  
-0.4166325832  
-0.5790768473  
-0.7256873285  
-0.847660988  
-0.9365039151  
-0.9851477324  
-0.9889817798  
-0.9466363681  
-0.8604063255  
-0.7362345741  
-0.5832789707  
-0.4131055384  
-0.2386364863  
-0.07297785367  
0.07173316702  
0.1853403131  
0.2604451606  
0.2929043655  
0.2820238523  
0.23047787  
0.1439751345  
0.03072631073  
-0.09923503367  
-0.2348377399  
-0.3648174896  
-0.478578441  
-0.5670192086  
-0.6232976801  
-0.6434455033  
-0.6267997461  
-0.5761955702  
-0.4978542388  
-0.4009755258  
-0.2970020798  
-0.1986308911  
-0.1186165574  
-0.06848047222  
-0.05726040083  
-0.09042188608  
-0.1690781875  
-0.2896118189  
-0.4437734537  
-0.6192735735  
-0.8008294306  
-0.9715643275  
-1.114642131  
-1.21494064  
-1.260602117  
-1.244295234  
-1.164037712  
-1.02350198  
-0.8317635093  
-0.6025265029  
-0.3529032922  
-0.1018819358  
0.1313695877  
0.3291871382  
0.4769289244  
0.5641947945  
0.5856396607  
0.5413338674  
0.4366516596  
0.2817220426  
0.09051090741  
-0.1203837375  
-0.3331014326  
-0.5299550126  
-0.6947964048  
-0.8142381771  
-0.8786148374  
-0.8826422858  
-0.8257186179  
-0.7118603676  
-0.5492856244  
-0.3496839012  
-0.1272380311  
0.1025208936  
0.3239313934  
0.5223919621  
0.6854350199  
0.8035952292  
0.8710248633  
0.8858217442  
0.8500476294  
0.769470939  
0.6530583559  
0.5122565629  
0.3601330193  
0.2104095526  
0.07645906113  
-0.02969227797  
-0.09829057615  
-0.1226611722  
-0.09982325114  
-0.03085265501  
0.0790687222  
0.2209489607  
0.3826572688  
0.5499441892  
0.7077281169  
0.8415603444  
0.9390996686  
0.9914261708  
0.99403104  
0.9473327993  
0.8566306127  
0.7314613098  
0.5844463368  
0.4297363852  
0.2812810329  
0.1511463471  
0.04812763868  
-0.02315549456  
-0.06254062399  
-0.07395756921  
-0.06448085882  
-0.04296510041  
-0.01849310014  
0.001109040463  
0.01043720437  
0.007175285341  
-0.007837715892  
-0.03112442418  
-0.0575620534  
-0.08162487377  
-0.09866233527  
-0.1059270297  
-0.1031808306  
-0.09274062375  
-0.07897258426  
-0.06732767479  
-0.06311760857  
-0.07028084496  
-0.0903794803  
-0.1220527751  
-0.1610408466  
-0.2007981819  
-0.2336036295  
-0.2519682335  
-0.2501016834  
-0.2251551205  
-0.1780269183  
-0.1135716615  
-0.04015198381  
0.03139901203  
0.08924533897  
0.1222320286  
0.121510714  
0.08187165749  
0.002583830693  
-0.1123688357  
-0.2546810506  
-0.4126691764  
-0.5726261154  
-0.7203946729  
-0.8429415585  
-0.9297478601  
-0.9738546837  
-0.9724642246  
-0.9270543329  
-0.8430372661  
-0.7290194655  
-0.5957768891  
-0.4550749087  
-0.3184626148  
-0.1961725102  
-0.09623004453  
-0.02385916465  
0.01877294518  
0.03246544994  
0.02056597924  
-0.01169902284  
-0.05806599594  
-0.1121244443  
-0.1681485131  
-0.221757544  
-0.2703214028  
-0.3130677241  
-0.3508745909  
-0.3858076678  
-0.4204684314  
-0.457270869  
-0.497763263  
-0.5421103763  
-0.58883275  
-0.634838202  
-0.6757724448  
-0.7066233775  
-0.7225016654  
-0.7194903958  
-0.6954003249  
-0.6503432713  
-0.5869904797  
-0.5104666988  
-0.4278685694  
-0.3474475283  
-0.2775609028  
-0.2255244209  
-0.1965286789  
-0.1927840932  
-0.2130323024  
-0.2525092074  
-0.3034022654  
-0.3557508828  
-0.3986872191  
-0.4218520557  
-0.4167941117  
-0.378156843  
-0.3044747781  
-0.1984699703  
-0.06680429821  
0.08069340802  
0.2321984064  
0.3753157294  
0.4985461359  
0.5926085069  
0.651444085  
0.6727831004  
0.6582243632  
0.6128365226  
0.5443786556  
0.4622517126  
0.3763395603  
0.2959060656  
0.22867227  
0.18017225  
0.1534555267  
0.1491269266  
0.1656739298  
0.2000269296  
0.2482137095  
0.3060371217  
0.3696493722  
0.4359600365  
0.502832913  
0.5690708429  
0.634217992  
0.6982304415  
0.7611085614  
0.822549499  
0.8816893498  
0.9369773844  
0.9861889862  
1.026568302  
1.055048366  
1.068519567  
1.064088438  
1.039294342  
0.9922694185  
0.921839721  
0.8275784348  
0.7098478845  
0.5698311575  
0.4095815752  
0.2320863374  
0.04133500976  
-0.1576348861  
-0.3587400699  
-0.5549367578  
-0.7384207915  
-0.900946066  
-1.034273068  
-1.130719132  
-1.183771608  
-1.188705378  
-1.143141425  
-1.047477557  
-0.9051385905  
-0.722596124  
-0.5091545139  
-0.2764917653  
-0.03799391908  
0.1920638176  
0.3994382088  
0.5708701061  
0.6949939787  
0.7631436085  
0.7699957302  
0.7140025955  
0.5975748794  
0.4269896315  
0.212021803  
-0.03469069115  
-0.2985125939  
-0.5638435481  
-0.8152286406  
-1.038462961  
-1.221575314  
-1.355619409  
-1.43517838  
-1.458585917  
-1.427815804  
-1.348116557  
-1.227427016  
-1.075641995  
-0.9038286061  
-0.7234251219  
-0.5455118002  
-0.380146814  
-0.2358194897  
-0.1190091512  
-0.03385219867  
0.01804721759  
0.03768047587  
0.02852361941  
-0.003753230533  
-0.05177792939  
-0.1071461053  
-0.1612424335  
-0.2061436854  
-0.2354990657  
-0.2452907359  
-0.2343630738  
-0.2046177962  
-0.1608366875  
-0.1101231031  
-0.06099925872  
-0.02228457645  
-0.001876085562  
-0.005602722268  
-0.03631090209  
-0.09331249613  
-0.1722745396  
-0.2655950715  
-0.3631943125  
-0.453654505  
-0.5255420192  
-0.5687519356  
-0.5756982155  
-0.5422091944  
-0.4680062302  
-0.3567308214  
-0.2155166657  
-0.05418063414  
0.1158402696  
0.2826868792  
0.4352257169  
0.5640273847  
0.6620615694  
0.7250516123  
0.7514768771  
0.7422831161  
0.7003675383  
0.6299735693  
0.5360874782  
0.4239448311  
0.2987170644  
0.1653818104  
0.02876907206  
-0.1062934042  
-0.2348061487  
-0.3515045367  
-0.4508941024  
-0.5274833794  
-0.5761878024  
-0.5928734712  
-0.5749451781  
-0.521884582  
-0.4356170014  
-0.3206160518  
-0.1837095442  
-0.0335533234  
0.1201434252  
0.2675734816  
0.3998141956  
0.5097125791  
0.5925293571  
0.6462659073  
0.6716134306  
0.6715545628  
0.6506876244  
0.6143921977  
0.5679791183  
0.5159645482  
0.4615775412  
0.4065826184  
0.3514080142  
0.2955418464  
0.2381016867  
0.1784310695  
0.1166124566  
0.05376369102  
-0.00793452493  
-0.06549619629  
-0.1156342555  
-0.1553946593  
-0.1828039891  
-0.1973913846  
-0.2004614961  
-0.1950634738  
-0.1856268095  
-0.1773224086  
-0.1752559297  
-0.1836137778  
-0.2049335279  
-0.2396138863  
-0.2857611172  
-0.339408999  
-0.3950802452  
-0.4466037117  
-0.4880519463  
-0.51465305  
-0.5235178642  
-0.5140744803  
-0.4881396797  
-0.4496169502  
-0.4038888422  
