0.1796309164  
0.7990868817  
1.381237451  
1.894607726  
2.313916768  
2.622324109  
2.812747684  
2.888103979  
2.860468762  
2.749297141  
2.578930676  
2.375719685  
2.165107793  
1.969006531  
1.803764046  
1.678908082  
1.596784379  
1.553070573  
1.538062702  
1.538537635  
1.539936938  
1.528574555  
1.493590966  
1.428412505  
1.33152372  
1.206482033  
1.061192955  
0.9065619916  
0.7547430061  
0.6172458735  
0.5031853069  
0.4179292219  
0.3623526401  
0.3327897121  
0.3216831473  
0.3188293942  
0.3130105806  
0.2937698934  
0.2530505346  
0.1864609185  
0.09396659926  
-0.02007703426  
-0.1475588213  
-0.2778041261  
-0.3991540004  
-0.500682126  
-0.5738133105  
-0.6135909425  
-0.6194271976  
-0.5952178954  
-0.5488095433  
-0.4909007706  
-0.4335296883  
-0.3883638774  
-0.365046417  
-0.3698291539  
-0.4046951235  
-0.4670949305  
-0.5503285533  
-0.6445195146  
-0.7380209832  
-0.8190378995  
-0.8772320468  
-0.90505992  
-0.8986673065  
-0.8582155276  
-0.7876309508  
-0.6938376471  
-0.585614715  
-0.4722826981  
-0.3624069658  
-0.2627231964  
-0.1774183929  
-0.1078412157  
-0.05264832261  
-0.008334634057  
0.02998034132  
0.06763452985  
0.10952839  
0.1593609358  
0.2191109812  
0.28878529  
0.3664572484  
0.4485479114  
0.5302989816  
0.6063539075  
0.6713690762  
0.7205830102  
0.7502810565  
0.7581146541  
0.7432503875  
0.7063564101  
0.6494350092  
0.5755455623  
0.488455327  
0.3922807303  
0.2911509827  
0.1889453527  
0.08910610159  
-0.005449657359  
-0.09236217825  
-0.1698236806  
-0.236555269  
-0.291824168  
-0.3354796939  
-0.3680158707  
-0.3906276222  
-0.4052118138  
-0.4142931831  
-0.4208251903  
-0.4278962831  
-0.4383531432  
-0.4544211006  
-0.4773797637  
-0.5073841258  
-0.5434676372  
-0.5837448336  
-0.6257724157  
-0.6670103493  
-0.7052695722  
-0.7390565154  
-0.7677345667  
-0.7914564852  
-0.810885754  
-0.8267803929  
-0.839522203  
-0.8487348739  
-0.8530807619  
-0.8503251123  
-0.8376736642  
-0.8123492153  
-0.7722907913  
-0.7168486227  
-0.6473138647  
-0.5671559253  
-0.4818750382  
-0.3984698993  
-0.3245669575  
-0.2673359523  
-0.2323769469  
-0.2227470091  
-0.2383130879  
-0.2755358647  
-0.3277487397  
-0.3858962933  
-0.4396348048  
-0.47864232  
-0.4939513283  
-0.4791163701  
-0.4310705044  
-0.350542505  
-0.2420131633  
-0.1131977621  
0.02584262155  
0.1638577257  
0.2896804595  
0.3934684549  
0.4677654454  
0.508282748  
0.514314594  
0.4887589321  
0.4377583702  
0.3700002481  
0.2957665247  
0.2258265951  
0.1703053821  
0.1376287212  
0.133668084  
0.1611637073  
0.2194889164  
0.3047780206  
0.4103939953  
0.52768715  
0.6469478729  
0.7584483287  
0.8534399953  
0.925011289  
0.9686917458  
0.9827618237  
0.9682361418  
0.9285510084  
0.8690171738  
0.7961177073  
0.716754501  
0.637536009  
0.5641858139  
0.5011230754  
0.4512342688  
0.4158246786  
0.3947131014  
0.3864240473  
0.3884238612  
0.3973648152  
0.4093212724  
0.4200064715  
0.4250000587  
0.4199952918  
0.4010900755  
0.3651226676  
0.3100285781  
0.2351758663  
0.1416261919  
0.03225376011  
-0.08832464902  
-0.2140352777  
-0.3378332973  
-0.4523451473  
-0.5505821318  
-0.6266329825  
-0.67623994  
-0.6971673903  
-0.6893326276  
-0.6546910228  
-0.5968992266  
-0.5208389992  
-0.4320678677  
-0.3362967466  
-0.2389502678  
-0.1448649224  
-0.05812650914  
0.01795769106  
0.08080291605  
0.1284548285  
0.1595130452  
0.1731012693  
0.1689193272  
0.1473461582  
0.1095807236  
0.05775668354  
-0.005007480063  
-0.07468125119  
-0.1465373292  
-0.2155127878  
-0.2766825295  
-0.3257954441  
-0.359784256  
-0.3771840564  
-0.378369796  
-0.365572536  
-0.3426453925  
-0.3146010624  
-0.2869690175  
-0.2650460018  
-0.2531523315  
-0.2539817058  
-0.2681501998  
-0.2940107686  
-0.3277721836  
-0.3639178596  
-0.3958935452  
-0.4169685835  
-0.4211693365  
-0.4041686363  
-0.3639972871  
-0.3014770261  
-0.2203010128  
-0.1267356862  
-0.02895326638  
0.06391542245  
0.142913543  
0.200413161  
0.231152786  
0.2330020533  
0.2073400555  
0.1589994058  
0.0957520563  
0.02739826277  
-0.03542083544  
-0.08255413676  
-0.1056340663  
-0.09918429744  
-0.06137894373  
0.005620769625  
0.09582015527  
0.2000008229  
0.3067260706  
0.4036241802  
0.4787848812  
0.5221178395  
0.5264953914  
0.488561468  
0.4090938771  
0.2928972393  
0.148233383  
-0.01412754041  
-0.1821179663  
-0.3436819049  
-0.4880276054  
-0.6066530139  
-0.6940264997  
-0.7478588271  
-0.7689425058  
-0.7606134958  
-0.7279566777  
-0.676879535  
-0.6132240531  
-0.5420503844  
-0.4672044187  
-0.3911991948  
-0.3154107696  
-0.2404936495  
-0.1669210086  
-0.09549439349  
-0.0277076415  
0.03412728372  
0.08703886924  
0.1278153219  
0.153613245  
0.1626352604  
0.1547460383  
0.1318816675  
0.09815448378  
0.05959154433  
0.02350812875  
-0.002425919566  
-0.01129697744  
0.001898936197  
0.03926255752  
0.09929664598  
0.1766695393  
0.2625011256  
0.3451906995  
0.4117260631  
0.4493307867  
0.4472502687  
0.3984459565  
0.300941089  
0.1586104161  
-0.01874905216  
-0.2161335268  
-0.4147980488  
-0.5943112147  
-0.7349732251  
-0.8202663515  
-0.8390247799  
-0.7870103955  
-0.6676597874  
-0.4918848932  
-0.2769327536  
-0.04444012303  
0.1820687893  
0.379911395  
0.5298484495  
0.6182232093  
0.6383612973  
0.5910755482  
0.4842260311  
0.3314266687  
0.1500948816  
-0.04086793111  
-0.2234528506  
-0.3826513885  
-0.5080290363  
-0.5945841417  
-0.6428166786  
-0.6580445817  
-0.6491059216  
-0.6266757638  
-0.6014536274  
-0.5824954512  
-0.5759172295  
-0.584140947  
-0.6057527677  
-0.6359639831  
-0.6675594961  
-0.6921673735  
-0.7016311984  
-0.6892690491  
-0.6508316435  
-0.5850195872  
-0.4935047667  
-0.3804714745  
-0.2517785547  
-0.1138915605  
0.02722400187  
0.1670631537  
0.3032202057  
0.4356158471  
0.5662472203  
0.6985135928  
0.836222361  
0.9824381972  
1.138382519  
1.30258533  
1.470470818  
1.634501844  
1.784923267  
1.911062407  
2.003035642  
2.053632713  
2.060078442  
2.025374152  
1.958907042  
1.876109682  
1.797074127  
1.744156986  
1.73878806  
1.797864778  
1.930210875  
2.133671428  
2.393372434  
2.681575417  
2.959379277  
3.180243646  
3.295051814  
3.258149755  
3.033581613  
2.600664048  
1.958022234  
1.125411287  
0.1429112934  
-0.9325374801  
-2.032901856  
-3.086387651  
-4.025344044  
-4.79366084  
-5.352592053  
-5.684236165  
-5.792215969  
-5.699555552  
-5.444182034  
-5.072814984  
-4.634229353  
-4.172912598  
-3.724035595  
-3.310364843  
-2.941419099  
-2.614789007  
-2.319190987  
-2.038599478  
-1.756667881  
-1.460681282  
-1.144411897  
-0.8094942368  
-0.4652221963  
-0.1269222665  
0.1866985793  
0.4567079542  
0.6670403843  
0.8070234904  
0.872976776  
0.8686896404  
0.8048063268  
0.6972767831  
0.5651947458  
0.4283630226  
0.3049645571  
0.2096193467  
0.1520605425  
0.1365073828  
0.1617543128  
0.2218638686  
0.3073222244  
0.4064575425  
0.506933867  
0.5971531571  
0.6674229214  
0.7108094291  
0.7236362357  
0.70562909  
0.6597414543  
0.5917189568  
0.5094620344  
0.4222450149  
0.3398589769  
0.2717200711  
0.2259979635  
0.2088184734  
0.2236035261  
0.2706067799  
0.3467233637  
0.4456185908  
0.5582203377  
0.673562978  
0.7799322655  
0.8662077661  
0.9232538904  
0.9451851715  
0.9303012597  
0.8815569271  
0.8064226178  
0.7161284651  
0.6243237117  
0.5453080502  
0.4920544614  
0.4743033649  
0.4970053174  
0.559372242  
0.6547072893  
0.7710840761  
0.8928037679  
1.002455214  
1.083276241  
1.12148301  
1.108214729  
1.04079845  
0.9231559863  
0.7652804891  
0.5818785853  
0.390381864  
0.2086190994  
0.05250967582  
-0.06593419754  
-0.1399869777  
-0.168833253  
-0.1573638799  
-0.1152069892  
-0.05515937974  
0.00874829248  
0.06326502016  
0.09774008287  
0.1055051555  
0.08463061303  
0.03798251924  
-0.02742454958  
-0.1016610379  
-0.1735230111  
-0.2323253986  
-0.2696017082  
-0.280453459  
-0.2643599438  
-0.2253490616  
-0.1714961512  
-0.1138556319  
-0.06497357574  
-0.0372182572  
-0.0411507384  
-0.0841806194  
-0.1696636007  
-0.2965358689  
-0.4595057852  
-0.6497275828  
-0.8558130133  
-1.065034429  
-1.264535191  
-1.442397957  
-1.588490163  
-1.69502705  
-1.756859796  
-1.771537096  
-1.739194066  
-1.662329523  
-1.545509489  
-1.3950369  
-1.218568206  
-1.024700326  
-0.8224975747  
-0.6209828139  
-0.4286063457  
-0.2527259936  
-0.09915031697  
0.02820743155  
0.1275259153  
0.1990871996  
0.245099049  
0.2693518598  
0.2767166658  
0.272572598  
0.2621953647  
0.2501942126  
0.2400599126  
0.2338661899  
0.2321756157  
0.2341466884  
0.2378320794  
0.2406253396  
0.2397865729  
0.2329814099  
0.2187471671  
0.1968220114  
0.1682878573  
0.1354923753  
0.1017731716  
0.07100645764  
0.04704280084  
0.03312959442  
0.03139336707  
0.04248672628  
0.06546498945  
0.09792545889  
0.1364077586  
0.1769980687  
0.2160253705  
0.2507401803  
0.2798132671  
0.3035604551  
0.3238096909  
0.3434128765  
0.3654817473  
0.3924745771  
0.4253167411  
0.462741576  
0.5010160567  
0.5341293364  
0.5544743479  
0.5539240819  
0.5251496753  
0.4629611015  
0.3654480192  
0.2347140495  
0.07707017796  
-0.09736955314  
-0.2756414614  
-0.4433251273  
-0.5861735675  
-0.6917779404  
-0.7510405509  
-0.7592839186  
-0.7168541349  
-0.6291547482  
-0.5061109588  
-0.3611284933  
-0.2096571336  
-0.06752166373  
0.05080330201  
0.1337893725  
0.174134373  
0.1695743499  
0.1231295265  
0.04272060288  
-0.05979260619  
-0.1700751717  
-0.2730824107  
-0.3549292712  
-0.4046047834  
-0.4153172961  
-0.385292343  
-0.3179155662  
-0.2212251444  
-0.1068147246  
0.01168267859  
0.1203358899  
0.2066517102  
0.261095981  
0.2782285304  
0.2573298195  
0.2024686662  
0.1220262391  
0.02773311321  
-0.06665388311  
-0.1469075545  
-0.1999490956  
-0.2153776846  
-0.1867491521  
-0.1124685047  
0.003804379593  
0.1533085344  
0.3229125678  
0.4963675451  
0.6559817119  
0.7845605383  
0.8673752676  
0.893947418  
0.8594053808  
0.765221654  
0.6192187994  
0.4348051994  
0.2295270919  
0.02310814711  
-0.1647766814  
-0.3167118213  
-0.4194486282  
-0.4652791607  
-0.4527128956  
-0.3864027132  
-0.2763509032  
-0.1365320808  
0.01686111289  
0.1673227744  
0.2998445944  
0.4024172667  
0.4670827986  
0.490431656  
0.4735444033  
0.4214305277  
0.3420640089  
0.2451683129  
0.1409066036  
0.03864235697  
-0.05409125927  
-0.1323065524  
-0.1938818678  
-0.2394847145  
-0.272113209  
-0.2963479105  
-0.3174190509  
-0.3402387045  
-0.3685366276  
-0.4042335756  
-0.4471387819  
-0.4950205908  
-0.5440235337  
-0.5893517039  
-0.6261043708  
-0.6501058748  
-0.6585836943  
-0.6505928242  
-0.6271096032  
-0.5907981389  
-0.5455149356  
-0.4956409923  
-0.445386994  
-0.3981860793  
-0.3562716559  
-0.3205033886  
-0.2904332503  
-0.2645937249  
-0.2409057086  
-0.217135345  
-0.1913060936  
-0.1619969914  
-0.1284882812  
-0.09074564637  
-0.04926956357  
-0.004853074895  
0.04168535361  
0.08974070602  
0.1390688264  
0.1898100019  
0.2423816175  
0.2972416202  
0.3545784874  
0.4139617741  
0.4740543517  
0.5324177354  
0.5854918459  
0.6287669226  
0.6571506281  
0.6654925188  
0.6492047329  
0.6048939981  
0.5309035823  
0.4276979392  
0.2980217525  
0.1468174359  
-0.01908725578  
-0.1914627354  
-0.3612628121  
-0.5192401351  
-0.6565076643  
-0.7650124211  
-0.8379043062  
-0.8698070823  
-0.8570352917  
-0.7977827429  
-0.6923167423  
-0.5431885864  
-0.3554140683  
-0.1365927336  
0.1031198038  
0.3512555365  
0.5935426813  
0.814694958  
0.9994536786  
1.133798814  
1.206208159  
1.208818293  
1.138333522  
0.9965670046  
0.7905077058  
0.5318970932  
0.2363360288  
-0.0779960159  
-0.3918851341  
-0.6867194097  
-0.9460598901  
-1.156978764  
-1.311025638  
-1.40472683  
-1.439578204  
-1.421532618  
-1.36005808  
-1.266874307  
-1.154517203  
-1.034899994  
-0.9180357542  
-0.8110636316  
-0.7176817465  
-0.6380595943  
-0.5692071032  
-0.5057558131  
-0.441046021  
-0.3683575915  
-0.2821345311  
-0.179025962  
-0.05859818349  
0.07638305942  
0.2201477628  
0.364580292  
0.5002499938  
0.6176742038  
0.7086349006  
0.7673473325  
0.7912963686  
0.7816026548  
0.7428441584  
0.6823417735  
0.6089978275  
0.5318723666  
0.4587012994  
0.3946103254  
0.3412483478  
0.2965017525  
0.2548683435  
0.2084812976  
0.1486372  
0.06761079505  
-0.03953460932  
-0.1734633853  
-0.3296873673  
-0.4985020186  
-0.6658295536  
-0.8148923934  
-0.9285145304  
-0.991704602  
-0.9941090264  
-0.9319077661  
-0.8088231455  
-0.636004175  
-0.4307743272  
-0.2144010677  
-0.009221983309  
0.1644215256  
0.2909449662  
0.3615367984  
0.3751133042  
0.3380806175  
0.2629712439  
0.1662339386  
0.06556980472  
-0.02271264056  
-0.08587967186  
-0.1161553435  
-0.1111244962  
-0.07317636522  
-0.008172849736  
0.07634017988  
0.1729668366  
0.2759922774  
0.3822981935  
0.4915170224  
0.6054415702  
0.7268511543  
0.8580416805  
0.9993964596  
1.148327087  
1.298820573  
1.441716455  
1.565680229  
1.658704286  
1.709868634  
1.711043574  
1.658233996  
1.552336442  
1.399188836  
1.20891726  
0.9947178366  
0.7712785703  
0.5531124943  
0.3530505675  
0.1811008776  
0.04378963265  
-0.05599656327  
-0.1187257014  
-0.1476435924  
-0.148040823  
-0.1265290579  
-0.09043009333  
-0.04732010335  
-0.004718383288  
0.03013975176  
0.05053360584  
0.05055578979  
0.02551278695  
-0.02758549845  
-0.1095306903  
-0.2185125134  
-0.3499414027  
-0.4965836736  
-0.6490778012  
-0.796806645  
-0.9290503677  
-1.036262906  
-1.11129533  
-1.150368746  
-1.153617127  
-1.125107443  
-1.072302011  
-1.005035502  
-0.934145897  
-0.8699844984  
-0.8210311917  
-0.7928402274  
-0.7874759067  
-0.8035207601  
-0.8366235542  
-0.8804830951  
-0.9280684531  
-0.9728621501  
-1.009911875  
-1.036534186  
-1.052568775  
-1.060176818  
-1.063258047  
-1.066598991  
-1.07490572  
-1.09188198  
-1.119488191  
-1.157469322  
-1.203219843  
-1.251980828  
-1.297348754  
-1.332015714  
-1.348652642  
-1.340828281  
-1.303851017  
-1.235418444  
-1.136003258  
-1.00890079  
-0.859935771  
-0.6968317446  
-0.5283334227  
-0.3631580576  
-0.208928445  
-0.07120516264  
0.04723407779  
0.1467642954  
0.2308672659  
0.3056424638  
0.3789161231  
0.4590420153  
0.5535241602  
0.6676492331  
0.803304007  
0.9581729626  
1.125465438  
1.294271  
1.450578395  
1.57889652  
1.66431583  
1.694777488  
1.663242849  
1.569420786  
1.420747649  
1.232373059  
1.02603613  
0.8278792949  
0.6654161128  
0.5640211555  
0.5434203732  
0.6146909233  
0.7782289414  
1.023022418  
1.327381794  
1.661083955  
1.988655635  
2.273397432  
2.481614455  
2.586512451  
2.571267535  
2.430874377  
2.172556672  
1.814708674  
1.384512419  
0.9145587212  
0.4389167159  
-0.01084276673  
-0.4091449145  
-0.7389911278  
-0.9932906363  
-1.174799551  
-1.294703753  
-1.370085281  
-1.420664938  
-1.465328095  
-1.518959852  
-1.590079445  
-1.679625015  
-1.781059989  
-1.881753584  
-1.965392255  
-2.014989868  
-2.015999967  
-1.958996515  
-1.841484957  
-1.668563786  
-1.452335851  
-1.210218961  
