0.07771717388  
0.08700116974  
0.09528451088  
0.1024043736  
0.1084372952  
0.1137290439  
0.1188630971  
0.124574103  
0.131616507  
0.1406162661  
0.1519363926  
0.1655820972  
0.1811659001  
0.1979418633  
0.2149023274  
0.2309168876  
0.2448918034  
0.2559186652  
0.2633860181  
0.2670398534  
0.2669815238  
0.2636134163  
0.2575395015  
0.2494462739  
0.2399845927  
0.2296681837  
0.2188053465  
0.2074717588  
0.1955183853  
0.182614515  
0.1683095663  
0.1521080606  
0.1335432401  
0.1122434718  
0.08798753969  
0.06074553952  
0.03070674003  
-0.0017022337  
-0.03580956511  
-0.07070185844  
-0.1052375184  
-0.1380810722  
-0.1677573806  
-0.1927352124  
-0.2115388477  
-0.222885876  
-0.2258396852  
-0.2199609395  
-0.2054374235  
-0.1831652257  
-0.1547636949  
-0.1225045316  
-0.08915378398  
-0.05773129994  
-0.03121439618  
-0.01221578736  
-0.002680700377  
-0.003644354739  
-0.01509028629  
-0.03593225324  
-0.06413114648  
-0.09693130462  
-0.1311933766  
-0.1637711038  
-0.1918865719  
-0.21344544  
-0.2272523298  
-0.2330963344  
-0.2316960413  
-0.2245209793  
-0.2135148584  
-0.2007718906  
-0.1882116534  
-0.1773049695  
-0.168888736  
-0.1630912273  
-0.1593774397  
-0.1566964556  
-0.1537048427  
-0.1490291991  
-0.141520628  
-0.1304659148  
-0.115724072  
-0.09777024099  
-0.0776418805  
-0.05680115548  
-0.03693621371  
-0.01973086651  
-0.006636803137  
0.00131791456  
0.00365967062  
0.0005247539858  
-0.00736929883  
-0.01882461968  
-0.03232219858  
-0.04621710667  
-0.05893758859  
-0.06916623181  
-0.075978669  
-0.07892352279  
-0.07803843279  
-0.07380156102  
-0.06703299003  
-0.05875675381  
-0.05004880828  
-0.04188808389  
-0.03503282688  
-0.02993552854  
-0.02670596609  
-0.02512545203  
-0.02470608839  
-0.02478869313  
-0.02465739851  
-0.02366229332  
-0.02132498783  
-0.01741757834  
-0.01199935212  
-0.005408392981  
0.001791143994  
0.008900425783  
0.01520135894  
0.02008054557  
0.02314039174  
0.02428215166  
0.02374398721  
0.02208510516  
0.02011671234  
0.01878341025  
0.01901329747  
0.02155684927  
0.02684048196  
0.03485969946  
0.04513262628  
0.05672865573  
0.06837198767  
0.07860967855  
0.08602464297  
0.08945772329  
0.08820670383  
0.0821657714  
0.07187792792  
0.05848942388  
0.04360208904  
0.02904838805  
0.01661846466  
0.007784071296  
0.00346232307  
0.003861112095  
0.008433546682  
0.01594972852  
0.02467640425  
0.03263872841  
0.03791820975  
0.03894233593  
0.03471943395  
0.02497868069  
0.01019864876  
-0.008480322581  
-0.02944318021  
-0.05085114277  
-0.07091881629  
-0.0881668552  
-0.1016160433  
-0.1108892323  
-0.1162124474  
-0.1183166093  
-0.1182656875  
-0.1172399081  
-0.1163167485  
-0.1162852617  
-0.1175277112  
-0.119981021  
-0.1231838845  
-0.1263956172  
-0.1287585315  
-0.1294727068  
-0.127951095  
-0.1239224938  
-0.1174719115  
-0.1090086075  
-0.09917781581  
-0.08873385696  
-0.07840504366  
-0.06877717026  
-0.06021821439  
-0.05285907682  
-0.04662940259  
-0.0413353345  
-0.03676228369  
-0.03277188192  
-0.02937133318  
-0.02673493289  
-0.02516850779  
-0.02502322043  
-0.02657274537  
-0.02988290522  
-0.03470237717  
-0.04040443927  
-0.0460040328  
-0.0502515115  
-0.05180540764  
-0.04945072014  
-0.04233339031  
-0.03016615883  
-0.01336354957  
0.006924464265  
0.02889847877  
0.05030988116  
0.06875000973  
0.08199028342  
0.08831624942  
0.08680459973  
0.07749699343  
0.06143483639  
0.040553307  
0.01744024072  
-0.005001641078  
-0.02394116777  
-0.03699842489  
-0.04256324237  
-0.04000822956  
-0.02976837498  
-0.01328185197  
0.007200004411  
0.0288993822  
0.04886060258  
0.06430764555  
0.07297269528  
0.07335274375  
0.06486893566  
0.04791716654  
0.02380676844  
-0.005394133055  
-0.03709092289  
-0.06843742069  
-0.09662555544  
-0.1191611714  
-0.1340961912  
-0.1402018009  
-0.1370691559  
-0.1251293354  
-0.1055989548  
-0.08035504885  
-0.0517533039  
-0.02240421254  
0.005072594656  
0.02829660632  
0.04535504123  
0.0549925823  
0.05674081853  
0.05097530943  
0.03888896571  
0.02237953244  
0.003859538264  
-0.01399968566  
-0.02856284216  
-0.03753705457  
-0.03925538772  
-0.03290510003  
-0.01866994689  
0.0022323263  
0.02762863025  
0.05458100724  
0.07967441222  
0.09937098486  
0.1103994871  
0.1101301983  
0.09690404653  
0.07026729382  
0.03109427502  
-0.01842605358  
-0.07493946064  
-0.1342000753  
-0.1914454391  
-0.241838325  
-0.280931957  
-0.305115836  
-0.3119964651  
-0.30067244  
-0.2718771087  
-0.2279664359  
-0.1727459592  
-0.1111506219  
-0.04879694401  
0.00855007497  
0.05554810147  
0.08782568481  
0.1024517857  
0.09826436785  
0.07601772482  
0.0383153169  
-0.01067394754  
-0.06569737786  
-0.1210485382  
-0.1712758142  
-0.2118776962  
-0.239893241  
-0.2542984505  
-0.2561383307  
-0.2483608594  
-0.2353566735  
-0.222253031  
-0.2140565666  
-0.2147616599  
-0.2265680683  
-0.2493365982  
-0.2803899282  
-0.3147150416  
-0.3455681222  
-0.365411118  
-0.3670530578  
-0.3448262297  
-0.2956058189  
-0.2195015796  
-0.1200883236  
-0.004114884623  
0.1192834102  
0.239759559  
0.3471412077  
0.4328082657  
0.4908390052  
0.5187444165  
0.5176709589  
0.4920480341  
0.4487525166  
0.3959365218  
0.3417239876  
0.2929934107  
0.2544408072  
0.2280620175  
0.213113604  
0.2065290453  
0.2036883009  
0.1993880707  
0.1888346053  
0.1684871673  
0.1366256028  
0.09356023553  
0.04148425457  
-0.01598667552  
-0.07447635448  
-0.1295881033  
-0.1775876836  
-0.2159190848  
-0.2434765769  
-0.2606078357  
-0.2688679257  
-0.2705836551  
-0.2683207692  
-0.2643496249  
-0.2602043446  
-0.256408719  
-0.2524052305  
-0.2466990007  
-0.2371769469  
-0.2215532665  
-0.1978577243  
-0.1648848072  
-0.1225353796  
-0.07198554107  
-0.01566244417  
0.04297963916  
0.09984314569  
0.1506828322  
0.1916367015  
0.2197142851  
0.2331746217  
0.2317390072  
0.2166104898  
0.1902974855  
0.156274426  
0.1185258708  
0.08104045344  
0.04733128388  
0.02003827957  
0.0006692138063  
-0.01049578019  
-0.01433167909  
-0.01265107756  
-0.007880339818  
-0.002680397363  
0.000426777149  
-0.0006184855074  
-0.007185398149  
-0.01983764006  
-0.03833523293  
-0.06174234179  
-0.0886076818  
-0.1171879305  
-0.1456732276  
-0.1723846678  
-0.1959242685  
-0.215257907  
-0.2297423974  
-0.2390972645  
-0.243346132  
-0.2427386565  
-0.2376781697  
-0.2286607182  
-0.2162352414  
-0.2009824826  
-0.1835073491  
-0.1644347973  
-0.1444038395  
-0.1240473102  
-0.1039642851  
-0.08468032087  
-0.06660985895  
-0.05002682962  
-0.03505324332  
-0.02167449132  
-0.009779120886  
0.0007796408306  
0.0101134818  
0.01823177562  
0.02499717273  
0.03011334042  
0.03315357542  
0.03362799956  
0.03108090146  
0.02519985054  
0.01591536591  
0.003470261426  
-0.01155796813  
-0.02829008699  
-0.04563079731  
-0.06239428849  
-0.07745102176  
-0.08986461039  
-0.09900475886  
-0.1046060083  
-0.1067702935  
-0.1059108169  
-0.1026493764  
-0.09768693457  
-0.09167112776  
-0.08508438351  
-0.07817521486  
-0.0709380792  
-0.06315011745  
-0.05445299283  
-0.04446297087  
-0.03289189562  
-0.01965101408  
-0.00492437143  
0.01080734967  
0.02679427559  
0.04209454018  
0.05568815103  
0.06661120658  
0.0740902336  
0.0776546754  
0.07721432372  
0.07308612396  
0.06597282328  
0.05689158746  
0.04706875276  
0.03780867894  
0.03035942221  
0.02578871584  
0.02487894225  
0.02805775337  
0.03535963632  
0.04642256417  
0.06051510921  
0.07658721981  
0.09334165825  
0.109318351  
0.122990285  
0.1328675518  
0.1376070802  
0.1361246745  
0.1277016263  
0.1120805796  
0.08953838041  
0.0609229979  
0.02764715766  
-0.008372376933  
-0.04483218447  
-0.07920754092  
-0.1089604429  
-0.1317670621  
-0.1457406508  
-0.149628158  
-0.1429533301  
-0.1260891881  
-0.1002474395  
-0.06738495408  
-0.03003423604  
0.008922577364  
0.04651451229  
0.07994613621  
0.1068416572  
0.1254399776  
0.1347256872  
0.1344835592  
0.1252735636  
0.1083342006  
0.08542570686  
0.05862958679  
0.03012775352  
0.001979798466  
-0.02407705078  
-0.04678614038  
-0.06547370998  
-0.08008193176  
-0.09112828708  
-0.09959627579  
-0.1067657066  
-0.1140056915  
-0.1225529313  
-0.1333073117  
-0.1466718728  
-0.1624639227  
-0.1799112617  
-0.1977385561  
-0.214336895  
-0.227988526  
-0.2371230068  
-0.2405612511  
-0.2377088825  
-0.2286729604  
-0.2142759123  
-0.1959622988  
-0.1756111381  
-0.1552797476  
-0.136917765  
-0.1220980493  
-0.1118036864  
-0.1063111529  
-0.1051840575  
-0.1073823325  
-0.1114675767  
-0.1158667452  
-0.1191548995  
-0.1203020593  
-0.1188472456  
-0.114964028  
-0.1094110416  
-0.1033719683  
-0.09821415466  
-0.09520948044  
-0.09526181952  
-0.09869704279  
-0.1051471745  
-0.1135573662  
-0.1223164551  
-0.1294939463  
-0.1331472123  
-0.1316518858  
-0.1240002231  
-0.1100195155  
-0.09047545293  
-0.06703831475  
-0.04211437625  
-0.01856782662  
0.0006325031511  
0.01279454219  
0.01585651957  
0.008674882221  
-0.008793287698  
-0.03543093566  
-0.06902985653  
-0.1064775415  
-0.1440414441  
-0.177721411  
-0.2036336758  
-0.218394881  
-0.2194662992  
-0.2054301593  
-0.1761674864  
-0.1329174336  
-0.07820752485  
-0.01565066923  
0.05037323954  
0.1151289081  
0.1739866577  
0.2228869374  
0.2587514747  
0.2797937938  
0.2856853312  
0.2775602497  
0.2578499939  
0.2299752422  
0.1979321592  
0.165828205  
0.1374284754  
0.1157668657  
0.1028701804  
0.09962014638  
0.1057601984  
0.1200356698  
0.1404328259  
0.1644793742  
0.1895567073  
0.2131852416  
0.2332479821  
0.2481338771  
0.256796852  
0.2587426114  
0.2539624864  
0.2428389828  
0.226052112  
0.204501594  
0.1792549688  
0.1515216276  
0.1226396245  
0.09406061331  
0.06731635075  
0.04395400723  
0.02543876917  
0.01303125722  
0.007654488003  
0.009776397175  
0.01933066108  
0.03569164786  
0.05771679553  
0.08384846751  
0.1122619  
0.1410337119  
0.1683011254  
0.1923882582  
0.2118816915  
0.2256512482  
0.2328294  
0.2327642189  
0.2249787758  
0.2091580742  
0.1851798157  
0.153188939  
0.1137032574  
0.06771720877  
0.01676964364  
-0.03706412484  
-0.0912798389  
-0.143162923  
-0.1901004246  
-0.229952329  
-0.261417823  
-0.2843352154  
-0.2998395744  
-0.3103311429  
-0.3192210331  
-0.3304643814  
-0.3479304652  
-0.3746879568  
-0.4123254409  
-0.4604262852  
-0.5163183904  
-0.5751849054  
-0.6305743669  
-0.6752832911  
-0.7025211702  
-0.7071943243  
-0.6871110058  
-0.6438850903  
-0.5833369041  
-0.5152388854  
-0.4523509276  
-0.408786858  
-0.3978811826  
-0.4298282132  
-0.5094412128  
-0.6344121498  
-0.7944238496  
-0.9713718605  
-1.140819666  
-1.274619296  
-1.34444321  
-1.325795504  
-1.201947696  
-0.9671979103  
-0.6288964355  
-0.2078182777  
0.2633101961  
0.743063034  
1.185993439  
1.548145466  
1.792654971  
1.894629163  
1.844586654  
1.649920975  
1.334134872  
0.9339272827  
0.4945288881  
0.06395546766  
-0.3129963371  
-0.6001436622  
-0.773943941  
-0.8256130003  
-0.7610997948  
-0.5990270417  
-0.367013092  
-0.09703956119  
0.1793557041  
0.4352901164  
0.6515208878  
0.8178201714  
0.9326449536  
1.001316893  
1.033170926  
1.038291298  
1.024501574  
0.9951962684  
0.948422757  
0.8773784717  
0.7722150052  
0.622787834  
0.421812183  
0.1677947281  
-0.1328621339  
-0.4650567948  
-0.805730744  
-1.126145899  
-1.395397442  
-1.584643524  
-1.671381074  
-1.643064823  
-1.499451306  
-1.253248413  
-0.9289111547  
-0.5597337334  
-0.1836482596  
0.1616462928  
0.443506045  
0.6384077775  
0.7346856187  
0.7335652474  
0.6483938264  
0.5022269144  
0.3241625895  
0.1449940574  
-0.007183110542  
-0.110775116  
-0.1533822283  
-0.1330346915  
-0.05785029399  
0.05577384942  
0.1861047954  
0.3096657931  
0.404902026  
0.45535868  
0.4519018976  
0.3936858689  
0.2877792585  
0.1475906586  
-0.009578518101  
-0.1653951125  
-0.3032671606  
-0.4105716085  
-0.4800095385  
-0.5099366844  
-0.5037140688  
-0.4682954796  
-0.412388835  
-0.3445713214  
-0.2717111004  
-0.1979532998  
-0.1243927729  
-0.04942260778  
0.03038106062  
0.1190545455  
0.2199654459  
0.3346894087  
0.4622182857  
0.5986024046  
0.7370555668  
0.8684887901  
0.9823872775  
1.067926525  
1.115212283  
1.11652225  
1.067445051  
0.9678014057  
0.8222453447  
0.6404391543  
0.4367172818  
0.229177175  
0.03818669979  
-0.1156333534  
-0.2138050347  
-0.242535494  
-0.1950897403  
-0.07363560405  
0.1097966132  
0.3335387371  
0.5678578196  
0.7778673711  
0.9275493862  
0.984441053  
0.9243714321  
0.7355320753  
0.4211810981  
0.0004209119693  
-0.4932627291  
-1.015666783  
-1.517342153  
-1.950133494  
-2.27381657  
-2.461784195  
-2.504838316  
-2.412426764  
-2.211080069  
-1.94027557  
-1.646393527  
-1.375760801  
-1.167910358  
-1.050130328  
-1.034117369  
-1.115165058  
-1.273869256  
-1.479915675  
-1.697199503  
-1.889358582  
-2.024816177  
-2.080585613  
-2.044376151  
-1.914871615  
-1.700379957  
-1.416312934  
-1.082098241  
-0.7181481025  
-0.3434007029  
0.02624023726  
0.3784850467  
0.7043922772  
0.9975792359  
1.253292329  
1.467709187  
1.63772236  
1.761280997  
1.838175497  
1.870990617  
1.86586933  
1.832739452  
1.784755542  
1.736888973  
1.703804958  
1.697359026  
1.724174691  
1.783805292  
1.867914303  
1.960746729  
2.040933691  
2.084422546  
2.068105145  
1.973565574  
1.790326141  
1.518040812  
1.16725207  
0.758577756  
0.3204438415  
-0.1142732126  
-0.5121721279  
-0.8432293331  
-1.084126945  
-1.220579209  
-1.248423314  
-1.173449369  
-1.010123158  
-0.7794932896  
-0.5066344974  
-0.2179716149  
0.06122458176  
0.3089616447  
0.5081441035  
0.6476300206  
0.7227154868  
0.7350618458  
0.6920978406  
0.6059453334  
0.4919397209  
0.3668524744  
0.2469610689  
0.1461512337  
0.07425969417  
0.03586590736  
0.02971237821  
0.04886195472  
0.08162518892  
0.113160509  
0.1275702865  
0.1102051689  
0.04985526757  
-0.05950498979  
-0.2176958017  
-0.418208884  
-0.6490294935  
-0.8942829547  
-1.136463782  
-1.358883713  
-1.547942189  
-1.694833951  
-1.796407369  
-1.855033937  
-1.877525302  
-1.873324005  
-1.852332621  
-1.822823643  
-1.789873733  
-1.754655027  
-1.714754577  
-1.665465574  
-1.601781887  
-1.52064936  
-1.422934233  
-1.314588109  
-1.206613346  
-1.113659271  
-1.051349046  
-1.032730447  
-1.06446243  
-1.143493728  
-1.254981743  
-1.372056088  
-1.457755701  
-1.469105172  
-1.362900536  
-1.102426213  
-0.6640809362  
-0.04281439703  
0.7446170024  
1.659276904  
2.64282944  
3.623251938  
4.522771807  
5.2669428  
5.793564711  
6.060143503  
6.04880747  
5.767974874  
5.250574686  
4.549148491  
3.728628505  
2.857911735  
2.001494019  
1.212352164  
0.5270101819  
-0.03666767368  
-0.4788694941  
-0.8147585999  
-1.069626732  
-1.273171785  
-1.453854426  
-1.634162572  
-1.827394785  
-2.036273727  
-2.253392517  
-2.463235814  
-2.645324925  
-2.777938265  
-2.841853618  
-2.823623243  
-2.718003234  
-2.52929258  
-2.27147795  
-1.967190908  
-1.645592554  
-1.339384106  
-1.081208193  
-0.8997651256  
-0.8160212554  
-0.839906802  
-0.9679142235  
-1.181968343  
-1.449861786  
-1.727412074  
-1.962315453  
-2.099456232  
-2.087209556  
-1.884070538  
-1.464816849  
-0.825358954  
0.01448113304  
1.010829006  
2.098510266  
3.196573059  
4.216062446  
5.069176667  
5.678699627  
5.986511568  
5.960075661  
5.596055569  
4.920603384  
3.986308528  
2.866236229  
1.645865145  
0.4139570241  
