1.053229875  
1.593382972  
2.077360454  
2.464541349  
2.725632092  
2.846152986  
2.827956731  
2.688574227  
2.458512192  
2.1769027  
1.886159548  
1.626392071  
1.430359248  
1.319610735  
1.302292559  
1.372822457  
1.513376785  
1.696894657  
1.891116615  
2.063075774  
2.183420837  
2.230041154  
2.190555337  
2.063421286  
1.857602568  
1.590919412  
1.287363489  
0.973785473  
0.6764124015  
0.4176566681  
0.21362185  
0.07258954072  
-0.005356963873  
-0.02760184817  
-0.007310719005  
0.03889872068  
0.0935726127  
0.1409063489  
0.1687545634  
0.1698890311  
0.1423602907  
0.08897505264  
0.01603794483  
-0.06838434431  
-0.1563267763  
-0.2415963968  
-0.3209326635  
-0.394470623  
-0.4654338588  
-0.5391327517  
-0.6214633438  
-0.7172056242  
-0.8284458969  
-0.9534367339  
-1.086138571  
-1.216556119  
-1.331868255  
-1.418191429  
-1.46271065  
-1.455855037  
-1.393156036  
-1.276486689  
-1.114461489  
-0.9218944746  
-0.718372266  
-0.5261070248  
-0.3673496228  
-0.2617068642  
-0.2237162101  
-0.2609911452  
-0.3731697743  
-0.5518055825  
-0.7811911632  
-1.040010529  
-1.303611264  
-1.546616756  
-1.745565295  
-1.881290994  
-1.940772468  
-1.918276721  
-1.815703047  
-1.642113388  
-1.412551424  
-1.146304967  
-0.8648322591  
-0.5895871361  
-0.3399802549  
-0.1316812656  
0.02458780808  
0.1236747526  
0.1660272501  
0.1571689656  
0.1067359989  
0.0272045635  
-0.06752873134  
-0.1635501545  
-0.2482002044  
-0.3110831504  
-0.344775969  
-0.3451880049  
-0.3115988406  
-0.2464098323  
-0.1546603337  
-0.04340404084  
0.07900923773  
0.2036525995  
0.3217013617  
0.4250296538  
0.5066901323  
0.5612835909  
0.5852068278  
0.5768051704  
0.5364336  
0.4664402208  
0.3710791774  
0.2563551932  
0.1297824054  
5.238681468e-05  
-0.1233945494  
-0.2309016377  
-0.313214582  
-0.3621627115  
-0.3713516929  
-0.3368154143  
-0.2575387747  
-0.1358040285  
0.02273097617  
0.2092448035  
0.4122930769  
0.6186429503  
0.8143494375  
0.9859737722  
1.121824763  
1.213071791  
1.254586964  
1.24540673  
1.188729212  
1.091434776  
0.9631802987  
0.8151851184  
0.6588739173  
0.5045813518  
0.3604906025  
0.2319822545  
0.1214646186  
0.02870096766  
-0.04844548164  
-0.113000678  
-0.1677934037  
-0.214510617  
-0.2530661385  
-0.2814121472  
-0.2958308769  
-0.291653821  
-0.2642929685  
-0.210375875  
-0.1287957899  
-0.02145678104  
0.1064153108  
0.2464858919  
0.3880299787  
0.519057069  
0.6276825467  
0.7035337613  
0.7390070227  
0.7301727799  
0.6772406869  
0.5845129679  
0.4598719051  
0.3138832087  
0.1586460732  
0.006548763891  
-0.1309303438  
-0.2442477551  
-0.3265569491  
-0.3741644009  
-0.3866648023  
-0.3667855667  
-0.3199725658  
-0.2537850446  
-0.1771583612  
-0.09958427388  
-0.03028870416  
0.02255599553  
0.0525236251  
0.05547876388  
0.02993140067  
-0.02283272616  
-0.09887117337  
-0.1919454551  
-0.2941102004  
-0.396472365  
-0.4900599217  
-0.5667123774  
-0.6199014543  
-0.6453996923  
-0.6417219356  
-0.6102841167  
-0.5552621436  
-0.4831524846  
-0.4020726323  
-0.3208801826  
-0.2481898404  
-0.191404836  
-0.1558794092  
-0.1442974098  
-0.1563655558  
-0.1888541951  
-0.2359921644  
-0.2901717552  
-0.3428818636  
-0.3857433973  
-0.4115249171  
-0.4149860452  
-0.3934519274  
-0.3470317441  
-0.2784566301  
-0.1925745716  
-0.09558121761  
0.005885925104  
0.1056436949  
0.1986987272  
0.2817157162  
0.3531326028  
0.4129404895  
0.4621625998  
0.5021751429  
0.5340085833  
0.5577918955  
0.5724738359  
0.5758973383  
0.565220435  
0.5376163912  
0.4910935536  
0.4252708232  
0.3419096971  
0.2450771113  
0.1408530474  
0.03661804697  
-0.0599786678  
-0.1421930677  
-0.2052756675  
-0.2472802664  
-0.2694279039  
-0.2759476567  
-0.2734163117  
-0.2697015647  
-0.2726959779  
-0.2890481374  
-0.3231039967  
-0.376224011  
-0.4465668639  
-0.5293542391  
-0.6175586716  
-0.7028860315  
-0.7768896104  
-0.8320692054  
-0.8627957609  
-0.8659655046  
-0.8413183075  
-0.7914190352  
-0.7213170643  
-0.6379534322  
-0.54938843  
-0.4639341484  
-0.389280915  
-0.3316910764  
-0.2953336922  
-0.2818197736  
-0.2899826225  
-0.3159301633  
-0.353376602  
-0.3942493688  
-0.4295007295  
-0.4500914394  
-0.4480134474  
-0.4172738281  
-0.3546966163  
-0.2604520455  
-0.1382196878  
0.005057282765  
0.1598254297  
0.3149132198  
0.4587645182  
0.5807564319  
0.6724262239  
0.7284615431  
0.7472940977  
0.7312292252  
0.6860804769  
0.6203618023  
0.544146178  
0.4677420497  
0.4003884824  
0.3491332669  
0.3180556365  
0.3079463316  
0.3164648598  
0.3387533926  
0.368394543  
0.3985548995  
0.4231287828  
0.437694459  
0.4401388022  
0.4308442313  
0.4124373571  
0.3891538407  
0.3659589723  
0.3475880762  
0.33768906  
0.3382225813  
0.3491938947  
0.3687523063  
0.3935800661  
0.419467083  
0.4419245045  
0.4567030287  
0.4601320256  
0.4492416611  
0.4217177318  
0.3757779162  
0.3100863006  
0.2238199481  
0.1169384179  
-0.009343892194  
-0.1519804166  
-0.3055576056  
-0.4619991557  
-0.6106862518  
-0.73911274  
-0.8340961268  
-0.883448321  
-0.8778749767  
-0.8127993351  
-0.6897671183  
-0.5171052023  
-0.3096396888  
-0.08739401675  
0.1266051982  
0.3091278243  
0.4397458577  
0.5035654842  
0.493265846  
0.4101163103  
0.2638181097  
0.0712105554  
-0.145940073  
-0.3637175274  
-0.558972067  
-0.7119729549  
-0.8084629617  
-0.8408953425  
-0.8087902617  
-0.7182571693  
-0.5808479552  
-0.4119387621  
-0.2288805759  
-0.04911353789  
0.1115673407  
0.2404680311  
0.3290763449  
0.3736909259  
0.3755729489  
0.3405871684  
0.2783748262  
0.2011155652  
0.1219950292  
0.05354720909  
0.006061395235  
-0.01373579484  
-0.003535222727  
0.03429579638  
0.09311603938  
0.1630379809  
0.2324559266  
0.2898715829  
0.3257470658  
0.3341117726  
0.3136633277  
0.2681690475  
0.2060680201  
0.1392854555  
0.08139932349  
0.04538750832  
0.04127196956  
0.0740123148  
0.1419806109  
0.236292342  
0.3411740331  
0.4354016616  
0.494704485  
0.4948852016  
0.4152915031  
0.2421858444  
-0.02844288106  
-0.3890661507  
-0.8201238097  
-1.291034867  
-1.76271609  
-2.19139118  
-2.533311698  
-2.749848153  
-2.812326296  
-2.705977734  
-2.432460313  
-2.010548014  
-1.474830186  
-0.8724991227  
-0.2585618298  
0.3099839589  
0.7803225472  
1.10961025  
1.269682854  
1.250129402  
1.059368525  
0.7236169014  
0.2838946961  
-0.2085630852  
-0.6979210543  
-1.12973486  
-1.456624234  
-1.643005251  
-1.668392609  
-1.528962694  
-1.237299074  
-0.8204109867  
-0.3163580783  
0.2301009266  
0.772307993  
1.26641417  
1.675521654  
1.972844609  
2.143645822  
2.185823858  
2.109192097  
1.933612931  
1.68627032  
1.398411466  
1.101934173  
0.826168225  
0.5951665756  
0.4257311715  
0.3263259381  
0.2969078871  
0.3296422569  
0.4103411285  
0.5204462193  
0.6393116722  
0.7465370943  
0.8241178374  
0.8582129196  
0.8403857095  
0.7682203443  
0.6452994656  
0.4805753516  
0.2872288964  
0.08114778181  
-0.1207974152  
-0.3025182673  
-0.4503247016  
-0.554233106  
-0.6088529827  
-0.6137677758  
-0.5733913185  
-0.4963239646  
-0.3943099508  
-0.2809069549  
-0.1700269516  
-0.07451543981  
-0.004903342252  
0.03153911321  
0.03136765265  
-0.004874069498  
-0.07288347159  
-0.1651766322  
-0.2719203846  
-0.3819359325  
-0.4837756781  
-0.5667861418  
-0.6220749536  
-0.6433088106  
-0.6272906465  
-0.5742552389  
-0.4878582122  
-0.3748368054  
-0.2443477394  
-0.1070419657  
0.02606492172  
0.1447937364  
0.2409395314  
0.3091970662  
0.3477402717  
0.3583517483  
0.3460677662  
0.3183689751  
0.2840109019  
0.2516724553  
0.2286032253  
0.2194918933  
0.2257270772  
0.2451736004  
0.2725034547  
0.3000365087  
0.3189590646  
0.3207358062  
0.2984905109  
0.2481532764  
0.1692038214  
0.06489332839  
-0.05805370034  
-0.1902294032  
-0.3206867151  
-0.4382854087  
-0.5330510395  
-0.5973754602  
-0.6269171651  
-0.6210912542  
-0.5831098395  
-0.5195737485  
-0.4396693607  
-0.3540791247  
-0.2737320952  
-0.2085446376  
-0.1663155145  
-0.1518980466  
-0.1667631278  
-0.2090031428  
-0.2737669071  
-0.3540626956  
-0.4418020472  
-0.5289252426  
-0.6084452096  
-0.6752419353  
-0.7265038811  
-0.7617608395  
-0.7825260545  
-0.7916315692  
-0.7923994748  
-0.7878014496  
-0.7797813299  
-0.7688618436  
-0.7541121429  
-0.7334882664  
-0.7044783793  
-0.6649207928  
-0.6138469409  
-0.5521525237  
-0.482955193  
-0.4115276295  
-0.3447700611  
-0.2902814939  
-0.2551477796  
-0.2446474456  
-0.2610975983  
-0.3030558384  
-0.3650566871  
-0.4379762359  
-0.5100155073  
-0.568202626  
-0.6001943213  
-0.5961226046  
-0.550179049  
-0.4616859525  
-0.3354464239  
-0.1812840284  
-0.01280200765  
0.1544735212  
0.3053144257  
0.4270315876  
0.5113991904  
0.5559371667  
0.5643390525  
0.5459412266  
0.5142888547  
0.485006137  
0.4732783858  
0.4913494999  
0.5464311802  
0.6393676652  
0.7642935266  
0.909348031  
1.05836078  
1.193244857  
1.296727281  
1.35498704  
1.359789978  
1.309779135  
1.210735596  
1.074766449  
0.918567407  
0.7610225981  
0.62052136  
0.5123862866  
0.4467884131  
0.4274345455  
0.4512123187  
0.5088053528  
0.586188429  
0.666770241  
0.73387653  
0.7732141213  
0.7749666671  
0.7352202495  
0.6565102032  
0.5473978384  
0.4211390461  
0.2936355358  
0.1809700415  
0.09690798115  
0.05075027564  
0.0458809116  
0.07923842959  
0.1418060591  
0.2200326909  
0.2979572667  
0.3596944219  
0.3918706538  
0.385624755  
0.3378574997  
0.2515466492  
0.1350935264  
0.0008443017167  
-0.1369563927  
-0.2644236631  
-0.3701226613  
-0.4466566905  
-0.4915069174  
-0.5070155769  
-0.4995584088  
-0.4780779393  
-0.4522768532  
-0.430798606  
-0.4197310012  
-0.4216978264  
-0.4356844471  
-0.4575971025  
-0.4814388433  
-0.5008307035  
-0.5105811682  
-0.5079627322  
-0.4934415912  
-0.4706965135  
-0.4459111241  
-0.4264671632  
-0.4193025547  
-0.4292469106  
-0.4576920449  
-0.5018854912  
-0.555021791  
-0.6071733848  
-0.6469347887  
-0.663517436  
-0.6489278466  
-0.5998444303  
-0.518825613  
-0.4145902711  
-0.3012564806  
-0.1966004343  
-0.1195527351  
-0.08730166877  
-0.1124352361  
-0.2005797643  
-0.3489197487  
-0.5458768552  
-0.7720384807  
-1.002255536  
-1.208646559  
-1.364109355  
-1.445848698  
-1.438444887  
-1.336017445  
-1.143191855  
-0.8747307574  
-0.5538811342  
-0.209658909  
0.1265546702  
0.4246581672  
0.6592430375  
0.8123412455  
0.875177913  
0.8487457586  
0.7431763392  
0.576036307  
0.3698225811  
0.1490112757  
-0.06294139405  
-0.2462657841  
-0.3869013964  
-0.4776713441  
-0.5185154336  
-0.5158396858  
-0.481129553  
-0.429058979  
-0.3753704086  
-0.3348054935  
-0.3193225272  
-0.3367836075  
-0.3902232754  
-0.4777270294  
-0.5928881141  
-0.7257411864  
-0.8640405381  
-0.9947266449  
-1.105401766  
-1.185669603  
-1.228182309  
-1.229302179  
-1.18929673  
-1.112075009  
-1.004488405  
-0.8753001079  
-0.7339635082  
-0.5893667151  
-0.4487313615  
-0.3168007891  
-0.1954545672  
-0.08378071186  
0.02140318069  
0.1246755064  
0.2309250576  
0.3442450235  
0.4669891356  
0.5991518129  
0.7381833438  
0.8792682229  
1.016034304  
1.141562261  
1.249552222  
1.335419972  
1.397169782  
1.435867612  
1.455628742  
1.463105678  
1.466510554  
1.474327975  
1.493867748  
1.529889102  
1.583498274  
1.651512246  
1.726433167  
1.797078833  
1.849856487  
1.870548867  
1.846399867  
1.768228392  
1.632258976  
1.441364817  
1.205490233  
0.9410984583  
0.6696282564  
0.4150939166  
0.2010794403  
0.04752192884  
-0.03229136796  
-0.03404790559  
0.03631624966  
0.1626686773  
0.3201435171  
0.4779079927  
0.6029338566  
0.6642897502  
0.637396116  
0.5076285601  
0.2727450071  
-0.05624629606  
-0.455942197  
-0.8930391765  
-1.328137065  
-1.720330947  
-2.031944234  
-2.232751326  
-2.303133302  
-2.235770053  
-2.035740896  
-1.719127848  
-1.310466538  
-0.8395181309  
-0.3379202321  
0.1637999583  
0.6384619933  
1.063556647  
1.421680347  
1.70027738  
1.891027468  
1.989214384  
1.993362571  
1.905283205  
1.730507752  
1.478908681  
1.165182383  
0.8088595538  
0.4335381614  
0.06522610335  
-0.2701614324  
-0.5498150896  
-0.7571037223  
-0.8841155788  
-0.9331212057  
-0.916555331  
-0.8553553416  
-0.7757952508  
-0.7052606581  
-0.6676272743  
-0.6790419483  
-0.7448621427  
-0.8583580336  
-1.001486326  
-1.147699974  
-1.2663914  
-1.328270354  
-1.310797026  
-1.20274847  
-1.007112444  
-0.7417728723  
-0.4377873338  
-0.1354664542  
0.1212033888  
0.2909424238  
0.3414223524  
0.2543913715  
0.02891107448  
-0.3178143208  
-0.7521601003  
-1.228120391  
-1.693100126  
-2.09464772  
-2.387182121  
-2.537802916  
-2.530396336  
-2.367518898  
-2.069841641  
-1.673277242  
-1.224224195  
-0.7735889375  
-0.370394909  
-0.05581610859  
0.141608894  
0.2089955376  
0.1500452272  
-0.01617755199  
-0.258378703  
-0.5376013415  
-0.8125773385  
-1.045127262  
-1.2048745  
-1.272690912  
-1.242455125  
-1.120978441  
-0.9262022166  
-0.6840187702  
-0.4242316695  
-0.1762816191  
0.03466056643  
0.1907036626  
0.2830020991  
0.3121134207  
0.2870187612  
0.223048793  
0.1390960845  
0.05457694693  
-0.01340800779  
-0.0523338739  
-0.05565036535  
-0.02319915977  
0.03933240089  
0.1217709477  
0.2113786798  
0.2950352382  
0.3613583007  
0.4024812681  
0.4152644109  
0.4017943117  
0.3691286931  
0.3283360489  
0.292959919  
0.2771047102  
0.2933986542  
0.3510873427  
0.4545198476  
0.6022383884  
0.7868049722  
0.9954291873  
1.211327819  
1.415670784  
1.589855139  
1.71782171  
1.788081514  
1.795176105  
1.74035055  
1.631350347  
1.481362594  
1.307262681  
1.127431048  
0.9594801406  
0.818211494  
0.7141156432  
0.6525931877  
0.6339769341  
0.6542653487  
0.7063902802  
0.781741943  
0.8716423603  
0.968532119  
1.066654199  
1.162200886  
1.252955111  
1.33759443  
1.414867272  
1.482881393  
1.538688688  
1.578283268  
1.597014363  
1.590327804  
1.554661686  
1.488290929  
1.391918055  
1.268869777  
1.1248356  
0.9671864601  
0.8039968899  
0.6429489518  
0.4903288209  
0.3502853533  
0.2244851429  
0.1121839333  
0.01068891594  
-0.08393093266  
-0.1760367798  
-0.2696898399  
-0.3681410442  
-0.4736163134  
-0.5873911607  
-0.7100842403  
-0.842041008  
-0.9836384018  
-1.135390479  
-1.29775144  
-1.470628773  
-1.65267692  
-1.840546146  
-2.028302624  
-2.20723909  
-2.36625847  
-2.492909361  
-2.575033196  
-2.602841259  
-2.571096124  
-2.481021688  
-2.341507211  
-2.169264502  
-1.987702596  
-1.824513676  
-1.708161433  
-1.663703839  
-1.708548385  
-1.848825145  
-2.077037247  
-2.371496566  
-2.697822043  
-3.012438004  
-3.267702541  
-3.417973433  
-3.425749616  
-3.266949043  
-2.93448893  
-2.439583346  
-1.810522758  
-1.089101738  
-0.3252481321  
0.4293071822  
1.127338864  
1.731457819  
2.217698812  
2.57692179  
2.813961879  
2.944851466  
2.992731345  
2.983248733  
2.940265088  
2.882564537  
2.822017932  
2.763339226  
2.70526888  
2.642774905  
2.569681874  
2.481150336  
2.375498005  
2.25504741  
