0.01335692871  
0.02053416744  
0.02002911705  
0.006504296279  
-0.02330265406  
-0.07001078838  
-0.1314585817  
-0.2030286413  
-0.2783678601  
-0.3504079285  
-0.4125091393  
-0.4595359073  
-0.4887011028  
-0.5000225795  
-0.4963299326  
-0.4828117735  
-0.4661795312  
-0.4535889861  
-0.4514861105  
-0.4645731838  
-0.4950547248  
-0.5422844683  
-0.6028747017  
-0.6712383155  
-0.7404868676  
-0.8035366081  
-0.8542519999  
-0.8884340949  
-0.904506199  
-0.9037718441  
-0.8901937411  
-0.8697168681  
-0.8492278493  
-0.8352957653  
-0.8328850755  
-0.8442489624  
-0.8681685365  
-0.8996949704  
-0.9304511084  
-0.9494884932  
-0.9446104107  
-0.9039974942  
-0.8179162815  
-0.6802909779  
-0.4899018011  
-0.2510411683  
0.02648068109  
0.3279994651  
0.6352595069  
0.9281190101  
1.186487408  
1.39226644  
1.531059007  
1.593455864  
1.57578498  
1.480261239  
1.314578023  
1.09102782  
0.8252924607  
0.5350636381  
0.2386547161  
-0.04628180626  
-0.3038232203  
-0.5205975246  
-0.6863489684  
-0.7942688343  
-0.8411295081  
-0.8272623055  
-0.7564013546  
-0.635412545  
-0.4738915169  
-0.2836307357  
-0.07794193778  
0.1291600666  
0.3238714828  
0.4935674038  
0.627724956  
0.7187187546  
0.7623842284  
0.7582785465  
0.709590676  
0.6227044647  
0.5064511529  
0.3711542101  
0.2275691431  
0.08585905584  
-0.04527263346  
-0.159193563  
-0.2516289215  
-0.3206236634  
-0.366201842  
-0.3898056509  
-0.3936185719  
-0.3798893836  
-0.3503577428  
-0.3058760591  
-0.2462711164  
-0.1704571003  
-0.07676932148  
0.03653501696  
0.1707038348  
0.325915951  
0.5008081412  
0.6921445389  
0.8946956918  
1.101329174  
1.303314719  
1.490814219  
1.653518109  
1.781377038  
1.865362946  
1.898212153  
1.875068477  
1.793986005  
1.656222692  
1.466297083  
1.231778404  
0.9628228821  
0.6714761182  
0.3708074485  
0.07394433388  
-0.2068821629  
-0.4612083838  
-0.6810090848  
-0.861127759  
-0.9994128924  
-1.096568228  
-1.155745331  
-1.181953644  
-1.181355041  
-1.16055111  
-1.125936998  
-1.083193799  
-1.036958231  
-0.9906944369  
-0.946733355  
-0.9064679206  
-0.8706316637  
-0.839612275  
-0.8137400483  
-0.793506027  
-0.7796614286  
-0.7732052264  
-0.7752344348  
-0.7866936748  
-0.8080525964  
-0.8389602512  
-0.8779283101  
-0.9221131604  
-0.9672346667  
-1.007691387  
-1.036867526  
-1.047662078  
-1.033162664  
-0.9874312737  
-0.9062936156  
-0.7880252771  
-0.6338407333  
-0.4480718051  
-0.2380022464  
-0.01332160781  
0.2147472788  
0.4345578826  
0.6352675261  
0.8079957028  
0.9467842771  
1.049195766  
1.116458917  
1.153136527  
1.166338103  
1.164581357  
1.156460601  
1.149306812  
1.148031616  
1.154330288  
1.166368405  
1.17900671  
1.184543765  
1.173878829  
1.13793484  
1.069134465  
0.9627172477  
0.8177013252  
0.6373401278  
0.4290022083  
0.2034810149  
-0.0261737972  
-0.2461460688  
-0.4434609989  
-0.6074896292  
-0.7311570865  
-0.8116989143  
-0.8508762913  
-0.8546469962  
-0.8323337399  
-0.7954331732  
-0.7561993292  
-0.7261906501  
-0.7149383551  
-0.7288807192  
-0.7706618954  
-0.8388533939  
-0.9281025727  
-1.029674819  
-1.132319657  
-1.22336287  
-1.289912296  
-1.320060581  
-1.303975052  
-1.234766989  
-1.109080202  
-0.927333849  
-0.6936296746  
-0.4153272384  
-0.1023599193  
0.2336234625  
0.5801914685  
0.9250201665  
1.256646039  
1.565016168  
1.84178039  
2.080361973  
2.275824262  
2.424635875  
2.524407587  
2.573706055  
2.571988123  
2.519700039  
2.418502185  
2.271564804  
2.083836405  
1.862171405  
1.61523072  
1.353097495  
1.086601577  
0.8264124346  
0.5820214611  
0.36075152  
0.1669702601  
0.001643927772  
-0.1376756883  
-0.2563895057  
-0.36197983  
-0.4628360905  
-0.5669523461  
-0.68069222  
-0.8078036835  
-0.9488318584  
-1.101019622  
-1.258699244  
-1.414122609  
-1.558599979  
-1.683788162  
-1.782944711  
-1.851976743  
-1.890136884  
-1.900276291  
-1.888608391  
-1.864001077  
-1.836874333  
-1.817825422  
-1.816131669  
-1.838324016  
-1.886996406  
-1.960027909  
-2.050328622  
-2.146196521  
-2.232279425  
-2.291070801  
-2.304797756  
-2.257500338  
-2.137048307  
-1.936850969  
-1.657020675  
-1.304818245  
-0.8942888378  
-0.4450941339  
0.01933864702  
0.4741458025  
0.8955543776  
1.263293572  
1.562604992  
1.78558937  
1.931735061  
2.007576217  
2.025537441  
2.002116951  
1.955664863  
1.904020198  
1.862312612  
1.841180234  
1.845608726  
1.874509211  
1.921060062  
1.973757519  
2.018022293  
2.038178705  
2.019550352  
1.950455426  
1.823857237  
1.638494379  
1.399369728  
1.11753944  
0.809228339  
0.4943645545  
0.1946961196  
-0.06832121905  
-0.2756254431  
-0.4124216461  
-0.4696336276  
-0.4447770803  
-0.3421743361  
-0.1725046539  
0.04826385924  
0.3004100307  
0.5623099133  
0.8123865452  
1.030970069  
1.2018797  
1.313592186  
1.359910448  
1.340095124  
1.258487184  
1.123685704  
0.9473863043  
0.7430158171  
0.5242888675  
0.3038482131  
0.09210276252  
-0.103609183  
-0.2794566935  
-0.4350937271  
-0.5731906623  
-0.698559589  
-0.8169738488  
-0.9338503805  
-1.052951827  
-1.175326973  
-1.298650918  
-1.417106766  
-1.521869654  
-1.60216532  
-1.646781693  
-1.645841477  
-1.592564932  
-1.484758332  
-1.325774073  
-1.124758175  
-0.8961012031  
-0.6581306699  
-0.4311967339  
-0.2353968856  
-0.08825633347  
-0.002684057641  
0.01450526411  
-0.03669662982  
-0.1496441469  
-0.3120096049  
-0.5074254149  
-0.7175408157  
-0.9241933064  
-1.11137978  
-1.26677825  
-1.382628826  
-1.455902746  
-1.487803302  
-1.482734313  
-1.44695169  
-1.387133609  
-1.309122987  
-1.217017193  
-1.11274327  
-0.9961467384  
-0.8655387714  
-0.7185861457  
-0.5533649858  
-0.3693714848  
-0.1683287728  
0.04538465646  
0.264747257  
0.4805750915  
0.6824052626  
0.8596582959  
1.002914778  
1.105123412  
1.162549847  
1.175342913  
1.147616639  
1.087044986  
1.004005631  
0.9104058463  
0.8183340812  
0.7387307006  
0.6802431235  
0.6484092654  
0.6452701705  
0.6694394768  
0.7165937133  
0.780294842  
0.8530074377  
0.92715692  
0.9960694428  
1.054657866  
1.099774689  
1.1301897  
1.146224327  
1.149128218  
1.140319194  
1.120636721  
1.08975799  
1.045891969  
0.9858298548  
0.9053670984  
0.8000425065  
0.666090064  
0.501452925  
0.306679444  
0.0855525565  
-0.1546845347  
-0.403569314  
-0.6481344003  
-0.8740110688  
-1.066810667  
-1.213594641  
-1.304260263  
-1.332669374  
-1.297389444  
-1.201965418  
-1.054696621  
-0.867966864  
-0.6571855198  
-0.439467585  
-0.232164918  
-0.05137481717  
0.08945475341  
0.1807217218  
0.2175746495  
0.2004521767  
0.1351967155  
0.03270543113  
-0.09189820463  
-0.2205322635  
-0.3337974767  
-0.4128624296  
-0.4414182413  
-0.4075056684  
-0.3049873089  
-0.1344740804  
0.09645079954  
0.3737695583  
0.6783197181  
0.9877060715  
1.278618787  
1.529280956  
1.721732979  
1.843650173  
1.889480202  
1.860756577  
1.765559023  
1.617216111  
1.432427782  
1.229073274  
1.024003938  
0.8310922161  
0.6598111941  
0.5144689192  
0.3942027651  
0.2936678971  
0.2042981572  
0.1159254494  
0.01850758294  
-0.09628846403  
-0.233870974  
-0.3960319664  
-0.5808414321  
-0.7831075972  
-0.9952813058  
-1.208624134  
-1.41442324  
-1.60504454  
-1.774653021  
-1.919491083  
-2.037711435  
-2.128825357  
-2.192919203  
-2.229820097  
-2.23841109  
-2.216265893  
-2.159709786  
-2.064331663  
-1.925893047  
-1.741486881  
-1.510757498  
-1.236950665  
-0.9275997552  
-0.5946731844  
-0.2541101809  
0.07526359291  
0.3733399593  
0.6206696603  
0.8005287982  
0.90082799  
0.9156352318  
0.8460967598  
0.7006160645  
0.4942560389  
0.2474006291  
-0.01617667809  
-0.2716193405  
-0.4954096491  
-0.6676294036  
-0.7737926927  
-0.8060578117  
-0.763691244  
-0.6527517997  
-0.4850675132  
-0.2766550409  
-0.04579589506  
0.1889847358  
0.4107940273  
0.605885239  
0.7646755307  
0.8821757774  
0.9578491952  
0.9949793051  
0.9996673972  
0.9796477567  
0.9430815429  
0.8974958135  
0.8489886163  
0.801776987  
0.7580940221  
0.7184157172  
0.6819319671  
0.647160127  
0.6125855845  
0.5772232328  
0.5410168463  
0.5050133718  
0.471305588  
0.4427603256  
0.4225782149  
0.4137728115  
0.4186349987  
0.4382879511  
0.4723775122  
0.5189650388  
0.5746241364  
0.6347446416  
0.6939947267  
0.7468905051  
0.7884013062  
0.8145120697  
0.8226786768  
0.812118231  
0.7838980532  
0.7408166809  
0.6870865195  
0.6278495804  
0.5685947627  
0.5145308728  
0.4699952117  
0.4379651405  
0.4197181584  
0.4146904438  
0.4205340835  
0.4333666154  
0.4481784532  
0.4593496348  
0.4612121724  
0.4486052572  
0.417364071  
0.364704556  
0.2894773003  
0.1922735774  
0.07538691936  
-0.05736238213  
-0.2009247593  
-0.3494166294  
-0.4965936755  
-0.6363484094  
-0.7632165378  
-0.8728178087  
-0.9621960785  
-1.030013423  
-1.076565007  
-1.103600003  
-1.113979795  
-1.111201165  
-1.098860584  
-1.080134631  
-1.057361986  
-1.031783443  
-1.003496547  
-0.9716180516  
-0.9346360559  
-0.8908861559  
-0.839084086  
-0.7788012912  
-0.7108263186  
-0.6373329891  
-0.561824041  
-0.488854588  
-0.4235749312  
-0.3711532015  
-0.336165561  
-0.3220450944  
-0.3306666528  
-0.3621327174  
-0.4147782076  
-0.4853934438  
-0.569618022  
-0.662429253  
-0.7586504469  
-0.8533806678  
-0.9422773105  
-1.02165666  
-1.08839961  
-1.13969887  
-1.172725413  
-1.184301198  
-1.170683618  
-1.127552039  
-1.050257448  
-0.9343439732  
-0.7763075315  
-0.5744960156  
-0.3300025394  
-0.04739656464  
0.2648757887  
0.5945642709  
0.92621897  
1.242340453  
1.52496028  
1.757491614  
1.92659247  
2.023790481  
2.046606428  
1.998985201  
1.890937481  
1.737400775  
1.556451594  
1.36709396  
1.186925863  
1.030002053  
0.9051971494  
0.8152859116  
0.7568893377  
0.7212753696  
0.6959096893  
0.6665284516  
0.6194479708  
0.5437724687  
0.4331948191  
0.2871303883  
0.1110352411  
-0.08415120422  
-0.2833434768  
-0.4692530694  
-0.6246557406  
-0.7346623349  
-0.7886822452  
-0.7817976381  
-0.7153620732  
-0.5967483025  
-0.4382882059  
-0.2555765198  
-0.06539090953  
0.1164579411  
0.2770266552  
0.4076162702  
0.5044385894  
0.5684960782  
0.6047376451  
0.6206463716  
0.6245277186  
0.6237930396  
0.6235367688  
0.6256413367  
0.6285679892  
0.6278429709  
0.61716299  
0.5899066411  
0.5407859528  
0.4673368804  
0.3709793573  
0.2574410284  
0.1364457754  
0.020696907  
-0.07571235066  
-0.139219844  
-0.1587681865  
-0.127526153  
-0.04411063456  
0.0868743384  
0.2550498527  
0.4451969446  
0.6387756003  
0.8158293802  
0.9570281986  
1.045609644  
1.06900526  
1.020001505  
0.8973463353  
0.7057891788  
0.4555876165  
0.1615737553  
-0.158109185  
-0.483496321  
-0.7943766077  
-1.071864733  
-1.299865729  
-1.466334449  
-1.564250726  
-1.592223591  
-1.554662145  
-1.461458384  
-1.327171567  
-1.169742345  
-1.008829483  
-0.8639038477  
-0.7522897953  
-0.6873731944  
-0.6771924544  
-0.723595191  
-0.8220848857  
-0.9623943019  
-1.12973486  
-1.306552861  
-1.47458403  
-1.616924647  
-1.719845581  
-1.774115453  
-1.775663121  
-1.725516258  
-1.629053151  
-1.49471906  
-1.332420345  
-1.151877919  
-0.961206358  
-0.7659430986  
-0.5687026585  
-0.3694753327  
-0.1665212104  
0.04231580334  
0.2581365238  
0.4796417975  
0.702193159  
0.9174933745  
1.114005173  
1.278087835  
1.395700094  
1.454426452  
1.445486749  
1.365407125  
1.217045256  
1.009795699  
0.7588972053  
0.4839432933  
0.2067937219  
-0.05080118047  
-0.2695293035  
-0.4344700182  
-0.5364303044  
-0.5725100676  
-0.5458794272  
-0.4648482653  
-0.3414170502  
-0.1895350909  
-0.02332566581  
0.1445053613  
0.3038932312  
0.4481675637  
0.5742958277  
0.6826500412  
0.7763812155  
0.8605034763  
0.9408409903  
1.022941083  
1.11109937  
1.207573411  
1.312073368  
1.421569783  
1.530453466  
1.63101886  
1.714251039  
1.770837132  
1.792305886  
1.772179427  
1.707002436  
1.597114968  
1.447047705  
1.265464366  
1.064596322  
0.8592031308  
0.6651347794  
0.4976443443  
0.3696324422  
0.290050513  
0.2626659829  
0.2853850305  
0.3502460818  
0.4441324001  
0.5501494258  
0.6495259118  
0.7237967859  
0.7570152408  
0.7376753207  
0.6601083231  
0.5251361268  
0.3398986569  
0.1168785983  
-0.1277474371  
-0.376193761  
-0.6112897709  
-0.8185345577  
-0.9877020246  
-1.113792513  
-1.197219616  
-1.243250995  
-1.260818021  
-1.260901772  
-1.254749592  
-1.252190978  
-1.260280988  
-1.282455628  
-1.318273712  
-1.363760844  
-1.412256284  
-1.455629246  
-1.485657841  
-1.495379436  
-1.480216375  
-1.43872492  
-1.372868705  
-1.287787164  
-1.191083246  
-1.091729514  
-0.9987453612  
-0.9198153505  
-0.860046481  
-0.8210564822  
-0.8005241282  
-0.7923155258  
-0.787177678  
-0.7739551715  
-0.741176883  
-0.6787987704  
-0.5798668488  
-0.441834387  
-0.2673259282  
-0.06420499194  
0.155107586  
0.3749822453  
0.5784338019  
0.7492009864  
0.8737621969  
0.9429765654  
0.9531173933  
0.9061474829  
0.8092203762  
0.6735153971  
0.5126085309  
0.3406742761  
0.1707992913  
0.01367235716  
-0.1231757957  
-0.2355132833  
-0.3219766524  
-0.3832220369  
-0.4208744895  
-0.4365080881  
-0.4308906869  
-0.403621148  
-0.3532493242  
-0.2778161453  
-0.1757098524  
-0.04663792097  
0.1074853584  
0.2819382612  
0.4690118822  
0.6583225318  
0.8375969708  
0.9938270981  
1.114641902  
1.189704398  
1.211945845  
1.178480095  
1.091086477  
0.9562161448  
0.7845191001  
0.5899699167  
0.388679091  
0.1975072531  
0.03262337525  
-0.09187890721  
-0.1651876783  
-0.1807015109  
-0.136606942  
-0.03604902396  
0.1131312004  
0.2990663566  
0.5069048668  
0.7201290919  
0.9220131515  
1.097099081  
1.232515155  
1.319010598  
1.351600088  
1.329755922  
1.257154316  
1.141023462  
0.9911955169  
0.8189940933  
0.6360931075  
0.4534634533  
0.2805107358  
0.1244564278  
-0.01001587639  
-0.120872937  
-0.208622252  
-0.276029888  
-0.3277106652  
-0.369602293  
-0.4083605425  
-0.4506767895  
-0.5025475116  
-0.5685290685  
-0.6510354496  
-0.7497637408  
-0.8613371363  
-0.9792563961  
-1.09424192  
-1.194983024  
-1.269275696  
-1.305443083  
-1.293887296  
-1.228566548  
-1.108172645  
-0.9368141874  
-0.7240531473  
-0.4842375255  
-0.2351785551  
0.003684612845  
0.2133974709  
0.3775833607  
0.4842342042  
0.526934855  
0.5053606149  
0.4249870701  
0.2960835779  
0.132165995  
-0.05182637145  
-0.2413441253  
-0.4237428414  
-0.5892970136  
-0.7315878881  
-0.8472748873  
-0.9353621891  
-0.9961568338  
-1.030180102  
-1.037267958  
-1.016064853  
-0.9640279161  
-0.8779356203  
-0.7548106275  
-0.5930515794  
-0.3935428025  
-0.1604905202  
0.09821395787  
0.371214564  
0.6445162455  
0.9027954216  
1.131015057  
1.316091551  
1.448341704  
1.522498956  
1.538141433  
1.499483343  
1.414588522  
1.294152621  
1.150049576  
0.9938928744  
0.8357997022  
0.683528932  
0.5420730575  
0.4137123865  
0.2984484928  
