369.1388591  
414.3473882  
513.268457  
685.8986686  
963.3682646  
7756.940933  
17726.36553  
16176.46939  
5630.532809  
33584.54357  
20062.346  
65907.83626  
24928.22793  
14030.72539  
16022.7136  
165.4040532  
13496.10743  
18827.2783  
1632.73872  
21140.36651  
4582.667649  
34702.19968  
6107.647656  
3082.100332  
16281.92182  
1219.649255  
10304.21737  
7878.446031  
3765.444474  
11312.02432  
855.8022015  
2332.432555  
1016.106654  
536.7047227  
6045.037748  
5826.30297  
10382.96715  
5589.487937  
3413.591961  
8270.481993  
2318.268501  
94.76954956  
971.588336  
472.3311171  
4218.110469  
8668.220632  
5625.354342  
5481.953033  
4499.044381  
7804.957889  
852.0096879  
2811.91558  
1648.019905  
2752.428687  
1392.031248  
1683.910989  
2244.507577  
2715.817121  
933.1075036  
2222.087457  
344.6879429  
1931.457882  
188.4839188  
1233.805396  
329.3445636  
140.3265203  
37.32140551  
278.3315873  
17.37550226  
14.46617278  
10.60800567  
4.626602188  
11.61045523  
11.17977922  
9.767975697  
9.200164854  
6.77846916  
2.67291866  
0.5328098767  
0.3874699316  
0.777304352  
1.506649358  
2.780517952  
1.43988433  
1.133210435  
1.349968332  
1.037114284  
0.547872236  
0.7131026623  
0.6208244012  
0.8016867903  
1.007003226  
0.8095942832  
0.6753293433  
0.6078212111  
0.513757679  
0.5135342554  
0.5181577041  
0.5092799483  
0.5178918574  
0.4952429369  
0.4592011506  
0.4336620045  
0.409562217  
0.4051298769  
0.3876733584  
0.3896657279  
0.3683666247  
0.3553552498  
0.3497493794  
0.331849029  
0.3211296791  
0.3122443101  
0.3011102738  
0.2953465085  
0.2863928253  
0.2794660105  
0.2707929601  
0.2634466179  
0.2549440887  
0.2489827301  
0.2421315832  
0.2365262754  
0.2300790692  
0.2251510265  
0.2190522566  
0.2142461144  
0.2088153445  
0.204130656  
0.1995398414  
0.1951651343  
0.1908212883  
0.186661813  
0.1826366159  
0.1787145581  
0.174872309  
0.1713361743  
0.1677742343  
0.1644649154  
0.1612132772  
0.1581089364  
0.155053515  
0.152111662  
0.149234287  
0.1464643328  
0.1437986018  
0.1411877404  
0.1386897923  
0.1362388693  
0.1338635381  
0.1315504938  
0.1293305536  
0.1271374391  
0.1250407309  
0.1229860394  
0.1209945016  
0.1190493921  
0.1171627693  
0.1153237202  
0.1135324225  
0.1117947091  
0.1100907154  
0.1084439537  
0.1068339937  
0.1052625967  
0.103727954  
0.1022367814  
0.1007815932  
0.09935749742  
0.0979695913  
0.09661802616  
0.09529219593  
0.09399810816  
0.09273963989  
0.0915119237  
0.09030092336  
0.08913054438  
0.0879758208  
0.08685189347  
0.08575051403  
0.08467763898  
0.08362896415  
0.08259437893  
0.08158654677  
0.08059825025  
0.07963733688  
0.07869339844  
0.07776462148  
0.07685851529  
0.07597128771  
0.07509945898  
0.07424601496  
0.07340741151  
0.07259069023  
0.07178668303  
0.07100302921  
0.07022749895  
0.06947049741  
0.06872963072  
0.06799882618  
0.06728940825  
0.06658497911  
0.06589657295  
0.06522220041  
0.06455752601  
0.06390554833  
0.0632648074  
0.0626362012  
0.06202357171  
0.06141396233  
0.0608215592  
0.06023897321  
0.05966265082  
0.05909971831  
0.05854317821  
0.05800041749  
0.05746411148  
0.05693963198  
0.05642261754  
0.05591015067  
0.05541268821  
0.05491791913  
0.05443518005  
0.05395965671  
0.05349058494  
0.05303025972  
0.05257635885  
0.05212918943  
0.05169009864  
0.05125928579  
0.05083687392  
0.0504161052  
0.05000579506  
0.04959803502  
0.04920089173  
0.04880584175  
0.04842083819  
0.04804011804  
0.04766388259  
0.04729482036  
0.0469318668  
0.04657370618  
0.04621750954  
0.04587107922  
0.04552807816  
0.0451882746  
0.04485430222  
0.04452788847  
0.04420696648  
0.04388628872  
0.04357294177  
0.04326277285  
0.04295694472  
0.04265580128  
0.04235878394  
0.04206750218  
0.04178009505  
0.04149353496  
0.0412130078  
0.04093738456  
0.04066469684  
0.0403959933  
0.04013221156  
0.0398700468  
0.03961097007  
0.03935499976  
0.03910379819  
0.03885718459  
0.03861354091  
0.03837060622  
0.03813502418  
0.0379007228  
0.03766755352  
0.03743715422  
0.03721182615  
0.03699010326  
0.03676932689  
0.03655130072  
0.03633812082  
0.03612756321  
0.03591795952  
0.03571024603  
0.03550831598  
0.03530802258  
0.03510885853  
0.03491357622  
0.0347192622  
0.03452941534  
0.03434274256  
0.03415538117  
0.03397056744  
0.03379264137  
0.03361048993  
0.03343167595  
0.0332579482  
0.03308609702  
0.03291575109  
0.03274665495  
0.03258267504  
0.03241580681  
0.03225445278  
0.03209389475  
0.03193544774  
0.03177864905  
0.03162507756  
0.03147145368  
0.03131774938  
0.0311708277  
0.03102229026  
0.03087945515  
0.03073589217  
0.030591564  
0.03045349913  
0.0303113972  
0.03017857318  
0.03003922296  
0.02990600246  
0.0297750468  
0.02964336359  
0.02951515051  
0.02938736831  
0.02926136666  
0.02913597339  
0.02901459083  
0.02889389959  
0.02877078848  
0.02865179478  
0.02853523463  
0.02842036963  
0.02830665291  
0.02819211892  
0.02807752981  
0.02796637024  
0.02785920745  
0.0277494501  
0.0276431278  
0.0275369779  
0.02743255187  
0.02733008347  
0.0272289651  
0.02712689063  
0.0270278552  
0.02692953667  
0.02683159302  
0.02673529501  
0.02663899893  
0.02654780303  
0.02645303667  
0.02636180872  
0.02627004893  
0.02618204312  
0.0260926748  
0.02600462128  
0.02592059233  
0.02583232206  
0.02574624648  
0.02566458932  
0.02558349624  
0.0255017145  
0.02542069351  
0.02534173106  
0.02526047137  
0.02518283345  
0.02510550289  
0.02503076869  
0.02495510587  
0.02488127473  
0.02480731554  
0.0247346859  
0.02466309448  
0.02459232544  
0.02452288646  
0.02445272106  
0.02438484616  
0.02431820225  
0.02425219333  
0.02418416163  
0.02412064367  
0.02405666123  
0.02399380944  
0.02393020491  
0.02386888856  
0.0238100595  
0.02374773709  
0.02368802258  
0.02363037945  
0.02357210317  
0.02351371718  
0.02345785221  
0.02340099915  
0.02334609483  
0.02329208054  
0.02323848538  
0.02318568553  
0.0231333393  
0.02308176589  
0.02303152475  
0.02298145788  
0.02292896713  
0.02288122063  
0.02283318837  
0.02278543238  
0.02274069969  
0.02269336124  
0.02264601931  
0.02260171295  
0.02255887116  
0.02251425074  
0.02247059671  
0.02242822456  
0.02238569647  
0.02234446648  
0.02230348376  
0.02226584044  
0.0222247644  
0.02218508936  
0.02214832978  
0.02210948564  
0.02207126182  
0.0220353488  
0.02200224391  
0.02196364405  
0.02193089972  
0.021893833  
0.02186097346  
0.02182534673  
0.02179496282  
0.02176198788  
0.02173068177  
0.02170053536  
0.02167033687  
0.02163918938  
0.02161122317  
0.02158346857  
0.02155254907  
0.02152552474  
0.02149778296  
0.02147225933  
0.02144557826  
0.02141946913  
0.02139592834  
0.0213694782  
0.02134602357  
0.02132242846  
0.02129992253  
0.02127443122  
0.02125445665  
0.02123203964  
0.02120868931  
0.02119058795  
0.02116843412  
0.02115054836  
0.02113058428  
0.02111038037  
0.02109291149  
0.02107589303  
0.02105868802  
0.02104321188  
0.02102586778  
0.02101041347  
0.02099387638  
0.02098020275  
0.02096623292  
0.02095036442  
0.02093678584  
0.02092528329  
0.02091183813  
0.02089856846  
0.02088816861  
0.02087673709  
0.02086603489  
0.02085487418  
0.02084675374  
0.02083701418  
0.02082841032  
0.02081853671  
0.02081287456  
0.02080373776  
0.02079669807  
0.02078998856  
0.02078295574  
0.02077787135  
0.02077243933  
0.02076923642  
0.02076540074  
0.02076029314  
0.02075771558  
0.02075437905  
0.02075275231  
0.02075058428  
0.02074869866  
0.02074656044  
0.02074533667  
0.02074556684  
