0.03697519776  
-0.727399386  
-1.460093886  
-2.128918704  
-2.704754561  
-3.163328895  
-3.486792472  
-3.664990317  
-3.696297171  
-3.587939467  
-3.355716142  
-3.023071305  
-2.619524671  
-2.178511096  
-1.734760849  
-1.321423806  
-0.9672093131  
-0.69383704  
-0.5141241272  
-0.4309483721  
-0.4372663066  
-0.5172118745  
-0.6481557791  
-0.8034836143  
-0.9557187344  
-1.079596223  
-1.154703587  
-1.167388447  
-1.111760985  
-0.9897664739  
-0.8104439848  
-0.5885601006  
-0.3428849339  
-0.09432043237  
0.1359193459  
0.3279810872  
0.4648531147  
0.5336446361  
0.5266737655  
0.4423191475  
0.2855625182  
0.06809764775  
-0.192126155  
-0.4720320553  
-0.7452288657  
-0.9844296157  
-1.1642621  
-1.264143374  
-1.270853564  
-1.18042578  
-0.9990418822  
-0.7427630707  
-0.4360648842  
-0.1093304742  
0.2044181733  
0.4731539599  
0.6694149424  
0.7733861216  
0.7751347653  
0.6757468849  
0.4872212232  
0.2311276575  
-0.06383281215  
-0.3651073205  
-0.6400387569  
-0.8596464636  
-1.001964762  
-1.054498665  
-1.015444675  
-0.8934725918  
-0.7060521418  
-0.4765385318  
-0.2304232422  
0.008675426665  
0.2226522953  
0.4015662303  
0.544840232  
0.6607608034  
0.764328797  
0.873782321  
1.006384575  
1.174194095  
1.38059761  
1.618250528  
1.868882616  
2.105114477  
2.294080062  
2.402379268  
2.401586676  
2.273471659  
2.014047598  
1.635740501  
1.167192751  
0.6506051467  
0.1368506498  
-0.3210143573  
-0.674957833  
-0.8888492443  
-0.9439460108  
-0.8420986301  
-0.6060854399  
-0.2769055095  
0.09167809054  
0.4406130808  
0.7139753032  
0.867075517  
0.8730072529  
0.726619332  
0.4452735026  
0.06624603232  
-0.3588149078  
-0.7715268202  
-1.115299002  
-1.343414504  
-1.425451334  
-1.351082503  
-1.130770713  
-0.7933834914  
-0.3812424786  
0.05648958191  
0.4709536406  
0.8201472047  
1.073920496  
1.216801665  
1.248419693  
1.181723143  
1.039517747  
0.8500466909  
0.642414894  
0.442555795  
0.2702572621  
0.1375125965  
0.0482126186  
-0.001013928281  
-0.01913471306  
-0.01859291848  
-0.01308705457  
-0.01552005291  
-0.0363065468  
-0.0821369311  
-0.155233285  
-0.2530955765  
-0.3687220008  
-0.4912895586  
-0.6072470497  
-0.7017703953  
-0.7604678752  
-0.7711768134  
-0.7256576156  
-0.6209521426  
-0.4601980767  
-0.2527406343  
-0.01347140554  
0.2385722261  
0.4821891425  
0.6963389652  
0.8625023083  
0.9667818589  
1.001453312  
0.9657964269  
0.8660981679  
0.7148677038  
0.5293861399  
0.3297871688  
0.1369339873  
-0.02966429286  
-0.1536604184  
-0.223222004  
-0.2318366373  
-0.1785454322  
-0.06764971365  
0.09198601728  
0.2879149861  
0.5052225902  
0.7276662476  
0.9387540569  
1.122727951  
1.26545078  
1.35519027  
1.383316629  
1.344885557  
1.239046713  
1.069226828  
0.8429801053  
0.5714831538  
0.2686371616  
-0.05014037183  
-0.3693184746  
-0.6746644336  
-0.9544779986  
-1.200447255  
-1.408008352  
-1.576172807  
-1.706862915  
-1.803901781  
-1.871841591  
-1.914852647  
-1.935857616  
-1.936046227  
-1.914834628  
-1.870236454  
-1.799564088  
-1.700317895  
-1.571096372  
-1.412384854  
-1.227084108  
-1.020704156  
-0.8011738327  
-0.5782937265  
-0.3628867982  
-0.1657493016  
0.003465178659  
0.1372696511  
0.2311439236  
0.2839604155  
0.2979821728  
0.2783939006  
0.2324393325  
0.1682796921  
0.09376938469  
0.01534458649  
-0.06276972928  
-0.1388935681  
-0.2136910135  
-0.2894827088  
-0.3691610736  
-0.4549308339  
-0.5470881092  
-0.6430674994  
-0.736953518  
-0.819550518  
-0.8790544807  
-0.9022549975  
-0.8761249499  
-0.7896227961  
-0.6354619082  
-0.4116411365  
-0.1225183356  
0.2207428335  
0.6004673428  
0.9935388581  
1.373220021  
1.711570661  
1.982243946  
2.163359505  
2.240088526  
2.206619564  
2.067185162  
1.835965885  
1.535801133  
1.195827992  
0.8483099932  
0.5250425222  
0.253804165  
0.0553124418  
-0.05891798815  
-0.08753498733  
-0.03902118165  
0.06985731732  
0.2166041377  
0.3761955523  
0.5244989416  
0.6414607834  
0.7136488953  
0.7358323697  
0.7113803669  
0.651456984  
0.5730971376  
0.4964365408  
0.4414624877  
0.4247424197  
0.456585193  
0.5390664158  
0.6652212472  
0.8195636555  
0.9799105538  
1.12028861  
1.214554071  
1.24022638  
1.18200547  
1.034453453  
0.803436622  
0.5060792062  
0.1691857281  
-0.1736871234  
-0.4861558736  
-0.7333985227  
-0.8864447271  
-0.9257682382  
-0.8437278229  
-0.6455316021  
-0.3486369469  
0.01929986517  
0.4236071355  
0.8264703619  
1.190971584  
1.484806669  
1.683263063  
1.77118479  
1.743781793  
1.606332966  
1.372909199  
1.064365276  
0.7058835574  
0.3243569687  
-0.05411667138  
-0.4064207011  
-0.7141033744  
-0.9644836301  
-1.151124245  
-1.273703967  
-1.337357271  
-1.351586957  
-1.328881464  
-1.283174355  
-1.228295391  
-1.176536911  
-1.137453252  
-1.117003137  
-1.117091105  
-1.135582114  
-1.166779409  
-1.202351524  
-1.232612176  
-1.248024173  
-1.240733765  
-1.205924036  
-1.142767266  
-1.054811875  
-0.9496884106  
-0.8381502606  
-0.7325623214  
-0.6450608576  
-0.5856724377  
-0.5607152011  
-0.5717465986  
-0.6152469821  
-0.68309499  
-0.7637495983  
-0.8439373842  
-0.9105498625  
-0.9524344838  
-0.9617977849  
-0.9350010553  
-0.8726736237  
-0.779159212  
-0.6614516074  
-0.5278260432  
-0.3864303387  
-0.2440904032  
-0.1055006688  
0.02705517135  
0.1534566093  
0.2750411512  
0.3936055272  
0.5103301791  
0.6248591424  
0.73475415  
0.8354619039  
0.9208513902  
0.9842432862  
1.019765214  
1.023768563  
0.9960009007  
0.9402645157  
0.8643554304  
0.7792249828  
0.6974399853  
0.6311836806  
0.5901364258  
0.5796395758  
0.5994982029  
0.6436977301  
0.7011528806  
0.7574079038  
0.7970567206  
0.8064887754  
0.7765127579  
0.7044086865  
0.5950244963  
0.4606948013  
0.3199307355  
0.1950090497  
0.10878467  
0.08116340922  
0.1257406504  
0.2471281031  
0.4393949145  
0.6859208442  
0.9607656751  
1.231463038  
1.46290634  
1.621850585  
1.681416636  
1.624960607  
1.448735493  
1.162903112  
0.7907161769  
0.3659172316  
-0.07131089063  
-0.4792759682  
-0.8199151074  
-1.063389656  
-1.19152851  
-1.199626229  
-1.096432288  
-0.9023934376  
-0.646498067  
-0.3622443391  
-0.08334321677  
0.1602232172  
0.3453058578  
0.4575318721  
0.4919592977  
0.4525257763  
0.3505256387  
0.2024363331  
0.02746975165  
-0.1548205325  
-0.326603293  
-0.4733285794  
-0.5846924152  
-0.655019603  
-0.6831282631  
-0.6717934614  
-0.6269295615  
-0.5566334918  
-0.470169263  
-0.3770092995  
-0.2859767889  
-0.2045390649  
-0.1382885817  
-0.09063489846  
-0.0627280775  
-0.05361616213  
-0.06064144544  
-0.08000635746  
-0.1074739071  
-0.1390669608  
-0.1716674965  
-0.203391595  
-0.2336574592  
-0.2629200337  
-0.2921022248  
-0.3218563961  
-0.3518014897  
-0.3799462114  
-0.402454663  
-0.4138688077  
-0.4077996874  
-0.3780005083  
-0.3196427963  
-0.2305474901  
-0.112132626  
0.03014067  
0.1869455088  
0.3459007518  
0.4929245102  
0.6139246935  
0.6965795572  
0.7319319935  
0.715566097  
0.6481849989  
0.5355119459  
0.3875317264  
0.2171789232  
0.03866323673  
-0.1343268222  
-0.290289066  
-0.4211859209  
-0.5231468885  
-0.5964538066  
-0.6448182253  
-0.6740243752  
-0.6901634555  
-0.6977482875  
-0.6980603527  
-0.6880678152  
-0.6601795648  
-0.6029792326  
-0.5029185557  
-0.3467703412  
-0.1244801039  
0.1680365623  
0.5266546416  
0.9378031801  
1.378539175  
1.818058753  
2.220541893  
2.549016596  
2.769737155  
2.856481534  
2.794145622  
2.581088002  
2.229859001  
1.766149491  
1.226079634  
0.6521780375  
0.08859930411  
-0.4237569295  
-0.8515549022  
-1.172191257  
-1.375443078  
-1.463454907  
-1.449192296  
-1.353704179  
-1.202694362  
-1.022949963  
-0.8391552819  
-0.6714592791  
-0.5340267655  
-0.4345830754  
-0.3748306012  
-0.3514896733  
-0.3576872213  
-0.3844370278  
-0.4220215857  
-0.4611632775  
-0.493952396  
-0.5145345074  
-0.5195743358  
-0.5085056234  
-0.4835307221  
-0.4493350368  
-0.4124740552  
-0.3804319948  
-0.3604174391  
-0.3580270659  
-0.3759858589  
-0.4131938922  
-0.464297606  
-0.5199408031  
-0.5677380921  
-0.5938854125  
-0.5851943876  
-0.5312518645  
-0.4263498922  
-0.2708766557  
-0.07190453575  
0.1571229513  
0.397612083  
0.627777889  
0.8250991765  
0.9689366918  
1.042998472  
1.037340709  
0.9496774019  
0.7858457987  
0.5593787415  
0.2902175369  
0.002703226524  
-0.2769615856  
-0.5235172933  
-0.715409232  
-0.8371992074  
-0.8813191689  
-0.8489311587  
-0.7497292147  
-0.6006605196  
-0.423687513  
-0.2428350567  
-0.08090852202  
0.04366138717  
0.1194046922  
0.1434188766  
0.1217307928  
0.06832461449  
0.002948153101  
-0.05200750128  
-0.07509912122  
-0.04934315425  
0.03487843361  
0.1779969068  
0.3708164593  
0.5955631035  
0.8282909927  
1.042303698  
1.212091715  
1.317186933  
1.345344107  
1.294547668  
1.173525186  
1.000672818  
0.8015391343  
0.6052492305  
0.4403986331  
0.3310369611  
0.2933257425  
0.3333425423  
0.446317679  
0.6173627085  
0.8235319115  
1.036870339  
1.22799218  
1.369694275  
1.440148168  
1.425303163  
1.320287795  
1.129706863  
0.8668936424  
0.5522668865  
0.2110167123  
-0.1296045586  
-0.4431125613  
-0.7064532833  
-0.9022459405  
-1.020393509  
-1.058892251  
-1.023773686  
-0.928162095  
-0.7905581355  
-0.6325370787  
-0.4761248773  
-0.3411767416  
-0.243063829  
-0.1909847363  
-0.1870860898  
-0.2265300746  
-0.2984815218  
-0.3878836786  
-0.4777819145  
-0.5518861878  
-0.5969993087  
-0.6049990336  
-0.5740728128  
-0.5090268414  
-0.4206184913  
-0.3239950543  
-0.2364526912  
-0.1748477242  
-0.1530318117  
-0.1797018715  
-0.2569900144  
-0.3800160962  
-0.537463174  
-0.7131016747  
-0.8880247396  
-1.043253208  
-1.162326655  
-1.23348712  
-1.25114581  
-1.216433376  
-1.13676412  
-1.024514098  
-0.8950151984  
-0.7641849965  
-0.6461377453  
-0.5511338526  
-0.484149053  
-0.4442731944  
-0.4250071924  
-0.4153898167  
-0.4018099669  
-0.3702011308  
-0.3083163314  
-0.2077537013  
-0.06543173766  
0.1156840428  
0.3267181205  
0.553875803  
0.7801575518  
0.9875807391  
1.159619431  
1.283527628  
1.352221153  
1.365427589  
1.329896601  
1.258568433  
1.168740837  
1.079439224  
1.008319734  
0.9685758814  
0.9663572963  
0.9992023859  
1.055863793  
1.117722122  
1.161705768  
1.164368807  
1.106521236  
0.9776352125  
0.7791968868  
0.5263045103  
0.2470173565  
-0.02063492343  
-0.2337212409  
-0.3508514784  
-0.3390437109  
-0.1798984325  
0.1259723873  
0.5570923976  
1.072281618  
1.614815682  
2.119068154  
2.518743782  
2.75553192  
2.786939012  
2.592166458  
2.175208938  
1.564737752  
0.8108239213  
-0.02100877325  
-0.8575338185  
-1.626293651  
-2.263674727  
-2.721538269  
-2.971666955  
-3.00759798  
-2.843811441  
-2.512586842  
-2.059125906  
-1.535689638  
-0.9955549698  
-0.4875108007  
-0.05147091571  
0.2844416732  
0.50520071  
0.6086296869  
0.6038557533  
0.5087940962  
0.3470729433  
0.1448087156  
-0.07238800484  
-0.2818950103  
-0.4658291071  
-0.6119948904  
-0.7140347534  
-0.7709109685  
-0.7859067713  
-0.7653804618  
-0.717486753  
-0.6510603178  
-0.5747799959  
-0.4966350736  
-0.4236716386  
-0.361917706  
-0.3163789284  
-0.2910079574  
-0.2885964544  
-0.3105950793  
-0.3569049256  
-0.4257332988  
-0.5135956791  
-0.6155044965  
-0.7253597725  
-0.8364760459  
-0.9421537598  
-1.036177894  
-1.113148044  
-1.168590885  
-1.198861835  
-1.200905453  
-1.171989977  
-1.10952386  
-1.011069446  
-0.8745770388  
-0.6988350079  
-0.4840590845  
-0.2324909278  
0.05110935831  
0.3591951768  
0.6814524658  
1.00513544  
1.315683988  
1.597572245  
1.835320016  
2.014588503  
2.123304288  
2.152754155  
2.098579391  
1.961605216  
1.748393687  
1.471422801  
1.148772176  
0.8032395078  
0.4608646085  
0.1489174411  
-0.1065070181  
-0.2830455909  
-0.3644866712  
-0.3427402508  
-0.2190690269  
-0.004380083344  
0.2815305617  
0.6117276392  
0.9547280304  
1.277641514  
1.54951996  
1.744518717  
1.844540508  
1.84105278  
1.735904003  
1.541067669  
1.277359623  
0.9722755232  
0.6571780693  
0.3641039972  
0.1224963545  
-0.0438543574  
-0.1193692683  
-0.09850093443  
0.01338316389  
0.2001986816  
0.4364545644  
0.6896397349  
0.9235018604  
1.10190922  
1.192906661  
1.172472835  
1.027507367  
0.7576148072  
0.3754160398  
-0.09471195594  
-0.6193243676  
-1.159677533  
-1.676051091  
-2.132027897  
-2.498133929  
-2.754358481  
-2.891288236  
-2.90978641  
-2.819432579  
-2.636086531  
-2.379085092  
-2.068559157  
-1.723309841  
-1.359510397  
-0.9902972464  
-0.6261516294  
-0.2757979161  
0.05272695181  
0.3511699422  
0.6106181286  
0.8216477305  
0.9750846884  
1.06322099  
1.081258533  
1.028650468  
0.9100624759  
0.735704304  
0.5208913856  
0.2848380936  
0.04880012868  
-0.1661873579  
-0.3416736728  
-0.4639022153  
-0.5253594391  
-0.5255312664  
-0.4707407623  
-0.3730920846  
-0.2486926445  
-0.115415537  
0.009459819878  
0.1113660224  
0.1800546984  
0.2104769833  
0.2028927978  
0.1622573266  
0.09708812184  
0.01802457985  
-0.06363896219  
-0.1372383803  
-0.1937032532  
-0.2261336116  
-0.2300413878  
-0.203322575  
-0.146111317  
-0.06059735552  
0.0491026426  
0.1770193755  
0.3153768237  
0.4546942149  
0.5840241221  
0.6914270585  
0.7647139646  
0.7924688541  
0.7652911433  
0.677150239  
0.5266877889  
0.3182803825  
0.06265969095  
-0.2230864276  
-0.5162712052  
-0.790172978  
-1.016348988  
-1.167530812  
-1.220803779  
-1.160684605  
-0.9816749995  
-0.6898583749  
-0.3032153511  
0.1495247783  
0.6314918522  
1.101492054  
1.518613465  
1.847020538  
2.060269824  
2.144532459  
2.100201713  
1.941617536  
1.694894957  
1.394152382  
1.076670252  
0.7777164297  
0.5258093697  
0.3391538611  
0.2237762708  
0.1736203164  
0.1725272062  
0.1977330972  
0.2242395388  
0.2293094561  
0.1963310558  
0.1174183945  
-0.005621727324  
-0.1620551956  
-0.334487776  
-0.5021814123  
-0.6447828515  
-0.7458123525  
-0.7953271369  
-0.7913426931  
-0.7398389434  
-0.6534283538  
-0.5489764698  
-0.4446333114  
-0.3568094687  
-0.2975916067  
-0.2730245127  
-0.2824816739  
-0.3191861794  
-0.3717306829  
-0.4263030581  
-0.4692199791  
-0.4893472035  
-0.4800237436  
-0.4402130301  
-0.3747296039  
-0.2935429694  
-0.2102901697  
-0.1402344131  
-0.0979654267  
-0.09516006961  
-0.1386946676  
-0.2293472362  
-0.3612641399  
-0.5222528182  
-0.6948917168  
-0.8583495876  
-0.9907205335  
-1.07162402  
-1.084772655  
-1.020193529  
-0.8758234874  
-0.6582342027  
-0.3823536761  
-0.0701498445  
0.2516176275  
0.5543582417  
0.8109847285  
0.9992135013  
1.104402778  
1.121530786  
1.056005178  
0.9231457849  
0.7463451816  
0.5541228174  
0.376429417  
0.2407132423  
0.1682878573  
0.1715319902  
0.2523254031  
0.4019406699  
0.6024049355  
0.8290992705  
1.054189521  
1.250360778  
1.394289142  
1.469361  
1.467275996  
1.388375099  
1.240753552  
1.03837942  
0.7986121168  
0.5395617859  
0.2776991569  
0.02609011269  
-0.2065806477  
-0.4161255058  
