-0.0345652297  
0.2672448357  
0.5488785667  
0.7931944494  
0.9865236193  
1.119790558  
1.189101128  
1.195745797  
1.14566662  
1.048490525  
0.9162822795  
0.7621996322  
0.5992184888  
0.4390626838  
0.2914284114  
0.1635454394  
0.0600496121  
-0.0168871685  
-0.06724156868  
-0.09273317267  
-0.09639098378  
-0.08215869205  
-0.05454785196  
-0.01835408957  
0.0215873034  
0.06062822292  
0.09453658596  
0.1197393195  
0.133573682  
0.1345203891  
0.1223755776  
0.09833480713  
0.06493742428  
0.02585166259  
-0.01449638863  
-0.05142479494  
-0.08057729385  
-0.09849512447  
-0.1031208991  
-0.09411652591  
-0.07296109008  
-0.04278197869  
-0.007915137345  
0.02672742106  
0.05643029616  
0.07744603681  
0.08765669321  
0.08699713225  
0.07755478502  
0.06330387131  
0.04948091625  
0.04167753853  
0.0447761912  
0.06189953344  
0.09354279108  
0.1370657948  
0.1866744605  
0.2339326492  
0.2688003314  
0.2810753385  
0.2620562719  
0.206183263  
0.1124019335  
-0.01499947217  
-0.1662520422  
-0.3267645795  
-0.4785551581  
-0.6023137615  
-0.6798531006  
-0.6966283163  
-0.6439634881  
-0.5206488745  
-0.333643105  
-0.09771546068  
0.1659724789  
0.4322020449  
0.6746700354  
0.8691888471  
0.996683627  
1.045548934  
1.013040779  
0.905480475  
0.7372717529  
0.5288686504  
0.3040126932  
0.08664978713  
-0.1020248523  
-0.2459833189  
-0.3359313311  
-0.3698571651  
-0.3525601765  
-0.2943021788  
-0.2088500219  
-0.111237988  
-0.01560544763  
0.06660038127  
0.1278186083  
0.1648759754  
0.1787767056  
0.1739109169  
0.1568562886  
0.1350044077  
0.1152508168  
0.1029402522  
0.101220209  
0.1108642812  
0.1305407617  
0.1574585881  
0.1882288325  
0.2197820757  
0.250164536  
0.2790700777  
0.3080023634  
0.340037508  
0.3792178436  
0.4296644324  
0.494555311  
0.5751338615  
0.6699236531  
0.7742894232  
0.880446915  
0.9779533943  
1.054654955  
1.097967745  
1.096348149  
1.040752726  
0.9258825374  
0.7510401275  
0.5204747409  
0.2431648393  
-0.06794294907  
-0.3971101046  
-0.7272517796  
-1.041449722  
-1.324335592  
-1.563201246  
-1.748725517  
-1.875304574  
-1.94100995  
-1.947264681  
-1.898349575  
-1.800830154  
-1.663004338  
-1.494397926  
-1.305318305  
-1.106454016  
-0.908462878  
-0.7215294576  
-0.5548712738  
-0.4162042065  
-0.3112154906  
-0.243107943  
-0.2122993603  
-0.2163417856  
-0.250122014  
-0.306348768  
-0.37628925  
-0.4506944964  
-0.5207895652  
-0.5792033276  
-0.6207158879  
-0.6427071924  
-0.6452516448  
-0.630847273  
-0.6038130796  
-0.5694594289  
-0.5331494778  
-0.4994073944  
-0.4712041067  
-0.4495330009  
-0.4333497263  
-0.4198719991  
-0.4052105686  
-0.3852138619  
-0.3564004285  
-0.3168114603  
-0.266633208  
-0.2084575099  
-0.1471061288  
-0.08899095748  
-0.04108355571  
-0.009611784389  
0.001318173107  
-0.009037899551  
-0.03720374223  
-0.07520765333  
-0.1110079785  
-0.1296768504  
-0.1152304096  
-0.05292080324  
0.06833297314  
0.2537447643  
0.5010691372  
0.7999377579  
1.132321944  
1.474153202  
1.797945215  
2.076080332  
2.284301026  
2.404882611  
2.428998499  
2.35789634  
2.202693675  
1.982814617  
1.723307326  
1.451448737  
1.193163095  
0.969774086  
0.7955628043  
0.6764517763  
0.6099553191  
0.5863319397  
0.5907096628  
0.6058047109  
0.6148074025  
0.6039870565  
0.5646592779  
0.4942524286  
0.3963772951  
0.2799400843  
0.1574960204  
0.04311111839  
-0.04991162945  
-0.1111099801  
-0.13444471  
-0.1191853909  
-0.06998504853  
0.003821383147  
0.08958858613  
0.1731717152  
0.240935128  
0.2816589761  
0.2880885155  
0.2579126236  
0.1940448473  
0.1041537039  
-0.0004852935369  
-0.1066704546  
-0.2012589415  
-0.2731762905  
-0.3151650084  
-0.3250017635  
-0.3059956675  
-0.2666515527  
-0.2195291627  
-0.1794243922  
-0.1611288973  
-0.1770872453  
-0.2353054837  
-0.3378468948  
-0.4801614946  
-0.6513809346  
-0.8355746438  
-1.013791057  
-1.166606213  
-1.276810965  
-1.33183819  
-1.325583182  
-1.259344826  
-1.141761027  
-0.9877460059  
-0.8165863225  
-0.6494704716  
-0.5067885605  
-0.4055711118  
-0.3573992727  
-0.3670480267  
-0.4320102226  
-0.5429400466  
-0.6849187331  
-0.8393561661  
-0.9862632782  
-1.106603279  
-1.184424767  
-1.208542783  
-1.173582805  
-1.080308244  
-0.9352392433  
-0.7496564064  
-0.5381508524  
-0.3169248234  
-0.1020639677  
0.092033436  
0.253884641  
0.3757305836  
0.4538629819  
0.4885070315  
0.4833211204  
0.4446349798  
0.3805383857  
0.2999484931  
0.2117557872  
0.1241152362  
0.04392851229  
-0.02348364395  
-0.07453085117  
-0.1073628241  
-0.1217586415  
-0.1189487769  
-0.1013720292  
-0.07239002089  
-0.0359706069  
0.003662747267  
0.04239789102  
0.07660089661  
0.1034435227  
0.1211762157  
0.1292804006  
0.1284899353  
0.1206575803  
0.1084684287  
0.09502893254  
0.08339058634  
0.07606813669  
0.0746349452  
0.07946167869  
0.08965011676  
0.1031842603  
0.1172834725  
0.1289058916  
0.1353265949  
0.1346944607  
0.1264790011  
0.1117140205  
0.09301175482  
0.07431661951  
0.0604392919  
0.05643201679  
0.06689088892  
0.09529165351  
0.1434440596  
0.2111471563  
0.2960933758  
0.3940294024  
0.4991589917  
0.6047311698  
0.7037430479  
0.7896687597  
0.8571339366  
0.9024483124  
0.9239450412  
0.9220956145  
0.8993723295  
0.8598984215  
0.8089164616  
0.7521325929  
0.6950321031  
0.6422354123  
0.5969827256  
0.5608186585  
0.53352478  
0.5133059698  
0.497213719  
0.481742329  
0.4635003887  
0.4398586513  
0.4094398206  
0.3723809597  
0.330302462  
0.2859739061  
0.2427410159  
0.2038010545  
0.1714668742  
0.146565803  
0.1280975435  
0.113247254  
0.09777935153  
0.07676332657  
0.04553002849  
0.0006860235815  
-0.05900314202  
-0.1320424734  
-0.2140905891  
-0.298369081  
-0.3765635801  
-0.4401042465  
-0.4816259261  
-0.4963494769  
-0.4831338667  
-0.4449673612  
-0.3887660337  
-0.3244396947  
-0.2633410252  
-0.2163045128  
-0.1915977699  
-0.1931583269  
-0.2194451368  
-0.2632078883  
-0.3123058066  
-0.3515543025  
-0.3654004841  
-0.3410358485  
-0.2714558376  
-0.1579068204  
-0.01120869578  
0.1484235156  
0.2932246941  
0.3912880596  
0.4111535811  
0.3269519157  
0.1233118523  
-0.2007950519  
-0.6299939184  
-1.132758877  
-1.664109416  
-2.170546064  
-2.596616369  
-2.892189553  
-3.019380186  
-2.958041067  
-2.708939372  
-2.294085619  
-1.754105353  
-1.143008063  
-0.5211433999  
0.05263073023  
0.5283719114  
0.8710295394  
1.064118161  
1.110668336  
1.031436139  
0.860789119  
0.6410091655  
0.4159404834  
0.2249475301  
0.09802847344  
0.052677569  
0.09279168736  
0.2095665144  
0.3840622073  
0.5908867602  
0.8023591514  
0.992506885  
1.140355108  
1.232145624  
1.262297597  
1.233159063  
1.153732089  
1.037694234  
0.9010726672  
0.7599473111  
0.628471103  
0.517428353  
0.4334352883  
0.3787862023  
0.3518570949  
0.3479202642  
0.3602010351  
0.3809853309  
0.4026444811  
0.4184623307  
0.423206951  
0.4134455099  
0.3876236928  
0.3459689821  
0.2902718729  
0.2236001386  
0.1499747003  
0.07401983726  
0.0005922007916  
-0.06563547885  
-0.1206311686  
-0.161492945  
-0.1869406075  
-0.1977305307  
-0.1969263014  
-0.189922928  
-0.1841509625  
-0.1884178075  
-0.2118942054  
-0.262821993  
-0.3470942531  
-0.4668903085  
-0.6196126464  
-0.797334136  
-0.9869496423  
-1.171114396  
-1.329951675  
-1.443385386  
-1.493811472  
-1.468755429  
-1.363094081  
-1.180463762  
-0.933563376  
-0.6432012947  
-0.33613534  
-0.04195480708  
0.2105986645  
0.3973349032  
0.5018110662  
0.5175300421  
0.4487918464  
0.3100950436  
0.1241401358  
-0.08122515477  
-0.2767010552  
-0.4352960884  
-0.5356521027  
-0.5644831261  
-0.517835427  
-0.4010788543  
-0.2276932294  
-0.01711218558  
0.2080265785  
0.4248338713  
0.6129126457  
0.7565730233  
0.8463050672  
0.8793768941  
0.8595964044  
0.7963364114  
0.7030103806  
0.5952396897  
0.4889330012  
0.3985148824  
0.335462957  
0.3072920548  
0.3170299272  
0.3632068348  
0.4402901495  
0.5394996975  
0.6498646861  
0.7594248994  
0.8564310404  
0.9304539872  
0.973299347  
0.9796696471  
0.947543091  
0.8782419368  
0.776220729  
0.6485915822  
0.5044397376  
0.3539866066  
0.2076739567  
0.07523878604  
-0.03515079916  
-0.1176072098  
-0.1690410701  
-0.1894142825  
-0.1817095343  
-0.1516101791  
-0.1069053334  
-0.05668860681  
-0.01040908221  
0.02311640012  
0.03663202507  
0.02520950963  
-0.01323037122  
-0.07771148387  
-0.1643306932  
-0.2667078123  
-0.376717468  
-0.4854054623  
-0.5839801856  
-0.6647640384  
-0.7219737451  
-0.7522356618  
-0.7547806409  
-0.7312819763  
-0.6853928014  
-0.6220353801  
-0.546576439  
-0.4640039649  
-0.3782327188  
-0.2916529259  
-0.2049736006  
-0.1173912394  
-0.02703451733  
0.06838015905  
0.1708064393  
0.2811516005  
0.3987093759  
0.5208446726  
0.6429691002  
0.7588349538  
0.8611062184  
0.9421364243  
0.9948472811  
1.013592748  
0.9948946438  
0.9379419534  
0.8448019801  
0.7202928676  
0.5715538234  
0.4073498162  
0.2372097507  
0.07050050313  
-0.08444405647  
-0.2210355502  
-0.3349093872  
-0.4241164871  
-0.4890366912  
-0.5320422877  
-0.5569988838  
-0.5686896938  
-0.5722617366  
-0.5727712108  
-0.5748888353  
-0.582750615  
-0.5999366342  
-0.6295020328  
-0.6739866826  
-0.7353239279  
-0.8146179628  
-0.9117971184  
-1.025200616  
-1.151212449  
-1.284066859  
-1.415967748  
-1.537601481  
-1.639073267  
-1.711213726  
-1.747091772  
-1.743513147  
-1.702230268  
-1.630587493  
-1.541375033  
-1.451767356  
-1.381357166  
-1.349442432  
-1.371880184  
-1.457936068  
-1.60762194  
-1.810002124  
-2.042866618  
-2.274014174  
-2.46415218  
-2.571201589  
-2.555529559  
-2.385448918  
-2.042232374  
-1.523851541  
-0.8468180936  
-0.04570045311  
0.8297614957  
1.719674665  
2.560546629  
3.29249756  
3.86615579  
4.248247277  
4.425112008  
4.403663044  
4.20969321  
3.883838339  
3.475828919  
3.037901723  
2.618308507  
2.255813467  
1.975857628  
1.788789252  
1.690247249  
1.663447115  
1.682911511  
1.718996104  
1.742517116  
1.728864522  
1.661082397  
1.531608765  
1.342589864  
1.104847409  
0.8357940846  
0.5566595769  
0.289463047  
0.05414708928  
-0.1337826166  
-0.2648537389  
-0.3363460004  
-0.3521269761  
-0.3217028099  
-0.2587025126  
-0.1790074769  
-0.09881043017  
-0.03281737653  
0.007195832774  
0.01337077435  
-0.01776617835  
-0.08534396986  
-0.1846052512  
-0.3076937346  
-0.4446312379  
-0.5843809606  
-0.7158801263  
-0.8289785034  
-0.915233057  
-0.9685247225  
-0.985489733  
-0.9657540552  
-0.9119527312  
-0.8295372626  
-0.7263410143  
-0.6119196858  
-0.4966896209  
-0.3909057943  
-0.3035791791  
-0.2414393394  
-0.2080782168  
-0.2034024737  
-0.223507055  
-0.2610294675  
-0.305994642  
-0.3470775483  
-0.3731501066  
-0.3749321361  
-0.3464999888  
-0.2864551592  
-0.198536783  
-0.0915610659  
0.02136201126  
0.1242765971  
0.2003444269  
0.2340867611  
0.2136136915  
0.1325392699  
-0.00869560058  
-0.2023139579  
-0.4336130114  
-0.6822958716  
-0.9245957888  
-1.135930358  
-1.293783645  
-1.38041013  
-1.38502154  
-1.30513298  
-1.146900878  
-0.9243743243  
-0.6577896042  
-0.3711380724  
-0.08934414759  
0.164541249  
0.3717619157  
0.5195946732  
0.6022045787  
0.6205864829  
0.5816733359  
0.4968227244  
0.3799637637  
0.2456983362  
0.1076246811  
-0.02290753256  
-0.1375212551  
-0.2310029916  
-0.3010530609  
-0.3477420927  
-0.3728569232  
-0.3792848887  
-0.3705693351  
-0.3506833649  
-0.324007721  
-0.2954310343  
-0.2704483632  
-0.2551335959  
-0.2558573456  
-0.2787146927  
-0.3286487104  
-0.4083929585  
-0.5173819235  
-0.6508487781  
-0.7993457949  
-0.9488781848  
-1.081765737  
-1.17825724  
-1.218759411  
-1.186448078  
-1.069900174  
-0.8653602139  
-0.5782376007  
-0.2235250459  
0.1750335413  
0.5870281242  
0.9785210705  
1.31584941  
1.569608552  
1.718251902  
1.750785463  
1.668177202  
1.483247864  
1.219073787  
0.9061131633  
0.5784709674  
0.2698129887  
0.009486032963  
-0.1806550903  
-0.2883499814  
-0.3117421134  
-0.2588791103  
-0.146054012  
0.004721014437  
0.1687324138  
0.3216676816  
0.4424215768  
0.5152965318  
0.5313968927  
0.4891190492  
0.3937643295  
0.2564049124  
0.09217755039  
-0.08173220249  
-0.248175975  
-0.3919608095  
-0.5013826506  
-0.5692492445  
-0.5932937956  
-0.5759803573  
-0.5237607348  
-0.4458980137  
-0.3530366451  
-0.2556933702  
-0.162897078  
-0.08113691634  
-0.01376781545  
0.03905160675  
0.07988747279  
0.1131103732  
0.1436729753  
0.1757963717  
0.2118043378  
0.2513194934  
0.291016218  
0.3250151819  
0.3459210647  
0.3463880443  
0.3209658692  
0.2679328342  
0.1907560421  
0.09885431581  
0.007399048456  
-0.06395145136  
-0.09334978305  
-0.05984354792  
0.05315399053  
0.2545356847  
0.5428632034  
0.9049538782  
1.316040913  
1.741658943  
2.141124533  
2.47220812  
2.696378184  
2.783850917  
2.717680756  
2.496242031  
2.133691378  
1.658317095  
1.109022009  
0.530486733  
-0.03224263665  
-0.5389222837  
-0.9582868363  
-1.270699938  
-1.469014002  
-1.557704307  
-1.550611934  
-1.467829068  
-1.33233731  
-1.166964613  
-0.9920846924  
-0.8242465198  
-0.6757433228  
-0.5548831972  
-0.4666661715  
-0.4135304176  
-0.3958940617  
-0.4123689053  
-0.4596562271  
-0.5322840257  
-0.6223933698  
-0.7198152552  
-0.8125852993  
-0.8879450511  
-0.9337450536  
-0.9400356627  
-0.9005886949  
-0.8140465672  
-0.6844949779  
-0.5213170452  
-0.3383488176  
-0.152455224  
0.01825898637  
0.1563251658  
0.2466497751  
0.2779068075  
0.2434957276  
0.1420493239  
-0.0224492103  
-0.2408390773  
-0.4991636374  
-0.7792108842  
-1.059223742  
-1.314864447  
-1.520509597  
-1.65097429  
-1.683660537  
-1.601042981  
-1.393247003  
-1.060387968  
-0.6142386238  
-0.0788027216  
0.5105268035  
1.109387246  
1.66836156  
2.13802707  
2.474563594  
2.645155589  
2.632399445  
2.437004918  
2.078291174  
1.592300482  
1.027708002  
0.4400252609  
-0.1151108013  
-0.5886712025  
-0.9440670473  
-1.161306535  
-1.238958736  
-1.193702407  
-1.057573895  
-0.8733437296  
-0.6886319793  
-0.5495658901  
-0.4947439287  
-0.550242446  
-0.7262289992  
-1.015524996  
-1.39425593  
-1.824448348  
-2.258258533  
-2.643325676  
-2.928645173  
-3.070310146  
-3.036480545  
-2.811056817  
-2.395639484  
-1.809586466  
-1.088161666  
-0.2789971712  
0.5627124368  
1.379730359  
2.118380119  
2.73358474  
3.192804983  
3.47846166  
3.588638394  
3.536083746  
3.345726027  
3.051086102  
2.690087822  
2.300789447  
1.917535093  
1.567931397  
1.270915021  
1.036020738  
0.863811299  
0.7472843079  
0.6739850637  
0.6284931313  
0.5949400567  
0.5592495139  
0.5108544306  
0.4437248628  
0.3566586554  
0.2528447741  
0.1388371718  
0.02311162065  
-0.08557101814  
-0.1797491409  
-0.254588848  
-0.3087539189  
-0.3447191574  
-0.3684830946  
-0.3887057101  
-0.4154113876  
-0.4584078846  
-0.5256539101  
-0.6218032294  
-0.7471213714  
-0.8969735292  
-1.061956934  
-1.228722162  
-1.38138939  
-1.503419615  
-1.579688896  
-1.598500532  
-1.553245045  
-1.443456496  
-1.275097156  
-1.059998861  
-0.8145177028  
-0.5576011847  
