------------------------------------------
Setting up environment variables
---
LD_LIBRARY_PATH is .:/opt/software/fix/1.065/MATLAB_Compiler_Runtime/v83/runtime/glnxa64:/opt/software/fix/1.065/MATLAB_Compiler_Runtime/v83/bin/glnxa64:/opt/software/fix/1.065/MATLAB_Compiler_Runtime/v83/sys/os/glnxa64
Warning: Name is nonexistent or not a directory: /usr/local/fsl/etc/matlab
[> In path at 109
  In startup at 1] 
Warning: Name is nonexistent or not a directory: /usr/local/fmrib/fmt
[> In path at 109
  In startup at 2] 
/home/mpib/LNDG/StateSwitch/WIP_rest/preproc/B_data/D_preproc/2140/preproc/rest/FEAT.feat/
    29     1

    29     2

    29     3

    29     4

    29     5

    29     6

    29     7

    29     8

    29     9

    29    10

    29    11

    29    12

    29    13

    29    14

    29    15

    29    16

    29    17

    29    18

    29    19

    29    20

    29    21

    29    22

    29    23

    29    24

    29    25

    29    26

    29    27

    29    28

    29    29

End of Matlab Script
