-0.4283676494  
-0.4005873836  
-0.3641736025  
-0.3139167212  
-0.2465262034  
-0.1611005068  
-0.05926732227  
0.05502227802  
0.1760290291  
0.2969891549  
0.4110048017  
0.5119221374  
0.5950576348  
0.6576689151  
0.6991088851  
0.7206606974  
0.7250972176  
0.7160640955  
0.6974021495  
0.6725331495  
0.6440102858  
0.613296865  
0.580802404  
0.5461376285  
0.5085365885  
0.4673539607  
0.4225401871  
0.3750063061  
0.3268078891  
0.2811096586  
0.2419319349  
0.2137031719  
0.200685184  
0.2063508871  
0.2328140181  
0.2803925897  
0.3473951541  
0.4301486086  
0.5233083218  
0.620387862  
0.7144601074  
0.7989246008  
0.8682356921  
0.9184969016  
0.9478348403  
0.9565110671  
0.9467649269  
0.9224181064  
0.8883109736  
0.8496437872  
0.8113335838  
0.7774503638  
0.750808636  
0.7327578908  
0.7231722242  
0.7206222459  
0.7226823914  
0.7263255333  
0.7283298923  
0.7256476822  
0.715706609  
0.696599443  
0.6671935612  
0.6271472688  
0.5768642893  
0.5174083259  
0.4503848409  
0.3777867417  
0.3018216709  
0.2247000913  
0.1483976169  
0.07441232652  
0.00354600127  
-0.06425465015  
-0.1299490516  
-0.1953081952  
-0.2626768612  
-0.3345870649  
-0.4132731199  
-0.5001536063  
-0.595364819  
-0.6974352794  
-0.8031799163  
-0.9078768635  
-1.005718943  
-1.09052529  
-1.156612759  
-1.199702915  
-1.21771778  
-1.211304414  
-1.18397225  
-1.141777174  
-1.092553827  
-1.044781331  
-1.00623147  
-0.9826079531  
-0.9763964829  
-0.9861196015  
-1.0061561  
-1.027196812  
-1.037299529  
-1.023450079  
-0.9734117213  
-0.8776221097  
-0.7308770192  
-0.533538005  
-0.2920890627  
-0.01892574841  
0.2686257541  
0.5499644015  
0.8033559147  
1.008307562  
1.147884595  
1.210680826  
1.192182656  
1.095375964  
0.9304707214  
0.7138076031  
0.4660479349  
0.2098693885  
-0.03254315548  
-0.2419195023  
-0.4039265885  
-0.5105497556  
-0.560673948  
-0.559784855  
-0.5188665941  
-0.4526345417  
-0.3773673679  
-0.3086269863  
-0.2591891118  
-0.2374435833  
-0.2464781298  
-0.2839330632  
-0.3426159315  
-0.4117419345  
-0.4786100604  
-0.5304402579  
-0.5561382948  
-0.5477347665  
-0.5013598902  
-0.417656887  
-0.3016338036  
-0.1620200881  
-0.0102539625  
0.1407511208  
0.2779082869  
0.3891685349  
0.4645521922  
0.4968978701  
0.4823159243  
0.4203375766  
0.3137867123  
0.1684463743  
-0.007452710296  
-0.2038352967  
-0.4094517653  
-0.6125588955  
-0.8015911278  
-0.9657980248  
-1.095813453  
-1.184132  
-1.22547189  
-1.216988418  
-1.158329359  
-1.051543967  
-0.900843833  
-0.7122820734  
-0.4933777425  
-0.2527360845  
0.0003008581939  
0.2559594969  
0.5043107525  
0.7355378173  
0.9402310968  
1.109741153  
1.236591469  
1.314949306  
1.341089589  
1.313811051  
1.234713336  
1.108269734  
0.9416677491  
0.7443842598  
0.5275598494  
0.3032144852  
0.08342424081  
-0.1204394873  
-0.2983147353  
-0.4418490347  
-0.5445536919  
-0.6017617623  
-0.6104577108  
-0.5690633635  
-0.477282569  
-0.336070349  
-0.1477587132  
0.08369444067  
0.3523828583  
0.65018758  
0.9666660765  
1.289207969  
1.60351082  
1.894381923  
2.146804521  
2.347157915  
2.484433985  
2.551301069  
2.544862578  
2.467012532  
2.324331767  
2.127528385  
1.890494697  
1.629056624  
1.359578694  
1.097532826  
0.8562022015  
0.6456205629  
0.4718634881  
0.3367359304  
0.2378917999  
0.1693368709  
0.1222671749  
0.08611843425  
0.04971866922  
0.002408602816  
-0.06496776478  
-0.1592851362  
-0.284619991  
-0.4419810633  
-0.6292913786  
-0.8415772922  
-1.071331965  
-1.309037751  
-1.543825208  
-1.764261524  
-1.959242589  
-2.118958162  
-2.235853548  
-2.305508868  
-2.327305184  
-2.304765575  
-2.245467645  
-2.160464935  
-2.063204383  
-1.968028686  
-1.888394056  
-1.835024601  
-1.814260549  
-1.826843144  
-1.867366595  
-1.924534192  
-1.982256346  
-2.021492364  
-2.022641153  
-1.968169097  
-1.845113738  
-1.647110994  
-1.375644135  
-1.040303081  
-0.6579964676  
-0.251202049  
0.1545272117  
0.5334635265  
0.8626297615  
1.12436552  
1.308187878  
1.411740638  
1.440710023  
1.407759797  
1.330650721  
1.229807482  
1.125661978  
1.036109587  
0.9744002901  
0.9476964367  
0.9564654398  
0.994748822  
1.051253309  
1.1110954  
1.157980202  
1.176519998  
1.154415947  
1.084233933  
0.9645697263  
0.8004780547  
0.6031253711  
0.3887297226  
0.1768875943  
-0.01150130602  
-0.1565058858  
-0.2414044085  
-0.2546573827  
-0.1914117625  
-0.05437328866  
0.146076329  
0.3925568076  
0.6621422155  
0.9284789712  
1.164385499  
1.344666607  
1.448848374  
1.46349821  
1.383851314  
1.214486188  
0.9689422151  
0.6682683982  
0.3386491723  
0.00837688967  
-0.2954563436  
-0.5501287052  
-0.7399100113  
-0.8577744511  
-0.9059805402  
-0.8954282861  
-0.8438744373  
-0.7732518294  
-0.7064475937  
-0.6639835001  
-0.6610638884  
-0.7053794047  
-0.795985423  
-0.9233761119  
-1.070753483  
-1.216288402  
-1.336055129  
-1.407231796  
-1.411142342  
-1.335740756  
-1.177251834  
-0.9407755624  
-0.6398275749  
-0.2949156135  
0.06865408994  
0.4234413868  
0.7426998051  
1.003041992  
1.186661504  
1.282897906  
1.288998391  
1.210038843  
1.058048828  
0.8504702615  
0.6081610883  
0.3531858217  
0.1066656685  
-0.113067011  
-0.2918268014  
-0.4203146077  
-0.494252166  
-0.5139561406  
-0.4835265867  
-0.4098273366  
-0.3014645657  
-0.167894814  
-0.01879449931  
0.1363355509  
0.2883363224  
0.4284542048  
0.5484086958  
0.6405528247  
0.6981993194  
0.7160950908  
0.6910100653  
0.6223183358  
0.5124516955  
0.3671139646  
0.1951366176  
0.007953557477  
-0.1813013346  
-0.3589822296  
-0.5122711214  
-0.6304900679  
-0.7062019384  
-0.7359393115  
-0.7204541192  
-0.6644465891  
-0.575819958  
-0.4645747237  
-0.3415194228  
-0.2169815209  
-0.09971228984  
0.00385644531  
0.08994115967  
0.157291632  
0.2067020699  
0.2402728252  
0.2605645998  
0.2698266044  
0.2694184758  
0.259534781  
0.2392637604  
0.2069599441  
0.1608452901  
0.09972434478  
0.02367646771  
-0.06541664314  
-0.1636142593  
-0.2649945584  
-0.3620912802  
-0.4466371818  
-0.5105216977  
-0.5468282668  
-0.5507943924  
-0.5205385134  
-0.457437177  
-0.3660592422  
-0.2536527201  
-0.1292288558  
-0.00236850139  
0.1181045937  
0.225356287  
0.3155123032  
0.3881862694  
0.4464656672  
0.4963148283  
0.5454798456  
0.602019637  
0.6726944972  
0.7614548328  
0.8682829426  
0.9885991266  
1.11336298  
1.229895905  
1.323342531  
1.378591193  
1.382356784  
1.32514958  
1.202794413  
1.017282491  
0.7768128796  
0.4950014909  
0.1893885344  
-0.1205343215  
-0.4154782493  
-0.6783813604  
-0.8960219257  
-1.060027728  
-1.167188689  
-1.219099688  
-1.221264214  
-1.181868341  
-1.11043691  
-1.016619053  
-0.9092594496  
-0.7958477115  
-0.6823638993  
-0.5734190495  
-0.4725925324  
-0.3827692953  
-0.3063663992  
-0.2453593762  
-0.201083868  
-0.1738888117  
-0.1627540888  
-0.1650232684  
-0.1763756217  
-0.1911289866  
-0.2028749043  
-0.2053715472  
-0.193571686  
-0.1645904071  
-0.1184400632  
-0.05839050994  
0.009166983031  
0.07534128251  
0.1298109459  
0.1621972519  
0.1635659012  
0.1278306083  
0.05286290606  
-0.05888985222  
-0.2003922045  
-0.3606523762  
-0.5259438502  
-0.6814744747  
-0.8132691421  
-0.9100163275  
-0.9645907838  
-0.9750206683  
-0.9447533479  
-0.8821417932  
-0.7992296841  
-0.7099938202  
-0.6282961341  
-0.5658518579  
-0.5305025055  
-0.5250666801  
-0.5469324793  
-0.5884573348  
-0.6381121111  
-0.6821978801  
-0.7068701953  
-0.7001656433  
-0.653741187  
-0.5640643803  
-0.4329128429  
-0.2671426663  
-0.07777883335  
0.121400525  
0.3155669138  
0.4905978826  
0.634646798  
0.7393467482  
0.8005324184  
0.8184237008  
0.797308948  
0.7447968692  
0.6707896635  
0.5863104588  
0.5023555425  
0.4288920864  
0.3741029741  
0.343929291  
0.3419043094  
0.3692361788  
0.4250780444  
0.5068768831  
0.6107382769  
0.7317292295  
0.8640809996  
1.001298028  
1.136210259  
1.261024469  
1.36746566  
1.447090467  
1.491814119  
1.494670142  
1.450732473  
1.358092418  
1.218699417  
1.038887334  
0.8293849737  
0.6047041481  
0.381881094  
0.1786683447  
0.01139751394  
-0.1071865521  
-0.1697639551  
-0.1756271292  
-0.1309817604  
-0.04825030233  
0.05556419728  
0.1612429922  
0.2500850106  
0.3066195987  
0.3208486698  
0.2896794586  
0.2173023035  
0.1144536073  
-0.003336889525  
-0.1182460372  
-0.2130153996  
-0.2737257774  
-0.2920501302  
-0.2666400503  
-0.2034211118  
-0.114744615  
-0.01753289829  
0.06932204134  
0.1279091584  
0.144154739  
0.1101664039  
0.02570981826  
-0.1014150061  
-0.2561573749  
-0.4180802379  
-0.5640479304  
-0.6713753952  
-0.7210125889  
-0.7003348777  
-0.6051472518  
-0.440643712  
-0.2211772862  
0.03112614261  
0.2887484647  
0.5218565816  
0.7017113584  
0.8039922238  
0.8116567982  
0.7169981563  
0.5226765828  
0.2415960237  
-0.1043492602  
-0.4865102259  
-0.8724546441  
-1.229334331  
-1.527264449  
-1.7423502  
-1.859007619  
-1.87134392  
-1.783457027  
-1.608643597  
-1.36765511  
-1.086223415  
-0.7921990254  
-0.5126396359  
-0.2712153808  
-0.08620391968  
0.03073204624  
0.07489891669  
0.04812391048  
-0.04234917943  
-0.1853966947  
-0.3677062509  
-0.5753751883  
-0.7951982078  
-1.01550344  
-1.22650097  
-1.420183977  
-1.589900818  
-1.729780113  
-1.834187705  
-1.897390111  
-1.913534743  
-1.876988978  
-1.783011306  
-1.628642539  
-1.413657049  
-1.141397369  
-0.8193093275  
-0.4590457065  
-0.07604491639  
0.3113989789  
0.6835137455  
1.020721653  
1.305405307  
1.523563221  
1.666137636  
1.729862378  
1.717524906  
1.637627443  
1.503487543  
1.331903058  
1.141524597  
0.9511206377  
0.7779077506  
0.6360938644  
0.5357815374  
0.4822939233  
0.4759856995  
0.5125381413  
0.5837057125  
0.6784242256  
0.7841896422  
0.8885378105  
0.9804914106  
1.05177153  
1.097650554  
1.117306279  
1.113638917  
1.092550982  
1.061795811  
1.029544817  
1.002897476  
0.9865460708  
0.9818247131  
0.9862915761  
0.9939363533  
0.996012286  
0.982382287  
0.9431894013  
0.8706236373  
0.7604776952  
0.6132595519  
0.4346430004  
0.2351471098  
0.02905531512  
-0.167314263  
-0.3377470326  
-0.4683758697  
-0.5496998451  
-0.578066811  
-0.5563705749  
-0.4938449639  
-0.4049410289  
-0.3074331374  
-0.2199932588  
-0.1595809261  
-0.1390097068  
-0.1650509967  
-0.2373587381  
-0.3483823665  
-0.4843072311  
-0.6269011073  
-0.7560108452  
-0.8523754778  
-0.9003413749  
-0.8900967782  
-0.8191129719  
-0.6925683103  
-0.5227045847  
-0.3272108835  
-0.1268633658  
0.05722050229  
0.2063235717  
0.3064545472  
0.3499388761  
0.3360559311  
0.270659112  
0.1648885833  
0.03321099106  
-0.1088727049  
-0.2470565065  
-0.3700598004  
-0.4707654128  
-0.5465345661  
-0.598694023  
-0.6313551004  
-0.6498140276  
-0.6588743953  
-0.6614185085  
-0.6575107737  
-0.6442212382  
-0.616205571  
-0.5669406449  
-0.490404009  
-0.3828456403  
-0.2443230146  
-0.07966460106  
0.1013667489  
0.2848082543  
0.454040358  
0.5919400396  
0.683291464  
0.717064935  
0.6882004144  
0.5985927351  
0.4571169466  
0.2787004894  
0.08256855113  
-0.1100607103  
-0.2785141929  
-0.4050751943  
-0.4769676403  
-0.4876790919  
-0.4375056182  
-0.3332815156  
-0.1873941266  
-0.01622994277  
0.1617381851  
0.3279778695  
0.4658336363  
0.5621574958  
0.6084858983  
0.6016626406  
0.5438565213  
0.4419964473  
0.3066962629  
0.1507882191  
-0.01234927637  
-0.1704855947  
-0.3140340898  
-0.4371534428  
-0.5383109169  
-0.6202129811  
-0.6890952718  
-0.7534648602  
-0.8224669432  
-0.9041019188  
-1.003572197  
-1.122020675  
-1.255865043  
-1.396871641  
-1.532976706  
-1.64976513  
-1.732393556  
-1.767688169  
-1.746082732  
-1.663125716  
-1.520290714  
-1.324988273  
-1.089756312  
-0.8307599489  
-0.5658279663  
-0.3123126956  
-0.08509997979  
0.1049591632  
0.2519972357  
0.3553522655  
0.4190916828  
0.450968454  
0.4610022341  
0.4599368562  
0.4578087419  
0.4628222881  
0.4806601504  
0.514262477  
0.564040121  
0.6284104119  
0.7045077319  
0.7889071566  
0.8782420234  
0.9696099427  
1.060745014  
1.149992994  
1.236138984  
1.318187974  
1.395188574  
1.46614828  
1.530068147  
1.586084246  
1.633646394  
1.672687865  
1.703699965  
1.727690335  
1.746009434  
1.76007599  
1.7710691  
1.779660125  
1.785851746  
1.78896897  
1.787814242  
1.780930519  
1.766932995  
1.744792602  
1.714015537  
1.674635021  
1.62700543  
1.571411186  
1.507557874  
1.434042573  
1.347924845  
1.244524774  
1.117532244  
0.9595143822  
0.7627867722  
0.5206059406  
0.22852967  
-0.1142382637  
-0.5037420626  
-0.930614278  
-1.3800379  
-1.832430312  
-2.264837126  
-2.652934551  
-2.973435826  
-3.206604484  
-3.33856487  
-3.363083715  
-3.282569908  
-3.108117618  
-2.858551948  
-2.558566639  
-2.236161962  
-1.919700204  
-1.634926297  
-1.402337378  
-1.235204188  
-1.138474248  
-1.108661189  
-1.134712762  
-1.199700987  
-1.283106716  
-1.363404258  
-1.420620982  
-1.438578839  
-1.406571098  
-1.320326103  
-1.18216644  
-1.000417843  
-0.788178731  
-0.5616295668  
-0.3381175703  
-0.1342409447  
0.03583720227  
0.161691915  
0.2374153287  
0.2618437041  
0.2382295891  
0.1734571108  
0.07691000214  
-0.04082697528  
-0.1692654896  
-0.299122949  
-0.4231046303  
-0.5362563523  
-0.6358497645  
-0.7208478561  
-0.7910502582  
-0.8460856356  
-0.8844607968  
-0.9028545173  
-0.8958398551  
-0.8561403592  
-0.7754421883  
-0.6456697877  
-0.4605422351  
-0.2171572322  
0.0827112444  
0.4318735378  
0.8177536985  
1.223255869  
1.628418874  
2.012605524  
2.356898112  
2.64629278  
2.871298649  
3.02866628  
3.121098594  
3.15603061  
3.143701703  
3.094913355  
3.018913943  
2.921822074  
2.805883602  
2.669694235  
2.509301825  
2.319947649  
2.098045608  
1.842981768  
1.558332495  
1.252232296  
0.9367880233  
0.6266315005  
0.3368753246  
0.08085802431  
-0.1318945877  
-0.2970917155  
-0.4162154083  
-0.4960669045  
-0.5474019677  
-0.5829252491  
-0.6150025416  
-0.6535419577  
-0.7044039472  
-0.7686281169  
-0.8425886137  
-0.9190163227  
-0.9886636122  
-1.042288625  
-1.072582035  
-1.075690576  
-1.052070886  
-1.006554059  
-0.9476076684  
-0.8859514568  
-0.8327714137  
-0.7978144811  
-0.7876955745  
-0.8046722716  
-0.846078755  
-0.9045217375  
-0.9688111017  
-1.025517622  
-1.060936825  
-1.063200813  
-1.024250039  
-0.941353823  
-0.8179678592  
-0.6637399545  
-0.4936334367  
-0.3262259792  
-0.1813987559  
-0.07770069919  
-0.02976893238  
-0.04617715879  
-0.1280446266  
-0.2686184564  
-0.4539167627  
-0.6643559092  
-0.8771173812  
-1.068919348  
-1.218798003  
-1.310500267  
-1.334172684  
-1.287150752  
-1.173785039  
-1.004404066  
-0.7936202043  
-0.5582730057  
-0.3153184826  
-0.0799703319  
0.1356934054  
0.3235178764  
0.4794352414  
0.6030675217  
0.6969298728  
0.7654234912  
0.8138076744  
0.8473472429  
0.8707190519  
0.8877396991  
0.9013662331  
0.9138894882  
0.9271962023  
0.9429930229  
0.962906614  
