0.3342464695  
0.4070652658  
0.4865458522  
0.5782947463  
0.6866111587  
0.8139094343  
0.9602690877  
1.123171624  
1.297496894  
1.475807537  
1.648956414  
1.806971093  
1.940134555  
2.040135018  
2.101124502  
2.120530503  
2.099464445  
2.042664498  
1.957928574  
1.855128206  
1.744914564  
1.637320706  
1.54046388  
1.459540325  
1.396276542  
1.348904123  
1.312670723  
1.280788523  
1.245670491  
1.20026756  
1.139271934  
1.060032689  
0.9630041538  
0.85169553  
0.7321092253  
0.6117735605  
0.4985247855  
0.3992377288  
0.3187039287  
0.2588573095  
0.2184553587  
0.1932769461  
0.1768082985  
0.1612898564  
0.1389606782  
0.1032830376  
0.04995632122  
-0.02246079314  
-0.1124048302  
-0.2156594469  
-0.3261348353  
-0.4369338548  
-0.5415149562  
-0.6347554269  
-0.7137403558  
-0.778152566  
-0.8302185697  
-0.8742370663  
-0.9158033274  
-0.9608671802  
-1.014814414  
-1.081719969  
-1.163903171  
-1.261837777  
-1.374405601  
-1.499412022  
-1.634239552  
-1.776475582  
-1.92437668  
-2.077052996  
-2.234322832  
-2.396250648  
-2.562453782  
-2.731319251  
-2.899289095  
-3.060383264  
-3.206088664  
-3.325688659  
-3.407034193  
-3.437680564  
-3.406249003  
-3.303826387  
-3.12520745  
-2.869788802  
-2.541983097  
-2.151075488  
-1.710544823  
-1.236918391  
-0.7483298064  
-0.2629498453  
0.2024923232  
0.6339260798  
1.020760133  
1.356228699  
1.637275454  
1.864032231  
2.03902725  
2.166261209  
2.250312775  
2.295621208  
2.30602286  
2.284596486  
2.233803181  
2.155852934  
2.053204441  
1.929066611  
1.78780212  
1.635107038  
1.4779293  
1.324080657  
1.181590121  
1.057863239  
0.9587709384  
0.88780408  
0.8454401716  
0.8288449858  
0.8320034888  
0.8463081427  
0.8615595878  
0.8672858451  
0.8541994849  
0.8155966032  
0.7484758062  
0.6542064144  
0.538588998  
0.4112854637  
0.284650542  
0.1721135387  
0.08632081809  
0.03731402764  
0.0309966394  
0.06813868643  
0.1440635587  
0.2490919706  
0.3696715102  
0.4900428875  
0.5942141309  
0.6679311641  
0.7004053135  
0.6855310407  
0.6224613166  
0.5154920017  
0.3733012789  
0.2077062178  
0.03213110032  
-0.1399766505  
-0.2965655834  
-0.428070815  
-0.5280758931  
-0.5935144499  
-0.6244656987  
-0.6236352263  
-0.5956514298  
-0.5462952022  
-0.4817956586  
-0.4082491092  
-0.3312237878  
-0.2555299799  
-0.1851514963  
-0.1232754714  
-0.07237688491  
-0.03431577089  
-0.01040164136  
-0.001426558023  
-0.007648787217  
-0.0287503486  
-0.06378272861  
-0.1111279625  
-0.1684859114  
-0.2329087536  
-0.3008869036  
-0.3684878718  
-0.4315432009  
-0.485871653  
-0.5275343648  
-0.5531028934  
-0.5599266212  
-0.5463906887  
-0.5121382978  
-0.4582398845  
-0.387288179  
-0.3033844285  
-0.2120068506  
-0.1197360831  
-0.0338396322  
0.03825910309  
0.08960333801  
0.1143573385  
0.1084178738  
0.06992368848  
-0.0004160609667  
-0.09921926277  
-0.2205838865  
-0.3564987556  
-0.4974731825  
-0.6333277395  
-0.7540685195  
-0.8507404646  
-0.9161801989  
-0.945584878  
-0.9368388585  
-0.8905834577  
-0.8100290078  
-0.7005535184  
-0.5691412361  
-0.4237379196  
-0.2725887375  
-0.1236228829  
0.016065304  
0.1406226905  
0.2457023171  
0.3285997039  
0.3882606417  
0.4251743676  
0.4411584137  
0.4390477721  
0.4223151067  
0.3946321198  
0.3594431624  
0.3195695884  
0.2769313152  
0.2324206413  
0.1859721102  
0.1368369908  
0.08401449881  
0.02678811764  
-0.0347442312  
-0.09926325901  
-0.1640363906  
-0.2250233599  
-0.2772966446  
-0.3157277786  
-0.3358458104  
-0.3347155902  
-0.3116743716  
-0.2687724531  
-0.2108125323  
-0.1449457253  
-0.07986288593  
-0.02468592211  
0.01226182804  
0.02463212259  
0.008968209275  
-0.03476945334  
-0.103150903  
-0.1897193576  
-0.2858332555  
-0.3817914862  
-0.468061171  
-0.5364172706  
-0.5808491656  
-0.598095805  
-0.5877724898  
-0.5520898047  
-0.4952521356  
-0.422645637  
-0.3399669271  
-0.2524324005  
-0.1641857369  
-0.07798094567  
0.00484888797  
0.08415221779  
0.1605405661  
0.2348900305  
0.307873618  
0.3796294353  
0.4496292319  
0.5167749048  
0.5796895452  
0.6371337427  
0.6884560196  
0.7339444211  
0.7750002901  
0.8140507106  
0.854195939  
0.898633162  
0.9499469633  
1.009393541  
1.076340015  
1.147960483  
1.219288676  
1.283637913  
1.333354349  
1.360771459  
1.35924151  
1.324059928  
1.253140839  
1.147336128  
1.010354323  
0.848301442  
0.6689360189  
0.480756479  
0.2920818565  
0.1102534577  
-0.05893872993  
-0.2115387912  
-0.3454392216  
-0.460160645  
-0.5564901362  
-0.6360756455  
-0.701063139  
-0.7538298454  
-0.7968363354  
-0.8325864185  
-0.863622898  
-0.8925263188  
-0.921839504  
-0.9538909657  
-0.9905185696  
-1.032732141  
-1.080374614  
-1.131873138  
-1.184148805  
-1.23275924  
-1.272283096  
-1.296933794  
-1.301332534  
-1.281342888  
-1.234828489  
-1.162224956  
-1.066794463  
-0.9545030648  
-0.8334912152  
-0.7131695519  
-0.6030469281  
-0.5114197286  
-0.4441166013  
-0.4034747776  
-0.3877340385  
-0.39097105  
-0.4036369743  
-0.4136752677  
-0.408109598  
-0.374903172  
-0.3048360359  
-0.1931249312  
-0.0405264677  
0.1462825288  
0.3551394547  
0.5696382393  
0.7710306332  
0.940545853  
1.0618112  
1.123020838  
1.118552563  
1.049787801  
0.9250140214  
0.7584299994  
0.5683816626  
0.3750919548  
0.1981943094  
0.05441556234  
-0.04428546964  
-0.09189830048  
-0.08871215182  
-0.04084368763  
0.0409525302  
0.1429964318  
0.2506405367  
0.3502048973  
0.4306056047  
0.4844905005  
0.508742541  
0.5043403695  
0.4756401927  
0.429222363  
0.3725119158  
0.3123998418  
0.2540582825  
0.200144814  
0.1504775413  
0.1022329775  
0.05060072956  
-0.01020033505  
-0.08571274907  
-0.1800294742  
-0.2947477808  
-0.4282643322  
-0.5755000921  
-0.7281143164  
-0.8751841812  
-1.0042646  
-1.102693986  
-1.15898249  
-1.16410013  
-1.112518217  
-1.002865022  
-0.8381338392  
-0.625432057  
-0.3753084356  
-0.1007680946  
0.1839126762  
0.4644238478  
0.7275787706  
0.9622805274  
1.160220404  
1.3162592  
1.428496173  
1.49803731  
1.528520283  
1.525447794  
1.49540462  
1.445224232  
1.381182204  
1.308287498  
1.229734528  
1.146585627  
1.057727178  
0.9601239476  
0.8493800181  
0.7205567274  
0.5691756378  
0.3922994785  
0.1895295217  
-0.03621416187  
-0.2783026541  
-0.5264897058  
-0.7675694537  
-0.9865671401  
-1.1683754  
-1.299654993  
-1.370754102  
-1.377386247  
-1.321776884  
-1.213089541  
-1.066984342  
-0.9043022527  
-0.7489849503  
-0.6254482311  
-0.5557265398  
-0.5567224441  
-0.6379210141  
-0.7998520998  
-1.033500755  
-1.320758931  
-1.635882689  
-1.947811057  
-2.223098144  
-2.429167352  
-2.537548816  
-2.526766247  
-2.384596376  
-2.109460141  
-1.71081889  
-1.208529074  
-0.6312200797  
-0.01386403867  
0.6052263949  
1.187683341  
1.698315578  
2.107999668  
2.39594128  
2.551132998  
2.572876028  
2.470366116  
2.261413709  
1.970447243  
1.626037739  
1.258174389  
0.8955876244  
0.5633396908  
0.2809336385  
0.06107515639  
-0.09082355581  
-0.1763794988  
-0.2032966439  
-0.1838802283  
-0.1332189532  
-0.0672392218  
-0.0008813318755  
0.05341140144  
0.08674119628  
0.09426317509  
0.07515658882  
0.03212971462  
-0.02941140186  
-0.1023578589  
-0.178902812  
-0.2514068266  
-0.3130356796  
-0.3581239615  
-0.3823001287  
-0.3824126573  
-0.3563832035  
-0.3030604024  
-0.2221671758  
-0.1143865296  
0.01841639102  
0.1728800918  
0.3438229722  
0.5240230962  
0.7041956563  
0.8732589149  
1.018931608  
1.128640058  
1.190678161  
1.19547653  
1.136830546  
1.012902983  
0.8268329486  
0.5868173788  
0.3056147023  
-0.0005317881705  
-0.3134450773  
-0.6148661332  
-0.8883863467  
-1.12120448  
-1.305470998  
-1.439031154  
-1.525439117  
-1.573231689  
-1.59454178  
-1.603208605  
-1.612643979  
-1.633734947  
-1.673054092  
-1.731643437  
-1.804529612  
-1.881060374  
-1.946032351  
-1.981472268  
-1.968852417  
-1.891470288  
-1.736669479  
-1.497657291  
-1.174667444  
-0.7753520217  
-0.3143639386  
0.1878055382  
0.7065707557  
1.215371076  
1.687915014  
2.100318917  
2.432944121  
2.671773749  
2.809258042  
2.844603855  
2.783529576  
2.637552395  
2.422889241  
2.15906677  
1.867339081  
1.569015868  
1.283816033  
1.028356847  
0.8149109994  
0.6505447487  
0.5367430463  
0.4695781198  
0.4404533155  
0.4373472823  
0.4464472034  
0.4539804213  
0.4480039576  
0.4199209593  
0.3654999605  
0.2852429086  
0.1840397359  
0.07015992783  
-0.04626249149  
-0.1550227796  
-0.2476086504  
-0.3186523304  
-0.3668200476  
-0.3949765757  
-0.4095932441  
-0.4194846827  
-0.4340927744  
-0.4616052232  
-0.5072401192  
-0.5720246981  
-0.6522864412  
-0.7399969127  
-0.823943093  
-0.8915598016  
-0.9311564631  
-0.9341667219  
-0.8970621669  
-0.8225829956  
-0.7200641252  
-0.6047414421  
-0.4961017928  
-0.4154657783  
-0.3831246021  
-0.4154198298  
-0.5221725835  
-0.7048231929  
-0.9555659572  
-1.257610287  
-1.586576012  
-1.91286797  
-2.204747532  
-2.431748898  
-2.56800807  
-2.595130544  
-2.504235542  
-2.296943545  
-1.985208281  
-1.590002879  
-1.139055378  
-0.6638892799  
-0.1965572595  
0.2335646759  
0.6025368802  
0.8938674338  
1.099577953  
1.220246621  
1.264077336  
1.245179454  
1.181310296  
1.091401781  
0.9931838041  
0.90120055  
0.8254369245  
0.7706736877  
0.7366149563  
0.7187007914  
0.7094628443  
0.7001886324  
0.6826759471  
0.6507952228  
0.6016725301  
0.5363228834  
0.4596536396  
0.3798468017  
0.307214993  
0.2527023942  
0.2262469657  
0.2352485108  
0.2833668797  
0.3698333575  
0.4893695515  
0.6327347355  
0.7878150617  
0.9410951315  
1.079294271  
1.19093605  
1.267615575  
1.304808068  
1.302104416  
1.262872771  
1.193421892  
1.101812732  
0.9965277931  
0.8851991841  
0.7736066458  
0.6650785755  
0.5603848394  
0.4580901095  
0.3553183451  
0.2487465784  
0.1356687107  
0.01493746792  
-0.1123825877  
-0.2427545837  
-0.3703518795  
-0.48766156  
-0.5864103603  
-0.658691672  
-0.6981179552  
-0.7008311886  
-0.6662370463  
-0.5973447431  
-0.5006707354  
-0.3857021968  
-0.2639951078  
-0.1480125337  
-0.04983836277  
0.02006587173  
0.05391708451  
0.04736096172  
-0.0001813296011  
-0.08559409257  
-0.2025562318  
-0.3423826446  
-0.4950907642  
-0.6505530245  
-0.799612902  
-0.9349830504  
-1.051851521  
-1.148105966  
-1.224163148  
-1.282440258  
-1.326553831  
-1.360373214  
-1.387073252  
-1.408346464  
-1.423885651  
-1.431249949  
-1.426126427  
-1.402970068  
-1.355935032  
-1.279943157  
-1.171742446  
-1.030763016  
-0.859646707  
-0.6643233521  
-0.4536249937  
-0.238460489  
-0.03064877177  
0.1584126994  
0.3190841901  
0.4446237117  
0.5319681841  
0.5820576734  
0.5996370142  
0.5925640942  
0.5707162636  
0.5446332565  
0.5240891767  
0.5167741309  
0.5272886851  
0.5565757515  
0.6018905672  
0.6573079919  
0.7147053712  
0.7650745249  
0.7999694264  
0.8128722785  
0.8002592052  
0.7622006292  
0.702387435  
0.6275819077  
0.5465616561  
0.4687309317  
0.4026108114  
0.3544568749  
0.3272300937  
0.3200848439  
0.328465486  
0.3447915732  
0.3596210311  
0.3630990685  
0.3464620803  
0.303345987  
0.2307099232  
0.1292319369  
0.00314419685  
-0.1404377207  
-0.2925587384  
-0.4436426819  
-0.5846869945  
-0.7082345756  
-0.8089877524  
-0.8840126571  
-0.9325368441  
-0.955436371  
-0.9545675112  
-0.9320954166  
-0.8899676684  
-0.8296611442  
-0.7522168353  
-0.6585513013  
-0.5499380809  
-0.4285172067  
-0.2976878567  
-0.1622349416  
-0.02813991391  
0.09796725028  
0.2096144787  
0.3014348458  
0.3700760526  
0.4148911865  
0.4382563319  
0.4454290097  
0.4439349109  
0.442553459  
0.4500572835  
0.473905165  
0.5190872824  
0.5873370877  
0.6768186621  
0.782360182  
0.8961808873  
1.00899365  
1.111296776  
1.194643354  
1.252679953  
1.281802102  
1.281338365  
1.253267296  
1.201540622  
1.131167266  
1.047227501  
0.9539914369  
0.8543087828  
0.749323116  
0.6385814799  
0.5204572853  
0.3928179681  
0.2537963666  
0.1025399048  
-0.06019742388  
-0.2316981047  
-0.4072237709  
-0.5802530803  
-0.7429816194  
-0.8870273879  
-1.004249275  
-1.087580454  
-1.131806356  
-1.134173977  
-1.09480523  
-1.016833502  
-0.9062738591  
-0.7716076387  
-0.6231292705  
-0.4721076254  
-0.3298367777  
-0.2066812896  
-0.1112013007  
-0.04946769395  
-0.02462841278  
-0.03677403791  
-0.08311621841  
-0.1584447267  
-0.2557962195  
-0.3672615371  
-0.4848149917  
-0.6010823684  
-0.7099610641  
-0.8070371001  
-0.8897664541  
-0.9574241172  
-1.010847553  
-1.052017306  
-1.083528407  
-1.108026605  
-1.127660739  
-1.143616507  
-1.155787092  
-1.162608648  
-1.161099936  
-1.147110598  
-1.115767789  
-1.062084892  
-0.9816820779  
-0.8715465739  
-0.7307303903  
-0.5609058334  
-0.3666835623  
-0.1556291822  
0.06207013128  
0.274269224  
0.4678338774  
0.6298215119  
0.7487504391  
0.8158291281  
0.8259905897  
0.7786100879  
0.6778065705  
0.5322707237  
0.3546152786  
0.1603118613  
-0.03369479462  
-0.2105385378  
-0.3550018384  
-0.4549120045  
-0.5022302247  
-0.4937014215  
-0.4310036573  
-0.3203817172  
-0.1718186596  
0.002160759374  
0.1878991145  
0.3720664678  
0.5430020418  
0.6917708817  
0.8128378493  
0.9042738124  
0.9675063373  
1.006654938  
1.027575832  
1.036744151  
1.040146819  
1.04233875  
1.045792018  
1.050612103  
1.054664226  
1.054054857  
1.043896412  
1.019213949  
0.9758650991  
0.9113136386  
0.8251504405  
0.7192825923  
0.597763454  
0.4663140868  
0.3315877355  
0.2003246065  
0.07851026415  
-0.02932930791  
-0.1205831923  
-0.1947022142  
-0.2530080357  
-0.2982076531  
-0.3336812428  
-0.3626691987  
-0.3874754363  
-0.4088470641  
-0.4256126251  
-0.4346859301  
-0.43143036  
-0.410372452  
-0.3661526982  
-0.2946017641  
-0.1937600623  
-0.06468487895  
0.08809003664  
0.2565528618  
0.4296958859  
0.5944455918  
0.7369458217  
0.844030351  
0.9046918894  
0.9113643689  
0.8608335251  
0.7546566469  
0.5990364249  
0.4041599791  
0.1830993005  
-0.0495782557  
-0.2793130079  
-0.4929634988  
-0.6799697262  
-0.8331348395  
-0.9489690209  
-1.027592585  
-1.072273902  
-1.088699635  
-1.084100456  
-1.066370347  
-1.043258356  
-1.021713333  
-1.00738964  
-1.004322838  
-1.014730874  
-1.038927642  
-1.075310327  
-1.120430402  
-1.169150658  
-1.21492093  
-1.250199398  
-1.267017438  
-1.257695045  
-1.215634184  
-1.13612613  
-1.017066171  
-0.8594626671  
-0.6676494361  
-0.4491420044  
-0.2141155822  
0.02543953731  
0.2568076809  
0.4677407753  
0.6476064247  
0.7883669301  
0.8852400769  
0.9370047629  
0.9459212732  
0.9172947622  
0.8587862962  
0.7795548216  
0.6893617245  
0.5977429166  
0.5133210372  
0.4433115724  
0.3932192465  
0.3667088399  
0.3656020995  
0.3899388793  
0.4380716721  
0.5067552056  
0.5912325754  
0.6853431712  
0.7816876026  
0.871903089  
0.9470772026  
0.9983246967  
1.017491953  
0.9979414249  
0.9353166768  
0.8281791341  
0.6784017719  
0.49122952  
0.2749558926  
0.04023439672  
-0.2009228752  
