-0.3075635608  
-0.2587588092  
-0.1856292894  
-0.06601267385  
0.1147606813  
0.3610631834  
0.6655671369  
1.009518771  
1.364666708  
1.696666268  
1.969509869  
2.150412104  
2.21448944  
2.148557378  
1.953529273  
1.645007131  
1.251979787  
0.8137594899  
0.3755391614  
-0.01682480047  
-0.3221398933  
-0.5086093594  
-0.5573849909  
-0.4645002692  
-0.2410181325  
0.08857796938  
0.4894648663  
0.9205807332  
1.339203052  
1.705423377  
1.98599745  
2.157195495  
2.206398846  
2.132404225  
1.944542586  
1.660855997  
1.30566719  
0.9068734306  
0.4933191174  
0.09247241877  
-0.271415261  
-0.5785941788  
-0.814580756  
-0.970461781  
-1.042851148  
-1.033597992  
-0.949320189  
-0.800814154  
-0.6023354914  
-0.3707478517  
-0.1245095994  
0.1174882545  
0.3372165978  
0.5188568816  
0.6500720158  
0.7230856538  
0.7353881795  
0.689963161  
0.5949309052  
0.4626136754  
0.3080713178  
0.1472771174  
-0.004859243005  
-0.1363657929  
-0.2397090004  
-0.3126907364  
-0.3586146859  
-0.3856425235  
-0.4054391102  
-0.4312650197  
-0.475789488  
-0.5489487586  
-0.6561476824  
-0.7970952589  
-0.9654542065  
-1.149350744  
-1.332709233  
-1.497218936  
-1.624660331  
-1.699272937  
-1.709831082  
-1.651152249  
-1.524834118  
-1.339126295  
-1.107981167  
-0.8494182266  
-0.5834456563  
-0.3298252169  
-0.1059638083  
0.07477784033  
0.2041914434  
0.2796310793  
0.3037290289  
0.2835152033  
0.2291185011  
0.1522517762  
0.06472157044  
-0.02286260515  
-0.1020042289  
-0.1668076277  
-0.2140185996  
-0.2426911047  
-0.2535763282  
-0.2483945189  
-0.2290952374  
-0.1972765894  
-0.153797553  
-0.09866202258  
-0.03114845451  
0.0498391717  
0.1452987661  
0.2555842876  
0.3799103852  
0.5159524269  
0.6596230072  
0.8050377759  
0.9447089783  
1.069931814  
1.171359798  
1.239714269  
1.266593814  
1.245299008  
1.171622834  
1.044532289  
0.8666428718  
0.6444484611  
0.3882126532  
0.111524245  
-0.169515356  
-0.4374134227  
-0.6746532856  
-0.8651775989  
-0.9958540177  
-1.057758181  
-1.047122659  
-0.965829001  
-0.8213636938  
-0.6262111647  
-0.3967438729  
-0.151714485  
0.08949494745  
0.308638588  
0.4902237736  
0.6227538036  
0.6994964317  
0.7186754232  
0.6831146459  
0.5994038047  
0.476732921  
0.3255744489  
0.1564238616  
-0.02124928031  
-0.1996845101  
-0.3730908513  
-0.5374921522  
-0.6902374955  
-0.8292881836  
-0.952475626  
-1.056867622  
-1.138408616  
-1.19190857  
-1.211420518  
-1.190961807  
-1.125461256  
-1.011810548  
-0.8498022002  
-0.6428263523  
-0.3981552458  
-0.1267528657  
0.1574173435  
0.4385201716  
0.7002920224  
0.9276042673  
1.107970044  
1.232767561  
1.298019049  
1.304631351  
1.258056832  
1.167435899  
1.044346928  
0.9013677344  
0.7506481617  
0.602700032  
0.4655682221  
0.3444590002  
0.2418428847  
0.157961844  
0.09157039999  
0.04078381288  
0.003824560786  
-0.0204682228  
-0.03245006863  
-0.03182167936  
-0.01807327143  
0.008892138257  
0.04810952528  
0.09702562741  
0.1512225949  
0.2045133533  
0.2493897452  
0.2778316789  
0.2823535303  
0.2571463937  
0.1991501736  
0.1088611068  
-0.009245250357  
-0.1468121255  
-0.2922299753  
-0.4317781995  
-0.551156097  
-0.6372319449  
-0.679794083  
-0.6730590894  
-0.6167234313  
-0.5163707211  
-0.3831563444  
-0.2327373357  
-0.08357140007  
0.04522795988  
0.1362288126  
0.1758785519  
0.1562723336  
0.07624598056  
-0.0583825312  
-0.2354707253  
-0.4380219794  
-0.6462779474  
-0.840136974  
-1.001571211  
-1.116699062  
-1.177227304  
-1.181102099  
-1.132285797  
-1.039752245  
-0.915880335  
-0.7745312472  
-0.6291141356  
-0.4909319643  
-0.3680336751  
-0.2647041265  
-0.1815931904  
-0.1163979646  
-0.06489362618  
-0.02210728302  
0.01661953064  
0.05484922909  
0.0946643992  
0.1366997537  
0.1805269421  
0.2252334567  
0.270045944  
0.3148012034  
0.3601515124  
0.4074340599  
0.4582176909  
0.5136308588  
0.5736303262  
0.6363712872  
0.6978861392  
0.752162466  
0.7916835511  
0.8083892431  
0.7949307806  
0.7460085513  
0.6595950289  
0.5377704495  
0.3870447865  
0.2180334322  
0.04449475185  
-0.1181435982  
-0.2545931341  
-0.3515891963  
-0.3995670807  
-0.3938925613  
-0.3354658066  
-0.2306003766  
-0.09022266994  
0.07151211848  
0.2389367214  
0.3967285082  
0.5315768786  
0.6335048067  
0.6966428309  
0.7194280188  
0.7042161824  
0.6564652086  
0.5836130462  
0.4938698229  
0.3951028787  
0.2939661798  
0.1953780852  
0.1023651667  
0.01626044171  
-0.06284244392  
-0.1354757603  
-0.2021811899  
-0.2629781818  
-0.317031861  
-0.3625739637  
-0.3970870709  
-0.4177161725  
-0.4218470619  
-0.4077485644  
-0.3751617059  
-0.3257459745  
-0.26326666  
-0.1934961862  
-0.1238092929  
-0.06249499231  
-0.0178979986  
0.002540668698  
-0.006835365871  
-0.04915947475  
-0.1246038812  
-0.2302419711  
-0.3602629716  
-0.5064770388  
-0.6590341723  
-0.8072642406  
-0.9405271997  
-1.049000907  
-1.124323649  
-1.160085385  
-1.15216799  
-1.098961104  
-1.001467799  
-0.8633582433  
-0.6909325956  
-0.4930114319  
-0.2806847468  
-0.06689806276  
0.1341939814  
0.3080919187  
0.4410493729  
0.5213066894  
0.5403650794  
0.4941545932  
0.3839247115  
0.2167013962  
0.005187924071  
-0.2329470417  
-0.4763986405  
-0.7020624627  
-0.8872092553  
-1.011758736  
-1.060395922  
-1.024246194  
-0.9019157388  
-0.6997292541  
-0.4311325274  
-0.1153149502  
0.2247746405  
0.5647937082  
0.8814366903  
1.154660909  
1.369427297  
1.51679409  
1.5942479  
1.605309157  
1.558512308  
1.465957034  
1.341645103  
1.199861028  
1.053760454  
0.9143454065  
0.7898702733  
0.6856672671  
0.6043432651  
0.5462003509  
0.5097781336  
0.4923823832  
0.4905175831  
0.500185161  
0.5170481648  
0.5364935085  
0.5536746093  
0.563586056  
0.5612185077  
0.5418267194  
0.5013036151  
0.4366009895  
0.3461520086  
0.2301931983  
0.09095662591  
-0.06736335979  
-0.2388335733  
-0.4162222897  
-0.5915754547  
-0.7568576609  
-0.9046020399  
-1.02846214  
-1.123634723  
-1.187116917  
-1.217793965  
-1.216409779  
-1.185418502  
-1.128802173  
-1.051863069  
-0.9610038691  
-0.8634958047  
-0.7671847242  
-0.6801226942  
-0.6100615372  
-0.5638218633  
-0.5465513335  
-0.5609372674  
-0.6064994437  
-0.6790752225  
-0.7706561556  
-0.8696776386  
-0.9618557613  
-1.031523276  
-1.063401503  
-1.044601932  
-0.9666139704  
-0.8269620735  
-0.6302632996  
-0.3884367306  
-0.1199272929  
0.152044922  
0.4020641514  
0.6056385524  
0.7424370642  
0.799201267  
0.7718776469  
0.6666045374  
0.4993476273  
0.2941432184  
0.08014458265  
-0.1121737163  
-0.2551464207  
-0.3278008855  
-0.3189366325  
-0.2289446009  
-0.07004846126  
0.1350745217  
0.3561894929  
0.559527771  
0.7124240049  
0.7879598908  
0.7689854325  
0.6509678857  
0.4432683583  
0.1686284475  
-0.1391020024  
-0.438760339  
-0.6867528879  
-0.8424251503  
-0.8732967794  
-0.7594767791  
-0.4967317594  
-0.09776936576  
0.4084279976  
0.9792085444  
1.562505201  
2.102279787  
2.544513433  
2.843068497  
2.964735038  
2.892884826  
2.629311455  
2.194083767  
1.623434433  
0.9659717247  
0.2776716252  
-0.3837734058  
-0.9646067405  
-1.420056152  
-1.71829465  
-1.842922278  
-1.793833544  
-1.586461463  
-1.249578328  
-0.821979818  
-0.348423512  
0.1247242637  
0.5537452737  
0.9013233369  
1.139554922  
1.251943637  
1.234325217  
1.094650014  
0.8517052763  
0.5328929373  
0.1712938195  
-0.197749827  
-0.540189384  
-0.8266520879  
-1.035281986  
-1.153767623  
-1.18030125  
-1.123361577  
-1.00031301  
-0.8349730418  
-0.6544329743  
-0.4855214502  
-0.351351579  
-0.2684135567  
-0.2446063803  
-0.2784872922  
-0.3598437215  
-0.4715366931  
-0.5923449393  
-0.7004230605  
-0.7768661406  
-0.8088589245  
-0.7919046336  
-0.7308066608  
-0.6391692807  
-0.5374813074  
-0.4500014286  
-0.4008622096  
-0.4099938976  
-0.4894353264  
-0.6406495622  
-0.8532951924  
-1.105705618  
-1.367097717  
-1.601264328  
-1.771283143  
-1.844576144  
-1.79764071  
-1.619715247  
-1.314868882  
-0.9021497157  
-0.4137512642  
0.1085844684  
0.6184526568  
1.070288338  
1.424750142  
1.653262301  
1.741125987  
1.688818773  
1.511375477  
1.235997848  
0.8982795933  
0.537618644  
0.1924549265  
-0.1040340734  
-0.3272346084  
-0.4630380777  
-0.5082697592  
-0.4696758005  
-0.3617128868  
-0.2035846052  
-0.01598346226  
0.1819489894  
0.3750184697  
0.5534408521  
0.7132220521  
0.855506017  
0.985064621  
1.108274591  
1.230939239  
1.356356553  
1.483943141  
1.6086618  
1.721307448  
1.809601749  
1.859914127  
1.85929504  
1.797527193  
1.668850238  
1.47312227  
1.216237862  
0.9097840601  
0.5699793679  
0.216097672  
-0.1314321361  
-0.4529513188  
-0.7313175895  
-0.9532601446  
-1.110233913  
-1.198727129  
-1.220065091  
-1.179799129  
-1.086810863  
-0.9522846122  
-0.7886750932  
-0.6087678852  
-0.42492162  
-0.2485072256  
-0.08953838149  
0.04353637767  
0.1439131259  
0.2064624429  
0.2277245296  
0.2059232605  
0.1410013084  
0.03469162436  
-0.1094143688  
-0.285794628  
-0.486991129  
-0.7036882921  
-0.9249126336  
-1.138381224  
-1.331019214  
-1.489625569  
-1.601681943  
-1.656254127  
-1.644942385  
-1.562779131  
-1.409027342  
-1.187760889  
-0.9081440001  
-0.584356791  
-0.235058074  
0.1175854299  
0.4493385973  
0.7357151626  
0.9540562245  
1.085726108  
1.118162145  
1.04657599  
0.8750482449  
0.6168092487  
0.293592257  
-0.0660022403  
-0.4290092102  
-0.7612796427  
-1.030989274  
-1.212110268  
-1.287373588  
-1.250387945  
-1.106543181  
-0.8726111825  
-0.5749672758  
-0.2466730409  
0.07629752167  
0.3592120244  
0.5726306185  
0.695843549  
0.7192991118  
0.6456969059  
0.4896321849  
0.2758302808  
0.03617416855  
-0.1941018344  
-0.3806251109  
-0.4939864624  
-0.5132660351  
-0.4285798543  
-0.2423196614  
0.031017164  
0.3664109806  
0.7311325938  
1.088442453  
1.401758817  
1.638790531  
1.775157992  
1.797070082  
1.702742289  
1.502394207  
1.216857077  
0.8749547965  
0.5100281179  
0.1560282696  
-0.1563122369  
-0.402768416  
-0.5679782086  
-0.6465924973  
-0.6431652644  
-0.570847664  
-0.4491354135  
-0.3010352411  
-0.1500524006  
-0.01741331419  
0.0801451933  
0.131792379  
0.1331346309  
0.08591277214  
-0.00297139698  
-0.1228628017  
-0.2609324666  
-0.4036713739  
-0.5381289371  
-0.6527833773  
-0.738034886  
-0.7863868103  
-0.7924305392  
-0.7527793884  
-0.6660462526  
-0.5329547316  
-0.3565870561  
-0.1427022125  
0.09997024034  
0.3596247516  
0.6215710096  
0.8688669851  
1.083397789  
1.247391775  
1.345230892  
1.365359651  
1.302038609  
1.156650587  
0.9383392173  
0.6637557243  
0.3558856457  
0.04193765461  
-0.2494431051  
-0.49141043  
-0.6621467395  
-0.7476921133  
-0.7439596154  
-0.6575897724  
-0.5054834299  
-0.3129686837  
-0.1107800964  
0.06879944782  
0.1961735529  
0.2484699464  
0.2128424947  
0.08853650346  
-0.1125940126  
-0.3672727693  
-0.6435685464  
-0.9049518149  
-1.115104464  
-1.242877422  
-1.266693878  
-1.177790602  
-0.9818166342  
-0.6984989003  
-0.3593981229  
-0.003977325035  
0.325484486  
0.5894771148  
0.7565608548  
0.8076471954  
0.7386274237  
0.5609638969  
0.3001036172  
-0.008058518797  
-0.3222251857  
-0.6015037734  
-0.8111750687  
-0.9275524147  
-0.9412309452  
-0.8582329614  
-0.6988491246  
-0.4943577654  
-0.2820949011  
-0.0996297691  
0.02108317493  
0.05865938941  
0.00558657539  
-0.1306436285  
-0.328754548  
-0.5570612308  
-0.7784785696  
-0.9563753535  
-1.060332022  
-1.070922634  
-0.9827429762  
-0.805231057  
-0.5611633545  
-0.2830659688  
-0.008139235839  
0.2274911887  
0.394299313  
0.4737678075  
0.4610135873  
0.3652386903  
0.2079452701  
0.01926627436  
-0.1670215606  
-0.318945709  
-0.4113935417  
-0.4299523686  
-0.3729287576  
-0.2512293733  
-0.08616231896  
0.0944886094  
0.2614401856  
0.38911761  
0.4602079776  
0.4688192948  
0.4216773144  
0.3371472469  
0.2422170259  
0.1678933715  
0.1437420514  
0.1924568541  
0.325322024  
0.5393605076  
0.8166447258  
1.125979366  
1.426773909  
1.67457089  
1.82749756  
1.85267154  
1.731646963  
1.464073999  
1.068974199  
0.5833923153  
0.05851249872  
-0.4463098954  
-0.8708620072  
-1.161778736  
-1.279654868  
-1.204601999  
-0.9394995895  
-0.5104520156  
0.03566070364  
0.6362981966  
1.220464963  
1.717125997  
2.063834193  
2.21447155  
2.145163864  
1.85757137  
1.379147529  
0.7602532799  
0.0684601881  
-0.6193170197  
-1.225904622  
-1.68308439  
-1.939816955  
-1.968436542  
-1.768073621  
-1.364841285  
-0.808764823  
-0.1678264608  
0.4801540576  
1.056779878  
1.492341747  
1.73394735  
1.751516803  
1.540953072  
1.124134967  
0.5458191239  
-0.132115065  
-0.8382797379  
-1.500279202  
-2.05303934  
-2.445949024  
-2.648019403  
-2.650501193  
-2.466783192  
-2.129692559  
-1.686647449  
-1.193347924  
-0.7068229058  
-0.2786802056  
0.05065547969  
0.2560835701  
0.3299685655  
0.2820989254  
0.1375918413  
-0.0669353412  
-0.2884185402  
-0.4829892823  
-0.61154953  
-0.6446227025  
-0.5659445187  
-0.374393537  
-0.08406374474  
0.27751678  
0.6727872582  
1.058784037  
1.39241744  
1.635774529  
1.760775484  
1.752632625  
1.611636491  
1.353061987  
1.005184895  
0.6056528688  
0.1966861061  
-0.1802802705  
-0.4897801342  
-0.70666712  
-0.8190377409  
-0.8293458124  
-0.7535997397  
-0.6187590209  
-0.4587334621  
-0.3095754552  
-0.2045163892  
-0.1695581495  
-0.2201675757  
-0.3594913265  
-0.5782383497  
-0.8561607726  
-1.164811787  
-1.471165693  
-1.741538355  
-1.945318433  
-2.058077632  
-2.063777037  
-1.955954061  
-1.737890195  
-1.421938959  
-1.02817891  
-0.5826339003  
-0.1152178618  
0.3424403403  
0.7592306448  
1.106801221  
1.361754179  
1.507701764  
1.537073909  
1.452442473  
1.267158651  
1.005054481  
0.6990596704  
0.3886779642  
0.1164355932  
-0.07643069656  
-0.1545910375  
-0.09302978843  
0.1193463262  
0.4773940361  
0.9591171153  
1.526902707  
2.130600626  
2.712121779  
3.211116477  
3.571096023  
3.74532709  
3.701858234  
3.427111449  
2.927664852  
2.23002434  
1.378418795  
0.430847438  
-0.546195281  
-1.483792371  
-2.316845218  
-2.989853989  
-3.461689974  
-3.708881398  
-3.727147649  
-3.531071943  
-3.152008866  
-2.634513985  
-2.031720608  
-1.400156736  
-0.794567731  
-0.2632201235  
0.1558675044  
0.4375199754  
0.570653159  
0.5582181967  
0.4159579091  
0.1702156015  
-0.144911176  
-0.4907757589  
-0.8274911075  
-1.117079095  
-1.32631706  
-1.429136859  
-1.408494887  
-1.257647197  
-0.9807736258  
-0.5928824895  
-0.1189724797  
0.4075968542  
0.9474847185  
1.458412854  
1.898691203  
2.230966687  
2.425842524  
2.464998043  
2.34340837  
2.070365466  
1.669065785  
1.17471385  
0.6312632265  
0.08708044616  
-0.4100014137  
-0.8177049723  
-1.103788171  
-1.249465971  
-1.251296802  
-1.12131673  
-0.8853621148  
-0.5797878646  
-0.2469780612  
0.06976263518  
0.3313185846  
0.5071912595  
0.578719557  
0.5407023364  
0.4012482951  
0.1799625581  
-0.09523995988  
-0.3921916886  
