26.07427572  
31.40299319  
42.25723679  
75.2018068  
499.6009299  
3298.353881  
1825.977641  
77473.80797  
42208.93549  
30696.15106  
15756.024  
7058.833391  
8908.232435  
9797.10269  
12218.29588  
23944.53486  
19803.10986  
43144.58389  
33549.90078  
10656.76907  
2064.852014  
13380.35555  
3469.298998  
116.5158702  
10250.65299  
6663.151579  
448.9906913  
1958.006217  
7007.261305  
16576.42426  
7265.051717  
5136.33776  
2991.448518  
2581.728809  
11805.29335  
3590.663375  
838.3269814  
959.5184252  
8325.50084  
13682.59029  
642.0059782  
531.4658938  
5083.788496  
3042.311877  
585.8653815  
2768.673162  
46.19078229  
2451.634676  
1092.401142  
2351.745313  
1284.038789  
1322.273477  
1182.174645  
3.769083739  
147.9909899  
1595.99058  
906.6039106  
456.3127024  
895.2580075  
124.0795047  
227.5922702  
198.928793  
7.925962597  
216.3676294  
35.95993171  
58.56175095  
67.40664649  
20.76734552  
31.59719856  
22.07819105  
29.1130013  
3.359751183  
0.5164146582  
1.414363055  
0.5173133267  
5.113599725  
1.437006983  
0.6468088972  
0.9683190294  
1.246410361  
0.2988470614  
0.744212721  
0.1619116931  
0.4593210414  
0.1447400459  
0.1687867144  
0.1749705775  
0.105898976  
0.1208465039  
0.1051673968  
0.1107391573  
0.09302530497  
0.08378389012  
0.08827685687  
0.07506613812  
0.07116528513  
0.06843962133  
0.06012957836  
0.05855860381  
0.05274074688  
0.04852018646  
0.04658298286  
0.0480278557  
0.04253827519  
0.04233579142  
0.0403332779  
0.0380937865  
0.03685377159  
0.03508546267  
0.03408804049  
0.03268284496  
0.03152409358  
0.02975930164  
0.02877186202  
0.02767507431  
0.02657645867  
0.02566473291  
0.02473165551  
0.02389966858  
0.02301977321  
0.0222694183  
0.02145250441  
0.02073913075  
0.02006087384  
0.01937843572  
0.01874537155  
0.01813679218  
0.01755167818  
0.01696633295  
0.01644131778  
0.01590485846  
0.01541407778  
0.01492660359  
0.0144766112  
0.01402829853  
0.01360653951  
0.01319774064  
0.01280612442  
0.01242531195  
0.01206122368  
0.01170982464  
0.01137161086  
0.01104631367  
0.01072997317  
0.01042653015  
0.01013495699  
0.009853035953  
0.009579813314  
0.009315236471  
0.009061484062  
0.008817027993  
0.008580524941  
0.008350161184  
0.008128147257  
0.007914745573  
0.007706243185  
0.007506936618  
0.00731176596  
0.007124902311  
0.006942031472  
0.006767545157  
0.006595117593  
0.006430382615  
0.006270966355  
0.006115703954  
0.005965542809  
0.00581927165  
0.005677777525  
0.005541638557  
0.005407293315  
0.00527882211  
0.005153493725  
0.005031396153  
0.00491321266  
0.00479910318  
0.00468775182  
0.004579634666  
0.004474095941  
0.004372489907  
0.00427246476  
0.004176323591  
0.004082780783  
0.003991351724  
0.003902740485  
0.003815742063  
0.00373220262  
0.00365126205  
0.003571747439  
0.003494116289  
0.00341850427  
0.003344895132  
0.00327392193  
0.003205194066  
0.0031374306  
0.003071531933  
0.00300651907  
0.002944697174  
0.002883347619  
0.002823645656  
0.002765702414  
0.002709825476  
0.002654977098  
0.002601761218  
0.00254891633  
0.002498233431  
0.002448103367  
0.002399892545  
0.002351861943  
0.002305449842  
0.002260727237  
0.002217038784  
0.002173825995  
0.002131399654  
0.002090553132  
0.002050823434  
0.002011541584  
0.001973265995  
0.001935561708  
0.001899581235  
0.001864206184  
0.001829516447  
0.001795229225  
0.001762099897  
0.001729623307  
0.001697838105  
0.00166675276  
0.001636101446  
0.001606803216  
0.001578347247  
0.001549635025  
0.001521715928  
0.001495226831  
0.001468254244  
0.001442237924  
0.001417528644  
0.00139209064  
0.001367799094  
0.001343882438  
0.001320923717  
0.001298043207  
0.001275533149  
0.001253619492  
0.001232256392  
0.001211468773  
0.001190868395  
0.001170954131  
0.001151441095  
0.001131945981  
0.001113347801  
0.001094659446  
0.001077027621  
0.001058697388  
0.001041544467  
0.001024459926  
0.001007778799  
0.0009912814516  
0.0009753534013  
0.000959457791  
0.0009440550221  
0.0009288210374  
0.0009142941247  
0.0008996953226  
0.0008857454935  
0.0008711375005  
0.0008574014781  
0.0008444238822  
0.0008316402633  
0.0008178920887  
0.0008053650852  
0.0007932141503  
0.0007805130096  
0.0007691424557  
0.0007571144757  
0.0007453442189  
0.0007341195532  
0.0007234578164  
0.0007122153538  
0.000701217975  
0.0006910820595  
0.0006807376895  
0.0006705833558  
0.000660779031  
0.000651017749  
0.0006413464802  
0.0006318390109  
0.0006226196124  
0.0006136579533  
0.000604719403  
0.0005958628927  
0.000587300798  
0.0005791811037  
0.0005704404187  
0.0005624132408  
0.0005543442134  
0.000546241479  
0.0005387800741  
0.000531332165  
0.0005238574942  
0.0005162873752  
0.0005094166594  
0.0005019607676  
0.0004949123144  
0.0004882489465  
0.0004815966381  
0.0004749386834  
0.0004685523726  
0.0004618253767  
0.000455898249  
0.0004495330793  
0.0004434679029  
0.0004373632951  
0.0004318361057  
0.0004258992512  
0.000420403172  
0.0004146955292  
0.0004091840809  
0.0004039831589  
0.0003988429305  
0.0003935122518  
0.0003882582573  
0.000383274567  
0.0003784015645  
0.000373126239  
0.0003684632928  
0.0003638062124  
0.0003591592468  
0.0003546412411  
0.0003502362421  
0.0003457614983  
0.0003413868037  
0.0003373435107  
0.0003329216036  
0.0003286292503  
0.0003245734374  
0.0003205795209  
0.0003165813427  
0.0003128093276  
0.0003088783635  
0.0003050200184  
0.0003014862569  
0.0002977705112  
0.0002942944129  
0.0002907766228  
0.0002873208568  
0.0002837944836  
0.0002804768802  
0.0002772234654  
0.0002740123107  
0.0002706111407  
0.0002674343398  
0.0002643300281  
0.0002612777257  
0.000258366803  
0.0002552366025  
0.0002524248507  
0.0002495972858  
0.0002468396362  
0.0002439444653  
0.0002412893646  
0.0002383289649  
0.0002358224958  
0.0002332306106  
0.0002305377882  
0.0002282494628  
0.0002256681227  
0.000223172156  
0.0002205219999  
0.0002182652298  
0.0002158755731  
0.0002135649569  
0.000211326218  
0.0002090239358  
0.0002069317721  
0.0002048337807  
0.0002027614074  
0.0002005357373  
0.0001985138582  
0.0001966606888  
0.0001945048596  
0.0001924622608  
0.0001902885383  
0.0001888200392  
0.0001867939495  
0.000184871481  
0.0001830490889  
0.0001810824606  
0.0001795728093  
0.0001776299321  
0.000176055665  
0.0001743500053  
0.0001724874249  
0.0001710702004  
0.0001693315795  
0.000167882623  
0.0001662744255  
0.0001646038027  
0.0001632174773  
0.00016177623  
0.0001602702966  
0.0001587057212  
0.0001574589989  
0.0001560381299  
0.0001546172472  
0.0001533632763  
0.0001520765522  
0.0001506128068  
0.0001493753219  
0.0001481372957  
0.0001469543491  
0.0001457990241  
0.0001444071899  
0.0001433520749  
0.0001421009899  
0.0001411189944  
0.0001398521322  
0.0001387739314  
0.0001377266834  
0.0001366507051  
0.0001356709883  
0.0001345998024  
0.0001335380378  
0.0001327063686  
0.0001317646996  
0.0001306636221  
0.0001299080047  
0.0001288814951  
0.000127983777  
0.0001270306724  
0.0001260492763  
0.0001253004673  
0.0001243815495  
0.0001236267299  
0.0001229697121  
0.0001220948153  
0.0001212964113  
0.0001205373576  
0.0001198310246  
0.0001190455385  
0.0001185518315  
0.0001177275289  
0.0001169499287  
0.0001162883603  
0.0001156341601  
0.0001151797021  
0.0001144896718  
0.0001138685854  
0.0001132674768  
0.0001127042531  
0.0001120599174  
0.0001116478114  
0.0001111469319  
0.0001105934909  
0.0001100109448  
0.0001096826587  
0.0001091058656  
0.0001085788693  
0.000108073709  
0.0001077789749  
0.0001072644513  
0.0001068789847  
0.0001065318822  
0.0001061004713  
0.0001056881373  
0.0001053862165  
0.0001050188276  
0.0001046328151  
0.000104332179  
0.0001040105166  
0.0001037347946  
0.0001034018006  
0.0001030777691  
0.0001027997874  
0.0001027379906  
0.0001024351582  
0.0001022401886  
0.0001019129822  
0.000101584488  
0.0001015633321  
0.0001012975012  
0.0001011761155  
0.0001010061896  
0.0001008607614  
0.0001006236216  
0.0001006613017  
0.0001005341484  
0.0001004950355  
0.0001002044589  
0.0001002104102  
0.0001002249812  
0.0001000716382  
0.0001000877647  
0.0001000167379  
0.0001000707139  
9.999157409e-05  
