0.06099755007  
0.1859318399  
0.3077249375  
0.4221522676  
0.52557914  
0.6151777483  
0.6890134928  
0.7460175694  
0.785893467  
0.8090271907  
0.8164419205  
0.8098384003  
0.7916889506  
0.7653533415  
0.7351216938  
0.7061078589  
0.6839267043  
0.6741309667  
0.6814551338  
0.7089488949  
0.757158611  
0.8235176181  
0.9021041309  
0.9838763824  
1.057424743  
1.11019423  
1.130040991  
1.106917096  
1.034445564  
0.9111387108  
0.7410593921  
0.5337981735  
0.3037301615  
0.06862818389  
-0.1522069978  
-0.3400593741  
-0.4788906848  
-0.5571433675  
-0.5690384776  
-0.5152154754  
-0.4026560452  
-0.2439254467  
-0.05584850464  
0.1422093864  
0.3302481935  
0.4895136167  
0.6041745283  
0.6626497432  
0.6584961824  
0.5908175782  
0.4642023009  
0.2882248428  
0.07657862686  
-0.1540935689  
-0.3855844711  
-0.5996398382  
-0.7795082377  
-0.9114169427  
-0.9858500955  
-0.9985028896  
-0.9507892795  
-0.8497974139  
-0.7076384144  
-0.5401987612  
-0.3653737707  
-0.2009622276  
-0.06245424392  
0.03899103907  
0.09808455023  
0.1162000493  
0.1012542646  
0.06661635546  
0.02915860213  
0.006680404512  
0.01508060406  
0.06569634422  
0.1632424773  
0.3047078667  
0.4794151023  
0.6702895593  
0.8561650876  
1.014794287  
1.126099048  
1.175148693  
1.154384982  
1.064738654  
0.9154464535  
0.7225958077  
0.5066410878  
0.2892803454  
0.09021161898  
-0.07571259986  
-0.2004761951  
-0.28371826  
-0.3322714809  
-0.3585140101  
-0.3778229014  
-0.4055788038  
-0.4542243259  
-0.5308785568  
-0.6359043474  
-0.7626703979  
-0.8985407754  
-1.026915619  
-1.12998394  
-1.191708741  
-1.200556302  
-1.151489584  
-1.046921875  
-0.8964545338  
-0.7154649243  
-0.5227900123  
-0.3379022505  
-0.1780574949  
-0.05589152788  
0.02214394757  
0.05625857452  
0.05266511851  
0.02193413893  
-0.02333316427  
-0.07108287226  
-0.1121727271  
-0.1421071416  
-0.1618381109  
-0.177489819  
-0.1990621989  
-0.238335806  
-0.3063483336  
-0.4108757838  
-0.554365746  
-0.7326875166  
-0.9349356712  
-1.144349188  
-1.340234995  
-1.500618813  
-1.605229759  
-1.638375257  
-1.591276164  
-1.463510495  
-1.263352377  
-1.006949451  
-0.7164550735  
-0.4173719627  
-0.1354749485  
0.1062685624  
0.2903806601  
0.4068165886  
0.4539418216  
0.4384598955  
0.374340309  
0.2809314704  
0.180531593  
0.09574452054  
0.04694536596  
0.05013554545  
0.1154022392  
0.2460814733  
0.4386527511  
0.6832857325  
0.9649221922  
1.264721146  
1.561717168  
1.834535458  
2.063047792  
2.229880846  
2.321705146  
2.330247695  
2.252974177  
2.093391619  
1.860913269  
1.570252799  
1.240349223  
0.892859692  
0.5503190511  
0.234130261  
-0.03741380072  
-0.2508538818  
-0.3988133821  
-0.4805984664  
-0.5020555993  
-0.4746816674  
-0.4140789907  
-0.3379503661  
-0.2638838918  
-0.2072104643  
-0.179206176  
-0.185869389  
-0.2274062844  
-0.2984817569  
-0.3891750842  
-0.4864921498  
-0.5762286324  
-0.6449196913  
-0.6816365452  
-0.6793877522  
-0.6359784436  
-0.5542254894  
-0.4415266355  
-0.3088657747  
-0.169395093  
-0.03678675997  
0.0764443108  
0.1604342583  
0.2091369951  
0.221027179  
0.1993072979  
0.1516081747  
0.08923668787  
0.02605959355  
-0.02288580036  
-0.04293159388  
-0.02136521497  
0.05105759856  
0.1787992201  
0.3605475854  
0.588681099  
0.8493124111  
1.122997873  
1.386141889  
1.613056661  
1.778514742  
1.860553405  
1.843203418  
1.718760266  
1.489244308  
1.166760902  
0.7726109939  
0.3351703069  
-0.1132498116  
-0.5401732292  
-0.9168571916  
-1.221758672  
-1.443056695  
-1.579836658  
-1.641749121  
-1.647172457  
-1.620157019  
-1.586606364  
-1.570276751  
-1.589188643  
-1.65298734  
-1.761618745  
-1.905480491  
-2.066975225  
-2.223189024  
-2.349237142  
-2.421771514  
-2.422127063  
-2.338679772  
-2.168142802  
-1.915703896  
-1.594089456  
-1.221786867  
-0.8207518651  
-0.4139695789  
-0.02318539155  
0.3329305769  
0.6400447254  
0.8888126892  
1.074979174  
1.199048895  
1.265669846  
1.282860823  
1.26117923  
1.212870304  
1.151006171  
1.088589451  
1.037608875  
1.008052746  
1.006934418  
1.037437987  
1.098311531  
1.183664449  
1.283275924  
1.383477462  
1.468574263  
1.522665878  
1.531659385  
1.485175855  
1.378068555  
1.211302607  
0.9920210614  
0.7327791693  
0.4500308205  
0.1621090946  
-0.1129902886  
-0.3596741856  
-0.5663429993  
-0.7262806082  
-0.8377368241  
-0.9032476264  
-0.9283689813  
-0.9201008351  
-0.8853261302  
-0.8295627884  
-0.756266088  
-0.6667921211  
-0.5610009207  
-0.438346561  
-0.2992086486  
-0.1461507067  
0.01517527498  
0.1757231926  
0.323468733  
0.4445388661  
0.524914686  
0.5524602288  
0.518938196  
0.42168298  
0.2646145153  
0.05838292327  
-0.1804368896  
-0.4310369637  
-0.6707506339  
-0.8777788417  
-1.033884565  
-1.126659214  
-1.151015893  
-1.109688385  
-1.01265296  
-0.8755586954  
-0.7174145005  
-0.5578778899  
-0.4145742046  
-0.3008416703  
-0.2242349857  
-0.185991338  
-0.1814885107  
-0.2015713936  
-0.2344798969  
-0.2680089727  
-0.2915292174  
-0.2975144998  
-0.2823424392  
-0.2462772833  
-0.1926920644  
-0.1267343377  
-0.05374396098  
0.02224449497  
0.09959213368  
0.1795164387  
0.2658268987  
0.3639806775  
0.4796566876  
0.6171234648  
0.7777429311  
0.9589097271  
1.153662497  
1.351071218  
1.537363654  
1.697622538  
1.817769852  
1.886525036  
1.896999563  
1.847682344  
1.742656985  
1.591021487  
1.405622596  
1.201297497  
0.9929164702  
0.7935069568  
0.6127398953  
0.4559785508  
0.3239984625  
0.2133873393  
0.1175239691  
0.0279723543  
-0.06394245186  
-0.1656152837  
-0.2819103417  
-0.4143560454  
-0.5608806779  
-0.7161005412  
-0.8720999298  
-1.019568291  
-1.149118126  
-1.252590154  
-1.324161761  
-1.361116874  
-1.364181677  
-1.337411263  
-1.287650683  
-1.223674799  
-1.155122267  
-1.091372272  
-1.040493962  
-1.008386713  
-0.9981871437  
-1.009997236  
-1.040927624  
-1.085444173  
-1.135967754  
-1.183665736  
-1.219371298  
-1.234547755  
-1.22223259  
-1.17787428  
-1.099983632  
-0.9905271978  
-0.8549857983  
-0.7020361912  
-0.5428316904  
-0.3899092455  
-0.2557899819  
-0.1514177515  
-0.08459133024  
-0.05860932655  
-0.07132657208  
-0.1148063109  
-0.1756898337  
-0.2363120039  
-0.2765091184  
-0.2759349521  
-0.2166432299  
-0.08560831877  
0.1231527259  
0.4071547451  
0.7549624241  
1.146765092  
1.555998294  
1.951857271  
2.302419548  
2.578008968  
2.754383837  
2.815350299  
2.75447871  
2.57570395  
2.292759332  
1.927534925  
1.507596361  
1.063219221  
0.6243257778  
0.2177209482  
-0.1350558266  
-0.4190417396  
-0.6262577827  
-0.7552735063  
-0.8101138971  
-0.7987762302  
-0.7316424494  
-0.6200611784  
-0.4752924369  
-0.3079187743  
-0.1277122509  
0.05614633316  
0.2346704738  
0.3986931321  
0.5387032063  
0.6450211955  
0.7083687552  
0.7207818225  
0.6767356907  
0.5742887112  
0.4160115604  
0.209494693  
-0.03273436364  
-0.2939531315  
-0.5546279352  
-0.794298742  
-0.9937585523  
-1.137243275  
-1.214343494  
-1.221364311  
-1.161928616  
-1.046710313  
-0.892292289  
-0.7192623332  
-0.5497574507  
-0.4047503671  
-0.301401217  
-0.2508056638  
-0.2564263932  
-0.3134103041  
-0.4088993662  
-0.5233136721  
-0.6324855127  
-0.7104122628  
-0.7323427226  
-0.6778579577  
-0.5336370387  
-0.2956018191  
0.02977801762  
0.425191625  
0.8632645829  
1.308396812  
1.719566123  
2.053902471  
2.270767914  
2.336004938  
2.225957854  
1.93082962  
1.456964599  
0.8276773675  
0.08238019911  
-0.7260903651  
-1.53582628  
-2.281537189  
-2.901026306  
-3.341730066  
-3.566530459  
-3.558082626  
-3.321040664  
-2.881820837  
-2.285855077  
-1.592620836  
-0.8690541507  
-0.1821546956  
0.4082822226  
0.8559093058  
1.132301986  
1.22916657  
1.158109392  
0.9480991514  
0.6410570302  
0.2862098499  
-0.06603954978  
-0.3699614695  
-0.5893873294  
-0.701126704  
-0.6966071847  
-0.5816813254  
-0.3747476525  
-0.1035457237  
0.1988960515  
0.4986058919  
0.7647553386  
0.9730099652  
1.107781442  
1.16319175  
1.142729801  
1.057758156  
0.9251644396  
0.7645416247  
0.5953356925  
0.4343449725  
0.29389813  
0.1809085721  
0.09685465221  
0.0386052268  
-0.0001170208893  
-0.02691719166  
-0.04886861969  
-0.07091363411  
-0.09475840685  
-0.1184056037  
-0.1363768169  
-0.140545393  
-0.1214513273  
-0.06987778937  
0.02152347264  
0.1567910032  
0.3355779361  
0.55256621  
0.7974567307  
1.055519578  
1.30866843  
1.5369454  
1.720289645  
1.840420026  
1.882670033  
1.837595164  
1.702200859  
1.480648495  
1.184337168  
0.8313146378  
0.4450154178  
0.05239667054  
-0.3183821248  
-0.6405382973  
-0.8912575265  
-1.054016364  
-1.120381306  
-1.091044526  
-0.9759532694  
-0.793463896  
-0.5685776172  
-0.3304153233  
-0.1091909091  
0.06699598101  
0.1751817237  
0.2000437531  
0.1355877766  
-0.014174508  
-0.2356428537  
-0.5070951294  
-0.8010388185  
-1.087175806  
-1.335641726  
-1.520156408  
-1.620734159  
-1.625664423  
-1.532561477  
-1.348400917  
-1.088579658  
-0.7751399212  
-0.434402101  
-0.09428774667  
0.2183532516  
0.480136002  
0.6730171513  
0.785513218  
0.8132029955  
0.7585395833  
0.6300832916  
0.4413014334  
0.2091202561  
-0.04760713598  
-0.3095664295  
-0.558286674  
-0.7772195213  
-0.9525851369  
-1.073994424  
-1.134875257  
-1.132730003  
-1.069223  
-0.9501046066  
-0.7849316739  
-0.5865610746  
-0.370390437  
-0.153347377  
0.04733673072  
0.2154894498  
0.3373768287  
0.4029655322  
0.4069051183  
0.3491098895  
0.2348398346  
0.07425111629  
-0.1185555941  
-0.3268885005  
-0.5330632257  
-0.7200646386  
-0.8730795246  
-0.9807176208  
-1.035800479  
-1.035645695  
-0.9818467953  
-0.8796180455  
-0.7368268567  
-0.5628684907  
-0.3675504882  
-0.1601372562  
0.05132740662  
0.2603689694  
0.4620851486  
0.6528769066  
0.8299964306  
0.9910480441  
1.133571614  
1.254820932  
1.351808943  
1.421633096  
1.462033198  
1.472085964  
1.452891085  
1.408092754  
1.344086528  
1.269811771  
1.196076489  
1.134445862  
1.095806161  
1.08877548  
1.118192272  
1.18391506  
1.280159504  
1.395533337  
1.513842189  
1.615635623  
1.680342237  
1.688749834  
1.625499125  
1.48125454  
1.254217445  
0.9507408317  
0.5849130088  
0.1771334707  
-0.2481583027  
-0.6652935383  
-1.050348968  
-1.383858089  
-1.652879719  
-1.852128139  
-1.984010801  
-2.057581112  
-2.086578216  
-2.086864703  
-2.073665687  
-2.059032486  
-2.049937215  
-2.047278906  
-2.045961389  
-2.036021263  
-2.004614717  
-1.938546385  
-1.82691842  
-1.663471374  
-1.448224598  
-1.188132264  
-0.8966357124  
-0.5921521348  
-0.2957258426  
-0.02818976793  
0.192727954  
0.3548997349  
0.4535146138  
0.4917317389  
0.4801713076  
0.4353058098  
0.3769892872  
0.325503913  
0.2985660879  
0.3087484102  
0.3617079169  
0.4554841589  
0.5809645459  
0.7234286244  
0.8649226547  
0.9870834958  
1.073969047  
1.114455933  
1.103853134  
1.044495368  
0.9452593483  
0.8201112978  
0.6859399644  
0.5600347737  
0.4576060881  
0.3897242358  
0.361970515  
0.3739639386  
0.419791831  
0.4892189451  
0.5694475706  
0.6471258041  
0.710270738  
0.7498307824  
0.7606638118  
0.7418303405  
0.6962035384  
0.6295159529  
0.5490341386  
0.4621053085  
0.3748169828  
0.2909864898  
0.2116170128  
0.1348858494  
0.05663665435  
-0.02873058417  
-0.1271330491  
-0.2436274632  
-0.3813675425  
-0.540847993  
-0.7195299752  
-0.9118922444  
-1.109877076  
-1.303658214  
-1.482613535  
-1.636377833  
-1.755847372  
-1.834027399  
-1.866642069  
-1.852460037  
-1.793322452  
-1.693883983  
-1.561107978  
-1.403573525  
-1.230654675  
-1.051652306  
-0.8749564013  
-0.707311975  
-0.5532609728  
-0.4148218379  
-0.2914434992  
-0.1802539716  
-0.07659039603  
0.02524121798  
0.1310490622  
0.2457896778  
0.3726759507  
0.5124791093  
0.6631285735  
0.8196852142  
0.9747098761  
1.118998835  
1.242604787  
1.336010197  
1.391304061  
1.403199534  
1.369753331  
1.29269106  
1.177297809  
1.031894932  
0.8669872413  
0.6942115041  
0.5252201053  
0.3706624754  
0.2393692043  
0.137820763  
0.06991888638  
0.03703025165  
0.03824474758  
0.07074539236  
0.1302210285  
0.2112477535  
0.3076121541  
0.4125757089  
0.5191124388  
0.6201670681  
0.7089640677  
0.7793952786  
0.8264628806  
0.8467346395  
0.8387388604  
0.8032120953  
0.7431282494  
0.6634703501  
0.570738943  
0.4722461121  
0.3752927191  
0.2863388035  
0.2103053627  
0.1501050076  
0.1064867956  
0.07820155777  
0.06245013242  
0.05552365912  
0.05349710762  
0.05283663808  
0.05079229907  
0.04549092552  
0.03570613566  
0.02036743685  
-0.002081504625  
-0.03429500258  
-0.08042733271  
-0.1461590611  
-0.2382408558  
-0.3635512878  
-0.5277597677  
-0.7337929347  
-0.9803794994  
-1.260975294  
-1.563335104  
-1.869927118  
-2.159247127  
-2.407937626  
-2.593456309  
-2.696945976  
-2.705862085  
-2.615951531  
-2.432241531  
-2.168842443  
-1.847549349  
-1.495406356  
-1.141554834  
-0.813804377  
-0.5353882796  
-0.322354637  
-0.1819238149  
-0.1120194044  
-0.1019880617  
-0.134378822  
-0.1874920853  
-0.2383385408  
-0.2655957185  
-0.2521830383  
-0.1871528783  
-0.06670045676  
0.1057653481  
0.3204286159  
0.5625747817  
0.8145590682  
1.057948289  
1.275567487  
1.453224179  
1.580940383  
1.653617962  
1.671122997  
1.637846537  
1.561853331  
1.453736808  
1.325332087  
1.188404391  
1.053446165  
0.9286757681  
0.8193193177  
0.7272424925  
0.6509602883  
0.5860377535  
0.5258491251  
0.4626313539  
0.3887193712  
0.2978294989  
0.1862261353  
0.05361668456  
-0.0963704936  
-0.2562025536  
-0.4149924869  
-0.5595341775  
-0.6757050535  
-0.7500673521  
-0.7714777583  
-0.7324875529  
-0.6303718537  
-0.4676619857  
-0.252124306  
0.003794025412  
0.2839742673  
0.5699686703  
0.8425248159  
1.083143044  
1.275538925  
1.40689824  
1.468858306  
1.458146123  
1.376859093  
1.232344652  
1.036677452  
0.8057294199  
0.5578667487  
0.3123416843  
0.08748964177  
-0.1010974061  
-0.2422235875  
-0.3303564487  
-0.366310667  
-0.3572153885  
-0.3157032804  
-0.2583831859  
-0.2037505581  
-0.1697944467  
-0.1716092882  
-0.2193404644  
-0.3167528595  
-0.4606195628  
-0.6410378601  
-0.8426146436  
-1.046367042  
-1.232069871  
-1.380731693  
-1.476859564  
-1.510229077  
-1.476940257  
-1.379660403  
-1.227070939  
-1.032633319  
-0.8128984158  
-0.5855967142  
-0.3677884933  
-0.1742921028  
-0.0165540074  
0.09795865706  
0.1658543882  
0.1874926856  
0.1663697768  
0.1083748358  
0.02105998663  
-0.08697547388  
-0.2065389727  
-0.3281567544  
-0.442309524  
-0.5396762247  
-0.611477424  
-0.6499623746  
-0.6490412539  
-0.604995436  
-0.5171498198  
-0.3883629687  
-0.2251939218  
-0.03763772226  
0.1616045925  
0.3582873767  
0.53808371  
0.6881639869  
0.7986696273  
0.8638562473  
0.8827284629  
0.8590601845  
0.8007867209  
0.7188608703  
0.6257286315  
0.5336701285  
0.4532349237  
0.3920116463  
0.353891237  
0.338912385  
0.3436821605  
0.3622637755  
