0.3261144682  
0.3695139116  
0.4056018039  
0.4274651809  
0.4296316093  
0.4088313475  
0.3645747965  
0.2994728047  
0.2192317724  
0.1322629794  
0.04892877707  
-0.0195480418  
-0.06240605241  
-0.07074248463  
-0.0388289643  
0.03487527432  
0.1471516246  
0.2900257323  
0.4514012573  
0.6162591614  
0.7683093121  
0.8918702458  
0.973721094  
1.004666507  
0.9805839126  
0.902792951  
0.7777108449  
0.6158482772  
0.4303144494  
0.2350703385  
0.04320504396  
-0.1345116579  
-0.2905871475  
-0.4211748549  
-0.5258398492  
-0.6068083386  
-0.6678925728  
-0.7132882526  
-0.7464911609  
-0.7695201217  
-0.782561902  
-0.7841079879  
-0.7715121037  
-0.7418630203  
-0.6929938176  
-0.624427331  
-0.538074862  
-0.438546494  
-0.3329897858  
-0.230458282  
-0.1408925032  
-0.07384252286  
-0.03713058552  
-0.03564699618  
-0.07047232534  
-0.1384733962  
-0.232449003  
-0.3418400914  
-0.4539280299  
-0.5553735969  
-0.6339067609  
-0.67993379  
-0.6878564492  
-0.6568988714  
-0.591331284  
-0.5000320293  
-0.3954351424  
-0.2919872397  
-0.2043024602  
-0.1452623572  
-0.1243022353  
-0.146115125  
-0.2099459212  
-0.3095630202  
-0.433921867  
-0.5684130363  
-0.6965492761  
-0.8018553118  
-0.8697354321  
-0.8890768813  
-0.8534286058  
-0.7616060159  
-0.6177055153  
-0.4305527318  
-0.2126834644  
0.02098929084  
0.2546548482  
0.473055715  
0.6627596327  
0.8131469518  
0.917030499  
0.9708993708  
0.9748081346  
0.9319617525  
0.8480880405  
0.7306869752  
0.5882582826  
0.4295963868  
0.2632166764  
0.09698283554  
-0.06206766908  
-0.2077092202  
-0.3343616769  
-0.4368524195  
-0.5102046201  
-0.5495275535  
-0.5500990245  
-0.5076663026  
-0.4189720151  
-0.28243053  
-0.09885305401  
0.1279273972  
0.3906745898  
0.6787453744  
0.9785454749  
1.274433506  
1.550010227  
1.789627244  
1.979923793  
2.111150127  
2.178095238  
2.180466739  
2.122673586  
2.013040566  
1.8625956  
1.683615083  
1.488146934  
1.286729665  
1.087475771  
0.8956304532  
0.7136090731  
0.5414750426  
0.3777231129  
0.2202138033  
0.06708863811  
-0.0824961382  
-0.2279141008  
-0.3669596708  
-0.4960784822  
-0.6108762172  
-0.7068124357  
-0.779966332  
-0.8277435742  
-0.849431702  
-0.8465237184  
-0.8227622322  
-0.783905727  
-0.7372277254  
-0.6908123235  
-0.652703206  
-0.6300168535  
-0.6280844372  
-0.6497496988  
-0.6948851086  
-0.7602219703  
-0.8395230939  
-0.924119959  
-1.003785056  
-1.067868504  
-1.106586413  
-1.112306173  
-1.080684178  
-1.011462016  
-0.9088015244  
-0.7810589029  
-0.6399694251  
-0.4993079476  
-0.3731731568  
-0.2740956556  
-0.2112490383  
-0.1890078718  
-0.2061136635  
-0.2555837343  
-0.3254334553  
-0.4001506265  
-0.4627320002  
-0.497026186  
-0.490034163  
-0.4338635513  
-0.3270282581  
-0.1749090252  
0.01070424734  
0.2129313152  
0.4118042364  
0.5866909726  
0.7188088234  
0.7935163809  
0.8020886972  
0.7427792954  
0.621046834  
0.4489426067  
0.2437497758  
0.02602789537  
-0.1826869298  
-0.3623024822  
-0.4964247349  
-0.5742048396  
-0.5915788836  
-0.5517389035  
-0.4647655613  
-0.3464250331  
-0.2162504588  
-0.09508775094  
-0.00239066381  
0.04640036858  
0.04205655409  
-0.01698451933  
-0.1241566677  
-0.2654156188  
-0.4209847814  
-0.5680047964  
-0.6837839127  
-0.7491762889  
-0.7516193413  
-0.6873402112  
-0.5623525369  
-0.3919989749  
-0.1990301191  
-0.01040738952  
0.1467470374  
0.2494818474  
0.282971195  
0.2434374859  
0.1395176874  
-0.008245334139  
-0.1698325506  
-0.3098296701  
-0.392624043  
-0.387953346  
-0.2759521657  
-0.05087815572  
0.2771605456  
0.6828102999  
1.128444955  
1.569111359  
1.958739604  
2.25667186  
2.4335022  
2.475286477  
2.385463901  
2.184163953  
1.905036448  
1.590105009  
1.283482902  
1.024943614  
0.8443578307  
0.7578097955  
0.7659490188  
0.854724404  
0.9982809928  
1.163473724  
1.31520684  
1.421748187  
1.45920616  
1.414548672  
1.286806324  
1.086417494  
0.8329544942  
0.5516938234  
0.2696546746  
0.01172157193  
-0.2025742617  
-0.3612053614  
-0.4605271098  
-0.5048746045  
-0.5050886508  
-0.4762777413  
-0.4352457495  
-0.397968787  
-0.3774970483  
-0.3825007319  
-0.4166093989  
-0.4785135357  
-0.5627298085  
-0.6608329743  
-0.7629259051  
-0.8591296899  
-0.9408986234  
-1.002028516  
-1.039287987  
-1.052646417  
-1.045141296  
-1.02243774  
-0.9921343057  
-0.9629059647  
-0.9435252383  
-0.9418296301  
-0.9637078657  
-1.012164506  
-1.086575323  
-1.182223328  
-1.290239554  
-1.398036695  
-1.490284  
-1.55042625  
-1.562632283  
-1.514022836  
-1.396876052  
-1.210526257  
-0.9626067588  
-0.6693674268  
-0.3548571537  
-0.04895716642  
0.2156363987  
0.4071426794  
0.498711761  
0.4721629529  
0.3209106022  
0.0516003084  
-0.3158418859  
-0.749831363  
-1.21026262  
-1.652777008  
-2.033609806  
-2.314400427  
-2.466350532  
-2.473225288  
-2.332876852  
-2.057160852  
-1.670317986  
-1.206090343  
-0.7039340137  
-0.2048020041  
0.2530752276  
0.6379360143  
0.9274332355  
1.11048327  
1.18785593  
1.171478647  
1.082524181  
0.9485206926  
0.7998115296  
0.6657842819  
0.5713527417  
0.5341169531  
0.5625808509  
0.6556387704  
0.8033791137  
0.9890428295  
1.191827992  
1.390087423  
1.564440585  
1.700344629  
1.789774677  
1.831811034  
1.83212138  
1.801475125  
1.753580502  
1.702597529  
1.660726477  
1.636212149  
1.632048961  
1.645529713  
1.668690656  
1.689540947  
1.693913905  
1.667658399  
1.598882607  
1.47995316  
1.308988811  
1.090640986  
0.836053257  
0.5619845255  
0.2891740626  
0.04012529483  
-0.1634273826  
-0.3030845561  
-0.3660377621  
-0.3467461225  
-0.2477845931  
-0.07974213318  
0.1398488544  
0.3884385323  
0.6410050674  
0.8728965667  
1.062611327  
1.194129411  
1.258507091  
1.254505744  
1.188199026  
1.071616036  
0.9206414783  
0.752482949  
0.5830876694  
0.4248804952  
0.28515431  
0.1653277208  
0.0611539329  
-0.03617659376  
-0.1382297879  
-0.2571188639  
-0.4032222591  
-0.5831736143  
-0.7984175192  
-1.044518423  
-1.311330536  
-1.583975344  
-1.844508304  
-2.074049723  
-2.255098346  
-2.373749938  
-2.421540267  
-2.396683025  
-2.304563034  
-2.15739134  
-1.973065424  
-1.773333889  
-1.581454786  
-1.419607743  
-1.306323073  
-1.254231807  
-1.268381796  
-1.345349688  
-1.473262805  
-1.632777057  
-1.79894888  
-1.943826702  
-2.039513674  
-2.061368694  
-1.990996272  
-1.818662265  
-1.544841948  
-1.180669519  
-0.7471994392  
-0.2735113277  
0.2061525446  
0.6559230612  
1.042104686  
1.336805592  
1.520961586  
1.586385078  
1.536593715  
1.386284956  
1.159544994  
0.8869782807  
0.6021215987  
0.33758019  
0.1213563735  
-0.02616896619  
-0.0942396789  
-0.08247719646  
-0.0003179619573  
0.1347527024  
0.2999041082  
0.4701958723  
0.6218961445  
0.7354167688  
0.797483653  
0.8022801187  
0.7514660311  
0.6531552146  
0.5200783922  
0.3672795355  
0.2097472836  
0.06036212824  
-0.07153636243  
-0.1807754771  
-0.2661487119  
-0.3294970765  
-0.3743299886  
-0.4042808313  
-0.4217420841  
-0.4269559523  
-0.4177324886  
-0.3898643227  
-0.3381304459  
-0.2576860303  
-0.1455493627  
-0.00184361473  
0.1694659859  
0.3605541097  
0.560490984  
0.7566901508  
0.9368165032  
1.090838182  
1.212833717  
1.302218962  
1.364108327  
1.408687518  
1.449639307  
1.501808473  
1.578458787  
1.688549  
1.83447028  
2.010643646  
2.203255381  
2.391242566  
2.548451666  
2.64672435  
2.659504539  
2.565493127  
2.351833565  
2.016402214  
1.568861172  
1.030309308  
0.4315688061  
-0.1897150455  
-0.7927940676  
-1.337923241  
-1.790349773  
-2.123737268  
-2.322632837  
-2.383715905  
-2.315722592  
-2.138094467  
-1.878529166  
-1.569752406  
-1.245887964  
-0.9388383434  
-0.6750833343  
-0.4732356933  
-0.3425990638  
-0.282875918  
-0.2849974421  
-0.3329663964  
-0.4064391756  
-0.4837283471  
-0.5448231966  
-0.5740529282  
-0.5620567958  
-0.5068138774  
-0.4136276636  
-0.294084874  
-0.1641624364  
-0.04176863795  
0.055934552  
0.1150232314  
0.1267852663  
0.08890087813  
0.005680143888  
-0.1126436954  
-0.2514414148  
-0.3937769643  
-0.5227538577  
-0.6237671659  
-0.6863466187  
-0.7053608799  
-0.6814303562  
-0.6205492555  
-0.5329892112  
-0.4316894274  
-0.3303574356  
-0.2415561923  
-0.1750305736  
-0.1364760144  
-0.1268877967  
-0.1425599705  
-0.1757029751  
-0.21558867  
-0.2500550823  
-0.2671829078  
-0.2569227842  
-0.2124629603  
-0.13118166  
-0.0150493951  
0.1295545523  
0.2925915008  
0.4615723287  
0.6230671063  
0.7642963342  
0.8745954247  
0.9465365161  
0.9765631745  
0.9650445767  
0.9157853996  
0.8350845883  
0.7305242984  
0.6097289306  
0.4793104884  
0.3441863734  
0.2073854441  
0.07034029204  
-0.06642043905  
-0.2023829966  
-0.3361502592  
-0.464806796  
-0.5836846563  
-0.6866470802  
-0.7668561874  
-0.8179020676  
-0.8350810383  
-0.816560766  
-0.7641883676  
-0.6837403658  
-0.584515944  
-0.4783021629  
-0.3778410758  
-0.2950379888  
-0.2392059149  
-0.2156223487  
-0.2246672417  
-0.2616758579  
-0.3175609681  
-0.3801031989  
-0.4357298701  
-0.4715062069  
-0.4770397112  
-0.4460217044  
-0.3771727036  
-0.2744731555  
-0.1466433401  
-0.005977603632  
0.1333067333  
0.2569546705  
0.352534259  
0.4110207892  
0.4278958886  
0.4036409482  
0.343580189  
0.2571150906  
0.156490051  
0.05525727651  
-0.03333289667  
-0.0978247442  
-0.129736298  
-0.1243095414  
-0.0807783573  
-0.00216223366  
0.1053296442  
0.2331645596  
0.3714674371  
0.5099929548  
0.6389742154  
0.7497811298  
0.8353885199  
0.8906752063  
0.9126075895  
0.9003627648  
0.8554279053  
0.7816600403  
0.685276611  
0.5746932358  
0.4601366171  
0.3529701462  
0.2647093286  
0.2057997244  
0.1842495498  
0.2043350488  
0.2655664786  
0.3621563567  
0.4831484858  
0.6132907644  
0.7346322787  
0.8286680393  
0.8787857504  
0.8726550632  
0.8041947309  
0.6747856578  
0.4935010084  
0.276266382  
0.04401809182  
-0.1798872681  
-0.3726606293  
-0.5150275169  
-0.5937053975  
-0.6030537561  
-0.5456708583  
-0.4318637478  
-0.2781010838  
-0.1047019199  
0.06689831903  
0.2168844126  
0.3294411848  
0.3944557447  
0.4083633486  
0.3740721993  
0.3000498548  
0.1987599785  
0.08471324793  
-0.02757654767  
-0.1254342918  
-0.1994397134  
-0.2442629111  
-0.2588574958  
-0.2460494348  
-0.2116369527  
-0.1631895913  
-0.1087409083  
-0.05558220965  
-0.009329812817  
0.02663175735  
0.05128996372  
0.06575476282  
0.07271097319  
0.07569381171  
0.07833104431  
0.0836762656  
0.09371758264  
0.1091289669  
0.1292447461  
0.1522190729  
0.1753035284  
0.1951551753  
0.208105673  
0.2103427153  
0.197996956  
0.167172004  
0.1139814671  
0.03467262788  
-0.0740967742  
-0.2147719115  
-0.3882354396  
-0.5930410132  
-0.8246722901  
-1.075023703  
-1.332260464  
-1.581226225  
-1.804445835  
-1.983695013  
-2.101978815  
-2.145666613  
-2.106458971  
-1.982870459  
-1.780934919  
-1.513979012  
-1.201427442  
-0.8667725999  
-0.5349811992  
-0.2297072  
0.0292969118  
0.2281822323  
0.360154541  
0.4256318755  
0.4314172913  
0.3890803697  
0.3128148812  
0.2171502703  
0.114883547  
0.01554321792  
-0.07540228753  
-0.1564972561  
-0.2295059422  
-0.2980397968  
-0.3659144183  
-0.4355439254  
-0.5066982302  
-0.5758374134  
-0.6361613254  
-0.6783624938  
-0.6919395498  
-0.6668490065  
-0.5951943774  
-0.4726704825  
-0.2995136531  
-0.08081057971  
0.1738866026  
0.4515492902  
0.7371143212  
1.015142145  
1.271435241  
1.494403862  
1.675995549  
1.812108236  
1.902487336  
1.950173433  
1.960641921  
1.940795846  
1.897954551  
1.838987287  
1.769653728  
1.694221441  
1.615321654  
1.534039031  
1.450160352  
1.36254103  
1.26953001  
1.169423934  
1.060913035  
0.9434986437  
0.8178641771  
0.6861626641  
0.5521797322  
0.421339131  
0.3004814804  
0.1974117564  
0.1201768576  
0.07613250356  
0.07085240768  
0.1070174397  
0.1834311336  
0.2943379786  
0.4292011166  
0.5730605694  
0.7075146229  
0.8122910362  
0.8672714291  
0.8547591924  
0.7617109424  
0.581641188  
0.3159228477  
-0.0257251246  
-0.4256704752  
-0.8597309779  
-1.299318909  
-1.714150348  
-2.075190995  
-2.357500627  
-2.542635509  
-2.620332273  
-2.589279047  
-2.456914896  
-2.238299574  
-1.954226398  
-1.628831614  
-1.287004513  
-0.9519241961  
-0.6430083706  
-0.374496976  
-0.1547955703  
0.01340235552  
0.1323064776  
0.2077091978  
0.2473920937  
0.2595138246  
0.2512276626  
0.2276985233  
0.1916394365  
0.1433874972  
0.08144166226  
0.003350792044  
-0.09322799343  
-0.2094781766  
-0.344545084  
-0.4949478715  
-0.6543691198  
-0.8138393814  
-0.9622915281  
-1.087431508  
-1.176826619  
-1.219117165  
-1.205235949  
-1.129522005  
-0.9906184322  
-0.7920632947  
-0.5424717283  
-0.2552641096  
0.05209110386  
0.3593064961  
0.6448921348  
0.888047881  
1.070657153  
1.179172262  
1.206187287  
1.151483377  
1.022407178  
0.8334696364  
0.6051745744  
0.3621467127  
0.1307477444  
-0.06359055662  
-0.1990073505  
-0.2595496225  
-0.2369037819  
-0.1313269917  
0.04835864696  
0.2857064264  
0.558436055  
0.8408564197  
1.106639932  
1.331619191  
1.496274185  
1.587619638  
1.600281705  
1.536661792  
1.406197557  
1.223858769  
1.008093583  
0.7785332049  
0.5537374925  
0.3492997059  
0.1765062503  
0.04169096081  
-0.0536988249  
-0.112411447  
-0.1402429397  
-0.144656781  
-0.1334020254  
-0.1133384856  
-0.08961789335  
-0.06529091244  
-0.04134584198  
-0.01709184911  
0.009226760898  
0.03971159692  
0.07614259573  
0.1194387168  
0.1693192875  
0.2241872165  
0.2812070472  
0.3365294658  
0.3856152783  
0.4235857691  
0.4455737114  
0.4470334857  
0.424022834  
0.3734447332  
0.2932785954  
0.1827990244  
0.042784438  
-0.1242954842  
-0.3141583087  
-0.5206765229  
-0.735986557  
-0.9507710533  
-1.154716374  
-1.337160702  
-1.487873272  
-1.597931487  
-1.66059994  
-1.672129783  
-1.632385635  
-1.545200827  
-1.418394423  
-1.263376395  
-1.094342547  
-0.9270644521  
-0.777352619  
-0.6593248628  
-0.5836510505  
-0.5559820978  
-0.5757998596  
-0.6358674605  
-0.7224423373  
-0.8163092653  
-0.894581009  
-0.9331255564  
-0.9093538162  
-0.8050531417  
-0.6089096673  
-0.3183895778  
0.05928171192  
0.5071985544  
0.9999575716  
1.505809926  
1.989587741  
2.416048453  
2.75327912  
2.975762426  
3.066764991  
3.019775558  
2.83886389  
2.537943254  
2.139075508  
1.670056034  
1.16161273  
0.6445748253  
0.1473276622  
-0.3061608994  
-0.6976049367  
-1.014908803  
-1.251984058  
-1.408034655  
-1.486499371  
-1.493858026  
-1.438468987  
-1.329562023  
-1.17644522  
-0.9879489598  
-0.7720953648  
-0.535967208  
-0.2857657478  
-0.02704407687  
0.2348873593  
0.494414504  
0.7449759148  
0.9784333705  
1.184593765  
1.351049189  
1.463512874  
1.506749329  
1.466141884  
1.329799769  
1.090960332  
0.7503545131  
0.3180911595  
-0.1853627371  
-0.7294753759  
-1.275407811  
-1.779223479  
-2.196283516  
-2.486312513  
-2.618465569  
-2.575624265  
-2.357221507  
-1.980056797  
-1.476855043  
-0.8926685049  
-0.2795770147  
