0.5318426694  
0.5186973711  
0.5023445097  
0.4808814003  
0.4536974965  
0.421842602  
0.3880859338  
0.356649132  
0.332643069  
0.3213004348  
0.3271232896  
0.353082281  
0.4000053451  
0.4662424054  
0.5476750236  
0.6380662197  
0.7297067248  
0.8142602086  
0.8836957117  
0.9311693064  
0.9517472112  
0.9428755321  
0.9045502877  
0.8391854165  
0.7512174041  
0.646515104  
0.5316964927  
0.4134390936  
0.2978760311  
0.1901403501  
0.09408440475  
0.0121847876  
-0.05440087507  
-0.1056669817  
-0.1425401316  
-0.1666507357  
-0.1801435972  
-0.1855440002  
-0.1856764941  
-0.1836281787  
-0.1827174579  
-0.186440736  
-0.1983677177  
-0.2219639701  
-0.2603459512  
-0.3159798727  
-0.390357091  
-0.4836872858  
-0.5946562453  
-0.7202895375  
-0.8559607872  
-0.9955579459  
-1.131825624  
-1.256861574  
-1.362743962  
-1.442240415  
-1.489546626  
-1.500967413  
-1.475481679  
-1.415095181  
-1.324930491  
-1.212992951  
-1.089602242  
-0.966499748  
-0.855697198  
-0.7681644845  
-0.7124935755  
-0.6936986496  
-0.7123243428  
-0.7640023354  
-0.8395795191  
-0.9258566143  
-1.006922247  
-1.065961113  
-1.087353589  
-1.058814329  
-0.9732783273  
-0.8302638121  
-0.6364698395  
-0.4054686466  
-0.1564660887  
0.08777057658  
0.3035749872  
0.4693077182  
0.5681500371  
0.590371402  
0.5347473198  
0.4089086121  
0.2285558616  
0.01564500867  
-0.2042149147  
-0.4047891297  
-0.562259303  
-0.6578827488  
-0.6799279382  
-0.6246789441  
-0.4964205028  
-0.3064785406  
-0.07150155852  
0.1887432026  
0.4537326599  
0.7044119901  
0.9250132323  
1.104291906  
1.236102727  
1.319330896  
1.357267484  
1.356592481  
1.326139447  
1.275625693  
1.214505527  
1.151055532  
1.091767324  
1.041053579  
1.001250144  
0.972854148  
0.9549225596  
0.945550147  
0.9423513161  
0.9428828898  
0.9449610356  
0.9468563474  
0.9473437828  
0.945640401  
0.9412348364  
0.9336533718  
0.9221862264  
0.9056273794  
0.8820544225  
0.8486964332  
0.8019311104  
0.7374424326  
0.6505677197  
0.5368453737  
0.3927434994  
0.2165223214  
0.009137342898  
-0.2249332366  
-0.4770942306  
-0.7344256077  
-0.9799962939  
-1.193795571  
-1.354289725  
-1.440526094  
-1.434600805  
-1.324204373  
-1.104915622  
-0.7818672992  
-0.3704733169  
0.1040218524  
0.6082402523  
1.103523765  
1.549658562  
1.909042615  
2.150762619  
2.254048607  
2.210617034  
2.02558507  
1.716808489  
1.312743536  
0.8491137536  
0.3648226742  
-0.1023366898  
-0.5196547048  
-0.8626619467  
-1.117142751  
-1.279803234  
-1.357603109  
-1.365909716  
-1.325781685  
-1.260769401  
-1.19366651  
-1.143623759  
-1.123968466  
-1.140966514  
-1.193629767  
-1.274534813  
-1.371477916  
-1.469695544  
-1.554309162  
-1.61263148  
-1.63600914  
-1.62094836  
-1.569386072  
-1.488093396  
-1.387335042  
-1.2790131  
-1.174591355  
-1.083148815  
-1.009851782  
-0.9550873257  
-0.9144014775  
-0.879223345  
-0.8382793562  
-0.7794570711  
-0.6918341841  
-0.5675581375  
-0.4032909032  
-0.2010031761  
0.03199513514  
0.2837871678  
0.5392314846  
0.7817865898  
0.9955180799  
1.16700456  
1.286880848  
1.350829179  
1.359894668  
1.320117058  
1.241555873  
1.136876208  
1.019694391  
0.9029381457  
0.7974197979  
0.7108143794  
0.6471377429  
0.6067640475  
0.5869263596  
0.582585598  
0.5875097109  
0.5953810973  
0.6007618565  
0.5997847817  
0.5904863291  
0.5727738175  
0.5480677272  
0.5187265838  
0.4873821936  
0.4563251159  
0.4270572651  
0.4000855785  
0.3749800382  
0.3506547828  
0.3257949099  
0.299314852  
0.2707340815  
0.2403867579  
0.2094006188  
0.1794626874  
0.1524130775  
0.1297584729  
0.1122175871  
0.09939747578  
0.08967940586  
0.08035105302  
0.06797163845  
0.04890993029  
0.01996698221  
-0.02102231583  
-0.0747160884  
-0.1399948972  
-0.2139505562  
-0.292133385  
-0.3690309243  
-0.4387074671  
-0.4955163766  
-0.5347882876  
-0.5534030438  
-0.5501656775  
-0.525949609  
-0.4835812765  
-0.4275045541  
-0.3632560058  
-0.296840806  
-0.2340915703  
-0.1800788439  
-0.1386623186  
-0.112214657  
-0.1015366757  
-0.1059609835  
-0.1235944529  
-0.1516593086  
-0.1868685534  
-0.2257913262  
-0.2651650645  
-0.3021400666  
-0.3344542688  
-0.3605403085  
-0.3795864564  
-0.3915613488  
-0.3971946486  
-0.3979217007  
-0.395766533  
-0.3931522051  
-0.3926324115  
-0.3965449152  
-0.4066138874  
-0.4235436346  
-0.4466674903  
-0.4737066672  
-0.5007140755  
-0.5222463504  
-0.5317749135  
-0.5223323435  
-0.4873291669  
-0.4214628781  
-0.3215920043  
-0.1874603526  
-0.02214659379  
0.1678545096  
0.372967702  
0.5812878251  
0.7796785081  
0.9551050378  
1.096036582  
1.193745208  
1.243313999  
1.24422367  
1.200417208  
1.11982471  
1.013402164  
0.8938002193  
0.7738454555  
0.6650302377  
0.5762094135  
0.5126850062  
0.4757827751  
0.4629689536  
0.4684664455  
0.4842688208  
0.501381384  
0.5111054305  
0.5061707847  
0.4815701385  
0.4349818228  
0.3667700237  
0.2795916913  
0.1777252606  
0.06626611694  
-0.04965837391  
-0.1655054985  
-0.277683964  
-0.3836209784  
-0.4815703025  
-0.5702423962  
-0.6483827288  
-0.7144229698  
-0.7663344903  
-0.801736357  
-0.8182797666  
-0.8142474219  
-0.7892500679  
-0.7448697813  
-0.6850823594  
-0.6163176687  
-0.5470676815  
-0.4870301255  
-0.4458600254  
-0.4316880479  
-0.4496292127  
-0.5005322092  
-0.5802159232  
-0.6793770407  
-0.7842646024  
-0.8780983585  
-0.9430787427  
-0.9627346521  
-0.9242694005  
-0.8205572659  
-0.6514630003  
-0.4242565814  
-0.1530218438  
0.142882885  
0.4411098458  
0.7190171032  
0.9563949995  
1.137802287  
1.254189969  
1.303586761  
1.29077411  
1.226054292  
1.123342599  
0.9979195137  
0.8642160176  
0.7339744224  
0.6150474702  
0.5109690631  
0.4212894355  
0.3425439825  
0.2696165629  
0.1972131828  
0.1211714615  
0.03936930035  
-0.04788778382  
-0.1380347835  
-0.2268852529  
-0.3095662427  
-0.3815458494  
-0.4395298481  
-0.482055111  
-0.5096693518  
-0.5246859107  
-0.530577198  
-0.5311535653  
-0.5296968694  
-0.5282333136  
-0.5270878865  
-0.5248052242  
-0.518447079  
-0.5042011807  
-0.4781813232  
-0.4372616946  
-0.3797919941  
-0.3060612425  
-0.2184304744  
-0.1211131001  
-0.01964977539  
0.07983583288  
0.1714714845  
0.2504264138  
0.3135344963  
0.3596674451  
0.3897943399  
0.4067458666  
0.4147212644  
0.4186159804  
0.4232785485  
0.4328039668  
0.449950612  
0.4757688182  
0.5094605249  
0.5484898814  
0.5889038107  
0.6258112226  
0.6539481241  
0.6682656275  
0.6644694074  
0.6394828252  
0.5917996824  
0.5217357616  
0.4315801194  
0.3256477499  
0.2102418229  
0.0934889253  
-0.01497405282  
-0.1045192865  
-0.1642770273  
-0.1841350764  
-0.1559412316  
-0.07482025063  
0.05954557013  
0.2418863991  
0.4607781369  
0.6987520956  
0.9332252632  
1.138296173  
1.287311522  
1.355970854  
1.325599649  
1.18613677  
0.9383585565  
0.594909752  
0.1798570924  
-0.2733371059  
-0.7252688959  
-1.135107001  
-1.465600211  
-1.687900629  
-1.785503522  
-1.756730127  
-1.615333663  
-1.389089888  
-1.116511683  
-0.8420762184  
-0.6105816453  
-0.4613487956  
-0.4230305508  
-0.509701018  
-0.7187442684  
-1.030833149  
-1.412024985  
-1.817740407  
-2.198135155  
-2.504204035  
-2.693843039  
-2.737096106  
-2.619900438  
-2.345838362  
-1.935665825  
-1.424678193  
-0.8582689722  
-0.2862928394  
0.2430104859  
0.6887003266  
1.021675799  
1.227493167  
1.307137296  
1.27572184  
1.159409028  
0.9910556572  
0.8052811512  
0.6336797073  
0.5008453447  
0.4217174514  
0.4005334396  
0.4314088631  
0.5003537334  
0.5883228909  
0.6747839793  
0.7412656369  
0.7743711202  
0.7678711371  
0.7236223592  
0.6512572789  
0.5667241033  
0.4899255069  
0.4417854561  
0.441129148  
0.5017699401  
0.6301425202  
0.8237677088  
1.070713413  
1.350132682  
1.633831657  
1.888737891  
2.080041781  
2.174727825  
2.145166645  
1.972423022  
1.64895266  
1.180389213  
0.5862063119  
-0.1008895747  
-0.836851621  
-1.569382004  
-2.242006351  
-2.798808248  
-3.189428437  
-3.373858662  
-3.326566076  
-3.039496177  
-2.523596205  
-1.8086115  
-0.9410774523  
0.01938161764  
1.005145179  
1.94659827  
2.778432412  
3.445561108  
3.907995063  
4.144114585  
4.151962516  
3.948422562  
3.56641214  
3.050461014  
2.451271295  
1.819963947  
1.202750707  
0.6366908325  
0.1470160654  
-0.2537369088  
-0.5648164771  
-0.794872582  
-0.9585992928  
-1.073018517  
-1.154047137  
-1.21386913  
-1.259468057  
-1.292448383  
-1.31001956  
-1.30684696  
-1.277317654  
-1.217755215  
-1.128146074  
-1.013069077  
-0.8816788389  
-0.7467675991  
-0.6230946287  
-0.5252821248  
-0.4656404144  
-0.45228695  
-0.4878633203  
-0.5690456682  
-0.6869307357  
-0.8282191958  
-0.9770188537  
-1.116976661  
-1.233423782  
-1.315201203  
-1.355909658  
-1.354411789  
-1.314541859  
-1.244106515  
-1.153373098  
-1.053309203  
-0.9538673079  
-0.8625915846  
-0.7837419179  
-0.7180367102  
-0.6630106893  
-0.6138664391  
-0.5646411211  
-0.5094564301  
-0.4436319876  
-0.3644877283  
-0.2717139972  
-0.1672986734  
-0.05505078664  
0.06015355033  
0.1732425676  
0.2797746047  
0.3765678919  
0.4620316062  
0.5361527522  
0.6001566973  
0.6559196581  
0.7052503027  
0.7491829594  
0.7874192268  
0.818039697  
0.8375479868  
0.8412697999  
0.8240586344  
0.7812129402  
0.7094639429  
0.6078782491  
0.4785232282  
0.3267662357  
0.1611332213  
-0.007290735344  
-0.1658646542  
-0.301694256  
-0.4030675211  
-0.4608412411  
-0.4695898439  
-0.42835521  
-0.3408840643  
-0.2153064634  
-0.06327804139  
0.1013051735  
0.2638677651  
0.4107831738  
0.5308603502  
0.6164924806  
0.6643143371  
0.6752934817  
0.6542397491  
0.6088256516  
0.5482567214  
0.4817908471  
0.4173242989  
0.3602508653  
0.3127528647  
0.2736291963  
0.2386780595  
0.2015719955  
0.1551013145  
0.09259071314  
0.009290826642  
-0.09647207153  
-0.2225555647  
-0.3627997057  
-0.507401875  
-0.6438468946  
-0.7582827279  
-0.8371761172  
-0.8690389394  
-0.8460058898  
-0.765048373  
-0.6286634754  
-0.4449215979  
-0.2268563296  
0.008759701943  
0.2431137733  
0.4573331919  
0.6345124324  
0.7615391592  
0.8304992504  
0.8394915194  
0.7927490831  
0.7000737599  
0.5756536228  
0.4364364539  
0.3002589716  
0.1839715079  
0.1017681601  
0.06390431561  
0.07590783224  
0.1383223523  
0.2469656402  
0.3936096562  
0.5669796301  
0.7539306354  
0.9406856596  
1.114012488  
1.262250685  
1.376122175  
1.449270266  
1.478513725  
1.463810793  
1.407950991  
1.316029623  
1.194767363  
1.051758256  
0.894740899  
0.7309659576  
0.5667335003  
0.4071242033  
0.2559253332  
0.1157193308  
-0.0119311072  
-0.1262646021  
-0.2271360771  
-0.3149070454  
-0.3904216332  
-0.4550483588  
-0.5107435973  
-0.5600755231  
-0.606154064  
-0.6524286199  
-0.7023532367  
-0.7589493649  
-0.8243263875  
-0.8992584277  
-0.9828919259  
-1.072670348  
-1.164511916  
-1.253232733  
-1.333178566  
-1.398956033  
-1.44615893  
-1.471962794  
-1.475489352  
-1.457873269  
-1.422022621  
-1.372120102  
-1.312944531  
-1.249149697  
-1.184615392  
-1.121989445  
-1.062499271  
-1.006051264  
-0.9515942845  
-0.8976646407  
-0.8430025456  
-0.7871102135  
-0.7306412193  
-0.6755268105  
-0.6248016587  
-0.5821459688  
-0.5512023781  
-0.5347869101  
-0.5341248805  
-0.5482568561  
-0.5737370483  
-0.6047064072  
-0.6333697237  
-0.6508413119  
-0.6482584926  
-0.6180156092  
-0.5549429552  
-0.4572392682  
-0.3270028465  
-0.1702518588  
0.003604820333  
0.1828011881  
0.3546176509  
0.5069711718  
0.6299532452  
0.7170864689  
0.7661092094  
0.7791641353  
0.7623698804  
0.7248435718  
0.6773442138  
0.6307478356  
0.5946041527  
0.5759799085  
0.5787570771  
0.603452192  
0.6475483894  
0.7062429279  
0.7734547111  
0.8429139094  
0.9091588943  
0.9682949672  
1.018423118  
1.059711864  
1.094133671  
1.124932128  
1.155935189  
1.190808271  
1.232369705  
1.282055911  
1.339601371  
1.402977238  
1.468589706  
1.531727557  
1.587196414  
1.630077632  
1.656511489  
1.664394607  
1.653889246  
1.627630142  
1.590558527  
1.549343925  
1.511407841  
1.483636887  
1.470920266  
1.474727776  
1.491945261  
1.514217737  
1.527995819  
1.51540957  
1.455989813  
1.329119038  
1.116958026  
0.8074927546  
0.3972508003  
-0.1067475197  
-0.6861956119  
-1.312107891  
-1.946897416  
-2.547759865  
-3.071000693  
-3.476783653  
-3.733677492  
-3.822385701  
-3.738151595  
-3.491493787  
-3.107173715  
-2.621516139  
-2.078458032  
-1.524823156  
-1.005439296  
-0.5586854507  
-0.2129827719  
0.01541458139  
0.1231552672  
0.1190803333  
0.02225926436  
-0.1408967522  
-0.3400433624  
-0.5444174436  
-0.7260737063  
-0.8625321483  
-0.9386354266  
-0.94750346  
-0.8905780542  
-0.7768427296  
-0.6213421707  
-0.4431969591  
-0.2633050998  
-0.1019509346  
0.02346315729  
0.1003772764  
0.1225318826  
0.0907943877  
0.01323867928  
-0.09555541022  
-0.2159669516  
-0.3254648511  
-0.4012195562  
-0.4229546628  
-0.3757277487  
-0.2523085397  
-0.05483175339  
0.2045447124  
0.5041629046  
0.8146064357  
1.101573113  
1.329605958  
1.466292883  
1.486436139  
1.375653143  
1.132899484  
0.7715165522  
0.3185712013  
-0.1875144721  
-0.700828207  
-1.172871134  
-1.557903547  
-1.818040361  
-1.927444999  
-1.875068598  
-1.665608331  
-1.318597021  
-0.8658133995  
-0.3474178495  
0.1926122572  
0.7111339721  
1.169980859  
1.539155802  
1.798792709  
1.939842097  
1.963580987  
1.880213712  
1.70687928  
1.465387121  
1.179957721  
0.8751642368  
0.5741819794  
0.2973957004  
0.06135856105  
-0.1219172162  
-0.2453611225  
-0.3069389712  
-0.3094522223  
-0.2600390655  
-0.1693925768  
-0.05073192234  
0.08140354708  
0.2124646171  
0.3291811157  
0.4207308464  
0.4796643302  
0.5025031634  
0.4899428061  
0.4466271374  
0.3805208838  
0.3019346778  
0.2223033969  
0.1528537933  
0.1033135971  
0.08080662104  
0.08907051529  
0.1280906482  
0.1941836138  
0.2805134379  
0.3779654668  
0.4762393206  
0.5650267908  
0.6351109098  
0.6792513971  
0.6927716025  
0.6738021129  
0.6231895757  
0.544129979  
0.4416083732  
0.3217461524  
0.1911432043  
0.0562960119  
-0.07686475969  
-0.2032948512  
-0.3190191661  
-0.4211963897  
-0.5081038253  
-0.5790567322  
-0.6343009402  
-0.6748873229  
-0.702531725  
-0.7194705172  
-0.7282988342  
-0.7317972946  
-0.7327453887  
-0.7337270252  
-0.7369346014  
-0.7439847586  
-0.7557573758  
-0.7722652665  
-0.7925768316  
-0.8147960287  
-0.8361179235  
-0.8529717122  
-0.8612560538  
-0.8566718674  
-0.8351312331  
-0.7932319297  
-0.7287343777  
-0.641001348  
-0.5313263979  
-0.4030871079  
-0.2616728815  
-0.1141627592  
0.0312472343  
0.16601655  
0.2821470352  
0.3730799726  
0.4344702972  
0.4647299944  
0.465242089  
0.4402047012  
0.3961191258  
0.3409799867  
0.2832872018  
0.2310158134  
0.190699685  
0.166744573  
0.1610787184  
0.1731583272  
0.2003183561  
0.2383918906  
0.2824733323  
0.3277133735  
0.3700031797  
0.4064578044  
0.4356426795  
0.4575304817  
