29.10150686  
29.1616326  
31.94018137  
34.6220539  
31.79254941  
1551.43692  
42902.44823  
48178.33178  
34633.14263  
46230.99788  
11950.17482  
4288.494222  
11527.36214  
11877.01934  
74797.67252  
6540.474609  
3914.422507  
15358.95912  
2735.341572  
4335.077841  
3953.571402  
883.5367859  
5946.506968  
5955.947747  
15721.87837  
9030.458445  
5150.193647  
6711.488025  
74.19589768  
1036.972062  
11942.58526  
5062.729937  
1266.966094  
219.0115304  
227.2066854  
10172.89859  
13951.02678  
1454.31943  
1831.474714  
292.8564393  
2161.960239  
588.5221324  
509.9132664  
217.3983416  
3831.334193  
5861.33502  
11340.35696  
1906.932725  
4184.974608  
420.6182327  
569.2401291  
8969.05253  
815.2542874  
1340.067132  
92.81666893  
3888.73199  
4819.974397  
396.2012256  
2524.141993  
4556.794692  
4639.371958  
270.2157763  
7.85610112  
244.6839619  
488.2685877  
554.5883328  
14.36270518  
187.8260229  
168.6783769  
19.99723632  
4.870046357  
34.88035557  
27.16220627  
0.2439674797  
1.784321599  
0.1808651153  
1.86026284  
0.7009110255  
5.680345849  
0.762692124  
2.973984808  
1.135851989  
1.852180388  
1.54735673  
1.647972321  
1.065467415  
1.107762266  
0.8219818744  
0.8916584614  
1.147513485  
0.7850378791  
0.9076747832  
0.775784627  
0.7528313243  
0.7300090912  
0.7303328255  
0.649296138  
0.6204436377  
0.6036844793  
0.5804764005  
0.5391586335  
0.5343683839  
0.4981533714  
0.4881769959  
0.4640531543  
0.4491061838  
0.431272795  
0.4160047285  
0.4019301161  
0.3912313477  
0.3771682082  
0.360727545  
0.3485084144  
0.3375863994  
0.3264452608  
0.3143842566  
0.3065569457  
0.2957666268  
0.2862210785  
0.2772150296  
0.269540153  
0.2612366119  
0.2528764588  
0.2451788189  
0.2382431268  
0.2314743537  
0.2247872438  
0.2184733351  
0.2124534573  
0.2065710269  
0.2008567332  
0.1954949886  
0.1903579946  
0.1853647188  
0.1805056606  
0.1759077656  
0.1714479242  
0.1671361896  
0.1629608008  
0.1589763418  
0.1551377931  
0.1514059347  
0.147825119  
0.1443720068  
0.1410105242  
0.1377605472  
0.1346321813  
0.1315997087  
0.1286862505  
0.1258439612  
0.1231035276  
0.1204521653  
0.1178779801  
0.1153867181  
0.1129757356  
0.1106405914  
0.1083701233  
0.1061717144  
0.1040416988  
0.101970497  
0.09996573661  
0.09801974998  
0.09612234008  
0.09428588271  
0.0925004662  
0.09076565234  
0.0890820971  
0.08744294115  
0.08584721222  
0.08429847565  
0.08279316482  
0.08132381867  
0.07989842921  
0.07850948664  
0.07715723159  
0.07583994999  
0.07455908979  
0.07330821679  
0.07209259165  
0.07090668271  
0.06974947809  
0.06862296606  
0.06752363698  
0.0664514247  
0.06540612428  
0.06438799422  
0.06339244962  
0.06242055887  
0.06147299353  
0.06054786086  
0.05964451785  
0.05876222236  
0.05789924115  
0.05705899536  
0.05623633362  
0.05543296667  
0.05464786293  
0.05387933795  
0.0531282188  
0.05239437446  
0.0516762663  
0.05097555999  
0.05029028976  
0.04961693403  
0.04896086153  
0.04831657661  
0.04768742408  
0.04707062472  
0.04646812674  
0.04587677171  
0.04529890202  
0.04473328838  
0.04417745787  
0.04363490416  
0.04310252556  
0.04258159679  
0.04206882222  
0.04156749344  
0.04107577502  
0.04059523047  
0.04012432251  
0.03966058189  
0.03920642442  
0.03876207317  
0.03832524145  
0.03789823305  
0.03747705063  
0.03706432707  
0.03666014349  
0.03626354615  
0.03587375943  
0.03549159389  
0.03511668736  
0.03474808318  
0.0343868554  
0.03403068307  
0.03368188497  
0.03333873761  
0.03300266778  
0.03267185271  
0.03234752943  
0.03202922298  
0.03171481834  
0.03140695016  
0.03110426819  
0.03080716424  
0.03051364016  
0.03022645457  
0.02994487966  
0.0296660646  
0.02939421324  
0.02912397627  
0.02886078651  
0.02860173764  
0.02834576601  
0.0280946446  
0.02784765513  
0.02760419113  
0.02736617647  
0.02712993602  
0.0268984324  
0.02667014363  
0.02644545974  
0.02622533294  
0.02600753152  
0.02579492424  
0.0255841032  
0.02537768788  
0.02517288774  
0.02497250742  
0.02477497234  
0.02458027763  
0.02438834825  
0.02419960931  
0.02401429973  
0.02383062865  
0.02365080458  
0.02347356263  
0.02329784502  
0.02312616571  
0.02295500836  
0.02278843764  
0.02262402236  
0.02246022911  
0.02230086996  
0.02214295113  
0.02198839014  
0.02183342063  
0.02168396065  
0.02153508475  
0.02138810196  
0.0212439353  
0.02110167719  
0.02096048916  
0.02082136625  
0.02068519236  
0.02055188406  
0.02041768484  
0.02028687104  
0.02015792733  
0.02003182624  
0.01990574792  
0.0197811698  
0.01965931903  
0.01953902897  
0.01942059627  
0.01930261138  
0.01918763331  
0.01907297641  
0.01896088247  
0.0188506648  
0.01874046663  
0.01863228266  
0.01852589057  
0.01842168451  
0.01831704191  
0.01821507642  
0.01811406028  
0.01801453277  
0.01791672755  
0.01781892922  
0.01772326815  
0.01762943827  
0.01753691455  
0.01744553888  
0.01735378995  
0.01726535296  
0.01717482406  
0.01708889579  
0.0170014601  
0.01691701562  
0.01683439059  
0.01675095604  
0.01666921109  
0.01658853986  
0.01650878328  
0.01642952677  
0.01635301265  
0.01627547495  
0.01620091153  
0.01612562067  
0.01605204948  
0.01597900612  
0.01590762339  
0.01583750512  
0.01576684242  
0.01569869409  
0.01563051561  
0.01556225806  
0.0154965139  
0.01542999506  
0.01536593157  
0.0153017751  
0.01523886967  
0.01517688888  
0.01511518829  
0.01505431575  
0.014994342  
0.01493485052  
0.01487713956  
0.01481974755  
0.01476281716  
0.01470674526  
0.01465055459  
0.01459577289  
0.01454243767  
0.01448804312  
0.014435279  
0.01438455826  
0.01433190919  
0.01428204551  
0.01423150938  
0.01418192194  
0.01413428294  
0.01408629308  
0.0140383336  
0.0139907474  
0.01394602284  
0.01389958412  
0.01385416234  
0.01381077338  
0.01376635081  
0.01372247325  
0.01367993014  
0.01363855602  
0.01359722496  
0.01355562657  
0.01351554181  
0.01347592423  
0.01343642209  
0.01339745718  
0.01335913908  
0.01332109157  
0.01328379586  
0.01324723425  
0.0132115585  
0.01317587772  
0.0131396998  
0.01310518934  
0.01307078947  
0.01303665405  
0.01300432713  
0.01297122433  
0.01293875807  
0.01290704906  
0.01287614973  
0.01284415612  
0.01281398848  
0.01278386456  
0.01275466919  
0.01272545836  
0.01269679015  
0.01266891903  
0.01264022242  
0.01261308746  
0.01258632076  
0.0125593676  
0.01253437076  
0.01250820247  
0.01248222221  
0.01245748909  
0.01243309175  
0.01240901479  
0.01238537399  
0.01236246188  
0.0123388465  
0.01231605518  
0.01229473987  
0.01227284693  
0.01225184648  
0.01223036606  
0.0122093475  
0.01218994409  
0.01217047521  
0.01215031606  
0.01213198406  
0.01211249574  
0.01209451395  
0.0120757693  
0.01205855389  
0.01204216508  
0.01202471898  
0.01200722436  
0.01199156705  
0.01197588941  
0.01195982466  
0.01194491732  
0.01193051802  
0.01191536812  
0.01190198034  
0.01188816552  
0.01187460567  
0.01186177531  
0.01184817639  
0.01183556188  
0.0118232749  
0.01181243596  
0.01180055147  
0.01178946828  
0.01177867365  
0.01176801008  
0.01175826661  
0.01174713202  
0.01173900668  
0.01173001485  
0.01172101891  
0.01171148797  
0.01170359017  
0.01169582135  
0.01168846056  
0.01168050997  
0.01167370193  
0.01166748894  
0.01166155863  
0.01165510407  
0.01164962541  
0.01164419692  
0.01163884035  
0.01163327237  
0.01162965248  
0.01162541855  
0.01162243816  
0.01161792229  
0.01161489789  
0.0116118906  
0.0116095466  
0.01160691939  
0.0116047952  
0.0116032558  
0.01160267802  
0.01160065222  
0.01160103488  
0.01159926089  
0.01160017056  
