61.38989017  
75.66317399  
104.1693252  
150.8091804  
272.2325375  
5203.75734  
1595.196099  
23195.17089  
50862.54758  
38804.84397  
14565.0505  
41430.92827  
1420.556625  
23336.83066  
39236.33562  
636.60793  
19640.66037  
8760.139248  
7196.855295  
20742.01445  
442.489457  
11403.76982  
1947.881291  
30565.7695  
6799.910177  
1621.82206  
3072.397718  
12826.38331  
19075.96915  
7232.336699  
18726.0942  
713.7815303  
8839.541882  
1072.193573  
2261.952981  
12577.37093  
2837.019967  
95.51143276  
2040.984389  
1564.616225  
4855.728679  
3376.286314  
2782.186593  
124.674875  
3713.70258  
3720.106214  
4522.368701  
3815.06146  
3044.888624  
2918.817303  
1337.79397  
929.1258212  
3923.409366  
134.3225116  
86.7283912  
790.3102255  
1730.971668  
533.7138249  
489.1029832  
236.4263651  
361.9899609  
319.2276148  
89.27838118  
189.6207316  
0.6934734442  
183.0317018  
150.7770426  
10.52736562  
105.9008676  
0.2959632348  
2.356229549  
15.53169607  
13.11061898  
11.28554492  
1.132411914  
1.791510296  
3.409215291  
2.320044708  
1.858382879  
0.9228393369  
0.9815133713  
1.156037685  
0.6671091994  
0.7912726598  
0.5481660349  
0.5186859729  
0.5502487694  
0.5536083219  
0.3962861172  
0.3051816637  
0.4252135107  
0.3334911731  
0.2856063552  
0.2975456028  
0.3225078441  
0.3225534141  
0.3054345784  
0.2738072183  
0.2826059279  
0.2773145521  
0.2689299718  
0.2668653681  
0.2527593932  
0.252190619  
0.2480972796  
0.2429632072  
0.2357179346  
0.2331378841  
0.2305025896  
0.227588387  
0.2254775554  
0.2214915237  
0.2172442321  
0.2146009242  
0.2114660174  
0.2087961755  
0.2055093389  
0.2025953373  
0.1998445771  
0.1969615258  
0.1943318367  
0.1921717588  
0.1896341038  
0.1871123802  
0.1848044561  
0.1826054386  
0.1801326577  
0.1777977442  
0.1756175929  
0.1734279877  
0.1714001095  
0.1692939097  
0.1671648324  
0.165153298  
0.1632228332  
0.1612850235  
0.1594073585  
0.1575279718  
0.1556577651  
0.1538891542  
0.1520990478  
0.1503381577  
0.1486541162  
0.1469857894  
0.1453310936  
0.143710376  
0.1421043158  
0.1405395141  
0.1390224061  
0.1374908193  
0.1360048485  
0.1345411101  
0.1331116838  
0.131694177  
0.1303016411  
0.1289264051  
0.1275890936  
0.1262638426  
0.1249625968  
0.1236814219  
0.1224234475  
0.1211853769  
0.1199588683  
0.118761717  
0.1175873122  
0.1164181309  
0.1152770874  
0.1141441093  
0.1130435859  
0.1119502217  
0.1108782711  
0.1098238249  
0.1087752467  
0.1077543406  
0.1067472846  
0.1057514167  
0.1047720104  
0.1038096799  
0.1028605493  
0.1019250304  
0.1010069675  
0.1001005428  
0.09920092058  
0.09832408114  
0.09745328987  
0.09661010056  
0.09574733209  
0.09492252423  
0.09411388929  
0.09331019405  
0.09251192332  
0.09172442063  
0.0909623691  
0.09019378173  
0.08943702545  
0.08870816142  
0.0879839387  
0.08726342581  
0.08654925529  
0.08584761866  
0.08516196921  
0.08448713685  
0.0838236363  
0.08316074171  
0.08251020095  
0.08187140598  
0.08123392673  
0.08060788123  
0.07998258708  
0.07938879289  
0.07879095303  
0.07819045228  
0.07761077182  
0.07703606745  
0.07646339254  
0.07589886751  
0.07535019181  
0.07480345793  
0.07426215178  
0.07373562232  
0.0732089129  
0.07269556859  
0.07218338204  
0.07167736351  
0.07117955818  
0.07068752253  
0.07020260813  
0.06972251437  
0.06925218027  
0.06878672818  
0.06832260241  
0.06787204059  
0.06741772329  
0.06697303346  
0.06653466294  
0.06610048065  
0.06567427221  
0.06525640816  
0.06483809572  
0.06441988087  
0.06401948883  
0.06361027044  
0.06322386805  
0.06283179505  
0.06243974072  
0.0620597127  
0.06167300471  
0.0612986027  
0.06093190862  
0.0605688631  
0.06021067099  
0.05985650717  
0.05950714451  
0.05915590511  
0.05881207475  
0.05847100911  
0.05813519423  
0.05780108009  
0.0574760534  
0.05715618908  
0.05683646535  
0.0565211592  
0.05620548994  
0.05590163306  
0.05559451087  
0.05528869516  
0.0549914109  
0.05469079395  
0.05440722144  
0.0541180136  
0.05383544893  
0.05355642434  
0.05327467137  
0.05300119241  
0.0527255553  
0.05245501629  
0.05218649845  
0.05193474746  
0.05167433843  
0.05141448663  
0.05115490176  
0.05090839969  
0.05065395752  
0.05041410618  
0.05016970617  
0.04992663077  
0.04969019749  
0.04945675117  
0.04921897406  
0.04899392911  
0.04876768934  
0.04854121458  
0.04831920747  
0.04809834909  
0.04787914487  
0.04766400535  
0.04745462958  
0.04724582785  
0.04703609218  
0.04683196835  
0.04662576891  
0.04642410032  
0.04622930896  
0.04602942959  
0.04583268509  
0.04563949151  
0.04544729956  
0.0452640828  
0.04507817178  
0.04489062025  
0.04470833526  
0.04453174358  
0.04434961043  
0.04417622181  
0.04400088311  
0.04382346644  
0.04365065125  
0.04348210949  
0.04331730078  
0.04314870397  
0.04298943098  
0.04282850384  
0.04266562348  
0.04250502089  
0.04234690507  
0.04219085151  
0.04203527924  
0.0418870473  
0.04172954721  
0.04159118436  
0.0414475844  
0.04129319412  
0.04115710354  
0.04101317839  
0.04086778751  
0.04073420121  
0.04059506497  
0.04045701292  
0.04032112431  
0.04018513861  
0.04005278013  
0.0399281186  
0.03979314074  
0.03966425611  
0.03953784377  
0.03941920531  
0.03929206409  
0.03917458646  
0.03904268475  
0.03892991593  
0.03880993744  
0.03870014708  
0.03858204757  
0.0384660482  
0.03835388528  
0.03823754389  
0.03812381736  
0.03801983897  
0.03791342731  
0.03780573772  
0.03769678421  
0.03759444877  
0.03749294159  
0.03738987151  
0.03728661166  
0.03718191156  
0.03708640769  
0.03698891124  
0.03689622943  
0.03679556519  
0.03670134278  
0.03660499509  
0.03651832179  
0.03642941749  
0.03633830091  
0.03624573733  
0.03615856456  
0.03607148416  
0.0359805269  
0.03590212202  
0.03581522656  
0.03573131508  
0.03565053267  
0.03557113972  
0.0354906506  
0.03540951627  
0.03533196229  
0.0352555355  
0.03517923404  
0.03510365237  
0.03503189028  
0.03495684545  
0.03488165905  
0.0348116559  
0.03473945064  
0.03467098631  
0.03460049106  
0.03453237896  
0.03446405402  
0.03440102521  
0.03433133236  
0.03426691237  
0.03420284493  
0.03414196741  
0.0340799855  
0.03402014488  
0.03395769938  
0.03389810819  
0.03383837895  
0.03378595573  
0.03372400629  
0.03366743268  
0.03361362403  
0.03355845475  
0.03350518418  
0.03344684433  
0.03340158491  
0.0333474225  
0.03329706634  
0.03325031523  
0.03319511996  
0.0331506738  
0.03309916381  
0.0330555031  
0.03301095282  
0.03296265833  
0.03291845314  
0.03287971006  
0.03282964281  
0.03278568759  
0.03274712845  
0.0327030463  
0.03266327104  
0.03262861963  
0.03258925656  
0.032547892  
0.03251175713  
0.03247730272  
0.03244121004  
0.03240229687  
0.03236664985  
0.03233377464  
0.03230417194  
0.03227063871  
0.03223609455  
0.03220375616  
0.03217476404  
0.03214750723  
0.03211394622  
0.03208599017  
0.03206102052  
0.03203522208  
0.03200198545  
0.03197847503  
0.03195095203  
0.03192875334  
0.03190417275  
0.0318826242  
0.0318575671  
0.03183864796  
0.0318203415  
0.0317950426  
0.03177882824  
0.03175706905  
0.03173790017  
0.03171842974  
0.03170394013  
0.03168742073  
0.03167268056  
0.03166043824  
0.03164323717  
0.0316286374  
0.03161091891  
0.03159723699  
0.03158995794  
0.03157658879  
0.03156591893  
0.03155838014  
0.03154342266  
0.03153791964  
0.03152811963  
0.03152105703  
0.03151483485  
0.0315090542  
0.03150349758  
0.03149526585  
0.03148723505  
0.03148166467  
0.03148341934  
0.03147906473  
0.03147692113  
0.0314720239  
0.03147588077  
0.03147281033  
