-0.2173494703  
-0.4531708131  
-0.6712830207  
-0.8512284464  
-0.9765801818  
-1.036895604  
-1.028965522  
-0.9571963977  
-0.8330747472  
-0.6737547412  
-0.4999466292  
-0.3333534222  
-0.1939636055  
-0.09754404776  
-0.05363223842  
-0.06429150713  
-0.1237863039  
-0.2192292295  
-0.332131318  
-0.4406773268  
-0.5224482926  
-0.5572648663  
-0.5298013803  
-0.4316370301  
-0.2624864443  
-0.03044866554  
0.2487799201  
0.5536350186  
0.8591435143  
1.139823617  
1.372645008  
1.539689304  
1.630167746  
1.641553855  
1.57969208  
1.457904906  
1.295226248  
1.114021414  
0.9373214077  
0.7862129828  
0.6776107495  
0.622656944  
0.6258978058  
0.6852655638  
0.7928068881  
0.9359778766  
1.099314861  
1.26623301  
1.42074451  
1.548916456  
1.639940487  
1.686757776  
1.686222095  
1.638846749  
1.548208221  
1.420102511  
1.26156651  
1.079881763  
0.8816656149  
0.6721647189  
0.4548181554  
0.2311637157  
0.001095568884  
-0.2365321951  
-0.4830373968  
-0.7388747  
-1.002602097  
-1.270007557  
-1.533580397  
-1.782472561  
-2.003039366  
-2.179981996  
-2.297996495  
-2.343765005  
-2.308019604  
-2.187376311  
-1.985631802  
-1.71424207  
-1.39183653  
-1.042718936  
-0.6944879338  
-0.3750314263  
-0.1093008217  
0.08372228958  
0.1933966213  
0.2187948407  
0.1688339565  
0.06112108253  
-0.08036177613  
-0.2284180665  
-0.356224271  
-0.4408542395  
-0.4662590786  
-0.4253087762  
-0.3206240552  
-0.1641104386  
0.0247265649  
0.2214502429  
0.3999730994  
0.5360120782  
0.6102793587  
0.6109810705  
0.535339302  
0.3899383947  
0.1898725484  
-0.04317415558  
-0.2836658938  
-0.5053998004  
-0.6847308235  
-0.8034177974  
-0.8507324596  
-0.8245753658  
-0.7314632686  
-0.5854303889  
-0.4060029376  
-0.2155471905  
-0.03634837461  
0.1121682084  
0.2157254961  
0.2666991019  
0.2646687909  
0.2159816959  
0.1324330664  
0.02927457301  
-0.07714402187  
-0.1717536346  
-0.2428435084  
-0.2835378927  
-0.292484366  
-0.2736827973  
-0.2354966224  
-0.1890126687  
-0.1460213195  
-0.1169327601  
-0.1089538245  
-0.1248164505  
-0.1622497174  
-0.2142746202  
-0.2702737224  
-0.3176509593  
-0.3438211817  
-0.3382130465  
-0.2939722099  
-0.2091057142  
-0.08690593553  
0.06440054222  
0.2326991927  
0.4035608231  
0.5620934727  
0.6948008831  
0.7911841854  
0.8448847281  
0.8542412905  
0.8222299628  
0.7558425995  
0.665035913  
0.5614240952  
0.4568987415  
0.3623715362  
0.2867488024  
0.236253737  
0.2141077168  
0.2205591834  
0.2531936874  
0.3074501761  
0.3772483706  
0.4556443371  
0.5354565881  
0.6098140488  
0.6726061337  
0.7188316522  
0.7448539552  
0.7485663794  
0.7294771437  
0.6887294298  
0.6290267309  
0.5544824921  
0.4703650891  
0.3827400969  
0.2980086493  
0.2223636283  
0.1612065836  
0.1185613369  
0.09657919162  
0.09518161558  
0.1119307959  
0.1421526673  
0.1793385172  
0.2158017266  
0.2435162473  
0.255044661  
0.244427693  
0.2079237685  
0.1444773757  
0.05584495327  
-0.05363847426  
-0.1776240218  
-0.3085680489  
-0.4386754538  
-0.5608244349  
-0.6693510938  
-0.7605589594  
-0.8329199577  
-0.8869436369  
-0.9247640165  
-0.9495504785  
-0.9648479358  
-0.9739740129  
-0.9795587531  
-0.9832961408  
-0.9859044992  
-0.9872620671  
-0.9866538032  
-0.9830363671  
-0.9752656834  
-0.9622126985  
-0.942790971  
-0.9158907704  
-0.8803045985  
-0.8346901008  
-0.7776431299  
-0.7078970379  
-0.6246409168  
-0.5278916383  
-0.4188277131  
-0.2999804899  
-0.1751797432  
-0.04921281694  
0.07280588957  
0.1862695187  
0.2879827219  
0.3769606354  
0.4549272604  
0.5263714493  
0.5980811893  
0.6781483397  
0.7745625222  
0.8936002017  
1.038249456  
1.206977982  
1.393068261  
1.584720079  
1.76596651  
1.918339334  
2.023091643  
2.063668674  
2.028082316  
1.910816223  
1.713977428  
1.447484999  
1.128249476  
0.778428526  
0.4229943532  
0.08693479321  
-0.2075300701  
-0.4433519403  
-0.6103649787  
-0.7061011356  
-0.7356362582  
-0.7105222794  
-0.6469903133  
-0.5636799303  
-0.4792259546  
-0.4100019712  
-0.3683093863  
-0.3612042359  
-0.3900711506  
-0.4509536901  
-0.5355322274  
-0.6325970325  
-0.7297751859  
-0.8152823853  
-0.8794635999  
-0.9159371077  
-0.9222205921  
-0.899792376  
-0.8536247454  
-0.7912796322  
-0.7217372031  
-0.6541237611  
-0.5965276597  
-0.555062483  
-0.5332790461  
-0.5319881863  
-0.5494740037  
-0.582037743  
-0.6247554896  
-0.672309997  
-0.7197655291  
-0.7631656979  
-0.7998675892  
-0.8285859057  
-0.8491627785  
-0.8621212739  
-0.8681114178  
-0.8673523729  
-0.8591915295  
-0.8418740975  
-0.8125789726  
-0.7677428941  
-0.7036224961  
-0.6170340804  
-0.5061308241  
-0.3711035125  
-0.2146534146  
-0.04213612683  
0.1386943259  
0.3183572702  
0.4866634419  
0.6339823392  
0.7525865525  
0.837880163  
0.8893289376  
0.9109230949  
0.9110675918  
0.9018584419  
0.8977837067  
0.9139713496  
0.9641905368  
1.05882729  
1.2031215  
1.395913049  
1.629105845  
1.887986095  
2.152422618  
2.398852058  
2.602844824  
2.741938161  
2.79837337  
2.761343948  
2.628417069  
2.405910095  
2.108112  
1.755451699  
1.371860852  
0.9817065987  
0.6067692326  
0.2637153464  
-0.03754745674  
-0.2943894268  
-0.5108086856  
-0.6957388983  
-0.8606549825  
-1.016891761  
-1.173170174  
-1.333759976  
-1.497597956  
-1.658510442  
-1.806475413  
-1.929685909  
-2.017027466  
-2.060504667  
-2.057162906  
-2.010139303  
-1.928624047  
-1.826714635  
-1.721316923  
-1.629454109  
-1.565414136  
-1.538223064  
-1.549899313  
-1.594775858  
-1.660056711  
-1.727521878  
-1.77613962  
-1.785167846  
-1.73726046  
-1.621088667  
-1.433077593  
-1.177989571  
-0.8683168169  
-0.5225926564  
-0.1629380816  
0.1877503049  
0.5085251594  
0.7826231451  
0.9989180084  
1.152445287  
1.24403013  
1.279174142  
1.266484871  
1.215957574  
1.137416874  
1.039349804  
0.9282770002  
0.8086759879  
0.6833791832  
0.5542994892  
0.4232784667  
0.2928719879  
0.1669049981  
0.05070230411  
-0.04905165159  
-0.1247842799  
-0.1687672855  
-0.1739808915  
-0.1349958515  
-0.04873114896  
0.08498380676  
0.2631451084  
0.4796070012  
0.7254299505  
0.9894896049  
1.259286297  
1.52188314  
1.764860183  
1.977206379  
2.150063343  
2.277233661  
2.355428482  
2.384210003  
2.365659207  
2.30380468  
2.203891273  
2.071593644  
1.91228138  
1.730449208  
1.529403216  
1.31124412  
1.077160426  
0.8279798624  
0.5648866431  
0.2901702069  
0.007872953417  
-0.2758096426  
-0.5524636045  
-0.8118055747  
-1.042426225  
-1.232876363  
-1.372980912  
-1.455205351  
-1.475904703  
-1.436257885  
-1.34272414  
-1.2069162  
-1.044836317  
-0.8755127414  
-0.7191565614  
-0.5950308202  
-0.5192769314  
-0.5029699636  
-0.5506713453  
-0.659683402  
-0.820158896  
-1.016080522  
-1.227037998  
-1.430594075  
-1.604967486  
-1.73167634  
-1.797807133  
-1.79759291  
-1.733098008  
-1.613895476  
-1.455793994  
-1.278781574  
-1.104468294  
-0.9533896295  
-0.8425122291  
-0.7832931773  
-0.7805070987  
-0.831955597  
-0.9290399481  
-1.05805043  
-1.201932731  
-1.342257548  
-1.461119798  
-1.542755324  
-1.574746252  
-1.548756753  
-1.460866824  
-1.311569136  
-1.105547404  
-0.8513282938  
-0.5608391502  
-0.248881856  
0.0675421074  
0.3701027761  
0.6402642236  
0.8606570856  
1.016626197  
1.097821845  
1.099616843  
1.02414544  
0.8807314255  
0.6855833572  
0.4606856072  
0.2319594029  
0.02687273609  
-0.1282476506  
-0.2108759112  
-0.2046134624  
-0.1008934787  
0.1001031837  
0.3894405159  
0.7502721081  
1.159441225  
1.58961805  
2.011727518  
2.397412011  
2.721277036  
2.962736319  
3.107317102  
3.147372751  
3.082218269  
2.91775582  
2.665705858  
2.34255302  
1.968340581  
1.565377068  
1.156930202  
0.7659175914  
0.4136081122  
0.1183483968  
-0.1056673805  
-0.249495573  
-0.3103223807  
-0.291981097  
-0.2049710516  
-0.06587474097  
0.1038789098  
0.2798691288  
0.437019343  
0.5521836177  
0.6066882422  
0.5884847984  
0.4936297181  
0.3268241458  
0.100915307  
-0.1646209812  
-0.4460494822  
-0.7182816302  
-0.9579282129  
-1.14608616  
-1.270461466  
-1.32656405  
-1.317809068  
-1.254560978  
-1.152295675  
-1.029185083  
-0.9034801181  
-0.791088771  
-0.703687547  
-0.6475975732  
-0.6235390051  
-0.6272072583  
-0.6505140654  
-0.6832262266  
-0.7147054318  
-0.7354625846  
-0.7383005306  
-0.7189125685  
-0.6759203763  
-0.6104340169  
-0.5252763242  
-0.4240943189  
-0.3105347842  
-0.1876637678  
-0.05771058961  
0.07782787534  
0.217789152  
0.3607587164  
0.5044445541  
0.6451681344  
0.7775955904  
0.8948057457  
0.9887164335  
1.050842601  
1.073296158  
1.049899198  
0.977248394  
0.8555606901  
0.689175149  
0.48657568  
0.2599000792  
0.02394956234  
-0.2052246717  
-0.4119887521  
-0.5828535855  
-0.7080297897  
-0.7825932391  
-0.8070811531  
-0.7874039935  
-0.7340717499  
-0.6608114926  
-0.5827658789  
-0.5145117485  
-0.4681934626  
-0.4520234519  
-0.4693840398  
-0.5186326217  
-0.5936421087  
-0.6849636451  
-0.7814296375  
-0.8719314359  
-0.9470940164  
-1.000599351  
-1.029966658  
-1.03668199  
-1.025700808  
-1.004411142  
-0.9812518596  
-0.964212512  
-0.959445334  
-0.9702093686  
-0.9962665139  
-1.033821158  
-1.075968444  
-1.113560505  
-1.13635488  
-1.134266828  
-1.098563839  
-1.022862613  
-0.9038317101  
-0.7415598441  
-0.5395848806  
-0.3046300589  
-0.04609989742  
0.2245974229  
0.4948394703  
0.7516484555  
0.982565528  
1.176520729  
1.324643495  
1.420973318  
1.463003487  
1.451992148  
1.392979593  
1.29446776  
1.167748846  
1.025925155  
0.8826985118  
0.7510545037  
0.6420127237  
0.5635739616  
0.5200367975  
0.5117608291  
0.5354072453  
0.5846323307  
0.651119011  
0.7257973983  
0.8000795197  
0.8669202228  
0.9215691711  
0.9619089113  
0.9883575658  
1.003358657  
1.010580965  
1.013951636  
1.016706152  
1.020607235  
1.025473034  
1.029099678  
1.027591018  
1.016050788  
0.989534666  
0.9440896886  
0.8777119166  
0.7910396287  
0.6876419728  
0.573809254  
0.4578373841  
0.3488847904  
0.2555538867  
0.1844101623  
0.1386954436  
0.1174601017  
0.1153309861  
0.1229902573  
0.1283844947  
0.1185133216  
0.0815728639  
0.009124887281  
-0.1020572609  
-0.2487903918  
-0.4211784719  
-0.6033213006  
-0.7750027965  
-0.9141629289  
-0.999842901  
-1.015187883  
-0.9500795211  
-0.8030144053  
-0.5819274742  
-0.3038353944  
0.006687175604  
0.3200103917  
0.6045994994  
0.8304259514  
0.9721945864  
1.012010933  
0.941174542  
0.7609242215  
0.4821021859  
0.1238205902  
-0.2886484509  
-0.7264793428  
-1.1600825  
-1.561760493  
-1.907959146  
-2.180925247  
-2.369644787  
-2.470048585  
-2.484530668  
-2.420912981  
-2.291025019  
-2.109097184  
-1.890160607  
-1.648640102  
-1.397247757  
-1.146293292  
-0.903395312  
-0.6735836881  
-0.4596937942  
-0.2629438109  
-0.08358213339  
0.07853183772  
0.2234777376  
0.3510187778  
0.4605398691  
0.5511554138  
0.6219276936  
0.6721239708  
0.701456974  
0.7102475348  
0.6994916936  
0.6708364208  
0.6264708516  
0.5689791512  
0.5011843305  
0.4260021387  
0.3463134113  
0.2648502875  
0.1840792444  
0.1060637038  
0.03230749135  
-0.03640281611  
-0.1001298808  
-0.1598279908  
-0.2172615112  
-0.2747633666  
-0.334838001  
-0.3996463592  
-0.4704691803  
-0.5472259023  
-0.6281811638  
-0.7099074058  
-0.7875366101  
-0.8552857373  
-0.907174789  
-0.937799681  
-0.9430307084  
-0.9204944898  
-0.8697548686  
-0.7921586473  
-0.690388288  
-0.5678110924  
-0.4277747478  
-0.2729875362  
-0.1051074001  
0.07535607772  
0.2688257542  
0.476136789  
0.6978226327  
0.9333246953  
1.180268128  
1.433946505  
1.687108057  
1.930114961  
2.15146682  
2.338645804  
2.479190551  
2.561860746  
2.577758184  
2.521275132  
2.390743592  
2.188739288  
1.922000923  
1.600997363  
1.239220094  
0.8522761589  
0.4569057663  
0.07001384732  
-0.2922101811  
-0.6150355472  
-0.8857981601  
-1.094373732  
-1.233553586  
-1.299343718  
-1.291204538  
-1.212200906  
-1.069035396  
-0.8719006851  
-0.6340895264  
-0.3713302315  
-0.1008237762  
0.159950073  
0.394581033  
0.5890805124  
0.7330637863  
0.8206029754  
0.850608593  
0.8266668131  
0.7563305587  
0.6499616762  
0.5192752151  
0.3758084189  
0.2295283424  
0.08778713915  
-0.04523829494  
-0.1685545959  
-0.2838520827  
-0.3945780949  
-0.5047908828  
-0.6179596113  
-0.7359304314  
-0.858205221  
-0.9816438155  
-1.100626069  
-1.207631124  
-1.294149697  
-1.351792306  
-1.373445862  
-1.354324887  
-1.292781187  
-1.190782708  
-1.053985675  
-0.8913850876  
-0.7145608934  
-0.5365774938  
-0.3706429834  
-0.2286521821  
-0.1197726238  
-0.04923880001  
-0.01751949275  
-0.01998434225  
-0.04716662933  
-0.08563659403  
-0.1194310965  
-0.1319136679  
-0.1078598161  
-0.03552431088  
0.09156367792  
0.273324011  
0.5025558573  
0.7651877661  
1.041369592  
1.307315982  
1.537720977  
1.70849121  
1.799474902  
1.796866406  
1.694975132  
1.497117265  
1.215478047  
0.8699367967  
0.4859460487  
0.09173294044  
-0.2848452265  
-0.6193690294  
-0.8934466116  
-1.096458382  
-1.226225315  
-1.288515741  
-1.295466852  
-1.263200613  
-1.208971108  
-1.148322349  
-1.092673186  
-1.047713057  
-1.012833948  
-0.9816785954  
-0.9436884119  
-0.8863988369  
-0.7980859178  
-0.6703409897  
-0.5001470995  
-0.2911093297  
-0.05363410434  
0.1960015343  
0.4375600388  
0.6494721872  
0.8117930943  
0.9090440684  
0.9325174117  
0.8816926965  
0.7645440242  
0.5966721595  
0.3994001848  
0.1970880455  
0.01406299584  
-0.1284052351  
-0.2146621067  
-0.2364190945  
-0.1934942249  
-0.09348169463  
0.04954795952  
0.2170959117  
0.3887093894  
0.5445345314  
0.6676245444  
0.7457139271  
0.7722887593  
0.7468819207  
0.6746120721  
0.5651056839  
0.430976745  
0.2860939403  
0.1438583789  
0.01571440034  
-0.08997251579  
-0.1685458735  
-0.2191646672  
-0.2444254648  
-0.2495767764  
-0.2414511957  
-0.2272941354  
-0.2136293596  
-0.2053281753  
-0.2049956853  
-0.2127384072  
-0.2263410174  
-0.2418013563  
-0.2541388698  
-0.2583499854  
-0.2503656887  
-0.2278685334  
-0.1908480325  
-0.1418047365  
-0.08558017852  
-0.02881395759  
0.02089717909  
0.0560166774  
0.07013471635  
0.05891217728  
0.0207864482  
-0.04270096484  
-0.1269943442  
-0.2250456624  
-0.3281945053  
-0.4272943995  
-0.5139011339  
-0.5813533466  
-0.6255526291  
-0.6453171697  
-0.6422390255  
-0.6200586459  
-0.5836702419  
-0.5379280276  
-0.4864809899  
-0.430864958  
-0.3700273757  
-0.3004231439  
-0.2166682075  
-0.1126755937  
0.01691784899  
0.1752792681  
0.3621299033  
0.5729436532  
0.7987766679  
1.026776635  
1.241341847  
1.425767276  
1.564173613  
1.643413522  
1.654723995  
1.594862881  
1.466592795  
1.278443998  
1.043796287  
0.7794103578  
0.5036128718  
0.2343739853  
-0.01247047635  
-0.224641357  
-0.394321924  
-0.5184674148  
-0.598529916  
-0.6396798841  
-0.6496950544  
-0.6376825217  
-0.6128424106  
-0.5834256806  
-0.5560121823  
-0.5351385148  
-0.5232740238  
-0.5210780012  
-0.5278229267  
-0.5419008616  
