-0.1258216145  
-0.2383349506  
-0.3391608174  
-0.4190714959  
-0.4722012571  
-0.4970061889  
-0.4965347815  
-0.4779664409  
-0.4514802083  
-0.4286377567  
-0.4205210691  
-0.4359282962  
-0.4799068396  
-0.5528554175  
-0.6503361508  
-0.7636249784  
-0.8809036896  
-0.9889101888  
-1.074780213  
-1.127791822  
-1.140755415  
-1.110837907  
-1.039726893  
-0.9331307459  
-0.7997323529  
-0.649784018  
-0.4935859977  
-0.3400976617  
-0.1958874852  
-0.06457176585  
0.05320977431  
0.1593140152  
0.257230446  
0.3510074493  
0.4441636388  
0.5387774516  
0.6348897  
0.7303102293  
0.8208359074  
0.9008158014  
0.9639635675  
1.004266099  
1.016850266  
0.9986783609  
0.9489878946  
0.8694251522  
0.7638880916  
0.6381094372  
0.499061294  
0.3542626338  
0.2110773475  
0.07608238162  
-0.04543481901  
-0.1498092339  
-0.2351440024  
-0.3012690848  
-0.3495396729  
-0.3825077441  
-0.4035149382  
-0.4162637447  
-0.4244164347  
-0.4312642271  
-0.4394980912  
-0.4510880209  
-0.4672532559  
-0.4885015021  
-0.5146863478  
-0.545051225  
-0.5782220747  
-0.612153631  
-0.6440395488  
-0.6702349855  
-0.6862524897  
-0.6868889385  
-0.666531451  
-0.6196615818  
-0.5415211643  
-0.4288804191  
-0.2807939285  
-0.09922891579  
0.1105697724  
0.3400602326  
0.5777941093  
0.8102036863  
1.022715415  
1.201074037  
1.332718762  
1.408045485  
1.42140256  
1.371694724  
1.262535038  
1.101923392  
0.9014991631  
0.6754539799  
0.4392284922  
0.2081328922  
-0.003968014767  
-0.1857792436  
-0.3293996856  
-0.4307829911  
-0.489799813  
-0.5099146976  
-0.4975273176  
-0.4610726253  
-0.4099819165  
-0.3536389678  
-0.3004462016  
-0.2571057222  
-0.2281758135  
-0.2159346844  
-0.2205232196  
-0.2403123968  
-0.272407774  
-0.3131962315  
-0.358844505  
-0.4056869895  
-0.4504669018  
-0.4904318305  
-0.5233156742  
-0.5472584271  
-0.560714982  
-0.5624070584  
-0.5513443324  
-0.5269180604  
-0.489050959  
-0.4383534917  
-0.3762475525  
-0.3049963471  
-0.2276156708  
-0.147643025  
-0.06878414763  
0.005523834771  
0.07257408682  
0.1307951358  
0.1800406977  
0.2216825117  
0.2584928371  
0.2942915138  
0.3334030729  
0.3799762095  
0.4372587416  
0.5069276763  
0.5885769105  
0.6794479638  
0.7744643532  
0.8665884734  
0.9474864655  
1.008423503  
1.04130182  
1.03970398  
0.9998093212  
0.9210497012  
0.8064133263  
0.6623229317  
0.4980965379  
0.3250353134  
0.1552419376  
0.000314933563  
-0.129919358  
-0.2284771381  
-0.2919516306  
-0.3208200434  
-0.3192809146  
-0.2946466379  
-0.2563657363  
-0.2147934441  
-0.1798587459  
-0.1597858052  
-0.16001228  
-0.1824282835  
-0.2250287511  
-0.2820107829  
-0.3443304974  
-0.4006639015  
-0.4386925728  
-0.446586908  
-0.4145511067  
-0.3362526133  
-0.2099783615  
-0.03936546382  
0.1664160739  
0.393094813  
0.6223461427  
0.833389856  
1.004988192  
1.11764114  
1.15573153  
1.109361974  
0.975649612  
0.7593025512  
0.4723842363  
0.1332701109  
-0.2350896017  
-0.6074062016  
-0.9585204484  
-1.265809859  
-1.511250474  
-1.682897974  
-1.775636801  
-1.791134704  
-1.73706176  
-1.625706874  
-1.472216181  
-1.292695631  
-1.102434977  
-0.9144694716  
-0.7386284833  
-0.5811414537  
-0.4447919986  
-0.3295161879  
-0.2333058651  
-0.1532338001  
-0.08642116054  
-0.03079582945  
0.01445882654  
0.04881668318  
0.07066023101  
0.07780306826  
0.06817753486  
0.04055504696  
-0.004829280413  
-0.06585388991  
-0.1383703467  
-0.2163724869  
-0.2924625548  
-0.3585454463  
-0.4066661909  
-0.4298616511  
-0.4229209342  
-0.3829420567  
-0.3096226603  
-0.2052502865  
-0.07441337241  
0.07651604326  
0.2400335169  
0.4082006771  
0.5732896051  
0.7283078322  
0.8673627479  
0.9858602703  
1.080574535  
1.14962315  
1.192413041  
1.209592111  
1.203029405  
1.175807136  
1.132200029  
1.077585261  
1.018228905  
0.9609236479  
0.9124655026  
0.8790067512  
0.8653436262  
0.8742414478  
0.9058912845  
0.9575988765  
1.023774422  
1.096255068  
1.164941238  
1.218693093  
1.246379898  
1.237969383  
1.185529661  
1.084026447  
0.9318391084  
0.7309526885  
0.4868191776  
0.2079329487  
-0.09481756845  
-0.4089401455  
-0.7211885361  
-1.018398698  
-1.288260045  
-1.519982784  
-1.704842662  
-1.836595604  
-1.911750989  
-1.92969817  
-1.892672369  
-1.805546255  
-1.675438698  
-1.51114711  
-1.322427446  
-1.119172173  
-0.9105718252  
-0.7043489601  
-0.5061764323  
-0.3193734548  
-0.1449428064  
0.01802845298  
0.1716436922  
0.3182422617  
0.4593627711  
0.5947936917  
0.7218951512  
0.8353330087  
0.9273238706  
0.9884112439  
1.008690821  
0.9793520768  
0.8943038988  
0.7516465015  
0.5547300893  
0.3126040415  
0.03971951118  
-0.2451376176  
-0.5205964004  
-0.7649465169  
-0.9585982931  
-1.086442597  
-1.1397885  
-1.117605969  
-1.02687859  
-0.8819919269  
-0.7032022201  
-0.5143470251  
-0.340070215  
-0.2028799651  
-0.1204001428  
-0.1031439  
-0.1530859932  
-0.2632107306  
-0.4181016975  
-0.5955329925  
-0.768886483  
-0.9101468733  
-0.9931561401  
-0.9967637342  
-0.9075370416  
-0.7217076288  
-0.446128095  
-0.09808768433  
0.2960269037  
0.7031298299  
1.086663852  
1.410333769  
1.641947896  
1.756936016  
1.741139184  
1.592537125  
1.321687432  
0.9508079264  
0.5115835311  
0.04194660726  
-0.4178090265  
-0.8291186762  
-1.158969295  
-1.383006617  
-1.487570207  
-1.470451288  
-1.340319716  
-1.11495251  
-0.8185495877  
-0.4785336548  
-0.1222882798  
0.2257207418  
0.546080718  
0.8255931869  
1.057397982  
1.240166873  
1.376621858  
1.471717937  
1.530874999  
1.558589425  
1.557657611  
1.529118869  
1.472857891  
1.388681781  
1.27759724  
1.142967777  
0.9912571342  
0.8321453886  
0.6779198299  
0.5421795329  
0.4380226295  
0.3759972846  
0.3621488943  
0.3965080541  
0.4723089522  
0.576131958  
0.6890207573  
0.7884866188  
0.851160323  
0.855755103  
0.785930161  
0.6326643089  
0.3957862534  
0.08443913943  
-0.2836025358  
-0.6836918455  
-1.086910165  
-1.463183637  
-1.784507494  
-2.027879297  
-2.177591652  
-2.226627915  
-2.177039167  
-2.039309032  
-1.83084472  
-1.573820138  
-1.29267133  
-1.01154681  
-0.7520041096  
-0.5311793857  
-0.3605871587  
-0.2456103093  
-0.1856678351  
-0.1749583186  
-0.2036473302  
-0.2593067446  
-0.3284396469  
-0.3979106387  
-0.4561578433  
-0.4940841965  
-0.5055917985  
-0.4877529664  
-0.4406691661  
-0.3670762309  
-0.2717852216  
-0.1610486383  
-0.04191807945  
0.07832939117  
0.1926767508  
0.2947301538  
0.3789754263  
0.4409397035  
0.4772830749  
0.4858597523  
0.4657614834  
0.4173683133  
0.3424060534  
0.2440011843  
0.1266976168  
-0.003592766659  
-0.1397452088  
-0.2737234245  
-0.3970278433  
-0.5012890735  
-0.578953584  
-0.6239943194  
-0.6325451853  
-0.6033659315  
-0.5380379038  
-0.4408397358  
-0.3182837057  
-0.1783583778  
-0.02956777584  
0.1200967921  
0.2640938281  
0.3980314115  
0.5200050558  
0.6305172697  
0.7319772703  
0.8278696317  
0.9217177583  
1.016030603  
1.111408462  
1.205973371  
1.295229046  
1.37238908  
1.429138215  
1.456711491  
1.447139749  
1.394480848  
1.295851803  
1.15212417  
0.9681831291  
0.7527186264  
0.5175787178  
0.276769506  
0.04522272538  
-0.1625209075  
-0.3335731206  
-0.4577814692  
-0.5285355979  
-0.543249717  
-0.5034952751  
-0.4148053967  
-0.2861902225  
-0.1294188561  
0.04187022739  
0.2131634159  
0.3701115129  
0.4995488304  
0.5904330511  
0.634642375  
0.6275653066  
0.5684317848  
0.4603422962  
0.3099692349  
0.1269509301  
-0.07697735323  
-0.2890331433  
-0.4964970803  
-0.6877591833  
-0.853178996  
-0.9856574086  
-1.080871865  
-1.137171217  
-1.155200556  
-1.137349627  
-1.087165713  
-1.008856479  
-0.9069810729  
-0.7863708481  
-0.6522555279  
-0.5105135973  
-0.3679035326  
-0.2321471734  
-0.1117350742  
-0.01539728141  
0.04874055618  
0.07420953412  
0.05728647192  
-0.002101256428  
-0.099861695  
-0.2277697926  
-0.3741151262  
-0.5249215224  
-0.6655844862  
-0.7826891956  
-0.8657222574  
-0.9083979998  
-0.9093798724  
-0.8722728978  
-0.8048754873  
-0.717814246  
-0.6227721682  
-0.5305913881  
-0.4495433339  
-0.384037088  
-0.3339568938  
-0.2947276118  
-0.2580949307  
-0.2135027523  
-0.1498612098  
-0.05745551743  
0.07028416728  
0.2353997872  
0.4346045113  
0.6591829582  
0.8956130887  
1.126840438  
1.334038875  
1.498657922  
1.604490654  
1.639526782  
1.597363966  
1.478026178  
1.288097267  
1.040167309  
0.7516683991  
0.4432278475  
0.1367290334  
-0.1467170333  
-0.3886820784  
-0.5750255378  
-0.6970400839  
-0.7520304143  
-0.7432780826  
-0.6793943038  
-0.5731339981  
-0.4397885936  
-0.2953312838  
-0.1545144498  
-0.02914207602  
0.07327748675  
0.1503203493  
0.2047642046  
0.2439963921  
0.2787731086  
0.3214740279  
0.3840746816  
0.4761078485  
0.6028987643  
0.7643184329  
0.9542471665  
1.160835419  
1.367537745  
1.554798996  
1.702169451  
1.790588815  
1.804546875  
1.733866945  
1.574909903  
1.331084508  
1.012632546  
0.6357547804  
0.2211981125  
-0.2075224449  
-0.626075829  
-1.011256888  
-1.342754595  
-1.604609894  
-1.786270147  
-1.883179302  
-1.896874647  
-1.834600443  
-1.708475284  
-1.534287184  
-1.33001118  
-1.114183427  
-0.9042733568  
-0.7152057122  
-0.5581825311  
-0.4399117892  
-0.3623301753  
-0.3228307642  
-0.3149667174  
-0.3295266022  
-0.355856368  
-0.3832484262  
-0.4022408564  
-0.405671103  
-0.3893744547  
-0.3524637161  
-0.2971850227  
-0.2284031662  
-0.1528047537  
-0.07794367253  
-0.0112611333  
0.04079072328  
0.07343166079  
0.08396952048  
0.07193433315  
0.03896137025  
-0.01153665552  
-0.07480724797  
-0.1452459837  
-0.2168445631  
-0.283569797  
-0.3396512014  
-0.3797958922  
-0.3993755553  
-0.3946213728  
-0.3628680419  
-0.3028508879  
-0.2150323842  
-0.1018893278  
0.03191502408  
0.1795689646  
0.3324329994  
0.4806656282  
0.6141308608  
0.7234928221  
0.8013564088  
0.8432712831  
0.8484333722  
0.8199329366  
0.7644787142  
0.6915990202  
0.6124188813  
0.5381742832  
0.4786895676  
0.4410370902  
0.4285875204  
0.4405881056  
0.4723212049  
0.5158131045  
0.5609627565  
0.596916394  
0.6134732352  
0.6023204268  
0.5579385779  
0.4780789592  
0.3637985066  
0.2190990373  
0.05029391168  
-0.1347620083  
-0.3274250082  
-0.5188759697  
-0.7005183196  
-0.8641427034  
-1.001896981  
-1.106157813  
-1.16941574  
-1.184291345  
-1.143784183  
-1.041792453  
-0.8738926096  
-0.6383002056  
-0.3368744332  
0.02400032142  
0.4328371686  
0.8729284766  
1.322799739  
1.757269023  
2.149075623  
2.470950216  
2.697933081  
2.809697152  
2.792609162  
2.641281303  
2.359405134  
1.959740881  
1.463232622  
0.8973222424  
0.2936400262  
-0.3146758584  
-0.895725395  
-1.421352661  
-1.869139505  
-2.223689893  
-2.477100909  
-2.628642972  
-2.683750364  
-2.652523624  
-2.547987003  
-2.384350689  
-2.175507431  
-1.933931109  
-1.670073631  
-1.392264981  
-1.107055402  
-0.8198621021  
-0.5357539268  
-0.2601933976  
0.0004280572635  
0.2385760781  
0.445743281  
0.6129946691  
0.7318100581  
0.7951042756  
0.7982698607  
0.7400760098  
0.6232917432  
0.4549168349  
0.2459846695  
0.01092626439  
-0.2334281996  
-0.4691190672  
-0.6784583548  
-0.8454266231  
-0.9569256557  
-1.003771879  
-0.9813574252  
-0.8899179358  
-0.7344132138  
-0.524040687  
-0.2714377749  
0.008341824868  
0.2989920273  
0.5841484953  
0.8485223745  
1.07887942  
1.264789964  
1.399115843  
1.478204055  
1.501814177  
1.472816014  
1.396717645  
1.281096796  
1.13499199  
0.9683029122  
0.7912243919  
0.613716098  
0.4450005504  
0.2930803055  
0.1642711641  
0.06277467757  
-0.009662697291  
-0.05394565952  
-0.07360613254  
-0.07450868618  
-0.06425795246  
-0.05133245774  
-0.04402846354  
-0.04933285332  
-0.07189498498  
-0.1132648871  
-0.1715374716  
-0.2415102308  
-0.3153536304  
-0.3837415446  
-0.4372896057  
-0.4680851638  
-0.4710717962  
-0.4450591395  
-0.3931687174  
-0.322609055  
-0.2437877485  
-0.1688617463  
-0.1099321117  
-0.07715592661  
-0.07707238587  
-0.1114226399  
-0.1766730025  
-0.2643465679  
-0.3621436645  
-0.4556972832  
-0.530706943  
-0.5751200699  
-0.5810077049  
-0.5458273372  
-0.4728481089  
-0.3706554888  
-0.2517932367  
-0.1307448888  
-0.02158753299  
0.06431469025  
0.1201881402  
0.1449799697  
0.1435510482  
0.1258786188  
0.1053982782  
0.09674218299  
0.1132425627  
0.1646020311  
0.2551083814  
0.3826846134  
0.5389214291  
0.7100959957  
0.8790100502  
1.027372208  
1.138360744  
1.198990185  
1.201938778  
1.146588077  
1.039139464  
0.8918107401  
0.7212417927  
0.5463395574  
0.3858602179  
0.2560499564  
0.1686447344  
0.1294721226  
0.1378144189  
0.1865869772  
0.2632879963  
0.3515733342  
0.4332564157  
0.4904725494  
0.5077539772  
0.473787801  
0.3826613825  
0.2344952548  
0.03541723494  
-0.2030789802  
-0.4652851817  
-0.7328018048  
-0.9862406565  
-1.20694734  
-1.378575121  
-1.488384059  
-1.528177585  
-1.494835732  
-1.390437461  
-1.221998656  
-1.000879366  
-0.7419238431  
-0.4624052481  
-0.1808541967  
0.0841669866  
0.3152630366  
0.4973269742  
0.6185150882  
0.6710299942  
0.6516591529  
0.5620321763  
0.4085619708  
0.2020554776  
-0.04300318604  
-0.3094743211  
-0.5788290548  
-0.8325770298  
-1.05374625  
-1.22827932  
-1.346215894  
-1.402523424  
-1.397487754  
-1.336591398  
-1.229890213  
-1.090931321  
-0.9353279263  
-0.7791401017  
-0.6372382312  
-0.5218249473  
-0.4412722405  
-0.3993879841  
-0.3951825326  
-0.4231333053  
-0.4739117058  
-0.5354693418  
-0.5943662268  
-0.6371935427  
-0.6519420921  
-0.6291872142  
-0.5629768731  
-0.4513479286  
-0.2964343796  
-0.1041785513  
0.116313269  
0.3536723967  
0.5953283374  
0.8285992844  
1.041695794  
1.224545854  
1.369363842  
1.470948471  
1.526713632  
1.536505979  
1.502269682  
1.427652101  
1.3176134  
1.178106994  
1.015872741  
0.8383397854  
0.6536326798  
0.4706338056  
0.2990432759  
0.1493620514  
0.03273724726  
-0.03940507629  
-0.05596866798  
-0.007048051406  
0.1149882063  
0.3142909027  
0.5903153425  
0.9367833359  
1.341001721  
1.783727357  
2.239712132  
2.67899923  
3.068941874  
3.376804655  
3.572696174  
3.632521561  
3.54058341  
3.291493735  
2.891124221  
2.356428382  
1.714132009  
0.9984238973  
0.2479102031  
-0.4978018555  
-1.201503564  
-1.831382234  
-2.363311883  
-2.782228009  
-3.082510042  
-3.267407401  
-3.347660464  
-3.33953852  
-3.262558335  
-3.1371638  
-2.98260974  
-2.815258031  
-2.647422212  
-2.486831604  
-2.336708455  
-2.196388904  
-2.062357854  
-1.929536072  
-1.79262957  
-1.647357281  
-1.491394324  
-1.324906921  
-1.150622355  
-0.9734298001  
-0.7995876189  
-0.6356542573  
-0.4873153483  
-0.35828397  
-0.2494461806  
-0.1583971188  
-0.07944733266  
-0.004126917536  
0.07785522108  
0.1773177751  
0.304110557  
0.4656239863  
0.6654710834  
0.902527049  
1.17045881  
1.457831763  
1.748809521  
2.024412315  
2.264216429  
2.44833663  
2.559480049  
2.584846635  
2.517651045  
2.358071207  
2.113489262  
1.79796169  
1.430960729  
1.035506129  
0.6359072318  
