0.01662033339  
0.6049768945  
1.151036638  
1.615676832  
1.967830768  
2.187627762  
2.268260201  
2.216377773  
2.050962854  
1.800868133  
1.501310147  
1.189774508  
0.9018032555  
0.667182015  
0.5069353373  
0.4314626532  
0.4399910012  
0.5213559915  
0.6559738045  
0.8187279025  
0.9823868385  
1.121131551  
1.213743799  
1.246087754  
1.212577666  
1.116485061  
0.969059789  
0.7876149274  
0.5928507855  
0.4057895092  
0.2447603519  
0.122859216  
0.04625261932  
0.01357042208  
0.01649320515  
0.04145011342  
0.07218301225  
0.09279944124  
0.09084344437  
0.05990103998  
0.00130710714  
-0.07534962631  
-0.1530775657  
-0.2096040914  
-0.2205301837  
-0.1630793477  
-0.01991258038  
0.2175548345  
0.5468469569  
0.9535161275  
1.411812297  
1.886917878  
2.338487119  
2.725060033  
3.008788294  
3.159854258  
3.160017945  
3.004835048  
2.704274669  
2.281664802  
1.771132329  
1.213869781  
0.6537056347  
0.1325252775  
-0.3139367182  
-0.6594503179  
-0.8894780358  
-1.002001075  
-1.006980527  
-0.924595269  
-0.7825183318  
-0.6125844434  
-0.4472402882  
-0.3161504795  
-0.2433059865  
-0.2448882865  
-0.3280657206  
-0.4907692359  
-0.7224274613  
-1.005512298  
-1.317700893  
-1.634391396  
-1.931302394  
-2.186877626  
-2.384259693  
-2.512651204  
-2.567950791  
-2.552642934  
-2.474987565  
-2.34765421  
-2.185980884  
-2.006081695  
-1.823043562  
-1.649404879  
-1.49410326  
-1.361967485  
-1.253793199  
-1.16693813  
-1.096317065  
-1.035634703  
-0.9786560756  
-0.9203320978  
-0.8576238427  
-0.7899207185  
-0.7190110549  
-0.6486304355  
-0.5836830338  
-0.5292569158  
-0.4896034779  
-0.4672406777  
-0.4623145923  
-0.4723269356  
-0.4922764973  
-0.5151943768  
-0.5330207009  
-0.537692826  
-0.5223143433  
-0.4822355437  
-0.4158949591  
-0.3252960913  
-0.2160405238  
-0.09687571784  
0.02120668843  
0.1262391234  
0.2067773487  
0.2534619882  
0.2604390883  
0.2264694745  
0.1555432036  
0.0569069681  
-0.05556765722  
-0.1646305119  
-0.2514234775  
-0.2975861216  
-0.2874730716  
-0.2102131433  
-0.06134932843  
0.1561700312  
0.4318123695  
0.7481717375  
1.082522871  
1.409091548  
1.701780365  
1.937050926  
2.096601156  
2.169511518  
2.153568154  
2.055582718  
1.890641153  
1.680357244  
1.450330876  
1.227113707  
1.03505962  
0.8934303022  
0.8141463673  
0.8004158913  
0.8464444745  
0.9382296104  
1.055348877  
1.173510464  
1.267541474  
1.314468948  
1.296309418  
1.20225348  
1.029994979  
0.7860772156  
0.4852389428  
0.1488562399  
-0.1973113038  
-0.5258049794  
-0.8102705402  
-1.028075701  
-1.162473552  
-1.204108214  
-1.151739943  
-1.012161465  
-0.7993642426  
-0.5330786775  
-0.2368715971  
0.06399441493  
0.3447246947  
0.5829956927  
0.7606411268  
0.8649023802  
0.889182488  
0.8332921826  
0.7031945564  
0.5103188548  
0.2705020018  
0.002670247284  
-0.272653575  
-0.5349098374  
-0.7650231617  
-0.9467939292  
-1.068068117  
-1.121607936  
-1.10559366  
-1.02371231  
-0.8848080213  
-0.702089786  
-0.4919429368  
-0.2724154772  
-0.06150613212  
0.1246100455  
0.273214794  
0.3763796332  
0.4317998403  
0.4430038725  
0.4188656207  
0.3724287463  
0.3191339191  
0.2746564052  
0.2525945466  
0.2623276979  
0.3073504955  
0.3843193798  
0.4830121055  
0.5872519831  
0.6767145312  
0.7294438933  
0.7247485376  
0.6461274094  
0.4838236421  
0.2366699958  
-0.08706226809  
-0.4699397038  
-0.8867808069  
-1.307062464  
-1.698043118  
-2.028239516  
-2.270845285  
-2.406673614  
-2.426279656  
-2.33100485  
-2.132817983  
-1.852981755  
-1.519710157  
-1.165098883  
-0.8217018535  
-0.519158384  
-0.2812608869  
-0.1237839868  
-0.05330449639  
-0.06709430366  
-0.1540465818  
-0.2964712844  
-0.472479724  
-0.6586525516  
-0.8326342347  
-0.9753656525  
-1.072707006  
-1.116316797  
-1.103764245  
-1.037939206  
-0.9259437297  
-0.7776565914  
-0.6042336203  
-0.4167345174  
-0.2250602585  
-0.03727282121  
0.1406764543  
0.3048759737  
0.4531434517  
0.5845886884  
0.6991818874  
0.7973930202  
0.8799383415  
0.9476442907  
1.001364317  
1.041911987  
1.069963074  
1.085907914  
1.089662893  
1.080499135  
1.056946225  
1.016836908  
0.9575532401  
0.8764727168  
0.771595456  
0.6422685677  
0.4898991689  
0.3185201152  
0.1350800206  
-0.05064170645  
-0.2265550823  
-0.3792150744  
-0.4951291996  
-0.5622903351  
-0.5717567587  
-0.5190449105  
-0.4051472784  
-0.2369877304  
-0.02719152692  
0.2068542853  
0.4445845203  
0.6643306977  
0.8456477355  
0.9716029397  
1.030747771  
1.018500806  
0.9377681433  
0.7987038452  
0.6176413495  
0.4153244519  
0.2146430305  
0.03815909881  
-0.09429741484  
-0.1676877867  
-0.1732602858  
-0.1093416072  
0.01864801056  
0.1989086075  
0.4146059609  
0.6456787309  
0.8708802485  
1.069848986  
1.224972165  
1.322873852  
1.355383129  
1.319928155  
1.219348465  
1.061199401  
0.8566700628  
0.6192733243  
0.3634821134  
0.1034725542  
-0.1479041163  
-0.3798298285  
-0.5839016221  
-0.754206789  
-0.8871768583  
-0.9813124977  
-1.036891668  
-1.055723018  
-1.041008069  
-0.9972890548  
-0.9304541929  
-0.8477051385  
-0.7574001744  
-0.6687045445  
-0.5909837915  
-0.5329656999  
-0.5017291531  
-0.501654925  
-0.533501496  
-0.5937865769  
-0.6746410932  
-0.7642381734  
-0.8478410242  
-0.9093833139  
-0.9334343488  
-0.9072923681  
-0.8229231103  
-0.6784429065  
-0.4789028385  
-0.2362148263  
0.03181527527  
0.3032551647  
0.5543942113  
0.7623702527  
0.9077238552  
0.9765522174  
0.9619827892  
0.8648110369  
0.6932452936  
0.461851392  
0.1898734664  
-0.1008190264  
-0.3878831476  
-0.6505039127  
-0.8710510396  
-1.036267003  
-1.137949065  
-1.173155537  
-1.144014171  
-1.057215961  
-0.9233033803  
-0.7558009144  
-0.5702380427  
-0.3830752854  
-0.2105404594  
-0.06740738585  
0.03426028021  
0.08627582823  
0.08532143699  
0.03359353396  
-0.06102621822  
-0.1853838396  
-0.3221006876  
-0.4512021059  
-0.552221346  
-0.6065297449  
-0.5996405839  
-0.5231732932  
-0.376190486  
-0.1656966897  
0.09382983088  
0.3818411314  
0.6739350715  
0.9445891702  
1.170085805  
1.331209963  
1.415369746  
1.417845115  
1.341991057  
1.198400914  
1.003163369  
0.7755021517  
0.5351670944  
0.2999853176  
0.08393083693  
-0.1040030376  
-0.2600170856  
-0.3848033465  
-0.4821450231  
-0.5570963524  
-0.614119805  
-0.6555576225  
-0.6807344257  
-0.6858779725  
-0.6648877847  
-0.6108145107  
-0.5177873073  
-0.3830065163  
-0.208428694  
-0.001770590965  
0.2233897448  
0.4485343126  
0.6520518232  
0.8117809904  
0.9078884169  
0.9256518083  
0.8577224611  
0.7055239867  
0.4795526712  
0.1985185044  
-0.1125622107  
-0.4250790629  
-0.7099769683  
-0.9409328265  
-1.097151224  
-1.165456092  
-1.141435368  
-1.029562132  
-0.8423293084  
-0.5985636215  
-0.3211720244  
-0.03461341662  
0.2376022368  
0.475117192  
0.6624368143  
0.7899973691  
0.8545656707  
0.8589675115  
0.8112431345  
0.72335196  
0.6095748545  
0.4847913984  
0.3628003063  
0.2548292348  
0.1683891756  
0.1065684278  
0.06786294628  
0.04654109551  
0.03354722098  
0.01784060396  
-0.01195400111  
-0.0657829778  
-0.1504929436  
-0.2684936559  
-0.4169351151  
-0.5875663359  
-0.7673304419  
-0.9396680233  
-1.086394071  
-1.189920016  
-1.235531069  
-1.213413501  
-1.120121959  
-0.9592856718  
-0.7414091254  
-0.4827929922  
-0.2036898422  
0.07404145001  
0.3294710539  
0.5449835899  
0.7081698855  
0.8130099853  
0.8601849776  
0.8565292734  
0.813736833  
0.7465330085  
0.6706040466  
0.6005668152  
0.5482463335  
0.5214662957  
0.5234516988  
0.552868405  
0.6044178749  
0.6698524621  
0.7392348229  
0.8022463788  
0.8493785967  
0.8728847469  
0.8673870562  
0.830156084  
0.7610542547  
0.6622325187  
0.5376658766  
0.3926185807  
0.2331298976  
0.06557466654  
-0.1036748999  
-0.2684886246  
-0.4231459643  
-0.5624813901  
-0.6820433295  
-0.7783025418  
-0.8489103692  
-0.8929849517  
-0.9113744407  
-0.9068201467  
-0.8839473404  
-0.8490161695  
-0.8094012219  
-0.7728110927  
-0.7463133038  
-0.735278958  
-0.7424026491  
-0.7669710562  
-0.8045270253  
-0.8470608129  
-0.883752783  
-0.902249772  
-0.8903180874  
-0.837687369  
-0.7378020276  
-0.5892273589  
-0.3964636166  
-0.1699953694  
0.07446988519  
0.3175249495  
0.5381697629  
0.7162292491  
0.8347681186  
0.8821679817  
0.8535862348  
0.7516018596  
0.5859564096  
0.3724359683  
0.1310633072  
-0.1161679015  
-0.3476903207  
-0.5445986852  
-0.6924407933  
-0.7823765084  
-0.8116094961  
-0.7830996607  
-0.7046728275  
-0.5877079568  
-0.4456120033  
-0.292300251  
-0.1408527089  
-0.002470667014  
0.1142175538  
0.2035179025  
0.2627467169  
0.2920901724  
0.2943315269  
0.2744784779  
0.2393166151  
0.196885669  
0.155850787  
0.1247696286  
0.1112555661  
0.1211008378  
0.1574356758  
0.2200603254  
0.3050606487  
0.4048465004  
0.5086734869  
0.6036540916  
0.6761988784  
0.7137193387  
0.7063910593  
0.6487213488  
0.5406738232  
0.3881463381  
0.202677467  
0.0003638651403  
-0.199908667  
-0.3787253646  
-0.518583813  
-0.6061951782  
-0.6342969422  
-0.6027101577  
-0.5184481563  
-0.3948307621  
-0.2496899926  
-0.1029005913  
0.02644523897  
0.1228114936  
0.1765484866  
0.1854155059  
0.155061947  
0.09835414027  
0.03360130136  
-0.0180843206  
-0.0359675468  
-0.002956421531  
0.09151226702  
0.249371702  
0.4629520863  
0.7153008156  
0.9817904859  
1.232837228  
1.4373932  
1.566757783  
1.598217998  
1.518038608  
1.323412988  
1.023117672  
0.6367961657  
0.1929617346  
-0.2740229736  
-0.7275930046  
-1.132826705  
-1.460006993  
-1.687508607  
-1.803698612  
-1.807684411  
-1.708882701  
-1.525531981  
-1.282378537  
-1.007849747  
-0.7310474725  
-0.4789127099  
-0.2738250924  
-0.1318496966  
-0.06175184874  
-0.06479408206  
-0.1352539577  
-0.2615307206  
-0.427672025  
-0.6151349762  
-0.8045814241  
-0.9775659732  
-1.117979445  
-1.213162864  
-1.254656542  
-1.238570551  
-1.165596741  
-1.040703765  
-0.8725421279  
-0.672627211  
-0.4543295344  
-0.2317260107  
-0.01838337406  
0.1738721933  
0.336083913  
0.4630948442  
0.5541520908  
0.6130693027  
0.6478586354  
0.6697973264  
0.6919607047  
0.7273369335  
0.7867338937  
0.8767337627  
0.9980269026  
1.14439027  
1.302580182  
1.453247627  
1.57287886  
1.636589136  
1.62145587  
1.509967156  
1.293102129  
0.9725828575  
0.5619120995  
0.08596953629  
-0.4208736749  
-0.9179629549  
-1.362520349  
-1.714264777  
-1.939897664  
-2.016881676  
-1.936005812  
-1.702409049  
-1.334916322  
-0.8637994169  
-0.3272577887  
0.2328966989  
0.7757785097  
1.265601122  
1.674968868  
1.986913076  
2.1954954  
2.304989227  
2.327876729  
2.282020891  
2.187462874  
2.06332549  
1.925240926  
1.783590309  
1.642757455  
1.501376877  
1.353459353  
1.190167358  
1.001913216  
0.7804737528  
0.5208126608  
0.2223779713  
-0.1102863155  
-0.4676495069  
-0.8359959933  
-1.198782349  
-1.538363102  
-1.837855008  
-2.082909877  
-2.263179988  
-2.373319716  
-2.413410367  
-2.388782724  
-2.309279494  
-2.188067699  
-2.040143024  
-1.880725887  
-1.723722323  
-1.580414564  
-1.458515281  
-1.361653953  
-1.28931978  
-1.237223652  
-1.198014934  
-1.162248564  
-1.119494783  
-1.059483252  
-0.973192744  
-0.8537880733  
-0.6973635343  
-0.5034315571  
-0.2751187451  
-0.01906370891  
0.2550031604  
0.5349705488  
0.8073158195  
1.058261521  
1.275020591  
1.447001832  
1.566850287  
1.631177374  
1.640868438  
1.600902965  
1.519673978  
1.407872016  
1.277073556  
1.138213229  
1.000179235  
0.8687421272  
0.7460001377  
0.6304501413  
0.5176842126  
0.4016202751  
0.2760650043  
0.1363548456  
-0.01921289155  
-0.1884239948  
-0.3648516727  
-0.5383140535  
-0.69605306  
-0.8244743767  
-0.9111931561  
-0.9470761652  
-0.9279527994  
-0.855714116  
-0.7386024759  
-0.5906231545  
-0.4301283971  
-0.2777548254  
-0.1539896775  
-0.07669172068  
-0.05889559154  
-0.1071883035  
-0.2208545356  
-0.3918878869  
-0.6058389461  
-0.8433723558  
-1.082328164  
-1.300011325  
-1.475458211  
-1.59142809  
-1.635916176  
-1.603083579  
-1.493550055  
-1.314064812  
-1.076653727  
-0.797351389  
-0.4946785552  
-0.1879949488  
0.1041094784  
0.36527868  
0.5825972818  
0.7474650167  
0.8560837527  
0.9095301731  
0.9134069065  
0.8771019049  
0.812719317  
0.7337636446  
0.6537032792  
0.5845520743  
0.5356066423  
0.5124829738  
0.5165546737  
0.5448616121  
0.5905041222  
0.6434888094  
0.6919295898  
0.7234819822  
0.7268552804  
0.6932450595  
0.6175288442  
0.4991085655  
0.3423063954  
0.1562714363  
-0.04559578007  
-0.2466587298  
-0.4284096452  
-0.5720700662  
-0.6602876742  
-0.6787854761  
-0.6178176471  
-0.4732890918  
-0.2474408787  
0.05100293652  
0.4072586767  
0.8014756119  
1.210234087  
1.608435403  
1.971414375  
2.277061614  
2.507735332  
2.65173443  
2.704160523  
2.667060146  
2.548811649  
2.362834761  
2.125800523  
1.8555652  
1.569119876  
1.280834883  
1.001235821  
0.7364578579  
0.4884423233  
0.2557890824  
0.03511259012  
-0.1773779406  
-0.3843309405  
-0.5860371449  
-0.7797510729  
-0.9596743248  
-1.117620577  
-1.244240359  
-1.330617713  
-1.36996183  
-1.359124005  
-1.299665045  
-1.198311038  
-1.066681858  
-0.9203273723  
-0.777198365  
-0.655738267  
-0.5728643959  
-0.5420976675  
-0.5720689595  
-0.6655861096  
-0.8193434998  
-1.024290029  
-1.266575427  
-1.52893205  
-1.792317733  
-2.037616919  
-2.247230258  
-2.406394005  
-2.504145816  
-2.533870151  
-2.493451589  
-2.38506123  
-2.214660589  
-1.991308314  
-1.726354567  
-1.432609142  
-1.123532026  
-0.8125083337  
-0.5122111078  
-0.2340775413  
0.01212012527  
0.2186054623  
0.3798464095  
0.492730464  
0.5566630424  
0.5735762136  
0.5478437903  
0.4860787247  
0.3967939011  
0.2899310979  
0.1762490958  
0.06660705859  
-0.02881937339  
-0.1013147963  
-0.1443189363  
-0.1539665041  
-0.1293756306  
-0.07265152206  
0.01141630964  
0.1159344891  
0.2327106268  
0.3531557157  
0.4691902282  
0.5740115187  
0.6626327433  
0.7321248262  
0.7815608558  
0.8116846305  
0.8243993208  
0.8221811614  
0.8075450427  
0.7826441413  
0.7490984864  
0.708047463  
0.6604150149  
0.607300666  
0.5504064936  
0.4923765961  
0.4369577953  
0.3889186707  
0.3536984856  
0.3368365312  
0.3432436616  
0.3764432225  
0.4378925953  
0.5265015347  
0.6384320977  
0.7672063817  
0.9041209138  
1.038908957  
1.160560709  
1.258205839  
1.32195877  
1.343648272  
1.317377428  
1.239904269  
1.110836374  
0.9326774186  
0.7107491747  
0.4530085897  
0.1697761909  
-0.126642869  
-0.42246383  
-0.703074653  
-0.9538611039  
-1.161175398  
-1.313410917  
-1.402088879  
-1.422820675  
-1.376018188  
-1.267205416  
-1.106818283  
-0.9094633033  
-0.6926505571  
-0.4751201024  
-0.2749501286  
-0.1076814361  
0.01530155766  
0.08789219287  
0.1097386008  
0.08600270497  
0.0264314546  
-0.05611777936  
-0.147491089  
-0.2341211067  
-0.304723178  
-0.3515624842  
-0.3711453968  
-0.364262245  
-0.3354143479  
-0.2917709682  
