133.3873698  
133.2901884  
136.0297902  
125.0108894  
0.264196837  
1963.873745  
10604.39313  
8366.56854  
105686.875  
9226.17775  
22916.33511  
26113.0012  
6498.497601  
43724.05023  
15325.83355  
49031.82414  
9824.351601  
6752.635171  
11858.91794  
23371.59725  
2975.590762  
10215.58333  
4969.428735  
3992.671199  
7542.516103  
737.8178626  
6024.745419  
6375.349291  
7339.598043  
11193.78081  
3499.913325  
2662.581128  
6948.869178  
853.8959342  
12399.44196  
1394.734468  
747.0243633  
3814.903615  
724.9798449  
3461.238996  
919.9068538  
2308.861968  
2517.493352  
4479.22842  
2941.937726  
5756.384185  
0.3940409788  
5925.661155  
1370.202032  
1661.029121  
1171.661835  
305.485554  
151.1101214  
3019.337209  
1286.388408  
157.7320058  
263.9058865  
683.3184782  
694.9922848  
982.3571489  
97.51101602  
238.100897  
221.9163975  
20.90769306  
117.1148794  
8.352334191  
98.27504827  
64.98867591  
93.91745106  
18.86360323  
22.19696928  
2.721986564  
10.91227625  
12.16314964  
10.19884707  
21.79480565  
22.12616845  
19.82090765  
16.6014542  
11.61766536  
10.05342839  
9.635178154  
8.214827493  
6.672046305  
6.047326967  
6.009008116  
5.927684931  
5.60982089  
5.159410509  
5.110211417  
4.77555294  
4.377726408  
4.0600608  
3.685702853  
3.458817364  
3.242442335  
3.030646086  
2.965293406  
2.775429556  
2.67840324  
2.532124421  
2.420050289  
2.301462584  
2.196298556  
2.087951588  
1.984566722  
1.906785217  
1.814635049  
1.744023435  
1.670064489  
1.60117502  
1.532465615  
1.469862496  
1.409716061  
1.354944716  
1.301931518  
1.251310991  
1.20561788  
1.160675238  
1.118058103  
1.07689912  
1.037799343  
1.001469764  
0.9662405529  
0.9325048771  
0.9004783379  
0.8697467503  
0.8406641925  
0.8128574677  
0.7862288053  
0.7609077772  
0.736495028  
0.7132868933  
0.6908510433  
0.6694472137  
0.6488965212  
0.6291728393  
0.6102737677  
0.5920566996  
0.5746152719  
0.5579183596  
0.541792463  
0.5263274836  
0.5114307452  
0.4971010015  
0.4833033876  
0.4700321565  
0.4572320395  
0.4448882778  
0.4329847675  
0.4215408031  
0.4104738259  
0.3998230955  
0.3895088829  
0.3795710229  
0.3699625248  
0.3606958229  
0.351709302  
0.3430345725  
0.3346707614  
0.3265656401  
0.3187247033  
0.3111292628  
0.3037931669  
0.2966830828  
0.2897917647  
0.2831187873  
0.2766596585  
0.2704023561  
0.2643203729  
0.2584372139  
0.2527306978  
0.2471986519  
0.2418274452  
0.236587624  
0.2315500062  
0.2266223561  
0.2218577929  
0.2172156344  
0.2127092665  
0.2083435207  
0.2040835094  
0.1999552804  
0.1959351927  
0.1920251202  
0.1882262693  
0.1845313621  
0.1809324172  
0.1774453409  
0.1740284313  
0.1707153793  
0.1674976059  
0.1643401824  
0.1612843445  
0.158284609  
0.1553956558  
0.1525412995  
0.1497927698  
0.1471067501  
0.1444733386  
0.1419091909  
0.1394243615  
0.1369870178  
0.1346223394  
0.1323012171  
0.1300516471  
0.1278407714  
0.1256924369  
0.1235893205  
0.1215318105  
0.1195326153  
0.1175811258  
0.1156709793  
0.1138059335  
0.1119725201  
0.1101909137  
0.1084518753  
0.1067518089  
0.1050843615  
0.1034554383  
0.1018712942  
0.1003132265  
0.09879143535  
0.09730942957  
0.09585414188  
0.09442645783  
0.09304530505  
0.09167779454  
0.09034202237  
0.08904105162  
0.08775904062  
0.08650954151  
0.08528649399  
0.08408129356  
0.08291703673  
0.08176370448  
0.08062905021  
0.07953221267  
0.07845384661  
0.07738347383  
0.07634922543  
0.07533825028  
0.07434289377  
0.0733564284  
0.07240803208  
0.07146029788  
0.07055154005  
0.06964352123  
0.06876356726  
0.06789304715  
0.06704648318  
0.06620660477  
0.06538881974  
0.0645835975  
0.06379713223  
0.06302105529  
0.06226632042  
0.06152044377  
0.06078998368  
0.0600720241  
0.05936743964  
0.05867839519  
0.05799957151  
0.05733107592  
0.05667272991  
0.05603786165  
0.05540123284  
0.05478320243  
0.05417627083  
0.05357674673  
0.05299203578  
0.05240987112  
0.05184755623  
0.05129210634  
0.05073921491  
0.05020093816  
0.04967411677  
0.04915949928  
0.04865276802  
0.04814482206  
0.04764848734  
0.0471703394  
0.04669006374  
0.04621938214  
0.04576242998  
0.04531265048  
0.04486048812  
0.04442531674  
0.04399261428  
0.04357371666  
0.0431522091  
0.04274260376  
0.04233964176  
0.04194417494  
0.04155323624  
0.04116640353  
0.0407876082  
0.0404175839  
0.04005196275  
0.03968787077  
0.03933493098  
0.03899044594  
0.03864068563  
0.03831162096  
0.03796486062  
0.03764417315  
0.0373230774  
0.03700624041  
0.03669220797  
0.03638705726  
0.03608544136  
0.03578832773  
0.03549447049  
0.0352036073  
0.03491485377  
0.03463599188  
0.03436456129  
0.0340886586  
0.0338274311  
0.03355913546  
0.0333005898  
0.03304659693  
0.03278928005  
0.03254101438  
0.03229896241  
0.03205932156  
0.03182411119  
0.03158691845  
0.03135596724  
0.03113086202  
0.03090473794  
0.03068476739  
0.03046801867  
0.03024892923  
0.03004365764  
0.02983772959  
0.02962597578  
0.02943199006  
0.02922879226  
0.02903299293  
0.02884028116  
0.02865310804  
0.02846076164  
0.02827636353  
0.02809796826  
0.02791521604  
0.02773930985  
0.02756538929  
0.02739398445  
0.0272267774  
0.02705653163  
0.02689205577  
0.0267305044  
0.02656654397  
0.02640810398  
0.02625919814  
0.02610340464  
0.02595342562  
0.02579906807  
0.02565716735  
0.02550900532  
0.02536753303  
0.02522903611  
0.02508715717  
0.02495050058  
0.02481300662  
0.02468397274  
0.02455176026  
0.02442452477  
0.02429861116  
0.02417397679  
0.02404526456  
0.0239269815  
0.02380665972  
0.02368085974  
0.02356779505  
0.0234535773  
0.02334466509  
0.0232300015  
0.02312092084  
0.02300893454  
0.02290455804  
0.0227993103  
0.02269493371  
0.02258938664  
0.02248954424  
0.02239022236  
0.02228840284  
0.02219582796  
0.02209983387  
0.02200486899  
0.02191309652  
0.02182054457  
0.02173038747  
0.02164176008  
0.02155920717  
0.02147162519  
0.02138743957  
0.02130249143  
0.02122153661  
0.02113952811  
0.02105840757  
0.02098439629  
0.02090754941  
0.02082993112  
0.02075795793  
0.02068166364  
0.02060711624  
0.02053623368  
0.02046453348  
0.02039958656  
0.02033069729  
0.02026133445  
0.02019625462  
0.02013072244  
0.02007091343  
0.02000838951  
0.01994354316  
0.01988558219  
0.01982417348  
0.01976631542  
0.01970731349  
0.01965150598  
0.01959640057  
0.01954354396  
0.01948770358  
0.01943354587  
0.01938672682  
0.01933439706  
0.01928411262  
0.01923222966  
0.01918522587  
0.01913867254  
0.01909217956  
0.0190446651  
0.01900064467  
0.01895694813  
0.01891450149  
0.01887693293  
0.01883374766  
0.01879336032  
0.01875204092  
0.01871601688  
0.01867747738  
0.01864519094  
0.01860757865  
0.01857188761  
0.01853894083  
0.01850213677  
0.01847071895  
0.01843918716  
0.01840764514  
0.01837685419  
0.01834704198  
0.01831792084  
0.01829284441  
0.01826544724  
0.01823588386  
0.01821553309  
0.01818833522  
0.01816192115  
0.01814179837  
0.01811567307  
0.01809532863  
0.01807551466  
0.01805047464  
0.01803836243  
0.0180169445  
0.01799753497  
0.01797732204  
0.01796392135  
0.01795020759  
0.01792680006  
0.01792160616  
0.01790314126  
0.01788861462  
0.01787704891  
0.01786863798  
0.01785533911  
0.0178484121  
0.01783634713  
0.01782450976  
0.01781745259  
0.01780995435  
0.01780427595  
0.01779711534  
0.01779462565  
0.01779069295  
0.01778526791  
0.0177816755  
0.01777986649  
0.01777807811  
0.01777700529  
0.01777860371  
