909.3439936  
968.3815109  
1094.418539  
1319.977996  
1950.432646  
5647.839162  
4379.169902  
53.89800504  
11116.00971  
13169.37792  
11751.61529  
20013.31357  
63847.07198  
1584.746999  
30435.28467  
7054.60109  
2512.36886  
1511.61636  
17411.60863  
2798.457639  
32586.82453  
13975.35402  
3607.844865  
19154.72227  
18753.63613  
8847.783024  
2703.490273  
2439.330862  
18496.36147  
6445.578442  
15804.19716  
15712.04986  
12570.75842  
5171.548925  
610.2541667  
5420.407227  
1138.25707  
2647.552788  
4164.925247  
3775.066756  
361.1460778  
753.3783412  
7632.558224  
2674.924207  
22424.20728  
4620.052013  
4288.892155  
289.1513174  
5829.469586  
3283.673798  
5093.431004  
2836.104286  
1002.585939  
6226.990042  
193.2768603  
958.7500708  
4274.468167  
3552.52617  
2289.904851  
4818.296196  
257.4666547  
5655.147944  
1354.920262  
197.8809887  
1000.276484  
404.1934117  
333.4354205  
107.0259579  
187.4156443  
384.9992364  
133.4750292  
28.51762185  
66.05262494  
24.18933696  
25.32453319  
24.67143368  
6.074032381  
27.65637262  
5.924193417  
8.240465227  
13.51745762  
6.005475461  
10.79966935  
11.6324762  
7.860147108  
8.40180311  
8.345577339  
6.900499103  
8.250324608  
6.492640389  
6.386660428  
6.048869136  
5.713748972  
5.70940072  
5.011402015  
5.378733631  
5.274952824  
4.841499909  
4.413533817  
4.456014402  
4.244927211  
4.1249489  
3.871680898  
3.839040813  
3.64939604  
3.590605578  
3.449443393  
3.357449545  
3.252785082  
3.148504141  
3.049274686  
2.96961986  
2.88844134  
2.797624992  
2.722886477  
2.641695491  
2.572259974  
2.503488046  
2.440367871  
2.374864425  
2.317061726  
2.259527941  
2.2016706  
2.151863158  
2.101022238  
2.050872312  
2.002854939  
1.956949349  
1.911926504  
1.87003232  
1.828896988  
1.789781613  
1.751400405  
1.714720182  
1.678691167  
1.644687108  
1.610982177  
1.578738813  
1.547701577  
1.517331874  
1.488189097  
1.459696753  
1.432293365  
1.405714969  
1.379849852  
1.354850977  
1.330471661  
1.306905067  
1.284011928  
1.261671341  
1.240045707  
1.218994758  
1.198562668  
1.178721028  
1.159342047  
1.140503439  
1.122182043  
1.104331634  
1.086986677  
1.07005867  
1.053567576  
1.037487805  
1.021835287  
1.00656527  
0.9916911779  
0.9771527146  
0.9629814513  
0.949167537  
0.9356625297  
0.9224990234  
0.9096347502  
0.8970624631  
0.8847967771  
0.8728003095  
0.8610901846  
0.8496438363  
0.8384429469  
0.8274739364  
0.8168195076  
0.8063212912  
0.7961000532  
0.7860875295  
0.7762635956  
0.7666603335  
0.7572744529  
0.7480920357  
0.7390937747  
0.7302586982  
0.7216193689  
0.7131484291  
0.7048714145  
0.6967402808  
0.6887903465  
0.6809868531  
0.6733516757  
0.6658275983  
0.6584784618  
0.6512905963  
0.6442069078  
0.6372484004  
0.6304502477  
0.6237642772  
0.6172103844  
0.6107838393  
0.6044519046  
0.5982632088  
0.5921819823  
0.5862038244  
0.5803213108  
0.5745460555  
0.5688975071  
0.5633462316  
0.5578773949  
0.5524910207  
0.5472308148  
0.542045946  
0.53694221  
0.5319405853  
0.5270213838  
0.5221830344  
0.5174299161  
0.5127515806  
0.5081400814  
0.5036142631  
0.4991752582  
0.4947818332  
0.4904745492  
0.4862476039  
0.4820711003  
0.4779668566  
0.4739382469  
0.4699665686  
0.4660436486  
0.4621952491  
0.4584095326  
0.4546754704  
0.4509997217  
0.4473960598  
0.4438332011  
0.4403115091  
0.4368660189  
0.4334471615  
0.4301104734  
0.4268152751  
0.4235671756  
0.4203630297  
0.4172005846  
0.4140944735  
0.4110304031  
0.4080063861  
0.4050493277  
0.402111242  
0.3992189496  
0.3963659531  
0.3935457269  
0.390781072  
0.388060873  
0.38535549  
0.3827060896  
0.3800994963  
0.3775107518  
0.3749690639  
0.3724674499  
0.369997206  
0.3675439261  
0.3651487359  
0.3627668091  
0.3604373848  
0.3581220196  
0.3558251782  
0.3535796135  
0.3513701127  
0.3491809403  
0.3470285949  
0.3448963749  
0.3427922448  
0.340712657  
0.3386717475  
0.3366472356  
0.3346518037  
0.3326811083  
0.330733667  
0.3288208775  
0.3269333347  
0.3250572723  
0.323205866  
0.3213904845  
0.3195964521  
0.3178187123  
0.3160621244  
0.3143120944  
0.3126226035  
0.3109388298  
0.3092657745  
0.3076099755  
0.3059898132  
0.3043867111  
0.3027861476  
0.3012236896  
0.2996879905  
0.2981483155  
0.2966491665  
0.2951654106  
0.2936897505  
0.2922382777  
0.2907982308  
0.2893797106  
0.2879761119  
0.2865895517  
0.2852145364  
0.283866174  
0.2825389506  
0.281215937  
0.2799175511  
0.2786183092  
0.2773555383  
0.2760900248  
0.2748536724  
0.2736277725  
0.2724161409  
0.2712154833  
0.2700312858  
0.2688700997  
0.267712156  
0.2665696956  
0.2654399955  
0.2643233411  
0.2632156326  
0.262128409  
0.2610487494  
0.2599832397  
0.2589395979  
0.2578994509  
0.2568603976  
0.2558535516  
0.2548475721  
0.2538491809  
0.2528845851  
0.2519139891  
0.2509562092  
0.250015334  
0.2490768599  
0.2481606653  
0.2472454704  
0.2463373759  
0.2454499968  
0.2445661148  
0.2437091478  
0.2428447627  
0.2419920989  
0.2411549555  
0.2403213636  
0.2395033839  
0.2386905656  
0.2378990105  
0.2370924993  
0.2363081353  
0.235537766  
0.2347706213  
0.2340148945  
0.2332824597  
0.2325373677  
0.231823427  
0.2310850311  
0.2303828098  
0.2296731295  
0.22898199  
0.2282992809  
0.2276098986  
0.2269418124  
0.2262929383  
0.2256392545  
0.2249930653  
0.2243488947  
0.2237179995  
0.2231074087  
0.2224784145  
0.221872298  
0.2212767626  
0.2206845037  
0.2201084401  
0.2195277301  
0.2189577044  
0.2183986046  
0.217839027  
0.2172914284  
0.2167496505  
0.21620462  
0.215683179  
0.2151655695  
0.2146477016  
0.214141408  
0.213637905  
0.213137312  
0.2126517184  
0.2121729294  
0.2117014881  
0.2112220151  
0.2107662159  
0.2103090182  
0.2098585837  
0.2094170302  
0.208976422  
0.2085431381  
0.2081096432  
0.207693219  
0.207276314  
0.206860628  
0.2064700548  
0.2060666054  
0.2056814622  
0.2052844118  
0.2049209546  
0.2045468941  
0.2041719244  
0.2038072157  
0.2034544677  
0.2030988142  
0.2027467981  
0.2024116636  
0.2020755511  
0.2017431701  
0.2014195818  
0.2010895849  
0.2007757864  
0.2004671336  
0.200168232  
0.1998655207  
0.1995753402  
0.1992847974  
0.1989913736  
0.198714325  
0.1984294933  
0.1981762734  
0.1979111374  
0.1976486813  
0.1974036165  
0.1971427761  
0.1969081674  
0.1966567378  
0.1964320753  
0.1961946539  
0.1959702846  
0.1957537802  
0.195533764  
0.1953274299  
0.195116426  
0.194921928  
0.1947159114  
0.1945259406  
0.1943393973  
0.194150574  
0.1939685954  
0.1938017372  
0.1936318849  
0.1934643158  
0.1933056508  
0.1931446548  
0.1929898314  
0.1928471526  
0.1927059758  
0.1925620901  
0.1924256837  
0.1923083824  
0.192178614  
0.1920510499  
0.1919375825  
0.191819449  
0.1917166708  
0.1916162683  
0.1915052811  
0.191412951  
0.1913235569  
0.1912388801  
0.1911582446  
0.1910772978  
0.1910045366  
0.190932648  
0.1908680456  
0.1908024262  
0.1907547054  
0.1907018095  
0.1906578062  
0.1906047883  
0.1905698309  
0.1905301563  
0.1904927837  
0.1904658085  
0.1904484909  
0.1904315958  
0.1904132688  
0.1904124321  
0.1903940295  
0.190383631  
