207.1085539  
214.9807943  
230.2353248  
255.4355254  
183.1445312  
948.8421586  
26971.0263  
12076.56711  
2689.348872  
3849.571192  
1260.076836  
16881.24458  
8142.066843  
24804.76145  
18050.70706  
47390.42249  
37801.11156  
16214.24032  
21106.01793  
3592.264189  
1087.452822  
8955.80281  
1299.415478  
18387.60417  
4705.011616  
27.701095  
1299.283732  
1460.548394  
14659.47478  
15505.32098  
5272.770323  
4726.555077  
24663.47908  
6462.188326  
3590.61966  
4787.684567  
9424.441043  
7994.550537  
8745.239142  
6054.042422  
10206.75652  
1763.973428  
1009.291628  
15935.27994  
2660.32484  
6037.085263  
60.66481506  
178.004467  
1191.53533  
4430.923102  
9095.155002  
5960.210982  
453.7182141  
1378.142833  
1960.618741  
7323.878875  
3163.659147  
4173.686863  
5338.309019  
5423.376996  
5483.314184  
470.5486999  
371.4137165  
121.8647561  
465.3437134  
297.726877  
126.819009  
133.6639268  
9.458645327  
41.53245238  
46.2188038  
119.7889808  
16.07134754  
1.751023745  
29.66451727  
26.27223807  
14.5650959  
1.178252923  
0.6296219442  
5.268745396  
4.458590461  
2.634342126  
2.778586044  
2.783992363  
1.686768165  
1.832045691  
1.979794011  
1.633218286  
1.767249101  
1.467608909  
1.466406244  
1.543971394  
1.505914126  
1.240597856  
1.145591743  
1.167640846  
1.128059777  
1.125010811  
1.011566565  
0.9838690356  
0.9592392718  
0.9339895375  
0.8626102093  
0.8313353785  
0.8086483881  
0.7738597969  
0.7400046595  
0.7093678276  
0.6862408823  
0.6601264463  
0.6299185524  
0.6065963908  
0.591666837  
0.5686541738  
0.5473807876  
0.5275732998  
0.511329459  
0.4941209173  
0.4773242949  
0.4610041208  
0.44694614  
0.4334438612  
0.419192366  
0.4059160395  
0.3937919071  
0.382070264  
0.3700626008  
0.3591576651  
0.348750137  
0.3386029146  
0.3288044311  
0.3194620701  
0.310504758  
0.3018897149  
0.2936120906  
0.2856226715  
0.2779797178  
0.2706198041  
0.2635113892  
0.2566373927  
0.2500412179  
0.2437011798  
0.2375409953  
0.2316169744  
0.2259067006  
0.2204030932  
0.2150650214  
0.2099174093  
0.2049384409  
0.2001223459  
0.1954797326  
0.1909778365  
0.1866348327  
0.1824182775  
0.1783420756  
0.1743950789  
0.1705732085  
0.1668688199  
0.1632802688  
0.1597976119  
0.1564271864  
0.1531540616  
0.1499811633  
0.1469024749  
0.1439110606  
0.1410121818  
0.1381939467  
0.1354592409  
0.1328054399  
0.1302226331  
0.1277151201  
0.1252751503  
0.1229026338  
0.1205965886  
0.1183575949  
0.1161756844  
0.1140542893  
0.1119877149  
0.1099754498  
0.1080183735  
0.1061118413  
0.1042536296  
0.1024451903  
0.1006852527  
0.09896698771  
0.09729349166  
0.09566157594  
0.09406998622  
0.09251838607  
0.09100669623  
0.0895297977  
0.08808990528  
0.08668679503  
0.08531450603  
0.08397658784  
0.08266921777  
0.08139453224  
0.08014700492  
0.07892935367  
0.0777429022  
0.07658079561  
0.07544650323  
0.07433759237  
0.07325339212  
0.07219279968  
0.07115845142  
0.0701448895  
0.06915267673  
0.06818499353  
0.06723666048  
0.06631021273  
0.06540184645  
0.06451616203  
0.06364473398  
0.06279692805  
0.06196173546  
0.06114707408  
0.06034806109  
0.05956731915  
0.05879960457  
0.05804972839  
0.05731633288  
0.05659742218  
0.05589121906  
0.0551994866  
0.05452256611  
0.05385920759  
0.05320873401  
0.05256821105  
0.05194458381  
0.05133089291  
0.05072875699  
0.05013952634  
0.04955994212  
0.04899130809  
0.04843470443  
0.04788827962  
0.04735268682  
0.04682495702  
0.04630924033  
0.04580157059  
0.04530518337  
0.04481635867  
0.0443344208  
0.04386432102  
0.04340113782  
0.04294697341  
0.0425010776  
0.04206174151  
0.0416321615  
0.04120972456  
0.04079245044  
0.04038394955  
0.03998389047  
0.03959045205  
0.03920177816  
0.03882191811  
0.03844520623  
0.03807845111  
0.0377173199  
0.03736019621  
0.03701108714  
0.03666647499  
0.03633020582  
0.03599618632  
0.03566757845  
0.0353463771  
0.03503004673  
0.03471885614  
0.0344109593  
0.03411207826  
0.03381518316  
0.03352259706  
0.03323514585  
0.03295304142  
0.03267493926  
0.03240067428  
0.03213277051  
0.03186690845  
0.03160470605  
0.0313486974  
0.03109596377  
0.03084559994  
0.03059996317  
0.03035960966  
0.03012162359  
0.0298877046  
0.0296567951  
0.02942936424  
0.02920425359  
0.0289856324  
0.02876865091  
0.02855279597  
0.02834356182  
0.028135435  
0.02793101615  
0.02772972844  
0.02753171124  
0.02733427638  
0.02714175909  
0.02695274581  
0.0267643554  
0.02658114104  
0.02639805906  
0.02621900342  
0.02604216238  
0.0258680927  
0.02569591576  
0.0255265487  
0.02535969663  
0.02519611388  
0.02503283926  
0.02487301322  
0.02471449673  
0.02456064157  
0.02440691685  
0.02425416247  
0.02410641683  
0.02395892616  
0.02381417407  
0.0236717704  
0.02353061574  
0.02339075879  
0.023253477  
0.0231191442  
0.02298471428  
0.02285341856  
0.02272368473  
0.02259558247  
0.02246906807  
0.02234546162  
0.02222221471  
0.0221012067  
0.02198021367  
0.02186246993  
0.02174622325  
0.02163212153  
0.02151784013  
0.02140555933  
0.02129492396  
0.02118685401  
0.02108013016  
0.0209741703  
0.02086916046  
0.02076635641  
0.02066395978  
0.02056343019  
0.0204646152  
0.02036584685  
0.02027081826  
0.0201752704  
0.02008180144  
0.01998860339  
0.01989697627  
0.01980690422  
0.01971687112  
0.01962910472  
0.01954209962  
0.01945675934  
0.01937373268  
0.01928889831  
0.01920804773  
0.01912638337  
0.01904547128  
0.01896617774  
0.01888893869  
0.01881114295  
0.01873563135  
0.0186602376  
0.01858656134  
0.01851370989  
0.01844200098  
0.01837087622  
0.01830113771  
0.01823235939  
0.01816404984  
0.0180972104  
0.01803013095  
0.0179642133  
0.01790008006  
0.01783662455  
0.01777345346  
0.01771216844  
0.01764967347  
0.01759044839  
0.01753174262  
0.01747202404  
0.01741433273  
0.01735689586  
0.01730013532  
0.01724544012  
0.01719035596  
0.01713683855  
0.01708220707  
0.01703073629  
0.0169794546  
0.01692918048  
0.01687861391  
0.016829159  
0.01677947335  
0.0167314261  
0.01668430295  
0.01663779495  
0.01659143379  
0.01654580309  
0.01650104275  
0.01645750695  
0.01641477637  
0.01637176607  
0.01632963756  
0.01628760012  
0.01624699496  
0.01620767546  
0.01616648702  
0.01612845939  
0.0160902097  
0.01605206244  
0.01601532018  
0.0159793113  
0.01594235408  
0.0159072081  
0.01587408068  
0.01583877317  
0.01580557886  
0.0157728586  
0.01573986452  
0.01570829749  
0.01567738558  
0.01564645588  
0.01561682507  
0.01558663243  
0.01555744123  
0.01552913955  
0.01550110717  
0.01547262738  
0.015446254  
0.01542041452  
0.01539413357  
0.01536848089  
0.01534424786  
0.0153191572  
0.01529540725  
0.01527269598  
0.0152484011  
0.01522647466  
0.01520449197  
0.01518397933  
0.01516142412  
0.01514253959  
0.01512165256  
0.0151026867  
0.0150835712  
0.01506683435  
0.01504691319  
0.01502968443  
0.01501235201  
0.01499580186  
0.01498025525  
0.01496400135  
0.01494934389  
0.01493412487  
0.01491981988  
0.01490593526  
0.01489189234  
0.01487934942  
0.01486704526  
0.01485544162  
0.01484424364  
0.0148316999  
0.01482229329  
0.01481220132  
0.0148018959  
0.01479175847  
0.01478357537  
0.01477474283  
0.01476784911  
0.0147595708  
0.01475277175  
0.01474571395  
0.01473863642  
0.01473335041  
0.01472822333  
0.0147236414  
0.0147188329  
0.0147148835  
0.01471135923  
0.01470761674  
0.01470483883  
0.0147024209  
0.0147000438  
0.01469883965  
0.01469770927  
0.01469741003  
0.01469758851  
