662.8379589  
685.1314545  
723.1544395  
796.1308169  
1262.763958  
3468.813922  
2015.698302  
3334.308616  
25072.53301  
967.9302586  
26859.97562  
5974.015937  
2759.901563  
3404.584857  
32194.56402  
27766.616  
27987.79455  
9503.628539  
38190.87998  
20904.11511  
800.9221301  
14615.40292  
13131.0197  
908.3989958  
5966.509345  
20207.26726  
4136.663138  
249.2786467  
12662.11502  
29464.19242  
5234.700054  
24764.1215  
2663.465191  
3027.792652  
227.4568454  
13071.34303  
15519.85849  
1224.621457  
512.940737  
3250.496956  
2729.836805  
429.6362415  
3935.0887  
396.6503203  
5019.932413  
6568.944163  
3350.000055  
1649.048799  
13152.65627  
2013.099421  
3927.575473  
345.4730605  
3385.106859  
3075.211454  
3222.516697  
3246.06159  
8198.245633  
414.5594683  
564.4618868  
5946.438536  
3777.747008  
3599.533277  
746.8637477  
118.2502688  
60.96835973  
356.6880412  
338.3850467  
52.01393923  
171.6978561  
23.14248147  
7.521292119  
25.52680352  
28.32358933  
63.26890193  
21.29480631  
4.999543598  
25.51853576  
13.74970288  
14.63474602  
18.42263384  
10.46519349  
12.47827618  
13.20255588  
7.817329406  
10.81181257  
9.762701138  
10.11419877  
8.94965646  
9.067545489  
8.925938477  
7.981822871  
7.986075642  
7.177086714  
7.149153269  
6.539717766  
6.271905568  
6.162477253  
5.86024311  
5.678773905  
5.398863318  
5.145102538  
4.880986405  
4.740288497  
4.559829062  
4.412766538  
4.216164109  
4.061241371  
3.89691228  
3.755454125  
3.621320015  
3.492114281  
3.367990292  
3.249625112  
3.133743192  
3.025057815  
2.924125415  
2.826014001  
2.732296267  
2.642515849  
2.557161338  
2.472962954  
2.395571273  
2.319201858  
2.248087471  
2.179203188  
2.112814631  
2.048148854  
1.986907067  
1.928420953  
1.872490946  
1.818396478  
1.766526585  
1.716408147  
1.668144246  
1.622043787  
1.577401929  
1.534608423  
1.493242866  
1.453430058  
1.415103685  
1.378211159  
1.342439846  
1.308115641  
1.274874274  
1.242834457  
1.21187711  
1.182040286  
1.153115016  
1.12521891  
1.098220246  
1.07212774  
1.046906215  
1.022484743  
0.9988579649  
0.975975724  
0.9538328625  
0.9323909545  
0.9116158834  
0.8914577894  
0.8719805466  
0.853043858  
0.8347044062  
0.8169030799  
0.7996510704  
0.7828964378  
0.7666451716  
0.7508533129  
0.7355338793  
0.7206471032  
0.7061938802  
0.6921562996  
0.6784936846  
0.6652228697  
0.6523453367  
0.6397988438  
0.6276100608  
0.6157303609  
0.6041868693  
0.5929518402  
0.5820072623  
0.5713621446  
0.5609966424  
0.5509125955  
0.541067162  
0.5314855085  
0.5221595484  
0.5130730756  
0.5042116889  
0.4955683015  
0.4871416877  
0.478928733  
0.4709057951  
0.4631068371  
0.4554703548  
0.4480352012  
0.4407586184  
0.4336791356  
0.4267547195  
0.4199912484  
0.4134170756  
0.4069617338  
0.4006590451  
0.3945187255  
0.3885138629  
0.3826575731  
0.3768993352  
0.3713007404  
0.3658303912  
0.3604536589  
0.3552214371  
0.3500933354  
0.3450797628  
0.340172183  
0.3353845507  
0.3306826202  
0.3260895394  
0.3216105994  
0.3171959757  
0.3128985075  
0.3086709094  
0.3045501655  
0.3005001162  
0.2965413377  
0.2926663942  
0.2888619257  
0.2851458373  
0.2814921361  
0.2779236216  
0.2744190981  
0.2709864891  
0.2676234941  
0.2643205655  
0.261092344  
0.2579293995  
0.2548083065  
0.2517605781  
0.2487680613  
0.2458367807  
0.2429581354  
0.2401366468  
0.2373708507  
0.2346460388  
0.2319781719  
0.2293701623  
0.2267917674  
0.2242661693  
0.2218002154  
0.2193621887  
0.216979226  
0.2146302137  
0.21233658  
0.2100678426  
0.2078536361  
0.2056737441  
0.2035267019  
0.201429024  
0.1993569241  
0.1973324819  
0.1953385326  
0.1933740709  
0.1914451676  
0.1895457152  
0.187682881  
0.1858556961  
0.184056678  
0.1822864774  
0.1805448119  
0.1788374112  
0.1771504924  
0.1754929307  
0.1738751041  
0.1722694563  
0.1706920119  
0.1691421041  
0.1676248816  
0.1661226926  
0.1646497683  
0.1632012044  
0.1617705543  
0.1603733074  
0.1589846294  
0.1576289396  
0.1562826711  
0.1549653526  
0.1536672454  
0.1523887185  
0.1511338805  
0.1498948223  
0.1486741393  
0.1474750077  
0.1462975971  
0.1451276244  
0.1439904794  
0.1428572166  
0.1417441081  
0.1406524995  
0.1395710615  
0.1385049884  
0.1374611719  
0.1364382442  
0.1354265823  
0.1344236404  
0.1334357354  
0.1324721045  
0.1315094775  
0.1305681874  
0.1296452613  
0.1287216564  
0.1278238032  
0.1269258342  
0.1260569299  
0.1251869814  
0.1243452616  
0.1235046337  
0.1226746361  
0.1218612019  
0.1210530467  
0.1202630541  
0.1194863874  
0.1187188567  
0.1179595239  
0.1172079376  
0.1164790247  
0.1157472299  
0.1150244463  
0.114328573  
0.1136250808  
0.1129312801  
0.1122562148  
0.1115856278  
0.1109348876  
0.1102737183  
0.1096348  
0.1090047773  
0.1083796397  
0.1077676282  
0.107161187  
0.1065620912  
0.1059693135  
0.1053886637  
0.104811206  
0.1042508013  
0.1036896491  
0.1031370794  
0.1025912595  
0.1020579256  
0.1015298863  
0.1010071033  
0.1004885742  
0.09999095039  
0.09948616036  
0.0989897659  
0.0984993758  
0.09802342181  
0.09754513574  
0.09708326984  
0.09661544237  
0.09616457415  
0.09571347222  
0.0952697136  
0.09482946763  
0.09439913039  
0.09397662313  
0.0935584409  
0.0931447158  
0.09273693695  
0.09232949857  
0.09192691108  
0.09153989859  
0.09115306389  
0.09076863737  
0.09039284702  
0.09002581101  
0.0896487613  
0.08929515032  
0.08893922103  
0.08858482304  
0.08823680146  
0.08789729371  
0.08755856043  
0.08723196382  
0.0868990237  
0.08657458797  
0.08625619752  
0.08594008385  
0.08563359627  
0.08532143627  
0.08502525727  
0.08472478589  
0.08442689917  
0.08414170591  
0.08385235409  
0.08357144054  
0.0832977893  
0.08302372255  
0.0827537063  
0.08249323991  
0.08222843568  
0.08196980237  
0.08171651179  
0.08146795045  
0.08122075362  
0.08097900053  
0.08074311767  
0.08050392895  
0.08026979748  
0.08004313979  
0.07981406143  
0.07959473323  
0.07937762408  
0.07916085261  
0.07895021837  
0.07874245253  
0.07853886744  
0.07833046078  
0.07813277031  
0.07794077133  
0.07774645976  
0.07756036077  
0.07736875351  
0.0771932015  
0.0770081897  
0.07682975379  
0.07666026851  
0.07648583064  
0.07632020848  
0.07614846563  
0.07599163098  
0.07582967589  
0.07567534556  
0.07551811573  
0.07537676594  
0.0752196471  
0.07507928492  
0.07493482738  
0.07479430491  
0.07465949087  
0.07452127153  
0.07439264719  
0.07426454232  
0.07413754889  
0.07400765356  
0.0738946597  
0.07377076767  
0.07365788097  
0.07354273704  
0.07343215273  
0.07332660843  
0.07321839239  
0.07311842151  
0.07302096647  
0.07291560087  
0.07282206199  
0.0727255827  
0.07263679199  
0.07255492706  
0.07246674159  
0.0723818169  
0.07230313708  
0.0722223545  
0.07214896114  
0.0720711663  
0.07200073752  
0.07193106742  
0.07186469932  
0.07180572266  
0.07173841593  
0.07168161254  
0.0716246735  
0.0715692443  
0.07150996268  
0.07146948386  
0.07141471444  
0.0713653852  
0.07132176241  
0.07128192415  
0.07124610975  
0.07120575983  
0.07117119995  
0.07114095678  
0.07111656  
0.07108539533  
0.07105439167  
0.07103263315  
0.0710145296  
0.07099708343  
0.07097611039  
0.07095976614  
0.07094446318  
0.07094472217  
0.07093174962  
0.07092819675  
0.07092377615  
0.07092104428  
