1021.948921  
1041.213233  
1095.683337  
1149.204284  
480.2195487  
3649.573861  
1113.203311  
46223.86567  
39927.24669  
12760.60621  
735.1934906  
9220.256166  
16319.79188  
44826.98314  
31345.28765  
17449.11196  
80108.28829  
2359.754991  
51745.17419  
20791.42725  
9097.288093  
2183.799907  
568.5948275  
3642.042794  
6627.653006  
3914.680386  
6965.098876  
2361.230378  
199.3101743  
330.7479683  
467.1638833  
351.0500427  
4953.845545  
5971.544221  
6231.004841  
3172.417889  
1407.729885  
5673.596005  
1500.603628  
478.5543817  
1682.086902  
4457.435534  
218.6382309  
4405.949811  
4400.868301  
1036.666703  
1028.835795  
486.6360492  
2120.599718  
2214.875994  
744.5633096  
2294.295785  
197.6875598  
2404.63518  
2356.450462  
278.1131784  
295.4392854  
2659.578581  
975.8683489  
62.08498076  
59.01656044  
164.1496224  
573.1639199  
496.1775731  
71.57544786  
136.3900758  
624.1212245  
93.73841388  
251.2629338  
47.95750553  
157.7000884  
137.8361401  
81.01614365  
78.462978  
58.28257089  
24.39862808  
42.12825692  
31.41446229  
18.45480066  
27.70210218  
27.53555154  
26.59151101  
17.87953595  
17.76878197  
16.26261392  
16.91358171  
14.70481906  
15.35138067  
13.44795438  
12.13236069  
12.28290017  
11.16737023  
10.26921595  
9.978840109  
9.232304718  
8.933067353  
8.478592988  
8.052819232  
7.818260473  
7.359841444  
7.046951959  
6.768619999  
6.54181523  
6.241415577  
6.023758751  
5.805786525  
5.575544526  
5.385076755  
5.188716195  
5.009840401  
4.827255345  
4.68322952  
4.535063016  
4.375287683  
4.24379774  
4.114695684  
3.987995205  
3.874975039  
3.755687976  
3.649567078  
3.544530248  
3.443366966  
3.350873146  
3.258795865  
3.172087477  
3.089652449  
3.008624111  
2.932504435  
2.858774258  
2.788124505  
2.720319616  
2.654913325  
2.591599855  
2.531597982  
2.473038304  
2.416090735  
2.362341978  
2.309790569  
2.259313212  
2.210499115  
2.163058051  
2.117739555  
2.073373752  
2.030966964  
1.989697228  
1.949546473  
1.911146542  
1.87366846  
1.837380467  
1.802289028  
1.768170441  
1.73515622  
1.703058601  
1.671987725  
1.641706216  
1.61231259  
1.583950733  
1.556267923  
1.529258266  
1.503065555  
1.477692727  
1.452950893  
1.428978666  
1.40550356  
1.38272017  
1.360508051  
1.338879099  
1.317843499  
1.297287873  
1.277296506  
1.257799558  
1.23879052  
1.220283598  
1.20220377  
1.184553627  
1.167361627  
1.150559028  
1.134171853  
1.118157462  
1.102543646  
1.087249114  
1.072334014  
1.057785331  
1.043541118  
1.029616803  
1.015996345  
1.002679799  
0.9896800478  
0.9769374074  
0.9644982621  
0.9522984054  
0.940380422  
0.9287177838  
0.9172917898  
0.9060984451  
0.8951459943  
0.8844431764  
0.8739025835  
0.8636328968  
0.8535373122  
0.8436544594  
0.8339638801  
0.8245151651  
0.8152114396  
0.8060660505  
0.7971357367  
0.7883432463  
0.7797524819  
0.7713110442  
0.7630567363  
0.7549265982  
0.7469638581  
0.7391451072  
0.7314590297  
0.7239263004  
0.716525407  
0.7092814509  
0.7021602059  
0.6951543596  
0.6882779176  
0.6814976572  
0.6748710257  
0.668354101  
0.6619684975  
0.655645729  
0.6494728986  
0.6433902716  
0.637420927  
0.6315490533  
0.6257780295  
0.6200963926  
0.6145120576  
0.6090283566  
0.6036257465  
0.5983161135  
0.5931033641  
0.5879576938  
0.5829100367  
0.5779414596  
0.5730359781  
0.5682193991  
0.5634842671  
0.5588322661  
0.5542364624  
0.5497259419  
0.5452786119  
0.5409022952  
0.5365970259  
0.5323339035  
0.5281534126  
0.5240434436  
0.5199968672  
0.5160003601  
0.5120716893  
0.5081883453  
0.5043686989  
0.5006124499  
0.4969199868  
0.4932614641  
0.4896825294  
0.4861280757  
0.4826381155  
0.4792014199  
0.4758049367  
0.4724507555  
0.4691765245  
0.4659204791  
0.4627096746  
0.4595704604  
0.4564632764  
0.4533856658  
0.450371073  
0.4473781883  
0.4444273124  
0.4415321872  
0.4386772157  
0.4358595778  
0.433061737  
0.4303212124  
0.4276133396  
0.4249475506  
0.4222941515  
0.4196969841  
0.4171486257  
0.4146129055  
0.412113678  
0.4096476864  
0.4072233922  
0.4048230778  
0.4024626145  
0.400117471  
0.397815269  
0.3955391613  
0.3932949222  
0.3910665033  
0.3888836379  
0.3867390581  
0.384581445  
0.3824940307  
0.3804143463  
0.3783607634  
0.3763340256  
0.3743347384  
0.3723618565  
0.3704115081  
0.3684957676  
0.3665939971  
0.3647044892  
0.3628550762  
0.3610250873  
0.3592113091  
0.3574375562  
0.3556724768  
0.3539368075  
0.3522196953  
0.3505119706  
0.3488461026  
0.3471830066  
0.3455543799  
0.343927937  
0.3423344115  
0.3407606541  
0.3392077289  
0.3376764858  
0.3361519785  
0.3346505503  
0.3331787246  
0.3317019875  
0.3302509244  
0.3288301269  
0.3274154011  
0.3260214451  
0.3246462719  
0.3232686476  
0.3219439259  
0.3206153908  
0.3193011374  
0.3180034784  
0.3167225725  
0.3154605912  
0.3142105163  
0.31296908  
0.311751107  
0.3105485163  
0.309361715  
0.3081782264  
0.3070252773  
0.3058674033  
0.3047380998  
0.3036190441  
0.3025124615  
0.3014099821  
0.3003343427  
0.2992619468  
0.2982131295  
0.2971648493  
0.2961396758  
0.2951292532  
0.2941136771  
0.2931300388  
0.2921408146  
0.291173495  
0.2902291801  
0.2892583554  
0.2883353557  
0.2874170069  
0.2864973778  
0.2855980823  
0.2847100246  
0.2838358557  
0.2829733856  
0.2821143364  
0.2812586919  
0.2804317541  
0.2796048246  
0.2787897133  
0.2779771395  
0.277192443  
0.2764107227  
0.2756339152  
0.2748616662  
0.2741012514  
0.2733581601  
0.2726173039  
0.2719021551  
0.2711808449  
0.2704813982  
0.2697663469  
0.2690856255  
0.2684070397  
0.2677391822  
0.267069643  
0.2664115614  
0.2657613087  
0.2651272823  
0.2645105148  
0.2638711673  
0.2632643872  
0.2626536432  
0.2620720689  
0.2614807407  
0.2608943207  
0.2603301732  
0.2597615222  
0.2592023562  
0.2586632831  
0.2581257066  
0.2575883594  
0.2570727636  
0.2565463307  
0.2560362561  
0.2555362784  
0.2550324641  
0.2545493214  
0.2540807535  
0.2535982979  
0.2531390277  
0.2526766482  
0.2522230853  
0.2517806766  
0.251348811  
0.2509206439  
0.2504899545  
0.2500837385  
0.2496710182  
0.2492648032  
0.2488726294  
0.2484839197  
0.2481054546  
0.2477318694  
0.2473495257  
0.2469913417  
0.2466380674  
0.2462853388  
0.24593817  
0.2456099934  
0.2452800104  
0.2449573021  
0.2446335107  
0.2443278239  
0.2440142615  
0.2437224509  
0.2434329021  
0.2431312916  
0.2428661639  
0.2425887023  
0.2423159645  
0.2420568589  
0.2418016937  
0.2415505877  
0.2413089931  
0.2410681606  
0.2408391578  
0.2406070682  
0.2403954451  
0.2401759227  
0.2399584097  
0.2397620799  
0.2395688036  
0.2393768939  
0.2391724673  
0.2390025858  
0.2388312773  
0.2386595022  
0.2385031434  
0.2383453168  
0.2381973869  
0.2380478119  
0.237902306  
0.2377716592  
0.2376377959  
0.2375142272  
0.2374001619  
0.2372997562  
0.2371808151  
0.237085696  
0.2369809227  
0.236886622  
0.2368132292  
0.2367255119  
0.2366580861  
0.2365931632  
0.2365304215  
0.2364733182  
0.2364218452  
0.2363715593  
0.2363379638  
0.2362844033  
0.2362613185  
0.2362386481  
0.2362288831  
0.2362079045  
0.2362049186  
0.2362032084  
