429.0234706  
451.4624505  
498.8495798  
570.3490611  
462.3579431  
3130.648595  
6848.261636  
807.8967527  
20667.72458  
18442.19714  
26917.91106  
10969.50449  
2932.840714  
64.43942009  
19858.2738  
8524.943706  
308.7016492  
21015.82357  
6750.016954  
11560.65409  
18099.87677  
5507.214131  
11106.83973  
4563.183481  
3747.817974  
28898.50066  
26742.24327  
5131.73347  
23025.88243  
30978.12066  
27286.43127  
8408.473101  
2633.0038  
2322.367523  
10874.45645  
4934.9901  
5960.618204  
1846.087354  
13422.98464  
13141.1738  
2752.359389  
5137.602751  
5660.63613  
2753.849269  
14591.26719  
2392.965303  
3369.782041  
7764.446516  
7641.39199  
1781.403376  
2192.878325  
7645.093649  
945.9956707  
76.0708273  
2273.298303  
3894.311153  
2416.588936  
47.28694672  
308.4042323  
1238.875241  
1032.551712  
134.2067238  
724.1975626  
166.8942771  
138.6389137  
71.69593221  
75.10717378  
66.99196405  
138.8880741  
87.03534813  
18.26439638  
35.24172995  
3.944296265  
27.53780852  
24.32661047  
5.861639974  
3.235604718  
4.45904712  
6.588870306  
4.351869611  
3.912004457  
3.949931626  
4.168028798  
2.295550517  
2.913439409  
1.783137918  
2.026054253  
2.357420681  
2.072437729  
1.78475411  
1.806401988  
1.591284177  
1.686267211  
1.469831894  
1.361896009  
1.3505542  
1.277162849  
1.220872293  
1.189378208  
1.125618779  
1.084354405  
1.021510735  
0.9786687864  
0.9480784328  
0.9045781569  
0.8717241149  
0.8317978704  
0.7995351172  
0.7655150558  
0.7371665203  
0.706359172  
0.6785192511  
0.6528284102  
0.6289113877  
0.607250646  
0.5854910011  
0.5649628248  
0.5452361839  
0.5272278852  
0.5086502875  
0.4913042243  
0.4752419085  
0.4594369547  
0.4446457836  
0.4302600973  
0.4165445501  
0.4034873377  
0.3908628104  
0.3787390071  
0.3671946941  
0.3561838127  
0.3455535935  
0.335385022  
0.3256542017  
0.3162148366  
0.3072397451  
0.2985404928  
0.2901703297  
0.2821372689  
0.2744006025  
0.2669715057  
0.259813549  
0.2528972208  
0.246254832  
0.2398274459  
0.2336371647  
0.227656712  
0.2218890658  
0.2163163639  
0.2109450532  
0.2057563763  
0.2007376056  
0.195891659  
0.1912029777  
0.1866645135  
0.1822800882  
0.1780340675  
0.1739297729  
0.1699523956  
0.166097422  
0.1623701352  
0.1587540127  
0.1552525308  
0.1518521881  
0.1485626978  
0.1453689091  
0.1422665809  
0.1392664481  
0.1363501531  
0.1335153361  
0.1307662159  
0.1281022416  
0.125508552  
0.1229866567  
0.1205316855  
0.1181549555  
0.1158434417  
0.1135963152  
0.1114073709  
0.1092791433  
0.1072135487  
0.1051964616  
0.1032368544  
0.1013250502  
0.09946678364  
0.09766083752  
0.09589702868  
0.0941813716  
0.0925071784  
0.09087644607  
0.08929233774  
0.08774447883  
0.08623234319  
0.08476088743  
0.08332786715  
0.08192333195  
0.08055620565  
0.07922418551  
0.07792230244  
0.07665490839  
0.07541749036  
0.07420662183  
0.07302637221  
0.0718702055  
0.07074290516  
0.06964542432  
0.06856685433  
0.06751612611  
0.0664923749  
0.06548357825  
0.06450625376  
0.06354740878  
0.06260762907  
0.06169380717  
0.0607980116  
0.05991699966  
0.05905815006  
0.05821889472  
0.05740097036  
0.05659436331  
0.05580981431  
0.055039792  
0.05428310689  
0.05354647804  
0.05282529608  
0.05211676446  
0.05142025675  
0.05074208637  
0.05007980984  
0.04942506231  
0.04878699506  
0.04816089485  
0.04754798496  
0.0469469132  
0.04635735388  
0.04578048244  
0.04521395779  
0.04465889968  
0.04411676211  
0.0435811302  
0.04305817633  
0.0425434593  
0.04204081269  
0.0415467477  
0.04106002697  
0.04058524429  
0.04011870577  
0.0396589184  
0.03921014844  
0.03876950489  
0.03833385436  
0.03790863847  
0.03749114436  
0.03708113641  
0.03667712504  
0.03628455407  
0.03589250231  
0.03551295825  
0.03513693293  
0.03476946258  
0.03440642643  
0.03405026896  
0.03370378135  
0.03335730125  
0.03302299014  
0.03269079887  
0.0323627705  
0.03204319505  
0.03172918891  
0.03141972316  
0.03111558914  
0.03081521998  
0.0305198245  
0.03023229962  
0.02994733346  
0.02966897255  
0.02939230496  
0.02912144689  
0.02885501913  
0.02859299192  
0.02833470196  
0.02808250522  
0.02783249334  
0.02758727007  
0.02734605583  
0.02710659746  
0.02687413324  
0.02664255021  
0.02641493761  
0.02619287251  
0.02597247016  
0.025757349  
0.02554561572  
0.02533406286  
0.02512936595  
0.02492292797  
0.02472582185  
0.02452915592  
0.02433290055  
0.02414216432  
0.02395491358  
0.02376838061  
0.02358745216  
0.02340608776  
0.02322872279  
0.02305502241  
0.02288619022  
0.02271299632  
0.02254812406  
0.02238295863  
0.02222075735  
0.02206167774  
0.02190334976  
0.02174948901  
0.02159792201  
0.0214471914  
0.02129753829  
0.02115155844  
0.02100878662  
0.0208675983  
0.02072632808  
0.02058913481  
0.0204524345  
0.02031857634  
0.02018656186  
0.02005552535  
0.01992855362  
0.01980146654  
0.01967603175  
0.01955499807  
0.019432154  
0.01931176938  
0.01919434438  
0.01907868222  
0.01896646882  
0.01885102531  
0.01873924293  
0.01862862573  
0.0185217678  
0.01841426116  
0.01831031546  
0.01820404002  
0.01810239841  
0.01800173983  
0.01790264564  
0.01780394976  
0.01770653735  
0.01761138605  
0.01751607718  
0.01742405988  
0.01733113253  
0.01724146659  
0.01715186121  
0.01706484424  
0.01697694562  
0.01689122327  
0.01680799778  
0.01672379409  
0.01664207817  
0.01656018461  
0.01648074498  
0.01640278463  
0.01632233692  
0.01624761728  
0.01617266567  
0.01609785345  
0.01602475133  
0.01595058839  
0.01587939878  
0.01580796767  
0.0157380568  
0.01566957511  
0.01560314502  
0.0155359501  
0.01546812358  
0.01540355965  
0.01534031881  
0.01527937841  
0.01521405765  
0.01515422316  
0.0150921742  
0.01503329806  
0.01497509965  
0.01491594285  
0.01486039366  
0.01480416619  
0.01474792903  
0.01469265926  
0.01463855135  
0.01458598056  
0.01453114631  
0.01448026835  
0.01442892293  
0.01437763855  
0.01432909754  
0.01428023497  
0.01423235416  
0.01418421853  
0.01413789975  
0.01409198022  
0.01404600742  
0.01400008927  
0.01395709277  
0.01391266026  
0.01387024682  
0.01383040551  
0.01378633793  
0.01374620174  
0.0137063026  
0.01366739517  
0.01362676313  
0.0135885108  
0.01355177949  
0.01351245824  
0.01347771981  
0.01344209722  
0.0134061745  
0.01336990782  
0.01333641576  
0.01330291122  
0.01326960013  
0.0132376527  
0.01320674917  
0.013173007  
0.01314463681  
0.0131131801  
0.01308224983  
0.01305377606  
0.013023971  
0.01299552474  
0.01296814712  
0.01293992286  
0.01291424842  
0.01288787872  
0.01286197649  
0.01283612438  
0.01281257996  
0.01278853086  
0.01276306615  
0.01274047586  
0.01271733765  
0.01269614409  
0.01267353582  
0.01265237542  
0.01263075457  
0.01261070188  
0.01259107942  
0.01257125247  
0.01255170858  
0.01253365845  
0.01251582395  
0.01249682808  
0.01247919323  
0.01246320929  
0.01244608109  
0.01243190753  
0.01241612386  
0.01240114122  
0.01238685897  
0.01237280979  
0.01235775435  
0.01234568155  
0.01233289052  
0.01232022245  
0.01230645495  
0.01229626465  
0.01228461924  
0.01227310334  
0.0122626743  
0.01225341772  
0.01224427381  
0.01223586367  
0.01222556672  
0.01221800325  
0.01220991982  
0.012201086  
0.01219636296  
0.01218869737  
0.01218154485  
0.01217650341  
0.01217160441  
0.01216661864  
0.01216164327  
0.01215722666  
0.01215300883  
0.01215042806  
0.01214704847  
0.01214354068  
0.01214175068  
0.01214068863  
0.01213840308  
0.01213683066  
0.01213758082  
0.01213766863  
