0.3054395969  
0.3664729305  
0.4111306512  
0.4305745979  
0.4192747866  
0.3758718165  
0.3035160183  
0.2096561665  
0.1052459555  
0.003476784119  
-0.08183815059  
-0.1380169109  
-0.1551898429  
-0.1276737595  
-0.05484946586  
0.0585871131  
0.203062116  
0.3652106378  
0.5294736941  
0.6800121879  
0.8026692808  
0.8867068668  
0.9260842769  
0.920081005  
0.8731925809  
0.7943271152  
0.6954157813  
0.5896724509  
0.4897481401  
0.4060619068  
0.3455344242  
0.3108885687  
0.3005923436  
0.3094076801  
0.3294381455  
0.3514845416  
0.3664979232  
0.3668980881  
0.347589185  
0.3065143562  
0.2447240413  
0.1659443254  
0.07577117806  
-0.0193866583  
-0.1134118611  
-0.2014583363  
-0.2806346616  
-0.3502906747  
-0.4118532988  
-0.4682672035  
-0.5231290837  
-0.579691869  
-0.6399158973  
-0.7037616404  
-0.7688570955  
-0.8306152558  
-0.8828118808  
-0.9185155723  
-0.9312412497  
-0.916107695  
-0.8708165823  
-0.7962549927  
-0.6966273901  
-0.5790641983  
-0.4527641147  
-0.3278056798  
-0.2138091815  
-0.1186657481  
-0.04753984408  
-0.002290747951  
0.01858099591  
0.019483212  
0.006840043544  
-0.01207169561  
-0.03036551482  
-0.04266290615  
-0.0458887331  
-0.03962703863  
-0.0259824234  
-0.008993509885  
0.006295132237  
0.01491053101  
0.01298321999  
-0.001449425386  
-0.02802764093  
-0.0640855334  
-0.1051044773  
-0.1455007879  
-0.1795926886  
-0.2025716758  
-0.2112925751  
-0.2047545582  
-0.1841850722  
-0.1527290971  
-0.1148002966  
-0.07522965035  
-0.03834605192  
-0.007161504099  
0.01719983633  
0.03574459442  
0.05147405931  
0.06889140628  
0.09321919636  
0.1294468202  
0.1813518463  
0.250636771  
0.3363236223  
0.4345085793  
0.5385377159  
0.6396002488  
0.7276882397  
0.7927907395  
0.8261849101  
0.8216236134  
0.7762482308  
0.6910791917  
0.570990756  
0.4241543399  
0.2610233155  
0.09300260431  
-0.0689977346  
-0.2158891899  
-0.3413980299  
-0.4425616587  
-0.5196552293  
-0.5755552983  
-0.6146835866  
-0.6417227984  
-0.6603705448  
-0.6723773519  
-0.6770861465  
-0.6715712538  
-0.6513954817  
-0.6118376253  
-0.5493727746  
-0.4630988643  
-0.3558017702  
-0.234398191  
-0.1095882019  
0.005294986609  
0.09611518091  
0.1501689394  
0.1584653366  
0.1176388043  
0.03114621137  
-0.09053844322  
-0.2308139372  
-0.3688748345  
-0.48239629  
-0.5506153661  
-0.5573260997  
-0.4933360878  
-0.358011083  
-0.1596488301  
0.08535556399  
0.3544356336  
0.6215863491  
0.8604919834  
1.04762589  
1.164909763  
1.201614225  
1.155294351  
1.031743362  
0.8440008524  
0.6106446109  
0.3535807028  
0.09563836171  
-0.1417954808  
-0.3408523182  
-0.4887957842  
-0.5790501153  
-0.6115745274  
-0.592550602  
-0.5334477713  
-0.4495288318  
-0.3579608896  
-0.275711529  
-0.2174707512  
-0.193835034  
-0.209989208  
-0.2650702446  
-0.3523149919  
-0.4599879215  
-0.5729889433  
-0.674916823  
-0.7502996752  
-0.7866860795  
-0.7762809711  
-0.7169069516  
-0.6121625992  
-0.4707800893  
-0.3053124536  
-0.1303816164  
0.03922556393  
0.1903133741  
0.3126321821  
0.3996609758  
0.4487586354  
0.460751376  
0.4390865521  
0.3887869303  
0.3154203052  
0.2242820962  
0.119930038  
0.006106111374  
-0.114011348  
-0.2373241246  
-0.3602944456  
-0.4785481565  
-0.5867316035  
-0.6787069922  
-0.7480737197  
-0.7889283329  
-0.7967212972  
-0.7690356543  
-0.706115222  
-0.6110235116  
-0.489366936  
-0.3486166643  
-0.1971161642  
-0.04295826896  
0.1070789065  
0.2483443797  
0.3787206969  
0.4985397817  
0.6100139704  
0.7162902631  
0.8202954172  
0.9236075765  
1.025583736  
1.122941163  
1.209920392  
1.279025721  
1.322254407  
1.332605682  
1.305577856  
1.240386346  
1.140623982  
1.014215055  
0.8726285691  
0.7294444632  
0.5985037116  
0.4919422636  
0.4184494875  
0.3820395825  
0.3815427079  
0.4108984493  
0.4601906119  
0.517228932  
0.5694141194  
0.6055628655  
0.6174048479  
0.6005218972  
0.5546118401  
0.4830757461  
0.3920495059  
0.2890774721  
0.1816862356  
0.07610471934  
-0.02364774561  
-0.1161892409  
-0.2026682829  
-0.2861857359  
-0.3708842156  
-0.4608959832  
-0.5593393848  
-0.6675431176  
-0.7846252806  
-0.9074770572  
-1.031123387  
-1.149395408  
-1.255776421  
-1.344281247  
-1.410240662  
-1.45087566  
-1.465599751  
-1.456016798  
-1.425643627  
-1.379397794  
-1.322933519  
-1.261906882  
-1.201265535  
-1.144649693  
-1.093979731  
-1.04928235  
-1.008785833  
-0.9692825796  
-0.9267184299  
-0.8769329463  
-0.8164474711  
-0.7431801538  
-0.6569614811  
-0.559757006  
-0.4555292663  
-0.3497372613  
-0.2485423844  
-0.1578304715  
-0.08222388647  
-0.02425056144  
0.01615736932  
0.04173919513  
0.05750426929  
0.06991338476  
0.08575654947  
0.1109183165  
0.149245511  
0.201715795  
0.2660618596  
0.3369544489  
0.4067172  
0.4664835518  
0.5076286911  
0.5232339925  
0.5093573733  
0.4658788778  
0.3967869819  
0.3098219667  
0.2155291248  
0.1258518342  
0.05247672998  
0.00519405358  
-0.009468214616  
0.01086533002  
0.06415227066  
0.1443314082  
0.242288701  
0.3472563502  
0.4483990684  
0.5363421442  
0.6044056019  
0.6493679565  
0.6716683301  
0.6750329211  
0.6656208314  
0.6508512588  
0.6380908657  
0.6334289746  
0.6407086058  
0.6609434655  
0.6921782337  
0.7297920728  
0.7671477006  
0.7964849318  
0.809907003  
0.8003390866  
0.7623463349  
0.6927635234  
0.5910877768  
0.4596625665  
0.3036481288  
0.1308119486  
-0.04888123023  
-0.2238620861  
-0.3817612643  
-0.5103990766  
-0.5989315315  
-0.6390532212  
-0.6261262674  
-0.5600667397  
-0.4458135296  
-0.2932457354  
-0.1164620079  
0.06754489011  
0.2407079558  
0.385977211  
0.4893927788  
0.5418508308  
0.540265397  
0.4879503345  
0.3941270143  
0.2726320964  
0.1399782977  
0.01308616482  
-0.09299916952  
-0.1670658579  
-0.2030878599  
-0.2007937829  
-0.165398399  
-0.1065905337  
-0.03694574591  
0.02995634963  
0.08141888174  
0.1072536234  
0.100933843  
0.06015627433  
-0.01320053257  
-0.1136512749  
-0.2330738033  
-0.3618742505  
-0.4901885185  
-0.608938284  
-0.7106408148  
-0.7899121578  
-0.843656316  
-0.8709967875  
-0.8730071006  
-0.852332601  
-0.8127781746  
-0.7589160161  
-0.6957425471  
-0.6283967365  
-0.5619124308  
-0.5009847805  
-0.4497267927  
-0.4113879582  
-0.3880639189  
-0.3804046347  
-0.3873856142  
-0.4061954659  
-0.4323010425  
-0.4597378816  
-0.481628898  
-0.490925574  
-0.4812794743  
-0.4479680647  
-0.3887197047  
-0.3043199538  
-0.1988780338  
-0.079663541  
0.043500603  
0.1592508479  
0.2559946814  
0.3233587211  
0.3535721738  
0.3425887918  
0.2907743041  
0.2030273686  
0.08830957205  
-0.0413821928  
-0.1724635184  
-0.2914376484  
-0.3865585775  
-0.4492507934  
-0.4750666152  
-0.4640681578  
-0.4205688625  
-0.3522836361  
-0.2690413625  
-0.1812395795  
-0.09830469909  
-0.02736865116  
0.02763323681  
0.06632615186  
0.09169568095  
0.1093696108  
0.1265288877  
0.1506164981  
0.1880732076  
0.2432644732  
0.3177689888  
0.4101061908  
0.515915053  
0.6285337096  
0.7398663671  
0.8413985985  
0.9252194611  
0.9849017681  
1.016157078  
1.017204249  
0.9888388249  
0.934244638  
0.8585867094  
0.7684703935  
0.6713249806  
0.5747819472  
0.4860860317  
0.4115784801  
0.3562535217  
0.3234208939  
0.3144522465  
0.3286424746  
0.3631691515  
0.4131811605  
0.4720200511  
0.531589471  
0.5828659364  
0.6165636226  
0.6239034659  
0.5974542487  
0.53196939  
0.4251285066  
0.2780919121  
0.09577017633  
-0.113267553  
-0.3372929377  
-0.5623153675  
-0.7733272925  
-0.9557723394  
-1.097094737  
-1.188172365  
-1.224440722  
-1.206542201  
-1.140388154  
-1.036575956  
-0.9092117163  
-0.774264466  
-0.6476558224  
-0.5433275332  
-0.4715591722  
-0.4377684716  
-0.4419583714  
-0.478905136  
-0.5390440238  
-0.6099307643  
-0.6780613304  
-0.73078875  
-0.7580507706  
-0.7536720673  
-0.7160704107  
-0.6482744654  
-0.5572867879  
-0.4529063465  
-0.3462082845  
-0.2479266331  
-0.1669795427  
-0.1093629481  
-0.07755346409  
-0.07049071301  
-0.08410202023  
-0.1122512254  
-0.1479283166  
-0.1844654423  
-0.2165558738  
-0.2409219753  
-0.2565184543  
-0.2642725761  
-0.2664151183  
-0.2655765289  
-0.2638154115  
-0.2618021531  
-0.2583218158  
-0.2502039938  
-0.2327158659  
-0.200342926  
-0.1478204794  
-0.07121639352  
0.03114062397  
0.1580663061  
0.3053739683  
0.4662133079  
0.6318176913  
0.7925492386  
0.939031007  
1.063197517  
1.159077473  
1.223217974  
1.254710612  
1.254880633  
1.226730641  
1.174298903  
1.102051928  
1.014447779  
0.9156890653  
0.8096853927  
0.7001436269  
0.5907039972  
0.4850090212  
0.3866390188  
0.2988822462  
0.2243588333  
0.164578508  
0.1195371856  
0.08746486014  
0.06483278065  
0.04664733668  
0.02704321306  
7.785831541e-05  
-0.0393763437  
-0.09480054975  
-0.1674236793  
-0.2559318684  
-0.3565763446  
-0.4636556317  
-0.5703102786  
-0.6694840143  
-0.7549110218  
-0.8219585992  
-0.8682046409  
-0.8936636055  
-0.9006389216  
-0.8932409091  
-0.8766571279  
-0.8562919693  
-0.8369025533  
-0.8218731952  
-0.8127067168  
-0.8088187609  
-0.8076464608  
-0.8050570965  
-0.7960008041  
-0.7753170444  
-0.7385920948  
-0.6829504262  
-0.6076688142  
-0.5145224103  
-0.4077933983  
-0.2939270232  
-0.1808398311  
-0.07696467552  
0.009870997842  
0.07357767194  
0.1107945875  
0.1215786367  
0.1096662034  
0.0822343221  
0.04915173932  
0.02178717585  
0.01151723971  
0.02812729714  
0.07831627383  
0.1645453647  
0.2843965606  
0.4305542808  
0.5914568623  
0.7525271578  
0.8978591151  
1.012131755  
1.082513756  
1.10029999  
1.062091455  
0.9703463438  
0.8332479925  
0.6639057977  
0.4789803523  
0.29690705  
0.1359220993  
0.01211614396  
-0.06226597933  
-0.08009653036  
-0.04008025579  
0.05315383555  
0.1895798218  
0.3548474133  
0.5317838626  
0.7021598365  
0.8485351361  
0.9560152143  
1.013728783  
1.015916918  
0.9625031865  
0.8591068554  
0.7164692495  
0.5493488132  
0.3749560554  
0.2110866643  
0.07411842792  
-0.02289782444  
-0.07183327779  
-0.070548215  
-0.02327903446  
0.05975873784  
0.1635150852  
0.2698873102  
0.3599257873  
0.4161624916  
0.424757312  
0.3771697512  
0.2711245392  
0.1107583461  
-0.09404514541  
-0.329015446  
-0.5773211646  
-0.8215866351  
-1.045814076  
-1.236953182  
-1.385958816  
-1.488245282  
-1.543574002  
-1.555463734  
-1.53029944  
-1.476297747  
-1.40251027  
-1.317949466  
-1.230933165  
-1.148614123  
-1.076690098  
-1.019219147  
-0.9784954391  
-0.9549643017  
-0.9471712302  
-0.9518007204  
-0.9638361299  
-0.9769092468  
-0.9838688075  
-0.9775445305  
-0.951662372  
-0.9017969589  
-0.8262086021  
-0.7264414565  
-0.6075329567  
-0.4777490897  
-0.3478339596  
-0.2298201684  
-0.1355407843  
-0.07500070893  
-0.05486490265  
-0.0772464178  
-0.1390073737  
-0.2316954668  
-0.3421649733  
-0.4538444443  
-0.5485208896  
-0.6084448625  
-0.6184900363  
-0.5681040312  
-0.4527918228  
-0.2749187827  
-0.04370715314  
0.2255977296  
0.5133222369  
0.7975310996  
1.056496459  
1.271173134  
1.427326197  
1.517046946  
1.539437947  
1.500371919  
1.411348054  
1.287628244  
1.145905089  
1.001858915  
0.8679550263  
0.7518285485  
0.6554817635  
0.5754270816  
0.5037352922  
0.4298374314  
0.3427818011  
0.2336002386  
0.09740659273  
-0.06510978135  
-0.2470364102  
-0.4355452588  
-0.6131582467  
-0.7597759373  
-0.8552201199  
-0.8819325236  
-0.8274536777  
-0.6863470028  
-0.4612962734  
-0.1632248345  
0.1895779991  
0.5732092555  
0.9605537803  
1.324011286  
1.638214438  
1.882397196  
2.04214213  
2.11034105  
2.087310426  
1.980108311  
1.801223721  
1.566852088  
1.29500727  
1.003719808  
0.7095118035  
0.4262905117  
0.1647092107  
-0.06800559487  
-0.2678447149  
-0.433526708  
-0.5658555005  
-0.6670425912  
-0.7400947222  
-0.7883262451  
-0.8150199471  
-0.8232362837  
-0.8157401119  
-0.7950001117  
-0.7632171599  
-0.7223473064  
-0.674095361  
-0.6198731294  
-0.5607338014  
-0.4973018746  
-0.4297149622  
-0.3576176954  
-0.2802030288  
-0.1963377217  
-0.1047545061  
-0.004318158027  
0.1056646929  
0.22510689  
0.352825527  
0.4862840096  
0.6214575209  
0.7528606339  
0.8737736214  
0.9766993432  
1.053996761  
1.09868049  
1.105269424  
1.070573591  
0.9943163857  
0.8794528287  
0.7321283794  
0.5612391966  
0.3776281465  
0.193010845  
0.01877633127  
-0.1351787086  
-0.2614172003  
-0.3555977569  
-0.4167164572  
-0.4469348226  
-0.45105922  
-0.4357737599  
-0.408762151  
-0.3778490633  
-0.3502659185  
-0.3320990661  
-0.3279471259  
-0.3407585438  
-0.3718065425  
-0.420756488  
-0.4857951594  
-0.5638068125  
-0.6506102122  
-0.7412854667  
-0.8306011454  
-0.9135516269  
-0.9859557128  
-1.045063281  
-1.09005455  
-1.12234389  
-1.145571621  
-1.165262907  
-1.188122243  
-1.221061222  
-1.270061052  
-1.33904982  
-1.428965781  
-1.537182405  
-1.657400327  
-1.780067024  
-1.893299313  
-1.984195491  
-2.040383324  
-2.051582323  
-2.010986657  
-1.916257222  
-1.770003807  
-1.579672524  
-1.356863416  
-1.116147956  
-0.8735556518  
-0.6448924815  
-0.4441064001  
-0.2818783797  
-0.1645828732  
-0.09371112071  
-0.06580309644  
-0.07286050239  
-0.1031902719  
-0.1425857065  
-0.1757274394  
-0.1877144168  
-0.1655745991  
-0.09966555439  
0.01516898643  
0.1787880576  
0.3853980679  
0.6237306379  
0.8777958179  
1.12819801  
1.353943035  
1.534569794  
1.652401214  
1.694658209  
1.655149062  
1.535304092  
1.344385623  
1.098781924  
0.8204530199  
0.5346664051  
0.2673156544  
0.04212259676  
-0.1219086959  
-0.2124723667  
-0.2251315828  
-0.1635360712  
-0.03866998668  
0.1327619548  
0.3305926752  
0.5338022109  
0.7231443195  
0.8834552484  
1.005363222  
1.086183785  
1.129898691  
1.146233236  
1.148958482  
1.153640873  
1.175156437  
1.22528591  
1.31074008  
1.43187707  
1.582308695  
1.749470723  
1.916081729  
2.062322802  
2.168433196  
2.217375857  
2.19719542  
2.102741479  
1.936511156  
1.708488425  
1.435016737  
1.136867639  
0.8367866321  
0.5568701587  
0.3161463886  
0.1286686576  
0.002366724202  
-0.06125421574  
-0.06658236926  
-0.02270662968  
0.05820331169  
0.1626524803  
0.277424259  
0.390808279  
0.493303919  
0.5777806599  
0.6391517657  
0.6737431172  
0.6785401897  
0.650573488  
0.5865804802  
0.4830993142  
0.3369862007  
0.1462855469  
-0.08872203627  
-0.3645233007  
-0.6736703967  
-1.004590927  
-1.342040989  
-1.668235908  
-1.964567897  
-2.213698209  
-2.401732508  
-2.520161459  
-2.567229736  
-2.54850899  
-2.476527432  
-2.369471064  
-2.249100194  
-2.13815791  
-2.057604615  
-2.024065112  
-2.047815253  
-2.131576388  
-2.270245593  
-2.451577017  
-2.657690819  
-2.867181372  
-3.057544426  
-3.207602224  
-3.299637001  
-3.320980091  
-3.264903023  
-3.130724038  
-2.923162984  
-2.651043025  
-2.325551793  
-1.958287879  
-1.559400944  
-1.136091634  
-0.691735412  
-0.2258001436  
0.2653609883  
0.7868962868  
1.343216252  
1.935436818  
2.558925681  
3.201381542  
3.841887029  
4.451235608  
4.993692144  
5.43011577  
5.722155803  
5.837008119  
5.752080697  
5.458859465  
4.965321126  
4.296408326  
3.492363926  
2.605019554  
1.692495083  
