2073.278245  
2115.265653  
2265.056741  
2567.703997  
1753.723502  
2628.511621  
27822.36262  
61402.17567  
42445.19137  
27830.95515  
20019.35862  
25984.18418  
3484.630014  
6929.186409  
19969.09663  
15727.50418  
15487.68197  
1539.906048  
2813.42929  
1749.419163  
10657.57253  
8132.87015  
14341.85442  
5650.055527  
30113.37251  
1164.146073  
5667.444001  
4842.744736  
11627.96849  
2744.878975  
3505.893216  
3316.074764  
336.0000798  
11323.4173  
2475.101653  
9876.544027  
2577.426281  
2844.958143  
1061.941203  
496.1435273  
1336.504472  
1849.813099  
596.1565849  
4079.584829  
2283.225675  
6747.588365  
1012.819513  
2009.163757  
604.004278  
310.000879  
6952.623977  
3133.305715  
3295.470614  
1975.471173  
4171.424379  
5917.766493  
2461.015157  
155.793051  
1525.100314  
4974.755838  
1537.038819  
2691.251539  
837.959287  
1082.554794  
887.6941581  
70.25470877  
1122.978781  
187.7772576  
614.5764227  
602.9922841  
484.4601179  
232.1108099  
185.9125293  
163.3743978  
128.7086753  
172.422986  
117.8499585  
120.7236878  
80.50004188  
73.24682723  
93.72505573  
59.96717561  
66.26318531  
59.72386831  
51.91062836  
48.71779856  
48.21569759  
42.68223851  
42.38021953  
38.14782611  
34.75196538  
32.33820471  
30.90747672  
29.49623132  
27.59399141  
26.09690211  
24.18918531  
23.39876641  
22.05860951  
20.91577193  
19.76894776  
18.79863158  
17.80457059  
17.13001184  
16.20408653  
15.46973778  
14.75977157  
14.12904163  
13.51208209  
12.94044574  
12.34570831  
11.84345962  
11.37491165  
10.89826608  
10.47316651  
10.04560716  
9.662464741  
9.285079086  
8.944360223  
8.605513583  
8.284833203  
7.983631564  
7.698256326  
7.425607778  
7.163615693  
6.913942152  
6.675409164  
6.451745154  
6.232008718  
6.027495011  
5.830685393  
5.640763107  
5.458978875  
5.286365104  
5.120330586  
4.961510396  
4.808592234  
4.662497258  
4.521831407  
4.386820141  
4.257168348  
4.132539965  
4.01282614  
3.897862601  
3.78704957  
3.680365497  
3.577813939  
3.478922414  
3.383713789  
3.291866765  
3.203333692  
3.118046244  
3.035779272  
2.956306344  
2.879648053  
2.80557795  
2.734058343  
2.665020126  
2.59822327  
2.533686281  
2.471251525  
2.41088944  
2.352456943  
2.295922639  
2.241247043  
2.188243405  
2.136965041  
2.087257478  
2.039085852  
1.992439085  
1.947236804  
1.903389002  
1.860827988  
1.819589792  
1.779573634  
1.740719752  
1.703005307  
1.666375703  
1.630867962  
1.596326433  
1.562744677  
1.530207943  
1.498523523  
1.467726264  
1.437773002  
1.408707527  
1.38038121  
1.352857838  
1.326082095  
1.300018047  
1.274628129  
1.249959193  
1.225892376  
1.202487311  
1.179693715  
1.157485007  
1.135851219  
1.114765755  
1.094232885  
1.074184328  
1.054664469  
1.035626372  
1.017082303  
0.9989694107  
0.9813365739  
0.9641106507  
0.9472971375  
0.9309004551  
0.9149034373  
0.8992601391  
0.8840114936  
0.8691291026  
0.8545974136  
0.8403846454  
0.826523906  
0.812949859  
0.799722459  
0.7867699876  
0.7741455452  
0.7617859038  
0.7496952564  
0.7378949962  
0.7263447207  
0.7150745649  
0.7040360719  
0.6932138477  
0.6826801856  
0.6723277064  
0.6622201304  
0.6523506857  
0.6426519448  
0.6331797224  
0.6238945878  
0.6148185827  
0.6059241233  
0.5972342886  
0.5887206711  
0.5803493333  
0.5721985504  
0.5641903284  
0.5563554822  
0.54865017  
0.5411333236  
0.5337474711  
0.5265205617  
0.5194260846  
0.5124920175  
0.5056755747  
0.4990032624  
0.4924583604  
0.4860506314  
0.4797316268  
0.4735688025  
0.4675222237  
0.4615772984  
0.4557596295  
0.4500437558  
0.4444388496  
0.4389396465  
0.4335493461  
0.4282372446  
0.4230541823  
0.4179488015  
0.4129483042  
0.4080203097  
0.4032219968  
0.3984713215  
0.393803793  
0.3892471904  
0.3847474405  
0.3803345366  
0.376029187  
0.3717590577  
0.3675931096  
0.3634894861  
0.3594489873  
0.3555008269  
0.3516255587  
0.3477821859  
0.3440255735  
0.3403434857  
0.3366965628  
0.3331507316  
0.3296239931  
0.3261755547  
0.3227907164  
0.3194793156  
0.3161990355  
0.3129801834  
0.3098232043  
0.3066969277  
0.3036290544  
0.3006276074  
0.2976579706  
0.2947499357  
0.2918965145  
0.289078483  
0.2863016445  
0.2835717259  
0.2808855278  
0.2782458471  
0.275653616  
0.2730947107  
0.2705754955  
0.2681010796  
0.2656652189  
0.2632643684  
0.2609049115  
0.2585878269  
0.25630342  
0.2540408098  
0.2518284758  
0.2496509471  
0.247499221  
0.2453998698  
0.2433112014  
0.2412685264  
0.2392460324  
0.2372610642  
0.2352956073  
0.233376339  
0.2314817252  
0.2296078713  
0.2277751144  
0.2259549447  
0.2241739826  
0.2224172896  
0.2206689192  
0.2189872884  
0.2172934654  
0.2156529052  
0.2140129419  
0.2124032218  
0.2108295518  
0.2092669771  
0.2077267383  
0.2062178683  
0.2047307554  
0.2032515439  
0.2018109597  
0.2003851969  
0.1989700922  
0.1975849137  
0.1962334151  
0.194880826  
0.1935622058  
0.1922546077  
0.1909646171  
0.1896956744  
0.1884497089  
0.1872105259  
0.1860028714  
0.1848022246  
0.1836284174  
0.1824586827  
0.1813255612  
0.1801876448  
0.1790732614  
0.1779788294  
0.1769035585  
0.1758462069  
0.1747860526  
0.1737609908  
0.1727328931  
0.171731414  
0.1707384031  
0.169765952  
0.1687955767  
0.1678523612  
0.166915698  
0.1659973728  
0.1650802908  
0.164190627  
0.1633162494  
0.1624393447  
0.1615827596  
0.1607361484  
0.1599007615  
0.1590845682  
0.1582834698  
0.1574827167  
0.1567051175  
0.1559208362  
0.1551644671  
0.1544078245  
0.1536682947  
0.1529419387  
0.1522244112  
0.1515232439  
0.1508167235  
0.1501367981  
0.1494482299  
0.1487849168  
0.1481248516  
0.1474924006  
0.1468465051  
0.1462235905  
0.1456043181  
0.1449914287  
0.1443897037  
0.1438032468  
0.1432224107  
0.1426494546  
0.1420836367  
0.1415288613  
0.1409835255  
0.1404486604  
0.1399195045  
0.1393981991  
0.1388860628  
0.1383796233  
0.1378888567  
0.1373936715  
0.1369156736  
0.1364427421  
0.1359825377  
0.1355233726  
0.1350769756  
0.1346300175  
0.1341954425  
0.1337733639  
0.1333511535  
0.1329429252  
0.1325284438  
0.1321398476  
0.1317436596  
0.1313620948  
0.1309818084  
0.1306164128  
0.130253055  
0.1299048012  
0.1295504928  
0.1292055269  
0.1288779971  
0.1285398132  
0.1282135382  
0.1278896722  
0.1275965965  
0.1272905298  
0.1269878653  
0.1266981097  
0.1264067416  
0.1261256903  
0.1258672966  
0.1255866495  
0.125324934  
0.1250696654  
0.1248283402  
0.1245800555  
0.1243432325  
0.1241144267  
0.1238838755  
0.1236637405  
0.1234519699  
0.1232438878  
0.1230434978  
0.1228476913  
0.1226583894  
0.1224636694  
0.1222806195  
0.1221042239  
0.1219376559  
0.1217772825  
0.1216238908  
0.1214650097  
0.1213251408  
0.121176195  
0.1210416112  
0.1209103837  
0.120778579  
0.1206617226  
0.1205425918  
0.1204316254  
0.120335499  
0.1202281025  
0.1201369398  
0.1200442765  
0.119964649  
0.1198757791  
0.119804275  
0.1197389027  
0.1196727821  
0.1196125934  
0.1195675995  
0.1195154377  
0.1194637597  
0.1194345226  
0.1194011436  
0.1193743982  
0.1193527833  
0.1193313654  
0.1193174863  
0.1193139386  
0.1193218906  
