134.8825533  
142.6988068  
157.3898368  
179.5464085  
626.9232004  
18968.43091  
93778.44703  
163587.4589  
60066.29284  
22941.66227  
52021.34906  
6218.2991  
8231.409648  
7183.217163  
8046.000319  
2633.916519  
22615.75138  
1449.064776  
770.9587365  
1546.135499  
3791.957714  
1630.889111  
2279.096662  
401.7828326  
376.7816116  
2337.486638  
642.7826009  
389.6535231  
463.2896582  
599.0701022  
240.5266931  
26.39125215  
94.49026074  
227.037518  
19.09761232  
66.93172278  
287.1660227  
42.78768027  
2.434432506  
674.1528993  
182.7896564  
33.44592738  
128.3583242  
449.6740236  
41.39913793  
0.6528126602  
46.27296519  
42.29227323  
128.7855477  
3.018224785  
92.90005423  
74.91485794  
51.52743735  
41.09820365  
23.29382996  
6.511889787  
41.87447742  
88.72686332  
33.32226035  
36.9786444  
1.942690424  
21.17912444  
0.7275369791  
11.03128542  
8.539855944  
21.39839449  
0.4334971647  
2.193755328  
1.682680613  
0.3739335397  
0.5345812416  
1.705333721  
0.8496943376  
3.005509345  
0.4289037924  
1.104128002  
2.042865085  
1.220496624  
1.462064773  
0.9692222454  
0.7197888627  
0.7779206698  
0.7842136092  
0.7114143737  
0.7848969186  
0.7733479679  
0.7464612602  
0.755467072  
0.7003334249  
0.6909223403  
0.6641848235  
0.655213676  
0.6222907409  
0.5959867756  
0.5793854154  
0.5637681842  
0.5484513616  
0.5460687763  
0.5263677252  
0.5094009378  
0.5018060177  
0.4860746482  
0.4763955878  
0.4644917933  
0.4536896425  
0.4444810681  
0.4336403765  
0.4241809741  
0.4147955275  
0.4059656684  
0.3969110596  
0.3886426512  
0.380883489  
0.3729785182  
0.3655556487  
0.3585305084  
0.3512960094  
0.3444565823  
0.3376121728  
0.3314380415  
0.3253728441  
0.319296668  
0.3135710688  
0.3078356819  
0.3024527173  
0.297087302  
0.2919525366  
0.2869709755  
0.2820223991  
0.2773475941  
0.2726886752  
0.2682549552  
0.2638632583  
0.2596299004  
0.2554801059  
0.2514633074  
0.2475334697  
0.2437019758  
0.2399895082  
0.2363581135  
0.2328118926  
0.2293550977  
0.2259868466  
0.2227068357  
0.2194903428  
0.2163590449  
0.2133005974  
0.2103112983  
0.2073995974  
0.2045427624  
0.2017566813  
0.1990293262  
0.1963690707  
0.1937636831  
0.1912148299  
0.1887250076  
0.1862888339  
0.1839035965  
0.1815732036  
0.1792870859  
0.1770481609  
0.1748632193  
0.1727189101  
0.1706183647  
0.168562409  
0.1665487187  
0.1645726771  
0.1626360365  
0.1607387553  
0.1588791187  
0.1570563704  
0.1552692942  
0.1535160258  
0.1518004235  
0.1501093699  
0.1484552295  
0.1468341451  
0.1452377053  
0.1436749758  
0.1421399166  
0.1406324288  
0.1391529792  
0.1377000871  
0.1362745414  
0.1348745829  
0.1334982141  
0.1321438837  
0.1308172845  
0.1295149793  
0.1282315762  
0.1269716026  
0.1257332415  
0.1245152161  
0.1233202294  
0.1221400275  
0.1209853029  
0.1198464927  
0.1187287464  
0.1176291436  
0.1165462475  
0.1154816477  
0.1144325176  
0.1134040924  
0.1123908345  
0.1113921638  
0.11040935  
0.1094432842  
0.1084916124  
0.1075542824  
0.1066363293  
0.1057272574  
0.1048341121  
0.1039536486  
0.1030891122  
0.1022351173  
0.1013933686  
0.1005669604  
0.0997521787  
0.09894809312  
0.09815858127  
0.09738051702  
0.09661017739  
0.09585471633  
0.09510962572  
0.09437501774  
0.09365066759  
0.09293447876  
0.09223295884  
0.09153929252  
0.09085809587  
0.09018224334  
0.0895184461  
0.08886310826  
0.08821680694  
0.08757965179  
0.08695248232  
0.08633147215  
0.08572184567  
0.08511668603  
0.08452427085  
0.08393845358  
0.08335816654  
0.08278953578  
0.08222487057  
0.08167101708  
0.08112131947  
0.08058024582  
0.08004822755  
0.07952272638  
0.07900268136  
0.07848799686  
0.07798428347  
0.07748326783  
0.07699148252  
0.07650486957  
0.07602541241  
0.07554941974  
0.07508163467  
0.07461759335  
0.07416164127  
0.07371253782  
0.07326667137  
0.0728279803  
0.07239408412  
0.07196661098  
0.07154230752  
0.07112347953  
0.07071304787  
0.0703034866  
0.06990125306  
0.06950646424  
0.06911165877  
0.0687226242  
0.06833989671  
0.06796162815  
0.06759094616  
0.06722063944  
0.0668555619  
0.06649626222  
0.066138434  
0.06578762219  
0.06544117934  
0.06509720839  
0.06475723248  
0.06442160772  
0.06409134284  
0.06376437675  
0.06344089407  
0.06311938085  
0.06280392709  
0.06249065929  
0.06218165821  
0.06187652296  
0.06157661841  
0.06127715343  
0.0609842128  
0.06069209909  
0.06040376411  
0.0601197189  
0.05983840546  
0.05956042453  
0.05928432645  
0.05901372131  
0.05874520155  
0.05847903029  
0.05821932323  
0.057959268  
0.05770157551  
0.05744788997  
0.0571981166  
0.05695137983  
0.05670492995  
0.05646137454  
0.05622414583  
0.05598772941  
0.05575383463  
0.05552009392  
0.0552912724  
0.05506636676  
0.05484121413  
0.05462069896  
0.05440320059  
0.05418591603  
0.05397275793  
0.05376054193  
0.05355175823  
0.05334412444  
0.05314104133  
0.05293743358  
0.05273704977  
0.05253867859  
0.05234517694  
0.05215023615  
0.05196181918  
0.05176988186  
0.05158408835  
0.05139924528  
0.05121599821  
0.05103494418  
0.05085558971  
0.05068082991  
0.05050507791  
0.05033246906  
0.05016173166  
0.04999426446  
0.04982764273  
0.04966268145  
0.04949920649  
0.04933753985  
0.04917771712  
0.04901938575  
0.04886393291  
0.04870864203  
0.0485569498  
0.04840605181  
0.0482563483  
0.04811007089  
0.04796444833  
0.0478181977  
0.04767762933  
0.0475378022  
0.04739881754  
0.04725930868  
0.04712427366  
0.04698963247  
0.04685605382  
0.04672709457  
0.04659561297  
0.04646812704  
0.0463408769  
0.04621542638  
0.0460931472  
0.04597060979  
0.04584880162  
0.04572827168  
0.04560897146  
0.04549391951  
0.0453783697  
0.04526432734  
0.04515209433  
0.04504054657  
0.04493142118  
0.04482068611  
0.04471524586  
0.04460968602  
0.04450533415  
0.04440206004  
0.04429917519  
0.04419873444  
0.04410004058  
0.04400249233  
0.04390398023  
0.04380925573  
0.04371556764  
0.04362241117  
0.04353041328  
0.04343884681  
0.04334719562  
0.04325875979  
0.04317283251  
0.04308607  
0.04300140666  
0.04291839017  
0.04283429289  
0.0427522194  
0.04267333825  
0.04259393552  
0.04251402332  
0.04243714353  
0.04236151452  
0.04228613076  
0.04221272411  
0.04214068668  
0.04206676077  
0.04199672851  
0.04192664115  
0.0418584097  
0.04178963303  
0.04172320237  
0.04165700486  
0.04159318776  
0.0415297107  
0.04146684557  
0.04140598601  
0.04134550123  
0.04128616318  
0.04122788958  
0.0411682533  
0.04111288959  
0.041056792  
0.04100111024  
0.04094897213  
0.04089639258  
0.04084414914  
0.04079235922  
0.04074284128  
0.04069437819  
0.04064518646  
0.04059748508  
0.04055097092  
0.0405070007  
0.04046355213  
0.04041995413  
0.04037651545  
0.04033429742  
0.0402931131  
0.04025402153  
0.04021491562  
0.04017625709  
0.0401403518  
0.04010480458  
0.04006665568  
0.04003291585  
0.04000083457  
0.03996623752  
0.03993469858  
0.03990415044  
0.03987290953  
0.03984351135  
0.03981540686  
0.03978658918  
0.03976051981  
0.03973551986  
0.03971014506  
0.03968414895  
0.03966155375  
0.03963906791  
0.03961664295  
0.03959580539  
0.03957458153  
0.03955530359  
0.03953785848  
0.03951933682  
0.039503478  
0.03948857345  
0.03947186661  
0.03945745743  
0.03944435219  
0.03943258128  
0.03942033018  
0.03940803878  
0.03939800134  
0.0393905077  
0.03938051633  
0.03937370484  
0.03936675257  
0.03935882109  
0.03935535789  
0.03935053293  
0.03934561971  
0.03934340318  
0.03934153001  
0.03934013011  
0.03934027302  
