-0.1747915833  
-0.02322512394  
0.1282125217  
0.2759681189  
0.4161441646  
0.5446250556  
0.6572927412  
0.7503241313  
0.8205488333  
0.8658231576  
0.8853707438  
0.8800337168  
0.8523800263  
0.806633952  
0.7484150755  
0.68429621  
0.6212183421  
0.5658228844  
0.5237803682  
0.4991897948  
0.4941322749  
0.5084360241  
0.5396896802  
0.5835130189  
0.6340569881  
0.6846754001  
0.7286931395  
0.7601689461  
0.7745639471  
0.7692317484  
0.7436731844  
0.6995281773  
0.6403205639  
0.5709894001  
0.4972826163  
0.4250868712  
0.3597797726  
0.305678037  
0.2656372345  
0.2408363191  
0.2307546768  
0.2333294429  
0.2452583644  
0.2624081507  
0.2802745906  
0.29445069  
0.301056315  
0.2970950159  
0.2807119862  
0.2513382955  
0.2097122997  
0.1577845307  
0.09851212789  
0.03556345323  
-0.02704266334  
-0.08533637676  
-0.1357963442  
-0.1757165308  
-0.2035026545  
-0.2188654131  
-0.2228858773  
-0.2179384728  
-0.2074731528  
-0.1956701584  
-0.1870004649  
-0.1857358916  
-0.1954582381  
-0.21862156  
-0.2562140813  
-0.3075571438  
-0.3702642857  
-0.4403655351  
-0.5125903205  
-0.5807814407  
-0.638411529  
-0.6791549641  
-0.6974758178  
-0.6891842432  
-0.6519167836  
-0.5854993046  
-0.4921505538  
-0.3765016756  
-0.2454013779  
-0.107509899  
0.02731266818  
0.148778447  
0.2470531224  
0.3136594493  
0.3423168584  
0.3296206358  
0.2754766863  
0.1832305851  
0.05945921645  
-0.08656742086  
-0.2437093155  
-0.3999787038  
-0.5436586141  
-0.6643903316  
-0.7541115972  
-0.8077403488  
-0.8235300627  
-0.8030639049  
-0.7508958858  
-0.673898077  
-0.5803982519  
-0.4792264197  
-0.3787863443  
-0.2862626931  
-0.2070460778  
-0.1444242505  
-0.09954287549  
-0.07161017  
-0.05827853333  
-0.05613215344  
-0.06119731714  
-0.06940747165  
-0.07697688315  
-0.08065410052  
-0.07786564935  
-0.06676561258  
-0.04623299847  
-0.01584822869  
0.02411929696  
0.07270394309  
0.128219993  
0.188248582  
0.2496620825  
0.3087246053  
0.3612880783  
0.4030907255  
0.4301447961  
0.4391753839  
0.4280551686  
0.396180095  
0.3447198976  
0.2767012368  
0.1968967183  
0.111516132  
0.02772413254  
-0.04697349446  
-0.1054163254  
-0.1414861307  
-0.1507427103  
-0.1309402951  
-0.08236424064  
-0.007939352873  
0.08692219697  
0.1947535185  
0.3067359492  
0.41363091  
0.5068647369  
0.5796492245  
0.6279922916  
0.651438023  
0.6533784562  
0.6408185545  
0.623536105  
0.6126725787  
0.6188843949  
0.6502901374  
0.7105190618  
0.7972062025  
0.9012543456  
1.007105511  
1.094131131  
1.139072915  
1.119282043  
1.016337935  
0.8195106999  
0.5284912499  
0.1548780051  
-0.2779475707  
-0.7366836027  
-1.18157303  
-1.571050188  
-1.866940433  
-2.039452557  
-2.071203715  
-1.959648881  
-1.717524901  
-1.371230491  
-0.9573891136  
-0.5181213266  
-0.09574732689  
0.272304649  
0.5576650587  
0.7437313431  
0.8266388232  
0.8144851396  
0.7250748351  
0.5826224434  
0.4139795206  
0.244947529  
0.09717105817  
-0.01403364302  
-0.08073748553  
-0.1023383085  
-0.08454039975  
-0.03763537729  
0.02558403572  
0.09194840426  
0.1497750335  
0.1902626734  
0.2082870403  
0.2025774065  
0.1753357491  
0.1314241099  
0.07729340678  
0.01982990467  
-0.03470966928  
-0.08154198426  
-0.1178890905  
-0.1431646356  
-0.158827739  
-0.1679588238  
-0.174648087  
-0.1832917326  
-0.197908366  
-0.2215590382  
-0.2559446202  
-0.3012195371  
-0.3560265072  
-0.4177348443  
-0.4828270627  
-0.547374005  
-0.6075225735  
-0.6599315062  
-0.7021017093  
-0.7325655705  
-0.750928204  
-0.7577685074  
-0.7544343222  
-0.7427704428  
-0.7248334961  
-0.7026276408  
-0.6779080989  
-0.6520599786  
-0.6260625712  
-0.6005190128  
-0.5757302292  
-0.5517837866  
-0.5286332957  
-0.5061494526  
-0.4841420999  
-0.4623548698  
-0.4404491718  
-0.4179914791  
-0.3944604366  
-0.3692807171  
-0.3418849637  
-0.3117960111  
-0.2787136832  
-0.2425902898  
-0.2036747432  
-0.1625139096  
-0.1199063745  
-0.07680810844  
-0.03420384731  
0.007037092974  
0.04630225045  
0.08334707636  
0.1183574642  
0.1519464311  
0.1850759617  
0.2189078902  
0.2545962365  
0.2930493914  
0.3346996299  
0.379321325  
0.4259406957  
0.4728670726  
0.5178623455  
0.5584408402  
0.5922713179  
0.6176293469  
0.6338341361  
0.6415915425  
0.6431725641  
0.6423605604  
0.6441293433  
0.6540529397  
0.6774852656  
0.7186014586  
0.7794396192  
0.8591042103  
0.9533097689  
1.054406818  
1.151983024  
1.234034796  
1.288607789  
1.305693616  
1.279094119  
1.207924926  
1.097451769  
0.9590279689  
0.8090401278  
0.6669298226  
0.5525267739  
0.483078683  
0.4704463015  
0.5189404936  
0.6242123363  
0.7734485655  
0.9469197504  
1.120699829  
1.270164302  
1.373717695  
1.416140844  
1.390982972  
1.301566436  
1.160395875  
0.9870250343  
0.8047044889  
0.6363445642  
0.5004593476  
0.4077805812  
0.3591276006  
0.3449309224  
0.3465356506  
0.3391264057  
0.2958366546  
0.1924087205  
0.01165738619  
-0.2529915365  
-0.5954913652  
-0.9970598171  
-1.428038387  
-1.851488201  
-2.228007391  
-2.521062394  
-2.70203053  
-2.754206108  
-2.675170123  
-2.477191135  
-2.185609628  
-1.835475436  
-1.466946782  
-1.120132788  
-0.8301174341  
-0.6228528334  
-0.512455532  
-0.5002206623  
-0.5754093363  
-0.7176061828  
-0.9002339682  
-1.094661533  
-1.274288536  
-1.418019886  
-1.512671165  
-1.554021189  
-1.546443043  
-1.501264566  
-1.4341812  
-1.362168822  
-1.300397175  
-1.259608549  
-1.244338946  
-1.25221329  
-1.274375997  
-1.296944724  
-1.303240375  
-1.276432397  
-1.202204687  
-1.071053838  
-0.879909369  
-0.6328664579  
-0.3409701946  
-0.02111002267  
0.3057854806  
0.6170002758  
0.8904166837  
1.106756782  
1.25142626  
1.315791487  
1.297801363  
1.201951154  
1.038648012  
0.8231000047  
0.5738713403  
0.3112592798  
0.05564675027  
-0.1740425569  
-0.3616717759  
-0.4949219665  
-0.565972515  
-0.5718024934  
-0.5141162481  
-0.3989215104  
-0.2358111421  
-0.037027448  
0.1836032876  
0.411767963  
0.6337047472  
0.8371075023  
1.011843062  
1.150457536  
1.248473623  
1.304488929  
1.320103247  
1.299685303  
1.249995612  
1.17965586  
1.098473522  
1.016628028  
0.9437523337  
0.8879750594  
0.8550157897  
0.8474556996  
0.8642995726  
0.9009381715  
0.949574704  
1.000113046  
1.041443223  
1.062976641  
1.056232178  
1.016245559  
0.9425689509  
0.83968387  
0.7167056537  
0.586384069  
0.4634889993  
0.3627912813  
0.2969201968  
0.2744192689  
0.2983137358  
0.3654465147  
0.4667310968  
0.5883397096  
0.7136960872  
0.8259997522  
0.9109144823  
0.9589941812  
0.9674364593  
0.940828158  
0.890692606  
0.8338161136  
0.7895334374  
0.7763245372  
0.8082158665  
0.8915506747  
1.022677146  
1.187012333  
1.359754878  
1.508296603  
1.596114052  
1.587677582  
1.45372855  
1.176156201  
0.7517246002  
0.1940170428  
-0.4667990482  
-1.186476032  
-1.911210937  
-2.583629015  
-3.149424668  
-3.563746834  
-3.796432969  
-3.835373174  
-3.687554327  
-3.377696658  
-2.944736243  
-2.436724555  
-1.904911097  
-1.397850304  
-0.9563142055  
-0.6096099949  
-0.3736499771  
-0.2508396185  
-0.2315766043  
-0.2969633554  
-0.4222086499  
-0.580175954  
-0.7446004071  
-0.8926224179  
-1.006447705  
-1.074110743  
-1.089452311  
-1.051515332  
-0.9636002052  
-0.8322054925  
-0.6660240225  
-0.4750883133  
-0.2700878468  
-0.06182080276  
0.1392793926  
0.323605229  
0.4828483122  
0.6104729673  
0.7021419958  
0.7560146986  
0.7728456679  
0.7558270685  
0.7101640887  
0.6424215468  
0.55971896  
0.4688949691  
0.3757657696  
0.2845914095  
0.1978358727  
0.1162526869  
0.03927189745  
-0.03438416711  
-0.1059768027  
-0.1760531661  
-0.2439132268  
-0.3073497131  
-0.3627243683  
-0.4053870886  
-0.430380185  
-0.4333151635  
-0.411277205  
-0.3635882397  
-0.2922800762  
-0.202166548  
-0.1004666306  
0.0039951428  
0.1019003403  
0.1847005655  
0.2458177413  
0.2815830076  
0.2917331775  
0.2793730969  
0.2503864847  
0.2123926992  
0.1734200684  
0.1405295008  
0.1186350533  
0.109733198  
0.1126880892  
0.1236094288  
0.1367580451  
0.1458105571  
0.1452489237  
0.1316141053  
0.1043864688  
0.06632921686  
0.02321778295  
-0.01700218703  
-0.04549373134  
-0.05402754089  
-0.03646036454  
0.01005554279  
0.08432580273  
0.1809543644  
0.2908095239  
0.4020503617  
0.5015863647  
0.5767615989  
0.6170426503  
0.6154766648  
0.5697201372  
0.4824953415  
0.3614020269  
0.218100469  
0.06695906302  
-0.0766639042  
-0.1982796095  
-0.2860296687  
-0.3321017108  
-0.3336100916  
-0.2928105503  
-0.216621472  
-0.1155188188  
-0.001973753588  
0.1113338188  
0.2132504934  
0.2955688072  
0.353920133  
0.3880098621  
0.4011823487  
0.3994042538  
0.3898601914  
0.3794182532  
0.3732345564  
0.3737619017  
0.3803319695  
0.3894025553  
0.3954251763  
0.3921800493  
0.3743345915  
0.3389270482  
0.286475879  
0.2214754296  
0.1521294317  
0.08930831509  
0.04486160918  
0.02953263888  
0.05082394295  
0.1111777604  
0.2068256058  
0.3275473101  
0.4574600998  
0.5767802084  
0.6643444523  
0.7005445093  
0.6702447019  
0.5652383716  
0.3858541516  
0.1414425828  
-0.1503691925  
-0.4655743214  
-0.7765878815  
-1.055561812  
-1.27774558  
-1.424421853  
-1.485012705  
-1.458079455  
-1.351114392  
-1.179201268  
-0.9627716909  
-0.7248170021  
-0.4879541673  
-0.2717532856  
-0.09066105964  
0.04723921458  
0.14052362  
0.1938032779  
0.2163176402  
0.2199918214  
0.2172563196  
0.2189582545  
0.2326685059  
0.2616270926  
0.3044718054  
0.3557710048  
0.4072543734  
0.4495236708  
0.4739404676  
0.4743652555  
0.448439221  
0.3981842095  
0.3298091263  
0.2527542335  
0.1781314703  
0.1168301556  
0.07761540141  
0.06554779512  
0.08100185915  
0.1194628477  
0.1721451796  
0.2273459245  
0.2723168129  
0.2953580943  
0.2877900786  
0.2454832601  
0.1696916004  
0.06704091368  
-0.0513323969  
-0.1713759145  
-0.2781991656  
-0.3583218473  
-0.401737593  
-0.4034750512  
-0.3644044427  
-0.2911617077  
-0.1951919077  
-0.09105248103  
0.005769218334  
0.0811910248  
0.1246621634  
0.1307525094  
0.09995312381  
0.03855957923  
-0.04233716935  
-0.1285997463  
-0.205241392  
-0.2587266759  
-0.2790067893  
-0.260979729  
-0.2051615632  
-0.1174939292  
-0.008356211538  
0.1090283935  
0.2205122313  
0.3129621996  
0.3759213281  
0.4027698221  
0.3912501774  
0.3433336377  
0.2645031563  
0.1626122959  
0.04652381776  
-0.07524742861  
-0.1956901993  
-0.3100953226  
-0.4164170318  
-0.5151758787  
-0.6089639918  
-0.7016547869  
-0.7974601838  
-0.8999798441  
-1.011381829  
-1.131816223  
-1.259126649  
-1.388879419  
-1.514682297  
-1.62874215  
-1.722583536  
-1.787850261  
-1.817117591  
-1.804652006  
-1.747081799  
-1.643931824  
-1.498001786  
-1.315542342  
-1.106192221  
-0.8826264883  
-0.6598772713  
-0.4543137831  
-0.2823052312  
-0.1586488386  
-0.09489797014  
-0.09778333641  
-0.1679439731  
-0.2991866601  
-0.4784494128  
-0.6865709576  
-0.8998629672  
-1.092363243  
-1.23853102  
-1.31606801  
-1.308492412  
-1.207116538  
-1.012135173  
-0.7326602354  
-0.3856760279  
0.005946014019  
0.4160997101  
0.8183966455  
1.189007325  
1.509018487  
1.766009291  
1.954688265  
2.07657493  
2.138860498  
2.152689934  
2.131180352  
2.087495588  
2.033262744  
1.977518825  
1.92627255  
1.882646094  
1.847457638  
1.820048335  
1.799125193  
1.78342245  
1.772043127  
1.764432475  
1.76002496  
1.757696842  
1.755194967  
1.748744743  
1.732983079  
1.701322498  
1.646736319  
1.562875143  
1.445331991  
1.292829727  
1.108092963  
0.8982102181  
0.6743667773  
0.4509330252  
0.2440058113  
0.06958744532  
-0.05834176671  
-0.1295905131  
-0.1391119574  
-0.08776676735  
0.01760199203  
0.1647820876  
0.3373996169  
0.5165651157  
0.6827494517  
0.8176823856  
0.9060690095  
0.9369626603  
0.904677825  
0.809181254  
0.6559537265  
0.4553638139  
0.2216355737  
-0.0284810855  
-0.277207141  
-0.5072662269  
-0.7033226156  
-0.8532157507  
-0.9488956439  
-0.9870002531  
-0.9690336823  
-0.901138578  
-0.7934779556  
-0.6592675544  
-0.5135260048  
-0.3716413031  
-0.2478703923  
-0.1539194895  
-0.09776278994  
-0.08285550732  
-0.1078681898  
-0.1670202764  
-0.2510182394  
-0.3485136679  
-0.4479115286  
-0.5392827372  
-0.6160969103  
-0.6764827494  
-0.7237827177  
-0.7662478568  
-0.8158530227  
-0.8863518555  
-0.9908277725  
-1.139098104  
-1.335390684  
-1.576691619  
-1.852093717  
-2.143327874  
-2.426487141  
-2.674755415  
-2.861789552  
-2.96527482  
-2.970133782  
-2.870900057  
-2.672883761  
-2.391930649  
-2.052780572  
-1.686236856  
-1.325526167  
-1.002344034  
-0.7431194391  
-0.5659959018  
-0.4789195064  
-0.4790679862  
-0.5536660707  
-0.6820374416  
-0.8385831882  
-0.9962470062  
-1.129980908  
-1.219733111  
-1.252578347  
-1.223735386  
-1.136406901  
-1.000541415  
-0.8307748284  
-0.6439139224  
-0.4563678037  
-0.2819126191  
-0.1300967681  
-0.005473181837  
0.09229861092  
0.1675762869  
0.2272912611  
0.2792309536  
0.3303529483  
0.3854185349  
0.4461623698  
0.5111096472  
0.5760391723  
0.6349801901  
0.6815455988  
0.7103501405  
0.718255971  
0.7052237868  
0.674615707  
0.6328990429  
0.5887946266  
0.552023408  
0.5318653876  
0.535791301  
0.5684073968  
0.6309090807  
0.7211398192  
0.8342436387  
0.9637818223  
1.103091847  
1.246611328  
1.390885544  
1.53502772  
1.680501157  
1.83022691  
1.987150848  
2.152534826  
2.324314353  
2.495880126  
2.655608069  
2.787339554  
2.871864379  
2.88927329  
2.821881067  
2.657283915  
2.391061579  
2.028647377  
1.586003703  
1.088906822  
0.5708569597  
0.06984899883  
-0.3755899441  
-0.730576447  
-0.967707138  
-1.070067211  
-1.033043857  
-0.8647498974  
-0.5850565878  
-0.2234001678  
0.1843325867  
0.5994511237  
0.9842261263  
1.305379439  
1.536967271  
1.662417642  
1.675580304  
1.580750545  
1.391722433  
1.129999524  
0.8223577339  
0.4979977027  
0.1855531073  
-0.0897694582  
-0.3086471562  
-0.4594533258  
-0.5392363352  
-0.5537546656  
-0.5165437605  
-0.4471170781  
-0.3684854853  
-0.3042890455  
-0.2758780655  
-0.2997057827  
-0.385351144  
-0.5344165222  
-0.7404296244  
-0.9897418535  
-1.263284999  
-1.538937891  
-1.79417489  
-2.008648391  
-2.166372954  
-2.257251262  
-2.277787122  
-2.230942583  
-2.12523633  
-1.973269165  
-1.78994453  
-1.590670841  
-1.389823468  
-1.199657646  
-1.02978519  
-0.887199689  
-0.7767320065  
-0.7017406427  
-0.6647952401  
-0.6681297713  
-0.7136972062  
-0.8027569256  
-0.9350465476  
-1.107691125  
-1.31410532  
-1.543166419  
-1.778931074  
-2.001086154  
-2.186211335  
-2.309786296  
-2.348735559  
-2.284201121  
-2.104160626  
-1.805519259  
-1.395350103  
-0.8910655584  
-0.3194345483  
0.2854983102  
0.8854022066  
1.441255651  
1.917168372  
2.28401583  
2.522465052  
2.625030896  
2.596884683  
2.455270043  
2.227546817  
1.948043839  
1.654084804  
1.381657137  
1.161285444  
1.014649126  
0.9524009068  
0.9734799658  
1.065996297  
1.209529826  
1.378478256  
