0.2680881005  
-0.1939763914  
-0.6122592708  
-0.9532466601  
-1.191068531  
-1.309992182  
-1.30591506  
-1.186680805  
-0.9711103434  
-0.6867966157  
-0.3668610548  
-0.0460040685  
0.2436766225  
0.4765532533  
0.6364759147  
0.7184743593  
0.7288603475  
0.6836913291  
0.6057950358  
0.5208226946  
0.4529357477  
0.4208436466  
0.4348352752  
0.4952903363  
0.5929232554  
0.7106758425  
0.8269336753  
0.9194701983  
0.9694373615  
0.9646855211  
0.9018572837  
0.7868935029  
0.6338866057  
0.4625252738  
0.2945610301  
0.1499864632  
0.04354455402  
-0.01776885114  
-0.03581753427  
-0.02085499356  
0.01043541262  
0.03801929605  
0.04216916602  
0.007074467431  
-0.07624853177  
-0.2082046785  
-0.3803516947  
-0.5766244878  
-0.7758439628  
-0.9550955926  
-1.093394206  
-1.175076241  
-1.192347686  
-1.146632354  
-1.048516935  
-0.9163235158  
-0.7735664502  
-0.6456578489  
-0.5563828997  
-0.5246222047  
-0.561748319  
-0.6700350435  
-0.8422279494  
-1.062289102  
-1.307158635  
-1.549328633  
-1.759849189  
-1.911481868  
-1.981635334  
-1.954801102  
-1.824264159  
-1.592913909  
-1.273091227  
-0.8854674114  
-0.4570455679  
-0.01848579239  
0.3990048067  
0.7668687044  
1.062127492  
1.269702655  
1.383812345  
1.408261191  
1.355560671  
1.244994004  
1.099843795  
0.9441958303  
0.7997299079  
0.6829745279  
0.6034047565  
0.5626399181  
0.5548749663  
0.5684140948  
0.5880889133  
0.598149181  
0.5851587083  
0.5404402828  
0.4616777239  
0.3534305826  
0.2264837891  
0.09615824541  
-0.02013885488  
-0.1056979018  
-0.1471992334  
-0.1368502922  
-0.07364467803  
0.03643290605  
0.1812801046  
0.3444631675  
0.5075997663  
0.652977804  
0.765964771  
0.8368792951  
0.8620517309  
0.8439479274  
0.790397839  
0.7130802813  
0.6255579832  
0.5411634906  
0.4710928048  
0.4229832043  
0.4001627907  
0.4016460314  
0.4228325377  
0.4567192676  
0.4953952305  
0.5315204214  
0.5595096034  
0.5762186531  
0.5810156365  
0.5752616334  
0.561313537  
0.5413078503  
0.5159853584  
0.4838457631  
0.4408669675  
0.380885302  
0.2966521392  
0.1814019966  
0.03067166056  
-0.1559507101  
-0.3735104919  
-0.6111117081  
-0.8522642255  
-1.076246572  
-1.260350694  
-1.38276213  
-1.425701987  
-1.378336164  
-1.239024921  
-1.016494324  
-0.729661543  
-0.4060551111  
-0.0789454488  
0.2164741118  
0.4473638273  
0.5873918433  
0.6201771234  
0.5415279805  
0.3601543997  
0.09674084691  
-0.218483234  
-0.5493302659  
-0.8579034358  
-1.1089305  
-1.273612862  
-1.332554773  
-1.277448435  
-1.111421454  
-0.8481106647  
-0.5097241093  
-0.1244005694  
0.2767387207  
0.6624735277  
1.004039943  
1.277142869  
1.463359045  
1.550929138  
1.535030342  
1.417629967  
1.207040028  
0.917248145  
0.5670665325  
0.1791077925  
-0.2214431165  
-0.6082649511  
-0.9555417479  
-1.239744407  
-1.441433874  
-1.54691139  
-1.549509535  
-1.450351401  
-1.25840425  
-0.9897929866  
-0.6663787655  
-0.3137839012  
0.04093684626  
0.3716668929  
0.6553791789  
0.8737914266  
1.014401595  
1.070812314  
1.042440402  
0.9337418586  
0.7531793887  
0.512136014  
0.2239728904  
-0.09668247495  
-0.4343899844  
-0.7731662424  
-1.096720648  
-1.388795481  
-1.633721328  
-1.817274532  
-1.927764481  
-1.957224635  
-1.902523397  
-1.766114288  
-1.556271378  
-1.286632127  
-0.9750184069  
-0.6416616457  
-0.3070143043  
0.01053798594  
0.2967253758  
0.5428900863  
0.7466814254  
0.9118440514  
1.04709834  
1.164293835  
1.276113329  
1.39366518  
1.524355964  
1.670339809  
1.82779034  
1.987090756  
2.133904898  
2.250982545  
2.320429434  
2.326149065  
2.25612281  
2.104261249  
1.871595226  
1.56667093  
1.205127658  
0.8084763003  
0.4022398219  
0.01363017211  
-0.330997692  
-0.6086547665  
-0.8019451023  
-0.9007644055  
-0.9032989166  
-0.8161913832  
-0.6538434251  
-0.4368964947  
-0.1900444346  
0.06060152809  
0.2903048861  
0.478324962  
0.6100475806  
0.6783821702  
0.6842117774  
0.6358674227  
0.5476827245  
0.4378393303  
0.3257853054  
0.2296036114  
0.1636776835  
0.1369628219  
0.1520799188  
0.2053047709  
0.2873985631  
0.3851043403  
0.4830387739  
0.5656913717  
0.6192468509  
0.6330106779  
0.6003137008  
0.5188622057  
0.3906164568  
0.2212878377  
0.01963711361  
-0.2033293572  
-0.4351511788  
-0.6626736756  
-0.8727755882  
-1.053133815  
-1.193036914  
-1.28429087  
-1.322151377  
-1.306195688  
-1.240958117  
-1.136167904  
-1.006413626  
-0.8701294405  
-0.7479025383  
-0.6602239891  
-0.6249145419  
-0.6545587163  
-0.7543511398  
-0.9206979537  
-1.140887326  
-1.393953064  
-1.652717385  
-1.886786223  
-2.066128725  
-2.164737435  
-2.163894655  
-2.054540271  
-1.838439909  
-1.528000854  
-1.144772977  
-0.7168936983  
-0.2758618883  
0.1468928884  
0.523175125  
0.8305223954  
1.053785339  
1.185673106  
1.2263415  
1.182229234  
1.064422797  
0.8869242912  
0.6650664428  
0.4143398852  
0.149692304  
-0.1147048056  
-0.3653781605  
-0.5893700194  
-0.7741658701  
-0.9079234536  
-0.9800868534  
-0.9823523438  
-0.909853773  
-0.7623067474  
-0.5448549089  
-0.2683318492  
0.05120875266  
0.3937725997  
0.7373932671  
1.060521124  
1.344504562  
1.575720974  
1.747011246  
1.85813587  
1.915171596  
1.92892771  
1.912670363  
1.879554349  
1.84024427  
1.801136099  
1.763503779  
1.723715925  
1.674434519  
1.606558544  
1.511502556  
1.383368279  
1.220580966  
1.026677134  
0.8101130914  
0.5831137007  
0.3598261791  
0.1541069726  
-0.02262045749  
-0.163053594  
-0.2649334314  
-0.3310589886  
-0.3684151278  
-0.3866120308  
-0.395949673  
-0.4054731029  
-0.4214021283  
-0.4461901281  
-0.4783777238  
-0.5132285566  
-0.5439769778  
-0.5634527376  
-0.5657164166  
-0.5474218649  
-0.508632737  
-0.4529575911  
-0.3870041815  
-0.3192426374  
-0.2585214102  
-0.212502148  
-0.1862915552  
-0.1815073477  
-0.1959346924  
-0.2238183587  
-0.2567401625  
-0.2849169506  
-0.2987030351  
-0.2900893864  
-0.2539328764  
-0.1887800991  
-0.09717747642  
0.01455907366  
0.1370397847  
0.2588582586  
0.3678602415  
0.4524597914  
0.5028806808  
0.5121892993  
0.4770608114  
0.3982155152  
0.2805159301  
0.1327172906  
-0.03312451307  
-0.2025547013  
-0.359891479  
-0.4896043505  
-0.577797548  
-0.613672036  
-0.5908195145  
-0.5081774117  
-0.3705137832  
-0.1883083341  
0.02298540913  
0.2443205829  
0.4549078643  
0.6344100526  
0.7651800295  
0.8343072869  
0.8351791952  
0.768361364  
0.6416507584  
0.4692807198  
0.2703397314  
0.06661904344  
-0.1198814313  
-0.2694670568  
-0.3669790462  
-0.4034877189  
-0.3772459127  
-0.2938114694  
-0.1653435056  
-0.00915754513  
0.1542729108  
0.3036599177  
0.4193215034  
0.4854428303  
0.4919219334  
0.4356090775  
0.3207847902  
0.1587725966  
-0.03329193433  
-0.2344881961  
-0.422727952  
-0.5777097193  
-0.6838236659  
-0.7326557551  
-0.7246592436  
-0.6697085413  
-0.5863155422  
-0.4995241379  
-0.437648755  
-0.4282568256  
-0.4939482677  
-0.6485230215  
-0.8941754169  
-1.220186142  
-1.603381352  
-2.010397098  
-2.401460395  
-2.735194765  
-2.973754517  
-3.087561273  
-3.05894998  
-2.884215729  
-2.573808068  
-2.150682868  
-1.647137993  
-1.1006548  
-0.5493869533  
-0.02799459483  
0.4356410555  
0.8224094773  
1.122530722  
1.334796723  
1.464790583  
1.522550324  
1.520168532  
1.469780243  
1.382262356  
1.266787305  
1.1311757  
0.9828442195  
0.8299856596  
0.6826102348  
0.5531006234  
0.4560085815  
0.4070165569  
0.421133772  
0.5103713262  
0.6812948054  
0.9328745672  
1.255106815  
1.628730376  
2.026250119  
2.414253414  
2.756805856  
3.019508178  
3.173666479  
3.199991214  
3.091253954  
2.853495037  
2.505562103  
2.077003785  
1.604590848  
1.127940168  
0.6848309633  
0.3068727143  
0.01607920193  
-0.1771786838  
-0.274633177  
-0.288982558  
-0.2413846022  
-0.1579766391  
-0.06599068155  
0.01001676953  
0.05125617835  
0.04674060006  
-0.005967009996  
-0.1013134789  
-0.2274595122  
-0.3687652563  
-0.5086386282  
-0.6322543056  
-0.7287200731  
-0.7923769505  
-0.8230709517  
-0.8254156725  
-0.8072670852  
-0.7776924922  
-0.7448787886  
-0.7143586992  
-0.6878821282  
-0.6631591877  
-0.6345137627  
-0.5943031177  
-0.5348685957  
-0.4506119098  
-0.3398049047  
-0.2057726385  
-0.05716831226  
0.0927352425  
0.2276985124  
0.330837071  
0.3872655844  
0.3865864963  
0.3248150322  
0.2053700982  
0.03892657181  
-0.1578745227  
-0.3646695198  
-0.5602380544  
-0.7254966844  
-0.8461502771  
-0.9145582363  
-0.9305182533  
-0.9008516013  
-0.8378892918  
-0.7571344716  
-0.6745195176  
-0.603719999  
-0.5539796797  
-0.5287878011  
-0.5256031408  
-0.5366194229  
-0.5503987374  
-0.5540852468  
-0.5357808426  
-0.4867192282  
-0.4028791091  
-0.2858207324  
-0.1426589869  
0.01479191577  
0.1715137496  
0.311178514  
0.4181789777  
0.4795000412  
0.4862349591  
0.4345907892  
0.3263220954  
0.1685846396  
-0.02673106668  
-0.2440832659  
-0.4656653889  
-0.6729581307  
-0.84832108  
-0.9764797062  
-1.045798193  
-1.04923793  
-0.9849084377  
-0.8561945005  
-0.6714338312  
-0.4432131072  
-0.1873389651  
0.07840441997  
0.3355831672  
0.5664196742  
0.7549886968  
0.888211756  
0.9566356346  
0.9549654935  
0.8823692192  
0.7425655233  
0.5437171356  
0.2980935005  
0.02153901034  
-0.2673376482  
-0.54822958  
-0.8004778838  
-1.004641671  
-1.144210174  
-1.207276154  
-1.187993499  
-1.087570833  
-0.9146093991  
-0.684610808  
-0.4186236141  
-0.1410981212  
0.1228425492  
0.350383971  
0.5238375879  
0.6329061361  
0.6759994742  
0.6603929003  
0.6011471426  
0.5189137846  
0.4369244986  
0.3775949297  
0.3592634165  
0.3935025227  
0.4834556442  
0.6233806388  
0.7994998386  
0.9919786821  
1.177747251  
1.333718185  
1.439949023  
1.482281577  
1.454102577  
1.356996888  
1.200251917  
0.99930701  
0.7734284546  
0.5429768145  
0.3266852342  
0.1393613325  
-0.009655774653  
-0.1170786295  
-0.1852534615  
-0.2208430828  
-0.2328968413  
-0.230656606  
-0.2215076394  
-0.2094632554  
-0.1944371985  
-0.1724526627  
-0.1367431361  
-0.07951766623  
0.005931122893  
0.1232064558  
0.2712630243  
0.4436877689  
0.6289579639  
0.8117002606  
0.9747444109  
1.101642745  
1.179201091  
1.199593294  
1.161636836  
1.071026989  
0.939426643  
0.7826048562  
0.617900034  
0.4614966935  
0.3259552596  
0.2184670031  
0.1401160753  
0.08628304771  
0.04808504611  
0.01459642708  
-0.02459743007  
-0.07698458944  
-0.1453098201  
-0.2267009034  
-0.3129122134  
-0.3916577193  
-0.4487806382  
-0.4708935701  
-0.4480073397  
-0.3756836172  
-0.256329704  
-0.09941792165  
0.07941849195  
0.2602507755  
0.4213790727  
0.5421148968  
0.6054016887  
0.5998849958  
0.5212038267  
0.3723407147  
0.163092245  
-0.09120961071  
-0.371489724  
-0.6569504356  
-0.9270765991  
-1.163393389  
-1.350849209  
-1.47875238  
-1.541274712  
-1.537561996  
-1.471546466  
-1.351534888  
-1.189621772  
-1.000965129  
-0.8029147597  
-0.6139760489  
-0.4525823053  
-0.335684247  
-0.2772051541  
-0.2864808911  
-0.3668395488  
-0.5145585048  
-0.7184186253  
-0.9600442074  
-1.215175533  
-1.4558399  
-1.653313566  
-1.781541306  
-1.820603958  
-1.759735005  
-1.599377853  
-1.351865996  
-1.040467787  
-0.6967979125  
-0.3568045392  
-0.05585544721  
0.1763969143  
0.3205900319  
0.3709009837  
0.3363690893  
0.2399792875  
0.1155169836  
0.00258550193  
-0.05950241561  
-0.03802942718  
0.08760422331  
0.322057117  
0.6525637923  
1.050096091  
1.473025948  
1.872787314  
2.200685894  
2.41482132  
2.48609586  
2.402397623  
2.170347669  
1.814371028  
1.373280641  
0.8948863512  
0.4294775908  
0.02312570126  
-0.2882239971  
-0.4830687933  
-0.5565069681  
-0.5200320413  
-0.399066322  
-0.2287070916  
-0.04829803399  
0.1043092079  
0.198036484  
0.212691486  
0.1413723524  
-0.009051789394  
-0.2193942396  
-0.4612211427  
-0.7010550274  
-0.9050690571  
-1.043616195  
-1.094953929  
-1.047740835  
-0.9019926921  
-0.6685081638  
-0.3669135575  
-0.02273482848  
0.3360501779  
0.682428286  
0.9932730834  
1.251414351  
1.446647534  
1.575678715  
1.64114646  
1.650005972  
1.611622997  
1.535920182  
1.431893713  
1.30667205  
1.165206653  
1.010520256  
0.8443805411  
0.6681651277  
0.4837035574  
0.2938886106  
0.1029433868  
-0.08372138818  
-0.2599938463  
-0.4198003248  
-0.5579235115  
-0.6707600629  
-0.7568441751  
-0.817058381  
-0.854470654  
-0.8738354934  
-0.8808247356  
-0.8811138573  
-0.8794691607  
-0.878973421  
-0.8805292739  
-0.8827080298  
-0.8819842737  
-0.8733379587  
-0.8511111926  
-0.8100263335  
-0.7461823981  
-0.6578845929  
-0.5461685917  
-0.4149203837  
-0.2705648041  
-0.121334439  
0.02376500388  
0.1561850377  
0.2690572772  
0.3582451104  
0.4230572541  
0.4665057815  
0.4950422857  
0.5177732967  
0.5452460769  
0.5879191236  
0.6545340125  
0.7505628096  
0.8769691075  
1.029471098  
1.198429563  
1.369448446  
1.524677466  
1.644694056  
1.710796451  
1.707420762  
1.624405376  
1.45876355  
1.215711952  
0.9087571715  
0.5587649685  
0.1920557442  
-0.1622636685  
-0.4754441614  
-0.7223214609  
-0.884209673  
-0.951092205  
-0.9228050366  
-0.8090416569  
-0.6281604191  
-0.4049597769  
-0.1676756921  
0.05538304964  
0.2391403548  
0.3645594703  
0.4205823042  
0.4049664976  
0.3239121607  
0.1905624777  
0.02259843847  
-0.1606960594  
-0.3414672765  
-0.5059553112  
-0.6463857621  
-0.7617891695  
-0.8576211201  
-0.9442314293  
-1.034434161  
-1.140563225  
-1.271495855  
-1.43013863  
-1.611839018  
-1.803998275  
-1.987031604  
-2.136577815  
-2.226694143  
-2.233583443  
-2.139327078  
-1.935079844  
-1.623236687  
-1.218201958  
-0.7456167589  
-0.2400601998  
0.2585091038  
0.709143093  
1.074584051  
1.32561716  
1.44453413  
1.427239349  
1.283717748  
1.036775553  
0.7192209764  
0.3698360524  
0.02867823893  
-0.2676862593  
-0.4903821288  
-0.6213147806  
-0.6547552275  
-0.5972565181  
-0.46594173  
-0.2854628292  
-0.08410234994  
0.1104049628  
0.274715319  
0.3928349945  
0.4578088315  
0.4719440337  
0.4456118891  
0.3948782651  
0.3384216071  
0.2942331978  
0.276657802  
0.2942396202  
0.3486575762  
0.4348839856  
0.5424607715  
0.6576261446  
0.7658865479  
0.8545846489  
0.9150335427  
0.9438781833  
0.9435109168  
0.9214933479  
0.889140583  
0.8595264997  
0.8452356884  
0.856231665  
0.8981334818  
0.9711504208  
1.06976098  
1.18317668  
1.296462647  
1.392177406  
1.452310143  
1.460316054  
1.403050608  
1.272435756  
1.066728968  
0.7912920539  
0.4587774669  
0.08867895906  
-0.2937858888  
-0.6594480274  
-0.9775695346  
-1.218703738  
-1.357838027  
-1.377521516  
-1.270656119  
-1.042534188  
-0.711794508  
-0.3099602101  
0.1205568078  
0.5300127879  
0.8661849662  
1.080089664  
1.131948587  
0.9966621278  
0.6680388064  
0.1611192498  
-0.4878873236  
-1.224239325  
-1.979726223  
-2.67968189  
-3.251155928  
-3.631248361  
-3.774526225  
-3.658544406  
-3.286650798  
-2.687684409  
-1.912520461  
-1.027930623  
-0.1085603887  
