193.6355366  
184.9407067  
172.2380093  
147.0207745  
31.87516215  
838.6503849  
5331.191776  
24892.66837  
7748.891836  
1369.520522  
150663.723  
23519.75185  
2155.948557  
18887.4201  
14529.91664  
2458.857233  
5426.521794  
13630.25152  
27084.1102  
4149.72066  
2009.538254  
5430.133011  
15834.71527  
7233.155209  
2821.754241  
3917.941183  
346.4640984  
4474.73222  
943.746468  
9304.946054  
21155.95119  
7155.287098  
2341.716635  
6644.412419  
6087.439716  
1975.824622  
2732.720915  
4635.986293  
3256.249818  
5569.794205  
5361.875474  
1420.992003  
2070.078978  
10914.15843  
3834.669221  
3143.786054  
15058.79036  
3958.812337  
378.8063667  
1641.193226  
2388.877425  
1196.091046  
2514.615223  
1665.946781  
2855.396083  
5550.711726  
1631.839506  
1053.948646  
635.7709647  
388.0379669  
333.8894659  
482.8577649  
222.0178411  
331.8217536  
448.6717161  
107.1282199  
8.05966213  
148.204785  
5.00199003  
77.61319796  
0.817742285  
25.50517042  
5.90162852  
18.26276572  
18.98291685  
22.71029676  
26.76855315  
12.16858434  
14.36719141  
9.833410562  
5.266952366  
7.197390786  
6.85509271  
8.797612083  
6.09211904  
6.606990129  
5.992421595  
5.728871729  
5.454744135  
5.159193917  
4.941024138  
4.549609323  
4.287208408  
4.253619138  
4.11430529  
3.875869197  
3.811865422  
3.659534533  
3.528231621  
3.389243259  
3.350439902  
3.170303487  
3.126635803  
2.976298973  
2.885579965  
2.821205566  
2.714086707  
2.654464795  
2.56757254  
2.482415282  
2.419895956  
2.356158695  
2.28423277  
2.226669225  
2.168450483  
2.111668308  
2.059995759  
2.007539541  
1.958140879  
1.909226114  
1.862663708  
1.819321611  
1.776610216  
1.734933486  
1.695536776  
1.657032717  
1.620456651  
1.584833036  
1.550707525  
1.517340156  
1.485172515  
1.454632741  
1.424537119  
1.39561646  
1.367629783  
1.340522943  
1.314215873  
1.288834677  
1.264194381  
1.240305622  
1.217127582  
1.194674144  
1.172871642  
1.15171135  
1.131153589  
1.111193532  
1.091798928  
1.072976993  
1.054643527  
1.036839673  
1.019536506  
1.002683844  
0.986284132  
0.9703181685  
0.9547833437  
0.9396633782  
0.9249121074  
0.9105495469  
0.8965497231  
0.8829079382  
0.8696183569  
0.8566381386  
0.8439760322  
0.8316403138  
0.8195923394  
0.8078272646  
0.7963522924  
0.785151196  
0.7742029253  
0.7635011084  
0.753068024  
0.7428685594  
0.7328696328  
0.7231329785  
0.7135953937  
0.7042722082  
0.6951605301  
0.6862402203  
0.6775181844  
0.6689864331  
0.6606199253  
0.6524575214  
0.644437792  
0.6365991646  
0.6289180378  
0.6213995007  
0.6140441883  
0.6068235135  
0.5997590852  
0.5928209169  
0.5860396118  
0.5793766535  
0.5728417866  
0.566447708  
0.5601756261  
0.554022447  
0.5479680135  
0.5420558997  
0.5362414766  
0.5305451976  
0.5249519695  
0.5194482183  
0.5140606465  
0.508773915  
0.5035712435  
0.4984685949  
0.493464563  
0.4885384589  
0.4837038631  
0.478960085  
0.4742928314  
0.4697034579  
0.4651974628  
0.4607761834  
0.456426317  
0.4521544086  
0.4479469986  
0.4438151425  
0.4397425477  
0.4357443144  
0.431817374  
0.4279452316  
0.4241382804  
0.4204160164  
0.4167356118  
0.4131176601  
0.4095562867  
0.4060441562  
0.4025995427  
0.3992053641  
0.3958673812  
0.3925731774  
0.3893377944  
0.3861463755  
0.3830156047  
0.3799241439  
0.3768811477  
0.3738837355  
0.3709309388  
0.3680269926  
0.3651667546  
0.3623474432  
0.3595688767  
0.3568399438  
0.3541374605  
0.3514830143  
0.348861364  
0.3462827782  
0.3437433282  
0.3412467684  
0.338772437  
0.3363415361  
0.3339398705  
0.3315723356  
0.3292473634  
0.3269407821  
0.3246759343  
0.3224427167  
0.3202385357  
0.3180681488  
0.3159212417  
0.3138077339  
0.3117267151  
0.3096711128  
0.3076379734  
0.3056352169  
0.303666326  
0.301718793  
0.2997981474  
0.297908193  
0.2960338859  
0.2941882211  
0.2923675328  
0.2905729858  
0.2887988282  
0.287047294  
0.285321545  
0.2836209884  
0.281935203  
0.280272055  
0.2786398584  
0.2770257647  
0.2754223877  
0.2738458489  
0.2722866753  
0.2707508508  
0.2692351896  
0.2677291336  
0.2662569824  
0.2647969781  
0.2633576479  
0.2619283613  
0.2605266555  
0.259129243  
0.2577649774  
0.2564120374  
0.255070592  
0.253750235  
0.2524438891  
0.2511562127  
0.2498814229  
0.2486278632  
0.247388856  
0.2461637105  
0.2449448536  
0.2437424968  
0.2425676661  
0.2413911557  
0.2402435852  
0.239101641  
0.2379755242  
0.2368586816  
0.2357664456  
0.234674975  
0.2335941296  
0.2325376851  
0.2314888431  
0.2304472041  
0.2294337818  
0.2284180169  
0.2274171526  
0.2264298093  
0.2254565245  
0.2244927643  
0.223534927  
0.2225971928  
0.2216612772  
0.220744371  
0.2198355412  
0.2189351792  
0.2180469595  
0.2171748938  
0.2163036793  
0.2154461388  
0.2146022185  
0.2137613935  
0.2129295802  
0.2121176051  
0.2113079228  
0.210504855  
0.2097259443  
0.2089437367  
0.2081732562  
0.2074074219  
0.2066547312  
0.2059124338  
0.2051755102  
0.204446949  
0.2037301588  
0.2030158786  
0.2023162114  
0.2016231349  
0.2009415567  
0.2002593669  
0.1995951245  
0.1989325654  
0.1982804764  
0.1976328648  
0.196995574  
0.1963620415  
0.1957398496  
0.1951224325  
0.1945150788  
0.1939128064  
0.1933146392  
0.1927331674  
0.1921518873  
0.191580187  
0.1910091313  
0.1904486278  
0.189896385  
0.1893539845  
0.1888125911  
0.1882811781  
0.1877600519  
0.1872404303  
0.1867238598  
0.186213544  
0.1857144318  
0.1852246293  
0.1847282733  
0.1842396788  
0.183768891  
0.1832956437  
0.1828371263  
0.1823755203  
0.1819240865  
0.1814787569  
0.1810298598  
0.1805967325  
0.1801683928  
0.1797441296  
0.1793206358  
0.1789052804  
0.1784988878  
0.1780910623  
0.1776928045  
0.1773109791  
0.1769196003  
0.1765338286  
0.1761587076  
0.1757877245  
0.1754227773  
0.1750571133  
0.1747013155  
0.1743564947  
0.1740133053  
0.1736610128  
0.1733293555  
0.1729935598  
0.1726630817  
0.1723453156  
0.1720230539  
0.171711813  
0.1714075562  
0.1711002202  
0.1708017734  
0.1705046949  
0.1702184406  
0.1699372163  
0.1696546819  
0.1693753793  
0.1691036044  
0.1688302747  
0.1685723593  
0.1683100551  
0.1680602927  
0.1678042281  
0.1675594698  
0.1673213825  
0.1670836575  
0.166854062  
0.1666173357  
0.166389078  
0.166170044  
0.1659505395  
0.1657389495  
0.1655291632  
0.1653261229  
0.1651206076  
0.1649305299  
0.164738828  
0.1645546184  
0.1643624221  
0.1641852938  
0.1640077157  
0.163833335  
0.163663728  
0.1634965808  
0.1633382616  
0.1631760357  
0.1630269396  
0.1628789694  
0.1627313855  
0.1625888465  
0.1624533724  
0.1623167193  
0.1621811381  
0.1620558609  
0.1619353489  
0.1618074518  
0.1616974638  
0.1615827678  
0.1614744888  
0.1613710795  
0.1612625608  
0.1611688119  
0.161078518  
0.1609808961  
0.1609014658  
0.1608152777  
0.1607312227  
0.1606565788  
0.1605848745  
0.1605144582  
0.1604490679  
0.1603847093  
0.1603254538  
0.1602729517  
0.1602250548  
0.1601704724  
0.1601324109  
0.16008743  
0.1600560191  
0.16001732  
0.1599942349  
0.1599684849  
0.1599422822  
0.1599171113  
0.1599058268  
0.1598944592  
0.1598896247  
0.1598784748  
0.1598797157  
