162.535702  
180.0181388  
220.5535124  
299.1977526  
326.8215047  
2458.973877  
48795.22439  
10795.59407  
91788.89669  
27852.55056  
40438.09602  
8912.166203  
30663.59435  
36944.51161  
2024.573157  
14340.45593  
1726.960626  
5807.673614  
12147.56616  
943.9089513  
7917.891013  
13723.95813  
6109.750978  
4132.971065  
2536.532155  
699.5984517  
421.7823608  
18005.72282  
6470.789115  
4852.573331  
3337.666201  
7603.352017  
14871.06467  
1002.688379  
4234.443177  
1475.076227  
588.0068303  
1065.613146  
7540.403447  
2530.125675  
491.9474829  
786.8808311  
1432.902093  
2799.136429  
1548.305089  
1266.173939  
485.1628017  
5478.447754  
888.7166306  
4039.407831  
1517.090315  
2705.111909  
2822.541429  
533.3648902  
1122.6536  
1671.621334  
799.859497  
699.8816326  
2638.667  
2192.883171  
1524.032361  
129.1593926  
1112.469874  
677.4893781  
1351.134257  
42.31064326  
276.252728  
275.3311431  
69.5218832  
109.8662139  
55.98607357  
2.225259399  
1.290389016  
21.62505776  
3.278794913  
0.6961166211  
11.46063092  
6.864712591  
1.30587682  
3.200348215  
2.770481916  
1.889384288  
1.564255423  
1.133345498  
1.042750798  
1.420981853  
1.104364236  
1.543176976  
0.9449959155  
0.902048679  
1.064602819  
0.7705307801  
0.8638266653  
0.6681326212  
0.5501150936  
0.5744083219  
0.5896953085  
0.5352882727  
0.5327824301  
0.435298307  
0.4422546383  
0.4102369608  
0.3895772234  
0.3802937374  
0.3530470487  
0.3454358519  
0.3255805801  
0.3004285464  
0.2921663648  
0.2816592332  
0.2598623959  
0.2497058199  
0.2368715052  
0.2286225161  
0.2149764706  
0.2093458135  
0.1996329578  
0.1905900779  
0.1826723574  
0.1747125027  
0.166612899  
0.1603155625  
0.1534725493  
0.1479532582  
0.1416522878  
0.1360044525  
0.1309197602  
0.1254988556  
0.1206034392  
0.1163278001  
0.111869854  
0.1079485642  
0.1037554395  
0.1000393314  
0.0964060881  
0.09300083289  
0.08962957796  
0.08650996701  
0.08357022282  
0.08073316813  
0.07798165407  
0.07536417369  
0.07284391645  
0.07041118397  
0.06807443275  
0.065875304  
0.06374138475  
0.06170681581  
0.05974211991  
0.0578639027  
0.05606345179  
0.05432366577  
0.05265321953  
0.05104554853  
0.04950478586  
0.04801626731  
0.04657858309  
0.04519531087  
0.0438751133  
0.04259594411  
0.04135897113  
0.04017246886  
0.0390237524  
0.0379200721  
0.0368547106  
0.03582244097  
0.03482525834  
0.0338628591  
0.0329351  
0.03203805493  
0.0311740159  
0.03033521145  
0.02952566036  
0.02874202762  
0.02798056648  
0.02724675478  
0.02654105296  
0.02585297605  
0.02518694149  
0.02454324879  
0.02391881751  
0.0233154766  
0.02272578927  
0.02216003092  
0.02161272062  
0.02107494815  
0.02055670234  
0.02005736393  
0.01956506094  
0.01909201624  
0.01863370825  
0.01818859507  
0.01775611637  
0.01733409422  
0.0169269318  
0.01652944499  
0.01614280665  
0.01577095448  
0.01540518508  
0.01505235082  
0.01470875428  
0.01437617601  
0.01404753836  
0.01373150814  
0.01342309667  
0.01312415737  
0.01283315009  
0.01254924843  
0.01227256732  
0.01200178438  
0.01174125019  
0.01148739832  
0.01123782084  
0.01099657342  
0.01076202734  
0.01053097469  
0.0103079603  
0.01009023127  
0.009874872131  
0.009668574275  
0.009466210864  
0.009267740686  
0.00907816579  
0.008888311127  
0.008708202729  
0.008527550457  
0.008354859016  
0.008184410766  
0.008017173927  
0.00785457723  
0.007698535269  
0.007543951915  
0.007392118183  
0.007244072026  
0.007101813585  
0.006960449437  
0.006823578488  
0.006690836449  
0.006559151206  
0.006430718305  
0.006306238802  
0.006182319099  
0.006066035092  
0.005946651091  
0.005832625315  
0.005722556951  
0.005613686084  
0.005505577181  
0.005403031859  
0.00529941796  
0.005199708218  
0.005102747948  
0.005006363753  
0.004913979418  
0.00482218233  
0.004733071426  
0.004644382823  
0.004558474032  
0.004474144908  
0.004392504816  
0.004312461337  
0.004233806504  
0.00415617747  
0.004081256008  
0.004006527784  
0.003934194299  
0.003862994287  
0.003794291149  
0.00372505206  
0.003659068893  
0.003594176327  
0.003530365238  
0.003468362835  
0.003405653736  
0.003346050727  
0.003287168467  
0.003228080589  
0.003170182738  
0.003116099373  
0.003061334897  
0.003007730818  
0.00295543509  
0.002904723795  
0.002854408711  
0.002803796652  
0.002756028131  
0.002709138177  
0.002660641682  
0.002615936769  
0.002570962762  
0.002526154333  
0.002483308551  
0.002441893792  
0.002399282594  
0.002357953771  
0.002319069963  
0.002278089568  
0.002240708457  
0.002204145254  
0.002165407066  
0.00212876609  
0.002092911714  
0.002057121304  
0.002023194974  
0.001989839593  
0.001955969235  
0.001923724027  
0.001890960518  
0.001859440452  
0.001829509356  
0.001798037956  
0.001767901177  
0.001738899681  
0.001710712539  
0.001682570144  
0.001655038567  
0.001626314424  
0.001599943031  
0.001573439256  
0.001547460431  
0.001522517887  
0.001497372688  
0.001471994979  
0.001448104854  
0.001424666726  
0.001400723705  
0.001377921884  
0.001355642805  
0.001333663864  
0.001311329713  
0.001290625824  
0.001269590275  
0.001249162401  
0.001228057174  
0.00120772247  
0.001188527404  
0.001169198266  
0.001150583731  
0.001131798074  
0.001113371987  
0.001095011144  
0.001076885605  
0.001059894611  
0.001042261322  
0.001026219019  
0.001009493193  
0.0009933975674  
0.0009765499404  
0.0009611760714  
0.0009458708211  
0.0009303275413  
0.0009150388948  
0.0009007605483  
0.0008854830006  
0.0008718605071  
0.0008579193769  
0.0008439466552  
0.000830041546  
0.0008170726596  
0.0008037238542  
0.0007901982445  
0.0007777416442  
0.0007652340307  
0.000752743691  
0.0007405734661  
0.0007284453222  
0.0007173979634  
0.0007059255502  
0.0006948821172  
0.0006830775887  
0.000672599022  
0.0006610975068  
0.0006499353771  
0.0006404271184  
0.0006302379978  
0.0006199157558  
0.0006102359877  
0.0005998197065  
0.0005900894398  
0.0005806471026  
0.0005714692326  
0.0005621027606  
0.0005534791231  
0.0005446767661  
0.0005351565883  
0.0005272685502  
0.0005188093727  
0.0005099819595  
0.0005023032606  
0.0004942549142  
0.0004858154106  
0.000478550202  
0.0004710223808  
0.0004629451436  
0.0004559818197  
0.0004481008379  
0.0004412204993  
0.0004342634605  
0.0004272351867  
0.0004204865256  
0.0004141881851  
0.0004072188592  
0.00040120992  
0.0003938417243  
0.0003883019213  
0.000381996843  
0.0003758996004  
0.0003703829696  
0.0003645586625  
0.0003584449526  
0.0003525629101  
0.0003473244524  
0.0003415446276  
0.000336525319  
0.0003313125483  
0.0003259944066  
0.0003211735303  
0.000316049249  
0.0003112529792  
0.0003067120349  
0.0003021124922  
0.0002971913512  
0.000292536357  
0.0002877200049  
0.0002838585344  
0.000279277918  
0.0002752207115  
0.0002712806067  
0.0002670798731  
0.0002628491548  
0.0002591522206  
0.0002555242917  
0.0002518428913  
0.0002480850392  
0.0002444845538  
0.0002413352944  
0.0002374372032  
0.0002344535812  
0.0002308350814  
0.0002277219489  
0.0002246891808  
0.0002215987199  
0.0002187953386  
0.0002156211917  
0.0002127805643  
0.000209923649  
0.0002072427694  
0.0002044561832  
0.0002019731363  
0.0001993094255  
0.000197066909  
0.0001946652092  
0.0001922328303  
0.0001899865977  
0.0001878169529  
0.0001857252687  
0.0001835138769  
0.0001814850939  
0.000179466849  
0.0001775050793  
0.0001756140019  
0.0001737801393  
0.0001722160835  
0.0001705885633  
0.0001689454221  
0.0001672245442  
0.0001657535338  
0.0001642975425  
0.0001629515248  
0.0001617668487  
0.0001607112968  
0.0001591371494  
0.0001579147901  
0.0001567119437  
0.0001557356064  
0.0001546181964  
0.0001538224582  
0.0001529343129  
0.0001520248598  
0.0001514035849  
0.0001507185648  
0.0001498242898  
0.0001493029686  
0.0001488034311  
0.0001480426516  
0.0001477251053  
0.0001474960044  
0.0001472700984  
0.0001466915286  
0.0001466989469  
0.0001463147311  
0.0001461394846  
0.0001460719278  
0.0001462907169  
