66.25854224  
72.06721083  
81.84832517  
90.556548  
152.7073682  
280.4738042  
2199.002487  
16164.81667  
8255.595602  
191.3478661  
1665.8975  
3486.161184  
4961.673379  
16855.01296  
7316.918013  
10952.03292  
1767.9792  
4348.535192  
943.5274356  
4644.948173  
1936.185188  
2088.463154  
1397.598076  
234.9370756  
14897.92947  
27217.60718  
2792.816446  
6916.986969  
810.3324334  
11886.45936  
3554.623087  
1279.858083  
4702.954099  
10446.16539  
8301.560051  
9116.068843  
10287.35688  
6663.05012  
9917.316205  
12690.3036  
15049.51869  
785.4498389  
16203.82872  
13533.35504  
3232.234093  
5006.600655  
25321.76637  
6393.414268  
9851.172188  
24144.16587  
31568.58831  
1161.421014  
1022.764992  
82.284924  
1958.317948  
3783.239891  
44658.26962  
13333.27077  
7055.905587  
373.9159652  
9136.947705  
4707.022759  
12026.92891  
472.0060075  
855.4044044  
1351.674643  
545.0623731  
492.4054643  
234.1086594  
465.2154307  
191.9957665  
555.3005908  
37.43152537  
170.7919309  
35.41428243  
0.9167426323  
9.862970446  
9.73706385  
3.035084999  
0.9218993828  
1.266868485  
8.328361032  
0.6468088436  
1.609212787  
6.085580348  
2.48252605  
1.792223504  
1.699752209  
2.026164261  
1.884970186  
2.170612968  
1.883062146  
1.7293582  
1.961582262  
1.780429529  
1.64245289  
1.412026788  
1.618205427  
1.527561488  
1.503885802  
1.463158379  
1.325403981  
1.218787493  
1.230525174  
1.196262693  
1.163090597  
1.122523706  
1.103116528  
1.072208712  
1.036517377  
0.9946054473  
0.9723840783  
0.9371102758  
0.9076155687  
0.8892162767  
0.8584910526  
0.8394168041  
0.8140596503  
0.7942772555  
0.7727560611  
0.7505785311  
0.7315154787  
0.710430329  
0.6926765805  
0.6746881111  
0.658395372  
0.6417824871  
0.6268346811  
0.6124815153  
0.5971772528  
0.5828967818  
0.5699252306  
0.5569215067  
0.5441921783  
0.5319779281  
0.5207005389  
0.5092975661  
0.4984220394  
0.4881813542  
0.4779372754  
0.4680488354  
0.4586535371  
0.4494152384  
0.4405121857  
0.4320907728  
0.4235585999  
0.415439853  
0.4075948146  
0.3999393597  
0.3926378459  
0.3854421301  
0.3785240335  
0.3717884945  
0.3652029484  
0.3588071945  
0.3526430345  
0.3466104787  
0.340728334  
0.3350681975  
0.3295363939  
0.3241344399  
0.3188864455  
0.3137934794  
0.3088062984  
0.3039686077  
0.2992435265  
0.2946576036  
0.2901793309  
0.2858021038  
0.2815386186  
0.2773799477  
0.2733220564  
0.2693721774  
0.2655159861  
0.2617518988  
0.2580622173  
0.2544674612  
0.2509632473  
0.2475420988  
0.2441893052  
0.2409046284  
0.2377136054  
0.2345874721  
0.2315334556  
0.228538367  
0.2256149279  
0.2227587053  
0.2199610948  
0.217209899  
0.214535826  
0.2119151991  
0.2093386618  
0.2068272944  
0.2043615326  
0.2019463989  
0.1995740738  
0.1972694761  
0.1949975696  
0.1927772781  
0.190595988  
0.188460688  
0.1863623558  
0.1843092774  
0.1822949607  
0.1803157616  
0.1783796464  
0.1764764946  
0.1746163845  
0.1727777574  
0.1709883985  
0.169223707  
0.1674890985  
0.1657889263  
0.1641197316  
0.1624767706  
0.1608733199  
0.1592980459  
0.1577421177  
0.1562156617  
0.1547162702  
0.1532473074  
0.1517991512  
0.1503743684  
0.1489771277  
0.147606962  
0.1462547246  
0.144922463  
0.1436216742  
0.142328375  
0.1410769781  
0.1398329597  
0.1386107655  
0.1374130038  
0.136227987  
0.1350681106  
0.1339225178  
0.1327954502  
0.1316878306  
0.1305957005  
0.1295224931  
0.1284701836  
0.1274302856  
0.1264004425  
0.1253958702  
0.124404127  
0.1234297229  
0.1224613706  
0.1215189879  
0.1205822435  
0.1196623448  
0.1187557308  
0.1178658334  
0.1169849834  
0.1161206363  
0.115265341  
0.1144242709  
0.1135983647  
0.1127800561  
0.1119781421  
0.111180012  
0.1104039052  
0.1096301899  
0.1088720817  
0.1081250679  
0.1073867847  
0.1066554199  
0.1059369552  
0.1052297156  
0.1045268535  
0.1038429473  
0.1031627347  
0.1024958499  
0.10183724  
0.1011841741  
0.1005389721  
0.09990908645  
0.09928083563  
0.09866374038  
0.09805922703  
0.09745615205  
0.09686162302  
0.09627777206  
0.09570136886  
0.09512926587  
0.09457028649  
0.09401378659  
0.093467752  
0.09292996457  
0.09239544905  
0.09187057079  
0.09135170719  
0.09083635107  
0.09032802901  
0.08982890051  
0.08933726244  
0.08885134321  
0.08837350819  
0.08789880358  
0.08742905045  
0.08696378218  
0.08650495543  
0.08606022086  
0.08561120891  
0.08517478261  
0.08474024474  
0.08430935047  
0.08388772862  
0.08346309667  
0.08305013636  
0.08264756655  
0.08224005632  
0.08184424668  
0.08145158341  
0.08106174663  
0.08067586444  
0.08029706816  
0.07992499786  
0.07955245718  
0.07918610841  
0.07882603681  
0.0784711146  
0.07811695697  
0.07777210948  
0.07742615966  
0.07708913958  
0.07674943085  
0.07642132216  
0.07609165228  
0.07576913178  
0.0754486547  
0.07513287166  
0.07481823511  
0.07451480648  
0.07420931618  
0.0739048723  
0.07360843268  
0.07331491827  
0.07302576468  
0.07274026764  
0.07245336158  
0.07217763143  
0.07189915851  
0.07162581132  
0.07134976207  
0.0710872772  
0.07082530056  
0.07056040881  
0.0703028481  
0.07004871443  
0.06979702695  
0.0695496889  
0.0693018278  
0.06905893063  
0.06882022535  
0.0685843188  
0.06834802503  
0.06811569355  
0.06789073055  
0.06766030098  
0.06743750137  
0.0672188673  
0.06700157491  
0.06679027171  
0.06657414082  
0.06636512088  
0.06615743297  
0.06594969506  
0.06575006216  
0.06554804902  
0.06535010217  
0.06515372862  
0.06496563464  
0.06477756553  
0.06458637243  
0.06439996096  
0.06421965942  
0.06403387166  
0.0638554775  
0.06368028823  
0.06350260054  
0.0633311143  
0.06316037624  
0.06299331089  
0.06282563727  
0.06266318128  
0.06250234055  
0.0623405967  
0.06218396599  
0.06202890825  
0.06187581355  
0.06172326974  
0.06157315222  
0.06143161688  
0.06127912559  
0.06113956218  
0.06099474991  
0.06085454065  
0.0607175697  
0.06058045014  
0.06044743014  
0.06031413115  
0.06018427795  
0.06005621541  
0.05992801459  
0.05980104859  
0.0596764115  
0.05955794625  
0.05943795966  
0.05931816788  
0.05919930588  
0.05908584781  
0.05897483578  
0.05886075417  
0.05875225238  
0.05864620253  
0.05853778699  
0.05843206661  
0.05832733063  
0.05822594803  
0.05812517114  
0.05802463125  
0.05792992732  
0.05783037444  
0.05774083755  
0.05764667806  
0.05755820077  
0.05746864923  
0.05737802068  
0.05729293697  
0.05721016597  
0.05712536557  
0.05704543685  
0.05696236808  
0.05688416827  
0.05680647805  
0.05672899904  
0.05665229711  
0.05658145482  
0.05650998126  
0.05644018271  
0.0563715228  
0.05630308419  
0.05623835288  
0.05617216395  
0.05610861728  
0.05604518211  
0.05598608874  
0.05592783678  
0.05586748225  
0.05581175367  
0.05575687922  
0.05570284923  
0.05565159074  
0.05559706621  
0.05554854943  
0.05550009679  
0.05545670486  
0.05540838115  
0.05536483775  
0.05532184297  
0.05527513208  
0.05523622422  
0.05519809218  
0.05515840941  
0.05512323224  
0.05508712957  
0.05505055014  
0.05501731464  
0.0549856474  
0.05495699723  
0.05492913202  
0.05489669929  
0.05487336151  
0.05484916895  
0.05482347282  
0.05480253718  
0.05477922865  
0.05476017892  
0.05474282489  
0.05472387678  
0.0547031004  
0.05469110229  
0.05467974535  
0.05466286788  
0.05465120408  
0.05464252194  
0.05463000365  
0.05462412555  
0.05461642658  
0.05460917035  
0.05460290453  
0.05460049259  
0.05460040527  
0.05460093574  
