-0.5549723053  
1.31339222  
3.043885341  
4.504678345  
5.588827761  
6.223783032  
6.377350925  
6.059595801  
5.320589124  
4.244351885  
2.939746915  
1.529335333  
0.1374116759  
-1.121558568  
-2.152935744  
-2.889418294  
-3.295420904  
-3.368057744  
-3.134813753  
-2.648338102  
-1.979084711  
-1.206705202  
-0.411165442  
0.3354308473  
0.97552005  
1.470623747  
1.803412896  
1.977242777  
2.013359006  
1.946243881  
1.817742661  
1.67073519  
1.543113658  
1.462823149  
1.444511968  
1.488175987  
1.579918828  
1.694657214  
1.800386899  
1.863379267  
1.853596535  
1.749544105  
1.541878724  
1.235261262  
0.848162254  
0.4106429966  
-0.03958908116  
-0.462298888  
-0.8202792907  
-1.084552387  
-1.238419759  
-1.279772734  
-1.221273582  
-1.088340659  
-0.915204758  
-0.739574946  
-0.5966971051  
-0.5136845318  
-0.5049839429  
-0.5696970144  
-0.6912312619  
-0.8393847319  
-0.9746611397  
-1.054213149  
-1.038602006  
-0.8983763054  
-0.6194975897  
-0.2067473338  
0.3154465429  
0.9049816179  
1.506666057  
2.058833655  
2.501106212  
2.782231256  
2.866910763  
2.74064752  
2.411933906  
1.911491802  
1.288655485  
0.6054572883  
-0.07078264048  
-0.6753161088  
-1.153245721  
-1.46528497  
-1.591358496  
-1.531698776  
-1.305495991  
-0.9474710365  
-0.5029881526  
-0.02246006999  
0.444193565  
0.8523890246  
1.166548669  
1.362365586  
1.427634878  
1.361833637  
1.174718034  
0.8842795949  
0.5143731652  
0.09227719016  
-0.3536302651  
-0.7959686053  
-1.210162024  
-1.575907749  
-1.878277531  
-2.108388403  
-2.263593402  
-2.347160149  
-2.367414627  
-2.336432297  
-2.268374816  
-2.177681989  
-2.077333083  
-1.97740757  
-1.88415681  
-1.79968199  
-1.722260465  
-1.647233111  
-1.56827042  
-1.478811985  
-1.373402452  
-1.248739906  
-1.104264468  
-0.9422364937  
-0.7673467877  
-0.5859573292  
-0.405150807  
-0.2317599638  
-0.07155127835  
0.07135493993  
0.19473387  
0.2982199482  
0.3830211484  
0.4514740441  
0.506534893  
0.5512917448  
0.588544821  
0.6205091333  
0.6486327415  
0.6735365036  
0.6950585556  
0.7123942127  
0.7242902552  
0.7293071526  
0.7261106249  
0.7137615575  
0.6919984895  
0.6614466253  
0.6237471661  
0.5815725643  
0.538481047  
0.4986533556  
0.466485841  
0.4460902376  
0.4407550207  
0.4524330451  
0.4813067418  
0.525539367  
0.5812269955  
0.6426181002  
0.7025909909  
0.7533588879  
0.7873404008  
0.7981034535  
0.7812478732  
0.735133925  
0.661314993  
0.5646140509  
0.4527944868  
0.3358415812  
0.2249192845  
0.1311296744  
0.06420957976  
0.03133773335  
0.03621333197  
0.07852251057  
0.1538762266  
0.2542254475  
0.3687202448  
0.4848900604  
0.5900052202  
0.6724436029  
0.722899405  
0.7352733341  
0.7071708886  
0.6399299176  
0.5382418494  
0.4094005373  
0.2623239325  
0.1064853948  
-0.04911788379  
-0.1968016365  
-0.3307971507  
-0.4475155636  
-0.5455325036  
-0.6252964048  
-0.6886605876  
-0.7383163609  
-0.7772310286  
-0.8081678766  
-0.833334024  
-0.8541946903  
-0.8714411918  
-0.8850952299  
-0.8946960327  
-0.899546447  
-0.8989535399  
-0.8924540199  
-0.8799962042  
-0.8620607665  
-0.8397263292  
-0.814660558  
-0.7890526518  
-0.7654661993  
-0.7466207746  
-0.7351193119  
-0.7331061963  
-0.7419211705  
-0.761759011  
-0.7914019562  
-0.8280570095  
-0.8673703838  
-0.9036294747  
-0.9301734597  
-0.9399979607  
-0.9264934025  
-0.8842479623  
-0.8098075234  
-0.7023001765  
-0.5638058247  
-0.3994272543  
-0.2170036052  
-0.02649016706  
0.160933894  
0.3339506667  
0.4822356944  
0.5975204621  
0.6744447879  
0.7111041673  
0.7092254418  
0.6739457919  
0.6132302584  
0.5370035909  
0.4560857432  
0.3810795355  
0.3213229576  
0.284026041  
0.2736808973  
0.2917840275  
0.3368978434  
0.40500193  
0.4900823444  
0.5848763791  
0.681686538  
0.7731765592  
0.8530868265  
0.9168148384  
0.9618249804  
0.9878727407  
0.9970179703  
0.9934354909  
0.9830166716  
0.9727622661  
0.9700177977  
0.9815676733  
1.012694001  
1.066285051  
1.142118075  
1.236435772  
1.34191684  
1.448106842  
1.542294144  
1.610783327  
1.640405438  
1.620084589  
1.54223055  
1.403755616  
1.206546402  
0.9573096486  
0.6668099421  
0.3486164748  
0.01755586825  
-0.3118777236  
-0.6269361878  
-0.9176179575  
-1.177176871  
-1.402099552  
-1.591624861  
-1.746965515  
-1.870415625  
-1.9645227  
-2.031481019  
-2.072829642  
-2.089467761  
-2.081933189  
-2.050843911  
-1.997366315  
-1.923589725  
-1.832699666  
-1.728895648  
-1.617048395  
-1.502151574  
-1.388658568  
-1.279824513  
-1.177192013  
-1.080312489  
-0.9867983452  
-0.8927143242  
-0.7932687689  
-0.6837254738  
-0.5603805868  
-0.4214644514  
-0.2678037415  
-0.1031178528  
0.0661176209  
0.2312433939  
0.3823673652  
0.5095509457  
0.6040633654  
0.6595189715  
0.6726952196  
0.6439393772  
0.5770627299  
0.4787707539  
0.3577118818  
0.2233244051  
0.08467575304  
-0.05050457594  
-0.1764438074  
-0.2894911399  
-0.3878470112  
-0.4709319522  
-0.5385618622  
-0.5901391885  
-0.6240447536  
-0.6374033785  
-0.6262899651  
-0.5863594239  
-0.5137946595  
-0.4063623893  
-0.264385807  
-0.0913987249  
0.1056702603  
0.3168476159  
0.5299705494  
0.7319356839  
0.9101193596  
1.053769692  
1.155128794  
1.210147802  
1.218687414  
1.184220481  
1.113127388  
1.01372686  
0.8952151071  
0.7666847463  
0.6363551631  
0.5110819738  
0.3961683828  
0.2954183004  
0.2113611679  
0.1455380854  
0.09875167733  
0.0712204466  
0.0625832925  
0.07178431646  
0.09687736153  
0.1348142987  
0.1813085147  
0.2308483955  
0.2768909752  
0.3122686736  
0.3297760486  
0.3228724797  
0.2864313072  
0.2174225997  
0.1154496883  
-0.01694184054  
-0.1742251398  
-0.3481588884  
-0.5283234214  
-0.7028940034  
-0.8595820705  
-0.9866527266  
-1.073929897  
-1.113683333  
-1.101333236  
-1.035881954  
-0.9200398392  
-0.7600199788  
-0.5650226471  
-0.3464387743  
-0.1168538312  
0.111054802  
0.3256160908  
0.5171418504  
0.6786732085  
0.8064189659  
0.8998239067  
0.9612781898  
0.9954810944  
1.008577283  
1.007145033  
0.9971952771  
0.9833010417  
0.9679802958  
0.9514031906  
0.931469484  
0.9042339658  
0.8646236348  
0.8073394169  
0.7278143743  
0.6230964338  
0.4925107651  
0.3380224932  
0.164226583  
-0.02203755442  
-0.2123772814  
-0.3977649289  
-0.5695279729  
-0.7202770713  
-0.8446205751  
-0.939579492  
-1.004640248  
-1.041454702  
-1.05326781  
-1.044167945  
-1.018332487  
-0.9793684588  
-0.9298940046  
-0.871410047  
-0.8044719608  
-0.7291062184  
-0.6453681099  
-0.5539241915  
-0.4565095529  
-0.3561818878  
-0.2573042692  
-0.1652477978  
-0.08587872751  
-0.02489165716  
0.01287507075  
0.0240572957  
0.007222221979  
-0.03689670047  
-0.1054028688  
-0.1934713102  
-0.2947802491  
-0.4020777249  
-0.5078377182  
-0.6049320183  
-0.6872626954  
-0.7502937815  
-0.7914301345  
-0.8101945487  
-0.8081695163  
-0.7886887711  
-0.7562969221  
-0.7160267322  
-0.672582829  
-0.6295460287  
-0.5887200082  
-0.5497422899  
-0.5100472304  
-0.4652266377  
-0.4097420943  
-0.337934805  
-0.2451652138  
-0.1288959041  
0.01044463482  
0.1690052039  
0.3395589255  
0.5120965027  
0.6748988047  
0.8159518655  
0.9245013794  
0.9925039563  
1.015740737  
0.9944118709  
0.9330968367  
0.8400747181  
0.7261168555  
0.6029125415  
0.4814058999  
0.3702966727  
0.2749415151  
0.1968477975  
0.1338180955  
0.08071648911  
0.03072370911  
-0.02316296197  
-0.08661757752  
-0.1627486907  
-0.2513329868  
-0.3486467798  
-0.4479186563  
-0.5403171964  
-0.6162979879  
-0.6670678519  
-0.6859313173  
-0.6692832551  
-0.6170930596  
-0.5328133869  
-0.4227416298  
-0.2949587258  
-0.1580354766  
-0.01973543122  
0.1140590637  
0.2400162046  
0.3575118008  
0.4682401224  
0.575356598  
0.6823123748  
0.7915732177  
0.903482538  
1.015472387  
1.121794557  
1.213856859  
1.281150628  
1.312639423  
1.298414806  
1.231351291  
1.108499257  
0.9319778649  
0.7091999199  
0.4523847894  
0.1774104394  
-0.0978405342  
-0.3553990858  
-0.579110108  
-0.7562667228  
-0.8787408204  
-0.9434976334  
-0.9524575368  
-0.911779313  
-0.8307215932  
-0.7202931163  
-0.5919106127  
-0.4562649793  
-0.3225304162  
-0.1979822199  
-0.08800122157  
0.00363199564  
0.07427605114  
0.1219938703  
0.1452330298  
0.1427716996  
0.1139084577  
0.05887940637  
-0.02061770396  
-0.120947638  
-0.2362478442  
-0.3584841394  
-0.4778989434  
-0.5838605111  
-0.6660207329  
-0.7156285405  
-0.7267839797  
-0.6974404605  
-0.6299380516  
-0.5309793955  
-0.4109887332  
-0.2829242377  
-0.1606938521  
-0.05739370519  
0.01638048973  
0.05389993475  
0.05313958143  
0.0169743359  
-0.04731620014  
-0.1291365282  
-0.2161063254  
-0.2958148053  
-0.357520142  
-0.393568324  
-0.4003262567  
-0.3785116952  
-0.3328987687  
-0.271459463  
-0.2041045927  
-0.1412103631  
-0.09217432462  
-0.06418656172  
-0.06140439144  
-0.08460276898  
-0.1313113231  
-0.1963884128  
-0.2728776746  
-0.3529950581  
-0.4290788764  
-0.4943556109  
-0.5434233418  
-0.572441803  
-0.5790497889  
-0.5621031333  
-0.5213507214  
-0.4571550493  
-0.3703413963  
-0.2622095741  
-0.1346881543  
0.009440599527  
0.1663525323  
0.3311337544  
0.4979414756  
0.660436627  
0.8124064989  
0.9485196713  
1.065039559  
1.160339622  
1.235072224  
1.29190136  
1.334775117  
1.367855697  
1.394251374  
1.414825408  
1.427323735  
1.426070872  
1.402372747  
1.345671871  
1.245305132  
1.092642692  
0.8832200901  
0.6184795086  
0.3067330096  
-0.0368936677  
-0.3916565161  
-0.7334044061  
-1.037518915  
-1.282144435  
-1.451170716  
-1.536488905  
-1.539131058  
-1.469090623  
-1.343847774  
-1.185836874  
-1.019263179  
-0.8667736998  
-0.7464885674  
-0.6698331782  
-0.6404405274  
-0.6542513036  
-0.700704748  
-0.7647944017  
-0.8296223564  
-0.8790578056  
-0.9001039533  
-0.8846523483  
-0.8304272901  
-0.7410251912  
-0.6251172449  
-0.4949615116  
-0.3644929893  
-0.2472646913  
-0.1545359041  
-0.09376666995  
-0.06769239409  
-0.07409911668  
-0.1062786794  
-0.1540933357  
-0.2054692993  
-0.2481025178  
-0.2711342718  
-0.2665681451  
-0.2302391642  
-0.1622216125  
-0.06666029084  
0.04895244085  
0.1748874766  
0.3005289992  
0.4157584396  
0.5121709857  
0.5839898656  
0.6285505997  
0.6463396067  
0.6406043318  
0.6166162081  
0.5807206896  
0.5393283816  
0.4979947104  
0.4607323704  
0.4296348846  
0.4048732538  
0.3850204468  
0.3676508081  
0.350079906  
0.3301097634  
0.3066506392  
0.2800972699  
0.2524013019  
0.2268292364  
0.2074422637  
0.1983942  
0.2031570673  
0.2238049166  
0.2604813041  
0.3111150095  
0.3714636356  
0.4354506425  
0.4957972021  
0.5448211147  
0.5753292809  
0.5814790266  
0.5594935324  
0.5081498123  
0.4289771668  
0.3261473315  
0.2060815488  
0.07682072795  
-0.05274962397  
-0.1737355023  
-0.2780287248  
-0.3589805714  
-0.4118901428  
-0.4342841625  
-0.4259768378  
-0.3889409965  
-0.3270289973  
-0.2455978751  
-0.1510807302  
-0.05055440935  
0.04867244317  
0.1394380612  
0.2150615396  
0.2696449287  
0.2983383076  
0.2975793955  
0.2652912544  
0.2010424914  
0.1061403391  
-0.01635164161  
-0.1617079683  
-0.3237311544  
-0.4950881288  
-0.6677347174  
-0.8334502383  
-0.9844254646  
-1.11385247  
-1.216481509  
-1.289057813  
-1.330594412  
-1.342445272  
-1.328112502  
-1.292835899  
-1.24294793  
-1.185086102  
-1.125329858  
-1.068392491  
-1.016964301  
-0.9713221418  
-0.9292767038  
-0.8864940438  
-0.837156454  
-0.7749014238  
-0.6939039908  
-0.5899431192  
-0.4613014009  
-0.3093434963  
-0.1386669041  
0.04319380432  
0.2265031241  
0.4003772894  
0.5540222208  
0.6779699847  
0.7651321394  
0.8115490895  
0.8167200949  
0.7835155995  
0.7176925709  
0.627128529  
0.5208939714  
0.4082933656  
0.2980230471  
0.1975150142  
0.1125352831  
0.04702337503  
0.003152436446  
-0.01845262941  
-0.01841433673  
0.001714544389  
0.03973198045  
0.09300861669  
0.1586347008  
0.2335182794  
0.3144516255  
0.398183871  
0.4815062837  
0.5613842041  
0.6351012846  
0.700416734  
0.755697035  
0.7999958502  
0.8330488642  
0.8551820266  
0.8671263598  
0.8697750231  
0.8639083633  
0.849953145  
0.8278043457  
0.7967801111  
0.7557101384  
0.7031707387  
0.6378434397  
0.5589391466  
0.4666287982  
0.3624006298  
0.2492666332  
0.1317751036  
0.01578667071  
-0.09198079367  
-0.1845965544  
-0.255687471  
-0.3002437185  
-0.3153515536  
-0.3007612119  
-0.2592063203  
-0.1964148108  
-0.1208004734  
-0.04284180483  
0.02578546368  
0.07328215462  
0.08886549633  
0.06391598884  
-0.00700405439  
-0.125340432  
-0.2880512067  
-0.4874924261  
-0.7117336632  
-0.9453165579  
-1.170438718  
-1.368469424  
-1.521696156  
-1.615112583  
-1.638073309  
-1.585595278  
-1.459157067  
-1.266824255  
-1.022679729  
-0.7455476042  
-0.4571595282  
-0.1799322789  
0.06536471985  
0.2617874474  
0.3979507256  
0.4691065982  
0.477436841  
0.4314959415  
0.3449163706  
0.2345320945  
0.1181706795  
0.01243028196  
-0.06929277057  
-0.1182513141  
-0.1311126966  
-0.1099560199  
-0.06154522946  
0.003987292762  
0.07483260303  
0.1393062399  
0.1875153428  
0.2126307612  
0.2116319601  
0.1854371449  
0.1384407735  
0.07756526668  
0.01100437699  
-0.05313584051  
-0.1080994307  
-0.149436608  
-0.1755649001  
-0.1878321086  
-0.1901497373  
-0.1882423021  
-0.1886569632  
-0.1977062558  
-0.2204950549  
-0.2601544119  
-0.3173988589  
-0.3904387781  
-0.4752251917  
-0.5659885078  
-0.655953479  
-0.7381375838  
-0.806120801  
-0.8546780208  
-0.8802192788  
-0.8810017733  
-0.8571055332  
-0.8102160221  
-0.7432605819  
-0.6599704366  
-0.5644304314  
-0.4606837636  
-0.3524279493  
-0.2428202017  
-0.1343955722  
-0.02907201225  
0.07178832586  
0.167302604  
0.2569974208  
0.3407754263  
0.418906991  
0.4920400803  
0.5611872992  
0.6276707842  
0.6929710108  
0.7584976253  
0.8252822233  
0.8936394052  
0.9628642698  
1.031050736  
1.095092846  
1.150934237  
1.194058558  
1.220193681  
1.226120473  
1.210467749  
1.174332674  
1.121563028  
1.058616198  
0.9939184407  
0.9367674878  
0.895891123  
0.8778628364  
0.8856074486  
0.9172785599  
0.9657265799  
1.018728474  
1.060039598  
1.071195063  
1.033869314  
0.9324872515  
0.7567356333  
0.5035725647  
0.1784400613  
-0.2045839679  
-0.6237497331  
-1.051647238  
-1.458042809  
-1.813164082  
-2.091033637  
-2.27240082  
-2.346892302  
-2.314118784  
-2.183606561  
-1.973571181  
-1.70871734  
-1.417351063  
-1.128175516  
-0.8671539479  
-0.6548176068  
-0.5043177512  
-0.4204168146  
-0.3995041287  
-0.4305687485  
-0.4970097854  
-0.5789840083  
-0.6560305808  
-0.7096293874  
-0.7254055529  
-0.6947311582  
-0.6155524106  
-0.4923889023  
-0.335508989  
-0.1594290656  
0.01908709956  
0.1832453155  
0.3183826582  
0.4137951285  
0.4639979363  
0.4692587013  
0.4353449599  
0.3725355106  
0.2940473514  
0.2141061501  
0.1459483363  
0.1000429117  
0.08277693369  
0.09580035565  
0.1360885781  
0.1966987599  
0.2680680061  
0.3396433133  
0.4015616581  
0.4461265685  
0.4688475446  
0.4689047276  
0.4490005301  
0.4146527431  
