58.93778708  
60.97826746  
67.28298422  
73.05675212  
43.82728542  
5615.082226  
48432.72531  
59144.65293  
14071.06409  
12535.2669  
8482.179087  
44779.37899  
19313.89251  
6204.09907  
35899.64056  
13280.06869  
25302.27645  
19846.99656  
10442.07044  
18623.28246  
18611.66651  
6672.288373  
738.4521694  
3414.531664  
9541.736381  
4605.750301  
2016.644293  
428.2981163  
3441.163821  
2087.321387  
355.8979  
2940.716168  
9804.990495  
2305.920777  
1813.167905  
3.001854508  
6017.909949  
2327.565478  
6610.43458  
2940.716052  
5300.416817  
6873.909308  
1942.252068  
9353.027628  
1473.755066  
3252.358291  
1530.274345  
1026.150637  
3339.069871  
2603.052911  
1879.628275  
1540.560808  
1120.370003  
2995.531487  
799.2271151  
1772.167167  
1844.149184  
4406.057968  
405.5477061  
2118.63441  
175.5920346  
1237.237383  
317.458625  
726.5056914  
5.046287468  
145.5938097  
14.68512189  
74.12689736  
41.06293795  
91.25891706  
50.57754123  
4.879101365  
15.98456688  
4.880812707  
1.117614053  
6.428646032  
8.644582245  
1.987572522  
1.667288292  
2.978482005  
1.9234274  
2.499667262  
1.834097808  
2.233167493  
0.8955121895  
1.762928799  
1.56938991  
1.449724858  
1.528481428  
1.373711266  
1.33324104  
1.317910528  
1.305826877  
1.24046636  
1.248707577  
1.181584184  
1.102157737  
1.124329976  
1.052295108  
1.071784888  
1.035454236  
1.022667486  
0.9816611421  
0.9695473816  
0.9578939168  
0.9301289324  
0.9105586529  
0.8907502022  
0.8784036521  
0.8567607802  
0.8411242077  
0.8264956865  
0.8092009962  
0.794560684  
0.7804902426  
0.7659566788  
0.7526742687  
0.7390542298  
0.7263459871  
0.7139403312  
0.7012605225  
0.6892824355  
0.6779721109  
0.6664894085  
0.6553823071  
0.6446122652  
0.6345116049  
0.6241340139  
0.6142574109  
0.6047599057  
0.5952549418  
0.5861572114  
0.5772880607  
0.5686218091  
0.5600442105  
0.5518224981  
0.5436771707  
0.53579665  
0.528075418  
0.5205125254  
0.5131684683  
0.5059762996  
0.4989506463  
0.4920809235  
0.4853637315  
0.4787939358  
0.47238913  
0.466098952  
0.4599558363  
0.4539451074  
0.4480724652  
0.4423015557  
0.4366654603  
0.4311542079  
0.4257515576  
0.4204673221  
0.4152779261  
0.4102125434  
0.4052294503  
0.4003486754  
0.395572931  
0.3908949483  
0.386313236  
0.3818001837  
0.3773886844  
0.3730693706  
0.3688269971  
0.3646549071  
0.3605682777  
0.3565657398  
0.3526241883  
0.3487696626  
0.3449778468  
0.3412549432  
0.337604736  
0.3340214592  
0.3304910576  
0.3270376377  
0.3236378865  
0.3203038301  
0.3170231444  
0.3138087343  
0.3106401138  
0.3075280451  
0.30447287  
0.3014684591  
0.2985101576  
0.2956093589  
0.2927512695  
0.2899519843  
0.2871870338  
0.2844688945  
0.2818061919  
0.279175634  
0.2765939395  
0.2740488607  
0.2715512438  
0.2690930961  
0.2666775655  
0.2642864134  
0.2619445693  
0.2596402564  
0.2573634584  
0.2551223178  
0.2529308338  
0.2507559212  
0.2486127415  
0.2465154702  
0.2444473168  
0.242410323  
0.2404067106  
0.2384250086  
0.2364715235  
0.234555324  
0.2326585369  
0.2307989457  
0.228957612  
0.2271564335  
0.2253702353  
0.2236096007  
0.2218776159  
0.220169998  
0.218488744  
0.2168252378  
0.215196016  
0.2135798299  
0.2119926738  
0.2104186599  
0.2088783483  
0.2073454317  
0.2058483123  
0.204365466  
0.2029012742  
0.2014588132  
0.2000409696  
0.1986315965  
0.1972509901  
0.1958800681  
0.194537888  
0.193206947  
0.1918907376  
0.1905982467  
0.189321729  
0.1880597612  
0.1868166597  
0.1855875431  
0.1843778571  
0.1831790291  
0.1819997896  
0.1808360866  
0.1796819601  
0.1785399653  
0.1774230274  
0.1763202145  
0.1752259819  
0.1741467533  
0.1730739536  
0.1720231519  
0.1709812943  
0.169962722  
0.1689409153  
0.1679463981  
0.1669572005  
0.1659784869  
0.1650173226  
0.1640593163  
0.1631216056  
0.1621978713  
0.1612749401  
0.1603735267  
0.159471835  
0.1585854839  
0.157715068  
0.1568508228  
0.1559999307  
0.1551504563  
0.1543164265  
0.1534985006  
0.1526814432  
0.1518794055  
0.1510826382  
0.1502990585  
0.1495219606  
0.1487577577  
0.1480030941  
0.1472531288  
0.1465048487  
0.1457759489  
0.1450472468  
0.1443340017  
0.1436305185  
0.1429282608  
0.1422443603  
0.1415632145  
0.1408877662  
0.1402118666  
0.1395558662  
0.1389049992  
0.1382624017  
0.1376252339  
0.1369946564  
0.1363736248  
0.1357627115  
0.1351534136  
0.1345515969  
0.13395345  
0.1333678702  
0.1327815163  
0.1322075099  
0.1316474265  
0.1310765033  
0.1305289564  
0.1299764447  
0.1294333604  
0.1288896117  
0.128357429  
0.127838868  
0.1273178922  
0.1268001755  
0.1262968199  
0.1257884694  
0.1252931963  
0.1248025424  
0.1243200854  
0.1238434413  
0.1233581339  
0.1228935384  
0.1224243032  
0.1219633108  
0.1215146899  
0.1210618256  
0.1206196987  
0.1201793229  
0.1197470956  
0.1193147049  
0.1188930043  
0.1184739224  
0.1180523063  
0.117639647  
0.1172337388  
0.116833375  
0.1164378401  
0.1160452151  
0.1156583685  
0.1152709073  
0.1148863421  
0.1145193796  
0.1141485117  
0.1137727673  
0.1134138247  
0.1130550157  
0.1127003495  
0.1123469184  
0.1120000159  
0.1116556667  
0.1113178672  
0.1109802462  
0.1106456679  
0.1103199992  
0.1099978216  
0.1096746455  
0.1093560547  
0.1090464717  
0.1087365851  
0.1084247216  
0.1081227555  
0.1078272144  
0.1075282664  
0.1072356104  
0.1069444731  
0.106660891  
0.1063821358  
0.1060975172  
0.1058214914  
0.1055502113  
0.1052782219  
0.1050138832  
0.104756898  
0.1044985162  
0.1042394478  
0.1039816345  
0.1037381728  
0.1034857241  
0.1032414291  
0.1030012818  
0.1027573615  
0.1025245095  
0.102292649  
0.102058426  
0.1018309806  
0.1016062037  
0.1013892685  
0.1011693976  
0.1009537738  
0.100741038  
0.1005291199  
0.1003220322  
0.1001148123  
0.09991447878  
0.0997104541  
0.09951450239  
0.09932711083  
0.09912976835  
0.09894342358  
0.09875673396  
0.0985730132  
0.09839442449  
0.09821017318  
0.09803255182  
0.09785886056  
0.097688612  
0.09752014656  
0.09735363586  
0.09719247716  
0.09702999643  
0.09686919666  
0.09671703793  
0.09655708699  
0.09639856152  
0.09625574554  
0.09610795795  
0.09596374058  
0.09581511091  
0.09567870622  
0.09554120379  
0.09540101153  
0.09526572386  
0.09513813704  
0.09500815832  
0.0948748583  
0.09475418152  
0.0946289569  
0.09451226978  
0.0943923079  
0.09427935755  
0.09416164452  
0.09404789364  
0.09393933363  
0.09383295705  
0.09372643144  
0.09362142982  
0.09352373712  
0.09341606057  
0.0933191437  
0.09322669299  
0.0931324884  
0.09304401838  
0.09295662582  
0.09286486278  
0.09278108859  
0.09270029966  
0.09261746474  
0.09253601226  
0.09245733604  
0.09238573421  
0.09230902208  
0.09223960925  
0.09217136638  
0.09210219592  
0.09203980461  
0.09197310923  
0.09191198019  
0.09185473067  
0.09179793141  
0.09174078214  
0.09168673132  
0.09163594204  
0.09158483823  
0.09153822831  
0.09149275859  
0.09144570866  
0.09140958603  
0.09136763947  
0.09132569553  
0.09128641053  
0.09125361515  
0.09122296555  
0.09119294386  
0.09116293892  
0.09113320001  
0.09111037035  
0.09108607915  
0.09106661375  
0.09105041127  
0.09102393066  
0.09101090935  
0.09100041376  
0.09098323762  
0.0909755667  
0.09096595581  
0.09096306062  
0.09095558165  
0.09095242832  
0.09094948725  
