0.3491916206  
-0.02605626051  
-0.3920852971  
-0.7412692771  
-1.067218855  
-1.365176343  
-1.632146229  
-1.866747227  
-2.068799223  
-2.238732815  
-2.376918597  
-2.483064604  
-2.55578968  
-2.59248778  
-2.5895322  
-2.542816571  
-2.448572758  
-2.30434795  
-2.109993219  
-1.868496724  
-1.586518888  
-1.274509711  
-0.9463566327  
-0.6185675067  
-0.3090659919  
-0.03571789972  
0.1852400137  
0.3406946478  
0.4219098205  
0.4253996155  
0.353331109  
0.2134237526  
0.01835258652  
-0.2152667221  
-0.4682277073  
-0.7202780436  
-0.9517447897  
-1.145091302  
-1.286296151  
-1.365934742  
-1.37988583  
-1.329587142  
-1.22181129  
-1.067954764  
-0.8828732612  
-0.6833525177  
-0.4863214112  
-0.3069901783  
-0.1570910263  
-0.04343945847  
0.03299948349  
0.07737514372  
0.1004578987  
0.1173873804  
0.1457496498  
0.2031791688  
0.304767341  
0.4605959715  
0.6737442579  
0.9390764163  
1.243025012  
1.564479438  
1.876724853  
2.15024179  
2.356041168  
2.469108517  
2.47151923  
2.354784451  
2.121115054  
1.783398972  
1.363888724  
0.8917534294  
0.3998149849  
-0.07910204097  
-0.5157291913  
-0.8873755146  
-1.180024736  
-1.389283736  
-1.520103592  
-1.585357424  
-1.60352559  
-1.595814638  
-1.583115241  
-1.583185929  
-1.608406619  
-1.664350842  
-1.749301692  
-1.854732898  
-1.96663915  
-2.067520872  
-2.138749462  
-2.163021283  
-2.126592622  
-2.021046472  
-1.84436881  
-1.60123943  
-1.302498082  
-0.9638773298  
-0.6041593392  
-0.2430108617  
0.1012278703  
0.4135092732  
0.6835326187  
0.9065129595  
1.083168262  
1.21895711  
1.32269719  
1.404805239  
1.475431935  
1.542793528  
1.611948301  
1.684199223  
1.757187194  
1.825628772  
1.882545001  
1.920752888  
1.934357705  
1.919993398  
1.877616766  
1.810734486  
1.726052069  
1.632619636  
1.540628282  
1.460051375  
1.399345267  
1.364382908  
1.357757888  
1.378522019  
1.422354431  
1.482101598  
1.548591839  
1.611595791  
1.66082868  
1.686886207  
1.682044341  
1.640887411  
1.560729837  
1.441840217  
1.28745087  
1.103559529  
0.8985094418  
0.6823554879  
0.4660203063  
0.2602853578  
0.0746892481  
-0.0835614199  
-0.2105280955  
-0.3061771629  
-0.3745787169  
-0.4235796684  
-0.4639123097  
-0.50780868  
-0.5672505318  
-0.6520875327  
-0.768285846  
-0.9165895563  
-1.09183682  
-1.283098099  
-1.474679332  
-1.647918281  
-1.783556905  
-1.864380258  
-1.877749846  
-1.817650466  
-1.685927955  
-1.492499158  
-1.254459676  
-0.9941799933  
-0.7366286413  
-0.5062885696  
-0.3240794952  
-0.2047356123  
-0.1549816864  
-0.1727748274  
-0.2476923833  
-0.3623969114  
-0.4949558697  
-0.6216715973  
-0.7200322008  
-0.7713819594  
-0.7629850681  
-0.6892467113  
-0.552004168  
-0.3599226851  
-0.1271560083  
0.1284834031  
0.3875660072  
0.6310148315  
0.84178346  
1.006070906  
1.114020618  
1.159912895  
1.141942829  
1.061718517  
0.9236314037  
0.7342303632  
0.5017049486  
0.2355225672  
-0.05378938131  
-0.3547635156  
-0.6551146388  
-0.9419459012  
-1.202131015  
-1.422913145  
-1.592712745  
-1.702079756  
-1.744681179  
-1.718162287  
-1.624738409  
-1.471371541  
-1.269444919  
-1.033919963  
-0.7820325388  
-0.5316670026  
-0.2995990609  
-0.09983676104  
0.05772726427  
0.1681740914  
0.2318092072  
0.2537918227  
0.2432059815  
0.2117158258  
0.1720055422  
0.1362235104  
0.1146334611  
0.1146276267  
0.1402017918  
0.1919002529  
0.2671810705  
0.3610908494  
0.4671143827  
0.5780525058  
0.6868128936  
0.7870283006  
0.8734593268  
0.9422009055  
0.9907064566  
1.017713692  
1.023104378  
1.007763989  
0.9734518566  
0.9226976977  
0.8587057339  
0.7852304085  
0.7064139053  
0.6265480235  
0.5497701438  
0.4797119518  
0.41912795  
0.3695749965  
0.3311846206  
0.3025930891  
0.281056159  
0.2627696228  
0.2433610914  
0.2185084857  
0.1846019291  
0.1393473707  
0.08221874125  
0.01467315369  
-0.0599215483  
-0.1366519577  
-0.2096752709  
-0.273001727  
-0.3213192431  
-0.3507258932  
-0.3592428292  
-0.3470134414  
-0.3161523597  
-0.2702484753  
-0.2136237106  
-0.1504677999  
-0.08401201893  
-0.01590949714  
0.05405636971  
0.1278522662  
0.2086726211  
0.300087073  
0.4050058072  
0.524651793  
0.6577390439  
0.8000302925  
0.9443955899  
1.081390851  
1.200311738  
1.2905651  
1.343153145  
1.352036916  
1.315140201  
1.234832646  
1.11778766  
0.9742217334  
0.8166202566  
0.65813539  
0.5108941822  
0.3844693125  
0.2847419302  
0.2133276637  
0.1676337697  
0.1415410638  
0.1265914129  
0.1134920911  
0.09369635085  
0.06081962479  
0.01166243001  
-0.053309076  
-0.1301022731  
-0.2119288884  
-0.2904069722  
-0.3570411008  
-0.40473455  
-0.4290962467  
-0.4293201683  
-0.4084982303  
-0.3733072723  
-0.3331172789  
-0.2986636513  
-0.2804789275  
-0.2873374101  
-0.3249413306  
-0.395045533  
-0.4951431531  
-0.6187383221  
-0.7561509153  
-0.8957148726  
-1.025183372  
-1.133132569  
-1.210175747  
-1.249849258  
-1.249075624  
-1.208201717  
-1.130659582  
-1.022344305  
-0.89083547  
-0.7445745617  
-0.5921095085  
-0.441461408  
-0.2996491958  
-0.1723623129  
-0.06375019521  
0.02370036868  
0.08923631984  
0.1338626945  
0.1603155119  
0.1729437467  
0.1774757106  
0.1806210699  
0.1895113678  
0.2109813618  
0.2507546797  
0.3126101532  
0.3976452412  
0.5037469424  
0.6253751151  
0.7537370846  
0.8773751368  
0.9831462598  
1.057508127  
1.087983871  
1.064644188  
0.9814211867  
0.8370957375  
0.6358107236  
0.3870291146  
0.1049110515  
-0.1928547005  
-0.4866469255  
-0.7567719689  
-0.985389106  
-1.158273777  
-1.26620964  
-1.305833563  
-1.279816629  
-1.196346234  
-1.067958904  
-0.9098666384  
-0.7379906679  
-0.5669658343  
-0.4083950763  
-0.2696021819  
-0.1530708863  
-0.05664813185  
0.02551001646  
0.1014120645  
0.1793641156  
0.2660753101  
0.3650663741  
0.475654203  
0.5927150692  
0.7072856  
0.8079354416  
0.8826898718  
0.9212018074  
0.9167988688  
0.8680502662  
0.7795618954  
0.6618188584  
0.5300572432  
0.4022920548  
0.2967740046  
0.2292482657  
0.2104392718  
0.2441397292  
0.3262454343  
0.4449019301  
0.5817981175  
0.714454706  
0.8192226716  
0.8745752934  
0.8642397615  
0.7797232428  
0.6218563398  
0.4011183005  
0.136670736  
-0.1457939543  
-0.4171094146  
-0.6482018475  
-0.8136789346  
-0.894969929  
-0.882587383  
-0.7772296526  
-0.5895783996  
-0.3388544382  
-0.05034251769  
0.2477553679  
0.5277014706  
0.7653882356  
0.9428747275  
1.049997173  
1.084885718  
1.053383346  
0.9675131035  
0.8432573563  
0.6980099467  
0.5480605462  
0.4064751118  
0.2816484186  
0.1766876726  
0.0896781726  
0.01473712338  
-0.05634025123  
-0.13212498  
-0.219599451  
-0.3225119393  
-0.4402865159  
-0.5676558708  
-0.6950553802  
-0.8097220697  
-0.897319995  
-0.9438519825  
-0.9375851144  
-0.8707074919  
-0.7405082933  
-0.5499250193  
-0.3074211371  
-0.02621972255  
0.2769587836  
0.583491762  
0.8745628361  
1.132789134  
1.343590148  
1.496188562  
1.584172384  
1.605629898  
1.562896376  
1.461999961  
1.311905995  
1.123654598  
0.9094912418  
0.6820371002  
0.4535549312  
0.2353201956  
0.03709962466  
-0.133266643  
-0.2701983232  
-0.3706133972  
-0.4340687733  
-0.4627890977  
-0.4615422991  
-0.437352393  
-0.3990205976  
-0.3564552638  
-0.3198506232  
-0.2987538866  
-0.301116837  
-0.3324355697  
-0.3950830677  
-0.4879409926  
-0.6064033034  
-0.7427680384  
-0.8870101297  
-1.027841187  
-1.153935877  
-1.255172337  
-1.323717993  
-1.354826986  
-1.347235502  
-1.303122124  
-1.227644717  
-1.128141369  
-1.013128625  
-0.8912451013  
-0.7703024425  
-0.6565721619  
-0.5543880141  
-0.4660920449  
-0.3922847795  
-0.3322921329  
-0.2847324771  
-0.2480507796  
-0.22091416  
-0.2023831321  
-0.1918450819  
-0.188736134  
-0.1921250086  
-0.2002799544  
-0.2103281249  
-0.218116479  
-0.2183529898  
-0.2050347523  
-0.1721440614  
-0.1145131878  
-0.02874980454  
0.08594111703  
0.2271583976  
0.3890601042  
0.5625387588  
0.7358348307  
0.8955443292  
1.027923655  
1.120356748  
1.162808704  
1.149099148  
1.077841034  
0.9529134909  
0.7834089096  
0.5830249617  
0.368960904  
0.1604116268  
-0.023186239  
-0.1639782948  
-0.2473908648  
-0.2635236659  
-0.2080724622  
-0.08268530627  
0.1053023826  
0.3437208141  
0.6169182178  
0.9074454492  
1.197873964  
1.472518892  
1.71885125  
1.928414753  
2.097143312  
2.225037303  
2.315271921  
2.372875319  
2.403197854  
2.410419916  
2.396344631  
2.359686637  
2.295984321  
2.198177549  
2.057776526  
1.866461008  
1.617866239  
1.309282753  
0.9430009039  
0.5270653271  
0.0753008247  
-0.3934392076  
-0.8567443777  
-1.290664656  
-1.672041154  
-1.980864431  
-2.202361171  
-2.328556566  
-2.35911477  
-2.301353732  
-2.169435464  
-1.982823673  
-1.764207829  
-1.537125744  
-1.323577286  
-1.141890238  
-1.005075377  
-0.9198367303  
-0.8863169482  
-0.8985699389  
-0.9456651556  
-1.013258528  
-1.085424057  
-1.146513098  
-1.182839179  
-1.183998408  
-1.143720546  
-1.060195513  
-0.9358915917  
-0.7769548599  
-0.5922964661  
-0.3925258584  
-0.1888597135  
0.007865969409  
0.1880009752  
0.343664689  
0.4690996568  
0.5608332254  
0.6176856564  
0.6406624856  
0.6327717714  
0.598761353  
0.5447767059  
0.4779228556  
0.4057075606  
0.3353911258  
0.2732713344  
0.2239857184  
0.1899304185  
0.1709180006  
0.1641582036  
0.1646406192  
0.165902985  
0.1611192185  
0.1443544671  
0.1117938687  
0.06272115087  
5.391352804e-05  
-0.0697191562  
-0.1372321888  
-0.1915142653  
-0.2216685339  
-0.2186994939  
-0.1771856401  
-0.09650976968  
0.01859889278  
0.1583341585  
0.3088982148  
0.4542608237  
0.5783438436  
0.6672961632  
0.7115060252  
0.7070380364  
0.6562634875  
0.5675859445  
0.4542948549  
0.3327241741  
0.2199850428  
0.1315989411  
0.07937291191  
0.06980314728  
0.1032111357  
0.173703814  
0.2699412343  
0.3765745145  
0.4761521171  
0.5512387382  
0.5864804874  
0.5703967175  
0.496704173  
0.36507518  
0.1812867024  
-0.04320881944  
-0.2922105825  
-0.5460891917  
-0.7833687343  
-0.9824487417  
-1.123348814  
-1.189368178  
-1.168558486  
-1.054918897  
-0.8492168672  
-0.5593505825  
-0.2001775224  
0.2072362396  
0.6369538757  
1.060036083  
1.446829441  
1.769490397  
2.004505978  
2.13495132  
2.152219795  
2.056992651  
1.859314534  
1.577701641  
1.237375167  
0.8677775084  
0.4996528919  
0.162021229  
-0.1206164121  
-0.3305183788  
-0.4581600374  
-0.50275853  
-0.4718480973  
-0.379992518  
-0.2468241433  
-0.09466012514  
0.05400964886  
0.1788892429  
0.263845293  
0.2982898588  
0.2778750668  
0.2044657062  
0.085444173  
-0.06753503105  
-0.2401647356  
-0.4172819901  
-0.5846200012  
-0.7303224295  
-0.8460399909  
-0.9275015092  
-0.9745009317  
-0.990328139  
-0.9807331972  
-0.9525926092  
-0.9124684737  
-0.8653043006  
-0.8134448368  
-0.7561743739  
-0.6898482633  
-0.6086377599  
-0.5057864335  
-0.3752025704  
-0.2131225328  
-0.01957327899  
0.2006474572  
0.4376807321  
0.6771308515  
0.9013838958  
1.091585424  
1.230011496  
1.30248613  
1.300473823  
1.222489917  
1.074593052  
0.8698215638  
0.6266413795  
0.3666090383  
0.111603699  
-0.1189535553  
-0.3104525915  
-0.4546554288  
-0.5502322401  
-0.602202466  
-0.6204066231  
-0.6172932018  
-0.6054154364  
-0.5950895689  
-0.592605745  
-0.5993073905  
-0.6116728481  
-0.6223601556  
-0.6220060687  
-0.6014291353  
-0.5538265182  
-0.4765473463  
-0.3721187877  
-0.2483170757  
-0.1172617432  
0.006320231318  
0.1073783665  
0.1729738131  
0.1944585144  
0.16902318  
0.1003567482  
-0.001708753533  
-0.1225073759  
-0.2446055163  
-0.3502851707  
-0.4240623704  
-0.4548453199  
-0.4373933178  
-0.3728707171  
-0.2684078727  
-0.135763331  
0.0106998104  
0.156399783  
0.2889042494  
0.3999178968  
0.4865738858  
0.5518271549  
0.6038789424  
0.6547045625  
0.7178936298  
0.8061001028  
0.9284826133  
1.088506183  
1.282440687  
1.498809936  
1.718918882  
1.918447527  
2.069957728  
2.14604252  
2.122741667  
1.982809704  
1.718416909  
1.332929097  
0.8414953975  
0.2703297181  
-0.3452888069  
-0.9641141761  
-1.542794669  
-2.040090979  
-2.420963353  
-2.660062743  
-2.744232647  
-2.673714963  
-2.461934992  
-2.133892366  
-1.723344343  
-1.269127661  
-0.8110424996  
-0.3857778239  
-0.02333580854  
0.2556525228  
0.4414527143  
0.5354674102  
0.5492216601  
0.5022727182  
0.4193426033  
0.3270398951  
0.2505802956  
0.2108726143  
0.222288312  
0.2913220337  
0.4162387747  
0.587674661  
0.790067383  
1.003687526  
1.20701165  
1.379152214  
1.502076996  
1.562395395  
1.552573001  
1.471475503  
1.324255814  
1.121640452  
0.8787406834  
0.6135323145  
0.3451773373  
0.09234881687  
-0.1282957437  
-0.3033824886  
-0.4237429774  
-0.4849571651  
-0.4874946919  
-0.4364908086  
-0.3411759842  
-0.2140379408  
-0.0697669496  
0.07592828367  
0.2075599064  
0.3110650683  
0.3748938214  
0.3908968448  
0.3549411971  
0.2671972069  
0.1320682717  
-0.04223523038  
-0.2444406221  
-0.4611996466  
-0.6782188539  
-0.8814088139  
-1.057938356  
-1.197089281  
-1.290837018  
-1.33413558  
-1.3249186  
-1.263869827  
-1.154046349  
-1.000442074  
-0.8095699527  
-0.5891162849  
-0.3476869312  
-0.09462457556  
0.1601479468  
0.406320155  
0.6334845131  
0.8315632385  
0.9913812854  
1.10534468  
1.168159233  
1.177487034  
1.134431065  
1.043744684  
0.9137030464  
0.7556078163  
0.5829400773  
0.4102509813  
0.2518849071  
0.1206742047  
0.02674000167  
-0.02348701209  
-0.02792531  
0.01087392835  
0.08583988293  
0.1858882467  
0.2967832157  
0.4023000336  
0.4856159316  
0.5308372859  
0.5245598873  
0.457331885  
0.3248915822  
0.1290364099  
-0.1220084156  
-0.413812367  
-0.726609509  
-1.036793103  
-1.318946855  
-1.548230011  
-1.702888401  
-1.766608853  
-1.730429434  
-1.593961291  
-1.365730805  
-1.062561003  
-0.7080350113  
-0.3301817918  
0.04134795818  
0.3782917915  
0.6566163771  
0.8588467527  
0.9756189468  
1.006277789  
0.9584869568  
0.8469229399  
0.6912523893  
0.5136802169  
0.336373616  
0.1790899615  
0.05727790585  
-0.01916977716  
-0.04640471615  
-0.02637452187  
0.03406956061  
0.1245272874  
0.2326655928  
0.3458654477  
0.4526996173  
0.5440805308  
0.6139724991  
0.6596291629  
0.6813758688  
0.682017457  
0.6659885569  
0.6383872148  
0.6040470631  
0.5667767109  
0.5288781226  
0.4910099688  
0.4523962778  
0.4113625219  
0.3660821125  
0.3154213983  
0.25972913  
0.2014076867  
0.1451430907  
0.09769810767  
0.06723929679  
0.06223669381  
0.09005686653  
0.1554154109  
0.2589265447  
0.3959785509  
0.5561658203  
0.7234414082  
0.8770877231  
0.9934798383  
1.048506713  
1.020418017  
0.8927636503  
0.6570554708  
0.3147866291  
-0.1215204451  
-0.6284496126  
-1.173094698  
-1.715667142  
-2.213059712  
-2.623021351  
-2.908463397  
-3.04140387  
-3.006062573  
-2.800710464  
-2.43802023  
-1.943841676  
-1.354523205  
-0.7130901099  
-0.06474452535  
