50.67143178  
57.74085749  
77.0734657  
130.4131692  
171.7311455  
12507.23449  
57076.15753  
25615.3129  
10552.96941  
44334.27338  
77832.02782  
11804.93132  
2899.637124  
29010.25454  
37666.4098  
29640.96411  
1815.833997  
11999.81268  
4741.801688  
9331.037235  
3301.874946  
6145.969583  
8715.996981  
3056.696105  
4373.900025  
8619.067888  
413.2643391  
2659.021217  
6456.097522  
4341.856779  
8747.645377  
1282.957627  
101.8254636  
702.7407478  
3875.058491  
3445.37693  
309.4115496  
5097.527323  
12708.74601  
1167.606789  
476.1811961  
8322.005143  
1589.921998  
302.2236371  
2919.898988  
4314.199947  
2456.840651  
468.929753  
3107.602321  
1243.457686  
172.5414458  
425.6345205  
1742.957784  
698.8025495  
55.16595586  
1467.00031  
677.3009938  
375.1128552  
1087.455503  
218.3342304  
567.4086918  
570.639488  
321.4447328  
513.0986444  
80.46129265  
136.8004882  
151.617507  
130.3528462  
31.26641072  
12.27625524  
34.77192351  
50.41520684  
2.992705547  
2.436538987  
2.526225311  
3.673380019  
2.021561885  
0.4375218051  
0.4896585832  
0.3415986638  
0.2912872585  
0.02210672086  
0.0006969462336  
0.228804815  
0.3016055262  
0.04013962526  
0.1172828358  
0.07390575423  
0.0153983494  
0.02926511116  
0.04721463105  
0.05954322359  
0.01977223113  
0.01401627688  
0.0208964668  
0.01326226816  
0.0301997904  
0.02263047043  
0.02207416747  
0.01773749931  
0.0161227339  
0.01848455237  
0.01728548718  
0.016390057  
0.0142814272  
0.01576740837  
0.01390646306  
0.01270580446  
0.01289609112  
0.01259190658  
0.0119746515  
0.01135451961  
0.01061313562  
0.01061345257  
0.01031387453  
0.009719708256  
0.00964076558  
0.009058192645  
0.008996479989  
0.008578578672  
0.008224225149  
0.008019794771  
0.00768294414  
0.007542171822  
0.007191405417  
0.006920971022  
0.006723176316  
0.00652013053  
0.006338344794  
0.006139239989  
0.005946479352  
0.005803033069  
0.005615299418  
0.005437225128  
0.005270534501  
0.005113900683  
0.004994218732  
0.004841955237  
0.004717095825  
0.004583095386  
0.004448379045  
0.004328158629  
0.004213851203  
0.004112870631  
0.003995812149  
0.003897827923  
0.003789356613  
0.003696140296  
0.003605044894  
0.003512012113  
0.003426250549  
0.003340776775  
0.003259876751  
0.003181506678  
0.003105137238  
0.003033597145  
0.002961905707  
0.002893399681  
0.002826901392  
0.002761914197  
0.002700254147  
0.002639057577  
0.002581017015  
0.002524659262  
0.002469812176  
0.00241641471  
0.002364747167  
0.002314899684  
0.002265391512  
0.002219767909  
0.002173825288  
0.002128188387  
0.002085705311  
0.002043810696  
0.002002597968  
0.001963889295  
0.001924925469  
0.001887948945  
0.001852294197  
0.001816186147  
0.001782157311  
0.001748576509  
0.001716086006  
0.001684331959  
0.001653795836  
0.001623596224  
0.001594879692  
0.001565729174  
0.001538679561  
0.001511673508  
0.00148498329  
0.001459720438  
0.00143455314  
0.001410203447  
0.001386747064  
0.001363360377  
0.001341207117  
0.001319373612  
0.001297490051  
0.001276127225  
0.001255383318  
0.001236363526  
0.001216624658  
0.001197155337  
0.00117887941  
0.001160959244  
0.001142725895  
0.001125512503  
0.001108764053  
0.001091877463  
0.001075655193  
0.001060390867  
0.001044424892  
0.001029395741  
0.001014787327  
0.001000045917  
0.0009856967337  
0.0009717721663  
0.0009586338363  
0.0009458247294  
0.0009325464302  
0.0009199596781  
0.0009074398017  
0.0008952056287  
0.0008833532984  
0.0008711377028  
0.0008604395702  
0.0008492025602  
0.0008376987488  
0.0008266318649  
0.0008171200429  
0.0008064841566  
0.000796424356  
0.0007866771248  
0.0007771086178  
0.0007674970514  
0.0007582225091  
0.0007488685161  
0.0007401628568  
0.0007315514623  
0.00072238913  
0.0007140269725  
0.0007056243549  
0.0006978533209  
0.0006895016048  
0.0006816949146  
0.0006741948298  
0.0006664988942  
0.0006594740685  
0.000651655671  
0.0006444555585  
0.0006374676498  
0.0006309154153  
0.000624146532  
0.000617614253  
0.000610771665  
0.0006045288682  
0.0005983290742  
0.0005923778829  
0.0005863170231  
0.0005799906193  
0.0005746344141  
0.0005687011187  
0.0005626134816  
0.0005572653336  
0.0005519226271  
0.0005464286357  
0.0005409882044  
0.0005357596293  
0.000530710678  
0.0005258003748  
0.0005208060435  
0.0005161314456  
0.0005113003235  
0.0005068060302  
0.0005019416192  
0.0004975087302  
0.0004928448226  
0.0004883369872  
0.0004842643463  
0.0004800229225  
0.0004755399696  
0.0004718181172  
0.0004677317062  
0.0004640120252  
0.0004598064745  
0.0004558837385  
0.0004518524405  
0.0004484027624  
0.0004449609992  
0.0004408930232  
0.0004377332022  
0.0004342040628  
0.0004304986889  
0.0004272617162  
0.0004239104693  
0.0004205256717  
0.0004175271129  
0.0004139920096  
0.0004109296214  
0.0004078949593  
0.0004048306345  
0.0004015183788  
0.0003984998576  
0.000395660893  
0.0003929088616  
0.0003900991529  
0.0003872479665  
0.0003845264945  
0.0003816896863  
0.0003792220424  
0.0003764412214  
0.0003737440198  
0.000371510424  
0.0003690785318  
0.0003663831244  
0.0003641522282  
0.0003615477378  
0.0003590699169  
0.0003567331592  
0.0003543152447  
0.0003522498636  
0.0003499226408  
0.000347518012  
0.0003454519276  
0.0003433997387  
0.0003411355003  
0.0003391067169  
0.0003370516165  
0.0003350581988  
0.0003329651714  
0.0003310168767  
0.0003290716285  
0.0003271439362  
0.0003253185681  
0.0003231375285  
0.0003214980433  
0.0003196745739  
0.0003179624344  
0.0003161777226  
0.0003144562099  
0.0003124723431  
0.0003109212318  
0.0003093021083  
0.0003073841553  
0.0003059186076  
0.0003043699616  
0.0003027574784  
0.0003013705574  
0.0002996899176  
0.000298208222  
0.0002965597273  
0.0002950722625  
0.0002936543054  
0.0002921998029  
0.0002913530986  
0.0002895556992  
0.0002880670053  
0.0002866720891  
0.0002853130182  
0.0002841000925  
0.000282767988  
0.0002814287489  
0.000280224161  
0.0002787803448  
0.0002775657829  
0.0002767066936  
0.0002752554063  
0.000273960885  
0.0002727770255  
0.0002716909793  
0.0002704707554  
0.0002694894578  
0.0002681010072  
0.0002670744905  
0.0002659320332  
0.0002649079128  
0.0002639468486  
0.0002629846849  
0.0002621929314  
0.0002608193281  
0.000259939576  
0.0002590769321  
0.0002579776962  
0.0002573715677  
0.0002561461345  
0.000255144623  
0.0002541923833  
0.0002533853712  
0.0002527762613  
0.0002514705859  
0.0002509551816  
0.0002498579388  
0.0002490040056  
0.0002483092479  
0.0002474297883  
0.0002466501167  
0.0002458977249  
0.0002451067822  
0.0002444756987  
0.0002433676403  
0.0002428345678  
0.0002420275922  
0.0002412622601  
0.0002406302323  
0.0002397976508  
0.0002393481815  
0.0002386712798  
0.0002377395897  
0.0002372920261  
0.0002363613885  
0.0002357848441  
0.0002355492529  
0.0002347518684  
0.0002341750264  
0.0002334327629  
0.0002327407373  
0.0002322914444  
0.0002317985897  
0.0002310588203  
0.0002307968207  
0.0002298806796  
0.0002296336968  
0.0002291445341  
0.0002285514904  
0.0002281825172  
0.0002274627063  
0.0002269330194  
0.0002265260574  
0.0002261977914  
0.0002256042424  
0.0002251679308  
0.0002247713371  
0.000224270292  
0.0002238117235  
0.0002233098066  
0.0002230741856  
0.0002224294221  
0.0002221880506  
0.0002215392795  
0.0002213304724  
0.0002211141793  
0.0002204483906  
0.0002202435251  
0.0002198397561  
0.0002195526705  
0.000219233188  
0.0002189026023  
0.0002185001707  
0.0002182507615  
0.0002180392387  
0.0002177656319  
0.000217317021  
0.0002171654622  
0.000216877498  
0.0002164074655  
0.0002163950103  
0.0002160167166  
0.0002158959386  
0.0002154917386  
0.000215388176  
0.0002152986968  
0.0002149468088  
0.000214711369  
0.0002145430394  
0.0002142364738  
0.0002139088176  
0.000214010751  
0.0002138097454  
0.0002137488136  
0.0002133825975  
0.0002132612235  
0.0002131499614  
0.0002128773301  
0.0002129400572  
0.0002126925799  
0.0002128077957  
0.0002126916037  
0.0002123748264  
0.0002123260134  
0.0002121982829  
0.0002119934659  
0.000212133727  
0.0002119624067  
0.0002119523424  
0.0002118456024  
0.000211946551  
0.0002118440934  
0.0002118023371  
0.000211659578  
0.0002116051503  
0.0002114738983  
0.0002116681224  
0.0002118087888  
