770.4930869  
781.3191046  
810.6884609  
868.8309026  
694.6820263  
2078.996257  
4098.430266  
209.4341658  
3541.01954  
129832.3918  
32649.54432  
15105.97428  
2781.21473  
30833.76366  
2247.377469  
4688.851535  
10446.24682  
986.0715891  
28487.67509  
9200.682793  
27745.88921  
3518.041128  
5861.821121  
17869.05606  
4710.48013  
11289.90993  
4411.752665  
13887.77143  
493.1553705  
7378.969835  
7379.07943  
8846.684474  
312.2813644  
7266.902154  
915.4825192  
3483.48751  
3665.618517  
4464.192142  
11126.37224  
2785.179867  
21077.33005  
1294.396304  
350.8855059  
1387.500648  
3569.44037  
444.4510619  
1823.503271  
759.7815009  
4811.670091  
1686.915523  
1428.602716  
2779.289879  
694.7229233  
5884.500653  
2719.650027  
455.4196406  
196.445271  
844.1439713  
418.867822  
1946.112207  
1598.530825  
116.467129  
675.659272  
411.8812708  
517.2765115  
232.5085685  
42.34230114  
82.36620894  
165.0369002  
101.8286909  
80.63068681  
59.49853488  
28.36480011  
13.43927827  
7.024716114  
24.37792897  
29.39123777  
16.93115149  
11.32583588  
14.40084848  
12.24349231  
12.55039045  
7.495686156  
9.102200393  
7.632749663  
8.404272877  
6.692043797  
7.433269712  
5.939610167  
6.130914766  
5.417333425  
5.746330527  
5.134257552  
4.737439617  
4.561850371  
4.225933371  
4.124994102  
3.944116769  
3.790290992  
3.51860383  
3.442032721  
3.288455869  
3.147194819  
2.997964796  
2.878644069  
2.746953494  
2.634314516  
2.546629753  
2.447429407  
2.337788927  
2.247991425  
2.166189689  
2.080221702  
2.00670448  
1.939084021  
1.868332197  
1.799771772  
1.738522934  
1.678163438  
1.619720888  
1.565319145  
1.513320175  
1.463289135  
1.41579915  
1.369615556  
1.326679006  
1.284014372  
1.244393099  
1.206227434  
1.169406929  
1.134301538  
1.100256863  
1.067660382  
1.036331716  
1.006381193  
0.9775982229  
0.9499092731  
0.9231045714  
0.8974659705  
0.872733987  
0.8489038203  
0.8259664629  
0.8039453708  
0.7826207811  
0.7620977399  
0.7423207118  
0.7231679105  
0.7046846919  
0.686871421  
0.6697072021  
0.6530561905  
0.6370194538  
0.6214721447  
0.6064605692  
0.5919337322  
0.5778812285  
0.564304314  
0.5511430297  
0.5384110688  
0.5260656757  
0.5141131147  
0.502530013  
0.4912878193  
0.4804106519  
0.4698685339  
0.4596443415  
0.449708543  
0.4400842129  
0.4307519961  
0.4216661071  
0.4128504827  
0.4042944001  
0.3959902247  
0.3879242777  
0.3800753836  
0.3724432699  
0.3650394828  
0.3578436457  
0.3508229155  
0.3440084971  
0.3373805719  
0.3309329461  
0.3246634512  
0.3185369849  
0.3125923134  
0.3067950756  
0.3011606286  
0.2956596122  
0.2903093297  
0.2850825748  
0.2800046639  
0.2750512795  
0.270211121  
0.2654994375  
0.2609135647  
0.2564384054  
0.2520644335  
0.24780406  
0.2436487785  
0.2395829494  
0.2356127798  
0.2317466489  
0.2279741331  
0.2242908453  
0.2206772135  
0.2171685794  
0.2137326581  
0.2103807956  
0.2070940198  
0.2038876275  
0.2007545396  
0.1977000243  
0.1947060822  
0.191776734  
0.1889150573  
0.1861112712  
0.1833809159  
0.1807002581  
0.1780773755  
0.1755115428  
0.1730101329  
0.1705471705  
0.1681481347  
0.165795439  
0.1634957447  
0.161237002  
0.1590335506  
0.15686505  
0.1547526516  
0.1526737719  
0.1506439017  
0.1486429979  
0.146700211  
0.1447953727  
0.1429177845  
0.1410850557  
0.1392727168  
0.137509478  
0.1357778599  
0.1340855986  
0.1324159813  
0.1307904967  
0.1291958127  
0.1276223791  
0.126082584  
0.1245655654  
0.1230887353  
0.121634413  
0.1202037655  
0.1188058754  
0.1174303611  
0.1160844275  
0.114760995  
0.1134608681  
0.1121819664  
0.1109284996  
0.1097004876  
0.1084891645  
0.1073008048  
0.1061377676  
0.1049904263  
0.103865659  
0.1027612872  
0.1016755064  
0.1006095599  
0.09956160956  
0.09852265499  
0.09751775496  
0.09652607949  
0.09554522819  
0.09458402376  
0.09363825047  
0.09270507055  
0.0917983306  
0.09089401805  
0.09001034706  
0.08915046205  
0.08828839217  
0.08745306901  
0.08662792241  
0.08580800256  
0.0850204015  
0.08422618709  
0.0834499196  
0.08268988973  
0.08194031441  
0.08120628747  
0.08048339006  
0.0797623032  
0.07906587221  
0.07837244034  
0.07769588764  
0.07703109235  
0.07636571889  
0.07571520447  
0.07508093008  
0.07445526307  
0.07383349946  
0.07321805497  
0.07262350126  
0.07203005793  
0.07145239732  
0.07087563016  
0.07031422035  
0.06976086844  
0.06921113094  
0.06867328883  
0.06814107786  
0.06762229362  
0.06710673411  
0.06659489096  
0.06609908516  
0.06560523807  
0.0651215596  
0.06464175906  
0.06416987216  
0.06370275144  
0.06324569993  
0.06279954079  
0.06235371069  
0.06191549069  
0.06148703611  
0.06105900909  
0.0606433727  
0.06022947644  
0.05982038236  
0.05942134191  
0.05902830522  
0.05863313401  
0.05825216002  
0.05787224217  
0.0575018548  
0.05713259865  
0.05677201861  
0.05641252175  
0.0560563667  
0.05571034992  
0.05536358154  
0.05503028469  
0.05469917996  
0.05437421  
0.05405000233  
0.05372661828  
0.05340747118  
0.05310478637  
0.05279305151  
0.05249711862  
0.05219677329  
0.05190311473  
0.05161157647  
0.05132643415  
0.05104580581  
0.05076963983  
0.05049406478  
0.05022644987  
0.04995984877  
0.04970398608  
0.04943943615  
0.04918437811  
0.04893440634  
0.04868322754  
0.04843748339  
0.048195517  
0.04795930797  
0.04772310136  
0.04749119843  
0.04726525051  
0.0470373467  
0.04681465476  
0.04659656862  
0.04638318421  
0.04617146614  
0.04595916454  
0.04575306158  
0.04554883507  
0.04534853399  
0.0451456511  
0.04495452132  
0.04475883439  
0.04456812861  
0.04438129819  
0.04419425307  
0.04401494475  
0.04383423647  
0.04365362082  
0.04348178327  
0.04330703152  
0.04313753775  
0.04296916344  
0.04280925755  
0.04264444711  
0.04248566774  
0.04232946  
0.04217342416  
0.04201859587  
0.04186397886  
0.04171796258  
0.04156852589  
0.04142199897  
0.0412807094  
0.04114764973  
0.04100680709  
0.04087206966  
0.04073559203  
0.04060448214  
0.0404706954  
0.0403416455  
0.04021817929  
0.04009332224  
0.03997356076  
0.03985409539  
0.0397331894  
0.03961654273  
0.03950035091  
0.03938884731  
0.03927977556  
0.03916747194  
0.03906053041  
0.03895415539  
0.03884947129  
0.03875118538  
0.03864810743  
0.03854854422  
0.0384520681  
0.03835750174  
0.03826685132  
0.03817101712  
0.03808005557  
0.03799383432  
0.03790274728  
0.03781794659  
0.03773430988  
0.03765475342  
0.03757008491  
0.0374945916  
0.03741562758  
0.03734041569  
0.03726241893  
0.03719365932  
0.03711376527  
0.03704733379  
0.03697778057  
0.03691304355  
0.03684348859  
0.03678179378  
0.03671627674  
0.0366565394  
0.03659605336  
0.03653703311  
0.03648243334  
0.03642649761  
0.03636976852  
0.03631770822  
0.03626793202  
0.03621669313  
0.03616717998  
0.03611991898  
0.03607167954  
0.03602686674  
0.03598295769  
0.03594250713  
0.03590218817  
0.03586092226  
0.03582306624  
0.03578733722  
0.03574959651  
0.03571386874  
0.03568481065  
0.0356481708  
0.0356207983  
0.03559172359  
0.03556205429  
0.03553438654  
0.03550886358  
0.03548356235  
0.03546270616  
0.03544011532  
0.03542014809  
0.03540062698  
0.03538470466  
0.03536601566  
0.03534952969  
0.0353412032  
0.03532445413  
0.03531280919  
0.0353010092  
0.03529319515  
0.03528328368  
0.03527886198  
0.03527260876  
0.03526801442  
0.03526703207  
0.03526481251  
0.0352677118  
