791.0913397  
871.0396358  
1010.226194  
1346.941597  
4091.913943  
21587.33727  
12963.58274  
1688.368771  
17103.74429  
2846.053  
9743.337492  
523.1159011  
26505.3261  
33234.60842  
18883.17975  
18278.08208  
5712.579312  
2407.139324  
13381.28683  
4986.944974  
15875.12249  
14156.44706  
18965.21769  
13589.73676  
7382.548211  
13291.17002  
9047.593785  
15262.07398  
13301.77949  
8807.408363  
9250.074967  
19564.2121  
8746.941643  
21457.65126  
8203.400774  
9101.384529  
2689.998799  
17967.37253  
6361.876606  
267.3012616  
923.39921  
991.4288779  
1384.043124  
1420.129789  
7051.354682  
3984.24631  
14976.16868  
2712.161928  
76.11895866  
453.2380797  
1892.404864  
1715.425065  
2377.844039  
4296.243157  
680.0366252  
2517.824497  
2200.874352  
483.325529  
283.632038  
2580.524781  
652.3028174  
1389.964093  
548.0430179  
288.0594093  
30.49827171  
24.81838443  
27.33919055  
128.4011475  
106.0795876  
3.411319211  
30.94608988  
11.74296926  
20.49237135  
5.89456147  
8.563916958  
1.996072677  
9.503637036  
3.074935205  
5.876722186  
3.884784351  
2.796616796  
3.061980247  
2.533747592  
1.749656313  
1.872448433  
1.206726108  
1.140001489  
0.8576835851  
0.8401738181  
1.120915012  
0.8262605715  
0.8717555399  
0.7722633858  
0.7460024937  
0.5969779614  
0.5329969412  
0.5383391929  
0.4890918318  
0.430911981  
0.4192305261  
0.3948858961  
0.378864282  
0.3496717291  
0.3151952311  
0.3059250805  
0.276043657  
0.2615096115  
0.2487466844  
0.2330526128  
0.222149487  
0.2074973326  
0.196166321  
0.1842656938  
0.1733736823  
0.1650265079  
0.1555029349  
0.1475473265  
0.1402733508  
0.1326276639  
0.126359129  
0.1198043342  
0.1139587861  
0.1085157532  
0.1031758079  
0.09837306975  
0.09377825544  
0.08942843914  
0.08543199164  
0.08163501244  
0.07812082033  
0.07469185485  
0.07147580492  
0.06844370875  
0.06555965959  
0.06286348714  
0.06031866382  
0.0578870288  
0.0555850333  
0.05339115628  
0.05130896638  
0.04933880519  
0.04744516269  
0.04566674468  
0.04397033938  
0.04235147767  
0.0408095421  
0.03933848444  
0.03793586996  
0.03660516814  
0.03531866624  
0.03410467967  
0.03294290048  
0.03182337805  
0.03075811521  
0.02974002351  
0.02876661017  
0.02782919981  
0.02693301604  
0.02607816706  
0.02525718245  
0.02446555598  
0.02371080728  
0.02298281339  
0.02228466254  
0.02161350119  
0.02097201091  
0.02034980845  
0.01975643138  
0.01917986843  
0.0186287207  
0.0180938485  
0.01758211936  
0.01709354948  
0.0166179461  
0.01616397224  
0.01572241695  
0.01529447139  
0.01488757422  
0.01448881838  
0.01410887254  
0.01373888829  
0.01338304775  
0.01304236938  
0.01270692997  
0.01238351515  
0.01207377282  
0.01177466552  
0.01148426268  
0.01120162734  
0.01092838575  
0.01066798384  
0.01041387701  
0.01016371121  
0.009924212292  
0.009692412537  
0.009466305971  
0.009250055506  
0.009040532651  
0.008832860411  
0.008633663177  
0.008440841899  
0.008251519252  
0.008071186081  
0.007897819155  
0.007724532001  
0.007560087008  
0.00739772721  
0.007244054405  
0.007089657612  
0.006940538672  
0.006795798763  
0.00665875174  
0.006519728631  
0.00638884122  
0.006259720667  
0.006134090751  
0.006014203248  
0.005894676801  
0.005777772904  
0.005665433648  
0.00555450877  
0.0054490586  
0.005344274957  
0.005245419355  
0.00514401109  
0.005047788867  
0.004955232373  
0.004865740122  
0.004774956666  
0.004689639031  
0.004605375029  
0.004520902247  
0.004441038131  
0.004362613923  
0.00428622749  
0.004211628246  
0.004137863045  
0.004065623267  
0.003997199391  
0.003930792352  
0.003865287133  
0.003798039727  
0.003734951238  
0.003673535525  
0.003613477007  
0.003555769534  
0.003496836879  
0.003441264147  
0.0033846907  
0.003331018093  
0.003277504143  
0.00322648384  
0.003175861764  
0.003127297315  
0.003078413092  
0.003030622775  
0.002985492385  
0.002940359018  
0.002896317393  
0.002851378024  
0.002810477282  
0.002768990756  
0.002729542359  
0.002687219171  
0.002649703776  
0.002613535217  
0.002574453095  
0.002537857474  
0.002502991449  
0.002466648023  
0.002431780034  
0.00239933913  
0.002367419149  
0.002335267392  
0.002302047633  
0.002272500957  
0.002240393891  
0.00221206317  
0.002183511587  
0.002152205916  
0.00212519787  
0.002096716842  
0.00207178623  
0.002044099415  
0.002018093575  
0.001992057489  
0.001967784605  
0.001941547419  
0.001918721861  
0.001894208182  
0.001871314866  
0.001849296478  
0.00182549287  
0.001805391337  
0.00178395787  
0.00176232627  
0.001740501708  
0.001721105123  
0.001701550186  
0.001680364551  
0.001661635111  
0.001642590472  
0.001625309035  
0.001607230158  
0.001588957942  
0.001569954494  
0.001553709618  
0.00153550226  
0.001519745659  
0.001503062539  
0.001487302923  
0.001471232625  
0.001454810733  
0.001439954171  
0.00142526126  
0.001409435885  
0.001395264333  
0.001381625308  
0.001367723369  
0.001352904128  
0.001339121518  
0.001326089795  
0.001312650402  
0.00130012472  
0.001286995367  
0.00127427094  
0.001262240625  
0.001249724302  
0.001238596948  
0.001227385848  
0.00121512049  
0.001203530729  
0.001192618709  
0.001181478961  
0.001171567956  
0.001161324744  
0.001150174522  
0.001139806034  
0.001129474361  
0.001119855462  
0.00110989927  
0.001099552285  
0.001091205093  
0.0010821122  
0.001072880764  
0.001063410313  
0.001054284402  
0.001044982317  
0.001036378446  
0.001028600862  
0.001020291046  
0.001012397691  
0.001004167142  
0.0009955600996  
0.0009889674316  
0.0009815528162  
0.0009731289135  
0.0009657767955  
0.0009581141792  
0.0009513846626  
0.0009438804636  
0.0009360894295  
0.000930327834  
0.0009218035373  
0.0009161132404  
0.0009099792297  
0.0009040390234  
0.0008969113323  
0.0008904748804  
0.00088388518  
0.0008779443938  
0.000871884786  
0.0008666393907  
0.0008604303194  
0.0008556342728  
0.0008487165237  
0.0008434297743  
0.0008380508994  
0.0008325641976  
0.0008276459587  
0.0008217331236  
0.0008175338259  
0.0008111658559  
0.0008078231912  
0.0008018530493  
0.0007968238345  
0.0007927411291  
0.0007876711116  
0.0007841090083  
0.0007785871982  
0.0007744865303  
0.000769179804  
0.000765264951  
0.0007606372203  
0.0007579703316  
0.0007528186065  
0.000748868049  
0.0007451341001  
0.0007412225973  
0.0007371782941  
0.0007319800687  
0.0007295498903  
0.0007256552629  
0.0007224086818  
0.0007188068908  
0.0007149545268  
0.0007119478089  
0.0007083185063  
0.0007058070183  
0.0007021983198  
0.0006977506465  
0.0006950471463  
0.0006921428362  
0.0006890716949  
0.0006856235194  
0.0006830971722  
0.0006802707263  
0.0006779298388  
0.0006754343834  
0.000671686356  
0.0006691511125  
0.0006664416607  
0.000664045025  
0.0006612367516  
0.0006591716453  
0.0006558237518  
0.0006539567995  
0.0006517326573  
0.0006491170751  
0.0006465385965  
0.0006442463056  
0.000642497998  
0.0006401234905  
0.0006372876376  
0.0006358703607  
0.0006339057984  
0.0006316283458  
0.0006293634308  
0.0006276904629  
0.000626272825  
0.0006241145144  
0.00062253708  
0.0006202954268  
0.0006184402073  
0.0006176186999  
0.0006157168023  
0.0006139548434  
0.0006131472472  
0.0006105825802  
0.0006094103955  
0.0006078569486  
0.0006058778425  
0.000605532113  
0.0006044864925  
0.0006029111624  
0.0006011506499  
0.0006003722908  
0.0005993391527  
0.0005978038354  
0.0005966702175  
0.0005955154102  
0.0005951110202  
0.0005938007164  
0.0005930611695  
0.0005919183766  
0.0005904294413  
0.0005890996496  
0.0005887114525  
0.000588009409  
0.0005872536171  
0.0005863506115  
0.000585675541  
0.0005855734635  
0.0005846334135  
0.0005839932608  
0.0005840220181  
0.0005832606644  
0.0005822477728  
0.0005812680579  
0.0005808335877  
0.0005813656402  
0.0005806759635  
0.0005800503375  
0.0005800773946  
0.0005794301361  
0.0005793605153  
0.0005787286833  
0.000578755749  
0.0005788166043  
0.0005778710135  
0.0005782962479  
0.0005779664537  
0.0005781309398  
0.0005783676898  
