29.72075538  
32.85292182  
40.96403212  
69.62090197  
438.9820721  
6202.972074  
6348.355818  
37970.56537  
38191.4843  
12130.1857  
32444.8961  
2701.785412  
4882.880129  
34667.32177  
944.6732289  
10121.37525  
20005.33411  
27703.36535  
24585.29082  
5080.187888  
7106.639008  
1927.829755  
16125.63798  
14278.37815  
15156.62137  
3695.783374  
27771.0764  
7114.300338  
5342.32259  
715.4506924  
2230.796212  
12576.3665  
2996.020216  
2177.208151  
4396.831697  
14674.40123  
9628.325447  
7504.610518  
4419.442072  
5581.544053  
3688.696479  
9075.355525  
332.4356933  
1269.645941  
5798.698139  
8386.066246  
5436.49904  
8892.782495  
1674.837788  
1503.395878  
667.7347828  
937.3660902  
944.4464018  
4226.670964  
1301.947957  
7.110166216  
249.703299  
1110.278266  
499.2730292  
467.9726499  
463.0665154  
120.4359792  
172.4444877  
172.0476495  
1.28064574  
9.497404275  
108.3624116  
10.35568667  
6.243332679  
7.965652111  
1.181608622  
1.82992712  
3.191720164  
1.690400626  
2.454085037  
1.415787149  
0.1667900665  
0.1659098318  
0.2778160922  
0.1026116706  
0.04556559399  
0.0225122775  
0.05742992162  
0.05662187705  
0.09959034491  
0.1145236941  
0.1039375165  
0.0486183809  
0.03894263544  
0.01860778345  
0.0307381513  
0.02990974765  
0.02478357853  
0.01594905989  
0.02322915996  
0.02807030312  
0.03017475563  
0.03399798849  
0.03596441031  
0.03427366597  
0.03816109265  
0.03556024382  
0.03580181497  
0.03898233075  
0.04005541715  
0.04092525029  
0.04162329403  
0.04251704713  
0.04373818981  
0.04420686293  
0.04474619172  
0.04523068057  
0.04557238669  
0.04605607588  
0.04651685038  
0.0470824321  
0.0472658729  
0.04748290408  
0.04775312991  
0.04825312615  
0.04823133212  
0.04856100005  
0.04854856575  
0.04861061317  
0.04878930134  
0.04875662502  
0.04883560852  
0.04882222921  
0.04877362783  
0.0487217533  
0.04864641326  
0.04858607288  
0.04843248484  
0.04832549657  
0.04818881048  
0.04806581396  
0.04789380989  
0.04769935161  
0.04752958624  
0.04735272326  
0.04715739459  
0.04695321524  
0.04673929155  
0.04652928546  
0.04630009333  
0.04606731308  
0.04583069264  
0.04559263974  
0.04534772237  
0.04509731629  
0.04485362032  
0.04459439414  
0.04433937652  
0.04408018852  
0.04381249337  
0.04355177824  
0.04329110846  
0.0430234114  
0.04276229108  
0.04248768633  
0.04222245486  
0.04196144312  
0.04169215406  
0.04142516688  
0.04116024437  
0.04088996812  
0.0406265007  
0.04035738595  
0.040100509  
0.03983299106  
0.03956822675  
0.03931181384  
0.0390466907  
0.03878804649  
0.03852956074  
0.03827507478  
0.03801795182  
0.0377701829  
0.03751438596  
0.0372651297  
0.03701808274  
0.0367723063  
0.03652311664  
0.03627829247  
0.03603848061  
0.03580305989  
0.03556540609  
0.0353275619  
0.03508907968  
0.03486199828  
0.03462715085  
0.03440493311  
0.03417744625  
0.03395111076  
0.03372779283  
0.03350870967  
0.03329081034  
0.03307227415  
0.03285671709  
0.03264280973  
0.03243149379  
0.03222840696  
0.03201671276  
0.03181223233  
0.0316091237  
0.03140463303  
0.03121116628  
0.0310145763  
0.03081122731  
0.03062479259  
0.03043137661  
0.0302422267  
0.03005309132  
0.02986686044  
0.02967762909  
0.02950232334  
0.02931756336  
0.02913806797  
0.02896249231  
0.02878733766  
0.02861456497  
0.02844428035  
0.02827160524  
0.02810667519  
0.02793754608  
0.02777153061  
0.02761022573  
0.0274472391  
0.0272846949  
0.02713081031  
0.02697183201  
0.02681394188  
0.02666706831  
0.02650628014  
0.02635851816  
0.02621070093  
0.02606108386  
0.02591766779  
0.02577080321  
0.02563047338  
0.0254864805  
0.02534439728  
0.02521118675  
0.02507035284  
0.02493289916  
0.02480307139  
0.0246644198  
0.02453116571  
0.02440377338  
0.02427279092  
0.02414412661  
0.02401963528  
0.02389403364  
0.02377369393  
0.02364895085  
0.0235256835  
0.02340754054  
0.02328921446  
0.02317065377  
0.02305368802  
0.02293856921  
0.02282673488  
0.022711951  
0.02259974564  
0.02248482198  
0.02237753944  
0.02226971586  
0.02216161331  
0.02205733076  
0.02195027111  
0.02184317233  
0.02174316011  
0.02164236048  
0.02153778273  
0.02144100451  
0.02134080737  
0.0212423848  
0.02114532761  
0.02105109616  
0.02095527897  
0.02085867115  
0.02076485578  
0.02067238282  
0.02058109957  
0.02049072269  
0.02039854906  
0.02031334879  
0.02022526568  
0.02014460164  
0.02005396773  
0.01996488966  
0.01988774716  
0.01980053688  
0.019718046  
0.01963853729  
0.01955918949  
0.01947534783  
0.01939660338  
0.01931824889  
0.01923937502  
0.01916218226  
0.01908517473  
0.019012271  
0.01893827719  
0.01886507735  
0.01879056768  
0.01871623807  
0.01864646695  
0.01857359912  
0.0185051099  
0.01843542448  
0.01836479441  
0.01829955768  
0.0182324911  
0.01816654499  
0.01809465659  
0.01803154078  
0.01796627481  
0.01790424587  
0.01783828455  
0.0177785651  
0.01771714887  
0.01765551355  
0.01759456721  
0.01752996983  
0.01747178387  
0.01741306649  
0.01735434769  
0.01729484531  
0.01723724427  
0.01718441276  
0.01712582848  
0.01707058834  
0.01701530957  
0.01696371424  
0.01690710093  
0.01685445386  
0.01679981204  
0.01675118559  
0.01669728517  
0.01664643753  
0.01659466413  
0.01654519696  
0.01649527388  
0.01644618575  
0.0163986332  
0.01634902745  
0.01630434624  
0.01625277926  
0.01620810331  
0.01615982298  
0.01611685315  
0.01607263899  
0.0160289916  
0.01598481468  
0.01594310245  
0.01589364216  
0.01585134095  
0.01580994841  
0.01576747186  
0.01572719535  
0.01568666381  
0.01564493611  
0.01560367815  
0.01556341302  
0.015526614  
0.0154847877  
0.01545173705  
0.0154110674  
0.0153733622  
0.01533722393  
0.01530131421  
0.01526353178  
0.01523061905  
0.01519338618  
0.01515657709  
0.01512039314  
0.01508925146  
0.01505134323  
0.01501956178  
0.01498714158  
0.01495266627  
0.01492128555  
0.01488833771  
0.01485878418  
0.01482639222  
0.0147938695  
0.01476340989  
0.01473695031  
0.01470491692  
0.01467616329  
0.01464855308  
0.01461722176  
0.01458951473  
0.01456297975  
0.01453372698  
0.01450821028  
0.01448138898  
0.01445388979  
0.01442650096  
0.01439991141  
0.01437493101  
0.01434879566  
0.01432552177  
0.01429773242  
0.01427635547  
0.01425040997  
0.01422921378  
0.01420342182  
0.01418023037  
0.01415934101  
0.01413705702  
0.01411503958  
0.0140927853  
0.01407247545  
0.01405029178  
0.01403007945  
0.01400939466  
0.01399147868  
0.01397008251  
0.01395057489  
0.01393144787  
0.01391009866  
0.01389315774  
0.01387335874  
0.01385767619  
0.01383813501  
0.0138183278  
0.01380462289  
0.01378734521  
0.01376999356  
0.01375382414  
0.01373905712  
0.01372167332  
0.01370469872  
0.01368920719  
0.01367613488  
0.01366062452  
0.01364496585  
0.01363222481  
0.0136197013  
0.01360611719  
0.01359316341  
0.01357791718  
0.01356586089  
0.01355224462  
0.01354251624  
0.01352911885  
0.0135186124  
0.0135058095  
0.0134945262  
0.01348262302  
0.01347312428  
0.0134618412  
0.01345359222  
0.01344485395  
0.01343377485  
0.01342284039  
0.0134150233  
0.01340551191  
0.01339727662  
0.01338790002  
0.01338209189  
0.01337615807  
0.01336756151  
0.01335914114  
0.01335473583  
0.01334501513  
0.01334048853  
0.01333347849  
0.01332798271  
0.01332195952  
0.0133160104  
0.01331379463  
0.01330668866  
0.01330115551  
0.01329711342  
0.01329230753  
0.01329127751  
0.01328602726  
0.01328211221  
0.01327744476  
0.01327839075  
0.01327530998  
0.01327280231  
0.01327214636  
0.01326950806  
0.01326589152  
0.01326412598  
0.0132649629  
0.01326387553  
0.01325948539  
0.01325898799  
0.01326131973  
