0.08279446501  
0.5936235861  
1.082896783  
1.527724866  
1.909169039  
2.21430964  
2.437582511  
2.581193984  
2.654553377  
2.672773267  
2.654448903  
2.619000359  
2.583920399  
2.562305349  
2.560996865  
2.579601197  
2.610539427  
2.640154734  
2.650760173  
2.623380407  
2.540839537  
2.39077385  
2.168150275  
1.87689539  
1.530362714  
1.150494099  
0.7657088258  
0.40773689  
0.1077629318  
-0.1076216057  
-0.2201298551  
-0.2226172897  
-0.1206246551  
0.06765140967  
0.3130284572  
0.578511362  
0.8236143889  
1.009316549  
1.103027296  
1.082932457  
0.9411223795  
0.6850657014  
0.3371834188  
-0.06748506876  
-0.485280403  
-0.8691251678  
-1.17430662  
-1.364114892  
-1.414619651  
-1.317962061  
-1.083705614  
-0.7380253622  
-0.3208024698  
0.1190586898  
0.5295211219  
0.8617796675  
1.076283715  
1.14763314  
1.067699133  
0.8465373977  
0.5109627255  
0.1009497345  
-0.3356454615  
-0.7493604583  
-1.095530621  
-1.339963762  
-1.463121377  
-1.462252974  
-1.351215869  
-1.15804938  
-0.9206760678  
-0.6813576082  
-0.4807023932  
-0.3520636837  
-0.3170935842  
-0.3830261638  
-0.5420231406  
-0.7725927875  
-1.04281982  
-1.314900551  
-1.550322856  
-1.71497291  
-1.783500066  
-1.742412838  
-1.591562526  
-1.343914962  
-1.023716592  
-0.6633802995  
-0.2995206462  
0.03133743537  
0.2968663247  
0.4724040353  
0.5434428441  
0.5069215302  
0.3712606985  
0.1551963879  
-0.1143992642  
-0.4054540909  
-0.6840599409  
-0.9179354856  
-1.079643912  
-1.149273697  
-1.116340381  
-0.9807408524  
-0.7526882873  
-0.4516443926  
-0.1043580245  
0.2577913467  
0.6018667437  
0.8965771891  
1.11526897  
1.238422108  
1.255408681  
1.165352391  
0.977039105  
0.7079105508  
0.3822961917  
0.02908053919  
-0.3209254024  
-0.637645077  
-0.894199246  
-1.068955574  
-1.147062432  
-1.121387971  
-0.9928640166  
-0.7702889706  
-0.4696327451  
-0.1129323306  
0.2731705214  
0.6591697156  
1.014666147  
1.310487806  
1.520860034  
1.625504898  
1.611501488  
1.474734839  
1.22075617  
0.8648893424  
0.4314995618  
-0.04761304626  
-0.5356035285  
-0.9935968324  
-1.38405971  
-1.674208929  
-1.839107472  
-1.864111858  
-1.746414792  
-1.49547188  
-1.132276306  
-0.6875218689  
-0.1988276479  
0.2926937629  
0.7461882055  
1.124769044  
1.398797296  
1.548439757  
1.565236033  
1.452563444  
1.224954857  
0.9063965124  
0.5277893598  
0.123884406  
-0.2699865414  
-0.6210308767  
-0.9016848061  
-1.091627072  
-1.179003822  
-1.160834002  
-1.042655067  
-0.8375580815  
-0.5647693396  
-0.2479721622  
0.08648881845  
0.4113944377  
0.7003581185  
0.9294331157  
1.078590141  
1.133067676  
1.08455594  
0.9321369799  
0.6828755836  
0.3519225122  
-0.0380003318  
-0.4578449591  
-0.874226467  
-1.252080802  
-1.557820711  
-1.762664806  
-1.845791837  
-1.796891069  
-1.617757065  
-1.322629849  
-0.9371535331  
-0.4959811627  
-0.03925209714  
0.3916908361  
0.7588354543  
1.031751114  
1.191010172  
1.230341574  
1.157214127  
0.9917584772  
0.7641233908  
0.5105908235  
0.2689334334  
0.07359543076  
-0.04867309899  
-0.08216418324  
-0.02409746415  
0.1152024658  
0.3138556592  
0.5414835689  
0.7633652327  
0.9451065797  
1.05720443  
1.078881773  
1.000704013  
0.8256483391  
0.5685365699  
0.253954822  
-0.08698998157  
-0.4206152498  
-0.7147334029  
-0.9423250165  
-1.084366091  
-1.131496766  
-1.084423335  
-0.9531103732  
-0.7549839095  
-0.5124778405  
-0.250299958  
0.007211623122  
0.2383367263  
0.4256227337  
0.5568485708  
0.6253197512  
0.6296043266  
0.5728682603  
0.4619871327  
0.3065924057  
0.1181688576  
-0.09072293822  
-0.30708406  
-0.5179926773  
-0.7110482292  
-0.8747835195  
-0.9990985177  
-1.07572468  
-1.098723926  
-1.06498043  
-0.9746439766  
-0.8314483076  
-0.6428523583  
-0.4199332293  
-0.1769931955  
0.06913806882  
0.3001135005  
0.4973494004  
0.6435190866  
0.724149156  
0.7291877817  
0.6543656176  
0.5021726708  
0.282268983  
0.01119350656  
-0.2887050501  
-0.591083307  
-0.8680430316  
-1.092946092  
-1.243295859  
-1.303319226  
-1.265912299  
-1.133659052  
-0.9187718659  
-0.6419172399  
-0.3300672659  
-0.01361858233  
0.276854084  
0.5138401527  
0.6757246019  
0.7489161247  
0.72904228  
0.6211249979  
0.4387787279  
0.2025712467  
-0.06222335898  
-0.3281980139  
-0.5684475075  
-0.7590013421  
-0.8808600104  
-0.9214965585  
-0.8757441276  
-0.7460535756  
-0.5421462252  
-0.2801207843  
0.01890435636  
0.3305146067  
0.6289793577  
0.8893586484  
1.089592162  
1.2124091  
1.24689916  
1.189580525  
1.044822707  
0.8245585226  
0.5472376463  
0.2361098524  
-0.08302117603  
-0.3843472011  
-0.6446103363  
-0.8453634471  
-0.9746463205  
-1.027860691  
-1.00773304  
-0.923376878  
-0.7886090276  
-0.6197742176  
-0.4334301005  
-0.244242451  
-0.0634200474  
0.1020751591  
0.2494526693  
0.3792131766  
0.4936544662  
0.5951044193  
0.6842339902  
0.7588298737  
0.8133012981  
0.8390834369  
0.8258975028  
0.7637086018  
0.6450167238  
0.4670870766  
0.2336774206  
-0.04410568545  
-0.3480427463  
-0.6541951263  
-0.9353073786  
-1.163908172  
-1.3156611  
-1.372479822  
-1.324937543  
-1.173619299  
-0.929210261  
-0.6113264006  
-0.2462649814  
0.1359835145  
0.5050321797  
0.8332401956  
1.098300522  
1.284967222  
1.385780816  
1.400802095  
1.336509331  
1.204141884  
1.017779173  
0.7924955556  
0.5428242999  
0.2816997491  
0.01992214527  
-0.2339030025  
-0.4730915256  
-0.6924317015  
-0.8877529289  
-1.05563119  
-1.193313459  
-1.29886039  
-1.371430927  
-1.411601304  
-1.421581196  
-1.405202532  
-1.367621734  
-1.314718027  
-1.252256933  
-1.184960391  
-1.115639042  
-1.044584088  
-0.9693663905  
-0.8851319037  
-0.7854098836  
-0.6633393451  
-0.5131337851  
-0.3315578288  
-0.1191407371  
0.1191006811  
0.3736035082  
0.6309258455  
0.8750862702  
1.089389138  
1.258477664  
1.370292553  
1.41762888  
1.399040921  
1.318960021  
1.186997441  
1.016569371  
0.8230559672  
0.621815706  
0.4263598918  
0.2469782934  
0.09000488185  
-0.04219185765  
-0.1505539758  
-0.2381740052  
-0.3088753032  
-0.3658196396  
-0.41040691  
-0.4416483729  
-0.4561494912  
-0.4486743528  
-0.4131966524  
-0.3442579681  
-0.2383909409  
-0.0953806257  
0.08086501215  
0.2819662033  
0.4953419157  
0.7050733292  
0.8932790673  
1.041844442  
1.134313073  
1.157716482  
1.104145573  
0.9718726684  
0.7658916682  
0.4977897406  
0.184937604  
-0.1509513349  
-0.4857747222  
-0.7953179143  
-1.057628971  
-1.25522873  
-1.376894269  
-1.418797497  
-1.384830581  
-1.286047898  
-1.139266088  
-0.964968238  
-0.784756998  
-0.6186756484  
-0.4827421586  
-0.3870155297  
-0.3344580833  
-0.3207529395  
-0.3350966912  
-0.3618730306  
-0.382970084  
-0.3804354202  
-0.3391112373  
-0.2488905589  
-0.1063042843  
0.08476238372  
0.3133082368  
0.5623626013  
0.8108734755  
1.036087565  
1.216119037  
1.332383506  
1.371619617  
1.327274473  
1.200121671  
0.9980763216  
0.7352731147  
0.4305375848  
0.1054591615  
-0.2177166808  
-0.5181439691  
-0.7781708288  
-0.9847148533  
-1.130092146  
-1.212256432  
-1.234462953  
-1.204405948  
-1.132965227  
-1.032705915  
-0.9163042464  
-0.7950856054  
-0.6778305716  
-0.5699906803  
-0.4733924259  
-0.3864598365  
-0.3049235937  
-0.2229311653  
-0.1343970479  
-0.03444177133  
0.07930555194  
0.2057148601  
0.339631989  
0.471952687  
0.5903140584  
0.6803845577  
0.7276183204  
0.7192853453  
0.6465319135  
0.5061843643  
0.3020325283  
0.0453658867  
-0.2453891557  
-0.5459783513  
-0.8284836689  
-1.064158927  
-1.226618924  
-1.295022095  
-1.256831982  
-1.109787989  
-0.8627812581  
-0.5354695379  
-0.1566027684  
0.2387822561  
0.6130063856  
0.929792087  
1.158235071  
1.276192195  
1.272677333  
1.148958821  
0.9182284356  
0.6039069774  
0.2368221205  
-0.1483632069  
-0.5170036998  
-0.8381201581  
-1.087393675  
-1.249195165  
-1.317435449  
-1.295233121  
-1.193531496  
-1.028934724  
-0.8211159767  
-0.5901886578  
-0.3543916448  
-0.1283785029  
0.07772269767  
0.2584283388  
0.4122975719  
0.5407771214  
0.6467658291  
0.7331692823  
0.8017091172  
0.8521808028  
0.8822723133  
0.887941202  
0.8642703899  
0.8066212319  
0.7118790422  
0.5795515558  
0.4125394807  
0.2174192491  
0.00419028096  
-0.2145045445  
-0.4245726057  
-0.6119386598  
-0.7640671077  
-0.8713577173  
-0.9282135966  
-0.9336474518  
-0.8913401211  
-0.8091397575  
-0.6980549329  
-0.570876227  
-0.4405911667  
-0.3188030302  
-0.2143654283  
-0.132404909  
-0.0738766868  
-0.03571047182  
-0.0115222816  
0.007203076954  
0.02963287949  
0.06403049676  
0.1163475645  
0.1891747359  
0.2812167859  
0.3873709368  
0.4993991281  
0.6071031276  
0.6998300451  
0.7680781537  
0.8049554498  
0.8072732531  
0.7760862307  
0.7165820605  
0.6373283759  
0.5489661348  
0.4625472904  
0.387773305  
0.3314154552  
0.2961881714  
0.2802758767  
0.2776282542  
0.2789974269  
0.2735889009  
0.2510631674  
0.2035754935  
0.1275013566  
0.02453070608  
-0.09808893396  
-0.2282755005  
-0.3507345298  
-0.4492912843  
-0.5095901142  
-0.5217490157  
-0.4825456204  
-0.3967232605  
-0.2771624695  
-0.1437840057  
-0.02126081161  
0.06421349188  
0.08867285437  
0.03414392149  
-0.1081321401  
-0.335517859  
-0.6332101451  
-0.9750855171  
-1.326131189  
-1.646226466  
-1.89483531  
-2.036033413  
-2.043234223  
-1.902985611  
-1.617321875  
-1.20432458  
-0.6967541816  
-0.1388836788  
0.4181313909  
0.9218043862  
1.324132194  
1.586979125  
1.686361987  
1.615145689  
1.383798613  
1.019144403  
0.5612634416  
0.05893671755  
-0.4358067727  
-0.8733739535  
-1.211843127  
-1.421151038  
-1.485775438  
-1.405676377  
-1.195455756  
-0.8819712393  
-0.5007585975  
-0.09179061789  
0.3048831987  
0.6531013224  
0.9237400941  
1.096786724  
1.162242999  
1.119923938  
0.9783638036  
0.7530973754  
0.4646322175  
0.1363832589  
-0.2072139745  
-0.5422960411  
-0.8468211938  
-1.101526072  
-1.29063679  
-1.402429667  
-1.429683296  
-1.370033763  
-1.22621577  
-1.006109332  
-0.7225189534  
-0.3926249634  
-0.03706902112  
0.3213187389  
0.6590600488  
0.953734903  
1.185685604  
1.33954363  
1.4054312  
1.379704028  
1.265161948  
1.070715943  
0.8105466924  
0.50285333  
0.1683239024  
-0.1715258344  
-0.4959847052  
-0.7866058614  
-1.028378817  
-1.210529448  
-1.326906799  
-1.375955361  
-1.360310916  
-1.286089998  
-1.161964584  
-0.9981276967  
-0.8052695365  
-0.5936688765  
-0.3724860139  
-0.1493287305  
0.06988125084  
0.2807485719  
0.4800032177  
0.6649299025  
0.8327392829  
0.9800072113  
1.102278609  
1.193941769  
1.248432644  
1.258782832  
1.218467803  
1.12248313  
0.9684959487  
0.7579272709  
0.4967670673  
0.1959700047  
-0.1287129848  
-0.4575159944  
-0.7680534516  
-1.037213654  
-1.243367121  
-1.368620998  
-1.400855692  
-1.335243707  
-1.175056165  
-0.9316003058  
-0.6232967922  
-0.2739871449  
0.08932941786  
0.4390457229  
0.7494850945  
0.9991514681  
1.17244411  
1.260700064  
1.262497213  
1.183251214  
1.034214183  
0.8310399841  
0.5920927489  
0.3366987299  
0.08349407729  
-0.1509877909  
-0.3533976355  
-0.514286383  
-0.6284166065  
-0.6947136938  
-0.715881194  
-0.6977455095  
-0.6484025506  
-0.5772388363  
-0.4939059221  
-0.4073420022  
-0.324912245  
-0.2517592674  
-0.1904221858  
-0.1407820495  
-0.1003414115  
-0.06482869667  
-0.0290653411  
0.01202039547  
0.06233782157  
0.1237200627  
0.1952730727  
0.2731203196  
0.3506040318  
0.4189548439  
0.4683485601  
0.4892347257  
0.4737431202  
0.4169631484  
0.317903268  
0.1799748178  
0.01089837124  
-0.1779583867  
-0.3727445912  
-0.5586371438  
-0.7214857196  
-0.8493781816  
-0.9339102659  
-0.970999839  
-0.9611536624  
-0.9091648067  
-0.8233160061  
-0.7142080565  
-0.5933953839  
-0.4720103165  
-0.3595682555  
-0.2630678881  
-0.1865010345  
-0.1307722069  
-0.09400183396  
-0.07212425887  
-0.05967051643  
-0.05060008699  
-0.03908462018  
-0.02014270422  
0.009919680149  
0.05326962402  
0.1105040623  
0.1807395519  
0.261798741  
0.3504404044  
0.4425931701  
0.5335819716  
0.6183555145  
0.6917168195  
0.7485849486  
0.7843024997  
0.794970292  
0.7777910771  
0.7313797714  
0.6559843366  
0.5535640843  
0.4276929654  
0.2832831706  
0.1261451124  
-0.03755322461  
-0.2018498908  
-0.3614910998  
-0.5122835668  
-0.6512543389  
-0.776583674  
-0.8873269996  
-0.9829823144  
-1.06296808  
-1.126111539  
-1.170231839  
-1.191908853  
-1.186500687  
-1.148450421  
-1.071895413  
-0.9515461843  
-0.7837722833  
-0.5677751483  
-0.3067042176  
-0.008532713117  
0.3134893695  
0.6409747669  
0.9512449436  
1.218919767  
1.418178878  
1.525515958  
1.522693528  
1.399521425  
1.156068701  
0.8039132605  
0.3661484038  
-0.124018937  
-0.6260337585  
-1.095909607  
-1.490874319  
-1.774207041  
-1.919644565  
-1.91476175  
-1.76282547  
-1.482826241  
-1.107593616  
-0.6802015383  
-0.2490645867  
0.1376493168  
0.4375962373  
0.6190965935  
0.6646279642  
0.5725357152  
0.3567746442  
0.04477141202  
-0.326269265  
-0.7140603236  
-1.076293626  
-1.375391834  
-1.582369289  
-1.679378146  
-1.660716348  
-1.53231766  
-1.30991917  
-1.016288299  
-0.6779496401  
-0.3218948354  
0.02731056958  
0.3497118518  
0.6312409641  
0.8640589222  
1.046046714  
1.17964182  
1.270279182  
1.324716024  
1.349516704  
1.349894457  
1.32905989  
1.288112982  
1.226440332  
1.142503539  
1.034843592  
0.9031107861  
0.7489290537  
0.5764374861  
0.3924086454  
0.2059084659  
0.02754078485  
-0.1316231436  
-0.2612747872  
-0.3530847873  
-0.4017196345  
-0.4055225985  
-0.3667457562  
-0.2912949838  
-0.1880146983  
-0.06759457237  
0.05876476245  
0.1807538739  
0.2902354563  
0.382239952  
0.4555311034  
0.5126435462  
0.5593750171  
0.6037753053  
0.6547493267  
0.7204494877  
0.8066733211  
0.9154958797  
1.04434598  
1.185689108  
1.327405206  
1.453860498  
1.547554395  
1.591181845  
1.569832487  
1.473045569  
1.296438059  
1.042667604  
0.7215764729  
0.3494571103  
-0.05248157951  
-0.4602711529  
-0.8496960655  
-1.198827826  
-1.490257722  
-1.712729069  
-1.86196896  
-1.940641059  
-1.957449738  
-1.925579822  
-1.860723272  
-1.779006845  
-1.695115281  
-1.620871543  
-1.564412757  
-1.530005898  
-1.518426288  
-1.527720119  
-1.554135654  
-1.592986747  
-1.639267672  
-1.687921039  
-1.73375806  
-1.771126134  
-1.79352121  
-1.793337355  
-1.761966243  
-1.690365276  
-1.570126368  
-1.394937542  
-1.162225641  
-0.8746723312  
-0.5412717461  
-0.1776144583  
0.1948051036  
0.5503425454  
0.8618981218  
1.104290225  
1.257872433  
1.311871973  
1.266916412  
1.13626421  
0.9454096525  
0.7299349446  
0.5317265384  
0.3939281431  
0.3552254175  
0.4441939008  
0.6745043174  
1.041713206  
1.522216871  
2.074646327  
2.643691231  
3.165982494  
3.577347235  
3.820527057  
3.852347936  
3.649337736  
3.210999099  
2.560235402  
1.740819012  
0.8122334033  
-0.1574090041  
