44.20167418  
58.7075783  
92.19906922  
176.5512108  
437.3210494  
397.5380052  
48622.09615  
6990.210394  
2507.555343  
15793.00382  
8566.307325  
1748.125178  
4154.898396  
1090.042306  
5542.748576  
23596.24858  
5087.823681  
5502.013566  
10368.67166  
1796.846803  
8379.302951  
4419.923677  
16716.65212  
3848.231611  
9447.773303  
20385.98375  
24800.87049  
12865.58165  
27812.4678  
9254.755672  
11104.32402  
9016.654827  
14123.92126  
427.32702  
27436.21317  
4645.371592  
9287.968134  
12934.29858  
15414.17519  
11418.60003  
5079.721198  
14626.40696  
1855.708533  
4163.520676  
9335.320293  
3064.980072  
10234.94943  
3676.442754  
4493.071268  
5855.472038  
3651.509892  
1410.379175  
1523.213654  
591.8462653  
980.1867451  
3488.576103  
4560.69882  
803.364215  
681.9987768  
5328.682644  
452.1387825  
2236.8702  
328.9441554  
732.1330001  
439.8227498  
207.4349836  
493.9071576  
23.43244657  
253.7572917  
39.10237509  
18.51717512  
48.07220272  
17.7968774  
16.27536431  
13.27775373  
28.44913169  
5.884048296  
11.14971026  
14.50293702  
7.940926991  
8.188947237  
5.183954708  
7.753744238  
9.715427849  
9.501650483  
7.646288883  
6.484283899  
7.163769248  
6.21824347  
6.582845917  
6.17835172  
5.980275062  
5.630615812  
5.589321789  
5.085434027  
5.09966981  
4.906916385  
4.835306959  
4.699116748  
4.567395328  
4.440540831  
4.286540096  
4.171992393  
4.056036816  
3.982746927  
3.870871214  
3.770722674  
3.675099197  
3.59374662  
3.507498885  
3.431141854  
3.35623639  
3.273744777  
3.204697365  
3.139806201  
3.07307725  
3.007606753  
2.946675432  
2.885705766  
2.829387856  
2.776172289  
2.720890185  
2.670022748  
2.619080129  
2.571000598  
2.524729136  
2.479238442  
2.434479895  
2.391741511  
2.350183703  
2.309604766  
2.270666075  
2.232781927  
2.195706474  
2.159668347  
2.124728391  
2.090784733  
2.057693355  
2.025617126  
1.994172724  
1.963635289  
1.933907754  
1.90491525  
1.876604656  
1.849106903  
1.822271958  
1.795964327  
1.770500762  
1.745476938  
1.721036625  
1.69730389  
1.674086328  
1.651362344  
1.629139867  
1.607501373  
1.586285757  
1.565577489  
1.545276935  
1.525470516  
1.506068188  
1.487102126  
1.468533157  
1.450349008  
1.432575281  
1.415166457  
1.398067554  
1.381362098  
1.365007715  
1.348981255  
1.333254107  
1.317827782  
1.302727736  
1.287956476  
1.273411508  
1.25919455  
1.245227155  
1.231523665  
1.218105801  
1.204918607  
1.191982074  
1.179307928  
1.166791269  
1.154603384  
1.142582205  
1.130809497  
1.119205739  
1.107824557  
1.096651822  
1.085681852  
1.074883323  
1.06431935  
1.053922579  
1.043680262  
1.033614894  
1.023718389  
1.013995406  
1.004449814  
0.9950457605  
0.9858339578  
0.9767407417  
0.9678052441  
0.9590090746  
0.950377659  
0.941859777  
0.9334613427  
0.925236713  
0.9171091277  
0.9091586118  
0.9012996856  
0.8935701753  
0.8859470948  
0.8784515818  
0.8710887542  
0.8638319208  
0.8566534932  
0.8496211523  
0.8426856544  
0.8358739947  
0.8291190921  
0.8224869836  
0.8159702759  
0.8095317898  
0.8031842551  
0.7969535434  
0.7907725299  
0.7847132945  
0.7787349918  
0.7728416211  
0.767019459  
0.7612854521  
0.755650969  
0.7500857397  
0.7446042225  
0.7391987374  
0.7338591467  
0.728587583  
0.7233969353  
0.7182908688  
0.7132368004  
0.70826167  
0.7033471193  
0.6984955436  
0.6937218505  
0.6890114738  
0.6843895326  
0.6797726263  
0.6752320114  
0.6707869975  
0.6663657132  
0.6620123553  
0.6577318915  
0.6534865999  
0.649296473  
0.6451835481  
0.6411016454  
0.637067563  
0.6331028568  
0.6291928418  
0.6253218165  
0.6215110631  
0.6177276637  
0.6140131087  
0.6103159476  
0.6067025843  
0.6031295048  
0.5995750849  
0.5960868062  
0.5926410662  
0.589216035  
0.5858591016  
0.5824952296  
0.5792268515  
0.5759844597  
0.5727827023  
0.5696057765  
0.5664925848  
0.5633855198  
0.560328215  
0.5573173651  
0.5543206877  
0.5514032414  
0.5485024969  
0.5456015378  
0.5427559849  
0.5399718215  
0.5371947714  
0.5344490177  
0.5317356965  
0.5290656616  
0.5264176554  
0.5237872706  
0.5212329945  
0.51866903  
0.5161299077  
0.5136412521  
0.5111998994  
0.5087302501  
0.5063332334  
0.503957435  
0.5015963813  
0.4992751013  
0.4969626684  
0.4946851038  
0.4924618469  
0.4902404184  
0.4880405321  
0.4858522355  
0.4836999262  
0.4815888601  
0.4794968802  
0.4774299728  
0.475367094  
0.4733489633  
0.4713460757  
0.4693492127  
0.4673962788  
0.4654663381  
0.4635527954  
0.4616565952  
0.4597711264  
0.4579262153  
0.4560800317  
0.4542690486  
0.4524858511  
0.4507294721  
0.4489714602  
0.4472261761  
0.4455354793  
0.4438345472  
0.4421687703  
0.4405052789  
0.4388667  
0.4372439615  
0.4356541305  
0.4340622489  
0.4325094016  
0.4309454308  
0.4294478511  
0.4279144721  
0.4264410194  
0.4249269505  
0.4234807392  
0.4220361907  
0.420607839  
0.4191716418  
0.4177985152  
0.4164128941  
0.4150502723  
0.4136933351  
0.4123536695  
0.4110432857  
0.4097380993  
0.4084358063  
0.4071749419  
0.4059040279  
0.4046492321  
0.4034150221  
0.4022027544  
0.400980573  
0.3998122617  
0.3986232415  
0.3974542703  
0.396304077  
0.39517176  
0.394027764  
0.3929203858  
0.3918211367  
0.3907552978  
0.3896727681  
0.3886095755  
0.3875523337  
0.3865331583  
0.3855040732  
0.384480765  
0.383474786  
0.3824992285  
0.3815144854  
0.3805564931  
0.3796083029  
0.3786615385  
0.3777404802  
0.3767994503  
0.3758918233  
0.3749949099  
0.3741255345  
0.3732439626  
0.3723886173  
0.371516747  
0.3706708187  
0.3698473016  
0.369030046  
0.3682216596  
0.3673877371  
0.3666236767  
0.3658283059  
0.3650635127  
0.3643109871  
0.3635610781  
0.362808453  
0.3620759528  
0.3613624079  
0.3606433005  
0.359942475  
0.3592519545  
0.3585628854  
0.3578872433  
0.3572169484  
0.356567367  
0.3559138134  
0.3552782107  
0.3546711955  
0.3540416289  
0.3534339068  
0.3528235304  
0.3522412658  
0.3516513665  
0.3510617214  
0.3504860468  
0.3499432136  
0.3494007332  
0.3488576893  
0.3483200835  
0.3477977592  
0.3472770582  
0.3467658692  
0.3462773012  
0.3457763645  
0.3453004392  
0.344822644  
0.3443620781  
0.3439090874  
0.3434395724  
0.3430175245  
0.3425799217  
0.3421522302  
0.3417232291  
0.341326873  
0.3409322305  
0.3405157273  
0.3401321215  
0.3397690665  
0.3393853757  
0.3390126625  
0.3386575852  
0.3383145287  
0.3379686005  
0.3376452891  
0.3373018634  
0.3369888948  
0.3366794532  
0.3363611401  
0.3360688648  
0.3357801914  
0.3355144237  
0.3352383274  
0.3349577874  
0.3347006545  
0.3344481957  
0.3342010306  
0.3339663104  
0.3337339494  
0.3335135157  
0.3332911012  
0.3330834953  
0.3328640844  
0.3326719471  
0.3324821828  
0.3322889077  
0.332141944  
0.3319565415  
0.3318092621  
0.331641367  
0.3314843708  
0.3313556405  
0.3312153681  
0.3310839566  
0.3309744455  
0.3308626888  
0.3307407705  
0.3306587762  
0.3305675118  
0.3304839828  
0.3303954203  
0.3303283038  
0.3302678494  
0.3302008613  
0.3301488565  
0.330105036  
0.3300893654  
0.330042768  
0.3300043271  
0.3300101559  
0.3299773823  
0.3299749892  
