0.4672709981  
0.6877275055  
0.8910503394  
1.06540112  
1.201987639  
1.296003103  
1.347068467  
1.359101467  
1.339626597  
1.29862282  
1.2470666  
1.195367353  
1.151918661  
1.121966623  
1.106955546  
1.10443434  
1.108560531  
1.111117873  
1.102924197  
1.075431093  
1.02229672  
0.9406955057  
0.8321893634  
0.7029981193  
0.5636099211  
0.4277492196  
0.3108086182  
0.2279147474  
0.1918690764  
0.2112227051  
0.2887325055  
0.4204270957  
0.5954268101  
0.7965815447  
1.001909815  
1.186674473  
1.325919186  
1.397151679  
1.382881966  
1.272704296  
1.064665867  
0.7657533494  
0.3914146895  
-0.03583719073  
-0.4885759336  
-0.9371373203  
-1.352480156  
-1.708944372  
-1.98656544  
-2.172722119  
-2.262963775  
-2.260951157  
-2.177582493  
-2.0294341  
-1.836728196  
-1.621080773  
-1.403274085  
-1.201301119  
-1.028861753  
-0.8944479222  
-0.8010700814  
-0.7466156283  
-0.7247534311  
-0.7262503976  
-0.7405187126  
-0.7571896497  
-0.7675322967  
-0.7655341564  
-0.7485241437  
-0.7172846317  
-0.6756423757  
-0.6296336965  
-0.5863686632  
-0.5527764447  
-0.5344036663  
-0.5344713436  
-0.5532984948  
-0.5881651669  
-0.6336379274  
-0.6822643819  
-0.7255263006  
-0.7549004976  
-0.7628539524  
-0.7436615594  
-0.6939297642  
-0.6128068106  
-0.5018840241  
-0.3648470118  
-0.2069701833  
-0.034529722  
0.1457684138  
0.327292611  
0.5038982141  
0.6702232457  
0.8218857993  
0.95560472  
1.069242851  
1.161794098  
1.23330846  
1.284757472  
1.317830651  
1.334672825  
1.337584865  
1.328702732  
1.309718348  
1.28166154  
1.244793289  
1.198636287  
1.142132768  
1.07391925  
0.9926788526  
0.8975122708  
0.7882701453  
0.6658103065  
0.5321308315  
0.3903593327  
0.2446231976  
0.09979219988  
-0.03885323521  
-0.1660035246  
-0.2767126334  
-0.3667726522  
-0.4330450064  
-0.4737184992  
-0.4884980513  
-0.4786859613  
-0.4471602931  
-0.3982331348  
-0.337389137  
-0.2709074407  
-0.2053918305  
-0.147235946  
-0.1020694236  
-0.07425452687  
-0.06646964548  
-0.07944805975  
-0.1119055063  
-0.1606812639  
-0.2210780588  
-0.2873879931  
-0.3535319411  
-0.4137629216  
-0.4633270213  
-0.4990267921  
-0.5195848624  
-0.5257779762  
-0.5203030053  
-0.5073820786  
-0.4921560908  
-0.4799297443  
-0.4753722554  
-0.4817677206  
-0.5004346367  
-0.5303861621  
-0.5682911027  
-0.6087584911  
-0.6449082863  
-0.6691751275  
-0.6742340339  
-0.6539435141  
-0.6041674414  
-0.5233819502  
-0.4129762715  
-0.2772048879  
-0.122793162  
0.04174118404  
0.2069876814  
0.3636182454  
0.5033409371  
0.6196833418  
0.708536235  
0.7683778891  
0.8001915024  
0.8070921033  
0.7937465927  
0.7656831935  
0.7286035286  
0.6877835976  
0.6476537204  
0.6115727352  
0.5818086605  
0.5596771544  
0.545789433  
0.5403097851  
0.5431900901  
0.5543018984  
0.5734648326  
0.6003743301  
0.6344526913  
0.6746853607  
0.7194765246  
0.7665846303  
0.8131555749  
0.8558706465  
0.8911935888  
0.9156904405  
0.9263776023  
0.9210573168  
0.8985762521  
0.858983194  
0.8035527902  
0.7346618934  
0.6555263296  
0.5698389554  
0.4813420663  
0.3933899241  
0.3085645049  
0.2284007185  
0.1532456277  
0.08229178036  
0.01376770709  
-0.05472520773  
-0.1257885906  
-0.2017651316  
-0.2842995486  
-0.3739989914  
-0.4702272696  
-0.5710711258  
-0.6734916345  
-0.7736339799  
-0.8672698687  
-0.9503089077  
-1.019310466  
-1.071941992  
-1.107301274  
-1.126075044  
-1.13049777  
-1.124109564  
-1.111336594  
-1.096940727  
-1.085395483  
-1.080272357  
-1.083694933  
-1.09595656  
-1.115335866  
-1.138160765  
-1.159133741  
-1.171880857  
-1.169704266  
-1.146438848  
-1.097327854  
-1.019803976  
-0.9140720478  
-0.7833931801  
-0.6340191132  
-0.4747401897  
-0.3160881265  
-0.1692546802  
-0.04486311574  
0.0482790518  
0.1042674668  
0.1208981283  
0.100039298  
0.04753857885  
-0.02735991315  
-0.1130175747  
-0.1967003324  
-0.2660302452  
-0.3103996763  
-0.3221732892  
-0.297534615  
-0.236872448  
-0.1446557434  
-0.02883261091  
0.1001777326  
0.230760198  
0.3514864768  
0.4524280814  
0.5262396835  
0.5688766616  
0.5798749078  
0.5621638356  
0.5214546639  
0.4652978126  
0.4019519586  
0.3392146599  
0.2833968811  
0.2385639945  
0.2061568546  
0.1850392939  
0.1719492547  
0.1622826351  
0.1510837375  
0.1340771228  
0.1085855488  
0.07418118943  
0.03295964337  
-0.01061266124  
-0.050267982  
-0.07883840321  
-0.08937044985  
-0.07627789146  
-0.0363611967  
0.03046291157  
0.1208388918  
0.2281279436  
0.3430197631  
0.4545361939  
0.551290757  
0.6228459618  
0.6609746675  
0.6606782736  
0.6208107991  
0.5442580241  
0.4376278146  
0.3105257152  
0.1744972619  
0.04177335166  
-0.07601955893  
-0.1690477992  
-0.2302128027  
-0.2557734869  
-0.2455695352  
-0.2028698521  
-0.1338517339  
-0.04682085816  
0.04875664902  
0.1432955617  
0.2280633935  
0.2960323759  
0.3424949973  
0.3654217456  
0.3655360131  
0.3461175054  
0.3125824059  
0.2718947856  
0.2318577281  
0.2003733082  
0.1847120132  
0.1908443297  
0.22288676  
0.28268139  
0.3695439329  
0.4802025115  
0.6089403865  
0.7479568141  
0.8879340601  
1.01879378  
1.130591491  
1.214461818  
1.263537199  
1.273715709  
1.244173265  
1.177548575  
1.079734496  
0.9592927644  
0.8265435438  
0.6924276244  
0.567295413  
0.4597660891  
0.3758093375  
0.3181660408  
0.286177213  
0.2760290173  
0.2813786091  
0.2942528912  
0.3061094927  
0.3089127308  
0.2961026502  
0.2633437363  
0.2089868625  
0.1342170402  
0.04288042077  
-0.05895066529  
-0.1636411244  
-0.2627923079  
-0.3481073188  
-0.4122548325  
-0.4496583949  
-0.4571363388  
-0.4343528557  
-0.38400718  
-0.3117295782  
-0.2256524984  
-0.1356726237  
-0.0524300542  
0.01389065972  
0.05481622272  
0.06473004227  
0.04171403835  
-0.01207166597  
-0.09060304815  
-0.1848435943  
-0.2841907141  
-0.3783419615  
-0.4593370621  
-0.5234440293  
-0.572540266  
-0.6146862862  
-0.6636886663  
-0.7375713494  
-0.8561053193  
-1.03766511  
-1.295872001  
-1.636547208  
-2.055493361  
-2.537547227  
-3.057150123  
-3.580462924  
-4.068801719  
-4.482946375  
-4.787710671  
-4.956125204  
-4.972615309  
-4.834727849  
-4.553172835  
-4.150202202  
-3.656616159  
-3.10784115  
-2.539680037  
-1.984311991  
-1.46708789  
-1.004474741  
-0.6033627731  
-0.2616984957  
0.02974708004  
0.2848198759  
0.5190569647  
0.746836045  
0.9789923382  
1.22119068  
1.473237004  
1.729340831  
1.979234011  
2.209923328  
2.407791984  
2.560725209  
2.659963088  
2.701414469  
2.686273871  
2.620876824  
2.515831764  
2.384586992  
2.241637924  
2.100654546  
1.972781052  
1.865365117  
1.781258374  
1.718802814  
1.672455942  
1.633964355  
1.593896094  
1.543290466  
1.475203818  
1.385911958  
1.275599316  
1.148464271  
1.012220606  
0.8770813259  
0.7543773833  
0.655011886  
0.5879714272  
0.5590888647  
0.5702339679  
0.6190318509  
0.6991266486  
0.8009671808  
0.9129738398  
1.02294614  
1.119507143  
1.193402006  
1.238488122  
1.252292521  
1.236090345  
1.194503942  
1.134702588  
1.065318665  
0.9952338739  
0.9324006218  
0.8828467688  
0.8499813569  
0.8342770985  
0.8333506038  
0.8424031876  
0.8549355116  
0.8636464677  
0.8613583501  
0.8418615492  
0.8005702667  
0.7349122291  
0.6444345092  
0.530634149  
0.3965723515  
0.2463587153  
0.08459211456  
-0.08414644127  
-0.2556768553  
-0.426446372  
-0.5935844109  
-0.7548238655  
-0.9083331812  
-1.052537661  
-1.185976677  
-1.307259576  
-1.415130793  
-1.508632234  
-1.587317733  
-1.651466323  
-1.702200012  
-1.741467531  
-1.771841192  
-1.79613894  
-1.816904198  
-1.835833852  
-1.85325356  
-1.867749345  
-1.876054749  
-1.873256935  
-1.85331687  
-1.809877791  
-1.737243429  
-1.631415578  
-1.49100003  
-1.317878068  
-1.117484167  
-0.8986523206  
-0.673008337  
-0.4539653961  
-0.2554337936  
-0.09038637843  
0.0305416845  
0.1002661174  
0.1161318264  
0.08034646451  
-7.572815115e-05  
-0.1138727467  
-0.2465396195  
-0.3817023406  
-0.5027092114  
-0.5943123033  
-0.644261492  
-0.6446594213  
-0.592923295  
-0.4922407086  
-0.3514330693  
-0.184192223  
-0.007732041004  
0.1590549421  
0.2977647456  
0.3927532016  
0.4332330431  
0.4149332838  
0.341059224  
0.2223659354  
0.07624157953  
-0.07516062074  
-0.2075845127  
-0.2978450853  
-0.3271150322  
-0.2838919675  
-0.1661970032  
0.01735736415  
0.2478721279  
0.4979203104  
0.7345874055  
0.9235003302  
1.033299474  
1.039985626  
0.930503664  
0.7050286594  
0.3775602354  
-0.02530209807  
-0.4673124455  
-0.9068765486  
-1.302115428  
-1.615987768  
-1.820749413  
-1.901119628  
-1.855714832  
-1.696593789  
-1.447018334  
-1.137821229  
-0.8029648195  
-0.4749602449  
-0.1808268899  
0.06086570935  
0.241516103  
0.3624623148  
0.4335315868  
0.4705080775  
0.4919978103  
0.5162121186  
0.5581603985  
0.6276472608  
0.7282809397  
0.8575519833  
1.007842214  
1.16811358  
1.325932427  
1.469463592  
1.589138359  
1.678750231  
1.735885484  
1.761702887  
1.760179032  
1.737031526  
1.698545928  
1.650525117  
1.59754081  
1.542576258  
1.487060044  
1.431237212  
1.374727486  
1.317133344  
1.258534318  
1.199762413  
1.142395643  
1.088495115  
1.040126746  
0.9988131142  
0.9650117359  
0.9377691408  
0.9146141642  
0.8917577162  
0.864550728  
0.8281633032  
0.7783609627  
0.7122521023  
0.6288851434  
0.5295749594  
0.4178981175  
0.2993330461  
0.1805698908  
0.06858418515  
-0.03041370463  
-0.1119780061  
-0.174254018  
-0.2184585344  
-0.2489371819  
-0.2727556644  
-0.2988494429  
-0.3368270596  
-0.395598575  
-0.4820058474  
-0.5996632785  
-0.748184783  
-0.9229396239  
-1.115373616  
-1.313878869  
-1.505110546  
-1.675559811  
-1.813179732  
-1.90884209  
-1.957412424  
-1.958314671  
-1.915515483  
-1.836930437  
-1.733368892  
-1.61716179  
-1.500667904  
-1.394870097  
-1.308215717  
-1.245857275  
-1.209336544  
-1.196720103  
-1.203136306  
-1.221589725  
-1.24394352  
-1.261924883  
-1.268039288  
-1.256287036  
-1.222650091  
-1.165292053  
-1.084509823  
-0.9824594122  
-0.8627088169  
-0.7296920853  
-0.5881291334  
-0.4424761112  
-0.2964734245  
-0.1528311014  
-0.01308929674  
0.1223298568  
0.2538981207  
0.3825994366  
0.5094622573  
0.6350599765  
0.7590658772  
0.8799469967  
0.9948425599  
1.099691935  
1.189577059  
1.259284972  
1.303978284  
1.319895001  
1.304964555  
1.25922997  
1.185014686  
1.086778986  
0.9707026797  
0.8440257824  
0.7142645502  
0.588403485  
0.4721809467  
0.3695746645  
0.2825544769  
0.2111200945  
0.1536091756  
0.1072275543  
0.0686959036  
0.03491883411  
0.00357086625  
-0.02648679636  
-0.05501888391  
-0.08048973478  
-0.1003597745  
-0.1115784346  
-0.1111704387  
-0.09683183022  
-0.0674296599  
-0.02332710517  
0.03353157022  
0.09977838665  
0.1710202882  
0.2423975583  
0.3092263081  
0.3676112059  
0.4149344167  
0.4501324909  
0.4737209857  
0.487566155  
0.4944348424  
0.4974216512  
0.4993269343  
0.5021226352  
0.5065687852  
0.5120610045  
0.5167178277  
0.5176860442  
0.5115965009  
0.49509783  
0.4653539104  
0.4204368454  
0.359558213  
0.2831172727  
0.1925728339  
0.09020619451  
-0.02118651668  
-0.1385839485  
-0.2589782684  
-0.3795161257  
-0.4975483686  
-0.6106091601  
-0.7163554998  
-0.8125221624  
-0.8969115608  
-0.9674563166  
-1.022328755  
-1.060100411  
-1.07990047  
-1.0815341  
-1.065531054  
-1.033097937  
-0.9859794491  
-0.9262356235  
-0.8559849476  
-0.7771393948  
-0.6911919829  
-0.5990909243  
-0.5012183934  
-0.3974845878  
-0.2875200539  
-0.17093391  
-0.04759736899  
0.08209324254  
0.2170067736  
0.3551532435  
0.4936605655  
0.6288412961  
0.7563552386  
0.8714349854  
0.9691676214  
1.044801565  
1.09407296  
1.113524415  
1.100799981  
1.054898813  
0.9763579894  
0.8673426349  
0.7316254823  
0.5744348382  
0.4021759544  
0.2220387092  
0.04150920676  
-0.1321553991  
-0.2924592238  
-0.4341418386  
-0.5535426255  
-0.648821949  
-0.7200075907  
-0.768842831  
-0.7984664096  
-0.8129320216  
-0.816628839  
-0.8136565788  
-0.8072364228  
-0.7992178079  
-0.7897686339  
-0.7772880112  
-0.7585791791  
-0.7292786217  
-0.6845125641  
-0.619703387  
-0.5314472993  
-0.4183238158  
-0.2815336445  
-0.1252428644  
0.04345042161  
0.2149605317  
0.3780649972  
0.5210768674  
0.6332140891  
0.7059902655  
0.7344303985  
0.7179370813  
0.660641584  
0.5711691139  
0.4617972027  
0.3471042388  
0.2422615883  
0.1611875398  
0.1148148319  
0.1097266128  
0.1473296632  
0.2237082915  
0.3301729453  
0.4544280253  
0.5821959887  
0.6990704977  
0.7923390324  
0.8525246173  
0.8744476911  
0.8576652672  
0.8062688503  
0.7280703805  
0.6333313318  
0.5332211996  
0.4382379401  
0.3568085039  
0.2942641754  
0.2523092962  
0.2290451902  
0.2195167609  
0.2166766613  
0.2126231236  
0.1999065434  
0.1727235489  
0.1278211892  
0.06498819992  
-0.01293580851  
-0.1005198551  
-0.1905970932  
-0.2753817545  
-0.3476807627  
-0.4020085034  
-0.4354434318  
-0.4480896147  
-0.4430822981  
-0.4261248632  
-0.4046372111  
-0.3866401735  
-0.3795468493  
-0.3890431213  
-0.4182280347  
-0.4671466737  
-0.5327830894  
-0.60950263  
-0.6898895867  
-0.7658288284  
-0.8296774397  
-0.8753310382  
-0.8990461348  
-0.8998764738  
-0.8796837356  
-0.8427344349  
-0.7949510303  
-0.7429549332  
-0.6930506487  
-0.6503093116  
-0.6178939153  
-0.5966971929  
-0.5853535934  
-0.5805841147  
-0.5778014363  
-0.5718855769  
-0.5579688531  
-0.5321472244  
-0.4919879436  
-0.4367967813  
-0.3676052607  
-0.2869194446  
-0.1982744725  
-0.1056795932  
-0.01304520874  
0.07633262308  
0.1601682778  
0.2374012354  
0.3082418264  
0.3740444022  
0.4370334485  
0.4999495494  
0.5656496995  
0.6367132639  
0.7151058868  
0.8019141547  
0.8971732416  
0.9997732748  
1.107446739  
1.216799049  
1.323386662  
1.421816224  
1.505887294  
1.568791535  
1.603388787  
1.602607707  
1.559955229  
1.47016585  
1.329908126  
1.13849809  
0.898511722  
0.6161719859  
0.3014104671  
-0.03247687804  
-0.3696179326  
-0.6927312928  
-0.9846077548  
-1.229716853  
-1.415765965  
-1.534996152  
-1.585042482  
-1.569227794  
-1.496223035  
-1.379101863  
-1.233877871  
-1.077701588  
-0.9269292171  
-0.7952917205  
-0.6923886825  
-0.6226927303  
-0.5851778728  
-0.5736244956  
-0.5775461826  
-0.583642235  
-0.577579075  
-0.5458986251  
-0.4778121645  
-0.3666795405  
-0.2109880261  
-0.01472954876  
0.2128728194  
0.4582568608  
0.7049099012  
0.9351226477  
1.131878906  
1.28069223  
1.371153965  
1.398042981  
1.361845246  
1.268636143  
1.129329722  
0.9583756799  
0.7720641862  
0.5866275441  
0.4163829067  
0.2721242341  
0.1599860637  
0.08091154504  
0.03079706385  
0.001297620936  
-0.01880583543  
-0.04186317413  
-0.07945805381  
-0.1406158964  
-0.230349054  
-0.348752023  
-0.4907513357  
-0.6465713533  
-0.8028512698  
-0.9442661311  
-1.055451748  
-1.122974503  
-1.137084927  
-1.093016343  
-0.9916641283  
-0.8395404455  
-0.648025273  
-0.4320123473  
-0.2081355563  
