227.875201  
256.6439415  
317.4089448  
430.6787429  
561.7477939  
8215.993341  
3518.703355  
13075.93448  
28321.14781  
30965.82831  
36590.70506  
9840.972684  
10261.63359  
9038.6197  
4233.87842  
55628.81825  
14173.77288  
21760.39771  
6894.530402  
10473.52774  
14596.50006  
1498.782897  
6784.908096  
2720.799865  
525.4008547  
7977.275288  
1715.47404  
3535.773603  
12783.50836  
10196.2539  
8252.80155  
1321.788677  
1588.887172  
8661.319214  
32273.32398  
1804.882664  
1412.798218  
5247.454133  
758.1392389  
15648.35614  
20899.72014  
5614.369159  
2615.041976  
8502.415161  
316.0343137  
9211.717484  
5893.181131  
1208.863771  
410.9023408  
2402.494856  
1688.705212  
2195.307929  
892.9703058  
3163.075803  
8468.783808  
1037.543827  
1266.488318  
393.0934768  
4315.410968  
241.7701251  
1296.527284  
69.77147591  
167.2477816  
516.0236421  
337.6067201  
145.5734354  
1.884244036  
77.6361847  
53.61579812  
20.40279441  
7.28462776  
10.91962392  
4.837248148  
7.40793766  
11.94584758  
0.9022117957  
0.8906519523  
3.763324995  
1.662242248  
2.610929757  
2.474434808  
0.4045001891  
0.226013164  
1.459511105  
0.01110194554  
0.2225026943  
0.5967307989  
0.08331984154  
0.1103382568  
0.27468379  
0.07549235515  
0.1376337844  
0.09739644721  
0.04399951184  
0.08521995533  
0.05254485325  
0.0337131583  
0.03044661565  
0.05808015007  
0.02931928781  
0.02678272506  
0.03128460433  
0.02586756635  
0.02406114183  
0.02406438393  
0.02032638296  
0.0175134383  
0.01972954165  
0.01626650369  
0.01472111801  
0.01517299736  
0.01456821048  
0.01359613508  
0.01318142406  
0.01218395304  
0.01227524112  
0.01153811315  
0.01102025926  
0.01086620588  
0.01058805877  
0.01027666138  
0.00988665018  
0.009760014482  
0.009400370747  
0.009376451125  
0.009147790364  
0.008945095159  
0.008783323873  
0.008739956296  
0.008509292301  
0.008428902708  
0.008332250297  
0.008216417543  
0.008123879262  
0.008044976052  
0.007959083918  
0.007877716185  
0.007810521452  
0.007718330847  
0.007665052542  
0.007596480368  
0.007533007112  
0.007467730776  
0.007424819357  
0.007361321613  
0.007313797534  
0.007260645283  
0.007212788359  
0.007164218336  
0.007121478877  
0.007069369571  
0.007026422008  
0.00698355438  
0.006939068381  
0.00689983298  
0.006854926178  
0.006814822133  
0.006776732869  
0.006735982707  
0.00669443795  
0.006656503541  
0.006618250721  
0.006581170356  
0.006544518858  
0.006505429629  
0.006469606351  
0.006433722513  
0.006395201165  
0.00635969912  
0.006324994621  
0.006290221607  
0.00625450063  
0.006219667695  
0.006184773712  
0.006151229958  
0.006116474564  
0.00608293069  
0.006048508866  
0.006016052216  
0.005981710541  
0.005949726824  
0.005917475258  
0.005882840813  
0.005850235342  
0.005819078727  
0.005788117482  
0.005755205259  
0.005724042022  
0.005692902349  
0.005660883314  
0.005630894246  
0.005599736437  
0.005568784079  
0.005538297168  
0.005507745906  
0.005478797888  
0.005448894391  
0.00541963754  
0.005389984348  
0.005360362579  
0.005331486402  
0.005302678526  
0.005273741623  
0.005245602211  
0.005217852244  
0.005189767609  
0.005162281876  
0.00513545087  
0.00510718781  
0.00508037652  
0.005053645109  
0.005027708407  
0.004999950763  
0.00497480963  
0.004947466385  
0.004923095075  
0.004896512555  
0.004871373969  
0.004846111563  
0.004821473358  
0.004796586925  
0.004771346403  
0.004746802549  
0.004722678215  
0.004698676291  
0.004674003842  
0.004650186934  
0.004627000822  
0.00460401794  
0.00458144192  
0.004558448107  
0.004535497567  
0.004514135458  
0.004491434843  
0.004468393408  
0.004447314692  
0.004424909129  
0.004403395931  
0.004381321588  
0.004360369496  
0.004339698153  
0.004318763955  
0.004298549723  
0.004277123125  
0.004256963653  
0.00423682576  
0.004217265374  
0.004197138386  
0.004178238478  
0.004157915383  
0.00413884234  
0.004120271542  
0.00410072772  
0.004081423806  
0.004062649942  
0.00404467026  
0.004026100512  
0.004007959286  
0.003990764489  
0.003972605913  
0.003954232164  
0.003936089746  
0.003919261042  
0.003902773692  
0.003885121652  
0.00386848578  
0.003851872247  
0.003835686644  
0.003819053686  
0.003802984977  
0.003786226408  
0.0037703923  
0.003754658847  
0.003738075488  
0.003723494767  
0.003707099439  
0.003692986234  
0.003676625297  
0.003661457246  
0.003647184575  
0.003633078196  
0.003617533862  
0.00360385995  
0.003589396535  
0.00357441863  
0.003559307989  
0.003547403891  
0.003532067747  
0.00351922186  
0.003505767808  
0.003491565293  
0.003478491915  
0.003465014047  
0.003452633845  
0.00343977517  
0.003426635148  
0.003413021664  
0.003400477756  
0.003389082435  
0.00337574149  
0.003363314819  
0.003351247326  
0.00333941639  
0.003327123216  
0.003315822128  
0.003304322597  
0.003292545476  
0.003281626878  
0.003269458039  
0.003257335521  
0.003246951459  
0.003234823422  
0.003224554791  
0.003213158089  
0.003202133113  
0.003192508635  
0.003182337306  
0.00317090958  
0.003160261402  
0.003150823869  
0.003141390252  
0.003130226126  
0.003119939  
0.003110016007  
0.003100663286  
0.003091355536  
0.003080462846  
0.003071559771  
0.003061672832  
0.003052785217  
0.003043568393  
0.003034484426  
0.003025594617  
0.003016428482  
0.003007332161  
0.002998892581  
0.002989829483  
0.002981390221  
0.002972711318  
0.002964508069  
0.002955826192  
0.002947535367  
0.002939267313  
0.002930588742  
0.0029225113  
0.002914697911  
0.00290747737  
0.002899038846  
0.002891081982  
0.002883528778  
0.002875780358  
0.002868076274  
0.002860682981  
0.00285327727  
0.002846424822  
0.00283931626  
0.00283177991  
0.00282453592  
0.002817819246  
0.002810589016  
0.0028038193  
0.002797251752  
0.002790790606  
0.002784402551  
0.002777034703  
0.002770779664  
0.002764956137  
0.002757685353  
0.002751636509  
0.002745185436  
0.002739578004  
0.002732506122  
0.002726171684  
0.002720509655  
0.00271434219  
0.002709455486  
0.002704904501  
0.002697544901  
0.002692349285  
0.002686541003  
0.002680339252  
0.002675148219  
0.002670014439  
0.002664157077  
0.002658569335  
0.002654715495  
0.002649220215  
0.002643426839  
0.002638132237  
0.002633834213  
0.00262848554  
0.002623839152  
0.002619478987  
0.00261501397  
0.00260992495  
0.002605092024  
0.00259969868  
0.002595747025  
0.002591580497  
0.002587120515  
0.002583093721  
0.002578277927  
0.002573928718  
0.002570258228  
0.002565619518  
0.002561864427  
0.002557437372  
0.002553639251  
0.002548845686  
0.002546186408  
0.002542266642  
0.002538009008  
0.002534365337  
0.002530997993  
0.002527749887  
0.00252345553  
0.002520490653  
0.002517148745  
0.0025131975  
0.002510038639  
0.002507521901  
0.002504345384  
0.002500371626  
0.002496914609  
0.002492998304  
0.002491554909  
0.002487192584  
0.002485424709  
0.002482196575  
0.002479327882  
0.002476738311  
0.002473768069  
0.002470906987  
0.002467696505  
0.002466063956  
0.002462682286  
0.002460398705  
0.002457975724  
0.002455562149  
0.002452945919  
0.002450965001  
0.002448184433  
0.002446239861  
0.002443905749  
0.002441485128  
0.002439825055  
0.002438392187  
0.002435261051  
0.002434280502  
0.002432069251  
0.002430079051  
0.002428264334  
0.002426074554  
0.002424516981  
0.002422833476  
0.002421296113  
0.002419456396  
0.002417841585  
0.002416605089  
0.002415128031  
0.002413229674  
0.002412163228  
0.002410917261  
0.002409497019  
0.002408227758  
0.002407319583  
0.002405199029  
0.002404330479  
0.002403273131  
0.002402713979  
0.002401600825  
0.002400473643  
0.002399099367  
0.002398929771  
0.002397324375  
0.002397265055  
0.002396528262  
0.002395365649  
0.002394931053  
0.002394144485  
0.002392817277  
0.002393451959  
0.002393023986  
0.002392773926  
0.002391177746  
0.00239145208  
0.002391301887  
0.0023905929  
0.002390904089  
0.002390175622  
0.002390232801  
0.002389878289  
0.002390704335  
0.00238930186  
