4.857854292  
6.750143315  
11.94732426  
30.2963643  
126.5080656  
8263.708072  
76706.94854  
31981.00797  
46655.17735  
157153.4462  
1822.667114  
3833.320943  
26212.35608  
30048.37097  
115.3327312  
3796.366819  
19541.64979  
3513.803202  
11216.15411  
2161.096265  
1932.59841  
9693.34798  
2131.680405  
6558.62031  
879.9052036  
6426.72868  
3212.909727  
2258.268561  
1399.092584  
215.6229592  
430.9253507  
2867.625392  
1872.624072  
3432.579687  
3173.959962  
1035.815113  
397.0716383  
1522.08667  
215.5330571  
318.411572  
557.177968  
4280.888124  
194.0409291  
741.0915024  
35.76587485  
441.6515537  
5.211853075  
149.301844  
405.1394809  
0.1097008366  
1278.410779  
1745.77711  
545.1849895  
953.0687749  
1414.54317  
72.25650278  
239.0939317  
591.2160092  
93.88406246  
38.00925097  
15.01167406  
92.99243145  
38.81807178  
17.47798429  
123.062335  
103.1027155  
101.887024  
33.66621253  
31.1181394  
20.86062995  
4.344842021  
0.09187462972  
4.607698083  
3.603028693  
2.52399067  
2.396656959  
2.050813943  
1.546959373  
1.286304951  
0.801014443  
1.083968844  
1.254276407  
0.8264847416  
0.6752748375  
0.3038855689  
0.6778695482  
0.5327853129  
0.6164890599  
0.5399663346  
0.5120745402  
0.456213662  
0.4326892495  
0.4290300118  
0.3923851812  
0.3663413676  
0.3410635349  
0.3336892153  
0.3180673782  
0.2990976961  
0.2748849444  
0.2594682533  
0.2530512335  
0.234630982  
0.2311713608  
0.214723317  
0.2067668828  
0.1971712397  
0.1869794107  
0.1772079567  
0.170190868  
0.1628866172  
0.1561066025  
0.1490776981  
0.1425101075  
0.136518098  
0.130929409  
0.125334369  
0.1203622297  
0.1156446773  
0.1109643111  
0.1066196042  
0.1024033445  
0.09853574424  
0.09484617426  
0.09127591059  
0.08783361439  
0.08457723017  
0.08157826335  
0.07858784785  
0.07580960632  
0.07312421093  
0.07054961524  
0.06806640176  
0.06574702669  
0.06349609418  
0.06135567146  
0.05931833685  
0.05735810411  
0.05544702792  
0.05365503698  
0.05191470005  
0.05025674912  
0.04866333746  
0.04712987394  
0.04565417568  
0.0442366044  
0.04288040481  
0.0415769849  
0.04031908122  
0.03911152211  
0.03794654795  
0.03682678911  
0.03574234341  
0.03470515412  
0.0337048682  
0.03272859378  
0.03180213478  
0.03089770474  
0.03003328172  
0.02919135831  
0.02838536007  
0.02761186494  
0.02685136999  
0.02612085945  
0.02541963955  
0.0247401051  
0.02407737134  
0.02344093645  
0.02282390014  
0.02222925408  
0.02165158338  
0.02109261497  
0.02055349571  
0.02002981908  
0.01952627195  
0.01903176364  
0.01855984122  
0.01809737468  
0.01764917933  
0.01721505445  
0.01679550029  
0.01638546556  
0.01598817214  
0.01560664093  
0.01523593493  
0.01486957503  
0.01451892087  
0.01417894566  
0.01384837172  
0.01352367559  
0.01321303909  
0.01291142281  
0.01260999541  
0.01232596283  
0.01204736132  
0.01177368204  
0.01151046971  
0.01125324792  
0.01100573745  
0.01075962941  
0.01052577329  
0.0102949191  
0.01007082447  
0.009849963521  
0.009639330821  
0.009432804505  
0.009230551422  
0.009034231076  
0.008843683728  
0.008654501302  
0.008475127157  
0.0082969275  
0.008125460864  
0.007959555085  
0.007790591575  
0.007630183816  
0.007476856368  
0.007325545658  
0.007175488742  
0.00703092174  
0.006889058312  
0.006750456039  
0.006617463974  
0.006485529181  
0.00635738529  
0.006231218373  
0.006109378064  
0.005988078756  
0.005873736059  
0.005759102903  
0.005648108518  
0.00554053368  
0.005435226659  
0.005329343715  
0.005227015709  
0.005130002459  
0.005031941852  
0.004936869303  
0.004843205377  
0.0047544578  
0.004664838107  
0.004579298029  
0.004493722494  
0.004410040394  
0.004330679518  
0.004251327949  
0.004173785498  
0.00409781464  
0.004023782626  
0.003950802399  
0.003878985789  
0.003811389511  
0.003742680261  
0.003675393905  
0.003610236047  
0.003545737665  
0.003483482872  
0.003422816797  
0.003361247064  
0.003303497321  
0.003244736238  
0.003188909826  
0.003133658443  
0.003079544575  
0.003026208029  
0.002974416172  
0.002924031271  
0.002874913867  
0.002825635386  
0.002776832647  
0.002729435623  
0.002683476072  
0.002637927906  
0.002594646514  
0.002551115977  
0.002507214149  
0.002465989871  
0.002426302244  
0.002384782553  
0.002346641384  
0.002307178335  
0.0022692037  
0.002231944955  
0.002195868619  
0.002159748025  
0.002125353542  
0.002089879686  
0.002056172322  
0.002023331889  
0.001989681291  
0.001958056533  
0.00192609566  
0.001895530433  
0.001866619843  
0.001835588705  
0.00180633928  
0.001778217633  
0.001750527901  
0.001723392025  
0.001695403785  
0.001668072872  
0.00164247967  
0.001616047962  
0.001592647399  
0.001567716977  
0.001542247571  
0.001518849663  
0.001495086996  
0.001472310404  
0.001449830452  
0.001426925083  
0.001405617921  
0.001383955794  
0.001362913498  
0.001341741584  
0.001322376466  
0.001301779651  
0.001281612085  
0.001262303361  
0.001243364904  
0.001224395027  
0.001206000464  
0.001187926696  
0.001170296466  
0.001152437256  
0.001135538397  
0.001118390786  
0.001101983619  
0.001086611334  
0.001069079536  
0.001054222815  
0.001037812881  
0.001022962416  
0.001009124836  
0.0009936303908  
0.0009786064587  
0.0009645832638  
0.0009503532668  
0.0009364199413  
0.0009231871028  
0.0009099183778  
0.0008960843229  
0.0008842996884  
0.0008704852999  
0.000857905004  
0.0008465300304  
0.0008342304851  
0.0008219633298  
0.0008105727139  
0.0007992275525  
0.0007877974837  
0.0007762016116  
0.0007656327236  
0.0007541974776  
0.0007442497064  
0.0007340406334  
0.0007233978714  
0.0007131105864  
0.0007036831276  
0.000693508133  
0.0006834352078  
0.0006739426327  
0.0006646986244  
0.0006558010219  
0.0006461579441  
0.0006373766563  
0.0006290258661  
0.0006200844293  
0.0006121690936  
0.0006043576388  
0.0005954924119  
0.0005877438541  
0.0005799040222  
0.0005718076109  
0.0005633760965  
0.000556173236  
0.000548780573  
0.0005415221155  
0.000534582185  
0.0005273698552  
0.0005203392166  
0.000513030034  
0.0005062486897  
0.0004997438684  
0.0004940681043  
0.0004866798225  
0.0004804811806  
0.0004739877233  
0.0004676660433  
0.0004619459175  
0.0004560312824  
0.0004507499769  
0.000444312968  
0.0004391087054  
0.0004335532375  
0.0004277148364  
0.0004225503482  
0.000417258628  
0.0004123528493  
0.0004072783462  
0.0004018848981  
0.0003974483642  
0.0003921788898  
0.0003874781333  
0.000382681606  
0.0003782812482  
0.0003734708625  
0.0003689392322  
0.0003650191656  
0.0003602043834  
0.000355706244  
0.0003520631057  
0.0003477265759  
0.0003434906724  
0.0003395889965  
0.000336542009  
0.0003320126093  
0.0003282773326  
0.00032470858  
0.0003208356702  
0.0003173361623  
0.0003140100798  
0.0003104565669  
0.0003071953935  
0.0003040922439  
0.0003004994182  
0.000297199279  
0.0002944529455  
0.0002916370645  
0.0002884452821  
0.0002855575394  
0.0002827571897  
0.0002792139234  
0.0002769572061  
0.0002744942014  
0.0002712721146  
0.0002690381863  
0.0002663501446  
0.0002640916682  
0.0002617351014  
0.00025927324  
0.0002569990795  
0.000254559664  
0.0002523776648  
0.0002500667275  
0.0002478353082  
0.0002461382698  
0.0002442187864  
0.0002417060742  
0.0002399931267  
0.0002382744988  
0.000235860749  
0.00023433654  
0.000232599604  
0.0002314326971  
0.0002295529953  
0.0002276729379  
0.0002260717234  
0.0002246318716  
0.0002238076042  
0.0002218547991  
0.0002205669502  
0.0002192831816  
0.0002181598178  
0.0002167347614  
0.0002158863716  
0.0002149423141  
0.0002134533517  
0.0002123477887  
0.000211119097  
0.0002104665087  
0.000209552147  
0.0002084571311  
0.0002074395003  
0.0002069525693  
0.0002060744672  
0.0002051987778  
0.0002046412168  
0.0002043153332  
0.0002032999494  
0.0002031077675  
0.000202226895  
0.0002017432774  
0.0002014569361  
0.0002011698089  
0.0002006672954  
0.0002007001413  
0.0001999800427  
0.0002000976998  
0.0001996363508  
0.0001997040746  
0.0001993953362  
0.0001997233271  
0.0001992081994  
