27,-0.003242,0.016999,0.024212,-0.98781,0.0021098,-1.9316,0.95544,0.59593,3.9144,0.1188,3.2261,0.00040732,0.53631,3.4931,0.023526,4.7811,0.0048688,0.98822,0.078564,0.059802,0.049761,0.042113,0.25679,0.37887,0.29036,0.01667,0.0091658,0.0070995,0.041041,0.39585,0.35666,0.0040324,265.54,835.65,1122.1,891.3,3115.4,0.14367,0.12613,0.14367,1.5609,1.7476,0.50898,0.19172,0.01751,26,246.58,5982,1.3616e+06,4.7873,23.961,1.6151e+05,4968,3942,0.90667,0.91388,0.42644,0.3438,0.21294,0.94054,64995,32341,0.0017052,0.00053592,0,0.070955,0,0.062982,0.0012375,0.0084742,0.0038838,0.013099,1.1117,3.6063,2.0208,0.19126,0.36796,0.34941,0.19723,0.42117,0.33348,0.21467,0.41784,0.31865,87.807,9.434,23779,85024,84448,0.063839,0.059229,0.037582,0.23608,0.25158,0.07249,0.41688,0.45979,0.090198,0.57783,0.6242,0.099486,0.70994,0.75098,0.10402,0.0088244,0.0098275,0.12674,0.034038,0.066782,0.033629,0.018731,0.021542,0.1272,0.045003,0.088096,0.057313,0.031594,0.036827,0.12666,0.055697,0.10853,0.078461,0.0064706,0.0082643,0.20892,0.043345,0.073144,0.073261,0.014555,0.01871,0.21464,0.059227,0.095977,0.097654,0.025349,0.032527,0.21661,0.074938,0.11832,0.12086,0.0023539,0.0015632,0.066973,0.0086986,0.024542,-0.045939,0.0041761,0.0028324,0.058654,0.0086157,0.031089,-0.053985,0.0062324,0.004294,0.053197,0.0084385,0.037007,-0.061745,0,0,0,-0.003345,0.0067699,0,8.5495e-08,4.4734e-08,7.8712e-06,-0.0045347,0.0095012,-0.012804,1.1964e-05,6.7344e-06,0.00053533,-0.0058058,0.013065,-0.020549,0.35588,74,74,40,988,3,3,3,0.645
27,-0.0043444,0.02221,0.031758,-0.98398,0.0023686,-1.9305,0.96199,0.17536,2.5603,0.027255,3.3172,0.00033252,0.42765,2.4166,0.031254,3.0062,0.0030614,0.98435,0.080415,0.053879,0.044855,0.038013,0.23921,0.32697,0.35835,0.023631,0.0083097,0.0063966,0.037133,0.39803,0.32032,0.039949,113.39,886.97,1207.9,977.86,3186.8,0.191,0.081357,0.191,1.078,1.0926,0.37166,0.22129,0.023664,33,121.76,3773,4.2753e+05,5.4702,30.961,1.0187e+05,2862,1863,0.91857,0.93438,0.30552,0.24509,0.092186,0.90976,73460,25461,0.00077878,0.00044877,0,0.073192,0,0.088829,0.0031587,0.015733,0.0093285,0.020356,0.20974,1.7,0.72006,0.17035,0.36577,0.37597,0.14222,0.39143,0.43383,0.13501,0.38678,0.45649,79.618,10.151,30083,88129,87562,0.058098,0.038678,0.021776,0.16106,0.13165,0.031487,0.28623,0.25313,0.039429,0.40511,0.35991,0.044407,0.50561,0.45701,0.047168,0.020245,0.016725,0.18513,0.073724,0.089423,-0.071955,0.041271,0.035397,0.17844,0.093068,0.11754,-0.077326,0.067156,0.059314,0.17141,0.11069,0.14478,-0.078753,0.01706,0.014877,0.35071,0.10081,0.089989,-0.047783,0.033421,0.030873,0.31379,0.11853,0.11751,-0.036487,0.052076,0.050305,0.28331,0.13296,0.14374,-0.019662,0.00284,0.0016517,0.051446,0.0096256,0.037686,-0.067046,0.0060502,0.0034283,0.054102,0.013574,0.046171,-0.088893,0.0096915,0.0054101,0.052668,0.016002,0.052999,-0.10709,0.00034463,0.00019626,0.062564,0.0055028,0.018709,-0.038522,0.0017997,0.0010961,0.10549,0.01505,0.029019,-0.060321,0.0054312,0.0036213,0.15473,0.030922,0.04347,-0.076864,0.3393,74,74,40,988,3,3,3,0.645
27,-0.0054899,0.028402,0.040544,-0.9795,0.0032858,-1.9185,0.95862,-0.27405,3.7833,0.050376,3.2614,0.00010457,0.61079,3.0598,0.039768,3.9572,0.0040215,0.98008,0.10753,0.061299,0.049741,0.041899,0.18165,0.31238,0.40477,0.040995,0.010813,0.0074726,0.041914,0.27443,0.31422,0.10271,28.957,436.84,790.12,691.4,1948,0.17453,0.3001,0.3001,0.68081,0.831,0.27354,0.24966,0.0294,58,35.155,1523,40079,7.1319,53.029,41121,6615,1701,0.92693,0.94712,0.18164,0.12962,0.098808,0.81915,19883,13303,0.00081425,0.00035652,0,0.095499,0,0.080377,0.035518,0.15691,0.066945,0.31045,1.1099,3.6795,2.8689,0.20436,0.34477,0.34455,0.30666,0.38559,0.21035,0.32159,0.39218,0.19648,25.195,9.3028,17171,28397,27526,0.15641,0.15156,0.036321,0.42397,0.43424,0.051353,0.62056,0.6619,0.052963,0.71506,0.76373,0.048563,0.78277,0.81984,0.045242,0.084297,0.090629,0.47759,0.26327,0.2214,0.063082,0.15042,0.15865,0.40293,0.29079,0.25534,0.057428,0.21492,0.22451,0.33987,0.30347,0.27977,0.055682,0.046333,0.050484,0.59012,0.22301,0.1825,0.053818,0.08128,0.085757,0.47281,0.23523,0.2014,0.039953,0.11298,0.11751,0.38081,0.23559,0.21399,0.033445,0.035875,0.038334,0.40264,0.15279,0.13116,0.035943,0.065017,0.069744,0.36021,0.17692,0.15842,0.047559,0.09516,0.1021,0.3204,0.19287,0.17889,0.055958,0.0020891,0.0018112,0.23498,0.036683,0.038625,-0.023702,0.0066284,0.0058586,0.24072,0.051028,0.05164,-0.027007,0.013504,0.01234,0.23835,0.065737,0.066932,-0.026113,0.39602,74,74,40,988,3,3,3,0.645
27,-0.0034805,0.016718,0.024501,-0.98766,0.00087692,-1.9575,0.98194,-0.45898,3.5635,-0.054458,3.2688,0.00010952,0.46205,2.9467,0.024537,3.8558,0.0039265,0.98772,0.051867,0.024524,0.018691,0.015202,0.26181,0.40911,0.27847,0.02604,0.0057355,0.0034624,0.015368,0.38456,0.38551,0.027195,110.78,2232.8,4987.2,7102.3,14434,0.13321,0.15279,0.15279,0.47312,0.78728,0.24382,0.1957,0.019022,43,118.35,2319,1.3815e+05,4.8692,28.388,62613,15876,15741,0.92098,0.93527,0.31683,0.23483,0.21716,0.75252,56096,27110,0.0008778,0.00044022,0,0.037865,0,0.044102,0.0033485,0.0023816,0.0060831,0.012254,0.28522,0.54724,1.3734,0.20509,0.40185,0.29946,0.22783,0.50694,0.21334,0.26073,0.4958,0.19188,39.088,8.0855,21118,55662,54924,0.058904,0.046065,0.032453,0.30734,0.28352,0.088322,0.58752,0.59025,0.11897,0.78529,0.79939,0.12653,0.9034,0.91681,0.12388,0.011106,0.016469,0.14929,0.044269,0.10275,0.17331,0.026553,0.041578,0.16875,0.067748,0.14829,0.27649,0.047392,0.072032,0.17781,0.089826,0.18326,0.32244,0.004319,0.010371,0.13051,0.025443,0.083554,0.37787,0.013188,0.029293,0.18201,0.050918,0.13362,0.44395,0.02592,0.051919,0.20729,0.074332,0.1701,0.46611,0.0067338,0.006053,0.17931,0.038332,0.064704,-0.025862,0.01359,0.012459,0.17863,0.049576,0.082615,-0.027403,0.022071,0.020584,0.17631,0.060083,0.097643,-0.027224,5.3395e-05,4.4685e-05,0.014249,-0.001693,0.0060697,-0.0058748,0.00020763,0.00017595,0.01789,-0.0017621,0.0087157,-0.0070736,0.00048721,0.00040385,0.020403,-0.0018147,0.012898,-0.011243,0.40876,74,74,40,988,3,3,3,0.645
27,-0.0028633,0.013594,0.01993,-0.98997,0.00069411,-1.9626,0.98243,-0.037195,2.6609,-0.044062,3.3126,0.00014119,0.42451,3.0002,0.01998,3.788,0.0038574,0.99,0.03941,0.016553,0.012209,0.0094909,0.31445,0.37237,0.27448,0.02208,0.0043093,0.0027148,0.0095962,0.4701,0.32421,0.04203,165.58,4219.5,8877.1,19277,32540,0.12644,0.081507,0.12644,1.3396,1.8409,0.44277,0.17675,0.011641,49,72.714,2251,1.0271e+05,6.4135,43.666,60777,6507,5859,0.92391,0.9394,0.13497,0.096702,0.080542,0.45722,51804,22848,0.00081702,0.00036794,0,0.050154,0,0.049679,0.0011991,0.022056,0.0017962,0.034505,1.1626,2.5743,1.6902,0.19238,0.38519,0.33456,0.22141,0.46638,0.27045,0.24018,0.47373,0.24997,39.089,9.0332,22072,46797,45869,0.04197,0.033346,0.016479,0.26574,0.26665,0.054423,0.54625,0.57319,0.078827,0.7469,0.77938,0.085766,0.85011,0.87725,0.083077,0.0059001,0.0057536,0.056518,0.015395,0.060276,-0.0066477,0.013337,0.013926,0.060404,0.022492,0.08287,0.015205,0.022477,0.02441,0.060097,0.027777,0.10319,0.036895,0.0034276,0.0038302,0.073813,0.015658,0.045989,0.026939,0.0091712,0.01073,0.090203,0.027198,0.066595,0.050559,0.016739,0.020058,0.095397,0.036612,0.085425,0.074931,0.002355,0.0018433,0.044689,0.0070716,0.035224,-0.032519,0.0041593,0.0032255,0.038962,0.006936,0.044245,-0.040077,0.005917,0.0045705,0.033685,0.0059849,0.051997,-0.047009,0.00011747,8.0067e-05,0.02234,0.00012992,0.026507,-0.015897,0.00037453,0.00025516,0.022998,0.00028988,0.035708,-0.020639,0.00083529,0.00057276,0.024928,0.00081157,0.044622,-0.027964,0.36391,74,74,40,988,3,3,3,0.645
27,-0.0026905,0.012823,0.018656,-0.99062,0.00084588,-1.9585,0.97707,-0.039458,3.2424,-0.03065,3.2712,7.6797e-05,0.42638,3.1163,0.018683,4.5047,0.0045872,0.99065,0.042328,0.014599,0.012198,0.010291,0.35332,0.30931,0.29586,0.026807,0.0023903,0.0019071,0.010414,0.49305,0.20967,0.022002,114.46,14785,18368,17375,50644,0.40866,0.16295,0.40866,0.81592,2.0429,0.47856,0.17487,0.015723,54,72.778,2388,1.1043e+05,6.4033,44.462,64476,15498,9423,0.92299,0.94145,0.10394,0.072946,0.068074,0.45168,25509,14530,0.0011581,0.00059186,0,0.040279,0,0.050021,0.012228,0.033208,0.027132,0.047917,0.47382,3.1155,2.9699,0.23149,0.30727,0.29888,0.35288,0.24884,0.12947,0.38595,0.23126,0.10987,13.385,8.0698,9427.5,19942,18677,0.32934,0.32162,0.13175,0.77974,0.81304,0.1627,0.89197,0.91389,0.13114,0.93863,0.95319,0.10981,0.96953,0.97683,0.096533,0.0075769,0.0062824,0.073949,0.022635,0.065062,-0.054726,0.016373,0.013823,0.075552,0.030697,0.088096,-0.066852,0.029202,0.025029,0.079551,0.041048,0.11158,-0.078876,0.0021966,0.0018247,0.048195,0.0078251,0.037496,-0.032291,0.0055781,0.0048082,0.055897,0.013371,0.051713,-0.036217,0.010767,0.0096647,0.062517,0.01998,0.06769,-0.034841,0.0053623,0.0044444,0.10367,0.024574,0.050411,-0.044861,0.011024,0.0091988,0.10521,0.032527,0.067666,-0.056909,0.018762,0.015647,0.10882,0.041778,0.084334,-0.07172,1.802e-05,1.3222e-05,0.0034914,-0.002302,0.022135,-0.015549,0.00020978,0.00015647,0.013124,-0.0014723,0.029229,-0.023419,0.00087138,0.00065794,0.026495,0.0010639,0.036546,-0.029282,0.46512,74,74,40,988,3,3,3,0.645
27,-0.0020539,0.0097819,0.014255,-0.99284,0.00061818,-1.9639,0.97808,-0.5172,3.3089,-0.063091,3.2676,9.0777e-05,0.3449,2.8827,0.014285,3.6536,0.0037205,0.99285,0.038857,0.015859,0.012258,0.0099233,0.41645,0.27567,0.26892,0.022701,0.0036476,0.0023788,0.010235,0.52674,0.11182,0.15089,211.29,7511,14900,22606,45229,0.21627,0.14626,0.21627,0.43466,1.1731,0.26691,0.14956,0.011877,59,68.424,2379,1.0533e+05,6.2977,44.259,64233,15957,15579,0.92585,0.94541,0.18377,0.1227,0.1535,0.59405,28348,16662,0.00089515,0.00043946,0,0.039854,0,0.0488,0.0071831,0.026883,0.01399,0.040392,1.0103,0.35965,1.8224,0.20143,0.36193,0.3032,0.27308,0.39589,0.15819,0.28576,0.38908,0.14643,22.914,8.1864,9429.1,18321,16352,0.20618,0.20324,0.085253,0.55978,0.57891,0.12073,0.76535,0.78811,0.11631,0.86844,0.88354,0.10502,0.91358,0.92372,0.094021,0.019565,0.020447,0.19737,0.074594,0.10787,0.031315,0.041609,0.043783,0.19846,0.098762,0.14091,0.046776,0.066479,0.070674,0.18719,0.11506,0.16875,0.067844,0.0041515,0.003897,0.094149,0.020853,0.050408,-0.020915,0.0099836,0.0098055,0.10341,0.031166,0.068614,-0.0079571,0.017205,0.017653,0.10326,0.038942,0.085837,0.014214,0.014128,0.015157,0.28234,0.07668,0.093976,0.041725,0.028877,0.031301,0.28487,0.10059,0.12175,0.061222,0.044843,0.048918,0.26884,0.11628,0.14279,0.078301,0.0012855,0.0013926,0.25745,0.029198,0.037167,0.01753,0.0036675,0.0040073,0.23716,0.036174,0.047534,0.026095,0.0070245,0.0078072,0.22077,0.043496,0.060255,0.03956,0.45357,74,74,40,988,3,3,3,0.645
27,-0.0029327,0.015101,0.021505,-0.98918,0.0017305,-1.9377,0.95892,-0.31003,2.8527,-0.024952,3.3011,9.0564e-05,0.36959,2.5531,0.020913,3.1685,0.0032265,0.98953,0.072722,0.051008,0.042315,0.035905,0.34605,0.27542,0.30886,0.019792,0.0081543,0.0061003,0.035618,0.47905,0.16722,0.0069787,216.95,1182.5,1743.9,1387.5,4531.5,0.18088,0.11633,0.18088,1.8022,1.9144,0.545,0.18155,0.01507,46,124.15,2957,2.483e+05,4.6509,24.836,79839,41958,25137,0.91083,0.923,0.36134,0.28128,0.17412,0.90177,59646,31054,0.00095849,0.00045775,0,0.060456,0,0.055479,0.00054269,0.0083539,0.0025347,0.0068142,0.21403,1.8571,1.5969,0.16054,0.40042,0.35793,0.14031,0.46657,0.36668,0.13024,0.4782,0.37336,64.033,9.6641,17583,53680,52645,0.04887,0.03606,0.026736,0.21807,0.2021,0.062229,0.43276,0.4399,0.087016,0.63286,0.66196,0.10126,0.7976,0.83117,0.10861,0.0030282,0.0020196,0.040419,0.0039863,0.040294,-0.054825,0.0059727,0.0042046,0.037692,0.0039097,0.052202,-0.065941,0.010291,0.00767,0.038338,0.0052605,0.063681,-0.073156,0.0019754,0.0012867,0.059274,0.0075039,0.035051,-0.044888,0.0034449,0.0023922,0.04721,0.0058798,0.04373,-0.049711,0.0054587,0.0041122,0.043347,0.0057358,0.05211,-0.050472,0.0010528,0.00073285,0.027838,-0.00048115,0.021551,-0.031509,0.0025808,0.0018435,0.033685,0.0013306,0.028994,-0.044356,0.0049508,0.0036282,0.039271,0.0039389,0.036275,-0.054278,0,0,0,-0.0032209,0.0098832,0,0,0,0,-0.0043675,0.013281,0,9.9372e-07,5.9414e-07,4.1322e-05,-0.0056776,0.017734,-0.015004,0.36534,74,74,40,988,3,3,3,0.645
27,-0.0060671,0.029858,0.0434,-0.97804,0.0021649,-1.9314,0.97474,0.15256,2.9824,0.037991,3.2947,6.9696e-07,0.60134,2.8805,0.043495,3.664,0.0037236,0.97823,0.090044,0.044572,0.034048,0.027479,0.1588,0.29652,0.45579,0.042976,0.010485,0.0066541,0.02878,0.19671,0.25626,0.12639,29.251,540.19,1134.9,1691.4,3396.3,0.29127,0.2126,0.29127,0.50568,0.56938,0.19868,0.26141,0.034465,75,35.453,1077,20404,5.7662,39.068,29079,13662,10557,0.9261,0.94546,0.22187,0.1518,0.15397,0.76842,17255,11630,0.00087092,0.00035506,0,0.057694,0,0.061213,0.0012576,0.0047944,0.0073987,0.021719,0.182,1.8033,2.1936,0.20447,0.34615,0.34207,0.31814,0.37167,0.22289,0.32577,0.39818,0.19075,22.197,9.2359,12743,21518,19801,0.17568,0.18307,0.053809,0.39665,0.4305,0.063369,0.56959,0.62118,0.064118,0.66758,0.71199,0.0598,0.72605,0.76511,0.05535,0.070842,0.089614,0.52938,0.2533,0.24541,0.29613,0.12261,0.1522,0.43317,0.27076,0.27615,0.32773,0.16998,0.20927,0.35453,0.27339,0.29676,0.36341,0.040079,0.051079,0.67329,0.22125,0.2074,0.23008,0.071803,0.088915,0.5509,0.23827,0.23121,0.24068,0.10067,0.12336,0.44755,0.24056,0.24721,0.26166,0.029309,0.037202,0.43386,0.14261,0.14213,0.18381,0.050133,0.063799,0.36634,0.1553,0.1646,0.22446,0.070051,0.089242,0.31109,0.16099,0.18008,0.25911,0.0014545,0.0013339,0.21578,0.028665,0.037318,-0.016109,0.0040338,0.0038741,0.19322,0.034466,0.048037,-0.010124,0.007439,0.0074744,0.17318,0.039777,0.060031,0.0014974,0.44999,74,74,40,988,3,3,3,0.645
27,-0.0052208,0.025409,0.036702,-0.98146,0.0020927,-1.9345,0.97107,0.75478,5.8188,0.020799,3.1387,0.0029347,0.96114,4.9998,0.036881,7.3002,0.007434,0.98154,0.085046,0.033283,0.026343,0.021794,0.25509,0.28905,0.37689,0.046516,0.0065931,0.00437,0.02149,0.42479,0.25624,0.055516,22.834,1362.6,2571.9,2954.6,6912.7,0.14082,0.17753,0.17753,0.3252,0.35106,0.22698,0.24581,0.028514,34,91.059,2724,2.1525e+05,5.5323,31.749,73548,4347,1998,0.92721,0.94347,0.025633,0.019189,0.0469,0.22553,28636,14790,0.00097568,0.00048418,0,0.076758,0,0.06419,0.006231,0.035353,0.0093416,0.078453,0.44322,0.35414,0.82253,0.20748,0.33213,0.29302,0.26195,0.292,0.17618,0.26456,0.28702,0.15055,20.799,7.9114,32999,72639,71949,0.32532,0.34018,0.10013,0.6897,0.74113,0.11073,0.84294,0.87802,0.095359,0.92898,0.94966,0.083626,0.96668,0.97735,0.074058,0.0015247,0.00105,0.01145,-0.0025942,0.04262,-0.024558,0.0024385,0.0016619,0.008658,-0.0052239,0.055987,-0.031529,0.0040556,0.0027318,0.0085007,-0.0066292,0.068311,-0.042441,2.9173e-05,1.8506e-05,0.0004925,-0.0054522,0.019778,-0.011188,0.00018843,0.00012094,0.0014529,-0.0067896,0.028743,-0.015461,0.00068648,0.00045078,0.003067,-0.0076,0.038229,-0.024055,0.0014735,0.0010162,0.021921,0.0017754,0.035928,-0.023711,0.0020835,0.0014296,0.0153,-0.00062627,0.046266,-0.027344,0.0027017,0.0018412,0.012057,-0.0025398,0.05434,-0.031233,2.1998e-05,1.5266e-05,0.0032795,-0.001929,0.020283,-0.012504,0.00020988,0.00014234,0.010103,-0.0012872,0.025105,-0.017895,0.00081836,0.00054718,0.019146,0.00061646,0.029935,-0.023635,0.39815,74,74,40,988,3,3,3,0.645
27,-0.0038102,0.01816,0.026626,-0.98658,0.00090134,-1.9563,0.98293,0.27393,3.0996,0.082247,3.2973,1.4454e-06,0.5302,3.2402,0.026722,3.9695,0.0040423,0.98662,0.036289,0.018481,0.015635,0.013377,0.24859,0.3689,0.34699,0.017113,0.0027911,0.0022249,0.013389,0.36206,0.3254,0.0067341,265.16,9783.1,12899,9533.7,32482,0.27654,0.11693,0.27654,0.55628,0.61968,0.25785,0.20439,0.020654,50,113.32,1364,93763,2.9743,11.023,36828,33642,30105,0.92248,0.94148,0.29629,0.20573,0.22381,0.76477,40052,25979,0.00093167,0.00042063,0,0.045065,0,0.039477,0.0036306,0.0062745,0.0060628,0.0063484,0.30538,0.074544,0.22538,0.18159,0.40935,0.32503,0.19085,0.52321,0.25605,0.19616,0.53492,0.24297,48.274,8.7759,15137,38263,36850,0.041701,0.035654,0.025223,0.23686,0.23956,0.074727,0.4886,0.50801,0.10862,0.69475,0.7182,0.12289,0.82847,0.84691,0.12472,0.010645,0.0094503,0.15709,0.044043,0.080843,-0.050128,0.02415,0.022054,0.1685,0.063272,0.10905,-0.051132,0.041782,0.039074,0.17209,0.080845,0.13571,-0.047814,0.0061346,0.005398,0.20351,0.041261,0.05648,-0.041146,0.013877,0.012708,0.21025,0.056771,0.078485,-0.037207,0.023249,0.021954,0.20411,0.068607,0.099357,-0.03007,0.0039388,0.0035692,0.11514,0.020184,0.053332,-0.025943,0.0096001,0.0088632,0.13853,0.033677,0.070589,-0.028795,0.017743,0.016666,0.1556,0.048157,0.086337,-0.029116,0.00057188,0.00048315,0.16753,0.013911,0.029469,-0.017755,0.0017751,0.0014849,0.16791,0.018916,0.039239,-0.027957,0.0036323,0.0030025,0.16699,0.024457,0.050501,-0.038634,0.41179,74,74,40,988,3,3,3,0.645
27,-0.0031931,0.015296,0.022314,-0.98877,0.0009775,-1.9556,0.97785,-0.07531,2.3136,-0.089294,3.338,0.00056429,0.43829,2.9343,0.022266,3.8356,0.0039059,0.98886,0.059175,0.02552,0.017643,0.013269,0.28801,0.36415,0.28903,0.032619,0.007946,0.0044666,0.013786,0.41673,0.29445,0.014857,71.421,1222.4,3279.4,9474.4,14048,0.31203,0.15308,0.31203,0.56997,0.71225,0.32167,0.18773,0.017378,67,49.06,1569,38398,7.0012,54.124,42363,7047,6291,0.92566,0.94489,0.15269,0.10313,0.10827,0.61267,41734,19485,0.00079186,0.00037792,0,0.047242,0,0.057424,0.0012543,0.0058006,0.0047596,0.019113,0.40553,0.79115,0.83481,0.18728,0.38231,0.32022,0.20255,0.49375,0.22826,0.21322,0.50148,0.21754,30.933,8.646,13737,25172,23790,0.088419,0.076801,0.03094,0.33181,0.32989,0.060562,0.58433,0.60231,0.07515,0.7542,0.77438,0.077184,0.84046,0.85474,0.0732,0.0034665,0.0028249,0.029594,0.004902,0.059365,-0.047953,0.0074189,0.0060996,0.029946,0.006664,0.076952,-0.060814,0.012891,0.010803,0.030718,0.00888,0.092842,-0.068897,0.0031736,0.0026034,0.060908,0.013226,0.053685,-0.043445,0.0062192,0.0051683,0.054514,0.014836,0.067502,-0.051284,0.009806,0.0083377,0.049806,0.016109,0.079793,-0.053769,0.00029294,0.00022151,0.0049542,-0.0044974,0.029503,-0.027106,0.0012102,0.00093898,0.010103,-0.0037012,0.040168,-0.037555,0.0031781,0.0025338,0.016124,-0.0014733,0.050185,-0.047965,0,0,0,-0.0025618,0.016342,0,0,0,0,-0.0034738,0.021293,0,9.2466e-07,6.7793e-07,2.4593e-05,-0.0045164,0.02685,-0.013353,0.41235,74,74,40,988,3,3,3,0.645
27,-0.0041306,0.019948,0.029067,-0.98534,0.0012618,-1.9491,0.97805,-0.11607,3.1259,-0.026193,3.2766,1.6697e-05,0.6544,3.8283,0.029161,5.0679,0.0051608,0.9854,0.054238,0.025482,0.021136,0.018055,0.25426,0.32911,0.36392,0.027249,0.0042519,0.0030355,0.018168,0.39684,0.30775,0.029469,89.295,3762.7,6116.2,4551.5,14520,0.22016,0.10341,0.22016,0.48596,0.56274,0.2665,0.21418,0.022807,49,71.224,2031,90551,5.7556,37.088,54837,13689,12447,0.92173,0.93944,0.26862,0.19742,0.1522,0.8554,54034,23593,0.0010082,0.00041574,0,0.04391,0,0.055568,0.0014573,0.0049069,0.00068665,0.0098903,0.51874,0.59651,1.5242,0.19339,0.38577,0.32731,0.22341,0.45543,0.26537,0.23252,0.47094,0.24834,42.624,8.8374,15117,31675,30606,0.074847,0.06163,0.027745,0.35927,0.35396,0.069465,0.65684,0.67322,0.089488,0.84055,0.86029,0.091126,0.93377,0.94784,0.086153,0.0086669,0.0066418,0.078383,0.026206,0.070328,-0.074707,0.016827,0.013143,0.07195,0.030674,0.088968,-0.088061,0.026152,0.020774,0.066014,0.033807,0.10574,-0.099424,0.0038078,0.002833,0.077418,0.017577,0.051628,-0.061971,0.009254,0.0071426,0.085931,0.026723,0.068821,-0.071591,0.016043,0.01271,0.086319,0.033648,0.084795,-0.080783,0.0048585,0.0038083,0.087043,0.020827,0.04623,-0.047362,0.0076273,0.0060378,0.067455,0.019138,0.054865,-0.052949,0.010359,0.0082423,0.055675,0.017697,0.06226,-0.059052,6.037e-07,4.3973e-07,0.00010839,-0.0026241,0.016928,-0.011763,2.2335e-05,1.6101e-05,0.0012948,-0.0033474,0.023271,-0.013297,0.00012527,8.8153e-05,0.0035297,-0.0038405,0.029537,-0.017554,0.35622,74,74,40,988,3,3,3,0.645
27,-0.0062938,0.02971,0.04358,-0.97794,0.0014603,-1.9394,0.9831,-0.33693,3.4085,-0.10071,3.2587,0.00010167,0.83989,3.9972,0.04406,5.4804,0.0055808,0.97795,0.043729,0.017468,0.012564,0.0095055,0.21142,0.2645,0.48095,0.025457,0.0049008,0.00308,0.0096934,0.3418,0.21868,0.16396,95.254,2460,5161.4,14736,22453,0.15258,0.18127,0.18127,0.83883,1.1702,0.38904,0.26675,0.03523,22,412.77,6769,2.248e+06,3.7704,16.128,1.8276e+05,62424,837,0.9217,0.93379,0.52302,0.38698,0.36225,0.97408,39680,29055,0.0005773,0.00042808,0,0.069196,0,0.066454,0.0032674,0.0034269,0.00051209,0.0027857,4.1804,5.5962,1.6372,0.1343,0.26314,0.52834,0.083546,0.16932,0.73758,0.08685,0.1591,0.7469,90.115,14.265,15589,42493,40314,0.010934,0.0081631,0.0086598,0.028981,0.022125,0.011972,0.067197,0.053712,0.01956,0.15159,0.12829,0.035113,0.28386,0.25225,0.055957,0.0016864,0.0012803,0.032585,-0.0032453,0.041611,-0.054131,0.0048244,0.0038124,0.044074,0.00043782,0.056404,-0.067968,0.010129,0.0082477,0.054631,0.0059293,0.071501,-0.081161,0.00027445,0.00019525,0.011922,-0.0066021,0.034145,-0.02414,0.00076786,0.00055565,0.015234,-0.0078077,0.040458,-0.03766,0.0016704,0.0012284,0.019203,-0.0083767,0.046521,-0.048561,0.0012807,0.0009872,0.049022,0.0012962,0.02291,-0.045613,0.0037403,0.0030152,0.070675,0.0077456,0.035109,-0.055232,0.0079072,0.0065989,0.0908,0.016472,0.048392,-0.064055,0.00013122,9.7795e-05,0.050337,0.00066523,0.015187,-0.020811,0.00052319,0.00039412,0.064802,0.0026818,0.023325,-0.028593,0.0013085,0.00099472,0.078767,0.0057279,0.032232,-0.03993,0.35804,74,74,40,988,3,3,3,0.645
27,-0.0048013,0.023426,0.033951,-0.98286,0.0017295,-1.9404,0.9742,-0.023816,2.6802,-0.015866,3.313,6.261e-05,0.53407,2.8922,0.034029,3.6803,0.0037478,0.98297,0.056245,0.032747,0.026667,0.02233,0.26042,0.303,0.38231,0.021954,0.0058439,0.0042111,0.022261,0.44214,0.27939,0.062531,134.99,1792,2866.2,2837.2,7631.1,0.13714,0.08326,0.13714,0.40586,0.57513,0.19065,0.23101,0.026586,37,56.432,1898,95956,5.7871,34.667,51246,3672,1215,0.92617,0.94714,0.16245,0.12412,0.039784,0.74823,49619,15602,0.00079761,0.000353,0,0.11145,0,0.1083,0.0015231,0.014195,0.0061371,0.030491,2.2657,2.5583,0.64219,0.16697,0.36758,0.35943,0.12415,0.42113,0.37132,0.11744,0.40604,0.39602,49.748,9.7046,33650,68515,67748,0.082642,0.067028,0.018413,0.28453,0.29062,0.033066,0.51925,0.56382,0.042519,0.71245,0.77921,0.046424,0.84868,0.89986,0.047063,0.0055906,0.0034584,0.030389,0.01057,0.052918,-0.080209,0.015352,0.0099557,0.039455,0.020802,0.074184,-0.10461,0.031179,0.021358,0.047305,0.033323,0.09669,-0.12404,0.0023192,0.0015755,0.028341,0.0064019,0.037591,-0.045425,0.0062258,0.0045135,0.034747,0.011816,0.051681,-0.053459,0.012852,0.0099848,0.041564,0.019242,0.067676,-0.056855,0.001935,0.001098,0.020837,0.003494,0.031291,-0.048912,0.0052578,0.0030804,0.027948,0.0082335,0.043474,-0.070164,0.010892,0.0066972,0.035186,0.014766,0.055908,-0.088852,0.0013363,0.00078487,0.1442,0.022243,0.032221,-0.047245,0.0043666,0.0026415,0.15215,0.031976,0.042949,-0.063791,0.0092342,0.0056944,0.15638,0.042883,0.055199,-0.080715,0.35373,74,74,40,988,3,3,3,0.645
27,-0.0045692,0.021632,0.031609,-0.98405,0.001232,-1.9487,0.98032,-0.33608,2.8736,-0.082594,3.3071,8.8039e-06,0.57063,3.194,0.031853,4.1919,0.0042687,0.98406,0.050333,0.016855,0.012503,0.0097868,0.19725,0.38244,0.37176,0.031757,0.0042828,0.0026918,0.0098192,0.25625,0.35306,0.024985,66.453,3958.1,8131.4,16959,29116,0.23518,0.11415,0.23518,0.49703,0.76146,0.25779,0.22369,0.024891,36,161.25,3974,4.4929e+05,5.2953,30.373,1.073e+05,20385,17010,0.91587,0.92927,0.38067,0.28376,0.22644,0.93556,49686,29791,0.0010999,0.00045985,0,0.057756,0,0.052854,0.004111,0.0086193,0.0028562,0.0097716,0.22125,0.40828,0.75224,0.18046,0.39849,0.33256,0.17268,0.49106,0.2994,0.16959,0.50331,0.29656,61.364,8.9791,15190,37539,36348,0.06399,0.055142,0.034303,0.2569,0.24705,0.071833,0.45954,0.45198,0.090538,0.62077,0.61478,0.097322,0.74059,0.73258,0.098813,0.0066647,0.0063177,0.087165,0.021818,0.059674,-0.01766,0.015613,0.01517,0.096544,0.033346,0.082789,-0.013021,0.028362,0.027577,0.10354,0.04581,0.10538,-0.016427,0.0038694,0.004097,0.11377,0.021699,0.050007,0.014627,0.0087468,0.0095481,0.11746,0.029973,0.067473,0.030843,0.015419,0.01688,0.11997,0.038588,0.085155,0.040659,0.0020418,0.001512,0.052901,0.0061864,0.03146,-0.048762,0.0045118,0.0034056,0.057703,0.0096598,0.043496,-0.059136,0.0078905,0.0059846,0.061329,0.013401,0.054239,-0.07293,0.00075346,0.00070872,0.19563,0.018234,0.023745,-0.0090286,0.002639,0.002426,0.22124,0.028527,0.033754,-0.017215,0.0060509,0.0054381,0.24655,0.042028,0.046503,-0.030104,0.36995,74,74,40,988,3,3,3,0.645
27,-0.0032197,0.016106,0.023227,-0.98831,0.0014367,-1.9456,0.96858,-0.27503,2.8406,-0.12709,3.2933,1.3241e-05,0.41575,2.7341,0.023076,3.371,0.0034328,0.98845,0.070411,0.041335,0.03302,0.027746,0.27877,0.35105,0.30351,0.026443,0.0078366,0.0050351,0.027368,0.4278,0.30376,0.00094601,102.4,1140.9,2282.2,2163.3,5689.6,0.15294,0.070611,0.15294,0.751,1.331,0.39263,0.18991,0.017734,54,47.407,655,18792,3.4337,14.039,17685,17064,12123,0.92706,0.94899,0.2317,0.15098,0.16898,0.88239,27646,17094,0.00076033,0.00035544,0,0.046766,0,0.065327,0.0025446,0.035576,0.0049457,0.083347,0.66896,2.0149,0.81215,0.18369,0.38771,0.33377,0.1877,0.51847,0.25599,0.1865,0.52754,0.25113,33.755,9.0117,8862.6,13638,11441,0.080698,0.076349,0.022953,0.3689,0.37142,0.05473,0.65268,0.66515,0.068228,0.81998,0.83389,0.068209,0.91546,0.92528,0.064808,0.014731,0.013674,0.10223,0.044461,0.088425,-0.05293,0.028441,0.026539,0.093311,0.052493,0.11382,-0.061627,0.044646,0.041942,0.086475,0.059602,0.13687,-0.06744,0.0080568,0.0075533,0.12569,0.038521,0.068479,-0.036054,0.01664,0.015706,0.11856,0.047693,0.090037,-0.04036,0.027041,0.025772,0.11164,0.055692,0.11023,-0.040683,0.0064041,0.0058943,0.088035,0.025732,0.055164,-0.035491,0.010888,0.010079,0.073885,0.026915,0.069009,-0.039959,0.015978,0.014833,0.065893,0.028605,0.080618,-0.04602,0.00027042,0.00022627,0.037254,0.0032555,0.020328,-0.024877,0.00091194,0.00075396,0.040564,0.0050847,0.025984,-0.030948,0.0016274,0.0013374,0.035182,0.005201,0.032646,-0.036129,0.38246,74,74,40,988,3,3,3,0.645
27,-0.0032886,0.015918,0.023193,-0.98832,0.0010223,-1.9546,0.97771,0.30775,2.7079,0.015004,3.3057,8.984e-05,0.47518,3.115,0.023224,3.9241,0.003996,0.98838,0.054577,0.027564,0.02223,0.018433,0.28052,0.35865,0.3084,0.02525,0.0051436,0.0036938,0.018333,0.41862,0.30878,0.00082785,117.86,2862.6,4518.1,5091.9,12591,0.20621,0.10911,0.20621,0.79413,1.0932,0.31215,0.19073,0.017787,38,98.579,1408,1.0064e+05,3.6696,15.155,38016,37638,10395,0.92458,0.9432,0.26689,0.18623,0.1913,0.79994,40861,24559,0.0007847,0.00033748,0,0.047162,0,0.065901,0.0007177,0.023157,0.0025767,0.04886,0.62359,1.6032,1.3435,0.18507,0.39948,0.33114,0.20184,0.52675,0.23881,0.21358,0.52798,0.22772,44.344,8.9409,14494,26948,25261,0.029851,0.025961,0.01093,0.21607,0.21104,0.041267,0.4496,0.45029,0.060503,0.64592,0.65295,0.069168,0.80436,0.81577,0.073304,0.003479,0.0048098,0.031078,0.0050671,0.055927,0.11299,0.009733,0.012968,0.041108,0.01264,0.078946,0.13442,0.018401,0.023544,0.045882,0.019272,0.099378,0.14355,0.0032488,0.0046483,0.065244,0.014002,0.044246,0.12995,0.0094313,0.012756,0.086504,0.02722,0.066039,0.14099,0.017789,0.023109,0.094541,0.038183,0.08605,0.1505,0.00022936,0.00016092,0.0040588,-0.0049548,0.032997,-0.014305,0.00028051,0.00019785,0.0024504,-0.0070918,0.042308,-0.016954,0.00052782,0.00037524,0.0028021,-0.008555,0.049992,-0.026629,8.1564e-07,5.7741e-07,0.00014465,-0.0026027,0.01732,-0.013919,2.1125e-05,1.4955e-05,0.0012096,-0.0033388,0.023118,-0.013919,8.4971e-05,6.0153e-05,0.0023648,-0.0040775,0.028234,-0.013919,0.3686,74,74,40,988,3,3,3,0.645
27,-0.0030833,0.014638,0.021295,-0.98928,0.00099284,-1.9552,0.97641,0.25119,3.1371,0.01072,3.2925,1.6263e-05,0.40633,2.7805,0.021313,3.5536,0.0036187,0.98933,0.042359,0.019296,0.013414,0.0099334,0.32792,0.31745,0.31093,0.023341,0.0061233,0.0036566,0.010576,0.46408,0.23901,0.0041398,155.99,2091.2,5172.9,16675,24096,0.10648,0.18925,0.18925,0.38281,0.38593,0.21039,0.18253,0.016738,54,72,2830,1.4714e+05,6.9978,50.636,76410,4941,4509,0.92545,0.94497,0.25048,0.16863,0.17443,0.81529,34368,19213,0.00080438,0.00041393,0,0.054665,0,0.057476,0.0058886,0.0062205,0.011435,0.0072995,1.3514,2.8109,1.1856,0.18615,0.39318,0.32251,0.18586,0.50782,0.26074,0.18196,0.52129,0.25616,38.955,8.7077,13329,24278,22749,0.085224,0.077802,0.032537,0.35521,0.34937,0.070736,0.61132,0.60631,0.08578,0.79344,0.79093,0.088593,0.89958,0.90137,0.085483,0.0063048,0.0057659,0.058727,0.016847,0.054023,-0.033788,0.012353,0.01127,0.054401,0.019644,0.067397,-0.044206,0.019334,0.017652,0.050265,0.021448,0.080656,-0.052588,3.4441e-05,2.7105e-05,0.0007212,-0.0060513,0.026208,-0.014759,0.00025669,0.00020836,0.002455,-0.0073158,0.034326,-0.019342,0.00082078,0.00068345,0.0045485,-0.0081087,0.043723,-0.026799,0.0062704,0.0057388,0.1157,0.029136,0.049477,-0.033342,0.012096,0.011061,0.11017,0.03565,0.061872,-0.042436,0.018497,0.016956,0.10239,0.040072,0.072267,-0.048755,0,0,0,-0.0026783,0.0048061,0,3.1218e-07,2.3546e-07,1.864e-05,-0.0036285,0.0067801,-0.014098,1.6407e-05,1.2375e-05,0.00047613,-0.0046192,0.0097696,-0.014098,0.38586,74,74,40,988,3,3,3,0.645
27,-0.0034874,0.016474,0.023998,-0.98792,0.0010477,-1.954,0.97793,-0.62058,4.5151,-0.033712,3.2828,9.2098e-05,0.86135,5.539,0.024133,8.1988,0.0083491,0.98792,0.042298,0.015652,0.010586,0.0076801,0.29389,0.32621,0.33687,0.026688,0.0052338,0.0030251,0.008081,0.44188,0.26899,0.005143,105.73,2668.1,6597,25706,35077,0.15752,0.19242,0.19242,0.67835,0.73526,0.28873,0.19773,0.019137,36,66.917,1946,1.0503e+05,5.5505,32.45,52542,8019,2187,0.92653,0.94551,0.12868,0.097903,0.031978,0.62848,32572,13582,0.00098419,0.00040087,0,0.080999,0,0.075284,0.0047156,0.030621,0.011515,0.045214,1.6364,2.2351,0.25113,0.18935,0.34441,0.33016,0.20041,0.34823,0.21588,0.21442,0.36517,0.21128,36.96,8.9144,39185,80852,80109,0.34032,0.33611,0.083235,0.65555,0.6952,0.083629,0.80268,0.8596,0.072153,0.8924,0.93057,0.063832,0.92919,0.95525,0.056564,0.00022728,0.00016709,0.0013562,-0.0065811,0.027523,-0.015029,0.00081405,0.00058285,0.0022966,-0.0079765,0.039436,-0.019519,0.0017513,0.001219,0.0029168,-0.0093679,0.05187,-0.025847,0,0,0,-0.0049989,0.019547,0,8.9916e-06,5.1655e-06,5.5088e-05,-0.0065894,0.027886,-0.017419,0.00012553,7.3155e-05,0.00044565,-0.0080048,0.036744,-0.019754,0.00022728,0.00016709,0.0026866,-0.0040454,0.018344,-0.015029,0.00080506,0.00057768,0.0046976,-0.0042581,0.026611,-0.019199,0.0016258,0.0011458,0.0057652,-0.0045904,0.035003,-0.023495,0,0,0,-0.0021355,0.0080427,0,0,0,0,-0.0028958,0.0114,0,0,0,0,-0.0037697,0.015436,0,0.33983,74,74,40,988,3,3,3,0.645
27,-0.0045061,0.022817,0.032721,-0.98349,0.0023218,-1.9314,0.96387,0.51559,3.8306,0.042392,3.2092,0.00044013,0.62003,3.4535,0.032169,4.5344,0.0046175,0.98389,0.08945,0.05295,0.041092,0.033614,0.23827,0.31079,0.36572,0.033026,0.011228,0.0072122,0.033755,0.36867,0.27247,0.036694,55.3,490.04,994.62,1255.4,2796.1,0.13647,0.12424,0.13647,0.29075,0.65581,0.1605,0.22443,0.024142,82,40.951,1133,26078,5.2596,31.253,30591,19629,17739,0.9275,0.95018,0.062772,0.03956,0.045496,0.37669,26848,18387,0.00075365,0.00036683,0,0.045209,0,0.058012,0.0016812,0.0041196,0.006622,0.042397,0.19214,1.6797,1.3964,0.18366,0.37351,0.33833,0.19396,0.45687,0.27452,0.19666,0.46408,0.2704,29.663,9.1349,7028.1,13074,10774,0.10902,0.10302,0.04187,0.27933,0.26983,0.055958,0.45447,0.44137,0.064149,0.59173,0.57595,0.066463,0.70031,0.68778,0.066943,0.0054864,0.0050977,0.051408,0.013508,0.058209,-0.035094,0.011517,0.010945,0.051024,0.017551,0.076228,-0.031807,0.019665,0.018981,0.051431,0.02214,0.094137,-0.027855,0.0045093,0.0041719,0.094985,0.022353,0.054795,-0.033842,0.0092384,0.0087875,0.088879,0.027151,0.066203,-0.02778,0.015055,0.014696,0.083925,0.031511,0.078455,-0.01647,0.00095964,0.00091153,0.017813,-0.00093051,0.028056,-0.0098972,0.0021737,0.0020713,0.019917,-0.00037251,0.040377,-0.013188,0.004457,0.0041598,0.024819,0.0019396,0.052311,-0.026479,1.7515e-05,1.4274e-05,0.0032582,-0.0022667,0.01158,-0.013258,0.00011143,9.082e-05,0.0066925,-0.0024738,0.016925,-0.013271,0.00022025,0.00018039,0.0064296,-0.0032801,0.02236,-0.013719,0.44181,74,74,40,988,3,3,3,0.645
27,-0.004697,0.022659,0.032784,-0.98345,0.0017524,-1.9403,0.97291,-0.047312,3.0926,0.01351,3.2986,9.5426e-09,0.52009,2.8669,0.032845,3.8611,0.0039319,0.98356,0.054667,0.026298,0.021835,0.018494,0.27712,0.26844,0.40159,0.026726,0.0043399,0.0032734,0.018517,0.44911,0.2083,0.065267,88.814,3463.8,5112.9,4233.7,12900,0.13661,0.2286,0.2286,0.69009,0.91274,0.39553,0.22817,0.025746,47,45.489,960,26103,4.535,23.718,25920,15768,6480,0.92726,0.94709,0.11871,0.079097,0.079252,0.55054,25047,13571,0.00092146,0.00042429,0,0.052477,0,0.061304,0.0025182,0.019706,0.0017799,0.057303,1.1571,1.8369,0.50132,0.20055,0.33826,0.3239,0.24813,0.34869,0.19883,0.25431,0.35516,0.18826,21.13,8.7452,12684,19634,17682,0.29549,0.30261,0.076593,0.65229,0.67176,0.08819,0.82485,0.84598,0.07858,0.9121,0.925,0.069144,0.94324,0.95125,0.060853,0.00050741,0.00041085,0.0032089,-0.0058277,0.042933,-0.025158,0.0014354,0.0011744,0.0042917,-0.006904,0.057991,-0.031732,0.0035241,0.0029273,0.0062205,-0.0068993,0.072316,-0.044786,0.00042134,0.00034335,0.00599,-0.0029573,0.032414,-0.021898,0.0011925,0.00098258,0.0077431,-0.0030657,0.043782,-0.028169,0.0028509,0.0023764,0.010726,-0.0020296,0.055309,-0.039208,8.5956e-05,6.7408e-05,0.0010768,-0.0048233,0.025694,-0.01294,0.00023402,0.00018498,0.0014472,-0.0060879,0.032935,-0.014097,0.00061667,0.00050689,0.0023176,-0.0069786,0.039314,-0.019857,1.2139e-07,9.4521e-08,1.524e-05,-0.002197,0.017618,-0.013243,8.817e-06,6.8654e-06,0.00035742,-0.0029066,0.024452,-0.013243,5.6524e-05,4.4013e-05,0.0011136,-0.0035752,0.031213,-0.013243,0.41664,74,74,40,988,3,3,3,0.645
27,-0.0053422,0.026034,0.03762,-0.98099,0.0021542,-1.9335,0.97095,-0.7881,4.7138,-0.07508,3.2258,0.00077326,0.80742,4.1642,0.03752,5.8992,0.0060073,0.98122,0.088937,0.033251,0.025536,0.020762,0.21993,0.30121,0.39653,0.049886,0.0073391,0.0045974,0.020502,0.3553,0.28383,0.08845,18.762,1058.3,2259.8,3206.9,6544.4,0.058805,0.096622,0.096622,0.22411,0.40058,0.11494,0.24268,0.028679,29,159.07,4392,6.6039e+05,5.0972,27,1.1858e+05,2565,1971,0.91889,0.92949,0.3282,0.27412,0.12495,0.84017,1.3979e+05,40041,0.00072528,0.0003982,0,0.12528,0,0.093756,0.010591,0.046688,0.01385,0.063924,1.8444,2.0288,0.31825,0.15303,0.34267,0.42197,0.11235,0.34694,0.50576,0.094627,0.3397,0.54538,110.86,11.393,36407,1.417e+05,1.4114e+05,0.041827,0.024565,0.017404,0.10063,0.057826,0.021839,0.25116,0.17639,0.038409,0.44251,0.38455,0.053849,0.61891,0.60487,0.064097,0.0022533,0.0011429,0.022875,0.00011947,0.025063,-0.050221,0.0044665,0.0025749,0.021438,-0.00064675,0.034829,-0.057598,0.0075925,0.0051031,0.021513,-0.00075269,0.044666,-0.057095,0.00059422,0.00033302,0.013561,-0.0026192,0.018344,-0.030189,0.0020506,0.0013885,0.021373,-0.0004685,0.027099,-0.034387,0.0046301,0.0036462,0.027964,0.0025799,0.036622,-0.031912,0.0016591,0.00080988,0.033365,0.0031683,0.017181,-0.04172,0.0024441,0.0011997,0.024263,0.0006377,0.023073,-0.046654,0.0030545,0.0015002,0.018428,-0.0019604,0.0279,-0.049837,0,0,0,-0.0027987,0.0032565,0,0,0,0,-0.003795,0.0056523,0,1.3245e-06,6.2208e-07,4.1891e-05,-0.0049312,0.0084132,-0.012835,0.34471,74,74,40,988,3,3,3,0.645
27,-0.0025578,0.012839,0.018353,-0.99077,0.0014793,-1.9408,0.95885,-0.053381,3.3127,-0.14976,3.2733,1.4862e-05,0.61374,4.5635,0.018052,6.3879,0.006505,0.99096,0.10002,0.045404,0.030651,0.022921,0.35394,0.25773,0.28976,0.051484,0.014844,0.0079487,0.024291,0.49638,0.12984,0.029325,28.706,352.53,1055.8,3230.9,4668.7,0.18871,0.22675,0.22675,0.55019,0.7971,0.24294,0.16888,0.013385,78,21.256,641,6587.6,6.0055,42.951,17307,8046,3807,0.92753,0.95019,0.092653,0.059569,0.064888,0.56153,19048,12379,0.00072489,0.00037379,0,0.049903,0,0.062904,0.00097519,0.023811,0.0077151,0.046522,1.5835,1.0481,0.7413,0.18113,0.33028,0.33086,0.20058,0.2757,0.18045,0.20081,0.26367,0.16756,19.438,8.9332,10935,15948,14032,0.37096,0.38424,0.086766,0.6711,0.699,0.081875,0.79727,0.82031,0.068537,0.8555,0.87284,0.058521,0.87886,0.89301,0.051165,0.0060078,0.0054793,0.034284,0.012177,0.069169,-0.04056,0.013825,0.012517,0.037301,0.018262,0.08827,-0.055985,0.022942,0.020696,0.036542,0.02203,0.10496,-0.068764,0.0033218,0.0029983,0.042615,0.01151,0.050789,-0.03738,0.0087599,0.007891,0.051325,0.019672,0.066079,-0.048416,0.01519,0.013712,0.05157,0.024781,0.079756,-0.05627,0.0024387,0.002227,0.027569,0.0058038,0.04411,-0.023434,0.0052,0.0047532,0.029018,0.0082752,0.054043,-0.030351,0.0085864,0.0078835,0.029119,0.010252,0.061517,-0.034762,0.00024725,0.0002539,0.028011,0.0025168,0.022334,0.0030373,0.00089462,0.0008882,0.032725,0.0044633,0.032295,-0.0011844,0.0020744,0.0019921,0.036879,0.0070159,0.043736,-0.0093472,0.42606,74,74,40,988,3,3,3,0.645
27,-0.0040435,0.019721,0.028685,-0.98554,0.0013397,-1.9478,0.97637,0.1144,3.7203,-0.0030501,3.265,0.00022476,0.48051,2.8316,0.028739,3.6053,0.0036714,0.98561,0.061316,0.031097,0.024875,0.020601,0.24983,0.36419,0.32699,0.028198,0.0060113,0.0041731,0.020611,0.38114,0.34811,0.0064457,84.608,1829.9,3162.8,3579.6,8657.6,0.14981,0.10271,0.14981,0.89744,1.0988,0.32865,0.2125,0.019842,51,45.314,1074,26258,5.1985,31.938,28998,10449,7884,0.92617,0.94763,0.13256,0.089039,0.092242,0.67573,32040,16812,0.0007326,0.00036229,0,0.059856,0,0.077022,0.0027567,0.002189,0.015017,0.012253,0.83861,0.48511,0.19901,0.1798,0.35167,0.35507,0.18582,0.38254,0.34596,0.17501,0.37971,0.36966,31.129,9.5869,15066,23842,22424,0.13832,0.12031,0.036237,0.40372,0.3825,0.055168,0.61682,0.62365,0.059391,0.76123,0.77998,0.058325,0.85847,0.87308,0.055978,0.0075057,0.007124,0.047974,0.018005,0.05456,-0.019126,0.017783,0.017726,0.05374,0.027739,0.078825,-0.0017195,0.033711,0.034785,0.060141,0.04012,0.10495,0.022148,0.0072902,0.0069665,0.10475,0.032939,0.053987,-0.016323,0.016972,0.017129,0.11138,0.046792,0.075484,0.0048104,0.031554,0.033162,0.11999,0.063762,0.10034,0.034019,0.00011437,8.3224e-05,0.0014481,-0.0047166,0.024006,-0.019768,0.00054791,0.00040372,0.0034246,-0.00518,0.034462,-0.029582,0.0017794,0.0013445,0.0067591,-0.0044086,0.044644,-0.045839,0.00010116,7.4326e-05,0.012836,-0.00021599,0.010608,-0.01616,0.00030412,0.00022341,0.01246,-0.00037216,0.016054,-0.018479,0.00059806,0.00044155,0.011909,-0.00063567,0.021939,-0.023583,0.38268,74,74,40,988,3,3,3,0.645
27,-0.0022209,0.011027,0.015986,-0.99197,0.00087938,-1.9563,0.97211,0.14596,3.056,-0.063451,3.2837,3.2507e-05,0.51876,4.1328,0.015724,5.4053,0.0055044,0.99213,0.069198,0.037268,0.02829,0.022855,0.37455,0.30832,0.25013,0.029801,0.0087118,0.0053486,0.023128,0.50495,0.20326,0.14274,95.149,1127.2,2426.7,3636.1,7286,0.099479,0.22459,0.22459,1.1854,1.7397,0.43024,0.15653,0.010858,81,49.481,2163,67166,7.135,56.029,58401,24354,9396,0.92527,0.94505,0.18721,0.12395,0.13601,0.64271,25686,16126,0.00093757,0.00044414,0,0.042043,0,0.054074,0.0074819,0.0036391,0.0077307,0.032122,0.76154,1.0206,0.32194,0.19855,0.34392,0.3208,0.24146,0.3481,0.22944,0.2456,0.34276,0.22089,18.09,8.6615,8274.8,16618,14609,0.25141,0.26055,0.11258,0.55163,0.57049,0.12884,0.70804,0.72315,0.11653,0.79703,0.80737,0.10438,0.86951,0.87713,0.096909,0.025709,0.030087,0.28086,0.10523,0.13336,0.14361,0.049031,0.056701,0.25326,0.12356,0.16135,0.16793,0.075773,0.086713,0.23106,0.13889,0.18549,0.18724,0.0055256,0.0063164,0.13571,0.031162,0.066629,0.055635,0.011172,0.012929,0.12531,0.037398,0.081775,0.080613,0.018565,0.021317,0.12067,0.044661,0.096273,0.095533,0.01803,0.021356,0.3902,0.10384,0.11165,0.13045,0.035022,0.041579,0.37415,0.12899,0.14155,0.16849,0.054058,0.064067,0.35098,0.14829,0.16557,0.19965,0.0021534,0.0024144,0.46704,0.052909,0.048817,0.03676,0.0061102,0.006829,0.42789,0.065401,0.061416,0.048137,0.011714,0.013007,0.39869,0.078978,0.074988,0.056901,0.51447,74,74,40,988,3,3,3,0.645
27,-0.0022911,0.011271,0.01629,-0.99181,0.00094877,-1.9543,0.97044,-0.89792,6.0602,-0.064859,3.2466,0.00063823,0.56816,4.4743,0.016092,6.3325,0.0064486,0.99194,0.05959,0.031486,0.02433,0.019821,0.35544,0.35924,0.22709,0.026626,0.0070131,0.0044704,0.020125,0.48586,0.25928,0.24916,129.44,1798.1,3630.8,4950.7,10510,0.1526,0.23854,0.23854,0.51156,0.57267,0.2191,0.15879,0.011779,37,30.216,506,9731.5,3.7974,16.721,13662,9828,2943,0.9288,0.95273,0.019737,0.012649,0.010953,0.46872,18891,12874,0.00063576,0.00033032,0,0.047173,0,0.068271,0.00070406,0.0018851,0.0048272,0.031419,0.25565,1.3738,1.1552,0.18108,0.33936,0.3346,0.19362,0.25518,0.17907,0.18919,0.22612,0.15036,27.922,9.0343,8165.3,10212,8789.3,0.39284,0.45383,0.059021,0.62171,0.6797,0.048722,0.72524,0.76775,0.040047,0.8338,0.86124,0.036637,0.91046,0.92621,0.034047,0.004625,0.0039441,0.016953,0.006177,0.064743,-0.052578,0.01052,0.008959,0.018231,0.0093088,0.086133,-0.068806,0.017805,0.015298,0.018217,0.01157,0.10634,-0.0795,0.003072,0.002664,0.025314,0.0082179,0.041806,-0.03676,0.0061973,0.0054254,0.023324,0.0096157,0.05798,-0.043298,0.010223,0.009109,0.022295,0.01122,0.075171,-0.046904,0.00044794,0.00036511,0.0032527,-0.0023838,0.045354,-0.020307,0.0012681,0.0010265,0.0045456,-0.0022808,0.056025,-0.032257,0.0025927,0.0021247,0.005648,-0.0019512,0.063858,-0.039569,0.0011051,0.00091503,0.080419,0.014787,0.02537,-0.035485,0.0030542,0.002507,0.071762,0.017649,0.035101,-0.0454,0.0049891,0.0040641,0.056974,0.017633,0.045265,-0.053032,0.35898,74,74,40,988,3,3,3,0.645
