1544.771489  
1630.758903  
1797.039207  
2179.677045  
3427.314524  
7580.308828  
16457.81901  
40104.12092  
11965.98801  
3076.639849  
15799.39243  
95822.02162  
46460.32557  
1909.24966  
2706.852898  
10771.55017  
9294.79309  
9542.17214  
5510.285162  
18150.8052  
2019.941977  
17089.2706  
6766.996361  
4053.454482  
14459.50167  
1306.935286  
1175.098829  
22340.76663  
572.9144431  
5036.078961  
4565.879605  
3752.187219  
6794.944907  
489.6217441  
18890.06172  
3621.435337  
3923.061781  
6487.379734  
4243.653033  
11479.58686  
3617.035026  
8059.279461  
1577.962106  
1891.118541  
3080.135225  
2264.730855  
1278.068191  
321.3108774  
1938.627392  
2054.478408  
21.81831305  
1127.886271  
2575.586631  
51.6794951  
2409.478198  
518.7650139  
697.5963403  
3226.828583  
363.967781  
3961.038677  
142.1804363  
92.59503561  
27.68080487  
702.0857769  
33.17502605  
128.1890518  
253.1217517  
32.42670824  
81.73208152  
44.53545214  
5.952700318  
3.874792535  
13.17763879  
5.469037584  
13.74293113  
5.855864873  
5.19600281  
6.548325243  
4.424119472  
7.128973431  
4.019491777  
2.792266261  
2.248388327  
3.391692779  
3.405737415  
3.304745315  
2.706461101  
2.768223626  
2.620723762  
2.370461564  
2.353211059  
2.420572822  
2.149469366  
2.082858364  
2.078995831  
1.942747185  
1.933388214  
1.861904288  
1.784953308  
1.700583956  
1.671345139  
1.612802531  
1.557808473  
1.499381083  
1.456746697  
1.402621889  
1.36229254  
1.316525297  
1.279551069  
1.239211034  
1.199376422  
1.162680375  
1.12832057  
1.095157516  
1.063555605  
1.03295621  
1.003749124  
0.9748896018  
0.9475664121  
0.921521688  
0.8962984183  
0.8716564925  
0.8485191131  
0.8259764253  
0.8042570465  
0.7831677711  
0.7630758254  
0.7435586005  
0.7248597311  
0.7067408847  
0.6892385606  
0.6724167696  
0.6561195511  
0.6403313893  
0.6251178241  
0.6103955067  
0.596182562  
0.5824494028  
0.569145673  
0.5562773113  
0.543828814  
0.5317835302  
0.5201020652  
0.5087855492  
0.4978167218  
0.4871917117  
0.4768965634  
0.4669082911  
0.4572238727  
0.4478353456  
0.4387217941  
0.42987761  
0.421282139  
0.412943827  
0.4048454743  
0.3969789544  
0.3893404703  
0.381916676  
0.374695431  
0.3676699822  
0.3608563734  
0.3542156969  
0.347754538  
0.3414679347  
0.335357878  
0.3294059019  
0.3236071476  
0.3179656776  
0.3124705136  
0.3071148211  
0.3019005029  
0.2968130935  
0.2918585652  
0.2870291387  
0.2823165308  
0.2777274275  
0.2732510149  
0.2688823405  
0.2646208977  
0.260463163  
0.2564014462  
0.2524465746  
0.2485739705  
0.2447943716  
0.2411048002  
0.2375058949  
0.2339873071  
0.2305444004  
0.2271829808  
0.2239035812  
0.2206973441  
0.2175548427  
0.2144920433  
0.2114878022  
0.2085532903  
0.2056835907  
0.2028771227  
0.2001330624  
0.197444054  
0.1948100026  
0.1922388141  
0.1897156065  
0.1872490895  
0.1848340178  
0.1824664061  
0.1801504933  
0.1778813762  
0.1756585784  
0.1734829146  
0.1713473089  
0.1692559573  
0.1672050404  
0.1651940396  
0.1632225636  
0.1612958566  
0.1594009971  
0.1575459138  
0.155721812  
0.1539356254  
0.1521848246  
0.1504682213  
0.1487807742  
0.1471269422  
0.1454996509  
0.1439119393  
0.1423457422  
0.140810018  
0.1393031141  
0.1378250976  
0.1363722152  
0.1349463307  
0.1335454633  
0.1321686188  
0.1308191763  
0.1294889228  
0.1281857997  
0.1269024326  
0.1256428974  
0.1244076121  
0.1231923299  
0.1219946273  
0.1208240409  
0.1196645879  
0.1185327578  
0.1174138264  
0.1163160455  
0.115238483  
0.1141763235  
0.1131305498  
0.1121068532  
0.1110974557  
0.1101059917  
0.1091259169  
0.1081633582  
0.1072219395  
0.1062906863  
0.1053758816  
0.1044743376  
0.1035877352  
0.1027156483  
0.1018544012  
0.1010117689  
0.1001767996  
0.09935636826  
0.09855237238  
0.09775549813  
0.09697690173  
0.09620590202  
0.09544508792  
0.09469979061  
0.09396446789  
0.09323685393  
0.09252597201  
0.09182299203  
0.09112870611  
0.09044588395  
0.08977552589  
0.0891134523  
0.0884586778  
0.08781679277  
0.08718460575  
0.08656167862  
0.08594650831  
0.08533817315  
0.08473884525  
0.08414995515  
0.08357257071  
0.08299670567  
0.08243226629  
0.08187519954  
0.08132695395  
0.08078774828  
0.08025290008  
0.07972699826  
0.0792054397  
0.07869694242  
0.07819246175  
0.07769648118  
0.07720339623  
0.07671906475  
0.07624506541  
0.07577371388  
0.07530953778  
0.07485151486  
0.07439853442  
0.0739544383  
0.07351510501  
0.07308137544  
0.07265283679  
0.07223042755  
0.07181380985  
0.07140452398  
0.07099624619  
0.07059957836  
0.0702005172  
0.06981255646  
0.06942957325  
0.06904877775  
0.06867508332  
0.06830412286  
0.06794000809  
0.0675833825  
0.06722399454  
0.06687542933  
0.06653003337  
0.06618920908  
0.06585219823  
0.06551686503  
0.06518837188  
0.06486537898  
0.06454618468  
0.06422874826  
0.0639175104  
0.06361037699  
0.06330490576  
0.06300512964  
0.06271078221  
0.06241781842  
0.06212846726  
0.06184439057  
0.06156195626  
0.06128505433  
0.06101102458  
0.06074159711  
0.06047019939  
0.06020776065  
0.05994764043  
0.05969132781  
0.05943615175  
0.0591856093  
0.05893583216  
0.05869274501  
0.05845316793  
0.05821293284  
0.05797801943  
0.05774551769  
0.05751820773  
0.05729146076  
0.05706716006  
0.05684671566  
0.05663043183  
0.05641291401  
0.05620165062  
0.0559918192  
0.05578448386  
0.05557978193  
0.05537710509  
0.05517786611  
0.05498189244  
0.05478985683  
0.05459659416  
0.05440575986  
0.05422086234  
0.05403514535  
0.0538538458  
0.05367205697  
0.05349860146  
0.05332266039  
0.0531499004  
0.05297828482  
0.05281236071  
0.05264687562  
0.0524819286  
0.05231967471  
0.05216150625  
0.05200474177  
0.05184969834  
0.05169604993  
0.05154531905  
0.05139672792  
0.05124717824  
0.0511032979  
0.05095918816  
0.05082066227  
0.05067967037  
0.05054232791  
0.05040734786  
0.05027228727  
0.05014043333  
0.05001026739  
0.04988363903  
0.04975801519  
0.04963428356  
0.04950941248  
0.0493891834  
0.04927212625  
0.04915505809  
0.04903859158  
0.04892397486  
0.04881077652  
0.04870163964  
0.04859220021  
0.04848363782  
0.04838099571  
0.04827505913  
0.0481739559  
0.04807401625  
0.04797400044  
0.04787653466  
0.0477813993  
0.04768449588  
0.04759298244  
0.04750255162  
0.04741276686  
0.04732366278  
0.04723720201  
0.04715034885  
0.04706697063  
0.04698438  
0.04690206917  
0.04682395248  
0.04674451955  
0.04666849448  
0.04659357112  
0.04652088288  
0.04644678619  
0.04637607045  
0.04630549486  
0.04623722383  
0.04617093575  
0.04610484528  
0.04604166961  
0.04597762108  
0.04591798142  
0.0458575907  
0.04579711929  
0.04573903989  
0.04568427028  
0.04562916767  
0.04557499526  
0.04552163782  
0.04547063193  
0.04542343245  
0.04537413522  
0.04532581682  
0.04527889058  
0.04523693238  
0.04519208238  
0.045149017  
0.04510857572  
0.04506727581  
0.04502962615  
0.04499402417  
0.0449567114  
0.04492280021  
0.04488826874  
0.04485556269  
0.04482595384  
0.04479503038  
0.04476429942  
0.04473571212  
0.0447113865  
0.04468592674  
0.04466388246  
0.04463804879  
0.04461751883  
0.04459669228  
0.0445788289  
0.04455905633  
0.04454209498  
0.0445268038  
0.04451439685  
0.04449826743  
0.04448761043  
0.04447750058  
0.04446612504  
0.04445782074  
0.04444944124  
0.04444282129  
0.0444382681  
0.04443555883  
0.04443311168  
0.0444295581  
0.04442729699  
