140.3143278  
156.6711572  
197.3194671  
311.3956931  
563.2728925  
1860.946739  
41058.69566  
23403.05401  
27131.54324  
11089.80138  
43372.52006  
15192.49055  
15532.78776  
13078.57642  
3017.71385  
24698.22599  
18328.37666  
10070.58761  
1270.609956  
1182.969253  
8791.900208  
3909.299102  
9655.932065  
25686.11617  
17595.97154  
7677.695185  
6006.294589  
6176.126217  
6971.704149  
8271.546383  
12519.34226  
5296.379804  
16430.41014  
8590.272744  
6146.827072  
7889.334156  
542.2184895  
4435.114851  
886.7703287  
2724.434128  
4992.06475  
13613.03179  
150.731826  
3656.400219  
1335.18174  
3133.3657  
4025.507715  
5741.343798  
2600.531912  
10724.35558  
2369.036344  
1074.747742  
682.6031818  
1495.661122  
1857.952103  
581.4561693  
2101.524443  
164.1628945  
3792.797921  
1431.448236  
570.3994478  
646.630118  
1843.077212  
310.3098808  
325.2899419  
1.222554829  
46.82257734  
140.0759094  
32.96802689  
54.2361714  
77.92570721  
17.11450822  
1.563108461  
4.240817285  
13.54967632  
2.804977553  
1.399877606  
1.16130057  
0.7407093273  
4.561099771  
2.454305548  
1.629815023  
1.220488937  
1.388268999  
1.882010194  
1.161774856  
1.310435946  
1.180425606  
1.318434213  
1.213757225  
1.249360017  
1.060218785  
0.9633089228  
0.95174484  
0.9637145939  
1.031155642  
0.9566167833  
0.9213330689  
0.8589300354  
0.8849999223  
0.8574205294  
0.8306456381  
0.7978172519  
0.7865225581  
0.7768445057  
0.7557198023  
0.7385123911  
0.7151359074  
0.6994340964  
0.6857793104  
0.6770292024  
0.6628894595  
0.6492396368  
0.6344462605  
0.6242407764  
0.611404136  
0.5987826168  
0.5872447104  
0.5773866601  
0.5665569867  
0.5563375769  
0.5468766285  
0.5369236095  
0.527887269  
0.5190307048  
0.5101828333  
0.5019753348  
0.4936031963  
0.4857163709  
0.4778692139  
0.4703922951  
0.4630073406  
0.4558962944  
0.4489150324  
0.4421585259  
0.4355230668  
0.4291041944  
0.4227709454  
0.4166691876  
0.4107083637  
0.4048790639  
0.3991720408  
0.3936069658  
0.388184154  
0.382897311  
0.377704616  
0.3726378831  
0.3676779834  
0.3628554717  
0.3581217824  
0.35350233  
0.3489797687  
0.3445347335  
0.3402222432  
0.3359744625  
0.3318245453  
0.3277397293  
0.3237631598  
0.31987433  
0.3160543784  
0.3123097157  
0.3086421002  
0.305038616  
0.3015213635  
0.2980672627  
0.2946780316  
0.2913592968  
0.2881055207  
0.284904388  
0.2817694085  
0.2786876382  
0.2756729841  
0.2727176432  
0.2697876696  
0.2669440576  
0.2641312922  
0.2613784226  
0.2586789247  
0.2560192973  
0.2534069199  
0.2508425749  
0.2483218502  
0.2458587688  
0.2434188704  
0.2410234491  
0.2386736529  
0.2363726872  
0.2340908343  
0.2318592268  
0.2296591824  
0.2275104279  
0.2253813946  
0.2233015365  
0.2212378254  
0.2192241525  
0.217225745  
0.2152818343  
0.2133432336  
0.2114510385  
0.2095771667  
0.2077453315  
0.2059344901  
0.2041591991  
0.2024135393  
0.2006797525  
0.1989876833  
0.1973077258  
0.1956600261  
0.1940367805  
0.1924390919  
0.1908656492  
0.1893165  
0.1877847691  
0.186280112  
0.1847960781  
0.1833352036  
0.1818873615  
0.1804704945  
0.1790779175  
0.1777012209  
0.1763437611  
0.1749962389  
0.173683019  
0.1723817619  
0.1710923783  
0.1698219519  
0.1685723419  
0.1673462789  
0.1661274732  
0.1649346773  
0.1637523943  
0.1625860099  
0.1614332912  
0.1602993644  
0.1591847074  
0.1580765881  
0.1569842243  
0.1559179713  
0.15485568  
0.1538048911  
0.1527778039  
0.1517535936  
0.1507558603  
0.149764513  
0.1487865077  
0.1478096885  
0.1468647735  
0.1459256746  
0.1449897853  
0.1440692981  
0.1431620868  
0.142275816  
0.1413886202  
0.1405112122  
0.1396543398  
0.1388085076  
0.1379647996  
0.1371288601  
0.1363147012  
0.135509781  
0.1347062551  
0.133921597  
0.1331344908  
0.1323665458  
0.1316078622  
0.1308597449  
0.1301186184  
0.129385468  
0.1286573122  
0.1279404619  
0.1272344019  
0.126530886  
0.1258449178  
0.1251617729  
0.1244867359  
0.1238147969  
0.1231644336  
0.1225151453  
0.1218743899  
0.1212403112  
0.1206120474  
0.1199943109  
0.1193742741  
0.1187707733  
0.1181726588  
0.117573127  
0.1169925868  
0.1164192942  
0.1158432025  
0.1152744223  
0.1147273061  
0.1141754628  
0.1136218715  
0.1130870538  
0.1125490677  
0.112026523  
0.111503571  
0.11098152  
0.1104761795  
0.1099760217  
0.1094732874  
0.1089764704  
0.1084982105  
0.1080143138  
0.1075354158  
0.107073065  
0.1065964246  
0.1061387468  
0.1056902345  
0.1052348362  
0.1047853447  
0.1043470618  
0.1039182459  
0.1034821951  
0.1030601402  
0.1026389778  
0.1022216158  
0.1018072054  
0.1014094943  
0.1010038291  
0.1006053165  
0.1002126314  
0.0998292792  
0.09943513077  
0.09905082006  
0.09867780991  
0.09830714286  
0.0979361103  
0.09757398203  
0.0972130626  
0.09685779626  
0.09650265889  
0.09615984669  
0.09580892235  
0.09547072025  
0.09513163523  
0.09480083828  
0.09447157155  
0.09413974505  
0.09382535216  
0.09350375708  
0.09319280879  
0.09287296826  
0.09256312873  
0.09225919101  
0.09195286906  
0.09166144673  
0.09137189249  
0.09107372489  
0.09078317296  
0.09050351765  
0.09021942762  
0.08994277921  
0.08966564318  
0.08939280615  
0.08912512912  
0.08885412981  
0.0885874041  
0.0883349834  
0.08806872269  
0.08782145363  
0.08756563681  
0.08731792801  
0.08707300092  
0.08683109213  
0.08659253052  
0.08635025389  
0.08611426798  
0.08588698784  
0.08565614441  
0.08542577598  
0.08520148322  
0.08498462253  
0.08476310414  
0.08454845897  
0.08433292754  
0.08411987775  
0.08390999691  
0.08370679668  
0.08350037098  
0.08330111479  
0.08309510125  
0.08290099962  
0.08270902568  
0.0825148384  
0.08232628468  
0.08213936856  
0.08195764071  
0.0817708961  
0.08159046195  
0.08141406818  
0.08123570117  
0.08106627084  
0.0808899221  
0.08072051903  
0.0805616132  
0.08038964408  
0.08023102406  
0.08006933481  
0.07990767144  
0.07974794963  
0.07959539402  
0.07944158104  
0.07929237733  
0.07914408149  
0.07900191897  
0.07885841797  
0.07871493172  
0.078569205  
0.07843638443  
0.07829845533  
0.07816299741  
0.07802144939  
0.07790395179  
0.07777277853  
0.07763940713  
0.07752061854  
0.07739379121  
0.07727689873  
0.07715471304  
0.07703903047  
0.0769221726  
0.07680806743  
0.07669666066  
0.07658638971  
0.07647809937  
0.0763722031  
0.07627107261  
0.07616466694  
0.07606522229  
0.07596269433  
0.07586442953  
0.07577100083  
0.07566872081  
0.07558022401  
0.07549029042  
0.07540554138  
0.07531369735  
0.07522676349  
0.07514100302  
0.07505889599  
0.07498099112  
0.07489907358  
0.07482576264  
0.07475118889  
0.07467313894  
0.07459726829  
0.07453088661  
0.07445978132  
0.07439228647  
0.07432490655  
0.07426453682  
0.074203474  
0.07413875471  
0.07408123377  
0.07401500883  
0.07395843777  
0.07390675557  
0.07385476109  
0.07380038322  
0.07375544865  
0.07370188691  
0.07365513691  
0.07360413152  
0.07356377456  
0.07352353701  
0.07347777723  
0.07344626596  
0.07340124143  
0.07336742843  
0.0733290483  
0.07330253176  
0.0732623661  
0.07323398511  
0.07320321661  
0.07317543366  
0.07315414566  
0.07312822816  
0.07310316714  
0.07308380013  
0.0730605782  
0.07304199977  
0.07303069085  
0.07301251831  
0.07299663137  
0.07298834525  
0.07296914945  
0.07296851931  
0.07294901477  
0.07294906389  
0.07294249218  
0.07294010345  
0.0729359046  
0.07293926228  
