14.16374946  
16.55801737  
19.93848178  
19.69842177  
34.38199905  
851.5635203  
66143.72263  
12678.28927  
3738.708315  
19665.64084  
17681.6936  
54870.27319  
5326.204729  
16570.94594  
38219.49039  
8669.508165  
5625.93299  
3959.856035  
8556.140343  
1271.493928  
18401.99828  
29744.39336  
7547.799627  
1925.66133  
43756.35489  
18325.14558  
4956.236357  
3293.000267  
760.7706221  
8732.824226  
17774.52464  
1405.928167  
17845.38257  
3035.401132  
284.7805026  
1211.34529  
5248.168524  
1404.448303  
2380.144277  
2310.473181  
544.8936873  
3383.354012  
1373.370661  
1775.669922  
1787.366868  
328.0340962  
2104.505826  
2018.225382  
960.0305078  
9887.491316  
691.0425287  
617.3472529  
486.4303737  
225.001846  
812.1094933  
761.6539118  
87.1890852  
893.6489489  
567.8927476  
181.2005999  
104.8352623  
1328.395572  
445.914263  
845.107028  
264.108484  
310.1110114  
70.43516045  
38.03702645  
140.7800316  
9.326330101  
4.158728491  
11.72264696  
29.69302125  
12.39243133  
18.14170951  
13.92443743  
3.005359381  
4.725315381  
4.900285667  
7.052478198  
4.843576987  
2.409715893  
3.788548935  
3.207969715  
3.829589471  
2.436769049  
2.604136783  
2.029459367  
2.156209378  
2.162112695  
2.178760994  
1.904008265  
1.721754294  
1.775733884  
1.643481798  
1.623655431  
1.552096453  
1.479085068  
1.406183563  
1.36249772  
1.321032742  
1.291295373  
1.253417984  
1.20486427  
1.184336142  
1.132147376  
1.108788106  
1.084972512  
1.065186037  
1.028982634  
1.000381123  
0.9769248464  
0.9568486723  
0.9367928927  
0.9149157513  
0.8931282171  
0.8724550093  
0.8558240383  
0.8380825163  
0.8210720339  
0.8033865513  
0.787690803  
0.772407023  
0.7578879565  
0.7432576843  
0.7289379244  
0.7154744598  
0.7025478276  
0.6899908478  
0.6783339768  
0.6663866237  
0.6549428176  
0.6437821277  
0.6331415264  
0.6225926417  
0.6125012023  
0.6027195671  
0.5931485279  
0.5838249413  
0.5747647555  
0.5659904833  
0.5573779842  
0.5490828128  
0.5409293918  
0.533049213  
0.5252983079  
0.5178101593  
0.5104366401  
0.5032835098  
0.4963017401  
0.4894944726  
0.4828258942  
0.4763421117  
0.4699651515  
0.4637663005  
0.4576951629  
0.451782941  
0.4459756224  
0.4403219137  
0.4347752386  
0.429343264  
0.4240484335  
0.4188448296  
0.4137530188  
0.4087963849  
0.4039094661  
0.3991404476  
0.3944681304  
0.3898856666  
0.3854025757  
0.3809927746  
0.3766816846  
0.3724566684  
0.3683136539  
0.3642346718  
0.3602545815  
0.3563526491  
0.3525137699  
0.3487428022  
0.345045203  
0.3414093577  
0.3378541475  
0.3343672295  
0.3309314459  
0.3275712309  
0.324249245  
0.3209972341  
0.3178002107  
0.3146695949  
0.3115850115  
0.308550601  
0.3055729194  
0.3026393295  
0.299767849  
0.2969416938  
0.2941583479  
0.2914212781  
0.2887373718  
0.2860847731  
0.2834863253  
0.2809278956  
0.2784031124  
0.2759296451  
0.2734882869  
0.2711008343  
0.2687347422  
0.2664108118  
0.2641270606  
0.2618722687  
0.2596441178  
0.2574753734  
0.2553193416  
0.2531999835  
0.251115899  
0.2490664827  
0.2470462776  
0.2450595526  
0.243091175  
0.2411634709  
0.2392556495  
0.2373939553  
0.2355328754  
0.2337086514  
0.2319173391  
0.2301466406  
0.2284118011  
0.2266865093  
0.2249874751  
0.2233163342  
0.2216660377  
0.2200486726  
0.2184529867  
0.2168657959  
0.2153067025  
0.2137737233  
0.212260417  
0.2107692791  
0.2092945755  
0.2078426139  
0.2064005666  
0.2049944642  
0.2036097272  
0.2022253312  
0.2008745779  
0.1995233942  
0.1982028156  
0.1969025473  
0.1956198313  
0.1943343494  
0.1930833803  
0.1918428331  
0.1906249237  
0.1894237497  
0.1882283631  
0.1870583096  
0.1859020167  
0.1847512815  
0.183622032  
0.1825023376  
0.1813999377  
0.1803184179  
0.1792418986  
0.1781803589  
0.1771280599  
0.1760991048  
0.1750677489  
0.1740516861  
0.1730620579  
0.1720766156  
0.1711124093  
0.1701477163  
0.1691942691  
0.1682579898  
0.1673302556  
0.1664093501  
0.1655049033  
0.1646203776  
0.1637326184  
0.1628551305  
0.1620017611  
0.161147092  
0.1603049771  
0.1594745729  
0.1586562874  
0.1578336444  
0.1570421917  
0.1562482539  
0.1554660037  
0.1546865167  
0.1539249837  
0.1531640985  
0.1524176194  
0.1516740074  
0.1509469283  
0.1502215543  
0.1495146025  
0.1488045415  
0.1481046162  
0.1474166924  
0.1467334051  
0.1460570543  
0.1453926737  
0.1447362007  
0.1440866358  
0.1434341111  
0.1428039826  
0.1421728538  
0.1415513822  
0.1409374088  
0.1403274738  
0.139719833  
0.1391296325  
0.1385452248  
0.1379625412  
0.1373885964  
0.1368196111  
0.1362632887  
0.1356971765  
0.1351554933  
0.1346012971  
0.134071559  
0.1335412403  
0.1330145935  
0.1324973783  
0.1319857464  
0.1314785201  
0.1309696651  
0.1304726022  
0.1299825029  
0.1294958747  
0.1290175226  
0.128548377  
0.1280724827  
0.127602998  
0.1271525591  
0.1266952188  
0.1262496667  
0.1258011083  
0.1253595876  
0.1249243659  
0.1244981011  
0.124073491  
0.1236563612  
0.1232389058  
0.1228350345  
0.1224272945  
0.122017505  
0.1216208733  
0.1212295361  
0.1208386397  
0.1204631716  
0.1200800736  
0.119702999  
0.1193365557  
0.1189683548  
0.1186002891  
0.1182439412  
0.1178930386  
0.1175389148  
0.1171917393  
0.1168502401  
0.1165109945  
0.1161746082  
0.1158443941  
0.1155164295  
0.115192795  
0.1148747184  
0.114557963  
0.1142454934  
0.1139321173  
0.1136344479  
0.1133306387  
0.113032683  
0.1127413061  
0.1124480459  
0.1121627896  
0.1118756431  
0.1115916098  
0.1113160292  
0.1110432517  
0.1107730402  
0.1105046807  
0.1102452877  
0.1099749094  
0.1097185638  
0.1094635337  
0.1092183618  
0.1089638754  
0.1087240458  
0.1084806402  
0.1082425042  
0.1080061803  
0.1077714852  
0.1075390251  
0.1073087533  
0.1070917755  
0.1068661532  
0.1066510434  
0.1064297161  
0.1062177221  
0.1060035198  
0.1058048398  
0.1055979328  
0.1053978338  
0.1051981568  
0.1049968982  
0.1048025493  
0.1046162347  
0.1044342493  
0.1042378607  
0.1040541748  
0.1038775926  
0.1036971819  
0.1035254999  
0.1033488135  
0.1031783904  
0.1030128566  
0.1028430809  
0.1026845957  
0.1025248165  
0.102365539  
0.1022104825  
0.1020610192  
0.1019112638  
0.101760996  
0.1016148928  
0.1014716226  
0.1013360455  
0.1011999013  
0.1010571879  
0.10092954  
0.1008021978  
0.1006617415  
0.1005410574  
0.1004111243  
0.1002963631  
0.1001705153  
0.1000538103  
0.09993991601  
0.09982843931  
0.09971262794  
0.09960853549  
0.09950216887  
0.09939667518  
0.09929613893  
0.09919162623  
0.09909814273  
0.09900221807  
0.09891279811  
0.09881779589  
0.09873341529  
0.09864578692  
0.09856254458  
0.09848334035  
0.09839897684  
0.0983179688  
0.09824532188  
0.09816809078  
0.09809840011  
0.09802710235  
0.09796020562  
0.09789720492  
0.09783224693  
0.09776672514  
0.09771178553  
0.0976532038  
0.09759818906  
0.09754911608  
0.09749655469  
0.09744486687  
0.09739336537  
0.09735081041  
0.09730988093  
0.09726910196  
0.09722651816  
0.09719284682  
0.09715636666  
0.09712497012  
0.09709477019  
0.0970623772  
0.09703613353  
0.09700709709  
0.0969873855  
0.09696763564  
0.09694997748  
0.09693007952  
0.09691675773  
0.09690475828  
0.09689583514  
0.09688883167  
0.09687815291  
0.09687408077  
0.09687268364  
0.09686919374  
