0.2929443445  
1.096931177  
1.83809283  
2.464381259  
2.937846649  
3.239105369  
3.36914912  
3.348266576  
3.212326021  
3.007045856  
2.781180694  
2.579661475  
2.437703641  
2.376684385  
2.402280629  
2.504990587  
2.662803077  
2.845459741  
3.01958597  
3.153864084  
3.223502953  
3.213409003  
3.119698131  
2.949474252  
2.719035792  
2.450899944  
2.170165274  
1.900786112  
1.662296785  
1.467421921  
1.32084621  
1.219237364  
1.15244045  
1.105588015  
1.061783413  
1.004935575  
0.9223357575  
0.8066249241  
0.6568908567  
0.4787679949  
0.2835607276  
0.08653212236  
-0.09537606002  
-0.2460603999  
-0.3526645866  
-0.4075262942  
-0.4094119216  
-0.3638635245  
-0.2826199733  
-0.1822014732  
-0.0818457304  
-0.001087225744  
0.04269516032  
0.03644611832  
-0.0269776045  
-0.1479738528  
-0.3202204552  
-0.5315239344  
-0.7653518932  
-1.002840455  
-1.224999394  
-1.414836571  
-1.55914207  
-1.649736697  
-1.68406198  
-1.665074267  
-1.600491553  
-1.501539622  
-1.381351124  
-1.25324697  
-1.129108128  
-1.018032798  
-0.9254289739  
-0.8526428539  
-0.7971476378  
-0.7532622771  
-0.7133044945  
-0.6690229868  
-0.6131395684  
-0.5407951475  
-0.4507139188  
-0.3459250455  
-0.233915822  
-0.1261527873  
-0.03699510788  
0.01793503507  
0.02375927939  
-0.03150028213  
-0.1548573343  
-0.3466997431  
-0.5997782391  
-0.8990647029  
-1.22260324  
-1.54333515  
-1.831773162  
-2.059217382  
-2.201143507  
-2.240285435  
-2.168984897  
-1.990418672  
-1.718486611  
-1.376321494  
-0.9936002896  
-0.602997475  
-0.2362999792  
0.07928490321  
0.3241017797  
0.4879004278  
0.5703533145  
0.5802241147  
0.5333908599  
0.4500745919  
0.3517391657  
0.2581245935  
0.1848338662  
0.1417554401  
0.1324584269  
0.1545320141  
0.2007009713  
0.260460329  
0.3219285871  
0.3736320148  
0.405993241  
0.4123786107  
0.3896406422  
0.3381940551  
0.2616922575  
0.1664187062  
0.06051532254  
-0.04687251111  
-0.1464580188  
-0.2296404794  
-0.2892860169  
-0.3204257355  
-0.3208462511  
-0.2915224199  
-0.2368014784  
-0.1642801798  
-0.08428488226  
-0.008938815483  
0.04915792128  
0.0785256954  
0.07050062834  
0.02078124706  
-0.06943059297  
-0.1929405428  
-0.3368782223  
-0.4838903967  
-0.6140979637  
-0.707609367  
-0.7472292549  
-0.7209802464  
-0.6240162591  
-0.4596229038  
-0.2391130154  
0.01940528792  
0.2932184256  
0.5578441272  
0.7901112787  
0.9710263828  
1.088046895  
1.13643577  
1.119568414  
1.048170257  
0.9386406669  
0.8107341182  
0.6849167716  
0.5797685554  
0.5097527564  
0.4836126211  
0.5035582676  
0.565303859  
0.6588958149  
0.7701964326  
0.8827962396  
0.980110354  
1.047394756  
1.07343931  
1.051754244  
0.9811322  
0.865549511  
0.7134559345  
0.5365729178  
0.3483759315  
0.1624773791  
-0.008884247296  
-0.1560513281  
-0.2727252257  
-0.3562316087  
-0.4072912545  
-0.4293676555  
-0.4277341505  
-0.4084268726  
-0.3772644097  
-0.3390825662  
-0.2972953653  
-0.2538201453  
-0.2093340568  
-0.1637838245  
-0.1170128684  
-0.06935276981  
-0.02206231865  
0.02250582238  
0.06102292309  
0.08958092392  
0.104282555  
0.1019050395  
0.0804994462  
0.0398160984  
-0.01853715975  
-0.09124266068  
-0.1736864732  
-0.260580257  
-0.3466844821  
-0.4275025649  
-0.499835607  
-0.5621095746  
-0.6144357734  
-0.658384448  
-0.6965405004  
-0.7318990035  
-0.7672154737  
-0.8044187263  
-0.8441660613  
-0.8856265528  
-0.9265021492  
-0.9632873915  
-0.9917171497  
-1.007324981  
-1.006020353  
-0.9846183626  
-0.9412355191  
-0.8755289413  
-0.7887633188  
-0.6837262241  
-0.5645252144  
-0.4363014585  
-0.3049028832  
-0.1765282455  
-0.05734949182  
0.04688033029  
0.1312479144  
0.1921139271  
0.2275410052  
0.2376595171  
0.2249259443  
0.1941840535  
0.1524763754  
0.108559797  
0.07213750895  
0.05282686734  
0.0589788417  
0.09646367368  
0.167581252  
0.2702527155  
0.3976348406  
0.5382541498  
0.6767247611  
0.7950141636  
0.8741979992  
0.8965461801  
0.8477299246  
0.718928553  
0.5085384331  
0.2232548366  
-0.1216966134  
-0.5033167594  
-0.8926046094  
-1.257230356  
-1.564878692  
-1.78688662  
-1.901723396  
-1.897844135  
-1.775448265  
-1.546871527  
-1.235417654  
-0.8727570177  
-0.4951544295  
-0.1390417013  
0.1634794596  
0.3885504401  
0.5233300966  
0.5672310901  
0.531446699  
0.4368547734  
0.3106404832  
0.182159064  
0.07866932691  
0.02156555029  
0.02365344254  
0.08782496852  
0.2072550987  
0.3670294048  
0.5468559628  
0.7244046123  
0.8787100928  
0.9931130444  
1.057315508  
1.068275692  
1.029890206  
0.9515903796  
0.8461701628  
0.7272371677  
0.6067625218  
0.4931295734  
0.3899910373  
0.2961000365  
0.2060946182  
0.1120690575  
0.005623203061  
-0.1199784652  
-0.2679258965  
-0.4365891099  
-0.6190639033  
-0.8036396991  
-0.9750993858  
-1.116664517  
-1.212296031  
-1.24897919  
-1.218686886  
-1.119708373  
-0.9571843893  
-0.7427661947  
-0.4934649607  
-0.2298475918  
0.02617197335  
0.2536696525  
0.4348928425  
0.5570314622  
0.6134033593  
0.6039304528  
0.5348945621  
0.4180262195  
0.269050215  
0.1058607786  
-0.05345386362  
-0.1925350745  
-0.2983953208  
-0.3626311718  
-0.3820511113  
-0.3586827979  
-0.2991596269  
-0.2135808464  
-0.1140075612  
-0.01279192283  
0.07902576148  
0.1530342608  
0.2043098896  
0.2317000193  
0.2375280684  
0.2267705557  
0.205870177  
0.1813910633  
0.1587450204  
0.1412139121  
0.1294369103  
0.1214491189  
0.1132744638  
0.09996694026  
0.07690797174  
0.0411302128  
-0.007596863188  
-0.0661459204  
-0.1280422629  
-0.1841464284  
-0.223977315  
-0.2374756658  
-0.2169581303  
-0.1589242034  
-0.06539654518  
0.05549741412  
0.189878543  
0.3194503333  
0.4237104334  
0.4827633952  
0.4803730899  
0.4067802751  
0.2608455981  
0.05112102196  
-0.204409269  
-0.4799794476  
-0.7449543733  
-0.9676494731  
-1.11955782  
-1.179382312  
-1.13625496  
-0.9916448324  
-0.7596057446  
-0.4652766478  
-0.1418132234  
0.1738398587  
0.44572838  
0.6435328561  
0.7464089883  
0.745490093  
0.6447238448  
0.4599674922  
0.2165270244  
-0.0544545878  
-0.320220101  
-0.5506153862  
-0.7217345288  
-0.8185396161  
-0.8361589475  
-0.7797884012  
-0.6633026404  
-0.5068537252  
-0.3338482806  
-0.1677433598  
-0.02910129388  
0.06674674611  
0.1111585754  
0.1026639848  
0.04647734349  
-0.04680303216  
-0.1630724135  
-0.2868607046  
-0.4034473113  
-0.5006472834  
-0.5700702042  
-0.6077315925  
-0.6139937729  
-0.5929212481  
-0.5512018082  
-0.4968369515  
-0.4378233186  
-0.3810029005  
-0.3312515959  
-0.2910540573  
-0.2605003314  
-0.2376331934  
-0.2190526574  
-0.2006437903  
-0.1783080015  
-0.1485876396  
-0.1090993314  
-0.05875722837  
0.00222977788  
0.0725320774  
0.14999076  
0.2319616275  
0.3156377811  
0.3983054777  
0.4775104491  
0.5511118292  
0.6172746384  
0.6743938021  
0.7210114585  
0.7557646755  
0.7773526412  
0.7845649669  
0.7763370451  
0.7518322208  
0.7105124156  
0.652213009  
0.5771991066  
0.4862272795  
0.3806292642  
0.2624279236  
0.1344918619  
0.0007054313156  
-0.1338952502  
-0.2630838972  
-0.3795936543  
-0.4755057476  
-0.5429256574  
-0.5749194368  
-0.5666272085  
-0.5164153746  
-0.4268415034  
-0.3052360916  
-0.1636845086  
-0.01827868443  
0.1123848345  
0.2093669957  
0.2559475716  
0.2402584429  
0.1575381728  
0.01161730458  
-0.1847232529  
-0.4106877186  
-0.6396913165  
-0.8426329873  
-0.9917903409  
-1.064754897  
-1.047813716  
-0.9382020475  
-0.7448437576  
-0.4874257718  
-0.1938993559  
0.1032077703  
0.3711217708  
0.5811310842  
0.7122452366  
0.7536650348  
0.7057781078  
0.5795807027  
0.3947152483  
0.1764727029  
-0.04775377431  
-0.2520280576  
-0.4149813319  
-0.5220854046  
-0.5668757245  
-0.5510674884  
-0.4836398162  
-0.3791142896  
-0.2553001901  
-0.1308238054  
-0.02276793631  
0.05534649574  
0.0949942055  
0.09339745271  
0.05353920464  
-0.01652202922  
-0.1049217566  
-0.1976788801  
-0.2805857471  
-0.34107261  
-0.3698109567  
-0.361870888  
-0.3172775519  
-0.2409213149  
-0.1418200283  
-0.03184619535  
0.07590824139  
0.1689126477  
0.2368826458  
0.2731420207  
0.2754763435  
0.246367105  
0.1925750723  
0.1241262212  
0.05283714409  
-0.009415903087  
-0.05245200927  
-0.06933010226  
-0.05745008754  
-0.01906478454  
0.03889309354  
0.105671693  
0.1681365216  
0.2126235072  
0.2269578513  
0.202368039  
0.135011532  
0.02689081703  
-0.1140182523  
-0.2744851362  
-0.4375371141  
-0.5846031636  
-0.6980248008  
-0.7635954642  
-0.772773641  
-0.7242253504  
-0.6244385983  
-0.4872656458  
-0.332381986  
-0.1828344296  
-0.06196718062  
0.009855685099  
0.01826885527  
-0.04279472489  
-0.1698894359  
-0.3501773932  
-0.5629048509  
-0.7820839903  
-0.9800203554  
-1.131172484  
-1.215770816  
-1.222628326  
-1.150693105  
-1.009081458  
-0.8155614285  
-0.5937291669  
-0.3693111154  
-0.1661962965  
-0.002829963832  
0.1104535564  
0.1727399513  
0.1922920223  
0.1848283964  
0.1706178657  
0.1708814995  
0.2040897285  
0.2827415872  
0.4111249498  
0.5843872895  
0.7890281093  
1.004719927  
1.207146392  
1.3714219  
1.475581996  
1.503651296  
1.447854999  
1.309713579  
1.099886891  
0.8368317276  
0.5444929749  
0.2493590135  
-0.02271226907  
-0.2494749041  
-0.4147129134  
-0.5098048266  
-0.534269751  
-0.4952854503  
-0.4062806665  
-0.2848483295  
-0.1502814793  
-0.02108105722  
0.08723939659  
0.1637827651  
0.2031694852  
0.2056427238  
0.1764402282  
0.1245727605  
0.06122948858  
-0.001964653237  
-0.0545789783  
-0.08872666304  
-0.09996286825  
-0.08768195314  
-0.05498686821  
-0.008092256783  
0.04463849889  
0.09389789626  
0.1307153203  
0.1476774516  
0.1399310875  
0.1058593751  
0.04733933412  
-0.03044335616  
-0.1196193722  
-0.2106264431  
-0.2934451439  
-0.3589292098  
-0.4000502722  
-0.412896521  
-0.3972687154  
-0.3567763903  
-0.2984161099  
-0.2316498654  
-0.1671102638  
-0.1150883817  
-0.08401602861  
-0.07915115522  
-0.1016720671  
-0.1483070443  
-0.2116037942  
-0.2807988096  
-0.3432111796  
-0.38598805  
-0.3979521518  
-0.3713332149  
-0.303103005  
-0.1957399567  
-0.05727315572  
0.09942093543  
0.2580249015  
0.4007235052  
0.5104583163  
0.5732029332  
0.5799668927  
0.5282291244  
0.4225881766  
0.2744878775  
0.1010028235  
-0.07721402868  
-0.2385834829  
-0.3635324932  
-0.4373137921  
-0.4523084921  
-0.4094643197  
-0.3185952371  
-0.197439175  
-0.06952775223  
0.03891732935  
0.1026460276  
0.1011153256  
0.02175431022  
-0.1377491803  
-0.3685297537  
-0.651191598  
-0.9579953096  
-1.256321429  
-1.512954275  
-1.698552862  
-1.791676397  
-1.781738556  
-1.670448195  
-1.471522045  
-1.20872324  
-0.9125396717  
-0.6160420907  
-0.3505409835  
-0.1417073943  
-0.006677259206  
0.04749754011  
0.02392810015  
-0.06537828015  
-0.2018484713  
-0.3632967225  
-0.5270342354  
-0.6726938384  
-0.7844276889  
-0.8522653331  
-0.8725634005  
-0.847617367  
-0.7845913634  
-0.6940071309  
-0.5880322673  
-0.478800731  
-0.3769631118  
-0.2906012967  
-0.2245750655  
-0.1803292243  
-0.1561123987  
-0.1475504298  
-0.1484593684  
-0.151797035  
-0.1506191881  
-0.1389484291  
-0.1124480543  
-0.06884608123  
-0.008079143731  
0.06784540169  
0.1552150848  
0.2491572843  
0.3442595251  
0.4351906368  
0.5172398984  
0.5867071719  
0.641128637  
0.6793095237  
0.7012167944  
0.7077565748  
0.700509085  
0.6814691282  
0.6528496203  
0.6169804718  
0.5762935755  
0.5334048336  
0.4912188872  
0.4530307129  
0.4225373891  
0.4037313677  
0.4006215469  
0.4168046508  
0.4549138837  
0.5160264225  
0.5991423695  
0.700840683  
0.815235925  
0.9342910837  
1.048525959  
1.148052027  
1.223834393  
1.268990134  
1.279920851  
1.25707831  
1.205173917  
1.132763593  
1.051188689  
0.9729997127  
0.910066566  
0.8716595694  
0.8628072592  
0.8832127822  
0.9269482661  
0.9830083866  
1.036699557  
1.071669079  
1.072301156  
1.026109114  
0.9257732373  
0.7704946958  
0.5664624573  
0.3263559494  
0.06795109052  
-0.1879636936  
-0.4200633114  
-0.6090088958  
-0.7396812323  
-0.8028468923  
-0.7960702649  
-0.7238063176  
-0.5966953029  
-0.430204267  
-0.2428127489  
-0.05397344095  
0.117889677  
0.257135346  
0.3522207989  
0.3964712039  
0.3882494677  
0.3305625153  
0.2301853679  
0.09646048048  
-0.06006672671  
-0.2289790007  
-0.4011190296  
-0.5693956993  
-0.7291651154  
-0.8781952297  
-1.016237295  
-1.144334625  
-1.264001035  
-1.376424032  
-1.481855799  
-1.579280749  
-1.666429367  
-1.740112592  
-1.796815736  
-1.83342078  
-1.847924189  
-1.83998706  
-1.811227748  
-1.765163157  
-1.706821798  
-1.642051961  
-1.576677325  
-1.515608535  
-1.462101402  
-1.417277002  
-1.380009279  
-1.347205774  
-1.314442534  
-1.276851018  
-1.230096522  
-1.171282829  
-1.09961264  
-1.016690494  
-0.9263999811  
-0.8343797629  
-0.7471745077  
-0.6712162441  
-0.6117944024  
-0.5721948451  
-0.5531456914  
-0.5526523545  
-0.566257441  
-0.5876445214  
-0.6095290086  
-0.6246402771  
-0.6266797989  
-0.6110996105  
-0.5755908484  
-0.5202412243  
-0.4473489645  
-0.3609529128  
-0.2661651798  
-0.1684173693  
-0.07273865598  
0.01682848917  
0.09760777059  
0.1684133935  
0.2294276412  
0.2818706201  
0.3275352745  
0.3682760468  
0.4055585581  
0.4401580147  
0.4720704623  
0.5006543729  
0.5249931948  
0.5443961513  
0.5589353665  
0.5698776604  
0.5798909742  
0.5929139106  
0.6136546704  
0.6467411368  
0.6956393114  
0.7615261987  
0.8423464668  
0.9322991535  
1.021940755  
1.099018684  
1.150016746  
1.162241449  
1.126159252  
1.037590646  
0.8993460629  
0.7219174831  
0.5229992393  
0.3257569603  
0.1560206211  
0.03876678591  
-0.005575736919  
0.03560881727  
0.1648551051  
0.3737909439  
0.6439426648  
0.9491058512  
1.258931434  
1.54315852  
1.775809661  
1.93865962  
2.023434523  
2.032389712  
1.977238422  
1.876649699  
1.752789058  
1.627511596  
1.518858538  
1.43839998  
1.389844545  
1.369050193  
1.36536087  
1.363976798  
1.348877324  
1.305794622  
1.224712513  
1.101512985  
0.9385344117  
0.7439954357  
0.5304723096  
0.312705619  
0.1051640387  
-0.08022885753  
-0.2358194244  
-0.3591448408  
-0.4529316977  
-0.5242198173  
-0.582790643  
-0.6392133139  
-0.7028450422  
-0.7801439457  
-0.8735656946  
-0.9812370154  
-1.097421814  
-1.213706655  
-1.320669219  
-1.409740841  
-1.47494624  
-1.514200498  
-1.52996681  
-1.529137574  
-1.522158658  
-1.521535363  
-1.539934986  
-1.588186107  
-1.67346861  
-1.797971525  
-1.958210273  
-2.14511965  
-2.344899967  
-2.540522568  
-2.713685279  
-2.846966227  
-2.925900343  
-2.940718948  
-2.887527788  
-2.768799646  
-2.593114961  
-2.374185659  
-2.129293548  
-1.877300325  
-1.636474818  
-1.422365276  
-1.245951264  
-1.112278222  
-1.019726308  
-0.9599949922  
-0.9188221605  
-0.8773684347  
-0.8141490154  
-0.7073164027  
-0.5370895428  
-0.2880937548  
0.04860634221  
0.4739674928  
0.9800805981  
1.550020702  
2.158504934  
2.773338574  
3.357608027  
3.872501954  
4.280580261  
4.549230608  
4.654005996  
4.581458802  
4.331108201  
3.916208945  
3.363102798  
2.70909059  
1.998995927  
1.28074491  
