-0.2760565054  
0.1197936719  
0.4736103859  
0.7455800337  
0.9055910199  
0.9365390148  
0.8358173443  
0.6148718681  
0.2970045006  
-0.08614474215  
-0.4988304152  
-0.9055282181  
-1.27476291  
-1.582006931  
-1.811412226  
-1.956326072  
-2.018721648  
-2.007783056  
-1.937955438  
-1.826761754  
-1.692637667  
-1.552988524  
-1.422574084  
-1.312290979  
-1.228357551  
-1.171914961  
-1.139032173  
-1.121125598  
-1.105790862  
-1.078033563  
-1.02185825  
-0.9221143719  
-0.7664654848  
-0.5472606475  
-0.2631089934  
0.08010115725  
0.4689097598  
0.882863497  
1.295970268  
1.678942568  
2.00202545  
2.238090031  
2.365638869  
2.371340674  
2.251768854  
2.014084279  
1.675563095  
1.261991006  
0.8050907392  
0.3393024853  
-0.101719665  
-0.4884642311  
-0.7983794845  
-1.017831179  
-1.142980798  
-1.179514405  
-1.141289577  
-1.048091528  
-0.9228038815  
-0.7883500282  
-0.6647807215  
-0.5668649015  
-0.5024665394  
-0.4718929682  
-0.4682775667  
-0.4789360302  
-0.4875191933  
-0.4766574928  
-0.4307699311  
-0.3386309881  
-0.1953532533  
-0.003492640797  
0.2268950082  
0.4792825645  
0.7326647572  
0.964259744  
1.152546008  
1.280218393  
1.336621487  
1.319312891  
1.234501723  
1.096274872  
0.924704197  
0.743091402  
0.5747389972  
0.4397219187  
0.3521402714  
0.3182693443  
0.3358912974  
0.3949235399  
0.4792451775  
0.5694380267  
0.6460180846  
0.6926292184  
0.6986958132  
0.6610894815  
0.5845416772  
0.4807281318  
0.3661868774  
0.2594104994  
0.177616712  
0.1337345561  
0.1341284774  
0.1774272067  
0.2546639919  
0.3506720035  
0.4464922485  
0.5223724116  
0.5608420457  
0.5493691613  
0.4821765079  
0.3609641496  
0.19448043  
-0.002917813317  
-0.2134328484  
-0.4183208975  
-0.6003002077  
-0.7455121302  
-0.8447753209  
-0.8940338606  
-0.8940228815  
-0.8493405321  
-0.7671657055  
-0.6559132459  
-0.5240793335  
-0.379461474  
-0.2288219107  
-0.0779662985  
0.06789363688  
0.2036782604  
0.3240811665  
0.4234542579  
0.4960361419  
0.5365062113  
0.5407451365  
0.5066507642  
0.4347868501  
0.3287052697  
0.1948073243  
0.0417346232  
-0.1206349497  
-0.2824242686  
-0.4349981563  
-0.5719862385  
-0.6899096516  
-0.7882836849  
-0.8692125254  
-0.9365560855  
-0.9948446753  
-1.048163151  
-1.099211771  
-1.148713552  
-1.195260412  
-1.235591747  
-1.265216839  
-1.279220818  
-1.273069177  
-1.243237801  
-1.187546252  
-1.105149117  
-0.9962419463  
-0.861583653  
-0.7020291331  
-0.5182221969  
-0.3106049296  
-0.07978917637  
0.1727377678  
0.4437108349  
0.7271938843  
1.013933283  
1.291196297  
1.54324502  
1.752506735  
1.901369003  
1.974394222  
1.960647123  
1.855766278  
1.663421216  
1.39583868  
1.073218023  
0.7220130748  
0.3722249686  
0.05402852283  
-0.2058374131  
-0.3873982253  
-0.4800135369  
-0.4837693857  
-0.4094715133  
-0.2771772223  
-0.1134523043  
0.05228110926  
0.1917886895  
0.2818862457  
0.3075504524  
0.2638492859  
0.1563979563  
0.0003028214869  
-0.1822327859  
-0.3652872055  
-0.5230584201  
-0.6336185132  
-0.6820293019  
-0.6624077212  
-0.5786563755  
-0.443808002  
-0.2781021354  
-0.1061084543  
0.04668597851  
0.1573326666  
0.2084611464  
0.1904948598  
0.102781345  
-0.04647420076  
-0.2414332787  
-0.4607890633  
-0.6805717529  
-0.8771899368  
-1.030311516  
-1.125210724  
-1.154294888  
-1.117648798  
-1.022575069  
-0.8822403182  
-0.7136636756  
-0.5353674556  
-0.3650190149  
-0.2174027168  
-0.102961329  
-0.02706378894  
0.009975933339  
0.01222620039  
-0.01301474537  
-0.05661344432  
-0.1089815784  
-0.1612325093  
-0.2059664129  
-0.2376134803  
-0.2523743682  
-0.2478531743  
-0.2225537021  
-0.1753951401  
-0.1054087987  
-0.01171291001  
0.1062111412  
0.248003841  
0.4117802319  
0.5935405663  
0.7868003365  
0.9825993706  
1.169974474  
1.336905049  
1.471635229  
1.564199177  
1.607928553  
1.600671824  
1.545495593  
1.450710174  
1.32913165  
1.196620931  
1.07007337  
0.965098598  
0.8937145572  
0.8624072105  
0.8708436957  
0.9114941477  
0.970258764  
1.028085988  
1.063417054  
1.055159706  
0.9857969512  
0.8442257241  
0.6278754693  
0.3437844908  
0.008416691079  
-0.3538388419  
-0.7133421927  
-1.03874008  
-1.300916648  
-1.476803054  
-1.552524813  
-1.525387033  
-1.404395762  
-1.209189364  
-0.9674881039  
-0.7114051541  
-0.473108176  
-0.280449774  
-0.1531731828  
-0.100229223  
-0.1185810813  
-0.1936500498  
-0.3013494855  
-0.4114052341  
-0.4915253449  
-0.5118543749  
-0.4491356441  
-0.290054882  
-0.0333504187  
0.3095472912  
0.7154172795  
1.151557633  
1.579212652  
1.957713088  
2.248838186  
2.420914531  
2.452193393  
2.333159717  
2.067536872  
1.671909828  
1.174041501  
0.6100884565  
0.02104894443  
-0.5511827624  
-1.067719278  
-1.496154334  
-1.81327717  
-2.006760903  
-2.075730516  
-2.030177327  
-1.889338605  
-1.67926192  
-1.429829409  
-1.171582599  
-0.9326764334  
-0.7362986977  
-0.5987771325  
-0.5285736081  
-0.5262093054  
-0.5850805448  
-0.6930130147  
-0.8343113149  
-0.992022339  
-1.150087707  
-1.295125554  
-1.41761791  
-1.512382576  
-1.578343225  
-1.617682655  
-1.63459451  
-1.633869639  
-1.619598145  
-1.59419985  
-1.55796327  
-1.509128584  
-1.444502488  
-1.36043315  
-1.253963914  
-1.123918517  
-0.9717012084  
-0.8016445052  
-0.6208221762  
-0.4383430117  
-0.2642324668  
-0.1080827605  
0.02230636557  
0.1220643413  
0.1899876753  
0.2287481367  
0.2445409492  
0.2462300617  
0.2441209212  
0.2485641734  
0.2685975956  
0.310830128  
0.3787479901  
0.4725280745  
0.5893713782  
0.7243056942  
0.8713023866  
1.02451945  
1.179469643  
1.333886732  
1.488145672  
1.645127609  
1.809527169  
1.986676426  
2.181048226  
2.394675836  
2.625740496  
2.867582617  
3.108354444  
3.331434564  
3.516631097  
3.642083523  
3.686656687  
3.632546456  
3.467744217  
3.188039444  
2.798245706  
2.312459211  
1.753244017  
1.149820977  
0.5354174868  
-0.05589731293  
-0.5925385869  
-1.048475623  
-1.405671825  
-1.655589077  
-1.799589318  
-1.84816057  
-1.819112117  
-1.734963553  
-1.619888924  
-1.496627516  
-1.383766596  
-1.293752132  
-1.231876609  
-1.196338269  
-1.17933096  
-1.168959545  
-1.151668066  
-1.114798228  
-1.048881395  
-0.9493343031  
-0.8172961059  
-0.6595149291  
-0.4873226238  
-0.3148723762  
-0.1569408908  
-0.02664806509  
0.06654903555  
0.118264821  
0.1297872464  
0.1077830159  
0.06315790912  
0.009260032869  
-0.04028885253  
-0.07379482531  
-0.08338827191  
-0.06631475416  
-0.0254431432  
0.0310979274  
0.09109239856  
0.1400348633  
0.1633049169  
0.1483940507  
0.08688152785  
-0.02411214712  
-0.1811875236  
-0.3747374659  
-0.5898005074  
-0.8076062895  
-1.007591324  
-1.169650877  
-1.276359684  
-1.314890235  
-1.278428583  
-1.166923433  
-0.9871011046  
-0.7517641629  
-0.4784649022  
-0.1877271801  
0.0989749211  
0.3612457665  
0.581571809  
0.7467211249  
0.8486014591  
0.8845252986  
0.8569082705  
0.7725011422  
0.6412909885  
0.4752571029  
0.2871365065  
0.08935856737  
-0.1067752775  
-0.2916204466  
-0.457429364  
-0.5983740001  
-0.7104021577  
-0.7910276956  
-0.839097325  
-0.8545844705  
-0.8384317188  
-0.7924225608  
-0.7190740754  
-0.6215207792  
-0.5033857057  
-0.3686323967  
-0.221410345  
-0.06592546371  
0.09364644493  
0.2531830734  
0.4085814097  
0.5556705475  
0.690122523  
0.8074091883  
0.9028433355  
0.9717573194  
1.009821221  
1.013490183  
0.9805341488  
0.9105648695  
0.8054760466  
0.6696918189  
0.5101470827  
0.3359467482  
0.1577000559  
-0.01342472637  
-0.1668255632  
-0.2936490663  
-0.3878463123  
-0.4469674765  
-0.4725401304  
-0.4699483826  
-0.447782386  
-0.41670464  
-0.3879443137  
-0.3716083405  
-0.3750129724  
-0.4012868961  
-0.4484582901  
-0.5092073515  
-0.5713724295  
-0.6192284337  
-0.6354294026  
-0.6034131028  
-0.5099858042  
-0.3477357947  
-0.1169348841  
0.173396287  
0.505487679  
0.8539897415  
1.188262827  
1.47558619  
1.684914143  
1.790734172  
1.776494541  
1.637121713  
1.380227743  
1.025767602  
0.6041289217  
0.1528460996  
-0.2876582576  
-0.6787388906  
-0.9879827142  
-1.192836004  
-1.282907765  
-1.260650745  
-1.140349797  
-0.9456139545  
-0.7057626215  
-0.4516743643  
-0.2117086639  
-0.008295594196  
0.1443672637  
0.2412316215  
0.2858996294  
0.288906088  
0.2651406678  
0.2309047966  
0.2010841032  
0.1869094307  
0.1945933606  
0.2249851383  
0.2742025488  
0.3350207285  
0.3986949282  
0.4568482446  
0.5030789106  
0.5340130238  
0.5496691909  
0.5531212703  
0.5495744894  
0.5450838037  
0.5451577648  
0.5535192691  
0.5712286324  
0.5963074704  
0.6239034309  
0.6469404645  
0.6571322267  
0.6461836176  
0.6069872681  
0.5346460889  
0.4271826939  
0.2858611405  
0.1151079808  
-0.07793716894  
-0.2841414324  
-0.4932778558  
-0.6949603302  
-0.8795399865  
-1.038845558  
-1.166731856  
-1.259409361  
-1.315531043  
-1.33608452  
-1.324085637  
-1.284120734  
-1.221777288  
-1.143000229  
-1.053421194  
-0.9577284031  
-0.8591362911  
-0.7590222662  
-0.6568058114  
-0.5500958988  
-0.435151127  
-0.3075828027  
-0.1632804612  
0.0005984459449  
0.1846910351  
0.38671374  
0.6010986861  
0.8190878292  
1.029308369  
1.218809255  
1.374419956  
1.484284873  
1.539337356  
1.534519525  
1.469557028  
1.349164263  
1.182653505  
0.9829812522  
0.7653695386  
0.5456917699  
0.3388318649  
0.157238657  
0.009857353261  
-0.09846778661  
-0.1670485218  
-0.1989257506  
-0.2000539997  
-0.1782424021  
-0.1420302057  
-0.09964374777  
-0.05817890874  
-0.02307764085  
0.002071317319  
0.0154297172  
0.01658664358  
0.006108675025  
-0.01493815397  
-0.0453909523  
-0.08426116154  
-0.1308465764  
-0.1846888653  
-0.2454250031  
-0.3125994967  
-0.3854909321  
-0.4630333132  
-0.5438336908  
-0.6263129844  
-0.7089159681  
-0.7903479596  
-0.8697633272  
-0.9468530328  
-1.021781894  
-1.094975529  
-1.166779062  
-1.237046716  
-1.304735533  
-1.367590298  
-1.421997488  
-1.46304241  
-1.484813405  
-1.480915285  
-1.445152261  
-1.372304184  
-1.258907329  
-1.103940668  
-0.9093373563  
-0.6802431085  
-0.4249772784  
-0.1546762512  
0.1173775668  
0.376706208  
0.6087989305  
0.8004016132  
0.9408265388  
1.023141751  
1.045123103  
1.009819717  
0.9256382495  
0.8058614872  
0.6676040182  
0.530234186  
0.4134129455  
0.3349344168  
0.3086184155  
0.3425256393  
0.4377452588  
0.5879707857  
0.779947101  
0.9948140303  
1.210191021  
1.402785119  
1.551173377  
1.638418894  
1.654150248  
1.595824748  
1.468993375  
1.28653532  
1.066951682  
0.8319730752  
0.6037993556  
0.4023619163  
0.2429797805  
0.1347132113  
0.07962609763  
0.07302047167  
0.1045609104  
0.1601023394  
0.2239123054  
0.2809608892  
0.3189286431  
0.3296745805  
0.3099615355  
0.261395203  
0.1896161268  
0.102934112  
0.01064618375  
-0.07867757052  
-0.158649968  
-0.2260442343  
-0.281139997  
-0.3274126168  
-0.3706116667  
-0.4174260616  
-0.4739302148  
-0.5441042926  
-0.6286617527  
-0.7243866615  
-0.8241029098  
-0.9172980304  
-0.9913128586  
-1.032947565  
-1.030239032  
-0.9741744079  
-0.8600897565  
-0.6885656428  
-0.4656947582  
-0.2026995935  
0.0850616858  
0.3795490277  
0.6617718304  
0.9135907503  
1.11936222  
1.267256966  
1.3501137  
1.365776851  
1.316916238  
1.210397747  
1.05632228  
0.8668627941  
0.6550623973  
0.4337028898  
0.2143548132  
0.006682112823  
-0.1819754189  
-0.3467403292  
-0.4850840873  
-0.5964976518  
-0.6820157031  
-0.7436460942  
-0.7837812811  
-0.8046610647  
-0.8079425094  
-0.7944557234  
-0.7641620378  
-0.7163453363  
-0.6500128371  
-0.5644525456  
-0.4598675655  
-0.3379770434  
-0.2024666656  
-0.05919429891  
0.08393951983  
0.2174725222  
0.331186119  
0.4151490577  
0.4608669566  
0.4623661464  
0.417052171  
0.3261987238  
0.194975358  
0.03199204039  
-0.151574513  
-0.3431785018  
-0.5302288221  
-0.7013770384  
-0.8475759496  
-0.9627770368  
-1.044191296  
-1.092114212  
-1.109372225  
-1.100520056  
-1.070943476  
-1.026018811  
-0.9704636  
-0.9079603882  
-0.8410887407  
-0.7715183304  
-0.7003857936  
-0.6287394829  
-0.5579261875  
-0.4898100427  
-0.4267643737  
-0.3714173501  
-0.3261956151  
-0.2927566104  
-0.2714358052  
-0.2608424856  
-0.257723623  
-0.2571654303  
-0.2531590208  
-0.2394692393  
-0.2106939969  
-0.1633487301  
-0.09678413052  
-0.01375417569  
0.07949986663  
0.1737300816  
0.2577078074  
0.3196924008  
0.3491541264  
0.338510221  
0.2846069148  
0.1897126154  
0.06182212429  
-0.08579769916  
-0.235817119  
-0.3686641539  
-0.4647192976  
-0.5065916941  
-0.4811521938  
-0.3810579688  
-0.2055339579  
0.039641905  
0.3429409581  
0.6884981258  
1.057891189  
1.4320033  
1.792680463  
2.123965269  
2.412797033  
2.649171433  
2.825862406  
2.93790144  
2.982022031  
2.956277195  
2.85996332  
2.693885194  
2.460908536  
2.166628744  
1.819964513  
1.433441977  
1.023012481  
0.6073145156  
0.2063975129  
-0.1599434966  
-0.474007745  
-0.7219281112  
-0.8950424743  
-0.9906850945  
-1.012281464  
-0.9687324901  
-0.8732155093  
-0.7415785109  
-0.5906112848  
-0.436415655  
-0.2931192666  
-0.1720515983  
-0.08142554945  
-0.02646017065  
-0.009809460234  
-0.03209483215  
-0.09237680056  
-0.1883981334  
-0.316537553  
-0.4714949494  
-0.64582604  
-0.829505316  
-1.009744007  
-1.171253098  
-1.297087873  
-1.370092846  
-1.374853583  
-1.299911058  
-1.139918081  
-0.897362455  
-0.5835021345  
-0.2182345585  
0.1712188644  
0.552766536  
0.8927881758  
1.159971069  
1.329109339  
1.384333305  
1.321260265  
1.147719816  
0.8828862984  
0.5548981662  
0.197253742  
-0.1554987929  
-0.4721939883  
-0.7289535276  
-0.9119928736  
-1.0189391  
-1.058466877  
-1.048328603  
-1.012090846  
-0.9750943726  
-0.9602584564  
-0.9843816107  
-1.055500236  
-1.171706744  
-1.321578617  
-1.486138257  
-1.641995038  
-1.765145028  
-1.834808422  
-1.836665628  
-1.764987249  
-1.623320763  
-1.423663769  
-1.184307497  
-0.9267694435  
-0.6723756217  
-0.4391086126  
-0.2392726561  
-0.07835167972  
0.04479244639  
0.136499286  
0.2060203491  
0.2628677487  
0.3143738642  
0.3639564608  
0.4104632334  
0.4486823676  
0.4709314948  
0.4693433467  
0.438376921  
0.3769996522  
0.2900737357  
0.1886074083  
0.08877261261  
0.009821022484  
-0.02877149572  
-0.01043449199  
0.07562996051  
0.2323431191  
0.4537884141  
0.7255535109  
1.026355237  
1.330684171  
1.612063686  
1.846428471  
2.015110703  
2.107008074  
2.119644921  
2.059014763  
1.93826409  
1.775490762  
1.590980056  
1.404335924  
1.231892199  
1.084783863  
0.9678931438  
0.8797787816  
0.8135395842  
0.7584257975  
0.7019320194  
0.6320349467  
0.5392415279  
0.4181624221  
0.2683926778  
0.09460353335  
-0.09414854136  
-0.2857558595  
-0.4668324242  
-0.6246427179  
-0.7488975676  
-0.8331581089  
-0.8756484631  
-0.8793827207  
-0.8516135399  
-0.8027080102  
-0.7446528635  
-0.6894198954  
-0.6474431531  
-0.6264117756  
-0.6305378589  
-0.6603509421  
-0.7130086988  
-0.7830238424  
-0.8632659375  
