502.6073662  
573.9312663  
727.8597778  
1053.665377  
2067.033007  
23127.86089  
22035.11959  
15035.72277  
82102.97702  
52656.26905  
20968.06715  
14695.97547  
12741.45208  
982.0186967  
27014.5591  
1688.739736  
26474.59208  
13476.58729  
11382.36924  
41799.44712  
10529.24655  
10751.80686  
8318.099879  
6259.211864  
6746.441539  
9763.520628  
6238.806623  
1651.264975  
1717.108049  
1752.742691  
2386.085373  
3038.681875  
52.90890299  
2293.106235  
604.9190161  
4073.041794  
5996.859181  
1256.567485  
1288.254282  
3271.947487  
2372.638256  
876.2155684  
1354.433284  
1991.834381  
531.1674307  
764.8334043  
4164.010159  
369.0050461  
1659.113893  
26.5065429  
477.9833891  
2206.536221  
1805.168556  
232.7286356  
351.8558813  
1666.886043  
455.1866312  
3035.934039  
824.5364046  
389.3182289  
34.7859772  
632.4694117  
100.8223504  
25.97213367  
506.6111748  
305.0986055  
66.74229878  
22.96890942  
27.01338521  
20.22913983  
76.01535852  
48.87084282  
28.61421509  
31.55667339  
35.13003263  
15.73770592  
25.61871923  
21.72521313  
16.54053709  
16.77434416  
19.021035  
15.17890248  
16.59761231  
15.07884649  
15.03107952  
14.1983238  
13.73586497  
12.70275176  
12.4010346  
11.80215474  
11.66387248  
10.80310619  
10.62285959  
10.20716165  
9.660315309  
9.526034534  
9.278719379  
8.85750845  
8.699451749  
8.407299623  
8.145602355  
7.982266952  
7.71399569  
7.538329306  
7.369986729  
7.156488982  
6.981820678  
6.817817458  
6.656080369  
6.498070023  
6.346607715  
6.206285833  
6.058239823  
5.928889717  
5.802447412  
5.674130721  
5.558473991  
5.443301606  
5.329342245  
5.223708715  
5.122086164  
5.017850135  
4.923004679  
4.829294068  
4.738904426  
4.650544858  
4.56444862  
4.481162919  
4.401368947  
4.323464007  
4.24754835  
4.174151546  
4.103068396  
4.03366846  
3.966079122  
3.900782876  
3.836955341  
3.77500967  
3.71473142  
3.656146099  
3.59894004  
3.543358694  
3.489151098  
3.436263491  
3.384774313  
3.334615592  
3.285599401  
3.237921174  
3.19132598  
3.14584087  
3.101464097  
3.058101794  
3.015762481  
2.974413933  
2.934016545  
2.894543658  
2.855961524  
2.818265679  
2.781312293  
2.745302361  
2.710016275  
2.675484756  
2.641769726  
2.608661978  
2.576371074  
2.544671699  
2.513668961  
2.483301719  
2.453558875  
2.424426693  
2.395846609  
2.3678733  
2.340482761  
2.313616533  
2.287268266  
2.261421329  
2.236089595  
2.21126149  
2.186888677  
2.163023988  
2.139562567  
2.116532944  
2.093962156  
2.07176363  
2.049977616  
2.028634666  
2.007668484  
1.987049268  
1.966840435  
1.946968184  
1.927419943  
1.908259807  
1.889447317  
1.87090903  
1.852700872  
1.834819167  
1.817264493  
1.799971457  
1.782978548  
1.766273107  
1.749870231  
1.733730639  
1.717830838  
1.702199427  
1.686817297  
1.671696911  
1.656819236  
1.642182186  
1.627785144  
1.61358023  
1.599656952  
1.585932127  
1.572391599  
1.559087571  
1.545983803  
1.533068437  
1.520370959  
1.507857148  
1.495562416  
1.483409529  
1.471448513  
1.459693764  
1.448100531  
1.436656828  
1.425402029  
1.414316285  
1.40336717  
1.392614127  
1.381982028  
1.371524808  
1.36122304  
1.351087426  
1.341042301  
1.331166226  
1.321417495  
1.311839891  
1.30236896  
1.29301354  
1.283832044  
1.274743472  
1.265779211  
1.256968431  
1.248256885  
1.239648901  
1.231175221  
1.2228313  
1.214577915  
1.206450966  
1.198415016  
1.190485369  
1.182672975  
1.174967124  
1.167353846  
1.159836346  
1.152413333  
1.145114503  
1.137882724  
1.130747351  
1.123718241  
1.116763711  
1.109904735  
1.103120564  
1.096461173  
1.089879764  
1.083335614  
1.076936027  
1.070567251  
1.064273187  
1.058100587  
1.051975475  
1.045946415  
1.039969288  
1.034075417  
1.028282539  
1.022486927  
1.016830596  
1.011210123  
1.005671398  
1.000221827  
0.994806986  
0.9894577643  
0.9841900675  
0.9789816064  
0.973802707  
0.9687196697  
0.9636896234  
0.9587311481  
0.953819193  
0.9489685049  
0.9441718726  
0.9394111926  
0.9347682814  
0.9301181727  
0.9255463232  
0.9210316409  
0.9165653922  
0.9121725737  
0.9077884946  
0.903477849  
0.899220835  
0.8950144111  
0.8908522029  
0.8867271467  
0.882671899  
0.8786439835  
0.8746781808  
0.8707500467  
0.8668569519  
0.8630109353  
0.8592100931  
0.8554746432  
0.851773305  
0.8480904874  
0.8444698707  
0.840872783  
0.8373330083  
0.8338345572  
0.8303568942  
0.8269236151  
0.8235523087  
0.8202127014  
0.8169070174  
0.8136120013  
0.8103922321  
0.8071748309  
0.8040114574  
0.8008805045  
0.7978060378  
0.7947479366  
0.7917015567  
0.7887170749  
0.7857746941  
0.7828555729  
0.7799688085  
0.7770991873  
0.7742877511  
0.7714783942  
0.7687297677  
0.7659838847  
0.7632903475  
0.7606170121  
0.7579824031  
0.7553627328  
0.7527879091  
0.7502553042  
0.7477151451  
0.7452172392  
0.7427533437  
0.7403177171  
0.7379300023  
0.7355264633  
0.7331590336  
0.7308453709  
0.7285374867  
0.7262495109  
0.7240237754  
0.7217824927  
0.7195604537  
0.7174019002  
0.71525618  
0.7131366988  
0.7110297916  
0.7089760447  
0.7069015781  
0.7048719906  
0.7028757254  
0.700886004  
0.698928526  
0.6969774425  
0.6950854459  
0.6931829346  
0.6912929582  
0.6894754821  
0.6876358155  
0.6858253596  
0.6840712572  
0.6822891669  
0.6805461072  
0.6788285322  
0.677151079  
0.6754762604  
0.6738041902  
0.672163049  
0.6705532007  
0.6689432442  
0.6673656994  
0.6658216807  
0.6642877137  
0.6627475662  
0.6612643037  
0.6597643659  
0.6583015558  
0.6568579883  
0.6554484279  
0.6540324712  
0.6526467981  
0.6512739352  
0.6499122562  
0.6485831179  
0.6472650748  
0.6459680477  
0.6446806282  
0.6434178117  
0.6421720515  
0.6409220982  
0.6397280615  
0.6385168427  
0.6373524974  
0.6361698787  
0.6350356538  
0.633895852  
0.6327757349  
0.6316798736  
0.6306020401  
0.6295182226  
0.6284744888  
0.6274433655  
0.6264372153  
0.6254286184  
0.6244453612  
0.6234634173  
0.6224937803  
0.6215641677  
0.620630319  
0.619716295  
0.6188205623  
0.6179334063  
0.61707394  
0.6162082613  
0.6153633079  
0.6145405757  
0.6137405319  
0.6129385769  
0.6121663721  
0.6113895973  
0.6106352972  
0.6098880867  
0.6091687816  
0.6084593716  
0.6077665081  
0.6070875043  
0.6064035253  
0.6057611248  
0.6051098375  
0.6044793934  
0.6038732942  
0.6032766743  
0.602678929  
0.6021039036  
0.6015366531  
0.6009912746  
0.6004655442  
0.5999380608  
0.599426619  
0.5989375335  
0.5984406645  
0.5979846659  
0.5975107788  
0.5970919592  
0.5966624681  
0.5962339429  
0.595835296  
0.5954319857  
0.5950436207  
0.5946972926  
0.5943348584  
0.5939985046  
0.5936691331  
0.5933456985  
0.5930508899  
0.5927693196  
0.5924822995  
0.5922194094  
0.5919720537  
0.5917088552  
0.5914883302  
0.591271574  
0.5910818827  
0.5908900131  
0.5906875144  
0.5905304355  
0.5903814976  
0.5902472861  
0.5901123196  
0.5899992936  
0.5898888392  
0.5898050386  
0.5897354437  
0.5896668049  
0.5896077772  
0.5895686417  
0.5895320458  
0.5895186499  
0.5895350457  
