195.8526055  
206.7345114  
225.4386344  
264.7268239  
735.5566899  
6861.112999  
24718.18979  
21356.05757  
20975.62874  
585.0629868  
12835.0187  
236.8193604  
11538.81291  
32002.53387  
13298.63089  
3812.403133  
338.0834497  
27355.45606  
6120.737131  
7766.266172  
28449.18384  
2056.340437  
12670.34367  
7134.030952  
3011.118574  
8089.766791  
5339.700073  
12750.33475  
2931.687872  
154.6447068  
2503.459968  
10788.99514  
17767.08799  
2557.616246  
3831.393664  
621.1956052  
36189.65163  
8704.833918  
9500.754351  
2731.837359  
21759.49286  
13039.58866  
4633.186419  
3250.81634  
488.1226799  
3912.63112  
4324.367359  
8812.543151  
3163.846083  
10297.23342  
16552.02743  
2284.348442  
4113.615456  
44.24053492  
4156.696331  
2004.557736  
340.5486164  
2039.665703  
3561.645947  
958.2782023  
1207.829857  
1393.343745  
670.8217805  
1530.154617  
2027.867803  
22.26524599  
413.3460875  
578.7563571  
280.109101  
275.2111667  
108.1760704  
64.01710343  
9.004572407  
3.480599817  
4.945537602  
0.398337874  
5.290080264  
16.23259674  
0.3936509729  
0.257204943  
1.821199132  
1.853189366  
1.045481132  
0.2221063897  
2.78091924  
0.1907347605  
0.02093070542  
0.4659433123  
0.1284427347  
0.06604175759  
0.2236807307  
0.08563334269  
0.1195778408  
0.0869162423  
0.1008600512  
0.0867492549  
0.09639607729  
0.09127846503  
0.09392090562  
0.06136680014  
0.07125175916  
0.06757837975  
0.06293284409  
0.06461860907  
0.05765224877  
0.05170087922  
0.05046068015  
0.05123104737  
0.05176835465  
0.04809058011  
0.04715830393  
0.04678909985  
0.04431940051  
0.04344230956  
0.04233490795  
0.04145216177  
0.04072341431  
0.03950387393  
0.03944806061  
0.03856270129  
0.03790555829  
0.03718613454  
0.03660032956  
0.03598680553  
0.03529406402  
0.03490051404  
0.03448388708  
0.03398289751  
0.03355506009  
0.0330948615  
0.03276475997  
0.03236405966  
0.03196406808  
0.03154981768  
0.0312338621  
0.03088624713  
0.03054270417  
0.03022233206  
0.02990024585  
0.0295804619  
0.02928469989  
0.0289857526  
0.02869529512  
0.02840965529  
0.02812523258  
0.02786593981  
0.02758889728  
0.02733339408  
0.02707398757  
0.02681993472  
0.02657440913  
0.02632835291  
0.02608662743  
0.02585096942  
0.02561979347  
0.02538842661  
0.02516535762  
0.0249421011  
0.02472344566  
0.02450799523  
0.02429520763  
0.02408446216  
0.02387846322  
0.02367457042  
0.02347611876  
0.02327551281  
0.02308136814  
0.02288937478  
0.02269843959  
0.02251065401  
0.0223243404  
0.02214219807  
0.02196340952  
0.02178316203  
0.02160707195  
0.02143382531  
0.02126089606  
0.02109243472  
0.02092593868  
0.02076128042  
0.0205978451  
0.02043714572  
0.02027850953  
0.02012091881  
0.01996960944  
0.01981436227  
0.01966409954  
0.01951319435  
0.01936585382  
0.01922037738  
0.01907714208  
0.01893673714  
0.01879695408  
0.01865616321  
0.01851944801  
0.01838539289  
0.01825121609  
0.01811961706  
0.0179881501  
0.01785927733  
0.01773077715  
0.01760746427  
0.01748213246  
0.01735907577  
0.01723873169  
0.01711720797  
0.01699891472  
0.01688290526  
0.01676643317  
0.01665361235  
0.01653898108  
0.01642618614  
0.01631673368  
0.01620739944  
0.01609954634  
0.01599432463  
0.01588742157  
0.01578366138  
0.01567932374  
0.01557842374  
0.01547733204  
0.01538007934  
0.01528121294  
0.01518410956  
0.01508556101  
0.01499408237  
0.01489859404  
0.01480620887  
0.0147150233  
0.01462410861  
0.01453584841  
0.01444540248  
0.0143587058  
0.01427255693  
0.01418600035  
0.01410119841  
0.01401663538  
0.01393463732  
0.01385351246  
0.01377100871  
0.01369118131  
0.01361121762  
0.01353458123  
0.0134549642  
0.01337967208  
0.01330363442  
0.01322813891  
0.01315445399  
0.01308127853  
0.01300904031  
0.01293760302  
0.01286695797  
0.01279702581  
0.01272777542  
0.01265764379  
0.01258874236  
0.01252326298  
0.01245688879  
0.01239220112  
0.01232493797  
0.01226323149  
0.01219869607  
0.0121361269  
0.0120738182  
0.01201297879  
0.01195070785  
0.0118917457  
0.01183208807  
0.01177272182  
0.01171317373  
0.01165663258  
0.0116000693  
0.01154347186  
0.01148587703  
0.01143157909  
0.01137708524  
0.01132431023  
0.01127008663  
0.01121642195  
0.01116457361  
0.01111153473  
0.01106137435  
0.01100967598  
0.01096090397  
0.01091032859  
0.01086171478  
0.01081228226  
0.01076522546  
0.01071598403  
0.01066992086  
0.01062167504  
0.01057635425  
0.01053044457  
0.01048630769  
0.0104396786  
0.01039727019  
0.01035230127  
0.01030775058  
0.01026662669  
0.01022306113  
0.01018212263  
0.01013863726  
0.010097473  
0.01005663608  
0.01001731499  
0.009978058536  
0.009938303326  
0.009899101486  
0.009859427071  
0.00982144988  
0.009783218231  
0.00974643623  
0.0097099921  
0.009672077464  
0.009637598412  
0.009600076341  
0.009564369731  
0.009529323868  
0.009494101335  
0.009460425621  
0.00942711497  
0.009391798456  
0.009358803265  
0.009325091965  
0.009292760074  
0.009259189641  
0.009228243844  
0.009196096299  
0.009164699851  
0.009134922241  
0.009102274102  
0.00907190326  
0.009042250634  
0.00901202416  
0.008983181818  
0.008954430507  
0.008924019329  
0.00889609715  
0.008868593928  
0.008839151663  
0.00881241395  
0.008783203348  
0.008757430903  
0.008730308217  
0.008704362326  
0.008677606173  
0.008651852668  
0.00862560658  
0.008600559835  
0.00857667604  
0.008550580941  
0.008525609244  
0.008501624602  
0.008476478493  
0.00845386721  
0.008429482391  
0.008406114583  
0.008383352983  
0.008360447837  
0.008337373153  
0.008315120384  
0.008292973649  
0.008271415286  
0.0082498404  
0.008227241279  
0.008206530896  
0.008186320826  
0.008164707546  
0.008145349702  
0.00812491922  
0.008103818006  
0.008086156148  
0.008064797927  
0.008045539686  
0.008026100614  
0.008008151358  
0.007989548255  
0.007970411254  
0.007951654732  
0.007935084687  
0.007916042842  
0.007899131176  
0.007880846268  
0.007863607707  
0.007846957626  
0.007830812565  
0.007813754821  
0.007797242312  
0.007779974594  
0.007764250616  
0.007749295014  
0.00773378384  
0.007717862548  
0.007701548303  
0.007687596117  
0.007673035945  
0.007657817578  
0.007642543661  
0.007630082021  
0.007615558421  
0.00760100821  
0.007586602778  
0.007573516774  
0.007559833055  
0.00754828934  
0.007533943469  
0.007520992906  
0.007508495996  
0.007496906005  
0.007483222788  
0.007471071054  
0.007459635463  
0.007448778206  
0.007435894786  
0.007423981153  
0.007413403029  
0.007402006609  
0.00739051051  
0.007379805078  
0.007369246211  
0.00735805152  
0.007348609699  
0.007337619192  
0.007328522808  
0.007317698469  
0.007307689812  
0.007300127898  
0.00728878678  
0.007280598671  
0.007271031583  
0.007261267456  
0.007252889398  
0.00724590954  
0.007236694356  
0.007228017184  
0.00722024631  
0.007210972828  
0.007204388327  
0.007195266035  
0.00718877898  
0.007181137692  
0.007174278423  
0.00716714048  
0.007159354723  
0.007153279581  
0.007145009392  
0.007139751281  
0.007132541646  
0.007127340227  
0.007121299498  
0.007115248958  
0.00710852885  
0.007103227879  
0.007097425113  
0.007093082654  
0.00708808181  
0.007082395691  
0.007077876676  
0.007073071636  
0.007068250428  
0.007063961256  
0.007058455088  
0.007054263487  
0.007050127848  
0.007045756397  
0.007042596142  
0.007038056976  
0.007035817354  
0.007031521411  
0.007028154555  
0.007025302729  
0.007022264764  
0.007018791932  
0.007017043299  
0.007013586625  
0.00701171238  
0.007009213411  
0.007006633367  
0.007004938765  
0.007002368781  
0.007001838402  
0.007000399563  
0.006997918533  
0.006997445368  
0.006994889445  
0.006994661758  
0.006993865352  
0.006992487773  
0.006991311842  
0.006991726635  
0.006990856583  
0.006990286197  
0.006990116764  
0.006989901116  
