-0.04693847237  
0.334200228  
0.6747234457  
0.9395894337  
1.101775423  
1.145130187  
1.065926006  
0.8729390857  
0.5860697663  
0.2337279203  
-0.1506607089  
-0.5325587488  
-0.8801219637  
-1.167456304  
-1.37695524  
-1.500503524  
-1.539474325  
-1.503633307  
-1.409163592  
-1.276128575  
-1.125749937  
-0.977834897  
-0.8486782352  
-0.7496423023  
-0.6865399225  
-0.6598105656  
-0.6653985253  
-0.696137131  
-0.7433915911  
-0.7987075029  
-0.8551997197  
-0.9085142251  
-0.957214366  
-1.002590388  
-1.047954029  
-1.097557872  
-1.155346814  
-1.223755696  
-1.302758168  
-1.389315882  
-1.477307734  
-1.557945991  
-1.620595817  
-1.653866102  
-1.646803117  
-1.590018368  
-1.47660857  
-1.302780553  
-1.068137224  
-0.7756649125  
-0.4314788895  
-0.04443053093  
0.3743497709  
0.8118959245  
1.253825036  
1.684746087  
2.088717978  
2.449821631  
2.752908956  
2.984536636  
3.134044106  
3.194679226  
3.164594638  
3.047561016  
2.853212205  
2.596713039  
2.297811802  
1.979336653  
1.665265172  
1.378586697  
1.139195203  
0.9620467284  
0.8557866702  
0.8219942474  
0.8550981713  
0.9429777859  
1.068152153  
1.209456371  
1.344030375  
1.449457301  
1.505867745  
1.497853086  
1.416034374  
1.258150657  
1.029577512  
0.7431972196  
0.4185913662  
0.08056349379  
-0.2429333701  
-0.5233389343  
-0.7343039961  
-0.8545468563  
-0.8704309387  
-0.7779852165  
-0.5840569571  
-0.3063834551  
0.02754788453  
0.3828305324  
0.7204888781  
1.001516212  
1.191149677  
1.2628529  
1.201474788  
1.0051349  
0.6855479613  
0.2666883767  
-0.2180410019  
-0.7297725573  
-1.228725139  
-1.678715881  
-2.051015675  
-2.327053558  
-2.499642271  
-2.5726631  
-2.559360532  
-2.479610501  
-2.35664708  
-2.213774221  
-2.071531565  
-1.945663144  
-1.846063275  
-1.77669947  
-1.736354538  
-1.719933846  
-1.720023706  
-1.72842346  
-1.737413109  
-1.740634319  
-1.733526243  
-1.713368519  
-1.67902115  
-1.630499629  
-1.568499539  
-1.49400073  
-1.408003075  
-1.311447641  
-1.205293411  
-1.090709839  
-0.9693139091  
-0.8433625437  
-0.7158249192  
-0.5902838251  
-0.4706415831  
-0.3606517628  
-0.2633334764  
-0.1803652607  
-0.1115639447  
-0.05455837387  
-0.004744447573  
0.04442088639  
0.1008000696  
0.1726694329  
0.2676419661  
0.3915500255  
0.547448106  
0.7348707289  
0.9494817781  
1.183194739  
1.424785571  
1.660968225  
1.877842299  
2.062540273  
2.204879457  
2.298768785  
2.343143229  
2.342236356  
2.305070558  
2.244186079  
2.173732981  
2.107192068  
2.055069201  
2.022971248  
2.010397177  
2.010522821  
2.011074214  
1.996210883  
1.949154245  
1.855142602  
1.704237562  
1.493477956  
1.228002089  
0.9209016005  
0.5918086942  
0.2644185098  
-0.03664745257  
-0.2891184123  
-0.4759630325  
-0.587431071  
-0.6219608744  
-0.5858822893  
-0.4920577724  
-0.3577964473  
-0.2024551192  
-0.0451642377  
0.09699456506  
0.2101448466  
0.2841216266  
0.3124398505  
0.291967479  
0.2225458097  
0.1067404662  
-0.05020290189  
-0.2402621046  
-0.4525626954  
-0.6735309814  
-0.8874638875  
-1.077617386  
-1.22775214  
-1.323975537  
-1.356570064  
-1.321477685  
-1.221125661  
-1.064400168  
-0.8657054306  
-0.643247423  
-0.4168018789  
-0.2053408105  
-0.0249066007  
0.1129461589  
0.2019126556  
0.2408636757  
0.2330201776  
0.1846178835  
0.103349764  
-0.003080285479  
-0.1280328237  
-0.266469962  
-0.4149089937  
-0.5708786621  
-0.7320706207  
-0.8954408219  
-1.056519878  
-1.209135402  
-1.345664225  
-1.457788581  
-1.537629037  
-1.579026186  
-1.578690563  
-1.536969895  
-1.458037832  
-1.349440305  
-1.22103782  
-1.083526855  
-0.9467989097  
-0.8184223842  
-0.7025338134  
-0.599337974  
-0.5053110622  
-0.4140838396  
-0.3178522459  
-0.2090747415  
-0.08216873919  
0.06508763004  
0.2306909181  
0.408231162  
0.5874355662  
0.7553507137  
0.8979978551  
1.002241311  
1.057615874  
1.05784857  
1.001880416  
0.8942599457  
0.7448694295  
0.5680334783  
0.3811187598  
0.2028145289  
0.05127481558  
-0.05767570025  
-0.1120773005  
-0.1049867101  
-0.0351362541  
0.09295842871  
0.2694205752  
0.4799385702  
0.707087691  
0.9319257858  
1.135711509  
1.301571392  
1.415968101  
1.469837372  
1.459306659  
1.38595074  
1.256589503  
1.082666466  
0.8792667429  
0.6638710897  
0.4549085859  
0.2702258659  
0.1255520623  
0.03309089619  
0.0003369586086  
0.02924511282  
0.1158490534  
0.250414275  
0.4181457865  
0.6004221578  
0.7764791847  
0.9253798465  
1.028091151  
1.069439865  
1.039738175  
0.9358768067  
0.7617527021  
0.5279633618  
0.250782274  
-0.04948551849  
-0.350576319  
-0.6305604126  
-0.8700692205  
-1.054214128  
-1.173976704  
-1.22689286  
-1.216975829  
-1.153881458  
-1.05144044  
-0.9257633664  
-0.7931853082  
-0.6683431178  
-0.5626633275  
-0.4834714038  
-0.4338273995  
-0.4130744857  
-0.4179550919  
-0.4440395469  
-0.4871796253  
-0.5446572799  
-0.6158030554  
-0.7019213486  
-0.8055291953  
-0.9290321667  
-1.073101042  
-1.235081831  
-1.407797747  
-1.579059785  
-1.732102547  
-1.847000351  
-1.902946359  
-1.881118168  
-1.767684012  
-1.556468525  
-1.250799457  
-0.8641444456  
-0.4193623209  
0.05343215651  
0.5201103447  
0.9464438448  
1.302117755  
1.564253699  
1.719922442  
1.767307506  
1.715372123  
1.582141425  
1.391896572  
1.171752029  
0.9481181526  
0.7435703574  
0.5745176113  
0.4499335182  
0.3712321284  
0.3331822037  
0.3256439683  
0.3357771432  
0.3503712547  
0.357947628  
0.3503621241  
0.323742292  
0.2786990471  
0.2198715263  
0.1549366289  
0.09327803447  
0.04452930106  
0.01718275501  
0.01745207357  
0.0484888461  
0.1100320526  
0.198490313  
0.3074176668  
0.4282998262  
0.5515375873  
0.6675116469  
0.7675935215  
0.8449887837  
0.895334376  
0.9169681321  
0.9108668993  
0.8802621416  
0.8299895749  
0.7656621526  
0.6927832456  
0.6159156118  
0.5380296104  
0.4601288312  
0.3812182893  
0.2986309702  
0.2086776233  
0.1075311012  
-0.007788991474  
-0.1384848098  
-0.2832724412  
-0.43801636  
-0.5958127856  
-0.7475313765  
-0.8827804675  
-0.9911730884  
-1.063723506  
-1.094181124  
-1.080085518  
-1.023369483  
-0.9303906452  
-0.8113510833  
-0.6791561026  
-0.5478456705  
-0.4308259618  
-0.3391203801  
-0.2799278457  
-0.2556733828  
-0.2637184949  
-0.296767979  
-0.3439291941  
-0.3922705843  
-0.4286671894  
-0.4416682451  
-0.4231262933  
-0.3693700866  
-0.2817512321  
-0.1665038944  
-0.03393806212  
0.1029177495  
0.2300268008  
0.3341759278  
0.4046705144  
0.4346630809  
0.4219389871  
0.3690572104  
0.2828545504  
0.1733840224  
0.05247953716  
-0.06784128697  
-0.1769000043  
-0.2665706567  
-0.3320340134  
-0.3719717202  
-0.3882167737  
-0.3849402267  
-0.3675486406  
-0.3414964486  
-0.3112266324  
-0.2794315378  
-0.2467637133  
-0.2120268235  
-0.1728174326  
-0.126463319  
-0.07108908005  
-0.006575387227  
0.06478102157  
0.1380601846  
0.2060390207  
0.2600159396  
0.2910303989  
0.2912777308  
0.2555032151  
0.1821290463  
0.07391702686  
-0.06195341965  
-0.2144276379  
-0.369675688  
-0.5126011382  
-0.6285500926  
-0.7049908519  
-0.7329531099  
-0.7080303061  
-0.6308565593  
-0.5069945074  
-0.3462851979  
-0.1617504217  
0.03180160016  
0.2193004787  
0.3868951794  
0.5232356999  
0.6204397414  
0.6746571895  
0.6862183804  
0.659354595  
0.6015669121  
0.5227160222  
0.4339393261  
0.34650586  
0.2707306191  
0.2150279486  
0.1851872271  
0.183923535  
0.2107105167  
0.2619166207  
0.3312027242  
0.4101617942  
0.489133948  
0.5581448836  
0.6078857868  
0.6306656929  
0.6212413846  
0.5774579759  
0.5006142483  
0.3955117382  
0.2701450118  
0.135039797  
0.002290634898  
-0.1156309238  
-0.2071654416  
-0.2629163836  
-0.2767139913  
-0.2463602971  
-0.1739607815  
-0.06579545239  
0.06826430601  
0.2157106694  
0.3626403103  
0.4951198018  
0.6005387354  
0.6688073425  
0.6932818921  
0.671340587  
0.6045649183  
0.4985267327  
0.3622193379  
0.2072027587  
0.04654239791  
-0.1063483652  
-0.2388698476  
-0.3403026334  
-0.4026961096  
-0.4215230587  
-0.3960365522  
-0.3293121688  
-0.2279636972  
-0.1015480763  
0.0382815612  
0.1788135869  
0.3074025309  
0.4125684459  
0.4849764522  
0.5181810528  
0.5090896384  
0.4580959449  
0.3688862967  
0.247956916  
0.103898341  
-0.05346885313  
-0.2140257468  
-0.3682481669  
-0.5079882699  
-0.6270558511  
-0.7215724224  
-0.7900582404  
-0.8332834828  
-0.8539066347  
-0.8559709509  
-0.8443238617  
-0.8240308054  
-0.7998404194  
-0.77575135  
-0.754693469  
-0.7383512005  
-0.7271101082  
-0.7201240239  
-0.7154940391  
-0.7105386046  
-0.7021684566  
-0.6873260934  
-0.6634932719  
-0.629209018  
-0.5845439535  
-0.5314484599  
-0.4738892478  
-0.4176971106  
-0.3700663268  
-0.338718908  
-0.3307674395  
-0.3514102117  
-0.4026188586  
-0.4820363438  
-0.5822975738  
-0.6909612341  
-0.791187355  
-0.8631917768  
-0.8863754278  
-0.8419547324  
-0.7157511297  
-0.5007852491  
-0.1992759811  
0.1763113519  
0.6034105843  
1.05081964  
1.481416298  
1.855900282  
2.137173618  
2.294852631  
2.309347978  
2.174947755  
1.901429922  
1.513867297  
1.050517939  
0.5589120296  
0.09052979299  
-0.3053406043  
-0.5878024266  
-0.7297841256  
-0.7219335987  
-0.5743592398  
-0.3158672968  
0.009338596536  
0.3471464813  
0.6405777869  
0.8374565187  
0.8976832878  
0.7990898001  
0.5410260777  
0.1451199297  
-0.3469371367  
-0.8783498001  
-1.384257709  
-1.799917461  
-2.068924194  
-2.150345325  
-2.023832783  
-1.692042005  
-1.180106606  
-0.5323153175  
0.1934737624  
0.9328464465  
1.622299398  
2.206157535  
2.642100679  
2.904685599  
2.986582812  
2.897565334  
2.661601474  
2.312612149  
1.88957113  
1.431669848  
0.9741427114  
0.5452201376  
0.1644544245  
-0.1575634416  
-0.418250638  
-0.6211767561  
-0.773723942  
-0.88468897  
-0.9622311841  
-1.012450536  
-1.038766363  
-1.042096353  
-1.021700647  
-0.9764499078  
-0.9062037286  
-0.8129745151  
-0.7016091578  
-0.579818192  
-0.4575052563  
-0.3454999257  
-0.2539048479  
-0.1903632587  
-0.158585809  
-0.1574174268  
-0.1806772107  
-0.2178363427  
-0.2554883261  
-0.2793941723  
-0.276806574  
-0.2386932981  
-0.1615076518  
-0.04818990554  
0.09179024295  
0.2433998365  
0.3879140132  
0.5054530398  
0.5778280635  
0.5912830662  
0.5387404527  
0.4211851503  
0.2479763378  
0.0359845843  
-0.1923412339  
-0.411742912  
-0.5973830549  
-0.7280919983  
-0.789172029  
-0.7743660302  
-0.6867144929  
-0.5381814079  
-0.3481048795  
-0.1407067185  
0.05799294769  
0.2234191934  
0.3354080126  
0.380519473  
0.3534137012  
0.2571764073  
0.1026005114  
-0.09340745928  
-0.3100464369  
-0.5251517296  
-0.7177125467  
-0.8700913399  
-0.9697182659  
-1.01010983  
-0.9911547687  
-0.9186861361  
-0.8034322286  
-0.6594870724  
-0.5024972192  
-0.3477701782  
-0.2085191075  
-0.09445505836  
-0.01088758113  
0.04155897992  
0.06658553117  
0.07126429086  
0.06464268  
0.05611299146  
0.05379626996  
0.06319629807  
0.0863207031  
0.1214127865  
0.1633193153  
0.2044291923  
0.2360138484  
0.2497552938  
0.2391959206  
0.2009014011  
0.1351421327  
0.04601554779  
-0.05899582191  
-0.1699444252  
-0.275661734  
-0.3651319145  
-0.4288034135  
-0.4596643022  
-0.4539439942  
-0.4113963759  
-0.3351373439  
-0.2311022151  
-0.1072190969  
0.02758907044  
0.1644341187  
0.2954077122  
0.4143294505  
0.5172370835  
0.6025599588  
0.6709927058  
0.7250807188  
0.7686020826  
0.8058113435  
0.8406636292  
0.876111546  
0.913580745  
0.9526991248  
0.991319661  
1.025851637  
1.051837621  
1.06470655  
1.060564544  
1.036886059  
0.9929948177  
0.9302282855  
0.851762729  
0.7621384899  
0.666547597  
0.5700513599  
0.4768262617  
0.3896052155  
0.3093833804  
0.2354340277  
0.1656390655  
0.09703880031  
0.0265218396  
-0.04846877957  
-0.129346097  
-0.2159760076  
-0.3065379857  
-0.3976530011  
-0.4847430409  
-0.5625700648  
-0.6258534802  
-0.6698907633  
-0.6910871183  
-0.6873429116  
-0.6582556814  
-0.6051378338  
-0.5308609679  
-0.4395680204  
-0.3362853307  
-0.2264999715  
-0.1157224239  
-0.00909363865  
0.08895481049  
0.1749343666  
0.2464391431  
0.3021537795  
0.3417377667  
0.3655947141  
0.374553615  
0.3695103611  
0.3510805065  
0.31933624  
0.2736804992  
0.2129126804  
0.1354844965  
0.03993381348  
-0.07457801142  
-0.2077045089  
-0.3574558634  
-0.5199492153  
-0.6894386532  
-0.8586910116  
-1.019662454  
-1.16441918  
-1.28614867  
-1.380104047  
-1.444293409  
-1.479769229  
-1.490431797  
-1.482321034  
-1.462494435  
-1.43765202  
-1.41273505  
-1.389755659  
-1.367083193  
-1.339366237  
-1.298135892  
-1.233051525  
-1.133606612  
-0.991036059  
-0.8001075493  
-0.5605020091  
-0.2775235658  
0.03798089483  
0.3705193705  
0.7015296066  
1.011412307  
1.281715536  
1.497156401  
1.647203615  
1.727006877  
1.737597946  
1.685361786  
1.580910692  
1.437553479  
1.26960452  
1.090756906  
0.9127372746  
0.7443788831  
0.5911735809  
0.4553165026  
0.3361547643  
0.2309479983  
0.1358018584  
0.04664781078  
-0.03984550226  
-0.1255241492  
-0.2102270794  
-0.2915474946  
-0.3648909014  
-0.4238555249  
-0.460915912  
-0.4683733313  
-0.4395107713  
-0.369829235  
-0.2582229995  
-0.1079140011  
0.07305223862  
0.2718944516  
0.4719034634  
0.6539582653  
0.7986752552  
0.8889537052  
0.9125996744  
0.8646175291  
0.7487678762  
0.5780251187  
0.3737280343  
0.1633835921  
-0.02267782578  
-0.1553883341  
-0.2111842917  
-0.1757472511  
-0.04659697374  
0.1659441016  
0.4396756177  
0.7432664912  
1.040454913  
1.295066375  
1.476052792  
1.561729164  
1.542517455  
1.421747599  
1.214401278  
0.9440452078  
0.6385168851  
0.3251416881  
0.02633522824  
-0.2436247764  
-0.480101115  
-0.687632783  
-0.8776344245  
-1.064728269  
-1.262414158  
-1.478939346  
-1.714138992  
-1.957890526  
-2.190483317  
-2.384884383  
-2.510539286  
-2.538073473  
-2.444123906  
-2.215513552  
-1.852103038  
-1.367891686  
-0.7902123603  
-0.1571753935  
0.4862465581  
1.092911589  
1.618344064  
2.025084226  
2.286071756  
2.386714779  
2.325546036  
2.113527557  
1.772246285  
1.331335566  
0.8255058971  
0.2915475565  
-0.2344112781  
-0.7191937338  
-1.134345049  
-1.457390793  
-1.672665579  
-1.771817336  
-1.754069772  
-1.626266178  
-1.402670888  
-1.104426319  
-0.7585374418  
-0.3962763644  
-0.05095008015  
0.2449070472  
0.4627254192  
0.5811494499  
0.5889105308  
0.4868591648  
0.2887244074  
0.0203155143  
-0.2829202236  
-0.5798077174  
-0.8283972182  
-0.9913134428  
-1.040751673  
-0.96235767  
-0.7573901875  
-0.4427681772  
-0.04896835117  
0.3839592084  
0.8116690593  
1.191322838  
1.487057769  
1.67433857  
1.742607506  
1.695899541  
1.551452647  
1.336587738  
1.084421367  
0.8290696383  
0.6010615867  
0.4235875734  
0.3100329277  
0.263041478  
0.2751191905  
0.3305509838  
0.4082645959  
0.4851631468  
0.5394293625  
0.5533612151  
0.515397485  
0.4211412286  
0.2733372546  
0.08092007777  
-0.1426563188  
-0.3814977098  
