0.06513453664  
0.6488730435  
1.188210184  
1.642958453  
1.981969743  
2.1863656  
2.251227388  
2.185579517  
2.010700232  
1.757032779  
1.460153736  
1.156339391  
0.8783158439  
0.6517181447  
0.4926579605  
0.4066279156  
0.3887970997  
0.4255485015  
0.496978244  
0.5799735033  
0.6514303768  
0.6912176215  
0.6845237267  
0.6233659862  
0.5071436198  
0.3422531117  
0.1408988132  
-0.0806816987  
-0.3043058337  
-0.5119666462  
-0.687737069  
-0.8192466141  
-0.8986149552  
-0.9227933185  
-0.8933462039  
-0.8157705894  
-0.6984901371  
-0.5516758621  
-0.3860657385  
-0.2118999128  
-0.03808417159  
0.1283567969  
0.2825187958  
0.4215755296  
0.544493981  
0.6515892125  
0.7439877992  
0.8230793083  
0.8900214979  
0.9453483634  
0.988708015  
1.01875027  
1.033163184  
1.028842617  
1.002188229  
0.9494845555  
0.8673626695  
0.75328349  
0.6060319742  
0.4261591589  
0.2163344417  
-0.0184427791  
-0.2708236157  
-0.5313157331  
-0.7887377136  
-1.030906945  
-1.245527015  
-1.421193274  
-1.548414245  
-1.620533635  
-1.634429047  
-1.590886709  
-1.494587083  
-1.353688171  
-1.179033528  
-0.9830900172  
-0.7787307665  
-0.578029094  
-0.3912127952  
-0.225904052  
-0.08673961982  
0.02461554402  
0.1090729396  
0.1694520368  
0.2096472022  
0.2337718814  
0.2454154801  
0.2471132269  
0.2400875752  
0.2242692421  
0.1985646416  
0.1612921062  
0.1106964183  
0.04543630301  
-0.03502163096  
-0.130158441  
-0.2383309335  
-0.3568306681  
-0.4820524644  
-0.6096959196  
-0.7349670213  
-0.8527354624  
-0.9576519324  
-1.044246227  
-1.107046969  
-1.140770868  
-1.140624977  
-1.102719961  
-1.024578128  
-0.9056827009  
-0.7479619183  
-0.5561192708  
-0.337707916  
-0.1028766178  
0.1362433476  
0.3664721449  
0.5747568139  
0.7494487125  
0.8815089239  
0.9654799098  
1.000058164  
0.9881791503  
0.9365736782  
0.8548577856  
0.7542580532  
0.646169038  
0.540738904  
0.4456829343  
0.3655126253  
0.301262698  
0.2507660911  
0.2094041615  
0.1712233572  
0.1302150523  
0.08157138033  
0.02269145126  
-0.04619145344  
-0.1218858925  
-0.1986202105  
-0.2688576628  
-0.3244126156  
-0.3576751603  
-0.3627349582  
-0.3362218851  
-0.2777165066  
-0.1896660903  
-0.07684432665  
0.05456055746  
0.1980276715  
0.3477512206  
0.4994420205  
0.6507076822  
0.8009308581  
0.9506446429  
1.100533637  
1.250251006  
1.397322366  
1.536376607  
1.658935095  
1.753858798  
1.808462246  
1.81014654  
1.748317124  
1.616249429  
1.412589653  
1.142183399  
0.8160699181  
0.4505795144  
0.06566317192  
-0.3173029794  
-0.6778939638  
-0.9988098202  
-1.267513096  
-1.477081263  
-1.626185703  
-1.718250918  
-1.760008332  
-1.759745305  
-1.72559754  
-1.664204916  
-1.579947951  
-1.474877747  
-1.349276821  
-1.202701288  
-1.035232988  
-0.8486667574  
-0.6473596848  
-0.4385595066  
-0.2321407437  
-0.03976612068  
0.1263750664  
0.2550389501  
0.3373667255  
0.3680571055  
0.3460898563  
0.2748996097  
0.1619912022  
0.01806975413  
-0.1441543623  
-0.3113176439  
-0.4707054397  
-0.6113408786  
-0.7247493567  
-0.8053370636  
-0.850401084  
-0.8598327022  
-0.8356191024  
-0.7812688644  
-0.7012561326  
-0.6005902065  
-0.484535836  
-0.3584945023  
-0.2280172695  
-0.09886754421  
0.02293380027  
0.1311547313  
0.219547095  
0.2821984539  
0.3140381317  
0.3114245306  
0.2727489139  
0.1989481855  
0.09383842514  
-0.03581283098  
-0.1805137093  
-0.328598326  
-0.4670564733  
-0.5825831392  
-0.662748255  
-0.6971757143  
-0.6786015145  
-0.603710578  
-0.4736514889  
-0.2941647124  
-0.07528443288  
0.169372973  
0.4237026053  
0.6704869937  
0.8929559227  
1.076358571  
1.209400373  
1.28537841  
1.302858691  
1.265827581  
1.183242912  
1.068044864  
0.935709583  
0.8025095395  
0.6837011241  
0.5918197141  
0.5353216201  
0.517709709  
0.5372461539  
0.587282868  
0.6571409206  
0.7334323966  
0.8016547215  
0.8478632109  
0.8602321938  
0.8303388938  
0.7540396046  
0.6318659132  
0.46892432  
0.274327265  
0.06024236952  
-0.159332587  
-0.3699339165  
-0.5580097174  
-0.7121768394  
-0.8242482636  
-0.8899589123  
-0.9093222221  
-0.8865971608  
-0.8298662009  
-0.7502546143  
-0.6608510361  
-0.5754064203  
-0.5069187029  
-0.4662317888  
-0.4607868856  
-0.4936573613  
-0.5629966463  
-0.6620050722  
-0.7794403517  
-0.9006889248  
-1.009298568  
-1.08884036  
-1.124887574  
-1.106891512  
-1.029687454  
-0.894432246  
-0.7088056095  
-0.4864084324  
-0.2453889854  
-0.006440930629  
0.2095902025  
0.3841929188  
0.5034395834  
0.5596866449  
0.5525025613  
0.4886571578  
0.3811826083  
0.2476132249  
0.1076376522  
-0.01951162087  
-0.1175764544  
-0.1753422919  
-0.1879772008  
-0.1574556782  
-0.0920250098  
-0.00479941515  
0.08829238453  
0.1708960291  
0.2286098109  
0.2509988998  
0.2329812611  
0.1754008225  
0.08473868028  
-0.02795409623  
-0.1487179977  
-0.2626777124  
-0.356073709  
-0.4180330422  
-0.4418622615  
-0.4256971008  
-0.3724577658  
-0.2891552544  
-0.1856777979  
-0.07325533846  
0.0371651848  
0.1364019164  
0.2181856592  
0.2798206028  
0.3222944484  
0.3498516989  
0.3691145118  
0.3878860795  
0.4138308251  
0.4531993355  
0.5097841541  
0.5842356505  
0.6738017744  
0.7725292395  
0.8718706559  
0.9616146103  
1.031006242  
1.069944176  
1.070097131  
1.025841582  
0.9349425029  
0.7989126207  
0.6230358141  
0.4160648009  
0.1896077553  
-0.04273818296  
-0.2664685542  
-0.4673737093  
-0.6328010397  
-0.7528506157  
-0.8214136935  
-0.8369282344  
-0.8027460506  
-0.7270382684  
-0.6221892403  
-0.5036922735  
-0.3886327547  
-0.2938743942  
-0.2341558945  
-0.2202979884  
-0.2577612754  
-0.3457369778  
-0.476936467  
-0.6381342205  
-0.8114481299  
-0.9762447667  
-1.111451863  
-1.198024585  
-1.221248789  
-1.172602369  
-1.050905579  
-0.8626142021  
-0.6211874712  
-0.3456094217  
-0.05824124373  
0.2177123879  
0.4607832401  
0.6535333177  
0.7842684087  
0.8479637689  
0.8463133426  
0.7869445003  
0.6819508983  
0.5460056114  
0.3943237173  
0.2407829305  
0.09644607526  
-0.03135112849  
-0.1392813038  
-0.2277023161  
-0.2998555611  
-0.3607626789  
-0.4160219123  
-0.4706907472  
-0.5284172554  
-0.5909044197  
-0.6577461944  
-0.7266021478  
-0.793640667  
-0.8541434736  
-0.9031665045  
-0.9361548253  
-0.9494273141  
-0.9404926717  
-0.9081767976  
-0.8525701074  
-0.7748406143  
-0.6769591559  
-0.561399284  
-0.4308693536  
-0.2881265064  
-0.1359028473  
0.0230396388  
0.1857438205  
0.3488160954  
0.5081722783  
0.658844511  
0.7949139963  
0.9096589517  
0.9959343328  
1.046804672  
1.056383469  
1.020780189  
0.9390380117  
0.8138909455  
0.6521874592  
0.4648431834  
0.2662459012  
0.07310764298  
-0.09714452999  
-0.2282630029  
-0.3071151339  
-0.3253724164  
-0.2806794086  
-0.1770870081  
-0.02462567827  
0.1619782799  
0.3652882609  
0.5675773078  
0.7533192608  
0.9113520825  
1.036341426  
1.129281326  
1.196890282  
1.249981317  
1.301025072  
1.361312046  
1.438182947  
1.532839116  
1.639147788  
1.743728473  
1.827398986  
1.867822762  
1.842999846  
1.735076732  
1.533855028  
1.23941185  
0.8633415613  
0.4283350592  
-0.03393020069  
-0.4863615161  
-0.8909912901  
-1.213850244  
-1.429456307  
-1.524245986  
-1.498450978  
-1.366117103  
-1.153294958  
-0.8946544293  
-0.629028242  
-0.3945158371  
-0.2238379071  
-0.1405524679  
-0.1565910793  
-0.2713887804  
-0.4726121144  
-0.7383077444  
-1.040068432  
-1.346764416  
-1.628301834  
-1.858942381  
-2.019828083  
-2.100471998  
-2.099158629  
-2.022330313  
-1.883146842  
-1.699491536  
-1.491705082  
-1.28033527  
-1.084125142  
-0.9184062159  
-0.7939930601  
-0.7166079805  
-0.6868181366  
-0.7004122466  
-0.7491454265  
-0.8217592909  
-0.9051636839  
-0.9857106125  
-1.050440762  
-1.088229604  
-1.090743057  
-1.053131702  
-0.974402406  
-0.8574417762  
-0.7086588428  
-0.5373018347  
-0.3544796142  
-0.1719798514  
-0.001019556745  
0.1489590323  
0.2712960231  
0.3627986348  
0.424002356  
0.4589685203  
0.4746084823  
0.4796255845  
0.483181646  
0.4934807187  
0.5164642513  
0.5548168874  
0.6074532346  
0.6695885903  
0.7334360907  
0.789440808  
0.827925882  
0.8408889823  
0.823689137  
0.7763389868  
0.7041375854  
0.6174932506  
0.5308766695  
0.4609854496  
0.4243310577  
0.4345907169  
0.5001060045  
0.6219524648  
0.7929317169  
0.9977311947  
1.214320446  
1.416483128  
1.577157688  
1.672158418  
1.683733845  
1.603410798  
1.433689212  
1.188275123  
0.8907693245  
0.5719563337  
0.2660367857  
0.006320604582  
-0.1790206973  
-0.2705654058  
-0.2600970712  
-0.1515849103  
0.03944913705  
0.2880663775  
0.5632502599  
0.8319627804  
1.063367412  
1.232639038  
1.323836352  
1.331484519  
1.260674144  
1.125699139  
0.9474725462  
0.7501202813  
0.5572700321  
0.3885811541  
0.2570269199  
0.167306561  
0.1156023107  
0.09067061375  
0.07607540635  
0.05318627694  
0.004452334005  
-0.08353842751  
-0.2177013095  
-0.3971204013  
-0.6129363712  
-0.8494235186  
-1.086078635  
-1.300385117  
-1.470830715  
-1.579751732  
-1.61561682  
-1.574466197  
-1.460361787  
-1.284837105  
-1.065487745  
-0.8239105138  
-0.5832980373  
-0.365989704  
-0.1912641464  
-0.07360222808  
-0.02158370342  
-0.03747909494  
-0.1175227577  
-0.2527806432  
-0.4304486863  
-0.6354090584  
-0.8518387892  
-1.064676295  
-1.260810549  
-1.429873119  
-1.564607387  
-1.660819882  
-1.717000565  
-1.733722428  
-1.712953806  
-1.657421573  
-1.570132091  
-1.454119897  
-1.312434824  
-1.148337269  
-0.9656188035  
-0.7689337796  
-0.5640376831  
-0.3578348608  
-0.1581769435  
0.0265809192  
0.18823029  
0.3194596648  
0.4145927557  
0.470186382  
0.485393539  
0.4620233781  
0.4042991623  
0.3183567068  
0.211573867  
0.09184988451  
-0.0330477618  
-0.1559716236  
-0.2706623608  
-0.3717928516  
-0.454832975  
-0.515828991  
-0.5512106437  
-0.5577114026  
-0.5325052735  
-0.473546966  
-0.3800946558  
-0.2533191764  
-0.09684086651  
0.08292673483  
0.2767843697  
0.473164834  
0.6589943661  
0.8209066781  
0.9466844144  
1.026722204  
1.055295948  
1.031430395  
0.9592335481  
0.8475978413  
0.7093124219  
0.5596706922  
0.4147782498  
0.2897608609  
0.1971235482  
0.1454656195  
0.1387111731  
0.1759267588  
0.2517297549  
0.3571996744  
0.4811287102  
0.6114386795  
0.7365449069  
0.8465083053  
0.9338319487  
0.9938562393  
1.024751183  
1.027182761  
1.003771643  
0.9584784283  
0.8960253972  
0.8214589576  
0.7398706744  
0.6562698406  
0.5755357425  
0.5023625511  
0.4411297014  
0.3956161844  
0.3685848027  
0.3612571642  
0.3728068668  
0.3999802226  
0.4369995708  
0.4758478952  
0.5069994923  
0.5205624129  
0.50773244  
0.4623708305  
0.3824530374  
0.2711290415  
0.1371637516  
-0.005439945891  
-0.1386690779  
-0.2425430186  
-0.2977498957  
-0.2885523672  
-0.2055683981  
-0.04798493  
0.175187175  
0.4450955635  
0.7343970019  
1.009906245  
1.236268222  
1.380220531  
1.414882777  
1.323479858  
1.101949135  
0.7600282457  
0.3206248429  
-0.1825122541  
-0.7084999063  
-1.213944288  
-1.657834081  
-2.006053077  
-2.23491371  
-2.333280374  
-2.303060287  
-2.158098325  
-1.921721853  
-1.623373896  
-1.29483972  
-0.9666120917  
-0.6648297468  
-0.4091173261  
-0.2114825722  
-0.07623724429  
-0.0008215252444  
0.02274696451  
0.006058440879  
-0.03758380471  
-0.09491779551  
-0.1541651133  
-0.2060915401  
-0.244637951  
-0.267152496  
-0.2742588872  
-0.2694265369  
-0.2582851791  
-0.24777004  
-0.2451505613  
-0.2570293491  
-0.2883917786  
-0.3418106358  
-0.4168947546  
-0.5100607228  
-0.6146879594  
-0.7216661712  
-0.8202963613  
-0.8994635077  
-0.9489447411  
-0.9607018795  
-0.9299945065  
-0.8561601017  
-0.7429581583  
-0.5984176789  
-0.4341858959  
-0.2644432839  
-0.1045019951  
0.03076653672  
0.1284960423  
0.1792114409  
0.1778775493  
0.1244947852  
0.02416599496  
-0.113382842  
-0.274793551  
-0.4444742463  
-0.6062755165  
-0.7452517942  
-0.8493275225  
-0.9106463102  
-0.9264633591  
-0.8994207897  
-0.837183234  
-0.751419736  
-0.6562716358  
-0.5664653444  
-0.4953303847  
-0.4529734576  
-0.4448931118  
-0.4712245018  
-0.526752901  
-0.6016964521  
-0.683170268  
-0.7571106178  
-0.8103663956  
-0.8326570263  
-0.8180825836  
-0.7659521223  
-0.680812768  
-0.571658104  
-0.4504494932  
-0.3301646261  
-0.2226784061  
-0.1367883702  
-0.07668601335  
-0.0411062134  
-0.02328120598  
-0.01172337317  
0.008265960353  
0.05254897184  
0.1358414259  
0.2694334342  
0.4592512578  
0.7045100619  
0.9971715003  
1.322279615  
1.659193501  
1.983592695  
2.270030151  
2.494754144  
2.638453941  
2.688583787  
2.64097266  
2.500488942  
2.280674183  
2.002366209  
1.691479602  
1.376222701  
1.084087095  
0.8389906508  
0.6589069261  
0.5542483066  
0.5271573494  
0.571754656  
0.6752398733  
0.8196790769  
0.9842204967  
1.147448076  
1.28961852  
1.394535511  
1.450901035  
1.453046216  
1.401030488  
1.300152861  
1.159980166  
0.9930306632  
0.8132624366  
0.6345440986  
0.4692426679  
0.3270742403  
0.2143216134  
0.1334556187  
0.08321875799  
0.05910009534  
0.05416528489  
0.06011011869  
0.06842843847  
0.07153908421  
0.06375032048  
0.04194522698  
0.005895803991  
-0.04181890551  
-0.0963024052  
-0.1511701061  
-0.1996210086  
-0.2356036445  
-0.2549243824  
-0.2561164204  
-0.2409400442  
-0.2144001278  
-0.1842631573  
-0.1601017463  
-0.1519869495  
-0.1690146212  
-0.2178848553  
-0.3017507817  
-0.4195572354  
-0.5659724467  
-0.731983061  
-0.9060705237  
-1.075809563  
-1.229644307  
-1.358565564  
-1.45738534  
-1.525423851  
-1.566443727  
-1.58785742  
-1.599323283  
-1.610971334  
-1.631561635  
-1.666902801  
-1.718813243  
-1.784805709  
-1.858555812  
-1.931073192  
-1.992358354  
-2.033248969  
-2.047127321  
-2.031175181  
-1.986959512  
-1.920248006  
-1.840081103  
-1.757280512  
-1.682642152  
-1.625136264  
-1.590401815  
-1.579800964  
-1.590161834  
-1.614237879  
-1.641801701  
-1.661174876  
-1.660945596  
-1.631619065  
-1.566942904  
-1.464745584  
-1.327175697  
-1.160339418  
-0.9734048074  
-0.7773190086  
-0.5833145271  
-0.4014256204  
-0.2391954587  
-0.1007554745  
0.01360712048  
0.1073381723  
0.1869743286  
0.2610602561  
0.3387815961  
0.4284993948  
0.5364213461  
0.6656094392  
0.815501109  
0.9820370766  
1.158412388  
1.336340865  
1.5076635  
1.666026901  
1.808333672  
1.935684188  
2.053574179  
2.171233592  
2.300106831  
2.451650768  
2.634745589  
2.853118192  
3.103229164  
3.373041483  
3.641998139  
3.882361879  
4.061880369  
4.147520315  
4.10980388  
3.927181268  
3.589781603  
3.101964304  
2.48320309  
1.767094531  
0.9985118109  
0.2292183373  
-0.4874972256  
-1.102493616  
-1.57597651  
-1.881562218  
-2.008696756  
-1.963163175  
-1.765708791  
-1.449080683  
-1.05396375  
-0.6244307963  
-0.2035145081  
0.1705667289  
0.4671779586  
0.6648519636  
0.7517314405  
0.7250342507  
0.5898290496  
0.3574212996  
0.04361016367  
-0.3329609149  
-0.7522786741  
-1.194200389  
-1.639493646  
-2.070712123  
