1771.638307  
1901.801899  
2166.814006  
2691.718784  
4497.688947  
12995.54236  
33003.60035  
17347.69887  
27102.7006  
29846.09506  
1357.047784  
48972.53792  
24326.1442  
16275.11345  
74039.46386  
16782.69135  
24952.1317  
559.5966372  
269.0925316  
12505.63319  
17931.07494  
8005.240783  
15323.91671  
15363.51534  
8187.58268  
13517.33845  
52.22167337  
4466.292549  
3637.495523  
565.5294092  
7479.875293  
1959.116393  
6751.747398  
3550.832753  
3811.721653  
830.8658313  
1137.346804  
3154.601205  
452.802398  
4625.81447  
347.2591592  
1188.683624  
127.9574091  
219.3670937  
850.1467004  
108.939799  
568.1459945  
3466.98261  
10.58683286  
186.6442157  
795.1198455  
560.0009612  
706.0703305  
258.6129384  
731.759117  
472.4498732  
104.5758162  
100.4192224  
44.74253907  
243.9019728  
961.3485881  
72.81639161  
198.7886431  
493.6993849  
115.7455893  
224.2496487  
20.82043116  
15.67940257  
25.34774085  
19.41819603  
1.125708309  
28.27639477  
0.0273661901  
8.900849675  
6.382855067  
5.867965632  
5.558845776  
2.434445847  
5.700286978  
2.786464047  
3.45383683  
2.880906269  
2.976230335  
2.975853516  
3.206428932  
2.792759008  
2.476976638  
2.47581629  
2.328261018  
2.204239311  
2.039808189  
1.995669813  
1.909325323  
1.823342885  
1.718544302  
1.656922279  
1.597212484  
1.547238482  
1.47762255  
1.435042956  
1.360660672  
1.302297794  
1.253675728  
1.209179342  
1.168271755  
1.124723367  
1.081740496  
1.041458599  
1.005961808  
0.9722182352  
0.9384607217  
0.9069186373  
0.8746226743  
0.8462779858  
0.8183570998  
0.7916494619  
0.7663906923  
0.7416448802  
0.7180764266  
0.6959570848  
0.6750405473  
0.6547410504  
0.6351163979  
0.6164159298  
0.5982313363  
0.5810113761  
0.5643327122  
0.5481510642  
0.5327158915  
0.5179973667  
0.5037112037  
0.4900099944  
0.4767501592  
0.4640684579  
0.4518699023  
0.4400677127  
0.4286999865  
0.4176599448  
0.4070986371  
0.3968789939  
0.3869991757  
0.3774846817  
0.3682860862  
0.3594183213  
0.350803567  
0.3425114235  
0.3344853223  
0.3267186371  
0.3192090915  
0.3119304918  
0.3048856616  
0.2980588307  
0.2914618499  
0.2850554018  
0.2788508409  
0.2728461436  
0.2670096744  
0.2613636629  
0.2558773068  
0.2505636867  
0.245401056  
0.240386407  
0.2355175955  
0.2307949433  
0.2262039997  
0.221742744  
0.2174119889  
0.2131980473  
0.2091058706  
0.2051270542  
0.2012527925  
0.1974865762  
0.1938218435  
0.1902538049  
0.1867854404  
0.1834043894  
0.1801149416  
0.1769124222  
0.1737939586  
0.1707557216  
0.1677916273  
0.1649021049  
0.1620903676  
0.1593477529  
0.1566715203  
0.1540639135  
0.151520658  
0.1490392986  
0.1466178064  
0.1442616019  
0.1419530896  
0.1397042482  
0.1375065172  
0.1353577877  
0.1332639262  
0.1312209452  
0.1292208436  
0.1272675676  
0.1253594424  
0.1234974619  
0.1216718984  
0.1198903828  
0.1181516259  
0.1164489342  
0.1147786334  
0.1131543979  
0.1115602341  
0.110002911  
0.1084753071  
0.1069857674  
0.1055251516  
0.104097854  
0.1026952432  
0.1013272819  
0.09998615854  
0.09867002861  
0.09738441597  
0.09612679305  
0.09489010012  
0.09368375399  
0.09249924646  
0.09133612335  
0.09020277013  
0.0890862487  
0.08799401591  
0.08692017133  
0.08586821804  
0.08484306498  
0.08383214574  
0.08284019984  
0.08186811656  
0.08091694491  
0.07998085045  
0.07906128854  
0.07816438588  
0.07728142421  
0.07641336034  
0.07556274338  
0.0747283849  
0.07391148782  
0.07310328925  
0.07231517951  
0.07153899009  
0.07077816864  
0.07002858008  
0.06929310245  
0.06857307774  
0.06786640187  
0.06717026454  
0.06648535509  
0.06581178578  
0.06514867241  
0.06450169046  
0.06386207157  
0.06323466205  
0.06261852063  
0.06201179003  
0.06141921378  
0.06083155212  
0.06025543046  
0.05968981365  
0.05913267788  
0.05858488165  
0.05804716369  
0.05751560523  
0.05699601889  
0.05648288403  
0.05597978194  
0.05548331271  
0.05499487698  
0.05451473933  
0.05404147999  
0.05357553427  
0.05312135877  
0.05266851796  
0.05222557602  
0.05178882594  
0.05135929173  
0.05093724617  
0.05051900151  
0.05011058935  
0.04970515635  
0.04930709039  
0.04891751612  
0.04853181022  
0.04815158303  
0.04777713478  
0.04741117939  
0.04704634978  
0.04668718142  
0.04633672535  
0.045989367  
0.04564807097  
0.04531274294  
0.04498006334  
0.04465349659  
0.04433288329  
0.04401481132  
0.04370360792  
0.04339383755  
0.04308964313  
0.04278973284  
0.04249564549  
0.04220420697  
0.04191900878  
0.04163668972  
0.04135763617  
0.04108468775  
0.04081228453  
0.0405457395  
0.04028166002  
0.04002452483  
0.03976741269  
0.03951537699  
0.03926580996  
0.03902191147  
0.03878133588  
0.03854082538  
0.03830815973  
0.03807508483  
0.03784615015  
0.03762035218  
0.03739688971  
0.0371788948  
0.03696357566  
0.03674854813  
0.036538164  
0.03633184318  
0.03612589584  
0.03592276574  
0.03572460636  
0.03552861036  
0.03533362379  
0.03514123391  
0.03495239338  
0.03476535147  
0.03458116883  
0.03440072315  
0.03422275805  
0.03404606283  
0.03387182362  
0.03369808144  
0.03353018846  
0.03336265835  
0.03319605919  
0.03303346037  
0.03287330008  
0.03271404308  
0.03255813229  
0.03240381754  
0.03225166097  
0.03209998985  
0.03195218701  
0.03180401259  
0.03166061364  
0.0315174053  
0.03137740458  
0.03123975434  
0.03110205673  
0.03096692433  
0.03083377315  
0.0307016226  
0.03057149831  
0.03044285906  
0.03031660339  
0.030191216  
0.03006928356  
0.02994663586  
0.0298268187  
0.02970906034  
0.02959212448  
0.0294763872  
0.02936158439  
0.02925073797  
0.02913974555  
0.0290320509  
0.02892423002  
0.0288160497  
0.02871068075  
0.02860736762  
0.02850564374  
0.02840521394  
0.02830654721  
0.02820759865  
0.02811130856  
0.02801595792  
0.02792327332  
0.02782751384  
0.02773627998  
0.02764760816  
0.02755874568  
0.02747064922  
0.02738519739  
0.02730152843  
0.0272150605  
0.0271331414  
0.02705065685  
0.02697131612  
0.02689013832  
0.02681200859  
0.02673710538  
0.02666110513  
0.02658490172  
0.02651144069  
0.02643784097  
0.02636707204  
0.02629631343  
0.02622697944  
0.02615941288  
0.02609400688  
0.02602536089  
0.02596137225  
0.02589579208  
0.02583207447  
0.02576983719  
0.02570841512  
0.02564938524  
0.02558787996  
0.02553052107  
0.02547289537  
0.02541496855  
0.02535995896  
0.02530510305  
0.02525347663  
0.02519799213  
0.02514752973  
0.02509614143  
0.02504475864  
0.02499693834  
0.0249486355  
0.02490134213  
0.02485385206  
0.02480816642  
0.0247637642  
0.02471932803  
0.02467704565  
0.02463446309  
0.02459195101  
0.02455220633  
0.02451125361  
0.02447248917  
0.02443492815  
0.02439655236  
0.02436063536  
0.02432394006  
0.02428843712  
0.02425509953  
0.02422097471  
0.02418910011  
0.02415820409  
0.02412620297  
0.02409583112  
0.02406622862  
0.02403625634  
0.02400804808  
0.02398081717  
0.02395450916  
0.02392849017  
0.02390410316  
0.02387889826  
0.02385520467  
0.02383144867  
0.02380951836  
0.02378935335  
0.02376909367  
0.02374927469  
0.02372788412  
0.02370946294  
0.02369233449  
0.0236755641  
0.02365917988  
0.0236434197  
0.02362830402  
0.02361389042  
0.02359930559  
0.02358797579  
0.02357656631  
0.02356376565  
0.02355197188  
0.02354375599  
0.02353365815  
0.02352572249  
0.02351677708  
0.02350984814  
0.02350211334  
0.02349834006  
0.02349257748  
0.02348706052  
0.02348544804  
0.02348138367  
0.02348039606  
0.02347736925  
0.02347436526  
0.02347451712  
