-0.1542564378  
-0.1915152867  
-0.2289621776  
-0.2627144901  
-0.2870151361  
-0.2942537385  
-0.2756252222  
-0.2223651703  
-0.127377551  
0.01305388986  
0.1978010597  
0.4200114825  
0.6670454619  
0.9213476914  
1.162202574  
1.368158052  
1.519788252  
1.602379024  
1.608116283  
1.53742876  
1.399245213  
1.210107384  
0.9922405737  
0.7708576306  
0.5710704583  
0.414851084  
0.3184560229  
0.2906479119  
0.3319259336  
0.4347998397  
0.5850154456  
0.7634984204  
0.948703942  
1.119038176  
1.255051819  
1.341166479  
1.366794855  
1.326828661  
1.221541898  
1.056032617  
0.8393661204  
0.5835581273  
0.3025405806  
0.01118713353  
-0.2755624475  
-0.543466189  
-0.7796557008  
-0.9732354747  
-1.115816865  
-1.201956608  
-1.229469088  
-1.199551461  
-1.116680829  
-0.9882489218  
-0.8239513816  
-0.6349744198  
-0.433069631  
-0.2296381943  
-0.03492319505  
0.1425790076  
0.2964372986  
0.4223328001  
0.5178709448  
0.5822569461  
0.6159353343  
0.6202864285  
0.5974719491  
0.5504158263  
0.4829203837  
0.3998140203  
0.3070280904  
0.2114997168  
0.1208288959  
0.04266464362  
-0.01611337884  
-0.05030665234  
-0.05723153914  
-0.03730506006  
0.005775024738  
0.06532759082  
0.1324744406  
0.1973049441  
0.2502495504  
0.2834220619  
0.2917137063  
0.2734250272  
0.2303403535  
0.1672167409  
0.09080592702  
0.00857673803  
-0.07259844299  
-0.1475525796  
-0.2135069922  
-0.2702140993  
-0.31952551  
-0.3644981706  
-0.4082261902  
-0.452657882  
-0.4976694386  
-0.5406143603  
-0.5764920824  
-0.5987436962  
-0.600571206  
-0.5765344377  
-0.5241369488  
-0.4450618735  
-0.345785304  
-0.237354337  
-0.1343039106  
-0.05279020592  
-0.008203028283  
-0.01261587015  
-0.07248673391  
-0.1870269349  
-0.3475479882  
-0.5379798061  
-0.7365704506  
-0.9185738728  
-1.059596886  
-1.139115312  
-1.143651308  
-1.069122938  
-0.9219728532  
-0.7188626504  
-0.4849201675  
-0.2507436007  
-0.04854319186  
0.09206898038  
0.1480601816  
0.1062000716  
-0.03492821013  
-0.2643905428  
-0.5599287888  
-0.8904125044  
-1.219411374  
-1.50942655  
-1.726257761  
-1.842965256  
-1.842937811  
-1.72172545  
-1.487410271  
-1.159521419  
-0.7666237442  
-0.3429297139  
0.07565601669  
0.4555676777  
0.7691842006  
0.9975943013  
1.132210323  
1.175075413  
1.137881491  
1.039865074  
0.9049039719  
0.7582212916  
0.6231209387  
0.5181847526  
0.4552571843  
0.4384323612  
0.4641150584  
0.5220780002  
0.5973070768  
0.6723522378  
0.7298210189  
0.754705263  
0.7362351081  
0.6690808077  
0.5537948625  
0.3965286954  
0.2081189598  
0.002729106978  
-0.2037397683  
-0.3952651302  
-0.5571565604  
-0.6772202259  
-0.7465655752  
-0.7600298681  
-0.7162645428  
-0.6175378476  
-0.4693290369  
-0.2797827454  
-0.05908107058  
0.1812242632  
0.4288948357  
0.6716780458  
0.8979572612  
1.097343724  
1.261185666  
1.382958515  
1.458502989  
1.486104621  
1.466409855  
1.402209569  
1.298140448  
1.160358154  
0.9962369806  
0.8141505579  
0.6233242833  
0.4337507852  
0.2560994539  
0.1015413414  
-0.01860109805  
-0.09344519843  
-0.1133995015  
-0.07124493112  
0.03666842855  
0.2092769393  
0.4399135056  
0.7158847766  
1.018695275  
1.325016717  
1.608410508  
1.841668211  
1.999570345  
2.06171947  
2.015085775  
1.855925527  
1.590739645  
1.236098519  
0.8172734628  
0.3657822609  
-0.08389328817  
-0.4980306783  
-0.8473882111  
-1.110445177  
-1.275758304  
-1.343111469  
-1.323318837  
-1.236688527  
-1.110340225  
-0.9747208246  
-0.8597454405  
-0.7910676831  
-0.7869313545  
-0.8559979417  
-0.996423045  
-1.19626759  
-1.435187601  
-1.687177416  
-1.923995067  
-2.1188413  
-2.249806678  
-2.302656494  
-2.272593411  
-2.164772948  
-1.993518434  
-1.780332064  
-1.550976774  
-1.332009534  
-1.147233205  
-1.014543713  
-0.9435834707  
-0.9345282627  
-0.9781573737  
-1.057198674  
-1.14874275  
-1.227406469  
-1.268802146  
-1.252820138  
-1.166307899  
-1.004763636  
-0.772844867  
-0.4836595914  
-0.1569540096  
0.1835005032  
0.512945137  
0.8086360013  
1.052411242  
1.232471657  
1.34417529  
1.389791573  
1.377334511  
1.318710462  
1.227535976  
1.116991681  
0.998053385  
0.8783711537  
0.7619228334  
0.6494293368  
0.5394050883  
0.4295684861  
0.3183313927  
0.2060416095  
0.09573527478  
-0.006752248073  
-0.09335917912  
-0.1549382012  
-0.1827808315  
-0.170234604  
-0.1141360318  
-0.01577798711  
0.1187612103  
0.2790158067  
0.4512097772  
0.6198646897  
0.7696895707  
0.8874681152  
0.9636496489  
0.9934151904  
0.977047843  
0.9195853744  
0.8298157208  
0.7187951511  
0.598128694  
0.478296199  
0.3672697538  
0.2696287379  
0.1862842179  
0.1148151703  
0.0503481892  
-0.01321843563  
-0.08183076497  
-0.1599822912  
-0.2496997906  
-0.3499505215  
-0.4565443228  
-0.5625151007  
-0.6588964959  
-0.7357548405  
-0.7833226234  
-0.7930687872  
-0.7585889932  
-0.6762270287  
-0.5454004894  
-0.3686620396  
-0.151545895  
0.0977276165  
0.3686191145  
0.6486717009  
0.9239350066  
1.179439201  
1.399768934  
1.569781863  
1.675503967  
1.705187882  
1.650470186  
1.507505186  
1.277913173  
0.9693713971  
0.5956904683  
0.1762691397  
-0.2650944916  
-0.7019715342  
-1.107479876  
-1.456648447  
-1.728679931  
-1.908837196  
-1.989705146  
-1.971683303  
-1.862618181  
-1.676664138  
-1.432489043  
-1.151098226  
-0.8535377618  
-0.5587849097  
-0.2820731053  
-0.03384633669  
0.18056669  
0.3605624151  
0.509268855  
0.6321319986  
0.7353198909  
0.8241888016  
0.9020481937  
0.9693905528  
1.023687964  
1.059772748  
1.070720089  
1.049097792  
0.9883837408  
0.8843371814  
0.7361261723  
0.5470328164  
0.3246356787  
0.08043125789  
-0.1710687606  
-0.413648738  
-0.6309462112  
-0.8080653244  
-0.9330383567  
-0.9979581363  
-0.999652023  
-0.9398223889  
-0.8246504282  
-0.6639501233  
-0.4699858814  
-0.256137715  
-0.03560129388  
0.1797099715  
0.3799215458  
0.5575404594  
0.7073913202  
0.8261983671  
0.9119540337  
0.9632308995  
0.9785915865  
0.9562477487  
0.894044742  
0.7897819222  
0.6418250759  
0.4498872166  
0.2158085226  
-0.05580690692  
-0.3572561238  
-0.6777984234  
-1.004124981  
-1.32120433  
-1.613382614  
-1.865602818  
-2.064574098  
-2.199748047  
-2.264004404  
-2.253991552  
-2.170139266  
-2.016404874  
-1.799833155  
-1.530034568  
-1.218653007  
-0.8788696125  
-0.5249493961  
-0.1717989461  
0.1655134852  
0.4723193237  
0.7350327673  
0.9419410141  
1.084058627  
1.155956998  
1.156451506  
1.089021545  
0.9618602456  
0.7874773121  
0.5818429528  
0.3631296405  
0.1501462691  
-0.03935442126  
-0.1903248533  
-0.2918171545  
-0.337967531  
-0.3284319728  
-0.2682222034  
-0.1669566064  
-0.0376041183  
0.1051110246  
0.2464688913  
0.3734471823  
0.4761464978  
0.5487912167  
0.590167824  
0.6034808417  
0.5956400232  
0.5760923237  
0.5553455878  
0.5433724501  
0.5480953913  
0.5741451379  
0.6220232153  
0.687789009  
0.7632940772  
0.8369545026  
0.8949748788  
0.9228989024  
0.9073289089  
0.8376318036  
0.7074464863  
0.515840741  
0.2679628888  
-0.02489059837  
-0.3458450217  
-0.6736172236  
-0.9842231034  
-1.253073635  
-1.457268693  
-1.577868707  
-1.601905298  
-1.523897048  
-1.346690324  
-1.081489178  
-0.7470411358  
-0.3680225023  
0.02722022529  
0.4093414096  
0.7507893346  
1.028402108  
1.225517643  
1.333336283  
1.351390943  
1.287083768  
1.154349483  
0.9716355806  
0.7594558038  
0.5378450189  
0.3240228137  
0.1305830839  
-0.0355995305  
-0.1735968417  
-0.2877969295  
-0.3865207927  
-0.4800956853  
-0.5786769576  
-0.6901355551  
-0.8183241855  
-0.9619939458  
-1.114518025  
-1.264483222  
-1.397071908  
-1.496032404  
-1.545960469  
-1.534543509  
-1.454443327  
-1.304526551  
-1.090272801  
-0.8232883328  
-0.5200142062  
-0.1998220239  
0.1172252697  
0.4126136045  
0.6713201576  
0.8831890739  
1.043600507  
1.153375273  
1.218007985  
1.246373594  
1.249154716  
1.237232033  
1.220264599  
1.20562788  
1.197805607  
1.19824785  
1.205620854  
1.216357569  
1.225359056  
1.22673277  
1.214472013  
1.183015408  
1.127686304  
1.045023632  
0.933038258  
0.7914384488  
0.6218346667  
0.4279014027  
0.2154781071  
-0.0074678527  
-0.2310813954  
-0.4440909475  
-0.6345571488  
-0.7908615457  
-0.902847196  
-0.9630152325  
-0.967598234  
-0.9173670308  
-0.818018501  
-0.6800393052  
-0.5180123017  
-0.3494028399  
-0.1929407011  
-0.06677293742  
0.01338466444  
0.03587707947  
-0.005694254288  
-0.111851757  
-0.2772695594  
-0.4914387973  
-0.7398651544  
-1.00562448  
-1.271086894  
-1.51956882  
-1.736746142  
-1.911663185  
-2.037291671  
-2.110601697  
-2.132227499  
-2.105821685  
-2.037220909  
-1.933556988  
-1.802417618  
-1.65112965  
-1.486225455  
-1.313082673  
-1.135740174  
-0.9568528784  
-0.7777606428  
-0.5986387542  
-0.4187151266  
-0.236536114  
-0.0502847795  
0.1418603997  
0.3413270067  
0.5487322537  
0.7634679268  
0.983328212  
1.204234284  
1.42009531  
1.622872205  
1.802871786  
1.949299609  
2.051052845  
2.097720615  
2.080697924  
1.994316322  
1.836844534  
1.611231491  
1.325463456  
0.9924403422  
0.629330843  
0.2564311514  
-0.1043991758  
-0.4315619629  
-0.7056225975  
-0.9110849142  
-1.037803611  
-1.081883947  
-1.045935272  
-0.9386399989  
-0.7736896844  
-0.5682012411  
-0.3408161773  
-0.1097100132  
0.1092444492  
0.3039443093  
0.4669742005  
0.5958882741  
0.6928345737  
0.7635970308  
0.8161916478  
0.859219075  
0.9001966065  
0.9440963799  
0.9922954019  
1.042073359  
1.086760953  
1.116516865  
1.119665824  
1.084422508  
1.000800592  
0.8624376009  
0.6680936907  
0.4225916855  
0.1370502397  
-0.1716888799  
-0.4823861092  
-0.7713805439  
-1.014989082  
-1.192057099  
-1.286353735  
-1.288506826  
-1.197237232  
-1.0197121  
-0.7709584066  
-0.4723843877  
-0.1495580899  
0.1704885454  
0.4621384913  
0.7039047445  
0.8806626696  
0.9851391349  
1.018473899  
0.9897802832  
0.9147566085  
0.8134941771  
0.7077363712  
0.6179197244  
0.5603366525  
0.5447886919  
0.5730296571  
0.6382141066  
0.7254783515  
0.8136111189  
0.877661339  
0.8921982027  
0.8348241894  
0.6895210516  
0.4493657669  
0.1182632366  
-0.288604229  
-0.7457084199  
-1.21944136  
-1.671491958  
-2.062935497  
-2.358574922  
-2.530998046  
-2.563851871  
-2.453936269  
-2.211848399  
-1.861098328  
-1.435797951  
-0.9771940884  
-0.5294528848  
-0.1351717095  
0.1688707741  
0.3552842163  
0.4085853881  
0.3264339735  
0.1195127394  
-0.1898944327  
-0.5704124382  
-0.9848836129  
-1.394095596  
-1.760548261  
-2.051872726  
-2.243596926  
-2.321001046  
-2.27994215  
-2.12661069  
-1.876308929  
-1.551418868  
-1.178815194  
-0.787011927  
-0.4033445315  
-0.05145884314  
0.2506513432  
0.491900961  
0.6685876731  
0.7840829326  
0.8478077293  
0.8736472778  
0.8779723839  
0.8775045574  
0.8872243802  
0.9185509022  
0.9779801688  
1.06630956  
1.178550619  
1.304530134  
1.43012284  
1.538986331  
1.614600747  
1.642367986  
1.61152603  
1.516639756  
1.358469146  
1.14411067  
0.8863873193  
0.6025587298  
0.3125126133  
0.03667607207  
-0.2061065277  
-0.4004681478  
-0.535965711  
-0.6079327351  
-0.6176766759  
-0.5720319533  
-0.4823822121  
-0.3632911055  
-0.2309362724  
-0.1015191288  
0.01019557107  
0.09208798326  
0.1355874236  
0.1362348738  
0.09392198436  
0.01282063706  
-0.09896312211  
-0.2300033227  
-0.3664071663  
-0.4928914291  
-0.594050407  
-0.6557434341  
-0.6664971306  
-0.6187878336  
-0.5100382591  
-0.3431663814  
-0.1265583445  
0.1266043221  
0.3996515417  
0.6742364486  
0.9324533143  
1.158982  
1.342940761  
1.479172471  
1.568726597  
1.61843549  
1.639609344  
1.646003368  
1.651350813  
1.66682454  
1.698816519  
1.747396912  
1.805716895  
1.860492405  
1.893544457  
1.884209396  
1.812311096  
1.661273847  
1.420952386  
1.089764119  
0.6758018055  
0.1967523761  
-0.3214075183  
-0.8467998552  
-1.344824509  
-1.781751306  
-2.128277729  
-2.362628642  
-2.47281806  
-2.457822159  
-2.327532851  
-2.10153006  
-1.806831323  
-1.474909381  
-1.138348918  
-0.8275198316  
-0.5676599304  
-0.3766633016  
-0.2637928953  
-0.2294109662  
-0.2657031936  
-0.3582307532  
-0.4881157027  
-0.6345291267  
-0.7772047929  
-0.8986652259  
-0.9859388498  
-1.031590725  
-1.034004207  
-0.9969408265  
-0.9284824569  
-0.8395501155  
-0.7422171935  
-0.6480533936  
-0.5667226878  
-0.5049882041  
-0.4662227795  
-0.4504420794  
-0.4547895413  
-0.4743473525  
-0.5031242459  
-0.5350322012  
-0.5647157975  
-0.5881240043  
-0.6027663186  
-0.6076729183  
-0.603105313  
-0.590105653  
-0.5700056111  
-0.5439642427  
-0.5126381112  
-0.4760017807  
-0.4333441791  
-0.3834098347  
-0.3246457549  
-0.2555054618  
-0.1747635627  
-0.08179624553  
0.02319953664  
0.1390566175  
0.263565497  
0.3934838965  
0.5246243229  
0.6520168415  
0.7701458551  
0.873258943  
0.9557304418  
1.012472561  
1.039358199  
1.033631524  
0.9942643031  
0.9222350617  
0.820686364  
0.6949462348  
0.5524043218  
0.4022161959  
0.2548577162  
0.1215217399  
0.01338345897  
-0.05923307187  
-0.08774210751  
-0.06616865243  
0.008080156131  
0.133624378  
0.3048120421  
0.5117715884  
0.7408618752  
0.9755387707  
1.197574701  
1.388534101  
1.531377817  
1.612008166  
1.620600303  
1.552544841  
1.408904976  
1.196314268  
0.9263366151  
0.6143521156  
0.278110516  
-0.06388528436  
-0.3939699596  
-0.6967147658  
-0.9599817683  
-1.175536315  
-1.339191743  
-1.45051322  
-1.512147432  
-1.528930696  
-1.506894767  
-1.452325017  
-1.371005194  
-1.267726095  
-1.146105096  
-1.008710154  
-0.8574203707  
-0.6939341448  
-0.5203040588  
-0.3393756693  
-0.1550304841  
0.02782765297  
0.2035629023  
0.3663324757  
0.5107596302  
0.6326276625  
0.7294639489  
0.8008956588  
0.8486782271  
0.8763787766  
0.888743872  
0.8908431288  
0.8871444841  
0.8806672786  
0.8723977145  
0.8610647908  
0.8433504518  
0.8145231563  
0.7693905168  
0.7034339548  
0.6139284781  
0.500847508  
0.3673980673  
0.2200665584  
0.0681358911  
-0.07725521904  
-0.2043994401  
-0.3024732651  
-0.362932624  
-0.3806611502  
-0.3547033401  
-0.2884830564  
-0.1894853815  
-0.06845489709  
0.06176148115  
0.1875601556  
0.2959282832  
0.3756187643  
0.418007175  
0.4175685192  
0.3719481465  
0.2816954807  
0.1497565626  
-0.01914493275  
-0.2190869046  
-0.4434041784  
-0.684937767  
-0.9360841603  
-1.188692662  
-1.433907753  
-1.662071679  
-1.862812753  
-2.025393009  
-2.139365053  
-2.195487194  
-2.186810679  
-2.109769084  
-1.965090412  
-1.75832765  
-1.499864189  
-1.20428989  
-0.8891578066  
-0.5732353716  
-0.274439857  
-0.007753775488  
0.216586172  
0.3943030009  
0.527500814  
0.6241397641  
0.6966198863  
0.759634449  
0.8275921249  
0.9120186085  
1.019344134  
1.149456292  
1.295301274  
1.443629487  
1.57681777  
1.675505814  
1.721646211  
1.701475832  
1.607923089  
1.442044812  
1.213241074  
0.9382005883  
0.6387422222  
