2239.168298  
2429.804073  
2842.259897  
3759.802704  
5598.104857  
10092.5309  
35908.63072  
40461.41783  
2078.494094  
8071.390831  
11160.65272  
1180.446778  
9898.39903  
14470.36763  
34735.44486  
8052.495324  
5310.024418  
1573.225469  
474.999627  
3526.80938  
6881.501469  
8258.253137  
7937.741695  
8084.92197  
28346.89928  
8956.100568  
14691.68226  
9872.259027  
18528.32309  
403.0805382  
9927.153749  
10341.22952  
6443.435279  
15400.5326  
3993.993851  
19123.0212  
11966.51719  
5278.689672  
7712.60724  
7080.08921  
2414.628268  
2883.432266  
3057.719697  
1062.910441  
2965.050261  
14152.51831  
7392.373023  
1740.869801  
4866.997823  
3185.121051  
6071.434455  
325.0697621  
4544.876259  
1568.363031  
276.0965751  
4730.671609  
1612.74599  
478.7939751  
1473.869346  
765.0961588  
1921.893763  
2814.190392  
1817.353496  
38.86986794  
1296.992359  
223.1323406  
37.14538241  
278.3795847  
195.1409375  
89.11754921  
53.93996599  
31.60241758  
14.39522346  
27.13879823  
6.601820206  
4.223831921  
8.723971503  
3.03527337  
3.932309213  
3.09688834  
1.489379136  
0.1939920138  
0.7006202526  
0.5174414958  
0.3394265356  
0.9525217061  
0.7575261694  
0.3706758688  
0.459490172  
0.5838397822  
0.4326394551  
0.3918799814  
0.4439682549  
0.424168187  
0.4712590567  
0.400325639  
0.4091224224  
0.3998770771  
0.3602507406  
0.4032490941  
0.3705188419  
0.3495272749  
0.3809396253  
0.3633948243  
0.3532779797  
0.3416053613  
0.3410649706  
0.3325310716  
0.3289388261  
0.3248282215  
0.3137473326  
0.3114829545  
0.3088487785  
0.3047859313  
0.2991842909  
0.2927025916  
0.2900577941  
0.2856959599  
0.2800463194  
0.2765606958  
0.2721190708  
0.2678899676  
0.2643866203  
0.2607132779  
0.256160015  
0.2523645272  
0.2490664731  
0.2454364061  
0.2421364159  
0.2387937245  
0.2354955612  
0.2325072437  
0.2293449918  
0.2263208484  
0.2232455467  
0.2203202079  
0.2174804082  
0.2146221205  
0.2119108825  
0.2092162593  
0.2066187243  
0.2040313617  
0.2015103397  
0.1990620352  
0.1966151741  
0.1942494215  
0.1918997475  
0.1896204948  
0.187393248  
0.1852006725  
0.1830373696  
0.1809186711  
0.1788416661  
0.1768020731  
0.174806381  
0.1728383892  
0.1709231923  
0.1690308573  
0.1671709546  
0.1653503243  
0.1635585995  
0.161794184  
0.1600741061  
0.1583790582  
0.1567045305  
0.1550722541  
0.1534563848  
0.1518732594  
0.1503187786  
0.14879313  
0.1472882429  
0.1458101069  
0.1443541291  
0.1429236488  
0.1415222356  
0.1401417469  
0.1387860845  
0.1374467801  
0.1361210914  
0.1348303857  
0.1335587  
0.1323064437  
0.1310737021  
0.1298592858  
0.1286650289  
0.1274875752  
0.126329455  
0.1251920023  
0.124070006  
0.122957549  
0.1218764992  
0.1208078409  
0.1197517188  
0.1187103354  
0.1176895956  
0.1166824838  
0.1156852971  
0.114708748  
0.1137468673  
0.1127942779  
0.1118550653  
0.1109386222  
0.1100259184  
0.1091272727  
0.1082478437  
0.1073768863  
0.1065183768  
0.1056756579  
0.1048446132  
0.1040197613  
0.1032104931  
0.1024149978  
0.1016225788  
0.100847221  
0.1000810022  
0.09932723404  
0.09857971992  
0.09784546677  
0.09711965639  
0.09640613159  
0.09570082375  
0.09500512725  
0.09431993294  
0.0936464462  
0.0929721793  
0.0923126023  
0.09166690794  
0.09102332901  
0.09038911381  
0.08976213771  
0.08914816271  
0.08854134073  
0.08793581816  
0.08734365714  
0.08675593966  
0.08617965857  
0.08561013088  
0.08504606274  
0.08449132012  
0.0839405367  
0.08339738323  
0.08286352981  
0.08233479052  
0.08181548932  
0.08129761567  
0.08078211568  
0.08028092592  
0.07978704524  
0.07929706365  
0.07881049784  
0.07833330524  
0.07785951929  
0.07739775097  
0.07693439623  
0.07647595402  
0.07602444733  
0.07558213761  
0.0751481023  
0.07470594652  
0.07427877918  
0.07385605539  
0.07343304759  
0.07302156296  
0.07261107205  
0.07220714913  
0.07181408597  
0.07141395451  
0.07102679074  
0.07064045253  
0.07025954526  
0.06988337693  
0.0695122288  
0.06914368572  
0.06877786426  
0.06842147364  
0.06806748027  
0.06771550053  
0.06736719303  
0.06702432179  
0.06668398023  
0.06634981837  
0.06601826797  
0.06569094689  
0.06536467645  
0.0650449459  
0.06472595958  
0.06441535699  
0.06410346725  
0.06380190548  
0.06349709757  
0.06319965407  
0.0628991796  
0.06260700208  
0.06232316543  
0.0620324366  
0.06174962465  
0.06147083076  
0.06119578839  
0.06092005942  
0.06064654396  
0.06037692714  
0.06011664506  
0.05985591523  
0.05959669072  
0.05933704277  
0.05908588627  
0.05883495114  
0.05858682748  
0.05834130587  
0.05809960534  
0.05786072943  
0.0576227963  
0.05738993469  
0.05715860739  
0.05692889572  
0.05669939405  
0.05647435354  
0.0562561786  
0.05603277101  
0.05581585162  
0.0556042367  
0.05538729093  
0.05517946429  
0.05497138921  
0.05476384575  
0.05456211461  
0.05436166179  
0.05416219702  
0.05396355867  
0.0537700295  
0.05357731432  
0.05338914083  
0.05319852086  
0.05301333346  
0.05282633599  
0.05264490286  
0.05246525858  
0.05228262727  
0.05210883332  
0.05193516488  
0.05176151864  
0.05159460228  
0.05142114424  
0.05125180458  
0.05108975436  
0.050924598  
0.0507638361  
0.05060664447  
0.05044715902  
0.05028877362  
0.05013811083  
0.04998433329  
0.04982995306  
0.04968224965  
0.0495350089  
0.04938978323  
0.04924118635  
0.04909690625  
0.04895750343  
0.04881806134  
0.04868058256  
0.04854000424  
0.04841004789  
0.0482745227  
0.04814113815  
0.04800936526  
0.04788529125  
0.04775409387  
0.04762807995  
0.04750334043  
0.0473812845  
0.047259562  
0.04713636953  
0.04701763099  
0.04689784864  
0.04678129087  
0.04666793333  
0.04655663957  
0.04644272254  
0.04632903851  
0.04621815776  
0.04611156014  
0.04600585436  
0.04590035707  
0.04579445922  
0.04569414025  
0.04558969032  
0.04548890361  
0.0453888935  
0.04528956647  
0.04519355312  
0.0450992692  
0.04500258953  
0.04491152612  
0.04481739951  
0.04472748095  
0.04463707818  
0.0445493445  
0.0444590146  
0.04437415756  
0.04428296338  
0.04420282056  
0.04412196753  
0.04404026653  
0.0439569203  
0.04387723184  
0.04380081665  
0.04372131185  
0.04364377449  
0.0435685664  
0.04349650817  
0.04342075604  
0.0433480456  
0.04327856721  
0.04320638293  
0.04313741806  
0.04306984938  
0.0430016048  
0.0429363838  
0.0428729478  
0.04280626875  
0.04274526013  
0.04268135157  
0.04262076094  
0.04255945325  
0.04250227249  
0.04244438977  
0.04238612632  
0.04232881327  
0.04227426458  
0.04221770111  
0.04216765178  
0.04211590203  
0.04206445629  
0.04201053554  
0.04196191443  
0.04191430971  
0.04186410654  
0.04181884024  
0.04177382104  
0.04172531674  
0.04168366905  
0.04163899799  
0.04159765598  
0.0415554593  
0.04151751903  
0.04147540667  
0.04143512374  
0.0413983354  
0.04136222945  
0.04132762518  
0.04128953748  
0.04125384603  
0.04122087528  
0.04118978694  
0.04115689376  
0.04112830649  
0.04109589045  
0.04106820094  
0.04103829934  
0.0410105208  
0.04098244049  
0.04095923604  
0.04093341484  
0.04090768278  
0.04088553016  
0.04086310013  
0.04084425593  
0.04082132862  
0.04079930328  
0.04078235993  
0.04076464277  
0.04074613634  
0.04072743759  
0.04071342831  
0.0406996753  
0.04068260563  
0.04067100283  
0.04065684481  
0.04064451659  
0.04063595102  
0.0406234973  
0.04061570445  
0.04060929777  
0.04059980074  
0.04058952651  
0.0405832257  
0.04057943401  
0.04057710576  
0.04057118491  
0.04056632627  
0.04056911836  
0.04056717117  
0.04056890244  
