0.1819808175  
0.6350869516  
1.052069327  
1.404841352  
1.672641234  
1.84420547  
1.918631899  
1.904831643  
1.819711756  
1.685395044  
1.525926596  
1.363991981  
1.218107962  
1.100679909  
1.01713385  
0.9661805962  
0.9410525903  
0.9314654333  
0.9259082319  
0.9138883803  
0.8877737437  
0.8439633987  
0.7832608935  
0.7104421459  
0.6331482103  
0.5603267629  
0.5005034482  
0.460183501  
0.4426275286  
0.447203818  
0.469389131  
0.5014269767  
0.5335117593  
0.5553030295  
0.5575545498  
0.5335799122  
0.4803525597  
0.3990562188  
0.2950205526  
0.1770464279  
0.05621059186  
-0.05565849561  
-0.1476223822  
-0.2111408542  
-0.2412260424  
-0.2370781633  
-0.2021123362  
-0.1433585963  
-0.07036850156  
0.006230128298  
0.07628735968  
0.131571299  
0.1668594675  
0.1805404461  
0.1746478212  
0.1543215527  
0.1267977033  
0.1000978321  
0.08160438713  
0.07675651388  
0.08806051006  
0.1145564295  
0.1518473425  
0.192672838  
0.2279519856  
0.2481569792  
0.2447956817  
0.2117935225  
0.1465825549  
0.05069428816  
-0.07019217741  
-0.2067883282  
-0.3472587877  
-0.4786487841  
-0.5885214738  
-0.6665753268  
-0.7060606235  
-0.7048000153  
-0.6656979798  
-0.5966584825  
-0.5099039146  
-0.4207311557  
-0.3458320804  
-0.3013225969  
-0.3006962546  
-0.3529417626  
-0.4610380398  
-0.6210772935  
-0.8221540932  
-1.04712064  
-1.27418164  
-1.479198359  
-1.638459191  
-1.731588862  
-1.744242494  
-1.67019604  
-1.512550848  
-1.283833953  
-1.004924855  
-0.7029234546  
-0.4081489429  
-0.1506582712  
0.04330766574  
0.1545065912  
0.1730930532  
0.09992990565  
-0.05335614903  
-0.2656205323  
-0.5085778361  
-0.7500441215  
-0.957660313  
-1.102654327  
-1.163201808  
-1.127007566  
-0.9927965835  
-0.77057855  
-0.4806453543  
-0.1514202129  
0.1835927013  
0.4894383387  
0.7335186231  
0.8891940995  
0.9387786723  
0.8756102018  
0.7049941037  
0.4438575088  
0.1191673185  
-0.2347601259  
-0.5798040776  
-0.8780625365  
-1.095934694  
-1.207813827  
-1.198964045  
-1.067249091  
-0.8234746004  
-0.4902907983  
-0.09973747253  
0.3102875462  
0.7002635235  
1.033474735  
1.280132367  
1.420680168  
1.447903797  
1.367568456  
1.197532969  
0.9654087733  
0.7050865629  
0.4525323871  
0.2413704775  
0.09881904745  
0.04245759357  
0.0782419126  
0.2000124579  
0.3905420525  
0.6239911432  
0.8694351682  
1.095005846  
1.272105281  
1.379117565  
1.404158736  
1.346505965  
1.216523063  
1.034136935  
0.826081822  
0.6223112386  
0.4520716021  
0.340155786  
0.3038297127  
0.3507977135  
0.4784135838  
0.6741862924  
0.9174292403  
1.181793457  
1.438299068  
1.658491369  
1.817334841  
1.895571154  
1.881341133  
1.771016949  
1.569241265  
1.288308349  
0.9469935184  
0.5689920183  
0.1810885678  
-0.1888428599  
-0.5139334985  
-0.7704243786  
-0.9396905636  
-1.010058785  
-0.9782456049  
-0.8502241295  
-0.6413216928  
-0.3754103639  
-0.08312884987  
0.2007958777  
0.4408939267  
0.6046403005  
0.6660351696  
0.6086035584  
0.4273870415  
0.1296466669  
-0.2658935117  
-0.7311440101  
-1.231846237  
-1.73140571  
-2.194854552  
-2.592392934  
-2.902053059  
-3.111184841  
-3.216639874  
-3.223749594  
-3.144386346  
-2.994480094  
-2.791484285  
-2.552172847  
-2.291114952  
-2.01999067  
-1.747699266  
-1.481140964  
-1.226319556  
-0.9894531088  
-0.7777466043  
-0.599584046  
-0.4640309727  
-0.3796974734  
-0.3531597443  
-0.3872497246  
-0.4795623483  
-0.6215308382  
-0.7983154896  
-0.9896362326  
-1.171503557  
-1.318663604  
-1.407435355  
-1.418534656  
-1.339497462  
-1.166341227  
-0.9042264221  
-0.5670267093  
-0.1758681756  
0.2431447066  
0.6617127896  
1.052245112  
1.390519317  
1.657780743  
1.842070772  
1.938689929  
1.949848731  
1.883651251  
1.75263948  
1.572162442  
1.35880896  
1.129078783  
0.8984234995  
0.6806525581  
0.4876740825  
0.3294411205  
0.2139989766  
0.1474941042  
0.1340872398  
0.1757306924  
0.2718622553  
0.4190772146  
0.6109078688  
0.8378063338  
1.087423617  
1.345216452  
1.595368944  
1.821950606  
2.010184622  
2.147683326  
2.225498308  
2.238850462  
2.187455231  
2.075409914  
1.910654836  
1.704095846  
1.468495321  
1.217256223  
0.9632673983  
0.7179010709  
0.4902786721  
0.2868352182  
0.1112174842  
-0.03555112039  
-0.1546729837  
-0.2490356026  
-0.3226128966  
-0.379878648  
-0.4252750615  
-0.4627891946  
-0.4956329567  
-0.5260493874  
-0.5552108886  
-0.5832345409  
-0.6092869472  
-0.6317833055  
-0.6486614964  
-0.6577374755  
-0.6570828015  
-0.6454115512  
-0.62242563  
-0.5890538229  
-0.547559523  
-0.5014728272  
-0.4553457311  
-0.4143413069  
-0.383689867  
-0.3680930969  
-0.3711285278  
-0.3947408071  
-0.4388956865  
-0.5014333969  
-0.5781555382  
-0.6631301447  
-0.7492000188  
-0.8286124454  
-0.893734484  
-0.9377605879  
-0.9553617963  
-0.9432059843  
-0.9003170142  
-0.8282465168  
-0.7310296404  
-0.6149388118  
-0.488029777  
-0.3595280237  
-0.2390757115  
-0.1359054987  
-0.05801050188  
-0.01139120813  
0.0005392344749  
-0.02267919557  
-0.07848600387  
-0.1615395069  
-0.2642675234  
-0.3776772036  
-0.4923357671  
-0.5994220374  
-0.6917083625  
-0.7643614992  
-0.8154592666  
-0.8461384069  
-0.8603535272  
-0.8642600526  
-0.8652842107  
-0.8709803436  
-0.8878053731  
-0.9199565803  
-0.9684254797  
-1.030395872  
-1.099098845  
-1.164180245  
-1.21258475  
-1.229910239  
-1.202092332  
-1.117255514  
-0.9675003037  
-0.7503954745  
-0.4699532133  
-0.1369186842  
0.231725923  
0.6140370328  
0.9850410942  
1.319141489  
1.592698314  
1.78647931  
1.887670755  
1.891201372  
1.800211178  
1.625610222  
1.384796501  
1.099707682  
0.7944679245  
0.4929257392  
0.2163921235  
-0.01815823076  
-0.1992539536  
-0.3213582288  
-0.384593484  
-0.3938739202  
-0.3576208021  
-0.286277702  
-0.1908472145  
-0.08162346069  
0.03274403757  
0.1458010034  
0.2534458765  
0.3537690675  
0.446640571  
0.5331715993  
0.6151396678  
0.6944466661  
0.772667494  
0.8507075149  
0.9285609794  
1.00516192  
1.07832421  
1.144752562  
1.200144105  
1.239393607  
1.256906784  
1.247048704  
1.20469016  
1.125826298  
1.008196449  
0.8518114293  
0.6593193713  
0.4361080821  
0.1901063274  
-0.06871417234  
-0.3291026913  
-0.5794557662  
-0.808786893  
-1.007611215  
-1.168603743  
-1.286961839  
-1.360443621  
-1.389095889  
-1.374767358  
-1.320532938  
-1.230134992  
-1.107601051  
-0.9570781135  
-0.782917544  
-0.589976171  
-0.3840067273  
-0.1720271271  
0.03749461839  
0.2347542784  
0.4090946831  
0.549856192  
0.6474940822  
0.694838293  
0.6882506685  
0.628507958  
0.5211902026  
0.3764768718  
0.2083136405  
0.03302464037  
-0.1324511368  
-0.2724717828  
-0.3744708111  
-0.4303436179  
-0.4372549112  
-0.3977558296  
-0.3192045919  
-0.2126181393  
-0.09113289352  
0.03165450155  
0.1432292054  
0.2333642551  
0.2948365689  
0.3236237952  
0.3186222253  
0.2810204577  
0.2135147551  
0.1195568351  
0.002796167865  
-0.1331740565  
-0.2847568625  
-0.4480285265  
-0.6182779447  
-0.7895795446  
-0.9545533113  
-1.104445412  
-1.229590454  
-1.3202532  
-1.367736236  
-1.365619607  
-1.31090498  
-1.204899565  
-1.05362764  
-0.8676781423  
-0.6614475916  
-0.4518266308  
-0.2564809263  
-0.09191938577  
0.02839291542  
0.0956442096  
0.106749962  
0.06479123045  
-0.02132691941  
-0.1379215243  
-0.268191903  
-0.3942823878  
-0.4994909724  
-0.5703153825  
-0.5980979007  
-0.5800025108  
-0.5192105454  
-0.4242925981  
-0.3078247295  
-0.1844368581  
-0.06854962487  
0.02787521454  
0.09726560724  
0.1377615731  
0.1536999636  
0.1551711019  
0.1566446193  
0.1748170805  
0.2259228608  
0.3228740408  
0.4726333514  
0.6742028157  
0.9176232291  
1.184204233  
1.448099502  
1.679132354  
1.84659438  
1.923561793  
1.89114754  
1.742052753  
1.482832121  
1.134395209  
0.7305236215  
0.3144340609  
-0.06626932979  
-0.3656304948  
-0.5455790713  
-0.5814466078  
-0.4659606159  
-0.2110338819  
0.152977229  
0.5805507345  
1.016419867  
1.402429553  
1.684901079  
1.82149804  
1.786631076  
1.574681568  
1.200607891  
0.6978820293  
0.1140855309  
-0.4951978482  
-1.073316225  
-1.569378947  
-1.944049554  
-2.173594224  
-2.251725365  
-2.189119126  
-2.010797991  
-1.751880588  
-1.452353229  
-1.151647591  
-0.8837480069  
-0.6734369436  
-0.5340791115  
-0.4671063405  
-0.4631143364  
-0.5042766765  
-0.5676523529  
-0.6288411353  
-0.6655220575  
-0.6603945596  
-0.6032344474  
-0.49189393  
-0.3322081383  
-0.1369558174  
0.07594040651  
0.2856698131  
0.4709684733  
0.6124447619  
0.6945645607  
0.7071454171  
0.6462490159  
0.514463326  
0.3206096506  
0.07895241418  
-0.1919683973  
-0.4707776177  
-0.7348475252  
-0.9619320464  
-1.131763074  
-1.227548731  
-1.237284832  
-1.154846301  
-0.9807552486  
-0.7225539407  
-0.3946999312  
-0.01791069542  
0.3820829799  
0.7763547175  
1.135068578  
1.43009669  
1.637696669  
1.741001214  
1.731977221  
1.612619662  
1.395132764  
1.101026356  
0.7591208333  
0.4026442732  
0.06571600231  
-0.2204006045  
-0.4308114901  
-0.5498363643  
-0.5727891336  
-0.5064427224  
-0.3680776557  
-0.1831945569  
0.01781757725  
0.2036716351  
0.3462799347  
0.4244272291  
0.4265336872  
0.352098025  
0.2116448147  
0.02515679251  
-0.1807873802  
-0.376770402  
-0.5346754837  
-0.6316064443  
-0.6530534691  
-0.5948405662  
-0.4636047528  
-0.2757295134  
-0.05493346156  
0.1711422333  
0.3748088913  
0.5321077277  
0.6259269138  
0.6480081801  
0.5995962538  
0.4906634193  
0.3379043531  
0.1618556664  
-0.01636623407  
-0.1781581344  
-0.3098824651  
-0.4043092495  
-0.460864751  
-0.484745835  
-0.4851064565  
-0.4727285971  
-0.4576146684  
-0.4469589713  
-0.4438576894  
-0.4469639413  
-0.4511065935  
-0.4487008394  
-0.4316723394  
-0.3934785721  
-0.3308584495  
-0.2449707704  
-0.1417115489  
-0.03116521672  
0.07373454738  
0.1590902564  
0.2121915085  
0.2235745116  
0.1886879254  
0.1089025066  
-0.008270817999  
-0.1498140318  
-0.298594753  
-0.4353598935  
-0.5410540949  
-0.5991949371  
-0.5979765677  
-0.5318465281  
-0.4023437553  
-0.218079284  
0.006132361945  
0.2508988175  
0.4944278168  
0.7149893203  
0.8933441108  
1.014861357  
1.071043415  
1.060288799  
0.9878302147  
0.8648612804  
0.7070029719  
0.5323165251  
0.3591346006  
0.2039678457  
0.07973976586  
-0.005459329792  
-0.0490142002  
-0.0537614162  
-0.02736652952  
0.0187930452  
0.07110362509  
0.1153584746  
0.1384145424  
0.1296677745  
0.08222435649  
-0.006345805334  
-0.1337599837  
-0.2932831248  
-0.4744717854  
-0.6643335959  
-0.8487699988  
-1.014154108  
-1.148869223  
-1.244628189  
-1.297422703  
-1.307960329  
-1.281547837  
-1.227383195  
-1.157345598  
-1.084403322  
-1.020843906  
-0.9765417076  
-0.957497328  
-0.9648506936  
-0.9945317389  
-1.037593978  
-1.081245721  
-1.110434193  
-1.109825118  
-1.065908287  
-0.9689808831  
-0.8147352177  
-0.60524908  
-0.3492276413  
-0.06144923825  
0.2385434713  
0.5283685812  
0.7851211339  
0.9878306819  
1.119753347  
1.170248279  
1.135997153  
1.021434914  
0.8383339094  
0.604591055  
0.342370395  
0.07580453564  
-0.1714525538  
-0.3785611693  
-0.5294431479  
-0.6141380209  
-0.6294160395  
-0.578631938  
-0.4708231146  
-0.3192261699  
-0.1393846055  
0.05288713754  
0.2434337794  
0.42133375  
0.5799212533  
0.7171467948  
0.8352304032  
0.9396910015  
1.037880914  
1.137255297  
1.243630712  
1.359673172  
1.483863697  
1.61008893  
1.727947379  
1.823761008  
1.882181631  
1.888202439  
1.829343012  
1.697705317  
1.491646198  
1.216817964  
0.8864062723  
0.5204631674  
0.1443678446  
-0.2134753495  
-0.5244788793  
-0.7629659159  
-0.9091400038  
-0.951592584  
-0.8889966294  
-0.7307384163  
-0.4963287172  
-0.2136093658  
0.08411904903  
0.3617375091  
0.5863145181  
0.7309925959  
0.7782791574  
0.722276789  
0.5695591697  
0.3385222977  
0.05724858536  
-0.2398730336  
-0.5163754548  
-0.7382565719  
-0.8782534344  
-0.9193084314  
-0.8567506846  
-0.6989166217  
-0.4661217929  
-0.1881013145  
0.09973013652  
0.3607278969  
0.561592766  
0.6764711081  
0.6900615431  
0.5993369804  
0.4136657178  
0.1533792665  
-0.1530270541  
-0.4726232468  
-0.7721940794  
-1.022246047  
-1.200321189  
-1.293230474  
-1.297955583  
-1.221170666  
-1.077565265  
-0.8872996432  
-0.672999545  
-0.4567999403  
-0.2578321619  
-0.09047471995  
0.03644244956  
0.1195253192  
0.1598925519  
0.1617294223  
0.1306390534  
0.07208264222  
-0.009783680449  
-0.1127319225  
-0.2364437355  
-0.3819083236  
-0.5503779469  
-0.742075734  
-0.9549353523  
-1.183591788  
-1.41886334  
-1.647849655  
-1.854700829  
-2.022019081  
-2.132715007  
-2.172118487  
-2.130030467  
-2.00244197  
-1.792635845  
-1.511491647  
-1.176886239  
-0.8122351592  
-0.4442936059  
-0.1004908372  
0.1938995916  
0.4184030436  
0.5594857764  
0.6119123775  
0.5791796375  
0.4729659186  
0.3116823972  
0.1183117263  
-0.08218218335  
-0.2655688132  
-0.4108630345  
-0.5023511319  
-0.5309577011  
-0.4948105159  
-0.3990189565  
-0.2547397959  
-0.07768470073  
0.1137429902  
0.3004726171  
0.4647559011  
0.591932557  
0.6718511443  
0.6998210458  
0.6770317542  
0.6104053318  
0.5118795917  
0.3971763535  
0.2841404356  
0.1907853745  
0.1332303206  
0.1237527799  
0.1691634601  
0.2697563615  
0.4189628963  
0.6038386481  
0.8063752335  
1.00550452  
1.179590476  
1.309099774  
1.379095463  
1.381211847  
1.314824871  
1.187239651  
1.012844767  
0.8113529594  
0.6053371021  
0.4174348991  
0.267551055  
0.1704746098  
0.1341835469  
0.1590573003  
0.2380649852  
0.3578636108  
0.5006616303  
0.6465455951  
0.7760114121  
0.8723360665  
0.9235397638  
0.9237052758  
0.8735304056  
0.780071572  
0.6557553638  
0.5167929773  
0.3812096659  
0.2667179251  
0.1886809945  
0.1583646444  
0.1816644992  
0.2583880324  
0.3821657814  
0.5409700991  
0.7181784047  
0.8940917052  
1.047759978  
1.158983329  
1.210291147  
1.188753811  
1.08743069  
0.9063160612  
0.6526642689  
0.3406192066  
-0.00985523174  
-0.3746654266  
-0.7277749327  
-1.043673546  
-1.299899808  
-1.479345057  
-1.572095784  
-1.57660335  
-1.500028975  
-1.357691204  
-1.171631798  
-0.9684113317  
-0.7763332381  
-0.6223604134  
-0.5290566133  
-0.511905758  
-0.5773166461  
-0.7216212787  
-0.9311995971  
-1.183806432  
-1.450961143  
-1.701172158  
-1.903605512  
-2.031776643  
-2.066786455  
-1.999722817  
-1.832916965  
-1.579907996  
-1.264126163  
-0.9164549094  
-0.5719723925  
-0.2662288168  
-0.03148976805  
0.1066986237  
0.1322347252  
0.0402805796  
-0.1620305913  
-0.4560157022  
-0.8129599179  
-1.196591505  
-1.566272655  
-1.880645431  
-2.101390164  
-2.196779519  
-2.144660015  
-1.934615049  
-1.569073974  
-1.063244146  
-0.4438845921  
0.2529892203  
0.9852201255  
1.708150127  
2.378390396  
2.957355863  
3.414210253  
3.727932689  
3.888363315  
3.896163011  
3.761800189  
3.503743642  
3.146146618  
2.716324723  
2.242315944  
1.750762413  
1.265283551  
0.8053853133  
