14.1210261  
19.63716295  
32.41799402  
63.53351231  
130.1623973  
1554.887995  
18798.04385  
46773.66143  
60355.12589  
27040.31237  
73499.79242  
16389.04783  
6486.76715  
15629.79083  
33228.0973  
9375.694933  
43854.07206  
12928.42844  
2911.962773  
4064.396645  
7353.60598  
22908.79384  
2768.003128  
1268.112466  
16981.27749  
40.45962163  
2579.76288  
994.2786123  
970.5191539  
1975.27688  
205.6658899  
5613.461707  
197.2465007  
2127.456021  
4117.717228  
4113.81121  
342.6805665  
7690.871617  
6145.109494  
3782.86798  
3974.51804  
1040.376021  
1283.372966  
229.0882341  
649.239081  
1751.303929  
2625.003943  
1588.420599  
2043.706313  
1391.021121  
1447.149244  
352.6252143  
198.1512361  
177.3600742  
153.424065  
788.9278288  
729.6355958  
519.7891979  
60.57007809  
464.4859167  
382.9249388  
42.94353254  
124.1890265  
34.87416629  
103.5612749  
31.08368531  
10.42522329  
0.2879468531  
3.63524829  
16.35685991  
4.506469611  
4.550779507  
1.286200296  
0.2771787134  
0.9804239755  
1.495383821  
0.6883444759  
1.285209707  
0.7685218992  
0.8293247875  
0.9529040518  
0.478572194  
0.57766286  
0.5577163278  
0.5999041049  
0.6418757502  
0.4717640539  
0.3461895082  
0.3371180963  
0.3447263244  
0.4029005079  
0.3275865268  
0.3391909918  
0.3085501149  
0.2805935761  
0.2662508555  
0.2522701581  
0.2432623208  
0.2280554748  
0.2222109595  
0.2119039595  
0.2018080687  
0.1941304438  
0.1849372477  
0.1747250976  
0.1672532334  
0.1611366991  
0.1562591244  
0.1488090381  
0.1428229876  
0.1378123709  
0.1325272897  
0.1277950585  
0.1229147437  
0.1186786215  
0.1141615839  
0.1105937544  
0.1064221226  
0.1028585292  
0.09949704191  
0.09614067239  
0.09302035112  
0.09005692635  
0.08728214551  
0.08442309488  
0.08183224012  
0.07928750814  
0.07689603222  
0.07461287842  
0.07237458186  
0.07025741603  
0.0682121627  
0.06626929644  
0.06439392172  
0.06259000492  
0.06086136322  
0.05918971962  
0.05758603508  
0.05603333628  
0.05454919199  
0.05312397991  
0.05174300898  
0.05041327366  
0.04913649734  
0.04790221222  
0.04670526618  
0.04555451886  
0.04443972436  
0.04336862955  
0.04233147571  
0.04132982611  
0.04036205005  
0.03942263019  
0.03851701437  
0.03763976587  
0.03678867652  
0.03596854328  
0.03517189122  
0.03440119094  
0.03365425977  
0.0329315585  
0.0322312894  
0.03154896645  
0.03089034457  
0.03024868672  
0.02962840358  
0.02902533468  
0.02844068563  
0.02787042754  
0.02731849633  
0.02678239393  
0.02625927349  
0.0257552512  
0.02526090293  
0.02478207525  
0.02431642042  
0.02386357554  
0.02342265279  
0.02299484594  
0.02257692723  
0.02217078461  
0.02177521475  
0.0213901939  
0.02101446942  
0.02064975989  
0.02029207079  
0.01994631119  
0.0196066532  
0.01927841556  
0.0189567834  
0.01864317409  
0.01833703555  
0.0180381638  
0.01774691525  
0.01746288784  
0.01718658547  
0.0169154862  
0.01665177908  
0.01639172316  
0.01614128243  
0.01589441664  
0.01565327643  
0.01542012437  
0.01518993305  
0.0149668262  
0.01474617214  
0.01453152565  
0.01432157406  
0.01411778249  
0.01391768502  
0.01372118443  
0.01352872864  
0.01334162449  
0.0131583348  
0.01297780767  
0.01280154185  
0.01262897165  
0.01246092104  
0.01229674507  
0.01213459856  
0.01197762879  
0.01182177988  
0.01166961178  
0.01152122586  
0.0113762909  
0.01123333506  
0.01109376821  
0.01095649257  
0.01082201173  
0.01068931092  
0.01056084059  
0.01043445362  
0.01031126941  
0.01018848655  
0.01006990774  
0.009952023683  
0.009836812618  
0.009724389813  
0.009613292458  
0.009505577222  
0.009399165693  
0.009295108264  
0.009192246542  
0.009091420167  
0.008992110109  
0.008894915317  
0.008799617588  
0.008706147914  
0.00861512261  
0.008524461791  
0.008435115212  
0.008348636739  
0.008263404594  
0.00817940496  
0.008096242896  
0.008014749743  
0.007935087793  
0.007857456853  
0.007780926761  
0.007704345267  
0.007630262177  
0.00755709186  
0.007485223249  
0.007414212796  
0.007344282523  
0.007276556331  
0.007209508547  
0.007142624941  
0.007077820284  
0.007014407993  
0.006951025107  
0.006888818688  
0.006828700666  
0.006768473504  
0.006708719644  
0.006651890391  
0.006594019836  
0.006538338221  
0.00648280766  
0.006427981444  
0.006374750178  
0.00632174786  
0.006270463373  
0.006218275731  
0.006169687311  
0.006119046799  
0.006070355676  
0.006022679963  
0.005975082353  
0.005928497931  
0.00588243695  
0.005837581894  
0.005792801088  
0.005748636393  
0.005706027533  
0.005662711639  
0.0056214089  
0.005580015615  
0.005539098708  
0.005499507751  
0.005459940019  
0.005421545077  
0.005382691208  
0.005344735366  
0.005307547223  
0.005271302995  
0.005234452534  
0.00519892586  
0.005163527483  
0.005129610671  
0.005095730305  
0.005062167522  
0.005028116421  
0.004995909682  
0.004963387194  
0.004931215269  
0.004901031142  
0.004870057318  
0.004838584826  
0.004808975377  
0.004779665493  
0.004750169288  
0.004721269246  
0.004692841266  
0.004665007958  
0.004637492859  
0.004610080745  
0.004583279385  
0.004556667156  
0.004531143358  
0.004505358813  
0.004480046714  
0.004453863962  
0.00442971535  
0.004404910686  
0.004381453748  
0.004356998204  
0.004333889785  
0.004310976558  
0.004287749268  
0.004265365277  
0.00424320686  
0.004221480552  
0.004200226679  
0.004178170135  
0.004157283135  
0.004137399629  
0.004116350135  
0.004095877327  
0.004076805643  
0.004056868683  
0.004037559043  
0.004018527245  
0.003998411003  
0.003980614025  
0.003962229617  
0.003944042197  
0.003925755076  
0.003908811504  
0.003891042972  
0.003873841621  
0.003857478436  
0.003840765448  
0.003823621154  
0.003807225795  
0.003791226053  
0.003775365916  
0.003759456692  
0.003744799091  
0.003729302567  
0.003714233192  
0.003699572729  
0.003684553467  
0.003670487266  
0.003656156166  
0.003641590716  
0.003628209175  
0.003614844336  
0.003601409005  
0.003588039079  
0.003574798077  
0.003561605215  
0.003549303575  
0.003536672875  
0.003524308894  
0.003511591669  
0.00350046443  
0.003488198009  
0.003476055632  
0.003464120133  
0.003453619161  
0.003442092286  
0.003431178856  
0.003420328304  
0.003408867126  
0.003398697258  
0.003387798588  
0.003377695244  
0.003367295997  
0.003357109706  
0.003347730338  
0.003338346946  
0.003328175893  
0.003319016879  
0.003309607244  
0.003300181562  
0.003291232513  
0.003282698629  
0.00327366471  
0.0032649061  
0.003255975736  
0.003248181747  
0.003240122005  
0.003232279351  
0.003224321223  
0.00321648006  
0.003208460425  
0.003200791336  
0.003192649574  
0.003185360356  
0.003178422306  
0.003171802407  
0.003164343618  
0.003157629226  
0.003151088843  
0.003144000859  
0.003137601864  
0.003131312803  
0.003124937918  
0.003118543892  
0.003113174754  
0.003106476694  
0.003100626757  
0.003094824256  
0.003089430029  
0.003083809794  
0.003078716533  
0.003073325159  
0.003068482189  
0.003062536323  
0.003057712013  
0.003053203466  
0.003048444515  
0.003043653836  
0.003039547272  
0.003034319214  
0.003029853068  
0.003025725246  
0.003021521168  
0.003017575267  
0.003013897947  
0.003009690468  
0.003005846099  
0.003001910695  
0.002998519907  
0.002995371972  
0.002991265149  
0.002988269935  
0.002984781827  
0.002981975387  
0.002979409771  
0.002976080932  
0.002972805831  
0.002970384388  
0.002967941423  
0.002965678548  
0.002963409903  
0.002960523238  
0.002958212925  
0.002955868651  
0.002953905061  
0.002951760146  
0.002949973561  
0.002948055003  
0.002946534554  
0.002944193248  
0.002943172053  
0.002941972443  
0.00294040388  
0.002938694817  
0.002937929558  
0.002937202478  
0.002935664159  
0.002934607459  
0.002933939633  
0.002933227613  
0.002932307048  
0.00293168561  
0.002931605088  
0.002930962009  
0.002930930264  
0.002930332775  
0.002930401786  
0.002930403294  
