0.1159550055  
-0.006096964671  
-0.1684628036  
-0.4076113555  
-0.7453583324  
-1.184098372  
-1.705059862  
-2.269853225  
-2.825077321  
-3.309302491  
-3.661401718  
-3.829036509  
-3.776092382  
-3.488047414  
-2.9745588  
-2.268957195  
-1.424760975  
-0.5097294094  
0.4017284384  
1.236774667  
1.931935756  
2.439519382  
2.73192272  
2.803428303  
2.669414917  
2.363267704  
1.931530599  
1.428020779  
0.9076982294  
0.4210188408  
0.009373581613  
-0.2979971179  
-0.485442738  
-0.550750275  
-0.5036240848  
-0.3631668078  
-0.1547597493  
0.09322349535  
0.3525129034  
0.5975588872  
0.8074860882  
0.9673043386  
1.068384358  
1.108282014  
1.09004312  
1.021142751  
0.9122235241  
0.7757712737  
0.6248511853  
0.471985243  
0.3282203293  
0.2024122505  
0.1007245324  
0.02634695971  
-0.02057403541  
-0.04278928148  
-0.04557946525  
-0.03617968153  
-0.02300633286  
-0.0147413219  
-0.01934684123  
-0.0431083209  
-0.08982250551  
-0.1602387211  
-0.2518425995  
-0.3590328383  
-0.4736826545  
-0.5860374309  
-0.6858330187  
-0.7634998755  
-0.8112984778  
-0.8242417219  
-0.8006939721  
-0.7425774937  
-0.6551781601  
-0.5465889062  
-0.4268623602  
-0.3069895236  
-0.1978120835  
-0.1089829021  
-0.04806347787  
-0.01983301322  
-0.02584781071  
-0.06428099012  
-0.1300458279  
-0.2151954907  
-0.3095877132  
-0.4017831358  
-0.4801356491  
-0.5340079167  
-0.5550213223  
-0.5382166164  
-0.4829867256  
-0.3936207373  
-0.2793264773  
-0.1536241325  
-0.03308147086  
0.0645565347  
0.122683377  
0.128331226  
0.07452680884  
-0.0378752396  
-0.1992335306  
-0.3913056567  
-0.5887270653  
-0.7617343985  
-0.879895027  
-0.9164051171  
-0.8523792949  
-0.6804744558  
-0.4072246116  
-0.0535801951  
0.3466039939  
0.7501095369  
1.109564493  
1.379667031  
1.523550569  
1.518335797  
1.358974587  
1.059722756  
0.652913917  
0.1851354094  
-0.2886879914  
-0.7124575035  
-1.036254251  
-1.222817322  
-1.252207728  
-1.124019557  
-0.8568887135  
-0.4854561504  
-0.05531060241  
0.3832896548  
0.7819903932  
1.100284839  
1.310055903  
1.398192821  
1.367057323  
1.232899894  
1.022597274  
0.7692838065  
0.5075680863  
0.2690056601  
0.07842393054  
-0.04849207594  
-0.1061476357  
-0.0985520915  
-0.03761775186  
0.05938002461  
0.172732389  
0.283157932  
0.3742107624  
0.4339602776  
0.4558173405  
0.4385265016  
0.3854684122  
0.303494646  
0.2015505558  
0.08932664561  
-0.02388437862  
-0.1300293247  
-0.2228100591  
-0.2979359056  
-0.3531896927  
-0.3884114398  
-0.4054557392  
-0.4081415718  
-0.402152814  
-0.3948106567  
-0.3946179128  
-0.4105041569  
-0.4507502684  
-0.5216563876  
-0.6261049999  
-0.7622539416  
-0.9226315174  
-1.09390072  
-1.257491527  
-1.391183616  
-1.47156087  
-1.47708192  
-1.391376731  
-1.206263402  
-0.9239724413  
-0.5581269725  
-0.1331948339  
0.3176564328  
0.7561082937  
1.143204715  
1.444209186  
1.633097987  
1.69599776  
1.633034727  
1.458290942  
1.197858416  
0.8862823314  
0.5619226475  
0.2619366096  
0.01761345877  
-0.1492752889  
-0.2286152091  
-0.2223494134  
-0.1431659245  
-0.01176271256  
0.1468170359  
0.3071772884  
0.447274494  
0.5512912233  
0.611302477  
0.6275585385  
0.6074405134  
0.5633409622  
0.5098828201  
0.4609769893  
0.4272100354  
0.4140019723  
0.4208049595  
0.4414705406  
0.4656788834  
0.4811825795  
0.4764610777  
0.4433204559  
0.3789781956  
0.2872476227  
0.1785825436  
0.06892152092  
-0.02253170736  
-0.07627716648  
-0.07578590243  
-0.01055301194  
0.1215668707  
0.3131497197  
0.5473653276  
0.7995580745  
1.040064278  
1.237898977  
1.364783249  
1.398936251  
1.32806563  
1.151109552  
0.878480246  
0.530773721  
0.1361552784  
-0.2731700552  
-0.6648791652  
-1.010262834  
-1.287262032  
-1.482421278  
-1.591576002  
-1.619289276  
-1.577241415  
-1.481912406  
-1.351966472  
-1.205747877  
-1.05920997  
-0.9245084735  
-0.8093356886  
-0.7169616359  
-0.6468353805  
-0.5955541288  
-0.557982813  
-0.5283364004  
-0.5010888002  
-0.4716313928  
-0.4366650309  
-0.3943592309  
-0.3443401482  
-0.2875704613  
-0.2261820458  
-0.1632865617  
-0.1027828877  
-0.04913757209  
-0.007113967925  
0.01857345409  
0.02369586791  
0.005022945877  
-0.03912916498  
-0.1083864273  
-0.1999259073  
-0.3083088779  
-0.4256063995  
-0.5418732445  
-0.6459605499  
-0.726615433  
-0.7737510631  
-0.7797254275  
-0.7404526917  
-0.6561675995  
-0.5317026489  
-0.3762022639  
-0.2022729299  
-0.02466260046  
0.1413644533  
0.2817427451  
0.3851736518  
0.4443330782  
0.4565608231  
0.423960073  
0.352917405  
0.2531502534  
0.1364356702  
0.01522214832  
-0.09869055334  
-0.1952443306  
-0.266887168  
-0.3089685523  
-0.3197883336  
-0.3003680253  
-0.2540274143  
-0.185866878  
-0.1022244564  
-0.01015525244  
0.0830576967  
0.1703612903  
0.2453900899  
0.3029292317  
0.3393836068  
0.3532142626  
0.3452850677  
0.3190383902  
0.2804193187  
0.2374894798  
0.1997120781  
0.1769369697  
0.1781882931  
0.2103989046  
0.277276251  
0.3784899956  
0.5093404534  
0.6610113654  
0.8214221848  
0.9765973362  
1.112383363  
1.216270096  
1.279047516  
1.29603452  
1.267691266  
1.199501217  
1.101143513  
0.9850833949  
0.8647999337  
0.7529380859  
0.659659498  
0.5914482365  
0.5505275007  
0.534948887  
0.5392989059  
0.5558739485  
0.57611186  
0.5920284857  
0.5974369323  
0.5887695891  
0.5653982354  
0.5294440388  
0.485146031  
0.4379246684  
0.3933282224  
0.3560357579  
0.3290906239  
0.313469122  
0.3080361161  
0.3098656503  
0.3148475601  
0.3184485983  
0.3164971868  
0.3058464576  
0.284820162  
0.2533765842  
0.2129916759  
0.1663008575  
0.1165879999  
0.0672186248  
0.02112564516  
-0.01957575656  
-0.05379035582  
-0.08145268686  
-0.1033713164  
-0.1209676339  
-0.1359726115  
-0.1501561493  
-0.1651374601  
-0.1822998099  
-0.2028030394  
-0.2276542288  
-0.2577881268  
-0.294095726  
-0.3373591782  
-0.3880772687  
-0.4461990881  
-0.5108225112  
-0.5799343122  
-0.6502863749  
-0.7174872741  
-0.7763591562  
-0.8215601771  
-0.8484176909  
-0.8538581985  
-0.8372839698  
-0.8012222729  
-0.751590738  
-0.6974570698  
-0.6502554355  
-0.622488709  
-0.6260519708  
-0.6703881165  
-0.7607381238  
-0.8967667504  
-1.07183056  
-1.273071578  
-1.482436834  
-1.678574098  
-1.839433272  
-1.945272311  
-1.981662416  
-1.942058057  
-1.829487257  
-1.65702877  
-1.446855492  
-1.227837496  
-1.031903313  
-0.8895677218  
-0.8252006375  
-0.8527149776  
-0.9723419462  
-1.169075563  
-1.413168955  
-1.662796055  
-1.86870448  
-1.980370095  
-1.952929859  
-1.753994957  
-1.369402085  
-0.8070350213  
-0.098044634  
0.7048912131  
1.532262058  
2.304962965  
2.943303479  
3.376729338  
3.553037429  
3.445849479  
3.059287604  
2.429083616  
1.619797318  
0.7183230446  
-0.1756496423  
-0.9610903868  
-1.547588576  
-1.866265251  
-1.878184248  
-1.579100667  
-0.9998697858  
-0.2024194714  
0.7281824662  
1.694486076  
2.598759667  
3.35477217  
3.897657598  
4.190586409  
4.227452426  
4.031395556  
3.649594246  
3.145273829  
2.588227504  
2.045285606  
1.572058906  
1.207005623  
0.9684411118  
0.854619013  
0.8465660406  
0.9129620354  
1.016152669  
1.118297165  
1.1867565  
1.198039277  
1.139920844  
1.011666635  
0.8225833597  
0.5893448442  
0.3326557546  
0.07384623844  
-0.1680925132  
-0.3786561306  
-0.5489710172  
-0.6759320352  
-0.7614857897  
-0.8113313119  
-0.8333506216  
-0.8360706424  
-0.8274042725  
-0.8138133263  
-0.7999362798  
-0.7886325433  
-0.7813149279  
-0.7784222295  
-0.7798831874  
-0.7854534734  
-0.7948801692  
-0.8078847519  
-0.824029343  
-0.8425445326  
-0.8622138459  
-0.8813792256  
-0.8981064259  
-0.9104902661  
-0.9170446022  
-0.9170901981  
-0.9110447171  
-0.9005282506  
-0.8882336924  
-0.8775566393  
-0.8720198908  
-0.8745846049  
-0.8869562318  
-0.9090189522  
-0.9385106398  
-0.9710252242  
-1.000388215  
-1.019381046  
-1.02074236  
-0.9983181685  
-0.94818755  
-0.8695917339  
-0.7654853693  
-0.6425923519  
-0.5108951062  
-0.3825849866  
-0.2705799626  
-0.1868040388  
-0.1404687983  
-0.1366294364  
-0.1752435595  
-0.2509160177  
-0.353391158  
-0.4687542657  
-0.5811750747  
-0.6749486992  
-0.7365294265  
-0.7562637968  
-0.7295684767  
-0.6573951256  
-0.5459380754  
-0.4056479147  
-0.2497274049  
-0.09234141406  
0.0531897995  
0.1759700033  
0.2686769861  
0.3281707007  
0.3555183122  
0.3554950176  
0.3356687915  
0.3052369975  
0.2737759477  
0.2500768196  
0.2411895892  
0.2517785304  
0.2838147539  
0.3366195853  
0.4072064444  
0.4908555754  
0.5818280116  
0.6741260056  
0.7622005349  
0.8415287483  
0.9089980241  
0.9630676167  
1.003698761  
1.032092091  
1.050276944  
1.060635726  
1.065439125  
1.066473773  
1.064814864  
1.060784288  
1.054075402  
1.044020693  
1.029925606  
1.011392298  
0.9885554107  
0.962161015  
0.9334682776  
0.9039755345  
0.8750254627  
0.8473679492  
0.8207826104  
0.7938517186  
0.7639601979  
0.7275572605  
0.6806624435  
0.6195541695  
0.541530518  
0.4456197388  
0.3330958227  
0.2076900402  
0.07543613617  
-0.05588104418  
-0.1775995269  
-0.2812872871  
-0.3599052626  
-0.4088675189  
-0.4268150878  
-0.4159720754  
-0.3820147202  
-0.3334352228  
-0.2804884828  
-0.2338521504  
-0.2031877105  
-0.1958137861  
-0.2156814785  
-0.2628082971  
-0.3332575559  
-0.4196684972  
-0.5122672763  
-0.6002123889  
-0.6730805534  
-0.7222834908  
-0.7422182019  
-0.7309921921  
-0.6906397473  
-0.626811763  
-0.5480008382  
-0.4644239145  
-0.3867209656  
-0.3246461073  
-0.2859146648  
-0.2753367203  
-0.2943252762  
-0.3408155649  
-0.4095838524  
-0.4929132634  
-0.5815239954  
-0.6656663703  
-0.7362605549  
-0.7859726991  
-0.8101130515  
-0.8072676562  
-0.7795689463  
-0.7325714402  
-0.6747044903  
-0.6163353705  
-0.5685168002  
-0.5415419253  
-0.5434695632  
-0.5788016846  
-0.64750207  
-0.7445188521  
-0.8599178453  
-0.9796727945  
-1.087065085  
-1.164562545  
-1.195966879  
-1.168565329  
-1.0749997  
-0.914580415  
-0.6938288727  
-0.4261240947  
-0.1304482953  
0.1706551626  
0.4536675945  
0.696904596  
0.8831662668  
1.001869243  
1.050345747  
1.034120818  
0.9661139541  
0.8648707209  
0.7520717224  
0.6496697575  
0.5770581625  
0.5486661322  
0.5723019634  
0.6484548072  
0.7706146378  
0.9265198417  
1.10011498  
1.273895938  
1.431285661  
1.558691084  
1.646961973  
1.692071904  
1.694981718  
1.660763496  
1.597191834  
1.51306785  
1.416582763  
1.313997808  
1.208853123  
1.101809269  
0.9911184888  
0.873602015  
0.7459281949  
0.6059320659  
0.4537196171  
0.292335349  
0.1278585584  
-0.03111027634  
-0.1744962544  
-0.2921645731  
-0.3754668996  
-0.4186635389  
-0.4199788059  
-0.3821103115  
-0.3121051232  
-0.2206097436  
-0.120608626  
-0.02584325164  
0.05085765769  
0.09909353023  
0.1120562495  
0.0871957484  
0.02634181097  
-0.06469576457  
-0.1769513232  
-0.2994070486  
-0.4202219605  
-0.527937132  
-0.6125455441  
-0.6663482086  
-0.6845604322  
-0.6656598739  
-0.6114829531  
-0.5270869159  
-0.4203809213  
-0.3015435475  
-0.1822352854  
-0.07463467395  
0.00964591179  
0.06068382281  
0.07130077723  
0.03792036394  
-0.0388999809  
-0.1543601887  
-0.2997940687  
-0.4635253162  
-0.6321313018  
-0.791983134  
-0.9308669042  
-1.039486886  
-1.112638655  
-1.14988469  
-1.155623825  
-1.138522575  
-1.110361009  
-1.084428356  
-1.073658702  
-1.088745875  
-1.136485981  
-1.218565765  
-1.330983985  
-1.464198455  
-1.604021371  
-1.733167439  
-1.833285979  
-1.887212636  
-1.881151883  
-1.806480411  
-1.660906571  
-1.448813366  
-1.180719842  
-0.8719376191  
-0.540620816  
-0.2055124241  
0.1162710257  
0.4110813197  
0.6699458005  
0.8889944683  
1.0690917  
1.214794852  
1.332870174  
1.430647664  
1.514513416  
1.588781153  
1.65511885  
1.712577577  
1.75817744  
1.787895539  
1.79784962  
1.785436618  
1.750207013  
1.694315833  
1.622468723  
1.541371542  
1.458788695  
1.382374  
1.318478343  
1.271146997  
1.241467128  
1.227393525  
1.224069272  
1.224605787  
1.221188859  
1.206342367  
1.174146891  
1.121223677  
1.047332132  
0.9554884628  
0.8515825363  
0.743554537  
0.6402414864  
0.5500671072  
0.4797575022  
0.4332687803  
0.4110835483  
0.4099755839  
0.4232976369  
0.4417556516  
0.4545865012  
0.4509852766  
0.42159848  
0.3598809005  
0.2631218044  
0.1329910865  
-0.02449375315  
-0.1995963014  
-0.380022294  
-0.5524651937  
-0.7043373985  
-0.8254436199  
-0.9093558846  
-0.9542872086  
-0.9633232257  
-0.9439658911  
-0.9070476027  
-0.8651591381  
-0.8308184315  
-0.8146486087  
-0.8238302774  
-0.8610557602  
-0.9241444816  
-1.006377294  
-1.0974946  
-1.185223491  
-1.257102846  
-1.302341851  
-1.313446055  
-1.287369938  
-1.226031555  
-1.136108578  
-1.028139715  
-0.91504957  
-0.810299263  
-0.7259168651  
-0.6706809007  
-0.648725385  
-0.6587710558  
-0.694120919  
-0.7434544407  
-0.7923444889  
-0.8253230901  
-0.8282291395  
-0.7905201615  
-0.7072083107  
-0.5801151874  
-0.4182107261  
-0.2369131612  
-0.05637110213  
0.1011033043  
0.2141464761  
0.2655869664  
0.2453557237  
0.152603607  
-0.003346169481  
-0.2034555783  
-0.4208764143  
-0.6241427862  
-0.7812728722  
-0.8642392957  
-0.8531675474  
-0.7396180094  
-0.5283888337  
-0.2374808548  
0.1038974358  
0.4590855106  
0.7890284456  
1.05791217  
1.238549687  
1.31665571  
1.293288998  
1.184990375  
1.021491212  
0.8412414777  
0.6853730159  
0.5909907999  
0.5848219505  
0.6782540804  
0.8646055977  
1.119158853  
1.402074148  
1.663858287  
1.852645923  
1.922247347  
1.839754329  
1.591516209  
1.186514343  
0.6565222457  
0.05290613976  
-0.5595539342  
-1.111001951  
-1.535809688  
-1.781511699  
-1.816042023  
-1.632211497  
-1.248762456  
-0.7078567876  
-0.06938976119  
0.5969996418  
1.221025686  
1.740626504  
2.109341143  
2.301208931  
2.312603821  
2.160918111  
1.88047637  
1.516452627  
1.117817711  
0.7304135225  
0.3911583354  
0.1241402519  
-0.06098405495  
-0.1682524656  
-0.2126419993  
-0.2159057017  
-0.2017833706  
-0.1913992138  
-0.1995834044  
-0.2326552866  
-0.2879343908  
-0.3549657077  
-0.4181509673  
-0.4602791154  
-0.4663105753  
-0.4267471188  
-0.3400094911  
-0.2134179226  
-0.06260308639  
0.09055512215  
0.2211309037  
0.3049652591  
0.3224726884  
0.2618207729  
0.120966278  
-0.09177263071  
-0.3586937942  
-0.6550709975  
-0.9525113969  
-1.222771906  
-1.441444278  
-1.590945061  
-1.66238893  
-1.656106443  
-1.580797574  
-1.451539289  
-1.287020186  
-1.106508058  
-0.927050713  
-0.7613553567  
-0.6166456583  
-0.4946073374  
-0.3923354196  
-0.3040187917  
-0.2229820499  
-0.1436522484  
-0.06306492084  
0.01837592201  
0.09699675093  
0.1667650994  
0.2207830975  
0.253040326  
0.2600412189  
0.2419677646  
0.2031276331  
0.1515817908  
0.09801744785  
0.05406254359  
0.03035995602  
0.03475112222  
0.07090205958  
0.137618731  
0.2289739925  
0.335222324  
0.4443375899  
0.5439056509  
0.6230527501  
0.6740813509  
0.6935528502  
0.6826573799  
0.6468323391  
0.5947278702  
