83.12919977  
92.46610366  
110.8778272  
134.0372422  
252.0989851  
5770.237747  
25045.69426  
63576.191  
2948.992827  
59494.03131  
104866.878  
16763.52817  
23518.68289  
2596.257062  
117.417197  
28360.90666  
16586.31018  
8706.043512  
5730.894928  
3180.884249  
1972.83983  
16876.20936  
4456.080447  
4074.155078  
16628.11111  
5433.164642  
1165.45648  
3294.559051  
4654.258896  
1815.028425  
6627.181031  
4348.035065  
1010.08784  
2143.548818  
3242.465567  
4243.019402  
4423.42227  
261.9051515  
1097.714807  
2783.088867  
77.1176733  
1341.406214  
2171.09672  
500.54499  
127.3637428  
4385.513802  
2992.120246  
235.7889515  
3543.033667  
1668.921706  
927.452208  
1099.117414  
1633.985715  
1263.433041  
2212.82697  
74.53961366  
340.8775304  
1959.818041  
131.56393  
5.639095272  
1398.670154  
363.0156811  
22.56172102  
268.738111  
42.17901681  
86.93154796  
33.87008078  
93.92485111  
9.460192387  
17.64057388  
13.69494935  
14.57688977  
4.702969339  
1.859886712  
0.2823373234  
7.948067555  
0.2027043143  
0.2198438141  
0.1479813794  
1.276872893  
0.5434718604  
0.1875381832  
0.1060869103  
0.4764430336  
0.07940987955  
0.3694170262  
0.1451949751  
0.2627940605  
0.3766757999  
0.2871322422  
0.2243545896  
0.2226981884  
0.2720123647  
0.2330808523  
0.1991682461  
0.213946183  
0.2056528528  
0.190867323  
0.1924735724  
0.1791908875  
0.1918579302  
0.1740300776  
0.1746508988  
0.16942946  
0.1663985264  
0.1607333185  
0.1576277667  
0.1533370786  
0.1525280914  
0.1458286647  
0.1428964364  
0.1392750824  
0.1372375904  
0.1332479246  
0.130458916  
0.1279023371  
0.1245997146  
0.1216759293  
0.1192685441  
0.1166903826  
0.1147668104  
0.1124839075  
0.1099427466  
0.1075808369  
0.1055150952  
0.1035118045  
0.1013073349  
0.09943330769  
0.0975159241  
0.095787933  
0.09380192435  
0.09208590699  
0.09040365409  
0.08879314202  
0.08716938812  
0.08565220398  
0.08406598447  
0.08264289778  
0.08120964409  
0.07980894296  
0.07845954668  
0.07716041339  
0.07587594765  
0.07462036417  
0.07340441854  
0.07223308811  
0.07107630884  
0.0699472291  
0.06886183307  
0.06779886313  
0.06675210006  
0.06573727832  
0.06475349015  
0.06378499419  
0.06284625927  
0.06192513406  
0.0610261931  
0.06015275392  
0.05929940035  
0.05846350439  
0.05764808908  
0.05685252121  
0.05607409899  
0.05531094788  
0.05456564881  
0.05383881486  
0.0531277884  
0.0524299116  
0.0517501227  
0.05108388857  
0.05043162428  
0.04979226953  
0.04916861254  
0.04855884321  
0.04795912953  
0.0473724726  
0.04680029555  
0.04623744924  
0.04568669942  
0.04514454523  
0.04461717736  
0.04409849891  
0.04359088631  
0.04309094309  
0.04260412468  
0.04212183005  
0.04165497249  
0.04119409124  
0.04074210058  
0.04029940263  
0.03986286158  
0.03943516865  
0.03901612295  
0.0386056483  
0.03820121759  
0.03780354194  
0.03741379224  
0.03703442565  
0.03665630987  
0.03628858104  
0.03592700924  
0.03556985736  
0.03522032402  
0.03487724644  
0.03453926137  
0.03420804984  
0.03387892712  
0.03356297991  
0.03324496629  
0.03293658407  
0.03263084132  
0.03233113036  
0.03203665308  
0.03174644228  
0.03146155612  
0.03118196128  
0.03090579207  
0.03063438838  
0.03036520076  
0.03010288457  
0.02984327155  
0.02959060661  
0.02933997244  
0.0290924646  
0.02885175172  
0.02861177964  
0.02837448822  
0.02814361898  
0.02791411454  
0.02768950361  
0.02746899682  
0.02725027878  
0.02703692746  
0.02682392364  
0.02661655983  
0.02640857214  
0.02620774236  
0.02600681246  
0.02581197774  
0.02561849149  
0.02542694583  
0.02523864885  
0.02505525083  
0.0248710075  
0.0246912738  
0.02451342908  
0.02433906935  
0.0241674821  
0.0239957133  
0.02382631409  
0.02366395087  
0.02350025733  
0.02333867404  
0.02317957742  
0.02302374306  
0.02287034428  
0.02271576699  
0.02256707572  
0.02241740672  
0.02227116649  
0.02212645939  
0.02198383282  
0.02184425558  
0.02170447755  
0.02156867963  
0.02143279218  
0.02130110377  
0.02116794183  
0.02103901962  
0.02091216502  
0.02078385423  
0.02065933334  
0.02053529358  
0.02041440841  
0.0202948666  
0.02017632631  
0.02005836516  
0.01994335494  
0.01982899013  
0.01971719557  
0.01960613099  
0.01949486051  
0.01938796119  
0.0192799776  
0.0191730641  
0.01906770333  
0.01896679628  
0.01886488555  
0.01876404851  
0.01866406466  
0.01856470403  
0.01846769635  
0.01837225876  
0.01827759054  
0.01818499194  
0.01809320789  
0.01800199764  
0.01790978059  
0.0178216996  
0.01773446921  
0.0176464463  
0.01756150601  
0.01747538029  
0.01739111143  
0.01730884532  
0.01722720204  
0.01714721856  
0.01706623877  
0.01698660659  
0.01690955565  
0.01683185429  
0.0167559391  
0.01667921656  
0.01660624348  
0.01653044311  
0.01645857354  
0.01638793729  
0.01631670016  
0.01624563418  
0.01617534335  
0.01610773503  
0.01603990265  
0.01597257869  
0.01590614081  
0.01584063024  
0.01577645903  
0.01571245519  
0.0156483697  
0.01558710872  
0.01552343805  
0.01546378752  
0.01540263258  
0.01534366025  
0.01528503178  
0.01522522178  
0.01516789435  
0.01511113929  
0.01505397602  
0.01499884738  
0.01494442948  
0.01488916454  
0.014836178  
0.01478221669  
0.01472971456  
0.01467754916  
0.01462670508  
0.01457608809  
0.01452647723  
0.01447674812  
0.01442655685  
0.01437808218  
0.01432916325  
0.01428135288  
0.01423491649  
0.01418964937  
0.01414462151  
0.01409779961  
0.01405445529  
0.01401085297  
0.01396559081  
0.01392332817  
0.01388089599  
0.01383792796  
0.01379637866  
0.0137559328  
0.01371566296  
0.01367486402  
0.01363508093  
0.01359488562  
0.01355633085  
0.01351875361  
0.01348149101  
0.01344452543  
0.0134065363  
0.01337095877  
0.01333420883  
0.01329801786  
0.01326246824  
0.01322817723  
0.01319447572  
0.01316021166  
0.01312648771  
0.013092755  
0.01306121633  
0.01302870779  
0.0129972047  
0.01296431586  
0.01293351738  
0.01290297092  
0.01287360579  
0.01284392065  
0.01281436469  
0.01278470825  
0.01275604154  
0.01272672393  
0.01269827608  
0.01267264454  
0.01264584401  
0.01261772166  
0.01259100511  
0.01256494426  
0.01253874339  
0.01251437939  
0.01248876438  
0.01246378708  
0.01243900319  
0.01241426291  
0.01239101052  
0.01236633195  
0.01234455082  
0.01232081221  
0.01229956328  
0.01227782801  
0.01225568282  
0.01223385823  
0.01221348381  
0.0121906896  
0.01217177678  
0.01215170395  
0.01213176746  
0.01211095398  
0.01209389677  
0.01207336006  
0.01205555257  
0.01203631485  
0.01201736237  
0.01200047873  
0.01198346588  
0.01196566838  
0.01194876553  
0.01193263551  
0.01191610293  
0.01189995588  
0.01188441023  
0.0118683015  
0.01185345256  
0.01183881395  
0.01182481381  
0.01181022236  
0.01179603659  
0.01178198674  
0.01176897737  
0.01175637015  
0.01174282083  
0.01173015869  
0.01171786345  
0.01170651773  
0.01169401276  
0.01168228901  
0.01167207736  
0.01166058994  
0.01164865687  
0.01164072454  
0.01162826623  
0.01161973771  
0.01160919532  
0.01159991468  
0.01159101553  
0.01158201741  
0.01157260284  
0.01156637838  
0.01155751505  
0.01154933963  
0.01154074777  
0.01153376627  
0.01152661856  
0.01152056067  
0.01151289863  
0.0115070539  
0.01150050291  
0.01149492315  
0.01149057509  
0.01148432156  
0.0114788344  
0.01147353692  
0.01146988653  
0.01146616862  
0.01146127209  
0.01145725375  
0.01145380645  
0.01145021818  
0.0114468262  
0.01144578702  
0.01144258173  
0.01144009638  
0.01143803833  
0.0114355823  
0.01143397  
0.01143437245  
0.01143217727  
0.011430156  
0.01143039498  
0.0114292516  
0.0114300879  
