0.2881934342  
1.880509624  
3.38219026  
4.713909325  
5.812895844  
6.638605738  
7.175664502  
7.433790328  
7.44486062  
7.257618807  
6.930852728  
6.525993974  
6.100097303  
5.700057806  
5.358647982  
5.092710422  
4.903499503  
4.778916999  
4.697161083  
4.631174904  
4.553264922  
4.439272638  
4.271825943  
4.042357586  
3.751741735  
3.409615841  
3.032587106  
2.641663723  
2.259296885  
1.906458817  
1.600119916  
1.351428144  
1.164749864  
1.037650812  
0.961718421  
0.9240660251  
0.9092556113  
0.9013585442  
0.8858698091  
0.8512508737  
0.7899384461  
0.6987487862  
0.5787024421  
0.4343567621  
0.2728008007  
0.1024748654  
-0.06800462656  
-0.2308860111  
-0.3800635641  
-0.51156124  
-0.6236872238  
-0.7168948364  
-0.7933966115  
-0.8566145099  
-0.910533785  
-0.9590644802  
-1.00546914  
-1.051938524  
-1.099349499  
-1.147242097  
-1.194007735  
-1.237267438  
-1.27439213  
-1.3030787  
-1.321914384  
-1.330824107  
-1.331321179  
-1.326511728  
-1.320814391  
-1.319421332  
-1.327559561  
-1.349648262  
-1.388483328  
-1.444584225  
-1.515817309  
-1.597393201  
-1.682262339  
-1.761883103  
-1.827280341  
-1.87023779  
-1.884471015  
-1.866584542  
-1.816673775  
-1.738457329  
-1.638900026  
-1.527364991  
-1.414397496  
-1.310310409  
-1.223767852  
-1.160571037  
-1.12283235  
-1.108661959  
-1.112426027  
-1.125545281  
-1.137733534  
-1.13849899  
-1.118701096  
-1.071932653  
-0.9955346858  
-0.8910970582  
-0.7643723205  
-0.624607875  
-0.4834076802  
-0.3532636464  
-0.2459715773  
-0.1711466603  
-0.1350260537  
-0.139717764  
-0.1829846641  
-0.2585618688  
-0.3569703293  
-0.4666874513  
-0.5755248274  
-0.6720241297  
-0.7467057083  
-0.7930127954  
-0.8078591685  
-0.7917334222  
-0.7483686603  
-0.6840467473  
-0.606640019  
-0.524523571  
-0.4454967769  
-0.3758363374  
-0.3195905837  
-0.2781855406  
-0.2503693914  
-0.2324890157  
-0.2190520325  
-0.2034974795  
-0.1790893753  
-0.1398180596  
-0.08120998389  
-0.000958758572  
0.1006998565  
0.2209095126  
0.3544174564  
0.4940785185  
0.6315704709  
0.75825228  
0.8660412471  
0.9482241189  
1.000117265  
1.019488837  
1.006739202  
0.9648142927  
0.8988996999  
0.8159245879  
0.7239482969  
0.6314782694  
0.5467788726  
0.4772145991  
0.428658563  
0.4050123457  
0.4078548401  
0.4362628566  
0.4868261732  
0.553886162  
0.6300049769  
0.7066576861  
0.7750949112  
0.8273116793  
0.857004869  
0.8603978683  
0.8368096831  
0.7888465156  
0.722177474  
0.6448523848  
0.5662684598  
0.4958776376  
0.4418415733  
0.4098181831  
0.4020883615  
0.417163556  
0.4499520855  
0.492478529  
0.5350554057  
0.5677223136  
0.5817420698  
0.5709097899  
0.5324715972  
0.4675141422  
0.3807593293  
0.2798141767  
0.1739942679  
0.07291308839  
-0.0149265908  
-0.083335089  
-0.1292304617  
-0.1529293237  
-0.1578948444  
-0.150012058  
-0.1365187246  
-0.1247779786  
-0.1211056862  
-0.1298304622  
-0.1527296985  
-0.1889282546  
-0.2352397897  
-0.2868846357  
-0.3384500057  
-0.3849073835  
-0.4225337709  
-0.4495550439  
-0.4664309468  
-0.475713907  
-0.4815311465  
-0.488770613  
-0.5021094082  
-0.5250671611  
-0.5592247786  
-0.6037729743  
-0.6554416925  
-0.7088532859  
-0.7572278976  
-0.7933357078  
-0.8105514427  
-0.8038277185  
-0.7704647524  
-0.7105282806  
-0.6268954723  
-0.524907108  
-0.4117040365  
-0.2953606474  
-0.183938632  
-0.08461226522  
-0.002982505464  
0.05734949455  
0.09489163177  
0.110093328  
0.10493177  
0.08235632602  
0.04568923767  
-0.00191687675  
-0.05788665417  
-0.1204304744  
-0.1885442818  
-0.2618145265  
-0.3400724537  
-0.4229829706  
-0.5096397324  
-0.5982602694  
-0.6860317265  
-0.7691693268  
-0.8431694095  
-0.9032490276  
-0.944896407  
-0.9644568149  
-0.959672399  
-0.930075719  
-0.8771944209  
-0.8045180501  
-0.7172289353  
-0.6217295352  
-0.5250131453  
-0.4339495858  
-0.3545751304  
-0.2914538401  
-0.2471970189  
-0.2221883763  
-0.2145617204  
-0.2204339344  
-0.2343891661  
-0.250143007  
-0.2613410154  
-0.2623717673  
-0.2490999238  
-0.2194178226  
-0.173538421  
-0.1139677398  
-0.04517124419  
0.02703881799  
0.09631078016  
0.15662716  
0.203131909  
0.2327678072  
0.2446480574  
0.24007942  
0.2222670228  
0.1957210501  
0.1654973  
0.1363688309  
0.1120991708  
0.0949113323  
0.0852712878  
0.08199684685  
0.08268634932  
0.08437846562  
0.08432077502  
0.08069699765  
0.07316677093  
0.06309738371  
0.05342964408  
0.04817297108  
0.05160724956  
0.06732828549  
0.09730869913  
0.1411530169  
0.1957152912  
0.2551726893  
0.3115957672  
0.3559415381  
0.3793546084  
0.374558127  
0.3371340399  
0.2664612531  
0.1661605592  
0.04393829032  
-0.08915872437  
-0.2199952827  
-0.3349363794  
-0.4215510909  
-0.4701943766  
-0.4752542505  
-0.4358905077  
-0.3561806927  
-0.2446573531  
-0.1133114749  
0.02380087954  
0.152170072  
0.2584593554  
0.331955838  
0.36568416  
0.3570719199  
0.3080978278  
0.2249476654  
0.1172111765  
-0.003249294329  
-0.1236306236  
-0.2315582872  
-0.3163473397  
-0.3700146154  
-0.3879442404  
-0.3691636369  
-0.3162250925  
-0.2347331534  
-0.1326111214  
-0.01920435021  
0.09566283012  
0.2025805672  
0.2933078952  
0.3613474702  
0.4023102788  
0.4140694062  
0.3967355656  
0.352473886  
0.2852017756  
0.2001989643  
0.1036590122  
0.002210321589  
-0.0975739879  
-0.1896457259  
-0.2689037579  
-0.331542315  
-0.3752906437  
-0.399516056  
-0.405183573  
-0.3946605558  
-0.3713833704  
-0.3394251225  
-0.3030036257  
-0.2659981316  
-0.2315352432  
-0.2016986935  
-0.1774116565  
-0.1585040217  
-0.1439643735  
-0.1323292886  
-0.1221577611  
-0.1124984841  
-0.1032787061  
-0.09552244145  
-0.09135627846  
-0.09377291083  
-0.1061775458  
-0.131769688  
-0.1728596995  
-0.2302408274  
-0.3027172066  
-0.3869102353  
-0.4773832534  
-0.5671162972  
-0.6482591418  
-0.7130856757  
-0.7549927555  
-0.7693965119  
-0.7543850765  
-0.7110173174  
-0.6432129329  
-0.5572570723  
-0.4609829031  
-0.3627654045  
-0.2704636191  
-0.1904806024  
-0.1270514431  
-0.08186591488  
-0.05404728564  
-0.04048196515  
-0.03643313587  
-0.03633680877  
-0.03466517426  
-0.02674336821  
-0.009402862788  
0.01859608168  
0.05642609298  
0.101345562  
0.1491024938  
0.1945494092  
0.2323583535  
0.2577629881  
0.2672144932  
0.258870047  
0.2328598177  
0.1912830448  
0.1379532272  
0.07791179228  
0.01678767111  
-0.03991327032  
-0.08749918828  
-0.1226538083  
-0.1438034759  
-0.151230547  
-0.1469194766  
-0.1341665261  
-0.1170007335  
-0.09953209506  
-0.08529868831  
-0.07675177061  
-0.07492769187  
-0.07938673856  
-0.08839794515  
-0.09935298575  
-0.1093154665  
-0.1156155059  
-0.1163781084  
-0.1108875258  
-0.09972777181  
-0.08466645092  
-0.0683226152  
-0.05366083668  
-0.04342697512  
-0.03962541095  
-0.04314226425  
-0.0535826944  
-0.06936803097  
-0.08806079509  
-0.1068747913  
-0.1232559265  
-0.1354340584  
-0.142829231  
-0.1462286946  
-0.1476924399  
-0.1501922509  
-0.1570433721  
-0.1712214617  
-0.1946900704  
-0.2278544707  
-0.2692556696  
-0.3155561618  
-0.3618454551  
-0.4022209583  
-0.4305677451  
-0.4414157543  
-0.430758029  
-0.3966907155  
-0.3397982606  
-0.2632128186  
-0.1723454125  
-0.0743196244  
0.02281027178  
0.1109602927  
0.1829205798  
0.2331413531  
0.258316511  
0.2576856654  
0.2330309336  
0.1883725473  
0.1294086986  
0.06277349197  
-0.004782508854  
-0.06719375253  
-0.119756805  
-0.159603822  
-0.1859120011  
-0.1998474034  
-0.2042437113  
-0.2030722452  
-0.2007911937  
-0.2016430575  
-0.2090151534  
-0.2249276212  
-0.2497198075  
-0.2819785844  
-0.3187025988  
-0.3556921082  
-0.3881103995  
-0.4111441899  
-0.420682922  
-0.4139199443  
-0.3897935565  
-0.3491981355  
-0.2949232834  
-0.2313199455  
-0.1637239567  
-0.09772028459  
-0.03835369761  
0.01058892701  
0.04710603427  
0.07121691795  
0.08486336628  
0.09147701492  
0.09528337832  
0.1004570579  
0.1102806857  
0.1264513923  
0.1486792311  
0.1746430651  
0.20034034  
0.2207679026  
0.2308219153  
0.2262671577  
0.2046007733  
0.165644169  
0.111755082  
0.04760162634  
-0.0204793254  
-0.08544282325  
-0.140659536  
-0.1810117303  
-0.2037700763  
-0.2090803034  
-0.1999727249  
-0.181861326  
-0.1616096349  
-0.1463077656  
-0.1419730248  
-0.1523914151  
-0.1783223252  
-0.2172124604  
-0.2634952376  
-0.3094378757  
-0.3464045692  
-0.3663431375  
-0.363224616  
-0.3342088373  
-0.2803158309  
-0.2064898951  
-0.1210280896  
-0.03445143442  
0.04199932291  
0.09802043903  
0.1257956635  
0.1211998593  
0.0844813821  
0.02031538532  
-0.06277269766  
-0.1535317111  
-0.2394903045  
-0.3086338275  
-0.3510220933  
-0.3601169545  
-0.3336629914  
-0.2739890983  
-0.18771363  
-0.0848888765  
0.02229042756  
0.121054382  
0.199680593  
0.2489764575  
0.2634276393  
0.2418686739  
0.1875898602  
0.1078736764  
0.01301842774  
-0.08502283351  
-0.1742084928  
-0.243969458  
-0.2865675  
-0.2980504741  
-0.2787005885  
-0.2328927467  
-0.168410289  
-0.09529846922  
-0.02443505438  
0.03398130652  
0.07181396191  
0.08404383898  
0.06936498629  
0.03023359259  
-0.0276049765  
-0.09603461969  
-0.1657869396  
-0.2277695198  
-0.2743120109  
-0.3001499403  
-0.3030247595  
-0.2838239787  
-0.2462784866  
-0.196280448  
-0.1409573289  
-0.08764988102  
-0.04296559994  
-0.01203402852  
0.001933791672  
-0.002245654215  
-0.02393540158  
-0.06111385135  
-0.1109376914  
-0.170302186  
-0.2362972761  
-0.3064775125  
-0.3789154622  
-0.4520677377  
-0.524500175  
-0.5945694254  
-0.6601561009  
-0.7185221495  
-0.7663471921  
-0.799954747  
-0.8156926671  
-0.8104065915  
-0.7819283006  
-0.7294894602  
-0.6539881314  
-0.5580719388  
-0.4460108317  
-0.3233902322  
-0.1966550676  
-0.07257274331  
0.04232012495  
0.1422331364  
0.2225441234  
0.2801026115  
0.3133923474  
0.3225598632  
0.3093159174  
0.2767329558  
0.2289608889  
0.1708835724  
0.1077469636  
0.04477768454  
-0.01318036076  
-0.06199178564  
-0.09849669235  
-0.1207059736  
-0.1279118367  
-0.1207124639  
-0.1009442268  
-0.07153409882  
-0.03627906748  
0.0004465402344  
0.03402761033  
0.05999647592  
0.07443134473  
0.07436812511  
0.05817002922  
0.02583154879  
-0.02083416026  
-0.07817729044  
-0.140891014  
-0.2024141958  
-0.2555447661  
-0.2932257478  
-0.3094028645  
-0.2998697401  
-0.2629535365  
-0.199937821  
-0.1151186417  
-0.01546372829  
0.09011598785  
0.1918003367  
0.2800727958  
0.346931002  
0.386939857  
0.3979512553  
0.3813939941  
0.3420688489  
0.2874869811  
0.2268316394  
0.1696870493  
0.124721832  
0.09850522169  
0.09463710325  
0.1132931595  
0.1512664982  
0.2024788503  
0.2588870013  
0.311650687  
0.3523776833  
0.3742716415  
0.3730169638  
0.3472762505  
0.2987364825  
0.2317273743  
0.1524728851  
0.0681243957  
-0.01428242538  
-0.08876636384  
-0.1511092002  
-0.1992391804  
-0.2332529834  
-0.255113285  
-0.2680858932  
-0.2760418526  
-0.2827353315  
-0.2911789263  
-0.3031981419  
-0.3192260367  
-0.3383406311  
-0.3585212909  
-0.3770765288  
-0.3911564451  
-0.3982757539  
-0.3967685  
-0.3861086549  
-0.3670474706  
-0.3415646146  
-0.3126230772  
-0.2837767206  
-0.2586828642  
-0.2405814799  
-0.231820508  
-0.233502033  
-0.2452885685  
-0.2654182374  
-0.2909203175  
-0.3180196558  
-0.3426621291  
-0.3611028655  
-0.3704707012  
-0.3692169749  
-0.3573906556  
-0.3366886888  
-0.3102605518  
-0.2822998711  
-0.2574554764  
-0.2401585687  
-0.2339576657  
-0.2409496034  
-0.2614099429  
-0.2936757029  
-0.3343058811  
-0.3785070893  
-0.4207651193  
-0.4555894145  
-0.4782650116  
-0.4854999986  
-0.4758711983  
-0.4500073424  
-0.4104867428  
-0.361473316  
-0.3081438717  
-0.2560052715  
-0.2101983349  
-0.1748786772  
-0.1527682885  
-0.1449171569  
-0.1506993437  
-0.1680320851  
-0.1937627961  
-0.224162587  
-0.2554501436  
-0.2842676058  
-0.3080389149  
-0.3251740184  
-0.3350853768  
-0.3380455171  
-0.334907171  
-0.3267502355  
-0.3145225555  
-0.2987502161  
-0.2793635631  
-0.2556899802  
-0.226610582  
-0.1908670355  
-0.1474544698  
-0.09603926239  
-0.03731260271  
0.02680253264  
0.09313493442  
0.1574753928  
0.2150031879  
0.2608622501  
0.2908313642  
0.3019660004  
0.2931352777  
0.2653448211  
0.2218129601  
0.1677563716  
0.1099128304  
0.05584748764  
0.01312731724  
-0.01155276403  
-0.01317339891  
0.0109535707  
0.06077432057  
0.1333638774  
0.2231118846  
0.3222128743  
0.4214135683  
0.5109412477  
0.5815243718  
0.6253724236  
0.6370239818  
0.6139379774  
0.5567637892  
0.4692479973  
0.3577887462  
0.2306906097  
0.0972128006  
-0.03345281847  
-0.1531511968  
-0.2555506352  
-0.3366500914  
-0.3949556731  
-0.4313135243  
-0.4484620143  
-0.4503667186  
-0.4414677263  
-0.4259466515  
-0.4071210138  
-0.3870490026  
-0.3663908825  
-0.3445169118  
-0.3198427269  
-0.2903100902  
-0.2539325027  
-0.2093170702  
-0.1560787951  
-0.09508025255  
-0.02848052964  
0.04042354544  
0.1075278476  
0.1683553  
0.2185518017  
0.2543436279  
0.2729124494  
0.2726387942  
0.2531906483  
0.2154671453  
0.1614248001  
0.09383044641  
0.01598823475  
-0.06851357607  
-0.1560033442  
-0.242872018  
-0.3256540701  
-0.4010824725  
-0.4661378325  
-0.5181177412  
-0.5547514228  
-0.5743490815  
-0.5759835856  
-0.5596580896  
-0.5264333845  
-0.4784589991  
-0.4188989933  
-0.3517162384  
-0.2813468081  
-0.2122735308  
-0.1485650648  
-0.09343302206  
-0.04887038781  
-0.01543479308  
0.007791103809  
0.0230367113  
0.03348992311  
0.04279047627  
0.05443591481  
0.07117191045  
0.09447159553  
0.1241712137  
0.1583421134  
0.1934300367  
0.2246614134  
0.2466688379  
0.2542587296  
0.2432091424  
0.2109709832  
0.1571700587  
0.08380701264  
-0.004864843278  
-0.1027965865  
-0.2028517897  
-0.2976758672  
-0.3805843986  
-0.4463412272  
-0.4917096961  
-0.5157062448  
-0.5195194559  
-0.5061370299  
-0.4797449152  
-0.4450153312  
-0.4064012386  
-0.367555075  
-0.3309561246  
-0.297808905  
-0.2681889632  
-0.241417131  
-0.2165656249  
-0.1929883343  
-0.1707696744  
-0.1509957752  
-0.1357797002  
-0.1280238005  
-0.1309496275  
-0.1474726487  
-0.1795231389  
-0.2274532749  
-0.2896290923  
-0.3623204439  
-0.4399143681  
-0.515456842  
-0.5814486461  
-0.6307813999  
-0.6576812164  
-0.6584963455  
-0.6322108806  
-0.5805922497  
-0.5079455273  
-0.4205088236  
-0.3255833573  
-0.2305492282  
-0.1419070801  
-0.06452665523  
-0.001196630176  
0.04744040423  
0.08257860177  
0.1066310671  
0.1224226821  
0.1323590171  
0.1377269919  
0.1382729479  
0.1321530062  
0.1162784279  
0.08702261078  
0.04116638125  
-0.02306734387  
-0.1050897219  
-0.2012975076  
-0.3048703415  
-0.4060811018  
-0.4931324657  
-0.5534474081  
-0.575250191  
-0.5492272556  
-0.4700311017  
-0.3373873878  
-0.156622165  
0.06149877027  
0.3016427775  
0.5454053821  
0.7732457233  
0.966628227  
1.110087993  
1.192960515  
1.210542493  
1.164551757  
1.062817731  
0.9182642017  
0.7473020474  
0.5678498402  
0.3972170016  
0.2501036914  
0.1369570241  
0.06287366822  
0.02716375153  
0.02363081967  
0.04153230945  
0.06709870134  
0.08543769004  
0.08258266483  
0.04744613047  
-0.02658698526  
-0.1406293884  
-0.289970155  
-0.464519529  
-0.6499799159  
-0.8295969736  
-0.9862626505  
-1.104689903  
-1.173373491  
-1.186052444  
-1.14248929  
-1.048456333  
-0.9149452436  
-0.7567069408  
-0.5903619385  
