-0.0679975673  
-1.62401806  
-3.087218924  
-4.374503002  
-5.420141104  
-6.181819229  
-6.643809537  
-6.81693324  
-6.735487912  
-6.451664146  
-6.028319456  
-5.531139816  
-5.021200848  
-4.548846944  
-4.14952291  
-3.841908165  
-3.628343102  
-3.497257033  
-3.427071006  
-3.390890574  
-3.361287983  
-3.314531652  
-3.233726197  
-3.110574879  
-2.945625102  
-2.747147113  
-2.528898586  
-2.307236918  
-2.098029958  
-1.913871913  
-1.762006282  
-1.643237489  
-1.551958041  
-1.477250786  
-1.40484828  
-1.319631943  
-1.208257486  
-1.061505528  
-0.8759842339  
-0.6549267762  
-0.4079727398  
-0.1499541648  
0.1011150032  
0.3265598549  
0.5096921081  
0.6382126412  
0.7060183448  
0.7141552173  
0.6708084294  
0.5903213771  
0.491403113  
0.3947719094  
0.320558469  
0.2858168509  
0.3024684207  
0.3759238095  
0.5045448236  
0.6799906032  
0.8883658137  
1.111998147  
1.331604139  
1.528547123  
1.686916051  
1.795173144  
1.84719255  
1.842621068  
1.786535765  
1.688515128  
1.561273509  
1.419051163  
1.275983628  
1.144636814  
1.034867848  
0.9531002723  
0.9020640151  
0.8809646  
0.8860145274  
0.9112218768  
0.9493183216  
0.9926933663  
1.034248255  
1.068069981  
1.089893333  
1.097317142  
1.08979575  
1.068432011  
1.035625516  
0.9946320302  
0.9490965118  
0.9026026902  
0.8582964762  
0.8185931224  
0.7849947386  
0.7580102472  
0.7371677787  
0.7211147397  
0.7077702864  
0.6945306528  
0.6785091587  
0.6567989678  
0.6267603098  
0.5863166684  
0.5342567259  
0.4705143323  
0.3964020406  
0.3147537878  
0.2299398972  
0.1477047423  
0.0747883942  
0.01833799532  
-0.01487714094  
-0.01938571004  
0.00805081285  
0.06760461667  
0.1558190437  
0.2654392785  
0.3857483506  
0.5034344475  
0.6039572344  
0.6732553033  
0.6996065019  
0.675359558  
0.5982696885  
0.4721979931  
0.3069995292  
0.1175789263  
-0.07784718398  
-0.2600186813  
-0.4111703809  
-0.5174303998  
-0.570740985  
-0.5699729426  
-0.5210679614  
-0.4361367625  
-0.3316486914  
-0.2259784204  
-0.136666979  
-0.07783093446  
-0.05810680927  
-0.07945799786  
-0.1370149722  
-0.2199780306  
-0.3134147872  
-0.4006773345  
-0.4660386337  
-0.4971550477  
-0.4869542236  
-0.4346862976  
-0.3459911309  
-0.2319900723  
-0.1075845191  
0.01077271344  
0.1074644224  
0.1698889368  
0.190113259  
0.1657797397  
0.1001464788  
0.001324845213  
-0.1191467133  
-0.2481284113  
-0.3728041814  
-0.4824022363  
-0.569470029  
-0.6305239517  
-0.6660362311  
-0.6798013221  
-0.6778333682  
-0.667023773  
-0.6537856112  
-0.6429239916  
-0.6369078889  
-0.6356285409  
-0.6366518666  
-0.6358889951  
-0.6285157729  
-0.6099622959  
-0.5767802553  
-0.5272296888  
-0.4614956354  
-0.3815189364  
-0.2905040034  
-0.1922373279  
-0.09037183795  
0.01215850969  
0.1134592998  
0.2126655168  
0.3096120866  
0.4042554753  
0.496003516  
0.5831060526  
0.6622798567  
0.7286960614  
0.776367514  
0.7989207619  
0.7906363594  
0.7475804184  
0.6686201407  
0.5561196148  
0.4161549929  
0.2581796942  
0.09412055942  
-0.06294164248  
-0.2003607615  
-0.307511518  
-0.3771397817  
-0.4062580745  
-0.3964351093  
-0.353436027  
-0.2862661787  
-0.2057688923  
-0.1229994434  
-0.04763174513  
0.01335654267  
0.05653487654  
0.08226730672  
0.09436567026  
0.09920784307  
0.1044901781  
0.1178249049  
0.1454033201  
0.1909481298  
0.2550792107  
0.335188567  
0.4258097086  
0.5193867255  
0.6073181135  
0.6810941887  
0.7333639487  
0.7587858053  
0.7545803527  
0.7207259578  
0.6598275179  
0.576704712  
0.4777820471  
0.3703856447  
0.2620175672  
0.1596985109  
0.06942594658  
-0.004223241495  
-0.05832044099  
-0.09166123417  
-0.1046779026  
-0.09924222823  
-0.07834561802  
-0.04572583219  
-0.005449976041  
0.0384877598  
0.08252834857  
0.1238267535  
0.160423206  
0.1912949143  
0.2162796275  
0.2359067667  
0.2511398998  
0.2630982278  
0.2727741319  
0.2808109373  
0.2873632977  
0.2920652949  
0.2941191927  
0.292486712  
0.2861625961  
0.2744899297  
0.2574638526  
0.2359765888  
0.2119443024  
0.1882877396  
0.1687354703  
0.1574596586  
0.1585694813  
0.1755125108  
0.210466084  
0.2637967574  
0.3336841544  
0.4159709569  
0.5043145097  
0.5906256037  
0.6658028184  
0.7206703517  
0.7470427113  
0.7387675666  
0.6926312519  
0.6089858788  
0.4920072555  
0.3495047322  
0.1922917654  
0.03314187154  
-0.1145471318  
-0.238252903  
-0.3278018689  
-0.3766277603  
-0.382644683  
-0.3485973075  
-0.281816518  
-0.1933774761  
-0.09676120858  
-0.006164146505  
0.06531335551  
0.1073539208  
0.1137594389  
0.08322771041  
0.01946763989  
-0.06937680434  
-0.1719051444  
-0.2750792036  
-0.366037229  
-0.4338495469  
-0.4709564454  
-0.4740931144  
-0.4445833864  
-0.3879714161  
-0.3130806976  
-0.2306425277  
-0.1517102635  
-0.08610525687  
-0.04109999645  
-0.02051611056  
-0.02435156836  
-0.04894263611  
-0.08763548576  
-0.1318140791  
-0.1721501768  
-0.1998808748  
-0.2079399312  
-0.1918180779  
-0.1500404805  
-0.08425671946  
0.001061863581  
0.0992225457  
0.2021201254  
0.3011302177  
0.3879765748  
0.4554746739  
0.4980841323  
0.512246676  
0.4965100375  
0.4514606242  
0.3795356019  
0.2847409697  
0.1723542261  
0.04862817607  
-0.07948371278  
-0.2045749143  
-0.3190408413  
-0.4153554993  
-0.4863997314  
-0.5258557488  
-0.5286639939  
-0.4915108845  
-0.4133050158  
-0.2955763561  
-0.1427315627  
0.03790759607  
0.2363153377  
0.4402554356  
0.6360421731  
0.8095213335  
0.9471819353  
1.03731345  
1.071086114  
1.043431818  
0.9536557923  
0.8056786468  
0.607906287  
0.3727068393  
0.1155469822  
-0.1461359775  
-0.3942534516  
-0.6114454947  
-0.7824313602  
-0.8952170024  
-0.9420558551  
-0.9201039949  
-0.8316868175  
-0.6841605846  
-0.4893560522  
-0.2626283544  
-0.02158015664  
0.2154458173  
0.4309831617  
0.6100072633  
0.7412830601  
0.8183650907  
0.8400858609  
0.8104916257  
0.7381943907  
0.6352087535  
0.5154069561  
0.3927968403  
0.2798376076  
0.1860422993  
0.1170478374  
0.07429892884  
0.05536737486  
0.05486005585  
0.06575027253  
0.0809012381  
0.09452438097  
0.1033151292  
0.1070647856  
0.1086259664  
0.1132588699  
0.1274302467  
0.1573061415  
0.207195405  
0.2782343111  
0.3675628562  
0.4681773129  
0.5695065617  
0.6586659995  
0.7221878528  
0.7479864513  
0.7272064516  
0.6556863373  
0.5347635687  
0.3713058175  
0.1769250121  
-0.03346915454  
-0.2435843544  
-0.4377926729  
-0.6030121504  
-0.7301115818  
-0.814645512  
-0.856815788  
-0.8607260116  
-0.8330619202  
-0.7815073466  
-0.7131564722  
-0.6332562576  
-0.5445025582  
-0.447007851  
-0.3389506098  
-0.21775199  
-0.08153916394  
0.06942658291  
0.2316644942  
0.3980037743  
0.5578745513  
0.6983812089  
0.8060097333  
0.8687100588  
0.8780090714  
0.8307644172  
0.7302380604  
0.5862454944  
0.4143116551  
0.2338946995  
0.06591271909  
-0.07005930123  
-0.1585184943  
-0.1902656164  
-0.1637787568  
-0.08551835657  
0.03091917206  
0.1666831328  
0.3003219466  
0.4108360598  
0.4806773326  
0.498252717  
0.4595792161  
0.3688390082  
0.2377674055  
0.08395503008  
-0.07165881303  
-0.2077420242  
-0.3055299983  
-0.3513682475  
-0.338481745  
-0.2677421897  
-0.1473614044  
0.008388591259  
0.1812068736  
0.3512033168  
0.4993957515  
0.6099174762  
0.6716542447  
0.6791846861  
0.6329522556  
0.5387669203  
0.4067854496  
0.2501700216  
0.08362784598  
-0.07800081046  
-0.2209738694  
-0.3336611244  
-0.4072965364  
-0.4365052665  
-0.4196144561  
-0.3587665243  
-0.2598192479  
-0.1320096035  
0.01265371264  
0.1602746518  
0.2962373832  
0.4065595108  
0.4793435116  
0.5061401893  
0.4830484322  
0.4113764043  
0.2977144998  
0.1533635263  
-0.006861350945  
-0.1663275547  
-0.3085711851  
-0.4193120047  
-0.4881984259  
-0.5100445688  
-0.4853480367  
-0.4200208822  
-0.3243691016  
-0.2114690633  
-0.09520416674  
0.01174873903  
0.0996549944  
0.1629337656  
0.2006642208  
0.2163325612  
0.2168906695  
0.2113038805  
0.2088534331  
0.2174657141  
0.24235791  
0.2851876044  
0.3438288709  
0.4127716194  
0.4840596115  
0.5485677208  
0.597423698  
0.623339358  
0.6216602768  
0.5910084118  
0.5334515864  
0.4542143834  
0.3610043315  
0.2630569798  
0.1700289775  
0.09086238815  
0.03273520498  
0.0001784102359  
-0.005560672893  
0.01314017476  
0.05028786966  
0.0966529755  
0.1405395577  
0.1689274766  
0.1689369722  
0.1294849245  
0.04299985575  
-0.09304094383  
-0.2749698207  
-0.4923984649  
-0.7284970655  
-0.961152482  
-1.164984356  
-1.314072316  
-1.385091831  
-1.3604991  
-1.231308885  
-0.9990507708  
-0.6765491019  
-0.2873183067  
0.1364564926  
0.5571897654  
0.9360401459  
1.237430345  
1.43334658  
1.506834492  
1.454180647  
1.28547401  
1.023413723  
0.7005155141  
0.3550738132  
0.02641284476  
-0.2499105111  
-0.4463345094  
-0.5463548319  
-0.5460673486  
-0.4539928575  
-0.2893040738  
-0.07872639154  
0.1473609719  
0.3590687209  
0.5307679322  
0.6439991919  
0.6891556249  
0.6657904161  
0.5816322093  
0.4505475289  
0.2898758705  
0.1176032757  
-0.05016295481  
-0.2010337718  
-0.327270335  
-0.4257505799  
-0.4970914249  
-0.544191359  
-0.5705687911  
-0.5788503372  
-0.5697493088  
-0.5417415604  
-0.4914917055  
-0.4149312749  
-0.3087454435  
-0.1719206226  
-0.007005591196  
0.1792376583  
0.3760014027  
0.5694496257  
0.7444864625  
0.886972625  
0.9860270232  
1.035967576  
1.037540636  
0.9981169029  
0.93080025  
0.8524951279  
0.7812264653  
0.733125633  
0.7195699599  
0.7449772391  
0.8056423323  
0.8898710042  
0.9794246502  
1.052130007  
1.085243938  
1.059096839  
0.9604368028  
0.7849587445  
0.5385964984  
0.2373731313  
-0.09420937136  
-0.426029678  
-0.7260407363  
-0.9642907715  
-1.116703964  
-1.168098048  
-1.114039439  
-0.9613092127  
-0.7269470436  
-0.4360437276  
-0.1186150938  
0.1940074457  
0.4727737867  
0.6940627517  
0.8419807894  
0.9096029216  
0.8990489414  
0.8204802656  
0.69021512  
0.5282668171  
0.3556599371  
0.1918675269  
0.052677767  
-0.05128905567  
-0.1152996135  
-0.1404395951  
-0.1328678262  
-0.102524975  
-0.06152696909  
-0.02245067569  
0.003282714217  
0.006761139814  
-0.01744342121  
-0.07074660363  
-0.1504662858  
-0.2501775146  
-0.3604322427  
-0.4697894969  
-0.5660486677  
-0.6376141672  
-0.6748600593  
-0.6713967208  
-0.6250927395  
-0.5387467746  
-0.4202675617  
-0.2822944493  
-0.1412051366  
-0.01554306733  
0.0760265832  
0.1170374807  
0.09555350981  
0.0061992462  
-0.1484283876  
-0.3572470312  
-0.6012413019  
-0.8551325781  
-1.090049172  
-1.276897038  
-1.390025532  
-1.410688516  
-1.329787397  
-1.14946249  
-0.883258595  
-0.5547749845  
-0.1949480378  
0.1616767086  
0.4811648009  
0.734322302  
0.9001521073  
0.9681599009  
0.9392398069  
0.8250485602  
0.6460373476  
0.4284727456  
0.2009220491  
-0.009284328317  
-0.1791449241  
-0.2922465234  
-0.3399789835  
-0.3216597584  
-0.2436594402  
-0.1177901026  
0.04075751016  
0.2155776587  
0.3910275854  
0.5537733801  
0.6937755661  
0.8046819303  
0.883660079  
0.9308244508  
0.9483978468  
0.939803082  
0.908852871  
0.8591480522  
0.7937873356  
0.7153891322  
0.6263742256  
0.5294380815  
0.4280596535  
0.3269076941  
0.2320076431  
0.1505672918  
0.09040807984  
0.05903835845  
0.06246198613  
0.103893747  
0.1826094703  
0.2931485502  
0.425085415  
0.5635132557  
0.6902827301  
0.7859181858  
0.8320270369  
0.813895866  
0.7229269857  
0.5585296913  
0.3291452585  
0.05217564706  
-0.247277146  
-0.5387844342  
-0.7898423218  
-0.9696152979  
-1.052724239  
-1.022563138  
-0.8737166365  
-0.6131232537  
-0.2597937959  
0.1568991545  
0.6001834164  
1.029757856  
1.406097182  
1.694698766  
1.869761005  
1.916887909  
1.834526244  
1.633988326  
1.338091055  
0.9785779355  
0.5926126222  
0.2187467945  
-0.1072264343  
-0.356068897  
-0.5081584442  
-0.5554732772  
-0.5022752542  
-0.3644053835  
-0.1672458674  
0.05744177953  
0.2754572079  
0.4544309544  
0.5679032023  
0.5987097835  
0.541211637  
0.4020694488  
0.1994070823  
-0.03955116782  
-0.2820831607  
-0.4943427123  
-0.6459175939  
-0.7139319856  
-0.686125697  
-0.5624724473  
-0.3551165128  
-0.08665128763  
0.212980216  
0.510500551  
0.7736171146  
0.9750241888  
1.095522557  
1.125863751  
1.06712654  
0.9296829898  
0.7310080244  
0.4927694185  
0.2376858585  
-0.01335343264  
-0.2434995195  
-0.4412424114  
-0.6007151958  
-0.7211029954  
-0.8053956719  
-0.8587981599  
-0.8871405369  
-0.8955776317  
-0.8877881961  
-0.8657528557  
-0.8300754072  
-0.7806987101  
-0.7178227735  
-0.6427714379  
-0.5586140115  
-0.4703840587  
-0.3848308854  
-0.3097364236  
-0.2528996338  
-0.2209620834  
-0.2182867032  
-0.2460697528  
-0.3018629703  
-0.3795857399  
-0.4700597376  
-0.5620037081  
-0.6433537117  
-0.7027423594  
-0.7309415005  
-0.722069254  
-0.6744203919  
-0.5908114398  
-0.4784020678  
-0.348015108  
-0.2130359616  
-0.08801027235  
0.01292254369  
0.0775835017  
0.09715512042  
0.06728257843  
-0.01124199542  
-0.1322915583  
-0.2847567454  
-0.4534164499  
-0.6202784419  
-0.7662645084  
-0.8730843995  
-0.9251314833  
-0.9111821042  
-0.825734833  
-0.6698239221  
-0.4512026667  
-0.1838496142  
0.1131845991  
0.417505354  
0.7055248538  
0.9548488323  
1.146643768  
1.267746089  
1.312258562  
1.282414508  
1.188558351  
1.048170861  
0.8839775694  
0.7213116811  
0.5849872885  
0.4960688032  
0.4689442131  
0.5091209119  
0.6121078198  
0.7635944517  
0.9410168238  
1.116357905  
1.259857847  
1.344174061  
1.348393395  
1.261327514  
1.083567811  
0.8279645435  
0.5183892456  
0.1869070297  
-0.1302655148  
-0.39748032  
-0.5843691826  
-0.6698686916  
-0.6449782277  
-0.5138421227  
-0.2930020939  
-0.008949134325  
0.3056509748  
0.6164846906  
0.8921807043  
1.10829558  
1.250111665  
1.313893655  
1.306458969  
1.243231811  
1.145129953  
1.034845255  
0.9331212875  
0.8556042086  
0.8107401217  
0.7989779006  
0.8133331282  
0.8411356191  
0.866612629  
0.8738456314  
0.8496063862  
0.785625555  
0.679968435  
0.537337952  
0.3683302861  
0.1877958321  
0.01259178584  
-0.1408822185  
-0.2590308965  
-0.3329293887  
-0.3594941945  
-0.3418102936  
-0.2886366122  
-0.213168511  
-0.1312577736  
-0.05934633746  
-0.01235603226  
-0.001805700685  
-0.03436417284  
-0.1109862424  
-0.2267461911  
-0.371352745  
-0.5303099304  
-0.6865736492  
-0.8225329113  
-0.9220878314  
-0.9725793301  
-0.9663681143  
-0.9018563871  
-0.7838613956  
-0.6232687602  
-0.4360429883  
-0.2416819761  
-0.06132062006  
0.08433051919  
0.1769825916  
0.2025184979  
0.1523401132  
0.02421688271  
-0.1774020658  
-0.4416277495  
-0.7518593111  
-1.086960942  
-1.422786721  
-1.73396596  
-1.995840587  
-2.186417181  
-2.288195162  
-2.289707818  
-2.186627516  
-1.982280063  
-1.687484321  
-1.31968561  
-0.9014168634  
-0.458248742  
-0.01641372219  
0.3996078178  
0.7692597598  
1.077591849  
1.316234471  
1.483575942  
1.584158386  
1.627400604  
1.625872649  
1.593387451  
1.543186147  
1.486468845  
1.431437257  
1.382924104  
1.342595802  
1.309599171  
1.28148304  
1.255198744  
1.227990619  
1.198031572  
