6.96230574  
7.847260261  
10.02428475  
16.77147161  
79.52800539  
3633.410949  
64961.27139  
30866.3369  
6416.258722  
8873.250144  
8176.257226  
3714.422699  
26113.01417  
9978.440272  
2091.442328  
23.96886156  
14257.89123  
145.7095451  
18696.32363  
31429.80034  
8170.987556  
1816.961264  
3013.428313  
24536.55184  
1892.421795  
14911.97641  
22934.96736  
9360.315029  
5799.371126  
14216.63914  
7554.900902  
7036.950819  
7290.785854  
9945.354942  
10192.97114  
4741.079  
1693.477542  
19480.35356  
4620.495898  
3157.223474  
1877.482588  
7658.486118  
9445.076542  
3810.246315  
2801.278667  
4754.653626  
3333.708514  
1201.221787  
321.5504389  
8811.409085  
2100.228355  
1475.948419  
709.4993566  
3049.456307  
8559.063199  
1402.306095  
5794.637036  
393.0666213  
67.56397454  
3622.161777  
395.0423863  
255.2150902  
2712.672086  
139.8315257  
545.1912268  
205.0258255  
73.78761668  
1.737543973  
42.62354612  
44.21620241  
10.88144873  
1.159038908  
18.87054449  
1.852086975  
0.2378600205  
1.393393514  
11.73500359  
6.983892856  
3.598163042  
5.413697862  
0.8019956615  
0.8178676207  
1.126515558  
0.9695632223  
1.397224236  
0.8772872589  
0.925505732  
1.160210265  
0.7959533101  
0.7000416343  
0.7503927698  
0.7889914208  
0.6297339297  
0.6053323422  
0.6270424184  
0.6122138667  
0.575742206  
0.5290978351  
0.5097837124  
0.498800132  
0.475081852  
0.459482163  
0.4452429261  
0.4296417337  
0.411700565  
0.3986923957  
0.3865697571  
0.3744504899  
0.3636144063  
0.3515568046  
0.3422830045  
0.3328196241  
0.3225222616  
0.3146013385  
0.305424095  
0.2977911691  
0.2903945918  
0.2825637252  
0.2757649277  
0.2691066034  
0.2626146824  
0.256441609  
0.2505977669  
0.2448501503  
0.2393946686  
0.2340887882  
0.2290227092  
0.2242351921  
0.2194525085  
0.2149137585  
0.2105765385  
0.2063442117  
0.2022170792  
0.1982805089  
0.1944629712  
0.1907862108  
0.1871981282  
0.1837550441  
0.1804051318  
0.1771539358  
0.1739946812  
0.1709510623  
0.1679985153  
0.1651267552  
0.1623351928  
0.1596170893  
0.1569875801  
0.154425562  
0.151933533  
0.1495163842  
0.1471594867  
0.144875259  
0.1426452164  
0.1404707039  
0.1383525276  
0.136290106  
0.1342794199  
0.13232545  
0.1304156461  
0.1285532746  
0.1267364918  
0.1249631723  
0.1232354771  
0.1215452378  
0.119895549  
0.1182848043  
0.1167121462  
0.1151719114  
0.1136742518  
0.1122010745  
0.1107686876  
0.1093632095  
0.1079876305  
0.1066415676  
0.1053239928  
0.1040424925  
0.1027798421  
0.1015458826  
0.1003432136  
0.09915848281  
0.09800253948  
0.09686586924  
0.09575216564  
0.09466814367  
0.0935962854  
0.09255451375  
0.09152424034  
0.09052185447  
0.08953651865  
0.08856734107  
0.08761421921  
0.08668961537  
0.08577603177  
0.08487422764  
0.08399439792  
0.08313370129  
0.08228556691  
0.08145185469  
0.08063680943  
0.07982973209  
0.07904256517  
0.07826928171  
0.07750876211  
0.07676133076  
0.07602993557  
0.07530544434  
0.07459813356  
0.07389582846  
0.07321485745  
0.07253794156  
0.07187773708  
0.07122519497  
0.07058714711  
0.06995508376  
0.0693305409  
0.06872712471  
0.06812379327  
0.06753380515  
0.06695526089  
0.06638709803  
0.06582000377  
0.06526814044  
0.06472271593  
0.06418806832  
0.0636576432  
0.06314075578  
0.06262716072  
0.06212060943  
0.06162547757  
0.0611417614  
0.06065781587  
0.06018054329  
0.0597140871  
0.05925475925  
0.05880441193  
0.05835520932  
0.05791418768  
0.05748353421  
0.05705240499  
0.05663522105  
0.05622082292  
0.05581068793  
0.05540484596  
0.05500995703  
0.05461985193  
0.05423022558  
0.05385182777  
0.05347336615  
0.05309987187  
0.0527367818  
0.05237781593  
0.05202329195  
0.05167249886  
0.05132906142  
0.0509836066  
0.05064630481  
0.05031297881  
0.04998931958  
0.0496662321  
0.04934617975  
0.04903057566  
0.04872124953  
0.04841337816  
0.0481112898  
0.04781652691  
0.04751875553  
0.04722829806  
0.0469406192  
0.04665729296  
0.04638041004  
0.04610349737  
0.04583227279  
0.04556226865  
0.0452960273  
0.04503621291  
0.04477735783  
0.04451942553  
0.04426712467  
0.04402174318  
0.04377119704  
0.04353075467  
0.04329174755  
0.04305175056  
0.04282011716  
0.04258689527  
0.0423604709  
0.04213809888  
0.04191462381  
0.04169325505  
0.04147443752  
0.04126052969  
0.0410508015  
0.04083720575  
0.04063021073  
0.04042379526  
0.04022506147  
0.04002576603  
0.03982623243  
0.0396320972  
0.03943694858  
0.039247802  
0.03906051351  
0.03887377928  
0.0386895582  
0.03850909781  
0.0383305473  
0.03815177496  
0.03797749515  
0.03780647733  
0.03763145475  
0.0374648143  
0.03729754893  
0.03713229526  
0.03696927584  
0.03680617122  
0.03664875705  
0.03649210214  
0.03633360866  
0.03617992039  
0.03602979761  
0.03587702353  
0.03572808244  
0.03558332476  
0.03543539424  
0.03529400846  
0.03515012849  
0.03500628879  
0.03487118599  
0.03473698555  
0.03460078952  
0.03446271269  
0.03433179476  
0.03419808877  
0.03407157868  
0.03394497834  
0.03381480493  
0.03369037046  
0.03356815148  
0.03344591483  
0.03332504679  
0.03320297332  
0.03308548482  
0.03297096806  
0.03285637991  
0.03273895424  
0.03262597721  
0.03251514142  
0.03240660566  
0.03229416333  
0.03218923825  
0.03208304364  
0.03197409876  
0.03187327631  
0.03176615788  
0.03166945184  
0.03156641154  
0.03146667761  
0.03136881071  
0.03127418294  
0.03117327164  
0.03108048411  
0.03098634247  
0.03089425792  
0.03080377385  
0.030713976  
0.03062404052  
0.03053389143  
0.03044722041  
0.0303608979  
0.03027624791  
0.03019065503  
0.03010977715  
0.03002544245  
0.02994460944  
0.02986262301  
0.02978464618  
0.02970675615  
0.0296280177  
0.02955174003  
0.0294779643  
0.02940069866  
0.02932791368  
0.02925737599  
0.02918290964  
0.02911166549  
0.02904118087  
0.02897360991  
0.02890344851  
0.02883599837  
0.02876928241  
0.02870543824  
0.02863888148  
0.02857362195  
0.0285110122  
0.02844811643  
0.02838832616  
0.0283253015  
0.02826587205  
0.02820566203  
0.02814972001  
0.02808997904  
0.02803174976  
0.0279768288  
0.02792252292  
0.02786841615  
0.02781470441  
0.02776053734  
0.02770797172  
0.02765809935  
0.02760618673  
0.02755331843  
0.02750495866  
0.02745680289  
0.02740952059  
0.02735857691  
0.02731475749  
0.02726909217  
0.02722287155  
0.02717754227  
0.02713488713  
0.0270912299  
0.02704995295  
0.02700572462  
0.02696492502  
0.02692397803  
0.02688610036  
0.02684824887  
0.02681067909  
0.02676852003  
0.0267335159  
0.02669623587  
0.02665998967  
0.02662549342  
0.02658932632  
0.02655650266  
0.02652151081  
0.02649023024  
0.02645806626  
0.02642633868  
0.02639561219  
0.02636377818  
0.0263355884  
0.02630405716  
0.02627722736  
0.02624891036  
0.02622302203  
0.02619643518  
0.02617113391  
0.02614534488  
0.02611904059  
0.02609518358  
0.02607430948  
0.02604740731  
0.02602788039  
0.02600462818  
0.02598308275  
0.02596249159  
0.02594370026  
0.02592335719  
0.02590276393  
0.02588496128  
0.02586763983  
0.02584955713  
0.02583347431  
0.02581740065  
0.02580005393  
0.02578584708  
0.02577080632  
0.02575736443  
0.02574379223  
0.02573266499  
0.02571980269  
0.02570687015  
0.02569477311  
0.0256835292  
0.02567606045  
0.02566403235  
0.0256567911  
0.02564702607  
0.0256410112  
0.02563150172  
0.02562641687  
0.02562004484  
0.02561479688  
0.02560879111  
0.02560385775  
0.02559998471  
0.02559500975  
0.02559275314  
0.02558995426  
0.02558863968  
0.02558639361  
0.02558803487  
0.02558933952  
