3314.589306  
3591.907704  
4193.841453  
5417.59951  
7636.745308  
27318.80945  
25484.97056  
22208.71858  
54003.76921  
113874.0133  
6973.124143  
11407.90215  
2015.383406  
2955.098812  
5818.701872  
3739.887554  
27433.72194  
2396.176368  
12531.72569  
4382.573823  
2994.668344  
3163.864635  
3938.004942  
3580.168019  
7199.05801  
7204.965341  
11761.93571  
2443.437866  
23239.51679  
2228.010464  
4398.187811  
4867.675436  
7399.011208  
3569.246309  
8292.072436  
1709.300889  
3352.06781  
115.8058499  
3931.561715  
982.0492982  
4926.666811  
1031.79077  
3432.343144  
3560.24098  
3452.155426  
951.3224042  
2000.001309  
366.3785109  
1722.699242  
215.1569914  
1031.601248  
196.7550529  
2381.822502  
839.9864467  
1657.114779  
1904.099643  
1444.71048  
275.5927968  
108.2197244  
746.9953355  
28.78315206  
162.4280313  
978.669301  
365.721968  
330.5316372  
13.04389316  
87.11440068  
60.70827122  
26.31527302  
13.0580979  
1.69656217  
35.49162856  
9.774918233  
17.57274302  
11.56634504  
9.379506891  
7.831996072  
2.67961532  
2.041493679  
2.472841983  
2.950560801  
3.314147194  
2.810002911  
2.758742126  
2.009824803  
1.906822314  
2.176600391  
1.547963869  
1.4601562  
1.252513019  
1.297126965  
1.356305965  
1.372720462  
1.232840109  
1.115800198  
1.139139667  
1.000239232  
1.047384108  
0.981504241  
0.9062871191  
0.8830215862  
0.8623316128  
0.8071691658  
0.8002864917  
0.767668801  
0.7416901671  
0.7212399811  
0.6978861048  
0.6751639341  
0.6525997796  
0.6332048766  
0.6194169956  
0.602577628  
0.5852048852  
0.5703252725  
0.554911462  
0.541494651  
0.5278728848  
0.5156853415  
0.5038533361  
0.4921220098  
0.4817242399  
0.4712162595  
0.4616531183  
0.452027427  
0.4428691339  
0.4342452887  
0.4256101295  
0.4174564714  
0.4096782036  
0.40225623  
0.3950449546  
0.388078501  
0.3813587832  
0.3748619714  
0.368508108  
0.3624635079  
0.356495424  
0.3508291348  
0.3452611931  
0.3399232626  
0.3346991233  
0.3296645989  
0.3247499222  
0.319984294  
0.315362121  
0.3108403475  
0.3064525626  
0.3021807538  
0.2980283872  
0.2939842694  
0.2900365028  
0.2861912133  
0.2824448303  
0.2787706123  
0.2752037845  
0.2717204622  
0.2683147822  
0.2649802202  
0.2617357119  
0.2585581364  
0.2554586141  
0.2524187392  
0.249442596  
0.2465411832  
0.243699014  
0.2409159384  
0.2381874975  
0.235515019  
0.2329008076  
0.230342707  
0.227831129  
0.2253725342  
0.2229524946  
0.2205984416  
0.2182686278  
0.2159911446  
0.213765687  
0.2115691247  
0.2094201867  
0.2073096825  
0.2052350908  
0.2032032408  
0.2012082267  
0.1992463699  
0.1973179805  
0.1954260427  
0.1935621381  
0.1917407419  
0.1899340336  
0.1881744586  
0.1864386705  
0.1847325968  
0.183055103  
0.1814004066  
0.179778132  
0.1781826917  
0.1766093424  
0.175069829  
0.1735459824  
0.1720526326  
0.1705741513  
0.1691277581  
0.1677005661  
0.1662886377  
0.1649134478  
0.1635510769  
0.1622094143  
0.160888467  
0.1595863697  
0.1583044797  
0.1570456365  
0.1558001413  
0.1545768282  
0.1533724119  
0.1521798313  
0.1510049215  
0.14985794  
0.1487131923  
0.1475945375  
0.1464904065  
0.1454044141  
0.1443240485  
0.143261625  
0.1422182013  
0.141190424  
0.1401737045  
0.1391668304  
0.1381841544  
0.1372052612  
0.1362436791  
0.1352987793  
0.1343630729  
0.1334411449  
0.1325290479  
0.1316270752  
0.1307434423  
0.1298688755  
0.1290123602  
0.128155182  
0.1273137212  
0.126482516  
0.1256629137  
0.1248498555  
0.1240565388  
0.1232691916  
0.1224898705  
0.1217247055  
0.1209677712  
0.1202151269  
0.1194765264  
0.1187466793  
0.1180255801  
0.1173153998  
0.1166105418  
0.115918242  
0.1152298833  
0.1145587932  
0.1138841385  
0.1132248831  
0.112574338  
0.1119291537  
0.111288702  
0.1106598889  
0.1100382096  
0.1094290311  
0.1088183131  
0.1082157279  
0.1076285435  
0.1070437009  
0.1064626753  
0.1058913545  
0.10532794  
0.1047664731  
0.1042187703  
0.1036709943  
0.1031349463  
0.1025996231  
0.1020767038  
0.1015537074  
0.1010380951  
0.1005262747  
0.1000309666  
0.0995341069  
0.09903999881  
0.09855284915  
0.09807277297  
0.09760117014  
0.09713214051  
0.0966705237  
0.09621206934  
0.09576126749  
0.09531206293  
0.09486914905  
0.09443062242  
0.09400045341  
0.09356900601  
0.09314556992  
0.09272634367  
0.09231071024  
0.0919030249  
0.09149513959  
0.09109948499  
0.09070335745  
0.09030724602  
0.08991996073  
0.08954239271  
0.08916018675  
0.08879086879  
0.08841751914  
0.08805563386  
0.08768937965  
0.08733203272  
0.08697762264  
0.08662530455  
0.08628104536  
0.08593765224  
0.08560175201  
0.08526026475  
0.08492848291  
0.08460470513  
0.08427835756  
0.08395893523  
0.08364350948  
0.08332619718  
0.08301641214  
0.08270883995  
0.08240743447  
0.08210590224  
0.08180960734  
0.08151253293  
0.08122459113  
0.08093859315  
0.08065427728  
0.08037215466  
0.08009357274  
0.07981704697  
0.07954637977  
0.07927391735  
0.07900793002  
0.0787445995  
0.07848525514  
0.07822922936  
0.07797376026  
0.07772150542  
0.07747238114  
0.07722678051  
0.07698336613  
0.07674253773  
0.07650311425  
0.07626861881  
0.0760312025  
0.07580232819  
0.07557789599  
0.07534856631  
0.07512610167  
0.07490445174  
0.0746919043  
0.07447104089  
0.0742604301  
0.07404828195  
0.07384292837  
0.07363763152  
0.07343419796  
0.07323077725  
0.07303070125  
0.07283585135  
0.07263851862  
0.07244864464  
0.07225925084  
0.07207038964  
0.07188177415  
0.07169840672  
0.07152024774  
0.0713388099  
0.07116305007  
0.07098570151  
0.07081111511  
0.07064284306  
0.07047317568  
0.07030292315  
0.07013953828  
0.06997808043  
0.06981865852  
0.06965737074  
0.06950363432  
0.06934556121  
0.06919246631  
0.06904100321  
0.06889002939  
0.06874138321  
0.0685969389  
0.06845248042  
0.06831163634  
0.06816560255  
0.06803037181  
0.06789773079  
0.0677577342  
0.06762752961  
0.06749324253  
0.06736624943  
0.06723638212  
0.06710803452  
0.06698631717  
0.06686163485  
0.06673956135  
0.066617889  
0.06650205595  
0.06638823631  
0.06627392406  
0.06615541088  
0.0660467515  
0.065935902  
0.06582761413  
0.06571869243  
0.06561788496  
0.06551225144  
0.06540651836  
0.06530888956  
0.06521025486  
0.06511450414  
0.06501556157  
0.06492465101  
0.06482713502  
0.06473531426  
0.064646387  
0.06456216005  
0.06447021554  
0.06438535159  
0.06430194318  
0.06422022608  
0.06413431409  
0.06405983845  
0.06397810582  
0.0639023099  
0.06382457645  
0.06375191626  
0.06367954198  
0.06361196243  
0.06354020509  
0.06347116726  
0.06339964752  
0.06333428922  
0.06327414308  
0.06320691699  
0.0631465278  
0.0630823583  
0.06302774265  
0.06296743181  
0.06291436765  
0.06285560618  
0.06280600986  
0.06275328129  
0.06269775196  
0.06265018905  
0.06260311587  
0.06255739522  
0.06250809383  
0.06246426701  
0.06242073602  
0.06237887505  
0.06234073082  
0.06229643269  
0.062261253  
0.0622241651  
0.06219125946  
0.0621544183  
0.06212180601  
0.06209180037  
0.06205808047  
0.0620327215  
0.06200096986  
0.06197643581  
0.06195258124  
0.06192765269  
0.06190241876  
0.06187922659  
0.06185994691  
0.06184101711  
0.06182373538  
0.06180797624  
0.06178887052  
0.06177710279  
0.06176624692  
0.06175329492  
0.06174225674  
0.06173188884  
0.06172559974  
0.06172049492  
0.06171436649  
0.06170765937  
0.06170626117  
0.06170623388  
0.06170143573  
