236.1519693  
282.4726482  
378.9581836  
585.0238835  
1774.183463  
32462.06534  
27958.40169  
6534.975679  
50428.48895  
30697.62775  
14045.21225  
12034.91032  
8332.111326  
1416.628703  
15330.86871  
8580.75001  
23895.4686  
6134.263731  
5968.369004  
20736.80752  
484.0539487  
28002.13207  
10466.901  
15818.0194  
5437.957373  
198.3509743  
7390.956478  
12833.13821  
6846.256941  
4483.723641  
5253.291318  
6448.496276  
12340.64125  
895.4256622  
3636.740291  
1437.935844  
1823.256332  
632.9354841  
2708.113551  
1922.339726  
8617.50119  
2016.828016  
6945.236709  
3883.454845  
7589.704808  
525.315107  
1707.672165  
2855.017043  
1696.694907  
3558.836978  
13879.55319  
73.30652946  
4954.438546  
965.1491995  
235.0909904  
7500.099811  
260.6957657  
2553.890052  
13499.56421  
969.3675136  
259.1329626  
491.0183355  
1258.457686  
1582.360933  
550.5587987  
567.4412138  
529.0996827  
430.1794777  
132.2986373  
139.6074439  
14.94767674  
54.24686119  
59.22632619  
48.45558134  
16.91335782  
2.145771532  
31.98198848  
9.360653135  
39.44030085  
8.26566266  
4.105170642  
13.54868382  
4.888297098  
10.18074208  
6.543512068  
5.102457803  
5.531964483  
2.853269343  
4.501031685  
3.857194181  
3.583972379  
3.557767705  
3.131970523  
3.614866771  
3.466110196  
3.514732946  
3.05780991  
2.811490292  
2.782850817  
2.699354994  
2.577940657  
2.401116133  
2.275380422  
2.10844895  
2.053388485  
1.96756016  
1.897237104  
1.811796349  
1.738034247  
1.683443925  
1.619571997  
1.555305382  
1.494153256  
1.426906635  
1.393409752  
1.343091407  
1.297434794  
1.254666496  
1.210705716  
1.174977449  
1.133673088  
1.095992167  
1.06343616  
1.030221077  
0.9988661115  
0.9673271308  
0.9393378385  
0.911375341  
0.8851827718  
0.8590575321  
0.8348595535  
0.8122877901  
0.7892719054  
0.7680994094  
0.7473262298  
0.7274670948  
0.708452981  
0.6899773397  
0.6724499027  
0.6553743076  
0.639077563  
0.6232655596  
0.6080823249  
0.593394049  
0.5792950578  
0.5656515354  
0.5524692844  
0.5397560326  
0.5274700497  
0.5155809495  
0.5041333894  
0.4930105324  
0.4823000373  
0.4719203061  
0.4618792269  
0.4521258034  
0.4426852334  
0.4335607309  
0.424712815  
0.4161432562  
0.4078246158  
0.3997606654  
0.391938851  
0.3843403811  
0.3769709017  
0.3698186459  
0.3628566218  
0.3561135147  
0.3495569082  
0.3431759287  
0.3369804413  
0.3309564993  
0.3251078352  
0.3194043331  
0.3138552647  
0.3084752118  
0.3032119054  
0.2980865188  
0.2931163104  
0.2882577909  
0.2835330532  
0.2789266153  
0.2744409958  
0.2700732464  
0.2657967713  
0.2616485854  
0.2575816125  
0.2536225652  
0.2497581048  
0.2459977875  
0.2423219953  
0.2387231142  
0.2352112904  
0.2317955711  
0.2284549491  
0.2251851073  
0.2219938395  
0.2188778822  
0.2158220577  
0.2128600775  
0.2099429209  
0.2070997175  
0.2043006558  
0.2015806853  
0.1989182975  
0.1963069223  
0.1937557771  
0.1912552403  
0.1888155342  
0.1864284122  
0.1840822966  
0.1817951368  
0.1795513123  
0.1773456519  
0.1751775205  
0.1730749854  
0.1710042037  
0.1689781633  
0.1669893748  
0.1650499872  
0.1631418856  
0.1612728495  
0.1594324061  
0.1576327258  
0.1558737015  
0.1541419962  
0.1524479436  
0.1507767794  
0.149144142  
0.1475398683  
0.1459588181  
0.1444198687  
0.1429050794  
0.1414125033  
0.139957921  
0.1385191342  
0.1371174452  
0.1357225544  
0.1343749098  
0.1330342899  
0.1317271607  
0.1304374447  
0.1291690114  
0.127931912  
0.1267089911  
0.1255014901  
0.1243300133  
0.1231655025  
0.1220300251  
0.1209090898  
0.1198015892  
0.1187183821  
0.1176592559  
0.1166075314  
0.1155717193  
0.1145585006  
0.1135631281  
0.1125769953  
0.1116252893  
0.1106665623  
0.1097331985  
0.1088102702  
0.1079069473  
0.1070190029  
0.1061399117  
0.1052825309  
0.1044324302  
0.103598206  
0.102775668  
0.1019622379  
0.1011696119  
0.1003807886  
0.09960529006  
0.09884165584  
0.09809538307  
0.09735379765  
0.09663005433  
0.09591579953  
0.09520169019  
0.09450622393  
0.093822851  
0.09315350375  
0.0924854474  
0.09182451717  
0.09117742803  
0.09054811809  
0.08991723722  
0.08929697786  
0.08868543424  
0.08809631097  
0.08749675724  
0.08691425802  
0.08634151643  
0.08577447778  
0.08520870922  
0.08466170308  
0.08411271447  
0.08358430174  
0.0830572255  
0.08252550079  
0.08202134813  
0.08150485084  
0.08101267519  
0.08052210511  
0.08003202592  
0.07955450162  
0.07908101958  
0.07860753552  
0.07815206989  
0.07769293762  
0.07724694976  
0.07680351388  
0.07636744577  
0.07593866958  
0.0755144713  
0.07510183029  
0.07467768232  
0.07427465052  
0.07387040354  
0.07347834538  
0.07308201556  
0.07269777806  
0.07231790689  
0.07193763179  
0.07156761291  
0.07119516409  
0.0708383967  
0.07048310431  
0.07013226633  
0.06977883247  
0.06943519367  
0.06909505096  
0.06876086933  
0.0684318228  
0.06810563636  
0.06778163065  
0.06747056928  
0.06715268378  
0.066841347  
0.06654038264  
0.06622997864  
0.06593825608  
0.06564352965  
0.06534717473  
0.06506894128  
0.06478710876  
0.06450766301  
0.0642279976  
0.06395983085  
0.06368667288  
0.06342398755  
0.06315821003  
0.06289967572  
0.06264466659  
0.06238757165  
0.06213874852  
0.06190128154  
0.06165851063  
0.06141742229  
0.06117674214  
0.06094537052  
0.06071602689  
0.0604856001  
0.06026945518  
0.06003855031  
0.05982479772  
0.05960562997  
0.05939189387  
0.05918138879  
0.0589745282  
0.05876803453  
0.05856331005  
0.0583704844  
0.05817061686  
0.05797224166  
0.05777981428  
0.05759370773  
0.0574049479  
0.05722225966  
0.05703940714  
0.05685928354  
0.05668065466  
0.05650711514  
0.05633054616  
0.05615941533  
0.05599552237  
0.05582689046  
0.05566737323  
0.05549901589  
0.05534325904  
0.05518368591  
0.05502907187  
0.05487392384  
0.05472156081  
0.05457526787  
0.05443166776  
0.05428675703  
0.05414585294  
0.05400014341  
0.0538609486  
0.05372258029  
0.05358971935  
0.05345485552  
0.05332053844  
0.05319332457  
0.05307105811  
0.05294353576  
0.05282100772  
0.05269694141  
0.05257524843  
0.05245741922  
0.05234071016  
0.05222790897  
0.0521178653  
0.0520028983  
0.05189408043  
0.0517892136  
0.05168103106  
0.05157949378  
0.05147481182  
0.05136872439  
0.05127163172  
0.05117125038  
0.05107908526  
0.05098274977  
0.05089095776  
0.05079887071  
0.05070473338  
0.0506202474  
0.050531217  
0.05045107672  
0.05036715711  
0.05028536037  
0.05020367506  
0.05012566335  
0.05004809822  
0.04997013653  
0.04989697711  
0.04982328615  
0.04975303157  
0.04968333799  
0.04961046185  
0.04954379313  
0.04947951263  
0.04941236123  
0.04935397095  
0.04929173447  
0.0492341522  
0.04917134292  
0.04911638024  
0.04906222843  
0.04900422696  
0.04895091438  
0.04890237429  
0.04884217194  
0.04880208214  
0.04875009832  
0.04870398755  
0.04865920984  
0.04861202895  
0.04857197769  
0.04853156678  
0.04849264499  
0.04845122543  
0.04841947312  
0.04838016381  
0.04834307243  
0.04831637438  
0.04827831829  
0.04824999998  
0.04822273488  
0.0481925139  
0.04816211602  
0.04814023172  
0.0481114788  
0.04808890956  
0.04806942667  
0.04804759435  
0.04802658226  
0.04800947805  
0.04799328878  
0.04797675498  
0.0479690705  
0.04794898669  
0.04793472037  
0.0479284737  
0.04791798644  
0.04791162711  
0.0479047406  
0.04789721643  
0.04789254133  
0.04789191134  
0.04788954642  
0.04788616015  
