1339.080602  
1398.556294  
1529.943787  
1759.770278  
1172.056523  
8360.178232  
46344.7782  
6134.681762  
42497.6953  
25528.72317  
28066.13099  
2269.060656  
9180.10722  
10211.77455  
34944.17013  
7076.544355  
4497.338287  
11516.04372  
12912.0471  
1018.827354  
4933.532132  
3225.576038  
9181.021904  
6.234395271  
10048.47674  
17054.49622  
739.0545084  
2975.517199  
9883.956875  
4501.661556  
11456.90564  
2132.300637  
12690.67591  
9107.561339  
5289.132335  
9008.288609  
2180.44019  
4428.612244  
4660.52786  
220.0348109  
5843.494439  
9157.670867  
20634.70919  
17414.52551  
11389.35013  
544.6186685  
425.7027627  
4967.786909  
8177.667963  
863.3051925  
1653.674797  
2453.789813  
525.4804533  
1029.533634  
820.0564261  
3351.486519  
8882.698711  
2312.901211  
946.3849953  
34.81392836  
2662.469283  
162.4211485  
122.2112812  
92.67436176  
513.130838  
331.111781  
349.9496955  
108.8668188  
15.05230744  
41.35679802  
25.08927112  
18.02431656  
31.36280781  
9.106894454  
27.56709695  
20.34710129  
21.81087449  
9.486682922  
5.222834402  
5.327931966  
8.678349315  
9.237882493  
8.814881437  
6.082480327  
5.814472896  
5.094083503  
4.511955588  
3.275956936  
2.842904036  
2.857823779  
2.763030406  
2.460845375  
2.121031304  
1.86442028  
1.675493361  
1.530349843  
1.416429054  
1.272798539  
1.177352145  
1.096769785  
1.025151273  
0.9421062806  
0.8457913377  
0.7906739052  
0.7408908628  
0.6912269696  
0.6454419334  
0.6031946199  
0.5634395875  
0.5308919495  
0.4965009405  
0.4651280656  
0.4365693112  
0.4107000851  
0.3887906313  
0.3675068182  
0.3469761004  
0.3279966723  
0.3099517502  
0.2939320825  
0.2788995228  
0.2645517589  
0.2510343375  
0.2388624576  
0.2273819155  
0.2166195803  
0.2062824763  
0.1967182468  
0.187663989  
0.1792433482  
0.1713449488  
0.1638839458  
0.156828802  
0.1501621069  
0.1438300331  
0.1379441274  
0.1322990539  
0.1269621033  
0.1219480986  
0.1171878826  
0.1126607217  
0.1083624283  
0.1042834286  
0.1004175949  
0.09673948519  
0.09323687613  
0.08991020852  
0.08674145788  
0.08371977296  
0.08083681221  
0.07808753972  
0.07547086838  
0.07296324051  
0.07057496746  
0.06828624082  
0.06609928858  
0.06401406216  
0.06201347539  
0.06009526572  
0.05826154253  
0.05650276415  
0.05481421203  
0.05319859255  
0.05164554678  
0.05015735556  
0.04872433106  
0.04735013272  
0.0460286333  
0.04475718055  
0.04353586584  
0.04235804139  
0.04122612684  
0.04013469331  
0.03908551048  
0.0380739162  
0.03709814803  
0.03616000538  
0.03525172111  
0.03437542369  
0.03353049374  
0.03271557801  
0.03192729976  
0.03116647877  
0.03043297067  
0.02972202228  
0.02903354394  
0.02836882908  
0.02772712182  
0.02710395479  
0.02650121621  
0.02591818134  
0.02535367104  
0.02480646086  
0.02427684688  
0.02376240682  
0.02326436073  
0.0227814386  
0.02231266557  
0.02185837422  
0.0214162388  
0.02098878234  
0.02057288061  
0.02016886662  
0.01977662419  
0.01939483586  
0.01902625757  
0.01866594663  
0.01831643716  
0.01797621599  
0.01764581461  
0.01732394886  
0.01701068387  
0.01670640972  
0.01641051958  
0.01612070099  
0.0158407956  
0.01556778909  
0.01530022078  
0.01504036207  
0.01478741905  
0.01454088404  
0.01430084004  
0.01406658193  
0.01383785693  
0.01361520603  
0.01339911607  
0.01318586758  
0.01297887718  
0.01277798569  
0.01258054721  
0.0123880337  
0.0122002224  
0.01201708002  
0.01183740712  
0.01166255118  
0.01149246328  
0.01132444583  
0.01116200842  
0.01100318482  
0.01084809358  
0.01069492751  
0.01054642846  
0.01040007392  
0.01025719415  
0.01011929562  
0.009982562418  
0.009848773371  
0.009718256446  
0.009590664618  
0.009465622694  
0.009343617174  
0.009223600686  
0.009106444189  
0.008991280667  
0.008879771449  
0.008769713801  
0.008661844686  
0.008555339399  
0.008451829217  
0.008350644029  
0.008251282557  
0.008153123946  
0.008058486344  
0.007964713608  
0.00787293005  
0.007782413219  
0.007694707492  
0.007608210803  
0.007522905049  
0.007439132021  
0.007358131767  
0.007277259559  
0.00719949968  
0.007122031344  
0.007046590514  
0.006971870011  
0.006899146675  
0.006827866621  
0.006757626004  
0.006687694467  
0.006620655043  
0.006554125197  
0.00648841704  
0.006424582664  
0.006361554288  
0.006299397698  
0.006238601868  
0.006179340465  
0.006120359352  
0.006062612013  
0.006005707298  
0.005950074528  
0.005894932694  
0.005841051627  
0.005789075136  
0.005736671842  
0.005685439185  
0.005634966785  
0.005585732933  
0.005537379847  
0.005489611695  
0.005443056961  
0.005395840736  
0.005351079011  
0.005306280477  
0.005262407226  
0.005219324142  
0.005176840069  
0.005134348285  
0.005093505411  
0.005052920349  
0.005013236131  
0.004973853454  
0.004935393022  
0.004897155014  
0.004859673338  
0.004823122481  
0.00478669117  
0.004750805921  
0.004715772719  
0.004681035023  
0.004647069158  
0.004613706739  
0.004580586213  
0.004547793704  
0.004516191054  
0.004484697773  
0.004453164552  
0.004423168414  
0.004393007676  
0.004363061535  
0.004333783084  
0.004305227891  
0.004277096272  
0.004249465066  
0.004221786501  
0.0041946251  
0.004168193878  
0.004141947949  
0.004116013467  
0.004090763475  
0.004064889654  
0.004040390548  
0.004016093455  
0.003991731015  
0.003968258878  
0.003945197584  
0.003922001568  
0.00389943779  
0.00387744882  
0.003855353478  
0.003833144326  
0.003812375463  
0.00379101513  
0.003769991418  
0.003750246335  
0.003729269897  
0.003709968291  
0.003690560266  
0.003671247929  
0.003651764034  
0.003632948152  
0.003614542214  
0.003596430124  
0.00357864111  
0.003560648647  
0.00354378687  
0.003526235596  
0.003509258764  
0.003492807766  
0.003476374768  
0.00346012196  
0.00344400856  
0.003427687537  
0.00341303416  
0.003397449248  
0.003382154955  
0.003367348868  
0.003352773807  
0.00333802385  
0.003324472027  
0.0033098059  
0.003296410746  
0.00328245786  
0.003269245213  
0.003255886015  
0.003243142595  
0.003230048588  
0.003217227695  
0.003204951959  
0.003192699655  
0.003180824058  
0.003168891801  
0.003156628262  
0.00314525382  
0.003134554243  
0.003122712004  
0.003111843168  
0.003100619838  
0.00309021607  
0.003079125562  
0.003069299387  
0.003058531209  
0.00304883024  
0.003038593099  
0.003029090839  
0.003019475809  
0.003009581147  
0.003000445432  
0.002991522896  
0.002982558113  
0.002973532163  
0.002965063474  
0.002956254091  
0.002947906553  
0.002939105218  
0.002931193273  
0.002922952638  
0.002915364894  
0.002907207007  
0.002899480654  
0.002892101971  
0.002884646424  
0.002877897038  
0.002870321005  
0.002863548257  
0.002856526519  
0.002850134002  
0.002842972634  
0.002836982864  
0.002830568405  
0.00282347171  
0.002818122142  
0.002812146559  
0.002805531528  
0.002799667022  
0.002794400388  
0.002789020779  
0.002783964149  
0.002778143807  
0.002772964909  
0.002767501159  
0.002762557833  
0.002757748062  
0.002752627706  
0.002748723438  
0.002743285321  
0.002739232495  
0.002734471872  
0.002731031802  
0.002726144748  
0.002722248547  
0.002718367966  
0.002714341982  
0.002710702858  
0.002706956285  
0.002703779532  
0.002699918424  
0.002696512816  
0.002693619432  
0.002689938848  
0.002687304326  
0.002684518078  
0.002681526752  
0.002678541946  
0.002676061183  
0.002673539817  
0.00267107809  
0.002668635126  
0.00266636889  
0.002664000913  
0.002662078017  
0.002660178858  
0.002658165267  
0.002656714767  
0.002655083055  
0.002653016996  
0.002651500692  
0.002650354949  
0.002648629787  
0.002647506002  
0.002646434764  
0.002645476092  
0.002644249094  
0.002643869279  
0.00264247424  
0.002641991851  
0.002641569147  
0.002640839266  
0.002640639248  
0.002640522897  
0.002640162094  
0.002639938208  
0.002639535691  
