-0.2540918555  
-0.338637178  
-0.4034801191  
-0.4333802575  
-0.4157604722  
-0.3418718069  
-0.2078673411  
-0.01564642126  
0.2266957852  
0.5049869317  
0.7997857958  
1.087918662  
1.344648582  
1.546274888  
1.67283727  
1.710562056  
1.653669281  
1.505263511  
1.277131878  
0.9884481519  
0.6635608848  
0.3291671616  
0.01127890273  
-0.267595123  
-0.4906682852  
-0.6482296096  
-0.7380043082  
-0.764556909  
-0.7379075703  
-0.6716526288  
-0.5809012741  
-0.480364955  
-0.3828386133  
-0.2982512507  
-0.233315246  
-0.1917299973  
-0.1747814254  
-0.1821504905  
-0.2127234274  
-0.2652295433  
-0.3385843942  
-0.4318996425  
-0.5441769807  
-0.6737933232  
-0.8178968583  
-0.9718794617  
-1.129049091  
-1.280605483  
-1.415980175  
-1.523504169  
-1.591363765  
-1.608716137  
-1.566832792  
-1.460133896  
-1.28697736  
-1.050109611  
-0.7567198573  
-0.4180839512  
-0.04882929254  
0.3341188164  
0.7128139096  
1.06968374  
1.388930521  
1.657818133  
1.867730698  
2.014910366  
2.100771605  
2.131750486  
2.118644499  
2.075473461  
2.017929525  
1.961539828  
1.919726417  
1.901969304  
1.912307593  
1.948392177  
2.001265656  
2.055956247  
2.092899453  
2.090067091  
2.025599732  
1.880637639  
1.642012347  
1.304442861  
0.8719360536  
0.3581753245  
-0.2141853266  
-0.8152737075  
-1.410600451  
-1.964213112  
-2.442022217  
-2.814922572  
-3.061346746  
-3.168987629  
-3.135539808  
-2.968430538  
-2.683650231  
-2.303874742  
-1.856151503  
-1.36943958  
-0.872269711  
-0.3907561794  
0.05289467752  
0.4413069684  
0.7622937612  
1.008722539  
1.17800971  
1.271376495  
1.293020673  
1.249318904  
1.148170483  
0.9985268376  
0.8101201229  
0.59335996  
0.3593255708  
0.1197611354  
-0.1130196555  
-0.3264026862  
-0.5079675086  
-0.6462099152  
-0.7314444383  
-0.7567919216  
-0.7191138345  
-0.6197450553  
-0.4648683991  
-0.2654185721  
-0.03644920409  
0.2040258574  
0.4366330982  
0.6425124774  
0.8052472391  
0.9125969045  
0.9577940263  
0.9402106648  
0.8652800382  
0.7436683521  
0.5897988081  
0.4199311379  
0.2500700631  
0.09400340072  
-0.03825465708  
-0.141402458  
-0.215057858  
-0.2632460516  
-0.293286065  
-0.3142821124  
-0.335487025  
-0.3647992667  
-0.4076158514  
-0.4661865569  
-0.5395185485  
-0.623781632  
-0.7130841592  
-0.8004400536  
-0.8787488807  
-0.9416169229  
-0.9839343248  
-1.002172527  
-0.9944390434  
-0.9603872914  
-0.9010934193  
-0.8190021325  
-0.7180020485  
-0.6036257956  
-0.4833054223  
-0.3665451791  
-0.2648612971  
-0.1913274032  
-0.1596366074  
-0.182657496  
-0.2705998265  
-0.428999754  
-0.6568272564  
-0.9450816108  
-1.276208671  
-1.624600534  
-1.958292124  
-2.241794091  
-2.439797723  
-2.521321579  
-2.463747046  
-2.256161379  
-1.901476591  
-1.416943164  
-0.832894078  
-0.1898048231  
0.4659980436  
1.087438229  
1.631940247  
2.066138903  
2.369426276  
2.535883883  
2.574373071  
2.506797063  
2.364807708  
2.185414576  
2.006095102  
1.86003017  
1.772073782  
1.7559234  
1.812798434  
1.931732592  
2.091373204  
2.263009693  
2.414415955  
2.514010183  
2.534824977  
2.457830899  
2.274245081  
1.98659689  
1.608461626  
1.162943219  
0.6801074475  
0.1936868846  
-0.2625530171  
-0.6583748714  
-0.9701469284  
-1.183114694  
-1.292615548  
-1.30412371  
-1.232150805  
-1.098154332  
-0.9277233797  
-0.7473971271  
-0.5815105647  
-0.4494450993  
-0.3636144132  
-0.3284173734  
-0.3402589368  
-0.3886091286  
-0.4579379746  
-0.5302519887  
-0.5878813075  
-0.6161427114  
-0.6055178123  
-0.5530525452  
-0.4627950125  
-0.3452119625  
-0.2156715372  
-0.09221024504  
0.007109584827  
0.06686386607  
0.07658314145  
0.03237837161  
-0.06235536357  
-0.1972671325  
-0.3563712835  
-0.5201742785  
-0.6682985702  
-0.7822336924  
-0.8478100322  
-0.8570409566  
-0.8090745164  
-0.7101281563  
-0.5724425765  
-0.4124344034  
-0.2483451047  
-0.09776739646  
0.02458590179  
0.1085207388  
0.14921269  
0.1471630599  
0.1073444303  
0.03773908099  
-0.05243643562  
-0.1544624749  
-0.2614881178  
-0.3692923073  
-0.4763054931  
-0.5829195631  
-0.6902375287  
-0.7985432928  
-0.9058288157  
-1.006721156  
-1.092102789  
-1.14958596  
-1.164879437  
-1.123894645  
-1.015307749  
-0.8331784651  
-0.579166002  
-0.2639192666  
0.0927134843  
0.4628195855  
0.8129133049  
1.107540472  
1.313594711  
1.404788905  
1.365644816  
1.194418275  
0.9044467747  
0.5236315516  
0.09199927765  
-0.3424493754  
-0.7291372464  
-1.020895636  
-1.179769226  
-1.181876794  
-1.020658373  
-0.7080582163  
-0.2734494043  
0.2395760777  
0.778163498  
1.28625486  
1.710985312  
2.008611702  
2.149242265  
2.119816324  
1.925017828  
1.586092239  
1.137810874  
0.6240326111  
0.09250067179  
-0.4104544063  
-0.8446417662  
-1.179641022  
-1.396978408  
-1.490717464  
-1.466549499  
-1.339667647  
-1.131833925  
-0.8681267471  
-0.5738310268  
-0.2718716243  
0.01895461298  
0.2848372586  
0.5169591026  
0.7108100402  
0.8650929095  
0.9804884992  
1.058552598  
1.100927362  
1.10895066  
1.083656517  
1.026053994  
0.9375340793  
0.8202440848  
0.6772934999  
0.5127282993  
0.331282031  
0.1379842698  
-0.06224198882  
-0.2648542257  
-0.4657380162  
-0.6609646292  
-0.8463120129  
-1.016669753  
-1.165500465  
-1.284573775  
-1.364142126  
-1.393667059  
-1.36307817  
-1.2644426  
-1.093790705  
-0.85277555  
-0.5498268907  
-0.2005033367  
0.1731442292  
0.5442297069  
0.8835701814  
1.162807935  
1.357698556  
1.451105475  
1.435251781  
1.312887119  
1.09718095  
0.8103273067  
0.4810472995  
0.1413183005  
-0.1772221875  
-0.4467311062  
-0.6460229676  
-0.7625028271  
-0.7929646989  
-0.7432138767  
-0.62665165  
-0.4620634189  
-0.270972027  
-0.07493384901  
0.1068692149  
0.25944669  
0.3730607887  
0.4434725586  
0.471443329  
0.4616585912  
0.4213063631  
0.3585606093  
0.2812067328  
0.1955917845  
0.1060251943  
0.01465320425  
-0.07821946394  
-0.1734653751  
-0.2722655261  
-0.3751976198  
-0.4814341115  
-0.5881861543  
-0.6904938698  
-0.7813980784  
-0.8525053265  
-0.8948787969  
-0.9001537961  
-0.8617478752  
-0.7759989044  
-0.64309304  
-0.4676154703  
-0.258650037  
-0.02934763785  
0.204010469  
0.4234059034  
0.6107868265  
0.7499171104  
0.8281587339  
0.8379715656  
0.7779470119  
0.6532157857  
0.4751656312  
0.2604607356  
0.02945879553  
-0.1958126287  
-0.393896182  
-0.5461127968  
-0.6384819485  
-0.6631385329  
-0.6190893442  
-0.5122314438  
-0.3546398635  
-0.1632281231  
0.04206352592  
0.2403247052  
0.4117577508  
0.5395556911  
0.6113957185  
0.6204297323  
0.5657020384  
0.4520110777  
0.2892675191  
0.09146297127  
-0.1246381046  
-0.3409486744  
-0.5395285215  
-0.703980607  
-0.8206762939  
-0.8797546691  
-0.8758343516  
-0.8084069961  
-0.6818766164  
-0.5052245339  
-0.291312406  
-0.05583215716  
0.184018436  
0.4110593726  
0.6097028482  
0.7674250306  
0.8759681846  
0.9321057185  
0.9378589966  
0.9000971107  
0.8295562382  
0.7393750079  
0.6433343629  
0.5540392451  
0.4812926097  
0.430896667  
0.404049469  
0.3974201005  
0.4038834921  
0.4137937461  
0.4165947416  
0.4025229425  
0.3641455617  
0.297514706  
0.2027719905  
0.08414400203  
-0.05065640106  
-0.1915065087  
-0.3272550568  
-0.4471864931  
-0.5423650204  
-0.6066609577  
-0.6373366567  
-0.6351352454  
-0.6038961583  
-0.549778629  
-0.4802432027  
-0.4029478071  
-0.3247333294  
-0.2508321445  
-0.1844012159  
-0.1264320022  
-0.07601271608  
-0.03089535534  
0.01173786982  
0.05443807336  
0.09870654585  
0.1443958958  
0.1893851855  
0.2295908322  
0.2593240993  
0.2719619226  
0.2608517552  
0.2203316444  
0.1467389396  
0.0392565914  
-0.09952597168  
-0.2634342281  
-0.4429708338  
-0.6260050405  
-0.798843235  
-0.9475578297  
-1.059425848  
-1.124305847  
-1.135782242  
-1.091931351  
-0.9956241234  
-0.854321588  
-0.6793905192  
-0.4850327071  
-0.2869449758  
-0.1008542449  
0.05891388467  
0.18071945  
0.2566267027  
0.283099906  
0.261327419  
0.1971579918  
0.1006634149  
-0.01466380257  
-0.1330344376  
-0.2377521106  
-0.3127922482  
-0.3444585808  
-0.3229782969  
-0.2438719801  
-0.1089239094  
0.07341526479  
0.2883226474  
0.515656866  
0.7317531224  
0.9118346572  
1.032814241  
1.076177326  
1.030596581  
0.8939059252  
0.6741312619  
0.3893561841  
0.06635295071  
-0.261940056  
-0.5598548364  
-0.792949697  
-0.9320262979  
-0.9566928129  
-0.8580118756  
-0.6398755894  
-0.3189011533  
0.07717011525  
0.51237428  
0.9463860707  
1.338854204  
1.653684102  
1.862742899  
1.948570052  
1.905802575  
1.741214391  
1.472438617  
1.125622891  
0.7323594816  
0.3263108796  
-0.06005379054  
-0.3982755842  
-0.6660119928  
-0.8483247602  
-0.9381312524  
-0.9359295531  
-0.8489581418  
-0.6899822393  
-0.4758888378  
-0.2262431965  
0.03810926858  
0.2963323755  
0.5287732245  
0.7180271547  
0.8498823094  
0.9141381349  
0.9052491578  
0.8227362916  
0.671307733  
0.4606171913  
0.2046415462  
-0.07931789961  
-0.371957712  
-0.6535098266  
-0.9053632382  
-1.111613251  
-1.260368196  
-1.344690465  
-1.363050903  
-1.319255603  
-1.221843623  
-1.083024561  
-0.9172759799  
-0.7397575024  
-0.5647281087  
-0.4041514774  
-0.2666463882  
-0.1569019923  
-0.07561753621  
-0.01994054175  
0.01565814918  
0.03822421917  
0.05504741038  
0.07245479313  
0.09485348372  
0.1241398179  
0.1595549111  
0.1979777723  
0.2345988308  
0.2638366404  
0.2803562712  
0.2800147142  
0.2605867333  
0.2221723078  
0.1672261233  
0.1002268631  
0.02705814659  
-0.04579831937  
-0.1121082851  
-0.1666394259  
-0.2057150387  
-0.2274829251  
-0.2318811137  
-0.2203284203  
-0.1952072001  
-0.1592485939  
-0.1149334839  
-0.06402601514  
-0.007327694638  
0.05529823569  
0.1246201414  
0.2015009436  
0.2862082324  
0.3776957445  
0.4729886196  
0.5668027193  
0.651510609  
0.7175153676  
0.7540409129  
0.7502883807  
0.6968348898  
0.5871073799  
0.4187342902  
0.1945661541  
-0.07681195652  
-0.3812055209  
-0.6996144215  
-1.009688036  
-1.287699001  
-1.510826862  
-1.659502339  
-1.7195266  
-1.683717588  
-1.552859892  
-1.335849467  
-1.049005927  
-0.7146209556  
-0.3589245154  
-0.009694556321  
0.3062218962  
0.5652131759  
0.7488125527  
0.8450477772  
0.8491462182  
0.763589821  
0.5975818496  
0.3660356272  
0.08822856372  
-0.2137243157  
-0.5164545914  
-0.7968664678  
-1.033537426  
-1.207950895  
-1.305542602  
-1.31654997  
-1.236658356  
-1.067408569  
-0.8163337324  
-0.4967589582  
-0.127215086  
0.269581538  
0.6681717688  
1.042189494  
1.366457573  
1.619186424  
1.784044559  
1.851865076  
1.821756961  
1.701435092  
1.506669231  
1.25984587  
0.9877680106  
0.7188975047  
0.4803584675  
0.2950524806  
0.1792398309  
0.1409016053  
0.1790971717  
0.2844167277  
0.4404708604  
0.6262242678  
0.8188523486  
0.996726822  
1.142099539  
1.243108158  
1.29480851  
1.299100608  
1.263573881  
1.199482174  
1.119189122  
1.033523189  
0.9494976204  
0.8687863405  
0.7872418778  
0.6955457175  
0.5809182619  
0.429607895  
0.229768399  
-0.02575357486  
-0.3371932218  
-0.6965927326  
-1.087724843  
-1.487278721  
-1.867174706  
-2.197713233  
-2.451108745  
-2.604934936  
-2.644981924  
-2.567139245  
-2.37803619  
-2.094368531  
-1.740990636  
-1.348060793  
-0.9476102868  
-0.5700087112  
-0.2407799898  
0.02182637509  
0.2082231049  
0.3176955176  
0.357467234  
0.3408062396  
0.2844920438  
0.2060322582  
0.1210400365  
0.04116066444  
-0.02718538715  
-0.08307140598  
-0.1303517824  
-0.1760998087  
-0.2284752013  
-0.2943681607  
-0.3772320608  
-0.4754708276  
-0.5816923077  
-0.6829998275  
-0.7623491702  
-0.8008271247  
-0.7805479335  
-0.6877586551  
-0.5156694064  
-0.2665510878  
0.04728817042  
0.403885512  
0.7734033664  
1.121158952  
1.411540249  
1.612318497  
1.698777332  
1.657094254  
1.486492297  
1.199846071  
0.8226253903  
0.3902912757  
-0.05553532737  
-0.4716579715  
-0.8180511471  
-1.062191269  
-1.182440341  
-1.170094624  
-1.029891667  
-0.7789799031  
-0.4445371973  
-0.06040068732  
0.3368346112  
0.7117598116  
1.033658194  
1.279207242  
1.434119607  
1.493630238  
1.461882975  
1.350400257  
1.175919776  
0.9579292948  
0.7162308179  
0.4688399156  
0.2304261852  
0.01143386723  
-0.1821048606  
-0.3481298747  
-0.4876391623  
-0.6034886607  
-0.6991283848  
-0.7774644396  
-0.8400135919  
-0.8864512614  
-0.9145965194  
-0.9208034273  
-0.9006859902  
-0.8500455792  
-0.7658614646  
-0.6471930164  
-0.4958525933  
-0.3167606759  
-0.117905633  
0.09008269413  
0.2947220625  
0.4827286881  
0.6412205175  
0.7589227956  
0.8272427703  
0.841084074  
0.7993017798  
0.70475773  
0.5639705209  
0.3864133368  
0.1835600602  
-0.03219291703  
-0.248594981  
-0.4544523546  
-0.6402957141  
-0.7987280121  
-0.9244497348  
-1.014005675  
-1.065339712  
-1.077266003  
-1.048990379  
-0.9797873314  
-0.868909142  
-0.715772099  
-0.5204046831  
-0.2840955509  
-0.01014486484  
0.295420333  
0.6232990212  
0.9606787061  
1.291414583  
1.596692919  
1.856175377  
2.049570746  
2.158497238  
2.16844573  
2.070612198  
1.863359368  
1.553079366  
1.154290475  
0.6888748999  
0.1844875432  
-0.3277541797  
-0.8160551817  
-1.250900873  
-1.607847841  
-1.869807748  
-2.028546625  
-2.085209579  
-2.04981629  
-1.939789215  
-1.777703992  
-1.588554356  
-1.396850423  
-1.2239118  
-1.085646161  
-0.9910540701  
-0.9415865854  
-0.9313840975  
-0.9483226233  
-0.9757176651  
-0.9944649354  
-0.9853902107  
-0.9315568484  
-0.8203214429  
-0.6449340234  
-0.405557481  
-0.1095977943  
0.2286876014  
0.5892860194  
0.9481533194  
1.279435665  
1.557981972  
1.761926925  
1.875056944  
1.888711778  
1.802968436  
1.62694839  
1.378165943  
1.080949651  
0.7640942594  
0.4579842684  
0.1915206731  
-0.01080031812  
-0.131311142  
-0.160827957  
-0.09935131571  
0.04424820957  
0.2534847235  
0.5062754181  
0.777438659  
1.041356693  
1.274470555  
1.457321734  
1.575936731  
1.622456031  
1.595018607  
1.497019109  
1.335941604  
1.121997825  
0.866815249  
0.5823704035  
0.2802850067  
-0.02847205482  
-0.3335373251  
-0.6248928167  
-0.8925590077  
-1.126428008  
-1.316377957  
-1.452755776  
-1.527219126  
-1.533846314  
-1.470335858  
-1.339079779  
-1.14786941  
-0.9100405469  
-0.6439217641  
-0.3715664262  
-0.1168573651  
0.09682268003  
0.2490731668  
0.3247835352  
0.3159602988  
0.2228015185  
0.0538632006  
-0.1747357344  
-0.4409765773  
-0.7192820436  
-0.983237577  
-1.208363755  
-1.374601077  
-1.468215618  
-1.482911572  
-1.420052567  
-1.288001401  
-1.100702838  
-0.8757298525  
-0.6320674192  
-0.3879278905  
-0.1588751681  
0.04352820688  
0.2124164728  
0.3456305637  
0.4450982482  
0.5157477333  
0.5641495996  
0.5971214019  
0.6205210791  
0.6383975202  
0.6526052387  
0.6629066704  
0.6674937229  
0.6637962059  
0.6493982916  
0.6228639311  
0.584316152  
0.535644998  
0.4803194043  
0.4228439473  
0.3679845483  
0.3199194895  
0.2815062521  
0.2537957766  
0.2359083881  
0.2252782226  
