-0.1813087514  
-0.2141071786  
-0.2474531103  
-0.2787113467  
-0.3053027447  
-0.3249943818  
-0.336150285  
-0.3379178836  
-0.3303349061  
-0.3143563933  
-0.2917939523  
-0.2651835347  
-0.2375788839  
-0.2122765868  
-0.1924837758  
-0.1809437134  
-0.1795414006  
-0.1889320386  
-0.2082403355  
-0.2348928258  
-0.2646339652  
-0.2917723092  
-0.309666549  
-0.3114299027  
-0.2907904403  
-0.2430034375  
-0.1656899773  
-0.05947223354  
0.07171858181  
0.2207367831  
0.3777449475  
0.5311343358  
0.6687380132  
0.779195414  
0.8532895875  
0.8850817837  
0.8726854028  
0.8185741476  
0.7293756696  
0.6151768262  
0.4884212409  
0.3625436299  
0.2505079986  
0.163422784  
0.109398952  
0.09277059091  
0.113761993  
0.1686120525  
0.2501352006  
0.3486311734  
0.4530392862  
0.5522020858  
0.6361022111  
0.6969483927  
0.729991255  
0.7339951629  
0.7113067462  
0.6675127788  
0.6107061208  
0.5504288866  
0.4963958454  
0.4571324634  
0.4386854503  
0.4435661229  
0.4700900535  
0.5122161429  
0.5599690612  
0.6004313113  
0.6192324918  
0.602374372  
0.5381789339  
0.4190948462  
0.2431067775  
0.01451937295  
-0.2560345393  
-0.552413412  
-0.8545416895  
-1.140555145  
-1.389247873  
-1.582483191  
-1.70724605  
-1.757052277  
-1.732525478  
-1.64107872  
-1.495760086  
-1.313444645  
-1.112639893  
-0.9112167397  
-0.7243730701  
-0.5630957877  
-0.4332979606  
-0.3357101561  
-0.2664935147  
-0.2184404968  
-0.1825568327  
-0.1497701595  
-0.1125089431  
-0.06591816743  
-0.008544757832  
0.05758429419  
0.1274848994  
0.1942348337  
0.2503066561  
0.2889940744  
0.3056921489  
0.2988225991  
0.2702494445  
0.2251211514  
0.1711627138  
0.1175416132  
0.07349491984  
0.04695437353  
0.04339861546  
0.06512672173  
0.1110635778  
0.1771253246  
0.2570525023  
0.3435476664  
0.4294951239  
0.5090214851  
0.5782018025  
0.6352782043  
0.6803644801  
0.7147173795  
0.7397444574  
0.7559833326  
0.7622978658  
0.7554955214  
0.7304965668  
0.6810602139  
0.6009660794  
0.4854342981  
0.3325208105  
0.144197177  
-0.0731157537  
-0.3086949062  
-0.5483612717  
-0.7759018419  
-0.9748524594  
-1.130353238  
-1.230783494  
-1.268937663  
-1.242582821  
-1.154360769  
-1.011104813  
-0.8227399784  
-0.6009777215  
-0.3580344692  
-0.1055695577  
0.1460324933  
0.3879874712  
0.613080419  
0.81537199  
0.989788817  
1.131729909  
1.236822149  
1.300891214  
1.320176893  
1.291749652  
1.214050693  
1.087447486  
0.9146861575  
0.7011480721  
0.454840042  
0.1860939591  
-0.09299996996  
-0.369378556  
-0.6299172014  
-0.8623748513  
-1.056275152  
-1.203635194  
-1.299479234  
-1.342093474  
-1.333012559  
-1.276743474  
-1.180268065  
-1.052371104  
-0.902865135  
-0.7417806473  
-0.5785938226  
-0.4215563543  
-0.2771794514  
-0.1499068232  
-0.04199430593  
0.04640969607  
0.1169944107  
0.1728735215  
0.218061549  
0.2568967466  
0.2934630595  
0.3310637927  
0.3717923174  
0.4162490073  
0.4634333891  
0.5108334098  
0.5547193009  
0.5906212904  
0.6139551234  
0.6207260962  
0.6082223498  
0.5755974698  
0.5242337929  
0.4577965556  
0.3819298912  
0.3035843191  
0.2300482857  
0.167796613  
0.1213373629  
0.09225745285  
0.07865508303  
0.07510909082  
0.07325426168  
0.06292253314  
0.03372422081  
-0.02317599575  
-0.11336009  
-0.2378350459  
-0.3923406218  
-0.5674408698  
-0.7494364519  
-0.9219918583  
-1.068249161  
-1.173111455  
-1.225339802  
-1.219129579  
-1.154918147  
-1.039289561  
-0.8839959447  
-0.7042458239  
-0.5165411178  
-0.3363931127  
-0.1762788319  
-0.04413713756  
0.05738048804  
0.130824067  
0.1830704103  
0.2238373205  
0.2638481727  
0.3129445572  
0.3784469742  
0.463994152  
0.5690118783  
0.6888462269  
0.8155051129  
0.9388516193  
1.048057941  
1.133096716  
1.186076407  
1.202254081  
1.180635206  
1.124108826  
1.039135165  
0.9350408845  
0.8230035056  
0.7148334204  
0.6216675469  
0.5527006827  
0.514076627  
0.5080623602  
0.5326121104  
0.5814046257  
0.644394151  
0.7088590203  
0.7608653672  
0.7869975791  
0.7761457848  
0.7211061943  
0.6197572295  
0.4755962733  
0.2975253332  
0.09885672224  
-0.104348985  
-0.2953952502  
-0.4592098351  
-0.5844075186  
-0.6648343176  
-0.7003477236  
-0.6967032724  
-0.6645675109  
-0.6178126335  
-0.5713687023  
-0.5389712357  
-0.5311591533  
-0.5538197746  
-0.607492911  
-0.6875087003  
-0.7849082154  
-0.8879697302  
-0.9840797905  
-1.061653941  
-1.11180479  
-1.129532448  
-1.114276787  
-1.069796227  
-1.003427632  
-0.9248800738  
-0.8447691655  
-0.7731277676  
-0.7180997045  
-0.6849981178  
-0.6758207277  
-0.6892491928  
-0.7210802423  
-0.7649816777  
-0.8134275384  
-0.8586641148  
-0.8935722622  
-0.9123300852  
-0.9108259661  
-0.8868188387  
-0.8398856126  
-0.7712144981  
-0.6833160344  
-0.5797173201  
-0.4646754069  
-0.3429343126  
-0.2195127673  
-0.09950532041  
0.01213594395  
0.1108579512  
0.1928126649  
0.2551907702  
0.2965507118  
0.3170927179  
0.3188186773  
0.3055304544  
0.2826374407  
0.2567691989  
0.2352181655  
0.2252657431  
0.2334664405  
0.264964379  
0.3229249615  
0.4081391536  
0.5188423078  
0.650760153  
0.7973752375  
0.9503873151  
1.100322472  
1.23725206  
1.351568904  
1.434772427  
1.480218108  
1.483776511  
1.444358006  
1.364243925  
1.249185322  
1.108221148  
0.9532069817  
0.7980465218  
0.6576670437  
0.5467950384  
0.4786244905  
0.4634871431  
0.5076472443  
0.6123461772  
0.7732123702  
0.98013133  
1.217634867  
1.465834081  
1.701856955  
1.901706233  
2.042390286  
2.104135205  
2.072449142  
1.93980658  
1.706738023  
1.382152052  
0.9828145491  
0.531983328  
0.0573254561  
-0.4116772955  
-0.8465407991  
-1.222487081  
-1.520729511  
-1.730067981  
-1.847614165  
-1.878586506  
-1.835224724  
-1.734998745  
-1.598353851  
-1.446293428  
-1.298091182  
-1.169398988  
-1.070933557  
-1.007849075  
-0.9798011508  
-0.9816253187  
-1.004495098  
-1.037373632  
-1.068570979  
-1.087228193  
-1.084579876  
-1.054882336  
-0.9959537265  
-0.9093006409  
-0.799850102  
-0.6753394977  
-0.5454300855  
-0.4206368329  
-0.3111702684  
-0.2257992873  
-0.1708432952  
-0.1493984779  
-0.1608814737  
-0.2009700399  
-0.2619590843  
-0.3335303969  
-0.4038734936  
-0.4610482066  
-0.4944477142  
-0.496183989  
-0.462219539  
-0.3930879055  
-0.2940786543  
-0.1748306453  
-0.04834876294  
0.07046230998  
0.1665917133  
0.2268189349  
0.2414801289  
0.2058628918  
0.1210370234  
-0.006014951605  
-0.1630044127  
-0.3336285573  
-0.499397316  
-0.6417757932  
-0.7443683469  
-0.794871358  
-0.786540628  
-0.7189866715  
-0.5981997877  
-0.4358041783  
-0.2476433807  
-0.05188082062  
0.1331420022  
0.2910211307  
0.4091271635  
0.4799509794  
0.5018181171  
0.4789111528  
0.4206272125  
0.3403743201  
0.2539620589  
0.1777855604  
0.1269977346  
0.1138700776  
0.1464854749  
0.2278919688  
0.3557701685  
0.5226426447  
0.716584956  
0.9223755858  
1.122972372  
1.301183554  
1.441377953  
1.531064824  
1.562184713  
1.531964762  
1.4432299  
1.304120229  
1.127224185  
0.9282180717  
0.7241652508  
0.5316758228  
0.3651592766  
0.2353857258  
0.1485317855  
0.1058160483  
0.1037481176  
0.1349241491  
0.1892319554  
0.2552796439  
0.3218531534  
0.3792083111  
0.4200663193  
0.4402233612  
0.4387477641  
0.4178040666  
0.3821639964  
0.3384943077  
0.2945133934  
0.2580901858  
0.2363524863  
0.234858252  
0.2568748415  
0.3028186136  
0.3699083939  
0.4520951107  
0.5403249936  
0.6231702088  
0.6878246747  
0.7214149435  
0.7125070654  
0.6526453185  
0.5377108952  
0.3688887912  
0.1530526344  
-0.09754990009  
-0.3663439454  
-0.6341166664  
-0.8811593909  
-1.089584939  
-1.245499273  
-1.340707362  
-1.373698981  
-1.349751751  
-1.280130103  
-1.180485994  
-1.068698094  
-0.9624702714  
-0.8770398776  
-0.8233306655  
-0.8068130005  
-0.8272049941  
-0.8790313543  
-0.9529061301  
-1.037303956  
-1.12051343  
-1.192456801  
-1.246085894  
-1.278163815  
-1.289339669  
-1.283554971  
-1.266921589  
-1.246297192  
-1.227814411  
-1.215620031  
-1.211024514  
-1.212185064  
-1.214355726  
-1.210636041  
-1.193081144  
-1.153980983  
-1.087105776  
-0.9887271693  
-0.8582723557  
-0.6985340183  
-0.5154257431  
-0.3173398001  
-0.1142207897  
0.08350829116  
0.2660170844  
0.4250031609  
0.5543928606  
0.650745942  
0.7133561579  
0.7440721738  
0.7468931475  
0.7274160672  
0.6922021905  
0.6481301493  
0.6017904125  
0.5589553862  
0.5241547748  
0.5003810965  
0.4889383269  
0.4894582985  
0.5000934968  
0.5178843826  
0.5392837  
0.560788494  
0.5796067545  
0.5942598845  
0.6050226073  
0.6140998858  
0.6254817789  
0.6444575837  
0.6768377573  
0.7279846113  
0.8018125981  
0.8999310586  
1.021109063  
1.161189241  
1.313517969  
1.469854595  
1.621638851  
1.761408466  
1.884106685  
1.988023204  
2.075143553  
2.150784968  
2.22250828  
2.298436392  
2.385230771  
2.486066573  
2.598975871  
2.71589919  
2.822696197  
2.900208968  
2.926317552  
2.878740288  
2.738209191  
2.491559905  
2.134268184  
1.67203021  
1.121115395  
0.5073914394  
-0.1358877049  
-0.7712658934  
-1.360843183  
-1.870137548  
-2.271575373  
-2.547192677  
-2.69024378  
-2.70555939  
-2.608652882  
-2.423724491  
-2.180831824  
-1.912587134  
-1.650772518  
-1.423249196  
-1.251498338  
-1.149017209  
-1.120699752  
-1.163190239  
-1.266100301  
-1.413875487  
-1.588039133  
-1.769528809  
-1.940853665  
-2.087855388  
-2.20092315  
-2.275608998  
-2.312636885  
-2.317391711  
-2.298979297  
-2.268986448  
-2.240058643  
-2.224408353  
-2.23235612  
-2.271001242  
-2.343124864  
-2.446424832  
-2.573188147  
-2.710490995  
-2.840981299  
-2.944252388  
-2.998728825  
-2.983923519  
-2.882826243  
-2.684145385  
-2.384100415  
-1.987489148  
-1.507831345  
-0.9665061341  
-0.3909350879  
0.1879943361  
0.7389595969  
1.233304661  
1.647826254  
1.966888524  
2.183617827  
2.300063793  
2.326344959  
2.278949481  
2.178452677  
2.046976438  
1.905726749  
1.77290421  
1.662202433  
1.582019721  
1.535391616  
1.520568046  
1.532074688  
1.562064234  
1.60174056  
1.642669222  
1.677819486  
1.702245372  
1.713370698  
1.71090452  
1.696454258  
1.672938327  
1.64390975  
1.612900078  
1.582869418  
1.555833718  
1.532691742  
1.513256113  
1.496460009  
1.480687262  
1.464163558  
1.445343741  
1.423228867  
1.397564941  
1.368893087  
1.338439997  
1.307871693  
1.27894199  
1.253101593  
1.231130674  
1.212860825  
1.197042857  
1.181393871  
1.162825099  
1.137828848  
1.102966603  
1.055385441  
0.993277004  
0.9162043145  
0.825232311  
0.7228337511  
0.6125759414  
0.4986278486  
0.3851621839  
0.2757415115  
0.1727844676  
0.07720051299  
-0.01174670248  
-0.09632499614  
-0.179975099  
-0.2667675338  
-0.3607522228  
-0.4653029925  
-0.5825511628  
-0.7129946727  
-0.8553339324  
-1.006551346  
-1.162217261  
-1.316965349  
-1.465070194  
-1.60103865  
-1.720149428  
-1.818875848  
-1.895157934  
-1.948517027  
-1.980015199  
-1.992089636  
-1.988284981  
-1.972918402  
-1.950701487  
-1.926338493  
-1.90412709  
-1.887576877  
-1.879069045  
-1.879593461  
-1.888583755  
-1.903888425  
-1.921896594  
-1.937823527  
-1.946147671  
-1.941157245  
-1.917553244  
-1.871034232  
-1.798782024  
-1.699782988  
-1.574931513  
-1.426895774  
-1.25976931  
-1.078555954  
-0.8885825103  
-0.6949224548  
-0.5019366062  
-0.3129958917  
-0.1304226261  
0.04435547052  
0.2104921619  
0.3673238078  
0.5139899366  
0.6491511143  
0.7708842357  
0.8767728444  
0.9641893785  
1.030712979  
1.074606543  
1.095259409  
1.093502539  
1.071740049  
1.033849002  
0.9848615815  
0.930463204  
0.8763798871  
0.8277436897  
0.7885254633  
0.7611192018  
0.7461384219  
0.7424484027  
0.7474310884  
0.7574446676  
0.7684070306  
0.7764220103  
0.7783594763  
0.7723046192  
0.7578199054  
0.7359757752  
0.7091552632  
0.6806578712  
0.6541639064  
0.6331363868  
0.6202503797  
0.6169353472  
0.6230978767  
0.6370736526  
0.6558159777  
0.6753012336  
0.6910955341  
0.6989997497  
0.6956792608  
0.6791798493  
0.6492483332  
0.6074002724  
0.5567185702  
0.5013989217  
0.4461155834  
0.3952904921  
0.3523898107  
0.3193580159  
0.2962895286  
0.2813998613  
0.27131749  
0.2616549569  
0.2477802587  
0.2256616096  
0.1926426704  
0.1480103245  
0.09324198424  
0.03187519301  
-0.03101176492  
-0.0896254537  
-0.1384744901  
-0.1734022072  
-0.1924566275  
-0.1964304826  
-0.188950466  
-0.1760745981  
-0.1654293319  
-0.165002895  
-0.1817906771  
-0.2204990943  
-0.2825444474  
-0.3655134798  
-0.463209676  
-0.566284779  
-0.6633865107  
-0.7426438181  
-0.7932704768  
-0.8070419494  
-0.7794303017  
-0.7102280727  
-0.6035957791  
-0.46753107  
-0.3128724113  
-0.1519826385  
0.002678103201  
0.139906979  
0.2508609522  
0.3297940249  
0.3743680898  
0.3855442144  
0.3671149936  
0.324976731  
0.2662610879  
0.198449867  
0.1285750147  
0.06258926388  
0.004951681019  
-0.04155798278  
-0.07580810421  
-0.09810918061  
-0.1098832354  
-0.1132673903  
-0.1107128152  
-0.1046268299  
-0.09709885985  
-0.08972725708  
-0.08356078309  
-0.07913949652  
-0.07661031387  
-0.07589040554  
-0.07683991187  
-0.07940812695  
-0.08373262005  
-0.09016940531  
-0.09925528874  
-0.1116111195  
-0.1278014999  
-0.148180606  
-0.1727490811  
-0.2010478033  
-0.232108508  
-0.2644763639  
-0.2963035085  
-0.325511773  
-0.3500050827  
-0.3679134345  
-0.377836856  
-0.3790560545  
-0.3716845705  
-0.3567301412  
-0.336049626  
-0.312189831  
-0.2881221669  
-0.2668959097  
-0.2512462979  
-0.2432091647  
-0.2437972032  
-0.2527888083  
-0.2686717521  
-0.2887657448  
-0.3095120765  
-0.3269077102  
-0.3370226413  
-0.3365269295  
-0.3231551251  
-0.2960304377  
-0.2558039984  
-0.2045802152  
-0.1456442312  
-0.08302428038  
-0.02095586287  
0.03667105283  
0.08681098834  
0.1276250648  
0.1586673871  
0.1808592756  
0.1962642944  
0.2076909554  
0.2181827815  
0.2304690881  
0.2464589392  
0.2668549626  
0.2909533097  
0.3166703519  
0.3408086284  
0.3595411167  
0.3690579306  
0.3662937806  
0.3496342118  
0.3194913948  
0.2786451614  
0.2322721277  
0.1876114536  
0.1532742474  
0.1382400628  
0.1506464154  
0.1965078698  
0.2785380476  
0.3952479982  
0.5404785094  
0.7034869313  
0.8696403045  
1.021687848  
1.141511632  
1.212160012  
1.219928951  
1.156209222  
1.018844741  
0.8127868089  
0.5499139264  
0.2480071694  
-0.07102235931  
-0.383437791  
-0.6662277058  
-0.8995658075  
-1.06886674  
-1.166174996  
-1.190716345  
-1.148573188  
-1.051549335  
-0.9154184618  
-0.7578003507  
-0.5959756379  
-0.4449145587  
-0.3157693708  
-0.2149864653  
-0.1441134724  
-0.1002653206  
-0.07713440902  
-0.06636611353  
-0.05907865995  
-0.04730935501  
-0.02519722843  
0.01024558836  
0.05884157784  
0.117444623  
0.1805577051  
0.2412583653  
0.2922781066  
0.3270785067  
0.3407718924  
0.3307709786  
0.2970928716  
0.242298759  
0.1710976238  
0.08968927063  
0.004954916064  
