-0.1840941288  
-0.2393550477  
-0.294462884  
-0.346917148  
-0.394168866  
-0.4340863911  
-0.4654398229  
-0.4883130487  
-0.5043398715  
-0.5166785231  
-0.5296802087  
-0.5482427168  
-0.5769189967  
-0.6188888969  
-0.6749664415  
-0.7428227054  
-0.8165994692  
-0.8870471002  
-0.942244946  
-0.9688826892  
-0.9539657883  
-0.8867531116  
-0.7606489295  
-0.5747670201  
-0.3349018477  
-0.05370622272  
0.2500245666  
0.5529339842  
0.8294085907  
1.054340461  
1.206008462  
1.268711589  
1.234796348  
1.105804835  
0.8925698981  
0.6142291835  
0.2962673925  
-0.03218025303  
-0.3414190577  
-0.6043185608  
-0.7990768268  
-0.9113146931  
-0.9352677511  
-0.8739722731  
-0.7384671059  
-0.5461541891  
-0.3185673966  
-0.0788377541  
0.1508147843  
0.3512727847  
0.5081664645  
0.6128215289  
0.6624623173  
0.6597255017  
0.6116207607  
0.5281187341  
0.4206038537  
0.3003888992  
0.177491885  
0.0597810212  
-0.04743781706  
-0.1414067342  
-0.2215381018  
-0.288782259  
-0.3448716249  
-0.3915728288  
-0.4300569933  
-0.4604779686  
-0.4817894344  
-0.4918239917  
-0.4875768559  
-0.4656614271  
-0.4228436268  
-0.3565807764  
-0.2654990809  
-0.1497436402  
-0.01117494173  
0.1466095688  
0.3184116111  
0.4977078151  
0.6770168163  
0.8483311241  
1.003563172  
1.134990263  
1.235672824  
1.29984144  
1.323252756  
1.303516754  
1.240377071  
1.135939693  
0.9947984279  
0.8240255778  
0.632968797  
0.4328188728  
0.2359250329  
0.05487646222  
-0.09859474076  
-0.2147862386  
-0.2871390163  
-0.3131336038  
-0.294821053  
-0.2388594297  
-0.1560009398  
-0.06002771187  
0.03377424897  
0.1104341251  
0.157194838  
0.1652315073  
0.1309559131  
0.05669441199  
-0.0493770093  
-0.1740754543  
-0.3007552046  
-0.4113724693  
-0.4888259623  
-0.5192685418  
-0.4940905295  
-0.4112991133  
-0.2761109196  
-0.1006499215  
0.09722551621  
0.2958260011  
0.4720512387  
0.6040174688  
0.6735793041  
0.6684284818  
0.5835319057  
0.4217243722  
0.1934144347  
-0.08455921108  
-0.3907604059  
-0.7014460136  
-0.9930353533  
-1.244465326  
-1.439172602  
-1.566487962  
-1.62232892  
-1.609145824  
-1.535183729  
-1.413191405  
-1.258767166  
-1.088545894  
-0.918456964  
-0.7622206064  
-0.6302343386  
-0.5289280635  
-0.4606002465  
-0.4237098059  
-0.4135359885  
-0.4230957585  
-0.4441955067  
-0.4684858232  
-0.4884094476  
-0.4979481553  
-0.4931077758  
-0.4721071532  
-0.4352729274  
-0.3846699216  
-0.3235157946  
-0.2554757276  
-0.1839050754  
-0.1111555835  
-0.03803970815  
0.03647785452  
0.1152831885  
0.2027951875  
0.3043334572  
0.4252253845  
0.5697559288  
0.7400694882  
0.9352083461  
1.150414432  
1.37685398  
1.601851536  
1.809684605  
1.98289262  
2.104000284  
2.157458722  
2.131577818  
2.020181917  
1.823748585  
1.549835597  
1.21268528  
0.8320134917  
0.4311034531  
0.03442750099  
-0.3348968243  
-0.6574780131  
-0.9195266898  
-1.113981368  
-1.240729505  
-1.305904693  
-1.320376098  
-1.297665789  
-1.251601389  
-1.194071893  
-1.133201879  
-1.072226994  
-1.009208078  
-0.9376347166  
-0.8477917026  
-0.7286910447  
-0.5702615978  
-0.3654752466  
-0.1120973075  
0.1862021809  
0.5195156315  
0.8722095981  
1.224195449  
1.552814477  
1.835076276  
2.049998972  
2.180766917  
2.216478349  
2.153292544  
1.994886894  
1.752187546  
1.442430105  
1.087658959  
0.7128165632  
0.3436176683  
0.004390587805  
-0.2839193419  
-0.5054216552  
-0.6504888149  
-0.7164102891  
-0.7074475027  
-0.6342896828  
-0.5129725705  
-0.3633556961  
-0.2073019268  
-0.06671307399  
0.03839434989  
0.09161736509  
0.08154829424  
0.002704871499  
-0.1440598837  
-0.3516823353  
-0.6075165539  
-0.894397318  
-1.192036308  
-1.478624254  
-1.732517452  
-1.933882029  
-2.06618491  
-2.117444196  
-2.081165196  
-1.956906031  
-1.750445302  
-1.473530539  
-1.143205092  
-0.7807281092  
-0.4101385722  
-0.05651555213  
0.2559503008  
0.5059503924  
0.6769477052  
0.7587917872  
0.7488704348  
0.6526443756  
0.4834473782  
0.2615049643  
0.01220615688  
-0.2362528514  
-0.4556411986  
-0.6206116195  
-0.7114528014  
-0.7163600395  
-0.6329410372  
-0.4687545245  
-0.2407676914  
0.0262487544  
0.3022642294  
0.5552114675  
0.7545564036  
0.8748293166  
0.8987030166  
0.8192563672  
0.6411380696  
0.3804459255  
0.06330428316  
-0.2767512603  
-0.6023114202  
-0.8761703814  
-1.065487776  
-1.145553158  
-1.10269717  
-0.9359981328  
-0.6575559721  
-0.2912897232  
0.1296277856  
0.56639507  
0.9788416535  
1.329818512  
1.589185391  
1.736931636  
1.765060039  
1.678038673  
1.491793917  
1.231419339  
0.9279175698  
0.6144090461  
0.3222910215  
0.07781761662  
-0.1005107601  
-0.2034767566  
-0.2314760407  
-0.1936767008  
-0.1061855807  
0.01049963656  
0.1344015832  
0.2449750551  
0.3256669383  
0.3658358414  
0.361841792  
0.3171977216  
0.2418049146  
0.1503893384  
0.06035037991  
-0.01070603025  
-0.04743275417  
-0.03890575682  
0.01979559797  
0.1267760744  
0.273400014  
0.4452230975  
0.6236666871  
0.7882124507  
0.9188236443  
0.998277845  
1.014112281  
0.9599333538  
0.8359527591  
0.6487028039  
0.4100122259  
0.1354284409  
-0.1576715999  
-0.4519904913  
-0.7319792623  
-0.9850395832  
-1.202139311  
-1.377799131  
-1.509543399  
-1.596963956  
-1.640624471  
-1.641042952  
-1.597964337  
-1.510081645  
-1.375269552  
-1.191292089  
-0.956871524  
-0.6729020737  
-0.3435811378  
0.02277805149  
0.4134461309  
0.8116009263  
1.197291731  
1.548956164  
1.845309319  
2.067367244  
2.200334711  
2.23510752  
2.169194066  
2.006935143  
1.75902441  
1.441395856  
1.073650307  
0.6772384404  
0.2736265062  
-0.117332289  
-0.4786669846  
-0.7970975013  
-1.063367173  
-1.272155599  
-1.421672026  
-1.513069529  
-1.549814875  
-1.53712425  
-1.481538112  
-1.390658236  
-1.273010659  
-1.137982422  
-0.9957290655  
-0.8569785761  
-0.7326611214  
-0.6333267256  
-0.5683857807  
-0.5452123478  
-0.5682289634  
-0.6380936756  
-0.7511272378  
-0.8990856425  
-1.06938475  
-1.245791613  
-1.409574213  
-1.541019426  
-1.621197926  
-1.633797363  
-1.566839166  
-1.414093087  
-1.176015817  
-0.8601016549  
-0.4805686592  
-0.0573886367  
0.3852691834  
0.8210480224  
1.223668551  
1.569229837  
1.838310932  
2.017646425  
2.101202459  
2.090532922  
1.994380784  
1.827565144  
1.609290326  
1.361062653  
1.104456247  
0.8589825943  
0.6403000496  
0.4589528001  
0.3197687005  
0.2219522675  
0.159834586  
0.124146005  
0.1036448354  
0.08686275722  
0.06376640222  
0.02710180754  
-0.02670732645  
-0.09721674089  
-0.1801941484  
-0.2683675326  
-0.3525772149  
-0.4231597924  
-0.4713770038  
-0.4906907498  
-0.4777118348  
-0.4327045039  
-0.3595650524  
-0.2652969944  
-0.1590455901  
-0.05083043219  
0.04983763555  
0.13526069  
0.2005875638  
0.2444138723  
0.2688539887  
0.2790668731  
0.2822826574  
0.2864789987  
0.2988901218  
0.3245815591  
0.3653073698  
0.4188553662  
0.4789866833  
0.5360306156  
0.5780688481  
0.5925711668  
0.5682673481  
0.4969934894  
0.3752520373  
0.2052497325  
-0.004760442029  
-0.2409063315  
-0.4848779419  
-0.7157389556  
-0.9121567089  
-1.054787376  
-1.128521792  
-1.124315461  
-1.040367073  
-0.8824952069  
-0.6636513374  
-0.4026168549  
-0.1220270244  
0.1540515221  
0.4027165651  
0.6046871477  
0.7463460193  
0.8211214281  
0.8300438074  
0.7814190314  
0.6896503403  
0.5733508815  
0.452977791  
0.3482700126  
0.2757938839  
0.2469001772  
0.2663353485  
0.3316700027  
0.4336113528  
0.5571657025  
0.6834967607  
0.7922753674  
0.8642194802  
0.8835488434  
0.8400480758  
0.7305040955  
0.5593470165  
0.3384025626  
0.08577883535  
-0.1760014083  
-0.4224314806  
-0.6297380589  
-0.7775857662  
-0.8514530196  
-0.8444038597  
-0.7580273466  
-0.602429539  
-0.3952525351  
-0.1598296877  
0.0773243716  
0.2893928196  
0.452173416  
0.5466885023  
0.561178924  
0.4922686349  
0.3451643296  
0.1329036441  
-0.1252452627  
-0.4060024627  
-0.6846395027  
-0.9375748062  
-1.144698074  
-1.291178689  
-1.368585867  
-1.375247429  
-1.315860736  
-1.200469442  
-1.042972151  
-0.8593742884  
-0.6660076002  
-0.4779161385  
-0.3075736399  
-0.1640383141  
-0.05259179489  
0.02515983501  
0.07078769238  
0.08826388172  
0.08303685979  
0.06109089473  
0.02812534945  
-0.01106729508  
-0.05296336972  
-0.09539231323  
-0.1373922315  
-0.178872751  
-0.2201938835  
-0.2617280308  
-0.3035021742  
-0.3449676411  
-0.3849348723  
-0.421674783  
-0.4531450341  
-0.4773026819  
-0.4924344494  
-0.4974404004  
-0.4920232405  
-0.4767569415  
-0.4530270282  
-0.4228527459  
-0.388631634  
-0.3528480179  
-0.3177815912  
-0.2852657488  
-0.2565045523  
-0.231981335  
-0.2114391862  
-0.1939409682  
-0.1779861911  
-0.1616677469  
-0.1428597639  
-0.1194207467  
-0.08939742459  
-0.05122980064  
-0.00393525549  
0.052727518  
0.1181366099  
0.1907413597  
0.268065402  
0.3467961497  
0.4229675452  
0.4922418807  
0.550280942  
0.5931856078  
0.6179775419  
0.6230719719  
0.6086871325  
0.5771348395  
0.5329308784  
0.4826792827  
0.4346981592  
0.3983953764  
0.3834163737  
0.3986407778  
0.4511126162  
0.545032222  
0.680929549  
0.8551382968  
1.059659711  
1.282471066  
1.508281694  
1.719687524  
1.898623583  
2.027974583  
2.09318925  
2.083711649  
1.994083649  
1.824582909  
1.581317594  
1.27575763  
0.9237331387  
0.5440118699  
0.1566053244  
-0.2190006209  
-0.5654895372  
-0.8690338862  
-1.12014144  
-1.313936006  
-1.449853131  
-1.5308315  
-1.562127058  
-1.549959526  
-1.500207623  
-1.417365088  
-1.303932599  
-1.160343025  
-0.9854321563  
-0.777378556  
-0.5349526576  
-0.2588629559  
0.04703877993  
0.3749204156  
0.7126691422  
1.044232691  
1.350604043  
1.611367832  
1.806634167  
1.919134451  
1.936228615  
1.851570408  
1.666226453  
1.389109469  
1.036647094  
0.6317235933  
0.2019699889  
-0.2224283873  
-0.6112103856  
-0.9365773922  
-1.175562139  
-1.312021156  
-1.338062621  
-1.254786512  
-1.072245567  
-0.8086250608  
-0.4887006109  
-0.1416918248  
0.2012880282  
0.509958703  
0.7574987112  
0.9228173295  
0.9922358123  
0.9603937648  
0.8303026361  
0.6125424452  
0.3237183915  
-0.01563244686  
-0.3834095298  
-0.7583029193  
-1.121837994  
-1.459870219  
-1.763366584  
-2.028411333  
-2.255486741  
-2.448176495  
-2.611523321  
-2.750297902  
-2.867472028  
-2.96311248  
-3.033883297  
-3.073215474  
-3.072129228  
-3.020582167  
-2.909141955  
-2.730740658  
-2.482243181  
-2.16560416  
-1.788419431  
-1.363794139  
-0.9095119896  
-0.446605322  
0.002495840473  
0.4160150154  
0.7748192748  
1.064118865  
1.274678041  
1.403418003  
1.453380609  
1.433090337  
1.355452107  
1.236338846  
1.093070262  
0.9429576579  
0.8020569286  
0.6842111986  
0.6004173131  
0.5584719848  
0.5628409225  
0.6146613135  
0.7118035094  
0.8489524  
1.017711721  
1.206773524  
1.402229293  
1.588118225  
1.747287811  
1.862587682  
1.918379806  
1.902240374  
1.806677475  
1.630624293  
1.380448985  
1.070242367  
0.7212166163  
0.3601474793  
0.01694542683  
-0.2784371917  
-0.4994095685  
-0.6260228609  
-0.6476728236  
-0.5647969727  
-0.3892810835  
-0.1434088593  
0.1425438401  
0.4338235391  
0.6953602841  
0.8960274826  
1.012406767  
1.031546708  
0.9523190956  
0.7852132127  
0.5506177223  
0.2758744132  
-0.008440449354  
-0.272456553  
-0.4906015998  
-0.6443531727  
-0.7238295283  
-0.7280640112  
-0.6640430943  
-0.5447610094  
-0.3866737053  
-0.2070016204  
-0.02131189919  
0.158275355  
0.3240577063  
0.4728305026  
0.6051916317  
0.7242875927  
0.8342926489  
0.9389279085  
1.040277737  
1.138096406  
1.229671649  
1.310220412  
1.373698295  
1.413837083  
1.425217284  
1.40418113  
1.349444669  
1.262326596  
1.146584406  
1.007905312  
0.8531431367  
0.689444733  
0.5233778526  
0.3601916352  
0.2033111437  
0.05410912564  
-0.0880088001  
-0.225234908  
-0.3607548958  
-0.497989967  
-0.6397907334  
-0.7876859159  
-0.9413019821  
-1.09803238  
-1.253022983  
-1.399496619  
-1.529390084  
-1.634242201  
-1.706225729  
-1.739186974  
-1.729561788  
-1.677026558  
-1.584792494  
-1.459481948  
-1.310591138  
-1.149588093  
-0.9887641513  
-0.8399584075  
-0.7133337733  
-0.6163269938  
-0.5529175496  
-0.5232768601  
-0.5238401833  
-0.5477738373  
-0.5857662645  
-0.6270496638  
-0.6605212713  
-0.6758537297  
-0.6644702912  
-0.6203164495  
-0.5403664253  
-0.4248543752  
-0.2772349225  
-0.1039119  
0.08621818686  
0.2823644559  
0.4725368426  
0.6442993424  
0.7855656503  
0.8854035663  
0.9348258924  
0.9275436091  
0.8606179241  
0.7349557292  
0.5555811161  
0.3316048104  
0.07584252247  
-0.1959439282  
-0.4661568867  
-0.7167583186  
-0.9308253171  
-1.094102931  
-1.196379783  
-1.232511398  
-1.202941971  
-1.113650367  
-0.9755036879  
-0.8030812518  
-0.6131127991  
-0.4227263788  
-0.2477128567  
-0.1010402361  
0.008219112316  
0.07543963795  
0.1004254633  
0.08688631403  
0.0415287569  
-0.02707403129  
-0.1096549368  
-0.1972822076  
-0.2821365354  
-0.3579655459  
-0.4202165184  
-0.465923546  
-0.4934295668  
-0.5020813298  
-0.4919810799  
-0.4638677096  
-0.419132352  
-0.3599345949  
-0.2893351707  
-0.2113392054  
-0.1307704967  
-0.05289998439  
0.01716990854  
0.07530331042  
0.1191978143  
0.1491583684  
0.1685947742  
0.1840920524  
0.2049506841  
0.2421743299  
0.3069915536  
0.4090865022  
0.5547916099  
0.7455321487  
0.9768088316  
1.237938576  
1.512682579  
1.780736527  
2.019946313  
2.208955751  
2.329934495  
2.370973458  
2.327789863  
2.204455612  
2.013012058  
1.77200181  
1.504107699  
1.233239294  
0.9814829692  
0.7663767971  
0.5988980468  
0.4824606295  
0.4130540147  
0.3804704245  
0.3704116173  
0.3671097507  
0.3560467765  
0.326323051  
0.2723124973  
0.1943558227  
0.09840976782  
-0.005254075002  
-0.1040476502  
-0.1854043465  
-0.2390451164  
-0.2587904193  
-0.2436181178  
-0.1978142124  
-0.1302130809  
-0.05269316179  
0.02179515725  
0.08130610509  
0.1167306332  
0.1230600173  
0.09989524235  
0.05113494538  
-0.01606974267  
-0.09288429626  
-0.1705848805  
-0.2422485391  
-0.3040329885  
-0.355827012  
-0.401156388  
-0.4463597577  
-0.4991901272  
-0.5670791658  
-0.6553562869  
-0.7657472512  
-0.8954058539  
-1.036664107  
-1.177589327  
-1.303276777  
-1.397739843  
-1.446134244  
-1.437004785  
-1.364240611  
-1.228447713  
-1.037516166  
-0.8062751638  
-0.5552276792  
-0.3085125253  
-0.091310779  
0.07296967081  
0.1653850176  
0.1736734051  
0.09371290782  
-0.06996948043  
-0.3046938704  
-0.5910480588  
-0.9050435625  
-1.220684339  
-1.512627541  
-1.758577128  
-1.941129688  
-2.048878994  
-2.076713727  
-2.025352343  
-1.900279516  
-1.710317943  
-1.466096537  
-1.178665103  
-0.8584566445  
-0.5146986359  
-0.1553022585  
0.2128449636  
0.5833218955  
0.9495317571  
1.304143073  
1.638773406  
1.943997825  
2.209703711  
2.425764319  
2.582911738  
2.673688018  
2.69333443  
2.640482501  
2.517548451  
2.330776592  
2.089916026  
1.807563736  
1.498243425  
1.177306626  
0.8597835226  
