------------------------------------------
Setting up environment variables
---
LD_LIBRARY_PATH is .:/opt/software/fix/1.065/MATLAB_Compiler_Runtime/v83/runtime/glnxa64:/opt/software/fix/1.065/MATLAB_Compiler_Runtime/v83/bin/glnxa64:/opt/software/fix/1.065/MATLAB_Compiler_Runtime/v83/sys/os/glnxa64
Warning: Name is nonexistent or not a directory: /usr/local/fsl/etc/matlab
[> In path at 109
  In startup at 1] 
Warning: Name is nonexistent or not a directory: /usr/local/fmrib/fmt
[> In path at 109
  In startup at 2] 
/home/mpib/LNDG/StateSwitch/WIP_rest/preproc/B_data/D_preproc/2108/preproc/rest/FEAT.feat/
    30     1

    30     2

    30     3

    30     4

    30     5

    30     6

    30     7

    30     8

    30     9

    30    10

    30    11

    30    12

    30    13

    30    14

    30    15

    30    16

    30    17

    30    18

    30    19

    30    20

    30    21

    30    22

    30    23

    30    24

    30    25

    30    26

    30    27

    30    28

    30    29

    30    30

End of Matlab Script
