0.03974804851  
0.1472275231  
0.2407617333  
0.3080014809  
0.3395137212  
0.3297570946  
0.2775645959  
0.1861034584  
0.06232881079  
-0.08396395235  
-0.2413457745  
-0.3980530203  
-0.5432105557  
-0.6678391005  
-0.7655500039  
-0.8328819251  
-0.869285207  
-0.8768078602  
-0.8595558057  
-0.8230291155  
-0.773417339  
-0.7169371239  
-0.6592681412  
-0.6051186704  
-0.5579365092  
-0.519764247  
-0.4912239702  
-0.4716193715  
-0.4591370592  
-0.4511281896  
-0.4444573573  
-0.4358946091  
-0.4225195276  
-0.4021119687  
-0.3734792568  
-0.3366863092  
-0.2931416449  
-0.2455226087  
-0.1975168533  
-0.1534050744  
-0.1175176074  
-0.09362606842  
-0.08435466452  
-0.09069346263  
-0.1116970444  
-0.1444350223  
-0.1842228029  
-0.2251265498  
-0.2606944245  
-0.2848191314  
-0.2926213218  
-0.2812135551  
-0.2502359704  
-0.2020557919  
-0.1415939408  
-0.07578192568  
-0.0127132062  
0.03939731298  
0.07329704755  
0.08367528435  
0.06789398849  
0.0263674304  
-0.03745621915  
-0.1175095607  
-0.2058417837  
-0.2935782544  
-0.3719534311  
-0.433284214  
-0.4717499316  
-0.4838915016  
-0.4687847131  
-0.4278912751  
-0.3646433676  
-0.2838496412  
-0.1910272135  
-0.09176402121  
0.008799836456  
0.1063178079  
0.1973952096  
0.2795764658  
0.3512129007  
0.4112774764  
0.4591875729  
0.4946978374  
0.5178767744  
0.5291782777  
0.529569595  
0.5206694817  
0.5048344061  
0.4851416365  
0.4652357696  
0.4490245397  
0.4402565173  
0.4420271641  
0.4562931628  
0.4834761028  
0.5222331423  
0.5694558702  
0.6205212276  
0.6697857059  
0.7112701392  
0.7394549853  
0.7500764961  
0.7408107619  
0.7117425427  
0.6655305428  
0.6072318523  
0.5437846022  
0.4831923672  
0.4335119565  
0.4017628928  
0.3929046141  
0.4090252907  
0.4488585115  
0.5077245801  
0.57791623  
0.6495156924  
0.7115502792  
0.7533565643  
0.7659753666  
0.7433958338  
0.6834632935  
0.5883201941  
0.4642859569  
0.3211821755  
0.1711650894  
0.02722404825  
-0.09845205869  
-0.196012784  
-0.2591583419  
-0.2858571444  
-0.278460689  
-0.2432118203  
-0.1892300948  
-0.127142211  
-0.06757523184  
-0.01974235956  
0.009671137542  
0.01717538136  
0.002630103474  
-0.03109853165  
-0.07887969898  
-0.1343158519  
-0.1908100725  
-0.2425415878  
-0.2852075084  
-0.3164402186  
-0.335881946  
-0.3449391447  
-0.3463008403  
-0.3433232859  
-0.3393928428  
-0.3373729606  
-0.3392019789  
-0.3456904797  
-0.3565122418  
-0.3703710468  
-0.3852869552  
-0.3989530456  
-0.4090989167  
-0.4138271372  
-0.4118808406  
-0.4028376504  
-0.3872196981  
-0.3665188879  
-0.3431353463  
-0.3202220041  
-0.3014208404  
-0.2904834952  
-0.29077041  
-0.3046564687  
-0.3328906364  
-0.3740012033  
-0.4238648633  
-0.4755776675  
-0.5197559618  
-0.5453588078  
-0.5410544824  
-0.4970518497  
-0.4072106875  
-0.2711389814  
-0.09590753406  
0.1030058065  
0.3018884172  
0.4703134827  
0.5740357987  
0.5790902998  
0.4566493952  
0.1880221005  
-0.2309638994  
-0.7869618122  
-1.448130866  
-2.165589481  
-2.877365362  
-3.514516201  
-4.008738201  
-4.300495862  
-4.346554473  
-4.125835134  
-3.642708672  
-2.927197679  
-2.03199901  
-1.026700565  
0.01002456389  
0.9991850422  
1.870020345  
2.567222354  
3.055945422  
3.324077303  
3.381647665  
3.257650556  
2.994890203  
2.643678168  
2.255285396  
1.876011352  
1.542553884  
1.279123959  
1.096471289  
0.992709339  
0.9556110745  
0.9658864024  
1.00089295  
1.038234338  
1.058800122  
1.048922267  
1.001493685  
0.91604845  
0.7979382344  
0.6568477644  
0.5049388656  
0.3549238076  
0.2183318113  
0.1041780149  
0.01814714761  
-0.03767185305  
-0.06454630027  
-0.06646311193  
-0.04924093172  
-0.01954691593  
0.01603557031  
0.05177046869  
0.08329389348  
0.1078696675  
0.1243932664  
0.1331885742  
0.1356669931  
0.1339217218  
0.1303280008  
0.1271924265  
0.1264878229  
0.1296826784  
0.1376496984  
0.1506422896  
0.1683117194  
0.1897474913  
0.2135356894  
0.2378254602  
0.2604292153  
0.2789557895  
0.2909980449  
0.2943749925  
0.2874191921  
0.2692802319  
0.2402024665  
0.2017245621  
0.1567464352  
0.1094121689  
0.06479047555  
0.02835067361  
0.005277790434  
-0.0002983281474  
0.01394712786  
0.0479286398  
0.09881649742  
0.1610740202  
0.2269245583  
0.2872519044  
0.3328576269  
0.3559322032  
0.3515342024  
0.3188407431  
0.2619199266  
0.1898213386  
0.1158527726  
0.05602314154  
0.02676717145  
0.0421912008  
0.1112162764  
0.235045555  
0.4054202794  
0.6040550134  
0.8035336314  
0.9697341452  
1.065636786  
1.056126619  
0.9131911664  
0.6207881123  
0.178611133  
-0.3959103435  
-1.067865818  
-1.787519595  
-2.495198972  
-3.127847018  
-3.626413377  
-3.943055916  
-4.047124001  
-3.929030834  
-3.601436582  
-3.097556767  
-2.466851692  
-1.768745981  
-1.065313151  
-0.4139864017  
0.1386934919  
0.5614859966  
0.8405335935  
0.9790126256  
0.9946253878  
0.9154813038  
0.7751218156  
0.6074743673  
0.4424535138  
0.3027503675  
0.2021002661  
0.1450776415  
0.1282240054  
0.1421492221  
0.174149918  
0.2108803101  
0.2406648106  
0.2551607076  
0.2502193922  
0.2259349656  
0.1860031881  
0.1365930048  
0.08498513272  
0.03822497244  
0.002007139678  
-0.02007147409  
-0.02681474451  
-0.01931085672  
-0.0004686628615  
0.02566744038  
0.05468008574  
0.08248878213  
0.1058989833  
0.1229264518  
0.1328790327  
0.1362186472  
0.1342638324  
0.1288008145  
0.1216885567  
0.1145188555  
0.1083817578  
0.1037593973  
0.1005409584  
0.09814640646  
0.09570711057  
0.09228172902  
0.08705114359  
0.07947899434  
0.06940800898  
0.057099378  
0.04321083754  
0.02873540182  
0.01490972329  
0.003107380023  
-0.005264002462  
-0.008868112133  
-0.006531619435  
0.0026727728  
0.01935413361  
0.04374877635  
0.07568428333  
0.1145702871  
0.1594230257  
0.208922685  
0.2615065833  
0.3154866263  
0.3691759807  
0.4210122055  
0.4696539775  
0.5140350363  
0.5533737609  
0.5871358815  
0.6149600381  
0.6365736024  
0.6517192545  
0.6601159005  
0.6614774615  
0.6555876136  
0.6424309877  
0.6223519834  
0.5962099835  
0.5654913302  
0.5323391485  
0.4994733866  
0.4699907592  
0.4470568331  
0.433525239  
0.431536479  
0.442162524  
0.465166954  
0.4989320419  
0.5405910555  
0.5863614521  
0.6320534496  
0.6736789778  
0.7080678717  
0.7333914449  
0.7494856545  
0.7578937752  
0.761598579  
0.7644506901  
0.7703719578  
0.782448728  
0.8020882666  
0.8283995183  
0.8579631575  
0.8850937442  
0.9026211981  
0.903134048  
0.8805106393  
0.8315065901  
0.7570885688  
0.6632233941  
0.5608641011  
0.4649875811  
0.3926776346  
0.360418471  
0.3809279224  
0.4599944602  
0.5938484956  
0.7676011436  
0.9551688723  
1.120939816  
1.223171696  
1.218849053  
1.06945522  
0.746911232  
0.2388321891  
-0.4477392472  
-1.284804533  
-2.224498235  
-3.202856956  
-4.145939848  
-4.977621681  
-5.628098073  
-6.042017434  
-6.185150942  
-6.048703593  
-5.650658197  
-5.033946665  
-4.261654373  
-3.409861897  
-2.559018806  
-1.784930898  
-1.150467207  
-0.6989730249  
-0.4501443321  
-0.3987910316  
-0.5165476697  
-0.7562374934  
-1.0582808  
-1.358314055  
-1.595069251  
-1.71755246  
-1.690691006  
-1.498813837  
-1.146639034  
-0.657749809  
-0.07086845935  
0.5654938769  
1.199260295  
1.781047417  
2.269673956  
2.636272407  
2.866586417  
2.961297008  
2.934501142  
2.810683714  
2.620710065  
2.397434906  
2.171532789  
1.968061239  
1.804126435  
1.687839899  
1.618565677  
1.588283326  
1.583764254  
1.589184233  
1.588775243  
1.569151832  
1.521040714  
1.440243872  
1.327788356  
1.189334175  
1.034001628  
0.8728408399  
0.717190403  
0.5771629521  
0.460448996  
0.3715607771  
0.3115789023  
0.2783709291  
0.2672029172  
0.2716170141  
0.2844180325  
0.2986399092  
0.30835044  
0.309225492  
0.2988437904  
0.2767115719  
0.244060495  
0.2034814125  
0.1584762175  
0.1129972391  
0.07102773179  
0.03623751323  
0.01172526625  
-0.0001693503439  
0.002000976859  
0.01868757692  
0.04926417765  
0.09196147063  
0.1438425011  
0.2008507909  
0.2579584158  
0.3094498416  
0.3493462416  
0.3719587935  
0.372522347  
0.3478352167  
0.2968190336  
0.2208893306  
0.1240654264  
0.01275308661  
-0.1048159197  
-0.2194450649  
-0.3220525825  
-0.4048407814  
-0.4623949532  
-0.4925521883  
-0.4968932081  
-0.4807575219  
-0.452737534  
-0.4236811925  
-0.4053096383  
-0.4086078614  
-0.4422026778  
-0.5109484284  
-0.6149278489  
-0.7490334776  
-0.9032126166  
-1.063384786  
-1.212937941  
-1.334627046  
-1.412642174  
-1.434582217  
-1.393068019  
-1.286786845  
-1.120815708  
-0.9061905713  
-0.6587664094  
-0.3975263633  
-0.1425634627  
0.08700895896  
0.2749507655  
0.4093751716  
0.4836631231  
0.4967431227  
0.4527691447  
0.3602925773  
0.2310950157  
0.07886122014  
-0.08213351654  
-0.2381768057  
-0.3770278952  
-0.4885460687  
-0.565061094  
-0.6015349605  
-0.5955871729  
-0.5474391205  
-0.4598222768  
-0.3378518346  
-0.1888455554  
-0.02204472791  
0.1518106915  
0.3210840228  
0.4740193606  
0.5996609466  
0.6888253304  
0.7350196531  
0.7351799053  
0.6901065507  
0.6045154411  
0.4866597176  
0.3475506939  
0.1998425156  
0.05652114683  
-0.07045699435  
-0.1714087299  
-0.2398991132  
-0.2733376375  
-0.2731275996  
-0.2443608604  
-0.1951030658  
-0.1353577855  
-0.07583855278  
-0.02668178442  
0.003758967489  
0.009908576975  
-0.01033457487  
-0.05527208178  
-0.1194754605  
-0.1942429099  
-0.2684080503  
-0.3294303509  
-0.3646845187  
-0.3628466176  
-0.3152600919  
-0.2171676548  
-0.068680161  
0.1246270225  
0.3516005373  
0.5959526168  
0.8373024294  
1.052796827  
1.219226264  
1.315471663  
1.325047864  
1.238443551  
1.054942897  
0.7836161745  
0.4432430081  
0.06104916976  
-0.3297129298  
-0.6931265668  
-0.9945483449  
-1.204625953  
-1.302850057  
-1.280133153  
-1.140011124  
-0.8982678136  
-0.5810051008  
-0.2214184836  
0.1442762642  
0.4811826391  
0.759738906  
0.9588634615  
1.06784857  
1.086815516  
1.025757057  
0.9024139612  
0.7393472278  
0.5606926266  
0.3890517222  
0.2429246917  
0.1349765874  
0.07126411425  
0.05140772859  
0.06956506075  
0.1159582977  
0.1786673549  
0.2454112616  
0.3050722105  
0.348811701  
0.3706970397  
0.3678601719  
0.3402671575  
0.2902240004  
0.2217576279  
0.1399924288  
0.0506111782  
-0.0405591682  
-0.1278398576  
-0.2059128351  
-0.2700039589  
-0.3161002553  
-0.3412235507  
-0.3437709676  
-0.3238736899  
-0.2837029649  
-0.2276290044  
-0.162129981  
-0.09538484576  
-0.0365192946  
0.005461950029  
0.0229485997  
0.01103611321  
-0.03133965977  
-0.10066807  
-0.1887398143  
-0.2832605636  
-0.3692369172  
-0.4310386209  
-0.4549063788  
-0.4315625146  
-0.3585041728  
-0.2415554424  
-0.09529891667  
0.05784190483  
0.1899195508  
0.2709969731  
0.2734932233  
0.1767498181  
-0.02887566661  
-0.3390804181  
-0.7344378454  
-1.181307114  
-1.634888091  
-2.044124945  
-2.357860185  
-2.531399862  
-2.532557872  
-2.346275991  
-1.977123432  
-1.449279363  
-0.8039794602  
-0.09479063913  
0.6186183186  
1.277327532  
1.829708608  
2.236802527  
2.4758957  
2.541938238  
2.446775044  
2.216451086  
1.887097299  
1.500036756  
1.096793635  
0.7146276356  
0.3830817947  
0.1218451588  
-0.05996983644  
-0.1632264165  
-0.1970805938  
-0.1765667325  
-0.1198398541  
-0.04545861756  
0.02996694059  
0.09352617626  
0.1370272058  
0.1572615684  
0.1555878717  
0.1369799477  
0.1087352111  
0.07904689812  
0.05564176313  
0.04464754192  
0.04980204865  
0.07206585814  
0.1096408236  
0.1583448746  
0.2122634219  
0.2645688094  
0.3083919527  
0.3376421218  
0.3476784182  
0.3357767012  
0.3013485475  
0.2459168122  
0.172869437  
0.08703489426  
-0.005851578482  
-0.09973139904  
-0.1887826846  
-0.2679059526  
-0.3330924461  
-0.3816538978  
-0.4123104232  
-0.4251531095  
-0.4215008551  
-0.4036910402  
-0.3748281159  
-0.3385223955  
-0.2986373988  
-0.2590534241  
-0.2234536372  
-0.1951258764  
-0.1767841672  
-0.1703986169  
-0.1770475535  
-0.1967976222  
-0.2286299483  
-0.2704317686  
-0.3190739088  
-0.3705855483  
-0.4204294748  
-0.4638665866  
-0.4963854284  
-0.5141487997  
-0.5144186582  
-0.4958937314  
-0.4589138575  
-0.4054937766  
-0.3391636895  
-0.2646274327  
-0.1872597973  
-0.1125131145  
-0.04530047647  
0.01056298942  
0.05277140787  
0.08073774722  
0.09556220621  
0.09975776087  
0.09677768645  
0.09041452093  
0.0841708821  
0.08070520039  
0.08145712019  
0.08651512456  
0.09475970605  
0.1042635114  
0.1128713702  
0.1188613305  
0.1215509491  
0.1217210643  
0.1217559753  
0.1254424022  
0.1374311519  
0.1624296037  
0.2042517978  
0.2648856381  
0.3437526478  
0.4373129109  
0.5391198585  
0.6403578743  
0.730812898  
0.8001527806  
0.839324609  
0.8418597154  
0.8048663157  
0.729554053  
0.6211905345  
0.4884913367  
0.3425392468  
0.1953995304  
0.05864569993  
-0.05797592663  
-0.1475549538  
-0.2065627634  
-0.2348901017  
-0.2354180805  
-0.2132250988  
-0.1746001928  
-0.1260367942  
-0.07337258121  
-0.02120061912  
0.02739381848  
0.07076286569  
0.1083657192  
0.1402771847  
0.1666607193  
0.1873282535  
0.2014725536  
0.2076296031  
0.2038639746  
0.188135322  
0.1587641333  
0.1149029084  
0.05690806274  
-0.01345008363  
-0.09299932375  
-0.1773886927  
-0.2615000214  
-0.339978885  
-0.4078050285  
-0.460819523  
-0.4961360553  
-0.5123876372  
-0.5097925165  
-0.490040443  
-0.4560410898  
-0.4115766567  
-0.3609103936  
-0.3084008093  
-0.25815555  
-0.2137466302  
-0.1779909397  
-0.1528005419  
-0.1390909264  
-0.1367446953  
-0.1446286611  
-0.160668482  
-0.1819839593  
-0.2050916973  
-0.2261737399  
-0.2413991474  
-0.2472779507  
-0.2410172827  
-0.2208381976  
-0.1862178287  
-0.1380162916  
-0.07846795981  
-0.0110232309  
0.05995023154  
0.1295837902  
0.1929970782  
0.2458101814  
0.284616367  
0.3073573743  
0.3135496763  
0.3043284165  
0.2822959548  
0.2511888334  
0.2153978142  
0.1794094272  
0.1472311856  
0.121889143  
0.1050637046  
0.0969162791  
0.09613426452  
0.1001876199  
0.1057656242  
0.1093249965  
0.107677877  
0.09852655794  
0.08087232636  
0.05523276667  
0.02363394968  
-0.01062309972  
-0.04340067544  
-0.07029656412  
-0.08728478476  
-0.09132061053  
-0.08083176855  
-0.0560142535  
-0.01888783189  
0.02690679854  
0.07654166502  
0.1246158772  
0.1658598642  
0.1958298924  
0.2114899527  
0.2115994596  
0.1968401842  
0.1696753401  
0.1339548885  
0.09433417707  
0.05559914261  
0.02199968702  
-0.003303738879  
-0.01859483283  
-0.02371897318  
-0.01994476778  
-0.009614193473  
0.004350113324  
0.01899029458  
0.03181056569  
0.04114080449  
0.0463100074  
0.04760791415  
0.04605502644  
0.04303350899  
0.03985980538  
0.03738588858  
0.03571172333  
0.03406685418  
0.03088716321  
0.02408283392  
0.01145018908  
-0.008841512893  
-0.03777272199  
-0.07508874528  
-0.1190840038  
-0.1665977396  
-0.2132407061  
-0.2538339849  
-0.2830088537  
-0.2958898932  
-0.2887776006  
-0.2597290652  
-0.2089614593  
-0.1390066373  
-0.05459502473  
0.03773792712  
0.130284976  
0.2149626192  
0.284186753  
0.3317158745  
0.3533587047  
0.3474529617  
0.3150503166  
0.2597836858  
0.1874213021  
0.1051734054  
0.02083446579  
