0.1504613936  
0.3915398337  
0.6012968487  
0.754258  
0.8336292698  
0.8339559864  
0.7620481164  
0.6360036861  
0.482472341  
0.3325571116  
0.2169696444  
0.1611809457  
0.1812985643  
0.2813148995  
0.4521632858  
0.6727382462  
0.9127488242  
1.136993137  
1.310432622  
1.40329702  
1.395500741  
1.279689648  
1.062502344  
0.763852224  
0.4143650102  
0.05133140122  
-0.2862294744  
-0.562703765  
-0.7505125167  
-0.8336239784  
-0.8095069523  
-0.6893130271  
-0.4963145298  
-0.2628455435  
-0.02619527744  
0.1760158616  
0.3103818089  
0.3516402359  
0.2855457852  
0.1103923316  
-0.162917989  
-0.5122104948  
-0.9065650236  
-1.309711756  
-1.683899347  
-1.993817246  
-2.210175256  
-2.312585009  
-2.291478474  
-2.148878776  
-1.897969919  
-1.56150511  
-1.169220639  
-0.7545315406  
-0.3508709439  
0.01192269138  
0.3107143158  
0.5313176926  
0.6695654223  
0.7310701519  
0.7297038453  
0.6850181435  
0.6189868529  
0.5525643952  
0.5025769791  
0.4794342167  
0.4859955265  
0.5177390406  
0.56417036  
0.61117676  
0.6438915241  
0.649533612  
0.6197183712  
0.5518380565  
0.4492778906  
0.3204939976  
0.1771515345  
0.03174162718  
-0.1048452687  
-0.2252833542  
-0.3269394232  
-0.4119275991  
-0.4861177399  
-0.5573050471  
-0.6329398564  
-0.7179060096  
-0.8128281772  
-0.913284178  
-1.010115464  
-1.090823843  
-1.141791397  
-1.15092596  
-1.110207459  
-1.017641231  
-0.8782115691  
-0.7036124804  
-0.5107585367  
-0.3192960308  
-0.148531346  
-0.01430542382  
0.07365102164  
0.113387651  
0.1111272854  
0.080263945  
0.03911492422  
0.007748193678  
0.004412567141  
0.04214815273  
0.1261518486  
0.252365768  
0.407560872  
0.5709739441  
0.717274114  
0.8204624063  
0.8581175438  
0.8153368435  
0.6877739322  
0.4832602722  
0.2217337329  
-0.06657461762  
-0.3444984522  
-0.5723938536  
-0.7131242565  
-0.7369010128  
-0.6253308789  
-0.3741461081  
0.005728091087  
0.4889139942  
1.038018029  
1.607446156  
2.148142642  
2.612681299  
2.960140925  
3.160233206  
3.196265388  
3.066670479  
2.784967821  
2.378229402  
1.884211697  
1.347483623  
0.8149453249  
0.3311736529  
-0.06592792868  
-0.3487685747  
-0.5026152104  
-0.5267953403  
-0.4344338672  
-0.250741958  
-0.0100393691  
0.248159517  
0.483574079  
0.6596029104  
0.747272527  
0.7282648693  
0.5966689161  
0.359299084  
0.03456703225  
-0.3499045548  
-0.7606058984  
-1.161966696  
-1.520218359  
-1.80682557  
-2.001118098  
-2.091870252  
-2.077712079  
-1.966420484  
-1.773272069  
-1.518730028  
-1.225807911  
-0.9174512526  
-0.6142558864  
-0.3327671876  
-0.08449917095  
0.124262967  
0.2919522344  
0.4206310053  
0.5145559583  
0.5786320417  
0.6170135571  
0.6320835144  
0.623956576  
0.5905760865  
0.5283847736  
0.4334367008  
0.3027380966  
0.1355716716  
-0.06545454136  
-0.2938525068  
-0.5393391391  
-0.7885932569  
-1.026596138  
-1.238371444  
-1.410859557  
-1.534612193  
-1.605029935  
-1.622909105  
-1.594203897  
-1.528992983  
-1.439822227  
-1.339666286  
-1.239847171  
-1.148237766  
-1.068071506  
-0.9975330702  
-0.9302285509  
-0.8564484717  
-0.7650262427  
-0.6454800245  
-0.490108413  
-0.2956877821  
-0.06451767092  
0.1953406783  
0.4706630731  
0.7443787598  
0.9974079198  
1.21073519  
1.367441348  
1.454428179  
1.463658688  
1.39280707  
1.245313224  
1.029920312  
0.7598085871  
0.4514841504  
0.1235600479  
-0.2044703019  
-0.5133679812  
-0.7851850006  
-1.004170458  
-1.157566556  
-1.236286275  
-1.23545449  
-1.154779532  
-0.9986927997  
-0.7762042377  
-0.5004213935  
-0.1877145523  
0.143438278  
0.4738556047  
0.7851829862  
1.061382443  
1.290017146  
1.463167383  
1.577857352  
1.635923364  
1.643343248  
1.609103091  
1.543759445  
1.457890274  
1.360655651  
1.258663271  
1.15530184  
1.050621527  
0.941771081  
0.8239115851  
0.6914450453  
0.5393858843  
0.3646291386  
0.166954861  
-0.05041060618  
-0.2807400018  
-0.5142758155  
-0.7391521218  
-0.9426364362  
-1.112537467  
-1.238564348  
-1.313498753  
-1.334005702  
-1.300998214  
-1.219518894  
-1.098142672  
-0.9479845137  
-0.7814153208  
-0.6106522316  
-0.4463831566  
-0.2966090492  
-0.165853962  
-0.05487353014  
0.03908159637  
0.1214547262  
0.1991102616  
0.278780353  
0.3654561383  
0.4609926277  
0.5631927637  
0.6655713057  
0.7579195114  
0.8276521309  
0.8617947777  
0.84932907  
0.7835482724  
0.6640037413  
0.4976899998  
0.2991948395  
0.089677626  
-0.1052603741  
-0.2585884627  
-0.3453570793  
-0.3462323997  
-0.2505322272  
-0.05832397084  
0.2187694648  
0.5582316625  
0.9287334741  
1.293431403  
1.614074988  
1.855417785  
1.989368427  
1.998359197  
1.877476505  
1.635091781  
1.291889817  
0.8784285142  
0.4315311383  
-0.01001990318  
-0.4099240075  
-0.7383806133  
-0.9751559348  
-1.111340234  
-1.149581491  
-1.102822559  
-0.9917570697  
-0.8414080778  
-0.677328939  
-0.5219902073  
-0.391865808  
-0.295606928  
-0.2335565095  
-0.198609713  
-0.1782599944  
-0.157476609  
-0.1219422313  
-0.06113491418  
0.02923278076  
0.1458061373  
0.2774237382  
0.4062449856  
0.5100025706  
0.5650531587  
0.549790182  
0.4479213303  
0.2511449341  
-0.03916777538  
-0.4115104834  
-0.8450894686  
-1.311869262  
-1.77954615  
-2.215078404  
-2.588300366  
-2.875184573  
-3.06031866  
-3.138317869  
-3.113984406  
-3.00122116  
-2.820843214  
-2.59757174  
-2.356601862  
-2.120186683  
-1.904688816  
-1.718485345  
-1.561026382  
-1.423192135  
-1.288917445  
-1.137889353  
-0.9489689836  
-0.7038513982  
-0.3904502806  
-0.005499987964  
0.4440285767  
0.9409488491  
1.459337439  
1.96730879  
2.430693945  
2.81711598  
3.099881391  
3.261155576  
3.293972604  
3.202847056  
3.002938706  
2.717956451  
2.377132483  
2.011739477  
1.651633549  
1.322265014  
1.042500815  
0.8234380107  
0.6682432685  
0.5728957181  
0.5276164722  
0.518693721  
0.5304348575  
0.5469817501  
0.5538265321  
0.5389262022  
0.4934007507  
0.4118760276  
0.2925266812  
0.136933092  
-0.0501797494  
-0.2612919424  
-0.4865049155  
-0.7140566659  
-0.9309687019  
-1.123866617  
-1.279969963  
-1.388213583  
-1.440423003  
-1.432388156  
-1.36469124  
-1.243096176  
-1.078373357  
-0.8854833281  
-0.6821210072  
-0.4867605022  
-0.3164093577  
-0.1843928598  
-0.09849310961  
-0.05977164835  
-0.06231527913  
-0.09401084047  
-0.1382811028  
-0.1765684725  
-0.1911866209  
-0.1680835693  
-0.09906047057  
0.01693537836  
0.1736739446  
0.3587010661  
0.5553974594  
0.745697605  
0.9129713922  
1.044590639  
1.133710729  
1.180003546  
1.189225839  
1.171746231  
1.14033077  
1.107618705  
1.083742361  
1.074535293  
1.080612992  
1.097467455  
1.116509425  
1.126851418  
1.117446703  
1.079220377  
1.006783541  
0.8994554036  
0.7614189863  
0.6010295751  
0.4294103325  
0.25861219  
0.09966581554  
-0.03913697111  
-0.153428864  
-0.2432524772  
-0.3127699489  
-0.3692803  
-0.4217304092  
-0.4790071761  
-0.5483067143  
-0.6338679382  
-0.7362908174  
-0.852528446  
-0.9765378664  
-1.100445522  
-1.21599638  
-1.316009275  
-1.395579608  
-1.452807598  
-1.488943749  
-1.507944153  
-1.515531541  
-1.517953904  
-1.520668693  
-1.527182116  
-1.538251163  
-1.551562941  
-1.561940359  
-1.562031046  
-1.543351181  
-1.497537883  
-1.41760236  
-1.299028768  
-1.140557172  
-0.9445666213  
-0.7170100382  
-0.4669173376  
-0.2055373469  
0.05478395841  
0.3018470639  
0.524819027  
0.7152811445  
0.8679851482  
0.9812151191  
1.056719504  
1.099216185  
1.115555001  
1.113647502  
1.101326364  
1.085310365  
1.070415542  
1.059140358  
1.051655597  
1.046201661  
1.039768465  
1.028938375  
1.010707344  
0.9831225387  
0.9456221334  
0.8990196355  
0.8451567414  
0.7863383693  
0.7246764052  
0.6615450111  
0.5972642796  
0.531130591  
0.4617864223  
0.387860252  
0.3087151998  
0.2251138482  
0.1395966397  
0.05642987004  
-0.01894166757  
-0.08088198  
-0.1248159846  
-0.1485189219  
-0.1531286921  
-0.1436362946  
-0.1286529469  
-0.1194109437  
-0.1280861977  
-0.165691331  
-0.2398876551  
-0.3531258831  
-0.5014864036  
-0.6745069138  
-0.8561133807  
-1.026590549  
-1.165335538  
-1.253976299  
-1.279372768  
-1.235982685  
-1.127175259  
-0.9652372636  
-0.769997931  
-0.5662479641  
-0.3803136143  
-0.2362943296  
-0.1525337182  
-0.138871932  
-0.1951086586  
-0.3109181008  
-0.4672350402  
-0.6389165945  
-0.7982644988  
-0.9189003995  
-0.9794122118  
-0.9662407282  
-0.8754097305  
-0.7128690928  
-0.4934349062  
-0.2385249852  
0.02695652923  
0.278102643  
0.4933566918  
0.6572592813  
0.7622183062  
0.8091237697  
0.806750605  
0.7701255393  
0.7181256046  
0.6707059818  
0.646149986  
0.658710327  
0.7169289028  
0.8227753492  
0.9716500035  
1.153146497  
1.352402414  
1.551810994  
1.732874536  
1.877999658  
1.972091016  
2.003839254  
1.96668072  
1.859388476  
1.686297723  
1.457156905  
1.186573051  
0.8930580343  
0.597650285  
0.3221764639  
0.08722939054  
-0.08995378354  
-0.197508622  
-0.2305774616  
-0.192314471  
-0.09403911546  
0.04557133343  
0.2022540713  
0.3487335627  
0.4578119033  
0.5055975975  
0.4744358956  
0.3551434771  
0.1482434294  
-0.1359886636  
-0.4786555602  
-0.8543970845  
-1.234267322  
-1.588945099  
-1.891858564  
-2.121849801  
-2.265076281  
-2.315977232  
-2.277270648  
-2.159059202  
-1.977247195  
-1.751493279  
-1.502992039  
-1.252327279  
-1.017608376  
-0.8130358556  
-0.6479841363  
-0.5266173587  
-0.4480142561  
-0.4067347539  
-0.3937533633  
-0.397656701  
-0.4060033218  
-0.4067468252  
-0.3895943032  
-0.3472027372  
-0.2760854846  
-0.1771254751  
-0.05561911402  
0.07919206223  
0.2150958131  
0.338304536  
0.4351347418  
0.4937839951  
0.5059677529  
0.4682040881  
0.3825276311  
0.2565308772  
0.1026607106  
-0.06314122238  
-0.2233113866  
-0.3607898003  
-0.4611263902  
-0.5142451965  
-0.5156458237  
-0.466840835  
-0.3749865833  
-0.251759682  
-0.1116572509  
0.03003005216  
0.1592608286  
0.2650038734  
0.340473898  
0.3836752568  
0.3972051256  
0.3873854958  
0.3628894631  
0.3331214117  
0.3065994446  
0.2896440754  
0.2855445745  
0.2943545685  
0.313305057  
0.3377461448  
0.3624145453  
0.3827800585  
0.3962019782  
0.4026538528  
0.4048905292  
0.4079920687  
0.418385017  
0.4425166815  
0.4854399641  
0.549585555  
0.6339694185  
0.7339885627  
0.8418628781  
0.9476520668  
1.040664585  
1.11102121  
1.151094341  
1.156578298  
1.127023152  
1.065744774  
0.9791520196  
0.8756191403  
0.764095237  
0.6527087251  
0.5475714172  
0.4520002388  
0.3662479567  
0.2877996563  
0.2121560893  
0.1339830249  
0.0484291491  
-0.04760352003  
-0.1544501256  
-0.2691059528  
-0.3851896254  
-0.4934869426  
-0.5830127468  
-0.6424716013  
-0.6619238336  
-0.634428009  
-0.557446313  
-0.433784041  
-0.2719358948  
-0.08573606237  
0.1066729243  
0.2844639701  
0.4261774895  
0.5119715088  
0.5258158881  
0.4573675305  
0.3033094655  
0.06799396355  
-0.2366821312  
-0.5921557466  
-0.9747109153  
-1.357459252  
-1.712569094  
-2.013499804  
-2.237058504  
-2.365094275  
-2.385740392  
-2.294152952  
-2.092744279  
-1.79095739  
-1.404627698  
-0.9549854159  
-0.4673603158  
0.03036686168  
0.5095041788  
0.9424088273  
1.304357988  
1.575318237  
1.741438832  
1.796136123  
1.740608435  
1.583692377  
1.341028556  
1.0335845  
0.6856625361  
0.3226247227  
-0.03144429222  
-0.3558260739  
-0.6347932907  
-0.8585605009  
-1.023478932  
-1.131469047  
-1.188814112  
-1.204497  
-1.188345895  
-1.149256502  
-1.093751806  
-1.025067877  
-0.9428998117  
-0.8438085259  
-0.7222264274  
-0.5718935414  
-0.3875049012  
-0.1663249553  
0.0904891178  
0.3770441558  
0.6825078235  
0.9915933209  
1.285704758  
1.54462208  
1.74852317  
1.880103129  
1.926529488  
1.880989916  
1.743629539  
1.521783439  
1.229449981  
0.8860905159  
0.5148837713  
0.1406325548  
-0.2124367643  
-0.5227726801  
-0.7732698254  
-0.9525624341  
-1.055735073  
-1.084393798  
-1.04612934  
-0.9534388545  
-0.822223949  
-0.6700285854  
-0.5141876136  
-0.3700692932  
-0.2495914539  
-0.1601559699  
-0.104106508  
-0.07877281948  
-0.07709510852  
-0.08877113029  
-0.1018040975  
-0.10428008  
-0.08617763538  
-0.04098210639  
0.03310454362  
0.1325322315  
0.2484894207  
0.367735512  
0.4741482179  
0.5508128158  
0.5824372662  
0.557758735  
0.471601437  
0.3262491186  
0.1318717875  
-0.09415488509  
-0.3290157543  
-0.5471455506  
-0.7235010996  
-0.836966284  
-0.8733975874  
-0.8278180566  
-0.7054170059  
-0.5211395784  
-0.2978871459  
-0.06356076935  
0.1526511499  
0.3242050051  
0.4307953787  
0.4611020186  
0.4143024186  
0.3001603302  
0.1377043525  
-0.04730358173  
-0.2257181205  
-0.3687434053  
-0.4515278262  
-0.4561948238  
-0.3739531644  
-0.2060805548  
0.03628167839  
0.3334308173  
0.6593071216  
0.9843154512  
1.278436188  
1.514309514  
1.669994559  
1.73114043  
1.692404115  
1.557967139  
1.341128081  
1.062968564  
0.7502176623  
0.4324831629  
0.1391048916  
-0.1040414263  
-0.2774481114  
-0.3702284041  
-0.3814048042  
-0.3200149386  
-0.2039661781  
-0.05771067843  
0.09099377146  
0.2148336346  
0.2906921674  
0.3028696521  
0.2452806498  
0.122285227  
-0.05201004718  
-0.2559001636  
-0.4633852352  
-0.6481135902  
-0.7873865535  
-0.8655725174  
-0.8764039093  
-0.8237822934  
-0.7209590463  
-0.5882308733  
-0.4495232444  
-0.3284235873  
-0.244312004  
-0.2092296361  
-0.2259848869  
-0.2878188438  
-0.3796560887  
-0.4807452466  
-0.5682292444  
-0.6210532982  
-0.6235576543  
-0.5681682302  
-0.4567288243  
-0.3002756303  
-0.1172882939  
0.06927020646  
0.2356416374  
0.3610521674  
0.4309785298  
0.4393522451  
0.389363184  
0.2927301455  
0.167606277  
0.03546176712  
-0.08252184806  
-0.1689413825  
-0.2129817333  
-0.2120869235  
-0.1722494355  
-0.1068806593  
-0.03446809351  
0.02457128698  
0.0513291999  
0.0315674047  
-0.04190571582  
-0.1680134001  
-0.3375290965  
-0.5344905631  
-0.7386591145  
-0.9286088284  
-1.08493087  
-1.193024335  
-1.245034463  
-1.240639332  
-1.186586586  
-1.095099278  
-0.981469749  
-0.8612537944  
-0.7475901026  
-0.6490987893  
-0.5686945636  
-0.5035013169  
-0.4458507917  
-0.3851258147  
-0.3101084313  
-0.2113747001  
-0.08331216849  
0.07460153196  
0.2574661251  
0.4556195503  
0.6561375472  
0.8449113967  
1.008917729  
1.138300577  
1.227912533  
1.278071844  
1.294416211  
1.286893638  
1.26805729  
1.250933105  
1.246800897  
1.263224488  
1.302632471  
1.361680866  
1.431480547  
1.498696255  
1.547350353  
1.56109105  
1.525601112  
1.430807094  
1.272566532  
1.053587675  
0.783440731  
0.477668845  
0.1560927652  
-0.1594194579  
-0.4474479755  
-0.6894118892  
-0.8715671975  
-0.9863501323  
-1.032938598  
-1.016986307  
-0.9496202711  
-0.8458804228  
-0.7228187515  
-0.5975391438  
-0.4853895721  
-0.3985249987  
-0.3449603347  
-0.3281776672  
-0.347269199  
-0.3975415816  
-0.4714755344  
-0.5598759955  
-0.6530805156  
-0.742080663  
