186.0106996  
195.0591558  
209.5782978  
242.2898517  
728.0635064  
443.6477254  
11821.00973  
7293.157938  
13788.4358  
12342.25554  
27492.08722  
42499.81443  
92969.64201  
29353.33326  
3285.760177  
3081.132432  
22476.11773  
5900.763488  
16261.02426  
39908.75172  
6785.282338  
3987.856621  
3722.662906  
23321.06818  
2137.509243  
17242.28014  
2288.450639  
3126.38931  
412.2080586  
3907.066772  
11519.4755  
14860.83969  
1791.578569  
2867.399701  
12699.09349  
143.954144  
3395.314185  
536.068912  
3102.846036  
10765.44016  
2127.135677  
1169.600555  
3804.023672  
3007.944928  
703.6244604  
1303.666946  
111.7993014  
480.015299  
929.4082563  
3255.562926  
565.3086475  
644.0117793  
2909.922249  
2665.332609  
1628.97102  
388.319032  
262.7467914  
983.3019364  
25.67008375  
585.4601678  
81.82498291  
43.81425529  
112.5158116  
80.72467829  
305.4461667  
162.795821  
70.0855494  
20.91293545  
4.770374585  
39.84437305  
3.882402376  
0.7681417608  
0.2720771444  
0.9460390873  
0.3722529342  
0.1221661148  
2.03704873  
0.09168418556  
0.1381556014  
0.521138491  
0.2671360632  
0.1415691994  
0.05323341478  
0.07041191298  
0.06809866146  
0.06121028199  
0.03344114582  
0.07481072819  
0.1421453204  
0.05962404151  
0.05459940197  
0.05778789499  
0.07129596473  
0.05849267012  
0.06411282578  
0.06329984556  
0.05391955345  
0.05181195799  
0.05918234855  
0.05194488244  
0.05468900532  
0.05685919923  
0.05079647809  
0.04922303523  
0.04848201118  
0.04690695685  
0.04521836042  
0.04382369026  
0.04232278407  
0.04145527339  
0.03972780674  
0.03818443382  
0.03755481717  
0.03649001055  
0.03512243805  
0.03430096102  
0.03313008231  
0.03222239647  
0.03113502354  
0.03036703167  
0.02937536663  
0.028501428  
0.02771608595  
0.02690520053  
0.02602384551  
0.02532277785  
0.02465323167  
0.0238689259  
0.0231954178  
0.02253431831  
0.02185314728  
0.021262436  
0.02066536464  
0.02006462428  
0.01952984384  
0.01899587712  
0.01845936547  
0.01795287214  
0.01745547369  
0.01698509681  
0.0165218736  
0.01607911106  
0.01564813004  
0.01522732511  
0.01482240217  
0.01443032213  
0.01404714227  
0.01368157348  
0.01332546609  
0.01297871482  
0.01264324668  
0.01231783814  
0.01200167944  
0.01169740703  
0.01140058322  
0.01111485706  
0.01083423791  
0.01056135271  
0.01030067387  
0.01004536769  
0.009797825741  
0.009555492326  
0.009325574601  
0.009098156949  
0.008876531756  
0.008662813958  
0.00845612628  
0.008256727458  
0.008059603167  
0.007867510713  
0.007684219788  
0.007504060412  
0.007329667517  
0.007157065441  
0.006994027702  
0.006832417335  
0.006675665488  
0.00652278691  
0.006376356213  
0.006230544273  
0.00609007183  
0.005952784743  
0.005819692258  
0.005690698645  
0.005564803193  
0.005441380152  
0.00532305249  
0.005205499909  
0.005092949985  
0.004981247421  
0.004873904948  
0.004769099798  
0.004667366833  
0.004567691668  
0.004469047983  
0.004376446459  
0.004283705489  
0.004192993041  
0.004104691375  
0.004019067037  
0.003936775689  
0.003853441051  
0.003775037754  
0.00369666923  
0.003621052564  
0.003547719179  
0.003474669644  
0.003402882162  
0.003335924061  
0.003268020314  
0.003202501038  
0.003137418371  
0.003075851236  
0.003015135801  
0.002955871376  
0.002896248889  
0.002839415912  
0.002783913815  
0.002730037132  
0.002676458535  
0.002623771885  
0.002573339287  
0.002524303758  
0.002474900593  
0.002428380299  
0.002381080526  
0.002335217778  
0.002291675915  
0.002247153881  
0.002205319676  
0.002163817237  
0.002123975429  
0.002083643534  
0.002045175578  
0.002006895376  
0.001969237428  
0.00193307092  
0.001897042962  
0.001863361947  
0.001828167921  
0.001794077262  
0.001761878196  
0.001729285797  
0.00169736487  
0.001667652122  
0.001637068104  
0.001607787716  
0.001579150485  
0.001549784624  
0.001522499774  
0.001495320261  
0.001468377096  
0.001441820786  
0.001416505197  
0.001391466603  
0.001367597173  
0.001342792008  
0.001320116666  
0.001296122135  
0.001273398976  
0.001251366454  
0.00122951126  
0.001209077169  
0.001187456227  
0.001167217187  
0.001146506556  
0.001126765423  
0.001108029212  
0.001087075951  
0.001069442291  
0.001050898446  
0.001033441488  
0.001015094574  
0.0009979002759  
0.0009807198802  
0.0009647149485  
0.0009480854364  
0.000932013279  
0.0009155803501  
0.0009009895032  
0.0008854908242  
0.0008711098253  
0.0008566712064  
0.000841391238  
0.0008283161062  
0.0008146557757  
0.0008004982545  
0.0007875611234  
0.0007739686374  
0.0007606169911  
0.0007484963671  
0.0007363096481  
0.000724252397  
0.0007115762008  
0.0007004914202  
0.000689152922  
0.0006779096623  
0.0006664877906  
0.0006551754352  
0.0006446527939  
0.0006340967449  
0.0006238954184  
0.0006131855305  
0.000603170497  
0.0005930008456  
0.0005837759769  
0.0005745784976  
0.0005650443221  
0.0005555665  
0.0005465290169  
0.0005376616462  
0.0005288895702  
0.0005204960708  
0.0005121871196  
0.0005039943655  
0.0004956776414  
0.0004879821171  
0.0004796601238  
0.0004719143586  
0.0004640708807  
0.0004569369777  
0.0004491974092  
0.000441922156  
0.0004350754239  
0.0004282301408  
0.0004215093866  
0.0004144741818  
0.0004077325811  
0.0004012681575  
0.0003947512152  
0.0003884595736  
0.0003825272085  
0.000376267728  
0.0003698547106  
0.000364375803  
0.0003584338198  
0.0003525797207  
0.0003474557382  
0.0003416180889  
0.0003358092175  
0.0003304956741  
0.0003253172575  
0.0003203837779  
0.0003149161956  
0.0003101271013  
0.0003049167547  
0.0003001866193  
0.0002952900341  
0.0002905736705  
0.0002859949358  
0.0002813972716  
0.0002770864225  
0.0002721979659  
0.0002680391507  
0.0002637707062  
0.0002596408732  
0.0002553155612  
0.0002515970844  
0.0002474092251  
0.0002434365631  
0.0002393739144  
0.0002356351304  
0.0002319512068  
0.0002282565327  
0.0002246657715  
0.0002209149617  
0.0002173228326  
0.0002139525469  
0.0002104923694  
0.0002071153449  
0.0002035769713  
0.000200531906  
0.0001974123038  
0.0001940904927  
0.0001911419117  
0.0001879910077  
0.000184746538  
0.0001819926104  
0.0001788681259  
0.000176114103  
0.0001733528183  
0.0001702377932  
0.0001678350153  
0.0001652092613  
0.0001623154584  
0.0001598847692  
0.000157402382  
0.0001548282413  
0.0001521104994  
0.0001498067677  
0.0001475005254  
0.0001449766621  
0.0001428052865  
0.0001404047672  
0.0001381495643  
0.0001359930986  
0.00013371046  
0.000131686645  
0.0001295954062  
0.0001271966361  
0.0001254239176  
0.0001234479375  
0.0001215038176  
0.0001194500657  
0.0001176212541  
0.0001156410799  
0.0001137448595  
0.0001117619422  
0.0001101346458  
0.0001084413486  
0.0001067178318  
0.0001050348296  
0.0001032215227  
0.0001015620647  
0.0001000890992  
9.849450252e-05  
9.70130231e-05  
9.541963721e-05  
9.404251154e-05  
9.234325135e-05  
9.106290874e-05  
8.954191889e-05  
8.809719179e-05  
8.675283176e-05  
8.567382461e-05  
8.412375681e-05  
8.306275607e-05  
8.173351444e-05  
8.049986927e-05  
7.921281437e-05  
7.796830492e-05  
7.680544618e-05  
7.585154991e-05  
7.465125404e-05  
7.363770572e-05  
7.253755017e-05  
7.136981986e-05  
7.034894296e-05  
6.913077613e-05  
6.817905642e-05  
6.733303309e-05  
6.644063631e-05  
6.570860867e-05  
6.451508935e-05  
6.376117579e-05  
6.287899202e-05  
6.205442131e-05  
6.119122198e-05  
6.034813956e-05  
5.96500285e-05  
5.879277478e-05  
5.821271625e-05  
5.708963089e-05  
5.664896168e-05  
5.576616242e-05  
5.540547868e-05  
5.462557661e-05  
5.405659657e-05  
5.34119074e-05  
5.277459462e-05  
5.226241188e-05  
5.152723466e-05  
5.124569637e-05  
5.061177008e-05  
5.023904261e-05  
4.94962251e-05  
4.923060212e-05  
4.881874143e-05  
4.834186891e-05  
4.781090303e-05  
4.748459557e-05  
4.707053611e-05  
4.662962973e-05  
4.637456625e-05  
4.603596397e-05  
4.583160981e-05  
4.542386755e-05  
4.522830468e-05  
4.499266205e-05  
4.465294453e-05  
4.454438176e-05  
4.424347259e-05  
4.411321609e-05  
4.39380378e-05  
4.382072741e-05  
4.358699033e-05  
4.347345218e-05  
4.343554375e-05  
4.331216712e-05  
4.325332522e-05  
4.309993251e-05  
4.30810914e-05  
4.296875056e-05  
4.333048273e-05  
