0.5216824166  
0.3012784829  
0.08283682928  
-0.1226410523  
-0.3046135743  
-0.4537155764  
-0.5623801442  
-0.6253270332  
-0.6399332593  
-0.6064662686  
-0.5282002063  
-0.411389269  
-0.2650908022  
-0.1007941252  
0.06817814488  
0.2274939778  
0.3628782238  
0.4613385815  
0.512468262  
0.5096843888  
0.4512240675  
0.3407355595  
0.1873380258  
0.005049493175  
-0.1883966061  
-0.3732626631  
-0.5298617144  
-0.6407212587  
-0.6925732396  
-0.6779311829  
-0.5960306516  
-0.4530148266  
-0.2613481417  
-0.03852605733  
0.1947436429  
0.4166560446  
0.6064722449  
0.7464701032  
0.8234813649  
0.8298813015  
0.7639584665  
0.6297156627  
0.4361679635  
0.1963005275  
-0.07415201064  
-0.3579706277  
-0.637609557  
-0.8962099869  
-1.118419514  
-1.291060558  
-1.403682283  
-1.449052985  
-1.423612487  
-1.327880666  
-1.166748618  
-0.9495844682  
-0.6900162997  
-0.4053208174  
-0.1153404742  
0.1590352497  
0.3977279628  
0.5834880231  
0.7037994693  
0.7524108472  
0.7302108113  
0.64526562  
0.5119314677  
0.3491088105  
0.1778313615  
0.01852280485  
-0.1116960451  
-0.2012446828  
-0.2455229355  
-0.2473324183  
-0.2162163636  
-0.1668120255  
-0.1164739432  
-0.08253094806  
-0.07957816117  
-0.1172136722  
-0.1985194787  
-0.3194997352  
-0.4695126457  
-0.6326154328  
-0.7896127578  
-0.9205066599  
-1.007045231  
-1.035046272  
-0.9962375524  
-0.8894387479  
-0.7209632017  
-0.5042209487  
-0.2585813495  
-0.007586331027  
0.2233088278  
0.4092826072  
0.5287470917  
0.5657471687  
0.5119304268  
0.3678248724  
0.1432696841  
-0.143137005  
-0.4655723602  
-0.7934002691  
-1.094236501  
-1.337334347  
-1.496893977  
-1.554891779  
-1.503062479  
-1.343769176  
-1.089645714  
-0.7620653375  
-0.388619596  
3.204611284e-05  
0.3735556865  
0.7051311528  
0.9740679341  
1.167544401  
1.281329808  
1.319472187  
1.293078266  
1.218442804  
1.114794861  
1.002018551  
0.8986043643  
0.8200636284  
0.7779093669  
0.7792357386  
0.8268005918  
0.9194810541  
1.052922242  
1.220202634  
1.412388651  
1.618915034  
1.827795835  
2.025740932  
2.198324028  
2.330326261  
2.40639947  
2.412087812  
2.335205843  
2.167416335  
1.905824593  
1.554295502  
1.124227989  
0.6345318633  
0.1106981742  
-0.4170747473  
-0.9165374264  
-1.356550314  
-1.710368508  
-1.958605828  
-2.091471979  
-2.109941593  
-2.025660852  
-1.859572986  
-1.639407967  
-1.39637349  
-1.161452666  
-0.9618198818  
-0.8178271723  
-0.7409439832  
-0.7329026364  
-0.7861055804  
-0.8852072893  
-1.009588711  
-1.136362423  
-1.243462314  
-1.312410264  
-1.330384372  
-1.291384122  
-1.196372701  
-1.052477958  
-0.8714436858  
-0.6676049152  
-0.4557337491  
-0.2490670286  
-0.05778819212  
0.1118604493  
0.2577745141  
0.3815239133  
0.4873778081  
0.5810034349  
0.6680773803  
0.7530179448  
0.8380343054  
0.9226091045  
1.003468291  
1.075041076  
1.130296214  
1.16187456  
1.163320046  
1.130274497  
1.061457321  
0.9592987221  
0.8301346497  
0.6839077442  
0.5333634011  
0.3928205017  
0.2766140769  
0.1973721252  
0.1643305034  
0.1818985935  
0.2486659783  
0.3570425722  
0.4936223813  
0.64029911  
0.7760557401  
0.8792596517  
0.9301865893  
0.9134683986  
0.8201201841  
0.6488530584  
0.4064507021  
0.1071289652  
-0.2290789849  
-0.5786814388  
-0.9175121452  
-1.223528405  
-1.479210235  
-1.67320924  
-1.801029171  
-1.864679951  
-1.871427846  
-1.831904795  
-1.757962652  
-1.660662365  
-1.548752337  
-1.427879105  
-1.300623999  
-1.167265914  
-1.027061479  
-0.879709036  
-0.7266496433  
-0.5718941954  
-0.422170475  
-0.2863445212  
-0.1742046054  
-0.09482933663  
-0.0548807787  
-0.05713193313  
-0.0995306188  
-0.1749893689  
-0.271959368  
-0.3756978773  
-0.4700284131  
-0.5393202739  
-0.5703681497  
-0.5539136167  
-0.4856108198  
-0.3663239286  
-0.201793766  
-0.001760543119  
0.2212764713  
0.4534597897  
0.680946992  
0.8910847143  
1.073302998  
1.219664937  
1.325109353  
1.387430226  
1.407076109  
1.386844721  
1.33152393  
1.247518724  
1.142462989  
1.02478577  
0.9032326323  
0.786306163  
0.6816489764  
0.5954106903  
0.5316703386  
0.4920104463  
0.4753303884  
0.4779784262  
0.4942161467  
0.516995663  
0.5389548697  
0.5534874512  
0.5557232924  
0.5432437246  
0.516408506  
0.4782096929  
0.4336672803  
0.3888507973  
0.3496879342  
0.320770663  
0.304374358  
0.2998743495  
0.3036969681  
0.3098129065  
0.3107206355  
0.2987508645  
0.2674588517  
0.2128593415  
0.1342766547  
0.03465424465  
-0.07974601417  
-0.2001969388  
-0.3167790567  
-0.419851985  
-0.5014801709  
-0.556579605  
-0.5836036931  
-0.5846709862  
-0.5651152715  
-0.5325579873  
-0.4956370835  
-0.4626317749  
-0.4401700146  
-0.4322374034  
-0.4396335796  
-0.4599455125  
-0.4880370109  
-0.5169582113  
-0.5391400677  
-0.5476687341  
-0.5374398278  
-0.5060249908  
-0.4540971418  
-0.3853639621  
-0.3060104504  
-0.2237450065  
-0.1465872737  
-0.08160430976  
-0.03378431722  
-0.005247099697  
0.005073003258  
0.001217919861  
-0.01054357235  
-0.02286325198  
-0.02871140541  
-0.02277214499  
-0.002603002715  
0.03066204829  
0.07223008626  
0.1142434068  
0.1469916735  
0.1605790689  
0.1467856833  
0.1007894801  
0.02245762886  
-0.0830793469  
-0.2056898391  
-0.3313733678  
-0.4440962995  
-0.5280609283  
-0.5700450953  
-0.5614199725  
-0.4995151922  
-0.3881031964  
-0.2369156928  
-0.06029074725  
0.1248227316  
0.301158298  
0.4533301605  
0.5696036663  
0.6429358845  
0.6711827009  
0.6564925616  
0.6040553764  
0.5205211452  
0.4124112437  
0.2848757846  
0.1410379802  
-0.0179453646  
-0.1921463806  
-0.381624799  
-0.5849831065  
-0.7980760647  
-1.013195509  
-1.218976078  
-1.401146876  
-1.544037298  
-1.632637506  
-1.654862843  
-1.603613485  
-1.478243027  
-1.285137414  
-1.037252291  
-0.7526248917  
-0.4520647172  
-0.1563690175  
0.1165183864  
0.3539569163  
0.550268888  
0.7073557261  
0.834139049  
0.9449065239  
1.056772988  
1.186620576  
1.347958868  
1.548143346  
1.786383167  
2.052832559  
2.32895393  
2.589150868  
2.803520323  
2.941409752  
2.975344966  
2.884836896  
2.659569682  
2.301514429  
1.825660353  
1.259206447  
0.6392568821  
0.009257592453  
-0.5854052108  
-1.102132796  
-1.505581924  
-1.771336933  
-1.888345814  
-1.859844081  
-1.702690025  
-1.445228342  
-1.123979705  
-0.7795859975  
-0.4525014439  
-0.1789245261  
0.01259831627  
0.1035755677  
0.08680267911  
-0.03362050982  
-0.2433828522  
-0.5199648913  
-0.8352865659  
-1.158688858  
-1.459955228  
-1.712103947  
-1.893714351  
-1.990621959  
-1.996861759  
-1.914803208  
-1.754501625  
-1.532321194  
-1.268988679  
-0.9872688967  
-0.7095101704  
-0.4553191891  
-0.2396376935  
-0.0714307648  
0.04686458723  
0.1190757759  
0.1542728077  
0.1651465171  
0.1660211652  
0.170778329  
0.1909750772  
0.2344001573  
0.3042287312  
0.398848519  
0.5123384421  
0.6354658932  
0.7570480164  
0.8654492128  
0.9500207516  
1.002310537  
1.016920942  
0.9919622673  
0.9291046769  
0.8332727915  
0.7120767715  
0.5750552078  
0.4328447182  
0.2963222438  
0.1758094411  
0.08035638192  
0.0171355128  
-0.009031042116  
0.003997043645  
0.05550030545  
0.141893587  
0.256890961  
0.3918669833  
0.5363855499  
0.6788901353  
0.8075315453  
0.9110609607  
0.9797495188  
1.006242568  
0.9862827013  
0.9192173286  
0.8082293197  
0.6602306914  
0.4854118133  
0.2964445864  
0.1073953671  
-0.06756637183  
-0.2155495677  
-0.3262517655  
-0.3930682554  
-0.4138327467  
-0.3910920571  
-0.3318471187  
-0.246750901  
-0.1488478133  
-0.05197864062  
0.03094973147  
0.08960619219  
0.1175666934  
0.1131297884  
0.07949703602  
0.02425307711  
-0.0417941045  
-0.1062654785  
-0.1571317367  
-0.1846210748  
-0.1828262702  
-0.1507692392  
-0.09273629835  
-0.01783350511  
0.0611854109  
0.129646795  
0.1729768358  
0.1787199623  
0.1382377035  
0.04787003935  
-0.09059711397  
-0.270197256  
-0.4796743531  
-0.7048432601  
-0.9301683854  
-1.140331799  
-1.321574083  
-1.462673547  
-1.55550674  
-1.595217664  
-1.580078645  
-1.511164524  
-1.391963774  
-1.227995616  
-1.026498233  
-0.7961656037  
-0.5469045713  
-0.2895400124  
-0.03542852761  
0.2040475317  
0.4181040225  
0.5972249681  
0.7338139728  
0.8227176062  
0.8615452783  
0.8507216756  
0.7932654833  
0.6943180261  
0.5605112337  
0.3992726203  
0.2181799481  
0.02446378905  
-0.1752783577  
-0.3751307567  
-0.5697116267  
-0.7538851472  
-0.9224336631  
-1.069794535  
-1.189945783  
-1.276499946  
-1.323030615  
-1.32359148  
-1.273374591  
-1.169400201  
-1.011142426  
-0.8009783099  
-0.5443901266  
-0.2498662794  
0.07150656223  
0.4067154123  
0.7417042713  
1.062370083  
1.355562049  
1.609991372  
1.816943776  
1.970751606  
2.068966122  
2.112251155  
2.10401014  
2.049814531  
1.956719908  
1.83252378  
1.685093138  
1.521784054  
1.349042099  
1.172175138  
0.995310378  
0.8214969342  
0.6529117933  
0.4911123096  
0.3372858387  
0.1924476878  
0.05756608507  
-0.06639053327  
-0.1784800736  
-0.2778562933  
-0.3638486993  
-0.4360350599  
-0.4942685929  
-0.5386675278  
-0.5695634067  
-0.5874343919  
-0.5928452611  
-0.5864194966  
-0.5688618861  
-0.5410375065  
-0.5040782039  
-0.4595128565  
-0.4093630826  
-0.3561770486  
-0.3029649568  
-0.2530276813  
-0.2096833011  
-0.1759166508  
-0.1540009471  
-0.1451608298  
-0.1493161722  
-0.1649795624  
-0.1893247165  
-0.2184497606  
-0.2477906184  
-0.2726636318  
-0.2888516348  
-0.2931584283  
-0.2838561626  
-0.2609521024  
-0.2262324591  
-0.1830638325  
-0.1359740255  
-0.09005380652  
-0.05025871625  
-0.0207027614  
-0.004043710773  
-0.001037031329  
-0.01034350815  
-0.02862248225  
-0.05091011358  
-0.07124944807  
-0.08350637636  
-0.08225094342  
-0.06361202637  
-0.02595279154  
0.02971381983  
0.09965823451  
0.1777434707  
0.256093444  
0.3260398773  
0.3792273062  
0.4087313535  
0.4100269421  
0.3816560556  
0.3254967594  
0.2465750792  
0.1524390946  
0.05217847457  
-0.04477561528  
-0.1298930043  
-0.1966512005  
-0.2413355382  
-0.2634244957  
-0.2655009381  
-0.2527203185  
-0.2319082702  
-0.2104532289  
-0.1951664096  
-0.1912715271  
-0.2016954582  
-0.2267332133  
-0.2641317919  
-0.3095402713  
-0.3572203148  
-0.4008872652  
-0.4345256265  
-0.4530524202  
-0.4527465965  
-0.4314240392  
-0.3883979646  
-0.3243109943  
-0.2409516436  
-0.1411461414  
-0.02880822278  
0.09086805018  
0.2111326072  
0.3234381502  
0.4173930048  
0.4810571411  
0.5016915168  
0.4669695875  
0.3665855183  
0.1940583411  
-0.05152972229  
-0.364173668  
-0.7302662326  
-1.128816835  
-1.532682075  
-1.91073714  
-2.230802481  
-2.462968657  
-2.582888279  
-2.574613  
-2.432553432  
-2.162309745  
-1.780236307  
-1.311793902  
-0.7889103677  
-0.246683921  
0.2801548316  
0.760587886  
1.17009184  
1.492550322  
1.721146381  
1.858193708  
1.913996486  
1.90494709  
1.851107507  
1.773590484  
1.692010917  
1.622285071  
1.574968032  
1.554276597  
1.557864215  
1.577341182  
1.599492157  
1.608050634  
1.58587358  
1.517297828  
1.390444822  
1.199216336  
0.9447461028  
0.636105111  
0.2901066855  
-0.06983377508  
-0.4157355898  
-0.7178294455  
-0.9477879731  
-1.082059698  
-1.104896655  
-1.010683589  
-0.8052077911  
-0.5056638298  
-0.1392970061  
0.2592043538  
0.6512994478  
0.9987589178  
1.267876425  
1.433218964  
1.480417069  
1.407629063  
1.225503543  
0.9556285522  
0.6277060549  
0.275812755  
-0.06573027448  
-0.366347059  
-0.6025227362  
-0.7600539758  
-0.8349722704  
-0.8330928478  
-0.7683202287  
-0.6600294144  
-0.5299283484  
-0.3988893519  
-0.2841888956  
-0.1975329397  
-0.1440818312  
-0.1225571287  
-0.1263172583  
-0.1451796019  
-0.1676406166  
-0.1831288364  
-0.1839282614  
-0.1664942618  
-0.1319738981  
-0.08591380907  
-0.03720907627  
0.003474728832  
0.02555936909  
0.02038522056  
-0.01728638509  
-0.08829617536  
-0.1888135891  
-0.3107810845  
-0.4430225553  
-0.5728571863  
-0.6879904766  
-0.7784077471  
-0.8380034182  
-0.8656935457  
-0.865835542  
-0.8478500504  
-0.8250628424  
-0.8128754586  
-0.8264766437  
-0.878382983  
-0.9761308825  
-1.120457973  
-1.304246549  
-1.512440276  
-1.723028207  
-1.909035777  
-2.041369811  
-2.092191245  
-2.03843932  
-1.865077873  
-1.567618194  
-1.153581826  
-0.6426449889  
-0.06538164826  
0.5393230662  
1.127926713  
1.656559323  
2.085539933  
2.383532776  
2.530864119  
2.521583055  
2.364027942  
2.079853583  
1.701654244  
1.269503867  
0.8268598645  
0.4163312466  
0.07578550139  
-0.1648028957  
-0.2855038467  
-0.2774847378  
-0.1429989254  
0.1055148009  
0.4470034141  
0.853790122  
1.293778592  
1.732711516  
2.136385183  
2.4727792  
2.714073928  
2.838501145  
2.831958919  
2.689257368  
2.41481872  
2.022681955  
1.535657948  
0.9836122971  
0.4009289532  
-0.176618762  
-0.7152532115  
-1.186429246  
-1.569478678  
-1.85329319  
-2.036797813  
-2.128153404  
-2.142817879  
-2.100775831  
-2.023377246  
-1.930273055  
-1.836910349  
-1.752922599  
-1.681617833  
-1.620543153  
-1.562960868  
-1.499908633  
-1.422461798  
-1.323797356  
-1.200722325  
-1.054460424  
-0.8905934516  
-0.718246508  
-0.5486829498  
-0.3935827888  
-0.2633051662  
-0.1654061161  
-0.103637613  
-0.07753614755  
-0.0826385763  
-0.111237533  
-0.1535360044  
-0.1989946557  
-0.2376839164  
-0.2614383216  
-0.2646909584  
-0.2448970615  
-0.2025396092  
-0.1407652568  
-0.06472235137  
0.01926221941  
0.1045672009  
0.1850958175  
0.2559446996  
0.3138650556  
0.3574854769  
0.3873047481  
0.4054728401  
0.4154178897  
0.421361915  
0.4277915465  
0.4389235026  
0.4582340564  
0.4880642123  
0.5293598069  
0.581553598  
0.6425998106  
0.709180941  
0.7770522197  
0.8415135563  
0.8979562508  
0.9424190949  
0.9720993174  
0.9857142516  
0.9836785761  
0.968026353  
0.9420827401  
0.9099043655  
0.8755713679  
0.8424389494  
0.8124745642  
0.7858252637  
0.7607079478  
0.7336829814  
0.7002986932  
0.6560091979  
0.5972300944  
0.5223186518  
0.4322924776  
0.3311030462  
0.2253804435  
0.1236261943  
0.03497089481  
-0.0323157848  
-0.07229745978  
-0.0825495179  
-0.06479638748  
-0.02484650054  
0.02819466993  
0.08335542624  
0.1296253958  
0.1578671833  
0.1624671126  
0.1423937039  
0.1014559  
0.04764670841  
-0.008325266341  
-0.05510776477  
-0.08302521141  
-0.08623880375  
-0.0643567701  
-0.02316463807  
0.02568729291  
0.06605723198  
0.07956439276  
0.04839106629  
-0.0417937535  
-0.1992509311  
-0.4243584629  
-0.7088689548  
-1.036375104  
-1.383952147  
-1.72472855  
-2.031040649  
-2.277695226  
-2.444905637  
-2.520484352  
-2.501034026  
-2.392000168  
-2.206633125  
-1.96404753  
-1.686665104  
-1.39740582  
-1.1169814  
-0.8616273934  
-0.6415025525  
-0.459937082  
-0.3135427831  
-0.193166953  
-0.08552355838  
0.02469810755  
0.1524887834  
0.3102253475  
0.5056830243  
0.7405870779  
1.009887345  
1.301856799  
1.599043942  
1.879984248  
2.121514421  
2.301428181  
2.401157074  
2.408150222  
2.317628875  
2.133462361  
1.868022556  
1.540998004  
1.177286109  
0.8042558735  
