48.58216568  
55.70021543  
66.39218167  
92.33589069  
575.1836609  
2397.939951  
1333.512408  
2926.445359  
23690.6542  
71218.78604  
62664.15085  
25435.82253  
4296.193806  
8776.633644  
31392.04432  
32142.63947  
1357.426656  
958.4251551  
18111.162  
2710.770376  
9097.063204  
9272.840216  
19477.97292  
17363.30946  
17138.42272  
609.1681549  
20449.35789  
12020.63058  
1762.593498  
1492.649805  
9793.369789  
708.280173  
3188.112844  
8661.460055  
1650.011326  
10594.82203  
645.2140052  
1013.203555  
298.8822842  
58.75808866  
1059.613552  
269.7839379  
417.5629357  
1910.559127  
3421.770715  
968.2952351  
15311.29093  
1293.505047  
7185.301379  
1701.282401  
1310.591542  
2863.094953  
1154.327329  
563.1022175  
1521.028261  
973.4527652  
2299.210944  
3390.386981  
145.7216669  
861.0370703  
27.56742586  
558.2878491  
671.452719  
812.2274358  
594.779647  
60.30153691  
155.2343064  
59.00917484  
185.0328507  
3.652494671  
6.330669186  
3.768675538  
15.78877082  
13.17701342  
17.99544087  
8.4492441  
10.9064961  
10.16416546  
3.951602651  
2.278840996  
2.249076068  
3.265407044  
4.611966927  
3.467383111  
2.608994752  
2.5461248  
2.574425316  
2.272939717  
2.633115542  
2.429213782  
2.267877024  
2.182480782  
2.097882546  
2.112136068  
1.9718929  
1.933438359  
1.970592152  
1.855977777  
1.857022102  
1.715637484  
1.738455524  
1.692144065  
1.637436161  
1.606257483  
1.570941224  
1.537360243  
1.496784165  
1.46879485  
1.434921283  
1.403481057  
1.369983311  
1.342852021  
1.3137339  
1.285626966  
1.26194178  
1.239197984  
1.21469871  
1.191348633  
1.168558801  
1.146351895  
1.125626268  
1.104656646  
1.084933596  
1.066139552  
1.047100618  
1.028990576  
1.011210894  
0.9941057205  
0.9774241196  
0.9608867069  
0.9451840514  
0.9297130271  
0.9148416636  
0.9004600584  
0.8862118565  
0.8722760663  
0.8589501502  
0.845871116  
0.8330889569  
0.8205666922  
0.8084585731  
0.7966296862  
0.7850501408  
0.773760121  
0.7627024855  
0.7519774357  
0.7414442422  
0.7312056063  
0.7211789716  
0.7113764016  
0.701784355  
0.6924314025  
0.6832886187  
0.6743288564  
0.6655794727  
0.6570050223  
0.648637573  
0.640419185  
0.6324093823  
0.6245415356  
0.6168410646  
0.6093033417  
0.6019252648  
0.5946902241  
0.5876126697  
0.5806655648  
0.5738663804  
0.5671801081  
0.5606563151  
0.5542436171  
0.5479579975  
0.541794876  
0.5357482866  
0.529816981  
0.5239899544  
0.5182905778  
0.5126687609  
0.5071667259  
0.5017786172  
0.4964781531  
0.4912817617  
0.4861675225  
0.4811530189  
0.4762160053  
0.4713675038  
0.466617242  
0.461951884  
0.4573448665  
0.4528456408  
0.4483971922  
0.4440446264  
0.4397561981  
0.4355393263  
0.4314032085  
0.4273313408  
0.4233265957  
0.4193854082  
0.415506342  
0.4116935645  
0.4079462722  
0.4042645604  
0.4006278698  
0.3970632699  
0.3935477091  
0.390089712  
0.3866889501  
0.3833453281  
0.3800312552  
0.3767888124  
0.3735959343  
0.3704483292  
0.3673491696  
0.3642950023  
0.3612827316  
0.3583252627  
0.3553997842  
0.3525401477  
0.3496986901  
0.3469190739  
0.3441808229  
0.3414541624  
0.3387934283  
0.336165655  
0.3335747509  
0.3310275094  
0.3285061024  
0.3260210628  
0.3235778396  
0.3211737302  
0.3187875338  
0.3164477505  
0.3141341527  
0.311858552  
0.309615236  
0.3073879913  
0.3051983323  
0.3030447797  
0.300916829  
0.2988259933  
0.2967548438  
0.2947179622  
0.2926963483  
0.2907192497  
0.2887528781  
0.2868160109  
0.2849156903  
0.283033226  
0.2811636953  
0.2793372724  
0.2775176246  
0.2757410005  
0.2739795001  
0.2722327142  
0.2705114155  
0.2688206731  
0.2671467137  
0.2654933212  
0.2638600997  
0.2622417631  
0.2606493331  
0.259088771  
0.2575278346  
0.2559989679  
0.2544874851  
0.2529937869  
0.2515196076  
0.2500526749  
0.2486161654  
0.2471971776  
0.2457914399  
0.2444051698  
0.2430261958  
0.2416756343  
0.2403470028  
0.2390197286  
0.2377257368  
0.2364275709  
0.2351484412  
0.2338923011  
0.2326549991  
0.2314317173  
0.2302096425  
0.2290073245  
0.2278158369  
0.2266540716  
0.2254933759  
0.2243446031  
0.223221575  
0.2220924283  
0.2209915475  
0.2199017575  
0.2188288635  
0.2177635551  
0.2167081998  
0.2156625303  
0.214624743  
0.2136163608  
0.2126043067  
0.2116177704  
0.2106369572  
0.2096628555  
0.2086894895  
0.2077463784  
0.2068095332  
0.2058811346  
0.2049587275  
0.204057999  
0.2031582814  
0.2022707467  
0.201395485  
0.200522437  
0.1996687595  
0.1988151817  
0.1979860952  
0.1971540026  
0.1963288881  
0.1955232739  
0.1947210581  
0.1939259593  
0.1931489407  
0.1923771107  
0.191605316  
0.1908524067  
0.1900988027  
0.1893653921  
0.1886260299  
0.1879064233  
0.1871937147  
0.1864828211  
0.1857791825  
0.1850913713  
0.1844053472  
0.1837245938  
0.1830592403  
0.1823977964  
0.181734938  
0.1810995279  
0.1804513677  
0.179820827  
0.1791992571  
0.1785711891  
0.177966135  
0.1773612766  
0.1767651333  
0.1761708399  
0.1755875329  
0.1750047932  
0.1744310032  
0.1738706717  
0.1733046355  
0.1727547671  
0.1722127925  
0.1716763923  
0.1711357837  
0.1705990763  
0.1700823466  
0.1695604885  
0.1690544849  
0.1685437148  
0.1680510078  
0.1675624873  
0.1670789386  
0.1665829604  
0.1661203231  
0.1656486224  
0.1651778492  
0.164709476  
0.1642591611  
0.1638071485  
0.1633618131  
0.1629313032  
0.1624899577  
0.1620656186  
0.1616343433  
0.1612244089  
0.1608103296  
0.1603985403  
0.1599899945  
0.1595942619  
0.1591932444  
0.1588065031  
0.1584267528  
0.1580430462  
0.1576698254  
0.157295397  
0.1569323854  
0.1565645074  
0.1562130634  
0.1558617713  
0.1555124369  
0.1551606917  
0.1548273004  
0.1544833342  
0.1541530541  
0.1538335236  
0.1535089392  
0.1531863081  
0.1528681905  
0.1525583348  
0.1522605332  
0.151945532  
0.1516541612  
0.1513549913  
0.1510675246  
0.1507824356  
0.1504954509  
0.1502218653  
0.1499432918  
0.1496720978  
0.1494078587  
0.1491420799  
0.1488872111  
0.1486207354  
0.1483785697  
0.1481264501  
0.1478828204  
0.1476427816  
0.1474031665  
0.1471740118  
0.14693412  
0.1467128184  
0.1464895285  
0.1462714051  
0.1460543915  
0.1458370484  
0.1456308013  
0.1454285306  
0.145220511  
0.1450261008  
0.1448322634  
0.1446343776  
0.1444458907  
0.1442605466  
0.1440840633  
0.1439044544  
0.1437238443  
0.1435525364  
0.1433819108  
0.1432207295  
0.1430618714  
0.1429004987  
0.1427417257  
0.1425821883  
0.1424339497  
0.1422939849  
0.1421462664  
0.142011288  
0.1418673718  
0.1417352592  
0.1416100757  
0.1414724759  
0.1413517088  
0.1412279585  
0.1411069717  
0.1409957604  
0.1408916767  
0.1407710776  
0.1406744658  
0.1405710105  
0.1404613927  
0.1403675393  
0.1402748965  
0.1401867349  
0.1400960973  
0.1400052637  
0.1399255095  
0.1398519683  
0.1397734507  
0.139698987  
0.1396345892  
0.1395631976  
0.1394934254  
0.1394374224  
0.1393795374  
0.1393165888  
0.1392591307  
0.1392223735  
0.1391805753  
0.1391232442  
0.1390827425  
0.1390394393  
0.1390029513  
0.1389726113  
0.1389446446  
0.1389073068  
0.138894812  
0.1388702676  
0.1388552396  
0.1388321372  
0.1388268014  
0.138815101  
0.1388027255  
0.1387997375  
0.1388039089  
