-0.5319586694  
-0.3685196338  
-0.2076237389  
-0.05413289327  
0.08752790411  
0.2136859964  
0.321648898  
0.4098251279  
0.477722684  
0.5258474135  
0.5555093513  
0.5685833573  
0.5672360562  
0.5536961783  
0.5300790567  
0.4983020585  
0.4601309647  
0.4173112401  
0.3718061597  
0.3260650189  
0.2832609259  
0.2474590135  
0.2236128875  
0.2173797798  
0.234706656  
0.2812244923  
0.3614804543  
0.4781154532  
0.6310698091  
0.8169729876  
1.028814664  
1.256019868  
1.484978667  
1.700040204  
1.884904631  
2.024275472  
2.105596643  
2.120631802  
2.066659531  
1.947089609  
1.771362675  
1.554095718  
1.313524399  
1.069434599  
0.8408227814  
0.643593328  
0.4886316164  
0.3805050032  
0.3170223488  
0.2897131073  
0.2851837039  
0.2871804564  
0.2790428898  
0.2462270951  
0.1785018888  
0.0715168589  
-0.07248812684  
-0.2449268431  
-0.4320088125  
-0.6165971633  
-0.7805012133  
-0.9068589744  
-0.9822935014  
-0.9985407566  
-0.9533782538  
-0.8507555756  
-0.7001755401  
-0.5154527257  
-0.3130387777  
-0.1101694946  
0.07694061626  
0.2346339268  
0.3529298126  
0.4261174891  
0.4528155512  
0.4355335379  
0.379861252  
0.2934187525  
0.1847618517  
0.06240704519  
-0.06588912455  
-0.1935164991  
-0.3150412218  
-0.4259603357  
-0.5223088459  
-0.6002662264  
-0.6559427048  
-0.6854579161  
-0.6853712147  
-0.6534078136  
-0.5893629693  
-0.4959737816  
-0.3795117859  
-0.2499045538  
-0.1202081455  
-0.005414971258  
0.07930833578  
0.120729913  
0.109672831  
0.04277844102  
-0.07645417264  
-0.2375783172  
-0.4242002114  
-0.6159569892  
-0.7912266857  
-0.9301624062  
-1.017563213  
-1.045107433  
-1.012571386  
-0.9278170005  
-0.8055410008  
-0.6649756454  
-0.5269432392  
-0.410706445  
-0.331164953  
-0.2967943564  
-0.3086609964  
-0.3606083143  
-0.4405276225  
-0.5324529764  
-0.619101831  
-0.684419579  
-0.7157358399  
-0.7052388505  
-0.6505881719  
-0.554712566  
-0.4248852139  
-0.2713695792  
-0.1058843526  
0.05980927771  
0.2150324767  
0.3508857354  
0.4605535603  
0.539269085  
0.5841020159  
0.5937092066  
0.5681644033  
0.5089457287  
0.419066143  
0.3032796693  
0.1682664799  
0.02265607376  
-0.1232029395  
-0.2578091467  
-0.3693777332  
-0.4469790091  
-0.4817923236  
-0.4683132882  
-0.4053443739  
-0.2965750337  
-0.1506567745  
0.01931129614  
0.1968622808  
0.3637187911  
0.5016900178  
0.5946876275  
0.6306550263  
0.6031737691  
0.5125339245  
0.3661377022  
0.1781187248  
-0.03181440639  
-0.2402317724  
-0.4223552463  
-0.5547247186  
-0.6178326261  
-0.5984372758  
-0.4912529503  
-0.2998085307  
-0.03633836688  
0.279284283  
0.6214659741  
0.9614298699  
1.270083237  
1.520890469  
1.6924224  
1.770334789  
1.748567135  
1.629692077  
1.424403054  
1.150247463  
0.8297683915  
0.4882660398  
0.1514149779  
-0.1570209188  
-0.4171747688  
-0.6145841287  
-0.7411142969  
-0.7952285459  
-0.7816166271  
-0.7102441745  
-0.5949394116  
-0.4516710221  
-0.2966983219  
-0.1448002127  
-0.007755800602  
0.1067172415  
0.195497385  
0.2599507927  
0.3052318937  
0.3390608675  
0.37016436  
0.4065883392  
0.4541424798  
0.5152055626  
0.5880886202  
0.6670731336  
0.7431215592  
0.8051828863  
0.8418933008  
0.843410867  
0.8031080143  
0.7188354379  
0.5935421191  
0.4351346332  
0.2555673878  
0.0692791216  
-0.1087945  
-0.2653271405  
-0.3905062211  
-0.4794170667  
-0.5326781401  
-0.5562111468  
-0.5601475212  
-0.5570432017  
-0.5596504789  
-0.5785988522  
-0.6203534878  
-0.6857851715  
-0.7696025844  
-0.8607769345  
-0.9439233529  
-1.001487189  
-1.016408477  
-0.9749055853  
-0.8689298511  
-0.6979441492  
-0.4696991892  
-0.1998792836  
0.08938840654  
0.3719766515  
0.6208452909  
0.8113628302  
0.9244099992  
0.9488542909  
0.8830529047  
0.7352080165  
0.5224841609  
0.2690414056  
0.003215946201  
-0.2458058073  
-0.4514012144  
-0.5926176212  
-0.6565999695  
-0.6400830208  
-0.5497748244  
-0.4016173149  
-0.2190015842  
-0.03015742471  
0.1350027726  
0.2482507415  
0.2862333107  
0.2331865332  
0.08283004297  
-0.1607308374  
-0.483210895  
-0.8614635414  
-1.265742044  
-1.662671934  
-2.018625096  
-2.303061236  
-2.491531413  
-2.567963742  
-2.526009669  
-2.369336428  
-2.110866488  
-1.77109717  
-1.375748426  
-0.9530252317  
-0.5308508089  
-0.134350046  
0.2161368902  
0.5063513549  
0.7286583934  
0.8818538522  
0.9703518675  
1.002938699  
0.9912845273  
0.9484318046  
0.8874272134  
0.820228128  
0.7569584515  
0.7054980172  
0.6713827691  
0.657914309  
0.6664008364  
0.696427329  
0.7461019646  
0.8122460933  
0.8905337159  
0.9756278018  
1.061358048  
1.141001025  
1.207696914  
1.255000185  
1.277533207  
1.27164594  
1.236003638  
1.171940539  
1.083531253  
0.9772670921  
0.8613724273  
0.7448069891  
0.6361038615  
0.5422052826  
0.4675035737  
0.413253514  
0.3774727875  
0.3553529311  
0.3401393662  
0.3242992612  
0.3008038877  
0.2642841934  
0.211865468  
0.1435455669  
0.06206962427  
-0.02765515911  
-0.1194742982  
-0.2070466973  
-0.2848543241  
-0.3489774783  
-0.3975159875  
-0.4306085659  
-0.4500799834  
-0.4588260636  
-0.4600715145  
-0.4566812109  
-0.4506354888  
-0.4427968309  
-0.4329707867  
-0.4202390084  
-0.4034723746  
-0.3818958568  
-0.3555785394  
-0.3257313689  
-0.2947574963  
-0.2660140646  
-0.243350573  
-0.2304848089  
-0.2303450903  
-0.2444848469  
-0.272695206  
-0.3128646553  
-0.3611391503  
-0.41235913  
-0.4607001983  
-0.5004385746  
-0.5267196932  
-0.536213421  
-0.5275727499  
-0.5016149615  
-0.4612168953  
-0.4109282278  
-0.3563720531  
-0.3035016042  
-0.2578156124  
-0.2236339443  
-0.2034992646  
-0.1977986291  
-0.2046171887  
-0.2198557372  
-0.2375974714  
-0.2506938092  
-0.2515199427  
-0.2328223562  
-0.1885996095  
-0.1149078671  
-0.01049285904  
0.1228070389  
0.279986614  
0.4531486708  
0.6321387809  
0.805483192  
0.961547745  
1.089792711  
1.181957665  
1.233033686  
1.241856131  
1.211242281  
1.147605639  
1.060090524  
0.9593171608  
0.855914094  
0.7590118687  
0.6749656353  
0.60643528  
0.5520165576  
0.5064406072  
0.4613461158  
0.4064943986  
0.3312711175  
0.2262575812  
0.08466081013  
-0.0965646963  
-0.3160719942  
-0.5679925809  
-0.8423426056  
-1.125911965  
-1.40350755  
-1.659425084  
-1.878953624  
-2.049779694  
-2.163106853  
-2.214400511  
-2.203675917  
-2.135322755  
-2.017495975  
-1.861179975  
-1.679027736  
-1.484128371  
-1.28883517  
-1.10375569  
-0.9370019055  
-0.7937277361  
-0.6759575067  
-0.5827075192  
-0.5103248772  
-0.4530376718  
-0.4036404785  
-0.3543033167  
-0.2974296486  
-0.2265365262  
-0.1370701238  
-0.0270860118  
0.1022963346  
0.2467616328  
0.3990391418  
0.5495642553  
0.6874965764  
0.8020422908  
0.8838933948  
0.9266132811  
0.9277601679  
0.8895501426  
0.8189475279  
0.7271122472  
0.6282478202  
0.5379785931  
0.471448371  
0.4414155821  
0.4565644424  
0.5203059582  
0.6302189181  
0.7782084432  
0.9513961685  
1.133594808  
1.307208753  
1.455281393  
1.563433637  
1.621462878  
1.624372387  
1.572748963  
1.472450833  
1.333681643  
1.16960275  
0.9946864458  
0.8230239079  
0.6668260906  
0.5352660746  
0.4338001415  
0.364000702  
0.3238877459  
0.3086553857  
0.3116748902  
0.325599439  
0.3434257247  
0.3593501011  
0.3693243055  
0.3712529771  
0.3648442025  
0.3511559861  
0.331954782  
0.3090138718  
0.2834903223  
0.2554908633  
0.2239245602  
0.1866576669  
0.1409434795  
0.08406219429  
0.01403375656  
-0.06972373346  
-0.165908925  
-0.2711442994  
-0.3801128882  
-0.4860366865  
-0.5814462305  
-0.6591346433  
-0.7131683751  
-0.7398121765  
-0.738223395  
-0.7108093313  
-0.6631590438  
-0.6035578252  
-0.5421080619  
-0.4895747815  
-0.4560927989  
-0.4498979866  
-0.4762751146  
-0.5368429388  
-0.6292840824  
-0.7475618242  
-0.882585096  
-1.023236679  
-1.157634766  
-1.274455918  
-1.364175959  
-1.420048226  
-1.438747411  
-1.420577283  
-1.369257823  
-1.291322211  
-1.19520319  
-1.090147945  
-0.9850894457  
-0.8876224698  
-0.8032103184  
-0.7347189885  
-0.6823142522  
-0.6437375825  
-0.614882284  
-0.5905911316  
-0.5655269595  
-0.535007145  
-0.4956565638  
-0.4458007588  
-0.3855510188  
-0.3165917637  
-0.2417147198  
-0.1642155267  
-0.08724792657  
-0.01326825516  
0.05633998845  
0.1213912548  
0.1827681183  
0.2420709544  
0.3011075057  
0.3613690824  
0.4235662147  
0.4873444383  
0.5512556532  
0.6129677058  
0.6696997476  
0.7187846673  
0.7582379434  
0.7872201879  
0.8062627375  
0.8172284507  
0.8229657332  
0.8267308569  
0.831477152  
0.839140941  
0.8500837654  
0.8627975979  
0.8739502097  
0.8788001387  
0.8719099016  
0.8480577285  
0.8031906773  
0.7352549699  
0.6447635814  
0.5349637312  
0.4115964638  
0.2822549798  
0.1554456134  
0.03950333579  
-0.05845641277  
-0.1333705111  
-0.182722121  
-0.2066069932  
-0.2073933933  
-0.1890367947  
-0.1562246179  
-0.1134877825  
-0.06449056436  
-0.01162275796  
0.04404232817  
0.1024141578  
0.1637714005  
0.2280095143  
0.2939364044  
0.3587830825  
0.4180794499  
0.4659539716  
0.4958647877  
0.5016523594  
0.4787533374  
0.4253569127  
0.3432902661  
0.2384094557  
0.1203862094  
0.001836511365  
-0.1031400984  
-0.1808387274  
-0.219974057  
-0.2135529931  
-0.1602802132  
-0.06523040937  
0.06037038159  
0.2002786622  
0.3351777703  
0.4451808233  
0.5125389651  
0.5241773807  
0.4736674614  
0.362337555  
0.1993366332  
0.0006188833845  
-0.2130289487  
-0.4186492074  
-0.594094078  
-0.7209205914  
-0.7867784203  
-0.7869758858  
-0.7249807908  
-0.6118169818  
-0.4644334472  
-0.3032882613  
-0.1495248591  
-0.02212039746  
0.06455092277  
0.1024086518  
0.09039372959  
0.03414313252  
-0.05527934638  
-0.1633589955  
-0.2744727173  
-0.3742154335  
-0.4513342048  
-0.4990056775  
-0.5152978992  
-0.502802839  
-0.467597582  
-0.4177493138  
-0.3616839173  
-0.3067128789  
-0.257964574  
-0.2178810454  
-0.1863124894  
-0.1611509844  
-0.1393133814  
-0.1178651811  
-0.09503970762  
-0.07093825281  
-0.04777581028  
-0.02962758979  
-0.02171582105  
-0.02938978479  
-0.05697971017  
-0.1067413649  
-0.1781022899  
-0.2673348745  
-0.3677291466  
-0.4702452562  
-0.5645445223  
-0.6402433444  
-0.6882035457  
-0.7016757029  
-0.6771442882  
-0.6147650386  
-0.5183721661  
-0.3950520878  
-0.2543885806  
-0.1074661208  
0.03421868542  
0.1598182323  
0.260061574  
0.3279635047  
0.3592645746  
0.3526109383  
0.3094711159  
0.2338270657  
0.1316962335  
0.01053422925  
-0.1214363546  
-0.2558983265  
-0.3850782017  
-0.5022784205  
-0.6022758493  
-0.6815357589  
-0.7382495064  
-0.7721840333  
-0.784379369  
-0.7767670054  
-0.7517287573  
-0.7117101751  
-0.6589064072  
-0.5950727109  
-0.5214761467  
-0.4389611949  
-0.3481174192  
-0.2494826923  
-0.143751471  
-0.03193648912  
0.08454576045  
0.2038836571  
0.3239565628  
0.4424890426  
0.5572358631  
0.6661632731  
0.7675976776  
0.8603242328  
0.9436201828  
1.017252117  
1.08143086  
1.136753492  
1.184147622  
1.224811407  
1.260145637  
1.291661378  
1.320850772  
1.349011302  
1.377039269  
1.405203343  
1.432963233  
1.458856892  
1.480512513  
1.494827046  
1.498297359  
1.48750385  
1.459680308  
1.413298316  
1.348564233  
1.267741287  
1.175199677  
1.077171468  
0.981171161  
0.8951419511  
0.8264211442  
0.780635503  
0.7606802085  
0.7659451248  
0.7918952016  
0.8301242861  
0.8689210605  
0.8943122717  
0.8915215873  
0.8466821986  
0.7486137301  
0.590432845  
0.3707905471  
0.09452134425  
-0.2274000543  
-0.5786672715  
-0.9391426644  
-1.286906176  
-1.600621017  
-1.861925617  
-2.057541582  
-2.18082509  
-2.232532454  
-2.220689695  
-2.159552832  
-2.067769886  
-1.965995769  
-1.874217834  
-1.809194317  
-1.782306858  
-1.798145571  
-1.854006395  
-1.940375358  
-2.042347524  
-2.141757468  
-2.219750126  
-2.259414117  
-2.248116372  
-2.179226583  
-2.052988672  
-1.876455309  
-1.662500437  
-1.428080886  
-1.192006045  
-0.9725248044  
-0.7850742243  
-0.6404641907  
-0.5437485814  
-0.4938775855  
-0.4841719906  
-0.5035163065  
-0.5380921991  
-0.5734053067  
-0.5963403596  
-0.5969427698  
-0.5697146443  
-0.5142347236  
-0.4350313314  
-0.3407213722  
-0.2425511902  
-0.1525310147  
-0.0814415211  
-0.03699201454  
-0.0224076801  
-0.03565279134  
-0.06940752614  
-0.1118350251  
-0.1480263582  
-0.1619640188  
-0.1387214591  
-0.06661051964  
0.06101852693  
0.2445928055  
0.4779086263  
0.748606965  
1.039457134  
1.330321677  
1.600525146  
1.831329112  
2.008156296  
2.122279737  
2.171729511  
2.161314791  
2.101774878  
2.008190844  
1.897905563  
1.788252448  
1.694408132  
1.627643769  
1.594195302  
1.594846668  
1.62525176  
1.676871111  
1.738396553  
1.797401932  
1.842027023  
1.862462025  
1.852075185  
1.80807233  
1.731641339  
1.627612865  
1.503705468  
1.369468081  
1.235058428  
1.110001468  
1.002074178  
0.9164166902  
0.854985119  
0.8163746156  
0.7960334005  
0.7868209029  
0.7798333149  
0.7653848933  
0.7340331155  
0.6775219221  
0.589558167  
0.4663709155  
0.3070154846  
0.113455105  
-0.1095712455  
-0.3548443715  
-0.6130898526  
-0.8735207496  
-1.124481505  
-1.354184681  
-1.551516136  
-1.706892209  
-1.813085478  
-1.865955232  
-1.864983709  
-1.813511935  
-1.718634154  
-1.590681734  
-1.442344524  
-1.287482226  
-1.139765058  
-1.011286923  
-0.9113256163  
-0.8454269819  
-0.8149156213  
-0.8169191118  
-0.8449041881  
-0.8896592473  
-0.940590999  
-0.9871634681  
-1.020281297  
-1.033441117  
-1.023477974  
-0.9908325795  
-0.9393015748  
-0.8753156264  
-0.8068706277  
-0.7422503771  
-0.6887462875  
-0.6515403004  
-0.6329196231  
-0.6319266469  
-0.6444890659  
-0.6640079556  
-0.6823114038  
-0.690839885  
-0.6818855325  
-0.6497187098  
-0.5914337534  
-0.5074115911  
-0.4013434385  
-0.2798050913  
-0.1514649953  
-0.02601584156  
0.08700088753  
0.1793551662  
0.2450938068  
0.2811985591  
0.2878602384  
0.2683074139  
0.228245202  
0.1749543422  
0.1161927271  
0.05904698478  
0.008916584876  
-0.0312335837  
-0.06121084004  
-0.08347977755  
-0.1025874726  
-0.1242142248  
-0.1539918385  
-0.1962627898  
-0.2530162995  
-0.3231484219  
-0.4022510186  
-0.4829746809  
-0.5559641572  
-0.6112843263  
-0.6400996519  
-0.6363745012  
-0.5982766565  
-0.5290065636  
-0.4368433979  
-0.3342827281  
-0.2363179433  
-0.1580465499  
-0.1119171072  
-0.1050403175  
-0.1370240089  
-0.1987482916  
-0.2723939927  
-0.3328760281  
-0.3506157188  
-0.2953726953  
-0.1406599874  
0.1318706572  
0.5287256656  
1.042163439  
1.649535027  
2.314595952  
2.990718054  
3.625635455  
4.167143428  
4.568970005  
4.796026558  
4.828317438  
4.662983463  
4.314232875  
3.811215575  
3.194190825  
2.509567237  
1.804519484  
1.121893538  
0.4960707352  
-0.04978994638  
-0.5048481159  
-0.870046821  
-1.156136541  
-1.380652641  
-1.564319248  
-1.727405805  
-1.886496875  
-2.052078973  
-2.227189053  
-2.407258455  
-2.581081414  
-2.73275581  
-2.844279927  
-2.898444677  
-2.881614935  
-2.78600341  
-2.611147938  
-2.364349005  
-2.060050218  
-1.718235075  
-1.362079966  
