-0.2885730079  
0.104564902  
0.4812317226  
0.8291484864  
1.136920313  
1.394293373  
1.592477702  
1.724528143  
1.785748282  
1.774064973  
1.690304155  
1.538309117  
1.324856542  
1.059358582  
0.7533681485  
0.4199476005  
0.07295651207  
-0.2736305581  
-0.6063414325  
-0.9126779011  
-1.181460186  
-1.403045248  
-1.569478148  
-1.67463736  
-1.71441983  
-1.687007635  
-1.593179366  
-1.436640117  
-1.224276112  
-0.9662273252  
-0.6756982275  
-0.3684379436  
-0.06188562965  
0.2259783365  
0.4779629433  
0.6790371165  
0.8175841297  
0.8863815857  
0.8832027973  
0.8109777927  
0.6775078638  
0.4948034983  
0.2781214595  
0.04483259207  
-0.1867883263  
-0.3987479013  
-0.5744321602  
-0.699585842  
-0.7631389737  
-0.7578804559  
-0.680954178  
-0.5341494496  
-0.3239436887  
-0.06126568834  
0.2390606094  
0.5591961179  
0.879465925  
1.179760757  
1.44105678  
1.646915791  
1.784803525  
1.847092617  
1.831631656  
1.741804591  
1.586077975  
1.377074666  
1.130279924  
0.8625266968  
0.5904229648  
0.3288973219  
0.0900112575  
-0.1178492223  
-0.29033103  
-0.4270230954  
-0.5309593521  
-0.6078059121  
-0.6648561428  
-0.7099585376  
-0.7505020045  
-0.7925593894  
-0.8402408463  
-0.8953116663  
-0.957051959  
-1.022351503  
-1.086008691  
-1.141192384  
-1.180034413  
-1.194327932  
-1.176293139  
-1.119379425  
-1.019052749  
-0.8734950273  
-0.6841524479  
-0.4560384891  
-0.1977222469  
0.07905143779  
0.3601272833  
0.6300412768  
0.8733825518  
1.076255318  
1.227694415  
1.320819345  
1.353590628  
1.329032973  
1.254882065  
1.142669521  
1.006380252  
0.860824242  
0.7199524556  
0.5953370582  
0.494987856  
0.4226759979  
0.3778001272  
0.3558017741  
0.3490403202  
0.3479839555  
0.3425529754  
0.3234390786  
0.2832489978  
0.21735282  
0.1243753248  
0.006303837516  
-0.1317635425  
-0.2821646712  
-0.4354435704  
-0.5812469042  
-0.7092587122  
-0.8100877754  
-0.8760363584  
-0.9017003334  
-0.8843614529  
-0.8241679942  
-0.7240880767  
-0.5896823735  
-0.4287004853  
-0.2505669089  
-0.06578024515  
0.1147185947  
0.2801817618  
0.4206534427  
0.5275253397  
0.5940170677  
0.6155767462  
0.5901900535  
0.5185741788  
0.4042503373  
0.2534513143  
0.0748684798  
-0.1208031495  
-0.3215016254  
-0.5146170581  
-0.687934214  
-0.8306378804  
-0.9342830598  
-0.9936274611  
-1.007199736  
-0.9775323457  
-0.9109701062  
-0.817062344  
-0.7075623533  
-0.5951569059  
-0.4920496599  
-0.4086066123  
-0.352225625  
-0.3265934036  
-0.3314430451  
-0.3628315841  
-0.4138984641  
-0.4759752711  
-0.5398766526  
-0.5971622133  
-0.6411690119  
-0.667670009  
-0.6750527974  
-0.6640289867  
-0.6369387892  
-0.5968030671  
-0.5463094055  
-0.486936493  
-0.4183819581  
-0.3384231877  
-0.2432264129  
-0.1280762166  
0.01161381173  
0.1791898  
0.3757472754  
0.5993983841  
0.8449656115  
1.104140365  
1.36609236  
1.618403482  
1.848180652  
2.043146593  
2.192555909  
2.287809968  
2.322752797  
2.293666002  
2.199085006  
2.039568489  
1.817556186  
1.537412343  
1.205666671  
0.8313881268  
0.4265697823  
0.006311500891  
-0.411345389  
-0.8061074443  
-1.156665755  
-1.442435326  
-1.645611738  
-1.75328215  
-1.759258189  
-1.665330077  
-1.481673892  
-1.226277421  
-0.9233897789  
-0.6011424343  
-0.2886235893  
-0.01277988398  
0.2044462947  
0.3483818096  
0.4129870881  
0.4011648642  
0.3240027885  
0.1990642724  
0.04799906442  
-0.1062138125  
-0.2420087306  
-0.3416374398  
-0.392934122  
-0.3902823303  
-0.3347056771  
-0.2331467619  
-0.09709628518  
0.05919216903  
0.2206267449  
0.3730713122  
0.5047654296  
0.6072265516  
0.6755625788  
0.7082172896  
0.7062663868  
0.6724377346  
0.6100576856  
0.5221229639  
0.41065704  
0.2764497669  
0.119212215  
-0.06191082108  
-0.2675792479  
-0.4973912879  
-0.7490827624  
-1.017931865  
-1.296497888  
-1.574727619  
-1.84045707  
-2.080232704  
-2.280353505  
-2.428017702  
-2.512419371  
-2.525679824  
-2.463507994  
-2.325539826  
-2.115319288  
-1.83997643  
-1.509633521  
-1.136653084  
-0.7348082899  
-0.3184716931  
0.09809275583  
0.5013072077  
0.8786848217  
1.219107778  
1.513009393  
1.752513388  
1.931606826  
2.046377525  
2.095330199  
2.079758403  
2.004107024  
1.876222231  
1.707381318  
1.512001245  
1.30694161  
1.110391779  
0.94039554  
0.8131279275  
0.7411159523  
0.7316320305  
0.7854732317  
0.8963596786  
1.051066966  
1.230363797  
1.410708695  
1.566538706  
1.672944371  
1.708418503  
1.657379953  
1.512162684  
1.274237944  
0.9544886458  
0.5724892412  
0.1548332904  
-0.2673271545  
-0.6612824831  
-0.9959909467  
-1.245173803  
-1.389948031  
-1.420699694  
-1.337991813  
-1.152406759  
-0.8833433831  
-0.5569150118  
-0.2032106792  
0.1467771959  
0.4641651875  
0.7248111113  
0.9112632158  
1.013836697  
1.030747408  
0.9673625691  
0.8347379974  
0.6477033987  
0.4227885786  
0.1763039656  
-0.0772126616  
-0.3259798497  
-0.5613716512  
-0.7777622879  
-0.971952001  
-1.14238748  
-1.288358004  
-1.409378991  
-1.504872538  
-1.574188423  
-1.616944718  
-1.633552351  
-1.625777424  
-1.597158622  
-1.553143763  
-1.500821703  
-1.448266944  
-1.403525893  
-1.373429887  
-1.362387923  
-1.371409653  
-1.397526941  
-1.433773329  
-1.46975911  
-1.49281307  
-1.489544105  
-1.447628818  
-1.357543024  
-1.214019175  
-1.016998767  
-0.7719270248  
-0.4893745649  
-0.1840133766  
0.1268884669  
0.4252539276  
0.6940193343  
0.9187656027  
1.088957847  
1.19867515  
1.246774388  
1.236528027  
1.174824146  
1.071079854  
0.9360282465  
0.7805453515  
0.6146534051  
0.4468029356  
0.2834845539  
0.129178762  
-0.01339297371  
-0.1427786479  
-0.2581665489  
-0.3587099534  
-0.4429119788  
-0.5081653335  
-0.5505191724  
-0.5647323798  
-0.5446276561  
-0.4837315634  
-0.3761431654  
-0.2175367338  
-0.006170735624  
0.2562267016  
0.5638482908  
0.9065753062  
1.270210851  
1.637178494  
1.987664885  
2.30108415  
2.557742798  
2.740487885  
2.836196231  
2.836923588  
2.740587712  
2.551130197  
2.278153878  
1.936083999  
1.542978882  
1.119128314  
0.6855982236  
0.2628709428  
-0.1303044838  
-0.4777725966  
-0.7665333353  
-0.9870241737  
-1.133178709  
-1.202360183  
-1.195219951  
-1.115556298  
-0.9701868106  
-0.7688099734  
-0.5238215737  
-0.2499949091  
0.03601591023  
0.3164169356  
0.573255331  
0.7895899404  
0.9507672382  
1.045655563  
1.067690313  
1.015579988  
0.8935505742  
0.7110650119  
0.4820288982  
0.2235347788  
-0.04570535346  
-0.3070706434  
-0.5437014375  
-0.7419174676  
-0.8922699174  
-0.9900900803  
-1.035537973  
-1.033145447  
-0.9909830969  
-0.9195537001  
-0.8305740597  
-0.7358021872  
-0.6460284045  
-0.5703229723  
-0.5155743836  
-0.4863207357  
-0.4848131636  
-0.5112522179  
-0.5641065477  
-0.6404421511  
-0.736213914  
-0.8464920029  
-0.9656317822  
-1.087419619  
-1.205235455  
-1.312265552  
-1.401815491  
-1.467698435  
-1.504703944  
-1.509084198  
-1.47899046  
-1.414800091  
-1.319246849  
-1.197320914  
-1.055915747  
-0.9032333592  
-0.7480172873  
-0.5986825853  
-0.4624556179  
-0.3446392591  
-0.2480879786  
-0.1729805976  
-0.1169212695  
-0.07535416795  
-0.04225402411  
-0.01099164206  
0.02472617737  
0.0699799166  
0.1279272171  
0.1993596517  
0.2825841242  
0.3736476414  
0.4668680829  
0.555608492  
0.6331837122  
0.6937916679  
0.7333319597  
0.750024534  
0.7447318089  
0.7209573161  
0.6845176233  
0.6429199429  
0.6045379433  
0.5776703732  
0.569592647  
0.5857252247  
0.6289864339  
0.6994233253  
0.7941392233  
0.9075359588  
1.031819869  
1.157732982  
1.275409249  
1.375281688  
1.448930785  
1.489809226  
1.493767487  
1.459352671  
1.387854479  
1.283116255  
1.151142849  
0.9995328622  
0.836812157  
0.6717078474  
0.5124197606  
0.3659587297  
0.2375765096  
0.1303570295  
0.04498923839  
-0.02023345766  
-0.06919328096  
-0.1074705246  
-0.1416697035  
-0.178568196  
-0.2241844666  
-0.2828608877  
-0.3564788152  
-0.4439330506  
-0.5409768531  
-0.6404959809  
-0.7332421796  
-0.8089728996  
-0.857874987  
-0.8720986039  
-0.8471813665  
-0.7831293148  
-0.6849652988  
-0.5626016874  
-0.4299993311  
-0.303684851  
-0.2007903985  
-0.1368924691  
-0.1239366527  
-0.1685675712  
-0.2711106507  
-0.4253615762  
-0.6192193276  
-0.8360828475  
-1.056798129  
-1.261886034  
-1.433736361  
-1.558477455  
-1.627293471  
-1.637044945  
-1.590157836  
-1.493864537  
-1.358930673  
-1.198094225  
-1.02443035  
-0.8498579761  
-0.6839536403  
-0.5331899322  
-0.4006233529  
-0.286028872  
-0.186411679  
-0.09677605579  
-0.01105981477  
0.07689982537  
0.1724766997  
0.2795107264  
0.3997885263  
0.5327704144  
0.6755777625  
0.8232392842  
0.9691529614  
1.105717453  
1.225080956  
1.31992805  
1.384224834  
1.41385952  
1.407087844  
1.364762039  
1.290275518  
1.189263767  
1.069049414  
0.93791925  
0.8042978495  
0.6759159948  
0.559064639  
0.4580307681  
0.3747752595  
0.3088871777  
0.2578305506  
0.2174376713  
0.1826015065  
0.1480759636  
0.1092913673  
0.06307993938  
0.00822510507  
-0.05424261659  
-0.1210397442  
-0.1869256382  
-0.2452904265  
-0.2889457179  
-0.3110694351  
-0.3061536849  
-0.2708873434  
-0.2048159158  
-0.1107162684  
0.005396165247  
0.1346471284  
0.2660550207  
0.3875747273  
0.4873444678  
0.5549754361  
0.5827463936  
0.566539982  
0.5064111672  
0.4066884247  
0.2755933724  
0.1244059078  
-0.03373262468  
-0.1852369567  
-0.3175409864  
-0.4204387649  
-0.487125874  
-0.514828275  
-0.5049489246  
-0.4627202481  
-0.3964293258  
-0.3163266509  
-0.2333738256  
-0.1579738643  
-0.09886160969  
-0.06226113394  
-0.05139155344  
-0.06635001422  
-0.1043499076  
-0.1602497491  
-0.2272915741  
-0.2979356758  
-0.3647039767  
-0.420940431  
-0.4614318182  
-0.48283557  
-0.4838965989  
-0.4654728208  
-0.4303538605  
-0.3829342527  
-0.3287525442  
-0.2739535587  
-0.2247201977  
-0.1866979097  
-0.1644841072  
-0.161199158  
-0.1781829559  
-0.2148424297  
-0.2686730865  
-0.33546179  
-0.409662785  
-0.4849369999  
-0.5548037101  
-0.6133538865  
-0.6559543052  
-0.6798391887  
-0.684523509  
-0.6719490176  
-0.6463137952  
-0.6135646706  
-0.5805910777  
-0.5541841716  
-0.5398980472  
-0.5409519778  
-0.5573560521  
-0.5854061456  
-0.6176794626  
-0.6435887963  
-0.65047442  
-0.6251518444  
-0.5557201572  
-0.4334114407  
-0.2542078127  
-0.01998271813  
0.2610388289  
0.5746134743  
0.9016024523  
1.219784422  
1.506128109  
1.73923946  
1.90165941  
1.98171304  
1.974671282  
1.883094937  
1.716333488  
1.489290746  
1.220657719  
0.9308552543  
0.6399777044  
0.3659848868  
0.1233209328  
-0.07792102422  
-0.2322745542  
-0.3386951201  
-0.3999668404  
-0.4218901892  
-0.412377414  
-0.3805751083  
-0.3360674252  
-0.2882099466  
-0.2455364154  
-0.2152491086  
-0.2027288618  
-0.2110815363  
-0.2407336662  
-0.2891615945  
-0.3508258474  
-0.4174109775  
-0.4784328802  
-0.5222297415  
-0.5372718132  
-0.5136671675  
-0.4446588627  
-0.3279050633  
-0.1663016588  
0.03180594076  
0.2531210686  
0.4805786587  
0.6950805075  
0.8775560156  
1.011072033  
1.082684985  
1.084796642  
1.015831942  
0.880188171  
0.6875023571  
0.4513992447  
0.1879372198  
-0.08600476883  
-0.3541909687  
-0.6021788895  
-0.818084008  
-0.9929622527  
-1.120882951  
-1.198795292  
-1.226291773  
-1.205366327  
-1.140198311  
-1.036954664  
-0.9035604286  
-0.7493851784  
-0.5847639935  
-0.4203432343  
-0.2662630997  
-0.1312475051  
-0.02172665234  
0.05887816474  
0.1105566765  
0.1367080801  
0.1436864539  
0.1399117894  
0.1346732766  
0.1367643215  
0.1531698707  
0.187993345  
0.241808058  
0.3115302617  
0.3908481338  
0.4711439812  
0.5427735156  
0.5965017905  
0.624885118  
0.6233818819  
0.5910382464  
0.5306391396  
0.4483222866  
0.3527184721  
0.2537565475  
0.1613192825  
0.08393435827  
0.02772065559  
-0.00431260738  
-0.01248449469  
-0.0001975689364  
0.02672529566  
0.06100955348  
0.09503873845  
0.1219401961  
0.1364988654  
0.1357571959  
0.1192531094  
0.08887496427  
0.04838338643  
0.002710614169  
-0.04284911141  
-0.08341847604  
-0.1151520177  
-0.1356330091  
-0.1439759875  
-0.1406879019  
-0.1273124525  
-0.1059672893  
-0.07886189748  
-0.04789229943  
-0.01437203213  
0.02105774913  
0.05836415311  
0.09792193707  
0.1402570724  
0.1857822751  
0.2345886293  
0.2863272812  
0.3401803216  
0.3949235878  
0.4490376414  
0.5008284177  
0.548541226  
0.5904190718  
0.6247283359  
0.6497482357  
0.6637514163  
0.6650058189  
0.6518233969  
0.6226607212  
0.5762865179  
0.5119862211  
0.4297833039  
0.3306314072  
0.2165502702  
0.09065914802  
-0.04290555309  
-0.1792016884  
-0.3127957157  
-0.4381711146  
-0.5501678545  
-0.6444198196  
-0.7177285785  
-0.7683465008  
-0.7961347675  
-0.8025902032  
-0.7907461551  
-0.7649811724  
-0.7307421313  
-0.6942368445  
-0.6620880143  
-0.6409842738  
-0.6373076486  
-0.6567410442  
-0.7038462271  
-0.7816152831  
-0.8910171654  
-1.030583959  
-1.196096425  
-1.380449826  
-1.573772022  
-1.763854882  
-1.936926761  
-2.078738964  
-2.175880982  
-2.217200065  
-2.195138552  
-2.106797142  
-1.954539226  
-1.746006653  
-1.493482106  
-1.212647755  
-0.9208490648  
-0.6351174031  
-0.3701801828  
-0.1367659146  
0.05957745782  
0.2189659187  
0.3469070641  
0.4533026034  
0.5508595967  
0.6531216052  
0.7723703491  
0.9176577284  
1.09320447  
1.297359921  
1.522245051  
1.754135067  
1.974567073  
2.162079596  
2.294445918  
2.351194007  
2.316177004  
2.179933443  
1.941571706  
1.60992506  
1.20378672  
0.7510969608  
0.287044887  
-0.1487940278  
-0.5160905435  
-0.7778025827  
-0.9042157744  
-0.8764902986  
-0.6892639256  
-0.3519290454  
0.1116728311  
0.6651812214  
1.263130389  
1.855472514  
2.392700064  
2.830921665  
3.136270445  
3.288076009  
3.280410898  
3.121838539  
2.833459517  
2.445559926  
1.993389735  
1.512674297  
1.035500865  
0.5871148398  
0.1840090468  
-0.1665226923  
-0.4654225265  
-0.7197808114  
-0.9400210109  
-1.136884322  
-1.31870149  
-1.489376674  
-1.647391603  
-1.785930889  
-1.894060226  
-1.958750062  
-1.967366368  
-1.910238692  
-1.782869656  
-1.587444742  
-1.333396717  
-1.03693338  
-0.7195882959  
-0.4059973999  
-0.1212171597  
0.1120420912  
0.2759046551  
0.3591953011  
0.3584661333  
0.2780734758  
0.1293280104  
-0.07112991396  
-0.3034814904  
-0.5471007286  
-0.7828380955  
-0.9949092939  
-1.172195903  
-1.308821114  
-1.403988719  
-1.461175119  
-1.486827963  
-1.48880842  
-1.474805539  
-1.450952999  
-1.420833477  
-1.384986707  
-1.340964005  
-1.283894211  
-1.207457942  
-1.105119248  
-0.9714277032  
-0.8032137753  
-0.6005073184  
-0.3670527077  
-0.1103474794  
0.1588066975  
0.4271934127  
0.6804164265  
0.904326888  
1.086483118  
1.217469904  
1.29192363  
1.309140692  
1.273190433  
1.19252454  
1.079109483  
0.9471824521  
0.8117670175  
0.6871195715  
0.5852757944  
0.5148771821  
0.4804074991  
0.4819266775  
0.5153328458  
0.573115593  
0.6454768089  
0.7216907539  
