28.38059013  
37.51116899  
56.40658986  
141.354208  
1039.071951  
3609.838466  
16754.6745  
66953.4657  
7390.590126  
3078.109751  
17730.76364  
3219.235455  
20689.54255  
1131.611271  
2358.477695  
21023.08412  
737.1252239  
17148.09692  
44402.09573  
1173.177152  
15883.94523  
10227.44561  
4182.526616  
1674.186785  
12689.00752  
9977.694829  
608.3703808  
2406.194746  
10953.62032  
16068.08381  
8223.272234  
11469.17564  
7090.331095  
7310.423056  
9390.073084  
4970.875663  
8802.673806  
23213.25614  
2394.49994  
5079.726734  
13482.97219  
11539.55754  
1278.252758  
2571.616175  
1776.365617  
484.3125059  
534.5319854  
279.7703544  
8211.048119  
1788.339887  
2535.552387  
6761.766155  
6430.240671  
4492.564648  
540.5614131  
624.4871743  
5738.669325  
2575.667605  
1473.442557  
3024.710652  
2068.926918  
4857.210833  
478.8793985  
1386.19213  
43.73162172  
47.45292253  
313.7104648  
135.6303205  
99.04855412  
29.0573733  
37.26373007  
22.38446762  
4.630678946  
42.17208501  
29.69029513  
9.406772936  
38.6641057  
20.55186563  
5.466787694  
9.702216347  
10.97218411  
12.63021279  
10.75553771  
12.16466064  
9.412662403  
8.039798256  
8.514849844  
7.002959246  
6.694875811  
6.131067345  
6.526862276  
6.458214508  
5.515644475  
5.375663294  
5.365571814  
5.080912206  
4.777886012  
4.716394275  
4.483587972  
4.318717697  
4.167210407  
4.035528447  
3.921247269  
3.772800655  
3.66494628  
3.533454045  
3.443892968  
3.340210513  
3.249619283  
3.162815153  
3.080481588  
3.002086514  
2.921133271  
2.852976685  
2.780784899  
2.713967802  
2.65406507  
2.593164092  
2.533973107  
2.478569747  
2.424093756  
2.373467258  
2.324251142  
2.276100019  
2.230334823  
2.185516799  
2.142887482  
2.101682719  
2.061815741  
2.023030305  
1.98574701  
1.949831838  
1.914615836  
1.880821558  
1.847826398  
1.816104978  
1.785083097  
1.755213987  
1.72599993  
1.697766967  
1.670236899  
1.643580618  
1.617607172  
1.592352033  
1.567755193  
1.543823186  
1.520540014  
1.497856065  
1.475741322  
1.454204207  
1.433200927  
1.412762409  
1.392793406  
1.373283135  
1.35427795  
1.335692424  
1.317583261  
1.299883745  
1.282588832  
1.265666478  
1.249213813  
1.233044646  
1.217262371  
1.201829386  
1.186749631  
1.171998956  
1.157529016  
1.143402428  
1.12956191  
1.116013239  
1.102742425  
1.089750813  
1.077008458  
1.064546175  
1.052328937  
1.040371666  
1.0286181  
1.017134149  
1.005839715  
0.9947426905  
0.9839227483  
0.973283627  
0.9628210129  
0.9525689266  
0.9425266288  
0.9326562717  
0.9229731216  
0.913465231  
0.9041278917  
0.8949645536  
0.8859416733  
0.8771196651  
0.868428298  
0.859879345  
0.8515118722  
0.8432680877  
0.8351665533  
0.8272108296  
0.8193797959  
0.8117161899  
0.80413976  
0.7967079833  
0.7894159252  
0.7822030277  
0.7751331502  
0.7682023037  
0.7613400552  
0.7546039026  
0.7479718161  
0.741469983  
0.7350601218  
0.7287445508  
0.7225598389  
0.7164395814  
0.7103923745  
0.7044753355  
0.6986415548  
0.6928953101  
0.6872364791  
0.6816581534  
0.6761798107  
0.6707733975  
0.6654458119  
0.6602087694  
0.6550499394  
0.6499283946  
0.6449208088  
0.6399704693  
0.6351173517  
0.6303172193  
0.6255755805  
0.6209007907  
0.6163138698  
0.6117740194  
0.6073214925  
0.6029138615  
0.5985554931  
0.5942748075  
0.5900633402  
0.5859084293  
0.5817863852  
0.5777464888  
0.5737378764  
0.5698188472  
0.5659113102  
0.5620879263  
0.5583016344  
0.5545699513  
0.5508785412  
0.547253122  
0.5436545696  
0.5401277952  
0.5366405324  
0.5331843492  
0.5297869713  
0.5264305371  
0.5231250931  
0.5198788645  
0.5166346116  
0.5134395997  
0.5103059812  
0.5071874421  
0.5041286678  
0.5010921854  
0.4981131271  
0.4951719668  
0.492258839  
0.489372484  
0.486526213  
0.4837175242  
0.4809579075  
0.478223485  
0.4755163736  
0.4728419746  
0.4702170702  
0.4676012453  
0.4650363153  
0.4624953579  
0.4599939311  
0.4575013749  
0.4550673192  
0.4526314644  
0.4502340112  
0.4478944384  
0.4455546302  
0.443235564  
0.4409565665  
0.4387098708  
0.436484935  
0.4342781304  
0.4321081982  
0.4299606535  
0.427826557  
0.4257497358  
0.4236694635  
0.4216226467  
0.419606495  
0.417619005  
0.4156207212  
0.4136632437  
0.4117508801  
0.4098363844  
0.4079517449  
0.4060783036  
0.4042303428  
0.4024231292  
0.4006109343  
0.3988339385  
0.3970686425  
0.3953090918  
0.3936054815  
0.39188813  
0.3902220106  
0.3885362487  
0.3869167783  
0.3852827715  
0.3836735243  
0.3820814198  
0.380522561  
0.3789584156  
0.3774293424  
0.3758939674  
0.374409441  
0.372925839  
0.3714593748  
0.3700152128  
0.3685750184  
0.3671577409  
0.3657467316  
0.3643710384  
0.36299087  
0.3616306788  
0.3602740514  
0.3589560189  
0.3576544252  
0.3563637372  
0.3550727753  
0.3537954441  
0.3525566335  
0.3513067564  
0.3500859688  
0.3488767918  
0.3476824012  
0.3464920461  
0.3453301064  
0.3441751055  
0.3430287117  
0.3418849484  
0.3407728549  
0.3396582285  
0.3385804498  
0.3374883137  
0.3364228684  
0.3353646333  
0.3343233562  
0.3332809398  
0.3322602684  
0.3312586431  
0.3302606726  
0.3292705343  
0.3282858676  
0.3273199326  
0.3263823935  
0.3254262711  
0.3245064811  
0.323584829  
0.3226683786  
0.3217717003  
0.3208885888  
0.3200070327  
0.3191469947  
0.3182806882  
0.3174282229  
0.3165882621  
0.3157786993  
0.3149383542  
0.3141377139  
0.3133482474  
0.3125575709  
0.3117790065  
0.3110002491  
0.3102416081  
0.3094880562  
0.3087556123  
0.3080198324  
0.3072980699  
0.3065713716  
0.3058588112  
0.3051556619  
0.3044910962  
0.3037990579  
0.3031263902  
0.3024635488  
0.3018179403  
0.3011733371  
0.3005196622  
0.2998953061  
0.2992813293  
0.2986593018  
0.2980517756  
0.2974582126  
0.2968684811  
0.2962947654  
0.2957255779  
0.2951513303  
0.2945947055  
0.2940484798  
0.2935099878  
0.2929620609  
0.2924322044  
0.2919160674  
0.2914063111  
0.2909051566  
0.2904118174  
0.2899139886  
0.289424029  
0.2889742991  
0.2884835419  
0.2880276186  
0.2875720473  
0.2871224686  
0.2866897474  
0.2862543072  
0.2858165525  
0.2854091739  
0.2849961963  
0.284590827  
0.2841806138  
0.2837988384  
0.2834154938  
0.2830420726  
0.2826475981  
0.2822956719  
0.2819294767  
0.2815827701  
0.2812423005  
0.28090829  
0.2805739862  
0.2802478818  
0.2799230752  
0.279603938  
0.2792864102  
0.2789913168  
0.2787040185  
0.2784126745  
0.2781357938  
0.2778534775  
0.2775832918  
0.2773207741  
0.2770748013  
0.2768200401  
0.2765705169  
0.2763180303  
0.2760763873  
0.2758652673  
0.2756522407  
0.275430885  
0.2752287197  
0.2750241936  
0.2748205805  
0.2746272869  
0.2744337361  
0.2742507557  
0.2740930999  
0.2739136551  
0.2737593646  
0.2736102254  
0.2734487411  
0.2732924125  
0.2731640191  
0.2730378608  
0.2729111747  
0.2727761961  
0.2726616467  
0.272557257  
0.2724473916  
0.2723457561  
0.2722535546  
0.2721756562  
0.272090912  
0.2720045672  
0.2719363085  
0.2718728547  
0.2718093642  
0.2717596754  
0.2717227951  
0.2716689983  
0.2716379768  
0.2715967035  
0.2715754938  
0.2715397704  
0.2715443027  
0.271537944  
0.2715434561  
