0.09328077934  
0.2136008099  
0.3297739992  
0.4343802199  
0.5205647275  
0.5826457802  
0.6166859554  
0.6209673049  
0.5963085481  
0.5461742588  
0.4765271356  
0.3954073357  
0.3122520535  
0.2369981414  
0.1790541077  
0.1462562498  
0.1439437384  
0.1742774858  
0.23592582  
0.3241689961  
0.4314380833  
0.5482331559  
0.6642856164  
0.7698155704  
0.8566873061  
0.9192938049  
0.9550401245  
0.9643627885  
0.9502935225  
0.9176631156  
0.872094365  
0.8189635043  
0.7625130726  
0.705257746  
0.6477808137  
0.5889205727  
0.5263101913  
0.4571400888  
0.3790067924  
0.2906868339  
0.1927007381  
0.08757684403  
-0.02022670657  
-0.1247192396  
-0.2190276013  
-0.2961939503  
-0.350001802  
-0.3757199905  
-0.3706641785  
-0.334529607  
-0.2694642669  
-0.179893278  
-0.07214342779  
0.04608744358  
0.166348523  
0.280077223  
0.3792208895  
0.456787172  
0.5072941477  
0.5271043745  
0.514618823  
0.4703285933  
0.3967128123  
0.297988533  
0.1797154447  
0.04827690559  
-0.08972685492  
-0.2281212238  
-0.3617726106  
-0.4870924354  
-0.6023649878  
-0.7078280866  
-0.8054832094  
-0.8986321632  
-0.991192505  
-1.086879769  
-1.188382392  
-1.296665193  
-1.410535777  
-1.526584311  
-1.639537602  
-1.743021643  
-1.830638054  
-1.897191486  
-1.939864735  
-1.959111174  
-1.95905182  
-1.947240316  
-1.933728269  
-1.929507808  
-1.944503665  
-1.985411984  
-2.053736439  
-2.144392931  
-2.245187493  
-2.337388733  
-2.397419201  
-2.399544952  
-2.319235836  
-2.13674783  
-1.840402504  
-1.429043443  
-0.9132430624  
-0.3150136334  
0.3340169391  
0.9957666403  
1.629789496  
2.197744746  
2.667626588  
3.017181389  
3.236051266  
3.326381443  
3.301859194  
3.185359794  
3.005574618  
2.793116397  
2.576638799  
2.379483389  
2.217261778  
2.096638305  
2.015392518  
1.963679417  
1.92623023  
1.885149429  
1.82288396  
1.72495659  
1.582109387  
1.391603084  
1.157552259  
0.8903137474  
0.6050710256  
0.3198510722  
0.05327345433  
-0.1776588369  
-0.3594539202  
-0.4834913714  
-0.5467244861  
-0.5516914456  
-0.5058879972  
-0.4206309223  
-0.309591477  
-0.1871918622  
-0.06707038211  
0.03922289684  
0.1231700777  
0.1797943115  
0.2077212067  
0.2088282599  
0.1875692176  
0.1500851811  
0.1032371855  
0.05368339317  
0.007108755805  
-0.03230672018  
-0.06215531986  
-0.08179431558  
-0.09211279821  
-0.09512993359  
-0.09351150013  
-0.09008933023  
-0.08745618066  
-0.08768614683  
-0.09221549233  
-0.1018690341  
-0.1170052425  
-0.1377327344  
-0.1641294129  
-0.1964144228  
-0.2350207463  
-0.2805553823  
-0.3336380586  
-0.3946574421  
-0.4634837421  
-0.5392015363  
-0.6199162511  
-0.7026906942  
-0.7836343629  
-0.858160994  
-0.9213828828  
-0.9686088337  
-0.995870281  
-1.000413457  
-0.9810787848  
-0.9385094217  
-0.875152491  
-0.7950428715  
-0.7033772345  
-0.6059437451  
-0.5084628591  
-0.4159317125  
-0.3320640703  
-0.2589009568  
-0.1966599416  
-0.1438427141  
-0.09759166913  
-0.05425524037  
-0.01006551121  
0.03815565411  
0.0923869541  
0.1529733367  
0.2184465716  
0.2856187173  
0.3499442038  
0.4060866141  
0.4486113875  
0.4726905261  
0.4747254764  
0.4527963652  
0.4068797173  
0.338823839  
0.2521003157  
0.1513901569  
0.04207569573  
-0.07026870659  
-0.1803251392  
-0.2833677127  
-0.3754571749  
-0.4535105419  
-0.5152742997  
-0.5592439743  
-0.5845858024  
-0.5910912279  
-0.5791915103  
-0.5500326567  
-0.5055761547  
-0.448701768  
-0.383247551  
-0.3139488608  
-0.246245696  
-0.1859440478  
-0.1387470348  
-0.1097062591  
-0.1026467437  
-0.1196531699  
-0.1606903962  
-0.2234229832  
-0.3032821335  
-0.3937941211  
-0.4871474798  
-0.5749502526  
-0.6490813615  
-0.7025437336  
-0.7301958655  
-0.7292638491  
-0.6995525699  
-0.6433180612  
-0.564810956  
-0.469555307  
-0.3634662437  
-0.2519570332  
-0.1391898957  
-0.02761039012  
0.08212244948  
0.1907693657  
0.2997465492  
0.4100750816  
0.5212414388  
0.6302057964  
0.7308121788  
0.8138131031  
0.8676548891  
0.8800302058  
0.8400812854  
0.7409658092  
0.582404396  
0.3727185167  
0.1298970389  
-0.1187070514  
-0.3382686292  
-0.4899699233  
-0.5357756353  
-0.4439632743  
-0.1946472279  
0.2155689438  
0.7706532078  
1.434603799  
2.153653544  
2.861200012  
3.484981063  
3.955631831  
4.215465485  
4.226219518  
3.974594329  
3.474711011  
2.767048937  
1.913965649  
0.9924030793  
0.08480759577  
-0.7304648534  
-1.387961354  
-1.842006868  
-2.070840943  
-2.077629307  
-1.888417987  
-1.547515955  
-1.11108183  
-0.6398547552  
-0.1920045697  
0.1830480173  
0.4491908264  
0.5861784536  
0.5900904385  
0.4718637336  
0.2542759383  
-0.03208203552  
-0.3532586143  
-0.6762247775  
-0.9724941114  
-1.220712016  
-1.40801434  
-1.53013385  
-1.590399102  
-1.597889052  
-1.565103135  
-1.505521969  
-1.431417381  
-1.352192989  
-1.273437609  
-1.196754236  
-1.120306798  
-1.03992803  
-0.9505603563  
-0.8477701219  
-0.7290772575  
-0.5948873133  
-0.4488880222  
-0.2978463565  
-0.1508547855  
-0.01814164526  
0.09037389531  
0.1665519022  
0.2053234119  
0.2055941068  
0.1706318206  
0.1078651965  
0.0281131333  
-0.05566989872  
-0.129959244  
-0.1823448792  
-0.203105946  
-0.186463552  
-0.1313552524  
-0.04161589733  
0.07444252362  
0.2050036896  
0.3361338063  
0.4534000165  
0.543517233  
0.595813596  
0.6033557405  
0.5636073217  
0.4785777029  
0.3544732988  
0.2009237089  
0.02989457988  
-0.1455575359  
-0.3125584746  
-0.4595712896  
-0.577323661  
-0.6594306087  
-0.7026781374  
-0.7069667595  
-0.6749538335  
-0.6114724045  
-0.5228080788  
-0.4159433255  
-0.2978565368  
-0.1749686702  
-0.05276954001  
0.06434162246  
0.1730256383  
0.270831177  
0.3559401142  
0.4269150759  
0.4824966405  
0.5215253286  
0.5429839674  
0.5461661798  
0.5309280443  
0.4979599139  
0.4490092543  
0.386987696  
0.3159103892  
0.2406495848  
0.1665209258  
0.09874438009  
0.04187079821  
-0.0007411506296  
-0.02730551876  
-0.03777109004  
-0.03373207096  
-0.01809466724  
0.005457102403  
0.03309653562  
0.06148786915  
0.08829678586  
0.1124853426  
0.1343275389  
0.1551425469  
0.1767925573  
0.2010430718  
0.2289170388  
0.2601773632  
0.2930509469  
0.3242686149  
0.3494266079  
0.3636220595  
0.3622530201  
0.3418505505  
0.3007936073  
0.2397848712  
0.1620070143  
0.07292477968  
-0.02023021723  
-0.1092222495  
-0.1857070044  
-0.2421397095  
-0.2725763524  
-0.2732811785  
-0.2430792047  
-0.1834364494  
-0.09828329583  
0.006372889581  
0.122995124  
0.2431551271  
0.3582097648  
0.4599655011  
0.5412870907  
0.5966191504  
0.6223854961  
0.6172437444  
0.5821613087  
0.5203033018  
0.4367268661  
0.3379004742  
0.2310885747  
0.1236604369  
0.0224060961  
-0.06706776729  
-0.1407851959  
-0.1966433446  
-0.2344231172  
-0.2555904854  
-0.2629200488  
-0.2600162444  
-0.2508031426  
-0.2390611129  
-0.2280663501  
-0.2203621893  
-0.2176743718  
-0.220942765  
-0.2304350542  
-0.2458975332  
-0.2666947886  
-0.2919138754  
-0.3204133175  
-0.350822336  
-0.381519313  
-0.4106078645  
-0.4359372148  
-0.4551857892  
-0.4660260775  
-0.466364486  
-0.4546317084  
-0.4300799727  
-0.393037219  
-0.3450616636  
-0.2889545627  
-0.2286032715  
-0.1686546593  
-0.1140468336  
-0.06945165002  
-0.03870295849  
-0.02428757173  
-0.02698429366  
-0.04569973749  
-0.0775414884  
-0.1181223662  
-0.1620600416  
-0.2036048715  
-0.2373133642  
-0.2586783044  
-0.2646275272  
-0.253837802  
-0.2268264671  
-0.1858141053  
-0.1343958418  
-0.07705582751  
-0.0186087347  
0.03637565589  
0.0840819328  
0.1218530511  
0.1484216397  
0.1639777517  
0.1700469818  
0.16922149  
0.1647659327  
0.1601568263  
0.1586088947  
0.1626418582  
0.1737388723  
0.1921363262  
0.216764229  
0.2453420096  
0.2746219737  
0.3007410893  
0.3196546824  
0.3275902004  
0.3214883493  
0.2993779792  
0.2606531541  
0.2062247392  
0.1385415554  
0.06145946604  
-0.02001016512  
-0.1000704257  
-0.1725857699  
-0.2315756161  
-0.2717046092  
-0.2887342269  
-0.2798919931  
-0.2441259594  
-0.1822257238  
-0.09680393922  
0.00786694749  
0.1261355541  
0.251356691  
0.3763443459  
0.4938646289  
0.59712857  
0.6802575994  
0.7386908281  
0.7694991923  
0.771591459  
0.7457899482  
0.6947568508  
0.6227789437  
0.5354051782  
0.4389660376  
0.3400096232  
0.2446988997  
0.1582303121  
0.08434047872  
0.02495504865  
-0.01996580499  
-0.05235870876  
-0.07575791363  
-0.0947951994  
-0.114549104  
-0.139828211  
-0.174473196  
-0.220782896  
-0.279137685  
-0.3478855011  
-0.4235102942  
-0.5010608776  
-0.5747977386  
-0.6389572723  
-0.6885303515  
-0.7199465295  
-0.7315577262  
-0.7238523049  
-0.6993698301  
-0.6623205744  
-0.6179770961  
-0.5719258982  
-0.5292933642  
-0.4940606063  
-0.4685753106  
-0.4533264524  
-0.447007319  
-0.4468545052  
-0.449196371  
-0.4501182793  
-0.4461370959  
-0.4347646639  
-0.4148831707  
-0.3868588572  
-0.3523958119  
-0.3141455708  
-0.2751603303  
-0.238274241  
-0.205542034  
-0.1778290111  
-0.1546436656  
-0.1342481348  
-0.1140427941  
-0.09116230433  
-0.06318076115  
-0.02879169122  
0.01167752741  
0.05604072661  
0.1003971718  
0.1396655981  
0.1684494493  
0.1821177383  
0.1779057158  
0.1558390867  
0.1192599644  
0.07480756044  
0.03176041525  
0.000767674251  
-0.007879347027  
0.01379942984  
0.06963309032  
0.1579186615  
0.2708231565  
0.3947921636  
0.5120431909  
0.6030424393  
0.6496711973  
0.6386410009  
0.5646062905  
0.4324002283  
0.257912394  
0.06727378504  
-0.1057384752  
-0.223869256  
-0.2516601217  
-0.1611142678  
0.06308314155  
0.4196618896  
0.8888967065  
1.433247756  
2.000631778  
2.530028279  
2.95875868  
3.230462408  
3.302649715  
3.152719817  
2.781538556  
2.214012262  
1.496545396  
0.6917180278  
-0.1290605307  
-0.8939101726  
-1.538707441  
-2.014111055  
-2.290531886  
-2.360509259  
-2.238341506  
-1.957183062  
-1.564124302  
-1.113991598  
-0.6627012094  
-0.2609867508  
0.05078468246  
0.2461918283  
0.3144376183  
0.2600925942  
0.1010874968  
-0.1346480499  
-0.4133996651  
-0.7001370943  
-0.9626921767  
-1.175145867  
-1.320096749  
-1.389621751  
-1.384958441  
-1.315062486  
-1.19436977  
-1.040133918  
-0.8697534218  
-0.6984582665  
-0.5376365355  
-0.3939680683  
-0.2694063876  
-0.1619005259  
-0.06668412437  
0.02214874465  
0.1100545218  
0.2007009304  
0.295088543  
0.3912366115  
0.4844639361  
0.5681724642  
0.6349840739  
0.6780138182  
0.6920661559  
0.6745428304  
0.6259272513  
0.5497673947  
0.4521728704  
0.3409267254  
0.2243533909  
0.1101500238  
0.004358433076  
-0.0893475282  
-0.1699521988  
-0.2389332348  
-0.2996727553  
-0.356557579  
-0.4139190975  
-0.4749979974  
-0.5411046307  
-0.6111223451  
-0.6814365578  
-0.7463162255  
-0.7986904707  
-0.8312142326  
-0.8374593582  
-0.8130476275  
-0.7565461999  
-0.6699789749  
-0.5588601714  
-0.4317246854  
-0.299207036  
-0.1727890662  
-0.06338385654  
0.02004248763  
0.07161984491  
0.08933488109  
0.07529077832  
0.03543565475  
-0.02120845556  
-0.08370168522  
-0.1405760776  
-0.1812679201  
-0.1974023987  
-0.183768463  
-0.1388587378  
-0.06492230851  
0.03246619833  
0.1452418728  
0.2639654716  
0.3790632844  
0.4820200403  
0.5663639981  
0.6283342334  
0.667143081  
0.6848260061  
0.6857225758  
0.6756721938  
0.661062654  
0.6478652175  
0.6408064246  
0.6427833452  
0.6545973361  
0.6750338833  
0.7012469028  
0.7293803275  
0.7553091886  
0.7753766606  
0.7870096909  
0.7891150025  
0.7822012289  
0.7682145777  
0.7501318262  
0.7313735893  
0.7151515624  
0.7038452182  
0.6985136809  
0.6986063306  
0.7019201713  
0.7047944416  
0.7025208629  
0.6899001852  
0.6618867985  
0.6142269747  
0.5440330475  
0.4502258472  
0.3337958119  
0.1978597218  
0.0474994445  
-0.1106052073  
-0.2687212195  
-0.4187413898  
-0.5529279351  
-0.664648156  
-0.7490266611  
-0.8034291174  
-0.8277205826  
-0.8242564797  
-0.7975938827  
-0.7539490413  
-0.7004612773  
-0.6443521208  
-0.5920835347  
-0.5486307309  
-0.5169612999  
-0.4978014233  
-0.4897064794  
-0.4894440438  
-0.4926207142  
-0.4944714268  
-0.4906991542  
-0.4782424804  
-0.4558709954  
-0.4245076559  
-0.3872377073  
-0.348990498  
-0.3159203624  
-0.2945705164  
-0.2909152369  
-0.3094051594  
-0.3521453526  
-0.4183193039  
-0.5039539867  
-0.6020735341  
-0.7032551867  
-0.7965404511  
-0.87060968  
-0.9150971069  
-0.9218833316  
-0.8862002796  
-0.8074067073  
-0.6893077251  
-0.5399633347  
-0.3709775645  
-0.196348548  
-0.03098957339  
0.1108924445  
0.2173787857  
0.2801865997  
0.295630315  
0.2650876384  
0.1949186561  
0.09585951121  
-0.01804441016  
-0.1308519537  
-0.2263509593  
-0.2897428936  
-0.3092397972  
-0.2774286968  
-0.1922635131  
-0.05758207278  
0.1169519391  
0.3165181334  
0.5224036836  
0.7137898313  
0.869893148  
0.9722432032  
1.006837381  
0.9658936038  
0.8489603695  
0.6632146034  
0.4228774507  
0.1477998583  
-0.1386211248  
-0.4119310956  
-0.6492023871  
-0.8313863493  
-0.9451515788  
-0.9839977121  
-0.9485454245  
-0.8460122323  
-0.6889909504  
-0.4937342051  
-0.2781859268  
-0.06002250183  
0.1450679778  
0.3246942848  
0.4705550129  
0.5786885662  
0.6492351781  
0.6857963744  
0.6945374004  
0.6831655242  
0.6599186895  
0.6326693039  
0.6082142228  
0.5917930091  
0.5868315968  
0.5949046602  
0.6158669022  
0.6481245731  
0.6889882272  
0.7350708983  
0.7826916528  
0.8282450889  
0.8685187609  
0.9009284597  
0.9236599416  
0.9357114076  
0.9368384799  
0.9274221207  
0.9082733198  
0.8804219069  
0.8449151424  
0.8026598546  
0.7543395367  
0.7004123099  
0.6411899853  
0.5769803513  
0.5082617981  
0.4358543207  
0.3610433182  
0.2856346731  
0.211904322  
0.1424507653  
0.0799485508  
0.02683993468  
-0.01500737435  
-0.04462680953  
-0.06221757765  
-0.06931476579  
-0.06883016192  
-0.06494958393  
-0.06288645379  
-0.0684989721  
-0.08779390212  
-0.1263512043  
-0.188715588  
-0.2778055871  
-0.3944019529  
-0.536789385  
-0.7006085408  
-0.8789854734  
-1.062973394  
-1.24231942  
-1.406518108  
-1.546080552  
-1.653880995  
-1.726410558  
-1.764737422  
-1.774977639  
-1.768103942  
-1.758993318  
-1.764713291  
-1.80215866  
-1.885283316  
-2.022268632  
-2.213052709  
-2.447642022  
-2.705594771  
-2.956929306  
-3.164528081  
-3.287899282  
-3.287924141  
-3.132027631  
-2.799086279  
-2.283355576  
-1.596775086  
-0.7692169994  
0.1535073365  
1.113731531  
2.047650998  
2.891967531  
3.59059908  
4.100588574  
4.396441671  
4.472382271  
4.342284204  
4.037383019  
3.60213835  
3.088844517  
2.551691448  
2.04098978  
1.598215863  
1.252356994  
1.017888071  
0.8944760597  
0.8683429409  
0.9150183093  
1.003097665  
1.098520818  
1.168858239  
1.18711382  
1.134638008  
1.002860136  
0.7937119443  
0.51877668  
0.1973521023  
-0.1462579192  
-0.4858464514  
-0.7963832471  
-1.056711189  
-1.251557466  
-1.372696539  
-1.419194915  
-1.396812401  
-1.316724093  
-1.193787911  
-1.0446189  
-0.8857166878  
-0.7318602944  
-0.5949114224  
-0.4831110629  
-0.4008646285  
-0.3489650611  
-0.325151722  
-0.3248776862  
-0.3421698125  
-0.3704581069  
-0.4033084558  
-0.4349927366  
-0.4608832593  
-0.4776768463  
