-0.1959266814  
0.06582624027  
0.315848834  
0.5414828566  
0.7325633143  
0.8822715184  
0.9874709408  
1.048509639  
1.068571269  
1.052740214  
1.006968251  
0.937134516  
0.8483791748  
0.7447624687  
0.6292847017  
0.5041914758  
0.3714337111  
0.2331461191  
0.09200964807  
-0.04861345134  
-0.184794225  
-0.3123822957  
-0.4274993873  
-0.5270701267  
-0.6092516335  
-0.6736866484  
-0.721495576  
-0.7550187076  
-0.7773559745  
-0.7917842943  
-0.8011784457  
-0.8075305962  
-0.8116557134  
-0.813126625  
-0.8104295547  
-0.8012986053  
-0.7831464746  
-0.7535116332  
-0.7104362111  
-0.6527348683  
-0.5801097711  
-0.4931554346  
-0.3932720187  
-0.2825460785  
-0.1636329323  
-0.03968619433  
0.08569831597  
0.2085138869  
0.3244189024  
0.4288953415  
0.5175079178  
0.5862883715  
0.6321956712  
0.6536011691  
0.6507109645  
0.6258390325  
0.5834410261  
0.5298778959  
0.4728871104  
0.4208239687  
0.3817402488  
0.3624289233  
0.3675805954  
0.3991428868  
0.4560198094  
0.5341152257  
0.6267706097  
0.7254941704  
0.8209231332  
0.9038639375  
0.9662911071  
1.002175666  
1.008052504  
0.9832598281  
0.9298499222  
0.8522031529  
0.756404355  
0.6494645493  
0.5385015491  
0.4299462151  
0.3288717355  
0.2385023072  
0.1599373573  
0.09211951024  
0.03205061051  
-0.0247561999  
-0.08362056247  
-0.1498822253  
-0.22800011  
-0.3206540728  
-0.4279632212  
-0.5469309717  
-0.671235503  
-0.7914419556  
-0.8957028558  
-0.9709105043  
-1.00423016  
-0.9848563878  
-0.9057723447  
-0.7652898047  
-0.5680959148  
-0.3256385221  
-0.0556948564  
0.2188927519  
0.4722322951  
0.677955226  
0.8120684602  
0.8557357536  
0.7976641776  
0.6357589812  
0.3778377391  
0.0412703151  
-0.3484294172  
-0.7599373703  
-1.159096984  
-1.512236518  
-1.789430091  
-1.967360627  
-2.031463607  
-1.977135594  
-1.809906541  
-1.544583967  
-1.203492631  
-0.8140457729  
-0.4059204336  
-0.008159409439  
0.3534823151  
0.6586965127  
0.8940636101  
1.053670136  
1.138894606  
1.157416171  
1.121617195  
1.046608572  
0.9481230177  
0.8405521176  
0.7353731254  
0.6401276446  
0.5580702768  
0.4884864515  
0.4275886726  
0.3698161503  
0.3093174872  
0.2413677461  
0.1634742028  
0.07602866812  
-0.01761316512  
-0.111596623  
-0.1984945801  
-0.2705013448  
-0.3207054962  
-0.3442087074  
-0.3389154098  
-0.3058810574  
-0.2491725461  
-0.1752923579  
-0.09228484792  
-0.008662901293  
0.06764593119  
0.1301990988  
0.1746531743  
0.1990409029  
0.2036990083  
0.1909078041  
0.16433781  
0.1283956718  
0.0875958817  
0.04602780821  
0.00698687178  
-0.02723103199  
-0.05536485914  
-0.07710293519  
-0.09292632454  
-0.1039039229  
-0.1115024638  
-0.1174132692  
-0.1234028478  
-0.1311851584  
-0.1423032033  
-0.1580031426  
-0.1791073929  
-0.2058907425  
-0.2379713525  
-0.2742424454  
-0.3128807138  
-0.3514200981  
-0.386931034  
-0.4162757111  
-0.4364175305  
-0.4447571929  
-0.4394336743  
-0.4195600969  
-0.3853462168  
-0.3380901495  
-0.2800452197  
-0.2141735221  
-0.1438263586  
-0.07241134291  
-0.003089755486  
0.06145555779  
0.1191538084  
0.1685716692  
0.2088564391  
0.2396402653  
0.2609149291  
0.2729517263  
0.2762631455  
0.2716275621  
0.2601499061  
0.243324944  
0.2230770011  
0.201712034  
0.1817838365  
0.1658514721  
0.15616143  
0.1542989892  
0.1608619447  
0.1752443179  
0.1955550115  
0.2187424225  
0.2409180214  
0.2578473411  
0.2655664305  
0.2610258902  
0.2426714552  
0.2108568464  
0.1680217937  
0.1185644117  
0.06842125199  
0.02437449613  
-0.006836539784  
-0.01946860318  
-0.009693741472  
0.02367950943  
0.07878219526  
0.1506430354  
0.2315712488  
0.3119365614  
0.3812703302  
0.429565361  
0.4486057663  
0.433153491  
0.3818275097  
0.2975321653  
0.1873480259  
0.06188167915  
-0.06588368103  
-0.1821152276  
-0.2738547018  
-0.3307267581  
-0.3464229344  
-0.31974994  
-0.2550885376  
-0.1621843004  
-0.05523845971  
0.04860218296  
0.1312098595  
0.1756682213  
0.1684411232  
0.1012283728  
-0.02771748719  
-0.2130065129  
-0.4423644487  
-0.6977097098  
-0.9569614289  
-1.196371568  
-1.39311351  
-1.527807078  
-1.586691469  
-1.563154429  
-1.458443482  
-1.281469798  
-1.047722211  
-0.7774413335  
-0.4932716324  
-0.2177001461  
0.02942579261  
0.2329887444  
0.384064243  
0.480606556  
0.5272873048  
0.5345383091  
0.5169325174  
0.4911110542  
0.4735095045  
0.4781547106  
0.5147929491  
0.5875480433  
0.6942849393  
0.8267304998  
0.9713507331  
1.110881513  
1.226352689  
1.299357965  
1.314333321  
1.260562172  
1.133678063  
0.9364727143  
0.6789147942  
0.3773456649  
0.05294952046  
-0.2703436958  
-0.5682754051  
-0.8187207649  
-1.003907323  
-1.112128589  
-1.138766711  
-1.086514006  
-0.9647937261  
-0.7884681608  
-0.5760247474  
-0.3474710071  
-0.1222112064  
0.08284584437  
0.2547291822  
0.3852675995  
0.4713097212  
0.5143259095  
0.5195248685  
0.4946289179  
0.4485207894  
0.3899499273  
0.3264619729  
0.2636774478  
0.2049591554  
0.1514674009  
0.1025275732  
0.05621258485  
0.01001799693  
-0.03850861742  
-0.09125484572  
-0.1492225762  
-0.2124239643  
-0.2799485626  
-0.3501897239  
-0.4211280745  
-0.4906356993  
-0.5567303579  
-0.6177524799  
-0.6724627414  
-0.7200422094  
-0.7600456249  
-0.7923029493  
-0.8167915407  
-0.8335032894  
-0.8423028057  
-0.8427881713  
-0.8341688788  
-0.8151807958  
-0.7840601585  
-0.7386163366  
-0.6764077171  
-0.5950534028  
-0.4926334016  
-0.3681549398  
-0.2220044162  
-0.05629833254  
0.1249497457  
0.3159100128  
0.5093030181  
0.6970252819  
0.8709693387  
1.023918464  
1.150364649  
1.247119272  
1.313571266  
1.351537165  
1.364707817  
1.357762649  
1.335313464  
1.300873911  
1.256062057  
1.200209109  
1.130481374  
1.042532417  
0.9315957664  
0.7938193867  
0.6276262843  
0.4348091508  
0.2211540979  
-0.00358652845  
-0.2263961155  
-0.4323373399  
-0.6063268899  
-0.7351129924  
-0.8091328745  
-0.8239875712  
-0.7812730988  
-0.6886439955  
-0.5590743956  
-0.4093822757  
-0.2582434315  
-0.1239228729  
-0.02205429857  
0.03623864684  
0.0456346183  
0.007139361093  
-0.07222251693  
-0.1804859337  
-0.302465833  
-0.4218556557  
-0.5234340011  
-0.5950703425  
-0.6292719693  
-0.6240660478  
-0.5831101483  
-0.5150322053  
-0.4320994647  
-0.3484066105  
-0.2778309265  
-0.2320457703  
-0.2188356001  
-0.2409443322  
-0.2956103695  
-0.3748149051  
-0.4662351014  
-0.5547539901  
-0.6243479479  
-0.660113195  
-0.6501894513  
-0.5873594136  
-0.4701329861  
-0.3032098882  
-0.09724071707  
0.1320528455  
0.3653330591  
0.5815223577  
0.7598859598  
0.8821268824  
0.9342660503  
0.9081112245  
0.8021692495  
0.6219040291  
0.3793111233  
0.09186472291  
-0.2190627652  
-0.5301270389  
-0.8181037481  
-1.061895656  
-1.244277508  
-1.353188193  
-1.382452869  
-1.3318971  
-1.206858961  
-1.017222537  
-0.7761018346  
-0.4983875859  
-0.1993393102  
0.106603996  
0.4066724342  
0.6902209294  
0.9488195838  
1.176049115  
1.367135629  
1.518552302  
1.627708964  
1.692796285  
1.712813255  
1.687728142  
1.618709954  
1.50832242  
1.360603669  
1.180978321  
0.9759922968  
0.7528961817  
0.5191703228  
0.2820556202  
0.04817997626  
-0.1766590243  
-0.3875631424  
-0.5804451056  
-0.7518669927  
-0.8988477568  
-1.018730652  
-1.10914333  
-1.168086583  
-1.194134258  
-1.186721089  
-1.146446326  
-1.075353345  
-0.9770978239  
-0.8569761402  
-0.7217745944  
-0.5794359225  
-0.4385690738  
-0.307821012  
-0.1951877485  
-0.1073077803  
-0.04881985411  
-0.02185056562  
-0.02568359331  
-0.05668434219  
-0.1084826765  
-0.1724461851  
-0.2384041415  
-0.295574943  
-0.3336055496  
-0.3436197057  
-0.3191400532  
-0.2567898019  
-0.156676889  
-0.02240339518  
0.1392799165  
0.3191291465  
0.5062804894  
0.6892107005  
0.8566700735  
0.9984793615  
1.106130151  
1.173170823  
1.195414007  
1.171023756  
1.100548824  
0.9869671255  
0.8357455172  
0.6548870472  
0.4548723999  
0.24841061  
0.04986608472  
-0.1256851812  
-0.2637664155  
-0.3520941899  
-0.3822516954  
-0.351202016  
-0.2623518808  
-0.1259205212  
0.04155873627  
0.2186424294  
0.3811937187  
0.5051544796  
0.5695197576  
0.5591030463  
0.4666909901  
0.2942647194  
0.05308479084  
-0.2373843726  
-0.5515879789  
-0.8607514522  
-1.136133417  
-1.352237278  
-1.48959498  
-1.536764836  
-1.491358091  
-1.359996467  
-1.157261484  
-0.9038305555  
-0.6240456036  
-0.3432596548  
-0.08525131428  
0.1299897304  
0.2878998607  
0.3802852793  
0.4055337504  
0.368152132  
0.2777682724  
0.1477536116  
-0.006322076429  
-0.1682308838  
-0.3224618143  
-0.4553150241  
-0.5556622872  
-0.6153720068  
-0.6294320445  
-0.5958566282  
-0.5154545349  
-0.3915568369  
-0.2297448133  
-0.03762091765  
0.175407748  
0.3983587161  
0.6190051945  
0.8243451383  
1.001274405  
1.137439221  
1.222228997  
1.247798959  
1.209986774  
1.108970122  
0.9495353659  
0.7408715425  
0.4958684248  
0.2300073114  
-0.04005450391  
-0.2979829579  
-0.5291663211  
-0.7218338401  
-0.8677520369  
-0.9624545087  
-1.005047445  
-0.997661851  
-0.9447348492  
-0.852256847  
-0.7271265073  
-0.5767135724  
-0.4086313075  
-0.2307036657  
-0.05099862589  
0.1221583027  
0.2803191164  
0.4152637153  
0.5195681272  
0.5873457117  
0.6150503861  
0.6021772611  
0.5517317324  
0.4703140297  
0.3677750276  
0.2564248661  
0.1498773434  
0.06166152161  
0.003782581647  
-0.01458121092  
0.01191374152  
0.08420369741  
0.1987249864  
0.3478156158  
0.5205312742  
0.7037629709  
0.8835250943  
1.046230038  
1.179836373  
1.2747375  
1.324331075  
1.325235075  
1.277180791  
1.182631191  
1.046221044  
0.8741053831  
0.6733195524  
0.4512159749  
0.215041558  
-0.02832989477  
-0.2725200031  
-0.5116429237  
-0.7402498177  
-0.9532562252  
-1.145922091  
-1.313907006  
-1.453438857  
-1.561552117  
-1.636398524  
-1.677544822  
-1.686201556  
-1.665327278  
-1.619550202  
-1.554897998  
-1.478338024  
-1.39718443  
-1.318438717  
-1.248155829  
-1.190906777  
-1.149424107  
-1.124454448  
-1.1148198  
-1.117664266  
-1.128822409  
-1.143236052  
-1.155363688  
-1.159519814  
-1.150130824  
-1.121911504  
-1.06999411  
-0.9900542146  
-0.8784742715  
-0.732587927  
-0.5509966196  
-0.3339362143  
-0.08364366678  
0.1953544088  
0.4961076669  
0.8093300894  
1.123750963  
1.426739338  
1.705162366  
1.946408362  
2.139462578  
2.275915792  
2.350777005  
2.362979194  
2.315506821  
2.21511147  
2.071642649  
1.897069932  
1.704318543  
1.506049798  
1.31355666  
1.135897041  
0.9793601205  
0.8473245517  
0.7404908585  
0.6574284889  
0.5953389316  
0.5508752122  
0.520900178  
0.5030333789  
0.4958884114  
0.4989741581  
0.5122578059  
0.5354899493  
0.5674166639  
0.6050537863  
0.6431996663  
0.6743216396  
0.6889079624  
0.6762831294  
0.6258163918  
0.5283499014  
0.3776365167  
0.171558883  
-0.08708253458  
-0.3903735991  
-0.7257153629  
-1.076862703  
-1.425403382  
-1.752484211  
-2.040508768  
-2.274590315  
-2.443536884  
-2.540294433  
-2.561815991  
-2.508479502  
-2.383214398  
-2.190579561  
-1.93601783  
-1.625462577  
-1.265415872  
-0.8634594115  
-0.4291001986  
0.02530681553  
0.4838299328  
0.9267339743  
1.33099169  
1.671661319  
1.924109291  
2.066854395  
2.084690809  
1.971579862  
1.732814208  
1.385973082  
0.9603447995  
0.4947076369  
0.03362451091  
-0.377364851  
-0.6970320568  
-0.8935075694  
-0.9483718257  
-0.8591558047  
-0.6398641138  
-0.3194069204  
0.0618738285  
0.4571032525  
0.8185085573  
1.103025681  
1.277096409  
1.320049117  
1.225669889  
1.001863558  
0.6685641435  
0.2543547212  
-0.207656573  
-0.6840230546  
-1.144628778  
-1.565374624  
-1.929608797  
-2.228284449  
-2.458996805  
-2.624244206  
-2.729341453  
-2.780406325  
-2.782798715  
-2.740246827  
-2.654752269  
-2.527189565  
-2.358386634  
-2.1503829  
-1.9075174  
-1.637056244  
-1.34915402  
-1.056078346  
-0.7707909652  
-0.5051079141  
-0.2677835838  
-0.06289006746  
0.1111533183  
0.261641396  
0.4006330442  
0.5430718025  
0.7042143654  
0.8967927281  
1.12835947  
1.39930468  
1.701920321  
2.020722439  
2.334036086  
2.616624258  
2.842952047  
2.990561113  
3.043020708  
2.99198596  
2.838076898  
2.590494399  
2.265547101  
1.884412014  
1.470604027  
1.047608237  
0.6370631982  
0.2577034453  
-0.07491990469  
-0.3481166565  
-0.5514542173  
-0.676224935  
-0.715306098  
-0.6635783954  
-0.5189078387  
-0.2834967767  
0.03476875832  
0.4213427935  
0.8548299822  
1.307816724  
1.748750746  
2.144718997  
2.464706382  
2.682845171  
2.781107673  
2.750992309  
2.593945586  
2.320464851  
1.948132028  
1.498941793  
0.9964801214  
0.4634322277  
-0.08015060159  
-0.6176229101  
-1.135559649  
-1.622837478  
-2.069365334  
-2.46490853  
-2.798403612  
-3.058057376  
-3.232296538  
-3.311430744  
-3.289716836  
-3.167346166  
-2.9518989  
-2.658838253  
-2.310807628  
-1.935697572  
-1.563703279  
-1.223781915  
-0.9400695002  
-0.7288360039  
-0.5964849549  
-0.5389496428  
-0.542582017  
-0.5863965619  
-0.6453006433  
-0.6937854697  
-0.7094932752  
-0.6761271719  
-0.5852832346  
-0.4370144982  
-0.2391355056  
-0.00548750908  
0.2464643638  
0.4982490034  
0.7327965753  
0.9362790354  
1.099176446  
1.216501276  
1.287305097  
1.313637646  
1.29926817  
1.24843322  
1.164847206  
1.051152675  
0.9088655284  
0.7387846451  
0.5417635144  
0.3196487504  
0.076213778  
-0.1821432654  
-0.4460808343  
-0.7034851882  
-0.9401732724  
-1.141066748  
-1.291709813  
-1.379940834  
-1.397486073  
-1.341237746  
-1.214015796  
-1.024674181  
-0.7874842699  
-0.5208647247  
-0.2455714393  
0.01741300899  
0.2490254929  
0.4340407159  
0.5625101685  
0.6305413416  
0.6403579033  
0.599635042  
0.5202574444  
0.4166851255  
0.3041659466  
0.1970556819  
0.1074493096  
0.04427234324  
0.01289358708  
0.0152412591  
0.05031549809  
0.114942319  
0.2046056317  
0.3142011107  
0.4385834328  
0.5728768707  
0.7125439655  
0.8532700369  
0.9907811609  
1.12067491  
1.238371994  
1.339225546  
1.418792628  
1.473216039  
1.499640447  
1.496546876  
1.463915811  
1.403162313  
1.316803737  
1.207933286  
1.079573621  
0.9340559577  
0.7725890878  
0.5951250361  
0.4006356291  
0.1877831073  
-0.04409036262  
-0.2938151349  
-0.557336311  
-0.8269726509  
-1.091237743  
-1.335361984  
-1.542554295  
-1.695899112  
-1.780648917  
-1.786584683  
-1.710046713  
-1.555264246  
-1.334710535  
-1.068313659  
-0.7815653581  
-0.5027382541  
-0.2595657527  
-0.07586050221  
0.03144456952  
0.05437757662  
-0.005180923066  
-0.1359278682  
-0.3188346847  
-0.5298311511  
-0.7430698283  
-0.9342586326  
-1.083561814  
-1.177645603  
-1.21059982  
-1.183660369  
-1.103860923  
-0.9819261818  
-0.8298263656  
-0.6584629404  
-0.4759113788  
-0.2865380615  
-0.09109992177  
0.1122100662  
0.3260365302  
0.5518300534  
0.7879572042  
1.02838666  
1.26225729  
1.47450324  
1.647471557  
1.763313368  
1.806730194  
1.76762742  
1.643167695  
1.438855924  
1.168426027  
0.852500365  
0.5162175879  
