------------------------------------------
Setting up environment variables
---
LD_LIBRARY_PATH is .:/opt/software/fix/1.065/MATLAB_Compiler_Runtime/v83/runtime/glnxa64:/opt/software/fix/1.065/MATLAB_Compiler_Runtime/v83/bin/glnxa64:/opt/software/fix/1.065/MATLAB_Compiler_Runtime/v83/sys/os/glnxa64
Warning: Name is nonexistent or not a directory: /usr/local/fsl/etc/matlab
[> In path at 109
  In startup at 1] 
Warning: Name is nonexistent or not a directory: /usr/local/fmrib/fmt
[> In path at 109
  In startup at 2] 
/home/mpib/LNDG/StateSwitch/WIP_rest/preproc/B_data/D_preproc/1266/preproc/rest/FEAT.feat/
    24     1

    24     2

    24     3

    24     4

    24     5

    24     6

    24     7

    24     8

    24     9

    24    10

    24    11

    24    12

    24    13

    24    14

    24    15

    24    16

    24    17

    24    18

    24    19

    24    20

    24    21

    24    22

    24    23

    24    24

End of Matlab Script
