0.2008978756  
0.8896831633  
1.529441291  
2.07590737  
2.495552545  
2.769297704  
2.894376966  
2.884120188  
2.765719986  
2.576296415  
2.357812808  
2.151530249  
1.992738804  
1.906447796  
1.904581825  
1.985009456  
2.132454021  
2.321116036  
2.518562613  
2.690301475  
2.804400191  
2.835512341  
2.767804908  
2.596478976  
2.327792312  
1.977691888  
1.56939443  
1.130321588  
0.6888645511  
0.271417512  
-0.09998446644  
-0.4092214661  
-0.6467757675  
-0.8096271666  
-0.9005194608  
-0.9268267569  
-0.8992364952  
-0.8304495996  
-0.7340110231  
-0.6233325935  
-0.5109114852  
-0.4076885984  
-0.3225013704  
-0.2615927915  
-0.2281927516  
-0.2222044816  
-0.2400971664  
-0.2751027444  
-0.3177904176  
-0.3570637728  
-0.3815287583  
-0.3811155165  
-0.3487509328  
-0.2818078552  
-0.1830866797  
-0.06108574749  
0.07056481328  
0.194522061  
0.2918557228  
0.3446053999  
0.3383920989  
0.2646780037  
0.1222959318  
-0.08203058212  
-0.3342595587  
-0.6146656309  
-0.9002459496  
-1.167565279  
-1.395572261  
-1.567997796  
-1.674984507  
-1.713767421  
-1.688378379  
-1.608504545  
-1.487766477  
-1.341721139  
-1.185939229  
-1.03441975  
-0.8985284185  
-0.7865274538  
-0.7036253388  
-0.6524132534  
-0.6334982873  
-0.646099955  
-0.6884844763  
-0.7581116284  
-0.8515103326  
-0.9639301466  
-1.08893509  
-1.21807276  
-1.340796654  
-1.444750131  
-1.51645964  
-1.542427103  
-1.510485928  
-1.411270872  
-1.23959114  
-0.9954678127  
-0.6846892621  
-0.3187155235  
0.08606868179  
0.5097255918  
0.9306080418  
1.327456872  
1.681492255  
1.978238754  
2.208824862  
2.370598201  
2.466951406  
2.506389542  
2.500956484  
2.464242689  
2.409268253  
2.346539051  
2.282579926  
2.219175296  
2.153427298  
2.07864806  
1.985946007  
1.866260253  
1.712524489  
1.52160265  
1.29564334  
1.04262168  
0.7759017005  
0.512847403  
0.2726538815  
0.07368513294  
-0.0692607047  
-0.1473332565  
-0.1592600407  
-0.1119313947  
-0.01979501141  
0.09688081053  
0.2146508343  
0.3100579346  
0.3628368478  
0.3586807215  
0.2911349906  
0.1623357369  
-0.01751238883  
-0.2318343886  
-0.4602666265  
-0.6817291766  
-0.877500783  
-1.033837514  
-1.143732199  
-1.207602806  
-1.232811415  
-1.232143211  
-1.221513824  
-1.217275453  
-1.233554448  
-1.280027839  
-1.360455126  
-1.47217006  
-1.606570669  
-1.750479968  
-1.888150247  
-2.003561223  
-2.082652717  
-2.115162901  
-2.095803963  
-2.024655937  
-1.906757083  
-1.751030031  
-1.568760764  
-1.371904373  
-1.171508884  
-0.9765018451  
-0.7929776565  
-0.6240762628  
-0.4703832871  
-0.3307248956  
-0.2031804609  
-0.08608287177  
0.02115936386  
0.1175901699  
0.2006158301  
0.2663317983  
0.3101637961  
0.327717049  
0.3156727531  
0.2725805123  
0.1994380544  
0.09994958214  
-0.01956133742  
-0.1505642972  
-0.2830117369  
-0.4062079025  
-0.5097375112  
-0.5843506448  
-0.6226976956  
-0.6198362798  
-0.573474312  
-0.4839460105  
-0.3539505633  
-0.1881246388  
0.00748162294  
0.2259363748  
0.4598935886  
0.7019461992  
0.9448358555  
1.181518721  
1.405122954  
1.608853757  
1.785905479  
1.929456215  
2.032806732  
2.089692778  
2.094787459  
2.044350212  
1.936966075  
1.77425336  
1.561428832  
1.307585865  
1.025581679  
0.7314525974  
0.4433494821  
0.1800604247  
-0.04074996229  
-0.2043714089  
-0.3007189671  
-0.3255945808  
-0.2813548186  
-0.1768407392  
-0.02654411457  
0.150901001  
0.3347300453  
0.5043156247  
0.6413829471  
0.7318995077  
0.7673930051  
0.7455473905  
0.6700276823  
0.5495864693  
0.3966241672  
0.2254319124  
0.05035797737  
-0.115815386  
-0.2631007888  
-0.3850103002  
-0.4786865927  
-0.5445006653  
-0.5852525091  
-0.6051162376  
-0.6085262757  
-0.5991782095  
-0.5792833251  
-0.5491871562  
-0.5073832173  
-0.4509250516  
-0.376162844  
-0.2796890316  
-0.1593465019  
-0.01514614107  
0.1500871746  
0.3304364633  
0.5170943702  
0.6990203884  
0.8640211854  
1.000093377  
1.096869827  
1.146955104  
1.146958237  
1.098073871  
1.00611836  
0.8810035334  
0.7357033742  
0.5848295454  
0.4429708384  
0.3229703582  
0.2343211276  
0.181851048  
0.1648434283  
0.1767228023  
0.205378665  
0.2341695959  
0.2435730077  
0.2133585595  
0.1251038206  
-0.03524742428  
-0.2750865544  
-0.5934525479  
-0.9802458815  
-1.416517382  
-1.87590507  
-2.327078411  
-2.73692673  
-3.074095046  
-3.312395578  
-3.433664848  
-3.429671086  
-3.302868233  
-3.065905704  
-2.740038328  
-2.352653882  
-1.934308643  
-1.51563488  
-1.124502221  
-0.7837265824  
-0.5095077821  
-0.3106804893  
-0.1887309906  
-0.1384704821  
-0.1492002374  
-0.2061913312  
-0.2923124008  
-0.3896782656  
-0.4812163982  
-0.5520654242  
-0.5907410429  
-0.5900202441  
-0.5474592832  
-0.4654949588  
-0.3510932794  
-0.2149231482  
-0.07010239923  
0.06938224076  
0.1904312619  
0.2825501277  
0.3393112763  
0.3593451244  
0.3466826091  
0.3103853981  
0.2634458252  
0.2211110643  
0.1988136946  
0.2100111672  
0.2642151067  
0.3655165497  
0.5118067344  
0.6948322427  
0.9010815644  
1.11340865  
1.313171139  
1.48260155  
1.607117335  
1.677223959  
1.68978682  
1.648471091  
1.56329564  
1.449327264  
1.324682751  
1.20809168  
1.116324401  
1.06185789  
1.05108955  
1.083376867  
1.151069654  
1.240560209  
1.334242518  
1.41310323  
1.459600808  
1.460370854  
1.40833832  
1.303876225  
1.154777268  
0.9750005127  
0.7823594891  
0.5954927028  
0.4306158522  
0.2986167663  
0.2030008312  
0.1390993567  
0.09472790927  
0.05223350843  
-0.008364056387  
-0.1056565851  
-0.253168514  
-0.4563677672  
-0.7108895302  
-1.002311824  
-1.307580436  
-1.597877268  
-1.842526531  
-2.01333591  
-2.088720145  
-2.056963732  
-1.918154403  
-1.684480032  
-1.378856483  
-1.032109948  
-0.6791032596  
-0.3543951763  
-0.08802557134  
0.09800327212  
0.1920833311  
0.1939520674  
0.11415414  
-0.02783271619  
-0.2064892876  
-0.3937364117  
-0.5625271537  
-0.6900765737  
-0.7603466724  
-0.7655228471  
-0.7063525405  
-0.5913974788  
-0.4353497275  
-0.2567172648  
-0.07518802885  
0.09094337051  
0.2269893754  
0.3234572888  
0.3768529681  
0.3896744909  
0.3696311875  
0.3282568709  
0.2791286281  
0.2359439896  
0.2107076953  
0.2122609579  
0.2452993706  
0.309993068  
0.4021953018  
0.5141868859  
0.6358038731  
0.7557939714  
0.863173476  
0.9484344206  
1.004430686  
1.026862907  
1.01432791  
0.967981246  
0.8909050506  
0.7873333659  
0.6618786618  
0.5189053737  
0.3621720449  
0.1947758038  
0.01940888949  
-0.1611614761  
-0.3434962846  
-0.5229446051  
-0.6932950473  
-0.8467597924  
-0.974361265  
-1.066725877  
-1.115205068  
-1.113181512  
-1.05735415  
-0.9487787924  
-0.7934631648  
-0.6023552196  
-0.3906563623  
-0.1764840083  
0.02097235601  
0.1835905538  
0.2964588829  
0.3497328078  
0.339923831  
0.2704329824  
0.1512217494  
-0.002349840164  
-0.1713830605  
-0.3357660168  
-0.4766597366  
-0.5788225215  
-0.6324838866  
-0.6345159951  
-0.5887609796  
-0.5054792086  
-0.3999925922  
-0.2906954474  
-0.1966928313  
-0.1353675774  
-0.1201692152  
-0.1589124568  
-0.2527740482  
-0.3961099576  
-0.5770997942  
-0.7791153753  
-0.9826471839  
-1.167534128  
-1.315219374  
-1.410788041  
-1.444527689  
-1.412859258  
-1.318546261  
-1.170177593  
-0.9810129701  
-0.7673366189  
-0.5465359239  
-0.3351368074  
-0.147022075  
0.007956343533  
0.1248241087  
0.2037026722  
0.2493881483  
0.2703614356  
0.2773635708  
0.2817222745  
0.2936439234  
0.3207076881  
0.3667468131  
0.4312835314  
0.5095828288  
0.5933476569  
0.6719367421  
0.7339728731  
0.7690941836  
0.7695982257  
0.7317502741  
0.6565227325  
0.5496647007  
0.4210357572  
0.283314201  
0.1502210401  
0.03454923343  
-0.05372289518  
-0.1089180635  
-0.130497864  
-0.123091131  
-0.09567836374  
-0.06003447705  
-0.02865501538  
-0.01249490462  
-0.01888731639  
-0.04999328913  
-0.102067946  
-0.1656766347  
-0.2268875094  
-0.2692563354  
-0.2763113973  
-0.2341781966  
-0.1338980523  
0.02689686403  
0.2432374275  
0.5031100661  
0.788765866  
1.078828664  
1.350908484  
1.584322506  
1.762529903  
1.874958773  
1.917961889  
1.894816504  
1.814803975  
1.691540492  
1.540823277  
1.37834563  
1.217582183  
1.068165716  
0.9349550164  
0.8178893313  
0.7126363937  
0.6118977478  
0.5071466468  
0.3905396519  
0.2566832944  
0.103984334  
-0.06463103505  
-0.2417719689  
-0.4164016003  
-0.5753298157  
-0.7051493591  
-0.7943146587  
-0.835040716  
-0.8246850118  
-0.7663755661  
-0.668742877  
-0.5447703259  
-0.4099227698  
-0.2798495493  
-0.1680402518  
-0.08383000512  
-0.03111688935  
-0.008021173821  
-0.007572058543  
-0.01931525235  
-0.03157015786  
-0.03393031499  
-0.01956961836  
0.01310732146  
0.0597639739  
0.1105628987  
0.1516690804  
0.1675880616  
0.1439213264  
0.07006153244  
-0.05867903258  
-0.2398830169  
-0.46402359  
-0.7156339253  
-0.9754782847  
-1.223315345  
-1.440807501  
-1.614065269  
-1.735411978  
-1.804101228  
-1.825886574  
-1.811565061  
-1.7747719  
-1.729414986  
-1.687201674  
-1.655665331  
-1.636999368  
-1.627886517  
-1.620299262  
-1.603136753  
-1.564389326  
-1.493459919  
-1.383271345  
-1.231801519  
-1.042812884  
-0.8256720499  
-0.5942890924  
-0.3653651821  
-0.1562075971  
0.01754224863  
0.1439404965  
0.2162424443  
0.2336802012  
0.2014122116  
0.1297089607  
0.0324838867  
-0.07456927971  
-0.1759805243  
-0.2583483042  
-0.311781349  
-0.3307581203  
-0.3142999825  
-0.2654893618  
-0.1904326176  
-0.09685350752  
0.007418210362  
0.1158415317  
0.2241869084  
0.331037451  
0.4376921635  
0.5475014121  
0.6647443332  
0.7932801028  
0.9351903787  
1.089686722  
1.252490572  
1.415821452  
1.569033232  
1.699829276  
1.79588854  
1.846643508  
1.844952616  
1.788366859  
1.679790432  
1.527398953  
1.343796494  
1.144520706  
0.9460965461  
0.763939755  
0.6104066255  
0.4932973802  
0.4150365434  
0.37264824  
0.3585310218  
0.3618942328  
0.3706269481  
0.3732951354  
0.3609525631  
0.3284789497  
0.2752388705  
0.2049727438  
0.1249542233  
0.04456196437  
-0.02647360686  
-0.07986530361  
-0.110298498  
-0.1164427513  
-0.1012767233  
-0.0716878118  
-0.03739162493  
-0.009359621101  
0.001992307453  
-0.01142426995  
-0.05394373688  
-0.1252712868  
-0.2203243037  
-0.3298047188  
-0.4414459713  
-0.5417187357  
-0.6177723889  
-0.6593071157  
-0.6601014087  
-0.6189683347  
-0.5400153061  
-0.4321449701  
-0.3079052573  
-0.1818496659  
-0.06864745601  
0.01876173338  
0.07072553291  
0.08192923481  
0.05180880625  
-0.01567821413  
-0.1128660125  
-0.2295952622  
-0.3546236015  
-0.4770008081  
-0.5871987174  
-0.677849908  
-0.7440498395  
-0.7832291975  
-0.7947226086  
-0.7791883743  
-0.7380536544  
-0.673126551  
-0.5864867236  
-0.4806413171  
-0.358903111  
-0.2258352761  
-0.08759939814  
0.04796385854  
0.171633679  
0.2735505837  
0.3443237081  
0.376372403  
0.365266177  
0.3108352532  
0.2177816756  
0.09564217378  
-0.04197202804  
-0.1788310435  
-0.2980404822  
-0.3842404283  
-0.4257243921  
-0.4161471676  
-0.3555435531  
-0.2504801262  
-0.1132939265  
0.03948565015  
0.1893128235  
0.3180848717  
0.4105231792  
0.4561396052  
0.4505011762  
0.3956446413  
0.299588202  
0.175034342  
0.03749240526  
-0.09691943566  
-0.2136561552  
-0.3016152773  
-0.3544476632  
-0.3711426936  
-0.355860275  
-0.3170491622  
-0.2660143794  
-0.2151566093  
-0.1761332042  
-0.1581932027  
-0.1668890787  
-0.2033397401  
-0.2640904161  
-0.3415864172  
-0.4251794296  
-0.5025077538  
-0.5611055507  
-0.5900058834  
-0.5811754774  
-0.5306126517  
-0.4389555832  
-0.3115849541  
-0.1581610508  
0.008321417671  
0.172869821  
0.3200619756  
0.4356836056  
0.5082296498  
0.5301195897  
0.4984654474  
0.4153367276  
0.2874935337  
0.1256235707  
-0.05677631373  
-0.2447586187  
-0.4233387286  
-0.5788065332  
-0.6998126366  
-0.7781267462  
-0.8090375431  
-0.7914120661  
-0.7274290912  
-0.622099443  
-0.4826176853  
-0.3176497041  
-0.1366143912  
0.0509806103  
0.2361019866  
0.410631658  
0.5676594342  
0.7016392467  
0.8083948222  
0.8850267127  
0.9297307252  
0.9415968282  
0.9204374162  
0.866705883  
0.7815313814  
0.6669170118  
0.5260470179  
0.3636842524  
0.1865328053  
0.00348169854  
-0.174426365  
-0.3343789289  
-0.462606939  
-0.5456220825  
-0.5717984955  
-0.5331249907  
-0.4268937811  
-0.2570550376  
-0.0349491523  
0.2208107759  
0.4854295348  
0.7299969845  
0.9243894501  
1.040685435  
1.056709567  
0.9592100572  
0.7462411319  
0.4283327153  
0.02824800425  
-0.4207550249  
-0.8779826896  
-1.299377145  
-1.642121913  
-1.869253282  
-1.953725414  
-1.881487763  
-1.653207461  
-1.284470586  
-0.8044528691  
-0.253204866  
0.3221447827  
0.8718779837  
1.348408087  
1.710776535  
1.928474933  
1.984241307  
1.875556713  
1.614714445  
1.227465768  
0.7503759681  
0.2271634035  
-0.2956031534  
-0.773018115  
-1.166093847  
-1.445322784  
-1.593182074  
-1.605318497  
-1.490327088  
-1.26817127  
-0.9674482482  
-0.6218742849  
-0.2663930321  
0.0666051933  
0.3505192071  
0.5668807318  
0.7065687341  
0.7698378017  
0.765226961  
0.7075866045  
0.6155186778  
0.5086076664  
0.4048027301  
0.318255978  
0.2578780679  
0.2267013855  
0.2221091871  
0.2368140633  
0.2604106431  
0.2812711253  
0.2884876948  
0.2736181525  
0.2319792139  
0.1633582705  
0.07205102067  
-0.03374116083  
-0.1430435608  
-0.2435948726  
-0.323475467  
-0.3726590813  
-0.3842830574  
-0.3554967079  
-0.2878086133  
-0.1869134067  
-0.06205587234  
0.07495759939  
0.2109780654  
0.3328017063  
0.4283999973  
0.4879875363  
0.5048220464  
0.4757352382  
0.4013393743  
0.2859469427  
0.1372232489  
-0.03440788061  
-0.2165553978  
-0.3958072092  
-0.5587938614  
-0.6932953188  
-0.7893174272  
-0.8400479598  
-0.8425982572  
-0.7984211419  
-0.7133377991  
-0.5971301378  
-0.4627047239  
-0.324887067  
-0.198964681  
-0.09913804564  
-0.03705049103  
-0.02058499352  
-0.05306781207  
-0.1329729939  
-0.2541792957  
-0.406713135  
-0.5779059639  
-0.7537946302  
-0.9206012223  
-1.066094871  
-1.180691471  
-1.258164137  
-1.29590149  
-1.294725985  
-1.258325901  
-1.192410637  
-1.103742814  
-0.9991777534  
-0.8848592986  
-0.7656602197  
-0.6449178884  
-0.5244638303  
-0.4048870273  
-0.2859401623  
-0.1669965298  
-0.04744664538  
0.07302966704  
0.1943498537  
0.3160784996  
0.437579978  
0.5582311518  
0.6776040941  
0.7955650081  
0.9122513346  
1.027922625  
1.142713053  
1.256335335  
1.36779903  
1.475223126  
1.575757618  
1.665683575  
1.740640387  
1.795978192  
1.827178837  
1.830279797  
1.802254575  
1.741297726  
1.646995292  
1.520369797  
1.363802915  
1.180871274  
0.9761068198  
0.7547062341  
0.5222334665  
0.2843164735  
0.04636978388  
-0.1866339591  
-0.4103375022  
-0.621086309  
-0.8159392559  
-0.9925890854  
-1.149218669  
-1.284311909  
-1.396467635  
-1.484254446  
-1.546154407  
-1.580623834  
-1.586279795  
-1.562199152  
-1.508283403  
-1.425613236  
-1.316732209  
-1.185768736  
-1.038354585  
-0.8813215589  
-0.72218928  
