0.1226063512  
0.6849973403  
2.413026614  
7.592167813  
25.94902323  
1979.577534  
1459.147695  
3165.385208  
20027.03137  
102773.4272  
114098.2494  
21546.62125  
6308.452667  
2148.517971  
49679.31963  
8040.036284  
8481.436501  
6679.812388  
4445.911468  
21245.45157  
15040.19466  
3109.28837  
18381.52431  
12018.22805  
3376.477439  
3859.520944  
4446.235403  
3675.467062  
13830.60638  
1132.883547  
1439.55061  
2506.089794  
1290.615416  
1920.982985  
40.11417041  
73.87645793  
3470.603634  
1074.48512  
2944.346191  
420.8731809  
5388.420133  
510.8920562  
907.9288014  
2971.850815  
1317.872555  
2571.128071  
1167.7971  
163.3903168  
572.1955711  
1335.746585  
1022.092046  
106.9402067  
260.9098447  
544.0705118  
26.38839399  
981.7600554  
99.28000857  
156.2236398  
278.38214  
318.7306155  
81.96253153  
145.9872626  
11.26404833  
217.1500974  
37.57349876  
43.64190976  
43.36313187  
44.57520597  
10.48357906  
11.79438173  
0.5298229786  
8.895107625  
4.237410948  
6.39636099  
1.605952903  
0.5256087407  
1.789896633  
0.07053578122  
0.8420147511  
0.2924197907  
0.8648157758  
0.468658056  
0.2682690135  
0.5700089131  
0.1858393186  
0.3717860156  
0.3635361071  
0.3453095137  
0.3413213847  
0.3386024498  
0.33404873  
0.2952529171  
0.35464133  
0.3114334663  
0.3142610422  
0.3351387121  
0.3024493776  
0.3176118879  
0.2929918805  
0.2900370465  
0.2850023155  
0.2821210276  
0.2848616688  
0.2705005766  
0.2736332361  
0.267395878  
0.2630997918  
0.260470256  
0.2529574759  
0.2513397962  
0.2462329083  
0.2434932577  
0.2398712007  
0.2347872426  
0.2320105163  
0.2280921858  
0.2252016663  
0.2217295131  
0.2177191411  
0.2152300524  
0.2117442703  
0.2087766904  
0.2057383321  
0.2028018331  
0.1999243904  
0.1968518988  
0.1942311536  
0.1913840268  
0.1887895686  
0.1862132959  
0.183578838  
0.1811103195  
0.1785949625  
0.1762344373  
0.1738250715  
0.1715015111  
0.1692288091  
0.1669713135  
0.1648399642  
0.1627038125  
0.1606086647  
0.1585601017  
0.1565413514  
0.1545963676  
0.152645055  
0.1507495644  
0.1488942574  
0.1470686067  
0.1452892707  
0.1435351406  
0.1418212139  
0.1401299565  
0.1384734767  
0.1368523574  
0.1352563468  
0.1336883003  
0.1321567307  
0.1306494969  
0.1291730221  
0.1277238992  
0.1262960548  
0.1248977031  
0.1235266965  
0.1221670999  
0.1208461226  
0.1195462114  
0.1182666718  
0.1170090282  
0.1157703539  
0.1145543353  
0.1133641797  
0.1121923008  
0.1110378459  
0.1099083445  
0.1087955341  
0.1076995459  
0.106623937  
0.1055657816  
0.1045272719  
0.1034998244  
0.1024926598  
0.1015079359  
0.1005321591  
0.09957469637  
0.0986266119  
0.09770044307  
0.09678964928  
0.09589436303  
0.09500373806  
0.09413556356  
0.09328320844  
0.09244022586  
0.0916105428  
0.09079080278  
0.08998535273  
0.08919263826  
0.08841760904  
0.08764763973  
0.08688946347  
0.08614235233  
0.08540931899  
0.08468573164  
0.08397456967  
0.0832738104  
0.08258051883  
0.08190123489  
0.08123129466  
0.08056979198  
0.07991679165  
0.07927783461  
0.07864170577  
0.078017218  
0.07740414919  
0.07679891382  
0.07619865978  
0.07561057814  
0.07502587153  
0.07445789181  
0.0738896202  
0.07333588897  
0.07278551883  
0.07224352421  
0.07170624817  
0.0711823665  
0.07066178857  
0.07014718274  
0.06964052931  
0.06914278904  
0.06865091279  
0.06816616107  
0.06768731268  
0.06721233244  
0.06674728046  
0.06628942853  
0.06583213919  
0.06538312109  
0.06494412569  
0.06450581359  
0.06407685862  
0.06364754834  
0.06323020643  
0.06281280082  
0.06240634342  
0.06200000867  
0.06160309798  
0.06120700642  
0.06082308996  
0.06043671417  
0.06005632292  
0.0596805098  
0.05930924464  
0.05894704108  
0.05858120549  
0.05822857384  
0.0578763946  
0.05752867701  
0.05718953795  
0.05684680945  
0.05651574698  
0.05618577745  
0.05585577536  
0.0555326953  
0.055216759  
0.05489632629  
0.05459021908  
0.05427869892  
0.0539791755  
0.05367580258  
0.05337781839  
0.05308732106  
0.05279722314  
0.05250739521  
0.0522281752  
0.05194509122  
0.05167244268  
0.05139483302  
0.0511290019  
0.05085759954  
0.05059745116  
0.05033649552  
0.05008175982  
0.04982669758  
0.04956844527  
0.04932482273  
0.04907626273  
0.04883600072  
0.04859615722  
0.04835619297  
0.04811954374  
0.04789100857  
0.04766304372  
0.04743753916  
0.04721058489  
0.04698894299  
0.04676751425  
0.04655178615  
0.04633741828  
0.04612246278  
0.04591086182  
0.04570944666  
0.045499788  
0.04529821881  
0.04509842149  
0.04490145682  
0.04470727277  
0.04450875519  
0.04431723402  
0.04412956956  
0.04394238759  
0.04375697125  
0.04357313263  
0.04339283764  
0.04321332922  
0.04303654728  
0.04285832228  
0.04268519291  
0.04251618539  
0.04234625578  
0.04217785502  
0.04201022709  
0.04184838659  
0.04168522873  
0.04152572678  
0.04136570124  
0.04120833038  
0.04105403795  
0.04090081712  
0.04075068161  
0.04059822164  
0.04045073911  
0.04030395654  
0.04015653509  
0.04001197209  
0.03986883255  
0.03973001479  
0.03959148787  
0.03945319865  
0.03931508336  
0.03918408611  
0.03905113852  
0.03891844773  
0.03878610626  
0.03865838277  
0.03853295256  
0.03840613672  
0.03828002194  
0.03815279515  
0.03803671959  
0.03791557379  
0.03779928573  
0.03767614833  
0.03756190462  
0.03744734661  
0.0373310747  
0.03721894725  
0.03710862111  
0.03700175526  
0.03688899961  
0.03678405511  
0.03667381719  
0.03656607934  
0.0364663105  
0.03636277956  
0.03626103751  
0.03615932998  
0.03606231092  
0.03596099833  
0.03586955245  
0.0357669691  
0.03567140723  
0.03557849004  
0.03548644709  
0.03539682792  
0.03530691467  
0.0352159912  
0.03512907287  
0.03503684175  
0.03495300075  
0.03486558774  
0.03478416854  
0.03469833684  
0.03461614334  
0.03453704304  
0.03445559051  
0.03437496527  
0.03429598247  
0.03421917234  
0.03414398001  
0.03406722307  
0.03399550702  
0.03392033247  
0.0338474908  
0.03377181383  
0.03370501863  
0.03363213753  
0.03356340685  
0.03349412659  
0.03342641288  
0.03336327901  
0.03329689859  
0.0332322397  
0.03316652569  
0.03310715557  
0.03304013609  
0.03298159  
0.03292178678  
0.03285819169  
0.03280000917  
0.03274274109  
0.0326839111  
0.03262701789  
0.03257326031  
0.03252042601  
0.0324632974  
0.03240745528  
0.03235863247  
0.03230537423  
0.03225495662  
0.03220260794  
0.03215838193  
0.03210795583  
0.03205982054  
0.03201356776  
0.03196532883  
0.0319184963  
0.03187444782  
0.03183423301  
0.03178805194  
0.03174488892  
0.03170350405  
0.03166094687  
0.03161810445  
0.03157871058  
0.03154135155  
0.03150507158  
0.03146500071  
0.03142833889  
0.03139556659  
0.03135854691  
0.03132136195  
0.03128916428  
0.03125824774  
0.03122052832  
0.03118884365  
0.03115569305  
0.03112687621  
0.03109727858  
0.03106798246  
0.0310392276  
0.03101117376  
0.03098234997  
0.03095671842  
0.03093062276  
0.03090478367  
0.03087989648  
0.03085815773  
0.03083026696  
0.03080958156  
0.03078892647  
0.03076532694  
0.03074621633  
0.03072485605  
0.03070436372  
0.03068482466  
0.030666834  
0.03064997342  
0.03063134466  
0.03061808172  
0.03059965549  
0.03058345361  
0.03057146227  
0.03055597928  
0.03054463804  
0.03052877173  
0.03052137315  
0.03050757169  
0.03049780502  
0.0304874633  
0.03047647675  
0.03046697866  
0.03046059055  
0.03045298336  
0.03044603123  
0.03043881929  
0.03043291432  
0.03042709728  
0.03042391852  
0.03041912819  
0.03041639311  
0.03041367404  
0.03040779928  
0.03040807033  
0.03040781846  
0.03040748359  
