341.7648391  
337.876571  
340.1858409  
377.1492683  
526.284042  
576.8446756  
9187.761036  
30111.57156  
50506.84291  
5099.336784  
52850.12734  
40852.96724  
4601.751767  
15409.56327  
11393.59128  
1854.533435  
13413.09694  
26609.73627  
1240.445421  
18027.22694  
18945.17176  
11701.90021  
22759.31968  
3368.216854  
1708.668318  
3461.556808  
1394.921303  
1894.32669  
2849.316692  
9582.858935  
5770.812956  
14324.29453  
285.4957015  
2805.356908  
1151.132895  
9597.909158  
1388.99142  
1983.320375  
5582.130581  
2273.466078  
4571.196891  
3362.663933  
3401.043149  
4834.963169  
3676.593407  
2227.957884  
1480.079171  
2808.802634  
13375.04578  
7241.281538  
1292.907642  
2478.297827  
512.0174908  
288.8725342  
256.4679631  
1936.24765  
7360.794094  
765.8763014  
8236.838105  
894.6735971  
4044.161681  
1459.618292  
1015.09673  
490.4255865  
617.3928622  
352.1633802  
403.3764364  
220.0623633  
240.3462247  
190.11115  
10.32135343  
22.46211906  
81.65823089  
84.05478072  
120.4422799  
33.18720951  
45.07354022  
43.07357052  
30.48422898  
31.18424851  
19.16027733  
28.02879414  
24.61573466  
19.04857108  
19.49224751  
18.70349403  
18.50311513  
14.81097008  
14.63851147  
13.2557799  
13.13595879  
12.71506889  
11.64305189  
11.5217235  
10.5900859  
10.19952235  
9.597901445  
9.197332183  
8.726967157  
8.221145727  
7.976429825  
7.5457135  
7.201072829  
6.873506077  
6.620268714  
6.334965136  
6.050449401  
5.782550653  
5.526577526  
5.310837975  
5.102003596  
4.909486691  
4.70730068  
4.520784412  
4.335668195  
4.178552024  
4.022264299  
3.878310909  
3.728827285  
3.601252936  
3.468514144  
3.346209846  
3.231740494  
3.120652828  
3.015237273  
2.913130515  
2.816093428  
2.721629669  
2.634301377  
2.549231937  
2.468635879  
2.390842457  
2.316619231  
2.245090161  
2.176450314  
2.110629299  
2.04768828  
1.986975412  
1.92848071  
1.872338236  
1.818446064  
1.766734574  
1.716966278  
1.668818637  
1.622750503  
1.578224679  
1.535372406  
1.493923961  
1.454189472  
1.415650605  
1.378612802  
1.342855446  
1.308277101  
1.274900461  
1.24268071  
1.211562672  
1.181500838  
1.152400841  
1.124295068  
1.097058464  
1.070749947  
1.045257394  
1.020624809  
0.9967403961  
0.9736238508  
0.9512305461  
0.9295489915  
0.9085039462  
0.8880795306  
0.8683339272  
0.8491801217  
0.8305582411  
0.8125207535  
0.7950042252  
0.7779897666  
0.7615022565  
0.7454727853  
0.7299203648  
0.7147797596  
0.7000656251  
0.6857901849  
0.6719314558  
0.6584267263  
0.6452849324  
0.6325397661  
0.6201141175  
0.6080307016  
0.5962787823  
0.5848461137  
0.5736805019  
0.5628530091  
0.5522930653  
0.5420136402  
0.5319745511  
0.5222080478  
0.5127079729  
0.5034491102  
0.4944226848  
0.4855904895  
0.4769896124  
0.4686289876  
0.4604387245  
0.4524996638  
0.4446961255  
0.4371023771  
0.4297032049  
0.422492561  
0.4154310691  
0.4085374563  
0.4017884943  
0.3952397874  
0.3888103551  
0.3825409545  
0.3764432062  
0.3704492173  
0.3645997224  
0.3588876616  
0.3533158631  
0.3478344232  
0.3425019919  
0.3372875382  
0.3321580499  
0.3271815822  
0.3222972866  
0.3175182263  
0.3128403168  
0.3082696466  
0.3037930994  
0.2994240543  
0.2951310159  
0.2909204468  
0.2868063513  
0.2828131364  
0.2788450782  
0.2749721634  
0.2712195088  
0.2674991791  
0.263870478  
0.2603278173  
0.2568190109  
0.2534160128  
0.2500556194  
0.2467759412  
0.2435781036  
0.2404354253  
0.237335814  
0.2343162717  
0.2313396381  
0.2284380836  
0.2255714522  
0.2227704776  
0.2200094849  
0.2173263171  
0.2146794104  
0.2120681595  
0.2095363597  
0.2070399417  
0.2045782078  
0.2021768792  
0.1998065338  
0.1974876518  
0.1952106219  
0.1929790508  
0.1907873591  
0.1886257637  
0.1865129485  
0.1844265584  
0.1823800596  
0.1803733059  
0.1784016101  
0.1764680836  
0.1745699758  
0.1726987078  
0.1708578218  
0.1690549798  
0.1672722463  
0.1655382443  
0.1638251674  
0.1621379535  
0.1604829941  
0.1588435285  
0.1572513847  
0.1556900279  
0.1541365394  
0.1526177991  
0.1511156599  
0.1496403392  
0.1482032294  
0.1467740776  
0.1453768137  
0.1439995088  
0.1426565053  
0.14130837  
0.1400049419  
0.1387161638  
0.1374514484  
0.1361993789  
0.1349736894  
0.133745846  
0.1325862564  
0.1313840311  
0.1302454571  
0.1291025084  
0.1279877863  
0.1268903682  
0.1258107817  
0.1247518419  
0.1237082695  
0.1226652889  
0.121643983  
0.1206511137  
0.1196618127  
0.1186961479  
0.1177384392  
0.1167941107  
0.1158613267  
0.1149506253  
0.1140497413  
0.1131667666  
0.1122956034  
0.1114267399  
0.1105909864  
0.1097546458  
0.10893209  
0.1081359681  
0.1073235899  
0.1065363914  
0.1057746276  
0.1050037236  
0.1042580814  
0.1035110177  
0.1027849237  
0.1020766245  
0.1013580496  
0.100665617  
0.09997130009  
0.09929064444  
0.09863073301  
0.0979649161  
0.09730670243  
0.09668373623  
0.09605389606  
0.09542211735  
0.09480924854  
0.09421333555  
0.09361647737  
0.09303543665  
0.09245496199  
0.09188419148  
0.09132209306  
0.09076683089  
0.09022285215  
0.08968312433  
0.08915065019  
0.08862655223  
0.08811529208  
0.08761043031  
0.0870954662  
0.08660812932  
0.08611904716  
0.08564132616  
0.08516729617  
0.08469408474  
0.08424610184  
0.08378205851  
0.08334233748  
0.08290854601  
0.08247038388  
0.08203922371  
0.08162148508  
0.08120528057  
0.08078571244  
0.08038320111  
0.07998203562  
0.07958868956  
0.07920440414  
0.07882157055  
0.07844606969  
0.07808015855  
0.07771306061  
0.07734687018  
0.07699826181  
0.07664516221  
0.07629795075  
0.07595647672  
0.07562494261  
0.07530045472  
0.07496771568  
0.07464588532  
0.07433254628  
0.07402246242  
0.07370672274  
0.07341254873  
0.07311153819  
0.0728163518  
0.07252837805  
0.07224042189  
0.07196154164  
0.07168703808  
0.07141096083  
0.07115362481  
0.070886835  
0.07062720965  
0.07037151941  
0.07011816495  
0.06986650605  
0.0696180247  
0.06938980555  
0.06914317672  
0.06891590114  
0.06867172222  
0.06845292808  
0.06824124134  
0.06801454779  
0.06779697848  
0.06758834549  
0.06738427246  
0.06717947896  
0.06697533654  
0.06676984564  
0.06657651814  
0.06638842648  
0.06620516259  
0.06602441616  
0.06583781344  
0.06565631428  
0.06547843525  
0.06531512565  
0.06513967212  
0.06497272461  
0.06481877676  
0.06465650887  
0.06449682593  
0.06434418833  
0.06418918897  
0.06404766932  
0.06390087267  
0.06375988275  
0.06362162093  
0.06348988313  
0.0633545229  
0.06321886755  
0.06309754646  
0.06296925335  
0.06284388158  
0.06273034829  
0.0626160288  
0.06249581911  
0.06238892716  
0.06228196974  
0.06216932445  
0.0620683117  
0.06197017401  
0.06186302955  
0.0617747643  
0.06168502535  
0.06159857835  
0.06150595437  
0.06142217387  
0.06133522167  
0.06125139604  
0.06117994707  
0.06110623018  
0.06102966217  
0.06096655656  
0.06089276569  
0.06082994577  
0.06076752344  
0.06070742899  
0.06064711723  
0.06059002813  
0.06054279748  
0.06048493446  
0.06044293501  
0.06039394542  
0.06034743058  
0.06031345716  
0.06026654146  
0.06024313746  
0.06019417254  
0.0601684863  
0.06013637149  
0.06011065693  
0.06008758107  
0.06006328063  
0.06004965348  
0.06002369356  
0.06001401673  
0.06000431354  
0.05999186099  
0.05998451389  
0.05996955444  
0.0599720621  
0.05997733562  
