136.0016524  
137.7162021  
150.36485  
182.2037456  
143.8974035  
1272.933855  
7024.601262  
9999.150189  
56717.97664  
52099.56605  
19828.64842  
19482.61089  
39196.96725  
25224.89396  
57765.29761  
18837.32874  
1353.865829  
8693.173478  
636.3045322  
8305.604267  
3351.35483  
15043.438  
12767.9732  
1701.121535  
901.0552039  
12484.45052  
3717.374751  
10716.48675  
18835.11806  
27.02298661  
15690.37302  
595.7638054  
4968.526887  
2139.376239  
7374.535334  
2161.808723  
3660.376414  
7225.525096  
2647.031551  
298.2301531  
852.794609  
449.6564535  
4751.426678  
5013.768541  
1709.360608  
3468.195749  
489.4708006  
776.2035065  
290.0396242  
1161.474329  
3.914285585  
653.4194409  
995.2095642  
2492.825437  
385.6068512  
3194.060545  
3776.875791  
1623.83849  
359.8772583  
104.2847331  
423.7288552  
293.3699853  
3.318585682  
94.23350529  
37.77739349  
125.0694675  
23.43275595  
42.43513489  
11.63772108  
101.8291902  
16.68543658  
14.25043694  
3.423739064  
0.8291177442  
6.893310621  
8.75199892  
5.135025717  
4.577028483  
8.919612625  
5.699289173  
3.358602259  
4.591262032  
3.789287171  
4.493337124  
3.681948089  
3.919234502  
3.630727133  
3.708351605  
3.552057532  
2.977020281  
3.310507209  
3.178224341  
3.030403513  
2.905569905  
3.015831508  
2.883997368  
2.817849836  
2.764398558  
2.704755172  
2.625395671  
2.523605745  
2.493979449  
2.436615734  
2.41130437  
2.339002308  
2.304989743  
2.260770042  
2.222101131  
2.172914093  
2.124742936  
2.09358273  
2.046685205  
2.017804246  
1.975624191  
1.942577563  
1.906909554  
1.876606982  
1.842829712  
1.815194024  
1.782950222  
1.753236099  
1.723185688  
1.695617837  
1.668741632  
1.6429903  
1.616634437  
1.591325698  
1.566815161  
1.543471277  
1.519913132  
1.497357975  
1.475050029  
1.453278327  
1.432361839  
1.411777166  
1.391543011  
1.372064191  
1.352834467  
1.333986107  
1.315731309  
1.297691708  
1.280211495  
1.263116992  
1.246316589  
1.229931921  
1.21388292  
1.198208836  
1.182822051  
1.167834552  
1.153044982  
1.138644572  
1.124489069  
1.110632873  
1.097121231  
1.083817793  
1.070813852  
1.058032902  
1.045537427  
1.033257925  
1.021227418  
1.00941478  
0.9978934496  
0.9865294549  
0.9754002125  
0.9644889042  
0.9537693951  
0.9432423671  
0.9329302033  
0.9227785724  
0.9128376776  
0.9030804531  
0.8934554105  
0.8840408202  
0.8747939702  
0.8657066171  
0.8567588354  
0.8480089719  
0.8393722388  
0.8308954673  
0.8225706595  
0.8144096077  
0.8063488911  
0.7984413627  
0.7906570963  
0.78300973  
0.7754793822  
0.7680806416  
0.76081543  
0.7536624295  
0.7466316578  
0.7397190869  
0.7328778343  
0.7261967008  
0.7195733654  
0.7131022299  
0.7067112261  
0.7004380898  
0.6942474284  
0.6881322632  
0.6821254426  
0.6762339961  
0.6704142883  
0.6646936091  
0.6590751042  
0.6534850779  
0.6480344832  
0.6426401096  
0.6373106084  
0.6321050052  
0.6269469427  
0.6218763051  
0.6168466726  
0.6119251879  
0.607052739  
0.6022903394  
0.5975560482  
0.5929047111  
0.5883087376  
0.5838117698  
0.5793412338  
0.5749560933  
0.5706273263  
0.5663413183  
0.5621376824  
0.5579784013  
0.5538654815  
0.5498393741  
0.5458328887  
0.5419303214  
0.538049635  
0.534215206  
0.5304530343  
0.5267260259  
0.5230506873  
0.5194447827  
0.515864246  
0.5123252093  
0.5088408728  
0.505418112  
0.5020368771  
0.4986701201  
0.4953723439  
0.492127882  
0.4888912039  
0.4857252102  
0.4825855226  
0.4794931546  
0.476437691  
0.4734254254  
0.4704464996  
0.4675017061  
0.4645967625  
0.4617156517  
0.4588893472  
0.4561005632  
0.4533544774  
0.4505919858  
0.4479176282  
0.4452648718  
0.4426281061  
0.4400347283  
0.4374559432  
0.4349233596  
0.4324337496  
0.4299536406  
0.4275071272  
0.4251139246  
0.422724565  
0.420362289  
0.4180348498  
0.4157574425  
0.4134848181  
0.4112253219  
0.4090111455  
0.4068179972  
0.4046468744  
0.4025168409  
0.4004028143  
0.3983108474  
0.3962406029  
0.394202478  
0.3921843896  
0.3901807129  
0.3882238749  
0.3862735177  
0.3843634865  
0.3824508521  
0.380556514  
0.3787029914  
0.3768669013  
0.3750387487  
0.3732481376  
0.3714687181  
0.3697065011  
0.3679641949  
0.3662654235  
0.364555602  
0.3628807127  
0.3612206223  
0.3595807161  
0.3579454994  
0.3563544636  
0.3547690186  
0.3531947053  
0.3516567382  
0.3501070564  
0.34860712  
0.3470915514  
0.3456223134  
0.3441637075  
0.342694674  
0.3412693137  
0.3398383419  
0.3384336029  
0.337046861  
0.3356807558  
0.3343289164  
0.3329895017  
0.3316599871  
0.3303491534  
0.3290557025  
0.3277672932  
0.3265033721  
0.3252531416  
0.323997166  
0.3227800742  
0.3215580792  
0.3203473946  
0.3191773139  
0.3180029826  
0.3168406763  
0.3156881203  
0.3145463475  
0.3134258938  
0.3123090676  
0.3112146016  
0.3101288833  
0.3090626354  
0.307987777  
0.3069493104  
0.3058898147  
0.3048653607  
0.3038563896  
0.302840674  
0.3018448831  
0.3008659431  
0.2998979308  
0.298931189  
0.2979744478  
0.2970469506  
0.2961169304  
0.2951981567  
0.2942888849  
0.2933749816  
0.2924884467  
0.2916095986  
0.2907481041  
0.2898823473  
0.2890316897  
0.2881919196  
0.2873678216  
0.2865521767  
0.2857332672  
0.2849303812  
0.2841310232  
0.2833385411  
0.2825694252  
0.2817945536  
0.2810437656  
0.2803000241  
0.2795590287  
0.2788214979  
0.2780909626  
0.2773845487  
0.2766764969  
0.2759666538  
0.2752821039  
0.2746073196  
0.2739342276  
0.2732506719  
0.2726092153  
0.2719621352  
0.2712968472  
0.270683941  
0.2700499227  
0.2694365474  
0.2688257018  
0.2682082781  
0.2676153097  
0.2670277023  
0.2664498441  
0.2658705578  
0.2653079076  
0.2647435323  
0.2641885389  
0.2636540448  
0.2631067961  
0.2625763001  
0.2620435855  
0.2615382407  
0.2610307326  
0.2605215073  
0.2600212188  
0.2595342522  
0.259042339  
0.2585675311  
0.2580965717  
0.2576228692  
0.2571729116  
0.2567211236  
0.2562697492  
0.2558402796  
0.2554027788  
0.2549693632  
0.254549509  
0.2541454535  
0.2537345234  
0.2533317089  
0.2529337095  
0.2525484078  
0.2521552987  
0.2517789161  
0.2514141833  
0.2510528521  
0.2506886627  
0.2503403308  
0.249991978  
0.2496426384  
0.2493103896  
0.2489813861  
0.2486543697  
0.2483189283  
0.2480116402  
0.2477005542  
0.2474024221  
0.2471009511  
0.246811407  
0.246524324  
0.2462492682  
0.2459703718  
0.2456974027  
0.2454346253  
0.2451771619  
0.2449285592  
0.2446843537  
0.2444347571  
0.2442053593  
0.2439684935  
0.243736469  
0.2435320098  
0.2433105279  
0.2430907122  
0.2428809427  
0.2426790631  
0.2424881253  
0.2423034553  
0.2421105468  
0.2419349014  
0.241757603  
0.2415839931  
0.2414259659  
0.2412620561  
0.2411102129  
0.2409656451  
0.240826147  
0.2406736623  
0.240535482  
0.2404059833  
0.2402821464  
0.2401664648  
0.2400551377  
0.2399384437  
0.2398380023  
0.2397305708  
0.2396452804  
0.2395468516  
0.2394612431  
0.2393935173  
0.2393235871  
0.2392442193  
0.2391684409  
0.2391134678  
0.2390521651  
0.2390067339  
0.2389642458  
0.2389218366  
0.2388794358  
0.2388558828  
0.2388257646  
0.2387978534  
0.2387816791  
0.2387777181  
0.2387617867  
0.2387723777  
