72.86479752  
107.221275  
185.2288528  
386.5168572  
910.9718633  
15098.48896  
18000.00369  
127986.5931  
1799.473723  
80017.68698  
14812.48643  
1805.039122  
24605.46992  
13951.19306  
20883.57701  
28108.93137  
1465.487001  
16151.72127  
4177.557262  
8408.833885  
2148.127385  
5540.934566  
2031.65555  
1034.450081  
712.3840349  
10557.93852  
690.4040764  
10949.96078  
9679.544531  
2055.44443  
355.7392443  
1142.60077  
1196.838929  
7407.290721  
510.5431029  
653.2115975  
591.2404738  
745.5600526  
2930.554031  
12431.92755  
1954.605273  
1969.746577  
1346.480527  
4908.690443  
351.3843953  
2343.526721  
228.479122  
1430.276356  
167.8549461  
743.1865859  
340.9276189  
1632.506357  
1298.658577  
3639.448521  
598.5537686  
4695.219365  
277.3514539  
2733.429323  
559.7927545  
497.632566  
1554.238845  
642.6330436  
19.10799339  
207.671245  
95.0306379  
244.5673078  
17.07708935  
249.298674  
43.58346732  
14.23818725  
59.45918489  
7.861246102  
17.55642803  
48.00556824  
4.841799132  
1.239836539  
22.07639371  
6.397245907  
4.566849656  
3.585967036  
6.953057301  
1.339485349  
3.440784931  
5.555803712  
3.479664095  
2.683205515  
3.316834129  
3.116038163  
3.272218239  
2.957685079  
3.168192679  
3.071821843  
2.795888768  
2.803389146  
2.799528748  
2.677692818  
2.726179227  
2.560698027  
2.474265896  
2.406863136  
2.507034303  
2.446813544  
2.315160555  
2.297969215  
2.265301939  
2.222551212  
2.184545979  
2.145875603  
2.104610073  
2.071573085  
2.020448801  
2.004536295  
1.958835647  
1.938363582  
1.898348076  
1.866860654  
1.835333412  
1.811152042  
1.783663191  
1.753030089  
1.723898063  
1.701517777  
1.674541738  
1.648016645  
1.625009908  
1.599959738  
1.577374744  
1.55279655  
1.531123419  
1.50888787  
1.487573385  
1.46666111  
1.445711398  
1.425347035  
1.406174879  
1.386892923  
1.368032531  
1.349413021  
1.331565109  
1.313992339  
1.296636756  
1.279780782  
1.263434569  
1.24708315  
1.231285569  
1.215701595  
1.200553813  
1.185668232  
1.171048301  
1.156729986  
1.142684125  
1.128930848  
1.11547389  
1.102219077  
1.089237319  
1.076528336  
1.064041346  
1.051806511  
1.03979064  
1.028019705  
1.016439847  
1.005090579  
0.9939495231  
0.9829980165  
0.9722651724  
0.9617180125  
0.9513474681  
0.9411711551  
0.9311852336  
0.9213645023  
0.9117267574  
0.9022422043  
0.8929418559  
0.8837840058  
0.8747875084  
0.8659514301  
0.857260703  
0.8487283642  
0.8403254006  
0.8320705428  
0.8239466946  
0.8159630963  
0.8080994389  
0.8003790472  
0.7927770358  
0.785307636  
0.7779499887  
0.7707086034  
0.7635924082  
0.7565794036  
0.7496795125  
0.7429022988  
0.7362185107  
0.729631157  
0.7231615904  
0.7167847622  
0.7105076434  
0.7043317541  
0.6982503158  
0.692253577  
0.6863470833  
0.6805378744  
0.6747995461  
0.6691651009  
0.6636002001  
0.6581315458  
0.6527381206  
0.6474071595  
0.6421743966  
0.637011484  
0.6319271113  
0.6269044425  
0.6219672596  
0.6170958936  
0.612286495  
0.6075559405  
0.6028850594  
0.5982782596  
0.5937466539  
0.5892616499  
0.584847214  
0.5804971108  
0.5762148182  
0.571970913  
0.5678018932  
0.5636828858  
0.5596134456  
0.5556014591  
0.5516566942  
0.5477530342  
0.5439046658  
0.540103697  
0.536350395  
0.5326565373  
0.5290096307  
0.5254118567  
0.5218575623  
0.5183485642  
0.5148890739  
0.5114725534  
0.5080972745  
0.5047688199  
0.5014861476  
0.4982368628  
0.4950335985  
0.491869054  
0.4887522691  
0.4856653636  
0.4826265557  
0.4796092666  
0.4766445538  
0.4737093737  
0.4708220949  
0.4679547144  
0.4651338271  
0.4623438454  
0.4595824875  
0.4568611412  
0.4541804915  
0.4515280303  
0.4488995507  
0.4463151824  
0.4437456648  
0.4412141931  
0.4387125659  
0.4362498892  
0.4338038901  
0.4314025337  
0.4290150918  
0.4266593657  
0.4243379915  
0.4220345163  
0.4197650819  
0.4175215486  
0.415306817  
0.4131118926  
0.4109504766  
0.408805657  
0.4066824195  
0.4045939437  
0.4025324707  
0.4004817613  
0.3984658935  
0.396468518  
0.3944967155  
0.3925448318  
0.3906155123  
0.3887091108  
0.3868151979  
0.3849554146  
0.3831151214  
0.3812863604  
0.3794881327  
0.3777072169  
0.3759489252  
0.3742033998  
0.3724822157  
0.3707794155  
0.369095546  
0.3674344092  
0.3657873797  
0.3641604509  
0.3625456012  
0.3609567756  
0.3593834816  
0.3578257197  
0.356284241  
0.3547689979  
0.3532624105  
0.3517668622  
0.3503046177  
0.3488526034  
0.3474055253  
0.3459798314  
0.3445733723  
0.3431813347  
0.3418063378  
0.3404467575  
0.3390932552  
0.3377628407  
0.3364412704  
0.3351380162  
0.3338475534  
0.3325791419  
0.331316848  
0.3300693696  
0.3288328654  
0.327610368  
0.326405098  
0.3252121462  
0.3240333905  
0.3228656288  
0.32171374  
0.3205686645  
0.3194395526  
0.3183253885  
0.3172157999  
0.3161287963  
0.3150388051  
0.3139728681  
0.3129145767  
0.3118741894  
0.3108384257  
0.3098143636  
0.3088014474  
0.3078065247  
0.3068122369  
0.3058336584  
0.3048651389  
0.3039086829  
0.3029614345  
0.3020301888  
0.3011049668  
0.3001859133  
0.2992818974  
0.2983916224  
0.2975038275  
0.2966239032  
0.2957630531  
0.294907198  
0.2940634869  
0.2932310665  
0.2923970798  
0.2915839914  
0.2907676384  
0.2899775307  
0.2891879561  
0.2884060792  
0.287632252  
0.2868696421  
0.2861197051  
0.2853704592  
0.2846384495  
0.2839056572  
0.2831865838  
0.2824758422  
0.281769095  
0.2810832664  
0.2803975974  
0.2797104615  
0.2790474905  
0.2783851443  
0.2777272438  
0.277082205  
0.2764479325  
0.2758134207  
0.2751879095  
0.2745744197  
0.2739680395  
0.2733664854  
0.2727783668  
0.2721912561  
0.2716100344  
0.2710406795  
0.2704809548  
0.2699208455  
0.2693683866  
0.268830492  
0.2683012464  
0.2677678055  
0.2672458458  
0.2667335031  
0.2662316182  
0.2657272367  
0.2652356998  
0.2647482889  
0.2642676952  
0.2637935366  
0.2633282594  
0.2628687675  
0.2624135669  
0.2619675965  
0.2615286772  
0.2610899889  
0.2606580987  
0.2602401566  
0.2598201847  
0.2594195936  
0.2590110248  
0.2586160018  
0.2582250389  
0.2578393951  
0.2574620553  
0.2570846102  
0.2567235031  
0.2563601282  
0.2560063475  
0.2556584976  
0.2553118666  
0.2549750373  
0.2546483624  
0.2543193589  
0.2539994139  
0.2536839622  
0.2533755238  
0.2530784574  
0.2527761384  
0.2524873378  
0.252199638  
0.2519175857  
0.2516412663  
0.2513764658  
0.2511109036  
0.2508485227  
0.2506021271  
0.2503523997  
0.2501101158  
0.2498755106  
0.2496421156  
0.2494195683  
0.2491954664  
0.2489771405  
0.2487727286  
0.2485632476  
0.2483644767  
0.2481680557  
0.2479854283  
0.2477961424  
0.2476205046  
0.2474495253  
0.247282444  
0.2471194375  
0.2469558555  
0.246803922  
0.24665952  
0.2465172909  
0.2463798202  
0.2462512716  
0.246121056  
0.2460016859  
0.2458837029  
0.2457721076  
0.2456600897  
0.2455602338  
0.2454620252  
0.2453730926  
0.2452880978  
0.2452008277  
0.2451269281  
0.2450568826  
0.2449864426  
0.2449258788  
0.244865742  
0.2448169472  
0.2447742829  
0.2447285235  
0.2446907845  
0.244661218  
0.2446315973  
0.2446120668  
0.2445913352  
0.2445819579  
0.2445730226  
0.2445700161  
