-0.04849092773  
0.3629770339  
0.7531203855  
1.10146406  
1.391022024  
1.609599443  
1.750597175  
1.813250425  
1.802297986  
1.727157845  
1.600721444  
1.43792919  
1.254296933  
1.064554627  
0.8815333388  
0.7153842618  
0.573176216  
0.458852595  
0.3735011895  
0.3158528756  
0.2829218346  
0.2706935156  
0.2747863917  
0.2910204524  
0.3158613407  
0.3467059531  
0.3820057201  
0.4212184462  
0.4646028961  
0.5128660983  
0.5666907711  
0.626199841  
0.6904044227  
0.7567320234  
0.8207163098  
0.8759511751  
0.9143663265  
0.9268760196  
0.9043745728  
0.8390026231  
0.7255408528  
0.562737519  
0.3543462536  
0.1096636662  
-0.1566032262  
-0.425230915  
-0.6741100784  
-0.8804814843  
-1.023531365  
-1.087024551  
-1.06161142  
-0.9464779693  
-0.7500515431  
-0.4896262326  
-0.1898827328  
0.1195492172  
0.4072101324  
0.6432457265  
0.8027155545  
0.8683827988  
0.8326211717  
0.6982185709  
0.4779773163  
0.1931863779  
-0.1288417176  
-0.4578394676  
-0.7638877866  
-1.020556248  
-1.207517421  
-1.312368036  
-1.331480025  
-1.269853908  
-1.140046392  
-0.9603614479  
-0.7525609044  
-0.5393908272  
-0.3422035889  
-0.1789403392  
-0.06265479372  
-0.000686650166  
0.005483211512  
-0.04023230838  
-0.1295023985  
-0.250878035  
-0.3912491807  
-0.5372652718  
-0.6765655281  
-0.7987007257  
-0.8956806613  
-0.9621329512  
-0.9951160444  
-0.993675252  
-0.9582520687  
-0.8900942721  
-0.7907752229  
-0.661935684  
-0.5052992287  
-0.3229593015  
-0.1178830462  
0.1054831441  
0.3406508934  
0.5787317403  
0.8084194119  
1.016413553  
1.188301421  
1.309853699  
1.368586963  
1.355404863  
1.266075193  
1.10231191  
0.8722620182  
0.5902801398  
0.2759570406  
-0.04750995573  
-0.3554303452  
-0.6239615027  
-0.8323937689  
-0.9650920313  
-1.012867638  
-0.973629042  
-0.8522649381  
-0.6598253869  
-0.4121389386  
-0.1280848843  
0.1722507922  
0.4693151134  
0.7455472463  
0.9864451879  
1.181199041  
1.322920598  
1.40853009  
1.438408569  
1.415898443  
1.346740046  
1.238487653  
1.099923614  
0.9404711062  
0.7695898428  
0.596152565  
0.4278241419  
0.2704792581  
0.1277384265  
0.0006981885088  
-0.1120622891  
-0.2141489078  
-0.3106877625  
-0.4073788674  
-0.5093822059  
-0.6201981318  
-0.7407211385  
-0.8686603377  
-0.9984521509  
-1.12174072  
-1.228402876  
-1.307989504  
-1.351382719  
-1.35240276  
-1.309085519  
-1.224396588  
-1.106214305  
-0.9665382707  
-0.82000621  
-0.6819209072  
-0.5660840579  
-0.4827744101  
-0.4371948905  
-0.4286526285  
-0.4506095758  
-0.4916211771  
-0.5370228823  
-0.5711225096  
-0.5795664596  
-0.5515292339  
-0.4814010013  
-0.3697280539  
-0.2232712471  
-0.0541816065  
0.1215875382  
0.2864038297  
0.4233164722  
0.5183347411  
0.5623193364  
0.5522377838  
0.4916414844  
0.390303196  
0.2630821585  
0.1281768265  
0.004987430968  
-0.08814009018  
-0.1360130419  
-0.1283000266  
-0.06065525172  
0.06483849788  
0.2399397985  
0.451169346  
0.6812553718  
0.9109399854  
1.120937834  
1.293864287  
1.415926806  
1.478250012  
1.477701723  
1.41715947  
1.305195473  
1.155206189  
0.9840622824  
0.8103948708  
0.6526776305  
0.5272856309  
0.446730592  
0.4182684741  
0.4430398844  
0.5158599225  
0.6257119614  
0.7569008569  
0.8907626248  
1.007728086  
1.089504584  
1.12110614  
1.092484891  
0.9995564122  
0.8445045851  
0.6353412819  
0.3848033426  
0.108756497  
-0.1756626059  
-0.451910928  
-0.7056724155  
-0.9260720758  
-1.106360252  
-1.244039235  
-1.340488171  
-1.400203198  
-1.429790443  
-1.436890388  
-1.429156567  
-1.413397349  
-1.394959706  
-1.377364448  
-1.362196  
-1.349217113  
-1.336662903  
-1.321668955  
-1.300783329  
-1.270505701  
-1.227805899  
-1.170563678  
-1.097881409  
-1.010234228  
-0.909425086  
-0.7983628177  
-0.680684425  
-0.5602827551  
-0.4408193267  
-0.3252997358  
-0.2157874239  
-0.1133028555  
-0.0179112315  
0.07101817729  
0.1544496403  
0.23329491  
0.3080862672  
0.3787756588  
0.4446957329  
0.5046773453  
0.5572843619  
0.601095504  
0.6349564759  
0.6581281889  
0.670294218  
0.6714242416  
0.661525981  
0.6403701654  
0.6072662367  
0.5609878015  
0.4998989622  
0.4223043826  
0.3269777033  
0.213784785  
0.0842748402  
-0.057908155  
-0.2069029213  
-0.3548888711  
-0.4927278638  
-0.6109309721  
-0.7008169972  
-0.7556818985  
-0.7717862855  
-0.7489775078  
-0.6908281776  
-0.6042472491  
-0.4986038712  
-0.3845032368  
-0.2723872693  
-0.171192191  
-0.08725342008  
-0.02362385134  
0.02011928436  
0.04757325477  
0.06479939745  
0.07934850563  
0.09918723109  
0.1317085018  
0.182954763  
0.2571370095  
0.3564680611  
0.4812540754  
0.6301596845  
0.8005214464  
0.9886092575  
1.189761023  
1.398361402  
1.607707624  
1.809834494  
1.995414695  
2.153850711  
2.273644514  
2.343089326  
2.351250898  
2.289153076  
2.151011288  
1.935330352  
1.64568483  
1.291025586  
0.8854201685  
0.4472133514  
-0.002323185862  
-0.4407057481  
-0.8461206024  
-1.199250281  
-1.484836751  
-1.692806795  
-1.818853589  
-1.864446619  
-1.836303387  
-1.745435994  
-1.605910326  
-1.433492302  
-1.244325065  
-1.053770561  
-0.8754959226  
-0.7208423379  
-0.5984607455  
-0.5141737539  
-0.4709985436  
-0.4692638022  
-0.5067764629  
-0.5789980491  
-0.6792461642  
-0.7989358819  
-0.9279127836  
-1.054918731  
-1.168222966  
-1.25642312  
-1.309376697  
-1.319195246  
-1.281179259  
-1.194572061  
-1.062989173  
-0.8944222248  
-0.7007448857  
-0.4967180728  
-0.2985705023  
-0.122280843  
0.01823322401  
0.1128065752  
0.1563562652  
0.1496646234  
0.09948471622  
0.0179114819  
-0.07892619333  
-0.1727145073  
-0.2451221601  
-0.2800301965  
-0.2655421765  
-0.1955132841  
-0.07041647251  
0.1025797032  
0.3103385736  
0.5351977689  
0.756966352  
0.9552273326  
1.11167759  
1.212215063  
1.248521289  
1.218947849  
1.128600759  
0.9886157357  
0.8147238505  
0.6252970785  
0.4391325736  
0.2732713713  
0.1411302664  
0.05119978371  
0.006453965254  
0.004535024488  
0.03864975086  
0.09901609177  
0.174610606  
0.2549387155  
0.3315367686  
0.3989780598  
0.4552333663  
0.5013543533  
0.5405579485  
0.5769166986  
0.613906734  
0.6531158296  
0.6933816732  
0.7305528833  
0.7579543974  
0.7675029139  
0.7512926538  
0.7033561192  
0.6212699003  
0.5072611551  
0.3685617891  
0.2168615373  
0.06688612482  
-0.06572146234  
-0.1668984146  
-0.2266223974  
-0.2409095144  
-0.2129722698  
-0.1532836614  
-0.07847055994  
-0.009144075492  
0.03303876678  
0.02865378171  
-0.03636087922  
-0.1682184055  
-0.3638252448  
-0.6105950586  
-0.8875851787  
-1.167800417  
-1.421344521  
-1.618984503  
-1.735629362  
-1.753276141  
-1.663049606  
-1.466121194  
-1.173447895  
-0.8044440347  
-0.3848189329  
0.05609856128  
0.4881907782  
0.8832145375  
1.217031877  
1.471232898  
1.634073545  
1.70073991  
1.673023256  
1.558523175  
1.369523435  
1.121680057  
0.8326380904  
0.5206862968  
0.2035145121  
-0.1028500434  
-0.3848885062  
-0.6321836676  
-0.8377237096  
-0.9979264575  
-1.112374427  
-1.183314473  
-1.214977233  
-1.212800953  
-1.182663055  
-1.130222667  
-1.060451252  
-0.977417331  
-0.8843331369  
-0.7838336629  
-0.6784053141  
-0.5708616958  
-0.464733117  
-0.3644587049  
-0.2752961271  
-0.2029179987  
-0.1527222701  
-0.1289544019  
-0.133785387  
-0.1665122173  
-0.2230650583  
-0.2959446469  
-0.3746836721  
-0.4468153856  
-0.4992681903  
-0.5200196063  
-0.4997800103  
-0.4334715269  
-0.3212639137  
-0.1689935073  
0.01213239974  
0.2065418883  
0.3959216182  
0.5612586268  
0.6850543622  
0.7534306425  
0.7578595156  
0.696291031  
0.5735373622  
0.4008608404  
0.1948117417  
-0.0245374018  
-0.2357442132  
-0.4182751642  
-0.5546383597  
-0.6321175697  
-0.6439189128  
-0.5896147152  
-0.4748715438  
-0.3105293193  
-0.111192791  
0.1064622685  
0.3254361327  
0.5299938875  
0.7069276328  
0.8463933009  
0.9423037564  
0.9923278707  
0.9975973552  
0.9622503732  
0.8929171331  
0.7982311388  
0.6883803824  
0.5746695635  
0.4690148122  
0.3832940472  
0.3284884383  
0.3136124852  
0.3445048884  
0.4226278014  
0.5440824187  
0.6990740681  
0.8720317788  
1.042516333  
1.186946571  
1.281019786  
1.302588668  
1.234641986  
1.067977075  
0.8031696353  
0.4515001568  
0.03463983666  
-0.4169519111  
-0.8667784173  
-1.275919013  
-1.607080705  
-1.828618359  
-1.918042274  
-1.864605754  
-1.670670724  
-1.351705905  
-0.9349212289  
-0.4566977108  
0.04091047424  
0.5142281084  
0.9221587355  
1.230103243  
1.413228656  
1.458743699  
1.366979357  
1.15114536  
0.8357780589  
0.4540233076  
0.04401685377  
-0.3552702774  
-0.7082729379  
-0.9866943073  
-1.172526107  
-1.259853619  
-1.25519899  
-1.176311158  
-1.049530366  
-0.9060149168  
-0.7773083573  
-0.6908135746  
-0.6657884674  
-0.710417127  
-0.8203944342  
-0.9792472317  
-1.160385736  
-1.330637707  
-1.454794455  
-1.50055223  
-1.443170355  
-1.269196592  
-0.9787467766  
-0.5860124509  
-0.1179334237  
0.3887874221  
0.8919162763  
1.348599268  
1.720304514  
1.977140856  
2.101035064  
2.087374556  
1.944975116  
1.694445188  
1.365224317  
0.9917483099  
0.6092773306  
0.2499455  
-0.06047195196  
-0.3047166406  
-0.4749196112  
-0.5722070357  
-0.6051974611  
-0.5877272776  
-0.5362041837  
-0.4670175993  
-0.3943802238  
-0.3288777952  
-0.2768474526  
-0.2405687695  
-0.2191037613  
-0.2095292289  
-0.2082571681  
-0.21216175  
-0.2192854766  
-0.2290140111  
-0.2417295774  
-0.2580551083  
-0.2779063414  
-0.2995915489  
-0.3192025817  
-0.3304813286  
-0.3252487109  
-0.294385545  
-0.2292362074  
-0.1232224854  
0.0265891306  
0.2182497842  
0.4442410443  
0.6915102377  
0.942282631  
1.175599243  
1.369415518  
1.503013441  
1.55941815  
1.527505635  
1.40350169  
1.19166862  
0.9040630768  
0.5593794896  
0.1810281157  
-0.2053113518  
-0.5743350308  
-0.9036133616  
-1.175615339  
-1.379020078  
-1.509170783  
-1.567667129  
-1.56121188  
-1.499943935  
-1.395536316  
-1.259381519  
-1.10113166  
-0.9277996196  
-0.7435212162  
-0.5499604638  
-0.3472333316  
-0.1351514797  
0.08547347243  
0.3116991288  
0.5377279484  
0.7547046633  
0.9511056952  
1.113660651  
1.228684356  
1.283631088  
1.268650553  
1.177941849  
1.010716666  
0.7716667543  
0.4708716268  
0.1231774609  
-0.2528759844  
-0.6364449989  
-1.005934761  
-1.340563124  
-1.621780002  
-1.834448558  
-1.967703898  
-2.015471245  
-1.976647806  
-1.854980719  
-1.658700518  
-1.399952199  
-1.094074597  
-0.7587546245  
-0.4130763887  
-0.07647070686  
0.232418316  
0.4969251232  
0.7035515406  
0.8430775968  
0.91146695  
0.9104498292  
0.8476412775  
0.7361037425  
0.5933155885  
0.4395701951  
0.2959402597  
0.1820088956  
0.1136387936  
0.1010834625  
0.1477077647  
0.2495381938  
0.3957374078  
0.5699747131  
0.7525268046  
0.9228126956  
1.062015371  
1.155403319  
1.194025022  
1.175539125  
1.104090198  
0.9892906788  
0.8445071026  
0.6847607881  
0.5245909236  
0.376222005  
0.2482974073  
0.1453221975  
0.0678298067  
0.0131538488  
-0.02341174269  
-0.04732004713  
-0.06361090615  
-0.07607387793  
-0.08685167898  
-0.09648824089  
-0.1043423423  
-0.1092071989  
-0.1099722603  
-0.1061475488  
-0.09815411274  
-0.08731799454  
-0.07560028247  
-0.06514198407  
-0.05775049597  
-0.05443933603  
-0.05513712868  
-0.05861452827  
-0.06264862524  
-0.06437124909  
-0.06073524245  
-0.04900132735  
-0.02715297135  
0.005818886454  
0.04979917439  
0.1035953321  
0.1651069881  
0.2315661558  
0.2997824931  
0.3663500604  
0.4277784607  
0.4805546966  
0.5211569611  
0.5460749507  
0.5518769925  
0.5353882493  
0.4939855405  
0.4260125617  
0.3312563346  
0.2114121941  
0.07042465037  
-0.0853928234  
-0.2475535855  
-0.405951635  
-0.5497538386  
-0.6685610018  
-0.7536916951  
-0.7994110221  
-0.8039057212  
-0.769833682  
-0.704318373  
-0.6183347541  
-0.5255328619  
-0.4406297928  
-0.3775637202  
-0.3476716535  
-0.3581360404  
-0.4109290729  
-0.5024109139  
-0.623656472  
-0.7614701431  
-0.8999737273  
-1.022550955  
-1.113908455  
-1.16198362  
-1.159458644  
-1.104703512  
-1.002034591  
-0.8612796943  
-0.6967086905  
-0.5254847778  
-0.3658176323  
-0.235042604  
-0.1478349699  
-0.1147378992  
-0.1411343675  
-0.2267398217  
-0.3656204586  
-0.5466934251  
-0.7546341907  
-0.9710745257  
-1.175984865  
-1.349135603  
-1.471543829  
-1.5268415  
-1.502495117  
-1.390839728  
-1.189864623  
-0.9036959074  
-0.5427138084  
-0.1232419902  
0.3332406999  
0.8013777377  
1.253670638  
1.662578248  
2.002820331  
2.253675127  
2.401013143  
2.43881888  
2.369972081  
2.206130437  
1.966667809  
1.676722245  
1.364545822  
1.058449833  
0.783701385  
0.5597647028  
0.3982420237  
0.3017777255  
0.2640858946  
0.2710918439  
0.3030355522  
0.3372608745  
0.3513099791  
0.3259257839  
0.2475630604  
0.1101193245  
-0.08432273941  
-0.3257759246  
-0.5975691705  
-0.878289068  
-1.144149983  
-1.371460187  
-1.538871909  
-1.629167368  
-1.630414983  
-1.5364614  
-1.346813316  
-1.066060301  
-0.7030333673  
-0.2699180016  
0.2185167054  
0.7454524858  
1.292299029  
1.838788686  
2.363020852  
2.841647594  
3.250375998  
3.564924445  
3.762477126  
3.823571767  
3.734226984  
3.488034259  
3.087864834  
2.546853401  
1.888385558  
1.144939407  
0.3557976147  
-0.4361703758  
-1.188296838  
-1.862007186  
-2.426299363  
-2.86034209  
-3.154854068  
-3.312084155  
-3.344448754  
-3.272050779  
-3.119491531  
-2.912449631  
-2.674530089  
-2.424802677  
-2.176320296  
-1.935746694  
-1.704031355  
-1.477921958  
-1.252005607  
-1.020889975  
-0.7811811836  
-0.5329549871  
-0.2805226688  
-0.03242786736  
0.1993074481  
0.4005217059  
0.5566590224  
0.6546631551  
0.6847930125  
0.6421348401  
0.5276589565  
0.3486816204  
0.1187048803  
-0.1433818286  
-0.4146717207  
-0.6700643978  
-0.884409401  
-1.034753158  
-1.10251605  
-1.075352059  
-0.9485187164  
-0.7255861153  
-0.4183744271  
-0.04610105945  
0.3662196622  
0.7899860531  
1.195618919  
1.555302034  
1.845564933  
2.049417956  
2.15779479  
2.170129451  
2.093996614  
1.943858133  
1.739066563  
1.501383362  
1.252326749  
1.01069349  
0.7905741172  
0.6001088477  
0.441127672  
0.3096907674  
0.1974158739  
0.09337379307  
-0.01374901618  
-0.1335365327  
-0.2720941223  
-0.4308966061  
-0.60638626  
-0.790351812  
-0.9710055661  
-1.134581744  
-1.267207476  
-1.35676421  
-1.394482989  
-1.376042561  
-1.302046293  
-1.177835495  
-1.012698844  
-0.8186328343  
-0.6088561  
-0.396303647  
-0.192334624  
-0.005800072494  
0.1574130881  
0.2943586052  
0.404591135  
0.4894347494  
0.5511274366  
0.5920066245  
0.6138816639  
0.6176932047  
0.6034899031  
0.5707053737  
0.5186477579  
0.4470947039  
0.3568637149  
0.2502398681  
0.1311723357  
0.005200550181  
-0.1208977306  
-0.2396790758  
-0.3437503039  
-0.4265281552  
-0.4829347427  
-0.5099349905  
-0.5068513757  
-0.4754182519  
-0.4195741039  
-0.3450219356  
-0.258620382  
-0.1676789971  
-0.07924062213  
