648.0084001  
683.699628  
767.9594872  
922.637999  
847.6867676  
5124.626244  
4964.328233  
14439.03773  
10209.16853  
4703.044275  
11108.682  
39602.50473  
36223.34622  
665.3512713  
17302.2582  
14151.78457  
6164.433872  
32379.36206  
29231.02782  
18579.05963  
5791.132378  
13410.80878  
16697.22266  
3250.017581  
8175.059856  
11585.63969  
8416.978139  
28268.28632  
11780.52359  
8598.85852  
1125.189631  
7798.890142  
4951.635209  
3762.985851  
1082.444292  
125.9597583  
6949.421584  
671.3198612  
13770.61738  
5629.535895  
9113.12377  
13563.82845  
3904.085153  
1722.380944  
8983.174065  
8689.718816  
192.4727955  
3871.568991  
511.013202  
5341.035343  
400.0892172  
3114.959656  
1628.911428  
475.1264423  
1015.110842  
1354.881528  
4352.710765  
3757.708591  
472.1987747  
602.4998725  
103.9057519  
670.5469174  
452.3562952  
603.452668  
428.9190307  
397.4045235  
106.3432086  
74.6310532  
88.52177483  
141.7897319  
45.12195037  
30.96966074  
12.77514294  
24.70536734  
24.26700825  
24.51573039  
23.46511986  
15.75936321  
17.85980771  
14.69705988  
14.33411369  
11.82687772  
13.3318889  
13.49428131  
13.05522883  
11.74210019  
12.01752988  
10.6402379  
9.784887675  
10.07463374  
9.012765297  
8.584362576  
8.603639694  
8.41766495  
8.098293253  
7.702066906  
7.506814169  
7.162734515  
7.02128698  
6.848793203  
6.569952522  
6.397803764  
6.217669742  
6.020585994  
5.861903635  
5.702325514  
5.546885446  
5.407432586  
5.25335556  
5.119388002  
4.982370138  
4.853889196  
4.734719034  
4.625190051  
4.511857576  
4.40507028  
4.305765803  
4.206861886  
4.112160248  
4.020460778  
3.932172718  
3.847530326  
3.765586705  
3.686847511  
3.609906707  
3.5367196  
3.465151573  
3.395899328  
3.329013971  
3.26419846  
3.201143594  
3.140493466  
3.08177537  
3.02456982  
2.969205166  
2.915439627  
2.863363633  
2.812719001  
2.763567248  
2.715703813  
2.669241315  
2.624210907  
2.580297979  
2.53764256  
2.496125598  
2.455719383  
2.41640295  
2.378122645  
2.340844052  
2.304494555  
2.269122706  
2.234666913  
2.201046515  
2.168235243  
2.136267605  
2.105062304  
2.074624565  
2.044948712  
2.015954336  
1.98766394  
1.959997707  
1.932951291  
1.906599612  
1.880854396  
1.855701048  
1.831019409  
1.806940141  
1.783433927  
1.760396094  
1.737884214  
1.715853198  
1.694269978  
1.673162906  
1.652527173  
1.632304641  
1.612487819  
1.593094909  
1.574083632  
1.555489698  
1.537240865  
1.519394188  
1.501897934  
1.484706623  
1.467908359  
1.451398898  
1.435226371  
1.419343063  
1.403769337  
1.388529648  
1.373560914  
1.358879776  
1.344450897  
1.330288813  
1.316391488  
1.302770621  
1.289395209  
1.276218232  
1.263310745  
1.250625957  
1.238171868  
1.225930915  
1.213925591  
1.20211357  
1.190490459  
1.179089724  
1.167883602  
1.156855921  
1.146014346  
1.135333633  
1.124898479  
1.114574872  
1.104452748  
1.094490521  
1.084694105  
1.075039136  
1.065538897  
1.0562453  
1.047064828  
1.037991238  
1.029105841  
1.020371056  
1.011760649  
1.003263489  
0.9949158721  
0.986691271  
0.9786021431  
0.9706428948  
0.9628211345  
0.9550629779  
0.947473701  
0.9399672002  
0.9325808681  
0.9253306188  
0.9181401818  
0.9110674177  
0.9041335764  
0.8972817371  
0.8905328827  
0.8838607579  
0.8773044651  
0.8708269984  
0.8644747274  
0.8581806619  
0.8519802095  
0.8458587966  
0.8398675586  
0.8339270253  
0.8280758128  
0.822288746  
0.816587344  
0.8109867863  
0.8054608077  
0.7999828815  
0.7946071756  
0.7892900366  
0.7840430816  
0.7788790137  
0.7737846222  
0.7687581786  
0.763799444  
0.7588893215  
0.7540442999  
0.7492605477  
0.7445770993  
0.739935746  
0.7353396367  
0.7308266594  
0.7263619177  
0.7219325915  
0.7175765198  
0.7133030525  
0.7090602782  
0.7048300898  
0.7007231405  
0.6966325549  
0.6926179663  
0.688634007  
0.6847027399  
0.680819472  
0.6770053617  
0.6732107056  
0.6695119269  
0.6657938263  
0.6621466591  
0.6585603703  
0.6549956791  
0.6514885973  
0.6480280747  
0.6445769941  
0.641226199  
0.6378857441  
0.6345603498  
0.6313097174  
0.6280851656  
0.6248916018  
0.6217559399  
0.61863388  
0.6155663396  
0.612539392  
0.6095455064  
0.606568537  
0.6036478159  
0.6007649172  
0.5978949946  
0.5950682316  
0.5922751312  
0.5895186398  
0.5867955281  
0.5841003456  
0.5814532699  
0.5788257934  
0.576218306  
0.573657277  
0.5710998908  
0.5686117639  
0.5661203632  
0.5636653253  
0.5612280868  
0.558827146  
0.5564838327  
0.5541299375  
0.5518135525  
0.5495361549  
0.5472804967  
0.5450387299  
0.5428324891  
0.540658865  
0.5384797855  
0.5363439862  
0.5342377954  
0.5321440829  
0.5301053484  
0.528054345  
0.5260548004  
0.5240552959  
0.5220764742  
0.5201445786  
0.5182171678  
0.5163137238  
0.5144316475  
0.5125716633  
0.5107508732  
0.5089347297  
0.5071221087  
0.5053555612  
0.5035940561  
0.5018643594  
0.500158866  
0.4984595949  
0.4967723018  
0.4951186906  
0.4934827763  
0.4918737965  
0.4902777146  
0.4886882458  
0.4871345079  
0.4855852371  
0.484076667  
0.4825546591  
0.4810546086  
0.4795768152  
0.4781275363  
0.4766813408  
0.4752700564  
0.4738615001  
0.4724745331  
0.4711088877  
0.4697364331  
0.4683930361  
0.467082809  
0.4657634987  
0.4644813596  
0.4631948065  
0.461935704  
0.4606900987  
0.4594473384  
0.4582495734  
0.4570321868  
0.4558462982  
0.4546665061  
0.453513828  
0.4523617224  
0.4512245209  
0.4501146283  
0.4490347038  
0.4479285512  
0.4468421234  
0.445805113  
0.4447362852  
0.4436971365  
0.442659601  
0.4416618378  
0.4406636699  
0.4396834142  
0.4387198469  
0.4377579212  
0.4368088549  
0.4358720455  
0.4349631807  
0.4340436066  
0.433159222  
0.4322650531  
0.4313932661  
0.4305223351  
0.4296846502  
0.4288567086  
0.4280206734  
0.4272136947  
0.4264121775  
0.4256290812  
0.4248393048  
0.4240708194  
0.4233114338  
0.4225590065  
0.4218252757  
0.421107198  
0.4204017098  
0.4196950292  
0.4189991437  
0.4183185173  
0.4176482922  
0.4169890051  
0.4163360951  
0.4157039484  
0.4150802599  
0.4144481379  
0.4138380183  
0.4132529896  
0.4126694461  
0.412091755  
0.4115100077  
0.4109565334  
0.4104213297  
0.4098650503  
0.4093463578  
0.4088155981  
0.4083049954  
0.4078067856  
0.4073397581  
0.4068575694  
0.4063712966  
0.4059213475  
0.4054719367  
0.4050280834  
0.4045965056  
0.4041670396  
0.4037671708  
0.4033554871  
0.4029660781  
0.4025855894  
0.4022077214  
0.4018363751  
0.4014674242  
0.4011316254  
0.4007845807  
0.400458023  
0.4001366058  
0.3998234378  
0.3995141928  
0.3992231798  
0.3989349371  
0.3986580183  
0.3983898478  
0.3981297387  
0.3978639402  
0.3976284042  
0.397394672  
0.3971643598  
0.3969543638  
0.3967615572  
0.3965413995  
0.396356671  
0.3961692477  
0.3959862385  
0.395828021  
0.3956734305  
0.3955413376  
0.3953955107  
0.3952531848  
0.3951515348  
0.3950185447  
0.3949045233  
0.3948114191  
0.3947391324  
0.3946553044  
0.394591354  
0.3945136887  
0.3944703744  
0.3944193092  
0.3943848933  
0.3943477809  
0.3943262393  
0.3943149341  
0.3943378004  
