-0.2484070078  
-1.37821837  
-2.433665278  
-3.344516904  
-4.052140279  
-4.514438985  
-4.70945224  
-4.637252587  
-4.319892921  
-3.799314837  
-3.133335707  
-2.390031906  
-1.641042559  
-0.95447455  
-0.3881752542  
0.01585323567  
0.2352563727  
0.2688734374  
0.1358714247  
-0.1274246729  
-0.4725619061  
-0.8452051151  
-1.191781003  
-1.465701541  
-1.632396361  
-1.672627211  
-1.583725781  
-1.378774461  
-1.083930405  
-0.7343884642  
-0.3695444313  
-0.02804266246  
0.2566947623  
0.4599524347  
0.567884501  
0.5782234509  
0.4995728881  
0.3495214705  
0.1518916617  
-0.06644670625  
-0.2788106644  
-0.4615899162  
-0.5965117768  
-0.6720762401  
-0.6841080706  
-0.6354561748  
-0.5349649412  
-0.3959207987  
-0.2342015887  
-0.06636173809  
0.09214174289  
0.228409165  
0.3331350125  
0.4011734817  
0.4316276364  
0.4275054676  
0.3950245783  
0.3426564534  
0.2800280529  
0.216783581  
0.1615365362  
0.1209930333  
0.09936679978  
0.09811988008  
0.1160976567  
0.1500071842  
0.1952238084  
0.2467830197  
0.3004348534  
0.3535835144  
0.4059553031  
0.4598571877  
0.5199543945  
0.5925597703  
0.6845187624  
0.8018197309  
0.9481511551  
1.12361025  
1.323775949  
1.539327095  
1.7562789  
1.956898857  
2.121215049  
2.228992024  
2.261980843  
2.206199192  
2.05398393  
1.805554746  
1.469860278  
1.064525222  
0.6148072825  
0.1515761686  
-0.2915581027  
-0.6816939998  
-0.9902933312  
-1.196581298  
-1.290211805  
-1.272763992  
-1.157771414  
-0.9691700425  
-0.7382905031  
-0.4997511548  
-0.2868221299  
-0.1269212675  
-0.03793977876  
-0.02594719689  
-0.08466090165  
-0.196742256  
-0.3367113141  
-0.4750199286  
-0.5826272547  
-0.6353689674  
-0.6174695786  
-0.523702684  
-0.3599279477  
-0.1420175667  
0.106598628  
0.3583217311  
0.5851723669  
0.762422379  
0.8715841791  
0.9023977598  
0.8536528851  
0.7328348742  
0.5547508369  
0.3394156961  
0.1095236395  
-0.1121477984  
-0.3050881016  
-0.4529186566  
-0.5446318091  
-0.5751172746  
-0.5450237972  
-0.4600457713  
-0.3297703797  
-0.1662828842  
0.0172957108  
0.2081697242  
0.3949662041  
0.5684926764  
0.7220864365  
0.8515762119  
0.9549125128  
1.031576813  
1.08188817  
1.106362951  
1.105227503  
1.07819045  
1.024502509  
0.9432854943  
0.8340533643  
0.6973175333  
0.53513447  
0.3514551978  
0.1521897044  
-0.05507696412  
-0.2616937571  
-0.4587953067  
-0.6382474073  
-0.793541401  
-0.9204449631  
-1.017311416  
-1.084975054  
-1.126279328  
-1.145332843  
-1.146664726  
-1.134474234  
-1.112123093  
-1.081982442  
-1.045645931  
-1.004416564  
-0.9599216179  
-0.9146495112  
-0.8722227996  
-0.837274066  
-0.8148820902  
-0.8096528507  
-0.8245979554  
-0.8600619641  
-0.9129386577  
-0.9764156001  
-1.040342519  
-1.092259801  
-1.118943953  
-1.108254853  
-1.050967293  
-0.9422861514  
-0.7827648267  
-0.5784680258  
-0.3403255799  
-0.08278611696  
0.1780152423  
0.4262769067  
0.6484155038  
0.8345267024  
0.9792227656  
1.081754033  
1.145462215  
1.17671603  
1.18355497  
1.174294658  
1.156340564  
1.135362203  
1.114918568  
1.096511315  
1.079974754  
1.064042836  
1.046937549  
1.026838618  
1.002149011  
0.9715333713  
0.9337747571  
0.8875383195  
0.8311351409  
0.7624120742  
0.6788058012  
0.5776026619  
0.4563669028  
0.3134726587  
0.1486472648  
-0.03656977755  
-0.2385303666  
-0.4514108152  
-0.667373476  
-0.8769531037  
-1.069640609  
-1.234575446  
-1.361312867  
-1.440589002  
-1.465026586  
-1.429755922  
-1.332884087  
-1.175794395  
-0.9632568545  
-0.7033058098  
-0.4068845596  
-0.08726553882  
0.2407515123  
0.5618026046  
0.8610186866  
1.125086715  
1.343211745  
1.507872955  
1.615290331  
1.665543006  
1.662332781  
1.612417856  
1.524805863  
1.409800998  
1.278034865  
1.139591342  
1.003297182  
0.8762489621  
0.7635581435  
0.6682849496  
0.5915222153  
0.5325571246  
0.489074176  
0.4573852697  
0.4326954708  
0.4094318341  
0.3816583316  
0.3435966829  
0.2902188261  
0.2178493484  
0.1246863783  
0.01112000337  
-0.1202430469  
-0.2649035784  
-0.4171310791  
-0.570858718  
-0.7206703036  
-0.8626572629  
-0.9949507667  
-1.117784747  
-1.233008693  
-1.34311398  
-1.449946452  
-1.553351761  
-1.650077735  
-1.733201279  
-1.792298272  
-1.814419943  
-1.785789333  
-1.693989117  
-1.530278209  
-1.291650558  
-0.9822260363  
-0.613698465  
-0.2046927039  
0.2209466736  
0.6366968472  
1.016386284  
1.337253786  
1.582565659  
1.743421699  
1.819456163  
1.818372657  
1.754402708  
1.645953962  
1.512836333  
1.373509209  
1.242756303  
1.130123925  
1.039306496  
0.9685167719  
0.911694998  
0.8603160441  
0.8054456247  
0.7396978268  
0.6587766042  
0.5623524365  
0.4542052924  
0.3415905904  
0.2340178863  
0.1416087006  
0.07334358719  
0.03543968899  
0.03010890148  
0.05487190484  
0.1025107043  
0.1616686235  
0.218019985  
0.2558701277  
0.259987859  
0.2174679875  
0.1194033904  
-0.03783442278  
-0.2518619028  
-0.5142026229  
-0.8108904226  
-1.123709695  
-1.431959762  
-1.71453134  
-1.952077645  
-2.128994461  
-2.234985093  
-2.265999528  
-2.224434277  
-2.118579074  
-1.961381455  
-1.768719523  
-1.557399928  
-1.343176091  
-1.139029678  
-0.9539405418  
-0.7922920952  
-0.6539427613  
-0.534940171  
-0.4287170841  
-0.3275877057  
-0.2243048612  
-0.1134385589  
0.007615417897  
0.138133818  
0.2741419717  
0.4090270199  
0.5345932034  
0.6423892606  
0.7251064416  
0.7778496752  
0.799080215  
0.7911097473  
0.7600632695  
0.7152991462  
0.6683755809  
0.6316428778  
0.6166839244  
0.6327420485  
0.6853795835  
0.7755168268  
0.8990173907  
1.046898222  
1.206189481  
1.361363559  
1.496187968  
1.595773406  
1.648534092  
1.647769967  
1.592596691  
1.488066524  
1.34438189  
1.175315681  
0.9960294565  
0.8206566692  
0.6600456263  
0.520051188  
0.4007200275  
0.2965303291  
0.1976859798  
0.09226882528  
-0.03109289016  
-0.1805168189  
-0.3585724539  
-0.560836401  
-0.7755705929  
-0.9846204089  
-1.165454053  
-1.294063491  
-1.348331173  
-1.311377052  
-1.174419385  
-0.9387410634  
-0.6164576509  
-0.229953827  
0.1899801459  
0.6071160266  
0.9835502815  
1.28380134  
1.478787622  
1.549209401  
1.487905316  
1.300902108  
1.006974015  
0.6357424956  
0.2244920447  
-0.1859319893  
-0.5556753146  
-0.8503287509  
-1.044717358  
-1.125550668  
-1.0925867  
-0.9581548916  
-0.74510136  
-0.4834531737  
-0.2062427607  
0.05489447715  
0.2737620249  
0.4327018877  
0.5243595466  
0.5518857446  
0.5276080341  
0.470435605  
0.4024209676  
0.3450544524  
0.3158568513  
0.3257975862  
0.377894249  
0.467159331  
0.5818412562  
0.7056786774  
0.8207597067  
0.9104772126  
0.9620818755  
0.9684431389  
0.928747018  
0.8481028465  
0.7361672376  
0.6051276214  
0.4674150066  
0.3336035699  
0.2108613447  
0.1022158622  
0.006720672209  
-0.07957295248  
-0.1620691269  
-0.2458758532  
-0.3342166666  
-0.4273564287  
-0.522285336  
-0.6132251262  
-0.692888389  
-0.7542458054  
-0.7924493729  
-0.8065296648  
-0.80049489  
-0.7835719076  
-0.7694470749  
-0.7745611649  
-0.8156617803  
-0.9069493301  
-1.057264854  
-1.267738746  
-1.53033902  
-1.827581856  
-2.133549231  
-2.416187006  
-2.640612534  
-2.773110453  
-2.785287042  
-2.657864187  
-2.383625827  
-1.969074703  
-1.43456473  
-0.8128238773  
-0.1459987877  
0.518445075  
1.132490686  
1.652435191  
2.043254433  
2.281949811  
2.359481089  
2.281092073  
2.065062322  
1.740106959  
1.341838656  
0.9087964229  
0.4785842817  
0.08456236196  
-0.2465389454  
-0.4959390613  
-0.6530807711  
-0.7150190211  
-0.6852304694  
-0.5721658363  
-0.387838359  
-0.1466625368  
0.1353658138  
0.4411860749  
0.7530085642  
1.052666221  
1.322123756  
1.544288317  
1.704103141  
1.789850283  
1.794457145  
1.71659179  
1.561282139  
1.339898064  
1.069389334  
0.7708366257  
0.4674380569  
0.1822134708  
-0.06430261959  
-0.2560358062  
-0.3827822266  
-0.4408585655  
-0.4329478242  
-0.3671933171  
-0.2557183671  
-0.1128316746  
0.04680245169  
0.2097409978  
0.3648638804  
0.5038817776  
0.6212179553  
0.7133816683  
0.7780262313  
0.8129378276  
0.8152484385  
0.78108387  
0.7057912597  
0.5847825793  
0.4148674996  
0.1958678474  
-0.06781838387  
-0.3660319802  
-0.6823833851  
-0.9947144257  
-1.276598181  
-1.499795627  
-1.637422562  
-1.667439034  
-1.575971023  
-1.359938559  
-1.028557615  
-0.6033691078  
-0.116669363  
0.3915414019  
0.8777948933  
1.300033946  
1.622510169  
1.820024142  
1.880920211  
1.808394543  
1.619922146  
1.344865391  
1.020600049  
0.6876871872  
0.3847817949  
0.1439665213  
-0.01284299232  
-0.07598816656  
-0.04840828353  
0.05571747977  
0.2137293256  
0.3981858796  
0.5808913987  
0.7366744994  
0.8463865331  
0.898759425  
0.8909732681  
0.8279699499  
0.7207329705  
0.5839026018  
0.4331348885  
0.2826176686  
0.1430877593  
0.02060651227  
-0.08381921421  
-0.173770377  
-0.2562609841  
-0.3401118872  
-0.4341248007  
-0.545354525  
-0.6777064905  
-0.8310708055  
-1.001079636  
-1.179500283  
-1.355187398  
-1.515435584  
-1.647540029  
-1.740347279  
-1.785598198  
-1.778905441  
-1.720263684  
-1.6140664  
-1.468645538  
-1.295430112  
-1.107823013  
-0.9199399252  
-0.7453262861  
-0.5957706138  
-0.4803010709  
-0.4044253449  
-0.369665859  
-0.3734124897  
-0.4090984548  
-0.4667203557  
-0.5336681205  
-0.5958488854  
-0.6390250973  
-0.6502878877  
-0.6195134961  
-0.5406542294  
-0.4127023592  
-0.240164444  
-0.03293002762  
0.1944861756  
0.4243312206  
0.637464888  
0.8154964079  
0.9429314098  
1.009055135  
1.009282917  
0.9457885283  
0.827291602  
0.6680322317  
0.4860502573  
0.30100189  
0.1318165195  
-0.005468167919  
-0.09942720546  
-0.1442464452  
-0.1399190261  
-0.09161155801  
-0.008354290807  
0.09873586867  
0.2183625124  
0.3408131305  
0.4592521025  
0.5703703679  
0.6743051316  
0.7738617538  
0.8732395027  
0.9764870081  
1.086027901  
1.201528175  
1.319351109  
1.432705004  
1.53247138  
1.608570736  
1.651595022  
1.654414671  
1.613433396  
1.529258706  
1.406645002  
1.253718223  
1.080632872  
0.8978965409  
0.7147166821  
0.5376506674  
0.3698484315  
0.2110367136  
0.05824264963  
-0.09286491409  
-0.2462783536  
-0.4039283961  
-0.5642912187  
-0.7216430513  
-0.8661419439  
-0.9848284556  
-1.063418899  
-1.088658206  
-1.05084776  
-0.9461291185  
-0.7781102172  
-0.5584873966  
-0.3064913759  
-0.04713516503  
0.1915376703  
0.3818604133  
0.5001171979  
0.5297732446  
0.4638851818  
0.3063058172  
0.07153329318  
-0.2168328705  
-0.5287726628  
-0.8313065185  
-1.092274078  
-1.283917384  
-1.385837686  
-1.386981503  
-1.286480365  
-1.093320116  
-0.8249662674  
-0.5051806473  
-0.1613602289  
0.1783037207  
0.4875068579  
0.7441273328  
0.9319339349  
1.041633394  
1.071194658  
1.025524827  
0.9155498653  
0.7568362563  
0.56789415  
0.368326221  
0.1769842738  
0.01029759634  
-0.1190880987  
-0.2032407374  
-0.2393744167  
-0.2297664705  
-0.181191638  
-0.1039459772  
-0.01060378476  
0.08538334845  
0.1710616151  
0.2352298532  
0.2694334296  
0.2686586791  
0.2316665185  
0.1609878403  
0.06259656475  
-0.05468108962  
-0.179969551  
-0.3012811816  
-0.4065254214  
-0.4845186053  
-0.5259400803  
-0.5241714063  
-0.4759715692  
-0.3819374423  
-0.246706737  
-0.07886241222  
0.109498744  
0.3035294677  
0.4867445433  
0.6424186865  
0.7551723716  
0.8126131282  
0.8068385015  
0.7355964909  
0.6028886453  
0.4188649138  
0.1989230495  
-0.0379568868  
-0.2714776577  
-0.4826170318  
-0.6561758046  
-0.7828673773  
-0.8605895325  
-0.8945940974  
-0.8964526439  
-0.8819237998  
-0.8679844522  
-0.8695307051  
-0.8962719862  
-0.9503922508  
-1.0254513  
-1.106783889  
-1.173437874  
-1.201398116  
-1.16763324  
-1.054300789  
-0.8524103157  
-0.564304853  
-0.2044733904  
0.2015136678  
0.6198685274  
1.012872194  
1.34395678  
1.582857556  
1.710019407  
1.719623846  
1.62071656  
1.436267011  
1.200244641  
0.9531076003  
0.7363253977  
0.5866916683  
0.5312287598  
0.5833924614  
0.7411060706  
0.9869171831  
1.290247649  
1.611432437  
1.906985033  
2.135359321  
2.262384625  
2.265640504  
2.137155345  
1.884088915  
1.527337592  
1.098341972  
0.6345969595  
0.1745822003  
-0.2471224177  
-0.6038269983  
-0.8792838681  
-1.068515571  
-1.176913416  
-1.217895626  
-1.20960833  
-1.171291517  
-1.11994827  
-1.067846199  
-1.021199237  
-0.980164801  
-0.9400172624  
-0.8932019685  
-0.8317839018  
-0.7498336604  
-0.6452603406  
-0.5208069198  
-0.3840298357  
-0.2463223067  
-0.1211834201  
-0.02207055073  
0.03978463151  
0.0572119868  
0.02830413469  
-0.04319852502  
-0.1483649266  
-0.2742717306  
-0.4057123539  
-0.5271495729  
-0.6245941486  
-0.6871402193  
-0.7079926452  
-0.6848574207  
-0.6197509474  
-0.5183132082  
-0.3888127864  
-0.2410356817  
-0.08524082084  
0.06869326619  
0.2118564276  
0.3366538776  
0.436955871  
0.5081408975  
0.5471232267  
0.5523908863  
0.5240799694  
0.46404254  
0.3758380898  
0.2645921381  
0.1366767516  
-0.0007742709802  
-0.1404807314  
-0.2756338924  
-0.4004391347  
-0.5104538318  
-0.6026672704  
-0.675314327  
-0.7274912409  
-0.7586650322  
-0.7682421345  
-0.7552915951  
-0.7185574961  
-0.6567403224  
-0.5690399861  
-0.4558092084  
-0.319197307  
-0.1635770402  
0.004355433565  
0.1758801363  
0.3409761506  
0.4893331975  
0.6115378442  
0.7002058209  
0.7508866684  
0.7625933068  
0.7378771704  
0.6824631989  
0.6045372092  
0.5138360333  
0.4206945794  
0.3352159218  
0.2666303001  
0.2228661307  
0.2103089998  
0.2336145919  
0.2955167242  
0.3965312964  
0.5345641515  
0.7044838452  
0.897784431  
1.102503448  
1.303559191  
1.483602853  
1.624403353  
1.708663904  
1.722067126  
1.655254814  
1.50543056  
1.277285304  
0.9830468822  
0.641557502  
0.2764649805  
-0.08627107676  
-0.4212148513  
-0.7062416655  
-0.9248978477  
-1.067976111  
-1.134125069  
-1.12941757  
-1.065982657  
-0.9599318244  
-0.8289342922  
-0.6897929858  
-0.5563961594  
-0.4383212149  
-0.3402384836  
-0.2621417936  
-0.2002854358  
-0.1486086402  
-0.1003519196  
-0.0495760899  
0.007665481725  
0.0726803061  
0.144072008  
0.2182168819  
0.2901356302  
0.354575417  
0.4070581197  
0.4447134753  
0.4667266078  
0.4743426967  
0.4704222732  
0.4586601805  
0.4425953139  
0.4246374265  
0.4052787017  
0.382661286  
0.3526142308  
0.3091786199  
0.2455680565  
0.155435392  
0.03423762558  
-0.1194957576  
-0.3032464818  
-0.5100674916  
-0.728768022  
-0.9447111711  
-1.141155531  
-1.300981792  
-1.408599957  
-1.451779815  
-1.423199873  
-1.321512676  
-1.151803422  
-0.9253897277  
-0.6589776197  
-0.3732597063  
-0.09107141861  
0.164712203  
0.3733667848  
0.5183813194  
0.589202432  
0.5824661541  
0.5025617279  
0.3614183548  
0.1774890771  
-0.02601889503  
-0.2235152261  
-0.3897358332  
-0.5025128176  
-0.5452404835  
-0.5087280199  
-0.3921937082  
-0.2032384844  
0.04318455475  
0.3266926743  
0.6240155565  
