0.1476672121  
0.4238431846  
0.7053780528  
0.9972129588  
1.29967467  
1.607029958  
1.907163391  
2.182503633  
2.412102102  
2.574569133  
2.651454519  
2.630526428  
2.508439437  
2.29232076  
1.999974965  
1.658578667  
1.301977309  
0.9668908678  
0.6885208965  
0.4961580601  
0.4093938968  
0.4354881764  
0.5682927432  
0.7888958795  
1.067933153  
1.369252001  
1.654425387  
1.887498563  
2.03931317  
2.090824773  
2.034988544  
1.87699933  
1.632917911  
1.326954518  
0.9878484422  
0.6449213656  
0.3243872041  
0.04643900948  
-0.1765082832  
-0.3402372641  
-0.4478590535  
-0.507878574  
-0.5316071243  
-0.5303956483  
-0.5131823694  
-0.4847727527  
-0.4451253352  
-0.3897507286  
-0.3111083698  
-0.2007540235  
-0.05180694217  
0.138692463  
0.3679956509  
0.6267642493  
0.8992930203  
1.164841598  
1.399918913  
1.581176773  
1.688481785  
1.707725295  
1.632926782  
1.467317527  
1.223243689  
0.9208831569  
0.585960351  
0.2467688967  
-0.06909450971  
-0.337828002  
-0.5419742316  
-0.6720961917  
-0.7274059604  
-0.7153224245  
-0.650089166  
-0.5506991305  
-0.4384491079  
-0.3344707616  
-0.2575408336  
-0.2224048914  
-0.2387396828  
-0.3107715282  
-0.4374628054  
-0.613136967  
-0.8283765714  
-1.071031657  
-1.327237477  
-1.582366028  
-1.821913719  
-2.032314973  
-2.201725498  
-2.320762462  
-2.383183988  
-2.386444405  
-2.332042831  
-2.225576947  
-2.076436147  
-1.897107861  
-1.70213024  
-1.506776221  
-1.325613619  
-1.171108858  
-1.052446748  
-0.974721172  
-0.9385904652  
-0.9404499295  
-0.9730589655  
-1.026541322  
-1.089595282  
-1.150727761  
-1.199357112  
-1.226642822  
-1.225973861  
-1.193114431  
-1.1260727  
-1.024808809  
-0.8908993824  
-0.7272861314  
-0.5381666841  
-0.329057731  
-0.1069492615  
0.1195341161  
0.3401090081  
0.5430779476  
0.7159208171  
0.8462588212  
0.9231291851  
0.9384180036  
0.8882497997  
0.7740800047  
0.6032844664  
0.3890375056  
0.1494287357  
-0.09416637574  
-0.3192853264  
-0.5048923799  
-0.6338576262  
-0.695037054  
-0.6846476607  
-0.6066848207  
-0.472313311  
-0.2982807463  
-0.1045795299  
0.0883245732  
0.2622707789  
0.4038112888  
0.5058858555  
0.568545189  
0.5986291477  
0.6084813883  
0.6139005218  
0.6316468416  
0.6768604881  
0.7607537153  
0.8888934644  
1.060273547  
1.267314084  
1.496730799  
1.731190471  
1.951496324  
2.139038412  
2.278170693  
2.358233349  
2.374926419  
2.33087388  
2.235283293  
2.102743033  
1.951314445  
1.800162916  
1.667059528  
1.566072992  
1.505788822  
1.48826429  
1.50887004  
1.557021157  
1.617657906  
1.673278296  
1.706219213  
1.700874254  
1.645571804  
1.533868003  
1.365130807  
1.144362813  
0.8813272926  
0.5891335472  
0.2824761738  
-0.02421126198  
-0.3184438304  
-0.5910089948  
-0.836753828  
-1.054763766  
-1.247940908  
-1.422060984  
-1.584472962  
-1.74262458  
-1.902618876  
-2.068001414  
-2.238888872  
-2.411576996  
-2.578623181  
-2.729413649  
-2.85114439  
-2.930124793  
-2.95328518  
-2.909756807  
-2.79237504  
-2.598941832  
-2.333121098  
-2.004802348  
-1.62985818  
-1.229244914  
-0.827458529  
-0.4504740501  
-0.1233263796  
0.1324020672  
0.3009030414  
0.3739898952  
0.3521894549  
0.2449244371  
0.06968587941  
-0.1497394353  
-0.3858035835  
-0.6102028095  
-0.796986567  
-0.9253644786  
-0.9818504002  
-0.9614686774  
-0.867875897  
-0.712389794  
-0.5121058091  
-0.2873676185  
-0.05898322179  
0.1544397031  
0.3386483176  
0.4851307431  
0.5915669131  
0.6613389118  
0.7022257514  
0.7245267658  
0.7389228431  
0.7544254156  
0.776727673  
0.8071865201  
0.8426006474  
0.8757741673  
0.8967822825  
0.8947159747  
0.859640185  
0.7844554231  
0.6663775251  
0.5077962747  
0.3163883939  
0.1044445292  
-0.1125025844  
-0.3175461152  
-0.4945189761  
-0.6300401921  
-0.7152022552  
-0.7466512827  
-0.7269093866  
-0.6638863847  
-0.5696632104  
-0.4587207323  
-0.345877162  
-0.2442250178  
-0.16338091  
-0.1082778534  
-0.07867369459  
-0.06943186352  
-0.07151447082  
-0.07354090906  
-0.06365524328  
-0.031441539  
0.03040793914  
0.124894387  
0.250163877  
0.3996554313  
0.5629205904  
0.7269657489  
0.8779231895  
1.002797413  
1.091039183  
1.135742816  
1.134325419  
1.088614669  
1.004406891  
0.8905566504  
0.7578122493  
0.6175469303  
0.4805780423  
0.3562242132  
0.2516746365  
0.1716957306  
0.1186303733  
0.09261870265  
0.09191014548  
0.1132038487  
0.1519121458  
0.2023498064  
0.2578511748  
0.3108974775  
0.353321213  
0.3766908558  
0.3729206762  
0.3351147722  
0.258585803  
0.1419040358  
-0.01219225333  
-0.1962471224  
-0.3980915594  
-0.6015292992  
-0.7877559195  
-0.9374093972  
-1.033034478  
-1.061643155  
-1.016973468  
-0.9010584736  
-0.7247681008  
-0.5071512868  
-0.2735353093  
-0.05259812939  
0.1272536056  
0.2416771193  
0.2738033904  
0.2167504682  
0.07480929897  
-0.1368856053  
-0.3941968146  
-0.6670806915  
-0.9234915069  
-1.133527402  
-1.273229104  
-1.327497637  
-1.291759257  
-1.172196095  
-0.9845712895  
-0.7519006105  
-0.501318221  
-0.2606375088  
-0.05503425216  
0.09571773038  
0.1791567252  
0.1910477575  
0.1352554158  
0.02271555233  
-0.1303145813  
-0.3044318308  
-0.4794117576  
-0.6363927852  
-0.7597011284  
-0.8381391546  
-0.8656574287  
-0.8414038346  
-0.7692043069  
-0.6566083141  
-0.5136400085  
-0.3514674654  
-0.1811344944  
-0.01252504663  
0.1463286234  
0.2895650131  
0.4134368009  
0.5159601764  
0.5963895908  
0.6546588144  
0.690915486  
0.7052525589  
0.6976891382  
0.6683737517  
0.6179605347  
0.5480294769  
0.4614491307  
0.3625565762  
0.2570975702  
0.1518899769  
0.05425940451  
-0.02868803367  
-0.09083612485  
-0.1277601148  
-0.1372564512  
-0.1196106713  
-0.0775793491  
-0.01607820263  
0.05837578084  
0.1384024372  
0.2165783583  
0.2862443477  
0.3422218318  
0.381344032  
0.4027651818  
0.4080232814  
0.4008368857  
0.3866803853  
0.3721592762  
0.3642415247  
0.3694208792  
0.3928727823  
0.4377050558  
0.5043675435  
0.5903112418  
0.6899587045  
0.7950186427  
0.8951523457  
0.9789561912  
1.035168343  
1.054001604  
1.028440323  
0.9553613729  
0.8363058547  
0.6777913118  
0.4910603924  
0.2912416414  
0.09594748304  
-0.0765806447  
-0.2096057252  
-0.2900737139  
-0.3105805979  
-0.2708279623  
-0.1783543462  
-0.04833234296  
0.09762681664  
0.2336261823  
0.3324046505  
0.3687381768  
0.3228906979  
0.1836862135  
-0.04926674428  
-0.3645709907  
-0.7394950071  
-1.141947347  
-1.533821562  
-1.875349033  
-2.129933709  
-2.268833623  
-2.27505816  
-2.145883409  
-1.893615037  
-1.544418479  
-1.135324172  
-0.7097782334  
-0.3123160428  
0.01692078591  
0.2470860171  
0.3602789023  
0.353463061  
0.2384028273  
0.03968015715  
-0.2089181075  
-0.4690860705  
-0.7031081833  
-0.8786794603  
-0.9727975508  
-0.9742678733  
-0.8845373211  
-0.7168719202  
-0.49404772  
-0.2449850128  
-0.0008011964897  
0.2091644613  
0.3608537547  
0.4381259346  
0.4342524196  
0.3521834605  
0.2036276893  
0.007148469851  
-0.2144205303  
-0.4368757816  
-0.6374753452  
-0.7973549739  
-0.903250339  
-0.9483720628  
-0.9323864741  
-0.8606176048  
-0.7426599374  
-0.5906807618  
-0.4176988578  
-0.2361079106  
-0.05661810072  
0.112290448  
0.2644202165  
0.395533952  
0.5028345928  
0.5844133416  
0.6388793663  
0.6652276573  
0.6630278259  
0.6328507794  
0.5768175962  
0.4991180094  
0.4063146859  
0.3073019111  
0.2128356219  
0.1346408282  
0.08419275484  
0.07131191045  
0.1028102411  
0.1813763721  
0.304916132  
0.4664554844  
0.6546728235  
0.8550096236  
1.051223175  
1.227203275  
1.368788003  
1.465356533  
1.510980973  
1.504978284  
1.451802716  
1.360299352  
1.242430882  
1.111668704  
0.9812651368  
0.8626435783  
0.7641058142  
0.6900071962  
0.6404491853  
0.6115150153  
0.5959303799  
0.5840568773  
0.5650619216  
0.5281180924  
0.4635227168  
0.3636409834  
0.2236387044  
0.04197742586  
-0.179322734  
-0.4346513239  
-0.7149992329  
-1.008382222  
-1.300517073  
-1.575738199  
-1.818140076  
-2.012901814  
-2.147666486  
-2.213848153  
-2.207693795  
-2.130913393  
-1.990754343  
-1.799437161  
-1.572967627  
-1.329426907  
-1.086963361  
-0.861710826  
-0.6659591493  
-0.5068178259  
-0.3855797577  
-0.2978914334  
-0.2347043122  
-0.1838766168  
-0.1322008505  
-0.067554954  
0.01913348327  
0.1323860732  
0.2713595099  
0.4298318535  
0.5969880638  
0.7589016806  
0.9004923958  
1.007692852  
1.069510373  
1.079684764  
1.037707265  
0.9490351071  
0.8244645702  
0.6787409908  
0.5285943475  
0.3904811193  
0.2783575152  
0.2017977996  
0.1647458493  
0.1650606093  
0.1949367358  
0.2421076191  
0.2916682049  
0.3282298367  
0.338086724  
0.3110820453  
0.2418933877  
0.1305757427  
-0.01770928128  
-0.1936963703  
-0.3855668039  
-0.5807815573  
-0.7678566759  
-0.9378133841  
-1.085035555  
-1.207422093  
-1.305841448  
-1.383011342  
-1.442055573  
-1.485050592  
-1.51184614  
-1.519448404  
-1.502091069  
-1.452035157  
-1.360979507  
-1.221845521  
-1.030631509  
-0.7879998556  
-0.500295465  
-0.1797587647  
0.1561508943  
0.4863057025  
0.7881340976  
1.040247145  
1.225085355  
1.331208474  
1.354862882  
1.300602375  
1.18081205  
1.014213282  
0.8235153149  
0.6325636707  
0.4633763024  
0.3334838783  
0.2539498235  
0.2283217393  
0.2526401012  
0.316451431  
0.4046564329  
0.4998610721  
0.5849115274  
0.6451940732  
0.6704322173  
0.6557270988  
0.601760384  
0.5141810681  
0.4023461746  
0.2776407609  
0.1516824531  
0.03469704667  
-0.06568961997  
-0.145075168  
-0.2022811054  
-0.2387833575  
-0.2577478843  
-0.2628917542  
-0.2574309031  
-0.2433311216  
-0.2210110533  
-0.1895494256  
-0.1473390944  
-0.09303090708  
-0.02655651477  
0.05000285526  
0.1319150541  
0.211793694  
0.2801625203  
0.3265213297  
0.3407796697  
0.3148526883  
0.2441569992  
0.128774031  
-0.02593210301  
-0.2093740039  
-0.4065082956  
-0.5992632696  
-0.7684388073  
-0.8958683572  
-0.9665475077  
-0.9704593713  
-0.9038486082  
-0.7697836694  
-0.5779272423  
-0.3435572301  
-0.08596476539  
0.1735673825  
0.4139356478  
0.6163023924  
0.7658369806  
0.8529472014  
0.8738951676  
0.830763321  
0.730838814  
0.5855304877  
0.4089671112  
0.216451697  
0.02295720101  
-0.1582357824  
-0.3166176256  
-0.4451955858  
-0.5408771522  
-0.6044748407  
-0.6403589736  
-0.6557822092  
-0.6599384156  
-0.6628086928  
-0.6738858737  
-0.7009068316  
-0.7486829811  
-0.8181814548  
-0.9059784883  
-1.004165099  
-1.100777755  
-1.18075818  
-1.227376059  
-1.224028186  
-1.156237885  
-1.013651994  
-0.7918408704  
-0.4936327176  
-0.1298253896  
0.2809082567  
0.7129843144  
1.135727373  
1.515933902  
1.820954884  
2.022002461  
2.097317744  
2.034828888  
1.833960495  
1.506332893  
1.075185959  
0.5735428659  
0.04123665503  
-0.4789056961  
-0.9453169995  
-1.321913933  
-1.581794435  
-1.709964759  
-1.70475341  
-1.577729381  
-1.352105969  
-1.059829211  
-0.7376954588  
-0.4229906978  
-0.1491834926  
0.05778674469  
0.1821557893  
0.2196397063  
0.1772329218  
0.07160549276  
-0.07367248392  
-0.2316495369  
-0.3757819186  
-0.4834748265  
-0.5389111944  
-0.5348227421  
-0.4730031918  
-0.3635373716  
-0.2229102403  
-0.071294286  
0.07056993967  
0.1844481073  
0.2571899404  
0.2824631235  
0.2614108268  
0.2021718627  
0.1183667396  
0.02682366574  
-0.05511171373  
-0.1122235572  
-0.1336530661  
-0.1143620453  
-0.05563064702  
0.03543836932  
0.1473044612  
0.265975088  
0.3772708559  
0.4689674042  
0.5324864583  
0.5638924834  
0.564084333  
0.5382164838  
0.4945270221  
0.4428040864  
0.3928191382  
0.3529471797  
0.3292235369  
0.3248919953  
0.3404596488  
0.3741567488  
0.4226133992  
0.4815965015  
0.5466143145  
0.6133096377  
0.677580182  
0.7354893314  
0.7830530882  
0.8160505795  
0.8299773559  
0.8202483377  
0.7826579922  
0.7140778238  
0.6132549249  
0.4815494068  
0.3234333444  
0.1465934349  
-0.03846916518  
-0.2193300211  
-0.3829498086  
-0.517222804  
-0.6125204876  
-0.6630060005  
-0.6674719884  
-0.629569751  
-0.5573634466  
-0.4622629111  
-0.357479742  
-0.256235286  
-0.169972984  
-0.1068550045  
-0.07073730705  
-0.06079438606  
-0.07182106571  
-0.09516606913  
-0.1201515447  
-0.1357572846  
-0.1323131755  
-0.1029666364  
-0.04470315117  
0.04120765465  
0.1493807484  
0.2710480809  
0.395232491  
0.510151281  
0.6046340161  
0.669355601  
0.6976974753  
0.6861563443  
0.6342781178  
0.5442022539  
0.4199402951  
0.2665989419  
0.08970997309  
-0.1051760867  
-0.3125494537  
-0.5266878907  
-0.7411759155  
-0.9483968813  
-1.139203481  
-1.302975825  
-1.428202376  
-1.503631352  
-1.519893348  
-1.471390488  
-1.35813575  
-1.187172578  
-0.9732175605  
-0.7382693633  
-0.5100194381  
-0.3191426215  
-0.1957027837  
-0.1651163684  
-0.2442454018  
-0.4382225603  
-0.7385835623  
-1.123107885  
-1.557546576  
-1.999106279  
-2.401317066  
-2.719604971  
-2.916836425  
-2.968005692  
-2.863412091  
-2.609848095  
-2.229655798  
-1.75778511  
-1.237316528  
-0.7140676293  
-0.2310591647  
0.1764534487  
0.4847298646  
0.6836803093  
0.7771820144  
0.7816541637  
0.7231664127  
0.6335255911  
0.5459068971  
0.4905573144  
0.4911290647  
0.5620160772  
0.706965874  
0.9190669938  
1.182007038  
1.472412633  
1.762891322  
2.025418321  
2.234609951  
2.370540184  
2.420781812  
2.381505126  
2.257569408  
2.061671235  
1.812722476  
1.533692508  
1.249184273  
0.9830206655  
0.7560683673  
0.58449775  
0.4785834562  
0.4421177582  
0.4724252896  
0.5609314785  
0.6941922597  
0.85526718  
1.025308631  
1.185221736  
1.3172628  
1.406468843  
1.441800424  
1.416940825  
1.330694683  
1.186979452  
0.9944050157  
0.7654941162  
0.5155907708  
0.2615362344  
0.02021565958  
-0.1929126586  
-0.365200343  
-0.4879655269  
-0.5573315043  
-0.5746507656  
-0.5464508723  
-0.4839003958  
-0.4017948821  
-0.3171642291  
-0.2476058854  
-0.2095046658  
-0.2163215929  
-0.2771336432  
-0.395594231  
-0.5694353218  
-0.7905902796  
-1.04592238  
-1.318497543  
-1.589250439  
-1.838865251  
-2.049652483  
-2.207223349  
-2.30177234  
-2.328861181  
-2.289629859  
-2.190445643  
-2.042045492  
-1.858294615  
-1.654686068  
-1.446741057  
-1.248473296  
-1.071043424  
-0.9217489666  
-0.8034264276  
-0.7143343812  
-0.6485332399  
-0.5967308082  
-0.5475114977  
-0.4888347973  
-0.4096490116  
-0.3014374502  
-0.1595294657  
0.01598582133  
0.2198699656  
0.4419387341  
0.6678674921  
0.8805436611  
1.061845667  
1.194659506  
1.264932495  
1.263509305  
1.18754915  
1.041308949  
0.8361748845  
0.5898983262  
0.325050053  
0.06686632691  
-0.1593345113  
-0.3308469852  
-0.4300839664  
-0.446574316  
-0.3781836198  
-0.2313888339  
-0.02054470302  
0.2337719929  
0.5071333909  
0.7740302151  
1.010672999  
1.197455342  
1.320761415  
1.373928721  
1.357277758  
1.2772954  
1.145142686  
0.9747744011  
0.7809642413  
0.577527663  
0.3759597604  
0.184631297  
0.008565621391  
-0.1502572237  
