0.1434117447  
0.377170131  
0.6182705131  
0.8684583134  
1.126819399  
1.389214734  
1.648215485  
1.893560965  
2.113128552  
2.294295824  
2.425529334  
2.497979003  
2.506845165  
2.452290249  
2.339732634  
2.179442118  
1.985444662  
1.773873221  
1.560981171  
1.3611008  
1.184858155  
1.037926828  
0.9205279681  
0.827765812  
0.750784745  
0.6785686268  
0.6001115182  
0.5066236144  
0.3934094945  
0.2611058725  
0.1160571055  
-0.03026505103  
-0.1627386601  
-0.2647597976  
-0.3208010803  
-0.3189693003  
-0.2531840847  
-0.1246422465  
0.05766738261  
0.2774933226  
0.5128446571  
0.7383053929  
0.9278501525  
1.057779925  
1.109400763  
1.071108144  
0.9396173837  
0.7202142917  
0.4260187632  
0.07639459214  
-0.3052631672  
-0.6940530584  
-1.066075044  
-1.400610661  
-1.681720934  
-1.899110623  
-2.04821227  
-2.129567547  
-2.147667219  
-2.109499694  
-2.023073119  
-1.896176288  
-1.735568765  
-1.546734501  
-1.334177489  
-1.102179513  
-0.8558008198  
-0.6018816255  
-0.3497573145  
-0.1114734882  
0.09866298551  
0.2652222792  
0.3733723807  
0.4109667083  
0.3706687172  
0.2517584631  
0.06126806147  
-0.1858097952  
-0.4673965164  
-0.7562433578  
-1.022727732  
-1.238174189  
-1.378283456  
-1.42619613  
-1.374755297  
-1.227623038  
-0.999071197  
-0.7124292881  
-0.3973726979  
-0.08637934167  
0.189186739  
0.4028581748  
0.536230657  
0.5810999069  
0.5403039764  
0.4271674906  
0.2636420082  
0.07739638312  
-0.1017598943  
-0.2456308999  
-0.3311026843  
-0.3428714867  
-0.2751050985  
-0.1318644787  
0.07373341249  
0.3214514228  
0.586668178  
0.8435142842  
1.067992769  
1.240659993  
1.348557486  
1.38618351  
1.355452869  
1.264736042  
1.127178705  
0.9586040091  
0.7753161699  
0.5921211073  
0.4208090915  
0.2692550272  
0.1411951284  
0.03661568926  
-0.04736383036  
-0.1153266431  
-0.1723115276  
-0.2227024488  
-0.2693985808  
-0.3133856619  
-0.3537228264  
-0.3879209851  
-0.4126100105  
-0.4243503695  
-0.4204588103  
-0.3996841318  
-0.3626265807  
-0.3118324547  
-0.2515503512  
-0.1871804577  
-0.1245257598  
-0.06894681975  
-0.0245733655  
0.006306177895  
0.02357983187  
0.02931185809  
0.0274159699  
0.02304761883  
0.02182358317  
0.0289847468  
0.04863823282  
0.08318818913  
0.1330425615  
0.1966093909  
0.2705818265  
0.3504378911  
0.4310612386  
0.5073772744  
0.5749068514  
0.6301601336  
0.6708251761  
0.6957650413  
0.7048459898  
0.6986704446  
0.678284552  
0.6449343756  
0.5999157962  
0.544537787  
0.4801876558  
0.4084462931  
0.3312026687  
0.2506921402  
0.1694244718  
0.08997390778  
0.01465551753  
-0.05485127172  
-0.1178625816  
-0.1749290191  
-0.2278879431  
-0.279663558  
-0.3338303999  
-0.393965497  
-0.4628932586  
-0.5419379004  
-0.6303143391  
-0.7247812636  
-0.8196331756  
-0.9070722264  
-0.9779363723  
-1.022698284  
-1.032623998  
-1.00093439  
-0.9238166182  
-0.8011484074  
-0.636829695  
-0.4386656607  
-0.2177910102  
0.01229759698  
0.2370208961  
0.4421507662  
0.6152526235  
0.7469561447  
0.8319151303  
0.8693201907  
0.8628968993  
0.8203763657  
0.7524728081  
0.6714954688  
0.5897521833  
0.517956084  
0.4638397178  
0.4311801367  
0.4193813847  
0.4236768093  
0.4359413647  
0.4459947103  
0.4432003173  
0.4181120929  
0.3639136261  
0.2774145552  
0.159448613  
0.01462516675  
-0.1495204041  
-0.3238032226  
-0.4988652904  
-0.6665706064  
-0.8210759868  
-0.9593827575  
-1.081279413  
-1.188705283  
-1.284666055  
-1.371923784  
-1.451726108  
-1.522838015  
-1.581072481  
-1.619452048  
-1.628996168  
-1.600033845  
-1.523842494  
-1.394355358  
-1.209664193  
-0.9730678843  
-0.6935048688  
-0.3852594972  
-0.06698080511  
0.2398926364  
0.5131059365  
0.731739151  
0.8782832003  
0.9404306217  
0.9123774385  
0.7955276386  
0.5985256566  
0.3366263422  
0.03045884128  
-0.2956953883  
-0.6159600999  
-0.905072851  
-1.140539361  
-1.304525387  
-1.38531243  
-1.378146673  
-1.285402335  
-1.116021081  
-0.8842966364  
-0.6081368884  
-0.307013462  
0.0001436687134  
0.2968488834  
0.5705065443  
0.8132383802  
1.021979854  
1.197893818  
1.34518739  
1.469568728  
1.576592766  
1.670176194  
1.751531464  
1.818687518  
1.86669162  
1.888436282  
1.875991871  
1.822204834  
1.722301282  
1.575207266  
1.384365435  
1.157878818  
0.907947766  
0.6496520347  
0.3992652733  
0.1723441931  
-0.01811818282  
-0.1631934268  
-0.2589448777  
-0.306652827  
-0.3123093718  
-0.2854850803  
-0.2377451418  
-0.1808887943  
-0.1252742609  
-0.07849214656  
-0.04457854136  
-0.0238519636  
-0.01336835129  
-0.007887050395  
-0.001145837602  
0.01277585112  
0.0382426283  
0.07719545663  
0.1287456364  
0.1892708325  
0.2529623828  
0.312687339  
0.361008417  
0.3911605824  
0.397844615  
0.3777231026  
0.3295839506  
0.2542162042  
0.1540753497  
0.03286123478  
-0.1048722699  
-0.2539948954  
-0.4089242473  
-0.5636279545  
-0.7115611845  
-0.8456595457  
-0.9584715115  
-1.0425179  
-1.090890662  
-1.098049315  
-1.060707629  
-0.978648674  
-0.8553069412  
-0.6979540648  
-0.5173871872  
-0.3270965645  
-0.1419812087  
0.02324856839  
0.1557514293  
0.246065192  
0.2892303939  
0.2853075447  
0.2392133124  
0.1598719246  
0.05879713633  
-0.05166587494  
-0.1601767106  
-0.2580112701  
-0.3401850282  
-0.4059093222  
-0.4582994619  
-0.503394489  
-0.5486491513  
-0.6011697837  
-0.665994651  
-0.7447278317  
-0.8347743082  
-0.9293186061  
-1.018078629  
-1.088723553  
-1.128735205  
-1.12742714  
-1.077788333  
-0.9778581681  
-0.8314052175  
-0.6477813413  
-0.4409593223  
-0.2278739142  
-0.02631191285  
0.1473624355  
0.2803019491  
0.3647963634  
0.3991699901  
0.3878267307  
0.3404370549  
0.2703773217  
0.1926647193  
0.1216943038  
0.06912145916  
0.04221874025  
0.04296253218  
0.06799002401  
0.1094409833  
0.1565476223  
0.1977238191  
0.2228152374  
0.2251296078  
0.2029124002  
0.1599830308  
0.1054027492  
0.05217210052  
0.01513449157  
0.008391668914  
0.04263597022  
0.122841328  
0.2467193325  
0.4042472713  
0.578428691  
0.7472338282  
0.8865013551  
0.9733949064  
0.9899054926  
0.9258581721  
0.7809233517  
0.5652841059  
0.2987862579  
0.008653128419  
-0.2739574535  
-0.5180599589  
-0.6970366105  
-0.7923012625  
-0.795895063  
-0.711643997  
-0.5546943331  
-0.3495088226  
-0.1266010372  
0.08152221896  
0.2446586845  
0.3388613757  
0.3495426599  
0.2733477901  
0.1185991295  
-0.09569735124  
-0.3421067484  
-0.5879751103  
-0.7991711648  
-0.9439369507  
-0.9963973265  
-0.9393884269  
-0.7663283453  
-0.4819834466  
-0.1020873195  
0.348114789  
0.8362332919  
1.325783832  
1.77961955  
2.163436245  
2.449004019  
2.61682804  
2.657945954  
2.574674392  
2.380195828  
2.09700008  
1.754340109  
1.384954013  
1.021446299  
0.6927416231  
0.4210556176  
0.2197589856  
0.09239300284  
0.0329506245  
0.02734992206  
0.05587481334  
0.096212732  
0.1266481111  
0.12896918  
0.09069065733  
0.006336807008  
-0.1223426459  
-0.2871774697  
-0.4751993939  
-0.6708002491  
-0.8580527237  
-1.022870835  
-1.154703126  
-1.247589682  
-1.300484949  
-1.316918291  
-1.304104112  
-1.271714157  
-1.230518459  
-1.191097567  
-1.162780762  
-1.152880742  
-1.166262517  
-1.205190873  
-1.269399044  
-1.356288986  
-1.46119726  
-1.577689419  
-1.697869622  
-1.812724066  
-1.912535021  
-1.987392609  
-2.027803387  
-2.025381623  
-1.973556078  
-1.868212219  
-1.708176675  
-1.495451295  
-1.235158477  
-0.9351635649  
-0.60543576  
-0.2572108131  
0.09792501823  
0.4488984832  
0.7858609521  
1.100652286  
1.386988243  
1.640379316  
1.857836976  
2.037462198  
2.178013157  
2.278554289  
2.338258785  
2.356401825  
2.332538228  
2.266820645  
2.160377877  
2.015680738  
1.836784671  
1.629401475  
1.400751956  
1.159195227  
0.9136723991  
0.6730241322  
0.4452656463  
0.2369089111  
0.05242599314  
-0.1060892877  
-0.239002619  
-0.3489521396  
-0.4404160831  
-0.519068405  
-0.5910152392  
-0.6619819828  
-0.7365624532  
-0.8176157812  
-0.9058776067  
-0.999835835  
-1.095877647  
-1.188688228  
-1.271836179  
-1.338494363  
-1.382180739  
-1.397465349  
-1.380552475  
-1.329689335  
-1.245380518  
-1.130381023  
-0.9894951708  
-0.8292019867  
-0.6571404543  
-0.4815125418  
-0.3104352032  
-0.1513022664  
-0.0102067768  
0.1085423971  
0.2027469459  
0.2724594795  
0.3199093113  
0.3491910023  
0.3657298811  
0.3755552722  
0.384446112  
0.3970431705  
0.4160445156  
0.4416189388  
0.471149516  
0.4994093806  
0.5192024082  
0.5224442717  
0.5015788087  
0.4511442235  
0.3692616968  
0.2587792268  
0.1278408213  
-0.01030759193  
-0.1383509188  
-0.2367258183  
-0.2860524934  
-0.2698774492  
-0.1773446812  
-0.005385155856  
0.2399353387  
0.5431979646  
0.8806499175  
1.222419271  
1.535692053  
1.78846893  
1.953414519  
2.011298862  
1.953541378  
1.783509318  
1.516368014  
1.177476781  
0.7995250979  
0.4187658753  
0.07082550971  
-0.213385507  
-0.4111398369  
-0.5103314089  
-0.5105942891  
-0.423004759  
-0.2684542986  
-0.07493135492  
0.1259041041  
0.3024103922  
0.4264674009  
0.4763921598  
0.4389734892  
0.310453209  
0.09643497423  
-0.1891688584  
-0.5259505091  
-0.8893096537  
-1.252949277  
-1.591297478  
-1.8816333  
-2.10575326  
-2.251095947  
-2.311292499  
-2.286181963  
-2.181343466  
-2.007245983  
-1.778110151  
-1.510588108  
-1.222364712  
-0.9307779155  
-0.6515524093  
-0.3977248273  
-0.1788243607  
-0.0003787265502  
0.1362490678  
0.2336646491  
0.2979158111  
0.33767619  
0.3632136969  
0.3852296551  
0.4136739796  
0.4566541939  
0.5195361919  
0.6043351601  
0.7094678124  
0.8298842019  
0.9575937957  
1.082524612  
1.19362008  
1.280073553  
1.33254033  
1.344193472  
1.31148631  
1.234526393  
1.117004156  
0.9656773732  
0.7894758901  
0.5983419339  
0.401957473  
0.2085502339  
0.0239409225  
-0.1490111239  
-0.310477723  
-0.4632221744  
-0.6117124663  
-0.7609178559  
-0.9149836654  
-1.075996141  
-1.243061092  
-1.411854513  
-1.574749736  
-1.721529204  
-1.84058057  
-1.920423435  
-1.95131499  
-1.926716976  
-1.844374845  
-1.706847946  
-1.521407826  
-1.29930653  
-1.054510511  
-0.8020880379  
-0.5564601055  
-0.3297661281  
-0.1305611257  
0.03698371832  
0.173266545  
0.2828126821  
0.3732679036  
0.4539766945  
0.5343366918  
0.6221705833  
0.7223406757  
0.8358148288  
0.9593122506  
1.085607103  
1.204433244  
1.30389437  
1.372161636  
1.399244628  
1.378568026  
1.308149873  
1.191211495  
1.036153456  
0.8559002233  
0.6667160216  
0.486648708  
0.3337918128  
0.2245640201  
0.1721699041  
0.1853708359  
0.2676535025  
0.4168132594  
0.6249726286  
0.878989006  
1.161239007  
1.450727747  
1.72447509  
1.959118313  
2.132650611  
2.226168794  
2.225508972  
2.122596939  
1.916372183  
1.613151918  
1.226353026  
0.7755639372  
0.285030485  
-0.21830628  
-0.7070147409  
-1.155390687  
-1.541443456  
-1.848459655  
-2.06598461  
-2.190162232  
-2.223439641  
-2.17374152  
-2.053240102  
-1.8769218  
-1.661111518  
-1.422127169  
-1.175171333  
-0.9335282488  
-0.7080750055  
-0.5070761423  
-0.3361993691  
-0.1986855872  
-0.09560595291  
-0.026154446  
0.01203620884  
0.02257074543  
0.009936792923  
-0.02088700795  
-0.06486934751  
-0.1173895528  
-0.1746874015  
-0.2342385742  
-0.2949820589  
-0.357336624  
-0.4229667493  
-0.4942997265  
-0.5738403218  
-0.6633837428  
-0.7632510626  
-0.8716954921  
-0.9846059665  
-1.095593007  
-1.196490171  
-1.278221242  
-1.331918582  
-1.350128148  
-1.327913962  
-1.26366281  
-1.15945891  
-1.020950478  
-0.8566923091  
-0.6770784578  
-0.4929986881  
-0.3144312808  
-0.1491776072  
-0.001926497034  
0.1262074887  
0.2376217457  
0.3376526683  
0.4335816673  
0.5333916392  
0.6444497434  
0.7723120002  
0.9198280858  
1.086642851  
1.269164391  
1.460961359  
1.653511591  
1.837153425  
2.002093436  
2.139302091  
2.241172384  
2.301881776  
2.31743327  
2.285445619  
2.20480491  
2.075301522  
1.897401759  
1.672247711  
1.401921726  
1.089953011  
0.741952094  
0.3662070276  
-0.02593369327  
-0.4200784835  
-0.799334077  
-1.145398971  
-1.440164862  
-1.667634159  
-1.815923388  
-1.879035982  
-1.858108104  
-1.761868474  
-1.60616283  
-1.412512114  
-1.2058237  
-1.011516579  
-0.852415637  
-0.7458432501  
-0.7013038052  
-0.719137963  
-0.7903356947  
-0.8976064217  
-1.017573894  
-1.123837393  
-1.190491785  
-1.195641853  
-1.124424503  
-0.971133213  
-0.7401601871  
-0.4456088428  
-0.1096568937  
0.2401193973  
0.5740858003  
0.8641078805  
1.086850253  
1.226386623  
1.275815176  
1.237682479  
1.1232263  
0.9505828885  
0.7422473662  
0.5221670839  
0.3128788429  
0.1330552262  
-0.004214107846  
-0.09225234677  
-0.1306784459  
-0.1244462688  
-0.08225725075  
-0.01463398402  
0.06802023497  
0.1570592335  
0.2467008069  
0.3344555533  
0.4208464432  
0.5085200667  
0.6009328601  
0.7008631063  
0.8090327635  
0.9230859045  
1.037119751  
1.141872597  
1.225561858  
1.275272956  
1.278705897  
1.226030933  
1.111587062  
0.9351684116  
0.7026997017  
0.4261666638  
0.1227880701  
-0.1865275969  
-0.4792651042  
-0.7337021103  
-0.9313443946  
-1.05909516  
-1.110886495  
-1.088547282  
-1.001759597  
-0.8670750931  
-0.7060717472  
-0.5428473546  
-0.4011439791  
-0.301453544  
-0.2584836632  
-0.2793203372  
-0.3625523128  
-0.4984834326  
-0.6704450161  
-0.8570159209  
-1.034880209  
-1.18191252  
-1.280061218  
-1.317630315  
-1.290631083  
-1.203028876  
-1.065870652  
-0.8954495481  
-0.7108097083  
-0.5309830434  
-0.3723905123  
-0.2467861072  
-0.1600415671  
-0.1118951278  
-0.09665436183  
-0.1046722244  
-0.1242955595  
-0.1439392791  
-0.1539258973  
-0.1477964403  
-0.1229198177  
-0.0803505437  
-0.02402766818  
0.04046942149  
0.1073376032  
0.1718495071  
0.2312662173  
0.2852118206  
0.3354360769  
0.3850347221  
0.4373038997  
0.4944589215  
0.5564939264  
0.6204391061  
0.6801927314  
0.7270069955  
0.7506105442  
0.7408101777  
0.6893238953  
0.591567192  
0.4480699895  
0.2652683795  
0.05549178697  
-0.1639166253  
-0.3722712862  
-0.5478095956  
-0.6702544303  
-0.723318996  
-0.6968009899  
-0.5879645112  
-0.4020040183  
-0.1515221877  
0.1448958553  
0.4648199645  
0.7844963303  
1.081413164  
1.336530863  
1.535905566  
1.671498935  
1.741119045  
1.747587009  
1.697311862  
1.598579637  
1.459860316  
1.288437647  
1.089587582  
0.8664061123  
0.6203028757  
0.3520004879  
0.06283668346  
-0.2439259026  
-0.5620594066  
-0.8818392722  
-1.19017273  
-1.471426365  
-1.708864073  
-1.88651097  
-1.991171802  
-2.014298502  
-1.953423662  
-1.812917108  
-1.603938538  
-1.343551957  
-1.053096751  
-0.7560250447  
-0.4754584299  
-0.2317904266  
-0.04062453873  
0.08870241745  
0.1538395642  
0.1593205998  
0.1156911538  
0.03799357137  
-0.05617453282  
-0.1487677204  
-0.2233179507  
-0.266635834  
-0.2700156807  
-0.2298319037  
-0.1475120374  
-0.02893290992  
0.1166392994  
0.2778963639  
0.4429454026  
