-0.2559037833  
-0.3004158518  
-0.3544877829  
-0.4259309995  
-0.5200845226  
-0.6392473361  
-0.7825863895  
-0.9465127854  
-1.125425572  
-1.312683851  
-1.501618236  
-1.686399434  
-1.862625688  
-2.027536472  
-2.179848902  
-2.319275657  
-2.445863014  
-2.559294567  
-2.658343424  
-2.740604802  
-2.802579609  
-2.840124598  
-2.849184621  
-2.826687885  
-2.77140515  
-2.684615637  
-2.57041242  
-2.435557585  
-2.28887327  
-2.140228641  
-1.999268437  
-1.874060852  
-1.76989235  
-1.688388038  
-1.627117046  
-1.579757316  
-1.536815174  
-1.486807773  
-1.417748462  
-1.318725469  
-1.181356241  
-1.000905471  
-0.7769206166  
-0.5132995898  
-0.2177915082  
0.09898650534  
0.424855094  
0.7475115316  
1.055884847  
1.341215646  
1.59771411  
1.822731125  
2.016442664  
2.181128569  
2.320197688  
2.437131601  
2.534520587  
2.613363096  
2.672719324  
2.709761931  
2.720203792  
2.699006106  
2.641254414  
2.543048344  
2.402288687  
2.219238759  
1.996809242  
1.740546361  
1.458337944  
1.159899258  
0.8560970514  
0.5581949913  
0.277073415  
0.02248861421  
-0.1975956772  
-0.3775614723  
-0.514553507  
-0.6087120049  
-0.6632144828  
-0.6840663743  
-0.6796472788  
-0.6600003852  
-0.6358998689  
-0.617764079  
-0.6145060648  
-0.632456221  
-0.6744917724  
-0.7395086761  
-0.8223285996  
-0.9141126986  
-1.003260751  
-1.076726125  
-1.121601183  
-1.126791947  
-1.084555674  
-0.9916994208  
-0.8502528557  
-0.6675052137  
-0.4553618418  
-0.2290837463  
-0.005546828006  
0.1987736263  
0.3698302667  
0.4977836474  
0.5782992195  
0.6131789158  
0.610235765  
0.582409487  
0.5462187299  
0.519743015  
0.5203613331  
0.5625442445  
0.6559520245  
0.8040897795  
1.003682148  
1.244843177  
1.512037384  
1.785700544  
2.044335232  
2.266821248  
2.434646769  
2.533810197  
2.556142451  
2.49992138  
2.369714372  
2.175500702  
1.93122093  
1.652967757  
1.357076476  
1.058369507  
0.7687844346  
0.4965279672  
0.2458370851  
0.01731374157  
-0.1912715767  
-0.3838797325  
-0.5649932496  
-0.7385105104  
-0.9068893581  
-1.070655458  
-1.228310693  
-1.376607784  
-1.511112504  
-1.626923718  
-1.719417387  
-1.784897985  
-1.821055232  
-1.827185817  
-1.804181376  
-1.754311909  
-1.680885821  
-1.587859012  
-1.479471471  
-1.359967745  
-1.233423688  
-1.10368776  
-0.9743927634  
-0.8490124107  
-0.7308987363  
-0.6232694066  
-0.5291264041  
-0.4510935874  
-0.3912113068  
-0.350714389  
-0.3298340333  
-0.3276717108  
-0.3421570993  
-0.3701072817  
-0.4073744971  
-0.4490656792  
-0.4898023204  
-0.524002189  
-0.5461665702  
-0.5511592837  
-0.534485985  
-0.4925717583  
-0.4230361757  
-0.3249594608  
-0.1991164576  
-0.04814343151  
0.1233899468  
0.3090565266  
0.5008081293  
0.6893874269  
0.8649042371  
1.017537116  
1.138298211  
1.219798691  
1.25692941  
1.247383653  
1.191963902  
1.094627556  
0.9622517274  
0.8041364451  
0.6312742102  
0.4554538866  
0.2882783464  
0.1401927508  
0.01961102282  
-0.06777008291  
-0.1194029296  
-0.13602523  
-0.1215026292  
-0.08238196149  
-0.0272122038  
0.0342973399  
0.09220524194  
0.1372735227  
0.1618259659  
0.1604588601  
0.1305555131  
0.07254542087  
-0.01009934966  
-0.1111595085  
-0.2222240041  
-0.333487177  
-0.4347137908  
-0.5162931985  
-0.570279818  
-0.5912942597  
-0.5771862239  
-0.5293417254  
-0.4525986529  
-0.3547245426  
-0.2455268769  
-0.1356694325  
-0.03535377479  
0.04697155183  
0.1056905185  
0.1387273287  
0.1477836127  
0.1380459006  
0.1174056918  
0.09528477619  
0.08124884139  
0.08358164432  
0.1080565875  
0.1570637863  
0.2292304372  
0.3195886775  
0.4202622416  
0.5215679944  
0.6133638052  
0.6864492322  
0.7337995001  
0.7514716805  
0.739044371  
0.6995480469  
0.6389038085  
0.5649783119  
0.4863960091  
0.4113005254  
0.3462356984  
0.2953142202  
0.259769515  
0.237940406  
0.2256738414  
0.2170660831  
0.2054232004  
0.1843067406  
0.1485187563  
0.09491315916  
0.02292956052  
-0.0651838317  
-0.1644763742  
-0.2677056587  
-0.3659924801  
-0.44966088  
-0.5091748002  
-0.5361088617  
-0.5240654731  
-0.4694771951  
-0.3722275853  
-0.2360304022  
-0.06850819135  
0.1190613772  
0.3123713276  
0.4950540524  
0.6499805651  
0.7607834595  
0.8134772453  
0.7980334017  
0.7097024406  
0.5499177926  
0.3266259782  
0.0539330836  
-0.2489416004  
-0.5593501072  
-0.8533834287  
-1.108286058  
-1.304836725  
-1.429393385  
-1.475330414  
-1.443663199  
-1.342753046  
-1.187116508  
-0.995471197  
-0.7882812361  
-0.585120122  
-0.402205862  
-0.2504514934  
-0.134279396  
-0.05136444819  
0.006688119289  
0.05283025772  
0.1024626163  
0.1710389185  
0.2717166226  
0.413380609  
0.5992969146  
0.8265522291  
1.086312761  
1.364835397  
1.645045077  
1.908442703  
2.137074891  
2.315310628  
2.431222645  
2.47744986  
2.451481215  
2.355416485  
2.195284001  
1.980075706  
1.720649725  
1.428654268  
1.11559913  
0.7921548128  
0.4677108152  
0.1501886221  
-0.1539347674  
-0.4394574241  
-0.7022148719  
-0.9388377809  
-1.146565734  
-1.323145534  
-1.466831021  
-1.576475018  
-1.651677549  
-1.692960818  
-1.701924391  
-1.681332731  
-1.635104787  
-1.568178434  
-1.486252207  
-1.39540213  
-1.301613499  
-1.210275596  
-1.12568246  
-1.050618751  
-0.9860768896  
-0.9311636465  
-0.8832199923  
-0.8381641434  
-0.7910345581  
-0.7366731312  
-0.6704848878  
-0.5891630609  
-0.4913004941  
-0.3777756491  
-0.2518669245  
-0.1190384386  
0.01357213631  
0.137934073  
0.2460762287  
0.3310887209  
0.3880548396  
0.41477759  
0.4121979785  
0.3844275669  
0.3383833924  
0.2830423892  
0.2283986614  
0.184247411  
0.1589387845  
0.1582680606  
0.1846412409  
0.2366426376  
0.3090639258  
0.3934172413  
0.4788682235  
0.5534980313  
0.6057209546  
0.6257082157  
0.6066067213  
0.5454326981  
0.4435036349  
0.3063698204  
0.1432638228  
-0.03386399913  
-0.2115833588  
-0.3763444753  
-0.5157885355  
-0.6198654846  
-0.6816361016  
-0.6977056068  
-0.66826199  
-0.5967656259  
-0.489365293  
-0.3541346005  
-0.2002328732  
-0.03709793219  
0.126264382  
0.2818328105  
0.4229535059  
0.5445388862  
0.6431214423  
0.7167833336  
0.7650040163  
0.7884644776  
0.7888357952  
0.7685807944  
0.7307751907  
0.6789652394  
0.6170489177  
0.5491797716  
0.4796762719  
0.4129192644  
0.3532277552  
0.3047018188  
0.2710176063  
0.2551997682  
0.2593673485  
0.2844918795  
0.330192642  
0.3946065922  
0.4743671872  
0.5647083106  
0.6597203106  
0.7527214181  
0.8367533744  
0.905126051  
0.9519749374  
0.9727691539  
0.9647105335  
0.9269814397  
0.8608200404  
0.7694083059  
0.6575956136  
0.5314861642  
0.3979332622  
0.2639971363  
0.1364085896  
0.02109036303  
-0.07723798818  
-0.155334421  
-0.211585496  
-0.2460267308  
-0.2602341263  
-0.2571131402  
-0.2405853865  
-0.2152175031  
-0.1858148949  
-0.1570016711  
-0.132843085  
-0.1165202468  
-0.1100967885  
-0.1143956321  
-0.1289974424  
-0.1523665893  
-0.1820865995  
-0.2151931652  
-0.2485626608  
-0.2793282362  
-0.3052667061  
-0.3251282474  
-0.3388604854  
-0.3476933755  
-0.3540844509  
-0.361500953  
-0.3740678965  
-0.3961023704  
-0.4315809091  
-0.4835949771  
-0.5538522615  
-0.6422848107  
-0.746815971  
-0.8633284271  
-0.9858575508  
-1.106998762  
-1.218511725  
-1.312056588  
-1.379995822  
-1.416162763  
-1.416507934  
-1.379541749  
-1.306504256  
-1.201242466  
-1.069797762  
-0.9197560914  
-0.7594432501  
-0.5970665177  
-0.4399104013  
-0.2936973726  
-0.1621669048  
-0.04693902885  
0.05236044111  
0.1377313837  
0.2122715834  
0.2795565397  
0.3430394091  
0.4055297156  
0.4688365206  
0.5335922173  
0.5992770102  
0.6644123286  
0.7268833666  
0.7843263059  
0.834518428  
0.8757099734  
0.9068487484  
0.9276779962  
0.9386900168  
0.9409558534  
0.9358718938  
0.9248522371  
0.9090336915  
0.8890334702  
0.8647996351  
0.8355866295  
0.800054523  
0.7564912592  
0.7031215135  
0.6384628194  
0.5616790464  
0.472869651  
0.3732587981  
0.2652359408  
0.1522460921  
0.0385260251  
-0.07127590952  
-0.1725508026  
-0.2611962855  
-0.3340290841  
-0.3891024865  
-0.4258833496  
-0.4452676626  
-0.4494579321  
-0.4416965226  
-0.425919153  
-0.4063500876  
-0.3870914877  
-0.3717320227  
-0.3630122945  
-0.3625560194  
-0.3706893027  
-0.3863493284  
-0.4070983123  
-0.4292498448  
-0.4481036857  
-0.4583010597  
-0.4542770241  
-0.4307878264  
-0.383480426  
-0.3094427166  
-0.2076816804  
-0.07945876943  
0.07156241987  
0.2394099309  
0.4161428573  
0.5924339982  
0.7583437621  
0.9042224685  
1.021637441  
1.104232494  
1.148398983  
1.153688541  
1.122892722  
1.061778508  
0.9784905567  
0.8826896431  
0.7845208422  
0.693530545  
0.6176646026  
0.5624671487  
0.5305678291  
0.5215244716  
0.5320293007  
0.55644358  
0.5875896961  
0.6176864109  
0.639316529  
0.6462919388  
0.6343212099  
0.6013967309  
0.5478800814  
0.4762812047  
0.3907940557  
0.2966639126  
0.1994864868  
0.1045435075  
0.01625229678  
-0.06219773624  
-0.129005438  
-0.1837216049  
-0.2270387686  
-0.260481243  
-0.2860534723  
-0.3059027809  
-0.3220551286  
-0.3362454386  
-0.3498590609  
-0.3639638427  
-0.3794080652  
-0.3969537214  
-0.4173957558  
-0.441641668  
-0.4707177908  
-0.5057071293  
-0.5475999245  
-0.5970966734  
-0.6543790053  
-0.7188900282  
-0.7891601571  
-0.8627231125  
-0.9361408287  
-1.005165903  
-1.065039318  
-1.110913431  
-1.138366569  
-1.143961605  
-1.125786682  
-1.083903972  
-1.020647465  
-0.9406881263  
-0.8508470513  
-0.7596243282  
-0.6764699584  
-0.6108546317  
-0.5712230799  
-0.5639474393  
-0.5924077539  
-0.6563201865  
-0.7514182271  
-0.8695515626  
-0.9992276364  
-1.126550546  
-1.23648666  
-1.314306705  
-1.347067278  
-1.324946904  
-1.242286779  
-1.09822175  
-0.896819488  
-0.6467261111  
-0.3603590597  
-0.05274779029  
0.2598299733  
0.5612780042  
0.8370104301  
1.075061587  
1.266881041  
1.407759003  
1.496894957  
1.537123996  
1.534375094  
1.496932374  
1.434586884  
1.357759248  
1.276656281  
1.200532991  
1.137092226  
1.092072062  
1.069018667  
1.069269068  
1.092124919  
1.135185987  
1.194808572  
1.266615643  
1.346009187  
1.428597355  
1.51048897  
1.588410719  
1.659644672  
1.721809427  
1.772539718  
1.809161706  
1.828444429  
1.826525361  
1.799066579  
1.741653623  
1.650407391  
1.522712461  
1.357947855  
1.158055737  
0.9278400635  
0.6748720748  
0.4089817255  
0.1413733007  
-0.1165401128  
-0.3544072078  
-0.5641259944  
-0.7407623976  
-0.8830483689  
-0.993368221  
-1.077245351  
-1.142385804  
-1.197441434  
-1.250667244  
-1.308681593  
-1.375505933  
-1.452007063  
-1.535825736  
-1.621759042  
-1.702540659  
-1.769886527  
-1.815643196  
-1.832881675  
-1.816794597  
-1.765288032  
-1.679210487  
-1.562223492  
-1.420349929  
-1.26129695  
-1.093649496  
-0.9260597591  
-0.7665290177  
-0.62186281  
-0.4973330075  
-0.3965640381  
-0.3215952501  
-0.273068081  
-0.2504560804  
-0.2522723332  
-0.2761927385  
-0.3190727403  
-0.3768719151  
-0.4445239245  
-0.5158370478  
-0.5834955499  
-0.6392450151  
-0.6743101644  
-0.6800486556  
-0.648799156  
-0.574831854  
-0.4552645012  
-0.290809611  
-0.08619166566  
0.1498536477  
0.4050707449  
0.6646351206  
0.9124970867  
1.132958368  
1.312303218  
1.440272036  
1.511199394  
1.524649298  
1.485472284  
1.403265395  
1.291282347  
1.164949087  
1.040132021  
0.9313828548  
0.8503590784  
0.8045957547  
0.7967691573  
0.8245221199  
0.8808599974  
0.9550613994  
1.033981049  
1.103607797  
1.150682059  
1.164201662  
1.136661162  
1.064882928  
0.9503717463  
0.7991622529  
0.6211817712  
0.4292131477  
0.2375689777  
0.06062266346  
-0.08863842774  
-0.1999010316  
-0.2665071628  
-0.2860407111  
-0.2604574719  
-0.1957634053  
-0.1012713156  
0.01145621569  
0.1298682858  
0.2417382284  
0.3363817688  
0.4056492569  
0.4445839957  
0.4516914986  
0.4287987696  
0.3805428399  
0.3135672626  
0.2355384419  
0.1541105899  
0.0759735609  
0.006107161654  
-0.05268381366  
-0.09989112743  
-0.1370942194  
-0.1674625671  
-0.1950633766  
-0.2240892902  
-0.2581266265  
-0.2995850471  
-0.3493673203  
-0.40682522  
-0.4699924991  
-0.5360436513  
-0.6018818502  
-0.664744027  
-0.7227259011  
-0.7751069701  
-0.8224474874  
-0.8664260421  
-0.9094505455  
-0.9541217816  
-1.002632882  
-1.05620675  
-1.114675353  
-1.176240111  
-1.237473776  
-1.293535922  
-1.338570656  
-1.366225776  
-1.370209632  
-1.344826743  
-1.285429122  
-1.188754004  
-1.053149495  
-0.8786924706  
-0.6672413993  
-0.4224449705  
-0.1497428434  
0.1436494062  
0.4487794359  
0.7550646152  
1.050507141  
1.322084584  
1.556330696  
1.740133017  
1.86170439  
1.911663643  
1.884110355  
1.777559193  
1.595597727  
1.347127789  
1.046112532  
0.7107832054  
0.3623423942  
0.02326499215  
-0.2846480542  
-0.5422521858  
-0.7348529938  
-0.8536005496  
-0.896303282  
-0.8675604181  
-0.7781729817  
-0.643903614  
-0.4837181654  
-0.3177193684  
-0.1650128232  
-0.0417604425  
0.0403655409  
0.0751523657  
0.06215109395  
0.006306973452  
-0.08300820152  
-0.1934101302  
-0.3111714027  
-0.4229277454  
-0.5171955959  
-0.5855392746  
-0.6232493921  
-0.6294816819  
-0.6068782083  
-0.5607520691  
-0.4979845934  
-0.4258058003  
-0.3506456395  
-0.2772194944  
-0.2079744764  
-0.1429620199  
-0.08013656797  
-0.01601254564  
0.05343511169  
0.131789802  
0.2212892209  
0.3221525949  
0.4322428229  
0.5471309784  
0.6605367085  
0.7650975521  
0.8533280621  
0.9186385264  
0.9562562287  
0.9639140582  
0.942216314  
0.8946325228  
0.827129653  
0.7474996863  
0.6644790345  
0.5867764346  
0.5221250633  
0.4764873685  
0.4534728833  
0.4540464603  
0.476536871  
0.5169240405  
0.5693814612  
0.626983552  
0.682514711  
0.7292810352  
0.7618487272  
0.7766191918  
0.7721968683  
0.7494990752  
0.7116030899  
0.6633458636  
0.6107164709  
0.560114909  
0.5175492669  
0.4878770868  
0.4741611609  
0.4772313655  
0.4955014892  
0.5250610808  
0.5600445184  
0.5932367535  
0.6168445156  
0.6233537942  
0.6063694951  
0.5613410497  
0.4860890397  
0.3810809457  
0.2494087312  
0.09648548492  
-0.07050098754  
-0.2433235579  
-0.4135401697  
-0.5733195835  
-0.7161763773  
-0.8375325537  
-0.935050325  
-1.008710773  
-1.060633551  
-1.094676142  
-1.115860314  
-1.129711396  
-1.141575043  
-1.156005767  
-1.17628842  
-1.204132889  
-1.239579659  
-1.281099984  
-1.325862552  
-1.370127247  
-1.409696157  
-1.440362306  
-1.458314564  
-1.460437461  
-1.444502229  
-1.40923182  
-1.354257932  
-1.279992539  
-1.187444304  
-1.07800761  
-0.9532607865  
-0.8147892429  
-0.664054801  
-0.5023214968  
-0.3306389847  
-0.1498952596  
0.03907897734  
0.2353463239  
0.4376620883  
0.6442510608  
0.8525881526  
1.059219854  
1.25965435  
1.448371759  
1.618962488  
1.764436858  
1.877678523  
1.952034426  
1.981982578  
1.963811803  
1.896217395  
1.780736371  
1.621925876  
1.427240424  
1.206581747  
0.9715431455  
0.7344345447  
