0.1298867488  
0.08793949897  
0.05020616673  
0.02620143228  
0.02550075945  
0.05729053466  
0.1297182458  
0.2490569894  
0.4187518921  
0.6384597166  
0.903250558  
1.203142112  
1.523133685  
1.843853534  
2.142862282  
2.396554867  
2.582496341  
2.681944754  
2.682239475  
2.578728183  
2.37592523  
2.087687612  
1.736309473  
1.350575313  
0.9629758895  
0.6063813526  
0.3105782919  
0.09907654172  
-0.0134092649  
-0.02250931855  
0.06541762197  
0.2341097385  
0.4593342628  
0.7117006043  
0.9600182736  
1.174798101  
1.331498609  
1.413113935  
1.411812533  
1.329421751  
1.176716461  
0.9715995994  
0.7364442117  
0.4949448964  
0.2689350816  
0.07561448566  
-0.07441995007  
-0.1780533003  
-0.2393443989  
-0.2680903715  
-0.2775268234  
-0.281559106  
-0.2919873245  
-0.3162196887  
-0.3558515322  
-0.4063725459  
-0.4580610763  
-0.497925719  
-0.5123673629  
-0.4901156682  
-0.4249359672  
-0.3176229985  
-0.1769296523  
-0.01921957468  
0.1331310874  
0.2543857392  
0.3187702475  
0.3039863842  
0.1944165747  
-0.01643766002  
-0.324629317  
-0.7157021244  
-1.165904146  
-1.644483325  
-2.116772035  
-2.547659219  
-2.905049271  
-3.162912704  
-3.303631518  
-3.319419791  
-3.212727011  
-2.995630412  
-2.688326973  
-2.31690641  
-1.910643489  
-1.499090485  
-1.109236245  
-0.7630330121  
-0.4755044424  
-0.2536459985  
-0.09621758527  
0.005541743692  
0.06636156442  
0.1047228261  
0.1402341959  
0.1909293799  
0.270810344  
0.3879618591  
0.543470306  
0.7313066504  
0.93916895  
1.15020064  
1.345333083  
1.505939663  
1.616448127  
1.666528692  
1.652569584  
1.578210379  
1.453855746  
1.295218016  
1.121089151  
0.9506370608  
0.8006222386  
0.6829281013  
0.6027845407  
0.557961473  
0.5390867466  
0.5310682272  
0.5154602647  
0.4734411342  
0.388999768  
0.2518608101  
0.05971976267  
-0.1805691618  
-0.4530573905  
-0.7340572649  
-0.9946636658  
-1.204120995  
-1.333638709  
-1.360145482  
-1.269513731  
-1.058818954  
-0.737339531  
-0.3261397246  
0.1437188861  
0.6341571883  
1.103890083  
1.512650063  
1.825323337  
2.015538398  
2.068313369  
1.981465025  
1.765652843  
1.443060217  
1.044891029  
0.6079711709  
0.1708412785  
-0.2302248462  
-0.5648378816  
-0.8113700948  
-0.9587948297  
-1.007314314  
-0.9677403233  
-0.8597246781  
-0.7090653098  
-0.5444126837  
-0.3937576643  
-0.2810994775  
-0.2236760302  
-0.2300600459  
-0.2993213101  
-0.4213486417  
-0.5782739786  
-0.7468182513  
-0.9012965768  
-1.016900348  
-1.072893674  
-1.055318099  
-0.9588966762  
-0.7878875978  
-0.5557934638  
-0.2839322828  
0.0009449731853  
0.2697165538  
0.4942532252  
0.6506769227  
0.7221246424  
0.7006763279  
0.5882416825  
0.3963059133  
0.1445928428  
-0.141169422  
-0.4321045017  
-0.699299968  
-0.9168312653  
-1.064335885  
-1.128878837  
-1.105919163  
-0.9993129332  
-0.820405527  
-0.5863630541  
-0.3179900836  
-0.03732236871  
0.2346989628  
0.4802060123  
0.6858222809  
0.8434043566  
0.95009848  
1.007785482  
1.022072464  
1.001023278  
0.953827534  
0.8895845143  
0.8163258094  
0.7403463761  
0.6658592314  
0.594948964  
0.5277699958  
0.4629361614  
0.3980411041  
0.3302498434  
0.2569212926  
0.1761890391  
0.08745033315  
-0.008307598437  
-0.1084068069  
-0.2086450707  
-0.3037436914  
-0.3880418965  
-0.4563619957  
-0.5049169863  
-0.5321156473  
-0.5391106513  
-0.5299552886  
-0.5113029247  
-0.4916285901  
-0.4800522896  
-0.4849147495  
-0.5122954192  
-0.5647116252  
-0.6402148674  
-0.7320496559  
-0.8289767093  
-0.9162634478  
-0.9772363872  
-0.9952256158  
-0.9556581368  
-0.8480264595  
-0.6674884397  
-0.4158798648  
-0.102001594  
0.2588608512  
0.646148665  
1.035838687  
1.402649628  
1.722404809  
1.97428581  
2.142731832  
2.218781604  
2.200714394  
2.093928384  
1.910098808  
1.665720393  
1.380232463  
1.073961508  
0.7661346461  
0.4731990036  
0.2076241416  
-0.02269449887  
-0.2144388867  
-0.3683243198  
-0.4881691198  
-0.5797515619  
-0.6496428821  
-0.7041902724  
-0.7487627202  
-0.7873150324  
-0.8222717849  
-0.8546775281  
-0.88452552  
-0.9111774443  
-0.9337838603  
-0.9516398086  
-0.9644310137  
-0.9723532678  
-0.9761010724  
-0.9767447348  
-0.9755220254  
-0.9735748274  
-0.9716682129  
-0.9699385232  
-0.9677041195  
-0.9633836201  
-0.9545456849  
-0.938110529  
-0.910692379  
-0.8690734933  
-0.8107443363  
-0.7344612393  
-0.6407319539  
-0.5321428868  
-0.4134647667  
-0.2914649105  
-0.1744113608  
-0.0712935397  
0.009185792298  
0.05972740914  
0.07552598373  
0.05516897201  
0.001203252995  
-0.07975956822  
-0.1774499203  
-0.2788630617  
-0.3696054277  
-0.4355084935  
-0.4643122285  
-0.447167231  
-0.3797535007  
-0.2628243474  
-0.1021028168  
0.09249039635  
0.3081565077  
0.5309009338  
0.7473306087  
0.9462926654  
1.120118509  
1.265279354  
1.382373542  
1.475451916  
1.550806149  
1.615396191  
1.675184597  
1.733630648  
1.790582613  
1.841755271  
1.878900519  
1.890679286  
1.864149979  
1.786699275  
1.648169017  
1.442884718  
1.171293487  
0.8409422064  
0.4665939847  
0.06939359855  
-0.3248965116  
-0.6884262971  
-0.9942813705  
-1.219634139  
-1.348616137  
-1.374524137  
-1.301024486  
-1.14216455  
-0.9211157721  
-0.6677756969  
-0.4154809441  
-0.1972218381  
-0.04182830957  
0.02940013228  
0.005191617472  
-0.1143990335  
-0.3180513306  
-0.5845944029  
-0.8855808871  
-1.18869552  
-1.461544257  
-1.675342398  
-1.808051107  
-1.846585467  
-1.78786228  
-1.638622165  
-1.414122023  
-1.135931337  
-0.8291782188  
-0.5196177471  
-0.2309046812  
0.0176305592  
0.2124931072  
0.3467217149  
0.4198057758  
0.4369276322  
0.4077078513  
0.3446578211  
0.2615323691  
0.1717561533  
0.08704302789  
0.01630077315  
-0.03513057378  
-0.06587379404  
-0.07851775892  
-0.07922434621  
-0.0769407477  
-0.08224600261  
-0.1058921523  
-0.1571652532  
-0.2422214546  
-0.3626044307  
-0.5141519342  
-0.6865155634  
-0.8634246778  
-1.023772295  
-1.143485167  
-1.198022261  
-1.165244875  
-1.028329377  
-0.7783480054  
-0.4161764176  
0.04656780593  
0.5877312662  
1.176020078  
1.773479341  
2.338825709  
2.831273254  
3.21444659  
3.459941289  
3.550134022  
3.479927199  
3.257231334  
2.902126255  
2.444799257  
1.922482622  
1.375735483  
0.8444764953  
0.364208943  
-0.03715543233  
-0.3415319049  
-0.5417359508  
-0.6413107812  
-0.6531851569  
-0.5973720881  
-0.4980406174  
-0.3803637036  
-0.2675441451  
-0.178396455  
-0.1257412314  
-0.1157512569  
-0.1482383261  
-0.2177378318  
-0.3151286748  
-0.4295069117  
-0.5499874056  
-0.6672013967  
-0.7742985439  
-0.8674101787  
-0.9455936555  
-1.010368572  
-1.065005107  
-1.113713525  
-1.160880592  
-1.210427204  
-1.265326861  
-1.327284731  
-1.396522789  
-1.471652875  
-1.54960434  
-1.625622245  
-1.693366729  
-1.745182911  
-1.772582456  
-1.766974097  
-1.720619203  
-1.627732883  
-1.48559315  
-1.295473345  
-1.063213065  
-0.7992491876  
-0.5180182184  
-0.2367107786  
0.02651413985  
0.2546432047  
0.4339705285  
0.5559633897  
0.6185306242  
0.6264564798  
0.5908601524  
0.5277263258  
0.4556772648  
0.393299567  
0.3564167422  
0.3557290578  
0.395194718  
0.4714106319  
0.5741147655  
0.6877527493  
0.7938714092  
0.8740056212  
0.9126054379  
0.8995722468  
0.832020602  
0.7149898716  
0.560995598  
0.3884865268  
0.2194146935  
0.07627510852  
-0.02096827302  
-0.05764597942  
-0.02643441971  
0.07155749698  
0.2268321072  
0.4226442113  
0.6370821891  
0.8458037491  
1.025046789  
1.154535544  
1.219888805  
1.214244025  
1.138902199  
1.002934491  
0.8218288684  
0.6153672165  
0.405042785  
0.2113392616  
0.05124598457  
-0.06368749204  
-0.1285139351  
-0.145131425  
-0.1216141537  
-0.07072701403  
-0.00786975498  
0.05125623727  
0.09292566437  
0.1072812657  
0.08959560123  
0.04072144656  
-0.03329070922  
-0.1223293219  
-0.2139210424  
-0.2952195265  
-0.3549745526  
-0.3852018855  
-0.3823192677  
-0.347605234  
-0.2869541829  
-0.209994224  
-0.1287304804  
-0.05592706074  
-0.003456576264  
0.01915555357  
0.005830569711  
-0.04543088734  
-0.1324199556  
-0.249056615  
-0.3861140382  
-0.5322188993  
-0.6749854851  
-0.8021753477  
-0.9027629722  
-0.9678421722  
-0.9913096321  
-0.9703028725  
-0.9053830393  
-0.800466271  
-0.6625171141  
-0.5010260477  
-0.3272987118  
-0.1535975508  
0.007817705342  
0.1456798803  
0.2506605684  
0.3161937595  
0.3390824256  
0.3198297117  
0.2626371443  
0.1750543986  
0.06730445414  
-0.04865837319  
-0.1602720858  
-0.2555474052  
-0.3241884582  
-0.3585266656  
-0.3541781451  
-0.3103479  
-0.2297687752  
-0.1182889293  
0.0158285272  
0.1627955703  
0.3122725959  
0.4543070279  
0.5801396482  
0.6828094777  
0.7575129218  
0.8017231078  
0.8150872023  
0.7991513727  
0.7569746015  
0.6926760115  
0.6109763728  
0.5167645884  
0.4147179478  
0.3090065774  
0.2030897044  
0.09962496806  
0.0004990227576  
-0.09302092308  
-0.1800273411  
-0.2596397753  
-0.3306514518  
-0.3912153402  
-0.4386584285  
-0.469473813  
-0.4795499639  
-0.4646357365  
-0.4210117109  
-0.3462953316  
-0.2402511507  
-0.1054913641  
0.05207685392  
0.2231618126  
0.3954122077  
0.5541710245  
0.6835970537  
0.7680605535  
0.7936698333  
0.7497686867  
0.6302484974  
0.434533213  
0.1681261112  
-0.1573609158  
-0.5247251335  
-0.9122309474  
-1.295142338  
-1.647632678  
-1.944914928  
-2.165405464  
-2.29272263  
-2.317281979  
-2.237321924  
-2.059201948  
-1.796899693  
-1.470746114  
-1.105497175  
-0.7279649475  
-0.3644622821  
-0.03836292676  
0.2319454595  
0.4344914386  
0.5643975132  
0.6237732802  
0.6208856069  
0.5687708168  
0.4834904668  
0.382268226  
0.2817262427  
0.1963938791  
0.1376076903  
0.1128559134  
0.1255656986  
0.1752690809  
0.2580756193  
0.3673559805  
0.4945359641  
0.6299294956  
0.7635351063  
0.8857602059  
0.9880408919  
1.063326861  
1.106449395  
1.114349657  
1.086183012  
1.023301502  
0.9291253056  
0.8089120357  
0.6694319225  
0.5185639183  
0.3648209507  
0.2168246152  
0.08274072551  
-0.03029762371  
-0.1167444289  
-0.1731360586  
-0.1984824609  
-0.1944974138  
-0.165630715  
-0.1188551532  
-0.0632021466  
-0.009042631625  
0.03284178531  
0.05233930849  
0.04114020685  
-0.006177674915  
-0.09124096093  
-0.2112446755  
-0.3587056448  
-0.5216587799  
-0.6843432426  
-0.828363763  
-0.9342718224  
-0.9834564165  
-0.9601887441  
-0.8536123883  
-0.6594533746  
-0.3812243668  
-0.03069966896  
0.3724666269  
0.8020625642  
1.227501892  
1.616709078  
1.939399173  
2.170371229  
2.292394777  
2.298280162  
2.191813978  
1.987378566  
1.708253401  
1.383789196  
1.045816909  
0.7247735315  
0.4460763913  
0.2272491451  
0.07618318512  
-0.009254818831  
-0.04025928042  
-0.03495838519  
-0.01549584004  
-0.004768065774  
-0.02330890748  
-0.086752949  
-0.2041701396  
-0.3774321318  
-0.6015630521  
-0.8659027968  
-1.155793677  
-1.454458679  
-1.744764182  
-2.010634174  
-2.238004836  
-2.415311632  
-2.53361326  
-2.586516602  
-2.570071648  
-2.482772905  
-2.325726952  
-2.102955161  
-1.821728812  
-1.492769112  
-1.130151656  
-0.7507880064  
-0.3734375488  
-0.01729453282  
0.2996924937  
0.5625469754  
0.7607751619  
0.8894138848  
0.9494296735  
0.9473868005  
0.8944175317  
0.8046374346  
0.6932558756  
0.5746591503  
0.4607659568  
0.3598829118  
0.2762175555  
0.2100824924  
0.1587112114  
0.1175020788  
0.08145252313  
0.04651445036  
0.01063766436  
-0.02568270659  
-0.05942054238  
-0.08558089751  
-0.09818587884  
-0.09150774847  
-0.0613239949  
-0.00597612152  
0.07292542734  
0.1702777763  
0.2777657392  
0.3846023019  
0.4786391238  
0.5476825444  
0.5808704275  
0.569933267  
0.5102119833  
0.4013102831  
0.2473323439  
0.05666696465  
-0.1586499189  
-0.3839352545  
-0.6031304391  
-0.800215971  
-0.9606322423  
-1.072566221  
-1.127979281  
-1.123262957  
-1.059472647  
-0.9421106046  
-0.7805013592  
-0.586829963  
-0.3749647647  
-0.159205779  
0.04691170091  
0.2316221083  
0.38566305  
0.502686391  
0.5793553562  
0.6151726721  
0.6121221039  
0.5742130932  
0.5070277665  
0.4173073502  
0.3126333721  
0.2011695075  
0.09143738585  
-0.007940397353  
-0.08858503271  
-0.1428324383  
-0.1643305084  
-0.148722963  
-0.09433834436  
-0.002775361743  
0.1207459748  
0.2673684086  
0.4250119247  
0.5792279216  
0.7144633091  
0.815620724  
0.8697397336  
0.8675968492  
0.8049938236  
0.6835463452  
0.5108293628  
0.2998201821  
0.06768803937  
-0.1659453757  
-0.3810456734  
-0.5592529882  
-0.6857552632  
-0.7506926748  
-0.7499542075  
-0.6852731299  
-0.5636653041  
-0.3963269791  
-0.1971802191  
0.01870760214  
0.2366172646  
0.4434026663  
0.6283383704  
0.7835533846  
0.9040817165  
0.9876328993  
1.034189974  
1.045557244  
1.024954213  
0.9766941802  
0.9059589038  
0.8186157433  
0.7210273449  
0.619787547  
0.5213563331  
0.4315911818  
0.3552283527  
0.2953979218  
0.2532641426  
0.2278936514  
0.2163965646  
0.2143678454  
0.2165604881  
0.2177179662  
0.2134099464  
0.2007408382  
0.1788032586  
0.1487826974  
0.1136987358  
0.07781296038  
0.04581351904  
0.02191655096  
0.009039011763  
0.008198981563  
0.01824004701  
0.03592170704  
0.05635740106  
0.07370486711  
0.08197766857  
0.07583115074  
0.05118604023  
0.00559543325  
-0.06168545769  
-0.1498998001  
-0.2571849286  
-0.3810497155  
-0.5188171312  
-0.667927678  
-0.8260357659  
-0.9908998622  
-1.160102449  
-1.330690284  
-1.498851806  
-1.659744367  
-1.807550825  
-1.935816684  
-2.038040306  
-2.10844341  
-2.142795681  
-2.139146291  
-2.098305293  
-2.023963767  
-1.922385175  
-1.801671127  
-1.670685135  
-1.537781552  
-1.409528058  
-1.289626315  
-1.178223573  
-1.071745809  
-0.963324758  
-0.8437833906  
-0.7030746287  
-0.5319821525  
-0.3238403731  
-0.07602668128  
0.2090217878  
0.5234269807  
0.8542307302  
1.184482261  
1.494933876  
1.766154887  
1.980778208  
2.125603996  
2.193263767  
2.183227005  
2.10199847  
1.962467963  
1.782478365  
1.58279027  
1.384679517  
1.207483019  
1.066376459  
0.9706703987  
0.9228298469  
0.9183222617  
0.946308784  
0.9910871487  
1.034082618  
1.056156438  
1.039931499  
0.9718721559  
0.8438758501  
0.6542148383  
0.4077437695  
0.1153965181  
-0.2069399652  
-0.5400041206  
-0.8629934931  
-1.155433813  
-1.398897881  
-1.578407656  
-1.683428837  
-1.70840689  
-1.652852836  
-1.521042536  
-1.321402346  
-1.065686871  
-0.7680472468  
-0.4440749776  
-0.1098951536  
0.2186470596  
0.5266787701  
0.8008639918  
1.029849704  
1.204604859  
1.318669855  
1.36833531  
1.352746411  
1.273944229  
1.136815859  
0.9489562814  
0.7203936766  
0.4631877383  
0.1908649936  
-0.08228167098  
-0.3420116196  
-0.5750275979  
-0.7698561661  
-0.9176517225  
-1.012824758  
-1.05342791  
-1.041242804  
-0.981551307  
-0.8825936003  
-0.7547760982  
-0.6096994681  
-0.4591176303  
-0.3139275455  
-0.183303817  
-0.07405666866  
0.009726642733  
0.06673387262  
0.0981960202  
0.107413766  
0.09912650978  
0.07880790701  
0.05198186224  
0.02363808369  
-0.002194047099  
-0.02268565418  
-0.0362586943  
-0.04248099756  
