798.4846188  
830.3700683  
901.3980081  
1058.245462  
1187.680223  
353.5754454  
17976.95912  
8746.22802  
9020.345758  
3348.250539  
14760.99895  
1409.056981  
11183.29106  
4971.255722  
832.302236  
807.0208068  
20163.33023  
4193.426965  
3950.000221  
475.9264563  
46917.56418  
14580.82219  
62237.03251  
30958.11087  
41311.03215  
4852.483541  
10533.02282  
2263.182448  
3502.052442  
18046.54042  
14247.58712  
1979.187249  
867.4531892  
3274.688742  
836.9020808  
10808.99143  
5981.030628  
1101.490752  
258.8027258  
3164.450459  
5497.025478  
7840.418996  
1819.39389  
3570.076514  
9433.394449  
2790.056269  
17846.6313  
5776.512279  
221.2713686  
4726.893313  
2865.983072  
6376.211637  
7864.915186  
2555.505197  
2602.513838  
1302.538891  
2480.911031  
3132.629181  
1044.900413  
7888.037182  
1256.413024  
950.0360136  
1427.338353  
523.7623686  
221.4202522  
68.56032108  
124.4811994  
166.7017424  
55.26178969  
26.85889878  
116.9749933  
37.69773342  
23.72863036  
22.16859767  
4.896975478  
12.15571146  
18.80519016  
18.47641865  
8.959404376  
11.49666955  
6.339136946  
6.836722545  
4.09604359  
9.145191156  
7.337731163  
6.755947195  
5.555080279  
4.602424355  
4.127608982  
4.423694545  
3.739817635  
3.63568648  
3.586233734  
3.364923902  
3.165944834  
3.011084357  
2.815303242  
2.668538724  
2.549867278  
2.435941874  
2.334548881  
2.218443606  
2.076991344  
1.958073547  
1.88082959  
1.818774306  
1.736585162  
1.658615549  
1.581547254  
1.510514276  
1.44905586  
1.38713657  
1.327871667  
1.276283914  
1.227207878  
1.175293453  
1.132101251  
1.085929144  
1.046156403  
1.005961858  
0.9699173008  
0.9330702248  
0.8992720214  
0.8651601283  
0.8342572709  
0.8041629585  
0.7766567368  
0.7492696944  
0.7234624338  
0.6988108112  
0.6750982177  
0.6521538918  
0.6303417833  
0.6097497133  
0.5898796424  
0.5708061777  
0.5524975404  
0.5348196275  
0.5179539191  
0.5016125785  
0.4860322533  
0.4710593838  
0.4567033211  
0.4428050094  
0.4294719335  
0.4166409514  
0.4043028891  
0.3924042592  
0.3809346162  
0.3698966774  
0.3592534704  
0.3489917379  
0.339098489  
0.3295666331  
0.3203589332  
0.3114606391  
0.3028694688  
0.2945814195  
0.2865746619  
0.2788378234  
0.2713527785  
0.2641179408  
0.2571359648  
0.2503622329  
0.2438294769  
0.2374912897  
0.2313688163  
0.2254304252  
0.2196911454  
0.2141195849  
0.2087362323  
0.2035144354  
0.1984504374  
0.1935448564  
0.1887921831  
0.1841806024  
0.1797040155  
0.1753663744  
0.171157602  
0.1670660788  
0.1631006551  
0.1592501326  
0.1555139166  
0.1518856815  
0.1483527247  
0.1449290038  
0.1416021684  
0.1383612629  
0.1352209782  
0.1321629618  
0.1291884577  
0.1263029684  
0.1234875941  
0.1207538053  
0.1180874081  
0.1154962312  
0.1129828155  
0.1105290504  
0.108141878  
0.1058140117  
0.1035498742  
0.1013513855  
0.09919800712  
0.09711156804  
0.09506656727  
0.09308339013  
0.09115343814  
0.08925430485  
0.08742231083  
0.08562438196  
0.08387754754  
0.08217570494  
0.08051527132  
0.07889068201  
0.0773030188  
0.07576019035  
0.07425334744  
0.07278985568  
0.07135040415  
0.06994983655  
0.06858143653  
0.06724362577  
0.06594086234  
0.06466454784  
0.06342654266  
0.06221152603  
0.06102242031  
0.0598643192  
0.05873591393  
0.05762768954  
0.05654290693  
0.05548436388  
0.05445856724  
0.05344191359  
0.052454814  
0.05148635564  
0.05054156207  
0.0496208895  
0.04871451569  
0.0478360989  
0.04696973196  
0.04612154974  
0.04529536042  
0.0444861121  
0.04369107976  
0.0429168147  
0.04215678317  
0.04141610138  
0.04069003726  
0.03997774023  
0.03927950181  
0.03859830666  
0.03792649442  
0.03727535715  
0.03663362339  
0.03600324919  
0.03538862435  
0.03478467031  
0.03419686556  
0.03361803576  
0.03305560417  
0.03249615577  
0.03195211002  
0.03141878695  
0.03089673085  
0.03038429353  
0.02988371727  
0.02938993955  
0.02890619286  
0.02843243038  
0.02796628902  
0.02751462857  
0.02706703313  
0.02662768295  
0.02619842087  
0.0257749521  
0.02535977814  
0.0249560533  
0.02455690673  
0.02417222432  
0.02378676397  
0.02340984637  
0.0230394902  
0.02267979063  
0.02232524164  
0.02197660234  
0.02163200081  
0.02130150127  
0.02096848847  
0.02064482187  
0.02032457303  
0.02001495717  
0.01970885131  
0.01940758758  
0.01911375744  
0.01882216289  
0.01853806564  
0.01825766189  
0.01798447512  
0.01771047889  
0.01744656268  
0.01718526483  
0.01693117519  
0.01667938285  
0.01643417571  
0.01618963068  
0.0159514277  
0.01571551501  
0.01548522433  
0.01525851765  
0.01503698321  
0.01481948108  
0.014601807  
0.01439394848  
0.01418388564  
0.01398137503  
0.0137790697  
0.01358496296  
0.01338984359  
0.01319733177  
0.01300915129  
0.01282687909  
0.01264621579  
0.01246753332  
0.01229257078  
0.01212066392  
0.01195047004  
0.01178434692  
0.01162139496  
0.01146202212  
0.01129865914  
0.01114456  
0.01099044622  
0.01084114486  
0.01069262874  
0.01054695092  
0.01040250771  
0.01026313536  
0.01012244994  
0.009986615793  
0.009852351381  
0.009719826211  
0.009588643518  
0.009461964587  
0.00933620471  
0.009210867722  
0.009090314171  
0.008969124974  
0.008851344351  
0.008735186351  
0.008621912148  
0.008508944764  
0.008399104832  
0.008287864362  
0.008182583415  
0.008076369134  
0.007971631641  
0.00787000059  
0.007769821228  
0.007670214723  
0.007572852773  
0.00747731696  
0.007382871955  
0.007290170596  
0.007198518196  
0.007109580101  
0.007019686052  
0.006933278692  
0.006847434395  
0.006763535663  
0.006680498311  
0.006596874433  
0.006517190687  
0.006438306319  
0.006361394378  
0.006283813104  
0.006208309998  
0.006134100523  
0.006059908428  
0.005989168886  
0.005917292517  
0.005848908487  
0.005779050581  
0.005711733613  
0.005647261139  
0.005580715653  
0.005516329965  
0.005452052207  
0.005390767678  
0.005329477267  
0.005268303398  
0.005209170103  
0.005151452413  
0.005094648641  
0.005036417106  
0.004981372502  
0.004925923569  
0.004874326066  
0.004820178607  
0.004769254919  
0.004716680508  
0.004667777176  
0.004618040766  
0.004568705598  
0.004520726381  
0.004473404237  
0.004427537046  
0.004382332928  
0.00433696534  
0.004293183652  
0.004249744343  
0.004207137526  
0.00416476817  
0.004122981809  
0.004082786115  
0.00404455868  
0.004006302911  
0.00396734209  
0.003929602424  
0.00389227386  
0.003856730087  
0.003819989958  
0.003785006451  
0.003751100785  
0.003718067644  
0.003684568689  
0.003652186396  
0.003620742186  
0.003589774131  
0.003560148262  
0.003529983333  
0.003499148845  
0.003471269582  
0.003442788468  
0.003414658873  
0.003387976596  
0.003360667426  
0.003335522287  
0.003310012334  
0.003286056751  
0.003260762293  
0.003238114315  
0.003214390276  
0.003191019083  
0.003167693805  
0.003146559127  
0.003125628163  
0.003105116857  
0.003084666229  
0.003065691257  
0.003045986901  
0.003027784938  
0.003009616313  
0.002992039465  
0.002974139129  
0.002957358571  
0.002940988878  
0.002925116213  
0.002910351483  
0.002895561372  
0.002881560795  
0.002867233474  
0.002852534304  
0.002840811994  
0.00282843125  
0.002815288207  
0.002803539834  
0.002792142867  
0.002781100717  
0.002771768485  
0.00276147216  
0.002751475595  
0.002742503917  
0.002733689642  
0.002726210208  
0.00271885829  
0.002710557325  
0.002704051071  
0.002696816288  
0.002691086946  
0.002685092179  
0.002680141488  
0.002675948986  
0.002670872171  
0.002667250282  
0.002663768722  
0.002660493505  
0.00265728581  
0.002656096988  
0.002653884611  
0.002652711685  
0.002651508185  
0.00265057715  
0.002650506144  
