2.190923838  
9.491821675  
25.7764458  
86.41778795  
513.402935  
5779.210358  
29493.59362  
36123.16701  
1716.427492  
26781.53999  
8576.217721  
14369.49607  
1161.132342  
63635.61468  
9659.107081  
30289.30308  
18917.43758  
16580.94661  
10005.71786  
9556.907717  
13253.61696  
2470.191877  
12234.00974  
10061.95591  
14887.53144  
15998.18545  
11152.8947  
1328.654613  
1260.365046  
10844.84519  
12609.69482  
9098.531881  
4087.457538  
2169.301508  
7482.26146  
5481.350198  
375.7221849  
9484.009599  
3813.846803  
5991.478273  
5537.863912  
446.1362209  
6790.302352  
2819.932484  
290.8105336  
3042.794577  
7754.653299  
162.7652204  
1723.432168  
587.5978223  
5256.633555  
110.4270059  
2579.514683  
424.963307  
3521.643293  
32.93446796  
302.6482856  
510.8978327  
372.0416778  
3885.499  
641.8454525  
972.3825444  
440.91395  
195.720309  
232.1680931  
75.14907238  
132.2584004  
104.2257473  
118.2675159  
136.7847804  
67.00510189  
12.56212312  
44.39306657  
18.6923434  
23.421767  
37.62562815  
24.01384116  
17.90787036  
18.17979135  
12.34742477  
12.97032668  
12.63180586  
14.11570399  
10.36734665  
12.24882828  
10.42047094  
9.730582192  
9.274903424  
9.399106709  
9.071383239  
8.624174691  
8.518521594  
8.078641126  
7.886056816  
7.874166465  
7.470864012  
7.263395191  
7.074784555  
6.881194215  
6.733206225  
6.510520859  
6.383833886  
6.234917578  
6.059806131  
5.93655926  
5.773780276  
5.637446488  
5.514764985  
5.400147601  
5.286980065  
5.177649735  
5.06737531  
4.965141502  
4.864896999  
4.768531717  
4.675302581  
4.586574692  
4.496176127  
4.414881573  
4.330291296  
4.252909896  
4.176426494  
4.103247372  
4.031516351  
3.961973014  
3.894078895  
3.828716938  
3.764581131  
3.70279328  
3.642465829  
3.584023098  
3.526938356  
3.471639774  
3.417401375  
3.365162732  
3.313809125  
3.264010175  
3.215268942  
3.167828205  
3.121649125  
3.076600593  
3.032617751  
2.989608986  
2.947669595  
2.906761682  
2.866804227  
2.827755034  
2.789591409  
2.752266526  
2.715814384  
2.68020347  
2.645337822  
2.611224232  
2.577843158  
2.545210637  
2.513257528  
2.48199169  
2.451347163  
2.421414563  
2.392063682  
2.363262511  
2.335088093  
2.307510781  
2.28046826  
2.253947957  
2.227944436  
2.202491595  
2.177509826  
2.152977916  
2.128935632  
2.105353862  
2.082205658  
2.059522622  
2.037226483  
2.015372244  
1.993964178  
1.972872119  
1.952155362  
1.931870967  
1.911905808  
1.892315375  
1.873048331  
1.85415369  
1.835558089  
1.81732383  
1.799383532  
1.781742324  
1.764388934  
1.747362624  
1.730637532  
1.714170655  
1.697975313  
1.682007065  
1.666356504  
1.65096513  
1.635792526  
1.620910316  
1.606248875  
1.591752387  
1.577586287  
1.563594982  
1.549872519  
1.536305373  
1.522959482  
1.509845551  
1.496930734  
1.484200533  
1.471690171  
1.459345067  
1.447187985  
1.435220862  
1.423435799  
1.411839865  
1.400411429  
1.389122102  
1.378032939  
1.367101566  
1.35633288  
1.345653399  
1.335258381  
1.324895698  
1.314740568  
1.304721862  
1.29485455  
1.28511291  
1.27550509  
1.265988882  
1.25670503  
1.247459482  
1.238417509  
1.229439344  
1.220630675  
1.211930181  
1.203333721  
1.194837334  
1.186514752  
1.178239865  
1.170113822  
1.16207586  
1.154167261  
1.146381677  
1.138656147  
1.131036727  
1.123544011  
1.116124757  
1.108806608  
1.101588504  
1.09446883  
1.087432502  
1.080520221  
1.073668054  
1.066874852  
1.060192841  
1.053598681  
1.047109597  
1.040716108  
1.034352633  
1.028060283  
1.021894791  
1.01577497  
1.009715497  
1.003759197  
0.9978974464  
0.9920794017  
0.9863150688  
0.9806642706  
0.9750436426  
0.9695234668  
0.9640643228  
0.9586413872  
0.9532938195  
0.9480355539  
0.9428393123  
0.9376929173  
0.9325801772  
0.9275805209  
0.9225955173  
0.9177065485  
0.9128570418  
0.9080735154  
0.9033349525  
0.8986683033  
0.8940261794  
0.8894720068  
0.8849568124  
0.8804779117  
0.8760648152  
0.8717051747  
0.8674025375  
0.8631235427  
0.8589416333  
0.8547637477  
0.8506750887  
0.8466053466  
0.8425848631  
0.8386078618  
0.8346744628  
0.8307987607  
0.8269588935  
0.8231568233  
0.8194063047  
0.8156928544  
0.8120315774  
0.8083959568  
0.8047940465  
0.8012589412  
0.7977629195  
0.7942806459  
0.7908696145  
0.7874738739  
0.7841256102  
0.7808110973  
0.777537934  
0.7743057337  
0.7710922112  
0.7679366785  
0.7647724055  
0.761683875  
0.7586280539  
0.7556032239  
0.7525921143  
0.7496285595  
0.7467121781  
0.7438183673  
0.7409424427  
0.7381146997  
0.7353043948  
0.7325359594  
0.7298135385  
0.7270893278  
0.7243987522  
0.7217687741  
0.7191505948  
0.7165325545  
0.7139804928  
0.7114362125  
0.7089496739  
0.7064706618  
0.7040093473  
0.7015895169  
0.6991928902  
0.6968116942  
0.6944842872  
0.6921513614  
0.6898680187  
0.6875827711  
0.6853686184  
0.6831385946  
0.6809516179  
0.6787785319  
0.6766506419  
0.6745207151  
0.6724174675  
0.6703465967  
0.6683161583  
0.6662689322  
0.6642769722  
0.6622913481  
0.6603351534  
0.6583925851  
0.6564926767  
0.654570613  
0.6527377879  
0.6508747361  
0.6490060279  
0.6472365299  
0.6454503319  
0.6436897949  
0.6419287118  
0.6402204792  
0.6385042327  
0.6368160981  
0.6351567726  
0.6335034201  
0.6318780769  
0.6302754439  
0.628675379  
0.6271118597  
0.625567182  
0.6240267091  
0.6225062189  
0.6210290963  
0.6195476094  
0.6180908525  
0.6166370181  
0.6152264263  
0.6138145204  
0.6124244399  
0.6110440461  
0.6097112236  
0.6083508572  
0.6070201636  
0.6057228402  
0.6044146037  
0.6031747582  
0.6019300272  
0.6006908604  
0.5994668668  
0.5982316339  
0.5970493792  
0.5958702089  
0.5947117709  
0.5935792384  
0.5924515977  
0.5913175029  
0.5902313885  
0.5891417565  
0.5880749821  
0.5870132725  
0.5859865726  
0.5849675601  
0.5839572538  
0.5829613093  
0.5819872932  
0.5810250963  
0.5800664481  
0.5791063872  
0.5781914975  
0.5772982216  
0.5764022181  
0.5755053386  
0.5746580788  
0.5737861619  
0.5729462683  
0.5721200838  
0.5713190253  
0.5705166543  
0.569735142  
0.568960216  
0.5681967364  
0.567451887  
0.5667119263  
0.5659953218  
0.565267571  
0.5645954807  
0.5639033236  
0.5632230474  
0.5625751387  
0.5619264355  
0.5612974184  
0.5606832745  
0.5600690676  
0.5594825559  
0.5589139649  
0.5583091178  
0.5577546724  
0.5572349764  
0.5566947085  
0.556153697  
0.5556495035  
0.5551597393  
0.5546651969  
0.5542188491  
0.5537409366  
0.553277469  
0.55286764  
0.5524207701  
0.5520152817  
0.5516039823  
0.5512251114  
0.550841634  
0.5504645066  
0.5501527655  
0.5497763354  
0.5494412939  
0.5491348567  
0.5488317673  
0.5485255211  
0.5482280603  
0.5479608266  
0.547687008  
0.5474449147  
0.5471953377  
0.5469560084  
0.5467531616  
0.5465537922  
0.5463471975  
0.5461992  
0.5459900226  
0.5458180531  
0.5456731049  
0.5455370092  
0.5454126264  
0.5452971148  
0.5451927865  
0.54509883  
0.5450175695  
0.5449536043  
0.5448814924  
0.5448249154  
0.5447693512  
0.5447663943  
0.544739291  
0.5447355844  
