9665.034935  
9661.670302  
9658.420403  
9655.433076  
9652.858143  
9650.842001  
9649.518489  
9648.996632  
9649.346796  
9650.587289  
9652.674126  
9655.496168  
9658.877514  
9662.587884  
9666.36057  
9669.916328  
9672.990417  
9675.359445  
9676.864468  
9677.427098  
9677.056339  
9675.845127  
9673.956953  
9671.604457  
9669.022934  
9666.442524  
9664.062817  
9662.033353  
9660.442278  
9659.314302  
9658.617551  
9658.277611  
9658.196094  
9658.270479  
9658.412144  
9658.559801  
9658.686707  
9658.800869  
9658.93883  
9659.15442  
9659.504721  
9660.035697  
9660.769896  
9661.698348  
9662.777838  
9663.93406  
9665.070182  
9666.079443  
9666.859891  
9667.329055  
9667.436192  
9667.170358  
9666.562891  
9665.684081  
9664.634247  
9663.530733  
9662.492556  
9661.62498  
9661.006284  
9660.678435  
9660.643026  
9660.86281  
9661.268458  
9661.76931  
9662.266416  
9662.665763  
9662.889846  
9662.88593  
9662.630044  
9662.126599  
9661.404148  
9660.508457  
9659.494525  
9658.419005  
9657.334466  
9656.286183  
9655.31169  
9654.442666  
9653.708208  
9653.138475  
9652.767508  
9652.634497  
9652.782956  
9653.257879  
9654.101159  
9655.346046  
9657.0113  
9659.095949  
9661.575297  
9664.398648  
9667.489179  
9670.745999  
9674.048408  
9677.262233  
9680.247887  
9682.869778  
9685.006443  
9686.560752  
9687.469247  
9687.709659  
9687.305629  
9686.32777  
9684.890479  
9683.144331  
9681.264431  
9679.435526  
9677.83535  
9676.617765  
9675.897644  
9675.739205  
9676.149136  
9677.075552  
9678.412982  
9680.013017  
9681.699602  
9683.287327  
9684.600812  
9685.492951  
9685.860072  
9685.652049  
9684.876357  
9683.595411  
9681.917536  
9679.982658  
9677.944452  
9675.951153  
9674.127436  
9672.559584  
9671.285782  
9670.2927  
9669.51879  
9668.863808  
9668.203332  
9667.406529  
9666.354857  
9664.959329  
9663.174229  
9661.005461  
9658.512387  
9655.803024  
9653.023051  
9650.340104  
9647.925305  
9645.934365  
9644.490564  
9643.671689  
9643.502244  
9643.951768  
9644.938987  
9646.341091  
9648.006591  
9649.770067  
9651.466987  
9652.946933  
9654.084028  
9654.783797  
9654.986343  
9654.666219  
9653.829664  
9652.510308  
9650.764243  
9648.665419  
9646.30178  
9643.772407  
9641.185339  
9638.655633  
9636.302932  
9634.24789  
9632.607208  
9631.487059  
9630.975531  
9631.134778  
9631.994121  
9633.545207  
9635.740348  
9638.494672  
9641.692179  
9645.195217  
9648.856282  
9652.530565  
9656.087644  
9659.420658  
9662.451956  
9665.134535  
9667.449631  
9669.401234  
9671.009012  
9672.301159  
9673.30865  
9674.061984  
9674.590697  
9674.925338  
9675.100959  
9675.160584  
9675.157404  
9675.154286  
9675.220207  
9675.423558  
9675.823399  
9676.46008  
9677.347069  
9678.465723  
9679.764293  
9681.161733  
9682.555994  
9683.835705  
9684.89352  
9685.639019  
9686.009308  
9685.975732  
9685.54583  
9684.760447  
9683.686719  
9682.408128  
9681.013341  
9679.585497  
9678.193359  
9676.885549  
9675.68825  
9674.60648  
9673.628323  
9672.73124  
9671.889401  
9671.080884  
9670.293681  
9669.529754  
9668.806644  
9668.156379  
9667.621852  
9667.251082  
9667.090029  
9667.174809  
9667.52433  
9668.134312  
9668.97369  
9669.984044  
9671.082543  
9672.168332  
9673.131968  
9673.866849  
9674.281457  
9674.310835  
9673.925727  
9673.138186  
9672.002627  
9670.612047  
9669.089602  
9667.576448  
9666.217058  
9665.143718  
9664.46179  
9664.237521  
9664.489583  
9665.185399  
9666.242629  
9667.535698  
9668.906806  
9670.180335  
9671.179249  
9671.741982  
9671.738206  
9671.081928  
9669.740798  
9667.740723  
9665.165341  
9662.150528  
9658.874276  
9655.542952  
9652.375023  
9649.583542  
9647.358836  
9645.852666  
9645.165162  
9645.335527  
9646.337413  
9648.079476  
9650.411315  
9653.134657  
9656.01904  
9658.821041  
9661.305453  
9663.266599  
9664.547818  
9665.057108  
9664.777194  
9663.768673  
9662.165699  
9660.164158  
9658.003306  
9655.942541  
9654.235443  
9653.103819  
9652.714379  
9653.160628  
9654.451916  
9656.510954  
9659.180079  
9662.235704  
9665.409359  
9668.413068  
9670.966447  
9672.822619  
9673.790403  
9673.750712  
9672.665825  
9670.580934  
9667.618405  
9663.965644  
9659.858246  
9655.560185  
9651.343073  
9647.466201  
9644.158955  
9641.606644  
9639.940586  
9639.232634  
9639.494253  
9640.6797  
9642.692914  
9645.397216  
9648.627107  
9652.20109  
9655.934488  
9659.651378  
9663.194638  
9666.433477  
9669.268075  
9671.631258  
9673.48746  
9674.829582  
9675.674497  
9676.05801  
9676.029974  
9675.650169  
9674.985101  
9674.10576  
9673.085985  
9672.001034  
9670.925821  
9669.932436  
9669.086716  
9668.443931  
9668.043929  
9667.906294  
9668.026353  
9668.372757  
9668.887375  
9669.487918  
9670.073457  
9670.532453  
9670.752708  
9670.632233  
9670.089907  
9669.07467  
9667.572313  
9665.609005  
9663.251197  
9660.601926  
9657.793888  
9654.980136  
9652.323262  
9649.984224  
9648.111762  
9646.833251  
9646.247645  
9646.420748  
9647.382829  
9649.12848  
9651.618211  
9654.781405  
9658.520242  
9662.714139  
9667.224565  
9671.900079  
9676.581646  
9681.108249  
9685.322918  
9689.079129  
9692.247474  
9694.72221  
9696.427351  
9697.321637  
9697.401821  
9696.703805  
9695.301262  
9693.301655  
9690.839901  
9688.070033  
9685.155598  
9682.259477  
9679.533892  
9677.111322  
9675.096894  
9673.562672  
9672.544215  
9672.039375  
9672.009535  
9672.382975  
9673.060312  
9673.921521  
9674.834215  
9675.662641  
9676.276835  
9676.561306  
9676.422754  
9675.796251  
9674.649524  
9672.985056  
9670.839923  
9668.283435  
9665.412707  
9662.346549  
9659.217928  
9656.165613  
9653.32529  
9650.820872  
9648.756398  
9647.209211  
9646.224775  
9645.813677  
9645.951084  
9646.578731  
9647.609401  
9648.933586  
9650.427831  
9651.96411  
9653.41939  
9654.684712  
9655.67294  
9656.324587  
9656.611283  
9656.536689  
9656.134802  
9655.465931  
9654.610712  
9653.662721  
9652.720286  
9651.878232  
9651.220086  
9650.811447  
9650.694985  
9650.88733  
9651.378157  
9652.131362  
9653.088155  
9654.171774  
9655.293279  
9656.357976  
9657.271927  
9657.948154  
9658.312235  
9658.307097  
9657.896985  
9657.070569  
9655.843196  
9654.258193  
9652.386987  
9650.327782  
9648.20234  
9646.150577  
9644.322778  
9642.869535  
9641.929906  
9641.618743  
9642.014475  
9643.148871  
9645.000349  
9647.492178  
9650.496411  
9653.843719  
9657.338503  
9660.77786  
9663.972366  
9666.766206  
9669.05411  
9670.792881  
9672.005894  
9672.779813  
9673.253705  
9673.601874  
9674.012302  
9674.663443  
9675.70198  
9677.224388  
9679.26434  
9681.78738  
9684.6934  
9687.826539  
9690.991127  
9693.97183  
9696.555613  
9698.553095  
9699.816962  
9700.255592  
9699.840681  
9698.608237  
9696.653194  
9694.118493  
9691.180008  
9688.029037  
9684.854265  
9681.824918  
9679.076848  
9676.702508  
9674.745816  
9673.201965  
9672.02211  
9671.122194  
9670.394961  
9669.723844  
9668.997317  
9668.122267  
9667.034978  
9665.708655  
9664.156647  
9662.431078  
9660.616994  
9658.822707  
9657.167456  
9655.767733  
9654.72388  
9654.108441  
9653.957549  
9654.266233  
9654.988037  
9656.038863  
9657.304439  
9658.650639  
9659.935447  
9661.021556  
9661.788494  
9662.143373  
9662.02951  
9661.432311  
9660.38194  
9658.952459  
9657.257197  
9655.440378  
9653.665337  
9652.099908  
9650.900134  
9650.193757  
9650.065232  
9650.544242  
9651.599367  
9653.138336  
9655.015383  
9657.045541  
9659.024513  
9660.752094  
9662.056247  
9662.814797  
9662.971739  
9662.545847  
9661.630079  
9660.381655  
9659.003821  
9657.721542  
9656.754185  
9656.288691  
9656.456666  
9657.318251  
9658.85476  
9660.970828  
9663.505541  
9666.250986  
9668.975618  
9671.449497  
9673.468281  
9674.873298  
9675.565677  
9675.513319  
9674.75063  
9673.371591  
9671.517504  
9669.361206  
9667.089619  
9664.886401  
9662.916365  
9661.312672  
9660.167733  
9659.528061  
9659.393117  
9659.717878  
9660.418655  
9661.381495  
9662.472488  
9663.549185  
9664.472405  
9665.117662  
9665.385505  
9665.210127  
9664.565749  
9663.470184  
9661.98546  
9660.21509  
9658.298107  
9656.399965  
9654.700663  
9653.380734  
9652.605964  
9652.511967  
9653.189994  
9654.675376  
9656.940096  
9659.890676  
9663.372109  
9667.17819  
9671.067602  
9674.784531  
9678.081986  
9680.745321  
9682.613368  
9683.594695  
9683.67693  
9682.927821  
9681.487708  
9679.554142  
9677.360351  
9675.15002  
9673.151496  
9671.554308  
9670.490942  
9670.025648  
9670.151524  
9670.795681  
9671.83148  
9673.095839  
9674.409227  
9675.595681  
9676.500504  
9677.003785  
9677.028694  
9676.544215  
9675.562797  
9674.134004  
9672.335579  
9670.263353  
9668.021458  
9665.71377  
9663.437304  
9661.277548  
9659.305708  
9657.577292  
9656.13164  
9654.991827  
9654.164841  
9653.641915  
9653.399231  
9653.399356  
9653.593677  
9653.926073  
9654.337734  
9654.772815  
9655.184323  
9655.539342  
9655.822785  
9656.038855  
9656.209676  
9656.371074  
9656.565765  
9656.834832  
9657.208673  
9657.698761  
9658.291654  
9658.946289  
9659.595453  
9660.151394  
9660.515336  
9660.589683  
9660.29158  
9659.566031  
9658.396729  
9656.813167  
9654.892758  
9652.75744  
9650.564906  
9648.495279  
9646.73456  
9645.456749  
9644.806675  
9644.885471  
9645.740404  
9647.360198  
9649.67629  
9652.569764  
9655.883012  
9659.434654  
9663.035797  
9666.505886  
9669.686319  
9672.450693  
9674.710837  
9676.418637  
9677.564131  
9678.170719  
9678.288671  
9677.988077  
9677.352179  
9676.47169  
9675.440316  
9674.351336  
9673.294736  
9672.354423  
9671.60498  
9671.107714  
9670.906143  
9671.021261  
9671.447462  
9672.150008  
9673.064974  
9674.102395  
9675.152922  
9676.097787  
9676.821258  
9677.224278  
9677.237552  
9676.832307  
9676.026933  
9674.888195  
9673.526388  
9672.084514  
9670.722475  
9669.597997  
9668.846661  
9668.563527  
9668.789026  
9669.501079  
9670.614833  
9671.990372  
9673.447719  
9674.787323  
9675.813616  
9676.358624  
9676.30254  
9675.588697  
9674.230968  
9672.312721  
9669.977536  
9667.41301  
9664.829768  
9662.438381  
9660.427048  
9658.942692  
9658.077502  
9657.862203  
9658.26646  
9659.205883  
9660.55431  
9662.159586  
9663.860691  
9665.504148  
9666.957916  
9668.121424  
9668.931009  
9669.360738  
9669.418973  
9669.141725  
9668.58389  
9667.809711  
9666.883673  
9665.862768  
9664.790902  
9663.695752  
9662.588183  
9661.463987  
9660.307642  
9659.097454  
9657.81162  
9656.434494  
9654.962444  
9653.408578  
9651.80591  
9650.208237  
9648.68861  
9647.335145  
9646.244466  
9645.513222  
9645.228543  
9645.458372  
9646.242897  
9647.588036  
9649.461965  
9651.795099  
9654.483735  
9657.396961  
9660.386032  
9663.295299  
9665.973411  
9668.283695  
9670.112836  
9671.377189  
9672.026392  
9672.044481  
9671.448649  
9670.286197  
9668.630189  
9666.574216  
9664.226647  
9661.704699  
9659.12838  
9656.614589  
9654.271522  
9652.193626  
9650.457378  
9649.118303  
9648.209431  
9647.741445  
9647.704423  
9648.071102  
9648.801153  
9649.845932  
9651.153125  
9652.670592  
9654.349095  
9656.143666  
9658.013653  
9659.921883  
9661.833449  
9663.714702  
9665.533096  
9667.258106  
9668.8633  
9670.329172  
9671.646141  
9672.816839  
9673.85688  
9674.793519  
9675.661948  
9676.499589  
9677.339099  
9678.201348  
9679.089728  
9679.987083  
9680.856179  
9681.644044  
9682.289778  
9682.734688  
9682.933127  
9682.862136  
9682.528  
9681.968374  
9681.249254  
9680.456986  
9679.68652  
9679.027448  
9678.550348  
9678.295481  
9678.265797  
9678.425556  
9678.704732  
9679.008697  
9679.231585  
9679.271255  
9679.0435  
9678.493294  
9677.601295  
9676.384731  
9674.892637  
9673.196391  
9671.377303  
9669.51334  
9667.667535  
9665.879886  
9664.164279  
9662.510927  
9660.893786  
9659.281563  
9657.650207  
9655.994447  
9654.335973  
9652.726471  
9651.244534  
9649.986454  
9649.052204  
9648.528669  
9648.47295  
9648.898687  
9649.767996  
9650.990971  
9652.433377  
9653.93198  
9655.315553  
9656.428606  
9657.154254  
9657.432486  
9657.270818  
9656.745127  
9655.990155  
9655.180681  
9654.505888  
9654.14059  
9654.217784  
9654.806667  
9655.89977  
9657.411325  
9659.187445  
9661.026729  
9662.708352  
9664.023466  
9664.805275  
9664.95333  
9664.448441  
9663.356256  
9661.819052  
9660.037219  
9658.243359  
9656.672741  
9655.53441  
9654.986804  
9655.120804  
9655.952089  
9657.42312  
9659.413733  
9661.758383  
9664.267287  
9666.748492  
9669.028268  
9670.967448  
9672.472496  
9673.500575  
9674.058808  
9674.198604  
9674.006144  
9673.590395  
9673.070119  
9672.560958  
9672.1637  
9671.95446  
9671.977423  
9672.240549  
9672.714579  
9673.335546  
9674.010684  
9674.627659  
9675.066377  
9675.212524  
9674.971556  
9674.281588  
9673.123556  
9671.527082  
9669.570933  
9667.377384  
9665.100727  
9662.910835  
9660.973622  
9659.430822  
9658.381734  
9657.869762  
9657.875795  
9658.319858  
9659.071213  
9659.96586  
9660.829284  
9661.501302  
9661.859535  
9661.838018  
9661.438019  
9660.729317  
9659.841423  
9658.945759  
9658.231147  
9657.876042  
9658.021427  
9658.748324  
9660.063262  
9661.893925  
9664.095731  
9666.46861  
9668.781691  
9670.802475  
9672.326476  
9673.203215  
9673.355013  
9672.786114  
9671.580998  
9669.892352  
9667.920624  
9665.888035  
9664.010863  
9662.473647  
9661.408715  
9660.883446  
9660.896558  
9661.38336  
9662.228695  
9663.285342  
9664.395049  
