757.5288336  
792.9240547  
860.8478401  
998.338017  
2057.461977  
233.691109  
944.4449983  
37560.98497  
59181.73995  
34026.17093  
86755.80344  
46177.88698  
4199.636066  
2500.777985  
3247.282331  
7048.922473  
10376.77263  
28348.62694  
30365.52667  
21722.05973  
426.4237484  
8262.617777  
9885.531095  
1822.66959  
7877.348209  
17218.9663  
9698.243042  
2007.34914  
3709.905899  
5432.54932  
1765.522697  
524.7311736  
695.0980779  
2561.798048  
3075.880455  
1503.356639  
9587.864023  
3287.736729  
1802.188681  
1167.886636  
1236.741911  
522.0275081  
2829.793088  
716.034159  
2958.819158  
1059.063447  
345.3808454  
351.4146126  
28.40689637  
671.2200888  
549.526676  
939.8246895  
253.0375369  
448.937369  
169.5129462  
151.0324638  
345.7553258  
380.2998452  
377.4406234  
321.318688  
1.929275555  
857.2371019  
35.22103423  
9.248666992  
270.6550494  
44.15477433  
26.4167141  
88.51107643  
208.0665841  
47.27100099  
59.68760306  
96.33977932  
42.40932897  
41.34084217  
43.19896701  
45.26543811  
29.94874944  
27.88307904  
27.24652404  
22.05492923  
20.17276375  
19.94959599  
17.49610855  
18.75875144  
14.89083208  
13.69663584  
13.63974499  
12.86675385  
11.26028555  
10.54044689  
10.39898343  
9.584736026  
8.87814814  
8.519251229  
7.963300953  
7.491159897  
7.109060781  
6.740392949  
6.42955121  
6.097754578  
5.813840908  
5.520456004  
5.272942163  
5.007796309  
4.781494714  
4.577956258  
4.382942755  
4.187753999  
4.019757736  
3.856080198  
3.690297532  
3.542626131  
3.409779916  
3.27236197  
3.142482632  
3.027922254  
2.915317724  
2.807502554  
2.705341673  
2.608462965  
2.517218049  
2.428457571  
2.344807463  
2.265575914  
2.190034784  
2.11739906  
2.047536721  
1.981970426  
1.91863683  
1.857755308  
1.799998953  
1.744700045  
1.691565456  
1.64039045  
1.591607657  
1.544884262  
1.499815842  
1.456631259  
1.415171005  
1.375337931  
1.336951757  
1.300086255  
1.264658243  
1.230517061  
1.197643232  
1.165948373  
1.13546273  
1.1060658  
1.07767705  
1.050315404  
1.023921139  
0.9984395486  
0.9738363799  
0.9500654287  
0.9271104046  
0.9049080094  
0.8834519833  
0.8627096734  
0.8426338799  
0.8232279359  
0.804437928  
0.786234549  
0.7686199542  
0.7515568742  
0.7350205049  
0.718990773  
0.7034567937  
0.6883985754  
0.673789463  
0.6596177863  
0.6458724721  
0.632528779  
0.6195726761  
0.6069899676  
0.5947733951  
0.5829108924  
0.5713766992  
0.5601802689  
0.5492823004  
0.5386931494  
0.5284008743  
0.5183844096  
0.5086447133  
0.4991649858  
0.4899361252  
0.4809632436  
0.4722174277  
0.4637105294  
0.4554240982  
0.4473443604  
0.4394753714  
0.4318143997  
0.4243405427  
0.4170604314  
0.4099580263  
0.4030402937  
0.3962859734  
0.389702962  
0.3832759549  
0.3770120149  
0.370891798  
0.3649291166  
0.3590924825  
0.3534047875  
0.3478505413  
0.3424235306  
0.33712733  
0.3319531971  
0.3268894362  
0.3219459519  
0.3171229605  
0.3123983138  
0.3077856008  
0.3032743358  
0.2988625002  
0.29455032  
0.2903295063  
0.286198875  
0.2821625342  
0.2782152525  
0.2743471459  
0.2705611637  
0.2668620467  
0.2632335432  
0.2596855963  
0.2562103961  
0.2528088041  
0.2494777985  
0.2462109048  
0.2430205107  
0.2398828591  
0.2368162414  
0.2338112368  
0.2308617231  
0.2279735597  
0.2251414093  
0.2223684954  
0.219644845  
0.2169760969  
0.2143640552  
0.2117954855  
0.2092801462  
0.2068127888  
0.2043916554  
0.2020192839  
0.1996863498  
0.1973980556  
0.1951534447  
0.19295332  
0.1907906289  
0.1886708525  
0.1865893575  
0.184544022  
0.1825346312  
0.1805623998  
0.1786267212  
0.1767248687  
0.1748601077  
0.1730244866  
0.1712214178  
0.169451006  
0.1677126514  
0.1660057946  
0.1643243191  
0.162673244  
0.1610578949  
0.1594620088  
0.1578920929  
0.1563547956  
0.1548405872  
0.1533522915  
0.1518900727  
0.1504506599  
0.1490365014  
0.1476437145  
0.1462792167  
0.1449310203  
0.1436075537  
0.1423048776  
0.1410240738  
0.1397629971  
0.1385251731  
0.1373061809  
0.1361004629  
0.1349225166  
0.1337619942  
0.1326170698  
0.1314930944  
0.1303819458  
0.1292931732  
0.1282222373  
0.1271647197  
0.1261228825  
0.1250966536  
0.1240885188  
0.123097318  
0.122118821  
0.1211567913  
0.1202101457  
0.1192778283  
0.1183554498  
0.1174515933  
0.116558429  
0.1156783331  
0.1148144824  
0.1139601607  
0.1131216511  
0.1122936239  
0.1114781597  
0.1106777182  
0.1098855175  
0.1091045141  
0.1083373379  
0.1075820633  
0.1068329578  
0.1061003291  
0.1053713653  
0.1046578541  
0.1039528242  
0.1032587272  
0.1025780802  
0.1019037264  
0.1012387808  
0.1005839825  
0.09993773852  
0.09930322155  
0.09867405291  
0.098056947  
0.09744735632  
0.09684625459  
0.09625486785  
0.09566863631  
0.09509099333  
0.09452251306  
0.09396250366  
0.0934087356  
0.09286524577  
0.09232866218  
0.09179708724  
0.09127711268  
0.09076094686  
0.09025199634  
0.08975176836  
0.08925677082  
0.08876988872  
0.08829061358  
0.08781564375  
0.08734789604  
0.08688695864  
0.08643107986  
0.08598353481  
0.08554134267  
0.08510423011  
0.08467052457  
0.08424912933  
0.08383001434  
0.08341540505  
0.08300960602  
0.08260743178  
0.08221146223  
0.08181986457  
0.08143435453  
0.08105401349  
0.08067733226  
0.08030793577  
0.07994383307  
0.07958293845  
0.07922927295  
0.07887763234  
0.07853212793  
0.07819161909  
0.07785553654  
0.07752358274  
0.07719687278  
0.07687299382  
0.07655499915  
0.07624331286  
0.07593334704  
0.07562847944  
0.07532805334  
0.07503127913  
0.07473765876  
0.07445130906  
0.0741646217  
0.07388434623  
0.07360828145  
0.07333584498  
0.07306662799  
0.07280418634  
0.0725405054  
0.07228542008  
0.07203044203  
0.07177974164  
0.0715345648  
0.07129085296  
0.07105132491  
0.07081519337  
0.07058193194  
0.07035274681  
0.07012711522  
0.06990498777  
0.06968652005  
0.06947020516  
0.06925642645  
0.06904653292  
0.06884151395  
0.06863682206  
0.06843801137  
0.06824047701  
0.0680461858  
0.06785340417  
0.06766717573  
0.06748305977  
0.06729975328  
0.06712104244  
0.06694327449  
0.06676889723  
0.06660197553  
0.06643206713  
0.0662668818  
0.06610260207  
0.06594476795  
0.06578740503  
0.06563262644  
0.06548262537  
0.06533331192  
0.06518750209  
0.06504298147  
0.0649026221  
0.06476159763  
0.06462479164  
0.06449234394  
0.06436115259  
0.06423398069  
0.0641069385  
0.06398283211  
0.06386100153  
0.06374270684  
0.06362766525  
0.06351159967  
0.06339981533  
0.06329000653  
0.06318342034  
0.06307888075  
0.06297441854  
0.06287352186  
0.06277771736  
0.06268166952  
0.06258835111  
0.0624978318  
0.06240823244  
0.06232148372  
0.06223544717  
0.06215510273  
0.06207477985  
0.06199430392  
0.06191947558  
0.06184461696  
0.06177424321  
0.06170436734  
0.06163623011  
0.06157259795  
0.06150693879  
0.06144745094  
0.06138588851  
0.06132995164  
0.06127440416  
0.06122301586  
0.06117181917  
0.06112248643  
0.06107634209  
0.06103108003  
0.06098932555  
0.06094752595  
0.06090868532  
0.06087399791  
0.06083738166  
0.06080506769  
0.06077482659  
0.06074707857  
0.06072019653  
0.06069560632  
0.06067186145  
0.06065286922  
0.06063308078  
0.06061654619  
0.06060097092  
0.06058726375  
0.06057739789  
0.06056970782  
0.06056314169  
0.06055600317  
0.0605563664  
0.06055589328  
