1382.559272  
1480.297677  
1673.293958  
2058.81087  
3318.217952  
16754.9621  
2785.972533  
7731.1394  
59323.10754  
7094.688296  
4326.834062  
55221.37974  
15329.42074  
5800.531761  
1163.626547  
3104.313564  
11624.7688  
25226.25613  
10244.28343  
947.4583763  
465.9212874  
3906.21324  
946.6209922  
12479.00044  
47096.7952  
15196.09881  
9238.869953  
291.8923121  
16093.70751  
1226.859128  
26406.26884  
14259.32479  
1309.870383  
4263.18848  
5521.161816  
405.892482  
4123.578983  
3268.391464  
3322.579833  
3444.331744  
5973.629514  
9499.73978  
7251.319899  
4216.303235  
1625.305225  
1710.714636  
6222.686521  
2409.855108  
1503.064477  
5923.723417  
8505.447722  
2368.941217  
2758.079575  
1516.615227  
2242.77908  
655.4265056  
1524.231413  
4276.722124  
1230.94397  
667.5715009  
411.3517001  
1685.042686  
1545.964354  
646.6218288  
63.42904639  
389.3013007  
305.49588  
35.30188388  
28.28185582  
110.8690814  
21.5253091  
62.81400792  
39.93895061  
9.663905475  
42.04660784  
3.875784116  
12.22445556  
23.39010562  
8.952795701  
15.47893756  
11.14316131  
5.726861035  
12.12131731  
7.109718321  
5.575096023  
7.498335449  
5.209000574  
5.691942797  
5.377090869  
4.422464698  
4.487158351  
4.08978918  
3.672842451  
3.820588266  
3.477803113  
3.293505199  
3.198094676  
2.848019287  
2.737050311  
2.598056961  
2.430182121  
2.381809681  
2.253439486  
2.132092104  
2.063291849  
1.950788437  
1.852529394  
1.78068356  
1.689850987  
1.618860216  
1.550755972  
1.482081351  
1.423961121  
1.364627103  
1.306436148  
1.256650365  
1.20370193  
1.157605793  
1.113442587  
1.070165024  
1.030318794  
0.9908670763  
0.9539280457  
0.9196028191  
0.8859112453  
0.8540341246  
0.8242143516  
0.7952160561  
0.7673667764  
0.7410548341  
0.7158930595  
0.6916424168  
0.668603443  
0.6463532372  
0.6252775491  
0.6048779228  
0.5855365427  
0.5668641795  
0.5489457268  
0.5318079149  
0.5152770549  
0.4994211339  
0.4842701957  
0.4696537214  
0.4555349625  
0.442035039  
0.4290121246  
0.4165006967  
0.4044518983  
0.3928284513  
0.3816345819  
0.3708509139  
0.3604435488  
0.3504177724  
0.3407425494  
0.331413243  
0.3224014884  
0.3136812085  
0.3052860338  
0.2971786198  
0.2893239285  
0.2817487258  
0.2744188947  
0.267325031  
0.2604619586  
0.2538486188  
0.247430979  
0.2412063968  
0.2352001762  
0.2293753215  
0.2237295689  
0.2182669298  
0.2129631792  
0.2078262656  
0.202860392  
0.1980286498  
0.1933491127  
0.1888102325  
0.1844031204  
0.1801321097  
0.1759747429  
0.1719528037  
0.1680399738  
0.1642410835  
0.1605517762  
0.1569572114  
0.1534869136  
0.150087507  
0.1468050303  
0.1436041695  
0.1404938049  
0.1374599801  
0.1345253477  
0.1316643054  
0.128872033  
0.126163898  
0.1235156051  
0.1209547214  
0.1184501607  
0.116010026  
0.1136438862  
0.1113357267  
0.109082169  
0.1068865519  
0.1047463776  
0.1026700689  
0.1006376461  
0.0986609169  
0.09673085576  
0.09484723751  
0.09301557291  
0.09121967888  
0.08947898256  
0.08777392369  
0.08610784967  
0.08448731939  
0.08290643362  
0.08135597085  
0.07984774993  
0.07837618909  
0.07693415142  
0.07552953494  
0.07415617163  
0.07281942922  
0.07150628743  
0.07022843725  
0.06897884139  
0.06775573641  
0.06656227429  
0.06539121938  
0.0642554101  
0.06313840095  
0.06204704349  
0.0609807438  
0.05993279914  
0.0589152544  
0.05791768379  
0.0569377295  
0.05598396519  
0.05505415185  
0.05413083664  
0.05323656585  
0.05236742488  
0.05150693689  
0.05066904089  
0.04983875176  
0.04903998827  
0.04825054111  
0.04747963457  
0.04672129961  
0.04598234378  
0.0452635516  
0.04455043547  
0.0438527743  
0.04316860115  
0.0425030564  
0.04184720926  
0.04120486803  
0.04057715419  
0.03995829104  
0.03935685098  
0.03876333138  
0.03818428985  
0.03761520372  
0.0370528583  
0.03650625458  
0.03597014168  
0.03544335187  
0.03492836742  
0.03442118108  
0.03392210396  
0.03343582986  
0.0329579138  
0.03248722537  
0.03202808876  
0.0315753942  
0.03113193562  
0.03069500737  
0.03026803193  
0.02984905625  
0.02943687661  
0.02903722792  
0.02863975699  
0.02824578569  
0.0278623457  
0.02748821057  
0.02712022081  
0.02675604327  
0.02640218482  
0.0260511459  
0.02570729158  
0.0253711619  
0.02503991043  
0.02471297322  
0.02439378742  
0.02408012137  
0.02377008298  
0.02346956538  
0.02316874334  
0.0228771432  
0.0225900763  
0.02230776731  
0.02202799249  
0.02175407324  
0.02148537518  
0.02122225036  
0.02096101641  
0.02070771171  
0.02045612804  
0.02020925217  
0.0199684501  
0.01972984588  
0.01949487928  
0.01926158977  
0.01903646554  
0.01881373218  
0.01859364424  
0.01837804375  
0.0181645297  
0.01795808899  
0.01775196928  
0.01754945622  
0.01735214891  
0.01715764189  
0.01696394706  
0.0167749485  
0.01658865034  
0.01640483391  
0.0162222992  
0.01604812504  
0.01587217803  
0.01569940972  
0.01553240864  
0.0153646474  
0.01520242087  
0.01503995794  
0.01488299798  
0.01472452877  
0.01457279929  
0.01442255765  
0.01427343992  
0.01412708683  
0.01398183967  
0.01384006066  
0.01370006228  
0.01356407856  
0.01342833711  
0.01329364507  
0.01316419769  
0.01303400181  
0.01290422409  
0.01278229205  
0.01265724335  
0.01253806485  
0.01241734821  
0.01229969892  
0.01218666365  
0.01206860493  
0.01195873717  
0.01184793106  
0.01173916105  
0.011631758  
0.01152572763  
0.01142227057  
0.01131950209  
0.0112173424  
0.01112038988  
0.01102064421  
0.01092492079  
0.01083081949  
0.01073669086  
0.01064535469  
0.01055429906  
0.01046790378  
0.01037990411  
0.01029024923  
0.01020505153  
0.01012408583  
0.01004092884  
0.009960835114  
0.009880015961  
0.009800990467  
0.009723763897  
0.00964563086  
0.009571410934  
0.00949761265  
0.009425865246  
0.009351560696  
0.009281940104  
0.009214033451  
0.009146547779  
0.009078515933  
0.009013126752  
0.008946966735  
0.008881552127  
0.008817125516  
0.008756636446  
0.00869577286  
0.008634469351  
0.008576350209  
0.008519481561  
0.008461179807  
0.008405034246  
0.008350234575  
0.008294309322  
0.008241543219  
0.008188308167  
0.008137480198  
0.008085619348  
0.008035542048  
0.00798694631  
0.007937405566  
0.007888150979  
0.007843263779  
0.007797958635  
0.007749540437  
0.007706013703  
0.007662183099  
0.007618738636  
0.007577208075  
0.007536039866  
0.007494489907  
0.007454631942  
0.007415146795  
0.007377356382  
0.007339425168  
0.007301498207  
0.007264720543  
0.007228428344  
0.007193889268  
0.007159992991  
0.007126575839  
0.007093896206  
0.007059822076  
0.007028467968  
0.00699833121  
0.006966981584  
0.006935234484  
0.006907457558  
0.006878201473  
0.006851616998  
0.006822927819  
0.006795119321  
0.006771406607  
0.006743956251  
0.006719746364  
0.006695712891  
0.006672717991  
0.006647294191  
0.006625138454  
0.006602771649  
0.006582335413  
0.006559223746  
0.006538538972  
0.006519390834  
0.006501660889  
0.006480112411  
0.006463135787  
0.006445869783  
0.006427715747  
0.006411483004  
0.006394463502  
0.006379124938  
0.006364366004  
0.006350188377  
0.006335302127  
0.00632114194  
0.006309161254  
0.006295971005  
0.006285312831  
0.006273745876  
0.006263416872  
0.006251170463  
0.006241310787  
0.006231445952  
0.006222922674  
0.006213235542  
0.00620699428  
0.006198775244  
0.006191273141  
0.00618634617  
0.006180175678  
0.006173506374  
0.006169019777  
0.006164554052  
0.006160624864  
0.006155153312  
0.006153395335  
0.006149576195  
0.006147212543  
0.006147273972  
0.006144880795  
0.006144604616  
0.006145620275  
