1891.115073  
2009.066958  
2272.715857  
2781.736828  
2670.887665  
3715.910554  
67804.49166  
49886.43798  
28713.79004  
1416.143614  
5552.504571  
8833.040467  
30032.26743  
36913.9805  
9243.12572  
16122.16673  
2756.016357  
42804.57895  
3175.482062  
32085.18132  
940.4601131  
2712.791027  
7486.614558  
2759.367519  
5742.021848  
1305.156685  
4582.270276  
20.45447021  
7116.553545  
13788.52985  
923.6981268  
20234.13338  
771.7995031  
3257.551297  
3431.34835  
1952.07613  
1711.197087  
2619.703708  
7551.000743  
7340.832929  
271.5274887  
376.1912696  
1712.774787  
3510.52955  
1939.987093  
7633.562261  
43.79686842  
3268.415474  
2923.645776  
158.0019514  
931.4333633  
94.14889372  
2253.41345  
1694.192263  
534.5968357  
3916.647729  
2478.092601  
605.6479072  
101.5072331  
887.7455339  
1223.953061  
625.1960064  
296.5121253  
260.2020966  
1482.361506  
209.1053103  
114.5416107  
48.03950579  
129.987349  
66.08502274  
196.7527733  
102.5767812  
109.4835952  
16.84599852  
53.28358821  
61.13293323  
29.49716951  
13.57305752  
21.69887732  
3.152427989  
7.816854402  
12.33018592  
5.114300195  
9.048464838  
8.763168754  
9.702943834  
10.46913724  
6.817935451  
8.064734382  
6.585483906  
6.224070307  
5.79703148  
5.407865542  
5.16559395  
4.985940086  
4.892458486  
4.654579276  
4.167563042  
4.002073648  
3.770925002  
3.6085147  
3.532198721  
3.314816172  
3.162037297  
3.043710109  
2.931622821  
2.769199664  
2.662651764  
2.5765635  
2.460720198  
2.372453689  
2.277693507  
2.173744497  
2.092436624  
2.023069185  
1.954715435  
1.871175059  
1.805525606  
1.731097206  
1.674150505  
1.613894762  
1.55938429  
1.503756048  
1.452497028  
1.404172476  
1.356684717  
1.310982161  
1.268708829  
1.225150533  
1.186447794  
1.148228511  
1.112118577  
1.076937807  
1.043902101  
1.011628621  
0.9808028221  
0.9510813208  
0.9226364335  
0.8954149305  
0.869014799  
0.8437165735  
0.8194305421  
0.7959463101  
0.7733456591  
0.7516751623  
0.730738109  
0.7104748072  
0.6910608387  
0.6722876699  
0.6541798709  
0.6366845528  
0.6198475556  
0.603562889  
0.5878290026  
0.5726510755  
0.5579590447  
0.543781429  
0.5300469714  
0.5167909401  
0.5039385334  
0.4915157304  
0.4795050165  
0.4678793717  
0.4566077516  
0.445696472  
0.4351258345  
0.4248736477  
0.4149368035  
0.4053261066  
0.3959889663  
0.3869448725  
0.3781613744  
0.3696576897  
0.3613863427  
0.35335152  
0.3455638518  
0.3380092531  
0.3306532923  
0.323533607  
0.3166073409  
0.3098659287  
0.3033161655  
0.2969546998  
0.2907604487  
0.2847400397  
0.2788848923  
0.273201868  
0.2676645234  
0.2622569164  
0.2570189424  
0.2519188961  
0.2469574505  
0.2421091829  
0.2373982014  
0.2328073547  
0.2283362154  
0.2239716142  
0.2197217426  
0.2155817796  
0.2115441006  
0.207612857  
0.203772822  
0.2000281176  
0.196384553  
0.1928228881  
0.1893530696  
0.1859628618  
0.1826659927  
0.179427136  
0.1762779929  
0.1732104772  
0.1701992674  
0.1672755081  
0.1644025687  
0.1616161005  
0.158877686  
0.1562082646  
0.1535958033  
0.1510566331  
0.1485617405  
0.146118745  
0.1437474294  
0.1414183353  
0.1391440781  
0.1369161723  
0.1347367182  
0.1326123307  
0.1305285416  
0.1284898049  
0.1265008612  
0.1245425585  
0.1226403186  
0.1207654762  
0.1189376119  
0.1171546189  
0.1154048245  
0.1136888725  
0.112006658  
0.1103659843  
0.10874981  
0.1071632004  
0.1056211256  
0.1041058722  
0.1026265804  
0.1011729702  
0.09973685612  
0.09834237208  
0.09698338385  
0.09563616271  
0.09432181782  
0.09303561285  
0.09176816883  
0.09052835261  
0.08931048896  
0.08812241321  
0.08695378952  
0.08580234403  
0.08467375866  
0.08357715381  
0.08249718824  
0.08143438964  
0.08038831285  
0.07936265977  
0.07836072228  
0.07737120372  
0.07641150479  
0.07545426905  
0.07453370928  
0.07361182067  
0.07271015946  
0.07182956873  
0.07096110601  
0.07011614724  
0.06927548244  
0.06845598252  
0.06765020025  
0.06685634413  
0.06607527943  
0.06531511162  
0.06456348127  
0.0638270251  
0.0631069878  
0.06239085967  
0.06168849484  
0.0610019944  
0.06032318428  
0.05966541834  
0.05901070925  
0.0583661122  
0.05773697901  
0.05711323501  
0.05650061727  
0.0559025166  
0.05531633364  
0.05473801324  
0.05416444273  
0.05360318331  
0.0530509371  
0.05251083723  
0.05197708081  
0.05145217037  
0.05093513393  
0.05042815812  
0.04992624085  
0.04943616894  
0.04895336972  
0.04847506993  
0.04800549188  
0.04754601546  
0.04709144301  
0.04664778909  
0.04620517013  
0.04576904842  
0.04535190085  
0.04492980586  
0.04451700608  
0.04410920286  
0.04370986938  
0.04331983256  
0.04293106099  
0.04254959134  
0.0421717338  
0.04180487849  
0.04144293941  
0.0410831049  
0.04073021676  
0.0403790749  
0.04004237341  
0.03970202599  
0.03937454763  
0.03904682723  
0.03872383916  
0.03840492105  
0.03809245643  
0.03779181674  
0.0374857818  
0.03718487425  
0.03689012601  
0.0366058642  
0.03632075021  
0.03603672906  
0.03576260655  
0.03548653813  
0.03521662614  
0.03495369041  
0.03469227645  
0.03443829192  
0.03418396418  
0.03393427256  
0.03368847242  
0.03344617931  
0.03320906562  
0.03297495046  
0.03274238556  
0.03251467116  
0.03229056875  
0.03207017174  
0.03185319225  
0.03163730046  
0.03142365186  
0.03121091923  
0.03100890881  
0.0308074344  
0.03060488028  
0.03041015056  
0.03021668103  
0.03002317627  
0.02983549389  
0.02965239063  
0.02946457272  
0.02928513006  
0.0291076948  
0.02893638334  
0.02876427323  
0.02859051495  
0.02842804189  
0.0282598116  
0.02809640288  
0.02793869908  
0.02777686342  
0.02762693647  
0.02746933591  
0.02732181208  
0.0271681816  
0.02702180959  
0.02687899174  
0.02673935146  
0.02659987625  
0.02646101637  
0.02632661787  
0.02619176525  
0.02606017647  
0.02592831633  
0.02580246332  
0.02567759347  
0.02555467242  
0.0254293595  
0.02531088602  
0.02519107277  
0.02507422397  
0.02496199789  
0.0248466027  
0.0247352678  
0.0246263108  
0.02451798722  
0.02441257875  
0.02430456853  
0.02420393655  
0.02410581888  
0.02400755676  
0.02390771405  
0.02381042675  
0.02371920191  
0.02362344247  
0.02353562097  
0.02343955347  
0.02335054122  
0.02326653465  
0.02318029268  
0.02309435592  
0.02301214018  
0.02293540391  
0.02285335758  
0.02277706768  
0.02269987549  
0.02262572957  
0.02254544242  
0.02247442309  
0.02240267384  
0.02233489249  
0.02226572552  
0.02219470673  
0.02213398713  
0.02206769697  
0.02199829556  
0.02194013208  
0.02187426073  
0.02181796355  
0.02175951046  
0.02170350005  
0.02164499914  
0.0215912854  
0.02153546693  
0.02148519069  
0.02143220344  
0.02138329194  
0.02133132056  
0.0212823976  
0.02123715059  
0.02118991301  
0.02114779581  
0.02110530783  
0.02105971637  
0.02101914923  
0.02097835891  
0.02093899395  
0.02090166389  
0.0208642816  
0.02083010669  
0.02079428948  
0.02076034065  
0.02072557811  
0.02069592599  
0.02066579118  
0.02063735272  
0.02060623236  
0.02058040428  
0.02055318202  
0.02053278971  
0.02050524175  
0.02048116456  
0.0204579853  
0.02043713198  
0.02041930436  
0.02039718253  
0.02038055237  
0.02036324606  
0.02034794735  
0.02032691294  
0.02031413291  
0.02030406587  
0.02028982497  
0.02027853098  
0.02026960253  
0.0202613389  
0.02025202034  
0.02024156854  
0.02023832786  
0.02023229063  
0.02022892637  
0.02022617275  
0.02022387838  
0.02021930884  
0.02022184557  
