-0.06820362457  
-0.1387023239  
-0.1994440578  
-0.2421612959  
-0.2604806225  
-0.2505171002  
-0.211212221  
-0.1443832945  
-0.05449484355  
0.05182357665  
0.1664407822  
0.2805123478  
0.3852867426  
0.4728707678  
0.5368585588  
0.5727816829  
0.5783413621  
0.5534108538  
0.4998318301  
0.4210419807  
0.3215841184  
0.2065802657  
0.08121584258  
-0.04968655353  
-0.181973281  
-0.3123110643  
-0.4381896242  
-0.5577785559  
-0.6696983348  
-0.7727216368  
-0.8654974399  
-0.9463222212  
-1.013028883  
-1.063011914  
-1.093417507  
-1.101465845  
-1.084888243  
-1.042400941  
-0.9741484509  
-0.8820375414  
-0.7698816358  
-0.6433218778  
-0.50948855  
-0.3764346366  
-0.2523888306  
-0.1449119545  
-0.06005544979  
-0.001634430812  
0.02930368965  
0.03472547424  
0.01953720059  
-0.008815339  
-0.04104858617  
-0.06697789565  
-0.0765954662  
-0.061184939  
-0.01434427009  
0.06719936639  
0.183071104  
0.3291164377  
0.4976775092  
0.6782624766  
0.8585583106  
1.025669039  
1.167453253  
1.273804959  
1.337724788  
1.356065261  
1.329851801  
1.26415677  
1.167536707  
1.051104809  
0.9273555593  
0.8088657916  
0.7070250072  
0.6309284998  
0.5865374157  
0.5761943539  
0.5985168299  
0.6486724367  
0.7189884288  
0.7998065727  
0.8805011509  
0.9505337316  
1.000442028  
1.022675376  
1.012195419  
0.9668074387  
0.8872080569  
0.7767822524  
0.6411734452  
0.4877116601  
0.3247431369  
0.1609533905  
0.004725475167  
-0.1364140421  
-0.2562320206  
-0.3500948901  
-0.4151410295  
-0.4503266385  
-0.456360236  
-0.4355381561  
-0.3915052174  
-0.3289489028  
-0.2532569422  
-0.1701540966  
-0.08533921691  
-0.004150793578  
0.06872080065  
0.129446295  
0.1751923267  
0.2041644673  
0.2155577587  
0.2094420733  
0.1865913531  
0.1482962727  
0.09618070007  
0.03206260729  
-0.04212818151  
-0.124374118  
-0.2125329592  
-0.3042706474  
-0.3970015569  
-0.4878672504  
-0.5737880906  
-0.6516171828  
-0.718375728  
-0.7715643432  
-0.8094933053  
-0.831572189  
-0.838502154  
-0.8323093383  
-0.8161979462  
-0.794211816  
-0.770747586  
-0.7499682333  
-0.7352103573  
-0.7284661446  
-0.7300335503  
-0.738390649  
-0.7503336885  
-0.7613736377  
-0.766348823  
-0.7601755108  
-0.7386320566  
-0.6990813165  
-0.640997517  
-0.5662446263  
-0.4790398618  
-0.3856085591  
-0.2935569772  
-0.2110622753  
-0.1459654162  
-0.104900669  
-0.09255860492  
-0.111184028  
-0.1603456641  
-0.2370059946  
-0.3358578314  
-0.4498694871  
-0.5709584771  
-0.6907132316  
-0.8010687798  
-0.8948888686  
-0.9663937858  
-1.011423995  
-1.027556814  
-1.014072229  
-0.9718280769  
-0.903054165  
-0.8111129922  
-0.7002346257  
-0.5752460238  
-0.4412930098  
-0.3035615121  
-0.1669939268  
-0.03601317602  
0.08574238911  
0.1956411431  
0.292227282  
0.3752998409  
0.4458955363  
0.5061484044  
0.5590465405  
0.6080933137  
0.6569014109  
0.7087701766  
0.7662863269  
0.8309957923  
0.9031851461  
0.9817990546  
1.064501547  
1.147880447  
1.22776072  
1.299601584  
1.358927005  
1.401741823  
1.424902264  
1.4263942  
1.405497148  
1.3628302  
1.300274585  
1.220784893  
1.128121691  
1.02653029  
0.9203968282  
0.813929078  
0.7108827286  
0.6143577807  
0.5266827257  
0.4493766175  
0.3831937826  
0.328212965  
0.2839688877  
0.2495891285  
0.2239177238  
0.2056135533  
0.1932266297  
0.1852387874  
0.1800932732  
0.1762219792  
0.1720875338  
0.1662407811  
0.1574146775  
0.1446394704  
0.1273616356  
0.105569896  
0.07988225654  
0.0515904578  
0.02262908329  
-0.004524188554  
-0.02704066852  
-0.04199786458  
-0.04669339441  
-0.03898621102  
-0.01762060247  
0.01750644721  
0.06516954695  
0.1227734294  
0.1864657765  
0.2514102088  
0.312205306  
0.3634092008  
0.4001177778  
0.4185232035  
0.4163777304  
0.393289441  
0.3507971866  
0.2922048352  
0.2221668862  
0.1460915105  
0.0694254555  
-0.003074308661  
-0.06796682432  
-0.1235585976  
-0.1700619733  
-0.2094499068  
-0.2450224783  
-0.2807535662  
-0.3205087693  
-0.3672738094  
-0.4225068745  
-0.4857289293  
-0.5544238214  
-0.6242667699  
-0.6896566005  
-0.7444745174  
-0.7829548625  
-0.8005569807  
-0.7946868533  
-0.7651910423  
-0.7145329931  
-0.6476457145  
-0.5714551553  
-0.4941547428  
-0.4243106775  
-0.3699122672  
-0.3374758216  
-0.3313042331  
-0.3529912263  
-0.4012163453  
-0.4718597046  
-0.5584104117  
-0.6526399972  
-0.7454470042  
-0.8277935096  
-0.8916306066  
-0.9306948753  
-0.9411087882  
-0.9217024761  
-0.8740414762  
-0.8021504  
-0.7119902282  
-0.6107586805  
-0.5061081475  
-0.4053939157  
-0.3150265477  
-0.2400269119  
-0.1837913406  
-0.148086596  
-0.1332274883  
-0.138380863  
-0.1619121604  
-0.2017132714  
-0.2554387368  
-0.3206333842  
-0.3947397901  
-0.475014829  
-0.5584076452  
-0.6414430535  
-0.7201847181  
-0.7902876183  
-0.8471782276  
-0.8863403571  
-0.9036675236  
-0.8958369279  
-0.8606489672  
-0.7972742299  
-0.7063864263  
-0.5901521007  
-0.452101469  
-0.2968894276  
-0.1299961602  
0.04260262495  
0.2147667149  
0.3804913469  
0.5341799626  
0.6708857899  
0.7865288255  
0.8780928577  
0.9437981447  
0.9832550123  
0.9975526759  
0.9892820541  
0.9624499338  
0.9222750782  
0.8748542771  
0.8267074659  
0.7842361566  
0.7531433281  
0.7378692668  
0.7411151738  
0.7635125647  
0.803491067  
0.8573685685  
0.9196653599  
0.9836263341  
1.041881512  
1.087202242  
1.11324259  
1.115208952  
1.090371148  
1.038351376  
0.9611763219  
0.8630697022  
0.7500120911  
0.6291281826  
0.5079568482  
0.3937086606  
0.29258022  
0.2092213395  
0.1464097703  
0.1049695272  
0.08393804846  
0.08094372985  
0.09273769514  
0.1157898017  
0.1468625345  
0.1834565757  
0.2240803088  
0.268285092  
0.3164810054  
0.3695588189  
0.4284002575  
0.4933596485  
0.5638144536  
0.6378739419  
0.7122911861  
0.782611394  
0.8435393349  
0.8894689537  
0.9151222332  
0.9161954307  
0.889942399  
0.8356264406  
0.7547763691  
0.6512380057  
0.5309927438  
0.4017698447  
0.2724792145  
0.1525014525  
0.05090276701  
-0.02438147512  
-0.06730727877  
-0.07437583581  
-0.04510790526  
0.01771820432  
0.1080920576  
0.2170974324  
0.3335132455  
0.4446624963  
0.5374374154  
0.5994218986  
0.6199958746  
0.5913207588  
0.5091004878  
0.3730477335  
0.1869894553  
-0.0413890772  
-0.3011378995  
-0.5789261621  
-0.8601122467  
-1.129908986  
-1.374525754  
-1.582191038  
-1.743967818  
-1.854301782  
-1.911283718  
-1.916603115  
-1.875245252  
-1.794949805  
-1.685499345  
-1.557906624  
-1.423546802  
-1.293317224  
-1.176865374  
-1.081939548  
-1.013898523  
-0.975412633  
-0.9663669704  
-0.9839822097  
-1.023137155  
-1.076883045  
-1.137105592  
-1.195289372  
-1.243326125  
-1.274290845  
-1.283110177  
-1.267060236  
-1.226023964  
-1.162479206  
-1.081202203  
-0.9887138405  
-0.89252292  
-0.8002537731  
-0.7187567373  
-0.653318072  
-0.607058186  
-0.5806050563  
-0.5720697366  
-0.5773254169  
-0.5905485137  
-0.6049312774  
-0.6134777885  
-0.6097705715  
-0.5886138999  
-0.5464928264  
-0.4817980091  
-0.3948339356  
-0.2876238357  
-0.1635778225  
-0.0270855241  
0.1169123224  
0.2633055951  
0.4071374503  
0.5438374412  
0.6693848369  
0.7804172604  
0.8743027167  
0.9492100327  
1.004185798  
1.039228612  
1.055370466  
1.05471268  
1.040417449  
1.016604141  
0.9881441427  
0.960344568  
0.9385405004  
0.9276182045  
0.9315340616  
0.9528711085  
0.9925151504  
1.049483068  
1.120955214  
1.202517125  
1.288589787  
1.373010726  
1.449690004  
1.51326943  
1.559684093  
1.586570548  
1.593453662  
1.581698492  
1.554226578  
1.515053071  
1.468693992  
1.41953766  
1.371254323  
1.326325764  
1.285745229  
1.248915039  
1.213762035  
1.177024212  
1.134702387  
1.082593414  
1.016872548  
0.9346393425  
0.8344016854  
0.7164218735  
0.5829066724  
0.4380060594  
0.2876145644  
0.1389708734  
8.626320445e-05  
-0.1209688652  
-0.216861778  
-0.2818042888  
-0.3122890769  
-0.3076701699  
-0.2705028354  
-0.2065793758  
-0.1246272321  
-0.03566086739  
0.04796196396  
0.1137057456  
0.1501105694  
0.1480113917  
0.1015526066  
0.008891800089  
-0.1275121467  
-0.3010733062  
-0.5016743056  
-0.7166369237  
-0.9319273644  
-1.133458602  
-1.308335682  
-1.445917581  
-1.538588752  
-1.582203813  
-1.576185039  
-1.523318036  
-1.429307149  
-1.302163365  
-1.151503487  
-0.987821379  
-0.8217734599  
-0.6635187857  
-0.5221132214  
-0.4049921968  
-0.3175380495  
-0.262762892  
-0.2411330759  
-0.2505657739  
-0.2866225476  
-0.3429141018  
-0.4117032668  
-0.4846605866  
-0.553717815  
-0.6119150437  
-0.6541455135  
-0.6776973769  
-0.6825147958  
-0.6711242085  
-0.6482373015  
-0.620053316  
-0.5933624675  
-0.5745552411  
-0.5686774321  
-0.5786487218  
-0.6047684728  
-0.6445626072  
-0.6930141554  
-0.7431389957  
-0.7868621596  
-0.8160499878  
-0.8236132831  
-0.8044974691  
-0.756461745  
-0.6805181216  
-0.5809805522  
-0.4650887403  
-0.3422545545  
-0.2230021264  
-0.1177372088  
-0.03548778143  
0.01722987431  
0.03725994  
0.02528080309  
-0.01417954642  
-0.07317778096  
-0.1411995366  
-0.206304039  
-0.2564322616  
-0.2807208021  
-0.2706652856  
-0.2210057402  
-0.1302329989  
-0.0006955576026  
0.1617122942  
0.3481977719  
0.5479790265  
0.7493385835  
0.9407019367  
1.111645593  
1.253733871  
1.361134863  
1.430970542  
1.463400765  
1.461443399  
1.43057068  
1.378122739  
1.312595585  
1.242858414  
1.177378184  
1.123503508  
1.086872784  
1.070991446  
1.077018778  
1.103770882  
1.147938934  
1.204491285  
1.267206505  
1.329274326  
1.383891803  
1.424791387  
1.446644512  
1.44530896  
1.41792594  
1.36287995  
1.279670507  
1.168748775  
1.03136925  
0.8694986298  
0.68580184  
0.4836936039  
0.2674254865  
0.04215526467  
-0.1860575001  
-0.4103812742  
-0.6235034728  
-0.8180890459  
-0.9873641718  
-1.125778494  
-1.229635772  
-1.297607524  
-1.331030571  
-1.333898077  
-1.312545581  
-1.275002486  
-1.23010909  
-1.18648015  
-1.151471742  
-1.130277622  
-1.125300863  
-1.135894338  
-1.158516549  
-1.187283027  
-1.214861947  
-1.233560239  
-1.236484111  
-1.218578771  
-1.177425079  
-1.113668045  
-1.031023108  
-0.9358545747  
-0.8363860959  
-0.7416469829  
-0.6602921697  
-0.5994498507  
-0.5637494335  
-0.5546537525  
-0.5701797976  
-0.6050513178  
-0.6512625353  
-0.698986901  
-0.7377200142  
-0.7575140355  
-0.7501564585  
-0.7101404948  
-0.6353226591  
-0.5271707918  
-0.3906003753  
-0.2334034998  
-0.06536405852  
0.1028299645  
0.2607416027  
0.3992606055  
0.5114758972  
0.5932436072  
0.6434155584  
0.6637040739  
0.658245186  
0.632941198  
0.5946794243  
0.5505462832  
0.5071470419  
0.470084361  
0.4436653877  
0.4308043327  
0.4331203345  
0.4511383264  
0.4845372884  
0.5323662792  
0.5931831601  
0.6650839348  
0.7456474284  
0.8318251046  
0.9198519778  
1.005243984  
1.082946909  
1.14766967  
1.194391014  
1.218999747  
1.218970185  
1.193967637  
1.146252933  
1.080793116  
1.005002839  
0.9281165362  
0.8602301467  
0.8111241395  
0.7890291558  
0.7994846544  
0.8444810152  
0.9220059799  
1.026082922  
1.147315593  
1.27387699  
1.392832867  
1.491613183  
1.559454911  
1.588624444  
1.575253931  
1.519695357  
1.426348041  
1.303001608  
1.159769472  
1.007792058  
0.8578536174  
0.7191212262  
0.5981407917  
0.4982225335  
0.41927426  
0.3580747211  
0.3089265659  
0.2645759469  
0.2172558173  
0.159685588  
0.0859159603  
-0.008117547859  
-0.12435078  
-0.2626756717  
-0.4212836458  
-0.5971764655  
-0.786736963  
-0.9862399344  
-1.19223114  
-1.401713214  
-1.612151406  
-1.82132157  
-2.027079254  
-2.227119403  
-2.418811696  
-2.599141328  
-2.764797079  
-2.912370507  
-3.038626649  
-3.140785586  
-3.216733691  
-3.265143947  
-3.28544629  
-3.277686999  
-3.242292126  
-3.179813487  
-3.09071168  
-2.975244482  
-2.833492515  
-2.665537443  
-2.471761095  
-2.25320416  
-2.011929389  
-1.751283952  
-1.476016353  
-1.192194635  
-0.9069176572  
-0.6278522565  
-0.3626397383  
-0.1182672482  
0.09952664484  
0.2867214353  
0.4413038241  
0.5633411844  
0.6548352759  
0.7193955563  
0.7617645045  
0.7872916524  
0.8013957938  
0.8091184802  
0.8147828421  
0.8218161613  
0.832718921  
0.8491725719  
0.872239451  
0.9026063552  
0.9408156228  
0.9874370575  
1.043140901  
1.108656509  
1.184632083  
1.271409959  
1.368765605  
1.475673273  
1.590135889  
1.709140809  
1.82875839  
1.944395681  
2.051188367  
2.144487358  
2.220377266  
2.2761567  
2.310704073  
2.32465458  
2.320366837  
2.301619436  
2.273107114  
2.239748904  
2.20592309  
2.174727854  
2.147379038  
2.122866158  
2.097921811  
2.067353236  
2.024700616  
1.96315051  
1.876590636  
1.760639717  
1.613515262  
1.436584257  
1.234513835  
1.014975057  
0.7879311656  
0.5645971504  
0.3562133806  
0.1727906819  
0.02200562577  
-0.09161941956  
-0.1671509268  
-0.2072493206  
-0.2177724872  
-0.2070532477  
-0.1849605294  
-0.1618896842  
-0.1478121444  
-0.1514812687  
-0.179882132  
-0.2379345225  
-0.3284329127  
-0.4521609097  
-0.6081118239  
-0.7937264441  
-1.005093245  
-1.237070033  
-1.483342405  
-1.736446638  
-1.987820183  
-2.227958028  
-2.446730759  
-2.633899612  
-2.779831245  
-2.87635139  
-2.917659358  
-2.901162364  
-2.82810196  
-2.703843395  
-2.537722249  
-2.342415884  
-2.132853853  
-1.924764556  
-1.733006728  
-1.569896691  
-1.443725662  
-1.357699191  
-1.309431032  
-1.291109795  
-1.290331646  
-1.291525661  
-1.277808493  
-1.233040841  
-1.143841837  
-1.001290509  
-0.8021179748  
-0.5492231355  
-0.2514673445  
0.07723516279  
0.4193971673  
0.7558212221  
1.067606319  
1.338057686  
1.554262982  
1.708179688  
1.79711202  
1.823572307  
1.794561273  
1.720412972  
1.613341559  
1.485912486  
1.349598488  
1.213610811  
1.08411351  
0.9638999724  
0.8525511777  
0.7470218867  
0.6425675704  
0.533883073  
0.4163006563  
0.2868868924  
0.1453072079  
-0.005672081521  
-0.1600987615  
-0.3091964363  
-0.442145613  
-0.5471890445  
-0.6129414297  
-0.6297612997  
-0.5910029754  
-0.4940152288  
-0.3407446414  
-0.1378847918  
0.1034682984  
0.3686144903  
0.6404263376  
0.9007623061  
1.13199944  
1.318508547  
1.447950987  
1.512280004  
1.508368285  
1.438212931  
1.308720655  
1.131085806  
0.9198238336  
0.691525452  
0.4634461651  
0.2520245835  
0.07147872339  
-0.06741448471  
-0.1582172539  
-0.1993223041  
-0.1939638469  
-0.1497425552  
-0.07769146331  
0.009013245291  
0.09656202009  
0.1720666474  
0.2249680536  
0.2481363854  
0.2385140832  
0.1972369617  
0.1292126898  
0.04223804783  
-0.05423453247  
-0.1505012081  
-0.2379845227  
-0.3104047982  
-0.3645850292  
-0.4007868379  
-0.4225415444  
-0.436006306  
-0.4489375927  
-0.4694261796  
-0.5045633549  
-0.5592211134  
-0.6351029348  
-0.7302081229  
-0.8387738696  
-0.9517199519  
-1.057561712  
-1.143672751  
-1.197754699  
-1.20933971  
-1.171119955  
-1.079942671  
-0.9373217849  
-0.7494030089  
-0.5263680342  
-0.2813522284  
-0.02902039497  
