-0.04599338646  
-0.7656564745  
-1.455682235  
-2.08256947  
-2.618221853  
-3.042239712  
-3.343278723  
-3.519383052  
-3.577352924  
-3.531330715  
-3.400877476  
-3.2088193  
-2.979124139  
-2.735005857  
-2.497357998  
-2.283545292  
-2.106528156  
-1.974282061  
-1.889457405  
-1.849297984  
-1.845835558  
-1.86642693  
-1.894694722  
-1.911884323  
-1.898605903  
-1.83685024  
-1.71206238  
-1.515050084  
-1.243442879  
-0.9024637166  
-0.5048586589  
-0.06992579323  
0.3782852699  
0.8133929995  
1.209426098  
1.543532881  
1.79829645  
1.963358892  
2.036151923  
2.02166306  
1.931330414  
1.781223234  
1.589836344  
1.375777622  
1.155702271  
0.9427115401  
0.7454162446  
0.5677154168  
0.4092617328  
0.2664873336  
0.1340033491  
0.006140374997  
-0.1215921713  
-0.2513527924  
-0.3822693539  
-0.510297641  
-0.6286513175  
-0.728724233  
-0.8013737005  
-0.838353648  
-0.8336831924  
-0.7847355088  
-0.6928733103  
-0.5635339478  
-0.4057423485  
-0.2311349337  
-0.05261773463  
0.1171287258  
0.2671007911  
0.3891673483  
0.4788566141  
0.5356257649  
0.5625673696  
0.5656033657  
0.5522570268  
0.5301799704  
0.5056382025  
0.4822046706  
0.4598779978  
0.4348390009  
0.399943846  
0.3459789925  
0.263533192  
0.1452527352  
-0.01190300747  
-0.2048220599  
-0.4232173816  
-0.6497539347  
-0.8614701281  
-1.032423171  
-1.13727562  
-1.155297484  
-1.074160281  
-0.8928294733  
-0.622967581  
-0.2884805937  
0.07691417997  
0.43382411  
0.7424729138  
0.9683401859  
1.087245671  
1.089008417  
0.9790461254  
0.7775904823  
0.5166011698  
0.2348636995  
-0.02794279404  
-0.2372460356  
-0.3686690257  
-0.4114005005  
-0.3693376129  
-0.2598720714  
-0.1105751418  
0.04560195785  
0.1758149242  
0.2525814187  
0.2580032105  
0.1863403689  
0.04462672846  
-0.1486406809  
-0.3664270674  
-0.5771311378  
-0.7489502739  
-0.8539695356  
-0.8714282639  
-0.7898034327  
-0.6075798766  
-0.3327711977  
0.01855125576  
0.4243872275  
0.8592249928  
1.296419218  
1.710293999  
2.07782848  
2.379898475  
2.60210712  
2.735283159  
2.775726459  
2.725251612  
2.591048789  
2.385329136  
2.124708693  
1.829280957  
1.521343549  
1.223812699  
0.9583883256  
0.7436234829  
0.5930839671  
0.5138089623  
0.5052895668  
0.5591335852  
0.6595251468  
0.7844915434  
0.9078986993  
1.001995771  
1.040266167  
1.000265924  
0.8661645875  
0.6306759601  
0.2961576111  
-0.1252552471  
-0.6125304054  
-1.137553777  
-1.667694143  
-2.168847059  
-2.608641598  
-2.959453029  
-3.2009145  
-3.321656643  
-3.320117018  
-3.204356906  
-2.990940234  
-2.703016882  
-2.36786141  
-2.014125326  
-1.669104707  
-1.356307665  
-1.093536531  
-0.891667973  
-0.7542091188  
-0.6776349451  
-0.6524297073  
-0.6646900145  
-0.6980818723  
-0.7359387899  
-0.7632478075  
-0.7683326658  
-0.7440411252  
-0.6883310161  
-0.6042012824  
-0.4989969289  
-0.383170139  
-0.2686634435  
-0.1670980475  
-0.08800408633  
-0.03732480013  
-0.01639085831  
-0.02153046675  
-0.04440551105  
-0.07304817816  
-0.09350035193  
-0.09184286836  
-0.05633739164  
0.02063722076  
0.1411622605  
0.3011121105  
0.4903943882  
0.6941015633  
0.8944378866  
1.073165839  
1.214200496  
1.305962318  
1.343113574  
1.327392912  
1.267389604  
1.17728397  
1.074720255  
0.9781420277  
0.9039882861  
0.8641955531  
0.8643916204  
0.9030801845  
0.9719397255  
1.057223293  
1.142041195  
1.209192937  
1.24411479  
1.237484066  
1.187064583  
1.098491253  
0.984817992  
0.8648773058  
0.7606313592  
0.6938910031  
0.6828557616  
0.7389841205  
0.8646592128  
1.052020386  
1.283166733  
1.53174711  
1.765769039  
1.951279997  
2.056450207  
2.055544922  
1.932269977  
1.682076218  
1.313121158  
0.8457758307  
0.3107356929  
-0.2540433437  
-0.8072163788  
-1.308283192  
-1.721703676  
-2.020442553  
-2.188575235  
-2.222690083  
-2.131973034  
-1.937001026  
-1.667406239  
-1.358668801  
-1.048394963  
-0.7724541228  
-0.5613644817  
-0.4372795251  
-0.4118727177  
-0.4853240047  
-0.6465151782  
-0.8744127143  
-1.140511872  
-1.412078185  
-1.655836551  
-1.841698402  
-1.946089578  
-1.954483574  
-1.862830823  
-1.677726922  
-1.415306128  
-1.09903406  
-0.7567136884  
-0.4171185906  
-0.1067080751  
0.1531587715  
0.3481747836  
0.4720167286  
0.5262224061  
0.5191287564  
0.4641193832  
0.3774898223  
0.2762693568  
0.1763026641  
0.09079561494  
0.02946676294  
-0.001712015649  
-0.0002607720319  
0.0334154849  
0.09679785405  
0.1860125129  
0.2964387457  
0.4230911156  
0.5607677015  
0.7040307  
0.8471078224  
0.9838400781  
1.107765295  
1.212405533  
1.291761176  
1.340950403  
1.356897237  
1.33892171  
1.289103511  
1.212299748  
1.11575947  
1.008345822  
0.8994561937  
0.7977754942  
0.7100638243  
0.64016645  
0.5884223961  
0.5515743654  
0.5232260499  
0.4947814402  
0.45674848  
0.4002126585  
0.3182767393  
0.2072570997  
0.0674766602  
-0.09645902959  
-0.2759349126  
-0.4591118491  
-0.6321317065  
-0.7805887158  
-0.8911015059  
-0.9528076361  
-0.9586235012  
-0.9061306256  
-0.7980160365  
-0.6420091078  
-0.4503305643  
-0.2387111807  
-0.02505436627  
0.1721253989  
0.3353498965  
0.4497695752  
0.5045361079  
0.4938363555  
0.4174700428  
0.2809048911  
0.09479525438  
-0.1260055583  
-0.3638389905  
-0.5998972693  
-0.8159804149  
-0.9961439957  
-1.128081445  
-1.204074551  
-1.22144978  
-1.182477306  
-1.093789575  
-0.9653962357  
-0.809446127  
-0.6389000823  
-0.4662726963  
-0.302568827  
-0.1565103777  
-0.03408328841  
0.06160412821  
0.1302033071  
0.1738107946  
0.1965383188  
0.2040142649  
0.2028645644  
0.2001778566  
0.2029616776  
0.217577775  
0.2491658305  
0.3010939619  
0.3744739793  
0.467832154  
0.5770204334  
0.6954382891  
0.8146067902  
0.9250819168  
1.017629017  
1.084523049  
1.120785297  
1.125157093  
1.100624334  
1.054347009  
0.9969404672  
0.9411489684  
0.9000456486  
0.8849982782  
0.9036849268  
0.9584594597  
1.045356059  
1.153917887  
1.267949416  
1.367139914  
1.429393586  
1.433573463  
1.362307272  
1.204479679  
0.9570679675  
0.6260567722  
0.2262892087  
-0.2197519396  
-0.6841030751  
-1.136166878  
-1.545905521  
-1.887000192  
-2.139585263  
-2.292232388  
-2.342938294  
-2.299009101  
-2.175862939  
-1.994924544  
-1.780894174  
-1.558758404  
-1.350925409  
-1.174851401  
-1.041420936  
-0.9542558633  
-0.9099591003  
-0.8992014921  
-0.9084340738  
-0.9219581338  
-0.924071244  
-0.9010053927  
-0.8424672692  
-0.7426373908  
-0.6005801677  
-0.4200920937  
-0.2090672808  
0.02149538975  
0.2587088171  
0.4891040774  
0.6998989456  
0.8801403506  
1.021635789  
1.119629014  
1.173174517  
1.185201765  
1.16226138  
1.113959294  
1.052113894  
0.9896850304  
0.9395461304  
0.9131985923  
0.9195478479  
0.963863779  
1.047046788  
1.165308602  
1.310328953  
1.469914169  
1.629105458  
1.771655448  
1.88171264  
1.94552282  
1.95296768  
1.898731389  
1.782954374  
1.61128358  
1.394290568  
1.146333697  
0.8839762965  
0.6241721074  
0.3824197557  
0.1711216866  
-0.001656524849  
-0.1328795902  
-0.2246114759  
-0.2834674783  
-0.3195192805  
-0.3448144365  
-0.3716965102  
-0.4111478918  
-0.4713582188  
-0.5567018731  
-0.6672401248  
-0.7987952048  
-0.9435724139  
-1.09123614  
-1.230278078  
-1.349501137  
-1.439419426  
-1.493391543  
-1.508361197  
-1.485116909  
-1.428054512  
-1.344498462  
-1.243681946  
-1.135526417  
-1.029397628  
-0.9329863002  
-0.8514745138  
-0.7870774571  
-0.7390254177  
-0.7039737082  
-0.6767799241  
-0.6515299472  
-0.6226542141  
-0.58596875  
-0.5394745806  
-0.4837816436  
-0.4220851901  
-0.3596873763  
-0.3031297205  
-0.2590750938  
-0.2331190107  
-0.2287344533  
-0.2465301129  
-0.283966879  
-0.335584292  
-0.3937205757  
-0.4496057686  
-0.4946458074  
-0.5216839172  
-0.5260191232  
-0.5060024988  
-0.4631207222  
-0.4015438044  
-0.3272412665  
-0.2468118754  
-0.1662655699  
-0.08995999544  
-0.01989166577  
0.0445186701  
0.1061342847  
0.169339652  
0.2389639052  
0.3190883667  
0.4119606602  
0.5172321089  
0.6316609736  
0.7493521354  
0.8625080319  
0.9625565279  
1.041477146  
1.093072291  
1.113975114  
1.10420301  
1.067154587  
1.009061973  
0.9379876167  
0.8625530085  
0.7906321297  
0.728240853  
0.6788189138  
0.6430193923  
0.6190321035  
0.6033529908  
0.5918340116  
0.5808096596  
0.5680717013  
0.5535104334  
0.5393130397  
0.529686433  
0.5301729507  
0.5466928167  
0.5844982112  
0.6472200972  
0.7361685516  
0.849993708  
0.9847323757  
1.134209794  
1.290689948  
1.445655066  
1.590570724  
1.717530125  
1.819695779  
1.891540133  
1.92889666  
1.928906601  
1.889935237  
1.811538497  
1.694512301  
1.541035765  
1.354844603  
1.141369522  
0.9077270779  
0.6625038143  
0.4152661926  
0.1758395633  
-0.04659625333  
-0.2444416212  
-0.4125126868  
-0.5486155348  
-0.65375385  
-0.731916095  
-0.789470019  
-0.8342375087  
-0.874412627  
-0.9174677144  
-0.969210265  
-1.033127342  
-1.110074209  
-1.198343679  
-1.294061296  
-1.391842542  
-1.485585946  
-1.569295886  
-1.637817088  
-1.68739825  
-1.71602382  
-1.723490952  
-1.711258618  
-1.682109275  
-1.639699654  
-1.588079137  
-1.531250599  
-1.472834726  
-1.41584957  
-1.36261918  
-1.314763206  
-1.273227502  
-1.238306048  
-1.209617813  
-1.186046043  
-1.165658428  
-1.145664907  
-1.122486894  
-1.091979729  
-1.049842446  
-0.9921939707  
-0.9162325778  
-0.8208748313  
-0.7072332082  
-0.5788106157  
-0.4413251866  
-0.3021491377  
-0.1694124448  
-0.05090298545  
0.04706895132  
0.120644017  
0.1690664416  
0.1948798559  
0.2036444306  
0.2031904469  
0.2025360813  
0.2106214487  
0.2350523625  
0.2810333736  
0.3506341858  
0.4424928133  
0.5519712419  
0.6717454596  
0.7927220637  
0.9051609441  
0.9998491346  
1.069175  
1.107969746  
1.114032643  
1.088283058  
1.03455274  
0.9590622323  
0.8696669407  
0.77498634  
0.6835274138  
0.6029084829  
0.5392716291  
0.4969355471  
0.4782975834  
0.4839636944  
0.513051759  
0.563579598  
0.6328532674  
0.7177794289  
0.8150406056  
0.9211140957  
1.032162454  
1.143843194  
1.25112637  
1.348208717  
1.42859728  
1.485415878  
1.511932408  
1.50225597  
1.452125568  
1.359659148  
1.225936036  
1.055303037  
0.8553092802  
0.6362490195  
0.4103429557  
0.1906415479  
-0.01021044145  
-0.1811847805  
-0.3139002162  
-0.4033332736  
-0.4481220434  
-0.4504469035  
-0.4155177068  
-0.3507733917  
-0.2649146506  
-0.1669236061  
-0.06519711122  
0.03310247238  
0.1224258624  
0.198936446  
0.2603707341  
0.3057289881  
0.3348815405  
0.3481803981  
0.3461528089  
0.3293199536  
0.2981542853  
0.2531741792  
0.1951171629  
0.1251475722  
0.0450290619  
-0.04279087339  
-0.1352254257  
-0.2287260703  
-0.3195870338  
-0.40431953  
-0.4800466613  
-0.5448286776  
-0.5978718905  
-0.6395493231  
-0.6712302511  
-0.6949285052  
-0.7128224251  
-0.7267341876  
-0.737663951  
-0.7454751734  
-0.7488004051  
-0.7452164679  
-0.7316483895  
-0.7049678089  
-0.6626716651  
-0.603526193  
-0.5280691941  
-0.4388723741  
-0.3405227056  
-0.23932283  
-0.1427466611  
-0.05873848228  
0.005060225975  
0.04205734211  
0.04736727718  
0.01830785568  
-0.04526810666  
-0.1408294443  
-0.2632081266  
-0.4048149674  
-0.5560358576  
-0.7058068453  
-0.8423565463  
-0.9540997439  
-1.030629651  
-1.063732659  
-1.04830956  
-0.9830942213  
-0.8710225379  
-0.7191777947  
-0.5382484103  
-0.3415281224  
-0.1435466008  
0.04150474682  
0.2013538908  
0.3270097597  
0.4137242024  
0.4614034481  
0.4744212235  
0.4608583613  
0.4312932365  
0.3973067008  
0.3699299392  
0.358234209  
0.3682449272  
0.4023035832  
0.4589283534  
0.5331523984  
0.6172657155  
0.7018388  
0.7768781038  
0.8329804899  
0.862355088  
0.8596248551  
0.8223473247  
0.7512361547  
0.6500872492  
0.5254418567  
0.3860264546  
0.2420238701  
0.1042304791  
-0.01684237067  
-0.1118548895  
-0.17344836  
-0.1969064179  
-0.1806098243  
-0.1262192241  
-0.03856967232  
0.07474276005  
0.2040424037  
0.3384703627  
0.4669924975  
0.5794294541  
0.6673821749  
0.7249581488  
0.7492279828  
0.7403648465  
0.7014686332  
0.638110452  
0.5576511896  
0.468431702  
0.3789132283  
0.2968588272  
0.2286307453  
0.1786637238  
0.1491433282  
0.1399121059  
0.1485957237  
0.1709302332  
0.2012533792  
0.2331192526  
0.2599831848  
0.2758827577  
0.2760800978  
0.2575617109  
0.2193795171  
0.1627665704  
0.09101320657  
0.009113631611  
-0.07678244738  
-0.1600515371  
-0.2343238223  
-0.294174597  
-0.3356896328  
-0.3568401245  
-0.3576367646  
-0.3400462246  
-0.3077138804  
-0.2655198296  
-0.2190465939  
-0.1740171124  
-0.1357591022  
-0.1087442624  
-0.09623734098  
-0.1000636319  
-0.120513293  
-0.1563671484  
-0.2050512124  
-0.2628895537  
-0.3254554465  
-0.3879801774  
-0.4457971729  
-0.4947822868  
-0.5317496998  
-0.5547590072  
-0.5632937039  
-0.5582868075  
-0.5419776286  
-0.5175996076  
-0.4889311694  
-0.4597627776  
-0.4333365292  
-0.4118449624  
-0.3960609415  
-0.3851593431  
-0.3767741878  
-0.3672933937  
-0.3523524757  
-0.327480308  
-0.2887846357  
-0.2336037525  
-0.1610036134  
-0.07207442517  
0.03003719546  
0.1403514474  
0.2525107762  
0.3593988672  
0.4538536381  
0.5293842306  
0.580813287  
0.6047892012  
0.6001073309  
0.5678386813  
0.5112484965  
0.4355174119  
0.3473043003  
0.2541753323  
0.1639566079  
0.0840520535  
0.02080206514  
-0.02107056757  
-0.03885779436  
-0.03206813759  
-0.002392825029  
0.04655490447  
0.1097167772  
0.1812233654  
0.2550992679  
0.3259607751  
0.3895974148  
0.4433711141  
0.4863588857  
0.5192425335  
0.5439498956  
0.5631187891  
0.5794601262  
0.5951327952  
0.6112228001  
0.6274158432  
0.6419142537  
0.651620239  
0.652552315  
0.6404442673  
0.6114258645  
0.5626929196  
0.4930580269  
0.4033033198  
0.2962806402  
0.176740379  
0.05091849869  
-0.07406340808  
-0.1908991297  
-0.2928075706  
-0.3741541421  
-0.4309173469  
-0.4609368376  
-0.4639429915  
-0.4413762896  
-0.3960415312  
-0.3316754429  
-0.2525046646  
-0.1628642037  
-0.06695976478  
0.03121797296  
0.127801114  
0.2188320889  
0.3000067973  
0.3664648126  
0.412755871  
0.4330403161  
0.4216193262  
0.3737415227  
0.2866297515  
0.1605606964  
-0.0001983638135  
-0.1868380475  
-0.3860304139  
-0.5806869128  
-0.7514613019  
-0.8789141568  
-0.9460802019  
-0.9410949662  
-0.8594514275  
-0.7054763596  
-0.492682755  
-0.2428281317  
0.0163060336  
0.2541806741  
0.4413812744  
0.5535642133  
0.5748717002  
0.5002881572  
0.3365525162  
0.1014746711  
-0.1782622517  
-0.470493538  
-0.7416579072  
-0.9609797934  
-1.104161378  
-1.156085941  
-1.11219066  
-0.9784040858  
-0.7697334745  
-0.5077893592  
-0.2176840805  
0.07523432272  
0.3483276579  
0.5839215948  
0.7706284971  
0.9036612749  
0.9842187852  
1.018169922  
1.0143231  
0.9826175858  
0.9325147274  
0.8718313456  
0.8060997194  
0.7384853179  
0.6701574375  
0.6009612107  
0.5302028874  
0.4573697819  
0.382645599  
