-0.02043336374  
0.1093365871  
0.2356811861  
0.3515485268  
0.4502815749  
0.5262824891  
0.5757034431  
0.5970578799  
0.5916634503  
0.5638087435  
0.520565599  
0.4712102041  
0.4262703711  
0.3962686974  
0.3903050291  
0.4146585443  
0.4716032116  
0.5586394  
0.6683003015  
0.7886134494  
0.9042217936  
0.9980778783  
1.053525339  
1.056496727  
0.9975636559  
0.8735267532  
0.6883286852  
0.4531161827  
0.1854108887  
-0.09252786043  
-0.3559736579  
-0.5803503747  
-0.7438760167  
-0.8299139158  
-0.8287369693  
-0.7385230954  
-0.5654689318  
-0.3230502158  
-0.03056031525  
0.2888967116  
0.6106769104  
0.9108945553  
1.168487365  
1.366879723  
1.495089915  
1.548249219  
1.527525966  
1.439534488  
1.295320212  
1.10906271  
0.8966264873  
0.6741051132  
0.4564650342  
0.2564182481  
0.08358575231  
-0.05597689473  
-0.1598758  
-0.2290927703  
-0.2673786968  
-0.2803859452  
-0.2746685827  
-0.2566677459  
-0.2318250226  
-0.2039470461  
-0.1749026409  
-0.144703155  
-0.111946387  
-0.07454104067  
-0.03059317371  
0.02070075046  
0.07831809538  
0.1389731228  
0.1970755538  
0.2451133648  
0.2744496234  
0.2764020299  
0.2434921357  
0.1706458984  
0.05618776494  
-0.09755100125  
-0.2841222937  
-0.493370879  
-0.7123490524  
-0.9266080393  
-1.121684414  
-1.284592229  
-1.405096889  
-1.476612708  
-1.496611445  
-1.466522367  
-1.391177162  
-1.27794242  
-1.135698667  
-0.973858539  
-0.8015642361  
-0.627171528  
-0.4580323129  
-0.3005183426  
-0.1601748493  
-0.04187458683  
0.05017714066  
0.1126478726  
0.1435235023  
0.142711105  
0.112675163  
0.05889974954  
-0.009986116628  
-0.08257806049  
-0.145621922  
-0.1854501424  
-0.1897803556  
-0.1496158579  
-0.06096091855  
0.07396520375  
0.2462614463  
0.4407808544  
0.6374798377  
0.8135583661  
0.9461326156  
1.015102023  
1.005816978  
0.9111837417  
0.7329175923  
0.4817506679  
0.1765659761  
-0.1574529902  
-0.4914441155  
-0.795925224  
-1.043940311  
-1.213923737  
-1.291952669  
-1.273129002  
-1.1619669  
-0.9717291396  
-0.7228327036  
-0.4405020346  
-0.1519658731  
0.1164839825  
0.3422202931  
0.5084949965  
0.6058997593  
0.6329367021  
0.5956763674  
0.5065806402  
0.3826953097  
0.2434371472  
0.1082906151  
-0.005347546834  
-0.08391417517  
-0.1188704046  
-0.1072551048  
-0.05160299076  
0.04069083982  
0.1584337659  
0.2879593626  
0.4145463481  
0.5237965838  
0.6028445871  
0.6413320409  
0.6321217341  
0.5717251954  
0.4604889798  
0.3025437726  
0.1055473609  
-0.119764583  
-0.3601965896  
-0.6008862545  
-0.8262284392  
-1.020910676  
-1.170996859  
-1.264987484  
-1.294781312  
-1.256432538  
-1.150644132  
-0.9829106186  
-0.7632818156  
-0.5057175239  
-0.2270672726  
0.05427177139  
0.3199203437  
0.5531747189  
0.7405931113  
0.8733267608  
0.9480401585  
0.9672471339  
0.9390001561  
0.8759047723  
0.7935365283  
0.7084399626  
0.6359434347  
0.5880918111  
0.5719824983  
0.5887757991  
0.6335281  
0.6959122875  
0.7617383488  
0.8150710576  
0.8406405784  
0.8261965191  
0.7644498332  
0.6543301925  
0.501348526  
0.3170212826  
0.1174367415  
-0.07882227769  
-0.2531255839  
-0.3892367519  
-0.4754277522  
-0.5059710776  
-0.4818048987  
-0.4102957743  
-0.304132749  
-0.1795078586  
-0.05383863252  
0.05665069561  
0.1391560718  
0.1860204972  
0.1957152617  
0.172919385  
0.1277010374  
0.07388551912  
0.02684927448  
0.001051837757  
0.007658347896  
0.0526203875  
0.1354907994  
0.249169625  
0.3806235136  
0.5124996147  
0.6253755715  
0.7003565834  
0.7216069211  
0.6784855727  
0.5669717551  
0.3902062401  
0.1581072806  
-0.1138597793  
-0.4065265977  
-0.6992141276  
-0.9719453379  
-1.207397271  
-1.392376329  
-1.518681921  
-1.583344888  
-1.588306077  
-1.53966246  
-1.446645891  
-1.320507034  
-1.173420069  
-1.017516848  
-0.8640716511  
-0.7228697181  
-0.6017042508  
-0.5060140704  
-0.4386179064  
-0.3995748346  
-0.3861823559  
-0.3931656748  
-0.4130911876  
-0.437030771  
-0.455467411  
-0.4593837538  
-0.4414327769  
-0.3970584203  
-0.3253786198  
-0.2296981577  
-0.117499271  
0.0001521772427  
0.109787307  
0.1972006269  
0.2494201554  
0.2567383626  
0.2145132539  
0.1244647634  
-0.004781221085  
-0.1580231033  
-0.3147436959  
-0.4511901348  
-0.5430545217  
-0.5684464658  
-0.5107954682  
-0.3612966555  
-0.1205847139  
0.2006082735  
0.5819186821  
0.9949310459  
1.405710134  
1.778034249  
2.076989002  
2.272532493  
2.342697817  
2.276063182  
2.073262076  
1.747345995  
1.322947349  
0.8342820922  
0.3221351022  
-0.169897401  
-0.5995971837  
-0.9303117336  
-1.134725254  
-1.197788517  
-1.118436091  
-0.9098564557  
-0.5982132672  
-0.219899529  
0.1823929195  
0.5643640927  
0.8850009209  
1.111092965  
1.220790333  
1.20577484  
1.071760024  
0.8372870195  
0.5309832906  
0.1876862571  
-0.1560476011  
-0.4664292882  
-0.7163346008  
-0.888133339  
-0.9751097184  
-0.9813886923  
-0.9204374561  
-0.8124630313  
-0.6811083369  
-0.5499515808  
-0.4392939698  
-0.3636461126  
-0.3301972932  
-0.3383902646  
-0.3805760494  
-0.4435584366  
-0.5107682817  
-0.5647113434  
-0.5893804625  
-0.5723196061  
-0.5061326609  
-0.3893114225  
-0.226360389  
-0.02725382988  
0.193635652  
0.419004714  
0.6303096088  
0.8095123488  
0.9407442083  
1.011748497  
1.014999025  
0.9484186162  
0.8156249334  
0.6256902392  
0.3924056565  
0.1331087658  
-0.1328459192  
-0.3858362726  
-0.6077722533  
-0.7837677214  
-0.9034849924  
-0.9619960637  
-0.9600536806  
-0.9037141735  
-0.8033740934  
-0.6723184692  
-0.5250055328  
-0.3753041573  
-0.2349511418  
-0.1124377884  
-0.01248767612  
0.06384140831  
0.1184651142  
0.1551656394  
0.17829049  
0.1915327633  
0.1970237281  
0.194924642  
0.1835925054  
0.1602681209  
0.1221424085  
0.06754677715  
-0.002993160303  
-0.08611567395  
-0.1755612091  
-0.2627776892  
-0.3381281142  
-0.3925127345  
-0.4191050158  
-0.4148877725  
-0.3816263629  
-0.3260510522  
-0.2591119439  
-0.1943643027  
-0.1456745586  
-0.1246370913  
-0.1381203937  
-0.1864307738  
-0.2624585855  
-0.3520754596  
-0.4357863847  
-0.4914913954  
-0.4979270729  
-0.4382896267  
-0.3034169063  
-0.09399463632  
0.1786503125  
0.4933505026  
0.8214629616  
1.130470396  
1.388314512  
1.567806727  
1.650440083  
1.629013379  
1.508659939  
1.30611549  
1.047330117  
0.7637999219  
0.4881556186  
0.249680906  
0.07040457051  
-0.03768206836  
-0.0739150762  
-0.04864006578  
0.01861906458  
0.1021753495  
0.1738842855  
0.2070261479  
0.1798045358  
0.07805669264  
-0.1031325099  
-0.3590050535  
-0.6758391102  
-1.032584571  
-1.40313337  
-1.758895361  
-2.071378686  
-2.314527243  
-2.466651915  
-2.511894759  
-2.441206169  
-2.252878098  
-1.952677821  
-1.553615871  
-1.075353103  
-0.5432258883  
0.01313712305  
0.5616055438  
1.069707783  
1.507050311  
1.847799823  
2.072994214  
2.172383467  
2.145549527  
2.002094455  
1.760790185  
1.447740941  
1.093712415  
0.7309427262  
0.3898024862  
0.09573346012  
-0.1331669896  
-0.287611328  
-0.3674704765  
-0.3810080913  
-0.3431287636  
-0.2729318589  
-0.1909125887  
-0.1162099968  
-0.06426722497  
-0.04517130611  
-0.06285821053  
-0.1151937299  
-0.1948541863  
-0.2907963982  
-0.390045323  
-0.4795300325  
-0.5477006614  
-0.5857271905  
-0.5881924581  
-0.5532385384  
-0.482268567  
-0.3792996767  
-0.2501493176  
-0.1016083157  
0.05927025924  
0.225680905  
0.3913393871  
0.5505424749  
0.6980699477  
0.8290211676  
0.9386711811  
1.022422485  
1.075914192  
1.095301332  
1.077682792  
1.021632004  
0.92772944  
0.7990151861  
0.6412477624  
0.4628858521  
0.2747465733  
0.08931590312  
-0.08023816287  
-0.2212723848  
-0.3229629517  
-0.3775235023  
-0.3812033319  
-0.3348997697  
-0.244291813  
-0.1194342908  
0.02616240105  
0.1768792706  
0.3166180876  
0.4304995038  
0.5064358274  
0.5363576846  
0.5169333312  
0.4496951252  
0.3405491015  
0.198749314  
0.03548922116  
-0.1376785579  
-0.3103601698  
-0.4745602301  
-0.6254537654  
-0.7615971622  
-0.8845592884  
-0.9980486566  
-1.106689196  
-1.214655805  
-1.324398029  
-1.435664727  
-1.544994233  
-1.645778519  
-1.728893576  
-1.78383612  
-1.800195207  
-1.769267895  
-1.685574563  
-1.548065356  
-1.360812149  
-1.133092209  
-0.8788047178  
-0.6152760291  
-0.3615726897  
-0.1365266816  
0.04330605058  
0.1654986017  
0.2231957183  
0.2159508257  
0.1498534105  
0.03690874581  
-0.1062651464  
-0.2602739502  
-0.4051117787  
-0.5223828565  
-0.597306175  
-0.6202670685  
-0.5877052371  
-0.5022508898  
-0.3720959401  
-0.2096980552  
-0.03002676842  
0.1514166693  
0.3205021943  
0.4660603455  
0.5809415599  
0.6624489758  
0.7121418927  
0.7350891341  
0.7387540852  
0.7317265643  
0.7224910427  
0.7184314935  
0.7251706442  
0.7462769836  
0.7833178858  
0.8361467669  
0.9033217004  
0.9825178624  
1.070846231  
1.165019653  
1.261365585  
1.355723816  
1.443306344  
1.518617194  
1.575509561  
1.607458516  
1.608057569  
1.571731872  
1.494560031  
1.375123448  
1.21519697  
1.020152489  
0.7989439691  
0.5636023431  
0.3282387375  
0.1076575485  
-0.08426433291  
-0.236204962  
-0.3407771525  
-0.3954259437  
-0.4026925091  
-0.3697514785  
-0.3072921589  
-0.2278884941  
-0.1441294716  
-0.06680737539  
-0.003477218111  
0.04238655167  
0.07147197414  
0.08796732217  
0.09826910685  
0.109308441  
0.1267966168  
0.1537329506  
0.1894224444  
0.2292127486  
0.2649904745  
0.2863491619  
0.2822553481  
0.2428951418  
0.1614186451  
0.03526481848  
-0.1331276129  
-0.3363600304  
-0.5628221768  
-0.798046628  
-1.026422413  
-1.233007569  
-1.405164506  
-1.533774089  
-1.613891057  
-1.644776743  
-1.629375575  
-1.573362848  
-1.483986717  
-1.368909108  
-1.235256688  
-1.089027612  
-0.9349193841  
-0.7765484748  
-0.6169684621  
-0.459308681  
-0.3073624393  
-0.1659296393  
-0.04080432381  
0.0616514214  
0.1353052845  
0.175292302  
0.1791043218  
0.1474933978  
0.08498860895  
-0.0001473404615  
-0.09657112496  
-0.1910959804  
-0.2703374717  
-0.3225353034  
-0.3392449397  
-0.3166236279  
-0.256058925  
-0.1640367042  
-0.05122297297  
0.06907713597  
0.1828610292  
0.2774369679  
0.3431907187  
0.374829166  
0.3719153479  
0.3386539695  
0.2829889761  
0.2152025628  
0.146273059  
0.08625246707  
0.04292007026  
0.0208775443  
0.02118336911  
0.04149800467  
0.07668860858  
0.119715053  
0.1626880413  
0.1979074985  
0.2187896822  
0.2205888715  
0.200875326  
0.1597531838  
0.09984023311  
0.02602009994  
-0.05498328694  
-0.1351985817  
-0.2061127962  
-0.2594673109  
-0.2880851286  
-0.2866826951  
-0.2525925627  
-0.1863257123  
-0.09190787047  
0.02308315635  
0.1478278105  
0.2689363762  
0.3714834945  
0.4403343935  
0.4616915918  
0.4246873182  
0.322885343  
0.1554874035  
-0.07193898073  
-0.3473368133  
-0.6527434058  
-0.9655697472  
-1.260494975  
-1.511785307  
-1.695810578  
-1.793442143  
-1.792078464  
-1.687021091  
-1.482050769  
-1.189114812  
-0.8271737432  
-0.4203403752  
0.004456327061  
0.4200046576  
0.8012454433  
1.127320096  
1.383032543  
1.559582154  
1.654540221  
1.671149286  
1.617103379  
1.50302744  
1.340912828  
1.142726761  
0.9193829203  
0.6801739958  
0.4326767331  
0.1830505374  
-0.0634033314  
-0.3016131859  
-0.5262025204  
-0.7312028084  
-0.9100840977  
-1.056108622  
-1.162935647  
-1.225345322  
-1.239937901  
-1.205650541  
-1.124001231  
-0.9989996281  
-0.8367459608  
-0.6447999771  
-0.4314182725  
-0.2048072962  
0.02752202248  
0.2591974562  
0.4852066451  
0.7019050626  
0.906858385  
1.098581417  
1.276252777  
1.439437658  
1.587870699  
1.72127839  
1.839252751  
1.941129077  
2.025864884  
2.09190822  
2.137083587  
2.158503409  
2.152581047  
2.115160341  
2.041797167  
1.928207857  
1.770840308  
1.567525283  
1.318127547  
1.025101569  
0.6938854574  
0.3330325478  
-0.04592971408  
-0.4289495217  
-0.8001755543  
-1.142904216  
-1.440676061  
-1.678425388  
-1.843589213  
-1.927080254  
-1.92403856  
-1.834300803  
-1.662536683  
-1.4180462  
-1.114210534  
-0.7676586379  
-0.3971900122  
-0.02256612338  
0.336737265  
0.662707611  
0.9398004529  
1.155693675  
1.301738069  
1.373112241  
1.368689528  
1.290706121  
1.144293997  
0.9369929808  
0.6782993144  
0.3793078958  
0.05246250376  
-0.2886453326  
-0.6294795314  
-0.9548752748  
-1.249548489  
-1.498858595  
-1.689821192  
-1.812295497  
-1.860212767  
-1.832639415  
-1.73445922  
-1.576473845  
-1.374783843  
-1.149425942  
-0.9223417352  
-0.7149220917  
-0.5454208339  
-0.4266357805  
-0.3642097436  
-0.3558773898  
-0.3917989383  
-0.4560160319  
-0.5288374436  
-0.5898342186  
-0.6209915329  
-0.6095583135  
-0.5501294995  
-0.4456535335  
-0.3071956063  
-0.1525021712  
-0.003581330408  
0.1163182349  
0.1858786817  
0.188568284  
0.1147767719  
-0.03702925273  
-0.260253531  
-0.5411424811  
-0.8605815988  
-1.196380805  
-1.525709856  
-1.827312412  
-2.083249947  
-2.280000657  
-2.408895049  
-2.465947575  
-2.451280017  
-2.368323943  
-2.223011286  
-2.023093514  
-1.777667358  
-1.496889782  
-1.191797594  
-0.8741237837  
-0.5559863901  
-0.2493924689  
0.03446244973  
0.2860209085  
0.4981940004  
0.6670412099  
0.7921487295  
0.8766156788  
0.9266076539  
0.9505442285  
0.958047372  
0.9588045172  
0.9615533326  
0.9733061908  
0.9989235737  
1.041038569  
1.10027143  
1.175629342  
1.264957863  
1.36531648  
1.473204878  
1.584625782  
1.695006052  
1.799096454  
1.890930543  
1.963972142  
2.011505131  
2.027269397  
2.006281707  
1.945698395  
1.845568327  
1.709287622  
1.543622555  
1.358242216  
1.164757811  
0.9754062115  
0.8015571473  
0.6522843614  
0.5332479604  
0.446087252  
0.3884339347  
0.3545761948  
0.3366487211  
0.3261650738  
0.3156158566  
0.2998589163  
0.2770479353  
0.2489347356  
0.2204975995  
0.1989638642  
0.1924047861  
0.2081754253  
0.2514582749  
0.3241850063  
0.4245159352  
0.5469442469  
0.682990448  
0.822356634  
0.9542983478  
1.069003671  
1.158726529  
1.218514021  
1.246430756  
1.243294295  
1.211994483  
1.156572355  
1.08122694  
0.9894443594  
0.8834031864  
0.7637292053  
0.6296327276  
0.4793588807  
0.3108465961  
0.1224545697  
-0.08638925886  
-0.3147371991  
-0.5599280644  
-0.8176733104  
-1.082389791  
-1.347689155  
-1.606944265  
-1.853832803  
-2.082788355  
-2.289311128  
-2.470137513  
-2.623267418  
-2.747900013  
-2.844288246  
-2.913558537  
-2.957494957  
-2.978302096  
-2.978329139  
-2.959766348  
-2.924315275  
-2.872867947  
-2.80523186  
-2.71998109  
-2.614484917  
-2.485175086  
-2.32807129  
-2.139537907  
-1.917187474  
-1.660805413  
-1.373106536  
-1.060167062  
-0.7313562438  
-0.3986987359  
-0.07566810076  
0.2244596886  
0.4904613134  
0.7149313937  
0.8956122491  
1.036007047  
1.145069549  
1.235928618  
1.323785416  
1.423269839  
1.545677904  
1.696577064  
1.874223665  
2.069118744  
2.264877932  
2.440323876  
2.572536409  
2.640385426  
2.62797411  
2.52743103  
2.340550999  
2.079006297  
1.763053384  
1.418945032  
