0.06717920002  
-0.2108385678  
-0.477783305  
-0.7215812125  
-0.9323240848  
-1.103200089  
-1.231046534  
-1.316469878  
-1.363534317  
-1.379066042  
-1.371679329  
-1.350643486  
-1.324744684  
-1.301272872  
-1.285249175  
-1.278991535  
-1.282046593  
-1.291491655  
-1.302554654  
-1.309465271  
-1.306418075  
-1.288515545  
-1.252566188  
-1.197621428  
-1.125183212  
-1.039050104  
-0.9448198142  
-0.8491230848  
-0.7586927848  
-0.6794000159  
-0.6154054795  
-0.5685401479  
-0.5380130307  
-0.5204913609  
-0.5105458633  
-0.5013942919  
-0.4858469786  
-0.4573157682  
-0.4107462596  
-0.3433421049  
-0.2549839133  
-0.148286993  
-0.02829447637  
0.09814836576  
0.2232492028  
0.339237142  
0.4393164676  
0.5184807934  
0.5740909316  
0.6061449013  
0.6172145016  
0.6120621595  
0.596987457  
0.5789923236  
0.5648601242  
0.5602745897  
0.5690769695  
0.5927620184  
0.6302783009  
0.6781601125  
0.7309830063  
0.7820812868  
0.8244426729  
0.8516586288  
0.8588021872  
0.8431113627  
0.8043751248  
0.7449744228  
0.6695607781  
0.5844275455  
0.4966545812  
0.4131616713  
0.3398016598  
0.2806289788  
0.237447589  
0.2096940475  
0.194674764  
0.1881047702  
0.1848634828  
0.1798494992  
0.1687983302  
0.1489426742  
0.1194114193  
0.08131420181  
0.03750527088  
-0.007940688645  
-0.05043947203  
-0.08569394741  
-0.1104340136  
-0.1229835367  
-0.1235603356  
-0.1142531129  
-0.09867949484  
-0.08137395986  
-0.06701183464  
-0.05958735408  
-0.06169745008  
-0.0740468131  
-0.09526674379  
-0.1220878529  
-0.1498434709  
-0.1732283278  
-0.1871970772  
-0.1878423427  
-0.173120796  
-0.1432982774  
-0.1010296819  
-0.05106079939  
0.0004183149543  
0.04666104137  
0.08137704694  
0.09969818204  
0.09896438726  
0.07920365966  
0.0432353617  
-0.003620117445  
-0.05417901857  
-0.1002998166  
-0.1339114228  
-0.1480421886  
-0.1377025568  
-0.1005134821  
-0.03700701557  
0.04941878636  
0.1528855843  
0.2656823121  
0.3791036104  
0.4843545578  
0.5734379414  
0.6399090823  
0.6794414408  
0.6901465607  
0.6726368024  
0.6298306674  
0.5665420131  
0.488899798  
0.4036640137  
0.3175114839  
0.2363706377  
0.164871674  
0.1059728147  
0.06080048955  
0.02871821665  
0.007609402764  
-0.005667542615  
-0.01472113224  
-0.02303591288  
-0.03344428368  
-0.04772563354  
-0.06638906263  
-0.08866596884  
-0.1127017859  
-0.1359148291  
-0.1554564286  
-0.1687075483  
-0.1737290155  
-0.1696142984  
-0.1566861421  
-0.1365297495  
-0.1118492969  
-0.086181813  
-0.06350002031  
-0.04775606332  
-0.04241326394  
-0.05001589128  
-0.07184458712  
-0.1076867295  
-0.1557519915  
-0.2127407906  
-0.2740700911  
-0.334242631  
-0.3873277163  
-0.4275156138  
-0.4496963712  
-0.4500000315  
-0.4262462768  
-0.3782434909  
-0.3079122622  
-0.2191981386  
-0.1177867492  
-0.01063880092  
0.09460245631  
0.1902845938  
0.2694186808  
0.3262942702  
0.3569747921  
0.3596266762  
0.3346531835  
0.2846331141  
0.2140639656  
0.1289487624  
0.03626023474  
-0.05666226516  
-0.1427381921  
-0.2157285327  
-0.270740174  
-0.3046017668  
-0.3160806579  
-0.3059300187  
-0.2767464758  
-0.2326658091  
-0.1789082718  
-0.1212252881  
-0.06529021897  
-0.01610712362  
0.02251625808  
0.04836054672  
0.06100677862  
0.06184761078  
0.05388270538  
0.04131906701  
0.02902366515  
0.02188473409  
0.02415692054  
0.0388805419  
0.06743244322  
0.1092816984  
0.1619760926  
0.2213690524  
0.2820647154  
0.338030725  
0.3832988244  
0.4126808359  
0.4224001327  
0.4105686185  
0.3774428327  
0.3254327577  
0.258858546  
0.1834831872  
0.1058864449  
0.03274830997  
-0.02986548887  
-0.07712973555  
-0.105924729  
-0.1150966159  
-0.1054716436  
-0.07965221658  
-0.041612186  
0.003846802936  
0.05170238947  
0.09731696259  
0.1369602846  
0.168201007  
0.1901179067  
0.2033215025  
0.2097778543  
0.2124712364  
0.214934008  
0.2207059659  
0.232777906  
0.2530906272  
0.2821429883  
0.3187670558  
0.3601099605  
0.4018333486  
0.4385359067  
0.4643536533  
0.4736917186  
0.4619955705  
0.4264718258  
0.3666515148  
0.2847160571  
0.1855067066  
0.07619531977  
-0.0343693313  
-0.1365818972  
-0.2211595423  
-0.280251873  
-0.3084249026  
-0.3033963891  
-0.2663986162  
-0.2021165069  
-0.1181911017  
-0.02434207251  
0.06877413852  
0.1508361682  
0.2130828123  
0.2493393557  
0.2567079165  
0.2358397159  
0.1907588277  
0.1282660123  
0.05701641612  
-0.01361258752  
-0.07470529027  
-0.1188970941  
-0.1412384095  
-0.1397272882  
-0.1154709245  
-0.07246669118  
-0.01705250687  
0.04288723259  
0.0988516415  
0.1426713888  
0.1673632589  
0.1678023851  
0.1411584309  
0.08706832931  
0.007565388042  
-0.09320016657  
-0.2093896258  
-0.3339901615  
-0.4593564391  
-0.5777421271  
-0.6817775131  
-0.7649002834  
-0.8217197923  
-0.8483263443  
-0.8425370888  
-0.8040659277  
-0.7346039088  
-0.6377730715  
-0.518938515  
-0.3848570668  
-0.2431733918  
-0.1017869695  
0.03184992149  
0.1514244116  
0.2523683261  
0.3322773601  
0.3910866595  
0.4309618765  
0.4559092742  
0.4711468536  
0.4823184574  
0.4946554759  
0.5122064274  
0.5372369539  
0.5698950998  
0.6081775413  
0.6482133179  
0.684821809  
0.7122619764  
0.7250764332  
0.7189061757  
0.6911726171  
0.6415245131  
0.5719936529  
0.4868414372  
0.3921027853  
0.2949058683  
0.2026398781  
0.1220890146  
0.05864703428  
0.015708614  
-0.005675021708  
-0.006845417532  
0.008724411084  
0.03594164267  
0.06880142944  
0.1011665393  
0.1275268637  
0.1436267451  
0.1468774309  
0.1365176171  
0.1135049092  
0.0801806569  
0.03976710126  
-0.004207176185  
-0.04846528883  
-0.09042955632  
-0.1284985403  
-0.1621117154  
-0.191613149  
-0.2179366977  
-0.2421890351  
-0.2652023884  
-0.2871475119  
-0.3072771619  
-0.3238550048  
-0.3342915184  
-0.3354778773  
-0.3242679806  
-0.2980467255  
-0.2552986331  
-0.1960804005  
-0.1223345292  
-0.03797286748  
0.05129780274  
0.1383947591  
0.2155014442  
0.2748554392  
0.3095998193  
0.3145948713  
0.2870935358  
0.2271934735  
0.1379996408  
0.02547507469  
-0.1020285425  
-0.2344955  
-0.3611764016  
-0.4716005257  
-0.5565825528  
-0.6090986753  
-0.6249508331  
-0.6031403837  
-0.545922867  
-0.4585355799  
-0.3486399671  
-0.2255328246  
-0.09922081475  
0.02054678105  
0.1251919006  
0.2080703011  
0.2650124342  
0.2946039804  
0.2981737128  
0.2795127883  
0.244358889  
0.1997069745  
0.1530275649  
0.1114746751  
0.08116368923  
0.06659310665  
0.07026314479  
0.09251833827  
0.1316253971  
0.1840567856  
0.2449504222  
0.3086768139  
0.3694578173  
0.4219587329  
0.4618001183  
0.4859369193  
0.4928741866  
0.4827079956  
0.4570035059  
0.4185347217  
0.3709307417  
0.3182711358  
0.2646912363  
0.2140233456  
0.1695218411  
0.1336740788  
0.1081121689  
0.09359793234  
0.09007270943  
0.09673987731  
0.1121650054  
0.1343685652  
0.160917357  
0.1890204973  
0.2156365152  
0.2376170649  
0.2518969554  
0.2557345047  
0.2469859262  
0.2243991999  
0.1878700477  
0.138629471  
0.07930613408  
0.0138351177  
-0.05280146874  
-0.1150001237  
-0.1670756755  
-0.2038814514  
-0.2214102709  
-0.2173211576  
-0.1913071052  
-0.1452537832  
-0.08316000135  
-0.01081736991  
0.06471658942  
0.1358011697  
0.1949714548  
0.2356920311  
0.253016661  
0.2440887236  
0.2084211033  
0.1479344737  
0.06675306774  
-0.02921534644  
-0.1328662359  
-0.2365773587  
-0.3329148453  
-0.4152817601  
-0.478450147  
-0.5189252413  
-0.5351102623  
-0.5272749049  
-0.4973413282  
-0.4485329124  
-0.3849356934  
-0.3110384572  
-0.2313096846  
-0.1498585224  
-0.0702167274  
0.004754093598  
0.07283612162  
0.1323442052  
0.1819725948  
0.2206517826  
0.2474555935  
0.2615932482  
0.2624901397  
0.2499524532  
0.2243684984  
0.1869090939  
0.1396598057  
0.08564696521  
0.02871377405  
-0.02675283845  
-0.07622881749  
-0.1155433211  
-0.1413883821  
-0.1517653391  
-0.1462936859  
-0.126330513  
-0.09485111266  
-0.05610619456  
-0.01508664312  
0.02314272787  
0.05413835597  
0.07471200071  
0.08340462582  
0.08072996585  
0.06913710223  
0.05269578231  
0.03653879235  
0.02613555461  
0.02649395484  
0.04140397386  
0.07282931284  
0.1205428776  
0.1820494147  
0.2528269074  
0.3268456247  
0.3973046289  
0.4574824515  
0.5015871831  
0.5254922511  
0.5272552011  
0.5073527159  
0.4686020458  
0.4157860884  
0.3550274205  
0.2930081157  
0.236134935  
0.1897577578  
0.1575498037  
0.1411174665  
0.1398954939  
0.1513290231  
0.1713101288  
0.1948152233  
0.2166364783  
0.232119431  
0.237791791  
0.2317888151  
0.2140204184  
0.186037446  
0.1506190123  
0.1111367158  
0.07079240377  
0.03186142364  
-0.0049227085  
-0.04071477765  
-0.07853000356  
-0.1228059464  
-0.1785738096  
-0.2503350466  
-0.3408128171  
-0.4497751958  
-0.5731714063  
-0.7027707502  
-0.8264640835  
-0.9292631844  
-0.9949478793  
-1.008182782  
-0.9568098564  
-0.8339929677  
-0.6398491104  
-0.3822672058  
-0.07671182903  
0.2550354191  
0.5870828481  
0.8923187301  
1.145587834  
1.326707606  
1.422895058  
1.430249408  
1.354087778  
1.208102353  
1.012476401  
0.7912494466  
0.5693193932  
0.3694991192  
0.2100165609  
0.1027558743  
0.05242072604  
0.05665457119  
0.1070181756  
0.1906179723  
0.292110817  
0.3957839673  
0.4874305494  
0.5557943254  
0.5934462557  
0.5970350417  
0.5669655606  
0.5066120854  
0.4212353971  
0.3168140846  
0.1989595346  
0.07208709509  
-0.06104711368  
-0.1994073719  
-0.3433491974  
-0.4939862169  
-0.6523774039  
-0.8186856155  
-0.9914647174  
-1.167198702  
-1.340185647  
-1.5028009  
-1.646107557  
-1.760739885  
-1.837932969  
-1.870554026  
-1.85399958  
-1.786826251  
-1.671038879  
-1.512006062  
-1.318005407  
-1.099481372  
-0.8680944363  
-0.6356893281  
-0.4132891328  
-0.2102326136  
-0.03352477115  
0.1125323029  
0.2264230625  
0.3092198817  
0.364147218  
0.3959744707  
0.4103169757  
0.4129306319  
0.4090828569  
0.4030720548  
0.3979406055  
0.3954070557  
0.3960068287  
0.3994051553  
0.4048248102  
0.4115034166  
0.4191084477  
0.4280240295  
0.4394662334  
0.4553916277  
0.4782093226  
0.5103433192  
0.5537105531  
0.6092044186  
0.6762862906  
0.7527569826  
0.8347728002  
0.917129121  
0.993783285  
1.058563076  
1.105954925  
1.131867523  
1.134240457  
1.113406141  
1.072128446  
1.015306517  
0.9493665359  
0.8814178589  
0.8183001766  
0.7656425871  
0.7270807294  
0.7037482895  
0.6941110586  
0.6941785668  
0.6980597267  
0.6987825264  
0.6892647256  
0.6632850885  
0.6163258817  
0.5461610659  
0.4531155196  
0.3399690063  
0.2115297855  
0.07395776626  
-0.06604623262  
-0.2020596814  
-0.3286406215  
-0.4418040716  
-0.5392217752  
-0.6201312958  
-0.6849879314  
-0.7349461135  
-0.7712728565  
-0.7948080853  
-0.8055789596  
-0.8026441804  
-0.7842061233  
-0.7479763793  
-0.6917477776  
-0.6140666253  
-0.5148994842  
-0.3961633294  
-0.2620106467  
-0.1187966747  
0.02530583525  
0.1610138453  
0.2788902544  
0.370424084  
0.4290774978  
0.4511639909  
0.4363991186  
0.3880497695  
0.3126387849  
0.2192301242  
0.1183946  
0.02098685737  
-0.06309119031  
-0.1259837804  
-0.1626699064  
-0.1713618408  
-0.1534723789  
-0.1131708462  
-0.05662176606  
0.008968409963  
0.07635131888  
0.1391237344  
0.1923986524  
0.2331597448  
0.2603048035  
0.2743821342  
0.2771234365  
0.2708587356  
0.2579465098  
0.2403180037  
0.2192035317  
0.1950865955  
0.1678563078  
0.1371158564  
0.1025572125  
0.06430645691  
0.0231583283  
-0.01935735813  
-0.06110712128  
-0.09964977858  
-0.1326513208  
-0.1583181898  
-0.1757666013  
-0.1852329589  
-0.1880709249  
-0.1865154609  
-0.183243613  
-0.1807971351  
-0.1809743782  
-0.1843057732  
-0.1897233132  
-0.1945057158  
-0.1945436719  
-0.1849049555  
-0.1606374056  
-0.117696682  
-0.05385303621  
0.03055989422  
0.1322031305  
0.244668057  
0.3588544224  
0.4637443477  
0.5475104457  
0.5988172523  
0.6081547716  
0.5690292496  
0.4788554774  
0.3394213115  
0.1568586454  
-0.05889339807  
-0.295064952  
-0.5373647756  
-0.7714494956  
-0.9843811484  
-1.165881862  
-1.309236641  
-1.411740262  
-1.474648076  
-1.502648904  
-1.502957799  
-1.484152736  
-1.454916019  
-1.422854187  
-1.393524526  
-1.369794843  
-1.351585137  
-1.336011663  
-1.317891866  
-1.29054256  
-1.246762062  
-1.179886652  
-1.08480515  
-0.9588214905  
-0.8022883653  
-0.618931347  
-0.4158422705  
-0.2031243042  
0.006791427458  
0.2001139024  
0.362874329  
0.4822298412  
0.5477838659  
0.5528016973  
0.4951972193  
0.378181448  
0.2104698792  
0.005992249744  
-0.216922963  
-0.4368537126  
-0.6309975192  
-0.7771456029  
-0.8557431052  
-0.8518157183  
-0.7565562112  
-0.5683762596  
-0.2932828633  
0.05548901339  
0.458581198  
0.892240241  
1.330509283  
1.747623218  
2.120364169  
2.430100138  
2.664291388  
2.817313091  
2.890520301  
2.891588677  
2.833241258  
2.73155048  
2.604032137  
2.467775287  
2.337810028  
2.225886967  
2.139751945  
2.082954296  
2.055128747  
2.052664681  
2.069619958  
2.098726428  
2.132360513  
2.163354924  
2.185582363  
2.194285495  
2.186156466  
2.159221324  
2.112585982  
2.04612435  
1.960178926  
1.855321599  
1.732216821  
1.591594185  
1.434318553  
1.261531683  
1.074829699  
0.8764207379  
0.6692297964  
0.456912667  
0.2437470594  
0.03440601475  
-0.1663895218  
-0.3542897458  
-0.5257735239  
-0.6785663086  
-0.8119556893  
-0.9269435783  
-1.026189976  
-1.113734  
-1.194519962  
-1.273775915  
-1.356342996  
-1.446048577  
-1.545225993  
-1.654457701  
-1.772584146  
-1.89697007  
-2.023976929  
-2.149549139  
-2.269803405  
-2.381507498  
-2.482350978  
-2.570969152  
-2.646705579  
-2.709173196  
-2.757711522  
-2.790864285  
-2.806008166  
-2.799253815  
-2.765681111  
-2.699924945  
-2.597056176  
-2.453639216  
-2.26879634  
-2.045097565  
-1.789095877  
-1.511372906  
-1.226030088  
-0.9496394617  
-0.6997618638  
-0.4932048074  
-0.3442421321  
-0.263036632  
-0.2544668378  
-0.3175122326  
-0.4452735024  
-0.6255986736  
-0.8422293807  
-1.076291304  
-1.307954441  
-1.518046149  
-1.689471518  
-1.808306935  
-1.864512027  
-1.852253213  
-1.76988008  
-1.619623595  
-1.407094649  
-1.140661954  
-0.8307658049  
-0.489208793  
-0.1284512841  
0.2390770329  
0.6016314468  
0.94875106  
1.271772515  
1.564218465  
1.822020659  
2.04354791  
2.229426573  
2.382161544  
2.505607628  
2.604352507  
2.68309371  
2.746094933  
2.796795181  
2.837609262  
2.869934186  
2.894331991  
2.910832363  
2.919273099  
2.919602148  
2.912069298  
2.897267403  
2.876018889  
2.849135641  
2.817108431  
2.779806222  
2.736259118  
2.68457807  
2.62205468  
2.545424558  
2.451271629  
2.336489105  
2.198739784  
2.036811633  
1.85082438  
1.642234859  
1.413640926  
1.168412778  
0.9102000553  
0.6423944392  
0.3676306064  
0.08740378742  
-0.1981279839  
-0.4901076353  
-0.7906892918  
-1.102502062  
-1.427908901  
-1.768127725  
-2.122317366  
-2.48674034  
-2.854137117  
-3.213439393  
-3.549919582  
-3.845861489  
-4.081746813  
-4.237913078  
-4.296539062  
-4.243753531  
-4.071603905  
-3.779607164  
-3.37561048  
-2.875777458  
-2.30360975  
-1.688047697  
-1.060858049  
