198.6423962  
199.4433926  
200.1403424  
201.1724858  
112.9521109  
412.5040126  
7721.591635  
48555.2123  
25645.66268  
57267.28057  
36023.65932  
9083.738259  
45327.65131  
19134.06204  
4361.83511  
7196.713983  
1864.617843  
902.9284391  
1238.741055  
14947.62481  
18788.06105  
4042.43034  
1464.38282  
10857.30148  
3498.332547  
3029.864943  
15361.32046  
16377.75668  
9144.969993  
3050.680831  
6182.629252  
15179.28883  
3220.156047  
1179.269903  
4105.988593  
8709.544718  
9806.021189  
3230.973064  
2618.820438  
1460.763577  
4098.153991  
383.8482832  
1375.846694  
1193.091349  
1166.649238  
2841.782195  
4286.856979  
4429.009388  
481.8502699  
428.0865082  
253.0760912  
1801.125616  
6471.197537  
4118.177935  
352.2609926  
1157.560039  
6307.073135  
5571.030813  
297.9386846  
4182.766072  
235.4552286  
3784.989889  
2744.090529  
467.5703147  
3835.329573  
1622.740904  
107.208071  
72.58756949  
27.25489671  
146.8016151  
320.4433913  
32.37643434  
181.6696364  
279.7335515  
20.50125343  
102.2792255  
24.24357052  
13.25328771  
36.86809572  
18.55736705  
37.14980413  
31.42858107  
21.36439959  
23.36831201  
14.95442494  
15.91770285  
8.995508689  
13.74395378  
12.94644843  
10.87833735  
9.532111485  
9.399433565  
8.328500946  
8.019881445  
7.043371628  
7.348582699  
6.528294663  
6.159910841  
5.980143341  
5.375479179  
5.347114505  
5.038763017  
4.808541969  
4.529474006  
4.320768527  
4.138949506  
3.877240935  
3.722428145  
3.509698639  
3.372059873  
3.199396984  
3.038942414  
2.915784819  
2.78723381  
2.668908064  
2.54979402  
2.447917504  
2.342685877  
2.248406554  
2.159934701  
2.073217221  
1.988951857  
1.90987592  
1.837483245  
1.767628601  
1.701350146  
1.63634884  
1.576226283  
1.519203673  
1.463494548  
1.410892961  
1.361197145  
1.31274851  
1.267055607  
1.223442369  
1.181485852  
1.1413097  
1.102916054  
1.066190975  
1.030992051  
0.9972095842  
0.9648280851  
0.9338145674  
0.9039230969  
0.8753313819  
0.8478281443  
0.8214366286  
0.796084574  
0.7716593111  
0.7481928957  
0.7256289807  
0.7038832315  
0.6829599184  
0.6628043864  
0.6434013176  
0.6246892598  
0.6066627643  
0.5892800574  
0.5725022732  
0.5563271461  
0.540716527  
0.5256352879  
0.5110932219  
0.4970302596  
0.4834442085  
0.4703314704  
0.4576464101  
0.4453900898  
0.4335288713  
0.4220567092  
0.4109619692  
0.4002282769  
0.3898303753  
0.3797758451  
0.3700213916  
0.360587043  
0.3514402057  
0.3425838445  
0.3339962182  
0.3256692654  
0.3176006951  
0.3097702152  
0.3021724852  
0.2948083118  
0.2876689211  
0.2807328298  
0.2740004369  
0.2674561127  
0.2611102554  
0.2549421454  
0.2489689854  
0.2431463821  
0.2374923791  
0.2319884316  
0.2266514332  
0.2214607154  
0.2164162323  
0.2115061793  
0.2067280067  
0.2020844085  
0.1975603939  
0.1931653353  
0.1888870812  
0.1847170097  
0.1806614714  
0.1767125805  
0.1728625934  
0.1691205946  
0.1654677292  
0.1619163113  
0.1584531102  
0.1550763057  
0.1517858066  
0.148579474  
0.1454563417  
0.1424086189  
0.1394391998  
0.1365402268  
0.1337133144  
0.1309589021  
0.1282667661  
0.1256455156  
0.1230825371  
0.1205828266  
0.1181410642  
0.1157612565  
0.1134429032  
0.1111696635  
0.108958091  
0.1067919395  
0.1046810783  
0.1026137981  
0.1006014565  
0.09862679759  
0.09670517365  
0.0948255912  
0.09298679723  
0.09118284166  
0.0894293699  
0.08771678139  
0.08603770544  
0.08439302084  
0.08279334281  
0.08122322573  
0.07968773637  
0.07818741791  
0.07671511723  
0.07528343068  
0.07387650697  
0.07250306943  
0.07115422586  
0.06983962633  
0.06854563766  
0.06728453311  
0.06605364869  
0.06484241279  
0.06366155897  
0.06250298517  
0.0613668859  
0.06025320675  
0.0591670716  
0.05810048138  
0.05705754555  
0.0560360524  
0.05503150692  
0.0540541203  
0.05309251512  
0.05214735918  
0.05122510566  
0.0503176592  
0.04943523877  
0.04856310147  
0.04771211319  
0.04687714239  
0.04605846257  
0.04525333587  
0.04446776868  
0.0436973971  
0.04293778269  
0.0421975615  
0.04147017506  
0.04075683771  
0.04005387872  
0.039366524  
0.03869443633  
0.03803484086  
0.03738260902  
0.03674647133  
0.03612306312  
0.03551193392  
0.03490594454  
0.03432017311  
0.03374052991  
0.03317302269  
0.03261331515  
0.03206817953  
0.03152909068  
0.03099940513  
0.03048276152  
0.02997468603  
0.02947494641  
0.02898522454  
0.02850450143  
0.02803092686  
0.02756708107  
0.02710770932  
0.02666031018  
0.02622078919  
0.02578787862  
0.0253658952  
0.02494666836  
0.0245396073  
0.02413396289  
0.02373819955  
0.02335210518  
0.0229699896  
0.02259288815  
0.02222438362  
0.0218624058  
0.02150610129  
0.02115857689  
0.02081429967  
0.02047483406  
0.02014460252  
0.01981461637  
0.01949527279  
0.01918014784  
0.01887066278  
0.01856466537  
0.01826615718  
0.01797251472  
0.01768163107  
0.01739838713  
0.01711848771  
0.01683972284  
0.0165709925  
0.01630522474  
0.01604445714  
0.01578574013  
0.01553258948  
0.01528409999  
0.0150395543  
0.0147991332  
0.01456168564  
0.01432920233  
0.01410007543  
0.01387403068  
0.01365217763  
0.01343450824  
0.01321996622  
0.01301100923  
0.01280195617  
0.01259713407  
0.01239756603  
0.01219950878  
0.01200573396  
0.01181269227  
0.01162686564  
0.01144150892  
0.01125945448  
0.01108082282  
0.01090430926  
0.01073138032  
0.01056133748  
0.0103924382  
0.01022788472  
0.01006648706  
0.009906458551  
0.009748349629  
0.009594047407  
0.009441524183  
0.009291890849  
0.009145553244  
0.008999263826  
0.008857091727  
0.008717083053  
0.008578953852  
0.008443809685  
0.008309895328  
0.008180052319  
0.008049050823  
0.007924031457  
0.007797341883  
0.007675130193  
0.007553749604  
0.007433620067  
0.007318434775  
0.007202565802  
0.007087902524  
0.006977438371  
0.006867373201  
0.006759272643  
0.006652892738  
0.006549232745  
0.006446283967  
0.006345674445  
0.006245493877  
0.006148028529  
0.006052022545  
0.005957891548  
0.005865285103  
0.005774822894  
0.005684040424  
0.005596143413  
0.005509255835  
0.005423026933  
0.005339749293  
0.005257572397  
0.005176779476  
0.005096905187  
0.005018300631  
0.004940797763  
0.0048663942  
0.004792269628  
0.004718997034  
0.004647637686  
0.004577068109  
0.004508444362  
0.004440259383  
0.004374107885  
0.004309083289  
0.004244411028  
0.004181373949  
0.004119938393  
0.0040591858  
0.003998923241  
0.003942049313  
0.003883425867  
0.003828027924  
0.003772982116  
0.003719288663  
0.003665542693  
0.003613857787  
0.003562568695  
0.003513549504  
0.003465154315  
0.003416523126  
0.003371233715  
0.003324879825  
0.003280142276  
0.003236605424  
0.003193881426  
0.003151964785  
0.003110792813  
0.003070761131  
0.003032783088  
0.002994512245  
0.002957167082  
0.002921177838  
0.002885428132  
0.002850927423  
0.002817502948  
0.00278481949  
0.002752945808  
0.002722522189  
0.002692320302  
0.002662404092  
0.002633793134  
0.002607407266  
0.002580369837  
0.002553679305  
0.002529387041  
0.002505505356  
0.002481864517  
0.002459138962  
0.002437458476  
0.002416442174  
0.002396729604  
0.002376610397  
0.00235911338  
0.002341147886  
0.002323763857  
0.002307786821  
0.002292265782  
0.002277513484  
0.002264081055  
0.002250129046  
0.002238466272  
0.002226260167  
0.00221510968  
0.002205764811  
0.002196281048  
0.002187729946  
0.002180262591  
0.002172819723  
0.002166708937  
0.002161180089  
0.002155801506  
0.002151635034  
0.002148672982  
0.002146436674  
0.002143787634  
0.002143073805  
0.00214336385  
