-0.3501462909  
-0.1681569364  
-0.001773378199  
0.1328941751  
0.2247011715  
0.2691499908  
0.2690098841  
0.2337820783  
0.1781288987  
0.1195325699  
0.07556235247  
0.06119356656  
0.08657434863  
0.155570665  
0.2652789112  
0.4065376823  
0.565331654  
0.7248423352  
0.8678253924  
0.9789697614  
1.046914752  
1.065662916  
1.035241801  
0.9615625642  
0.8555474131  
0.7316747588  
0.6061607337  
0.4950174037  
0.4122342119  
0.3682809024  
0.3690918584  
0.415621706  
0.5039913364  
0.6261817569  
0.7711723865  
0.9263814878  
1.079231898  
1.218657374  
1.336373029  
1.427758937  
1.492245213  
1.533157112  
1.557022421  
1.572437426  
1.588622463  
1.613864366  
1.654057428  
1.711556622  
1.784514202  
1.866819906  
1.948680521  
2.017772684  
2.060829721  
2.065440336  
2.021802277  
1.924180487  
1.771845517  
1.569350071  
1.326100217  
1.055263659  
0.7721859408  
0.4925126805  
0.2302962121  
-0.003664697927  
-0.2030293207  
-0.3665063909  
-0.4977692292  
-0.6047076952  
-0.698134561  
-0.7901116411  
-0.892121101  
-1.013319069  
-1.1590951  
-1.330134975  
-1.522122401  
-1.726131901  
-1.929700584  
-2.11845489  
-2.278108329  
-2.396573977  
-2.465906992  
-2.483789586  
-2.4543257  
-2.387974642  
-2.300576782  
-2.211547097  
-2.141421041  
-2.109059082  
-2.12886422  
-2.20839756  
-2.34673539  
-2.533826022  
-2.750993511  
-2.9725836  
-3.168590803  
-3.307990777  
-3.362386025  
-3.309519892  
-3.136219675  
-2.840376015  
-2.431672829  
-1.930935064  
-1.368121285  
-0.7791798653  
-0.2021364402  
0.3271042612  
0.7786943718  
1.132000768  
1.377559329  
1.517562871  
1.564834521  
1.54045589  
1.470414765  
1.381789098  
1.299024582  
1.240864497  
1.218325298  
1.233985961  
1.282593431  
1.35280997  
1.429738225  
1.49777421  
1.543292439  
1.556755081  
1.533929205  
1.476100852  
1.389317211  
1.282883895  
1.167435986  
1.052967357  
0.9471822948  
0.8544587594  
0.77558027  
0.7082435586  
0.6482018582  
0.5907842703  
0.5324623149  
0.4721260747  
0.4117991163  
0.3566200595  
0.3140760461  
0.2926102909  
0.2998662872  
0.3409043699  
0.4167446938  
0.5235397003  
0.6525743133  
0.7911267488  
0.9240817084  
1.036017026  
1.113417475  
1.146613245  
1.131106333  
1.068045501  
0.9637702666  
0.8285301115  
0.6746143784  
0.5142636952  
0.3577414468  
0.2119319092  
0.07970506238  
-0.03985302853  
-0.1504190149  
-0.25684547  
-0.3633362892  
-0.4717613726  
-0.5804573482  
-0.6837578558  
-0.7723802538  
-0.8346115282  
-0.8581129858  
-0.8320358896  
-0.7490924048  
-0.6072368025  
-0.410668654  
-0.169994315  
0.09849745928  
0.3743446746  
0.6349917581  
0.8581731444  
1.02428064  
1.118426431  
1.131970562  
1.063357947  
0.9181995615  
0.7086259965  
0.4520171277  
0.1692659629  
-0.1172289741  
-0.3856334615  
-0.6166072031  
-0.7949260967  
-0.9106505781  
-0.9597626551  
-0.9442290683  
-0.8715215649  
-0.7536557059  
-0.605867734  
-0.4450620848  
-0.2881920532  
-0.1507249629  
-0.04533067932  
0.01907989498  
0.0379019321  
0.01091831567  
-0.05806028462  
-0.1619458981  
-0.2914098522  
-0.4360755365  
-0.5857069673  
-0.7312642762  
-0.8656790964  
-0.9842850775  
-1.084863935  
-1.167340906  
-1.233210718  
-1.284816225  
-1.324620604  
-1.354594946  
-1.375828555  
-1.388407589  
-1.391557282  
-1.383990535  
-1.364362407  
-1.331725841  
-1.285867311  
-1.227460435  
-1.157994009  
-1.079501079  
-0.9941586631  
-0.9038536216  
-0.8098242312  
-0.7124740724  
-0.6114091252  
-0.5057047263  
-0.3943535101  
-0.2767897409  
-0.1533757483  
-0.02572022312  
0.1032733696  
0.2296756388  
0.3491034096  
0.4575190213  
0.5521062892  
0.6320669984  
0.6991475803  
0.7577574304  
0.8145932901  
0.8777739117  
0.9555733731  
1.05493185  
1.179970856  
1.330777846  
1.502680755  
1.686193853  
1.867706438  
2.0308778  
2.15858823  
2.235187967  
2.24874646  
2.192951743  
2.068382422  
1.882909198  
1.651140503  
1.39291954  
1.131054558  
0.8885450102  
0.6856767282  
0.5373705514  
0.4511563143  
0.4260654945  
0.4526212156  
0.5139393544  
0.5878423246  
0.6497013629  
0.6756634589  
0.6458341595  
0.5470023195  
0.3745449532  
0.1332543687  
-0.1630348549  
-0.4929776941  
-0.8302164039  
-1.146529998  
-1.415217751  
-1.614278797  
-1.728975821  
-1.75346099  
-1.691256493  
-1.554573677  
-1.362579729  
-1.1388815  
-0.9085896325  
-0.6953556501  
-0.5187752355  
-0.3924711703  
-0.3230534601  
-0.3100401675  
-0.3466622651  
-0.4213893066  
-0.5198964907  
-0.6271802007  
-0.7295137881  
-0.8159884502  
-0.8794553136  
-0.9167969483  
-0.9285419397  
-0.9179507077  
-0.8897526399  
-0.8487875385  
-0.7987719759  
-0.7414177933  
-0.6760449955  
-0.5997521058  
-0.5081259771  
-0.3963701875  
-0.2606659574  
-0.099534853  
0.08503732389  
0.2869319805  
0.4958417667  
0.6978933812  
0.8769214427  
1.016265193  
1.100865897  
1.119386381  
1.066056123  
0.9419444911  
0.7554519434  
0.5218784445  
0.2620695163  
0.0002663593862  
-0.2386043657  
-0.4318545963  
-0.5617997566  
-0.617987334  
-0.5985685477  
-0.5106246212  
-0.3693612332  
-0.1962835983  
-0.01655663408  
0.1440954616  
0.262560155  
0.3211813528  
0.309909047  
0.2275114926  
0.0817077833  
-0.1117663199  
-0.3310281122  
-0.5506028792  
-0.7443622817  
-0.8884867334  
-0.9641406994  
-0.9595607226  
-0.8713552641  
-0.7048984526  
-0.4737899305  
-0.1984460471  
0.09602284315  
0.3824431414  
0.6344580496  
0.8293757235  
0.9506931306  
0.9900343291  
0.9482651827  
0.8356254543  
0.6708160174  
0.4790674149  
0.2893703957  
0.1311333131  
0.03064542197  
0.007772790028  
0.07330974332  
0.2273511468  
0.4589409911  
0.7470734986  
1.062976616  
1.373389748  
1.644438389  
1.845601898  
1.953254268  
1.953320045  
1.842696849  
1.629287104  
1.330651099  
0.9715132513  
0.5804805347  
0.1864528632  
-0.1847709456  
-0.5132418977  
-0.7865986588  
-1.000620069  
-1.158569421  
-1.269496772  
-1.345823534  
-1.400611401  
-1.444963733  
-1.485965403  
-1.525470627  
-1.559906543  
-1.581085799  
-1.577883055  
-1.538466255  
-1.452715204  
-1.314429167  
-1.122957728  
-0.8839997934  
-0.6094388268  
-0.3162409509  
-0.02457685208  
0.2445405997  
0.4717710268  
0.6417451085  
0.744840402  
0.7782060479  
0.745933684  
0.6583889247  
0.5308359756  
0.3815794957  
0.229878958  
0.09391219423  
-0.01097979931  
-0.07359390231  
-0.08761038735  
-0.05176422697  
0.03050399482  
0.1518137194  
0.3018983541  
0.4687866634  
0.6399744858  
0.8034673942  
0.9486010925  
1.066597011  
1.150841633  
1.196914678  
1.202433959  
1.166772701  
1.090745388  
0.9763165157  
0.8263816397  
0.6446462265  
0.4355902653  
0.2044905036  
-0.04255383732  
-0.2986346547  
-0.5561428158  
-0.8069902277  
-1.042952159  
-1.256110119  
-1.439340835  
-1.586811102  
-1.694395257  
-1.75997173  
-1.78355503  
-1.767241221  
-1.714967739  
-1.632117929  
-1.525004941  
-1.400298255  
-1.264444263  
-1.123148839  
-0.9809670845  
-0.841051136  
-0.705072343  
-0.5733238421  
-0.444993809  
-0.3185642052  
-0.1922782147  
-0.06461416697  
0.06530922229  
0.1974529832  
0.3307419738  
0.4631306938  
0.5918168661  
0.7135603372  
0.8250345623  
0.9231352343  
1.005180813  
1.068972678  
1.112715377  
1.134830157  
1.133744733  
1.107733388  
1.054899611  
0.9733668259  
0.8616826161  
0.7194159764  
0.5478499512  
0.3506476616  
0.134333236  
-0.09154810706  
-0.3146993864  
-0.5208190046  
-0.6947816973  
-0.8221399347  
-0.8907640326  
-0.8923792588  
-0.823775174  
-0.6874708247  
-0.4917143919  
-0.2497803028  
0.02135229831  
0.302758201  
0.5755021896  
0.8224777047  
1.029885789  
1.188176298  
1.292366183  
1.341774298  
1.339298456  
1.290443893  
1.202298634  
1.082663521  
0.939438837  
0.780311653  
0.6126968842  
0.4438169766  
0.2807912726  
0.1306001392  
-0.0001581007567  
-0.105738803  
-0.1819005447  
-0.2266259324  
-0.2407547306  
-0.2283712106  
-0.1968146696  
-0.156226133  
-0.1186276395  
-0.09661372732  
-0.1018028828  
-0.1432553773  
-0.2260840484  
-0.3504755648  
-0.5112763418  
-0.6982390098  
-0.8969246858  
-1.090152496  
-1.259837657  
-1.388978527  
-1.463552907  
-1.474089242  
-1.41673209  
-1.293683067  
-1.112984022  
-0.8876824782  
-0.6344984003  
-0.3721466654  
-0.1195144714  
0.1061156278  
0.2906143616  
0.4241759818  
0.5020154966  
0.524537642  
0.4969773048  
0.428573733  
0.3313778345  
0.2188252019  
0.1042356718  
-0.0005915301417  
-0.08653894005  
-0.1479502616  
-0.1829523788  
-0.1932750302  
-0.1836025846  
-0.160536976  
-0.1313063921  
-0.102406513  
-0.07835841798  
-0.06077940766  
-0.04792519451  
-0.03480392707  
-0.01387796121  
0.02370986639  
0.08654473488  
0.1812189825  
0.3107555465  
0.4734529546  
0.662384998  
0.865700677  
1.067747321  
1.250893499  
1.397819429  
1.493920213  
1.529441556  
1.500979975  
1.412067086  
1.272693907  
1.097811635  
0.9050145394  
0.7117616672  
0.532582712  
0.3767438176  
0.2467624212  
0.13805228  
0.03977209615  
-0.0632294402  
-0.1876742781  
-0.3487502018  
-0.5571274456  
-0.8165690332  
-1.122502651  
-1.461785048  
-1.813693501  
-2.15201159  
-2.447919573  
-2.673290918  
-2.803958364  
-2.822535358  
-2.720447473  
-2.49894635  
-2.16902928  
-1.750318593  
-1.269077487  
-0.755639205  
-0.2415720805  
0.2431030029  
0.6723416993  
1.025935536  
1.290656362  
1.460644298  
1.537080397  
1.527254993  
1.443208681  
1.300134628  
1.114743681  
0.9037694416  
0.682749361  
0.4651590161  
0.2619317366  
0.08132803669  
-0.07092296563  
-0.1913086189  
-0.2781558934  
-0.3312906847  
-0.3517974907  
-0.3419064679  
-0.3049791494  
-0.2455476499  
-0.1693134977  
-0.08302786536  
0.005807080721  
0.08944363273  
0.1605741558  
0.2131116895  
0.2429547935  
0.2485956582  
0.2314506496  
0.1958147312  
0.1484195616  
0.09762035125  
0.05231743051  
0.02076338392  
0.00941482319  
0.02200576153  
0.05897213824  
0.1173042807  
0.1908529858  
0.271040051  
0.347884164  
0.4112057749  
0.4518673181  
0.4629019916  
0.4404123744  
0.3841371551  
0.297642601  
0.1881101927  
0.06574637088  
-0.05714112827  
-0.167326715  
-0.2520054808  
-0.3001749508  
-0.303926033  
-0.2594968805  
-0.1679648098  
-0.03545381447  
0.1272118944  
0.3054116826  
0.4821485327  
0.6398402808  
0.7622818677  
0.8365572659  
0.8546288251  
0.8143976518  
0.7200584906  
0.5816849556  
0.4140725674  
0.2349709328  
0.06293078748  
-0.08496474276  
-0.1951828265  
-0.2593784105  
-0.2753725601  
-0.2473483825  
-0.1852501307  
-0.1034592485  
-0.01892235023  
0.0510358869  
0.09093529003  
0.08912814845  
0.0392974485  
-0.05871070038  
-0.198823908  
-0.3694431471  
-0.5548092082  
-0.7368507934  
-0.8972806214  
-1.019667214  
-1.091245791  
-1.104254781  
-1.056665268  
-0.9522433323  
-0.7999815534  
-0.6129790724  
-0.4069414745  
-0.1984770129  
-0.003381818954  
0.1648894922  
0.2964255538  
0.3856089545  
0.4313683645  
0.436925903  
0.4090877411  
0.3571942461  
0.2918490398  
0.2236026659  
0.1617319129  
0.1132771547  
0.08242421343  
0.07030886433  
0.07523755204  
0.0932797553  
0.1191269602  
0.147093589  
0.1721044966  
0.1905277858  
0.2007302458  
0.2032902071  
0.2008239062  
0.1974730043  
0.1981231343  
0.2074864572  
0.2291757844  
0.2649321676  
0.3141154803  
0.3735433589  
0.4377154902  
0.4993892983  
0.5504262223  
0.5827821504  
0.589500105  
0.56555199  
0.5084049095  
0.4182355717  
0.2977592412  
0.1517238422  
-0.01384619147  
-0.1925072303  
-0.3782088281  
-0.5659028956  
-0.7518467732  
-0.9335485649  
-1.109364179  
-1.277853993  
-1.437020676  
-1.583615771  
-1.712678875  
-1.817442352  
-1.889677086  
-1.920468757  
-1.901345446  
-1.825594276  
-1.689575104  
-1.493816692  
-1.243709301  
-0.94965562  
-0.6266144212  
-0.2930596658  
0.03054131854  
0.3235682418  
0.5671949445  
0.7462254804  
0.8506126356  
0.8765035147  
0.8266992516  
0.7104986987  
0.5429384876  
0.3435054275  
0.1344409645  
-0.06122215808  
-0.2217278667  
-0.3285933041  
-0.368374689  
-0.3340312733  
-0.2257547752  
-0.0511524352  
0.1752752959  
0.4333661368  
0.6991652927  
0.9472817464  
1.153515509  
1.297476183  
1.364892979  
1.349320645  
1.253002159  
1.086726945  
0.8686704754  
0.6223068621  
0.373634443  
0.1480656654  
-0.03262045752  
-0.1528427577  
-0.2049545202  
-0.189895801  
-0.1166887096  
-0.0008437859795  
0.1380697637  
0.2793362751  
0.4040471976  
0.4976741162  
0.5518931788  
0.5654172164  
0.5437580057  
0.4979880222  
0.4427379749  
0.3937595573  
0.36544662  
0.3686872231  
0.4093547696  
0.487627903  
0.5981889176  
0.7312075108  
0.8738992421  
1.012370072  
1.133436216  
1.226143894  
1.28277805  
1.299270746  
1.275017735  
1.212231249  
1.11500729  
0.9883352135  
0.8372541301  
0.6663121759  
0.4794065037  
0.2800029492  
0.07162979155  
-0.1414955269  
-0.3538997863  
-0.5585284728  
-0.7467959103  
-0.90908969  
-1.03569892  
-1.118062531  
-1.150146943  
-1.129714682  
-1.0592468  
-0.9463024509  
-0.8031993473  
-0.6459922514  
-0.4928487089  
-0.3620406966  
-0.2698282716  
-0.2285681686  
-0.2453263158  
-0.3212120854  
-0.4515247686  
-0.6266670786  
-0.8336485031  
-1.057910795  
-1.285152881  
-1.502854674  
-1.701264898  
-1.873734031  
-2.016399352  
-2.127362932  
-2.205594643  
-2.249841565  
-2.257820963  
-2.225910655  
-2.149438752  
-2.023566001  
-1.844595871  
-1.611478573  
-1.327190259  
-0.9996788729  
-0.6421274717  
-0.2723811243  
0.0884593343  
0.4181433282  
0.6957962246  
0.9045000505  
1.033542896  
1.079968866  
1.049173354  
0.9544170379  
0.8153099338  
0.6554569078  
0.4996032825  
0.3706767089  
0.2871403227  
0.2610127499  
0.2968106703  
0.3915060785  
0.5354649452  
0.7141598122  
0.9103709467  
1.106525028  
1.286820074  
1.43886075  
1.554599175  
1.63052759  
1.667169165  
1.668028766  
1.638244301  
1.583199253  
1.507351573  
1.413477914  
1.302452967  
1.173579534  
1.025394794  
0.8567877645  
0.6682076396  
0.4627319238  
0.2467591526  
0.03016533682  
-0.1741727309  
-0.3514779657  
-0.4866889172  
-0.5663975031  
-0.5808412026  
-0.5256714439  
-0.4032044007  
-0.2229471318  
-0.001255644104  
0.2398877744  
0.474879703  
0.677066129  
0.8215783145  
0.8880955477  
0.8631867252  
0.7419559784  
0.5287685366  
0.2369902619  
-0.1122469492  
-0.4920969291  
-0.8726435595  
-1.223833584  
-1.518386559  
-1.734374173  
-1.857200112  
-1.880804847  
-1.807972603  
-1.649750192  
-1.424044895  
-1.15357467  
-0.8634018442  
-0.5783158075  
-0.3203535701  
-0.1067302081  
0.05160190954  
0.1506143218  
0.1930231352  
0.1873255372  
0.1461987647  
0.08448934129  
0.01708499531  
-0.04304840605  
-0.08639035762  
-0.1077743986  
-0.1065794339  
-0.08623629036  
-0.05316454177  
-0.01534400058  
0.01922384653  
0.04392823983  
0.05461907813  
0.05018802125  
0.03261607187  
0.006513651848  
-0.02173125849  
-0.04504388684  
-0.05679117573  
-0.05178517337  
-0.02700881315  
0.01802182863  
0.08128479548  
0.1586405882  
0.244490277  
