1194.507603  
1249.660104  
1395.412091  
1744.205454  
1933.774441  
1770.371848  
28059.22544  
13314.0581  
51602.31394  
10696.96073  
10232.446  
17925.56353  
22926.60806  
2623.473712  
30543.57413  
16036.81766  
32795.08124  
13704.98195  
11110.14922  
6120.580748  
16920.98574  
15481.24813  
14773.69328  
12571.16364  
7911.787241  
14389.62293  
2429.04583  
6661.386617  
5.889554865  
1376.41218  
3040.236703  
6795.207567  
5721.533154  
1089.934593  
2221.814416  
3837.857879  
1331.710872  
3586.860454  
5842.961463  
2117.6458  
65.68690363  
4151.407768  
2273.121089  
798.7546786  
9490.150574  
1293.460737  
115.0884788  
11397.58836  
2048.517261  
646.7802542  
9361.071225  
243.4471197  
727.0800504  
7944.369102  
2347.156359  
4686.772045  
10065.51687  
800.9176052  
929.4569326  
1828.380351  
168.5493043  
1271.420721  
5958.50271  
1629.986299  
277.3617248  
752.6622839  
55.06744114  
253.1476107  
138.8489982  
74.43208692  
37.1576107  
9.30393453  
22.0207772  
149.4738486  
26.35888162  
10.81740386  
36.99397009  
15.84609483  
13.2624583  
25.0423604  
16.78016421  
13.48458179  
13.03372708  
13.54142699  
13.05653951  
7.752487797  
7.419335105  
7.600505636  
6.170154702  
7.026112624  
7.766547621  
6.313702984  
6.169688777  
5.903468015  
5.619487238  
5.486686668  
5.05800045  
4.841902643  
4.779807509  
4.370701971  
4.324444552  
4.213866619  
3.89105179  
3.748482109  
3.621709384  
3.465266558  
3.339044656  
3.211895312  
3.112010213  
2.992984352  
2.878056085  
2.801390706  
2.711944322  
2.601501712  
2.521598497  
2.440903025  
2.353455376  
2.287601942  
2.213828676  
2.146472651  
2.081537711  
2.01647389  
1.959670693  
1.902082778  
1.844487461  
1.79448484  
1.744019037  
1.69681403  
1.650890474  
1.606716876  
1.564862537  
1.524525922  
1.484584167  
1.446996997  
1.410475235  
1.375748929  
1.342076216  
1.309617511  
1.278186508  
1.248127549  
1.218947284  
1.190756516  
1.163707009  
1.137454391  
1.112063367  
1.087608298  
1.063960937  
1.041063386  
1.018856091  
0.9973803269  
0.9766433825  
0.9565085388  
0.9370108016  
0.9181366072  
0.8998148356  
0.8820651296  
0.8648487169  
0.8481342308  
0.8319240705  
0.8161752575  
0.8008824012  
0.7860413858  
0.7716118377  
0.7576053838  
0.7439864281  
0.7307392396  
0.7178558152  
0.7053356417  
0.6931454608  
0.6812890188  
0.6697423321  
0.6585082199  
0.6475634748  
0.6369056162  
0.6265235552  
0.616406519  
0.6065563705  
0.5969465168  
0.5875765027  
0.5784397481  
0.5695303734  
0.5608404929  
0.5523572343  
0.5440849188  
0.535999721  
0.5281183395  
0.5204241653  
0.5129011695  
0.5055570876  
0.4983860756  
0.491377907  
0.4845283658  
0.4778333825  
0.4712812124  
0.4648896869  
0.4586311487  
0.4525100114  
0.4465317627  
0.4406742231  
0.4349479963  
0.4293410144  
0.4238606743  
0.418487893  
0.4132339397  
0.4080827631  
0.4030407345  
0.3981099398  
0.3932755154  
0.3885361139  
0.3838957337  
0.3793457885  
0.3748953225  
0.3705277704  
0.366249335  
0.3620536379  
0.3579323924  
0.3539043493  
0.3499389869  
0.3460642227  
0.3422565308  
0.3385211403  
0.3348559406  
0.3312617252  
0.3277322798  
0.3242700695  
0.3208720359  
0.3175306112  
0.3142537411  
0.3110414137  
0.3078806332  
0.3047784497  
0.3017293849  
0.2987373719  
0.295798811  
0.2929081718  
0.2900719721  
0.2872845511  
0.2845457033  
0.2818487217  
0.2792058318  
0.2766033456  
0.2740469267  
0.271531848  
0.2690592537  
0.2666258393  
0.2642360306  
0.2618860391  
0.2595708044  
0.2572987145  
0.2550623869  
0.2528605599  
0.250696087  
0.248565856  
0.2464643089  
0.2444004634  
0.2423730663  
0.2403706237  
0.2384049508  
0.236471927  
0.2345632191  
0.2326859313  
0.2308390946  
0.2290236229  
0.2272282474  
0.2254653166  
0.2237307634  
0.2220157608  
0.2203318018  
0.2186764718  
0.217035101  
0.2154275852  
0.2138388966  
0.2122769209  
0.210735044  
0.2092187324  
0.2077245234  
0.2062498359  
0.2047975564  
0.203366655  
0.2019556098  
0.2005668055  
0.1991954244  
0.1978412472  
0.1965094703  
0.1951957485  
0.1939018784  
0.1926259844  
0.1913691495  
0.1901251802  
0.1889024193  
0.1876997308  
0.186507682  
0.1853356581  
0.1841769341  
0.1830327419  
0.1819074442  
0.1807984689  
0.1797017811  
0.1786204873  
0.1775565599  
0.1765000057  
0.1754641774  
0.1744409028  
0.1734327606  
0.1724337049  
0.1714549987  
0.1704793357  
0.1695239797  
0.1685789651  
0.1676445232  
0.1667249506  
0.165815662  
0.1649231304  
0.1640350006  
0.163164209  
0.1623022239  
0.1614532843  
0.1606099221  
0.1597841192  
0.1589637862  
0.1581554313  
0.1573586439  
0.1565708971  
0.1557944365  
0.1550282603  
0.1542698357  
0.1535234027  
0.152786377  
0.1520546713  
0.1513385903  
0.1506269061  
0.1499236291  
0.1492313413  
0.1485504163  
0.1478735404  
0.1472024552  
0.1465497227  
0.1458971562  
0.1452585706  
0.1446243967  
0.143996061  
0.1433781534  
0.142770053  
0.1421649814  
0.141572478  
0.1409849302  
0.1404025887  
0.1398273938  
0.1392640905  
0.1387063326  
0.1381536254  
0.1376084394  
0.1370687908  
0.1365378828  
0.1360125998  
0.1354930691  
0.1349839564  
0.1344800248  
0.1339803759  
0.1334856318  
0.1330006341  
0.1325175898  
0.1320432497  
0.1315755827  
0.1311154105  
0.1306564933  
0.1302043701  
0.1297603161  
0.1293214125  
0.1288853157  
0.1284598147  
0.1280356414  
0.1276192873  
0.1272052216  
0.1267959726  
0.1263965038  
0.1259982568  
0.125607443  
0.1252192392  
0.1248374439  
0.1244590253  
0.1240879151  
0.1237234237  
0.1233602116  
0.1230036908  
0.1226504266  
0.1223006178  
0.1219581284  
0.121619008  
0.1212851655  
0.1209549919  
0.1206316874  
0.1203074373  
0.1199906067  
0.1196806938  
0.1193683229  
0.1190659675  
0.1187666279  
0.1184710207  
0.1181769221  
0.1178905064  
0.1176082215  
0.1173290834  
0.1170529773  
0.1167830684  
0.1165154045  
0.1162491165  
0.1159904542  
0.1157340005  
0.1154810545  
0.1152316511  
0.1149890478  
0.1147484452  
0.1145081772  
0.1142760016  
0.1140436855  
0.1138189773  
0.1135932848  
0.1133755842  
0.1131617532  
0.1129445182  
0.112734861  
0.112530613  
0.1123290427  
0.1121302719  
0.1119337079  
0.1117424845  
0.1115503155  
0.1113670721  
0.111182262  
0.1110031105  
0.1108268924  
0.1106529517  
0.1104860818  
0.1103178854  
0.1101546852  
0.1099940943  
0.1098375698  
0.1096833975  
0.1095311343  
0.1093844135  
0.1092395739  
0.1090967705  
0.1089553317  
0.1088225837  
0.1086895663  
0.108560034  
0.108431037  
0.1083060199  
0.1081847511  
0.1080696703  
0.1079538222  
0.1078405613  
0.107733427  
0.1076248468  
0.1075178546  
0.1074167765  
0.1073206171  
0.1072247699  
0.1071321913  
0.1070420477  
0.1069555358  
0.1068696832  
0.106792595  
0.1067086582  
0.1066341402  
0.1065613765  
0.1064911166  
0.1064240601  
0.1063584016  
0.1062940058  
0.1062340664  
0.1061767021  
0.1061252484  
0.1060724478  
0.1060234321  
0.1059760335  
0.1059354419  
0.1058916485  
0.1058530363  
0.1058172794  
0.1057831317  
0.1057553114  
0.105726297  
0.1057009519  
0.1056805092  
0.1056591105  
0.1056420375  
0.1056305834  
0.105616262  
0.1056077695  
0.1056020085  
0.1055979392  
0.1055946491  
