0.04549855349  
0.3140792613  
0.5706154983  
0.8043955723  
1.006827131  
1.171953803  
1.296542136  
1.379762634  
1.422565889  
1.426910389  
1.395027643  
1.328893666  
1.230022137  
1.099618912  
0.9390603682  
0.750574395  
0.5379518644  
0.3071004234  
0.06626660611  
-0.1741786596  
-0.4024334787  
-0.6063751037  
-0.7749483618  
-0.8996206589  
-0.9756830265  
-1.0031592  
-0.9871718207  
-0.9376377104  
-0.868319389  
-0.7953186325  
-0.7351918969  
-0.7029271687  
-0.7100510631  
-0.7631199106  
-0.8627927146  
-1.003623325  
-1.174603156  
-1.360394133  
-1.543099439  
-1.704341133  
-1.827381985  
-1.899028165  
-1.911053274  
-1.86098045  
-1.752137937  
-1.592991349  
-1.395881687  
-1.175366351  
-0.9464117579  
-0.7227072609  
-0.5153369874  
-0.3319670807  
-0.1766414147  
-0.05013380127  
0.0492490448  
0.1246264921  
0.1794705992  
0.2167411626  
0.2383738428  
0.2452179181  
0.237405496  
0.2150561688  
0.1791368542  
0.1322839375  
0.07936435706  
0.02763712192  
-0.01359125954  
-0.0338033688  
-0.02251139088  
0.02927424092  
0.1275659655  
0.2741491996  
0.4657787371  
0.6939662378  
0.9454441214  
1.203272839  
1.448467798  
1.661959199  
1.826629582  
1.929164104  
1.961485363  
1.921583169  
1.813647063  
1.647497578  
1.437405944  
1.200465733  
0.9547459685  
0.7174487544  
0.5032875944  
0.3232772102  
0.1840155202  
0.08751015681  
0.03149583658  
0.01016422102  
0.01516495084  
0.03675136686  
0.06492967091  
0.09050814356  
0.1059774251  
0.1061555528  
0.08859465802  
0.0537212649  
0.00472695815  
-0.05278881936  
-0.1114079087  
-0.1626872108  
-0.1980970043  
-0.2100499139  
-0.1929012668  
-0.1438256515  
-0.06343722105  
0.04395297295  
0.1705070911  
0.3054903721  
0.4363016629  
0.5498198213  
0.6338871337  
0.6787488901  
0.6782489629  
0.6306107568  
0.5386895585  
0.4096576656  
0.2541702597  
0.08511400348  
-0.08386961858  
-0.2398877295  
-0.3721282738  
-0.4728560934  
-0.5379653822  
-0.5670552414  
-0.5630698311  
-0.5316040509  
-0.4800121741  
-0.4164769647  
-0.3491732376  
-0.2856281651  
-0.2323239171  
-0.194530876  
-0.1763268616  
-0.1806889801  
-0.2095929288  
-0.2640256688  
-0.3438743072  
-0.4477020557  
-0.572466823  
-0.7132741387  
-0.8632747938  
-1.013790854  
-1.154748423  
-1.275397564  
-1.365281954  
-1.415333913  
-1.418937204  
-1.372805601  
-1.277506606  
-1.137559309  
-0.9610423304  
-0.7587680544  
-0.5431312336  
-0.3267764914  
-0.1212853402  
0.06395877694  
0.2225756887  
0.3515810326  
0.4513365824  
0.5251034706  
0.5782783867  
0.6174476339  
0.6493770144  
0.6800789396  
0.7140596411  
0.7538114646  
0.7995839053  
0.8494562435  
0.8996375493  
0.9449878571  
0.9796561562  
0.9977778219  
0.9941546666  
0.9648415735  
0.9075966505  
0.8221355005  
0.7101970841  
0.5753924412  
0.4228847046  
0.2589299206  
0.09033843224  
-0.07607312853  
-0.2339810647  
-0.3779409257  
-0.5036222253  
-0.6078781235  
-0.6886541375  
-0.7447886662  
-0.7757339169  
-0.7812990796  
-0.7614642163  
-0.7163090623  
-0.6460956314  
-0.5514798917  
-0.4338073421  
-0.2954259808  
-0.139931323  
0.02773330303  
0.201369126  
0.373831516  
0.5375126696  
0.6849516688  
0.8094610889  
0.9056770505  
0.9699360767  
1.000419676  
0.9970439828  
0.9611201061  
0.8948618083  
0.8008405706  
0.6814971002  
0.5388110791  
0.3742054313  
0.1887013075  
-0.01669570108  
-0.2404440235  
-0.4798645531  
-0.730596288  
-0.9862302445  
-1.23820917  
-1.476040765  
-1.687835725  
-1.861121879  
-1.983868636  
-2.045602675  
-2.038509519  
-1.958388687  
-1.805367272  
-1.584277255  
-1.30463846  
-0.9802206753  
-0.6281977708  
-0.2679467094  
0.0804248625  
0.3976903599  
0.667114138  
0.8758758559  
1.0161727  
1.08583779  
1.088395757  
1.032515049  
0.9309041388  
0.7987737214  
0.6520331603  
0.5054730923  
0.3711677799  
0.2573050003  
0.1676451452  
0.1016382652  
0.05521177574  
0.02207146846  
-0.004698062447  
-0.03100124111  
-0.06035256143  
-0.09299100172  
-0.1256421403  
-0.1519764815  
-0.1636912636  
-0.152025942  
-0.1094597088  
-0.03129002767  
0.0831847277  
0.230074093  
0.4010259324  
0.5840442199  
0.764898882  
0.9288889438  
1.062720908  
1.156201772  
1.203528693  
1.203991306  
1.162015276  
1.086553066  
0.9899359978  
0.8863356128  
0.7900589663  
0.713862652  
0.6674889313  
0.6565532555  
0.6818938337  
0.7394146079  
0.8204176611  
0.912380569  
1.000111406  
1.06716889  
1.097463206  
1.076884982  
0.9948494744  
0.8456098017  
0.6291886118  
0.3518174172  
0.02577690291  
-0.3313901459  
-0.698287308  
-1.051562743  
-1.368130946  
-1.627456848  
-1.813624834  
-1.916924123  
-1.934721215  
-1.871508012  
-1.73810964  
-1.550181414  
-1.326209384  
-1.085332945  
-0.8452812351  
-0.6207294971  
-0.4222516114  
-0.2559572769  
-0.1237817894  
-0.02426357014  
0.04638780929  
0.09318303847  
0.1214036213  
0.1359429065  
0.1409946076  
0.1400092208  
0.1358350558  
0.1308656851  
0.1270611453  
0.1257821736  
0.1274092974  
0.1308661289  
0.1331748004  
0.1292487319  
0.1120758254  
0.07339614745  
0.004853831592  
-0.1004870101  
-0.2465166975  
-0.4326258792  
-0.6527484885  
-0.8951419562  
-1.14305428  
-1.376268544  
-1.573354576  
-1.714317925  
-1.783242019  
-1.770513992  
-1.674247525  
-1.50065876  
-1.263303904  
-0.9812690052  
-0.6765907258  
-0.3712881814  
-0.08447698418  
0.1699853815  
0.3849605115  
0.5603721072  
0.702394309  
0.8216341398  
0.9306156008  
1.041008158  
1.161029214  
1.293489323  
1.43477869  
1.574971748  
1.699037399  
1.788968731  
1.826492179  
1.795957784  
1.686950278  
1.496246832  
1.2288361  
0.8978498691  
0.5234335367  
0.1307201003  
-0.2528058644  
-0.6001968324  
-0.8878089148  
-1.097616968  
-1.218810718  
-1.248543567  
-1.191786559  
-1.060391019  
-0.8715154683  
-0.6456533419  
-0.4045046189  
-0.1689230826  
0.04286542444  
0.2166288044  
0.3429957327  
0.4178142433  
0.4419932652  
0.4209396946  
0.3636429318  
0.2815426839  
0.1872862439  
0.09349736191  
0.0116515786  
-0.04885078245  
-0.08135295181  
-0.08233182487  
-0.05148641615  
0.008429096147  
0.09200403854  
0.1917227802  
0.2986221724  
0.4029864513  
0.4950309847  
0.5655485239  
0.6065003313  
0.6115405666  
0.5764935784  
0.4997572255  
0.382648437  
0.2296294992  
0.04838770638  
-0.1503072522  
-0.3530289065  
-0.5444331868  
-0.7083381869  
-0.8290812915  
-0.89306046  
-0.8902950056  
-0.815819565  
-0.6706997997  
-0.4624877742  
-0.2049897675  
0.0826934225  
0.3777985222  
0.656056254  
0.894113561  
1.071950186  
1.174961476  
1.195449219  
1.133307537  
0.9958266275  
0.7966296841  
0.5538954015  
0.288126671  
0.01975649203  
-0.233066817  
-0.4562269589  
-0.6407101669  
-0.782866382  
-0.8838924019  
-0.9486450781  
-0.9840087918  
-0.9970925894  
-0.9935506352  
-0.9762886904  
-0.9447587671  
-0.8949421169  
-0.8200197914  
-0.71162065  
-0.5614519317  
-0.3630708029  
-0.113508939  
0.1854630056  
0.5266596568  
0.8974644435  
1.280520563  
1.655019342  
1.998469306  
2.288710208  
2.505955382  
2.634635135  
2.66484402  
2.59324395  
2.423348636  
2.165155169  
1.834188095  
1.450028318  
1.034512094  
0.6097433981  
0.1961427367  
-0.1892786114  
-0.5342325002  
-0.8319106896  
-1.081104456  
-1.285652116  
-1.453299543  
-1.59410203  
-1.718578908  
-1.835873268  
-1.952161944  
-2.069559003  
-2.185658646  
-2.293791039  
-2.383961646  
-2.444330746  
-2.463016965  
-2.42995654  
-2.338544138  
-2.18682225  
-1.978046595  
-1.72057978  
-1.427123482  
-1.113457017  
-0.7968491452  
-0.4943962524  
-0.2215013319  
0.009327895265  
0.1892336973  
0.3133016911  
0.3804069335  
0.3927304294  
0.3550674336  
0.2740656012  
0.1575281483  
0.01385052644  
-0.1483499314  
-0.3204340004  
-0.4938119725  
-0.6599478145  
-0.8103911414  
-0.9368891921  
-1.031641136  
-1.087683793  
-1.099404547  
-1.063098435  
-0.977500731  
-0.8441766136  
-0.6676956672  
-0.4554850936  
-0.2173584704  
0.0352987143  
0.2906107558  
0.5374401188  
0.7666216809  
0.9720149806  
1.151202667  
1.305699791  
1.440589171  
1.563585855  
1.683616631  
1.80910665  
1.946201075  
2.097221082  
2.259611252  
2.425601824  
2.582698636  
2.714996865  
2.80517422  
2.836903013  
2.797326791  
2.679223121  
2.482505359  
2.214789857  
1.890903913  
1.531378957  
1.160106639  
0.8014997122  
0.4775644228  
0.2053028372  
-0.005170856748  
-0.1515361002  
-0.2390864895  
-0.2795041819  
-0.28880401  
-0.2847583548  
-0.2842124159  
-0.3006635023  
-0.3424762351  
-0.4119523011  
-0.5053769288  
-0.6139878955  
-0.7256896734  
-0.8272266028  
-0.9064480946  
-0.9543242449  
-0.9663843257  
-0.9433754204  
-0.8910512195  
-0.8191569563  
-0.7398048569  
-0.665514019  
-0.6072741327  
-0.5729300181  
-0.5661580059  
-0.5861604037  
-0.6280907736  
-0.6840739377  
-0.7446154097  
-0.8001001749  
-0.8421270341  
-0.8644718673  
-0.8635511334  
-0.8383908201  
-0.7902064344  
-0.7217501214  
-0.6366311517  
-0.5387672391  
-0.4320903306  
-0.3205188623  
-0.2081412821  
-0.09948635766  
0.0002773016674  
0.08534856911  
0.1495996653  
0.1871953505  
0.1934437401  
0.1657460824  
0.1044410397  
0.01336212497  
-0.100051194  
-0.2251797707  
-0.3491739598  
-0.4583287886  
-0.5397195493  
-0.5828505832  
-0.5810952674  
-0.5327102436  
-0.4412691662  
-0.3154465451  
-0.1681623047  
-0.01519529079  
0.1265707554  
0.2410527677  
0.3148020299  
0.3385532796  
0.3083067567  
0.2258315065  
0.09854842607  
-0.06120869586  
-0.2374373824  
-0.4120886827  
-0.566893935  
-0.685182523  
-0.7535237576  
-0.7630242076  
-0.7101699623  
-0.5971488599  
-0.4316461198  
-0.226153948  
0.003127035252  
0.2376855905  
0.4582713152  
0.6465355555  
0.7865982081  
0.8664496655  
0.8790734796  
0.8232149046  
0.7037156451  
0.5313601394  
0.3222151096  
0.09646713976  
-0.1231792253  
-0.3134514165  
-0.4526465427  
-0.5227758507  
-0.5115029456  
-0.4136585591  
-0.232144018  
0.02191362354  
0.329829204  
0.6668257617  
1.004190325  
1.311924412  
1.561612565  
1.729220865  
1.7975071  
1.757779026  
1.610796871  
1.366717937  
1.044087832  
0.6679851316  
0.2675492663  
-0.1268483235  
-0.4864713115  
-0.7868025211  
-1.009597861  
-1.14420283  
-1.188029104  
-1.146205769  
-1.030480363  
-0.8575639652  
-0.6471241655  
-0.4197068953  
-0.1948005703  
0.01074954821  
0.183828187  
0.3155916751  
0.4014647213  
0.4406885305  
0.4355516929  
0.3904693487  
0.3110806572  
0.2035054157  
0.07384647984  
-0.07201419864  
-0.2283669015  
-0.389452442  
-0.5491894778  
-0.7009813048  
-0.8377216332  
-0.9520669883  
-1.037000477  
-1.086611288  
-1.096981007  
-1.067020722  
-0.9990576661  
-0.8990368848  
-0.7762101925  
-0.6423004691  
-0.510188584  
-0.3922827855  
-0.2987832381  
-0.2361097336  
-0.2057356964  
-0.2036542058  
-0.220604672  
-0.2430894945  
-0.2550853135  
-0.240250096  
-0.184341315  
-0.07749244514  
0.08398162946  
0.2965370755  
0.5493167969  
0.8250708101  
1.102013321  
1.3563662  
1.56526704  
1.70961682  
1.776464202  
1.760570971  
1.664922688  
1.500113277  
1.282692194  
1.03273423  
0.7710098245  
0.5162024545  
0.2825885799  
0.07854261347  
-0.09392913904  
-0.2385854442  
-0.3634132303  
-0.4784422785  
-0.5933026227  
-0.7149365098  
-0.845856921  
-0.9832327651  
-1.118947354  
-1.240610304  
-1.333355276  
-1.382126233  
-1.374106208  
-1.300885373  
-1.160064598  
-0.9560417226  
-0.6998697785  
-0.4082155156  
-0.1015685087  
0.1980495736  
0.4695495222  
0.6950960284  
0.8619732296  
0.9637673793  
1.00074189  
0.9793736254  
0.9111502662  
0.810814233  
0.694302406  
0.5766703257  
0.470276176  
0.3834605421  
0.3198735842  
0.2785293259  
0.2545259611  
0.2403208485  
0.2273201592  
0.2075525324  
0.1751328271  
0.1273073151  
0.06489421219  
-0.007907270855  
-0.08433041621  
-0.1562974957  
-0.2159088634  
-0.2568948972  
-0.275777101  
-0.2725365307  
-0.2506598859  
-0.2165792141  
-0.1785616244  
-0.1452663644  
-0.1241831584  
-0.1202175273  
-0.1346431885  
-0.1645982989  
-0.2032105611  
-0.2403419483  
-0.2638754468  
-0.2613521528  
-0.2217826747  
-0.1373624257  
-0.004889917257  
0.1733186858  
0.3891516875  
0.6291258572  
0.8755020696  
1.107995525  
1.305899865  
1.45039562  
1.526767501  
1.52624028  
1.447195235  
1.295563675  
1.084316346  
0.8320746905  
0.5609910328  
0.2941660103  
0.05292971403  
-0.1456345962  
-0.2905843181  
-0.3781599941  
-0.4118448792  
-0.4014351896  
-0.3612828274  
-0.3080051522  
-0.2579968504  
-0.2251533971  
-0.2191243549  
-0.2443415373  
-0.2999149154  
-0.3803711186  
-0.4770240221  
-0.5797349632  
-0.6787241736  
-0.7661316  
-0.8371003161  
-0.8902258616  
-0.9273627643  
-0.9528774151  
-0.9725164073  
-0.9921288117  
-1.016456941  
-1.048201738  
-1.087494412  
-1.131816781  
-1.176349499  
-1.214664262  
-1.239610015  
-1.244267722  
-1.222842201  
-1.171377137  
-1.088248818  
-0.9743997475  
-0.8333360076  
-0.6709043455  
-0.4949004679  
-0.3145451145  
-0.139865954  
0.01897615619  
0.1523819487  
0.2520130173  
0.3114327149  
0.3266751043  
0.2966815467  
0.2235736346  
0.1127080757  
-0.02749204258  
-0.18597465  
-0.3497252071  
-0.5046736049  
-0.6367552455  
-0.7330877017  
-0.783152257  
-0.779881382  
-0.7205396572  
-0.6072918891  
-0.4473390638  
-0.252589311  
-0.03880151314  
0.1757456772  
0.3719684746  
0.5319308849  
0.640809057  
0.6886426021  
0.6716198606  
0.5927153699  
0.4615314137  
0.293338402  
0.1073916748  
-0.07526302965  
-0.2342124745  
-0.3519950667  
-0.4159843463  
-0.4195785924  
-0.3625418876  
-0.2504654793  
-0.0934747291  
0.09559091506  
0.3031936636  
0.5169836635  
0.727243614  
0.9276687106  
1.11540304  
1.290362209  
1.454041004  
1.608049037  
1.752723684  
1.886091668  
2.003437649  
2.097582894  
2.159863427  
2.181652943  
2.156159992  
2.080169235  
1.955387676  
1.789097398  
1.593940276  
1.386785763  
1.186797063  
1.012949524  
0.8813623914  
0.8028655972  
0.7811742437  
0.8120182751  
0.8833804995  
0.9768788048  
1.070117309  
1.139694294  
1.164443569  
1.128424734  
1.023221698  
0.8491869518  
0.6154305181  
0.3385465886  
0.04024249875  
-0.2557679877  
-0.527149337  
-0.7560930537  
-0.9317430862  
-1.051534866  
-1.121250365  
-1.153779357  
-1.166817602  
-1.179848645  
-1.210938184  
-1.273824449  
-1.375783782  
-1.516591071  
-1.688727916  
-1.878751041  
-2.06958913  
-2.243337122  
-2.384090721  
-2.480342516  
-2.52656393  
-2.523739549  
-2.478807374  
-2.40313423  
-2.310314799  
-2.213674794  
-2.123893089  
-2.047133902  
-1.983963528  
-1.929213449  
-1.872785304  
-1.801261913  
-1.700057872  
-1.555778391  
-1.358436405  
-1.103207717  
-0.7914837165  
-0.4310887247  
-0.03565578195  
0.3767314131  
0.7854219163  
1.169360168  
1.509229343  
1.789320638  
1.998937424  
2.133172302  
2.193043439  
2.184995045  
2.119887317  
2.011605145  
1.875474998  
1.726668195  
1.578748805  
1.442521658  
1.325266751  
1.230416287  
1.157694961  
1.103659984  
1.062570302  
1.027465064  
0.9912930566  
