1045.851665  
1095.415432  
1200.710295  
1377.000948  
1128.314427  
5942.373054  
5611.616397  
4413.710763  
71881.54987  
1058.825546  
1961.562933  
30200.22119  
18002.97922  
2794.916291  
40146.79155  
7832.659352  
21323.44204  
11505.0347  
5462.256161  
4047.251876  
6354.275977  
26685.10328  
2137.352252  
9191.88774  
3385.575382  
19314.20257  
5164.082677  
2106.298292  
11377.30846  
1737.642009  
2560.367619  
5886.43921  
1253.279212  
6680.897431  
2592.457024  
3281.032595  
26983.18924  
9415.401732  
4365.688372  
10443.37327  
11638.14449  
6688.772879  
14498.32784  
2620.737065  
4249.499706  
222.7424362  
509.2963562  
1757.511686  
8300.739989  
7411.865656  
3251.301809  
5207.041309  
6516.99085  
197.0071067  
3039.745244  
715.2003659  
956.2875891  
1127.983389  
3.085951586  
775.2651023  
163.8553749  
1498.550813  
140.7800843  
1595.334763  
368.8722646  
218.0272052  
847.8115563  
870.349886  
380.5295944  
297.901515  
106.975547  
352.3996876  
323.6629648  
92.87294859  
125.0300089  
55.38703906  
127.4364709  
103.6990389  
75.58099925  
84.60050145  
57.81384845  
49.05504588  
39.22428035  
43.28691211  
37.09321541  
34.18038512  
35.23233166  
29.63392751  
28.14661779  
27.0816348  
26.18024498  
23.55617122  
21.943884  
20.81184127  
20.0642836  
19.09911156  
17.7805708  
16.85765926  
15.98070866  
15.21485705  
14.30166383  
13.75534517  
13.10292666  
12.57571835  
11.92140592  
11.35763556  
10.96268306  
10.45596302  
10.03640344  
9.643950747  
9.252022308  
8.874099037  
8.537020245  
8.224314977  
7.908210749  
7.615580192  
7.350236225  
7.094581799  
6.848499653  
6.609075501  
6.388757539  
6.177219047  
5.974880468  
5.779671354  
5.596389113  
5.420767508  
5.253181957  
5.091499649  
4.938202473  
4.791569057  
4.650432111  
4.515958494  
4.387128826  
4.263140397  
4.143422218  
4.029850137  
3.919972764  
3.814344996  
3.713079796  
3.615660087  
3.522113964  
3.431616574  
3.344839254  
3.261255276  
3.180535368  
3.10280552  
3.027770023  
2.95543479  
2.885609903  
2.818154999  
2.753008904  
2.690069147  
2.629187718  
2.57043887  
2.513544512  
2.458511291  
2.405271958  
2.353655763  
2.303804373  
2.255413291  
2.208539579  
2.163143323  
2.119151961  
2.076450762  
2.035031807  
1.994818344  
1.955850278  
1.917989947  
1.881197331  
1.845554317  
1.810889337  
1.777188107  
1.744439695  
1.712600707  
1.681647022  
1.651565205  
1.622214838  
1.593759897  
1.566007414  
1.539035237  
1.51273038  
1.487106117  
1.462212123  
1.437946738  
1.414280638  
1.391182274  
1.368687443  
1.346790194  
1.325401504  
1.304575069  
1.284210662  
1.26438057  
1.245038111  
1.226119378  
1.207666083  
1.189661379  
1.172063756  
1.154899398  
1.138078078  
1.121715005  
1.105691242  
1.090053812  
1.074713828  
1.059806251  
1.04516688  
1.030836961  
1.016889353  
1.003201841  
0.9898284231  
0.9767423409  
0.9639199289  
0.9513606481  
0.9391099309  
0.9270752248  
0.9153366106  
0.9037909654  
0.8925231779  
0.8814781713  
0.8706773609  
0.8600368745  
0.8496394483  
0.8394655199  
0.8294890159  
0.8197289708  
0.8101288286  
0.8007532802  
0.7915187183  
0.7824679984  
0.7736241013  
0.7649445263  
0.7564061408  
0.7480330135  
0.739857416  
0.7318093872  
0.7238988011  
0.7161241784  
0.7085053348  
0.7010250608  
0.6936925132  
0.6865085309  
0.6794172332  
0.6724995842  
0.6656595241  
0.658962356  
0.6523755397  
0.6459315129  
0.6395856648  
0.6333324571  
0.6271989647  
0.6211886768  
0.6152490416  
0.6094470553  
0.6037276563  
0.5980928106  
0.5925712993  
0.5871325399  
0.5817833146  
0.5765252146  
0.5713617768  
0.56628323  
0.5612953403  
0.5563682442  
0.5515408292  
0.5467731452  
0.5420980424  
0.5374778353  
0.5329356198  
0.528486483  
0.5240913893  
0.5197777637  
0.515519034  
0.5113376657  
0.5072273822  
0.5031676172  
0.4991709167  
0.4952367849  
0.4913719534  
0.4875521135  
0.4838090323  
0.4801115033  
0.4764645384  
0.4728888456  
0.4693435857  
0.4658735727  
0.4624349233  
0.4590884355  
0.4557345781  
0.4524628496  
0.4492176184  
0.4460543716  
0.4429255408  
0.4398235017  
0.4367759979  
0.4337853353  
0.430822851  
0.4279115755  
0.4250265631  
0.4222033654  
0.4194181148  
0.4166570024  
0.4139338664  
0.4112563872  
0.4086435065  
0.4060295334  
0.4034775699  
0.40094067  
0.3984490203  
0.3959910458  
0.3935770572  
0.3911736476  
0.3888138668  
0.3864886331  
0.3842029569  
0.3819403688  
0.3797145326  
0.3775036871  
0.3753404071  
0.373206201  
0.3710796065  
0.3689920123  
0.3669581037  
0.3649077868  
0.3629274855  
0.3609292436  
0.3589837555  
0.3570595448  
0.3551740489  
0.3532969165  
0.3514368333  
0.3496013076  
0.3478243358  
0.346042949  
0.3442806508  
0.3425447193  
0.3408490656  
0.3391642595  
0.3375155604  
0.3358750315  
0.3342553223  
0.3326498511  
0.3310793378  
0.3295209581  
0.3279778518  
0.3264646267  
0.3249811845  
0.3235175111  
0.3220469168  
0.3205974352  
0.3191749635  
0.3177887682  
0.3163901099  
0.315030084  
0.3136923876  
0.3123577617  
0.3110385546  
0.3097482002  
0.308479098  
0.3072189535  
0.3059494092  
0.3047226287  
0.3035261843  
0.3023261558  
0.3011320566  
0.2999705344  
0.2988114829  
0.2976807186  
0.2965576653  
0.2954472278  
0.2943532079  
0.2932744871  
0.2922070239  
0.2911558651  
0.2901272759  
0.2891056563  
0.2880750563  
0.2870790571  
0.2860962336  
0.2851294018  
0.2841651423  
0.2832342193  
0.2822877243  
0.2813794458  
0.2804573359  
0.2795714412  
0.2786814042  
0.2778173383  
0.2769565887  
0.2761046752  
0.275266472  
0.2744413142  
0.2736350232  
0.2728177323  
0.2720209109  
0.2712324858  
0.2704900253  
0.2697114666  
0.2689599876  
0.2682293276  
0.2675016764  
0.2667796353  
0.2660829181  
0.2653816719  
0.2646861615  
0.2640221801  
0.2633541583  
0.2626839608  
0.2620331793  
0.2614043026  
0.260754848  
0.2601594454  
0.2595427807  
0.258940836  
0.2583540928  
0.2577735704  
0.2571988229  
0.2566206231  
0.2560681454  
0.2555249869  
0.2549841885  
0.2544511491  
0.2539232191  
0.2534238556  
0.2529163518  
0.2524317406  
0.2519457583  
0.2514688685  
0.2509851972  
0.2505348667  
0.2500620101  
0.2496297887  
0.2491926622  
0.24875432  
0.2483343723  
0.2479195258  
0.2475133808  
0.2471044704  
0.2467234055  
0.2463410295  
0.2459650975  
0.2455854981  
0.2452236559  
0.244887834  
0.2445224827  
0.2441901826  
0.2438613601  
0.2435330443  
0.2432170097  
0.2429021878  
0.242599537  
0.2423172083  
0.2420183456  
0.2417307568  
0.2414684045  
0.2412051594  
0.2409371373  
0.2406800327  
0.2404445824  
0.2402042366  
0.2399685901  
0.2397264806  
0.2395298039  
0.2393110674  
0.239102667  
0.2389047425  
0.2387078265  
0.2385385864  
0.2383545598  
0.2381692672  
0.2380045076  
0.2378654647  
0.2377093254  
0.2375733096  
0.2374281734  
0.2372949403  
0.2371652974  
0.2370472501  
0.2369404222  
0.2368274698  
0.2367407756  
0.2366308814  
0.2365416159  
0.2364707185  
0.2363992809  
0.236323333  
0.2362604996  
0.2362060404  
0.2361652385  
0.2361202383  
0.2360847362  
0.2360598061  
0.2360205752  
0.2360274214  
0.2360067893  
0.2360069973  
