2.387209869  
8.070334282  
22.03980014  
30.05735019  
340.9573798  
15278.34432  
10431.18762  
18654.15293  
10652.39962  
28303.57098  
31477.23486  
4898.431832  
23046.63277  
5521.864235  
10400.13434  
376.8203012  
124.5774256  
11304.70578  
1636.383914  
18197.68298  
16578.29647  
384.4504687  
7104.876514  
34.91548789  
6185.926319  
582.4844467  
12480.58553  
1468.031271  
16779.60647  
3573.801166  
7780.5568  
9133.44943  
21954.13139  
181.7585007  
6560.908446  
3775.595371  
5481.1485  
22027.01337  
6136.164847  
9140.551468  
3353.542623  
5123.698268  
28228.31345  
4458.707534  
1296.94305  
9482.581502  
14170.67986  
1760.061873  
1199.154908  
1550.57622  
14888.45464  
672.8544082  
4088.07939  
4235.908835  
15548.9835  
1006.512227  
7455.720723  
9189.686763  
1175.711623  
250.264927  
3303.732533  
1373.798266  
984.4027525  
2215.91566  
40.64590796  
945.1307828  
199.4011363  
170.0026993  
124.39345  
415.7278092  
114.6501341  
216.7719091  
36.70724928  
42.76268449  
9.488511599  
5.602734383  
20.96775781  
11.47479502  
9.75913058  
12.99198017  
4.656201399  
6.192725337  
5.298314127  
7.626656489  
5.540556912  
5.82335065  
4.111926038  
4.535640367  
3.673509227  
3.751670081  
3.670881074  
3.541931404  
3.045117704  
2.975411255  
2.748300318  
2.660745036  
2.530903294  
2.38106435  
2.210795758  
2.13922566  
1.993863189  
1.906284381  
1.779992196  
1.74249197  
1.625468101  
1.583364867  
1.497935046  
1.435331644  
1.359397765  
1.306773985  
1.24679688  
1.191359505  
1.143004228  
1.092744813  
1.050108466  
1.006609739  
0.9655803957  
0.9270150564  
0.8918632345  
0.857272809  
0.8242248265  
0.7929764303  
0.7637028855  
0.73514303  
0.708139062  
0.6826514859  
0.6580598096  
0.6347263993  
0.6126028142  
0.5912939057  
0.5707853383  
0.5515443568  
0.5327881703  
0.5150368668  
0.4979340953  
0.4816096708  
0.4659685668  
0.450954477  
0.436601203  
0.4228055338  
0.4095754458  
0.3968714354  
0.3846576595  
0.3729196813  
0.3616490701  
0.350786915  
0.3403439198  
0.3303126861  
0.3206501281  
0.3113482596  
0.3023797896  
0.2937402122  
0.2854135536  
0.2773808309  
0.2696552311  
0.2621718759  
0.2549637966  
0.2480045179  
0.2412856747  
0.2348116918  
0.2285536034  
0.2224764061  
0.2166351768  
0.2109797871  
0.2055139051  
0.2002181  
0.1951013992  
0.1901434015  
0.1853540973  
0.1807007062  
0.176209144  
0.1718573764  
0.1676261664  
0.1635444448  
0.1595846869  
0.1557402535  
0.1520200922  
0.1484052456  
0.1448859482  
0.1415037358  
0.1382047525  
0.1349916515  
0.1318826715  
0.1288645729  
0.1259271549  
0.1230816497  
0.1203123515  
0.1176224132  
0.1150153845  
0.1124734866  
0.1099990262  
0.1076067287  
0.1052646774  
0.1030019744  
0.1007860186  
0.09863796277  
0.09654600506  
0.09450791771  
0.09252852777  
0.09059682088  
0.0887172939  
0.08688755024  
0.08510822371  
0.0833726558  
0.08168302946  
0.08003219013  
0.07842542038  
0.07685395209  
0.07532618018  
0.07384780945  
0.07239149188  
0.07097723375  
0.06959246249  
0.06825086132  
0.06693319587  
0.06565658814  
0.0644018023  
0.06317854285  
0.061984922  
0.06082392851  
0.0596887026  
0.05857977534  
0.05749775768  
0.05644080006  
0.05540808671  
0.05439607372  
0.05341427826  
0.05244610544  
0.05150650542  
0.05058426486  
0.04968607059  
0.04881036264  
0.04794804655  
0.0471040239  
0.04628351171  
0.04548315163  
0.04469550149  
0.04392207946  
0.04317829798  
0.04243801884  
0.04172028068  
0.04101297713  
0.04032434348  
0.03964909101  
0.03898817599  
0.03833994462  
0.03771002027  
0.03709372159  
0.03648518546  
0.03589169398  
0.03530445301  
0.0347381264  
0.03418283396  
0.03363381059  
0.03310005221  
0.03257527241  
0.03206354896  
0.03155783595  
0.03106433204  
0.0305784352  
0.03010696241  
0.02964252567  
0.02918630109  
0.02874003185  
0.02830175255  
0.027868822  
0.0274513293  
0.02704061768  
0.0266316705  
0.02623641365  
0.02585014984  
0.02546700482  
0.02509128589  
0.02472098105  
0.02436199802  
0.02401458104  
0.02366289528  
0.02331810319  
0.02298817642  
0.02265953303  
0.02233745773  
0.02201906056  
0.0217120118  
0.02140619984  
0.021109143  
0.02081147752  
0.0205235122  
0.02024040144  
0.01996374852  
0.01969078477  
0.01942362132  
0.01915478899  
0.01889922942  
0.01864496227  
0.01839737366  
0.01815101755  
0.01790777104  
0.01767362339  
0.01744223082  
0.0172108392  
0.01699104258  
0.01676540817  
0.0165520174  
0.01634145431  
0.01613097013  
0.01592585796  
0.01571785118  
0.01552289532  
0.01532778711  
0.01513728326  
0.01494469558  
0.01476047414  
0.01457854657  
0.01439784087  
0.01422360592  
0.01404666767  
0.01387704138  
0.01370900535  
0.0135443149  
0.01338093251  
0.01322184863  
0.01306500491  
0.01291095009  
0.01275662465  
0.01260914227  
0.01246032368  
0.01231401593  
0.0121734095  
0.01203477201  
0.01189525418  
0.01176154313  
0.01162677191  
0.01149645841  
0.01136898851  
0.01124148336  
0.01111436768  
0.01099175858  
0.01087164033  
0.01075150165  
0.01063524553  
0.01052001355  
0.01040573913  
0.01029308976  
0.01018240249  
0.01007465934  
0.00996994927  
0.009864146153  
0.009760399144  
0.00966026441  
0.009561510968  
0.009457898039  
0.009363315754  
0.00926803573  
0.009173758936  
0.009080396344  
0.008990808711  
0.008899791986  
0.008812114089  
0.008725533686  
0.008639618569  
0.008555168233  
0.008471238309  
0.008392492467  
0.008310551517  
0.008232408916  
0.008153490198  
0.008077670663  
0.008000413091  
0.007929111109  
0.0078550467  
0.007782594764  
0.007710284445  
0.007641345097  
0.007571309006  
0.00750461434  
0.007437889043  
0.007372136562  
0.007306770238  
0.007244556052  
0.007180882846  
0.007118896572  
0.007057494359  
0.006998868259  
0.006941035183  
0.006882324436  
0.00682365894  
0.006770617225  
0.006712800892  
0.006659102122  
0.006605222285  
0.006552871181  
0.006501095345  
0.006452057259  
0.006399988887  
0.006350723491  
0.0063003315  
0.006253787242  
0.006206447531  
0.006161824215  
0.006116111782  
0.006068197179  
0.006025401101  
0.005980599028  
0.005939553537  
0.005897749176  
0.00585652432  
0.005816654412  
0.005775335595  
0.005736310173  
0.005696866023  
0.0056599828  
0.005622646949  
0.00558509767  
0.005549009559  
0.005513968045  
0.005477610614  
0.005443372084  
0.005411576076  
0.005376568035  
0.005345573629  
0.005313113918  
0.005281600128  
0.005250448897  
0.005221304908  
0.00519165395  
0.005162741913  
0.005134301976  
0.005105543935  
0.005077666869  
0.005050785251  
0.005024041312  
0.0049985576  
0.004973500151  
0.004947176141  
0.004923622561  
0.004899499867  
0.004876471929  
0.00485376445  
0.004829963018  
0.004808888313  
0.004786881706  
0.004764982809  
0.004745486828  
0.004725480889  
0.004705041314  
0.004684989231  
0.004667245505  
0.00464734039  
0.004631076381  
0.004614289802  
0.004595806684  
0.004581191869  
0.004563062743  
0.004547126102  
0.004532577843  
0.004517475519  
0.004503808967  
0.004489502884  
0.004475474003  
0.004461842385  
0.004449053113  
0.004435888801  
0.004426155365  
0.004412598848  
0.004401355068  
0.004392526087  
0.004379514331  
0.00437205391  
0.0043607512  
0.004352387984  
0.004343111778  
0.004334086245  
0.004327148034  
0.00431890001  
0.004311544349  
0.004304494629  
0.004299669968  
0.00429188148  
0.00428654536  
0.004280857637  
0.004276458688  
0.004273137806  
0.004267700075  
0.00426355156  
0.004259748045  
0.004255692568  
0.004253385068  
0.004252174514  
0.004249480618  
0.004247704612  
0.004245721395  
0.00424620324  
0.004244975849  
0.004244738099  
