139.72233  
149.0462567  
175.9266417  
264.5221327  
431.5117517  
1346.746915  
3.965487374  
1282.844538  
28875.0573  
81203.46195  
1708.256094  
47235.91294  
8779.946182  
70527.79634  
4915.623376  
12838.72036  
10318.9227  
3865.850421  
11408.61668  
25751.12448  
491.6194443  
12845.9396  
7692.638889  
1980.052093  
571.399244  
5435.712331  
14761.68403  
9080.762708  
9735.867176  
16407.01354  
2925.008814  
14831.42414  
5791.365426  
3146.874871  
161.5259541  
8293.393212  
3032.906623  
3899.443794  
536.0809965  
5638.630149  
8075.4201  
956.6775117  
1529.760838  
4748.52659  
2137.856597  
3972.062997  
1161.474669  
1879.994857  
349.6414664  
2000.163243  
4524.093998  
510.9894075  
2532.265212  
934.9670136  
856.9346259  
1832.233761  
1773.891173  
1795.577236  
683.2168568  
3269.334635  
568.6873641  
570.4008315  
1436.758041  
46.34533873  
190.3136556  
257.8896193  
243.4182126  
17.19461872  
31.50978338  
29.79539115  
2.576415249  
49.26874776  
4.329513321  
9.793883122  
11.04491963  
1.854962031  
8.965025978  
5.985013907  
5.458731047  
5.705139275  
4.593607663  
4.552002718  
4.528424099  
3.388139742  
3.488065926  
2.928194228  
2.462240027  
2.042570582  
1.924936389  
2.056829907  
1.767734475  
1.739796432  
1.639695681  
1.469894887  
1.38650675  
1.262959992  
1.203493587  
1.137912759  
1.076642469  
1.001326956  
0.965244427  
0.9088063627  
0.8598647695  
0.8250254622  
0.7688213817  
0.7357534077  
0.6949271351  
0.6598280956  
0.629094187  
0.601593587  
0.568604766  
0.5452657795  
0.5222322403  
0.4982322746  
0.4761714773  
0.4562013843  
0.4373482446  
0.4178018509  
0.4006996959  
0.3857156254  
0.3693652102  
0.3556824309  
0.3416896336  
0.3286109485  
0.3162960917  
0.3046256326  
0.2933139897  
0.2829731481  
0.2727551604  
0.2630853378  
0.2539965848  
0.2452184975  
0.236907588  
0.2290135689  
0.2214190483  
0.2141563499  
0.2072427355  
0.2005775408  
0.1942545162  
0.1881969513  
0.1823593783  
0.1767878193  
0.1714398944  
0.1663048254  
0.1613948818  
0.1566686367  
0.1521393507  
0.1477770234  
0.1435782298  
0.1395463679  
0.1356686878  
0.1319331054  
0.1283532931  
0.1248878903  
0.1215556513  
0.1183410352  
0.1152446361  
0.1122630863  
0.1093800913  
0.1066013106  
0.1039164362  
0.1013210591  
0.09881967844  
0.09640017555  
0.09406171872  
0.09180068566  
0.08961722366  
0.08750147382  
0.08545608  
0.08347278224  
0.08156141117  
0.07970345887  
0.07790685888  
0.07616398492  
0.07447571103  
0.07283388513  
0.07125349466  
0.06971161327  
0.06821892902  
0.06677198096  
0.06536872265  
0.06400344288  
0.06267934047  
0.06139258951  
0.06014306357  
0.05892929936  
0.05774909202  
0.05660307043  
0.05548847765  
0.05440080075  
0.05334687624  
0.05232093123  
0.05132291189  
0.05035423967  
0.04940798015  
0.04849145646  
0.04759471296  
0.04672279987  
0.04587204135  
0.04504482047  
0.04424092669  
0.04345357318  
0.04269132384  
0.04194370004  
0.04121774209  
0.04050460966  
0.03981383968  
0.03913989259  
0.03848119481  
0.03783801818  
0.03721334454  
0.03660133602  
0.03600522977  
0.0354212314  
0.03485167742  
0.0342957071  
0.03375579085  
0.03322338923  
0.03270446171  
0.03219956258  
0.03170316377  
0.03121893433  
0.03074732803  
0.03028246787  
0.02983439791  
0.02939091342  
0.02896069473  
0.02853723617  
0.02812353081  
0.02771813599  
0.02732263236  
0.02693492286  
0.02655636038  
0.0261869235  
0.02582167314  
0.0254646564  
0.02511797532  
0.02477689587  
0.02444486224  
0.02411847399  
0.02379619443  
0.02348404623  
0.0231746642  
0.02287452903  
0.02257831139  
0.02228875518  
0.02200494878  
0.02172688217  
0.02145604943  
0.02118869027  
0.02092583211  
0.02066720216  
0.0204167576  
0.02016870341  
0.01992721909  
0.01968863922  
0.0194561972  
0.01922620321  
0.01900196753  
0.01878110035  
0.01856564061  
0.01835189986  
0.01814431315  
0.01793979369  
0.01773863387  
0.0175419942  
0.01734708221  
0.0171577521  
0.01697102655  
0.01678804126  
0.01660640636  
0.01643072429  
0.01625617913  
0.01608576559  
0.01591781018  
0.01575390194  
0.01559078459  
0.01543075566  
0.01527638911  
0.01511985459  
0.01497080862  
0.01482156507  
0.01467519369  
0.01453281116  
0.01439190495  
0.01425333492  
0.01411635105  
0.01398043675  
0.01384759625  
0.01371940889  
0.01359058242  
0.01346627602  
0.01334300265  
0.01322161541  
0.01310151204  
0.01298427021  
0.01286849407  
0.01275453711  
0.01264234412  
0.01253327231  
0.01242435333  
0.01231741928  
0.01221257889  
0.01210839438  
0.01200579438  
0.01190588305  
0.01180823481  
0.01170992493  
0.01161538586  
0.01152137272  
0.01142894868  
0.01133703732  
0.01124765808  
0.01115864231  
0.01107062523  
0.01098563552  
0.01090156352  
0.01081875729  
0.0107362026  
0.01065644285  
0.01057478548  
0.01049759257  
0.0104207474  
0.01034482563  
0.01027057124  
0.01019641648  
0.01012314899  
0.01005178934  
0.009981777465  
0.009911755436  
0.009843185519  
0.009776348901  
0.009707592265  
0.009642514145  
0.009580323193  
0.009514636718  
0.009453429768  
0.009391144085  
0.00932893292  
0.00927010513  
0.009210711242  
0.009152516015  
0.009095335562  
0.009038701145  
0.008982272076  
0.008926999359  
0.008873592426  
0.008819507801  
0.008767520314  
0.008716221337  
0.008662695844  
0.008613827777  
0.008564149978  
0.008515058261  
0.008465532729  
0.00841777464  
0.008370865014  
0.008324331195  
0.008279204072  
0.00823455778  
0.008188925392  
0.008145892711  
0.008103129451  
0.008060816052  
0.008018048192  
0.007976662258  
0.00793608878  
0.007895411548  
0.007856032578  
0.007816644916  
0.007777999713  
0.007741510946  
0.007704180702  
0.007666925321  
0.007630322987  
0.007594806649  
0.007558153554  
0.007524227036  
0.007490142503  
0.007454639882  
0.007422380929  
0.007389852982  
0.007356782598  
0.007325885511  
0.007293548239  
0.007262474874  
0.007231909413  
0.007203594921  
0.007172493332  
0.007143612831  
0.007114326093  
0.007085723546  
0.007057568286  
0.007030143824  
0.007003302396  
0.006976654586  
0.00695021249  
0.006924239888  
0.006897886232  
0.006872785105  
0.00684900934  
0.006822868339  
0.006799048236  
0.006776423485  
0.006752896739  
0.006728124782  
0.006707026449  
0.006684218679  
0.006662488133  
0.00664040708  
0.00662041856  
0.006598840153  
0.006578715632  
0.006559066871  
0.006537873054  
0.006518777812  
0.006500256176  
0.006480914447  
0.00646193388  
0.006443858476  
0.006425269703  
0.006407574299  
0.006391078574  
0.006372374184  
0.006356071872  
0.006339706287  
0.00632340238  
0.006307454927  
0.006291604192  
0.006277346592  
0.006262456571  
0.006246789752  
0.006232021046  
0.006218643209  
0.006204003776  
0.006190366594  
0.006177270671  
0.006163421636  
0.006150950344  
0.006139011368  
0.006126748708  
0.00611456375  
0.006102876349  
0.006090951778  
0.006079262569  
0.006068194294  
0.006057243275  
0.006046338029  
0.006036786049  
0.006027014825  
0.006016919698  
0.006007570773  
0.005998545406  
0.005989324013  
0.005979652291  
0.005970887972  
0.005962628918  
0.005954964517  
0.005947448821  
0.00593874605  
0.005931340304  
0.005924628745  
0.005917596496  
0.005911333108  
0.005904726857  
0.005898512788  
0.005892448545  
0.005885415094  
0.005881050987  
0.005875109654  
0.005869987882  
0.005866145865  
0.005861178734  
0.005855234861  
0.005851746351  
0.005848431135  
0.005843603692  
0.005841227569  
0.005837025533  
0.00583377112  
0.005830408898  
0.005829330794  
0.005827006795  
0.005822772791  
0.005821102516  
0.005819948976  
0.005818381396  
0.005817191529  
0.005815367698  
0.005814657571  
0.005813917164  
0.005813432918  
0.005812646487  
0.005813048673  
