1768.230115  
1876.660008  
2076.689021  
2493.411735  
5047.342658  
16244.45222  
5077.475703  
8783.419951  
4307.940182  
14373.38004  
45930.60527  
29029.4366  
24966.58225  
14720.22146  
46341.97279  
4994.633804  
24158.69579  
1490.91368  
26589.08768  
428.1927184  
3958.357034  
1502.027222  
35288.35839  
16168.79099  
9257.962624  
12364.33172  
1120.316932  
3588.65939  
18408.56948  
12254.87873  
180.7017335  
1665.026964  
12509.36593  
8776.324375  
590.5574646  
43.63034831  
3970.926366  
335.0837588  
11338.95455  
7507.574491  
1484.38219  
634.0530475  
171.3679837  
619.9321437  
3836.723574  
104.8726213  
847.8782848  
4813.027165  
574.8274833  
3827.713227  
1703.749233  
4235.026483  
867.1465115  
2884.664832  
1609.940284  
2579.441491  
5766.177807  
856.3288359  
1509.490095  
435.7612536  
775.4203733  
2983.480321  
1179.937904  
628.2666878  
149.833575  
245.8937859  
39.67907285  
48.34784455  
32.90479448  
24.8850027  
37.40896891  
98.02737036  
25.77207362  
45.89245234  
11.92838253  
18.24139547  
21.24891703  
23.99265727  
18.63844199  
11.82608795  
12.11291725  
8.418382347  
7.876730424  
16.11871133  
9.814143893  
9.518257067  
10.60531474  
7.569610213  
6.866717175  
6.761920745  
6.454732897  
6.30291324  
5.948055857  
5.736246093  
5.355528707  
5.01241054  
4.75154015  
4.372343817  
4.416648181  
4.152602869  
4.011646571  
3.815260859  
3.534778759  
3.385953429  
3.238880872  
3.100989738  
3.012858405  
2.860992981  
2.739724884  
2.636035922  
2.507208015  
2.42340464  
2.330279083  
2.235148821  
2.145204414  
2.054044625  
1.985982805  
1.907632163  
1.841836739  
1.76923678  
1.708461481  
1.643021156  
1.583353794  
1.527090093  
1.474781933  
1.422294387  
1.373436121  
1.326991585  
1.28279341  
1.239437015  
1.197767727  
1.158953947  
1.120977934  
1.08466992  
1.04980864  
1.016449818  
0.984309258  
0.9536776883  
0.9239509415  
0.895524447  
0.8683377831  
0.8419667635  
0.8166612871  
0.7923359036  
0.768879233  
0.746290421  
0.724558736  
0.7036136244  
0.6834347955  
0.6639705349  
0.6452144414  
0.6270778658  
0.6096186781  
0.5927650194  
0.57648729  
0.5607592531  
0.5455904295  
0.5308931311  
0.516725536  
0.5030114056  
0.4897640896  
0.4769322893  
0.4645396354  
0.4525457589  
0.4409337231  
0.4296878284  
0.4188145983  
0.4082614502  
0.3980507747  
0.3881627281  
0.3785734898  
0.369292614  
0.3602638329  
0.351521982  
0.3430734748  
0.3348505242  
0.3268775907  
0.3191419418  
0.3116312605  
0.3043391982  
0.2972601823  
0.2903906218  
0.2837199355  
0.277221624  
0.2709196623  
0.264796572  
0.2588428787  
0.2530524871  
0.2474283369  
0.241961313  
0.2366228591  
0.2314540709  
0.2264263303  
0.2215108813  
0.2167537925  
0.2121116169  
0.207599478  
0.2032007257  
0.198918462  
0.1947401697  
0.1906791035  
0.1867159451  
0.1828525072  
0.17910143  
0.1754346133  
0.171869845  
0.1683872695  
0.16499419  
0.1616979912  
0.1584652895  
0.1553156483  
0.1522452497  
0.1492416298  
0.146326336  
0.14347078  
0.1406933389  
0.1379842715  
0.1353254616  
0.1327460789  
0.1302060307  
0.1277475186  
0.1253336459  
0.1229817219  
0.1206780972  
0.1184405592  
0.1162449869  
0.114099541  
0.1119928251  
0.1099460952  
0.1079463695  
0.1059898278  
0.1040814089  
0.1022123178  
0.1003811473  
0.09858821957  
0.09684166266  
0.09512844154  
0.09345713655  
0.09181372859  
0.09021692873  
0.08864392803  
0.08712015747  
0.08561728337  
0.08414897637  
0.08270614117  
0.08130925339  
0.07992458476  
0.07857755307  
0.07724904596  
0.0759558045  
0.07468990868  
0.07345042594  
0.07223776769  
0.07104630889  
0.06988085733  
0.06873379406  
0.06762041295  
0.06652134951  
0.06544122218  
0.06439314294  
0.06335307453  
0.06234244871  
0.06134520842  
0.0603769927  
0.05942655877  
0.05848656935  
0.05757524429  
0.0566684803  
0.05579274405  
0.05492725225  
0.05407895705  
0.05324358509  
0.0524219888  
0.05162974972  
0.0508453517  
0.05006797167  
0.04931084189  
0.04857509463  
0.04784674634  
0.04713054099  
0.0464287482  
0.04574448685  
0.04506168986  
0.04440388504  
0.04374723264  
0.0431134852  
0.04248381979  
0.04187064724  
0.04126090875  
0.04066204807  
0.04008351372  
0.03951368543  
0.03894695908  
0.03839330872  
0.0378513649  
0.03732010984  
0.03679397046  
0.03627729325  
0.03577309002  
0.03528101471  
0.03478540666  
0.0343073174  
0.03383794627  
0.03337490873  
0.03292223797  
0.03246860323  
0.03203236729  
0.03160130794  
0.03117579449  
0.03075624047  
0.0303493707  
0.02994395933  
0.02954843207  
0.02915702451  
0.02877645573  
0.02839501647  
0.02802921604  
0.02766521471  
0.02730501166  
0.02695219784  
0.02660264594  
0.02626009141  
0.02592687101  
0.02559714994  
0.02527487512  
0.02495471468  
0.02464087439  
0.02433329306  
0.02403013178  
0.02373025843  
0.02343547071  
0.02314976481  
0.02286182572  
0.02258598583  
0.02230945186  
0.02203820715  
0.02177220083  
0.02150586772  
0.02125172861  
0.0209968246  
0.02074605567  
0.02049927691  
0.02025800063  
0.02001898242  
0.01978653099  
0.01955386435  
0.01932993228  
0.01910490424  
0.01888335897  
0.01866825632  
0.01845261238  
0.01824268876  
0.01803973934  
0.01783407272  
0.01763670226  
0.01743969659  
0.01724365789  
0.01705515741  
0.01686481902  
0.01668479919  
0.01650324503  
0.01632224549  
0.01614616913  
0.01597409866  
0.01580118903  
0.01563127616  
0.01546658397  
0.01530366894  
0.01514557092  
0.01498394729  
0.01483027256  
0.01467716075  
0.01452905728  
0.01437718502  
0.01423393864  
0.01408684556  
0.01394624633  
0.01381028811  
0.01367028547  
0.01353354237  
0.01340034996  
0.01327141363  
0.01314256207  
0.013015461  
0.0128909967  
0.01276634715  
0.01264995696  
0.01252865749  
0.01241273511  
0.01229398477  
0.012183338  
0.01207273167  
0.01196201186  
0.01185212924  
0.0117476312  
0.01164353238  
0.01154026654  
0.01143861357  
0.01133925242  
0.01124240638  
0.01114337729  
0.01104995306  
0.01095650195  
0.0108643747  
0.01077183435  
0.01068622702  
0.01059744547  
0.01051465381  
0.01042949229  
0.01034530478  
0.01026194195  
0.01018420762  
0.01010512732  
0.01002696463  
0.009951025069  
0.009877848138  
0.009803496543  
0.009729555312  
0.009658262617  
0.009588055629  
0.009518086977  
0.009451812026  
0.009386611288  
0.009323548483  
0.009258677408  
0.009197253258  
0.009134883527  
0.009074579357  
0.009017517172  
0.008958344898  
0.008901027009  
0.008846106519  
0.008791408469  
0.008736899762  
0.008684198843  
0.008631804104  
0.008583576685  
0.008535115336  
0.008486531349  
0.008439398099  
0.008392709456  
0.008349192993  
0.008302499199  
0.008261403309  
0.008220883623  
0.008176134577  
0.008135295182  
0.008098139812  
0.008058436858  
0.008024777934  
0.007985976483  
0.007950565558  
0.007917902938  
0.007883040423  
0.007849936964  
0.007816613998  
0.00778842876  
0.007756779536  
0.007729093607  
0.007699935429  
0.00767086947  
0.007644573323  
0.00761979283  
0.007594845233  
0.007571647587  
0.007548952223  
0.007527216622  
0.007504177768  
0.007484225343  
0.007464449631  
0.007445594182  
0.007428395442  
0.007408991668  
0.007393306367  
0.007378512918  
0.007361006776  
0.007348291479  
0.00733552121  
0.007324776047  
0.007311293515  
0.007302152429  
0.007290609409  
0.007283498497  
0.007275495688  
0.007267057108  
0.007258636522  
0.007254136067  
0.007247805492  
0.007245437806  
0.007239929694  
0.007238919395  
0.007237206513  
0.007234563368  
0.007233827256  
