90.39587036  
88.78937219  
84.42349378  
68.28621612  
150.8404579  
848.4347929  
23708.4303  
13471.70019  
8781.15149  
2598.411784  
9407.232088  
1707.189499  
811.2608033  
8062.786612  
78071.43678  
38382.00384  
23130.10531  
42219.86457  
5317.505372  
9465.589962  
20397.96701  
1798.553172  
24186.50871  
4083.67669  
12339.68217  
14857.75857  
5973.821493  
6931.148251  
1626.931035  
3648.859575  
11167.25029  
1240.35175  
6142.44642  
14446.93493  
3322.77218  
6812.316362  
619.6306371  
40.08024629  
1089.674898  
11858.26101  
339.6116886  
8455.276952  
1898.616884  
1161.06831  
11059.05635  
900.3530295  
12595.08528  
1974.428525  
3165.025106  
9831.36627  
1580.111968  
1665.93798  
4539.363267  
85.80822825  
192.6162388  
4499.784781  
1553.86115  
496.1182714  
357.0521572  
22.32289804  
472.9233597  
145.9551455  
653.450791  
197.4080167  
107.728021  
186.3860067  
96.96452194  
60.44224126  
168.771657  
16.45220802  
0.4615542825  
0.8336850385  
0.7058165066  
12.67550008  
2.297314568  
1.338935908  
0.3028655642  
0.5099501895  
0.02478432071  
0.1159332368  
0.6278028182  
0.329728349  
0.02551364147  
0.2105250206  
0.5480345186  
0.3263310098  
0.255379639  
0.2535812602  
0.2897516728  
0.2437293046  
0.2794113544  
0.3019475695  
0.2769460765  
0.263635546  
0.29259368  
0.2594780193  
0.2539191536  
0.259933301  
0.2797897054  
0.2723689205  
0.2632232073  
0.2586296324  
0.253165267  
0.2528146455  
0.2474348452  
0.2484980993  
0.2484817916  
0.241759994  
0.2371208543  
0.2381150501  
0.2324369697  
0.2292611815  
0.224311745  
0.2233088054  
0.2183639813  
0.2144821883  
0.2119380468  
0.2077257666  
0.2045601537  
0.2015168011  
0.1981570043  
0.1947941466  
0.1914060609  
0.1885822228  
0.185437235  
0.1823470662  
0.1793548001  
0.1765014685  
0.1736539034  
0.1707428485  
0.1679817278  
0.165278942  
0.1625835022  
0.1599224545  
0.1573931687  
0.154902229  
0.1524309311  
0.150042413  
0.1476826944  
0.1453737784  
0.1431074281  
0.1408952553  
0.1387238806  
0.1366090006  
0.134525715  
0.132507269  
0.1305273388  
0.1285701932  
0.1266784965  
0.1248274984  
0.1229913157  
0.1212145307  
0.1194604289  
0.1177511542  
0.1160829557  
0.1144511242  
0.1128424962  
0.1112764817  
0.1097386098  
0.1082276502  
0.1067527455  
0.1053106677  
0.1038953571  
0.1025113805  
0.1011510729  
0.09982793299  
0.09852111555  
0.09724782346  
0.0959999661  
0.09477214244  
0.09357071836  
0.09239270566  
0.09124563638  
0.09010988808  
0.08900614365  
0.08791838423  
0.0868487561  
0.08580202233  
0.0847753867  
0.08377696275  
0.08278225384  
0.08181371134  
0.08086261388  
0.07993284496  
0.07902154063  
0.07812675223  
0.07724675202  
0.07637839698  
0.07552781479  
0.07469338571  
0.0738799305  
0.07307334655  
0.07229275164  
0.07150867626  
0.07074934563  
0.07000027078  
0.06926924024  
0.06854889805  
0.06783663092  
0.06714502869  
0.06645737191  
0.06578783984  
0.06512815993  
0.06447859278  
0.06384216949  
0.06320890853  
0.06259270027  
0.06198603889  
0.06139199157  
0.06080662144  
0.06022880023  
0.05965851951  
0.05910600799  
0.05855232759  
0.0580130417  
0.05748611122  
0.05696401767  
0.05644347467  
0.05594271808  
0.0554461557  
0.05494943701  
0.05446727817  
0.05399175997  
0.05352898615  
0.05306936912  
0.05261300765  
0.05216514924  
0.0517299033  
0.0512950105  
0.05087318496  
0.05045268595  
0.05003693828  
0.04963012647  
0.04922919737  
0.04883749584  
0.04845175845  
0.04806739177  
0.04768765386  
0.04731604916  
0.04695088423  
0.04658899396  
0.04623325013  
0.0458799437  
0.0455355725  
0.04519627332  
0.04485638836  
0.04453014071  
0.04420113066  
0.0438806081  
0.04356199818  
0.04324855754  
0.04293644453  
0.04263609141  
0.04234012455  
0.04204277505  
0.04175126754  
0.0414646435  
0.04117742457  
0.04090199352  
0.04062543973  
0.04035245875  
0.04008047876  
0.03981517896  
0.03956109934  
0.03929735627  
0.03904413757  
0.0387964823  
0.03854623733  
0.03830062158  
0.0380593312  
0.03781965648  
0.03759014828  
0.03735303218  
0.03712839245  
0.03689729933  
0.03667670513  
0.03645535878  
0.03624094733  
0.03601968175  
0.03581137101  
0.03560459792  
0.03539689787  
0.03519141074  
0.03499021001  
0.03479580991  
0.03459591104  
0.03440319193  
0.03420882052  
0.03402131086  
0.03383647593  
0.03365277539  
0.0334689597  
0.03329233959  
0.03311406969  
0.0329382964  
0.03276175188  
0.03259125622  
0.0324231014  
0.03225538134  
0.03209369189  
0.03192771775  
0.0317667902  
0.03160818581  
0.03145118268  
0.03129730713  
0.03114215487  
0.03099459146  
0.03084258713  
0.03069488096  
0.03054828034  
0.03040210841  
0.03025903908  
0.03011904114  
0.02997888422  
0.02984465943  
0.02970704852  
0.02957005527  
0.0294408099  
0.02930921039  
0.02917750469  
0.02905257258  
0.0289275811  
0.02879998095  
0.028677124  
0.02855343323  
0.02843276356  
0.02831493844  
0.0281946067  
0.02807968128  
0.02796090136  
0.02785454221  
0.02773714982  
0.02762529027  
0.02751725012  
0.02740876984  
0.02730021652  
0.02719224528  
0.02708729564  
0.02698350426  
0.02688556652  
0.02678405337  
0.02667920931  
0.02658349175  
0.02648522899  
0.02638894264  
0.02629268713  
0.02619980701  
0.02610639966  
0.02601014054  
0.02592435217  
0.0258295789  
0.02574403485  
0.02565329067  
0.02557083088  
0.02548157121  
0.02540018574  
0.02531212514  
0.02523055242  
0.02514942821  
0.02506979201  
0.02498860432  
0.02490842221  
0.0248309998  
0.0247533905  
0.02467601754  
0.02460210307  
0.02452869203  
0.02445464305  
0.02438338301  
0.02431013011  
0.02423815625  
0.0241683659  
0.02410043025  
0.02403246097  
0.02396276142  
0.02389724803  
0.02383150044  
0.02376587524  
0.02369916051  
0.02363646428  
0.02357424571  
0.02351291569  
0.02345118679  
0.02339118065  
0.02333186964  
0.02327410601  
0.0232144425  
0.02315967032  
0.02309862228  
0.02304117874  
0.02298949063  
0.02293423163  
0.02288196766  
0.02282725014  
0.02277414365  
0.02272075699  
0.02267295717  
0.02262396957  
0.02257152246  
0.02252283391  
0.02247162097  
0.02242874547  
0.02238044743  
0.02233274919  
0.0222865087  
0.02224208821  
0.02219751314  
0.02215486153  
0.02211042195  
0.02206819796  
0.02202486301  
0.02198545766  
0.02194558291  
0.02190351591  
0.02186401065  
0.02182480155  
0.02178575423  
0.02175024138  
0.02171143854  
0.02167333128  
0.02163621085  
0.0216031561  
0.02156955587  
0.02153164381  
0.02150075509  
0.02146811356  
0.02143182625  
0.02140266376  
0.02137156673  
0.02133874892  
0.02131000489  
0.02128176676  
0.02124932244  
0.02122289525  
0.02119384692  
0.02116336948  
0.02113692406  
0.02110949996  
0.02108368587  
0.02105867484  
0.02103295968  
0.02100823719  
0.02098601212  
0.02096346427  
0.0209356755  
0.02091576657  
0.02089398427  
0.02087333634  
0.02084995353  
0.0208278799  
0.02080684713  
0.02078996786  
0.02076761013  
0.02074929912  
0.02073200639  
0.02071328858  
0.02069960144  
0.02068289646  
0.02066332013  
0.02064738337  
0.02063466282  
0.02061811141  
0.02060469744  
0.02058807577  
0.0205752425  
0.02056441199  
0.02055007757  
0.02053929975  
0.02052689806  
0.02051582516  
0.02050573709  
0.02049162334  
0.02048255744  
0.02047434416  
0.02046696132  
0.02046006673  
0.02045004905  
0.02043845543  
0.02043729177  
0.020428582  
0.02042429476  
0.02041699615  
0.02040863135  
0.02040747809  
0.02040269131  
0.02039973071  
0.02039610777  
0.02039184588  
0.02039123253  
0.02038387803  
0.02038675481  
0.02038463406  
0.02038477285  
0.02038422165  
