93.25795011  
109.1671071  
140.4397032  
194.6494935  
557.6375453  
5825.77907  
3504.311842  
18906.73247  
28765.5314  
22921.75555  
15272.28868  
16345.72555  
35113.79551  
11838.76491  
42804.93075  
4448.725357  
8496.221038  
6746.658081  
9594.65829  
20353.21661  
45272.8069  
10321.18886  
14314.92192  
508.9978075  
1604.939693  
17353.70872  
7784.620719  
4273.03672  
3171.813341  
2798.587733  
1286.086056  
5093.450398  
10712.02367  
1034.023293  
3213.398937  
8222.126316  
14845.53406  
865.7797049  
8509.301217  
878.989936  
11961.78309  
4589.106693  
4688.360693  
9730.282168  
866.7779104  
624.2769566  
4124.692247  
4409.003476  
370.7282056  
9019.216603  
2586.951801  
1090.745542  
1711.219047  
559.2948572  
3583.030287  
483.976656  
1113.235407  
1920.067081  
2117.775655  
2798.988084  
634.1113479  
746.9800696  
615.4927138  
1074.287182  
1006.228335  
254.5547709  
91.18870386  
208.7485619  
146.9266073  
116.7330218  
53.01810725  
33.68238766  
5.616119219  
1.949994548  
10.09225766  
2.310067865  
6.058871422  
8.503272153  
3.800782596  
3.685175301  
1.112126574  
0.4553022781  
0.9047061575  
1.638740499  
2.05614767  
1.232688006  
1.598056896  
1.270403884  
1.464258339  
1.479095992  
0.9652870357  
1.325877913  
1.145141213  
1.201972972  
1.148632406  
1.103731558  
1.080888382  
1.001838445  
0.9703000226  
1.016744878  
0.9654273288  
0.9497325197  
0.945167944  
0.9036510739  
0.902037587  
0.8793473285  
0.8655747402  
0.8373550403  
0.8158521056  
0.8050955914  
0.7918133558  
0.7711741627  
0.7586120709  
0.7437034303  
0.7297088421  
0.7151835961  
0.7017577369  
0.6888655482  
0.6744495003  
0.6624893686  
0.6508282773  
0.6388060562  
0.6278291967  
0.6167941798  
0.6063531716  
0.595852122  
0.5852498798  
0.5758603229  
0.5659563216  
0.5566690466  
0.5474744096  
0.538548458  
0.5299191632  
0.5215470683  
0.5132228061  
0.5051813595  
0.4973825987  
0.4897126616  
0.4822701374  
0.4750176731  
0.4678853118  
0.4609643106  
0.4542200282  
0.4476213479  
0.4411739899  
0.4348562877  
0.4287369661  
0.4227069994  
0.4168374625  
0.4111059176  
0.4054942747  
0.4000038903  
0.3946422767  
0.3893985098  
0.3842613706  
0.3792402491  
0.3743335642  
0.3695279297  
0.3648212493  
0.3602109399  
0.3556930343  
0.3512834661  
0.3469569225  
0.3427221523  
0.3385677207  
0.3345007115  
0.3305132755  
0.3266046167  
0.3227761587  
0.3190278979  
0.315340307  
0.3117338158  
0.3081900344  
0.3047153268  
0.3013111551  
0.2979710977  
0.2946921977  
0.2914838553  
0.2883240624  
0.2852199044  
0.282174118  
0.2791857806  
0.2762602915  
0.2733798823  
0.2705489323  
0.2677700053  
0.2650390011  
0.2623553122  
0.259725842  
0.2571326324  
0.2545834803  
0.2520904746  
0.2496312648  
0.2472126321  
0.2448402119  
0.2425089023  
0.2402111092  
0.2379519472  
0.2357336575  
0.2335471172  
0.2314030284  
0.2292913313  
0.2272113777  
0.2251612334  
0.223149024  
0.221172527  
0.2192217286  
0.2173062721  
0.2154142533  
0.2135589771  
0.2117279471  
0.2099290956  
0.2081545385  
0.2064034294  
0.2046849883  
0.2029963331  
0.2013291856  
0.1996862369  
0.1980633842  
0.1964711528  
0.1948996064  
0.1933508036  
0.1918306265  
0.1903256617  
0.1888442109  
0.1873878291  
0.185952424  
0.1845296706  
0.183134161  
0.1817571565  
0.1804016801  
0.1790669616  
0.1777441874  
0.1764449595  
0.1751627137  
0.1738957697  
0.1726481319  
0.1714217383  
0.1702040032  
0.169013785  
0.1678295126  
0.1666662664  
0.1655173225  
0.1643886099  
0.1632696831  
0.1621644029  
0.1610766471  
0.1600060314  
0.1589427026  
0.1579011399  
0.1568695775  
0.1558542097  
0.1548451917  
0.1538564345  
0.1528774563  
0.1519099253  
0.150956485  
0.1500167747  
0.1490901366  
0.148169146  
0.1472617797  
0.1463683456  
0.1454875173  
0.1446133409  
0.1437547803  
0.1429015551  
0.1420696918  
0.1412335196  
0.1404184374  
0.1396100642  
0.1388090557  
0.1380234406  
0.1372429625  
0.136474567  
0.1357156836  
0.1349634425  
0.1342222533  
0.1334880479  
0.1327684822  
0.1320494247  
0.1313462624  
0.1306434207  
0.1299521626  
0.1292759164  
0.1286019722  
0.1279340971  
0.1272773807  
0.1266296597  
0.1259896731  
0.1253514989  
0.1247246116  
0.1241074775  
0.1234951675  
0.1228907218  
0.1222912778  
0.1217010403  
0.1211167889  
0.1205365296  
0.1199674153  
0.1194047371  
0.1188481138  
0.1182957484  
0.1177494947  
0.1172123179  
0.1166812812  
0.1161538847  
0.1156307457  
0.1151192618  
0.1146069755  
0.1141076503  
0.1136076385  
0.1131188924  
0.1126327054  
0.1121518415  
0.1116763136  
0.1112072301  
0.1107425548  
0.110285751  
0.109833003  
0.1093808472  
0.1089387149  
0.1085004885  
0.1080699387  
0.1076385413  
0.1072117455  
0.1067970859  
0.1063835516  
0.1059690536  
0.1055651523  
0.105165646  
0.1047682154  
0.1043776261  
0.1039924455  
0.1036080941  
0.1032272356  
0.1028518327  
0.1024842133  
0.1021196287  
0.1017546811  
0.1014013821  
0.1010458385  
0.1006936009  
0.1003529954  
0.1000058735  
0.09966864257  
0.09933357499  
0.09900434517  
0.09867371035  
0.0983508615  
0.09803005251  
0.0977168706  
0.09740216675  
0.09709496224  
0.09679003042  
0.09649051115  
0.09619199402  
0.09589542042  
0.09560147994  
0.09531706523  
0.09503126673  
0.09474699712  
0.09447280521  
0.09419322661  
0.09392023871  
0.09365150411  
0.09338437507  
0.09312380695  
0.09286395672  
0.09260579232  
0.0923536584  
0.09210276355  
0.09185283481  
0.09161259994  
0.09136543353  
0.091127654  
0.09089068222  
0.09065876595  
0.09042717453  
0.09019709508  
0.08997322343  
0.08975325244  
0.0895320258  
0.089315527  
0.08909611908  
0.08888770034  
0.08868033473  
0.08847396353  
0.08826817978  
0.08806552783  
0.08786719326  
0.08766950939  
0.08747730479  
0.08728688443  
0.08709560537  
0.08691001357  
0.08672767726  
0.08654110635  
0.08636349284  
0.08618737807  
0.0860110897  
0.08583616216  
0.08567105893  
0.08549886706  
0.08533451173  
0.08517042841  
0.08501246307  
0.08485100379  
0.08469760168  
0.08454178471  
0.08439069819  
0.08423875662  
0.08408793012  
0.08394446959  
0.08380181225  
0.08365812311  
0.08352170869  
0.08338209308  
0.08324772446  
0.08311401261  
0.08298221675  
0.08285425078  
0.08272733426  
0.0826023165  
0.08247787776  
0.08235579845  
0.0822372676  
0.08212104544  
0.08200525905  
0.08189113852  
0.08177891158  
0.08167147174  
0.08156421588  
0.08146000754  
0.0813516513  
0.08124955041  
0.08115139111  
0.08105362236  
0.08095720424  
0.08086308426  
0.08076808862  
0.08068239603  
0.0805942306  
0.08050647109  
0.08041846412  
0.08033492699  
0.08025393394  
0.08017200408  
0.08009599374  
0.08001497667  
0.07994409842  
0.07987474774  
0.07979791981  
0.07973155962  
0.07966525021  
0.07959920138  
0.07953593307  
0.0794734577  
0.07941231593  
0.07935576353  
0.07929410024  
0.07924278643  
0.07918652413  
0.07913354719  
0.07908358962  
0.0790330605  
0.07898873635  
0.0789443753  
0.07890119189  
0.07885774455  
0.07881929543  
0.07877644558  
0.07874587381  
0.0787071486  
0.0786719228  
0.07864075628  
0.07861262145  
0.07858214287  
0.078555554  
0.07852941971  
0.0785081622  
0.07848294526  
0.07846264667  
0.07844683686  
0.07842912848  
0.0784171169  
0.07839951059  
0.0783887248  
0.07837487324  
0.07836802864  
0.07835919481  
0.0783545438  
0.07835167091  
0.078347077  
0.07834728187  
