375.5616171  
392.1595009  
422.930185  
484.2647038  
587.4240284  
1053.523638  
3639.530294  
33976.13084  
33301.72676  
48960.33677  
25594.34117  
23293.89003  
2442.706697  
17212.5808  
14317.81567  
7883.558431  
1358.849714  
20792.78352  
16113.45081  
1291.931659  
11750.87988  
1332.521437  
12351.68393  
11468.39936  
40330.72692  
12181.21919  
2858.834479  
40285.94823  
1332.505713  
6901.168555  
2466.516654  
104.7999693  
3250.780808  
3490.219381  
2344.541584  
51.80924418  
505.5866166  
439.9976492  
12370.58057  
6792.408572  
2869.445719  
1095.119969  
4508.935287  
4592.091364  
3080.057972  
520.0732034  
2021.159127  
3712.898467  
2964.733622  
9895.833712  
1231.763235  
4398.027635  
4111.008112  
612.1448927  
3995.995217  
1693.12013  
404.4830821  
1367.670215  
39.8089777  
4999.799967  
1193.549153  
413.2814254  
543.1666359  
22.57206382  
557.2759798  
137.8637916  
20.27928501  
103.243676  
136.4208482  
63.94327988  
49.25275901  
13.07874533  
10.51192678  
12.1009109  
5.348019115  
0.8124814775  
0.2034364992  
1.828111929  
2.473659016  
3.277385998  
1.545334621  
2.131503331  
2.434410053  
3.454693125  
1.872259591  
1.852209573  
2.579369321  
1.403313397  
1.672230875  
1.512899908  
1.495882852  
1.604002897  
1.695808888  
1.313696014  
1.285181664  
1.22655774  
1.13144777  
1.130371335  
1.095777049  
1.035788402  
1.00078192  
0.9376619837  
0.8971876415  
0.8614559313  
0.8281674177  
0.8000649719  
0.7540819593  
0.7324736914  
0.7009610049  
0.6802872461  
0.6492373377  
0.6204544894  
0.5985722987  
0.5733081833  
0.5560487175  
0.5347925234  
0.5136010033  
0.4959688156  
0.4793365272  
0.4620388493  
0.4459472182  
0.4310472121  
0.4158782997  
0.4023808401  
0.3886824522  
0.3755822063  
0.3636642157  
0.3520094993  
0.3410322839  
0.3301510466  
0.3198754792  
0.3101346281  
0.3006648195  
0.29162536  
0.2828208402  
0.2744149327  
0.2663836142  
0.2586701949  
0.2512639289  
0.2440842701  
0.2371906038  
0.2305720665  
0.2242209924  
0.2180709837  
0.2121257976  
0.2064125825  
0.2009190571  
0.1956174569  
0.1904706141  
0.1855427469  
0.1807600401  
0.1761320941  
0.1716869294  
0.167388146  
0.1632233533  
0.1592028337  
0.1553125845  
0.1515556652  
0.1479119311  
0.1443831595  
0.1409751126  
0.1376694343  
0.1344752854  
0.1313728681  
0.1283698497  
0.1254526317  
0.1226309714  
0.1198989319  
0.1172422022  
0.1146806896  
0.112171659  
0.1097547016  
0.1074016305  
0.1051124894  
0.1028959049  
0.1007434753  
0.09864132032  
0.0966164574  
0.09463420549  
0.0927172581  
0.09084459105  
0.08902576813  
0.08725572164  
0.08553612664  
0.08386691597  
0.0822390151  
0.0806598571  
0.07911635689  
0.07761839654  
0.07614583428  
0.07472375022  
0.07333734334  
0.0719869053  
0.07067186787  
0.06938852673  
0.06814476191  
0.0669192212  
0.06572749884  
0.06457236179  
0.06343723986  
0.06233181177  
0.06125862091  
0.0602081409  
0.05918405266  
0.05818136232  
0.05720571973  
0.05625107869  
0.055323769  
0.05441710597  
0.0535278803  
0.05266377256  
0.05181296332  
0.05098520543  
0.05017520881  
0.04938493845  
0.04861284552  
0.04785656798  
0.04711362442  
0.04639808419  
0.04568792683  
0.04499899463  
0.04432747859  
0.04366311576  
0.04301353578  
0.04238165549  
0.04175973486  
0.04115784285  
0.04056813664  
0.03998165007  
0.03941381322  
0.03885447246  
0.03831703624  
0.0377787095  
0.03725572752  
0.03674545803  
0.03624002757  
0.03575349257  
0.03526997376  
0.03479843298  
0.03433655665  
0.03388239369  
0.03343441208  
0.03300155534  
0.03257172576  
0.03215989606  
0.03174543493  
0.03134432773  
0.0309455458  
0.03055917858  
0.03017911583  
0.02981162772  
0.02944410127  
0.02908564306  
0.02873145622  
0.02838814372  
0.02804791537  
0.02771818869  
0.02739080029  
0.02707009105  
0.02675051083  
0.02644771506  
0.02614604587  
0.02584634017  
0.02555222216  
0.02526762233  
0.02498134192  
0.02470727165  
0.02443208044  
0.02416743646  
0.02390151229  
0.02364540147  
0.02339207881  
0.02314111865  
0.02289599457  
0.02265745359  
0.02241894344  
0.02218824667  
0.02196293947  
0.02173565496  
0.02151494514  
0.02129314911  
0.02108500653  
0.02087131601  
0.02066576504  
0.02046011403  
0.02026496356  
0.02006477684  
0.01987439554  
0.01968483791  
0.01949691159  
0.0193146264  
0.01913081558  
0.01895450482  
0.01878053099  
0.01860744175  
0.01843806264  
0.01826912871  
0.01810696566  
0.01794773152  
0.01778724461  
0.0176324512  
0.017475842  
0.01732513535  
0.01717551926  
0.01702658872  
0.01688588666  
0.01674151907  
0.01660109478  
0.01646482982  
0.01632762344  
0.01619306789  
0.01606214043  
0.01593271044  
0.01580579628  
0.01567727791  
0.01555443795  
0.01543492567  
0.01531451929  
0.01519400355  
0.01507611496  
0.01496245549  
0.01484739868  
0.01473829521  
0.01462546818  
0.01451924053  
0.01441183551  
0.01430600735  
0.01420441175  
0.01410102006  
0.01400160023  
0.0139028629  
0.01380415429  
0.01370545  
0.01361272222  
0.01351892007  
0.01342640439  
0.013338453  
0.01324691114  
0.01315710025  
0.01307102853  
0.01298585305  
0.01290211799  
0.01282141763  
0.01273742097  
0.01265444099  
0.01257442578  
0.01249871286  
0.01242047211  
0.01234238528  
0.01226905744  
0.01219369356  
0.01212094492  
0.0120505423  
0.01197801737  
0.01190934005  
0.0118386774  
0.01177159857  
0.01170240076  
0.01163728112  
0.01157223637  
0.01150825698  
0.01144556224  
0.01138138652  
0.01132109099  
0.0112603312  
0.01119963164  
0.01114032017  
0.01108276846  
0.01102405916  
0.01096869808  
0.01091556145  
0.01085732406  
0.01080057415  
0.01075202634  
0.0106996481  
0.01064663381  
0.01059311511  
0.01054241412  
0.01049472053  
0.01044482795  
0.01039501568  
0.01034926496  
0.01030128021  
0.01025606873  
0.01021071478  
0.01016576413  
0.0101212956  
0.0100804525  
0.01003313139  
0.00999195384  
0.009948552902  
0.009909194909  
0.009868556727  
0.009828617247  
0.009788197683  
0.009749277781  
0.00971216751  
0.009673870144  
0.00963704916  
0.009601357761  
0.009566655705  
0.009530298307  
0.009494361634  
0.009458813114  
0.009426605471  
0.009393400204  
0.009360739357  
0.009327631237  
0.009296947791  
0.009264931403  
0.00923256383  
0.009203851394  
0.009172489927  
0.00914494402  
0.009114890635  
0.009086673229  
0.009057972195  
0.009031496461  
0.009004249058  
0.008978292629  
0.008949852878  
0.008926866378  
0.008901422488  
0.008876273453  
0.008852354284  
0.008828826591  
0.00880506067  
0.008781517319  
0.008760220158  
0.00873510165  
0.0087153415  
0.008691882472  
0.008673258656  
0.008649635459  
0.008632362345  
0.008611476404  
0.008594258003  
0.008573461514  
0.008555658056  
0.008537497893  
0.008518366534  
0.008500872581  
0.008483012976  
0.008466689391  
0.008449661807  
0.00843303313  
0.008417460411  
0.008402834284  
0.00838979079  
0.008374250037  
0.008359097537  
0.008345775201  
0.008332436973  
0.008319367221  
0.008306521282  
0.008293390751  
0.008282406223  
0.008271051667  
0.008259453708  
0.00824831599  
0.008237628468  
0.008227935162  
0.008214658461  
0.008208208718  
0.008197228752  
0.008189319988  
0.008179944149  
0.00817274324  
0.008162034008  
0.00815430674  
0.008146216842  
0.008140723921  
0.00813472865  
0.008126772614  
0.008121132728  
0.008116738684  
0.00810937234  
0.008105128733  
0.008098240702  
0.008094314629  
0.008091030814  
0.00808668368  
0.0080847232  
0.008080653105  
0.008078259266  
0.008075463743  
0.00807276889  
0.008069856387  
0.008068656959  
0.008067801878  
0.008065392152  
0.008065405206  
0.008065121672  
0.008066619928  
