0.2019653982  
0.6963981279  
1.306855278  
0.1977326519  
137.616902  
4339.18663  
33613.54232  
127843.5928  
77254.90048  
36301.09424  
12307.18505  
12638.30012  
13619.89172  
2194.766261  
10569.65387  
25461.28541  
33826.43857  
8861.16788  
14025.43137  
2973.278911  
7447.722467  
9133.475878  
1201.880252  
3719.172728  
942.3739818  
6930.41008  
1853.889834  
1692.328726  
207.3118186  
2943.687246  
2753.656537  
3332.816659  
2936.315313  
926.5452865  
1665.881408  
1668.014499  
116.4731293  
2427.324883  
212.6995894  
482.7766175  
2424.831787  
388.334484  
689.5655703  
2.277373217  
4003.354747  
2576.071764  
1515.699035  
475.7018485  
1142.691018  
437.902192  
306.7219311  
78.05093161  
640.9559827  
848.9121205  
208.6560525  
601.7448028  
825.0458618  
10.40297901  
124.4504323  
38.6286751  
638.6182072  
472.3786641  
98.38041489  
45.01269509  
116.3008378  
12.60674274  
56.05079479  
83.34977277  
29.36492182  
19.31029353  
33.86415311  
6.013683931  
0.6462097826  
5.445157065  
6.874312272  
3.753409727  
1.361033193  
1.567708994  
3.852740537  
1.874123553  
1.304093268  
1.800347015  
1.456828868  
0.9906262457  
0.8277763692  
1.215667206  
0.9865795845  
0.8716017829  
1.01924824  
0.8295958359  
0.7817311833  
0.6926793722  
0.7052610705  
0.6764582148  
0.6156264635  
0.5851230022  
0.6040683194  
0.5460658464  
0.5045792437  
0.4809902783  
0.4666151705  
0.4357088272  
0.423864853  
0.3978525896  
0.3892970968  
0.3708139171  
0.3563284159  
0.3425295036  
0.329122671  
0.314699268  
0.3037921678  
0.2938149576  
0.2825143184  
0.27100059  
0.263024663  
0.2533413372  
0.2445379824  
0.2360567456  
0.2286650248  
0.2219718787  
0.2142043716  
0.2074036421  
0.2010753348  
0.1948775459  
0.1887989574  
0.1832899671  
0.1779953451  
0.1731199493  
0.168193084  
0.1634501578  
0.1591208499  
0.1547231544  
0.1505359667  
0.1466939517  
0.1428333024  
0.1391908185  
0.1357160818  
0.1323437533  
0.1290759925  
0.125964091  
0.122943236  
0.1200583187  
0.1172586192  
0.1145720947  
0.1119710078  
0.1094624992  
0.1070305663  
0.104695887  
0.1024377023  
0.1002383288  
0.09814224516  
0.09609126301  
0.09411135507  
0.09219874396  
0.09034194956  
0.08854630121  
0.0868039016  
0.08511640211  
0.0834835787  
0.08189547238  
0.08035873897  
0.07886592626  
0.07741481613  
0.07600228821  
0.07464136852  
0.07331438199  
0.07202131563  
0.07077052747  
0.06954809263  
0.0683661503  
0.06720732202  
0.06608618179  
0.06499199837  
0.06393019837  
0.0628980729  
0.06188690629  
0.06090699492  
0.05994891806  
0.05901456182  
0.05810787096  
0.05722049535  
0.05635682305  
0.05551501641  
0.0546881969  
0.05388718268  
0.05310867622  
0.05234097136  
0.05159359492  
0.05086945065  
0.05015518292  
0.04946071862  
0.04878239296  
0.04811489291  
0.04747003437  
0.0468306738  
0.04621343029  
0.04560568194  
0.04501255728  
0.04443498527  
0.04386877181  
0.04331399118  
0.0427697802  
0.04224003355  
0.04171871474  
0.04120788138  
0.04070837827  
0.04021972894  
0.03974152005  
0.03927488117  
0.03881295346  
0.03836552123  
0.0379232309  
0.03749080037  
0.03706911587  
0.03665333121  
0.03624639018  
0.03584590426  
0.03545293348  
0.03506986347  
0.03469366412  
0.03432430555  
0.03396244  
0.03360512297  
0.0332567534  
0.03291310006  
0.03257473364  
0.03224657956  
0.03192222353  
0.03160590285  
0.03129216618  
0.03098429412  
0.03068251941  
0.03038674236  
0.03009242169  
0.02980802553  
0.02952777452  
0.02925288633  
0.02897866843  
0.02871263901  
0.0284498027  
0.02819299078  
0.02793778691  
0.0276907777  
0.02744397294  
0.02720346099  
0.02696588972  
0.02673398484  
0.02650264171  
0.02627740653  
0.02605503058  
0.025835819  
0.0256216253  
0.02541046466  
0.02520071603  
0.02499776411  
0.02479467938  
0.02459532503  
0.02440181267  
0.02420812756  
0.02401897078  
0.02383368037  
0.02365127993  
0.02347010866  
0.02329006692  
0.0231151582  
0.02294205787  
0.02277213435  
0.02260547339  
0.02243972169  
0.02227499224  
0.02211638122  
0.02195879129  
0.02180104779  
0.02164882224  
0.02149680123  
0.02134732461  
0.02120222448  
0.02105867727  
0.02091523896  
0.02077306965  
0.0206345929  
0.02049892123  
0.02036417447  
0.02023161918  
0.02009843743  
0.01996912948  
0.01984228611  
0.01971755128  
0.01959297356  
0.01947064073  
0.01934990206  
0.01923244836  
0.01911491479  
0.01899917568  
0.01888620403  
0.01877179736  
0.01866071849  
0.0185507916  
0.01844252037  
0.01833663927  
0.01823102046  
0.01812781181  
0.01802493236  
0.01792268683  
0.01782477825  
0.01772484088  
0.0176279044  
0.01753264455  
0.01743802593  
0.0173437107  
0.01725342818  
0.01716089859  
0.01706987179  
0.01698093634  
0.01689426897  
0.01680842696  
0.01672258261  
0.01663852066  
0.01655366328  
0.01647333385  
0.01639165282  
0.01631151255  
0.01623245648  
0.01615503506  
0.01607700247  
0.01600169148  
0.01592664347  
0.01585155887  
0.01578022753  
0.01570782011  
0.01563613972  
0.01556492977  
0.01549578368  
0.01542516764  
0.01535864272  
0.01529222445  
0.01522486524  
0.01516088098  
0.01509494071  
0.01503058921  
0.01496863236  
0.01490660631  
0.01484514584  
0.01478531856  
0.01472347296  
0.01466379483  
0.01460841391  
0.01454962919  
0.01449186913  
0.01443434811  
0.01437987634  
0.01432326921  
0.01426997118  
0.01421635057  
0.01416442375  
0.01411063081  
0.01406098382  
0.01400856195  
0.01395882855  
0.01390818213  
0.01386011327  
0.01381033069  
0.01376372999  
0.01371722176  
0.01366750319  
0.01362440704  
0.01357685657  
0.01353299165  
0.01348818407  
0.01344398059  
0.01340152209  
0.01335708356  
0.01331597859  
0.01327369437  
0.01323324791  
0.01319265539  
0.0131533093  
0.01311313917  
0.01307344289  
0.01303441159  
0.01299807654  
0.01295800591  
0.01292115376  
0.01288562465  
0.01284890627  
0.01281262206  
0.01277733482  
0.01274222822  
0.01270988786  
0.0126738624  
0.01264261341  
0.01260815831  
0.01257711221  
0.0125446615  
0.01251339984  
0.01248190234  
0.01245059415  
0.01242125503  
0.01238955095  
0.01236147292  
0.01233077551  
0.01230229986  
0.0122738856  
0.01224673493  
0.01221826132  
0.01219101083  
0.01216589616  
0.01213848819  
0.01211350148  
0.01208721448  
0.01206208464  
0.01203715781  
0.01201277242  
0.01198841376  
0.01196475103  
0.01194148805  
0.01191709831  
0.01189569715  
0.01187289856  
0.01185182871  
0.01182990658  
0.01180818841  
0.01178748798  
0.01176695092  
0.01174585169  
0.01172616087  
0.01170589396  
0.01168894277  
0.01166931526  
0.01165070531  
0.01163101866  
0.01161552861  
0.01159573165  
0.01157947843  
0.0115631619  
0.01154528167  
0.01153004391  
0.01151317164  
0.01149750918  
0.01148317694  
0.01146649882  
0.01145209528  
0.0114377799  
0.01142430168  
0.011410112  
0.01139653388  
0.01138265268  
0.01137054428  
0.01135793991  
0.0113468082  
0.01133425686  
0.01132144894  
0.01131142706  
0.01129977289  
0.01128788711  
0.01127860703  
0.0112677426  
0.01125646209  
0.0112456925  
0.0112395008  
0.0112289534  
0.01122058088  
0.0112118536  
0.01120334533  
0.01119495058  
0.01118904643  
0.01118015792  
0.01117357214  
0.01116812382  
0.01115983881  
0.01115353153  
0.0111464027  
0.01114187101  
0.01113602519  
0.01113113524  
0.01112682621  
0.01112163733  
0.01111605737  
0.0111131406  
0.0111085692  
0.01110509185  
0.01110058432  
0.0110981326  
0.01109436924  
0.01109276254  
0.01109088859  
0.01108953967  
0.01108786652  
0.01108566888  
0.01108448849  
0.01108376561  
0.01108307  
0.01108290962  
0.01108298283  
