33.89901131  
34.125502  
37.02772153  
57.79055156  
258.4952752  
4048.755066  
8511.297428  
8052.125405  
37683.68663  
33666.56062  
36287.79672  
43300.58705  
28495.50835  
6310.767964  
20691.75172  
23620.74336  
45757.37116  
7238.329003  
8678.141969  
13641.35848  
7608.904679  
4884.958214  
25511.11042  
9292.617965  
3032.467326  
9358.340503  
7274.346918  
2729.549787  
2623.040283  
2395.951716  
1028.305743  
765.49464  
6319.718425  
68.10882705  
2549.975372  
2842.93082  
10597.26614  
1216.058525  
153.7078032  
1287.372445  
3474.443527  
391.0354561  
7639.167788  
815.9574707  
9872.243869  
2493.913784  
2087.658085  
7590.759213  
5152.707098  
1511.536505  
138.8632086  
3058.813075  
5934.582516  
37.45659433  
53.80305876  
187.7748037  
2238.223862  
1272.625078  
288.3316153  
184.6903552  
1756.350679  
72.23706364  
618.4853083  
1342.614097  
510.4525523  
51.70848098  
215.7234001  
340.878657  
115.6244192  
38.79326298  
40.87322648  
58.69101956  
3.242696311  
15.01549821  
3.972933205  
6.580859538  
3.704843624  
1.325885632  
0.154252308  
0.8537459783  
2.770438472  
0.7273998363  
0.853183718  
0.1077898051  
0.1132421599  
0.1837456317  
0.1576661931  
0.192606042  
0.2377210427  
0.1639446112  
0.09626569713  
0.1239410305  
0.09804209157  
0.0764350086  
0.1000310873  
0.09108295997  
0.08848021274  
0.08404048953  
0.07436019455  
0.06264942588  
0.05866890159  
0.05571229689  
0.05982870727  
0.05600817827  
0.05536623829  
0.0518126045  
0.05053131781  
0.04658937141  
0.04500311999  
0.04424548075  
0.04176924529  
0.04049959683  
0.03922211967  
0.03841382946  
0.03666515607  
0.0348932867  
0.03404487505  
0.03309593842  
0.03268591877  
0.03196892914  
0.03093130162  
0.02997985586  
0.02917775497  
0.02826868093  
0.02765526953  
0.02691641586  
0.02629884535  
0.02574202245  
0.02507455393  
0.02449983451  
0.02394736302  
0.02340432997  
0.0228992148  
0.02242317965  
0.02197774113  
0.02152466459  
0.02108161286  
0.02068051668  
0.02025955942  
0.01987457448  
0.01948793808  
0.01912599449  
0.01877811289  
0.01843840348  
0.01811077638  
0.01779038531  
0.01748255231  
0.0171820482  
0.01689096235  
0.01660801627  
0.01633930321  
0.01607467263  
0.0158152144  
0.01556473074  
0.01532166206  
0.01508497213  
0.014852729  
0.01462937119  
0.01441204364  
0.01420035807  
0.01399336507  
0.01379379181  
0.01359632001  
0.01340349553  
0.01321758922  
0.01303520551  
0.01285773722  
0.01268606931  
0.01251663064  
0.01235011014  
0.0121888101  
0.01203258582  
0.01187826979  
0.01172891305  
0.01157997906  
0.01143592897  
0.01129707725  
0.0111597953  
0.01102388275  
0.01089235296  
0.01076281283  
0.01063797176  
0.01051397472  
0.01039302731  
0.01027502312  
0.0101577263  
0.01004456529  
0.009933061249  
0.00982323789  
0.009716320481  
0.00961208203  
0.009507786958  
0.009407796348  
0.009308098572  
0.009211118947  
0.009116312791  
0.009022876059  
0.00893083593  
0.008840712643  
0.008751342324  
0.008665058477  
0.008578976593  
0.00849485368  
0.008413518333  
0.008333339828  
0.008254101525  
0.008175355656  
0.008097456374  
0.008022365707  
0.007948675527  
0.007875555394  
0.007805551344  
0.00773483278  
0.007664549079  
0.00759633797  
0.007530361778  
0.007464180868  
0.007399553732  
0.007334437819  
0.007273273824  
0.007210248409  
0.007150796247  
0.007089786388  
0.007030510196  
0.00697297526  
0.006917346233  
0.006860311921  
0.006804953004  
0.006750154344  
0.006697826789  
0.006643880047  
0.006592451996  
0.006541311089  
0.006490714136  
0.006441521717  
0.006391809285  
0.006344789676  
0.00629704309  
0.006249269167  
0.006203640481  
0.00615793367  
0.006113541808  
0.006069292265  
0.006026410256  
0.005983539167  
0.005940339442  
0.005898949846  
0.00585704079  
0.005818420328  
0.005777217796  
0.005737331404  
0.005698839837  
0.00566083078  
0.005622888119  
0.00558533245  
0.005548642859  
0.005512407121  
0.00547734818  
0.005441419545  
0.005406190095  
0.005372350948  
0.005338230436  
0.005305017703  
0.005272055275  
0.005239421661  
0.005207256144  
0.005175240788  
0.005144204264  
0.005112584715  
0.005082628265  
0.005052544576  
0.005022411173  
0.00499196653  
0.004964580241  
0.004935538075  
0.004905972987  
0.004879173274  
0.004850481243  
0.004823690211  
0.004797059864  
0.004769599481  
0.004744404283  
0.004717554368  
0.004693301672  
0.004667873225  
0.004642589904  
0.004617844798  
0.004593743919  
0.004569437059  
0.004545657071  
0.004522598184  
0.004498919809  
0.004475890535  
0.004453693562  
0.004431165697  
0.004408964064  
0.004387095804  
0.004365599439  
0.004344633962  
0.004323193456  
0.004302670034  
0.004281885302  
0.004261312903  
0.00424087093  
0.004221634675  
0.004201907845  
0.004182640335  
0.004163698413  
0.004144210865  
0.004124757423  
0.004107364022  
0.004088630141  
0.004070943178  
0.004053316802  
0.00403509148  
0.004018044212  
0.004001342764  
0.003984143623  
0.003967123046  
0.003950278902  
0.003932852598  
0.003917643104  
0.003901212189  
0.003885629595  
0.003869569564  
0.003853931417  
0.003839351375  
0.003823977121  
0.00380899107  
0.003794552186  
0.00377918312  
0.003764632028  
0.003749560734  
0.003735857248  
0.003722037637  
0.003709096862  
0.003694918206  
0.003681666842  
0.003667584097  
0.0036543022  
0.003641198357  
0.003628312452  
0.003615714522  
0.003603379252  
0.003590351834  
0.003577967276  
0.003566664185  
0.00355409461  
0.00354224643  
0.003530315651  
0.003518593385  
0.003507255866  
0.003495880741  
0.003484708858  
0.003473670037  
0.003462207682  
0.003451590998  
0.003441299083  
0.003430252797  
0.00341971356  
0.003409347424  
0.003399238528  
0.003388317346  
0.003378749196  
0.003368994954  
0.003358657001  
0.003349479547  
0.003340148194  
0.003330471705  
0.003320969996  
0.003311942587  
0.003302586014  
0.003293417962  
0.003284830453  
0.003276361775  
0.003267074412  
0.003258985295  
0.003250170237  
0.003242405441  
0.003234737225  
0.003225877589  
0.003218164758  
0.003209746903  
0.003201383401  
0.003193809838  
0.003185586549  
0.003178646746  
0.003171555042  
0.003163743144  
0.003156787581  
0.003149651083  
0.003142226053  
0.00313511605  
0.003128572876  
0.003121398176  
0.003113996945  
0.003108220834  
0.003101380374  
0.003094084327  
0.003088534265  
0.003082240472  
0.003076509373  
0.003069789247  
0.003064091446  
0.003057852351  
0.003052135035  
0.003046236717  
0.003040190221  
0.003034720264  
0.003028933878  
0.003023044603  
0.003017893475  
0.003013386582  
0.003007686148  
0.003002467719  
0.002996312475  
0.002992447785  
0.002987686021  
0.00298219606  
0.002977687975  
0.002973040442  
0.002968033623  
0.002963622222  
0.002959317527  
0.002954490479  
0.002950710031  
0.00294540228  
0.002941502627  
0.002938127087  
0.002933392298  
0.002929865576  
0.002926109897  
0.002921242089  
0.00291809138  
0.002914343245  
0.002910616795  
0.002906783386  
0.002903232628  
0.002899799557  
0.002896438284  
0.00289383904  
0.002890372012  
0.002886659486  
0.002883515541  
0.002880605174  
0.002877574376  
0.002874828196  
0.002871611996  
0.002869140353  
0.002866296934  
0.002863732181  
0.002861485951  
0.002858622419  
0.002856314161  
0.002853917064  
0.002851612373  
0.00284901844  
0.002847373545  
0.002844956069  
0.002842392277  
0.002840892465  
0.002838702187  
0.002837088402  
0.002835088255  
0.002833276585  
0.002831803398  
0.00283027656  
0.002827992351  
0.002826396123  
0.00282517863  
0.002824125653  
0.002822744341  
0.002821809336  
0.002819995481  
0.002818729782  
0.002817565735  
0.002816676366  
0.002816030614  
0.002814859179  
0.002813714494  
0.002812773656  
0.002812417872  
0.002811816033  
0.002811204497  
0.002810391644  
0.002809830176  
0.0028097728  
0.002808817332  
0.002808463852  
0.002808091363  
0.002808665905  
0.002807888192  
0.0028088773  
0.002808113897  
