46.13977517  
57.41972904  
80.92917291  
128.3532841  
474.2074375  
4889.940399  
10208.39895  
11220.59118  
37144.19156  
5337.006365  
44254.41528  
34913.87437  
45236.40535  
15831.75735  
13464.66508  
23128.6157  
7961.275558  
47.67121271  
13238.81099  
7606.97186  
710.2446789  
7259.256036  
10593.44687  
3675.984507  
7011.195283  
3248.671748  
1050.261451  
5348.001535  
138.4358503  
20823.53155  
5560.694223  
1047.1778  
6324.134384  
22403.64858  
8481.031617  
5372.902129  
8226.640471  
299.282891  
15602.95485  
17718.1303  
3310.571332  
16258.23183  
3342.252352  
399.6826466  
1986.591823  
4862.159338  
2720.636064  
4359.00114  
3932.68436  
763.1560264  
884.0882838  
3846.771154  
1451.90315  
2665.794688  
3228.37351  
199.47908  
915.644265  
274.0917837  
817.5437745  
741.401056  
2047.517559  
747.6233463  
124.5449534  
423.1898721  
329.5993066  
13.80029628  
354.2112956  
151.4502558  
24.74832909  
11.29187153  
13.67192833  
15.533572  
9.870877245  
18.45012342  
5.84737023  
7.901723672  
4.661493184  
16.93423648  
5.719981557  
5.951183317  
6.906419631  
5.03650696  
4.705641713  
3.745388901  
4.203669563  
3.84346333  
3.433395125  
3.197798829  
2.975126863  
2.926738971  
2.642735793  
2.384764859  
2.249343999  
2.175103596  
2.027468116  
1.960333313  
1.854249198  
1.747977484  
1.661097232  
1.580300216  
1.495751029  
1.441930461  
1.363979173  
1.315503633  
1.256603145  
1.192320398  
1.147681043  
1.103532809  
1.058375246  
1.009318217  
0.9722108517  
0.9362134974  
0.8984840002  
0.8643950485  
0.8331787802  
0.802454277  
0.7746920254  
0.7481209254  
0.7213822751  
0.6962149473  
0.6727328174  
0.6500222376  
0.6295106676  
0.6089818627  
0.589701743  
0.5711779054  
0.5533751084  
0.5366424943  
0.520643686  
0.5052142532  
0.4904130398  
0.4761239604  
0.4624898658  
0.4495904849  
0.4370877862  
0.4251237041  
0.4136354407  
0.4025787019  
0.3919278854  
0.3817150705  
0.3718826578  
0.3624530814  
0.3533362327  
0.3445420682  
0.3361046564  
0.3279534593  
0.3201026826  
0.312511881  
0.3051937062  
0.29813062  
0.2913035689  
0.284716796  
0.2783497694  
0.2721846143  
0.2662304298  
0.2604687922  
0.2548876128  
0.2494935645  
0.2442663088  
0.2392001112  
0.2342969862  
0.2295425539  
0.2249295464  
0.2204649405  
0.2161309904  
0.2119214762  
0.2078488485  
0.2038817187  
0.200028715  
0.1962938297  
0.192662327  
0.189135302  
0.1857080222  
0.1823798376  
0.1791330321  
0.1759811527  
0.1729162146  
0.1699301738  
0.1670295777  
0.1641960257  
0.1614453235  
0.1587596375  
0.1561521495  
0.1536076547  
0.1511232557  
0.1487047777  
0.1463528582  
0.1440546459  
0.141813265  
0.1396327113  
0.1374929173  
0.1354137394  
0.1333797629  
0.1313986892  
0.1294675308  
0.1275723274  
0.1257319861  
0.123931691  
0.1221645746  
0.1204460428  
0.1187651136  
0.1171185464  
0.1155129054  
0.1139422409  
0.1124049849  
0.110907393  
0.109436955  
0.1079989543  
0.106587403  
0.1052143337  
0.1038667112  
0.1025416329  
0.1012549262  
0.09998847125  
0.0987540818  
0.09753947363  
0.09635350832  
0.09519578631  
0.0940495146  
0.09293186053  
0.09184226194  
0.09077232539  
0.08971745506  
0.08868442762  
0.0876776016  
0.08668146022  
0.08571725988  
0.08476122056  
0.0838257408  
0.08290669117  
0.08201052759  
0.08112760071  
0.08026128382  
0.07941036833  
0.07857326576  
0.07775193204  
0.07695481541  
0.07616476208  
0.07538621965  
0.07462476363  
0.07388021333  
0.07314372578  
0.07242717032  
0.07171707516  
0.07101965294  
0.07033902156  
0.06966073636  
0.06899932241  
0.06835043369  
0.06771558145  
0.06708634179  
0.06647121174  
0.06586229471  
0.06527195013  
0.06468509464  
0.06410454558  
0.06353811539  
0.06298116863  
0.06243379356  
0.06189366259  
0.0613606497  
0.06083996477  
0.06032728637  
0.05982469063  
0.05932973825  
0.05882932067  
0.0583506443  
0.05787985868  
0.0574108732  
0.05695293782  
0.05650079034  
0.05605492451  
0.0556187135  
0.05518631425  
0.05476004739  
0.05434561488  
0.05393215499  
0.05352378008  
0.05312425021  
0.05273074076  
0.05234432061  
0.05196219917  
0.05158491912  
0.05121352227  
0.0508506813  
0.0504886746  
0.05013306452  
0.04978473337  
0.04943674666  
0.04910040469  
0.04876167883  
0.04843648462  
0.04810832286  
0.04779099865  
0.0474720601  
0.04716195219  
0.04685572016  
0.04655258193  
0.04625329497  
0.04595905412  
0.04566554447  
0.04538369926  
0.04510057667  
0.0448219411  
0.04454943427  
0.04427743034  
0.0440084311  
0.04375016791  
0.04348773969  
0.04323047988  
0.04298000307  
0.04273195659  
0.0424871736  
0.04223955072  
0.04200145405  
0.04176469555  
0.04153594353  
0.0413048232  
0.04107646664  
0.04085599444  
0.04062996522  
0.04041526008  
0.04019937573  
0.03998810542  
0.03977521601  
0.03957433259  
0.03936936551  
0.03916763242  
0.03896794124  
0.03877087683  
0.0385782014  
0.03838730213  
0.03820065951  
0.03801464407  
0.03782936184  
0.03765104528  
0.03747251876  
0.03729391284  
0.03712202893  
0.03694901031  
0.03677863933  
0.03661209872  
0.0364470601  
0.03628509802  
0.03612373346  
0.03596093194  
0.03580536944  
0.03565081332  
0.0354981741  
0.0353484831  
0.03519819728  
0.03505072128  
0.03490518721  
0.03476087656  
0.0346204632  
0.03448026919  
0.03434070536  
0.03420407599  
0.03407348824  
0.03393843794  
0.03380783655  
0.03367896836  
0.03354909273  
0.03342433644  
0.03329871947  
0.03317743928  
0.03305796246  
0.03293503513  
0.03281698362  
0.03270145725  
0.03258756149  
0.03247324105  
0.03236011255  
0.03224978387  
0.03214228599  
0.03203351941  
0.03192811701  
0.03182284225  
0.03171788105  
0.03161690451  
0.03151835185  
0.03141371731  
0.03131838452  
0.03122066266  
0.0311239375  
0.03102995462  
0.03093628016  
0.03084508075  
0.03075141133  
0.03066543438  
0.03057545192  
0.0304904161  
0.03040327317  
0.03031975473  
0.03023615595  
0.03015439456  
0.03007145594  
0.02999041482  
0.02991344294  
0.02983548228  
0.02975706  
0.02968188953  
0.0296093011  
0.02953522968  
0.02946255036  
0.02939051662  
0.0293190112  
0.02925355724  
0.02918186958  
0.02911518564  
0.02904993017  
0.02898517814  
0.02892139563  
0.02885692858  
0.02879524622  
0.02873546122  
0.02867325384  
0.02861373018  
0.02855489238  
0.0284966851  
0.02844338037  
0.02838561371  
0.02832933886  
0.02827841264  
0.02822452513  
0.02817268077  
0.02812195982  
0.02806814505  
0.02802086306  
0.02797300023  
0.02792549126  
0.02787788249  
0.0278347166  
0.02778690669  
0.02774519388  
0.02770225916  
0.02765646779  
0.02761704677  
0.02757538832  
0.02753545547  
0.02749653913  
0.02745935573  
0.0274194118  
0.02738504044  
0.0273473232  
0.02731036311  
0.02727854943  
0.02724359416  
0.02721060926  
0.02717723481  
0.0271482618  
0.02711689719  
0.02708794401  
0.02705898422  
0.02703052141  
0.02700186372  
0.02697485075  
0.02694963496  
0.02692385999  
0.02689864378  
0.02687344279  
0.02685345904  
0.02683018438  
0.02680795415  
0.02678687776  
0.02676771188  
0.0267454184  
0.02673019796  
0.02671003228  
0.02669416524  
0.02667667582  
0.02666127069  
0.02664702875  
0.02663161759  
0.02661803627  
0.02660674671  
0.02659463133  
0.0265831285  
0.02657099465  
0.02656132884  
0.02655137694  
0.02654319992  
0.02653597265  
0.02652558609  
0.02651981007  
0.02651558267  
0.02651112283  
0.02650535376  
0.02650042266  
0.02649605793  
0.02649598699  
0.02649652089  
0.0264946913  
0.02649194184  
