-0.2391142785  
-1.114996416  
-1.941960974  
-2.677577  
-3.286063963  
-3.740553058  
-4.024547181  
-4.132506878  
-4.069596966  
-3.850685076  
-3.498778138  
-3.0430591  
-2.516722184  
-1.954749909  
-1.391752654  
-0.8599685663  
-0.3874797944  
0.003284211408  
0.2967094334  
0.4847514711  
0.5672160138  
0.5515202096  
0.4518984415  
0.2880719238  
0.08345668706  
-0.1369569335  
-0.3488686227  
-0.5308522125  
-0.6662263724  
-0.7444087711  
-0.7615965308  
-0.7206958146  
-0.6305116384  
-0.5043216066  
-0.3579946268  
-0.207917797  
-0.06896828175  
0.04720603061  
0.1334265015  
0.1875892033  
0.2126214815  
0.2157992075  
0.2075541181  
0.1999181985  
0.2048036678  
0.2323246469  
0.2893459031  
0.3784205212  
0.4972423554  
0.638676513  
0.791375832  
0.9409398265  
1.071495326  
1.167542808  
1.215870444  
1.207307857  
1.138103516  
1.01074211  
0.8340560374  
0.6225851967  
0.3952213128  
0.1732592997  
-0.02191655964  
-0.1712368628  
-0.2601316503  
-0.2802047495  
-0.2301795705  
-0.1159673729  
0.05014298003  
0.2510582843  
0.4669987001  
0.6778452469  
0.8653948498  
1.015205311  
1.117795409  
1.169077392  
1.170018164  
1.125660481  
1.043718017  
0.9330300303  
0.8021378798  
0.6582240905  
0.5065474133  
0.3504086135  
0.1915779529  
0.03101616365  
-0.1302982795  
-0.2906588189  
-0.4471907389  
-0.5957855207  
-0.7314050262  
-0.8486976379  
-0.9427690614  
-1.009959204  
-1.048458784  
-1.058652937  
-1.04313384  
-1.006399188  
-0.9543135581  
-0.8934328972  
-0.8303291735  
-0.7710102934  
-0.7204992072  
-0.6825822243  
-0.6597044385  
-0.6529400165  
-0.6619709994  
-0.6850233799  
-0.7187585908  
-0.7581302496  
-0.7963106695  
-0.8247643239  
-0.8335828353  
-0.8121355505  
-0.7500580506  
-0.6384968977  
-0.4714821242  
-0.2472180104  
0.03093370702  
0.3540024652  
0.7076410554  
1.073114624  
1.428987704  
1.753333149  
2.026176749  
2.231842126  
2.36082861  
2.41092945  
2.387386731  
2.302025061  
2.171473938  
2.014729472  
1.85041563  
1.694162578  
1.556518191  
1.441693537  
1.347367659  
1.265554483  
1.184397457  
1.090598003  
0.9720850715  
0.820486056  
0.6329975746  
0.413356733  
0.1717310235  
-0.07644632352  
-0.31254038  
-0.5173560851  
-0.6739556114  
-0.7702290575  
-0.800823812  
-0.7681392972  
-0.6822411235  
-0.5596907207  
-0.4214666195  
-0.2902585688  
-0.1875220394  
-0.1307012298  
-0.1309940017  
-0.1919699256  
-0.3092180769  
-0.4710553679  
-0.6601951282  
-0.8561392976  
-1.037960588  
-1.187097482  
-1.289788149  
-1.338827165  
-1.334410079  
-1.283979177  
-1.201101963  
-1.103552023  
-1.010859742  
-0.941678935  
-0.9113057637  
-0.9296866003  
-1.000153335  
-1.119021291  
-1.276094335  
-1.45595003  
-1.639837171  
-1.807896433  
-1.94142456  
-2.024871218  
-2.047345113  
-2.003463154  
-1.893468481  
-1.722678863  
-1.500377112  
-1.238388391  
-0.9495528284  
-0.646357328  
-0.3399357389  
-0.03953096512  
0.2475325022  
0.5154495163  
0.7592677448  
0.974167827  
1.154898135  
1.295558104  
1.389824088  
1.431641267  
1.416260266  
1.341472689  
1.208767367  
1.02419497  
0.798721429  
0.5479380957  
0.291103471  
0.04960245581  
-0.1549929609  
-0.3030307814  
-0.3787440984  
-0.3718456723  
-0.2785265394  
-0.1017421692  
0.1492245877  
0.4598510407  
0.8119413757  
1.185455657  
1.560359168  
1.918272168  
2.243733087  
2.524982196  
2.754214326  
2.927355352  
3.043456384  
3.10385224  
3.111242843  
3.068842811  
2.979732346  
2.846475093  
2.671046648  
2.45504325  
2.200111041  
1.908494606  
1.583593544  
1.230412382  
0.8558007547  
0.4684310004  
0.07848285705  
-0.3029424006  
-0.6646051469  
-0.9960014332  
-1.288221272  
-1.534651812  
-1.731439412  
-1.877639744  
-1.975042068  
-2.027696787  
-2.041233359  
-2.022058331  
-1.9765633  
-1.910447768  
-1.828232014  
-1.733033559  
-1.626591793  
-1.509536115  
-1.381842482  
-1.24339461  
-1.094576385  
-0.9368140014  
-0.7729770287  
-0.6075929074  
-0.4468220991  
-0.2981697745  
-0.1699435947  
-0.07050148782  
-0.007334528564  
0.01390428571  
-0.009668605405  
-0.07741052357  
-0.1846682889  
-0.3226699228  
-0.4788453303  
-0.6375989561  
-0.7814805307  
-0.8926705319  
-0.9546499982  
-0.9538656108  
-0.8812293699  
-0.7332670979  
-0.5127695997  
-0.2288524396  
0.1036131414  
0.465161213  
0.8333802804  
1.184887075  
1.49741942  
1.751807286  
1.93362496  
2.034320394  
2.051712138  
1.989810834  
1.858003923  
1.669732876  
1.440844439  
1.187840468  
0.9262556546  
0.6693515892  
0.4272744416  
0.2067293372  
0.0111620954  
-0.1586576584  
-0.3037940782  
-0.4262327702  
-0.5280649795  
-0.6109154927  
-0.6757008343  
-0.7227299704  
-0.7520862988  
-0.7641821246  
-0.7603317404  
-0.743178733  
-0.7168470422  
-0.6867369905  
-0.6589512805  
-0.6394280665  
-0.632910833  
-0.6419480475  
-0.6661203515  
-0.7016795685  
-0.7417218464  
-0.7769283513  
-0.7968215834  
-0.7913757741  
-0.7527411088  
-0.6768285214  
-0.5644628452  
-0.4218952415  
-0.2605435172  
-0.09593332207  
0.05404305786  
0.1713608959  
0.2402710457  
0.2495820846  
0.1944780206  
0.07761890532  
-0.09065277201  
-0.293063997  
-0.5070486614  
-0.7071079051  
-0.8676112203  
-0.9657152316  
-0.9840442338  
-0.9127958514  
-0.7510036112  
-0.5067772348  
-0.1964811014  
0.1570799755  
0.5272446515  
0.8865328244  
1.209741649  
1.476698385  
1.674301707  
1.797582441  
1.84963808  
1.840488376  
1.785034306  
1.700440238  
1.603365808  
1.507464561  
1.421542029  
1.348627489  
1.286084808  
1.226692219  
1.160472423  
1.07693407  
0.967339993  
0.8266034584  
0.6545216118  
0.4561644899  
0.2413865013  
0.02358239379  
-0.1820833717  
-0.3606607403  
-0.4993105348  
-0.5888320339  
-0.6246312534  
-0.6070550993  
-0.5411155933  
-0.435718966  
-0.3025860617  
-0.1550341621  
-0.006820459941  
0.1288705042  
0.2401956037  
0.3172312291  
0.3523676346  
0.3406192143  
0.2798976814  
0.1712741999  
0.01921306917  
-0.168296074  
-0.3798003097  
-0.6007606656  
-0.8143076011  
-1.002416843  
-1.147449297  
-1.233920825  
-1.250303595  
-1.190602686  
-1.055458059  
-0.8525751635  
-0.5963374585  
-0.3066086874  
-0.006830252127  
0.2783600779  
0.52568165  
0.715597937  
0.8342351993  
0.874580488  
0.8368550596  
0.7280528827  
0.5607670356  
0.3515409242  
0.1189851239  
-0.1180516387  
-0.3420610483  
-0.5380396875  
-0.694191438  
-0.8022032846  
-0.8571825777  
-0.8573751016  
-0.8038116643  
-0.6999542726  
-0.551425413  
-0.3657976619  
-0.1524184713  
0.07780636539  
0.3127316119  
0.5394487375  
0.744936165  
0.9168480166  
1.044377584  
1.11909723  
1.135677119  
1.092374669  
0.9912478409  
0.8380492127  
0.6418234679  
0.4142599674  
0.1688526998  
-0.08001421516  
-0.3180128801  
-0.5317456479  
-0.7095223128  
-0.8419911214  
-0.9226184227  
-0.9480025424  
-0.9180313988  
-0.8358697973  
-0.707788285  
-0.5428165642  
-0.3522370393  
-0.1489172569  
0.05349082605  
0.2414370674  
0.4024010356  
0.5257743552  
0.6036328175  
0.6313119885  
0.6077350733  
0.5354446104  
0.4203385438  
0.2711282942  
0.09857828874  
-0.0853996311  
-0.2686914063  
-0.4398803101  
-0.5890102108  
-0.7081443641  
-0.7916874124  
-0.8364667491  
-0.8416004173  
-0.8081957763  
-0.738961616  
-0.6377856418  
-0.5093517121  
-0.3588357337  
-0.1916892122  
-0.01351686125  
0.170003468  
0.3531854574  
0.530431316  
0.6963942039  
0.8461944821  
0.9756860152  
1.081694466  
1.162204992  
1.216399055  
1.244534826  
1.247658946  
1.227183219  
1.184419291  
1.120167241  
1.034472473  
0.9266360979  
0.7955205985  
0.6401373529  
0.4604216775  
0.2580590922  
0.03719565726  
-0.1951552518  
-0.4291308861  
-0.6525405293  
-0.8518827283  
-1.013732019  
-1.126334532  
-1.181162896  
-1.174194299  
-1.106695918  
-0.9853659899  
-0.8217965334  
-0.6312813557  
-0.4311543516  
-0.2388568412  
-0.07001120796  
0.06323805755  
0.1533982008  
0.1981664186  
0.2003054927  
0.1668707686  
0.107974209  
0.03526194319  
-0.03964836506  
-0.1065454873  
-0.157632956  
-0.1880684158  
-0.195998633  
-0.1821561922  
-0.1491422444  
-0.1005715212  
-0.04023305138  
0.0285519041  
0.1033184  
0.1825141445  
0.2653015218  
0.3511477842  
0.439352063  
0.5285987163  
0.6166539317  
0.7002522585  
0.7751929581  
0.8366111113  
0.8793654309  
0.8984690212  
0.8895001662  
0.8489411002  
0.7744299529  
0.664942366  
0.5209233154  
0.3444107848  
0.1391646272  
-0.08918628714  
-0.3330236775  
-0.5826879628  
-0.8265829242  
-1.051501491  
-1.243237972  
-1.387486171  
-1.471014354  
-1.482986055  
-1.416317217  
-1.268853789  
-1.04420147  
-0.7520272091  
-0.4077198237  
-0.03138819423  
0.3537600629  
0.7234792374  
1.054762547  
1.328052231  
1.529078503  
1.650086325  
1.690272434  
1.655367313  
1.556435369  
1.408054048  
1.226170744  
1.025950688  
0.8199482234  
0.6168669346  
0.4210991724  
0.233066137  
0.05029135104  
-0.1310222774  
-0.3141951783  
-0.5003944634  
-0.6873727558  
-0.8688713173  
-1.034802999  
-1.172213079  
-1.266877758  
-1.305318848  
-1.276913828  
-1.175778865  
-1.002143679  
-0.7629948715  
-0.4718696751  
-0.1478242168  
0.1863161319  
0.5061876205  
0.7883259033  
1.012508404  
1.163721696  
1.233523406  
1.220681572  
1.131027993  
0.9766086015  
0.7742343086  
0.543645942  
0.3055000826  
0.07940322144  
-0.1178165153  
-0.2734325048  
-0.3796445334  
-0.4338369477  
-0.4383007708  
-0.3994768233  
-0.3268261359  
-0.2314801841  
-0.1248427791  
-0.01730557392  
0.08276832186  
0.1696641785  
0.2404968294  
0.2949354398  
0.3345559008  
0.3619343682  
0.3796671209  
0.3894862961  
0.3916431646  
0.384683465  
0.3656582151  
0.3307420528  
0.2761380529  
0.1991046346  
0.09888705754  
-0.02263843274  
-0.1607550588  
-0.3082094509  
-0.4559875142  
-0.5944552886  
-0.7146520201  
-0.8095072409  
-0.8747495175  
-0.9093381363  
-0.9153318415  
-0.8972227973  
-0.860872397  
-0.812254116  
-0.7562531246  
-0.69575987  
-0.6312194064  
-0.5607362664  
-0.4806882966  
-0.3867382097  
-0.2750501797  
-0.1434602601  
0.007588337096  
0.1745401997  
0.3507266979  
0.526870028  
0.6920202217  
0.8347625381  
0.9445228788  
1.012788591  
1.034090646  
1.006640526  
0.9325619809  
0.8177361485  
0.6712800898  
0.5047440233  
0.3310992137  
0.1636100258  
0.0146745592  
-0.1052760843  
-0.1887396796  
-0.2318665256  
-0.2348776581  
-0.2021086408  
-0.1416347426  
-0.06449891809  
0.01642542542  
0.08781059113  
0.1373543288  
0.1551878783  
0.1350331938  
0.0749631598  
-0.02234188015  
-0.1498687877  
-0.2970532015  
-0.450955951  
-0.5976906268  
-0.7239209474  
-0.8182505938  
-0.8723462581  
-0.8816852137  
-0.8458579181  
-0.7684319269  
-0.6564065178  
-0.51934991  
-0.3683386214  
-0.2147943561  
-0.06936435161  
0.05906793183  
0.1641488036  
0.2425462198  
0.2941215368  
0.3217906501  
0.3310769922  
0.3294080887  
0.3252060267  
0.326858048  
0.3416573092  
0.3748175838  
0.428665933  
0.5021159992  
0.590500916  
0.6858122137  
0.7773583948  
0.8527965493  
0.8994541972  
0.9058006089  
0.8629077349  
0.7657286079  
0.6140186669  
0.4128032708  
0.1722695662  
-0.09287529579  
-0.3645617783  
-0.6228977752  
-0.8479361394  
-1.021495903  
-1.128841113  
-1.160058564  
-1.110988397  
-0.9836346063  
-0.7860067678  
-0.5314169616  
-0.2373183934  
0.07621409949  
0.3881970053  
0.6784749238  
0.9293217045  
1.126765456  
1.261499863  
1.329348216  
1.331223986  
1.272650507  
1.162881712  
1.013760761  
0.8384163596  
0.649963828  
0.4603326736  
0.2793542326  
0.1141829607  
-0.03087186737  
-0.1541370878  
-0.2559996611  
-0.3380874278  
-0.4023306758  
-0.4500492964  
-0.4812311213  
-0.4941173962  
-0.4851909797  
-0.4495806223  
-0.3818570387  
-0.27709491  
-0.1320671482  
0.05362925977  
0.2767001365  
0.5296939188  
0.8010692771  
1.075826497  
1.336673838  
1.565590348  
1.74562447  
1.862677417  
1.90706103  
1.87460352  
1.767150249  
1.592395015  
1.363053468  
1.095498203  
0.8080310975  
0.5190279383  
0.2452065565  
0.0002056905207  
-0.206346324  
-0.369222654  
-0.4874514881  
-0.5637323691  
-0.6035581399  
-0.6142144944  
-0.603828  
-0.5805814583  
-0.5521635471  
-0.5254661839  
-0.5064676595  
-0.5002175889  
-0.5108093211  
-0.541267842  
-0.5933006022  
-0.6669266279  
-0.7600534438  
-0.8681358667  
-0.984034012  
-1.098225194  
-1.199433389  
-1.275705203  
-1.315832801  
-1.31096421  
-1.25615168  
-1.151559669  
-1.003071194  
-0.822100513  
-0.6245264953  
-0.4288334896  
-0.253657302  
-0.1151013393  
-0.02424232755  
0.01474364139  
0.005474392232  
-0.04094589749  
-0.1074612839  
-0.1736437173  
-0.2189563287  
-0.2261912771  
-0.1845365428  
-0.09175421591  
0.04489385252  
0.2091793158  
0.3778413044  
0.5236597593  
0.6192131495  
0.6407772843  
0.5717928204  
0.4054040353  
0.1457132775  
-0.1923929329  
-0.5848019036  
-1.00086378  
-1.406821531  
-1.769501601  
-2.059794548  
-2.25548849  
-2.343169969  
-2.319012639  
-2.188465727  
-1.964982918  
-1.668022816  
-1.320651376  
-0.9470501571  
-0.570232527  
-0.2101923699  
0.117371676  
0.4017162097  
0.6371193923  
0.8224613991  
0.9604516119  
1.056670549  
1.118539766  
1.154360259  
1.172470489  
1.180574846  
1.185235202  
1.191515037  
1.202751582  
1.220435263  
1.244192521  
1.271875011  
1.299765014  
1.322909488  
1.335592024  
1.33191624  
1.306476232  
1.255049709  
1.175249488  
1.067054479  
0.9331405557  
0.7789650598  
0.6125530874  
0.443993453  
0.2846590076  
0.1462275226  
0.03957084794  
-0.02634824541  
-0.0454768992  
-0.01543040406  
0.06207218055  
0.1811809209  
0.3322950988  
0.5028521701  
0.6784246564  
0.8440381542  
0.98554954  
1.090960364  
1.151517839  
1.162497548  
1.123594759  
1.038903103  
0.9164788305  
0.7675664622  
0.6055482664  
0.4447281052  
0.2990587592  
0.1809232841  
0.1000598901  
0.06271006788  
0.07106430601  
0.1230330688  
0.2123600022  
0.3290896188  
0.460349694  
0.5914061837  
0.7069193337  
0.7923128785  
0.8351354585  
0.8262966412  
0.7610392054  
0.6395313669  
0.466988684  
0.253273437  
0.01196387037  
-0.2410056992  
-0.4890240243  
-0.7165807163  
-0.9109223742  
-1.063353242  
-1.169966804  
-1.231699561  
-1.253658835  
-1.243836556  
-1.211390084  
-1.164810889  
-1.110286082  
-1.050585017  
-0.9847098159  
-0.9084111152  
-0.8155294546  
-0.699942691  
-0.5577847449  
-0.3894903459  
-0.2012659749  
-0.005595744388  
0.1793867767  
0.3317160608  
0.4283768195  
0.448695182  
0.3778155625  
0.209711118  
-0.05080431043  
-0.3874504259  
-0.7734510944  
-1.174045389  
-1.550282458  
-1.863596961  
-2.080559713  
-2.177129697  
-2.141785809  
-1.97710062  
-1.699481336  
-1.337127818  
-0.926463885  
-0.5075603698  
-0.1191766427  
0.2058836841  
0.4444731808  
0.5853813772  
0.629942829  
0.5909670075  
0.4902199524  
0.3549156699  
0.2137574312  
0.09313149627  
0.01397798194  
-0.01027817035  
0.02546235204  
0.1184150282  
0.259391242  
0.4349870399  
0.6300519186  
0.8300319602  
1.022826187  
1.199949746  
1.356904286  
