0.9709240319  
2.158198287  
5.230166829  
10.35621844  
75.76566919  
7068.009832  
1624.313665  
17477.84131  
78038.24454  
101968.6664  
52413.57082  
40761.48296  
17516.53811  
11646.42125  
9576.021267  
6928.550071  
3152.068237  
4060.760515  
6740.940404  
9675.909495  
14250.29458  
10305.96234  
11426.81088  
9695.900151  
7826.98345  
5805.273521  
1385.535419  
5316.986019  
2434.428574  
1872.689185  
2276.220546  
3460.018824  
3876.663426  
5072.060755  
4360.634933  
2624.18418  
1911.590169  
1990.564471  
725.6800173  
2617.664943  
675.012383  
982.3507614  
1726.48102  
938.0808853  
1290.278233  
1583.927561  
1642.799669  
1068.042957  
266.8114666  
171.3538405  
732.1269386  
68.00662171  
862.4897972  
1215.441063  
1740.636099  
1066.114236  
961.0823889  
616.37086  
350.9448038  
631.3219931  
333.6135925  
0.296499733  
188.3684168  
163.1992055  
129.2864547  
95.51219649  
16.65536445  
24.76751719  
15.19246425  
7.605531262  
2.24608036  
1.198556708  
1.133213334  
1.54561937  
2.471042075  
0.28503475  
0.602360652  
1.216108679  
0.6899891909  
0.8096912182  
0.523171222  
0.3847320493  
0.6027107903  
0.4664098046  
0.3932052805  
0.4065435606  
0.3257084279  
0.2695292166  
0.3548734506  
0.3924953342  
0.3639164607  
0.3260106959  
0.3172905672  
0.2589575468  
0.2550984845  
0.2522049959  
0.2478683751  
0.2281273643  
0.236093849  
0.237617612  
0.2176848403  
0.2076009327  
0.2080357423  
0.1976353838  
0.1912054868  
0.1886375938  
0.1841456136  
0.1776421529  
0.1728254596  
0.1703347506  
0.1666500639  
0.1606214173  
0.1567506937  
0.1516662642  
0.1477851559  
0.144256439  
0.1409953038  
0.1377663693  
0.1344727759  
0.1316296692  
0.128875812  
0.1264115207  
0.1233546996  
0.1206653297  
0.1180073346  
0.1155904577  
0.1133033869  
0.1109291328  
0.1088004727  
0.1067150296  
0.1046508443  
0.1027234764  
0.1008069647  
0.09889558501  
0.09708868585  
0.09532996696  
0.09361330676  
0.09196572929  
0.09037797982  
0.08882920625  
0.0873306523  
0.08585149533  
0.08444438982  
0.08304842889  
0.08169223462  
0.08037615439  
0.07909900106  
0.07785160929  
0.0766414631  
0.07546156924  
0.07431806943  
0.07319890524  
0.07210614722  
0.07104298064  
0.07000476692  
0.06898789595  
0.06799794981  
0.06703573982  
0.06609098439  
0.06517516752  
0.06427649963  
0.06340486702  
0.06254762292  
0.06170818608  
0.06089231739  
0.06008830029  
0.0593089296  
0.05854225796  
0.05779307783  
0.05706541356  
0.0563499188  
0.05565031311  
0.05496184947  
0.05429255406  
0.0536332615  
0.05299076039  
0.05235903719  
0.05174186029  
0.05113849458  
0.05054340155  
0.04996276998  
0.04939328893  
0.04883470976  
0.04828908938  
0.04775382339  
0.04722764686  
0.04671084344  
0.04620072296  
0.04570790267  
0.04521694317  
0.0447413768  
0.04426747071  
0.04380978514  
0.04335678382  
0.04291157025  
0.04247751091  
0.04204959795  
0.04162830982  
0.04121373556  
0.04080991953  
0.04040905557  
0.04001855063  
0.03963111885  
0.03925522458  
0.03888419951  
0.03851775921  
0.03815657229  
0.03780366499  
0.03745845948  
0.03711513657  
0.0367788787  
0.03644716278  
0.03612264444  
0.03580257529  
0.03548755464  
0.03517676587  
0.03487242328  
0.03457140351  
0.03427797038  
0.03398717791  
0.03370156036  
0.03342102111  
0.03314096238  
0.03286988064  
0.03260071318  
0.03233527085  
0.03207485084  
0.03181692598  
0.03156609488  
0.0313165816  
0.03107273629  
0.03082971964  
0.03059341581  
0.03035719409  
0.03012702148  
0.02989987173  
0.02967438923  
0.02945566086  
0.02923662744  
0.02902054737  
0.02880913952  
0.02860225025  
0.02839341879  
0.02819015384  
0.02799062325  
0.02779297236  
0.02759931616  
0.02740900145  
0.02721883741  
0.0270311443  
0.026847791  
0.02666434829  
0.02648821479  
0.02630999034  
0.02613727334  
0.02596427993  
0.02579469839  
0.02562634214  
0.02546332929  
0.02529847516  
0.02513900311  
0.02498034017  
0.02482263646  
0.02466917428  
0.02451769913  
0.02436565715  
0.02421667905  
0.02407130543  
0.02392523869  
0.02378306088  
0.02364073543  
0.02350231691  
0.02336444788  
0.02322933709  
0.02309311956  
0.02296345649  
0.02283194914  
0.02270371791  
0.02257631441  
0.022449617  
0.02232642269  
0.02220098279  
0.0220805015  
0.02196092996  
0.02184361745  
0.02172469575  
0.02161070053  
0.0214961461  
0.02138405243  
0.02127207828  
0.02116203598  
0.02105573974  
0.02094441587  
0.02084062183  
0.02073416613  
0.02063095315  
0.02053039894  
0.02042856771  
0.02032839596  
0.02023036298  
0.02013406526  
0.02003794779  
0.01994056668  
0.01984520493  
0.01975444834  
0.01966226467  
0.01957172395  
0.01947949419  
0.01939374648  
0.01930559474  
0.01921996238  
0.01913343299  
0.01904813992  
0.01896472117  
0.01888171031  
0.01880041738  
0.01871921634  
0.01863960551  
0.01856074839  
0.01848180684  
0.01840512442  
0.01832838212  
0.01825283894  
0.01818020941  
0.01810673311  
0.01803269911  
0.01796107193  
0.01788988997  
0.01781971985  
0.01774997328  
0.01768277193  
0.01761391402  
0.01754523152  
0.01747890319  
0.01741214185  
0.01734995138  
0.0172850503  
0.01722249055  
0.01715928587  
0.01709592691  
0.01703437086  
0.01697447023  
0.01691472851  
0.0168550388  
0.0167969028  
0.01673857969  
0.0166816809  
0.01662436374  
0.01656932208  
0.01651209675  
0.01645980113  
0.01640572911  
0.01635366452  
0.01630105657  
0.01624793869  
0.01619652377  
0.01614409244  
0.01609468757  
0.01604392367  
0.01599396032  
0.01594611509  
0.01589761221  
0.01585121767  
0.0158048593  
0.01575638859  
0.01570963306  
0.0156671008  
0.01562104834  
0.01557710667  
0.0155308657  
0.01549016045  
0.01544709021  
0.01540358231  
0.01536253857  
0.01532272371  
0.01528054734  
0.01524050519  
0.01520112523  
0.01516182649  
0.01512359433  
0.01508429744  
0.0150466962  
0.01500910306  
0.01497282337  
0.01493487327  
0.01490114089  
0.01486563406  
0.01483076685  
0.01479488742  
0.01476049903  
0.01472733811  
0.0146934694  
0.01466276117  
0.01462900333  
0.01459618631  
0.01456568782  
0.01453527435  
0.0145019259  
0.01447196236  
0.01444173905  
0.01441228685  
0.01438193884  
0.01435560683  
0.0143268064  
0.01429906726  
0.01427053138  
0.01424112168  
0.01421682497  
0.01418988129  
0.01416437379  
0.01413945764  
0.01411137355  
0.01408711405  
0.01406251974  
0.01403754985  
0.01401269151  
0.01399073131  
0.01396526203  
0.0139441646  
0.0139225195  
0.01389971066  
0.01387722671  
0.01385619322  
0.01383616017  
0.01381353716  
0.01379367782  
0.01377334891  
0.01375362455  
0.01373271583  
0.01371688757  
0.01369627681  
0.01367910696  
0.01366097026  
0.01364384771  
0.01362607301  
0.01360798808  
0.01359062049  
0.01357524041  
0.01355815769  
0.01354235218  
0.01352693464  
0.01351393977  
0.0134961907  
0.01348249017  
0.01346880204  
0.01345552651  
0.01343869723  
0.01342814868  
0.013413867  
0.01340277112  
0.01338669327  
0.0133770462  
0.01336518817  
0.01335273326  
0.01334205424  
0.01333227663  
0.01332008493  
0.01330982045  
0.01329988289  
0.01328914882  
0.01328087922  
0.01327174075  
0.01326098327  
0.01325386143  
0.01324381022  
0.01323693597  
0.01323097158  
0.01322242447  
0.01321346521  
0.01320847262  
0.01320128298  
0.01319652336  
0.01319043919  
0.01318268789  
0.01317883249  
0.01317348973  
0.01316896536  
0.01316260173  
0.01315858557  
0.01315575401  
0.01315056972  
0.01314762488  
0.01314484435  
0.01314131002  
0.01313913136  
0.01313628417  
0.01313336368  
0.01313308954  
0.01313113365  
0.01312866094  
0.01312831168  
0.01312886503  
0.01312735568  
0.01312792187  
