0.9423026607  
1.575685555  
3.032061655  
11.24423173  
142.2088373  
302.24485  
17635.66753  
567.2552181  
47529.28792  
18196.40769  
3436.893787  
224.8036401  
37561.35908  
22720.33667  
1817.188139  
26950.85738  
10120.10264  
7828.617355  
2252.215291  
6378.301399  
1229.500526  
20515.93026  
10756.93974  
8563.251734  
20893.64196  
8443.044859  
12011.35632  
14168.76313  
6612.458229  
2331.887628  
467.3795961  
35277.41383  
1403.439455  
1797.773279  
5919.329309  
3183.949101  
13834.06912  
17624.60042  
3472.48079  
22670.14696  
3710.448748  
1594.586652  
9199.418265  
1295.956809  
2995.979116  
5228.169261  
4491.859614  
16620.3615  
1039.36959  
24.08916976  
3510.329688  
3246.65137  
1755.187097  
888.4959132  
2552.32929  
353.0495858  
3074.448478  
4025.380875  
3839.195688  
725.9728425  
129.260816  
158.7069884  
643.071745  
50.15697067  
934.2622577  
154.6003971  
71.3243591  
83.32593372  
38.51260236  
63.06358908  
22.17308063  
12.49723587  
13.36119631  
23.17620517  
1.763108343  
3.123342033  
0.1003837579  
4.298259263  
1.250201851  
4.79197354  
1.636768591  
4.799060802  
2.471975033  
3.399934883  
2.212597556  
2.057913484  
1.96746986  
2.111571728  
2.063612199  
2.146062416  
2.003572312  
2.071600306  
1.880220752  
1.657438461  
1.690731418  
1.51052371  
1.526028014  
1.486604487  
1.456046408  
1.421972396  
1.370383145  
1.346716297  
1.261434704  
1.265158257  
1.22054332  
1.183583798  
1.149283829  
1.123931994  
1.098038067  
1.068729521  
1.037510957  
1.014566938  
0.9894184857  
0.9615558091  
0.9387897814  
0.9174902084  
0.8986947258  
0.8765244675  
0.8569200398  
0.8384686074  
0.8208867719  
0.8028143474  
0.7855818671  
0.7693688772  
0.7534624843  
0.7382816146  
0.7232620029  
0.7090968303  
0.6955906065  
0.6818892623  
0.6688073894  
0.656241513  
0.6440618626  
0.6321963027  
0.6205801981  
0.6094982861  
0.598778811  
0.588256871  
0.5780823519  
0.5681393144  
0.5585638598  
0.549195753  
0.5400663517  
0.531175851  
0.5225983086  
0.5142500195  
0.5060647902  
0.4980882641  
0.4903782227  
0.4828417206  
0.4754900474  
0.4683087238  
0.4613446203  
0.4545385859  
0.447896877  
0.4414087556  
0.4350906239  
0.4289191547  
0.4228857876  
0.4170031306  
0.4112471538  
0.4056418495  
0.4001539336  
0.3947892763  
0.389548033  
0.3844165945  
0.3794221867  
0.3745060352  
0.3697274815  
0.3650351864  
0.3604471563  
0.3559527152  
0.3515655663  
0.3472488553  
0.3430520345  
0.3389102953  
0.3348789044  
0.3309161843  
0.3270502053  
0.3232423387  
0.3195264968  
0.3158688893  
0.3122949124  
0.3087906113  
0.3053308192  
0.3019695999  
0.2986566479  
0.295406619  
0.2922216169  
0.2890981551  
0.2860384701  
0.2830257249  
0.2800604769  
0.2771521644  
0.2743056808  
0.2715205255  
0.2687755951  
0.2660838758  
0.2634296737  
0.2608194671  
0.2582697131  
0.255740445  
0.2532850648  
0.2508621884  
0.2484720511  
0.2461328577  
0.2438245169  
0.2415607505  
0.2393292833  
0.2371451569  
0.2349890439  
0.2328590708  
0.2307767995  
0.2287357161  
0.226713497  
0.2247278428  
0.2227845929  
0.2208446862  
0.2189570644  
0.2170912695  
0.2152663655  
0.2134569344  
0.2116870202  
0.2099404844  
0.2082102324  
0.2065206498  
0.2048405733  
0.2032044071  
0.2015915788  
0.2000008346  
0.1984253221  
0.1968729136  
0.1953529922  
0.1938358902  
0.192371659  
0.1909156775  
0.1894596392  
0.1880492057  
0.1866541027  
0.1852822301  
0.1839387392  
0.1825934491  
0.1812734725  
0.1799833595  
0.1786956507  
0.1774241038  
0.1761744045  
0.1749515181  
0.1737442431  
0.1725401403  
0.1713692554  
0.1702088811  
0.1690625342  
0.1679274628  
0.166818526  
0.1657244694  
0.1646329793  
0.1635556438  
0.1625042569  
0.1614610649  
0.1604360836  
0.1594128915  
0.1584151242  
0.1574186758  
0.1564406705  
0.1554833167  
0.1545374865  
0.1535920805  
0.1526644117  
0.1517489815  
0.1508501815  
0.1499691192  
0.1490783181  
0.1482078066  
0.1473560752  
0.1465092558  
0.1456628469  
0.144838842  
0.1440268822  
0.1432197209  
0.1424327668  
0.1416358932  
0.1408707153  
0.1400888192  
0.1393426446  
0.1385976754  
0.1378597312  
0.137120603  
0.1363973729  
0.1356948183  
0.1349890768  
0.1342978378  
0.1336125962  
0.1329314983  
0.1322565776  
0.1315942017  
0.1309316473  
0.1303033944  
0.1296657893  
0.1290214767  
0.1284111385  
0.1277839917  
0.1271829863  
0.1265759074  
0.1259843765  
0.1254058492  
0.124808429  
0.1242438556  
0.1236746609  
0.1231087685  
0.1225606185  
0.1220082438  
0.1214736708  
0.1209339576  
0.1204106909  
0.1198827834  
0.1193716276  
0.1188579457  
0.1183503827  
0.1178452874  
0.1173667457  
0.1168738039  
0.1163935275  
0.1159171937  
0.1154404839  
0.1149797837  
0.1145156363  
0.11405796  
0.1136101361  
0.1131727345  
0.1127257699  
0.1122888204  
0.1118706074  
0.1114390562  
0.1110248466  
0.1106045157  
0.1101985049  
0.1097868525  
0.1093880912  
0.1090012171  
0.1085990052  
0.1082209559  
0.1078323219  
0.1074589955  
0.1070845007  
0.1067096736  
0.1063402423  
0.1059839712  
0.1056232838  
0.1052747856  
0.1049238022  
0.1045723706  
0.1042347055  
0.1038965453  
0.1035651222  
0.1032397604  
0.102919453  
0.1025833665  
0.102266759  
0.1019544591  
0.1016511721  
0.1013381916  
0.1010396491  
0.1007286386  
0.1004341887  
0.1001416834  
0.09985927718  
0.09956948856  
0.09927389817  
0.09900748909  
0.09872558057  
0.09845491852  
0.09818610266  
0.09791706922  
0.09765815733  
0.09739712674  
0.09713526109  
0.09689195883  
0.09664082703  
0.09639471864  
0.09614329428  
0.09590121815  
0.09566290444  
0.09542782933  
0.09519688399  
0.09496339835  
0.09472959305  
0.09451746848  
0.09429333374  
0.09407419775  
0.09385354679  
0.09364401884  
0.09343159946  
0.09322677315  
0.09302348003  
0.09280988132  
0.09261852249  
0.09242392753  
0.09222786062  
0.09203564087  
0.09184754085  
0.09166128689  
0.09148019805  
0.09128911249  
0.09111516548  
0.09093649973  
0.09076234752  
0.09059188991  
0.09041968597  
0.09025523314  
0.09008409905  
0.08992962734  
0.0897744597  
0.08961555196  
0.08945772727  
0.08930572331  
0.08915028354  
0.08900574525  
0.08885865111  
0.08871494066  
0.0885729084  
0.08843351647  
0.08830143191  
0.08815993861  
0.08803585341  
0.08790110901  
0.08777224474  
0.08764007199  
0.08752036466  
0.08739571936  
0.08728574548  
0.08715734131  
0.087041269  
0.08693188989  
0.08682149242  
0.08670795017  
0.08660568283  
0.08648932816  
0.08639841332  
0.08629691832  
0.086198779  
0.08609404129  
0.08600473572  
0.08590610896  
0.08581354158  
0.08572779576  
0.08564247258  
0.08556281723  
0.08547366611  
0.08539320432  
0.08531010731  
0.08522991251  
0.08516137483  
0.08508524433  
0.08501471178  
0.08494125307  
0.08487500633  
0.08480353908  
0.08474528499  
0.08467891145  
0.08462096861  
0.08456755652  
0.0845080584  
0.08444886703  
0.08439630433  
0.0843452572  
0.08429890889  
0.08425355135  
0.08420263657  
0.08416041425  
0.08410710943  
0.0840742649  
0.08404242584  
0.08400330778  
0.08396137453  
0.08393799575  
0.08390363785  
0.0838732303  
0.08384518223  
0.08382532224  
0.08379622452  
0.08377152533  
0.08375338485  
0.08372958294  
0.08370856771  
0.08369769393  
0.08367936364  
0.08368532187  
0.08366787912  
0.08366194471  
0.08366191552  
0.08364289124  
0.08364765693  
0.0836424357  
