0.3108436788  
-0.5405088055  
-1.34607861  
-2.062203459  
-2.653409457  
-3.095204992  
-3.375571504  
-3.495049888  
-3.465521552  
-3.307931591  
-3.049343386  
-2.719732175  
-2.348948304  
-1.964183304  
-1.588174349  
-1.238252334  
-0.9261890819  
-0.6587213226  
-0.4385103931  
-0.2652983793  
-0.1370137631  
-0.05064898686  
-0.00278989027  
0.01019346537  
-0.007739035994  
-0.0520341799  
-0.1172562103  
-0.1969342839  
-0.2836169881  
-0.369183591  
-0.4453731873  
-0.5044555867  
-0.5399069139  
-0.5469978277  
-0.5231765129  
-0.4682127841  
-0.3840994481  
-0.2747588814  
-0.1456287268  
-0.003210624022  
0.145369804  
0.2927395839  
0.4316209498  
0.5551561068  
0.6572520587  
0.7329749465  
0.7789967824  
0.7940345824  
0.7792146511  
0.7382713338  
0.6774764844  
0.6052500749  
0.5314241102  
0.4662230742  
0.4190495676  
0.3972401264  
0.4049531673  
0.4423795866  
0.5054010469  
0.5858037049  
0.6720570074  
0.7505993183  
0.8074944315  
0.8302664394  
0.8096654515  
0.7411282392  
0.6257069453  
0.4703190033  
0.2872199683  
0.09276217834  
-0.09446509014  
-0.2558725631  
-0.375206459  
-0.4406746216  
-0.4465612065  
-0.3941148056  
-0.2915583708  
-0.1532187074  
0.002118904497  
0.1534163608  
0.2798587064  
0.3632623602  
0.3901320821  
0.3530989011  
0.2515909067  
0.09170465201  
-0.1146924638  
-0.3514390155  
-0.5999507444  
-0.8412313414  
-1.057788568  
-1.235244342  
-1.363504399  
-1.437382236  
-1.45666279  
-1.425658443  
-1.352329835  
-1.247123438  
-1.121668883  
-0.987499475  
-0.8549399242  
-0.7322655813  
-0.6252170003  
-0.5368641701  
-0.467810284  
-0.416649948  
-0.3805884424  
-0.3561171496  
-0.3396405394  
-0.3279810366  
-0.3187154651  
-0.3103004032  
-0.3020203076  
-0.2937646359  
-0.2856968771  
-0.2778620465  
-0.2698123471  
-0.2603062842  
-0.2471526457  
-0.2272335471  
-0.1967446529  
-0.1516297907  
-0.08817717646  
-0.003690942071  
0.102858552  
0.2303319184  
0.3751772402  
0.5315234597  
0.6916429587  
0.8467467532  
0.9880044136  
1.107621602  
1.199785158  
1.261290956  
1.291711916  
1.293068041  
1.269032856  
1.223852136  
1.161193888  
1.083204154  
0.9900216932  
0.8799081417  
0.750055792  
0.597957557  
0.4231170177  
0.2287450898  
0.02304550226  
-0.1802605188  
-0.3624348695  
-0.5013401491  
-0.5740562484  
-0.5601841995  
-0.4453381785  
-0.2242630114  
0.09701183096  
0.500437125  
0.956904232  
1.428896547  
1.874544636  
2.252569819  
2.527390577  
2.673636246  
2.67936186  
2.547466243  
2.295079087  
1.951010401  
1.551668053  
1.136073142  
0.7407431  
0.3952058665  
0.1187691097  
-0.08103554215  
-0.2082035891  
-0.276370147  
-0.3056749328  
-0.31894833  
-0.3378386314  
-0.3794819952  
-0.4541513626  
-0.5641707645  
-0.7041463168  
-0.8623676465  
-1.023065212  
-1.169140003  
-1.284899056  
-1.358426179  
-1.383251861  
-1.359156083  
-1.292034855  
-1.192930245  
-1.076386802  
-0.9584119664  
-0.8543198168  
-0.7767463158  
-0.7340917636  
-0.7295554059  
-0.7608809378  
-0.8208057721  
-0.8981675852  
-0.9794865567  
-1.050850627  
-1.099845594  
-1.117294633  
-1.098579324  
-1.044371532  
-0.9606632237  
-0.8580870376  
-0.7505902501  
-0.6536253759  
-0.5820773769  
-0.5481973833  
-0.5598057458  
-0.6190185541  
-0.72165912  
-0.8574719027  
-1.011104084  
-1.163769781  
-1.295388976  
-1.386939173  
-1.422733598  
-1.39233302  
-1.291850821  
-1.12448344  
-0.9001950221  
-0.6345815239  
-0.3470785474  
-0.05871938079  
0.2102507076  
0.4426019094  
0.6258934903  
0.7535784687  
0.8252980734  
0.8463507695  
0.8264608106  
0.7780324  
0.714193205  
0.6469243519  
0.5855718205  
0.5359500143  
0.5001526783  
0.4770483694  
0.4633357784  
0.4549182673  
0.4483133107  
0.4418262951  
0.4362356632  
0.4348794091  
0.443105902  
0.4672110813  
0.5130648606  
0.5846946839  
0.6831141003  
0.8056242521  
0.9457356863  
1.093751829  
1.237922007  
1.365988179  
1.466861297  
1.532175983  
1.557455036  
1.542735892  
1.49254997  
1.415290649  
1.322090635  
1.22536881  
1.137296299  
1.068362445  
1.026242112  
1.015049228  
1.03501684  
1.082583417  
1.150791011  
1.229903688  
1.308153615  
1.372550166  
1.409719377  
1.406780906  
1.352272119  
1.237130152  
1.055702933  
0.8067273115  
0.4941311275  
0.1275431643  
-0.277688792  
-0.7010828055  
-1.118274596  
-1.502916369  
-1.829069751  
-2.073851616  
-2.219998264  
-2.258010979  
-2.187540977  
-2.017773264  
-1.766707585  
-1.459369733  
-1.125155112  
-0.7946468145  
-0.4963048141  
-0.2534667156  
-0.08203834373  
0.01083229886  
0.02697632861  
-0.02367532616  
-0.12490123  
-0.2566334112  
-0.3976940399  
-0.5284318338  
-0.6329432773  
-0.7006194574  
-0.7268777033  
-0.7130724919  
-0.6656651993  
-0.5948505913  
-0.5128545668  
-0.4321665052  
-0.3639057291  
-0.3165222644  
-0.2949181358  
-0.3000542836  
-0.3290180714  
-0.3754997918  
-0.4305852948  
-0.483768121  
-0.5240778935  
-0.5412324806  
-0.5267169442  
-0.474714212  
-0.3828147913  
-0.2524384422  
-0.08891863776  
0.0987726427  
0.2986730372  
0.4967905451  
0.678320724  
0.8289975574  
0.9364316961  
0.9913145164  
0.9883351164  
0.9267199332  
0.8103300583  
0.6473161345  
0.4493816589  
0.2307261185  
0.006796105045  
-0.2070332593  
-0.3967351384  
-0.5507591637  
-0.6609337596  
-0.7230942608  
-0.7374022561  
-0.7083430484  
-0.6443879059  
-0.5573243979  
-0.4612676313  
-0.3713692842  
-0.3022875249  
-0.2665148547  
-0.2726907382  
-0.3240991485  
-0.417553121  
-0.5428943983  
-0.683286499  
-0.8164257086  
-0.9166622396  
-0.9579147631  
-0.9170729681  
-0.7775061272  
-0.5321717223  
-0.185817391  
0.2441534328  
0.7284556655  
1.228394983  
1.699872788  
2.098457612  
2.38490508  
2.530317725  
2.520187098  
2.35664808  
2.058534578  
1.659147746  
1.201997544  
0.7351140381  
0.3047763261  
-0.05042173486  
-0.3042624998  
-0.445682388  
-0.4792516633  
-0.4233626849  
-0.3064975528  
-0.1622381067  
-0.02385186995  
0.08067715781  
0.1324276489  
0.1236039143  
0.05770782626  
-0.05208716668  
-0.1859500524  
-0.3211872438  
-0.4361534938  
-0.513632517  
-0.5432057048  
-0.5223173657  
-0.4560022723  
-0.3554647129  
-0.2358407037  
-0.1135929816  
-0.00397931891  
0.08103008111  
0.1341275066  
0.1532278936  
0.1412251746  
0.1051193813  
0.0546954391  
0.001019914319  
-0.04503166357  
-0.07404030497  
-0.0789865205  
-0.05583503428  
-0.003760339279  
0.07492982844  
0.1751168756  
0.2893828461  
0.4086455005  
0.5228857102  
0.6219283357  
0.6962447672  
0.7377394734  
0.7404638566  
0.7012137494  
0.6199333963  
0.4998896259  
0.3475545655  
0.172212144  
-0.01471727155  
-0.200578778  
-0.3725238015  
-0.5186124959  
-0.6288522155  
-0.6960742018  
-0.7165638649  
-0.6903584257  
-0.6211961178  
-0.5161090466  
-0.3847106769  
-0.238250818  
-0.08854882926  
0.05307167317  
0.1767222362  
0.2746790334  
0.3417969936  
0.3756212866  
0.3761821848  
0.3455530669  
0.2872733668  
0.205730153  
0.1056351328  
-0.008339794512  
-0.1316976921  
-0.2600452888  
-0.3888570018  
-0.5131660151  
-0.6273117987  
-0.7248366127  
-0.7986358639  
-0.8413892658  
-0.8462567249  
-0.8077492314  
-0.722652567  
-0.5908545485  
-0.415904369  
-0.2052131381  
0.03019420372  
0.2763521209  
0.5174050328  
0.7369114987  
0.919243908  
1.050954554  
1.121946663  
1.126356719  
1.063085291  
0.9359208145  
0.7532851898  
0.5276011797  
0.2743395041  
0.01080573192  
-0.2452541151  
-0.4771083445  
-0.6704623302  
-0.8146755039  
-0.9036801828  
-0.9364554841  
-0.9170063968  
-0.8538214267  
-0.7588457581  
-0.646094444  
-0.5300543687  
-0.4240804413  
-0.3389853797  
-0.2820029575  
-0.2562580528  
-0.2608067007  
-0.2912171876  
-0.3406000542  
-0.400916664  
-0.4643490466  
-0.5245212129  
-0.577367693  
-0.6215262259  
-0.6581809312  
-0.6904145058  
-0.7221805795  
-0.7570860928  
-0.7972015523  
-0.8421260354  
-0.8884676175  
-0.929850928  
-0.957468247  
-0.9611095225  
-0.9305096557  
-0.8568372159  
-0.7340791513  
-0.5601400989  
-0.3374883675  
-0.07326079511  
0.221191158  
0.5312324799  
0.8402394427  
1.13108393  
1.387636573  
1.596112331  
1.746142586  
1.831481272  
1.850319667  
1.80522411  
1.702742294  
1.552753081  
1.36763826  
1.161366886  
0.9485407376  
0.743483243  
0.5593969609  
0.4076303791  
0.2970817691  
0.2337394884  
0.2203981724  
0.256539749  
0.3383959448  
0.4591955588  
0.6095864166  
0.7782345975  
0.9525596519  
1.119580493  
1.266809823  
1.383147156  
1.459674711  
1.490314093  
1.472237194  
1.406020969  
1.295504303  
1.147362732  
0.9704472385  
0.77495531  
0.5715304666  
0.3703704678  
0.1804480114  
0.008901185308  
-0.139354522  
-0.2617924688  
-0.3582019628  
-0.4304280608  
-0.4819636529  
-0.5174292528  
-0.5419997731  
-0.560820293  
-0.5784677119  
-0.598469679  
-0.6229489229  
-0.6524135571  
-0.6857265609  
-0.7202758586  
-0.7523502521  
-0.7776978909  
-0.7922215006  
-0.7927323275  
-0.7776609801  
-0.747609565  
-0.7056393586  
-0.6572105313  
-0.6097380354  
-0.5717810275  
-0.5519337491  
-0.5575774862  
-0.5936576355  
-0.6616645642  
-0.7590132311  
-0.8789429403  
-1.010978378  
-1.141952545  
-1.257471857  
-1.343629791  
-1.388764537  
-1.384999947  
-1.329356354  
-1.224266447  
-1.077418122  
-0.9009214555  
-0.7099179035  
-0.5208162146  
-0.3493743374  
-0.2088995868  
-0.1087814801  
-0.05354805362  
-0.04254765131  
-0.07026190252  
-0.1272044345  
-0.2012317955  
-0.279116705  
-0.3481271627  
-0.3974600502  
-0.4193090599  
-0.4095081949  
-0.3676539462  
-0.2967653329  
-0.2025449691  
-0.09237448244  
0.02579057869  
0.1444728714  
0.2575260604  
0.3606723365  
0.4516849047  
0.5301969973  
0.597225075  
0.6544894428  
0.703682933  
0.7458252743  
0.7808404175  
0.8074347241  
0.8233237385  
0.8257643072  
0.8123091994  
0.78165152  
0.7343700375  
0.6734408764  
0.6043594348  
0.5348204385  
0.4739411761  
0.4311388572  
0.4147995061  
0.4309544227  
0.4822004333  
0.5670364818  
0.6797744047  
0.8110616172  
0.9489576477  
1.080413641  
1.192927344  
1.276130758  
1.323053645  
1.330885398  
1.301151722  
1.239287654  
1.153732069  
1.054687293  
0.9527620822  
0.857676933  
0.777207951  
0.7164522665  
0.6774627627  
0.6592414147  
0.6580297047  
0.6678187927  
0.6810233401  
0.6892248399  
0.6839498401  
0.6574376324  
0.60333998  
0.5173446675  
0.3976372942  
0.2451892652  
0.06380230844  
-0.1401034715  
-0.3579764815  
-0.5798663935  
-0.7953402588  
-0.9944910698  
-1.168932051  
-1.312649538  
-1.422610712  
-1.499028282  
-1.545261992  
-1.567328007  
-1.57309048  
-1.571222135  
-1.570053502  
-1.576474659  
-1.595004373  
-1.627177406  
-1.671303404  
-1.722654335  
-1.774054941  
-1.816793385  
-1.841745763  
-1.840568238  
-1.806801849  
-1.736737069  
-1.629943496  
-1.48937881  
-1.321068105  
-1.133396879  
-0.9361136085  
-0.7391691977  
-0.5515580779  
-0.3803124309  
-0.2297972473  
-0.1013891461  
0.006401466047  
0.097399664  
0.1769136421  
0.2506940565  
0.3238704711  
0.4000497626  
0.4807156891  
0.5650307587  
0.6500713358  
0.731445371  
0.8041925713  
0.8637908624  
0.9071068574  
0.9330971481  
0.9431607411  
0.9410541893  
0.9323959573  
0.9238321204  
0.9220100971  
0.9325214027  
0.9589893437  
1.002455244  
1.061142129  
1.130644913  
1.204497267  
1.275027851  
1.334376683  
1.375499363  
1.39304833  
1.38398403  
1.34787262  
1.286837536  
1.205202207  
1.108894371  
1.004712352  
0.8995494364  
0.7996890242  
0.710233836  
0.6347375534  
0.5750375859  
0.5313009368  
0.5022315493  
0.4854018684  
0.4776445737  
0.4754531296  
0.4753408349  
0.4741277265  
0.4691379092  
0.4582892017  
0.4401044078  
0.4136453798  
0.3784033762  
0.334175414  
0.2809510301  
0.2188439157  
0.1480753065  
0.06902360925  
-0.0176748499  
-0.1109898752  
-0.2093543392  
-0.3105825051  
-0.4118579591  
-0.5098510601  
-0.6009739321  
-0.6817579376  
-0.7493107883  
-0.8017956795  
-0.8388252761  
-0.861688429  
-0.8733319701  
-0.878056409  
-0.8809420455  
-0.8870552543  
-0.900581725  
-0.9240133707  
-0.9575635407  
-0.9989296586  
-1.043497598  
-1.084967526  
-1.116339043  
-1.131077735  
-1.124271352  
-1.093544385  
-1.039556034  
-0.965952135  
-0.8787687094  
-0.7853571515  
-0.6930409205  
-0.6077270672  
-0.5327626084  
-0.4682572964  
-0.4110313375  
-0.3552345553  
-0.2935397958  
-0.2187245165  
-0.1253535616  
-0.01124855072  
0.1215495744  
0.2665167843  
0.4132027559  
0.5485377934  
0.6587204114  
0.7313949794  
0.7577573165  
0.734244894  
0.6634987709  
0.5544069571  
0.4211756796  
0.2815244075  
0.1542560628  
0.05655672797  
0.001423516534  
-0.004368900947  
0.03855859531  
0.122084849  
0.2315996606  
0.3479966787  
0.4503894658  
0.5191522024  
0.5388336072  
0.5005252151  
0.4033050593  
0.2545292489  
0.06889797959  
-0.1336088041  
-0.3306423215  
-0.5008564735  
-0.6272534229  
-0.7000087896  
-0.7183216358  
-0.6909789982  
-0.6354326111  
-0.5754545783  
-0.5376048365  
-0.5469236978  
-0.6224784703  
-0.7733729347  
-0.9959135933  
-1.272447716  
-1.572222497  
-1.854332054  
-2.072507178  
-2.181199939  
-2.142155074  
-1.930545876  
-1.539702281  
-0.9836397669  
-0.2968542496  
0.4687330936  
1.24940062  
1.977102868  
2.587781446  
3.02934042  
3.268137547  
3.293068899  
3.116669459  
2.773128396  
2.3135428  
1.799163254  
1.293606131  
0.8551347536  
0.5300280758  
0.3478299675  
0.3189836338  
0.4349571479  
0.6706783262  
0.988756687  
1.344830569  
1.693276133  
1.992546617  
2.209531624  
2.322499447  
2.322413781  
2.212617471  
2.007092995  
1.7276389  
1.400431963  
1.052454192  
0.7082498942  
0.3873996957  
0.1029592667  
-0.1390161657  
-0.3389330032  
-0.5022791781  
-0.6377137442  
-0.7549586932  
-0.8628506503  
-0.9678302276  
-1.073054097  
-1.178212575  
-1.27997912  
-1.372971822  
-1.450996424  
-1.508326767  
-1.540821896  
-1.546694732  
-1.526830462  
-1.484651331  
-1.425575207  
-1.356209547  
-1.283425586  
-1.213492692  
-1.151400426  
-1.100471309  
-1.062290496  
-1.036908177  
-1.023238919  
-1.019533573  
-1.023804089  
-1.034108089  
-1.048623808  
-1.065538194  
-1.082767502  
-1.097640333  
-1.10662431  
-1.105236937  
-1.088206914  
-1.049931578  
-0.9851901393  
-0.8900326652  
-0.7626896973  
-0.6043532092  
-0.4196384508  
-0.2166129274  
-0.006314283699  
0.1982374038  
0.3834353294  
0.5367488414  
0.6483999882  
0.712858028  
0.7298819909  
0.7049509206  
0.6489649502  
0.577191056  
0.5075425852  
0.4583750365  
0.4460402879  
0.482518512  
0.5734149795  
0.7166345361  
0.9019222283  
1.111416709  
1.321215472  
1.503837135  
1.631362167  
1.678909012  
1.628064739  
1.469846302  
1.206794621  
0.8538851015  
0.4380478454  
-0.003766836923  
-0.4278603808  
-0.7881174537  
-1.040980502  
-1.15052609  
-1.093053547  
-0.8606310012  
-0.463091279  
0.07184828166  
0.7004662642  
1.366816969  
2.008050779  
2.560731238  
2.967431657  
3.18284282  
3.178658649  
2.946626712  
2.499375791  
1.868900661  
1.102875627  
0.2592688997  
-0.6000834419  
