269.1365748  
283.2860923  
323.896522  
441.5744655  
530.1866913  
487.9594786  
9843.078715  
85829.94763  
39442.80677  
307.5543705  
16880.67455  
19334.29408  
32570.79263  
17745.13688  
22053.6071  
10991.69949  
13039.95868  
12299.6914  
20130.49328  
4787.98712  
523.9835468  
6409.019256  
8562.473404  
11222.46988  
9191.210742  
466.3597866  
3727.06001  
8067.823644  
2289.051474  
528.7093933  
12491.71954  
5647.943035  
3211.937172  
2412.531246  
5029.336211  
24004.32627  
7335.03521  
550.8596112  
3836.271401  
1827.263579  
945.1852764  
853.3398906  
629.1757446  
672.0597156  
5330.303163  
571.3340479  
1632.210338  
15519.4448  
2703.340658  
1659.285567  
345.7878159  
2526.522599  
6233.963758  
1057.638076  
154.5370735  
1797.064672  
3005.156292  
2658.920503  
1017.638461  
5332.24181  
857.1160736  
1888.282289  
2021.653755  
1668.427691  
104.6002181  
474.5955956  
126.5319936  
16.95186541  
440.1659177  
181.3842829  
75.83426773  
27.9543252  
21.65333663  
4.73749106  
14.90173872  
5.001397615  
8.616416534  
6.822683629  
1.654372736  
0.8319413484  
2.742131846  
3.608942502  
2.018450739  
2.103464418  
1.753648178  
0.6730408008  
0.5990679955  
1.263408488  
0.8362146806  
0.5856337717  
0.4311870563  
0.7188234805  
0.8066387014  
0.7686601535  
0.6337144869  
0.6560369396  
0.675897451  
0.5742952243  
0.5391820664  
0.5711933436  
0.4654817063  
0.4961559478  
0.4709496695  
0.4745130279  
0.4323693615  
0.4226668822  
0.4307637475  
0.4158261446  
0.3946915905  
0.3836032498  
0.3819770878  
0.3729121994  
0.3601001319  
0.3525082622  
0.3437781949  
0.3313365812  
0.3247474757  
0.3159811901  
0.3093160266  
0.3014704295  
0.294608053  
0.2891086344  
0.283621433  
0.2764947231  
0.2705354424  
0.2656142588  
0.259945717  
0.2539631079  
0.2490681766  
0.2442097691  
0.23953736  
0.2346662299  
0.2304178521  
0.2260327977  
0.2218832603  
0.2176636885  
0.2137913767  
0.2100668614  
0.2062679182  
0.2026664276  
0.1991445786  
0.1957084843  
0.1924237684  
0.1891871754  
0.1860401636  
0.1830079719  
0.1799972812  
0.1771229833  
0.1743147866  
0.1715780071  
0.1688836606  
0.1663059629  
0.1637851077  
0.1613089465  
0.158895252  
0.1565563014  
0.1542523707  
0.1520207733  
0.1498305681  
0.147708069  
0.1456256889  
0.1435942434  
0.1416074908  
0.1396738421  
0.1377807773  
0.1359308347  
0.1341256777  
0.1323529385  
0.1306234684  
0.1289343653  
0.1272814224  
0.1256630419  
0.1240759321  
0.1225269256  
0.1210060243  
0.1195247186  
0.1180725598  
0.1166486922  
0.1152515754  
0.1138852462  
0.1125470663  
0.1112311564  
0.1099523435  
0.108687295  
0.1074547651  
0.1062419539  
0.1050555793  
0.1038917726  
0.1027473509  
0.1016252602  
0.1005247941  
0.09944691939  
0.09838788216  
0.09735014216  
0.09633019503  
0.09532823132  
0.09434576543  
0.09338145081  
0.09243335018  
0.09150043248  
0.09058760169  
0.08969045191  
0.08880694798  
0.08793904301  
0.087090085  
0.08625020641  
0.08542944231  
0.08461437789  
0.08382282434  
0.08304103209  
0.0822748762  
0.08151792897  
0.08077251065  
0.08004457925  
0.07932462158  
0.07861820068  
0.07792115225  
0.07723547698  
0.07656687774  
0.07590216184  
0.07524769024  
0.07460816372  
0.07397394695  
0.07335532637  
0.07274228218  
0.07213584306  
0.07154594012  
0.07096235234  
0.07038690869  
0.06981955863  
0.06925905817  
0.06870965827  
0.06817351907  
0.06763695422  
0.06711212832  
0.06659674998  
0.06608609823  
0.06558251927  
0.06508878051  
0.06460013392  
0.06412104751  
0.06364522915  
0.06317937819  
0.06271512829  
0.06226356543  
0.06181654594  
0.06137406382  
0.06094003955  
0.06050871998  
0.06008847272  
0.05967286039  
0.05926018857  
0.05885645278  
0.0584563401  
0.05805971852  
0.05767156866  
0.05728845164  
0.05690886574  
0.05653370854  
0.05616637898  
0.0558033453  
0.05544268656  
0.05508903462  
0.05474212724  
0.05439522172  
0.05405608627  
0.05372054567  
0.05339093543  
0.0530635671  
0.05273688903  
0.05242225863  
0.0521063066  
0.05179338805  
0.05149043424  
0.05118665929  
0.05088797301  
0.05059109347  
0.05030119125  
0.05001485646  
0.04973297799  
0.04945169591  
0.04917529846  
0.04890185415  
0.04863181647  
0.04836484626  
0.04810158378  
0.0478402955  
0.04758344739  
0.04733003062  
0.04707953012  
0.0468351579  
0.04658717057  
0.04634745573  
0.04610933168  
0.04587440854  
0.04564048766  
0.04540855851  
0.04518202536  
0.04495858294  
0.04473402671  
0.04451666099  
0.04430143793  
0.04408525461  
0.04387393927  
0.04366487191  
0.04345960606  
0.04325381138  
0.04305463577  
0.04285457236  
0.04265895359  
0.04246269757  
0.04226990978  
0.04208100395  
0.04189133618  
0.04170827708  
0.04152247091  
0.04134369757  
0.04116371932  
0.04098729472  
0.04081115391  
0.04063683967  
0.04046756744  
0.04029882211  
0.04013224654  
0.03996530092  
0.03980194185  
0.03964179729  
0.03948389224  
0.03932306989  
0.03916760841  
0.03901283929  
0.03886186338  
0.03871205481  
0.0385622983  
0.03841621377  
0.03827196288  
0.03812642431  
0.03798472517  
0.03784549165  
0.03770833205  
0.0375673799  
0.03743178485  
0.03729750215  
0.03716699262  
0.03703363071  
0.03690548123  
0.03677804937  
0.03665212422  
0.03652563408  
0.03640036211  
0.03628079461  
0.03616056377  
0.03604068747  
0.03592331994  
0.0358072815  
0.03569168863  
0.03557597102  
0.03546272984  
0.03535341801  
0.03524244222  
0.03513379223  
0.03502450312  
0.03492037379  
0.03481490543  
0.03471143519  
0.03460834077  
0.03450786702  
0.0344065205  
0.03430783879  
0.03420974004  
0.03411607761  
0.03401860242  
0.03392311107  
0.03383229706  
0.03373960474  
0.033649078  
0.03355858291  
0.03346948437  
0.03338048557  
0.03329646612  
0.0332101036  
0.03312690077  
0.0330405244  
0.03295983715  
0.03287886383  
0.03279895243  
0.03271973424  
0.03263996441  
0.03256429319  
0.03248631954  
0.03241248264  
0.03233797557  
0.0322629617  
0.03218948278  
0.0321198318  
0.03204973605  
0.03197934274  
0.03191145172  
0.03184299413  
0.03177360967  
0.03171040991  
0.03164422403  
0.03157904605  
0.03151594367  
0.03145507433  
0.03139270186  
0.03132999459  
0.03127025693  
0.03121206043  
0.03115371665  
0.03109738058  
0.0310400396  
0.03098463068  
0.03092809826  
0.03087540785  
0.0308220436  
0.03076873942  
0.03071696504  
0.03066675824  
0.03061531336  
0.03056610574  
0.0305197334  
0.03046991778  
0.03042423996  
0.03037754172  
0.03033324305  
0.03028765425  
0.0302445107  
0.0302006898  
0.03015668757  
0.03011457447  
0.03007431832  
0.03003360642  
0.0299948898  
0.02995392365  
0.02991679147  
0.02988158696  
0.02984338451  
0.0298066166  
0.02977261325  
0.02973786518  
0.02970299212  
0.02966999418  
0.02963716149  
0.02960590152  
0.02957636876  
0.02954375152  
0.02951279199  
0.02948744194  
0.02945716667  
0.02943072353  
0.02940112336  
0.02937513415  
0.02934912992  
0.0293257056  
0.02930011226  
0.02927749437  
0.02925353962  
0.02923220076  
0.02920872908  
0.02918819996  
0.02916816715  
0.0291491237  
0.02912952118  
0.02911206045  
0.02909437223  
0.02907570463  
0.02906035278  
0.02904367281  
0.02902568772  
0.02901415079  
0.02900107748  
0.02898483807  
0.02897271821  
0.02895963136  
0.02894708708  
0.02893757577  
0.02892687448  
0.02891835372  
0.02890901874  
0.02890171394  
0.02889401992  
0.02888671021  
0.02888029366  
0.02887355332  
0.02886939919  
0.02886538385  
0.02885863578  
0.02885553156  
0.02885294038  
0.02885230791  
0.02885009141  
0.02884857432  
0.02885096773  
