8993.714446  
9564.448319  
10740.88001  
13185.30718  
18943.29767  
32852.3633  
42033.81066  
42299.82678  
31502.98313  
20631.1266  
11227.87816  
156.0325808  
19646.58559  
287.0198397  
4495.650969  
6699.750377  
3638.184531  
3724.872515  
8380.89296  
102.6871922  
4858.034508  
2490.380338  
22264.25493  
7118.278428  
13625.79893  
12910.1357  
2380.764699  
23103.06241  
5026.272602  
2293.313063  
909.4682878  
1394.595599  
2048.614082  
807.6146509  
8189.557589  
1948.881392  
1125.392829  
6332.881696  
3169.846173  
2215.201465  
381.8924073  
475.9637189  
116.1368315  
5411.83202  
2872.789781  
160.0442392  
4061.76997  
1138.042385  
4595.421258  
1297.697702  
15727.9135  
2333.982136  
5154.611838  
394.2272107  
533.8953201  
3678.281394  
7980.097954  
3699.136092  
4577.652531  
260.2141398  
2303.776328  
842.0048513  
1788.462421  
62.42913562  
925.4032866  
249.7404356  
34.00246503  
88.52165866  
531.2794393  
63.2876372  
303.675504  
230.2159749  
114.3330991  
96.80808642  
78.36986313  
80.51716318  
75.6679444  
108.1850353  
72.82612228  
62.60505428  
51.19377804  
57.69855594  
47.71370055  
57.42006998  
51.67844185  
46.90661583  
42.16690036  
41.14291463  
35.62779702  
33.45528354  
31.1480875  
30.21698622  
28.5641967  
26.07804455  
24.20118003  
23.41658733  
22.9252563  
21.26537943  
20.70168505  
19.36210357  
18.66304184  
17.63736874  
16.90634232  
16.17557978  
15.42302542  
14.82225511  
14.14627357  
13.49005273  
12.9687167  
12.40501068  
11.91603124  
11.46388639  
10.99652643  
10.56048332  
10.14188105  
9.763718045  
9.392425332  
9.036976849  
8.69730281  
8.387660757  
8.078923649  
7.794486465  
7.517308707  
7.257379711  
7.010675839  
6.769684482  
6.543877469  
6.32432871  
6.115503957  
5.916937042  
5.724876203  
5.542480038  
5.366714732  
5.198755551  
5.036860676  
4.882046866  
4.733631533  
4.590352212  
4.45315407  
4.321316338  
4.194499109  
4.072491993  
3.955245739  
3.842275214  
3.733549891  
3.628731563  
3.527797028  
3.430525368  
3.336800213  
3.246368017  
3.159148439  
3.074980289  
2.993769599  
2.915268474  
2.839553696  
2.766340108  
2.69563745  
2.627269531  
2.561175497  
2.497281382  
2.435429796  
2.37564493  
2.317713871  
2.261666956  
2.207411663  
2.15482343  
2.103891342  
2.054575082  
2.006741983  
1.960382485  
1.915443017  
1.871851186  
1.829561897  
1.788528007  
1.748704292  
1.710068483  
1.67255059  
1.636109646  
1.600734588  
1.566348739  
1.53296901  
1.500508866  
1.468972006  
1.438306137  
1.408504821  
1.379508562  
1.351300218  
1.323873694  
1.297177198  
1.271199319  
1.245914837  
1.221305331  
1.197346976  
1.174013059  
1.15128498  
1.129150685  
1.107584368  
1.086575481  
1.06609781  
1.046124188  
1.026669636  
1.007701345  
0.989199277  
0.9711580936  
0.9535576512  
0.9363908727  
0.9196453966  
0.9033055481  
0.8873552347  
0.8717866821  
0.856591476  
0.8417373305  
0.827262618  
0.813109829  
0.7992953977  
0.7857942156  
0.7726134336  
0.7597283919  
0.7471325151  
0.7348375338  
0.72281006  
0.7110626999  
0.6995595788  
0.6883328861  
0.6773427351  
0.6666010644  
0.6560843857  
0.64581614  
0.6357518548  
0.6259090459  
0.6162897545  
0.6068632608  
0.5976443914  
0.5886205858  
0.5797865428  
0.5711378169  
0.5626682069  
0.5543850447  
0.5462563784  
0.5383150101  
0.5305175733  
0.5228891122  
0.5154186552  
0.5080929348  
0.5009151053  
0.4938856944  
0.4869995299  
0.4802482773  
0.4736288951  
0.4671358565  
0.4607789609  
0.4545393592  
0.4484237974  
0.4424278769  
0.4365431235  
0.4307758421  
0.4251258234  
0.4195743646  
0.4141310553  
0.4087875574  
0.4035525502  
0.3984074837  
0.3933602111  
0.3884053827  
0.3835478119  
0.3787720788  
0.3740918232  
0.3695001323  
0.3649826591  
0.3605543334  
0.3562051276  
0.3519304084  
0.3477339699  
0.3436126595  
0.3395629781  
0.3355940121  
0.3316923785  
0.327847349  
0.3240828222  
0.3203846924  
0.3167476931  
0.3131690826  
0.3096571761  
0.3062031344  
0.3028166373  
0.299482718  
0.2962063225  
0.2929851409  
0.2898159731  
0.2867028778  
0.2836441298  
0.2806320767  
0.2776758905  
0.2747645788  
0.2719105605  
0.2690976224  
0.266331283  
0.2636048698  
0.260927162  
0.2582956368  
0.255710418  
0.2531649942  
0.2506589426  
0.2481917022  
0.2457679952  
0.2433779862  
0.2410326613  
0.2387241651  
0.2364522525  
0.2342088365  
0.2320099557  
0.2298461407  
0.2277103887  
0.2256115641  
0.223547174  
0.2215094883  
0.2195056759  
0.2175376542  
0.2155996303  
0.213694896  
0.2118065063  
0.2099582325  
0.2081307045  
0.2063356021  
0.204573369  
0.2028296184  
0.2011173438  
0.1994306581  
0.1977685843  
0.1961336943  
0.1945232271  
0.1929339335  
0.1913682358  
0.1898264129  
0.1883134421  
0.1868195122  
0.1853472604  
0.1839001056  
0.1824712081  
0.1810657594  
0.1796772583  
0.1783141927  
0.1769700738  
0.1756426838  
0.17433478  
0.1730516775  
0.1717843507  
0.170535206  
0.169308275  
0.1680932532  
0.1669047396  
0.1657248854  
0.16456533  
0.1634237496  
0.1622978566  
0.1611902296  
0.1600967944  
0.1590165581  
0.1579558073  
0.1569108643  
0.1558842473  
0.1548702449  
0.1538668203  
0.152880508  
0.1519090389  
0.1509539289  
0.1500081262  
0.1490810222  
0.1481632392  
0.1472631941  
0.1463697435  
0.1454951025  
0.144630623  
0.143781239  
0.1429407696  
0.1421143069  
0.1413014486  
0.1404960601  
0.1397115009  
0.1389304357  
0.1381628249  
0.1374060971  
0.1366579872  
0.1359279392  
0.1352060153  
0.1344920546  
0.1337896978  
0.133101479  
0.1324182546  
0.13174718  
0.1310880781  
0.1304378452  
0.1297984274  
0.1291640996  
0.1285398959  
0.1279337677  
0.1273270597  
0.1267313152  
0.1261511706  
0.1255735582  
0.1250059228  
0.1244494144  
0.123898989  
0.1233588343  
0.1228295745  
0.1223023232  
0.1217870827  
0.1212806542  
0.1207822205  
0.1202892289  
0.1198037923  
0.1193302191  
0.118861633  
0.1184025807  
0.117953001  
0.1175061339  
0.1170681368  
0.1166387202  
0.116218051  
0.1158001711  
0.1153936075  
0.1149897873  
0.1145952811  
0.1142091224  
0.1138300838  
0.1134570262  
0.1130868048  
0.1127264759  
0.1123748162  
0.1120262165  
0.1116869244  
0.1113512824  
0.1110235325  
0.1107026705  
0.1103895339  
0.1100778677  
0.1097775396  
0.1094819253  
0.1091898771  
0.1089055701  
0.1086266575  
0.1083550674  
0.1080888904  
0.1078282983  
0.1075748914  
0.1073239096  
0.1070812684  
0.1068412682  
0.1066083314  
0.10638735  
0.1061636756  
0.1059491185  
0.1057351923  
0.1055332941  
0.1053350847  
0.1051409549  
0.1049548229  
0.1047695632  
0.1045934704  
0.104422006  
0.1042542183  
0.1040921479  
0.1039378517  
0.1037865521  
0.1036415039  
0.1034984383  
0.1033653977  
0.1032324344  
0.1031093743  
0.102988815  
0.1028737539  
0.1027611521  
0.1026612693  
0.1025568561  
0.1024625008  
0.1023715529  
0.1022872771  
0.1022066328  
0.1021322352  
0.1020584078  
0.1019927017  
0.1019322727  
0.1018749111  
0.1018270493  
0.1017800554  
0.1017424092  
0.1017030844  
0.1016716135  
0.1016440025  
0.1016229447  
0.1016070166  
0.1015938574  
0.1015869112  
0.1015868837  
