2638.896877  
2808.075459  
3159.930633  
3882.525628  
5959.174089  
7441.692639  
37016.22465  
10013.10028  
3394.797945  
26242.93177  
43836.02849  
46624.00286  
4011.761506  
7933.242942  
4764.078857  
20955.67907  
1361.113233  
1031.230419  
1783.619972  
5763.587206  
3208.220106  
6282.258069  
723.9617414  
10179.8468  
17234.64341  
2614.520401  
881.3018103  
11174.92254  
9379.658936  
16631.20601  
3136.179183  
1498.990927  
748.0431273  
1822.758064  
2654.203367  
3816.14028  
5052.436758  
4784.341532  
25592.24354  
6526.04049  
14161.01195  
9967.183859  
207.8979093  
18506.65705  
9003.965042  
98.41311534  
114.7114577  
6439.879965  
4827.387928  
7492.836175  
7199.546953  
6429.662358  
3243.882749  
4290.733674  
521.740722  
1245.190682  
5856.877808  
1434.016277  
4015.516015  
2577.491077  
2714.754381  
482.4466259  
0.07758370846  
440.0822779  
465.1184563  
375.6371589  
4.828833659  
57.20769903  
87.93971508  
19.63375937  
1.445334141  
4.37004484  
71.76166774  
11.64443374  
19.38787158  
18.41959768  
24.94009542  
20.67417888  
19.5891988  
18.62649118  
18.29457311  
16.2140421  
11.67605763  
12.23567357  
11.62771708  
11.65981344  
10.2765014  
10.29717818  
10.59763235  
9.297609736  
8.908948249  
8.472572582  
8.297362995  
7.837092319  
7.468810864  
7.222810224  
7.100406636  
6.860154252  
6.427922127  
6.268839708  
6.068177067  
5.824095895  
5.622301684  
5.433882963  
5.263362979  
5.088353223  
4.891912119  
4.752450505  
4.611330199  
4.461670622  
4.329384473  
4.191565387  
4.069935008  
3.956316935  
3.840821939  
3.728001463  
3.626230836  
3.523593173  
3.428590831  
3.336373544  
3.249129309  
3.163167967  
3.082857364  
3.003641795  
2.929179358  
2.856965057  
2.787658382  
2.720372122  
2.655929736  
2.593509936  
2.533507097  
2.475652782  
2.419799291  
2.365627067  
2.313574477  
2.263175175  
2.214599624  
2.167560538  
2.12191151  
2.078015032  
2.035242117  
1.994036344  
1.954062219  
1.915345462  
1.877850956  
1.841427402  
1.806105178  
1.771906654  
1.738642805  
1.706390304  
1.675107828  
1.644718258  
1.615189916  
1.586473459  
1.558596352  
1.531468591  
1.505075024  
1.479484901  
1.454534699  
1.430261738  
1.406631056  
1.38362588  
1.361192546  
1.339361494  
1.318130625  
1.297397638  
1.277176201  
1.257510944  
1.238312456  
1.219620465  
1.20134062  
1.183541896  
1.166139652  
1.14918976  
1.132598814  
1.116420687  
1.100614109  
1.085188556  
1.07012366  
1.055376373  
1.040983281  
1.026921357  
1.013160601  
0.9997058199  
0.9865708682  
0.9737086659  
0.9611108405  
0.948773788  
0.9367025388  
0.9249456821  
0.9134034275  
0.902123456  
0.8910405619  
0.8802070537  
0.8696128833  
0.8591978766  
0.8489878004  
0.8390480008  
0.8292519239  
0.819684508  
0.8102881803  
0.8010834675  
0.7920702763  
0.7831854158  
0.7745234178  
0.7659792054  
0.7576605118  
0.7494478476  
0.7414075347  
0.7334974914  
0.7257710785  
0.7181734745  
0.7107188584  
0.7033815509  
0.6961948492  
0.689142396  
0.6822140195  
0.6753915851  
0.6687100329  
0.662140878  
0.6556754412  
0.6493547394  
0.6431140459  
0.636980942  
0.6309888118  
0.6250668938  
0.6192297266  
0.6135164897  
0.6079018028  
0.602387132  
0.5969394307  
0.5916082108  
0.586351363  
0.5811762721  
0.5760958266  
0.5710813458  
0.5661543474  
0.5613165147  
0.556565218  
0.5518562915  
0.5472415479  
0.5427018701  
0.5382512894  
0.5338280668  
0.529486962  
0.5252192466  
0.5210306336  
0.5168902718  
0.5128211755  
0.508816204  
0.5048643094  
0.5009798197  
0.4971435093  
0.4933644072  
0.4896365833  
0.4859658761  
0.4823679843  
0.4788233165  
0.4753002926  
0.4718672791  
0.4684410709  
0.4651021625  
0.4617846059  
0.4585355415  
0.4553242535  
0.4521688938  
0.4490173585  
0.4459565408  
0.4429240539  
0.4399211374  
0.436974731  
0.4340656658  
0.4312031255  
0.428362764  
0.425572477  
0.422829561  
0.4201183412  
0.4174477703  
0.4147931661  
0.4121880712  
0.4096159922  
0.4070915151  
0.4045766629  
0.4021075395  
0.3996770732  
0.3972902173  
0.3949131624  
0.3925500316  
0.3902536755  
0.3879763372  
0.3857366695  
0.3835229049  
0.3813243772  
0.3791876432  
0.3770273228  
0.3749215035  
0.3728466107  
0.3707916557  
0.3687743933  
0.3667554492  
0.364785958  
0.3628403713  
0.3609087482  
0.3590103732  
0.3571374701  
0.3552796645  
0.3534436459  
0.3516480753  
0.3498603612  
0.3480986521  
0.3463595649  
0.3446337915  
0.3429374768  
0.3412595398  
0.3396041862  
0.3379669634  
0.3363555764  
0.3347630491  
0.3331828768  
0.3316364481  
0.3300938037  
0.3285834876  
0.327070744  
0.3255868898  
0.3241291164  
0.322692758  
0.3212530613  
0.3198484336  
0.3184544195  
0.3170798174  
0.3157167291  
0.3143531755  
0.3130506104  
0.3117293465  
0.310439192  
0.3091511122  
0.307876687  
0.3066460062  
0.3054123377  
0.3041890959  
0.3029858303  
0.3018007861  
0.3006132047  
0.299451592  
0.2983005929  
0.2971698539  
0.2960478387  
0.2949414486  
0.2938388784  
0.2927775989  
0.2916980901  
0.290642129  
0.2896002407  
0.2885704538  
0.2875522517  
0.2865601242  
0.2855519864  
0.2845827582  
0.2836111415  
0.2826472081  
0.2817086049  
0.2807802727  
0.2798543814  
0.2789336241  
0.2780393698  
0.2771478621  
0.2762715961  
0.275399393  
0.2745450663  
0.2736865277  
0.2728595678  
0.2720463657  
0.2712174139  
0.2704101894  
0.2696040344  
0.2688232548  
0.2680533088  
0.2672902068  
0.2665238708  
0.2657854569  
0.2650459651  
0.2643174505  
0.2635988921  
0.2628927546  
0.2621876533  
0.2614982421  
0.2608055921  
0.2601377023  
0.2594628217  
0.2588144625  
0.2581687798  
0.2575114973  
0.2569033489  
0.2562776994  
0.2556526453  
0.2550547087  
0.2544617504  
0.2538583675  
0.2532704093  
0.2526989946  
0.2521399025  
0.2515815001  
0.2510426023  
0.2504898513  
0.2499578093  
0.2494252255  
0.2488975081  
0.2483807612  
0.2478806716  
0.2473811966  
0.2468908306  
0.246402543  
0.245921786  
0.24545805  
0.2450008894  
0.2445439838  
0.244088127  
0.2436461249  
0.2432118674  
0.2427860856  
0.2423631446  
0.2419454514  
0.2415432581  
0.2411412509  
0.2407268726  
0.2403588774  
0.2399705597  
0.2395956753  
0.2392309208  
0.2388659099  
0.2385069659  
0.2381597848  
0.2378193959  
0.2374931175  
0.2371610516  
0.236818384  
0.2365010843  
0.2361956892  
0.2358969533  
0.2355898178  
0.235302309  
0.2350073397  
0.2347214009  
0.2344493607  
0.234178461  
0.2339116758  
0.233655662  
0.23339228  
0.2331569164  
0.2329052282  
0.2326817453  
0.2324537075  
0.2322201827  
0.2320033178  
0.2318086094  
0.2315898087  
0.2313847047  
0.2311899906  
0.2309858417  
0.2308237986  
0.2306329753  
0.2304511696  
0.2302851382  
0.2301307524  
0.2299680256  
0.2298246734  
0.2296686427  
0.2295291113  
0.2293982257  
0.2292815209  
0.2291522942  
0.2290295719  
0.2288943176  
0.2288007916  
0.2287025903  
0.2286151082  
0.2285057403  
0.2284184581  
0.2283545443  
0.2282676917  
0.2281992352  
0.2281339175  
0.2280619762  
0.2280053862  
0.2279636875  
0.2279149592  
0.2278836062  
0.2278512691  
0.2278184039  
0.2277869511  
0.2277688619  
0.2277577725  
0.2277516688  
0.2277432476  
