-0.123400778  
-0.3593781796  
-0.577438042  
-0.7589844661  
-0.8879747693  
-0.9518223789  
-0.9420633869  
-0.8547664366  
-0.6907261473  
-0.4554531514  
-0.158983042  
0.1845073032  
0.5572784821  
0.9388356288  
1.306990313  
1.639164315  
1.913917372  
2.112604929  
2.221048826  
2.231049644  
2.141540555  
1.959208652  
1.698415865  
1.380347332  
1.031374965  
0.6807599731  
0.3578962495  
0.08939302752  
-0.1036549232  
-0.2078570598  
-0.2188864199  
-0.1417957334  
0.009768788549  
0.2153769944  
0.4504202361  
0.6891670016  
0.9078478288  
1.087388341  
1.215388165  
1.287145138  
1.30558964  
1.280209171  
1.225155478  
1.156836939  
1.09137925  
1.042297077  
1.018708881  
1.024291207  
1.057072625  
1.110033498  
1.172358268  
1.231116655  
1.273115788  
1.286644316  
1.262902678  
1.196946744  
1.088084035  
0.9397337683  
0.758826667  
0.5548900159  
0.3389745384  
0.1225812208  
-0.08328016057  
-0.2688119394  
-0.4258991748  
-0.5483474706  
-0.6319427547  
-0.674418644  
-0.6754068286  
-0.6364381041  
-0.5610097987  
-0.454709303  
-0.3253295122  
-0.1828851965  
-0.03942704645  
0.09142305596  
0.1952865274  
0.2581676389  
0.2678545025  
0.2154294408  
0.09670250115  
-0.08668048479  
-0.3266446653  
-0.6088160565  
-0.9134490046  
-1.217125932  
-1.495113471  
-1.724101523  
-1.884994429  
-1.965385652  
-1.961328465  
-1.878141327  
-1.730058856  
-1.538716773  
-1.330633534  
-1.133974491  
-0.9750319404  
-0.8748757102  
-0.8466400208  
-0.8938239114  
-1.009832503  
-1.178847691  
-1.377893554  
-1.579818322  
-1.756792988  
-1.883843497  
-1.941959683  
-1.920381966  
-1.817789622  
-1.642291299  
-1.410257965  
-1.144204673  
-0.8700365976  
-0.614027988  
-0.3998975876  
-0.2463258189  
-0.1651323957  
-0.1602661038  
-0.2276182893  
-0.3556146114  
-0.5264459425  
-0.71777065  
-0.904724481  
-1.062059147  
-1.166275267  
-1.197614855  
-1.141801349  
-0.9914325599  
-0.7469177182  
-0.416869113  
-0.01786922154  
0.4264429032  
0.8869696359  
1.331379215  
1.726822336  
2.042930995  
2.254821313  
2.34577131  
2.309266128  
2.150107814  
1.884398967  
1.538313631  
1.145735851  
0.7449659001  
0.3748478467  
0.070762031  
-0.1390544957  
-0.2364036795  
-0.2148874762  
-0.08030670308  
0.1503409944  
0.4511263505  
0.7904316356  
1.134727069  
1.452414361  
1.717233603  
1.910830844  
2.024171891  
2.057700923  
2.020254065  
1.926972615  
1.79654509  
1.648197611  
1.498900643  
1.361156907  
1.241695971  
1.141197236  
1.055050321  
0.97495807  
0.8911045258  
0.7944806528  
0.6789981003  
0.5430082204  
0.3899981  
0.2283344678  
0.07010427269  
-0.07075192806  
-0.180719102  
-0.2490265754  
-0.2696240808  
-0.2425065963  
-0.1741585954  
-0.07704185405  
0.03180855897  
0.1328919381  
0.2067450178  
0.2364855775  
0.2100460235  
0.1217709227  
-0.02680641484  
-0.2271390267  
-0.464728643  
-0.7209150422  
-0.9751456905  
-1.207390372  
-1.400388361  
-1.541415191  
-1.623390507  
-1.645177216  
-1.611123485  
-1.529948581  
-1.413186695  
-1.273457891  
-1.122823264  
-0.9714724178  
-0.8268872085  
-0.6935798423  
-0.5733640964  
-0.4660482882  
-0.3703868598  
-0.285093874  
-0.2096990232  
-0.1451172419  
-0.09381709098  
-0.05957426836  
-0.04686152498  
-0.05998432158  
-0.1021193341  
-0.1744283639  
-0.2753945463  
-0.4005124022  
-0.5423798714  
-0.6912262482  
-0.8357794351  
-0.9643825981  
-1.066217874  
-1.132468414  
-1.157269919  
-1.138354325  
-1.077291115  
-0.9793354597  
-0.8528928715  
-0.7086972078  
-0.5588010383  
-0.4154709095  
-0.2901421129  
-0.1924645102  
-0.1295447453  
-0.1054023231  
-0.1206479115  
-0.1723968592  
-0.2543979381  
-0.3573716197  
-0.469564984  
-0.5774875287  
-0.6668390352  
-0.723568324  
-0.7350211918  
-0.6910848049  
-0.5852147541  
-0.4152380732  
-0.1838220107  
0.1014800221  
0.4286448527  
0.7820172341  
1.143525607  
1.494119282  
1.815270675  
2.090368067  
2.305851177  
2.451955529  
2.523033518  
2.517464899  
2.437222794  
2.287238478  
2.074683167  
1.808308045  
1.497941587  
1.154170593  
0.7881960766  
0.4118078456  
0.03736577337  
-0.3222913847  
-0.6541213912  
-0.9453461409  
-1.184145371  
-1.360477095  
-1.466965943  
-1.499700284  
-1.458831179  
-1.348854034  
-1.178502586  
-0.960235672  
-0.7093526173  
-0.4428102369  
-0.1778760505  
0.06924742699  
0.2846849354  
0.4579000937  
0.5823642184  
0.6558268081  
0.6801699159  
0.6608754515  
0.606179761  
0.5260103176  
0.4308183849  
0.3304349236  
0.2330781064  
0.144614225  
0.06815517937  
0.004037601276  
-0.04980872265  
-0.09716658404  
-0.1425851666  
-0.1903345966  
-0.243391636  
-0.3026263162  
-0.3663170252  
-0.43008187  
-0.487253536  
-0.5296677136  
-0.5487620441  
-0.5368266341  
-0.4882365372  
-0.40047882  
-0.2748208909  
-0.116512157  
0.06551293653  
0.2594087207  
0.4515651553  
0.6279864813  
0.7757225569  
0.8841775367  
0.9461438635  
0.958435764  
0.9220779819  
0.8420266344  
0.7264836368  
0.5859001805  
0.4317868243  
0.2754764063  
0.1269760563  
-0.005969495503  
-0.1185035782  
-0.2089237834  
-0.2785511031  
-0.3312546953  
-0.3726714486  
-0.4092424506  
-0.4471737854  
-0.4914646768  
-0.5451214452  
-0.608655094  
-0.6799195267  
-0.7543199433  
-0.8253385596  
-0.8853197435  
-0.926411634  
-0.9415469783  
-0.9253387601  
-0.8748112244  
-0.7898712452  
-0.673479786  
-0.5315140047  
-0.3723299622  
-0.206080212  
-0.04383103514  
0.1034104373  
0.2256993448  
0.3150603809  
0.3662299756  
0.3771500291  
0.3491436601  
0.2867591811  
0.1972820185  
0.08996180837  
-0.02497342231  
-0.1373914435  
-0.2383080381  
-0.3207917767  
-0.3806048804  
-0.4165126929  
-0.4302224113  
-0.4259690323  
-0.4098032973  
-0.3886724557  
-0.369423063  
-0.3578338799  
-0.3578100767  
-0.3708363695  
-0.3957455122  
-0.4288534033  
-0.4644358793  
-0.4955166658  
-0.514872946  
-0.5161617089  
-0.4949998826  
-0.4498871219  
-0.3827892151  
-0.2992818087  
-0.2081586476  
-0.120501422  
-0.0482544184  
-0.00245875165  
0.00864441311  
-0.01862896337  
-0.08209104592  
-0.1730607534  
-0.2766537071  
-0.3730613304  
-0.4397553335  
-0.4544146796  
-0.398222115  
-0.2590772773  
-0.03423011489  
0.2681141358  
0.6285554625  
1.017795372  
1.399401127  
1.733745261  
1.982644571  
2.114073292  
2.10629717  
1.950843147  
1.653884959  
1.235843693  
0.7292709888  
0.175332882  
-0.3806084356  
-0.893712164  
-1.324060353  
-1.640240105  
-1.821736295  
-1.859986383  
-1.758128926  
-1.529657397  
-1.196279101  
-0.7853426648  
-0.3271741488  
0.1474091819  
0.6092137916  
1.032323549  
1.395277531  
1.681815786  
1.881270729  
1.988661057  
2.004561425  
1.934768063  
1.789763092  
1.583987116  
1.334901963  
1.061862717  
0.7848423767  
0.5230767552  
0.2937224772  
0.1106490779  
-0.01652719364  
-0.08307183035  
-0.08935298567  
-0.04062902406  
0.05358257569  
0.1804902896  
0.3252805458  
0.4725231209  
0.6075939325  
0.7179865442  
0.794392604  
0.8314456356  
0.8280530656  
0.787272435  
0.7157329689  
0.6226491552  
0.5185060285  
0.4135692715  
0.3163594164  
0.2322986633  
0.1626885414  
0.1041928817  
0.04892877479  
-0.01478665672  
-0.1010633505  
-0.2245556389  
-0.3982624975  
-0.6312575004  
-0.9266542579  
-1.280089981  
-1.6789742  
-2.10271506  
-2.523956141  
-2.910814964  
-3.229902697  
-3.449839651  
-3.544858577  
-3.498062791  
-3.303901716  
-2.969515397  
-2.514712008  
-1.97051701  
-1.376407666  
-0.7765272392  
-0.2153121231  
0.2669442355  
0.6380676072  
0.877024766  
0.9756502709  
0.9388949037  
0.783602229  
0.5360238904  
0.2284445573  
-0.1046483597  
-0.4303351919  
-0.7205182801  
-0.9543120108  
-1.119340526  
-1.211883608  
-1.235977522  
-1.20167733  
-1.122824934  
-1.014633843  
-0.891456504  
-0.7649862659  
-0.643086675  
-0.5293172365  
-0.4231309673  
-0.3206332425  
-0.2157237517  
-0.1014273473  
0.02876700782  
0.1797554639  
0.3539273043  
0.5506388517  
0.7660399562  
0.9932554822  
1.222859537  
1.443586109  
1.643232195  
1.809663093  
1.931876986  
2.001056782  
2.011532875  
1.961578959  
1.85394796  
1.696060649  
1.499783128  
1.280735534  
1.057150702  
0.8483308336  
0.672826753  
0.5465113713  
0.4807666735  
0.4810136525  
0.5458016072  
0.6666231433  
0.8285313431  
1.01155215  
1.192748027  
1.348712365  
1.458193885  
1.504509567  
1.477440161  
1.3743516  
1.200398667  
0.96778504  
0.6941792416  
0.4005191509  
0.1084809413  
-0.162038057  
-0.395114017  
-0.5803904548  
-0.713897526  
-0.7980209779  
-0.8406604066  
-0.8537176478  
-0.8511411268  
-0.8467992743  
-0.8524633034  
-0.8761642558  
-0.9211266279  
-0.9854065114  
-1.062253422  
-1.141143271  
-1.209323883  
-1.253655131  
-1.26250075  
-1.227426304  
-1.144478368  
-1.014901007  
-0.8451908646  
-0.6465240289  
-0.4335987333  
-0.223077135  
-0.0317901487  
0.1250733952  
0.2355928094  
0.2923822252  
0.293359147  
0.2419447662  
0.1466755765  
0.02027892765  
-0.1216826273  
-0.2624603101  
-0.3858521566  
-0.4778554377  
-0.5280447707  
-0.5305185462  
-0.4843318935  
-0.3933619254  
-0.2656611065  
-0.1123613561  
0.05367490627  
0.2193173683  
0.3725358303  
0.5035100437  
0.6053641859  
0.6744697967  
0.7103118689  
0.7149990053  
0.6925287774  
0.6479484828  
0.5865569813  
0.5132673765  
0.4322066124  
0.3465834113  
0.2588000667  
0.1707512247  
0.08421913894  
0.001260942674  
-0.07548626067  
-0.1426706062  
-0.1962850896  
-0.2319405197  
-0.2453300789  
-0.232829493  
-0.1921762109  
-0.1231310125  
-0.02803019191  
0.08785983305  
0.2162875993  
0.3463179442  
0.4650300498  
0.5585874834  
0.6136245279  
0.6187924795  
0.5663107274  
0.4532820884  
0.2825704934  
0.06304033432  
-0.190939186  
-0.4607599973  
-0.7254946021  
-0.964269211  
-1.158767391  
-1.295525842  
-1.367655083  
-1.3756989  
-1.327475827  
-1.236857373  
-1.121655696  
-1.000915188  
-0.8920150908  
-0.8080319908  
-0.7557986899  
-0.7349643216  
-0.7382062215  
-0.7525841837  
-0.7617802022  
-0.7488946541  
-0.6993144918  
-0.6032138695  
-0.4572854595  
-0.2654421653  
-0.0384153855  
0.2076697991  
0.4534892688  
0.6791302489  
0.8666912185  
1.002524033  
1.078781901  
1.094095688  
1.053352727  
0.9666459517  
0.84763381  
0.7115518944  
0.5732100282  
0.4452519721  
0.3368657646  
0.2531063709  
0.1948300288  
0.1591805329  
0.1404938793  
0.1314409658  
0.1242039539  
0.1115455593  
0.08762566782  
0.04850933073  
-0.007635334222  
-0.08061855144  
-0.168508725  
-0.2680051057  
-0.3748520316  
-0.4841981705  
-0.5908819793  
-0.6896498104  
-0.7753201434  
-0.8429527241  
-0.8880493829  
-0.9068422509  
-0.8966541018  
-0.8563139417  
-0.786572282  
-0.6904148446  
-0.573198193  
-0.4424985979  
-0.3076340774  
-0.1788305537  
-0.0660989527  
0.02206536869  
0.07999708507  
0.1059721915  
0.1029136101  
0.07850735952  
0.04463024759  
0.01606520835  
0.008624835719  
0.03688157797  
0.1118220307  
0.2387722935  
0.4159349162  
0.6338294814  
0.8757894895  
1.119535251  
1.339660039  
1.510722526  
1.610527638  
1.623117932  
1.541044245  
1.366566232  
1.111576795  
0.7962779885  
0.4467773083  
0.09196869548  
-0.239851869  
-0.5241449892  
-0.7426311818  
-0.8848156699  
-0.9483833711  
-0.9384807301  
-0.8660942402  
-0.7458146754  
-0.5934070864  
-0.4235524681  
-0.2481012242  
-0.07505830614  
0.09161603173  
0.2514335337  
0.4062347565  
0.5586984058  
0.7108247442  
0.862659587  
1.011471225  
1.151519121  
1.274431833  
1.370108829  
1.427987747  
1.438483596  
1.394345209  
1.291766659  
1.131084602  
0.9169852621  
0.6582426623  
0.3670329634  
0.05795610713  
-0.2530960283  
-0.5500813381  
-0.8178566728  
-1.043036344  
-1.214656546  
-1.324630343  
-1.368040172  
-1.343309114  
-1.252282861  
-1.100234855  
-0.8957692107  
-0.6505987677  
-0.3791175015  
-0.09773760266  
0.1760392338  
0.424802745  
0.6325822324  
0.7862521251  
0.8768123012  
0.9003661659  
0.8586327092  
0.7588650706  
0.6131314365  
0.4370123219  
0.2478509067  
0.06278262261  
-0.103203534  
-0.2388923118  
-0.3379391551  
-0.3992850501  
-0.4268488269  
-0.4285519183  
-0.4148586152  
-0.3970488327  
-0.3855095035  
-0.3882856851  
-0.4101113768  
-0.4520159694  
-0.5115535366  
-0.5835466076  
-0.6612010733  
-0.737375735  
-0.8057768614  
-0.861903414  
-0.9035800963  
-0.9310456182  
-0.9466186281  
-0.9540342179  
-0.9576132918  
-0.9614138037  
-0.9685186667  
-0.9805609538  
-0.9975190594  
-1.017777681  
-1.038373297  
-1.055344021  
-1.064090209  
-1.059686039  
-1.037124455  
-0.9915132233  
-0.9182821588  
-0.8134716279  
-0.6741593199  
-0.4990318595  
-0.2890773066  
-0.04828766943  
0.2157665467  
0.4916571776  
0.764283445  
1.015612178  
1.22601245  
1.376113331  
1.4489828  
1.43239171  
1.32081178  
1.116842805  
0.8317836441  
0.4851706216  
0.1032438705  
-0.2835333406  
-0.6436457548  
-0.9479887486  
-1.17317624  
-1.304228321  
-1.336251499  
-1.274848841  
-1.135188984  
-0.9398270622  
-0.7155958354  
-0.4899871281  
-0.287558611  
-0.1268635357  
-0.01835387706  
0.03647505202  
0.04460418471  
0.0197918871  
-0.02003617758  
-0.05587278019  
-0.07069507502  
-0.05203677559  
0.006303637893  
0.1036481189  
0.2329280882  
0.3821649939  
0.5366086812  
0.6811680299  
0.8027303062  
0.8919853639  
0.9445181056  
0.9610383914  
0.9467823266  
0.9102488391  
0.8615358539  
0.8105675774  
0.7655329718  
0.7317512986  
0.7111274655  
0.7022376104  
0.7009698354  
0.7015840465  
0.6979662312  
0.68486646  
0.6589103142  
0.6192467766  
0.5677267623  
0.5086495216  
0.4481146531  
0.3931316457  
0.350611678  
0.3264260139  
0.3246265539  
0.3469388586  
0.3925560437  
0.458220504  
0.5385663852  
0.6266384847  
0.7145312925  
0.7940838532  
0.857571959  
0.8983750867  
0.9115797937  
0.8944996034  
0.8470742805  
0.7721117561  
0.6753126512  
0.5650210044  
0.4516667645  
0.3468725602  
0.2622590844  
0.2080328054  
0.1914897356  
0.2156232522  
0.2780525356  
0.3704681392  
0.4787665761  
0.5839553344  
0.6638217322  
0.6952197267  
0.6567589567  
0.5315490413  
0.3096574899  
-0.01008271905  
-0.4191925272  
-0.8997636963  
-1.425792337  
-1.96549276  
-2.484313809  
-2.948284491  
-3.327252288  
-3.597631379  
-3.744312644  
-3.761568465  
-3.652893484  
-3.42990093  
-3.110513095  
-2.716758668  
-2.272500634  
-1.801406854  
-1.325352992  
-0.8633676359  
-0.4311169779  
-0.04080613822  
0.2986311932  
0.5812394927  
0.8037678588  
0.965498664  
1.068181837  
1.116022143  
1.11562757  
1.075801936  
1.007104521  
0.9211436865  
0.8296167983  
0.7431945925  
0.6703889517  
0.6165696809  
0.5833108629  
0.5681896654  
0.5651439592  
0.5653703343  
0.5587062342  
0.5353166473  
0.4874686713  
0.4111370943  
0.3071633459  
0.18178165  
0.04633252757  
-0.08382816207  
-0.1911708006  
-0.2583481521  
-0.2707830956  
-0.2191001198  
-0.101049323  
0.07742464913  
0.3021784325  
0.5520123847  
0.8008757034  
1.020878753  
1.185717452  
1.274052652  
1.27233619  
1.176676591  
0.9934429189  
0.7384920922  
0.435129335  
0.1110855717  
