-0.1532161392  
0.2918682723  
0.7056639688  
1.05873002  
1.328748466  
1.502778471  
1.578283452  
1.562846632  
1.472662243  
1.330074001  
1.16052261  
0.9893438155  
0.8388376179  
0.7259780696  
0.661005504  
0.6470020387  
0.6804003517  
0.7522474066  
0.8499497106  
0.9591998186  
1.065783056  
1.157051507  
1.222920448  
1.256372626  
1.253527459  
1.213403843  
1.137527346  
1.029514382  
0.8947163534  
0.7399372376  
0.5731905953  
0.403402131  
0.239965062  
0.09210475054  
-0.03197744179  
-0.126080567  
-0.1869644057  
-0.2151009923  
-0.2150015728  
-0.1949736613  
-0.1662154482  
-0.141311824  
-0.1322899066  
-0.1485333253  
-0.1948985787  
-0.270403712  
-0.3677834165  
-0.4740927729  
-0.5723572719  
-0.6440934882  
-0.67235072  
-0.6447901568  
-0.5562874861  
-0.410578981  
-0.2205820987  
-0.007248216893  
0.2029897776  
0.3818493735  
0.5033994225  
0.5481873197  
0.5066259395  
0.3810571487  
0.1860870846  
-0.05294467948  
-0.3032242411  
-0.5290037443  
-0.6967799329  
-0.7803092135  
-0.7646877781  
-0.6488044484  
-0.4457653643  
-0.1811622407  
0.1105795742  
0.3912239082  
0.6243412721  
0.7806487652  
0.842226973  
0.8049554551  
0.6787873586  
0.4858442109  
0.2566515231  
0.02513884728  
-0.1767781466  
-0.3241555067  
-0.4027353934  
-0.410838127  
-0.3591625459  
-0.2685788429  
-0.1663102947  
-0.08117363208  
-0.03866756195  
-0.05672041817  
-0.1427587047  
-0.2925435567  
-0.4908988962  
-0.714165029  
-0.9339247706  
-1.12137869  
-1.251656026  
-1.307400227  
-1.281109465  
-1.175927981  
-1.004846763  
-0.7885162566  
-0.5520765822  
-0.3215331849  
-0.120243172  
0.03398583676  
0.1308025366  
0.1680463715  
0.1513011143  
0.09244933205  
0.007543635468  
-0.08564065146  
-0.1699778879  
-0.2309847827  
-0.2582088231  
-0.2459261142  
-0.1931773117  
-0.1032599671  
0.01713506254  
0.1589468095  
0.3117581507  
0.4646766389  
0.6070284285  
0.7288754948  
0.8214051788  
0.8772797302  
0.8910021059  
0.8593512937  
0.7818563378  
0.6612536935  
0.503796574  
0.3192860782  
0.1206816839  
-0.07678552935  
-0.2570022707  
-0.4047685124  
-0.5077830905  
-0.5585380361  
-0.5557857773  
-0.5052555522  
-0.4193878926  
-0.3159866779  
-0.2158627711  
-0.139739157  
-0.104848152  
-0.1217582351  
-0.1919811813  
-0.3068459082  
-0.4479434797  
-0.5892118872  
-0.7004618559  
-0.7518842757  
-0.7188812943  
-0.5864831007  
-0.3526190393  
-0.02966317348  
0.3560721606  
0.7669383239  
1.158331305  
1.484307834  
1.703649053  
1.785529214  
1.713983449  
1.490531915  
1.134571753  
0.6814524563  
0.1784643684  
-0.3207520966  
-0.7626555046  
-1.100294598  
-1.299005761  
-1.340590085  
-1.225448043  
-0.9723874936  
-0.6161502358  
-0.2029667292  
0.2152749198  
0.5874994263  
0.8697049217  
1.030226385  
1.053320675  
0.9406596017  
0.710567515  
0.3951652995  
0.03585134683  
-0.3222473773  
-0.6360949919  
-0.8700653121  
-1.000091282  
-1.016140825  
-0.9227743346  
-0.7377857066  
-0.4892022627  
-0.2111188866  
0.06102246926  
0.2950397401  
0.4658900922  
0.5583369691  
0.5681078403  
0.5014719139  
0.3734030494  
0.204675802  
0.01838541289  
-0.1635525007  
-0.3234064509  
-0.4497004026  
-0.5381037494  
-0.5910589804  
-0.6162898866  
-0.6244872448  
-0.6266155417  
-0.6312988926  
-0.6427672718  
-0.6597063087  
-0.6752386198  
-0.678051616  
-0.6545234404  
-0.5915104975  
-0.4793408648  
-0.314509189  
-0.1015782871  
0.1461065677  
0.4071048803  
0.653998345  
0.8567047454  
0.9865728511  
1.020681243  
0.9456909107  
0.760643504  
0.4782171266  
0.12416696  
-0.2650701722  
-0.6463487568  
-0.9748937555  
-1.209819972  
-1.319378913  
-1.28522022  
-1.105099032  
-0.7936443485  
-0.381056678  
0.09012684649  
0.5698217129  
1.006158961  
1.351512667  
1.568052095  
1.63213478  
1.537001501  
1.293460615  
0.9284863886  
0.4819420143  
0.001860901082  
-0.461109942  
-0.859404009  
-1.153682758  
-1.316844919  
-1.336482418  
-1.215577604  
-0.9714687494  
-0.6333115997  
-0.2384317095  
0.1719572311  
0.5571494285  
0.8809793131  
1.115107905  
1.241278367  
1.252410087  
1.152525392  
0.9556083561  
0.6836089844  
0.3638591556  
0.02618610765  
-0.299964687  
-0.5881438231  
-0.8170244262  
-0.9718893906  
-1.045409557  
-1.037697267  
-0.9557000029  
-0.8120465049  
-0.6234829487  
-0.4090789525  
-0.188369336  
0.02039448288  
0.2017325893  
0.3440479971  
0.4402821834  
0.4880751367  
0.4894577333  
0.450136356  
0.3784831035  
0.2843641539  
0.1779501953  
0.06865992542  
-0.03565959537  
-0.129227435  
-0.2084659337  
-0.2718025002  
-0.3191899237  
-0.3514561017  
-0.3696011834  
-0.3741862177  
-0.3649161416  
-0.3405170431  
-0.2989194058  
-0.2377462675  
-0.1550107564  
-0.04990495884  
0.07645022685  
0.2204444752  
0.3757182716  
0.5332737412  
0.6819809773  
0.8094421019  
0.9031286947  
0.9516746873  
0.9461711461  
0.8813238238  
0.7563166914  
0.575287969  
0.3473274213  
0.08598067643  
-0.1917091964  
-0.4665562786  
-0.7188486416  
-0.9300808852  
-1.084634156  
-1.171237416  
-1.18406622  
-1.123371744  
-0.9955707707  
-0.8127911564  
-0.5918976925  
-0.3530824207  
-0.1181245942  
0.09153849099  
0.256765199  
0.3625307383  
0.3994391493  
0.364764314  
0.2628977124  
0.1051108953  
-0.09138890561  
-0.3050544287  
-0.5121214796  
-0.6890453202  
-0.8150022008  
-0.874159877  
-0.857449166  
-0.763605905  
-0.5993341687  
-0.3785658981  
-0.1208794211  
0.1507149885  
0.4123526897  
0.6419326097  
0.8214325103  
0.9386679462  
0.9882741524  
0.971834867  
0.8971908517  
0.7770477066  
0.6271109699  
0.4639943311  
0.3031860799  
0.1573142983  
0.0349248404  
-0.06010410205  
-0.1284564737  
-0.1746178332  
-0.2055926661  
-0.2292995675  
-0.2528991076  
-0.2813255719  
-0.3162793831  
-0.3558642126  
-0.3949529632  
-0.4262451096  
-0.4418509808  
-0.4351215855  
-0.402400984  
-0.3443399169  
-0.2665070241  
-0.1791063965  
-0.09579919436  
-0.03175920597  
-0.001269973558  
-0.01523589573  
-0.07906425557  
-0.1912733461  
-0.3431232034  
-0.5193643596  
-0.7000223113  
-0.8629574046  
-0.9868034918  
-1.053817973  
-1.052220432  
-0.9776640517  
-0.8336748012  
-0.631042931  
-0.3863411843  
-0.1198613658  
0.1466825951  
0.3923456356  
0.5987702454  
0.7514822801  
0.840629306  
0.8612285788  
0.8130673722  
0.7003960917  
0.5315491303  
0.3185408015  
0.07664246963  
-0.1761429655  
-0.4198003083  
-0.6333302075  
-0.7961221047  
-0.8896547134  
-0.8993935873  
-0.8166712825  
-0.6402738395  
-0.3774268005  
-0.04393528289  
0.3366825055  
0.7350901964  
1.118906623  
1.456068744  
1.718359237  
1.884636721  
1.943296368  
1.893600931  
1.745650275  
1.518970012  
1.23989512  
0.9381077103  
0.6428265801  
0.3791951169  
0.1653953585  
0.01088729383  
-0.08398555695  
-0.1270253578  
-0.1320453807  
-0.115954238  
-0.09557292892  
-0.08472101107  
-0.0920287387  
-0.1198288303  
-0.164251073  
-0.2164597394  
-0.2647697368  
-0.297231152  
-0.3042151308  
-0.2805410051  
-0.2267587214  
-0.1493809724  
-0.06000391442  
0.02652048065  
0.0945595992  
0.1303986229  
0.1246982005  
0.07428075135  
-0.01709096895  
-0.1390908144  
-0.2763649574  
-0.4109735976  
-0.5253767548  
-0.605458516  
-0.643076268  
-0.6376692185  
-0.5966244403  
-0.5342703476  
-0.4696220057  
-0.4232075636  
-0.4134634264  
-0.4533003503  
-0.5473968669  
-0.6907175641  
-0.8685425494  
-1.058071522  
-1.231421366  
-1.359601281  
-1.416878641  
-1.384873655  
-1.255717846  
-1.033762141  
-0.7355032253  
-0.3876910946  
-0.02386064389  
0.3201960297  
0.6113309081  
0.8235396421  
0.9413460662  
0.9615518542  
0.8930893339  
0.7550436291  
0.5732300559  
0.3759281559  
0.189526061  
0.03478950961  
-0.07565070096  
-0.1382515778  
-0.1579020459  
-0.1458903588  
-0.1169685488  
-0.08610556913  
-0.06554747024  
-0.06269827365  
-0.07914653161  
-0.1109425831  
-0.149973991  
-0.1861162023  
-0.2096952958  
-0.2137634494  
-0.1957701011  
-0.1582969857  
-0.1087528879  
-0.05807476144  
-0.01868844055  
-0.002085994605  
-0.01646521467  
-0.06484883767  
-0.1440218177  
-0.2444900418  
-0.3514910123  
-0.446912342  
-0.5118251717  
-0.5292514459  
-0.4867566058  
-0.378477409  
-0.2063126177  
0.01988446105  
0.28312768  
0.561019457  
0.8281331161  
1.058777215  
1.229799023  
1.323105075  
1.327634463  
1.240552624  
1.067565633  
0.8223255842  
0.525008577  
0.2002316385  
-0.1254546776  
-0.4262260285  
-0.6795074883  
-0.8680983161  
-0.9816687932  
-1.017485686  
-0.9802858272  
-0.8813272433  
-0.7367323212  
-0.5653273057  
-0.3862603343  
-0.2167093473  
-0.06999629794  
0.04562055882  
0.1273137884  
0.1771654254  
0.2008651417  
0.2058814068  
0.1994514615  
0.1867800023  
0.1698198279  
0.1468956147  
0.1132723139  
0.06259199609  
-0.01108208633  
-0.1110266617  
-0.2358855954  
-0.3784216911  
-0.5253409632  
-0.6583418755  
-0.7563481991  
-0.798612487  
-0.7682316177  
-0.6554692677  
-0.4602791129  
-0.1935164067  
0.1234809486  
0.460992812  
0.7844644178  
1.059016835  
1.254228714  
1.348449648  
1.331945468  
1.208355932  
0.9942106675  
0.7165698845  
0.4091535051  
0.1075726731  
-0.1555790579  
-0.3550179686  
-0.4757910516  
-0.5146047493  
-0.4793268684  
-0.3868289589  
-0.2596062478  
-0.1217886253  
0.004766686363  
0.1036537984  
0.1658990335  
0.190468781  
0.1833405241  
0.1553993512  
0.1196319944  
0.0881910058  
0.06991103401  
0.06872161398  
0.08323581591  
0.107523838  
0.1328659048  
0.1500671083  
0.1518270636  
0.1346381738  
0.09981100044  
0.05338536546  
0.004945789034  
-0.0344396834  
-0.05471918229  
-0.04927642269  
-0.01674839953  
0.03817518072  
0.1051915017  
0.1700336408  
0.2170683474  
0.2323619166  
0.2066480961  
0.137604603  
0.03096706022  
-0.09979138771  
-0.2352344612  
-0.3529369424  
-0.4311819277  
-0.4527587462  
-0.4081943446  
-0.2978459008  
-0.1324460936  
0.06804813475  
0.2771557153  
0.4657273142  
0.606366993  
0.6776997231  
0.6678173454  
0.5763241936  
0.414642597  
0.2045121897  
-0.02510937977  
-0.2422779104  
-0.4167678895  
-0.5245496769  
-0.5513514373  
-0.4947818986  
-0.3647114716  
-0.1818848372  
0.02500319425  
0.2233025054  
0.3808849964  
0.4704406012  
0.4730142181  
0.3803203251  
0.1955854839  
-0.06711204534  
-0.3848196434  
-0.7286490815  
-1.067224117  
-1.370152804  
-1.611095506  
-1.770111533  
-1.835112689  
-1.802392958  
-1.676342235  
-1.468530637  
-1.196383739  
-0.8816453752  
-0.5487845407  
-0.2234140117  
0.06926854719  
0.3060419717  
0.4672547568  
0.5384355938  
0.5118466363  
0.3877989773  
0.1755203758  
-0.1066879681  
-0.4322287442  
-0.7680430281  
-1.077488566  
-1.324070088  
-1.475640159  
-1.508567552  
-1.411265764  
-1.186529122  
-0.8521979788  
-0.4399148308  
0.00802686414  
0.4434377237  
0.8180337454  
1.089528361  
1.227184389  
1.216021805  
1.059046374  
0.7771307009  
0.406502955  
-0.005850899887  
-0.4082689737  
-0.7511342985  
-0.9933225812  
-1.107468122  
-1.083333139  
-0.9288210184  
-0.6685324148  
-0.3400903367  
0.0112106536  
0.3386619624  
0.6004269192  
0.7649914733  
0.8150676382  
0.7494624942  
0.5827396689  
0.3427932273  
0.06673963016  
-0.2042568747  
-0.430492303  
-0.5788390054  
-0.6268100632  
-0.5650989117  
-0.3983369643  
-0.1440540253  
0.1699523975  
0.5094308206  
0.8381633854  
1.122522253  
1.335552233  
1.460068348  
1.490427181  
1.432780746  
1.303822211  
1.128207055  
0.935012442  
0.7537020942  
0.610129178  
0.523112537  
0.5020224033  
0.5456941373  
0.6428011921  
0.7736034609  
0.9128252366  
1.033242858  
1.109482466  
1.121513078  
1.057365408  
0.914740111  
0.7013276968  
0.4338396626  
0.1359209514  
-0.1647408447  
-0.4397144273  
-0.6631121575  
-0.8144540425  
-0.8807912179  
-0.8578745072  
-0.7502677286  
-0.5704631312  
-0.3371486663  
-0.07288909427  
0.1984713081  
0.4543493854  
0.6756069882  
0.8481400134  
0.9637307421  
1.020136106  
1.020489457  
0.9721854221  
0.8854742687  
0.7719989664  
0.6434929478  
0.5107723326  
0.3831001025  
0.2678848578  
0.1706319893  
0.09501756455  
0.04295427303  
0.01456933958  
0.008075513674  
0.0195919064  
0.04303374714  
0.07022521617  
0.09137326401  
0.09597448978  
0.07413361672  
0.01815687712  
-0.07581971798  
-0.2064808995  
-0.3665781277  
-0.5430231118  
-0.7179826729  
-0.8709278783  
-0.9814493119  
-1.032437673  
-1.013165949  
-0.9217257172  
-0.7663557713  
-0.565323529  
-0.3452232117  
-0.1378265881  
0.02416076093  
0.1118541271  
0.1047632999  
-0.005539291791  
-0.2132817657  
-0.4983182025  
-0.8280734141  
-1.161447024  
-1.454198526  
-1.665107491  
-1.762024594  
-1.726912718  
-1.559092364  
-1.276123165  
-0.9120975428  
-0.5134904825  
-0.1330783107  
0.1772505369  
0.3737853472  
0.4273159659  
0.3275528524  
0.084938829  
-0.2704464549  
-0.6928074555  
-1.126838589  
-1.515347743  
-1.807208556  
-1.964492022  
-1.967734465  
-1.818576426  
-1.539387027  
-1.169932474  
-0.761578957  
-0.3698852711  
-0.04668240857  
0.167200473  
0.2474944168  
0.1895358747  
0.008369446887  
-0.2640428504  
-0.5840498383  
-0.9031248161  
-1.175185357  
-1.363291597  
-1.444695298  
-1.41350836  
-1.2806517  
-1.071185996  
-0.8195437702  
-0.5635005643  
-0.3378929305  
-0.1691050015  
-0.071172835  
-0.0440749633  
-0.07440121991  
-0.1382198725  
-0.2056114132  
-0.2461088298  
-0.2341665054  
-0.1537978984  
-0.001674380447  
0.2117845006  
0.4635018168  
0.7208691957  
0.9464834167  
1.103845421  
1.163225576  
1.106863794  
0.932743926  
0.6563414597  
0.3099925597  
-0.06015670675  
-0.3993308309  
-0.6508448504  
-0.7635148462  
-0.6987907977  
-0.4366278638  
0.02075660355  
0.6478118058  
1.397495915  
2.205858486  
2.998810877  
3.70023634  
4.240418899  
4.563751253  
4.634796445  
4.442029558  
3.99891544  
3.342304322  
2.528459981  
1.627268009  
0.7153202101  
-0.1313763852  
-0.8443538332  
-1.368689596  
-1.667599164  
-1.725270845  
-1.547783129  
-1.162067632  
-0.6130199338  
0.040998883  
0.7338833334  
1.398238767  
1.971956609  
2.404253011  
2.66050657  
2.725341192  
2.603555223  
2.318757753  
1.909861959  
1.425870979  
0.9196522764  
0.4415261202  
0.03353190128  
-0.2748771125  
-0.469196277  
-0.550081206  
-0.5315362915  
-0.4375303939  
-0.2976739731  
-0.1427294835  
-0.0006359940869  
0.1063843279  
0.1633523468  
0.1626663672  
0.1030763075  
-0.01208491307  
-0.1768944936  
-0.3845966002  
-0.6287383311  
-0.9035254731  
-1.203423035  
-1.522224228  
-1.851946868  
-2.181949436  
-2.498635921  
-2.785968459  
-3.026845131  
-3.205174774  
-3.308316031  
-3.329422153  
-3.269201017  
-3.136667381  
-2.948639458  
-2.727930763  
-2.500464481  
-2.291727683  
-2.123139387  
-2.008946583  
-1.954176504  
-1.954007626  
-1.994658709  
-2.055637946  
-2.11294237  
-2.142643315  
-2.124228784  
-2.043151215  
-1.892184396  
-1.671442081  
-1.38717233  
-1.049665748  
-0.6707942683  
-0.2617295475  
0.1686586701  
0.6143831888  
1.071798633  
1.538088915  
2.00916266  
2.477489923  
2.930457724  
3.349754829  
3.71209807  
3.991359142  
4.161850241  
4.202271821  
4.099632316  
3.852407053  
3.472281866  
2.98403374  
2.423448528  
1.833491186  
