342.6265494  
359.5898553  
395.3797425  
485.2842584  
740.1797847  
10449.26223  
4601.15666  
31134.17947  
12185.5148  
3109.509899  
13068.23969  
62988.80976  
14142.15605  
23322.97346  
2921.438647  
83238.78502  
37458.70441  
11208.82808  
1359.883481  
5132.332127  
6098.808892  
2237.115475  
2883.647495  
1456.5197  
9613.609805  
5197.736238  
2367.945864  
4133.803939  
232.8155141  
10688.81513  
15220.18354  
14799.1812  
642.884495  
21041.61287  
1054.426018  
1738.130952  
5453.621444  
14770.93014  
658.6089624  
2553.772823  
6987.72405  
871.6993778  
751.6120624  
815.2698035  
1404.482786  
4315.599376  
1379.638666  
266.6424545  
1876.235639  
2265.693397  
5266.204003  
1295.871432  
853.1585171  
5074.685058  
2637.989058  
5014.903549  
1207.586852  
289.5586745  
450.6220491  
849.6045564  
353.7672699  
243.9351339  
17.46795553  
628.483141  
668.9561303  
44.51441883  
38.24705872  
14.21414765  
3.297737329  
36.45507635  
28.74198563  
11.22458942  
1.33449062  
9.475201895  
4.845753023  
10.46447017  
12.84880964  
6.272249828  
4.191681453  
2.981226764  
2.729518065  
2.994342931  
2.14982604  
2.717787224  
2.307992196  
2.78103135  
2.455083611  
2.05811039  
1.643777318  
1.742388728  
1.219703687  
1.076629167  
1.187623209  
1.198422154  
1.036062675  
1.086491592  
1.040454852  
0.9651633234  
0.9141437188  
0.8616884212  
0.8159892009  
0.7752639509  
0.7558636606  
0.7262979711  
0.7004064414  
0.6607939076  
0.6432053755  
0.6124683633  
0.5938881276  
0.5712314529  
0.5498946999  
0.530840187  
0.5129882029  
0.4966498408  
0.4834926312  
0.4652643826  
0.4504053081  
0.4359661065  
0.422478582  
0.4095664155  
0.3978626078  
0.3862606373  
0.3748674949  
0.3640211875  
0.3540076049  
0.3440521057  
0.3349359454  
0.3259367681  
0.3173789916  
0.3091846116  
0.3013248436  
0.2937202473  
0.286571817  
0.2795708837  
0.2729063632  
0.2663646205  
0.2602807175  
0.2542396631  
0.2484350772  
0.2429085245  
0.2375672941  
0.2323600122  
0.2274143526  
0.2225587352  
0.2178725301  
0.2133632605  
0.2090271193  
0.2048086283  
0.2007291116  
0.1967693705  
0.1929453998  
0.1892494574  
0.1856620181  
0.1821749751  
0.1787986819  
0.175521903  
0.1723429035  
0.1692639593  
0.1662688838  
0.1633572231  
0.1605299197  
0.1577903638  
0.1551172058  
0.1525186792  
0.1499927868  
0.1475399382  
0.145150736  
0.1428191581  
0.1405580289  
0.1383517502  
0.1361997856  
0.1341002574  
0.1320635864  
0.1300746224  
0.1281339008  
0.1262438344  
0.1243975947  
0.1225957642  
0.1208406082  
0.1191237547  
0.1174506478  
0.1158115167  
0.1142194121  
0.1126636811  
0.1111390369  
0.1096490871  
0.1081937888  
0.1067716763  
0.1053847096  
0.1040222486  
0.1026922693  
0.1013923804  
0.1001215035  
0.0988763077  
0.09765474038  
0.0964642222  
0.09529610216  
0.09415041366  
0.09303266689  
0.0919351935  
0.09086116344  
0.08980818796  
0.08877983341  
0.0877668686  
0.0867763405  
0.08580861441  
0.08484964396  
0.08392045833  
0.08300478779  
0.08210539697  
0.08122581447  
0.08035968581  
0.07951693859  
0.07868185887  
0.07786990605  
0.07706560024  
0.0762796265  
0.07550455613  
0.07474700223  
0.07400603761  
0.07327406171  
0.0725581634  
0.071853951  
0.07115798305  
0.07047789483  
0.06981226302  
0.06915430821  
0.06850771797  
0.06787290273  
0.06724951763  
0.06663458489  
0.06603475068  
0.06543806623  
0.06485582304  
0.06428698122  
0.06372223999  
0.06316751919  
0.06262060436  
0.0620852502  
0.06155896471  
0.06103840057  
0.06052748151  
0.0600236049  
0.05953005028  
0.05904960359  
0.05856345566  
0.05809288741  
0.05762872617  
0.05716972132  
0.05671983854  
0.05627670754  
0.05584137599  
0.05541092861  
0.05498761675  
0.05456838385  
0.05415874624  
0.05375734317  
0.05335831899  
0.05296354541  
0.05257681793  
0.05219426811  
0.05182067518  
0.05145111003  
0.05108264228  
0.05072545006  
0.05037053432  
0.05002124065  
0.04967512621  
0.04933752765  
0.04900473099  
0.0486733618  
0.04834583953  
0.04802651816  
0.04770904699  
0.04739661287  
0.04709061148  
0.04678541718  
0.04648819009  
0.04619283468  
0.04590062354  
0.04561509094  
0.0453302684  
0.04505162631  
0.04477613416  
0.04450425762  
0.04423600251  
0.04397193669  
0.04370714973  
0.04345282043  
0.04319667996  
0.04294733739  
0.04269903013  
0.04245393547  
0.04220978767  
0.04197375651  
0.04173911459  
0.04150765143  
0.04127676599  
0.04105345047  
0.04082844856  
0.04060900189  
0.04039028841  
0.04017797589  
0.03996496668  
0.03975288227  
0.03954948552  
0.03934327866  
0.03914239675  
0.03894426189  
0.03874852826  
0.03855468873  
0.03836148007  
0.03817294536  
0.03798638022  
0.03780149803  
0.03761954512  
0.03743928509  
0.03726393394  
0.03708729406  
0.03691334971  
0.03674456001  
0.03657278987  
0.03640830373  
0.03624188723  
0.03607824067  
0.03591727245  
0.03575651785  
0.03559913599  
0.03544320772  
0.03529283914  
0.03514001833  
0.0349908382  
0.03484401885  
0.03469674206  
0.03455139444  
0.03441092633  
0.03426882865  
0.03413151116  
0.03399295424  
0.033857469  
0.03372311698  
0.03359086575  
0.03345974194  
0.03332905971  
0.03320251605  
0.03307737157  
0.03295059765  
0.03282879958  
0.0327083068  
0.0325868614  
0.03246691648  
0.0323501766  
0.03223548678  
0.03212123593  
0.03200654127  
0.03189635687  
0.03178559586  
0.03167494643  
0.03156771913  
0.03146090583  
0.03135719198  
0.03125068574  
0.03114924868  
0.03104877094  
0.0309480416  
0.03084857208  
0.03075256407  
0.03065402596  
0.03055855628  
0.03046548514  
0.03037292894  
0.03027919182  
0.03018880824  
0.03009881208  
0.03001192134  
0.02992465582  
0.02983735372  
0.02975320402  
0.02966941887  
0.02958642203  
0.02950227662  
0.02942158167  
0.02934088613  
0.02926305152  
0.02918559127  
0.0291082483  
0.02903005656  
0.02895724669  
0.02888240916  
0.02881004705  
0.0287361579  
0.02866634132  
0.02859624809  
0.02852714873  
0.02845787263  
0.02839005212  
0.02832628037  
0.02825958848  
0.02819390993  
0.02813088284  
0.02806870807  
0.028006239  
0.02794439185  
0.02788181007  
0.02782494542  
0.02776521289  
0.02770767346  
0.02764971666  
0.02759419091  
0.02753743088  
0.02748452114  
0.02742815169  
0.02737631928  
0.02732531254  
0.02727380524  
0.02722358636  
0.02717274589  
0.02712353328  
0.02707458691  
0.02702631533  
0.02697989363  
0.02693381352  
0.0268893343  
0.0268442793  
0.02680123098  
0.02675788513  
0.02671564593  
0.02667273739  
0.02663210972  
0.02659227643  
0.02655241892  
0.0265132798  
0.02647517852  
0.02643870731  
0.02640344076  
0.02636530265  
0.02632977406  
0.02629331507  
0.02626135271  
0.02622841963  
0.02619553222  
0.02616122926  
0.02613188068  
0.02610311843  
0.02606994526  
0.02604046235  
0.02601184675  
0.02598464628  
0.02595818936  
0.02593131919  
0.02590303461  
0.02587699821  
0.02585489744  
0.02582800636  
0.02580463377  
0.02578391899  
0.02576032065  
0.02573956863  
0.02571698251  
0.02569667807  
0.025677173  
0.02565796043  
0.02563756097  
0.02562090483  
0.02560382148  
0.02558556499  
0.02557180006  
0.02555536645  
0.0255385503  
0.02552646058  
0.02551142104  
0.02549845185  
0.02548464801  
0.02547220362  
0.02546252411  
0.02545121459  
0.02543987239  
0.02543163816  
0.0254228774  
0.02541340923  
0.02540648255  
0.02539830509  
0.02539321198  
0.02538468629  
0.02537978676  
0.02537565309  
0.02537245791  
0.02536600458  
0.02536502034  
0.02536140885  
0.02535986229  
0.0253580658  
0.02535618868  
0.02535474005  
