9823.713347  
9821.246078  
9818.651072  
9815.903232  
9813.039486  
9810.167462  
9807.459405  
9805.131771  
9803.413695  
9802.50975  
9802.563445  
9803.628086  
9805.650355  
9808.469846  
9811.834977  
9815.433072  
9818.929734  
9822.011233  
9824.423208  
9825.999486  
9826.676769  
9826.493319  
9825.572614  
9824.095361  
9822.265366  
9820.275482  
9818.27974  
9816.376294  
9814.603712  
9812.950408  
9811.374543  
9809.829692  
9808.290689  
9806.774091  
9805.349017  
9804.136159  
9803.294934  
9803.001151  
9803.419077  
9804.672695  
9806.82084  
9809.840138  
9813.618288  
9817.95859  
9822.595085  
9827.216311  
9831.494746  
9835.118476  
9837.821594  
9839.41014  
9839.78089  
9838.931312  
9836.959732  
9834.05592  
9830.483164  
9826.553652  
9822.599885  
9818.944888  
9815.874298  
9813.613071  
9812.309006  
9812.024543  
9812.737161  
9814.347986  
9816.69691  
9819.582152  
9822.781664  
9826.073625  
9829.253988  
9832.149213  
9834.623731  
9836.582106  
9837.966889  
9838.753728  
9838.945266  
9838.5655  
9837.655623  
9836.271943  
9834.485603  
9832.383495  
9830.069195  
9827.662734  
9825.29816  
9823.118216  
9821.266069  
9819.874555  
9819.053973  
9818.879879  
9819.382521  
9820.539479  
9822.272887  
9824.451972  
9826.901296  
9829.414051  
9831.76948  
9833.752634  
9835.174441  
9835.889938  
9835.812546  
9834.922679  
9833.269613  
9830.966285  
9828.177426  
9825.102314  
9821.954144  
9818.938319  
9816.232224  
9813.968914  
9812.226573  
9811.025063  
9810.329656  
9810.061423  
9810.112585  
9810.364531  
9810.705805  
9811.047503  
9811.33372  
9811.545744  
9811.699545  
9811.837292  
9812.014647  
9812.286338  
9812.692693  
9813.249804  
9813.945193  
9814.739834  
9815.576324  
9816.39147  
9817.131158  
9817.764293  
9818.293105  
9818.75751  
9819.232215  
9819.816663  
9820.619088  
9821.73724  
9823.238835  
9825.145073  
9827.420144  
9829.968713  
9832.642172  
9835.253059  
9837.595781  
9839.470827  
9840.709171  
9841.193452  
9840.873128  
9839.771658  
9837.984814  
9835.670516  
9833.031607  
9830.293859  
9827.681926  
9825.396154  
9823.592851  
9822.370064  
9821.760255  
9821.730252  
9822.188229  
9822.996501  
9823.988598  
9824.988455  
9825.829713  
9826.373015  
9826.519534  
9826.219487  
9825.474951  
9824.336695  
9822.895719  
9821.270469  
9819.591234  
9817.983651  
9816.55322  
9815.372746  
9814.47435  
9813.847053  
9813.440472  
9813.174169  
9812.951665  
9812.677242  
9812.2734  
9811.696365  
9810.947421  
9810.078076  
9809.187836  
9808.414412  
9807.917116  
9807.855244  
9808.364181  
9809.532426  
9811.382815  
9813.860991  
9816.833287  
9820.095055  
9823.389015  
9826.431963  
9828.946639  
9830.694938  
9831.508168  
9831.310242  
9830.13062  
9828.104973  
9825.463169  
9822.505828  
9819.572184  
9817.003042  
9815.103325  
9814.108638  
9814.159744  
9815.287973  
9817.412918  
9820.352751  
9823.845524  
9827.578993  
9831.225257  
9834.476235  
9837.075861  
9838.84521  
9839.697989  
9839.64461  
9838.784716  
9837.289362  
9835.375343  
9833.275102  
9831.206216  
9829.344425  
9827.803698  
9826.62571  
9825.779965  
9825.174137  
9824.672902  
9824.122342  
9823.376354  
9822.321131  
9820.894405  
9819.096723  
9816.993461  
9814.707466  
9812.403657  
9810.267967  
9808.483844  
9807.209652  
9806.560036  
9806.593897  
9807.310138  
9808.651502  
9810.515272  
9812.768849  
9815.267292  
9817.869888  
9820.45306  
9822.917626  
9825.18973  
9827.215949  
9828.954226  
9830.36336  
9831.394104  
9831.984764  
9832.063391  
9831.557382  
9830.409716  
9828.59936  
9826.162231  
9823.208117  
9819.929301  
9816.597228  
9813.545513  
9811.13952  
9809.735375  
9809.633353  
9811.032094  
9813.990815  
9818.405958  
9824.007227  
9830.375079  
9836.978849  
9843.231326  
9848.553033  
9852.437743  
9854.510403  
9854.569653  
9852.60936  
9848.816584  
9843.546935  
9837.281209  
9830.569716  
9823.971968  
9817.99938  
9813.067677  
9809.46369  
9807.328956  
9806.659982  
9807.323169  
9809.080737  
9811.62341  
9814.605555  
9817.678968  
9820.522523  
9822.865887  
9824.506435  
9825.319349  
9825.261385  
9824.368881  
9822.750832  
9820.577523  
9818.065543  
9815.459669  
9813.012598  
9810.963602  
9809.517543  
9808.825986  
9808.972215  
9809.961798  
9811.720234  
9814.098183  
9816.884438  
9819.825488  
9822.650061  
9825.096001  
9826.936597  
9828.003532  
9828.203617  
9827.527463  
9826.049023  
9823.915987  
9821.332245  
9818.534468  
9815.765753  
9813.249369  
9811.165988  
9809.637021  
9808.716103  
9808.389662  
9808.586377  
9809.194035  
9810.081425  
9811.122129  
9812.216636  
9813.309558  
9814.399139  
9815.537387  
9816.820577  
9818.37104  
9820.312857  
9822.744888  
9825.715293  
9829.20162  
9833.099875  
9837.224953  
9841.32297  
9845.094573  
9848.226458  
9850.427184  
9851.462643  
9851.1864  
9849.561009  
9846.667226  
9842.699974  
9837.951376  
9832.782897  
9827.589908  
9822.762801  
9818.6491  
9815.520789  
9813.550307  
9812.797657  
9813.209643  
9814.630933  
9816.825415  
9819.504899  
9822.361945  
9825.10269  
9827.476084  
9829.29625  
9830.455638  
9830.927947  
9830.760901  
9830.060532  
9828.969399  
9827.642089  
9826.221526  
9824.819413  
9823.503453  
9822.292863  
9821.162631  
9820.055368  
9818.898681  
9817.62507  
9816.190907  
9814.591373  
9812.86861  
9811.111691  
9809.44812  
9808.027983  
9807.003191  
9806.504809  
9806.622197  
9807.387053  
9808.764982  
9810.656017  
9812.90406  
9815.313948  
9817.673751  
9819.779104  
9821.456216  
9822.580495  
9823.088558  
9822.982294  
9822.325125  
9821.231392  
9819.850899  
9818.350962  
9816.89849  
9815.644199  
9814.710523  
9814.184021  
9814.112355  
9814.505249  
9815.338466  
9816.559684  
9818.095272  
9819.85704  
9821.74858  
9823.670926  
9825.5275  
9827.228584  
9828.695244  
9829.862902  
9830.684359  
9831.132121  
9831.199869  
9830.902861  
9830.277187  
9829.378054  
9828.277098  
9827.059058  
9825.818001  
9824.653075  
9823.663913  
9822.945535  
9822.582539  
9822.642632  
9823.169685  
9824.176735  
9825.639926  
9827.494322  
9829.633004  
9831.910341  
9834.150269  
9836.159453  
9837.744597  
9838.732308  
9838.989182  
9838.43953  
9837.078101  
9834.97565  
9832.275966  
9829.184271  
9825.947812  
9822.830817  
9820.086759  
9817.931287  
9816.519195  
9815.928373  
9816.152682  
9817.104649  
9818.627522  
9820.515069  
9822.536394  
9824.462638  
9826.091934  
9827.269665  
9827.901493  
9827.957849  
9827.469906  
9826.518005  
9825.214886  
9823.686474  
9822.053234  
9820.415035  
9818.841462  
9817.368759  
9816.003274  
9814.730361  
9813.526647  
9812.373255  
9811.267389  
9810.230121  
9809.308814  
9808.573759  
9808.10934  
9808.001149  
9808.321087  
9809.112773  
9810.379757  
9812.078442  
9814.117203  
9816.36212  
9818.648988  
9820.800215  
9822.644655  
9824.037789  
9824.879648  
9825.128061  
9824.805308  
9823.997177  
9822.844192  
9821.526014  
9820.240794  
9819.181918  
9818.515041  
9818.358293  
9818.768121  
9819.732521  
9821.172629  
9822.952355  
9824.894879  
9826.803933  
9828.487114  
9829.778332  
9830.556571  
9830.75869  
9830.384813  
9829.495824  
9828.20367  
9826.655951  
9825.017191  
9823.449349  
9822.094276  
9821.060179  
9820.413563  
9820.177133  
9820.333193  
9820.831368  
9821.598966  
9822.551997  
9823.605355  
9824.680824  
9825.712354  
9826.648615  
9827.453329  
9828.104202  
9828.591231  
9828.915009  
9829.085355  
9829.120101  
9829.043659  
9828.884918  
9828.674  
9828.437852  
9828.195056  
9827.950639  
9827.692233  
9827.38874  
9826.992841  
9826.447798  
9825.698533  
9824.70581  
9823.461559  
9822.002593  
9820.419759  
9818.859762  
9817.517619  
9816.619028  
9816.393581  
9817.041387  
9818.697103  
9821.396614  
9825.051748  
9829.437911  
9834.198356  
9838.866498  
9842.905496  
9845.761558  
9846.925301  
9845.993869  
9842.725929  
9837.081999  
9829.244181  
9819.611811  
9808.772315  
9797.450087  
9786.438775  
9776.52484  
9768.411277  
9762.650475  
9759.594103  
9759.365498  
9761.857328  
9766.753995  
9773.575208  
9781.734679  
9790.60636  
9799.589901  
9808.16774  
9815.947716  
9822.687143  
9828.297007  
9832.827606  
9836.438911  
9839.360943  
9841.850053  
9844.147052  
9846.442583  
9848.853443  
9851.412072  
9854.069377  
9856.709269  
9859.171893  
9861.281494  
9862.874598  
9863.824266  
9864.057219  
9863.561615  
9862.384911  
9860.622674  
9858.400734  
9855.853777  
9853.104309  
9850.24561  
9847.331662  
9844.375875  
9841.358912  
9838.24422  
9834.998495  
9831.6131  
9828.122269  
9824.613791  
9821.229376  
9818.153202  
9815.589325  
9813.730702  
9812.724486  
9812.639172  
9813.439649  
9814.975306  
9816.984567  
9819.116667  
9820.968872  
9822.134372  
9822.254404  
9821.066986  
9818.445061  
9814.418292  
9809.175147  
9803.044894  
9796.462004  
9789.918017  
9783.907508  
9778.875469  
9775.172722  
9773.024864  
9772.517696  
9773.59987  
9776.10102  
9779.761727  
9784.270212  
9789.300438  
9794.546454  
9799.749147  
9804.712875  
9809.311475  
9813.484621  
9817.226818  
9820.57209  
9823.577448  
9826.307847  
9828.824401  
9831.176707  
9833.399093  
9835.509722  
9837.511443  
9839.393022  
9841.129932  
9842.684491  
9844.005711  
9845.029671  
9845.681664  
9845.880843  
9845.548027  
9844.616338  
9843.043687  
9840.825421  
9838.00502  
9834.680546  
9831.005227  
9827.180802  
9823.443828  
9820.045812  
9817.229284  
9815.202625  
9814.116858  
9814.047442  
9814.983602  
9816.826882  
9819.399305  
9822.46048  
9825.731721  
9828.924549  
9831.770106  
9834.046285  
9835.599196  
9836.356728  
9836.332477  
9835.619853  
9834.377037  
9832.804785  
9831.119844  
9829.527224  
9828.194834  
9827.233549  
9826.685135  
9826.519571  
9826.641849  
9826.907475  
9827.144457  
9827.178967  
9826.861326  
9826.088831  
9824.822521  
9823.095595  
9821.012341  
9818.737592  
9816.477959  
9814.457165  
9812.888631  
9811.948762  
9811.754586  
9812.348715  
9813.693862  
9815.677751  
9818.128013  
9820.835086  
9823.579963  
9826.162777  
9828.428089  
9830.282863  
9831.704357  
9832.736612  
9833.475977  
9834.047974  
9834.579271  
9835.169538  
9835.868019  
9836.659017  
9837.459046  
9838.126409  
9838.481764  
9838.336275  
9837.522569  
9835.923051  
9833.490671  
9830.258584  
9826.337075  
9821.898624  
9817.154034  
9812.324302  
9807.613224  
9803.185948  
9799.156646  
9795.587054  
9792.495055  
9789.870415  
9787.693798  
9785.954247  
9784.661364  
9783.849572  
9783.573817  
9783.89811  
9784.879771  
9786.553087  
9788.9163  
9791.924707  
9795.491462  
9799.495866  
9803.797436  
9808.252845  
9812.732393  
9817.132936  
9821.385  
9825.453068  
9829.3295  
9833.023639  
9836.548645  
9839.908686  
9843.089236  
9846.052088  
9848.736118  
9851.063479  
9852.950045  
9854.318123  
9855.109238  
9855.294564  
9854.881413  
9853.914401  
9852.471239  
9850.653551  
9848.57433  
9846.343806  
9844.056048  
9841.778405  
9839.545461  
9837.358469  
9835.190362  
9832.995526  
9830.722618  
9828.328317  
9825.789616  
9823.112494  
9820.33543  
9817.5271  
9814.778533  
9812.191123  
9809.86248  
9807.872544  
9806.272516  
9805.078481  
9804.271036  
9803.80101  
9803.600461  
9803.597041  
9803.729282  
9803.960032  
9804.28558  
9804.738495  
9805.383535  
9806.306724  
9807.599266  
9809.338581  
9811.569593  
9814.289257  
9817.437194  
9820.894195  
9824.489523  
9828.016287  
9831.253365  
9833.99093  
9836.056291  
9837.336444  
9837.794059  
9837.474612  
9836.503115  
9835.070703  
9833.412326  
9831.778203  
9830.402668  
9829.474262  
9829.11114  
9829.345153  
9830.116843  
9831.282344  
9832.63131  
9833.91381  
9834.872536  
9835.276126  
9834.949178  
9833.794934  
9831.807779  
9829.074094  
9825.761621  
9822.099087  
9818.349131  
9814.778248  
9811.627767  
9809.089448  
9807.288575  
9806.275965  
9806.02942  
9806.463415  
9807.44529  
9808.815058  
9810.40617  
9812.064284  
9813.662013  
9815.108113  
9816.350679  
9817.374567  
9818.194254  
9818.843609  
9819.364438  
9819.795576  
9820.16406  
9820.47948  
9820.732207  
9820.895485  
9820.931153  
9820.798076  
9820.462292  
9819.907343  
9819.143528  
9818.214423  
9817.199481  
9816.211771  
9815.390402  
9814.887905  
9814.853589  
9815.414551  
9816.656658  
9818.6081  
9821.2281  
9824.402843  
9827.94997  
9831.631836  
9835.176567  
9838.304689  
9840.758496  
9842.330327  
9842.88653  
9842.383704  
9840.87522  
9838.506881  
9835.502049  
9832.137904  
9828.715418  
9825.526693  
9822.823364  
9820.789777  
9819.524208  
9819.030175  
9819.219001  
9819.92324  
9820.919453  
9821.957618  
9822.793723  
9823.2216  
9823.100199  
9822.372829  
9821.075943  
9819.336054  
9817.355  
9815.385035  
9813.696767  
9812.543811  
9812.128761  
9812.575015  
9813.908313  
9816.050764  
9818.828334  
9821.991056  
9825.243192  
9828.27938  
9830.821513  
9832.651299  
9833.633812  
9833.728888  
9832.988979  
9831.544231  
9829.577624  
9827.294323  
9824.890506  
9822.526748  
9820.310196  
9818.288152  
9816.453879  
9814.762933  
9813.15683  
9811.589305  
9810.050068  
9808.581173  
9807.282537  
9806.304855  
9805.830318  
9806.043946  
9807.099804  
9809.087903  
9812.007327  
9815.750903  
9820.104635  
9824.76322  
9829.360274  
9833.509546  
9836.85151  
9839.098691  
9840.073152  
9839.730499  
9838.166758  
9835.607033  
9832.377329  
9828.8636  
9825.463685  
9822.538842  
9820.371506  
9819.134746  
9818.877273  
9819.525258  
9820.900073  
9822.748651  
9824.781614  
