0.02341768792  
-0.8673202337  
-1.68185494  
-2.354369075  
-2.835781228  
-3.099178107  
-3.142272066  
-2.986629039  
-2.673858038  
-2.259412466  
-1.80493755  
-1.370276223  
-1.006232318  
-0.7490317759  
-0.6170952736  
-0.6104028115  
-0.7123204933  
-0.8934440418  
-1.116746146  
-1.343221326  
-1.537216468  
-1.670752897  
-1.726396003  
-1.698420284  
-1.59235058  
-1.423109278  
-1.2122067  
-0.9844464788  
-0.7646183029  
-0.5746066236  
-0.4311734152  
-0.3445765017  
-0.3180587606  
-0.3481080256  
-0.4253595714  
-0.5359482649  
-0.6631524421  
-0.7891391964  
-0.8967121498  
-0.9709191749  
-1.000443039  
-0.9786717505  
-0.9043683721  
-0.7818669436  
-0.6207336735  
-0.4348831428  
-0.2411908537  
-0.05771061656  
0.09833294265  
0.2125472984  
0.2751270404  
0.2821141473  
0.2359803013  
0.1454218315  
0.02435934606  
-0.1097473809  
-0.2380529703  
-0.3426878281  
-0.4090041327  
-0.4274047122  
-0.3945237023  
-0.3136037178  
-0.1940173772  
-0.05003077757  
0.1010439124  
0.2410287251  
0.3531160921  
0.423887822  
0.4448504213  
0.4133412678  
0.3327036415  
0.2117717135  
0.06374488261  
-0.09535297113  
-0.2484447766  
-0.3791752093  
-0.4734854014  
-0.5208571664  
-0.5151078879  
-0.4547091822  
-0.3426417187  
-0.1858518947  
0.005615674097  
0.2196712367  
0.4433481368  
0.6639329933  
0.8700015336  
1.052240845  
1.204022239  
1.321667764  
1.404401498  
1.454013427  
1.474270499  
1.4701685  
1.447120258  
1.410206236  
1.363577554  
1.310124167  
1.251437525  
1.188076963  
1.120083071  
1.047636958  
0.9717192842  
0.8946379312  
0.8202801748  
0.7540058295  
0.7021583956  
0.6712293652  
0.6668027141  
0.6924420598  
0.7487021151  
0.8324742047  
0.9367847028  
1.05114746  
1.162443163  
1.256242124  
1.318399373  
1.336699282  
1.302311702  
1.210864746  
1.06296077  
0.8640799778  
0.623886375  
0.3550506204  
0.07176419139  
-0.211819357  
-0.4830103555  
-0.7316741435  
-0.9508576187  
-1.136909575  
-1.289116925  
-1.408974442  
-1.499240375  
-1.562946303  
-1.602552476  
-1.619367752  
-1.613314758  
-1.583072078  
-1.526540185  
-1.441545792  
-1.326659116  
-1.181981826  
-1.00977395  
-0.8147961927  
-0.6043063253  
-0.3876667625  
-0.1755987279  
0.02085754728  
0.1915347489  
0.328354589  
0.426384029  
0.4845840485  
0.5061149275  
0.498115537  
0.4709554313  
0.436997558  
0.4090217721  
0.3984874152  
0.4138695583  
0.459296304  
0.5337030071  
0.6306533284  
0.7388832575  
0.8435508875  
0.9280346475  
0.9760791353  
0.9739886128  
0.9125834204  
0.7886282073  
0.6055361646  
0.3732300981  
0.1071606712  
-0.1733736872  
-0.4474168741  
-0.6947191011  
-0.8980015573  
-1.044792572  
-1.128632893  
-1.149485806  
-1.113364434  
-1.031229762  
-0.9173650767  
-0.7874514955  
-0.6566375361  
-0.5378249733  
-0.4404043293  
-0.3695442777  
-0.3261006501  
-0.3070886657  
-0.3065964179  
-0.3170047384  
-0.3302854708  
-0.3392225268  
-0.3384062242  
-0.3248603141  
-0.298288711  
-0.2609161304  
-0.2169946688  
-0.1720467248  
-0.1319813452  
-0.1021861968  
-0.08672689674  
-0.0877433867  
-0.1051164715  
-0.1364463068  
-0.1773407721  
-0.2219750009  
-0.2638548997  
-0.2966918943  
-0.315261716  
-0.3161438243  
-0.2982332432  
-0.2629264252  
-0.2139639439  
-0.1569256225  
-0.09843034373  
-0.04516618526  
-0.002851714914  
0.02467584215  
0.03614856033  
0.03318508389  
0.02019050992  
0.003830358219  
-0.007864174858  
-0.006648611546  
0.01468196576  
0.06112252035  
0.1345217518  
0.2330350559  
0.351063263  
0.4796920012  
0.6076100998  
0.7223775783  
0.8119119999  
0.8659732328  
0.8774674834  
0.8433804605  
0.7652053509  
0.6488089851  
0.5037386113  
0.3420626126  
0.1769014583  
0.02084828113  
-0.1155035784  
-0.2247208972  
-0.3032328724  
-0.3514872676  
-0.3735448894  
-0.3762085253  
-0.3678056645  
-0.3568346418  
-0.3506457885  
-0.3543572617  
-0.3701348705  
-0.3969110893  
-0.4305525367  
-0.4644267589  
-0.4902667023  
-0.4992020454  
-0.482828128  
-0.4341887477  
-0.3485889274  
-0.2241563652  
-0.06214995148  
0.1330105104  
0.3539602408  
0.5908447698  
0.8319631059  
1.064586612  
1.275909568  
1.454067388  
1.589174974  
1.674276296  
1.706112374  
1.685594988  
1.617887391  
1.512038873  
1.380153419  
1.236155461  
1.094272016  
0.9674012357  
0.865600056  
0.7948754367  
0.7564879846  
0.7468828427  
0.7582798806  
0.7798594875  
0.7993988943  
0.8051222575  
0.7874868171  
0.7406402753  
0.663305218  
0.5589475085  
0.4351735996  
0.3024586982  
0.172370622  
0.05560140717  
-0.03988747905  
-0.1102735163  
-0.1565973483  
-0.1846390339  
-0.2039685915  
-0.2262885215  
-0.2633481492  
-0.3247746198  
-0.4161933479  
-0.5379613887  
-0.6847624628  
-0.8461301096  
-1.007850704  
-1.154016126  
-1.269398434  
-1.341763328  
-1.363750851  
-1.334007678  
-1.257417073  
-1.14438252  
-1.009299222  
-0.8684663014  
-0.7377709903  
-0.630511236  
-0.5556563185  
-0.5168121133  
-0.5119898658  
-0.5341791091  
-0.5726023655  
-0.6144255829  
-0.6466718802  
-0.65805164  
-0.6404678677  
-0.5900190631  
-0.5073982589  
-0.3976781976  
-0.2695464019  
-0.1341343438  
-0.003591422371  
0.1103860215  
0.1979076505  
0.2519636504  
0.2691198985  
0.2497827618  
0.1980145238  
0.1209762883  
0.02806665214  
-0.07012373175  
-0.1629102095  
-0.2405496089  
-0.2951113749  
-0.3211212019  
-0.3159287939  
-0.2798115326  
-0.2158277128  
-0.1294730014  
-0.02817405702  
0.07932189391  
0.1836186023  
0.2753965588  
0.3461426286  
0.3888599567  
0.3987371561  
0.3737026113  
0.3148078936  
0.2263716439  
0.1157908917  
-0.006995342426  
-0.1304256607  
-0.2425453323  
-0.3324388085  
-0.3916939215  
-0.4156803432  
-0.4044382374  
-0.3629814785  
-0.3009076195  
-0.2312945842  
-0.1689933601  
-0.1285033021  
-0.1217473737  
-0.1560599464  
-0.2327166391  
-0.3462639477  
-0.4847841776  
-0.6311137636  
-0.7648628007  
-0.8649801559  
-0.912499863  
-0.8930962876  
-0.7990660212  
-0.6304698744  
-0.3952620336  
-0.1084027199  
0.209910243  
0.5366441965  
0.848594009  
1.124954581  
1.34941344  
1.511529502  
1.607214778  
1.638327244  
1.611503071  
1.536489201  
1.424273967  
1.285375844  
1.12856097  
0.9602111625  
0.7843866783  
0.6035407068  
0.4196779391  
0.2356896429  
0.05652793061  
-0.1100614229  
-0.2534800052  
-0.3609769351  
-0.4190771217  
-0.4155257217  
-0.3414533813  
-0.1933830331  
0.02529879555  
0.3037266033  
0.6239756498  
0.9625569215  
1.292821508  
1.587967078  
1.824216363  
1.9836805  
2.056462661  
2.041661663  
1.947109356  
1.787861399  
1.583689439  
1.355984094  
1.124550166  
0.9048543082  
0.7061479088  
0.5307790541  
0.3747870911  
0.2296441289  
0.08481950408  
-0.06931180358  
-0.2387567209  
-0.4238944752  
-0.6185489774  
-0.8103531637  
-0.9823570928  
-1.115646051  
-1.192520322  
-1.199717271  
-1.131086244  
-0.9892868834  
-0.7861619543  
-0.5417079547  
-0.2817839102  
-0.03490575593  
0.1713822567  
0.3139887952  
0.3771056039  
0.353956104  
0.247281335  
0.068532383  
-0.1640131002  
-0.4278589002  
-0.6991865618  
-0.9555706379  
-1.178191131  
-1.353242029  
-1.472525171  
-1.533259132  
-1.537335505  
-1.490266187  
-1.400095232  
-1.276465694  
-1.129944378  
-0.9715951972  
-0.8127106538  
-0.6645290868  
-0.5378095409  
-0.4421710184  
-0.3851829932  
-0.3713249231  
-0.4010006488  
-0.469844697  
-0.568557822  
-0.6834136122  
-0.797505184  
-0.8926254807  
-0.9515612725  
-0.9604791262  
-0.9110345769  
-0.8018436265  
-0.6390560851  
-0.4358918958  
-0.2111644898  
0.01303278331  
0.2141449923  
0.3720810684  
0.4718155017  
0.5053071548  
0.4724287789  
0.3808214058  
0.2446929859  
0.08277029674  
-0.08428388637  
-0.23659288  
-0.357551641  
-0.4357343082  
-0.4659806137  
-0.4495755766  
-0.3935341132  
-0.3091457679  
-0.210019579  
-0.1099075078  
-0.02061300912  
0.04975219838  
0.09795289558  
0.1261138848  
0.1414644126  
0.1553667701  
0.181760132  
0.2351852868  
0.3286453117  
0.4715113751  
0.6677699065  
0.9148038996  
1.20288415  
1.515497281  
1.830503835  
2.12208604  
2.363309538  
2.529074059  
2.599115618  
2.560750479  
2.410962251  
2.157546357  
1.819067887  
1.423531929  
1.005824642  
0.6041416117  
0.2557770326  
-0.007214615486  
-0.1619616787  
-0.1977562606  
-0.1176608066  
0.06156400862  
0.3112467885  
0.5941688829  
0.8690810472  
1.095825769  
1.240385317  
1.279186739  
1.2020472  
1.013386125  
0.7314908408  
0.3859565855  
0.01364900497  
-0.3462511805  
-0.6574397441  
-0.8911820911  
-1.029910264  
-1.06921707  
-1.01805322  
-0.8971181326  
-0.7357360059  
-0.5676654278  
-0.4264565685  
-0.3409630372  
-0.3316001273  
-0.4078143295  
-0.5670211644  
-0.7951091437  
-1.068369548  
-1.356558906  
-1.626675666  
-1.846948767  
-1.990558061  
-2.038642454  
-1.982285054  
-1.82326575  
-1.57356935  
-1.253752881  
-0.890437112  
-0.5132426618  
-0.1515535546  
0.1684891201  
0.4264612358  
0.6093391732  
0.7122625362  
0.7383561603  
0.6977038785  
0.605668458  
0.4807871966  
0.342520539  
0.2091265751  
0.09586937858  
0.01374520947  
-0.03119480775  
-0.03791095481  
-0.009891498766  
0.04576021942  
0.1194993885  
0.2006169919  
0.2784493823  
0.3433990889  
0.3876865202  
0.4058187984  
0.3947839321  
0.3540400109  
0.285366131  
0.192637796  
0.08156729253  
-0.04058932257  
-0.1653866956  
-0.2836483987  
-0.3860781056  
-0.4640186289  
-0.510342632  
-0.5203463911  
-0.4925241357  
-0.4290111722  
-0.3355618978  
-0.2209308605  
-0.09567226491  
0.02954633213  
0.1458545189  
0.247985497  
0.3356076783  
0.4138460434  
0.4927586295  
0.5857274406  
0.7069270946  
0.8682199145  
1.076018392  
1.328682286  
1.61502932  
1.91434391  
2.198058729  
2.432981633  
2.585643746  
2.627129431  
2.53760717  
2.309800766  
1.950793723  
1.481800657  
0.9359089143  
0.3540906843  
-0.2198846695  
-0.7448640195  
-1.187216294  
-1.524493868  
-1.747351469  
-1.859509108  
-1.875874239  
-1.819244202  
-1.716188767  
-1.592819729  
-1.471135091  
-1.366445093  
-1.286201944  
-1.230282559  
-1.192520522  
-1.163099205  
-1.131312602  
-1.088154455  
-1.028309708  
-0.951213856  
-0.8610800344  
-0.7659398396  
-0.6759539118  
-0.6013201223  
-0.5501977855  
-0.5270151773  
-0.5314579252  
-0.5583001388  
-0.5980905872  
-0.6385618299  
-0.6665094927  
-0.6698087243  
-0.6392458763  
-0.569854126  
-0.4615531787  
-0.3190138098  
-0.1507867742  
0.03212540251  
0.2179964625  
0.3960927855  
0.5580818938  
0.6988815223  
0.8168282105  
0.9131333934  
0.9907675881  
1.052999782  
1.10191068  
1.137204201  
1.155605095  
1.151017678  
1.115485923  
1.040825342  
0.9206692587  
0.7525560169  
0.5396566232  
0.2917916883  
0.02546667747  
-0.2371629693  
-0.4703346818  
-0.6474763886  
-0.7444009129  
-0.7424624578  
-0.6312305712  
-0.4103339351  
-0.09020722598  
0.3083355983  
0.7556776785  
1.215915676  
1.650041338  
2.019463329  
2.289508895  
2.432580227  
2.430694039  
2.277195996  
1.977497869  
1.548785538  
1.018718596  
0.4232196755  
-0.1964747477  
-0.7972451853  
-1.337704119  
-1.781661986  
-2.101115376  
-2.278462866  
-2.307728333  
-2.194668387  
-1.955773513  
-1.616275918  
-1.207426541  
-0.7633445156  
-0.3178190714  
0.09857471454  
0.4607530885  
0.7505801157  
0.9574267202  
1.077885631  
1.114798106  
1.075846292  
0.9719725736  
0.8158977164  
0.6209298152  
0.4001646686  
0.1660837484  
-0.06953643024  
-0.2955533942  
-0.501410361  
-0.6772398968  
-0.8142312404  
-0.9052511555  
-0.9456424759  
-0.9340322224  
-0.8729607095  
-0.7691256031  
-0.6330910508  
-0.4784230537  
-0.3202733296  
-0.1736088206  
-0.05131383379  
0.03751987199  
0.08884360753  
0.1042072199  
0.09051780335  
0.05901371565  
0.02361888296  
-0.001079430913  
-0.001900675671  
0.03111664683  
0.1034423033  
0.2154647237  
0.362655449  
0.5364027973  
0.7253448635  
0.9169627693  
1.099179503  
1.2617193  
1.397042946  
1.500770494  
1.571556163  
1.610514349  
1.620325509  
1.604220501  
1.56504956  
1.50460791  
1.423365178  
1.320634099  
1.19515824  
1.045999933  
0.8735291969  
0.6803032292  
0.4716139192  
0.2555281625  
0.04233370405  
-0.1565846358  
-0.3303012713  
-0.4701106648  
-0.5711658685  
-0.633699051  
-0.6635335478  
-0.6717140578  
-0.6732290608  
-0.6849414129  
-0.7230090154  
-0.8001849477  
-0.9234248462  
-1.0922153  
-1.297936186  
-1.524409234  
-1.749611379  
-1.948335993  
-2.095425879  
-2.169132983  
-2.154083846  
-2.043448076  
-1.839959067  
-1.555673725  
-1.210491444  
-0.8296838771  
-0.4407848566  
-0.07031326562  
0.2592153611  
0.5315924278  
0.7382319506  
0.8783948904  
0.9583391664  
0.9895793992  
0.9865628526  
0.9641144463  
0.9349982372  
0.9079645746  
0.8864897596  
0.8683873097  
0.8463079856  
0.8090500115  
0.7434940861  
0.6368994197  
0.479253521  
0.2653431526  
-0.003740279163  
-0.3198811033  
-0.6681444498  
-1.027893968  
-1.374721741  
-1.682952571  
-1.928407336  
-2.091078731  
-2.15737889  
-2.121659528  
-1.986812293  
-1.763880081  
-1.470724517  
-1.129936711  
-0.766267729  
-0.4039282094  
-0.06409207334  
0.2370379194  
0.4894138697  
0.6894003021  
0.8391592407  
0.9452813768  
1.016932139  
1.063818492  
1.09432669  
1.114120843  
1.125411089  
1.126985166  
1.114948459  
1.084020279  
1.029113237  
0.9469083188  
0.8371166539  
0.7032116924  
0.5524739169  
0.3953480469  
0.2442070022  
0.1117338168  
0.009185666889  
-0.05516177913  
-0.07714491544  
-0.05721172073  
-0.0002284229792  
0.08539004854  
0.1890753951  
0.2997941825  
0.4077559842  
0.5058461967  
0.5905338256  
0.6621107911  
0.7241698919  
0.78243414  
0.8430972781  
0.9109622336  
0.987729004  
1.07073211  
1.152423987  
1.22075403  
1.260469037  
1.255207644  
1.190103737  
1.054532088  
0.8445616516  
0.5647103235  
0.2286742437  
-0.1411606065  
-0.515449685  
-0.8607032864  
-1.142876906  
-1.331294334  
-1.402412885  
-1.342942299  
-1.15188405  
-0.8412113386  
-0.4350505455  
0.03256112618  
0.5211128621  
0.9878336704  
1.392203331  
1.700200662  
1.887798109  
1.943285704  
1.868169536  
1.676567594  
1.393215031  
1.050347086  
0.6838638096  
0.3292396541  
0.01766250824  
-0.2271642421  
-0.3912134208  
-0.4711206501  
-0.4738773282  
-0.415349681  
-0.3178385622  
-0.2070339231  
-0.1087565486  
-0.04592495836  
-0.03609473137  
-0.08985557198  
-0.2102132236  
-0.3929403415  
-0.6277434129  
-0.8999718005  
-1.192572402  
-1.487950647  
-1.769515115  
-2.022724075  
-2.235620259  
-2.398914198  
-2.505765282  
-2.551472499  
-2.53323158  
-2.450109039  
-2.303253006  
-2.096322724  
-1.835974631  
-1.532247245  
-1.198622303  
-0.8516278811  
-0.5098588873  
-0.192454314  
0.08285752065  
0.3018959112  
0.4560449417  
0.5438063001  
0.5715699637  
0.5533825271  
0.5096227829  
0.46466737  
0.4437897431  
0.4696987839  
0.5591789932  
0.720351562  
0.9509689379  
1.23805308  
1.558986832  
1.883934776  
2.179344224  
2.412010184  
2.553209749  
2.582318779  
2.48942968  
2.276629123  
1.957758925  
1.556724525  
1.104581189  
0.635833479  
