600.5168814  
637.3288995  
719.3548414  
914.3283477  
1433.470904  
350.8427536  
24468.92057  
41198.91757  
111.5063334  
3640.003571  
2981.69994  
89725.30534  
2045.290639  
41467.23337  
10733.11632  
1343.401814  
1878.933372  
11602.36042  
7215.450367  
5198.627483  
4798.091108  
1953.018216  
7228.691942  
8444.295398  
13234.70809  
34612.49484  
13861.02946  
4888.089086  
3107.727409  
14508.33996  
11321.1157  
545.3405357  
14858.82863  
6098.026803  
959.7658974  
13792.43961  
1289.394334  
5426.070371  
6547.663053  
9410.343499  
14960.56713  
3196.538344  
3203.975254  
8815.528819  
2143.661683  
60.30604369  
5.436887288  
890.0939239  
1122.718973  
1674.202706  
4086.839278  
3654.69141  
2084.112318  
1284.911129  
3337.152679  
2113.536786  
2223.311572  
2251.453088  
429.4688025  
973.1236467  
1505.510742  
262.2956042  
163.3990929  
821.483495  
27.45481357  
498.8254895  
117.2188791  
94.02598665  
19.30000371  
43.05543401  
79.11008369  
13.65083854  
37.14390624  
12.71168841  
14.31697323  
14.15401559  
21.04909404  
8.35319009  
5.909854373  
6.678414642  
11.41531818  
8.516613131  
7.239617021  
6.745055056  
5.326062992  
5.899781112  
4.503241675  
4.246484834  
4.510491059  
4.008381482  
3.850748839  
3.346455833  
3.220066281  
3.098511505  
2.949675344  
2.747628103  
2.658574292  
2.529133453  
2.36926417  
2.248677285  
2.131227812  
2.017400024  
1.915099767  
1.836544273  
1.732810243  
1.657169399  
1.580978389  
1.504604525  
1.439096363  
1.375584369  
1.312238716  
1.256226204  
1.202072196  
1.151968072  
1.103291761  
1.057670819  
1.013838859  
0.9732942747  
0.9345352402  
0.8975141875  
0.8619652684  
0.8293833193  
0.7978029995  
0.7676694085  
0.7389158488  
0.7114894061  
0.6855892132  
0.6606379461  
0.6370138718  
0.6142620309  
0.5927073282  
0.5720420315  
0.5523620895  
0.533347574  
0.5153066107  
0.4979937776  
0.481369976  
0.4654805276  
0.4502542615  
0.4356482854  
0.4216277729  
0.4081688195  
0.3952401419  
0.3828261962  
0.3709108975  
0.3594275546  
0.3484175973  
0.3378262635  
0.327629695  
0.3178074302  
0.308356794  
0.2992599426  
0.290492985  
0.282031907  
0.2738950284  
0.266046822  
0.2584729126  
0.2511678129  
0.2441153672  
0.2373073755  
0.2307358608  
0.2243871997  
0.2182475954  
0.2123212851  
0.2066006616  
0.2010627042  
0.195707719  
0.1905267397  
0.1855147415  
0.1806673054  
0.1759704367  
0.1714234939  
0.1670302527  
0.1627735076  
0.1586357026  
0.154641779  
0.1507603046  
0.1470026239  
0.1433600028  
0.1398257401  
0.1364040994  
0.1330763115  
0.1298482861  
0.126713842  
0.1236872571  
0.1207282243  
0.1178625221  
0.1150844594  
0.1123831032  
0.1097567762  
0.1072051239  
0.1047252365  
0.1023187108  
0.09997724077  
0.09769976875  
0.09548549907  
0.09333243366  
0.09123713313  
0.08919573084  
0.08721194512  
0.08528050232  
0.08340226939  
0.08156999741  
0.07979183489  
0.07806235434  
0.07637310682  
0.07472416434  
0.07312162252  
0.07156277487  
0.07004195179  
0.06855322957  
0.06711283231  
0.06570141927  
0.06433017177  
0.06299206872  
0.06168514578  
0.06040731454  
0.0591669895  
0.05795542877  
0.05677694279  
0.05562114525  
0.05449455074  
0.05339524538  
0.05232428425  
0.05127533413  
0.05025232611  
0.04925668074  
0.04827838502  
0.04732544339  
0.04639894192  
0.04549154869  
0.04460601294  
0.04374118413  
0.04289037153  
0.04206596192  
0.04125421824  
0.04046411382  
0.03969048046  
0.03893782541  
0.03819462059  
0.03747131172  
0.03676576002  
0.03607529824  
0.03540000282  
0.03473920853  
0.03409194126  
0.03345941271  
0.03284209012  
0.03223510556  
0.03164271802  
0.03106250558  
0.03049388264  
0.02993805588  
0.02939460178  
0.02886237688  
0.0283375838  
0.0278302799  
0.02732915846  
0.02683839057  
0.02635818018  
0.02588978327  
0.02543206461  
0.02497989345  
0.02453780053  
0.02410422607  
0.02368159417  
0.02326632766  
0.02285934809  
0.02245869146  
0.02206784248  
0.02168335709  
0.02130876383  
0.02093880477  
0.0205779106  
0.02022423832  
0.01987766296  
0.01953875363  
0.01920417929  
0.01887516212  
0.01855443167  
0.01823998637  
0.01793133258  
0.01762591096  
0.01733010012  
0.0170383768  
0.01675069283  
0.01646945147  
0.01619383435  
0.01592348891  
0.01565814639  
0.0153991657  
0.01514350182  
0.01489299697  
0.01464565009  
0.01440269312  
0.01416604547  
0.01393314569  
0.0137065951  
0.01348051864  
0.01325995008  
0.01304256552  
0.01283004824  
0.01262164959  
0.01241518072  
0.0122144525  
0.01201593262  
0.01182198975  
0.01162960412  
0.01144441834  
0.01125836255  
0.0110761299  
0.01090070669  
0.01072622529  
0.01055160847  
0.01038256553  
0.01021775067  
0.01005578357  
0.009896550594  
0.009737695767  
0.009583435713  
0.009432242333  
0.009282383261  
0.00913573624  
0.008990615967  
0.008850114147  
0.00871078369  
0.008572693737  
0.008436763085  
0.008304629744  
0.008174319108  
0.00804686149  
0.00791975871  
0.007795664102  
0.007674567178  
0.007555862296  
0.007437373701  
0.007321221269  
0.00720886283  
0.00709577001  
0.006984646177  
0.006877665019  
0.006770531927  
0.00666539744  
0.006562204369  
0.006461100857  
0.006360847665  
0.006263054344  
0.006165950408  
0.006071234815  
0.005978383285  
0.005886149878  
0.005795554885  
0.00570711757  
0.005619171988  
0.005532373931  
0.005448471172  
0.005366005043  
0.005283451233  
0.005202511536  
0.005122882534  
0.005044910392  
0.004968468719  
0.00489323086  
0.004818677471  
0.004745989759  
0.004673905692  
0.004604257077  
0.004533195434  
0.004463906981  
0.004397241903  
0.00433092449  
0.004264209946  
0.004201318411  
0.00413833968  
0.004075421678  
0.00401472164  
0.00395414096  
0.003894946254  
0.003837031794  
0.003779944274  
0.003723450787  
0.003667149229  
0.003613278933  
0.003559383681  
0.00350595501  
0.003454419857  
0.003403720791  
0.003351774789  
0.003303473647  
0.003253645913  
0.003206104144  
0.00315872043  
0.003113153651  
0.003067556064  
0.003022887924  
0.00297765864  
0.00293428329  
0.002891179123  
0.002849492423  
0.002808669502  
0.00276895059  
0.002728308543  
0.002688657072  
0.002650345544  
0.002612496942  
0.002575890288  
0.002538295563  
0.002502702909  
0.002467520959  
0.00243126227  
0.002398101199  
0.002365046026  
0.002332496199  
0.00229843071  
0.002267017188  
0.002235656967  
0.002204595273  
0.002174488708  
0.002145145765  
0.002116291006  
0.002087460945  
0.00205918552  
0.002031429194  
0.002004640964  
0.001977910486  
0.001952229597  
0.001926463822  
0.001901202222  
0.001876769742  
0.001852742368  
0.001829341939  
0.00180632276  
0.001783267416  
0.001761941157  
0.00173906537  
0.0017181101  
0.001696778445  
0.001676419311  
0.001656542732  
0.001636818625  
0.001617436228  
0.001598805855  
0.001580736151  
0.001563073875  
0.001545677217  
0.001528192147  
0.001511834736  
0.001494901253  
0.001479337504  
0.001464257337  
0.001449209558  
0.001434315036  
0.001420065025  
0.001405888578  
0.001392340554  
0.00137917045  
0.001366874167  
0.001354058761  
0.001342024275  
0.001330438605  
0.001318936744  
0.001307242778  
0.001297994127  
0.001287458132  
0.001277699601  
0.001268109436  
0.001258462348  
0.001250210876  
0.001241054251  
0.001233259746  
0.001225059264  
0.001217288523  
0.001210445213  
0.001203763854  
0.001196977648  
0.001191603661  
0.001185717584  
0.001180149331  
0.001175210691  
0.001169897336  
0.001166381358  
0.001162482491  
0.001158284344  
0.001154594674  
0.001152297339  
0.001148675251  
0.001145445301  
0.00114407483  
0.001142937066  
0.001141073991  
0.001139963072  
0.001138779022  
0.001138594403  
0.001138392346  
