158.186921  
163.189169  
176.7485791  
201.8508458  
129.3414171  
185.1056382  
18044.28203  
16683.17673  
5744.243971  
15236.46447  
3111.27389  
47604.08078  
2705.24206  
22065.50398  
18253.12977  
5870.547424  
19051.26621  
1430.012781  
592.3121359  
3762.239562  
1788.549522  
4456.003144  
9447.03222  
10093.08254  
6178.585921  
14271.64  
2725.615049  
7028.863437  
36163.67744  
8286.641587  
2835.760004  
40585.96432  
27778.42196  
17296.33466  
948.1724182  
14660.94928  
3183.623945  
6917.70443  
21381.33217  
839.4329422  
4450.847996  
5606.381313  
3773.762613  
6863.131652  
3095.376516  
6847.140966  
13771.43309  
2406.883046  
5489.34642  
388.2605284  
5888.563516  
723.4585173  
2276.388575  
706.9811157  
2053.82035  
135.8671326  
1106.214215  
213.4638893  
297.3465507  
1355.043016  
448.0853905  
28.96321312  
547.5078235  
212.4984805  
430.5399406  
93.23714024  
63.55347425  
209.7769118  
12.56552894  
0.04516775205  
13.6499015  
2.253252382  
1.456365941  
0.9588107732  
0.6347151998  
0.971830042  
1.945957522  
1.25377624  
0.8041064726  
1.873554729  
0.04165205971  
0.1347576763  
0.1887939761  
0.3359562678  
0.4102243883  
0.2044997347  
0.2719208053  
0.2689030371  
0.2385985939  
0.2313317794  
0.243749297  
0.2277074717  
0.2256957629  
0.2192923629  
0.1985056157  
0.2031419927  
0.1782307018  
0.1758131454  
0.1866368695  
0.1766883879  
0.1848414765  
0.1697070546  
0.1714956054  
0.1651253441  
0.1675871539  
0.1637624124  
0.161069907  
0.1569397419  
0.1545614434  
0.1526459194  
0.1491858093  
0.1471300868  
0.1434322476  
0.141030544  
0.1390166844  
0.1362533893  
0.1345216479  
0.1318540344  
0.129910521  
0.1276187097  
0.1252714558  
0.1234452371  
0.1214693648  
0.1194481323  
0.1175780454  
0.1156248465  
0.1138168586  
0.1120470347  
0.1102304017  
0.1085418818  
0.1068826587  
0.1052215279  
0.1036127429  
0.102037901  
0.1005334842  
0.09901181251  
0.0975647444  
0.09612535181  
0.09472384346  
0.09336243734  
0.09201179369  
0.09071148153  
0.0894210033  
0.08816462928  
0.08693520706  
0.08573735261  
0.08456252678  
0.08341411315  
0.08227954272  
0.08117944989  
0.08009759408  
0.07904165696  
0.07800714239  
0.07698591604  
0.07599511249  
0.07502060539  
0.07405999427  
0.07312614266  
0.07221336893  
0.07131270113  
0.0704325012  
0.06957791216  
0.06872983817  
0.06789062522  
0.06708047199  
0.06628863096  
0.06550903659  
0.06474357931  
0.06399141838  
0.06325329671  
0.06252681419  
0.06181917689  
0.06111925003  
0.06043241141  
0.05975854107  
0.05910791641  
0.05845232578  
0.05781587057  
0.0571960337  
0.05658215786  
0.05598296563  
0.05539242148  
0.05481197455  
0.05423639027  
0.05367432415  
0.05312200474  
0.0525813715  
0.05205393206  
0.05152380808  
0.05101140825  
0.05050897028  
0.05001066976  
0.04952172529  
0.04903874796  
0.0485704761  
0.04810543874  
0.04764438588  
0.04720102775  
0.04675615271  
0.04632365497  
0.04589476515  
0.04547564315  
0.04505585102  
0.04465734379  
0.04425086973  
0.04385554444  
0.04346583515  
0.04308709556  
0.04270494838  
0.04233622748  
0.04197435825  
0.04161665104  
0.04125867955  
0.04091255606  
0.04056453408  
0.04023138855  
0.03990151894  
0.03957061677  
0.03924724044  
0.03892600518  
0.03861416303  
0.03830426374  
0.03799825161  
0.03770129103  
0.03740681238  
0.03711308935  
0.03683001334  
0.03654370378  
0.03626241854  
0.03599009969  
0.03572117599  
0.0354534851  
0.03519360854  
0.03493038695  
0.03467335644  
0.03441555012  
0.03417159972  
0.03392592483  
0.03368203473  
0.03344207429  
0.03320823019  
0.03297401739  
0.03274594314  
0.03251733219  
0.03229738649  
0.03207857451  
0.03185812123  
0.03164563597  
0.03143631107  
0.03122400852  
0.03101611592  
0.03081714652  
0.03061868122  
0.03041980233  
0.03022225262  
0.03002797052  
0.02983384618  
0.02965284108  
0.02946485755  
0.0292830817  
0.02909616247  
0.02892140766  
0.02874755375  
0.02857216603  
0.02840328005  
0.02822998679  
0.02806493479  
0.02789822964  
0.02773648524  
0.02757443693  
0.02741540512  
0.02725714873  
0.02709970907  
0.02695132527  
0.02679574134  
0.02664213402  
0.02649773073  
0.02635109261  
0.02620646633  
0.02606523805  
0.02592652215  
0.02578510281  
0.02564972193  
0.02551251051  
0.02537730589  
0.02524447173  
0.02511491184  
0.02498424091  
0.02485541074  
0.0247309417  
0.02460380949  
0.02447840242  
0.02435886242  
0.02423747533  
0.02412102042  
0.02400177747  
0.02388489023  
0.02376902327  
0.02365603638  
0.02354370273  
0.02343482858  
0.02332357668  
0.02321423285  
0.0231039823  
0.02300284388  
0.02289415737  
0.02279211556  
0.02269107968  
0.02258808355  
0.02248422903  
0.02238839861  
0.02229167144  
0.02219519741  
0.02210036373  
0.02200390796  
0.02190974221  
0.021817773  
0.02172764585  
0.02163790779  
0.02154539904  
0.02146092796  
0.02137115633  
0.02128316349  
0.0211993055  
0.02111782879  
0.02103422814  
0.02095152392  
0.02086569223  
0.02079267215  
0.02070778976  
0.02062919927  
0.02055137512  
0.02047568363  
0.0203926845  
0.02032310179  
0.02024683293  
0.02017671381  
0.02010209945  
0.0200278568  
0.01996052397  
0.01988469509  
0.01981836804  
0.0197491021  
0.01968229561  
0.01961685841  
0.01954867025  
0.01948073462  
0.01941959632  
0.01935536198  
0.01928716095  
0.01922725878  
0.01916625572  
0.01910256807  
0.01904273322  
0.01898313508  
0.01892485545  
0.01886271372  
0.01880713623  
0.01874923619  
0.01868982989  
0.01863444928  
0.01858249191  
0.01852860197  
0.01847124759  
0.01842216554  
0.0183669287  
0.01831189088  
0.0182641986  
0.0182106141  
0.01816045194  
0.01811067603  
0.01806217459  
0.01801204009  
0.0179664619  
0.01791725815  
0.0178716974  
0.01782725346  
0.01777764402  
0.01773203347  
0.01769064875  
0.01764328497  
0.01760080181  
0.01755898644  
0.01751607736  
0.01747223101  
0.01743070829  
0.01739423456  
0.01735073857  
0.01731070419  
0.01727377944  
0.01723104006  
0.01719238023  
0.0171561261  
0.01711878344  
0.01708137591  
0.01704516135  
0.0170071746  
0.0169718073  
0.01693692223  
0.01690445386  
0.0168676266  
0.01683201252  
0.01679908711  
0.01676957314  
0.01673699446  
0.0167023497  
0.01667119704  
0.01663905245  
0.0166114534  
0.01658017616  
0.01654977996  
0.01652042975  
0.0164920181  
0.01646556306  
0.01643676772  
0.01640845163  
0.01638424883  
0.01635339659  
0.01632556886  
0.01630195622  
0.01627467773  
0.01624949622  
0.01622571292  
0.01620141409  
0.01617481218  
0.01615353921  
0.01613112579  
0.01610770326  
0.01608380678  
0.01606436685  
0.01604067595  
0.01602034257  
0.0159984934  
0.01597844112  
0.01595597412  
0.01593741175  
0.01591886046  
0.01589824594  
0.01588058488  
0.01586307623  
0.01584563408  
0.01582853862  
0.01580942934  
0.01579558233  
0.01577665102  
0.01575786952  
0.01574676617  
0.01572649072  
0.01571366437  
0.01570117067  
0.0156852306  
0.01567171954  
0.01565485392  
0.01564375966  
0.01562838837  
0.01561569926  
0.01560500403  
0.01559479033  
0.01558208041  
0.01557113416  
0.01555791485  
0.01554975269  
0.01553883791  
0.01552935211  
0.01551997318  
0.01550782558  
0.01550187662  
0.01549004052  
0.01548426437  
0.01547714919  
0.01546556342  
0.01545685961  
0.01545538335  
0.01544467296  
0.01544156524  
0.01543215582  
0.01542836625  
0.01542063945  
0.01541773745  
0.01541438582  
0.01541203009  
0.015407588  
0.01540386771  
0.01539750061  
0.01539756383  
0.01539345224  
0.01538890813  
0.01538583761  
0.01538343042  
0.01538776856  
0.01538466603  
0.01538306227  
0.01537974272  
0.01538024491  
