363.6005675  
389.6786853  
443.1031978  
564.2576955  
857.4773438  
3624.80391  
2277.054332  
502.4229416  
4851.925469  
40997.09595  
9809.835665  
5427.820457  
40952.52806  
12766.67962  
4760.906968  
2571.044007  
25298.35582  
2275.999251  
7479.225178  
22558.9566  
7606.663013  
766.5131033  
7131.552798  
28183.39917  
20551.0089  
36025.48112  
14886.41045  
12909.99318  
85538.88473  
529.2731276  
44583.01742  
440.2637542  
3484.955269  
72.94014454  
1625.185323  
2721.089806  
1188.301154  
1170.406259  
1711.06606  
760.1540773  
1827.40036  
33.9555882  
9512.276242  
1108.392537  
918.8438757  
3182.94724  
277.6122329  
265.2973019  
357.1237661  
21.57290225  
943.3580268  
1410.040194  
373.7521622  
252.1003886  
249.5578824  
2710.487019  
706.5329609  
906.6676059  
421.0838407  
109.3149421  
632.876412  
244.6236342  
112.2980846  
30.58516706  
8.658117725  
119.686779  
3.999042775  
7.334438262  
46.27043998  
12.81933019  
36.27486484  
3.556554158  
5.725907706  
2.254319748  
4.730620648  
3.554925181  
0.5663101689  
2.640228863  
2.250038381  
3.284244924  
1.631449286  
1.979478504  
1.037287259  
1.414164801  
1.016410901  
1.301814169  
1.268278845  
1.148048932  
1.066029372  
0.8728514573  
0.9643230205  
0.9251128692  
0.850210974  
0.8337810646  
0.7922289228  
0.697023227  
0.6835837527  
0.6536026076  
0.6355503817  
0.6090383393  
0.5743378844  
0.5535238722  
0.5297934105  
0.5069938589  
0.4904830842  
0.4718920567  
0.4556858214  
0.4383899556  
0.4227822186  
0.4079263904  
0.3941894015  
0.3815944059  
0.3701610076  
0.3556414331  
0.3445744445  
0.3328586357  
0.322439414  
0.3121482182  
0.3032680283  
0.2939388164  
0.2850382323  
0.2762921429  
0.2684558709  
0.2606758159  
0.2533371846  
0.2461438403  
0.239498833  
0.2328764956  
0.2267079382  
0.2206516392  
0.2149456053  
0.2094234061  
0.2040598149  
0.1989361804  
0.193975212  
0.1892085606  
0.1846266641  
0.1802214097  
0.1759728235  
0.1718701321  
0.1678996553  
0.1640578367  
0.1603830227  
0.1568025201  
0.1533419457  
0.1500165882  
0.1467919377  
0.1436604962  
0.1406372674  
0.1377136448  
0.1348790682  
0.1321313094  
0.1294814639  
0.1269028482  
0.1243903655  
0.1219735044  
0.1196161192  
0.1173444403  
0.1151245178  
0.1129753501  
0.110883943  
0.108858327  
0.1068809201  
0.1049658308  
0.1030994289  
0.1012931385  
0.09953064995  
0.09781467279  
0.0961478403  
0.09452545581  
0.09294779868  
0.09141132874  
0.08991460893  
0.08844777957  
0.08702360848  
0.08563762982  
0.08429376155  
0.08297214049  
0.08169068898  
0.08043485319  
0.07922148611  
0.07802480384  
0.07685874129  
0.07572005041  
0.07461670822  
0.0735305114  
0.07247236743  
0.07143981702  
0.07043203672  
0.06945006855  
0.06848624458  
0.06754263761  
0.06662092341  
0.06572454075  
0.06484159019  
0.06398253987  
0.06314265108  
0.06232108474  
0.06151472216  
0.06072203423  
0.05995198959  
0.05920040423  
0.05845481863  
0.05773256131  
0.05702388069  
0.05632803479  
0.05565083562  
0.05498548358  
0.05432940731  
0.05368832411  
0.05306621795  
0.05245006365  
0.05184418434  
0.0512550616  
0.05067485889  
0.05011371635  
0.0495502283  
0.04900479456  
0.04847092217  
0.04794283686  
0.04742532551  
0.04692016408  
0.04642276376  
0.04594127023  
0.04546073207  
0.04498800498  
0.04452859471  
0.04408063603  
0.04363285213  
0.04319346005  
0.04276795209  
0.04234532527  
0.04193027646  
0.04152543639  
0.04112225471  
0.04073201817  
0.04034378515  
0.03996145337  
0.03958994025  
0.03922552746  
0.0388645164  
0.03850754846  
0.03816125509  
0.03782064749  
0.03748221608  
0.03715532132  
0.0368222171  
0.0365047856  
0.03618462808  
0.03587866883  
0.03557328131  
0.03527381262  
0.03497803861  
0.03468547029  
0.03439921546  
0.03411663893  
0.03383976741  
0.03356883744  
0.03329917223  
0.03303553591  
0.03277614956  
0.03251720731  
0.0322587611  
0.0320147277  
0.03177136486  
0.03152866367  
0.03128789935  
0.03105465759  
0.03082550375  
0.03059418673  
0.03037349428  
0.03015131063  
0.02993643601  
0.02972056657  
0.0295116629  
0.02930674724  
0.02909992792  
0.0288977509  
0.02869513768  
0.0284998841  
0.02830529853  
0.02811871751  
0.02792781008  
0.02774604608  
0.02756255513  
0.02737597773  
0.02719875651  
0.02702514307  
0.0268563484  
0.02668356636  
0.02651236785  
0.02634970616  
0.0261855258  
0.02602258673  
0.02586321146  
0.02570540416  
0.02554961658  
0.02539493526  
0.02524700915  
0.02510067781  
0.02495352631  
0.02480906618  
0.02466721745  
0.02452678385  
0.02438635984  
0.02424516478  
0.02411151297  
0.02397876502  
0.02384660521  
0.02371511574  
0.02358780948  
0.02345886279  
0.02333729731  
0.02321184463  
0.02309214431  
0.02297094545  
0.02285259239  
0.022736023  
0.02261768287  
0.02250340493  
0.02239039974  
0.02227801534  
0.02216643599  
0.02206138549  
0.02195403647  
0.02184630896  
0.02174312616  
0.02163783884  
0.02153734257  
0.02143529509  
0.02133840783  
0.02124209912  
0.02114315354  
0.02104604362  
0.02095152816  
0.02086004088  
0.02076707215  
0.02067414525  
0.02058837709  
0.0204979932  
0.02041063254  
0.02032417398  
0.02023996492  
0.02015299967  
0.02007161583  
0.01998738108  
0.0199064148  
0.01982548379  
0.01974672036  
0.01967017128  
0.01959270187  
0.01951209005  
0.01944038327  
0.01936698318  
0.01929362917  
0.01922049506  
0.01914618283  
0.01907944415  
0.01900541143  
0.01893763506  
0.01886945813  
0.01880218383  
0.01873875534  
0.01866798763  
0.01860521633  
0.01854188593  
0.01847608458  
0.01841574965  
0.01835201047  
0.01829458443  
0.01823358747  
0.01817403495  
0.01811643088  
0.01805698067  
0.01800164281  
0.01794037124  
0.01788915591  
0.01783456659  
0.0177777546  
0.01772671287  
0.01767072446  
0.01762204712  
0.01757164706  
0.01751926433  
0.01746766452  
0.01741571897  
0.01736947176  
0.01732241639  
0.01727142606  
0.01722898322  
0.01718151515  
0.01713611348  
0.01708957249  
0.01704593093  
0.01699931097  
0.0169582543  
0.01691388918  
0.01687266671  
0.01683279129  
0.01679240944  
0.01674995513  
0.0167122555  
0.01667460475  
0.01663245697  
0.01659530272  
0.01655829057  
0.01652223016  
0.01648207834  
0.01644838407  
0.01641197036  
0.01637819155  
0.01634158765  
0.01631028932  
0.0162755473  
0.0162459455  
0.01621053926  
0.01617907916  
0.0161478961  
0.01611513228  
0.01608654868  
0.01605565048  
0.01602590933  
0.01599566555  
0.01597025162  
0.01594170676  
0.01591287487  
0.01588659437  
0.0158592174  
0.01583649195  
0.01581051125  
0.01578180437  
0.01576126233  
0.01573511938  
0.01571029033  
0.01568585672  
0.01566449495  
0.01564103414  
0.01561716201  
0.01560028267  
0.01557588805  
0.0155549611  
0.01553433356  
0.01551742696  
0.01549525769  
0.01547699628  
0.01545771523  
0.01544024118  
0.0154203957  
0.01540488798  
0.01538737041  
0.01537217021  
0.01535520918  
0.01533590983  
0.01532318241  
0.01530602629  
0.01529347516  
0.01527988066  
0.01526515654  
0.01525242934  
0.01524022841  
0.01522511961  
0.01521462801  
0.01520196595  
0.01519128989  
0.0151806567  
0.01517036102  
0.01515903445  
0.01514603845  
0.01513936817  
0.01513062384  
0.0151209707  
0.01511416597  
0.01510471265  
0.01509563714  
0.01508854561  
0.01508183166  
0.01507621634  
0.01507212018  
0.01506446053  
0.0150607149  
0.01505459137  
0.01505171948  
0.01504394858  
0.01503979129  
0.01503844801  
0.01503291128  
0.01503456135  
0.01502779161  
0.01502751399  
0.01502716828  
0.01502642033  
0.01502583455  
0.01502364629  
0.01502095606  
