95.42332877  
99.6569902  
112.2527626  
125.9894915  
15.29253458  
5091.909821  
21833.46231  
31952.41502  
24906.32909  
19360.64903  
23038.90972  
5713.032648  
27040.61235  
29466.57265  
2532.510046  
18852.70514  
25988.17535  
13594.17641  
1561.543972  
11237.58088  
12037.34235  
11616.10009  
6254.708329  
9161.32054  
1213.482119  
6350.389039  
6812.878108  
23792.52701  
2126.411109  
7350.397664  
1492.550054  
2166.647602  
2283.344364  
7662.125287  
7123.911798  
2066.998858  
11175.42821  
4157.025728  
6753.071893  
7744.114114  
9349.461025  
3076.312013  
2426.315658  
926.1838951  
5393.000544  
4710.195145  
7216.061122  
5865.306424  
9429.944818  
3500.129192  
8175.97175  
5745.938465  
930.1013706  
1404.908612  
3358.861603  
5503.730598  
2083.149363  
568.94148  
308.5878566  
1406.708854  
511.1107976  
929.189236  
857.6313679  
591.4243677  
196.1298012  
499.5382881  
187.9680445  
157.4245693  
67.03948525  
107.8621488  
8.705045119  
39.54944185  
15.27572574  
6.039691713  
13.30073204  
6.936724424  
11.18499859  
3.466564332  
2.415912531  
0.2110184767  
0.1255997234  
0.1110937277  
0.3188872544  
1.4867535  
0.7764372655  
0.8229758295  
0.4782202758  
0.4353455991  
0.2689137089  
0.2492499856  
0.3448197334  
0.3426250412  
0.4399672754  
0.3837183614  
0.3601993231  
0.3299241459  
0.3033970681  
0.2676918689  
0.2639460974  
0.2706163811  
0.2728779305  
0.2755068913  
0.2683571865  
0.2562004505  
0.2476941761  
0.2345809058  
0.2236475773  
0.216298511  
0.210812418  
0.2076584412  
0.2041711073  
0.2001724748  
0.1952991093  
0.1896761176  
0.1841119866  
0.1791372503  
0.1740313276  
0.1702897993  
0.1667470037  
0.1632678864  
0.1596912115  
0.1559896631  
0.1523424957  
0.1489431218  
0.1454620306  
0.1422707088  
0.1392182913  
0.1365017824  
0.1337115743  
0.1309740435  
0.1284301711  
0.125788733  
0.1232885121  
0.1207971924  
0.1184530203  
0.116168764  
0.1139890478  
0.1118875589  
0.1098192365  
0.1078299967  
0.1058798304  
0.1039719067  
0.1021211321  
0.100330549  
0.09859529705  
0.09690655347  
0.09527278316  
0.09367608455  
0.09212109765  
0.09060641896  
0.08913113854  
0.08769268167  
0.08628874758  
0.08492723447  
0.08360183957  
0.0823080018  
0.08104838344  
0.07982249433  
0.07862069539  
0.07745135493  
0.07631024492  
0.07519487771  
0.07410985544  
0.07304601931  
0.072010107  
0.07099913462  
0.07000910418  
0.06904373372  
0.06809871133  
0.0671746342  
0.06627140833  
0.06539198031  
0.06452858615  
0.0636863614  
0.06286191692  
0.06205413632  
0.06126370324  
0.06049260977  
0.05973470306  
0.05899430066  
0.05826803705  
0.05755897919  
0.05686503274  
0.05618547943  
0.05551831114  
0.05486316891  
0.05422494799  
0.05359349351  
0.05297863188  
0.05237394814  
0.05178316161  
0.05120100404  
0.0506332289  
0.0500752027  
0.04952712422  
0.04899185898  
0.04846406885  
0.04794640414  
0.0474402753  
0.04693992517  
0.04645093932  
0.04597217365  
0.04550153238  
0.04503777893  
0.04458330621  
0.04413688762  
0.04369723527  
0.04326861646  
0.04284355769  
0.04242871555  
0.04201882887  
0.04161771924  
0.04122326958  
0.04083362609  
0.04045304993  
0.04007535809  
0.03970844149  
0.0393462061  
0.03898938982  
0.03863899352  
0.03829299608  
0.03795327413  
0.03761968193  
0.03728996504  
0.03696601638  
0.0366467969  
0.03633503942  
0.03602575758  
0.03572483699  
0.0354278418  
0.03513181271  
0.03484166842  
0.03455916873  
0.03427729489  
0.03400201177  
0.03372756019  
0.03346068053  
0.03319732669  
0.03293634088  
0.03268139003  
0.03242935644  
0.03218108237  
0.03193607781  
0.03169443777  
0.03145750102  
0.03122485547  
0.03099139385  
0.03076433803  
0.03054101058  
0.03031786043  
0.03010265266  
0.02988558524  
0.02967550262  
0.02946689819  
0.0292599165  
0.02905887862  
0.02885855095  
0.02865991322  
0.02846715413  
0.02827372657  
0.02808468747  
0.02789615123  
0.02771435074  
0.02753139885  
0.02735267988  
0.02717645498  
0.02700076835  
0.02682940258  
0.02666101029  
0.02649221418  
0.0263275417  
0.02616454228  
0.02600392388  
0.02584601241  
0.02568844151  
0.02553293796  
0.02538054806  
0.02523055475  
0.02508112507  
0.02493469704  
0.02478889192  
0.02464521658  
0.02450376601  
0.02436353019  
0.02422521617  
0.02409168738  
0.02395659802  
0.02382525902  
0.02369309906  
0.02356406949  
0.02343560303  
0.02331038254  
0.02318764322  
0.02306229469  
0.02294233324  
0.02282176842  
0.0227023769  
0.02258772118  
0.02246970873  
0.02235562565  
0.02224243602  
0.02213342223  
0.02202239684  
0.02191377256  
0.02180630633  
0.02170095493  
0.02159402465  
0.02149292452  
0.02138942553  
0.02128772695  
0.02118878375  
0.02108912576  
0.02099214521  
0.02089544844  
0.0208014396  
0.02070735646  
0.02061379358  
0.02052126545  
0.02043113868  
0.02034144793  
0.02025339636  
0.02016620621  
0.02007851666  
0.01999186801  
0.01990725283  
0.01982512472  
0.01974200902  
0.01965996564  
0.01958004326  
0.01950008496  
0.01942323093  
0.01934454817  
0.01926748854  
0.01919172651  
0.01911545015  
0.01904123444  
0.01896740518  
0.01889454875  
0.01882435823  
0.01875263364  
0.0186839787  
0.0186118297  
0.01854533941  
0.01847728971  
0.01841291305  
0.01834501672  
0.01828066032  
0.0182155417  
0.01815057806  
0.0180891313  
0.01802498593  
0.0179655011  
0.01790432322  
0.01784430024  
0.01778449036  
0.01772519306  
0.01766585865  
0.01760998693  
0.01755315803  
0.01749683309  
0.01744081799  
0.01738737007  
0.01733275854  
0.0172793368  
0.01722669202  
0.01717477025  
0.01712401305  
0.01707279443  
0.01702178833  
0.01697251522  
0.01692379709  
0.01687504104  
0.01682719925  
0.01677939924  
0.01673343649  
0.01668708725  
0.01664043752  
0.01659449173  
0.01655256844  
0.01650821223  
0.01646416887  
0.01642189291  
0.01637830559  
0.01633613459  
0.01629628585  
0.01625455774  
0.0162152897  
0.01617431107  
0.01613600443  
0.01609646484  
0.01605886428  
0.01602001526  
0.01598434293  
0.01594677405  
0.01591045216  
0.01587556701  
0.0158395049  
0.01580531335  
0.01576950337  
0.01573697898  
0.01570295923  
0.01566965139  
0.01563872796  
0.01560435172  
0.01557228946  
0.01554129844  
0.01551144609  
0.01548073774  
0.0154511587  
0.01542276357  
0.0153919643  
0.01536431674  
0.01533586114  
0.01530728733  
0.01527923574  
0.01525236794  
0.01522629489  
0.01520157889  
0.01517503278  
0.01514859635  
0.01512503679  
0.01510085197  
0.01507593887  
0.01505120788  
0.01502776391  
0.01500481201  
0.01498319859  
0.01496003459  
0.01493899638  
0.01491756988  
0.01489529269  
0.01487594868  
0.0148548063  
0.01483323315  
0.01481552448  
0.01479441307  
0.01477852349  
0.01475768458  
0.01474042477  
0.01472266544  
0.01470552205  
0.01468761626  
0.01467052471  
0.0146557067  
0.01463872343  
0.01462268301  
0.01460776142  
0.01459096888  
0.01457768379  
0.01456235674  
0.01454823748  
0.01453607015  
0.0145218157  
0.01450986256  
0.01449696579  
0.01448422874  
0.01447294443  
0.01446121028  
0.01444960719  
0.01443765699  
0.01442707301  
0.01441630029  
0.01440573418  
0.01439714238  
0.01438714054  
0.01437838167  
0.01437031465  
0.01436249936  
0.01435380366  
0.01434541512  
0.01433877116  
0.01433080365  
0.0143240578  
0.01431862571  
0.01431269823  
0.01430673642  
0.0143016696  
0.0142967386  
0.01429145294  
0.01428665859  
0.01428219449  
0.01427901518  
0.01427420486  
0.014271307  
0.01426729005  
0.01426603617  
0.01426350594  
0.01426130825  
0.01426032109  
0.01425756904  
0.01425649146  
0.01425551155  
0.0142552558  
0.01425607607  
