0.1496324963  
0.276574372  
0.3961192083  
0.5022011334  
0.5900964194  
0.6568389649  
0.7014133149  
0.7247183549  
0.7293061055  
0.7189556701  
0.698142578  
0.6714847604  
0.6432387609  
0.6169104589  
0.5950145578  
0.5789941365  
0.5692921058  
0.5655293854  
0.5667527439  
0.5716920839  
0.5789899861  
0.5873638267  
0.5956898439  
0.6030078229  
0.608469583  
0.6112504546  
0.6104674132  
0.6051230434  
0.5941053573  
0.576248998  
0.5504569625  
0.5158650409  
0.4720213633  
0.4190478586  
0.3577519444  
0.2896593518  
0.2169480876  
0.1422863447  
0.06858118622  
-0.001326997833  
-0.06498885114  
-0.1206358244  
-0.1673937867  
-0.2053749624  
-0.2356297888  
-0.2599506092  
-0.2805478011  
-0.2996429067  
-0.3190341077  
-0.3397064976  
-0.3615516118  
-0.3832558942  
-0.4023879513  
-0.4156889574  
-0.4195352541  
-0.4105176744  
-0.3860490005  
-0.3449149206  
-0.2876746021  
-0.2168487172  
-0.136850979  
-0.05366637191  
0.02568761276  
0.09384622694  
0.1438426989  
0.1698079483  
0.1675487071  
0.1349282645  
0.07202897191  
-0.01891136301  
-0.1337441926  
-0.2667889634  
-0.4112773232  
-0.5598017681  
-0.7047300534  
-0.8385649746  
-0.9542554214  
-1.045479874  
-1.106938674  
-1.134673125  
-1.126416398  
-1.08195486  
-1.003445999  
-0.8956130384  
-0.765742522  
-0.6233948395  
-0.4797996798  
-0.3469224031  
-0.2362748873  
-0.157580669  
-0.1174594652  
-0.1183274844  
-0.1576975651  
-0.2280377098  
-0.3172754885  
-0.40995276  
-0.4889363312  
-0.5374978846  
-0.5415091626  
-0.4914572016  
-0.3839921512  
-0.2227705422  
-0.01844169087  
0.2122608476  
0.44824061  
0.6663752133  
0.8441883394  
0.9625258713  
1.007896501  
0.9741908736  
0.8635546595  
0.6863134346  
0.4599537058  
0.2072823253  
-0.04600896908  
-0.2740885754  
-0.4537144313  
-0.5666379542  
-0.6014116835  
-0.5544184504  
-0.430025856  
-0.2398896128  
-0.001516756044  
0.2637089079  
0.532796747  
0.7834446397  
0.9961104655  
1.155659498  
1.252447772  
1.282783134  
1.248777211  
1.157668533  
1.020743302  
0.8520013498  
0.6667303718  
0.480117993  
0.3060331794  
0.1560416893  
0.03871787703  
-0.04074062367  
-0.08060186919  
-0.08241917515  
-0.05062604257  
0.008049642151  
0.08529567064  
0.1719945524  
0.259015222  
0.3379556999  
0.4017834775  
0.4453250943  
0.4655628976  
0.4617211009  
0.4351391605  
0.3889560446  
0.3276416586  
0.256442449  
0.1807985072  
0.1058038128  
0.0357631949  
-0.02611775082  
-0.07788751118  
-0.1188566012  
-0.1494802931  
-0.1711429717  
-0.1858948044  
-0.1961647611  
-0.2044865819  
-0.2132573095  
-0.2245314436  
-0.2398672026  
-0.2602119756  
-0.2858394205  
-0.3163314609  
-0.3506178299  
-0.3870698486  
-0.4236514551  
-0.4581204416  
-0.4882618939  
-0.5121336683  
-0.5282896005  
-0.5359502753  
-0.5351011532  
-0.526495376  
-0.511560061  
-0.4922240685  
-0.4706822403  
-0.4491352691  
-0.4295395252  
-0.413396076  
-0.4016044953  
-0.3943934069  
-0.3913230177  
-0.3913498181  
-0.3929332104  
-0.394159692  
-0.3928697354  
-0.3867769417  
-0.3735798031  
-0.3510792707  
-0.3173096184  
-0.2707020526  
-0.2102774339  
-0.1358613724  
-0.0482921589  
0.05041364168  
0.1569837171  
0.2669362257  
0.3747833481  
0.4743912759  
0.5594827659  
0.6242351328  
0.6639103414  
0.6754411702  
0.6578853717  
0.612688142  
0.5436939873  
0.4568878132  
0.3598804742  
0.2611832472  
0.1693487327  
0.09207413376  
0.03537437795  
0.002929091112  
-0.004320985019  
0.01173193622  
0.0465850487  
0.09364482715  
0.1449806796  
0.1922214264  
0.2274871588  
0.2442523266  
0.2380369654  
0.206853345  
0.1513647352  
0.07474658031  
-0.01772282091  
-0.1192863381  
-0.2224740072  
-0.3199143351  
-0.4051079091  
-0.4730789112  
-0.5208367847  
-0.5476086227  
-0.5548227427  
-0.5458519962  
-0.5255533156  
-0.4996579856  
-0.4740765094  
-0.4542050916  
-0.4443012675  
-0.446992874  
-0.4629817343  
-0.4909520863  
-0.5277017273  
-0.5684666318  
-0.6074050239  
-0.6381815986  
-0.654596786  
-0.6511994777  
-0.6238267877  
-0.57002592  
-0.4893249175  
-0.3833253189  
-0.2556113395  
-0.1114765913  
0.04251530875  
0.1990998516  
0.3509620202  
0.491406436  
0.6149725803  
0.7179264859  
0.7985640825  
0.8572810904  
0.8963968492  
0.9197500937  
0.9321138226  
0.9385077761  
0.9434972599  
0.9505735772  
0.9616878756  
0.976998702  
0.9948499255  
1.011974344  
1.023886776  
1.025410865  
1.011282933  
0.9767661151  
0.9182324245  
0.8336613663  
0.7230282209  
0.5885558338  
0.4348052624  
0.2685836418  
0.09864340414  
-0.06483768435  
-0.2110063762  
-0.3292848292  
-0.4104711483  
-0.4479006555  
-0.4385286936  
-0.3837896753  
-0.2900691764  
-0.168647269  
-0.03502529958  
0.09238248791  
0.1941127314  
0.2519006543  
0.2510515867  
0.1826185555  
0.04505941114  
-0.1549231452  
-0.4025592888  
-0.6762770101  
-0.9499692996  
-1.196016945  
-1.388679518  
-1.507396044  
-1.539514548  
-1.482033533  
-1.342078891  
-1.13601367  
-0.8873019282  
-0.6234196634  
-0.3722736698  
-0.1586509724  
-0.001212492908  
0.08954372142  
0.1120903941  
0.07338361909  
-0.01277971347  
-0.1282450555  
-0.2534009769  
-0.370024854  
-0.4636383718  
-0.5250540954  
-0.5509326816  
-0.5433558058  
-0.5085718517  
-0.455206609  
-0.3922837772  
-0.3274192902  
-0.2654874136  
-0.207949825  
-0.1529233  
-0.09591112901  
-0.03103174709  
0.04751637144  
0.1440158559  
0.2600853316  
0.3940098787  
0.5406536351  
0.6919510408  
0.8378838794  
0.9677780693  
1.071703362  
1.141766456  
1.173101227  
1.164421682  
1.118072476  
1.039589097  
0.9368484983  
0.8189512119  
0.6950012658  
0.5729652646  
0.4587661704  
0.3557331963  
0.2644718457  
0.183154798  
0.108174258  
0.03505195823  
-0.04054471101  
-0.1218311538  
-0.2101310558  
-0.3044135007  
-0.4012158026  
-0.4949674732  
-0.5786716933  
-0.6448472702  
-0.6866040392  
-0.6986922739  
-0.6783836487  
-0.6260486326  
-0.5453494869  
-0.4430073831  
-0.3281672634  
-0.2114271802  
-0.1036495251  
-0.01469601161  
0.04776123639  
0.07920362047  
0.07888165178  
0.05000067062  
-0.0005654802772  
-0.06301134732  
-0.1257243314  
-0.1766738583  
-0.2049176617  
-0.2020445948  
-0.1633801963  
-0.08879587591  
0.0170003735  
0.1447478955  
0.2814933441  
0.4119386961  
0.5201367876  
0.5913374406  
0.6137599747  
0.5800769497  
0.4884165058  
0.3427591602  
0.1526685388  
-0.06760962032  
-0.3005761895  
-0.5272597274  
-0.7291383262  
-0.8899724205  
-0.9973356115  
-1.043674511  
-1.026790332  
-0.9497086424  
-0.8199858351  
-0.6485657294  
-0.448360058  
-0.232744558  
-0.01418153994  
0.1968681491  
0.3926144579  
0.5681341975  
0.7211177918  
0.8512515105  
0.9593802125  
1.046622369  
1.113608214  
1.159974217  
1.184206856  
1.183845085  
1.155990965  
1.098017052  
1.008326703  
0.8870130049  
0.7362882005  
0.5605945251  
0.3663775737  
0.1615506696  
-0.04525999097  
-0.2455701369  
-0.4318608744  
-0.5982595751  
-0.7409904642  
-0.8585480815  
-0.9516004939  
-1.022649633  
-1.075511372  
-1.114687937  
-1.144694409  
-1.169412478  
-1.191514948  
-1.212007785  
-1.229931608  
-1.242255678  
-1.243998574  
-1.228606883  
-1.188591357  
-1.116408285  
-1.005525852  
-0.8515715242  
-0.6534256032  
-0.4140956901  
-0.1412090955  
0.1530152683  
0.4523917204  
0.7379924095  
0.989875472  
1.189141064  
1.320059161  
1.371997658  
1.340866473  
1.229865031  
1.049404477  
0.8161829138  
0.5515238723  
0.2791839905  
0.02291293478  
-0.1959173882  
-0.3603205867  
-0.4590951361  
-0.4874739313  
-0.4469860323  
-0.3446114891  
-0.1914016886  
-0.0008074619531  
0.2130211656  
0.4367103358  
0.6587205451  
0.8698701679  
1.063322274  
1.234112503  
1.378388252  
1.492577633  
1.57270637  
1.614060855  
1.611307488  
1.559094513  
1.453053061  
1.291015027  
1.074220778  
0.8082462303  
0.5034366324  
0.1746803596  
-0.1595072569  
-0.4785317939  
-0.7617081832  
-0.9904360687  
-1.150263376  
-1.232558996  
-1.235566701  
-1.164704011  
-1.03207232  
-0.8552475484  
-0.6555039991  
-0.4556887704  
-0.2779850347  
-0.1418032512  
-0.06201903048  
-0.04770955937  
-0.1015053584  
-0.2195843388  
-0.3922895028  
-0.6052771718  
-0.8410612466  
-1.080776667  
-1.305972226  
-1.500240688  
-1.650523536  
-1.747968973  
-1.788282352  
-1.771573459  
-1.701773313  
-1.585734065  
-1.432171523  
-1.250598668  
-1.050395285  
-0.8401106837  
-0.6270459602  
-0.4171104712  
-0.2149009189  
-0.02391321188  
0.1531971858  
0.3143959548  
0.4581386123  
0.5833473231  
0.6894694891  
0.7765711702  
0.8453968229  
0.8973463762  
0.9343297546  
0.9585028309  
0.9719216665  
0.9761813869  
0.9721213986  
0.9596792425  
0.9379434626  
0.9054314821  
0.8605599775  
0.8022402478  
0.7304928796  
0.6469635243  
0.555219332  
0.4607442675  
0.3705863425  
0.2926731215  
0.2348654441  
0.2038783379  
0.2042200696  
0.2373265503  
0.3010372786  
0.3895301627  
0.4937646394  
0.6024095725  
0.7031488704  
0.7842075132  
0.8358729715  
0.8517928138  
0.829830772  
0.7723349133  
0.6857393343  
0.5795336728  
0.464730878  
0.3520582617  
0.2501505927  
0.1640451188  
0.09424102588  
0.03651048567  
-0.01746656787  
-0.07870635714  
-0.1589502105  
-0.2684135413  
-0.4136036684  
-0.5955659421  
-0.8088584321  
-1.041458407  
-1.275664865  
-1.489906666  
-1.661234187  
-1.76815951  
-1.793450671  
-1.726498299  
-1.56491497  
-1.3151498  
-0.9920295318  
-0.6172887364  
-0.2172829632  
0.1798100703  
0.546946796  
0.8609623538  
1.104770463  
1.268782397  
1.351392582  
1.358526474  
1.302341599  
1.199290147  
1.067813311  
0.925977842  
0.7893574657  
0.6694262382  
0.5726335255  
0.5002567816  
0.4489926539  
0.4121591772  
0.3812970305  
0.3478955091  
0.3049798557  
0.2483054451  
0.1769909896  
0.09349890991  
0.002991173119  
-0.08782120059  
-0.1721266204  
-0.2445042526  
-0.3021886982  
-0.3458703496  
-0.3798659863  
-0.4115836822  
-0.4503391841  
-0.5056789124  
-0.585465132  
-0.6940421198  
-0.8308034139  
-0.9894419511  
-1.158076959  
-1.320305437  
-1.45709399  
-1.549274796  
-1.580287892  
-1.538764642  
-1.420540257  
-1.229751263  
-0.9788169539  
-0.6872573182  
-0.3794952791  
-0.08194433732  
0.1801993931  
0.3859902388  
0.5211570771  
0.579573722  
0.5635876013  
0.4831973897  
0.3542447615  
0.1959310824  
0.02805141622  
-0.1316230977  
-0.2694491533  
-0.3772155364  
-0.4525196395  
-0.4982245233  
-0.5211557406  
-0.5302979669  
-0.5348169044  
-0.5422311284  
-0.5570245366  
-0.5798895182  
-0.6076955273  
-0.6341499898  
-0.6510157353  
-0.6496696717  
-0.6227462902  
-0.5655978843  
-0.4773493886  
-0.3613815423  
-0.2251672495  
-0.07947360399  
0.06295769  
0.1890898297  
0.2873900178  
0.3495245759  
0.3717091723  
0.3555353697  
0.3081486927  
0.2417243898  
0.1722880626  
0.1179842539  
0.09698156743  
0.1252360005  
0.2143671829  
0.3698955292  
0.5900569976  
0.8653629624  
1.178995142  
1.508043413  
1.825494179  
2.102801973  
2.312788804  
2.432578064  
2.446238282  
2.346833083  
2.137618275  
1.832212496  
1.45367228  
1.03252817  
0.6039585382  
0.2043919375  
-0.1321010417  
-0.3772168501  
-0.5112362206  
-0.5249203112  
-0.4202618288  
-0.2100039381  
0.08399317545  
0.4333258488  
0.8062113051  
1.170833192  
1.498444018  
1.7658456  
1.956990481  
2.063576424  
2.084674681  
2.025569847  
1.896090838  
1.708758327  
1.477059354  
1.214089275  
0.9316958264  
0.6401380942  
0.3481763438  
0.06341909661  
-0.207262075  
-0.4574337658  
-0.6810403896  
-0.8726303495  
-1.027828914  
-1.14395323  
-1.220614184  
-1.260148605  
-1.267746677  
-1.251197166  
-1.220244894  
-1.185621527  
-1.157882537  
-1.146207923  
-1.157345693  
-1.194850194  
-1.258725528  
-1.345525956  
-1.448894026  
-1.560463076  
-1.670996848  
-1.771609097  
-1.854905939  
-1.915898668  
-1.952576668  
-1.966067516  
-1.960374461  
-1.941725303  
-1.917621338  
-1.895705819  
-1.8825995  
-1.88284887  
-1.898121874  
-1.926763469  
-1.963772529  
-2.001217399  
-2.029055924  
-2.036267095  
-2.012169605  
-1.947765597  
-1.836945661  
-1.677396653  
-1.471095338  
-1.224309811  
-0.9471035852  
-0.6523940103  
-0.3546805989  
-0.06859973106  
0.1925134452  
0.4178798683  
0.6002055831  
0.7361818583  
0.8265261231  
0.8755846753  
0.8905845443  
0.8806495146  
0.8557218461  
0.8255204396  
0.7986497648  
0.7819356683  
0.7800304611  
0.7952862551  
0.8278696068  
0.8760760774  
0.936779477  
1.005967511  
1.079303494  
1.15266884  
1.222645469  
1.286898907  
1.344434924  
1.395700502  
1.442517702  
1.487854088  
1.535439088  
1.58927297  
1.653074216  
1.729734294  
1.820844008  
1.926350036  
2.044383534  
2.171280772  
2.301784525  
2.429402817  
2.546867381  
2.646643043  
2.721424215  
2.764575478  
2.770481978  
2.734801174  
2.65461935  
2.528531828  
2.356670518  
2.140695701  
1.883764127  
1.590462052  
1.266688202  
0.9194530211  
0.5565742692  
0.1862527086  
-0.1834639305  
-0.5452767077  
-0.8932304443  
-1.22320029  
-1.533164881  
-1.823170318  
-2.094919931  
-2.350986693  
-2.593710217  
-2.823916794  
-3.039663576  
-3.235238759  
-3.400653558  
-3.521817724  
-3.581499575  
-3.561066449  
-3.442863705  
-3.212971616  
-2.863985775  
-2.397412462  
-1.825285741  
-1.170677164  
-0.4668978069  
0.2446501626  
0.9178269038  
1.5059976  
1.966712485  
2.266268288  
2.383594876  
2.31294207  
2.064979632  
1.666096135  
1.155894395  
0.5831184667  
0.0004472572359  
-0.5412503343  
-0.9984988142  
-1.339952098  
-1.549663103  
-1.628456144  
-1.593189395  
-1.473980243  
-1.309725745  
-1.142489778  
-1.011480474  
-0.9474190731  
-0.9680510146  
-1.07540991  
-1.255223918  
-1.478562399  
-1.705533805  
-1.89056258  
-1.98856193  
-1.961196532  
-1.78240751  
-1.442469901  
-0.9500349596  
-0.3318844279  
0.3695914304  
1.10087246  
1.803177984  
2.418986054  
2.898383629  
3.20446745  
3.317151634  
3.234949736  
2.974577616  
2.568497711  
2.060778998  
1.501849795  
0.9428262708  
0.4301164528  
0.0009288428083  
-0.3198444795  
-0.5210978735  
-0.605287222  
-0.5866836204  
-0.4884362672  
-0.3389061613  
-0.1677752135  
-0.002409517842  
0.1351089769  
0.2299961583  
0.2756824369  
0.2736242932  
0.2321463451  
0.1645423835  
0.08673104625  
0.01478658619  
-0.03735068457  
-0.05972794621  
-0.04761024395  
-0.001988146989  
0.07065381442  
0.1592382238  
0.2495335444  
0.3259494858  
0.3734757884  
0.3795590313  
0.3357136203  
0.2387064457  
0.09119149436  
-0.09826590843  
-0.3157873146  
-0.5433504399  
-0.7604213839  
-0.9459049737  
-1.080221992  
-1.14731355  
-1.136367361  
-1.043077282  
-0.8702978383  
-0.6280064057  
-0.3325571943  
-0.005295179587  
0.329333305  
0.645985953  
0.9207087496  
1.133067854  
1.267910295  
1.316587065  
1.27752853  
1.156138304  
0.964048961  
0.717830704  
0.4373152286  
0.1437041069  
-0.142335905  
-0.4024137925  
-0.6218267643  
-0.7905270533  
-0.9035712234  
-0.961034351  
-0.9674360935  
-0.9307627254  
-0.8612312056  
-0.7699469203  
-0.6676262315  
-0.5635345701  
-0.4647560695  
-0.3758523963  
-0.2989159327  
-0.2339562616  
