759.6817173  
791.1612952  
853.4317002  
978.4206574  
1471.509785  
947.2514863  
10960.53358  
65943.21492  
2157.59446  
16291.47178  
1153.813803  
12445.9992  
17045.2657  
44365.87662  
1044.544017  
15023.23285  
9733.328375  
9838.016247  
1010.401959  
8850.985825  
49403.96908  
42296.31483  
7933.784807  
40.02983404  
7672.943664  
3883.790346  
20262.46428  
1868.33902  
1473.706886  
14173.25909  
1046.806329  
8202.434511  
1357.226635  
676.6077869  
12715.84686  
3146.355343  
4014.450339  
309.7663161  
1931.098027  
10097.09895  
2220.593912  
4097.834542  
4227.714509  
10267.29746  
1885.439336  
1161.482589  
19422.8216  
9108.918477  
1166.638395  
2109.186107  
4128.856167  
2941.075701  
600.4876075  
1156.451473  
1804.760889  
210.9279121  
3048.673609  
138.487356  
278.7347637  
730.9155221  
908.0398318  
230.6306874  
641.8192465  
53.53324019  
71.05845276  
31.5495429  
79.46829509  
168.1596724  
54.56348035  
61.75493617  
10.99391233  
17.76265007  
23.37012518  
31.57573679  
15.79845305  
10.67551651  
26.71972158  
3.589142934  
11.31122745  
9.093367184  
6.560837353  
8.504060895  
9.755993543  
7.655845214  
8.062148832  
6.223717653  
6.428514685  
6.056354937  
5.601855701  
4.893493189  
5.296824656  
4.61956319  
4.556085152  
4.212229514  
4.02254754  
3.905547199  
3.741336977  
3.603632286  
3.439262741  
3.298235659  
3.102052467  
3.026760711  
2.875100025  
2.77160773  
2.668621613  
2.555622204  
2.459486977  
2.372655803  
2.273752813  
2.199104925  
2.121563391  
2.042638239  
1.972166894  
1.905373379  
1.83831418  
1.781904271  
1.722727  
1.66533196  
1.612195233  
1.560552147  
1.510269867  
1.465435542  
1.418741393  
1.376968643  
1.33615092  
1.295814003  
1.258035101  
1.222084198  
1.187201373  
1.153918  
1.12164901  
1.090607944  
1.061155551  
1.032547316  
1.005013076  
0.9785117039  
0.9530197499  
0.9284760161  
0.9047246251  
0.881862746  
0.8598801387  
0.838579498  
0.8181299535  
0.7984032292  
0.779221736  
0.7606880977  
0.7429213456  
0.7256372944  
0.7090010936  
0.6928393523  
0.6772054678  
0.662090936  
0.6474621567  
0.6333221387  
0.6196066428  
0.6063100314  
0.5934317356  
0.5809503853  
0.5688451572  
0.5571009994  
0.5457030843  
0.5346606494  
0.5239145161  
0.5135043133  
0.5034024767  
0.4935782603  
0.4840229577  
0.4747694117  
0.4657460838  
0.4569788057  
0.448478938  
0.4401992253  
0.4321424467  
0.4242882746  
0.4166747759  
0.4092326698  
0.4019958039  
0.3949740097  
0.3881195543  
0.3814357986  
0.3749378551  
0.3685929754  
0.3624168164  
0.3563942953  
0.3505188583  
0.3447997149  
0.3391855758  
0.3337646729  
0.3284517708  
0.3232613799  
0.3182124882  
0.3132563621  
0.3084343698  
0.3037337328  
0.2991371643  
0.2946490514  
0.2902635578  
0.2859782843  
0.2817799765  
0.2776897971  
0.2736965437  
0.2697798441  
0.265968971  
0.2622146255  
0.258562308  
0.2549964557  
0.2514982143  
0.2480632723  
0.2447275724  
0.2414381256  
0.2382250318  
0.2350890727  
0.2320211866  
0.2290040524  
0.2260600954  
0.223176878  
0.2203456414  
0.2175674325  
0.2148550684  
0.2122133013  
0.2095986413  
0.2070409303  
0.2045369969  
0.2020908409  
0.1996799145  
0.1973299771  
0.1950229335  
0.1927521996  
0.1905255116  
0.1883444071  
0.186206067  
0.184099766  
0.1820478755  
0.1800240186  
0.1780438232  
0.1760976453  
0.174188349  
0.1723055808  
0.1704709947  
0.1686621767  
0.1668742386  
0.1651411751  
0.163427582  
0.1617462301  
0.1601000483  
0.1584631391  
0.1568666011  
0.1553021567  
0.1537778885  
0.1522579513  
0.1507850021  
0.1493095263  
0.1478908712  
0.1464670817  
0.1450769721  
0.1437138666  
0.1423732164  
0.1410582663  
0.1397574166  
0.1384802722  
0.1372250895  
0.1359974776  
0.1347800417  
0.1335913075  
0.1324166985  
0.1312615949  
0.1301327134  
0.1290073404  
0.127902137  
0.1268254333  
0.1257545498  
0.1247013644  
0.1236730695  
0.1226511597  
0.1216517521  
0.1206656264  
0.1196953717  
0.1187435872  
0.1178018573  
0.1168764062  
0.1159696348  
0.1150757687  
0.114195758  
0.113318715  
0.1124535289  
0.1116119248  
0.1107762643  
0.1099606157  
0.1091469279  
0.1083535664  
0.1075682269  
0.1068008251  
0.106034863  
0.1052828962  
0.1045469593  
0.1038186691  
0.103099624  
0.1023836124  
0.1016905476  
0.1010029552  
0.1003207627  
0.09965737148  
0.09899708995  
0.09835314262  
0.09771202574  
0.09707834066  
0.09645007062  
0.09584273615  
0.09523082366  
0.09463465972  
0.09404864518  
0.09347656458  
0.09289646805  
0.09233875727  
0.09177647838  
0.09122579086  
0.09067943685  
0.09015060107  
0.08961690759  
0.08909775824  
0.08859553444  
0.08808372931  
0.08758959202  
0.08709576261  
0.08660916787  
0.0861300114  
0.08566133547  
0.08518021683  
0.08472931667  
0.08427414607  
0.08382865269  
0.08337772599  
0.0829496958  
0.08251945337  
0.08209038258  
0.08167496337  
0.08125655213  
0.08084888534  
0.08045777794  
0.08005549343  
0.07965844305  
0.07927336274  
0.07889083173  
0.07851039646  
0.07814553077  
0.07777881576  
0.07740765823  
0.07705349726  
0.07670320582  
0.07635252115  
0.07600538849  
0.0756724569  
0.07534021146  
0.07500565995  
0.07467879778  
0.0743549617  
0.07403884236  
0.07373333634  
0.07342047302  
0.07311456789  
0.07281953699  
0.07251516054  
0.07221599906  
0.07192893414  
0.07164392927  
0.07135865648  
0.07108389789  
0.07081268756  
0.07054531966  
0.07027085613  
0.07000798607  
0.06974635422  
0.06949040757  
0.06923011271  
0.06898437007  
0.06873243341  
0.06848966101  
0.06824547279  
0.06801426313  
0.0677766568  
0.06754804586  
0.06731900834  
0.06709724588  
0.06687168489  
0.06665633989  
0.06643468262  
0.06622402277  
0.06601447859  
0.0658092926  
0.0656057613  
0.06540187903  
0.06520999351  
0.06501059082  
0.06481366741  
0.064626072  
0.06443648183  
0.06425341913  
0.06406713235  
0.0638848517  
0.06371424845  
0.06353230463  
0.06336222245  
0.06319020216  
0.06302175985  
0.06286213064  
0.06269515477  
0.06253817979  
0.0623781757  
0.06222690733  
0.06207251303  
0.06191972978  
0.0617734861  
0.0616309008  
0.06148299601  
0.06134390928  
0.06120397972  
0.06106806047  
0.06092819144  
0.06079370679  
0.06066240744  
0.06052934569  
0.06041276086  
0.06028538338  
0.06016116001  
0.06004151151  
0.05992798677  
0.05980853197  
0.05969217099  
0.0595824122  
0.05947161252  
0.05936239817  
0.05925615878  
0.05915292781  
0.05905482915  
0.05894598517  
0.05885305762  
0.05875889368  
0.05866270116  
0.05856770099  
0.05847725513  
0.05838391874  
0.05829754577  
0.0582140693  
0.05813614302  
0.05804743894  
0.05797423897  
0.05788901575  
0.05781379978  
0.05774312422  
0.05766859866  
0.05759898629  
0.05753216815  
0.05746164437  
0.05739004124  
0.05732611187  
0.05726207791  
0.05720122931  
0.05715013873  
0.05708974897  
0.05703191681  
0.0569804703  
0.05692588766  
0.05687748406  
0.05683085456  
0.05678344901  
0.05673382534  
0.05669816318  
0.05664541933  
0.05660600974  
0.05656907747  
0.05653098764  
0.05650198328  
0.05646161959  
0.05643411521  
0.05640723567  
0.05637319631  
0.05634410459  
0.05631656506  
0.05629361654  
0.05626463495  
0.05624641347  
0.05623061724  
0.05620766819  
0.05618694969  
0.05617741592  
0.05616575983  
0.05615335877  
0.05614648411  
0.05613007029  
0.05612585539  
0.05611642725  
0.05612104969  
0.05611810907  
0.05611370594  
