1.88474037  
3.26285541  
7.185376153  
24.11681658  
94.33346189  
1108.269763  
11781.88158  
36455.87565  
30714.64438  
6381.226605  
23623.08979  
427.6884369  
811.6651681  
79315.44583  
30173.11193  
486.5874358  
4127.001355  
37860.85492  
26492.86378  
6855.564597  
13998.13374  
20676.56956  
2740.839422  
12048.80502  
7721.312138  
1770.832698  
1488.085267  
608.8148939  
262.1398691  
22117.95273  
844.5432106  
7836.246629  
2517.229895  
8174.322292  
2625.264103  
4381.790437  
1011.651706  
257.974528  
12553.83089  
670.9953875  
12160.12622  
3058.152786  
2591.013956  
1382.756391  
7573.224069  
13578.51716  
1553.483107  
1611.675917  
6075.292784  
75.08180464  
1945.290636  
3303.113485  
2027.917154  
2262.896917  
19.25266667  
115.5299647  
256.6717695  
950.4870063  
669.3616114  
535.7619663  
1979.664345  
76.2340937  
582.2965312  
481.8875085  
739.8803217  
529.6997794  
165.6420578  
69.54401331  
21.60939192  
12.16846718  
18.76422117  
2.382991111  
8.423929816  
6.60536316  
1.00806094  
3.486520337  
4.562984602  
2.366380146  
5.646310504  
3.790647769  
1.786605686  
1.591191564  
2.437367741  
1.221822903  
1.280925768  
1.510517376  
1.417576264  
1.415677727  
1.330893357  
1.20768866  
1.023326532  
1.043168781  
0.9803723175  
0.8933837629  
0.8513114064  
0.8013305548  
0.7630868452  
0.7576099105  
0.7224394208  
0.6969421009  
0.666082752  
0.6435730687  
0.6218704774  
0.5976576615  
0.5763441023  
0.5555558955  
0.5378542048  
0.5204772306  
0.505051186  
0.4877006797  
0.4741513053  
0.4594294118  
0.4458999713  
0.4329168932  
0.4208188092  
0.4092655801  
0.3978965598  
0.3875985468  
0.3774183011  
0.3676951463  
0.3584051752  
0.3497197611  
0.3408731231  
0.3327819592  
0.325093921  
0.3175636694  
0.3102351625  
0.3031939756  
0.2964686032  
0.2900252489  
0.2837982431  
0.2778063647  
0.2719758321  
0.2664051449  
0.2610018479  
0.2557798241  
0.2507316221  
0.2458398967  
0.2411228363  
0.2365454968  
0.2321337795  
0.2278470669  
0.2236959289  
0.2196789634  
0.2157775665  
0.2119876582  
0.2083130356  
0.2047549395  
0.2012929062  
0.1979219496  
0.1946570144  
0.1914775112  
0.188393073  
0.1853862338  
0.1824567746  
0.1796119299  
0.1768448638  
0.1741436758  
0.1715145526  
0.168956185  
0.1664600826  
0.1640322247  
0.1616596978  
0.159342921  
0.1570900205  
0.1548882845  
0.1527378949  
0.150639311  
0.1485943935  
0.1465900213  
0.1446379531  
0.1427321866  
0.1408635276  
0.1390373329  
0.1372544406  
0.1355115522  
0.1338090273  
0.13213859  
0.1305122386  
0.1289117739  
0.1273502404  
0.125819461  
0.1243207693  
0.1228532689  
0.1214230626  
0.1200080511  
0.1186326859  
0.1172823216  
0.1159590231  
0.1146617737  
0.1133905522  
0.112142131  
0.1109208951  
0.1097238327  
0.1085459518  
0.1073919828  
0.1062611615  
0.1051459597  
0.1040589467  
0.1029880834  
0.1019397332  
0.1009080749  
0.09989504915  
0.09890254246  
0.0979254296  
0.09696683163  
0.09602352127  
0.09509841609  
0.09419276472  
0.09330126763  
0.09242038479  
0.09155877241  
0.09071251706  
0.08987318923  
0.08905403567  
0.08825103555  
0.08745584528  
0.08667718192  
0.0859124011  
0.08515606557  
0.0844131087  
0.08368702769  
0.08296833268  
0.08226128336  
0.08156543284  
0.08088231797  
0.08021325482  
0.07954599357  
0.07889403541  
0.07825007416  
0.07762003945  
0.07699654759  
0.07638367277  
0.07578130068  
0.07518712348  
0.07459996061  
0.07402391252  
0.07345282385  
0.07289283124  
0.07234246331  
0.07179928976  
0.07126307473  
0.07073570171  
0.07021609242  
0.06970152758  
0.06919861686  
0.06870262215  
0.06820970258  
0.06772660114  
0.06724847304  
0.06677914071  
0.06631511383  
0.06585857844  
0.06540681902  
0.06496412865  
0.06452444252  
0.06409359877  
0.06366530458  
0.06324162011  
0.06283029747  
0.06242154093  
0.06201818507  
0.06161863683  
0.06122556096  
0.06083876219  
0.06045706489  
0.06007830659  
0.05970560451  
0.05933877187  
0.05897490651  
0.05861589071  
0.05826271292  
0.05791288948  
0.05756943595  
0.05722649536  
0.05689385481  
0.05656214499  
0.05623821271  
0.05591495923  
0.05559499439  
0.0552791537  
0.05497015264  
0.0546588189  
0.05435956759  
0.05405878559  
0.05376486885  
0.05347308029  
0.05318545528  
0.05290027368  
0.05261801542  
0.0523407807  
0.05206762421  
0.05179624376  
0.05152864294  
0.05126437653  
0.05100312919  
0.05074567761  
0.0504895477  
0.0502381227  
0.04999143287  
0.04974482478  
0.04950319575  
0.049262021  
0.04902582185  
0.04878980979  
0.04855853662  
0.0483316872  
0.0481059262  
0.04788306409  
0.04766166625  
0.04744463056  
0.0472265224  
0.04701595315  
0.04680552229  
0.04659758071  
0.04639417547  
0.04618944525  
0.04598745657  
0.04579118472  
0.04559377306  
0.04539935273  
0.04521206697  
0.04501966248  
0.04483312184  
0.04464835111  
0.04446696406  
0.04428674471  
0.04410435907  
0.04393050206  
0.04375450907  
0.04358343275  
0.04341154828  
0.04324442899  
0.04307726736  
0.04291233098  
0.0427514923  
0.04258995026  
0.04242978168  
0.04227428664  
0.04211823829  
0.04196540654  
0.04181291333  
0.04166394049  
0.04151477205  
0.04136788244  
0.04122427552  
0.04108159705  
0.04093892997  
0.04079907117  
0.04066224222  
0.04052421001  
0.04038997279  
0.04025671286  
0.04012406529  
0.03999456125  
0.03986668511  
0.03973793005  
0.03961028004  
0.03948835242  
0.03936466293  
0.03924360135  
0.03912488236  
0.03900338096  
0.03888507683  
0.03876889619  
0.03865580027  
0.03854331966  
0.03843114196  
0.03832041898  
0.03821138805  
0.03810275514  
0.03799614248  
0.03789231362  
0.0377864491  
0.037682387  
0.03758154528  
0.0374817947  
0.03738406659  
0.03728525345  
0.03719103164  
0.03709362423  
0.03699805916  
0.03690731769  
0.03681471632  
0.03672152505  
0.03663225534  
0.03654455773  
0.03645698984  
0.03637006438  
0.03628475213  
0.03620094492  
0.03612033676  
0.03603567219  
0.03595481918  
0.03587510324  
0.03579507064  
0.03571721002  
0.03564146834  
0.0355646503  
0.03549189248  
0.03541403029  
0.03534188435  
0.03527171591  
0.03520046118  
0.03513010028  
0.03506240452  
0.03499455512  
0.03492741004  
0.03486128541  
0.03479686723  
0.03473301761  
0.03466825646  
0.03460717771  
0.03454543006  
0.0344860451  
0.03442587221  
0.03436706956  
0.03430963013  
0.03425038737  
0.03419538804  
0.03414185454  
0.03408826975  
0.03403311812  
0.03398003561  
0.03392775868  
0.03387847178  
0.03382878615  
0.03377966032  
0.03373125227  
0.0336818752  
0.03363482516  
0.03359078717  
0.03354486431  
0.03350106459  
0.03345682637  
0.03341590668  
0.03337399909  
0.03333339217  
0.03329088078  
0.03325220766  
0.03321398901  
0.03317505948  
0.03313907766  
0.03310136352  
0.03306686988  
0.03303231458  
0.03299793909  
0.03296586903  
0.03293273831  
0.03290150684  
0.03287190246  
0.03283877123  
0.0328099244  
0.03278121866  
0.03275433706  
0.03272777439  
0.03269856927  
0.03267467072  
0.03264761299  
0.03262469592  
0.03259986397  
0.0325782579  
0.03255605093  
0.03253658154  
0.03251549269  
0.03249454087  
0.03247498198  
0.0324570398  
0.03243951316  
0.03242140993  
0.03240404476  
0.03238869074  
0.03237498767  
0.0323588914  
0.03234720351  
0.0323317463  
0.0323219884  
0.0323090316  
0.03230036541  
0.03228980182  
0.03227867769  
0.03227075386  
0.03226352607  
0.032255982  
0.0322494484  
0.0322432881  
0.03223769669  
0.03223291096  
0.03223002693  
0.03222710935  
0.03222329301  
0.0322229324  
0.03222238611  
0.03222141343  
