0.03238771802  
-0.03074656849  
-0.07659308437  
-0.09549297878  
-0.08300069767  
-0.04097394379  
0.02243243245  
0.09385398813  
0.1567547283  
0.1940623539  
0.1909867231  
0.1375408944  
0.0303439823  
-0.1266207551  
-0.3224237914  
-0.5407457668  
-0.7623321936  
-0.9679449709  
-1.141336028  
-1.271746099  
-1.35549752  
-1.396412907  
-1.404975986  
-1.396342197  
-1.38753789  
-1.394294028  
-1.428051356  
-1.493641298  
-1.588051632  
-1.70050937  
-1.813905082  
-1.907354838  
-1.95951498  
-1.95213042  
-1.873252803  
-1.719593123  
-1.497633775  
-1.223267319  
-0.9200019328  
-0.6159632439  
-0.3401379314  
-0.1183977649  
0.03009546755  
0.09556204832  
0.07896562932  
-0.008146845426  
-0.1453105669  
-0.3060458791  
-0.4615874259  
-0.5848786295  
-0.6542534235  
-0.6562724141  
-0.5873225529  
-0.4537645429  
-0.2706521292  
-0.05922781241  
0.1563938985  
0.3528626696  
0.5109847228  
0.6184146261  
0.671225879  
0.6742049895  
0.6398258441  
0.5861204005  
0.5337740829  
0.5029063206  
0.5100111912  
0.5655026954  
0.6722044599  
0.8249690721  
1.011453188  
1.213896174  
1.411614049  
1.583851395  
1.712556984  
1.784727107  
1.793996051  
1.741291787  
1.634506667  
1.487264015  
1.316983596  
1.142540993  
0.9818345581  
0.8496060296  
0.7557802986  
0.7045127257  
0.6940479255  
0.7173414281  
0.7633232363  
0.8185863145  
0.8692452536  
0.9026951271  
0.9090518893  
0.8821069185  
0.8197238281  
0.7236901353  
0.5991222199  
0.4535647663  
0.2959565787  
0.1356282894  
-0.01855992059  
-0.1588633638  
-0.2790775174  
-0.3747746522  
-0.4434184008  
-0.4844081952  
-0.4990910399  
-0.4907476199  
-0.4644959635  
-0.4270619667  
-0.3863468667  
-0.3507497042  
-0.3282595395  
-0.3253929255  
-0.346116947  
-0.3909396188  
-0.4563606305  
-0.5348445387  
-0.6154103766  
-0.6848236341  
-0.7292786362  
-0.7363417826  
-0.6968756992  
-0.6066292066  
-0.467216263  
-0.2862935441  
-0.07687086564  
0.1441806483  
0.3582196771  
0.5472130038  
0.6960578142  
0.7944978702  
0.8383530925  
0.8298858182  
0.7772751783  
0.6932941233  
0.5934078421  
0.4935890331  
0.4081700643  
0.3480264313  
0.31932734  
0.3229722576  
0.3547408795  
0.4060781351  
0.4653448764  
0.5193393345  
0.5548705952  
0.5601851353  
0.5261121175  
0.4468253451  
0.320200955  
0.1478010409  
-0.06547001706  
-0.3119240885  
-0.5818004595  
-0.8640323066  
-1.147014002  
-1.419315862  
-1.670331489  
-1.890838562  
-2.073450502  
-2.212954653  
-2.306512858  
-2.353688589  
-2.356309222  
-2.318116199  
-2.244266581  
-2.140685827  
-2.013379073  
-1.86775861  
-1.708109089  
-1.537259917  
-1.356528327  
-1.165951701  
-0.9647735743  
-0.752119928  
-0.5277386122  
-0.292701916  
-0.04992403777  
0.1955863424  
0.4368026236  
0.6650970253  
0.870943271  
1.044829857  
1.178251015  
1.264648919  
1.300185232  
1.284230772  
1.219517179  
1.111948957  
0.9700874036  
0.8044104175  
0.6264243552  
0.4477682795  
0.2794053015  
0.1309894758  
0.01045883739  
-0.07613559594  
-0.124598597  
-0.1324267407  
-0.09859601263  
-0.0233844739  
0.09168745374  
0.243773525  
0.4284653291  
0.6394658212  
0.8682648456  
1.103925559  
1.333131124  
1.54057785  
1.709788206  
1.824342231  
1.869439845  
1.833642399  
1.710568878  
1.500302712  
1.21024758  
0.8552483307  
0.4568493558  
0.04170668075  
-0.3607161373  
-0.7209235336  
-1.012277551  
-1.213643455  
-1.311404145  
-1.300595466  
-1.184990112  
-0.9761448151  
-0.6915809178  
-0.3523923425  
0.01932923371  
0.4028586584  
0.7806418005  
1.139293769  
1.469703678  
1.766320545  
2.025834297  
2.245573268  
2.421980741  
2.549516146  
2.620241358  
2.624212012  
2.550660272  
2.389788537  
2.134882632  
1.784379792  
1.343523559  
0.8252721452  
0.25026373  
-0.3542500664  
-0.9564125393  
-1.522493481  
-2.020013759  
-2.420868287  
-2.704062572  
-2.857731773  
-2.880186318  
-2.779908579  
-2.574486099  
-2.288668207  
-1.951773307  
-1.5947605  
-1.247294585  
-0.9351058903  
-0.6778965815  
-0.4879741576  
-0.3697030063  
-0.3197685469  
-0.3282090799  
-0.3800266429  
-0.4572415718  
-0.5411254385  
-0.6144062136  
-0.6632138266  
-0.6785722536  
-0.6572841427  
-0.6021270122  
-0.5213296008  
-0.4273907455  
-0.3353609525  
-0.2607756482  
-0.2174751721  
-0.2155573971  
-0.2597224817  
-0.3482163338  
-0.4725319363  
-0.6179358477  
-0.7648154869  
-0.8907040303  
-0.9728096448  
-0.9907507802  
-0.9292119137  
-0.7801906585  
-0.5445641153  
-0.2327523976  
0.1356448619  
0.5332653675  
0.9273528796  
1.282887282  
1.566165407  
1.748484493  
1.809509888  
1.739939598  
1.543109536  
1.235289311  
0.8445331728  
0.4081303366  
-0.0311409949  
-0.4295770199  
-0.7474161717  
-0.9534302896  
-1.028645071  
-0.9686733195  
-0.7843158586  
-0.5002810391  
-0.1521481505  
0.218067949  
0.5671943758  
0.8563077284  
1.055562179  
1.147769912  
1.130265136  
1.014792721  
0.8254706627  
0.5951285034  
0.3605471623  
0.1572853286  
0.01480500829  
-0.0474325264  
-0.02239605002  
0.0838537981  
0.2533083287  
0.4587582767  
0.6677147097  
0.8469577388  
0.9670928541  
1.00651592  
0.9543064027  
0.81170917  
0.5920656886  
0.3192466183  
0.02481357874  
-0.2557181127  
-0.4870617299  
-0.6382975888  
-0.6864998055  
-0.6194622073  
-0.4372369317  
-0.1523400471  
0.2113822023  
0.6210910536  
1.038231575  
1.422404395  
1.735410195  
1.945052309  
2.028303738  
1.973516928  
1.781461231  
1.46510615  
1.048193252  
0.5627800973  
0.04603516464  
-0.4633685172  
-0.9288696268  
-1.319271528  
-1.611336246  
-1.79145101  
-1.856278615  
-1.812346785  
-1.674689156  
-1.464724651  
-1.20762917  
-0.9294945708  
-0.6545886042  
-0.4029984467  
-0.1888868309  
-0.01954373564  
0.1046914953  
0.1896417053  
0.2457437148  
0.2859309768  
0.3232120012  
0.3682622017  
0.427349169  
0.5008991932  
0.5829400293  
0.6615410723  
0.7202612026  
0.740438199  
0.7040487271  
0.5967401131  
0.410591974  
0.1461656078  
-0.1865103383  
-0.5682500982  
-0.9723511239  
-1.367403565  
-1.720937516  
-2.003410466  
-2.191984811  
-2.273544891  
-2.246497239  
-2.121073387  
-1.918038927  
-1.665993082  
-1.397598402  
-1.14527968  
-0.9369920677  
-0.7926540277  
-0.7217392003  
-0.7223499326  
-0.7818642723  
-0.8790372605  
-0.9871959597  
-1.078055724  
-1.125585326  
-1.109378697  
-1.017099056  
-0.8457071139  
-0.6013918207  
-0.2983184094  
0.04353677537  
0.4010819926  
0.7509172552  
1.071863789  
1.346920998  
1.564463629  
1.718651774  
1.809120678  
1.840130587  
1.819381952  
1.756731912  
1.662984514  
1.5488934  
1.424435288  
1.298356919  
1.177966094  
1.069083134  
0.9761083885  
0.9021364347  
0.8490821916  
0.8178063262  
0.8082209009  
0.8193823983  
0.8495616598  
0.8962781728  
0.9563100917  
1.025652512  
1.099453115  
1.171959325  
1.236505849  
1.285621992  
1.311303858  
1.305492666  
1.260760712  
1.171166276  
1.033173569  
0.8465326832  
0.6149456992  
0.3463926611  
0.05299135228  
-0.2496336123  
-0.5434829329  
-0.8097019775  
-1.030327088  
-1.190069952  
-1.277905959  
-1.288276936  
-1.221748287  
-1.085032736  
-0.8903625989  
-0.654289964  
-0.3960362718  
-0.135587555  
0.1082525096  
0.3196350227  
0.4870704684  
0.6043176498  
0.6706662112  
0.6906059477  
0.6729181708  
0.629315209  
0.5727935271  
0.51589251  
0.4690559766  
0.4393046098  
0.4293565091  
0.4372952555  
0.4568337403  
0.4781203435  
0.4889909863  
0.4765215492  
0.4286866984  
0.3359298519  
0.1924685474  
-0.002818038735  
-0.2460091868  
-0.52830737  
-0.8367150456  
-1.155143516  
-1.465823575  
-1.750866057  
-1.993812466  
-2.181028482  
-2.302812387  
-2.35412674  
-2.334901683  
-2.249901448  
-2.10816634  
-1.922098135  
-1.706271193  
-1.476085617  
-1.246383124  
-1.030170722  
-0.8375719042  
-0.6751302795  
-0.5455247555  
-0.4477406099  
-0.3776564299  
-0.3289690822  
-0.2943199727  
-0.266463803  
-0.2393089703  
-0.2086877088  
-0.1727456343  
-0.1319290677  
-0.08859181955  
-0.04631855666  
-0.009107893635  
0.01943485576  
0.03675604618  
0.0417596333  
0.03492371604  
0.01815185773  
-0.005560161322  
-0.0325340978  
-0.05876465011  
-0.08014004389  
-0.09247351452  
-0.09137810184  
-0.07206397586  
-0.02919643064  
0.04305285254  
0.1506176507  
0.2987819267  
0.4910638686  
0.7278920302  
1.005283772  
1.313811709  
1.638147288  
1.957407921  
2.246448681  
2.478079427  
2.626007951  
2.668197237  
2.59015884  
2.387695771  
2.068606309  
1.65300134  
1.172039585  
0.6651279844  
0.1758662949  
-0.2527891621  
-0.5835030109  
-0.7890202405  
-0.8554590729  
-0.7839772241  
-0.5905450709  
-0.303844298  
0.03841203976  
0.3942398636  
0.7225364867  
0.9879333259  
1.164677311  
1.23906372  
1.210138288  
1.088681667  
0.8947196218  
0.65401187  
0.3940958102  
0.1404887323  
-0.08642128377  
-0.2734009878  
-0.415136124  
-0.5137282326  
-0.5771584183  
-0.6170448313  
-0.6461249089  
-0.6758764136  
-0.7146398715  
-0.7664648061  
-0.8307956268  
-0.9029429287  
-0.9751913769  
-1.038298341  
-1.083118303  
-1.102083727  
-1.090345042  
-1.046411323  
-0.9722610605  
-0.872931996  
-0.7557034151  
-0.6290047868  
-0.5012198403  
-0.3795576188  
-0.2691316948  
-0.1723584741  
-0.08875130933  
-0.0151191386  
0.05383381979  
0.1245950696  
0.2036985613  
0.2964948566  
0.4059832002  
0.5318699068  
0.6700051691  
0.8123263246  
0.9473763758  
1.061402004  
1.139951566  
1.169802483  
1.14096862  
1.048515353  
0.8938730679  
0.6854057598  
0.438083478  
0.1722033902  
-0.08870615295  
-0.3205764553  
-0.5017140719  
-0.6155523069  
-0.6528295888  
-0.6128741908  
-0.5037953278  
-0.3415442911  
-0.1479558538  
0.05193702772  
0.2329710768  
0.3728556578  
0.4547377597  
0.4689946042  
0.4140557403  
0.296197779  
0.1283954897  
-0.07157454901  
-0.2834855056  
-0.4871418131  
-0.6646840777  
-0.8024465996  
-0.8921807633  
-0.9315553955  
-0.9239351087  
-0.8775233594  
-0.8040233229  
-0.7170092325  
-0.6302120056  
-0.5559033094  
-0.503559772  
-0.4789036922  
-0.4833999833  
-0.5142365715  
-0.564755362  
-0.6252809327  
-0.6842653575  
-0.7296390475  
-0.7502402212  
-0.7372126702  
-0.6852076558  
-0.5932833576  
-0.4653699391  
-0.3102105156  
-0.1407315704  
0.02714983297  
0.1762168333  
0.2899784738  
0.3548345889  
0.3621037606  
0.3096392379  
0.2027652475  
0.05433591448  
-0.1161910912  
-0.2846455475  
-0.4248263121  
-0.5116826959  
-0.5246098678  
-0.4504025981  
-0.2854602097  
-0.03688226132  
0.2777435519  
0.6318961792  
0.9928760057  
1.325430422  
1.59581448  
1.775772755  
1.845941341  
1.798244213  
1.63698564  
1.378504218  
1.049443099  
0.6838386336  
0.3193798107  
-0.006732024599  
-0.26185097  
-0.4214316166  
-0.4716673346  
-0.4109310905  
-0.2498723598  
-0.01016035564  
0.2779890245  
0.5792328655  
0.8570742808  
1.077951399  
1.214954452  
1.250731984  
1.179240549  
1.006108757  
0.7475994192  
0.4282939408  
0.0778439302  
-0.272768612  
-0.5949247117  
-0.8655134533  
-1.069096933  
-1.198829264  
-1.256069896  
-1.248838372  
-1.189442194  
-1.091732647  
-0.9684982328  
-0.8294477041  
-0.6801037888  
-0.5217707071  
-0.3524964046  
-0.1687898836  
0.03230784677  
0.2512431122  
0.4844925847  
0.7239495069  
0.9573027855  
1.169374408  
1.344166714  
1.467275066  
1.528189559  
1.522085223  
1.450737465  
1.322387233  
1.150567225  
0.9520705763  
0.744425739  
0.5433047393  
0.3603239883  
0.2016138867  
0.06739544557  
-0.04738062311  
-0.1514621157  
-0.255098149  
-0.3676250929  
-0.4952797317  
-0.6396419756  
-0.7969861181  
-0.9586634526  
-1.112437992  
-1.244547506  
-1.342122072  
-1.395523882  
-1.400206715  
-1.357740011  
-1.275816346  
-1.167198865  
-1.047772548  
-0.9339800548  
-0.8400662692  
-0.775563781  
-0.7434452726  
-0.7392637248  
-0.7514626454  
-0.7628559972  
-0.7531041895  
-0.7018593357  
-0.5921298452  
-0.4133855572  
-0.1639202584  
0.1478951729  
0.503712051  
0.8767077301  
1.23435202  
1.542111434  
1.767628215  
1.884828773  
1.877411079  
1.741218879  
1.485163478  
1.130538617  
0.7087828321  
0.2579700622  
-0.1815261505  
-0.5716237914  
-0.88078753  
-1.087379676  
-1.18169907  
-1.166457114  
-1.055678244  
-0.8722165919  
-0.6442671456  
-0.4013893701  
-0.1705772828  
0.02706913712  
0.1786628658  
0.2805547236  
0.3379766373  
0.3634183037  
0.3740116512  
0.3883245385  
0.4230627551  
0.4901409491  
0.5945621986  
0.7333838721  
0.8959394747  
1.0652403  
1.220366756  
1.339478438  
1.40300133  
1.396514962  
1.312907273  
1.153492166  
0.9279123294  
0.6528712079  
0.349884959  
0.04241491421  
-0.2471781128  
-0.500389747  
-0.7046338853  
-0.854316984  
-0.9508036752  
-1.001341152  
-1.017160289  
-1.011123191  
-0.9953273378  
-0.9790682142  
-0.9675042663  
-0.9612053431  
-0.9566225966  
-0.9473647758  
-0.9260063332  
-0.8860878903  
-0.8239338347  
-0.7399542605  
-0.6391860124  
-0.5309617409  
-0.4277526212  
-0.3433630489  
-0.2907680127  
-0.2799585054  
-0.3161323026  
-0.398544531  
-0.5201923542  
-0.6683833392  
-0.8260879462  
-0.9738541385  
-1.091978727  
-1.162610171  
-1.171499009  
-1.109196224  
-0.9716145464  
-0.7600037442  
-0.4804685775  
-0.1432245107  
0.2382127375  
0.6477693675  
1.06742095  
1.477700792  
1.858220741  
2.188343062  
2.448142098  
2.619711772  
2.688776431  
2.646448911  
2.490865023  
2.228386334  
1.874046202  
1.451021075  
0.9890175947  
0.5216684129  
0.08318998191  
-0.2952644687  
-0.5890794518  
-0.7829394511  
-0.8724683595  
-0.8644680355  
-0.7756938402  
-0.6303165661  
-0.4564668603  
-0.2823342022  
-0.1324280582  
-0.02452663372  
0.03224423453  
0.03797068524  
0.001111821804  
-0.06352979558  
-0.1376609395  
-0.2026778232  
-0.2426606156  
-0.246717952  
-0.2103717857  
-0.1358122481  
-0.03109689429  
0.09150410815  
0.2176671829  
0.3332800757  
0.4264412342  
0.4889001426  
0.5167730123  
0.5105179459  
0.4742767088  
0.4147889896  
0.3401266068  
0.2584928967  
0.1772592793  
0.102348011  
0.03796626774  
-0.01337112672  
-0.05063742528  
-0.0740375964  
-0.08478179707  
-0.08494802902  
-0.07741598827  
-0.0658278666  
-0.05449202968  
-0.04816374366  
-0.05166208674  
-0.06933056969  
-0.1044036559  
-0.1583866461  
-0.230558109  
-0.3177294489  
-0.4143126949  
-0.512741963  
-0.6041946976  
-0.6795346349  
-0.730342198  
-0.7498960618  
-0.7339867973  
-0.6814651838  
-0.594481877  
-0.4784071681  
-0.3414630071  
-0.1941159736  
-0.04829105258  
0.08353306346  
0.1893040611  
0.2583844536  
0.2825237521  
0.2567224745  
0.1799508184  
0.05560461411  
-0.1083598133  
-0.2997017859  
-0.5026242357  
-0.6989418093  
-0.869635818  
-0.9966614047  
-1.064819764  
-1.063488471  
-0.987968981  
-0.840263804  
-0.629140612  
-0.3694299948  
-0.08061226083  
0.2151608317  
0.4953734964  
0.7394982348  
0.9311051706  
1.059455371  
1.120399021  
1.116473125  
1.05622715  
0.9528790824  
0.822511126  
0.6820537568  
0.5473120584  
0.4312839949  
0.3429531703  
0.2866726264  
0.2621627609  
0.2650868357  
0.2880704699  
0.3220060415  
0.3574456345  
