97.1480071  
97.43104337  
107.4022653  
125.426507  
402.0769614  
4515.734682  
43519.93271  
13732.6584  
22475.21798  
3358.399893  
1076.048667  
19592.57175  
13600.69475  
20090.78095  
57826.71053  
523.1683457  
9916.774949  
11310.27645  
48560.4959  
855.7800616  
6899.541254  
17378.22518  
879.3428675  
3687.675803  
18988.48631  
6550.472527  
12987.85251  
1814.920885  
12506.07439  
519.6715157  
13228.68305  
5308.843628  
16982.98793  
18365.1662  
10405.75278  
436.4812426  
3208.841929  
5963.773539  
1976.698483  
10807.8913  
8663.703139  
2068.001255  
4497.256344  
2914.46733  
5869.270618  
609.0897717  
4113.804435  
1819.867958  
80.15172068  
4560.926314  
1812.66956  
936.6569459  
55.576744  
416.2202745  
3036.197379  
736.5163717  
518.9618706  
223.6330759  
53.43825088  
1583.992511  
228.0619828  
161.5550691  
1162.949393  
144.075369  
164.2307257  
66.20949099  
9.02503105  
108.2411973  
11.49903709  
12.34764597  
23.60369561  
31.54790154  
7.435622941  
15.93455899  
12.7362232  
6.307597034  
8.2418758  
5.798407628  
5.093837643  
3.113358782  
2.386065843  
3.94433888  
2.573516707  
2.491251719  
2.693927417  
2.506053164  
2.435893863  
2.232353993  
2.168791381  
2.369086504  
1.964944887  
1.795910223  
1.722352837  
1.653719229  
1.602641429  
1.60582332  
1.478660662  
1.448318923  
1.408758007  
1.314636001  
1.298633592  
1.273275922  
1.212675665  
1.194022133  
1.153220136  
1.12239266  
1.092391093  
1.056438998  
1.030334553  
0.9896287951  
0.972342757  
0.9513226884  
0.9293939752  
0.9000259087  
0.8836194849  
0.8637312214  
0.8446096197  
0.8274582306  
0.8082406032  
0.7906929746  
0.7748052191  
0.7592520776  
0.7439934213  
0.7286669894  
0.7150507451  
0.7014606029  
0.6882011753  
0.6751963163  
0.6630380766  
0.6509742207  
0.6394625053  
0.6283110275  
0.6174621817  
0.6069588198  
0.5967556721  
0.5869176779  
0.5773052833  
0.5679557178  
0.5589437371  
0.5501761559  
0.5415907363  
0.5332981263  
0.5251608044  
0.5173155908  
0.5096685289  
0.5021895612  
0.4949232022  
0.4878314479  
0.4809122861  
0.4741734105  
0.4676089945  
0.4611819318  
0.4549137619  
0.44880769  
0.4428263769  
0.4370069395  
0.4313111788  
0.4257359162  
0.4203042727  
0.4149792768  
0.4097719448  
0.4046877107  
0.3997019541  
0.39484071  
0.3900602282  
0.3854003786  
0.3808356323  
0.3763451721  
0.3719756941  
0.367664614  
0.3634744378  
0.3593417222  
0.3553013303  
0.3513438699  
0.3474521052  
0.3436381187  
0.3399129051  
0.3362492716  
0.332643612  
0.3291132003  
0.3256722481  
0.3222611987  
0.3189268755  
0.315649618  
0.3124345967  
0.3092793628  
0.3061754688  
0.3031315321  
0.3001376606  
0.2972017544  
0.2943131647  
0.2914839906  
0.2886817973  
0.2859452312  
0.2832506957  
0.2806002673  
0.2779943862  
0.2754324379  
0.2729206673  
0.270438318  
0.2679994501  
0.2655921262  
0.2632436783  
0.2609252515  
0.258639675  
0.2563832329  
0.2541740342  
0.2520031341  
0.2498586914  
0.2477472903  
0.2456738497  
0.2436316754  
0.241610447  
0.2396266756  
0.2376729352  
0.2357402476  
0.233852624  
0.2319894297  
0.2301554679  
0.2283356269  
0.2265520201  
0.2247892305  
0.2230641927  
0.2213549272  
0.2196746125  
0.2180055715  
0.2163739727  
0.2147695174  
0.2131754318  
0.2116059414  
0.2100664371  
0.2085429698  
0.2070284229  
0.2055551512  
0.2040923661  
0.2026555452  
0.201233705  
0.199835076  
0.1984524281  
0.1970858837  
0.1957458471  
0.1944181471  
0.193099428  
0.19180939  
0.1905335727  
0.1892794813  
0.1880386154  
0.1868070369  
0.1856045844  
0.1844102277  
0.1832291828  
0.1820665993  
0.1809247443  
0.1797840024  
0.1786646004  
0.1775679785  
0.17647636  
0.1753987512  
0.1743424269  
0.1732864112  
0.1722584411  
0.1712273742  
0.1702154278  
0.1692184176  
0.1682395318  
0.1672667645  
0.1662995412  
0.1653567353  
0.164411228  
0.1634874599  
0.1625695661  
0.1616624329  
0.1607703499  
0.159893464  
0.1590225493  
0.1581586456  
0.1573098079  
0.1564719066  
0.1556378464  
0.1548181563  
0.1540037488  
0.1532040705  
0.1524085516  
0.1516296122  
0.1508565525  
0.1500987819  
0.1493404672  
0.1485885082  
0.1478536146  
0.14712859  
0.1464023386  
0.1456968568  
0.1449922514  
0.14429449  
0.1436049337  
0.142919165  
0.1422485518  
0.1415876814  
0.1409287884  
0.1402849723  
0.1396346914  
0.1390041522  
0.1383793  
0.1377590956  
0.1371461921  
0.1365378559  
0.135935845  
0.1353489535  
0.1347593971  
0.1341774809  
0.1336065896  
0.1330440212  
0.1324775901  
0.1319258496  
0.1313824296  
0.1308365117  
0.1303001282  
0.1297780135  
0.1292484146  
0.128735353  
0.1282164666  
0.1277124809  
0.1272158732  
0.1267141237  
0.1262261117  
0.1257449367  
0.1252634108  
0.1247939023  
0.1243157952  
0.123862307  
0.1234057702  
0.1229490295  
0.1224973645  
0.1220541188  
0.1216213423  
0.121186316  
0.1207632795  
0.1203381706  
0.1199226828  
0.119503804  
0.119093776  
0.1186869813  
0.1182860248  
0.1178986159  
0.1175032781  
0.1171167075  
0.1167304328  
0.1163568442  
0.1159840817  
0.1156126134  
0.1152455424  
0.1148883332  
0.1145254591  
0.1141700961  
0.1138160556  
0.1134745314  
0.1131336516  
0.1127973872  
0.1124607954  
0.1121293431  
0.1117979145  
0.1114839673  
0.1111589615  
0.110841455  
0.1105284155  
0.1102291  
0.1099206653  
0.1096171211  
0.1093209185  
0.1090263989  
0.1087327588  
0.1084498848  
0.1081623138  
0.1078819217  
0.1076082565  
0.1073285751  
0.107062128  
0.1067895237  
0.1065273025  
0.1062668142  
0.1060081108  
0.1057493054  
0.1054978414  
0.1052532214  
0.1049998824  
0.1047636602  
0.1045193834  
0.1042940983  
0.1040460992  
0.1038194682  
0.1035885461  
0.103361667  
0.1031430904  
0.1029214896  
0.1027059442  
0.1024917755  
0.1022832601  
0.1020727155  
0.101861573  
0.1016610647  
0.101464056  
0.1012623095  
0.1010716158  
0.100876778  
0.1006838557  
0.1004977727  
0.1003147692  
0.1001315867  
0.09994961245  
0.09977762971  
0.09960393823  
0.09942673622  
0.09925986292  
0.0990898408  
0.09892398408  
0.09876285727  
0.09860169178  
0.09844803704  
0.09829154699  
0.09813924921  
0.09798972384  
0.09784631241  
0.09769615083  
0.09755549096  
0.09741027529  
0.09726878283  
0.09713362805  
0.09700289176  
0.09687077094  
0.09674652887  
0.09661551918  
0.09648733215  
0.09636856572  
0.09624390627  
0.09611826158  
0.09601107326  
0.0958978216  
0.09578296559  
0.09567232678  
0.0955644274  
0.0954559085  
0.09535526564  
0.09525360827  
0.09515611796  
0.09505537269  
0.09495763774  
0.09487043009  
0.09478181581  
0.09469473919  
0.09460362517  
0.09451771974  
0.09443428384  
0.09435847795  
0.09427515251  
0.09419993428  
0.09412527695  
0.09404779557  
0.09397959114  
0.0939126869  
0.09385063969  
0.09378379092  
0.09371820418  
0.09366129588  
0.09360337146  
0.09354541292  
0.09349219775  
0.09343442251  
0.09338481501  
0.09333694079  
0.09329329487  
0.0932497628  
0.09320637346  
0.09316029867  
0.09312001946  
0.09308672308  
0.09305387998  
0.09301729828  
0.09298591474  
0.09295472973  
0.0929282933  
0.09290408501  
0.09287939264  
0.09286050451  
0.09283472244  
0.09281836174  
0.09280190533  
0.09278687105  
0.09277743138  
0.09276368354  
0.09275683763  
0.09275175721  
0.09274976677  
0.09274565821  
0.09274288137  
