3429.154048  
3517.829069  
3742.316542  
4068.457759  
2957.228271  
921.9020813  
100016.0236  
95393.19598  
4017.757465  
4160.687982  
9424.949529  
4166.116267  
21990.5264  
7692.482106  
16390.25969  
18274.44406  
5522.452805  
1761.105859  
13221.78042  
2762.276416  
1088.700895  
1895.057378  
3591.06291  
9313.807696  
2525.040631  
1951.21443  
2843.237582  
493.3438049  
5153.36415  
13545.04845  
5098.225392  
2533.883188  
931.6940555  
615.5384996  
17405.86239  
5390.92958  
24584.10364  
8530.472216  
2390.592055  
2113.728522  
13837.91561  
368.5349256  
2133.200977  
746.355075  
293.3519553  
815.1429402  
2504.024408  
2235.074067  
1190.023753  
2644.302431  
3021.484246  
110.9641843  
5922.6478  
466.4980168  
66.26396827  
222.1416646  
2724.468916  
129.919889  
1090.29758  
1000.692734  
2526.87475  
629.8854869  
1314.601398  
64.33310919  
1077.36228  
678.2930897  
407.1220575  
226.9746908  
373.9120591  
313.6078813  
320.8302745  
248.9956942  
185.6264294  
159.9786704  
172.2707424  
153.8991927  
137.1974091  
94.05494067  
95.39907876  
90.09496941  
84.72992589  
67.90513135  
63.04724404  
56.76117028  
58.09501834  
48.28101588  
48.05586374  
42.06140294  
39.05400784  
37.72030683  
35.77000827  
32.25425216  
30.78865179  
29.61133488  
27.4645179  
26.17135604  
24.72817643  
23.24704264  
22.04493047  
21.05708013  
19.85290185  
18.8608621  
17.91414159  
17.14165617  
16.28449414  
15.46258402  
14.79560376  
14.08849648  
13.46815923  
12.87159714  
12.29869184  
11.76244395  
11.27080309  
10.79027711  
10.33838127  
9.919995367  
9.520818574  
9.136486886  
8.774921663  
8.434687013  
8.10774285  
7.799008383  
7.505526042  
7.223849874  
6.957770833  
6.703529786  
6.459232068  
6.22767027  
6.007687913  
5.794646006  
5.593301607  
5.400876312  
5.215753013  
5.039271458  
4.869898691  
4.707382924  
4.552234633  
4.403659832  
4.26060465  
4.123612368  
3.992256016  
3.86599232  
3.744672056  
3.628088648  
3.516026404  
3.408410164  
3.304758262  
3.205033037  
3.109146178  
3.016761441  
2.927729734  
2.841997959  
2.759393193  
2.679701365  
2.602924794  
2.528866449  
2.45736031  
2.38837322  
2.321742156  
2.257456581  
2.195334521  
2.13534181  
2.077311443  
2.021301135  
1.967095812  
1.914706836  
1.863981434  
1.814971667  
1.767476161  
1.721484594  
1.677035608  
1.633959205  
1.592190961  
1.551782087  
1.512628782  
1.474665587  
1.437854697  
1.402158221  
1.367570978  
1.334015884  
1.301427683  
1.269846311  
1.239172275  
1.209396621  
1.180535127  
1.152418416  
1.12515556  
1.09869187  
1.073009019  
1.048014633  
1.02370755  
1.000081927  
0.9771573043  
0.9548506452  
0.9331238198  
0.912026133  
0.8914816313  
0.8715119802  
0.8520401164  
0.8331341849  
0.8147173275  
0.7967881236  
0.779356234  
0.7623407348  
0.7457860304  
0.7296941418  
0.7139414015  
0.6986500787  
0.6837261477  
0.6691942182  
0.6550329196  
0.6412375847  
0.6277935392  
0.6146300628  
0.6018267152  
0.5893713095  
0.5771647885  
0.5652783595  
0.5537111479  
0.5423953556  
0.531363038  
0.5205761533  
0.5100491968  
0.4998118234  
0.4897915419  
0.4799909186  
0.4704538047  
0.4611153371  
0.4520068416  
0.44311071  
0.4344210812  
0.4259200333  
0.4175999465  
0.4094981459  
0.4015600282  
0.3938042276  
0.386241715  
0.3788225943  
0.3715945659  
0.3645155254  
0.3575933192  
0.3508094022  
0.3441932195  
0.3377102426  
0.3313613882  
0.3251709405  
0.3191045316  
0.3131709158  
0.3073603067  
0.3016824497  
0.2961201287  
0.2906770716  
0.2853447649  
0.2801213937  
0.2750115251  
0.2700110966  
0.2651139085  
0.2602973478  
0.2556132988  
0.2510149829  
0.2465038205  
0.2420868985  
0.237758478  
0.2335113041  
0.2293694047  
0.2253119976  
0.2213089666  
0.2174071172  
0.2135656078  
0.2098079943  
0.2061434759  
0.2025314924  
0.1989736231  
0.1955173015  
0.1921174965  
0.1888014686  
0.1855195849  
0.18231139  
0.1791777816  
0.1760838456  
0.1730605493  
0.1700914438  
0.1671881213  
0.1643309927  
0.1615241491  
0.1587805712  
0.1560884451  
0.1534275656  
0.1508264117  
0.1482810268  
0.1457815722  
0.1433191311  
0.1409132591  
0.138544432  
0.1362164123  
0.133949286  
0.1317161326  
0.1295029105  
0.1273578939  
0.1252363744  
0.1231506202  
0.1211104223  
0.1191042422  
0.1171349548  
0.1151930076  
0.1132994453  
0.1114259311  
0.1095934421  
0.1077754094  
0.1060186316  
0.1042770393  
0.1025603413  
0.1008914008  
0.09923610814  
0.09761859508  
0.09602714226  
0.09446008512  
0.09292463331  
0.09140848835  
0.08991687265  
0.08846140514  
0.08702414429  
0.08561772334  
0.08422911836  
0.08286713601  
0.08152422156  
0.08020064621  
0.0789077636  
0.07763589906  
0.07638686197  
0.07515905106  
0.07394454441  
0.07275606488  
0.07158076793  
0.07043484315  
0.06930196617  
0.06818902334  
0.06709852403  
0.06601981461  
0.06495676836  
0.06392084615  
0.06289759183  
0.06189311919  
0.06089707441  
0.0599218274  
0.05897200779  
0.0580206113  
0.05709780497  
0.05618989039  
0.05528795735  
0.05440115861  
0.05353240111  
0.05268567835  
0.05184094136  
0.05101856629  
0.05020392804  
0.04940588903  
0.04861681885  
0.0478452616  
0.0470801993  
0.0463335467  
0.04559414086  
0.04486179409  
0.04415142599  
0.04344731559  
0.04276076824  
0.04207679905  
0.04140936165  
0.04075745353  
0.04010226338  
0.03946503853  
0.03884001024  
0.03822376021  
0.03761187884  
0.03702002478  
0.0364329368  
0.03584860254  
0.03528495324  
0.03472720034  
0.03417668108  
0.03363706857  
0.03310023298  
0.0325732055  
0.0320592339  
0.03155037221  
0.03105401594  
0.03056131252  
0.03008099653  
0.02960325502  
0.02913498434  
0.02867559513  
0.02822271972  
0.02777484909  
0.02734222973  
0.02690795586  
0.02648577184  
0.02607210649  
0.02565898879  
0.02525626256  
0.02485925047  
0.02447042707  
0.02408615504  
0.02371076713  
0.02333822378  
0.02297571179  
0.02261570972  
0.02226670343  
0.02192199547  
0.02158061565  
0.02124537457  
0.02091757959  
0.02059809464  
0.02027685444  
0.01997254992  
0.01966081229  
0.01936038122  
0.0190676978  
0.01877566231  
0.01849325623  
0.01821307757  
0.01793923866  
0.01766847768  
0.01740608879  
0.01714419965  
0.0168914879  
0.01664068235  
0.01639779326  
0.01615534137  
0.01591949049  
0.01568939224  
0.01546382902  
0.01524212631  
0.01502317194  
0.01480937463  
0.01460111706  
0.01439604304  
0.01419939475  
0.01399848271  
0.01380490765  
0.01361981236  
0.01343879787  
0.01325757796  
0.01307976462  
0.01290977204  
0.01274294382  
0.01258169469  
0.01241966011  
0.01226204228  
0.01210930056  
0.01196507296  
0.01181635979  
0.0116784858  
0.01153819519  
0.01140767694  
0.01127651281  
0.01115026298  
0.01102892931  
0.01090689059  
0.01079335721  
0.01068002814  
0.01057080831  
0.01047030487  
0.01036717525  
0.0102684689  
0.01017333767  
0.01007812173  
0.009992947618  
0.009907423052  
0.009828285665  
0.009748812231  
0.009671821711  
0.00960302713  
0.009535388289  
0.009469084968  
0.009408875795  
0.009350357247  
0.009294810335  
0.009244287809  
0.009195496346  
0.009148187508  
0.00910772651  
0.009068607085  
0.009029566493  
0.008996995285  
0.008968327337  
0.008941532319  
0.008919662529  
0.00889820409  
0.008880834098  
0.008866957612  
0.008858130079  
0.008845007641  
0.008844171015  
0.008841380293  
