{
	"ConversionSoftware": "dicm2nii.m 20170922?",
	"SeriesNumber": 9,
	"SeriesDescription": "cmrr_MB4_bold_rest",
	"ImageType": "ORIGINAL\\PRIMARY\\M\\MB\\ND\\MOSAIC",
	"Modality": "MR",
	"AcquisitionDateTime": "20171012103359.095000",
	"TotalReadoutTime": 0.03723012,
	"SliceTiming": [
		0,
		0.4525,
		0.2575,
		0.065,
		0.5175,
		0.3225,
		0.1275,
		0.5825,
		0.3875,
		0.1925,
		0,
		0.4525,
		0.2575,
		0.065,
		0.5175,
		0.3225,
		0.1275,
		0.5825,
		0.3875,
		0.1925,
		0,
		0.4525,
		0.2575,
		0.065,
		0.5175,
		0.3225,
		0.1275,
		0.5825,
		0.3875,
		0.1925,
		0,
		0.4525,
		0.2575,
		0.065,
		0.5175,
		0.3225,
		0.1275,
		0.5825,
		0.3875,
		0.1925	],
	"RepetitionTime": 0.645,
	"PhaseEncodingDirection": "y-",
	"EffectiveEchoSpacing": 0.00051000164,
	"EchoTime": 0.03,
	"PatientName": "STSW_1132",
	"PatientSex": "M",
	"PatientAge": "023Y",
	"PatientSize": 186,
	"PatientWeight": 80,
	"PatientPosition": "HFS",
	"SliceThickness": 3,
	"FlipAngle": 60,
	"Manufacturer": "SIEMENS",
	"SoftwareVersion": "syngo MR B17",
	"MRAcquisitionType": "2D",
	"InstitutionName": "MPI for Human Development",
	"InstitutionAddress": "Lentzallee 94,Berlin,District,DE,14195",
	"DeviceSerialNumber": "35453",
	"ScanningSequence": "EP",
	"SequenceVariant": "SK\\SS",
	"ScanOptions": "FS",
	"SequenceName": "epfid2d1_74"
}
