{
	"ConversionSoftware": "dicm2nii.m 20170922?",
	"SeriesNumber": 9,
	"SeriesDescription": "cmrr_MB4_bold_rest",
	"ImageType": "ORIGINAL\\PRIMARY\\M\\MB\\ND\\MOSAIC",
	"Modality": "MR",
	"AcquisitionDateTime": "20180124154630.990000",
	"TotalReadoutTime": 0.03723012,
	"SliceTiming": [
		0,
		0.455,
		0.26,
		0.065,
		0.52,
		0.325,
		0.13,
		0.5825,
		0.39,
		0.195,
		0,
		0.455,
		0.26,
		0.065,
		0.52,
		0.325,
		0.13,
		0.5825,
		0.39,
		0.195,
		0,
		0.455,
		0.26,
		0.065,
		0.52,
		0.325,
		0.13,
		0.5825,
		0.39,
		0.195,
		0,
		0.455,
		0.26,
		0.065,
		0.52,
		0.325,
		0.13,
		0.5825,
		0.39,
		0.195	],
	"RepetitionTime": 0.645,
	"PhaseEncodingDirection": "y-",
	"EffectiveEchoSpacing": 0.00051000164,
	"EchoTime": 0.03,
	"PatientName": "STSW_2149",
	"PatientSex": "M",
	"PatientAge": "068Y",
	"PatientSize": 1.73,
	"PatientWeight": 70,
	"PatientPosition": "HFS",
	"SliceThickness": 3,
	"FlipAngle": 60,
	"Manufacturer": "SIEMENS",
	"SoftwareVersion": "syngo MR B17",
	"MRAcquisitionType": "2D",
	"InstitutionName": "MPI for Human Development",
	"InstitutionAddress": "Lentzallee 94,Berlin,District,DE,14195",
	"DeviceSerialNumber": "35453",
	"ScanningSequence": "EP",
	"SequenceVariant": "SK\\SS",
	"ScanOptions": "FS",
	"SequenceName": "epfid2d1_74"
}
