---------------------  Running antsBrainExtraction.sh on ood-46  ---------------------

--------------------------------------------------------------------------------------
 Bias correction of anatomical images (pre brain extraction)
   1) pre-process by truncating the image intensities
   2) run N4
--------------------------------------------------------------------------------------

BEGIN >>>>>>>>>>>>>>>>>>>>
/usr/lib/ants//ImageMath 3 /home/mpib/LNDG/StateSwitch/WIP_rest/preproc/B_data/D_preproc/2251/mri/t1/tempANTs/2251_t1_ANTsBET_N4Truncated0.nii.gz TruncateImageIntensity /home/mpib/LNDG/StateSwitch/WIP_rest/preproc/B_data/D_preproc/2251/mri/t1/2251_t1.nii.gz 0.01 0.999 256
END   <<<<<<<<<<<<<<<<<<<<


BEGIN >>>>>>>>>>>>>>>>>>>>
/usr/lib/ants//N4BiasFieldCorrection -d 3 -i /home/mpib/LNDG/StateSwitch/WIP_rest/preproc/B_data/D_preproc/2251/mri/t1/tempANTs/2251_t1_ANTsBET_N4Truncated0.nii.gz -s 4 -c [50x50x50x50,0.0000001] -b [200] -o /home/mpib/LNDG/StateSwitch/WIP_rest/preproc/B_data/D_preproc/2251/mri/t1/tempANTs/2251_t1_ANTsBET_N4Corrected0.nii.gz --verbose 1

Running N4 for 3-dimensional images.

Mask not read.  Using the entire image as the mask.

Specified spline distance: 200mm
  original image size:  [188, 191, 200]
  padded image size:  [201, 201, 201]
  number of control points:  [4, 4, 4]

Current level = 1
  Iteration 1 (of 50).   Current convergence value = 0.000256952 (threshold = 1e-07)
  Iteration 2 (of 50).   Current convergence value = 0.000216626 (threshold = 1e-07)
  Iteration 3 (of 50).   Current convergence value = 0.000181732 (threshold = 1e-07)
  Iteration 4 (of 50).   Current convergence value = 0.000150937 (threshold = 1e-07)
  Iteration 5 (of 50).   Current convergence value = 0.000128229 (threshold = 1e-07)
  Iteration 6 (of 50).   Current convergence value = 0.000110552 (threshold = 1e-07)
  Iteration 7 (of 50).   Current convergence value = 9.68091e-05 (threshold = 1e-07)
  Iteration 8 (of 50).   Current convergence value = 8.76003e-05 (threshold = 1e-07)
  Iteration 9 (of 50).   Current convergence value = 8.26787e-05 (threshold = 1e-07)
  Iteration 10 (of 50).   Current convergence value = 8.10236e-05 (threshold = 1e-07)
  Iteration 11 (of 50).   Current convergence value = 8.17533e-05 (threshold = 1e-07)
  Iteration 12 (of 50).   Current convergence value = 8.3015e-05 (threshold = 1e-07)
  Iteration 13 (of 50).   Current convergence value = 8.3503e-05 (threshold = 1e-07)
  Iteration 14 (of 50).   Current convergence value = 8.42739e-05 (threshold = 1e-07)
  Iteration 15 (of 50).   Current convergence value = 8.44016e-05 (threshold = 1e-07)
  Iteration 16 (of 50).   Current convergence value = 8.46403e-05 (threshold = 1e-07)
  Iteration 17 (of 50).   Current convergence value = 8.45995e-05 (threshold = 1e-07)
  Iteration 18 (of 50).   Current convergence value = 8.45435e-05 (threshold = 1e-07)
  Iteration 19 (of 50).   Current convergence value = 8.42781e-05 (threshold = 1e-07)
  Iteration 20 (of 50).   Current convergence value = 8.41292e-05 (threshold = 1e-07)
  Iteration 21 (of 50).   Current convergence value = 8.40641e-05 (threshold = 1e-07)
  Iteration 22 (of 50).   Current convergence value = 8.3932e-05 (threshold = 1e-07)
  Iteration 23 (of 50).   Current convergence value = 8.37433e-05 (threshold = 1e-07)
  Iteration 24 (of 50).   Current convergence value = 8.37235e-05 (threshold = 1e-07)
  Iteration 25 (of 50).   Current convergence value = 8.33698e-05 (threshold = 1e-07)
  Iteration 26 (of 50).   Current convergence value = 8.32316e-05 (threshold = 1e-07)
  Iteration 27 (of 50).   Current convergence value = 8.29508e-05 (threshold = 1e-07)
  Iteration 28 (of 50).   Current convergence value = 8.28523e-05 (threshold = 1e-07)
  Iteration 29 (of 50).   Current convergence value = 8.27629e-05 (threshold = 1e-07)
  Iteration 30 (of 50).   Current convergence value = 8.25072e-05 (threshold = 1e-07)
  Iteration 31 (of 50).   Current convergence value = 8.22042e-05 (threshold = 1e-07)
  Iteration 32 (of 50).   Current convergence value = 8.17929e-05 (threshold = 1e-07)
  Iteration 33 (of 50).   Current convergence value = 8.15521e-05 (threshold = 1e-07)
  Iteration 34 (of 50).   Current convergence value = 8.12892e-05 (threshold = 1e-07)
  Iteration 35 (of 50).   Current convergence value = 8.09552e-05 (threshold = 1e-07)
  Iteration 36 (of 50).   Current convergence value = 8.05597e-05 (threshold = 1e-07)
  Iteration 37 (of 50).   Current convergence value = 8.01766e-05 (threshold = 1e-07)
  Iteration 38 (of 50).   Current convergence value = 7.98585e-05 (threshold = 1e-07)
  Iteration 39 (of 50).   Current convergence value = 7.94431e-05 (threshold = 1e-07)
  Iteration 40 (of 50).   Current convergence value = 7.89991e-05 (threshold = 1e-07)
  Iteration 41 (of 50).   Current convergence value = 7.84735e-05 (threshold = 1e-07)
  Iteration 42 (of 50).   Current convergence value = 7.79892e-05 (threshold = 1e-07)
  Iteration 43 (of 50).   Current convergence value = 7.76286e-05 (threshold = 1e-07)
  Iteration 44 (of 50).   Current convergence value = 7.72275e-05 (threshold = 1e-07)
  Iteration 45 (of 50).   Current convergence value = 7.67408e-05 (threshold = 1e-07)
  Iteration 46 (of 50).   Current convergence value = 7.62782e-05 (threshold = 1e-07)
  Iteration 47 (of 50).   Current convergence value = 7.57713e-05 (threshold = 1e-07)
  Iteration 48 (of 50).   Current convergence value = 7.52179e-05 (threshold = 1e-07)
  Iteration 49 (of 50).   Current convergence value = 7.47771e-05 (threshold = 1e-07)
  Iteration 50 (of 50).   Current convergence value = 7.43011e-05 (threshold = 1e-07)
Current level = 2
  Iteration 1 (of 50).   Current convergence value = 0.000218156 (threshold = 1e-07)
  Iteration 2 (of 50).   Current convergence value = 0.000175674 (threshold = 1e-07)
  Iteration 3 (of 50).   Current convergence value = 0.000156517 (threshold = 1e-07)
  Iteration 4 (of 50).   Current convergence value = 0.000149286 (threshold = 1e-07)
  Iteration 5 (of 50).   Current convergence value = 0.000147565 (threshold = 1e-07)
  Iteration 6 (of 50).   Current convergence value = 0.000148444 (threshold = 1e-07)
  Iteration 7 (of 50).   Current convergence value = 0.000150433 (threshold = 1e-07)
  Iteration 8 (of 50).   Current convergence value = 0.000152775 (threshold = 1e-07)
  Iteration 9 (of 50).   Current convergence value = 0.000155571 (threshold = 1e-07)
  Iteration 10 (of 50).   Current convergence value = 0.000158836 (threshold = 1e-07)
  Iteration 11 (of 50).   Current convergence value = 0.000163282 (threshold = 1e-07)
  Iteration 12 (of 50).   Current convergence value = 0.000167938 (threshold = 1e-07)
  Iteration 13 (of 50).   Current convergence value = 0.00017207 (threshold = 1e-07)
  Iteration 14 (of 50).   Current convergence value = 0.000175894 (threshold = 1e-07)
  Iteration 15 (of 50).   Current convergence value = 0.000179253 (threshold = 1e-07)
  Iteration 16 (of 50).   Current convergence value = 0.000181971 (threshold = 1e-07)
  Iteration 17 (of 50).   Current convergence value = 0.00018475 (threshold = 1e-07)
  Iteration 18 (of 50).   Current convergence value = 0.000187453 (threshold = 1e-07)
  Iteration 19 (of 50).   Current convergence value = 0.000192089 (threshold = 1e-07)
  Iteration 20 (of 50).   Current convergence value = 0.000200148 (threshold = 1e-07)
  Iteration 21 (of 50).   Current convergence value = 0.000207849 (threshold = 1e-07)
  Iteration 22 (of 50).   Current convergence value = 0.000214312 (threshold = 1e-07)
  Iteration 23 (of 50).   Current convergence value = 0.000219829 (threshold = 1e-07)
  Iteration 24 (of 50).   Current convergence value = 0.000224812 (threshold = 1e-07)
  Iteration 25 (of 50).   Current convergence value = 0.000229395 (threshold = 1e-07)
  Iteration 26 (of 50).   Current convergence value = 0.000233392 (threshold = 1e-07)
  Iteration 27 (of 50).   Current convergence value = 0.000236466 (threshold = 1e-07)
  Iteration 28 (of 50).   Current convergence value = 0.000236964 (threshold = 1e-07)
  Iteration 29 (of 50).   Current convergence value = 0.000237531 (threshold = 1e-07)
  Iteration 30 (of 50).   Current convergence value = 0.000238678 (threshold = 1e-07)
  Iteration 31 (of 50).   Current convergence value = 0.000239347 (threshold = 1e-07)
  Iteration 32 (of 50).   Current convergence value = 0.000240468 (threshold = 1e-07)
  Iteration 33 (of 50).   Current convergence value = 0.000241309 (threshold = 1e-07)
  Iteration 34 (of 50).   Current convergence value = 0.00024202 (threshold = 1e-07)
  Iteration 35 (of 50).   Current convergence value = 0.000242725 (threshold = 1e-07)
  Iteration 36 (of 50).   Current convergence value = 0.000243552 (threshold = 1e-07)
  Iteration 37 (of 50).   Current convergence value = 0.000244036 (threshold = 1e-07)
  Iteration 38 (of 50).   Current convergence value = 0.000244529 (threshold = 1e-07)
  Iteration 39 (of 50).   Current convergence value = 0.000245531 (threshold = 1e-07)
  Iteration 40 (of 50).   Current convergence value = 0.000240049 (threshold = 1e-07)
  Iteration 41 (of 50).   Current convergence value = 0.000235785 (threshold = 1e-07)
  Iteration 42 (of 50).   Current convergence value = 0.000232544 (threshold = 1e-07)
  Iteration 43 (of 50).   Current convergence value = 0.000229852 (threshold = 1e-07)
  Iteration 44 (of 50).   Current convergence value = 0.000226147 (threshold = 1e-07)
  Iteration 45 (of 50).   Current convergence value = 0.000223146 (threshold = 1e-07)
  Iteration 46 (of 50).   Current convergence value = 0.000220564 (threshold = 1e-07)
  Iteration 47 (of 50).   Current convergence value = 0.000218708 (threshold = 1e-07)
  Iteration 48 (of 50).   Current convergence value = 0.000217292 (threshold = 1e-07)
  Iteration 49 (of 50).   Current convergence value = 0.000216342 (threshold = 1e-07)
  Iteration 50 (of 50).   Current convergence value = 0.000228338 (threshold = 1e-07)
Current level = 3
  Iteration 1 (of 50).   Current convergence value = 0.000884988 (threshold = 1e-07)
  Iteration 2 (of 50).   Current convergence value = 0.000845239 (threshold = 1e-07)
  Iteration 3 (of 50).   Current convergence value = 0.000837187 (threshold = 1e-07)
  Iteration 4 (of 50).   Current convergence value = 0.000844436 (threshold = 1e-07)
  Iteration 5 (of 50).   Current convergence value = 0.000859275 (threshold = 1e-07)
  Iteration 6 (of 50).   Current convergence value = 0.000855615 (threshold = 1e-07)
  Iteration 7 (of 50).   Current convergence value = 0.000830496 (threshold = 1e-07)
  Iteration 8 (of 50).   Current convergence value = 0.000806893 (threshold = 1e-07)
  Iteration 9 (of 50).   Current convergence value = 0.000796185 (threshold = 1e-07)
  Iteration 10 (of 50).   Current convergence value = 0.000795694 (threshold = 1e-07)
  Iteration 11 (of 50).   Current convergence value = 0.000802464 (threshold = 1e-07)
  Iteration 12 (of 50).   Current convergence value = 0.000817436 (threshold = 1e-07)
  Iteration 13 (of 50).   Current convergence value = 0.000835521 (threshold = 1e-07)
  Iteration 14 (of 50).   Current convergence value = 0.000807069 (threshold = 1e-07)
  Iteration 15 (of 50).   Current convergence value = 0.000789913 (threshold = 1e-07)
  Iteration 16 (of 50).   Current convergence value = 0.000771461 (threshold = 1e-07)
  Iteration 17 (of 50).   Current convergence value = 0.000770225 (threshold = 1e-07)
  Iteration 18 (of 50).   Current convergence value = 0.000782287 (threshold = 1e-07)
  Iteration 19 (of 50).   Current convergence value = 0.000792442 (threshold = 1e-07)
  Iteration 20 (of 50).   Current convergence value = 0.000798577 (threshold = 1e-07)
  Iteration 21 (of 50).   Current convergence value = 0.00078733 (threshold = 1e-07)
  Iteration 22 (of 50).   Current convergence value = 0.000759997 (threshold = 1e-07)
  Iteration 23 (of 50).   Current convergence value = 0.000744289 (threshold = 1e-07)
  Iteration 24 (of 50).   Current convergence value = 0.000740935 (threshold = 1e-07)
  Iteration 25 (of 50).   Current convergence value = 0.000733845 (threshold = 1e-07)
  Iteration 26 (of 50).   Current convergence value = 0.000734786 (threshold = 1e-07)
  Iteration 27 (of 50).   Current convergence value = 0.000743944 (threshold = 1e-07)
  Iteration 28 (of 50).   Current convergence value = 0.000760213 (threshold = 1e-07)
  Iteration 29 (of 50).   Current convergence value = 0.000781524 (threshold = 1e-07)
  Iteration 30 (of 50).   Current convergence value = 0.000797603 (threshold = 1e-07)
  Iteration 31 (of 50).   Current convergence value = 0.000779972 (threshold = 1e-07)
  Iteration 32 (of 50).   Current convergence value = 0.000728193 (threshold = 1e-07)
  Iteration 33 (of 50).   Current convergence value = 0.000745648 (threshold = 1e-07)
  Iteration 34 (of 50).   Current convergence value = 0.000777515 (threshold = 1e-07)
  Iteration 35 (of 50).   Current convergence value = 0.000773356 (threshold = 1e-07)
  Iteration 36 (of 50).   Current convergence value = 0.000758914 (threshold = 1e-07)
  Iteration 37 (of 50).   Current convergence value = 0.000747324 (threshold = 1e-07)
  Iteration 38 (of 50).   Current convergence value = 0.000706996 (threshold = 1e-07)
  Iteration 39 (of 50).   Current convergence value = 0.000678374 (threshold = 1e-07)
  Iteration 40 (of 50).   Current convergence value = 0.000657533 (threshold = 1e-07)
  Iteration 41 (of 50).   Current convergence value = 0.000643266 (threshold = 1e-07)
  Iteration 42 (of 50).   Current convergence value = 0.000636398 (threshold = 1e-07)
  Iteration 43 (of 50).   Current convergence value = 0.000637615 (threshold = 1e-07)
  Iteration 44 (of 50).   Current convergence value = 0.000637277 (threshold = 1e-07)
  Iteration 45 (of 50).   Current convergence value = 0.000640787 (threshold = 1e-07)
  Iteration 46 (of 50).   Current convergence value = 0.000651779 (threshold = 1e-07)
  Iteration 47 (of 50).   Current convergence value = 0.00067014 (threshold = 1e-07)
  Iteration 48 (of 50).   Current convergence value = 0.000693845 (threshold = 1e-07)
  Iteration 49 (of 50).   Current convergence value = 0.000716997 (threshold = 1e-07)
  Iteration 50 (of 50).   Current convergence value = 0.000733102 (threshold = 1e-07)
Current level = 4
  Iteration 1 (of 50).   Current convergence value = 0.00245038 (threshold = 1e-07)
  Iteration 2 (of 50).   Current convergence value = 0.00233228 (threshold = 1e-07)
  Iteration 3 (of 50).   Current convergence value = 0.00222312 (threshold = 1e-07)
  Iteration 4 (of 50).   Current convergence value = 0.0021568 (threshold = 1e-07)
  Iteration 5 (of 50).   Current convergence value = 0.00204226 (threshold = 1e-07)
  Iteration 6 (of 50).   Current convergence value = 0.00201978 (threshold = 1e-07)
  Iteration 7 (of 50).   Current convergence value = 0.00184111 (threshold = 1e-07)
  Iteration 8 (of 50).   Current convergence value = 0.00162091 (threshold = 1e-07)
  Iteration 9 (of 50).   Current convergence value = 0.0015514 (threshold = 1e-07)
  Iteration 10 (of 50).   Current convergence value = 0.00142504 (threshold = 1e-07)
  Iteration 11 (of 50).   Current convergence value = 0.00127986 (threshold = 1e-07)
  Iteration 12 (of 50).   Current convergence value = 0.00117831 (threshold = 1e-07)
  Iteration 13 (of 50).   Current convergence value = 0.00110757 (threshold = 1e-07)
  Iteration 14 (of 50).   Current convergence value = 0.00105194 (threshold = 1e-07)
  Iteration 15 (of 50).   Current convergence value = 0.00100304 (threshold = 1e-07)
  Iteration 16 (of 50).   Current convergence value = 0.000963881 (threshold = 1e-07)
  Iteration 17 (of 50).   Current convergence value = 0.00093577 (threshold = 1e-07)
  Iteration 18 (of 50).   Current convergence value = 0.000916564 (threshold = 1e-07)
  Iteration 19 (of 50).   Current convergence value = 0.000899906 (threshold = 1e-07)
  Iteration 20 (of 50).   Current convergence value = 0.000883691 (threshold = 1e-07)
  Iteration 21 (of 50).   Current convergence value = 0.000869596 (threshold = 1e-07)
  Iteration 22 (of 50).   Current convergence value = 0.000856296 (threshold = 1e-07)
  Iteration 23 (of 50).   Current convergence value = 0.00084267 (threshold = 1e-07)
  Iteration 24 (of 50).   Current convergence value = 0.000845203 (threshold = 1e-07)
  Iteration 25 (of 50).   Current convergence value = 0.000853243 (threshold = 1e-07)
  Iteration 26 (of 50).   Current convergence value = 0.000861247 (threshold = 1e-07)
  Iteration 27 (of 50).   Current convergence value = 0.00087312 (threshold = 1e-07)
  Iteration 28 (of 50).   Current convergence value = 0.000897025 (threshold = 1e-07)
  Iteration 29 (of 50).   Current convergence value = 0.000925218 (threshold = 1e-07)
  Iteration 30 (of 50).   Current convergence value = 0.000922757 (threshold = 1e-07)
  Iteration 31 (of 50).   Current convergence value = 0.000917047 (threshold = 1e-07)
  Iteration 32 (of 50).   Current convergence value = 0.000907252 (threshold = 1e-07)
  Iteration 33 (of 50).   Current convergence value = 0.000903933 (threshold = 1e-07)
  Iteration 34 (of 50).   Current convergence value = 0.000885491 (threshold = 1e-07)
  Iteration 35 (of 50).   Current convergence value = 0.000834594 (threshold = 1e-07)
  Iteration 36 (of 50).   Current convergence value = 0.000755692 (threshold = 1e-07)
  Iteration 37 (of 50).   Current convergence value = 0.000750875 (threshold = 1e-07)
  Iteration 38 (of 50).   Current convergence value = 0.000758564 (threshold = 1e-07)
  Iteration 39 (of 50).   Current convergence value = 0.000774789 (threshold = 1e-07)
  Iteration 40 (of 50).   Current convergence value = 0.000814827 (threshold = 1e-07)
  Iteration 41 (of 50).   Current convergence value = 0.000904355 (threshold = 1e-07)
  Iteration 42 (of 50).   Current convergence value = 0.000913234 (threshold = 1e-07)
  Iteration 43 (of 50).   Current convergence value = 0.000930935 (threshold = 1e-07)
  Iteration 44 (of 50).   Current convergence value = 0.000943232 (threshold = 1e-07)
  Iteration 45 (of 50).   Current convergence value = 0.000957828 (threshold = 1e-07)
  Iteration 46 (of 50).   Current convergence value = 0.001001 (threshold = 1e-07)
  Iteration 47 (of 50).   Current convergence value = 0.000988215 (threshold = 1e-07)
  Iteration 48 (of 50).   Current convergence value = 0.000962271 (threshold = 1e-07)
  Iteration 49 (of 50).   Current convergence value = 0.000943497 (threshold = 1e-07)
  Iteration 50 (of 50).   Current convergence value = 0.000915728 (threshold = 1e-07)
   N4BiasFieldCorrectionImageFilter (0x5558b40a6d30)
     RTTI typeinfo:   itk::N4BiasFieldCorrectionImageFilter<itk::Image<float, 3u>, itk::Image<float, 3u>, itk::Image<float, 3u> >
     Reference Count: 1
     Modified Time: 438
     Debug: Off
     Object Name: 
     Observers: 
       IterationEvent(Command)
     Inputs: 
       Primary: (0x5558b40b65d0) *
       _1: (0x5558b40b52e0)
     Indexed Inputs: 
       0: Primary (0x5558b40b65d0)
       1: _1 (0x5558b40b52e0)
     Required Input Names: Primary
     NumberOfRequiredInputs: 1
     Outputs: 
       Primary: (0x5558b40aee50)
     Indexed Outputs: 
       0: Primary (0x5558b40aee50)
     NumberOfRequiredOutputs: 1
     Number Of Threads: 20
     ReleaseDataFlag: Off
     ReleaseDataBeforeUpdateFlag: Off
     AbortGenerateData: Off
     Progress: 0
     Multithreader: 
       RTTI typeinfo:   itk::MultiThreader
       Reference Count: 1
       Modified Time: 132
       Debug: Off
       Object Name: 
       Observers: 
         none
       Thread Count: 20
       Global Maximum Number Of Threads: 128
       Global Default Number Of Threads: 20
     CoordinateTolerance: 1e-06
     DirectionTolerance: 1e-06
     Mask label: 1
     Number of histogram bins: 200
     Wiener filter noise: 0.01
     Bias field FWHM: 0.15
     Maximum number of iterations: [50, 50, 50, 50]
     Convergence threshold: 1e-07
     Spline order: 3
     Number of fitting levels: [4, 4, 4]
     Number of control points: [4, 4, 4]
     CurrentConvergenceMeasurement: 0.000915728
     CurrentLevel: 4
     ElapsedIterations: 51
     LogBiasFieldControlPointLattice: 
       Image (0x5558b40b4770)
         RTTI typeinfo:   itk::Image<itk::Vector<float, 1u>, 3u>
         Reference Count: 1
         Modified Time: 248425443
         Debug: Off
         Object Name: 
         Observers: 
           none
         Source: (none)
         Source output name: (none)
         Release Data: Off
         Data Released: False
         Global Release Data: Off
         PipelineMTime: 0
         UpdateMTime: 0
         RealTimeStamp: 0 seconds 
         LargestPossibleRegion: 
           Dimension: 3
           Index: [0, 0, 0]
           Size: [11, 11, 11]
         BufferedRegion: 
           Dimension: 3
           Index: [0, 0, 0]
           Size: [11, 11, 11]
         RequestedRegion: 
           Dimension: 3
           Index: [0, 0, 0]
           Size: [11, 11, 11]
         Spacing: [24.5, 24.5, 24.5]
         Origin: [24.1599, 17.9481, -29.9151]
         Direction: 
-0.999816 0.0185691 -0.00487152
-0.0191975 -0.967089 0.253711
-1.1376e-08 0.253758 0.967268

         IndexToPointMatrix: 
-24.4955 0.454942 -0.119352
-0.470338 -23.6937 6.21592
-2.78712e-07 6.21707 23.6981

         PointToIndexMatrix: 
-0.0408088 -0.00078357 -4.54812e-10
0.000757921 -0.039473 0.0103575
-0.000198837 0.0103556 0.0394803

         Inverse Direction: 
-0.999816 -0.0191975 -1.11429e-08
0.0185691 -0.967089 0.253758
-0.00487152 0.253711 0.967268

         PixelContainer: 
           ImportImageContainer (0x5558b40b4110)
             RTTI typeinfo:   itk::ImportImageContainer<unsigned long, itk::Vector<float, 1u> >
             Reference Count: 1
             Modified Time: 248425444
             Debug: Off
             Object Name: 
             Observers: 
               none
             Pointer: 0x5558b4510780
             Container manages memory: true
             Size: 1331
             Capacity: 1331
Elapsed time: 74.7501
END   <<<<<<<<<<<<<<<<<<<<



--------------------------------------------------------------------------------------
 Done with N4 correction (pre brain extraction):  0h 1m 22s
--------------------------------------------------------------------------------------


--------------------------------------------------------------------------------------
 Brain extraction using the following steps:
   1) Register /home/mpib/LNDG/StateSwitch/WIP_rest/preproc/B_data/C_standards/ANTS/MICCAI2012-Multi-Atlas-Challenge-Data/T_template0.nii.gz to /home/mpib/LNDG/StateSwitch/WIP_rest/preproc/B_data/D_preproc/2251/mri/t1/tempANTs/2251_t1_ANTsBET_N4Corrected0.nii.gz
   2) Warp /home/mpib/LNDG/StateSwitch/WIP_rest/preproc/B_data/C_standards/ANTS/MICCAI2012-Multi-Atlas-Challenge-Data/T_template0_BrainCerebellumProbabilityMask.nii.gz to /home/mpib/LNDG/StateSwitch/WIP_rest/preproc/B_data/D_preproc/2251/mri/t1/2251_t1.nii.gz using, from 1),
      /home/mpib/LNDG/StateSwitch/WIP_rest/preproc/B_data/D_preproc/2251/mri/t1/tempANTs/2251_t1_ANTsBET_BrainExtractionWarp/Affine
   3) Refine segmentation results using Atropos
--------------------------------------------------------------------------------------

BEGIN >>>>>>>>>>>>>>>>>>>>
/usr/lib/ants//ResampleImageBySpacing 3 /home/mpib/LNDG/StateSwitch/WIP_rest/preproc/B_data/C_standards/ANTS/MICCAI2012-Multi-Atlas-Challenge-Data/T_template0.nii.gz /home/mpib/LNDG/StateSwitch/WIP_rest/preproc/B_data/D_preproc/2251/mri/t1/tempANTs/2251_t1_ANTsBET_BrainExtractionInitialAffineFixed.nii.gz 4 4 4 1
 spacing [1, 1, 1] dim 3
 spacing2 [4, 4, 4]
 smoothing by : 3 dir 0
 smoothing by : 3 dir 1
 smoothing by : 3 dir 2
 out space [4, 4, 4]
 output size [54, 64, 72] spc [4, 4, 4]
END   <<<<<<<<<<<<<<<<<<<<


BEGIN >>>>>>>>>>>>>>>>>>>>
/usr/lib/ants//ResampleImageBySpacing 3 /home/mpib/LNDG/StateSwitch/WIP_rest/preproc/B_data/D_preproc/2251/mri/t1/tempANTs/2251_t1_ANTsBET_N4Corrected0.nii.gz /home/mpib/LNDG/StateSwitch/WIP_rest/preproc/B_data/D_preproc/2251/mri/t1/tempANTs/2251_t1_ANTsBET_BrainExtractionInitialAffineMoving.nii.gz 4 4 4 1
 spacing [1, 1, 1] dim 3
 spacing2 [4, 4, 4]
 smoothing by : 3 dir 0
 smoothing by : 3 dir 1
 smoothing by : 3 dir 2
 out space [4, 4, 4]
 output size [47, 47, 50] spc [4, 4, 4]
END   <<<<<<<<<<<<<<<<<<<<


BEGIN >>>>>>>>>>>>>>>>>>>>
/usr/lib/ants//ImageMath 3 /home/mpib/LNDG/StateSwitch/WIP_rest/preproc/B_data/D_preproc/2251/mri/t1/tempANTs/2251_t1_ANTsBET_BrainExtractionLaplacian.nii.gz Laplacian /home/mpib/LNDG/StateSwitch/WIP_rest/preproc/B_data/D_preproc/2251/mri/t1/tempANTs/2251_t1_ANTsBET_N4Corrected0.nii.gz 1.5 1
END   <<<<<<<<<<<<<<<<<<<<


BEGIN >>>>>>>>>>>>>>>>>>>>
/usr/lib/ants//ImageMath 3 /home/mpib/LNDG/StateSwitch/WIP_rest/preproc/B_data/D_preproc/2251/mri/t1/tempANTs/2251_t1_ANTsBET_BrainExtractionTemplateLaplacian.nii.gz Laplacian /home/mpib/LNDG/StateSwitch/WIP_rest/preproc/B_data/C_standards/ANTS/MICCAI2012-Multi-Atlas-Challenge-Data/T_template0.nii.gz 1.5 1
END   <<<<<<<<<<<<<<<<<<<<


BEGIN >>>>>>>>>>>>>>>>>>>>
/usr/lib/ants//antsAI -d 3 -v 1 -m Mattes[/home/mpib/LNDG/StateSwitch/WIP_rest/preproc/B_data/D_preproc/2251/mri/t1/tempANTs/2251_t1_ANTsBET_BrainExtractionInitialAffineFixed.nii.gz,/home/mpib/LNDG/StateSwitch/WIP_rest/preproc/B_data/D_preproc/2251/mri/t1/tempANTs/2251_t1_ANTsBET_BrainExtractionInitialAffineMoving.nii.gz,32,Regular,0.25] -t Affine[0.1] -s [15,0.1] -p 0 -c 10 -o /home/mpib/LNDG/StateSwitch/WIP_rest/preproc/B_data/D_preproc/2251/mri/t1/tempANTs/2251_t1_ANTsBET_BrainExtractionInitialAffine.mat -x //home/mpib/LNDG/StateSwitch/WIP_rest/preproc/B_data/C_standards/ANTS/MICCAI2012-Multi-Atlas-Challenge-Data/T_template0_BrainCerebellumRegistrationMask.nii.gz
Using the Mattes MI metric (number of bins = 32)
END   <<<<<<<<<<<<<<<<<<<<


BEGIN >>>>>>>>>>>>>>>>>>>>
/usr/lib/ants//antsRegistration -d 3 -u 1 -w [0.025,0.975] -o /home/mpib/LNDG/StateSwitch/WIP_rest/preproc/B_data/D_preproc/2251/mri/t1/tempANTs/2251_t1_ANTsBET_BrainExtractionPrior -r /home/mpib/LNDG/StateSwitch/WIP_rest/preproc/B_data/D_preproc/2251/mri/t1/tempANTs/2251_t1_ANTsBET_BrainExtractionInitialAffine.mat -z 1 --float 0 --verbose 1 -x [//home/mpib/LNDG/StateSwitch/WIP_rest/preproc/B_data/C_standards/ANTS/MICCAI2012-Multi-Atlas-Challenge-Data/T_template0_BrainCerebellumRegistrationMask.nii.gz] -m MI[/home/mpib/LNDG/StateSwitch/WIP_rest/preproc/B_data/C_standards/ANTS/MICCAI2012-Multi-Atlas-Challenge-Data/T_template0.nii.gz,/home/mpib/LNDG/StateSwitch/WIP_rest/preproc/B_data/D_preproc/2251/mri/t1/tempANTs/2251_t1_ANTsBET_N4Corrected0.nii.gz,1,32,Regular,0.25] -c [1000x500x250x100,1e-8,10] -t Rigid[0.1] -f 8x4x2x1 -s 4x2x1x0 -m MI[/home/mpib/LNDG/StateSwitch/WIP_rest/preproc/B_data/C_standards/ANTS/MICCAI2012-Multi-Atlas-Challenge-Data/T_template0.nii.gz,/home/mpib/LNDG/StateSwitch/WIP_rest/preproc/B_data/D_preproc/2251/mri/t1/tempANTs/2251_t1_ANTsBET_N4Corrected0.nii.gz,1,32,Regular,0.25] -c [1000x500x250x100,1e-8,10] -t Affine[0.1] -f 8x4x2x1 -s 4x2x1x0 -m CC[/home/mpib/LNDG/StateSwitch/WIP_rest/preproc/B_data/C_standards/ANTS/MICCAI2012-Multi-Atlas-Challenge-Data/T_template0.nii.gz,/home/mpib/LNDG/StateSwitch/WIP_rest/preproc/B_data/D_preproc/2251/mri/t1/tempANTs/2251_t1_ANTsBET_N4Corrected0.nii.gz,0.5,4] -m CC[/home/mpib/LNDG/StateSwitch/WIP_rest/preproc/B_data/D_preproc/2251/mri/t1/tempANTs/2251_t1_ANTsBET_BrainExtractionTemplateLaplacian.nii.gz,/home/mpib/LNDG/StateSwitch/WIP_rest/preproc/B_data/D_preproc/2251/mri/t1/tempANTs/2251_t1_ANTsBET_BrainExtractionLaplacian.nii.gz,0.5,4] -c [50x10x0,1e-9,15] -t SyN[0.1,3,0] -f 4x2x1 -s 2x1x0
All_Command_lines_OK
Using double precision for computations.
=============================================================================
The composite transform comprises the following transforms (in order): 
  1. /home/mpib/LNDG/StateSwitch/WIP_rest/preproc/B_data/D_preproc/2251/mri/t1/tempANTs/2251_t1_ANTsBET_BrainExtractionInitialAffine.mat (type = AffineTransform)
=============================================================================
  Reading mask(s).
    Registration stage 0
      Fixed mask = //home/mpib/LNDG/StateSwitch/WIP_rest/preproc/B_data/C_standards/ANTS/MICCAI2012-Multi-Atlas-Challenge-Data/T_template0_BrainCerebellumRegistrationMask.nii.gz
  number of levels = 4
  number of levels = 4
  number of levels = 3
  fixed image: /home/mpib/LNDG/StateSwitch/WIP_rest/preproc/B_data/C_standards/ANTS/MICCAI2012-Multi-Atlas-Challenge-Data/T_template0.nii.gz
  moving image: /home/mpib/LNDG/StateSwitch/WIP_rest/preproc/B_data/D_preproc/2251/mri/t1/tempANTs/2251_t1_ANTsBET_N4Corrected0.nii.gz
  fixed image: /home/mpib/LNDG/StateSwitch/WIP_rest/preproc/B_data/C_standards/ANTS/MICCAI2012-Multi-Atlas-Challenge-Data/T_template0.nii.gz
  moving image: /home/mpib/LNDG/StateSwitch/WIP_rest/preproc/B_data/D_preproc/2251/mri/t1/tempANTs/2251_t1_ANTsBET_N4Corrected0.nii.gz
  fixed image: /home/mpib/LNDG/StateSwitch/WIP_rest/preproc/B_data/C_standards/ANTS/MICCAI2012-Multi-Atlas-Challenge-Data/T_template0.nii.gz
  moving image: /home/mpib/LNDG/StateSwitch/WIP_rest/preproc/B_data/D_preproc/2251/mri/t1/tempANTs/2251_t1_ANTsBET_N4Corrected0.nii.gz
  fixed image: /home/mpib/LNDG/StateSwitch/WIP_rest/preproc/B_data/D_preproc/2251/mri/t1/tempANTs/2251_t1_ANTsBET_BrainExtractionTemplateLaplacian.nii.gz
  moving image: /home/mpib/LNDG/StateSwitch/WIP_rest/preproc/B_data/D_preproc/2251/mri/t1/tempANTs/2251_t1_ANTsBET_BrainExtractionLaplacian.nii.gz
Dimension = 3
Number of stages = 3
Use Histogram Matching true
Winsorize image intensities true
Lower quantile = 0.025
Upper quantile = 0.975
Stage 1 State
   Image metric = Mattes
     Fixed image = Image (0x5604d98207e0)
  RTTI typeinfo:   itk::Image<double, 3u>
  Reference Count: 2
  Modified Time: 1666
  Debug: Off
  Object Name: 
  Observers: 
    none
  Source: (none)
  Source output name: (none)
  Release Data: Off
  Data Released: False
  Global Release Data: Off
  PipelineMTime: 0
  UpdateMTime: 1501
  RealTimeStamp: 0 seconds 
  LargestPossibleRegion: 
    Dimension: 3
    Index: [0, 0, 0]
    Size: [216, 256, 291]
  BufferedRegion: 
    Dimension: 3
    Index: [0, 0, 0]
    Size: [216, 256, 291]
  RequestedRegion: 
    Dimension: 3
    Index: [0, 0, 0]
    Size: [216, 256, 291]
  Spacing: [1, 1, 1]
  Origin: [0, 293, 0]
  Direction: 
1 0 0
0 -0 -1
0 -1 -0

  IndexToPointMatrix: 
1 0 0
0 0 -1
0 -1 0

  PointToIndexMatrix: 
1 0 0
0 0 -1
0 -1 0

  Inverse Direction: 
1 0 0
0 0 -1
0 -1 0

  PixelContainer: 
    ImportImageContainer (0x5604d98249d0)
      RTTI typeinfo:   itk::ImportImageContainer<unsigned long, double>
      Reference Count: 1
      Modified Time: 1498
      Debug: Off
      Object Name: 
      Observers: 
        none
      Pointer: 0x7f21e6845010
      Container manages memory: true
      Size: 16091136
      Capacity: 16091136

     Moving image = Image (0x5604d9822620)
  RTTI typeinfo:   itk::Image<double, 3u>
  Reference Count: 2
  Modified Time: 1667
  Debug: Off
  Object Name: 
  Observers: 
    none
  Source: (none)
  Source output name: (none)
  Release Data: Off
  Data Released: False
  Global Release Data: Off
  PipelineMTime: 0
  UpdateMTime: 1664
  RealTimeStamp: 0 seconds 
  LargestPossibleRegion: 
    Dimension: 3
    Index: [0, 0, 0]
    Size: [188, 191, 200]
  BufferedRegion: 
    Dimension: 3
    Index: [0, 0, 0]
    Size: [188, 191, 200]
  RequestedRegion: 
    Dimension: 3
    Index: [0, 0, 0]
    Size: [188, 191, 200]
  Spacing: [1, 1, 1]
  Origin: [93.4808, 42.6824, -135.85]
  Direction: 
-0.999816 0.0185691 -0.00487152
-0.0191975 -0.967089 0.253711
-1.1376e-08 0.253758 0.967268

  IndexToPointMatrix: 
-0.999816 0.0185691 -0.00487152
-0.0191975 -0.967089 0.253711
-1.1376e-08 0.253758 0.967268

  PointToIndexMatrix: 
-0.999816 -0.0191975 -1.11429e-08
0.0185691 -0.967089 0.253758
-0.00487152 0.253711 0.967268

  Inverse Direction: 
-0.999816 -0.0191975 -1.11429e-08
0.0185691 -0.967089 0.253758
-0.00487152 0.253711 0.967268

  PixelContainer: 
    ImportImageContainer (0x5604d98248c0)
      RTTI typeinfo:   itk::ImportImageContainer<unsigned long, double>
      Reference Count: 1
      Modified Time: 1661
      Debug: Off
      Object Name: 
      Observers: 
        none
      Pointer: 0x7f21e317a010
      Container manages memory: true
      Size: 7181600
      Capacity: 7181600

     Weighting = 1
     Sampling strategy = regular
     Number of bins = 32
     Radius = 4
     Sampling percentage  = 0.25
   Transform = Rigid
     Gradient step = 0.1
     Update field sigma (voxel space) = 0
     Total field sigma (voxel space) = 0
     Update field time sigma = 0
     Total field time sigma  = 0
     Number of time indices = 0
     Number of time point samples = 0
Stage 2 State
   Image metric = Mattes
     Fixed image = Image (0x5604d982d910)
  RTTI typeinfo:   itk::Image<double, 3u>
  Reference Count: 2
  Modified Time: 1994
  Debug: Off
  Object Name: 
  Observers: 
    none
  Source: (none)
  Source output name: (none)
  Release Data: Off
  Data Released: False
  Global Release Data: Off
  PipelineMTime: 0
  UpdateMTime: 1829
  RealTimeStamp: 0 seconds 
  LargestPossibleRegion: 
    Dimension: 3
    Index: [0, 0, 0]
    Size: [216, 256, 291]
  BufferedRegion: 
    Dimension: 3
    Index: [0, 0, 0]
    Size: [216, 256, 291]
  RequestedRegion: 
    Dimension: 3
    Index: [0, 0, 0]
    Size: [216, 256, 291]
  Spacing: [1, 1, 1]
  Origin: [0, 293, 0]
  Direction: 
1 0 0
0 -0 -1
0 -1 -0

  IndexToPointMatrix: 
1 0 0
0 0 -1
0 -1 0

  PointToIndexMatrix: 
1 0 0
0 0 -1
0 -1 0

  Inverse Direction: 
1 0 0
0 0 -1
0 -1 0

  PixelContainer: 
    ImportImageContainer (0x5604d98243a0)
      RTTI typeinfo:   itk::ImportImageContainer<unsigned long, double>
      Reference Count: 1
      Modified Time: 1826
      Debug: Off
      Object Name: 
      Observers: 
        none
      Pointer: 0x7f21db6b5010
      Container manages memory: true
      Size: 16091136
      Capacity: 16091136

     Moving image = Image (0x5604d9833040)
  RTTI typeinfo:   itk::Image<double, 3u>
  Reference Count: 2
  Modified Time: 1995
  Debug: Off
  Object Name: 
  Observers: 
    none
  Source: (none)
  Source output name: (none)
  Release Data: Off
  Data Released: False
  Global Release Data: Off
  PipelineMTime: 0
  UpdateMTime: 1992
  RealTimeStamp: 0 seconds 
  LargestPossibleRegion: 
    Dimension: 3
    Index: [0, 0, 0]
    Size: [188, 191, 200]
  BufferedRegion: 
    Dimension: 3
    Index: [0, 0, 0]
    Size: [188, 191, 200]
  RequestedRegion: 
    Dimension: 3
    Index: [0, 0, 0]
    Size: [188, 191, 200]
  Spacing: [1, 1, 1]
  Origin: [93.4808, 42.6824, -135.85]
  Direction: 
-0.999816 0.0185691 -0.00487152
-0.0191975 -0.967089 0.253711
-1.1376e-08 0.253758 0.967268

  IndexToPointMatrix: 
-0.999816 0.0185691 -0.00487152
-0.0191975 -0.967089 0.253711
-1.1376e-08 0.253758 0.967268

  PointToIndexMatrix: 
-0.999816 -0.0191975 -1.11429e-08
0.0185691 -0.967089 0.253758
-0.00487152 0.253711 0.967268

  Inverse Direction: 
-0.999816 -0.0191975 -1.11429e-08
0.0185691 -0.967089 0.253758
-0.00487152 0.253711 0.967268

  PixelContainer: 
    ImportImageContainer (0x5604d9826830)
      RTTI typeinfo:   itk::ImportImageContainer<unsigned long, double>
      Reference Count: 1
      Modified Time: 1989
      Debug: Off
      Object Name: 
      Observers: 
        none
      Pointer: 0x5604d9834dd0
      Container manages memory: true
      Size: 7181600
      Capacity: 7181600

     Weighting = 1
     Sampling strategy = regular
     Number of bins = 32
     Radius = 4
     Sampling percentage  = 0.25
   Transform = Affine
     Gradient step = 0.1
     Update field sigma (voxel space) = 0
     Total field sigma (voxel space) = 0
     Update field time sigma = 0
     Total field time sigma  = 0
     Number of time indices = 0
     Number of time point samples = 0
Stage 3 State
   Image metric = CC
     Fixed image = Image (0x5604dceff6e0)
  RTTI typeinfo:   itk::Image<double, 3u>
  Reference Count: 2
  Modified Time: 2322
  Debug: Off
  Object Name: 
  Observers: 
    none
  Source: (none)
  Source output name: (none)
  Release Data: Off
  Data Released: False
  Global Release Data: Off
  PipelineMTime: 0
  UpdateMTime: 2157
  RealTimeStamp: 0 seconds 
  LargestPossibleRegion: 
    Dimension: 3
    Index: [0, 0, 0]
    Size: [216, 256, 291]
  BufferedRegion: 
    Dimension: 3
    Index: [0, 0, 0]
    Size: [216, 256, 291]
  RequestedRegion: 
    Dimension: 3
    Index: [0, 0, 0]
    Size: [216, 256, 291]
  Spacing: [1, 1, 1]
  Origin: [0, 293, 0]
  Direction: 
1 0 0
0 -0 -1
0 -1 -0

  IndexToPointMatrix: 
1 0 0
0 0 -1
0 -1 0

  PointToIndexMatrix: 
1 0 0
0 0 -1
0 -1 0

  Inverse Direction: 
1 0 0
0 0 -1
0 -1 0

  PixelContainer: 
    ImportImageContainer (0x5604d98308c0)
      RTTI typeinfo:   itk::ImportImageContainer<unsigned long, double>
      Reference Count: 1
      Modified Time: 2154
      Debug: Off
      Object Name: 
      Observers: 
        none
      Pointer: 0x7f21d3bf0010
      Container manages memory: true
      Size: 16091136
      Capacity: 16091136

     Moving image = Image (0x5604dcf01710)
  RTTI typeinfo:   itk::Image<double, 3u>
  Reference Count: 2
  Modified Time: 2323
  Debug: Off
  Object Name: 
  Observers: 
    none
  Source: (none)
  Source output name: (none)
  Release Data: Off
  Data Released: False
  Global Release Data: Off
  PipelineMTime: 0
  UpdateMTime: 2320
  RealTimeStamp: 0 seconds 
  LargestPossibleRegion: 
    Dimension: 3
    Index: [0, 0, 0]
    Size: [188, 191, 200]
  BufferedRegion: 
    Dimension: 3
    Index: [0, 0, 0]
    Size: [188, 191, 200]
  RequestedRegion: 
    Dimension: 3
    Index: [0, 0, 0]
    Size: [188, 191, 200]
  Spacing: [1, 1, 1]
  Origin: [93.4808, 42.6824, -135.85]
  Direction: 
-0.999816 0.0185691 -0.00487152
-0.0191975 -0.967089 0.253711
-1.1376e-08 0.253758 0.967268

  IndexToPointMatrix: 
-0.999816 0.0185691 -0.00487152
-0.0191975 -0.967089 0.253711
-1.1376e-08 0.253758 0.967268

  PointToIndexMatrix: 
-0.999816 -0.0191975 -1.11429e-08
0.0185691 -0.967089 0.253758
-0.00487152 0.253711 0.967268

  Inverse Direction: 
-0.999816 -0.0191975 -1.11429e-08
0.0185691 -0.967089 0.253758
-0.00487152 0.253711 0.967268

  PixelContainer: 
    ImportImageContainer (0x5604d98312d0)
      RTTI typeinfo:   itk::ImportImageContainer<unsigned long, double>
      Reference Count: 1
      Modified Time: 2317
      Debug: Off
      Object Name: 
      Observers: 
        none
      Pointer: 0x5604dcf03b00
      Container manages memory: true
      Size: 7181600
      Capacity: 7181600

     Weighting = 0.5
     Sampling strategy = none
     Number of bins = 32
     Radius = 4
     Sampling percentage  = 1
   Transform = SyN
     Gradient step = 0.1
     Update field sigma (voxel space) = 3
     Total field sigma (voxel space) = 0
     Update field time sigma = 0
     Total field time sigma  = 0
     Number of time indices = 0
     Number of time point samples = 0
Registration using 3 total stages.

Stage 0
  iterations = 1000x500x250x100
  convergence threshold = 1e-08
  convergence window size = 10
  number of levels = 4
  using the Mattes MI metric (number of bins = 32, weight = 1)
  preprocessing:  winsorizing the image intensities
  preprocessing:  histogram matching the images
  Shrink factors (level 1 out of 4): [8, 8, 8]
  Shrink factors (level 2 out of 4): [4, 4, 4]
  Shrink factors (level 3 out of 4): [2, 2, 2]
  Shrink factors (level 4 out of 4): [1, 1, 1]
  smoothing sigmas per level: [4, 2, 1, 0]
  regular sampling (percentage = 0.25)

*** Running Euler3DTransform registration ***

DIAGNOSTIC,Iteration,metricValue,convergenceValue,ITERATION_TIME_INDEX,SINCE_LAST
 2DIAGNOSTIC,     1, -8.751139583308e-01, 1.797693134862e+308, 9.9075e+00, 9.9075e+00, 
 2DIAGNOSTIC,     2, -8.754008705238e-01, 1.797693134862e+308, 9.9194e+00, 1.1904e-02, 
 2DIAGNOSTIC,     3, -8.755309036121e-01, 1.797693134862e+308, 9.9311e+00, 1.1744e-02, 
