---------------------  Running antsBrainExtraction.sh on ood-32  ---------------------

--------------------------------------------------------------------------------------
 Bias correction of anatomical images (pre brain extraction)
   1) pre-process by truncating the image intensities
   2) run N4
--------------------------------------------------------------------------------------

BEGIN >>>>>>>>>>>>>>>>>>>>
/usr/lib/ants//ImageMath 3 /home/mpib/LNDG/StateSwitch/WIP_rest/preproc/B_data/D_preproc/2147/mri/t1/tempANTs/2147_t1_ANTsBET_N4Truncated0.nii.gz TruncateImageIntensity /home/mpib/LNDG/StateSwitch/WIP_rest/preproc/B_data/D_preproc/2147/mri/t1/2147_t1.nii.gz 0.01 0.999 256
END   <<<<<<<<<<<<<<<<<<<<


BEGIN >>>>>>>>>>>>>>>>>>>>
/usr/lib/ants//N4BiasFieldCorrection -d 3 -i /home/mpib/LNDG/StateSwitch/WIP_rest/preproc/B_data/D_preproc/2147/mri/t1/tempANTs/2147_t1_ANTsBET_N4Truncated0.nii.gz -s 4 -c [50x50x50x50,0.0000001] -b [200] -o /home/mpib/LNDG/StateSwitch/WIP_rest/preproc/B_data/D_preproc/2147/mri/t1/tempANTs/2147_t1_ANTsBET_N4Corrected0.nii.gz --verbose 1

Running N4 for 3-dimensional images.

Mask not read.  Using the entire image as the mask.

Specified spline distance: 200mm
  original image size:  [180, 210, 193]
  padded image size:  [201, 401, 201]
  number of control points:  [4, 5, 4]

Current level = 1
  Iteration 1 (of 50).   Current convergence value = 0.000190722 (threshold = 1e-07)
  Iteration 2 (of 50).   Current convergence value = 0.000162644 (threshold = 1e-07)
  Iteration 3 (of 50).   Current convergence value = 0.000138634 (threshold = 1e-07)
  Iteration 4 (of 50).   Current convergence value = 0.000120219 (threshold = 1e-07)
  Iteration 5 (of 50).   Current convergence value = 0.000106051 (threshold = 1e-07)
  Iteration 6 (of 50).   Current convergence value = 9.57052e-05 (threshold = 1e-07)
  Iteration 7 (of 50).   Current convergence value = 8.92738e-05 (threshold = 1e-07)
  Iteration 8 (of 50).   Current convergence value = 8.48423e-05 (threshold = 1e-07)
  Iteration 9 (of 50).   Current convergence value = 8.22428e-05 (threshold = 1e-07)
  Iteration 10 (of 50).   Current convergence value = 8.15441e-05 (threshold = 1e-07)
  Iteration 11 (of 50).   Current convergence value = 8.26425e-05 (threshold = 1e-07)
  Iteration 12 (of 50).   Current convergence value = 8.48499e-05 (threshold = 1e-07)
  Iteration 13 (of 50).   Current convergence value = 8.79348e-05 (threshold = 1e-07)
  Iteration 14 (of 50).   Current convergence value = 9.06863e-05 (threshold = 1e-07)
  Iteration 15 (of 50).   Current convergence value = 9.35952e-05 (threshold = 1e-07)
  Iteration 16 (of 50).   Current convergence value = 9.67205e-05 (threshold = 1e-07)
  Iteration 17 (of 50).   Current convergence value = 9.94953e-05 (threshold = 1e-07)
  Iteration 18 (of 50).   Current convergence value = 0.000101118 (threshold = 1e-07)
  Iteration 19 (of 50).   Current convergence value = 0.000102572 (threshold = 1e-07)
  Iteration 20 (of 50).   Current convergence value = 0.000103912 (threshold = 1e-07)
  Iteration 21 (of 50).   Current convergence value = 0.000105344 (threshold = 1e-07)
  Iteration 22 (of 50).   Current convergence value = 0.00010651 (threshold = 1e-07)
  Iteration 23 (of 50).   Current convergence value = 0.000107469 (threshold = 1e-07)
  Iteration 24 (of 50).   Current convergence value = 0.000108486 (threshold = 1e-07)
  Iteration 25 (of 50).   Current convergence value = 0.000109501 (threshold = 1e-07)
  Iteration 26 (of 50).   Current convergence value = 0.00011054 (threshold = 1e-07)
  Iteration 27 (of 50).   Current convergence value = 0.000111415 (threshold = 1e-07)
  Iteration 28 (of 50).   Current convergence value = 0.000112377 (threshold = 1e-07)
  Iteration 29 (of 50).   Current convergence value = 0.000113119 (threshold = 1e-07)
  Iteration 30 (of 50).   Current convergence value = 0.000113899 (threshold = 1e-07)
  Iteration 31 (of 50).   Current convergence value = 0.000114505 (threshold = 1e-07)
  Iteration 32 (of 50).   Current convergence value = 0.000115489 (threshold = 1e-07)
  Iteration 33 (of 50).   Current convergence value = 0.000115033 (threshold = 1e-07)
  Iteration 34 (of 50).   Current convergence value = 0.000113994 (threshold = 1e-07)
  Iteration 35 (of 50).   Current convergence value = 0.000112931 (threshold = 1e-07)
  Iteration 36 (of 50).   Current convergence value = 0.000112103 (threshold = 1e-07)
  Iteration 37 (of 50).   Current convergence value = 0.000111346 (threshold = 1e-07)
  Iteration 38 (of 50).   Current convergence value = 0.000110332 (threshold = 1e-07)
  Iteration 39 (of 50).   Current convergence value = 0.000109428 (threshold = 1e-07)
  Iteration 40 (of 50).   Current convergence value = 0.000108641 (threshold = 1e-07)
  Iteration 41 (of 50).   Current convergence value = 0.000107902 (threshold = 1e-07)
  Iteration 42 (of 50).   Current convergence value = 0.00010726 (threshold = 1e-07)
  Iteration 43 (of 50).   Current convergence value = 0.000106678 (threshold = 1e-07)
  Iteration 44 (of 50).   Current convergence value = 0.000105969 (threshold = 1e-07)
  Iteration 45 (of 50).   Current convergence value = 0.000105346 (threshold = 1e-07)
  Iteration 46 (of 50).   Current convergence value = 0.000104782 (threshold = 1e-07)
  Iteration 47 (of 50).   Current convergence value = 0.00010452 (threshold = 1e-07)
  Iteration 48 (of 50).   Current convergence value = 0.000104072 (threshold = 1e-07)
  Iteration 49 (of 50).   Current convergence value = 0.000103676 (threshold = 1e-07)
  Iteration 50 (of 50).   Current convergence value = 0.000103305 (threshold = 1e-07)
Current level = 2
  Iteration 1 (of 50).   Current convergence value = 0.000358411 (threshold = 1e-07)
  Iteration 2 (of 50).   Current convergence value = 0.000364891 (threshold = 1e-07)
  Iteration 3 (of 50).   Current convergence value = 0.000374006 (threshold = 1e-07)
  Iteration 4 (of 50).   Current convergence value = 0.000382219 (threshold = 1e-07)
  Iteration 5 (of 50).   Current convergence value = 0.000387998 (threshold = 1e-07)
  Iteration 6 (of 50).   Current convergence value = 0.000391443 (threshold = 1e-07)
  Iteration 7 (of 50).   Current convergence value = 0.000393296 (threshold = 1e-07)
  Iteration 8 (of 50).   Current convergence value = 0.000394017 (threshold = 1e-07)
  Iteration 9 (of 50).   Current convergence value = 0.000394285 (threshold = 1e-07)
  Iteration 10 (of 50).   Current convergence value = 0.000386599 (threshold = 1e-07)
  Iteration 11 (of 50).   Current convergence value = 0.000374317 (threshold = 1e-07)
  Iteration 12 (of 50).   Current convergence value = 0.000369527 (threshold = 1e-07)
  Iteration 13 (of 50).   Current convergence value = 0.000365103 (threshold = 1e-07)
  Iteration 14 (of 50).   Current convergence value = 0.000360696 (threshold = 1e-07)
  Iteration 15 (of 50).   Current convergence value = 0.000357243 (threshold = 1e-07)
  Iteration 16 (of 50).   Current convergence value = 0.000355416 (threshold = 1e-07)
  Iteration 17 (of 50).   Current convergence value = 0.000353627 (threshold = 1e-07)
  Iteration 18 (of 50).   Current convergence value = 0.000351895 (threshold = 1e-07)
  Iteration 19 (of 50).   Current convergence value = 0.000350136 (threshold = 1e-07)
  Iteration 20 (of 50).   Current convergence value = 0.000348321 (threshold = 1e-07)
  Iteration 21 (of 50).   Current convergence value = 0.000346994 (threshold = 1e-07)
  Iteration 22 (of 50).   Current convergence value = 0.000345498 (threshold = 1e-07)
  Iteration 23 (of 50).   Current convergence value = 0.000344364 (threshold = 1e-07)
  Iteration 24 (of 50).   Current convergence value = 0.000343389 (threshold = 1e-07)
  Iteration 25 (of 50).   Current convergence value = 0.000342799 (threshold = 1e-07)
  Iteration 26 (of 50).   Current convergence value = 0.000341864 (threshold = 1e-07)
  Iteration 27 (of 50).   Current convergence value = 0.000342181 (threshold = 1e-07)
  Iteration 28 (of 50).   Current convergence value = 0.000342973 (threshold = 1e-07)
  Iteration 29 (of 50).   Current convergence value = 0.000354538 (threshold = 1e-07)
  Iteration 30 (of 50).   Current convergence value = 0.000373332 (threshold = 1e-07)
  Iteration 31 (of 50).   Current convergence value = 0.000386872 (threshold = 1e-07)
  Iteration 32 (of 50).   Current convergence value = 0.000398078 (threshold = 1e-07)
  Iteration 33 (of 50).   Current convergence value = 0.000405325 (threshold = 1e-07)
  Iteration 34 (of 50).   Current convergence value = 0.000410772 (threshold = 1e-07)
  Iteration 35 (of 50).   Current convergence value = 0.000415209 (threshold = 1e-07)
  Iteration 36 (of 50).   Current convergence value = 0.000419259 (threshold = 1e-07)
  Iteration 37 (of 50).   Current convergence value = 0.000423066 (threshold = 1e-07)
  Iteration 38 (of 50).   Current convergence value = 0.000426162 (threshold = 1e-07)
  Iteration 39 (of 50).   Current convergence value = 0.000429062 (threshold = 1e-07)
  Iteration 40 (of 50).   Current convergence value = 0.000431479 (threshold = 1e-07)
  Iteration 41 (of 50).   Current convergence value = 0.000433703 (threshold = 1e-07)
  Iteration 42 (of 50).   Current convergence value = 0.000435826 (threshold = 1e-07)
  Iteration 43 (of 50).   Current convergence value = 0.000437664 (threshold = 1e-07)
  Iteration 44 (of 50).   Current convergence value = 0.000439009 (threshold = 1e-07)
  Iteration 45 (of 50).   Current convergence value = 0.000438056 (threshold = 1e-07)
  Iteration 46 (of 50).   Current convergence value = 0.000436734 (threshold = 1e-07)
  Iteration 47 (of 50).   Current convergence value = 0.000446821 (threshold = 1e-07)
  Iteration 48 (of 50).   Current convergence value = 0.000454684 (threshold = 1e-07)
  Iteration 49 (of 50).   Current convergence value = 0.000458819 (threshold = 1e-07)
  Iteration 50 (of 50).   Current convergence value = 0.000447218 (threshold = 1e-07)
Current level = 3
  Iteration 1 (of 50).   Current convergence value = 0.00133592 (threshold = 1e-07)
  Iteration 2 (of 50).   Current convergence value = 0.00131004 (threshold = 1e-07)
  Iteration 3 (of 50).   Current convergence value = 0.00130277 (threshold = 1e-07)
  Iteration 4 (of 50).   Current convergence value = 0.00129861 (threshold = 1e-07)
  Iteration 5 (of 50).   Current convergence value = 0.00128884 (threshold = 1e-07)
  Iteration 6 (of 50).   Current convergence value = 0.00127728 (threshold = 1e-07)
  Iteration 7 (of 50).   Current convergence value = 0.00127865 (threshold = 1e-07)
  Iteration 8 (of 50).   Current convergence value = 0.00128063 (threshold = 1e-07)
  Iteration 9 (of 50).   Current convergence value = 0.00128232 (threshold = 1e-07)
  Iteration 10 (of 50).   Current convergence value = 0.00126737 (threshold = 1e-07)
  Iteration 11 (of 50).   Current convergence value = 0.00121776 (threshold = 1e-07)
  Iteration 12 (of 50).   Current convergence value = 0.00119766 (threshold = 1e-07)
  Iteration 13 (of 50).   Current convergence value = 0.00118505 (threshold = 1e-07)
  Iteration 14 (of 50).   Current convergence value = 0.00117485 (threshold = 1e-07)
  Iteration 15 (of 50).   Current convergence value = 0.00116523 (threshold = 1e-07)
  Iteration 16 (of 50).   Current convergence value = 0.00113983 (threshold = 1e-07)
  Iteration 17 (of 50).   Current convergence value = 0.00113115 (threshold = 1e-07)
  Iteration 18 (of 50).   Current convergence value = 0.00112665 (threshold = 1e-07)
  Iteration 19 (of 50).   Current convergence value = 0.00112274 (threshold = 1e-07)
  Iteration 20 (of 50).   Current convergence value = 0.00111071 (threshold = 1e-07)
  Iteration 21 (of 50).   Current convergence value = 0.00110308 (threshold = 1e-07)
  Iteration 22 (of 50).   Current convergence value = 0.00110153 (threshold = 1e-07)
  Iteration 23 (of 50).   Current convergence value = 0.0011254 (threshold = 1e-07)
  Iteration 24 (of 50).   Current convergence value = 0.00113322 (threshold = 1e-07)
  Iteration 25 (of 50).   Current convergence value = 0.00112256 (threshold = 1e-07)
  Iteration 26 (of 50).   Current convergence value = 0.00112458 (threshold = 1e-07)
  Iteration 27 (of 50).   Current convergence value = 0.00113412 (threshold = 1e-07)
  Iteration 28 (of 50).   Current convergence value = 0.00113292 (threshold = 1e-07)
  Iteration 29 (of 50).   Current convergence value = 0.00110941 (threshold = 1e-07)
  Iteration 30 (of 50).   Current convergence value = 0.00108911 (threshold = 1e-07)
  Iteration 31 (of 50).   Current convergence value = 0.0010796 (threshold = 1e-07)
  Iteration 32 (of 50).   Current convergence value = 0.0010751 (threshold = 1e-07)
  Iteration 33 (of 50).   Current convergence value = 0.0010746 (threshold = 1e-07)
  Iteration 34 (of 50).   Current convergence value = 0.00107795 (threshold = 1e-07)
  Iteration 35 (of 50).   Current convergence value = 0.00108361 (threshold = 1e-07)
  Iteration 36 (of 50).   Current convergence value = 0.00108833 (threshold = 1e-07)
  Iteration 37 (of 50).   Current convergence value = 0.00108696 (threshold = 1e-07)
  Iteration 38 (of 50).   Current convergence value = 0.00109338 (threshold = 1e-07)
  Iteration 39 (of 50).   Current convergence value = 0.0011037 (threshold = 1e-07)
  Iteration 40 (of 50).   Current convergence value = 0.00111152 (threshold = 1e-07)
  Iteration 41 (of 50).   Current convergence value = 0.00111989 (threshold = 1e-07)
  Iteration 42 (of 50).   Current convergence value = 0.00112145 (threshold = 1e-07)
  Iteration 43 (of 50).   Current convergence value = 0.00113513 (threshold = 1e-07)
  Iteration 44 (of 50).   Current convergence value = 0.0011545 (threshold = 1e-07)
  Iteration 45 (of 50).   Current convergence value = 0.00115151 (threshold = 1e-07)
  Iteration 46 (of 50).   Current convergence value = 0.00114328 (threshold = 1e-07)
  Iteration 47 (of 50).   Current convergence value = 0.00113685 (threshold = 1e-07)
  Iteration 48 (of 50).   Current convergence value = 0.00113047 (threshold = 1e-07)
  Iteration 49 (of 50).   Current convergence value = 0.00113729 (threshold = 1e-07)
  Iteration 50 (of 50).   Current convergence value = 0.0011211 (threshold = 1e-07)
Current level = 4
  Iteration 1 (of 50).   Current convergence value = 0.00301781 (threshold = 1e-07)
  Iteration 2 (of 50).   Current convergence value = 0.00278211 (threshold = 1e-07)
  Iteration 3 (of 50).   Current convergence value = 0.00257496 (threshold = 1e-07)
  Iteration 4 (of 50).   Current convergence value = 0.00241521 (threshold = 1e-07)
  Iteration 5 (of 50).   Current convergence value = 0.00225335 (threshold = 1e-07)
  Iteration 6 (of 50).   Current convergence value = 0.00193139 (threshold = 1e-07)
  Iteration 7 (of 50).   Current convergence value = 0.00179412 (threshold = 1e-07)
  Iteration 8 (of 50).   Current convergence value = 0.00173293 (threshold = 1e-07)
  Iteration 9 (of 50).   Current convergence value = 0.00167324 (threshold = 1e-07)
  Iteration 10 (of 50).   Current convergence value = 0.00159414 (threshold = 1e-07)
  Iteration 11 (of 50).   Current convergence value = 0.00151655 (threshold = 1e-07)
  Iteration 12 (of 50).   Current convergence value = 0.00144697 (threshold = 1e-07)
  Iteration 13 (of 50).   Current convergence value = 0.00139198 (threshold = 1e-07)
  Iteration 14 (of 50).   Current convergence value = 0.00134393 (threshold = 1e-07)
  Iteration 15 (of 50).   Current convergence value = 0.00139523 (threshold = 1e-07)
  Iteration 16 (of 50).   Current convergence value = 0.00137792 (threshold = 1e-07)
  Iteration 17 (of 50).   Current convergence value = 0.00133469 (threshold = 1e-07)
  Iteration 18 (of 50).   Current convergence value = 0.00129624 (threshold = 1e-07)
  Iteration 19 (of 50).   Current convergence value = 0.00126251 (threshold = 1e-07)
  Iteration 20 (of 50).   Current convergence value = 0.00123988 (threshold = 1e-07)
  Iteration 21 (of 50).   Current convergence value = 0.00120612 (threshold = 1e-07)
  Iteration 22 (of 50).   Current convergence value = 0.00118152 (threshold = 1e-07)
  Iteration 23 (of 50).   Current convergence value = 0.0011578 (threshold = 1e-07)
  Iteration 24 (of 50).   Current convergence value = 0.00114196 (threshold = 1e-07)
  Iteration 25 (of 50).   Current convergence value = 0.00110205 (threshold = 1e-07)
  Iteration 26 (of 50).   Current convergence value = 0.0010666 (threshold = 1e-07)
  Iteration 27 (of 50).   Current convergence value = 0.00103451 (threshold = 1e-07)
  Iteration 28 (of 50).   Current convergence value = 0.00100593 (threshold = 1e-07)
  Iteration 29 (of 50).   Current convergence value = 0.000979146 (threshold = 1e-07)
  Iteration 30 (of 50).   Current convergence value = 0.000955854 (threshold = 1e-07)
  Iteration 31 (of 50).   Current convergence value = 0.00093576 (threshold = 1e-07)
  Iteration 32 (of 50).   Current convergence value = 0.000915809 (threshold = 1e-07)
  Iteration 33 (of 50).   Current convergence value = 0.00089837 (threshold = 1e-07)
  Iteration 34 (of 50).   Current convergence value = 0.000883054 (threshold = 1e-07)
  Iteration 35 (of 50).   Current convergence value = 0.000869202 (threshold = 1e-07)
  Iteration 36 (of 50).   Current convergence value = 0.000855174 (threshold = 1e-07)
  Iteration 37 (of 50).   Current convergence value = 0.00084321 (threshold = 1e-07)
  Iteration 38 (of 50).   Current convergence value = 0.000834205 (threshold = 1e-07)
  Iteration 39 (of 50).   Current convergence value = 0.000827045 (threshold = 1e-07)
  Iteration 40 (of 50).   Current convergence value = 0.000820295 (threshold = 1e-07)
  Iteration 41 (of 50).   Current convergence value = 0.00081695 (threshold = 1e-07)
  Iteration 42 (of 50).   Current convergence value = 0.000815032 (threshold = 1e-07)
  Iteration 43 (of 50).   Current convergence value = 0.000840592 (threshold = 1e-07)
  Iteration 44 (of 50).   Current convergence value = 0.000974892 (threshold = 1e-07)
  Iteration 45 (of 50).   Current convergence value = 0.00106451 (threshold = 1e-07)
  Iteration 46 (of 50).   Current convergence value = 0.00111206 (threshold = 1e-07)
  Iteration 47 (of 50).   Current convergence value = 0.00113148 (threshold = 1e-07)
  Iteration 48 (of 50).   Current convergence value = 0.00113788 (threshold = 1e-07)
  Iteration 49 (of 50).   Current convergence value = 0.00114185 (threshold = 1e-07)
  Iteration 50 (of 50).   Current convergence value = 0.00114229 (threshold = 1e-07)
   N4BiasFieldCorrectionImageFilter (0x55622e9dcd30)
     RTTI typeinfo:   itk::N4BiasFieldCorrectionImageFilter<itk::Image<float, 3u>, itk::Image<float, 3u>, itk::Image<float, 3u> >
     Reference Count: 1
     Modified Time: 439
     Debug: Off
     Object Name: 
     Observers: 
       IterationEvent(Command)
     Inputs: 
       Primary: (0x55622e9ec5d0) *
       _1: (0x55622e9eacb0)
     Indexed Inputs: 
       0: Primary (0x55622e9ec5d0)
       1: _1 (0x55622e9eacb0)
     Required Input Names: Primary
     NumberOfRequiredInputs: 1
     Outputs: 
       Primary: (0x55622e9e4e50)
     Indexed Outputs: 
       0: Primary (0x55622e9e4e50)
     NumberOfRequiredOutputs: 1
     Number Of Threads: 16
     ReleaseDataFlag: Off
     ReleaseDataBeforeUpdateFlag: Off
     AbortGenerateData: Off
     Progress: 0
     Multithreader: 
       RTTI typeinfo:   itk::MultiThreader
       Reference Count: 1
       Modified Time: 132
       Debug: Off
       Object Name: 
       Observers: 
         none
       Thread Count: 16
       Global Maximum Number Of Threads: 128
       Global Default Number Of Threads: 16
     CoordinateTolerance: 1e-06
     DirectionTolerance: 1e-06
     Mask label: 1
     Number of histogram bins: 200
     Wiener filter noise: 0.01
     Bias field FWHM: 0.15
     Maximum number of iterations: [50, 50, 50, 50]
     Convergence threshold: 1e-07
     Spline order: 3
     Number of fitting levels: [4, 4, 4]
     Number of control points: [4, 5, 4]
     CurrentConvergenceMeasurement: 0.00114229
     CurrentLevel: 4
     ElapsedIterations: 51
     LogBiasFieldControlPointLattice: 
       Image (0x55622f120730)
         RTTI typeinfo:   itk::Image<itk::Vector<float, 1u>, 3u>
         Reference Count: 1
         Modified Time: 252076038
         Debug: Off
         Object Name: 
         Observers: 
           none
         Source: (none)
         Source output name: (none)
         Release Data: Off
         Data Released: False
         Global Release Data: Off
         PipelineMTime: 0
         UpdateMTime: 0
         RealTimeStamp: 0 seconds 
         LargestPossibleRegion: 
           Dimension: 3
           Index: [0, 0, 0]
           Size: [11, 19, 11]
         BufferedRegion: 
           Dimension: 3
           Index: [0, 0, 0]
           Size: [11, 19, 11]
         RequestedRegion: 
           Dimension: 3
           Index: [0, 0, 0]
           Size: [11, 19, 11]
         Spacing: [24.5, 24.75, 24.5]
         Origin: [24.2321, 19.3538, -29.177]
         Direction: 
-0.999903 0.0136468 -0.00295056
-0.0139621 -0.977321 0.211304
-1.45019e-08 0.211325 0.977416

         IndexToPointMatrix: 
-24.4976 0.337758 -0.0722887
-0.342072 -24.1887 5.17695
-3.55297e-07 5.23029 23.9467

         PointToIndexMatrix: 
-0.0408123 -0.000569883 -5.89413e-10
0.000551386 -0.0394877 0.00853838
-0.000120431 0.00862466 0.0398945

         Inverse Direction: 
-0.999903 -0.0139621 -1.44406e-08
0.0136468 -0.977321 0.211325
-0.00295056 0.211304 0.977416

         PixelContainer: 
           ImportImageContainer (0x55622e9ebcc0)
             RTTI typeinfo:   itk::ImportImageContainer<unsigned long, itk::Vector<float, 1u> >
             Reference Count: 1
             Modified Time: 252076039
             Debug: Off
             Object Name: 
             Observers: 
               none
             Pointer: 0x55622f3b0bc0
             Container manages memory: true
             Size: 2299
             Capacity: 2299
Elapsed time: 99.9441
END   <<<<<<<<<<<<<<<<<<<<



--------------------------------------------------------------------------------------
 Done with N4 correction (pre brain extraction):  0h 1m 49s
--------------------------------------------------------------------------------------


--------------------------------------------------------------------------------------
 Brain extraction using the following steps:
   1) Register /home/mpib/LNDG/StateSwitch/WIP_rest/preproc/B_data/C_standards/ANTS/MICCAI2012-Multi-Atlas-Challenge-Data/T_template0.nii.gz to /home/mpib/LNDG/StateSwitch/WIP_rest/preproc/B_data/D_preproc/2147/mri/t1/tempANTs/2147_t1_ANTsBET_N4Corrected0.nii.gz
   2) Warp /home/mpib/LNDG/StateSwitch/WIP_rest/preproc/B_data/C_standards/ANTS/MICCAI2012-Multi-Atlas-Challenge-Data/T_template0_BrainCerebellumProbabilityMask.nii.gz to /home/mpib/LNDG/StateSwitch/WIP_rest/preproc/B_data/D_preproc/2147/mri/t1/2147_t1.nii.gz using, from 1),
      /home/mpib/LNDG/StateSwitch/WIP_rest/preproc/B_data/D_preproc/2147/mri/t1/tempANTs/2147_t1_ANTsBET_BrainExtractionWarp/Affine
   3) Refine segmentation results using Atropos
--------------------------------------------------------------------------------------

BEGIN >>>>>>>>>>>>>>>>>>>>
/usr/lib/ants//ResampleImageBySpacing 3 /home/mpib/LNDG/StateSwitch/WIP_rest/preproc/B_data/C_standards/ANTS/MICCAI2012-Multi-Atlas-Challenge-Data/T_template0.nii.gz /home/mpib/LNDG/StateSwitch/WIP_rest/preproc/B_data/D_preproc/2147/mri/t1/tempANTs/2147_t1_ANTsBET_BrainExtractionInitialAffineFixed.nii.gz 4 4 4 1
 spacing [1, 1, 1] dim 3
 spacing2 [4, 4, 4]
 smoothing by : 3 dir 0
 smoothing by : 3 dir 1
 smoothing by : 3 dir 2
 out space [4, 4, 4]
 output size [54, 64, 72] spc [4, 4, 4]
END   <<<<<<<<<<<<<<<<<<<<


BEGIN >>>>>>>>>>>>>>>>>>>>
/usr/lib/ants//ResampleImageBySpacing 3 /home/mpib/LNDG/StateSwitch/WIP_rest/preproc/B_data/D_preproc/2147/mri/t1/tempANTs/2147_t1_ANTsBET_N4Corrected0.nii.gz /home/mpib/LNDG/StateSwitch/WIP_rest/preproc/B_data/D_preproc/2147/mri/t1/tempANTs/2147_t1_ANTsBET_BrainExtractionInitialAffineMoving.nii.gz 4 4 4 1
 spacing [1, 1, 1] dim 3
 spacing2 [4, 4, 4]
 smoothing by : 3 dir 0
 smoothing by : 3 dir 1
 smoothing by : 3 dir 2
 out space [4, 4, 4]
 output size [45, 52, 48] spc [4, 4, 4]
END   <<<<<<<<<<<<<<<<<<<<


BEGIN >>>>>>>>>>>>>>>>>>>>
/usr/lib/ants//ImageMath 3 /home/mpib/LNDG/StateSwitch/WIP_rest/preproc/B_data/D_preproc/2147/mri/t1/tempANTs/2147_t1_ANTsBET_BrainExtractionLaplacian.nii.gz Laplacian /home/mpib/LNDG/StateSwitch/WIP_rest/preproc/B_data/D_preproc/2147/mri/t1/tempANTs/2147_t1_ANTsBET_N4Corrected0.nii.gz 1.5 1
END   <<<<<<<<<<<<<<<<<<<<


BEGIN >>>>>>>>>>>>>>>>>>>>
/usr/lib/ants//ImageMath 3 /home/mpib/LNDG/StateSwitch/WIP_rest/preproc/B_data/D_preproc/2147/mri/t1/tempANTs/2147_t1_ANTsBET_BrainExtractionTemplateLaplacian.nii.gz Laplacian /home/mpib/LNDG/StateSwitch/WIP_rest/preproc/B_data/C_standards/ANTS/MICCAI2012-Multi-Atlas-Challenge-Data/T_template0.nii.gz 1.5 1
END   <<<<<<<<<<<<<<<<<<<<


BEGIN >>>>>>>>>>>>>>>>>>>>
/usr/lib/ants//antsAI -d 3 -v 1 -m Mattes[/home/mpib/LNDG/StateSwitch/WIP_rest/preproc/B_data/D_preproc/2147/mri/t1/tempANTs/2147_t1_ANTsBET_BrainExtractionInitialAffineFixed.nii.gz,/home/mpib/LNDG/StateSwitch/WIP_rest/preproc/B_data/D_preproc/2147/mri/t1/tempANTs/2147_t1_ANTsBET_BrainExtractionInitialAffineMoving.nii.gz,32,Regular,0.25] -t Affine[0.1] -s [15,0.1] -p 0 -c 10 -o /home/mpib/LNDG/StateSwitch/WIP_rest/preproc/B_data/D_preproc/2147/mri/t1/tempANTs/2147_t1_ANTsBET_BrainExtractionInitialAffine.mat -x //home/mpib/LNDG/StateSwitch/WIP_rest/preproc/B_data/C_standards/ANTS/MICCAI2012-Multi-Atlas-Challenge-Data/T_template0_BrainCerebellumRegistrationMask.nii.gz
Using the Mattes MI metric (number of bins = 32)
END   <<<<<<<<<<<<<<<<<<<<


BEGIN >>>>>>>>>>>>>>>>>>>>
/usr/lib/ants//antsRegistration -d 3 -u 1 -w [0.025,0.975] -o /home/mpib/LNDG/StateSwitch/WIP_rest/preproc/B_data/D_preproc/2147/mri/t1/tempANTs/2147_t1_ANTsBET_BrainExtractionPrior -r /home/mpib/LNDG/StateSwitch/WIP_rest/preproc/B_data/D_preproc/2147/mri/t1/tempANTs/2147_t1_ANTsBET_BrainExtractionInitialAffine.mat -z 1 --float 0 --verbose 1 -x [//home/mpib/LNDG/StateSwitch/WIP_rest/preproc/B_data/C_standards/ANTS/MICCAI2012-Multi-Atlas-Challenge-Data/T_template0_BrainCerebellumRegistrationMask.nii.gz] -m MI[/home/mpib/LNDG/StateSwitch/WIP_rest/preproc/B_data/C_standards/ANTS/MICCAI2012-Multi-Atlas-Challenge-Data/T_template0.nii.gz,/home/mpib/LNDG/StateSwitch/WIP_rest/preproc/B_data/D_preproc/2147/mri/t1/tempANTs/2147_t1_ANTsBET_N4Corrected0.nii.gz,1,32,Regular,0.25] -c [1000x500x250x100,1e-8,10] -t Rigid[0.1] -f 8x4x2x1 -s 4x2x1x0 -m MI[/home/mpib/LNDG/StateSwitch/WIP_rest/preproc/B_data/C_standards/ANTS/MICCAI2012-Multi-Atlas-Challenge-Data/T_template0.nii.gz,/home/mpib/LNDG/StateSwitch/WIP_rest/preproc/B_data/D_preproc/2147/mri/t1/tempANTs/2147_t1_ANTsBET_N4Corrected0.nii.gz,1,32,Regular,0.25] -c [1000x500x250x100,1e-8,10] -t Affine[0.1] -f 8x4x2x1 -s 4x2x1x0 -m CC[/home/mpib/LNDG/StateSwitch/WIP_rest/preproc/B_data/C_standards/ANTS/MICCAI2012-Multi-Atlas-Challenge-Data/T_template0.nii.gz,/home/mpib/LNDG/StateSwitch/WIP_rest/preproc/B_data/D_preproc/2147/mri/t1/tempANTs/2147_t1_ANTsBET_N4Corrected0.nii.gz,0.5,4] -m CC[/home/mpib/LNDG/StateSwitch/WIP_rest/preproc/B_data/D_preproc/2147/mri/t1/tempANTs/2147_t1_ANTsBET_BrainExtractionTemplateLaplacian.nii.gz,/home/mpib/LNDG/StateSwitch/WIP_rest/preproc/B_data/D_preproc/2147/mri/t1/tempANTs/2147_t1_ANTsBET_BrainExtractionLaplacian.nii.gz,0.5,4] -c [50x10x0,1e-9,15] -t SyN[0.1,3,0] -f 4x2x1 -s 2x1x0
All_Command_lines_OK
Using double precision for computations.
=============================================================================
The composite transform comprises the following transforms (in order): 
  1. /home/mpib/LNDG/StateSwitch/WIP_rest/preproc/B_data/D_preproc/2147/mri/t1/tempANTs/2147_t1_ANTsBET_BrainExtractionInitialAffine.mat (type = AffineTransform)
=============================================================================
  Reading mask(s).
    Registration stage 0
      Fixed mask = //home/mpib/LNDG/StateSwitch/WIP_rest/preproc/B_data/C_standards/ANTS/MICCAI2012-Multi-Atlas-Challenge-Data/T_template0_BrainCerebellumRegistrationMask.nii.gz
  number of levels = 4
  number of levels = 4
  number of levels = 3
  fixed image: /home/mpib/LNDG/StateSwitch/WIP_rest/preproc/B_data/C_standards/ANTS/MICCAI2012-Multi-Atlas-Challenge-Data/T_template0.nii.gz
  moving image: /home/mpib/LNDG/StateSwitch/WIP_rest/preproc/B_data/D_preproc/2147/mri/t1/tempANTs/2147_t1_ANTsBET_N4Corrected0.nii.gz
  fixed image: /home/mpib/LNDG/StateSwitch/WIP_rest/preproc/B_data/C_standards/ANTS/MICCAI2012-Multi-Atlas-Challenge-Data/T_template0.nii.gz
  moving image: /home/mpib/LNDG/StateSwitch/WIP_rest/preproc/B_data/D_preproc/2147/mri/t1/tempANTs/2147_t1_ANTsBET_N4Corrected0.nii.gz
  fixed image: /home/mpib/LNDG/StateSwitch/WIP_rest/preproc/B_data/C_standards/ANTS/MICCAI2012-Multi-Atlas-Challenge-Data/T_template0.nii.gz
  moving image: /home/mpib/LNDG/StateSwitch/WIP_rest/preproc/B_data/D_preproc/2147/mri/t1/tempANTs/2147_t1_ANTsBET_N4Corrected0.nii.gz
  fixed image: /home/mpib/LNDG/StateSwitch/WIP_rest/preproc/B_data/D_preproc/2147/mri/t1/tempANTs/2147_t1_ANTsBET_BrainExtractionTemplateLaplacian.nii.gz
  moving image: /home/mpib/LNDG/StateSwitch/WIP_rest/preproc/B_data/D_preproc/2147/mri/t1/tempANTs/2147_t1_ANTsBET_BrainExtractionLaplacian.nii.gz
Dimension = 3
Number of stages = 3
Use Histogram Matching true
Winsorize image intensities true
Lower quantile = 0.025
Upper quantile = 0.975
Stage 1 State
   Image metric = Mattes
     Fixed image = Image (0x555f749c67e0)
  RTTI typeinfo:   itk::Image<double, 3u>
  Reference Count: 2
  Modified Time: 1666
  Debug: Off
  Object Name: 
  Observers: 
    none
  Source: (none)
  Source output name: (none)
  Release Data: Off
  Data Released: False
  Global Release Data: Off
  PipelineMTime: 0
  UpdateMTime: 1501
  RealTimeStamp: 0 seconds 
  LargestPossibleRegion: 
    Dimension: 3
    Index: [0, 0, 0]
    Size: [216, 256, 291]
  BufferedRegion: 
    Dimension: 3
    Index: [0, 0, 0]
    Size: [216, 256, 291]
  RequestedRegion: 
    Dimension: 3
    Index: [0, 0, 0]
    Size: [216, 256, 291]
  Spacing: [1, 1, 1]
  Origin: [0, 293, 0]
  Direction: 
1 0 0
0 -0 -1
0 -1 -0

  IndexToPointMatrix: 
1 0 0
0 0 -1
0 -1 0

  PointToIndexMatrix: 
1 0 0
0 0 -1
0 -1 0

  Inverse Direction: 
1 0 0
0 0 -1
0 -1 0

  PixelContainer: 
    ImportImageContainer (0x555f749ca9d0)
      RTTI typeinfo:   itk::ImportImageContainer<unsigned long, double>
      Reference Count: 1
      Modified Time: 1498
      Debug: Off
      Object Name: 
      Observers: 
        none
      Pointer: 0x7f7a8339e010
      Container manages memory: true
      Size: 16091136
      Capacity: 16091136

     Moving image = Image (0x555f749c8620)
  RTTI typeinfo:   itk::Image<double, 3u>
  Reference Count: 2
  Modified Time: 1667
  Debug: Off
  Object Name: 
  Observers: 
    none
  Source: (none)
  Source output name: (none)
  Release Data: Off
  Data Released: False
  Global Release Data: Off
  PipelineMTime: 0
  UpdateMTime: 1664
  RealTimeStamp: 0 seconds 
  LargestPossibleRegion: 
    Dimension: 3
    Index: [0, 0, 0]
    Size: [180, 210, 193]
  BufferedRegion: 
    Dimension: 3
    Index: [0, 0, 0]
    Size: [180, 210, 193]
  RequestedRegion: 
    Dimension: 3
    Index: [0, 0, 0]
    Size: [180, 210, 193]
  Spacing: [1, 1, 1]
  Origin: [87.842, 64.1179, -130.261]
  Direction: 
-0.999903 0.0136468 -0.00295056
-0.0139621 -0.977321 0.211304
-1.43862e-08 0.211325 0.977416

  IndexToPointMatrix: 
-0.999903 0.0136468 -0.00295056
-0.0139621 -0.977321 0.211304
-1.43862e-08 0.211325 0.977416

  PointToIndexMatrix: 
-0.999903 -0.0139621 -1.44406e-08
0.0136468 -0.977321 0.211325
-0.00295056 0.211304 0.977416

  Inverse Direction: 
-0.999903 -0.0139621 -1.44406e-08
0.0136468 -0.977321 0.211325
-0.00295056 0.211304 0.977416

  PixelContainer: 
    ImportImageContainer (0x555f749ca8c0)
      RTTI typeinfo:   itk::ImportImageContainer<unsigned long, double>
      Reference Count: 1
      Modified Time: 1661
      Debug: Off
      Object Name: 
      Observers: 
        none
      Pointer: 0x7f7a7fbf5010
      Container manages memory: true
      Size: 7295400
      Capacity: 7295400

     Weighting = 1
     Sampling strategy = regular
     Number of bins = 32
     Radius = 4
     Sampling percentage  = 0.25
   Transform = Rigid
     Gradient step = 0.1
     Update field sigma (voxel space) = 0
     Total field sigma (voxel space) = 0
     Update field time sigma = 0
     Total field time sigma  = 0
     Number of time indices = 0
     Number of time point samples = 0
Stage 2 State
   Image metric = Mattes
     Fixed image = Image (0x555f749d3910)
  RTTI typeinfo:   itk::Image<double, 3u>
  Reference Count: 2
  Modified Time: 1994
  Debug: Off
  Object Name: 
  Observers: 
    none
  Source: (none)
  Source output name: (none)
  Release Data: Off
  Data Released: False
  Global Release Data: Off
  PipelineMTime: 0
  UpdateMTime: 1829
  RealTimeStamp: 0 seconds 
  LargestPossibleRegion: 
    Dimension: 3
    Index: [0, 0, 0]
    Size: [216, 256, 291]
  BufferedRegion: 
    Dimension: 3
    Index: [0, 0, 0]
    Size: [216, 256, 291]
  RequestedRegion: 
    Dimension: 3
    Index: [0, 0, 0]
    Size: [216, 256, 291]
  Spacing: [1, 1, 1]
  Origin: [0, 293, 0]
  Direction: 
1 0 0
0 -0 -1
0 -1 -0

  IndexToPointMatrix: 
1 0 0
0 0 -1
0 -1 0

  PointToIndexMatrix: 
1 0 0
0 0 -1
0 -1 0

  Inverse Direction: 
1 0 0
0 0 -1
0 -1 0

  PixelContainer: 
    ImportImageContainer (0x555f749ca3a0)
      RTTI typeinfo:   itk::ImportImageContainer<unsigned long, double>
      Reference Count: 1
      Modified Time: 1826
      Debug: Off
      Object Name: 
      Observers: 
        none
      Pointer: 0x7f7a78130010
      Container manages memory: true
      Size: 16091136
      Capacity: 16091136

     Moving image = Image (0x555f749d9040)
  RTTI typeinfo:   itk::Image<double, 3u>
  Reference Count: 2
  Modified Time: 1995
  Debug: Off
  Object Name: 
  Observers: 
    none
  Source: (none)
  Source output name: (none)
  Release Data: Off
  Data Released: False
  Global Release Data: Off
  PipelineMTime: 0
  UpdateMTime: 1992
  RealTimeStamp: 0 seconds 
  LargestPossibleRegion: 
    Dimension: 3
    Index: [0, 0, 0]
    Size: [180, 210, 193]
  BufferedRegion: 
    Dimension: 3
    Index: [0, 0, 0]
    Size: [180, 210, 193]
  RequestedRegion: 
    Dimension: 3
    Index: [0, 0, 0]
    Size: [180, 210, 193]
  Spacing: [1, 1, 1]
  Origin: [87.842, 64.1179, -130.261]
  Direction: 
-0.999903 0.0136468 -0.00295056
-0.0139621 -0.977321 0.211304
-1.43862e-08 0.211325 0.977416

  IndexToPointMatrix: 
-0.999903 0.0136468 -0.00295056
-0.0139621 -0.977321 0.211304
-1.43862e-08 0.211325 0.977416

  PointToIndexMatrix: 
-0.999903 -0.0139621 -1.44406e-08
0.0136468 -0.977321 0.211325
-0.00295056 0.211304 0.977416

  Inverse Direction: 
-0.999903 -0.0139621 -1.44406e-08
0.0136468 -0.977321 0.211325
-0.00295056 0.211304 0.977416

  PixelContainer: 
    ImportImageContainer (0x555f749cc830)
      RTTI typeinfo:   itk::ImportImageContainer<unsigned long, double>
      Reference Count: 1
      Modified Time: 1989
      Debug: Off
      Object Name: 
      Observers: 
        none
      Pointer: 0x555f749dadd0
      Container manages memory: true
      Size: 7295400
      Capacity: 7295400

     Weighting = 1
     Sampling strategy = regular
     Number of bins = 32
     Radius = 4
     Sampling percentage  = 0.25
   Transform = Affine
     Gradient step = 0.1
     Update field sigma (voxel space) = 0
     Total field sigma (voxel space) = 0
     Update field time sigma = 0
     Total field time sigma  = 0
     Number of time indices = 0
     Number of time point samples = 0
Stage 3 State
   Image metric = CC
     Fixed image = Image (0x555f78183b20)
  RTTI typeinfo:   itk::Image<double, 3u>
  Reference Count: 2
  Modified Time: 2322
  Debug: Off
  Object Name: 
  Observers: 
    none
  Source: (none)
  Source output name: (none)
  Release Data: Off
  Data Released: False
  Global Release Data: Off
  PipelineMTime: 0
  UpdateMTime: 2157
  RealTimeStamp: 0 seconds 
  LargestPossibleRegion: 
    Dimension: 3
    Index: [0, 0, 0]
    Size: [216, 256, 291]
  BufferedRegion: 
    Dimension: 3
    Index: [0, 0, 0]
    Size: [216, 256, 291]
  RequestedRegion: 
    Dimension: 3
    Index: [0, 0, 0]
    Size: [216, 256, 291]
  Spacing: [1, 1, 1]
  Origin: [0, 293, 0]
  Direction: 
1 0 0
0 -0 -1
0 -1 -0

  IndexToPointMatrix: 
1 0 0
0 0 -1
0 -1 0

  PointToIndexMatrix: 
1 0 0
0 0 -1
0 -1 0

  Inverse Direction: 
1 0 0
0 0 -1
0 -1 0

  PixelContainer: 
    ImportImageContainer (0x555f749d68c0)
      RTTI typeinfo:   itk::ImportImageContainer<unsigned long, double>
      Reference Count: 1
      Modified Time: 2154
      Debug: Off
      Object Name: 
      Observers: 
        none
      Pointer: 0x7f7a7066b010
      Container manages memory: true
      Size: 16091136
      Capacity: 16091136

     Moving image = Image (0x555f78185b50)
  RTTI typeinfo:   itk::Image<double, 3u>
  Reference Count: 2
  Modified Time: 2323
  Debug: Off
  Object Name: 
  Observers: 
    none
  Source: (none)
  Source output name: (none)
  Release Data: Off
  Data Released: False
  Global Release Data: Off
  PipelineMTime: 0
  UpdateMTime: 2320
  RealTimeStamp: 0 seconds 
  LargestPossibleRegion: 
    Dimension: 3
    Index: [0, 0, 0]
    Size: [180, 210, 193]
  BufferedRegion: 
    Dimension: 3
    Index: [0, 0, 0]
    Size: [180, 210, 193]
  RequestedRegion: 
    Dimension: 3
    Index: [0, 0, 0]
    Size: [180, 210, 193]
  Spacing: [1, 1, 1]
  Origin: [87.842, 64.1179, -130.261]
  Direction: 
-0.999903 0.0136468 -0.00295056
-0.0139621 -0.977321 0.211304
-1.43862e-08 0.211325 0.977416

  IndexToPointMatrix: 
-0.999903 0.0136468 -0.00295056
-0.0139621 -0.977321 0.211304
-1.43862e-08 0.211325 0.977416

  PointToIndexMatrix: 
-0.999903 -0.0139621 -1.44406e-08
0.0136468 -0.977321 0.211325
-0.00295056 0.211304 0.977416

  Inverse Direction: 
-0.999903 -0.0139621 -1.44406e-08
0.0136468 -0.977321 0.211325
-0.00295056 0.211304 0.977416

  PixelContainer: 
    ImportImageContainer (0x555f749d72d0)
      RTTI typeinfo:   itk::ImportImageContainer<unsigned long, double>
      Reference Count: 1
      Modified Time: 2317
      Debug: Off
      Object Name: 
      Observers: 
        none
      Pointer: 0x555f78187f40
      Container manages memory: true
      Size: 7295400
      Capacity: 7295400

     Weighting = 0.5
     Sampling strategy = none
     Number of bins = 32
     Radius = 4
     Sampling percentage  = 1
   Transform = SyN
     Gradient step = 0.1
     Update field sigma (voxel space) = 3
     Total field sigma (voxel space) = 0
     Update field time sigma = 0
     Total field time sigma  = 0
     Number of time indices = 0
     Number of time point samples = 0
Registration using 3 total stages.

Stage 0
  iterations = 1000x500x250x100
  convergence threshold = 1e-08
  convergence window size = 10
  number of levels = 4
  using the Mattes MI metric (number of bins = 32, weight = 1)
  preprocessing:  winsorizing the image intensities
  preprocessing:  histogram matching the images
  Shrink factors (level 1 out of 4): [8, 8, 8]
  Shrink factors (level 2 out of 4): [4, 4, 4]
  Shrink factors (level 3 out of 4): [2, 2, 2]
  Shrink factors (level 4 out of 4): [1, 1, 1]
  smoothing sigmas per level: [4, 2, 1, 0]
  regular sampling (percentage = 0.25)

*** Running Euler3DTransform registration ***

DIAGNOSTIC,Iteration,metricValue,convergenceValue,ITERATION_TIME_INDEX,SINCE_LAST
 2DIAGNOSTIC,     1, -8.390079193686e-01, 1.797693134862e+308, 1.0528e+01, 1.0528e+01, 
 2DIAGNOSTIC,     2, -8.416054942921e-01, 1.797693134862e+308, 1.0541e+01, 1.2753e-02, 
 2DIAGNOSTIC,     3, -8.447614256525e-01, 1.797693134862e+308, 1.0554e+01, 1.2772e-02, 
