---------------------  Running antsBrainExtraction.sh on ood-47  ---------------------

--------------------------------------------------------------------------------------
 Bias correction of anatomical images (pre brain extraction)
   1) pre-process by truncating the image intensities
   2) run N4
--------------------------------------------------------------------------------------

BEGIN >>>>>>>>>>>>>>>>>>>>
/usr/lib/ants//ImageMath 3 /home/mpib/LNDG/StateSwitch/WIP_rest/preproc/B_data/D_preproc/2135/mri/t1/tempANTs/2135_t1_ANTsBET_N4Truncated0.nii.gz TruncateImageIntensity /home/mpib/LNDG/StateSwitch/WIP_rest/preproc/B_data/D_preproc/2135/mri/t1/2135_t1.nii.gz 0.01 0.999 256
END   <<<<<<<<<<<<<<<<<<<<


BEGIN >>>>>>>>>>>>>>>>>>>>
/usr/lib/ants//N4BiasFieldCorrection -d 3 -i /home/mpib/LNDG/StateSwitch/WIP_rest/preproc/B_data/D_preproc/2135/mri/t1/tempANTs/2135_t1_ANTsBET_N4Truncated0.nii.gz -s 4 -c [50x50x50x50,0.0000001] -b [200] -o /home/mpib/LNDG/StateSwitch/WIP_rest/preproc/B_data/D_preproc/2135/mri/t1/tempANTs/2135_t1_ANTsBET_N4Corrected0.nii.gz --verbose 1

Running N4 for 3-dimensional images.

Mask not read.  Using the entire image as the mask.

Specified spline distance: 200mm
  original image size:  [166, 206, 189]
  padded image size:  [201, 401, 201]
  number of control points:  [4, 5, 4]

Current level = 1
  Iteration 1 (of 50).   Current convergence value = 0.0001446 (threshold = 1e-07)
  Iteration 2 (of 50).   Current convergence value = 0.000131026 (threshold = 1e-07)
  Iteration 3 (of 50).   Current convergence value = 0.000121004 (threshold = 1e-07)
  Iteration 4 (of 50).   Current convergence value = 0.000111761 (threshold = 1e-07)
  Iteration 5 (of 50).   Current convergence value = 0.000104637 (threshold = 1e-07)
  Iteration 6 (of 50).   Current convergence value = 0.000100232 (threshold = 1e-07)
  Iteration 7 (of 50).   Current convergence value = 9.55836e-05 (threshold = 1e-07)
  Iteration 8 (of 50).   Current convergence value = 9.15036e-05 (threshold = 1e-07)
  Iteration 9 (of 50).   Current convergence value = 8.8736e-05 (threshold = 1e-07)
  Iteration 10 (of 50).   Current convergence value = 8.69192e-05 (threshold = 1e-07)
  Iteration 11 (of 50).   Current convergence value = 8.67274e-05 (threshold = 1e-07)
  Iteration 12 (of 50).   Current convergence value = 8.78889e-05 (threshold = 1e-07)
  Iteration 13 (of 50).   Current convergence value = 9.04908e-05 (threshold = 1e-07)
  Iteration 14 (of 50).   Current convergence value = 8.98841e-05 (threshold = 1e-07)
  Iteration 15 (of 50).   Current convergence value = 8.81057e-05 (threshold = 1e-07)
  Iteration 16 (of 50).   Current convergence value = 8.62716e-05 (threshold = 1e-07)
  Iteration 17 (of 50).   Current convergence value = 8.48054e-05 (threshold = 1e-07)
  Iteration 18 (of 50).   Current convergence value = 8.38735e-05 (threshold = 1e-07)
  Iteration 19 (of 50).   Current convergence value = 8.28532e-05 (threshold = 1e-07)
  Iteration 20 (of 50).   Current convergence value = 8.21301e-05 (threshold = 1e-07)
  Iteration 21 (of 50).   Current convergence value = 8.17325e-05 (threshold = 1e-07)
  Iteration 22 (of 50).   Current convergence value = 8.12796e-05 (threshold = 1e-07)
  Iteration 23 (of 50).   Current convergence value = 8.08379e-05 (threshold = 1e-07)
  Iteration 24 (of 50).   Current convergence value = 8.07722e-05 (threshold = 1e-07)
  Iteration 25 (of 50).   Current convergence value = 8.05098e-05 (threshold = 1e-07)
  Iteration 26 (of 50).   Current convergence value = 8.02989e-05 (threshold = 1e-07)
  Iteration 27 (of 50).   Current convergence value = 8.02346e-05 (threshold = 1e-07)
  Iteration 28 (of 50).   Current convergence value = 8.00936e-05 (threshold = 1e-07)
  Iteration 29 (of 50).   Current convergence value = 8.01471e-05 (threshold = 1e-07)
  Iteration 30 (of 50).   Current convergence value = 8.01593e-05 (threshold = 1e-07)
  Iteration 31 (of 50).   Current convergence value = 8.02427e-05 (threshold = 1e-07)
  Iteration 32 (of 50).   Current convergence value = 8.02897e-05 (threshold = 1e-07)
  Iteration 33 (of 50).   Current convergence value = 8.04279e-05 (threshold = 1e-07)
  Iteration 34 (of 50).   Current convergence value = 8.05731e-05 (threshold = 1e-07)
  Iteration 35 (of 50).   Current convergence value = 8.07839e-05 (threshold = 1e-07)
  Iteration 36 (of 50).   Current convergence value = 8.08791e-05 (threshold = 1e-07)
  Iteration 37 (of 50).   Current convergence value = 8.11802e-05 (threshold = 1e-07)
  Iteration 38 (of 50).   Current convergence value = 8.13593e-05 (threshold = 1e-07)
  Iteration 39 (of 50).   Current convergence value = 8.14669e-05 (threshold = 1e-07)
  Iteration 40 (of 50).   Current convergence value = 8.17922e-05 (threshold = 1e-07)
  Iteration 41 (of 50).   Current convergence value = 8.21078e-05 (threshold = 1e-07)
  Iteration 42 (of 50).   Current convergence value = 8.25838e-05 (threshold = 1e-07)
  Iteration 43 (of 50).   Current convergence value = 8.30907e-05 (threshold = 1e-07)
  Iteration 44 (of 50).   Current convergence value = 8.34474e-05 (threshold = 1e-07)
  Iteration 45 (of 50).   Current convergence value = 8.39406e-05 (threshold = 1e-07)
  Iteration 46 (of 50).   Current convergence value = 8.43733e-05 (threshold = 1e-07)
  Iteration 47 (of 50).   Current convergence value = 8.47356e-05 (threshold = 1e-07)
  Iteration 48 (of 50).   Current convergence value = 8.50757e-05 (threshold = 1e-07)
  Iteration 49 (of 50).   Current convergence value = 8.54532e-05 (threshold = 1e-07)
  Iteration 50 (of 50).   Current convergence value = 8.57556e-05 (threshold = 1e-07)
Current level = 2
  Iteration 1 (of 50).   Current convergence value = 0.000524184 (threshold = 1e-07)
  Iteration 2 (of 50).   Current convergence value = 0.000553045 (threshold = 1e-07)
  Iteration 3 (of 50).   Current convergence value = 0.000556905 (threshold = 1e-07)
  Iteration 4 (of 50).   Current convergence value = 0.000555742 (threshold = 1e-07)
  Iteration 5 (of 50).   Current convergence value = 0.000551532 (threshold = 1e-07)
  Iteration 6 (of 50).   Current convergence value = 0.000544383 (threshold = 1e-07)
  Iteration 7 (of 50).   Current convergence value = 0.000536713 (threshold = 1e-07)
  Iteration 8 (of 50).   Current convergence value = 0.00052791 (threshold = 1e-07)
  Iteration 9 (of 50).   Current convergence value = 0.00051944 (threshold = 1e-07)
  Iteration 10 (of 50).   Current convergence value = 0.000510514 (threshold = 1e-07)
  Iteration 11 (of 50).   Current convergence value = 0.000501879 (threshold = 1e-07)
  Iteration 12 (of 50).   Current convergence value = 0.00048429 (threshold = 1e-07)
  Iteration 13 (of 50).   Current convergence value = 0.000467289 (threshold = 1e-07)
  Iteration 14 (of 50).   Current convergence value = 0.000456257 (threshold = 1e-07)
  Iteration 15 (of 50).   Current convergence value = 0.000446174 (threshold = 1e-07)
  Iteration 16 (of 50).   Current convergence value = 0.000437297 (threshold = 1e-07)
  Iteration 17 (of 50).   Current convergence value = 0.000430094 (threshold = 1e-07)
  Iteration 18 (of 50).   Current convergence value = 0.000423258 (threshold = 1e-07)
  Iteration 19 (of 50).   Current convergence value = 0.000417024 (threshold = 1e-07)
  Iteration 20 (of 50).   Current convergence value = 0.000410385 (threshold = 1e-07)
  Iteration 21 (of 50).   Current convergence value = 0.000404343 (threshold = 1e-07)
  Iteration 22 (of 50).   Current convergence value = 0.000398471 (threshold = 1e-07)
  Iteration 23 (of 50).   Current convergence value = 0.000393162 (threshold = 1e-07)
  Iteration 24 (of 50).   Current convergence value = 0.00038857 (threshold = 1e-07)
  Iteration 25 (of 50).   Current convergence value = 0.000384244 (threshold = 1e-07)
  Iteration 26 (of 50).   Current convergence value = 0.000380712 (threshold = 1e-07)
  Iteration 27 (of 50).   Current convergence value = 0.000377383 (threshold = 1e-07)
  Iteration 28 (of 50).   Current convergence value = 0.000374576 (threshold = 1e-07)
  Iteration 29 (of 50).   Current convergence value = 0.000372221 (threshold = 1e-07)
  Iteration 30 (of 50).   Current convergence value = 0.000370504 (threshold = 1e-07)
  Iteration 31 (of 50).   Current convergence value = 0.000366805 (threshold = 1e-07)
  Iteration 32 (of 50).   Current convergence value = 0.000361949 (threshold = 1e-07)
  Iteration 33 (of 50).   Current convergence value = 0.000375918 (threshold = 1e-07)
  Iteration 34 (of 50).   Current convergence value = 0.000391475 (threshold = 1e-07)
  Iteration 35 (of 50).   Current convergence value = 0.000405515 (threshold = 1e-07)
  Iteration 36 (of 50).   Current convergence value = 0.000417016 (threshold = 1e-07)
  Iteration 37 (of 50).   Current convergence value = 0.000426155 (threshold = 1e-07)
  Iteration 38 (of 50).   Current convergence value = 0.000433283 (threshold = 1e-07)
  Iteration 39 (of 50).   Current convergence value = 0.000437644 (threshold = 1e-07)
  Iteration 40 (of 50).   Current convergence value = 0.000440837 (threshold = 1e-07)
  Iteration 41 (of 50).   Current convergence value = 0.000443301 (threshold = 1e-07)
  Iteration 42 (of 50).   Current convergence value = 0.000445166 (threshold = 1e-07)
  Iteration 43 (of 50).   Current convergence value = 0.000446844 (threshold = 1e-07)
  Iteration 44 (of 50).   Current convergence value = 0.000447826 (threshold = 1e-07)
  Iteration 45 (of 50).   Current convergence value = 0.000458748 (threshold = 1e-07)
  Iteration 46 (of 50).   Current convergence value = 0.000469093 (threshold = 1e-07)
  Iteration 47 (of 50).   Current convergence value = 0.000476641 (threshold = 1e-07)
  Iteration 48 (of 50).   Current convergence value = 0.000480773 (threshold = 1e-07)
  Iteration 49 (of 50).   Current convergence value = 0.000482546 (threshold = 1e-07)
  Iteration 50 (of 50).   Current convergence value = 0.000484639 (threshold = 1e-07)
Current level = 3
  Iteration 1 (of 50).   Current convergence value = 0.00123462 (threshold = 1e-07)
  Iteration 2 (of 50).   Current convergence value = 0.00120942 (threshold = 1e-07)
  Iteration 3 (of 50).   Current convergence value = 0.00120166 (threshold = 1e-07)
  Iteration 4 (of 50).   Current convergence value = 0.00120533 (threshold = 1e-07)
  Iteration 5 (of 50).   Current convergence value = 0.00120213 (threshold = 1e-07)
  Iteration 6 (of 50).   Current convergence value = 0.00119492 (threshold = 1e-07)
  Iteration 7 (of 50).   Current convergence value = 0.00119266 (threshold = 1e-07)
  Iteration 8 (of 50).   Current convergence value = 0.00123097 (threshold = 1e-07)
  Iteration 9 (of 50).   Current convergence value = 0.00127046 (threshold = 1e-07)
  Iteration 10 (of 50).   Current convergence value = 0.00130782 (threshold = 1e-07)
  Iteration 11 (of 50).   Current convergence value = 0.0013176 (threshold = 1e-07)
  Iteration 12 (of 50).   Current convergence value = 0.00121914 (threshold = 1e-07)
  Iteration 13 (of 50).   Current convergence value = 0.00118473 (threshold = 1e-07)
  Iteration 14 (of 50).   Current convergence value = 0.00114347 (threshold = 1e-07)
  Iteration 15 (of 50).   Current convergence value = 0.00114245 (threshold = 1e-07)
  Iteration 16 (of 50).   Current convergence value = 0.00114533 (threshold = 1e-07)
  Iteration 17 (of 50).   Current convergence value = 0.00113326 (threshold = 1e-07)
  Iteration 18 (of 50).   Current convergence value = 0.0011219 (threshold = 1e-07)
  Iteration 19 (of 50).   Current convergence value = 0.0011194 (threshold = 1e-07)
  Iteration 20 (of 50).   Current convergence value = 0.00112291 (threshold = 1e-07)
  Iteration 21 (of 50).   Current convergence value = 0.00116233 (threshold = 1e-07)
  Iteration 22 (of 50).   Current convergence value = 0.00117683 (threshold = 1e-07)
  Iteration 23 (of 50).   Current convergence value = 0.00119251 (threshold = 1e-07)
  Iteration 24 (of 50).   Current convergence value = 0.00122559 (threshold = 1e-07)
  Iteration 25 (of 50).   Current convergence value = 0.00122141 (threshold = 1e-07)
  Iteration 26 (of 50).   Current convergence value = 0.00118208 (threshold = 1e-07)
  Iteration 27 (of 50).   Current convergence value = 0.00117047 (threshold = 1e-07)
  Iteration 28 (of 50).   Current convergence value = 0.00117009 (threshold = 1e-07)
  Iteration 29 (of 50).   Current convergence value = 0.00116716 (threshold = 1e-07)
  Iteration 30 (of 50).   Current convergence value = 0.00113729 (threshold = 1e-07)
  Iteration 31 (of 50).   Current convergence value = 0.00111497 (threshold = 1e-07)
  Iteration 32 (of 50).   Current convergence value = 0.00110412 (threshold = 1e-07)
  Iteration 33 (of 50).   Current convergence value = 0.00106098 (threshold = 1e-07)
  Iteration 34 (of 50).   Current convergence value = 0.00106202 (threshold = 1e-07)
  Iteration 35 (of 50).   Current convergence value = 0.00106963 (threshold = 1e-07)
  Iteration 36 (of 50).   Current convergence value = 0.00110117 (threshold = 1e-07)
  Iteration 37 (of 50).   Current convergence value = 0.00110075 (threshold = 1e-07)
  Iteration 38 (of 50).   Current convergence value = 0.00110465 (threshold = 1e-07)
  Iteration 39 (of 50).   Current convergence value = 0.00110185 (threshold = 1e-07)
  Iteration 40 (of 50).   Current convergence value = 0.00110717 (threshold = 1e-07)
  Iteration 41 (of 50).   Current convergence value = 0.00111527 (threshold = 1e-07)
  Iteration 42 (of 50).   Current convergence value = 0.0011217 (threshold = 1e-07)
  Iteration 43 (of 50).   Current convergence value = 0.00112708 (threshold = 1e-07)
  Iteration 44 (of 50).   Current convergence value = 0.0011201 (threshold = 1e-07)
  Iteration 45 (of 50).   Current convergence value = 0.00110965 (threshold = 1e-07)
  Iteration 46 (of 50).   Current convergence value = 0.0011198 (threshold = 1e-07)
  Iteration 47 (of 50).   Current convergence value = 0.00114056 (threshold = 1e-07)
  Iteration 48 (of 50).   Current convergence value = 0.00112702 (threshold = 1e-07)
  Iteration 49 (of 50).   Current convergence value = 0.00113025 (threshold = 1e-07)
  Iteration 50 (of 50).   Current convergence value = 0.00113405 (threshold = 1e-07)
Current level = 4
  Iteration 1 (of 50).   Current convergence value = 0.00300081 (threshold = 1e-07)
  Iteration 2 (of 50).   Current convergence value = 0.00287422 (threshold = 1e-07)
  Iteration 3 (of 50).   Current convergence value = 0.00279543 (threshold = 1e-07)
  Iteration 4 (of 50).   Current convergence value = 0.00271206 (threshold = 1e-07)
  Iteration 5 (of 50).   Current convergence value = 0.00253221 (threshold = 1e-07)
  Iteration 6 (of 50).   Current convergence value = 0.00250123 (threshold = 1e-07)
  Iteration 7 (of 50).   Current convergence value = 0.00237188 (threshold = 1e-07)
  Iteration 8 (of 50).   Current convergence value = 0.00202546 (threshold = 1e-07)
  Iteration 9 (of 50).   Current convergence value = 0.00187142 (threshold = 1e-07)
  Iteration 10 (of 50).   Current convergence value = 0.00180008 (threshold = 1e-07)
  Iteration 11 (of 50).   Current convergence value = 0.00173727 (threshold = 1e-07)
  Iteration 12 (of 50).   Current convergence value = 0.00164009 (threshold = 1e-07)
  Iteration 13 (of 50).   Current convergence value = 0.00154014 (threshold = 1e-07)
  Iteration 14 (of 50).   Current convergence value = 0.00145386 (threshold = 1e-07)
  Iteration 15 (of 50).   Current convergence value = 0.00138311 (threshold = 1e-07)
  Iteration 16 (of 50).   Current convergence value = 0.00134239 (threshold = 1e-07)
  Iteration 17 (of 50).   Current convergence value = 0.00129569 (threshold = 1e-07)
  Iteration 18 (of 50).   Current convergence value = 0.0012602 (threshold = 1e-07)
  Iteration 19 (of 50).   Current convergence value = 0.00123505 (threshold = 1e-07)
  Iteration 20 (of 50).   Current convergence value = 0.00121846 (threshold = 1e-07)
  Iteration 21 (of 50).   Current convergence value = 0.00116782 (threshold = 1e-07)
  Iteration 22 (of 50).   Current convergence value = 0.00114833 (threshold = 1e-07)
  Iteration 23 (of 50).   Current convergence value = 0.00117163 (threshold = 1e-07)
  Iteration 24 (of 50).   Current convergence value = 0.0010821 (threshold = 1e-07)
  Iteration 25 (of 50).   Current convergence value = 0.00106541 (threshold = 1e-07)
  Iteration 26 (of 50).   Current convergence value = 0.00111173 (threshold = 1e-07)
  Iteration 27 (of 50).   Current convergence value = 0.00114278 (threshold = 1e-07)
  Iteration 28 (of 50).   Current convergence value = 0.00115998 (threshold = 1e-07)
  Iteration 29 (of 50).   Current convergence value = 0.00117006 (threshold = 1e-07)
  Iteration 30 (of 50).   Current convergence value = 0.00117762 (threshold = 1e-07)
  Iteration 31 (of 50).   Current convergence value = 0.00118592 (threshold = 1e-07)
  Iteration 32 (of 50).   Current convergence value = 0.00119432 (threshold = 1e-07)
  Iteration 33 (of 50).   Current convergence value = 0.00119233 (threshold = 1e-07)
  Iteration 34 (of 50).   Current convergence value = 0.00116347 (threshold = 1e-07)
  Iteration 35 (of 50).   Current convergence value = 0.00113773 (threshold = 1e-07)
  Iteration 36 (of 50).   Current convergence value = 0.00111637 (threshold = 1e-07)
  Iteration 37 (of 50).   Current convergence value = 0.00109613 (threshold = 1e-07)
  Iteration 38 (of 50).   Current convergence value = 0.0010763 (threshold = 1e-07)
  Iteration 39 (of 50).   Current convergence value = 0.00105905 (threshold = 1e-07)
  Iteration 40 (of 50).   Current convergence value = 0.00104599 (threshold = 1e-07)
  Iteration 41 (of 50).   Current convergence value = 0.00103584 (threshold = 1e-07)
  Iteration 42 (of 50).   Current convergence value = 0.00102893 (threshold = 1e-07)
  Iteration 43 (of 50).   Current convergence value = 0.00102414 (threshold = 1e-07)
  Iteration 44 (of 50).   Current convergence value = 0.00102228 (threshold = 1e-07)
  Iteration 45 (of 50).   Current convergence value = 0.00102259 (threshold = 1e-07)
  Iteration 46 (of 50).   Current convergence value = 0.00102472 (threshold = 1e-07)
  Iteration 47 (of 50).   Current convergence value = 0.00103056 (threshold = 1e-07)
  Iteration 48 (of 50).   Current convergence value = 0.00103566 (threshold = 1e-07)
  Iteration 49 (of 50).   Current convergence value = 0.00104265 (threshold = 1e-07)
  Iteration 50 (of 50).   Current convergence value = 0.00105059 (threshold = 1e-07)
   N4BiasFieldCorrectionImageFilter (0x560fe0670d30)
     RTTI typeinfo:   itk::N4BiasFieldCorrectionImageFilter<itk::Image<float, 3u>, itk::Image<float, 3u>, itk::Image<float, 3u> >
     Reference Count: 1
     Modified Time: 439
     Debug: Off
     Object Name: 
     Observers: 
       IterationEvent(Command)
     Inputs: 
       Primary: (0x560fe06805d0) *
       _1: (0x560fe067f2e0)
     Indexed Inputs: 
       0: Primary (0x560fe06805d0)
       1: _1 (0x560fe067f2e0)
     Required Input Names: Primary
     NumberOfRequiredInputs: 1
     Outputs: 
       Primary: (0x560fe0678e50)
     Indexed Outputs: 
       0: Primary (0x560fe0678e50)
     NumberOfRequiredOutputs: 1
     Number Of Threads: 20
     ReleaseDataFlag: Off
     ReleaseDataBeforeUpdateFlag: Off
     AbortGenerateData: Off
     Progress: 0
     Multithreader: 
       RTTI typeinfo:   itk::MultiThreader
       Reference Count: 1
       Modified Time: 132
       Debug: Off
       Object Name: 
       Observers: 
         none
       Thread Count: 20
       Global Maximum Number Of Threads: 128
       Global Default Number Of Threads: 20
     CoordinateTolerance: 1e-06
     DirectionTolerance: 1e-06
     Mask label: 1
     Number of histogram bins: 200
     Wiener filter noise: 0.01
     Bias field FWHM: 0.15
     Maximum number of iterations: [50, 50, 50, 50]
     Convergence threshold: 1e-07
     Spline order: 3
     Number of fitting levels: [4, 4, 4]
     Number of control points: [4, 5, 4]
     CurrentConvergenceMeasurement: 0.00105059
     CurrentLevel: 4
     ElapsedIterations: 51
     LogBiasFieldControlPointLattice: 
       Image (0x560fe067e8d0)
         RTTI typeinfo:   itk::Image<itk::Vector<float, 1u>, 3u>
         Reference Count: 1
         Modified Time: 230895894
         Debug: Off
         Object Name: 
         Observers: 
           none
         Source: (none)
         Source output name: (none)
         Release Data: Off
         Data Released: False
         Global Release Data: Off
         PipelineMTime: 0
         UpdateMTime: 0
         RealTimeStamp: 0 seconds 
         LargestPossibleRegion: 
           Dimension: 3
           Index: [0, 0, 0]
           Size: [11, 19, 11]
         BufferedRegion: 
           Dimension: 3
           Index: [0, 0, 0]
           Size: [11, 19, 11]
         RequestedRegion: 
           Dimension: 3
           Index: [0, 0, 0]
           Size: [11, 19, 11]
         Spacing: [24.5, 24.75, 24.5]
         Origin: [25.2772, 17.6705, -29.3578]
         Direction: 
-0.999657 -0.00668678 -0.0253085
-7.95591e-09 -0.966823 0.255446
-0.0261769 0.255358 0.966492

         IndexToPointMatrix: 
-24.4916 -0.165498 -0.620057
-1.9492e-07 -23.9289 6.25842
-0.641335 6.32012 23.6791

         PointToIndexMatrix: 
-0.0408023 -3.34167e-10 -0.00106845
-0.000270173 -0.0390636 0.0103175
-0.001033 0.0104264 0.0394487

         Inverse Direction: 
-0.999657 -8.1871e-09 -0.0261769
-0.00668678 -0.966823 0.255358
-0.0253085 0.255446 0.966492

         PixelContainer: 
           ImportImageContainer (0x560fe067e110)
             RTTI typeinfo:   itk::ImportImageContainer<unsigned long, itk::Vector<float, 1u> >
             Reference Count: 1
             Modified Time: 230895895
             Debug: Off
             Object Name: 
             Observers: 
               none
             Pointer: 0x560fe0cfa5e0
             Container manages memory: true
             Size: 2299
             Capacity: 2299
Elapsed time: 72.8684
END   <<<<<<<<<<<<<<<<<<<<



--------------------------------------------------------------------------------------
 Done with N4 correction (pre brain extraction):  0h 1m 21s
--------------------------------------------------------------------------------------


--------------------------------------------------------------------------------------
 Brain extraction using the following steps:
   1) Register /home/mpib/LNDG/StateSwitch/WIP_rest/preproc/B_data/C_standards/ANTS/MICCAI2012-Multi-Atlas-Challenge-Data/T_template0.nii.gz to /home/mpib/LNDG/StateSwitch/WIP_rest/preproc/B_data/D_preproc/2135/mri/t1/tempANTs/2135_t1_ANTsBET_N4Corrected0.nii.gz
   2) Warp /home/mpib/LNDG/StateSwitch/WIP_rest/preproc/B_data/C_standards/ANTS/MICCAI2012-Multi-Atlas-Challenge-Data/T_template0_BrainCerebellumProbabilityMask.nii.gz to /home/mpib/LNDG/StateSwitch/WIP_rest/preproc/B_data/D_preproc/2135/mri/t1/2135_t1.nii.gz using, from 1),
      /home/mpib/LNDG/StateSwitch/WIP_rest/preproc/B_data/D_preproc/2135/mri/t1/tempANTs/2135_t1_ANTsBET_BrainExtractionWarp/Affine
   3) Refine segmentation results using Atropos
--------------------------------------------------------------------------------------

BEGIN >>>>>>>>>>>>>>>>>>>>
/usr/lib/ants//ResampleImageBySpacing 3 /home/mpib/LNDG/StateSwitch/WIP_rest/preproc/B_data/C_standards/ANTS/MICCAI2012-Multi-Atlas-Challenge-Data/T_template0.nii.gz /home/mpib/LNDG/StateSwitch/WIP_rest/preproc/B_data/D_preproc/2135/mri/t1/tempANTs/2135_t1_ANTsBET_BrainExtractionInitialAffineFixed.nii.gz 4 4 4 1
 spacing [1, 1, 1] dim 3
 spacing2 [4, 4, 4]
 smoothing by : 3 dir 0
 smoothing by : 3 dir 1
 smoothing by : 3 dir 2
 out space [4, 4, 4]
 output size [54, 64, 72] spc [4, 4, 4]
END   <<<<<<<<<<<<<<<<<<<<


BEGIN >>>>>>>>>>>>>>>>>>>>
/usr/lib/ants//ResampleImageBySpacing 3 /home/mpib/LNDG/StateSwitch/WIP_rest/preproc/B_data/D_preproc/2135/mri/t1/tempANTs/2135_t1_ANTsBET_N4Corrected0.nii.gz /home/mpib/LNDG/StateSwitch/WIP_rest/preproc/B_data/D_preproc/2135/mri/t1/tempANTs/2135_t1_ANTsBET_BrainExtractionInitialAffineMoving.nii.gz 4 4 4 1
 spacing [1, 1, 1] dim 3
 spacing2 [4, 4, 4]
 smoothing by : 3 dir 0
 smoothing by : 3 dir 1
 smoothing by : 3 dir 2
 out space [4, 4, 4]
 output size [41, 51, 47] spc [4, 4, 4]
END   <<<<<<<<<<<<<<<<<<<<


BEGIN >>>>>>>>>>>>>>>>>>>>
/usr/lib/ants//ImageMath 3 /home/mpib/LNDG/StateSwitch/WIP_rest/preproc/B_data/D_preproc/2135/mri/t1/tempANTs/2135_t1_ANTsBET_BrainExtractionLaplacian.nii.gz Laplacian /home/mpib/LNDG/StateSwitch/WIP_rest/preproc/B_data/D_preproc/2135/mri/t1/tempANTs/2135_t1_ANTsBET_N4Corrected0.nii.gz 1.5 1
END   <<<<<<<<<<<<<<<<<<<<


BEGIN >>>>>>>>>>>>>>>>>>>>
/usr/lib/ants//ImageMath 3 /home/mpib/LNDG/StateSwitch/WIP_rest/preproc/B_data/D_preproc/2135/mri/t1/tempANTs/2135_t1_ANTsBET_BrainExtractionTemplateLaplacian.nii.gz Laplacian /home/mpib/LNDG/StateSwitch/WIP_rest/preproc/B_data/C_standards/ANTS/MICCAI2012-Multi-Atlas-Challenge-Data/T_template0.nii.gz 1.5 1
END   <<<<<<<<<<<<<<<<<<<<


BEGIN >>>>>>>>>>>>>>>>>>>>
/usr/lib/ants//antsAI -d 3 -v 1 -m Mattes[/home/mpib/LNDG/StateSwitch/WIP_rest/preproc/B_data/D_preproc/2135/mri/t1/tempANTs/2135_t1_ANTsBET_BrainExtractionInitialAffineFixed.nii.gz,/home/mpib/LNDG/StateSwitch/WIP_rest/preproc/B_data/D_preproc/2135/mri/t1/tempANTs/2135_t1_ANTsBET_BrainExtractionInitialAffineMoving.nii.gz,32,Regular,0.25] -t Affine[0.1] -s [15,0.1] -p 0 -c 10 -o /home/mpib/LNDG/StateSwitch/WIP_rest/preproc/B_data/D_preproc/2135/mri/t1/tempANTs/2135_t1_ANTsBET_BrainExtractionInitialAffine.mat -x //home/mpib/LNDG/StateSwitch/WIP_rest/preproc/B_data/C_standards/ANTS/MICCAI2012-Multi-Atlas-Challenge-Data/T_template0_BrainCerebellumRegistrationMask.nii.gz
Using the Mattes MI metric (number of bins = 32)
END   <<<<<<<<<<<<<<<<<<<<


BEGIN >>>>>>>>>>>>>>>>>>>>
/usr/lib/ants//antsRegistration -d 3 -u 1 -w [0.025,0.975] -o /home/mpib/LNDG/StateSwitch/WIP_rest/preproc/B_data/D_preproc/2135/mri/t1/tempANTs/2135_t1_ANTsBET_BrainExtractionPrior -r /home/mpib/LNDG/StateSwitch/WIP_rest/preproc/B_data/D_preproc/2135/mri/t1/tempANTs/2135_t1_ANTsBET_BrainExtractionInitialAffine.mat -z 1 --float 0 --verbose 1 -x [//home/mpib/LNDG/StateSwitch/WIP_rest/preproc/B_data/C_standards/ANTS/MICCAI2012-Multi-Atlas-Challenge-Data/T_template0_BrainCerebellumRegistrationMask.nii.gz] -m MI[/home/mpib/LNDG/StateSwitch/WIP_rest/preproc/B_data/C_standards/ANTS/MICCAI2012-Multi-Atlas-Challenge-Data/T_template0.nii.gz,/home/mpib/LNDG/StateSwitch/WIP_rest/preproc/B_data/D_preproc/2135/mri/t1/tempANTs/2135_t1_ANTsBET_N4Corrected0.nii.gz,1,32,Regular,0.25] -c [1000x500x250x100,1e-8,10] -t Rigid[0.1] -f 8x4x2x1 -s 4x2x1x0 -m MI[/home/mpib/LNDG/StateSwitch/WIP_rest/preproc/B_data/C_standards/ANTS/MICCAI2012-Multi-Atlas-Challenge-Data/T_template0.nii.gz,/home/mpib/LNDG/StateSwitch/WIP_rest/preproc/B_data/D_preproc/2135/mri/t1/tempANTs/2135_t1_ANTsBET_N4Corrected0.nii.gz,1,32,Regular,0.25] -c [1000x500x250x100,1e-8,10] -t Affine[0.1] -f 8x4x2x1 -s 4x2x1x0 -m CC[/home/mpib/LNDG/StateSwitch/WIP_rest/preproc/B_data/C_standards/ANTS/MICCAI2012-Multi-Atlas-Challenge-Data/T_template0.nii.gz,/home/mpib/LNDG/StateSwitch/WIP_rest/preproc/B_data/D_preproc/2135/mri/t1/tempANTs/2135_t1_ANTsBET_N4Corrected0.nii.gz,0.5,4] -m CC[/home/mpib/LNDG/StateSwitch/WIP_rest/preproc/B_data/D_preproc/2135/mri/t1/tempANTs/2135_t1_ANTsBET_BrainExtractionTemplateLaplacian.nii.gz,/home/mpib/LNDG/StateSwitch/WIP_rest/preproc/B_data/D_preproc/2135/mri/t1/tempANTs/2135_t1_ANTsBET_BrainExtractionLaplacian.nii.gz,0.5,4] -c [50x10x0,1e-9,15] -t SyN[0.1,3,0] -f 4x2x1 -s 2x1x0
All_Command_lines_OK
Using double precision for computations.
=============================================================================
The composite transform comprises the following transforms (in order): 
  1. /home/mpib/LNDG/StateSwitch/WIP_rest/preproc/B_data/D_preproc/2135/mri/t1/tempANTs/2135_t1_ANTsBET_BrainExtractionInitialAffine.mat (type = AffineTransform)
=============================================================================
  Reading mask(s).
    Registration stage 0
      Fixed mask = //home/mpib/LNDG/StateSwitch/WIP_rest/preproc/B_data/C_standards/ANTS/MICCAI2012-Multi-Atlas-Challenge-Data/T_template0_BrainCerebellumRegistrationMask.nii.gz
  number of levels = 4
  number of levels = 4
  number of levels = 3
  fixed image: /home/mpib/LNDG/StateSwitch/WIP_rest/preproc/B_data/C_standards/ANTS/MICCAI2012-Multi-Atlas-Challenge-Data/T_template0.nii.gz
  moving image: /home/mpib/LNDG/StateSwitch/WIP_rest/preproc/B_data/D_preproc/2135/mri/t1/tempANTs/2135_t1_ANTsBET_N4Corrected0.nii.gz
  fixed image: /home/mpib/LNDG/StateSwitch/WIP_rest/preproc/B_data/C_standards/ANTS/MICCAI2012-Multi-Atlas-Challenge-Data/T_template0.nii.gz
  moving image: /home/mpib/LNDG/StateSwitch/WIP_rest/preproc/B_data/D_preproc/2135/mri/t1/tempANTs/2135_t1_ANTsBET_N4Corrected0.nii.gz
  fixed image: /home/mpib/LNDG/StateSwitch/WIP_rest/preproc/B_data/C_standards/ANTS/MICCAI2012-Multi-Atlas-Challenge-Data/T_template0.nii.gz
  moving image: /home/mpib/LNDG/StateSwitch/WIP_rest/preproc/B_data/D_preproc/2135/mri/t1/tempANTs/2135_t1_ANTsBET_N4Corrected0.nii.gz
  fixed image: /home/mpib/LNDG/StateSwitch/WIP_rest/preproc/B_data/D_preproc/2135/mri/t1/tempANTs/2135_t1_ANTsBET_BrainExtractionTemplateLaplacian.nii.gz
  moving image: /home/mpib/LNDG/StateSwitch/WIP_rest/preproc/B_data/D_preproc/2135/mri/t1/tempANTs/2135_t1_ANTsBET_BrainExtractionLaplacian.nii.gz
Dimension = 3
Number of stages = 3
Use Histogram Matching true
Winsorize image intensities true
Lower quantile = 0.025
Upper quantile = 0.975
Stage 1 State
   Image metric = Mattes
     Fixed image = Image (0x55e11393c7e0)
  RTTI typeinfo:   itk::Image<double, 3u>
  Reference Count: 2
  Modified Time: 1666
  Debug: Off
  Object Name: 
  Observers: 
    none
  Source: (none)
  Source output name: (none)
  Release Data: Off
  Data Released: False
  Global Release Data: Off
  PipelineMTime: 0
  UpdateMTime: 1501
  RealTimeStamp: 0 seconds 
  LargestPossibleRegion: 
    Dimension: 3
    Index: [0, 0, 0]
    Size: [216, 256, 291]
  BufferedRegion: 
    Dimension: 3
    Index: [0, 0, 0]
    Size: [216, 256, 291]
  RequestedRegion: 
    Dimension: 3
    Index: [0, 0, 0]
    Size: [216, 256, 291]
  Spacing: [1, 1, 1]
  Origin: [0, 293, 0]
  Direction: 
1 0 0
0 -0 -1
0 -1 -0

  IndexToPointMatrix: 
1 0 0
0 0 -1
0 -1 0

  PointToIndexMatrix: 
1 0 0
0 0 -1
0 -1 0

  Inverse Direction: 
1 0 0
0 0 -1
0 -1 0

  PixelContainer: 
    ImportImageContainer (0x55e1139409d0)
      RTTI typeinfo:   itk::ImportImageContainer<unsigned long, double>
      Reference Count: 1
      Modified Time: 1498
      Debug: Off
      Object Name: 
      Observers: 
        none
      Pointer: 0x7fd772c1a010
      Container manages memory: true
      Size: 16091136
      Capacity: 16091136

     Moving image = Image (0x55e11393e620)
  RTTI typeinfo:   itk::Image<double, 3u>
  Reference Count: 2
  Modified Time: 1667
  Debug: Off
  Object Name: 
  Observers: 
    none
  Source: (none)
  Source output name: (none)
  Release Data: Off
  Data Released: False
  Global Release Data: Off
  PipelineMTime: 0
  UpdateMTime: 1664
  RealTimeStamp: 0 seconds 
  LargestPossibleRegion: 
    Dimension: 3
    Index: [0, 0, 0]
    Size: [166, 206, 189]
  BufferedRegion: 
    Dimension: 3
    Index: [0, 0, 0]
    Size: [166, 206, 189]
  RequestedRegion: 
    Dimension: 3
    Index: [0, 0, 0]
    Size: [166, 206, 189]
  Spacing: [1, 1, 1]
  Origin: [85.9975, 64.6477, -117.914]
  Direction: 
-0.999657 -0.00668678 -0.0253085
-7.95591e-09 -0.966823 0.255446
-0.0261769 0.255358 0.966492

  IndexToPointMatrix: 
-0.999657 -0.00668678 -0.0253085
-7.95591e-09 -0.966823 0.255446
-0.0261769 0.255358 0.966492

  PointToIndexMatrix: 
-0.999657 -8.1871e-09 -0.0261769
-0.00668678 -0.966823 0.255358
-0.0253085 0.255446 0.966492

  Inverse Direction: 
-0.999657 -8.1871e-09 -0.0261769
-0.00668678 -0.966823 0.255358
-0.0253085 0.255446 0.966492

  PixelContainer: 
    ImportImageContainer (0x55e1139408c0)
      RTTI typeinfo:   itk::ImportImageContainer<unsigned long, double>
      Reference Count: 1
      Modified Time: 1661
      Debug: Off
      Object Name: 
      Observers: 
        none
      Pointer: 0x7fd76faca010
      Container manages memory: true
      Size: 6463044
      Capacity: 6463044

     Weighting = 1
     Sampling strategy = regular
     Number of bins = 32
     Radius = 4
     Sampling percentage  = 0.25
   Transform = Rigid
     Gradient step = 0.1
     Update field sigma (voxel space) = 0
     Total field sigma (voxel space) = 0
     Update field time sigma = 0
     Total field time sigma  = 0
     Number of time indices = 0
     Number of time point samples = 0
Stage 2 State
   Image metric = Mattes
     Fixed image = Image (0x55e113949910)
  RTTI typeinfo:   itk::Image<double, 3u>
  Reference Count: 2
  Modified Time: 1994
  Debug: Off
  Object Name: 
  Observers: 
    none
  Source: (none)
  Source output name: (none)
  Release Data: Off
  Data Released: False
  Global Release Data: Off
  PipelineMTime: 0
  UpdateMTime: 1829
  RealTimeStamp: 0 seconds 
  LargestPossibleRegion: 
    Dimension: 3
    Index: [0, 0, 0]
    Size: [216, 256, 291]
  BufferedRegion: 
    Dimension: 3
    Index: [0, 0, 0]
    Size: [216, 256, 291]
  RequestedRegion: 
    Dimension: 3
    Index: [0, 0, 0]
    Size: [216, 256, 291]
  Spacing: [1, 1, 1]
  Origin: [0, 293, 0]
  Direction: 
1 0 0
0 -0 -1
0 -1 -0

  IndexToPointMatrix: 
1 0 0
0 0 -1
0 -1 0

  PointToIndexMatrix: 
1 0 0
0 0 -1
0 -1 0

  Inverse Direction: 
1 0 0
0 0 -1
0 -1 0

  PixelContainer: 
    ImportImageContainer (0x55e1139403a0)
      RTTI typeinfo:   itk::ImportImageContainer<unsigned long, double>
      Reference Count: 1
      Modified Time: 1826
      Debug: Off
      Object Name: 
      Observers: 
        none
      Pointer: 0x7fd768005010
      Container manages memory: true
      Size: 16091136
      Capacity: 16091136

     Moving image = Image (0x55e11394f040)
  RTTI typeinfo:   itk::Image<double, 3u>
  Reference Count: 2
  Modified Time: 1995
  Debug: Off
  Object Name: 
  Observers: 
    none
  Source: (none)
  Source output name: (none)
  Release Data: Off
  Data Released: False
  Global Release Data: Off
  PipelineMTime: 0
  UpdateMTime: 1992
  RealTimeStamp: 0 seconds 
  LargestPossibleRegion: 
    Dimension: 3
    Index: [0, 0, 0]
    Size: [166, 206, 189]
  BufferedRegion: 
    Dimension: 3
    Index: [0, 0, 0]
    Size: [166, 206, 189]
  RequestedRegion: 
    Dimension: 3
    Index: [0, 0, 0]
    Size: [166, 206, 189]
  Spacing: [1, 1, 1]
  Origin: [85.9975, 64.6477, -117.914]
  Direction: 
-0.999657 -0.00668678 -0.0253085
-7.95591e-09 -0.966823 0.255446
-0.0261769 0.255358 0.966492

  IndexToPointMatrix: 
-0.999657 -0.00668678 -0.0253085
-7.95591e-09 -0.966823 0.255446
-0.0261769 0.255358 0.966492

  PointToIndexMatrix: 
-0.999657 -8.1871e-09 -0.0261769
-0.00668678 -0.966823 0.255358
-0.0253085 0.255446 0.966492

  Inverse Direction: 
-0.999657 -8.1871e-09 -0.0261769
-0.00668678 -0.966823 0.255358
-0.0253085 0.255446 0.966492

  PixelContainer: 
    ImportImageContainer (0x55e113942830)
      RTTI typeinfo:   itk::ImportImageContainer<unsigned long, double>
      Reference Count: 1
      Modified Time: 1989
      Debug: Off
      Object Name: 
      Observers: 
        none
      Pointer: 0x55e113950dd0
      Container manages memory: true
      Size: 6463044
      Capacity: 6463044

     Weighting = 1
     Sampling strategy = regular
     Number of bins = 32
     Radius = 4
     Sampling percentage  = 0.25
   Transform = Affine
     Gradient step = 0.1
     Update field sigma (voxel space) = 0
     Total field sigma (voxel space) = 0
     Update field time sigma = 0
     Total field time sigma  = 0
     Number of time indices = 0
     Number of time point samples = 0
Stage 3 State
   Image metric = CC
     Fixed image = Image (0x55e116aa0000)
  RTTI typeinfo:   itk::Image<double, 3u>
  Reference Count: 2
  Modified Time: 2322
  Debug: Off
  Object Name: 
  Observers: 
    none
  Source: (none)
  Source output name: (none)
  Release Data: Off
  Data Released: False
  Global Release Data: Off
  PipelineMTime: 0
  UpdateMTime: 2157
  RealTimeStamp: 0 seconds 
  LargestPossibleRegion: 
    Dimension: 3
    Index: [0, 0, 0]
    Size: [216, 256, 291]
  BufferedRegion: 
    Dimension: 3
    Index: [0, 0, 0]
    Size: [216, 256, 291]
  RequestedRegion: 
    Dimension: 3
    Index: [0, 0, 0]
    Size: [216, 256, 291]
  Spacing: [1, 1, 1]
  Origin: [0, 293, 0]
  Direction: 
1 0 0
0 -0 -1
0 -1 -0

  IndexToPointMatrix: 
1 0 0
0 0 -1
0 -1 0

  PointToIndexMatrix: 
1 0 0
0 0 -1
0 -1 0

  Inverse Direction: 
1 0 0
0 0 -1
0 -1 0

  PixelContainer: 
    ImportImageContainer (0x55e11394c8c0)
      RTTI typeinfo:   itk::ImportImageContainer<unsigned long, double>
      Reference Count: 1
      Modified Time: 2154
      Debug: Off
      Object Name: 
      Observers: 
        none
      Pointer: 0x7fd760540010
      Container manages memory: true
      Size: 16091136
      Capacity: 16091136

     Moving image = Image (0x55e116aa2030)
  RTTI typeinfo:   itk::Image<double, 3u>
  Reference Count: 2
  Modified Time: 2323
  Debug: Off
  Object Name: 
  Observers: 
    none
  Source: (none)
  Source output name: (none)
  Release Data: Off
  Data Released: False
  Global Release Data: Off
  PipelineMTime: 0
  UpdateMTime: 2320
  RealTimeStamp: 0 seconds 
  LargestPossibleRegion: 
    Dimension: 3
    Index: [0, 0, 0]
    Size: [166, 206, 189]
  BufferedRegion: 
    Dimension: 3
    Index: [0, 0, 0]
    Size: [166, 206, 189]
  RequestedRegion: 
    Dimension: 3
    Index: [0, 0, 0]
    Size: [166, 206, 189]
  Spacing: [1, 1, 1]
  Origin: [85.9975, 64.6477, -117.914]
  Direction: 
-0.999657 -0.00668678 -0.0253085
-7.95591e-09 -0.966823 0.255446
-0.0261769 0.255358 0.966492

  IndexToPointMatrix: 
-0.999657 -0.00668678 -0.0253085
-7.95591e-09 -0.966823 0.255446
-0.0261769 0.255358 0.966492

  PointToIndexMatrix: 
-0.999657 -8.1871e-09 -0.0261769
-0.00668678 -0.966823 0.255358
-0.0253085 0.255446 0.966492

  Inverse Direction: 
-0.999657 -8.1871e-09 -0.0261769
-0.00668678 -0.966823 0.255358
-0.0253085 0.255446 0.966492

  PixelContainer: 
    ImportImageContainer (0x55e11394d2d0)
      RTTI typeinfo:   itk::ImportImageContainer<unsigned long, double>
      Reference Count: 1
      Modified Time: 2317
      Debug: Off
      Object Name: 
      Observers: 
        none
      Pointer: 0x55e116aa4420
      Container manages memory: true
      Size: 6463044
      Capacity: 6463044

     Weighting = 0.5
     Sampling strategy = none
     Number of bins = 32
     Radius = 4
     Sampling percentage  = 1
   Transform = SyN
     Gradient step = 0.1
     Update field sigma (voxel space) = 3
     Total field sigma (voxel space) = 0
     Update field time sigma = 0
     Total field time sigma  = 0
     Number of time indices = 0
     Number of time point samples = 0
Registration using 3 total stages.

Stage 0
  iterations = 1000x500x250x100
  convergence threshold = 1e-08
  convergence window size = 10
  number of levels = 4
  using the Mattes MI metric (number of bins = 32, weight = 1)
  preprocessing:  winsorizing the image intensities
  preprocessing:  histogram matching the images
  Shrink factors (level 1 out of 4): [8, 8, 8]
  Shrink factors (level 2 out of 4): [4, 4, 4]
  Shrink factors (level 3 out of 4): [2, 2, 2]
  Shrink factors (level 4 out of 4): [1, 1, 1]
  smoothing sigmas per level: [4, 2, 1, 0]
  regular sampling (percentage = 0.25)

*** Running Euler3DTransform registration ***

DIAGNOSTIC,Iteration,metricValue,convergenceValue,ITERATION_TIME_INDEX,SINCE_LAST
 2DIAGNOSTIC,     1, -8.425028916567e-01, 1.797693134862e+308, 9.4613e+00, 9.4613e+00, 
 2DIAGNOSTIC,     2, -8.448409050511e-01, 1.797693134862e+308, 9.4717e+00, 1.0393e-02, 
 2DIAGNOSTIC,     3, -8.464912358440e-01, 1.797693134862e+308, 9.4821e+00, 1.0479e-02, 
 2DIAGNOSTIC,     4, -8.485971075663e-01, 1.797693134862e+308, 9.4926e+00, 1.0489e-02, 
