---------------------  Running antsBrainExtraction.sh on ood-26  ---------------------

--------------------------------------------------------------------------------------
 Bias correction of anatomical images (pre brain extraction)
   1) pre-process by truncating the image intensities
   2) run N4
--------------------------------------------------------------------------------------

BEGIN >>>>>>>>>>>>>>>>>>>>
/usr/lib/ants//ImageMath 3 /home/mpib/LNDG/StateSwitch/WIP_rest/preproc/B_data/D_preproc/2216/mri/t1/tempANTs/2216_t1_ANTsBET_N4Truncated0.nii.gz TruncateImageIntensity /home/mpib/LNDG/StateSwitch/WIP_rest/preproc/B_data/D_preproc/2216/mri/t1/2216_t1.nii.gz 0.01 0.999 256
END   <<<<<<<<<<<<<<<<<<<<


BEGIN >>>>>>>>>>>>>>>>>>>>
/usr/lib/ants//N4BiasFieldCorrection -d 3 -i /home/mpib/LNDG/StateSwitch/WIP_rest/preproc/B_data/D_preproc/2216/mri/t1/tempANTs/2216_t1_ANTsBET_N4Truncated0.nii.gz -s 4 -c [50x50x50x50,0.0000001] -b [200] -o /home/mpib/LNDG/StateSwitch/WIP_rest/preproc/B_data/D_preproc/2216/mri/t1/tempANTs/2216_t1_ANTsBET_N4Corrected0.nii.gz --verbose 1

Running N4 for 3-dimensional images.

Mask not read.  Using the entire image as the mask.

Specified spline distance: 200mm
  original image size:  [162, 192, 168]
  padded image size:  [201, 201, 201]
  number of control points:  [4, 4, 4]

Current level = 1
  Iteration 1 (of 50).   Current convergence value = 0.000142197 (threshold = 1e-07)
  Iteration 2 (of 50).   Current convergence value = 0.000120174 (threshold = 1e-07)
  Iteration 3 (of 50).   Current convergence value = 0.000105056 (threshold = 1e-07)
  Iteration 4 (of 50).   Current convergence value = 9.188e-05 (threshold = 1e-07)
  Iteration 5 (of 50).   Current convergence value = 8.04666e-05 (threshold = 1e-07)
  Iteration 6 (of 50).   Current convergence value = 7.17148e-05 (threshold = 1e-07)
  Iteration 7 (of 50).   Current convergence value = 6.58096e-05 (threshold = 1e-07)
  Iteration 8 (of 50).   Current convergence value = 6.14766e-05 (threshold = 1e-07)
  Iteration 9 (of 50).   Current convergence value = 5.84581e-05 (threshold = 1e-07)
  Iteration 10 (of 50).   Current convergence value = 5.66459e-05 (threshold = 1e-07)
  Iteration 11 (of 50).   Current convergence value = 5.58243e-05 (threshold = 1e-07)
  Iteration 12 (of 50).   Current convergence value = 5.59117e-05 (threshold = 1e-07)
  Iteration 13 (of 50).   Current convergence value = 5.65361e-05 (threshold = 1e-07)
  Iteration 14 (of 50).   Current convergence value = 5.74634e-05 (threshold = 1e-07)
  Iteration 15 (of 50).   Current convergence value = 5.87034e-05 (threshold = 1e-07)
  Iteration 16 (of 50).   Current convergence value = 6.00897e-05 (threshold = 1e-07)
  Iteration 17 (of 50).   Current convergence value = 6.1677e-05 (threshold = 1e-07)
  Iteration 18 (of 50).   Current convergence value = 6.30687e-05 (threshold = 1e-07)
  Iteration 19 (of 50).   Current convergence value = 6.44452e-05 (threshold = 1e-07)
  Iteration 20 (of 50).   Current convergence value = 6.59044e-05 (threshold = 1e-07)
  Iteration 21 (of 50).   Current convergence value = 6.69624e-05 (threshold = 1e-07)
  Iteration 22 (of 50).   Current convergence value = 6.81438e-05 (threshold = 1e-07)
  Iteration 23 (of 50).   Current convergence value = 6.92964e-05 (threshold = 1e-07)
  Iteration 24 (of 50).   Current convergence value = 7.03282e-05 (threshold = 1e-07)
  Iteration 25 (of 50).   Current convergence value = 7.12478e-05 (threshold = 1e-07)
  Iteration 26 (of 50).   Current convergence value = 7.07821e-05 (threshold = 1e-07)
  Iteration 27 (of 50).   Current convergence value = 6.99104e-05 (threshold = 1e-07)
  Iteration 28 (of 50).   Current convergence value = 6.91417e-05 (threshold = 1e-07)
  Iteration 29 (of 50).   Current convergence value = 6.79568e-05 (threshold = 1e-07)
  Iteration 30 (of 50).   Current convergence value = 6.69526e-05 (threshold = 1e-07)
  Iteration 31 (of 50).   Current convergence value = 6.58335e-05 (threshold = 1e-07)
  Iteration 32 (of 50).   Current convergence value = 6.46496e-05 (threshold = 1e-07)
  Iteration 33 (of 50).   Current convergence value = 6.33771e-05 (threshold = 1e-07)
  Iteration 34 (of 50).   Current convergence value = 6.24252e-05 (threshold = 1e-07)
  Iteration 35 (of 50).   Current convergence value = 6.12808e-05 (threshold = 1e-07)
  Iteration 36 (of 50).   Current convergence value = 6.02675e-05 (threshold = 1e-07)
  Iteration 37 (of 50).   Current convergence value = 5.92466e-05 (threshold = 1e-07)
  Iteration 38 (of 50).   Current convergence value = 5.84369e-05 (threshold = 1e-07)
  Iteration 39 (of 50).   Current convergence value = 5.74266e-05 (threshold = 1e-07)
  Iteration 40 (of 50).   Current convergence value = 5.64601e-05 (threshold = 1e-07)
  Iteration 41 (of 50).   Current convergence value = 5.56458e-05 (threshold = 1e-07)
  Iteration 42 (of 50).   Current convergence value = 5.49321e-05 (threshold = 1e-07)
  Iteration 43 (of 50).   Current convergence value = 5.40181e-05 (threshold = 1e-07)
  Iteration 44 (of 50).   Current convergence value = 5.31946e-05 (threshold = 1e-07)
  Iteration 45 (of 50).   Current convergence value = 5.25439e-05 (threshold = 1e-07)
  Iteration 46 (of 50).   Current convergence value = 5.18752e-05 (threshold = 1e-07)
  Iteration 47 (of 50).   Current convergence value = 5.11099e-05 (threshold = 1e-07)
  Iteration 48 (of 50).   Current convergence value = 5.0424e-05 (threshold = 1e-07)
  Iteration 49 (of 50).   Current convergence value = 4.98042e-05 (threshold = 1e-07)
  Iteration 50 (of 50).   Current convergence value = 4.91023e-05 (threshold = 1e-07)
Current level = 2
  Iteration 1 (of 50).   Current convergence value = 0.00037213 (threshold = 1e-07)
  Iteration 2 (of 50).   Current convergence value = 0.000344555 (threshold = 1e-07)
  Iteration 3 (of 50).   Current convergence value = 0.00032701 (threshold = 1e-07)
  Iteration 4 (of 50).   Current convergence value = 0.000314888 (threshold = 1e-07)
  Iteration 5 (of 50).   Current convergence value = 0.000305116 (threshold = 1e-07)
  Iteration 6 (of 50).   Current convergence value = 0.000298355 (threshold = 1e-07)
  Iteration 7 (of 50).   Current convergence value = 0.000293901 (threshold = 1e-07)
  Iteration 8 (of 50).   Current convergence value = 0.000291261 (threshold = 1e-07)
  Iteration 9 (of 50).   Current convergence value = 0.000290202 (threshold = 1e-07)
  Iteration 10 (of 50).   Current convergence value = 0.000290465 (threshold = 1e-07)
  Iteration 11 (of 50).   Current convergence value = 0.000291669 (threshold = 1e-07)
  Iteration 12 (of 50).   Current convergence value = 0.000293344 (threshold = 1e-07)
  Iteration 13 (of 50).   Current convergence value = 0.000295854 (threshold = 1e-07)
  Iteration 14 (of 50).   Current convergence value = 0.000297479 (threshold = 1e-07)
  Iteration 15 (of 50).   Current convergence value = 0.000293413 (threshold = 1e-07)
  Iteration 16 (of 50).   Current convergence value = 0.00028578 (threshold = 1e-07)
  Iteration 17 (of 50).   Current convergence value = 0.000280973 (threshold = 1e-07)
  Iteration 18 (of 50).   Current convergence value = 0.000278254 (threshold = 1e-07)
  Iteration 19 (of 50).   Current convergence value = 0.000276889 (threshold = 1e-07)
  Iteration 20 (of 50).   Current convergence value = 0.000276574 (threshold = 1e-07)
  Iteration 21 (of 50).   Current convergence value = 0.000277047 (threshold = 1e-07)
  Iteration 22 (of 50).   Current convergence value = 0.000278472 (threshold = 1e-07)
  Iteration 23 (of 50).   Current convergence value = 0.000278515 (threshold = 1e-07)
  Iteration 24 (of 50).   Current convergence value = 0.000277694 (threshold = 1e-07)
  Iteration 25 (of 50).   Current convergence value = 0.000285058 (threshold = 1e-07)
  Iteration 26 (of 50).   Current convergence value = 0.00029294 (threshold = 1e-07)
  Iteration 27 (of 50).   Current convergence value = 0.000300563 (threshold = 1e-07)
  Iteration 28 (of 50).   Current convergence value = 0.000307405 (threshold = 1e-07)
  Iteration 29 (of 50).   Current convergence value = 0.000313412 (threshold = 1e-07)
  Iteration 30 (of 50).   Current convergence value = 0.000317247 (threshold = 1e-07)
  Iteration 31 (of 50).   Current convergence value = 0.000321437 (threshold = 1e-07)
  Iteration 32 (of 50).   Current convergence value = 0.000325051 (threshold = 1e-07)
  Iteration 33 (of 50).   Current convergence value = 0.000328025 (threshold = 1e-07)
  Iteration 34 (of 50).   Current convergence value = 0.000330133 (threshold = 1e-07)
  Iteration 35 (of 50).   Current convergence value = 0.000332269 (threshold = 1e-07)
  Iteration 36 (of 50).   Current convergence value = 0.000333455 (threshold = 1e-07)
  Iteration 37 (of 50).   Current convergence value = 0.000334902 (threshold = 1e-07)
  Iteration 38 (of 50).   Current convergence value = 0.000335603 (threshold = 1e-07)
  Iteration 39 (of 50).   Current convergence value = 0.000325129 (threshold = 1e-07)
  Iteration 40 (of 50).   Current convergence value = 0.000310092 (threshold = 1e-07)
  Iteration 41 (of 50).   Current convergence value = 0.000297313 (threshold = 1e-07)
  Iteration 42 (of 50).   Current convergence value = 0.000286144 (threshold = 1e-07)
  Iteration 43 (of 50).   Current convergence value = 0.000276725 (threshold = 1e-07)
  Iteration 44 (of 50).   Current convergence value = 0.000268692 (threshold = 1e-07)
  Iteration 45 (of 50).   Current convergence value = 0.000260903 (threshold = 1e-07)
  Iteration 46 (of 50).   Current convergence value = 0.0002542 (threshold = 1e-07)
  Iteration 47 (of 50).   Current convergence value = 0.000248344 (threshold = 1e-07)
  Iteration 48 (of 50).   Current convergence value = 0.000243162 (threshold = 1e-07)
  Iteration 49 (of 50).   Current convergence value = 0.000238913 (threshold = 1e-07)
  Iteration 50 (of 50).   Current convergence value = 0.000235391 (threshold = 1e-07)
Current level = 3
  Iteration 1 (of 50).   Current convergence value = 0.00119985 (threshold = 1e-07)
  Iteration 2 (of 50).   Current convergence value = 0.00119878 (threshold = 1e-07)
  Iteration 3 (of 50).   Current convergence value = 0.00121828 (threshold = 1e-07)
  Iteration 4 (of 50).   Current convergence value = 0.00124713 (threshold = 1e-07)
  Iteration 5 (of 50).   Current convergence value = 0.00127272 (threshold = 1e-07)
  Iteration 6 (of 50).   Current convergence value = 0.00126455 (threshold = 1e-07)
  Iteration 7 (of 50).   Current convergence value = 0.00121041 (threshold = 1e-07)
  Iteration 8 (of 50).   Current convergence value = 0.00106329 (threshold = 1e-07)
  Iteration 9 (of 50).   Current convergence value = 0.00100175 (threshold = 1e-07)
  Iteration 10 (of 50).   Current convergence value = 0.000981031 (threshold = 1e-07)
  Iteration 11 (of 50).   Current convergence value = 0.000964618 (threshold = 1e-07)
  Iteration 12 (of 50).   Current convergence value = 0.00094935 (threshold = 1e-07)
  Iteration 13 (of 50).   Current convergence value = 0.000936473 (threshold = 1e-07)
  Iteration 14 (of 50).   Current convergence value = 0.000936196 (threshold = 1e-07)
  Iteration 15 (of 50).   Current convergence value = 0.000948455 (threshold = 1e-07)
  Iteration 16 (of 50).   Current convergence value = 0.000973011 (threshold = 1e-07)
  Iteration 17 (of 50).   Current convergence value = 0.00101259 (threshold = 1e-07)
  Iteration 18 (of 50).   Current convergence value = 0.0010656 (threshold = 1e-07)
  Iteration 19 (of 50).   Current convergence value = 0.0011354 (threshold = 1e-07)
  Iteration 20 (of 50).   Current convergence value = 0.00120284 (threshold = 1e-07)
  Iteration 21 (of 50).   Current convergence value = 0.00125172 (threshold = 1e-07)
  Iteration 22 (of 50).   Current convergence value = 0.00128376 (threshold = 1e-07)
  Iteration 23 (of 50).   Current convergence value = 0.00108069 (threshold = 1e-07)
  Iteration 24 (of 50).   Current convergence value = 0.000962619 (threshold = 1e-07)
  Iteration 25 (of 50).   Current convergence value = 0.000914082 (threshold = 1e-07)
  Iteration 26 (of 50).   Current convergence value = 0.000885329 (threshold = 1e-07)
  Iteration 27 (of 50).   Current convergence value = 0.000861678 (threshold = 1e-07)
  Iteration 28 (of 50).   Current convergence value = 0.000853144 (threshold = 1e-07)
  Iteration 29 (of 50).   Current convergence value = 0.000851125 (threshold = 1e-07)
  Iteration 30 (of 50).   Current convergence value = 0.000859099 (threshold = 1e-07)
  Iteration 31 (of 50).   Current convergence value = 0.000877908 (threshold = 1e-07)
  Iteration 32 (of 50).   Current convergence value = 0.000923028 (threshold = 1e-07)
  Iteration 33 (of 50).   Current convergence value = 0.000989168 (threshold = 1e-07)
  Iteration 34 (of 50).   Current convergence value = 0.00107238 (threshold = 1e-07)
  Iteration 35 (of 50).   Current convergence value = 0.00115484 (threshold = 1e-07)
  Iteration 36 (of 50).   Current convergence value = 0.0012142 (threshold = 1e-07)
  Iteration 37 (of 50).   Current convergence value = 0.00113786 (threshold = 1e-07)
  Iteration 38 (of 50).   Current convergence value = 0.00102684 (threshold = 1e-07)
  Iteration 39 (of 50).   Current convergence value = 0.000915353 (threshold = 1e-07)
  Iteration 40 (of 50).   Current convergence value = 0.000866864 (threshold = 1e-07)
  Iteration 41 (of 50).   Current convergence value = 0.000861147 (threshold = 1e-07)
  Iteration 42 (of 50).   Current convergence value = 0.000862756 (threshold = 1e-07)
  Iteration 43 (of 50).   Current convergence value = 0.000869599 (threshold = 1e-07)
  Iteration 44 (of 50).   Current convergence value = 0.000896608 (threshold = 1e-07)
  Iteration 45 (of 50).   Current convergence value = 0.000928503 (threshold = 1e-07)
  Iteration 46 (of 50).   Current convergence value = 0.000964904 (threshold = 1e-07)
  Iteration 47 (of 50).   Current convergence value = 0.00100197 (threshold = 1e-07)
  Iteration 48 (of 50).   Current convergence value = 0.00106359 (threshold = 1e-07)
  Iteration 49 (of 50).   Current convergence value = 0.00107993 (threshold = 1e-07)
  Iteration 50 (of 50).   Current convergence value = 0.000970005 (threshold = 1e-07)
Current level = 4
  Iteration 1 (of 50).   Current convergence value = 0.00294122 (threshold = 1e-07)
  Iteration 2 (of 50).   Current convergence value = 0.00285536 (threshold = 1e-07)
  Iteration 3 (of 50).   Current convergence value = 0.00281027 (threshold = 1e-07)
  Iteration 4 (of 50).   Current convergence value = 0.00272332 (threshold = 1e-07)
  Iteration 5 (of 50).   Current convergence value = 0.00230729 (threshold = 1e-07)
  Iteration 6 (of 50).   Current convergence value = 0.00215203 (threshold = 1e-07)
  Iteration 7 (of 50).   Current convergence value = 0.00208112 (threshold = 1e-07)
  Iteration 8 (of 50).   Current convergence value = 0.00178086 (threshold = 1e-07)
  Iteration 9 (of 50).   Current convergence value = 0.00153622 (threshold = 1e-07)
  Iteration 10 (of 50).   Current convergence value = 0.00140777 (threshold = 1e-07)
  Iteration 11 (of 50).   Current convergence value = 0.00133192 (threshold = 1e-07)
  Iteration 12 (of 50).   Current convergence value = 0.00132318 (threshold = 1e-07)
  Iteration 13 (of 50).   Current convergence value = 0.00116166 (threshold = 1e-07)
  Iteration 14 (of 50).   Current convergence value = 0.00107438 (threshold = 1e-07)
  Iteration 15 (of 50).   Current convergence value = 0.000948573 (threshold = 1e-07)
  Iteration 16 (of 50).   Current convergence value = 0.000882287 (threshold = 1e-07)
  Iteration 17 (of 50).   Current convergence value = 0.000860389 (threshold = 1e-07)
  Iteration 18 (of 50).   Current convergence value = 0.000811392 (threshold = 1e-07)
  Iteration 19 (of 50).   Current convergence value = 0.000770286 (threshold = 1e-07)
  Iteration 20 (of 50).   Current convergence value = 0.00068641 (threshold = 1e-07)
  Iteration 21 (of 50).   Current convergence value = 0.000707171 (threshold = 1e-07)
  Iteration 22 (of 50).   Current convergence value = 0.000691158 (threshold = 1e-07)
  Iteration 23 (of 50).   Current convergence value = 0.000670078 (threshold = 1e-07)
  Iteration 24 (of 50).   Current convergence value = 0.000648995 (threshold = 1e-07)
  Iteration 25 (of 50).   Current convergence value = 0.000637963 (threshold = 1e-07)
  Iteration 26 (of 50).   Current convergence value = 0.000643679 (threshold = 1e-07)
  Iteration 27 (of 50).   Current convergence value = 0.000578081 (threshold = 1e-07)
  Iteration 28 (of 50).   Current convergence value = 0.000521997 (threshold = 1e-07)
  Iteration 29 (of 50).   Current convergence value = 0.000486164 (threshold = 1e-07)
  Iteration 30 (of 50).   Current convergence value = 0.000470379 (threshold = 1e-07)
  Iteration 31 (of 50).   Current convergence value = 0.000477789 (threshold = 1e-07)
  Iteration 32 (of 50).   Current convergence value = 0.000508421 (threshold = 1e-07)
  Iteration 33 (of 50).   Current convergence value = 0.000555688 (threshold = 1e-07)
  Iteration 34 (of 50).   Current convergence value = 0.000602954 (threshold = 1e-07)
  Iteration 35 (of 50).   Current convergence value = 0.000596801 (threshold = 1e-07)
  Iteration 36 (of 50).   Current convergence value = 0.000552603 (threshold = 1e-07)
  Iteration 37 (of 50).   Current convergence value = 0.000518709 (threshold = 1e-07)
  Iteration 38 (of 50).   Current convergence value = 0.000436454 (threshold = 1e-07)
  Iteration 39 (of 50).   Current convergence value = 0.000404944 (threshold = 1e-07)
  Iteration 40 (of 50).   Current convergence value = 0.000412248 (threshold = 1e-07)
  Iteration 41 (of 50).   Current convergence value = 0.00041837 (threshold = 1e-07)
  Iteration 42 (of 50).   Current convergence value = 0.000419477 (threshold = 1e-07)
  Iteration 43 (of 50).   Current convergence value = 0.000416445 (threshold = 1e-07)
  Iteration 44 (of 50).   Current convergence value = 0.000409681 (threshold = 1e-07)
  Iteration 45 (of 50).   Current convergence value = 0.00040091 (threshold = 1e-07)
  Iteration 46 (of 50).   Current convergence value = 0.000391878 (threshold = 1e-07)
  Iteration 47 (of 50).   Current convergence value = 0.000381693 (threshold = 1e-07)
  Iteration 48 (of 50).   Current convergence value = 0.000372477 (threshold = 1e-07)
  Iteration 49 (of 50).   Current convergence value = 0.000362677 (threshold = 1e-07)
  Iteration 50 (of 50).   Current convergence value = 0.00035388 (threshold = 1e-07)
   N4BiasFieldCorrectionImageFilter (0x55edef984d30)
     RTTI typeinfo:   itk::N4BiasFieldCorrectionImageFilter<itk::Image<float, 3u>, itk::Image<float, 3u>, itk::Image<float, 3u> >
     Reference Count: 1
     Modified Time: 438
     Debug: Off
     Object Name: 
     Observers: 
       IterationEvent(Command)
     Inputs: 
       Primary: (0x55edef9945d0) *
       _1: (0x55edef992cb0)
     Indexed Inputs: 
       0: Primary (0x55edef9945d0)
       1: _1 (0x55edef992cb0)
     Required Input Names: Primary
     NumberOfRequiredInputs: 1
     Outputs: 
       Primary: (0x55edef98ce50)
     Indexed Outputs: 
       0: Primary (0x55edef98ce50)
     NumberOfRequiredOutputs: 1
     Number Of Threads: 16
     ReleaseDataFlag: Off
     ReleaseDataBeforeUpdateFlag: Off
     AbortGenerateData: Off
     Progress: 0
     Multithreader: 
       RTTI typeinfo:   itk::MultiThreader
       Reference Count: 1
       Modified Time: 132
       Debug: Off
       Object Name: 
       Observers: 
         none
       Thread Count: 16
       Global Maximum Number Of Threads: 128
       Global Default Number Of Threads: 16
     CoordinateTolerance: 1e-06
     DirectionTolerance: 1e-06
     Mask label: 1
     Number of histogram bins: 200
     Wiener filter noise: 0.01
     Bias field FWHM: 0.15
     Maximum number of iterations: [50, 50, 50, 50]
     Convergence threshold: 1e-07
     Spline order: 3
     Number of fitting levels: [4, 4, 4]
     Number of control points: [4, 4, 4]
     CurrentConvergenceMeasurement: 0.00035388
     CurrentLevel: 4
     ElapsedIterations: 51
     LogBiasFieldControlPointLattice: 
       Image (0x55edef993d30)
         RTTI typeinfo:   itk::Image<itk::Vector<float, 1u>, 3u>
         Reference Count: 1
         Modified Time: 182063187
         Debug: Off
         Object Name: 
         Observers: 
           none
         Source: (none)
         Source output name: (none)
         Release Data: Off
         Data Released: False
         Global Release Data: Off
         PipelineMTime: 0
         UpdateMTime: 0
         RealTimeStamp: 0 seconds 
         LargestPossibleRegion: 
           Dimension: 3
           Index: [0, 0, 0]
           Size: [11, 11, 11]
         BufferedRegion: 
           Dimension: 3
           Index: [0, 0, 0]
           Size: [11, 11, 11]
         RequestedRegion: 
           Dimension: 3
           Index: [0, 0, 0]
           Size: [11, 11, 11]
         Spacing: [24.5, 24.5, 24.5]
         Origin: [24.6015, 23.4261, -25.4309]
         Direction: 
-0.999718 -0.0188507 0.0144245
0.0191956 -0.999524 0.0241597
0.0139622 0.0244298 0.999604

         IndexToPointMatrix: 
-24.4931 -0.461842 0.353401
0.470292 -24.4883 0.591913
0.342074 0.59853 24.4903

         PointToIndexMatrix: 
-0.0408048 0.000783494 0.000569886
-0.000769416 -0.0407969 0.000997135
0.000588756 0.000986112 0.0408002

         Inverse Direction: 
-0.999718 0.0191956 0.0139622
-0.0188507 -0.999524 0.0244298
0.0144245 0.0241597 0.999604

         PixelContainer: 
           ImportImageContainer (0x55edef993ff0)
             RTTI typeinfo:   itk::ImportImageContainer<unsigned long, itk::Vector<float, 1u> >
             Reference Count: 1
             Modified Time: 182063188
             Debug: Off
             Object Name: 
             Observers: 
               none
             Pointer: 0x55edf0246f00
             Container manages memory: true
             Size: 1331
             Capacity: 1331
Elapsed time: 70.8825
END   <<<<<<<<<<<<<<<<<<<<



--------------------------------------------------------------------------------------
 Done with N4 correction (pre brain extraction):  0h 1m 17s
--------------------------------------------------------------------------------------


--------------------------------------------------------------------------------------
 Brain extraction using the following steps:
   1) Register /home/mpib/LNDG/StateSwitch/WIP_rest/preproc/B_data/C_standards/ANTS/MICCAI2012-Multi-Atlas-Challenge-Data/T_template0.nii.gz to /home/mpib/LNDG/StateSwitch/WIP_rest/preproc/B_data/D_preproc/2216/mri/t1/tempANTs/2216_t1_ANTsBET_N4Corrected0.nii.gz
   2) Warp /home/mpib/LNDG/StateSwitch/WIP_rest/preproc/B_data/C_standards/ANTS/MICCAI2012-Multi-Atlas-Challenge-Data/T_template0_BrainCerebellumProbabilityMask.nii.gz to /home/mpib/LNDG/StateSwitch/WIP_rest/preproc/B_data/D_preproc/2216/mri/t1/2216_t1.nii.gz using, from 1),
      /home/mpib/LNDG/StateSwitch/WIP_rest/preproc/B_data/D_preproc/2216/mri/t1/tempANTs/2216_t1_ANTsBET_BrainExtractionWarp/Affine
   3) Refine segmentation results using Atropos
--------------------------------------------------------------------------------------

BEGIN >>>>>>>>>>>>>>>>>>>>
/usr/lib/ants//ResampleImageBySpacing 3 /home/mpib/LNDG/StateSwitch/WIP_rest/preproc/B_data/C_standards/ANTS/MICCAI2012-Multi-Atlas-Challenge-Data/T_template0.nii.gz /home/mpib/LNDG/StateSwitch/WIP_rest/preproc/B_data/D_preproc/2216/mri/t1/tempANTs/2216_t1_ANTsBET_BrainExtractionInitialAffineFixed.nii.gz 4 4 4 1
 spacing [1, 1, 1] dim 3
 spacing2 [4, 4, 4]
 smoothing by : 3 dir 0
 smoothing by : 3 dir 1
 smoothing by : 3 dir 2
 out space [4, 4, 4]
 output size [54, 64, 72] spc [4, 4, 4]
END   <<<<<<<<<<<<<<<<<<<<


BEGIN >>>>>>>>>>>>>>>>>>>>
/usr/lib/ants//ResampleImageBySpacing 3 /home/mpib/LNDG/StateSwitch/WIP_rest/preproc/B_data/D_preproc/2216/mri/t1/tempANTs/2216_t1_ANTsBET_N4Corrected0.nii.gz /home/mpib/LNDG/StateSwitch/WIP_rest/preproc/B_data/D_preproc/2216/mri/t1/tempANTs/2216_t1_ANTsBET_BrainExtractionInitialAffineMoving.nii.gz 4 4 4 1
 spacing [1, 1, 1] dim 3
 spacing2 [4, 4, 4]
 smoothing by : 3 dir 0
 smoothing by : 3 dir 1
 smoothing by : 3 dir 2
 out space [4, 4, 4]
 output size [40, 48, 42] spc [4, 4, 4]
END   <<<<<<<<<<<<<<<<<<<<


BEGIN >>>>>>>>>>>>>>>>>>>>
/usr/lib/ants//ImageMath 3 /home/mpib/LNDG/StateSwitch/WIP_rest/preproc/B_data/D_preproc/2216/mri/t1/tempANTs/2216_t1_ANTsBET_BrainExtractionLaplacian.nii.gz Laplacian /home/mpib/LNDG/StateSwitch/WIP_rest/preproc/B_data/D_preproc/2216/mri/t1/tempANTs/2216_t1_ANTsBET_N4Corrected0.nii.gz 1.5 1
END   <<<<<<<<<<<<<<<<<<<<


BEGIN >>>>>>>>>>>>>>>>>>>>
/usr/lib/ants//ImageMath 3 /home/mpib/LNDG/StateSwitch/WIP_rest/preproc/B_data/D_preproc/2216/mri/t1/tempANTs/2216_t1_ANTsBET_BrainExtractionTemplateLaplacian.nii.gz Laplacian /home/mpib/LNDG/StateSwitch/WIP_rest/preproc/B_data/C_standards/ANTS/MICCAI2012-Multi-Atlas-Challenge-Data/T_template0.nii.gz 1.5 1
END   <<<<<<<<<<<<<<<<<<<<


BEGIN >>>>>>>>>>>>>>>>>>>>
/usr/lib/ants//antsAI -d 3 -v 1 -m Mattes[/home/mpib/LNDG/StateSwitch/WIP_rest/preproc/B_data/D_preproc/2216/mri/t1/tempANTs/2216_t1_ANTsBET_BrainExtractionInitialAffineFixed.nii.gz,/home/mpib/LNDG/StateSwitch/WIP_rest/preproc/B_data/D_preproc/2216/mri/t1/tempANTs/2216_t1_ANTsBET_BrainExtractionInitialAffineMoving.nii.gz,32,Regular,0.25] -t Affine[0.1] -s [15,0.1] -p 0 -c 10 -o /home/mpib/LNDG/StateSwitch/WIP_rest/preproc/B_data/D_preproc/2216/mri/t1/tempANTs/2216_t1_ANTsBET_BrainExtractionInitialAffine.mat -x //home/mpib/LNDG/StateSwitch/WIP_rest/preproc/B_data/C_standards/ANTS/MICCAI2012-Multi-Atlas-Challenge-Data/T_template0_BrainCerebellumRegistrationMask.nii.gz
Using the Mattes MI metric (number of bins = 32)
END   <<<<<<<<<<<<<<<<<<<<


BEGIN >>>>>>>>>>>>>>>>>>>>
/usr/lib/ants//antsRegistration -d 3 -u 1 -w [0.025,0.975] -o /home/mpib/LNDG/StateSwitch/WIP_rest/preproc/B_data/D_preproc/2216/mri/t1/tempANTs/2216_t1_ANTsBET_BrainExtractionPrior -r /home/mpib/LNDG/StateSwitch/WIP_rest/preproc/B_data/D_preproc/2216/mri/t1/tempANTs/2216_t1_ANTsBET_BrainExtractionInitialAffine.mat -z 1 --float 0 --verbose 1 -x [//home/mpib/LNDG/StateSwitch/WIP_rest/preproc/B_data/C_standards/ANTS/MICCAI2012-Multi-Atlas-Challenge-Data/T_template0_BrainCerebellumRegistrationMask.nii.gz] -m MI[/home/mpib/LNDG/StateSwitch/WIP_rest/preproc/B_data/C_standards/ANTS/MICCAI2012-Multi-Atlas-Challenge-Data/T_template0.nii.gz,/home/mpib/LNDG/StateSwitch/WIP_rest/preproc/B_data/D_preproc/2216/mri/t1/tempANTs/2216_t1_ANTsBET_N4Corrected0.nii.gz,1,32,Regular,0.25] -c [1000x500x250x100,1e-8,10] -t Rigid[0.1] -f 8x4x2x1 -s 4x2x1x0 -m MI[/home/mpib/LNDG/StateSwitch/WIP_rest/preproc/B_data/C_standards/ANTS/MICCAI2012-Multi-Atlas-Challenge-Data/T_template0.nii.gz,/home/mpib/LNDG/StateSwitch/WIP_rest/preproc/B_data/D_preproc/2216/mri/t1/tempANTs/2216_t1_ANTsBET_N4Corrected0.nii.gz,1,32,Regular,0.25] -c [1000x500x250x100,1e-8,10] -t Affine[0.1] -f 8x4x2x1 -s 4x2x1x0 -m CC[/home/mpib/LNDG/StateSwitch/WIP_rest/preproc/B_data/C_standards/ANTS/MICCAI2012-Multi-Atlas-Challenge-Data/T_template0.nii.gz,/home/mpib/LNDG/StateSwitch/WIP_rest/preproc/B_data/D_preproc/2216/mri/t1/tempANTs/2216_t1_ANTsBET_N4Corrected0.nii.gz,0.5,4] -m CC[/home/mpib/LNDG/StateSwitch/WIP_rest/preproc/B_data/D_preproc/2216/mri/t1/tempANTs/2216_t1_ANTsBET_BrainExtractionTemplateLaplacian.nii.gz,/home/mpib/LNDG/StateSwitch/WIP_rest/preproc/B_data/D_preproc/2216/mri/t1/tempANTs/2216_t1_ANTsBET_BrainExtractionLaplacian.nii.gz,0.5,4] -c [50x10x0,1e-9,15] -t SyN[0.1,3,0] -f 4x2x1 -s 2x1x0
All_Command_lines_OK
Using double precision for computations.
=============================================================================
The composite transform comprises the following transforms (in order): 
  1. /home/mpib/LNDG/StateSwitch/WIP_rest/preproc/B_data/D_preproc/2216/mri/t1/tempANTs/2216_t1_ANTsBET_BrainExtractionInitialAffine.mat (type = AffineTransform)
=============================================================================
  Reading mask(s).
    Registration stage 0
      Fixed mask = //home/mpib/LNDG/StateSwitch/WIP_rest/preproc/B_data/C_standards/ANTS/MICCAI2012-Multi-Atlas-Challenge-Data/T_template0_BrainCerebellumRegistrationMask.nii.gz
  number of levels = 4
  number of levels = 4
  number of levels = 3
  fixed image: /home/mpib/LNDG/StateSwitch/WIP_rest/preproc/B_data/C_standards/ANTS/MICCAI2012-Multi-Atlas-Challenge-Data/T_template0.nii.gz
  moving image: /home/mpib/LNDG/StateSwitch/WIP_rest/preproc/B_data/D_preproc/2216/mri/t1/tempANTs/2216_t1_ANTsBET_N4Corrected0.nii.gz
  fixed image: /home/mpib/LNDG/StateSwitch/WIP_rest/preproc/B_data/C_standards/ANTS/MICCAI2012-Multi-Atlas-Challenge-Data/T_template0.nii.gz
  moving image: /home/mpib/LNDG/StateSwitch/WIP_rest/preproc/B_data/D_preproc/2216/mri/t1/tempANTs/2216_t1_ANTsBET_N4Corrected0.nii.gz
  fixed image: /home/mpib/LNDG/StateSwitch/WIP_rest/preproc/B_data/C_standards/ANTS/MICCAI2012-Multi-Atlas-Challenge-Data/T_template0.nii.gz
  moving image: /home/mpib/LNDG/StateSwitch/WIP_rest/preproc/B_data/D_preproc/2216/mri/t1/tempANTs/2216_t1_ANTsBET_N4Corrected0.nii.gz
  fixed image: /home/mpib/LNDG/StateSwitch/WIP_rest/preproc/B_data/D_preproc/2216/mri/t1/tempANTs/2216_t1_ANTsBET_BrainExtractionTemplateLaplacian.nii.gz
  moving image: /home/mpib/LNDG/StateSwitch/WIP_rest/preproc/B_data/D_preproc/2216/mri/t1/tempANTs/2216_t1_ANTsBET_BrainExtractionLaplacian.nii.gz
Dimension = 3
Number of stages = 3
Use Histogram Matching true
Winsorize image intensities true
Lower quantile = 0.025
Upper quantile = 0.975
Stage 1 State
   Image metric = Mattes
     Fixed image = Image (0x555f0f1967e0)
  RTTI typeinfo:   itk::Image<double, 3u>
  Reference Count: 2
  Modified Time: 1666
  Debug: Off
  Object Name: 
  Observers: 
    none
  Source: (none)
  Source output name: (none)
  Release Data: Off
  Data Released: False
  Global Release Data: Off
  PipelineMTime: 0
  UpdateMTime: 1501
  RealTimeStamp: 0 seconds 
  LargestPossibleRegion: 
    Dimension: 3
    Index: [0, 0, 0]
    Size: [216, 256, 291]
  BufferedRegion: 
    Dimension: 3
    Index: [0, 0, 0]
    Size: [216, 256, 291]
  RequestedRegion: 
    Dimension: 3
    Index: [0, 0, 0]
    Size: [216, 256, 291]
  Spacing: [1, 1, 1]
  Origin: [0, 293, 0]
  Direction: 
1 0 0
0 -0 -1
0 -1 -0

  IndexToPointMatrix: 
1 0 0
0 0 -1
0 -1 0

  PointToIndexMatrix: 
1 0 0
0 0 -1
0 -1 0

  Inverse Direction: 
1 0 0
0 0 -1
0 -1 0

  PixelContainer: 
    ImportImageContainer (0x555f0f19a9d0)
      RTTI typeinfo:   itk::ImportImageContainer<unsigned long, double>
      Reference Count: 1
      Modified Time: 1498
      Debug: Off
      Object Name: 
      Observers: 
        none
      Pointer: 0x7f4c794f1010
      Container manages memory: true
      Size: 16091136
      Capacity: 16091136

     Moving image = Image (0x555f0f198620)
  RTTI typeinfo:   itk::Image<double, 3u>
  Reference Count: 2
  Modified Time: 1667
  Debug: Off
  Object Name: 
  Observers: 
    none
  Source: (none)
  Source output name: (none)
  Release Data: Off
  Data Released: False
  Global Release Data: Off
  PipelineMTime: 0
  UpdateMTime: 1664
  RealTimeStamp: 0 seconds 
  LargestPossibleRegion: 
    Dimension: 3
    Index: [0, 0, 0]
    Size: [162, 192, 168]
  BufferedRegion: 
    Dimension: 3
    Index: [0, 0, 0]
    Size: [162, 192, 168]
  RequestedRegion: 
    Dimension: 3
    Index: [0, 0, 0]
    Size: [162, 192, 168]
  Spacing: [1, 1, 1]
  Origin: [80.4543, 83.2189, -59.339]
  Direction: 
-0.999718 -0.0188507 0.0144245
0.0191956 -0.999524 0.0241597
0.0139622 0.0244298 0.999604

  IndexToPointMatrix: 
-0.999718 -0.0188507 0.0144245
0.0191956 -0.999524 0.0241597
0.0139622 0.0244298 0.999604

  PointToIndexMatrix: 
-0.999718 0.0191956 0.0139622
-0.0188507 -0.999524 0.0244298
0.0144245 0.0241597 0.999604

  Inverse Direction: 
-0.999718 0.0191956 0.0139622
-0.0188507 -0.999524 0.0244298
0.0144245 0.0241597 0.999604

  PixelContainer: 
    ImportImageContainer (0x555f0f19a8c0)
      RTTI typeinfo:   itk::ImportImageContainer<unsigned long, double>
      Reference Count: 1
      Modified Time: 1661
      Debug: Off
      Object Name: 
      Observers: 
        none
      Pointer: 0x7f4c76d12010
      Container manages memory: true
      Size: 5225472
      Capacity: 5225472

     Weighting = 1
     Sampling strategy = regular
     Number of bins = 32
     Radius = 4
     Sampling percentage  = 0.25
   Transform = Rigid
     Gradient step = 0.1
     Update field sigma (voxel space) = 0
     Total field sigma (voxel space) = 0
     Update field time sigma = 0
     Total field time sigma  = 0
     Number of time indices = 0
     Number of time point samples = 0
Stage 2 State
   Image metric = Mattes
     Fixed image = Image (0x555f0f1a3910)
  RTTI typeinfo:   itk::Image<double, 3u>
  Reference Count: 2
  Modified Time: 1994
  Debug: Off
  Object Name: 
  Observers: 
    none
  Source: (none)
  Source output name: (none)
  Release Data: Off
  Data Released: False
  Global Release Data: Off
  PipelineMTime: 0
  UpdateMTime: 1829
  RealTimeStamp: 0 seconds 
  LargestPossibleRegion: 
    Dimension: 3
    Index: [0, 0, 0]
    Size: [216, 256, 291]
  BufferedRegion: 
    Dimension: 3
    Index: [0, 0, 0]
    Size: [216, 256, 291]
  RequestedRegion: 
    Dimension: 3
    Index: [0, 0, 0]
    Size: [216, 256, 291]
  Spacing: [1, 1, 1]
  Origin: [0, 293, 0]
  Direction: 
1 0 0
0 -0 -1
0 -1 -0

  IndexToPointMatrix: 
1 0 0
0 0 -1
0 -1 0

  PointToIndexMatrix: 
1 0 0
0 0 -1
0 -1 0

  Inverse Direction: 
1 0 0
0 0 -1
0 -1 0

  PixelContainer: 
    ImportImageContainer (0x555f0f19a3a0)
      RTTI typeinfo:   itk::ImportImageContainer<unsigned long, double>
      Reference Count: 1
      Modified Time: 1826
      Debug: Off
      Object Name: 
      Observers: 
        none
      Pointer: 0x7f4c6f24d010
      Container manages memory: true
      Size: 16091136
      Capacity: 16091136

     Moving image = Image (0x555f0f1a9040)
  RTTI typeinfo:   itk::Image<double, 3u>
  Reference Count: 2
  Modified Time: 1995
  Debug: Off
  Object Name: 
  Observers: 
    none
  Source: (none)
  Source output name: (none)
  Release Data: Off
  Data Released: False
  Global Release Data: Off
  PipelineMTime: 0
  UpdateMTime: 1992
  RealTimeStamp: 0 seconds 
  LargestPossibleRegion: 
    Dimension: 3
    Index: [0, 0, 0]
    Size: [162, 192, 168]
  BufferedRegion: 
    Dimension: 3
    Index: [0, 0, 0]
    Size: [162, 192, 168]
  RequestedRegion: 
    Dimension: 3
    Index: [0, 0, 0]
    Size: [162, 192, 168]
  Spacing: [1, 1, 1]
  Origin: [80.4543, 83.2189, -59.339]
  Direction: 
-0.999718 -0.0188507 0.0144245
0.0191956 -0.999524 0.0241597
0.0139622 0.0244298 0.999604

  IndexToPointMatrix: 
-0.999718 -0.0188507 0.0144245
0.0191956 -0.999524 0.0241597
0.0139622 0.0244298 0.999604

  PointToIndexMatrix: 
-0.999718 0.0191956 0.0139622
-0.0188507 -0.999524 0.0244298
0.0144245 0.0241597 0.999604

  Inverse Direction: 
-0.999718 0.0191956 0.0139622
-0.0188507 -0.999524 0.0244298
0.0144245 0.0241597 0.999604

  PixelContainer: 
    ImportImageContainer (0x555f0f19c830)
      RTTI typeinfo:   itk::ImportImageContainer<unsigned long, double>
      Reference Count: 1
      Modified Time: 1989
      Debug: Off
      Object Name: 
      Observers: 
        none
      Pointer: 0x555f0f1aadd0
      Container manages memory: true
      Size: 5225472
      Capacity: 5225472

     Weighting = 1
     Sampling strategy = regular
     Number of bins = 32
     Radius = 4
     Sampling percentage  = 0.25
   Transform = Affine
     Gradient step = 0.1
     Update field sigma (voxel space) = 0
     Total field sigma (voxel space) = 0
     Update field time sigma = 0
     Total field time sigma  = 0
     Number of time indices = 0
     Number of time point samples = 0
Stage 3 State
   Image metric = CC
     Fixed image = Image (0x555f11988de0)
  RTTI typeinfo:   itk::Image<double, 3u>
  Reference Count: 2
  Modified Time: 2322
  Debug: Off
  Object Name: 
  Observers: 
    none
  Source: (none)
  Source output name: (none)
  Release Data: Off
  Data Released: False
  Global Release Data: Off
  PipelineMTime: 0
  UpdateMTime: 2157
  RealTimeStamp: 0 seconds 
  LargestPossibleRegion: 
    Dimension: 3
    Index: [0, 0, 0]
    Size: [216, 256, 291]
  BufferedRegion: 
    Dimension: 3
    Index: [0, 0, 0]
    Size: [216, 256, 291]
  RequestedRegion: 
    Dimension: 3
    Index: [0, 0, 0]
    Size: [216, 256, 291]
  Spacing: [1, 1, 1]
  Origin: [0, 293, 0]
  Direction: 
1 0 0
0 -0 -1
0 -1 -0

  IndexToPointMatrix: 
1 0 0
0 0 -1
0 -1 0

  PointToIndexMatrix: 
1 0 0
0 0 -1
0 -1 0

  Inverse Direction: 
1 0 0
0 0 -1
0 -1 0

  PixelContainer: 
    ImportImageContainer (0x555f0f1a68c0)
      RTTI typeinfo:   itk::ImportImageContainer<unsigned long, double>
      Reference Count: 1
      Modified Time: 2154
      Debug: Off
      Object Name: 
      Observers: 
        none
      Pointer: 0x7f4c67788010
      Container manages memory: true
      Size: 16091136
      Capacity: 16091136

     Moving image = Image (0x555f1198ae10)
  RTTI typeinfo:   itk::Image<double, 3u>
  Reference Count: 2
  Modified Time: 2323
  Debug: Off
  Object Name: 
  Observers: 
    none
  Source: (none)
  Source output name: (none)
  Release Data: Off
  Data Released: False
  Global Release Data: Off
  PipelineMTime: 0
  UpdateMTime: 2320
  RealTimeStamp: 0 seconds 
  LargestPossibleRegion: 
    Dimension: 3
    Index: [0, 0, 0]
    Size: [162, 192, 168]
  BufferedRegion: 
    Dimension: 3
    Index: [0, 0, 0]
    Size: [162, 192, 168]
  RequestedRegion: 
    Dimension: 3
    Index: [0, 0, 0]
    Size: [162, 192, 168]
  Spacing: [1, 1, 1]
  Origin: [80.4543, 83.2189, -59.339]
  Direction: 
-0.999718 -0.0188507 0.0144245
0.0191956 -0.999524 0.0241597
0.0139622 0.0244298 0.999604

  IndexToPointMatrix: 
-0.999718 -0.0188507 0.0144245
0.0191956 -0.999524 0.0241597
0.0139622 0.0244298 0.999604

  PointToIndexMatrix: 
-0.999718 0.0191956 0.0139622
-0.0188507 -0.999524 0.0244298
0.0144245 0.0241597 0.999604

  Inverse Direction: 
-0.999718 0.0191956 0.0139622
-0.0188507 -0.999524 0.0244298
0.0144245 0.0241597 0.999604

  PixelContainer: 
    ImportImageContainer (0x555f0f1a72d0)
      RTTI typeinfo:   itk::ImportImageContainer<unsigned long, double>
      Reference Count: 1
      Modified Time: 2317
      Debug: Off
      Object Name: 
      Observers: 
        none
      Pointer: 0x555f1198d200
      Container manages memory: true
      Size: 5225472
      Capacity: 5225472

     Weighting = 0.5
     Sampling strategy = none
     Number of bins = 32
     Radius = 4
     Sampling percentage  = 1
   Transform = SyN
     Gradient step = 0.1
     Update field sigma (voxel space) = 3
     Total field sigma (voxel space) = 0
     Update field time sigma = 0
     Total field time sigma  = 0
     Number of time indices = 0
     Number of time point samples = 0
Registration using 3 total stages.

Stage 0
  iterations = 1000x500x250x100
  convergence threshold = 1e-08
  convergence window size = 10
  number of levels = 4
  using the Mattes MI metric (number of bins = 32, weight = 1)
  preprocessing:  winsorizing the image intensities
  preprocessing:  histogram matching the images
  Shrink factors (level 1 out of 4): [8, 8, 8]
  Shrink factors (level 2 out of 4): [4, 4, 4]
  Shrink factors (level 3 out of 4): [2, 2, 2]
  Shrink factors (level 4 out of 4): [1, 1, 1]
  smoothing sigmas per level: [4, 2, 1, 0]
  regular sampling (percentage = 0.25)

*** Running Euler3DTransform registration ***

DIAGNOSTIC,Iteration,metricValue,convergenceValue,ITERATION_TIME_INDEX,SINCE_LAST
 2DIAGNOSTIC,     1, -7.155019934146e-01, 1.797693134862e+308, 9.7024e+00, 9.7024e+00, 
 2DIAGNOSTIC,     2, -7.173929473355e-01, 1.797693134862e+308, 9.7150e+00, 1.2602e-02, 
 2DIAGNOSTIC,     3, -7.187287553151e-01, 1.797693134862e+308, 9.7283e+00, 1.3289e-02, 
