---------------------  Running antsBrainExtraction.sh on ood-47  ---------------------

--------------------------------------------------------------------------------------
 Bias correction of anatomical images (pre brain extraction)
   1) pre-process by truncating the image intensities
   2) run N4
--------------------------------------------------------------------------------------

BEGIN >>>>>>>>>>>>>>>>>>>>
/usr/lib/ants//ImageMath 3 /home/mpib/LNDG/StateSwitch/WIP_rest/preproc/B_data/D_preproc/2203/mri/t1/tempANTs/2203_t1_ANTsBET_N4Truncated0.nii.gz TruncateImageIntensity /home/mpib/LNDG/StateSwitch/WIP_rest/preproc/B_data/D_preproc/2203/mri/t1/2203_t1.nii.gz 0.01 0.999 256
END   <<<<<<<<<<<<<<<<<<<<


BEGIN >>>>>>>>>>>>>>>>>>>>
/usr/lib/ants//N4BiasFieldCorrection -d 3 -i /home/mpib/LNDG/StateSwitch/WIP_rest/preproc/B_data/D_preproc/2203/mri/t1/tempANTs/2203_t1_ANTsBET_N4Truncated0.nii.gz -s 4 -c [50x50x50x50,0.0000001] -b [200] -o /home/mpib/LNDG/StateSwitch/WIP_rest/preproc/B_data/D_preproc/2203/mri/t1/tempANTs/2203_t1_ANTsBET_N4Corrected0.nii.gz --verbose 1

Running N4 for 3-dimensional images.

Mask not read.  Using the entire image as the mask.

Specified spline distance: 200mm
  original image size:  [182, 201, 190]
  padded image size:  [201, 201, 201]
  number of control points:  [4, 4, 4]

Current level = 1
  Iteration 1 (of 50).   Current convergence value = 0.000179755 (threshold = 1e-07)
  Iteration 2 (of 50).   Current convergence value = 0.00015064 (threshold = 1e-07)
  Iteration 3 (of 50).   Current convergence value = 0.000127667 (threshold = 1e-07)
  Iteration 4 (of 50).   Current convergence value = 0.000108613 (threshold = 1e-07)
  Iteration 5 (of 50).   Current convergence value = 9.2712e-05 (threshold = 1e-07)
  Iteration 6 (of 50).   Current convergence value = 8.05569e-05 (threshold = 1e-07)
  Iteration 7 (of 50).   Current convergence value = 7.20909e-05 (threshold = 1e-07)
  Iteration 8 (of 50).   Current convergence value = 6.70289e-05 (threshold = 1e-07)
  Iteration 9 (of 50).   Current convergence value = 6.44758e-05 (threshold = 1e-07)
  Iteration 10 (of 50).   Current convergence value = 6.33794e-05 (threshold = 1e-07)
  Iteration 11 (of 50).   Current convergence value = 6.34667e-05 (threshold = 1e-07)
  Iteration 12 (of 50).   Current convergence value = 6.44074e-05 (threshold = 1e-07)
  Iteration 13 (of 50).   Current convergence value = 6.58197e-05 (threshold = 1e-07)
  Iteration 14 (of 50).   Current convergence value = 6.72862e-05 (threshold = 1e-07)
  Iteration 15 (of 50).   Current convergence value = 6.92834e-05 (threshold = 1e-07)
  Iteration 16 (of 50).   Current convergence value = 7.10724e-05 (threshold = 1e-07)
  Iteration 17 (of 50).   Current convergence value = 7.29176e-05 (threshold = 1e-07)
  Iteration 18 (of 50).   Current convergence value = 7.49601e-05 (threshold = 1e-07)
  Iteration 19 (of 50).   Current convergence value = 7.6481e-05 (threshold = 1e-07)
  Iteration 20 (of 50).   Current convergence value = 7.81745e-05 (threshold = 1e-07)
  Iteration 21 (of 50).   Current convergence value = 7.94854e-05 (threshold = 1e-07)
  Iteration 22 (of 50).   Current convergence value = 8.08054e-05 (threshold = 1e-07)
  Iteration 23 (of 50).   Current convergence value = 8.21067e-05 (threshold = 1e-07)
  Iteration 24 (of 50).   Current convergence value = 8.34143e-05 (threshold = 1e-07)
  Iteration 25 (of 50).   Current convergence value = 8.44693e-05 (threshold = 1e-07)
  Iteration 26 (of 50).   Current convergence value = 8.54942e-05 (threshold = 1e-07)
  Iteration 27 (of 50).   Current convergence value = 8.64414e-05 (threshold = 1e-07)
  Iteration 28 (of 50).   Current convergence value = 8.56549e-05 (threshold = 1e-07)
  Iteration 29 (of 50).   Current convergence value = 8.39315e-05 (threshold = 1e-07)
  Iteration 30 (of 50).   Current convergence value = 8.23505e-05 (threshold = 1e-07)
  Iteration 31 (of 50).   Current convergence value = 8.10568e-05 (threshold = 1e-07)
  Iteration 32 (of 50).   Current convergence value = 7.97553e-05 (threshold = 1e-07)
  Iteration 33 (of 50).   Current convergence value = 7.83006e-05 (threshold = 1e-07)
  Iteration 34 (of 50).   Current convergence value = 7.70954e-05 (threshold = 1e-07)
  Iteration 35 (of 50).   Current convergence value = 7.59243e-05 (threshold = 1e-07)
  Iteration 36 (of 50).   Current convergence value = 7.48079e-05 (threshold = 1e-07)
  Iteration 37 (of 50).   Current convergence value = 7.39782e-05 (threshold = 1e-07)
  Iteration 38 (of 50).   Current convergence value = 7.29255e-05 (threshold = 1e-07)
  Iteration 39 (of 50).   Current convergence value = 7.20116e-05 (threshold = 1e-07)
  Iteration 40 (of 50).   Current convergence value = 7.10668e-05 (threshold = 1e-07)
  Iteration 41 (of 50).   Current convergence value = 7.01456e-05 (threshold = 1e-07)
  Iteration 42 (of 50).   Current convergence value = 6.94215e-05 (threshold = 1e-07)
  Iteration 43 (of 50).   Current convergence value = 6.8576e-05 (threshold = 1e-07)
  Iteration 44 (of 50).   Current convergence value = 6.77885e-05 (threshold = 1e-07)
  Iteration 45 (of 50).   Current convergence value = 6.69173e-05 (threshold = 1e-07)
  Iteration 46 (of 50).   Current convergence value = 6.6183e-05 (threshold = 1e-07)
  Iteration 47 (of 50).   Current convergence value = 6.54452e-05 (threshold = 1e-07)
  Iteration 48 (of 50).   Current convergence value = 6.4674e-05 (threshold = 1e-07)
  Iteration 49 (of 50).   Current convergence value = 6.39815e-05 (threshold = 1e-07)
  Iteration 50 (of 50).   Current convergence value = 6.3293e-05 (threshold = 1e-07)
Current level = 2
  Iteration 1 (of 50).   Current convergence value = 0.000229604 (threshold = 1e-07)
  Iteration 2 (of 50).   Current convergence value = 0.000216152 (threshold = 1e-07)
  Iteration 3 (of 50).   Current convergence value = 0.000213346 (threshold = 1e-07)
  Iteration 4 (of 50).   Current convergence value = 0.000213483 (threshold = 1e-07)
  Iteration 5 (of 50).   Current convergence value = 0.00021441 (threshold = 1e-07)
  Iteration 6 (of 50).   Current convergence value = 0.000215695 (threshold = 1e-07)
  Iteration 7 (of 50).   Current convergence value = 0.000216505 (threshold = 1e-07)
  Iteration 8 (of 50).   Current convergence value = 0.00021751 (threshold = 1e-07)
  Iteration 9 (of 50).   Current convergence value = 0.000218593 (threshold = 1e-07)
  Iteration 10 (of 50).   Current convergence value = 0.000219041 (threshold = 1e-07)
  Iteration 11 (of 50).   Current convergence value = 0.000218782 (threshold = 1e-07)
  Iteration 12 (of 50).   Current convergence value = 0.000218865 (threshold = 1e-07)
  Iteration 13 (of 50).   Current convergence value = 0.000218894 (threshold = 1e-07)
  Iteration 14 (of 50).   Current convergence value = 0.00022223 (threshold = 1e-07)
  Iteration 15 (of 50).   Current convergence value = 0.0002266 (threshold = 1e-07)
  Iteration 16 (of 50).   Current convergence value = 0.000231516 (threshold = 1e-07)
  Iteration 17 (of 50).   Current convergence value = 0.00023636 (threshold = 1e-07)
  Iteration 18 (of 50).   Current convergence value = 0.000242574 (threshold = 1e-07)
  Iteration 19 (of 50).   Current convergence value = 0.000249675 (threshold = 1e-07)
  Iteration 20 (of 50).   Current convergence value = 0.000256255 (threshold = 1e-07)
  Iteration 21 (of 50).   Current convergence value = 0.000262565 (threshold = 1e-07)
  Iteration 22 (of 50).   Current convergence value = 0.000268924 (threshold = 1e-07)
  Iteration 23 (of 50).   Current convergence value = 0.000273954 (threshold = 1e-07)
  Iteration 24 (of 50).   Current convergence value = 0.000278496 (threshold = 1e-07)
  Iteration 25 (of 50).   Current convergence value = 0.000281001 (threshold = 1e-07)
  Iteration 26 (of 50).   Current convergence value = 0.000283362 (threshold = 1e-07)
  Iteration 27 (of 50).   Current convergence value = 0.000285633 (threshold = 1e-07)
  Iteration 28 (of 50).   Current convergence value = 0.000287875 (threshold = 1e-07)
  Iteration 29 (of 50).   Current convergence value = 0.000289344 (threshold = 1e-07)
  Iteration 30 (of 50).   Current convergence value = 0.000289808 (threshold = 1e-07)
  Iteration 31 (of 50).   Current convergence value = 0.000280591 (threshold = 1e-07)
  Iteration 32 (of 50).   Current convergence value = 0.000273542 (threshold = 1e-07)
  Iteration 33 (of 50).   Current convergence value = 0.00026763 (threshold = 1e-07)
  Iteration 34 (of 50).   Current convergence value = 0.000263076 (threshold = 1e-07)
  Iteration 35 (of 50).   Current convergence value = 0.000259469 (threshold = 1e-07)
  Iteration 36 (of 50).   Current convergence value = 0.000256204 (threshold = 1e-07)
  Iteration 37 (of 50).   Current convergence value = 0.000258483 (threshold = 1e-07)
  Iteration 38 (of 50).   Current convergence value = 0.000266591 (threshold = 1e-07)
  Iteration 39 (of 50).   Current convergence value = 0.000273263 (threshold = 1e-07)
  Iteration 40 (of 50).   Current convergence value = 0.000278679 (threshold = 1e-07)
  Iteration 41 (of 50).   Current convergence value = 0.000282955 (threshold = 1e-07)
  Iteration 42 (of 50).   Current convergence value = 0.00028654 (threshold = 1e-07)
  Iteration 43 (of 50).   Current convergence value = 0.000289397 (threshold = 1e-07)
  Iteration 44 (of 50).   Current convergence value = 0.000291636 (threshold = 1e-07)
  Iteration 45 (of 50).   Current convergence value = 0.000295016 (threshold = 1e-07)
  Iteration 46 (of 50).   Current convergence value = 0.000298109 (threshold = 1e-07)
  Iteration 47 (of 50).   Current convergence value = 0.000300884 (threshold = 1e-07)
  Iteration 48 (of 50).   Current convergence value = 0.000303107 (threshold = 1e-07)
  Iteration 49 (of 50).   Current convergence value = 0.00030467 (threshold = 1e-07)
  Iteration 50 (of 50).   Current convergence value = 0.000305621 (threshold = 1e-07)
Current level = 3
  Iteration 1 (of 50).   Current convergence value = 0.000948339 (threshold = 1e-07)
  Iteration 2 (of 50).   Current convergence value = 0.000907789 (threshold = 1e-07)
  Iteration 3 (of 50).   Current convergence value = 0.000883627 (threshold = 1e-07)
  Iteration 4 (of 50).   Current convergence value = 0.000868245 (threshold = 1e-07)
  Iteration 5 (of 50).   Current convergence value = 0.000858745 (threshold = 1e-07)
  Iteration 6 (of 50).   Current convergence value = 0.000854489 (threshold = 1e-07)
  Iteration 7 (of 50).   Current convergence value = 0.000852515 (threshold = 1e-07)
  Iteration 8 (of 50).   Current convergence value = 0.000853752 (threshold = 1e-07)
  Iteration 9 (of 50).   Current convergence value = 0.00086146 (threshold = 1e-07)
  Iteration 10 (of 50).   Current convergence value = 0.000866012 (threshold = 1e-07)
  Iteration 11 (of 50).   Current convergence value = 0.000877082 (threshold = 1e-07)
  Iteration 12 (of 50).   Current convergence value = 0.000896447 (threshold = 1e-07)
  Iteration 13 (of 50).   Current convergence value = 0.00092647 (threshold = 1e-07)
  Iteration 14 (of 50).   Current convergence value = 0.000964136 (threshold = 1e-07)
  Iteration 15 (of 50).   Current convergence value = 0.000977534 (threshold = 1e-07)
  Iteration 16 (of 50).   Current convergence value = 0.000955274 (threshold = 1e-07)
  Iteration 17 (of 50).   Current convergence value = 0.000925034 (threshold = 1e-07)
  Iteration 18 (of 50).   Current convergence value = 0.000868242 (threshold = 1e-07)
  Iteration 19 (of 50).   Current convergence value = 0.000841941 (threshold = 1e-07)
  Iteration 20 (of 50).   Current convergence value = 0.000838551 (threshold = 1e-07)
  Iteration 21 (of 50).   Current convergence value = 0.000837402 (threshold = 1e-07)
  Iteration 22 (of 50).   Current convergence value = 0.000837389 (threshold = 1e-07)
  Iteration 23 (of 50).   Current convergence value = 0.000833593 (threshold = 1e-07)
  Iteration 24 (of 50).   Current convergence value = 0.00082566 (threshold = 1e-07)
  Iteration 25 (of 50).   Current convergence value = 0.000813789 (threshold = 1e-07)
  Iteration 26 (of 50).   Current convergence value = 0.000784415 (threshold = 1e-07)
  Iteration 27 (of 50).   Current convergence value = 0.000767834 (threshold = 1e-07)
  Iteration 28 (of 50).   Current convergence value = 0.000761687 (threshold = 1e-07)
  Iteration 29 (of 50).   Current convergence value = 0.000767946 (threshold = 1e-07)
  Iteration 30 (of 50).   Current convergence value = 0.000787274 (threshold = 1e-07)
  Iteration 31 (of 50).   Current convergence value = 0.000820769 (threshold = 1e-07)
  Iteration 32 (of 50).   Current convergence value = 0.000868376 (threshold = 1e-07)
  Iteration 33 (of 50).   Current convergence value = 0.000926073 (threshold = 1e-07)
  Iteration 34 (of 50).   Current convergence value = 0.000990143 (threshold = 1e-07)
  Iteration 35 (of 50).   Current convergence value = 0.000965796 (threshold = 1e-07)
  Iteration 36 (of 50).   Current convergence value = 0.000896343 (threshold = 1e-07)
  Iteration 37 (of 50).   Current convergence value = 0.000795736 (threshold = 1e-07)
  Iteration 38 (of 50).   Current convergence value = 0.000769972 (threshold = 1e-07)
  Iteration 39 (of 50).   Current convergence value = 0.000772562 (threshold = 1e-07)
  Iteration 40 (of 50).   Current convergence value = 0.0007678 (threshold = 1e-07)
  Iteration 41 (of 50).   Current convergence value = 0.000761684 (threshold = 1e-07)
  Iteration 42 (of 50).   Current convergence value = 0.000757193 (threshold = 1e-07)
  Iteration 43 (of 50).   Current convergence value = 0.000731791 (threshold = 1e-07)
  Iteration 44 (of 50).   Current convergence value = 0.000703671 (threshold = 1e-07)
  Iteration 45 (of 50).   Current convergence value = 0.000683319 (threshold = 1e-07)
  Iteration 46 (of 50).   Current convergence value = 0.00066792 (threshold = 1e-07)
  Iteration 47 (of 50).   Current convergence value = 0.000656556 (threshold = 1e-07)
  Iteration 48 (of 50).   Current convergence value = 0.000650062 (threshold = 1e-07)
  Iteration 49 (of 50).   Current convergence value = 0.000650722 (threshold = 1e-07)
  Iteration 50 (of 50).   Current convergence value = 0.000664098 (threshold = 1e-07)
Current level = 4
  Iteration 1 (of 50).   Current convergence value = 0.00247296 (threshold = 1e-07)
  Iteration 2 (of 50).   Current convergence value = 0.00230037 (threshold = 1e-07)
  Iteration 3 (of 50).   Current convergence value = 0.00222708 (threshold = 1e-07)
  Iteration 4 (of 50).   Current convergence value = 0.00205678 (threshold = 1e-07)
  Iteration 5 (of 50).   Current convergence value = 0.00177158 (threshold = 1e-07)
  Iteration 6 (of 50).   Current convergence value = 0.00162285 (threshold = 1e-07)
  Iteration 7 (of 50).   Current convergence value = 0.00143725 (threshold = 1e-07)
  Iteration 8 (of 50).   Current convergence value = 0.0012927 (threshold = 1e-07)
  Iteration 9 (of 50).   Current convergence value = 0.00119083 (threshold = 1e-07)
  Iteration 10 (of 50).   Current convergence value = 0.0011171 (threshold = 1e-07)
  Iteration 11 (of 50).   Current convergence value = 0.0010602 (threshold = 1e-07)
  Iteration 12 (of 50).   Current convergence value = 0.00101839 (threshold = 1e-07)
  Iteration 13 (of 50).   Current convergence value = 0.000990012 (threshold = 1e-07)
  Iteration 14 (of 50).   Current convergence value = 0.000965477 (threshold = 1e-07)
  Iteration 15 (of 50).   Current convergence value = 0.000903432 (threshold = 1e-07)
  Iteration 16 (of 50).   Current convergence value = 0.000860248 (threshold = 1e-07)
  Iteration 17 (of 50).   Current convergence value = 0.000821218 (threshold = 1e-07)
  Iteration 18 (of 50).   Current convergence value = 0.000789371 (threshold = 1e-07)
  Iteration 19 (of 50).   Current convergence value = 0.00076325 (threshold = 1e-07)
  Iteration 20 (of 50).   Current convergence value = 0.000740883 (threshold = 1e-07)
  Iteration 21 (of 50).   Current convergence value = 0.000719678 (threshold = 1e-07)
  Iteration 22 (of 50).   Current convergence value = 0.000702875 (threshold = 1e-07)
  Iteration 23 (of 50).   Current convergence value = 0.000690578 (threshold = 1e-07)
  Iteration 24 (of 50).   Current convergence value = 0.000681966 (threshold = 1e-07)
  Iteration 25 (of 50).   Current convergence value = 0.000677116 (threshold = 1e-07)
  Iteration 26 (of 50).   Current convergence value = 0.000690158 (threshold = 1e-07)
  Iteration 27 (of 50).   Current convergence value = 0.000693597 (threshold = 1e-07)
  Iteration 28 (of 50).   Current convergence value = 0.000705195 (threshold = 1e-07)
  Iteration 29 (of 50).   Current convergence value = 0.000687623 (threshold = 1e-07)
  Iteration 30 (of 50).   Current convergence value = 0.00070631 (threshold = 1e-07)
  Iteration 31 (of 50).   Current convergence value = 0.000697449 (threshold = 1e-07)
  Iteration 32 (of 50).   Current convergence value = 0.000686692 (threshold = 1e-07)
  Iteration 33 (of 50).   Current convergence value = 0.000676212 (threshold = 1e-07)
  Iteration 34 (of 50).   Current convergence value = 0.000668002 (threshold = 1e-07)
  Iteration 35 (of 50).   Current convergence value = 0.000664274 (threshold = 1e-07)
  Iteration 36 (of 50).   Current convergence value = 0.000663289 (threshold = 1e-07)
  Iteration 37 (of 50).   Current convergence value = 0.000663311 (threshold = 1e-07)
  Iteration 38 (of 50).   Current convergence value = 0.00066426 (threshold = 1e-07)
  Iteration 39 (of 50).   Current convergence value = 0.000666443 (threshold = 1e-07)
  Iteration 40 (of 50).   Current convergence value = 0.000681551 (threshold = 1e-07)
  Iteration 41 (of 50).   Current convergence value = 0.000695102 (threshold = 1e-07)
  Iteration 42 (of 50).   Current convergence value = 0.000708512 (threshold = 1e-07)
  Iteration 43 (of 50).   Current convergence value = 0.000722263 (threshold = 1e-07)
  Iteration 44 (of 50).   Current convergence value = 0.00073494 (threshold = 1e-07)
  Iteration 45 (of 50).   Current convergence value = 0.000750034 (threshold = 1e-07)
  Iteration 46 (of 50).   Current convergence value = 0.000765867 (threshold = 1e-07)
  Iteration 47 (of 50).   Current convergence value = 0.000783579 (threshold = 1e-07)
  Iteration 48 (of 50).   Current convergence value = 0.000793215 (threshold = 1e-07)
  Iteration 49 (of 50).   Current convergence value = 0.000783318 (threshold = 1e-07)
  Iteration 50 (of 50).   Current convergence value = 0.000775353 (threshold = 1e-07)
   N4BiasFieldCorrectionImageFilter (0x561dbd0e3d30)
     RTTI typeinfo:   itk::N4BiasFieldCorrectionImageFilter<itk::Image<float, 3u>, itk::Image<float, 3u>, itk::Image<float, 3u> >
     Reference Count: 1
     Modified Time: 438
     Debug: Off
     Object Name: 
     Observers: 
       IterationEvent(Command)
     Inputs: 
       Primary: (0x561dbd0f35d0) *
       _1: (0x561dbd0f22e0)
     Indexed Inputs: 
       0: Primary (0x561dbd0f35d0)
       1: _1 (0x561dbd0f22e0)
     Required Input Names: Primary
     NumberOfRequiredInputs: 1
     Outputs: 
       Primary: (0x561dbd0ebe50)
     Indexed Outputs: 
       0: Primary (0x561dbd0ebe50)
     NumberOfRequiredOutputs: 1
     Number Of Threads: 20
     ReleaseDataFlag: Off
     ReleaseDataBeforeUpdateFlag: Off
     AbortGenerateData: Off
     Progress: 0
     Multithreader: 
       RTTI typeinfo:   itk::MultiThreader
       Reference Count: 1
       Modified Time: 132
       Debug: Off
       Object Name: 
       Observers: 
         none
       Thread Count: 20
       Global Maximum Number Of Threads: 128
       Global Default Number Of Threads: 20
     CoordinateTolerance: 1e-06
     DirectionTolerance: 1e-06
     Mask label: 1
     Number of histogram bins: 200
     Wiener filter noise: 0.01
     Bias field FWHM: 0.15
     Maximum number of iterations: [50, 50, 50, 50]
     Convergence threshold: 1e-07
     Spline order: 3
     Number of fitting levels: [4, 4, 4]
     Number of control points: [4, 4, 4]
     CurrentConvergenceMeasurement: 0.000775353
     CurrentLevel: 4
     ElapsedIterations: 51
     LogBiasFieldControlPointLattice: 
       Image (0x561dbd0f1770)
         RTTI typeinfo:   itk::Image<itk::Vector<float, 1u>, 3u>
         Reference Count: 1
         Modified Time: 243145443
         Debug: Off
         Object Name: 
         Observers: 
           none
         Source: (none)
         Source output name: (none)
         Release Data: Off
         Data Released: False
         Global Release Data: Off
         PipelineMTime: 0
         UpdateMTime: 0
         RealTimeStamp: 0 seconds 
         LargestPossibleRegion: 
           Dimension: 3
           Index: [0, 0, 0]
           Size: [11, 11, 11]
         BufferedRegion: 
           Dimension: 3
           Index: [0, 0, 0]
           Size: [11, 11, 11]
         RequestedRegion: 
           Dimension: 3
           Index: [0, 0, 0]
           Size: [11, 11, 11]
         Spacing: [24.5, 24.5, 24.5]
         Origin: [23.9439, 21.6155, -27.5719]
         Direction: 
-0.998767 0.04416 -0.0226954
-0.0471065 -0.987244 0.152085
-0.0156898 0.152967 0.988107

         IndexToPointMatrix: 
-24.4698 1.08192 -0.556038
-1.15411 -24.1875 3.72609
-0.384401 3.74769 24.2086

         PointToIndexMatrix: 
-0.040766 -0.00192271 -0.000640402
0.00180245 -0.0402957 0.00624355
-0.000926345 0.00620757 0.0403309

         Inverse Direction: 
-0.998767 -0.0471065 -0.0156898
0.04416 -0.987244 0.152967
-0.0226954 0.152085 0.988107

         PixelContainer: 
           ImportImageContainer (0x561dbd0f1110)
             RTTI typeinfo:   itk::ImportImageContainer<unsigned long, itk::Vector<float, 1u> >
             Reference Count: 1
             Modified Time: 243145444
             Debug: Off
             Object Name: 
             Observers: 
               none
             Pointer: 0x561dbd54d780
             Container manages memory: true
             Size: 1331
             Capacity: 1331
Elapsed time: 84.0646
END   <<<<<<<<<<<<<<<<<<<<



--------------------------------------------------------------------------------------
 Done with N4 correction (pre brain extraction):  0h 1m 32s
--------------------------------------------------------------------------------------


--------------------------------------------------------------------------------------
 Brain extraction using the following steps:
   1) Register /home/mpib/LNDG/StateSwitch/WIP_rest/preproc/B_data/C_standards/ANTS/MICCAI2012-Multi-Atlas-Challenge-Data/T_template0.nii.gz to /home/mpib/LNDG/StateSwitch/WIP_rest/preproc/B_data/D_preproc/2203/mri/t1/tempANTs/2203_t1_ANTsBET_N4Corrected0.nii.gz
   2) Warp /home/mpib/LNDG/StateSwitch/WIP_rest/preproc/B_data/C_standards/ANTS/MICCAI2012-Multi-Atlas-Challenge-Data/T_template0_BrainCerebellumProbabilityMask.nii.gz to /home/mpib/LNDG/StateSwitch/WIP_rest/preproc/B_data/D_preproc/2203/mri/t1/2203_t1.nii.gz using, from 1),
      /home/mpib/LNDG/StateSwitch/WIP_rest/preproc/B_data/D_preproc/2203/mri/t1/tempANTs/2203_t1_ANTsBET_BrainExtractionWarp/Affine
   3) Refine segmentation results using Atropos
--------------------------------------------------------------------------------------

BEGIN >>>>>>>>>>>>>>>>>>>>
/usr/lib/ants//ResampleImageBySpacing 3 /home/mpib/LNDG/StateSwitch/WIP_rest/preproc/B_data/C_standards/ANTS/MICCAI2012-Multi-Atlas-Challenge-Data/T_template0.nii.gz /home/mpib/LNDG/StateSwitch/WIP_rest/preproc/B_data/D_preproc/2203/mri/t1/tempANTs/2203_t1_ANTsBET_BrainExtractionInitialAffineFixed.nii.gz 4 4 4 1
 spacing [1, 1, 1] dim 3
 spacing2 [4, 4, 4]
 smoothing by : 3 dir 0
 smoothing by : 3 dir 1
 smoothing by : 3 dir 2
 out space [4, 4, 4]
 output size [54, 64, 72] spc [4, 4, 4]
END   <<<<<<<<<<<<<<<<<<<<


BEGIN >>>>>>>>>>>>>>>>>>>>
/usr/lib/ants//ResampleImageBySpacing 3 /home/mpib/LNDG/StateSwitch/WIP_rest/preproc/B_data/D_preproc/2203/mri/t1/tempANTs/2203_t1_ANTsBET_N4Corrected0.nii.gz /home/mpib/LNDG/StateSwitch/WIP_rest/preproc/B_data/D_preproc/2203/mri/t1/tempANTs/2203_t1_ANTsBET_BrainExtractionInitialAffineMoving.nii.gz 4 4 4 1
 spacing [1, 1, 1] dim 3
 spacing2 [4, 4, 4]
 smoothing by : 3 dir 0
 smoothing by : 3 dir 1
 smoothing by : 3 dir 2
 out space [4, 4, 4]
 output size [45, 50, 47] spc [4, 4, 4]
END   <<<<<<<<<<<<<<<<<<<<


BEGIN >>>>>>>>>>>>>>>>>>>>
/usr/lib/ants//ImageMath 3 /home/mpib/LNDG/StateSwitch/WIP_rest/preproc/B_data/D_preproc/2203/mri/t1/tempANTs/2203_t1_ANTsBET_BrainExtractionLaplacian.nii.gz Laplacian /home/mpib/LNDG/StateSwitch/WIP_rest/preproc/B_data/D_preproc/2203/mri/t1/tempANTs/2203_t1_ANTsBET_N4Corrected0.nii.gz 1.5 1
END   <<<<<<<<<<<<<<<<<<<<


BEGIN >>>>>>>>>>>>>>>>>>>>
/usr/lib/ants//ImageMath 3 /home/mpib/LNDG/StateSwitch/WIP_rest/preproc/B_data/D_preproc/2203/mri/t1/tempANTs/2203_t1_ANTsBET_BrainExtractionTemplateLaplacian.nii.gz Laplacian /home/mpib/LNDG/StateSwitch/WIP_rest/preproc/B_data/C_standards/ANTS/MICCAI2012-Multi-Atlas-Challenge-Data/T_template0.nii.gz 1.5 1
END   <<<<<<<<<<<<<<<<<<<<


BEGIN >>>>>>>>>>>>>>>>>>>>
/usr/lib/ants//antsAI -d 3 -v 1 -m Mattes[/home/mpib/LNDG/StateSwitch/WIP_rest/preproc/B_data/D_preproc/2203/mri/t1/tempANTs/2203_t1_ANTsBET_BrainExtractionInitialAffineFixed.nii.gz,/home/mpib/LNDG/StateSwitch/WIP_rest/preproc/B_data/D_preproc/2203/mri/t1/tempANTs/2203_t1_ANTsBET_BrainExtractionInitialAffineMoving.nii.gz,32,Regular,0.25] -t Affine[0.1] -s [15,0.1] -p 0 -c 10 -o /home/mpib/LNDG/StateSwitch/WIP_rest/preproc/B_data/D_preproc/2203/mri/t1/tempANTs/2203_t1_ANTsBET_BrainExtractionInitialAffine.mat -x //home/mpib/LNDG/StateSwitch/WIP_rest/preproc/B_data/C_standards/ANTS/MICCAI2012-Multi-Atlas-Challenge-Data/T_template0_BrainCerebellumRegistrationMask.nii.gz
Using the Mattes MI metric (number of bins = 32)
END   <<<<<<<<<<<<<<<<<<<<


BEGIN >>>>>>>>>>>>>>>>>>>>
/usr/lib/ants//antsRegistration -d 3 -u 1 -w [0.025,0.975] -o /home/mpib/LNDG/StateSwitch/WIP_rest/preproc/B_data/D_preproc/2203/mri/t1/tempANTs/2203_t1_ANTsBET_BrainExtractionPrior -r /home/mpib/LNDG/StateSwitch/WIP_rest/preproc/B_data/D_preproc/2203/mri/t1/tempANTs/2203_t1_ANTsBET_BrainExtractionInitialAffine.mat -z 1 --float 0 --verbose 1 -x [//home/mpib/LNDG/StateSwitch/WIP_rest/preproc/B_data/C_standards/ANTS/MICCAI2012-Multi-Atlas-Challenge-Data/T_template0_BrainCerebellumRegistrationMask.nii.gz] -m MI[/home/mpib/LNDG/StateSwitch/WIP_rest/preproc/B_data/C_standards/ANTS/MICCAI2012-Multi-Atlas-Challenge-Data/T_template0.nii.gz,/home/mpib/LNDG/StateSwitch/WIP_rest/preproc/B_data/D_preproc/2203/mri/t1/tempANTs/2203_t1_ANTsBET_N4Corrected0.nii.gz,1,32,Regular,0.25] -c [1000x500x250x100,1e-8,10] -t Rigid[0.1] -f 8x4x2x1 -s 4x2x1x0 -m MI[/home/mpib/LNDG/StateSwitch/WIP_rest/preproc/B_data/C_standards/ANTS/MICCAI2012-Multi-Atlas-Challenge-Data/T_template0.nii.gz,/home/mpib/LNDG/StateSwitch/WIP_rest/preproc/B_data/D_preproc/2203/mri/t1/tempANTs/2203_t1_ANTsBET_N4Corrected0.nii.gz,1,32,Regular,0.25] -c [1000x500x250x100,1e-8,10] -t Affine[0.1] -f 8x4x2x1 -s 4x2x1x0 -m CC[/home/mpib/LNDG/StateSwitch/WIP_rest/preproc/B_data/C_standards/ANTS/MICCAI2012-Multi-Atlas-Challenge-Data/T_template0.nii.gz,/home/mpib/LNDG/StateSwitch/WIP_rest/preproc/B_data/D_preproc/2203/mri/t1/tempANTs/2203_t1_ANTsBET_N4Corrected0.nii.gz,0.5,4] -m CC[/home/mpib/LNDG/StateSwitch/WIP_rest/preproc/B_data/D_preproc/2203/mri/t1/tempANTs/2203_t1_ANTsBET_BrainExtractionTemplateLaplacian.nii.gz,/home/mpib/LNDG/StateSwitch/WIP_rest/preproc/B_data/D_preproc/2203/mri/t1/tempANTs/2203_t1_ANTsBET_BrainExtractionLaplacian.nii.gz,0.5,4] -c [50x10x0,1e-9,15] -t SyN[0.1,3,0] -f 4x2x1 -s 2x1x0
All_Command_lines_OK
Using double precision for computations.
=============================================================================
The composite transform comprises the following transforms (in order): 
  1. /home/mpib/LNDG/StateSwitch/WIP_rest/preproc/B_data/D_preproc/2203/mri/t1/tempANTs/2203_t1_ANTsBET_BrainExtractionInitialAffine.mat (type = AffineTransform)
=============================================================================
  Reading mask(s).
    Registration stage 0
      Fixed mask = //home/mpib/LNDG/StateSwitch/WIP_rest/preproc/B_data/C_standards/ANTS/MICCAI2012-Multi-Atlas-Challenge-Data/T_template0_BrainCerebellumRegistrationMask.nii.gz
  number of levels = 4
  number of levels = 4
  number of levels = 3
  fixed image: /home/mpib/LNDG/StateSwitch/WIP_rest/preproc/B_data/C_standards/ANTS/MICCAI2012-Multi-Atlas-Challenge-Data/T_template0.nii.gz
  moving image: /home/mpib/LNDG/StateSwitch/WIP_rest/preproc/B_data/D_preproc/2203/mri/t1/tempANTs/2203_t1_ANTsBET_N4Corrected0.nii.gz
  fixed image: /home/mpib/LNDG/StateSwitch/WIP_rest/preproc/B_data/C_standards/ANTS/MICCAI2012-Multi-Atlas-Challenge-Data/T_template0.nii.gz
  moving image: /home/mpib/LNDG/StateSwitch/WIP_rest/preproc/B_data/D_preproc/2203/mri/t1/tempANTs/2203_t1_ANTsBET_N4Corrected0.nii.gz
  fixed image: /home/mpib/LNDG/StateSwitch/WIP_rest/preproc/B_data/C_standards/ANTS/MICCAI2012-Multi-Atlas-Challenge-Data/T_template0.nii.gz
  moving image: /home/mpib/LNDG/StateSwitch/WIP_rest/preproc/B_data/D_preproc/2203/mri/t1/tempANTs/2203_t1_ANTsBET_N4Corrected0.nii.gz
  fixed image: /home/mpib/LNDG/StateSwitch/WIP_rest/preproc/B_data/D_preproc/2203/mri/t1/tempANTs/2203_t1_ANTsBET_BrainExtractionTemplateLaplacian.nii.gz
  moving image: /home/mpib/LNDG/StateSwitch/WIP_rest/preproc/B_data/D_preproc/2203/mri/t1/tempANTs/2203_t1_ANTsBET_BrainExtractionLaplacian.nii.gz
Dimension = 3
Number of stages = 3
Use Histogram Matching true
Winsorize image intensities true
Lower quantile = 0.025
Upper quantile = 0.975
Stage 1 State
   Image metric = Mattes
     Fixed image = Image (0x557a83fd07e0)
  RTTI typeinfo:   itk::Image<double, 3u>
  Reference Count: 2
  Modified Time: 1666
  Debug: Off
  Object Name: 
  Observers: 
    none
  Source: (none)
  Source output name: (none)
  Release Data: Off
  Data Released: False
  Global Release Data: Off
  PipelineMTime: 0
  UpdateMTime: 1501
  RealTimeStamp: 0 seconds 
  LargestPossibleRegion: 
    Dimension: 3
    Index: [0, 0, 0]
    Size: [216, 256, 291]
  BufferedRegion: 
    Dimension: 3
    Index: [0, 0, 0]
    Size: [216, 256, 291]
  RequestedRegion: 
    Dimension: 3
    Index: [0, 0, 0]
    Size: [216, 256, 291]
  Spacing: [1, 1, 1]
  Origin: [0, 293, 0]
  Direction: 
1 0 0
0 -0 -1
0 -1 -0

  IndexToPointMatrix: 
1 0 0
0 0 -1
0 -1 0

  PointToIndexMatrix: 
1 0 0
0 0 -1
0 -1 0

  Inverse Direction: 
1 0 0
0 0 -1
0 -1 0

  PixelContainer: 
    ImportImageContainer (0x557a83fd49d0)
      RTTI typeinfo:   itk::ImportImageContainer<unsigned long, double>
      Reference Count: 1
      Modified Time: 1498
      Debug: Off
      Object Name: 
      Observers: 
        none
      Pointer: 0x7fd898090010
      Container manages memory: true
      Size: 16091136
      Capacity: 16091136

     Moving image = Image (0x557a83fd2620)
  RTTI typeinfo:   itk::Image<double, 3u>
  Reference Count: 2
  Modified Time: 1667
  Debug: Off
  Object Name: 
  Observers: 
    none
  Source: (none)
  Source output name: (none)
  Release Data: Off
  Data Released: False
  Global Release Data: Off
  PipelineMTime: 0
  UpdateMTime: 1664
  RealTimeStamp: 0 seconds 
  LargestPossibleRegion: 
    Dimension: 3
    Index: [0, 0, 0]
    Size: [182, 201, 190]
  BufferedRegion: 
    Dimension: 3
    Index: [0, 0, 0]
    Size: [182, 201, 190]
  RequestedRegion: 
    Dimension: 3
    Index: [0, 0, 0]
    Size: [182, 201, 190]
  Spacing: [1, 1, 1]
  Origin: [87.7723, 76.8562, -106.405]
  Direction: 
-0.998767 0.04416 -0.0226954
-0.0471065 -0.987244 0.152085
-0.0156898 0.152967 0.988107

  IndexToPointMatrix: 
-0.998767 0.04416 -0.0226954
-0.0471065 -0.987244 0.152085
-0.0156898 0.152967 0.988107

  PointToIndexMatrix: 
-0.998767 -0.0471065 -0.0156898
0.04416 -0.987244 0.152967
-0.0226954 0.152085 0.988107

  Inverse Direction: 
-0.998767 -0.0471065 -0.0156898
0.04416 -0.987244 0.152967
-0.0226954 0.152085 0.988107

  PixelContainer: 
    ImportImageContainer (0x557a83fd48c0)
      RTTI typeinfo:   itk::ImportImageContainer<unsigned long, double>
      Reference Count: 1
      Modified Time: 1661
      Debug: Off
      Object Name: 
      Observers: 
        none
      Pointer: 0x7fd894b88010
      Container manages memory: true
      Size: 6950580
      Capacity: 6950580

     Weighting = 1
     Sampling strategy = regular
     Number of bins = 32
     Radius = 4
     Sampling percentage  = 0.25
   Transform = Rigid
     Gradient step = 0.1
     Update field sigma (voxel space) = 0
     Total field sigma (voxel space) = 0
     Update field time sigma = 0
     Total field time sigma  = 0
     Number of time indices = 0
     Number of time point samples = 0
Stage 2 State
   Image metric = Mattes
     Fixed image = Image (0x557a83fdd910)
  RTTI typeinfo:   itk::Image<double, 3u>
  Reference Count: 2
  Modified Time: 1994
  Debug: Off
  Object Name: 
  Observers: 
    none
  Source: (none)
  Source output name: (none)
  Release Data: Off
  Data Released: False
  Global Release Data: Off
  PipelineMTime: 0
  UpdateMTime: 1829
  RealTimeStamp: 0 seconds 
  LargestPossibleRegion: 
    Dimension: 3
    Index: [0, 0, 0]
    Size: [216, 256, 291]
  BufferedRegion: 
    Dimension: 3
    Index: [0, 0, 0]
    Size: [216, 256, 291]
  RequestedRegion: 
    Dimension: 3
    Index: [0, 0, 0]
    Size: [216, 256, 291]
  Spacing: [1, 1, 1]
  Origin: [0, 293, 0]
  Direction: 
1 0 0
0 -0 -1
0 -1 -0

  IndexToPointMatrix: 
1 0 0
0 0 -1
0 -1 0

  PointToIndexMatrix: 
1 0 0
0 0 -1
0 -1 0

  Inverse Direction: 
1 0 0
0 0 -1
0 -1 0

  PixelContainer: 
    ImportImageContainer (0x557a83fd43a0)
      RTTI typeinfo:   itk::ImportImageContainer<unsigned long, double>
      Reference Count: 1
      Modified Time: 1826
      Debug: Off
      Object Name: 
      Observers: 
        none
      Pointer: 0x7fd88d0c3010
      Container manages memory: true
      Size: 16091136
      Capacity: 16091136

     Moving image = Image (0x557a83fe3040)
  RTTI typeinfo:   itk::Image<double, 3u>
  Reference Count: 2
  Modified Time: 1995
  Debug: Off
  Object Name: 
  Observers: 
    none
  Source: (none)
  Source output name: (none)
  Release Data: Off
  Data Released: False
  Global Release Data: Off
  PipelineMTime: 0
  UpdateMTime: 1992
  RealTimeStamp: 0 seconds 
  LargestPossibleRegion: 
    Dimension: 3
    Index: [0, 0, 0]
    Size: [182, 201, 190]
  BufferedRegion: 
    Dimension: 3
    Index: [0, 0, 0]
    Size: [182, 201, 190]
  RequestedRegion: 
    Dimension: 3
    Index: [0, 0, 0]
    Size: [182, 201, 190]
  Spacing: [1, 1, 1]
  Origin: [87.7723, 76.8562, -106.405]
  Direction: 
-0.998767 0.04416 -0.0226954
-0.0471065 -0.987244 0.152085
-0.0156898 0.152967 0.988107

  IndexToPointMatrix: 
-0.998767 0.04416 -0.0226954
-0.0471065 -0.987244 0.152085
-0.0156898 0.152967 0.988107

  PointToIndexMatrix: 
-0.998767 -0.0471065 -0.0156898
0.04416 -0.987244 0.152967
-0.0226954 0.152085 0.988107

  Inverse Direction: 
-0.998767 -0.0471065 -0.0156898
0.04416 -0.987244 0.152967
-0.0226954 0.152085 0.988107

  PixelContainer: 
    ImportImageContainer (0x557a83fd6830)
      RTTI typeinfo:   itk::ImportImageContainer<unsigned long, double>
      Reference Count: 1
      Modified Time: 1989
      Debug: Off
      Object Name: 
      Observers: 
        none
      Pointer: 0x557a83fe4dd0
      Container manages memory: true
      Size: 6950580
      Capacity: 6950580

     Weighting = 1
     Sampling strategy = regular
     Number of bins = 32
     Radius = 4
     Sampling percentage  = 0.25
   Transform = Affine
     Gradient step = 0.1
     Update field sigma (voxel space) = 0
     Total field sigma (voxel space) = 0
     Update field time sigma = 0
     Total field time sigma  = 0
     Number of time indices = 0
     Number of time point samples = 0
Stage 3 State
   Image metric = CC
     Fixed image = Image (0x557a874ec380)
  RTTI typeinfo:   itk::Image<double, 3u>
  Reference Count: 2
  Modified Time: 2322
  Debug: Off
  Object Name: 
  Observers: 
    none
  Source: (none)
  Source output name: (none)
  Release Data: Off
  Data Released: False
  Global Release Data: Off
  PipelineMTime: 0
  UpdateMTime: 2157
  RealTimeStamp: 0 seconds 
  LargestPossibleRegion: 
    Dimension: 3
    Index: [0, 0, 0]
    Size: [216, 256, 291]
  BufferedRegion: 
    Dimension: 3
    Index: [0, 0, 0]
    Size: [216, 256, 291]
  RequestedRegion: 
    Dimension: 3
    Index: [0, 0, 0]
    Size: [216, 256, 291]
  Spacing: [1, 1, 1]
  Origin: [0, 293, 0]
  Direction: 
1 0 0
0 -0 -1
0 -1 -0

  IndexToPointMatrix: 
1 0 0
0 0 -1
0 -1 0

  PointToIndexMatrix: 
1 0 0
0 0 -1
0 -1 0

  Inverse Direction: 
1 0 0
0 0 -1
0 -1 0

  PixelContainer: 
    ImportImageContainer (0x557a83fe08c0)
      RTTI typeinfo:   itk::ImportImageContainer<unsigned long, double>
      Reference Count: 1
      Modified Time: 2154
      Debug: Off
      Object Name: 
      Observers: 
        none
      Pointer: 0x7fd8855fe010
      Container manages memory: true
      Size: 16091136
      Capacity: 16091136

     Moving image = Image (0x557a874ee3b0)
  RTTI typeinfo:   itk::Image<double, 3u>
  Reference Count: 2
  Modified Time: 2323
  Debug: Off
  Object Name: 
  Observers: 
    none
  Source: (none)
  Source output name: (none)
  Release Data: Off
  Data Released: False
  Global Release Data: Off
  PipelineMTime: 0
  UpdateMTime: 2320
  RealTimeStamp: 0 seconds 
  LargestPossibleRegion: 
    Dimension: 3
    Index: [0, 0, 0]
    Size: [182, 201, 190]
  BufferedRegion: 
    Dimension: 3
    Index: [0, 0, 0]
    Size: [182, 201, 190]
  RequestedRegion: 
    Dimension: 3
    Index: [0, 0, 0]
    Size: [182, 201, 190]
  Spacing: [1, 1, 1]
  Origin: [87.7723, 76.8562, -106.405]
  Direction: 
-0.998767 0.04416 -0.0226954
-0.0471065 -0.987244 0.152085
-0.0156898 0.152967 0.988107

  IndexToPointMatrix: 
-0.998767 0.04416 -0.0226954
-0.0471065 -0.987244 0.152085
-0.0156898 0.152967 0.988107

  PointToIndexMatrix: 
-0.998767 -0.0471065 -0.0156898
0.04416 -0.987244 0.152967
-0.0226954 0.152085 0.988107

  Inverse Direction: 
-0.998767 -0.0471065 -0.0156898
0.04416 -0.987244 0.152967
-0.0226954 0.152085 0.988107

  PixelContainer: 
    ImportImageContainer (0x557a83fe12d0)
      RTTI typeinfo:   itk::ImportImageContainer<unsigned long, double>
      Reference Count: 1
      Modified Time: 2317
      Debug: Off
      Object Name: 
      Observers: 
        none
      Pointer: 0x557a874f07a0
      Container manages memory: true
      Size: 6950580
      Capacity: 6950580

     Weighting = 0.5
     Sampling strategy = none
     Number of bins = 32
     Radius = 4
     Sampling percentage  = 1
   Transform = SyN
     Gradient step = 0.1
     Update field sigma (voxel space) = 3
     Total field sigma (voxel space) = 0
     Update field time sigma = 0
     Total field time sigma  = 0
     Number of time indices = 0
     Number of time point samples = 0
Registration using 3 total stages.

Stage 0
  iterations = 1000x500x250x100
  convergence threshold = 1e-08
  convergence window size = 10
  number of levels = 4
  using the Mattes MI metric (number of bins = 32, weight = 1)
  preprocessing:  winsorizing the image intensities
  preprocessing:  histogram matching the images
  Shrink factors (level 1 out of 4): [8, 8, 8]
  Shrink factors (level 2 out of 4): [4, 4, 4]
  Shrink factors (level 3 out of 4): [2, 2, 2]
  Shrink factors (level 4 out of 4): [1, 1, 1]
  smoothing sigmas per level: [4, 2, 1, 0]
  regular sampling (percentage = 0.25)

*** Running Euler3DTransform registration ***

DIAGNOSTIC,Iteration,metricValue,convergenceValue,ITERATION_TIME_INDEX,SINCE_LAST
 2DIAGNOSTIC,     1, -8.781895980725e-01, 1.797693134862e+308, 1.1580e+01, 1.1580e+01, 
 2DIAGNOSTIC,     2, -8.798771576591e-01, 1.797693134862e+308, 1.1594e+01, 1.4179e-02, 
 2DIAGNOSTIC,     3, -8.812119131133e-01, 1.797693134862e+308, 1.1608e+01, 1.4075e-02, 
 2DIAGNOSTIC,     4, -8.818481259079e-01, 1.797693134862e+308, 1.1622e+01, 1.4089e-02, 
