
    Using antsBrainExtraction with the following arguments:
      image dimension         = 3
      anatomical image        = /home/mpib/LNDG/StateSwitch/WIP_rest/preproc/B_data/D_preproc/2132/mri/t1/2132_t1.nii.gz
      extraction template     = /home/mpib/LNDG/StateSwitch/WIP_rest/preproc/B_data/C_standards/ANTS/MICCAI2012-Multi-Atlas-Challenge-Data/T_template0.nii.gz
      extraction reg. mask    = //home/mpib/LNDG/StateSwitch/WIP_rest/preproc/B_data/C_standards/ANTS/MICCAI2012-Multi-Atlas-Challenge-Data/T_template0_BrainCerebellumRegistrationMask.nii.gz
      extraction prior        = /home/mpib/LNDG/StateSwitch/WIP_rest/preproc/B_data/C_standards/ANTS/MICCAI2012-Multi-Atlas-Challenge-Data/T_template0_BrainCerebellumProbabilityMask.nii.gz
      output prefix           = /home/mpib/LNDG/StateSwitch/WIP_rest/preproc/B_data/D_preproc/2132/mri/t1/tempANTs/2132_t1_ANTsBET_
      output image suffix     = nii.gz

    N4 parameters (pre brain extraction):
      convergence             = [50x50x50x50,0.0000001]
      shrink factor           = 4
      B-spline parameters     = [200]

    Atropos parameters (extraction):
       convergence            = [3,0.0]
       likelihood             = Gaussian
       initialization         = kmeans[3]
       mrf                    = [0.1,1x1x1]
       use clock random seed  = 1

WARNING: In /usr/include/ITK-4.10/itkTransformFactoryBase.h, line 81
TransformFactoryBase (0x559dd6735870): Refusing to register transform "MatrixOffsetTransformBase_double_3_3" again!

