---------------------  Running antsBrainExtraction.sh on ood-48  ---------------------

--------------------------------------------------------------------------------------
 Bias correction of anatomical images (pre brain extraction)
   1) pre-process by truncating the image intensities
   2) run N4
--------------------------------------------------------------------------------------

BEGIN >>>>>>>>>>>>>>>>>>>>
/usr/lib/ants//ImageMath 3 /home/mpib/LNDG/StateSwitch/WIP_rest/preproc/B_data/D_preproc/1124/mri/t1/tempANTs/1124_t1_ANTsBET_N4Truncated0.nii.gz TruncateImageIntensity /home/mpib/LNDG/StateSwitch/WIP_rest/preproc/B_data/D_preproc/1124/mri/t1/1124_t1.nii.gz 0.01 0.999 256
END   <<<<<<<<<<<<<<<<<<<<


BEGIN >>>>>>>>>>>>>>>>>>>>
/usr/lib/ants//N4BiasFieldCorrection -d 3 -i /home/mpib/LNDG/StateSwitch/WIP_rest/preproc/B_data/D_preproc/1124/mri/t1/tempANTs/1124_t1_ANTsBET_N4Truncated0.nii.gz -s 4 -c [50x50x50x50,0.0000001] -b [200] -o /home/mpib/LNDG/StateSwitch/WIP_rest/preproc/B_data/D_preproc/1124/mri/t1/tempANTs/1124_t1_ANTsBET_N4Corrected0.nii.gz --verbose 1

Running N4 for 3-dimensional images.

Mask not read.  Using the entire image as the mask.

Specified spline distance: 200mm
  original image size:  [192, 256, 256]
  padded image size:  [201, 401, 401]
  number of control points:  [4, 5, 5]

Current level = 1
  Iteration 1 (of 50).   Current convergence value = 0.000392048 (threshold = 1e-07)
  Iteration 2 (of 50).   Current convergence value = 0.000319885 (threshold = 1e-07)
  Iteration 3 (of 50).   Current convergence value = 0.00026363 (threshold = 1e-07)
  Iteration 4 (of 50).   Current convergence value = 0.00021925 (threshold = 1e-07)
  Iteration 5 (of 50).   Current convergence value = 0.000183419 (threshold = 1e-07)
  Iteration 6 (of 50).   Current convergence value = 0.000155507 (threshold = 1e-07)
  Iteration 7 (of 50).   Current convergence value = 0.000134282 (threshold = 1e-07)
  Iteration 8 (of 50).   Current convergence value = 0.000118567 (threshold = 1e-07)
  Iteration 9 (of 50).   Current convergence value = 0.000107559 (threshold = 1e-07)
  Iteration 10 (of 50).   Current convergence value = 0.000100211 (threshold = 1e-07)
  Iteration 11 (of 50).   Current convergence value = 9.56133e-05 (threshold = 1e-07)
  Iteration 12 (of 50).   Current convergence value = 9.31543e-05 (threshold = 1e-07)
  Iteration 13 (of 50).   Current convergence value = 9.19056e-05 (threshold = 1e-07)
  Iteration 14 (of 50).   Current convergence value = 9.15184e-05 (threshold = 1e-07)
  Iteration 15 (of 50).   Current convergence value = 9.14747e-05 (threshold = 1e-07)
  Iteration 16 (of 50).   Current convergence value = 9.19734e-05 (threshold = 1e-07)
  Iteration 17 (of 50).   Current convergence value = 9.23178e-05 (threshold = 1e-07)
  Iteration 18 (of 50).   Current convergence value = 9.26752e-05 (threshold = 1e-07)
  Iteration 19 (of 50).   Current convergence value = 9.28575e-05 (threshold = 1e-07)
  Iteration 20 (of 50).   Current convergence value = 9.30493e-05 (threshold = 1e-07)
  Iteration 21 (of 50).   Current convergence value = 9.33078e-05 (threshold = 1e-07)
  Iteration 22 (of 50).   Current convergence value = 9.31936e-05 (threshold = 1e-07)
  Iteration 23 (of 50).   Current convergence value = 9.259e-05 (threshold = 1e-07)
  Iteration 24 (of 50).   Current convergence value = 8.91361e-05 (threshold = 1e-07)
  Iteration 25 (of 50).   Current convergence value = 8.40437e-05 (threshold = 1e-07)
  Iteration 26 (of 50).   Current convergence value = 8.06777e-05 (threshold = 1e-07)
  Iteration 27 (of 50).   Current convergence value = 7.7873e-05 (threshold = 1e-07)
  Iteration 28 (of 50).   Current convergence value = 7.54452e-05 (threshold = 1e-07)
  Iteration 29 (of 50).   Current convergence value = 7.31527e-05 (threshold = 1e-07)
  Iteration 30 (of 50).   Current convergence value = 7.10899e-05 (threshold = 1e-07)
  Iteration 31 (of 50).   Current convergence value = 6.93256e-05 (threshold = 1e-07)
  Iteration 32 (of 50).   Current convergence value = 6.80168e-05 (threshold = 1e-07)
  Iteration 33 (of 50).   Current convergence value = 6.71109e-05 (threshold = 1e-07)
  Iteration 34 (of 50).   Current convergence value = 6.65159e-05 (threshold = 1e-07)
  Iteration 35 (of 50).   Current convergence value = 6.6299e-05 (threshold = 1e-07)
  Iteration 36 (of 50).   Current convergence value = 6.63249e-05 (threshold = 1e-07)
  Iteration 37 (of 50).   Current convergence value = 6.66424e-05 (threshold = 1e-07)
  Iteration 38 (of 50).   Current convergence value = 6.71252e-05 (threshold = 1e-07)
  Iteration 39 (of 50).   Current convergence value = 6.77722e-05 (threshold = 1e-07)
  Iteration 40 (of 50).   Current convergence value = 6.85581e-05 (threshold = 1e-07)
  Iteration 41 (of 50).   Current convergence value = 6.9438e-05 (threshold = 1e-07)
  Iteration 42 (of 50).   Current convergence value = 7.03975e-05 (threshold = 1e-07)
  Iteration 43 (of 50).   Current convergence value = 7.13533e-05 (threshold = 1e-07)
  Iteration 44 (of 50).   Current convergence value = 7.24772e-05 (threshold = 1e-07)
  Iteration 45 (of 50).   Current convergence value = 7.35534e-05 (threshold = 1e-07)
  Iteration 46 (of 50).   Current convergence value = 7.4568e-05 (threshold = 1e-07)
  Iteration 47 (of 50).   Current convergence value = 7.56408e-05 (threshold = 1e-07)
  Iteration 48 (of 50).   Current convergence value = 7.6681e-05 (threshold = 1e-07)
  Iteration 49 (of 50).   Current convergence value = 7.76701e-05 (threshold = 1e-07)
  Iteration 50 (of 50).   Current convergence value = 7.87138e-05 (threshold = 1e-07)
Current level = 2
  Iteration 1 (of 50).   Current convergence value = 0.000300775 (threshold = 1e-07)
  Iteration 2 (of 50).   Current convergence value = 0.000271213 (threshold = 1e-07)
  Iteration 3 (of 50).   Current convergence value = 0.000259508 (threshold = 1e-07)
  Iteration 4 (of 50).   Current convergence value = 0.000250366 (threshold = 1e-07)
  Iteration 5 (of 50).   Current convergence value = 0.000250844 (threshold = 1e-07)
  Iteration 6 (of 50).   Current convergence value = 0.00025873 (threshold = 1e-07)
  Iteration 7 (of 50).   Current convergence value = 0.00026877 (threshold = 1e-07)
  Iteration 8 (of 50).   Current convergence value = 0.000279439 (threshold = 1e-07)
  Iteration 9 (of 50).   Current convergence value = 0.000290416 (threshold = 1e-07)
  Iteration 10 (of 50).   Current convergence value = 0.000299066 (threshold = 1e-07)
  Iteration 11 (of 50).   Current convergence value = 0.000305565 (threshold = 1e-07)
  Iteration 12 (of 50).   Current convergence value = 0.000311223 (threshold = 1e-07)
  Iteration 13 (of 50).   Current convergence value = 0.000316738 (threshold = 1e-07)
  Iteration 14 (of 50).   Current convergence value = 0.000324328 (threshold = 1e-07)
  Iteration 15 (of 50).   Current convergence value = 0.000334917 (threshold = 1e-07)
  Iteration 16 (of 50).   Current convergence value = 0.000390233 (threshold = 1e-07)
  Iteration 17 (of 50).   Current convergence value = 0.000428122 (threshold = 1e-07)
  Iteration 18 (of 50).   Current convergence value = 0.000459072 (threshold = 1e-07)
  Iteration 19 (of 50).   Current convergence value = 0.000481307 (threshold = 1e-07)
  Iteration 20 (of 50).   Current convergence value = 0.000498145 (threshold = 1e-07)
  Iteration 21 (of 50).   Current convergence value = 0.000508428 (threshold = 1e-07)
  Iteration 22 (of 50).   Current convergence value = 0.000514553 (threshold = 1e-07)
  Iteration 23 (of 50).   Current convergence value = 0.000517729 (threshold = 1e-07)
  Iteration 24 (of 50).   Current convergence value = 0.000519318 (threshold = 1e-07)
  Iteration 25 (of 50).   Current convergence value = 0.000520399 (threshold = 1e-07)
  Iteration 26 (of 50).   Current convergence value = 0.000508277 (threshold = 1e-07)
  Iteration 27 (of 50).   Current convergence value = 0.000494938 (threshold = 1e-07)
  Iteration 28 (of 50).   Current convergence value = 0.000485002 (threshold = 1e-07)
  Iteration 29 (of 50).   Current convergence value = 0.000476598 (threshold = 1e-07)
  Iteration 30 (of 50).   Current convergence value = 0.000470106 (threshold = 1e-07)
  Iteration 31 (of 50).   Current convergence value = 0.000464415 (threshold = 1e-07)
  Iteration 32 (of 50).   Current convergence value = 0.000459296 (threshold = 1e-07)
  Iteration 33 (of 50).   Current convergence value = 0.0004551 (threshold = 1e-07)
  Iteration 34 (of 50).   Current convergence value = 0.000451323 (threshold = 1e-07)
  Iteration 35 (of 50).   Current convergence value = 0.000447717 (threshold = 1e-07)
  Iteration 36 (of 50).   Current convergence value = 0.000445016 (threshold = 1e-07)
  Iteration 37 (of 50).   Current convergence value = 0.000441919 (threshold = 1e-07)
  Iteration 38 (of 50).   Current convergence value = 0.000439702 (threshold = 1e-07)
  Iteration 39 (of 50).   Current convergence value = 0.000437368 (threshold = 1e-07)
  Iteration 40 (of 50).   Current convergence value = 0.000435354 (threshold = 1e-07)
  Iteration 41 (of 50).   Current convergence value = 0.000433165 (threshold = 1e-07)
  Iteration 42 (of 50).   Current convergence value = 0.000431559 (threshold = 1e-07)
  Iteration 43 (of 50).   Current convergence value = 0.000429463 (threshold = 1e-07)
  Iteration 44 (of 50).   Current convergence value = 0.000427677 (threshold = 1e-07)
  Iteration 45 (of 50).   Current convergence value = 0.000425723 (threshold = 1e-07)
  Iteration 46 (of 50).   Current convergence value = 0.000424189 (threshold = 1e-07)
  Iteration 47 (of 50).   Current convergence value = 0.000422994 (threshold = 1e-07)
  Iteration 48 (of 50).   Current convergence value = 0.000421424 (threshold = 1e-07)
  Iteration 49 (of 50).   Current convergence value = 0.000413815 (threshold = 1e-07)
  Iteration 50 (of 50).   Current convergence value = 0.000387144 (threshold = 1e-07)
Current level = 3
  Iteration 1 (of 50).   Current convergence value = 0.00132594 (threshold = 1e-07)
  Iteration 2 (of 50).   Current convergence value = 0.00125742 (threshold = 1e-07)
  Iteration 3 (of 50).   Current convergence value = 0.00123712 (threshold = 1e-07)
  Iteration 4 (of 50).   Current convergence value = 0.00122792 (threshold = 1e-07)
  Iteration 5 (of 50).   Current convergence value = 0.00121726 (threshold = 1e-07)
  Iteration 6 (of 50).   Current convergence value = 0.00118607 (threshold = 1e-07)
  Iteration 7 (of 50).   Current convergence value = 0.0011733 (threshold = 1e-07)
  Iteration 8 (of 50).   Current convergence value = 0.00127165 (threshold = 1e-07)
  Iteration 9 (of 50).   Current convergence value = 0.00133648 (threshold = 1e-07)
  Iteration 10 (of 50).   Current convergence value = 0.00126044 (threshold = 1e-07)
  Iteration 11 (of 50).   Current convergence value = 0.00124443 (threshold = 1e-07)
  Iteration 12 (of 50).   Current convergence value = 0.00141457 (threshold = 1e-07)
  Iteration 13 (of 50).   Current convergence value = 0.0015273 (threshold = 1e-07)
  Iteration 14 (of 50).   Current convergence value = 0.00149359 (threshold = 1e-07)
  Iteration 15 (of 50).   Current convergence value = 0.00142256 (threshold = 1e-07)
  Iteration 16 (of 50).   Current convergence value = 0.00128496 (threshold = 1e-07)
  Iteration 17 (of 50).   Current convergence value = 0.00118612 (threshold = 1e-07)
  Iteration 18 (of 50).   Current convergence value = 0.00123705 (threshold = 1e-07)
  Iteration 19 (of 50).   Current convergence value = 0.0014349 (threshold = 1e-07)
  Iteration 20 (of 50).   Current convergence value = 0.0013641 (threshold = 1e-07)
  Iteration 21 (of 50).   Current convergence value = 0.00118827 (threshold = 1e-07)
  Iteration 22 (of 50).   Current convergence value = 0.00137657 (threshold = 1e-07)
  Iteration 23 (of 50).   Current convergence value = 0.0015477 (threshold = 1e-07)
  Iteration 24 (of 50).   Current convergence value = 0.00163154 (threshold = 1e-07)
  Iteration 25 (of 50).   Current convergence value = 0.00158037 (threshold = 1e-07)
  Iteration 26 (of 50).   Current convergence value = 0.00139551 (threshold = 1e-07)
  Iteration 27 (of 50).   Current convergence value = 0.00123297 (threshold = 1e-07)
  Iteration 28 (of 50).   Current convergence value = 0.00116377 (threshold = 1e-07)
  Iteration 29 (of 50).   Current convergence value = 0.00126076 (threshold = 1e-07)
  Iteration 30 (of 50).   Current convergence value = 0.00125346 (threshold = 1e-07)
  Iteration 31 (of 50).   Current convergence value = 0.00108192 (threshold = 1e-07)
  Iteration 32 (of 50).   Current convergence value = 0.00110755 (threshold = 1e-07)
  Iteration 33 (of 50).   Current convergence value = 0.00122694 (threshold = 1e-07)
  Iteration 34 (of 50).   Current convergence value = 0.00132074 (threshold = 1e-07)
  Iteration 35 (of 50).   Current convergence value = 0.00136145 (threshold = 1e-07)
  Iteration 36 (of 50).   Current convergence value = 0.0012759 (threshold = 1e-07)
  Iteration 37 (of 50).   Current convergence value = 0.00121509 (threshold = 1e-07)
  Iteration 38 (of 50).   Current convergence value = 0.00115315 (threshold = 1e-07)
  Iteration 39 (of 50).   Current convergence value = 0.00104765 (threshold = 1e-07)
  Iteration 40 (of 50).   Current convergence value = 0.000988042 (threshold = 1e-07)
  Iteration 41 (of 50).   Current convergence value = 0.000969683 (threshold = 1e-07)
  Iteration 42 (of 50).   Current convergence value = 0.000898843 (threshold = 1e-07)
  Iteration 43 (of 50).   Current convergence value = 0.000895683 (threshold = 1e-07)
  Iteration 44 (of 50).   Current convergence value = 0.000914188 (threshold = 1e-07)
  Iteration 45 (of 50).   Current convergence value = 0.000970235 (threshold = 1e-07)
  Iteration 46 (of 50).   Current convergence value = 0.00105562 (threshold = 1e-07)
  Iteration 47 (of 50).   Current convergence value = 0.00111402 (threshold = 1e-07)
  Iteration 48 (of 50).   Current convergence value = 0.00114115 (threshold = 1e-07)
  Iteration 49 (of 50).   Current convergence value = 0.00115637 (threshold = 1e-07)
  Iteration 50 (of 50).   Current convergence value = 0.00108297 (threshold = 1e-07)
Current level = 4
  Iteration 1 (of 50).   Current convergence value = 0.00220846 (threshold = 1e-07)
  Iteration 2 (of 50).   Current convergence value = 0.00206445 (threshold = 1e-07)
  Iteration 3 (of 50).   Current convergence value = 0.00192651 (threshold = 1e-07)
  Iteration 4 (of 50).   Current convergence value = 0.00178657 (threshold = 1e-07)
  Iteration 5 (of 50).   Current convergence value = 0.00168854 (threshold = 1e-07)
  Iteration 6 (of 50).   Current convergence value = 0.00163167 (threshold = 1e-07)
  Iteration 7 (of 50).   Current convergence value = 0.00157795 (threshold = 1e-07)
  Iteration 8 (of 50).   Current convergence value = 0.00152887 (threshold = 1e-07)
  Iteration 9 (of 50).   Current convergence value = 0.00151146 (threshold = 1e-07)
  Iteration 10 (of 50).   Current convergence value = 0.00150902 (threshold = 1e-07)
  Iteration 11 (of 50).   Current convergence value = 0.00151396 (threshold = 1e-07)
  Iteration 12 (of 50).   Current convergence value = 0.00151767 (threshold = 1e-07)
  Iteration 13 (of 50).   Current convergence value = 0.00151508 (threshold = 1e-07)
  Iteration 14 (of 50).   Current convergence value = 0.00150444 (threshold = 1e-07)
  Iteration 15 (of 50).   Current convergence value = 0.00148418 (threshold = 1e-07)
  Iteration 16 (of 50).   Current convergence value = 0.00144531 (threshold = 1e-07)
  Iteration 17 (of 50).   Current convergence value = 0.00140389 (threshold = 1e-07)
  Iteration 18 (of 50).   Current convergence value = 0.00136636 (threshold = 1e-07)
  Iteration 19 (of 50).   Current convergence value = 0.00132644 (threshold = 1e-07)
  Iteration 20 (of 50).   Current convergence value = 0.00129039 (threshold = 1e-07)
  Iteration 21 (of 50).   Current convergence value = 0.0012489 (threshold = 1e-07)
  Iteration 22 (of 50).   Current convergence value = 0.00118023 (threshold = 1e-07)
  Iteration 23 (of 50).   Current convergence value = 0.00112486 (threshold = 1e-07)
  Iteration 24 (of 50).   Current convergence value = 0.00108094 (threshold = 1e-07)
  Iteration 25 (of 50).   Current convergence value = 0.00104268 (threshold = 1e-07)
  Iteration 26 (of 50).   Current convergence value = 0.000998598 (threshold = 1e-07)
  Iteration 27 (of 50).   Current convergence value = 0.000976999 (threshold = 1e-07)
  Iteration 28 (of 50).   Current convergence value = 0.000963512 (threshold = 1e-07)
  Iteration 29 (of 50).   Current convergence value = 0.000963553 (threshold = 1e-07)
  Iteration 30 (of 50).   Current convergence value = 0.000971538 (threshold = 1e-07)
  Iteration 31 (of 50).   Current convergence value = 0.00099124 (threshold = 1e-07)
  Iteration 32 (of 50).   Current convergence value = 0.00106073 (threshold = 1e-07)
  Iteration 33 (of 50).   Current convergence value = 0.00112142 (threshold = 1e-07)
  Iteration 34 (of 50).   Current convergence value = 0.00119602 (threshold = 1e-07)
  Iteration 35 (of 50).   Current convergence value = 0.00129711 (threshold = 1e-07)
  Iteration 36 (of 50).   Current convergence value = 0.00142651 (threshold = 1e-07)
  Iteration 37 (of 50).   Current convergence value = 0.00158484 (threshold = 1e-07)
  Iteration 38 (of 50).   Current convergence value = 0.00165337 (threshold = 1e-07)
  Iteration 39 (of 50).   Current convergence value = 0.00163753 (threshold = 1e-07)
  Iteration 40 (of 50).   Current convergence value = 0.00146775 (threshold = 1e-07)
  Iteration 41 (of 50).   Current convergence value = 0.00136134 (threshold = 1e-07)
  Iteration 42 (of 50).   Current convergence value = 0.00128328 (threshold = 1e-07)
  Iteration 43 (of 50).   Current convergence value = 0.00122543 (threshold = 1e-07)
  Iteration 44 (of 50).   Current convergence value = 0.00115611 (threshold = 1e-07)
  Iteration 45 (of 50).   Current convergence value = 0.00104527 (threshold = 1e-07)
  Iteration 46 (of 50).   Current convergence value = 0.00100041 (threshold = 1e-07)
  Iteration 47 (of 50).   Current convergence value = 0.000990258 (threshold = 1e-07)
  Iteration 48 (of 50).   Current convergence value = 0.000987274 (threshold = 1e-07)
  Iteration 49 (of 50).   Current convergence value = 0.000991369 (threshold = 1e-07)
  Iteration 50 (of 50).   Current convergence value = 0.0010027 (threshold = 1e-07)
   N4BiasFieldCorrectionImageFilter (0x55ff1ea41d30)
     RTTI typeinfo:   itk::N4BiasFieldCorrectionImageFilter<itk::Image<float, 3u>, itk::Image<float, 3u>, itk::Image<float, 3u> >
     Reference Count: 1
     Modified Time: 439
     Debug: Off
     Object Name: 
     Observers: 
       IterationEvent(Command)
     Inputs: 
       Primary: (0x55ff1ea515d0) *
       _1: (0x55ff1ea502e0)
     Indexed Inputs: 
       0: Primary (0x55ff1ea515d0)
       1: _1 (0x55ff1ea502e0)
     Required Input Names: Primary
     NumberOfRequiredInputs: 1
     Outputs: 
       Primary: (0x55ff1ea49e50)
     Indexed Outputs: 
       0: Primary (0x55ff1ea49e50)
     NumberOfRequiredOutputs: 1
     Number Of Threads: 20
     ReleaseDataFlag: Off
     ReleaseDataBeforeUpdateFlag: Off
     AbortGenerateData: Off
     Progress: 0
     Multithreader: 
       RTTI typeinfo:   itk::MultiThreader
       Reference Count: 1
       Modified Time: 132
       Debug: Off
       Object Name: 
       Observers: 
         none
       Thread Count: 20
       Global Maximum Number Of Threads: 128
       Global Default Number Of Threads: 20
     CoordinateTolerance: 1e-06
     DirectionTolerance: 1e-06
     Mask label: 1
     Number of histogram bins: 200
     Wiener filter noise: 0.01
     Bias field FWHM: 0.15
     Maximum number of iterations: [50, 50, 50, 50]
     Convergence threshold: 1e-07
     Spline order: 3
     Number of fitting levels: [4, 4, 4]
     Number of control points: [4, 5, 5]
     CurrentConvergenceMeasurement: 0.0010027
     CurrentLevel: 4
     ElapsedIterations: 51
     LogBiasFieldControlPointLattice: 
       Image (0x55ff1ea53350)
         RTTI typeinfo:   itk::Image<itk::Vector<float, 1u>, 3u>
         Reference Count: 1
         Modified Time: 432828186
         Debug: Off
         Object Name: 
         Observers: 
           none
         Source: (none)
         Source output name: (none)
         Release Data: Off
         Data Released: False
         Global Release Data: Off
         PipelineMTime: 0
         UpdateMTime: 0
         RealTimeStamp: 0 seconds 
         LargestPossibleRegion: 
           Dimension: 3
           Index: [0, 0, 0]
           Size: [11, 19, 19]
         BufferedRegion: 
           Dimension: 3
           Index: [0, 0, 0]
           Size: [11, 19, 19]
         RequestedRegion: 
           Dimension: 3
           Index: [0, 0, 0]
           Size: [11, 19, 19]
         Spacing: [24.5, 24.75, 24.75]
         Origin: [-25.5618, 23.4768, -24.916]
         Direction: 
0.999505 0.0265953 0.0167952
0.026173 -0.999348 0.0248804
-0.017446 0.0244286 0.999549

         IndexToPointMatrix: 
24.4879 0.658234 0.415681
0.64124 -24.7339 0.615791
-0.427426 0.604607 24.7388

         PointToIndexMatrix: 
0.0407961 0.00106829 -0.00071208
0.00107456 -0.0403777 0.000987012
0.000678594 0.00100527 0.0403858

         Inverse Direction: 
0.999505 0.026173 -0.017446
0.0265953 -0.999348 0.0244286
0.0167952 0.0248804 0.999549

         PixelContainer: 
           ImportImageContainer (0x55ff1ea53bb0)
             RTTI typeinfo:   itk::ImportImageContainer<unsigned long, itk::Vector<float, 1u> >
             Reference Count: 1
             Modified Time: 432828187
             Debug: Off
             Object Name: 
             Observers: 
               none
             Pointer: 0x55ff1f4d1270
             Container manages memory: true
             Size: 3971
             Capacity: 3971
Elapsed time: 147.062
END   <<<<<<<<<<<<<<<<<<<<



--------------------------------------------------------------------------------------
 Done with N4 correction (pre brain extraction):  0h 2m 42s
--------------------------------------------------------------------------------------


--------------------------------------------------------------------------------------
 Brain extraction using the following steps:
   1) Register /home/mpib/LNDG/StateSwitch/WIP_rest/preproc/B_data/C_standards/ANTS/MICCAI2012-Multi-Atlas-Challenge-Data/T_template0.nii.gz to /home/mpib/LNDG/StateSwitch/WIP_rest/preproc/B_data/D_preproc/1124/mri/t1/tempANTs/1124_t1_ANTsBET_N4Corrected0.nii.gz
   2) Warp /home/mpib/LNDG/StateSwitch/WIP_rest/preproc/B_data/C_standards/ANTS/MICCAI2012-Multi-Atlas-Challenge-Data/T_template0_BrainCerebellumProbabilityMask.nii.gz to /home/mpib/LNDG/StateSwitch/WIP_rest/preproc/B_data/D_preproc/1124/mri/t1/1124_t1.nii.gz using, from 1),
      /home/mpib/LNDG/StateSwitch/WIP_rest/preproc/B_data/D_preproc/1124/mri/t1/tempANTs/1124_t1_ANTsBET_BrainExtractionWarp/Affine
   3) Refine segmentation results using Atropos
--------------------------------------------------------------------------------------

BEGIN >>>>>>>>>>>>>>>>>>>>
/usr/lib/ants//ResampleImageBySpacing 3 /home/mpib/LNDG/StateSwitch/WIP_rest/preproc/B_data/C_standards/ANTS/MICCAI2012-Multi-Atlas-Challenge-Data/T_template0.nii.gz /home/mpib/LNDG/StateSwitch/WIP_rest/preproc/B_data/D_preproc/1124/mri/t1/tempANTs/1124_t1_ANTsBET_BrainExtractionInitialAffineFixed.nii.gz 4 4 4 1
 spacing [1, 1, 1] dim 3
 spacing2 [4, 4, 4]
 smoothing by : 3 dir 0
 smoothing by : 3 dir 1
 smoothing by : 3 dir 2
 out space [4, 4, 4]
 output size [54, 64, 72] spc [4, 4, 4]
END   <<<<<<<<<<<<<<<<<<<<


BEGIN >>>>>>>>>>>>>>>>>>>>
/usr/lib/ants//ResampleImageBySpacing 3 /home/mpib/LNDG/StateSwitch/WIP_rest/preproc/B_data/D_preproc/1124/mri/t1/tempANTs/1124_t1_ANTsBET_N4Corrected0.nii.gz /home/mpib/LNDG/StateSwitch/WIP_rest/preproc/B_data/D_preproc/1124/mri/t1/tempANTs/1124_t1_ANTsBET_BrainExtractionInitialAffineMoving.nii.gz 4 4 4 1
 spacing [1, 1, 1] dim 3
 spacing2 [4, 4, 4]
 smoothing by : 3 dir 0
 smoothing by : 3 dir 1
 smoothing by : 3 dir 2
 out space [4, 4, 4]
 output size [48, 64, 64] spc [4, 4, 4]
END   <<<<<<<<<<<<<<<<<<<<


BEGIN >>>>>>>>>>>>>>>>>>>>
/usr/lib/ants//ImageMath 3 /home/mpib/LNDG/StateSwitch/WIP_rest/preproc/B_data/D_preproc/1124/mri/t1/tempANTs/1124_t1_ANTsBET_BrainExtractionLaplacian.nii.gz Laplacian /home/mpib/LNDG/StateSwitch/WIP_rest/preproc/B_data/D_preproc/1124/mri/t1/tempANTs/1124_t1_ANTsBET_N4Corrected0.nii.gz 1.5 1
END   <<<<<<<<<<<<<<<<<<<<


BEGIN >>>>>>>>>>>>>>>>>>>>
/usr/lib/ants//ImageMath 3 /home/mpib/LNDG/StateSwitch/WIP_rest/preproc/B_data/D_preproc/1124/mri/t1/tempANTs/1124_t1_ANTsBET_BrainExtractionTemplateLaplacian.nii.gz Laplacian /home/mpib/LNDG/StateSwitch/WIP_rest/preproc/B_data/C_standards/ANTS/MICCAI2012-Multi-Atlas-Challenge-Data/T_template0.nii.gz 1.5 1
END   <<<<<<<<<<<<<<<<<<<<


BEGIN >>>>>>>>>>>>>>>>>>>>
/usr/lib/ants//antsAI -d 3 -v 1 -m Mattes[/home/mpib/LNDG/StateSwitch/WIP_rest/preproc/B_data/D_preproc/1124/mri/t1/tempANTs/1124_t1_ANTsBET_BrainExtractionInitialAffineFixed.nii.gz,/home/mpib/LNDG/StateSwitch/WIP_rest/preproc/B_data/D_preproc/1124/mri/t1/tempANTs/1124_t1_ANTsBET_BrainExtractionInitialAffineMoving.nii.gz,32,Regular,0.25] -t Affine[0.1] -s [15,0.1] -p 0 -c 10 -o /home/mpib/LNDG/StateSwitch/WIP_rest/preproc/B_data/D_preproc/1124/mri/t1/tempANTs/1124_t1_ANTsBET_BrainExtractionInitialAffine.mat -x //home/mpib/LNDG/StateSwitch/WIP_rest/preproc/B_data/C_standards/ANTS/MICCAI2012-Multi-Atlas-Challenge-Data/T_template0_BrainCerebellumRegistrationMask.nii.gz
Using the Mattes MI metric (number of bins = 32)
END   <<<<<<<<<<<<<<<<<<<<


BEGIN >>>>>>>>>>>>>>>>>>>>
/usr/lib/ants//antsRegistration -d 3 -u 1 -w [0.025,0.975] -o /home/mpib/LNDG/StateSwitch/WIP_rest/preproc/B_data/D_preproc/1124/mri/t1/tempANTs/1124_t1_ANTsBET_BrainExtractionPrior -r /home/mpib/LNDG/StateSwitch/WIP_rest/preproc/B_data/D_preproc/1124/mri/t1/tempANTs/1124_t1_ANTsBET_BrainExtractionInitialAffine.mat -z 1 --float 0 --verbose 1 -x [//home/mpib/LNDG/StateSwitch/WIP_rest/preproc/B_data/C_standards/ANTS/MICCAI2012-Multi-Atlas-Challenge-Data/T_template0_BrainCerebellumRegistrationMask.nii.gz] -m MI[/home/mpib/LNDG/StateSwitch/WIP_rest/preproc/B_data/C_standards/ANTS/MICCAI2012-Multi-Atlas-Challenge-Data/T_template0.nii.gz,/home/mpib/LNDG/StateSwitch/WIP_rest/preproc/B_data/D_preproc/1124/mri/t1/tempANTs/1124_t1_ANTsBET_N4Corrected0.nii.gz,1,32,Regular,0.25] -c [1000x500x250x100,1e-8,10] -t Rigid[0.1] -f 8x4x2x1 -s 4x2x1x0 -m MI[/home/mpib/LNDG/StateSwitch/WIP_rest/preproc/B_data/C_standards/ANTS/MICCAI2012-Multi-Atlas-Challenge-Data/T_template0.nii.gz,/home/mpib/LNDG/StateSwitch/WIP_rest/preproc/B_data/D_preproc/1124/mri/t1/tempANTs/1124_t1_ANTsBET_N4Corrected0.nii.gz,1,32,Regular,0.25] -c [1000x500x250x100,1e-8,10] -t Affine[0.1] -f 8x4x2x1 -s 4x2x1x0 -m CC[/home/mpib/LNDG/StateSwitch/WIP_rest/preproc/B_data/C_standards/ANTS/MICCAI2012-Multi-Atlas-Challenge-Data/T_template0.nii.gz,/home/mpib/LNDG/StateSwitch/WIP_rest/preproc/B_data/D_preproc/1124/mri/t1/tempANTs/1124_t1_ANTsBET_N4Corrected0.nii.gz,0.5,4] -m CC[/home/mpib/LNDG/StateSwitch/WIP_rest/preproc/B_data/D_preproc/1124/mri/t1/tempANTs/1124_t1_ANTsBET_BrainExtractionTemplateLaplacian.nii.gz,/home/mpib/LNDG/StateSwitch/WIP_rest/preproc/B_data/D_preproc/1124/mri/t1/tempANTs/1124_t1_ANTsBET_BrainExtractionLaplacian.nii.gz,0.5,4] -c [50x10x0,1e-9,15] -t SyN[0.1,3,0] -f 4x2x1 -s 2x1x0
All_Command_lines_OK
Using double precision for computations.
=============================================================================
The composite transform comprises the following transforms (in order): 
  1. /home/mpib/LNDG/StateSwitch/WIP_rest/preproc/B_data/D_preproc/1124/mri/t1/tempANTs/1124_t1_ANTsBET_BrainExtractionInitialAffine.mat (type = AffineTransform)
=============================================================================
  Reading mask(s).
    Registration stage 0
      Fixed mask = //home/mpib/LNDG/StateSwitch/WIP_rest/preproc/B_data/C_standards/ANTS/MICCAI2012-Multi-Atlas-Challenge-Data/T_template0_BrainCerebellumRegistrationMask.nii.gz
  number of levels = 4
  number of levels = 4
  number of levels = 3
  fixed image: /home/mpib/LNDG/StateSwitch/WIP_rest/preproc/B_data/C_standards/ANTS/MICCAI2012-Multi-Atlas-Challenge-Data/T_template0.nii.gz
  moving image: /home/mpib/LNDG/StateSwitch/WIP_rest/preproc/B_data/D_preproc/1124/mri/t1/tempANTs/1124_t1_ANTsBET_N4Corrected0.nii.gz
  fixed image: /home/mpib/LNDG/StateSwitch/WIP_rest/preproc/B_data/C_standards/ANTS/MICCAI2012-Multi-Atlas-Challenge-Data/T_template0.nii.gz
  moving image: /home/mpib/LNDG/StateSwitch/WIP_rest/preproc/B_data/D_preproc/1124/mri/t1/tempANTs/1124_t1_ANTsBET_N4Corrected0.nii.gz
  fixed image: /home/mpib/LNDG/StateSwitch/WIP_rest/preproc/B_data/C_standards/ANTS/MICCAI2012-Multi-Atlas-Challenge-Data/T_template0.nii.gz
  moving image: /home/mpib/LNDG/StateSwitch/WIP_rest/preproc/B_data/D_preproc/1124/mri/t1/tempANTs/1124_t1_ANTsBET_N4Corrected0.nii.gz
  fixed image: /home/mpib/LNDG/StateSwitch/WIP_rest/preproc/B_data/D_preproc/1124/mri/t1/tempANTs/1124_t1_ANTsBET_BrainExtractionTemplateLaplacian.nii.gz
  moving image: /home/mpib/LNDG/StateSwitch/WIP_rest/preproc/B_data/D_preproc/1124/mri/t1/tempANTs/1124_t1_ANTsBET_BrainExtractionLaplacian.nii.gz
Dimension = 3
Number of stages = 3
Use Histogram Matching true
Winsorize image intensities true
Lower quantile = 0.025
Upper quantile = 0.975
Stage 1 State
   Image metric = Mattes
     Fixed image = Image (0x55e6f69297e0)
  RTTI typeinfo:   itk::Image<double, 3u>
  Reference Count: 2
  Modified Time: 1666
  Debug: Off
  Object Name: 
  Observers: 
    none
  Source: (none)
  Source output name: (none)
  Release Data: Off
  Data Released: False
  Global Release Data: Off
  PipelineMTime: 0
  UpdateMTime: 1501
  RealTimeStamp: 0 seconds 
  LargestPossibleRegion: 
    Dimension: 3
    Index: [0, 0, 0]
    Size: [216, 256, 291]
  BufferedRegion: 
    Dimension: 3
    Index: [0, 0, 0]
    Size: [216, 256, 291]
  RequestedRegion: 
    Dimension: 3
    Index: [0, 0, 0]
    Size: [216, 256, 291]
  Spacing: [1, 1, 1]
  Origin: [0, 293, 0]
  Direction: 
1 0 0
0 -0 -1
0 -1 -0

  IndexToPointMatrix: 
1 0 0
0 0 -1
0 -1 0

  PointToIndexMatrix: 
1 0 0
0 0 -1
0 -1 0

  Inverse Direction: 
1 0 0
0 0 -1
0 -1 0

  PixelContainer: 
    ImportImageContainer (0x55e6f692d9d0)
      RTTI typeinfo:   itk::ImportImageContainer<unsigned long, double>
      Reference Count: 1
      Modified Time: 1498
      Debug: Off
      Object Name: 
      Observers: 
        none
      Pointer: 0x7fc701b3b010
      Container manages memory: true
      Size: 16091136
      Capacity: 16091136

     Moving image = Image (0x55e6f692b620)
  RTTI typeinfo:   itk::Image<double, 3u>
  Reference Count: 2
  Modified Time: 1667
  Debug: Off
  Object Name: 
  Observers: 
    none
  Source: (none)
  Source output name: (none)
  Release Data: Off
  Data Released: False
  Global Release Data: Off
  PipelineMTime: 0
  UpdateMTime: 1664
  RealTimeStamp: 0 seconds 
  LargestPossibleRegion: 
    Dimension: 3
    Index: [0, 0, 0]
    Size: [192, 256, 256]
  BufferedRegion: 
    Dimension: 3
    Index: [0, 0, 0]
    Size: [192, 256, 256]
  RequestedRegion: 
    Dimension: 3
    Index: [0, 0, 0]
    Size: [192, 256, 256]
  Spacing: [1, 1, 1]
  Origin: [-101.595, 100.681, -124.893]
  Direction: 
0.999505 0.0265953 0.0167952
0.026173 -0.999348 0.0248804
-0.017446 0.0244286 0.999549

  IndexToPointMatrix: 
0.999505 0.0265953 0.0167952
0.026173 -0.999348 0.0248804
-0.017446 0.0244286 0.999549

  PointToIndexMatrix: 
0.999505 0.026173 -0.017446
0.0265953 -0.999348 0.0244286
0.0167952 0.0248804 0.999549

  Inverse Direction: 
0.999505 0.026173 -0.017446
0.0265953 -0.999348 0.0244286
0.0167952 0.0248804 0.999549

  PixelContainer: 
    ImportImageContainer (0x55e6f692d8c0)
      RTTI typeinfo:   itk::ImportImageContainer<unsigned long, double>
      Reference Count: 1
      Modified Time: 1661
      Debug: Off
      Object Name: 
      Observers: 
        none
      Pointer: 0x7fc6fbb3a010
      Container manages memory: true
      Size: 12582912
      Capacity: 12582912

     Weighting = 1
     Sampling strategy = regular
     Number of bins = 32
     Radius = 4
     Sampling percentage  = 0.25
   Transform = Rigid
     Gradient step = 0.1
     Update field sigma (voxel space) = 0
     Total field sigma (voxel space) = 0
     Update field time sigma = 0
     Total field time sigma  = 0
     Number of time indices = 0
     Number of time point samples = 0
Stage 2 State
   Image metric = Mattes
     Fixed image = Image (0x55e6f6936910)
  RTTI typeinfo:   itk::Image<double, 3u>
  Reference Count: 2
  Modified Time: 1994
  Debug: Off
  Object Name: 
  Observers: 
    none
  Source: (none)
  Source output name: (none)
  Release Data: Off
  Data Released: False
  Global Release Data: Off
  PipelineMTime: 0
  UpdateMTime: 1829
  RealTimeStamp: 0 seconds 
  LargestPossibleRegion: 
    Dimension: 3
    Index: [0, 0, 0]
    Size: [216, 256, 291]
  BufferedRegion: 
    Dimension: 3
    Index: [0, 0, 0]
    Size: [216, 256, 291]
  RequestedRegion: 
    Dimension: 3
    Index: [0, 0, 0]
    Size: [216, 256, 291]
  Spacing: [1, 1, 1]
  Origin: [0, 293, 0]
  Direction: 
1 0 0
0 -0 -1
0 -1 -0

  IndexToPointMatrix: 
1 0 0
0 0 -1
0 -1 0

  PointToIndexMatrix: 
1 0 0
0 0 -1
0 -1 0

  Inverse Direction: 
1 0 0
0 0 -1
0 -1 0

  PixelContainer: 
    ImportImageContainer (0x55e6f692d3a0)
      RTTI typeinfo:   itk::ImportImageContainer<unsigned long, double>
      Reference Count: 1
      Modified Time: 1826
      Debug: Off
      Object Name: 
      Observers: 
        none
      Pointer: 0x7fc6f4075010
      Container manages memory: true
      Size: 16091136
      Capacity: 16091136

     Moving image = Image (0x55e6f693c040)
  RTTI typeinfo:   itk::Image<double, 3u>
  Reference Count: 2
  Modified Time: 1995
  Debug: Off
  Object Name: 
  Observers: 
    none
  Source: (none)
  Source output name: (none)
  Release Data: Off
  Data Released: False
  Global Release Data: Off
  PipelineMTime: 0
  UpdateMTime: 1992
  RealTimeStamp: 0 seconds 
  LargestPossibleRegion: 
    Dimension: 3
    Index: [0, 0, 0]
    Size: [192, 256, 256]
  BufferedRegion: 
    Dimension: 3
    Index: [0, 0, 0]
    Size: [192, 256, 256]
  RequestedRegion: 
    Dimension: 3
    Index: [0, 0, 0]
    Size: [192, 256, 256]
  Spacing: [1, 1, 1]
  Origin: [-101.595, 100.681, -124.893]
  Direction: 
0.999505 0.0265953 0.0167952
0.026173 -0.999348 0.0248804
-0.017446 0.0244286 0.999549

  IndexToPointMatrix: 
0.999505 0.0265953 0.0167952
0.026173 -0.999348 0.0248804
-0.017446 0.0244286 0.999549

  PointToIndexMatrix: 
0.999505 0.026173 -0.017446
0.0265953 -0.999348 0.0244286
0.0167952 0.0248804 0.999549

  Inverse Direction: 
0.999505 0.026173 -0.017446
0.0265953 -0.999348 0.0244286
0.0167952 0.0248804 0.999549

  PixelContainer: 
    ImportImageContainer (0x55e6f692f830)
      RTTI typeinfo:   itk::ImportImageContainer<unsigned long, double>
      Reference Count: 1
      Modified Time: 1989
      Debug: Off
      Object Name: 
      Observers: 
        none
      Pointer: 0x7fc6ee074010
      Container manages memory: true
      Size: 12582912
      Capacity: 12582912

     Weighting = 1
     Sampling strategy = regular
     Number of bins = 32
     Radius = 4
     Sampling percentage  = 0.25
   Transform = Affine
     Gradient step = 0.1
     Update field sigma (voxel space) = 0
     Total field sigma (voxel space) = 0
     Update field time sigma = 0
     Total field time sigma  = 0
     Number of time indices = 0
     Number of time point samples = 0
Stage 3 State
   Image metric = CC
     Fixed image = Image (0x55e6f693dd80)
  RTTI typeinfo:   itk::Image<double, 3u>
  Reference Count: 2
  Modified Time: 2322
  Debug: Off
  Object Name: 
  Observers: 
    none
  Source: (none)
  Source output name: (none)
  Release Data: Off
  Data Released: False
  Global Release Data: Off
  PipelineMTime: 0
  UpdateMTime: 2157
  RealTimeStamp: 0 seconds 
  LargestPossibleRegion: 
    Dimension: 3
    Index: [0, 0, 0]
    Size: [216, 256, 291]
  BufferedRegion: 
    Dimension: 3
    Index: [0, 0, 0]
    Size: [216, 256, 291]
  RequestedRegion: 
    Dimension: 3
    Index: [0, 0, 0]
    Size: [216, 256, 291]
  Spacing: [1, 1, 1]
  Origin: [0, 293, 0]
  Direction: 
1 0 0
0 -0 -1
0 -1 -0

  IndexToPointMatrix: 
1 0 0
0 0 -1
0 -1 0

  PointToIndexMatrix: 
1 0 0
0 0 -1
0 -1 0

  Inverse Direction: 
1 0 0
0 0 -1
0 -1 0

  PixelContainer: 
    ImportImageContainer (0x55e6f69398c0)
      RTTI typeinfo:   itk::ImportImageContainer<unsigned long, double>
      Reference Count: 1
      Modified Time: 2154
      Debug: Off
      Object Name: 
      Observers: 
        none
      Pointer: 0x7fc6e65af010
      Container manages memory: true
      Size: 16091136
      Capacity: 16091136

     Moving image = Image (0x55e6f693fe00)
  RTTI typeinfo:   itk::Image<double, 3u>
  Reference Count: 2
  Modified Time: 2323
  Debug: Off
  Object Name: 
  Observers: 
    none
  Source: (none)
  Source output name: (none)
  Release Data: Off
  Data Released: False
  Global Release Data: Off
  PipelineMTime: 0
  UpdateMTime: 2320
  RealTimeStamp: 0 seconds 
  LargestPossibleRegion: 
    Dimension: 3
    Index: [0, 0, 0]
    Size: [192, 256, 256]
  BufferedRegion: 
    Dimension: 3
    Index: [0, 0, 0]
    Size: [192, 256, 256]
  RequestedRegion: 
    Dimension: 3
    Index: [0, 0, 0]
    Size: [192, 256, 256]
  Spacing: [1, 1, 1]
  Origin: [-101.595, 100.681, -124.893]
  Direction: 
0.999505 0.0265953 0.0167952
0.026173 -0.999348 0.0248804
-0.017446 0.0244286 0.999549

  IndexToPointMatrix: 
0.999505 0.0265953 0.0167952
0.026173 -0.999348 0.0248804
-0.017446 0.0244286 0.999549

  PointToIndexMatrix: 
0.999505 0.026173 -0.017446
0.0265953 -0.999348 0.0244286
0.0167952 0.0248804 0.999549

  Inverse Direction: 
0.999505 0.026173 -0.017446
0.0265953 -0.999348 0.0244286
0.0167952 0.0248804 0.999549

  PixelContainer: 
    ImportImageContainer (0x55e6f6939e10)
      RTTI typeinfo:   itk::ImportImageContainer<unsigned long, double>
      Reference Count: 1
      Modified Time: 2317
      Debug: Off
      Object Name: 
      Observers: 
        none
      Pointer: 0x7fc6e05ae010
      Container manages memory: true
      Size: 12582912
      Capacity: 12582912

     Weighting = 0.5
     Sampling strategy = none
     Number of bins = 32
     Radius = 4
     Sampling percentage  = 1
   Transform = SyN
     Gradient step = 0.1
     Update field sigma (voxel space) = 3
     Total field sigma (voxel space) = 0
     Update field time sigma = 0
     Total field time sigma  = 0
     Number of time indices = 0
     Number of time point samples = 0
Registration using 3 total stages.

Stage 0
  iterations = 1000x500x250x100
  convergence threshold = 1e-08
  convergence window size = 10
  number of levels = 4
  using the Mattes MI metric (number of bins = 32, weight = 1)
  preprocessing:  winsorizing the image intensities
  preprocessing:  histogram matching the images
  Shrink factors (level 1 out of 4): [8, 8, 8]
  Shrink factors (level 2 out of 4): [4, 4, 4]
  Shrink factors (level 3 out of 4): [2, 2, 2]
  Shrink factors (level 4 out of 4): [1, 1, 1]
  smoothing sigmas per level: [4, 2, 1, 0]
  regular sampling (percentage = 0.25)

*** Running Euler3DTransform registration ***

DIAGNOSTIC,Iteration,metricValue,convergenceValue,ITERATION_TIME_INDEX,SINCE_LAST
 2DIAGNOSTIC,     1, -9.035156463450e-01, 1.797693134862e+308, 1.3994e+01, 1.3994e+01, 
 2DIAGNOSTIC,     2, -9.043834412053e-01, 1.797693134862e+308, 1.4008e+01, 1.4590e-02, 
 2DIAGNOSTIC,     3, -9.055075897369e-01, 1.797693134862e+308, 1.4024e+01, 1.5358e-02, 
 2DIAGNOSTIC,     4, -9.064208816885e-01, 1.797693134862e+308, 1.4038e+01, 1.4411e-02, 
