------------------------------------------
Setting up environment variables
---
LD_LIBRARY_PATH is .:/opt/matlab/R2014b//runtime/glnxa64:/opt/matlab/R2014b//bin/glnxa64:/opt/matlab/R2014b//sys/os/glnxa64:/opt/matlab/R2014b//sys/opengl/lib/glnxa64
Will attempt to process 1219_rest_feat
/home/mpib/LNDG/StateSwitch/WIP_rest/preproc/B_data/D_preproc/1219/preproc/rest/FEAT.feat/filtered_func_data.nii.gz: will be detrended
Detrending /home/mpib/LNDG/StateSwitch/WIP_rest/preproc/B_data/D_preproc/1219/preproc/rest/FEAT.feat/filtered_func_data.nii.gz using PolyOrder 3
/home/mpib/LNDG/StateSwitch/WIP_rest/preproc/B_data/D_preproc/1219/preproc/rest/1219_rest_feat_detrended.nii.gz created: detrending done

OutputStage =

bandpassed

Loading 1219_rest_feat_detrended.nii.gz
1219_rest_feat_detrended.nii.gz will be bandpassed
Filter Order: 8
Using Highpass: 0.01
Using Lowpass: 0.1
1219_rest_feat_detrended_bandpassed.nii.gz created: filtering done.
