------------------------------------------
Setting up environment variables
---
LD_LIBRARY_PATH is .:/opt/matlab/R2014b//runtime/glnxa64:/opt/matlab/R2014b//bin/glnxa64:/opt/matlab/R2014b//sys/os/glnxa64:/opt/matlab/R2014b//sys/opengl/lib/glnxa64
Will attempt to process 2118_rest_feat
/home/mpib/LNDG/StateSwitch/WIP_rest/preproc/B_data/D_preproc/2118/preproc/rest/FEAT.feat/filtered_func_data.nii.gz: will be detrended
  MException with properties:

    identifier: 'MATLAB:gunzip:javaCopyStreamError'
       message: 'Unexpected end of input stream when attempting to GUNZIP ...'
         cause: {0x1 cell}
         stack: [6x1 struct]

/home/mpib/LNDG/StateSwitch/WIP_rest/preproc/B_data/D_preproc/2118/preproc/rest/FEAT.feat/filtered_func_data.nii.gz did NOT want to load!
