
Final result: 
0.998593 0.004533 -0.052827 31.800055 
0.000162 0.996073 0.088535 5.885494 
0.053021 -0.088419 0.994671 -60.027358 
0.000000 0.000000 0.000000 1.000000 


Melodic Version 3.14

Melodic results will be in /home/mpib/LNDG/StateSwitch/WIP_rest/preproc/B_data/D_preproc/2145/preproc/rest/FEAT.feat/filtered_func_data.ica

Create mask ... done
Reading data file /home/mpib/LNDG/StateSwitch/WIP_rest/preproc/B_data/D_preproc/2145/preproc/rest/2145_rest_feat_detrended_bandpassed  ...  done
  Estimating data smoothness ...  done 
  Removing mean image ... done
  Normalising by voxel-wise variance ... done
Excluding voxels with constant value ... done

  Data size : 988 x 64863

Starting PCA  ... done
Start whitening using  30 dimensions ... 
  retaining 87.1423 percent of the variability 
 ... done

Starting ICA estimation using symm

  Step no. 1 change : 0.854496
  Step no. 2 change : 0.166398
  Step no. 3 change : 0.055608
  Step no. 4 change : 0.0357659
  Step no. 5 change : 0.0314362
  Step no. 6 change : 0.0185608
  Step no. 7 change : 0.013045
  Step no. 8 change : 0.0110933
  Step no. 9 change : 0.0117827
  Step no. 10 change : 0.0145317
  Step no. 11 change : 0.0124991
  Step no. 12 change : 0.0140186
  Step no. 13 change : 0.0192253
  Step no. 14 change : 0.0171356
  Step no. 15 change : 0.00854958
  Step no. 16 change : 0.00300226
  Step no. 17 change : 0.00129811
  Step no. 18 change : 0.00106589
  Step no. 19 change : 0.000913583
  Step no. 20 change : 0.00081798
  Step no. 21 change : 0.000883098
  Step no. 22 change : 0.00104307
  Step no. 23 change : 0.00121709
  Step no. 24 change : 0.00138013
  Step no. 25 change : 0.00149894
  Step no. 26 change : 0.00153991
  Step no. 27 change : 0.00148241
  Step no. 28 change : 0.00133024
  Step no. 29 change : 0.00137352
  Step no. 30 change : 0.00148826
  Step no. 31 change : 0.00151284
  Step no. 32 change : 0.00142433
  Step no. 33 change : 0.00122997
  Step no. 34 change : 0.000970381
  Step no. 35 change : 0.000701834
  Step no. 36 change : 0.000470192
  Step no. 37 change : 0.000296288
  Step no. 38 change : 0.000178713
  Step no. 39 change : 0.000104981
  Step no. 40 change : 6.10017e-05
  Step no. 41 change : 3.59208e-05
  Convergence after 41 steps 

Sorting IC maps

Writing results to : 
  /home/mpib/LNDG/StateSwitch/WIP_rest/preproc/B_data/D_preproc/2145/preproc/rest/FEAT.feat/filtered_func_data.ica/melodic_IC
  /home/mpib/LNDG/StateSwitch/WIP_rest/preproc/B_data/D_preproc/2145/preproc/rest/FEAT.feat/filtered_func_data.ica/melodic_Tmodes
  /home/mpib/LNDG/StateSwitch/WIP_rest/preproc/B_data/D_preproc/2145/preproc/rest/FEAT.feat/filtered_func_data.ica/melodic_mix
  /home/mpib/LNDG/StateSwitch/WIP_rest/preproc/B_data/D_preproc/2145/preproc/rest/FEAT.feat/filtered_func_data.ica/melodic_FTmix
  /home/mpib/LNDG/StateSwitch/WIP_rest/preproc/B_data/D_preproc/2145/preproc/rest/FEAT.feat/filtered_func_data.ica/melodic_PPCA
  /home/mpib/LNDG/StateSwitch/WIP_rest/preproc/B_data/D_preproc/2145/preproc/rest/FEAT.feat/filtered_func_data.ica/melodic_ICstats
  /home/mpib/LNDG/StateSwitch/WIP_rest/preproc/B_data/D_preproc/2145/preproc/rest/FEAT.feat/filtered_func_data.ica/mask
...done
Creating report index page ...done


Running Mixture Modelling on Z-transformed IC maps ...
  IC map 1 ... 
   calculating mixture-model fit 
   saving probability map:    /home/mpib/LNDG/StateSwitch/WIP_rest/preproc/B_data/D_preproc/2145/preproc/rest/FEAT.feat/filtered_func_data.ica/stats/probmap_1
   saving mixture model fit:  /home/mpib/LNDG/StateSwitch/WIP_rest/preproc/B_data/D_preproc/2145/preproc/rest/FEAT.feat/filtered_func_data.ica/stats/MMstats_1
   re-scaling spatial maps ... 
   thresholding ... 
   alternative hypothesis test at p > 0.5
   saving thresholded Z-stats image:  /home/mpib/LNDG/StateSwitch/WIP_rest/preproc/B_data/D_preproc/2145/preproc/rest/FEAT.feat/filtered_func_data.ica/stats/thresh_zstat1
   creating report page ...    done
  IC map 2 ... 
   calculating mixture-model fit 
   saving probability map:    /home/mpib/LNDG/StateSwitch/WIP_rest/preproc/B_data/D_preproc/2145/preproc/rest/FEAT.feat/filtered_func_data.ica/stats/probmap_2
   saving mixture model fit:  /home/mpib/LNDG/StateSwitch/WIP_rest/preproc/B_data/D_preproc/2145/preproc/rest/FEAT.feat/filtered_func_data.ica/stats/MMstats_2
   re-scaling spatial maps ... 
   thresholding ... 
   alternative hypothesis test at p > 0.5
   saving thresholded Z-stats image:  /home/mpib/LNDG/StateSwitch/WIP_rest/preproc/B_data/D_preproc/2145/preproc/rest/FEAT.feat/filtered_func_data.ica/stats/thresh_zstat2
   creating report page ...    done
  IC map 3 ... 
   calculating mixture-model fit 
   saving probability map:    /home/mpib/LNDG/StateSwitch/WIP_rest/preproc/B_data/D_preproc/2145/preproc/rest/FEAT.feat/filtered_func_data.ica/stats/probmap_3
   saving mixture model fit:  /home/mpib/LNDG/StateSwitch/WIP_rest/preproc/B_data/D_preproc/2145/preproc/rest/FEAT.feat/filtered_func_data.ica/stats/MMstats_3
   re-scaling spatial maps ... 
   thresholding ... 
   alternative hypothesis test at p > 0.5
   saving thresholded Z-stats image:  /home/mpib/LNDG/StateSwitch/WIP_rest/preproc/B_data/D_preproc/2145/preproc/rest/FEAT.feat/filtered_func_data.ica/stats/thresh_zstat3
   creating report page ...    done
  IC map 4 ... 
   calculating mixture-model fit 
   saving probability map:    /home/mpib/LNDG/StateSwitch/WIP_rest/preproc/B_data/D_preproc/2145/preproc/rest/FEAT.feat/filtered_func_data.ica/stats/probmap_4
   saving mixture model fit:  /home/mpib/LNDG/StateSwitch/WIP_rest/preproc/B_data/D_preproc/2145/preproc/rest/FEAT.feat/filtered_func_data.ica/stats/MMstats_4
   re-scaling spatial maps ... 
   thresholding ... 
   alternative hypothesis test at p > 0.5
   saving thresholded Z-stats image:  /home/mpib/LNDG/StateSwitch/WIP_rest/preproc/B_data/D_preproc/2145/preproc/rest/FEAT.feat/filtered_func_data.ica/stats/thresh_zstat4
   creating report page ...    done
  IC map 5 ... 
   calculating mixture-model fit 
   saving probability map:    /home/mpib/LNDG/StateSwitch/WIP_rest/preproc/B_data/D_preproc/2145/preproc/rest/FEAT.feat/filtered_func_data.ica/stats/probmap_5
   saving mixture model fit:  /home/mpib/LNDG/StateSwitch/WIP_rest/preproc/B_data/D_preproc/2145/preproc/rest/FEAT.feat/filtered_func_data.ica/stats/MMstats_5
   re-scaling spatial maps ... 
   thresholding ... 
   alternative hypothesis test at p > 0.5
   saving thresholded Z-stats image:  /home/mpib/LNDG/StateSwitch/WIP_rest/preproc/B_data/D_preproc/2145/preproc/rest/FEAT.feat/filtered_func_data.ica/stats/thresh_zstat5
   creating report page ...    done
  IC map 6 ... 
   calculating mixture-model fit 
   saving probability map:    /home/mpib/LNDG/StateSwitch/WIP_rest/preproc/B_data/D_preproc/2145/preproc/rest/FEAT.feat/filtered_func_data.ica/stats/probmap_6
   saving mixture model fit:  /home/mpib/LNDG/StateSwitch/WIP_rest/preproc/B_data/D_preproc/2145/preproc/rest/FEAT.feat/filtered_func_data.ica/stats/MMstats_6
   re-scaling spatial maps ... 
   thresholding ... 
   alternative hypothesis test at p > 0.5
   saving thresholded Z-stats image:  /home/mpib/LNDG/StateSwitch/WIP_rest/preproc/B_data/D_preproc/2145/preproc/rest/FEAT.feat/filtered_func_data.ica/stats/thresh_zstat6
   creating report page ...    done
  IC map 7 ... 
   calculating mixture-model fit 
   saving probability map:    /home/mpib/LNDG/StateSwitch/WIP_rest/preproc/B_data/D_preproc/2145/preproc/rest/FEAT.feat/filtered_func_data.ica/stats/probmap_7
   saving mixture model fit:  /home/mpib/LNDG/StateSwitch/WIP_rest/preproc/B_data/D_preproc/2145/preproc/rest/FEAT.feat/filtered_func_data.ica/stats/MMstats_7
   re-scaling spatial maps ... 
   thresholding ... 
   alternative hypothesis test at p > 0.5
   saving thresholded Z-stats image:  /home/mpib/LNDG/StateSwitch/WIP_rest/preproc/B_data/D_preproc/2145/preproc/rest/FEAT.feat/filtered_func_data.ica/stats/thresh_zstat7
   creating report page ...    done
  IC map 8 ... 
   calculating mixture-model fit 
   saving probability map:    /home/mpib/LNDG/StateSwitch/WIP_rest/preproc/B_data/D_preproc/2145/preproc/rest/FEAT.feat/filtered_func_data.ica/stats/probmap_8
   saving mixture model fit:  /home/mpib/LNDG/StateSwitch/WIP_rest/preproc/B_data/D_preproc/2145/preproc/rest/FEAT.feat/filtered_func_data.ica/stats/MMstats_8
   re-scaling spatial maps ... 
   thresholding ... 
   alternative hypothesis test at p > 0.5
   saving thresholded Z-stats image:  /home/mpib/LNDG/StateSwitch/WIP_rest/preproc/B_data/D_preproc/2145/preproc/rest/FEAT.feat/filtered_func_data.ica/stats/thresh_zstat8
   creating report page ...    done
  IC map 9 ... 
   calculating mixture-model fit 
   saving probability map:    /home/mpib/LNDG/StateSwitch/WIP_rest/preproc/B_data/D_preproc/2145/preproc/rest/FEAT.feat/filtered_func_data.ica/stats/probmap_9
   saving mixture model fit:  /home/mpib/LNDG/StateSwitch/WIP_rest/preproc/B_data/D_preproc/2145/preproc/rest/FEAT.feat/filtered_func_data.ica/stats/MMstats_9
   re-scaling spatial maps ... 
   thresholding ... 
   alternative hypothesis test at p > 0.5
   saving thresholded Z-stats image:  /home/mpib/LNDG/StateSwitch/WIP_rest/preproc/B_data/D_preproc/2145/preproc/rest/FEAT.feat/filtered_func_data.ica/stats/thresh_zstat9
   creating report page ...    done
  IC map 10 ... 
   calculating mixture-model fit 
   saving probability map:    /home/mpib/LNDG/StateSwitch/WIP_rest/preproc/B_data/D_preproc/2145/preproc/rest/FEAT.feat/filtered_func_data.ica/stats/probmap_10
   saving mixture model fit:  /home/mpib/LNDG/StateSwitch/WIP_rest/preproc/B_data/D_preproc/2145/preproc/rest/FEAT.feat/filtered_func_data.ica/stats/MMstats_10
   re-scaling spatial maps ... 
   thresholding ... 
   alternative hypothesis test at p > 0.5
   saving thresholded Z-stats image:  /home/mpib/LNDG/StateSwitch/WIP_rest/preproc/B_data/D_preproc/2145/preproc/rest/FEAT.feat/filtered_func_data.ica/stats/thresh_zstat10
   creating report page ...    done
  IC map 11 ... 
   calculating mixture-model fit 
   saving probability map:    /home/mpib/LNDG/StateSwitch/WIP_rest/preproc/B_data/D_preproc/2145/preproc/rest/FEAT.feat/filtered_func_data.ica/stats/probmap_11
   saving mixture model fit:  /home/mpib/LNDG/StateSwitch/WIP_rest/preproc/B_data/D_preproc/2145/preproc/rest/FEAT.feat/filtered_func_data.ica/stats/MMstats_11
   re-scaling spatial maps ... 
   thresholding ... 
   alternative hypothesis test at p > 0.5
   saving thresholded Z-stats image:  /home/mpib/LNDG/StateSwitch/WIP_rest/preproc/B_data/D_preproc/2145/preproc/rest/FEAT.feat/filtered_func_data.ica/stats/thresh_zstat11
   creating report page ...    done
  IC map 12 ... 
   calculating mixture-model fit 
   saving probability map:    /home/mpib/LNDG/StateSwitch/WIP_rest/preproc/B_data/D_preproc/2145/preproc/rest/FEAT.feat/filtered_func_data.ica/stats/probmap_12
   saving mixture model fit:  /home/mpib/LNDG/StateSwitch/WIP_rest/preproc/B_data/D_preproc/2145/preproc/rest/FEAT.feat/filtered_func_data.ica/stats/MMstats_12
   re-scaling spatial maps ... 
   thresholding ... 
   alternative hypothesis test at p > 0.5
   saving thresholded Z-stats image:  /home/mpib/LNDG/StateSwitch/WIP_rest/preproc/B_data/D_preproc/2145/preproc/rest/FEAT.feat/filtered_func_data.ica/stats/thresh_zstat12
   creating report page ...    done
  IC map 13 ... 
   calculating mixture-model fit 
   saving probability map:    /home/mpib/LNDG/StateSwitch/WIP_rest/preproc/B_data/D_preproc/2145/preproc/rest/FEAT.feat/filtered_func_data.ica/stats/probmap_13
   saving mixture model fit:  /home/mpib/LNDG/StateSwitch/WIP_rest/preproc/B_data/D_preproc/2145/preproc/rest/FEAT.feat/filtered_func_data.ica/stats/MMstats_13
   re-scaling spatial maps ... 
   thresholding ... 
   alternative hypothesis test at p > 0.5
   saving thresholded Z-stats image:  /home/mpib/LNDG/StateSwitch/WIP_rest/preproc/B_data/D_preproc/2145/preproc/rest/FEAT.feat/filtered_func_data.ica/stats/thresh_zstat13
   creating report page ...    done
  IC map 14 ... 
   calculating mixture-model fit 
   saving probability map:    /home/mpib/LNDG/StateSwitch/WIP_rest/preproc/B_data/D_preproc/2145/preproc/rest/FEAT.feat/filtered_func_data.ica/stats/probmap_14
   saving mixture model fit:  /home/mpib/LNDG/StateSwitch/WIP_rest/preproc/B_data/D_preproc/2145/preproc/rest/FEAT.feat/filtered_func_data.ica/stats/MMstats_14
   re-scaling spatial maps ... 
   thresholding ... 
   alternative hypothesis test at p > 0.5
   saving thresholded Z-stats image:  /home/mpib/LNDG/StateSwitch/WIP_rest/preproc/B_data/D_preproc/2145/preproc/rest/FEAT.feat/filtered_func_data.ica/stats/thresh_zstat14
   creating report page ...    done
  IC map 15 ... 
   calculating mixture-model fit 
   saving probability map:    /home/mpib/LNDG/StateSwitch/WIP_rest/preproc/B_data/D_preproc/2145/preproc/rest/FEAT.feat/filtered_func_data.ica/stats/probmap_15
   saving mixture model fit:  /home/mpib/LNDG/StateSwitch/WIP_rest/preproc/B_data/D_preproc/2145/preproc/rest/FEAT.feat/filtered_func_data.ica/stats/MMstats_15
   re-scaling spatial maps ... 
   thresholding ... 
   alternative hypothesis test at p > 0.5
   saving thresholded Z-stats image:  /home/mpib/LNDG/StateSwitch/WIP_rest/preproc/B_data/D_preproc/2145/preproc/rest/FEAT.feat/filtered_func_data.ica/stats/thresh_zstat15
   creating report page ...    done
  IC map 16 ... 
   calculating mixture-model fit 
   saving probability map:    /home/mpib/LNDG/StateSwitch/WIP_rest/preproc/B_data/D_preproc/2145/preproc/rest/FEAT.feat/filtered_func_data.ica/stats/probmap_16
   saving mixture model fit:  /home/mpib/LNDG/StateSwitch/WIP_rest/preproc/B_data/D_preproc/2145/preproc/rest/FEAT.feat/filtered_func_data.ica/stats/MMstats_16
   re-scaling spatial maps ... 
   thresholding ... 
   alternative hypothesis test at p > 0.5
   saving thresholded Z-stats image:  /home/mpib/LNDG/StateSwitch/WIP_rest/preproc/B_data/D_preproc/2145/preproc/rest/FEAT.feat/filtered_func_data.ica/stats/thresh_zstat16
   creating report page ...    done
  IC map 17 ... 
   calculating mixture-model fit 
   saving probability map:    /home/mpib/LNDG/StateSwitch/WIP_rest/preproc/B_data/D_preproc/2145/preproc/rest/FEAT.feat/filtered_func_data.ica/stats/probmap_17
   saving mixture model fit:  /home/mpib/LNDG/StateSwitch/WIP_rest/preproc/B_data/D_preproc/2145/preproc/rest/FEAT.feat/filtered_func_data.ica/stats/MMstats_17
   re-scaling spatial maps ... 
   thresholding ... 
   alternative hypothesis test at p > 0.5
   saving thresholded Z-stats image:  /home/mpib/LNDG/StateSwitch/WIP_rest/preproc/B_data/D_preproc/2145/preproc/rest/FEAT.feat/filtered_func_data.ica/stats/thresh_zstat17
   creating report page ...    done
  IC map 18 ... 
   calculating mixture-model fit 
   saving probability map:    /home/mpib/LNDG/StateSwitch/WIP_rest/preproc/B_data/D_preproc/2145/preproc/rest/FEAT.feat/filtered_func_data.ica/stats/probmap_18
   saving mixture model fit:  /home/mpib/LNDG/StateSwitch/WIP_rest/preproc/B_data/D_preproc/2145/preproc/rest/FEAT.feat/filtered_func_data.ica/stats/MMstats_18
   re-scaling spatial maps ... 
   thresholding ... 
   alternative hypothesis test at p > 0.5
   saving thresholded Z-stats image:  /home/mpib/LNDG/StateSwitch/WIP_rest/preproc/B_data/D_preproc/2145/preproc/rest/FEAT.feat/filtered_func_data.ica/stats/thresh_zstat18
   creating report page ...    done
  IC map 19 ... 
   calculating mixture-model fit 
   saving probability map:    /home/mpib/LNDG/StateSwitch/WIP_rest/preproc/B_data/D_preproc/2145/preproc/rest/FEAT.feat/filtered_func_data.ica/stats/probmap_19
   saving mixture model fit:  /home/mpib/LNDG/StateSwitch/WIP_rest/preproc/B_data/D_preproc/2145/preproc/rest/FEAT.feat/filtered_func_data.ica/stats/MMstats_19
   re-scaling spatial maps ... 
   thresholding ... 
   alternative hypothesis test at p > 0.5
   saving thresholded Z-stats image:  /home/mpib/LNDG/StateSwitch/WIP_rest/preproc/B_data/D_preproc/2145/preproc/rest/FEAT.feat/filtered_func_data.ica/stats/thresh_zstat19
   creating report page ...    done
  IC map 20 ... 
   calculating mixture-model fit 
   saving probability map:    /home/mpib/LNDG/StateSwitch/WIP_rest/preproc/B_data/D_preproc/2145/preproc/rest/FEAT.feat/filtered_func_data.ica/stats/probmap_20
   saving mixture model fit:  /home/mpib/LNDG/StateSwitch/WIP_rest/preproc/B_data/D_preproc/2145/preproc/rest/FEAT.feat/filtered_func_data.ica/stats/MMstats_20
   re-scaling spatial maps ... 
   thresholding ... 
   alternative hypothesis test at p > 0.5
   saving thresholded Z-stats image:  /home/mpib/LNDG/StateSwitch/WIP_rest/preproc/B_data/D_preproc/2145/preproc/rest/FEAT.feat/filtered_func_data.ica/stats/thresh_zstat20
   creating report page ...    done
  IC map 21 ... 
   calculating mixture-model fit 
   saving probability map:    /home/mpib/LNDG/StateSwitch/WIP_rest/preproc/B_data/D_preproc/2145/preproc/rest/FEAT.feat/filtered_func_data.ica/stats/probmap_21
   saving mixture model fit:  /home/mpib/LNDG/StateSwitch/WIP_rest/preproc/B_data/D_preproc/2145/preproc/rest/FEAT.feat/filtered_func_data.ica/stats/MMstats_21
   re-scaling spatial maps ... 
   thresholding ... 
   alternative hypothesis test at p > 0.5
   saving thresholded Z-stats image:  /home/mpib/LNDG/StateSwitch/WIP_rest/preproc/B_data/D_preproc/2145/preproc/rest/FEAT.feat/filtered_func_data.ica/stats/thresh_zstat21
   creating report page ...    done
  IC map 22 ... 
   calculating mixture-model fit 
   saving probability map:    /home/mpib/LNDG/StateSwitch/WIP_rest/preproc/B_data/D_preproc/2145/preproc/rest/FEAT.feat/filtered_func_data.ica/stats/probmap_22
   saving mixture model fit:  /home/mpib/LNDG/StateSwitch/WIP_rest/preproc/B_data/D_preproc/2145/preproc/rest/FEAT.feat/filtered_func_data.ica/stats/MMstats_22
   re-scaling spatial maps ... 
   thresholding ... 
   alternative hypothesis test at p > 0.5
   saving thresholded Z-stats image:  /home/mpib/LNDG/StateSwitch/WIP_rest/preproc/B_data/D_preproc/2145/preproc/rest/FEAT.feat/filtered_func_data.ica/stats/thresh_zstat22
   creating report page ...    done
  IC map 23 ... 
   calculating mixture-model fit 
   saving probability map:    /home/mpib/LNDG/StateSwitch/WIP_rest/preproc/B_data/D_preproc/2145/preproc/rest/FEAT.feat/filtered_func_data.ica/stats/probmap_23
   saving mixture model fit:  /home/mpib/LNDG/StateSwitch/WIP_rest/preproc/B_data/D_preproc/2145/preproc/rest/FEAT.feat/filtered_func_data.ica/stats/MMstats_23
   re-scaling spatial maps ... 
   thresholding ... 
   alternative hypothesis test at p > 0.5
   saving thresholded Z-stats image:  /home/mpib/LNDG/StateSwitch/WIP_rest/preproc/B_data/D_preproc/2145/preproc/rest/FEAT.feat/filtered_func_data.ica/stats/thresh_zstat23
   creating report page ...    done
  IC map 24 ... 
   calculating mixture-model fit 
   saving probability map:    /home/mpib/LNDG/StateSwitch/WIP_rest/preproc/B_data/D_preproc/2145/preproc/rest/FEAT.feat/filtered_func_data.ica/stats/probmap_24
   saving mixture model fit:  /home/mpib/LNDG/StateSwitch/WIP_rest/preproc/B_data/D_preproc/2145/preproc/rest/FEAT.feat/filtered_func_data.ica/stats/MMstats_24
   re-scaling spatial maps ... 
   thresholding ... 
   alternative hypothesis test at p > 0.5
   saving thresholded Z-stats image:  /home/mpib/LNDG/StateSwitch/WIP_rest/preproc/B_data/D_preproc/2145/preproc/rest/FEAT.feat/filtered_func_data.ica/stats/thresh_zstat24
   creating report page ...    done
  IC map 25 ... 
   calculating mixture-model fit 
   saving probability map:    /home/mpib/LNDG/StateSwitch/WIP_rest/preproc/B_data/D_preproc/2145/preproc/rest/FEAT.feat/filtered_func_data.ica/stats/probmap_25
   saving mixture model fit:  /home/mpib/LNDG/StateSwitch/WIP_rest/preproc/B_data/D_preproc/2145/preproc/rest/FEAT.feat/filtered_func_data.ica/stats/MMstats_25
   re-scaling spatial maps ... 
   thresholding ... 
   alternative hypothesis test at p > 0.5
   saving thresholded Z-stats image:  /home/mpib/LNDG/StateSwitch/WIP_rest/preproc/B_data/D_preproc/2145/preproc/rest/FEAT.feat/filtered_func_data.ica/stats/thresh_zstat25
   creating report page ...    done
  IC map 26 ... 
   calculating mixture-model fit 
   saving probability map:    /home/mpib/LNDG/StateSwitch/WIP_rest/preproc/B_data/D_preproc/2145/preproc/rest/FEAT.feat/filtered_func_data.ica/stats/probmap_26
   saving mixture model fit:  /home/mpib/LNDG/StateSwitch/WIP_rest/preproc/B_data/D_preproc/2145/preproc/rest/FEAT.feat/filtered_func_data.ica/stats/MMstats_26
   re-scaling spatial maps ... 
   thresholding ... 
   alternative hypothesis test at p > 0.5
   saving thresholded Z-stats image:  /home/mpib/LNDG/StateSwitch/WIP_rest/preproc/B_data/D_preproc/2145/preproc/rest/FEAT.feat/filtered_func_data.ica/stats/thresh_zstat26
   creating report page ...    done
  IC map 27 ... 
   calculating mixture-model fit 
   saving probability map:    /home/mpib/LNDG/StateSwitch/WIP_rest/preproc/B_data/D_preproc/2145/preproc/rest/FEAT.feat/filtered_func_data.ica/stats/probmap_27
   saving mixture model fit:  /home/mpib/LNDG/StateSwitch/WIP_rest/preproc/B_data/D_preproc/2145/preproc/rest/FEAT.feat/filtered_func_data.ica/stats/MMstats_27
   re-scaling spatial maps ... 
   thresholding ... 
   alternative hypothesis test at p > 0.5
   saving thresholded Z-stats image:  /home/mpib/LNDG/StateSwitch/WIP_rest/preproc/B_data/D_preproc/2145/preproc/rest/FEAT.feat/filtered_func_data.ica/stats/thresh_zstat27
   creating report page ...    done
  IC map 28 ... 
   calculating mixture-model fit 
   saving probability map:    /home/mpib/LNDG/StateSwitch/WIP_rest/preproc/B_data/D_preproc/2145/preproc/rest/FEAT.feat/filtered_func_data.ica/stats/probmap_28
   saving mixture model fit:  /home/mpib/LNDG/StateSwitch/WIP_rest/preproc/B_data/D_preproc/2145/preproc/rest/FEAT.feat/filtered_func_data.ica/stats/MMstats_28
   re-scaling spatial maps ... 
   thresholding ... 
   alternative hypothesis test at p > 0.5
   saving thresholded Z-stats image:  /home/mpib/LNDG/StateSwitch/WIP_rest/preproc/B_data/D_preproc/2145/preproc/rest/FEAT.feat/filtered_func_data.ica/stats/thresh_zstat28
   creating report page ...    done
  IC map 29 ... 
   calculating mixture-model fit 
   saving probability map:    /home/mpib/LNDG/StateSwitch/WIP_rest/preproc/B_data/D_preproc/2145/preproc/rest/FEAT.feat/filtered_func_data.ica/stats/probmap_29
   saving mixture model fit:  /home/mpib/LNDG/StateSwitch/WIP_rest/preproc/B_data/D_preproc/2145/preproc/rest/FEAT.feat/filtered_func_data.ica/stats/MMstats_29
   re-scaling spatial maps ... 
   thresholding ... 
   alternative hypothesis test at p > 0.5
   saving thresholded Z-stats image:  /home/mpib/LNDG/StateSwitch/WIP_rest/preproc/B_data/D_preproc/2145/preproc/rest/FEAT.feat/filtered_func_data.ica/stats/thresh_zstat29
   creating report page ...    done
  IC map 30 ... 
   calculating mixture-model fit 
   saving probability map:    /home/mpib/LNDG/StateSwitch/WIP_rest/preproc/B_data/D_preproc/2145/preproc/rest/FEAT.feat/filtered_func_data.ica/stats/probmap_30
   saving mixture model fit:  /home/mpib/LNDG/StateSwitch/WIP_rest/preproc/B_data/D_preproc/2145/preproc/rest/FEAT.feat/filtered_func_data.ica/stats/MMstats_30
   re-scaling spatial maps ... 
   thresholding ... 
   alternative hypothesis test at p > 0.5
   saving thresholded Z-stats image:  /home/mpib/LNDG/StateSwitch/WIP_rest/preproc/B_data/D_preproc/2145/preproc/rest/FEAT.feat/filtered_func_data.ica/stats/thresh_zstat30
   creating report page ...    done

Writing results to : 
  /home/mpib/LNDG/StateSwitch/WIP_rest/preproc/B_data/D_preproc/2145/preproc/rest/FEAT.feat/filtered_func_data.ica/melodic_IC
  /home/mpib/LNDG/StateSwitch/WIP_rest/preproc/B_data/D_preproc/2145/preproc/rest/FEAT.feat/filtered_func_data.ica/melodic_Tmodes
  /home/mpib/LNDG/StateSwitch/WIP_rest/preproc/B_data/D_preproc/2145/preproc/rest/FEAT.feat/filtered_func_data.ica/melodic_mix
  /home/mpib/LNDG/StateSwitch/WIP_rest/preproc/B_data/D_preproc/2145/preproc/rest/FEAT.feat/filtered_func_data.ica/melodic_FTmix
  /home/mpib/LNDG/StateSwitch/WIP_rest/preproc/B_data/D_preproc/2145/preproc/rest/FEAT.feat/filtered_func_data.ica/melodic_PPCA
  /home/mpib/LNDG/StateSwitch/WIP_rest/preproc/B_data/D_preproc/2145/preproc/rest/FEAT.feat/filtered_func_data.ica/melodic_ICstats
  /home/mpib/LNDG/StateSwitch/WIP_rest/preproc/B_data/D_preproc/2145/preproc/rest/FEAT.feat/filtered_func_data.ica/mask
...done


 To view the output report point your web browser at /home/mpib/LNDG/StateSwitch/WIP_rest/preproc/B_data/D_preproc/2145/preproc/rest/FEAT.feat/filtered_func_data.ica/report/00index.html

finished!

