---------------------  Running antsBrainExtraction.sh on ood-48  ---------------------

--------------------------------------------------------------------------------------
 Bias correction of anatomical images (pre brain extraction)
   1) pre-process by truncating the image intensities
   2) run N4
--------------------------------------------------------------------------------------

BEGIN >>>>>>>>>>>>>>>>>>>>
/usr/lib/ants//ImageMath 3 /home/mpib/LNDG/StateSwitch/WIP_rest/preproc/B_data/D_preproc/1281/mri/t1/tempANTs/1281_t1_ANTsBET_N4Truncated0.nii.gz TruncateImageIntensity /home/mpib/LNDG/StateSwitch/WIP_rest/preproc/B_data/D_preproc/1281/mri/t1/1281_t1.nii.gz 0.01 0.999 256
END   <<<<<<<<<<<<<<<<<<<<


BEGIN >>>>>>>>>>>>>>>>>>>>
/usr/lib/ants//N4BiasFieldCorrection -d 3 -i /home/mpib/LNDG/StateSwitch/WIP_rest/preproc/B_data/D_preproc/1281/mri/t1/tempANTs/1281_t1_ANTsBET_N4Truncated0.nii.gz -s 4 -c [50x50x50x50,0.0000001] -b [200] -o /home/mpib/LNDG/StateSwitch/WIP_rest/preproc/B_data/D_preproc/1281/mri/t1/tempANTs/1281_t1_ANTsBET_N4Corrected0.nii.gz --verbose 1

Running N4 for 3-dimensional images.

Mask not read.  Using the entire image as the mask.

Specified spline distance: 200mm
  original image size:  [192, 256, 256]
  padded image size:  [201, 401, 401]
  number of control points:  [4, 5, 5]

Current level = 1
  Iteration 1 (of 50).   Current convergence value = 0.000772579 (threshold = 1e-07)
  Iteration 2 (of 50).   Current convergence value = 0.000572583 (threshold = 1e-07)
  Iteration 3 (of 50).   Current convergence value = 0.000422567 (threshold = 1e-07)
  Iteration 4 (of 50).   Current convergence value = 0.000310651 (threshold = 1e-07)
  Iteration 5 (of 50).   Current convergence value = 0.000228545 (threshold = 1e-07)
  Iteration 6 (of 50).   Current convergence value = 0.000170733 (threshold = 1e-07)
  Iteration 7 (of 50).   Current convergence value = 0.000132557 (threshold = 1e-07)
  Iteration 8 (of 50).   Current convergence value = 0.00011083 (threshold = 1e-07)
  Iteration 9 (of 50).   Current convergence value = 0.000101434 (threshold = 1e-07)
  Iteration 10 (of 50).   Current convergence value = 9.94488e-05 (threshold = 1e-07)
  Iteration 11 (of 50).   Current convergence value = 0.000101198 (threshold = 1e-07)
  Iteration 12 (of 50).   Current convergence value = 0.000105789 (threshold = 1e-07)
  Iteration 13 (of 50).   Current convergence value = 0.000110819 (threshold = 1e-07)
  Iteration 14 (of 50).   Current convergence value = 0.000115752 (threshold = 1e-07)
  Iteration 15 (of 50).   Current convergence value = 0.000119937 (threshold = 1e-07)
  Iteration 16 (of 50).   Current convergence value = 0.00012353 (threshold = 1e-07)
  Iteration 17 (of 50).   Current convergence value = 0.000126142 (threshold = 1e-07)
  Iteration 18 (of 50).   Current convergence value = 0.000128368 (threshold = 1e-07)
  Iteration 19 (of 50).   Current convergence value = 0.000131195 (threshold = 1e-07)
  Iteration 20 (of 50).   Current convergence value = 0.000132364 (threshold = 1e-07)
  Iteration 21 (of 50).   Current convergence value = 0.000126324 (threshold = 1e-07)
  Iteration 22 (of 50).   Current convergence value = 0.000121563 (threshold = 1e-07)
  Iteration 23 (of 50).   Current convergence value = 0.000117739 (threshold = 1e-07)
  Iteration 24 (of 50).   Current convergence value = 0.000113771 (threshold = 1e-07)
  Iteration 25 (of 50).   Current convergence value = 0.000110277 (threshold = 1e-07)
  Iteration 26 (of 50).   Current convergence value = 0.000107312 (threshold = 1e-07)
  Iteration 27 (of 50).   Current convergence value = 0.000105144 (threshold = 1e-07)
  Iteration 28 (of 50).   Current convergence value = 0.000103171 (threshold = 1e-07)
  Iteration 29 (of 50).   Current convergence value = 0.000101737 (threshold = 1e-07)
  Iteration 30 (of 50).   Current convergence value = 0.00010042 (threshold = 1e-07)
  Iteration 31 (of 50).   Current convergence value = 9.91947e-05 (threshold = 1e-07)
  Iteration 32 (of 50).   Current convergence value = 9.82332e-05 (threshold = 1e-07)
  Iteration 33 (of 50).   Current convergence value = 9.73409e-05 (threshold = 1e-07)
  Iteration 34 (of 50).   Current convergence value = 9.6565e-05 (threshold = 1e-07)
  Iteration 35 (of 50).   Current convergence value = 9.59984e-05 (threshold = 1e-07)
  Iteration 36 (of 50).   Current convergence value = 9.50639e-05 (threshold = 1e-07)
  Iteration 37 (of 50).   Current convergence value = 9.44108e-05 (threshold = 1e-07)
  Iteration 38 (of 50).   Current convergence value = 9.39126e-05 (threshold = 1e-07)
  Iteration 39 (of 50).   Current convergence value = 9.33217e-05 (threshold = 1e-07)
  Iteration 40 (of 50).   Current convergence value = 9.28286e-05 (threshold = 1e-07)
  Iteration 41 (of 50).   Current convergence value = 9.2347e-05 (threshold = 1e-07)
  Iteration 42 (of 50).   Current convergence value = 9.17854e-05 (threshold = 1e-07)
  Iteration 43 (of 50).   Current convergence value = 9.10855e-05 (threshold = 1e-07)
  Iteration 44 (of 50).   Current convergence value = 9.04183e-05 (threshold = 1e-07)
  Iteration 45 (of 50).   Current convergence value = 8.97797e-05 (threshold = 1e-07)
  Iteration 46 (of 50).   Current convergence value = 8.91145e-05 (threshold = 1e-07)
  Iteration 47 (of 50).   Current convergence value = 8.85347e-05 (threshold = 1e-07)
  Iteration 48 (of 50).   Current convergence value = 8.79167e-05 (threshold = 1e-07)
  Iteration 49 (of 50).   Current convergence value = 8.73007e-05 (threshold = 1e-07)
  Iteration 50 (of 50).   Current convergence value = 8.66516e-05 (threshold = 1e-07)
Current level = 2
  Iteration 1 (of 50).   Current convergence value = 0.000271406 (threshold = 1e-07)
  Iteration 2 (of 50).   Current convergence value = 0.000214187 (threshold = 1e-07)
  Iteration 3 (of 50).   Current convergence value = 0.000190298 (threshold = 1e-07)
  Iteration 4 (of 50).   Current convergence value = 0.000184608 (threshold = 1e-07)
  Iteration 5 (of 50).   Current convergence value = 0.000188046 (threshold = 1e-07)
  Iteration 6 (of 50).   Current convergence value = 0.000194719 (threshold = 1e-07)
  Iteration 7 (of 50).   Current convergence value = 0.000202154 (threshold = 1e-07)
  Iteration 8 (of 50).   Current convergence value = 0.000208474 (threshold = 1e-07)
  Iteration 9 (of 50).   Current convergence value = 0.000214579 (threshold = 1e-07)
  Iteration 10 (of 50).   Current convergence value = 0.000219638 (threshold = 1e-07)
  Iteration 11 (of 50).   Current convergence value = 0.000218226 (threshold = 1e-07)
  Iteration 12 (of 50).   Current convergence value = 0.000212784 (threshold = 1e-07)
  Iteration 13 (of 50).   Current convergence value = 0.000208128 (threshold = 1e-07)
  Iteration 14 (of 50).   Current convergence value = 0.000203333 (threshold = 1e-07)
  Iteration 15 (of 50).   Current convergence value = 0.000199535 (threshold = 1e-07)
  Iteration 16 (of 50).   Current convergence value = 0.000194838 (threshold = 1e-07)
  Iteration 17 (of 50).   Current convergence value = 0.000190313 (threshold = 1e-07)
  Iteration 18 (of 50).   Current convergence value = 0.000186167 (threshold = 1e-07)
  Iteration 19 (of 50).   Current convergence value = 0.000182844 (threshold = 1e-07)
  Iteration 20 (of 50).   Current convergence value = 0.000179773 (threshold = 1e-07)
  Iteration 21 (of 50).   Current convergence value = 0.000177482 (threshold = 1e-07)
  Iteration 22 (of 50).   Current convergence value = 0.000175084 (threshold = 1e-07)
  Iteration 23 (of 50).   Current convergence value = 0.000172767 (threshold = 1e-07)
  Iteration 24 (of 50).   Current convergence value = 0.000170929 (threshold = 1e-07)
  Iteration 25 (of 50).   Current convergence value = 0.000169289 (threshold = 1e-07)
  Iteration 26 (of 50).   Current convergence value = 0.000168161 (threshold = 1e-07)
  Iteration 27 (of 50).   Current convergence value = 0.000167929 (threshold = 1e-07)
  Iteration 28 (of 50).   Current convergence value = 0.000168039 (threshold = 1e-07)
  Iteration 29 (of 50).   Current convergence value = 0.000169184 (threshold = 1e-07)
  Iteration 30 (of 50).   Current convergence value = 0.000170765 (threshold = 1e-07)
  Iteration 31 (of 50).   Current convergence value = 0.000171749 (threshold = 1e-07)
  Iteration 32 (of 50).   Current convergence value = 0.000171057 (threshold = 1e-07)
  Iteration 33 (of 50).   Current convergence value = 0.000169129 (threshold = 1e-07)
  Iteration 34 (of 50).   Current convergence value = 0.000156495 (threshold = 1e-07)
  Iteration 35 (of 50).   Current convergence value = 0.000158103 (threshold = 1e-07)
  Iteration 36 (of 50).   Current convergence value = 0.000162906 (threshold = 1e-07)
  Iteration 37 (of 50).   Current convergence value = 0.000167558 (threshold = 1e-07)
  Iteration 38 (of 50).   Current convergence value = 0.00017199 (threshold = 1e-07)
  Iteration 39 (of 50).   Current convergence value = 0.000174876 (threshold = 1e-07)
  Iteration 40 (of 50).   Current convergence value = 0.000178027 (threshold = 1e-07)
  Iteration 41 (of 50).   Current convergence value = 0.000180456 (threshold = 1e-07)
  Iteration 42 (of 50).   Current convergence value = 0.000182815 (threshold = 1e-07)
  Iteration 43 (of 50).   Current convergence value = 0.000181944 (threshold = 1e-07)
  Iteration 44 (of 50).   Current convergence value = 0.000181852 (threshold = 1e-07)
  Iteration 45 (of 50).   Current convergence value = 0.000181926 (threshold = 1e-07)
  Iteration 46 (of 50).   Current convergence value = 0.000182607 (threshold = 1e-07)
  Iteration 47 (of 50).   Current convergence value = 0.000182421 (threshold = 1e-07)
  Iteration 48 (of 50).   Current convergence value = 0.000182409 (threshold = 1e-07)
  Iteration 49 (of 50).   Current convergence value = 0.000186907 (threshold = 1e-07)
  Iteration 50 (of 50).   Current convergence value = 0.000190838 (threshold = 1e-07)
Current level = 3
  Iteration 1 (of 50).   Current convergence value = 0.000938705 (threshold = 1e-07)
  Iteration 2 (of 50).   Current convergence value = 0.000841554 (threshold = 1e-07)
  Iteration 3 (of 50).   Current convergence value = 0.000825579 (threshold = 1e-07)
  Iteration 4 (of 50).   Current convergence value = 0.000876969 (threshold = 1e-07)
  Iteration 5 (of 50).   Current convergence value = 0.000921569 (threshold = 1e-07)
  Iteration 6 (of 50).   Current convergence value = 0.000952044 (threshold = 1e-07)
  Iteration 7 (of 50).   Current convergence value = 0.000892818 (threshold = 1e-07)
  Iteration 8 (of 50).   Current convergence value = 0.000848517 (threshold = 1e-07)
  Iteration 9 (of 50).   Current convergence value = 0.000819147 (threshold = 1e-07)
  Iteration 10 (of 50).   Current convergence value = 0.000798345 (threshold = 1e-07)
  Iteration 11 (of 50).   Current convergence value = 0.000775462 (threshold = 1e-07)
  Iteration 12 (of 50).   Current convergence value = 0.000758358 (threshold = 1e-07)
  Iteration 13 (of 50).   Current convergence value = 0.000745766 (threshold = 1e-07)
  Iteration 14 (of 50).   Current convergence value = 0.000733748 (threshold = 1e-07)
  Iteration 15 (of 50).   Current convergence value = 0.000723075 (threshold = 1e-07)
  Iteration 16 (of 50).   Current convergence value = 0.000720111 (threshold = 1e-07)
  Iteration 17 (of 50).   Current convergence value = 0.000711967 (threshold = 1e-07)
  Iteration 18 (of 50).   Current convergence value = 0.000718305 (threshold = 1e-07)
  Iteration 19 (of 50).   Current convergence value = 0.000726113 (threshold = 1e-07)
  Iteration 20 (of 50).   Current convergence value = 0.000733941 (threshold = 1e-07)
  Iteration 21 (of 50).   Current convergence value = 0.000740151 (threshold = 1e-07)
  Iteration 22 (of 50).   Current convergence value = 0.00074982 (threshold = 1e-07)
  Iteration 23 (of 50).   Current convergence value = 0.000722463 (threshold = 1e-07)
  Iteration 24 (of 50).   Current convergence value = 0.000720091 (threshold = 1e-07)
  Iteration 25 (of 50).   Current convergence value = 0.00073505 (threshold = 1e-07)
  Iteration 26 (of 50).   Current convergence value = 0.000756034 (threshold = 1e-07)
  Iteration 27 (of 50).   Current convergence value = 0.00076644 (threshold = 1e-07)
  Iteration 28 (of 50).   Current convergence value = 0.000756753 (threshold = 1e-07)
  Iteration 29 (of 50).   Current convergence value = 0.000784197 (threshold = 1e-07)
  Iteration 30 (of 50).   Current convergence value = 0.000905419 (threshold = 1e-07)
  Iteration 31 (of 50).   Current convergence value = 0.000957741 (threshold = 1e-07)
  Iteration 32 (of 50).   Current convergence value = 0.000915511 (threshold = 1e-07)
  Iteration 33 (of 50).   Current convergence value = 0.000888149 (threshold = 1e-07)
  Iteration 34 (of 50).   Current convergence value = 0.000863588 (threshold = 1e-07)
  Iteration 35 (of 50).   Current convergence value = 0.000836708 (threshold = 1e-07)
  Iteration 36 (of 50).   Current convergence value = 0.000798795 (threshold = 1e-07)
  Iteration 37 (of 50).   Current convergence value = 0.000768315 (threshold = 1e-07)
  Iteration 38 (of 50).   Current convergence value = 0.000742633 (threshold = 1e-07)
  Iteration 39 (of 50).   Current convergence value = 0.000724498 (threshold = 1e-07)
  Iteration 40 (of 50).   Current convergence value = 0.000700075 (threshold = 1e-07)
  Iteration 41 (of 50).   Current convergence value = 0.000669709 (threshold = 1e-07)
  Iteration 42 (of 50).   Current convergence value = 0.000621856 (threshold = 1e-07)
  Iteration 43 (of 50).   Current convergence value = 0.000564207 (threshold = 1e-07)
  Iteration 44 (of 50).   Current convergence value = 0.000518674 (threshold = 1e-07)
  Iteration 45 (of 50).   Current convergence value = 0.000480284 (threshold = 1e-07)
  Iteration 46 (of 50).   Current convergence value = 0.000451523 (threshold = 1e-07)
  Iteration 47 (of 50).   Current convergence value = 0.000441171 (threshold = 1e-07)
  Iteration 48 (of 50).   Current convergence value = 0.000467285 (threshold = 1e-07)
  Iteration 49 (of 50).   Current convergence value = 0.000521578 (threshold = 1e-07)
  Iteration 50 (of 50).   Current convergence value = 0.000601509 (threshold = 1e-07)
Current level = 4
  Iteration 1 (of 50).   Current convergence value = 0.00208958 (threshold = 1e-07)
  Iteration 2 (of 50).   Current convergence value = 0.0018269 (threshold = 1e-07)
  Iteration 3 (of 50).   Current convergence value = 0.00159233 (threshold = 1e-07)
  Iteration 4 (of 50).   Current convergence value = 0.00139601 (threshold = 1e-07)
  Iteration 5 (of 50).   Current convergence value = 0.00131244 (threshold = 1e-07)
  Iteration 6 (of 50).   Current convergence value = 0.00127583 (threshold = 1e-07)
  Iteration 7 (of 50).   Current convergence value = 0.00123444 (threshold = 1e-07)
  Iteration 8 (of 50).   Current convergence value = 0.00115733 (threshold = 1e-07)
  Iteration 9 (of 50).   Current convergence value = 0.00109569 (threshold = 1e-07)
  Iteration 10 (of 50).   Current convergence value = 0.00105915 (threshold = 1e-07)
  Iteration 11 (of 50).   Current convergence value = 0.00103153 (threshold = 1e-07)
  Iteration 12 (of 50).   Current convergence value = 0.00101211 (threshold = 1e-07)
  Iteration 13 (of 50).   Current convergence value = 0.000986242 (threshold = 1e-07)
  Iteration 14 (of 50).   Current convergence value = 0.000959631 (threshold = 1e-07)
  Iteration 15 (of 50).   Current convergence value = 0.000947909 (threshold = 1e-07)
  Iteration 16 (of 50).   Current convergence value = 0.000937776 (threshold = 1e-07)
  Iteration 17 (of 50).   Current convergence value = 0.000926056 (threshold = 1e-07)
  Iteration 18 (of 50).   Current convergence value = 0.000910232 (threshold = 1e-07)
  Iteration 19 (of 50).   Current convergence value = 0.00089036 (threshold = 1e-07)
  Iteration 20 (of 50).   Current convergence value = 0.000868027 (threshold = 1e-07)
  Iteration 21 (of 50).   Current convergence value = 0.000873854 (threshold = 1e-07)
  Iteration 22 (of 50).   Current convergence value = 0.000889408 (threshold = 1e-07)
  Iteration 23 (of 50).   Current convergence value = 0.000897202 (threshold = 1e-07)
  Iteration 24 (of 50).   Current convergence value = 0.000909609 (threshold = 1e-07)
  Iteration 25 (of 50).   Current convergence value = 0.000923781 (threshold = 1e-07)
  Iteration 26 (of 50).   Current convergence value = 0.00102205 (threshold = 1e-07)
  Iteration 27 (of 50).   Current convergence value = 0.00114396 (threshold = 1e-07)
  Iteration 28 (of 50).   Current convergence value = 0.00129984 (threshold = 1e-07)
  Iteration 29 (of 50).   Current convergence value = 0.00133897 (threshold = 1e-07)
  Iteration 30 (of 50).   Current convergence value = 0.00126008 (threshold = 1e-07)
  Iteration 31 (of 50).   Current convergence value = 0.00125544 (threshold = 1e-07)
  Iteration 32 (of 50).   Current convergence value = 0.00116443 (threshold = 1e-07)
  Iteration 33 (of 50).   Current convergence value = 0.00111681 (threshold = 1e-07)
  Iteration 34 (of 50).   Current convergence value = 0.00109486 (threshold = 1e-07)
  Iteration 35 (of 50).   Current convergence value = 0.00108855 (threshold = 1e-07)
  Iteration 36 (of 50).   Current convergence value = 0.00111215 (threshold = 1e-07)
  Iteration 37 (of 50).   Current convergence value = 0.00112975 (threshold = 1e-07)
  Iteration 38 (of 50).   Current convergence value = 0.00114079 (threshold = 1e-07)
  Iteration 39 (of 50).   Current convergence value = 0.00114028 (threshold = 1e-07)
  Iteration 40 (of 50).   Current convergence value = 0.00106442 (threshold = 1e-07)
  Iteration 41 (of 50).   Current convergence value = 0.000991391 (threshold = 1e-07)
  Iteration 42 (of 50).   Current convergence value = 0.000950927 (threshold = 1e-07)
  Iteration 43 (of 50).   Current convergence value = 0.000931206 (threshold = 1e-07)
  Iteration 44 (of 50).   Current convergence value = 0.00092103 (threshold = 1e-07)
  Iteration 45 (of 50).   Current convergence value = 0.000910908 (threshold = 1e-07)
  Iteration 46 (of 50).   Current convergence value = 0.000895735 (threshold = 1e-07)
  Iteration 47 (of 50).   Current convergence value = 0.000877117 (threshold = 1e-07)
  Iteration 48 (of 50).   Current convergence value = 0.000857888 (threshold = 1e-07)
  Iteration 49 (of 50).   Current convergence value = 0.000832934 (threshold = 1e-07)
  Iteration 50 (of 50).   Current convergence value = 0.000802753 (threshold = 1e-07)
   N4BiasFieldCorrectionImageFilter (0x5603ac8d0d30)
     RTTI typeinfo:   itk::N4BiasFieldCorrectionImageFilter<itk::Image<float, 3u>, itk::Image<float, 3u>, itk::Image<float, 3u> >
     Reference Count: 1
     Modified Time: 439
     Debug: Off
     Object Name: 
     Observers: 
       IterationEvent(Command)
     Inputs: 
       Primary: (0x5603ac8e05d0) *
       _1: (0x5603ac8df2e0)
     Indexed Inputs: 
       0: Primary (0x5603ac8e05d0)
       1: _1 (0x5603ac8df2e0)
     Required Input Names: Primary
     NumberOfRequiredInputs: 1
     Outputs: 
       Primary: (0x5603ac8d8e50)
     Indexed Outputs: 
       0: Primary (0x5603ac8d8e50)
     NumberOfRequiredOutputs: 1
     Number Of Threads: 20
     ReleaseDataFlag: Off
     ReleaseDataBeforeUpdateFlag: Off
     AbortGenerateData: Off
     Progress: 0
     Multithreader: 
       RTTI typeinfo:   itk::MultiThreader
       Reference Count: 1
       Modified Time: 132
       Debug: Off
       Object Name: 
       Observers: 
         none
       Thread Count: 20
       Global Maximum Number Of Threads: 128
       Global Default Number Of Threads: 20
     CoordinateTolerance: 1e-06
     DirectionTolerance: 1e-06
     Mask label: 1
     Number of histogram bins: 200
     Wiener filter noise: 0.01
     Bias field FWHM: 0.15
     Maximum number of iterations: [50, 50, 50, 50]
     Convergence threshold: 1e-07
     Spline order: 3
     Number of fitting levels: [4, 4, 4]
     Number of control points: [4, 5, 5]
     CurrentConvergenceMeasurement: 0.000802753
     CurrentLevel: 4
     ElapsedIterations: 51
     LogBiasFieldControlPointLattice: 
       Image (0x5603ac8e2350)
         RTTI typeinfo:   itk::Image<itk::Vector<float, 1u>, 3u>
         Reference Count: 1
         Modified Time: 432828186
         Debug: Off
         Object Name: 
         Observers: 
           none
         Source: (none)
         Source output name: (none)
         Release Data: Off
         Data Released: False
         Global Release Data: Off
         PipelineMTime: 0
         UpdateMTime: 0
         RealTimeStamp: 0 seconds 
         LargestPossibleRegion: 
           Dimension: 3
           Index: [0, 0, 0]
           Size: [11, 19, 19]
         BufferedRegion: 
           Dimension: 3
           Index: [0, 0, 0]
           Size: [11, 19, 19]
         RequestedRegion: 
           Dimension: 3
           Index: [0, 0, 0]
           Size: [11, 19, 19]
         Spacing: [24.5, 24.75, 24.75]
         Origin: [-26.2477, 26.2601, -21.1386]
         Direction: 
0.99754 0.0700398 0.00301152
0.0697515 -0.987296 -0.142765
0.00702597 -0.142624 0.989752

         IndexToPointMatrix: 
24.4397 1.73348 0.0745352
1.70891 -24.4356 -3.53344
0.172136 -3.52994 24.4964

         PointToIndexMatrix: 
0.0407159 0.002847 0.000286774
0.00282989 -0.0398907 -0.00576258
0.000121678 -0.00576829 0.03999

         Inverse Direction: 
0.99754 0.0697515 0.00702597
0.0700398 -0.987296 -0.142624
0.00301152 -0.142765 0.989752

         PixelContainer: 
           ImportImageContainer (0x5603ac8e2bb0)
             RTTI typeinfo:   itk::ImportImageContainer<unsigned long, itk::Vector<float, 1u> >
             Reference Count: 1
             Modified Time: 432828187
             Debug: Off
             Object Name: 
             Observers: 
               none
             Pointer: 0x5603ad360270
             Container manages memory: true
             Size: 3971
             Capacity: 3971
Elapsed time: 151.581
END   <<<<<<<<<<<<<<<<<<<<



--------------------------------------------------------------------------------------
 Done with N4 correction (pre brain extraction):  0h 2m 47s
--------------------------------------------------------------------------------------


--------------------------------------------------------------------------------------
 Brain extraction using the following steps:
   1) Register /home/mpib/LNDG/StateSwitch/WIP_rest/preproc/B_data/C_standards/ANTS/MICCAI2012-Multi-Atlas-Challenge-Data/T_template0.nii.gz to /home/mpib/LNDG/StateSwitch/WIP_rest/preproc/B_data/D_preproc/1281/mri/t1/tempANTs/1281_t1_ANTsBET_N4Corrected0.nii.gz
   2) Warp /home/mpib/LNDG/StateSwitch/WIP_rest/preproc/B_data/C_standards/ANTS/MICCAI2012-Multi-Atlas-Challenge-Data/T_template0_BrainCerebellumProbabilityMask.nii.gz to /home/mpib/LNDG/StateSwitch/WIP_rest/preproc/B_data/D_preproc/1281/mri/t1/1281_t1.nii.gz using, from 1),
      /home/mpib/LNDG/StateSwitch/WIP_rest/preproc/B_data/D_preproc/1281/mri/t1/tempANTs/1281_t1_ANTsBET_BrainExtractionWarp/Affine
   3) Refine segmentation results using Atropos
--------------------------------------------------------------------------------------

BEGIN >>>>>>>>>>>>>>>>>>>>
/usr/lib/ants//ResampleImageBySpacing 3 /home/mpib/LNDG/StateSwitch/WIP_rest/preproc/B_data/C_standards/ANTS/MICCAI2012-Multi-Atlas-Challenge-Data/T_template0.nii.gz /home/mpib/LNDG/StateSwitch/WIP_rest/preproc/B_data/D_preproc/1281/mri/t1/tempANTs/1281_t1_ANTsBET_BrainExtractionInitialAffineFixed.nii.gz 4 4 4 1
 spacing [1, 1, 1] dim 3
 spacing2 [4, 4, 4]
 smoothing by : 3 dir 0
 smoothing by : 3 dir 1
 smoothing by : 3 dir 2
 out space [4, 4, 4]
 output size [54, 64, 72] spc [4, 4, 4]
END   <<<<<<<<<<<<<<<<<<<<


BEGIN >>>>>>>>>>>>>>>>>>>>
/usr/lib/ants//ResampleImageBySpacing 3 /home/mpib/LNDG/StateSwitch/WIP_rest/preproc/B_data/D_preproc/1281/mri/t1/tempANTs/1281_t1_ANTsBET_N4Corrected0.nii.gz /home/mpib/LNDG/StateSwitch/WIP_rest/preproc/B_data/D_preproc/1281/mri/t1/tempANTs/1281_t1_ANTsBET_BrainExtractionInitialAffineMoving.nii.gz 4 4 4 1
 spacing [1, 1, 1] dim 3
 spacing2 [4, 4, 4]
 smoothing by : 3 dir 0
 smoothing by : 3 dir 1
 smoothing by : 3 dir 2
 out space [4, 4, 4]
 output size [48, 64, 64] spc [4, 4, 4]
END   <<<<<<<<<<<<<<<<<<<<


BEGIN >>>>>>>>>>>>>>>>>>>>
/usr/lib/ants//ImageMath 3 /home/mpib/LNDG/StateSwitch/WIP_rest/preproc/B_data/D_preproc/1281/mri/t1/tempANTs/1281_t1_ANTsBET_BrainExtractionLaplacian.nii.gz Laplacian /home/mpib/LNDG/StateSwitch/WIP_rest/preproc/B_data/D_preproc/1281/mri/t1/tempANTs/1281_t1_ANTsBET_N4Corrected0.nii.gz 1.5 1
END   <<<<<<<<<<<<<<<<<<<<


BEGIN >>>>>>>>>>>>>>>>>>>>
/usr/lib/ants//ImageMath 3 /home/mpib/LNDG/StateSwitch/WIP_rest/preproc/B_data/D_preproc/1281/mri/t1/tempANTs/1281_t1_ANTsBET_BrainExtractionTemplateLaplacian.nii.gz Laplacian /home/mpib/LNDG/StateSwitch/WIP_rest/preproc/B_data/C_standards/ANTS/MICCAI2012-Multi-Atlas-Challenge-Data/T_template0.nii.gz 1.5 1
END   <<<<<<<<<<<<<<<<<<<<


BEGIN >>>>>>>>>>>>>>>>>>>>
/usr/lib/ants//antsAI -d 3 -v 1 -m Mattes[/home/mpib/LNDG/StateSwitch/WIP_rest/preproc/B_data/D_preproc/1281/mri/t1/tempANTs/1281_t1_ANTsBET_BrainExtractionInitialAffineFixed.nii.gz,/home/mpib/LNDG/StateSwitch/WIP_rest/preproc/B_data/D_preproc/1281/mri/t1/tempANTs/1281_t1_ANTsBET_BrainExtractionInitialAffineMoving.nii.gz,32,Regular,0.25] -t Affine[0.1] -s [15,0.1] -p 0 -c 10 -o /home/mpib/LNDG/StateSwitch/WIP_rest/preproc/B_data/D_preproc/1281/mri/t1/tempANTs/1281_t1_ANTsBET_BrainExtractionInitialAffine.mat -x //home/mpib/LNDG/StateSwitch/WIP_rest/preproc/B_data/C_standards/ANTS/MICCAI2012-Multi-Atlas-Challenge-Data/T_template0_BrainCerebellumRegistrationMask.nii.gz
Using the Mattes MI metric (number of bins = 32)
END   <<<<<<<<<<<<<<<<<<<<


BEGIN >>>>>>>>>>>>>>>>>>>>
/usr/lib/ants//antsRegistration -d 3 -u 1 -w [0.025,0.975] -o /home/mpib/LNDG/StateSwitch/WIP_rest/preproc/B_data/D_preproc/1281/mri/t1/tempANTs/1281_t1_ANTsBET_BrainExtractionPrior -r /home/mpib/LNDG/StateSwitch/WIP_rest/preproc/B_data/D_preproc/1281/mri/t1/tempANTs/1281_t1_ANTsBET_BrainExtractionInitialAffine.mat -z 1 --float 0 --verbose 1 -x [//home/mpib/LNDG/StateSwitch/WIP_rest/preproc/B_data/C_standards/ANTS/MICCAI2012-Multi-Atlas-Challenge-Data/T_template0_BrainCerebellumRegistrationMask.nii.gz] -m MI[/home/mpib/LNDG/StateSwitch/WIP_rest/preproc/B_data/C_standards/ANTS/MICCAI2012-Multi-Atlas-Challenge-Data/T_template0.nii.gz,/home/mpib/LNDG/StateSwitch/WIP_rest/preproc/B_data/D_preproc/1281/mri/t1/tempANTs/1281_t1_ANTsBET_N4Corrected0.nii.gz,1,32,Regular,0.25] -c [1000x500x250x100,1e-8,10] -t Rigid[0.1] -f 8x4x2x1 -s 4x2x1x0 -m MI[/home/mpib/LNDG/StateSwitch/WIP_rest/preproc/B_data/C_standards/ANTS/MICCAI2012-Multi-Atlas-Challenge-Data/T_template0.nii.gz,/home/mpib/LNDG/StateSwitch/WIP_rest/preproc/B_data/D_preproc/1281/mri/t1/tempANTs/1281_t1_ANTsBET_N4Corrected0.nii.gz,1,32,Regular,0.25] -c [1000x500x250x100,1e-8,10] -t Affine[0.1] -f 8x4x2x1 -s 4x2x1x0 -m CC[/home/mpib/LNDG/StateSwitch/WIP_rest/preproc/B_data/C_standards/ANTS/MICCAI2012-Multi-Atlas-Challenge-Data/T_template0.nii.gz,/home/mpib/LNDG/StateSwitch/WIP_rest/preproc/B_data/D_preproc/1281/mri/t1/tempANTs/1281_t1_ANTsBET_N4Corrected0.nii.gz,0.5,4] -m CC[/home/mpib/LNDG/StateSwitch/WIP_rest/preproc/B_data/D_preproc/1281/mri/t1/tempANTs/1281_t1_ANTsBET_BrainExtractionTemplateLaplacian.nii.gz,/home/mpib/LNDG/StateSwitch/WIP_rest/preproc/B_data/D_preproc/1281/mri/t1/tempANTs/1281_t1_ANTsBET_BrainExtractionLaplacian.nii.gz,0.5,4] -c [50x10x0,1e-9,15] -t SyN[0.1,3,0] -f 4x2x1 -s 2x1x0
All_Command_lines_OK
Using double precision for computations.
=============================================================================
The composite transform comprises the following transforms (in order): 
  1. /home/mpib/LNDG/StateSwitch/WIP_rest/preproc/B_data/D_preproc/1281/mri/t1/tempANTs/1281_t1_ANTsBET_BrainExtractionInitialAffine.mat (type = AffineTransform)
=============================================================================
  Reading mask(s).
    Registration stage 0
      Fixed mask = //home/mpib/LNDG/StateSwitch/WIP_rest/preproc/B_data/C_standards/ANTS/MICCAI2012-Multi-Atlas-Challenge-Data/T_template0_BrainCerebellumRegistrationMask.nii.gz
  number of levels = 4
  number of levels = 4
  number of levels = 3
  fixed image: /home/mpib/LNDG/StateSwitch/WIP_rest/preproc/B_data/C_standards/ANTS/MICCAI2012-Multi-Atlas-Challenge-Data/T_template0.nii.gz
  moving image: /home/mpib/LNDG/StateSwitch/WIP_rest/preproc/B_data/D_preproc/1281/mri/t1/tempANTs/1281_t1_ANTsBET_N4Corrected0.nii.gz
  fixed image: /home/mpib/LNDG/StateSwitch/WIP_rest/preproc/B_data/C_standards/ANTS/MICCAI2012-Multi-Atlas-Challenge-Data/T_template0.nii.gz
  moving image: /home/mpib/LNDG/StateSwitch/WIP_rest/preproc/B_data/D_preproc/1281/mri/t1/tempANTs/1281_t1_ANTsBET_N4Corrected0.nii.gz
  fixed image: /home/mpib/LNDG/StateSwitch/WIP_rest/preproc/B_data/C_standards/ANTS/MICCAI2012-Multi-Atlas-Challenge-Data/T_template0.nii.gz
  moving image: /home/mpib/LNDG/StateSwitch/WIP_rest/preproc/B_data/D_preproc/1281/mri/t1/tempANTs/1281_t1_ANTsBET_N4Corrected0.nii.gz
  fixed image: /home/mpib/LNDG/StateSwitch/WIP_rest/preproc/B_data/D_preproc/1281/mri/t1/tempANTs/1281_t1_ANTsBET_BrainExtractionTemplateLaplacian.nii.gz
  moving image: /home/mpib/LNDG/StateSwitch/WIP_rest/preproc/B_data/D_preproc/1281/mri/t1/tempANTs/1281_t1_ANTsBET_BrainExtractionLaplacian.nii.gz
Dimension = 3
Number of stages = 3
Use Histogram Matching true
Winsorize image intensities true
Lower quantile = 0.025
Upper quantile = 0.975
Stage 1 State
   Image metric = Mattes
     Fixed image = Image (0x5561bb0b37e0)
  RTTI typeinfo:   itk::Image<double, 3u>
  Reference Count: 2
  Modified Time: 1666
  Debug: Off
  Object Name: 
  Observers: 
    none
  Source: (none)
  Source output name: (none)
  Release Data: Off
  Data Released: False
  Global Release Data: Off
  PipelineMTime: 0
  UpdateMTime: 1501
  RealTimeStamp: 0 seconds 
  LargestPossibleRegion: 
    Dimension: 3
    Index: [0, 0, 0]
    Size: [216, 256, 291]
  BufferedRegion: 
    Dimension: 3
    Index: [0, 0, 0]
    Size: [216, 256, 291]
  RequestedRegion: 
    Dimension: 3
    Index: [0, 0, 0]
    Size: [216, 256, 291]
  Spacing: [1, 1, 1]
  Origin: [0, 293, 0]
  Direction: 
1 0 0
0 -0 -1
0 -1 -0

  IndexToPointMatrix: 
1 0 0
0 0 -1
0 -1 0

  PointToIndexMatrix: 
1 0 0
0 0 -1
0 -1 0

  Inverse Direction: 
1 0 0
0 0 -1
0 -1 0

  PixelContainer: 
    ImportImageContainer (0x5561bb0b79d0)
      RTTI typeinfo:   itk::ImportImageContainer<unsigned long, double>
      Reference Count: 1
      Modified Time: 1498
      Debug: Off
      Object Name: 
      Observers: 
        none
      Pointer: 0x7f4c95693010
      Container manages memory: true
      Size: 16091136
      Capacity: 16091136

     Moving image = Image (0x5561bb0b5620)
  RTTI typeinfo:   itk::Image<double, 3u>
  Reference Count: 2
  Modified Time: 1667
  Debug: Off
  Object Name: 
  Observers: 
    none
  Source: (none)
  Source output name: (none)
  Release Data: Off
  Data Released: False
  Global Release Data: Off
  PipelineMTime: 0
  UpdateMTime: 1664
  RealTimeStamp: 0 seconds 
  LargestPossibleRegion: 
    Dimension: 3
    Index: [0, 0, 0]
    Size: [192, 256, 256]
  BufferedRegion: 
    Dimension: 3
    Index: [0, 0, 0]
    Size: [192, 256, 256]
  RequestedRegion: 
    Dimension: 3
    Index: [0, 0, 0]
    Size: [192, 256, 256]
  Spacing: [1, 1, 1]
  Origin: [-100.991, 116.907, -89.1038]
  Direction: 
0.99754 0.0700398 0.00301152
0.0697515 -0.987296 -0.142765
0.00702597 -0.142624 0.989752

  IndexToPointMatrix: 
0.99754 0.0700398 0.00301152
0.0697515 -0.987296 -0.142765
0.00702597 -0.142624 0.989752

  PointToIndexMatrix: 
0.99754 0.0697515 0.00702597
0.0700398 -0.987296 -0.142624
0.00301152 -0.142765 0.989752

  Inverse Direction: 
0.99754 0.0697515 0.00702597
0.0700398 -0.987296 -0.142624
0.00301152 -0.142765 0.989752

  PixelContainer: 
    ImportImageContainer (0x5561bb0b78c0)
      RTTI typeinfo:   itk::ImportImageContainer<unsigned long, double>
      Reference Count: 1
      Modified Time: 1661
      Debug: Off
      Object Name: 
      Observers: 
        none
      Pointer: 0x7f4c8f692010
      Container manages memory: true
      Size: 12582912
      Capacity: 12582912

     Weighting = 1
     Sampling strategy = regular
     Number of bins = 32
     Radius = 4
     Sampling percentage  = 0.25
   Transform = Rigid
     Gradient step = 0.1
     Update field sigma (voxel space) = 0
     Total field sigma (voxel space) = 0
     Update field time sigma = 0
     Total field time sigma  = 0
     Number of time indices = 0
     Number of time point samples = 0
Stage 2 State
   Image metric = Mattes
     Fixed image = Image (0x5561bb0c0910)
  RTTI typeinfo:   itk::Image<double, 3u>
  Reference Count: 2
  Modified Time: 1994
  Debug: Off
  Object Name: 
  Observers: 
    none
  Source: (none)
  Source output name: (none)
  Release Data: Off
  Data Released: False
  Global Release Data: Off
  PipelineMTime: 0
  UpdateMTime: 1829
  RealTimeStamp: 0 seconds 
  LargestPossibleRegion: 
    Dimension: 3
    Index: [0, 0, 0]
    Size: [216, 256, 291]
  BufferedRegion: 
    Dimension: 3
    Index: [0, 0, 0]
    Size: [216, 256, 291]
  RequestedRegion: 
    Dimension: 3
    Index: [0, 0, 0]
    Size: [216, 256, 291]
  Spacing: [1, 1, 1]
  Origin: [0, 293, 0]
  Direction: 
1 0 0
0 -0 -1
0 -1 -0

  IndexToPointMatrix: 
1 0 0
0 0 -1
0 -1 0

  PointToIndexMatrix: 
1 0 0
0 0 -1
0 -1 0

  Inverse Direction: 
1 0 0
0 0 -1
0 -1 0

  PixelContainer: 
    ImportImageContainer (0x5561bb0b73a0)
      RTTI typeinfo:   itk::ImportImageContainer<unsigned long, double>
      Reference Count: 1
      Modified Time: 1826
      Debug: Off
      Object Name: 
      Observers: 
        none
      Pointer: 0x7f4c87bcd010
      Container manages memory: true
      Size: 16091136
      Capacity: 16091136

     Moving image = Image (0x5561bb0c6040)
  RTTI typeinfo:   itk::Image<double, 3u>
  Reference Count: 2
  Modified Time: 1995
  Debug: Off
  Object Name: 
  Observers: 
    none
  Source: (none)
  Source output name: (none)
  Release Data: Off
  Data Released: False
  Global Release Data: Off
  PipelineMTime: 0
  UpdateMTime: 1992
  RealTimeStamp: 0 seconds 
  LargestPossibleRegion: 
    Dimension: 3
    Index: [0, 0, 0]
    Size: [192, 256, 256]
  BufferedRegion: 
    Dimension: 3
    Index: [0, 0, 0]
    Size: [192, 256, 256]
  RequestedRegion: 
    Dimension: 3
    Index: [0, 0, 0]
    Size: [192, 256, 256]
  Spacing: [1, 1, 1]
  Origin: [-100.991, 116.907, -89.1038]
  Direction: 
0.99754 0.0700398 0.00301152
0.0697515 -0.987296 -0.142765
0.00702597 -0.142624 0.989752

  IndexToPointMatrix: 
0.99754 0.0700398 0.00301152
0.0697515 -0.987296 -0.142765
0.00702597 -0.142624 0.989752

  PointToIndexMatrix: 
0.99754 0.0697515 0.00702597
0.0700398 -0.987296 -0.142624
0.00301152 -0.142765 0.989752

  Inverse Direction: 
0.99754 0.0697515 0.00702597
0.0700398 -0.987296 -0.142624
0.00301152 -0.142765 0.989752

  PixelContainer: 
    ImportImageContainer (0x5561bb0b9830)
      RTTI typeinfo:   itk::ImportImageContainer<unsigned long, double>
      Reference Count: 1
      Modified Time: 1989
      Debug: Off
      Object Name: 
      Observers: 
        none
      Pointer: 0x7f4c81bcc010
      Container manages memory: true
      Size: 12582912
      Capacity: 12582912

     Weighting = 1
     Sampling strategy = regular
     Number of bins = 32
     Radius = 4
     Sampling percentage  = 0.25
   Transform = Affine
     Gradient step = 0.1
     Update field sigma (voxel space) = 0
     Total field sigma (voxel space) = 0
     Update field time sigma = 0
     Total field time sigma  = 0
     Number of time indices = 0
     Number of time point samples = 0
Stage 3 State
   Image metric = CC
     Fixed image = Image (0x5561bb0c7d80)
  RTTI typeinfo:   itk::Image<double, 3u>
  Reference Count: 2
  Modified Time: 2322
  Debug: Off
  Object Name: 
  Observers: 
    none
  Source: (none)
  Source output name: (none)
  Release Data: Off
  Data Released: False
  Global Release Data: Off
  PipelineMTime: 0
  UpdateMTime: 2157
  RealTimeStamp: 0 seconds 
  LargestPossibleRegion: 
    Dimension: 3
    Index: [0, 0, 0]
    Size: [216, 256, 291]
  BufferedRegion: 
    Dimension: 3
    Index: [0, 0, 0]
    Size: [216, 256, 291]
  RequestedRegion: 
    Dimension: 3
    Index: [0, 0, 0]
    Size: [216, 256, 291]
  Spacing: [1, 1, 1]
  Origin: [0, 293, 0]
  Direction: 
1 0 0
0 -0 -1
0 -1 -0

  IndexToPointMatrix: 
1 0 0
0 0 -1
0 -1 0

  PointToIndexMatrix: 
1 0 0
0 0 -1
0 -1 0

  Inverse Direction: 
1 0 0
0 0 -1
0 -1 0

  PixelContainer: 
    ImportImageContainer (0x5561bb0c38c0)
      RTTI typeinfo:   itk::ImportImageContainer<unsigned long, double>
      Reference Count: 1
      Modified Time: 2154
      Debug: Off
      Object Name: 
      Observers: 
        none
      Pointer: 0x7f4c7a107010
      Container manages memory: true
      Size: 16091136
      Capacity: 16091136

     Moving image = Image (0x5561bb0c9e00)
  RTTI typeinfo:   itk::Image<double, 3u>
  Reference Count: 2
  Modified Time: 2323
  Debug: Off
  Object Name: 
  Observers: 
    none
  Source: (none)
  Source output name: (none)
  Release Data: Off
  Data Released: False
  Global Release Data: Off
  PipelineMTime: 0
  UpdateMTime: 2320
  RealTimeStamp: 0 seconds 
  LargestPossibleRegion: 
    Dimension: 3
    Index: [0, 0, 0]
    Size: [192, 256, 256]
  BufferedRegion: 
    Dimension: 3
    Index: [0, 0, 0]
    Size: [192, 256, 256]
  RequestedRegion: 
    Dimension: 3
    Index: [0, 0, 0]
    Size: [192, 256, 256]
  Spacing: [1, 1, 1]
  Origin: [-100.991, 116.907, -89.1038]
  Direction: 
0.99754 0.0700398 0.00301152
0.0697515 -0.987296 -0.142765
0.00702597 -0.142624 0.989752

  IndexToPointMatrix: 
0.99754 0.0700398 0.00301152
0.0697515 -0.987296 -0.142765
0.00702597 -0.142624 0.989752

  PointToIndexMatrix: 
0.99754 0.0697515 0.00702597
0.0700398 -0.987296 -0.142624
0.00301152 -0.142765 0.989752

  Inverse Direction: 
0.99754 0.0697515 0.00702597
0.0700398 -0.987296 -0.142624
0.00301152 -0.142765 0.989752

  PixelContainer: 
    ImportImageContainer (0x5561bb0c3e10)
      RTTI typeinfo:   itk::ImportImageContainer<unsigned long, double>
      Reference Count: 1
      Modified Time: 2317
      Debug: Off
      Object Name: 
      Observers: 
        none
      Pointer: 0x7f4c74106010
      Container manages memory: true
      Size: 12582912
      Capacity: 12582912

     Weighting = 0.5
     Sampling strategy = none
     Number of bins = 32
     Radius = 4
     Sampling percentage  = 1
   Transform = SyN
     Gradient step = 0.1
     Update field sigma (voxel space) = 3
     Total field sigma (voxel space) = 0
     Update field time sigma = 0
     Total field time sigma  = 0
     Number of time indices = 0
     Number of time point samples = 0
Registration using 3 total stages.

Stage 0
  iterations = 1000x500x250x100
  convergence threshold = 1e-08
  convergence window size = 10
  number of levels = 4
  using the Mattes MI metric (number of bins = 32, weight = 1)
  preprocessing:  winsorizing the image intensities
  preprocessing:  histogram matching the images
  Shrink factors (level 1 out of 4): [8, 8, 8]
  Shrink factors (level 2 out of 4): [4, 4, 4]
  Shrink factors (level 3 out of 4): [2, 2, 2]
  Shrink factors (level 4 out of 4): [1, 1, 1]
  smoothing sigmas per level: [4, 2, 1, 0]
  regular sampling (percentage = 0.25)

*** Running Euler3DTransform registration ***

DIAGNOSTIC,Iteration,metricValue,convergenceValue,ITERATION_TIME_INDEX,SINCE_LAST
 2DIAGNOSTIC,     1, -9.431438077850e-01, 1.797693134862e+308, 1.2996e+01, 1.2996e+01, 
 2DIAGNOSTIC,     2, -9.457723144833e-01, 1.797693134862e+308, 1.3011e+01, 1.4543e-02, 
 2DIAGNOSTIC,     3, -9.489217316064e-01, 1.797693134862e+308, 1.3024e+01, 1.2896e-02, 
