---------------------  Running antsBrainExtraction.sh on ood-19  ---------------------

--------------------------------------------------------------------------------------
 Bias correction of anatomical images (pre brain extraction)
   1) pre-process by truncating the image intensities
   2) run N4
--------------------------------------------------------------------------------------

BEGIN >>>>>>>>>>>>>>>>>>>>
/usr/lib/ants//ImageMath 3 /home/mpib/LNDG/StateSwitch/WIP_rest/preproc/B_data/D_preproc/1252/mri/t1/tempANTs/1252_t1_ANTsBET_N4Truncated0.nii.gz TruncateImageIntensity /home/mpib/LNDG/StateSwitch/WIP_rest/preproc/B_data/D_preproc/1252/mri/t1/1252_t1.nii.gz 0.01 0.999 256
END   <<<<<<<<<<<<<<<<<<<<


BEGIN >>>>>>>>>>>>>>>>>>>>
/usr/lib/ants//N4BiasFieldCorrection -d 3 -i /home/mpib/LNDG/StateSwitch/WIP_rest/preproc/B_data/D_preproc/1252/mri/t1/tempANTs/1252_t1_ANTsBET_N4Truncated0.nii.gz -s 4 -c [50x50x50x50,0.0000001] -b [200] -o /home/mpib/LNDG/StateSwitch/WIP_rest/preproc/B_data/D_preproc/1252/mri/t1/tempANTs/1252_t1_ANTsBET_N4Corrected0.nii.gz --verbose 1

Running N4 for 3-dimensional images.

Mask not read.  Using the entire image as the mask.

Specified spline distance: 200mm
  original image size:  [192, 256, 256]
  padded image size:  [201, 401, 401]
  number of control points:  [4, 5, 5]

Current level = 1
  Iteration 1 (of 50).   Current convergence value = 0.000557488 (threshold = 1e-07)
  Iteration 2 (of 50).   Current convergence value = 0.000451095 (threshold = 1e-07)
  Iteration 3 (of 50).   Current convergence value = 0.000368231 (threshold = 1e-07)
  Iteration 4 (of 50).   Current convergence value = 0.000301434 (threshold = 1e-07)
  Iteration 5 (of 50).   Current convergence value = 0.000248527 (threshold = 1e-07)
  Iteration 6 (of 50).   Current convergence value = 0.000206082 (threshold = 1e-07)
  Iteration 7 (of 50).   Current convergence value = 0.000172587 (threshold = 1e-07)
  Iteration 8 (of 50).   Current convergence value = 0.00014632 (threshold = 1e-07)
  Iteration 9 (of 50).   Current convergence value = 0.000126028 (threshold = 1e-07)
  Iteration 10 (of 50).   Current convergence value = 0.000110824 (threshold = 1e-07)
  Iteration 11 (of 50).   Current convergence value = 9.98818e-05 (threshold = 1e-07)
  Iteration 12 (of 50).   Current convergence value = 9.19591e-05 (threshold = 1e-07)
  Iteration 13 (of 50).   Current convergence value = 8.5737e-05 (threshold = 1e-07)
  Iteration 14 (of 50).   Current convergence value = 8.16017e-05 (threshold = 1e-07)
  Iteration 15 (of 50).   Current convergence value = 7.91698e-05 (threshold = 1e-07)
  Iteration 16 (of 50).   Current convergence value = 7.79845e-05 (threshold = 1e-07)
  Iteration 17 (of 50).   Current convergence value = 7.68584e-05 (threshold = 1e-07)
  Iteration 18 (of 50).   Current convergence value = 7.58265e-05 (threshold = 1e-07)
  Iteration 19 (of 50).   Current convergence value = 7.59649e-05 (threshold = 1e-07)
  Iteration 20 (of 50).   Current convergence value = 7.70584e-05 (threshold = 1e-07)
  Iteration 21 (of 50).   Current convergence value = 7.88644e-05 (threshold = 1e-07)
  Iteration 22 (of 50).   Current convergence value = 8.08678e-05 (threshold = 1e-07)
  Iteration 23 (of 50).   Current convergence value = 8.32778e-05 (threshold = 1e-07)
  Iteration 24 (of 50).   Current convergence value = 8.57467e-05 (threshold = 1e-07)
  Iteration 25 (of 50).   Current convergence value = 8.84611e-05 (threshold = 1e-07)
  Iteration 26 (of 50).   Current convergence value = 9.09405e-05 (threshold = 1e-07)
  Iteration 27 (of 50).   Current convergence value = 9.33668e-05 (threshold = 1e-07)
  Iteration 28 (of 50).   Current convergence value = 9.55817e-05 (threshold = 1e-07)
  Iteration 29 (of 50).   Current convergence value = 9.79414e-05 (threshold = 1e-07)
  Iteration 30 (of 50).   Current convergence value = 0.00010048 (threshold = 1e-07)
  Iteration 31 (of 50).   Current convergence value = 0.000102694 (threshold = 1e-07)
  Iteration 32 (of 50).   Current convergence value = 0.000104657 (threshold = 1e-07)
  Iteration 33 (of 50).   Current convergence value = 0.000106643 (threshold = 1e-07)
  Iteration 34 (of 50).   Current convergence value = 0.000108547 (threshold = 1e-07)
  Iteration 35 (of 50).   Current convergence value = 0.000110276 (threshold = 1e-07)
  Iteration 36 (of 50).   Current convergence value = 0.000111643 (threshold = 1e-07)
  Iteration 37 (of 50).   Current convergence value = 0.000113066 (threshold = 1e-07)
  Iteration 38 (of 50).   Current convergence value = 0.000114499 (threshold = 1e-07)
  Iteration 39 (of 50).   Current convergence value = 0.000115749 (threshold = 1e-07)
  Iteration 40 (of 50).   Current convergence value = 0.000116742 (threshold = 1e-07)
  Iteration 41 (of 50).   Current convergence value = 0.000117687 (threshold = 1e-07)
  Iteration 42 (of 50).   Current convergence value = 0.000118778 (threshold = 1e-07)
  Iteration 43 (of 50).   Current convergence value = 0.000119437 (threshold = 1e-07)
  Iteration 44 (of 50).   Current convergence value = 0.000119962 (threshold = 1e-07)
  Iteration 45 (of 50).   Current convergence value = 0.000120585 (threshold = 1e-07)
  Iteration 46 (of 50).   Current convergence value = 0.00012101 (threshold = 1e-07)
  Iteration 47 (of 50).   Current convergence value = 0.000121595 (threshold = 1e-07)
  Iteration 48 (of 50).   Current convergence value = 0.000121959 (threshold = 1e-07)
  Iteration 49 (of 50).   Current convergence value = 0.000122033 (threshold = 1e-07)
  Iteration 50 (of 50).   Current convergence value = 0.000122069 (threshold = 1e-07)
Current level = 2
  Iteration 1 (of 50).   Current convergence value = 0.000319698 (threshold = 1e-07)
  Iteration 2 (of 50).   Current convergence value = 0.000293483 (threshold = 1e-07)
  Iteration 3 (of 50).   Current convergence value = 0.00027774 (threshold = 1e-07)
  Iteration 4 (of 50).   Current convergence value = 0.000267074 (threshold = 1e-07)
  Iteration 5 (of 50).   Current convergence value = 0.000262886 (threshold = 1e-07)
  Iteration 6 (of 50).   Current convergence value = 0.000259542 (threshold = 1e-07)
  Iteration 7 (of 50).   Current convergence value = 0.000244067 (threshold = 1e-07)
  Iteration 8 (of 50).   Current convergence value = 0.000240545 (threshold = 1e-07)
  Iteration 9 (of 50).   Current convergence value = 0.000243487 (threshold = 1e-07)
  Iteration 10 (of 50).   Current convergence value = 0.000247621 (threshold = 1e-07)
  Iteration 11 (of 50).   Current convergence value = 0.000250582 (threshold = 1e-07)
  Iteration 12 (of 50).   Current convergence value = 0.000253998 (threshold = 1e-07)
  Iteration 13 (of 50).   Current convergence value = 0.000257883 (threshold = 1e-07)
  Iteration 14 (of 50).   Current convergence value = 0.000305431 (threshold = 1e-07)
  Iteration 15 (of 50).   Current convergence value = 0.000364949 (threshold = 1e-07)
  Iteration 16 (of 50).   Current convergence value = 0.000411208 (threshold = 1e-07)
  Iteration 17 (of 50).   Current convergence value = 0.000443495 (threshold = 1e-07)
  Iteration 18 (of 50).   Current convergence value = 0.000463327 (threshold = 1e-07)
  Iteration 19 (of 50).   Current convergence value = 0.000475085 (threshold = 1e-07)
  Iteration 20 (of 50).   Current convergence value = 0.000479303 (threshold = 1e-07)
  Iteration 21 (of 50).   Current convergence value = 0.00047659 (threshold = 1e-07)
  Iteration 22 (of 50).   Current convergence value = 0.000474205 (threshold = 1e-07)
  Iteration 23 (of 50).   Current convergence value = 0.000471254 (threshold = 1e-07)
  Iteration 24 (of 50).   Current convergence value = 0.000467801 (threshold = 1e-07)
  Iteration 25 (of 50).   Current convergence value = 0.000464324 (threshold = 1e-07)
  Iteration 26 (of 50).   Current convergence value = 0.000460194 (threshold = 1e-07)
  Iteration 27 (of 50).   Current convergence value = 0.000455766 (threshold = 1e-07)
  Iteration 28 (of 50).   Current convergence value = 0.000452132 (threshold = 1e-07)
  Iteration 29 (of 50).   Current convergence value = 0.000448048 (threshold = 1e-07)
  Iteration 30 (of 50).   Current convergence value = 0.000443853 (threshold = 1e-07)
  Iteration 31 (of 50).   Current convergence value = 0.000438566 (threshold = 1e-07)
  Iteration 32 (of 50).   Current convergence value = 0.000431888 (threshold = 1e-07)
  Iteration 33 (of 50).   Current convergence value = 0.000418698 (threshold = 1e-07)
  Iteration 34 (of 50).   Current convergence value = 0.000408875 (threshold = 1e-07)
  Iteration 35 (of 50).   Current convergence value = 0.000400419 (threshold = 1e-07)
  Iteration 36 (of 50).   Current convergence value = 0.000392837 (threshold = 1e-07)
  Iteration 37 (of 50).   Current convergence value = 0.000386572 (threshold = 1e-07)
  Iteration 38 (of 50).   Current convergence value = 0.000380678 (threshold = 1e-07)
  Iteration 39 (of 50).   Current convergence value = 0.000375149 (threshold = 1e-07)
  Iteration 40 (of 50).   Current convergence value = 0.000370495 (threshold = 1e-07)
  Iteration 41 (of 50).   Current convergence value = 0.000365831 (threshold = 1e-07)
  Iteration 42 (of 50).   Current convergence value = 0.000361119 (threshold = 1e-07)
  Iteration 43 (of 50).   Current convergence value = 0.000357128 (threshold = 1e-07)
  Iteration 44 (of 50).   Current convergence value = 0.000352868 (threshold = 1e-07)
  Iteration 45 (of 50).   Current convergence value = 0.00034917 (threshold = 1e-07)
  Iteration 46 (of 50).   Current convergence value = 0.000345775 (threshold = 1e-07)
  Iteration 47 (of 50).   Current convergence value = 0.000342563 (threshold = 1e-07)
  Iteration 48 (of 50).   Current convergence value = 0.00033929 (threshold = 1e-07)
  Iteration 49 (of 50).   Current convergence value = 0.000335977 (threshold = 1e-07)
  Iteration 50 (of 50).   Current convergence value = 0.000332689 (threshold = 1e-07)
Current level = 3
  Iteration 1 (of 50).   Current convergence value = 0.00109544 (threshold = 1e-07)
  Iteration 2 (of 50).   Current convergence value = 0.000969624 (threshold = 1e-07)
  Iteration 3 (of 50).   Current convergence value = 0.000926592 (threshold = 1e-07)
  Iteration 4 (of 50).   Current convergence value = 0.000861476 (threshold = 1e-07)
  Iteration 5 (of 50).   Current convergence value = 0.000797494 (threshold = 1e-07)
  Iteration 6 (of 50).   Current convergence value = 0.000793982 (threshold = 1e-07)
  Iteration 7 (of 50).   Current convergence value = 0.000860627 (threshold = 1e-07)
  Iteration 8 (of 50).   Current convergence value = 0.000981919 (threshold = 1e-07)
  Iteration 9 (of 50).   Current convergence value = 0.0011384 (threshold = 1e-07)
  Iteration 10 (of 50).   Current convergence value = 0.00115099 (threshold = 1e-07)
  Iteration 11 (of 50).   Current convergence value = 0.000803673 (threshold = 1e-07)
  Iteration 12 (of 50).   Current convergence value = 0.000896869 (threshold = 1e-07)
  Iteration 13 (of 50).   Current convergence value = 0.00103214 (threshold = 1e-07)
  Iteration 14 (of 50).   Current convergence value = 0.00110564 (threshold = 1e-07)
  Iteration 15 (of 50).   Current convergence value = 0.00113306 (threshold = 1e-07)
  Iteration 16 (of 50).   Current convergence value = 0.00112429 (threshold = 1e-07)
  Iteration 17 (of 50).   Current convergence value = 0.00109802 (threshold = 1e-07)
  Iteration 18 (of 50).   Current convergence value = 0.000994582 (threshold = 1e-07)
  Iteration 19 (of 50).   Current convergence value = 0.000887958 (threshold = 1e-07)
  Iteration 20 (of 50).   Current convergence value = 0.00081226 (threshold = 1e-07)
  Iteration 21 (of 50).   Current convergence value = 0.000797155 (threshold = 1e-07)
  Iteration 22 (of 50).   Current convergence value = 0.000893286 (threshold = 1e-07)
  Iteration 23 (of 50).   Current convergence value = 0.00112489 (threshold = 1e-07)
  Iteration 24 (of 50).   Current convergence value = 0.00132829 (threshold = 1e-07)
  Iteration 25 (of 50).   Current convergence value = 0.000836077 (threshold = 1e-07)
  Iteration 26 (of 50).   Current convergence value = 0.00092463 (threshold = 1e-07)
  Iteration 27 (of 50).   Current convergence value = 0.00110939 (threshold = 1e-07)
  Iteration 28 (of 50).   Current convergence value = 0.00119724 (threshold = 1e-07)
  Iteration 29 (of 50).   Current convergence value = 0.00121572 (threshold = 1e-07)
  Iteration 30 (of 50).   Current convergence value = 0.00117405 (threshold = 1e-07)
  Iteration 31 (of 50).   Current convergence value = 0.0010488 (threshold = 1e-07)
  Iteration 32 (of 50).   Current convergence value = 0.000943246 (threshold = 1e-07)
  Iteration 33 (of 50).   Current convergence value = 0.000838214 (threshold = 1e-07)
  Iteration 34 (of 50).   Current convergence value = 0.000733387 (threshold = 1e-07)
  Iteration 35 (of 50).   Current convergence value = 0.000724788 (threshold = 1e-07)
  Iteration 36 (of 50).   Current convergence value = 0.000838517 (threshold = 1e-07)
  Iteration 37 (of 50).   Current convergence value = 0.00104515 (threshold = 1e-07)
  Iteration 38 (of 50).   Current convergence value = 0.00105862 (threshold = 1e-07)
  Iteration 39 (of 50).   Current convergence value = 0.000809431 (threshold = 1e-07)
  Iteration 40 (of 50).   Current convergence value = 0.000661558 (threshold = 1e-07)
  Iteration 41 (of 50).   Current convergence value = 0.000755348 (threshold = 1e-07)
  Iteration 42 (of 50).   Current convergence value = 0.000897101 (threshold = 1e-07)
  Iteration 43 (of 50).   Current convergence value = 0.000974626 (threshold = 1e-07)
  Iteration 44 (of 50).   Current convergence value = 0.00100596 (threshold = 1e-07)
  Iteration 45 (of 50).   Current convergence value = 0.0010112 (threshold = 1e-07)
  Iteration 46 (of 50).   Current convergence value = 0.000950699 (threshold = 1e-07)
  Iteration 47 (of 50).   Current convergence value = 0.000872186 (threshold = 1e-07)
  Iteration 48 (of 50).   Current convergence value = 0.000810707 (threshold = 1e-07)
  Iteration 49 (of 50).   Current convergence value = 0.000755953 (threshold = 1e-07)
  Iteration 50 (of 50).   Current convergence value = 0.000707164 (threshold = 1e-07)
Current level = 4
  Iteration 1 (of 50).   Current convergence value = 0.00192867 (threshold = 1e-07)
  Iteration 2 (of 50).   Current convergence value = 0.00176073 (threshold = 1e-07)
  Iteration 3 (of 50).   Current convergence value = 0.00158143 (threshold = 1e-07)
  Iteration 4 (of 50).   Current convergence value = 0.00145515 (threshold = 1e-07)
  Iteration 5 (of 50).   Current convergence value = 0.00142343 (threshold = 1e-07)
  Iteration 6 (of 50).   Current convergence value = 0.00134229 (threshold = 1e-07)
  Iteration 7 (of 50).   Current convergence value = 0.00117678 (threshold = 1e-07)
  Iteration 8 (of 50).   Current convergence value = 0.00109045 (threshold = 1e-07)
  Iteration 9 (of 50).   Current convergence value = 0.00105216 (threshold = 1e-07)
  Iteration 10 (of 50).   Current convergence value = 0.00103396 (threshold = 1e-07)
  Iteration 11 (of 50).   Current convergence value = 0.00103388 (threshold = 1e-07)
  Iteration 12 (of 50).   Current convergence value = 0.00109655 (threshold = 1e-07)
  Iteration 13 (of 50).   Current convergence value = 0.00112761 (threshold = 1e-07)
  Iteration 14 (of 50).   Current convergence value = 0.00110925 (threshold = 1e-07)
  Iteration 15 (of 50).   Current convergence value = 0.00106037 (threshold = 1e-07)
  Iteration 16 (of 50).   Current convergence value = 0.00102771 (threshold = 1e-07)
  Iteration 17 (of 50).   Current convergence value = 0.00100443 (threshold = 1e-07)
  Iteration 18 (of 50).   Current convergence value = 0.000987678 (threshold = 1e-07)
  Iteration 19 (of 50).   Current convergence value = 0.000973942 (threshold = 1e-07)
  Iteration 20 (of 50).   Current convergence value = 0.000958977 (threshold = 1e-07)
  Iteration 21 (of 50).   Current convergence value = 0.000944553 (threshold = 1e-07)
  Iteration 22 (of 50).   Current convergence value = 0.000936603 (threshold = 1e-07)
  Iteration 23 (of 50).   Current convergence value = 0.000931975 (threshold = 1e-07)
  Iteration 24 (of 50).   Current convergence value = 0.000920821 (threshold = 1e-07)
  Iteration 25 (of 50).   Current convergence value = 0.000923908 (threshold = 1e-07)
  Iteration 26 (of 50).   Current convergence value = 0.000937177 (threshold = 1e-07)
  Iteration 27 (of 50).   Current convergence value = 0.00099814 (threshold = 1e-07)
  Iteration 28 (of 50).   Current convergence value = 0.00103203 (threshold = 1e-07)
  Iteration 29 (of 50).   Current convergence value = 0.00104747 (threshold = 1e-07)
  Iteration 30 (of 50).   Current convergence value = 0.00108144 (threshold = 1e-07)
  Iteration 31 (of 50).   Current convergence value = 0.00111308 (threshold = 1e-07)
  Iteration 32 (of 50).   Current convergence value = 0.00115016 (threshold = 1e-07)
  Iteration 33 (of 50).   Current convergence value = 0.00113293 (threshold = 1e-07)
  Iteration 34 (of 50).   Current convergence value = 0.00109871 (threshold = 1e-07)
  Iteration 35 (of 50).   Current convergence value = 0.00107354 (threshold = 1e-07)
  Iteration 36 (of 50).   Current convergence value = 0.00105987 (threshold = 1e-07)
  Iteration 37 (of 50).   Current convergence value = 0.00104159 (threshold = 1e-07)
  Iteration 38 (of 50).   Current convergence value = 0.000940165 (threshold = 1e-07)
  Iteration 39 (of 50).   Current convergence value = 0.00084742 (threshold = 1e-07)
  Iteration 40 (of 50).   Current convergence value = 0.000774453 (threshold = 1e-07)
  Iteration 41 (of 50).   Current convergence value = 0.00071718 (threshold = 1e-07)
  Iteration 42 (of 50).   Current convergence value = 0.000673084 (threshold = 1e-07)
  Iteration 43 (of 50).   Current convergence value = 0.000641031 (threshold = 1e-07)
  Iteration 44 (of 50).   Current convergence value = 0.000617389 (threshold = 1e-07)
  Iteration 45 (of 50).   Current convergence value = 0.000596942 (threshold = 1e-07)
  Iteration 46 (of 50).   Current convergence value = 0.000586016 (threshold = 1e-07)
  Iteration 47 (of 50).   Current convergence value = 0.000582718 (threshold = 1e-07)
  Iteration 48 (of 50).   Current convergence value = 0.00058002 (threshold = 1e-07)
  Iteration 49 (of 50).   Current convergence value = 0.00057976 (threshold = 1e-07)
  Iteration 50 (of 50).   Current convergence value = 0.000582348 (threshold = 1e-07)
   N4BiasFieldCorrectionImageFilter (0x55cd50db1d30)
     RTTI typeinfo:   itk::N4BiasFieldCorrectionImageFilter<itk::Image<float, 3u>, itk::Image<float, 3u>, itk::Image<float, 3u> >
     Reference Count: 1
     Modified Time: 439
     Debug: Off
     Object Name: 
     Observers: 
       IterationEvent(Command)
     Inputs: 
       Primary: (0x55cd50dc15d0) *
       _1: (0x55cd50dbfcb0)
     Indexed Inputs: 
       0: Primary (0x55cd50dc15d0)
       1: _1 (0x55cd50dbfcb0)
     Required Input Names: Primary
     NumberOfRequiredInputs: 1
     Outputs: 
       Primary: (0x55cd50db9e50)
     Indexed Outputs: 
       0: Primary (0x55cd50db9e50)
     NumberOfRequiredOutputs: 1
     Number Of Threads: 16
     ReleaseDataFlag: Off
     ReleaseDataBeforeUpdateFlag: Off
     AbortGenerateData: Off
     Progress: 0
     Multithreader: 
       RTTI typeinfo:   itk::MultiThreader
       Reference Count: 1
       Modified Time: 132
       Debug: Off
       Object Name: 
       Observers: 
         none
       Thread Count: 16
       Global Maximum Number Of Threads: 128
       Global Default Number Of Threads: 16
     CoordinateTolerance: 1e-06
     DirectionTolerance: 1e-06
     Mask label: 1
     Number of histogram bins: 200
     Wiener filter noise: 0.01
     Bias field FWHM: 0.15
     Maximum number of iterations: [50, 50, 50, 50]
     Convergence threshold: 1e-07
     Spline order: 3
     Number of fitting levels: [4, 4, 4]
     Number of control points: [4, 5, 5]
     CurrentConvergenceMeasurement: 0.000582348
     CurrentLevel: 4
     ElapsedIterations: 51
     LogBiasFieldControlPointLattice: 
       Image (0x55cd50fb80e0)
         RTTI typeinfo:   itk::Image<itk::Vector<float, 1u>, 3u>
         Reference Count: 1
         Modified Time: 432774366
         Debug: Off
         Object Name: 
         Observers: 
           none
         Source: (none)
         Source output name: (none)
         Release Data: Off
         Data Released: False
         Global Release Data: Off
         PipelineMTime: 0
         UpdateMTime: 0
         RealTimeStamp: 0 seconds 
         LargestPossibleRegion: 
           Dimension: 3
           Index: [0, 0, 0]
           Size: [11, 19, 19]
         BufferedRegion: 
           Dimension: 3
           Index: [0, 0, 0]
           Size: [11, 19, 19]
         RequestedRegion: 
           Dimension: 3
           Index: [0, 0, 0]
           Size: [11, 19, 19]
         Spacing: [24.5, 24.75, 24.75]
         Origin: [-26.037, 19.4713, -27.7185]
         Direction: 
0.998537 0.0105037 0.053047
1.50344e-07 -0.980955 0.194234
-0.0540769 0.19395 0.97952

         IndexToPointMatrix: 
24.4642 0.259968 1.31291
3.68343e-06 -24.2786 4.8073
-1.32488 4.80027 24.2431

         PointToIndexMatrix: 
0.0407566 6.1479e-09 -0.00220722
0.000424394 -0.0396346 0.00783637
0.00214331 0.00784785 0.0395766

         Inverse Direction: 
0.998537 1.50624e-07 -0.0540769
0.0105037 -0.980955 0.19395
0.053047 0.194234 0.97952

         PixelContainer: 
           ImportImageContainer (0x55cd518a0db0)
             RTTI typeinfo:   itk::ImportImageContainer<unsigned long, itk::Vector<float, 1u> >
             Reference Count: 1
             Modified Time: 432774367
             Debug: Off
             Object Name: 
             Observers: 
               none
             Pointer: 0x55cd511a4390
             Container manages memory: true
             Size: 3971
             Capacity: 3971
Elapsed time: 177.664
END   <<<<<<<<<<<<<<<<<<<<



--------------------------------------------------------------------------------------
 Done with N4 correction (pre brain extraction):  0h 3m 13s
--------------------------------------------------------------------------------------


--------------------------------------------------------------------------------------
 Brain extraction using the following steps:
   1) Register /home/mpib/LNDG/StateSwitch/WIP_rest/preproc/B_data/C_standards/ANTS/MICCAI2012-Multi-Atlas-Challenge-Data/T_template0.nii.gz to /home/mpib/LNDG/StateSwitch/WIP_rest/preproc/B_data/D_preproc/1252/mri/t1/tempANTs/1252_t1_ANTsBET_N4Corrected0.nii.gz
   2) Warp /home/mpib/LNDG/StateSwitch/WIP_rest/preproc/B_data/C_standards/ANTS/MICCAI2012-Multi-Atlas-Challenge-Data/T_template0_BrainCerebellumProbabilityMask.nii.gz to /home/mpib/LNDG/StateSwitch/WIP_rest/preproc/B_data/D_preproc/1252/mri/t1/1252_t1.nii.gz using, from 1),
      /home/mpib/LNDG/StateSwitch/WIP_rest/preproc/B_data/D_preproc/1252/mri/t1/tempANTs/1252_t1_ANTsBET_BrainExtractionWarp/Affine
   3) Refine segmentation results using Atropos
--------------------------------------------------------------------------------------

BEGIN >>>>>>>>>>>>>>>>>>>>
/usr/lib/ants//ResampleImageBySpacing 3 /home/mpib/LNDG/StateSwitch/WIP_rest/preproc/B_data/C_standards/ANTS/MICCAI2012-Multi-Atlas-Challenge-Data/T_template0.nii.gz /home/mpib/LNDG/StateSwitch/WIP_rest/preproc/B_data/D_preproc/1252/mri/t1/tempANTs/1252_t1_ANTsBET_BrainExtractionInitialAffineFixed.nii.gz 4 4 4 1
 spacing [1, 1, 1] dim 3
 spacing2 [4, 4, 4]
 smoothing by : 3 dir 0
 smoothing by : 3 dir 1
 smoothing by : 3 dir 2
 out space [4, 4, 4]
 output size [54, 64, 72] spc [4, 4, 4]
END   <<<<<<<<<<<<<<<<<<<<


BEGIN >>>>>>>>>>>>>>>>>>>>
/usr/lib/ants//ResampleImageBySpacing 3 /home/mpib/LNDG/StateSwitch/WIP_rest/preproc/B_data/D_preproc/1252/mri/t1/tempANTs/1252_t1_ANTsBET_N4Corrected0.nii.gz /home/mpib/LNDG/StateSwitch/WIP_rest/preproc/B_data/D_preproc/1252/mri/t1/tempANTs/1252_t1_ANTsBET_BrainExtractionInitialAffineMoving.nii.gz 4 4 4 1
 spacing [1, 1, 1] dim 3
 spacing2 [4, 4, 4]
 smoothing by : 3 dir 0
 smoothing by : 3 dir 1
 smoothing by : 3 dir 2
 out space [4, 4, 4]
 output size [48, 64, 64] spc [4, 4, 4]
END   <<<<<<<<<<<<<<<<<<<<


BEGIN >>>>>>>>>>>>>>>>>>>>
/usr/lib/ants//ImageMath 3 /home/mpib/LNDG/StateSwitch/WIP_rest/preproc/B_data/D_preproc/1252/mri/t1/tempANTs/1252_t1_ANTsBET_BrainExtractionLaplacian.nii.gz Laplacian /home/mpib/LNDG/StateSwitch/WIP_rest/preproc/B_data/D_preproc/1252/mri/t1/tempANTs/1252_t1_ANTsBET_N4Corrected0.nii.gz 1.5 1
END   <<<<<<<<<<<<<<<<<<<<


BEGIN >>>>>>>>>>>>>>>>>>>>
/usr/lib/ants//ImageMath 3 /home/mpib/LNDG/StateSwitch/WIP_rest/preproc/B_data/D_preproc/1252/mri/t1/tempANTs/1252_t1_ANTsBET_BrainExtractionTemplateLaplacian.nii.gz Laplacian /home/mpib/LNDG/StateSwitch/WIP_rest/preproc/B_data/C_standards/ANTS/MICCAI2012-Multi-Atlas-Challenge-Data/T_template0.nii.gz 1.5 1
END   <<<<<<<<<<<<<<<<<<<<


BEGIN >>>>>>>>>>>>>>>>>>>>
/usr/lib/ants//antsAI -d 3 -v 1 -m Mattes[/home/mpib/LNDG/StateSwitch/WIP_rest/preproc/B_data/D_preproc/1252/mri/t1/tempANTs/1252_t1_ANTsBET_BrainExtractionInitialAffineFixed.nii.gz,/home/mpib/LNDG/StateSwitch/WIP_rest/preproc/B_data/D_preproc/1252/mri/t1/tempANTs/1252_t1_ANTsBET_BrainExtractionInitialAffineMoving.nii.gz,32,Regular,0.25] -t Affine[0.1] -s [15,0.1] -p 0 -c 10 -o /home/mpib/LNDG/StateSwitch/WIP_rest/preproc/B_data/D_preproc/1252/mri/t1/tempANTs/1252_t1_ANTsBET_BrainExtractionInitialAffine.mat -x //home/mpib/LNDG/StateSwitch/WIP_rest/preproc/B_data/C_standards/ANTS/MICCAI2012-Multi-Atlas-Challenge-Data/T_template0_BrainCerebellumRegistrationMask.nii.gz
Using the Mattes MI metric (number of bins = 32)
END   <<<<<<<<<<<<<<<<<<<<


BEGIN >>>>>>>>>>>>>>>>>>>>
/usr/lib/ants//antsRegistration -d 3 -u 1 -w [0.025,0.975] -o /home/mpib/LNDG/StateSwitch/WIP_rest/preproc/B_data/D_preproc/1252/mri/t1/tempANTs/1252_t1_ANTsBET_BrainExtractionPrior -r /home/mpib/LNDG/StateSwitch/WIP_rest/preproc/B_data/D_preproc/1252/mri/t1/tempANTs/1252_t1_ANTsBET_BrainExtractionInitialAffine.mat -z 1 --float 0 --verbose 1 -x [//home/mpib/LNDG/StateSwitch/WIP_rest/preproc/B_data/C_standards/ANTS/MICCAI2012-Multi-Atlas-Challenge-Data/T_template0_BrainCerebellumRegistrationMask.nii.gz] -m MI[/home/mpib/LNDG/StateSwitch/WIP_rest/preproc/B_data/C_standards/ANTS/MICCAI2012-Multi-Atlas-Challenge-Data/T_template0.nii.gz,/home/mpib/LNDG/StateSwitch/WIP_rest/preproc/B_data/D_preproc/1252/mri/t1/tempANTs/1252_t1_ANTsBET_N4Corrected0.nii.gz,1,32,Regular,0.25] -c [1000x500x250x100,1e-8,10] -t Rigid[0.1] -f 8x4x2x1 -s 4x2x1x0 -m MI[/home/mpib/LNDG/StateSwitch/WIP_rest/preproc/B_data/C_standards/ANTS/MICCAI2012-Multi-Atlas-Challenge-Data/T_template0.nii.gz,/home/mpib/LNDG/StateSwitch/WIP_rest/preproc/B_data/D_preproc/1252/mri/t1/tempANTs/1252_t1_ANTsBET_N4Corrected0.nii.gz,1,32,Regular,0.25] -c [1000x500x250x100,1e-8,10] -t Affine[0.1] -f 8x4x2x1 -s 4x2x1x0 -m CC[/home/mpib/LNDG/StateSwitch/WIP_rest/preproc/B_data/C_standards/ANTS/MICCAI2012-Multi-Atlas-Challenge-Data/T_template0.nii.gz,/home/mpib/LNDG/StateSwitch/WIP_rest/preproc/B_data/D_preproc/1252/mri/t1/tempANTs/1252_t1_ANTsBET_N4Corrected0.nii.gz,0.5,4] -m CC[/home/mpib/LNDG/StateSwitch/WIP_rest/preproc/B_data/D_preproc/1252/mri/t1/tempANTs/1252_t1_ANTsBET_BrainExtractionTemplateLaplacian.nii.gz,/home/mpib/LNDG/StateSwitch/WIP_rest/preproc/B_data/D_preproc/1252/mri/t1/tempANTs/1252_t1_ANTsBET_BrainExtractionLaplacian.nii.gz,0.5,4] -c [50x10x0,1e-9,15] -t SyN[0.1,3,0] -f 4x2x1 -s 2x1x0
All_Command_lines_OK
Using double precision for computations.
=============================================================================
The composite transform comprises the following transforms (in order): 
  1. /home/mpib/LNDG/StateSwitch/WIP_rest/preproc/B_data/D_preproc/1252/mri/t1/tempANTs/1252_t1_ANTsBET_BrainExtractionInitialAffine.mat (type = AffineTransform)
=============================================================================
  Reading mask(s).
    Registration stage 0
      Fixed mask = //home/mpib/LNDG/StateSwitch/WIP_rest/preproc/B_data/C_standards/ANTS/MICCAI2012-Multi-Atlas-Challenge-Data/T_template0_BrainCerebellumRegistrationMask.nii.gz
  number of levels = 4
  number of levels = 4
  number of levels = 3
  fixed image: /home/mpib/LNDG/StateSwitch/WIP_rest/preproc/B_data/C_standards/ANTS/MICCAI2012-Multi-Atlas-Challenge-Data/T_template0.nii.gz
  moving image: /home/mpib/LNDG/StateSwitch/WIP_rest/preproc/B_data/D_preproc/1252/mri/t1/tempANTs/1252_t1_ANTsBET_N4Corrected0.nii.gz
  fixed image: /home/mpib/LNDG/StateSwitch/WIP_rest/preproc/B_data/C_standards/ANTS/MICCAI2012-Multi-Atlas-Challenge-Data/T_template0.nii.gz
  moving image: /home/mpib/LNDG/StateSwitch/WIP_rest/preproc/B_data/D_preproc/1252/mri/t1/tempANTs/1252_t1_ANTsBET_N4Corrected0.nii.gz
  fixed image: /home/mpib/LNDG/StateSwitch/WIP_rest/preproc/B_data/C_standards/ANTS/MICCAI2012-Multi-Atlas-Challenge-Data/T_template0.nii.gz
  moving image: /home/mpib/LNDG/StateSwitch/WIP_rest/preproc/B_data/D_preproc/1252/mri/t1/tempANTs/1252_t1_ANTsBET_N4Corrected0.nii.gz
  fixed image: /home/mpib/LNDG/StateSwitch/WIP_rest/preproc/B_data/D_preproc/1252/mri/t1/tempANTs/1252_t1_ANTsBET_BrainExtractionTemplateLaplacian.nii.gz
  moving image: /home/mpib/LNDG/StateSwitch/WIP_rest/preproc/B_data/D_preproc/1252/mri/t1/tempANTs/1252_t1_ANTsBET_BrainExtractionLaplacian.nii.gz
Dimension = 3
Number of stages = 3
Use Histogram Matching true
Winsorize image intensities true
Lower quantile = 0.025
Upper quantile = 0.975
Stage 1 State
   Image metric = Mattes
     Fixed image = Image (0x563de19b47e0)
  RTTI typeinfo:   itk::Image<double, 3u>
  Reference Count: 2
  Modified Time: 1666
  Debug: Off
  Object Name: 
  Observers: 
    none
  Source: (none)
  Source output name: (none)
  Release Data: Off
  Data Released: False
  Global Release Data: Off
  PipelineMTime: 0
  UpdateMTime: 1501
  RealTimeStamp: 0 seconds 
  LargestPossibleRegion: 
    Dimension: 3
    Index: [0, 0, 0]
    Size: [216, 256, 291]
  BufferedRegion: 
    Dimension: 3
    Index: [0, 0, 0]
    Size: [216, 256, 291]
  RequestedRegion: 
    Dimension: 3
    Index: [0, 0, 0]
    Size: [216, 256, 291]
  Spacing: [1, 1, 1]
  Origin: [0, 293, 0]
  Direction: 
1 0 0
0 -0 -1
0 -1 -0

  IndexToPointMatrix: 
1 0 0
0 0 -1
0 -1 0

  PointToIndexMatrix: 
1 0 0
0 0 -1
0 -1 0

  Inverse Direction: 
1 0 0
0 0 -1
0 -1 0

  PixelContainer: 
    ImportImageContainer (0x563de19b89d0)
      RTTI typeinfo:   itk::ImportImageContainer<unsigned long, double>
      Reference Count: 1
      Modified Time: 1498
      Debug: Off
      Object Name: 
      Observers: 
        none
      Pointer: 0x7fbfcaf41010
      Container manages memory: true
      Size: 16091136
      Capacity: 16091136

     Moving image = Image (0x563de19b6620)
  RTTI typeinfo:   itk::Image<double, 3u>
  Reference Count: 2
  Modified Time: 1667
  Debug: Off
  Object Name: 
  Observers: 
    none
  Source: (none)
  Source output name: (none)
  Release Data: Off
  Data Released: False
  Global Release Data: Off
  PipelineMTime: 0
  UpdateMTime: 1664
  RealTimeStamp: 0 seconds 
  LargestPossibleRegion: 
    Dimension: 3
    Index: [0, 0, 0]
    Size: [192, 256, 256]
  BufferedRegion: 
    Dimension: 3
    Index: [0, 0, 0]
    Size: [192, 256, 256]
  RequestedRegion: 
    Dimension: 3
    Index: [0, 0, 0]
    Size: [192, 256, 256]
  Spacing: [1, 1, 1]
  Origin: [-99.2712, 81.1606, -140.381]
  Direction: 
0.998537 0.0105037 0.053047
1.50344e-07 -0.980955 0.194234
-0.0540769 0.19395 0.97952

  IndexToPointMatrix: 
0.998537 0.0105037 0.053047
1.50344e-07 -0.980955 0.194234
-0.0540769 0.19395 0.97952

  PointToIndexMatrix: 
0.998537 1.50624e-07 -0.0540769
0.0105037 -0.980955 0.19395
0.053047 0.194234 0.97952

  Inverse Direction: 
0.998537 1.50624e-07 -0.0540769
0.0105037 -0.980955 0.19395
0.053047 0.194234 0.97952

  PixelContainer: 
    ImportImageContainer (0x563de19b88c0)
      RTTI typeinfo:   itk::ImportImageContainer<unsigned long, double>
      Reference Count: 1
      Modified Time: 1661
      Debug: Off
      Object Name: 
      Observers: 
        none
      Pointer: 0x7fbfc4f40010
      Container manages memory: true
      Size: 12582912
      Capacity: 12582912

     Weighting = 1
     Sampling strategy = regular
     Number of bins = 32
     Radius = 4
     Sampling percentage  = 0.25
   Transform = Rigid
     Gradient step = 0.1
     Update field sigma (voxel space) = 0
     Total field sigma (voxel space) = 0
     Update field time sigma = 0
     Total field time sigma  = 0
     Number of time indices = 0
     Number of time point samples = 0
Stage 2 State
   Image metric = Mattes
     Fixed image = Image (0x563de19c1910)
  RTTI typeinfo:   itk::Image<double, 3u>
  Reference Count: 2
  Modified Time: 1994
  Debug: Off
  Object Name: 
  Observers: 
    none
  Source: (none)
  Source output name: (none)
  Release Data: Off
  Data Released: False
  Global Release Data: Off
  PipelineMTime: 0
  UpdateMTime: 1829
  RealTimeStamp: 0 seconds 
  LargestPossibleRegion: 
    Dimension: 3
    Index: [0, 0, 0]
    Size: [216, 256, 291]
  BufferedRegion: 
    Dimension: 3
    Index: [0, 0, 0]
    Size: [216, 256, 291]
  RequestedRegion: 
    Dimension: 3
    Index: [0, 0, 0]
    Size: [216, 256, 291]
  Spacing: [1, 1, 1]
  Origin: [0, 293, 0]
  Direction: 
1 0 0
0 -0 -1
0 -1 -0

  IndexToPointMatrix: 
1 0 0
0 0 -1
0 -1 0

  PointToIndexMatrix: 
1 0 0
0 0 -1
0 -1 0

  Inverse Direction: 
1 0 0
0 0 -1
0 -1 0

  PixelContainer: 
    ImportImageContainer (0x563de19b83a0)
      RTTI typeinfo:   itk::ImportImageContainer<unsigned long, double>
      Reference Count: 1
      Modified Time: 1826
      Debug: Off
      Object Name: 
      Observers: 
        none
      Pointer: 0x7fbfbd47b010
      Container manages memory: true
      Size: 16091136
      Capacity: 16091136

     Moving image = Image (0x563de19c6fa0)
  RTTI typeinfo:   itk::Image<double, 3u>
  Reference Count: 2
  Modified Time: 1995
  Debug: Off
  Object Name: 
  Observers: 
    none
  Source: (none)
  Source output name: (none)
  Release Data: Off
  Data Released: False
  Global Release Data: Off
  PipelineMTime: 0
  UpdateMTime: 1992
  RealTimeStamp: 0 seconds 
  LargestPossibleRegion: 
    Dimension: 3
    Index: [0, 0, 0]
    Size: [192, 256, 256]
  BufferedRegion: 
    Dimension: 3
    Index: [0, 0, 0]
    Size: [192, 256, 256]
  RequestedRegion: 
    Dimension: 3
    Index: [0, 0, 0]
    Size: [192, 256, 256]
  Spacing: [1, 1, 1]
  Origin: [-99.2712, 81.1606, -140.381]
  Direction: 
0.998537 0.0105037 0.053047
1.50344e-07 -0.980955 0.194234
-0.0540769 0.19395 0.97952

  IndexToPointMatrix: 
0.998537 0.0105037 0.053047
1.50344e-07 -0.980955 0.194234
-0.0540769 0.19395 0.97952

  PointToIndexMatrix: 
0.998537 1.50624e-07 -0.0540769
0.0105037 -0.980955 0.19395
0.053047 0.194234 0.97952

  Inverse Direction: 
0.998537 1.50624e-07 -0.0540769
0.0105037 -0.980955 0.19395
0.053047 0.194234 0.97952

  PixelContainer: 
    ImportImageContainer (0x563de19bb670)
      RTTI typeinfo:   itk::ImportImageContainer<unsigned long, double>
      Reference Count: 1
      Modified Time: 1989
      Debug: Off
      Object Name: 
      Observers: 
        none
      Pointer: 0x7fbfb747a010
      Container manages memory: true
      Size: 12582912
      Capacity: 12582912

     Weighting = 1
     Sampling strategy = regular
     Number of bins = 32
     Radius = 4
     Sampling percentage  = 0.25
   Transform = Affine
     Gradient step = 0.1
     Update field sigma (voxel space) = 0
     Total field sigma (voxel space) = 0
     Update field time sigma = 0
     Total field time sigma  = 0
     Number of time indices = 0
     Number of time point samples = 0
Stage 3 State
   Image metric = CC
     Fixed image = Image (0x563de19c8db0)
  RTTI typeinfo:   itk::Image<double, 3u>
  Reference Count: 2
  Modified Time: 2322
  Debug: Off
  Object Name: 
  Observers: 
    none
  Source: (none)
  Source output name: (none)
  Release Data: Off
  Data Released: False
  Global Release Data: Off
  PipelineMTime: 0
  UpdateMTime: 2157
  RealTimeStamp: 0 seconds 
  LargestPossibleRegion: 
    Dimension: 3
    Index: [0, 0, 0]
    Size: [216, 256, 291]
  BufferedRegion: 
    Dimension: 3
    Index: [0, 0, 0]
    Size: [216, 256, 291]
  RequestedRegion: 
    Dimension: 3
    Index: [0, 0, 0]
    Size: [216, 256, 291]
  Spacing: [1, 1, 1]
  Origin: [0, 293, 0]
  Direction: 
1 0 0
0 -0 -1
0 -1 -0

  IndexToPointMatrix: 
1 0 0
0 0 -1
0 -1 0

  PointToIndexMatrix: 
1 0 0
0 0 -1
0 -1 0

  Inverse Direction: 
1 0 0
0 0 -1
0 -1 0

  PixelContainer: 
    ImportImageContainer (0x563de19b9400)
      RTTI typeinfo:   itk::ImportImageContainer<unsigned long, double>
      Reference Count: 1
      Modified Time: 2154
      Debug: Off
      Object Name: 
      Observers: 
        none
      Pointer: 0x7fbfaf9b5010
      Container manages memory: true
      Size: 16091136
      Capacity: 16091136

     Moving image = Image (0x563de19caf40)
  RTTI typeinfo:   itk::Image<double, 3u>
  Reference Count: 2
  Modified Time: 2323
  Debug: Off
  Object Name: 
  Observers: 
    none
  Source: (none)
  Source output name: (none)
  Release Data: Off
  Data Released: False
  Global Release Data: Off
  PipelineMTime: 0
  UpdateMTime: 2320
  RealTimeStamp: 0 seconds 
  LargestPossibleRegion: 
    Dimension: 3
    Index: [0, 0, 0]
    Size: [192, 256, 256]
  BufferedRegion: 
    Dimension: 3
    Index: [0, 0, 0]
    Size: [192, 256, 256]
  RequestedRegion: 
    Dimension: 3
    Index: [0, 0, 0]
    Size: [192, 256, 256]
  Spacing: [1, 1, 1]
  Origin: [-99.2712, 81.1606, -140.381]
  Direction: 
0.998537 0.0105037 0.053047
1.50344e-07 -0.980955 0.194234
-0.0540769 0.19395 0.97952

  IndexToPointMatrix: 
0.998537 0.0105037 0.053047
1.50344e-07 -0.980955 0.194234
-0.0540769 0.19395 0.97952

  PointToIndexMatrix: 
0.998537 1.50624e-07 -0.0540769
0.0105037 -0.980955 0.19395
0.053047 0.194234 0.97952

  Inverse Direction: 
0.998537 1.50624e-07 -0.0540769
0.0105037 -0.980955 0.19395
0.053047 0.194234 0.97952

  PixelContainer: 
    ImportImageContainer (0x563de19c54d0)
      RTTI typeinfo:   itk::ImportImageContainer<unsigned long, double>
      Reference Count: 1
      Modified Time: 2317
      Debug: Off
      Object Name: 
      Observers: 
        none
      Pointer: 0x7fbfa99b4010
      Container manages memory: true
      Size: 12582912
      Capacity: 12582912

     Weighting = 0.5
     Sampling strategy = none
     Number of bins = 32
     Radius = 4
     Sampling percentage  = 1
   Transform = SyN
     Gradient step = 0.1
     Update field sigma (voxel space) = 3
     Total field sigma (voxel space) = 0
     Update field time sigma = 0
     Total field time sigma  = 0
     Number of time indices = 0
     Number of time point samples = 0
Registration using 3 total stages.

Stage 0
  iterations = 1000x500x250x100
  convergence threshold = 1e-08
  convergence window size = 10
  number of levels = 4
  using the Mattes MI metric (number of bins = 32, weight = 1)
  preprocessing:  winsorizing the image intensities
  preprocessing:  histogram matching the images
  Shrink factors (level 1 out of 4): [8, 8, 8]
  Shrink factors (level 2 out of 4): [4, 4, 4]
  Shrink factors (level 3 out of 4): [2, 2, 2]
  Shrink factors (level 4 out of 4): [1, 1, 1]
  smoothing sigmas per level: [4, 2, 1, 0]
  regular sampling (percentage = 0.25)

*** Running Euler3DTransform registration ***

DIAGNOSTIC,Iteration,metricValue,convergenceValue,ITERATION_TIME_INDEX,SINCE_LAST
 2DIAGNOSTIC,     1, -9.849852574807e-01, 1.797693134862e+308, 1.3136e+01, 1.3136e+01, 
 2DIAGNOSTIC,     2, -9.855994161047e-01, 1.797693134862e+308, 1.3149e+01, 1.3604e-02, 
 2DIAGNOSTIC,     3, -9.862534711280e-01, 1.797693134862e+308, 1.3163e+01, 1.3533e-02, 
 2DIAGNOSTIC,     4, -9.872986890827e-01, 1.797693134862e+308, 1.3176e+01, 1.3513e-02, 
