Refresh (5 sec)

Progress Report / Log

Started at Fri Feb 23 17:46:47 CET 2018

Feat main script


/bin/cp /home/mpib/LNDG/StateSwitch/WIP_rest/preproc/B_data/D_preproc/2241/preproc/rest/2241_rest.fsf design.fsf

/usr/share/fsl/5.0/bin/feat_model design

mkdir .files;cp /usr/share/fsl/5.0/doc/fsl.css .files;cp -r /usr/share/fsl/5.0/doc/images .files/images

/usr/share/fsl/5.0/bin/fsl_sub -T 10 -l logs -N feat0_init   /usr/share/fsl/5.0/bin/feat /home/mpib/LNDG/StateSwitch/WIP_rest/preproc/B_data/D_preproc/2241/preproc/rest/FEAT.feat/design.fsf -D /home/mpib/LNDG/StateSwitch/WIP_rest/preproc/B_data/D_preproc/2241/preproc/rest/FEAT.feat -I 1 -init


























