Refresh (5 sec)

Progress Report / Log

Started at Wed Apr 11 17:23:41 CEST 2018

Feat main script


/bin/cp /home/mpib/LNDG/StateSwitch/WIP_rest/preproc/B_data/D_preproc/1132/motionCorr/rest/1132_rest.fsf design.fsf

/usr/share/fsl/5.0/bin/feat_model design

mkdir .files;cp /usr/share/fsl/5.0/doc/fsl.css .files;cp -r /usr/share/fsl/5.0/doc/images .files/images

/usr/share/fsl/5.0/bin/fsl_sub -T 10 -l logs -N feat0_init   /usr/share/fsl/5.0/bin/feat /home/mpib/LNDG/StateSwitch/WIP_rest/preproc/B_data/D_preproc/1132/motionCorr/rest/FEAT.feat/design.fsf -D /home/mpib/LNDG/StateSwitch/WIP_rest/preproc/B_data/D_preproc/1132/motionCorr/rest/FEAT.feat -I 1 -init


























