---------------------  Running antsBrainExtraction.sh on ood-10  ---------------------

--------------------------------------------------------------------------------------
 Bias correction of anatomical images (pre brain extraction)
   1) pre-process by truncating the image intensities
   2) run N4
--------------------------------------------------------------------------------------

BEGIN >>>>>>>>>>>>>>>>>>>>
/usr/lib/ants//ImageMath 3 /home/mpib/LNDG/StateSwitch/WIP_rest/preproc/B_data/D_preproc/1169/mri/t1/tempANTs/1169_t1_ANTsBET_N4Truncated0.nii.gz TruncateImageIntensity /home/mpib/LNDG/StateSwitch/WIP_rest/preproc/B_data/D_preproc/1169/mri/t1/1169_t1.nii.gz 0.01 0.999 256
END   <<<<<<<<<<<<<<<<<<<<


BEGIN >>>>>>>>>>>>>>>>>>>>
/usr/lib/ants//N4BiasFieldCorrection -d 3 -i /home/mpib/LNDG/StateSwitch/WIP_rest/preproc/B_data/D_preproc/1169/mri/t1/tempANTs/1169_t1_ANTsBET_N4Truncated0.nii.gz -s 4 -c [50x50x50x50,0.0000001] -b [200] -o /home/mpib/LNDG/StateSwitch/WIP_rest/preproc/B_data/D_preproc/1169/mri/t1/tempANTs/1169_t1_ANTsBET_N4Corrected0.nii.gz --verbose 1

Running N4 for 3-dimensional images.

Mask not read.  Using the entire image as the mask.

Specified spline distance: 200mm
  original image size:  [192, 256, 256]
  padded image size:  [201, 401, 401]
  number of control points:  [4, 5, 5]

Current level = 1
  Iteration 1 (of 50).   Current convergence value = 0.00062475 (threshold = 1e-07)
  Iteration 2 (of 50).   Current convergence value = 0.000469928 (threshold = 1e-07)
  Iteration 3 (of 50).   Current convergence value = 0.000352596 (threshold = 1e-07)
  Iteration 4 (of 50).   Current convergence value = 0.000262516 (threshold = 1e-07)
  Iteration 5 (of 50).   Current convergence value = 0.000196549 (threshold = 1e-07)
  Iteration 6 (of 50).   Current convergence value = 0.000150919 (threshold = 1e-07)
  Iteration 7 (of 50).   Current convergence value = 0.000123026 (threshold = 1e-07)
  Iteration 8 (of 50).   Current convergence value = 0.000110053 (threshold = 1e-07)
  Iteration 9 (of 50).   Current convergence value = 0.000107531 (threshold = 1e-07)
  Iteration 10 (of 50).   Current convergence value = 0.000110749 (threshold = 1e-07)
  Iteration 11 (of 50).   Current convergence value = 0.000116363 (threshold = 1e-07)
  Iteration 12 (of 50).   Current convergence value = 0.000121967 (threshold = 1e-07)
  Iteration 13 (of 50).   Current convergence value = 0.00012728 (threshold = 1e-07)
  Iteration 14 (of 50).   Current convergence value = 0.000132128 (threshold = 1e-07)
  Iteration 15 (of 50).   Current convergence value = 0.000136108 (threshold = 1e-07)
  Iteration 16 (of 50).   Current convergence value = 0.000139395 (threshold = 1e-07)
  Iteration 17 (of 50).   Current convergence value = 0.000142332 (threshold = 1e-07)
  Iteration 18 (of 50).   Current convergence value = 0.000144696 (threshold = 1e-07)
  Iteration 19 (of 50).   Current convergence value = 0.000146782 (threshold = 1e-07)
  Iteration 20 (of 50).   Current convergence value = 0.000151325 (threshold = 1e-07)
  Iteration 21 (of 50).   Current convergence value = 0.000155377 (threshold = 1e-07)
  Iteration 22 (of 50).   Current convergence value = 0.000149291 (threshold = 1e-07)
  Iteration 23 (of 50).   Current convergence value = 0.000142981 (threshold = 1e-07)
  Iteration 24 (of 50).   Current convergence value = 0.000136276 (threshold = 1e-07)
  Iteration 25 (of 50).   Current convergence value = 0.000130578 (threshold = 1e-07)
  Iteration 26 (of 50).   Current convergence value = 0.000125421 (threshold = 1e-07)
  Iteration 27 (of 50).   Current convergence value = 0.000121102 (threshold = 1e-07)
  Iteration 28 (of 50).   Current convergence value = 0.000117355 (threshold = 1e-07)
  Iteration 29 (of 50).   Current convergence value = 0.000114236 (threshold = 1e-07)
  Iteration 30 (of 50).   Current convergence value = 0.000111334 (threshold = 1e-07)
  Iteration 31 (of 50).   Current convergence value = 0.000108881 (threshold = 1e-07)
  Iteration 32 (of 50).   Current convergence value = 0.000106693 (threshold = 1e-07)
  Iteration 33 (of 50).   Current convergence value = 0.000104715 (threshold = 1e-07)
  Iteration 34 (of 50).   Current convergence value = 0.000101926 (threshold = 1e-07)
  Iteration 35 (of 50).   Current convergence value = 9.79976e-05 (threshold = 1e-07)
  Iteration 36 (of 50).   Current convergence value = 9.51943e-05 (threshold = 1e-07)
  Iteration 37 (of 50).   Current convergence value = 9.32618e-05 (threshold = 1e-07)
  Iteration 38 (of 50).   Current convergence value = 9.2179e-05 (threshold = 1e-07)
  Iteration 39 (of 50).   Current convergence value = 9.18347e-05 (threshold = 1e-07)
  Iteration 40 (of 50).   Current convergence value = 9.21302e-05 (threshold = 1e-07)
  Iteration 41 (of 50).   Current convergence value = 9.28979e-05 (threshold = 1e-07)
  Iteration 42 (of 50).   Current convergence value = 9.39718e-05 (threshold = 1e-07)
  Iteration 43 (of 50).   Current convergence value = 9.5396e-05 (threshold = 1e-07)
  Iteration 44 (of 50).   Current convergence value = 9.70456e-05 (threshold = 1e-07)
  Iteration 45 (of 50).   Current convergence value = 9.89077e-05 (threshold = 1e-07)
  Iteration 46 (of 50).   Current convergence value = 0.000100686 (threshold = 1e-07)
  Iteration 47 (of 50).   Current convergence value = 0.000102718 (threshold = 1e-07)
  Iteration 48 (of 50).   Current convergence value = 0.00010486 (threshold = 1e-07)
  Iteration 49 (of 50).   Current convergence value = 0.000106721 (threshold = 1e-07)
  Iteration 50 (of 50).   Current convergence value = 0.000108972 (threshold = 1e-07)
Current level = 2
  Iteration 1 (of 50).   Current convergence value = 0.000336741 (threshold = 1e-07)
  Iteration 2 (of 50).   Current convergence value = 0.000269826 (threshold = 1e-07)
  Iteration 3 (of 50).   Current convergence value = 0.000225723 (threshold = 1e-07)
  Iteration 4 (of 50).   Current convergence value = 0.000201098 (threshold = 1e-07)
  Iteration 5 (of 50).   Current convergence value = 0.000185286 (threshold = 1e-07)
  Iteration 6 (of 50).   Current convergence value = 0.000176563 (threshold = 1e-07)
  Iteration 7 (of 50).   Current convergence value = 0.000172201 (threshold = 1e-07)
  Iteration 8 (of 50).   Current convergence value = 0.00017207 (threshold = 1e-07)
  Iteration 9 (of 50).   Current convergence value = 0.000175265 (threshold = 1e-07)
  Iteration 10 (of 50).   Current convergence value = 0.000181932 (threshold = 1e-07)
  Iteration 11 (of 50).   Current convergence value = 0.000191255 (threshold = 1e-07)
  Iteration 12 (of 50).   Current convergence value = 0.000205628 (threshold = 1e-07)
  Iteration 13 (of 50).   Current convergence value = 0.000222928 (threshold = 1e-07)
  Iteration 14 (of 50).   Current convergence value = 0.000243485 (threshold = 1e-07)
  Iteration 15 (of 50).   Current convergence value = 0.00026626 (threshold = 1e-07)
  Iteration 16 (of 50).   Current convergence value = 0.000284762 (threshold = 1e-07)
  Iteration 17 (of 50).   Current convergence value = 0.000294212 (threshold = 1e-07)
  Iteration 18 (of 50).   Current convergence value = 0.000291747 (threshold = 1e-07)
  Iteration 19 (of 50).   Current convergence value = 0.000215288 (threshold = 1e-07)
  Iteration 20 (of 50).   Current convergence value = 0.000183131 (threshold = 1e-07)
  Iteration 21 (of 50).   Current convergence value = 0.00018735 (threshold = 1e-07)
  Iteration 22 (of 50).   Current convergence value = 0.000204306 (threshold = 1e-07)
  Iteration 23 (of 50).   Current convergence value = 0.000223107 (threshold = 1e-07)
  Iteration 24 (of 50).   Current convergence value = 0.000239162 (threshold = 1e-07)
  Iteration 25 (of 50).   Current convergence value = 0.000250301 (threshold = 1e-07)
  Iteration 26 (of 50).   Current convergence value = 0.000281934 (threshold = 1e-07)
  Iteration 27 (of 50).   Current convergence value = 0.000309447 (threshold = 1e-07)
  Iteration 28 (of 50).   Current convergence value = 0.000328279 (threshold = 1e-07)
  Iteration 29 (of 50).   Current convergence value = 0.000341647 (threshold = 1e-07)
  Iteration 30 (of 50).   Current convergence value = 0.000351015 (threshold = 1e-07)
  Iteration 31 (of 50).   Current convergence value = 0.000356409 (threshold = 1e-07)
  Iteration 32 (of 50).   Current convergence value = 0.000360381 (threshold = 1e-07)
  Iteration 33 (of 50).   Current convergence value = 0.000362224 (threshold = 1e-07)
  Iteration 34 (of 50).   Current convergence value = 0.000363254 (threshold = 1e-07)
  Iteration 35 (of 50).   Current convergence value = 0.000362928 (threshold = 1e-07)
  Iteration 36 (of 50).   Current convergence value = 0.000361468 (threshold = 1e-07)
  Iteration 37 (of 50).   Current convergence value = 0.000360268 (threshold = 1e-07)
  Iteration 38 (of 50).   Current convergence value = 0.000357387 (threshold = 1e-07)
  Iteration 39 (of 50).   Current convergence value = 0.000355137 (threshold = 1e-07)
  Iteration 40 (of 50).   Current convergence value = 0.000353199 (threshold = 1e-07)
  Iteration 41 (of 50).   Current convergence value = 0.00035145 (threshold = 1e-07)
  Iteration 42 (of 50).   Current convergence value = 0.000348939 (threshold = 1e-07)
  Iteration 43 (of 50).   Current convergence value = 0.000346494 (threshold = 1e-07)
  Iteration 44 (of 50).   Current convergence value = 0.00034417 (threshold = 1e-07)
  Iteration 45 (of 50).   Current convergence value = 0.000341786 (threshold = 1e-07)
  Iteration 46 (of 50).   Current convergence value = 0.000339685 (threshold = 1e-07)
  Iteration 47 (of 50).   Current convergence value = 0.000337308 (threshold = 1e-07)
  Iteration 48 (of 50).   Current convergence value = 0.000334727 (threshold = 1e-07)
  Iteration 49 (of 50).   Current convergence value = 0.000331112 (threshold = 1e-07)
  Iteration 50 (of 50).   Current convergence value = 0.000326291 (threshold = 1e-07)
Current level = 3
  Iteration 1 (of 50).   Current convergence value = 0.00109282 (threshold = 1e-07)
  Iteration 2 (of 50).   Current convergence value = 0.000972893 (threshold = 1e-07)
  Iteration 3 (of 50).   Current convergence value = 0.000961416 (threshold = 1e-07)
  Iteration 4 (of 50).   Current convergence value = 0.000899729 (threshold = 1e-07)
  Iteration 5 (of 50).   Current convergence value = 0.000860748 (threshold = 1e-07)
  Iteration 6 (of 50).   Current convergence value = 0.000830873 (threshold = 1e-07)
  Iteration 7 (of 50).   Current convergence value = 0.000810297 (threshold = 1e-07)
  Iteration 8 (of 50).   Current convergence value = 0.000864303 (threshold = 1e-07)
  Iteration 9 (of 50).   Current convergence value = 0.00101167 (threshold = 1e-07)
  Iteration 10 (of 50).   Current convergence value = 0.00102055 (threshold = 1e-07)
  Iteration 11 (of 50).   Current convergence value = 0.000860236 (threshold = 1e-07)
  Iteration 12 (of 50).   Current convergence value = 0.000815604 (threshold = 1e-07)
  Iteration 13 (of 50).   Current convergence value = 0.000894606 (threshold = 1e-07)
  Iteration 14 (of 50).   Current convergence value = 0.00108943 (threshold = 1e-07)
  Iteration 15 (of 50).   Current convergence value = 0.00103126 (threshold = 1e-07)
  Iteration 16 (of 50).   Current convergence value = 0.000958026 (threshold = 1e-07)
  Iteration 17 (of 50).   Current convergence value = 0.000904869 (threshold = 1e-07)
  Iteration 18 (of 50).   Current convergence value = 0.000864422 (threshold = 1e-07)
  Iteration 19 (of 50).   Current convergence value = 0.000818599 (threshold = 1e-07)
  Iteration 20 (of 50).   Current convergence value = 0.000808919 (threshold = 1e-07)
  Iteration 21 (of 50).   Current convergence value = 0.000778683 (threshold = 1e-07)
  Iteration 22 (of 50).   Current convergence value = 0.000742406 (threshold = 1e-07)
  Iteration 23 (of 50).   Current convergence value = 0.000745738 (threshold = 1e-07)
  Iteration 24 (of 50).   Current convergence value = 0.000759423 (threshold = 1e-07)
  Iteration 25 (of 50).   Current convergence value = 0.000766411 (threshold = 1e-07)
  Iteration 26 (of 50).   Current convergence value = 0.000765807 (threshold = 1e-07)
  Iteration 27 (of 50).   Current convergence value = 0.000745379 (threshold = 1e-07)
  Iteration 28 (of 50).   Current convergence value = 0.000744594 (threshold = 1e-07)
  Iteration 29 (of 50).   Current convergence value = 0.00075385 (threshold = 1e-07)
  Iteration 30 (of 50).   Current convergence value = 0.000764039 (threshold = 1e-07)
  Iteration 31 (of 50).   Current convergence value = 0.000766229 (threshold = 1e-07)
  Iteration 32 (of 50).   Current convergence value = 0.000757642 (threshold = 1e-07)
  Iteration 33 (of 50).   Current convergence value = 0.000910969 (threshold = 1e-07)
  Iteration 34 (of 50).   Current convergence value = 0.000927858 (threshold = 1e-07)
  Iteration 35 (of 50).   Current convergence value = 0.000910723 (threshold = 1e-07)
  Iteration 36 (of 50).   Current convergence value = 0.000886322 (threshold = 1e-07)
  Iteration 37 (of 50).   Current convergence value = 0.000866336 (threshold = 1e-07)
  Iteration 38 (of 50).   Current convergence value = 0.000847848 (threshold = 1e-07)
  Iteration 39 (of 50).   Current convergence value = 0.000819 (threshold = 1e-07)
  Iteration 40 (of 50).   Current convergence value = 0.000793678 (threshold = 1e-07)
  Iteration 41 (of 50).   Current convergence value = 0.000744289 (threshold = 1e-07)
  Iteration 42 (of 50).   Current convergence value = 0.000647565 (threshold = 1e-07)
  Iteration 43 (of 50).   Current convergence value = 0.000661084 (threshold = 1e-07)
  Iteration 44 (of 50).   Current convergence value = 0.000785251 (threshold = 1e-07)
  Iteration 45 (of 50).   Current convergence value = 0.000894347 (threshold = 1e-07)
  Iteration 46 (of 50).   Current convergence value = 0.000938192 (threshold = 1e-07)
  Iteration 47 (of 50).   Current convergence value = 0.000654728 (threshold = 1e-07)
  Iteration 48 (of 50).   Current convergence value = 0.000694066 (threshold = 1e-07)
  Iteration 49 (of 50).   Current convergence value = 0.000828338 (threshold = 1e-07)
  Iteration 50 (of 50).   Current convergence value = 0.000914839 (threshold = 1e-07)
Current level = 4
  Iteration 1 (of 50).   Current convergence value = 0.00209629 (threshold = 1e-07)
  Iteration 2 (of 50).   Current convergence value = 0.00206356 (threshold = 1e-07)
  Iteration 3 (of 50).   Current convergence value = 0.00202514 (threshold = 1e-07)
  Iteration 4 (of 50).   Current convergence value = 0.00200748 (threshold = 1e-07)
  Iteration 5 (of 50).   Current convergence value = 0.00196508 (threshold = 1e-07)
  Iteration 6 (of 50).   Current convergence value = 0.00182167 (threshold = 1e-07)
  Iteration 7 (of 50).   Current convergence value = 0.00172578 (threshold = 1e-07)
  Iteration 8 (of 50).   Current convergence value = 0.00163771 (threshold = 1e-07)
  Iteration 9 (of 50).   Current convergence value = 0.00163385 (threshold = 1e-07)
  Iteration 10 (of 50).   Current convergence value = 0.00170815 (threshold = 1e-07)
  Iteration 11 (of 50).   Current convergence value = 0.00130282 (threshold = 1e-07)
  Iteration 12 (of 50).   Current convergence value = 0.00115526 (threshold = 1e-07)
  Iteration 13 (of 50).   Current convergence value = 0.00113103 (threshold = 1e-07)
  Iteration 14 (of 50).   Current convergence value = 0.00113481 (threshold = 1e-07)
  Iteration 15 (of 50).   Current convergence value = 0.00113587 (threshold = 1e-07)
  Iteration 16 (of 50).   Current convergence value = 0.00115187 (threshold = 1e-07)
  Iteration 17 (of 50).   Current convergence value = 0.00116913 (threshold = 1e-07)
  Iteration 18 (of 50).   Current convergence value = 0.00115857 (threshold = 1e-07)
  Iteration 19 (of 50).   Current convergence value = 0.00113574 (threshold = 1e-07)
  Iteration 20 (of 50).   Current convergence value = 0.00111232 (threshold = 1e-07)
  Iteration 21 (of 50).   Current convergence value = 0.0010923 (threshold = 1e-07)
  Iteration 22 (of 50).   Current convergence value = 0.00107747 (threshold = 1e-07)
  Iteration 23 (of 50).   Current convergence value = 0.00106829 (threshold = 1e-07)
  Iteration 24 (of 50).   Current convergence value = 0.0010631 (threshold = 1e-07)
  Iteration 25 (of 50).   Current convergence value = 0.00106318 (threshold = 1e-07)
  Iteration 26 (of 50).   Current convergence value = 0.00106346 (threshold = 1e-07)
  Iteration 27 (of 50).   Current convergence value = 0.00105825 (threshold = 1e-07)
  Iteration 28 (of 50).   Current convergence value = 0.00104984 (threshold = 1e-07)
  Iteration 29 (of 50).   Current convergence value = 0.0010404 (threshold = 1e-07)
  Iteration 30 (of 50).   Current convergence value = 0.000993809 (threshold = 1e-07)
  Iteration 31 (of 50).   Current convergence value = 0.000913005 (threshold = 1e-07)
  Iteration 32 (of 50).   Current convergence value = 0.000865389 (threshold = 1e-07)
  Iteration 33 (of 50).   Current convergence value = 0.000834818 (threshold = 1e-07)
  Iteration 34 (of 50).   Current convergence value = 0.000815028 (threshold = 1e-07)
  Iteration 35 (of 50).   Current convergence value = 0.000796137 (threshold = 1e-07)
  Iteration 36 (of 50).   Current convergence value = 0.000785639 (threshold = 1e-07)
  Iteration 37 (of 50).   Current convergence value = 0.000784345 (threshold = 1e-07)
  Iteration 38 (of 50).   Current convergence value = 0.000786685 (threshold = 1e-07)
  Iteration 39 (of 50).   Current convergence value = 0.00078739 (threshold = 1e-07)
  Iteration 40 (of 50).   Current convergence value = 0.000785721 (threshold = 1e-07)
  Iteration 41 (of 50).   Current convergence value = 0.000776265 (threshold = 1e-07)
  Iteration 42 (of 50).   Current convergence value = 0.000761853 (threshold = 1e-07)
  Iteration 43 (of 50).   Current convergence value = 0.000747113 (threshold = 1e-07)
  Iteration 44 (of 50).   Current convergence value = 0.000726768 (threshold = 1e-07)
  Iteration 45 (of 50).   Current convergence value = 0.000713163 (threshold = 1e-07)
  Iteration 46 (of 50).   Current convergence value = 0.000781594 (threshold = 1e-07)
  Iteration 47 (of 50).   Current convergence value = 0.00088254 (threshold = 1e-07)
  Iteration 48 (of 50).   Current convergence value = 0.00100287 (threshold = 1e-07)
  Iteration 49 (of 50).   Current convergence value = 0.00114339 (threshold = 1e-07)
  Iteration 50 (of 50).   Current convergence value = 0.00128849 (threshold = 1e-07)
   N4BiasFieldCorrectionImageFilter (0x55a6bb878d30)
     RTTI typeinfo:   itk::N4BiasFieldCorrectionImageFilter<itk::Image<float, 3u>, itk::Image<float, 3u>, itk::Image<float, 3u> >
     Reference Count: 1
     Modified Time: 439
     Debug: Off
     Object Name: 
     Observers: 
       IterationEvent(Command)
     Inputs: 
       Primary: (0x55a6bb8885d0) *
       _1: (0x55a6bb886cb0)
     Indexed Inputs: 
       0: Primary (0x55a6bb8885d0)
       1: _1 (0x55a6bb886cb0)
     Required Input Names: Primary
     NumberOfRequiredInputs: 1
     Outputs: 
       Primary: (0x55a6bb880e50)
     Indexed Outputs: 
       0: Primary (0x55a6bb880e50)
     NumberOfRequiredOutputs: 1
     Number Of Threads: 16
     ReleaseDataFlag: Off
     ReleaseDataBeforeUpdateFlag: Off
     AbortGenerateData: Off
     Progress: 0
     Multithreader: 
       RTTI typeinfo:   itk::MultiThreader
       Reference Count: 1
       Modified Time: 132
       Debug: Off
       Object Name: 
       Observers: 
         none
       Thread Count: 16
       Global Maximum Number Of Threads: 128
       Global Default Number Of Threads: 16
     CoordinateTolerance: 1e-06
     DirectionTolerance: 1e-06
     Mask label: 1
     Number of histogram bins: 200
     Wiener filter noise: 0.01
     Bias field FWHM: 0.15
     Maximum number of iterations: [50, 50, 50, 50]
     Convergence threshold: 1e-07
     Spline order: 3
     Number of fitting levels: [4, 4, 4]
     Number of control points: [4, 5, 5]
     CurrentConvergenceMeasurement: 0.00128849
     CurrentLevel: 4
     ElapsedIterations: 51
     LogBiasFieldControlPointLattice: 
       Image (0x55a6bba7f0e0)
         RTTI typeinfo:   itk::Image<itk::Vector<float, 1u>, 3u>
         Reference Count: 1
         Modified Time: 432774366
         Debug: Off
         Object Name: 
         Observers: 
           none
         Source: (none)
         Source output name: (none)
         Release Data: Off
         Data Released: False
         Global Release Data: Off
         PipelineMTime: 0
         UpdateMTime: 0
         RealTimeStamp: 0 seconds 
         LargestPossibleRegion: 
           Dimension: 3
           Index: [0, 0, 0]
           Size: [11, 19, 19]
         BufferedRegion: 
           Dimension: 3
           Index: [0, 0, 0]
           Size: [11, 19, 19]
         RequestedRegion: 
           Dimension: 3
           Index: [0, 0, 0]
           Size: [11, 19, 19]
         Spacing: [24.5, 24.75, 24.75]
         Origin: [-23.7743, 22.9172, -27.1101]
         Direction: 
0.999773 -0.0184516 -0.0106432
-0.0174525 -0.996024 0.0873548
0.0122127 0.0871492 0.99612

         IndexToPointMatrix: 
24.4944 -0.456677 -0.263419
-0.427586 -24.6516 2.16203
0.299211 2.15694 24.654

         PointToIndexMatrix: 
0.0408071 -0.000712346 0.000498478
-0.000745519 -0.0402434 0.00352118
-0.000430028 0.00352949 0.0402473

         Inverse Direction: 
0.999773 -0.0174525 0.0122127
-0.0184516 -0.996024 0.0871492
-0.0106432 0.0873548 0.99612

         PixelContainer: 
           ImportImageContainer (0x55a6bc367db0)
             RTTI typeinfo:   itk::ImportImageContainer<unsigned long, itk::Vector<float, 1u> >
             Reference Count: 1
             Modified Time: 432774367
             Debug: Off
             Object Name: 
             Observers: 
               none
             Pointer: 0x55a6bbc6b390
             Container manages memory: true
             Size: 3971
             Capacity: 3971
Elapsed time: 177.321
END   <<<<<<<<<<<<<<<<<<<<



--------------------------------------------------------------------------------------
 Done with N4 correction (pre brain extraction):  0h 3m 14s
--------------------------------------------------------------------------------------


--------------------------------------------------------------------------------------
 Brain extraction using the following steps:
   1) Register /home/mpib/LNDG/StateSwitch/WIP_rest/preproc/B_data/C_standards/ANTS/MICCAI2012-Multi-Atlas-Challenge-Data/T_template0.nii.gz to /home/mpib/LNDG/StateSwitch/WIP_rest/preproc/B_data/D_preproc/1169/mri/t1/tempANTs/1169_t1_ANTsBET_N4Corrected0.nii.gz
   2) Warp /home/mpib/LNDG/StateSwitch/WIP_rest/preproc/B_data/C_standards/ANTS/MICCAI2012-Multi-Atlas-Challenge-Data/T_template0_BrainCerebellumProbabilityMask.nii.gz to /home/mpib/LNDG/StateSwitch/WIP_rest/preproc/B_data/D_preproc/1169/mri/t1/1169_t1.nii.gz using, from 1),
      /home/mpib/LNDG/StateSwitch/WIP_rest/preproc/B_data/D_preproc/1169/mri/t1/tempANTs/1169_t1_ANTsBET_BrainExtractionWarp/Affine
   3) Refine segmentation results using Atropos
--------------------------------------------------------------------------------------

BEGIN >>>>>>>>>>>>>>>>>>>>
/usr/lib/ants//ResampleImageBySpacing 3 /home/mpib/LNDG/StateSwitch/WIP_rest/preproc/B_data/C_standards/ANTS/MICCAI2012-Multi-Atlas-Challenge-Data/T_template0.nii.gz /home/mpib/LNDG/StateSwitch/WIP_rest/preproc/B_data/D_preproc/1169/mri/t1/tempANTs/1169_t1_ANTsBET_BrainExtractionInitialAffineFixed.nii.gz 4 4 4 1
 spacing [1, 1, 1] dim 3
 spacing2 [4, 4, 4]
 smoothing by : 3 dir 0
 smoothing by : 3 dir 1
 smoothing by : 3 dir 2
 out space [4, 4, 4]
 output size [54, 64, 72] spc [4, 4, 4]
END   <<<<<<<<<<<<<<<<<<<<


BEGIN >>>>>>>>>>>>>>>>>>>>
/usr/lib/ants//ResampleImageBySpacing 3 /home/mpib/LNDG/StateSwitch/WIP_rest/preproc/B_data/D_preproc/1169/mri/t1/tempANTs/1169_t1_ANTsBET_N4Corrected0.nii.gz /home/mpib/LNDG/StateSwitch/WIP_rest/preproc/B_data/D_preproc/1169/mri/t1/tempANTs/1169_t1_ANTsBET_BrainExtractionInitialAffineMoving.nii.gz 4 4 4 1
 spacing [1, 1, 1] dim 3
 spacing2 [4, 4, 4]
 smoothing by : 3 dir 0
 smoothing by : 3 dir 1
 smoothing by : 3 dir 2
 out space [4, 4, 4]
 output size [48, 64, 64] spc [4, 4, 4]
END   <<<<<<<<<<<<<<<<<<<<


BEGIN >>>>>>>>>>>>>>>>>>>>
/usr/lib/ants//ImageMath 3 /home/mpib/LNDG/StateSwitch/WIP_rest/preproc/B_data/D_preproc/1169/mri/t1/tempANTs/1169_t1_ANTsBET_BrainExtractionLaplacian.nii.gz Laplacian /home/mpib/LNDG/StateSwitch/WIP_rest/preproc/B_data/D_preproc/1169/mri/t1/tempANTs/1169_t1_ANTsBET_N4Corrected0.nii.gz 1.5 1
END   <<<<<<<<<<<<<<<<<<<<


BEGIN >>>>>>>>>>>>>>>>>>>>
/usr/lib/ants//ImageMath 3 /home/mpib/LNDG/StateSwitch/WIP_rest/preproc/B_data/D_preproc/1169/mri/t1/tempANTs/1169_t1_ANTsBET_BrainExtractionTemplateLaplacian.nii.gz Laplacian /home/mpib/LNDG/StateSwitch/WIP_rest/preproc/B_data/C_standards/ANTS/MICCAI2012-Multi-Atlas-Challenge-Data/T_template0.nii.gz 1.5 1
END   <<<<<<<<<<<<<<<<<<<<


BEGIN >>>>>>>>>>>>>>>>>>>>
/usr/lib/ants//antsAI -d 3 -v 1 -m Mattes[/home/mpib/LNDG/StateSwitch/WIP_rest/preproc/B_data/D_preproc/1169/mri/t1/tempANTs/1169_t1_ANTsBET_BrainExtractionInitialAffineFixed.nii.gz,/home/mpib/LNDG/StateSwitch/WIP_rest/preproc/B_data/D_preproc/1169/mri/t1/tempANTs/1169_t1_ANTsBET_BrainExtractionInitialAffineMoving.nii.gz,32,Regular,0.25] -t Affine[0.1] -s [15,0.1] -p 0 -c 10 -o /home/mpib/LNDG/StateSwitch/WIP_rest/preproc/B_data/D_preproc/1169/mri/t1/tempANTs/1169_t1_ANTsBET_BrainExtractionInitialAffine.mat -x //home/mpib/LNDG/StateSwitch/WIP_rest/preproc/B_data/C_standards/ANTS/MICCAI2012-Multi-Atlas-Challenge-Data/T_template0_BrainCerebellumRegistrationMask.nii.gz
Using the Mattes MI metric (number of bins = 32)
END   <<<<<<<<<<<<<<<<<<<<


BEGIN >>>>>>>>>>>>>>>>>>>>
/usr/lib/ants//antsRegistration -d 3 -u 1 -w [0.025,0.975] -o /home/mpib/LNDG/StateSwitch/WIP_rest/preproc/B_data/D_preproc/1169/mri/t1/tempANTs/1169_t1_ANTsBET_BrainExtractionPrior -r /home/mpib/LNDG/StateSwitch/WIP_rest/preproc/B_data/D_preproc/1169/mri/t1/tempANTs/1169_t1_ANTsBET_BrainExtractionInitialAffine.mat -z 1 --float 0 --verbose 1 -x [//home/mpib/LNDG/StateSwitch/WIP_rest/preproc/B_data/C_standards/ANTS/MICCAI2012-Multi-Atlas-Challenge-Data/T_template0_BrainCerebellumRegistrationMask.nii.gz] -m MI[/home/mpib/LNDG/StateSwitch/WIP_rest/preproc/B_data/C_standards/ANTS/MICCAI2012-Multi-Atlas-Challenge-Data/T_template0.nii.gz,/home/mpib/LNDG/StateSwitch/WIP_rest/preproc/B_data/D_preproc/1169/mri/t1/tempANTs/1169_t1_ANTsBET_N4Corrected0.nii.gz,1,32,Regular,0.25] -c [1000x500x250x100,1e-8,10] -t Rigid[0.1] -f 8x4x2x1 -s 4x2x1x0 -m MI[/home/mpib/LNDG/StateSwitch/WIP_rest/preproc/B_data/C_standards/ANTS/MICCAI2012-Multi-Atlas-Challenge-Data/T_template0.nii.gz,/home/mpib/LNDG/StateSwitch/WIP_rest/preproc/B_data/D_preproc/1169/mri/t1/tempANTs/1169_t1_ANTsBET_N4Corrected0.nii.gz,1,32,Regular,0.25] -c [1000x500x250x100,1e-8,10] -t Affine[0.1] -f 8x4x2x1 -s 4x2x1x0 -m CC[/home/mpib/LNDG/StateSwitch/WIP_rest/preproc/B_data/C_standards/ANTS/MICCAI2012-Multi-Atlas-Challenge-Data/T_template0.nii.gz,/home/mpib/LNDG/StateSwitch/WIP_rest/preproc/B_data/D_preproc/1169/mri/t1/tempANTs/1169_t1_ANTsBET_N4Corrected0.nii.gz,0.5,4] -m CC[/home/mpib/LNDG/StateSwitch/WIP_rest/preproc/B_data/D_preproc/1169/mri/t1/tempANTs/1169_t1_ANTsBET_BrainExtractionTemplateLaplacian.nii.gz,/home/mpib/LNDG/StateSwitch/WIP_rest/preproc/B_data/D_preproc/1169/mri/t1/tempANTs/1169_t1_ANTsBET_BrainExtractionLaplacian.nii.gz,0.5,4] -c [50x10x0,1e-9,15] -t SyN[0.1,3,0] -f 4x2x1 -s 2x1x0
All_Command_lines_OK
Using double precision for computations.
=============================================================================
The composite transform comprises the following transforms (in order): 
  1. /home/mpib/LNDG/StateSwitch/WIP_rest/preproc/B_data/D_preproc/1169/mri/t1/tempANTs/1169_t1_ANTsBET_BrainExtractionInitialAffine.mat (type = AffineTransform)
=============================================================================
  Reading mask(s).
    Registration stage 0
      Fixed mask = //home/mpib/LNDG/StateSwitch/WIP_rest/preproc/B_data/C_standards/ANTS/MICCAI2012-Multi-Atlas-Challenge-Data/T_template0_BrainCerebellumRegistrationMask.nii.gz
  number of levels = 4
  number of levels = 4
  number of levels = 3
  fixed image: /home/mpib/LNDG/StateSwitch/WIP_rest/preproc/B_data/C_standards/ANTS/MICCAI2012-Multi-Atlas-Challenge-Data/T_template0.nii.gz
  moving image: /home/mpib/LNDG/StateSwitch/WIP_rest/preproc/B_data/D_preproc/1169/mri/t1/tempANTs/1169_t1_ANTsBET_N4Corrected0.nii.gz
  fixed image: /home/mpib/LNDG/StateSwitch/WIP_rest/preproc/B_data/C_standards/ANTS/MICCAI2012-Multi-Atlas-Challenge-Data/T_template0.nii.gz
  moving image: /home/mpib/LNDG/StateSwitch/WIP_rest/preproc/B_data/D_preproc/1169/mri/t1/tempANTs/1169_t1_ANTsBET_N4Corrected0.nii.gz
  fixed image: /home/mpib/LNDG/StateSwitch/WIP_rest/preproc/B_data/C_standards/ANTS/MICCAI2012-Multi-Atlas-Challenge-Data/T_template0.nii.gz
  moving image: /home/mpib/LNDG/StateSwitch/WIP_rest/preproc/B_data/D_preproc/1169/mri/t1/tempANTs/1169_t1_ANTsBET_N4Corrected0.nii.gz
  fixed image: /home/mpib/LNDG/StateSwitch/WIP_rest/preproc/B_data/D_preproc/1169/mri/t1/tempANTs/1169_t1_ANTsBET_BrainExtractionTemplateLaplacian.nii.gz
  moving image: /home/mpib/LNDG/StateSwitch/WIP_rest/preproc/B_data/D_preproc/1169/mri/t1/tempANTs/1169_t1_ANTsBET_BrainExtractionLaplacian.nii.gz
Dimension = 3
Number of stages = 3
Use Histogram Matching true
Winsorize image intensities true
Lower quantile = 0.025
Upper quantile = 0.975
Stage 1 State
   Image metric = Mattes
     Fixed image = Image (0x565556d047e0)
  RTTI typeinfo:   itk::Image<double, 3u>
  Reference Count: 2
  Modified Time: 1666
  Debug: Off
  Object Name: 
  Observers: 
    none
  Source: (none)
  Source output name: (none)
  Release Data: Off
  Data Released: False
  Global Release Data: Off
  PipelineMTime: 0
  UpdateMTime: 1501
  RealTimeStamp: 0 seconds 
  LargestPossibleRegion: 
    Dimension: 3
    Index: [0, 0, 0]
    Size: [216, 256, 291]
  BufferedRegion: 
    Dimension: 3
    Index: [0, 0, 0]
    Size: [216, 256, 291]
  RequestedRegion: 
    Dimension: 3
    Index: [0, 0, 0]
    Size: [216, 256, 291]
  Spacing: [1, 1, 1]
  Origin: [0, 293, 0]
  Direction: 
1 0 0
0 -0 -1
0 -1 -0

  IndexToPointMatrix: 
1 0 0
0 0 -1
0 -1 0

  PointToIndexMatrix: 
1 0 0
0 0 -1
0 -1 0

  Inverse Direction: 
1 0 0
0 0 -1
0 -1 0

  PixelContainer: 
    ImportImageContainer (0x565556d089d0)
      RTTI typeinfo:   itk::ImportImageContainer<unsigned long, double>
      Reference Count: 1
      Modified Time: 1498
      Debug: Off
      Object Name: 
      Observers: 
        none
      Pointer: 0x7f9ad7958010
      Container manages memory: true
      Size: 16091136
      Capacity: 16091136

     Moving image = Image (0x565556d06620)
  RTTI typeinfo:   itk::Image<double, 3u>
  Reference Count: 2
  Modified Time: 1667
  Debug: Off
  Object Name: 
  Observers: 
    none
  Source: (none)
  Source output name: (none)
  Release Data: Off
  Data Released: False
  Global Release Data: Off
  PipelineMTime: 0
  UpdateMTime: 1664
  RealTimeStamp: 0 seconds 
  LargestPossibleRegion: 
    Dimension: 3
    Index: [0, 0, 0]
    Size: [192, 256, 256]
  BufferedRegion: 
    Dimension: 3
    Index: [0, 0, 0]
    Size: [192, 256, 256]
  RequestedRegion: 
    Dimension: 3
    Index: [0, 0, 0]
    Size: [192, 256, 256]
  Spacing: [1, 1, 1]
  Origin: [-86.479, 104.942, -146.703]
  Direction: 
0.999773 -0.0184516 -0.0106432
-0.0174525 -0.996024 0.0873548
0.0122127 0.0871492 0.99612

  IndexToPointMatrix: 
0.999773 -0.0184516 -0.0106432
-0.0174525 -0.996024 0.0873548
0.0122127 0.0871492 0.99612

  PointToIndexMatrix: 
0.999773 -0.0174525 0.0122127
-0.0184516 -0.996024 0.0871492
-0.0106432 0.0873548 0.99612

  Inverse Direction: 
0.999773 -0.0174525 0.0122127
-0.0184516 -0.996024 0.0871492
-0.0106432 0.0873548 0.99612

  PixelContainer: 
    ImportImageContainer (0x565556d088c0)
      RTTI typeinfo:   itk::ImportImageContainer<unsigned long, double>
      Reference Count: 1
      Modified Time: 1661
      Debug: Off
      Object Name: 
      Observers: 
        none
      Pointer: 0x7f9ad1957010
      Container manages memory: true
      Size: 12582912
      Capacity: 12582912

     Weighting = 1
     Sampling strategy = regular
     Number of bins = 32
     Radius = 4
     Sampling percentage  = 0.25
   Transform = Rigid
     Gradient step = 0.1
     Update field sigma (voxel space) = 0
     Total field sigma (voxel space) = 0
     Update field time sigma = 0
     Total field time sigma  = 0
     Number of time indices = 0
     Number of time point samples = 0
Stage 2 State
   Image metric = Mattes
     Fixed image = Image (0x565556d11910)
  RTTI typeinfo:   itk::Image<double, 3u>
  Reference Count: 2
  Modified Time: 1994
  Debug: Off
  Object Name: 
  Observers: 
    none
  Source: (none)
  Source output name: (none)
  Release Data: Off
  Data Released: False
  Global Release Data: Off
  PipelineMTime: 0
  UpdateMTime: 1829
  RealTimeStamp: 0 seconds 
  LargestPossibleRegion: 
    Dimension: 3
    Index: [0, 0, 0]
    Size: [216, 256, 291]
  BufferedRegion: 
    Dimension: 3
    Index: [0, 0, 0]
    Size: [216, 256, 291]
  RequestedRegion: 
    Dimension: 3
    Index: [0, 0, 0]
    Size: [216, 256, 291]
  Spacing: [1, 1, 1]
  Origin: [0, 293, 0]
  Direction: 
1 0 0
0 -0 -1
0 -1 -0

  IndexToPointMatrix: 
1 0 0
0 0 -1
0 -1 0

  PointToIndexMatrix: 
1 0 0
0 0 -1
0 -1 0

  Inverse Direction: 
1 0 0
0 0 -1
0 -1 0

  PixelContainer: 
    ImportImageContainer (0x565556d083a0)
      RTTI typeinfo:   itk::ImportImageContainer<unsigned long, double>
      Reference Count: 1
      Modified Time: 1826
      Debug: Off
      Object Name: 
      Observers: 
        none
      Pointer: 0x7f9ac9e92010
      Container manages memory: true
      Size: 16091136
      Capacity: 16091136

     Moving image = Image (0x565556d17040)
  RTTI typeinfo:   itk::Image<double, 3u>
  Reference Count: 2
  Modified Time: 1995
  Debug: Off
  Object Name: 
  Observers: 
    none
  Source: (none)
  Source output name: (none)
  Release Data: Off
  Data Released: False
  Global Release Data: Off
  PipelineMTime: 0
  UpdateMTime: 1992
  RealTimeStamp: 0 seconds 
  LargestPossibleRegion: 
    Dimension: 3
    Index: [0, 0, 0]
    Size: [192, 256, 256]
  BufferedRegion: 
    Dimension: 3
    Index: [0, 0, 0]
    Size: [192, 256, 256]
  RequestedRegion: 
    Dimension: 3
    Index: [0, 0, 0]
    Size: [192, 256, 256]
  Spacing: [1, 1, 1]
  Origin: [-86.479, 104.942, -146.703]
  Direction: 
0.999773 -0.0184516 -0.0106432
-0.0174525 -0.996024 0.0873548
0.0122127 0.0871492 0.99612

  IndexToPointMatrix: 
0.999773 -0.0184516 -0.0106432
-0.0174525 -0.996024 0.0873548
0.0122127 0.0871492 0.99612

  PointToIndexMatrix: 
0.999773 -0.0174525 0.0122127
-0.0184516 -0.996024 0.0871492
-0.0106432 0.0873548 0.99612

  Inverse Direction: 
0.999773 -0.0174525 0.0122127
-0.0184516 -0.996024 0.0871492
-0.0106432 0.0873548 0.99612

  PixelContainer: 
    ImportImageContainer (0x565556d0a830)
      RTTI typeinfo:   itk::ImportImageContainer<unsigned long, double>
      Reference Count: 1
      Modified Time: 1989
      Debug: Off
      Object Name: 
      Observers: 
        none
      Pointer: 0x7f9ac3e91010
      Container manages memory: true
      Size: 12582912
      Capacity: 12582912

     Weighting = 1
     Sampling strategy = regular
     Number of bins = 32
     Radius = 4
     Sampling percentage  = 0.25
   Transform = Affine
     Gradient step = 0.1
     Update field sigma (voxel space) = 0
     Total field sigma (voxel space) = 0
     Update field time sigma = 0
     Total field time sigma  = 0
     Number of time indices = 0
     Number of time point samples = 0
Stage 3 State
   Image metric = CC
     Fixed image = Image (0x565556d18d80)
  RTTI typeinfo:   itk::Image<double, 3u>
  Reference Count: 2
  Modified Time: 2322
  Debug: Off
  Object Name: 
  Observers: 
    none
  Source: (none)
  Source output name: (none)
  Release Data: Off
  Data Released: False
  Global Release Data: Off
  PipelineMTime: 0
  UpdateMTime: 2157
  RealTimeStamp: 0 seconds 
  LargestPossibleRegion: 
    Dimension: 3
    Index: [0, 0, 0]
    Size: [216, 256, 291]
  BufferedRegion: 
    Dimension: 3
    Index: [0, 0, 0]
    Size: [216, 256, 291]
  RequestedRegion: 
    Dimension: 3
    Index: [0, 0, 0]
    Size: [216, 256, 291]
  Spacing: [1, 1, 1]
  Origin: [0, 293, 0]
  Direction: 
1 0 0
0 -0 -1
0 -1 -0

  IndexToPointMatrix: 
1 0 0
0 0 -1
0 -1 0

  PointToIndexMatrix: 
1 0 0
0 0 -1
0 -1 0

  Inverse Direction: 
1 0 0
0 0 -1
0 -1 0

  PixelContainer: 
    ImportImageContainer (0x565556d148c0)
      RTTI typeinfo:   itk::ImportImageContainer<unsigned long, double>
      Reference Count: 1
      Modified Time: 2154
      Debug: Off
      Object Name: 
      Observers: 
        none
      Pointer: 0x7f9abc3cc010
      Container manages memory: true
      Size: 16091136
      Capacity: 16091136

     Moving image = Image (0x565556d1ae00)
  RTTI typeinfo:   itk::Image<double, 3u>
  Reference Count: 2
  Modified Time: 2323
  Debug: Off
  Object Name: 
  Observers: 
    none
  Source: (none)
  Source output name: (none)
  Release Data: Off
  Data Released: False
  Global Release Data: Off
  PipelineMTime: 0
  UpdateMTime: 2320
  RealTimeStamp: 0 seconds 
  LargestPossibleRegion: 
    Dimension: 3
    Index: [0, 0, 0]
    Size: [192, 256, 256]
  BufferedRegion: 
    Dimension: 3
    Index: [0, 0, 0]
    Size: [192, 256, 256]
  RequestedRegion: 
    Dimension: 3
    Index: [0, 0, 0]
    Size: [192, 256, 256]
  Spacing: [1, 1, 1]
  Origin: [-86.479, 104.942, -146.703]
  Direction: 
0.999773 -0.0184516 -0.0106432
-0.0174525 -0.996024 0.0873548
0.0122127 0.0871492 0.99612

  IndexToPointMatrix: 
0.999773 -0.0184516 -0.0106432
-0.0174525 -0.996024 0.0873548
0.0122127 0.0871492 0.99612

  PointToIndexMatrix: 
0.999773 -0.0174525 0.0122127
-0.0184516 -0.996024 0.0871492
-0.0106432 0.0873548 0.99612

  Inverse Direction: 
0.999773 -0.0174525 0.0122127
-0.0184516 -0.996024 0.0871492
-0.0106432 0.0873548 0.99612

  PixelContainer: 
    ImportImageContainer (0x565556d14e10)
      RTTI typeinfo:   itk::ImportImageContainer<unsigned long, double>
      Reference Count: 1
      Modified Time: 2317
      Debug: Off
      Object Name: 
      Observers: 
        none
      Pointer: 0x7f9ab63cb010
      Container manages memory: true
      Size: 12582912
      Capacity: 12582912

     Weighting = 0.5
     Sampling strategy = none
     Number of bins = 32
     Radius = 4
     Sampling percentage  = 1
   Transform = SyN
     Gradient step = 0.1
     Update field sigma (voxel space) = 3
     Total field sigma (voxel space) = 0
     Update field time sigma = 0
     Total field time sigma  = 0
     Number of time indices = 0
     Number of time point samples = 0
Registration using 3 total stages.

Stage 0
  iterations = 1000x500x250x100
  convergence threshold = 1e-08
  convergence window size = 10
  number of levels = 4
  using the Mattes MI metric (number of bins = 32, weight = 1)
  preprocessing:  winsorizing the image intensities
  preprocessing:  histogram matching the images
  Shrink factors (level 1 out of 4): [8, 8, 8]
  Shrink factors (level 2 out of 4): [4, 4, 4]
  Shrink factors (level 3 out of 4): [2, 2, 2]
  Shrink factors (level 4 out of 4): [1, 1, 1]
  smoothing sigmas per level: [4, 2, 1, 0]
  regular sampling (percentage = 0.25)

*** Running Euler3DTransform registration ***

DIAGNOSTIC,Iteration,metricValue,convergenceValue,ITERATION_TIME_INDEX,SINCE_LAST
 2DIAGNOSTIC,     1, -9.519374328087e-01, 1.797693134862e+308, 1.3053e+01, 1.3053e+01, 
 2DIAGNOSTIC,     2, -9.527232544593e-01, 1.797693134862e+308, 1.3066e+01, 1.3419e-02, 
 2DIAGNOSTIC,     3, -9.537245086143e-01, 1.797693134862e+308, 1.3080e+01, 1.3044e-02, 
