expected boolean value but got "/home/mpib/LNDG/StateSwitch/WIP_rest/preproc/B_dat"
    while executing
"if { $fmri(reginitial_highres_yn) || $fmri(reghighres_yn) || $fmri(regstandard_yn) } {
	set prestatsTime [ expr $prestatsTime + 30 + 30 * $fmri(regsta..."
    (procedure "firstLevelMaster" line 149)
    invoked from within
"firstLevelMaster $session"
    invoked from within
"if { $done_something == 0 } {

    if { ! $fmri(inmelodic) } {
       if { $fmri(level) == 1 } {
	      for { set session 1 } { $session <= $fmri(mult..."
    (file "/usr/lib/fsl/5.0/feat" line 387)
