
Final result: 
0.999314 0.032959 0.016862 26.030101 
-0.034186 0.996323 0.078564 7.775835 
-0.014211 -0.079087 0.996766 -47.362756 
0.000000 0.000000 0.000000 1.000000 


Melodic Version 3.14

Melodic results will be in /home/mpib/LNDG/StateSwitch/WIP_rest/preproc/B_data/D_preproc/2213/preproc/rest/FEAT.feat/filtered_func_data.ica

Create mask ... done
Reading data file /home/mpib/LNDG/StateSwitch/WIP_rest/preproc/B_data/D_preproc/2213/preproc/rest/2213_rest_feat_detrended_bandpassed  ...  done
  Estimating data smoothness ...  done 
  Removing mean image ... done
  Normalising by voxel-wise variance ... done
Excluding voxels with constant value ... done

  Data size : 988 x 62513

Starting PCA  ... done
Start whitening using  30 dimensions ... 
  retaining 87.8877 percent of the variability 
 ... done

Starting ICA estimation using symm

  Step no. 1 change : 0.996024
  Step no. 2 change : 0.47778
  Step no. 3 change : 0.127521
  Step no. 4 change : 0.0666331
  Step no. 5 change : 0.0343644
  Step no. 6 change : 0.0211517
  Step no. 7 change : 0.0119797
  Step no. 8 change : 0.00695515
  Step no. 9 change : 0.00514164
  Step no. 10 change : 0.00493644
  Step no. 11 change : 0.00514427
  Step no. 12 change : 0.0053541
  Step no. 13 change : 0.00501586
  Step no. 14 change : 0.00441772
  Step no. 15 change : 0.00326043
  Step no. 16 change : 0.00212765
  Step no. 17 change : 0.00132044
  Step no. 18 change : 0.000832258
  Step no. 19 change : 0.000673938
  Step no. 20 change : 0.000625419
  Step no. 21 change : 0.000567317
  Step no. 22 change : 0.000502127
  Step no. 23 change : 0.000452931
  Step no. 24 change : 0.000464672
  Step no. 25 change : 0.000482384
  Step no. 26 change : 0.000507348
  Step no. 27 change : 0.000540299
  Step no. 28 change : 0.000581385
  Step no. 29 change : 0.000630096
  Step no. 30 change : 0.000685056
  Step no. 31 change : 0.000743675
  Step no. 32 change : 0.000801756
  Step no. 33 change : 0.000853271
  Step no. 34 change : 0.000890619
  Step no. 35 change : 0.000905677
  Step no. 36 change : 0.000891695
  Step no. 37 change : 0.000845595
  Step no. 38 change : 0.00076965
  Step no. 39 change : 0.000671495
  Step no. 40 change : 0.000562187
  Step no. 41 change : 0.00045314
  Step no. 42 change : 0.000353394
  Step no. 43 change : 0.000268263
  Step no. 44 change : 0.00019947
  Step no. 45 change : 0.00014616
  Step no. 46 change : 0.000106108
  Step no. 47 change : 7.78726e-05
  Step no. 48 change : 6.37214e-05
  Step no. 49 change : 5.2373e-05
  Step no. 50 change : 4.32635e-05
  Convergence after 50 steps 

Sorting IC maps

Writing results to : 
  /home/mpib/LNDG/StateSwitch/WIP_rest/preproc/B_data/D_preproc/2213/preproc/rest/FEAT.feat/filtered_func_data.ica/melodic_IC
  /home/mpib/LNDG/StateSwitch/WIP_rest/preproc/B_data/D_preproc/2213/preproc/rest/FEAT.feat/filtered_func_data.ica/melodic_Tmodes
  /home/mpib/LNDG/StateSwitch/WIP_rest/preproc/B_data/D_preproc/2213/preproc/rest/FEAT.feat/filtered_func_data.ica/melodic_mix
  /home/mpib/LNDG/StateSwitch/WIP_rest/preproc/B_data/D_preproc/2213/preproc/rest/FEAT.feat/filtered_func_data.ica/melodic_FTmix
  /home/mpib/LNDG/StateSwitch/WIP_rest/preproc/B_data/D_preproc/2213/preproc/rest/FEAT.feat/filtered_func_data.ica/melodic_PPCA
  /home/mpib/LNDG/StateSwitch/WIP_rest/preproc/B_data/D_preproc/2213/preproc/rest/FEAT.feat/filtered_func_data.ica/melodic_ICstats
  /home/mpib/LNDG/StateSwitch/WIP_rest/preproc/B_data/D_preproc/2213/preproc/rest/FEAT.feat/filtered_func_data.ica/mask
...done
Creating report index page ...done


Running Mixture Modelling on Z-transformed IC maps ...
  IC map 1 ... 
   calculating mixture-model fit 
   saving probability map:    /home/mpib/LNDG/StateSwitch/WIP_rest/preproc/B_data/D_preproc/2213/preproc/rest/FEAT.feat/filtered_func_data.ica/stats/probmap_1
   saving mixture model fit:  /home/mpib/LNDG/StateSwitch/WIP_rest/preproc/B_data/D_preproc/2213/preproc/rest/FEAT.feat/filtered_func_data.ica/stats/MMstats_1
   re-scaling spatial maps ... 
   thresholding ... 
   alternative hypothesis test at p > 0.5
   saving thresholded Z-stats image:  /home/mpib/LNDG/StateSwitch/WIP_rest/preproc/B_data/D_preproc/2213/preproc/rest/FEAT.feat/filtered_func_data.ica/stats/thresh_zstat1
   creating report page ...    done
  IC map 2 ... 
   calculating mixture-model fit 
   saving probability map:    /home/mpib/LNDG/StateSwitch/WIP_rest/preproc/B_data/D_preproc/2213/preproc/rest/FEAT.feat/filtered_func_data.ica/stats/probmap_2
   saving mixture model fit:  /home/mpib/LNDG/StateSwitch/WIP_rest/preproc/B_data/D_preproc/2213/preproc/rest/FEAT.feat/filtered_func_data.ica/stats/MMstats_2
   re-scaling spatial maps ... 
   thresholding ... 
   alternative hypothesis test at p > 0.5
   saving thresholded Z-stats image:  /home/mpib/LNDG/StateSwitch/WIP_rest/preproc/B_data/D_preproc/2213/preproc/rest/FEAT.feat/filtered_func_data.ica/stats/thresh_zstat2
   creating report page ...    done
  IC map 3 ... 
   calculating mixture-model fit 
   saving probability map:    /home/mpib/LNDG/StateSwitch/WIP_rest/preproc/B_data/D_preproc/2213/preproc/rest/FEAT.feat/filtered_func_data.ica/stats/probmap_3
   saving mixture model fit:  /home/mpib/LNDG/StateSwitch/WIP_rest/preproc/B_data/D_preproc/2213/preproc/rest/FEAT.feat/filtered_func_data.ica/stats/MMstats_3
   re-scaling spatial maps ... 
   thresholding ... 
   alternative hypothesis test at p > 0.5
   saving thresholded Z-stats image:  /home/mpib/LNDG/StateSwitch/WIP_rest/preproc/B_data/D_preproc/2213/preproc/rest/FEAT.feat/filtered_func_data.ica/stats/thresh_zstat3
   creating report page ...    done
  IC map 4 ... 
   calculating mixture-model fit 
   saving probability map:    /home/mpib/LNDG/StateSwitch/WIP_rest/preproc/B_data/D_preproc/2213/preproc/rest/FEAT.feat/filtered_func_data.ica/stats/probmap_4
   saving mixture model fit:  /home/mpib/LNDG/StateSwitch/WIP_rest/preproc/B_data/D_preproc/2213/preproc/rest/FEAT.feat/filtered_func_data.ica/stats/MMstats_4
   re-scaling spatial maps ... 
   thresholding ... 
   alternative hypothesis test at p > 0.5
   saving thresholded Z-stats image:  /home/mpib/LNDG/StateSwitch/WIP_rest/preproc/B_data/D_preproc/2213/preproc/rest/FEAT.feat/filtered_func_data.ica/stats/thresh_zstat4
   creating report page ...    done
  IC map 5 ... 
   calculating mixture-model fit 
   saving probability map:    /home/mpib/LNDG/StateSwitch/WIP_rest/preproc/B_data/D_preproc/2213/preproc/rest/FEAT.feat/filtered_func_data.ica/stats/probmap_5
   saving mixture model fit:  /home/mpib/LNDG/StateSwitch/WIP_rest/preproc/B_data/D_preproc/2213/preproc/rest/FEAT.feat/filtered_func_data.ica/stats/MMstats_5
   re-scaling spatial maps ... 
   thresholding ... 
   alternative hypothesis test at p > 0.5
   saving thresholded Z-stats image:  /home/mpib/LNDG/StateSwitch/WIP_rest/preproc/B_data/D_preproc/2213/preproc/rest/FEAT.feat/filtered_func_data.ica/stats/thresh_zstat5
   creating report page ...    done
  IC map 6 ... 
   calculating mixture-model fit 
   saving probability map:    /home/mpib/LNDG/StateSwitch/WIP_rest/preproc/B_data/D_preproc/2213/preproc/rest/FEAT.feat/filtered_func_data.ica/stats/probmap_6
   saving mixture model fit:  /home/mpib/LNDG/StateSwitch/WIP_rest/preproc/B_data/D_preproc/2213/preproc/rest/FEAT.feat/filtered_func_data.ica/stats/MMstats_6
   re-scaling spatial maps ... 
   thresholding ... 
   alternative hypothesis test at p > 0.5
   saving thresholded Z-stats image:  /home/mpib/LNDG/StateSwitch/WIP_rest/preproc/B_data/D_preproc/2213/preproc/rest/FEAT.feat/filtered_func_data.ica/stats/thresh_zstat6
   creating report page ...    done
  IC map 7 ... 
   calculating mixture-model fit 
   saving probability map:    /home/mpib/LNDG/StateSwitch/WIP_rest/preproc/B_data/D_preproc/2213/preproc/rest/FEAT.feat/filtered_func_data.ica/stats/probmap_7
   saving mixture model fit:  /home/mpib/LNDG/StateSwitch/WIP_rest/preproc/B_data/D_preproc/2213/preproc/rest/FEAT.feat/filtered_func_data.ica/stats/MMstats_7
   re-scaling spatial maps ... 
   thresholding ... 
   alternative hypothesis test at p > 0.5
   saving thresholded Z-stats image:  /home/mpib/LNDG/StateSwitch/WIP_rest/preproc/B_data/D_preproc/2213/preproc/rest/FEAT.feat/filtered_func_data.ica/stats/thresh_zstat7
   creating report page ...    done
  IC map 8 ... 
   calculating mixture-model fit 
   saving probability map:    /home/mpib/LNDG/StateSwitch/WIP_rest/preproc/B_data/D_preproc/2213/preproc/rest/FEAT.feat/filtered_func_data.ica/stats/probmap_8
   saving mixture model fit:  /home/mpib/LNDG/StateSwitch/WIP_rest/preproc/B_data/D_preproc/2213/preproc/rest/FEAT.feat/filtered_func_data.ica/stats/MMstats_8
   re-scaling spatial maps ... 
   thresholding ... 
   alternative hypothesis test at p > 0.5
   saving thresholded Z-stats image:  /home/mpib/LNDG/StateSwitch/WIP_rest/preproc/B_data/D_preproc/2213/preproc/rest/FEAT.feat/filtered_func_data.ica/stats/thresh_zstat8
   creating report page ...    done
  IC map 9 ... 
   calculating mixture-model fit 
   saving probability map:    /home/mpib/LNDG/StateSwitch/WIP_rest/preproc/B_data/D_preproc/2213/preproc/rest/FEAT.feat/filtered_func_data.ica/stats/probmap_9
   saving mixture model fit:  /home/mpib/LNDG/StateSwitch/WIP_rest/preproc/B_data/D_preproc/2213/preproc/rest/FEAT.feat/filtered_func_data.ica/stats/MMstats_9
   re-scaling spatial maps ... 
   thresholding ... 
   alternative hypothesis test at p > 0.5
   saving thresholded Z-stats image:  /home/mpib/LNDG/StateSwitch/WIP_rest/preproc/B_data/D_preproc/2213/preproc/rest/FEAT.feat/filtered_func_data.ica/stats/thresh_zstat9
   creating report page ...    done
  IC map 10 ... 
   calculating mixture-model fit 
   saving probability map:    /home/mpib/LNDG/StateSwitch/WIP_rest/preproc/B_data/D_preproc/2213/preproc/rest/FEAT.feat/filtered_func_data.ica/stats/probmap_10
   saving mixture model fit:  /home/mpib/LNDG/StateSwitch/WIP_rest/preproc/B_data/D_preproc/2213/preproc/rest/FEAT.feat/filtered_func_data.ica/stats/MMstats_10
   re-scaling spatial maps ... 
   thresholding ... 
   alternative hypothesis test at p > 0.5
   saving thresholded Z-stats image:  /home/mpib/LNDG/StateSwitch/WIP_rest/preproc/B_data/D_preproc/2213/preproc/rest/FEAT.feat/filtered_func_data.ica/stats/thresh_zstat10
   creating report page ...    done
  IC map 11 ... 
   calculating mixture-model fit 
   saving probability map:    /home/mpib/LNDG/StateSwitch/WIP_rest/preproc/B_data/D_preproc/2213/preproc/rest/FEAT.feat/filtered_func_data.ica/stats/probmap_11
   saving mixture model fit:  /home/mpib/LNDG/StateSwitch/WIP_rest/preproc/B_data/D_preproc/2213/preproc/rest/FEAT.feat/filtered_func_data.ica/stats/MMstats_11
   re-scaling spatial maps ... 
   thresholding ... 
   alternative hypothesis test at p > 0.5
   saving thresholded Z-stats image:  /home/mpib/LNDG/StateSwitch/WIP_rest/preproc/B_data/D_preproc/2213/preproc/rest/FEAT.feat/filtered_func_data.ica/stats/thresh_zstat11
   creating report page ...    done
  IC map 12 ... 
   calculating mixture-model fit 
   saving probability map:    /home/mpib/LNDG/StateSwitch/WIP_rest/preproc/B_data/D_preproc/2213/preproc/rest/FEAT.feat/filtered_func_data.ica/stats/probmap_12
   saving mixture model fit:  /home/mpib/LNDG/StateSwitch/WIP_rest/preproc/B_data/D_preproc/2213/preproc/rest/FEAT.feat/filtered_func_data.ica/stats/MMstats_12
   re-scaling spatial maps ... 
   thresholding ... 
   alternative hypothesis test at p > 0.5
   saving thresholded Z-stats image:  /home/mpib/LNDG/StateSwitch/WIP_rest/preproc/B_data/D_preproc/2213/preproc/rest/FEAT.feat/filtered_func_data.ica/stats/thresh_zstat12
   creating report page ...    done
  IC map 13 ... 
   calculating mixture-model fit 
   saving probability map:    /home/mpib/LNDG/StateSwitch/WIP_rest/preproc/B_data/D_preproc/2213/preproc/rest/FEAT.feat/filtered_func_data.ica/stats/probmap_13
   saving mixture model fit:  /home/mpib/LNDG/StateSwitch/WIP_rest/preproc/B_data/D_preproc/2213/preproc/rest/FEAT.feat/filtered_func_data.ica/stats/MMstats_13
   re-scaling spatial maps ... 
   thresholding ... 
   alternative hypothesis test at p > 0.5
   saving thresholded Z-stats image:  /home/mpib/LNDG/StateSwitch/WIP_rest/preproc/B_data/D_preproc/2213/preproc/rest/FEAT.feat/filtered_func_data.ica/stats/thresh_zstat13
   creating report page ...    done
  IC map 14 ... 
   calculating mixture-model fit 
   saving probability map:    /home/mpib/LNDG/StateSwitch/WIP_rest/preproc/B_data/D_preproc/2213/preproc/rest/FEAT.feat/filtered_func_data.ica/stats/probmap_14
   saving mixture model fit:  /home/mpib/LNDG/StateSwitch/WIP_rest/preproc/B_data/D_preproc/2213/preproc/rest/FEAT.feat/filtered_func_data.ica/stats/MMstats_14
   re-scaling spatial maps ... 
   thresholding ... 
   alternative hypothesis test at p > 0.5
   saving thresholded Z-stats image:  /home/mpib/LNDG/StateSwitch/WIP_rest/preproc/B_data/D_preproc/2213/preproc/rest/FEAT.feat/filtered_func_data.ica/stats/thresh_zstat14
   creating report page ...    done
  IC map 15 ... 
   calculating mixture-model fit 
   saving probability map:    /home/mpib/LNDG/StateSwitch/WIP_rest/preproc/B_data/D_preproc/2213/preproc/rest/FEAT.feat/filtered_func_data.ica/stats/probmap_15
   saving mixture model fit:  /home/mpib/LNDG/StateSwitch/WIP_rest/preproc/B_data/D_preproc/2213/preproc/rest/FEAT.feat/filtered_func_data.ica/stats/MMstats_15
   re-scaling spatial maps ... 
   thresholding ... 
   alternative hypothesis test at p > 0.5
   saving thresholded Z-stats image:  /home/mpib/LNDG/StateSwitch/WIP_rest/preproc/B_data/D_preproc/2213/preproc/rest/FEAT.feat/filtered_func_data.ica/stats/thresh_zstat15
   creating report page ...    done
  IC map 16 ... 
   calculating mixture-model fit 
   saving probability map:    /home/mpib/LNDG/StateSwitch/WIP_rest/preproc/B_data/D_preproc/2213/preproc/rest/FEAT.feat/filtered_func_data.ica/stats/probmap_16
   saving mixture model fit:  /home/mpib/LNDG/StateSwitch/WIP_rest/preproc/B_data/D_preproc/2213/preproc/rest/FEAT.feat/filtered_func_data.ica/stats/MMstats_16
   re-scaling spatial maps ... 
   thresholding ... 
   alternative hypothesis test at p > 0.5
   saving thresholded Z-stats image:  /home/mpib/LNDG/StateSwitch/WIP_rest/preproc/B_data/D_preproc/2213/preproc/rest/FEAT.feat/filtered_func_data.ica/stats/thresh_zstat16
   creating report page ...    done
  IC map 17 ... 
   calculating mixture-model fit 
   saving probability map:    /home/mpib/LNDG/StateSwitch/WIP_rest/preproc/B_data/D_preproc/2213/preproc/rest/FEAT.feat/filtered_func_data.ica/stats/probmap_17
   saving mixture model fit:  /home/mpib/LNDG/StateSwitch/WIP_rest/preproc/B_data/D_preproc/2213/preproc/rest/FEAT.feat/filtered_func_data.ica/stats/MMstats_17
   re-scaling spatial maps ... 
   thresholding ... 
   alternative hypothesis test at p > 0.5
   saving thresholded Z-stats image:  /home/mpib/LNDG/StateSwitch/WIP_rest/preproc/B_data/D_preproc/2213/preproc/rest/FEAT.feat/filtered_func_data.ica/stats/thresh_zstat17
   creating report page ...    done
  IC map 18 ... 
   calculating mixture-model fit 
   saving probability map:    /home/mpib/LNDG/StateSwitch/WIP_rest/preproc/B_data/D_preproc/2213/preproc/rest/FEAT.feat/filtered_func_data.ica/stats/probmap_18
   saving mixture model fit:  /home/mpib/LNDG/StateSwitch/WIP_rest/preproc/B_data/D_preproc/2213/preproc/rest/FEAT.feat/filtered_func_data.ica/stats/MMstats_18
   re-scaling spatial maps ... 
   thresholding ... 
   alternative hypothesis test at p > 0.5
   saving thresholded Z-stats image:  /home/mpib/LNDG/StateSwitch/WIP_rest/preproc/B_data/D_preproc/2213/preproc/rest/FEAT.feat/filtered_func_data.ica/stats/thresh_zstat18
   creating report page ...    done
  IC map 19 ... 
   calculating mixture-model fit 
   saving probability map:    /home/mpib/LNDG/StateSwitch/WIP_rest/preproc/B_data/D_preproc/2213/preproc/rest/FEAT.feat/filtered_func_data.ica/stats/probmap_19
   saving mixture model fit:  /home/mpib/LNDG/StateSwitch/WIP_rest/preproc/B_data/D_preproc/2213/preproc/rest/FEAT.feat/filtered_func_data.ica/stats/MMstats_19
   re-scaling spatial maps ... 
   thresholding ... 
   alternative hypothesis test at p > 0.5
   saving thresholded Z-stats image:  /home/mpib/LNDG/StateSwitch/WIP_rest/preproc/B_data/D_preproc/2213/preproc/rest/FEAT.feat/filtered_func_data.ica/stats/thresh_zstat19
   creating report page ...    done
  IC map 20 ... 
   calculating mixture-model fit 
   saving probability map:    /home/mpib/LNDG/StateSwitch/WIP_rest/preproc/B_data/D_preproc/2213/preproc/rest/FEAT.feat/filtered_func_data.ica/stats/probmap_20
   saving mixture model fit:  /home/mpib/LNDG/StateSwitch/WIP_rest/preproc/B_data/D_preproc/2213/preproc/rest/FEAT.feat/filtered_func_data.ica/stats/MMstats_20
   re-scaling spatial maps ... 
   thresholding ... 
   alternative hypothesis test at p > 0.5
   saving thresholded Z-stats image:  /home/mpib/LNDG/StateSwitch/WIP_rest/preproc/B_data/D_preproc/2213/preproc/rest/FEAT.feat/filtered_func_data.ica/stats/thresh_zstat20
   creating report page ...    done
  IC map 21 ... 
   calculating mixture-model fit 
   saving probability map:    /home/mpib/LNDG/StateSwitch/WIP_rest/preproc/B_data/D_preproc/2213/preproc/rest/FEAT.feat/filtered_func_data.ica/stats/probmap_21
   saving mixture model fit:  /home/mpib/LNDG/StateSwitch/WIP_rest/preproc/B_data/D_preproc/2213/preproc/rest/FEAT.feat/filtered_func_data.ica/stats/MMstats_21
   re-scaling spatial maps ... 
   thresholding ... 
   alternative hypothesis test at p > 0.5
   saving thresholded Z-stats image:  /home/mpib/LNDG/StateSwitch/WIP_rest/preproc/B_data/D_preproc/2213/preproc/rest/FEAT.feat/filtered_func_data.ica/stats/thresh_zstat21
   creating report page ...    done
  IC map 22 ... 
   calculating mixture-model fit 
   saving probability map:    /home/mpib/LNDG/StateSwitch/WIP_rest/preproc/B_data/D_preproc/2213/preproc/rest/FEAT.feat/filtered_func_data.ica/stats/probmap_22
   saving mixture model fit:  /home/mpib/LNDG/StateSwitch/WIP_rest/preproc/B_data/D_preproc/2213/preproc/rest/FEAT.feat/filtered_func_data.ica/stats/MMstats_22
   re-scaling spatial maps ... 
   thresholding ... 
   alternative hypothesis test at p > 0.5
   saving thresholded Z-stats image:  /home/mpib/LNDG/StateSwitch/WIP_rest/preproc/B_data/D_preproc/2213/preproc/rest/FEAT.feat/filtered_func_data.ica/stats/thresh_zstat22
   creating report page ...    done
  IC map 23 ... 
   calculating mixture-model fit 
   saving probability map:    /home/mpib/LNDG/StateSwitch/WIP_rest/preproc/B_data/D_preproc/2213/preproc/rest/FEAT.feat/filtered_func_data.ica/stats/probmap_23
   saving mixture model fit:  /home/mpib/LNDG/StateSwitch/WIP_rest/preproc/B_data/D_preproc/2213/preproc/rest/FEAT.feat/filtered_func_data.ica/stats/MMstats_23
   re-scaling spatial maps ... 
   thresholding ... 
   alternative hypothesis test at p > 0.5
   saving thresholded Z-stats image:  /home/mpib/LNDG/StateSwitch/WIP_rest/preproc/B_data/D_preproc/2213/preproc/rest/FEAT.feat/filtered_func_data.ica/stats/thresh_zstat23
   creating report page ...    done
  IC map 24 ... 
   calculating mixture-model fit 
   saving probability map:    /home/mpib/LNDG/StateSwitch/WIP_rest/preproc/B_data/D_preproc/2213/preproc/rest/FEAT.feat/filtered_func_data.ica/stats/probmap_24
   saving mixture model fit:  /home/mpib/LNDG/StateSwitch/WIP_rest/preproc/B_data/D_preproc/2213/preproc/rest/FEAT.feat/filtered_func_data.ica/stats/MMstats_24
   re-scaling spatial maps ... 
   thresholding ... 
   alternative hypothesis test at p > 0.5
   saving thresholded Z-stats image:  /home/mpib/LNDG/StateSwitch/WIP_rest/preproc/B_data/D_preproc/2213/preproc/rest/FEAT.feat/filtered_func_data.ica/stats/thresh_zstat24
   creating report page ...    done
  IC map 25 ... 
   calculating mixture-model fit 
   saving probability map:    /home/mpib/LNDG/StateSwitch/WIP_rest/preproc/B_data/D_preproc/2213/preproc/rest/FEAT.feat/filtered_func_data.ica/stats/probmap_25
   saving mixture model fit:  /home/mpib/LNDG/StateSwitch/WIP_rest/preproc/B_data/D_preproc/2213/preproc/rest/FEAT.feat/filtered_func_data.ica/stats/MMstats_25
   re-scaling spatial maps ... 
   thresholding ... 
   alternative hypothesis test at p > 0.5
   saving thresholded Z-stats image:  /home/mpib/LNDG/StateSwitch/WIP_rest/preproc/B_data/D_preproc/2213/preproc/rest/FEAT.feat/filtered_func_data.ica/stats/thresh_zstat25
   creating report page ...    done
  IC map 26 ... 
   calculating mixture-model fit 
   saving probability map:    /home/mpib/LNDG/StateSwitch/WIP_rest/preproc/B_data/D_preproc/2213/preproc/rest/FEAT.feat/filtered_func_data.ica/stats/probmap_26
   saving mixture model fit:  /home/mpib/LNDG/StateSwitch/WIP_rest/preproc/B_data/D_preproc/2213/preproc/rest/FEAT.feat/filtered_func_data.ica/stats/MMstats_26
   re-scaling spatial maps ... 
   thresholding ... 
   alternative hypothesis test at p > 0.5
   saving thresholded Z-stats image:  /home/mpib/LNDG/StateSwitch/WIP_rest/preproc/B_data/D_preproc/2213/preproc/rest/FEAT.feat/filtered_func_data.ica/stats/thresh_zstat26
   creating report page ...    done
  IC map 27 ... 
   calculating mixture-model fit 
   saving probability map:    /home/mpib/LNDG/StateSwitch/WIP_rest/preproc/B_data/D_preproc/2213/preproc/rest/FEAT.feat/filtered_func_data.ica/stats/probmap_27
   saving mixture model fit:  /home/mpib/LNDG/StateSwitch/WIP_rest/preproc/B_data/D_preproc/2213/preproc/rest/FEAT.feat/filtered_func_data.ica/stats/MMstats_27
   re-scaling spatial maps ... 
   thresholding ... 
   alternative hypothesis test at p > 0.5
   saving thresholded Z-stats image:  /home/mpib/LNDG/StateSwitch/WIP_rest/preproc/B_data/D_preproc/2213/preproc/rest/FEAT.feat/filtered_func_data.ica/stats/thresh_zstat27
   creating report page ...    done
  IC map 28 ... 
   calculating mixture-model fit 
   saving probability map:    /home/mpib/LNDG/StateSwitch/WIP_rest/preproc/B_data/D_preproc/2213/preproc/rest/FEAT.feat/filtered_func_data.ica/stats/probmap_28
   saving mixture model fit:  /home/mpib/LNDG/StateSwitch/WIP_rest/preproc/B_data/D_preproc/2213/preproc/rest/FEAT.feat/filtered_func_data.ica/stats/MMstats_28
   re-scaling spatial maps ... 
   thresholding ... 
   alternative hypothesis test at p > 0.5
   saving thresholded Z-stats image:  /home/mpib/LNDG/StateSwitch/WIP_rest/preproc/B_data/D_preproc/2213/preproc/rest/FEAT.feat/filtered_func_data.ica/stats/thresh_zstat28
   creating report page ...    done
  IC map 29 ... 
   calculating mixture-model fit 
   saving probability map:    /home/mpib/LNDG/StateSwitch/WIP_rest/preproc/B_data/D_preproc/2213/preproc/rest/FEAT.feat/filtered_func_data.ica/stats/probmap_29
   saving mixture model fit:  /home/mpib/LNDG/StateSwitch/WIP_rest/preproc/B_data/D_preproc/2213/preproc/rest/FEAT.feat/filtered_func_data.ica/stats/MMstats_29
   re-scaling spatial maps ... 
   thresholding ... 
   alternative hypothesis test at p > 0.5
   saving thresholded Z-stats image:  /home/mpib/LNDG/StateSwitch/WIP_rest/preproc/B_data/D_preproc/2213/preproc/rest/FEAT.feat/filtered_func_data.ica/stats/thresh_zstat29
   creating report page ...    done
  IC map 30 ... 
   calculating mixture-model fit 
   saving probability map:    /home/mpib/LNDG/StateSwitch/WIP_rest/preproc/B_data/D_preproc/2213/preproc/rest/FEAT.feat/filtered_func_data.ica/stats/probmap_30
   saving mixture model fit:  /home/mpib/LNDG/StateSwitch/WIP_rest/preproc/B_data/D_preproc/2213/preproc/rest/FEAT.feat/filtered_func_data.ica/stats/MMstats_30
   re-scaling spatial maps ... 
   thresholding ... 
   alternative hypothesis test at p > 0.5
   saving thresholded Z-stats image:  /home/mpib/LNDG/StateSwitch/WIP_rest/preproc/B_data/D_preproc/2213/preproc/rest/FEAT.feat/filtered_func_data.ica/stats/thresh_zstat30
   creating report page ...    done

Writing results to : 
  /home/mpib/LNDG/StateSwitch/WIP_rest/preproc/B_data/D_preproc/2213/preproc/rest/FEAT.feat/filtered_func_data.ica/melodic_IC
  /home/mpib/LNDG/StateSwitch/WIP_rest/preproc/B_data/D_preproc/2213/preproc/rest/FEAT.feat/filtered_func_data.ica/melodic_Tmodes
  /home/mpib/LNDG/StateSwitch/WIP_rest/preproc/B_data/D_preproc/2213/preproc/rest/FEAT.feat/filtered_func_data.ica/melodic_mix
  /home/mpib/LNDG/StateSwitch/WIP_rest/preproc/B_data/D_preproc/2213/preproc/rest/FEAT.feat/filtered_func_data.ica/melodic_FTmix
  /home/mpib/LNDG/StateSwitch/WIP_rest/preproc/B_data/D_preproc/2213/preproc/rest/FEAT.feat/filtered_func_data.ica/melodic_PPCA
  /home/mpib/LNDG/StateSwitch/WIP_rest/preproc/B_data/D_preproc/2213/preproc/rest/FEAT.feat/filtered_func_data.ica/melodic_ICstats
  /home/mpib/LNDG/StateSwitch/WIP_rest/preproc/B_data/D_preproc/2213/preproc/rest/FEAT.feat/filtered_func_data.ica/mask
...done


 To view the output report point your web browser at /home/mpib/LNDG/StateSwitch/WIP_rest/preproc/B_data/D_preproc/2213/preproc/rest/FEAT.feat/filtered_func_data.ica/report/00index.html

finished!

