------------------------------------------
Setting up environment variables
---
LD_LIBRARY_PATH is .:/opt/matlab/R2016b/runtime/glnxa64:/opt/matlab/R2016b/bin/glnxa64:/opt/matlab/R2016b/sys/os/glnxa64:/opt/matlab/R2016b/sys/opengl/lib/glnxa64
Converting Niftis: REST Subject 1257
Xiangrui Li's dicm2nii.m 20170922? (feedback to xiangrui.li@gmail.com)
Extracting files from sub-STSWD1257_rest_bold.zip ...
Validating 1000 files ...
Converting 1 series (SIEMENS) into 4-D .nii.gz: subject 'STSW_1257'
 cmrr_MB4_bold_rest       74x74x40x1000
Elapsed time by dicm2nii is 146.6 seconds

