Refresh (5 sec)

Progress Report / Log

Started at Fri Feb 23 17:46:24 CET 2018

Feat main script


/bin/cp /home/mpib/LNDG/StateSwitch/WIP_rest/preproc/B_data/D_preproc/2149/preproc/rest/2149_rest.fsf design.fsf

/usr/share/fsl/5.0/bin/feat_model design

mkdir .files;cp /usr/share/fsl/5.0/doc/fsl.css .files;cp -r /usr/share/fsl/5.0/doc/images .files/images


























