/opt/software/fix/1.065//fix
FIX Feature extraction for Melodic output directory: /home/mpib/LNDG/StateSwitch/WIP_rest/preproc/B_data/D_preproc/1223/preproc/rest/FEAT.feat
 create edge masks
 run FAST
 registration of standard space masks
 extract features
