%!PS-Adobe-3.0 EPSF-3.0
%%Creator: (MATLAB, The Mathworks, Inc. Version 9.8.0.1323502 \(R2020a\). Operating System: Mac OS X)
%%Title: /Users/kosciessa/Desktop/tardis/LNDG/stateswitch/stsw_eye/pupil/figures/e01_pls_traces.eps
%%CreationDate: 2022-02-21T10:10:05
%%Pages: (atend)
%%BoundingBox:    12     0   389   276
%%LanguageLevel: 3
%%EndComments
%%BeginProlog
%%BeginResource: procset (Apache XML Graphics Std ProcSet) 1.2 0
%%Version: 1.2 0
%%Copyright: (Copyright 2001-2003,2010 The Apache Software Foundation. License terms: http://www.apache.org/licenses/LICENSE-2.0)
/bd{bind def}bind def
/ld{load def}bd
/GR/grestore ld
/GS/gsave ld
/RM/rmoveto ld
/C/curveto ld
/t/show ld
/L/lineto ld
/ML/setmiterlimit ld
/CT/concat ld
/f/fill ld
/N/newpath ld
/S/stroke ld
/CC/setcmykcolor ld
/A/ashow ld
/cp/closepath ld
/RC/setrgbcolor ld
/LJ/setlinejoin ld
/GC/setgray ld
/LW/setlinewidth ld
/M/moveto ld
/re {4 2 roll M
1 index 0 rlineto
0 exch rlineto
neg 0 rlineto
cp } bd
/_ctm matrix def
/_tm matrix def
/BT { _ctm currentmatrix pop matrix _tm copy pop 0 0 moveto } bd
/ET { _ctm setmatrix } bd
/iTm { _ctm setmatrix _tm concat } bd
/Tm { _tm astore pop iTm 0 0 moveto } bd
/ux 0.0 def
/uy 0.0 def
/F {
  /Tp exch def
  /Tf exch def
  Tf findfont Tp scalefont setfont
  /cf Tf def  /cs Tp def
} bd
/ULS {currentpoint /uy exch def /ux exch def} bd
/ULE {
  /Tcx currentpoint pop def
  gsave
  newpath
  cf findfont cs scalefont dup
  /FontMatrix get 0 get /Ts exch def /FontInfo get dup
  /UnderlinePosition get Ts mul /To exch def
  /UnderlineThickness get Ts mul /Tt exch def
  ux uy To add moveto  Tcx uy To add lineto
  Tt setlinewidth stroke
  grestore
} bd
/OLE {
  /Tcx currentpoint pop def
  gsave
  newpath
  cf findfont cs scalefont dup
  /FontMatrix get 0 get /Ts exch def /FontInfo get dup
  /UnderlinePosition get Ts mul /To exch def
  /UnderlineThickness get Ts mul /Tt exch def
  ux uy To add cs add moveto Tcx uy To add cs add lineto
  Tt setlinewidth stroke
  grestore
} bd
/SOE {
  /Tcx currentpoint pop def
  gsave
  newpath
  cf findfont cs scalefont dup
  /FontMatrix get 0 get /Ts exch def /FontInfo get dup
  /UnderlinePosition get Ts mul /To exch def
  /UnderlineThickness get Ts mul /Tt exch def
  ux uy To add cs 10 mul 26 idiv add moveto Tcx uy To add cs 10 mul 26 idiv add lineto
  Tt setlinewidth stroke
  grestore
} bd
/QT {
/Y22 exch store
/X22 exch store
/Y21 exch store
/X21 exch store
currentpoint
/Y21 load 2 mul add 3 div exch
/X21 load 2 mul add 3 div exch
/X21 load 2 mul /X22 load add 3 div
/Y21 load 2 mul /Y22 load add 3 div
/X22 load /Y22 load curveto
} bd
/SSPD {
dup length /d exch dict def
{
/v exch def
/k exch def
currentpagedevice k known {
/cpdv currentpagedevice k get def
v cpdv ne {
/upd false def
/nullv v type /nulltype eq def
/nullcpdv cpdv type /nulltype eq def
nullv nullcpdv or
{
/upd true def
} {
/sametype v type cpdv type eq def
sametype {
v type /arraytype eq {
/vlen v length def
/cpdvlen cpdv length def
vlen cpdvlen eq {
0 1 vlen 1 sub {
/i exch def
/obj v i get def
/cpdobj cpdv i get def
obj cpdobj ne {
/upd true def
exit
} if
} for
} {
/upd true def
} ifelse
} {
v type /dicttype eq {
v {
/dv exch def
/dk exch def
/cpddv cpdv dk get def
dv cpddv ne {
/upd true def
exit
} if
} forall
} {
/upd true def
} ifelse
} ifelse
} if
} ifelse
upd true eq {
d k v put
} if
} if
} if
} forall
d length 0 gt {
d setpagedevice
} if
} bd
/RE { % /NewFontName [NewEncodingArray] /FontName RE -
  findfont dup length dict begin
  {
    1 index /FID ne
    {def} {pop pop} ifelse
  } forall
  /Encoding exch def
  /FontName 1 index def
  currentdict definefont pop
  end
} bind def
%%EndResource
%%BeginResource: procset (Apache XML Graphics EPS ProcSet) 1.0 0
%%Version: 1.0 0
%%Copyright: (Copyright 2002-2003 The Apache Software Foundation. License terms: http://www.apache.org/licenses/LICENSE-2.0)
/BeginEPSF { %def
/b4_Inc_state save def         % Save state for cleanup
/dict_count countdictstack def % Count objects on dict stack
/op_count count 1 sub def      % Count objects on operand stack
userdict begin                 % Push userdict on dict stack
/showpage { } def              % Redefine showpage, { } = null proc
0 setgray 0 setlinecap         % Prepare graphics state
1 setlinewidth 0 setlinejoin
10 setmiterlimit [ ] 0 setdash newpath
/languagelevel where           % If level not equal to 1 then
{pop languagelevel             % set strokeadjust and
1 ne                           % overprint to their defaults.
{false setstrokeadjust false setoverprint
} if
} if
} bd
/EndEPSF { %def
count op_count sub {pop} repeat            % Clean up stacks
countdictstack dict_count sub {end} repeat
b4_Inc_state restore
} bd
%%EndResource
%FOPBeginFontDict
%%IncludeResource: font Courier-Oblique
%%IncludeResource: font Courier-BoldOblique
%%IncludeResource: font Courier-Bold
%%IncludeResource: font ZapfDingbats
%%IncludeResource: font Symbol
%%IncludeResource: font Helvetica
%%IncludeResource: font Helvetica-Oblique
%%IncludeResource: font Helvetica-Bold
%%IncludeResource: font Helvetica-BoldOblique
%%IncludeResource: font Times-Roman
%%IncludeResource: font Times-Italic
%%IncludeResource: font Times-Bold
%%IncludeResource: font Times-BoldItalic
%%IncludeResource: font Courier
%FOPEndFontDict
%%BeginResource: encoding WinAnsiEncoding
/WinAnsiEncoding [
/.notdef /.notdef /.notdef /.notdef /.notdef
/.notdef /.notdef /.notdef /.notdef /.notdef
/.notdef /.notdef /.notdef /.notdef /.notdef
/.notdef /.notdef /.notdef /.notdef /.notdef
/.notdef /.notdef /.notdef /.notdef /.notdef
/.notdef /.notdef /.notdef /.notdef /.notdef
/.notdef /.notdef /space /exclam /quotedbl
/numbersign /dollar /percent /ampersand /quotesingle
/parenleft /parenright /asterisk /plus /comma
/hyphen /period /slash /zero /one
/two /three /four /five /six
/seven /eight /nine /colon /semicolon
/less /equal /greater /question /at
/A /B /C /D /E
/F /G /H /I /J
/K /L /M /N /O
/P /Q /R /S /T
/U /V /W /X /Y
/Z /bracketleft /backslash /bracketright /asciicircum
/underscore /quoteleft /a /b /c
/d /e /f /g /h
/i /j /k /l /m
/n /o /p /q /r
/s /t /u /v /w
/x /y /z /braceleft /bar
/braceright /asciitilde /bullet /Euro /bullet
/quotesinglbase /florin /quotedblbase /ellipsis /dagger
/daggerdbl /circumflex /perthousand /Scaron /guilsinglleft
/OE /bullet /Zcaron /bullet /bullet
/quoteleft /quoteright /quotedblleft /quotedblright /bullet
/endash /emdash /asciitilde /trademark /scaron
/guilsinglright /oe /bullet /zcaron /Ydieresis
/space /exclamdown /cent /sterling /currency
/yen /brokenbar /section /dieresis /copyright
/ordfeminine /guillemotleft /logicalnot /sfthyphen /registered
/macron /degree /plusminus /twosuperior /threesuperior
/acute /mu /paragraph /middot /cedilla
/onesuperior /ordmasculine /guillemotright /onequarter /onehalf
/threequarters /questiondown /Agrave /Aacute /Acircumflex
/Atilde /Adieresis /Aring /AE /Ccedilla
/Egrave /Eacute /Ecircumflex /Edieresis /Igrave
/Iacute /Icircumflex /Idieresis /Eth /Ntilde
/Ograve /Oacute /Ocircumflex /Otilde /Odieresis
/multiply /Oslash /Ugrave /Uacute /Ucircumflex
/Udieresis /Yacute /Thorn /germandbls /agrave
/aacute /acircumflex /atilde /adieresis /aring
/ae /ccedilla /egrave /eacute /ecircumflex
/edieresis /igrave /iacute /icircumflex /idieresis
/eth /ntilde /ograve /oacute /ocircumflex
/otilde /odieresis /divide /oslash /ugrave
/uacute /ucircumflex /udieresis /yacute /thorn
/ydieresis
] def
%%EndResource
%FOPBeginFontReencode
/Courier-Oblique findfont
dup length dict begin
  {1 index /FID ne {def} {pop pop} ifelse} forall
  /Encoding WinAnsiEncoding def
  currentdict
end
/Courier-Oblique exch definefont pop
/Courier-BoldOblique findfont
dup length dict begin
  {1 index /FID ne {def} {pop pop} ifelse} forall
  /Encoding WinAnsiEncoding def
  currentdict
end
/Courier-BoldOblique exch definefont pop
/Courier-Bold findfont
dup length dict begin
  {1 index /FID ne {def} {pop pop} ifelse} forall
  /Encoding WinAnsiEncoding def
  currentdict
end
/Courier-Bold exch definefont pop
/Helvetica findfont
dup length dict begin
  {1 index /FID ne {def} {pop pop} ifelse} forall
  /Encoding WinAnsiEncoding def
  currentdict
end
/Helvetica exch definefont pop
/Helvetica-Oblique findfont
dup length dict begin
  {1 index /FID ne {def} {pop pop} ifelse} forall
  /Encoding WinAnsiEncoding def
  currentdict
end
/Helvetica-Oblique exch definefont pop
/Helvetica-Bold findfont
dup length dict begin
  {1 index /FID ne {def} {pop pop} ifelse} forall
  /Encoding WinAnsiEncoding def
  currentdict
end
/Helvetica-Bold exch definefont pop
/Helvetica-BoldOblique findfont
dup length dict begin
  {1 index /FID ne {def} {pop pop} ifelse} forall
  /Encoding WinAnsiEncoding def
  currentdict
end
/Helvetica-BoldOblique exch definefont pop
/Times-Roman findfont
dup length dict begin
  {1 index /FID ne {def} {pop pop} ifelse} forall
  /Encoding WinAnsiEncoding def
  currentdict
end
/Times-Roman exch definefont pop
/Times-Italic findfont
dup length dict begin
  {1 index /FID ne {def} {pop pop} ifelse} forall
  /Encoding WinAnsiEncoding def
  currentdict
end
/Times-Italic exch definefont pop
/Times-Bold findfont
dup length dict begin
  {1 index /FID ne {def} {pop pop} ifelse} forall
  /Encoding WinAnsiEncoding def
  currentdict
end
/Times-Bold exch definefont pop
/Times-BoldItalic findfont
dup length dict begin
  {1 index /FID ne {def} {pop pop} ifelse} forall
  /Encoding WinAnsiEncoding def
  currentdict
end
/Times-BoldItalic exch definefont pop
/Courier findfont
dup length dict begin
  {1 index /FID ne {def} {pop pop} ifelse} forall
  /Encoding WinAnsiEncoding def
  currentdict
end
/Courier exch definefont pop
%FOPEndFontReencode
%%EndProlog
%%Page: 1 1
%%PageBoundingBox: 0 0 425 283
%%BeginPageSetup
[1 0 0 -1 0 283] CT
%%EndPageSetup
GS
[1.00046 0 0 1 0 0] CT
1 GC
N
0 0 425 283 re
f
GR
GS
[1.00046 0 0 1 0 0] CT
1 GC
N
0 0 425 283 re
f
GR
GS
[1.00046 0 0 1 0 0] CT
1 GC
N
55 233.5 M
384.5 233.5 L
384.5 48.5 L
55 48.5 L
cp
f
GR
GS
[1.00046 0 0 1 0 0] CT
0.149 GC
2 setlinecap
1 LJ
0.5 LW
N
55 233.5 M
384.5 233.5 L
S
GR
GS
[1.00046 0 0 1 0 0] CT
0.149 GC
2 setlinecap
1 LJ
0.5 LW
N
55 48.5 M
384.5 48.5 L
S
GR
GS
[1.00046 0 0 1 0 0] CT
0.149 GC
2 setlinecap
1 LJ
0.5 LW
N
55 233.5 M
55 230.21 L
S
GR
GS
[1.00046 0 0 1 0 0] CT
0.149 GC
2 setlinecap
1 LJ
0.5 LW
N
164.833 233.5 M
164.833 230.21 L
S
GR
GS
[1.00046 0 0 1 0 0] CT
0.149 GC
2 setlinecap
1 LJ
0.5 LW
N
274.667 233.5 M
274.667 230.21 L
S
GR
GS
[1.00046 0 0 1 0 0] CT
0.149 GC
2 setlinecap
1 LJ
0.5 LW
N
384.5 233.5 M
384.5 230.21 L
S
GR
GS
[1.00046 0 0 1 0 0] CT
0.149 GC
2 setlinecap
1 LJ
0.5 LW
N
55 48.5 M
55 51.79 L
S
GR
GS
[1.00046 0 0 1 0 0] CT
0.149 GC
2 setlinecap
1 LJ
0.5 LW
N
164.833 48.5 M
164.833 51.79 L
S
GR
GS
[1.00046 0 0 1 0 0] CT
0.149 GC
2 setlinecap
1 LJ
0.5 LW
N
274.667 48.5 M
274.667 51.79 L
S
GR
GS
[1.00046 0 0 1 0 0] CT
0.149 GC
2 setlinecap
1 LJ
0.5 LW
N
384.5 48.5 M
384.5 51.79 L
S
GR
GS
[1.00046 0 0 1 55.02547 239.09999] CT
0.149 GC
/Helvetica 18 F
GS
[1 0 0 1 0 0] CT
-5.5 18 moveto 
1 -1 scale
(0) t 
GR
GR
GS
[1.00046 0 0 1 164.90967 239.09999] CT
0.149 GC
/Helvetica 18 F
GS
[1 0 0 1 0 0] CT
-5.5 18 moveto 
1 -1 scale
(1) t 
GR
GR
GS
[1.00046 0 0 1 274.79387 239.09999] CT
0.149 GC
/Helvetica 18 F
GS
[1 0 0 1 0 0] CT
-5.5 18 moveto 
1 -1 scale
(2) t 
GR
GR
GS
[1.00046 0 0 1 384.67808 239.09999] CT
0.149 GC
/Helvetica 18 F
GS
[1 0 0 1 0 0] CT
-5.5 18 moveto 
1 -1 scale
(3) t 
GR
GR
GS
[1.00046 0 0 1 219.85193 261.60001] CT
0.149 GC
/Helvetica 18 F
GS
[1 0 0 1 0 0] CT
-97 18 moveto 
1 -1 scale
(Time [s from stim onset]) t 
GR
GR
GS
[1.00046 0 0 1 0 0] CT
0.149 GC
2 setlinecap
1 LJ
0.5 LW
N
55 233.5 M
55 48.5 L
S
GR
GS
[1.00046 0 0 1 0 0] CT
0.149 GC
2 setlinecap
1 LJ
0.5 LW
N
384.5 233.5 M
384.5 48.5 L
S
GR
GS
[1.00046 0 0 1 0 0] CT
0.149 GC
2 setlinecap
1 LJ
0.5 LW
N
55 226.589 M
58.29 226.589 L
S
GR
GS
[1.00046 0 0 1 0 0] CT
0.149 GC
2 setlinecap
1 LJ
0.5 LW
N
55 187.071 M
58.29 187.071 L
S
GR
GS
[1.00046 0 0 1 0 0] CT
0.149 GC
2 setlinecap
1 LJ
0.5 LW
N
55 147.553 M
58.29 147.553 L
S
GR
GS
[1.00046 0 0 1 0 0] CT
0.149 GC
2 setlinecap
1 LJ
0.5 LW
N
55 108.035 M
58.29 108.035 L
S
GR
GS
[1.00046 0 0 1 0 0] CT
0.149 GC
2 setlinecap
1 LJ
0.5 LW
N
55 68.518 M
58.29 68.518 L
S
GR
GS
[1.00046 0 0 1 0 0] CT
0.149 GC
2 setlinecap
1 LJ
0.5 LW
N
384.5 226.589 M
381.21 226.589 L
S
GR
GS
[1.00046 0 0 1 0 0] CT
0.149 GC
2 setlinecap
1 LJ
0.5 LW
N
384.5 187.071 M
381.21 187.071 L
S
GR
GS
[1.00046 0 0 1 0 0] CT
0.149 GC
2 setlinecap
1 LJ
0.5 LW
N
384.5 147.553 M
381.21 147.553 L
S
GR
GS
[1.00046 0 0 1 0 0] CT
0.149 GC
2 setlinecap
1 LJ
0.5 LW
N
384.5 108.035 M
381.21 108.035 L
S
GR
GS
[1.00046 0 0 1 0 0] CT
0.149 GC
2 setlinecap
1 LJ
0.5 LW
N
384.5 68.518 M
381.21 68.518 L
S
GR
GS
[1.00046 0 0 1 49.42288 226.58897] CT
0.149 GC
/Helvetica 18 F
GS
[1 0 0 1 0 0] CT
-18 7 moveto 
1 -1 scale
(-2) t 
GR
GR
GS
[1.00046 0 0 1 49.42288 187.07112] CT
0.149 GC
/Helvetica 18 F
GS
[1 0 0 1 0 0] CT
-11 7 moveto 
1 -1 scale
(0) t 
GR
GR
GS
[1.00046 0 0 1 49.42288 147.55325] CT
0.149 GC
/Helvetica 18 F
GS
[1 0 0 1 0 0] CT
-11 7 moveto 
1 -1 scale
(2) t 
GR
GR
GS
[1.00046 0 0 1 49.42288 108.0354] CT
0.149 GC
/Helvetica 18 F
GS
[1 0 0 1 0 0] CT
-11 7 moveto 
1 -1 scale
(4) t 
GR
GR
GS
[1.00046 0 0 1 49.42288 68.51754] CT
0.149 GC
/Helvetica 18 F
GS
[1 0 0 1 0 0] CT
-11 7 moveto 
1 -1 scale
(6) t 
GR
GR
GS
[0 -1 1.00046 0 29.41362 140.99991] CT
0.149 GC
/Helvetica 18 F
GS
[1 0 0 1 0 0] CT
-18.5 -4 moveto 
1 -1 scale
(BSR) t 
GR
GR
GS
[1.00046 0 0 1 219.85199 46.25] CT
/Helvetica-Bold 18 F
GS
[1 0 0 1 0 0] CT
-95 -26 moveto 
1 -1 scale
(Pupil dilation changes) t 
GR
GR
GS
[1.00046 0 0 1 219.85199 46.25] CT
/Helvetica-Bold 18 F
GS
[1 0 0 1 0 0] CT
-21 -4 moveto 
1 -1 scale
(p = 0) t 
GR
GR
GS
[1.00046 0 0 1 0 0] CT
1 LJ
0.5 LW
N
55.549 182.847 M
56.098 158.64 L
56.647 147.519 L
57.197 174.004 L
57.746 181.2 L
58.295 162.581 L
58.844 130.249 L
59.393 160.707 L
59.943 160.652 L
60.492 170.993 L
61.041 144.349 L
61.59 188.403 L
62.139 174.26 L
62.688 137.702 L
63.237 156.824 L
63.787 124.24 L
64.336 160.893 L
64.885 136.326 L
65.434 155.794 L
65.983 176.655 L
66.533 143.435 L
67.082 165.34 L
67.631 130.134 L
68.18 163.645 L
68.729 154.96 L
69.278 170.613 L
69.827 178.514 L
70.377 178.953 L
70.926 171.315 L
71.475 163.792 L
72.024 181.827 L
72.573 185.596 L
73.122 179.838 L
73.672 190.279 L
74.221 132.642 L
74.77 192.656 L
75.319 186.288 L
75.868 180.474 L
76.417 154.783 L
76.967 154.152 L
77.516 175.676 L
78.065 159.496 L
78.614 185.85 L
79.163 157.442 L
79.713 192.594 L
80.262 165.92 L
80.811 155.825 L
81.36 165.882 L
81.909 179.855 L
82.458 139.753 L
83.007 149.901 L
83.557 190.67 L
84.106 153.568 L
84.655 154.581 L
85.204 181.796 L
85.753 176.649 L
86.302 193.555 L
86.852 197.647 L
87.401 166.229 L
87.95 181.587 L
88.499 204.516 L
89.048 153.356 L
89.597 191.448 L
90.147 132.322 L
90.696 192.221 L
91.245 188.071 L
91.794 150.11 L
92.343 181.353 L
92.893 178.548 L
93.442 160.214 L
93.991 161.221 L
94.54 143.78 L
95.089 181.383 L
95.638 146.607 L
96.188 132.519 L
96.737 123.413 L
97.286 122.174 L
97.835 125.882 L
98.384 133.42 L
98.933 154.234 L
99.482 128.639 L
100.032 115.247 L
100.581 160.121 L
101.13 152.862 L
101.679 129.508 L
102.228 126.722 L
102.778 96.789 L
103.327 105.124 L
103.876 113.028 L
104.425 66.656 L
104.974 68.256 L
105.523 96.212 L
106.073 48.5 L
106.622 88.506 L
107.171 107.791 L
107.72 92.696 L
108.269 105.018 L
108.818 115.126 L
109.368 110.218 L
109.917 84.833 L
110.466 74.917 L
111.015 78.177 L
111.564 68.259 L
112.113 99.831 L
112.662 100.339 L
113.212 66.691 L
113.761 71.327 L
114.31 113.031 L
114.859 102.494 L
115.408 106.986 L
115.958 96.075 L
116.507 93.354 L
117.056 91.758 L
117.605 112.62 L
118.154 126.375 L
118.703 66.172 L
119.252 73.894 L
119.802 85.055 L
120.351 66.663 L
120.9 81.412 L
121.449 111.005 L
121.998 139.601 L
122.548 83.908 L
123.097 156.589 L
123.646 101.296 L
124.195 88.897 L
124.744 113.698 L
125.293 109.403 L
125.842 89.069 L
126.392 88.286 L
126.941 96.549 L
127.49 114.2 L
128.039 94.127 L
128.588 79.44 L
129.137 103.323 L
129.687 89.397 L
130.236 96.505 L
130.785 95.018 L
131.334 98.752 L
131.883 78.372 L
132.432 104.046 L
132.982 126.02 L
133.531 111.481 L
134.08 105.201 L
134.629 63.27 L
135.178 98.801 L
135.728 106.833 L
136.277 76.376 L
136.826 84.019 L
137.375 95.495 L
137.924 104.618 L
138.473 84.306 L
139.022 99.604 L
139.572 107.975 L
140.121 126.822 L
140.67 107.231 L
141.219 126.588 L
141.768 149.177 L
142.318 113.399 L
142.867 129.304 L
143.416 136.139 L
143.965 144.814 L
144.514 110.166 L
145.063 73.871 L
145.613 93.189 L
146.162 111.344 L
146.711 110.755 L
147.26 133.337 L
147.809 69.939 L
148.358 125.187 L
148.908 132.388 L
149.457 120.012 L
150.006 134.861 L
150.555 83.933 L
151.104 85.004 L
151.653 109.56 L
152.202 113.387 L
152.752 125.008 L
153.301 111.173 L
153.85 127.531 L
154.399 128.696 L
154.948 151.272 L
155.497 139.46 L
156.047 167.991 L
156.596 139.743 L
157.145 127.286 L
157.694 126.167 L
158.243 124.694 L
158.792 141.185 L
159.342 125.689 L
159.891 112.968 L
160.44 156.013 L
160.989 150.538 L
161.538 157.148 L
162.088 112.722 L
162.637 124.273 L
163.186 122.574 L
163.735 117.873 L
164.284 150.001 L
164.833 94.164 L
165.382 144.986 L
165.932 138.402 L
166.481 126.28 L
167.03 130.017 L
167.579 125.937 L
168.128 143.052 L
168.677 119.8 L
169.227 153.839 L
169.776 153.576 L
170.325 133.17 L
170.874 144.15 L
171.423 142.493 L
171.973 141.52 L
172.522 180.976 L
173.071 128.514 L
173.62 129.743 L
174.169 161.063 L
174.718 145.588 L
175.268 145.82 L
175.817 156 L
176.366 139.573 L
176.915 141.711 L
177.464 147.445 L
178.013 150.478 L
178.563 166.179 L
179.112 157.736 L
179.661 132.409 L
180.21 167.851 L
180.759 141.794 L
181.308 157.89 L
181.857 155.857 L
182.407 154.938 L
182.956 154.432 L
183.505 192.352 L
184.054 184.113 L
184.603 196.966 L
185.152 198.096 L
185.702 160.681 L
186.251 175.058 L
186.8 178.822 L
187.349 175.534 L
187.898 178.24 L
188.448 180.261 L
188.997 156.861 L
189.546 155.621 L
190.095 162.039 L
190.644 142.64 L
191.193 155.418 L
191.743 157.336 L
192.292 127.658 L
192.841 159.038 L
193.39 173.504 L
193.939 180.413 L
194.488 185.75 L
195.037 187.31 L
195.587 173.369 L
196.136 161.033 L
196.685 201.858 L
197.234 172.349 L
197.783 186.269 L
198.332 162.369 L
198.882 172.57 L
199.431 198.241 L
199.98 175.89 L
200.529 181.892 L
201.078 220.547 L
201.628 171.813 L
202.177 142.758 L
202.726 176.492 L
203.275 184.901 L
203.824 144.075 L
204.373 174.369 L
204.923 200.932 L
205.472 170.884 L
206.021 187.974 L
206.57 154.443 L
207.119 176.12 L
207.668 158.593 L
208.217 164.828 L
208.767 194.699 L
209.316 170.752 L
209.865 182.215 L
210.414 200.941 L
210.963 212.85 L
211.512 220.124 L
212.062 207.166 L
212.611 203.309 L
213.16 192.03 L
213.709 198.301 L
214.258 183.143 L
214.808 193.852 L
215.357 171.616 L
215.906 176.114 L
216.455 162.018 L
217.004 191.721 L
217.553 171.128 L
218.103 158.804 L
218.652 153.402 L
219.201 188.443 L
219.75 173.289 L
220.299 203.812 L
220.848 168.919 L
221.397 153.765 L
221.947 144.08 L
222.496 163.545 L
223.045 202.476 L
223.594 154.936 L
224.143 197.071 L
224.692 178.978 L
225.242 214.055 L
225.791 211.012 L
226.34 172.399 L
226.889 201.73 L
227.438 222.31 L
227.988 161.089 L
228.537 173.031 L
229.086 168.079 L
229.635 166.373 L
230.184 193.7 L
230.733 154.663 L
231.283 160.079 L
231.832 179.714 L
232.381 173.817 L
232.93 172.799 L
233.479 202.494 L
234.028 161.808 L
234.577 196.046 L
235.127 209.024 L
235.676 191.281 L
236.225 167.621 L
236.774 216.738 L
237.323 205.509 L
237.872 183.445 L
238.422 216.675 L
238.971 205.363 L
239.52 194.67 L
240.069 194.391 L
240.618 186.262 L
241.168 207.062 L
241.717 179.319 L
242.266 153.64 L
242.815 207.475 L
243.364 164.16 L
243.913 177.598 L
244.463 187.252 L
245.012 175.059 L
245.561 167.169 L
246.11 195.051 L
246.659 187.453 L
247.208 188.46 L
247.757 151.591 L
248.307 149.163 L
248.856 179.46 L
249.405 160.305 L
249.954 194.641 L
250.503 167.136 L
251.052 198.615 L
251.602 188.908 L
252.151 171.952 L
252.7 168.722 L
253.249 167.874 L
253.798 176.881 L
254.348 163.522 L
254.897 152.294 L
255.446 143.461 L
255.995 130.28 L
256.544 172.044 L
257.093 168.859 L
257.643 161.876 L
258.192 158.705 L
258.741 173.988 L
259.29 195.552 L
259.839 184.192 L
260.388 186.244 L
260.938 180.308 L
261.487 154.528 L
262.036 173.063 L
262.585 160.974 L
263.134 142.701 L
263.683 158.621 L
264.232 183.202 L
264.782 199.007 L
265.331 153.861 L
265.88 183.143 L
266.429 163.191 L
266.978 138.092 L
267.527 175.31 L
268.077 180.223 L
268.626 176.237 L
269.175 166.716 L
269.724 156.131 L
270.273 194.326 L
270.823 189.879 L
271.372 149.604 L
271.921 183.228 L
272.47 143.379 L
273.019 185.189 L
273.568 185.336 L
274.117 202.973 L
274.667 187.603 L
275.216 178.49 L
275.765 171.631 L
276.314 177.584 L
276.863 163.568 L
277.413 159.744 L
277.962 201.28 L
278.511 159.816 L
279.06 168.383 L
279.609 141.414 L
280.158 173.634 L
280.708 150.169 L
281.257 161.681 L
281.806 150.634 L
282.355 185.542 L
282.904 181.484 L
283.453 182.116 L
284.003 178.224 L
284.552 163.286 L
285.101 192.586 L
285.65 176.359 L
286.199 135.854 L
286.748 136.33 L
287.298 151.078 L
287.847 137.276 L
288.396 177.739 L
288.945 163.676 L
289.494 161.596 L
290.043 182.593 L
290.592 199.491 L
291.142 184.655 L
291.691 167.74 L
292.24 161.905 L
292.789 151.133 L
293.338 147.376 L
293.887 185.425 L
294.437 164.337 L
294.986 141.066 L
295.535 172.207 L
296.084 141.867 L
296.633 168.392 L
297.182 189.752 L
297.732 148.343 L
298.281 174.394 L
298.83 162.678 L
299.379 169.724 L
299.928 179.423 L
300.477 154.08 L
301.027 138.261 L
301.576 174.846 L
302.125 192.79 L
302.674 159.792 L
303.223 156.245 L
303.773 199.998 L
304.322 173.895 L
304.871 133.81 L
305.42 179.977 L
305.969 183.542 L
306.518 173.609 L
307.068 184.432 L
307.617 173.9 L
308.166 167.61 L
308.715 131.978 L
309.264 180.501 L
309.813 159.254 L
310.363 157.842 L
310.912 175.995 L
311.461 209.742 L
312.01 174.933 L
312.559 203.599 L
313.108 189.338 L
313.658 180.351 L
314.207 205.133 L
314.756 186.395 L
315.305 191.455 L
315.854 201.256 L
316.403 208.435 L
316.952 215.33 L
317.502 207.649 L
318.051 217.399 L
318.6 165.301 L
319.149 184.209 L
319.698 188.336 L
320.247 159.868 L
320.797 175.829 L
321.346 169.928 L
321.895 169.215 L
322.444 173.122 L
322.993 159.16 L
323.542 156.006 L
324.092 211.209 L
324.641 180.449 L
325.19 188.625 L
325.739 173.84 L
326.288 150.997 L
326.837 187.657 L
327.387 141.822 L
327.936 170.395 L
328.485 193.626 L
329.034 189.351 L
329.583 191.355 L
330.133 183.475 L
330.682 181.124 L
331.231 171.593 L
331.78 196.198 L
332.329 190.952 L
332.878 190.17 L
333.428 194.087 L
333.977 220.839 L
334.526 201.836 L
335.075 171.714 L
335.624 170.043 L
336.173 166.76 L
336.723 158.96 L
337.272 196.91 L
337.821 151.277 L
338.37 163.983 L
338.919 200.729 L
339.468 200.167 L
340.018 197.326 L
340.567 213.635 L
341.116 175.18 L
341.665 214.616 L
342.214 179.772 L
342.763 173.865 L
343.313 197.969 L
343.862 187.22 L
344.411 199.327 L
344.96 160.121 L
345.509 161.59 L
346.058 186.951 L
346.607 162.278 L
347.157 186.876 L
347.706 192.721 L
348.255 202.14 L
348.804 172.959 L
349.353 191.31 L
349.902 208.502 L
350.452 195.002 L
351.001 214.48 L
351.55 170.673 L
352.099 204.743 L
352.648 233.5 L
353.197 181.881 L
353.747 184.342 L
354.296 224.354 L
354.845 180.614 L
355.394 197.976 L
355.943 171.458 L
356.492 210.267 L
357.042 218.751 L
357.591 212.731 L
358.14 187.128 L
358.689 188.583 L
359.238 194.816 L
359.788 173.305 L
360.337 194.197 L
360.886 155.78 L
361.435 131.51 L
361.984 130.973 L
362.533 196.575 L
363.083 181.157 L
363.632 148.122 L
364.181 147.128 L
364.73 170.437 L
365.279 160.075 L
365.828 181.024 L
366.378 176.28 L
366.927 157.18 L
367.476 191.892 L
368.025 179.135 L
368.574 171.272 L
369.123 186.433 L
369.673 157.844 L
370.222 186.981 L
370.771 180.218 L
371.32 153.095 L
371.869 214.905 L
372.418 179.433 L
372.967 149.883 L
373.517 179.966 L
374.066 206.536 L
374.615 177.911 L
375.164 172.26 L
375.713 157.489 L
376.262 164.786 L
376.812 181.945 L
377.361 209.099 L
377.91 206.039 L
378.459 186.506 L
379.008 161.464 L
379.557 158.167 L
380.107 185.523 L
380.656 150.22 L
381.205 160.005 L
381.754 173.739 L
382.303 162.734 L
382.852 168.507 L
383.402 147.222 L
383.951 182.374 L
S
GR
%%Trailer
%%Pages: 1
%%EOF
