%!PS-Adobe-3.0 EPSF-3.0
%%Creator: (MATLAB, The Mathworks, Inc. Version 9.8.0.1323502 \(R2020a\). Operating System: Mac OS X)
%%Title: /Users/kosciessa/Volumes/tardis/LNDG/stateswitch/stsw_eeg_task/tfr_thetarsp/figures/RspRelatedTheta.eps
%%CreationDate: 2022-02-09T11:33:56
%%Pages: (atend)
%%BoundingBox:    58     0  1042   263
%%LanguageLevel: 3
%%EndComments
%%BeginProlog
%%BeginResource: procset (Apache XML Graphics Std ProcSet) 1.2 0
%%Version: 1.2 0
%%Copyright: (Copyright 2001-2003,2010 The Apache Software Foundation. License terms: http://www.apache.org/licenses/LICENSE-2.0)
/bd{bind def}bind def
/ld{load def}bd
/GR/grestore ld
/GS/gsave ld
/RM/rmoveto ld
/C/curveto ld
/t/show ld
/L/lineto ld
/ML/setmiterlimit ld
/CT/concat ld
/f/fill ld
/N/newpath ld
/S/stroke ld
/CC/setcmykcolor ld
/A/ashow ld
/cp/closepath ld
/RC/setrgbcolor ld
/LJ/setlinejoin ld
/GC/setgray ld
/LW/setlinewidth ld
/M/moveto ld
/re {4 2 roll M
1 index 0 rlineto
0 exch rlineto
neg 0 rlineto
cp } bd
/_ctm matrix def
/_tm matrix def
/BT { _ctm currentmatrix pop matrix _tm copy pop 0 0 moveto } bd
/ET { _ctm setmatrix } bd
/iTm { _ctm setmatrix _tm concat } bd
/Tm { _tm astore pop iTm 0 0 moveto } bd
/ux 0.0 def
/uy 0.0 def
/F {
  /Tp exch def
  /Tf exch def
  Tf findfont Tp scalefont setfont
  /cf Tf def  /cs Tp def
} bd
/ULS {currentpoint /uy exch def /ux exch def} bd
/ULE {
  /Tcx currentpoint pop def
  gsave
  newpath
  cf findfont cs scalefont dup
  /FontMatrix get 0 get /Ts exch def /FontInfo get dup
  /UnderlinePosition get Ts mul /To exch def
  /UnderlineThickness get Ts mul /Tt exch def
  ux uy To add moveto  Tcx uy To add lineto
  Tt setlinewidth stroke
  grestore
} bd
/OLE {
  /Tcx currentpoint pop def
  gsave
  newpath
  cf findfont cs scalefont dup
  /FontMatrix get 0 get /Ts exch def /FontInfo get dup
  /UnderlinePosition get Ts mul /To exch def
  /UnderlineThickness get Ts mul /Tt exch def
  ux uy To add cs add moveto Tcx uy To add cs add lineto
  Tt setlinewidth stroke
  grestore
} bd
/SOE {
  /Tcx currentpoint pop def
  gsave
  newpath
  cf findfont cs scalefont dup
  /FontMatrix get 0 get /Ts exch def /FontInfo get dup
  /UnderlinePosition get Ts mul /To exch def
  /UnderlineThickness get Ts mul /Tt exch def
  ux uy To add cs 10 mul 26 idiv add moveto Tcx uy To add cs 10 mul 26 idiv add lineto
  Tt setlinewidth stroke
  grestore
} bd
/QT {
/Y22 exch store
/X22 exch store
/Y21 exch store
/X21 exch store
currentpoint
/Y21 load 2 mul add 3 div exch
/X21 load 2 mul add 3 div exch
/X21 load 2 mul /X22 load add 3 div
/Y21 load 2 mul /Y22 load add 3 div
/X22 load /Y22 load curveto
} bd
/SSPD {
dup length /d exch dict def
{
/v exch def
/k exch def
currentpagedevice k known {
/cpdv currentpagedevice k get def
v cpdv ne {
/upd false def
/nullv v type /nulltype eq def
/nullcpdv cpdv type /nulltype eq def
nullv nullcpdv or
{
/upd true def
} {
/sametype v type cpdv type eq def
sametype {
v type /arraytype eq {
/vlen v length def
/cpdvlen cpdv length def
vlen cpdvlen eq {
0 1 vlen 1 sub {
/i exch def
/obj v i get def
/cpdobj cpdv i get def
obj cpdobj ne {
/upd true def
exit
} if
} for
} {
/upd true def
} ifelse
} {
v type /dicttype eq {
v {
/dv exch def
/dk exch def
/cpddv cpdv dk get def
dv cpddv ne {
/upd true def
exit
} if
} forall
} {
/upd true def
} ifelse
} ifelse
} if
} ifelse
upd true eq {
d k v put
} if
} if
} if
} forall
d length 0 gt {
d setpagedevice
} if
} bd
/RE { % /NewFontName [NewEncodingArray] /FontName RE -
  findfont dup length dict begin
  {
    1 index /FID ne
    {def} {pop pop} ifelse
  } forall
  /Encoding exch def
  /FontName 1 index def
  currentdict definefont pop
  end
} bind def
%%EndResource
%%BeginResource: procset (Apache XML Graphics EPS ProcSet) 1.0 0
%%Version: 1.0 0
%%Copyright: (Copyright 2002-2003 The Apache Software Foundation. License terms: http://www.apache.org/licenses/LICENSE-2.0)
/BeginEPSF { %def
/b4_Inc_state save def         % Save state for cleanup
/dict_count countdictstack def % Count objects on dict stack
/op_count count 1 sub def      % Count objects on operand stack
userdict begin                 % Push userdict on dict stack
/showpage { } def              % Redefine showpage, { } = null proc
0 setgray 0 setlinecap         % Prepare graphics state
1 setlinewidth 0 setlinejoin
10 setmiterlimit [ ] 0 setdash newpath
/languagelevel where           % If level not equal to 1 then
{pop languagelevel             % set strokeadjust and
1 ne                           % overprint to their defaults.
{false setstrokeadjust false setoverprint
} if
} if
} bd
/EndEPSF { %def
count op_count sub {pop} repeat            % Clean up stacks
countdictstack dict_count sub {end} repeat
b4_Inc_state restore
} bd
%%EndResource
%FOPBeginFontDict
%%IncludeResource: font Courier-Oblique
%%IncludeResource: font Courier-BoldOblique
%%IncludeResource: font Courier-Bold
%%IncludeResource: font ZapfDingbats
%%IncludeResource: font Symbol
%%IncludeResource: font Helvetica
%%IncludeResource: font Helvetica-Oblique
%%IncludeResource: font Helvetica-Bold
%%IncludeResource: font Helvetica-BoldOblique
%%IncludeResource: font Times-Roman
%%IncludeResource: font Times-Italic
%%IncludeResource: font Times-Bold
%%IncludeResource: font Times-BoldItalic
%%IncludeResource: font Courier
%FOPEndFontDict
%%BeginResource: encoding WinAnsiEncoding
/WinAnsiEncoding [
/.notdef /.notdef /.notdef /.notdef /.notdef
/.notdef /.notdef /.notdef /.notdef /.notdef
/.notdef /.notdef /.notdef /.notdef /.notdef
/.notdef /.notdef /.notdef /.notdef /.notdef
/.notdef /.notdef /.notdef /.notdef /.notdef
/.notdef /.notdef /.notdef /.notdef /.notdef
/.notdef /.notdef /space /exclam /quotedbl
/numbersign /dollar /percent /ampersand /quotesingle
/parenleft /parenright /asterisk /plus /comma
/hyphen /period /slash /zero /one
/two /three /four /five /six
/seven /eight /nine /colon /semicolon
/less /equal /greater /question /at
/A /B /C /D /E
/F /G /H /I /J
/K /L /M /N /O
/P /Q /R /S /T
/U /V /W /X /Y
/Z /bracketleft /backslash /bracketright /asciicircum
/underscore /quoteleft /a /b /c
/d /e /f /g /h
/i /j /k /l /m
/n /o /p /q /r
/s /t /u /v /w
/x /y /z /braceleft /bar
/braceright /asciitilde /bullet /Euro /bullet
/quotesinglbase /florin /quotedblbase /ellipsis /dagger
/daggerdbl /circumflex /perthousand /Scaron /guilsinglleft
/OE /bullet /Zcaron /bullet /bullet
/quoteleft /quoteright /quotedblleft /quotedblright /bullet
/endash /emdash /asciitilde /trademark /scaron
/guilsinglright /oe /bullet /zcaron /Ydieresis
/space /exclamdown /cent /sterling /currency
/yen /brokenbar /section /dieresis /copyright
/ordfeminine /guillemotleft /logicalnot /sfthyphen /registered
/macron /degree /plusminus /twosuperior /threesuperior
/acute /mu /paragraph /middot /cedilla
/onesuperior /ordmasculine /guillemotright /onequarter /onehalf
/threequarters /questiondown /Agrave /Aacute /Acircumflex
/Atilde /Adieresis /Aring /AE /Ccedilla
/Egrave /Eacute /Ecircumflex /Edieresis /Igrave
/Iacute /Icircumflex /Idieresis /Eth /Ntilde
/Ograve /Oacute /Ocircumflex /Otilde /Odieresis
/multiply /Oslash /Ugrave /Uacute /Ucircumflex
/Udieresis /Yacute /Thorn /germandbls /agrave
/aacute /acircumflex /atilde /adieresis /aring
/ae /ccedilla /egrave /eacute /ecircumflex
/edieresis /igrave /iacute /icircumflex /idieresis
/eth /ntilde /ograve /oacute /ocircumflex
/otilde /odieresis /divide /oslash /ugrave
/uacute /ucircumflex /udieresis /yacute /thorn
/ydieresis
] def
%%EndResource
%FOPBeginFontReencode
/Courier-Oblique findfont
dup length dict begin
  {1 index /FID ne {def} {pop pop} ifelse} forall
  /Encoding WinAnsiEncoding def
  currentdict
end
/Courier-Oblique exch definefont pop
/Courier-BoldOblique findfont
dup length dict begin
  {1 index /FID ne {def} {pop pop} ifelse} forall
  /Encoding WinAnsiEncoding def
  currentdict
end
/Courier-BoldOblique exch definefont pop
/Courier-Bold findfont
dup length dict begin
  {1 index /FID ne {def} {pop pop} ifelse} forall
  /Encoding WinAnsiEncoding def
  currentdict
end
/Courier-Bold exch definefont pop
/Helvetica findfont
dup length dict begin
  {1 index /FID ne {def} {pop pop} ifelse} forall
  /Encoding WinAnsiEncoding def
  currentdict
end
/Helvetica exch definefont pop
/Helvetica-Oblique findfont
dup length dict begin
  {1 index /FID ne {def} {pop pop} ifelse} forall
  /Encoding WinAnsiEncoding def
  currentdict
end
/Helvetica-Oblique exch definefont pop
/Helvetica-Bold findfont
dup length dict begin
  {1 index /FID ne {def} {pop pop} ifelse} forall
  /Encoding WinAnsiEncoding def
  currentdict
end
/Helvetica-Bold exch definefont pop
/Helvetica-BoldOblique findfont
dup length dict begin
  {1 index /FID ne {def} {pop pop} ifelse} forall
  /Encoding WinAnsiEncoding def
  currentdict
end
/Helvetica-BoldOblique exch definefont pop
/Times-Roman findfont
dup length dict begin
  {1 index /FID ne {def} {pop pop} ifelse} forall
  /Encoding WinAnsiEncoding def
  currentdict
end
/Times-Roman exch definefont pop
/Times-Italic findfont
dup length dict begin
  {1 index /FID ne {def} {pop pop} ifelse} forall
  /Encoding WinAnsiEncoding def
  currentdict
end
/Times-Italic exch definefont pop
/Times-Bold findfont
dup length dict begin
  {1 index /FID ne {def} {pop pop} ifelse} forall
  /Encoding WinAnsiEncoding def
  currentdict
end
/Times-Bold exch definefont pop
/Times-BoldItalic findfont
dup length dict begin
  {1 index /FID ne {def} {pop pop} ifelse} forall
  /Encoding WinAnsiEncoding def
  currentdict
end
/Times-BoldItalic exch definefont pop
/Courier findfont
dup length dict begin
  {1 index /FID ne {def} {pop pop} ifelse} forall
  /Encoding WinAnsiEncoding def
  currentdict
end
/Courier exch definefont pop
%FOPEndFontReencode
%%EndProlog
%%Page: 1 1
%%PageBoundingBox: 0 0 1134 283
%%BeginPageSetup
[1 0 0 -1 0 283] CT
%%EndPageSetup
GS
[0.99988 0 0 1 0 0] CT
1 GC
N
0 0 1134 283 re
f
GR
GS
[0.99988 0 0 1 0 0] CT
1 GC
N
0 0 1134 283 re
f
GR
GS
[0.99988 0 0 1 0 0] CT
1 GC
N
147.5 228 M
527 228 L
527 21 L
147.5 21 L
cp
f
GR
GS
[0.99988 0 0 1 0 0] CT
0.149 GC
2 setlinecap
1 LJ
0.5 LW
N
147.5 228 M
527 228 L
S
GR
GS
[0.99988 0 0 1 0 0] CT
0.149 GC
2 setlinecap
1 LJ
0.5 LW
N
147.5 228 M
147.5 224.205 L
S
GR
GS
[0.99988 0 0 1 0 0] CT
0.149 GC
2 setlinecap
1 LJ
0.5 LW
N
223.4 228 M
223.4 224.205 L
S
GR
GS
[0.99988 0 0 1 0 0] CT
0.149 GC
2 setlinecap
1 LJ
0.5 LW
N
299.3 228 M
299.3 224.205 L
S
GR
GS
[0.99988 0 0 1 0 0] CT
0.149 GC
2 setlinecap
1 LJ
0.5 LW
N
375.2 228 M
375.2 224.205 L
S
GR
GS
[0.99988 0 0 1 0 0] CT
0.149 GC
2 setlinecap
1 LJ
0.5 LW
N
451.1 228 M
451.1 224.205 L
S
GR
GS
[0.99988 0 0 1 0 0] CT
0.149 GC
2 setlinecap
1 LJ
0.5 LW
N
527 228 M
527 224.205 L
S
GR
GS
[0.99988 0 0 1 147.48157 234] CT
0.149 GC
/Helvetica 20 F
GS
[1 0 0 1 0 0] CT
-21 20 moveto 
1 -1 scale
(-800) t 
GR
GR
GS
[0.99988 0 0 1 223.37207 234] CT
0.149 GC
/Helvetica 20 F
GS
[1 0 0 1 0 0] CT
-21 20 moveto 
1 -1 scale
(-600) t 
GR
GR
GS
[0.99988 0 0 1 299.26258 234] CT
0.149 GC
/Helvetica 20 F
GS
[1 0 0 1 0 0] CT
-21 20 moveto 
1 -1 scale
(-400) t 
GR
GR
GS
[0.99988 0 0 1 375.15312 234] CT
0.149 GC
/Helvetica 20 F
GS
[1 0 0 1 0 0] CT
-21 20 moveto 
1 -1 scale
(-200) t 
GR
GR
GS
[0.99988 0 0 1 451.04363 234] CT
0.149 GC
/Helvetica 20 F
GS
[1 0 0 1 0 0] CT
-6 20 moveto 
1 -1 scale
(0) t 
GR
GR
GS
[0.99988 0 0 1 526.93414 234] CT
0.149 GC
/Helvetica 20 F
GS
[1 0 0 1 0 0] CT
-17 20 moveto 
1 -1 scale
(200) t 
GR
GR
GS
[0.99988 0 0 1 337.20803 259] CT
0.149 GC
/Helvetica 20 F
GS
[1 0 0 1 0 0] CT
-102.5 20 moveto 
1 -1 scale
(Time \(ms\); resp-locked) t 
GR
GR
GS
[0.99988 0 0 1 0 0] CT
0.149 GC
2 setlinecap
1 LJ
0.5 LW
N
147.5 228 M
147.5 21 L
S
GR
GS
[0.99988 0 0 1 0 0] CT
0.149 GC
2 setlinecap
1 LJ
0.5 LW
N
147.5 228 M
151.295 228 L
S
GR
GS
[0.99988 0 0 1 0 0] CT
0.149 GC
2 setlinecap
1 LJ
0.5 LW
N
147.5 168.857 M
151.295 168.857 L
S
GR
GS
[0.99988 0 0 1 0 0] CT
0.149 GC
2 setlinecap
1 LJ
0.5 LW
N
147.5 109.714 M
151.295 109.714 L
S
GR
GS
[0.99988 0 0 1 0 0] CT
0.149 GC
2 setlinecap
1 LJ
0.5 LW
N
147.5 50.571 M
151.295 50.571 L
S
GR
GS
[0.99988 0 0 1 141.4823 228] CT
0.149 GC
/Helvetica 20 F
GS
[1 0 0 1 0 0] CT
-36 7.5 moveto 
1 -1 scale
(-0.1) t 
GR
GR
GS
[0.99988 0 0 1 141.4823 168.85715] CT
0.149 GC
/Helvetica 20 F
GS
[1 0 0 1 0 0] CT
-12 7.5 moveto 
1 -1 scale
(0) t 
GR
GR
GS
[0.99988 0 0 1 141.4823 109.71429] CT
0.149 GC
/Helvetica 20 F
GS
[1 0 0 1 0 0] CT
-28 7.5 moveto 
1 -1 scale
(0.1) t 
GR
GR
GS
[0.99988 0 0 1 141.4823 50.57143] CT
0.149 GC
/Helvetica 20 F
GS
[1 0 0 1 0 0] CT
-28 7.5 moveto 
1 -1 scale
(0.2) t 
GR
GR
GS
[0 -1 0.99988 0 102.48718 124.4999] CT
0.149 GC
/Helvetica 20 F
GS
[1 0 0 1 0 0] CT
-56 -30 moveto 
1 -1 scale
(Theta power) t 
GR
GR
GS
[0 -1 0.99988 0 102.48718 124.4999] CT
0.149 GC
/Helvetica 20 F
GS
[1 0 0 1 0 0] CT
-59.5 -5 moveto 
1 -1 scale
(\(2-8 Hz\) \(a.u.\)) t 
GR
GR
GS
[0.99988 0 0 1 0 0] CT
0.996 0.98 0.98 RC
N
147.5 181.785 M
147.455 181.79 L
147.455 189.482 L
147.455 189.501 L
147.5 189.495 L
166.475 187.793 L
185.45 191.034 L
204.425 195.227 L
223.4 195.73 L
242.375 194.586 L
261.35 192.843 L
280.325 188.673 L
299.3 181.96 L
318.275 172.779 L
337.25 163.894 L
356.225 152.532 L
375.2 139.188 L
394.175 122.614 L
413.15 105.479 L
432.125 82.714 L
451.1 62.933 L
470.075 54.935 L
489.05 67.176 L
508.025 87.137 L
527 103.557 L
527.045 103.588 L
527.045 103.564 L
527.045 94.152 L
527 94.122 L
508.025 78.136 L
489.05 57.358 L
470.075 44.337 L
451.1 52.313 L
432.125 71.438 L
413.15 94.189 L
394.175 112.019 L
375.2 128.234 L
356.225 141.565 L
337.25 153.246 L
318.275 162.946 L
299.3 172.656 L
280.325 179.382 L
261.35 184.081 L
242.375 186.614 L
223.4 188.175 L
204.425 187.821 L
185.45 182.894 L
166.475 179.905 L
cp
f
GR
GS
[0.99988 0 0 1 0 0] CT
0.98 0.91 0.91 RC
1 LJ
0.5 LW
N
147.455 189.501 M
147.5 189.495 L
166.475 187.793 L
185.45 191.034 L
204.425 195.227 L
223.4 195.73 L
242.375 194.586 L
261.35 192.843 L
280.325 188.673 L
299.3 181.96 L
318.275 172.779 L
337.25 163.894 L
356.225 152.532 L
375.2 139.188 L
394.175 122.614 L
413.15 105.479 L
432.125 82.714 L
451.1 62.933 L
470.075 54.935 L
489.05 67.176 L
508.025 87.137 L
527 103.557 L
527.045 103.588 L
S
GR
GS
[0.99988 0 0 1 0 0] CT
0.98 0.91 0.91 RC
1 LJ
0.5 LW
N
147.455 181.79 M
147.5 181.785 L
166.475 179.905 L
185.45 182.894 L
204.425 187.821 L
223.4 188.175 L
242.375 186.614 L
261.35 184.081 L
280.325 179.382 L
299.3 172.656 L
318.275 162.946 L
337.25 153.246 L
356.225 141.565 L
375.2 128.234 L
394.175 112.019 L
413.15 94.189 L
432.125 71.438 L
451.1 52.313 L
470.075 44.337 L
489.05 57.358 L
508.025 78.136 L
527 94.122 L
527.045 94.152 L
S
GR
GS
[0.99988 0 0 1 0 0] CT
0.961 0.8 0.8 RC
1 LJ
2 LW
N
147.455 185.646 M
147.5 185.64 L
166.475 183.849 L
185.45 186.964 L
204.425 191.524 L
223.4 191.952 L
242.375 190.6 L
261.35 188.462 L
280.325 184.027 L
299.3 177.308 L
318.275 167.863 L
337.25 158.57 L
356.225 147.049 L
375.2 133.711 L
394.175 117.316 L
413.15 99.834 L
432.125 77.076 L
451.1 57.623 L
470.075 49.636 L
489.05 62.267 L
508.025 82.637 L
527 98.839 L
527.045 98.87 L
S
GR
GS
[0.99988 0 0 1 0 0] CT
0.99 0.959 0.959 RC
N
147.5 188.111 M
166.475 186.464 L
185.45 181.411 L
204.425 175.496 L
223.4 171.164 L
242.375 166.344 L
261.35 163.61 L
280.325 153.525 L
299.3 142.461 L
318.275 127.149 L
337.25 110.82 L
356.225 92.773 L
375.2 81.031 L
394.175 73.015 L
413.15 64.581 L
432.125 55.949 L
451.1 47.798 L
470.075 50.339 L
489.05 70.843 L
508.025 93.85 L
527 106.96 L
527.045 106.976 L
527.045 106.957 L
527.045 98.758 L
527 98.74 L
508.025 85.531 L
489.05 63.375 L
470.075 42.912 L
451.1 39.375 L
432.125 46.822 L
413.15 54.807 L
394.175 62.702 L
375.2 71.074 L
356.225 83.411 L
337.25 101.442 L
318.275 117.935 L
299.3 133.711 L
280.325 144.335 L
261.35 154.292 L
242.375 156.75 L
223.4 161.452 L
204.425 165.574 L
185.45 171.783 L
166.475 177.556 L
147.5 179.866 L
147.455 179.871 L
147.455 188.096 L
147.455 188.117 L
cp
f
GR
GS
[0.99988 0 0 1 0 0] CT
0.957 0.82 0.82 RC
1 LJ
0.5 LW
N
147.455 188.117 M
147.5 188.111 L
166.475 186.464 L
185.45 181.411 L
204.425 175.496 L
223.4 171.164 L
242.375 166.344 L
261.35 163.61 L
280.325 153.525 L
299.3 142.461 L
318.275 127.149 L
337.25 110.82 L
356.225 92.773 L
375.2 81.031 L
394.175 73.015 L
413.15 64.581 L
432.125 55.949 L
451.1 47.798 L
470.075 50.339 L
489.05 70.843 L
508.025 93.85 L
527 106.96 L
527.045 106.976 L
S
GR
GS
[0.99988 0 0 1 0 0] CT
0.957 0.82 0.82 RC
1 LJ
0.5 LW
N
147.455 179.871 M
147.5 179.866 L
166.475 177.556 L
185.45 171.783 L
204.425 165.574 L
223.4 161.452 L
242.375 156.75 L
261.35 154.292 L
280.325 144.335 L
299.3 133.711 L
318.275 117.935 L
337.25 101.442 L
356.225 83.411 L
375.2 71.074 L
394.175 62.702 L
413.15 54.807 L
432.125 46.822 L
451.1 39.375 L
470.075 42.912 L
489.05 63.375 L
508.025 85.531 L
527 98.74 L
527.045 98.758 L
S
GR
GS
[0.99988 0 0 1 0 0] CT
0.898 0.6 0.6 RC
1 LJ
2 LW
N
147.455 183.994 M
147.5 183.988 L
166.475 182.01 L
185.45 176.597 L
204.425 170.535 L
223.4 166.308 L
242.375 161.547 L
261.35 158.951 L
280.325 148.93 L
299.3 138.086 L
318.275 122.542 L
337.25 106.131 L
356.225 88.092 L
375.2 76.052 L
394.175 67.858 L
413.15 59.694 L
432.125 51.385 L
451.1 43.587 L
470.075 46.626 L
489.05 67.109 L
508.025 89.69 L
527 102.85 L
527.045 102.867 L
S
GR
GS
[0.99988 0 0 1 0 0] CT
0.98 0.939 0.939 RC
N
147.455 180.709 M
147.455 180.726 L
147.5 180.723 L
166.475 178.018 L
185.45 172.476 L
204.425 167.317 L
223.4 162.636 L
242.375 153.679 L
261.35 145.704 L
280.325 138.595 L
299.3 131.184 L
318.275 122.11 L
337.25 113.29 L
356.225 104.406 L
375.2 92.636 L
394.175 82.227 L
413.15 74.096 L
432.125 67.023 L
451.1 60.167 L
470.075 62.572 L
489.05 81.146 L
508.025 100.544 L
527 113.327 L
527.045 113.356 L
527.045 113.335 L
527.045 104.885 L
527 104.858 L
508.025 91.227 L
489.05 71.66 L
470.075 52.961 L
451.1 50.57 L
432.125 57.096 L
413.15 64.401 L
394.175 72.667 L
375.2 82.968 L
356.225 94.776 L
337.25 104.02 L
318.275 113.264 L
299.3 122.303 L
280.325 129.393 L
261.35 136.687 L
242.375 144.909 L
223.4 154.41 L
204.425 159.382 L
185.45 165.223 L
166.475 170.443 L
147.5 173.023 L
147.455 173.027 L
cp
f
GR
GS
[0.99988 0 0 1 0 0] CT
0.91 0.729 0.729 RC
1 LJ
0.5 LW
N
147.455 180.726 M
147.5 180.723 L
166.475 178.018 L
185.45 172.476 L
204.425 167.317 L
223.4 162.636 L
242.375 153.679 L
261.35 145.704 L
280.325 138.595 L
299.3 131.184 L
318.275 122.11 L
337.25 113.29 L
356.225 104.406 L
375.2 92.636 L
394.175 82.227 L
413.15 74.096 L
432.125 67.023 L
451.1 60.167 L
470.075 62.572 L
489.05 81.146 L
508.025 100.544 L
527 113.327 L
527.045 113.356 L
S
GR
GS
[0.99988 0 0 1 0 0] CT
0.91 0.729 0.729 RC
1 LJ
0.5 LW
N
147.455 173.027 M
147.5 173.023 L
166.475 170.443 L
185.45 165.223 L
204.425 159.382 L
223.4 154.41 L
242.375 144.909 L
261.35 136.687 L
280.325 129.393 L
299.3 122.303 L
318.275 113.264 L
337.25 104.02 L
356.225 94.776 L
375.2 82.968 L
394.175 72.667 L
413.15 64.401 L
432.125 57.096 L
451.1 50.57 L
470.075 52.961 L
489.05 71.66 L
508.025 91.227 L
527 104.858 L
527.045 104.885 L
S
GR
GS
[0.99988 0 0 1 0 0] CT
0.8 0.4 0.4 RC
1 LJ
2 LW
N
147.455 176.877 M
147.5 176.873 L
166.475 174.23 L
185.45 168.85 L
204.425 163.349 L
223.4 158.523 L
242.375 149.294 L
261.35 141.195 L
280.325 133.994 L
299.3 126.744 L
318.275 117.687 L
337.25 108.655 L
356.225 99.591 L
375.2 87.802 L
394.175 77.447 L
413.15 69.248 L
432.125 62.059 L
451.1 55.368 L
470.075 57.766 L
489.05 76.403 L
508.025 95.885 L
527 109.092 L
527.045 109.121 L
S
GR
GS
[0.99988 0 0 1 0 0] CT
0.959 0.918 0.918 RC
N
432.125 67.518 M
413.15 76.604 L
394.175 86.016 L
375.2 92.658 L
356.225 99.268 L
337.25 102.997 L
318.275 110.504 L
299.3 118.737 L
280.325 126.978 L
261.35 137.045 L
242.375 146.804 L
223.4 156.932 L
204.425 164.53 L
185.45 171.778 L
166.475 174.742 L
147.5 180.182 L
147.455 180.191 L
147.455 188.717 L
147.455 188.737 L
147.5 188.728 L
166.475 183.528 L
185.45 180.848 L
204.425 174.242 L
223.4 166.55 L
242.375 156.09 L
261.35 145.573 L
280.325 135.197 L
299.3 126.588 L
318.275 118.205 L
337.25 111.348 L
356.225 107.259 L
375.2 100.177 L
394.175 93.645 L
413.15 84.093 L
432.125 74.952 L
451.1 65.487 L
470.075 66.925 L
489.05 84.147 L
508.025 106.871 L
527 119.827 L
527.045 119.839 L
527.045 119.821 L
527.045 112.173 L
527 112.161 L
508.025 98.801 L
489.05 75.821 L
470.075 58.902 L
451.1 58.338 L
cp
f
GR
GS
[0.99988 0 0 1 0 0] CT
0.82 0.639 0.639 RC
1 LJ
0.5 LW
N
147.455 188.737 M
147.5 188.728 L
166.475 183.528 L
185.45 180.848 L
204.425 174.242 L
223.4 166.55 L
242.375 156.09 L
261.35 145.573 L
280.325 135.197 L
299.3 126.588 L
318.275 118.205 L
337.25 111.348 L
356.225 107.259 L
375.2 100.177 L
394.175 93.645 L
413.15 84.093 L
432.125 74.952 L
451.1 65.487 L
470.075 66.925 L
489.05 84.147 L
508.025 106.871 L
527 119.827 L
527.045 119.839 L
S
GR
GS
[0.99988 0 0 1 0 0] CT
0.82 0.639 0.639 RC
1 LJ
0.5 LW
N
147.455 180.191 M
147.5 180.182 L
166.475 174.742 L
185.45 171.778 L
204.425 164.53 L
223.4 156.932 L
242.375 146.804 L
261.35 137.045 L
280.325 126.978 L
299.3 118.737 L
318.275 110.504 L
337.25 102.997 L
356.225 99.268 L
375.2 92.658 L
394.175 86.016 L
413.15 76.604 L
432.125 67.518 L
451.1 58.338 L
470.075 58.902 L
489.05 75.821 L
508.025 98.801 L
527 112.161 L
527.045 112.173 L
S
GR
GS
[0.99988 0 0 1 0 0] CT
0.6 0.2 0.2 RC
1 LJ
2 LW
N
147.455 184.464 M
147.5 184.455 L
166.475 179.135 L
185.45 176.313 L
204.425 169.386 L
223.4 161.741 L
242.375 151.447 L
261.35 141.309 L
280.325 131.088 L
299.3 122.663 L
318.275 114.355 L
337.25 107.173 L
356.225 103.264 L
375.2 96.418 L
394.175 89.831 L
413.15 80.348 L
432.125 71.235 L
451.1 61.913 L
470.075 62.913 L
489.05 79.984 L
508.025 102.836 L
527 115.994 L
527.045 116.006 L
S
GR
GS
[0.99988 0 0 1 0 0] CT
[8 8] 0 setdash
2 LJ
2 LW
N
451.1 228 M
451.1 21 L
S
GR
GS
[0.99988 0 0 1 192.47594 43] CT
/Helvetica 20 F
GS
[1 0 0 1 0 0] CT
0 7.5 moveto 
1 -1 scale
(Load 1) t 
GR
GR
GS
[0.99988 0 0 1 0 0] CT
0.961 0.8 0.8 RC
1 LJ
2 LW
N
159.5 43 M
189.5 43 L
S
GR
GS
[0.99988 0 0 1 192.47594 67.5] CT
/Helvetica 20 F
GS
[1 0 0 1 0 0] CT
0 7.5 moveto 
1 -1 scale
(Load 4) t 
GR
GR
GS
[0.99988 0 0 1 0 0] CT
0.6 0.2 0.2 RC
1 LJ
2 LW
N
159.5 67.5 M
189.5 67.5 L
S
GR
GS
[0.99988 0 0 1 0 0] CT
1 GC
N
647 228 M
1026.5 228 L
1026.5 21 L
647 21 L
cp
f
GR
GS
[0.99988 0 0 1 0 0] CT
0.149 GC
2 setlinecap
1 LJ
0.5 LW
N
647 228 M
1026.5 228 L
S
GR
GS
[0.99988 0 0 1 0 0] CT
0.149 GC
2 setlinecap
1 LJ
0.5 LW
N
647 228 M
647 224.205 L
S
GR
GS
[0.99988 0 0 1 0 0] CT
0.149 GC
2 setlinecap
1 LJ
0.5 LW
N
722.9 228 M
722.9 224.205 L
S
GR
GS
[0.99988 0 0 1 0 0] CT
0.149 GC
2 setlinecap
1 LJ
0.5 LW
N
798.8 228 M
798.8 224.205 L
S
GR
GS
[0.99988 0 0 1 0 0] CT
0.149 GC
2 setlinecap
1 LJ
0.5 LW
N
874.7 228 M
874.7 224.205 L
S
GR
GS
[0.99988 0 0 1 0 0] CT
0.149 GC
2 setlinecap
1 LJ
0.5 LW
N
950.6 228 M
950.6 224.205 L
S
GR
GS
[0.99988 0 0 1 0 0] CT
0.149 GC
2 setlinecap
1 LJ
0.5 LW
N
1026.5 228 M
1026.5 224.205 L
S
GR
GS
[0.99988 0 0 1 646.91914 234] CT
0.149 GC
/Helvetica 20 F
GS
[1 0 0 1 0 0] CT
-21 20 moveto 
1 -1 scale
(-800) t 
GR
GR
GS
[0.99988 0 0 1 722.80968 234] CT
0.149 GC
/Helvetica 20 F
GS
[1 0 0 1 0 0] CT
-21 20 moveto 
1 -1 scale
(-600) t 
GR
GR
GS
[0.99988 0 0 1 798.70016 234] CT
0.149 GC
/Helvetica 20 F
GS
[1 0 0 1 0 0] CT
-21 20 moveto 
1 -1 scale
(-400) t 
GR
GR
GS
[0.99988 0 0 1 874.5907 234] CT
0.149 GC
/Helvetica 20 F
GS
[1 0 0 1 0 0] CT
-21 20 moveto 
1 -1 scale
(-200) t 
GR
GR
GS
[0.99988 0 0 1 950.48117 234] CT
0.149 GC
/Helvetica 20 F
GS
[1 0 0 1 0 0] CT
-6 20 moveto 
1 -1 scale
(0) t 
GR
GR
GS
[0.99988 0 0 1 1026.37171 234] CT
0.149 GC
/Helvetica 20 F
GS
[1 0 0 1 0 0] CT
-17 20 moveto 
1 -1 scale
(200) t 
GR
GR
GS
[0.99988 0 0 1 836.64561 259] CT
0.149 GC
/Helvetica 20 F
GS
[1 0 0 1 0 0] CT
-102.5 20 moveto 
1 -1 scale
(Time \(ms\); resp-locked) t 
GR
GR
GS
[0.99988 0 0 1 0 0] CT
0.149 GC
2 setlinecap
1 LJ
0.5 LW
N
647 228 M
647 21 L
S
GR
GS
[0.99988 0 0 1 0 0] CT
0.149 GC
2 setlinecap
1 LJ
0.5 LW
N
647 228 M
650.795 228 L
S
GR
GS
[0.99988 0 0 1 0 0] CT
0.149 GC
2 setlinecap
1 LJ
0.5 LW
N
647 168.857 M
650.795 168.857 L
S
GR
GS
[0.99988 0 0 1 0 0] CT
0.149 GC
2 setlinecap
1 LJ
0.5 LW
N
647 109.714 M
650.795 109.714 L
S
GR
GS
[0.99988 0 0 1 0 0] CT
0.149 GC
2 setlinecap
1 LJ
0.5 LW
N
647 50.571 M
650.795 50.571 L
S
GR
GS
[0.99988 0 0 1 640.91989 228] CT
0.149 GC
/Helvetica 20 F
GS
[1 0 0 1 0 0] CT
-36 7.5 moveto 
1 -1 scale
(-0.1) t 
GR
GR
GS
[0.99988 0 0 1 640.91989 168.85715] CT
0.149 GC
/Helvetica 20 F
GS
[1 0 0 1 0 0] CT
-12 7.5 moveto 
1 -1 scale
(0) t 
GR
GR
GS
[0.99988 0 0 1 640.91989 109.71429] CT
0.149 GC
/Helvetica 20 F
GS
[1 0 0 1 0 0] CT
-28 7.5 moveto 
1 -1 scale
(0.1) t 
GR
GR
GS
[0.99988 0 0 1 640.91989 50.57143] CT
0.149 GC
/Helvetica 20 F
GS
[1 0 0 1 0 0] CT
-28 7.5 moveto 
1 -1 scale
(0.2) t 
GR
GR
GS
[0 -1 0.99988 0 601.92476 124.4999] CT
0.149 GC
/Helvetica 20 F
GS
[1 0 0 1 0 0] CT
-56 -30 moveto 
1 -1 scale
(Theta power) t 
GR
GR
GS
[0 -1 0.99988 0 601.92476 124.4999] CT
0.149 GC
/Helvetica 20 F
GS
[1 0 0 1 0 0] CT
-59.5 -5 moveto 
1 -1 scale
(\(2-8 Hz\) \(a.u.\)) t 
GR
GR
GS
[0.99988 0 0 1 0 0] CT
0.996 0.98 0.98 RC
N
703.925 173.822 M
684.95 175.5 L
665.975 175.339 L
647 177.116 L
646.955 177.123 L
646.955 184.66 L
646.955 184.678 L
647 184.671 L
665.975 182.848 L
684.95 183.121 L
703.925 182.004 L
722.9 181.038 L
741.875 176.743 L
760.85 174.055 L
779.825 168.685 L
798.8 165.186 L
817.775 157.928 L
836.75 151.98 L
855.725 144.21 L
874.7 131.463 L
893.675 118.446 L
912.65 100.339 L
931.625 73.737 L
950.6 44.865 L
969.575 29.892 L
988.55 39.102 L
1007.525 69.935 L
1026.5 103.22 L
1026.545 103.28 L
1026.545 103.262 L
1026.545 95.557 L
1026.5 95.496 L
1007.525 61.227 L
988.55 28.965 L
972.8 20.975 L
969.575 20.975 L
967.558 20.975 L
950.6 34.734 L
931.625 63.841 L
912.65 90.102 L
893.675 107.883 L
874.7 121.591 L
855.725 134.871 L
836.75 142.557 L
817.775 148.516 L
798.8 155.861 L
779.825 159.981 L
760.85 165.73 L
741.875 168.443 L
722.9 172.308 L
cp
f
GR
GS
[0.99988 0 0 1 0 0] CT
0.98 0.91 0.91 RC
1 LJ
0.5 LW
N
646.955 184.678 M
647 184.671 L
665.975 182.848 L
684.95 183.121 L
703.925 182.004 L
722.9 181.038 L
741.875 176.743 L
760.85 174.055 L
779.825 168.685 L
798.8 165.186 L
817.775 157.928 L
836.75 151.98 L
855.725 144.21 L
874.7 131.463 L
893.675 118.446 L
912.65 100.339 L
931.625 73.737 L
950.6 44.865 L
969.575 29.892 L
988.55 39.102 L
1007.525 69.935 L
1026.5 103.22 L
1026.545 103.28 L
S
GR
GS
[0.99988 0 0 1 0 0] CT
0.98 0.91 0.91 RC
1 LJ
0.5 LW
N
646.955 177.123 M
647 177.116 L
665.975 175.339 L
684.95 175.5 L
703.925 173.822 L
722.9 172.308 L
741.875 168.443 L
760.85 165.73 L
779.825 159.981 L
798.8 155.861 L
817.775 148.516 L
836.75 142.557 L
855.725 134.871 L
874.7 121.591 L
893.675 107.883 L
912.65 90.102 L
931.625 63.841 L
950.6 34.734 L
967.558 20.975 L
S
GR
GS
[0.99988 0 0 1 0 0] CT
0.98 0.91 0.91 RC
1 LJ
0.5 LW
N
972.8 20.975 M
988.55 28.965 L
1007.525 61.227 L
1026.5 95.496 L
1026.545 95.557 L
S
GR
GS
[0.99988 0 0 1 0 0] CT
0.961 0.8 0.8 RC
1 LJ
2 LW
N
646.955 180.901 M
647 180.893 L
665.975 179.094 L
684.95 179.311 L
703.925 177.913 L
722.9 176.673 L
741.875 172.593 L
760.85 169.893 L
779.825 164.333 L
798.8 160.524 L
817.775 153.222 L
836.75 147.268 L
855.725 139.541 L
874.7 126.527 L
893.675 113.164 L
912.65 95.22 L
931.625 68.789 L
950.6 39.8 L
969.575 24.615 L
988.55 34.033 L
1007.525 65.581 L
1026.5 99.358 L
1026.545 99.419 L
S
GR
GS
[0.99988 0 0 1 0 0] CT
0.99 0.959 0.959 RC
N
646.955 159.024 M
646.955 165.316 L
646.955 165.332 L
647 165.317 L
665.975 162.794 L
684.95 162.766 L
703.925 162.905 L
722.9 160.448 L
741.875 155.548 L
760.85 150.354 L
779.825 143.711 L
798.8 140.504 L
817.775 134.492 L
836.75 127.04 L
855.725 120.728 L
874.7 117.845 L
893.675 113.641 L
912.65 105.2 L
931.625 84.182 L
950.6 54.088 L
969.575 37.748 L
988.55 43.205 L
1007.525 73.479 L
1026.5 108.647 L
1026.545 108.71 L
1026.545 108.693 L
1026.545 101.595 L
1026.5 101.532 L
1007.525 66.087 L
988.55 35.242 L
969.575 29.856 L
950.6 46.405 L
931.625 76.766 L
912.65 97.646 L
893.675 106.061 L
874.7 110.331 L
855.725 113.517 L
836.75 120.292 L
817.775 128.257 L
798.8 133.656 L
779.825 136.572 L
760.85 143.217 L
741.875 148.465 L
722.9 153.263 L
703.925 156.371 L
684.95 156.722 L
665.975 157.011 L
647 159.01 L
cp
f
GR
GS
[0.99988 0 0 1 0 0] CT
0.957 0.82 0.82 RC
1 LJ
0.5 LW
N
646.955 165.332 M
647 165.317 L
665.975 162.794 L
684.95 162.766 L
703.925 162.905 L
722.9 160.448 L
741.875 155.548 L
760.85 150.354 L
779.825 143.711 L
798.8 140.504 L
817.775 134.492 L
836.75 127.04 L
855.725 120.728 L
874.7 117.845 L
893.675 113.641 L
912.65 105.2 L
931.625 84.182 L
950.6 54.088 L
969.575 37.748 L
988.55 43.205 L
1007.525 73.479 L
1026.5 108.647 L
1026.545 108.71 L
S
GR
GS
[0.99988 0 0 1 0 0] CT
0.957 0.82 0.82 RC
1 LJ
0.5 LW
N
646.955 159.024 M
647 159.01 L
665.975 157.011 L
684.95 156.722 L
703.925 156.371 L
722.9 153.263 L
741.875 148.465 L
760.85 143.217 L
779.825 136.572 L
798.8 133.656 L
817.775 128.257 L
836.75 120.292 L
855.725 113.517 L
874.7 110.331 L
893.675 106.061 L
912.65 97.646 L
931.625 76.766 L
950.6 46.405 L
969.575 29.856 L
988.55 35.242 L
1007.525 66.087 L
1026.5 101.532 L
1026.545 101.595 L
S
GR
GS
[0.99988 0 0 1 0 0] CT
0.898 0.6 0.6 RC
1 LJ
2 LW
N
646.955 162.178 M
647 162.164 L
665.975 159.902 L
684.95 159.744 L
703.925 159.638 L
722.9 156.855 L
741.875 152.006 L
760.85 146.786 L
779.825 140.142 L
798.8 137.08 L
817.775 131.375 L
836.75 123.666 L
855.725 117.122 L
874.7 114.088 L
893.675 109.851 L
912.65 101.423 L
931.625 80.474 L
950.6 50.247 L
969.575 33.802 L
988.55 39.224 L
1007.525 69.783 L
1026.5 105.089 L
1026.545 105.152 L
S
GR
GS
[0.99988 0 0 1 0 0] CT
0.98 0.939 0.939 RC
N
665.975 155.137 M
647 157.612 L
646.955 157.623 L
646.955 165.365 L
646.955 165.383 L
647 165.374 L
665.975 163.173 L
684.95 159.283 L
703.925 156.965 L
722.9 154.059 L
741.875 151.202 L
760.85 149.103 L
779.825 145.848 L
798.8 142.229 L
817.775 135.459 L
836.75 132.094 L
855.725 125.795 L
874.7 122.415 L
893.675 117.463 L
912.65 107.852 L
931.625 86.55 L
950.6 55.856 L
969.575 32.28 L
988.55 38.637 L
1007.525 72.058 L
1026.5 111.082 L
1026.545 111.147 L
1026.545 111.129 L
1026.545 103.476 L
1026.5 103.41 L
1007.525 64.089 L
988.55 30.747 L
969.575 25.361 L
950.6 48.552 L
931.625 79.554 L
912.65 100.551 L
893.675 110.016 L
874.7 115.04 L
855.725 118.249 L
836.75 124.809 L
817.775 128.139 L
798.8 134.454 L
779.825 137.787 L
760.85 141.178 L
741.875 143.749 L
722.9 146.783 L
703.925 149.044 L
684.95 151.786 L
cp
f
GR
GS
[0.99988 0 0 1 0 0] CT
0.91 0.729 0.729 RC
1 LJ
0.5 LW
N
646.955 165.383 M
647 165.374 L
665.975 163.173 L
684.95 159.283 L
703.925 156.965 L
722.9 154.059 L
741.875 151.202 L
760.85 149.103 L
779.825 145.848 L
798.8 142.229 L
817.775 135.459 L
836.75 132.094 L
855.725 125.795 L
874.7 122.415 L
893.675 117.463 L
912.65 107.852 L
931.625 86.55 L
950.6 55.856 L
969.575 32.28 L
988.55 38.637 L
1007.525 72.058 L
1026.5 111.082 L
1026.545 111.147 L
S
GR
GS
[0.99988 0 0 1 0 0] CT
0.91 0.729 0.729 RC
1 LJ
0.5 LW
N
646.955 157.623 M
647 157.612 L
665.975 155.137 L
684.95 151.786 L
703.925 149.044 L
722.9 146.783 L
741.875 143.749 L
760.85 141.178 L
779.825 137.787 L
798.8 134.454 L
817.775 128.139 L
836.75 124.809 L
855.725 118.249 L
874.7 115.04 L
893.675 110.016 L
912.65 100.551 L
931.625 79.554 L
950.6 48.552 L
969.575 25.361 L
988.55 30.747 L
1007.525 64.089 L
1026.5 103.41 L
1026.545 103.476 L
S
GR
GS
[0.99988 0 0 1 0 0] CT
0.8 0.4 0.4 RC
1 LJ
2 LW
N
646.955 161.503 M
647 161.493 L
665.975 159.155 L
684.95 155.535 L
703.925 153.005 L
722.9 150.421 L
741.875 147.476 L
760.85 145.141 L
779.825 141.817 L
798.8 138.341 L
817.775 131.799 L
836.75 128.452 L
855.725 122.022 L
874.7 118.728 L
893.675 113.739 L
912.65 104.202 L
931.625 83.052 L
950.6 52.204 L
969.575 28.82 L
988.55 34.692 L
1007.525 68.074 L
1026.5 107.246 L
1026.545 107.311 L
S
GR
GS
[0.99988 0 0 1 0 0] CT
0.959 0.918 0.918 RC
N
665.975 161.367 M
647 165.617 L
646.955 165.621 L
646.955 172.329 L
646.955 172.345 L
647 172.341 L
665.975 168.166 L
684.95 166.87 L
703.925 164.682 L
722.9 160.013 L
741.875 155.275 L
760.85 149.769 L
779.825 143.151 L
798.8 138.162 L
817.775 133.662 L
836.75 132.713 L
855.725 128.045 L
874.7 122.932 L
893.675 114.541 L
912.65 104.457 L
931.625 87.268 L
950.6 57.941 L
969.575 37.101 L
988.55 43.523 L
1007.525 76.556 L
1026.5 115.683 L
1026.545 115.744 L
1026.545 115.725 L
1026.545 107.701 L
1026.5 107.64 L
1007.525 68.791 L
988.55 35.585 L
969.575 29.718 L
950.6 50.062 L
931.625 79.542 L
912.65 97.279 L
893.675 106.856 L
874.7 115.234 L
855.725 120.271 L
836.75 125.693 L
817.775 126.316 L
798.8 130.214 L
779.825 135.082 L
760.85 141.965 L
741.875 148.273 L
722.9 153.398 L
703.925 157.527 L
684.95 160.168 L
cp
f
GR
GS
[0.99988 0 0 1 0 0] CT
0.82 0.639 0.639 RC
1 LJ
0.5 LW
N
646.955 172.345 M
647 172.341 L
665.975 168.166 L
684.95 166.87 L
703.925 164.682 L
722.9 160.013 L
741.875 155.275 L
760.85 149.769 L
779.825 143.151 L
798.8 138.162 L
817.775 133.662 L
836.75 132.713 L
855.725 128.045 L
874.7 122.932 L
893.675 114.541 L
912.65 104.457 L
931.625 87.268 L
950.6 57.941 L
969.575 37.101 L
988.55 43.523 L
1007.525 76.556 L
1026.5 115.683 L
1026.545 115.744 L
S
GR
GS
[0.99988 0 0 1 0 0] CT
0.82 0.639 0.639 RC
1 LJ
0.5 LW
N
646.955 165.621 M
647 165.617 L
665.975 161.367 L
684.95 160.168 L
703.925 157.527 L
722.9 153.398 L
741.875 148.273 L
760.85 141.965 L
779.825 135.082 L
798.8 130.214 L
817.775 126.316 L
836.75 125.693 L
855.725 120.271 L
874.7 115.234 L
893.675 106.856 L
912.65 97.279 L
931.625 79.542 L
950.6 50.062 L
969.575 29.718 L
988.55 35.585 L
1007.525 68.791 L
1026.5 107.64 L
1026.545 107.701 L
S
GR
GS
[0.99988 0 0 1 0 0] CT
0.6 0.2 0.2 RC
1 LJ
2 LW
N
646.955 168.983 M
647 168.979 L
665.975 164.767 L
684.95 163.519 L
703.925 161.105 L
722.9 156.705 L
741.875 151.774 L
760.85 145.867 L
779.825 139.116 L
798.8 134.188 L
817.775 129.989 L
836.75 129.203 L
855.725 124.158 L
874.7 119.083 L
893.675 110.699 L
912.65 100.868 L
931.625 83.405 L
950.6 54.001 L
969.575 33.41 L
988.55 39.554 L
1007.525 72.674 L
1026.5 111.661 L
1026.545 111.723 L
S
GR
GS
[0.99988 0 0 1 0 0] CT
[8 8] 0 setdash
2 LJ
2 LW
N
950.6 228 M
950.6 21 L
S
GR
GS
[0.99988 0 0 1 691.91352 43] CT
/Helvetica 20 F
GS
[1 0 0 1 0 0] CT
0 7.5 moveto 
1 -1 scale
(Load 1) t 
GR
GR
GS
[0.99988 0 0 1 0 0] CT
0.961 0.8 0.8 RC
1 LJ
2 LW
N
659 43 M
689 43 L
S
GR
GS
[0.99988 0 0 1 691.91352 67.5] CT
/Helvetica 20 F
GS
[1 0 0 1 0 0] CT
0 7.5 moveto 
1 -1 scale
(Load 4) t 
GR
GR
GS
[0.99988 0 0 1 0 0] CT
0.6 0.2 0.2 RC
1 LJ
2 LW
N
659 67.5 M
689 67.5 L
S
GR
%%Trailer
%%Pages: 1
%%EOF
