%!PS-Adobe-3.0 EPSF-3.0
%%Creator: (MATLAB, The Mathworks, Inc. Version 9.8.0.1323502 \(R2020a\). Operating System: Mac OS X)
%%Title: /Users/kosciessa/Volumes/tardis/LNDG/stateswitch/stsw_eeg_task/tfr_thetarsp/figures/ProbeRelatedTheta.eps
%%CreationDate: 2022-02-09T11:33:17
%%Pages: (atend)
%%BoundingBox:    57     0  1031   263
%%LanguageLevel: 3
%%EndComments
%%BeginProlog
%%BeginResource: procset (Apache XML Graphics Std ProcSet) 1.2 0
%%Version: 1.2 0
%%Copyright: (Copyright 2001-2003,2010 The Apache Software Foundation. License terms: http://www.apache.org/licenses/LICENSE-2.0)
/bd{bind def}bind def
/ld{load def}bd
/GR/grestore ld
/GS/gsave ld
/RM/rmoveto ld
/C/curveto ld
/t/show ld
/L/lineto ld
/ML/setmiterlimit ld
/CT/concat ld
/f/fill ld
/N/newpath ld
/S/stroke ld
/CC/setcmykcolor ld
/A/ashow ld
/cp/closepath ld
/RC/setrgbcolor ld
/LJ/setlinejoin ld
/GC/setgray ld
/LW/setlinewidth ld
/M/moveto ld
/re {4 2 roll M
1 index 0 rlineto
0 exch rlineto
neg 0 rlineto
cp } bd
/_ctm matrix def
/_tm matrix def
/BT { _ctm currentmatrix pop matrix _tm copy pop 0 0 moveto } bd
/ET { _ctm setmatrix } bd
/iTm { _ctm setmatrix _tm concat } bd
/Tm { _tm astore pop iTm 0 0 moveto } bd
/ux 0.0 def
/uy 0.0 def
/F {
  /Tp exch def
  /Tf exch def
  Tf findfont Tp scalefont setfont
  /cf Tf def  /cs Tp def
} bd
/ULS {currentpoint /uy exch def /ux exch def} bd
/ULE {
  /Tcx currentpoint pop def
  gsave
  newpath
  cf findfont cs scalefont dup
  /FontMatrix get 0 get /Ts exch def /FontInfo get dup
  /UnderlinePosition get Ts mul /To exch def
  /UnderlineThickness get Ts mul /Tt exch def
  ux uy To add moveto  Tcx uy To add lineto
  Tt setlinewidth stroke
  grestore
} bd
/OLE {
  /Tcx currentpoint pop def
  gsave
  newpath
  cf findfont cs scalefont dup
  /FontMatrix get 0 get /Ts exch def /FontInfo get dup
  /UnderlinePosition get Ts mul /To exch def
  /UnderlineThickness get Ts mul /Tt exch def
  ux uy To add cs add moveto Tcx uy To add cs add lineto
  Tt setlinewidth stroke
  grestore
} bd
/SOE {
  /Tcx currentpoint pop def
  gsave
  newpath
  cf findfont cs scalefont dup
  /FontMatrix get 0 get /Ts exch def /FontInfo get dup
  /UnderlinePosition get Ts mul /To exch def
  /UnderlineThickness get Ts mul /Tt exch def
  ux uy To add cs 10 mul 26 idiv add moveto Tcx uy To add cs 10 mul 26 idiv add lineto
  Tt setlinewidth stroke
  grestore
} bd
/QT {
/Y22 exch store
/X22 exch store
/Y21 exch store
/X21 exch store
currentpoint
/Y21 load 2 mul add 3 div exch
/X21 load 2 mul add 3 div exch
/X21 load 2 mul /X22 load add 3 div
/Y21 load 2 mul /Y22 load add 3 div
/X22 load /Y22 load curveto
} bd
/SSPD {
dup length /d exch dict def
{
/v exch def
/k exch def
currentpagedevice k known {
/cpdv currentpagedevice k get def
v cpdv ne {
/upd false def
/nullv v type /nulltype eq def
/nullcpdv cpdv type /nulltype eq def
nullv nullcpdv or
{
/upd true def
} {
/sametype v type cpdv type eq def
sametype {
v type /arraytype eq {
/vlen v length def
/cpdvlen cpdv length def
vlen cpdvlen eq {
0 1 vlen 1 sub {
/i exch def
/obj v i get def
/cpdobj cpdv i get def
obj cpdobj ne {
/upd true def
exit
} if
} for
} {
/upd true def
} ifelse
} {
v type /dicttype eq {
v {
/dv exch def
/dk exch def
/cpddv cpdv dk get def
dv cpddv ne {
/upd true def
exit
} if
} forall
} {
/upd true def
} ifelse
} ifelse
} if
} ifelse
upd true eq {
d k v put
} if
} if
} if
} forall
d length 0 gt {
d setpagedevice
} if
} bd
/RE { % /NewFontName [NewEncodingArray] /FontName RE -
  findfont dup length dict begin
  {
    1 index /FID ne
    {def} {pop pop} ifelse
  } forall
  /Encoding exch def
  /FontName 1 index def
  currentdict definefont pop
  end
} bind def
%%EndResource
%%BeginResource: procset (Apache XML Graphics EPS ProcSet) 1.0 0
%%Version: 1.0 0
%%Copyright: (Copyright 2002-2003 The Apache Software Foundation. License terms: http://www.apache.org/licenses/LICENSE-2.0)
/BeginEPSF { %def
/b4_Inc_state save def         % Save state for cleanup
/dict_count countdictstack def % Count objects on dict stack
/op_count count 1 sub def      % Count objects on operand stack
userdict begin                 % Push userdict on dict stack
/showpage { } def              % Redefine showpage, { } = null proc
0 setgray 0 setlinecap         % Prepare graphics state
1 setlinewidth 0 setlinejoin
10 setmiterlimit [ ] 0 setdash newpath
/languagelevel where           % If level not equal to 1 then
{pop languagelevel             % set strokeadjust and
1 ne                           % overprint to their defaults.
{false setstrokeadjust false setoverprint
} if
} if
} bd
/EndEPSF { %def
count op_count sub {pop} repeat            % Clean up stacks
countdictstack dict_count sub {end} repeat
b4_Inc_state restore
} bd
%%EndResource
%FOPBeginFontDict
%%IncludeResource: font Courier-Oblique
%%IncludeResource: font Courier-BoldOblique
%%IncludeResource: font Courier-Bold
%%IncludeResource: font ZapfDingbats
%%IncludeResource: font Symbol
%%IncludeResource: font Helvetica
%%IncludeResource: font Helvetica-Oblique
%%IncludeResource: font Helvetica-Bold
%%IncludeResource: font Helvetica-BoldOblique
%%IncludeResource: font Times-Roman
%%IncludeResource: font Times-Italic
%%IncludeResource: font Times-Bold
%%IncludeResource: font Times-BoldItalic
%%IncludeResource: font Courier
%FOPEndFontDict
%%BeginResource: encoding WinAnsiEncoding
/WinAnsiEncoding [
/.notdef /.notdef /.notdef /.notdef /.notdef
/.notdef /.notdef /.notdef /.notdef /.notdef
/.notdef /.notdef /.notdef /.notdef /.notdef
/.notdef /.notdef /.notdef /.notdef /.notdef
/.notdef /.notdef /.notdef /.notdef /.notdef
/.notdef /.notdef /.notdef /.notdef /.notdef
/.notdef /.notdef /space /exclam /quotedbl
/numbersign /dollar /percent /ampersand /quotesingle
/parenleft /parenright /asterisk /plus /comma
/hyphen /period /slash /zero /one
/two /three /four /five /six
/seven /eight /nine /colon /semicolon
/less /equal /greater /question /at
/A /B /C /D /E
/F /G /H /I /J
/K /L /M /N /O
/P /Q /R /S /T
/U /V /W /X /Y
/Z /bracketleft /backslash /bracketright /asciicircum
/underscore /quoteleft /a /b /c
/d /e /f /g /h
/i /j /k /l /m
/n /o /p /q /r
/s /t /u /v /w
/x /y /z /braceleft /bar
/braceright /asciitilde /bullet /Euro /bullet
/quotesinglbase /florin /quotedblbase /ellipsis /dagger
/daggerdbl /circumflex /perthousand /Scaron /guilsinglleft
/OE /bullet /Zcaron /bullet /bullet
/quoteleft /quoteright /quotedblleft /quotedblright /bullet
/endash /emdash /asciitilde /trademark /scaron
/guilsinglright /oe /bullet /zcaron /Ydieresis
/space /exclamdown /cent /sterling /currency
/yen /brokenbar /section /dieresis /copyright
/ordfeminine /guillemotleft /logicalnot /sfthyphen /registered
/macron /degree /plusminus /twosuperior /threesuperior
/acute /mu /paragraph /middot /cedilla
/onesuperior /ordmasculine /guillemotright /onequarter /onehalf
/threequarters /questiondown /Agrave /Aacute /Acircumflex
/Atilde /Adieresis /Aring /AE /Ccedilla
/Egrave /Eacute /Ecircumflex /Edieresis /Igrave
/Iacute /Icircumflex /Idieresis /Eth /Ntilde
/Ograve /Oacute /Ocircumflex /Otilde /Odieresis
/multiply /Oslash /Ugrave /Uacute /Ucircumflex
/Udieresis /Yacute /Thorn /germandbls /agrave
/aacute /acircumflex /atilde /adieresis /aring
/ae /ccedilla /egrave /eacute /ecircumflex
/edieresis /igrave /iacute /icircumflex /idieresis
/eth /ntilde /ograve /oacute /ocircumflex
/otilde /odieresis /divide /oslash /ugrave
/uacute /ucircumflex /udieresis /yacute /thorn
/ydieresis
] def
%%EndResource
%FOPBeginFontReencode
/Courier-Oblique findfont
dup length dict begin
  {1 index /FID ne {def} {pop pop} ifelse} forall
  /Encoding WinAnsiEncoding def
  currentdict
end
/Courier-Oblique exch definefont pop
/Courier-BoldOblique findfont
dup length dict begin
  {1 index /FID ne {def} {pop pop} ifelse} forall
  /Encoding WinAnsiEncoding def
  currentdict
end
/Courier-BoldOblique exch definefont pop
/Courier-Bold findfont
dup length dict begin
  {1 index /FID ne {def} {pop pop} ifelse} forall
  /Encoding WinAnsiEncoding def
  currentdict
end
/Courier-Bold exch definefont pop
/Helvetica findfont
dup length dict begin
  {1 index /FID ne {def} {pop pop} ifelse} forall
  /Encoding WinAnsiEncoding def
  currentdict
end
/Helvetica exch definefont pop
/Helvetica-Oblique findfont
dup length dict begin
  {1 index /FID ne {def} {pop pop} ifelse} forall
  /Encoding WinAnsiEncoding def
  currentdict
end
/Helvetica-Oblique exch definefont pop
/Helvetica-Bold findfont
dup length dict begin
  {1 index /FID ne {def} {pop pop} ifelse} forall
  /Encoding WinAnsiEncoding def
  currentdict
end
/Helvetica-Bold exch definefont pop
/Helvetica-BoldOblique findfont
dup length dict begin
  {1 index /FID ne {def} {pop pop} ifelse} forall
  /Encoding WinAnsiEncoding def
  currentdict
end
/Helvetica-BoldOblique exch definefont pop
/Times-Roman findfont
dup length dict begin
  {1 index /FID ne {def} {pop pop} ifelse} forall
  /Encoding WinAnsiEncoding def
  currentdict
end
/Times-Roman exch definefont pop
/Times-Italic findfont
dup length dict begin
  {1 index /FID ne {def} {pop pop} ifelse} forall
  /Encoding WinAnsiEncoding def
  currentdict
end
/Times-Italic exch definefont pop
/Times-Bold findfont
dup length dict begin
  {1 index /FID ne {def} {pop pop} ifelse} forall
  /Encoding WinAnsiEncoding def
  currentdict
end
/Times-Bold exch definefont pop
/Times-BoldItalic findfont
dup length dict begin
  {1 index /FID ne {def} {pop pop} ifelse} forall
  /Encoding WinAnsiEncoding def
  currentdict
end
/Times-BoldItalic exch definefont pop
/Courier findfont
dup length dict begin
  {1 index /FID ne {def} {pop pop} ifelse} forall
  /Encoding WinAnsiEncoding def
  currentdict
end
/Courier exch definefont pop
%FOPEndFontReencode
%%EndProlog
%%Page: 1 1
%%PageBoundingBox: 0 0 1134 283
%%BeginPageSetup
[1 0 0 -1 0 283] CT
%%EndPageSetup
GS
[0.99988 0 0 1 0 0] CT
1 GC
N
0 0 1134 283 re
f
GR
GS
[0.99988 0 0 1 0 0] CT
1 GC
N
0 0 1134 283 re
f
GR
GS
[0.99988 0 0 1 0 0] CT
1 GC
N
147.5 228 M
527 228 L
527 21 L
147.5 21 L
cp
f
GR
GS
[0.99988 0 0 1 0 0] CT
0.149 GC
2 setlinecap
1 LJ
0.5 LW
N
147.5 228 M
527 228 L
S
GR
GS
[0.99988 0 0 1 0 0] CT
0.149 GC
2 setlinecap
1 LJ
0.5 LW
N
182 228 M
182 224.205 L
S
GR
GS
[0.99988 0 0 1 0 0] CT
0.149 GC
2 setlinecap
1 LJ
0.5 LW
N
268.25 228 M
268.25 224.205 L
S
GR
GS
[0.99988 0 0 1 0 0] CT
0.149 GC
2 setlinecap
1 LJ
0.5 LW
N
354.5 228 M
354.5 224.205 L
S
GR
GS
[0.99988 0 0 1 0 0] CT
0.149 GC
2 setlinecap
1 LJ
0.5 LW
N
440.75 228 M
440.75 224.205 L
S
GR
GS
[0.99988 0 0 1 0 0] CT
0.149 GC
2 setlinecap
1 LJ
0.5 LW
N
527 228 M
527 224.205 L
S
GR
GS
[0.99988 0 0 1 181.97725 234] CT
0.149 GC
/Helvetica 20 F
GS
[1 0 0 1 0 0] CT
-6 20 moveto 
1 -1 scale
(0) t 
GR
GR
GS
[0.99988 0 0 1 268.21647 234] CT
0.149 GC
/Helvetica 20 F
GS
[1 0 0 1 0 0] CT
-14 20 moveto 
1 -1 scale
(0.5) t 
GR
GR
GS
[0.99988 0 0 1 354.4557 234] CT
0.149 GC
/Helvetica 20 F
GS
[1 0 0 1 0 0] CT
-6 20 moveto 
1 -1 scale
(1) t 
GR
GR
GS
[0.99988 0 0 1 440.69492 234] CT
0.149 GC
/Helvetica 20 F
GS
[1 0 0 1 0 0] CT
-14 20 moveto 
1 -1 scale
(1.5) t 
GR
GR
GS
[0.99988 0 0 1 526.93414 234] CT
0.149 GC
/Helvetica 20 F
GS
[1 0 0 1 0 0] CT
-6 20 moveto 
1 -1 scale
(2) t 
GR
GR
GS
[0.99988 0 0 1 337.20803 259] CT
0.149 GC
/Helvetica 20 F
GS
[1 0 0 1 0 0] CT
-115 20 moveto 
1 -1 scale
(Time from probe onset \(s\)) t 
GR
GR
GS
[0.99988 0 0 1 0 0] CT
0.149 GC
2 setlinecap
1 LJ
0.5 LW
N
147.5 228 M
147.5 21 L
S
GR
GS
[0.99988 0 0 1 0 0] CT
0.149 GC
2 setlinecap
1 LJ
0.5 LW
N
147.5 228 M
151.295 228 L
S
GR
GS
[0.99988 0 0 1 0 0] CT
0.149 GC
2 setlinecap
1 LJ
0.5 LW
N
147.5 163.313 M
151.295 163.313 L
S
GR
GS
[0.99988 0 0 1 0 0] CT
0.149 GC
2 setlinecap
1 LJ
0.5 LW
N
147.5 98.625 M
151.295 98.625 L
S
GR
GS
[0.99988 0 0 1 0 0] CT
0.149 GC
2 setlinecap
1 LJ
0.5 LW
N
147.5 33.937 M
151.295 33.937 L
S
GR
GS
[0.99988 0 0 1 141.48232 228] CT
0.149 GC
/Helvetica 20 F
GS
[1 0 0 1 0 0] CT
-36 7.5 moveto 
1 -1 scale
(-0.1) t 
GR
GR
GS
[0.99988 0 0 1 141.48232 163.3125] CT
0.149 GC
/Helvetica 20 F
GS
[1 0 0 1 0 0] CT
-12 7.5 moveto 
1 -1 scale
(0) t 
GR
GR
GS
[0.99988 0 0 1 141.48232 98.625] CT
0.149 GC
/Helvetica 20 F
GS
[1 0 0 1 0 0] CT
-28 7.5 moveto 
1 -1 scale
(0.1) t 
GR
GR
GS
[0.99988 0 0 1 141.48232 33.9375] CT
0.149 GC
/Helvetica 20 F
GS
[1 0 0 1 0 0] CT
-28 7.5 moveto 
1 -1 scale
(0.2) t 
GR
GR
GS
[0 -1 0.99988 0 102.48719 124.4999] CT
0.149 GC
/Helvetica 20 F
GS
[1 0 0 1 0 0] CT
-94 -30 moveto 
1 -1 scale
(Theta power \(2-8 Hz\)) t 
GR
GR
GS
[0 -1 0.99988 0 102.48719 124.4999] CT
0.149 GC
/Helvetica 20 F
GS
[1 0 0 1 0 0] CT
-76.5 -5 moveto 
1 -1 scale
(\(normalized; a.u.\)) t 
GR
GR
GS
[0.99988 0 0 1 0 0] CT
0.996 0.98 0.98 RC
N
242.375 58.427 M
251 54.71 L
259.625 60.432 L
268.25 71.049 L
276.875 85.712 L
285.5 99.396 L
294.125 113.127 L
302.75 128.672 L
311.375 138.132 L
320 147.665 L
328.625 156.397 L
337.25 164.221 L
345.875 169.179 L
354.5 171.529 L
363.125 175.515 L
371.75 179.102 L
380.375 181.026 L
389 183.114 L
397.625 182.429 L
406.25 179.351 L
414.875 177.247 L
423.5 174.291 L
432.125 173.361 L
440.75 174.597 L
449.375 171.712 L
458 168.666 L
466.625 171.424 L
475.25 178.372 L
483.875 179.493 L
492.5 175.732 L
501.125 172.109 L
509.75 174.553 L
518.375 172.39 L
527 169.722 L
527.045 169.705 L
527.045 161.594 L
527.045 161.547 L
527 161.568 L
518.375 164.194 L
509.75 166.278 L
501.125 163.863 L
492.5 166.324 L
483.875 169.034 L
475.25 168.306 L
466.625 162.499 L
458 160.254 L
449.375 162.746 L
440.75 165.066 L
432.125 163.569 L
423.5 164.735 L
414.875 167.017 L
406.25 169.926 L
397.625 173.321 L
389 173.261 L
380.375 170.907 L
371.75 168.384 L
363.125 163.179 L
354.5 158.595 L
345.875 156.373 L
337.25 152.159 L
328.625 143.862 L
320 134.003 L
311.375 123.606 L
302.75 113.927 L
294.125 99.255 L
285.5 86.853 L
276.875 73.963 L
268.25 59.374 L
259.625 49.215 L
251 44.046 L
242.375 47.379 L
233.75 67.786 L
225.125 96.927 L
216.5 126.53 L
207.875 148.795 L
199.25 162.036 L
190.625 171.257 L
182 177.932 L
173.375 182.292 L
164.75 181.001 L
156.125 183.899 L
147.5 185.242 L
147.455 185.249 L
147.455 192.333 L
147.455 192.374 L
147.5 192.364 L
156.125 191.133 L
164.75 188.819 L
173.375 190.513 L
182 186.616 L
190.625 180.75 L
199.25 172.011 L
207.875 159.205 L
216.5 137.731 L
225.125 108.052 L
233.75 79.158 L
cp
f
GR
GS
[0.99988 0 0 1 0 0] CT
0.98 0.91 0.91 RC
1 LJ
0.5 LW
N
147.455 192.374 M
147.5 192.364 L
156.125 191.133 L
164.75 188.819 L
173.375 190.513 L
182 186.616 L
190.625 180.75 L
199.25 172.011 L
207.875 159.205 L
216.5 137.731 L
225.125 108.052 L
233.75 79.158 L
242.375 58.427 L
251 54.71 L
259.625 60.432 L
268.25 71.049 L
276.875 85.712 L
285.5 99.396 L
294.125 113.127 L
302.75 128.672 L
311.375 138.132 L
320 147.665 L
328.625 156.397 L
337.25 164.221 L
345.875 169.179 L
354.5 171.529 L
363.125 175.515 L
371.75 179.102 L
380.375 181.026 L
389 183.114 L
397.625 182.429 L
406.25 179.351 L
414.875 177.247 L
423.5 174.291 L
432.125 173.361 L
440.75 174.597 L
449.375 171.712 L
458 168.666 L
466.625 171.424 L
475.25 178.372 L
483.875 179.493 L
492.5 175.732 L
501.125 172.109 L
509.75 174.553 L
518.375 172.39 L
527 169.722 L
527.045 169.705 L
S
GR
GS
[0.99988 0 0 1 0 0] CT
0.98 0.91 0.91 RC
1 LJ
0.5 LW
N
147.455 185.249 M
147.5 185.242 L
156.125 183.899 L
164.75 181.001 L
173.375 182.292 L
182 177.932 L
190.625 171.257 L
199.25 162.036 L
207.875 148.795 L
216.5 126.53 L
225.125 96.927 L
233.75 67.786 L
242.375 47.379 L
251 44.046 L
259.625 49.215 L
268.25 59.374 L
276.875 73.963 L
285.5 86.853 L
294.125 99.255 L
302.75 113.927 L
311.375 123.606 L
320 134.003 L
328.625 143.862 L
337.25 152.159 L
345.875 156.373 L
354.5 158.595 L
363.125 163.179 L
371.75 168.384 L
380.375 170.907 L
389 173.261 L
397.625 173.321 L
406.25 169.926 L
414.875 167.017 L
423.5 164.735 L
432.125 163.569 L
440.75 165.066 L
449.375 162.746 L
458 160.254 L
466.625 162.499 L
475.25 168.306 L
483.875 169.034 L
492.5 166.324 L
501.125 163.863 L
509.75 166.278 L
518.375 164.194 L
527 161.568 L
527.045 161.547 L
S
GR
GS
[0.99988 0 0 1 0 0] CT
0.961 0.8 0.8 RC
1 LJ
2 LW
N
147.455 188.811 M
147.5 188.803 L
156.125 187.516 L
164.75 184.91 L
173.375 186.402 L
182 182.274 L
190.625 176.003 L
199.25 167.023 L
207.875 154 L
216.5 132.131 L
225.125 102.49 L
233.75 73.472 L
242.375 52.903 L
251 49.378 L
259.625 54.823 L
268.25 65.211 L
276.875 79.838 L
285.5 93.125 L
294.125 106.191 L
302.75 121.299 L
311.375 130.869 L
320 140.834 L
328.625 150.129 L
337.25 158.19 L
345.875 162.776 L
354.5 165.062 L
363.125 169.347 L
371.75 173.743 L
380.375 175.966 L
389 178.188 L
397.625 177.875 L
406.25 174.639 L
414.875 172.132 L
423.5 169.513 L
432.125 168.465 L
440.75 169.831 L
449.375 167.229 L
458 164.46 L
466.625 166.961 L
475.25 173.339 L
483.875 174.263 L
492.5 171.028 L
501.125 167.986 L
509.75 170.416 L
518.375 168.292 L
527 165.645 L
527.045 165.626 L
S
GR
GS
[0.99988 0 0 1 0 0] CT
0.99 0.959 0.959 RC
N
242.375 78.523 M
251 64.394 L
259.625 51.884 L
268.25 44.344 L
276.875 40.344 L
285.5 43.57 L
294.125 50.025 L
302.75 59.935 L
311.375 72.755 L
320 86.333 L
328.625 98.13 L
337.25 109.547 L
345.875 123.05 L
354.5 131.463 L
363.125 138.749 L
371.75 146.203 L
380.375 153.901 L
389 158.104 L
397.625 163.113 L
406.25 165.956 L
414.875 166.192 L
423.5 164.179 L
432.125 163.378 L
440.75 166.497 L
449.375 169.231 L
458 168.172 L
466.625 166.989 L
475.25 165.794 L
483.875 164.396 L
492.5 166.578 L
501.125 167.651 L
509.75 170.791 L
518.375 171.404 L
527 169.669 L
527.045 169.644 L
527.045 160.231 L
527.045 160.185 L
527 160.207 L
518.375 162.194 L
509.75 162.447 L
501.125 159.699 L
492.5 158.554 L
483.875 155.735 L
475.25 157.101 L
466.625 157.569 L
458 158.737 L
449.375 159.957 L
440.75 157.851 L
432.125 154.181 L
423.5 154.396 L
414.875 156.411 L
406.25 156.724 L
397.625 153.098 L
389 147.249 L
380.375 143.138 L
371.75 136.772 L
363.125 129.409 L
354.5 121.774 L
345.875 113.18 L
337.25 100.358 L
328.625 88.984 L
320 76.402 L
311.375 61.824 L
302.75 49.099 L
294.125 39.874 L
285.5 33.582 L
276.875 30.535 L
268.25 34.931 L
259.625 42.758 L
251 55.968 L
242.375 70.828 L
233.75 93.803 L
225.125 123.963 L
216.5 150.724 L
207.875 168.136 L
199.25 175.946 L
190.625 182.562 L
182 184.013 L
173.375 184.636 L
164.75 187.552 L
156.125 187.876 L
147.5 184.896 L
147.455 184.894 L
147.455 184.937 L
147.455 192.739 L
147.5 192.739 L
156.125 195.877 L
164.75 195.732 L
173.375 193.593 L
182 193.849 L
190.625 192.829 L
199.25 186.243 L
207.875 177.489 L
216.5 159.633 L
225.125 132.281 L
233.75 101.619 L
cp
f
GR
GS
[0.99988 0 0 1 0 0] CT
0.957 0.82 0.82 RC
1 LJ
0.5 LW
N
147.455 192.739 M
147.5 192.739 L
156.125 195.877 L
164.75 195.732 L
173.375 193.593 L
182 193.849 L
190.625 192.829 L
199.25 186.243 L
207.875 177.489 L
216.5 159.633 L
225.125 132.281 L
233.75 101.619 L
242.375 78.523 L
251 64.394 L
259.625 51.884 L
268.25 44.344 L
276.875 40.344 L
285.5 43.57 L
294.125 50.025 L
302.75 59.935 L
311.375 72.755 L
320 86.333 L
328.625 98.13 L
337.25 109.547 L
345.875 123.05 L
354.5 131.463 L
363.125 138.749 L
371.75 146.203 L
380.375 153.901 L
389 158.104 L
397.625 163.113 L
406.25 165.956 L
414.875 166.192 L
423.5 164.179 L
432.125 163.378 L
440.75 166.497 L
449.375 169.231 L
458 168.172 L
466.625 166.989 L
475.25 165.794 L
483.875 164.396 L
492.5 166.578 L
501.125 167.651 L
509.75 170.791 L
518.375 171.404 L
527 169.669 L
527.045 169.644 L
S
GR
GS
[0.99988 0 0 1 0 0] CT
0.957 0.82 0.82 RC
1 LJ
0.5 LW
N
147.455 184.894 M
147.5 184.896 L
156.125 187.876 L
164.75 187.552 L
173.375 184.636 L
182 184.013 L
190.625 182.562 L
199.25 175.946 L
207.875 168.136 L
216.5 150.724 L
225.125 123.963 L
233.75 93.803 L
242.375 70.828 L
251 55.968 L
259.625 42.758 L
268.25 34.931 L
276.875 30.535 L
285.5 33.582 L
294.125 39.874 L
302.75 49.099 L
311.375 61.824 L
320 76.402 L
328.625 88.984 L
337.25 100.358 L
345.875 113.18 L
354.5 121.774 L
363.125 129.409 L
371.75 136.772 L
380.375 143.138 L
389 147.249 L
397.625 153.098 L
406.25 156.724 L
414.875 156.411 L
423.5 154.396 L
432.125 154.181 L
440.75 157.851 L
449.375 159.957 L
458 158.737 L
466.625 157.569 L
475.25 157.101 L
483.875 155.735 L
492.5 158.554 L
501.125 159.699 L
509.75 162.447 L
518.375 162.194 L
527 160.207 L
527.045 160.185 L
S
GR
GS
[0.99988 0 0 1 0 0] CT
0.898 0.6 0.6 RC
1 LJ
2 LW
N
147.455 188.816 M
147.5 188.817 L
156.125 191.877 L
164.75 191.642 L
173.375 189.115 L
182 188.931 L
190.625 187.696 L
199.25 181.095 L
207.875 172.812 L
216.5 155.179 L
225.125 128.122 L
233.75 97.711 L
242.375 74.676 L
251 60.181 L
259.625 47.321 L
268.25 39.638 L
276.875 35.439 L
285.5 38.576 L
294.125 44.95 L
302.75 54.517 L
311.375 67.29 L
320 81.368 L
328.625 93.557 L
337.25 104.952 L
345.875 118.115 L
354.5 126.619 L
363.125 134.079 L
371.75 141.488 L
380.375 148.52 L
389 152.677 L
397.625 158.105 L
406.25 161.34 L
414.875 161.301 L
423.5 159.288 L
432.125 158.779 L
440.75 162.174 L
449.375 164.594 L
458 163.454 L
466.625 162.279 L
475.25 161.448 L
483.875 160.066 L
492.5 162.566 L
501.125 163.675 L
509.75 166.619 L
518.375 166.799 L
527 164.938 L
527.045 164.915 L
S
GR
GS
[0.99988 0 0 1 0 0] CT
0.98 0.939 0.939 RC
N
363.125 123.409 M
354.5 116.714 L
345.875 103.762 L
337.25 86.114 L
328.625 72.822 L
320 65.035 L
311.375 64.059 L
302.75 60.148 L
294.125 58.546 L
285.5 58.933 L
276.875 60.355 L
268.25 59.262 L
259.625 64.074 L
251 70.934 L
242.375 82.432 L
233.75 104.086 L
225.125 133.419 L
216.5 160.874 L
207.875 178.385 L
199.25 183.944 L
190.625 184.75 L
182 186.231 L
173.375 188.196 L
164.75 189.621 L
156.125 187.534 L
147.5 186.709 L
147.455 186.697 L
147.455 186.737 L
147.455 194.131 L
147.5 194.142 L
156.125 194.875 L
164.75 197.285 L
173.375 196.087 L
182 194.873 L
190.625 193.241 L
199.25 191.51 L
207.875 185.873 L
216.5 169.804 L
225.125 143.259 L
233.75 114.229 L
242.375 92.694 L
251 81.167 L
259.625 74.836 L
268.25 69.894 L
276.875 69.966 L
285.5 68.898 L
294.125 69.893 L
302.75 72.274 L
311.375 76.465 L
320 76.495 L
328.625 84.212 L
337.25 97.401 L
345.875 115.129 L
354.5 127.035 L
363.125 133.066 L
371.75 138.703 L
380.375 145.303 L
389 150.957 L
397.625 153.692 L
406.25 158.17 L
414.875 160.185 L
423.5 164.693 L
432.125 167.455 L
440.75 166.933 L
449.375 167.816 L
458 167.63 L
466.625 167.586 L
475.25 169.376 L
483.875 170.462 L
492.5 172.134 L
501.125 168.776 L
509.75 162.123 L
518.375 161.294 L
527 161.344 L
527.045 161.355 L
527.045 161.312 L
527.045 153.087 L
527 153.075 L
518.375 152.707 L
509.75 153.461 L
501.125 159.56 L
492.5 163.007 L
483.875 160.712 L
475.25 159.837 L
466.625 158.645 L
458 157.682 L
449.375 157.121 L
440.75 156.896 L
432.125 158.058 L
423.5 155.455 L
414.875 150.272 L
406.25 147.992 L
397.625 143.692 L
389 140.995 L
380.375 134.955 L
371.75 129.012 L
cp
f
GR
GS
[0.99988 0 0 1 0 0] CT
0.91 0.729 0.729 RC
1 LJ
0.5 LW
N
147.455 194.131 M
147.5 194.142 L
156.125 194.875 L
164.75 197.285 L
173.375 196.087 L
182 194.873 L
190.625 193.241 L
199.25 191.51 L
207.875 185.873 L
216.5 169.804 L
225.125 143.259 L
233.75 114.229 L
242.375 92.694 L
251 81.167 L
259.625 74.836 L
268.25 69.894 L
276.875 69.966 L
285.5 68.898 L
294.125 69.893 L
302.75 72.274 L
311.375 76.465 L
320 76.495 L
328.625 84.212 L
337.25 97.401 L
345.875 115.129 L
354.5 127.035 L
363.125 133.066 L
371.75 138.703 L
380.375 145.303 L
389 150.957 L
397.625 153.692 L
406.25 158.17 L
414.875 160.185 L
423.5 164.693 L
432.125 167.455 L
440.75 166.933 L
449.375 167.816 L
458 167.63 L
466.625 167.586 L
475.25 169.376 L
483.875 170.462 L
492.5 172.134 L
501.125 168.776 L
509.75 162.123 L
518.375 161.294 L
527 161.344 L
527.045 161.355 L
S
GR
GS
[0.99988 0 0 1 0 0] CT
0.91 0.729 0.729 RC
1 LJ
0.5 LW
N
147.455 186.697 M
147.5 186.709 L
156.125 187.534 L
164.75 189.621 L
173.375 188.196 L
182 186.231 L
190.625 184.75 L
199.25 183.944 L
207.875 178.385 L
216.5 160.874 L
225.125 133.419 L
233.75 104.086 L
242.375 82.432 L
251 70.934 L
259.625 64.074 L
268.25 59.262 L
276.875 60.355 L
285.5 58.933 L
294.125 58.546 L
302.75 60.148 L
311.375 64.059 L
320 65.035 L
328.625 72.822 L
337.25 86.114 L
345.875 103.762 L
354.5 116.714 L
363.125 123.409 L
371.75 129.012 L
380.375 134.955 L
389 140.995 L
397.625 143.692 L
406.25 147.992 L
414.875 150.272 L
423.5 155.455 L
432.125 158.058 L
440.75 156.896 L
449.375 157.121 L
458 157.682 L
466.625 158.645 L
475.25 159.837 L
483.875 160.712 L
492.5 163.007 L
501.125 159.56 L
509.75 153.461 L
518.375 152.707 L
527 153.075 L
527.045 153.087 L
S
GR
GS
[0.99988 0 0 1 0 0] CT
0.8 0.4 0.4 RC
1 LJ
2 LW
N
147.455 190.414 M
147.5 190.426 L
156.125 191.204 L
164.75 193.453 L
173.375 192.142 L
182 190.552 L
190.625 188.995 L
199.25 187.727 L
207.875 182.129 L
216.5 165.339 L
225.125 138.339 L
233.75 109.158 L
242.375 87.563 L
251 76.05 L
259.625 69.455 L
268.25 64.578 L
276.875 65.161 L
285.5 63.916 L
294.125 64.22 L
302.75 66.211 L
311.375 70.262 L
320 70.765 L
328.625 78.517 L
337.25 91.757 L
345.875 109.445 L
354.5 121.875 L
363.125 128.237 L
371.75 133.857 L
380.375 140.129 L
389 145.976 L
397.625 148.692 L
406.25 153.081 L
414.875 155.228 L
423.5 160.074 L
432.125 162.756 L
440.75 161.914 L
449.375 162.469 L
458 162.656 L
466.625 163.115 L
475.25 164.606 L
483.875 165.587 L
492.5 167.57 L
501.125 164.168 L
509.75 157.792 L
518.375 157 L
527 157.209 L
527.045 157.221 L
S
GR
GS
[0.99988 0 0 1 0 0] CT
0.959 0.918 0.918 RC
N
233.75 110.983 M
225.125 137.996 L
216.5 163.826 L
207.875 179.947 L
199.25 186.436 L
190.625 193.037 L
182 199.531 L
173.375 202.73 L
164.75 203.815 L
156.125 198.729 L
147.5 196.354 L
147.455 196.356 L
147.455 204.003 L
147.455 204.043 L
147.5 204.041 L
156.125 206.207 L
164.75 211.712 L
173.375 212.329 L
182 209.085 L
190.625 202.063 L
199.25 195.872 L
207.875 188.501 L
216.5 171.228 L
225.125 145.562 L
233.75 119.426 L
242.375 99.593 L
251 88.96 L
259.625 82.866 L
268.25 78.708 L
276.875 76.963 L
285.5 77.317 L
294.125 77.724 L
302.75 78.666 L
311.375 81.917 L
320 85.723 L
328.625 93.029 L
337.25 100.515 L
345.875 111.996 L
354.5 123.543 L
363.125 132.059 L
371.75 138.157 L
380.375 143.298 L
389 146.453 L
397.625 152.36 L
406.25 161.11 L
414.875 169.322 L
423.5 176.079 L
432.125 178.524 L
440.75 173.332 L
449.375 170.907 L
458 171.185 L
466.625 171.301 L
475.25 170.792 L
483.875 169.021 L
492.5 170.902 L
501.125 172.345 L
509.75 171.814 L
518.375 170.158 L
527 167.807 L
527.045 167.77 L
527.045 157.973 L
527.045 157.927 L
527 157.958 L
518.375 160.71 L
509.75 162.236 L
501.125 163.06 L
492.5 162.432 L
483.875 160.951 L
475.25 162.334 L
466.625 162.644 L
458 163.329 L
449.375 162.877 L
440.75 164.916 L
432.125 169.821 L
423.5 166.264 L
414.875 159.216 L
406.25 150.9 L
397.625 141.108 L
389 134.879 L
380.375 132.272 L
371.75 127.844 L
363.125 121.805 L
354.5 113.063 L
345.875 101.904 L
337.25 90.8 L
328.625 83.023 L
320 75.048 L
311.375 70.474 L
302.75 67.07 L
294.125 66.972 L
285.5 67.775 L
276.875 68.467 L
268.25 70.051 L
259.625 74.628 L
251 81.293 L
242.375 91.094 L
cp
f
GR
GS
[0.99988 0 0 1 0 0] CT
0.82 0.639 0.639 RC
1 LJ
0.5 LW
N
147.455 204.043 M
147.5 204.041 L
156.125 206.207 L
164.75 211.712 L
173.375 212.329 L
182 209.085 L
190.625 202.063 L
199.25 195.872 L
207.875 188.501 L
216.5 171.228 L
225.125 145.562 L
233.75 119.426 L
242.375 99.593 L
251 88.96 L
259.625 82.866 L
268.25 78.708 L
276.875 76.963 L
285.5 77.317 L
294.125 77.724 L
302.75 78.666 L
311.375 81.917 L
320 85.723 L
328.625 93.029 L
337.25 100.515 L
345.875 111.996 L
354.5 123.543 L
363.125 132.059 L
371.75 138.157 L
380.375 143.298 L
389 146.453 L
397.625 152.36 L
406.25 161.11 L
414.875 169.322 L
423.5 176.079 L
432.125 178.524 L
440.75 173.332 L
449.375 170.907 L
458 171.185 L
466.625 171.301 L
475.25 170.792 L
483.875 169.021 L
492.5 170.902 L
501.125 172.345 L
509.75 171.814 L
518.375 170.158 L
527 167.807 L
527.045 167.77 L
S
GR
GS
[0.99988 0 0 1 0 0] CT
0.82 0.639 0.639 RC
1 LJ
0.5 LW
N
147.455 196.356 M
147.5 196.354 L
156.125 198.729 L
164.75 203.815 L
173.375 202.73 L
182 199.531 L
190.625 193.037 L
199.25 186.436 L
207.875 179.947 L
216.5 163.826 L
225.125 137.996 L
233.75 110.983 L
242.375 91.094 L
251 81.293 L
259.625 74.628 L
268.25 70.051 L
276.875 68.467 L
285.5 67.775 L
294.125 66.972 L
302.75 67.07 L
311.375 70.474 L
320 75.048 L
328.625 83.023 L
337.25 90.8 L
345.875 101.904 L
354.5 113.063 L
363.125 121.805 L
371.75 127.844 L
380.375 132.272 L
389 134.879 L
397.625 141.108 L
406.25 150.9 L
414.875 159.216 L
423.5 166.264 L
432.125 169.821 L
440.75 164.916 L
449.375 162.877 L
458 163.329 L
466.625 162.644 L
475.25 162.334 L
483.875 160.951 L
492.5 162.432 L
501.125 163.06 L
509.75 162.236 L
518.375 160.71 L
527 157.958 L
527.045 157.927 L
S
GR
GS
[0.99988 0 0 1 0 0] CT
0.6 0.2 0.2 RC
1 LJ
2 LW
N
147.455 200.199 M
147.5 200.198 L
156.125 202.468 L
164.75 207.764 L
173.375 207.53 L
182 204.308 L
190.625 197.55 L
199.25 191.154 L
207.875 184.224 L
216.5 167.527 L
225.125 141.779 L
233.75 115.204 L
242.375 95.344 L
251 85.127 L
259.625 78.747 L
268.25 74.379 L
276.875 72.715 L
285.5 72.546 L
294.125 72.348 L
302.75 72.868 L
311.375 76.195 L
320 80.386 L
328.625 88.026 L
337.25 95.657 L
345.875 106.95 L
354.5 118.303 L
363.125 126.932 L
371.75 133.001 L
380.375 137.785 L
389 140.666 L
397.625 146.734 L
406.25 156.005 L
414.875 164.269 L
423.5 171.172 L
432.125 174.173 L
440.75 169.124 L
449.375 166.892 L
458 167.257 L
466.625 166.973 L
475.25 166.563 L
483.875 164.986 L
492.5 166.667 L
501.125 167.702 L
509.75 167.025 L
518.375 165.434 L
527 162.882 L
527.045 162.848 L
S
GR
GS
[0.99988 0 0 1 0 0] CT
[8 8] 0 setdash
2 LJ
2 LW
N
182 228 M
182 20.975 L
S
GR
GS
[0.99988 0 0 1 452.94339 43] CT
/Helvetica 20 F
GS
[1 0 0 1 0 0] CT
0 7.5 moveto 
1 -1 scale
(Load 1) t 
GR
GR
GS
[0.99988 0 0 1 0 0] CT
0.961 0.8 0.8 RC
1 LJ
2 LW
N
420 43 M
450 43 L
S
GR
GS
[0.99988 0 0 1 452.94339 67.5] CT
/Helvetica 20 F
GS
[1 0 0 1 0 0] CT
0 7.5 moveto 
1 -1 scale
(Load 2) t 
GR
GR
GS
[0.99988 0 0 1 0 0] CT
0.898 0.6 0.6 RC
1 LJ
2 LW
N
420 67.5 M
450 67.5 L
S
GR
GS
[0.99988 0 0 1 452.94339 92] CT
/Helvetica 20 F
GS
[1 0 0 1 0 0] CT
0 7.5 moveto 
1 -1 scale
(Load 3) t 
GR
GR
GS
[0.99988 0 0 1 0 0] CT
0.8 0.4 0.4 RC
1 LJ
2 LW
N
420 92 M
450 92 L
S
GR
GS
[0.99988 0 0 1 452.94339 116.5] CT
/Helvetica 20 F
GS
[1 0 0 1 0 0] CT
0 7.5 moveto 
1 -1 scale
(Load 4) t 
GR
GR
GS
[0.99988 0 0 1 0 0] CT
0.6 0.2 0.2 RC
1 LJ
2 LW
N
420 116.5 M
450 116.5 L
S
GR
GS
[0.99988 0 0 1 0 0] CT
1 GC
N
647 228 M
1026.5 228 L
1026.5 21 L
647 21 L
cp
f
GR
GS
[0.99988 0 0 1 0 0] CT
0.149 GC
2 setlinecap
1 LJ
0.5 LW
N
647 228 M
1026.5 228 L
S
GR
GS
[0.99988 0 0 1 0 0] CT
0.149 GC
2 setlinecap
1 LJ
0.5 LW
N
681.5 228 M
681.5 224.205 L
S
GR
GS
[0.99988 0 0 1 0 0] CT
0.149 GC
2 setlinecap
1 LJ
0.5 LW
N
767.75 228 M
767.75 224.205 L
S
GR
GS
[0.99988 0 0 1 0 0] CT
0.149 GC
2 setlinecap
1 LJ
0.5 LW
N
854 228 M
854 224.205 L
S
GR
GS
[0.99988 0 0 1 0 0] CT
0.149 GC
2 setlinecap
1 LJ
0.5 LW
N
940.25 228 M
940.25 224.205 L
S
GR
GS
[0.99988 0 0 1 0 0] CT
0.149 GC
2 setlinecap
1 LJ
0.5 LW
N
1026.5 228 M
1026.5 224.205 L
S
GR
GS
[0.99988 0 0 1 681.41483 234] CT
0.149 GC
/Helvetica 20 F
GS
[1 0 0 1 0 0] CT
-6 20 moveto 
1 -1 scale
(0) t 
GR
GR
GS
[0.99988 0 0 1 767.65405 234] CT
0.149 GC
/Helvetica 20 F
GS
[1 0 0 1 0 0] CT
-14 20 moveto 
1 -1 scale
(0.5) t 
GR
GR
GS
[0.99988 0 0 1 853.89327 234] CT
0.149 GC
/Helvetica 20 F
GS
[1 0 0 1 0 0] CT
-6 20 moveto 
1 -1 scale
(1) t 
GR
GR
GS
[0.99988 0 0 1 940.13249 234] CT
0.149 GC
/Helvetica 20 F
GS
[1 0 0 1 0 0] CT
-14 20 moveto 
1 -1 scale
(1.5) t 
GR
GR
GS
[0.99988 0 0 1 1026.37171 234] CT
0.149 GC
/Helvetica 20 F
GS
[1 0 0 1 0 0] CT
-6 20 moveto 
1 -1 scale
(2) t 
GR
GR
GS
[0.99988 0 0 1 836.64561 259] CT
0.149 GC
/Helvetica 20 F
GS
[1 0 0 1 0 0] CT
-115 20 moveto 
1 -1 scale
(Time from probe onset \(s\)) t 
GR
GR
GS
[0.99988 0 0 1 0 0] CT
0.149 GC
2 setlinecap
1 LJ
0.5 LW
N
647 228 M
647 21 L
S
GR
GS
[0.99988 0 0 1 0 0] CT
0.149 GC
2 setlinecap
1 LJ
0.5 LW
N
647 228 M
650.795 228 L
S
GR
GS
[0.99988 0 0 1 0 0] CT
0.149 GC
2 setlinecap
1 LJ
0.5 LW
N
647 163.313 M
650.795 163.313 L
S
GR
GS
[0.99988 0 0 1 0 0] CT
0.149 GC
2 setlinecap
1 LJ
0.5 LW
N
647 98.625 M
650.795 98.625 L
S
GR
GS
[0.99988 0 0 1 0 0] CT
0.149 GC
2 setlinecap
1 LJ
0.5 LW
N
647 33.937 M
650.795 33.937 L
S
GR
GS
[0.99988 0 0 1 640.91989 228] CT
0.149 GC
/Helvetica 20 F
GS
[1 0 0 1 0 0] CT
-36 7.5 moveto 
1 -1 scale
(-0.1) t 
GR
GR
GS
[0.99988 0 0 1 640.91989 163.3125] CT
0.149 GC
/Helvetica 20 F
GS
[1 0 0 1 0 0] CT
-12 7.5 moveto 
1 -1 scale
(0) t 
GR
GR
GS
[0.99988 0 0 1 640.91989 98.625] CT
0.149 GC
/Helvetica 20 F
GS
[1 0 0 1 0 0] CT
-28 7.5 moveto 
1 -1 scale
(0.1) t 
GR
GR
GS
[0.99988 0 0 1 640.91989 33.9375] CT
0.149 GC
/Helvetica 20 F
GS
[1 0 0 1 0 0] CT
-28 7.5 moveto 
1 -1 scale
(0.2) t 
GR
GR
GS
[0 -1 0.99988 0 601.92476 124.4999] CT
0.149 GC
/Helvetica 20 F
GS
[1 0 0 1 0 0] CT
-94 -30 moveto 
1 -1 scale
(Theta power \(2-8 Hz\)) t 
GR
GR
GS
[0 -1 0.99988 0 601.92476 124.4999] CT
0.149 GC
/Helvetica 20 F
GS
[1 0 0 1 0 0] CT
-76.5 -5 moveto 
1 -1 scale
(\(normalized; a.u.\)) t 
GR
GR
GS
[0.99988 0 0 1 0 0] CT
0.996 0.98 0.98 RC
N
733.25 84.088 M
724.625 115.789 L
716 141.068 L
707.375 156.5 L
698.75 166.949 L
690.125 171.296 L
681.5 175.658 L
672.875 176.998 L
664.25 175.65 L
655.625 173.009 L
647 174.096 L
646.955 174.107 L
646.955 181.975 L
646.955 182.02 L
647 182.006 L
655.625 180.653 L
664.25 183.825 L
672.875 185.511 L
681.5 184.359 L
690.125 180.088 L
698.75 175.105 L
707.375 163.455 L
716 148.137 L
724.625 123.27 L
733.25 93.22 L
741.875 71.574 L
750.5 59.281 L
759.125 58.062 L
767.75 64.591 L
776.375 72.557 L
785 79.905 L
793.625 85.603 L
802.25 97.103 L
810.875 113.03 L
819.5 126.632 L
828.125 139.628 L
836.75 149.557 L
845.375 159.252 L
854 165.685 L
862.625 171.248 L
871.25 172.755 L
879.875 176.139 L
888.5 173.815 L
897.125 175.14 L
905.75 176.163 L
914.375 175.971 L
923 175.078 L
931.625 169.748 L
940.25 168.325 L
948.875 169.768 L
957.5 172.027 L
966.125 170.206 L
974.75 165.982 L
983.375 167.31 L
992 168.873 L
1000.625 167.769 L
1009.25 166.007 L
1017.875 162.912 L
1026.5 159.402 L
1026.545 159.395 L
1026.545 152.181 L
1026.545 152.138 L
1026.5 152.149 L
1017.875 154.743 L
1009.25 156.756 L
1000.625 159.026 L
992 161.375 L
983.375 159.452 L
974.75 158.022 L
966.125 161.662 L
957.5 162.667 L
948.875 160.374 L
940.25 159.092 L
931.625 160.854 L
923 165.463 L
914.375 165.305 L
905.75 165.362 L
897.125 163.906 L
888.5 162.687 L
879.875 164.999 L
871.25 161.652 L
862.625 160.158 L
854 154.256 L
845.375 147.806 L
836.75 137.864 L
828.125 128.002 L
819.5 113.919 L
810.875 99.368 L
802.25 83.885 L
793.625 73.589 L
785 68.501 L
776.375 61.253 L
767.75 53.655 L
759.125 47.224 L
750.5 48.704 L
741.875 61.395 L
cp
f
GR
GS
[0.99988 0 0 1 0 0] CT
0.98 0.91 0.91 RC
1 LJ
0.5 LW
N
646.955 182.02 M
647 182.006 L
655.625 180.653 L
664.25 183.825 L
672.875 185.511 L
681.5 184.359 L
690.125 180.088 L
698.75 175.105 L
707.375 163.455 L
716 148.137 L
724.625 123.27 L
733.25 93.22 L
741.875 71.574 L
750.5 59.281 L
759.125 58.062 L
767.75 64.591 L
776.375 72.557 L
785 79.905 L
793.625 85.603 L
802.25 97.103 L
810.875 113.03 L
819.5 126.632 L
828.125 139.628 L
836.75 149.557 L
845.375 159.252 L
854 165.685 L
862.625 171.248 L
871.25 172.755 L
879.875 176.139 L
888.5 173.815 L
897.125 175.14 L
905.75 176.163 L
914.375 175.971 L
923 175.078 L
931.625 169.748 L
940.25 168.325 L
948.875 169.768 L
957.5 172.027 L
966.125 170.206 L
974.75 165.982 L
983.375 167.31 L
992 168.873 L
1000.625 167.769 L
1009.25 166.007 L
1017.875 162.912 L
1026.5 159.402 L
1026.545 159.395 L
S
GR
GS
[0.99988 0 0 1 0 0] CT
0.98 0.91 0.91 RC
1 LJ
0.5 LW
N
646.955 174.107 M
647 174.096 L
655.625 173.009 L
664.25 175.65 L
672.875 176.998 L
681.5 175.658 L
690.125 171.296 L
698.75 166.949 L
707.375 156.5 L
716 141.068 L
724.625 115.789 L
733.25 84.088 L
741.875 61.395 L
750.5 48.704 L
759.125 47.224 L
767.75 53.655 L
776.375 61.253 L
785 68.501 L
793.625 73.589 L
802.25 83.885 L
810.875 99.368 L
819.5 113.919 L
828.125 128.002 L
836.75 137.864 L
845.375 147.806 L
854 154.256 L
862.625 160.158 L
871.25 161.652 L
879.875 164.999 L
888.5 162.687 L
897.125 163.906 L
905.75 165.362 L
914.375 165.305 L
923 165.463 L
931.625 160.854 L
940.25 159.092 L
948.875 160.374 L
957.5 162.667 L
966.125 161.662 L
974.75 158.022 L
983.375 159.452 L
992 161.375 L
1000.625 159.026 L
1009.25 156.756 L
1017.875 154.743 L
1026.5 152.149 L
1026.545 152.138 L
S
GR
GS
[0.99988 0 0 1 0 0] CT
0.961 0.8 0.8 RC
1 LJ
2 LW
N
646.955 178.064 M
647 178.051 L
655.625 176.831 L
664.25 179.738 L
672.875 181.255 L
681.5 180.008 L
690.125 175.692 L
698.75 171.027 L
707.375 159.978 L
716 144.603 L
724.625 119.53 L
733.25 88.654 L
741.875 66.484 L
750.5 53.992 L
759.125 52.643 L
767.75 59.123 L
776.375 66.905 L
785 74.203 L
793.625 79.596 L
802.25 90.494 L
810.875 106.199 L
819.5 120.275 L
828.125 133.815 L
836.75 143.71 L
845.375 153.529 L
854 159.97 L
862.625 165.703 L
871.25 167.203 L
879.875 170.569 L
888.5 168.251 L
897.125 169.523 L
905.75 170.763 L
914.375 170.638 L
923 170.27 L
931.625 165.301 L
940.25 163.709 L
948.875 165.071 L
957.5 167.347 L
966.125 165.934 L
974.75 162.002 L
983.375 163.381 L
992 165.124 L
1000.625 163.398 L
1009.25 161.381 L
1017.875 158.827 L
1026.5 155.776 L
1026.545 155.767 L
S
GR
GS
[0.99988 0 0 1 0 0] CT
0.99 0.959 0.959 RC
N
733.25 106.266 M
724.625 130.923 L
716 151.781 L
707.375 162.105 L
698.75 167.408 L
690.125 170.216 L
681.5 174.313 L
672.875 177.778 L
664.25 177.491 L
655.625 178.327 L
647 176.596 L
646.955 176.598 L
646.955 184.112 L
646.955 184.152 L
647 184.15 L
655.625 187.042 L
664.25 186.994 L
672.875 186.324 L
681.5 182.312 L
690.125 178.242 L
698.75 175.014 L
707.375 170.047 L
716 160.279 L
724.625 138.968 L
733.25 114.969 L
741.875 94.177 L
750.5 83.079 L
759.125 84.546 L
767.75 88.02 L
776.375 87.448 L
785 86.664 L
793.625 88.066 L
802.25 90.654 L
810.875 95.017 L
819.5 101.287 L
828.125 107.19 L
836.75 112.506 L
845.375 116.384 L
854 125.021 L
862.625 132.512 L
871.25 136.484 L
879.875 138.652 L
888.5 145.655 L
897.125 151.87 L
905.75 154.719 L
914.375 158.72 L
923 160.512 L
931.625 160.642 L
940.25 161.46 L
948.875 161.933 L
957.5 163.521 L
966.125 168.341 L
974.75 170.993 L
983.375 169.041 L
992 164.024 L
1000.625 163.115 L
1009.25 163.839 L
1017.875 161.785 L
1026.5 161.145 L
1026.545 161.142 L
1026.545 153.413 L
1026.545 153.375 L
1026.5 153.375 L
1017.875 153.126 L
1009.25 155.145 L
1000.625 155.294 L
992 157.231 L
983.375 161.878 L
974.75 163.929 L
966.125 161.249 L
957.5 156.807 L
948.875 156.064 L
940.25 155.596 L
931.625 153.86 L
923 152.931 L
914.375 151.373 L
905.75 146.985 L
897.125 143.089 L
888.5 136.517 L
879.875 130.298 L
871.25 128.795 L
862.625 124.956 L
854 116.739 L
845.375 107.91 L
836.75 103.441 L
828.125 98.112 L
819.5 92.371 L
810.875 86.143 L
802.25 82.332 L
793.625 80.202 L
785 77.7 L
776.375 77.656 L
767.75 78.989 L
759.125 75.848 L
750.5 74.181 L
741.875 85.289 L
cp
f
GR
GS
[0.99988 0 0 1 0 0] CT
0.957 0.82 0.82 RC
1 LJ
0.5 LW
N
646.955 184.152 M
647 184.15 L
655.625 187.042 L
664.25 186.994 L
672.875 186.324 L
681.5 182.312 L
690.125 178.242 L
698.75 175.014 L
707.375 170.047 L
716 160.279 L
724.625 138.968 L
733.25 114.969 L
741.875 94.177 L
750.5 83.079 L
759.125 84.546 L
767.75 88.02 L
776.375 87.448 L
785 86.664 L
793.625 88.066 L
802.25 90.654 L
810.875 95.017 L
819.5 101.287 L
828.125 107.19 L
836.75 112.506 L
845.375 116.384 L
854 125.021 L
862.625 132.512 L
871.25 136.484 L
879.875 138.652 L
888.5 145.655 L
897.125 151.87 L
905.75 154.719 L
914.375 158.72 L
923 160.512 L
931.625 160.642 L
940.25 161.46 L
948.875 161.933 L
957.5 163.521 L
966.125 168.341 L
974.75 170.993 L
983.375 169.041 L
992 164.024 L
1000.625 163.115 L
1009.25 163.839 L
1017.875 161.785 L
1026.5 161.145 L
1026.545 161.142 L
S
GR
GS
[0.99988 0 0 1 0 0] CT
0.957 0.82 0.82 RC
1 LJ
0.5 LW
N
646.955 176.598 M
647 176.596 L
655.625 178.327 L
664.25 177.491 L
672.875 177.778 L
681.5 174.313 L
690.125 170.216 L
698.75 167.408 L
707.375 162.105 L
716 151.781 L
724.625 130.923 L
733.25 106.266 L
741.875 85.289 L
750.5 74.181 L
759.125 75.848 L
767.75 78.989 L
776.375 77.656 L
785 77.7 L
793.625 80.202 L
802.25 82.332 L
810.875 86.143 L
819.5 92.371 L
828.125 98.112 L
836.75 103.441 L
845.375 107.91 L
854 116.739 L
862.625 124.956 L
871.25 128.795 L
879.875 130.298 L
888.5 136.517 L
897.125 143.089 L
905.75 146.985 L
914.375 151.373 L
923 152.931 L
931.625 153.86 L
940.25 155.596 L
948.875 156.064 L
957.5 156.807 L
966.125 161.249 L
974.75 163.929 L
983.375 161.878 L
992 157.231 L
1000.625 155.294 L
1009.25 155.145 L
1017.875 153.126 L
1026.5 153.375 L
1026.545 153.375 L
S
GR
GS
[0.99988 0 0 1 0 0] CT
0.898 0.6 0.6 RC
1 LJ
2 LW
N
646.955 180.375 M
647 180.373 L
655.625 182.685 L
664.25 182.243 L
672.875 182.051 L
681.5 178.313 L
690.125 174.229 L
698.75 171.211 L
707.375 166.076 L
716 156.03 L
724.625 134.945 L
733.25 110.617 L
741.875 89.733 L
750.5 78.63 L
759.125 80.197 L
767.75 83.505 L
776.375 82.552 L
785 82.182 L
793.625 84.134 L
802.25 86.493 L
810.875 90.58 L
819.5 96.829 L
828.125 102.651 L
836.75 107.974 L
845.375 112.147 L
854 120.88 L
862.625 128.734 L
871.25 132.639 L
879.875 134.475 L
888.5 141.086 L
897.125 147.479 L
905.75 150.852 L
914.375 155.047 L
923 156.721 L
931.625 157.251 L
940.25 158.528 L
948.875 158.999 L
957.5 160.164 L
966.125 164.795 L
974.75 167.461 L
983.375 165.459 L
992 160.627 L
1000.625 159.204 L
1009.25 159.492 L
1017.875 157.456 L
1026.5 157.26 L
1026.545 157.259 L
S
GR
GS
[0.99988 0 0 1 0 0] CT
0.98 0.939 0.939 RC
N
836.75 115.269 M
845.375 119.707 L
854 124.036 L
862.625 131.12 L
871.25 136.376 L
879.875 138.437 L
888.5 142.647 L
897.125 149.562 L
905.75 155.649 L
914.375 159.35 L
923 158.288 L
931.625 157.336 L
940.25 156.758 L
948.875 160.774 L
957.5 158.675 L
966.125 156.085 L
974.75 157.014 L
983.375 158.645 L
992 161.098 L
1000.625 166.291 L
1009.25 166.804 L
1017.875 166.846 L
1026.5 166.965 L
1026.545 166.958 L
1026.545 157.752 L
1026.545 157.705 L
1026.5 157.711 L
1017.875 156.696 L
1009.25 157.314 L
1000.625 157.48 L
992 152.39 L
983.375 150.256 L
974.75 149.35 L
966.125 148.639 L
957.5 151.249 L
948.875 153.215 L
940.25 149.287 L
931.625 149.677 L
923 149.962 L
914.375 150.627 L
905.75 146.98 L
897.125 141.221 L
888.5 134.403 L
879.875 130.325 L
871.25 128.007 L
862.625 121.874 L
854 114.912 L
845.375 111.592 L
836.75 107.285 L
828.125 104.545 L
819.5 97.25 L
810.875 92.523 L
802.25 89.836 L
793.625 88.023 L
785 85.266 L
776.375 82.005 L
767.75 78.958 L
759.125 78.252 L
750.5 82.208 L
741.875 91.087 L
733.25 111.591 L
724.625 132.926 L
716 155.067 L
707.375 170.487 L
698.75 174.329 L
690.125 174.034 L
681.5 177.792 L
672.875 180.376 L
664.25 179.23 L
655.625 178.199 L
647 180.097 L
646.955 180.096 L
646.955 186.798 L
646.955 186.836 L
647 186.834 L
655.625 185.648 L
664.25 186.642 L
672.875 188.418 L
681.5 186.685 L
690.125 182.39 L
698.75 182.252 L
707.375 178.198 L
716 163.119 L
724.625 141.523 L
733.25 120.752 L
741.875 99.917 L
750.5 91.026 L
759.125 86.757 L
767.75 87.003 L
776.375 90.26 L
785 92.597 L
793.625 95.854 L
802.25 98.029 L
810.875 101.081 L
819.5 105.224 L
828.125 112.476 L
cp
f
GR
GS
[0.99988 0 0 1 0 0] CT
0.91 0.729 0.729 RC
1 LJ
0.5 LW
N
646.955 186.836 M
647 186.834 L
655.625 185.648 L
664.25 186.642 L
672.875 188.418 L
681.5 186.685 L
690.125 182.39 L
698.75 182.252 L
707.375 178.198 L
716 163.119 L
724.625 141.523 L
733.25 120.752 L
741.875 99.917 L
750.5 91.026 L
759.125 86.757 L
767.75 87.003 L
776.375 90.26 L
785 92.597 L
793.625 95.854 L
802.25 98.029 L
810.875 101.081 L
819.5 105.224 L
828.125 112.476 L
836.75 115.269 L
845.375 119.707 L
854 124.036 L
862.625 131.12 L
871.25 136.376 L
879.875 138.437 L
888.5 142.647 L
897.125 149.562 L
905.75 155.649 L
914.375 159.35 L
923 158.288 L
931.625 157.336 L
940.25 156.758 L
948.875 160.774 L
957.5 158.675 L
966.125 156.085 L
974.75 157.014 L
983.375 158.645 L
992 161.098 L
1000.625 166.291 L
1009.25 166.804 L
1017.875 166.846 L
1026.5 166.965 L
1026.545 166.958 L
S
GR
GS
[0.99988 0 0 1 0 0] CT
0.91 0.729 0.729 RC
1 LJ
0.5 LW
N
646.955 180.096 M
647 180.097 L
655.625 178.199 L
664.25 179.23 L
672.875 180.376 L
681.5 177.792 L
690.125 174.034 L
698.75 174.329 L
707.375 170.487 L
716 155.067 L
724.625 132.926 L
733.25 111.591 L
741.875 91.087 L
750.5 82.208 L
759.125 78.252 L
767.75 78.958 L
776.375 82.005 L
785 85.266 L
793.625 88.023 L
802.25 89.836 L
810.875 92.523 L
819.5 97.25 L
828.125 104.545 L
836.75 107.285 L
845.375 111.592 L
854 114.912 L
862.625 121.874 L
871.25 128.007 L
879.875 130.325 L
888.5 134.403 L
897.125 141.221 L
905.75 146.98 L
914.375 150.627 L
923 149.962 L
931.625 149.677 L
940.25 149.287 L
948.875 153.215 L
957.5 151.249 L
966.125 148.639 L
974.75 149.35 L
983.375 150.256 L
992 152.39 L
1000.625 157.48 L
1009.25 157.314 L
1017.875 156.696 L
1026.5 157.711 L
1026.545 157.705 L
S
GR
GS
[0.99988 0 0 1 0 0] CT
0.8 0.4 0.4 RC
1 LJ
2 LW
N
646.955 183.466 M
647 183.466 L
655.625 181.924 L
664.25 182.936 L
672.875 184.397 L
681.5 182.239 L
690.125 178.212 L
698.75 178.291 L
707.375 174.343 L
716 159.093 L
724.625 137.224 L
733.25 116.171 L
741.875 95.502 L
750.5 86.617 L
759.125 82.505 L
767.75 82.98 L
776.375 86.133 L
785 88.932 L
793.625 91.938 L
802.25 93.933 L
810.875 96.802 L
819.5 101.237 L
828.125 108.511 L
836.75 111.277 L
845.375 115.649 L
854 119.474 L
862.625 126.497 L
871.25 132.191 L
879.875 134.381 L
888.5 138.525 L
897.125 145.391 L
905.75 151.315 L
914.375 154.989 L
923 154.125 L
931.625 153.507 L
940.25 153.023 L
948.875 156.995 L
957.5 154.962 L
966.125 152.362 L
974.75 153.182 L
983.375 154.45 L
992 156.744 L
1000.625 161.886 L
1009.25 162.059 L
1017.875 161.771 L
1026.5 162.338 L
1026.545 162.332 L
S
GR
GS
[0.99988 0 0 1 0 0] CT
0.959 0.918 0.918 RC
N
733.25 115.067 M
741.875 98.295 L
750.5 89.804 L
759.125 87.298 L
767.75 89.184 L
776.375 96.459 L
785 99.959 L
793.625 102.609 L
802.25 104.345 L
810.875 107.731 L
819.5 113.075 L
828.125 117.562 L
836.75 118.191 L
845.375 123.676 L
854 126.625 L
862.625 130.479 L
871.25 135.217 L
879.875 139.978 L
888.5 142.744 L
897.125 148.742 L
905.75 153.224 L
914.375 155.368 L
923 153.858 L
931.625 152.795 L
940.25 157.166 L
948.875 161.796 L
957.5 164.831 L
966.125 162.289 L
974.75 163.223 L
983.375 166.485 L
992 169.221 L
1000.625 170.087 L
1009.25 170.289 L
1017.875 174.526 L
1026.5 172.902 L
1026.545 172.89 L
1026.545 165.068 L
1026.545 165.028 L
1026.5 165.039 L
1017.875 166.13 L
1009.25 162.409 L
1000.625 162.404 L
992 161.35 L
983.375 158.701 L
974.75 156.553 L
966.125 155.775 L
957.5 158.696 L
948.875 155.509 L
940.25 150.1 L
931.625 145.333 L
923 145.915 L
914.375 147.269 L
905.75 143.824 L
897.125 138.396 L
888.5 133.111 L
879.875 130.092 L
871.25 124.549 L
862.625 119.955 L
854 116.218 L
845.375 113.792 L
836.75 109.155 L
828.125 109.023 L
819.5 104.669 L
810.875 99.016 L
802.25 94.865 L
793.625 93.743 L
785 91.839 L
776.375 88.983 L
767.75 81.732 L
759.125 79.616 L
750.5 81.654 L
741.875 89.812 L
733.25 106.292 L
724.625 131.339 L
716 153.98 L
707.375 168.228 L
698.75 176.718 L
690.125 184.023 L
681.5 184.278 L
672.875 184.31 L
664.25 184.263 L
655.625 186.478 L
647 185.888 L
646.955 185.871 L
646.955 185.911 L
646.955 193.532 L
647 193.549 L
655.625 194.302 L
664.25 192.65 L
672.875 193.023 L
681.5 193.045 L
690.125 192.563 L
698.75 185.252 L
707.375 176.837 L
716 162.965 L
724.625 140.187 L
cp
f
GR
GS
[0.99988 0 0 1 0 0] CT
0.82 0.639 0.639 RC
1 LJ
0.5 LW
N
646.955 193.532 M
647 193.549 L
655.625 194.302 L
664.25 192.65 L
672.875 193.023 L
681.5 193.045 L
690.125 192.563 L
698.75 185.252 L
707.375 176.837 L
716 162.965 L
724.625 140.187 L
733.25 115.067 L
741.875 98.295 L
750.5 89.804 L
759.125 87.298 L
767.75 89.184 L
776.375 96.459 L
785 99.959 L
793.625 102.609 L
802.25 104.345 L
810.875 107.731 L
819.5 113.075 L
828.125 117.562 L
836.75 118.191 L
845.375 123.676 L
854 126.625 L
862.625 130.479 L
871.25 135.217 L
879.875 139.978 L
888.5 142.744 L
897.125 148.742 L
905.75 153.224 L
914.375 155.368 L
923 153.858 L
931.625 152.795 L
940.25 157.166 L
948.875 161.796 L
957.5 164.831 L
966.125 162.289 L
974.75 163.223 L
983.375 166.485 L
992 169.221 L
1000.625 170.087 L
1009.25 170.289 L
1017.875 174.526 L
1026.5 172.902 L
1026.545 172.89 L
S
GR
GS
[0.99988 0 0 1 0 0] CT
0.82 0.639 0.639 RC
1 LJ
0.5 LW
N
646.955 185.871 M
647 185.888 L
655.625 186.478 L
664.25 184.263 L
672.875 184.31 L
681.5 184.278 L
690.125 184.023 L
698.75 176.718 L
707.375 168.228 L
716 153.98 L
724.625 131.339 L
733.25 106.292 L
741.875 89.812 L
750.5 81.654 L
759.125 79.616 L
767.75 81.732 L
776.375 88.983 L
785 91.839 L
793.625 93.743 L
802.25 94.865 L
810.875 99.016 L
819.5 104.669 L
828.125 109.023 L
836.75 109.155 L
845.375 113.792 L
854 116.218 L
862.625 119.955 L
871.25 124.549 L
879.875 130.092 L
888.5 133.111 L
897.125 138.396 L
905.75 143.824 L
914.375 147.269 L
923 145.915 L
931.625 145.333 L
940.25 150.1 L
948.875 155.509 L
957.5 158.696 L
966.125 155.775 L
974.75 156.553 L
983.375 158.701 L
992 161.35 L
1000.625 162.404 L
1009.25 162.409 L
1017.875 166.13 L
1026.5 165.039 L
1026.545 165.028 L
S
GR
GS
[0.99988 0 0 1 0 0] CT
0.6 0.2 0.2 RC
1 LJ
2 LW
N
646.955 189.701 M
647 189.718 L
655.625 190.39 L
664.25 188.457 L
672.875 188.667 L
681.5 188.661 L
690.125 188.293 L
698.75 180.985 L
707.375 172.532 L
716 158.473 L
724.625 135.763 L
733.25 110.68 L
741.875 94.053 L
750.5 85.729 L
759.125 83.457 L
767.75 85.458 L
776.375 92.721 L
785 95.899 L
793.625 98.176 L
802.25 99.605 L
810.875 103.373 L
819.5 108.872 L
828.125 113.293 L
836.75 113.673 L
845.375 118.734 L
854 121.422 L
862.625 125.217 L
871.25 129.883 L
879.875 135.035 L
888.5 137.927 L
897.125 143.569 L
905.75 148.524 L
914.375 151.318 L
923 149.887 L
931.625 149.064 L
940.25 153.633 L
948.875 158.652 L
957.5 161.763 L
966.125 159.032 L
974.75 159.888 L
983.375 162.593 L
992 165.285 L
1000.625 166.246 L
1009.25 166.349 L
1017.875 170.328 L
1026.5 168.97 L
1026.545 168.959 L
S
GR
GS
[0.99988 0 0 1 0 0] CT
[8 8] 0 setdash
2 LJ
2 LW
N
681.5 195.656 M
681.5 33.937 L
S
GR
GS
[0.99988 0 0 1 952.38096 43] CT
/Helvetica 20 F
GS
[1 0 0 1 0 0] CT
0 7.5 moveto 
1 -1 scale
(Load 1) t 
GR
GR
GS
[0.99988 0 0 1 0 0] CT
0.961 0.8 0.8 RC
1 LJ
2 LW
N
919.5 43 M
949.5 43 L
S
GR
GS
[0.99988 0 0 1 952.38096 67.5] CT
/Helvetica 20 F
GS
[1 0 0 1 0 0] CT
0 7.5 moveto 
1 -1 scale
(Load 2) t 
GR
GR
GS
[0.99988 0 0 1 0 0] CT
0.898 0.6 0.6 RC
1 LJ
2 LW
N
919.5 67.5 M
949.5 67.5 L
S
GR
GS
[0.99988 0 0 1 952.38096 92] CT
/Helvetica 20 F
GS
[1 0 0 1 0 0] CT
0 7.5 moveto 
1 -1 scale
(Load 3) t 
GR
GR
GS
[0.99988 0 0 1 0 0] CT
0.8 0.4 0.4 RC
1 LJ
2 LW
N
919.5 92 M
949.5 92 L
S
GR
GS
[0.99988 0 0 1 952.38096 116.5] CT
/Helvetica 20 F
GS
[1 0 0 1 0 0] CT
0 7.5 moveto 
1 -1 scale
(Load 4) t 
GR
GR
GS
[0.99988 0 0 1 0 0] CT
0.6 0.2 0.2 RC
1 LJ
2 LW
N
919.5 116.5 M
949.5 116.5 L
S
GR
%%Trailer
%%Pages: 1
%%EOF
