%!PS-Adobe-3.0 EPSF-3.0
%%Creator: (MATLAB, The Mathworks, Inc. Version 9.10.0.1602886 \(R2021a\). Operating System: Mac OS X)
%%Title: /Users/kosciessa/Desktop/tardis/LNDG/stateswitch/stsw_eeg_task/tfr/figures/b01_alphaTraces_yaoa.eps
%%CreationDate: 2022-02-22T16:23:38
%%Pages: (atend)
%%BoundingBox:     2     0   388   266
%%LanguageLevel: 3
%%EndComments
%%BeginProlog
%%BeginResource: procset (Apache XML Graphics Std ProcSet) 1.2 0
%%Version: 1.2 0
%%Copyright: (Copyright 2001-2003,2010 The Apache Software Foundation. License terms: http://www.apache.org/licenses/LICENSE-2.0)
/bd{bind def}bind def
/ld{load def}bd
/GR/grestore ld
/GS/gsave ld
/RM/rmoveto ld
/C/curveto ld
/t/show ld
/L/lineto ld
/ML/setmiterlimit ld
/CT/concat ld
/f/fill ld
/N/newpath ld
/S/stroke ld
/CC/setcmykcolor ld
/A/ashow ld
/cp/closepath ld
/RC/setrgbcolor ld
/LJ/setlinejoin ld
/GC/setgray ld
/LW/setlinewidth ld
/M/moveto ld
/re {4 2 roll M
1 index 0 rlineto
0 exch rlineto
neg 0 rlineto
cp } bd
/_ctm matrix def
/_tm matrix def
/BT { _ctm currentmatrix pop matrix _tm copy pop 0 0 moveto } bd
/ET { _ctm setmatrix } bd
/iTm { _ctm setmatrix _tm concat } bd
/Tm { _tm astore pop iTm 0 0 moveto } bd
/ux 0.0 def
/uy 0.0 def
/F {
  /Tp exch def
  /Tf exch def
  Tf findfont Tp scalefont setfont
  /cf Tf def  /cs Tp def
} bd
/ULS {currentpoint /uy exch def /ux exch def} bd
/ULE {
  /Tcx currentpoint pop def
  gsave
  newpath
  cf findfont cs scalefont dup
  /FontMatrix get 0 get /Ts exch def /FontInfo get dup
  /UnderlinePosition get Ts mul /To exch def
  /UnderlineThickness get Ts mul /Tt exch def
  ux uy To add moveto  Tcx uy To add lineto
  Tt setlinewidth stroke
  grestore
} bd
/OLE {
  /Tcx currentpoint pop def
  gsave
  newpath
  cf findfont cs scalefont dup
  /FontMatrix get 0 get /Ts exch def /FontInfo get dup
  /UnderlinePosition get Ts mul /To exch def
  /UnderlineThickness get Ts mul /Tt exch def
  ux uy To add cs add moveto Tcx uy To add cs add lineto
  Tt setlinewidth stroke
  grestore
} bd
/SOE {
  /Tcx currentpoint pop def
  gsave
  newpath
  cf findfont cs scalefont dup
  /FontMatrix get 0 get /Ts exch def /FontInfo get dup
  /UnderlinePosition get Ts mul /To exch def
  /UnderlineThickness get Ts mul /Tt exch def
  ux uy To add cs 10 mul 26 idiv add moveto Tcx uy To add cs 10 mul 26 idiv add lineto
  Tt setlinewidth stroke
  grestore
} bd
/QT {
/Y22 exch store
/X22 exch store
/Y21 exch store
/X21 exch store
currentpoint
/Y21 load 2 mul add 3 div exch
/X21 load 2 mul add 3 div exch
/X21 load 2 mul /X22 load add 3 div
/Y21 load 2 mul /Y22 load add 3 div
/X22 load /Y22 load curveto
} bd
/SSPD {
dup length /d exch dict def
{
/v exch def
/k exch def
currentpagedevice k known {
/cpdv currentpagedevice k get def
v cpdv ne {
/upd false def
/nullv v type /nulltype eq def
/nullcpdv cpdv type /nulltype eq def
nullv nullcpdv or
{
/upd true def
} {
/sametype v type cpdv type eq def
sametype {
v type /arraytype eq {
/vlen v length def
/cpdvlen cpdv length def
vlen cpdvlen eq {
0 1 vlen 1 sub {
/i exch def
/obj v i get def
/cpdobj cpdv i get def
obj cpdobj ne {
/upd true def
exit
} if
} for
} {
/upd true def
} ifelse
} {
v type /dicttype eq {
v {
/dv exch def
/dk exch def
/cpddv cpdv dk get def
dv cpddv ne {
/upd true def
exit
} if
} forall
} {
/upd true def
} ifelse
} ifelse
} if
} ifelse
upd true eq {
d k v put
} if
} if
} if
} forall
d length 0 gt {
d setpagedevice
} if
} bd
/RE { % /NewFontName [NewEncodingArray] /FontName RE -
  findfont dup length dict begin
  {
    1 index /FID ne
    {def} {pop pop} ifelse
  } forall
  /Encoding exch def
  /FontName 1 index def
  currentdict definefont pop
  end
} bind def
%%EndResource
%%BeginResource: procset (Apache XML Graphics EPS ProcSet) 1.0 0
%%Version: 1.0 0
%%Copyright: (Copyright 2002-2003 The Apache Software Foundation. License terms: http://www.apache.org/licenses/LICENSE-2.0)
/BeginEPSF { %def
/b4_Inc_state save def         % Save state for cleanup
/dict_count countdictstack def % Count objects on dict stack
/op_count count 1 sub def      % Count objects on operand stack
userdict begin                 % Push userdict on dict stack
/showpage { } def              % Redefine showpage, { } = null proc
0 setgray 0 setlinecap         % Prepare graphics state
1 setlinewidth 0 setlinejoin
10 setmiterlimit [ ] 0 setdash newpath
/languagelevel where           % If level not equal to 1 then
{pop languagelevel             % set strokeadjust and
1 ne                           % overprint to their defaults.
{false setstrokeadjust false setoverprint
} if
} if
} bd
/EndEPSF { %def
count op_count sub {pop} repeat            % Clean up stacks
countdictstack dict_count sub {end} repeat
b4_Inc_state restore
} bd
%%EndResource
%FOPBeginFontDict
%%IncludeResource: font Courier-Oblique
%%IncludeResource: font Courier-BoldOblique
%%IncludeResource: font Courier-Bold
%%IncludeResource: font ZapfDingbats
%%IncludeResource: font Symbol
%%IncludeResource: font Helvetica
%%IncludeResource: font Helvetica-Oblique
%%IncludeResource: font Helvetica-Bold
%%IncludeResource: font Helvetica-BoldOblique
%%IncludeResource: font Times-Roman
%%IncludeResource: font Times-Italic
%%IncludeResource: font Times-Bold
%%IncludeResource: font Times-BoldItalic
%%IncludeResource: font Courier
%FOPEndFontDict
%%BeginResource: encoding WinAnsiEncoding
/WinAnsiEncoding [
/.notdef /.notdef /.notdef /.notdef /.notdef
/.notdef /.notdef /.notdef /.notdef /.notdef
/.notdef /.notdef /.notdef /.notdef /.notdef
/.notdef /.notdef /.notdef /.notdef /.notdef
/.notdef /.notdef /.notdef /.notdef /.notdef
/.notdef /.notdef /.notdef /.notdef /.notdef
/.notdef /.notdef /space /exclam /quotedbl
/numbersign /dollar /percent /ampersand /quotesingle
/parenleft /parenright /asterisk /plus /comma
/hyphen /period /slash /zero /one
/two /three /four /five /six
/seven /eight /nine /colon /semicolon
/less /equal /greater /question /at
/A /B /C /D /E
/F /G /H /I /J
/K /L /M /N /O
/P /Q /R /S /T
/U /V /W /X /Y
/Z /bracketleft /backslash /bracketright /asciicircum
/underscore /quoteleft /a /b /c
/d /e /f /g /h
/i /j /k /l /m
/n /o /p /q /r
/s /t /u /v /w
/x /y /z /braceleft /bar
/braceright /asciitilde /bullet /Euro /bullet
/quotesinglbase /florin /quotedblbase /ellipsis /dagger
/daggerdbl /circumflex /perthousand /Scaron /guilsinglleft
/OE /bullet /Zcaron /bullet /bullet
/quoteleft /quoteright /quotedblleft /quotedblright /bullet
/endash /emdash /asciitilde /trademark /scaron
/guilsinglright /oe /bullet /zcaron /Ydieresis
/space /exclamdown /cent /sterling /currency
/yen /brokenbar /section /dieresis /copyright
/ordfeminine /guillemotleft /logicalnot /sfthyphen /registered
/macron /degree /plusminus /twosuperior /threesuperior
/acute /mu /paragraph /middot /cedilla
/onesuperior /ordmasculine /guillemotright /onequarter /onehalf
/threequarters /questiondown /Agrave /Aacute /Acircumflex
/Atilde /Adieresis /Aring /AE /Ccedilla
/Egrave /Eacute /Ecircumflex /Edieresis /Igrave
/Iacute /Icircumflex /Idieresis /Eth /Ntilde
/Ograve /Oacute /Ocircumflex /Otilde /Odieresis
/multiply /Oslash /Ugrave /Uacute /Ucircumflex
/Udieresis /Yacute /Thorn /germandbls /agrave
/aacute /acircumflex /atilde /adieresis /aring
/ae /ccedilla /egrave /eacute /ecircumflex
/edieresis /igrave /iacute /icircumflex /idieresis
/eth /ntilde /ograve /oacute /ocircumflex
/otilde /odieresis /divide /oslash /ugrave
/uacute /ucircumflex /udieresis /yacute /thorn
/ydieresis
] def
%%EndResource
%FOPBeginFontReencode
/Courier-Oblique findfont
dup length dict begin
  {1 index /FID ne {def} {pop pop} ifelse} forall
  /Encoding WinAnsiEncoding def
  currentdict
end
/Courier-Oblique exch definefont pop
/Courier-BoldOblique findfont
dup length dict begin
  {1 index /FID ne {def} {pop pop} ifelse} forall
  /Encoding WinAnsiEncoding def
  currentdict
end
/Courier-BoldOblique exch definefont pop
/Courier-Bold findfont
dup length dict begin
  {1 index /FID ne {def} {pop pop} ifelse} forall
  /Encoding WinAnsiEncoding def
  currentdict
end
/Courier-Bold exch definefont pop
/Helvetica findfont
dup length dict begin
  {1 index /FID ne {def} {pop pop} ifelse} forall
  /Encoding WinAnsiEncoding def
  currentdict
end
/Helvetica exch definefont pop
/Helvetica-Oblique findfont
dup length dict begin
  {1 index /FID ne {def} {pop pop} ifelse} forall
  /Encoding WinAnsiEncoding def
  currentdict
end
/Helvetica-Oblique exch definefont pop
/Helvetica-Bold findfont
dup length dict begin
  {1 index /FID ne {def} {pop pop} ifelse} forall
  /Encoding WinAnsiEncoding def
  currentdict
end
/Helvetica-Bold exch definefont pop
/Helvetica-BoldOblique findfont
dup length dict begin
  {1 index /FID ne {def} {pop pop} ifelse} forall
  /Encoding WinAnsiEncoding def
  currentdict
end
/Helvetica-BoldOblique exch definefont pop
/Times-Roman findfont
dup length dict begin
  {1 index /FID ne {def} {pop pop} ifelse} forall
  /Encoding WinAnsiEncoding def
  currentdict
end
/Times-Roman exch definefont pop
/Times-Italic findfont
dup length dict begin
  {1 index /FID ne {def} {pop pop} ifelse} forall
  /Encoding WinAnsiEncoding def
  currentdict
end
/Times-Italic exch definefont pop
/Times-Bold findfont
dup length dict begin
  {1 index /FID ne {def} {pop pop} ifelse} forall
  /Encoding WinAnsiEncoding def
  currentdict
end
/Times-Bold exch definefont pop
/Times-BoldItalic findfont
dup length dict begin
  {1 index /FID ne {def} {pop pop} ifelse} forall
  /Encoding WinAnsiEncoding def
  currentdict
end
/Times-BoldItalic exch definefont pop
/Courier findfont
dup length dict begin
  {1 index /FID ne {def} {pop pop} ifelse} forall
  /Encoding WinAnsiEncoding def
  currentdict
end
/Courier exch definefont pop
%FOPEndFontReencode
%%EndProlog
%%Page: 1 1
%%PageBoundingBox: 0 0 425 283
%%BeginPageSetup
[1 0 0 -1 0 283] CT
%%EndPageSetup
GS
[1.00046 0 0 1 0 0] CT
1 GC
N
0 0 425 283 re
f
GR
GS
[1.00046 0 0 1 0 0] CT
1 GC
N
0 0 425 283 re
f
GR
GS
[1.00046 0 0 1 0 0] CT
1 GC
N
57.5 248.5 M
384.5 248.5 L
384.5 21 L
57.5 21 L
cp
f
GR
GS
[1.00046 0 0 1 0 0] CT
0.149 GC
2 setlinecap
1 LJ
0.5 LW
N
57.5 248.5 M
384.5 248.5 L
S
GR
GS
[1.00046 0 0 1 0 0] CT
0.149 GC
2 setlinecap
1 LJ
0.5 LW
N
82.654 248.5 M
82.654 245.234 L
S
GR
GS
[1.00046 0 0 1 0 0] CT
0.149 GC
2 setlinecap
1 LJ
0.5 LW
N
132.962 248.5 M
132.962 245.234 L
S
GR
GS
[1.00046 0 0 1 0 0] CT
0.149 GC
2 setlinecap
1 LJ
0.5 LW
N
183.269 248.5 M
183.269 245.234 L
S
GR
GS
[1.00046 0 0 1 0 0] CT
0.149 GC
2 setlinecap
1 LJ
0.5 LW
N
233.577 248.5 M
233.577 245.234 L
S
GR
GS
[1.00046 0 0 1 0 0] CT
0.149 GC
2 setlinecap
1 LJ
0.5 LW
N
283.885 248.5 M
283.885 245.234 L
S
GR
GS
[1.00046 0 0 1 0 0] CT
0.149 GC
2 setlinecap
1 LJ
0.5 LW
N
334.192 248.5 M
334.192 245.234 L
S
GR
GS
[1.00046 0 0 1 0 0] CT
0.149 GC
2 setlinecap
1 LJ
0.5 LW
N
384.5 248.5 M
384.5 245.234 L
S
GR
GS
[1.00046 0 0 1 82.69213 252.89996] CT
0.149 GC
/Helvetica 12 F
GS
[1 0 0 1 0 0] CT
-6 12 moveto 
1 -1 scale
(-1) t 
GR
GR
GS
[1.00046 0 0 1 133.02311 252.89996] CT
0.149 GC
/Helvetica 12 F
GS
[1 0 0 1 0 0] CT
-3.5 12 moveto 
1 -1 scale
(0) t 
GR
GR
GS
[1.00046 0 0 1 183.35411 252.89996] CT
0.149 GC
/Helvetica 12 F
GS
[1 0 0 1 0 0] CT
-3.5 12 moveto 
1 -1 scale
(1) t 
GR
GR
GS
[1.00046 0 0 1 233.6851 252.89996] CT
0.149 GC
/Helvetica 12 F
GS
[1 0 0 1 0 0] CT
-3.5 12 moveto 
1 -1 scale
(2) t 
GR
GR
GS
[1.00046 0 0 1 284.01609 252.89996] CT
0.149 GC
/Helvetica 12 F
GS
[1 0 0 1 0 0] CT
-3.5 12 moveto 
1 -1 scale
(3) t 
GR
GR
GS
[1.00046 0 0 1 334.3471 252.89996] CT
0.149 GC
/Helvetica 12 F
GS
[1 0 0 1 0 0] CT
-3.5 12 moveto 
1 -1 scale
(4) t 
GR
GR
GS
[1.00046 0 0 1 384.67808 252.89996] CT
0.149 GC
/Helvetica 12 F
GS
[1 0 0 1 0 0] CT
-3.5 12 moveto 
1 -1 scale
(5) t 
GR
GR
GS
[1.00046 0 0 1 221.10251 268.50009] CT
0.149 GC
/Helvetica 12 F
GS
[1 0 0 1 0 0] CT
-21 12 moveto 
1 -1 scale
(Time \(s\)) t 
GR
GR
GS
[1.00046 0 0 1 0 0] CT
0.149 GC
2 setlinecap
1 LJ
0.5 LW
N
57.5 248.5 M
57.5 21 L
S
GR
GS
[1.00046 0 0 1 0 0] CT
0.149 GC
2 setlinecap
1 LJ
0.5 LW
N
57.5 248.5 M
60.766 248.5 L
S
GR
GS
[1.00046 0 0 1 0 0] CT
0.149 GC
2 setlinecap
1 LJ
0.5 LW
N
57.5 216 M
60.766 216 L
S
GR
GS
[1.00046 0 0 1 0 0] CT
0.149 GC
2 setlinecap
1 LJ
0.5 LW
N
57.5 183.5 M
60.766 183.5 L
S
GR
GS
[1.00046 0 0 1 0 0] CT
0.149 GC
2 setlinecap
1 LJ
0.5 LW
N
57.5 151 M
60.766 151 L
S
GR
GS
[1.00046 0 0 1 0 0] CT
0.149 GC
2 setlinecap
1 LJ
0.5 LW
N
57.5 118.5 M
60.766 118.5 L
S
GR
GS
[1.00046 0 0 1 0 0] CT
0.149 GC
2 setlinecap
1 LJ
0.5 LW
N
57.5 86 M
60.766 86 L
S
GR
GS
[1.00046 0 0 1 0 0] CT
0.149 GC
2 setlinecap
1 LJ
0.5 LW
N
57.5 53.5 M
60.766 53.5 L
S
GR
GS
[1.00046 0 0 1 0 0] CT
0.149 GC
2 setlinecap
1 LJ
0.5 LW
N
57.5 21 M
60.766 21 L
S
GR
GS
[1.00046 0 0 1 53.12459 248.5] CT
0.149 GC
/Helvetica 12 F
GS
[1 0 0 1 0 0] CT
-22 4.5 moveto 
1 -1 scale
(-5.5) t 
GR
GR
GS
[1.00046 0 0 1 53.12459 216.00003] CT
0.149 GC
/Helvetica 12 F
GS
[1 0 0 1 0 0] CT
-22 4.5 moveto 
1 -1 scale
(-5.4) t 
GR
GR
GS
[1.00046 0 0 1 53.12459 183.50006] CT
0.149 GC
/Helvetica 12 F
GS
[1 0 0 1 0 0] CT
-22 4.5 moveto 
1 -1 scale
(-5.3) t 
GR
GR
GS
[1.00046 0 0 1 53.12459 150.99994] CT
0.149 GC
/Helvetica 12 F
GS
[1 0 0 1 0 0] CT
-22 4.5 moveto 
1 -1 scale
(-5.2) t 
GR
GR
GS
[1.00046 0 0 1 53.12459 118.49997] CT
0.149 GC
/Helvetica 12 F
GS
[1 0 0 1 0 0] CT
-22 4.5 moveto 
1 -1 scale
(-5.1) t 
GR
GR
GS
[1.00046 0 0 1 53.12459 86] CT
0.149 GC
/Helvetica 12 F
GS
[1 0 0 1 0 0] CT
-12 4.5 moveto 
1 -1 scale
(-5) t 
GR
GR
GS
[1.00046 0 0 1 53.12459 53.50003] CT
0.149 GC
/Helvetica 12 F
GS
[1 0 0 1 0 0] CT
-22 4.5 moveto 
1 -1 scale
(-4.9) t 
GR
GR
GS
[1.00046 0 0 1 53.12459 21.00006] CT
0.149 GC
/Helvetica 12 F
GS
[1 0 0 1 0 0] CT
-22 4.5 moveto 
1 -1 scale
(-4.8) t 
GR
GR
GS
[0 -1 1.00046 0 29.01343 134.74988] CT
0.149 GC
/Helvetica 12 F
GS
[1 0 0 1 0 0] CT
-57 -18 moveto 
1 -1 scale
(8-12 Hz Alpha Power) t 
GR
GR
GS
[0 -1 1.00046 0 29.01343 134.74988] CT
0.149 GC
/Helvetica 12 F
GS
[1 0 0 1 0 0] CT
-46 -3 moveto 
1 -1 scale
(\(a.u.; normalized\)) t 
GR
GR
GS
[1.00046 0 0 1 0 0] CT
0.996 0.98 0.98 RC
N
170.692 202.082 M
173.208 202.564 L
175.723 202.762 L
178.238 202.223 L
180.754 201.456 L
183.269 200.609 L
185.785 199.944 L
188.3 199.933 L
190.815 199.825 L
193.331 199.423 L
195.846 198.876 L
198.362 198.932 L
200.877 198.696 L
203.392 198.319 L
205.908 197.983 L
208.423 197.401 L
210.938 196.911 L
213.454 196.194 L
215.969 195.063 L
218.485 194.443 L
221 193.993 L
223.515 193.949 L
226.031 193.407 L
228.546 192.859 L
231.062 192.527 L
233.577 192.501 L
236.092 192.212 L
238.608 192.039 L
241.123 192.061 L
243.638 192.401 L
246.154 192.608 L
248.669 192.441 L
251.185 192.372 L
253.7 192.24 L
256.215 191.792 L
258.731 191.02 L
261.246 190.366 L
263.762 190.449 L
266.277 190.2 L
268.792 189.507 L
271.308 189.339 L
273.823 189.349 L
276.338 189.09 L
278.854 188.826 L
281.369 188.643 L
283.885 188.096 L
286.4 187.358 L
288.915 186.412 L
291.431 184.778 L
293.946 184.369 L
296.462 186.735 L
298.977 191.709 L
301.492 197.071 L
304.008 201.188 L
306.523 202.472 L
309.038 202.136 L
311.554 200.581 L
314.069 197.798 L
316.585 193.432 L
319.1 186.383 L
321.615 176.037 L
324.131 163.327 L
326.646 149.64 L
329.162 135.466 L
331.677 121.509 L
334.192 108.735 L
336.708 98.235 L
339.223 90.277 L
341.738 84.243 L
344.254 78.842 L
346.769 74.381 L
349.285 70.922 L
351.8 68.417 L
354.315 66.25 L
356.831 64.361 L
359.346 62.905 L
361.862 61.362 L
364.377 60.061 L
366.892 58.726 L
369.408 57.387 L
371.923 56.266 L
374.438 55.461 L
376.954 54.632 L
379.469 53.127 L
381.985 51.571 L
384.5 49.86 L
384.539 49.813 L
384.539 45.375 L
384.539 45.309 L
384.5 45.352 L
381.985 46.813 L
379.469 48.292 L
376.954 49.747 L
374.438 50.552 L
371.923 51.253 L
369.408 52.202 L
366.892 53.358 L
364.377 54.525 L
361.862 55.598 L
359.346 56.926 L
356.831 58.245 L
354.315 60.117 L
351.8 62.293 L
349.285 64.859 L
346.769 68.495 L
344.254 73.132 L
341.738 78.59 L
339.223 84.619 L
336.708 92.514 L
334.192 102.782 L
331.677 115.408 L
329.162 129.272 L
326.646 143.536 L
324.131 157.49 L
321.615 170.385 L
319.1 180.76 L
316.585 187.932 L
314.069 192.559 L
311.554 195.781 L
309.038 197.827 L
306.523 198.63 L
304.008 197.668 L
301.492 193.711 L
298.977 188.395 L
296.462 183.365 L
293.946 180.936 L
291.431 181.246 L
288.915 182.756 L
286.4 183.598 L
283.885 184.322 L
281.369 184.906 L
278.854 185.178 L
276.338 185.458 L
273.823 185.673 L
271.308 185.548 L
268.792 185.657 L
266.277 186.352 L
263.762 186.668 L
261.246 186.65 L
258.731 187.358 L
256.215 188.218 L
253.7 188.769 L
251.185 188.931 L
248.669 188.974 L
246.154 189.163 L
243.638 188.967 L
241.123 188.588 L
238.608 188.62 L
236.092 188.865 L
233.577 189.196 L
231.062 189.29 L
228.546 189.637 L
226.031 190.213 L
223.515 190.868 L
221 190.892 L
218.485 191.262 L
215.969 191.804 L
213.454 192.966 L
210.938 193.756 L
208.423 194.296 L
205.908 195.004 L
203.392 195.46 L
200.877 195.797 L
198.362 195.986 L
195.846 195.962 L
193.331 196.527 L
190.815 197.044 L
188.3 197.192 L
185.785 197.245 L
183.269 197.913 L
180.754 198.699 L
178.238 199.498 L
175.723 200.085 L
173.208 199.964 L
170.692 199.589 L
168.177 198.913 L
165.662 198.078 L
163.146 197.247 L
160.631 195.223 L
158.115 191.598 L
155.6 185.491 L
153.085 174.859 L
150.569 156.808 L
148.054 128.28 L
145.538 92.122 L
143.023 58.578 L
140.508 39.073 L
137.992 36.858 L
135.477 45.29 L
132.962 54.716 L
130.446 59.002 L
127.931 60.247 L
125.415 59.7 L
122.9 57.965 L
120.385 56.312 L
117.869 55.152 L
115.354 54.276 L
112.838 54.203 L
110.323 54.867 L
107.808 55.471 L
105.292 55.908 L
102.777 56.111 L
100.262 56.094 L
97.746 56.659 L
95.231 57.645 L
92.715 58.951 L
90.2 60.145 L
87.685 60.943 L
85.169 62.173 L
82.654 64.317 L
80.138 67.239 L
77.623 69.884 L
75.108 73.155 L
72.592 77.522 L
70.077 83.008 L
67.562 88.417 L
65.046 93.483 L
62.531 98.652 L
60.015 103.416 L
57.5 107.272 L
57.461 107.333 L
57.461 111.049 L
57.461 111.107 L
57.5 111.046 L
60.015 107.242 L
62.531 102.593 L
65.046 97.449 L
67.562 92.362 L
70.077 86.933 L
72.592 81.487 L
75.108 77.166 L
77.623 73.937 L
80.138 71.266 L
82.654 68.283 L
85.169 66.087 L
87.685 64.773 L
90.2 63.859 L
92.715 62.677 L
95.231 61.394 L
97.746 60.335 L
100.262 59.763 L
102.777 59.765 L
105.292 59.604 L
107.808 59.233 L
110.323 58.685 L
112.838 57.969 L
115.354 58.054 L
117.869 58.867 L
120.385 59.889 L
122.9 61.359 L
125.415 62.996 L
127.931 63.493 L
130.446 62.277 L
132.962 57.972 L
135.477 48.366 L
137.992 39.725 L
140.508 41.746 L
143.023 61.026 L
145.538 94.412 L
148.054 130.403 L
150.569 158.876 L
153.085 176.973 L
155.6 187.705 L
158.115 193.852 L
160.631 197.613 L
163.146 199.749 L
165.662 200.58 L
168.177 201.389 L
cp
f
GR
GS
[1.00046 0 0 1 0 0] CT
0.98 0.91 0.91 RC
1 LJ
0.5 LW
N
57.461 111.107 M
57.5 111.046 L
60.015 107.242 L
62.531 102.593 L
65.046 97.449 L
67.562 92.362 L
70.077 86.933 L
72.592 81.487 L
75.108 77.166 L
77.623 73.937 L
80.138 71.266 L
82.654 68.283 L
85.169 66.087 L
87.685 64.773 L
90.2 63.859 L
92.715 62.677 L
95.231 61.394 L
97.746 60.335 L
100.262 59.763 L
102.777 59.765 L
105.292 59.604 L
107.808 59.233 L
110.323 58.685 L
112.838 57.969 L
115.354 58.054 L
117.869 58.867 L
120.385 59.889 L
122.9 61.359 L
125.415 62.996 L
127.931 63.493 L
130.446 62.277 L
132.962 57.972 L
135.477 48.366 L
137.992 39.725 L
140.508 41.746 L
143.023 61.026 L
145.538 94.412 L
148.054 130.403 L
150.569 158.876 L
153.085 176.973 L
155.6 187.705 L
158.115 193.852 L
160.631 197.613 L
163.146 199.749 L
165.662 200.58 L
168.177 201.389 L
170.692 202.082 L
173.208 202.564 L
175.723 202.762 L
178.238 202.223 L
180.754 201.456 L
183.269 200.609 L
185.785 199.944 L
188.3 199.933 L
190.815 199.825 L
193.331 199.423 L
195.846 198.876 L
198.362 198.932 L
200.877 198.696 L
203.392 198.319 L
205.908 197.983 L
208.423 197.401 L
210.938 196.911 L
213.454 196.194 L
215.969 195.063 L
218.485 194.443 L
221 193.993 L
223.515 193.949 L
226.031 193.407 L
228.546 192.859 L
231.062 192.527 L
233.577 192.501 L
236.092 192.212 L
238.608 192.039 L
241.123 192.061 L
243.638 192.401 L
246.154 192.608 L
248.669 192.441 L
251.185 192.372 L
253.7 192.24 L
256.215 191.792 L
258.731 191.02 L
261.246 190.366 L
263.762 190.449 L
266.277 190.2 L
268.792 189.507 L
271.308 189.339 L
273.823 189.349 L
276.338 189.09 L
278.854 188.826 L
281.369 188.643 L
283.885 188.096 L
286.4 187.358 L
288.915 186.412 L
291.431 184.778 L
293.946 184.369 L
296.462 186.735 L
298.977 191.709 L
301.492 197.071 L
304.008 201.188 L
306.523 202.472 L
309.038 202.136 L
311.554 200.581 L
314.069 197.798 L
316.585 193.432 L
319.1 186.383 L
321.615 176.037 L
324.131 163.327 L
326.646 149.64 L
329.162 135.466 L
331.677 121.509 L
334.192 108.735 L
336.708 98.235 L
339.223 90.277 L
341.738 84.243 L
344.254 78.842 L
346.769 74.381 L
349.285 70.922 L
351.8 68.417 L
354.315 66.25 L
356.831 64.361 L
359.346 62.905 L
361.862 61.362 L
364.377 60.061 L
366.892 58.726 L
369.408 57.387 L
371.923 56.266 L
374.438 55.461 L
376.954 54.632 L
379.469 53.127 L
381.985 51.571 L
384.5 49.86 L
384.539 49.813 L
S
GR
GS
[1.00046 0 0 1 0 0] CT
0.98 0.91 0.91 RC
1 LJ
0.5 LW
N
57.461 107.333 M
57.5 107.272 L
60.015 103.416 L
62.531 98.652 L
65.046 93.483 L
67.562 88.417 L
70.077 83.008 L
72.592 77.522 L
75.108 73.155 L
77.623 69.884 L
80.138 67.239 L
82.654 64.317 L
85.169 62.173 L
87.685 60.943 L
90.2 60.145 L
92.715 58.951 L
95.231 57.645 L
97.746 56.659 L
100.262 56.094 L
102.777 56.111 L
105.292 55.908 L
107.808 55.471 L
110.323 54.867 L
112.838 54.203 L
115.354 54.276 L
117.869 55.152 L
120.385 56.312 L
122.9 57.965 L
125.415 59.7 L
127.931 60.247 L
130.446 59.002 L
132.962 54.716 L
135.477 45.29 L
137.992 36.858 L
140.508 39.073 L
143.023 58.578 L
145.538 92.122 L
148.054 128.28 L
150.569 156.808 L
153.085 174.859 L
155.6 185.491 L
158.115 191.598 L
160.631 195.223 L
163.146 197.247 L
165.662 198.078 L
168.177 198.913 L
170.692 199.589 L
173.208 199.964 L
175.723 200.085 L
178.238 199.498 L
180.754 198.699 L
183.269 197.913 L
185.785 197.245 L
188.3 197.192 L
190.815 197.044 L
193.331 196.527 L
195.846 195.962 L
198.362 195.986 L
200.877 195.797 L
203.392 195.46 L
205.908 195.004 L
208.423 194.296 L
210.938 193.756 L
213.454 192.966 L
215.969 191.804 L
218.485 191.262 L
221 190.892 L
223.515 190.868 L
226.031 190.213 L
228.546 189.637 L
231.062 189.29 L
233.577 189.196 L
236.092 188.865 L
238.608 188.62 L
241.123 188.588 L
243.638 188.967 L
246.154 189.163 L
248.669 188.974 L
251.185 188.931 L
253.7 188.769 L
256.215 188.218 L
258.731 187.358 L
261.246 186.65 L
263.762 186.668 L
266.277 186.352 L
268.792 185.657 L
271.308 185.548 L
273.823 185.673 L
276.338 185.458 L
278.854 185.178 L
281.369 184.906 L
283.885 184.322 L
286.4 183.598 L
288.915 182.756 L
291.431 181.246 L
293.946 180.936 L
296.462 183.365 L
298.977 188.395 L
301.492 193.711 L
304.008 197.668 L
306.523 198.63 L
309.038 197.827 L
311.554 195.781 L
314.069 192.559 L
316.585 187.932 L
319.1 180.76 L
321.615 170.385 L
324.131 157.49 L
326.646 143.536 L
329.162 129.272 L
331.677 115.408 L
334.192 102.782 L
336.708 92.514 L
339.223 84.619 L
341.738 78.59 L
344.254 73.132 L
346.769 68.495 L
349.285 64.859 L
351.8 62.293 L
354.315 60.117 L
356.831 58.245 L
359.346 56.926 L
361.862 55.598 L
364.377 54.525 L
366.892 53.358 L
369.408 52.202 L
371.923 51.253 L
374.438 50.552 L
376.954 49.747 L
379.469 48.292 L
381.985 46.813 L
384.5 45.352 L
384.539 45.309 L
S
GR
GS
[1.00046 0 0 1 0 0] CT
0.961 0.8 0.8 RC
1 LJ
2 LW
N
57.461 109.22 M
57.5 109.159 L
60.015 105.329 L
62.531 100.623 L
65.046 95.466 L
67.562 90.389 L
70.077 84.971 L
72.592 79.505 L
75.108 75.16 L
77.623 71.91 L
80.138 69.253 L
82.654 66.3 L
85.169 64.13 L
87.685 62.858 L
90.2 62.002 L
92.715 60.814 L
95.231 59.519 L
97.746 58.497 L
100.262 57.929 L
102.777 57.938 L
105.292 57.756 L
107.808 57.352 L
110.323 56.776 L
112.838 56.086 L
115.354 56.165 L
117.869 57.01 L
120.385 58.1 L
122.9 59.662 L
125.415 61.348 L
127.931 61.87 L
130.446 60.639 L
132.962 56.344 L
135.477 46.828 L
137.992 38.291 L
140.508 40.41 L
143.023 59.802 L
145.538 93.267 L
148.054 129.342 L
150.569 157.842 L
153.085 175.916 L
155.6 186.598 L
158.115 192.725 L
160.631 196.418 L
163.146 198.498 L
165.662 199.329 L
168.177 200.151 L
170.692 200.836 L
173.208 201.264 L
175.723 201.424 L
178.238 200.861 L
180.754 200.077 L
183.269 199.261 L
185.785 198.594 L
188.3 198.563 L
190.815 198.435 L
193.331 197.975 L
195.846 197.419 L
198.362 197.459 L
200.877 197.247 L
203.392 196.89 L
205.908 196.493 L
208.423 195.849 L
210.938 195.333 L
213.454 194.58 L
215.969 193.433 L
218.485 192.853 L
221 192.443 L
223.515 192.408 L
226.031 191.81 L
228.546 191.248 L
231.062 190.909 L
233.577 190.849 L
236.092 190.539 L
238.608 190.33 L
241.123 190.324 L
243.638 190.684 L
246.154 190.885 L
248.669 190.707 L
251.185 190.651 L
253.7 190.504 L
256.215 190.005 L
258.731 189.189 L
261.246 188.508 L
263.762 188.558 L
266.277 188.276 L
268.792 187.582 L
271.308 187.443 L
273.823 187.511 L
276.338 187.274 L
278.854 187.002 L
281.369 186.774 L
283.885 186.209 L
286.4 185.478 L
288.915 184.584 L
291.431 183.012 L
293.946 182.652 L
296.462 185.05 L
298.977 190.052 L
301.492 195.391 L
304.008 199.428 L
306.523 200.551 L
309.038 199.981 L
311.554 198.181 L
314.069 195.179 L
316.585 190.682 L
319.1 183.572 L
321.615 173.211 L
324.131 160.409 L
326.646 146.588 L
329.162 132.369 L
331.677 118.458 L
334.192 105.758 L
336.708 95.374 L
339.223 87.448 L
341.738 81.416 L
344.254 75.987 L
346.769 71.438 L
349.285 67.89 L
351.8 65.355 L
354.315 63.183 L
356.831 61.303 L
359.346 59.915 L
361.862 58.48 L
364.377 57.293 L
366.892 56.042 L
369.408 54.795 L
371.923 53.759 L
374.438 53.006 L
376.954 52.189 L
379.469 50.709 L
381.985 49.192 L
384.5 47.606 L
384.539 47.561 L
S
GR
GS
[1.00046 0 0 1 0 0] CT
0.99 0.959 0.959 RC
N
168.177 197.491 M
165.662 197.376 L
163.146 196.365 L
160.631 194.092 L
158.115 190.236 L
155.6 183.584 L
153.085 172.899 L
150.569 155.279 L
148.054 127.931 L
145.538 91.671 L
143.023 56.344 L
140.508 34.616 L
137.992 30.378 L
135.477 37.317 L
132.962 45.675 L
130.446 49.307 L
127.931 49.735 L
125.415 49.606 L
122.9 49.35 L
120.385 49.219 L
117.869 48.236 L
115.354 47.42 L
112.838 47.265 L
110.323 47.446 L
107.808 47.749 L
105.292 48.206 L
102.777 48.822 L
100.262 49.787 L
97.746 50.243 L
95.231 50.271 L
92.715 50.609 L
90.2 51.74 L
87.685 53.283 L
85.169 55.26 L
82.654 56.988 L
80.138 59.256 L
77.623 62.272 L
75.108 66.002 L
72.592 71.324 L
70.077 77.972 L
67.562 85.36 L
65.046 92.858 L
62.531 99.884 L
60.015 106.489 L
57.5 113.293 L
57.461 113.405 L
57.461 116.174 L
57.461 116.216 L
57.5 116.105 L
60.015 109.288 L
62.531 102.718 L
65.046 95.828 L
67.562 88.368 L
70.077 80.904 L
72.592 74.205 L
75.108 68.784 L
77.623 64.906 L
80.138 61.762 L
82.654 59.461 L
85.169 57.782 L
87.685 55.761 L
90.2 54.165 L
92.715 53.03 L
95.231 52.757 L
97.746 52.808 L
100.262 52.485 L
102.777 51.692 L
105.292 51.157 L
107.808 50.682 L
110.323 50.353 L
112.838 50.116 L
115.354 50.194 L
117.869 50.978 L
120.385 51.996 L
122.9 52.204 L
125.415 52.517 L
127.931 52.644 L
130.446 52.224 L
132.962 48.57 L
135.477 40.044 L
137.992 32.864 L
140.508 36.883 L
143.023 58.471 L
145.538 93.641 L
148.054 129.809 L
150.569 157.222 L
153.085 174.932 L
155.6 185.681 L
158.115 192.351 L
160.631 196.349 L
163.146 198.587 L
165.662 199.551 L
168.177 199.609 L
170.692 199.339 L
173.208 200.207 L
175.723 201.048 L
178.238 201.247 L
180.754 201.373 L
183.269 201.241 L
185.785 201.475 L
188.3 202.131 L
190.815 202.615 L
193.331 202.312 L
195.846 201.934 L
198.362 202.027 L
200.877 202.054 L
203.392 202.741 L
205.908 203.352 L
208.423 204.404 L
210.938 205.107 L
213.454 205.136 L
215.969 204.777 L
218.485 204.441 L
221 204.159 L
223.515 203.413 L
226.031 202.924 L
228.546 202.25 L
231.062 202.007 L
233.577 202.551 L
236.092 202.71 L
238.608 202.289 L
241.123 201.365 L
243.638 201.078 L
246.154 201.351 L
248.669 201.258 L
251.185 201.142 L
253.7 201.362 L
256.215 201.937 L
258.731 202.121 L
261.246 201.936 L
263.762 201.758 L
266.277 201.489 L
268.792 201.456 L
271.308 201.349 L
273.823 200.904 L
276.338 200.668 L
278.854 200.097 L
281.369 200.019 L
283.885 200.116 L
286.4 199.486 L
288.915 198.069 L
291.431 196.379 L
293.946 195.897 L
296.462 198.238 L
298.977 203.278 L
301.492 210.225 L
304.008 216.023 L
306.523 220.044 L
309.038 223.794 L
311.554 227.274 L
314.069 229.076 L
316.585 227.037 L
319.1 219.591 L
321.615 208.422 L
324.131 194.695 L
326.646 180.313 L
329.162 166.08 L
331.677 152.951 L
334.192 140.093 L
336.708 128.1 L
339.223 116.689 L
341.738 106.433 L
344.254 97.577 L
346.769 90.076 L
349.285 83.735 L
351.8 78.565 L
354.315 74.38 L
356.831 70.781 L
359.346 67.889 L
361.862 65.236 L
364.377 63.151 L
366.892 60.875 L
369.408 58.312 L
371.923 55.618 L
374.438 53.73 L
376.954 52.254 L
379.469 51.109 L
381.985 50.107 L
384.5 48.185 L
384.539 48.128 L
384.539 45.72 L
384.539 45.682 L
384.5 45.739 L
381.985 47.632 L
379.469 48.556 L
376.954 49.581 L
374.438 51.04 L
371.923 52.928 L
369.408 55.652 L
366.892 58.202 L
364.377 60.457 L
361.862 62.478 L
359.346 65.071 L
356.831 67.877 L
354.315 71.442 L
351.8 75.574 L
349.285 80.709 L
346.769 87.038 L
344.254 94.62 L
341.738 103.578 L
339.223 113.899 L
336.708 125.498 L
334.192 137.729 L
331.677 150.89 L
329.162 164.246 L
326.646 178.509 L
324.131 192.921 L
321.615 206.715 L
319.1 217.86 L
316.585 225.285 L
314.069 227.213 L
311.554 225.278 L
309.038 221.807 L
306.523 218.117 L
304.008 214.185 L
301.492 208.326 L
298.977 201.187 L
296.462 195.93 L
293.946 193.54 L
291.431 194.024 L
288.915 195.693 L
286.4 197.139 L
283.885 197.773 L
281.369 197.632 L
278.854 197.581 L
276.338 198.131 L
273.823 198.531 L
271.308 199.082 L
268.792 199.267 L
266.277 199.234 L
263.762 199.438 L
261.246 199.65 L
258.731 199.975 L
256.215 199.919 L
253.7 199.36 L
251.185 199.252 L
248.669 199.458 L
246.154 199.579 L
243.638 199.244 L
241.123 199.363 L
238.608 200.081 L
236.092 200.438 L
233.577 200.265 L
231.062 199.782 L
228.546 200.082 L
226.031 200.785 L
223.515 201.226 L
221 201.927 L
218.485 202.206 L
215.969 202.625 L
213.454 203.083 L
210.938 203.119 L
208.423 202.398 L
205.908 201.322 L
203.392 200.697 L
200.877 199.958 L
198.362 199.902 L
195.846 199.795 L
193.331 200.25 L
190.815 200.633 L
188.3 200.202 L
185.785 199.544 L
183.269 199.266 L
180.754 199.347 L
178.238 199.204 L
175.723 198.965 L
173.208 198.126 L
170.692 197.322 L
cp
f
GR
GS
[1.00046 0 0 1 0 0] CT
0.957 0.82 0.82 RC
1 LJ
0.5 LW
N
57.461 116.216 M
57.5 116.105 L
60.015 109.288 L
62.531 102.718 L
65.046 95.828 L
67.562 88.368 L
70.077 80.904 L
72.592 74.205 L
75.108 68.784 L
77.623 64.906 L
80.138 61.762 L
82.654 59.461 L
85.169 57.782 L
87.685 55.761 L
90.2 54.165 L
92.715 53.03 L
95.231 52.757 L
97.746 52.808 L
100.262 52.485 L
102.777 51.692 L
105.292 51.157 L
107.808 50.682 L
110.323 50.353 L
112.838 50.116 L
115.354 50.194 L
117.869 50.978 L
120.385 51.996 L
122.9 52.204 L
125.415 52.517 L
127.931 52.644 L
130.446 52.224 L
132.962 48.57 L
135.477 40.044 L
137.992 32.864 L
140.508 36.883 L
143.023 58.471 L
145.538 93.641 L
148.054 129.809 L
150.569 157.222 L
153.085 174.932 L
155.6 185.681 L
158.115 192.351 L
160.631 196.349 L
163.146 198.587 L
165.662 199.551 L
168.177 199.609 L
170.692 199.339 L
173.208 200.207 L
175.723 201.048 L
178.238 201.247 L
180.754 201.373 L
183.269 201.241 L
185.785 201.475 L
188.3 202.131 L
190.815 202.615 L
193.331 202.312 L
195.846 201.934 L
198.362 202.027 L
200.877 202.054 L
203.392 202.741 L
205.908 203.352 L
208.423 204.404 L
210.938 205.107 L
213.454 205.136 L
215.969 204.777 L
218.485 204.441 L
221 204.159 L
223.515 203.413 L
226.031 202.924 L
228.546 202.25 L
231.062 202.007 L
233.577 202.551 L
236.092 202.71 L
238.608 202.289 L
241.123 201.365 L
243.638 201.078 L
246.154 201.351 L
248.669 201.258 L
251.185 201.142 L
253.7 201.362 L
256.215 201.937 L
258.731 202.121 L
261.246 201.936 L
263.762 201.758 L
266.277 201.489 L
268.792 201.456 L
271.308 201.349 L
273.823 200.904 L
276.338 200.668 L
278.854 200.097 L
281.369 200.019 L
283.885 200.116 L
286.4 199.486 L
288.915 198.069 L
291.431 196.379 L
293.946 195.897 L
296.462 198.238 L
298.977 203.278 L
301.492 210.225 L
304.008 216.023 L
306.523 220.044 L
309.038 223.794 L
311.554 227.274 L
314.069 229.076 L
316.585 227.037 L
319.1 219.591 L
321.615 208.422 L
324.131 194.695 L
326.646 180.313 L
329.162 166.08 L
331.677 152.951 L
334.192 140.093 L
336.708 128.1 L
339.223 116.689 L
341.738 106.433 L
344.254 97.577 L
346.769 90.076 L
349.285 83.735 L
351.8 78.565 L
354.315 74.38 L
356.831 70.781 L
359.346 67.889 L
361.862 65.236 L
364.377 63.151 L
366.892 60.875 L
369.408 58.312 L
371.923 55.618 L
374.438 53.73 L
376.954 52.254 L
379.469 51.109 L
381.985 50.107 L
384.5 48.185 L
384.539 48.128 L
S
GR
GS
[1.00046 0 0 1 0 0] CT
0.957 0.82 0.82 RC
1 LJ
0.5 LW
N
57.461 113.405 M
57.5 113.293 L
60.015 106.489 L
62.531 99.884 L
65.046 92.858 L
67.562 85.36 L
70.077 77.972 L
72.592 71.324 L
75.108 66.002 L
77.623 62.272 L
80.138 59.256 L
82.654 56.988 L
85.169 55.26 L
87.685 53.283 L
90.2 51.74 L
92.715 50.609 L
95.231 50.271 L
97.746 50.243 L
100.262 49.787 L
102.777 48.822 L
105.292 48.206 L
107.808 47.749 L
110.323 47.446 L
112.838 47.265 L
115.354 47.42 L
117.869 48.236 L
120.385 49.219 L
122.9 49.35 L
125.415 49.606 L
127.931 49.735 L
130.446 49.307 L
132.962 45.675 L
135.477 37.317 L
137.992 30.378 L
140.508 34.616 L
143.023 56.344 L
145.538 91.671 L
148.054 127.931 L
150.569 155.279 L
153.085 172.899 L
155.6 183.584 L
158.115 190.236 L
160.631 194.092 L
163.146 196.365 L
165.662 197.376 L
168.177 197.491 L
170.692 197.322 L
173.208 198.126 L
175.723 198.965 L
178.238 199.204 L
180.754 199.347 L
183.269 199.266 L
185.785 199.544 L
188.3 200.202 L
190.815 200.633 L
193.331 200.25 L
195.846 199.795 L
198.362 199.902 L
200.877 199.958 L
203.392 200.697 L
205.908 201.322 L
208.423 202.398 L
210.938 203.119 L
213.454 203.083 L
215.969 202.625 L
218.485 202.206 L
221 201.927 L
223.515 201.226 L
226.031 200.785 L
228.546 200.082 L
231.062 199.782 L
233.577 200.265 L
236.092 200.438 L
238.608 200.081 L
241.123 199.363 L
243.638 199.244 L
246.154 199.579 L
248.669 199.458 L
251.185 199.252 L
253.7 199.36 L
256.215 199.919 L
258.731 199.975 L
261.246 199.65 L
263.762 199.438 L
266.277 199.234 L
268.792 199.267 L
271.308 199.082 L
273.823 198.531 L
276.338 198.131 L
278.854 197.581 L
281.369 197.632 L
283.885 197.773 L
286.4 197.139 L
288.915 195.693 L
291.431 194.024 L
293.946 193.54 L
296.462 195.93 L
298.977 201.187 L
301.492 208.326 L
304.008 214.185 L
306.523 218.117 L
309.038 221.807 L
311.554 225.278 L
314.069 227.213 L
316.585 225.285 L
319.1 217.86 L
321.615 206.715 L
324.131 192.921 L
326.646 178.509 L
329.162 164.246 L
331.677 150.89 L
334.192 137.729 L
336.708 125.498 L
339.223 113.899 L
341.738 103.578 L
344.254 94.62 L
346.769 87.038 L
349.285 80.709 L
351.8 75.574 L
354.315 71.442 L
356.831 67.877 L
359.346 65.071 L
361.862 62.478 L
364.377 60.457 L
366.892 58.202 L
369.408 55.652 L
371.923 52.928 L
374.438 51.04 L
376.954 49.581 L
379.469 48.556 L
381.985 47.632 L
384.5 45.739 L
384.539 45.682 L
S
GR
GS
[1.00046 0 0 1 0 0] CT
0.898 0.6 0.6 RC
1 LJ
2 LW
N
57.461 114.811 M
57.5 114.699 L
60.015 107.889 L
62.531 101.301 L
65.046 94.343 L
67.562 86.864 L
70.077 79.438 L
72.592 72.765 L
75.108 67.393 L
77.623 63.589 L
80.138 60.509 L
82.654 58.225 L
85.169 56.521 L
87.685 54.522 L
90.2 52.952 L
92.715 51.82 L
95.231 51.514 L
97.746 51.525 L
100.262 51.136 L
102.777 50.257 L
105.292 49.682 L
107.808 49.216 L
110.323 48.9 L
112.838 48.69 L
115.354 48.807 L
117.869 49.607 L
120.385 50.607 L
122.9 50.777 L
125.415 51.061 L
127.931 51.19 L
130.446 50.765 L
132.962 47.122 L
135.477 38.68 L
137.992 31.621 L
140.508 35.75 L
143.023 57.407 L
145.538 92.656 L
148.054 128.87 L
150.569 156.25 L
153.085 173.915 L
155.6 184.633 L
158.115 191.294 L
160.631 195.22 L
163.146 197.476 L
165.662 198.464 L
168.177 198.55 L
170.692 198.33 L
173.208 199.167 L
175.723 200.006 L
178.238 200.226 L
180.754 200.36 L
183.269 200.253 L
185.785 200.509 L
188.3 201.166 L
190.815 201.624 L
193.331 201.281 L
195.846 200.865 L
198.362 200.965 L
200.877 201.006 L
203.392 201.719 L
205.908 202.337 L
208.423 203.401 L
210.938 204.113 L
213.454 204.11 L
215.969 203.701 L
218.485 203.323 L
221 203.043 L
223.515 202.32 L
226.031 201.854 L
228.546 201.166 L
231.062 200.894 L
233.577 201.408 L
236.092 201.574 L
238.608 201.185 L
241.123 200.364 L
243.638 200.161 L
246.154 200.465 L
248.669 200.358 L
251.185 200.197 L
253.7 200.361 L
256.215 200.928 L
258.731 201.048 L
261.246 200.793 L
263.762 200.598 L
266.277 200.361 L
268.792 200.362 L
271.308 200.216 L
273.823 199.718 L
276.338 199.399 L
278.854 198.839 L
281.369 198.825 L
283.885 198.945 L
286.4 198.312 L
288.915 196.881 L
291.431 195.202 L
293.946 194.718 L
296.462 197.084 L
298.977 202.232 L
301.492 209.275 L
304.008 215.104 L
306.523 219.08 L
309.038 222.801 L
311.554 226.276 L
314.069 228.144 L
316.585 226.161 L
319.1 218.726 L
321.615 207.569 L
324.131 193.808 L
326.646 179.411 L
329.162 165.163 L
331.677 151.921 L
334.192 138.911 L
336.708 126.799 L
339.223 115.294 L
341.738 105.005 L
344.254 96.099 L
346.769 88.557 L
349.285 82.222 L
351.8 77.069 L
354.315 72.911 L
356.831 69.329 L
359.346 66.48 L
361.862 63.857 L
364.377 61.804 L
366.892 59.539 L
369.408 56.982 L
371.923 54.273 L
374.438 52.385 L
376.954 50.918 L
379.469 49.832 L
381.985 48.87 L
384.5 46.962 L
384.539 46.905 L
S
GR
GS
[1.00046 0 0 1 0 0] CT
0.98 0.939 0.939 RC
N
168.177 194.744 M
165.662 194.123 L
163.146 193.242 L
160.631 191.85 L
158.115 188.881 L
155.6 182.714 L
153.085 171.832 L
150.569 153.499 L
148.054 124.778 L
145.538 87.809 L
143.023 52.881 L
140.508 31.63 L
137.992 27.483 L
135.477 34.192 L
132.962 41.299 L
130.446 43.293 L
127.931 42.417 L
125.415 40.997 L
122.9 39.732 L
120.385 39.069 L
117.869 38.67 L
115.354 37.83 L
112.838 36.604 L
110.323 35.32 L
107.808 34.846 L
105.292 34.536 L
102.777 34.533 L
100.262 34.523 L
97.746 35.257 L
95.231 36.402 L
92.715 37.371 L
90.2 38.858 L
87.685 40.613 L
85.169 43.034 L
82.654 45.961 L
80.138 49.324 L
77.623 53.367 L
75.108 58.955 L
72.592 65.896 L
70.077 73.945 L
67.562 82.376 L
65.046 90.779 L
62.531 98.816 L
60.015 106.551 L
57.5 114.727 L
57.461 114.854 L
57.461 117.653 L
57.461 117.699 L
57.5 117.571 L
60.015 109.28 L
62.531 101.497 L
65.046 93.455 L
67.562 85.111 L
70.077 76.696 L
72.592 68.727 L
75.108 61.8 L
77.623 56.167 L
80.138 52.142 L
82.654 48.95 L
85.169 46.253 L
87.685 43.886 L
90.2 42.104 L
92.715 40.682 L
95.231 39.742 L
97.746 38.571 L
100.262 37.932 L
102.777 38.011 L
105.292 37.977 L
107.808 38.289 L
110.323 38.855 L
112.838 40.176 L
115.354 41.327 L
117.869 41.996 L
120.385 42.27 L
122.9 42.905 L
125.415 44.171 L
127.931 45.547 L
130.446 46.431 L
132.962 44.449 L
135.477 37.233 L
137.992 30.321 L
140.508 34.301 L
143.023 55.408 L
145.538 90.188 L
148.054 126.983 L
150.569 155.809 L
153.085 174.139 L
155.6 185.02 L
158.115 191.079 L
160.631 193.9 L
163.146 195.268 L
165.662 196.121 L
168.177 196.646 L
170.692 196.661 L
173.208 197.241 L
175.723 198.234 L
178.238 199.114 L
180.754 199.698 L
183.269 200.543 L
185.785 200.968 L
188.3 201.687 L
190.815 201.924 L
193.331 201.282 L
195.846 201.742 L
198.362 201.932 L
200.877 201.347 L
203.392 201.327 L
205.908 201.405 L
208.423 201.351 L
210.938 201.639 L
213.454 201.904 L
215.969 202.313 L
218.485 202.653 L
221 203.059 L
223.515 203.25 L
226.031 203.435 L
228.546 203.494 L
231.062 202.829 L
233.577 202.035 L
236.092 201.354 L
238.608 201.372 L
241.123 201.453 L
243.638 201.963 L
246.154 202.709 L
248.669 202.869 L
251.185 202.502 L
253.7 202.058 L
256.215 201.594 L
258.731 201.54 L
261.246 201.864 L
263.762 202.534 L
266.277 202.801 L
268.792 203.277 L
271.308 203.651 L
273.823 202.995 L
276.338 202.335 L
278.854 202.007 L
281.369 201.919 L
283.885 201.815 L
286.4 201.618 L
288.915 200.7 L
291.431 199.959 L
293.946 199.986 L
296.462 201.828 L
298.977 206.36 L
301.492 212.584 L
304.008 218.465 L
306.523 223.345 L
309.038 227.619 L
311.554 231.509 L
314.069 233.518 L
316.585 232.495 L
319.1 227.944 L
321.615 220.079 L
324.131 209.259 L
326.646 196.567 L
329.162 183.223 L
331.677 169.243 L
334.192 155.68 L
336.708 142.448 L
339.223 130.634 L
341.738 119.579 L
344.254 110.276 L
346.769 101.825 L
349.285 94.386 L
351.8 87.794 L
354.315 82.071 L
356.831 77.69 L
359.346 74.465 L
361.862 72.035 L
364.377 69.459 L
366.892 66.906 L
369.408 63.916 L
371.923 61.708 L
374.438 60.604 L
376.954 58.908 L
379.469 57.107 L
381.985 55.27 L
384.5 53.192 L
384.539 53.122 L
384.539 50.042 L
384.539 49.994 L
384.5 50.064 L
381.985 52.191 L
379.469 54.13 L
376.954 55.978 L
374.438 57.638 L
371.923 58.705 L
369.408 60.807 L
366.892 63.768 L
364.377 66.334 L
361.862 68.955 L
359.346 71.333 L
356.831 74.552 L
354.315 78.979 L
351.8 84.696 L
349.285 91.192 L
346.769 98.604 L
344.254 107.052 L
341.738 116.436 L
339.223 127.577 L
336.708 139.464 L
334.192 152.681 L
331.677 166.15 L
329.162 180.054 L
326.646 193.328 L
324.131 206.082 L
321.615 216.982 L
319.1 225.022 L
316.585 229.723 L
314.069 230.863 L
311.554 229.032 L
309.038 225.241 L
306.523 221.115 L
304.008 216.32 L
301.492 210.372 L
298.977 204.056 L
296.462 199.489 L
293.946 197.531 L
291.431 197.414 L
288.915 198.066 L
286.4 198.798 L
283.885 198.887 L
281.369 199.046 L
278.854 199.184 L
276.338 199.578 L
273.823 200.315 L
271.308 200.976 L
268.792 200.585 L
266.277 200.088 L
263.762 199.769 L
261.246 199.15 L
258.731 198.9 L
256.215 199.094 L
253.7 199.638 L
251.185 200.138 L
248.669 200.581 L
246.154 200.609 L
243.638 199.969 L
241.123 199.561 L
238.608 199.477 L
236.092 199.469 L
233.577 200 L
231.062 200.665 L
228.546 201.216 L
226.031 201.18 L
223.515 201.056 L
221 200.961 L
218.485 200.587 L
215.969 200.367 L
213.454 199.973 L
210.938 199.648 L
208.423 199.365 L
205.908 199.53 L
203.392 199.504 L
200.877 199.485 L
198.362 199.965 L
195.846 199.678 L
193.331 199.212 L
190.815 199.839 L
188.3 199.72 L
185.785 199.14 L
183.269 198.702 L
180.754 197.726 L
178.238 197.04 L
175.723 196.217 L
173.208 195.348 L
170.692 194.82 L
cp
f
GR
GS
[1.00046 0 0 1 0 0] CT
0.91 0.729 0.729 RC
1 LJ
0.5 LW
N
57.461 117.699 M
57.5 117.571 L
60.015 109.28 L
62.531 101.497 L
65.046 93.455 L
67.562 85.111 L
70.077 76.696 L
72.592 68.727 L
75.108 61.8 L
77.623 56.167 L
80.138 52.142 L
82.654 48.95 L
85.169 46.253 L
87.685 43.886 L
90.2 42.104 L
92.715 40.682 L
95.231 39.742 L
97.746 38.571 L
100.262 37.932 L
102.777 38.011 L
105.292 37.977 L
107.808 38.289 L
110.323 38.855 L
112.838 40.176 L
115.354 41.327 L
117.869 41.996 L
120.385 42.27 L
122.9 42.905 L
125.415 44.171 L
127.931 45.547 L
130.446 46.431 L
132.962 44.449 L
135.477 37.233 L
137.992 30.321 L
140.508 34.301 L
143.023 55.408 L
145.538 90.188 L
148.054 126.983 L
150.569 155.809 L
153.085 174.139 L
155.6 185.02 L
158.115 191.079 L
160.631 193.9 L
163.146 195.268 L
165.662 196.121 L
168.177 196.646 L
170.692 196.661 L
173.208 197.241 L
175.723 198.234 L
178.238 199.114 L
180.754 199.698 L
183.269 200.543 L
185.785 200.968 L
188.3 201.687 L
190.815 201.924 L
193.331 201.282 L
195.846 201.742 L
198.362 201.932 L
200.877 201.347 L
203.392 201.327 L
205.908 201.405 L
208.423 201.351 L
210.938 201.639 L
213.454 201.904 L
215.969 202.313 L
218.485 202.653 L
221 203.059 L
223.515 203.25 L
226.031 203.435 L
228.546 203.494 L
231.062 202.829 L
233.577 202.035 L
236.092 201.354 L
238.608 201.372 L
241.123 201.453 L
243.638 201.963 L
246.154 202.709 L
248.669 202.869 L
251.185 202.502 L
253.7 202.058 L
256.215 201.594 L
258.731 201.54 L
261.246 201.864 L
263.762 202.534 L
266.277 202.801 L
268.792 203.277 L
271.308 203.651 L
273.823 202.995 L
276.338 202.335 L
278.854 202.007 L
281.369 201.919 L
283.885 201.815 L
286.4 201.618 L
288.915 200.7 L
291.431 199.959 L
293.946 199.986 L
296.462 201.828 L
298.977 206.36 L
301.492 212.584 L
304.008 218.465 L
306.523 223.345 L
309.038 227.619 L
311.554 231.509 L
314.069 233.518 L
316.585 232.495 L
319.1 227.944 L
321.615 220.079 L
324.131 209.259 L
326.646 196.567 L
329.162 183.223 L
331.677 169.243 L
334.192 155.68 L
336.708 142.448 L
339.223 130.634 L
341.738 119.579 L
344.254 110.276 L
346.769 101.825 L
349.285 94.386 L
351.8 87.794 L
354.315 82.071 L
356.831 77.69 L
359.346 74.465 L
361.862 72.035 L
364.377 69.459 L
366.892 66.906 L
369.408 63.916 L
371.923 61.708 L
374.438 60.604 L
376.954 58.908 L
379.469 57.107 L
381.985 55.27 L
384.5 53.192 L
384.539 53.122 L
S
GR
GS
[1.00046 0 0 1 0 0] CT
0.91 0.729 0.729 RC
1 LJ
0.5 LW
N
57.461 114.854 M
57.5 114.727 L
60.015 106.551 L
62.531 98.816 L
65.046 90.779 L
67.562 82.376 L
70.077 73.945 L
72.592 65.896 L
75.108 58.955 L
77.623 53.367 L
80.138 49.324 L
82.654 45.961 L
85.169 43.034 L
87.685 40.613 L
90.2 38.858 L
92.715 37.371 L
95.231 36.402 L
97.746 35.257 L
100.262 34.523 L
102.777 34.533 L
105.292 34.536 L
107.808 34.846 L
110.323 35.32 L
112.838 36.604 L
115.354 37.83 L
117.869 38.67 L
120.385 39.069 L
122.9 39.732 L
125.415 40.997 L
127.931 42.417 L
130.446 43.293 L
132.962 41.299 L
135.477 34.192 L
137.992 27.483 L
140.508 31.63 L
143.023 52.881 L
145.538 87.809 L
148.054 124.778 L
150.569 153.499 L
153.085 171.832 L
155.6 182.714 L
158.115 188.881 L
160.631 191.85 L
163.146 193.242 L
165.662 194.123 L
168.177 194.744 L
170.692 194.82 L
173.208 195.348 L
175.723 196.217 L
178.238 197.04 L
180.754 197.726 L
183.269 198.702 L
185.785 199.14 L
188.3 199.72 L
190.815 199.839 L
193.331 199.212 L
195.846 199.678 L
198.362 199.965 L
200.877 199.485 L
203.392 199.504 L
205.908 199.53 L
208.423 199.365 L
210.938 199.648 L
213.454 199.973 L
215.969 200.367 L
218.485 200.587 L
221 200.961 L
223.515 201.056 L
226.031 201.18 L
228.546 201.216 L
231.062 200.665 L
233.577 200 L
236.092 199.469 L
238.608 199.477 L
241.123 199.561 L
243.638 199.969 L
246.154 200.609 L
248.669 200.581 L
251.185 200.138 L
253.7 199.638 L
256.215 199.094 L
258.731 198.9 L
261.246 199.15 L
263.762 199.769 L
266.277 200.088 L
268.792 200.585 L
271.308 200.976 L
273.823 200.315 L
276.338 199.578 L
278.854 199.184 L
281.369 199.046 L
283.885 198.887 L
286.4 198.798 L
288.915 198.066 L
291.431 197.414 L
293.946 197.531 L
296.462 199.489 L
298.977 204.056 L
301.492 210.372 L
304.008 216.32 L
306.523 221.115 L
309.038 225.241 L
311.554 229.032 L
314.069 230.863 L
316.585 229.723 L
319.1 225.022 L
321.615 216.982 L
324.131 206.082 L
326.646 193.328 L
329.162 180.054 L
331.677 166.15 L
334.192 152.681 L
336.708 139.464 L
339.223 127.577 L
341.738 116.436 L
344.254 107.052 L
346.769 98.604 L
349.285 91.192 L
351.8 84.696 L
354.315 78.979 L
356.831 74.552 L
359.346 71.333 L
361.862 68.955 L
364.377 66.334 L
366.892 63.768 L
369.408 60.807 L
371.923 58.705 L
374.438 57.638 L
376.954 55.978 L
379.469 54.13 L
381.985 52.191 L
384.5 50.064 L
384.539 49.994 L
S
GR
GS
[1.00046 0 0 1 0 0] CT
0.8 0.4 0.4 RC
1 LJ
2 LW
N
57.461 116.276 M
57.5 116.149 L
60.015 107.915 L
62.531 100.157 L
65.046 92.117 L
67.562 83.743 L
70.077 75.321 L
72.592 67.311 L
75.108 60.377 L
77.623 54.767 L
80.138 50.733 L
82.654 47.455 L
85.169 44.644 L
87.685 42.25 L
90.2 40.481 L
92.715 39.026 L
95.231 38.072 L
97.746 36.914 L
100.262 36.227 L
102.777 36.272 L
105.292 36.256 L
107.808 36.568 L
110.323 37.088 L
112.838 38.39 L
115.354 39.578 L
117.869 40.333 L
120.385 40.67 L
122.9 41.319 L
125.415 42.584 L
127.931 43.982 L
130.446 44.862 L
132.962 42.874 L
135.477 35.713 L
137.992 28.902 L
140.508 32.965 L
143.023 54.144 L
145.538 88.999 L
148.054 125.881 L
150.569 154.654 L
153.085 172.986 L
155.6 183.867 L
158.115 189.98 L
160.631 192.875 L
163.146 194.255 L
165.662 195.122 L
168.177 195.695 L
170.692 195.74 L
173.208 196.294 L
175.723 197.225 L
178.238 198.077 L
180.754 198.712 L
183.269 199.623 L
185.785 200.054 L
188.3 200.704 L
190.815 200.881 L
193.331 200.247 L
195.846 200.71 L
198.362 200.948 L
200.877 200.416 L
203.392 200.415 L
205.908 200.468 L
208.423 200.358 L
210.938 200.643 L
213.454 200.938 L
215.969 201.34 L
218.485 201.62 L
221 202.01 L
223.515 202.153 L
226.031 202.307 L
228.546 202.355 L
231.062 201.747 L
233.577 201.017 L
236.092 200.412 L
238.608 200.425 L
241.123 200.507 L
243.638 200.966 L
246.154 201.659 L
248.669 201.725 L
251.185 201.32 L
253.7 200.848 L
256.215 200.344 L
258.731 200.22 L
261.246 200.507 L
263.762 201.151 L
266.277 201.445 L
268.792 201.931 L
271.308 202.313 L
273.823 201.655 L
276.338 200.956 L
278.854 200.595 L
281.369 200.482 L
283.885 200.351 L
286.4 200.208 L
288.915 199.383 L
291.431 198.687 L
293.946 198.758 L
296.462 200.659 L
298.977 205.208 L
301.492 211.478 L
304.008 217.392 L
306.523 222.23 L
309.038 226.43 L
311.554 230.27 L
314.069 232.19 L
316.585 231.109 L
319.1 226.483 L
321.615 218.53 L
324.131 207.671 L
326.646 194.948 L
329.162 181.639 L
331.677 167.696 L
334.192 154.181 L
336.708 140.956 L
339.223 129.106 L
341.738 118.007 L
344.254 108.664 L
346.769 100.215 L
349.285 92.789 L
351.8 86.245 L
354.315 80.525 L
356.831 76.121 L
359.346 72.899 L
361.862 70.495 L
364.377 67.896 L
366.892 65.337 L
369.408 62.361 L
371.923 60.206 L
374.438 59.121 L
376.954 57.443 L
379.469 55.619 L
381.985 53.73 L
384.5 51.628 L
384.539 51.558 L
S
GR
GS
[1.00046 0 0 1 0 0] CT
0.959 0.918 0.918 RC
N
165.662 194.867 M
163.146 194.045 L
160.631 192.626 L
158.115 188.432 L
155.6 181.186 L
153.085 169.595 L
150.569 150.636 L
148.054 122.097 L
145.538 85.194 L
143.023 50.376 L
140.508 28.475 L
137.992 23.696 L
135.477 29.621 L
132.962 36.873 L
130.446 39.492 L
127.931 39.473 L
125.415 38.58 L
122.9 37.751 L
120.385 37.261 L
117.869 36.639 L
115.354 36.042 L
112.838 35.16 L
110.323 35.004 L
107.808 34.805 L
105.292 34.667 L
102.777 34.604 L
100.262 34.323 L
97.746 34.299 L
95.231 33.964 L
92.715 34.18 L
90.2 34.635 L
87.685 36.495 L
85.169 39.646 L
82.654 43.276 L
80.138 47.181 L
77.623 51.85 L
75.108 58.175 L
72.592 65.395 L
70.077 73.458 L
67.562 81.426 L
65.046 90.238 L
62.531 98.948 L
60.015 107.251 L
57.5 114.688 L
57.461 114.8 L
57.461 117.862 L
57.461 117.908 L
57.5 117.798 L
60.015 110.422 L
62.531 102.253 L
65.046 93.673 L
67.562 84.993 L
70.077 77.096 L
72.592 69.04 L
75.108 61.758 L
77.623 55.419 L
80.138 50.592 L
82.654 46.479 L
85.169 42.727 L
87.685 39.507 L
90.2 37.629 L
92.715 37.272 L
95.231 37.099 L
97.746 37.422 L
100.262 37.535 L
102.777 37.912 L
105.292 38.076 L
107.808 38.235 L
110.323 38.571 L
112.838 38.794 L
115.354 39.642 L
117.869 40.114 L
120.385 40.58 L
122.9 40.885 L
125.415 41.575 L
127.931 42.409 L
130.446 42.454 L
132.962 39.786 L
135.477 32.399 L
137.992 26.193 L
140.508 30.774 L
143.023 52.542 L
145.538 87.303 L
148.054 124.198 L
150.569 152.782 L
153.085 171.727 L
155.6 183.284 L
158.115 190.401 L
160.631 194.423 L
163.146 195.834 L
165.662 196.797 L
168.177 197.531 L
170.692 197.893 L
173.208 197.993 L
175.723 197.843 L
178.238 197.603 L
180.754 197.613 L
183.269 198.356 L
185.785 198.832 L
188.3 199.382 L
190.815 199.599 L
193.331 200.034 L
195.846 200.325 L
198.362 200.191 L
200.877 200.495 L
203.392 201.173 L
205.908 201.823 L
208.423 202.351 L
210.938 202.537 L
213.454 202.968 L
215.969 202.696 L
218.485 202.738 L
221 202.901 L
223.515 203.291 L
226.031 203.34 L
228.546 203.008 L
231.062 202.957 L
233.577 202.727 L
236.092 202.488 L
238.608 202.81 L
241.123 203.696 L
243.638 203.995 L
246.154 203.695 L
248.669 203.622 L
251.185 204.015 L
253.7 204.696 L
256.215 205.015 L
258.731 204.925 L
261.246 204.045 L
263.762 203.358 L
266.277 202.665 L
268.792 202.014 L
271.308 202.028 L
273.823 202.127 L
276.338 202.25 L
278.854 202.335 L
281.369 202.588 L
283.885 202.73 L
286.4 203.071 L
288.915 202.462 L
291.431 200.074 L
293.946 198.79 L
296.462 200.88 L
298.977 205.844 L
301.492 212.432 L
304.008 218.555 L
306.523 223.782 L
309.038 228.977 L
311.554 234.349 L
314.069 238.43 L
316.585 238.882 L
319.1 234.702 L
321.615 225.872 L
324.131 214.53 L
326.646 201.841 L
329.162 188.084 L
331.677 174.525 L
334.192 161.126 L
336.708 148.141 L
339.223 135.973 L
341.738 125.111 L
344.254 115.614 L
346.769 107.393 L
349.285 100.638 L
351.8 94.804 L
354.315 89.571 L
356.831 85.556 L
359.346 81.986 L
361.862 78.421 L
364.377 75.012 L
366.892 71.634 L
369.408 68.738 L
371.923 66.704 L
374.438 64.965 L
376.954 62.978 L
379.469 60.549 L
381.985 57.585 L
384.5 54.686 L
384.539 54.628 L
384.539 51.153 L
384.539 51.102 L
384.5 51.157 L
381.985 53.841 L
379.469 56.65 L
376.954 58.993 L
374.438 60.961 L
371.923 62.734 L
369.408 64.894 L
366.892 67.767 L
364.377 70.978 L
361.862 74.249 L
359.346 77.826 L
356.831 81.514 L
354.315 85.617 L
351.8 90.882 L
349.285 96.811 L
346.769 103.649 L
344.254 111.875 L
341.738 121.302 L
339.223 132.139 L
336.708 144.249 L
334.192 157.167 L
331.677 170.605 L
329.162 184.215 L
326.646 198.106 L
324.131 210.922 L
321.615 222.271 L
319.1 231.081 L
316.585 235.367 L
314.069 235.144 L
311.554 231.423 L
309.038 226.329 L
306.523 221.28 L
304.008 216.045 L
301.492 209.912 L
298.977 203.259 L
296.462 198.08 L
293.946 195.871 L
291.431 197.212 L
288.915 199.587 L
286.4 200.143 L
283.885 199.891 L
281.369 199.858 L
278.854 199.678 L
276.338 199.571 L
273.823 199.562 L
271.308 199.504 L
268.792 199.518 L
266.277 200.184 L
263.762 200.835 L
261.246 201.481 L
258.731 202.329 L
256.215 202.384 L
253.7 202.134 L
251.185 201.575 L
248.669 201.287 L
246.154 201.34 L
243.638 201.528 L
241.123 201.198 L
238.608 200.381 L
236.092 200.064 L
233.577 200.25 L
231.062 200.453 L
228.546 200.426 L
226.031 200.815 L
223.515 200.842 L
221 200.46 L
218.485 200.397 L
215.969 200.509 L
213.454 200.91 L
210.938 200.494 L
208.423 200.264 L
205.908 199.669 L
203.392 199.007 L
200.877 198.385 L
198.362 198.053 L
195.846 198.193 L
193.331 198.031 L
190.815 197.612 L
188.3 197.304 L
185.785 196.707 L
183.269 196.259 L
180.754 195.612 L
178.238 195.638 L
175.723 195.911 L
173.208 196.057 L
170.692 195.864 L
168.177 195.505 L
cp
f
GR
GS
[1.00046 0 0 1 0 0] CT
0.82 0.639 0.639 RC
1 LJ
0.5 LW
N
57.461 117.908 M
57.5 117.798 L
60.015 110.422 L
62.531 102.253 L
65.046 93.673 L
67.562 84.993 L
70.077 77.096 L
72.592 69.04 L
75.108 61.758 L
77.623 55.419 L
80.138 50.592 L
82.654 46.479 L
85.169 42.727 L
87.685 39.507 L
90.2 37.629 L
92.715 37.272 L
95.231 37.099 L
97.746 37.422 L
100.262 37.535 L
102.777 37.912 L
105.292 38.076 L
107.808 38.235 L
110.323 38.571 L
112.838 38.794 L
115.354 39.642 L
117.869 40.114 L
120.385 40.58 L
122.9 40.885 L
125.415 41.575 L
127.931 42.409 L
130.446 42.454 L
132.962 39.786 L
135.477 32.399 L
137.992 26.193 L
140.508 30.774 L
143.023 52.542 L
145.538 87.303 L
148.054 124.198 L
150.569 152.782 L
153.085 171.727 L
155.6 183.284 L
158.115 190.401 L
160.631 194.423 L
163.146 195.834 L
165.662 196.797 L
168.177 197.531 L
170.692 197.893 L
173.208 197.993 L
175.723 197.843 L
178.238 197.603 L
180.754 197.613 L
183.269 198.356 L
185.785 198.832 L
188.3 199.382 L
190.815 199.599 L
193.331 200.034 L
195.846 200.325 L
198.362 200.191 L
200.877 200.495 L
203.392 201.173 L
205.908 201.823 L
208.423 202.351 L
210.938 202.537 L
213.454 202.968 L
215.969 202.696 L
218.485 202.738 L
221 202.901 L
223.515 203.291 L
226.031 203.34 L
228.546 203.008 L
231.062 202.957 L
233.577 202.727 L
236.092 202.488 L
238.608 202.81 L
241.123 203.696 L
243.638 203.995 L
246.154 203.695 L
248.669 203.622 L
251.185 204.015 L
253.7 204.696 L
256.215 205.015 L
258.731 204.925 L
261.246 204.045 L
263.762 203.358 L
266.277 202.665 L
268.792 202.014 L
271.308 202.028 L
273.823 202.127 L
276.338 202.25 L
278.854 202.335 L
281.369 202.588 L
283.885 202.73 L
286.4 203.071 L
288.915 202.462 L
291.431 200.074 L
293.946 198.79 L
296.462 200.88 L
298.977 205.844 L
301.492 212.432 L
304.008 218.555 L
306.523 223.782 L
309.038 228.977 L
311.554 234.349 L
314.069 238.43 L
316.585 238.882 L
319.1 234.702 L
321.615 225.872 L
324.131 214.53 L
326.646 201.841 L
329.162 188.084 L
331.677 174.525 L
334.192 161.126 L
336.708 148.141 L
339.223 135.973 L
341.738 125.111 L
344.254 115.614 L
346.769 107.393 L
349.285 100.638 L
351.8 94.804 L
354.315 89.571 L
356.831 85.556 L
359.346 81.986 L
361.862 78.421 L
364.377 75.012 L
366.892 71.634 L
369.408 68.738 L
371.923 66.704 L
374.438 64.965 L
376.954 62.978 L
379.469 60.549 L
381.985 57.585 L
384.5 54.686 L
384.539 54.628 L
S
GR
GS
[1.00046 0 0 1 0 0] CT
0.82 0.639 0.639 RC
1 LJ
0.5 LW
N
57.461 114.8 M
57.5 114.688 L
60.015 107.251 L
62.531 98.948 L
65.046 90.238 L
67.562 81.426 L
70.077 73.458 L
72.592 65.395 L
75.108 58.175 L
77.623 51.85 L
80.138 47.181 L
82.654 43.276 L
85.169 39.646 L
87.685 36.495 L
90.2 34.635 L
92.715 34.18 L
95.231 33.964 L
97.746 34.299 L
100.262 34.323 L
102.777 34.604 L
105.292 34.667 L
107.808 34.805 L
110.323 35.004 L
112.838 35.16 L
115.354 36.042 L
117.869 36.639 L
120.385 37.261 L
122.9 37.751 L
125.415 38.58 L
127.931 39.473 L
130.446 39.492 L
132.962 36.873 L
135.477 29.621 L
137.992 23.696 L
140.508 28.475 L
143.023 50.376 L
145.538 85.194 L
148.054 122.097 L
150.569 150.636 L
153.085 169.595 L
155.6 181.186 L
158.115 188.432 L
160.631 192.626 L
163.146 194.045 L
165.662 194.867 L
168.177 195.505 L
170.692 195.864 L
173.208 196.057 L
175.723 195.911 L
178.238 195.638 L
180.754 195.612 L
183.269 196.259 L
185.785 196.707 L
188.3 197.304 L
190.815 197.612 L
193.331 198.031 L
195.846 198.193 L
198.362 198.053 L
200.877 198.385 L
203.392 199.007 L
205.908 199.669 L
208.423 200.264 L
210.938 200.494 L
213.454 200.91 L
215.969 200.509 L
218.485 200.397 L
221 200.46 L
223.515 200.842 L
226.031 200.815 L
228.546 200.426 L
231.062 200.453 L
233.577 200.25 L
236.092 200.064 L
238.608 200.381 L
241.123 201.198 L
243.638 201.528 L
246.154 201.34 L
248.669 201.287 L
251.185 201.575 L
253.7 202.134 L
256.215 202.384 L
258.731 202.329 L
261.246 201.481 L
263.762 200.835 L
266.277 200.184 L
268.792 199.518 L
271.308 199.504 L
273.823 199.562 L
276.338 199.571 L
278.854 199.678 L
281.369 199.858 L
283.885 199.891 L
286.4 200.143 L
288.915 199.587 L
291.431 197.212 L
293.946 195.871 L
296.462 198.08 L
298.977 203.259 L
301.492 209.912 L
304.008 216.045 L
306.523 221.28 L
309.038 226.329 L
311.554 231.423 L
314.069 235.144 L
316.585 235.367 L
319.1 231.081 L
321.615 222.271 L
324.131 210.922 L
326.646 198.106 L
329.162 184.215 L
331.677 170.605 L
334.192 157.167 L
336.708 144.249 L
339.223 132.139 L
341.738 121.302 L
344.254 111.875 L
346.769 103.649 L
349.285 96.811 L
351.8 90.882 L
354.315 85.617 L
356.831 81.514 L
359.346 77.826 L
361.862 74.249 L
364.377 70.978 L
366.892 67.767 L
369.408 64.894 L
371.923 62.734 L
374.438 60.961 L
376.954 58.993 L
379.469 56.65 L
381.985 53.841 L
384.5 51.157 L
384.539 51.102 L
S
GR
GS
[1.00046 0 0 1 0 0] CT
0.6 0.2 0.2 RC
1 LJ
2 LW
N
57.461 116.354 M
57.5 116.243 L
60.015 108.836 L
62.531 100.6 L
65.046 91.955 L
67.562 83.21 L
70.077 75.277 L
72.592 67.218 L
75.108 59.966 L
77.623 53.634 L
80.138 48.886 L
82.654 44.878 L
85.169 41.187 L
87.685 38.001 L
90.2 36.132 L
92.715 35.726 L
95.231 35.531 L
97.746 35.86 L
100.262 35.929 L
102.777 36.258 L
105.292 36.372 L
107.808 36.52 L
110.323 36.787 L
112.838 36.977 L
115.354 37.842 L
117.869 38.377 L
120.385 38.92 L
122.9 39.318 L
125.415 40.078 L
127.931 40.941 L
130.446 40.973 L
132.962 38.33 L
135.477 31.01 L
137.992 24.944 L
140.508 29.624 L
143.023 51.459 L
145.538 86.249 L
148.054 123.147 L
150.569 151.709 L
153.085 170.661 L
155.6 182.235 L
158.115 189.417 L
160.631 193.525 L
163.146 194.939 L
165.662 195.832 L
168.177 196.518 L
170.692 196.878 L
173.208 197.025 L
175.723 196.877 L
178.238 196.621 L
180.754 196.613 L
183.269 197.308 L
185.785 197.769 L
188.3 198.343 L
190.815 198.605 L
193.331 199.032 L
195.846 199.259 L
198.362 199.122 L
200.877 199.44 L
203.392 200.09 L
205.908 200.746 L
208.423 201.307 L
210.938 201.515 L
213.454 201.939 L
215.969 201.603 L
218.485 201.567 L
221 201.681 L
223.515 202.067 L
226.031 202.078 L
228.546 201.717 L
231.062 201.705 L
233.577 201.489 L
236.092 201.276 L
238.608 201.595 L
241.123 202.447 L
243.638 202.761 L
246.154 202.517 L
248.669 202.455 L
251.185 202.795 L
253.7 203.415 L
256.215 203.7 L
258.731 203.627 L
261.246 202.763 L
263.762 202.097 L
266.277 201.424 L
268.792 200.766 L
271.308 200.766 L
273.823 200.845 L
276.338 200.911 L
278.854 201.006 L
281.369 201.223 L
283.885 201.311 L
286.4 201.607 L
288.915 201.024 L
291.431 198.643 L
293.946 197.33 L
296.462 199.48 L
298.977 204.551 L
301.492 211.172 L
304.008 217.3 L
306.523 222.531 L
309.038 227.653 L
311.554 232.886 L
314.069 236.787 L
316.585 237.124 L
319.1 232.892 L
321.615 224.071 L
324.131 212.726 L
326.646 199.974 L
329.162 186.149 L
331.677 172.565 L
334.192 159.146 L
336.708 146.195 L
339.223 134.056 L
341.738 123.207 L
344.254 113.745 L
346.769 105.521 L
349.285 98.724 L
351.8 92.843 L
354.315 87.594 L
356.831 83.535 L
359.346 79.906 L
361.862 76.335 L
364.377 72.995 L
366.892 69.701 L
369.408 66.816 L
371.923 64.719 L
374.438 62.963 L
376.954 60.986 L
379.469 58.6 L
381.985 55.713 L
384.5 52.921 L
384.539 52.865 L
S
GR
%%Trailer
%%Pages: 1
%%EOF
