%!PS-Adobe-3.0 EPSF-3.0
%%Creator: (MATLAB, The Mathworks, Inc. Version 9.10.0.1602886 \(R2021a\). Operating System: Mac OS X)
%%Title: /Users/kosciessa/Desktop/tardis/LNDG/stateswitch/stsw_eeg_task/tfr/figures/b01_alphaTraces_stim_yaoa.eps
%%CreationDate: 2022-02-22T16:21:56
%%Pages: (atend)
%%BoundingBox:     2     0   388   266
%%LanguageLevel: 3
%%EndComments
%%BeginProlog
%%BeginResource: procset (Apache XML Graphics Std ProcSet) 1.2 0
%%Version: 1.2 0
%%Copyright: (Copyright 2001-2003,2010 The Apache Software Foundation. License terms: http://www.apache.org/licenses/LICENSE-2.0)
/bd{bind def}bind def
/ld{load def}bd
/GR/grestore ld
/GS/gsave ld
/RM/rmoveto ld
/C/curveto ld
/t/show ld
/L/lineto ld
/ML/setmiterlimit ld
/CT/concat ld
/f/fill ld
/N/newpath ld
/S/stroke ld
/CC/setcmykcolor ld
/A/ashow ld
/cp/closepath ld
/RC/setrgbcolor ld
/LJ/setlinejoin ld
/GC/setgray ld
/LW/setlinewidth ld
/M/moveto ld
/re {4 2 roll M
1 index 0 rlineto
0 exch rlineto
neg 0 rlineto
cp } bd
/_ctm matrix def
/_tm matrix def
/BT { _ctm currentmatrix pop matrix _tm copy pop 0 0 moveto } bd
/ET { _ctm setmatrix } bd
/iTm { _ctm setmatrix _tm concat } bd
/Tm { _tm astore pop iTm 0 0 moveto } bd
/ux 0.0 def
/uy 0.0 def
/F {
  /Tp exch def
  /Tf exch def
  Tf findfont Tp scalefont setfont
  /cf Tf def  /cs Tp def
} bd
/ULS {currentpoint /uy exch def /ux exch def} bd
/ULE {
  /Tcx currentpoint pop def
  gsave
  newpath
  cf findfont cs scalefont dup
  /FontMatrix get 0 get /Ts exch def /FontInfo get dup
  /UnderlinePosition get Ts mul /To exch def
  /UnderlineThickness get Ts mul /Tt exch def
  ux uy To add moveto  Tcx uy To add lineto
  Tt setlinewidth stroke
  grestore
} bd
/OLE {
  /Tcx currentpoint pop def
  gsave
  newpath
  cf findfont cs scalefont dup
  /FontMatrix get 0 get /Ts exch def /FontInfo get dup
  /UnderlinePosition get Ts mul /To exch def
  /UnderlineThickness get Ts mul /Tt exch def
  ux uy To add cs add moveto Tcx uy To add cs add lineto
  Tt setlinewidth stroke
  grestore
} bd
/SOE {
  /Tcx currentpoint pop def
  gsave
  newpath
  cf findfont cs scalefont dup
  /FontMatrix get 0 get /Ts exch def /FontInfo get dup
  /UnderlinePosition get Ts mul /To exch def
  /UnderlineThickness get Ts mul /Tt exch def
  ux uy To add cs 10 mul 26 idiv add moveto Tcx uy To add cs 10 mul 26 idiv add lineto
  Tt setlinewidth stroke
  grestore
} bd
/QT {
/Y22 exch store
/X22 exch store
/Y21 exch store
/X21 exch store
currentpoint
/Y21 load 2 mul add 3 div exch
/X21 load 2 mul add 3 div exch
/X21 load 2 mul /X22 load add 3 div
/Y21 load 2 mul /Y22 load add 3 div
/X22 load /Y22 load curveto
} bd
/SSPD {
dup length /d exch dict def
{
/v exch def
/k exch def
currentpagedevice k known {
/cpdv currentpagedevice k get def
v cpdv ne {
/upd false def
/nullv v type /nulltype eq def
/nullcpdv cpdv type /nulltype eq def
nullv nullcpdv or
{
/upd true def
} {
/sametype v type cpdv type eq def
sametype {
v type /arraytype eq {
/vlen v length def
/cpdvlen cpdv length def
vlen cpdvlen eq {
0 1 vlen 1 sub {
/i exch def
/obj v i get def
/cpdobj cpdv i get def
obj cpdobj ne {
/upd true def
exit
} if
} for
} {
/upd true def
} ifelse
} {
v type /dicttype eq {
v {
/dv exch def
/dk exch def
/cpddv cpdv dk get def
dv cpddv ne {
/upd true def
exit
} if
} forall
} {
/upd true def
} ifelse
} ifelse
} if
} ifelse
upd true eq {
d k v put
} if
} if
} if
} forall
d length 0 gt {
d setpagedevice
} if
} bd
/RE { % /NewFontName [NewEncodingArray] /FontName RE -
  findfont dup length dict begin
  {
    1 index /FID ne
    {def} {pop pop} ifelse
  } forall
  /Encoding exch def
  /FontName 1 index def
  currentdict definefont pop
  end
} bind def
%%EndResource
%%BeginResource: procset (Apache XML Graphics EPS ProcSet) 1.0 0
%%Version: 1.0 0
%%Copyright: (Copyright 2002-2003 The Apache Software Foundation. License terms: http://www.apache.org/licenses/LICENSE-2.0)
/BeginEPSF { %def
/b4_Inc_state save def         % Save state for cleanup
/dict_count countdictstack def % Count objects on dict stack
/op_count count 1 sub def      % Count objects on operand stack
userdict begin                 % Push userdict on dict stack
/showpage { } def              % Redefine showpage, { } = null proc
0 setgray 0 setlinecap         % Prepare graphics state
1 setlinewidth 0 setlinejoin
10 setmiterlimit [ ] 0 setdash newpath
/languagelevel where           % If level not equal to 1 then
{pop languagelevel             % set strokeadjust and
1 ne                           % overprint to their defaults.
{false setstrokeadjust false setoverprint
} if
} if
} bd
/EndEPSF { %def
count op_count sub {pop} repeat            % Clean up stacks
countdictstack dict_count sub {end} repeat
b4_Inc_state restore
} bd
%%EndResource
%FOPBeginFontDict
%%IncludeResource: font Courier-Oblique
%%IncludeResource: font Courier-BoldOblique
%%IncludeResource: font Courier-Bold
%%IncludeResource: font ZapfDingbats
%%IncludeResource: font Symbol
%%IncludeResource: font Helvetica
%%IncludeResource: font Helvetica-Oblique
%%IncludeResource: font Helvetica-Bold
%%IncludeResource: font Helvetica-BoldOblique
%%IncludeResource: font Times-Roman
%%IncludeResource: font Times-Italic
%%IncludeResource: font Times-Bold
%%IncludeResource: font Times-BoldItalic
%%IncludeResource: font Courier
%FOPEndFontDict
%%BeginResource: encoding WinAnsiEncoding
/WinAnsiEncoding [
/.notdef /.notdef /.notdef /.notdef /.notdef
/.notdef /.notdef /.notdef /.notdef /.notdef
/.notdef /.notdef /.notdef /.notdef /.notdef
/.notdef /.notdef /.notdef /.notdef /.notdef
/.notdef /.notdef /.notdef /.notdef /.notdef
/.notdef /.notdef /.notdef /.notdef /.notdef
/.notdef /.notdef /space /exclam /quotedbl
/numbersign /dollar /percent /ampersand /quotesingle
/parenleft /parenright /asterisk /plus /comma
/hyphen /period /slash /zero /one
/two /three /four /five /six
/seven /eight /nine /colon /semicolon
/less /equal /greater /question /at
/A /B /C /D /E
/F /G /H /I /J
/K /L /M /N /O
/P /Q /R /S /T
/U /V /W /X /Y
/Z /bracketleft /backslash /bracketright /asciicircum
/underscore /quoteleft /a /b /c
/d /e /f /g /h
/i /j /k /l /m
/n /o /p /q /r
/s /t /u /v /w
/x /y /z /braceleft /bar
/braceright /asciitilde /bullet /Euro /bullet
/quotesinglbase /florin /quotedblbase /ellipsis /dagger
/daggerdbl /circumflex /perthousand /Scaron /guilsinglleft
/OE /bullet /Zcaron /bullet /bullet
/quoteleft /quoteright /quotedblleft /quotedblright /bullet
/endash /emdash /asciitilde /trademark /scaron
/guilsinglright /oe /bullet /zcaron /Ydieresis
/space /exclamdown /cent /sterling /currency
/yen /brokenbar /section /dieresis /copyright
/ordfeminine /guillemotleft /logicalnot /sfthyphen /registered
/macron /degree /plusminus /twosuperior /threesuperior
/acute /mu /paragraph /middot /cedilla
/onesuperior /ordmasculine /guillemotright /onequarter /onehalf
/threequarters /questiondown /Agrave /Aacute /Acircumflex
/Atilde /Adieresis /Aring /AE /Ccedilla
/Egrave /Eacute /Ecircumflex /Edieresis /Igrave
/Iacute /Icircumflex /Idieresis /Eth /Ntilde
/Ograve /Oacute /Ocircumflex /Otilde /Odieresis
/multiply /Oslash /Ugrave /Uacute /Ucircumflex
/Udieresis /Yacute /Thorn /germandbls /agrave
/aacute /acircumflex /atilde /adieresis /aring
/ae /ccedilla /egrave /eacute /ecircumflex
/edieresis /igrave /iacute /icircumflex /idieresis
/eth /ntilde /ograve /oacute /ocircumflex
/otilde /odieresis /divide /oslash /ugrave
/uacute /ucircumflex /udieresis /yacute /thorn
/ydieresis
] def
%%EndResource
%FOPBeginFontReencode
/Courier-Oblique findfont
dup length dict begin
  {1 index /FID ne {def} {pop pop} ifelse} forall
  /Encoding WinAnsiEncoding def
  currentdict
end
/Courier-Oblique exch definefont pop
/Courier-BoldOblique findfont
dup length dict begin
  {1 index /FID ne {def} {pop pop} ifelse} forall
  /Encoding WinAnsiEncoding def
  currentdict
end
/Courier-BoldOblique exch definefont pop
/Courier-Bold findfont
dup length dict begin
  {1 index /FID ne {def} {pop pop} ifelse} forall
  /Encoding WinAnsiEncoding def
  currentdict
end
/Courier-Bold exch definefont pop
/Helvetica findfont
dup length dict begin
  {1 index /FID ne {def} {pop pop} ifelse} forall
  /Encoding WinAnsiEncoding def
  currentdict
end
/Helvetica exch definefont pop
/Helvetica-Oblique findfont
dup length dict begin
  {1 index /FID ne {def} {pop pop} ifelse} forall
  /Encoding WinAnsiEncoding def
  currentdict
end
/Helvetica-Oblique exch definefont pop
/Helvetica-Bold findfont
dup length dict begin
  {1 index /FID ne {def} {pop pop} ifelse} forall
  /Encoding WinAnsiEncoding def
  currentdict
end
/Helvetica-Bold exch definefont pop
/Helvetica-BoldOblique findfont
dup length dict begin
  {1 index /FID ne {def} {pop pop} ifelse} forall
  /Encoding WinAnsiEncoding def
  currentdict
end
/Helvetica-BoldOblique exch definefont pop
/Times-Roman findfont
dup length dict begin
  {1 index /FID ne {def} {pop pop} ifelse} forall
  /Encoding WinAnsiEncoding def
  currentdict
end
/Times-Roman exch definefont pop
/Times-Italic findfont
dup length dict begin
  {1 index /FID ne {def} {pop pop} ifelse} forall
  /Encoding WinAnsiEncoding def
  currentdict
end
/Times-Italic exch definefont pop
/Times-Bold findfont
dup length dict begin
  {1 index /FID ne {def} {pop pop} ifelse} forall
  /Encoding WinAnsiEncoding def
  currentdict
end
/Times-Bold exch definefont pop
/Times-BoldItalic findfont
dup length dict begin
  {1 index /FID ne {def} {pop pop} ifelse} forall
  /Encoding WinAnsiEncoding def
  currentdict
end
/Times-BoldItalic exch definefont pop
/Courier findfont
dup length dict begin
  {1 index /FID ne {def} {pop pop} ifelse} forall
  /Encoding WinAnsiEncoding def
  currentdict
end
/Courier exch definefont pop
%FOPEndFontReencode
%%EndProlog
%%Page: 1 1
%%PageBoundingBox: 0 0 425 283
%%BeginPageSetup
[1 0 0 -1 0 283] CT
%%EndPageSetup
GS
[1.00046 0 0 1 0 0] CT
1 GC
N
0 0 425 283 re
f
GR
GS
[1.00046 0 0 1 0 0] CT
1 GC
N
0 0 425 283 re
f
GR
GS
[1.00046 0 0 1 0 0] CT
1 GC
N
64.5 248.5 M
384.5 248.5 L
384.5 21 L
64.5 21 L
cp
f
GR
GS
[1.00046 0 0 1 0 0] CT
0.149 GC
2 setlinecap
1 LJ
0.5 LW
N
64.5 248.5 M
384.5 248.5 L
S
GR
GS
[1.00046 0 0 1 0 0] CT
0.149 GC
2 setlinecap
1 LJ
0.5 LW
N
64.5 248.5 M
64.5 245.304 L
S
GR
GS
[1.00046 0 0 1 0 0] CT
0.149 GC
2 setlinecap
1 LJ
0.5 LW
N
128.5 248.5 M
128.5 245.304 L
S
GR
GS
[1.00046 0 0 1 0 0] CT
0.149 GC
2 setlinecap
1 LJ
0.5 LW
N
192.5 248.5 M
192.5 245.304 L
S
GR
GS
[1.00046 0 0 1 0 0] CT
0.149 GC
2 setlinecap
1 LJ
0.5 LW
N
256.5 248.5 M
256.5 245.304 L
S
GR
GS
[1.00046 0 0 1 0 0] CT
0.149 GC
2 setlinecap
1 LJ
0.5 LW
N
320.5 248.5 M
320.5 245.304 L
S
GR
GS
[1.00046 0 0 1 0 0] CT
0.149 GC
2 setlinecap
1 LJ
0.5 LW
N
384.5 248.5 M
384.5 245.304 L
S
GR
GS
[1.00046 0 0 1 64.52987 252.89929] CT
0.149 GC
/Helvetica 12 F
GS
[1 0 0 1 0 0] CT
-8.5 12 moveto 
1 -1 scale
(0.5) t 
GR
GR
GS
[1.00046 0 0 1 128.55951 252.89929] CT
0.149 GC
/Helvetica 12 F
GS
[1 0 0 1 0 0] CT
-3.5 12 moveto 
1 -1 scale
(1) t 
GR
GR
GS
[1.00046 0 0 1 192.58916 252.89929] CT
0.149 GC
/Helvetica 12 F
GS
[1 0 0 1 0 0] CT
-8.5 12 moveto 
1 -1 scale
(1.5) t 
GR
GR
GS
[1.00046 0 0 1 256.6188 252.89929] CT
0.149 GC
/Helvetica 12 F
GS
[1 0 0 1 0 0] CT
-3.5 12 moveto 
1 -1 scale
(2) t 
GR
GR
GS
[1.00046 0 0 1 320.64844 252.89929] CT
0.149 GC
/Helvetica 12 F
GS
[1 0 0 1 0 0] CT
-8.5 12 moveto 
1 -1 scale
(2.5) t 
GR
GR
GS
[1.00046 0 0 1 384.67808 252.89929] CT
0.149 GC
/Helvetica 12 F
GS
[1 0 0 1 0 0] CT
-3.5 12 moveto 
1 -1 scale
(3) t 
GR
GR
GS
[1.00046 0 0 1 224.60413 268.50034] CT
0.149 GC
/Helvetica 12 F
GS
[1 0 0 1 0 0] CT
-21 12 moveto 
1 -1 scale
(Time \(s\)) t 
GR
GR
GS
[1.00046 0 0 1 0 0] CT
0.149 GC
2 setlinecap
1 LJ
0.5 LW
N
64.5 248.5 M
64.5 21.001 L
S
GR
GS
[1.00046 0 0 1 0 0] CT
0.149 GC
2 setlinecap
1 LJ
0.5 LW
N
64.5 248.5 M
67.696 248.5 L
S
GR
GS
[1.00046 0 0 1 0 0] CT
0.149 GC
2 setlinecap
1 LJ
0.5 LW
N
64.5 216 M
67.696 216 L
S
GR
GS
[1.00046 0 0 1 0 0] CT
0.149 GC
2 setlinecap
1 LJ
0.5 LW
N
64.5 183.5 M
67.696 183.5 L
S
GR
GS
[1.00046 0 0 1 0 0] CT
0.149 GC
2 setlinecap
1 LJ
0.5 LW
N
64.5 151 M
67.696 151 L
S
GR
GS
[1.00046 0 0 1 0 0] CT
0.149 GC
2 setlinecap
1 LJ
0.5 LW
N
64.5 118.5 M
67.696 118.5 L
S
GR
GS
[1.00046 0 0 1 0 0] CT
0.149 GC
2 setlinecap
1 LJ
0.5 LW
N
64.5 86.001 M
67.696 86.001 L
S
GR
GS
[1.00046 0 0 1 0 0] CT
0.149 GC
2 setlinecap
1 LJ
0.5 LW
N
64.5 53.5 M
67.696 53.5 L
S
GR
GS
[1.00046 0 0 1 0 0] CT
0.149 GC
2 setlinecap
1 LJ
0.5 LW
N
64.5 21.001 M
67.696 21.001 L
S
GR
GS
[1.00046 0 0 1 60.12783 248.49963] CT
0.149 GC
/Helvetica 12 F
GS
[1 0 0 1 0 0] CT
-29 4.5 moveto 
1 -1 scale
(-5.37) t 
GR
GR
GS
[1.00046 0 0 1 60.12783 216.00043] CT
0.149 GC
/Helvetica 12 F
GS
[1 0 0 1 0 0] CT
-29 4.5 moveto 
1 -1 scale
(-5.36) t 
GR
GR
GS
[1.00046 0 0 1 60.12783 183.49969] CT
0.149 GC
/Helvetica 12 F
GS
[1 0 0 1 0 0] CT
-29 4.5 moveto 
1 -1 scale
(-5.35) t 
GR
GR
GS
[1.00046 0 0 1 60.12783 151.00049] CT
0.149 GC
/Helvetica 12 F
GS
[1 0 0 1 0 0] CT
-29 4.5 moveto 
1 -1 scale
(-5.34) t 
GR
GR
GS
[1.00046 0 0 1 60.12783 118.49975] CT
0.149 GC
/Helvetica 12 F
GS
[1 0 0 1 0 0] CT
-29 4.5 moveto 
1 -1 scale
(-5.33) t 
GR
GR
GS
[1.00046 0 0 1 60.12783 86.00056] CT
0.149 GC
/Helvetica 12 F
GS
[1 0 0 1 0 0] CT
-29 4.5 moveto 
1 -1 scale
(-5.32) t 
GR
GR
GS
[1.00046 0 0 1 60.12783 53.49981] CT
0.149 GC
/Helvetica 12 F
GS
[1 0 0 1 0 0] CT
-29 4.5 moveto 
1 -1 scale
(-5.31) t 
GR
GR
GS
[1.00046 0 0 1 60.12783 21.00062] CT
0.149 GC
/Helvetica 12 F
GS
[1 0 0 1 0 0] CT
-22 4.5 moveto 
1 -1 scale
(-5.3) t 
GR
GR
GS
[0 -1 1.00046 0 29.01343 134.75012] CT
0.149 GC
/Helvetica 12 F
GS
[1 0 0 1 0 0] CT
-57 -18 moveto 
1 -1 scale
(8-12 Hz Alpha Power) t 
GR
GR
GS
[0 -1 1.00046 0 29.01343 134.75012] CT
0.149 GC
/Helvetica 12 F
GS
[1 0 0 1 0 0] CT
-46 -3 moveto 
1 -1 scale
(\(a.u.; normalized\)) t 
GR
GR
GS
[1.00046 0 0 1 0 0] CT
0.996 0.98 0.98 RC
N
96.5 206.818 M
102.9 211.638 L
109.3 213.622 L
115.7 208.232 L
122.1 200.556 L
128.5 192.094 L
134.9 185.437 L
141.3 185.335 L
147.7 184.253 L
154.1 180.233 L
160.5 174.759 L
166.9 175.316 L
173.3 172.963 L
179.7 169.191 L
186.1 165.825 L
192.5 160.007 L
198.9 155.106 L
205.3 147.935 L
211.7 136.627 L
218.1 130.433 L
224.5 125.928 L
230.9 125.491 L
237.3 120.074 L
243.7 114.588 L
250.1 111.269 L
256.5 111.013 L
262.9 108.121 L
269.3 106.395 L
275.7 106.607 L
282.1 110.006 L
288.5 112.076 L
294.9 110.409 L
301.3 109.716 L
307.7 108.405 L
314.1 103.918 L
320.5 96.198 L
326.9 89.664 L
333.3 90.489 L
339.7 87.997 L
346.1 81.072 L
352.5 79.386 L
358.9 79.486 L
365.3 76.899 L
371.7 74.255 L
378.1 72.434 L
384.5 66.961 L
384.538 66.917 L
384.538 29.398 L
384.538 29.174 L
384.5 29.217 L
378.1 35.057 L
371.7 37.778 L
365.3 40.58 L
358.9 42.732 L
352.5 41.479 L
346.1 42.568 L
339.7 49.52 L
333.3 52.678 L
326.9 52.505 L
320.5 59.579 L
314.1 68.176 L
307.7 73.686 L
301.3 75.307 L
294.9 75.737 L
288.5 77.632 L
282.1 75.675 L
275.7 71.876 L
269.3 72.2 L
262.9 74.65 L
256.5 77.958 L
250.1 78.901 L
243.7 82.374 L
237.3 88.125 L
230.9 94.681 L
224.5 94.924 L
218.1 98.62 L
211.7 104.041 L
205.3 115.659 L
198.9 123.556 L
192.5 128.963 L
186.1 136.039 L
179.7 140.605 L
173.3 143.974 L
166.9 145.86 L
160.5 145.621 L
154.1 151.27 L
147.7 156.443 L
141.3 157.925 L
134.9 158.447 L
128.5 165.134 L
122.1 172.986 L
115.7 180.984 L
109.3 186.855 L
102.9 185.635 L
96.5 181.894 L
90.1 175.131 L
83.7 166.778 L
77.3 158.47 L
70.9 138.231 L
64.5 101.977 L
64.462 101.613 L
64.462 101.745 L
64.462 124.149 L
64.5 124.516 L
70.9 162.127 L
77.3 183.486 L
83.7 191.797 L
90.1 199.891 L
cp
f
GR
GS
[1.00046 0 0 1 0 0] CT
0.98 0.91 0.91 RC
1 LJ
0.5 LW
N
64.462 124.149 M
64.5 124.516 L
70.9 162.127 L
77.3 183.486 L
83.7 191.797 L
90.1 199.891 L
96.5 206.818 L
102.9 211.638 L
109.3 213.622 L
115.7 208.232 L
122.1 200.556 L
128.5 192.094 L
134.9 185.437 L
141.3 185.335 L
147.7 184.253 L
154.1 180.233 L
160.5 174.759 L
166.9 175.316 L
173.3 172.963 L
179.7 169.191 L
186.1 165.825 L
192.5 160.007 L
198.9 155.106 L
205.3 147.935 L
211.7 136.627 L
218.1 130.433 L
224.5 125.928 L
230.9 125.491 L
237.3 120.074 L
243.7 114.588 L
250.1 111.269 L
256.5 111.013 L
262.9 108.121 L
269.3 106.395 L
275.7 106.607 L
282.1 110.006 L
288.5 112.076 L
294.9 110.409 L
301.3 109.716 L
307.7 108.405 L
314.1 103.918 L
320.5 96.198 L
326.9 89.664 L
333.3 90.489 L
339.7 87.997 L
346.1 81.072 L
352.5 79.386 L
358.9 79.486 L
365.3 76.899 L
371.7 74.255 L
378.1 72.434 L
384.5 66.961 L
384.538 66.917 L
S
GR
GS
[1.00046 0 0 1 0 0] CT
0.98 0.91 0.91 RC
1 LJ
0.5 LW
N
64.462 101.613 M
64.5 101.977 L
70.9 138.231 L
77.3 158.47 L
83.7 166.778 L
90.1 175.131 L
96.5 181.894 L
102.9 185.635 L
109.3 186.855 L
115.7 180.984 L
122.1 172.986 L
128.5 165.134 L
134.9 158.447 L
141.3 157.925 L
147.7 156.443 L
154.1 151.27 L
160.5 145.621 L
166.9 145.86 L
173.3 143.974 L
179.7 140.605 L
186.1 136.039 L
192.5 128.963 L
198.9 123.556 L
205.3 115.659 L
211.7 104.041 L
218.1 98.62 L
224.5 94.924 L
230.9 94.681 L
237.3 88.125 L
243.7 82.374 L
250.1 78.901 L
256.5 77.958 L
262.9 74.65 L
269.3 72.2 L
275.7 71.876 L
282.1 75.675 L
288.5 77.632 L
294.9 75.737 L
301.3 75.307 L
307.7 73.686 L
314.1 68.176 L
320.5 59.579 L
326.9 52.505 L
333.3 52.678 L
339.7 49.52 L
346.1 42.568 L
352.5 41.479 L
358.9 42.732 L
365.3 40.58 L
371.7 37.778 L
378.1 35.057 L
384.5 29.217 L
384.538 29.174 L
S
GR
GS
[1.00046 0 0 1 0 0] CT
0.961 0.8 0.8 RC
1 LJ
2 LW
N
64.462 112.881 M
64.5 113.246 L
70.9 150.179 L
77.3 170.978 L
83.7 179.288 L
90.1 187.51 L
96.5 194.357 L
102.9 198.636 L
109.3 200.238 L
115.7 194.608 L
122.1 186.771 L
128.5 178.615 L
134.9 171.942 L
141.3 171.63 L
147.7 170.349 L
154.1 165.752 L
160.5 160.19 L
166.9 160.589 L
173.3 158.469 L
179.7 154.898 L
186.1 150.932 L
192.5 144.485 L
198.9 139.331 L
205.3 131.796 L
211.7 120.335 L
218.1 114.526 L
224.5 110.426 L
230.9 110.085 L
237.3 104.1 L
243.7 98.482 L
250.1 95.085 L
256.5 94.485 L
262.9 91.386 L
269.3 89.297 L
275.7 89.241 L
282.1 92.841 L
288.5 94.854 L
294.9 93.073 L
301.3 92.511 L
307.7 91.045 L
314.1 86.047 L
320.5 77.888 L
326.9 71.084 L
333.3 71.584 L
339.7 68.758 L
346.1 61.82 L
352.5 60.432 L
358.9 61.109 L
365.3 58.739 L
371.7 56.017 L
378.1 53.745 L
384.5 48.09 L
384.538 48.046 L
S
GR
GS
[1.00046 0 0 1 0 0] CT
0.99 0.959 0.959 RC
N
90.1 160.911 M
83.7 159.76 L
77.3 149.652 L
70.9 126.919 L
64.5 88.364 L
64.462 87.967 L
64.462 88.092 L
64.462 109.112 L
64.5 109.51 L
70.9 149.488 L
77.3 171.867 L
83.7 181.51 L
90.1 182.086 L
96.5 179.39 L
102.9 188.071 L
109.3 196.477 L
115.7 198.47 L
122.1 199.725 L
128.5 198.41 L
134.9 200.748 L
141.3 207.311 L
147.7 212.146 L
154.1 209.121 L
160.5 205.343 L
166.9 206.271 L
173.3 206.536 L
179.7 213.406 L
186.1 219.518 L
192.5 230.044 L
198.9 237.074 L
205.3 237.363 L
211.7 233.773 L
218.1 230.408 L
224.5 227.586 L
230.9 220.134 L
237.3 215.243 L
243.7 208.504 L
250.1 206.067 L
256.5 211.514 L
262.9 213.096 L
269.3 208.889 L
275.7 199.648 L
282.1 196.784 L
288.5 199.505 L
294.9 198.577 L
301.3 197.419 L
307.7 199.62 L
314.1 205.368 L
320.5 207.209 L
326.9 205.355 L
333.3 203.576 L
339.7 200.894 L
346.1 200.564 L
352.5 199.494 L
358.9 195.04 L
365.3 192.676 L
371.7 186.971 L
378.1 186.19 L
384.5 187.165 L
384.538 187.127 L
384.538 163.829 L
384.538 163.689 L
384.5 163.727 L
378.1 162.315 L
371.7 161.805 L
365.3 167.31 L
358.9 171.313 L
352.5 176.817 L
346.1 178.668 L
339.7 178.338 L
333.3 180.383 L
326.9 182.503 L
320.5 185.753 L
314.1 185.186 L
307.7 179.601 L
301.3 178.519 L
294.9 180.577 L
288.5 181.795 L
282.1 178.435 L
275.7 179.63 L
269.3 186.808 L
262.9 190.382 L
256.5 188.651 L
250.1 183.822 L
243.7 186.821 L
237.3 193.847 L
230.9 198.258 L
224.5 205.267 L
218.1 208.058 L
211.7 212.255 L
205.3 216.828 L
198.9 217.194 L
192.5 209.977 L
186.1 199.22 L
179.7 192.973 L
173.3 185.583 L
166.9 185.025 L
160.5 183.951 L
154.1 188.496 L
147.7 192.33 L
141.3 188.017 L
134.9 181.44 L
128.5 178.66 L
122.1 179.467 L
115.7 178.043 L
109.3 175.649 L
102.9 167.257 L
96.5 159.217 L
cp
f
GR
GS
[1.00046 0 0 1 0 0] CT
0.957 0.82 0.82 RC
1 LJ
0.5 LW
N
64.462 109.112 M
64.5 109.51 L
70.9 149.488 L
77.3 171.867 L
83.7 181.51 L
90.1 182.086 L
96.5 179.39 L
102.9 188.071 L
109.3 196.477 L
115.7 198.47 L
122.1 199.725 L
128.5 198.41 L
134.9 200.748 L
141.3 207.311 L
147.7 212.146 L
154.1 209.121 L
160.5 205.343 L
166.9 206.271 L
173.3 206.536 L
179.7 213.406 L
186.1 219.518 L
192.5 230.044 L
198.9 237.074 L
205.3 237.363 L
211.7 233.773 L
218.1 230.408 L
224.5 227.586 L
230.9 220.134 L
237.3 215.243 L
243.7 208.504 L
250.1 206.067 L
256.5 211.514 L
262.9 213.096 L
269.3 208.889 L
275.7 199.648 L
282.1 196.784 L
288.5 199.505 L
294.9 198.577 L
301.3 197.419 L
307.7 199.62 L
314.1 205.368 L
320.5 207.209 L
326.9 205.355 L
333.3 203.576 L
339.7 200.894 L
346.1 200.564 L
352.5 199.494 L
358.9 195.04 L
365.3 192.676 L
371.7 186.971 L
378.1 186.19 L
384.5 187.165 L
384.538 187.127 L
S
GR
GS
[1.00046 0 0 1 0 0] CT
0.957 0.82 0.82 RC
1 LJ
0.5 LW
N
64.462 87.967 M
64.5 88.364 L
70.9 126.919 L
77.3 149.652 L
83.7 159.76 L
90.1 160.911 L
96.5 159.217 L
102.9 167.257 L
109.3 175.649 L
115.7 178.043 L
122.1 179.467 L
128.5 178.66 L
134.9 181.44 L
141.3 188.017 L
147.7 192.33 L
154.1 188.496 L
160.5 183.951 L
166.9 185.025 L
173.3 185.583 L
179.7 192.973 L
186.1 199.22 L
192.5 209.977 L
198.9 217.194 L
205.3 216.828 L
211.7 212.255 L
218.1 208.058 L
224.5 205.267 L
230.9 198.258 L
237.3 193.847 L
243.7 186.821 L
250.1 183.822 L
256.5 188.651 L
262.9 190.382 L
269.3 186.808 L
275.7 179.63 L
282.1 178.435 L
288.5 181.795 L
294.9 180.577 L
301.3 178.519 L
307.7 179.601 L
314.1 185.186 L
320.5 185.753 L
326.9 182.503 L
333.3 180.383 L
339.7 178.338 L
346.1 178.668 L
352.5 176.817 L
358.9 171.313 L
365.3 167.31 L
371.7 161.805 L
378.1 162.315 L
384.5 163.727 L
384.538 163.689 L
S
GR
GS
[1.00046 0 0 1 0 0] CT
0.898 0.6 0.6 RC
1 LJ
2 LW
N
64.462 98.539 M
64.5 98.936 L
70.9 138.203 L
77.3 160.761 L
83.7 170.635 L
90.1 171.499 L
96.5 169.303 L
102.9 177.665 L
109.3 186.063 L
115.7 188.257 L
122.1 189.596 L
128.5 188.535 L
134.9 191.093 L
141.3 197.664 L
147.7 202.237 L
154.1 198.809 L
160.5 194.647 L
166.9 195.648 L
173.3 196.06 L
179.7 203.189 L
186.1 209.369 L
192.5 220.01 L
198.9 227.134 L
205.3 227.096 L
211.7 223.013 L
218.1 219.233 L
224.5 216.427 L
230.9 209.196 L
237.3 204.545 L
243.7 197.663 L
250.1 194.944 L
256.5 200.082 L
262.9 201.738 L
269.3 197.849 L
275.7 189.638 L
282.1 187.61 L
288.5 190.65 L
294.9 189.578 L
301.3 187.969 L
307.7 189.61 L
314.1 195.276 L
320.5 196.482 L
326.9 193.929 L
333.3 191.98 L
339.7 189.615 L
346.1 189.616 L
352.5 188.157 L
358.9 183.176 L
365.3 179.993 L
371.7 174.387 L
378.1 174.253 L
384.5 175.446 L
384.538 175.408 L
S
GR
GS
[1.00046 0 0 1 0 0] CT
0.98 0.939 0.939 RC
N
90.1 133.436 M
83.7 127.232 L
77.3 118.416 L
70.9 104.504 L
64.5 74.812 L
64.462 74.444 L
64.462 74.581 L
64.462 96.433 L
64.5 96.794 L
70.9 125.004 L
77.3 138.679 L
83.7 147.207 L
90.1 152.463 L
96.5 152.606 L
102.9 158.408 L
109.3 168.343 L
115.7 177.143 L
122.1 182.977 L
128.5 191.431 L
134.9 195.684 L
141.3 202.871 L
147.7 205.239 L
154.1 198.825 L
160.5 203.415 L
166.9 205.315 L
173.3 199.468 L
179.7 199.267 L
186.1 200.052 L
192.5 199.505 L
198.9 202.386 L
205.3 205.036 L
211.7 209.127 L
218.1 212.529 L
224.5 216.592 L
230.9 218.495 L
237.3 220.349 L
243.7 220.939 L
250.1 214.291 L
256.5 206.352 L
262.9 199.538 L
269.3 199.724 L
275.7 200.526 L
282.1 205.63 L
288.5 213.093 L
294.9 214.694 L
301.3 211.023 L
307.7 206.575 L
314.1 201.935 L
320.5 201.402 L
326.9 204.641 L
333.3 211.339 L
339.7 214.009 L
346.1 218.773 L
352.5 222.506 L
358.9 215.954 L
365.3 209.351 L
371.7 206.065 L
378.1 205.186 L
384.5 204.147 L
384.538 204.135 L
384.538 175.031 L
384.538 174.862 L
384.5 174.868 L
378.1 176.462 L
371.7 177.845 L
365.3 181.778 L
358.9 189.15 L
352.5 195.761 L
346.1 191.851 L
339.7 186.884 L
333.3 183.689 L
326.9 177.499 L
320.5 174.998 L
314.1 176.944 L
307.7 182.376 L
301.3 187.385 L
294.9 191.806 L
288.5 192.093 L
282.1 185.691 L
275.7 181.611 L
269.3 180.772 L
262.9 180.693 L
256.5 185.998 L
250.1 192.646 L
243.7 198.157 L
237.3 197.799 L
230.9 196.561 L
224.5 195.606 L
218.1 191.871 L
211.7 189.666 L
205.3 185.727 L
198.9 182.478 L
192.5 179.652 L
186.1 181.299 L
179.7 181.037 L
173.3 180.848 L
166.9 185.646 L
160.5 182.778 L
154.1 178.116 L
147.7 184.386 L
141.3 183.204 L
134.9 177.397 L
128.5 173.024 L
122.1 163.259 L
115.7 156.401 L
109.3 148.166 L
102.9 139.478 L
96.5 134.198 L
cp
f
GR
GS
[1.00046 0 0 1 0 0] CT
0.91 0.729 0.729 RC
1 LJ
0.5 LW
N
64.462 96.433 M
64.5 96.794 L
70.9 125.004 L
77.3 138.679 L
83.7 147.207 L
90.1 152.463 L
96.5 152.606 L
102.9 158.408 L
109.3 168.343 L
115.7 177.143 L
122.1 182.977 L
128.5 191.431 L
134.9 195.684 L
141.3 202.871 L
147.7 205.239 L
154.1 198.825 L
160.5 203.415 L
166.9 205.315 L
173.3 199.468 L
179.7 199.267 L
186.1 200.052 L
192.5 199.505 L
198.9 202.386 L
205.3 205.036 L
211.7 209.127 L
218.1 212.529 L
224.5 216.592 L
230.9 218.495 L
237.3 220.349 L
243.7 220.939 L
250.1 214.291 L
256.5 206.352 L
262.9 199.538 L
269.3 199.724 L
275.7 200.526 L
282.1 205.63 L
288.5 213.093 L
294.9 214.694 L
301.3 211.023 L
307.7 206.575 L
314.1 201.935 L
320.5 201.402 L
326.9 204.641 L
333.3 211.339 L
339.7 214.009 L
346.1 218.773 L
352.5 222.506 L
358.9 215.954 L
365.3 209.351 L
371.7 206.065 L
378.1 205.186 L
384.5 204.147 L
384.538 204.135 L
S
GR
GS
[1.00046 0 0 1 0 0] CT
0.91 0.729 0.729 RC
1 LJ
0.5 LW
N
64.462 74.444 M
64.5 74.812 L
70.9 104.504 L
77.3 118.416 L
83.7 127.232 L
90.1 133.436 L
96.5 134.198 L
102.9 139.478 L
109.3 148.166 L
115.7 156.401 L
122.1 163.259 L
128.5 173.024 L
134.9 177.397 L
141.3 183.204 L
147.7 184.386 L
154.1 178.116 L
160.5 182.778 L
166.9 185.646 L
173.3 180.848 L
179.7 181.037 L
186.1 181.299 L
192.5 179.652 L
198.9 182.478 L
205.3 185.727 L
211.7 189.666 L
218.1 191.871 L
224.5 195.606 L
230.9 196.561 L
237.3 197.799 L
243.7 198.157 L
250.1 192.646 L
256.5 185.998 L
262.9 180.693 L
269.3 180.772 L
275.7 181.611 L
282.1 185.691 L
288.5 192.093 L
294.9 191.806 L
301.3 187.385 L
307.7 182.376 L
314.1 176.944 L
320.5 174.998 L
326.9 177.499 L
333.3 183.689 L
339.7 186.884 L
346.1 191.851 L
352.5 195.761 L
358.9 189.15 L
365.3 181.778 L
371.7 177.845 L
378.1 176.462 L
384.5 174.868 L
384.538 174.862 L
S
GR
GS
[1.00046 0 0 1 0 0] CT
0.8 0.4 0.4 RC
1 LJ
2 LW
N
64.462 85.439 M
64.5 85.804 L
70.9 114.754 L
77.3 128.548 L
83.7 137.219 L
90.1 142.95 L
96.5 143.402 L
102.9 148.942 L
109.3 158.255 L
115.7 166.772 L
122.1 173.118 L
128.5 182.227 L
134.9 186.54 L
141.3 193.037 L
147.7 194.813 L
154.1 188.471 L
160.5 193.097 L
166.9 195.481 L
173.3 190.157 L
179.7 190.153 L
186.1 190.676 L
192.5 189.579 L
198.9 192.432 L
205.3 195.381 L
211.7 199.397 L
218.1 202.2 L
224.5 206.099 L
230.9 207.528 L
237.3 209.075 L
243.7 209.547 L
250.1 203.468 L
256.5 196.175 L
262.9 190.115 L
269.3 190.249 L
275.7 191.069 L
282.1 195.66 L
288.5 202.592 L
294.9 203.251 L
301.3 199.203 L
307.7 194.476 L
314.1 189.44 L
320.5 188.2 L
326.9 191.07 L
333.3 197.514 L
339.7 200.447 L
346.1 205.312 L
352.5 209.134 L
358.9 202.552 L
365.3 195.564 L
371.7 191.955 L
378.1 190.824 L
384.5 189.506 L
384.538 189.498 L
S
GR
GS
[1.00046 0 0 1 0 0] CT
0.959 0.918 0.918 RC
N
83.7 134.671 M
77.3 126.448 L
70.9 112.259 L
64.5 70.322 L
64.462 69.89 L
64.462 70.015 L
64.462 89.587 L
64.5 90.011 L
70.9 130.233 L
77.3 144.335 L
83.7 153.973 L
90.1 161.306 L
96.5 164.931 L
102.9 165.929 L
109.3 164.43 L
115.7 162.031 L
122.1 162.131 L
128.5 169.558 L
134.9 174.319 L
141.3 179.822 L
147.7 181.986 L
154.1 186.343 L
160.5 189.248 L
166.9 187.912 L
173.3 190.946 L
179.7 197.729 L
186.1 204.232 L
192.5 209.507 L
198.9 211.373 L
205.3 215.68 L
211.7 212.961 L
218.1 213.381 L
224.5 215.01 L
230.9 218.911 L
237.3 219.401 L
243.7 216.076 L
250.1 215.571 L
256.5 213.271 L
262.9 210.882 L
269.3 214.096 L
275.7 222.965 L
282.1 225.95 L
288.5 222.951 L
294.9 222.221 L
301.3 226.153 L
307.7 232.959 L
314.1 236.148 L
320.5 235.251 L
326.9 226.455 L
333.3 219.585 L
339.7 212.65 L
346.1 206.143 L
352.5 206.279 L
358.9 207.272 L
365.3 208.497 L
371.7 209.354 L
378.1 211.877 L
384.5 213.296 L
384.538 213.316 L
384.538 213.142 L
384.538 184.93 L
384.5 184.915 L
378.1 184.578 L
371.7 182.776 L
365.3 181.714 L
358.9 181.62 L
352.5 181.036 L
346.1 181.181 L
339.7 187.836 L
333.3 194.346 L
326.9 200.805 L
320.5 209.287 L
314.1 209.845 L
307.7 207.344 L
301.3 201.746 L
294.9 198.874 L
288.5 199.398 L
282.1 201.277 L
275.7 197.98 L
269.3 189.805 L
262.9 186.643 L
256.5 188.501 L
250.1 190.531 L
243.7 190.258 L
237.3 194.152 L
230.9 194.422 L
224.5 190.602 L
218.1 189.967 L
211.7 191.089 L
205.3 195.101 L
198.9 190.935 L
192.5 188.642 L
186.1 182.692 L
179.7 176.07 L
173.3 169.845 L
166.9 166.526 L
160.5 167.928 L
154.1 166.306 L
147.7 162.123 L
141.3 159.039 L
134.9 153.068 L
128.5 148.594 L
122.1 142.122 L
115.7 142.382 L
109.3 145.108 L
102.9 146.57 L
96.5 144.64 L
90.1 141.045 L
cp
f
GR
GS
[1.00046 0 0 1 0 0] CT
0.82 0.639 0.639 RC
1 LJ
0.5 LW
N
64.462 89.587 M
64.5 90.011 L
70.9 130.233 L
77.3 144.335 L
83.7 153.973 L
90.1 161.306 L
96.5 164.931 L
102.9 165.929 L
109.3 164.43 L
115.7 162.031 L
122.1 162.131 L
128.5 169.558 L
134.9 174.319 L
141.3 179.822 L
147.7 181.986 L
154.1 186.343 L
160.5 189.248 L
166.9 187.912 L
173.3 190.946 L
179.7 197.729 L
186.1 204.232 L
192.5 209.507 L
198.9 211.373 L
205.3 215.68 L
211.7 212.961 L
218.1 213.381 L
224.5 215.01 L
230.9 218.911 L
237.3 219.401 L
243.7 216.076 L
250.1 215.571 L
256.5 213.271 L
262.9 210.882 L
269.3 214.096 L
275.7 222.965 L
282.1 225.95 L
288.5 222.951 L
294.9 222.221 L
301.3 226.153 L
307.7 232.959 L
314.1 236.148 L
320.5 235.251 L
326.9 226.455 L
333.3 219.585 L
339.7 212.65 L
346.1 206.143 L
352.5 206.279 L
358.9 207.272 L
365.3 208.497 L
371.7 209.354 L
378.1 211.877 L
384.5 213.296 L
384.538 213.316 L
S
GR
GS
[1.00046 0 0 1 0 0] CT
0.82 0.639 0.639 RC
1 LJ
0.5 LW
N
64.462 69.89 M
64.5 70.322 L
70.9 112.259 L
77.3 126.448 L
83.7 134.671 L
90.1 141.045 L
96.5 144.64 L
102.9 146.57 L
109.3 145.108 L
115.7 142.382 L
122.1 142.122 L
128.5 148.594 L
134.9 153.068 L
141.3 159.039 L
147.7 162.123 L
154.1 166.306 L
160.5 167.928 L
166.9 166.526 L
173.3 169.845 L
179.7 176.07 L
186.1 182.692 L
192.5 188.642 L
198.9 190.935 L
205.3 195.101 L
211.7 191.089 L
218.1 189.967 L
224.5 190.602 L
230.9 194.422 L
237.3 194.152 L
243.7 190.258 L
250.1 190.531 L
256.5 188.501 L
262.9 186.643 L
269.3 189.805 L
275.7 197.98 L
282.1 201.277 L
288.5 199.398 L
294.9 198.874 L
301.3 201.746 L
307.7 207.344 L
314.1 209.845 L
320.5 209.287 L
326.9 200.805 L
333.3 194.346 L
339.7 187.836 L
346.1 181.181 L
352.5 181.036 L
358.9 181.62 L
365.3 181.714 L
371.7 182.776 L
378.1 184.578 L
384.5 184.915 L
384.538 184.93 L
S
GR
GS
[1.00046 0 0 1 0 0] CT
0.6 0.2 0.2 RC
1 LJ
2 LW
N
64.462 79.738 M
64.5 80.166 L
70.9 121.246 L
77.3 135.392 L
83.7 144.321 L
90.1 151.176 L
96.5 154.785 L
102.9 156.249 L
109.3 154.769 L
115.7 152.206 L
122.1 152.127 L
128.5 159.076 L
134.9 163.693 L
141.3 169.431 L
147.7 172.053 L
154.1 176.324 L
160.5 178.589 L
166.9 177.219 L
173.3 180.396 L
179.7 186.9 L
186.1 193.461 L
192.5 199.074 L
198.9 201.154 L
205.3 205.391 L
211.7 202.025 L
218.1 201.675 L
224.5 202.806 L
230.9 206.666 L
237.3 206.776 L
243.7 203.167 L
250.1 203.051 L
256.5 200.886 L
262.9 198.761 L
269.3 201.951 L
275.7 210.473 L
282.1 213.612 L
288.5 211.175 L
294.9 210.549 L
301.3 213.949 L
307.7 220.151 L
314.1 222.997 L
320.5 222.269 L
326.9 213.629 L
333.3 206.966 L
339.7 200.243 L
346.1 193.661 L
352.5 193.658 L
358.9 194.445 L
365.3 195.106 L
371.7 196.065 L
378.1 198.227 L
384.5 199.105 L
384.538 199.123 L
S
GR
%%Trailer
%%Pages: 1
%%EOF
