%!PS-Adobe-3.0 EPSF-3.0
%%Creator: (MATLAB, The Mathworks, Inc. Version 9.10.0.1602886 \(R2021a\). Operating System: Mac OS X)
%%Title: /Users/kosciessa/Desktop/tardis/LNDG/stateswitch/stsw_eeg_task/tfr/figures/b01_gammaTraces_oa.eps
%%CreationDate: 2022-02-22T16:35:27
%%Pages: (atend)
%%BoundingBox:     2     0   388   266
%%LanguageLevel: 3
%%EndComments
%%BeginProlog
%%BeginResource: procset (Apache XML Graphics Std ProcSet) 1.2 0
%%Version: 1.2 0
%%Copyright: (Copyright 2001-2003,2010 The Apache Software Foundation. License terms: http://www.apache.org/licenses/LICENSE-2.0)
/bd{bind def}bind def
/ld{load def}bd
/GR/grestore ld
/GS/gsave ld
/RM/rmoveto ld
/C/curveto ld
/t/show ld
/L/lineto ld
/ML/setmiterlimit ld
/CT/concat ld
/f/fill ld
/N/newpath ld
/S/stroke ld
/CC/setcmykcolor ld
/A/ashow ld
/cp/closepath ld
/RC/setrgbcolor ld
/LJ/setlinejoin ld
/GC/setgray ld
/LW/setlinewidth ld
/M/moveto ld
/re {4 2 roll M
1 index 0 rlineto
0 exch rlineto
neg 0 rlineto
cp } bd
/_ctm matrix def
/_tm matrix def
/BT { _ctm currentmatrix pop matrix _tm copy pop 0 0 moveto } bd
/ET { _ctm setmatrix } bd
/iTm { _ctm setmatrix _tm concat } bd
/Tm { _tm astore pop iTm 0 0 moveto } bd
/ux 0.0 def
/uy 0.0 def
/F {
  /Tp exch def
  /Tf exch def
  Tf findfont Tp scalefont setfont
  /cf Tf def  /cs Tp def
} bd
/ULS {currentpoint /uy exch def /ux exch def} bd
/ULE {
  /Tcx currentpoint pop def
  gsave
  newpath
  cf findfont cs scalefont dup
  /FontMatrix get 0 get /Ts exch def /FontInfo get dup
  /UnderlinePosition get Ts mul /To exch def
  /UnderlineThickness get Ts mul /Tt exch def
  ux uy To add moveto  Tcx uy To add lineto
  Tt setlinewidth stroke
  grestore
} bd
/OLE {
  /Tcx currentpoint pop def
  gsave
  newpath
  cf findfont cs scalefont dup
  /FontMatrix get 0 get /Ts exch def /FontInfo get dup
  /UnderlinePosition get Ts mul /To exch def
  /UnderlineThickness get Ts mul /Tt exch def
  ux uy To add cs add moveto Tcx uy To add cs add lineto
  Tt setlinewidth stroke
  grestore
} bd
/SOE {
  /Tcx currentpoint pop def
  gsave
  newpath
  cf findfont cs scalefont dup
  /FontMatrix get 0 get /Ts exch def /FontInfo get dup
  /UnderlinePosition get Ts mul /To exch def
  /UnderlineThickness get Ts mul /Tt exch def
  ux uy To add cs 10 mul 26 idiv add moveto Tcx uy To add cs 10 mul 26 idiv add lineto
  Tt setlinewidth stroke
  grestore
} bd
/QT {
/Y22 exch store
/X22 exch store
/Y21 exch store
/X21 exch store
currentpoint
/Y21 load 2 mul add 3 div exch
/X21 load 2 mul add 3 div exch
/X21 load 2 mul /X22 load add 3 div
/Y21 load 2 mul /Y22 load add 3 div
/X22 load /Y22 load curveto
} bd
/SSPD {
dup length /d exch dict def
{
/v exch def
/k exch def
currentpagedevice k known {
/cpdv currentpagedevice k get def
v cpdv ne {
/upd false def
/nullv v type /nulltype eq def
/nullcpdv cpdv type /nulltype eq def
nullv nullcpdv or
{
/upd true def
} {
/sametype v type cpdv type eq def
sametype {
v type /arraytype eq {
/vlen v length def
/cpdvlen cpdv length def
vlen cpdvlen eq {
0 1 vlen 1 sub {
/i exch def
/obj v i get def
/cpdobj cpdv i get def
obj cpdobj ne {
/upd true def
exit
} if
} for
} {
/upd true def
} ifelse
} {
v type /dicttype eq {
v {
/dv exch def
/dk exch def
/cpddv cpdv dk get def
dv cpddv ne {
/upd true def
exit
} if
} forall
} {
/upd true def
} ifelse
} ifelse
} if
} ifelse
upd true eq {
d k v put
} if
} if
} if
} forall
d length 0 gt {
d setpagedevice
} if
} bd
/RE { % /NewFontName [NewEncodingArray] /FontName RE -
  findfont dup length dict begin
  {
    1 index /FID ne
    {def} {pop pop} ifelse
  } forall
  /Encoding exch def
  /FontName 1 index def
  currentdict definefont pop
  end
} bind def
%%EndResource
%%BeginResource: procset (Apache XML Graphics EPS ProcSet) 1.0 0
%%Version: 1.0 0
%%Copyright: (Copyright 2002-2003 The Apache Software Foundation. License terms: http://www.apache.org/licenses/LICENSE-2.0)
/BeginEPSF { %def
/b4_Inc_state save def         % Save state for cleanup
/dict_count countdictstack def % Count objects on dict stack
/op_count count 1 sub def      % Count objects on operand stack
userdict begin                 % Push userdict on dict stack
/showpage { } def              % Redefine showpage, { } = null proc
0 setgray 0 setlinecap         % Prepare graphics state
1 setlinewidth 0 setlinejoin
10 setmiterlimit [ ] 0 setdash newpath
/languagelevel where           % If level not equal to 1 then
{pop languagelevel             % set strokeadjust and
1 ne                           % overprint to their defaults.
{false setstrokeadjust false setoverprint
} if
} if
} bd
/EndEPSF { %def
count op_count sub {pop} repeat            % Clean up stacks
countdictstack dict_count sub {end} repeat
b4_Inc_state restore
} bd
%%EndResource
%FOPBeginFontDict
%%IncludeResource: font Courier-Oblique
%%IncludeResource: font Courier-BoldOblique
%%IncludeResource: font Courier-Bold
%%IncludeResource: font ZapfDingbats
%%IncludeResource: font Symbol
%%IncludeResource: font Helvetica
%%IncludeResource: font Helvetica-Oblique
%%IncludeResource: font Helvetica-Bold
%%IncludeResource: font Helvetica-BoldOblique
%%IncludeResource: font Times-Roman
%%IncludeResource: font Times-Italic
%%IncludeResource: font Times-Bold
%%IncludeResource: font Times-BoldItalic
%%IncludeResource: font Courier
%FOPEndFontDict
%%BeginResource: encoding WinAnsiEncoding
/WinAnsiEncoding [
/.notdef /.notdef /.notdef /.notdef /.notdef
/.notdef /.notdef /.notdef /.notdef /.notdef
/.notdef /.notdef /.notdef /.notdef /.notdef
/.notdef /.notdef /.notdef /.notdef /.notdef
/.notdef /.notdef /.notdef /.notdef /.notdef
/.notdef /.notdef /.notdef /.notdef /.notdef
/.notdef /.notdef /space /exclam /quotedbl
/numbersign /dollar /percent /ampersand /quotesingle
/parenleft /parenright /asterisk /plus /comma
/hyphen /period /slash /zero /one
/two /three /four /five /six
/seven /eight /nine /colon /semicolon
/less /equal /greater /question /at
/A /B /C /D /E
/F /G /H /I /J
/K /L /M /N /O
/P /Q /R /S /T
/U /V /W /X /Y
/Z /bracketleft /backslash /bracketright /asciicircum
/underscore /quoteleft /a /b /c
/d /e /f /g /h
/i /j /k /l /m
/n /o /p /q /r
/s /t /u /v /w
/x /y /z /braceleft /bar
/braceright /asciitilde /bullet /Euro /bullet
/quotesinglbase /florin /quotedblbase /ellipsis /dagger
/daggerdbl /circumflex /perthousand /Scaron /guilsinglleft
/OE /bullet /Zcaron /bullet /bullet
/quoteleft /quoteright /quotedblleft /quotedblright /bullet
/endash /emdash /asciitilde /trademark /scaron
/guilsinglright /oe /bullet /zcaron /Ydieresis
/space /exclamdown /cent /sterling /currency
/yen /brokenbar /section /dieresis /copyright
/ordfeminine /guillemotleft /logicalnot /sfthyphen /registered
/macron /degree /plusminus /twosuperior /threesuperior
/acute /mu /paragraph /middot /cedilla
/onesuperior /ordmasculine /guillemotright /onequarter /onehalf
/threequarters /questiondown /Agrave /Aacute /Acircumflex
/Atilde /Adieresis /Aring /AE /Ccedilla
/Egrave /Eacute /Ecircumflex /Edieresis /Igrave
/Iacute /Icircumflex /Idieresis /Eth /Ntilde
/Ograve /Oacute /Ocircumflex /Otilde /Odieresis
/multiply /Oslash /Ugrave /Uacute /Ucircumflex
/Udieresis /Yacute /Thorn /germandbls /agrave
/aacute /acircumflex /atilde /adieresis /aring
/ae /ccedilla /egrave /eacute /ecircumflex
/edieresis /igrave /iacute /icircumflex /idieresis
/eth /ntilde /ograve /oacute /ocircumflex
/otilde /odieresis /divide /oslash /ugrave
/uacute /ucircumflex /udieresis /yacute /thorn
/ydieresis
] def
%%EndResource
%FOPBeginFontReencode
/Courier-Oblique findfont
dup length dict begin
  {1 index /FID ne {def} {pop pop} ifelse} forall
  /Encoding WinAnsiEncoding def
  currentdict
end
/Courier-Oblique exch definefont pop
/Courier-BoldOblique findfont
dup length dict begin
  {1 index /FID ne {def} {pop pop} ifelse} forall
  /Encoding WinAnsiEncoding def
  currentdict
end
/Courier-BoldOblique exch definefont pop
/Courier-Bold findfont
dup length dict begin
  {1 index /FID ne {def} {pop pop} ifelse} forall
  /Encoding WinAnsiEncoding def
  currentdict
end
/Courier-Bold exch definefont pop
/Helvetica findfont
dup length dict begin
  {1 index /FID ne {def} {pop pop} ifelse} forall
  /Encoding WinAnsiEncoding def
  currentdict
end
/Helvetica exch definefont pop
/Helvetica-Oblique findfont
dup length dict begin
  {1 index /FID ne {def} {pop pop} ifelse} forall
  /Encoding WinAnsiEncoding def
  currentdict
end
/Helvetica-Oblique exch definefont pop
/Helvetica-Bold findfont
dup length dict begin
  {1 index /FID ne {def} {pop pop} ifelse} forall
  /Encoding WinAnsiEncoding def
  currentdict
end
/Helvetica-Bold exch definefont pop
/Helvetica-BoldOblique findfont
dup length dict begin
  {1 index /FID ne {def} {pop pop} ifelse} forall
  /Encoding WinAnsiEncoding def
  currentdict
end
/Helvetica-BoldOblique exch definefont pop
/Times-Roman findfont
dup length dict begin
  {1 index /FID ne {def} {pop pop} ifelse} forall
  /Encoding WinAnsiEncoding def
  currentdict
end
/Times-Roman exch definefont pop
/Times-Italic findfont
dup length dict begin
  {1 index /FID ne {def} {pop pop} ifelse} forall
  /Encoding WinAnsiEncoding def
  currentdict
end
/Times-Italic exch definefont pop
/Times-Bold findfont
dup length dict begin
  {1 index /FID ne {def} {pop pop} ifelse} forall
  /Encoding WinAnsiEncoding def
  currentdict
end
/Times-Bold exch definefont pop
/Times-BoldItalic findfont
dup length dict begin
  {1 index /FID ne {def} {pop pop} ifelse} forall
  /Encoding WinAnsiEncoding def
  currentdict
end
/Times-BoldItalic exch definefont pop
/Courier findfont
dup length dict begin
  {1 index /FID ne {def} {pop pop} ifelse} forall
  /Encoding WinAnsiEncoding def
  currentdict
end
/Courier exch definefont pop
%FOPEndFontReencode
%%EndProlog
%%Page: 1 1
%%PageBoundingBox: 0 0 425 283
%%BeginPageSetup
[1 0 0 -1 0 283] CT
%%EndPageSetup
GS
[1.00046 0 0 1 0 0] CT
1 GC
N
0 0 425 283 re
f
GR
GS
[1.00046 0 0 1 0 0] CT
1 GC
N
0 0 425 283 re
f
GR
GS
[1.00046 0 0 1 0 0] CT
1 GC
N
64.5 248.5 M
384.5 248.5 L
384.5 21 L
64.5 21 L
cp
f
GR
GS
[1.00046 0 0 1 0 0] CT
0.149 GC
2 setlinecap
1 LJ
0.5 LW
N
64.5 248.5 M
384.5 248.5 L
S
GR
GS
[1.00046 0 0 1 0 0] CT
0.149 GC
2 setlinecap
1 LJ
0.5 LW
N
64.5 248.5 M
64.5 245.304 L
S
GR
GS
[1.00046 0 0 1 0 0] CT
0.149 GC
2 setlinecap
1 LJ
0.5 LW
N
110.214 248.5 M
110.214 245.304 L
S
GR
GS
[1.00046 0 0 1 0 0] CT
0.149 GC
2 setlinecap
1 LJ
0.5 LW
N
155.929 248.5 M
155.929 245.304 L
S
GR
GS
[1.00046 0 0 1 0 0] CT
0.149 GC
2 setlinecap
1 LJ
0.5 LW
N
201.643 248.5 M
201.643 245.304 L
S
GR
GS
[1.00046 0 0 1 0 0] CT
0.149 GC
2 setlinecap
1 LJ
0.5 LW
N
247.357 248.5 M
247.357 245.304 L
S
GR
GS
[1.00046 0 0 1 0 0] CT
0.149 GC
2 setlinecap
1 LJ
0.5 LW
N
293.071 248.5 M
293.071 245.304 L
S
GR
GS
[1.00046 0 0 1 0 0] CT
0.149 GC
2 setlinecap
1 LJ
0.5 LW
N
338.786 248.5 M
338.786 245.304 L
S
GR
GS
[1.00046 0 0 1 0 0] CT
0.149 GC
2 setlinecap
1 LJ
0.5 LW
N
384.5 248.5 M
384.5 245.304 L
S
GR
GS
[1.00046 0 0 1 64.52987 252.90001] CT
0.149 GC
/Helvetica 12 F
GS
[1 0 0 1 0 0] CT
-3.5 12 moveto 
1 -1 scale
(1) t 
GR
GR
GS
[1.00046 0 0 1 110.26533 252.90001] CT
0.149 GC
/Helvetica 12 F
GS
[1 0 0 1 0 0] CT
-3.5 12 moveto 
1 -1 scale
(2) t 
GR
GR
GS
[1.00046 0 0 1 156.00079 252.90001] CT
0.149 GC
/Helvetica 12 F
GS
[1 0 0 1 0 0] CT
-3.5 12 moveto 
1 -1 scale
(3) t 
GR
GR
GS
[1.00046 0 0 1 201.73624 252.90001] CT
0.149 GC
/Helvetica 12 F
GS
[1 0 0 1 0 0] CT
-3.5 12 moveto 
1 -1 scale
(4) t 
GR
GR
GS
[1.00046 0 0 1 247.47171 252.90001] CT
0.149 GC
/Helvetica 12 F
GS
[1 0 0 1 0 0] CT
-3.5 12 moveto 
1 -1 scale
(5) t 
GR
GR
GS
[1.00046 0 0 1 293.20718 252.90001] CT
0.149 GC
/Helvetica 12 F
GS
[1 0 0 1 0 0] CT
-3.5 12 moveto 
1 -1 scale
(6) t 
GR
GR
GS
[1.00046 0 0 1 338.94261 252.90001] CT
0.149 GC
/Helvetica 12 F
GS
[1 0 0 1 0 0] CT
-3.5 12 moveto 
1 -1 scale
(7) t 
GR
GR
GS
[1.00046 0 0 1 384.67808 252.90001] CT
0.149 GC
/Helvetica 12 F
GS
[1 0 0 1 0 0] CT
-3.5 12 moveto 
1 -1 scale
(8) t 
GR
GR
GS
[1.00046 0 0 1 224.60413 268.5] CT
0.149 GC
/Helvetica 12 F
GS
[1 0 0 1 0 0] CT
-21 12 moveto 
1 -1 scale
(Time \(s\)) t 
GR
GR
GS
[1.00046 0 0 1 0 0] CT
0.149 GC
2 setlinecap
1 LJ
0.5 LW
N
64.5 248.5 M
64.5 21 L
S
GR
GS
[1.00046 0 0 1 0 0] CT
0.149 GC
2 setlinecap
1 LJ
0.5 LW
N
64.5 248.5 M
67.696 248.5 L
S
GR
GS
[1.00046 0 0 1 0 0] CT
0.149 GC
2 setlinecap
1 LJ
0.5 LW
N
64.5 203 M
67.696 203 L
S
GR
GS
[1.00046 0 0 1 0 0] CT
0.149 GC
2 setlinecap
1 LJ
0.5 LW
N
64.5 157.5 M
67.696 157.5 L
S
GR
GS
[1.00046 0 0 1 0 0] CT
0.149 GC
2 setlinecap
1 LJ
0.5 LW
N
64.5 112 M
67.696 112 L
S
GR
GS
[1.00046 0 0 1 0 0] CT
0.149 GC
2 setlinecap
1 LJ
0.5 LW
N
64.5 66.5 M
67.696 66.5 L
S
GR
GS
[1.00046 0 0 1 0 0] CT
0.149 GC
2 setlinecap
1 LJ
0.5 LW
N
64.5 21 M
67.696 21 L
S
GR
GS
[1.00046 0 0 1 60.12783 248.5] CT
0.149 GC
/Helvetica 12 F
GS
[1 0 0 1 0 0] CT
-29 4.5 moveto 
1 -1 scale
(-0.05) t 
GR
GR
GS
[1.00046 0 0 1 60.12783 203] CT
0.149 GC
/Helvetica 12 F
GS
[1 0 0 1 0 0] CT
-7 4.5 moveto 
1 -1 scale
(0) t 
GR
GR
GS
[1.00046 0 0 1 60.12783 157.5] CT
0.149 GC
/Helvetica 12 F
GS
[1 0 0 1 0 0] CT
-24 4.5 moveto 
1 -1 scale
(0.05) t 
GR
GR
GS
[1.00046 0 0 1 60.12783 112] CT
0.149 GC
/Helvetica 12 F
GS
[1 0 0 1 0 0] CT
-17 4.5 moveto 
1 -1 scale
(0.1) t 
GR
GR
GS
[1.00046 0 0 1 60.12783 66.49999] CT
0.149 GC
/Helvetica 12 F
GS
[1 0 0 1 0 0] CT
-24 4.5 moveto 
1 -1 scale
(0.15) t 
GR
GR
GS
[1.00046 0 0 1 60.12783 21] CT
0.149 GC
/Helvetica 12 F
GS
[1 0 0 1 0 0] CT
-17 4.5 moveto 
1 -1 scale
(0.2) t 
GR
GR
GS
[0 -1 1.00046 0 29.01343 134.74989] CT
0.149 GC
/Helvetica 12 F
GS
[1 0 0 1 0 0] CT
-70 -18 moveto 
1 -1 scale
(60-150 Hz Gamma Power) t 
GR
GR
GS
[0 -1 1.00046 0 29.01343 134.74989] CT
0.149 GC
/Helvetica 12 F
GS
[1 0 0 1 0 0] CT
-46 -3 moveto 
1 -1 scale
(\(a.u.; normalized\)) t 
GR
GR
GS
[1.00046 0 0 1 0 0] CT
0.996 0.98 0.98 RC
N
101.071 196.033 M
103.357 196.798 L
105.643 197.088 L
107.929 196.545 L
110.214 197.665 L
112.5 199.267 L
114.786 199.899 L
117.071 201.891 L
119.357 200.372 L
121.643 200.386 L
123.929 202.714 L
126.214 201.576 L
128.5 200.59 L
130.786 201.112 L
133.071 202.91 L
135.357 203.579 L
137.643 205.485 L
139.929 208.972 L
142.214 209.516 L
144.5 210.657 L
146.786 211.965 L
149.071 214.317 L
151.357 214.729 L
153.643 205.989 L
155.929 199.323 L
158.214 192.803 L
160.5 175.462 L
162.786 166.288 L
165.071 154.536 L
167.357 144.365 L
169.643 134.692 L
171.929 122.219 L
174.214 128.494 L
176.5 132.225 L
178.786 127.861 L
181.071 132.373 L
183.357 135.71 L
185.643 136.014 L
187.929 139.984 L
190.214 140.617 L
192.5 143.786 L
194.786 147.163 L
197.071 150.634 L
199.357 152.217 L
201.643 150.42 L
203.929 151.806 L
206.214 152.857 L
208.5 156.871 L
210.786 157.965 L
213.071 158.006 L
215.357 157.311 L
217.643 164.509 L
219.929 164.468 L
222.214 164.825 L
224.5 163.806 L
226.786 163.738 L
229.071 164.387 L
231.357 161.54 L
233.643 159.024 L
235.929 157.972 L
238.214 155.167 L
240.5 154.201 L
242.786 156.851 L
245.071 154.513 L
247.357 155.817 L
249.643 158.401 L
251.929 160.647 L
254.214 163.692 L
256.5 163.439 L
258.786 159.92 L
261.071 161.52 L
263.357 161.941 L
265.643 158.657 L
267.929 157.38 L
270.214 154.85 L
272.5 155.866 L
274.786 154.466 L
277.071 151.959 L
279.357 153.999 L
281.643 154.495 L
283.929 153.858 L
286.214 154.885 L
288.5 152.835 L
290.786 151.965 L
293.071 151.343 L
295.357 146.415 L
297.643 144.27 L
299.929 150.328 L
302.214 146.272 L
304.5 136.832 L
306.786 122.997 L
309.071 112.965 L
311.357 105.568 L
313.643 96.283 L
315.929 85.235 L
318.214 86.445 L
320.5 93.657 L
322.786 106.035 L
325.071 118.445 L
327.357 132.662 L
329.643 143.094 L
331.929 151.752 L
334.214 160.408 L
336.5 164.727 L
338.786 167.884 L
341.071 170.943 L
343.357 173.821 L
345.643 179.762 L
347.929 182.191 L
350.214 182.219 L
352.5 182.78 L
354.786 184.784 L
357.071 185.255 L
359.357 186.241 L
361.643 184.266 L
363.929 179.909 L
366.214 180.722 L
368.5 180.355 L
370.786 180.448 L
373.071 182.328 L
375.357 179.84 L
377.643 177.87 L
379.929 179.845 L
382.214 178.275 L
384.5 173.796 L
384.5 161.269 L
382.214 165.426 L
379.929 166.244 L
377.643 162.966 L
375.357 164.313 L
373.071 165.274 L
370.786 162.644 L
368.5 162.401 L
366.214 161.116 L
363.929 158.819 L
361.643 161.349 L
359.357 162.584 L
357.071 160.335 L
354.786 159.592 L
352.5 157.023 L
350.214 155.212 L
347.929 153.571 L
345.643 149.943 L
343.357 144.166 L
341.071 141.35 L
338.786 138.495 L
336.5 134.401 L
334.214 131.817 L
331.929 124.734 L
329.643 117.636 L
327.357 108.101 L
325.071 96.016 L
322.786 83.503 L
320.5 69.181 L
318.214 60.101 L
315.929 59.456 L
313.643 70.534 L
311.357 81.19 L
309.071 90.772 L
306.786 104.714 L
304.5 121.627 L
302.214 130.973 L
299.929 135.355 L
297.643 130.12 L
295.357 132.26 L
293.071 138.428 L
290.786 138.126 L
288.5 138.704 L
286.214 141.554 L
283.929 140.489 L
281.643 140.806 L
279.357 139.92 L
277.071 137.049 L
274.786 139.897 L
272.5 140.572 L
270.214 138.807 L
267.929 141.932 L
265.643 143.282 L
263.357 147.178 L
261.071 147.252 L
258.786 146.554 L
256.5 150.471 L
254.214 150.877 L
251.929 148.025 L
249.643 145.448 L
247.357 142.866 L
245.071 141.639 L
242.786 144.186 L
240.5 142.053 L
238.214 142.973 L
235.929 145.136 L
233.643 146.054 L
231.357 147.967 L
229.071 150.036 L
226.786 149.551 L
224.5 149.791 L
222.214 150.304 L
219.929 150.532 L
217.643 151.07 L
215.357 144.281 L
213.071 146.273 L
210.786 146.414 L
208.5 145.275 L
206.214 141.541 L
203.929 140.29 L
201.643 139.014 L
199.357 140.738 L
197.071 138.772 L
194.786 135.025 L
192.5 131.853 L
190.214 127.767 L
187.929 126.991 L
185.643 122.969 L
183.357 123.079 L
181.071 120.807 L
178.786 116.949 L
176.5 121.434 L
174.214 118.206 L
171.929 111.612 L
169.643 123.721 L
167.357 133.022 L
165.071 143.168 L
162.786 155.257 L
160.5 165.372 L
158.214 182.735 L
155.929 190.012 L
153.643 196.657 L
151.357 206.427 L
149.071 206.892 L
146.786 205.659 L
144.5 205.349 L
142.214 204.675 L
139.929 204.438 L
137.643 201.383 L
135.357 199.074 L
133.071 197.905 L
130.786 196.383 L
128.5 195.733 L
126.214 196.132 L
123.929 196.539 L
121.643 194.057 L
119.357 193.698 L
117.071 193.584 L
114.786 191.135 L
112.5 189.008 L
110.214 186.901 L
107.929 185.132 L
105.643 185.131 L
103.357 185.016 L
101.071 184.956 L
98.786 186.832 L
96.5 184.307 L
94.214 181.28 L
91.929 180.237 L
89.643 181.267 L
87.357 181.799 L
85.071 180.086 L
82.786 172.77 L
80.5 169.853 L
78.214 167.945 L
75.929 167.437 L
73.643 166.245 L
71.357 165.098 L
69.071 163.141 L
66.786 162.994 L
64.5 162.388 L
64.5 175.691 L
66.786 176.578 L
69.071 176.054 L
71.357 177.209 L
73.643 177.773 L
75.929 178.668 L
78.214 179.047 L
80.5 180.508 L
82.786 183.39 L
85.071 191.223 L
87.357 192.737 L
89.643 192.863 L
91.929 192.4 L
94.214 193.26 L
96.5 195.964 L
98.786 198.078 L
cp
f
GR
GS
[1.00046 0 0 1 0 0] CT
0.98 0.91 0.91 RC
1 LJ
0.5 LW
N
64.5 175.691 M
66.786 176.578 L
69.071 176.054 L
71.357 177.209 L
73.643 177.773 L
75.929 178.668 L
78.214 179.047 L
80.5 180.508 L
82.786 183.39 L
85.071 191.223 L
87.357 192.737 L
89.643 192.863 L
91.929 192.4 L
94.214 193.26 L
96.5 195.964 L
98.786 198.078 L
101.071 196.033 L
103.357 196.798 L
105.643 197.088 L
107.929 196.545 L
110.214 197.665 L
112.5 199.267 L
114.786 199.899 L
117.071 201.891 L
119.357 200.372 L
121.643 200.386 L
123.929 202.714 L
126.214 201.576 L
128.5 200.59 L
130.786 201.112 L
133.071 202.91 L
135.357 203.579 L
137.643 205.485 L
139.929 208.972 L
142.214 209.516 L
144.5 210.657 L
146.786 211.965 L
149.071 214.317 L
151.357 214.729 L
153.643 205.989 L
155.929 199.323 L
158.214 192.803 L
160.5 175.462 L
162.786 166.288 L
165.071 154.536 L
167.357 144.365 L
169.643 134.692 L
171.929 122.219 L
174.214 128.494 L
176.5 132.225 L
178.786 127.861 L
181.071 132.373 L
183.357 135.71 L
185.643 136.014 L
187.929 139.984 L
190.214 140.617 L
192.5 143.786 L
194.786 147.163 L
197.071 150.634 L
199.357 152.217 L
201.643 150.42 L
203.929 151.806 L
206.214 152.857 L
208.5 156.871 L
210.786 157.965 L
213.071 158.006 L
215.357 157.311 L
217.643 164.509 L
219.929 164.468 L
222.214 164.825 L
224.5 163.806 L
226.786 163.738 L
229.071 164.387 L
231.357 161.54 L
233.643 159.024 L
235.929 157.972 L
238.214 155.167 L
240.5 154.201 L
242.786 156.851 L
245.071 154.513 L
247.357 155.817 L
249.643 158.401 L
251.929 160.647 L
254.214 163.692 L
256.5 163.439 L
258.786 159.92 L
261.071 161.52 L
263.357 161.941 L
265.643 158.657 L
267.929 157.38 L
270.214 154.85 L
272.5 155.866 L
274.786 154.466 L
277.071 151.959 L
279.357 153.999 L
281.643 154.495 L
283.929 153.858 L
286.214 154.885 L
288.5 152.835 L
290.786 151.965 L
293.071 151.343 L
295.357 146.415 L
297.643 144.27 L
299.929 150.328 L
302.214 146.272 L
304.5 136.832 L
306.786 122.997 L
309.071 112.965 L
311.357 105.568 L
313.643 96.283 L
315.929 85.235 L
318.214 86.445 L
320.5 93.657 L
322.786 106.035 L
325.071 118.445 L
327.357 132.662 L
329.643 143.094 L
331.929 151.752 L
334.214 160.408 L
336.5 164.727 L
338.786 167.884 L
341.071 170.943 L
343.357 173.821 L
345.643 179.762 L
347.929 182.191 L
350.214 182.219 L
352.5 182.78 L
354.786 184.784 L
357.071 185.255 L
359.357 186.241 L
361.643 184.266 L
363.929 179.909 L
366.214 180.722 L
368.5 180.355 L
370.786 180.448 L
373.071 182.328 L
375.357 179.84 L
377.643 177.87 L
379.929 179.845 L
382.214 178.275 L
384.5 173.796 L
S
GR
GS
[1.00046 0 0 1 0 0] CT
0.98 0.91 0.91 RC
1 LJ
0.5 LW
N
64.5 162.388 M
66.786 162.994 L
69.071 163.141 L
71.357 165.098 L
73.643 166.245 L
75.929 167.437 L
78.214 167.945 L
80.5 169.853 L
82.786 172.77 L
85.071 180.086 L
87.357 181.799 L
89.643 181.267 L
91.929 180.237 L
94.214 181.28 L
96.5 184.307 L
98.786 186.832 L
101.071 184.956 L
103.357 185.016 L
105.643 185.131 L
107.929 185.132 L
110.214 186.901 L
112.5 189.008 L
114.786 191.135 L
117.071 193.584 L
119.357 193.698 L
121.643 194.057 L
123.929 196.539 L
126.214 196.132 L
128.5 195.733 L
130.786 196.383 L
133.071 197.905 L
135.357 199.074 L
137.643 201.383 L
139.929 204.438 L
142.214 204.675 L
144.5 205.349 L
146.786 205.659 L
149.071 206.892 L
151.357 206.427 L
153.643 196.657 L
155.929 190.012 L
158.214 182.735 L
160.5 165.372 L
162.786 155.257 L
165.071 143.168 L
167.357 133.022 L
169.643 123.721 L
171.929 111.612 L
174.214 118.206 L
176.5 121.434 L
178.786 116.949 L
181.071 120.807 L
183.357 123.079 L
185.643 122.969 L
187.929 126.991 L
190.214 127.767 L
192.5 131.853 L
194.786 135.025 L
197.071 138.772 L
199.357 140.738 L
201.643 139.014 L
203.929 140.29 L
206.214 141.541 L
208.5 145.275 L
210.786 146.414 L
213.071 146.273 L
215.357 144.281 L
217.643 151.07 L
219.929 150.532 L
222.214 150.304 L
224.5 149.791 L
226.786 149.551 L
229.071 150.036 L
231.357 147.967 L
233.643 146.054 L
235.929 145.136 L
238.214 142.973 L
240.5 142.053 L
242.786 144.186 L
245.071 141.639 L
247.357 142.866 L
249.643 145.448 L
251.929 148.025 L
254.214 150.877 L
256.5 150.471 L
258.786 146.554 L
261.071 147.252 L
263.357 147.178 L
265.643 143.282 L
267.929 141.932 L
270.214 138.807 L
272.5 140.572 L
274.786 139.897 L
277.071 137.049 L
279.357 139.92 L
281.643 140.806 L
283.929 140.489 L
286.214 141.554 L
288.5 138.704 L
290.786 138.126 L
293.071 138.428 L
295.357 132.26 L
297.643 130.12 L
299.929 135.355 L
302.214 130.973 L
304.5 121.627 L
306.786 104.714 L
309.071 90.772 L
311.357 81.19 L
313.643 70.534 L
315.929 59.456 L
318.214 60.101 L
320.5 69.181 L
322.786 83.503 L
325.071 96.016 L
327.357 108.101 L
329.643 117.636 L
331.929 124.734 L
334.214 131.817 L
336.5 134.401 L
338.786 138.495 L
341.071 141.35 L
343.357 144.166 L
345.643 149.943 L
347.929 153.571 L
350.214 155.212 L
352.5 157.023 L
354.786 159.592 L
357.071 160.335 L
359.357 162.584 L
361.643 161.349 L
363.929 158.819 L
366.214 161.116 L
368.5 162.401 L
370.786 162.644 L
373.071 165.274 L
375.357 164.313 L
377.643 162.966 L
379.929 166.244 L
382.214 165.426 L
384.5 161.269 L
S
GR
GS
[1.00046 0 0 1 0 0] CT
0.961 0.8 0.8 RC
1 LJ
2 LW
N
64.5 169.039 M
66.786 169.786 L
69.071 169.598 L
71.357 171.154 L
73.643 172.009 L
75.929 173.052 L
78.214 173.496 L
80.5 175.181 L
82.786 178.08 L
85.071 185.654 L
87.357 187.268 L
89.643 187.065 L
91.929 186.318 L
94.214 187.27 L
96.5 190.135 L
98.786 192.455 L
101.071 190.495 L
103.357 190.907 L
105.643 191.11 L
107.929 190.839 L
110.214 192.283 L
112.5 194.138 L
114.786 195.517 L
117.071 197.738 L
119.357 197.035 L
121.643 197.222 L
123.929 199.627 L
126.214 198.854 L
128.5 198.162 L
130.786 198.748 L
133.071 200.407 L
135.357 201.327 L
137.643 203.434 L
139.929 206.705 L
142.214 207.096 L
144.5 208.003 L
146.786 208.812 L
149.071 210.605 L
151.357 210.578 L
153.643 201.323 L
155.929 194.668 L
158.214 187.769 L
160.5 170.417 L
162.786 160.773 L
165.071 148.852 L
167.357 138.694 L
169.643 129.206 L
171.929 116.915 L
174.214 123.35 L
176.5 126.829 L
178.786 122.405 L
181.071 126.59 L
183.357 129.395 L
185.643 129.492 L
187.929 133.487 L
190.214 134.192 L
192.5 137.82 L
194.786 141.094 L
197.071 144.703 L
199.357 146.478 L
201.643 144.717 L
203.929 146.048 L
206.214 147.199 L
208.5 151.073 L
210.786 152.189 L
213.071 152.14 L
215.357 150.796 L
217.643 157.79 L
219.929 157.5 L
222.214 157.564 L
224.5 156.798 L
226.786 156.644 L
229.071 157.211 L
231.357 154.754 L
233.643 152.539 L
235.929 151.554 L
238.214 149.07 L
240.5 148.127 L
242.786 150.518 L
245.071 148.076 L
247.357 149.341 L
249.643 151.924 L
251.929 154.336 L
254.214 157.284 L
256.5 156.955 L
258.786 153.237 L
261.071 154.386 L
263.357 154.56 L
265.643 150.969 L
267.929 149.656 L
270.214 146.828 L
272.5 148.219 L
274.786 147.182 L
277.071 144.504 L
279.357 146.959 L
281.643 147.65 L
283.929 147.173 L
286.214 148.219 L
288.5 145.77 L
290.786 145.046 L
293.071 144.886 L
295.357 139.337 L
297.643 137.195 L
299.929 142.842 L
302.214 138.622 L
304.5 129.23 L
306.786 113.856 L
309.071 101.869 L
311.357 93.379 L
313.643 83.408 L
315.929 72.345 L
318.214 73.273 L
320.5 81.419 L
322.786 94.769 L
325.071 107.231 L
327.357 120.381 L
329.643 130.365 L
331.929 138.243 L
334.214 146.112 L
336.5 149.564 L
338.786 153.19 L
341.071 156.147 L
343.357 158.994 L
345.643 164.853 L
347.929 167.881 L
350.214 168.716 L
352.5 169.902 L
354.786 172.188 L
357.071 172.795 L
359.357 174.413 L
361.643 172.807 L
363.929 169.364 L
366.214 170.919 L
368.5 171.378 L
370.786 171.546 L
373.071 173.801 L
375.357 172.077 L
377.643 170.418 L
379.929 173.045 L
382.214 171.851 L
384.5 167.532 L
S
GR
GS
[1.00046 0 0 1 0 0] CT
0.99 0.959 0.959 RC
N
82.786 201.135 M
85.071 198.495 L
87.357 194.11 L
89.643 191.398 L
91.929 190.532 L
94.214 188.149 L
96.5 186.515 L
98.786 188.025 L
101.071 190.218 L
103.357 191.953 L
105.643 192.951 L
107.929 195.003 L
110.214 197.386 L
112.5 199.663 L
114.786 198.197 L
117.071 200.544 L
119.357 203.851 L
121.643 204.739 L
123.929 202.199 L
126.214 202.706 L
128.5 203.994 L
130.786 207.137 L
133.071 207.775 L
135.357 205.023 L
137.643 205.445 L
139.929 205.762 L
142.214 206.85 L
144.5 208.266 L
146.786 207.841 L
149.071 210.045 L
151.357 212.06 L
153.643 206.391 L
155.929 206.067 L
158.214 197.248 L
160.5 177.637 L
162.786 166.181 L
165.071 157.771 L
167.357 147.067 L
169.643 138.199 L
171.929 129.108 L
174.214 137.324 L
176.5 143.352 L
178.786 142.102 L
181.071 145.555 L
183.357 149.195 L
185.643 150.233 L
187.929 151.531 L
190.214 153.159 L
192.5 153.148 L
194.786 154.843 L
197.071 153.158 L
199.357 157.547 L
201.643 157.41 L
203.929 158.937 L
206.214 159.774 L
208.5 163.238 L
210.786 164.703 L
213.071 167.518 L
215.357 164.036 L
217.643 164.672 L
219.929 166.16 L
222.214 164.874 L
224.5 164.553 L
226.786 166.446 L
229.071 166.354 L
231.357 166.489 L
233.643 168.459 L
235.929 167.372 L
238.214 167.709 L
240.5 169.78 L
242.786 170.159 L
245.071 173.217 L
247.357 175.132 L
249.643 173.67 L
251.929 175.869 L
254.214 173.881 L
256.5 168.528 L
258.786 168.878 L
261.071 165.77 L
263.357 165.571 L
265.643 166.263 L
267.929 165.685 L
270.214 168.313 L
272.5 170.096 L
274.786 170.225 L
277.071 168.741 L
279.357 166.236 L
281.643 162.136 L
283.929 161.069 L
286.214 157.674 L
288.5 157.305 L
290.786 154.925 L
293.071 155.59 L
295.357 153.93 L
297.643 157.212 L
299.929 157.566 L
302.214 152.427 L
304.5 142.252 L
306.786 137.409 L
309.071 133.17 L
311.357 128.628 L
313.643 118.576 L
315.929 110.795 L
318.214 108.849 L
320.5 110.148 L
322.786 106.53 L
325.071 106.727 L
327.357 108.776 L
329.643 112.474 L
331.929 113.608 L
334.214 116.728 L
336.5 119.237 L
338.786 122.577 L
341.071 129.348 L
343.357 133.7 L
345.643 133.624 L
347.929 134.711 L
350.214 142.051 L
352.5 148.51 L
354.786 151.807 L
357.071 151.932 L
359.357 152.057 L
361.643 157.734 L
363.929 162.804 L
366.214 161.543 L
368.5 165.252 L
370.786 166.93 L
373.071 168.303 L
375.357 170.315 L
377.643 170.912 L
379.929 167.683 L
382.214 167.04 L
384.5 163.542 L
384.5 149.288 L
382.214 152.793 L
379.929 153.325 L
377.643 156.234 L
375.357 155.399 L
373.071 152.926 L
370.786 152.57 L
368.5 151.152 L
366.214 147.682 L
363.929 148.3 L
361.643 142.42 L
359.357 136.847 L
357.071 136.918 L
354.786 135.191 L
352.5 132.286 L
350.214 126.371 L
347.929 119.798 L
345.643 118.66 L
343.357 118.092 L
341.071 114.214 L
338.786 108.248 L
336.5 104.089 L
334.214 101.643 L
331.929 98.849 L
329.643 97.876 L
327.357 94.206 L
325.071 91.91 L
322.786 90.512 L
320.5 92.848 L
318.214 91.086 L
315.929 92.027 L
313.643 101.057 L
311.357 112.434 L
309.071 117.58 L
306.786 123.6 L
304.5 128.875 L
302.214 139.382 L
299.929 145.139 L
297.643 144.773 L
295.357 141.646 L
293.071 143.27 L
290.786 142.768 L
288.5 145.651 L
286.214 145.632 L
283.929 148.202 L
281.643 149.432 L
279.357 153 L
277.071 155.807 L
274.786 157.11 L
272.5 157.568 L
270.214 156.433 L
267.929 154.45 L
265.643 155.197 L
263.357 155.161 L
261.071 154.377 L
258.786 157.537 L
256.5 157.59 L
254.214 162.853 L
251.929 164.411 L
249.643 162.034 L
247.357 162.985 L
245.071 161.568 L
242.786 158.742 L
240.5 158.649 L
238.214 157.126 L
235.929 157.075 L
233.643 157.829 L
231.357 155.076 L
229.071 153.8 L
226.786 153.646 L
224.5 151.581 L
222.214 151.695 L
219.929 152.263 L
217.643 151.161 L
215.357 151.29 L
213.071 154.731 L
210.786 152.239 L
208.5 150.35 L
206.214 146.912 L
203.929 146.52 L
201.643 144.98 L
199.357 144.57 L
197.071 141.126 L
194.786 142.987 L
192.5 141.632 L
190.214 141.585 L
187.929 140.075 L
185.643 139.239 L
183.357 138.998 L
181.071 135.363 L
178.786 132.258 L
176.5 132.898 L
174.214 126.083 L
171.929 117.288 L
169.643 125.769 L
167.357 134.422 L
165.071 146.177 L
162.786 154.761 L
160.5 166.682 L
158.214 187.034 L
155.929 196.391 L
153.643 197.252 L
151.357 204.076 L
149.071 202.059 L
146.786 200.478 L
144.5 201.995 L
142.214 201.051 L
139.929 200.773 L
137.643 200.97 L
135.357 200.245 L
133.071 202.332 L
130.786 201.979 L
128.5 198.771 L
126.214 196.714 L
123.929 195.503 L
121.643 197.348 L
119.357 195.186 L
117.071 191.394 L
114.786 188.505 L
112.5 189.784 L
110.214 187.836 L
107.929 185.824 L
105.643 184.073 L
103.357 182.902 L
101.071 181.17 L
98.786 178.351 L
96.5 176.119 L
94.214 176.92 L
91.929 179.256 L
89.643 180.065 L
87.357 182.901 L
85.071 187.841 L
82.786 190.143 L
80.5 191.898 L
78.214 191.038 L
75.929 192.298 L
73.643 190.948 L
71.357 188.46 L
69.071 184.86 L
66.786 183.953 L
64.5 177.48 L
64.5 188.673 L
66.786 195.039 L
69.071 196.658 L
71.357 200.542 L
73.643 202.498 L
75.929 203.27 L
78.214 201.234 L
80.5 202.377 L
cp
f
GR
GS
[1.00046 0 0 1 0 0] CT
0.957 0.82 0.82 RC
1 LJ
0.5 LW
N
64.5 188.673 M
66.786 195.039 L
69.071 196.658 L
71.357 200.542 L
73.643 202.498 L
75.929 203.27 L
78.214 201.234 L
80.5 202.377 L
82.786 201.135 L
85.071 198.495 L
87.357 194.11 L
89.643 191.398 L
91.929 190.532 L
94.214 188.149 L
96.5 186.515 L
98.786 188.025 L
101.071 190.218 L
103.357 191.953 L
105.643 192.951 L
107.929 195.003 L
110.214 197.386 L
112.5 199.663 L
114.786 198.197 L
117.071 200.544 L
119.357 203.851 L
121.643 204.739 L
123.929 202.199 L
126.214 202.706 L
128.5 203.994 L
130.786 207.137 L
133.071 207.775 L
135.357 205.023 L
137.643 205.445 L
139.929 205.762 L
142.214 206.85 L
144.5 208.266 L
146.786 207.841 L
149.071 210.045 L
151.357 212.06 L
153.643 206.391 L
155.929 206.067 L
158.214 197.248 L
160.5 177.637 L
162.786 166.181 L
165.071 157.771 L
167.357 147.067 L
169.643 138.199 L
171.929 129.108 L
174.214 137.324 L
176.5 143.352 L
178.786 142.102 L
181.071 145.555 L
183.357 149.195 L
185.643 150.233 L
187.929 151.531 L
190.214 153.159 L
192.5 153.148 L
194.786 154.843 L
197.071 153.158 L
199.357 157.547 L
201.643 157.41 L
203.929 158.937 L
206.214 159.774 L
208.5 163.238 L
210.786 164.703 L
213.071 167.518 L
215.357 164.036 L
217.643 164.672 L
219.929 166.16 L
222.214 164.874 L
224.5 164.553 L
226.786 166.446 L
229.071 166.354 L
231.357 166.489 L
233.643 168.459 L
235.929 167.372 L
238.214 167.709 L
240.5 169.78 L
242.786 170.159 L
245.071 173.217 L
247.357 175.132 L
249.643 173.67 L
251.929 175.869 L
254.214 173.881 L
256.5 168.528 L
258.786 168.878 L
261.071 165.77 L
263.357 165.571 L
265.643 166.263 L
267.929 165.685 L
270.214 168.313 L
272.5 170.096 L
274.786 170.225 L
277.071 168.741 L
279.357 166.236 L
281.643 162.136 L
283.929 161.069 L
286.214 157.674 L
288.5 157.305 L
290.786 154.925 L
293.071 155.59 L
295.357 153.93 L
297.643 157.212 L
299.929 157.566 L
302.214 152.427 L
304.5 142.252 L
306.786 137.409 L
309.071 133.17 L
311.357 128.628 L
313.643 118.576 L
315.929 110.795 L
318.214 108.849 L
320.5 110.148 L
322.786 106.53 L
325.071 106.727 L
327.357 108.776 L
329.643 112.474 L
331.929 113.608 L
334.214 116.728 L
336.5 119.237 L
338.786 122.577 L
341.071 129.348 L
343.357 133.7 L
345.643 133.624 L
347.929 134.711 L
350.214 142.051 L
352.5 148.51 L
354.786 151.807 L
357.071 151.932 L
359.357 152.057 L
361.643 157.734 L
363.929 162.804 L
366.214 161.543 L
368.5 165.252 L
370.786 166.93 L
373.071 168.303 L
375.357 170.315 L
377.643 170.912 L
379.929 167.683 L
382.214 167.04 L
384.5 163.542 L
S
GR
GS
[1.00046 0 0 1 0 0] CT
0.957 0.82 0.82 RC
1 LJ
0.5 LW
N
64.5 177.48 M
66.786 183.953 L
69.071 184.86 L
71.357 188.46 L
73.643 190.948 L
75.929 192.298 L
78.214 191.038 L
80.5 191.898 L
82.786 190.143 L
85.071 187.841 L
87.357 182.901 L
89.643 180.065 L
91.929 179.256 L
94.214 176.92 L
96.5 176.119 L
98.786 178.351 L
101.071 181.17 L
103.357 182.902 L
105.643 184.073 L
107.929 185.824 L
110.214 187.836 L
112.5 189.784 L
114.786 188.505 L
117.071 191.394 L
119.357 195.186 L
121.643 197.348 L
123.929 195.503 L
126.214 196.714 L
128.5 198.771 L
130.786 201.979 L
133.071 202.332 L
135.357 200.245 L
137.643 200.97 L
139.929 200.773 L
142.214 201.051 L
144.5 201.995 L
146.786 200.478 L
149.071 202.059 L
151.357 204.076 L
153.643 197.252 L
155.929 196.391 L
158.214 187.034 L
160.5 166.682 L
162.786 154.761 L
165.071 146.177 L
167.357 134.422 L
169.643 125.769 L
171.929 117.288 L
174.214 126.083 L
176.5 132.898 L
178.786 132.258 L
181.071 135.363 L
183.357 138.998 L
185.643 139.239 L
187.929 140.075 L
190.214 141.585 L
192.5 141.632 L
194.786 142.987 L
197.071 141.126 L
199.357 144.57 L
201.643 144.98 L
203.929 146.52 L
206.214 146.912 L
208.5 150.35 L
210.786 152.239 L
213.071 154.731 L
215.357 151.29 L
217.643 151.161 L
219.929 152.263 L
222.214 151.695 L
224.5 151.581 L
226.786 153.646 L
229.071 153.8 L
231.357 155.076 L
233.643 157.829 L
235.929 157.075 L
238.214 157.126 L
240.5 158.649 L
242.786 158.742 L
245.071 161.568 L
247.357 162.985 L
249.643 162.034 L
251.929 164.411 L
254.214 162.853 L
256.5 157.59 L
258.786 157.537 L
261.071 154.377 L
263.357 155.161 L
265.643 155.197 L
267.929 154.45 L
270.214 156.433 L
272.5 157.568 L
274.786 157.11 L
277.071 155.807 L
279.357 153 L
281.643 149.432 L
283.929 148.202 L
286.214 145.632 L
288.5 145.651 L
290.786 142.768 L
293.071 143.27 L
295.357 141.646 L
297.643 144.773 L
299.929 145.139 L
302.214 139.382 L
304.5 128.875 L
306.786 123.6 L
309.071 117.58 L
311.357 112.434 L
313.643 101.057 L
315.929 92.027 L
318.214 91.086 L
320.5 92.848 L
322.786 90.512 L
325.071 91.91 L
327.357 94.206 L
329.643 97.876 L
331.929 98.849 L
334.214 101.643 L
336.5 104.089 L
338.786 108.248 L
341.071 114.214 L
343.357 118.092 L
345.643 118.66 L
347.929 119.798 L
350.214 126.371 L
352.5 132.286 L
354.786 135.191 L
357.071 136.918 L
359.357 136.847 L
361.643 142.42 L
363.929 148.3 L
366.214 147.682 L
368.5 151.152 L
370.786 152.57 L
373.071 152.926 L
375.357 155.399 L
377.643 156.234 L
379.929 153.325 L
382.214 152.793 L
384.5 149.288 L
S
GR
GS
[1.00046 0 0 1 0 0] CT
0.898 0.6 0.6 RC
1 LJ
2 LW
N
64.5 183.077 M
66.786 189.496 L
69.071 190.759 L
71.357 194.501 L
73.643 196.723 L
75.929 197.784 L
78.214 196.136 L
80.5 197.138 L
82.786 195.639 L
85.071 193.168 L
87.357 188.505 L
89.643 185.731 L
91.929 184.894 L
94.214 182.535 L
96.5 181.317 L
98.786 183.188 L
101.071 185.694 L
103.357 187.427 L
105.643 188.512 L
107.929 190.414 L
110.214 192.611 L
112.5 194.724 L
114.786 193.351 L
117.071 195.969 L
119.357 199.518 L
121.643 201.044 L
123.929 198.851 L
126.214 199.71 L
128.5 201.383 L
130.786 204.558 L
133.071 205.053 L
135.357 202.634 L
137.643 203.207 L
139.929 203.267 L
142.214 203.95 L
144.5 205.131 L
146.786 204.16 L
149.071 206.052 L
151.357 208.068 L
153.643 201.821 L
155.929 201.229 L
158.214 192.141 L
160.5 172.159 L
162.786 160.471 L
165.071 151.974 L
167.357 140.745 L
169.643 131.984 L
171.929 123.198 L
174.214 131.704 L
176.5 138.125 L
178.786 137.18 L
181.071 140.459 L
183.357 144.096 L
185.643 144.736 L
187.929 145.803 L
190.214 147.372 L
192.5 147.39 L
194.786 148.915 L
197.071 147.142 L
199.357 151.059 L
201.643 151.195 L
203.929 152.729 L
206.214 153.343 L
208.5 156.794 L
210.786 158.471 L
213.071 161.124 L
215.357 157.663 L
217.643 157.917 L
219.929 159.212 L
222.214 158.284 L
224.5 158.067 L
226.786 160.046 L
229.071 160.077 L
231.357 160.783 L
233.643 163.144 L
235.929 162.224 L
238.214 162.417 L
240.5 164.214 L
242.786 164.451 L
245.071 167.393 L
247.357 169.058 L
249.643 167.852 L
251.929 170.14 L
254.214 168.367 L
256.5 163.059 L
258.786 163.208 L
261.071 160.073 L
263.357 160.366 L
265.643 160.73 L
267.929 160.068 L
270.214 162.373 L
272.5 163.832 L
274.786 163.668 L
277.071 162.274 L
279.357 159.618 L
281.643 155.784 L
283.929 154.636 L
286.214 151.653 L
288.5 151.478 L
290.786 148.846 L
293.071 149.43 L
295.357 147.788 L
297.643 150.992 L
299.929 151.352 L
302.214 145.905 L
304.5 135.564 L
306.786 130.505 L
309.071 125.375 L
311.357 120.531 L
313.643 109.816 L
315.929 101.411 L
318.214 99.967 L
320.5 101.498 L
322.786 98.521 L
325.071 99.318 L
327.357 101.491 L
329.643 105.175 L
331.929 106.229 L
334.214 109.185 L
336.5 111.663 L
338.786 115.412 L
341.071 121.781 L
343.357 125.896 L
345.643 126.142 L
347.929 127.254 L
350.214 134.211 L
352.5 140.398 L
354.786 143.499 L
357.071 144.425 L
359.357 144.452 L
361.643 150.077 L
363.929 155.552 L
366.214 154.613 L
368.5 158.202 L
370.786 159.75 L
373.071 160.614 L
375.357 162.857 L
377.643 163.573 L
379.929 160.504 L
382.214 159.916 L
384.5 156.415 L
S
GR
GS
[1.00046 0 0 1 0 0] CT
0.98 0.939 0.939 RC
N
96.5 185.64 M
98.786 186.48 L
101.071 184.796 L
103.357 187.346 L
105.643 189.337 L
107.929 189.771 L
110.214 192.559 L
112.5 193.35 L
114.786 189.258 L
117.071 190.021 L
119.357 190.12 L
121.643 191.354 L
123.929 194.035 L
126.214 193.568 L
128.5 196.923 L
130.786 203.777 L
133.071 207.544 L
135.357 212.036 L
137.643 214.083 L
139.929 212.39 L
142.214 213.825 L
144.5 213.349 L
146.786 214.056 L
149.071 211.689 L
151.357 211.292 L
153.643 202.799 L
155.929 203.046 L
158.214 191.716 L
160.5 174.085 L
162.786 167.666 L
165.071 161.635 L
167.357 151.228 L
169.643 140.695 L
171.929 130.639 L
174.214 140.581 L
176.5 147.381 L
178.786 141.954 L
181.071 144.917 L
183.357 147.81 L
185.643 149.974 L
187.929 151.325 L
190.214 154.802 L
192.5 154.841 L
194.786 156.29 L
197.071 155.385 L
199.357 158.758 L
201.643 160.7 L
203.929 164.811 L
206.214 168.008 L
208.5 169.967 L
210.786 167.764 L
213.071 166.206 L
215.357 163.959 L
217.643 165.65 L
219.929 166.527 L
222.214 165.702 L
224.5 164.149 L
226.786 167.794 L
229.071 167.3 L
231.357 166.133 L
233.643 165.746 L
235.929 163.815 L
238.214 165.621 L
240.5 165.692 L
242.786 163.976 L
245.071 165.945 L
247.357 166.584 L
249.643 167.038 L
251.929 169.628 L
254.214 173.298 L
256.5 175.666 L
258.786 176.664 L
261.071 178.161 L
263.357 179.735 L
265.643 177.469 L
267.929 175.913 L
270.214 174.441 L
272.5 176.491 L
274.786 177.699 L
277.071 174.233 L
279.357 171.663 L
281.643 170.583 L
283.929 168.002 L
286.214 167.933 L
288.5 168.073 L
290.786 164.818 L
293.071 161.869 L
295.357 160.655 L
297.643 161.138 L
299.929 164.296 L
302.214 156.638 L
304.5 147.455 L
306.786 138.455 L
309.071 133.931 L
311.357 123.439 L
313.643 108.501 L
315.929 98.223 L
318.214 96.933 L
320.5 93.435 L
322.786 94.806 L
325.071 98.212 L
327.357 104.556 L
329.643 112.841 L
331.929 114.621 L
334.214 118.104 L
336.5 125.809 L
338.786 130.481 L
341.071 129.744 L
343.357 130.369 L
345.643 128.39 L
347.929 131.171 L
350.214 128.02 L
352.5 128.467 L
354.786 129.719 L
357.071 133.812 L
359.357 137.967 L
361.643 142.705 L
363.929 145.093 L
366.214 149.97 L
368.5 151.889 L
370.786 153.435 L
373.071 153.208 L
375.357 156.309 L
377.643 154.224 L
379.929 157.006 L
382.214 156.604 L
384.5 156.363 L
384.5 141.252 L
382.214 141.224 L
379.929 141.865 L
377.643 139.646 L
375.357 141.593 L
373.071 138.246 L
370.786 138.528 L
368.5 136.948 L
366.214 134.953 L
363.929 130.055 L
361.643 126.682 L
359.357 123.511 L
357.071 119.198 L
354.786 113.83 L
352.5 112.733 L
350.214 112.786 L
347.929 114.786 L
345.643 113.226 L
343.357 115.56 L
341.071 114.863 L
338.786 115.575 L
336.5 110.923 L
334.214 103.846 L
331.929 100.312 L
329.643 96.221 L
327.357 85.01 L
325.071 78.78 L
322.786 76.846 L
320.5 76.494 L
318.214 80.322 L
315.929 82.476 L
313.643 93.665 L
311.357 110.545 L
309.071 121.886 L
306.786 127.145 L
304.5 135.424 L
302.214 143.905 L
299.929 151.848 L
297.643 149.275 L
295.357 148.454 L
293.071 149.491 L
290.786 152.172 L
288.5 155.812 L
286.214 156.289 L
283.929 155.737 L
281.643 157.851 L
279.357 159.395 L
277.071 162.471 L
274.786 165.785 L
272.5 164.046 L
270.214 161.103 L
267.929 162.946 L
265.643 164.395 L
263.357 167.107 L
261.071 165.104 L
258.786 163.605 L
256.5 162.947 L
254.214 161.219 L
251.929 157.81 L
249.643 155.243 L
247.357 154.202 L
245.071 154.044 L
242.786 151.78 L
240.5 153.325 L
238.214 152.974 L
235.929 151.646 L
233.643 152.644 L
231.357 151.845 L
229.071 151.949 L
226.786 153.235 L
224.5 149.635 L
222.214 151.509 L
219.929 153.146 L
217.643 153.468 L
215.357 152.455 L
213.071 154.237 L
210.786 155.617 L
208.5 158.262 L
206.214 156.239 L
203.929 152.612 L
201.643 148.586 L
199.357 146.149 L
197.071 143.193 L
194.786 144.02 L
192.5 142.503 L
190.214 142.229 L
187.929 139.101 L
185.643 138.057 L
183.357 136.792 L
181.071 134.33 L
178.786 131.558 L
176.5 137.291 L
174.214 130.903 L
171.929 121.31 L
169.643 131.348 L
167.357 141.789 L
165.071 151.998 L
162.786 158.381 L
160.5 164.936 L
158.214 182.244 L
155.929 194.022 L
153.643 194.073 L
151.357 202.237 L
149.071 202.569 L
146.786 206.597 L
144.5 207.471 L
142.214 208.609 L
139.929 207.95 L
137.643 208.943 L
135.357 206.615 L
133.071 202.451 L
130.786 198.933 L
128.5 191.617 L
126.214 187.372 L
123.929 186.923 L
121.643 183.319 L
119.357 181.089 L
117.071 180.458 L
114.786 178.983 L
112.5 182.317 L
110.214 181.298 L
107.929 178.119 L
105.643 177.521 L
103.357 175.508 L
101.071 172.857 L
98.786 174.314 L
96.5 173.22 L
94.214 169.004 L
91.929 167.68 L
89.643 168.076 L
87.357 167.006 L
85.071 165.319 L
82.786 161.832 L
80.5 160.633 L
78.214 159.692 L
75.929 157.332 L
73.643 156.514 L
71.357 156.195 L
69.071 154.443 L
66.786 153.121 L
64.5 152.756 L
64.5 163.93 L
66.786 164.584 L
69.071 165.743 L
71.357 167.648 L
73.643 168.144 L
75.929 168.544 L
78.214 170.914 L
80.5 171.629 L
82.786 173.209 L
85.071 176.432 L
87.357 177.55 L
89.643 179.012 L
91.929 179.005 L
94.214 180.735 L
cp
f
GR
GS
[1.00046 0 0 1 0 0] CT
0.91 0.729 0.729 RC
1 LJ
0.5 LW
N
64.5 163.93 M
66.786 164.584 L
69.071 165.743 L
71.357 167.648 L
73.643 168.144 L
75.929 168.544 L
78.214 170.914 L
80.5 171.629 L
82.786 173.209 L
85.071 176.432 L
87.357 177.55 L
89.643 179.012 L
91.929 179.005 L
94.214 180.735 L
96.5 185.64 L
98.786 186.48 L
101.071 184.796 L
103.357 187.346 L
105.643 189.337 L
107.929 189.771 L
110.214 192.559 L
112.5 193.35 L
114.786 189.258 L
117.071 190.021 L
119.357 190.12 L
121.643 191.354 L
123.929 194.035 L
126.214 193.568 L
128.5 196.923 L
130.786 203.777 L
133.071 207.544 L
135.357 212.036 L
137.643 214.083 L
139.929 212.39 L
142.214 213.825 L
144.5 213.349 L
146.786 214.056 L
149.071 211.689 L
151.357 211.292 L
153.643 202.799 L
155.929 203.046 L
158.214 191.716 L
160.5 174.085 L
162.786 167.666 L
165.071 161.635 L
167.357 151.228 L
169.643 140.695 L
171.929 130.639 L
174.214 140.581 L
176.5 147.381 L
178.786 141.954 L
181.071 144.917 L
183.357 147.81 L
185.643 149.974 L
187.929 151.325 L
190.214 154.802 L
192.5 154.841 L
194.786 156.29 L
197.071 155.385 L
199.357 158.758 L
201.643 160.7 L
203.929 164.811 L
206.214 168.008 L
208.5 169.967 L
210.786 167.764 L
213.071 166.206 L
215.357 163.959 L
217.643 165.65 L
219.929 166.527 L
222.214 165.702 L
224.5 164.149 L
226.786 167.794 L
229.071 167.3 L
231.357 166.133 L
233.643 165.746 L
235.929 163.815 L
238.214 165.621 L
240.5 165.692 L
242.786 163.976 L
245.071 165.945 L
247.357 166.584 L
249.643 167.038 L
251.929 169.628 L
254.214 173.298 L
256.5 175.666 L
258.786 176.664 L
261.071 178.161 L
263.357 179.735 L
265.643 177.469 L
267.929 175.913 L
270.214 174.441 L
272.5 176.491 L
274.786 177.699 L
277.071 174.233 L
279.357 171.663 L
281.643 170.583 L
283.929 168.002 L
286.214 167.933 L
288.5 168.073 L
290.786 164.818 L
293.071 161.869 L
295.357 160.655 L
297.643 161.138 L
299.929 164.296 L
302.214 156.638 L
304.5 147.455 L
306.786 138.455 L
309.071 133.931 L
311.357 123.439 L
313.643 108.501 L
315.929 98.223 L
318.214 96.933 L
320.5 93.435 L
322.786 94.806 L
325.071 98.212 L
327.357 104.556 L
329.643 112.841 L
331.929 114.621 L
334.214 118.104 L
336.5 125.809 L
338.786 130.481 L
341.071 129.744 L
343.357 130.369 L
345.643 128.39 L
347.929 131.171 L
350.214 128.02 L
352.5 128.467 L
354.786 129.719 L
357.071 133.812 L
359.357 137.967 L
361.643 142.705 L
363.929 145.093 L
366.214 149.97 L
368.5 151.889 L
370.786 153.435 L
373.071 153.208 L
375.357 156.309 L
377.643 154.224 L
379.929 157.006 L
382.214 156.604 L
384.5 156.363 L
S
GR
GS
[1.00046 0 0 1 0 0] CT
0.91 0.729 0.729 RC
1 LJ
0.5 LW
N
64.5 152.756 M
66.786 153.121 L
69.071 154.443 L
71.357 156.195 L
73.643 156.514 L
75.929 157.332 L
78.214 159.692 L
80.5 160.633 L
82.786 161.832 L
85.071 165.319 L
87.357 167.006 L
89.643 168.076 L
91.929 167.68 L
94.214 169.004 L
96.5 173.22 L
98.786 174.314 L
101.071 172.857 L
103.357 175.508 L
105.643 177.521 L
107.929 178.119 L
110.214 181.298 L
112.5 182.317 L
114.786 178.983 L
117.071 180.458 L
119.357 181.089 L
121.643 183.319 L
123.929 186.923 L
126.214 187.372 L
128.5 191.617 L
130.786 198.933 L
133.071 202.451 L
135.357 206.615 L
137.643 208.943 L
139.929 207.95 L
142.214 208.609 L
144.5 207.471 L
146.786 206.597 L
149.071 202.569 L
151.357 202.237 L
153.643 194.073 L
155.929 194.022 L
158.214 182.244 L
160.5 164.936 L
162.786 158.381 L
165.071 151.998 L
167.357 141.789 L
169.643 131.348 L
171.929 121.31 L
174.214 130.903 L
176.5 137.291 L
178.786 131.558 L
181.071 134.33 L
183.357 136.792 L
185.643 138.057 L
187.929 139.101 L
190.214 142.229 L
192.5 142.503 L
194.786 144.02 L
197.071 143.193 L
199.357 146.149 L
201.643 148.586 L
203.929 152.612 L
206.214 156.239 L
208.5 158.262 L
210.786 155.617 L
213.071 154.237 L
215.357 152.455 L
217.643 153.468 L
219.929 153.146 L
222.214 151.509 L
224.5 149.635 L
226.786 153.235 L
229.071 151.949 L
231.357 151.845 L
233.643 152.644 L
235.929 151.646 L
238.214 152.974 L
240.5 153.325 L
242.786 151.78 L
245.071 154.044 L
247.357 154.202 L
249.643 155.243 L
251.929 157.81 L
254.214 161.219 L
256.5 162.947 L
258.786 163.605 L
261.071 165.104 L
263.357 167.107 L
265.643 164.395 L
267.929 162.946 L
270.214 161.103 L
272.5 164.046 L
274.786 165.785 L
277.071 162.471 L
279.357 159.395 L
281.643 157.851 L
283.929 155.737 L
286.214 156.289 L
288.5 155.812 L
290.786 152.172 L
293.071 149.491 L
295.357 148.454 L
297.643 149.275 L
299.929 151.848 L
302.214 143.905 L
304.5 135.424 L
306.786 127.145 L
309.071 121.886 L
311.357 110.545 L
313.643 93.665 L
315.929 82.476 L
318.214 80.322 L
320.5 76.494 L
322.786 76.846 L
325.071 78.78 L
327.357 85.01 L
329.643 96.221 L
331.929 100.312 L
334.214 103.846 L
336.5 110.923 L
338.786 115.575 L
341.071 114.863 L
343.357 115.56 L
345.643 113.226 L
347.929 114.786 L
350.214 112.786 L
352.5 112.733 L
354.786 113.83 L
357.071 119.198 L
359.357 123.511 L
361.643 126.682 L
363.929 130.055 L
366.214 134.953 L
368.5 136.948 L
370.786 138.528 L
373.071 138.246 L
375.357 141.593 L
377.643 139.646 L
379.929 141.865 L
382.214 141.224 L
384.5 141.252 L
S
GR
GS
[1.00046 0 0 1 0 0] CT
0.8 0.4 0.4 RC
1 LJ
2 LW
N
64.5 158.343 M
66.786 158.853 L
69.071 160.093 L
71.357 161.921 L
73.643 162.329 L
75.929 162.938 L
78.214 165.303 L
80.5 166.131 L
82.786 167.521 L
85.071 170.876 L
87.357 172.278 L
89.643 173.544 L
91.929 173.342 L
94.214 174.869 L
96.5 179.43 L
98.786 180.397 L
101.071 178.826 L
103.357 181.427 L
105.643 183.429 L
107.929 183.945 L
110.214 186.929 L
112.5 187.833 L
114.786 184.12 L
117.071 185.24 L
119.357 185.604 L
121.643 187.336 L
123.929 190.479 L
126.214 190.47 L
128.5 194.27 L
130.786 201.355 L
133.071 204.998 L
135.357 209.326 L
137.643 211.513 L
139.929 210.17 L
142.214 211.217 L
144.5 210.41 L
146.786 210.327 L
149.071 207.129 L
151.357 206.765 L
153.643 198.436 L
155.929 198.534 L
158.214 186.98 L
160.5 169.511 L
162.786 163.023 L
165.071 156.816 L
167.357 146.508 L
169.643 136.022 L
171.929 125.975 L
174.214 135.742 L
176.5 142.336 L
178.786 136.756 L
181.071 139.624 L
183.357 142.301 L
185.643 144.016 L
187.929 145.213 L
190.214 148.516 L
192.5 148.672 L
194.786 150.155 L
197.071 149.289 L
199.357 152.453 L
201.643 154.643 L
203.929 158.712 L
206.214 162.123 L
208.5 164.114 L
210.786 161.691 L
213.071 160.221 L
215.357 158.207 L
217.643 159.559 L
219.929 159.837 L
222.214 158.606 L
224.5 156.892 L
226.786 160.515 L
229.071 159.625 L
231.357 158.989 L
233.643 159.195 L
235.929 157.731 L
238.214 159.298 L
240.5 159.509 L
242.786 157.878 L
245.071 159.995 L
247.357 160.393 L
249.643 161.14 L
251.929 163.719 L
254.214 167.258 L
256.5 169.307 L
258.786 170.134 L
261.071 171.632 L
263.357 173.421 L
265.643 170.932 L
267.929 169.43 L
270.214 167.772 L
272.5 170.268 L
274.786 171.742 L
277.071 168.352 L
279.357 165.529 L
281.643 164.217 L
283.929 161.87 L
286.214 162.111 L
288.5 161.943 L
290.786 158.495 L
293.071 155.68 L
295.357 154.555 L
297.643 155.206 L
299.929 158.072 L
302.214 150.271 L
304.5 141.439 L
306.786 132.8 L
309.071 127.909 L
311.357 116.992 L
313.643 101.083 L
315.929 90.349 L
318.214 88.628 L
320.5 84.964 L
322.786 85.826 L
325.071 88.496 L
327.357 94.783 L
329.643 104.531 L
331.929 107.467 L
334.214 110.975 L
336.5 118.366 L
338.786 123.028 L
341.071 122.304 L
343.357 122.965 L
345.643 120.808 L
347.929 122.978 L
350.214 120.403 L
352.5 120.6 L
354.786 121.775 L
357.071 126.505 L
359.357 130.739 L
361.643 134.694 L
363.929 137.574 L
366.214 142.462 L
368.5 144.419 L
370.786 145.981 L
373.071 145.727 L
375.357 148.951 L
377.643 146.935 L
379.929 149.436 L
382.214 148.914 L
384.5 148.807 L
S
GR
GS
[1.00046 0 0 1 0 0] CT
0.959 0.918 0.918 RC
N
98.786 201.7 M
101.071 204.738 L
103.357 208.295 L
105.643 206.242 L
107.929 206.921 L
110.214 206.387 L
112.5 203.606 L
114.786 201.38 L
117.071 199.674 L
119.357 197.246 L
121.643 198.662 L
123.929 200.32 L
126.214 200.4 L
128.5 199.084 L
130.786 202.184 L
133.071 203.552 L
135.357 208.243 L
137.643 209.744 L
139.929 207.343 L
142.214 209.462 L
144.5 213.238 L
146.786 210.962 L
149.071 212.407 L
151.357 215.497 L
153.643 208.805 L
155.929 208.82 L
158.214 199.207 L
160.5 183.354 L
162.786 178.327 L
165.071 171.028 L
167.357 162.264 L
169.643 151.268 L
171.929 141.625 L
174.214 148.647 L
176.5 149.572 L
178.786 147.488 L
181.071 152.912 L
183.357 152.642 L
185.643 157.428 L
187.929 162.367 L
190.214 166.683 L
192.5 172.349 L
194.786 172.504 L
197.071 168.735 L
199.357 169.104 L
201.643 170.494 L
203.929 173.083 L
206.214 175.157 L
208.5 179.846 L
210.786 181.447 L
213.071 187.507 L
215.357 193.684 L
217.643 191.405 L
219.929 188.109 L
222.214 184.595 L
224.5 180.885 L
226.786 181.422 L
229.071 180.534 L
231.357 179.527 L
233.643 182.485 L
235.929 184.697 L
238.214 185.574 L
240.5 187.413 L
242.786 190.644 L
245.071 186.958 L
247.357 188.205 L
249.643 186.929 L
251.929 187.19 L
254.214 186.613 L
256.5 184.356 L
258.786 182.767 L
261.071 181.615 L
263.357 177.761 L
265.643 174.42 L
267.929 171.723 L
270.214 170.531 L
272.5 173.642 L
274.786 175.276 L
277.071 180.392 L
279.357 181.84 L
281.643 184.211 L
283.929 186.599 L
286.214 185.437 L
288.5 181.337 L
290.786 179.387 L
293.071 177.772 L
295.357 175.157 L
297.643 172.387 L
299.929 173.305 L
302.214 171.06 L
304.5 164.541 L
306.786 159.589 L
309.071 154.153 L
311.357 151.094 L
313.643 143.513 L
315.929 136.519 L
318.214 130.68 L
320.5 125.965 L
322.786 120.724 L
325.071 117.4 L
327.357 117.02 L
329.643 119.657 L
331.929 120.396 L
334.214 124.938 L
336.5 126.112 L
338.786 130.774 L
341.071 131.462 L
343.357 132.642 L
345.643 134.499 L
347.929 140.939 L
350.214 144.162 L
352.5 150.648 L
354.786 154.384 L
357.071 156.928 L
359.357 160.956 L
361.643 165.406 L
363.929 169.823 L
366.214 173.038 L
368.5 176.806 L
370.786 179.998 L
373.071 183.586 L
375.357 182.424 L
377.643 185.684 L
379.929 183.581 L
382.214 180.271 L
384.5 173.57 L
384.5 161.228 L
382.214 168.204 L
379.929 170.81 L
377.643 171.893 L
375.357 168.333 L
373.071 169.208 L
370.786 165.573 L
368.5 162.265 L
366.214 157.995 L
363.929 154.601 L
361.643 149.724 L
359.357 143.673 L
357.071 138.295 L
354.786 135.449 L
352.5 131.314 L
350.214 122.481 L
347.929 119.334 L
345.643 110.958 L
343.357 108.269 L
341.071 108.183 L
338.786 107.968 L
336.5 103.667 L
334.214 104.013 L
331.929 100.83 L
329.643 102.69 L
327.357 103.201 L
325.071 105.102 L
322.786 106.686 L
320.5 109.462 L
318.214 111.442 L
315.929 115.999 L
313.643 124.174 L
311.357 133.631 L
309.071 137.764 L
306.786 144.955 L
304.5 151.186 L
302.214 158.015 L
299.929 160.734 L
297.643 159.149 L
295.357 161.958 L
293.071 164.297 L
290.786 165.167 L
288.5 167.164 L
286.214 171.857 L
283.929 172.39 L
281.643 169.717 L
279.357 167.698 L
277.071 166.332 L
274.786 161.673 L
272.5 160.484 L
270.214 156.92 L
267.929 159.058 L
265.643 161.773 L
263.357 164.626 L
261.071 168.233 L
258.786 170.503 L
256.5 172.194 L
254.214 174.787 L
251.929 174.99 L
249.643 174.568 L
247.357 175.726 L
245.071 174.755 L
242.786 178.641 L
240.5 175.687 L
238.214 174.443 L
235.929 173.287 L
233.643 170.645 L
231.357 167.217 L
229.071 167.103 L
226.786 167.851 L
224.5 167.744 L
222.214 171.356 L
219.929 174.979 L
217.643 178.593 L
215.357 180.998 L
213.071 175.202 L
210.786 168.95 L
208.5 167.483 L
206.214 163.15 L
203.929 161.927 L
201.643 158.765 L
199.357 157.541 L
197.071 157.753 L
194.786 160.788 L
192.5 160.574 L
190.214 155.345 L
187.929 150.958 L
185.643 146.566 L
183.357 141.958 L
181.071 142.56 L
178.786 137.876 L
176.5 140.862 L
174.214 139.561 L
171.929 132.149 L
169.643 141.344 L
167.357 152.387 L
165.071 161.636 L
162.786 168.733 L
160.5 174.261 L
158.214 190.244 L
155.929 200.02 L
153.643 200.473 L
151.357 207.83 L
149.071 205.098 L
146.786 204.276 L
144.5 207.66 L
142.214 204.867 L
139.929 202.554 L
137.643 204.746 L
135.357 203.086 L
133.071 198.435 L
130.786 197.185 L
128.5 194.41 L
126.214 194.868 L
123.929 193.968 L
121.643 191.246 L
119.357 188.468 L
117.071 190.04 L
114.786 191.363 L
112.5 192.819 L
110.214 195.103 L
107.929 195.259 L
105.643 194.316 L
103.357 196.309 L
101.071 192.5 L
98.786 189.758 L
96.5 186.3 L
94.214 182.833 L
91.929 180.783 L
89.643 179.047 L
87.357 172.514 L
85.071 167.716 L
82.786 161.82 L
80.5 158.503 L
78.214 151.911 L
75.929 146.86 L
73.643 144.231 L
71.357 146.795 L
69.071 148.59 L
66.786 153.114 L
64.5 154.871 L
64.5 168.643 L
66.786 167.467 L
69.071 162.336 L
71.357 159.824 L
73.643 157.942 L
75.929 160.145 L
78.214 164.814 L
80.5 171.103 L
82.786 174.402 L
85.071 179.523 L
87.357 184.485 L
89.643 190.739 L
91.929 192.38 L
94.214 193.607 L
96.5 197.239 L
cp
f
GR
GS
[1.00046 0 0 1 0 0] CT
0.82 0.639 0.639 RC
1 LJ
0.5 LW
N
64.5 168.643 M
66.786 167.467 L
69.071 162.336 L
71.357 159.824 L
73.643 157.942 L
75.929 160.145 L
78.214 164.814 L
80.5 171.103 L
82.786 174.402 L
85.071 179.523 L
87.357 184.485 L
89.643 190.739 L
91.929 192.38 L
94.214 193.607 L
96.5 197.239 L
98.786 201.7 L
101.071 204.738 L
103.357 208.295 L
105.643 206.242 L
107.929 206.921 L
110.214 206.387 L
112.5 203.606 L
114.786 201.38 L
117.071 199.674 L
119.357 197.246 L
121.643 198.662 L
123.929 200.32 L
126.214 200.4 L
128.5 199.084 L
130.786 202.184 L
133.071 203.552 L
135.357 208.243 L
137.643 209.744 L
139.929 207.343 L
142.214 209.462 L
144.5 213.238 L
146.786 210.962 L
149.071 212.407 L
151.357 215.497 L
153.643 208.805 L
155.929 208.82 L
158.214 199.207 L
160.5 183.354 L
162.786 178.327 L
165.071 171.028 L
167.357 162.264 L
169.643 151.268 L
171.929 141.625 L
174.214 148.647 L
176.5 149.572 L
178.786 147.488 L
181.071 152.912 L
183.357 152.642 L
185.643 157.428 L
187.929 162.367 L
190.214 166.683 L
192.5 172.349 L
194.786 172.504 L
197.071 168.735 L
199.357 169.104 L
201.643 170.494 L
203.929 173.083 L
206.214 175.157 L
208.5 179.846 L
210.786 181.447 L
213.071 187.507 L
215.357 193.684 L
217.643 191.405 L
219.929 188.109 L
222.214 184.595 L
224.5 180.885 L
226.786 181.422 L
229.071 180.534 L
231.357 179.527 L
233.643 182.485 L
235.929 184.697 L
238.214 185.574 L
240.5 187.413 L
242.786 190.644 L
245.071 186.958 L
247.357 188.205 L
249.643 186.929 L
251.929 187.19 L
254.214 186.613 L
256.5 184.356 L
258.786 182.767 L
261.071 181.615 L
263.357 177.761 L
265.643 174.42 L
267.929 171.723 L
270.214 170.531 L
272.5 173.642 L
274.786 175.276 L
277.071 180.392 L
279.357 181.84 L
281.643 184.211 L
283.929 186.599 L
286.214 185.437 L
288.5 181.337 L
290.786 179.387 L
293.071 177.772 L
295.357 175.157 L
297.643 172.387 L
299.929 173.305 L
302.214 171.06 L
304.5 164.541 L
306.786 159.589 L
309.071 154.153 L
311.357 151.094 L
313.643 143.513 L
315.929 136.519 L
318.214 130.68 L
320.5 125.965 L
322.786 120.724 L
325.071 117.4 L
327.357 117.02 L
329.643 119.657 L
331.929 120.396 L
334.214 124.938 L
336.5 126.112 L
338.786 130.774 L
341.071 131.462 L
343.357 132.642 L
345.643 134.499 L
347.929 140.939 L
350.214 144.162 L
352.5 150.648 L
354.786 154.384 L
357.071 156.928 L
359.357 160.956 L
361.643 165.406 L
363.929 169.823 L
366.214 173.038 L
368.5 176.806 L
370.786 179.998 L
373.071 183.586 L
375.357 182.424 L
377.643 185.684 L
379.929 183.581 L
382.214 180.271 L
384.5 173.57 L
S
GR
GS
[1.00046 0 0 1 0 0] CT
0.82 0.639 0.639 RC
1 LJ
0.5 LW
N
64.5 154.871 M
66.786 153.114 L
69.071 148.59 L
71.357 146.795 L
73.643 144.231 L
75.929 146.86 L
78.214 151.911 L
80.5 158.503 L
82.786 161.82 L
85.071 167.716 L
87.357 172.514 L
89.643 179.047 L
91.929 180.783 L
94.214 182.833 L
96.5 186.3 L
98.786 189.758 L
101.071 192.5 L
103.357 196.309 L
105.643 194.316 L
107.929 195.259 L
110.214 195.103 L
112.5 192.819 L
114.786 191.363 L
117.071 190.04 L
119.357 188.468 L
121.643 191.246 L
123.929 193.968 L
126.214 194.868 L
128.5 194.41 L
130.786 197.185 L
133.071 198.435 L
135.357 203.086 L
137.643 204.746 L
139.929 202.554 L
142.214 204.867 L
144.5 207.66 L
146.786 204.276 L
149.071 205.098 L
151.357 207.83 L
153.643 200.473 L
155.929 200.02 L
158.214 190.244 L
160.5 174.261 L
162.786 168.733 L
165.071 161.636 L
167.357 152.387 L
169.643 141.344 L
171.929 132.149 L
174.214 139.561 L
176.5 140.862 L
178.786 137.876 L
181.071 142.56 L
183.357 141.958 L
185.643 146.566 L
187.929 150.958 L
190.214 155.345 L
192.5 160.574 L
194.786 160.788 L
197.071 157.753 L
199.357 157.541 L
201.643 158.765 L
203.929 161.927 L
206.214 163.15 L
208.5 167.483 L
210.786 168.95 L
213.071 175.202 L
215.357 180.998 L
217.643 178.593 L
219.929 174.979 L
222.214 171.356 L
224.5 167.744 L
226.786 167.851 L
229.071 167.103 L
231.357 167.217 L
233.643 170.645 L
235.929 173.287 L
238.214 174.443 L
240.5 175.687 L
242.786 178.641 L
245.071 174.755 L
247.357 175.726 L
249.643 174.568 L
251.929 174.99 L
254.214 174.787 L
256.5 172.194 L
258.786 170.503 L
261.071 168.233 L
263.357 164.626 L
265.643 161.773 L
267.929 159.058 L
270.214 156.92 L
272.5 160.484 L
274.786 161.673 L
277.071 166.332 L
279.357 167.698 L
281.643 169.717 L
283.929 172.39 L
286.214 171.857 L
288.5 167.164 L
290.786 165.167 L
293.071 164.297 L
295.357 161.958 L
297.643 159.149 L
299.929 160.734 L
302.214 158.015 L
304.5 151.186 L
306.786 144.955 L
309.071 137.764 L
311.357 133.631 L
313.643 124.174 L
315.929 115.999 L
318.214 111.442 L
320.5 109.462 L
322.786 106.686 L
325.071 105.102 L
327.357 103.201 L
329.643 102.69 L
331.929 100.83 L
334.214 104.013 L
336.5 103.667 L
338.786 107.968 L
341.071 108.183 L
343.357 108.269 L
345.643 110.958 L
347.929 119.334 L
350.214 122.481 L
352.5 131.314 L
354.786 135.449 L
357.071 138.295 L
359.357 143.673 L
361.643 149.724 L
363.929 154.601 L
366.214 157.995 L
368.5 162.265 L
370.786 165.573 L
373.071 169.208 L
375.357 168.333 L
377.643 171.893 L
379.929 170.81 L
382.214 168.204 L
384.5 161.228 L
S
GR
GS
[1.00046 0 0 1 0 0] CT
0.6 0.2 0.2 RC
1 LJ
2 LW
N
64.5 161.757 M
66.786 160.29 L
69.071 155.463 L
71.357 153.31 L
73.643 151.086 L
75.929 153.503 L
78.214 158.362 L
80.5 164.803 L
82.786 168.111 L
85.071 173.62 L
87.357 178.499 L
89.643 184.893 L
91.929 186.581 L
94.214 188.22 L
96.5 191.769 L
98.786 195.729 L
101.071 198.619 L
103.357 202.302 L
105.643 200.279 L
107.929 201.09 L
110.214 200.745 L
112.5 198.212 L
114.786 196.371 L
117.071 194.857 L
119.357 192.857 L
121.643 194.954 L
123.929 197.144 L
126.214 197.634 L
128.5 196.747 L
130.786 199.684 L
133.071 200.994 L
135.357 205.665 L
137.643 207.245 L
139.929 204.949 L
142.214 207.165 L
144.5 210.449 L
146.786 207.619 L
149.071 208.753 L
151.357 211.664 L
153.643 204.639 L
155.929 204.42 L
158.214 194.726 L
160.5 178.808 L
162.786 173.53 L
165.071 166.332 L
167.357 157.326 L
169.643 146.306 L
171.929 136.887 L
174.214 144.104 L
176.5 145.217 L
178.786 142.682 L
181.071 147.736 L
183.357 147.3 L
185.643 151.997 L
187.929 156.662 L
190.214 161.014 L
192.5 166.461 L
194.786 166.646 L
197.071 163.244 L
199.357 163.323 L
201.643 164.63 L
203.929 167.505 L
206.214 169.153 L
208.5 173.664 L
210.786 175.198 L
213.071 181.355 L
215.357 187.341 L
217.643 184.999 L
219.929 181.544 L
222.214 177.975 L
224.5 174.315 L
226.786 174.636 L
229.071 173.819 L
231.357 173.372 L
233.643 176.565 L
235.929 178.992 L
238.214 180.008 L
240.5 181.55 L
242.786 184.643 L
245.071 180.856 L
247.357 181.965 L
249.643 180.749 L
251.929 181.09 L
254.214 180.7 L
256.5 178.275 L
258.786 176.635 L
261.071 174.924 L
263.357 171.194 L
265.643 168.096 L
267.929 165.391 L
270.214 163.725 L
272.5 167.063 L
274.786 168.474 L
277.071 173.362 L
279.357 174.769 L
281.643 176.964 L
283.929 179.495 L
286.214 178.647 L
288.5 174.251 L
290.786 172.277 L
293.071 171.034 L
295.357 168.557 L
297.643 165.768 L
299.929 167.019 L
302.214 164.538 L
304.5 157.864 L
306.786 152.272 L
309.071 145.958 L
311.357 142.363 L
313.643 133.843 L
315.929 126.259 L
318.214 121.061 L
320.5 117.713 L
322.786 113.705 L
325.071 111.251 L
327.357 110.11 L
329.643 111.174 L
331.929 110.613 L
334.214 114.476 L
336.5 114.89 L
338.786 119.371 L
341.071 119.823 L
343.357 120.455 L
345.643 122.729 L
347.929 130.137 L
350.214 133.321 L
352.5 140.981 L
354.786 144.917 L
357.071 147.612 L
359.357 152.314 L
361.643 157.565 L
363.929 162.212 L
366.214 165.517 L
368.5 169.535 L
370.786 172.785 L
373.071 176.397 L
375.357 175.379 L
377.643 178.788 L
379.929 177.195 L
382.214 174.237 L
384.5 167.399 L
S
GR
%%Trailer
%%Pages: 1
%%EOF
