%!PS-Adobe-3.0 EPSF-3.0
%%Creator: (MATLAB, The Mathworks, Inc. Version 9.10.0.1602886 \(R2021a\). Operating System: Mac OS X)
%%Title: /Users/kosciessa/Desktop/tardis/LNDG/stateswitch/stsw_eeg_task/tfr/figures/b01_alphaTraces_stim_oa.eps
%%CreationDate: 2022-02-22T16:21:55
%%Pages: (atend)
%%BoundingBox:     2     0   388   266
%%LanguageLevel: 3
%%EndComments
%%BeginProlog
%%BeginResource: procset (Apache XML Graphics Std ProcSet) 1.2 0
%%Version: 1.2 0
%%Copyright: (Copyright 2001-2003,2010 The Apache Software Foundation. License terms: http://www.apache.org/licenses/LICENSE-2.0)
/bd{bind def}bind def
/ld{load def}bd
/GR/grestore ld
/GS/gsave ld
/RM/rmoveto ld
/C/curveto ld
/t/show ld
/L/lineto ld
/ML/setmiterlimit ld
/CT/concat ld
/f/fill ld
/N/newpath ld
/S/stroke ld
/CC/setcmykcolor ld
/A/ashow ld
/cp/closepath ld
/RC/setrgbcolor ld
/LJ/setlinejoin ld
/GC/setgray ld
/LW/setlinewidth ld
/M/moveto ld
/re {4 2 roll M
1 index 0 rlineto
0 exch rlineto
neg 0 rlineto
cp } bd
/_ctm matrix def
/_tm matrix def
/BT { _ctm currentmatrix pop matrix _tm copy pop 0 0 moveto } bd
/ET { _ctm setmatrix } bd
/iTm { _ctm setmatrix _tm concat } bd
/Tm { _tm astore pop iTm 0 0 moveto } bd
/ux 0.0 def
/uy 0.0 def
/F {
  /Tp exch def
  /Tf exch def
  Tf findfont Tp scalefont setfont
  /cf Tf def  /cs Tp def
} bd
/ULS {currentpoint /uy exch def /ux exch def} bd
/ULE {
  /Tcx currentpoint pop def
  gsave
  newpath
  cf findfont cs scalefont dup
  /FontMatrix get 0 get /Ts exch def /FontInfo get dup
  /UnderlinePosition get Ts mul /To exch def
  /UnderlineThickness get Ts mul /Tt exch def
  ux uy To add moveto  Tcx uy To add lineto
  Tt setlinewidth stroke
  grestore
} bd
/OLE {
  /Tcx currentpoint pop def
  gsave
  newpath
  cf findfont cs scalefont dup
  /FontMatrix get 0 get /Ts exch def /FontInfo get dup
  /UnderlinePosition get Ts mul /To exch def
  /UnderlineThickness get Ts mul /Tt exch def
  ux uy To add cs add moveto Tcx uy To add cs add lineto
  Tt setlinewidth stroke
  grestore
} bd
/SOE {
  /Tcx currentpoint pop def
  gsave
  newpath
  cf findfont cs scalefont dup
  /FontMatrix get 0 get /Ts exch def /FontInfo get dup
  /UnderlinePosition get Ts mul /To exch def
  /UnderlineThickness get Ts mul /Tt exch def
  ux uy To add cs 10 mul 26 idiv add moveto Tcx uy To add cs 10 mul 26 idiv add lineto
  Tt setlinewidth stroke
  grestore
} bd
/QT {
/Y22 exch store
/X22 exch store
/Y21 exch store
/X21 exch store
currentpoint
/Y21 load 2 mul add 3 div exch
/X21 load 2 mul add 3 div exch
/X21 load 2 mul /X22 load add 3 div
/Y21 load 2 mul /Y22 load add 3 div
/X22 load /Y22 load curveto
} bd
/SSPD {
dup length /d exch dict def
{
/v exch def
/k exch def
currentpagedevice k known {
/cpdv currentpagedevice k get def
v cpdv ne {
/upd false def
/nullv v type /nulltype eq def
/nullcpdv cpdv type /nulltype eq def
nullv nullcpdv or
{
/upd true def
} {
/sametype v type cpdv type eq def
sametype {
v type /arraytype eq {
/vlen v length def
/cpdvlen cpdv length def
vlen cpdvlen eq {
0 1 vlen 1 sub {
/i exch def
/obj v i get def
/cpdobj cpdv i get def
obj cpdobj ne {
/upd true def
exit
} if
} for
} {
/upd true def
} ifelse
} {
v type /dicttype eq {
v {
/dv exch def
/dk exch def
/cpddv cpdv dk get def
dv cpddv ne {
/upd true def
exit
} if
} forall
} {
/upd true def
} ifelse
} ifelse
} if
} ifelse
upd true eq {
d k v put
} if
} if
} if
} forall
d length 0 gt {
d setpagedevice
} if
} bd
/RE { % /NewFontName [NewEncodingArray] /FontName RE -
  findfont dup length dict begin
  {
    1 index /FID ne
    {def} {pop pop} ifelse
  } forall
  /Encoding exch def
  /FontName 1 index def
  currentdict definefont pop
  end
} bind def
%%EndResource
%%BeginResource: procset (Apache XML Graphics EPS ProcSet) 1.0 0
%%Version: 1.0 0
%%Copyright: (Copyright 2002-2003 The Apache Software Foundation. License terms: http://www.apache.org/licenses/LICENSE-2.0)
/BeginEPSF { %def
/b4_Inc_state save def         % Save state for cleanup
/dict_count countdictstack def % Count objects on dict stack
/op_count count 1 sub def      % Count objects on operand stack
userdict begin                 % Push userdict on dict stack
/showpage { } def              % Redefine showpage, { } = null proc
0 setgray 0 setlinecap         % Prepare graphics state
1 setlinewidth 0 setlinejoin
10 setmiterlimit [ ] 0 setdash newpath
/languagelevel where           % If level not equal to 1 then
{pop languagelevel             % set strokeadjust and
1 ne                           % overprint to their defaults.
{false setstrokeadjust false setoverprint
} if
} if
} bd
/EndEPSF { %def
count op_count sub {pop} repeat            % Clean up stacks
countdictstack dict_count sub {end} repeat
b4_Inc_state restore
} bd
%%EndResource
%FOPBeginFontDict
%%IncludeResource: font Courier-Oblique
%%IncludeResource: font Courier-BoldOblique
%%IncludeResource: font Courier-Bold
%%IncludeResource: font ZapfDingbats
%%IncludeResource: font Symbol
%%IncludeResource: font Helvetica
%%IncludeResource: font Helvetica-Oblique
%%IncludeResource: font Helvetica-Bold
%%IncludeResource: font Helvetica-BoldOblique
%%IncludeResource: font Times-Roman
%%IncludeResource: font Times-Italic
%%IncludeResource: font Times-Bold
%%IncludeResource: font Times-BoldItalic
%%IncludeResource: font Courier
%FOPEndFontDict
%%BeginResource: encoding WinAnsiEncoding
/WinAnsiEncoding [
/.notdef /.notdef /.notdef /.notdef /.notdef
/.notdef /.notdef /.notdef /.notdef /.notdef
/.notdef /.notdef /.notdef /.notdef /.notdef
/.notdef /.notdef /.notdef /.notdef /.notdef
/.notdef /.notdef /.notdef /.notdef /.notdef
/.notdef /.notdef /.notdef /.notdef /.notdef
/.notdef /.notdef /space /exclam /quotedbl
/numbersign /dollar /percent /ampersand /quotesingle
/parenleft /parenright /asterisk /plus /comma
/hyphen /period /slash /zero /one
/two /three /four /five /six
/seven /eight /nine /colon /semicolon
/less /equal /greater /question /at
/A /B /C /D /E
/F /G /H /I /J
/K /L /M /N /O
/P /Q /R /S /T
/U /V /W /X /Y
/Z /bracketleft /backslash /bracketright /asciicircum
/underscore /quoteleft /a /b /c
/d /e /f /g /h
/i /j /k /l /m
/n /o /p /q /r
/s /t /u /v /w
/x /y /z /braceleft /bar
/braceright /asciitilde /bullet /Euro /bullet
/quotesinglbase /florin /quotedblbase /ellipsis /dagger
/daggerdbl /circumflex /perthousand /Scaron /guilsinglleft
/OE /bullet /Zcaron /bullet /bullet
/quoteleft /quoteright /quotedblleft /quotedblright /bullet
/endash /emdash /asciitilde /trademark /scaron
/guilsinglright /oe /bullet /zcaron /Ydieresis
/space /exclamdown /cent /sterling /currency
/yen /brokenbar /section /dieresis /copyright
/ordfeminine /guillemotleft /logicalnot /sfthyphen /registered
/macron /degree /plusminus /twosuperior /threesuperior
/acute /mu /paragraph /middot /cedilla
/onesuperior /ordmasculine /guillemotright /onequarter /onehalf
/threequarters /questiondown /Agrave /Aacute /Acircumflex
/Atilde /Adieresis /Aring /AE /Ccedilla
/Egrave /Eacute /Ecircumflex /Edieresis /Igrave
/Iacute /Icircumflex /Idieresis /Eth /Ntilde
/Ograve /Oacute /Ocircumflex /Otilde /Odieresis
/multiply /Oslash /Ugrave /Uacute /Ucircumflex
/Udieresis /Yacute /Thorn /germandbls /agrave
/aacute /acircumflex /atilde /adieresis /aring
/ae /ccedilla /egrave /eacute /ecircumflex
/edieresis /igrave /iacute /icircumflex /idieresis
/eth /ntilde /ograve /oacute /ocircumflex
/otilde /odieresis /divide /oslash /ugrave
/uacute /ucircumflex /udieresis /yacute /thorn
/ydieresis
] def
%%EndResource
%FOPBeginFontReencode
/Courier-Oblique findfont
dup length dict begin
  {1 index /FID ne {def} {pop pop} ifelse} forall
  /Encoding WinAnsiEncoding def
  currentdict
end
/Courier-Oblique exch definefont pop
/Courier-BoldOblique findfont
dup length dict begin
  {1 index /FID ne {def} {pop pop} ifelse} forall
  /Encoding WinAnsiEncoding def
  currentdict
end
/Courier-BoldOblique exch definefont pop
/Courier-Bold findfont
dup length dict begin
  {1 index /FID ne {def} {pop pop} ifelse} forall
  /Encoding WinAnsiEncoding def
  currentdict
end
/Courier-Bold exch definefont pop
/Helvetica findfont
dup length dict begin
  {1 index /FID ne {def} {pop pop} ifelse} forall
  /Encoding WinAnsiEncoding def
  currentdict
end
/Helvetica exch definefont pop
/Helvetica-Oblique findfont
dup length dict begin
  {1 index /FID ne {def} {pop pop} ifelse} forall
  /Encoding WinAnsiEncoding def
  currentdict
end
/Helvetica-Oblique exch definefont pop
/Helvetica-Bold findfont
dup length dict begin
  {1 index /FID ne {def} {pop pop} ifelse} forall
  /Encoding WinAnsiEncoding def
  currentdict
end
/Helvetica-Bold exch definefont pop
/Helvetica-BoldOblique findfont
dup length dict begin
  {1 index /FID ne {def} {pop pop} ifelse} forall
  /Encoding WinAnsiEncoding def
  currentdict
end
/Helvetica-BoldOblique exch definefont pop
/Times-Roman findfont
dup length dict begin
  {1 index /FID ne {def} {pop pop} ifelse} forall
  /Encoding WinAnsiEncoding def
  currentdict
end
/Times-Roman exch definefont pop
/Times-Italic findfont
dup length dict begin
  {1 index /FID ne {def} {pop pop} ifelse} forall
  /Encoding WinAnsiEncoding def
  currentdict
end
/Times-Italic exch definefont pop
/Times-Bold findfont
dup length dict begin
  {1 index /FID ne {def} {pop pop} ifelse} forall
  /Encoding WinAnsiEncoding def
  currentdict
end
/Times-Bold exch definefont pop
/Times-BoldItalic findfont
dup length dict begin
  {1 index /FID ne {def} {pop pop} ifelse} forall
  /Encoding WinAnsiEncoding def
  currentdict
end
/Times-BoldItalic exch definefont pop
/Courier findfont
dup length dict begin
  {1 index /FID ne {def} {pop pop} ifelse} forall
  /Encoding WinAnsiEncoding def
  currentdict
end
/Courier exch definefont pop
%FOPEndFontReencode
%%EndProlog
%%Page: 1 1
%%PageBoundingBox: 0 0 425 283
%%BeginPageSetup
[1 0 0 -1 0 283] CT
%%EndPageSetup
GS
[1.00046 0 0 1 0 0] CT
1 GC
N
0 0 425 283 re
f
GR
GS
[1.00046 0 0 1 0 0] CT
1 GC
N
0 0 425 283 re
f
GR
GS
[1.00046 0 0 1 0 0] CT
1 GC
N
64.5 248.5 M
384.5 248.5 L
384.5 21 L
64.5 21 L
cp
f
GR
GS
[1.00046 0 0 1 0 0] CT
0.149 GC
2 setlinecap
1 LJ
0.5 LW
N
64.5 248.5 M
384.5 248.5 L
S
GR
GS
[1.00046 0 0 1 0 0] CT
0.149 GC
2 setlinecap
1 LJ
0.5 LW
N
64.5 248.5 M
64.5 245.303 L
S
GR
GS
[1.00046 0 0 1 0 0] CT
0.149 GC
2 setlinecap
1 LJ
0.5 LW
N
128.5 248.5 M
128.5 245.303 L
S
GR
GS
[1.00046 0 0 1 0 0] CT
0.149 GC
2 setlinecap
1 LJ
0.5 LW
N
192.5 248.5 M
192.5 245.303 L
S
GR
GS
[1.00046 0 0 1 0 0] CT
0.149 GC
2 setlinecap
1 LJ
0.5 LW
N
256.5 248.5 M
256.5 245.303 L
S
GR
GS
[1.00046 0 0 1 0 0] CT
0.149 GC
2 setlinecap
1 LJ
0.5 LW
N
320.5 248.5 M
320.5 245.303 L
S
GR
GS
[1.00046 0 0 1 0 0] CT
0.149 GC
2 setlinecap
1 LJ
0.5 LW
N
384.5 248.5 M
384.5 245.303 L
S
GR
GS
[1.00046 0 0 1 64.52987 252.90062] CT
0.149 GC
/Helvetica 12 F
GS
[1 0 0 1 0 0] CT
-8.5 12 moveto 
1 -1 scale
(0.5) t 
GR
GR
GS
[1.00046 0 0 1 128.55951 252.90062] CT
0.149 GC
/Helvetica 12 F
GS
[1 0 0 1 0 0] CT
-3.5 12 moveto 
1 -1 scale
(1) t 
GR
GR
GS
[1.00046 0 0 1 192.58916 252.90062] CT
0.149 GC
/Helvetica 12 F
GS
[1 0 0 1 0 0] CT
-8.5 12 moveto 
1 -1 scale
(1.5) t 
GR
GR
GS
[1.00046 0 0 1 256.6188 252.90062] CT
0.149 GC
/Helvetica 12 F
GS
[1 0 0 1 0 0] CT
-3.5 12 moveto 
1 -1 scale
(2) t 
GR
GR
GS
[1.00046 0 0 1 320.64844 252.90062] CT
0.149 GC
/Helvetica 12 F
GS
[1 0 0 1 0 0] CT
-8.5 12 moveto 
1 -1 scale
(2.5) t 
GR
GR
GS
[1.00046 0 0 1 384.67808 252.90062] CT
0.149 GC
/Helvetica 12 F
GS
[1 0 0 1 0 0] CT
-3.5 12 moveto 
1 -1 scale
(3) t 
GR
GR
GS
[1.00046 0 0 1 224.60413 268.50012] CT
0.149 GC
/Helvetica 12 F
GS
[1 0 0 1 0 0] CT
-21 12 moveto 
1 -1 scale
(Time \(s\)) t 
GR
GR
GS
[1.00046 0 0 1 0 0] CT
0.149 GC
2 setlinecap
1 LJ
0.5 LW
N
64.5 248.5 M
64.5 21 L
S
GR
GS
[1.00046 0 0 1 0 0] CT
0.149 GC
2 setlinecap
1 LJ
0.5 LW
N
64.5 248.5 M
67.696 248.5 L
S
GR
GS
[1.00046 0 0 1 0 0] CT
0.149 GC
2 setlinecap
1 LJ
0.5 LW
N
64.5 210.584 M
67.696 210.584 L
S
GR
GS
[1.00046 0 0 1 0 0] CT
0.149 GC
2 setlinecap
1 LJ
0.5 LW
N
64.5 172.667 M
67.696 172.667 L
S
GR
GS
[1.00046 0 0 1 0 0] CT
0.149 GC
2 setlinecap
1 LJ
0.5 LW
N
64.5 134.749 M
67.696 134.749 L
S
GR
GS
[1.00046 0 0 1 0 0] CT
0.149 GC
2 setlinecap
1 LJ
0.5 LW
N
64.5 96.833 M
67.696 96.833 L
S
GR
GS
[1.00046 0 0 1 0 0] CT
0.149 GC
2 setlinecap
1 LJ
0.5 LW
N
64.5 58.916 M
67.696 58.916 L
S
GR
GS
[1.00046 0 0 1 0 0] CT
0.149 GC
2 setlinecap
1 LJ
0.5 LW
N
64.5 21 M
67.696 21 L
S
GR
GS
[1.00046 0 0 1 60.12783 248.49992] CT
0.149 GC
/Helvetica 12 F
GS
[1 0 0 1 0 0] CT
-29 4.5 moveto 
1 -1 scale
(-5.52) t 
GR
GR
GS
[1.00046 0 0 1 60.12783 210.5842] CT
0.149 GC
/Helvetica 12 F
GS
[1 0 0 1 0 0] CT
-29 4.5 moveto 
1 -1 scale
(-5.51) t 
GR
GR
GS
[1.00046 0 0 1 60.12783 172.66667] CT
0.149 GC
/Helvetica 12 F
GS
[1 0 0 1 0 0] CT
-22 4.5 moveto 
1 -1 scale
(-5.5) t 
GR
GR
GS
[1.00046 0 0 1 60.12783 134.74913] CT
0.149 GC
/Helvetica 12 F
GS
[1 0 0 1 0 0] CT
-29 4.5 moveto 
1 -1 scale
(-5.49) t 
GR
GR
GS
[1.00046 0 0 1 60.12783 96.8334] CT
0.149 GC
/Helvetica 12 F
GS
[1 0 0 1 0 0] CT
-29 4.5 moveto 
1 -1 scale
(-5.48) t 
GR
GR
GS
[1.00046 0 0 1 60.12783 58.91587] CT
0.149 GC
/Helvetica 12 F
GS
[1 0 0 1 0 0] CT
-29 4.5 moveto 
1 -1 scale
(-5.47) t 
GR
GR
GS
[1.00046 0 0 1 60.12783 21.00014] CT
0.149 GC
/Helvetica 12 F
GS
[1 0 0 1 0 0] CT
-29 4.5 moveto 
1 -1 scale
(-5.46) t 
GR
GR
GS
[0 -1 1.00046 0 29.01343 134.74913] CT
0.149 GC
/Helvetica 12 F
GS
[1 0 0 1 0 0] CT
-57 -18 moveto 
1 -1 scale
(8-12 Hz Alpha Power) t 
GR
GR
GS
[0 -1 1.00046 0 29.01343 134.74913] CT
0.149 GC
/Helvetica 12 F
GS
[1 0 0 1 0 0] CT
-46 -3 moveto 
1 -1 scale
(\(a.u.; normalized\)) t 
GR
GR
GS
[1.00046 0 0 1 0 0] CT
0.996 0.98 0.98 RC
N
77.3 183.574 M
70.9 177.814 L
64.5 163.522 L
64.462 163.29 L
64.462 163.456 L
64.462 189.288 L
64.5 189.508 L
70.9 206.737 L
77.3 217.008 L
83.7 222.788 L
90.1 235.238 L
96.5 242.633 L
102.9 240.971 L
109.3 238.381 L
115.7 228.807 L
122.1 221.637 L
128.5 206.337 L
134.9 194.054 L
141.3 192.34 L
147.7 180.316 L
154.1 162.802 L
160.5 145.615 L
166.9 145.037 L
173.3 149.361 L
179.7 152.198 L
186.1 148.933 L
192.5 147.917 L
198.9 146.803 L
205.3 140.245 L
211.7 124.948 L
218.1 118.361 L
224.5 111.33 L
230.9 111.232 L
237.3 110.148 L
243.7 105.955 L
250.1 106.213 L
256.5 103.494 L
262.9 98.296 L
269.3 94.591 L
275.7 92.145 L
282.1 88.782 L
288.5 86.012 L
294.9 82.818 L
301.3 87.356 L
307.7 97.097 L
314.1 100.513 L
320.5 98.16 L
326.9 92.42 L
333.3 89.401 L
339.7 86.378 L
346.1 75.401 L
352.5 68.265 L
358.9 62.018 L
365.3 59.408 L
371.7 62.29 L
378.1 69.325 L
384.5 67.808 L
384.538 67.744 L
384.538 25.829 L
384.538 25.568 L
384.5 25.641 L
378.1 29.968 L
371.7 25.972 L
365.3 24.123 L
358.9 29.024 L
352.5 37.211 L
346.1 43.89 L
339.7 52.588 L
333.3 54.871 L
326.9 58.489 L
320.5 61.655 L
314.1 62.51 L
307.7 60.776 L
301.3 52.664 L
294.9 48.988 L
288.5 53.09 L
282.1 58.288 L
275.7 63.414 L
269.3 64.79 L
262.9 64.396 L
256.5 67.621 L
250.1 69.679 L
243.7 68.39 L
237.3 72.076 L
230.9 75.663 L
224.5 76.11 L
218.1 82.552 L
211.7 87.716 L
205.3 104.431 L
198.9 111.945 L
192.5 112.133 L
186.1 115.385 L
179.7 120.793 L
173.3 118.844 L
166.9 114.597 L
160.5 114.599 L
154.1 128.92 L
147.7 146.724 L
141.3 159.88 L
134.9 162.433 L
128.5 173.916 L
122.1 188.593 L
115.7 197.38 L
109.3 207.726 L
102.9 208.035 L
96.5 208.816 L
90.1 200.725 L
83.7 188.06 L
cp
f
GR
GS
[1.00046 0 0 1 0 0] CT
0.98 0.91 0.91 RC
1 LJ
0.5 LW
N
64.462 189.288 M
64.5 189.508 L
70.9 206.737 L
77.3 217.008 L
83.7 222.788 L
90.1 235.238 L
96.5 242.633 L
102.9 240.971 L
109.3 238.381 L
115.7 228.807 L
122.1 221.637 L
128.5 206.337 L
134.9 194.054 L
141.3 192.34 L
147.7 180.316 L
154.1 162.802 L
160.5 145.615 L
166.9 145.037 L
173.3 149.361 L
179.7 152.198 L
186.1 148.933 L
192.5 147.917 L
198.9 146.803 L
205.3 140.245 L
211.7 124.948 L
218.1 118.361 L
224.5 111.33 L
230.9 111.232 L
237.3 110.148 L
243.7 105.955 L
250.1 106.213 L
256.5 103.494 L
262.9 98.296 L
269.3 94.591 L
275.7 92.145 L
282.1 88.782 L
288.5 86.012 L
294.9 82.818 L
301.3 87.356 L
307.7 97.097 L
314.1 100.513 L
320.5 98.16 L
326.9 92.42 L
333.3 89.401 L
339.7 86.378 L
346.1 75.401 L
352.5 68.265 L
358.9 62.018 L
365.3 59.408 L
371.7 62.29 L
378.1 69.325 L
384.5 67.808 L
384.538 67.744 L
S
GR
GS
[1.00046 0 0 1 0 0] CT
0.98 0.91 0.91 RC
1 LJ
0.5 LW
N
64.462 163.29 M
64.5 163.522 L
70.9 177.814 L
77.3 183.574 L
83.7 188.06 L
90.1 200.725 L
96.5 208.816 L
102.9 208.035 L
109.3 207.726 L
115.7 197.38 L
122.1 188.593 L
128.5 173.916 L
134.9 162.433 L
141.3 159.88 L
147.7 146.724 L
154.1 128.92 L
160.5 114.599 L
166.9 114.597 L
173.3 118.844 L
179.7 120.793 L
186.1 115.385 L
192.5 112.133 L
198.9 111.945 L
205.3 104.431 L
211.7 87.716 L
218.1 82.552 L
224.5 76.11 L
230.9 75.663 L
237.3 72.076 L
243.7 68.39 L
250.1 69.679 L
256.5 67.621 L
262.9 64.396 L
269.3 64.79 L
275.7 63.414 L
282.1 58.288 L
288.5 53.09 L
294.9 48.988 L
301.3 52.664 L
307.7 60.776 L
314.1 62.51 L
320.5 61.655 L
326.9 58.489 L
333.3 54.871 L
339.7 52.588 L
346.1 43.89 L
352.5 37.211 L
358.9 29.024 L
365.3 24.123 L
371.7 25.972 L
378.1 29.968 L
384.5 25.641 L
384.538 25.568 L
S
GR
GS
[1.00046 0 0 1 0 0] CT
0.961 0.8 0.8 RC
1 LJ
2 LW
N
64.462 176.288 M
64.5 176.514 L
70.9 192.275 L
77.3 200.291 L
83.7 205.424 L
90.1 217.981 L
96.5 225.724 L
102.9 224.504 L
109.3 223.054 L
115.7 213.094 L
122.1 205.115 L
128.5 190.127 L
134.9 178.243 L
141.3 176.111 L
147.7 163.52 L
154.1 145.861 L
160.5 130.108 L
166.9 129.817 L
173.3 134.102 L
179.7 136.496 L
186.1 132.158 L
192.5 130.025 L
198.9 129.374 L
205.3 122.337 L
211.7 106.331 L
218.1 100.457 L
224.5 93.72 L
230.9 93.449 L
237.3 91.111 L
243.7 87.173 L
250.1 87.945 L
256.5 85.559 L
262.9 81.346 L
269.3 79.69 L
275.7 77.779 L
282.1 73.535 L
288.5 69.551 L
294.9 65.902 L
301.3 70.01 L
307.7 78.936 L
314.1 81.512 L
320.5 79.909 L
326.9 75.454 L
333.3 72.136 L
339.7 69.482 L
346.1 59.646 L
352.5 52.738 L
358.9 45.52 L
365.3 41.765 L
371.7 44.13 L
378.1 49.646 L
384.5 46.724 L
384.538 46.656 L
S
GR
GS
[1.00046 0 0 1 0 0] CT
0.99 0.959 0.959 RC
N
102.9 156.597 M
109.3 166.279 L
115.7 171.347 L
122.1 169.125 L
128.5 159.752 L
134.9 154.664 L
141.3 154.804 L
147.7 154.247 L
154.1 143.337 L
160.5 136.376 L
166.9 131.003 L
173.3 122.104 L
179.7 128.076 L
186.1 132.129 L
192.5 145.585 L
198.9 152.945 L
205.3 147.409 L
211.7 142.196 L
218.1 149.906 L
224.5 157.266 L
230.9 155.601 L
237.3 152.585 L
243.7 145.463 L
250.1 138.978 L
256.5 144.574 L
262.9 143.212 L
269.3 139.419 L
275.7 128.121 L
282.1 127.521 L
288.5 126.694 L
294.9 115.713 L
301.3 111.147 L
307.7 111.348 L
314.1 121.82 L
320.5 127.156 L
326.9 126.232 L
333.3 130.522 L
339.7 132.014 L
346.1 134.827 L
352.5 131.39 L
358.9 128.076 L
365.3 130.542 L
371.7 128.052 L
378.1 134.006 L
384.5 141.784 L
384.538 141.778 L
384.538 116.983 L
384.538 116.829 L
384.5 116.841 L
378.1 105.506 L
371.7 96.181 L
365.3 100.22 L
358.9 100.294 L
352.5 104.452 L
346.1 108.898 L
339.7 104.725 L
333.3 101.59 L
326.9 97.379 L
320.5 96.983 L
314.1 90.704 L
307.7 81.006 L
301.3 84.978 L
294.9 92.615 L
288.5 103.82 L
282.1 102.823 L
275.7 100.921 L
269.3 110.285 L
262.9 114.038 L
256.5 114.093 L
250.1 109.039 L
243.7 114.96 L
237.3 121.569 L
230.9 123.704 L
224.5 125.076 L
218.1 118.866 L
211.7 112.693 L
205.3 119.298 L
198.9 124.505 L
192.5 117.173 L
186.1 105.177 L
179.7 102.001 L
173.3 95.843 L
166.9 102.568 L
160.5 105.655 L
154.1 112.23 L
147.7 124.543 L
141.3 125.405 L
134.9 124.923 L
128.5 128.694 L
122.1 136.776 L
115.7 140.206 L
109.3 135.684 L
102.9 125.568 L
96.5 117.334 L
90.1 120.334 L
83.7 125.597 L
77.3 128.897 L
70.9 121.652 L
64.5 107.891 L
64.462 107.689 L
64.462 107.848 L
64.462 133.159 L
64.5 133.353 L
70.9 148.588 L
77.3 156.731 L
83.7 154.766 L
90.1 150.269 L
96.5 147.242 L
cp
f
GR
GS
[1.00046 0 0 1 0 0] CT
0.957 0.82 0.82 RC
1 LJ
0.5 LW
N
64.462 133.159 M
64.5 133.353 L
70.9 148.588 L
77.3 156.731 L
83.7 154.766 L
90.1 150.269 L
96.5 147.242 L
102.9 156.597 L
109.3 166.279 L
115.7 171.347 L
122.1 169.125 L
128.5 159.752 L
134.9 154.664 L
141.3 154.804 L
147.7 154.247 L
154.1 143.337 L
160.5 136.376 L
166.9 131.003 L
173.3 122.104 L
179.7 128.076 L
186.1 132.129 L
192.5 145.585 L
198.9 152.945 L
205.3 147.409 L
211.7 142.196 L
218.1 149.906 L
224.5 157.266 L
230.9 155.601 L
237.3 152.585 L
243.7 145.463 L
250.1 138.978 L
256.5 144.574 L
262.9 143.212 L
269.3 139.419 L
275.7 128.121 L
282.1 127.521 L
288.5 126.694 L
294.9 115.713 L
301.3 111.147 L
307.7 111.348 L
314.1 121.82 L
320.5 127.156 L
326.9 126.232 L
333.3 130.522 L
339.7 132.014 L
346.1 134.827 L
352.5 131.39 L
358.9 128.076 L
365.3 130.542 L
371.7 128.052 L
378.1 134.006 L
384.5 141.784 L
384.538 141.778 L
S
GR
GS
[1.00046 0 0 1 0 0] CT
0.957 0.82 0.82 RC
1 LJ
0.5 LW
N
64.462 107.689 M
64.5 107.891 L
70.9 121.652 L
77.3 128.897 L
83.7 125.597 L
90.1 120.334 L
96.5 117.334 L
102.9 125.568 L
109.3 135.684 L
115.7 140.206 L
122.1 136.776 L
128.5 128.694 L
134.9 124.923 L
141.3 125.405 L
147.7 124.543 L
154.1 112.23 L
160.5 105.655 L
166.9 102.568 L
173.3 95.843 L
179.7 102.001 L
186.1 105.177 L
192.5 117.173 L
198.9 124.505 L
205.3 119.298 L
211.7 112.693 L
218.1 118.866 L
224.5 125.076 L
230.9 123.704 L
237.3 121.569 L
243.7 114.96 L
250.1 109.039 L
256.5 114.093 L
262.9 114.038 L
269.3 110.285 L
275.7 100.921 L
282.1 102.823 L
288.5 103.82 L
294.9 92.615 L
301.3 84.978 L
307.7 81.006 L
314.1 90.704 L
320.5 96.983 L
326.9 97.379 L
333.3 101.59 L
339.7 104.725 L
346.1 108.898 L
352.5 104.452 L
358.9 100.294 L
365.3 100.22 L
371.7 96.181 L
378.1 105.506 L
384.5 116.841 L
384.538 116.829 L
S
GR
GS
[1.00046 0 0 1 0 0] CT
0.898 0.6 0.6 RC
1 LJ
2 LW
N
64.462 120.423 M
64.5 120.621 L
70.9 135.12 L
77.3 142.815 L
83.7 140.18 L
90.1 135.301 L
96.5 132.288 L
102.9 141.083 L
109.3 150.981 L
115.7 155.776 L
122.1 152.95 L
128.5 144.223 L
134.9 139.793 L
141.3 140.104 L
147.7 139.394 L
154.1 127.783 L
160.5 121.016 L
166.9 116.787 L
173.3 108.972 L
179.7 115.038 L
186.1 118.654 L
192.5 131.379 L
198.9 138.725 L
205.3 133.353 L
211.7 127.445 L
218.1 134.386 L
224.5 141.171 L
230.9 139.652 L
237.3 137.078 L
243.7 130.211 L
250.1 124.01 L
256.5 129.334 L
262.9 128.625 L
269.3 124.852 L
275.7 114.521 L
282.1 115.172 L
288.5 115.257 L
294.9 104.163 L
301.3 98.063 L
307.7 96.177 L
314.1 106.262 L
320.5 112.069 L
326.9 111.806 L
333.3 116.056 L
339.7 118.37 L
346.1 121.862 L
352.5 117.922 L
358.9 114.185 L
365.3 115.38 L
371.7 112.116 L
378.1 119.757 L
384.5 129.312 L
384.538 129.303 L
S
GR
GS
[1.00046 0 0 1 0 0] CT
0.98 0.939 0.939 RC
N
90.1 100.37 M
83.7 103.308 L
77.3 99.701 L
70.9 100.618 L
64.5 100.838 L
64.462 100.676 L
64.462 100.853 L
64.462 129.234 L
64.5 129.39 L
70.9 127.419 L
77.3 124.541 L
83.7 127.821 L
90.1 126.074 L
96.5 122.194 L
102.9 129.03 L
109.3 131.93 L
115.7 133.775 L
122.1 130.678 L
128.5 138.43 L
134.9 138.712 L
141.3 144.413 L
147.7 146.329 L
154.1 134.52 L
160.5 139.228 L
166.9 133.592 L
173.3 122.299 L
179.7 119.54 L
186.1 117.047 L
192.5 113.738 L
198.9 112.521 L
205.3 111.458 L
211.7 113.816 L
218.1 120.135 L
224.5 124.774 L
230.9 126.602 L
237.3 126.528 L
243.7 130.598 L
250.1 133.375 L
256.5 128.323 L
262.9 118.177 L
269.3 107.985 L
275.7 99.547 L
282.1 97.186 L
288.5 105.262 L
294.9 101.144 L
301.3 96.213 L
307.7 91.106 L
314.1 89.636 L
320.5 92.154 L
326.9 94.221 L
333.3 101.872 L
339.7 103.97 L
346.1 110.986 L
352.5 118.045 L
358.9 114.617 L
365.3 112.621 L
371.7 102.567 L
378.1 102.485 L
384.5 105.018 L
384.538 105.004 L
384.538 63.506 L
384.538 63.272 L
384.5 63.271 L
378.1 62.485 L
371.7 65.036 L
365.3 77.132 L
358.9 80.89 L
352.5 85.043 L
346.1 77.869 L
339.7 71.192 L
333.3 68.252 L
326.9 60.778 L
320.5 59.198 L
314.1 59.86 L
307.7 62.713 L
301.3 66.927 L
294.9 70.509 L
288.5 75.513 L
282.1 69.437 L
275.7 73.995 L
269.3 83.516 L
262.9 93.326 L
256.5 101.164 L
250.1 104.973 L
243.7 99.867 L
237.3 95.969 L
230.9 96.17 L
224.5 95.682 L
218.1 91.167 L
211.7 87.952 L
205.3 85.398 L
198.9 82.948 L
192.5 83.68 L
186.1 88.428 L
179.7 92.577 L
173.3 96.519 L
166.9 105.17 L
160.5 108.593 L
154.1 104.597 L
147.7 115.253 L
141.3 113.872 L
134.9 110.533 L
128.5 111.751 L
122.1 102.037 L
115.7 104.366 L
109.3 104.123 L
102.9 102.36 L
96.5 96.611 L
cp
f
GR
GS
[1.00046 0 0 1 0 0] CT
0.91 0.729 0.729 RC
1 LJ
0.5 LW
N
64.462 129.234 M
64.5 129.39 L
70.9 127.419 L
77.3 124.541 L
83.7 127.821 L
90.1 126.074 L
96.5 122.194 L
102.9 129.03 L
109.3 131.93 L
115.7 133.775 L
122.1 130.678 L
128.5 138.43 L
134.9 138.712 L
141.3 144.413 L
147.7 146.329 L
154.1 134.52 L
160.5 139.228 L
166.9 133.592 L
173.3 122.299 L
179.7 119.54 L
186.1 117.047 L
192.5 113.738 L
198.9 112.521 L
205.3 111.458 L
211.7 113.816 L
218.1 120.135 L
224.5 124.774 L
230.9 126.602 L
237.3 126.528 L
243.7 130.598 L
250.1 133.375 L
256.5 128.323 L
262.9 118.177 L
269.3 107.985 L
275.7 99.547 L
282.1 97.186 L
288.5 105.262 L
294.9 101.144 L
301.3 96.213 L
307.7 91.106 L
314.1 89.636 L
320.5 92.154 L
326.9 94.221 L
333.3 101.872 L
339.7 103.97 L
346.1 110.986 L
352.5 118.045 L
358.9 114.617 L
365.3 112.621 L
371.7 102.567 L
378.1 102.485 L
384.5 105.018 L
384.538 105.004 L
S
GR
GS
[1.00046 0 0 1 0 0] CT
0.91 0.729 0.729 RC
1 LJ
0.5 LW
N
64.462 100.676 M
64.5 100.838 L
70.9 100.618 L
77.3 99.701 L
83.7 103.308 L
90.1 100.37 L
96.5 96.611 L
102.9 102.36 L
109.3 104.123 L
115.7 104.366 L
122.1 102.037 L
128.5 111.751 L
134.9 110.533 L
141.3 113.872 L
147.7 115.253 L
154.1 104.597 L
160.5 108.593 L
166.9 105.17 L
173.3 96.519 L
179.7 92.577 L
186.1 88.428 L
192.5 83.68 L
198.9 82.948 L
205.3 85.398 L
211.7 87.952 L
218.1 91.167 L
224.5 95.682 L
230.9 96.17 L
237.3 95.969 L
243.7 99.867 L
250.1 104.973 L
256.5 101.164 L
262.9 93.326 L
269.3 83.516 L
275.7 73.995 L
282.1 69.437 L
288.5 75.513 L
294.9 70.509 L
301.3 66.927 L
307.7 62.713 L
314.1 59.86 L
320.5 59.198 L
326.9 60.778 L
333.3 68.252 L
339.7 71.192 L
346.1 77.869 L
352.5 85.043 L
358.9 80.89 L
365.3 77.132 L
371.7 65.036 L
378.1 62.485 L
384.5 63.271 L
384.538 63.272 L
S
GR
GS
[1.00046 0 0 1 0 0] CT
0.8 0.4 0.4 RC
1 LJ
2 LW
N
64.462 114.955 M
64.5 115.114 L
70.9 114.019 L
77.3 112.12 L
83.7 115.564 L
90.1 113.223 L
96.5 109.403 L
102.9 115.695 L
109.3 118.027 L
115.7 119.07 L
122.1 116.358 L
128.5 125.091 L
134.9 124.622 L
141.3 129.143 L
147.7 130.791 L
154.1 119.558 L
160.5 123.91 L
166.9 119.381 L
173.3 109.41 L
179.7 106.058 L
186.1 102.737 L
192.5 98.71 L
198.9 97.734 L
205.3 98.428 L
211.7 100.883 L
218.1 105.651 L
224.5 110.229 L
230.9 111.386 L
237.3 111.249 L
243.7 115.232 L
250.1 119.173 L
256.5 114.744 L
262.9 105.75 L
269.3 95.75 L
275.7 86.772 L
282.1 83.311 L
288.5 90.388 L
294.9 85.826 L
301.3 81.57 L
307.7 76.909 L
314.1 74.749 L
320.5 75.676 L
326.9 77.499 L
333.3 85.063 L
339.7 87.582 L
346.1 94.429 L
352.5 101.545 L
358.9 97.754 L
365.3 94.875 L
371.7 83.801 L
378.1 82.485 L
384.5 84.145 L
384.538 84.138 L
S
GR
GS
[1.00046 0 0 1 0 0] CT
0.959 0.918 0.918 RC
N
102.9 104.537 M
96.5 108.604 L
90.1 106.618 L
83.7 108.443 L
77.3 120.699 L
70.9 132.05 L
64.5 115.221 L
64.462 114.923 L
64.462 115.098 L
64.462 140.146 L
64.5 140.419 L
70.9 154.375 L
77.3 143.064 L
83.7 134.19 L
90.1 134.171 L
96.5 134.348 L
102.9 126.425 L
109.3 115.7 L
115.7 107.893 L
122.1 106.403 L
128.5 118.007 L
134.9 114.434 L
141.3 114.405 L
147.7 109.788 L
154.1 104.883 L
160.5 103.006 L
166.9 99.784 L
173.3 105.553 L
179.7 113.756 L
186.1 121.628 L
192.5 132.391 L
198.9 137.539 L
205.3 140.517 L
211.7 133.211 L
218.1 129.168 L
224.5 128.175 L
230.9 134.905 L
237.3 136.331 L
243.7 133.724 L
250.1 133.4 L
256.5 124.677 L
262.9 115.29 L
269.3 113.724 L
275.7 117.687 L
282.1 115.461 L
288.5 117.21 L
294.9 124.803 L
301.3 134.668 L
307.7 139.64 L
314.1 137.734 L
320.5 135.973 L
326.9 130.652 L
333.3 122.095 L
339.7 110.2 L
346.1 100.392 L
352.5 103.662 L
358.9 111.713 L
365.3 114.308 L
371.7 112.111 L
378.1 109.949 L
384.5 107.763 L
384.538 107.8 L
384.538 107.634 L
384.538 80.316 L
384.5 80.281 L
378.1 81.368 L
371.7 82.028 L
365.3 82.331 L
358.9 81.869 L
352.5 74.635 L
346.1 70.05 L
339.7 77.849 L
333.3 86.065 L
326.9 93.263 L
320.5 98.352 L
314.1 99.404 L
307.7 102.849 L
301.3 99.021 L
294.9 90.117 L
288.5 84.454 L
282.1 83.031 L
275.7 85.965 L
269.3 83.559 L
262.9 85.492 L
256.5 92.626 L
250.1 100.167 L
243.7 98.226 L
237.3 102.104 L
230.9 102.988 L
224.5 95.664 L
218.1 96.226 L
211.7 101.326 L
205.3 110.759 L
198.9 106.297 L
192.5 98.45 L
186.1 87.573 L
179.7 79.889 L
173.3 71.85 L
166.9 64.611 L
160.5 69.153 L
154.1 74.195 L
147.7 80.167 L
141.3 84.3 L
134.9 84.564 L
128.5 89.305 L
122.1 79.742 L
115.7 83.658 L
109.3 94.337 L
cp
f
GR
GS
[1.00046 0 0 1 0 0] CT
0.82 0.639 0.639 RC
1 LJ
0.5 LW
N
64.462 140.146 M
64.5 140.419 L
70.9 154.375 L
77.3 143.064 L
83.7 134.19 L
90.1 134.171 L
96.5 134.348 L
102.9 126.425 L
109.3 115.7 L
115.7 107.893 L
122.1 106.403 L
128.5 118.007 L
134.9 114.434 L
141.3 114.405 L
147.7 109.788 L
154.1 104.883 L
160.5 103.006 L
166.9 99.784 L
173.3 105.553 L
179.7 113.756 L
186.1 121.628 L
192.5 132.391 L
198.9 137.539 L
205.3 140.517 L
211.7 133.211 L
218.1 129.168 L
224.5 128.175 L
230.9 134.905 L
237.3 136.331 L
243.7 133.724 L
250.1 133.4 L
256.5 124.677 L
262.9 115.29 L
269.3 113.724 L
275.7 117.687 L
282.1 115.461 L
288.5 117.21 L
294.9 124.803 L
301.3 134.668 L
307.7 139.64 L
314.1 137.734 L
320.5 135.973 L
326.9 130.652 L
333.3 122.095 L
339.7 110.2 L
346.1 100.392 L
352.5 103.662 L
358.9 111.713 L
365.3 114.308 L
371.7 112.111 L
378.1 109.949 L
384.5 107.763 L
384.538 107.8 L
S
GR
GS
[1.00046 0 0 1 0 0] CT
0.82 0.639 0.639 RC
1 LJ
0.5 LW
N
64.462 114.923 M
64.5 115.221 L
70.9 132.05 L
77.3 120.699 L
83.7 108.443 L
90.1 106.618 L
96.5 108.604 L
102.9 104.537 L
109.3 94.337 L
115.7 83.658 L
122.1 79.742 L
128.5 89.305 L
134.9 84.564 L
141.3 84.3 L
147.7 80.167 L
154.1 74.195 L
160.5 69.153 L
166.9 64.611 L
173.3 71.85 L
179.7 79.889 L
186.1 87.573 L
192.5 98.45 L
198.9 106.297 L
205.3 110.759 L
211.7 101.326 L
218.1 96.226 L
224.5 95.664 L
230.9 102.988 L
237.3 102.104 L
243.7 98.226 L
250.1 100.167 L
256.5 92.626 L
262.9 85.492 L
269.3 83.559 L
275.7 85.965 L
282.1 83.031 L
288.5 84.454 L
294.9 90.117 L
301.3 99.021 L
307.7 102.849 L
314.1 99.404 L
320.5 98.352 L
326.9 93.263 L
333.3 86.065 L
339.7 77.849 L
346.1 70.05 L
352.5 74.635 L
358.9 81.869 L
365.3 82.331 L
371.7 82.028 L
378.1 81.368 L
384.5 80.281 L
384.538 80.316 L
S
GR
GS
[1.00046 0 0 1 0 0] CT
0.6 0.2 0.2 RC
1 LJ
2 LW
N
64.462 127.534 M
64.5 127.819 L
70.9 143.212 L
77.3 131.882 L
83.7 121.316 L
90.1 120.394 L
96.5 121.475 L
102.9 115.481 L
109.3 105.018 L
115.7 95.776 L
122.1 93.073 L
128.5 103.657 L
134.9 99.5 L
141.3 99.352 L
147.7 94.978 L
154.1 89.538 L
160.5 86.079 L
166.9 82.198 L
173.3 88.701 L
179.7 96.823 L
186.1 104.601 L
192.5 115.42 L
198.9 121.918 L
205.3 125.639 L
211.7 117.268 L
218.1 112.697 L
224.5 111.919 L
230.9 118.945 L
237.3 119.217 L
243.7 115.975 L
250.1 116.783 L
256.5 108.651 L
262.9 100.39 L
269.3 98.641 L
275.7 101.825 L
282.1 99.247 L
288.5 100.831 L
294.9 107.461 L
301.3 116.844 L
307.7 121.245 L
314.1 118.569 L
320.5 117.163 L
326.9 111.957 L
333.3 104.08 L
339.7 94.026 L
346.1 85.221 L
352.5 89.149 L
358.9 96.792 L
365.3 98.32 L
371.7 97.07 L
378.1 95.658 L
384.5 94.022 L
384.538 94.058 L
S
GR
%%Trailer
%%Pages: 1
%%EOF
