%!PS-Adobe-3.0 EPSF-3.0
%%Creator: (MATLAB, The Mathworks, Inc. Version 9.10.0.1602886 \(R2021a\). Operating System: Mac OS X)
%%Title: /Users/kosciessa/Desktop/tardis/LNDG/stateswitch/stsw_eeg_task/tfr/figures/b01_thetaTraces_yaoa.eps
%%CreationDate: 2022-02-22T16:23:59
%%Pages: (atend)
%%BoundingBox:     2     0   388   266
%%LanguageLevel: 3
%%EndComments
%%BeginProlog
%%BeginResource: procset (Apache XML Graphics Std ProcSet) 1.2 0
%%Version: 1.2 0
%%Copyright: (Copyright 2001-2003,2010 The Apache Software Foundation. License terms: http://www.apache.org/licenses/LICENSE-2.0)
/bd{bind def}bind def
/ld{load def}bd
/GR/grestore ld
/GS/gsave ld
/RM/rmoveto ld
/C/curveto ld
/t/show ld
/L/lineto ld
/ML/setmiterlimit ld
/CT/concat ld
/f/fill ld
/N/newpath ld
/S/stroke ld
/CC/setcmykcolor ld
/A/ashow ld
/cp/closepath ld
/RC/setrgbcolor ld
/LJ/setlinejoin ld
/GC/setgray ld
/LW/setlinewidth ld
/M/moveto ld
/re {4 2 roll M
1 index 0 rlineto
0 exch rlineto
neg 0 rlineto
cp } bd
/_ctm matrix def
/_tm matrix def
/BT { _ctm currentmatrix pop matrix _tm copy pop 0 0 moveto } bd
/ET { _ctm setmatrix } bd
/iTm { _ctm setmatrix _tm concat } bd
/Tm { _tm astore pop iTm 0 0 moveto } bd
/ux 0.0 def
/uy 0.0 def
/F {
  /Tp exch def
  /Tf exch def
  Tf findfont Tp scalefont setfont
  /cf Tf def  /cs Tp def
} bd
/ULS {currentpoint /uy exch def /ux exch def} bd
/ULE {
  /Tcx currentpoint pop def
  gsave
  newpath
  cf findfont cs scalefont dup
  /FontMatrix get 0 get /Ts exch def /FontInfo get dup
  /UnderlinePosition get Ts mul /To exch def
  /UnderlineThickness get Ts mul /Tt exch def
  ux uy To add moveto  Tcx uy To add lineto
  Tt setlinewidth stroke
  grestore
} bd
/OLE {
  /Tcx currentpoint pop def
  gsave
  newpath
  cf findfont cs scalefont dup
  /FontMatrix get 0 get /Ts exch def /FontInfo get dup
  /UnderlinePosition get Ts mul /To exch def
  /UnderlineThickness get Ts mul /Tt exch def
  ux uy To add cs add moveto Tcx uy To add cs add lineto
  Tt setlinewidth stroke
  grestore
} bd
/SOE {
  /Tcx currentpoint pop def
  gsave
  newpath
  cf findfont cs scalefont dup
  /FontMatrix get 0 get /Ts exch def /FontInfo get dup
  /UnderlinePosition get Ts mul /To exch def
  /UnderlineThickness get Ts mul /Tt exch def
  ux uy To add cs 10 mul 26 idiv add moveto Tcx uy To add cs 10 mul 26 idiv add lineto
  Tt setlinewidth stroke
  grestore
} bd
/QT {
/Y22 exch store
/X22 exch store
/Y21 exch store
/X21 exch store
currentpoint
/Y21 load 2 mul add 3 div exch
/X21 load 2 mul add 3 div exch
/X21 load 2 mul /X22 load add 3 div
/Y21 load 2 mul /Y22 load add 3 div
/X22 load /Y22 load curveto
} bd
/SSPD {
dup length /d exch dict def
{
/v exch def
/k exch def
currentpagedevice k known {
/cpdv currentpagedevice k get def
v cpdv ne {
/upd false def
/nullv v type /nulltype eq def
/nullcpdv cpdv type /nulltype eq def
nullv nullcpdv or
{
/upd true def
} {
/sametype v type cpdv type eq def
sametype {
v type /arraytype eq {
/vlen v length def
/cpdvlen cpdv length def
vlen cpdvlen eq {
0 1 vlen 1 sub {
/i exch def
/obj v i get def
/cpdobj cpdv i get def
obj cpdobj ne {
/upd true def
exit
} if
} for
} {
/upd true def
} ifelse
} {
v type /dicttype eq {
v {
/dv exch def
/dk exch def
/cpddv cpdv dk get def
dv cpddv ne {
/upd true def
exit
} if
} forall
} {
/upd true def
} ifelse
} ifelse
} if
} ifelse
upd true eq {
d k v put
} if
} if
} if
} forall
d length 0 gt {
d setpagedevice
} if
} bd
/RE { % /NewFontName [NewEncodingArray] /FontName RE -
  findfont dup length dict begin
  {
    1 index /FID ne
    {def} {pop pop} ifelse
  } forall
  /Encoding exch def
  /FontName 1 index def
  currentdict definefont pop
  end
} bind def
%%EndResource
%%BeginResource: procset (Apache XML Graphics EPS ProcSet) 1.0 0
%%Version: 1.0 0
%%Copyright: (Copyright 2002-2003 The Apache Software Foundation. License terms: http://www.apache.org/licenses/LICENSE-2.0)
/BeginEPSF { %def
/b4_Inc_state save def         % Save state for cleanup
/dict_count countdictstack def % Count objects on dict stack
/op_count count 1 sub def      % Count objects on operand stack
userdict begin                 % Push userdict on dict stack
/showpage { } def              % Redefine showpage, { } = null proc
0 setgray 0 setlinecap         % Prepare graphics state
1 setlinewidth 0 setlinejoin
10 setmiterlimit [ ] 0 setdash newpath
/languagelevel where           % If level not equal to 1 then
{pop languagelevel             % set strokeadjust and
1 ne                           % overprint to their defaults.
{false setstrokeadjust false setoverprint
} if
} if
} bd
/EndEPSF { %def
count op_count sub {pop} repeat            % Clean up stacks
countdictstack dict_count sub {end} repeat
b4_Inc_state restore
} bd
%%EndResource
%FOPBeginFontDict
%%IncludeResource: font Courier-Oblique
%%IncludeResource: font Courier-BoldOblique
%%IncludeResource: font Courier-Bold
%%IncludeResource: font ZapfDingbats
%%IncludeResource: font Symbol
%%IncludeResource: font Helvetica
%%IncludeResource: font Helvetica-Oblique
%%IncludeResource: font Helvetica-Bold
%%IncludeResource: font Helvetica-BoldOblique
%%IncludeResource: font Times-Roman
%%IncludeResource: font Times-Italic
%%IncludeResource: font Times-Bold
%%IncludeResource: font Times-BoldItalic
%%IncludeResource: font Courier
%FOPEndFontDict
%%BeginResource: encoding WinAnsiEncoding
/WinAnsiEncoding [
/.notdef /.notdef /.notdef /.notdef /.notdef
/.notdef /.notdef /.notdef /.notdef /.notdef
/.notdef /.notdef /.notdef /.notdef /.notdef
/.notdef /.notdef /.notdef /.notdef /.notdef
/.notdef /.notdef /.notdef /.notdef /.notdef
/.notdef /.notdef /.notdef /.notdef /.notdef
/.notdef /.notdef /space /exclam /quotedbl
/numbersign /dollar /percent /ampersand /quotesingle
/parenleft /parenright /asterisk /plus /comma
/hyphen /period /slash /zero /one
/two /three /four /five /six
/seven /eight /nine /colon /semicolon
/less /equal /greater /question /at
/A /B /C /D /E
/F /G /H /I /J
/K /L /M /N /O
/P /Q /R /S /T
/U /V /W /X /Y
/Z /bracketleft /backslash /bracketright /asciicircum
/underscore /quoteleft /a /b /c
/d /e /f /g /h
/i /j /k /l /m
/n /o /p /q /r
/s /t /u /v /w
/x /y /z /braceleft /bar
/braceright /asciitilde /bullet /Euro /bullet
/quotesinglbase /florin /quotedblbase /ellipsis /dagger
/daggerdbl /circumflex /perthousand /Scaron /guilsinglleft
/OE /bullet /Zcaron /bullet /bullet
/quoteleft /quoteright /quotedblleft /quotedblright /bullet
/endash /emdash /asciitilde /trademark /scaron
/guilsinglright /oe /bullet /zcaron /Ydieresis
/space /exclamdown /cent /sterling /currency
/yen /brokenbar /section /dieresis /copyright
/ordfeminine /guillemotleft /logicalnot /sfthyphen /registered
/macron /degree /plusminus /twosuperior /threesuperior
/acute /mu /paragraph /middot /cedilla
/onesuperior /ordmasculine /guillemotright /onequarter /onehalf
/threequarters /questiondown /Agrave /Aacute /Acircumflex
/Atilde /Adieresis /Aring /AE /Ccedilla
/Egrave /Eacute /Ecircumflex /Edieresis /Igrave
/Iacute /Icircumflex /Idieresis /Eth /Ntilde
/Ograve /Oacute /Ocircumflex /Otilde /Odieresis
/multiply /Oslash /Ugrave /Uacute /Ucircumflex
/Udieresis /Yacute /Thorn /germandbls /agrave
/aacute /acircumflex /atilde /adieresis /aring
/ae /ccedilla /egrave /eacute /ecircumflex
/edieresis /igrave /iacute /icircumflex /idieresis
/eth /ntilde /ograve /oacute /ocircumflex
/otilde /odieresis /divide /oslash /ugrave
/uacute /ucircumflex /udieresis /yacute /thorn
/ydieresis
] def
%%EndResource
%FOPBeginFontReencode
/Courier-Oblique findfont
dup length dict begin
  {1 index /FID ne {def} {pop pop} ifelse} forall
  /Encoding WinAnsiEncoding def
  currentdict
end
/Courier-Oblique exch definefont pop
/Courier-BoldOblique findfont
dup length dict begin
  {1 index /FID ne {def} {pop pop} ifelse} forall
  /Encoding WinAnsiEncoding def
  currentdict
end
/Courier-BoldOblique exch definefont pop
/Courier-Bold findfont
dup length dict begin
  {1 index /FID ne {def} {pop pop} ifelse} forall
  /Encoding WinAnsiEncoding def
  currentdict
end
/Courier-Bold exch definefont pop
/Helvetica findfont
dup length dict begin
  {1 index /FID ne {def} {pop pop} ifelse} forall
  /Encoding WinAnsiEncoding def
  currentdict
end
/Helvetica exch definefont pop
/Helvetica-Oblique findfont
dup length dict begin
  {1 index /FID ne {def} {pop pop} ifelse} forall
  /Encoding WinAnsiEncoding def
  currentdict
end
/Helvetica-Oblique exch definefont pop
/Helvetica-Bold findfont
dup length dict begin
  {1 index /FID ne {def} {pop pop} ifelse} forall
  /Encoding WinAnsiEncoding def
  currentdict
end
/Helvetica-Bold exch definefont pop
/Helvetica-BoldOblique findfont
dup length dict begin
  {1 index /FID ne {def} {pop pop} ifelse} forall
  /Encoding WinAnsiEncoding def
  currentdict
end
/Helvetica-BoldOblique exch definefont pop
/Times-Roman findfont
dup length dict begin
  {1 index /FID ne {def} {pop pop} ifelse} forall
  /Encoding WinAnsiEncoding def
  currentdict
end
/Times-Roman exch definefont pop
/Times-Italic findfont
dup length dict begin
  {1 index /FID ne {def} {pop pop} ifelse} forall
  /Encoding WinAnsiEncoding def
  currentdict
end
/Times-Italic exch definefont pop
/Times-Bold findfont
dup length dict begin
  {1 index /FID ne {def} {pop pop} ifelse} forall
  /Encoding WinAnsiEncoding def
  currentdict
end
/Times-Bold exch definefont pop
/Times-BoldItalic findfont
dup length dict begin
  {1 index /FID ne {def} {pop pop} ifelse} forall
  /Encoding WinAnsiEncoding def
  currentdict
end
/Times-BoldItalic exch definefont pop
/Courier findfont
dup length dict begin
  {1 index /FID ne {def} {pop pop} ifelse} forall
  /Encoding WinAnsiEncoding def
  currentdict
end
/Courier exch definefont pop
%FOPEndFontReencode
%%EndProlog
%%Page: 1 1
%%PageBoundingBox: 0 0 425 283
%%BeginPageSetup
[1 0 0 -1 0 283] CT
%%EndPageSetup
GS
[1.00046 0 0 1 0 0] CT
1 GC
N
0 0 425 283 re
f
GR
GS
[1.00046 0 0 1 0 0] CT
1 GC
N
0 0 425 283 re
f
GR
GS
[1.00046 0 0 1 0 0] CT
1 GC
N
64.5 248.5 M
384.5 248.5 L
384.5 21 L
64.5 21 L
cp
f
GR
GS
[1.00046 0 0 1 0 0] CT
0.149 GC
2 setlinecap
1 LJ
0.5 LW
N
64.5 248.5 M
384.5 248.5 L
S
GR
GS
[1.00046 0 0 1 0 0] CT
0.149 GC
2 setlinecap
1 LJ
0.5 LW
N
89.115 248.5 M
89.115 245.304 L
S
GR
GS
[1.00046 0 0 1 0 0] CT
0.149 GC
2 setlinecap
1 LJ
0.5 LW
N
138.346 248.5 M
138.346 245.304 L
S
GR
GS
[1.00046 0 0 1 0 0] CT
0.149 GC
2 setlinecap
1 LJ
0.5 LW
N
187.577 248.5 M
187.577 245.304 L
S
GR
GS
[1.00046 0 0 1 0 0] CT
0.149 GC
2 setlinecap
1 LJ
0.5 LW
N
236.808 248.5 M
236.808 245.304 L
S
GR
GS
[1.00046 0 0 1 0 0] CT
0.149 GC
2 setlinecap
1 LJ
0.5 LW
N
286.038 248.5 M
286.038 245.304 L
S
GR
GS
[1.00046 0 0 1 0 0] CT
0.149 GC
2 setlinecap
1 LJ
0.5 LW
N
335.269 248.5 M
335.269 245.304 L
S
GR
GS
[1.00046 0 0 1 0 0] CT
0.149 GC
2 setlinecap
1 LJ
0.5 LW
N
384.5 248.5 M
384.5 245.304 L
S
GR
GS
[1.00046 0 0 1 89.15666 252.90041] CT
0.149 GC
/Helvetica 12 F
GS
[1 0 0 1 0 0] CT
-6 12 moveto 
1 -1 scale
(-1) t 
GR
GR
GS
[1.00046 0 0 1 138.41024 252.90041] CT
0.149 GC
/Helvetica 12 F
GS
[1 0 0 1 0 0] CT
-3.5 12 moveto 
1 -1 scale
(0) t 
GR
GR
GS
[1.00046 0 0 1 187.6638 252.90041] CT
0.149 GC
/Helvetica 12 F
GS
[1 0 0 1 0 0] CT
-3.5 12 moveto 
1 -1 scale
(1) t 
GR
GR
GS
[1.00046 0 0 1 236.91737 252.90041] CT
0.149 GC
/Helvetica 12 F
GS
[1 0 0 1 0 0] CT
-3.5 12 moveto 
1 -1 scale
(2) t 
GR
GR
GS
[1.00046 0 0 1 286.17093 252.90041] CT
0.149 GC
/Helvetica 12 F
GS
[1 0 0 1 0 0] CT
-3.5 12 moveto 
1 -1 scale
(3) t 
GR
GR
GS
[1.00046 0 0 1 335.42451 252.90041] CT
0.149 GC
/Helvetica 12 F
GS
[1 0 0 1 0 0] CT
-3.5 12 moveto 
1 -1 scale
(4) t 
GR
GR
GS
[1.00046 0 0 1 384.67808 252.90041] CT
0.149 GC
/Helvetica 12 F
GS
[1 0 0 1 0 0] CT
-3.5 12 moveto 
1 -1 scale
(5) t 
GR
GR
GS
[1.00046 0 0 1 224.60413 268.49988] CT
0.149 GC
/Helvetica 12 F
GS
[1 0 0 1 0 0] CT
-21 12 moveto 
1 -1 scale
(Time \(s\)) t 
GR
GR
GS
[1.00046 0 0 1 0 0] CT
0.149 GC
2 setlinecap
1 LJ
0.5 LW
N
64.5 248.5 M
64.5 21 L
S
GR
GS
[1.00046 0 0 1 0 0] CT
0.149 GC
2 setlinecap
1 LJ
0.5 LW
N
64.5 248.5 M
67.696 248.5 L
S
GR
GS
[1.00046 0 0 1 0 0] CT
0.149 GC
2 setlinecap
1 LJ
0.5 LW
N
64.5 220.063 M
67.696 220.063 L
S
GR
GS
[1.00046 0 0 1 0 0] CT
0.149 GC
2 setlinecap
1 LJ
0.5 LW
N
64.5 191.625 M
67.696 191.625 L
S
GR
GS
[1.00046 0 0 1 0 0] CT
0.149 GC
2 setlinecap
1 LJ
0.5 LW
N
64.5 163.188 M
67.696 163.188 L
S
GR
GS
[1.00046 0 0 1 0 0] CT
0.149 GC
2 setlinecap
1 LJ
0.5 LW
N
64.5 134.75 M
67.696 134.75 L
S
GR
GS
[1.00046 0 0 1 0 0] CT
0.149 GC
2 setlinecap
1 LJ
0.5 LW
N
64.5 106.313 M
67.696 106.313 L
S
GR
GS
[1.00046 0 0 1 0 0] CT
0.149 GC
2 setlinecap
1 LJ
0.5 LW
N
64.5 77.875 M
67.696 77.875 L
S
GR
GS
[1.00046 0 0 1 0 0] CT
0.149 GC
2 setlinecap
1 LJ
0.5 LW
N
64.5 49.437 M
67.696 49.437 L
S
GR
GS
[1.00046 0 0 1 0 0] CT
0.149 GC
2 setlinecap
1 LJ
0.5 LW
N
64.5 21 M
67.696 21 L
S
GR
GS
[1.00046 0 0 1 60.12783 248.50017] CT
0.149 GC
/Helvetica 12 F
GS
[1 0 0 1 0 0] CT
-29 4.5 moveto 
1 -1 scale
(-5.38) t 
GR
GR
GS
[1.00046 0 0 1 60.12783 220.06268] CT
0.149 GC
/Helvetica 12 F
GS
[1 0 0 1 0 0] CT
-29 4.5 moveto 
1 -1 scale
(-5.36) t 
GR
GR
GS
[1.00046 0 0 1 60.12783 191.62521] CT
0.149 GC
/Helvetica 12 F
GS
[1 0 0 1 0 0] CT
-29 4.5 moveto 
1 -1 scale
(-5.34) t 
GR
GR
GS
[1.00046 0 0 1 60.12783 163.18774] CT
0.149 GC
/Helvetica 12 F
GS
[1 0 0 1 0 0] CT
-29 4.5 moveto 
1 -1 scale
(-5.32) t 
GR
GR
GS
[1.00046 0 0 1 60.12783 134.75027] CT
0.149 GC
/Helvetica 12 F
GS
[1 0 0 1 0 0] CT
-22 4.5 moveto 
1 -1 scale
(-5.3) t 
GR
GR
GS
[1.00046 0 0 1 60.12783 106.3128] CT
0.149 GC
/Helvetica 12 F
GS
[1 0 0 1 0 0] CT
-29 4.5 moveto 
1 -1 scale
(-5.28) t 
GR
GR
GS
[1.00046 0 0 1 60.12783 77.87533] CT
0.149 GC
/Helvetica 12 F
GS
[1 0 0 1 0 0] CT
-29 4.5 moveto 
1 -1 scale
(-5.26) t 
GR
GR
GS
[1.00046 0 0 1 60.12783 49.43718] CT
0.149 GC
/Helvetica 12 F
GS
[1 0 0 1 0 0] CT
-29 4.5 moveto 
1 -1 scale
(-5.24) t 
GR
GR
GS
[1.00046 0 0 1 60.12783 20.9997] CT
0.149 GC
/Helvetica 12 F
GS
[1 0 0 1 0 0] CT
-29 4.5 moveto 
1 -1 scale
(-5.22) t 
GR
GR
GS
[0 -1 1.00046 0 29.01344 134.74959] CT
0.149 GC
/Helvetica 12 F
GS
[1 0 0 1 0 0] CT
-53.5 -18 moveto 
1 -1 scale
(2-8 Hz Theta Power) t 
GR
GR
GS
[0 -1 1.00046 0 29.01344 134.74959] CT
0.149 GC
/Helvetica 12 F
GS
[1 0 0 1 0 0] CT
-46 -3 moveto 
1 -1 scale
(\(a.u.; normalized\)) t 
GR
GR
GS
[1.00046 0 0 1 0 0] CT
0.996 0.98 0.98 RC
N
81.731 230.214 M
84.192 232.175 L
86.654 233.655 L
89.115 234.238 L
91.577 233.284 L
94.038 234.343 L
96.5 234.892 L
98.962 233.592 L
101.423 233.144 L
103.885 233.016 L
106.346 231.876 L
108.808 229.922 L
111.269 227.488 L
113.731 225.262 L
116.192 224.892 L
118.654 222.786 L
121.115 220.458 L
123.577 218.31 L
126.038 216.284 L
128.5 213.774 L
130.962 206.518 L
133.423 199.095 L
135.885 192.119 L
138.346 179.858 L
140.808 163.109 L
143.269 145.68 L
145.731 128.074 L
148.192 115.392 L
150.654 111.99 L
153.115 112.275 L
155.577 113.793 L
158.038 119.074 L
160.5 126.391 L
162.962 134.889 L
165.423 145.24 L
167.885 155.627 L
170.346 164.012 L
172.808 171.193 L
175.269 177.298 L
177.731 184.112 L
180.192 191.772 L
182.654 198.572 L
185.115 205.852 L
187.577 214.342 L
190.038 221.758 L
192.5 227.814 L
194.962 230.951 L
197.423 233.601 L
199.885 234.682 L
202.346 234.523 L
204.808 233.246 L
207.269 231.721 L
209.731 231.122 L
212.192 233.074 L
214.654 232.296 L
217.115 233.755 L
219.577 236.041 L
222.038 238.121 L
224.5 238.209 L
226.962 237.032 L
229.423 236.721 L
231.885 235.952 L
234.346 234.78 L
236.808 235.149 L
239.269 234.211 L
241.731 234.177 L
244.192 232.149 L
246.654 229.768 L
249.115 228.298 L
251.577 226.149 L
254.038 223.982 L
256.5 223.384 L
258.962 224.526 L
261.423 224.217 L
263.885 223.619 L
266.346 223.546 L
268.808 223.036 L
271.269 221.471 L
273.731 218.98 L
276.192 216.187 L
278.654 213.331 L
281.115 210.388 L
283.577 208.317 L
286.038 203.417 L
288.5 193.404 L
290.962 179.087 L
293.423 159.894 L
295.885 137.166 L
298.346 112.573 L
300.808 90.791 L
303.269 75.22 L
305.731 67.495 L
308.192 65.618 L
310.654 67.804 L
313.115 74.973 L
315.577 86.793 L
318.038 101.224 L
320.5 115.608 L
322.962 129.709 L
325.423 142.13 L
327.885 155.74 L
330.346 166.808 L
332.808 177.445 L
335.269 187.335 L
337.731 196.653 L
340.192 204.95 L
342.654 210.41 L
345.115 210.694 L
347.577 209.663 L
350.038 208.142 L
352.5 205.857 L
354.962 202.469 L
357.423 203.088 L
359.885 204.863 L
362.346 205.74 L
364.808 208.571 L
367.269 210.293 L
369.731 212.431 L
372.192 214.442 L
374.654 213.637 L
377.115 211.137 L
379.577 206.772 L
382.038 201.839 L
384.5 193.786 L
384.538 193.648 L
384.538 184.692 L
384.538 184.548 L
384.5 184.689 L
382.038 192.513 L
379.577 197.18 L
377.115 200.967 L
374.654 202.841 L
372.192 203.398 L
369.731 201.489 L
367.269 199.74 L
364.808 198.356 L
362.346 195.657 L
359.885 194.652 L
357.423 192.745 L
354.962 191.646 L
352.5 194.585 L
350.038 196.322 L
347.577 197.718 L
345.115 198.731 L
342.654 198.173 L
340.192 192.643 L
337.731 184.495 L
335.269 175.297 L
332.808 165.192 L
330.346 153.958 L
327.885 142.189 L
325.423 127.942 L
322.962 114.732 L
320.5 99.973 L
318.038 84.971 L
315.577 70.111 L
313.115 58.082 L
310.654 51.437 L
308.192 50.098 L
305.731 53.069 L
303.269 62.144 L
300.808 78.649 L
298.346 101.192 L
295.885 126.464 L
293.423 149.877 L
290.962 169.358 L
288.5 183.744 L
286.038 193.51 L
283.577 198.326 L
281.115 200.125 L
278.654 203.169 L
276.192 206.214 L
273.731 209.411 L
271.269 212.185 L
268.808 213.991 L
266.346 214.359 L
263.885 214.598 L
261.423 215.169 L
258.962 215.376 L
256.5 214.2 L
254.038 214.567 L
251.577 216.602 L
249.115 218.704 L
246.654 220.069 L
244.192 222.2 L
241.731 224.132 L
239.269 224.122 L
236.808 225.205 L
234.346 224.618 L
231.885 225.491 L
229.423 226.002 L
226.962 226.262 L
224.5 227.174 L
222.038 226.905 L
219.577 224.761 L
217.115 222.329 L
214.654 220.773 L
212.192 221.709 L
209.731 220.312 L
207.269 221.362 L
204.808 223.322 L
202.346 224.594 L
199.885 224.771 L
197.423 223.367 L
194.962 220.804 L
192.5 217.88 L
190.038 212.01 L
187.577 204.672 L
185.115 195.964 L
182.654 188.761 L
180.192 181.967 L
177.731 174.493 L
175.269 168.098 L
172.808 162.414 L
170.346 155.522 L
167.885 147.549 L
165.423 137.664 L
162.962 127.443 L
160.5 118.574 L
158.038 110.664 L
155.577 105.371 L
153.115 103.879 L
150.654 103.582 L
148.192 107.04 L
145.731 119.893 L
143.269 137.476 L
140.808 154.819 L
138.346 171.379 L
135.885 183.629 L
133.423 190.934 L
130.962 198.611 L
128.5 205.835 L
126.038 208.345 L
123.577 209.83 L
121.115 211.666 L
118.654 213.837 L
116.192 215.803 L
113.731 216.292 L
111.269 218.796 L
108.808 221.36 L
106.346 223.459 L
103.885 224.652 L
101.423 224.881 L
98.962 225.114 L
96.5 225.984 L
94.038 225.262 L
91.577 224.095 L
89.115 224.895 L
86.654 224.396 L
84.192 222.841 L
81.731 220.922 L
79.269 217.051 L
76.808 213.238 L
74.346 209.398 L
71.885 206.202 L
69.423 201.556 L
66.962 197.392 L
64.5 193.798 L
64.462 193.735 L
64.462 193.887 L
64.462 203.422 L
64.5 203.482 L
66.962 207.469 L
69.423 211.598 L
71.885 216.06 L
74.346 219.047 L
76.808 222.681 L
79.269 226.454 L
cp
f
GR
GS
[1.00046 0 0 1 0 0] CT
0.98 0.91 0.91 RC
1 LJ
0.5 LW
N
64.462 203.422 M
64.5 203.482 L
66.962 207.469 L
69.423 211.598 L
71.885 216.06 L
74.346 219.047 L
76.808 222.681 L
79.269 226.454 L
81.731 230.214 L
84.192 232.175 L
86.654 233.655 L
89.115 234.238 L
91.577 233.284 L
94.038 234.343 L
96.5 234.892 L
98.962 233.592 L
101.423 233.144 L
103.885 233.016 L
106.346 231.876 L
108.808 229.922 L
111.269 227.488 L
113.731 225.262 L
116.192 224.892 L
118.654 222.786 L
121.115 220.458 L
123.577 218.31 L
126.038 216.284 L
128.5 213.774 L
130.962 206.518 L
133.423 199.095 L
135.885 192.119 L
138.346 179.858 L
140.808 163.109 L
143.269 145.68 L
145.731 128.074 L
148.192 115.392 L
150.654 111.99 L
153.115 112.275 L
155.577 113.793 L
158.038 119.074 L
160.5 126.391 L
162.962 134.889 L
165.423 145.24 L
167.885 155.627 L
170.346 164.012 L
172.808 171.193 L
175.269 177.298 L
177.731 184.112 L
180.192 191.772 L
182.654 198.572 L
185.115 205.852 L
187.577 214.342 L
190.038 221.758 L
192.5 227.814 L
194.962 230.951 L
197.423 233.601 L
199.885 234.682 L
202.346 234.523 L
204.808 233.246 L
207.269 231.721 L
209.731 231.122 L
212.192 233.074 L
214.654 232.296 L
217.115 233.755 L
219.577 236.041 L
222.038 238.121 L
224.5 238.209 L
226.962 237.032 L
229.423 236.721 L
231.885 235.952 L
234.346 234.78 L
236.808 235.149 L
239.269 234.211 L
241.731 234.177 L
244.192 232.149 L
246.654 229.768 L
249.115 228.298 L
251.577 226.149 L
254.038 223.982 L
256.5 223.384 L
258.962 224.526 L
261.423 224.217 L
263.885 223.619 L
266.346 223.546 L
268.808 223.036 L
271.269 221.471 L
273.731 218.98 L
276.192 216.187 L
278.654 213.331 L
281.115 210.388 L
283.577 208.317 L
286.038 203.417 L
288.5 193.404 L
290.962 179.087 L
293.423 159.894 L
295.885 137.166 L
298.346 112.573 L
300.808 90.791 L
303.269 75.22 L
305.731 67.495 L
308.192 65.618 L
310.654 67.804 L
313.115 74.973 L
315.577 86.793 L
318.038 101.224 L
320.5 115.608 L
322.962 129.709 L
325.423 142.13 L
327.885 155.74 L
330.346 166.808 L
332.808 177.445 L
335.269 187.335 L
337.731 196.653 L
340.192 204.95 L
342.654 210.41 L
345.115 210.694 L
347.577 209.663 L
350.038 208.142 L
352.5 205.857 L
354.962 202.469 L
357.423 203.088 L
359.885 204.863 L
362.346 205.74 L
364.808 208.571 L
367.269 210.293 L
369.731 212.431 L
372.192 214.442 L
374.654 213.637 L
377.115 211.137 L
379.577 206.772 L
382.038 201.839 L
384.5 193.786 L
384.538 193.648 L
S
GR
GS
[1.00046 0 0 1 0 0] CT
0.98 0.91 0.91 RC
1 LJ
0.5 LW
N
64.462 193.735 M
64.5 193.798 L
66.962 197.392 L
69.423 201.556 L
71.885 206.202 L
74.346 209.398 L
76.808 213.238 L
79.269 217.051 L
81.731 220.922 L
84.192 222.841 L
86.654 224.396 L
89.115 224.895 L
91.577 224.095 L
94.038 225.262 L
96.5 225.984 L
98.962 225.114 L
101.423 224.881 L
103.885 224.652 L
106.346 223.459 L
108.808 221.36 L
111.269 218.796 L
113.731 216.292 L
116.192 215.803 L
118.654 213.837 L
121.115 211.666 L
123.577 209.83 L
126.038 208.345 L
128.5 205.835 L
130.962 198.611 L
133.423 190.934 L
135.885 183.629 L
138.346 171.379 L
140.808 154.819 L
143.269 137.476 L
145.731 119.893 L
148.192 107.04 L
150.654 103.582 L
153.115 103.879 L
155.577 105.371 L
158.038 110.664 L
160.5 118.574 L
162.962 127.443 L
165.423 137.664 L
167.885 147.549 L
170.346 155.522 L
172.808 162.414 L
175.269 168.098 L
177.731 174.493 L
180.192 181.967 L
182.654 188.761 L
185.115 195.964 L
187.577 204.672 L
190.038 212.01 L
192.5 217.88 L
194.962 220.804 L
197.423 223.367 L
199.885 224.771 L
202.346 224.594 L
204.808 223.322 L
207.269 221.362 L
209.731 220.312 L
212.192 221.709 L
214.654 220.773 L
217.115 222.329 L
219.577 224.761 L
222.038 226.905 L
224.5 227.174 L
226.962 226.262 L
229.423 226.002 L
231.885 225.491 L
234.346 224.618 L
236.808 225.205 L
239.269 224.122 L
241.731 224.132 L
244.192 222.2 L
246.654 220.069 L
249.115 218.704 L
251.577 216.602 L
254.038 214.567 L
256.5 214.2 L
258.962 215.376 L
261.423 215.169 L
263.885 214.598 L
266.346 214.359 L
268.808 213.991 L
271.269 212.185 L
273.731 209.411 L
276.192 206.214 L
278.654 203.169 L
281.115 200.125 L
283.577 198.326 L
286.038 193.51 L
288.5 183.744 L
290.962 169.358 L
293.423 149.877 L
295.885 126.464 L
298.346 101.192 L
300.808 78.649 L
303.269 62.144 L
305.731 53.069 L
308.192 50.098 L
310.654 51.437 L
313.115 58.082 L
315.577 70.111 L
318.038 84.971 L
320.5 99.973 L
322.962 114.732 L
325.423 127.942 L
327.885 142.189 L
330.346 153.958 L
332.808 165.192 L
335.269 175.297 L
337.731 184.495 L
340.192 192.643 L
342.654 198.173 L
345.115 198.731 L
347.577 197.718 L
350.038 196.322 L
352.5 194.585 L
354.962 191.646 L
357.423 192.745 L
359.885 194.652 L
362.346 195.657 L
364.808 198.356 L
367.269 199.74 L
369.731 201.489 L
372.192 203.398 L
374.654 202.841 L
377.115 200.967 L
379.577 197.18 L
382.038 192.513 L
384.5 184.689 L
384.538 184.548 L
S
GR
GS
[1.00046 0 0 1 0 0] CT
0.961 0.8 0.8 RC
1 LJ
2 LW
N
64.462 198.578 M
64.5 198.64 L
66.962 202.431 L
69.423 206.577 L
71.885 211.131 L
74.346 214.222 L
76.808 217.96 L
79.269 221.752 L
81.731 225.569 L
84.192 227.508 L
86.654 229.026 L
89.115 229.566 L
91.577 228.69 L
94.038 229.802 L
96.5 230.438 L
98.962 229.353 L
101.423 229.012 L
103.885 228.834 L
106.346 227.667 L
108.808 225.641 L
111.269 223.141 L
113.731 220.777 L
116.192 220.347 L
118.654 218.311 L
121.115 216.062 L
123.577 214.07 L
126.038 212.314 L
128.5 209.805 L
130.962 202.565 L
133.423 195.014 L
135.885 187.874 L
138.346 175.619 L
140.808 158.964 L
143.269 141.578 L
145.731 123.984 L
148.192 111.215 L
150.654 107.786 L
153.115 108.077 L
155.577 109.582 L
158.038 114.869 L
160.5 122.482 L
162.962 131.166 L
165.423 141.452 L
167.885 151.588 L
170.346 159.767 L
172.808 166.804 L
175.269 172.697 L
177.731 179.302 L
180.192 186.869 L
182.654 193.667 L
185.115 200.908 L
187.577 209.507 L
190.038 216.884 L
192.5 222.847 L
194.962 225.878 L
197.423 228.484 L
199.885 229.727 L
202.346 229.559 L
204.808 228.284 L
207.269 226.542 L
209.731 225.717 L
212.192 227.391 L
214.654 226.534 L
217.115 228.042 L
219.577 230.401 L
222.038 232.513 L
224.5 232.691 L
226.962 231.647 L
229.423 231.362 L
231.885 230.722 L
234.346 229.699 L
236.808 230.177 L
239.269 229.167 L
241.731 229.155 L
244.192 227.174 L
246.654 224.919 L
249.115 223.501 L
251.577 221.375 L
254.038 219.274 L
256.5 218.792 L
258.962 219.951 L
261.423 219.693 L
263.885 219.109 L
266.346 218.952 L
268.808 218.513 L
271.269 216.828 L
273.731 214.196 L
276.192 211.201 L
278.654 208.251 L
281.115 205.256 L
283.577 203.321 L
286.038 198.464 L
288.5 188.574 L
290.962 174.222 L
293.423 154.886 L
295.885 131.815 L
298.346 106.882 L
300.808 84.72 L
303.269 68.682 L
305.731 60.282 L
308.192 57.858 L
310.654 59.621 L
313.115 66.528 L
315.577 78.452 L
318.038 93.097 L
320.5 107.791 L
322.962 122.22 L
325.423 135.036 L
327.885 148.964 L
330.346 160.384 L
332.808 171.319 L
335.269 181.316 L
337.731 190.574 L
340.192 198.796 L
342.654 204.292 L
345.115 204.713 L
347.577 203.691 L
350.038 202.232 L
352.5 200.221 L
354.962 197.057 L
357.423 197.916 L
359.885 199.757 L
362.346 200.698 L
364.808 203.463 L
367.269 205.016 L
369.731 206.96 L
372.192 208.92 L
374.654 208.239 L
377.115 206.052 L
379.577 201.976 L
382.038 197.177 L
384.5 189.237 L
384.538 189.098 L
S
GR
GS
[1.00046 0 0 1 0 0] CT
0.99 0.959 0.959 RC
N
138.346 182.41 M
140.808 170.359 L
143.269 156.295 L
145.731 142.863 L
148.192 134.941 L
150.654 132.461 L
153.115 133.634 L
155.577 134.963 L
158.038 139.359 L
160.5 146.143 L
162.962 153.039 L
165.423 158.071 L
167.885 164.617 L
170.346 169.707 L
172.808 174.644 L
175.269 177.731 L
177.731 180.619 L
180.192 182.305 L
182.654 184.401 L
185.115 186.243 L
187.577 188.356 L
190.038 188.092 L
192.5 189.446 L
194.962 190.869 L
197.423 191.307 L
199.885 192.947 L
202.346 196.376 L
204.808 199.812 L
207.269 202.252 L
209.731 204.932 L
212.192 206.612 L
214.654 208.214 L
217.115 210.215 L
219.577 210.919 L
222.038 210.766 L
224.5 209.275 L
226.962 208.071 L
229.423 208.175 L
231.885 209.27 L
234.346 208.641 L
236.808 208.095 L
239.269 208.958 L
241.731 210.201 L
244.192 211.508 L
246.654 215.117 L
249.115 217.746 L
251.577 220.192 L
254.038 221.018 L
256.5 220.061 L
258.962 220.071 L
261.423 219.05 L
263.885 218.345 L
266.346 216.305 L
268.808 215.475 L
271.269 214.288 L
273.731 214.004 L
276.192 212.523 L
278.654 211.396 L
281.115 209.925 L
283.577 206.145 L
286.038 197.562 L
288.5 187.677 L
290.962 175.647 L
293.423 163.593 L
295.885 148.085 L
298.346 125.232 L
300.808 101.145 L
303.269 79.42 L
305.731 62.66 L
308.192 50.784 L
310.654 43.025 L
313.115 40.335 L
315.577 43.059 L
318.038 53.093 L
320.5 68.31 L
322.962 83.985 L
325.423 99.317 L
327.885 113.411 L
330.346 127.766 L
332.808 141.21 L
335.269 152.612 L
337.731 160.534 L
340.192 168.681 L
342.654 176.254 L
345.115 182.369 L
347.577 187.068 L
350.038 193.092 L
352.5 198.699 L
354.962 202.929 L
357.423 207.217 L
359.885 210.496 L
362.346 212.942 L
364.808 215.712 L
367.269 217.72 L
369.731 217.547 L
372.192 215.858 L
374.654 212.489 L
377.115 208.224 L
379.577 203.615 L
382.038 197.001 L
384.5 190.394 L
384.538 190.257 L
384.538 182.611 L
384.538 182.491 L
384.5 182.627 L
382.038 188.831 L
379.577 195.516 L
377.115 199.881 L
374.654 204.107 L
372.192 207.099 L
369.731 208.6 L
367.269 208.909 L
364.808 207.045 L
362.346 204.147 L
359.885 201.811 L
357.423 198.539 L
354.962 194.171 L
352.5 189.971 L
350.038 184.383 L
347.577 178.393 L
345.115 173.56 L
342.654 167.357 L
340.192 159.95 L
337.731 151.905 L
335.269 143.934 L
332.808 132.453 L
330.346 118.659 L
327.885 104.2 L
325.423 90.011 L
322.962 74.662 L
320.5 59.091 L
318.038 44.331 L
315.577 34.274 L
313.115 31.652 L
310.654 34.201 L
308.192 41.503 L
305.731 53.307 L
303.269 70.213 L
300.808 91.971 L
298.346 116.42 L
295.885 139.811 L
293.423 155.854 L
290.962 168.225 L
288.5 180.057 L
286.038 189.534 L
283.577 197.623 L
281.115 201.215 L
278.654 202.744 L
276.192 204.047 L
273.731 205.301 L
271.269 205.326 L
268.808 206.297 L
266.346 206.859 L
263.885 209.056 L
261.423 209.889 L
258.962 211.281 L
256.5 211.559 L
254.038 212.508 L
251.577 211.379 L
249.115 209.132 L
246.654 206.548 L
244.192 203.023 L
241.731 201.33 L
239.269 199.893 L
236.808 198.989 L
234.346 199.538 L
231.885 199.807 L
229.423 198.908 L
226.962 198.928 L
224.5 199.981 L
222.038 201.908 L
219.577 202.133 L
217.115 201.719 L
214.654 200.177 L
212.192 198.712 L
209.731 196.718 L
207.269 193.926 L
204.808 191.347 L
202.346 187.733 L
199.885 184.426 L
197.423 182.775 L
194.962 182.499 L
192.5 181.794 L
190.038 180.839 L
187.577 181.003 L
185.115 178.747 L
182.654 176.275 L
180.192 174.131 L
177.731 172.722 L
175.269 170.084 L
172.808 167.347 L
170.346 162.373 L
167.885 156.939 L
165.423 150.167 L
162.962 145.101 L
160.5 138.366 L
158.038 131.385 L
155.577 126.498 L
153.115 124.748 L
150.654 123.325 L
148.192 125.761 L
145.731 133.754 L
143.269 147.506 L
140.808 161.723 L
138.346 174.12 L
135.885 185.25 L
133.423 194.894 L
130.962 200.166 L
128.5 204.372 L
126.038 206.047 L
123.577 207.594 L
121.115 210.315 L
118.654 212.015 L
116.192 213.595 L
113.731 216.094 L
111.269 218.421 L
108.808 219.457 L
106.346 221.195 L
103.885 220.305 L
101.423 220.448 L
98.962 220.937 L
96.5 222.593 L
94.038 223.169 L
91.577 222.956 L
89.115 223.2 L
86.654 223.762 L
84.192 223.83 L
81.731 222.932 L
79.269 219.745 L
76.808 214.879 L
74.346 208.777 L
71.885 203.248 L
69.423 196.969 L
66.962 190.468 L
64.5 184.926 L
64.462 184.803 L
64.462 184.938 L
64.462 193.217 L
64.5 193.336 L
66.962 198.592 L
69.423 204.862 L
71.885 211.126 L
74.346 216.734 L
76.808 222.91 L
79.269 227.813 L
81.731 231.208 L
84.192 232.117 L
86.654 231.862 L
89.115 231.248 L
91.577 230.856 L
94.038 230.992 L
96.5 230.414 L
98.962 229.204 L
101.423 228.318 L
103.885 228.161 L
106.346 228.745 L
108.808 226.837 L
111.269 226.042 L
113.731 224.293 L
116.192 221.986 L
118.654 220.328 L
121.115 218.328 L
123.577 215.634 L
126.038 214.308 L
128.5 212.799 L
130.962 208.337 L
133.423 202.597 L
135.885 193.089 L
cp
f
GR
GS
[1.00046 0 0 1 0 0] CT
0.957 0.82 0.82 RC
1 LJ
0.5 LW
N
64.462 193.217 M
64.5 193.336 L
66.962 198.592 L
69.423 204.862 L
71.885 211.126 L
74.346 216.734 L
76.808 222.91 L
79.269 227.813 L
81.731 231.208 L
84.192 232.117 L
86.654 231.862 L
89.115 231.248 L
91.577 230.856 L
94.038 230.992 L
96.5 230.414 L
98.962 229.204 L
101.423 228.318 L
103.885 228.161 L
106.346 228.745 L
108.808 226.837 L
111.269 226.042 L
113.731 224.293 L
116.192 221.986 L
118.654 220.328 L
121.115 218.328 L
123.577 215.634 L
126.038 214.308 L
128.5 212.799 L
130.962 208.337 L
133.423 202.597 L
135.885 193.089 L
138.346 182.41 L
140.808 170.359 L
143.269 156.295 L
145.731 142.863 L
148.192 134.941 L
150.654 132.461 L
153.115 133.634 L
155.577 134.963 L
158.038 139.359 L
160.5 146.143 L
162.962 153.039 L
165.423 158.071 L
167.885 164.617 L
170.346 169.707 L
172.808 174.644 L
175.269 177.731 L
177.731 180.619 L
180.192 182.305 L
182.654 184.401 L
185.115 186.243 L
187.577 188.356 L
190.038 188.092 L
192.5 189.446 L
194.962 190.869 L
197.423 191.307 L
199.885 192.947 L
202.346 196.376 L
204.808 199.812 L
207.269 202.252 L
209.731 204.932 L
212.192 206.612 L
214.654 208.214 L
217.115 210.215 L
219.577 210.919 L
222.038 210.766 L
224.5 209.275 L
226.962 208.071 L
229.423 208.175 L
231.885 209.27 L
234.346 208.641 L
236.808 208.095 L
239.269 208.958 L
241.731 210.201 L
244.192 211.508 L
246.654 215.117 L
249.115 217.746 L
251.577 220.192 L
254.038 221.018 L
256.5 220.061 L
258.962 220.071 L
261.423 219.05 L
263.885 218.345 L
266.346 216.305 L
268.808 215.475 L
271.269 214.288 L
273.731 214.004 L
276.192 212.523 L
278.654 211.396 L
281.115 209.925 L
283.577 206.145 L
286.038 197.562 L
288.5 187.677 L
290.962 175.647 L
293.423 163.593 L
295.885 148.085 L
298.346 125.232 L
300.808 101.145 L
303.269 79.42 L
305.731 62.66 L
308.192 50.784 L
310.654 43.025 L
313.115 40.335 L
315.577 43.059 L
318.038 53.093 L
320.5 68.31 L
322.962 83.985 L
325.423 99.317 L
327.885 113.411 L
330.346 127.766 L
332.808 141.21 L
335.269 152.612 L
337.731 160.534 L
340.192 168.681 L
342.654 176.254 L
345.115 182.369 L
347.577 187.068 L
350.038 193.092 L
352.5 198.699 L
354.962 202.929 L
357.423 207.217 L
359.885 210.496 L
362.346 212.942 L
364.808 215.712 L
367.269 217.72 L
369.731 217.547 L
372.192 215.858 L
374.654 212.489 L
377.115 208.224 L
379.577 203.615 L
382.038 197.001 L
384.5 190.394 L
384.538 190.257 L
S
GR
GS
[1.00046 0 0 1 0 0] CT
0.957 0.82 0.82 RC
1 LJ
0.5 LW
N
64.462 184.803 M
64.5 184.926 L
66.962 190.468 L
69.423 196.969 L
71.885 203.248 L
74.346 208.777 L
76.808 214.879 L
79.269 219.745 L
81.731 222.932 L
84.192 223.83 L
86.654 223.762 L
89.115 223.2 L
91.577 222.956 L
94.038 223.169 L
96.5 222.593 L
98.962 220.937 L
101.423 220.448 L
103.885 220.305 L
106.346 221.195 L
108.808 219.457 L
111.269 218.421 L
113.731 216.094 L
116.192 213.595 L
118.654 212.015 L
121.115 210.315 L
123.577 207.594 L
126.038 206.047 L
128.5 204.372 L
130.962 200.166 L
133.423 194.894 L
135.885 185.25 L
138.346 174.12 L
140.808 161.723 L
143.269 147.506 L
145.731 133.754 L
148.192 125.761 L
150.654 123.325 L
153.115 124.748 L
155.577 126.498 L
158.038 131.385 L
160.5 138.366 L
162.962 145.101 L
165.423 150.167 L
167.885 156.939 L
170.346 162.373 L
172.808 167.347 L
175.269 170.084 L
177.731 172.722 L
180.192 174.131 L
182.654 176.275 L
185.115 178.747 L
187.577 181.003 L
190.038 180.839 L
192.5 181.794 L
194.962 182.499 L
197.423 182.775 L
199.885 184.426 L
202.346 187.733 L
204.808 191.347 L
207.269 193.926 L
209.731 196.718 L
212.192 198.712 L
214.654 200.177 L
217.115 201.719 L
219.577 202.133 L
222.038 201.908 L
224.5 199.981 L
226.962 198.928 L
229.423 198.908 L
231.885 199.807 L
234.346 199.538 L
236.808 198.989 L
239.269 199.893 L
241.731 201.33 L
244.192 203.023 L
246.654 206.548 L
249.115 209.132 L
251.577 211.379 L
254.038 212.508 L
256.5 211.559 L
258.962 211.281 L
261.423 209.889 L
263.885 209.056 L
266.346 206.859 L
268.808 206.297 L
271.269 205.326 L
273.731 205.301 L
276.192 204.047 L
278.654 202.744 L
281.115 201.215 L
283.577 197.623 L
286.038 189.534 L
288.5 180.057 L
290.962 168.225 L
293.423 155.854 L
295.885 139.811 L
298.346 116.42 L
300.808 91.971 L
303.269 70.213 L
305.731 53.307 L
308.192 41.503 L
310.654 34.201 L
313.115 31.652 L
315.577 34.274 L
318.038 44.331 L
320.5 59.091 L
322.962 74.662 L
325.423 90.011 L
327.885 104.2 L
330.346 118.659 L
332.808 132.453 L
335.269 143.934 L
337.731 151.905 L
340.192 159.95 L
342.654 167.357 L
345.115 173.56 L
347.577 178.393 L
350.038 184.383 L
352.5 189.971 L
354.962 194.171 L
357.423 198.539 L
359.885 201.811 L
362.346 204.147 L
364.808 207.045 L
367.269 208.909 L
369.731 208.6 L
372.192 207.099 L
374.654 204.107 L
377.115 199.881 L
379.577 195.516 L
382.038 188.831 L
384.5 182.627 L
384.538 182.491 L
S
GR
GS
[1.00046 0 0 1 0 0] CT
0.898 0.6 0.6 RC
1 LJ
2 LW
N
64.462 189.01 M
64.5 189.131 L
66.962 194.53 L
69.423 200.916 L
71.885 207.187 L
74.346 212.756 L
76.808 218.894 L
79.269 223.779 L
81.731 227.07 L
84.192 227.974 L
86.654 227.812 L
89.115 227.224 L
91.577 226.906 L
94.038 227.081 L
96.5 226.504 L
98.962 225.07 L
101.423 224.384 L
103.885 224.233 L
106.346 224.97 L
108.808 223.147 L
111.269 222.232 L
113.731 220.194 L
116.192 217.791 L
118.654 216.172 L
121.115 214.321 L
123.577 211.614 L
126.038 210.177 L
128.5 208.586 L
130.962 204.251 L
133.423 198.745 L
135.885 189.169 L
138.346 178.264 L
140.808 166.041 L
143.269 151.901 L
145.731 138.308 L
148.192 130.351 L
150.654 127.893 L
153.115 129.191 L
155.577 130.73 L
158.038 135.372 L
160.5 142.255 L
162.962 149.07 L
165.423 154.119 L
167.885 160.778 L
170.346 166.041 L
172.808 170.996 L
175.269 173.908 L
177.731 176.671 L
180.192 178.218 L
182.654 180.338 L
185.115 182.495 L
187.577 184.679 L
190.038 184.465 L
192.5 185.62 L
194.962 186.685 L
197.423 187.041 L
199.885 188.687 L
202.346 192.054 L
204.808 195.579 L
207.269 198.089 L
209.731 200.825 L
212.192 202.662 L
214.654 204.195 L
217.115 205.967 L
219.577 206.526 L
222.038 206.337 L
224.5 204.628 L
226.962 203.499 L
229.423 203.541 L
231.885 204.538 L
234.346 204.09 L
236.808 203.542 L
239.269 204.425 L
241.731 205.766 L
244.192 207.266 L
246.654 210.832 L
249.115 213.439 L
251.577 215.785 L
254.038 216.763 L
256.5 215.81 L
258.962 215.676 L
261.423 214.47 L
263.885 213.701 L
266.346 211.582 L
268.808 210.886 L
271.269 209.807 L
273.731 209.652 L
276.192 208.285 L
278.654 207.07 L
281.115 205.57 L
283.577 201.884 L
286.038 193.547 L
288.5 183.867 L
290.962 171.937 L
293.423 159.724 L
295.885 143.948 L
298.346 120.827 L
300.808 96.558 L
303.269 74.816 L
305.731 57.983 L
308.192 46.143 L
310.654 38.614 L
313.115 35.993 L
315.577 38.666 L
318.038 48.712 L
320.5 63.7 L
322.962 79.324 L
325.423 94.664 L
327.885 108.806 L
330.346 123.213 L
332.808 136.831 L
335.269 148.273 L
337.731 156.22 L
340.192 164.315 L
342.654 171.805 L
345.115 177.964 L
347.577 182.73 L
350.038 188.738 L
352.5 194.335 L
354.962 198.55 L
357.423 202.879 L
359.885 206.153 L
362.346 208.544 L
364.808 211.378 L
367.269 213.315 L
369.731 213.074 L
372.192 211.479 L
374.654 208.299 L
377.115 204.052 L
379.577 199.565 L
382.038 192.916 L
384.5 186.511 L
384.538 186.374 L
S
GR
GS
[1.00046 0 0 1 0 0] CT
0.98 0.939 0.939 RC
N
64.462 199.772 M
64.462 199.942 L
64.462 210.275 L
64.5 210.377 L
66.962 214.758 L
69.423 217.451 L
71.885 218.945 L
74.346 221.027 L
76.808 222.828 L
79.269 225.898 L
81.731 227.365 L
84.192 228.721 L
86.654 227.86 L
89.115 228.189 L
91.577 227.536 L
94.038 226.512 L
96.5 227.473 L
98.962 228.338 L
101.423 228.479 L
103.885 229.743 L
106.346 229.73 L
108.808 228.762 L
111.269 228.385 L
113.731 228.526 L
116.192 226.054 L
118.654 224.278 L
121.115 224.045 L
123.577 222.708 L
126.038 220.158 L
128.5 217.117 L
130.962 211.295 L
133.423 206.024 L
135.885 198.773 L
138.346 190.97 L
140.808 180.815 L
143.269 166.236 L
145.731 153.775 L
148.192 144.431 L
150.654 140.903 L
153.115 140.275 L
155.577 142.033 L
158.038 145.621 L
160.5 150.368 L
162.962 156.307 L
165.423 161.148 L
167.885 166.126 L
170.346 167.88 L
172.808 170.722 L
175.269 172.577 L
177.731 174.1 L
180.192 174.893 L
182.654 177.41 L
185.115 178.995 L
187.577 179.791 L
190.038 180.019 L
192.5 181.705 L
194.962 183.311 L
197.423 185.769 L
199.885 186.92 L
202.346 185.992 L
204.808 182.825 L
207.269 181.954 L
209.731 182.9 L
212.192 186.163 L
214.654 190.319 L
217.115 191.373 L
219.577 192.774 L
222.038 194.967 L
224.5 197.064 L
226.962 198.322 L
229.423 197.726 L
231.885 197.842 L
234.346 198.269 L
236.808 196.501 L
239.269 194.537 L
241.731 193.479 L
244.192 192.53 L
246.654 191.569 L
249.115 193.274 L
251.577 194.606 L
254.038 196.616 L
256.5 198.133 L
258.962 199.147 L
261.423 200.479 L
263.885 202.861 L
266.346 203.733 L
268.808 201.695 L
271.269 200.962 L
273.731 201.33 L
276.192 201.814 L
278.654 201.367 L
281.115 201.668 L
283.577 201.293 L
286.038 198.778 L
288.5 192.85 L
290.962 182.052 L
293.423 167.521 L
295.885 148.184 L
298.346 125.381 L
300.808 100.595 L
303.269 77.848 L
305.731 59.617 L
308.192 47.167 L
310.654 41.618 L
313.115 40.45 L
315.577 43.658 L
318.038 50.901 L
320.5 60.784 L
322.962 72.171 L
325.423 83.966 L
327.885 96.506 L
330.346 108.851 L
332.808 121.891 L
335.269 136.347 L
337.731 150.776 L
340.192 162.152 L
342.654 171.502 L
345.115 178.267 L
347.577 183.126 L
350.038 190.265 L
352.5 194.398 L
354.962 195.529 L
357.423 196.729 L
359.885 195.95 L
362.346 196.405 L
364.808 198.135 L
367.269 198.451 L
369.731 199.862 L
372.192 202.301 L
374.654 203.582 L
377.115 202.993 L
379.577 200.941 L
382.038 196.445 L
384.5 191.214 L
384.538 191.086 L
384.538 182.763 L
384.538 182.633 L
384.5 182.76 L
382.038 187.628 L
379.577 191.977 L
377.115 193.752 L
374.654 193.909 L
372.192 192.242 L
369.731 189.777 L
367.269 188.376 L
364.808 188.439 L
362.346 186.848 L
359.885 186.574 L
357.423 187.302 L
354.962 186.154 L
352.5 185.173 L
350.038 180.85 L
347.577 173.568 L
345.115 168.458 L
342.654 161.27 L
340.192 151.877 L
337.731 141.235 L
335.269 127.096 L
332.808 112.552 L
330.346 99.337 L
327.885 86.906 L
325.423 74.309 L
322.962 62.221 L
320.5 50.826 L
318.038 41.121 L
315.577 34.11 L
313.115 30.739 L
310.654 31.985 L
308.192 37.963 L
305.731 50.104 L
303.269 68.029 L
300.808 90.658 L
298.346 115.902 L
295.885 139.339 L
293.423 159.067 L
290.962 173.663 L
288.5 184.279 L
286.038 189.963 L
283.577 192.048 L
281.115 192.162 L
278.654 192.067 L
276.192 192.997 L
273.731 192.911 L
271.269 192.553 L
268.808 193.001 L
266.346 194.629 L
263.885 193.598 L
261.423 191.753 L
258.962 191.1 L
256.5 190.558 L
254.038 188.809 L
251.577 185.982 L
249.115 184.202 L
246.654 182.391 L
244.192 183.412 L
241.731 184.356 L
239.269 185.151 L
236.808 187.151 L
234.346 189.041 L
231.885 188.784 L
229.423 188.898 L
226.962 189.701 L
224.5 188.642 L
222.038 186.728 L
219.577 184.878 L
217.115 183.644 L
214.654 182.501 L
212.192 177.939 L
209.731 174.228 L
207.269 172.998 L
204.808 174.028 L
202.346 177.339 L
199.885 178.612 L
197.423 177.476 L
194.962 174.925 L
192.5 173.115 L
190.038 171.408 L
187.577 170.945 L
185.115 170.158 L
182.654 168.52 L
180.192 166.13 L
177.731 165.328 L
175.269 164.051 L
172.808 162.478 L
170.346 159.591 L
167.885 157.554 L
165.423 152.578 L
162.962 148.219 L
160.5 142.381 L
158.038 137.607 L
155.577 133.767 L
153.115 131.801 L
150.654 132.178 L
148.192 135.796 L
145.731 145.092 L
143.269 157.818 L
140.808 172.487 L
138.346 182.772 L
135.885 190.509 L
133.423 197.594 L
130.962 202.95 L
128.5 208.759 L
126.038 211.548 L
123.577 214.113 L
121.115 215.319 L
118.654 215.593 L
116.192 217.256 L
113.731 219.271 L
111.269 218.842 L
108.808 219.122 L
106.346 220.402 L
103.885 220.72 L
101.423 219.414 L
98.962 219.147 L
96.5 218.39 L
94.038 217.922 L
91.577 219.235 L
89.115 220.407 L
86.654 219.829 L
84.192 220.002 L
81.731 218.256 L
79.269 216.444 L
76.808 213.04 L
74.346 211.123 L
71.885 208.72 L
69.423 207.217 L
66.962 204.507 L
64.5 199.881 L
cp
f
GR
GS
[1.00046 0 0 1 0 0] CT
0.91 0.729 0.729 RC
1 LJ
0.5 LW
N
64.462 210.275 M
64.5 210.377 L
66.962 214.758 L
69.423 217.451 L
71.885 218.945 L
74.346 221.027 L
76.808 222.828 L
79.269 225.898 L
81.731 227.365 L
84.192 228.721 L
86.654 227.86 L
89.115 228.189 L
91.577 227.536 L
94.038 226.512 L
96.5 227.473 L
98.962 228.338 L
101.423 228.479 L
103.885 229.743 L
106.346 229.73 L
108.808 228.762 L
111.269 228.385 L
113.731 228.526 L
116.192 226.054 L
118.654 224.278 L
121.115 224.045 L
123.577 222.708 L
126.038 220.158 L
128.5 217.117 L
130.962 211.295 L
133.423 206.024 L
135.885 198.773 L
138.346 190.97 L
140.808 180.815 L
143.269 166.236 L
145.731 153.775 L
148.192 144.431 L
150.654 140.903 L
153.115 140.275 L
155.577 142.033 L
158.038 145.621 L
160.5 150.368 L
162.962 156.307 L
165.423 161.148 L
167.885 166.126 L
170.346 167.88 L
172.808 170.722 L
175.269 172.577 L
177.731 174.1 L
180.192 174.893 L
182.654 177.41 L
185.115 178.995 L
187.577 179.791 L
190.038 180.019 L
192.5 181.705 L
194.962 183.311 L
197.423 185.769 L
199.885 186.92 L
202.346 185.992 L
204.808 182.825 L
207.269 181.954 L
209.731 182.9 L
212.192 186.163 L
214.654 190.319 L
217.115 191.373 L
219.577 192.774 L
222.038 194.967 L
224.5 197.064 L
226.962 198.322 L
229.423 197.726 L
231.885 197.842 L
234.346 198.269 L
236.808 196.501 L
239.269 194.537 L
241.731 193.479 L
244.192 192.53 L
246.654 191.569 L
249.115 193.274 L
251.577 194.606 L
254.038 196.616 L
256.5 198.133 L
258.962 199.147 L
261.423 200.479 L
263.885 202.861 L
266.346 203.733 L
268.808 201.695 L
271.269 200.962 L
273.731 201.33 L
276.192 201.814 L
278.654 201.367 L
281.115 201.668 L
283.577 201.293 L
286.038 198.778 L
288.5 192.85 L
290.962 182.052 L
293.423 167.521 L
295.885 148.184 L
298.346 125.381 L
300.808 100.595 L
303.269 77.848 L
305.731 59.617 L
308.192 47.167 L
310.654 41.618 L
313.115 40.45 L
315.577 43.658 L
318.038 50.901 L
320.5 60.784 L
322.962 72.171 L
325.423 83.966 L
327.885 96.506 L
330.346 108.851 L
332.808 121.891 L
335.269 136.347 L
337.731 150.776 L
340.192 162.152 L
342.654 171.502 L
345.115 178.267 L
347.577 183.126 L
350.038 190.265 L
352.5 194.398 L
354.962 195.529 L
357.423 196.729 L
359.885 195.95 L
362.346 196.405 L
364.808 198.135 L
367.269 198.451 L
369.731 199.862 L
372.192 202.301 L
374.654 203.582 L
377.115 202.993 L
379.577 200.941 L
382.038 196.445 L
384.5 191.214 L
384.538 191.086 L
S
GR
GS
[1.00046 0 0 1 0 0] CT
0.91 0.729 0.729 RC
1 LJ
0.5 LW
N
64.462 199.772 M
64.5 199.881 L
66.962 204.507 L
69.423 207.217 L
71.885 208.72 L
74.346 211.123 L
76.808 213.04 L
79.269 216.444 L
81.731 218.256 L
84.192 220.002 L
86.654 219.829 L
89.115 220.407 L
91.577 219.235 L
94.038 217.922 L
96.5 218.39 L
98.962 219.147 L
101.423 219.414 L
103.885 220.72 L
106.346 220.402 L
108.808 219.122 L
111.269 218.842 L
113.731 219.271 L
116.192 217.256 L
118.654 215.593 L
121.115 215.319 L
123.577 214.113 L
126.038 211.548 L
128.5 208.759 L
130.962 202.95 L
133.423 197.594 L
135.885 190.509 L
138.346 182.772 L
140.808 172.487 L
143.269 157.818 L
145.731 145.092 L
148.192 135.796 L
150.654 132.178 L
153.115 131.801 L
155.577 133.767 L
158.038 137.607 L
160.5 142.381 L
162.962 148.219 L
165.423 152.578 L
167.885 157.554 L
170.346 159.591 L
172.808 162.478 L
175.269 164.051 L
177.731 165.328 L
180.192 166.13 L
182.654 168.52 L
185.115 170.158 L
187.577 170.945 L
190.038 171.408 L
192.5 173.115 L
194.962 174.925 L
197.423 177.476 L
199.885 178.612 L
202.346 177.339 L
204.808 174.028 L
207.269 172.998 L
209.731 174.228 L
212.192 177.939 L
214.654 182.501 L
217.115 183.644 L
219.577 184.878 L
222.038 186.728 L
224.5 188.642 L
226.962 189.701 L
229.423 188.898 L
231.885 188.784 L
234.346 189.041 L
236.808 187.151 L
239.269 185.151 L
241.731 184.356 L
244.192 183.412 L
246.654 182.391 L
249.115 184.202 L
251.577 185.982 L
254.038 188.809 L
256.5 190.558 L
258.962 191.1 L
261.423 191.753 L
263.885 193.598 L
266.346 194.629 L
268.808 193.001 L
271.269 192.553 L
273.731 192.911 L
276.192 192.997 L
278.654 192.067 L
281.115 192.162 L
283.577 192.048 L
286.038 189.963 L
288.5 184.279 L
290.962 173.663 L
293.423 159.067 L
295.885 139.339 L
298.346 115.902 L
300.808 90.658 L
303.269 68.029 L
305.731 50.104 L
308.192 37.963 L
310.654 31.985 L
313.115 30.739 L
315.577 34.11 L
318.038 41.121 L
320.5 50.826 L
322.962 62.221 L
325.423 74.309 L
327.885 86.906 L
330.346 99.337 L
332.808 112.552 L
335.269 127.096 L
337.731 141.235 L
340.192 151.877 L
342.654 161.27 L
345.115 168.458 L
347.577 173.568 L
350.038 180.85 L
352.5 185.173 L
354.962 186.154 L
357.423 187.302 L
359.885 186.574 L
362.346 186.848 L
364.808 188.439 L
367.269 188.376 L
369.731 189.777 L
372.192 192.242 L
374.654 193.909 L
377.115 193.752 L
379.577 191.977 L
382.038 187.628 L
384.5 182.76 L
384.538 182.633 L
S
GR
GS
[1.00046 0 0 1 0 0] CT
0.8 0.4 0.4 RC
1 LJ
2 LW
N
64.462 205.023 M
64.5 205.128 L
66.962 209.632 L
69.423 212.334 L
71.885 213.833 L
74.346 216.075 L
76.808 217.934 L
79.269 221.171 L
81.731 222.811 L
84.192 224.361 L
86.654 223.845 L
89.115 224.298 L
91.577 223.386 L
94.038 222.217 L
96.5 222.931 L
98.962 223.743 L
101.423 223.946 L
103.885 225.231 L
106.346 225.066 L
108.808 223.942 L
111.269 223.613 L
113.731 223.898 L
116.192 221.655 L
118.654 219.935 L
121.115 219.682 L
123.577 218.41 L
126.038 215.852 L
128.5 212.938 L
130.962 207.123 L
133.423 201.809 L
135.885 194.641 L
138.346 186.871 L
140.808 176.652 L
143.269 162.027 L
145.731 149.434 L
148.192 140.113 L
150.654 136.541 L
153.115 136.038 L
155.577 137.9 L
158.038 141.614 L
160.5 146.375 L
162.962 152.263 L
165.423 156.863 L
167.885 161.84 L
170.346 163.736 L
172.808 166.599 L
175.269 168.314 L
177.731 169.714 L
180.192 170.512 L
182.654 172.965 L
185.115 174.576 L
187.577 175.367 L
190.038 175.714 L
192.5 177.41 L
194.962 179.118 L
197.423 181.623 L
199.885 182.766 L
202.346 181.665 L
204.808 178.427 L
207.269 177.477 L
209.731 178.564 L
212.192 182.05 L
214.654 186.409 L
217.115 187.508 L
219.577 188.826 L
222.038 190.848 L
224.5 192.853 L
226.962 194.011 L
229.423 193.311 L
231.885 193.313 L
234.346 193.654 L
236.808 191.827 L
239.269 189.843 L
241.731 188.918 L
244.192 187.971 L
246.654 186.98 L
249.115 188.738 L
251.577 190.294 L
254.038 192.713 L
256.5 194.345 L
258.962 195.124 L
261.423 196.116 L
263.885 198.23 L
266.346 199.181 L
268.808 197.348 L
271.269 196.758 L
273.731 197.121 L
276.192 197.405 L
278.654 196.716 L
281.115 196.916 L
283.577 196.67 L
286.038 194.37 L
288.5 188.565 L
290.962 177.857 L
293.423 163.294 L
295.885 143.761 L
298.346 120.641 L
300.808 95.627 L
303.269 72.939 L
305.731 54.861 L
308.192 42.565 L
310.654 36.801 L
313.115 35.594 L
315.577 38.884 L
318.038 46.011 L
320.5 55.804 L
322.962 67.196 L
325.423 79.138 L
327.885 91.706 L
330.346 104.094 L
332.808 117.222 L
335.269 131.722 L
337.731 146.006 L
340.192 157.015 L
342.654 166.387 L
345.115 173.363 L
347.577 178.347 L
350.038 185.558 L
352.5 189.785 L
354.962 190.841 L
357.423 192.015 L
359.885 191.262 L
362.346 191.627 L
364.808 193.287 L
367.269 193.413 L
369.731 194.82 L
372.192 197.272 L
374.654 198.746 L
377.115 198.373 L
379.577 196.459 L
382.038 192.037 L
384.5 186.987 L
384.538 186.859 L
S
GR
GS
[1.00046 0 0 1 0 0] CT
0.959 0.918 0.918 RC
N
81.731 218.711 M
79.269 216.717 L
76.808 214.805 L
74.346 209.392 L
71.885 202.289 L
69.423 196.475 L
66.962 189.567 L
64.5 183.442 L
64.462 183.347 L
64.462 183.484 L
64.462 192.046 L
64.5 192.14 L
66.962 198.56 L
69.423 205.498 L
71.885 211.07 L
74.346 217.928 L
76.808 223.475 L
79.269 225.683 L
81.731 227.707 L
84.192 229.347 L
86.654 231.449 L
89.115 231.999 L
91.577 230.973 L
94.038 230.825 L
96.5 231.919 L
98.962 232.27 L
101.423 233.32 L
103.885 234.386 L
106.346 233.264 L
108.808 231.203 L
111.269 230.138 L
113.731 229.886 L
116.192 229.321 L
118.654 226.37 L
121.115 223.293 L
123.577 220.376 L
126.038 217.494 L
128.5 212.971 L
130.962 210.494 L
133.423 205.124 L
135.885 198.684 L
138.346 189.193 L
140.808 175.355 L
143.269 160.184 L
145.731 146.773 L
148.192 139.022 L
150.654 137.001 L
153.115 138.712 L
155.577 141.488 L
158.038 144.861 L
160.5 150.195 L
162.962 155.068 L
165.423 161.064 L
167.885 167.092 L
170.346 170.484 L
172.808 175.976 L
175.269 181.709 L
177.731 184.937 L
180.192 185.373 L
182.654 184.209 L
185.115 183.636 L
187.577 181.772 L
190.038 180.026 L
192.5 181.219 L
194.962 182.816 L
197.423 185.26 L
199.885 186.975 L
202.346 188.167 L
204.808 189.349 L
207.269 190.312 L
209.731 191.269 L
212.192 192.385 L
214.654 193.627 L
217.115 195.794 L
219.577 196.692 L
222.038 198.711 L
224.5 201.512 L
226.962 201.584 L
229.423 201.428 L
231.885 200.742 L
234.346 201.654 L
236.808 204.831 L
239.269 205.768 L
241.731 206.705 L
244.192 207.608 L
246.654 207.333 L
249.115 207.145 L
251.577 206.484 L
254.038 205.268 L
256.5 205.247 L
258.962 205.395 L
261.423 206.126 L
263.885 208.458 L
266.346 210.699 L
268.808 212.488 L
271.269 214.92 L
273.731 217.534 L
276.192 217.9 L
278.654 217.419 L
281.115 215.348 L
283.577 213.161 L
286.038 208.874 L
288.5 200.736 L
290.962 188.009 L
293.423 173.04 L
295.885 153.351 L
298.346 131.182 L
300.808 107.428 L
303.269 83.889 L
305.731 64.902 L
308.192 50.757 L
310.654 45.221 L
313.115 45.08 L
315.577 48.548 L
318.038 56.688 L
320.5 68.242 L
322.962 80.986 L
325.423 94.508 L
327.885 111.609 L
330.346 125.443 L
332.808 137.483 L
335.269 149.125 L
337.731 160.356 L
340.192 171.295 L
342.654 182.385 L
345.115 191.448 L
347.577 199.716 L
350.038 203.519 L
352.5 207.653 L
354.962 212.26 L
357.423 215.158 L
359.885 216.153 L
362.346 215.322 L
364.808 215.292 L
367.269 214.292 L
369.731 211.797 L
372.192 208.395 L
374.654 206.252 L
377.115 205.341 L
379.577 204.562 L
382.038 201.736 L
384.5 195.988 L
384.538 195.873 L
384.538 188.211 L
384.538 188.095 L
384.5 188.205 L
382.038 193.467 L
379.577 195.931 L
377.115 196.2 L
374.654 196.911 L
372.192 198.963 L
369.731 202.292 L
367.269 204.663 L
364.808 205.683 L
362.346 205.854 L
359.885 206.824 L
357.423 206.137 L
354.962 202.913 L
352.5 197.865 L
350.038 193.562 L
347.577 189.771 L
345.115 181.04 L
342.654 171.697 L
340.192 160.515 L
337.731 149.906 L
335.269 138.624 L
332.808 127.133 L
330.346 115.511 L
327.885 101.65 L
325.423 84.215 L
322.962 70.324 L
320.5 57.394 L
318.038 46.265 L
315.577 38.406 L
313.115 35.139 L
310.654 35.356 L
308.192 40.999 L
305.731 55.033 L
303.269 74.301 L
300.808 98.091 L
298.346 122.021 L
295.885 144.39 L
293.423 164.357 L
290.962 179.262 L
288.5 191.898 L
286.038 200.078 L
283.577 204.651 L
281.115 206.867 L
278.654 208.782 L
276.192 209.167 L
273.731 208.863 L
271.269 205.88 L
268.808 203.372 L
266.346 201.603 L
263.885 199.685 L
261.423 197.84 L
258.962 197.396 L
256.5 197.359 L
254.038 197.338 L
251.577 198.453 L
249.115 198.885 L
246.654 198.649 L
244.192 198.662 L
241.731 197.772 L
239.269 196.765 L
236.808 195.95 L
234.346 193.113 L
231.885 192.467 L
229.423 193.291 L
226.962 193.14 L
224.5 192.93 L
222.038 190.094 L
219.577 187.834 L
217.115 186.644 L
214.654 184.503 L
212.192 183.418 L
209.731 182.595 L
207.269 181.681 L
204.808 180.875 L
202.346 179.437 L
199.885 178.139 L
197.423 176.067 L
194.962 173.81 L
192.5 172.773 L
190.038 171.912 L
187.577 173.749 L
185.115 175.354 L
182.654 175.979 L
180.192 177.214 L
177.731 176.806 L
175.269 173.712 L
172.808 168.139 L
170.346 162.568 L
167.885 159.077 L
165.423 153.075 L
162.962 147.029 L
160.5 142.063 L
158.038 136.722 L
155.577 133.714 L
153.115 131.444 L
150.654 129.505 L
148.192 131.204 L
145.731 138.488 L
143.269 151.637 L
140.808 166.625 L
138.346 180.596 L
135.885 190.369 L
133.423 197.106 L
130.962 202.601 L
128.5 204.922 L
126.038 209.225 L
123.577 212.298 L
121.115 215.272 L
118.654 218.598 L
116.192 221.354 L
113.731 222.216 L
111.269 222.755 L
108.808 223.841 L
106.346 225.786 L
103.885 226.478 L
101.423 225.569 L
98.962 224.388 L
96.5 223.839 L
94.038 222.527 L
91.577 222.537 L
89.115 223.705 L
86.654 223.12 L
84.192 220.585 L
cp
f
GR
GS
[1.00046 0 0 1 0 0] CT
0.82 0.639 0.639 RC
1 LJ
0.5 LW
N
64.462 192.046 M
64.5 192.14 L
66.962 198.56 L
69.423 205.498 L
71.885 211.07 L
74.346 217.928 L
76.808 223.475 L
79.269 225.683 L
81.731 227.707 L
84.192 229.347 L
86.654 231.449 L
89.115 231.999 L
91.577 230.973 L
94.038 230.825 L
96.5 231.919 L
98.962 232.27 L
101.423 233.32 L
103.885 234.386 L
106.346 233.264 L
108.808 231.203 L
111.269 230.138 L
113.731 229.886 L
116.192 229.321 L
118.654 226.37 L
121.115 223.293 L
123.577 220.376 L
126.038 217.494 L
128.5 212.971 L
130.962 210.494 L
133.423 205.124 L
135.885 198.684 L
138.346 189.193 L
140.808 175.355 L
143.269 160.184 L
145.731 146.773 L
148.192 139.022 L
150.654 137.001 L
153.115 138.712 L
155.577 141.488 L
158.038 144.861 L
160.5 150.195 L
162.962 155.068 L
165.423 161.064 L
167.885 167.092 L
170.346 170.484 L
172.808 175.976 L
175.269 181.709 L
177.731 184.937 L
180.192 185.373 L
182.654 184.209 L
185.115 183.636 L
187.577 181.772 L
190.038 180.026 L
192.5 181.219 L
194.962 182.816 L
197.423 185.26 L
199.885 186.975 L
202.346 188.167 L
204.808 189.349 L
207.269 190.312 L
209.731 191.269 L
212.192 192.385 L
214.654 193.627 L
217.115 195.794 L
219.577 196.692 L
222.038 198.711 L
224.5 201.512 L
226.962 201.584 L
229.423 201.428 L
231.885 200.742 L
234.346 201.654 L
236.808 204.831 L
239.269 205.768 L
241.731 206.705 L
244.192 207.608 L
246.654 207.333 L
249.115 207.145 L
251.577 206.484 L
254.038 205.268 L
256.5 205.247 L
258.962 205.395 L
261.423 206.126 L
263.885 208.458 L
266.346 210.699 L
268.808 212.488 L
271.269 214.92 L
273.731 217.534 L
276.192 217.9 L
278.654 217.419 L
281.115 215.348 L
283.577 213.161 L
286.038 208.874 L
288.5 200.736 L
290.962 188.009 L
293.423 173.04 L
295.885 153.351 L
298.346 131.182 L
300.808 107.428 L
303.269 83.889 L
305.731 64.902 L
308.192 50.757 L
310.654 45.221 L
313.115 45.08 L
315.577 48.548 L
318.038 56.688 L
320.5 68.242 L
322.962 80.986 L
325.423 94.508 L
327.885 111.609 L
330.346 125.443 L
332.808 137.483 L
335.269 149.125 L
337.731 160.356 L
340.192 171.295 L
342.654 182.385 L
345.115 191.448 L
347.577 199.716 L
350.038 203.519 L
352.5 207.653 L
354.962 212.26 L
357.423 215.158 L
359.885 216.153 L
362.346 215.322 L
364.808 215.292 L
367.269 214.292 L
369.731 211.797 L
372.192 208.395 L
374.654 206.252 L
377.115 205.341 L
379.577 204.562 L
382.038 201.736 L
384.5 195.988 L
384.538 195.873 L
S
GR
GS
[1.00046 0 0 1 0 0] CT
0.82 0.639 0.639 RC
1 LJ
0.5 LW
N
64.462 183.347 M
64.5 183.442 L
66.962 189.567 L
69.423 196.475 L
71.885 202.289 L
74.346 209.392 L
76.808 214.805 L
79.269 216.717 L
81.731 218.711 L
84.192 220.585 L
86.654 223.12 L
89.115 223.705 L
91.577 222.537 L
94.038 222.527 L
96.5 223.839 L
98.962 224.388 L
101.423 225.569 L
103.885 226.478 L
106.346 225.786 L
108.808 223.841 L
111.269 222.755 L
113.731 222.216 L
116.192 221.354 L
118.654 218.598 L
121.115 215.272 L
123.577 212.298 L
126.038 209.225 L
128.5 204.922 L
130.962 202.601 L
133.423 197.106 L
135.885 190.369 L
138.346 180.596 L
140.808 166.625 L
143.269 151.637 L
145.731 138.488 L
148.192 131.204 L
150.654 129.505 L
153.115 131.444 L
155.577 133.714 L
158.038 136.722 L
160.5 142.063 L
162.962 147.029 L
165.423 153.075 L
167.885 159.077 L
170.346 162.568 L
172.808 168.139 L
175.269 173.712 L
177.731 176.806 L
180.192 177.214 L
182.654 175.979 L
185.115 175.354 L
187.577 173.749 L
190.038 171.912 L
192.5 172.773 L
194.962 173.81 L
197.423 176.067 L
199.885 178.139 L
202.346 179.437 L
204.808 180.875 L
207.269 181.681 L
209.731 182.595 L
212.192 183.418 L
214.654 184.503 L
217.115 186.644 L
219.577 187.834 L
222.038 190.094 L
224.5 192.93 L
226.962 193.14 L
229.423 193.291 L
231.885 192.467 L
234.346 193.113 L
236.808 195.95 L
239.269 196.765 L
241.731 197.772 L
244.192 198.662 L
246.654 198.649 L
249.115 198.885 L
251.577 198.453 L
254.038 197.338 L
256.5 197.359 L
258.962 197.396 L
261.423 197.84 L
263.885 199.685 L
266.346 201.603 L
268.808 203.372 L
271.269 205.88 L
273.731 208.863 L
276.192 209.167 L
278.654 208.782 L
281.115 206.867 L
283.577 204.651 L
286.038 200.078 L
288.5 191.898 L
290.962 179.262 L
293.423 164.357 L
295.885 144.39 L
298.346 122.021 L
300.808 98.091 L
303.269 74.301 L
305.731 55.033 L
308.192 40.999 L
310.654 35.356 L
313.115 35.139 L
315.577 38.406 L
318.038 46.265 L
320.5 57.394 L
322.962 70.324 L
325.423 84.215 L
327.885 101.65 L
330.346 115.511 L
332.808 127.133 L
335.269 138.624 L
337.731 149.906 L
340.192 160.515 L
342.654 171.697 L
345.115 181.04 L
347.577 189.771 L
350.038 193.562 L
352.5 197.865 L
354.962 202.913 L
357.423 206.137 L
359.885 206.824 L
362.346 205.854 L
364.808 205.683 L
367.269 204.663 L
369.731 202.292 L
372.192 198.963 L
374.654 196.911 L
377.115 196.2 L
379.577 195.931 L
382.038 193.467 L
384.5 188.205 L
384.538 188.095 L
S
GR
GS
[1.00046 0 0 1 0 0] CT
0.6 0.2 0.2 RC
1 LJ
2 LW
N
64.462 187.697 M
64.5 187.791 L
66.962 194.063 L
69.423 200.986 L
71.885 206.68 L
74.346 213.66 L
76.808 219.14 L
79.269 221.2 L
81.731 223.209 L
84.192 224.965 L
86.654 227.285 L
89.115 227.852 L
91.577 226.755 L
94.038 226.677 L
96.5 227.879 L
98.962 228.329 L
101.423 229.444 L
103.885 230.432 L
106.346 229.525 L
108.808 227.522 L
111.269 226.447 L
113.731 226.051 L
116.192 225.337 L
118.654 222.485 L
121.115 219.282 L
123.577 216.337 L
126.038 213.36 L
128.5 208.946 L
130.962 206.547 L
133.423 201.115 L
135.885 194.526 L
138.346 184.895 L
140.808 170.99 L
143.269 155.91 L
145.731 142.631 L
148.192 135.113 L
150.654 133.253 L
153.115 135.078 L
155.577 137.601 L
158.038 140.792 L
160.5 146.129 L
162.962 151.048 L
165.423 157.07 L
167.885 163.085 L
170.346 166.526 L
172.808 172.057 L
175.269 177.711 L
177.731 180.871 L
180.192 181.294 L
182.654 180.094 L
185.115 179.495 L
187.577 177.761 L
190.038 175.969 L
192.5 176.995 L
194.962 178.313 L
197.423 180.663 L
199.885 182.557 L
202.346 183.802 L
204.808 185.112 L
207.269 185.996 L
209.731 186.932 L
212.192 187.902 L
214.654 189.065 L
217.115 191.219 L
219.577 192.263 L
222.038 194.403 L
224.5 197.221 L
226.962 197.362 L
229.423 197.36 L
231.885 196.604 L
234.346 197.383 L
236.808 200.39 L
239.269 201.267 L
241.731 202.238 L
244.192 203.135 L
246.654 202.991 L
249.115 203.015 L
251.577 202.469 L
254.038 201.303 L
256.5 201.303 L
258.962 201.396 L
261.423 201.983 L
263.885 204.071 L
266.346 206.151 L
268.808 207.931 L
271.269 210.4 L
273.731 213.198 L
276.192 213.533 L
278.654 213.1 L
281.115 211.108 L
283.577 208.906 L
286.038 204.475 L
288.5 196.316 L
290.962 183.636 L
293.423 168.698 L
295.885 148.87 L
298.346 126.602 L
300.808 102.759 L
303.269 79.095 L
305.731 59.967 L
308.192 45.878 L
310.654 40.288 L
313.115 40.11 L
315.577 43.478 L
318.038 51.477 L
320.5 62.818 L
322.962 75.655 L
325.423 89.361 L
327.885 106.63 L
330.346 120.477 L
332.808 132.307 L
335.269 143.875 L
337.731 155.131 L
340.192 165.904 L
342.654 177.041 L
345.115 186.243 L
347.577 194.743 L
350.038 198.541 L
352.5 202.759 L
354.962 207.587 L
357.423 210.647 L
359.885 211.489 L
362.346 210.588 L
364.808 210.488 L
367.269 209.478 L
369.731 207.044 L
372.192 203.679 L
374.654 201.582 L
377.115 200.77 L
379.577 200.246 L
382.038 197.601 L
384.5 192.096 L
384.538 191.984 L
S
GR
%%Trailer
%%Pages: 1
%%EOF
