%!PS-Adobe-3.0 EPSF-3.0
%%Creator: (MATLAB, The Mathworks, Inc. Version 9.10.0.1602886 \(R2021a\). Operating System: Mac OS X)
%%Title: /Users/kosciessa/Desktop/tardis/LNDG/stateswitch/stsw_eeg_task/tfr/figures/b01_alphaTraces_ya.eps
%%CreationDate: 2022-02-22T16:23:36
%%Pages: (atend)
%%BoundingBox:     2     0   388   266
%%LanguageLevel: 3
%%EndComments
%%BeginProlog
%%BeginResource: procset (Apache XML Graphics Std ProcSet) 1.2 0
%%Version: 1.2 0
%%Copyright: (Copyright 2001-2003,2010 The Apache Software Foundation. License terms: http://www.apache.org/licenses/LICENSE-2.0)
/bd{bind def}bind def
/ld{load def}bd
/GR/grestore ld
/GS/gsave ld
/RM/rmoveto ld
/C/curveto ld
/t/show ld
/L/lineto ld
/ML/setmiterlimit ld
/CT/concat ld
/f/fill ld
/N/newpath ld
/S/stroke ld
/CC/setcmykcolor ld
/A/ashow ld
/cp/closepath ld
/RC/setrgbcolor ld
/LJ/setlinejoin ld
/GC/setgray ld
/LW/setlinewidth ld
/M/moveto ld
/re {4 2 roll M
1 index 0 rlineto
0 exch rlineto
neg 0 rlineto
cp } bd
/_ctm matrix def
/_tm matrix def
/BT { _ctm currentmatrix pop matrix _tm copy pop 0 0 moveto } bd
/ET { _ctm setmatrix } bd
/iTm { _ctm setmatrix _tm concat } bd
/Tm { _tm astore pop iTm 0 0 moveto } bd
/ux 0.0 def
/uy 0.0 def
/F {
  /Tp exch def
  /Tf exch def
  Tf findfont Tp scalefont setfont
  /cf Tf def  /cs Tp def
} bd
/ULS {currentpoint /uy exch def /ux exch def} bd
/ULE {
  /Tcx currentpoint pop def
  gsave
  newpath
  cf findfont cs scalefont dup
  /FontMatrix get 0 get /Ts exch def /FontInfo get dup
  /UnderlinePosition get Ts mul /To exch def
  /UnderlineThickness get Ts mul /Tt exch def
  ux uy To add moveto  Tcx uy To add lineto
  Tt setlinewidth stroke
  grestore
} bd
/OLE {
  /Tcx currentpoint pop def
  gsave
  newpath
  cf findfont cs scalefont dup
  /FontMatrix get 0 get /Ts exch def /FontInfo get dup
  /UnderlinePosition get Ts mul /To exch def
  /UnderlineThickness get Ts mul /Tt exch def
  ux uy To add cs add moveto Tcx uy To add cs add lineto
  Tt setlinewidth stroke
  grestore
} bd
/SOE {
  /Tcx currentpoint pop def
  gsave
  newpath
  cf findfont cs scalefont dup
  /FontMatrix get 0 get /Ts exch def /FontInfo get dup
  /UnderlinePosition get Ts mul /To exch def
  /UnderlineThickness get Ts mul /Tt exch def
  ux uy To add cs 10 mul 26 idiv add moveto Tcx uy To add cs 10 mul 26 idiv add lineto
  Tt setlinewidth stroke
  grestore
} bd
/QT {
/Y22 exch store
/X22 exch store
/Y21 exch store
/X21 exch store
currentpoint
/Y21 load 2 mul add 3 div exch
/X21 load 2 mul add 3 div exch
/X21 load 2 mul /X22 load add 3 div
/Y21 load 2 mul /Y22 load add 3 div
/X22 load /Y22 load curveto
} bd
/SSPD {
dup length /d exch dict def
{
/v exch def
/k exch def
currentpagedevice k known {
/cpdv currentpagedevice k get def
v cpdv ne {
/upd false def
/nullv v type /nulltype eq def
/nullcpdv cpdv type /nulltype eq def
nullv nullcpdv or
{
/upd true def
} {
/sametype v type cpdv type eq def
sametype {
v type /arraytype eq {
/vlen v length def
/cpdvlen cpdv length def
vlen cpdvlen eq {
0 1 vlen 1 sub {
/i exch def
/obj v i get def
/cpdobj cpdv i get def
obj cpdobj ne {
/upd true def
exit
} if
} for
} {
/upd true def
} ifelse
} {
v type /dicttype eq {
v {
/dv exch def
/dk exch def
/cpddv cpdv dk get def
dv cpddv ne {
/upd true def
exit
} if
} forall
} {
/upd true def
} ifelse
} ifelse
} if
} ifelse
upd true eq {
d k v put
} if
} if
} if
} forall
d length 0 gt {
d setpagedevice
} if
} bd
/RE { % /NewFontName [NewEncodingArray] /FontName RE -
  findfont dup length dict begin
  {
    1 index /FID ne
    {def} {pop pop} ifelse
  } forall
  /Encoding exch def
  /FontName 1 index def
  currentdict definefont pop
  end
} bind def
%%EndResource
%%BeginResource: procset (Apache XML Graphics EPS ProcSet) 1.0 0
%%Version: 1.0 0
%%Copyright: (Copyright 2002-2003 The Apache Software Foundation. License terms: http://www.apache.org/licenses/LICENSE-2.0)
/BeginEPSF { %def
/b4_Inc_state save def         % Save state for cleanup
/dict_count countdictstack def % Count objects on dict stack
/op_count count 1 sub def      % Count objects on operand stack
userdict begin                 % Push userdict on dict stack
/showpage { } def              % Redefine showpage, { } = null proc
0 setgray 0 setlinecap         % Prepare graphics state
1 setlinewidth 0 setlinejoin
10 setmiterlimit [ ] 0 setdash newpath
/languagelevel where           % If level not equal to 1 then
{pop languagelevel             % set strokeadjust and
1 ne                           % overprint to their defaults.
{false setstrokeadjust false setoverprint
} if
} if
} bd
/EndEPSF { %def
count op_count sub {pop} repeat            % Clean up stacks
countdictstack dict_count sub {end} repeat
b4_Inc_state restore
} bd
%%EndResource
%FOPBeginFontDict
%%IncludeResource: font Courier-Oblique
%%IncludeResource: font Courier-BoldOblique
%%IncludeResource: font Courier-Bold
%%IncludeResource: font ZapfDingbats
%%IncludeResource: font Symbol
%%IncludeResource: font Helvetica
%%IncludeResource: font Helvetica-Oblique
%%IncludeResource: font Helvetica-Bold
%%IncludeResource: font Helvetica-BoldOblique
%%IncludeResource: font Times-Roman
%%IncludeResource: font Times-Italic
%%IncludeResource: font Times-Bold
%%IncludeResource: font Times-BoldItalic
%%IncludeResource: font Courier
%FOPEndFontDict
%%BeginResource: encoding WinAnsiEncoding
/WinAnsiEncoding [
/.notdef /.notdef /.notdef /.notdef /.notdef
/.notdef /.notdef /.notdef /.notdef /.notdef
/.notdef /.notdef /.notdef /.notdef /.notdef
/.notdef /.notdef /.notdef /.notdef /.notdef
/.notdef /.notdef /.notdef /.notdef /.notdef
/.notdef /.notdef /.notdef /.notdef /.notdef
/.notdef /.notdef /space /exclam /quotedbl
/numbersign /dollar /percent /ampersand /quotesingle
/parenleft /parenright /asterisk /plus /comma
/hyphen /period /slash /zero /one
/two /three /four /five /six
/seven /eight /nine /colon /semicolon
/less /equal /greater /question /at
/A /B /C /D /E
/F /G /H /I /J
/K /L /M /N /O
/P /Q /R /S /T
/U /V /W /X /Y
/Z /bracketleft /backslash /bracketright /asciicircum
/underscore /quoteleft /a /b /c
/d /e /f /g /h
/i /j /k /l /m
/n /o /p /q /r
/s /t /u /v /w
/x /y /z /braceleft /bar
/braceright /asciitilde /bullet /Euro /bullet
/quotesinglbase /florin /quotedblbase /ellipsis /dagger
/daggerdbl /circumflex /perthousand /Scaron /guilsinglleft
/OE /bullet /Zcaron /bullet /bullet
/quoteleft /quoteright /quotedblleft /quotedblright /bullet
/endash /emdash /asciitilde /trademark /scaron
/guilsinglright /oe /bullet /zcaron /Ydieresis
/space /exclamdown /cent /sterling /currency
/yen /brokenbar /section /dieresis /copyright
/ordfeminine /guillemotleft /logicalnot /sfthyphen /registered
/macron /degree /plusminus /twosuperior /threesuperior
/acute /mu /paragraph /middot /cedilla
/onesuperior /ordmasculine /guillemotright /onequarter /onehalf
/threequarters /questiondown /Agrave /Aacute /Acircumflex
/Atilde /Adieresis /Aring /AE /Ccedilla
/Egrave /Eacute /Ecircumflex /Edieresis /Igrave
/Iacute /Icircumflex /Idieresis /Eth /Ntilde
/Ograve /Oacute /Ocircumflex /Otilde /Odieresis
/multiply /Oslash /Ugrave /Uacute /Ucircumflex
/Udieresis /Yacute /Thorn /germandbls /agrave
/aacute /acircumflex /atilde /adieresis /aring
/ae /ccedilla /egrave /eacute /ecircumflex
/edieresis /igrave /iacute /icircumflex /idieresis
/eth /ntilde /ograve /oacute /ocircumflex
/otilde /odieresis /divide /oslash /ugrave
/uacute /ucircumflex /udieresis /yacute /thorn
/ydieresis
] def
%%EndResource
%FOPBeginFontReencode
/Courier-Oblique findfont
dup length dict begin
  {1 index /FID ne {def} {pop pop} ifelse} forall
  /Encoding WinAnsiEncoding def
  currentdict
end
/Courier-Oblique exch definefont pop
/Courier-BoldOblique findfont
dup length dict begin
  {1 index /FID ne {def} {pop pop} ifelse} forall
  /Encoding WinAnsiEncoding def
  currentdict
end
/Courier-BoldOblique exch definefont pop
/Courier-Bold findfont
dup length dict begin
  {1 index /FID ne {def} {pop pop} ifelse} forall
  /Encoding WinAnsiEncoding def
  currentdict
end
/Courier-Bold exch definefont pop
/Helvetica findfont
dup length dict begin
  {1 index /FID ne {def} {pop pop} ifelse} forall
  /Encoding WinAnsiEncoding def
  currentdict
end
/Helvetica exch definefont pop
/Helvetica-Oblique findfont
dup length dict begin
  {1 index /FID ne {def} {pop pop} ifelse} forall
  /Encoding WinAnsiEncoding def
  currentdict
end
/Helvetica-Oblique exch definefont pop
/Helvetica-Bold findfont
dup length dict begin
  {1 index /FID ne {def} {pop pop} ifelse} forall
  /Encoding WinAnsiEncoding def
  currentdict
end
/Helvetica-Bold exch definefont pop
/Helvetica-BoldOblique findfont
dup length dict begin
  {1 index /FID ne {def} {pop pop} ifelse} forall
  /Encoding WinAnsiEncoding def
  currentdict
end
/Helvetica-BoldOblique exch definefont pop
/Times-Roman findfont
dup length dict begin
  {1 index /FID ne {def} {pop pop} ifelse} forall
  /Encoding WinAnsiEncoding def
  currentdict
end
/Times-Roman exch definefont pop
/Times-Italic findfont
dup length dict begin
  {1 index /FID ne {def} {pop pop} ifelse} forall
  /Encoding WinAnsiEncoding def
  currentdict
end
/Times-Italic exch definefont pop
/Times-Bold findfont
dup length dict begin
  {1 index /FID ne {def} {pop pop} ifelse} forall
  /Encoding WinAnsiEncoding def
  currentdict
end
/Times-Bold exch definefont pop
/Times-BoldItalic findfont
dup length dict begin
  {1 index /FID ne {def} {pop pop} ifelse} forall
  /Encoding WinAnsiEncoding def
  currentdict
end
/Times-BoldItalic exch definefont pop
/Courier findfont
dup length dict begin
  {1 index /FID ne {def} {pop pop} ifelse} forall
  /Encoding WinAnsiEncoding def
  currentdict
end
/Courier exch definefont pop
%FOPEndFontReencode
%%EndProlog
%%Page: 1 1
%%PageBoundingBox: 0 0 425 283
%%BeginPageSetup
[1 0 0 -1 0 283] CT
%%EndPageSetup
GS
[1.00046 0 0 1 0 0] CT
1 GC
N
0 0 425 283 re
f
GR
GS
[1.00046 0 0 1 0 0] CT
1 GC
N
0 0 425 283 re
f
GR
GS
[1.00046 0 0 1 0 0] CT
1 GC
N
57.5 248.5 M
384.5 248.5 L
384.5 21 L
57.5 21 L
cp
f
GR
GS
[1.00046 0 0 1 0 0] CT
0.149 GC
2 setlinecap
1 LJ
0.5 LW
N
57.5 248.5 M
384.5 248.5 L
S
GR
GS
[1.00046 0 0 1 0 0] CT
0.149 GC
2 setlinecap
1 LJ
0.5 LW
N
82.654 248.5 M
82.654 245.234 L
S
GR
GS
[1.00046 0 0 1 0 0] CT
0.149 GC
2 setlinecap
1 LJ
0.5 LW
N
132.962 248.5 M
132.962 245.234 L
S
GR
GS
[1.00046 0 0 1 0 0] CT
0.149 GC
2 setlinecap
1 LJ
0.5 LW
N
183.269 248.5 M
183.269 245.234 L
S
GR
GS
[1.00046 0 0 1 0 0] CT
0.149 GC
2 setlinecap
1 LJ
0.5 LW
N
233.577 248.5 M
233.577 245.234 L
S
GR
GS
[1.00046 0 0 1 0 0] CT
0.149 GC
2 setlinecap
1 LJ
0.5 LW
N
283.885 248.5 M
283.885 245.234 L
S
GR
GS
[1.00046 0 0 1 0 0] CT
0.149 GC
2 setlinecap
1 LJ
0.5 LW
N
334.192 248.5 M
334.192 245.234 L
S
GR
GS
[1.00046 0 0 1 0 0] CT
0.149 GC
2 setlinecap
1 LJ
0.5 LW
N
384.5 248.5 M
384.5 245.234 L
S
GR
GS
[1.00046 0 0 1 82.69213 252.89999] CT
0.149 GC
/Helvetica 12 F
GS
[1 0 0 1 0 0] CT
-6 12 moveto 
1 -1 scale
(-1) t 
GR
GR
GS
[1.00046 0 0 1 133.02311 252.89999] CT
0.149 GC
/Helvetica 12 F
GS
[1 0 0 1 0 0] CT
-3.5 12 moveto 
1 -1 scale
(0) t 
GR
GR
GS
[1.00046 0 0 1 183.35411 252.89999] CT
0.149 GC
/Helvetica 12 F
GS
[1 0 0 1 0 0] CT
-3.5 12 moveto 
1 -1 scale
(1) t 
GR
GR
GS
[1.00046 0 0 1 233.6851 252.89999] CT
0.149 GC
/Helvetica 12 F
GS
[1 0 0 1 0 0] CT
-3.5 12 moveto 
1 -1 scale
(2) t 
GR
GR
GS
[1.00046 0 0 1 284.01609 252.89999] CT
0.149 GC
/Helvetica 12 F
GS
[1 0 0 1 0 0] CT
-3.5 12 moveto 
1 -1 scale
(3) t 
GR
GR
GS
[1.00046 0 0 1 334.3471 252.89999] CT
0.149 GC
/Helvetica 12 F
GS
[1 0 0 1 0 0] CT
-3.5 12 moveto 
1 -1 scale
(4) t 
GR
GR
GS
[1.00046 0 0 1 384.67808 252.89999] CT
0.149 GC
/Helvetica 12 F
GS
[1 0 0 1 0 0] CT
-3.5 12 moveto 
1 -1 scale
(5) t 
GR
GR
GS
[1.00046 0 0 1 221.10251 268.50003] CT
0.149 GC
/Helvetica 12 F
GS
[1 0 0 1 0 0] CT
-21 12 moveto 
1 -1 scale
(Time \(s\)) t 
GR
GR
GS
[1.00046 0 0 1 0 0] CT
0.149 GC
2 setlinecap
1 LJ
0.5 LW
N
57.5 248.5 M
57.5 21 L
S
GR
GS
[1.00046 0 0 1 0 0] CT
0.149 GC
2 setlinecap
1 LJ
0.5 LW
N
57.5 248.5 M
60.766 248.5 L
S
GR
GS
[1.00046 0 0 1 0 0] CT
0.149 GC
2 setlinecap
1 LJ
0.5 LW
N
57.5 203 M
60.766 203 L
S
GR
GS
[1.00046 0 0 1 0 0] CT
0.149 GC
2 setlinecap
1 LJ
0.5 LW
N
57.5 157.5 M
60.766 157.5 L
S
GR
GS
[1.00046 0 0 1 0 0] CT
0.149 GC
2 setlinecap
1 LJ
0.5 LW
N
57.5 112 M
60.766 112 L
S
GR
GS
[1.00046 0 0 1 0 0] CT
0.149 GC
2 setlinecap
1 LJ
0.5 LW
N
57.5 66.5 M
60.766 66.5 L
S
GR
GS
[1.00046 0 0 1 0 0] CT
0.149 GC
2 setlinecap
1 LJ
0.5 LW
N
57.5 21 M
60.766 21 L
S
GR
GS
[1.00046 0 0 1 53.12459 248.50002] CT
0.149 GC
/Helvetica 12 F
GS
[1 0 0 1 0 0] CT
-22 4.5 moveto 
1 -1 scale
(-5.4) t 
GR
GR
GS
[1.00046 0 0 1 53.12459 202.99995] CT
0.149 GC
/Helvetica 12 F
GS
[1 0 0 1 0 0] CT
-22 4.5 moveto 
1 -1 scale
(-5.2) t 
GR
GR
GS
[1.00046 0 0 1 53.12459 157.5] CT
0.149 GC
/Helvetica 12 F
GS
[1 0 0 1 0 0] CT
-12 4.5 moveto 
1 -1 scale
(-5) t 
GR
GR
GS
[1.00046 0 0 1 53.12459 112.00005] CT
0.149 GC
/Helvetica 12 F
GS
[1 0 0 1 0 0] CT
-22 4.5 moveto 
1 -1 scale
(-4.8) t 
GR
GR
GS
[1.00046 0 0 1 53.12459 66.49998] CT
0.149 GC
/Helvetica 12 F
GS
[1 0 0 1 0 0] CT
-22 4.5 moveto 
1 -1 scale
(-4.6) t 
GR
GR
GS
[1.00046 0 0 1 53.12459 21.00002] CT
0.149 GC
/Helvetica 12 F
GS
[1 0 0 1 0 0] CT
-22 4.5 moveto 
1 -1 scale
(-4.4) t 
GR
GR
GS
[0 -1 1.00046 0 29.01343 134.74991] CT
0.149 GC
/Helvetica 12 F
GS
[1 0 0 1 0 0] CT
-57 -18 moveto 
1 -1 scale
(8-12 Hz Alpha Power) t 
GR
GR
GS
[0 -1 1.00046 0 29.01343 134.74991] CT
0.149 GC
/Helvetica 12 F
GS
[1 0 0 1 0 0] CT
-46 -3 moveto 
1 -1 scale
(\(a.u.; normalized\)) t 
GR
GR
GS
[1.00046 0 0 1 0 0] CT
0.996 0.98 0.98 RC
N
170.692 198 M
173.208 198.867 L
175.723 199.321 L
178.238 199.181 L
180.754 198.519 L
183.269 198.287 L
185.785 198.105 L
188.3 198.205 L
190.815 198.907 L
193.331 199.538 L
195.846 199.872 L
198.362 199.977 L
200.877 199.293 L
203.392 198.509 L
205.908 198.266 L
208.423 197.498 L
210.938 196.815 L
213.454 196.193 L
215.969 195.567 L
218.485 195.067 L
221 194.871 L
223.515 194.826 L
226.031 194.123 L
228.546 193.587 L
231.062 193.059 L
233.577 193.216 L
236.092 193.105 L
238.608 193.017 L
241.123 193.183 L
243.638 193.964 L
246.154 194.531 L
248.669 194.513 L
251.185 194.091 L
253.7 193.199 L
256.215 192.297 L
258.731 191.272 L
261.246 190.652 L
263.762 191.036 L
266.277 190.869 L
268.792 190.555 L
271.308 190.802 L
273.823 191.314 L
276.338 191.157 L
278.854 190.553 L
281.369 189.832 L
283.885 189.158 L
286.4 188.826 L
288.915 188.252 L
291.431 186.639 L
293.946 186.052 L
296.462 187.382 L
298.977 190.209 L
301.492 193.189 L
304.008 195.196 L
306.523 194.933 L
309.038 191.972 L
311.554 186.296 L
314.069 178.746 L
316.585 170.023 L
319.1 159.399 L
321.615 147.044 L
324.131 133.328 L
326.646 119.703 L
329.162 106.953 L
331.677 95.911 L
334.192 86.794 L
336.708 80.537 L
339.223 76.741 L
341.738 74.661 L
344.254 73.335 L
346.769 72.384 L
349.285 71.599 L
351.8 70.834 L
354.315 69.587 L
356.831 68.227 L
359.346 66.896 L
361.862 65.63 L
364.377 64.406 L
366.892 63.753 L
369.408 63.134 L
371.923 62.676 L
374.438 62.639 L
376.954 62.609 L
379.469 61.849 L
381.985 61.142 L
384.5 60.399 L
384.539 60.384 L
384.539 55.411 L
384.539 55.335 L
384.5 55.347 L
381.985 55.945 L
379.469 56.765 L
376.954 57.535 L
374.438 57.44 L
371.923 57.336 L
369.408 57.579 L
366.892 57.911 L
364.377 58.205 L
361.862 58.986 L
359.346 59.938 L
356.831 61.13 L
354.315 62.466 L
351.8 63.8 L
349.285 64.705 L
346.769 65.797 L
344.254 67.093 L
341.738 68.662 L
339.223 70.923 L
336.708 74.963 L
334.192 81.243 L
331.677 90.262 L
329.162 101.085 L
326.646 113.782 L
324.131 127.626 L
321.615 141.481 L
319.1 153.819 L
316.585 164.414 L
314.069 173.344 L
311.554 181.249 L
309.038 187.328 L
306.523 190.667 L
304.008 191.213 L
301.492 189.289 L
298.977 186.277 L
296.462 183.315 L
293.946 181.926 L
291.431 182.501 L
288.915 184.008 L
286.4 184.543 L
283.885 184.836 L
281.369 185.452 L
278.854 186.154 L
276.338 186.681 L
273.823 186.721 L
271.308 186.055 L
268.792 185.781 L
266.277 186.203 L
263.762 186.518 L
261.246 186.304 L
258.731 187.108 L
256.215 188.296 L
253.7 189.232 L
251.185 189.985 L
248.669 190.286 L
246.154 190.304 L
243.638 189.732 L
241.123 188.867 L
238.608 188.791 L
236.092 189.101 L
233.577 189.343 L
231.062 189.356 L
228.546 189.944 L
226.031 190.549 L
223.515 191.313 L
221 191.333 L
218.485 191.446 L
215.969 191.881 L
213.454 192.503 L
210.938 193.174 L
208.423 193.939 L
205.908 194.802 L
203.392 195.154 L
200.877 195.756 L
198.362 196.284 L
195.846 196.231 L
193.331 196.09 L
190.815 195.701 L
188.3 195.08 L
185.785 194.985 L
183.269 195.182 L
180.754 195.352 L
178.238 195.945 L
175.723 196.134 L
173.208 195.915 L
170.692 195.341 L
168.177 194.872 L
165.662 194.433 L
163.146 193.478 L
160.631 190.903 L
158.115 186.515 L
155.6 180.02 L
153.085 170.012 L
150.569 155.355 L
148.054 134.933 L
145.538 111.224 L
143.023 89.169 L
140.508 73.885 L
137.992 67.206 L
135.477 66.699 L
132.962 67.886 L
130.446 68.359 L
127.931 67.837 L
125.415 66.654 L
122.9 64.904 L
120.385 63.033 L
117.869 61.852 L
115.354 61.125 L
112.838 61.193 L
110.323 61.361 L
107.808 61.435 L
105.292 61.439 L
102.777 61.49 L
100.262 61.211 L
97.746 62.082 L
95.231 63.146 L
92.715 64.61 L
90.2 65.956 L
87.685 67.064 L
85.169 68.807 L
82.654 71.095 L
80.138 73.558 L
77.623 75.868 L
75.108 79.229 L
72.592 83.488 L
70.077 88.6 L
67.562 93.386 L
65.046 97.738 L
62.531 102.606 L
60.015 107.504 L
57.5 110.998 L
57.461 111.038 L
57.461 115.6 L
57.461 115.671 L
57.5 115.632 L
60.015 112.231 L
62.531 107.451 L
65.046 102.596 L
67.562 98.291 L
70.077 93.527 L
72.592 88.466 L
75.108 84.183 L
77.623 80.751 L
80.138 78.377 L
82.654 75.823 L
85.169 73.466 L
87.685 71.624 L
90.2 70.337 L
92.715 68.854 L
95.231 67.389 L
97.746 66.209 L
100.262 65.347 L
102.777 65.633 L
105.292 65.585 L
107.808 65.621 L
110.323 65.7 L
112.838 65.59 L
115.354 65.58 L
117.869 66.232 L
120.385 67.259 L
122.9 69.008 L
125.415 70.695 L
127.931 71.816 L
130.446 72.31 L
132.962 71.734 L
135.477 70.298 L
137.992 70.554 L
140.508 77.009 L
143.023 91.968 L
145.538 113.756 L
148.054 137.253 L
150.569 157.699 L
153.085 172.499 L
155.6 182.701 L
158.115 189.325 L
160.631 193.805 L
163.146 196.341 L
165.662 197.167 L
168.177 197.478 L
cp
f
GR
GS
[1.00046 0 0 1 0 0] CT
0.98 0.91 0.91 RC
1 LJ
0.5 LW
N
57.461 115.671 M
57.5 115.632 L
60.015 112.231 L
62.531 107.451 L
65.046 102.596 L
67.562 98.291 L
70.077 93.527 L
72.592 88.466 L
75.108 84.183 L
77.623 80.751 L
80.138 78.377 L
82.654 75.823 L
85.169 73.466 L
87.685 71.624 L
90.2 70.337 L
92.715 68.854 L
95.231 67.389 L
97.746 66.209 L
100.262 65.347 L
102.777 65.633 L
105.292 65.585 L
107.808 65.621 L
110.323 65.7 L
112.838 65.59 L
115.354 65.58 L
117.869 66.232 L
120.385 67.259 L
122.9 69.008 L
125.415 70.695 L
127.931 71.816 L
130.446 72.31 L
132.962 71.734 L
135.477 70.298 L
137.992 70.554 L
140.508 77.009 L
143.023 91.968 L
145.538 113.756 L
148.054 137.253 L
150.569 157.699 L
153.085 172.499 L
155.6 182.701 L
158.115 189.325 L
160.631 193.805 L
163.146 196.341 L
165.662 197.167 L
168.177 197.478 L
170.692 198 L
173.208 198.867 L
175.723 199.321 L
178.238 199.181 L
180.754 198.519 L
183.269 198.287 L
185.785 198.105 L
188.3 198.205 L
190.815 198.907 L
193.331 199.538 L
195.846 199.872 L
198.362 199.977 L
200.877 199.293 L
203.392 198.509 L
205.908 198.266 L
208.423 197.498 L
210.938 196.815 L
213.454 196.193 L
215.969 195.567 L
218.485 195.067 L
221 194.871 L
223.515 194.826 L
226.031 194.123 L
228.546 193.587 L
231.062 193.059 L
233.577 193.216 L
236.092 193.105 L
238.608 193.017 L
241.123 193.183 L
243.638 193.964 L
246.154 194.531 L
248.669 194.513 L
251.185 194.091 L
253.7 193.199 L
256.215 192.297 L
258.731 191.272 L
261.246 190.652 L
263.762 191.036 L
266.277 190.869 L
268.792 190.555 L
271.308 190.802 L
273.823 191.314 L
276.338 191.157 L
278.854 190.553 L
281.369 189.832 L
283.885 189.158 L
286.4 188.826 L
288.915 188.252 L
291.431 186.639 L
293.946 186.052 L
296.462 187.382 L
298.977 190.209 L
301.492 193.189 L
304.008 195.196 L
306.523 194.933 L
309.038 191.972 L
311.554 186.296 L
314.069 178.746 L
316.585 170.023 L
319.1 159.399 L
321.615 147.044 L
324.131 133.328 L
326.646 119.703 L
329.162 106.953 L
331.677 95.911 L
334.192 86.794 L
336.708 80.537 L
339.223 76.741 L
341.738 74.661 L
344.254 73.335 L
346.769 72.384 L
349.285 71.599 L
351.8 70.834 L
354.315 69.587 L
356.831 68.227 L
359.346 66.896 L
361.862 65.63 L
364.377 64.406 L
366.892 63.753 L
369.408 63.134 L
371.923 62.676 L
374.438 62.639 L
376.954 62.609 L
379.469 61.849 L
381.985 61.142 L
384.5 60.399 L
384.539 60.384 L
S
GR
GS
[1.00046 0 0 1 0 0] CT
0.98 0.91 0.91 RC
1 LJ
0.5 LW
N
57.461 111.038 M
57.5 110.998 L
60.015 107.504 L
62.531 102.606 L
65.046 97.738 L
67.562 93.386 L
70.077 88.6 L
72.592 83.488 L
75.108 79.229 L
77.623 75.868 L
80.138 73.558 L
82.654 71.095 L
85.169 68.807 L
87.685 67.064 L
90.2 65.956 L
92.715 64.61 L
95.231 63.146 L
97.746 62.082 L
100.262 61.211 L
102.777 61.49 L
105.292 61.439 L
107.808 61.435 L
110.323 61.361 L
112.838 61.193 L
115.354 61.125 L
117.869 61.852 L
120.385 63.033 L
122.9 64.904 L
125.415 66.654 L
127.931 67.837 L
130.446 68.359 L
132.962 67.886 L
135.477 66.699 L
137.992 67.206 L
140.508 73.885 L
143.023 89.169 L
145.538 111.224 L
148.054 134.933 L
150.569 155.355 L
153.085 170.012 L
155.6 180.02 L
158.115 186.515 L
160.631 190.903 L
163.146 193.478 L
165.662 194.433 L
168.177 194.872 L
170.692 195.341 L
173.208 195.915 L
175.723 196.134 L
178.238 195.945 L
180.754 195.352 L
183.269 195.182 L
185.785 194.985 L
188.3 195.08 L
190.815 195.701 L
193.331 196.09 L
195.846 196.231 L
198.362 196.284 L
200.877 195.756 L
203.392 195.154 L
205.908 194.802 L
208.423 193.939 L
210.938 193.174 L
213.454 192.503 L
215.969 191.881 L
218.485 191.446 L
221 191.333 L
223.515 191.313 L
226.031 190.549 L
228.546 189.944 L
231.062 189.356 L
233.577 189.343 L
236.092 189.101 L
238.608 188.791 L
241.123 188.867 L
243.638 189.732 L
246.154 190.304 L
248.669 190.286 L
251.185 189.985 L
253.7 189.232 L
256.215 188.296 L
258.731 187.108 L
261.246 186.304 L
263.762 186.518 L
266.277 186.203 L
268.792 185.781 L
271.308 186.055 L
273.823 186.721 L
276.338 186.681 L
278.854 186.154 L
281.369 185.452 L
283.885 184.836 L
286.4 184.543 L
288.915 184.008 L
291.431 182.501 L
293.946 181.926 L
296.462 183.315 L
298.977 186.277 L
301.492 189.289 L
304.008 191.213 L
306.523 190.667 L
309.038 187.328 L
311.554 181.249 L
314.069 173.344 L
316.585 164.414 L
319.1 153.819 L
321.615 141.481 L
324.131 127.626 L
326.646 113.782 L
329.162 101.085 L
331.677 90.262 L
334.192 81.243 L
336.708 74.963 L
339.223 70.923 L
341.738 68.662 L
344.254 67.093 L
346.769 65.797 L
349.285 64.705 L
351.8 63.8 L
354.315 62.466 L
356.831 61.13 L
359.346 59.938 L
361.862 58.986 L
364.377 58.205 L
366.892 57.911 L
369.408 57.579 L
371.923 57.336 L
374.438 57.44 L
376.954 57.535 L
379.469 56.765 L
381.985 55.945 L
384.5 55.347 L
384.539 55.335 L
S
GR
GS
[1.00046 0 0 1 0 0] CT
0.961 0.8 0.8 RC
1 LJ
2 LW
N
57.461 113.355 M
57.5 113.315 L
60.015 109.868 L
62.531 105.029 L
65.046 100.167 L
67.562 95.838 L
70.077 91.064 L
72.592 85.977 L
75.108 81.706 L
77.623 78.309 L
80.138 75.968 L
82.654 73.459 L
85.169 71.136 L
87.685 69.344 L
90.2 68.146 L
92.715 66.732 L
95.231 65.268 L
97.746 64.145 L
100.262 63.279 L
102.777 63.561 L
105.292 63.512 L
107.808 63.528 L
110.323 63.53 L
112.838 63.391 L
115.354 63.352 L
117.869 64.042 L
120.385 65.146 L
122.9 66.956 L
125.415 68.675 L
127.931 69.827 L
130.446 70.335 L
132.962 69.81 L
135.477 68.498 L
137.992 68.88 L
140.508 75.447 L
143.023 90.569 L
145.538 112.49 L
148.054 136.093 L
150.569 156.527 L
153.085 171.255 L
155.6 181.36 L
158.115 187.92 L
160.631 192.354 L
163.146 194.91 L
165.662 195.8 L
168.177 196.175 L
170.692 196.671 L
173.208 197.391 L
175.723 197.727 L
178.238 197.563 L
180.754 196.935 L
183.269 196.735 L
185.785 196.545 L
188.3 196.643 L
190.815 197.304 L
193.331 197.814 L
195.846 198.052 L
198.362 198.13 L
200.877 197.525 L
203.392 196.831 L
205.908 196.534 L
208.423 195.718 L
210.938 194.994 L
213.454 194.348 L
215.969 193.724 L
218.485 193.257 L
221 193.102 L
223.515 193.069 L
226.031 192.336 L
228.546 191.766 L
231.062 191.208 L
233.577 191.28 L
236.092 191.103 L
238.608 190.904 L
241.123 191.025 L
243.638 191.848 L
246.154 192.418 L
248.669 192.399 L
251.185 192.038 L
253.7 191.216 L
256.215 190.297 L
258.731 189.19 L
261.246 188.478 L
263.762 188.777 L
266.277 188.536 L
268.792 188.168 L
271.308 188.429 L
273.823 189.018 L
276.338 188.919 L
278.854 188.353 L
281.369 187.642 L
283.885 186.997 L
286.4 186.685 L
288.915 186.13 L
291.431 184.57 L
293.946 183.989 L
296.462 185.348 L
298.977 188.243 L
301.492 191.239 L
304.008 193.205 L
306.523 192.8 L
309.038 189.65 L
311.554 183.772 L
314.069 176.045 L
316.585 167.218 L
319.1 156.609 L
321.615 144.262 L
324.131 130.477 L
326.646 116.742 L
329.162 104.019 L
331.677 93.087 L
334.192 84.018 L
336.708 77.75 L
339.223 73.832 L
341.738 71.662 L
344.254 70.214 L
346.769 69.09 L
349.285 68.152 L
351.8 67.317 L
354.315 66.026 L
356.831 64.679 L
359.346 63.417 L
361.862 62.308 L
364.377 61.306 L
366.892 60.832 L
369.408 60.357 L
371.923 60.006 L
374.438 60.04 L
376.954 60.072 L
379.469 59.307 L
381.985 58.543 L
384.5 57.873 L
384.539 57.86 L
S
GR
GS
[1.00046 0 0 1 0 0] CT
0.99 0.959 0.959 RC
N
170.692 200.34 M
173.208 201.029 L
175.723 201.637 L
178.238 201.59 L
180.754 201.921 L
183.269 202.338 L
185.785 203.016 L
188.3 203.977 L
190.815 204.752 L
193.331 205.067 L
195.846 204.999 L
198.362 205.481 L
200.877 206.082 L
203.392 206.681 L
205.908 207.316 L
208.423 207.97 L
210.938 208.505 L
213.454 208.923 L
215.969 208.781 L
218.485 207.82 L
221 206.925 L
223.515 205.922 L
226.031 205.383 L
228.546 204.865 L
231.062 204.94 L
233.577 205.39 L
236.092 205.704 L
238.608 205.328 L
241.123 204.664 L
243.638 204.225 L
246.154 204.66 L
248.669 205.271 L
251.185 205.442 L
253.7 205.789 L
256.215 205.945 L
258.731 205.892 L
261.246 205.697 L
263.762 205.156 L
266.277 204.631 L
268.792 204.366 L
271.308 204.462 L
273.823 204.049 L
276.338 203.583 L
278.854 202.915 L
281.369 202.334 L
283.885 201.892 L
286.4 201.029 L
288.915 199.452 L
291.431 197.486 L
293.946 195.998 L
296.462 196.808 L
298.977 200.034 L
301.492 205.206 L
304.008 209.993 L
306.523 213.908 L
309.038 216.426 L
311.554 216.36 L
314.069 212.953 L
316.585 206.007 L
319.1 195.07 L
321.615 181.894 L
324.131 168.095 L
326.646 154.321 L
329.162 141.426 L
331.677 129.538 L
334.192 117.915 L
336.708 106.708 L
339.223 96.653 L
341.738 88.578 L
344.254 81.818 L
346.769 76.299 L
349.285 71.874 L
351.8 68.44 L
354.315 65.512 L
356.831 63.047 L
359.346 61.083 L
361.862 58.981 L
364.377 56.888 L
366.892 54.854 L
369.408 54.011 L
371.923 53.592 L
374.438 53.11 L
376.954 52.491 L
379.469 52.364 L
381.985 52.156 L
384.5 51.381 L
384.539 51.363 L
384.539 49.086 L
384.539 49.051 L
384.5 49.068 L
381.985 49.642 L
379.469 49.566 L
376.954 49.473 L
374.438 50.041 L
371.923 50.59 L
369.408 51.117 L
366.892 52 L
364.377 54.001 L
361.862 56.089 L
359.346 58.258 L
356.831 60.214 L
354.315 62.55 L
351.8 65.399 L
349.285 68.764 L
346.769 73.115 L
344.254 78.701 L
341.738 85.574 L
339.223 93.768 L
336.708 103.965 L
334.192 115.524 L
331.677 127.448 L
329.162 139.412 L
326.646 152.224 L
324.131 165.968 L
321.615 179.954 L
319.1 193.128 L
316.585 204.075 L
314.069 211.072 L
311.554 214.313 L
309.038 214.269 L
306.523 211.725 L
304.008 207.868 L
301.492 202.968 L
298.977 197.575 L
296.462 194.116 L
293.946 193.263 L
291.431 194.68 L
288.915 196.513 L
286.4 198.046 L
283.885 198.863 L
281.369 199.358 L
278.854 199.852 L
276.338 200.411 L
273.823 201.056 L
271.308 201.62 L
268.792 201.617 L
266.277 201.825 L
263.762 202.317 L
261.246 202.932 L
258.731 203.462 L
256.215 203.836 L
253.7 203.669 L
251.185 203.272 L
248.669 203.096 L
246.154 202.525 L
243.638 202.066 L
241.123 202.32 L
238.608 202.704 L
236.092 202.976 L
233.577 202.7 L
231.062 202.34 L
228.546 202.386 L
226.031 202.989 L
223.515 203.487 L
221 204.432 L
218.485 205.292 L
215.969 206.396 L
213.454 206.67 L
210.938 206.373 L
208.423 205.78 L
205.908 204.986 L
203.392 204.269 L
200.877 203.566 L
198.362 202.986 L
195.846 202.598 L
193.331 202.854 L
190.815 202.619 L
188.3 201.935 L
185.785 200.982 L
183.269 200.297 L
180.754 199.85 L
178.238 199.4 L
175.723 199.348 L
173.208 198.794 L
170.692 198.182 L
168.177 198.21 L
165.662 197.671 L
163.146 195.938 L
160.631 193.05 L
158.115 188.279 L
155.6 180.642 L
153.085 170.186 L
150.569 155.741 L
148.054 136.801 L
145.538 113.401 L
143.023 89.464 L
140.508 72.22 L
137.992 64.082 L
135.477 62.157 L
132.962 62.607 L
130.446 62.473 L
127.931 61.624 L
125.415 60.951 L
122.9 60.569 L
120.385 60.195 L
117.869 59.416 L
115.354 58.558 L
112.838 58.404 L
110.323 58.889 L
107.808 59.394 L
105.292 60.111 L
102.777 60.658 L
100.262 61.367 L
97.746 61.911 L
95.231 62.459 L
92.715 63.088 L
90.2 64.032 L
87.685 65.258 L
85.169 66.849 L
82.654 68.601 L
80.138 70.411 L
77.623 73.208 L
75.108 76.947 L
72.592 81.773 L
70.077 87.639 L
67.562 93.92 L
65.046 100.096 L
62.531 106.339 L
60.015 112.589 L
57.5 118.621 L
57.461 118.706 L
57.461 121.94 L
57.461 121.989 L
57.5 121.905 L
60.015 115.987 L
62.531 109.9 L
65.046 103.865 L
67.562 97.625 L
70.077 90.964 L
72.592 84.848 L
75.108 79.847 L
77.623 75.98 L
80.138 73.181 L
82.654 71.434 L
85.169 69.766 L
87.685 68.17 L
90.2 66.925 L
92.715 65.964 L
95.231 65.367 L
97.746 64.828 L
100.262 64.359 L
102.777 63.724 L
105.292 63.203 L
107.808 62.49 L
110.323 62.056 L
112.838 61.568 L
115.354 61.64 L
117.869 62.483 L
120.385 63.395 L
122.9 63.873 L
125.415 64.391 L
127.931 65.06 L
130.446 65.785 L
132.962 65.726 L
135.477 65.082 L
137.992 66.745 L
140.508 74.643 L
143.023 91.693 L
145.538 115.385 L
148.054 138.765 L
150.569 157.973 L
153.085 172.602 L
155.6 183.16 L
158.115 190.862 L
160.631 195.825 L
163.146 198.615 L
165.662 200.18 L
168.177 200.559 L
cp
f
GR
GS
[1.00046 0 0 1 0 0] CT
0.957 0.82 0.82 RC
1 LJ
0.5 LW
N
57.461 121.989 M
57.5 121.905 L
60.015 115.987 L
62.531 109.9 L
65.046 103.865 L
67.562 97.625 L
70.077 90.964 L
72.592 84.848 L
75.108 79.847 L
77.623 75.98 L
80.138 73.181 L
82.654 71.434 L
85.169 69.766 L
87.685 68.17 L
90.2 66.925 L
92.715 65.964 L
95.231 65.367 L
97.746 64.828 L
100.262 64.359 L
102.777 63.724 L
105.292 63.203 L
107.808 62.49 L
110.323 62.056 L
112.838 61.568 L
115.354 61.64 L
117.869 62.483 L
120.385 63.395 L
122.9 63.873 L
125.415 64.391 L
127.931 65.06 L
130.446 65.785 L
132.962 65.726 L
135.477 65.082 L
137.992 66.745 L
140.508 74.643 L
143.023 91.693 L
145.538 115.385 L
148.054 138.765 L
150.569 157.973 L
153.085 172.602 L
155.6 183.16 L
158.115 190.862 L
160.631 195.825 L
163.146 198.615 L
165.662 200.18 L
168.177 200.559 L
170.692 200.34 L
173.208 201.029 L
175.723 201.637 L
178.238 201.59 L
180.754 201.921 L
183.269 202.338 L
185.785 203.016 L
188.3 203.977 L
190.815 204.752 L
193.331 205.067 L
195.846 204.999 L
198.362 205.481 L
200.877 206.082 L
203.392 206.681 L
205.908 207.316 L
208.423 207.97 L
210.938 208.505 L
213.454 208.923 L
215.969 208.781 L
218.485 207.82 L
221 206.925 L
223.515 205.922 L
226.031 205.383 L
228.546 204.865 L
231.062 204.94 L
233.577 205.39 L
236.092 205.704 L
238.608 205.328 L
241.123 204.664 L
243.638 204.225 L
246.154 204.66 L
248.669 205.271 L
251.185 205.442 L
253.7 205.789 L
256.215 205.945 L
258.731 205.892 L
261.246 205.697 L
263.762 205.156 L
266.277 204.631 L
268.792 204.366 L
271.308 204.462 L
273.823 204.049 L
276.338 203.583 L
278.854 202.915 L
281.369 202.334 L
283.885 201.892 L
286.4 201.029 L
288.915 199.452 L
291.431 197.486 L
293.946 195.998 L
296.462 196.808 L
298.977 200.034 L
301.492 205.206 L
304.008 209.993 L
306.523 213.908 L
309.038 216.426 L
311.554 216.36 L
314.069 212.953 L
316.585 206.007 L
319.1 195.07 L
321.615 181.894 L
324.131 168.095 L
326.646 154.321 L
329.162 141.426 L
331.677 129.538 L
334.192 117.915 L
336.708 106.708 L
339.223 96.653 L
341.738 88.578 L
344.254 81.818 L
346.769 76.299 L
349.285 71.874 L
351.8 68.44 L
354.315 65.512 L
356.831 63.047 L
359.346 61.083 L
361.862 58.981 L
364.377 56.888 L
366.892 54.854 L
369.408 54.011 L
371.923 53.592 L
374.438 53.11 L
376.954 52.491 L
379.469 52.364 L
381.985 52.156 L
384.5 51.381 L
384.539 51.363 L
S
GR
GS
[1.00046 0 0 1 0 0] CT
0.957 0.82 0.82 RC
1 LJ
0.5 LW
N
57.461 118.706 M
57.5 118.621 L
60.015 112.589 L
62.531 106.339 L
65.046 100.096 L
67.562 93.92 L
70.077 87.639 L
72.592 81.773 L
75.108 76.947 L
77.623 73.208 L
80.138 70.411 L
82.654 68.601 L
85.169 66.849 L
87.685 65.258 L
90.2 64.032 L
92.715 63.088 L
95.231 62.459 L
97.746 61.911 L
100.262 61.367 L
102.777 60.658 L
105.292 60.111 L
107.808 59.394 L
110.323 58.889 L
112.838 58.404 L
115.354 58.558 L
117.869 59.416 L
120.385 60.195 L
122.9 60.569 L
125.415 60.951 L
127.931 61.624 L
130.446 62.473 L
132.962 62.607 L
135.477 62.157 L
137.992 64.082 L
140.508 72.22 L
143.023 89.464 L
145.538 113.401 L
148.054 136.801 L
150.569 155.741 L
153.085 170.186 L
155.6 180.642 L
158.115 188.279 L
160.631 193.05 L
163.146 195.938 L
165.662 197.671 L
168.177 198.21 L
170.692 198.182 L
173.208 198.794 L
175.723 199.348 L
178.238 199.4 L
180.754 199.85 L
183.269 200.297 L
185.785 200.982 L
188.3 201.935 L
190.815 202.619 L
193.331 202.854 L
195.846 202.598 L
198.362 202.986 L
200.877 203.566 L
203.392 204.269 L
205.908 204.986 L
208.423 205.78 L
210.938 206.373 L
213.454 206.67 L
215.969 206.396 L
218.485 205.292 L
221 204.432 L
223.515 203.487 L
226.031 202.989 L
228.546 202.386 L
231.062 202.34 L
233.577 202.7 L
236.092 202.976 L
238.608 202.704 L
241.123 202.32 L
243.638 202.066 L
246.154 202.525 L
248.669 203.096 L
251.185 203.272 L
253.7 203.669 L
256.215 203.836 L
258.731 203.462 L
261.246 202.932 L
263.762 202.317 L
266.277 201.825 L
268.792 201.617 L
271.308 201.62 L
273.823 201.056 L
276.338 200.411 L
278.854 199.852 L
281.369 199.358 L
283.885 198.863 L
286.4 198.046 L
288.915 196.513 L
291.431 194.68 L
293.946 193.263 L
296.462 194.116 L
298.977 197.575 L
301.492 202.968 L
304.008 207.868 L
306.523 211.725 L
309.038 214.269 L
311.554 214.313 L
314.069 211.072 L
316.585 204.075 L
319.1 193.128 L
321.615 179.954 L
324.131 165.968 L
326.646 152.224 L
329.162 139.412 L
331.677 127.448 L
334.192 115.524 L
336.708 103.965 L
339.223 93.768 L
341.738 85.574 L
344.254 78.701 L
346.769 73.115 L
349.285 68.764 L
351.8 65.399 L
354.315 62.55 L
356.831 60.214 L
359.346 58.258 L
361.862 56.089 L
364.377 54.001 L
366.892 52 L
369.408 51.117 L
371.923 50.59 L
374.438 50.041 L
376.954 49.473 L
379.469 49.566 L
381.985 49.642 L
384.5 49.068 L
384.539 49.051 L
S
GR
GS
[1.00046 0 0 1 0 0] CT
0.898 0.6 0.6 RC
1 LJ
2 LW
N
57.461 120.348 M
57.5 120.263 L
60.015 114.288 L
62.531 108.12 L
65.046 101.98 L
67.562 95.773 L
70.077 89.302 L
72.592 83.311 L
75.108 78.397 L
77.623 74.594 L
80.138 71.796 L
82.654 70.018 L
85.169 68.308 L
87.685 66.714 L
90.2 65.478 L
92.715 64.527 L
95.231 63.913 L
97.746 63.37 L
100.262 62.863 L
102.777 62.191 L
105.292 61.657 L
107.808 60.942 L
110.323 60.472 L
112.838 59.986 L
115.354 60.099 L
117.869 60.95 L
120.385 61.795 L
122.9 62.221 L
125.415 62.671 L
127.931 63.342 L
130.446 64.129 L
132.962 64.167 L
135.477 63.62 L
137.992 65.414 L
140.508 73.432 L
143.023 90.579 L
145.538 114.393 L
148.054 137.783 L
150.569 156.857 L
153.085 171.394 L
155.6 181.901 L
158.115 189.57 L
160.631 194.438 L
163.146 197.277 L
165.662 198.926 L
168.177 199.384 L
170.692 199.261 L
173.208 199.911 L
175.723 200.493 L
178.238 200.495 L
180.754 200.886 L
183.269 201.318 L
185.785 201.999 L
188.3 202.956 L
190.815 203.686 L
193.331 203.96 L
195.846 203.798 L
198.362 204.234 L
200.877 204.824 L
203.392 205.475 L
205.908 206.151 L
208.423 206.875 L
210.938 207.439 L
213.454 207.797 L
215.969 207.588 L
218.485 206.556 L
221 205.679 L
223.515 204.704 L
226.031 204.186 L
228.546 203.625 L
231.062 203.64 L
233.577 204.045 L
236.092 204.34 L
238.608 204.016 L
241.123 203.492 L
243.638 203.146 L
246.154 203.593 L
248.669 204.184 L
251.185 204.357 L
253.7 204.729 L
256.215 204.89 L
258.731 204.677 L
261.246 204.315 L
263.762 203.737 L
266.277 203.228 L
268.792 202.992 L
271.308 203.041 L
273.823 202.552 L
276.338 201.997 L
278.854 201.383 L
281.369 200.846 L
283.885 200.377 L
286.4 199.537 L
288.915 197.983 L
291.431 196.083 L
293.946 194.63 L
296.462 195.462 L
298.977 198.804 L
301.492 204.087 L
304.008 208.93 L
306.523 212.816 L
309.038 215.348 L
311.554 215.337 L
314.069 212.013 L
316.585 205.041 L
319.1 194.099 L
321.615 180.924 L
324.131 167.031 L
326.646 153.273 L
329.162 140.419 L
331.677 128.493 L
334.192 116.72 L
336.708 105.336 L
339.223 95.211 L
341.738 87.076 L
344.254 80.259 L
346.769 74.707 L
349.285 70.319 L
351.8 66.92 L
354.315 64.031 L
356.831 61.631 L
359.346 59.67 L
361.862 57.535 L
364.377 55.445 L
366.892 53.427 L
369.408 52.564 L
371.923 52.091 L
374.438 51.576 L
376.954 50.982 L
379.469 50.965 L
381.985 50.899 L
384.5 50.224 L
384.539 50.207 L
S
GR
GS
[1.00046 0 0 1 0 0] CT
0.98 0.939 0.939 RC
N
178.238 200.938 M
180.754 201.966 L
183.269 202.662 L
185.785 203.279 L
188.3 204.015 L
190.815 204.291 L
193.331 204.135 L
195.846 204.505 L
198.362 205.133 L
200.877 204.982 L
203.392 205.126 L
205.908 205.423 L
208.423 205.585 L
210.938 206.075 L
213.454 206.507 L
215.969 206.962 L
218.485 207.085 L
221 207.378 L
223.515 207.557 L
226.031 207.838 L
228.546 207.665 L
231.062 206.478 L
233.577 205.619 L
236.092 205.243 L
238.608 205.932 L
241.123 206.601 L
243.638 207.538 L
246.154 208.147 L
248.669 208.706 L
251.185 208.495 L
253.7 208.179 L
256.215 207.625 L
258.731 207.431 L
261.246 207.774 L
263.762 208.263 L
266.277 208.491 L
268.792 208.729 L
271.308 208.818 L
273.823 208.095 L
276.338 207.291 L
278.854 207.48 L
281.369 207.365 L
283.885 207.062 L
286.4 206.88 L
288.915 205.938 L
291.431 204.804 L
293.946 203.434 L
296.462 203.19 L
298.977 205.483 L
301.492 209.248 L
304.008 213.587 L
306.523 217.781 L
309.038 221.195 L
311.554 222.489 L
314.069 220.72 L
316.585 215.471 L
319.1 207.373 L
321.615 196.688 L
324.131 184.347 L
326.646 171.61 L
329.162 158.858 L
331.677 146.281 L
334.192 134.43 L
336.708 123.106 L
339.223 112.908 L
341.738 103.604 L
344.254 95.837 L
346.769 89.114 L
349.285 83.229 L
351.8 78.046 L
354.315 73.289 L
356.831 69.705 L
359.346 67.179 L
361.862 65.414 L
364.377 63.087 L
366.892 61.209 L
369.408 59.672 L
371.923 58.483 L
374.438 58.011 L
376.954 57.331 L
379.469 56.518 L
381.985 55.775 L
384.5 55.114 L
384.539 55.093 L
384.539 51.659 L
384.539 51.604 L
384.5 51.625 L
381.985 52.262 L
379.469 53.044 L
376.954 53.883 L
374.438 54.49 L
371.923 54.887 L
369.408 55.848 L
366.892 57.356 L
364.377 59.293 L
361.862 61.71 L
359.346 63.528 L
356.831 66.203 L
354.315 69.855 L
351.8 74.483 L
349.285 79.514 L
346.769 85.478 L
344.254 92.255 L
341.738 100.158 L
339.223 109.533 L
336.708 119.799 L
334.192 131.09 L
331.677 142.823 L
329.162 155.351 L
326.646 168.161 L
324.131 181.043 L
321.615 193.555 L
319.1 204.471 L
316.585 212.576 L
314.069 217.896 L
311.554 219.905 L
309.038 218.783 L
306.523 215.535 L
304.008 211.481 L
301.492 207.018 L
298.977 203.091 L
296.462 200.628 L
293.946 200.674 L
291.431 202.027 L
288.915 203.116 L
286.4 203.898 L
283.885 203.993 L
281.369 204.307 L
278.854 204.351 L
276.338 204.117 L
273.823 205.005 L
271.308 205.73 L
268.792 205.643 L
266.277 205.358 L
263.762 205.053 L
261.246 204.646 L
258.731 204.381 L
256.215 204.681 L
253.7 205.335 L
251.185 205.797 L
248.669 206.215 L
246.154 205.961 L
243.638 205.463 L
241.123 204.564 L
238.608 203.774 L
236.092 203.07 L
233.577 203.282 L
231.062 203.996 L
228.546 205.153 L
226.031 205.378 L
223.515 205.18 L
221 205.09 L
218.485 204.841 L
215.969 204.774 L
213.454 204.365 L
210.938 204.013 L
208.423 203.521 L
205.908 203.465 L
203.392 203.156 L
200.877 202.848 L
198.362 202.934 L
195.846 202.239 L
193.331 201.819 L
190.815 202.032 L
188.3 202.003 L
185.785 201.415 L
183.269 200.684 L
180.754 199.848 L
178.238 198.619 L
175.723 197.42 L
173.208 196.274 L
170.692 195.902 L
168.177 195.515 L
165.662 194.382 L
163.146 193.311 L
160.631 191.158 L
158.115 186.672 L
155.6 179.296 L
153.085 168.711 L
150.569 153.955 L
148.054 133.89 L
145.538 109.99 L
143.023 86.523 L
140.508 69.487 L
137.992 61.14 L
135.477 59.542 L
132.962 59.979 L
130.446 59.546 L
127.931 58.101 L
125.415 56.389 L
122.9 54.686 L
120.385 53.838 L
117.869 53.418 L
115.354 53.126 L
112.838 52.264 L
110.323 51.432 L
107.808 51.171 L
105.292 50.847 L
102.777 51.047 L
100.262 51.435 L
97.746 52.28 L
95.231 53.839 L
92.715 54.962 L
90.2 56.316 L
87.685 58.107 L
85.169 60.876 L
82.654 64.094 L
80.138 67.709 L
77.623 71.441 L
75.108 75.485 L
72.592 80.443 L
70.077 86.433 L
67.562 93.172 L
65.046 100.161 L
62.531 107.804 L
60.015 115.529 L
57.5 123.304 L
57.461 123.411 L
57.461 126.776 L
57.461 126.828 L
57.5 126.723 L
60.015 118.888 L
62.531 111.12 L
65.046 103.476 L
67.562 96.511 L
70.077 89.726 L
72.592 83.765 L
75.108 78.72 L
77.623 74.54 L
80.138 70.789 L
82.654 67.425 L
85.169 64.479 L
87.685 61.772 L
90.2 59.932 L
92.715 58.659 L
95.231 57.586 L
97.746 56.009 L
100.262 55.226 L
102.777 54.863 L
105.292 54.648 L
107.808 55.071 L
110.323 55.6 L
112.838 56.507 L
115.354 57.162 L
117.869 57.179 L
120.385 57.393 L
122.9 58.183 L
125.415 59.796 L
127.931 61.357 L
130.446 62.754 L
132.962 63.156 L
135.477 62.669 L
137.992 64.141 L
140.508 72.246 L
143.023 89.034 L
145.538 112.275 L
148.054 136.116 L
150.569 156.55 L
153.085 171.469 L
155.6 182.079 L
158.115 189.302 L
160.631 193.588 L
163.146 195.8 L
165.662 196.847 L
168.177 197.737 L
170.692 198.002 L
173.208 198.429 L
175.723 199.741 L
cp
f
GR
GS
[1.00046 0 0 1 0 0] CT
0.91 0.729 0.729 RC
1 LJ
0.5 LW
N
57.461 126.828 M
57.5 126.723 L
60.015 118.888 L
62.531 111.12 L
65.046 103.476 L
67.562 96.511 L
70.077 89.726 L
72.592 83.765 L
75.108 78.72 L
77.623 74.54 L
80.138 70.789 L
82.654 67.425 L
85.169 64.479 L
87.685 61.772 L
90.2 59.932 L
92.715 58.659 L
95.231 57.586 L
97.746 56.009 L
100.262 55.226 L
102.777 54.863 L
105.292 54.648 L
107.808 55.071 L
110.323 55.6 L
112.838 56.507 L
115.354 57.162 L
117.869 57.179 L
120.385 57.393 L
122.9 58.183 L
125.415 59.796 L
127.931 61.357 L
130.446 62.754 L
132.962 63.156 L
135.477 62.669 L
137.992 64.141 L
140.508 72.246 L
143.023 89.034 L
145.538 112.275 L
148.054 136.116 L
150.569 156.55 L
153.085 171.469 L
155.6 182.079 L
158.115 189.302 L
160.631 193.588 L
163.146 195.8 L
165.662 196.847 L
168.177 197.737 L
170.692 198.002 L
173.208 198.429 L
175.723 199.741 L
178.238 200.938 L
180.754 201.966 L
183.269 202.662 L
185.785 203.279 L
188.3 204.015 L
190.815 204.291 L
193.331 204.135 L
195.846 204.505 L
198.362 205.133 L
200.877 204.982 L
203.392 205.126 L
205.908 205.423 L
208.423 205.585 L
210.938 206.075 L
213.454 206.507 L
215.969 206.962 L
218.485 207.085 L
221 207.378 L
223.515 207.557 L
226.031 207.838 L
228.546 207.665 L
231.062 206.478 L
233.577 205.619 L
236.092 205.243 L
238.608 205.932 L
241.123 206.601 L
243.638 207.538 L
246.154 208.147 L
248.669 208.706 L
251.185 208.495 L
253.7 208.179 L
256.215 207.625 L
258.731 207.431 L
261.246 207.774 L
263.762 208.263 L
266.277 208.491 L
268.792 208.729 L
271.308 208.818 L
273.823 208.095 L
276.338 207.291 L
278.854 207.48 L
281.369 207.365 L
283.885 207.062 L
286.4 206.88 L
288.915 205.938 L
291.431 204.804 L
293.946 203.434 L
296.462 203.19 L
298.977 205.483 L
301.492 209.248 L
304.008 213.587 L
306.523 217.781 L
309.038 221.195 L
311.554 222.489 L
314.069 220.72 L
316.585 215.471 L
319.1 207.373 L
321.615 196.688 L
324.131 184.347 L
326.646 171.61 L
329.162 158.858 L
331.677 146.281 L
334.192 134.43 L
336.708 123.106 L
339.223 112.908 L
341.738 103.604 L
344.254 95.837 L
346.769 89.114 L
349.285 83.229 L
351.8 78.046 L
354.315 73.289 L
356.831 69.705 L
359.346 67.179 L
361.862 65.414 L
364.377 63.087 L
366.892 61.209 L
369.408 59.672 L
371.923 58.483 L
374.438 58.011 L
376.954 57.331 L
379.469 56.518 L
381.985 55.775 L
384.5 55.114 L
384.539 55.093 L
S
GR
GS
[1.00046 0 0 1 0 0] CT
0.91 0.729 0.729 RC
1 LJ
0.5 LW
N
57.461 123.411 M
57.5 123.304 L
60.015 115.529 L
62.531 107.804 L
65.046 100.161 L
67.562 93.172 L
70.077 86.433 L
72.592 80.443 L
75.108 75.485 L
77.623 71.441 L
80.138 67.709 L
82.654 64.094 L
85.169 60.876 L
87.685 58.107 L
90.2 56.316 L
92.715 54.962 L
95.231 53.839 L
97.746 52.28 L
100.262 51.435 L
102.777 51.047 L
105.292 50.847 L
107.808 51.171 L
110.323 51.432 L
112.838 52.264 L
115.354 53.126 L
117.869 53.418 L
120.385 53.838 L
122.9 54.686 L
125.415 56.389 L
127.931 58.101 L
130.446 59.546 L
132.962 59.979 L
135.477 59.542 L
137.992 61.14 L
140.508 69.487 L
143.023 86.523 L
145.538 109.99 L
148.054 133.89 L
150.569 153.955 L
153.085 168.711 L
155.6 179.296 L
158.115 186.672 L
160.631 191.158 L
163.146 193.311 L
165.662 194.382 L
168.177 195.515 L
170.692 195.902 L
173.208 196.274 L
175.723 197.42 L
178.238 198.619 L
180.754 199.848 L
183.269 200.684 L
185.785 201.415 L
188.3 202.003 L
190.815 202.032 L
193.331 201.819 L
195.846 202.239 L
198.362 202.934 L
200.877 202.848 L
203.392 203.156 L
205.908 203.465 L
208.423 203.521 L
210.938 204.013 L
213.454 204.365 L
215.969 204.774 L
218.485 204.841 L
221 205.09 L
223.515 205.18 L
226.031 205.378 L
228.546 205.153 L
231.062 203.996 L
233.577 203.282 L
236.092 203.07 L
238.608 203.774 L
241.123 204.564 L
243.638 205.463 L
246.154 205.961 L
248.669 206.215 L
251.185 205.797 L
253.7 205.335 L
256.215 204.681 L
258.731 204.381 L
261.246 204.646 L
263.762 205.053 L
266.277 205.358 L
268.792 205.643 L
271.308 205.73 L
273.823 205.005 L
276.338 204.117 L
278.854 204.351 L
281.369 204.307 L
283.885 203.993 L
286.4 203.898 L
288.915 203.116 L
291.431 202.027 L
293.946 200.674 L
296.462 200.628 L
298.977 203.091 L
301.492 207.018 L
304.008 211.481 L
306.523 215.535 L
309.038 218.783 L
311.554 219.905 L
314.069 217.896 L
316.585 212.576 L
319.1 204.471 L
321.615 193.555 L
324.131 181.043 L
326.646 168.161 L
329.162 155.351 L
331.677 142.823 L
334.192 131.09 L
336.708 119.799 L
339.223 109.533 L
341.738 100.158 L
344.254 92.255 L
346.769 85.478 L
349.285 79.514 L
351.8 74.483 L
354.315 69.855 L
356.831 66.203 L
359.346 63.528 L
361.862 61.71 L
364.377 59.293 L
366.892 57.356 L
369.408 55.848 L
371.923 54.887 L
374.438 54.49 L
376.954 53.883 L
379.469 53.044 L
381.985 52.262 L
384.5 51.625 L
384.539 51.604 L
S
GR
GS
[1.00046 0 0 1 0 0] CT
0.8 0.4 0.4 RC
1 LJ
2 LW
N
57.461 125.119 M
57.5 125.014 L
60.015 117.208 L
62.531 109.462 L
65.046 101.819 L
67.562 94.841 L
70.077 88.079 L
72.592 82.104 L
75.108 77.103 L
77.623 72.991 L
80.138 69.249 L
82.654 65.759 L
85.169 62.677 L
87.685 59.939 L
90.2 58.124 L
92.715 56.811 L
95.231 55.713 L
97.746 54.145 L
100.262 53.331 L
102.777 52.955 L
105.292 52.747 L
107.808 53.121 L
110.323 53.516 L
112.838 54.386 L
115.354 55.144 L
117.869 55.299 L
120.385 55.616 L
122.9 56.434 L
125.415 58.093 L
127.931 59.729 L
130.446 61.15 L
132.962 61.567 L
135.477 61.105 L
137.992 62.64 L
140.508 70.867 L
143.023 87.778 L
145.538 111.132 L
148.054 135.003 L
150.569 155.253 L
153.085 170.09 L
155.6 180.688 L
158.115 187.987 L
160.631 192.373 L
163.146 194.556 L
165.662 195.614 L
168.177 196.626 L
170.692 196.952 L
173.208 197.351 L
175.723 198.581 L
178.238 199.779 L
180.754 200.907 L
183.269 201.673 L
185.785 202.347 L
188.3 203.009 L
190.815 203.162 L
193.331 202.977 L
195.846 203.372 L
198.362 204.033 L
200.877 203.915 L
203.392 204.141 L
205.908 204.444 L
208.423 204.553 L
210.938 205.044 L
213.454 205.436 L
215.969 205.868 L
218.485 205.963 L
221 206.234 L
223.515 206.369 L
226.031 206.608 L
228.546 206.409 L
231.062 205.237 L
233.577 204.45 L
236.092 204.156 L
238.608 204.853 L
241.123 205.583 L
243.638 206.5 L
246.154 207.054 L
248.669 207.461 L
251.185 207.146 L
253.7 206.757 L
256.215 206.153 L
258.731 205.906 L
261.246 206.21 L
263.762 206.658 L
266.277 206.924 L
268.792 207.186 L
271.308 207.274 L
273.823 206.55 L
276.338 205.704 L
278.854 205.915 L
281.369 205.836 L
283.885 205.528 L
286.4 205.389 L
288.915 204.527 L
291.431 203.416 L
293.946 202.054 L
296.462 201.909 L
298.977 204.287 L
301.492 208.133 L
304.008 212.534 L
306.523 216.658 L
309.038 219.989 L
311.554 221.197 L
314.069 219.308 L
316.585 214.024 L
319.1 205.922 L
321.615 195.122 L
324.131 182.695 L
326.646 169.885 L
329.162 157.105 L
331.677 144.552 L
334.192 132.76 L
336.708 121.453 L
339.223 111.221 L
341.738 101.881 L
344.254 94.046 L
346.769 87.296 L
349.285 81.372 L
351.8 76.265 L
354.315 71.572 L
356.831 67.954 L
359.346 65.353 L
361.862 63.562 L
364.377 61.19 L
366.892 59.282 L
369.408 57.76 L
371.923 56.685 L
374.438 56.25 L
376.954 55.607 L
379.469 54.781 L
381.985 54.018 L
384.5 53.37 L
384.539 53.349 L
S
GR
GS
[1.00046 0 0 1 0 0] CT
0.959 0.918 0.918 RC
N
175.723 200.153 M
178.238 200.357 L
180.754 200.505 L
183.269 200.878 L
185.785 201.835 L
188.3 202.639 L
190.815 203.241 L
193.331 204.22 L
195.846 204.814 L
198.362 204.837 L
200.877 204.907 L
203.392 205.383 L
205.908 205.82 L
208.423 205.86 L
210.938 205.787 L
213.454 206.229 L
215.969 206.356 L
218.485 206.719 L
221 207.038 L
223.515 207.162 L
226.031 207.168 L
228.546 206.867 L
231.062 206.771 L
233.577 206.986 L
236.092 207.22 L
238.608 207.799 L
241.123 208.871 L
243.638 209.458 L
246.154 208.897 L
248.669 208.318 L
251.185 208.282 L
253.7 208.983 L
256.215 209.578 L
258.731 209.531 L
261.246 208.583 L
263.762 208.12 L
266.277 207.846 L
268.792 207.518 L
271.308 207.329 L
273.823 206.972 L
276.338 207.016 L
278.854 207.257 L
281.369 207.74 L
283.885 208.071 L
286.4 208.18 L
288.915 207.106 L
291.431 204.343 L
293.946 202.177 L
296.462 202.11 L
298.977 204.49 L
301.492 208.936 L
304.008 213.535 L
306.523 218.166 L
309.038 222.713 L
311.554 225.794 L
314.069 226.187 L
316.585 222.489 L
319.1 214.998 L
321.615 203.729 L
324.131 191.035 L
326.646 178.158 L
329.162 165.192 L
331.677 153.115 L
334.192 141.264 L
336.708 129.739 L
339.223 119.144 L
341.738 110.117 L
344.254 102.124 L
346.769 95.005 L
349.285 88.748 L
351.8 83.034 L
354.315 78.115 L
356.831 74.138 L
359.346 70.71 L
361.862 67.707 L
364.377 65.314 L
366.892 62.741 L
369.408 60.639 L
371.923 59.342 L
374.438 58.673 L
376.954 58.4 L
379.469 57.91 L
381.985 57.371 L
384.5 56.81 L
384.539 56.792 L
384.539 52.667 L
384.539 52.607 L
384.5 52.62 L
381.985 53.12 L
379.469 53.765 L
376.954 54.293 L
374.438 54.525 L
371.923 55.181 L
369.408 56.597 L
366.892 58.689 L
364.377 61.022 L
361.862 63.248 L
359.346 66.137 L
356.831 69.633 L
354.315 73.66 L
351.8 78.626 L
349.285 84.415 L
346.769 90.792 L
344.254 98.135 L
341.738 106.314 L
339.223 115.472 L
336.708 125.982 L
334.192 137.281 L
331.677 149.132 L
329.162 161.288 L
326.646 174.474 L
324.131 187.541 L
321.615 200.252 L
319.1 211.422 L
316.585 218.882 L
314.069 222.778 L
311.554 222.619 L
309.038 219.744 L
306.523 215.305 L
304.008 210.616 L
301.492 205.954 L
298.977 201.33 L
296.462 198.617 L
293.946 198.492 L
291.431 200.718 L
288.915 203.425 L
286.4 204.458 L
283.885 204.507 L
281.369 204.355 L
278.854 204.002 L
276.338 203.789 L
273.823 203.843 L
271.308 204.285 L
268.792 204.629 L
266.277 205.07 L
263.762 205.438 L
261.246 205.894 L
258.731 206.815 L
256.215 206.795 L
253.7 206.18 L
251.185 205.629 L
248.669 205.85 L
246.154 206.355 L
243.638 206.734 L
241.123 206.037 L
238.608 205.001 L
236.092 204.394 L
233.577 204.143 L
231.062 203.902 L
228.546 203.95 L
226.031 204.286 L
223.515 204.296 L
221 204.22 L
218.485 204.097 L
215.969 203.946 L
213.454 203.943 L
210.938 203.626 L
208.423 203.813 L
205.908 203.645 L
203.392 203.181 L
200.877 202.818 L
198.362 202.822 L
195.846 202.728 L
193.331 202.179 L
190.815 201.15 L
188.3 200.379 L
185.785 199.454 L
183.269 198.472 L
180.754 198.207 L
178.238 198.014 L
175.723 197.73 L
173.208 197.239 L
170.692 196.609 L
168.177 196.191 L
165.662 195.145 L
163.146 193.142 L
160.631 190.266 L
158.115 185.102 L
155.6 177.629 L
153.085 167.029 L
150.569 152.458 L
148.054 132.958 L
145.538 108.806 L
143.023 84.797 L
140.508 66.885 L
137.992 57.601 L
135.477 54.951 L
132.962 55.318 L
130.446 54.929 L
127.931 54.041 L
125.415 53.005 L
122.9 51.941 L
120.385 51.279 L
117.869 50.507 L
115.354 49.794 L
112.838 48.919 L
110.323 48.18 L
107.808 47.807 L
105.292 47.731 L
102.777 48.31 L
100.262 48.956 L
97.746 49.285 L
95.231 49.417 L
92.715 50.179 L
90.2 51.218 L
87.685 53.022 L
85.169 55.901 L
82.654 59.397 L
80.138 63.131 L
77.623 67.09 L
75.108 71.797 L
72.592 77.211 L
70.077 83.907 L
67.562 91.097 L
65.046 99.277 L
62.531 106.976 L
60.015 114.09 L
57.5 121.076 L
57.461 121.177 L
57.461 124.941 L
57.461 124.996 L
57.5 124.899 L
60.015 118.069 L
62.531 111.112 L
65.046 103.515 L
67.562 95.413 L
70.077 88.245 L
72.592 81.513 L
75.108 76.005 L
77.623 71.3 L
80.138 67.199 L
82.654 63.257 L
85.169 59.64 L
87.685 56.623 L
90.2 54.715 L
92.715 53.758 L
95.231 52.987 L
97.746 52.836 L
100.262 52.6 L
102.777 52.062 L
105.292 51.532 L
107.808 51.554 L
110.323 52.023 L
112.838 52.894 L
115.354 53.831 L
117.869 54.464 L
120.385 55.007 L
122.9 55.545 L
125.415 56.533 L
127.931 57.56 L
130.446 58.495 L
132.962 58.77 L
135.477 58.23 L
137.992 60.576 L
140.508 69.572 L
143.023 87.251 L
145.538 111.132 L
148.054 135.289 L
150.569 154.918 L
153.085 169.48 L
155.6 180.031 L
158.115 187.474 L
160.631 192.463 L
163.146 195.334 L
165.662 197.42 L
168.177 198.541 L
170.692 199.052 L
173.208 199.669 L
cp
f
GR
GS
[1.00046 0 0 1 0 0] CT
0.82 0.639 0.639 RC
1 LJ
0.5 LW
N
57.461 124.996 M
57.5 124.899 L
60.015 118.069 L
62.531 111.112 L
65.046 103.515 L
67.562 95.413 L
70.077 88.245 L
72.592 81.513 L
75.108 76.005 L
77.623 71.3 L
80.138 67.199 L
82.654 63.257 L
85.169 59.64 L
87.685 56.623 L
90.2 54.715 L
92.715 53.758 L
95.231 52.987 L
97.746 52.836 L
100.262 52.6 L
102.777 52.062 L
105.292 51.532 L
107.808 51.554 L
110.323 52.023 L
112.838 52.894 L
115.354 53.831 L
117.869 54.464 L
120.385 55.007 L
122.9 55.545 L
125.415 56.533 L
127.931 57.56 L
130.446 58.495 L
132.962 58.77 L
135.477 58.23 L
137.992 60.576 L
140.508 69.572 L
143.023 87.251 L
145.538 111.132 L
148.054 135.289 L
150.569 154.918 L
153.085 169.48 L
155.6 180.031 L
158.115 187.474 L
160.631 192.463 L
163.146 195.334 L
165.662 197.42 L
168.177 198.541 L
170.692 199.052 L
173.208 199.669 L
175.723 200.153 L
178.238 200.357 L
180.754 200.505 L
183.269 200.878 L
185.785 201.835 L
188.3 202.639 L
190.815 203.241 L
193.331 204.22 L
195.846 204.814 L
198.362 204.837 L
200.877 204.907 L
203.392 205.383 L
205.908 205.82 L
208.423 205.86 L
210.938 205.787 L
213.454 206.229 L
215.969 206.356 L
218.485 206.719 L
221 207.038 L
223.515 207.162 L
226.031 207.168 L
228.546 206.867 L
231.062 206.771 L
233.577 206.986 L
236.092 207.22 L
238.608 207.799 L
241.123 208.871 L
243.638 209.458 L
246.154 208.897 L
248.669 208.318 L
251.185 208.282 L
253.7 208.983 L
256.215 209.578 L
258.731 209.531 L
261.246 208.583 L
263.762 208.12 L
266.277 207.846 L
268.792 207.518 L
271.308 207.329 L
273.823 206.972 L
276.338 207.016 L
278.854 207.257 L
281.369 207.74 L
283.885 208.071 L
286.4 208.18 L
288.915 207.106 L
291.431 204.343 L
293.946 202.177 L
296.462 202.11 L
298.977 204.49 L
301.492 208.936 L
304.008 213.535 L
306.523 218.166 L
309.038 222.713 L
311.554 225.794 L
314.069 226.187 L
316.585 222.489 L
319.1 214.998 L
321.615 203.729 L
324.131 191.035 L
326.646 178.158 L
329.162 165.192 L
331.677 153.115 L
334.192 141.264 L
336.708 129.739 L
339.223 119.144 L
341.738 110.117 L
344.254 102.124 L
346.769 95.005 L
349.285 88.748 L
351.8 83.034 L
354.315 78.115 L
356.831 74.138 L
359.346 70.71 L
361.862 67.707 L
364.377 65.314 L
366.892 62.741 L
369.408 60.639 L
371.923 59.342 L
374.438 58.673 L
376.954 58.4 L
379.469 57.91 L
381.985 57.371 L
384.5 56.81 L
384.539 56.792 L
S
GR
GS
[1.00046 0 0 1 0 0] CT
0.82 0.639 0.639 RC
1 LJ
0.5 LW
N
57.461 121.177 M
57.5 121.076 L
60.015 114.09 L
62.531 106.976 L
65.046 99.277 L
67.562 91.097 L
70.077 83.907 L
72.592 77.211 L
75.108 71.797 L
77.623 67.09 L
80.138 63.131 L
82.654 59.397 L
85.169 55.901 L
87.685 53.022 L
90.2 51.218 L
92.715 50.179 L
95.231 49.417 L
97.746 49.285 L
100.262 48.956 L
102.777 48.31 L
105.292 47.731 L
107.808 47.807 L
110.323 48.18 L
112.838 48.919 L
115.354 49.794 L
117.869 50.507 L
120.385 51.279 L
122.9 51.941 L
125.415 53.005 L
127.931 54.041 L
130.446 54.929 L
132.962 55.318 L
135.477 54.951 L
137.992 57.601 L
140.508 66.885 L
143.023 84.797 L
145.538 108.806 L
148.054 132.958 L
150.569 152.458 L
153.085 167.029 L
155.6 177.629 L
158.115 185.102 L
160.631 190.266 L
163.146 193.142 L
165.662 195.145 L
168.177 196.191 L
170.692 196.609 L
173.208 197.239 L
175.723 197.73 L
178.238 198.014 L
180.754 198.207 L
183.269 198.472 L
185.785 199.454 L
188.3 200.379 L
190.815 201.15 L
193.331 202.179 L
195.846 202.728 L
198.362 202.822 L
200.877 202.818 L
203.392 203.181 L
205.908 203.645 L
208.423 203.813 L
210.938 203.626 L
213.454 203.943 L
215.969 203.946 L
218.485 204.097 L
221 204.22 L
223.515 204.296 L
226.031 204.286 L
228.546 203.95 L
231.062 203.902 L
233.577 204.143 L
236.092 204.394 L
238.608 205.001 L
241.123 206.037 L
243.638 206.734 L
246.154 206.355 L
248.669 205.85 L
251.185 205.629 L
253.7 206.18 L
256.215 206.795 L
258.731 206.815 L
261.246 205.894 L
263.762 205.438 L
266.277 205.07 L
268.792 204.629 L
271.308 204.285 L
273.823 203.843 L
276.338 203.789 L
278.854 204.002 L
281.369 204.355 L
283.885 204.507 L
286.4 204.458 L
288.915 203.425 L
291.431 200.718 L
293.946 198.492 L
296.462 198.617 L
298.977 201.33 L
301.492 205.954 L
304.008 210.616 L
306.523 215.305 L
309.038 219.744 L
311.554 222.619 L
314.069 222.778 L
316.585 218.882 L
319.1 211.422 L
321.615 200.252 L
324.131 187.541 L
326.646 174.474 L
329.162 161.288 L
331.677 149.132 L
334.192 137.281 L
336.708 125.982 L
339.223 115.472 L
341.738 106.314 L
344.254 98.135 L
346.769 90.792 L
349.285 84.415 L
351.8 78.626 L
354.315 73.66 L
356.831 69.633 L
359.346 66.137 L
361.862 63.248 L
364.377 61.022 L
366.892 58.689 L
369.408 56.597 L
371.923 55.181 L
374.438 54.525 L
376.954 54.293 L
379.469 53.765 L
381.985 53.12 L
384.5 52.62 L
384.539 52.607 L
S
GR
GS
[1.00046 0 0 1 0 0] CT
0.6 0.2 0.2 RC
1 LJ
2 LW
N
57.461 123.087 M
57.5 122.988 L
60.015 116.08 L
62.531 109.044 L
65.046 101.396 L
67.562 93.255 L
70.077 86.076 L
72.592 79.362 L
75.108 73.901 L
77.623 69.195 L
80.138 65.165 L
82.654 61.327 L
85.169 57.771 L
87.685 54.823 L
90.2 52.966 L
92.715 51.969 L
95.231 51.202 L
97.746 51.06 L
100.262 50.778 L
102.777 50.186 L
105.292 49.632 L
107.808 49.681 L
110.323 50.101 L
112.838 50.906 L
115.354 51.813 L
117.869 52.485 L
120.385 53.143 L
122.9 53.743 L
125.415 54.769 L
127.931 55.8 L
130.446 56.712 L
132.962 57.044 L
135.477 56.591 L
137.992 59.088 L
140.508 68.229 L
143.023 86.024 L
145.538 109.969 L
148.054 134.123 L
150.569 153.688 L
153.085 168.254 L
155.6 178.83 L
158.115 186.288 L
160.631 191.364 L
163.146 194.238 L
165.662 196.283 L
168.177 197.366 L
170.692 197.831 L
173.208 198.454 L
175.723 198.942 L
178.238 199.185 L
180.754 199.356 L
183.269 199.675 L
185.785 200.644 L
188.3 201.509 L
190.815 202.195 L
193.331 203.199 L
195.846 203.771 L
198.362 203.829 L
200.877 203.862 L
203.392 204.282 L
205.908 204.733 L
208.423 204.837 L
210.938 204.706 L
213.454 205.086 L
215.969 205.151 L
218.485 205.408 L
221 205.629 L
223.515 205.729 L
226.031 205.727 L
228.546 205.409 L
231.062 205.337 L
233.577 205.564 L
236.092 205.807 L
238.608 206.4 L
241.123 207.454 L
243.638 208.096 L
246.154 207.626 L
248.669 207.084 L
251.185 206.956 L
253.7 207.582 L
256.215 208.186 L
258.731 208.173 L
261.246 207.239 L
263.762 206.779 L
266.277 206.458 L
268.792 206.074 L
271.308 205.807 L
273.823 205.408 L
276.338 205.402 L
278.854 205.63 L
281.369 206.047 L
283.885 206.289 L
286.4 206.319 L
288.915 205.266 L
291.431 202.531 L
293.946 200.334 L
296.462 200.364 L
298.977 202.91 L
301.492 207.445 L
304.008 212.076 L
306.523 216.736 L
309.038 221.228 L
311.554 224.206 L
314.069 224.482 L
316.585 220.685 L
319.1 213.21 L
321.615 201.99 L
324.131 189.288 L
326.646 176.316 L
329.162 163.24 L
331.677 151.124 L
334.192 139.272 L
336.708 127.861 L
339.223 117.308 L
341.738 108.216 L
344.254 100.129 L
346.769 92.899 L
349.285 86.581 L
351.8 80.83 L
354.315 75.887 L
356.831 71.885 L
359.346 68.424 L
361.862 65.478 L
364.377 63.168 L
366.892 60.715 L
369.408 58.618 L
371.923 57.261 L
374.438 56.599 L
376.954 56.347 L
379.469 55.837 L
381.985 55.246 L
384.5 54.715 L
384.539 54.699 L
S
GR
%%Trailer
%%Pages: 1
%%EOF
