%!PS-Adobe-3.0 EPSF-3.0
%%Creator: (MATLAB, The Mathworks, Inc. Version 9.1.0.441655 \(R2016b\). Operating System: Mac OS X)
%%Title: /Volumes/LNDG/Projects/StateSwitch/dynamic/data/eeg/task/B_analyses/S2_TFR_PeriResponse/C_figures/Z_exampleAlpha1.eps
%%CreationDate: 2020-11-03T17:25:32
%%Pages: (atend)
%%BoundingBox:   189     0  1626   285
%%LanguageLevel: 3
%%EndComments
%%BeginProlog
%%BeginResource: procset (Apache XML Graphics Std ProcSet) 1.2 0
%%Version: 1.2 0
%%Copyright: (Copyright 2001-2003,2010 The Apache Software Foundation. License terms: http://www.apache.org/licenses/LICENSE-2.0)
/bd{bind def}bind def
/ld{load def}bd
/GR/grestore ld
/M/moveto ld
/LJ/setlinejoin ld
/C/curveto ld
/f/fill ld
/LW/setlinewidth ld
/GC/setgray ld
/t/show ld
/N/newpath ld
/CT/concat ld
/cp/closepath ld
/S/stroke ld
/L/lineto ld
/CC/setcmykcolor ld
/A/ashow ld
/GS/gsave ld
/RC/setrgbcolor ld
/RM/rmoveto ld
/ML/setmiterlimit ld
/re {4 2 roll M
1 index 0 rlineto
0 exch rlineto
neg 0 rlineto
cp } bd
/_ctm matrix def
/_tm matrix def
/BT { _ctm currentmatrix pop matrix _tm copy pop 0 0 moveto } bd
/ET { _ctm setmatrix } bd
/iTm { _ctm setmatrix _tm concat } bd
/Tm { _tm astore pop iTm 0 0 moveto } bd
/ux 0.0 def
/uy 0.0 def
/F {
  /Tp exch def
  /Tf exch def
  Tf findfont Tp scalefont setfont
  /cf Tf def  /cs Tp def
} bd
/ULS {currentpoint /uy exch def /ux exch def} bd
/ULE {
  /Tcx currentpoint pop def
  gsave
  newpath
  cf findfont cs scalefont dup
  /FontMatrix get 0 get /Ts exch def /FontInfo get dup
  /UnderlinePosition get Ts mul /To exch def
  /UnderlineThickness get Ts mul /Tt exch def
  ux uy To add moveto  Tcx uy To add lineto
  Tt setlinewidth stroke
  grestore
} bd
/OLE {
  /Tcx currentpoint pop def
  gsave
  newpath
  cf findfont cs scalefont dup
  /FontMatrix get 0 get /Ts exch def /FontInfo get dup
  /UnderlinePosition get Ts mul /To exch def
  /UnderlineThickness get Ts mul /Tt exch def
  ux uy To add cs add moveto Tcx uy To add cs add lineto
  Tt setlinewidth stroke
  grestore
} bd
/SOE {
  /Tcx currentpoint pop def
  gsave
  newpath
  cf findfont cs scalefont dup
  /FontMatrix get 0 get /Ts exch def /FontInfo get dup
  /UnderlinePosition get Ts mul /To exch def
  /UnderlineThickness get Ts mul /Tt exch def
  ux uy To add cs 10 mul 26 idiv add moveto Tcx uy To add cs 10 mul 26 idiv add lineto
  Tt setlinewidth stroke
  grestore
} bd
/QT {
/Y22 exch store
/X22 exch store
/Y21 exch store
/X21 exch store
currentpoint
/Y21 load 2 mul add 3 div exch
/X21 load 2 mul add 3 div exch
/X21 load 2 mul /X22 load add 3 div
/Y21 load 2 mul /Y22 load add 3 div
/X22 load /Y22 load curveto
} bd
/SSPD {
dup length /d exch dict def
{
/v exch def
/k exch def
currentpagedevice k known {
/cpdv currentpagedevice k get def
v cpdv ne {
/upd false def
/nullv v type /nulltype eq def
/nullcpdv cpdv type /nulltype eq def
nullv nullcpdv or
{
/upd true def
} {
/sametype v type cpdv type eq def
sametype {
v type /arraytype eq {
/vlen v length def
/cpdvlen cpdv length def
vlen cpdvlen eq {
0 1 vlen 1 sub {
/i exch def
/obj v i get def
/cpdobj cpdv i get def
obj cpdobj ne {
/upd true def
exit
} if
} for
} {
/upd true def
} ifelse
} {
v type /dicttype eq {
v {
/dv exch def
/dk exch def
/cpddv cpdv dk get def
dv cpddv ne {
/upd true def
exit
} if
} forall
} {
/upd true def
} ifelse
} ifelse
} if
} ifelse
upd true eq {
d k v put
} if
} if
} if
} forall
d length 0 gt {
d setpagedevice
} if
} bd
/RE { % /NewFontName [NewEncodingArray] /FontName RE -
  findfont dup length dict begin
  {
    1 index /FID ne
    {def} {pop pop} ifelse
  } forall
  /Encoding exch def
  /FontName 1 index def
  currentdict definefont pop
  end
} bind def
%%EndResource
%%BeginResource: procset (Apache XML Graphics EPS ProcSet) 1.0 0
%%Version: 1.0 0
%%Copyright: (Copyright 2002-2003 The Apache Software Foundation. License terms: http://www.apache.org/licenses/LICENSE-2.0)
/BeginEPSF { %def
/b4_Inc_state save def         % Save state for cleanup
/dict_count countdictstack def % Count objects on dict stack
/op_count count 1 sub def      % Count objects on operand stack
userdict begin                 % Push userdict on dict stack
/showpage { } def              % Redefine showpage, { } = null proc
0 setgray 0 setlinecap         % Prepare graphics state
1 setlinewidth 0 setlinejoin
10 setmiterlimit [ ] 0 setdash newpath
/languagelevel where           % If level not equal to 1 then
{pop languagelevel             % set strokeadjust and
1 ne                           % overprint to their defaults.
{false setstrokeadjust false setoverprint
} if
} if
} bd
/EndEPSF { %def
count op_count sub {pop} repeat            % Clean up stacks
countdictstack dict_count sub {end} repeat
b4_Inc_state restore
} bd
%%EndResource
%FOPBeginFontDict
%%IncludeResource: font Courier-Bold
%%IncludeResource: font Helvetica
%%IncludeResource: font Courier-BoldOblique
%%IncludeResource: font Courier-Oblique
%%IncludeResource: font Times-Roman
%%IncludeResource: font Helvetica-BoldOblique
%%IncludeResource: font Helvetica-Bold
%%IncludeResource: font Helvetica-Oblique
%%IncludeResource: font Times-BoldItalic
%%IncludeResource: font Courier
%%IncludeResource: font Times-Italic
%%IncludeResource: font Times-Bold
%%IncludeResource: font Symbol
%%IncludeResource: font ZapfDingbats
%FOPEndFontDict
%%BeginResource: encoding WinAnsiEncoding
/WinAnsiEncoding [
/.notdef /.notdef /.notdef /.notdef /.notdef
/.notdef /.notdef /.notdef /.notdef /.notdef
/.notdef /.notdef /.notdef /.notdef /.notdef
/.notdef /.notdef /.notdef /.notdef /.notdef
/.notdef /.notdef /.notdef /.notdef /.notdef
/.notdef /.notdef /.notdef /.notdef /.notdef
/.notdef /.notdef /space /exclam /quotedbl
/numbersign /dollar /percent /ampersand /quotesingle
/parenleft /parenright /asterisk /plus /comma
/hyphen /period /slash /zero /one
/two /three /four /five /six
/seven /eight /nine /colon /semicolon
/less /equal /greater /question /at
/A /B /C /D /E
/F /G /H /I /J
/K /L /M /N /O
/P /Q /R /S /T
/U /V /W /X /Y
/Z /bracketleft /backslash /bracketright /asciicircum
/underscore /quoteleft /a /b /c
/d /e /f /g /h
/i /j /k /l /m
/n /o /p /q /r
/s /t /u /v /w
/x /y /z /braceleft /bar
/braceright /asciitilde /bullet /Euro /bullet
/quotesinglbase /florin /quotedblbase /ellipsis /dagger
/daggerdbl /circumflex /perthousand /Scaron /guilsinglleft
/OE /bullet /Zcaron /bullet /bullet
/quoteleft /quoteright /quotedblleft /quotedblright /bullet
/endash /emdash /asciitilde /trademark /scaron
/guilsinglright /oe /bullet /zcaron /Ydieresis
/space /exclamdown /cent /sterling /currency
/yen /brokenbar /section /dieresis /copyright
/ordfeminine /guillemotleft /logicalnot /sfthyphen /registered
/macron /degree /plusminus /twosuperior /threesuperior
/acute /mu /paragraph /middot /cedilla
/onesuperior /ordmasculine /guillemotright /onequarter /onehalf
/threequarters /questiondown /Agrave /Aacute /Acircumflex
/Atilde /Adieresis /Aring /AE /Ccedilla
/Egrave /Eacute /Ecircumflex /Edieresis /Igrave
/Iacute /Icircumflex /Idieresis /Eth /Ntilde
/Ograve /Oacute /Ocircumflex /Otilde /Odieresis
/multiply /Oslash /Ugrave /Uacute /Ucircumflex
/Udieresis /Yacute /Thorn /germandbls /agrave
/aacute /acircumflex /atilde /adieresis /aring
/ae /ccedilla /egrave /eacute /ecircumflex
/edieresis /igrave /iacute /icircumflex /idieresis
/eth /ntilde /ograve /oacute /ocircumflex
/otilde /odieresis /divide /oslash /ugrave
/uacute /ucircumflex /udieresis /yacute /thorn
/ydieresis
] def
%%EndResource
%FOPBeginFontReencode
/Courier-Bold findfont
dup length dict begin
  {1 index /FID ne {def} {pop pop} ifelse} forall
  /Encoding WinAnsiEncoding def
  currentdict
end
/Courier-Bold exch definefont pop
/Helvetica findfont
dup length dict begin
  {1 index /FID ne {def} {pop pop} ifelse} forall
  /Encoding WinAnsiEncoding def
  currentdict
end
/Helvetica exch definefont pop
/Courier-BoldOblique findfont
dup length dict begin
  {1 index /FID ne {def} {pop pop} ifelse} forall
  /Encoding WinAnsiEncoding def
  currentdict
end
/Courier-BoldOblique exch definefont pop
/Courier-Oblique findfont
dup length dict begin
  {1 index /FID ne {def} {pop pop} ifelse} forall
  /Encoding WinAnsiEncoding def
  currentdict
end
/Courier-Oblique exch definefont pop
/Times-Roman findfont
dup length dict begin
  {1 index /FID ne {def} {pop pop} ifelse} forall
  /Encoding WinAnsiEncoding def
  currentdict
end
/Times-Roman exch definefont pop
/Helvetica-BoldOblique findfont
dup length dict begin
  {1 index /FID ne {def} {pop pop} ifelse} forall
  /Encoding WinAnsiEncoding def
  currentdict
end
/Helvetica-BoldOblique exch definefont pop
/Helvetica-Bold findfont
dup length dict begin
  {1 index /FID ne {def} {pop pop} ifelse} forall
  /Encoding WinAnsiEncoding def
  currentdict
end
/Helvetica-Bold exch definefont pop
/Helvetica-Oblique findfont
dup length dict begin
  {1 index /FID ne {def} {pop pop} ifelse} forall
  /Encoding WinAnsiEncoding def
  currentdict
end
/Helvetica-Oblique exch definefont pop
/Times-BoldItalic findfont
dup length dict begin
  {1 index /FID ne {def} {pop pop} ifelse} forall
  /Encoding WinAnsiEncoding def
  currentdict
end
/Times-BoldItalic exch definefont pop
/Courier findfont
dup length dict begin
  {1 index /FID ne {def} {pop pop} ifelse} forall
  /Encoding WinAnsiEncoding def
  currentdict
end
/Courier exch definefont pop
/Times-Italic findfont
dup length dict begin
  {1 index /FID ne {def} {pop pop} ifelse} forall
  /Encoding WinAnsiEncoding def
  currentdict
end
/Times-Italic exch definefont pop
/Times-Bold findfont
dup length dict begin
  {1 index /FID ne {def} {pop pop} ifelse} forall
  /Encoding WinAnsiEncoding def
  currentdict
end
/Times-Bold exch definefont pop
%FOPEndFontReencode
%%EndProlog
%%Page: 1 1
%%PageBoundingBox: 0 0 1792 288
%%BeginPageSetup
[1 0 0 -1 0 288] CT
%%EndPageSetup
GS
1 GC
N
0 0 1792 288 re
f
GR
GS
1 GC
N
0 0 1792 288 re
f
GR
GS
1 GC
N
233 238 M
1622 238 L
1622 27 L
233 27 L
cp
f
GR
GS
0.149 GC
2 setlinecap
1 LJ
0.5 LW
N
233 238 M
1622 238 L
S
GR
GS
0.149 GC
2 setlinecap
1 LJ
0.5 LW
N
233 238 M
233 224.11 L
S
GR
GS
0.149 GC
2 setlinecap
1 LJ
0.5 LW
N
387.333 238 M
387.333 224.11 L
S
GR
GS
0.149 GC
2 setlinecap
1 LJ
0.5 LW
N
541.667 238 M
541.667 224.11 L
S
GR
GS
0.149 GC
2 setlinecap
1 LJ
0.5 LW
N
696 238 M
696 224.11 L
S
GR
GS
0.149 GC
2 setlinecap
1 LJ
0.5 LW
N
850.333 238 M
850.333 224.11 L
S
GR
GS
0.149 GC
2 setlinecap
1 LJ
0.5 LW
N
1004.667 238 M
1004.667 224.11 L
S
GR
GS
0.149 GC
2 setlinecap
1 LJ
0.5 LW
N
1159 238 M
1159 224.11 L
S
GR
GS
0.149 GC
2 setlinecap
1 LJ
0.5 LW
N
1313.333 238 M
1313.333 224.11 L
S
GR
GS
0.149 GC
2 setlinecap
1 LJ
0.5 LW
N
1467.667 238 M
1467.667 224.11 L
S
GR
GS
0.149 GC
2 setlinecap
1 LJ
0.5 LW
N
1622 238 M
1622 224.11 L
S
GR
GS
[1 0 0 1 233 243.60001] CT
0.149 GC
/Helvetica 18 F
GS
[1 0 0 1 0 0] CT
-9 18 moveto 
1 -1 scale
(-4) t 
GR
GR
GS
[1 0 0 1 387.33334 243.60001] CT
0.149 GC
/Helvetica 18 F
GS
[1 0 0 1 0 0] CT
-9 18 moveto 
1 -1 scale
(-3) t 
GR
GR
GS
[1 0 0 1 541.66669 243.60001] CT
0.149 GC
/Helvetica 18 F
GS
[1 0 0 1 0 0] CT
-9 18 moveto 
1 -1 scale
(-2) t 
GR
GR
GS
[1 0 0 1 696 243.60001] CT
0.149 GC
/Helvetica 18 F
GS
[1 0 0 1 0 0] CT
-9 18 moveto 
1 -1 scale
(-1) t 
GR
GR
GS
[1 0 0 1 850.33331 243.60001] CT
0.149 GC
/Helvetica 18 F
GS
[1 0 0 1 0 0] CT
-5.5 18 moveto 
1 -1 scale
(0) t 
GR
GR
GS
[1 0 0 1 1004.66669 243.60001] CT
0.149 GC
/Helvetica 18 F
GS
[1 0 0 1 0 0] CT
-5.5 18 moveto 
1 -1 scale
(1) t 
GR
GR
GS
[1 0 0 1 1159 243.60001] CT
0.149 GC
/Helvetica 18 F
GS
[1 0 0 1 0 0] CT
-5.5 18 moveto 
1 -1 scale
(2) t 
GR
GR
GS
[1 0 0 1 1313.33337 243.60001] CT
0.149 GC
/Helvetica 18 F
GS
[1 0 0 1 0 0] CT
-5.5 18 moveto 
1 -1 scale
(3) t 
GR
GR
GS
[1 0 0 1 1467.66663 243.60001] CT
0.149 GC
/Helvetica 18 F
GS
[1 0 0 1 0 0] CT
-5.5 18 moveto 
1 -1 scale
(4) t 
GR
GR
GS
[1 0 0 1 1622 243.60001] CT
0.149 GC
/Helvetica 18 F
GS
[1 0 0 1 0 0] CT
-5.5 18 moveto 
1 -1 scale
(5) t 
GR
GR
GS
[1 0 0 1 927.50067 266.60001] CT
0.149 GC
/Helvetica 18 F
GS
[1 0 0 1 0 0] CT
-113.5 18 moveto 
1 -1 scale
(Time from stimulus onset \(s\)) t 
GR
GR
GS
0.149 GC
2 setlinecap
1 LJ
0.5 LW
N
233 238 M
233 27 L
S
GR
GS
0.149 GC
2 setlinecap
1 LJ
0.5 LW
N
233 238 M
246.89 238 L
S
GR
GS
0.149 GC
2 setlinecap
1 LJ
0.5 LW
N
233 185.25 M
246.89 185.25 L
S
GR
GS
0.149 GC
2 setlinecap
1 LJ
0.5 LW
N
233 132.5 M
246.89 132.5 L
S
GR
GS
0.149 GC
2 setlinecap
1 LJ
0.5 LW
N
233 79.75 M
246.89 79.75 L
S
GR
GS
0.149 GC
2 setlinecap
1 LJ
0.5 LW
N
233 27 M
246.89 27 L
S
GR
GS
[1 0 0 1 227.40002 238] CT
0.149 GC
/Helvetica 18 F
GS
[1 0 0 1 0 0] CT
-18 7 moveto 
1 -1 scale
(-4) t 
GR
GR
GS
[1 0 0 1 227.40002 185.25] CT
0.149 GC
/Helvetica 18 F
GS
[1 0 0 1 0 0] CT
-18 7 moveto 
1 -1 scale
(-2) t 
GR
GR
GS
[1 0 0 1 227.40002 132.5] CT
0.149 GC
/Helvetica 18 F
GS
[1 0 0 1 0 0] CT
-11 7 moveto 
1 -1 scale
(0) t 
GR
GR
GS
[1 0 0 1 227.40002 79.75] CT
0.149 GC
/Helvetica 18 F
GS
[1 0 0 1 0 0] CT
-11 7 moveto 
1 -1 scale
(2) t 
GR
GR
GS
[1 0 0 1 227.40002 26.99999] CT
0.149 GC
/Helvetica 18 F
GS
[1 0 0 1 0 0] CT
-11 7 moveto 
1 -1 scale
(4) t 
GR
GR
GS
[0 -1 1 0 206.89998 132.49989] CT
0.149 GC
/Helvetica 18 F
GS
[1 0 0 1 0 0] CT
-76.5 -4 moveto 
1 -1 scale
(Amplitude \(microV\)) t 
GR
GR
GS
[1 0 0 1 233 23] CT
0.149 GC
N
2.641 -0.516 M
2.641 -0.656 2.734 -0.781 QT
6.484 -4.5 L
2.734 -8.25 L
2.641 -8.328 2.641 -8.484 QT
2.641 -8.609 2.75 -8.727 QT
2.859 -8.844 3 -8.844 QT
3.125 -8.844 3.281 -8.734 QT
7 -5 L
10.719 -8.734 L
10.859 -8.844 10.984 -8.844 QT
11.125 -8.844 11.234 -8.734 QT
11.344 -8.625 11.344 -8.484 QT
11.344 -8.328 11.25 -8.25 QT
7.5 -4.5 L
11.25 -0.781 L
11.344 -0.656 11.344 -0.516 QT
11.344 -0.375 11.234 -0.266 QT
11.125 -0.156 10.984 -0.156 QT
10.844 -0.156 10.719 -0.297 QT
7 -4 L
3.281 -0.297 L
3.141 -0.156 3 -0.156 QT
2.859 -0.156 2.75 -0.273 QT
2.641 -0.391 2.641 -0.516 QT
cp
f
GR
GS
[1 0 0 1 247 23] CT
0.149 GC
/Helvetica 18 F
GS
[1 0 0 1 0 0] CT
0 0 moveto 
1 -1 scale
(10) t 
GR
GR
GS
[1 0 0 1 268 14] CT
0.149 GC
/Helvetica 14.4 F
GS
[1 0 0 1 0 0] CT
0 0 moveto 
1 -1 scale
(-3) t 
GR
GR
GS
[1 0 0 1 927.50085 24.75531] CT
/Helvetica-Bold 18 F
GS
[1 0 0 1 0 0] CT
-201 -4 moveto 
1 -1 scale
(Posterior signal across a single exemplary trial) t 
GR
GR
GS
1 0.949 0.8 RC
N
850.333 211.625 M
1313.333 211.625 L
1313.333 53.375 L
cp
f
GR
GS
1 0.949 0.8 RC
N
850.333 211.625 M
1313.333 53.375 L
850.333 53.375 L
cp
f
GR
GS
0.902 GC
N
387.333 211.625 M
541.667 211.625 L
541.667 53.375 L
cp
f
GR
GS
0.902 GC
N
387.333 211.625 M
541.667 53.375 L
387.333 53.375 L
cp
f
GR
GS
1 LJ
0.5 LW
N
232.834 141.832 M
233 141.12 L
233.309 144.487 L
233.617 151.779 L
233.926 156.352 L
234.235 154.299 L
234.543 149.895 L
234.852 148.123 L
235.161 149.197 L
235.469 150.164 L
235.778 148.712 L
236.087 145.678 L
236.395 143.992 L
236.704 145.891 L
237.013 150.844 L
237.321 154.614 L
237.63 151.969 L
237.939 142.769 L
238.247 135.089 L
238.556 137.837 L
238.865 145.7 L
239.173 145.216 L
239.482 136.769 L
239.791 130.959 L
240.099 131.165 L
240.408 132.08 L
240.717 127.767 L
241.025 118.924 L
241.334 114.393 L
241.643 119.968 L
241.951 129.68 L
242.26 135.395 L
242.569 136.167 L
242.877 135.762 L
243.186 136.521 L
243.495 136.677 L
243.803 134.95 L
244.112 134.701 L
244.421 138.688 L
244.729 143.846 L
245.038 146.224 L
245.347 146.589 L
245.655 147.11 L
245.964 147.777 L
246.273 149.352 L
246.581 152.727 L
246.89 155.772 L
247.199 157.132 L
247.507 159.036 L
247.816 160.377 L
248.125 156.72 L
248.433 151.68 L
248.742 152.981 L
249.051 158.397 L
249.359 162.634 L
249.668 166.481 L
249.977 171.293 L
250.285 176.232 L
250.594 178.79 L
250.903 176.04 L
251.211 167.891 L
251.52 157.353 L
251.829 147.655 L
252.137 140.115 L
252.446 134.511 L
252.755 130.552 L
253.063 128.859 L
253.372 130.12 L
253.681 131.368 L
253.989 127.337 L
254.298 118.24 L
254.607 110.361 L
254.915 107.496 L
255.224 108.336 L
255.533 110.903 L
255.841 113.072 L
256.15 111.871 L
256.459 107.738 L
256.767 104.673 L
257.076 103.933 L
257.385 104.561 L
257.693 106.87 L
258.002 110.862 L
258.311 114.158 L
258.619 112.801 L
258.928 110.278 L
259.237 116.186 L
259.545 126.477 L
259.854 129.667 L
260.163 127.61 L
260.471 126.733 L
260.78 126.404 L
261.089 126.081 L
261.397 128.267 L
261.706 132.216 L
262.015 134.205 L
262.323 133.072 L
262.632 131.825 L
262.941 133.407 L
263.249 136.188 L
263.558 138.141 L
263.867 140.832 L
264.175 144.29 L
264.484 145.836 L
264.793 145.508 L
265.101 147.427 L
265.41 154.089 L
265.719 160.45 L
266.027 161.165 L
266.336 160.261 L
266.645 164.352 L
266.953 172.292 L
267.262 177.815 L
267.571 179.185 L
267.879 180.318 L
268.188 182.118 L
268.497 181.06 L
268.805 175.876 L
269.114 168.15 L
269.423 159.449 L
269.731 150.786 L
270.04 143.048 L
270.349 136.57 L
270.657 129.602 L
270.966 121.467 L
271.275 114.561 L
271.583 108.85 L
271.892 101.527 L
272.201 93.343 L
272.509 88.394 L
272.818 87.353 L
273.127 84.628 L
273.435 75.849 L
273.744 67.59 L
274.053 69.975 L
274.361 77.56 L
274.67 78.09 L
274.979 74.366 L
275.287 74.998 L
275.596 79.552 L
275.905 83.878 L
276.213 87.631 L
276.522 92.855 L
276.831 99.797 L
277.139 106.278 L
277.448 112.198 L
277.757 120.837 L
278.065 134.128 L
278.374 149.907 L
278.683 164.952 L
278.991 178.257 L
279.3 188.468 L
279.609 192.434 L
279.917 189.973 L
280.226 186.066 L
280.535 184.463 L
280.843 183.111 L
281.152 179.152 L
281.461 172.902 L
281.769 165.347 L
282.078 156.098 L
282.387 146.686 L
282.695 141.242 L
283.004 139.82 L
283.313 138.723 L
283.621 136.94 L
283.93 134.809 L
284.239 132.074 L
284.547 130.272 L
284.856 130.551 L
285.165 131.29 L
285.473 131.268 L
285.782 130.984 L
286.091 129.676 L
286.399 126.975 L
286.708 126.318 L
287.017 129.113 L
287.325 130.27 L
287.634 127.156 L
287.943 124.509 L
288.251 123.889 L
288.56 121.452 L
288.869 118.435 L
289.177 119.113 L
289.486 120.479 L
289.795 116.035 L
290.103 106.571 L
290.412 98.608 L
290.721 97.04 L
291.029 100.953 L
291.338 104.732 L
291.647 107.826 L
291.955 112 L
292.264 112.729 L
292.573 109.325 L
292.881 108.497 L
293.19 111.92 L
293.499 115.96 L
293.807 120.207 L
294.116 124.699 L
294.425 128.1 L
294.733 132.273 L
295.042 138.356 L
295.351 143.91 L
295.659 148.91 L
295.968 155.309 L
296.277 162.105 L
296.585 168.02 L
296.894 173.609 L
297.203 179.122 L
297.511 183.587 L
297.82 186.181 L
298.129 187.631 L
298.437 188.342 L
298.746 188.379 L
299.055 187.264 L
299.363 182.513 L
299.672 174.484 L
299.981 167.864 L
300.289 164.477 L
300.598 161.388 L
300.907 156.466 L
301.215 149.289 L
301.524 138.911 L
301.833 128.024 L
302.141 122.38 L
302.45 122.071 L
302.759 120.933 L
303.067 115.702 L
303.376 109.65 L
303.685 105.83 L
303.993 103.853 L
304.302 103.122 L
304.611 102.954 L
304.919 101.317 L
305.228 97.189 L
305.537 93.644 L
305.845 95.625 L
306.154 101.35 L
306.463 103.73 L
306.771 102.132 L
307.08 101.534 L
307.389 103.783 L
307.697 106.453 L
308.006 105.927 L
308.315 102.591 L
308.623 100.953 L
308.932 100.842 L
309.241 97.023 L
309.549 90.617 L
309.858 92.568 L
310.167 107.335 L
310.475 120.839 L
310.784 121.812 L
311.093 119.024 L
311.401 121.906 L
311.71 127.388 L
312.019 131.49 L
312.327 135.473 L
312.636 140.078 L
312.945 144.651 L
313.253 149.24 L
313.562 152.628 L
313.871 154.27 L
314.179 157.296 L
314.488 163.419 L
314.797 168.842 L
315.105 170.033 L
315.414 168.933 L
315.723 168.874 L
316.031 171.073 L
316.34 175.428 L
316.649 179.248 L
316.957 178.662 L
317.266 174.484 L
317.575 171.116 L
317.883 169.031 L
318.192 165.58 L
318.501 159.529 L
318.809 151.238 L
319.118 142.398 L
319.427 134.061 L
319.735 125.62 L
320.044 117.089 L
320.353 110.234 L
320.661 105.962 L
320.97 101.64 L
321.279 94.416 L
321.587 87.748 L
321.896 87.085 L
322.205 90.329 L
322.513 92.253 L
322.822 92.947 L
323.131 93.053 L
323.439 90.403 L
323.748 86.796 L
324.057 87.264 L
324.365 91.471 L
324.674 95.131 L
324.983 98.017 L
325.291 101.87 L
325.6 105.232 L
325.909 107.58 L
326.217 112.588 L
326.526 121.382 L
326.835 128.492 L
327.143 130.569 L
327.452 132.428 L
327.761 138.646 L
328.069 146.269 L
328.378 150.585 L
328.687 153.864 L
328.995 160.34 L
329.304 166.613 L
329.613 169.86 L
329.921 173.727 L
330.23 179.672 L
330.539 184.389 L
330.847 185.651 L
331.156 185.373 L
331.465 186.839 L
331.773 190.736 L
332.082 194.181 L
332.391 195.942 L
332.699 197.895 L
333.008 200.048 L
333.317 200.611 L
333.625 198.673 L
333.934 195.66 L
334.243 194.611 L
334.551 195.99 L
334.86 196.84 L
335.169 194.422 L
335.477 188.31 L
335.786 180.046 L
336.095 171.566 L
336.403 164.808 L
336.712 161.248 L
337.021 157.43 L
337.329 148.449 L
337.638 137.467 L
337.947 130.143 L
338.255 124.23 L
338.564 115.675 L
338.873 107.831 L
339.181 104.014 L
339.49 99.823 L
339.799 92.881 L
340.107 87.833 L
340.416 87.542 L
340.725 88.693 L
341.033 85.941 L
341.342 80.159 L
341.651 78.467 L
341.959 82.554 L
342.268 87.093 L
342.577 89.705 L
342.885 92.474 L
343.194 96.465 L
343.503 101.035 L
343.811 105.973 L
344.12 113.168 L
344.429 123.903 L
344.737 134.876 L
345.046 142.689 L
345.355 149.872 L
345.663 159.707 L
345.972 169.01 L
346.281 174.196 L
346.589 179.884 L
346.898 190.503 L
347.207 199.444 L
347.515 201.73 L
347.824 203.917 L
348.133 209.098 L
348.441 213.014 L
348.75 217.115 L
349.059 224.445 L
349.367 230.102 L
349.676 229.97 L
349.985 227.01 L
350.293 224.243 L
350.602 222.452 L
350.911 221.629 L
351.219 219.647 L
351.528 214.551 L
351.837 208.041 L
352.145 202.681 L
352.454 197.832 L
352.763 191.367 L
353.071 182.185 L
353.38 172.031 L
353.689 164.874 L
353.997 161.073 L
354.306 155.677 L
354.615 144.582 L
354.923 129.812 L
355.232 117.93 L
355.541 112.058 L
355.849 107.877 L
356.158 101.701 L
356.467 96.651 L
356.775 96.988 L
357.084 100.71 L
357.393 100.883 L
357.701 96.412 L
358.01 93.249 L
358.319 92.226 L
358.627 90.205 L
358.936 88.795 L
359.245 91.827 L
359.553 100.398 L
359.862 110.282 L
360.171 113.94 L
360.479 111.009 L
360.788 113.263 L
361.097 128.356 L
361.405 145.262 L
361.714 151.798 L
362.023 152.02 L
362.331 155.942 L
362.64 165.099 L
362.949 174.155 L
363.257 180.36 L
363.566 184.999 L
363.875 189.367 L
364.183 193.488 L
364.492 197.646 L
364.801 202.246 L
365.109 205.636 L
365.418 206.464 L
365.727 206.924 L
366.035 209.629 L
366.344 213.042 L
366.653 212.891 L
366.961 209.207 L
367.27 207.592 L
367.579 211.291 L
367.887 216.465 L
368.196 218.253 L
368.505 216.413 L
368.813 212.437 L
369.122 207.601 L
369.431 202.828 L
369.739 198.156 L
370.048 194.059 L
370.357 189.077 L
370.665 178.585 L
370.974 161.705 L
371.283 145.035 L
371.591 133.668 L
371.9 125.513 L
372.209 118.27 L
372.517 112.611 L
372.826 107.584 L
373.135 102.321 L
373.443 97.49 L
373.752 91.219 L
374.061 82.954 L
374.369 77.413 L
374.678 76.92 L
374.987 78.612 L
375.295 81.27 L
375.604 84.337 L
375.913 84.958 L
376.221 84.758 L
376.53 88.684 L
376.839 95.805 L
377.147 103.377 L
377.456 113.409 L
377.765 126.642 L
378.073 137.122 L
378.382 141.355 L
378.691 144.958 L
378.999 152.048 L
379.308 162.851 L
379.617 177.828 L
379.925 191.253 L
380.234 197.117 L
380.543 198.996 L
380.851 202.199 L
381.16 206.091 L
381.469 208.84 L
381.777 210.681 L
382.086 210.836 L
382.395 208.739 L
382.703 207.427 L
383.012 208.999 L
383.321 209.332 L
383.629 204.55 L
383.938 196.901 L
384.247 190.042 L
384.555 184.238 L
384.864 176.974 L
385.173 166.911 L
385.481 156.312 L
385.79 147.714 L
386.099 140.96 L
386.407 134.849 L
386.716 129.674 L
387.025 125.734 L
387.333 121.116 L
387.642 114.337 L
387.951 106.424 L
388.259 99.502 L
388.568 95.957 L
388.877 96.08 L
389.185 96.28 L
389.494 94.747 L
389.803 94.013 L
390.111 94.952 L
390.42 95.373 L
390.729 94.499 L
391.037 94.177 L
391.346 95.734 L
391.655 98.636 L
391.963 102.513 L
392.272 105.763 L
392.581 106.292 L
392.889 106.617 L
393.198 111.023 L
393.507 118.518 L
393.815 124.066 L
394.124 125.028 L
394.433 123.199 L
394.741 122.573 L
395.05 126.182 L
395.359 134.176 L
395.667 143.956 L
395.976 152.289 L
396.285 157.97 L
396.593 163.493 L
396.902 171.933 L
397.211 179.495 L
397.519 180.398 L
397.828 180.276 L
398.137 188.784 L
398.445 201.041 L
398.754 206.351 L
399.063 204.454 L
399.371 201.129 L
399.68 199.865 L
399.989 201.647 L
400.297 206.64 L
400.606 213.801 L
400.915 220.504 L
401.223 222.963 L
401.532 219.947 L
401.841 213.738 L
402.149 206.848 L
402.458 200.293 L
402.767 192.719 L
403.075 182.843 L
403.384 172.121 L
403.693 161.431 L
404.001 148.034 L
404.31 128.833 L
404.619 107.827 L
404.927 94.331 L
405.236 88.017 L
405.545 81.255 L
405.853 75.414 L
406.162 74.263 L
406.471 73.161 L
406.779 68.359 L
407.088 64.037 L
407.397 65.217 L
407.705 71.263 L
408.014 78.537 L
408.323 84.508 L
408.631 90.204 L
408.94 97.851 L
409.249 104.439 L
409.557 106.34 L
409.866 107.736 L
410.175 114.001 L
410.483 122.801 L
410.792 129.155 L
411.101 132.96 L
411.409 136.561 L
411.718 140.042 L
412.027 141.026 L
412.335 137.923 L
412.644 135.175 L
412.953 140.82 L
413.261 151.961 L
413.57 156.145 L
413.879 150.39 L
414.187 142.014 L
414.496 136.505 L
414.805 134.497 L
415.113 133.447 L
415.422 129.984 L
415.731 126.039 L
416.039 126.725 L
416.348 130.901 L
416.657 133.571 L
416.965 133.322 L
417.274 132.14 L
417.583 131.857 L
417.891 132.289 L
418.2 133.475 L
418.509 136.471 L
418.817 141.08 L
419.126 145.522 L
419.435 149.029 L
419.743 151.937 L
420.052 153.759 L
420.361 155.099 L
420.669 156.072 L
420.978 153.971 L
421.287 149.419 L
421.595 148.416 L
421.904 153.341 L
422.213 157.318 L
422.521 152.416 L
422.83 141.386 L
423.139 133.251 L
423.447 130.728 L
423.756 129.501 L
424.065 125.136 L
424.373 118.49 L
424.682 113.769 L
424.991 110.48 L
425.299 104.55 L
425.608 96.933 L
425.917 92.665 L
426.225 91.76 L
426.534 90.175 L
426.843 88.784 L
427.151 91.549 L
427.46 96.28 L
427.769 96.177 L
428.077 90.158 L
428.386 87.428 L
428.695 94.468 L
429.003 103.791 L
429.312 109.164 L
429.621 116.325 L
429.929 128.946 L
430.238 138.601 L
430.547 139.244 L
430.855 138.502 L
431.164 143.15 L
431.473 149.005 L
431.781 150.834 L
432.09 149.174 L
432.399 147.102 L
432.707 146.552 L
433.016 146.19 L
433.325 144.226 L
433.633 142.58 L
433.942 143.413 L
434.251 145.041 L
434.559 144.277 L
434.868 141.273 L
435.177 138.983 L
435.485 137.817 L
435.794 135.224 L
436.103 129.6 L
436.411 122.807 L
436.72 118.151 L
437.029 114.037 L
437.337 105.921 L
437.646 99.281 L
437.955 103.11 L
438.263 111.058 L
438.572 112.846 L
438.881 110.714 L
439.189 109.903 L
439.498 109.148 L
439.807 106.589 L
440.115 103.371 L
440.424 100.143 L
440.733 97.014 L
441.041 94.639 L
441.35 94.596 L
441.659 98.285 L
441.967 103.433 L
442.276 104.295 L
442.585 98.322 L
442.893 91.82 L
443.202 92.688 L
443.511 98.106 L
443.819 99.369 L
444.128 96.32 L
444.437 94.679 L
444.745 94.309 L
445.054 91.825 L
445.363 89.074 L
445.671 90.237 L
445.98 93.203 L
446.289 91.857 L
446.597 88.169 L
446.906 89.838 L
447.215 95.436 L
447.523 97.349 L
447.832 95.053 L
448.141 94.13 L
448.449 96.923 L
448.758 100.758 L
449.067 102.426 L
449.375 100.769 L
449.684 100.284 L
449.993 108.563 L
450.301 121.898 L
450.61 128.608 L
450.919 127.535 L
451.227 125.878 L
451.536 127.366 L
451.845 130.249 L
452.153 130.52 L
452.462 125.932 L
452.771 119.358 L
453.079 116.596 L
453.388 117.849 L
453.697 116.949 L
454.005 112.224 L
454.314 107.046 L
454.623 102.367 L
454.931 97.527 L
455.24 93.246 L
455.549 92.046 L
455.857 94.942 L
456.166 98.86 L
456.475 100.191 L
456.783 98.032 L
457.092 93.679 L
457.401 89.707 L
457.709 88.256 L
458.018 89.221 L
458.327 91.725 L
458.635 94.476 L
458.944 96.285 L
459.253 98.276 L
459.561 101.647 L
459.87 105.717 L
460.179 109.687 L
460.487 113.035 L
460.796 114.639 L
461.105 115.06 L
461.413 117.237 L
461.722 121.81 L
462.031 126.612 L
462.339 129.829 L
462.648 129.912 L
462.957 127.091 L
463.265 124.428 L
463.574 123.481 L
463.883 123.259 L
464.191 121.48 L
464.5 116.149 L
464.809 111.123 L
465.117 112.378 L
465.426 115.916 L
465.735 114.222 L
466.043 109.129 L
466.352 105.037 L
466.661 101.729 L
466.969 99.39 L
467.278 99.736 L
467.587 102.159 L
467.895 104.478 L
468.204 107.853 L
468.513 114.969 L
468.821 121.844 L
469.13 121.813 L
469.439 115.899 L
469.747 110.466 L
470.056 108.909 L
470.365 110.682 L
470.673 112.615 L
470.982 110.797 L
471.291 106.372 L
471.599 105.739 L
471.908 110.047 L
472.217 112.527 L
472.525 110.448 L
472.834 108.97 L
473.143 110.603 L
473.451 110.568 L
473.76 105.5 L
474.069 98.722 L
474.377 96.714 L
474.686 102.635 L
474.995 111.652 L
475.303 116.615 L
475.612 116.396 L
475.921 114.053 L
476.229 111.91 L
476.538 110.447 L
476.847 109.651 L
477.155 109.812 L
477.464 109.533 L
477.773 107.415 L
478.081 105.107 L
478.39 103.088 L
478.699 99.379 L
479.007 96.53 L
479.316 98.251 L
479.625 99.128 L
479.933 91.556 L
480.242 82.162 L
480.551 84.172 L
480.859 93.977 L
481.168 98.563 L
481.477 97.72 L
481.785 98.362 L
482.094 100.805 L
482.403 101.637 L
482.711 102.313 L
483.02 105.795 L
483.329 109.431 L
483.637 110.699 L
483.946 112.171 L
484.255 115.615 L
484.563 118.944 L
484.872 119.283 L
485.181 116.854 L
485.489 115.385 L
485.798 115.909 L
486.107 115.463 L
486.415 115.489 L
486.724 119.837 L
487.033 125.593 L
487.341 128.886 L
487.65 131.891 L
487.959 136.087 L
488.267 137.79 L
488.576 135.123 L
488.885 131.282 L
489.193 129.264 L
489.502 129.506 L
489.811 130.855 L
490.119 130.577 L
490.428 126.323 L
490.737 120.044 L
491.045 116.815 L
491.354 118.128 L
491.663 119.72 L
491.971 117.258 L
492.28 113.226 L
492.589 111.552 L
492.897 109.093 L
493.206 104.515 L
493.515 105.295 L
493.823 113.549 L
494.132 119.816 L
494.441 118.422 L
494.749 112.24 L
495.058 105.653 L
495.367 103.306 L
495.675 106.782 L
495.984 111.006 L
496.293 112.857 L
496.601 115.965 L
496.91 120.94 L
497.219 124.254 L
497.527 125.534 L
497.836 125.844 L
498.145 126.139 L
498.453 128.06 L
498.762 131.917 L
499.071 136.116 L
499.379 137.36 L
499.688 134.644 L
499.997 133.279 L
500.305 137.484 L
500.614 142.798 L
500.923 143.371 L
501.231 140.136 L
501.54 136.491 L
501.849 134.324 L
502.157 135.457 L
502.466 139.959 L
502.775 144.437 L
503.083 145.753 L
503.392 144.485 L
503.701 141.8 L
504.009 137.727 L
504.318 134.116 L
504.627 133.167 L
504.935 134.721 L
505.244 137.47 L
505.553 140.572 L
505.861 142.966 L
506.17 143.2 L
506.479 141.628 L
506.787 140.148 L
507.096 139.176 L
507.405 138.544 L
507.713 138.844 L
508.022 139.099 L
508.331 137.25 L
508.639 133.518 L
508.948 130.905 L
509.257 131.952 L
509.565 135.16 L
509.874 138.079 L
510.183 141.467 L
510.491 144.383 L
510.8 142.657 L
511.109 137.41 L
511.417 135.501 L
511.726 138.685 L
512.035 141.591 L
512.343 140.688 L
512.652 138.796 L
512.961 139.504 L
513.269 140.203 L
513.578 137.044 L
513.887 131.985 L
514.195 128.339 L
514.504 126.335 L
514.813 125.318 L
515.121 126.565 L
515.43 131.101 L
515.739 136.078 L
516.047 136.319 L
516.356 132.224 L
516.665 133.548 L
516.973 144.245 L
517.282 153.368 L
517.591 153.829 L
517.899 151.219 L
518.208 151.13 L
518.517 153.534 L
518.825 156.452 L
519.134 157.356 L
519.443 154.084 L
519.751 148.954 L
520.06 147.481 L
520.369 148.752 L
520.677 148.127 L
520.986 146.588 L
521.295 145.765 L
521.603 145.712 L
521.912 148.819 L
522.221 154.511 L
522.529 158.196 L
522.838 158.228 L
523.147 155.724 L
523.455 152.319 L
523.764 151.151 L
524.073 154.139 L
524.381 157.963 L
524.69 156.862 L
524.999 150.87 L
525.307 146.604 L
525.616 147.382 L
525.925 148.758 L
526.233 146.19 L
526.542 141.029 L
526.851 137.478 L
527.159 136.089 L
527.468 134.8 L
527.777 133.662 L
528.085 132.504 L
528.394 131.092 L
528.703 130.927 L
529.011 132.126 L
529.32 133.041 L
529.629 133.679 L
529.937 134.986 L
530.246 135.755 L
530.555 134.779 L
530.863 133.049 L
531.172 133.513 L
531.481 138.602 L
531.789 145.554 L
532.098 148.814 L
532.407 148.534 L
532.715 149.112 L
533.024 149.511 L
533.333 143.751 L
533.641 133.066 L
533.95 130.003 L
534.259 139.246 L
534.567 145.757 L
534.876 139.618 L
535.185 130.443 L
535.493 127.772 L
535.802 129.022 L
536.111 127.147 L
536.419 120.592 L
536.728 114.6 L
537.037 113.639 L
537.345 116.425 L
537.654 119.597 L
537.963 121.837 L
538.271 123.61 L
538.58 124.727 L
538.889 125.544 L
539.197 127.542 L
539.506 129.606 L
539.815 130.381 L
540.123 131.662 L
540.432 133.111 L
540.741 132.905 L
541.049 134.86 L
541.358 141.684 L
541.667 148.012 L
541.975 149.223 L
542.284 146.869 L
542.593 144.557 L
542.901 144.271 L
543.21 145.269 L
543.519 145.496 L
543.827 143.735 L
544.136 140.896 L
544.445 138.028 L
544.753 134.274 L
545.062 129.478 L
545.371 126.002 L
545.679 126.587 L
545.988 130.941 L
546.297 134.618 L
546.605 133.339 L
546.914 128.863 L
547.223 127.285 L
547.531 130.117 L
547.84 133.243 L
548.149 133.969 L
548.457 134.155 L
548.766 136.09 L
549.075 138.26 L
549.383 139.096 L
549.692 139.38 L
550.001 140.519 L
550.309 143.352 L
550.618 146.127 L
550.927 146.432 L
551.235 144.32 L
551.544 142.003 L
551.853 141.551 L
552.161 141.241 L
552.47 136.535 L
552.779 127.246 L
553.087 119.63 L
553.396 119.126 L
553.705 121.956 L
554.013 120.341 L
554.322 114.975 L
554.631 111.343 L
554.939 109.499 L
555.248 107.179 L
555.557 106.408 L
555.865 109.118 L
556.174 113.036 L
556.483 116.306 L
556.791 118.295 L
557.1 118.161 L
557.409 117.473 L
557.717 119.943 L
558.026 127.164 L
558.335 136.041 L
558.643 141.958 L
558.952 144.391 L
559.261 148.239 L
559.569 157.346 L
559.878 166.493 L
560.187 168.616 L
560.495 166.836 L
560.804 167.14 L
561.113 166.725 L
561.421 160.951 L
561.73 153.927 L
562.039 150.95 L
562.347 147.899 L
562.656 140.032 L
562.965 131.779 L
563.273 127.057 L
563.582 122.471 L
563.891 116.749 L
564.199 113.471 L
564.508 112.45 L
564.817 108.657 L
565.125 101.039 L
565.434 94.821 L
565.743 93.728 L
566.051 96.154 L
566.36 97.799 L
566.669 96.596 L
566.977 94.633 L
567.286 94.604 L
567.595 95.795 L
567.903 95.717 L
568.212 95.255 L
568.521 97.562 L
568.829 103.115 L
569.138 109.636 L
569.447 115.491 L
569.755 120.936 L
570.064 126.07 L
570.373 128.114 L
570.681 125.561 L
570.99 124.332 L
571.299 130.46 L
571.607 138.555 L
571.916 141.56 L
572.225 143.081 L
572.533 147.568 L
572.842 152.317 L
573.151 152.804 L
573.459 148.911 L
573.768 145.302 L
574.077 144.08 L
574.385 142.165 L
574.694 139.81 L
575.003 140.073 L
575.311 140.092 L
575.62 135.745 L
575.929 129.509 L
576.237 126.16 L
576.546 127.026 L
576.855 130.543 L
577.163 134.552 L
577.472 137.738 L
577.781 139.419 L
578.089 139.801 L
578.398 139.893 L
578.707 140.356 L
579.015 142.107 L
579.324 145.548 L
579.633 148.736 L
579.941 150.852 L
580.25 154.602 L
580.559 160.069 L
580.867 162.065 L
581.176 158.447 L
581.485 153.728 L
581.793 151.323 L
582.102 149.663 L
582.411 146.641 L
582.719 142.478 L
583.028 139.15 L
583.337 137.419 L
583.645 134.873 L
583.954 129.926 L
584.263 124.736 L
584.571 120.878 L
584.88 117.178 L
585.189 113.111 L
585.497 109.34 L
585.806 107.319 L
586.115 108.07 L
586.423 108.131 L
586.732 104.253 L
587.041 100.542 L
587.349 102.313 L
587.658 107.875 L
587.967 110.89 L
588.275 109.336 L
588.584 108.808 L
588.893 114.69 L
589.201 124.608 L
589.51 131.865 L
589.819 134.231 L
590.127 136.188 L
590.436 141.527 L
590.745 146.354 L
591.053 146.055 L
591.362 145.143 L
591.671 149.176 L
591.979 153.723 L
592.288 153.056 L
592.597 150.041 L
592.905 148.175 L
593.214 146.332 L
593.523 143.82 L
593.831 141.022 L
594.14 138.166 L
594.449 136.11 L
594.757 135.773 L
595.066 136.146 L
595.375 133.41 L
595.683 125.127 L
595.992 117.97 L
596.301 121.343 L
596.609 132.381 L
596.918 143.255 L
597.227 153.05 L
597.535 160.464 L
597.844 162.353 L
598.153 161.458 L
598.461 163.025 L
598.77 167.166 L
599.079 169.673 L
599.387 167.22 L
599.696 159.454 L
600.005 148.908 L
600.313 138.765 L
600.622 129.584 L
600.931 122.053 L
601.239 117.741 L
601.548 113.5 L
601.857 104.33 L
602.165 91.893 L
602.474 81.956 L
602.783 75.41 L
603.091 67.545 L
603.4 56.21 L
603.709 46.416 L
604.017 43.997 L
604.326 47.381 L
604.635 50.018 L
604.943 50.069 L
605.252 52.223 L
605.561 60.024 L
605.869 70.93 L
606.178 78.347 L
606.487 80.419 L
606.795 82.939 L
607.104 88.652 L
607.413 95.358 L
607.721 103.51 L
608.03 114.973 L
608.339 126.017 L
608.647 129.927 L
608.956 128.841 L
609.265 131.373 L
609.573 138.467 L
609.882 143.814 L
610.191 144.4 L
610.499 142.727 L
610.808 142.906 L
611.117 146.168 L
611.425 148.695 L
611.734 147.09 L
612.043 141.81 L
612.351 134.9 L
612.66 128.782 L
612.969 124.302 L
613.277 121.372 L
613.586 121.267 L
613.895 124.246 L
614.203 127.39 L
614.512 128.002 L
614.821 127.529 L
615.129 129.674 L
615.438 134.289 L
615.747 136.297 L
616.055 133.511 L
616.364 131.346 L
616.673 134.845 L
616.981 138.538 L
617.29 133.884 L
617.599 127.457 L
617.907 130.584 L
618.216 134.898 L
618.525 128.157 L
618.833 116.965 L
619.142 112.158 L
619.451 111.655 L
619.759 108.526 L
620.068 103.474 L
620.377 100.851 L
620.685 100.014 L
620.994 97.214 L
621.303 91.714 L
621.611 86.622 L
621.92 85.259 L
622.229 86.223 L
622.537 86.012 L
622.846 85.98 L
623.155 88.602 L
623.463 92.283 L
623.772 95.912 L
624.081 101.541 L
624.389 109.744 L
624.698 116.961 L
625.007 119.779 L
625.315 120.26 L
625.624 123.701 L
625.933 131.38 L
626.241 139.348 L
626.55 144.839 L
626.859 149.695 L
627.167 157.194 L
627.476 166.635 L
627.785 173.04 L
628.093 175.092 L
628.402 176.58 L
628.711 177.864 L
629.019 176.075 L
629.328 173.753 L
629.637 175.478 L
629.945 178.156 L
630.254 176.085 L
630.563 170.459 L
630.871 165.342 L
631.18 160.269 L
631.489 153.376 L
631.797 146.738 L
632.106 142.136 L
632.415 137.748 L
632.723 134.697 L
633.032 136.778 L
633.341 140.896 L
633.649 141.024 L
633.958 139.064 L
634.267 139.524 L
634.575 141.241 L
634.884 140.244 L
635.193 134.565 L
635.501 126.333 L
635.81 119.002 L
636.119 115.006 L
636.427 117.838 L
636.736 126.355 L
637.045 132.013 L
637.353 130.413 L
637.662 124.511 L
637.971 119.161 L
638.279 117.217 L
638.588 115.938 L
638.897 110.216 L
639.205 99.887 L
639.514 90.658 L
639.823 87.946 L
640.131 91.666 L
640.44 97.018 L
640.749 99.604 L
641.057 98.922 L
641.366 97.152 L
641.675 96.832 L
641.983 100.099 L
642.292 107.474 L
642.601 115.794 L
642.909 120.919 L
643.218 123.072 L
643.527 124.72 L
643.835 126.471 L
644.144 128.833 L
644.453 132.233 L
644.761 135.443 L
645.07 139.128 L
645.379 144.112 L
645.687 145.225 L
645.996 138.085 L
646.305 129.381 L
646.613 128.439 L
646.922 133.502 L
647.231 136.619 L
647.539 136.052 L
647.848 135.568 L
648.157 136.777 L
648.465 138.36 L
648.774 140.355 L
649.083 143.183 L
649.391 143.635 L
649.7 140.376 L
650.009 138.177 L
650.317 139.805 L
650.626 142.888 L
650.935 144.5 L
651.243 143.829 L
651.552 143.019 L
651.861 143.764 L
652.169 142.668 L
652.478 134.777 L
652.787 124.27 L
653.095 123.848 L
653.404 133.707 L
653.713 139.109 L
654.021 135.642 L
654.33 131.037 L
654.639 128.924 L
654.947 127.821 L
655.256 126.955 L
655.565 125.98 L
655.873 124.867 L
656.182 125.6 L
656.491 128.363 L
656.799 127.784 L
657.108 119.136 L
657.417 108.384 L
657.725 105.475 L
658.034 108.42 L
658.343 108.774 L
658.651 105.551 L
658.96 102.821 L
659.269 101.487 L
659.577 98.922 L
659.886 95.012 L
660.195 92.849 L
660.503 93.417 L
660.812 94.622 L
661.121 94.103 L
661.429 91.48 L
661.738 88.976 L
662.047 90.887 L
662.355 99.472 L
662.664 110.581 L
662.973 117.915 L
663.281 121.558 L
663.59 125.892 L
663.899 131.471 L
664.207 136.187 L
664.516 140.625 L
664.825 148.158 L
665.133 160.14 L
665.442 172.039 L
665.751 179.43 L
666.059 184.423 L
666.368 190.952 L
666.677 199.275 L
666.985 208.416 L
667.294 218.724 L
667.603 228.266 L
667.911 232.142 L
668.22 230.759 L
668.529 231.417 L
668.837 234.431 L
669.146 232.103 L
669.455 225.856 L
669.763 221.86 L
670.072 215.409 L
670.381 203.54 L
670.689 193.979 L
670.998 188.444 L
671.307 179.225 L
671.615 163.738 L
671.924 146.694 L
672.233 130.56 L
672.541 114.693 L
672.85 99.835 L
673.159 87.167 L
673.467 76.913 L
673.776 69.343 L
674.085 64.702 L
674.393 61.94 L
674.702 58.685 L
675.011 53.042 L
675.319 45.769 L
675.628 41.615 L
675.937 44.325 L
676.245 50.733 L
676.554 56.638 L
676.863 61.86 L
677.171 67.388 L
677.48 74.426 L
677.789 82.216 L
678.097 87.936 L
678.406 92.832 L
678.715 101.139 L
679.023 110.762 L
679.332 116.63 L
679.641 122.769 L
679.949 135.647 L
680.258 151.51 L
680.567 160.973 L
680.875 160.748 L
681.184 156.973 L
681.493 157.897 L
681.801 165.537 L
682.11 175.254 L
682.419 182.712 L
682.727 188.466 L
683.036 194.046 L
683.345 199.318 L
683.653 204.392 L
683.962 208.587 L
684.271 209.08 L
684.579 205.853 L
684.888 203.9 L
685.197 205.143 L
685.505 206.836 L
685.814 208.156 L
686.123 208.312 L
686.431 204.247 L
686.74 200.575 L
687.049 205.283 L
687.357 210.286 L
687.666 203.515 L
687.975 188.842 L
688.283 175.683 L
688.592 166.073 L
688.901 156.785 L
689.209 146.708 L
689.518 138.114 L
689.827 131.098 L
690.135 122.954 L
690.444 112.253 L
690.753 100.164 L
691.061 90.908 L
691.37 88.332 L
691.679 89.629 L
691.987 88.637 L
692.296 84.856 L
692.605 82.84 L
692.913 83.252 L
693.222 82.367 L
693.531 79.748 L
693.839 77.233 L
694.148 75.9 L
694.457 77.415 L
694.765 80.569 L
695.074 81.729 L
695.383 82.216 L
695.691 86.896 L
696 96.35 L
696.309 106.147 L
696.617 113.574 L
696.926 120.727 L
697.235 129.438 L
697.543 138.033 L
697.852 145.338 L
698.161 153.262 L
698.469 162.219 L
698.778 169.278 L
699.087 173.37 L
699.395 177.782 L
699.704 184.562 L
700.013 192.244 L
700.321 199.34 L
700.63 202.254 L
700.939 198.14 L
701.247 195.264 L
701.556 201.558 L
701.865 208.165 L
702.173 205.671 L
702.482 198.975 L
702.791 194.11 L
703.099 188.778 L
703.408 180.1 L
703.717 169.999 L
704.025 162.936 L
704.334 161.031 L
704.643 160.57 L
704.951 155.885 L
705.26 147.412 L
705.569 141.198 L
705.877 139.553 L
706.186 137.181 L
706.495 129.122 L
706.803 118.782 L
707.112 112.655 L
707.421 111.508 L
707.729 111.192 L
708.038 108.838 L
708.347 104.775 L
708.655 100.324 L
708.964 96.081 L
709.273 91.138 L
709.581 86.487 L
709.89 86.122 L
710.199 88.505 L
710.507 86.136 L
710.816 78.965 L
711.125 74.76 L
711.433 76.865 L
711.742 81.286 L
712.051 82.6 L
712.359 80.978 L
712.668 81.711 L
712.977 86.49 L
713.285 92.412 L
713.594 97.655 L
713.903 102.411 L
714.211 108.796 L
714.52 119.236 L
714.829 132.775 L
715.137 144.979 L
715.446 152.569 L
715.755 157.908 L
716.063 166.625 L
716.372 179.354 L
716.681 190.22 L
716.989 195.789 L
717.298 199.99 L
717.607 207.241 L
717.915 214.253 L
718.224 214.528 L
718.533 209.592 L
718.841 206.514 L
719.15 205.64 L
719.459 203.35 L
719.767 201.778 L
720.076 200.304 L
720.385 189.909 L
720.693 171.823 L
721.002 159.987 L
721.311 156.128 L
721.619 151.097 L
721.928 143.4 L
722.237 135.415 L
722.545 124.927 L
722.854 111.197 L
723.163 99.512 L
723.471 94.161 L
723.78 93.436 L
724.089 91.899 L
724.397 87.118 L
724.706 84.528 L
725.015 88.905 L
725.323 93.418 L
725.632 89.416 L
725.941 81.604 L
726.249 80.927 L
726.558 87.436 L
726.867 92.814 L
727.175 94.719 L
727.484 95.214 L
727.793 93.714 L
728.101 92.567 L
728.41 98.143 L
728.719 109.326 L
729.027 118.784 L
729.336 125.726 L
729.645 133.288 L
729.953 139.667 L
730.262 142.509 L
730.571 144.754 L
730.879 149.936 L
731.188 157.471 L
731.497 164.043 L
731.805 167.82 L
732.114 169.652 L
732.423 170.736 L
732.731 172.256 L
733.04 174.903 L
733.349 177.127 L
733.657 177.625 L
733.966 178.461 L
734.275 179.286 L
734.583 174.441 L
734.892 163.379 L
735.201 152.811 L
735.509 144.47 L
735.818 134.905 L
736.127 126.383 L
736.435 124.063 L
736.744 125.866 L
737.053 125.751 L
737.361 122.659 L
737.67 118.342 L
737.979 112.957 L
738.287 108.292 L
738.596 106.885 L
738.905 105.957 L
739.213 101.41 L
739.522 96.407 L
739.831 96.763 L
740.139 102.582 L
740.448 108.168 L
740.757 108.555 L
741.065 106.04 L
741.374 104.04 L
741.683 102.097 L
741.991 101.699 L
742.3 105.253 L
742.609 111.707 L
742.917 118.287 L
743.226 121.639 L
743.535 121.176 L
743.843 122.922 L
744.152 131.116 L
744.461 140.888 L
744.769 146.097 L
745.078 147.61 L
745.387 149.579 L
745.695 153.165 L
746.004 155.08 L
746.313 152.871 L
746.621 150.077 L
746.93 149.665 L
747.239 148.614 L
747.547 143.814 L
747.856 137.948 L
748.165 136.13 L
748.473 138.591 L
748.782 140.51 L
749.091 139.246 L
749.399 138.621 L
749.708 141.725 L
750.017 144.715 L
750.325 142.837 L
750.634 136.333 L
750.943 129.482 L
751.251 124.676 L
751.56 119.716 L
751.869 112.013 L
752.177 103.296 L
752.486 97.768 L
752.795 96.611 L
753.103 98.659 L
753.412 101.07 L
753.721 100.583 L
754.029 99.019 L
754.338 101.027 L
754.647 105.556 L
754.955 108.25 L
755.264 109.483 L
755.573 111.584 L
755.881 114.76 L
756.19 119.075 L
756.499 124.579 L
756.807 130.037 L
757.116 133.901 L
757.425 137.777 L
757.733 144.827 L
758.042 152.622 L
758.351 157.047 L
758.659 160.47 L
758.968 165.625 L
759.277 168.09 L
759.585 163.306 L
759.894 156.263 L
760.203 155.554 L
760.511 158.49 L
760.82 156.527 L
761.129 151.939 L
761.437 150.5 L
761.746 149.31 L
762.055 144.281 L
762.363 137.322 L
762.672 131.531 L
762.981 128.014 L
763.289 127.733 L
763.598 131.192 L
763.907 136.75 L
764.215 140.76 L
764.524 140.706 L
764.833 138.364 L
765.141 136.327 L
765.45 133.869 L
765.759 130.632 L
766.067 128.112 L
766.376 126.08 L
766.685 123.702 L
766.993 121.41 L
767.302 118.765 L
767.611 114.992 L
767.919 112.101 L
768.228 112.235 L
768.537 114.18 L
768.845 115.953 L
769.154 117.276 L
769.463 119.129 L
769.771 122.299 L
770.08 125.744 L
770.389 127.192 L
770.697 125.592 L
771.006 122.321 L
771.315 119.08 L
771.623 116.45 L
771.932 116.43 L
772.241 121.636 L
772.549 129.842 L
772.858 135.413 L
773.167 136.509 L
773.475 136.35 L
773.784 138.333 L
774.093 140.72 L
774.401 141.159 L
774.71 142.638 L
775.019 145.246 L
775.327 145.368 L
775.636 147.187 L
775.945 154.426 L
776.253 158.645 L
776.562 156.038 L
776.871 154.865 L
777.179 158.131 L
777.488 159.737 L
777.797 157.104 L
778.105 154.964 L
778.414 156.399 L
778.723 158.957 L
779.031 159.304 L
779.34 157.802 L
779.649 157.358 L
779.957 157.547 L
780.266 155.518 L
780.575 150.635 L
780.883 143.662 L
781.192 137.914 L
781.501 137.145 L
781.809 137.923 L
782.118 133.815 L
782.427 124.916 L
782.735 116.929 L
783.044 114.75 L
783.353 117.161 L
783.661 117.649 L
783.97 113.288 L
784.279 108.737 L
784.587 109.223 L
784.896 114.548 L
785.205 121.135 L
785.513 126.155 L
785.822 128.431 L
786.131 127.647 L
786.439 125.492 L
786.748 124.345 L
787.057 124.761 L
787.365 127.224 L
787.674 131.334 L
787.983 134.551 L
788.291 136.756 L
788.6 139.523 L
788.909 141.937 L
789.217 144.046 L
789.526 147.576 L
789.835 151.333 L
790.143 152.915 L
790.452 152.938 L
790.761 153.625 L
791.069 157.054 L
791.378 164.423 L
791.687 172.088 L
791.995 173.813 L
792.304 169.413 L
792.613 165.23 L
792.921 164.082 L
793.23 161.698 L
793.539 157.465 L
793.847 155.974 L
794.156 155.501 L
794.465 148.49 L
794.773 137.832 L
795.082 136.056 L
795.391 140.606 L
795.699 139.438 L
796.008 134.329 L
796.317 131.153 L
796.625 127.21 L
796.934 120.875 L
797.243 115.497 L
797.551 112.124 L
797.86 110.221 L
798.169 110.083 L
798.477 110.38 L
798.786 110.363 L
799.095 111.734 L
799.403 114.469 L
799.712 116.507 L
800.021 118.954 L
800.329 124.072 L
800.638 129.69 L
800.947 133.947 L
801.255 139.352 L
801.564 146.166 L
801.873 149.22 L
802.181 147.165 L
802.49 145.788 L
802.799 146.559 L
803.107 145.172 L
803.416 142.767 L
803.725 145.237 L
804.033 153.495 L
804.342 162.144 L
804.651 166.443 L
804.959 167.264 L
805.268 168.573 L
805.577 171.374 L
805.885 172.606 L
806.194 170.977 L
806.503 170.034 L
806.811 172.24 L
807.12 173.851 L
807.429 171.673 L
807.737 169.106 L
808.046 169.183 L
808.355 169.451 L
808.663 167.65 L
808.972 165.18 L
809.281 162.983 L
809.589 159.777 L
809.898 154.359 L
810.207 147.299 L
810.515 141.324 L
810.824 136.386 L
811.133 125.874 L
811.441 109.714 L
811.75 102.063 L
812.059 108.149 L
812.367 113.604 L
812.676 108.988 L
812.985 99.028 L
813.293 90.99 L
813.602 89.3 L
813.911 92.582 L
814.219 95.401 L
814.528 96.327 L
814.837 98.238 L
815.145 100.783 L
815.454 101.324 L
815.763 103.449 L
816.071 110.783 L
816.38 117.231 L
816.689 118.415 L
816.997 120.725 L
817.306 128.999 L
817.615 137.752 L
817.923 140.902 L
818.232 141.182 L
818.541 144.722 L
818.849 151.505 L
819.158 156.741 L
819.467 159.644 L
819.775 164.036 L
820.084 170.628 L
820.393 175.457 L
820.701 176.744 L
821.01 177.684 L
821.319 180.895 L
821.627 185.041 L
821.936 186.82 L
822.245 184.813 L
822.553 181.155 L
822.862 178.35 L
823.171 175.962 L
823.479 171.652 L
823.788 165.408 L
824.097 159.885 L
824.405 155.124 L
824.714 147.365 L
825.023 135.81 L
825.331 124.894 L
825.64 118.62 L
825.949 116.765 L
826.257 113.933 L
826.566 106.949 L
826.875 101.313 L
827.183 99.238 L
827.492 93.241 L
827.801 81.83 L
828.109 76.902 L
828.418 84.013 L
828.727 92.6 L
829.035 95.146 L
829.344 94.114 L
829.653 90.825 L
829.961 85.924 L
830.27 84.523 L
830.579 89.034 L
830.887 95.105 L
831.196 98.927 L
831.505 103.217 L
831.813 111.319 L
832.122 119.325 L
832.431 122.108 L
832.739 121.694 L
833.048 124.596 L
833.357 132.103 L
833.665 139.057 L
833.974 142.249 L
834.283 143.529 L
834.591 145.449 L
834.9 149.254 L
835.209 155.869 L
835.517 164.729 L
835.826 173.491 L
836.135 180.164 L
836.443 183.508 L
836.752 182.341 L
837.061 177.796 L
837.369 174.184 L
837.678 175.511 L
837.987 180.494 L
838.295 184.892 L
838.604 188.267 L
838.913 190.377 L
839.221 188.638 L
839.53 182.967 L
839.839 175.652 L
840.147 169.103 L
840.456 164.226 L
840.765 158.584 L
841.073 149.866 L
841.382 140.008 L
841.691 131.304 L
841.999 123.532 L
842.308 115.99 L
842.617 108.141 L
842.925 100.866 L
843.234 95.82 L
843.543 92.462 L
843.851 89.425 L
844.16 86.692 L
844.469 84.249 L
844.777 81.861 L
845.086 80.778 L
845.395 82.151 L
845.703 84.023 L
846.012 84.365 L
846.321 85.346 L
846.629 90.413 L
846.938 98.039 L
847.247 104.222 L
847.555 109.727 L
847.864 116.365 L
848.173 120.569 L
848.481 119.084 L
848.79 115.581 L
849.099 115.058 L
849.407 118.512 L
849.716 124.842 L
850.025 131.529 L
850.333 136.624 L
850.642 141.43 L
850.951 146.928 L
851.259 151.557 L
851.568 155.405 L
851.877 159.628 L
852.185 162.928 L
852.494 164.877 L
852.803 169.04 L
853.111 177.308 L
853.42 183.755 L
853.729 183.063 L
854.037 181.872 L
854.346 187.115 L
854.655 191.467 L
854.963 188.068 L
855.272 182.167 L
855.581 176.823 L
855.889 168.569 L
856.198 157.452 L
856.507 146.832 L
856.815 138.382 L
857.124 132.795 L
857.433 129.793 L
857.741 126.229 L
858.05 118.922 L
858.359 109.11 L
858.667 100.833 L
858.976 96.154 L
859.285 93.897 L
859.593 93.151 L
859.902 93.952 L
860.211 93.992 L
860.519 91.953 L
860.828 91.22 L
861.137 93.56 L
861.445 95.971 L
861.754 96.386 L
862.063 97.207 L
862.371 101.718 L
862.68 108.509 L
862.989 112.394 L
863.297 112.207 L
863.606 111.103 L
863.915 111.095 L
864.223 113.435 L
864.532 117.152 L
864.841 118.957 L
865.149 119.666 L
865.458 123.505 L
865.767 131.528 L
866.075 140.493 L
866.384 146.186 L
866.693 147.995 L
867.001 150.322 L
867.31 157.385 L
867.619 167.448 L
867.927 174.987 L
868.236 178.018 L
868.545 180.518 L
868.853 186.326 L
869.162 192.241 L
869.471 191.844 L
869.779 189.04 L
870.088 193.37 L
870.397 200.043 L
870.705 197.785 L
871.014 187.747 L
871.323 176.57 L
871.631 166.595 L
871.94 159.411 L
872.249 154.648 L
872.557 147.746 L
872.866 136.688 L
873.175 125.122 L
873.483 116.493 L
873.792 109.776 L
874.101 103.237 L
874.409 98.28 L
874.718 95.562 L
875.027 93.327 L
875.335 90.32 L
875.644 87.196 L
875.953 86.747 L
876.261 91.131 L
876.57 98.964 L
876.879 107.024 L
877.187 112.437 L
877.496 114.159 L
877.805 115.464 L
878.113 120.573 L
878.422 127.583 L
878.731 131.128 L
879.039 131.084 L
879.348 131.026 L
879.657 130.625 L
879.965 127.963 L
880.274 125.739 L
880.583 128.492 L
880.891 135.557 L
881.2 139.248 L
881.509 132.646 L
881.817 121.652 L
882.126 119.539 L
882.435 124.209 L
882.743 123.832 L
883.052 120.493 L
883.361 121.096 L
883.669 122.698 L
883.978 123.562 L
884.287 126.688 L
884.595 130.55 L
884.904 132.401 L
885.213 131.543 L
885.521 127.235 L
885.83 121.011 L
886.139 116.097 L
886.447 116.036 L
886.756 123.531 L
887.065 134.545 L
887.373 139.09 L
887.682 132.952 L
887.991 123.376 L
888.299 120.909 L
888.608 128.208 L
888.917 136.743 L
889.225 136.184 L
889.534 126.942 L
889.843 118.781 L
890.151 117.859 L
890.46 121.073 L
890.769 121.144 L
891.077 114.548 L
891.386 107.525 L
891.695 110.221 L
892.003 119.551 L
892.312 121.388 L
892.621 115.393 L
892.929 113.12 L
893.238 115.794 L
893.547 117.682 L
893.855 119.397 L
894.164 122.862 L
894.473 123.276 L
894.781 116.135 L
895.09 107.157 L
895.399 105.539 L
895.707 111.296 L
896.016 115.844 L
896.325 113.181 L
896.633 107.133 L
896.942 104.157 L
897.251 104.54 L
897.559 106.178 L
897.868 107.798 L
898.177 107.551 L
898.485 106.322 L
898.794 106.948 L
899.103 108.67 L
899.411 107.287 L
899.72 101.44 L
900.029 98.328 L
900.337 104.847 L
900.646 114.387 L
900.955 117.052 L
901.263 113.359 L
901.572 108.166 L
901.881 105.523 L
902.189 108.174 L
902.498 113.494 L
902.807 115.818 L
903.115 114.646 L
903.424 113.594 L
903.733 113.702 L
904.041 112.997 L
904.35 110.619 L
904.659 107.308 L
904.967 104.674 L
905.276 105.001 L
905.585 106.935 L
905.893 105.947 L
906.202 100.646 L
906.511 94.063 L
906.819 89.316 L
907.128 87.218 L
907.437 86.531 L
907.745 84.801 L
908.054 82.371 L
908.363 83.374 L
908.671 89.551 L
908.98 95.715 L
909.289 96.289 L
909.597 94.751 L
909.906 97.476 L
910.215 101.197 L
910.523 99.873 L
910.832 99.624 L
911.141 107.082 L
911.449 113.251 L
911.758 109.583 L
912.067 102.213 L
912.375 100.553 L
912.684 104.714 L
912.993 107.265 L
913.301 104.42 L
913.61 99.992 L
913.919 98.737 L
914.227 100.794 L
914.536 102.715 L
914.845 102.853 L
915.153 102.784 L
915.462 104.151 L
915.771 106.294 L
916.079 106.534 L
916.388 104.196 L
916.697 101.809 L
917.005 101.959 L
917.314 105.313 L
917.623 109.186 L
917.931 110.164 L
918.24 109.083 L
918.549 109.402 L
918.857 111.278 L
919.166 110.668 L
919.475 106 L
919.783 101.623 L
920.092 100.864 L
920.401 101.677 L
920.709 102.22 L
921.018 103.824 L
921.327 105.38 L
921.635 103.387 L
921.944 99.678 L
922.253 99.708 L
922.561 103.122 L
922.87 105.425 L
923.179 106.626 L
923.487 109.38 L
923.796 112.28 L
924.105 111.462 L
924.413 107.375 L
924.722 105.04 L
925.031 104.965 L
925.339 101.947 L
925.648 96.684 L
925.957 96.842 L
926.265 102.923 L
926.574 106.83 L
926.883 106.069 L
927.191 105.444 L
927.5 105.694 L
927.809 102.455 L
928.117 97.284 L
928.426 96.816 L
928.735 100.276 L
929.043 103.863 L
929.352 108.199 L
929.661 112.224 L
929.969 113.323 L
930.278 113.57 L
930.587 116.197 L
930.895 118.791 L
931.204 117.794 L
931.513 116.199 L
931.821 117.254 L
932.13 118.353 L
932.439 117.995 L
932.747 117.529 L
933.056 116.478 L
933.365 115.547 L
933.673 117.491 L
933.982 120.308 L
934.291 119.718 L
934.599 116.684 L
934.908 115.285 L
935.217 117 L
935.525 118.837 L
935.834 117.739 L
936.143 115.92 L
936.451 116.502 L
936.76 117.132 L
937.069 115.457 L
937.377 114.646 L
937.686 116.558 L
937.995 118.505 L
938.303 120.95 L
938.612 126.045 L
938.921 128.039 L
939.229 121.289 L
939.538 113.481 L
939.847 114.897 L
940.155 121.928 L
940.464 124.878 L
940.773 122.564 L
941.081 119.243 L
941.39 117.615 L
941.699 117.701 L
942.007 116.946 L
942.316 114.789 L
942.625 114.762 L
942.933 116.172 L
943.242 114.055 L
943.551 110.705 L
943.859 111.384 L
944.168 113.489 L
944.477 112.657 L
944.785 111.107 L
945.094 112.341 L
945.403 113.955 L
945.711 112.814 L
946.02 111.705 L
946.329 113.17 L
946.637 115.496 L
946.946 117.294 L
947.255 118.549 L
947.563 119.768 L
947.872 121.709 L
948.181 123.569 L
948.489 124.662 L
948.798 126.026 L
949.107 128.008 L
949.415 129.808 L
949.724 131.012 L
950.033 130.892 L
950.341 128.447 L
950.65 125.054 L
950.959 122.912 L
951.267 122.241 L
951.576 122.781 L
951.885 123.912 L
952.193 123.179 L
952.502 119.362 L
952.811 115.345 L
953.119 113.646 L
953.428 114.479 L
953.737 117.813 L
954.045 122.62 L
954.354 126.73 L
954.663 127.354 L
954.971 123.504 L
955.28 119.429 L
955.589 120.228 L
955.897 123.938 L
956.206 124.662 L
956.515 121.767 L
956.823 118.409 L
957.132 117.706 L
957.441 124.81 L
957.749 138.885 L
958.058 147.446 L
958.367 144.043 L
958.675 137.148 L
958.984 134.422 L
959.293 134.19 L
959.601 132.716 L
959.91 130.104 L
960.219 128.556 L
960.527 128.912 L
960.836 129.866 L
961.145 130.722 L
961.453 132.671 L
961.762 132.991 L
962.071 127.695 L
962.379 120.497 L
962.688 118.662 L
962.997 122.838 L
963.305 127.326 L
963.614 129.131 L
963.923 130.035 L
964.231 130.562 L
964.54 130.13 L
964.849 130.093 L
965.157 132.465 L
965.466 136.985 L
965.775 141.027 L
966.083 142.026 L
966.392 139.226 L
966.701 136.142 L
967.009 137.318 L
967.318 140.618 L
967.627 139.762 L
967.935 133.963 L
968.244 129.213 L
968.553 129.371 L
968.861 130.402 L
969.17 128.336 L
969.479 126.751 L
969.787 130.271 L
970.096 136.63 L
970.405 139.44 L
970.713 136.423 L
971.022 131.898 L
971.331 130.79 L
971.639 134.212 L
971.948 138.788 L
972.257 138.195 L
972.565 133.766 L
972.874 135.117 L
973.183 142.445 L
973.491 147.411 L
973.8 147.471 L
974.109 143.108 L
974.417 133.975 L
974.726 124.708 L
975.035 121.485 L
975.343 123.988 L
975.652 127.286 L
975.961 126.89 L
976.269 123.895 L
976.578 123.783 L
976.887 127.2 L
977.195 129.721 L
977.504 129.712 L
977.813 129.492 L
978.121 130.918 L
978.43 134.184 L
978.739 138.908 L
979.047 143.804 L
979.356 146.364 L
979.665 145.025 L
979.973 141.797 L
980.282 141.732 L
980.591 146.666 L
980.899 152.004 L
981.208 153.817 L
981.517 153.264 L
981.825 152.05 L
982.134 150.996 L
982.443 151.456 L
982.751 152.929 L
983.06 153.193 L
983.369 152.468 L
983.677 152.643 L
983.986 152.497 L
984.295 149.066 L
984.603 142.98 L
984.912 138.516 L
985.221 138.699 L
985.529 142.246 L
985.838 145.007 L
986.147 144.846 L
986.455 143.724 L
986.764 143.159 L
987.073 142.631 L
987.381 143.203 L
987.69 145.419 L
987.999 145.621 L
988.307 141.76 L
988.616 138.912 L
988.925 142.944 L
989.233 152.118 L
989.542 158.574 L
989.851 158.511 L
990.159 157.428 L
990.468 159.616 L
990.777 159.451 L
991.085 152.742 L
991.394 148.068 L
991.703 152.691 L
992.011 160.268 L
992.32 164.468 L
992.629 166.358 L
992.937 166.003 L
993.246 162.095 L
993.555 158.096 L
993.863 159.169 L
994.172 163.594 L
994.481 162.905 L
994.789 154.434 L
995.098 147.936 L
995.407 150.03 L
995.715 152.441 L
996.024 147.788 L
996.333 142.598 L
996.641 143.993 L
996.95 147.32 L
997.259 146.647 L
997.567 144.598 L
997.876 144.999 L
998.185 146.441 L
998.493 145.787 L
998.802 143.468 L
999.111 142.805 L
999.419 144.015 L
999.728 144.054 L
1000.037 142.508 L
1000.345 141.497 L
1000.654 141.293 L
1000.963 140.803 L
1001.271 139.557 L
1001.58 136.779 L
1001.889 133.098 L
1002.197 130.997 L
1002.506 130.582 L
1002.815 130.375 L
1003.123 130.055 L
1003.432 130.622 L
1003.741 132.365 L
1004.049 133.373 L
1004.358 133.281 L
1004.667 134.176 L
1004.975 136.548 L
1005.284 138.149 L
1005.593 136.387 L
1005.901 130.104 L
1006.21 123.168 L
1006.519 124.764 L
1006.827 134.492 L
1007.136 141.043 L
1007.445 141.808 L
1007.753 141.966 L
1008.062 142.488 L
1008.371 142.859 L
1008.679 144.551 L
1008.988 147.54 L
1009.297 150.882 L
1009.605 154.588 L
1009.914 155.9 L
1010.223 151.824 L
1010.531 146.262 L
1010.84 144.938 L
1011.149 147.227 L
1011.457 149.228 L
1011.766 149.751 L
1012.075 149.471 L
1012.383 147.748 L
1012.692 143.314 L
1013.001 138.28 L
1013.309 137.912 L
1013.618 142.421 L
1013.927 145.087 L
1014.235 142.576 L
1014.544 138.997 L
1014.853 138.255 L
1015.161 138.992 L
1015.47 137.945 L
1015.779 135.66 L
1016.087 135.071 L
1016.396 136.518 L
1016.705 137.88 L
1017.013 137.625 L
1017.322 137.174 L
1017.631 139.087 L
1017.939 142.865 L
1018.248 144.649 L
1018.557 142.445 L
1018.865 139.814 L
1019.174 142.018 L
1019.483 147.988 L
1019.791 151.845 L
1020.1 153.24 L
1020.409 155.863 L
1020.717 158.634 L
1021.026 157.623 L
1021.335 152.968 L
1021.643 148.798 L
1021.952 148.003 L
1022.261 148.957 L
1022.569 148.974 L
1022.878 148.693 L
1023.187 149.133 L
1023.495 149.205 L
1023.804 148.799 L
1024.113 147.974 L
1024.421 145.548 L
1024.73 143.389 L
1025.039 144.664 L
1025.347 146.318 L
1025.656 142.609 L
1025.965 137.431 L
1026.273 140.006 L
1026.582 146.497 L
1026.891 146.702 L
1027.199 141.673 L
1027.508 138.186 L
1027.817 137.917 L
1028.125 139.899 L
1028.434 144.472 L
1028.743 148.835 L
1029.051 148.31 L
1029.36 144.704 L
1029.669 143.836 L
1029.977 145.959 L
1030.286 146.955 L
1030.595 146.542 L
1030.903 147.139 L
1031.212 147.436 L
1031.521 145.34 L
1031.829 143.242 L
1032.138 143.392 L
1032.447 145.097 L
1032.755 146.88 L
1033.064 146.198 L
1033.373 143.346 L
1033.681 143.556 L
1033.99 147.676 L
1034.299 149.723 L
1034.607 147.129 L
1034.916 144.891 L
1035.225 148.035 L
1035.533 152.736 L
1035.842 151.202 L
1036.151 144.708 L
1036.459 141.345 L
1036.768 142.448 L
1037.077 142.259 L
1037.385 139.597 L
1037.694 138.667 L
1038.003 140.079 L
1038.311 140.792 L
1038.62 140.969 L
1038.929 143.46 L
1039.237 147.313 L
1039.546 149.361 L
1039.855 150.007 L
1040.163 150.591 L
1040.472 148.947 L
1040.781 145.219 L
1041.089 146.266 L
1041.398 154.665 L
1041.707 162.037 L
1042.015 162.465 L
1042.324 160.946 L
1042.633 161.737 L
1042.941 160.322 L
1043.25 154.925 L
1043.559 152.421 L
1043.867 153.333 L
1044.176 150.852 L
1044.485 145.841 L
1044.793 144.087 L
1045.102 145.846 L
1045.411 145.794 L
1045.719 140.921 L
1046.028 135.244 L
1046.337 133.26 L
1046.645 133.618 L
1046.954 132.194 L
1047.263 127.697 L
1047.571 124.22 L
1047.88 125.102 L
1048.189 127.331 L
1048.497 128.669 L
1048.806 130.673 L
1049.115 132.843 L
1049.423 132.95 L
1049.732 132.329 L
1050.041 133.961 L
1050.349 136.215 L
1050.658 135.947 L
1050.967 134.796 L
1051.275 135.637 L
1051.584 138.741 L
1051.893 142.513 L
1052.201 144.587 L
1052.51 143.895 L
1052.819 140.938 L
1053.127 138.095 L
1053.436 137.811 L
1053.745 138.624 L
1054.053 138.373 L
1054.362 138.083 L
1054.671 135.75 L
1054.979 128.534 L
1055.288 125.057 L
1055.597 133.205 L
1055.905 143.335 L
1056.214 145.88 L
1056.523 143.938 L
1056.831 141.181 L
1057.14 137.501 L
1057.449 134.991 L
1057.757 137.128 L
1058.066 141.373 L
1058.375 140.277 L
1058.683 133.333 L
1058.992 130.722 L
1059.301 137.148 L
1059.609 142.055 L
1059.918 137.663 L
1060.227 132.189 L
1060.535 134.287 L
1060.844 138.784 L
1061.153 137.247 L
1061.461 131.603 L
1061.77 128.747 L
1062.079 129.203 L
1062.387 128.678 L
1062.696 125.444 L
1063.005 121.991 L
1063.313 121.954 L
1063.622 124.548 L
1063.931 125.057 L
1064.239 123.157 L
1064.548 123.354 L
1064.857 126.168 L
1065.165 127.442 L
1065.474 126.992 L
1065.783 128.105 L
1066.091 128.627 L
1066.4 124.811 L
1066.709 120.271 L
1067.017 122.505 L
1067.326 132.014 L
1067.635 140.775 L
1067.943 144.259 L
1068.252 144.685 L
1068.561 142.399 L
1068.869 139.074 L
1069.178 141.141 L
1069.487 146.601 L
1069.795 147.357 L
1070.104 144.704 L
1070.413 143.531 L
1070.721 143.437 L
1071.03 143.767 L
1071.339 145.025 L
1071.647 143.896 L
1071.956 136.033 L
1072.265 123.306 L
1072.573 114.11 L
1072.882 114.97 L
1073.191 121.824 L
1073.499 124.943 L
1073.808 121.928 L
1074.117 118.991 L
1074.425 119.412 L
1074.734 120.148 L
1075.043 119.322 L
1075.351 116.965 L
1075.66 114.117 L
1075.969 113.442 L
1076.277 115.444 L
1076.586 118.611 L
1076.895 122.512 L
1077.203 127.055 L
1077.512 130.039 L
1077.821 130.146 L
1078.129 129.494 L
1078.438 129.716 L
1078.747 130.74 L
1079.055 131.185 L
1079.364 128.468 L
1079.673 123.343 L
1079.981 121.467 L
1080.29 125.222 L
1080.599 129.495 L
1080.907 129.785 L
1081.216 125.597 L
1081.525 118.412 L
1081.833 112.66 L
1082.142 111.648 L
1082.451 114.897 L
1082.759 119.795 L
1083.068 122.669 L
1083.377 122.038 L
1083.685 118.711 L
1083.994 114.465 L
1084.303 112.814 L
1084.611 114.983 L
1084.92 117.186 L
1085.229 117.675 L
1085.537 119.85 L
1085.846 123.777 L
1086.155 123.433 L
1086.463 119.197 L
1086.772 121.855 L
1087.081 132.306 L
1087.389 137.018 L
1087.698 132.92 L
1088.007 130.628 L
1088.315 133.825 L
1088.624 136.752 L
1088.933 137.05 L
1089.241 137.105 L
1089.55 137.4 L
1089.859 137.12 L
1090.167 137.547 L
1090.476 139.455 L
1090.785 142.212 L
1091.093 145.771 L
1091.402 148.504 L
1091.711 148.076 L
1092.019 145.008 L
1092.328 140.325 L
1092.637 134.527 L
1092.945 129.965 L
1093.254 127.727 L
1093.563 126.803 L
1093.871 126.17 L
1094.18 123.216 L
1094.489 118.951 L
1094.797 120.024 L
1095.106 126.817 L
1095.415 130.406 L
1095.723 127.117 L
1096.032 124.088 L
1096.341 126.385 L
1096.649 129.969 L
1096.958 129.853 L
1097.267 126.712 L
1097.575 123.747 L
1097.884 122.694 L
1098.193 123.767 L
1098.501 125.888 L
1098.81 127.658 L
1099.119 129.374 L
1099.427 131.226 L
1099.736 132.103 L
1100.045 132.72 L
1100.353 135.223 L
1100.662 138.865 L
1100.971 140.958 L
1101.279 141.636 L
1101.588 141.426 L
1101.897 138.769 L
1102.205 135.479 L
1102.514 135.89 L
1102.823 139.366 L
1103.131 142.103 L
1103.44 143.006 L
1103.749 142.417 L
1104.057 139.301 L
1104.366 134.146 L
1104.675 133.486 L
1104.983 139.825 L
1105.292 144.638 L
1105.601 144.432 L
1105.909 143.716 L
1106.218 142.74 L
1106.527 140.113 L
1106.835 137.974 L
1107.144 136.789 L
1107.453 134.784 L
1107.761 133.536 L
1108.07 134.478 L
1108.379 135.433 L
1108.687 135.21 L
1108.996 134.923 L
1109.305 135.813 L
1109.613 137.16 L
1109.922 137.44 L
1110.231 137.708 L
1110.539 139.043 L
1110.848 138.895 L
1111.157 134.212 L
1111.465 126.56 L
1111.774 121.395 L
1112.083 120.386 L
1112.391 121.212 L
1112.7 125.252 L
1113.009 133.028 L
1113.317 138.276 L
1113.626 137.067 L
1113.935 133.188 L
1114.243 130.085 L
1114.552 127.818 L
1114.861 126.782 L
1115.169 127.021 L
1115.478 128.326 L
1115.787 131.823 L
1116.095 136.067 L
1116.404 136.441 L
1116.713 131.92 L
1117.021 127.365 L
1117.33 127.811 L
1117.639 132.104 L
1117.947 135.315 L
1118.256 136.441 L
1118.565 138.637 L
1118.873 143.525 L
1119.182 148.153 L
1119.491 148.635 L
1119.799 145.92 L
1120.108 143.377 L
1120.417 142.006 L
1120.725 141.102 L
1121.034 137.81 L
1121.343 130.706 L
1121.651 127.244 L
1121.96 132.789 L
1122.269 138.814 L
1122.577 139.249 L
1122.886 138.872 L
1123.195 140.202 L
1123.503 140.72 L
1123.812 140.009 L
1124.121 140.344 L
1124.429 141.75 L
1124.738 142.454 L
1125.047 143.218 L
1125.355 145.146 L
1125.664 146.318 L
1125.973 142.967 L
1126.281 136.083 L
1126.59 132.815 L
1126.899 135.115 L
1127.207 138.062 L
1127.516 139.272 L
1127.825 141.825 L
1128.133 148.017 L
1128.442 153.275 L
1128.751 151.37 L
1129.059 145.012 L
1129.368 143.377 L
1129.677 148.252 L
1129.985 151.707 L
1130.294 149.362 L
1130.603 146.208 L
1130.911 146.81 L
1131.22 148.788 L
1131.529 148.015 L
1131.837 144.393 L
1132.146 141.182 L
1132.455 141.528 L
1132.763 144.55 L
1133.072 145.276 L
1133.381 141.058 L
1133.689 137.065 L
1133.998 139.759 L
1134.307 145.68 L
1134.615 146.638 L
1134.924 142.682 L
1135.233 140.683 L
1135.541 142.967 L
1135.85 144.046 L
1136.159 139.973 L
1136.467 133.422 L
1136.776 128.58 L
1137.085 127.953 L
1137.393 129.608 L
1137.702 126.379 L
1138.011 118.577 L
1138.319 118.762 L
1138.628 129.895 L
1138.937 137.49 L
1139.245 134.153 L
1139.554 129.296 L
1139.863 131.724 L
1140.171 138.933 L
1140.48 143.067 L
1140.789 139.809 L
1141.097 132.374 L
1141.406 127.993 L
1141.715 130.288 L
1142.023 135.659 L
1142.332 139.112 L
1142.641 140.517 L
1142.949 142.296 L
1143.258 145.553 L
1143.567 148.417 L
1143.875 149.647 L
1144.184 150.774 L
1144.493 151.957 L
1144.801 151.947 L
1145.11 150.929 L
1145.419 151.349 L
1145.727 154.001 L
1146.036 154.124 L
1146.345 149.798 L
1146.653 147.519 L
1146.962 151.153 L
1147.271 155.684 L
1147.579 155.239 L
1147.888 150.07 L
1148.197 143.891 L
1148.505 138.877 L
1148.814 135.611 L
1149.123 134.402 L
1149.431 134.581 L
1149.74 135.302 L
1150.049 137.358 L
1150.357 140.145 L
1150.666 140.763 L
1150.975 139.722 L
1151.283 141.157 L
1151.592 145.018 L
1151.901 145.439 L
1152.209 140.103 L
1152.518 135.677 L
1152.827 137.67 L
1153.135 140.512 L
1153.444 136.681 L
1153.753 128.818 L
1154.061 124.262 L
1154.37 125.025 L
1154.679 126.99 L
1154.987 124.612 L
1155.296 119.368 L
1155.605 119.526 L
1155.913 124.977 L
1156.222 127.996 L
1156.531 127.936 L
1156.839 128.866 L
1157.148 132.219 L
1157.457 137.482 L
1157.765 142.073 L
1158.074 142.052 L
1158.383 136.752 L
1158.691 130.393 L
1159 127.379 L
1159.309 128.487 L
1159.617 131.652 L
1159.926 135.058 L
1160.235 137.988 L
1160.543 139.029 L
1160.852 137.786 L
1161.161 136.991 L
1161.469 138.319 L
1161.778 140.35 L
1162.087 142.891 L
1162.395 145.964 L
1162.704 145.079 L
1163.013 137.641 L
1163.321 131.102 L
1163.63 133.146 L
1163.939 139.314 L
1164.247 138.856 L
1164.556 129.574 L
1164.865 121.193 L
1165.173 122.593 L
1165.482 128.479 L
1165.791 127.838 L
1166.099 121.953 L
1166.408 118.441 L
1166.717 116.55 L
1167.025 111.642 L
1167.334 106.673 L
1167.643 107.959 L
1167.951 114.953 L
1168.26 121.559 L
1168.569 125.027 L
1168.877 127.976 L
1169.186 131.256 L
1169.495 132.543 L
1169.803 129.99 L
1170.112 125.125 L
1170.421 122.837 L
1170.729 125.107 L
1171.038 129.057 L
1171.347 131.358 L
1171.655 131.361 L
1171.964 130.461 L
1172.273 129.119 L
1172.581 126.503 L
1172.89 124.187 L
1173.199 125.657 L
1173.507 129.573 L
1173.816 129.473 L
1174.125 123.519 L
1174.433 119.656 L
1174.742 123.358 L
1175.051 129.086 L
1175.359 130.54 L
1175.668 127.821 L
1175.977 124.341 L
1176.285 123.039 L
1176.594 124.992 L
1176.903 127.814 L
1177.211 126.015 L
1177.52 118.695 L
1177.829 110.871 L
1178.137 105.909 L
1178.446 107.476 L
1178.755 116.929 L
1179.063 125.151 L
1179.372 125.472 L
1179.681 123.385 L
1179.989 123.148 L
1180.298 121.236 L
1180.607 116.688 L
1180.915 115.083 L
1181.224 118.413 L
1181.533 121.5 L
1181.841 121.246 L
1182.15 121.158 L
1182.459 124.599 L
1182.767 128.34 L
1183.076 127.86 L
1183.385 124.214 L
1183.693 120.14 L
1184.002 117.179 L
1184.311 116.874 L
1184.619 118.492 L
1184.928 118.549 L
1185.237 116.98 L
1185.545 117.734 L
1185.854 119.906 L
1186.163 118.111 L
1186.471 112.848 L
1186.78 109.458 L
1187.089 109.299 L
1187.397 110.173 L
1187.706 110.468 L
1188.015 109.403 L
1188.323 107.858 L
1188.632 107.184 L
1188.941 107.377 L
1189.249 109.05 L
1189.558 112.925 L
1189.867 117.26 L
1190.175 118.168 L
1190.484 114.341 L
1190.793 111.135 L
1191.101 113.947 L
1191.41 119.642 L
1191.719 120.958 L
1192.027 117.757 L
1192.336 116.701 L
1192.645 120.022 L
1192.953 122.274 L
1193.262 118.868 L
1193.571 114.383 L
1193.879 115.52 L
1194.188 119.121 L
1194.497 119.066 L
1194.805 117.015 L
1195.114 116.387 L
1195.423 116.265 L
1195.731 115.816 L
1196.04 117.688 L
1196.349 122.711 L
1196.657 124.395 L
1196.966 117.812 L
1197.275 109.616 L
1197.583 111.346 L
1197.892 121.908 L
1198.201 126.998 L
1198.509 121.446 L
1198.818 114.619 L
1199.127 113.852 L
1199.435 117.303 L
1199.744 120.752 L
1200.053 122.119 L
1200.361 121.211 L
1200.67 118.611 L
1200.979 114.815 L
1201.287 111.835 L
1201.596 112.465 L
1201.905 114.885 L
1202.213 114.071 L
1202.522 111.924 L
1202.831 113.526 L
1203.139 116.056 L
1203.448 114.653 L
1203.757 111.536 L
1204.065 110.507 L
1204.374 110.878 L
1204.683 110.972 L
1204.991 111.675 L
1205.3 114.627 L
1205.609 119.066 L
1205.917 122.143 L
1206.226 121.829 L
1206.535 119.975 L
1206.843 120.373 L
1207.152 123.601 L
1207.461 126.396 L
1207.769 124.844 L
1208.078 119.236 L
1208.387 115.308 L
1208.695 116.843 L
1209.004 120.472 L
1209.313 121.257 L
1209.621 119.122 L
1209.93 117.436 L
1210.239 117.53 L
1210.547 118.432 L
1210.856 119.692 L
1211.165 120.198 L
1211.473 118.508 L
1211.782 115.476 L
1212.091 113.477 L
1212.399 113.565 L
1212.708 115.776 L
1213.017 119.881 L
1213.325 122.482 L
1213.634 120.453 L
1213.943 116.554 L
1214.251 114.596 L
1214.56 114.644 L
1214.869 115.871 L
1215.177 117.966 L
1215.486 119.997 L
1215.795 121.854 L
1216.103 123.26 L
1216.412 122.42 L
1216.721 120.017 L
1217.029 118.83 L
1217.338 119.331 L
1217.647 121.913 L
1217.955 126.951 L
1218.264 130.237 L
1218.573 129.327 L
1218.881 127.272 L
1219.19 125.947 L
1219.499 127.166 L
1219.807 133.217 L
1220.116 140.044 L
1220.425 141.486 L
1220.733 138.285 L
1221.042 135.114 L
1221.351 134.959 L
1221.659 136.967 L
1221.968 137.399 L
1222.277 134.79 L
1222.585 131.878 L
1222.894 130.821 L
1223.203 130.16 L
1223.511 128.441 L
1223.82 128.106 L
1224.129 131.657 L
1224.437 136.729 L
1224.746 140.105 L
1225.055 140.291 L
1225.363 136.656 L
1225.672 131.951 L
1225.981 129.581 L
1226.289 129.242 L
1226.598 128.783 L
1226.907 127.333 L
1227.215 126.821 L
1227.524 128.99 L
1227.833 131.693 L
1228.141 132.184 L
1228.45 129.882 L
1228.759 125.971 L
1229.067 124.283 L
1229.376 128.062 L
1229.685 134.623 L
1229.993 138.027 L
1230.302 137.19 L
1230.611 137.089 L
1230.919 140.451 L
1231.228 143.935 L
1231.537 144.893 L
1231.845 145.388 L
1232.154 145.791 L
1232.463 144.694 L
1232.771 146.135 L
1233.08 152.195 L
1233.389 155.108 L
1233.697 148.803 L
1234.006 140.197 L
1234.315 140.106 L
1234.623 146.014 L
1234.932 147.325 L
1235.241 144.137 L
1235.549 143.173 L
1235.858 144.256 L
1236.167 143.009 L
1236.475 138.382 L
1236.784 133.543 L
1237.093 132.131 L
1237.401 133.485 L
1237.71 134.376 L
1238.019 134.363 L
1238.327 134.959 L
1238.636 136.42 L
1238.945 137.4 L
1239.253 136.709 L
1239.562 134.571 L
1239.871 132.81 L
1240.179 133.605 L
1240.488 137.334 L
1240.797 142.558 L
1241.105 147.291 L
1241.414 149.89 L
1241.723 149.487 L
1242.031 146.891 L
1242.34 144.503 L
1242.649 143.617 L
1242.957 143.755 L
1243.266 145.273 L
1243.575 148.357 L
1243.883 151.986 L
1244.192 155.379 L
1244.501 156.851 L
1244.809 154.89 L
1245.118 151.879 L
1245.427 150.594 L
1245.735 149.6 L
1246.044 147.679 L
1246.353 145.6 L
1246.661 142.754 L
1246.97 140.264 L
1247.279 142.842 L
1247.587 149.808 L
1247.896 154.793 L
1248.205 156.455 L
1248.513 157.326 L
1248.822 156.578 L
1249.131 152.357 L
1249.439 147.122 L
1249.748 144.708 L
1250.057 145.973 L
1250.365 149.415 L
1250.674 152.488 L
1250.983 153.05 L
1251.291 150.929 L
1251.6 147.85 L
1251.909 146.264 L
1252.217 145.905 L
1252.526 144.788 L
1252.835 143.832 L
1253.143 144.358 L
1253.452 145.141 L
1253.761 145.24 L
1254.069 146.531 L
1254.378 149.88 L
1254.687 151.925 L
1254.995 150.334 L
1255.304 147.397 L
1255.613 146.261 L
1255.921 146.645 L
1256.23 146.295 L
1256.539 144.992 L
1256.847 143.513 L
1257.156 141.091 L
1257.465 137.885 L
1257.773 137.163 L
1258.082 141.366 L
1258.391 146.768 L
1258.699 146.261 L
1259.008 139.285 L
1259.317 133.008 L
1259.625 131.591 L
1259.934 132.622 L
1260.243 134.41 L
1260.551 135.858 L
1260.86 134.021 L
1261.169 132.099 L
1261.477 136.686 L
1261.786 144.436 L
1262.095 148.213 L
1262.403 147.876 L
1262.712 146.891 L
1263.021 147.424 L
1263.329 149.092 L
1263.638 149.212 L
1263.947 146.809 L
1264.255 143.525 L
1264.564 139.595 L
1264.873 135.61 L
1265.181 133.54 L
1265.49 134.067 L
1265.799 137.043 L
1266.107 140.772 L
1266.416 142.385 L
1266.725 141.577 L
1267.033 140.143 L
1267.342 138.992 L
1267.651 139.213 L
1267.959 141.093 L
1268.268 142.236 L
1268.577 141.385 L
1268.885 138.909 L
1269.194 134.631 L
1269.503 130.258 L
1269.811 130.602 L
1270.12 137.088 L
1270.429 143.106 L
1270.737 142.77 L
1271.046 139.035 L
1271.355 136.905 L
1271.663 136.262 L
1271.972 135.347 L
1272.281 134.334 L
1272.589 135.382 L
1272.898 139.621 L
1273.207 143.199 L
1273.515 142.697 L
1273.824 141.339 L
1274.133 141.916 L
1274.441 141.15 L
1274.75 139.1 L
1275.059 141.587 L
1275.367 147.086 L
1275.676 149.998 L
1275.985 151.866 L
1276.293 154.098 L
1276.602 153.872 L
1276.911 150.543 L
1277.219 147.198 L
1277.528 147.022 L
1277.837 150.608 L
1278.145 154.137 L
1278.454 152.81 L
1278.763 148.449 L
1279.071 146.622 L
1279.38 148.048 L
1279.689 148.937 L
1279.997 147.098 L
1280.306 144.195 L
1280.615 143.134 L
1280.923 144.177 L
1281.232 145.611 L
1281.541 147.044 L
1281.849 148.462 L
1282.158 149.31 L
1282.467 149.433 L
1282.775 148.395 L
1283.084 146.688 L
1283.393 145.772 L
1283.701 145.604 L
1284.01 146.434 L
1284.319 146.832 L
1284.627 143.144 L
1284.936 137.257 L
1285.245 133.916 L
1285.553 133.104 L
1285.862 133.443 L
1286.171 134.593 L
1286.479 135.039 L
1286.788 134.562 L
1287.097 135.596 L
1287.405 137.93 L
1287.714 138.345 L
1288.023 136.207 L
1288.331 134.876 L
1288.64 136.508 L
1288.949 137.127 L
1289.257 135.498 L
1289.566 138.247 L
1289.875 146.948 L
1290.183 154.365 L
1290.492 155.743 L
1290.801 153.235 L
1291.109 151.554 L
1291.418 153.744 L
1291.727 156.827 L
1292.035 154.852 L
1292.344 149.73 L
1292.653 149.239 L
1292.961 154.941 L
1293.27 161.124 L
1293.579 162.01 L
1293.887 157.117 L
1294.196 151.876 L
1294.505 151.225 L
1294.813 152.522 L
1295.122 149.696 L
1295.431 143.118 L
1295.739 138.284 L
1296.048 138.423 L
1296.357 142.463 L
1296.665 146.174 L
1296.974 145.867 L
1297.283 142.577 L
1297.591 140.384 L
1297.9 140.323 L
1298.209 139.687 L
1298.517 137.989 L
1298.826 137.46 L
1299.135 137.549 L
1299.443 134.485 L
1299.752 127.343 L
1300.061 122.824 L
1300.369 127.564 L
1300.678 136.406 L
1300.987 140.778 L
1301.295 140.971 L
1301.604 140.837 L
1301.913 140.396 L
1302.221 137.114 L
1302.53 132.11 L
1302.839 131.142 L
1303.147 135.872 L
1303.456 140.195 L
1303.765 140.757 L
1304.073 142.164 L
1304.382 145.93 L
1304.691 147.015 L
1304.999 144.792 L
1305.308 143.672 L
1305.617 143.387 L
1305.925 140.643 L
1306.234 137.629 L
1306.543 139.296 L
1306.851 143.971 L
1307.16 146.739 L
1307.469 147.703 L
1307.777 148.818 L
1308.086 149.355 L
1308.395 148.052 L
1308.703 146.087 L
1309.012 144.784 L
1309.321 143.348 L
1309.629 141.306 L
1309.938 139.776 L
1310.247 139.099 L
1310.555 137.815 L
1310.864 136.299 L
1311.173 136.487 L
1311.481 135.657 L
1311.79 128.797 L
1312.099 120.423 L
1312.407 121.535 L
1312.716 130.474 L
1313.025 134.82 L
1313.333 131.132 L
1313.642 125.979 L
1313.951 123.484 L
1314.259 122.102 L
1314.568 120.903 L
1314.877 120.843 L
1315.185 120.057 L
1315.494 116.114 L
1315.803 112.027 L
1316.111 112.659 L
1316.42 116.833 L
1316.729 119.161 L
1317.037 118.217 L
1317.346 117.044 L
1317.655 118.071 L
1317.963 121.266 L
1318.272 124.922 L
1318.581 127.505 L
1318.889 129.642 L
1319.198 132.472 L
1319.507 135.199 L
1319.815 136.923 L
1320.124 138.9 L
1320.433 141.092 L
1320.741 140.784 L
1321.05 138.843 L
1321.359 138.715 L
1321.667 139.468 L
1321.976 137.656 L
1322.285 133.793 L
1322.593 132.114 L
1322.902 133.895 L
1323.211 135.237 L
1323.519 133.941 L
1323.828 131.96 L
1324.137 130.864 L
1324.445 130.554 L
1324.754 127.827 L
1325.063 119.761 L
1325.371 113.69 L
1325.68 120.875 L
1325.989 136.788 L
1326.297 144.606 L
1326.606 139.195 L
1326.915 130.934 L
1327.223 128.589 L
1327.532 130.18 L
1327.841 129.842 L
1328.149 125.969 L
1328.458 121.725 L
1328.767 119.807 L
1329.075 118.585 L
1329.384 117.109 L
1329.693 117.846 L
1330.001 120.608 L
1330.31 122.249 L
1330.619 123.493 L
1330.927 125.418 L
1331.236 123.107 L
1331.545 116.13 L
1331.853 114.025 L
1332.162 120.875 L
1332.471 129.158 L
1332.779 130.076 L
1333.088 123.02 L
1333.397 117.296 L
1333.705 120.555 L
1334.014 129.217 L
1334.323 135.348 L
1334.631 135.946 L
1334.94 133.098 L
1335.249 130.098 L
1335.557 129.785 L
1335.866 132.395 L
1336.175 134.679 L
1336.483 133.774 L
1336.792 131.404 L
1337.101 133.525 L
1337.409 142.154 L
1337.718 149.438 L
1338.027 149.341 L
1338.335 146.925 L
1338.644 146.84 L
1338.953 144.843 L
1339.261 137.667 L
1339.57 130.309 L
1339.879 128.601 L
1340.187 129.738 L
1340.496 126.044 L
1340.805 118.919 L
1341.113 118.506 L
1341.422 124.787 L
1341.731 126.922 L
1342.039 122.635 L
1342.348 118.973 L
1342.657 120.299 L
1342.965 124.184 L
1343.274 126.298 L
1343.583 126.784 L
1343.891 128.03 L
1344.2 128.409 L
1344.509 123.977 L
1344.817 116.573 L
1345.126 113.905 L
1345.435 118.776 L
1345.743 123.631 L
1346.052 122.456 L
1346.361 120.492 L
1346.669 123.072 L
1346.978 127.292 L
1347.287 131.61 L
1347.595 137.988 L
1347.904 142.876 L
1348.213 141.249 L
1348.521 135.799 L
1348.83 132.341 L
1349.139 132.433 L
1349.447 135.121 L
1349.756 139.888 L
1350.065 144.161 L
1350.373 144.278 L
1350.682 141.808 L
1350.991 141.811 L
1351.299 144.807 L
1351.608 147.325 L
1351.917 149.142 L
1352.225 152.086 L
1352.534 152.71 L
1352.843 148.098 L
1353.151 144.542 L
1353.46 145.351 L
1353.769 143.073 L
1354.077 136.248 L
1354.386 132.602 L
1354.695 134.483 L
1355.003 138.271 L
1355.312 140.98 L
1355.621 141.731 L
1355.929 140.541 L
1356.238 136.655 L
1356.547 131.614 L
1356.855 129.758 L
1357.164 130.983 L
1357.473 131.725 L
1357.781 131.278 L
1358.09 130.5 L
1358.399 130.094 L
1358.707 131.334 L
1359.016 134.111 L
1359.325 136.369 L
1359.633 136.992 L
1359.942 135.954 L
1360.251 133.555 L
1360.559 130.951 L
1360.868 130.204 L
1361.177 132.318 L
1361.485 134.66 L
1361.794 134.339 L
1362.103 134.731 L
1362.411 139.92 L
1362.72 145.083 L
1363.029 144.799 L
1363.337 142.068 L
1363.646 140.445 L
1363.955 139.417 L
1364.263 138.64 L
1364.572 138.705 L
1364.881 139.596 L
1365.189 140.451 L
1365.498 140.872 L
1365.807 139.75 L
1366.115 134.905 L
1366.424 128.945 L
1366.733 129.801 L
1367.041 137.923 L
1367.35 143.165 L
1367.659 141.153 L
1367.967 137.873 L
1368.276 137.704 L
1368.585 138.053 L
1368.893 135.176 L
1369.202 129.492 L
1369.511 124.712 L
1369.819 123.679 L
1370.128 126.421 L
1370.437 131.277 L
1370.745 134.018 L
1371.054 130.097 L
1371.363 122.108 L
1371.671 117.757 L
1371.98 119.137 L
1372.289 122.546 L
1372.597 124.632 L
1372.906 123.375 L
1373.215 119.936 L
1373.523 117.11 L
1373.832 115.415 L
1374.141 114.532 L
1374.449 115.404 L
1374.758 118.703 L
1375.067 122.723 L
1375.375 125.291 L
1375.684 125.992 L
1375.993 126.089 L
1376.301 127.971 L
1376.61 131.162 L
1376.919 130.806 L
1377.227 126.466 L
1377.536 124.371 L
1377.845 126.713 L
1378.153 130.214 L
1378.462 134.124 L
1378.771 138.936 L
1379.079 140.153 L
1379.388 134.258 L
1379.697 127.729 L
1380.005 127.924 L
1380.314 130.818 L
1380.623 131.023 L
1380.931 131.789 L
1381.24 134.902 L
1381.549 136.535 L
1381.857 134.912 L
1382.166 132.083 L
1382.475 131.528 L
1382.783 133.139 L
1383.092 130.993 L
1383.401 122.621 L
1383.709 116.743 L
1384.018 121.975 L
1384.327 130.351 L
1384.635 129.991 L
1384.944 124.335 L
1385.253 121.707 L
1385.561 122.222 L
1385.87 121.187 L
1386.179 116.944 L
1386.487 113.682 L
1386.796 115.291 L
1387.105 119.364 L
1387.413 121.501 L
1387.722 121.23 L
1388.031 120.87 L
1388.339 122.165 L
1388.648 124.34 L
1388.957 125.947 L
1389.265 126.947 L
1389.574 126.925 L
1389.883 125.869 L
1390.191 125.829 L
1390.5 126.325 L
1390.809 125.033 L
1391.117 124.567 L
1391.426 128.339 L
1391.735 133.541 L
1392.043 134.493 L
1392.352 130.665 L
1392.661 128.901 L
1392.969 133.548 L
1393.278 138.109 L
1393.587 136.642 L
1393.895 134.153 L
1394.204 134.684 L
1394.513 134.984 L
1394.821 133.009 L
1395.13 130.503 L
1395.439 128.142 L
1395.747 124.706 L
1396.056 122.933 L
1396.365 126.879 L
1396.673 132.072 L
1396.982 131.021 L
1397.291 125.723 L
1397.599 124.781 L
1397.908 130.578 L
1398.217 135.085 L
1398.525 133.408 L
1398.834 132.646 L
1399.143 136.201 L
1399.451 136.72 L
1399.76 131.92 L
1400.069 128.237 L
1400.377 129.094 L
1400.686 130.851 L
1400.995 128.724 L
1401.303 122.887 L
1401.612 118.689 L
1401.921 119.323 L
1402.229 121.039 L
1402.538 119.797 L
1402.847 118.041 L
1403.155 120.349 L
1403.464 125.99 L
1403.773 129.934 L
1404.081 130.421 L
1404.39 130.139 L
1404.699 130.523 L
1405.007 130.933 L
1405.316 131.488 L
1405.625 131.65 L
1405.933 130.524 L
1406.242 131.264 L
1406.551 135.512 L
1406.859 137.156 L
1407.168 134.041 L
1407.477 132.228 L
1407.785 133.956 L
1408.094 136.997 L
1408.403 141.262 L
1408.711 145.501 L
1409.02 145.134 L
1409.329 140.123 L
1409.637 137.705 L
1409.946 141.546 L
1410.255 145.175 L
1410.563 141.873 L
1410.872 135.569 L
1411.181 136.888 L
1411.489 145.469 L
1411.798 147.961 L
1412.107 141.552 L
1412.415 136.606 L
1412.724 135.965 L
1413.033 133.995 L
1413.341 129.238 L
1413.65 125.003 L
1413.959 123.44 L
1414.267 124.353 L
1414.576 125.365 L
1414.885 123.298 L
1415.193 118.825 L
1415.502 115.955 L
1415.811 116.96 L
1416.119 120.934 L
1416.428 125.861 L
1416.737 129.369 L
1417.045 129.232 L
1417.354 127.072 L
1417.663 126.08 L
1417.971 125.654 L
1418.28 125.167 L
1418.589 126.074 L
1418.897 127.221 L
1419.206 126.917 L
1419.515 127.379 L
1419.823 130.483 L
1420.132 134.453 L
1420.441 137.153 L
1420.749 139.349 L
1421.058 141.997 L
1421.367 143.464 L
1421.675 144.161 L
1421.984 146.032 L
1422.293 146.622 L
1422.601 144.254 L
1422.91 141.837 L
1423.219 140.627 L
1423.527 138.95 L
1423.836 135.73 L
1424.145 132.262 L
1424.453 132.395 L
1424.762 135.622 L
1425.071 133.949 L
1425.379 126.93 L
1425.688 123.347 L
1425.997 123.983 L
1426.305 123.257 L
1426.614 121.711 L
1426.923 122.547 L
1427.231 124.171 L
1427.54 123.804 L
1427.849 122.305 L
1428.157 121.34 L
1428.466 120.437 L
1428.775 119.17 L
1429.083 117.757 L
1429.392 114.859 L
1429.701 110.283 L
1430.009 108.855 L
1430.318 114.74 L
1430.627 124.353 L
1430.935 130.453 L
1431.244 130.283 L
1431.553 126.915 L
1431.861 124.849 L
1432.17 124.375 L
1432.479 123.325 L
1432.787 123.197 L
1433.096 125.991 L
1433.405 129.29 L
1433.713 130.521 L
1434.022 130.876 L
1434.331 132.653 L
1434.639 136.19 L
1434.948 139.983 L
1435.257 142.842 L
1435.565 144.548 L
1435.874 144.853 L
1436.183 143.534 L
1436.491 142.673 L
1436.8 144.9 L
1437.109 149.131 L
1437.417 150.88 L
1437.726 147.849 L
1438.035 143.254 L
1438.343 142.079 L
1438.652 145.625 L
1438.961 149.926 L
1439.269 150.91 L
1439.578 147.98 L
1439.887 143.143 L
1440.195 138.703 L
1440.504 135.045 L
1440.813 131.714 L
1441.121 128.223 L
1441.43 124.017 L
1441.739 120.135 L
1442.047 119.005 L
1442.356 119.213 L
1442.665 117.244 L
1442.973 116.773 L
1443.282 122.55 L
1443.591 128.25 L
1443.899 126.306 L
1444.208 121.884 L
1444.517 123.785 L
1444.825 130.01 L
1445.134 133.3 L
1445.443 133.795 L
1445.751 136.116 L
1446.06 139.786 L
1446.369 141.783 L
1446.677 142.692 L
1446.986 143.312 L
1447.295 143.196 L
1447.603 143.654 L
1447.912 145.48 L
1448.221 147.347 L
1448.529 147.767 L
1448.838 147.36 L
1449.147 147.997 L
1449.455 149.524 L
1449.764 149.902 L
1450.073 147.335 L
1450.381 141.952 L
1450.69 135.665 L
1450.999 130.765 L
1451.307 130.954 L
1451.616 138.124 L
1451.925 146.64 L
1452.233 149.127 L
1452.542 146.594 L
1452.851 146.055 L
1453.159 149.631 L
1453.468 150.279 L
1453.777 141.754 L
1454.085 130.728 L
1454.394 129.148 L
1454.703 136.865 L
1455.011 145.84 L
1455.32 153.557 L
1455.629 158.852 L
1455.937 158.928 L
1456.246 156.674 L
1456.555 157.332 L
1456.863 159.217 L
1457.172 158.53 L
1457.481 156.533 L
1457.789 154.388 L
1458.098 150.426 L
1458.407 146.014 L
1458.715 144.194 L
1459.024 144.02 L
1459.333 143.22 L
1459.641 142.2 L
1459.95 142.684 L
1460.259 144.055 L
1460.567 143.659 L
1460.876 141.922 L
1461.185 142.746 L
1461.493 147.336 L
1461.802 151.104 L
1462.111 150.177 L
1462.419 147.145 L
1462.728 145.409 L
1463.037 145.281 L
1463.345 147.557 L
1463.654 151.563 L
1463.963 153.361 L
1464.271 152.165 L
1464.58 150.827 L
1464.889 151.102 L
1465.197 152.078 L
1465.506 152.026 L
1465.815 151.355 L
1466.123 150.631 L
1466.432 148.021 L
1466.741 142.454 L
1467.049 137.45 L
1467.358 136.609 L
1467.667 137.521 L
1467.975 136.713 L
1468.284 136.203 L
1468.593 138.673 L
1468.901 142.238 L
1469.21 143.594 L
1469.519 141.925 L
1469.827 138.825 L
1470.136 136.365 L
1470.445 135.88 L
1470.753 137.12 L
1471.062 139.696 L
1471.371 142.615 L
1471.679 144.792 L
1471.988 149.178 L
1472.297 157.496 L
1472.605 164.184 L
1472.914 164.006 L
1473.223 159.785 L
1473.531 157.391 L
1473.84 158.773 L
1474.149 161.185 L
1474.457 160.681 L
1474.766 157.281 L
1475.075 154.622 L
1475.383 152.901 L
1475.692 150.506 L
1476.001 149.401 L
1476.309 147.567 L
1476.618 140.401 L
1476.927 134.19 L
1477.235 135.466 L
1477.544 138.465 L
1477.853 137.728 L
1478.161 134.003 L
1478.47 127.983 L
1478.779 120.614 L
1479.087 114.998 L
1479.396 111.971 L
1479.705 112.009 L
1480.013 116.811 L
1480.322 122.916 L
1480.631 125.394 L
1480.939 126.154 L
1481.248 128.724 L
1481.557 131.838 L
1481.865 133.316 L
1482.174 134.792 L
1482.483 138.191 L
1482.791 140.661 L
1483.1 140.168 L
1483.409 140.178 L
1483.717 143.687 L
1484.026 148.665 L
1484.335 152.795 L
1484.643 156.945 L
1484.952 160.881 L
1485.261 161.712 L
1485.569 158.095 L
1485.878 153.126 L
1486.187 151.084 L
1486.495 150.534 L
1486.804 146.657 L
1487.113 140.132 L
1487.421 135.832 L
1487.73 135.235 L
1488.039 134.845 L
1488.347 131.651 L
1488.656 127.183 L
1488.965 124.397 L
1489.273 122.685 L
1489.582 119.656 L
1489.891 116.918 L
1490.199 117.034 L
1490.508 116.491 L
1490.817 111.586 L
1491.125 106.848 L
1491.434 108.027 L
1491.743 112.174 L
1492.051 111.428 L
1492.36 105.149 L
1492.669 102.6 L
1492.977 109.866 L
1493.286 121.559 L
1493.595 129.894 L
1493.903 132.069 L
1494.212 129.468 L
1494.521 126.948 L
1494.829 128.833 L
1495.138 133.05 L
1495.447 134.957 L
1495.755 135.668 L
1496.064 137.831 L
1496.373 139.306 L
1496.681 138.187 L
1496.99 135.558 L
1497.299 134.432 L
1497.607 137.902 L
1497.916 144.332 L
1498.225 148.428 L
1498.533 147.266 L
1498.842 144.067 L
1499.151 143.154 L
1499.459 142.555 L
1499.768 139.16 L
1500.077 135.281 L
1500.385 134.234 L
1500.694 134.211 L
1501.003 130.819 L
1501.311 125.827 L
1501.62 125.332 L
1501.929 128.33 L
1502.237 128.629 L
1502.546 125.189 L
1502.855 121.601 L
1503.163 119.909 L
1503.472 119.801 L
1503.781 119.689 L
1504.089 117.252 L
1504.398 112.213 L
1504.707 108.369 L
1505.015 110.014 L
1505.324 115.502 L
1505.633 118.612 L
1505.941 117.14 L
1506.25 114.871 L
1506.559 114.786 L
1506.867 115.905 L
1507.176 117.688 L
1507.485 121.824 L
1507.793 127.895 L
1508.102 131.006 L
1508.411 127.948 L
1508.719 123.131 L
1509.028 122.127 L
1509.337 124.004 L
1509.645 125.595 L
1509.954 126.474 L
1510.263 127.274 L
1510.571 127.924 L
1510.88 126.432 L
1511.189 122.959 L
1511.497 123.625 L
1511.806 130.134 L
1512.115 137.94 L
1512.423 144.628 L
1512.732 147.593 L
1513.041 144.85 L
1513.349 140.416 L
1513.658 140.445 L
1513.967 144.493 L
1514.275 145.558 L
1514.584 140.449 L
1514.893 134.887 L
1515.201 133.891 L
1515.51 133.913 L
1515.819 130.816 L
1516.127 127.174 L
1516.436 127.325 L
1516.745 129.926 L
1517.053 128.433 L
1517.362 122.254 L
1517.671 118.4 L
1517.979 119.292 L
1518.288 121.491 L
1518.597 123.315 L
1518.905 124.791 L
1519.214 125.408 L
1519.523 125.137 L
1519.831 124.772 L
1520.14 125.637 L
1520.449 127.327 L
1520.757 128.202 L
1521.066 129.566 L
1521.375 133.087 L
1521.683 137.311 L
1521.992 140.435 L
1522.301 140.574 L
1522.609 136.468 L
1522.918 130.483 L
1523.227 126.421 L
1523.535 126.923 L
1523.844 132.412 L
1524.153 139.126 L
1524.461 142.057 L
1524.77 141.423 L
1525.079 140.06 L
1525.387 138.162 L
1525.696 136.02 L
1526.005 134.18 L
1526.313 131.234 L
1526.622 127.484 L
1526.931 124.678 L
1527.239 122.983 L
1527.548 121.453 L
1527.857 120.185 L
1528.165 120.367 L
1528.474 121.517 L
1528.783 122.28 L
1529.091 121.942 L
1529.4 120.45 L
1529.709 120.485 L
1530.017 124.078 L
1530.326 127.155 L
1530.635 125.776 L
1530.943 122.618 L
1531.252 121.029 L
1531.561 120.276 L
1531.869 119.114 L
1532.178 118.89 L
1532.487 120.149 L
1532.795 120.315 L
1533.104 117.981 L
1533.413 115.899 L
1533.721 117.931 L
1534.03 123.372 L
1534.339 127.726 L
1534.647 128.666 L
1534.956 127.006 L
1535.265 124.734 L
1535.573 123.032 L
1535.882 121.78 L
1536.191 120.83 L
1536.499 119.962 L
1536.808 118.889 L
1537.117 116.962 L
1537.425 113.35 L
1537.734 109.734 L
1538.043 108.772 L
1538.351 110.286 L
1538.66 112.169 L
1538.969 113.786 L
1539.277 116.565 L
1539.586 119.381 L
1539.895 119.719 L
1540.203 119.388 L
1540.512 121.494 L
1540.821 125.391 L
1541.129 127.39 L
1541.438 126.041 L
1541.747 124.54 L
1542.055 123.597 L
1542.364 120.799 L
1542.673 118.389 L
1542.981 121.349 L
1543.29 129.321 L
1543.599 135.625 L
1543.907 135.449 L
1544.216 131.339 L
1544.525 128.634 L
1544.833 128.897 L
1545.142 129.414 L
1545.451 128.211 L
1545.759 126.082 L
1546.068 122.563 L
1546.377 117.338 L
1546.685 116.539 L
1546.994 123.424 L
1547.303 127.833 L
1547.611 122.407 L
1547.92 113.903 L
1548.229 110.215 L
1548.537 112.819 L
1548.846 118.8 L
1549.155 123.146 L
1549.463 124.345 L
1549.772 125.42 L
1550.081 126.726 L
1550.389 125.694 L
1550.698 123.725 L
1551.007 124.434 L
1551.315 127.076 L
1551.624 128.591 L
1551.933 129.387 L
1552.241 131.099 L
1552.55 131.681 L
1552.859 129.256 L
1553.167 127.95 L
1553.476 132.018 L
1553.785 136.488 L
1554.093 134.518 L
1554.402 129.863 L
1554.711 129.428 L
1555.019 131.213 L
1555.328 129.469 L
1555.637 125.264 L
1555.945 123.99 L
1556.254 125.404 L
1556.563 124.768 L
1556.871 121.866 L
1557.18 119.669 L
1557.489 117.399 L
1557.797 113.493 L
1558.106 111.895 L
1558.415 117.509 L
1558.723 125.949 L
1559.032 126.493 L
1559.341 118.796 L
1559.649 115.149 L
1559.958 119.84 L
1560.267 123.739 L
1560.575 123.44 L
1560.884 123.54 L
1561.193 125.053 L
1561.501 126.839 L
1561.81 128.851 L
1562.119 130.721 L
1562.427 131.078 L
1562.736 127.57 L
1563.045 121.214 L
1563.353 117.136 L
1563.662 117.76 L
1563.971 120.973 L
1564.279 123.632 L
1564.588 124.246 L
1564.897 124.724 L
1565.205 126.987 L
1565.514 128.711 L
1565.823 128.145 L
1566.131 127.265 L
1566.44 127.512 L
1566.749 127.56 L
1567.057 126.082 L
1567.366 123.412 L
1567.675 120.333 L
1567.983 117.881 L
1568.292 117.561 L
1568.601 119.715 L
1568.909 122.872 L
1569.218 126.1 L
1569.527 128.051 L
1569.835 127.355 L
1570.144 126.944 L
1570.453 128.939 L
1570.761 129.69 L
1571.07 125.833 L
1571.379 118.809 L
1571.687 113.266 L
1571.996 113.281 L
1572.305 117.632 L
1572.613 120.859 L
1572.922 120.235 L
1573.231 118.861 L
1573.539 120.653 L
1573.848 124.968 L
1574.157 129.449 L
1574.465 132.706 L
1574.774 132.635 L
1575.083 130.354 L
1575.391 131.944 L
1575.7 138.404 L
1576.009 142.054 L
1576.317 138.161 L
1576.626 133.797 L
1576.935 136.767 L
1577.243 141.979 L
1577.552 142.531 L
1577.861 142.476 L
1578.169 145.747 L
1578.478 148.216 L
1578.787 146.5 L
1579.095 143.826 L
1579.404 144.128 L
1579.713 145.404 L
1580.021 144.39 L
1580.33 143.481 L
1580.639 145.531 L
1580.947 145.993 L
1581.256 141.746 L
1581.565 137.974 L
1581.873 136.859 L
1582.182 134.431 L
1582.491 129.743 L
1582.799 125.327 L
1583.108 122.404 L
1583.417 122.102 L
1583.725 124.816 L
1584.034 128.175 L
1584.343 129.684 L
1584.651 128.364 L
1584.96 124.494 L
1585.269 120.139 L
1585.577 117.343 L
1585.886 114.764 L
1586.195 109.51 L
1586.503 103.979 L
1586.812 104.259 L
1587.121 109.54 L
1587.429 113.95 L
1587.738 116.64 L
1588.047 120.018 L
1588.355 123.477 L
1588.664 125.443 L
1588.973 126.038 L
1589.281 125.316 L
1589.59 124.698 L
1589.899 128.057 L
1590.207 135.74 L
1590.516 142.565 L
1590.825 145.39 L
1591.133 146.306 L
1591.442 147.053 L
1591.751 146.875 L
1592.059 145.97 L
1592.368 146.277 L
1592.677 146.89 L
1592.985 144.886 L
1593.294 142.185 L
1593.603 142.983 L
1593.911 145.906 L
1594.22 147.451 L
1594.529 148.574 L
1594.837 149.792 L
1595.146 149.393 L
1595.455 146.711 L
1595.763 141.099 L
1596.072 134.627 L
1596.381 131.514 L
1596.689 130.867 L
1596.998 129.148 L
1597.307 127.165 L
1597.615 125.043 L
1597.924 121.378 L
1598.233 120.169 L
1598.541 123.76 L
1598.85 127.056 L
1599.159 126.908 L
1599.467 124.427 L
1599.776 120.019 L
1600.085 117.02 L
1600.393 119.852 L
1600.702 125.522 L
1601.011 128.706 L
1601.319 129.633 L
1601.628 129.975 L
1601.937 128.818 L
1602.245 126.671 L
1602.554 126.88 L
1602.863 130.686 L
1603.171 134.93 L
1603.48 135.178 L
1603.789 131.057 L
1604.097 127.102 L
1604.406 127.02 L
1604.715 129.089 L
1605.023 129.471 L
1605.332 127.717 L
1605.641 127.591 L
1605.949 133.168 L
1606.258 142.468 L
1606.567 147.848 L
1606.875 145.475 L
1607.184 140.119 L
1607.493 138.041 L
1607.801 139.32 L
1608.11 140.665 L
1608.419 141.544 L
1608.727 143.144 L
1609.036 146.514 L
1609.345 152.214 L
1609.653 158.995 L
1609.962 163.57 L
1610.271 161.227 L
1610.579 152.303 L
1610.888 144.915 L
1611.197 143.453 L
1611.505 143.788 L
1611.814 142.043 L
1612.123 138.958 L
1612.431 136.841 L
1612.74 136.484 L
1613.049 137.816 L
1613.357 140.82 L
1613.666 143.428 L
1613.975 143.545 L
1614.283 142.29 L
1614.592 140.521 L
1614.901 137.611 L
1615.209 134.736 L
1615.518 133.569 L
1615.827 132.638 L
1616.135 130.185 L
1616.444 128.427 L
1616.753 130.36 L
1617.061 134.083 L
1617.37 134.292 L
1617.679 130.295 L
1617.987 126.289 L
1618.296 124.153 L
1618.605 122.331 L
1618.913 117.395 L
1619.222 109.172 L
1619.531 104.349 L
1619.839 106.956 L
1620.148 112.85 L
1620.457 115.799 L
1620.765 114.36 L
1621.074 113.927 L
1621.383 118.171 L
1621.691 123.358 L
1622 126.108 L
1622.166 127.092 L
S
GR
%%Trailer
%%Pages: 1
%%EOF
