%!PS-Adobe-3.0 EPSF-3.0
%%Creator: (MATLAB, The Mathworks, Inc. Version 9.10.0.1602886 \(R2021a\). Operating System: Mac OS X)
%%Title: /Users/kosciessa/Desktop/tardis/LNDG/stateswitch/stsw_eeg_task/tfr/figures/b01_thetaTraces_oa.eps
%%CreationDate: 2022-02-22T16:23:58
%%Pages: (atend)
%%BoundingBox:     2     0   388   266
%%LanguageLevel: 3
%%EndComments
%%BeginProlog
%%BeginResource: procset (Apache XML Graphics Std ProcSet) 1.2 0
%%Version: 1.2 0
%%Copyright: (Copyright 2001-2003,2010 The Apache Software Foundation. License terms: http://www.apache.org/licenses/LICENSE-2.0)
/bd{bind def}bind def
/ld{load def}bd
/GR/grestore ld
/GS/gsave ld
/RM/rmoveto ld
/C/curveto ld
/t/show ld
/L/lineto ld
/ML/setmiterlimit ld
/CT/concat ld
/f/fill ld
/N/newpath ld
/S/stroke ld
/CC/setcmykcolor ld
/A/ashow ld
/cp/closepath ld
/RC/setrgbcolor ld
/LJ/setlinejoin ld
/GC/setgray ld
/LW/setlinewidth ld
/M/moveto ld
/re {4 2 roll M
1 index 0 rlineto
0 exch rlineto
neg 0 rlineto
cp } bd
/_ctm matrix def
/_tm matrix def
/BT { _ctm currentmatrix pop matrix _tm copy pop 0 0 moveto } bd
/ET { _ctm setmatrix } bd
/iTm { _ctm setmatrix _tm concat } bd
/Tm { _tm astore pop iTm 0 0 moveto } bd
/ux 0.0 def
/uy 0.0 def
/F {
  /Tp exch def
  /Tf exch def
  Tf findfont Tp scalefont setfont
  /cf Tf def  /cs Tp def
} bd
/ULS {currentpoint /uy exch def /ux exch def} bd
/ULE {
  /Tcx currentpoint pop def
  gsave
  newpath
  cf findfont cs scalefont dup
  /FontMatrix get 0 get /Ts exch def /FontInfo get dup
  /UnderlinePosition get Ts mul /To exch def
  /UnderlineThickness get Ts mul /Tt exch def
  ux uy To add moveto  Tcx uy To add lineto
  Tt setlinewidth stroke
  grestore
} bd
/OLE {
  /Tcx currentpoint pop def
  gsave
  newpath
  cf findfont cs scalefont dup
  /FontMatrix get 0 get /Ts exch def /FontInfo get dup
  /UnderlinePosition get Ts mul /To exch def
  /UnderlineThickness get Ts mul /Tt exch def
  ux uy To add cs add moveto Tcx uy To add cs add lineto
  Tt setlinewidth stroke
  grestore
} bd
/SOE {
  /Tcx currentpoint pop def
  gsave
  newpath
  cf findfont cs scalefont dup
  /FontMatrix get 0 get /Ts exch def /FontInfo get dup
  /UnderlinePosition get Ts mul /To exch def
  /UnderlineThickness get Ts mul /Tt exch def
  ux uy To add cs 10 mul 26 idiv add moveto Tcx uy To add cs 10 mul 26 idiv add lineto
  Tt setlinewidth stroke
  grestore
} bd
/QT {
/Y22 exch store
/X22 exch store
/Y21 exch store
/X21 exch store
currentpoint
/Y21 load 2 mul add 3 div exch
/X21 load 2 mul add 3 div exch
/X21 load 2 mul /X22 load add 3 div
/Y21 load 2 mul /Y22 load add 3 div
/X22 load /Y22 load curveto
} bd
/SSPD {
dup length /d exch dict def
{
/v exch def
/k exch def
currentpagedevice k known {
/cpdv currentpagedevice k get def
v cpdv ne {
/upd false def
/nullv v type /nulltype eq def
/nullcpdv cpdv type /nulltype eq def
nullv nullcpdv or
{
/upd true def
} {
/sametype v type cpdv type eq def
sametype {
v type /arraytype eq {
/vlen v length def
/cpdvlen cpdv length def
vlen cpdvlen eq {
0 1 vlen 1 sub {
/i exch def
/obj v i get def
/cpdobj cpdv i get def
obj cpdobj ne {
/upd true def
exit
} if
} for
} {
/upd true def
} ifelse
} {
v type /dicttype eq {
v {
/dv exch def
/dk exch def
/cpddv cpdv dk get def
dv cpddv ne {
/upd true def
exit
} if
} forall
} {
/upd true def
} ifelse
} ifelse
} if
} ifelse
upd true eq {
d k v put
} if
} if
} if
} forall
d length 0 gt {
d setpagedevice
} if
} bd
/RE { % /NewFontName [NewEncodingArray] /FontName RE -
  findfont dup length dict begin
  {
    1 index /FID ne
    {def} {pop pop} ifelse
  } forall
  /Encoding exch def
  /FontName 1 index def
  currentdict definefont pop
  end
} bind def
%%EndResource
%%BeginResource: procset (Apache XML Graphics EPS ProcSet) 1.0 0
%%Version: 1.0 0
%%Copyright: (Copyright 2002-2003 The Apache Software Foundation. License terms: http://www.apache.org/licenses/LICENSE-2.0)
/BeginEPSF { %def
/b4_Inc_state save def         % Save state for cleanup
/dict_count countdictstack def % Count objects on dict stack
/op_count count 1 sub def      % Count objects on operand stack
userdict begin                 % Push userdict on dict stack
/showpage { } def              % Redefine showpage, { } = null proc
0 setgray 0 setlinecap         % Prepare graphics state
1 setlinewidth 0 setlinejoin
10 setmiterlimit [ ] 0 setdash newpath
/languagelevel where           % If level not equal to 1 then
{pop languagelevel             % set strokeadjust and
1 ne                           % overprint to their defaults.
{false setstrokeadjust false setoverprint
} if
} if
} bd
/EndEPSF { %def
count op_count sub {pop} repeat            % Clean up stacks
countdictstack dict_count sub {end} repeat
b4_Inc_state restore
} bd
%%EndResource
%FOPBeginFontDict
%%IncludeResource: font Courier-Oblique
%%IncludeResource: font Courier-BoldOblique
%%IncludeResource: font Courier-Bold
%%IncludeResource: font ZapfDingbats
%%IncludeResource: font Symbol
%%IncludeResource: font Helvetica
%%IncludeResource: font Helvetica-Oblique
%%IncludeResource: font Helvetica-Bold
%%IncludeResource: font Helvetica-BoldOblique
%%IncludeResource: font Times-Roman
%%IncludeResource: font Times-Italic
%%IncludeResource: font Times-Bold
%%IncludeResource: font Times-BoldItalic
%%IncludeResource: font Courier
%FOPEndFontDict
%%BeginResource: encoding WinAnsiEncoding
/WinAnsiEncoding [
/.notdef /.notdef /.notdef /.notdef /.notdef
/.notdef /.notdef /.notdef /.notdef /.notdef
/.notdef /.notdef /.notdef /.notdef /.notdef
/.notdef /.notdef /.notdef /.notdef /.notdef
/.notdef /.notdef /.notdef /.notdef /.notdef
/.notdef /.notdef /.notdef /.notdef /.notdef
/.notdef /.notdef /space /exclam /quotedbl
/numbersign /dollar /percent /ampersand /quotesingle
/parenleft /parenright /asterisk /plus /comma
/hyphen /period /slash /zero /one
/two /three /four /five /six
/seven /eight /nine /colon /semicolon
/less /equal /greater /question /at
/A /B /C /D /E
/F /G /H /I /J
/K /L /M /N /O
/P /Q /R /S /T
/U /V /W /X /Y
/Z /bracketleft /backslash /bracketright /asciicircum
/underscore /quoteleft /a /b /c
/d /e /f /g /h
/i /j /k /l /m
/n /o /p /q /r
/s /t /u /v /w
/x /y /z /braceleft /bar
/braceright /asciitilde /bullet /Euro /bullet
/quotesinglbase /florin /quotedblbase /ellipsis /dagger
/daggerdbl /circumflex /perthousand /Scaron /guilsinglleft
/OE /bullet /Zcaron /bullet /bullet
/quoteleft /quoteright /quotedblleft /quotedblright /bullet
/endash /emdash /asciitilde /trademark /scaron
/guilsinglright /oe /bullet /zcaron /Ydieresis
/space /exclamdown /cent /sterling /currency
/yen /brokenbar /section /dieresis /copyright
/ordfeminine /guillemotleft /logicalnot /sfthyphen /registered
/macron /degree /plusminus /twosuperior /threesuperior
/acute /mu /paragraph /middot /cedilla
/onesuperior /ordmasculine /guillemotright /onequarter /onehalf
/threequarters /questiondown /Agrave /Aacute /Acircumflex
/Atilde /Adieresis /Aring /AE /Ccedilla
/Egrave /Eacute /Ecircumflex /Edieresis /Igrave
/Iacute /Icircumflex /Idieresis /Eth /Ntilde
/Ograve /Oacute /Ocircumflex /Otilde /Odieresis
/multiply /Oslash /Ugrave /Uacute /Ucircumflex
/Udieresis /Yacute /Thorn /germandbls /agrave
/aacute /acircumflex /atilde /adieresis /aring
/ae /ccedilla /egrave /eacute /ecircumflex
/edieresis /igrave /iacute /icircumflex /idieresis
/eth /ntilde /ograve /oacute /ocircumflex
/otilde /odieresis /divide /oslash /ugrave
/uacute /ucircumflex /udieresis /yacute /thorn
/ydieresis
] def
%%EndResource
%FOPBeginFontReencode
/Courier-Oblique findfont
dup length dict begin
  {1 index /FID ne {def} {pop pop} ifelse} forall
  /Encoding WinAnsiEncoding def
  currentdict
end
/Courier-Oblique exch definefont pop
/Courier-BoldOblique findfont
dup length dict begin
  {1 index /FID ne {def} {pop pop} ifelse} forall
  /Encoding WinAnsiEncoding def
  currentdict
end
/Courier-BoldOblique exch definefont pop
/Courier-Bold findfont
dup length dict begin
  {1 index /FID ne {def} {pop pop} ifelse} forall
  /Encoding WinAnsiEncoding def
  currentdict
end
/Courier-Bold exch definefont pop
/Helvetica findfont
dup length dict begin
  {1 index /FID ne {def} {pop pop} ifelse} forall
  /Encoding WinAnsiEncoding def
  currentdict
end
/Helvetica exch definefont pop
/Helvetica-Oblique findfont
dup length dict begin
  {1 index /FID ne {def} {pop pop} ifelse} forall
  /Encoding WinAnsiEncoding def
  currentdict
end
/Helvetica-Oblique exch definefont pop
/Helvetica-Bold findfont
dup length dict begin
  {1 index /FID ne {def} {pop pop} ifelse} forall
  /Encoding WinAnsiEncoding def
  currentdict
end
/Helvetica-Bold exch definefont pop
/Helvetica-BoldOblique findfont
dup length dict begin
  {1 index /FID ne {def} {pop pop} ifelse} forall
  /Encoding WinAnsiEncoding def
  currentdict
end
/Helvetica-BoldOblique exch definefont pop
/Times-Roman findfont
dup length dict begin
  {1 index /FID ne {def} {pop pop} ifelse} forall
  /Encoding WinAnsiEncoding def
  currentdict
end
/Times-Roman exch definefont pop
/Times-Italic findfont
dup length dict begin
  {1 index /FID ne {def} {pop pop} ifelse} forall
  /Encoding WinAnsiEncoding def
  currentdict
end
/Times-Italic exch definefont pop
/Times-Bold findfont
dup length dict begin
  {1 index /FID ne {def} {pop pop} ifelse} forall
  /Encoding WinAnsiEncoding def
  currentdict
end
/Times-Bold exch definefont pop
/Times-BoldItalic findfont
dup length dict begin
  {1 index /FID ne {def} {pop pop} ifelse} forall
  /Encoding WinAnsiEncoding def
  currentdict
end
/Times-BoldItalic exch definefont pop
/Courier findfont
dup length dict begin
  {1 index /FID ne {def} {pop pop} ifelse} forall
  /Encoding WinAnsiEncoding def
  currentdict
end
/Courier exch definefont pop
%FOPEndFontReencode
%%EndProlog
%%Page: 1 1
%%PageBoundingBox: 0 0 425 283
%%BeginPageSetup
[1 0 0 -1 0 283] CT
%%EndPageSetup
GS
[1.00046 0 0 1 0 0] CT
1 GC
N
0 0 425 283 re
f
GR
GS
[1.00046 0 0 1 0 0] CT
1 GC
N
0 0 425 283 re
f
GR
GS
[1.00046 0 0 1 0 0] CT
1 GC
N
64.5 248.5 M
384.5 248.5 L
384.5 21 L
64.5 21 L
cp
f
GR
GS
[1.00046 0 0 1 0 0] CT
0.149 GC
2 setlinecap
1 LJ
0.5 LW
N
64.5 248.5 M
384.5 248.5 L
S
GR
GS
[1.00046 0 0 1 0 0] CT
0.149 GC
2 setlinecap
1 LJ
0.5 LW
N
89.115 248.5 M
89.115 245.304 L
S
GR
GS
[1.00046 0 0 1 0 0] CT
0.149 GC
2 setlinecap
1 LJ
0.5 LW
N
138.346 248.5 M
138.346 245.304 L
S
GR
GS
[1.00046 0 0 1 0 0] CT
0.149 GC
2 setlinecap
1 LJ
0.5 LW
N
187.577 248.5 M
187.577 245.304 L
S
GR
GS
[1.00046 0 0 1 0 0] CT
0.149 GC
2 setlinecap
1 LJ
0.5 LW
N
236.808 248.5 M
236.808 245.304 L
S
GR
GS
[1.00046 0 0 1 0 0] CT
0.149 GC
2 setlinecap
1 LJ
0.5 LW
N
286.038 248.5 M
286.038 245.304 L
S
GR
GS
[1.00046 0 0 1 0 0] CT
0.149 GC
2 setlinecap
1 LJ
0.5 LW
N
335.269 248.5 M
335.269 245.304 L
S
GR
GS
[1.00046 0 0 1 0 0] CT
0.149 GC
2 setlinecap
1 LJ
0.5 LW
N
384.5 248.5 M
384.5 245.304 L
S
GR
GS
[1.00046 0 0 1 89.15666 252.89983] CT
0.149 GC
/Helvetica 12 F
GS
[1 0 0 1 0 0] CT
-6 12 moveto 
1 -1 scale
(-1) t 
GR
GR
GS
[1.00046 0 0 1 138.41024 252.89983] CT
0.149 GC
/Helvetica 12 F
GS
[1 0 0 1 0 0] CT
-3.5 12 moveto 
1 -1 scale
(0) t 
GR
GR
GS
[1.00046 0 0 1 187.6638 252.89983] CT
0.149 GC
/Helvetica 12 F
GS
[1 0 0 1 0 0] CT
-3.5 12 moveto 
1 -1 scale
(1) t 
GR
GR
GS
[1.00046 0 0 1 236.91737 252.89983] CT
0.149 GC
/Helvetica 12 F
GS
[1 0 0 1 0 0] CT
-3.5 12 moveto 
1 -1 scale
(2) t 
GR
GR
GS
[1.00046 0 0 1 286.17093 252.89983] CT
0.149 GC
/Helvetica 12 F
GS
[1 0 0 1 0 0] CT
-3.5 12 moveto 
1 -1 scale
(3) t 
GR
GR
GS
[1.00046 0 0 1 335.42451 252.89983] CT
0.149 GC
/Helvetica 12 F
GS
[1 0 0 1 0 0] CT
-3.5 12 moveto 
1 -1 scale
(4) t 
GR
GR
GS
[1.00046 0 0 1 384.67808 252.89983] CT
0.149 GC
/Helvetica 12 F
GS
[1 0 0 1 0 0] CT
-3.5 12 moveto 
1 -1 scale
(5) t 
GR
GR
GS
[1.00046 0 0 1 224.60413 268.50003] CT
0.149 GC
/Helvetica 12 F
GS
[1 0 0 1 0 0] CT
-21 12 moveto 
1 -1 scale
(Time \(s\)) t 
GR
GR
GS
[1.00046 0 0 1 0 0] CT
0.149 GC
2 setlinecap
1 LJ
0.5 LW
N
64.5 248.5 M
64.5 21 L
S
GR
GS
[1.00046 0 0 1 0 0] CT
0.149 GC
2 setlinecap
1 LJ
0.5 LW
N
64.5 248.5 M
67.696 248.5 L
S
GR
GS
[1.00046 0 0 1 0 0] CT
0.149 GC
2 setlinecap
1 LJ
0.5 LW
N
64.5 172.667 M
67.696 172.667 L
S
GR
GS
[1.00046 0 0 1 0 0] CT
0.149 GC
2 setlinecap
1 LJ
0.5 LW
N
64.5 96.833 M
67.696 96.833 L
S
GR
GS
[1.00046 0 0 1 0 0] CT
0.149 GC
2 setlinecap
1 LJ
0.5 LW
N
64.5 21 M
67.696 21 L
S
GR
GS
[1.00046 0 0 1 60.12783 248.49986] CT
0.149 GC
/Helvetica 12 F
GS
[1 0 0 1 0 0] CT
-22 4.5 moveto 
1 -1 scale
(-5.6) t 
GR
GR
GS
[1.00046 0 0 1 60.12783 172.66696] CT
0.149 GC
/Helvetica 12 F
GS
[1 0 0 1 0 0] CT
-29 4.5 moveto 
1 -1 scale
(-5.55) t 
GR
GR
GS
[1.00046 0 0 1 60.12783 96.83334] CT
0.149 GC
/Helvetica 12 F
GS
[1 0 0 1 0 0] CT
-22 4.5 moveto 
1 -1 scale
(-5.5) t 
GR
GR
GS
[1.00046 0 0 1 60.12783 20.99971] CT
0.149 GC
/Helvetica 12 F
GS
[1 0 0 1 0 0] CT
-29 4.5 moveto 
1 -1 scale
(-5.45) t 
GR
GR
GS
[0 -1 1.00046 0 29.01344 134.74942] CT
0.149 GC
/Helvetica 12 F
GS
[1 0 0 1 0 0] CT
-53.5 -18 moveto 
1 -1 scale
(2-8 Hz Theta Power) t 
GR
GR
GS
[0 -1 1.00046 0 29.01344 134.74942] CT
0.149 GC
/Helvetica 12 F
GS
[1 0 0 1 0 0] CT
-46 -3 moveto 
1 -1 scale
(\(a.u.; normalized\)) t 
GR
GR
GS
[1.00046 0 0 1 0 0] CT
0.996 0.98 0.98 RC
N
126.038 194.393 M
123.577 198.823 L
121.115 202.916 L
118.654 207.273 L
116.192 208.786 L
113.731 209.774 L
111.269 212.474 L
108.808 214.574 L
106.346 214.905 L
103.885 215.12 L
101.423 211.932 L
98.962 209.252 L
96.5 208.61 L
94.038 207.104 L
91.577 205.982 L
89.115 205.906 L
86.654 204.416 L
84.192 202.102 L
81.731 199.175 L
79.269 195.4 L
76.808 190.423 L
74.346 185.889 L
71.885 181.805 L
69.423 174.8 L
66.962 170.44 L
64.5 166.69 L
64.462 166.654 L
64.462 166.865 L
64.462 180.539 L
64.5 180.58 L
66.962 184.778 L
69.423 189.053 L
71.885 195.867 L
74.346 199.399 L
76.808 203.613 L
79.269 208.713 L
81.731 212.421 L
84.192 215.427 L
86.654 217.694 L
89.115 219.514 L
91.577 219.612 L
94.038 220.737 L
96.5 221.657 L
98.962 221.284 L
101.423 223.13 L
103.885 226.166 L
106.346 225.569 L
108.808 225.68 L
111.269 223.761 L
113.731 222.12 L
116.192 222.193 L
118.654 220.814 L
121.115 216.411 L
123.577 211.506 L
126.038 205.785 L
128.5 197.518 L
130.962 187.413 L
133.423 179.213 L
135.885 171.106 L
138.346 157.986 L
140.808 138.121 L
143.269 116.888 L
145.731 95.248 L
148.192 81.518 L
150.654 79.831 L
153.115 83.799 L
155.577 88.938 L
158.038 95.612 L
160.5 104.594 L
162.962 113.58 L
165.423 126.093 L
167.885 137.529 L
170.346 150.412 L
172.808 163.09 L
175.269 173.53 L
177.731 182.067 L
180.192 190.725 L
182.654 200.727 L
185.115 209.662 L
187.577 220.207 L
190.038 226.244 L
192.5 232.162 L
194.962 237.645 L
197.423 242.133 L
199.885 245.292 L
202.346 244.576 L
204.808 241.776 L
207.269 238.896 L
209.731 235.492 L
212.192 233.03 L
214.654 228.369 L
217.115 226.839 L
219.577 230.231 L
222.038 234.27 L
224.5 238.332 L
226.962 239.81 L
229.423 243.073 L
231.885 244.16 L
234.346 242.863 L
236.808 243.231 L
239.269 242.977 L
241.731 241.486 L
244.192 236.148 L
246.654 230.544 L
249.115 228.745 L
251.577 227.305 L
254.038 225.182 L
256.5 224.766 L
258.962 227.204 L
261.423 225.1 L
263.885 223.442 L
266.346 223.281 L
268.808 221.953 L
271.269 219.397 L
273.731 218.491 L
276.192 217.285 L
278.654 215.216 L
281.115 212.375 L
283.577 211.958 L
286.038 207.157 L
288.5 195.752 L
290.962 180.684 L
293.423 158.524 L
295.885 133.532 L
298.346 106.805 L
300.808 83.006 L
303.269 65.71 L
305.731 54.442 L
308.192 50.301 L
310.654 50.345 L
313.115 57.138 L
315.577 71.264 L
318.038 90.499 L
320.5 111.058 L
322.962 129.484 L
325.423 146.464 L
327.885 162.238 L
330.346 174.385 L
332.808 186.962 L
335.269 197.284 L
337.731 203.284 L
340.192 210.673 L
342.654 215.077 L
345.115 214.203 L
347.577 211.36 L
350.038 209.679 L
352.5 205.85 L
354.962 200.049 L
357.423 198.683 L
359.885 198.049 L
362.346 197.149 L
364.808 198.391 L
367.269 197.842 L
369.731 197.141 L
372.192 197.884 L
374.654 196.003 L
377.115 192.338 L
379.577 187.041 L
382.038 180.056 L
384.5 170.712 L
384.538 170.546 L
384.538 158.714 L
384.538 158.524 L
384.5 158.694 L
382.038 167.443 L
379.577 173.744 L
377.115 178.507 L
374.654 180.922 L
372.192 182.299 L
369.731 181.311 L
367.269 182.184 L
364.808 182.861 L
362.346 181.943 L
359.885 182.881 L
357.423 182.821 L
354.962 182.764 L
352.5 187.512 L
350.038 190.271 L
347.577 191.898 L
345.115 194.49 L
342.654 194.986 L
340.192 190.505 L
337.731 183.607 L
335.269 178.121 L
332.808 167.994 L
330.346 155.234 L
327.885 143.637 L
325.423 128.417 L
322.962 112.055 L
320.5 93.854 L
318.038 73.402 L
315.577 53.532 L
313.115 38.595 L
310.654 32.044 L
308.192 32.495 L
305.731 37.361 L
303.269 49.899 L
300.808 68.274 L
298.346 92.767 L
295.885 119.985 L
293.423 145.39 L
290.962 167.269 L
288.5 182.301 L
286.038 193.159 L
283.577 197.793 L
281.115 198.312 L
278.654 201.38 L
276.192 203.721 L
273.731 205.859 L
271.269 207.589 L
268.808 210.746 L
266.346 211.674 L
263.885 211.977 L
261.423 213.877 L
258.962 215.46 L
256.5 213.21 L
254.038 213.577 L
251.577 215.298 L
249.115 216.477 L
246.654 218.078 L
244.192 222.52 L
241.731 227.481 L
239.269 228.584 L
236.808 229.323 L
234.346 228.875 L
231.885 229.527 L
229.423 227.763 L
226.962 224.523 L
224.5 222.995 L
222.038 218.962 L
219.577 215.008 L
217.115 211.269 L
214.654 212.458 L
212.192 217.022 L
209.731 219.768 L
207.269 224.008 L
204.808 228.162 L
202.346 230.985 L
199.885 231.587 L
197.423 228.457 L
194.962 224.226 L
192.5 218.954 L
190.038 213.154 L
187.577 207.023 L
185.115 196.404 L
182.654 187.307 L
180.192 176.646 L
177.731 168.008 L
175.269 160.525 L
172.808 151.369 L
170.346 139.554 L
167.885 127.203 L
165.423 116.46 L
162.962 103.592 L
160.5 93.58 L
158.038 83.39 L
155.577 76.42 L
153.115 71.484 L
150.654 67.743 L
148.192 69.297 L
145.731 83.446 L
143.269 105.459 L
140.808 126.72 L
138.346 146.875 L
135.885 160.521 L
133.423 169.181 L
130.962 177.698 L
128.5 187.3 L
cp
f
GR
GS
[1.00046 0 0 1 0 0] CT
0.98 0.91 0.91 RC
1 LJ
0.5 LW
N
64.462 180.539 M
64.5 180.58 L
66.962 184.778 L
69.423 189.053 L
71.885 195.867 L
74.346 199.399 L
76.808 203.613 L
79.269 208.713 L
81.731 212.421 L
84.192 215.427 L
86.654 217.694 L
89.115 219.514 L
91.577 219.612 L
94.038 220.737 L
96.5 221.657 L
98.962 221.284 L
101.423 223.13 L
103.885 226.166 L
106.346 225.569 L
108.808 225.68 L
111.269 223.761 L
113.731 222.12 L
116.192 222.193 L
118.654 220.814 L
121.115 216.411 L
123.577 211.506 L
126.038 205.785 L
128.5 197.518 L
130.962 187.413 L
133.423 179.213 L
135.885 171.106 L
138.346 157.986 L
140.808 138.121 L
143.269 116.888 L
145.731 95.248 L
148.192 81.518 L
150.654 79.831 L
153.115 83.799 L
155.577 88.938 L
158.038 95.612 L
160.5 104.594 L
162.962 113.58 L
165.423 126.093 L
167.885 137.529 L
170.346 150.412 L
172.808 163.09 L
175.269 173.53 L
177.731 182.067 L
180.192 190.725 L
182.654 200.727 L
185.115 209.662 L
187.577 220.207 L
190.038 226.244 L
192.5 232.162 L
194.962 237.645 L
197.423 242.133 L
199.885 245.292 L
202.346 244.576 L
204.808 241.776 L
207.269 238.896 L
209.731 235.492 L
212.192 233.03 L
214.654 228.369 L
217.115 226.839 L
219.577 230.231 L
222.038 234.27 L
224.5 238.332 L
226.962 239.81 L
229.423 243.073 L
231.885 244.16 L
234.346 242.863 L
236.808 243.231 L
239.269 242.977 L
241.731 241.486 L
244.192 236.148 L
246.654 230.544 L
249.115 228.745 L
251.577 227.305 L
254.038 225.182 L
256.5 224.766 L
258.962 227.204 L
261.423 225.1 L
263.885 223.442 L
266.346 223.281 L
268.808 221.953 L
271.269 219.397 L
273.731 218.491 L
276.192 217.285 L
278.654 215.216 L
281.115 212.375 L
283.577 211.958 L
286.038 207.157 L
288.5 195.752 L
290.962 180.684 L
293.423 158.524 L
295.885 133.532 L
298.346 106.805 L
300.808 83.006 L
303.269 65.71 L
305.731 54.442 L
308.192 50.301 L
310.654 50.345 L
313.115 57.138 L
315.577 71.264 L
318.038 90.499 L
320.5 111.058 L
322.962 129.484 L
325.423 146.464 L
327.885 162.238 L
330.346 174.385 L
332.808 186.962 L
335.269 197.284 L
337.731 203.284 L
340.192 210.673 L
342.654 215.077 L
345.115 214.203 L
347.577 211.36 L
350.038 209.679 L
352.5 205.85 L
354.962 200.049 L
357.423 198.683 L
359.885 198.049 L
362.346 197.149 L
364.808 198.391 L
367.269 197.842 L
369.731 197.141 L
372.192 197.884 L
374.654 196.003 L
377.115 192.338 L
379.577 187.041 L
382.038 180.056 L
384.5 170.712 L
384.538 170.546 L
S
GR
GS
[1.00046 0 0 1 0 0] CT
0.98 0.91 0.91 RC
1 LJ
0.5 LW
N
64.462 166.654 M
64.5 166.69 L
66.962 170.44 L
69.423 174.8 L
71.885 181.805 L
74.346 185.889 L
76.808 190.423 L
79.269 195.4 L
81.731 199.175 L
84.192 202.102 L
86.654 204.416 L
89.115 205.906 L
91.577 205.982 L
94.038 207.104 L
96.5 208.61 L
98.962 209.252 L
101.423 211.932 L
103.885 215.12 L
106.346 214.905 L
108.808 214.574 L
111.269 212.474 L
113.731 209.774 L
116.192 208.786 L
118.654 207.273 L
121.115 202.916 L
123.577 198.823 L
126.038 194.393 L
128.5 187.3 L
130.962 177.698 L
133.423 169.181 L
135.885 160.521 L
138.346 146.875 L
140.808 126.72 L
143.269 105.459 L
145.731 83.446 L
148.192 69.297 L
150.654 67.743 L
153.115 71.484 L
155.577 76.42 L
158.038 83.39 L
160.5 93.58 L
162.962 103.592 L
165.423 116.46 L
167.885 127.203 L
170.346 139.554 L
172.808 151.369 L
175.269 160.525 L
177.731 168.008 L
180.192 176.646 L
182.654 187.307 L
185.115 196.404 L
187.577 207.023 L
190.038 213.154 L
192.5 218.954 L
194.962 224.226 L
197.423 228.457 L
199.885 231.587 L
202.346 230.985 L
204.808 228.162 L
207.269 224.008 L
209.731 219.768 L
212.192 217.022 L
214.654 212.458 L
217.115 211.269 L
219.577 215.008 L
222.038 218.962 L
224.5 222.995 L
226.962 224.523 L
229.423 227.763 L
231.885 229.527 L
234.346 228.875 L
236.808 229.323 L
239.269 228.584 L
241.731 227.481 L
244.192 222.52 L
246.654 218.078 L
249.115 216.477 L
251.577 215.298 L
254.038 213.577 L
256.5 213.21 L
258.962 215.46 L
261.423 213.877 L
263.885 211.977 L
266.346 211.674 L
268.808 210.746 L
271.269 207.589 L
273.731 205.859 L
276.192 203.721 L
278.654 201.38 L
281.115 198.312 L
283.577 197.793 L
286.038 193.159 L
288.5 182.301 L
290.962 167.269 L
293.423 145.39 L
295.885 119.985 L
298.346 92.767 L
300.808 68.274 L
303.269 49.899 L
305.731 37.361 L
308.192 32.495 L
310.654 32.044 L
313.115 38.595 L
315.577 53.532 L
318.038 73.402 L
320.5 93.854 L
322.962 112.055 L
325.423 128.417 L
327.885 143.637 L
330.346 155.234 L
332.808 167.994 L
335.269 178.121 L
337.731 183.607 L
340.192 190.505 L
342.654 194.986 L
345.115 194.49 L
347.577 191.898 L
350.038 190.271 L
352.5 187.512 L
354.962 182.764 L
357.423 182.821 L
359.885 182.881 L
362.346 181.943 L
364.808 182.861 L
367.269 182.184 L
369.731 181.311 L
372.192 182.299 L
374.654 180.922 L
377.115 178.507 L
379.577 173.744 L
382.038 167.443 L
384.5 158.694 L
384.538 158.524 L
S
GR
GS
[1.00046 0 0 1 0 0] CT
0.961 0.8 0.8 RC
1 LJ
2 LW
N
64.462 173.597 M
64.5 173.635 L
66.962 177.609 L
69.423 181.927 L
71.885 188.836 L
74.346 192.644 L
76.808 197.018 L
79.269 202.056 L
81.731 205.798 L
84.192 208.764 L
86.654 211.055 L
89.115 212.71 L
91.577 212.797 L
94.038 213.92 L
96.5 215.134 L
98.962 215.268 L
101.423 217.531 L
103.885 220.644 L
106.346 220.237 L
108.808 220.127 L
111.269 218.118 L
113.731 215.947 L
116.192 215.49 L
118.654 214.044 L
121.115 209.664 L
123.577 205.165 L
126.038 200.089 L
128.5 192.41 L
130.962 182.556 L
133.423 174.197 L
135.885 165.813 L
138.346 152.43 L
140.808 132.421 L
143.269 111.173 L
145.731 89.347 L
148.192 75.408 L
150.654 73.787 L
153.115 77.642 L
155.577 82.679 L
158.038 89.501 L
160.5 99.087 L
162.962 108.586 L
165.423 121.276 L
167.885 132.366 L
170.346 144.983 L
172.808 157.229 L
175.269 167.028 L
177.731 175.038 L
180.192 183.685 L
182.654 194.017 L
185.115 203.034 L
187.577 213.615 L
190.038 219.699 L
192.5 225.558 L
194.962 230.935 L
197.423 235.295 L
199.885 238.439 L
202.346 237.781 L
204.808 234.969 L
207.269 231.452 L
209.731 227.63 L
212.192 225.026 L
214.654 220.414 L
217.115 219.054 L
219.577 222.62 L
222.038 226.616 L
224.5 230.663 L
226.962 232.166 L
229.423 235.418 L
231.885 236.844 L
234.346 235.869 L
236.808 236.277 L
239.269 235.781 L
241.731 234.483 L
244.192 229.334 L
246.654 224.311 L
249.115 222.611 L
251.577 221.302 L
254.038 219.379 L
256.5 218.988 L
258.962 221.332 L
261.423 219.489 L
263.885 217.709 L
266.346 217.477 L
268.808 216.349 L
271.269 213.493 L
273.731 212.176 L
276.192 210.503 L
278.654 208.298 L
281.115 205.343 L
283.577 204.876 L
286.038 200.158 L
288.5 189.027 L
290.962 173.977 L
293.423 151.957 L
295.885 126.758 L
298.346 99.786 L
300.808 75.64 L
303.269 57.805 L
305.731 45.901 L
308.192 41.398 L
310.654 41.195 L
313.115 47.867 L
315.577 62.399 L
318.038 81.95 L
320.5 102.456 L
322.962 120.77 L
325.423 137.44 L
327.885 152.937 L
330.346 164.809 L
332.808 177.478 L
335.269 187.703 L
337.731 193.445 L
340.192 200.59 L
342.654 205.032 L
345.115 204.346 L
347.577 201.629 L
350.038 199.975 L
352.5 196.681 L
354.962 191.406 L
357.423 190.752 L
359.885 190.465 L
362.346 189.546 L
364.808 190.626 L
367.269 190.013 L
369.731 189.226 L
372.192 190.092 L
374.654 188.462 L
377.115 185.422 L
379.577 180.392 L
382.038 173.75 L
384.5 164.703 L
384.538 164.535 L
S
GR
GS
[1.00046 0 0 1 0 0] CT
0.99 0.959 0.959 RC
N
123.577 201.256 M
126.038 199.65 L
128.5 195.989 L
130.962 189.936 L
133.423 181.178 L
135.885 168.237 L
138.346 155.529 L
140.808 139.398 L
143.269 122.34 L
145.731 108.385 L
148.192 102.649 L
150.654 103.088 L
153.115 107.644 L
155.577 113.364 L
158.038 119.798 L
160.5 129.19 L
162.962 138.018 L
165.423 144.462 L
167.885 153.638 L
170.346 161.648 L
172.808 170.94 L
175.269 178.528 L
177.731 186.179 L
180.192 192.041 L
182.654 196.238 L
185.115 199.533 L
187.577 203.71 L
190.038 203.394 L
192.5 204.535 L
194.962 204.904 L
197.423 204.575 L
199.885 206.414 L
202.346 209.119 L
204.808 212.915 L
207.269 216.693 L
209.731 220.909 L
212.192 224.283 L
214.654 225.392 L
217.115 227.043 L
219.577 228.1 L
222.038 226.692 L
224.5 224.353 L
226.962 221.911 L
229.423 219.727 L
231.885 220.668 L
234.346 220.751 L
236.808 219.562 L
239.269 220.616 L
241.731 220.767 L
244.192 222.339 L
246.654 228.385 L
249.115 232.73 L
251.577 236.157 L
254.038 237.205 L
256.5 235.703 L
258.962 235.307 L
261.423 235.28 L
263.885 233.433 L
266.346 229.082 L
268.808 224.555 L
271.269 221.865 L
273.731 223.011 L
276.192 221.092 L
278.654 221.347 L
281.115 218.984 L
283.577 214.877 L
286.038 206.891 L
288.5 195.948 L
290.962 183.203 L
293.423 171.554 L
295.885 156.981 L
298.346 137.228 L
300.808 116.472 L
303.269 99.183 L
305.731 88.483 L
308.192 83.173 L
310.654 80.294 L
313.115 83.347 L
315.577 89.231 L
318.038 98.361 L
320.5 110.589 L
322.962 120.18 L
325.423 128.661 L
327.885 137.305 L
330.346 148.785 L
332.808 157.904 L
335.269 165.285 L
337.731 170.2 L
340.192 176.748 L
342.654 183.502 L
345.115 188.883 L
347.577 192.405 L
350.038 199.021 L
352.5 203.786 L
354.962 206.777 L
357.423 208.802 L
359.885 210.666 L
362.346 212.082 L
364.808 215.133 L
367.269 218.492 L
369.731 218.814 L
372.192 214.379 L
374.654 208.563 L
377.115 201.395 L
379.577 194.349 L
382.038 186.659 L
384.5 179.601 L
384.538 179.466 L
384.538 167.538 L
384.538 167.365 L
384.5 167.485 L
382.038 173.685 L
379.577 181.648 L
377.115 189.185 L
374.654 197.076 L
372.192 202.801 L
369.731 206.566 L
367.269 206.293 L
364.808 202.825 L
362.346 200.131 L
359.885 199.419 L
357.423 198.179 L
354.962 195.84 L
352.5 192.7 L
350.038 188.169 L
347.577 181.912 L
345.115 178.037 L
342.654 172.188 L
340.192 165.481 L
337.731 159.188 L
335.269 153.898 L
332.808 146.099 L
330.346 136.05 L
327.885 124.863 L
325.423 116.104 L
322.962 107.9 L
320.5 99.241 L
318.038 88.942 L
315.577 79.823 L
313.115 73.184 L
310.654 69.072 L
308.192 70.811 L
305.731 75.852 L
303.269 86.306 L
300.808 103.067 L
298.346 124.386 L
295.885 144.73 L
293.423 160.202 L
290.962 172.227 L
288.5 184.608 L
286.038 194.673 L
283.577 201.977 L
281.115 206.092 L
278.654 209.07 L
276.192 210.064 L
273.731 212.984 L
271.269 211.891 L
268.808 213.537 L
266.346 216.069 L
263.885 219.842 L
261.423 221.506 L
258.962 221.926 L
256.5 222.487 L
254.038 224.093 L
251.577 223.29 L
249.115 220.833 L
246.654 216.877 L
244.192 211.036 L
241.731 208.536 L
239.269 207.927 L
236.808 207.222 L
234.346 208.39 L
231.885 207.72 L
229.423 206.543 L
226.962 208.416 L
224.5 210.175 L
222.038 213.401 L
219.577 214.724 L
217.115 214.37 L
214.654 213.594 L
212.192 212.699 L
209.731 209.115 L
207.269 205.03 L
204.808 201.391 L
202.346 198.014 L
199.885 195.543 L
197.423 194.014 L
194.962 194.875 L
192.5 195.206 L
190.038 193.633 L
187.577 193.069 L
185.115 188.416 L
182.654 184.11 L
180.192 179.824 L
177.731 174.1 L
175.269 167.064 L
172.808 160.86 L
170.346 152.464 L
167.885 144.003 L
165.423 134.613 L
162.962 128.478 L
160.5 119.984 L
158.038 110.077 L
155.577 102.435 L
153.115 95.848 L
150.654 90.998 L
148.192 90.303 L
145.731 96.017 L
143.269 110.292 L
140.808 127.807 L
138.346 144.729 L
135.885 157.909 L
133.423 171.171 L
130.962 179.13 L
128.5 184.915 L
126.038 188.828 L
123.577 190.722 L
121.115 192.31 L
118.654 191.875 L
116.192 189.533 L
113.731 191.545 L
111.269 196.03 L
108.808 198.124 L
106.346 201.9 L
103.885 199.255 L
101.423 198.052 L
98.962 194.416 L
96.5 193.673 L
94.038 192.498 L
91.577 190.419 L
89.115 188.904 L
86.654 187.284 L
84.192 186.414 L
81.731 184.928 L
79.269 181.397 L
76.808 177.259 L
74.346 172.783 L
71.885 170.022 L
69.423 164.898 L
66.962 160.118 L
64.5 154.907 L
64.462 154.79 L
64.462 154.979 L
64.462 166.683 L
64.5 166.795 L
66.962 171.841 L
69.423 177.089 L
71.885 182.367 L
74.346 185.2 L
76.808 189.089 L
79.269 192.75 L
81.731 196.097 L
84.192 197.283 L
86.654 198.009 L
89.115 199.571 L
91.577 200.476 L
94.038 202.474 L
96.5 203.705 L
98.962 205.358 L
101.423 208.612 L
103.885 209.722 L
106.346 212.278 L
108.808 208.319 L
111.269 206.606 L
113.731 202.938 L
116.192 201.177 L
118.654 203.224 L
121.115 203.08 L
cp
f
GR
GS
[1.00046 0 0 1 0 0] CT
0.957 0.82 0.82 RC
1 LJ
0.5 LW
N
64.462 166.683 M
64.5 166.795 L
66.962 171.841 L
69.423 177.089 L
71.885 182.367 L
74.346 185.2 L
76.808 189.089 L
79.269 192.75 L
81.731 196.097 L
84.192 197.283 L
86.654 198.009 L
89.115 199.571 L
91.577 200.476 L
94.038 202.474 L
96.5 203.705 L
98.962 205.358 L
101.423 208.612 L
103.885 209.722 L
106.346 212.278 L
108.808 208.319 L
111.269 206.606 L
113.731 202.938 L
116.192 201.177 L
118.654 203.224 L
121.115 203.08 L
123.577 201.256 L
126.038 199.65 L
128.5 195.989 L
130.962 189.936 L
133.423 181.178 L
135.885 168.237 L
138.346 155.529 L
140.808 139.398 L
143.269 122.34 L
145.731 108.385 L
148.192 102.649 L
150.654 103.088 L
153.115 107.644 L
155.577 113.364 L
158.038 119.798 L
160.5 129.19 L
162.962 138.018 L
165.423 144.462 L
167.885 153.638 L
170.346 161.648 L
172.808 170.94 L
175.269 178.528 L
177.731 186.179 L
180.192 192.041 L
182.654 196.238 L
185.115 199.533 L
187.577 203.71 L
190.038 203.394 L
192.5 204.535 L
194.962 204.904 L
197.423 204.575 L
199.885 206.414 L
202.346 209.119 L
204.808 212.915 L
207.269 216.693 L
209.731 220.909 L
212.192 224.283 L
214.654 225.392 L
217.115 227.043 L
219.577 228.1 L
222.038 226.692 L
224.5 224.353 L
226.962 221.911 L
229.423 219.727 L
231.885 220.668 L
234.346 220.751 L
236.808 219.562 L
239.269 220.616 L
241.731 220.767 L
244.192 222.339 L
246.654 228.385 L
249.115 232.73 L
251.577 236.157 L
254.038 237.205 L
256.5 235.703 L
258.962 235.307 L
261.423 235.28 L
263.885 233.433 L
266.346 229.082 L
268.808 224.555 L
271.269 221.865 L
273.731 223.011 L
276.192 221.092 L
278.654 221.347 L
281.115 218.984 L
283.577 214.877 L
286.038 206.891 L
288.5 195.948 L
290.962 183.203 L
293.423 171.554 L
295.885 156.981 L
298.346 137.228 L
300.808 116.472 L
303.269 99.183 L
305.731 88.483 L
308.192 83.173 L
310.654 80.294 L
313.115 83.347 L
315.577 89.231 L
318.038 98.361 L
320.5 110.589 L
322.962 120.18 L
325.423 128.661 L
327.885 137.305 L
330.346 148.785 L
332.808 157.904 L
335.269 165.285 L
337.731 170.2 L
340.192 176.748 L
342.654 183.502 L
345.115 188.883 L
347.577 192.405 L
350.038 199.021 L
352.5 203.786 L
354.962 206.777 L
357.423 208.802 L
359.885 210.666 L
362.346 212.082 L
364.808 215.133 L
367.269 218.492 L
369.731 218.814 L
372.192 214.379 L
374.654 208.563 L
377.115 201.395 L
379.577 194.349 L
382.038 186.659 L
384.5 179.601 L
384.538 179.466 L
S
GR
GS
[1.00046 0 0 1 0 0] CT
0.957 0.82 0.82 RC
1 LJ
0.5 LW
N
64.462 154.79 M
64.5 154.907 L
66.962 160.118 L
69.423 164.898 L
71.885 170.022 L
74.346 172.783 L
76.808 177.259 L
79.269 181.397 L
81.731 184.928 L
84.192 186.414 L
86.654 187.284 L
89.115 188.904 L
91.577 190.419 L
94.038 192.498 L
96.5 193.673 L
98.962 194.416 L
101.423 198.052 L
103.885 199.255 L
106.346 201.9 L
108.808 198.124 L
111.269 196.03 L
113.731 191.545 L
116.192 189.533 L
118.654 191.875 L
121.115 192.31 L
123.577 190.722 L
126.038 188.828 L
128.5 184.915 L
130.962 179.13 L
133.423 171.171 L
135.885 157.909 L
138.346 144.729 L
140.808 127.807 L
143.269 110.292 L
145.731 96.017 L
148.192 90.303 L
150.654 90.998 L
153.115 95.848 L
155.577 102.435 L
158.038 110.077 L
160.5 119.984 L
162.962 128.478 L
165.423 134.613 L
167.885 144.003 L
170.346 152.464 L
172.808 160.86 L
175.269 167.064 L
177.731 174.1 L
180.192 179.824 L
182.654 184.11 L
185.115 188.416 L
187.577 193.069 L
190.038 193.633 L
192.5 195.206 L
194.962 194.875 L
197.423 194.014 L
199.885 195.543 L
202.346 198.014 L
204.808 201.391 L
207.269 205.03 L
209.731 209.115 L
212.192 212.699 L
214.654 213.594 L
217.115 214.37 L
219.577 214.724 L
222.038 213.401 L
224.5 210.175 L
226.962 208.416 L
229.423 206.543 L
231.885 207.72 L
234.346 208.39 L
236.808 207.222 L
239.269 207.927 L
241.731 208.536 L
244.192 211.036 L
246.654 216.877 L
249.115 220.833 L
251.577 223.29 L
254.038 224.093 L
256.5 222.487 L
258.962 221.926 L
261.423 221.506 L
263.885 219.842 L
266.346 216.069 L
268.808 213.537 L
271.269 211.891 L
273.731 212.984 L
276.192 210.064 L
278.654 209.07 L
281.115 206.092 L
283.577 201.977 L
286.038 194.673 L
288.5 184.608 L
290.962 172.227 L
293.423 160.202 L
295.885 144.73 L
298.346 124.386 L
300.808 103.067 L
303.269 86.306 L
305.731 75.852 L
308.192 70.811 L
310.654 69.072 L
313.115 73.184 L
315.577 79.823 L
318.038 88.942 L
320.5 99.241 L
322.962 107.9 L
325.423 116.104 L
327.885 124.863 L
330.346 136.05 L
332.808 146.099 L
335.269 153.898 L
337.731 159.188 L
340.192 165.481 L
342.654 172.188 L
345.115 178.037 L
347.577 181.912 L
350.038 188.169 L
352.5 192.7 L
354.962 195.84 L
357.423 198.179 L
359.885 199.419 L
362.346 200.131 L
364.808 202.825 L
367.269 206.293 L
369.731 206.566 L
372.192 202.801 L
374.654 197.076 L
377.115 189.185 L
379.577 181.648 L
382.038 173.685 L
384.5 167.485 L
384.538 167.365 L
S
GR
GS
[1.00046 0 0 1 0 0] CT
0.898 0.6 0.6 RC
1 LJ
2 LW
N
64.462 160.736 M
64.5 160.851 L
66.962 165.979 L
69.423 170.993 L
71.885 176.195 L
74.346 178.991 L
76.808 183.174 L
79.269 187.073 L
81.731 190.512 L
84.192 191.848 L
86.654 192.646 L
89.115 194.238 L
91.577 195.448 L
94.038 197.486 L
96.5 198.689 L
98.962 199.887 L
101.423 203.331 L
103.885 204.489 L
106.346 207.089 L
108.808 203.222 L
111.269 201.318 L
113.731 197.242 L
116.192 195.355 L
118.654 197.549 L
121.115 197.695 L
123.577 195.99 L
126.038 194.239 L
128.5 190.452 L
130.962 184.533 L
133.423 176.174 L
135.885 163.073 L
138.346 150.129 L
140.808 133.603 L
143.269 116.316 L
145.731 102.201 L
148.192 96.475 L
150.654 97.043 L
153.115 101.746 L
155.577 107.899 L
158.038 114.937 L
160.5 124.587 L
162.962 133.248 L
165.423 139.538 L
167.885 148.821 L
170.346 157.056 L
172.808 165.9 L
175.269 172.796 L
177.731 180.14 L
180.192 185.932 L
182.654 190.174 L
185.115 193.974 L
187.577 198.389 L
190.038 198.514 L
192.5 199.87 L
194.962 199.89 L
197.423 199.295 L
199.885 200.978 L
202.346 203.566 L
204.808 207.153 L
207.269 210.861 L
209.731 215.012 L
212.192 218.491 L
214.654 219.493 L
217.115 220.707 L
219.577 221.412 L
222.038 220.046 L
224.5 217.264 L
226.962 215.164 L
229.423 213.135 L
231.885 214.194 L
234.346 214.571 L
236.808 213.392 L
239.269 214.271 L
241.731 214.652 L
244.192 216.687 L
246.654 222.631 L
249.115 226.781 L
251.577 229.724 L
254.038 230.649 L
256.5 229.095 L
258.962 228.617 L
261.423 228.393 L
263.885 226.637 L
266.346 222.576 L
268.808 219.047 L
271.269 216.878 L
273.731 217.997 L
276.192 215.578 L
278.654 215.209 L
281.115 212.538 L
283.577 208.427 L
286.038 200.782 L
288.5 190.278 L
290.962 177.715 L
293.423 165.878 L
295.885 150.856 L
298.346 130.807 L
300.808 109.77 L
303.269 92.744 L
305.731 82.167 L
308.192 76.992 L
310.654 74.683 L
313.115 78.266 L
315.577 84.527 L
318.038 93.651 L
320.5 104.915 L
322.962 114.04 L
325.423 122.383 L
327.885 131.084 L
330.346 142.418 L
332.808 152.001 L
335.269 159.591 L
337.731 164.694 L
340.192 171.114 L
342.654 177.845 L
345.115 183.46 L
347.577 187.158 L
350.038 193.595 L
352.5 198.242 L
354.962 201.308 L
357.423 203.491 L
359.885 205.043 L
362.346 206.106 L
364.808 208.979 L
367.269 212.393 L
369.731 212.69 L
372.192 208.59 L
374.654 202.819 L
377.115 195.29 L
379.577 187.998 L
382.038 180.172 L
384.5 173.543 L
384.538 173.415 L
S
GR
GS
[1.00046 0 0 1 0 0] CT
0.98 0.939 0.939 RC
N
69.423 180.458 M
66.962 176.583 L
64.5 169.259 L
64.462 169.111 L
64.462 169.377 L
64.462 185.622 L
64.5 185.76 L
66.962 192.521 L
69.423 196.555 L
71.885 197.552 L
74.346 199.848 L
76.808 200.802 L
79.269 203.247 L
81.731 205.981 L
84.192 208.783 L
86.654 208.429 L
89.115 207.151 L
91.577 206.092 L
94.038 205.791 L
96.5 206.861 L
98.962 206.198 L
101.423 205.406 L
103.885 205.635 L
106.346 205.411 L
108.808 205.513 L
111.269 205.442 L
113.731 206.069 L
116.192 202.574 L
118.654 202.704 L
121.115 205.607 L
123.577 205.312 L
126.038 201.08 L
128.5 197.016 L
130.962 189.91 L
133.423 181.532 L
135.885 171.741 L
138.346 161.101 L
140.808 149.216 L
143.269 134.202 L
145.731 120.672 L
148.192 110.878 L
150.654 106.847 L
153.115 106.579 L
155.577 110.023 L
158.038 115.78 L
160.5 123.5 L
162.962 134.43 L
165.423 144.419 L
167.885 151.958 L
170.346 155.094 L
172.808 159.619 L
175.269 163.421 L
177.731 167.976 L
180.192 171.421 L
182.654 177.032 L
185.115 181.358 L
187.577 186.136 L
190.038 189.416 L
192.5 194.436 L
194.962 198.655 L
197.423 200.801 L
199.885 200.781 L
202.346 197.785 L
204.808 195.43 L
207.269 194.831 L
209.731 196.974 L
212.192 199.972 L
214.654 204.329 L
217.115 204.191 L
219.577 204.654 L
222.038 208.49 L
224.5 212.359 L
226.962 213.992 L
229.423 212.526 L
231.885 213.862 L
234.346 215.783 L
236.808 217.158 L
239.269 218.844 L
241.731 218.867 L
244.192 218.075 L
246.654 216.618 L
249.115 216.423 L
251.577 215.817 L
254.038 216.67 L
256.5 216.849 L
258.962 216.709 L
261.423 216.74 L
263.885 218.909 L
266.346 220.026 L
268.808 217.743 L
271.269 218.653 L
273.731 219.435 L
276.192 217.883 L
278.654 214.292 L
281.115 212.553 L
283.577 212.368 L
286.038 210.409 L
288.5 204.784 L
290.962 194.383 L
293.423 180.623 L
295.885 162.084 L
298.346 141.024 L
300.808 120.85 L
303.269 103.623 L
305.731 89.636 L
308.192 80.208 L
310.654 78.379 L
313.115 79.663 L
315.577 82.569 L
318.038 89.825 L
320.5 100.998 L
322.962 111.366 L
325.423 120.713 L
327.885 130.151 L
330.346 138.59 L
332.808 147.306 L
335.269 159.455 L
337.731 171.317 L
340.192 181.246 L
342.654 188.617 L
345.115 194.202 L
347.577 197.035 L
350.038 201.552 L
352.5 202.278 L
354.962 198.882 L
357.423 197.31 L
359.885 195.845 L
362.346 196.174 L
364.808 200.201 L
367.269 200.154 L
369.731 200.826 L
372.192 201.841 L
374.654 202.286 L
377.115 198.958 L
379.577 195.144 L
382.038 191.176 L
384.5 184.248 L
384.538 184.098 L
384.538 173.132 L
384.538 172.957 L
384.5 173.109 L
382.038 180.042 L
379.577 184.027 L
377.115 186.863 L
374.654 189.059 L
372.192 187.661 L
369.731 186.309 L
367.269 185.752 L
364.808 186.394 L
362.346 182.356 L
359.885 182.272 L
357.423 183.825 L
354.962 185.328 L
352.5 188.318 L
350.038 186.766 L
347.577 181.915 L
345.115 178.501 L
342.654 172.083 L
340.192 164.867 L
337.731 156.124 L
335.269 144.528 L
332.808 132.502 L
330.346 123.716 L
327.885 115.781 L
325.423 106.816 L
322.962 97.484 L
320.5 88.326 L
318.038 77.861 L
315.577 70.629 L
313.115 66.828 L
310.654 64.842 L
308.192 66.776 L
305.731 75.356 L
303.269 88.863 L
300.808 105.847 L
298.346 126.51 L
295.885 148.522 L
293.423 167.796 L
290.962 181.819 L
288.5 192.356 L
286.038 198.439 L
283.577 200.319 L
281.115 199.933 L
278.654 201.773 L
276.192 205.907 L
273.731 207.899 L
271.269 207.366 L
268.808 205.691 L
266.346 207.488 L
263.885 206.603 L
261.423 205.072 L
258.962 205.657 L
256.5 205.994 L
254.038 205.5 L
251.577 203.72 L
249.115 203.994 L
246.654 204.201 L
244.192 205.484 L
241.731 205.757 L
239.269 205.38 L
236.808 203.607 L
234.346 202.405 L
231.885 200.946 L
229.423 200.029 L
226.962 201.506 L
224.5 200.324 L
222.038 197.348 L
219.577 194.397 L
217.115 194.381 L
214.654 194.908 L
212.192 189.928 L
209.731 185.418 L
207.269 182.123 L
204.808 182.373 L
202.346 184.674 L
199.885 188.112 L
197.423 188.342 L
194.962 186.151 L
192.5 182.301 L
190.038 177.624 L
187.577 174.793 L
185.115 170.539 L
182.654 166.483 L
180.192 160.56 L
177.731 156.669 L
175.269 152.161 L
172.808 147.976 L
170.346 143.045 L
167.885 139.235 L
165.423 131.528 L
162.962 122.662 L
160.5 112.248 L
158.038 104.441 L
155.577 98.767 L
153.115 94.96 L
150.654 94.436 L
148.192 98.145 L
145.731 108.226 L
143.269 123.163 L
140.808 139.608 L
138.346 152.341 L
135.885 162.863 L
133.423 171.616 L
130.962 179.005 L
128.5 185.278 L
126.038 188.451 L
123.577 192.056 L
121.115 192.171 L
118.654 189.638 L
116.192 189.646 L
113.731 192.978 L
111.269 192.293 L
108.808 192.119 L
106.346 192.734 L
103.885 192.94 L
101.423 192.58 L
98.962 192.927 L
96.5 193.149 L
94.038 192.455 L
91.577 192.985 L
89.115 194.731 L
86.654 195.823 L
84.192 195.58 L
81.731 192.42 L
79.269 189.022 L
76.808 185.276 L
74.346 183.908 L
71.885 181.043 L
cp
f
GR
GS
[1.00046 0 0 1 0 0] CT
0.91 0.729 0.729 RC
1 LJ
0.5 LW
N
64.462 185.622 M
64.5 185.76 L
66.962 192.521 L
69.423 196.555 L
71.885 197.552 L
74.346 199.848 L
76.808 200.802 L
79.269 203.247 L
81.731 205.981 L
84.192 208.783 L
86.654 208.429 L
89.115 207.151 L
91.577 206.092 L
94.038 205.791 L
96.5 206.861 L
98.962 206.198 L
101.423 205.406 L
103.885 205.635 L
106.346 205.411 L
108.808 205.513 L
111.269 205.442 L
113.731 206.069 L
116.192 202.574 L
118.654 202.704 L
121.115 205.607 L
123.577 205.312 L
126.038 201.08 L
128.5 197.016 L
130.962 189.91 L
133.423 181.532 L
135.885 171.741 L
138.346 161.101 L
140.808 149.216 L
143.269 134.202 L
145.731 120.672 L
148.192 110.878 L
150.654 106.847 L
153.115 106.579 L
155.577 110.023 L
158.038 115.78 L
160.5 123.5 L
162.962 134.43 L
165.423 144.419 L
167.885 151.958 L
170.346 155.094 L
172.808 159.619 L
175.269 163.421 L
177.731 167.976 L
180.192 171.421 L
182.654 177.032 L
185.115 181.358 L
187.577 186.136 L
190.038 189.416 L
192.5 194.436 L
194.962 198.655 L
197.423 200.801 L
199.885 200.781 L
202.346 197.785 L
204.808 195.43 L
207.269 194.831 L
209.731 196.974 L
212.192 199.972 L
214.654 204.329 L
217.115 204.191 L
219.577 204.654 L
222.038 208.49 L
224.5 212.359 L
226.962 213.992 L
229.423 212.526 L
231.885 213.862 L
234.346 215.783 L
236.808 217.158 L
239.269 218.844 L
241.731 218.867 L
244.192 218.075 L
246.654 216.618 L
249.115 216.423 L
251.577 215.817 L
254.038 216.67 L
256.5 216.849 L
258.962 216.709 L
261.423 216.74 L
263.885 218.909 L
266.346 220.026 L
268.808 217.743 L
271.269 218.653 L
273.731 219.435 L
276.192 217.883 L
278.654 214.292 L
281.115 212.553 L
283.577 212.368 L
286.038 210.409 L
288.5 204.784 L
290.962 194.383 L
293.423 180.623 L
295.885 162.084 L
298.346 141.024 L
300.808 120.85 L
303.269 103.623 L
305.731 89.636 L
308.192 80.208 L
310.654 78.379 L
313.115 79.663 L
315.577 82.569 L
318.038 89.825 L
320.5 100.998 L
322.962 111.366 L
325.423 120.713 L
327.885 130.151 L
330.346 138.59 L
332.808 147.306 L
335.269 159.455 L
337.731 171.317 L
340.192 181.246 L
342.654 188.617 L
345.115 194.202 L
347.577 197.035 L
350.038 201.552 L
352.5 202.278 L
354.962 198.882 L
357.423 197.31 L
359.885 195.845 L
362.346 196.174 L
364.808 200.201 L
367.269 200.154 L
369.731 200.826 L
372.192 201.841 L
374.654 202.286 L
377.115 198.958 L
379.577 195.144 L
382.038 191.176 L
384.5 184.248 L
384.538 184.098 L
S
GR
GS
[1.00046 0 0 1 0 0] CT
0.91 0.729 0.729 RC
1 LJ
0.5 LW
N
64.462 169.111 M
64.5 169.259 L
66.962 176.583 L
69.423 180.458 L
71.885 181.043 L
74.346 183.908 L
76.808 185.276 L
79.269 189.022 L
81.731 192.42 L
84.192 195.58 L
86.654 195.823 L
89.115 194.731 L
91.577 192.985 L
94.038 192.455 L
96.5 193.149 L
98.962 192.927 L
101.423 192.58 L
103.885 192.94 L
106.346 192.734 L
108.808 192.119 L
111.269 192.293 L
113.731 192.978 L
116.192 189.646 L
118.654 189.638 L
121.115 192.171 L
123.577 192.056 L
126.038 188.451 L
128.5 185.278 L
130.962 179.005 L
133.423 171.616 L
135.885 162.863 L
138.346 152.341 L
140.808 139.608 L
143.269 123.163 L
145.731 108.226 L
148.192 98.145 L
150.654 94.436 L
153.115 94.96 L
155.577 98.767 L
158.038 104.441 L
160.5 112.248 L
162.962 122.662 L
165.423 131.528 L
167.885 139.235 L
170.346 143.045 L
172.808 147.976 L
175.269 152.161 L
177.731 156.669 L
180.192 160.56 L
182.654 166.483 L
185.115 170.539 L
187.577 174.793 L
190.038 177.624 L
192.5 182.301 L
194.962 186.151 L
197.423 188.342 L
199.885 188.112 L
202.346 184.674 L
204.808 182.373 L
207.269 182.123 L
209.731 185.418 L
212.192 189.928 L
214.654 194.908 L
217.115 194.381 L
219.577 194.397 L
222.038 197.348 L
224.5 200.324 L
226.962 201.506 L
229.423 200.029 L
231.885 200.946 L
234.346 202.405 L
236.808 203.607 L
239.269 205.38 L
241.731 205.757 L
244.192 205.484 L
246.654 204.201 L
249.115 203.994 L
251.577 203.72 L
254.038 205.5 L
256.5 205.994 L
258.962 205.657 L
261.423 205.072 L
263.885 206.603 L
266.346 207.488 L
268.808 205.691 L
271.269 207.366 L
273.731 207.899 L
276.192 205.907 L
278.654 201.773 L
281.115 199.933 L
283.577 200.319 L
286.038 198.439 L
288.5 192.356 L
290.962 181.819 L
293.423 167.796 L
295.885 148.522 L
298.346 126.51 L
300.808 105.847 L
303.269 88.863 L
305.731 75.356 L
308.192 66.776 L
310.654 64.842 L
313.115 66.828 L
315.577 70.629 L
318.038 77.861 L
320.5 88.326 L
322.962 97.484 L
325.423 106.816 L
327.885 115.781 L
330.346 123.716 L
332.808 132.502 L
335.269 144.528 L
337.731 156.124 L
340.192 164.867 L
342.654 172.083 L
345.115 178.501 L
347.577 181.915 L
350.038 186.766 L
352.5 188.318 L
354.962 185.328 L
357.423 183.825 L
359.885 182.272 L
362.346 182.356 L
364.808 186.394 L
367.269 185.752 L
369.731 186.309 L
372.192 187.661 L
374.654 189.059 L
377.115 186.863 L
379.577 184.027 L
382.038 180.042 L
384.5 173.109 L
384.538 172.957 L
S
GR
GS
[1.00046 0 0 1 0 0] CT
0.8 0.4 0.4 RC
1 LJ
2 LW
N
64.462 177.366 M
64.5 177.51 L
66.962 184.552 L
69.423 188.507 L
71.885 189.297 L
74.346 191.878 L
76.808 193.039 L
79.269 196.134 L
81.731 199.201 L
84.192 202.182 L
86.654 202.127 L
89.115 200.941 L
91.577 199.538 L
94.038 199.123 L
96.5 200.005 L
98.962 199.562 L
101.423 198.994 L
103.885 199.287 L
106.346 199.073 L
108.808 198.816 L
111.269 198.868 L
113.731 199.524 L
116.192 196.11 L
118.654 196.17 L
121.115 198.889 L
123.577 198.684 L
126.038 194.766 L
128.5 191.147 L
130.962 184.457 L
133.423 176.574 L
135.885 167.302 L
138.346 156.721 L
140.808 144.411 L
143.269 128.682 L
145.731 114.448 L
148.192 104.512 L
150.654 100.642 L
153.115 100.769 L
155.577 104.395 L
158.038 110.111 L
160.5 117.874 L
162.962 128.546 L
165.423 137.973 L
167.885 145.596 L
170.346 149.07 L
172.808 153.798 L
175.269 157.791 L
177.731 162.322 L
180.192 165.99 L
182.654 171.757 L
185.115 175.949 L
187.577 180.465 L
190.038 183.519 L
192.5 188.368 L
194.962 192.403 L
197.423 194.571 L
199.885 194.446 L
202.346 191.23 L
204.808 188.901 L
207.269 188.477 L
209.731 191.196 L
212.192 194.95 L
214.654 199.619 L
217.115 199.286 L
219.577 199.526 L
222.038 202.919 L
224.5 206.341 L
226.962 207.75 L
229.423 206.278 L
231.885 207.404 L
234.346 209.094 L
236.808 210.382 L
239.269 212.112 L
241.731 212.312 L
244.192 211.779 L
246.654 210.409 L
249.115 210.208 L
251.577 209.768 L
254.038 211.085 L
256.5 211.421 L
258.962 211.183 L
261.423 210.906 L
263.885 212.756 L
266.346 213.757 L
268.808 211.717 L
271.269 213.01 L
273.731 213.668 L
276.192 211.895 L
278.654 208.032 L
281.115 206.243 L
283.577 206.344 L
286.038 204.424 L
288.5 198.571 L
290.962 188.102 L
293.423 174.21 L
295.885 155.303 L
298.346 133.767 L
300.808 113.348 L
303.269 96.243 L
305.731 82.496 L
308.192 73.492 L
310.654 71.61 L
313.115 73.245 L
315.577 76.599 L
318.038 83.843 L
320.5 94.662 L
322.962 104.426 L
325.423 113.764 L
327.885 122.966 L
330.346 131.153 L
332.808 139.904 L
335.269 151.991 L
337.731 163.721 L
340.192 173.057 L
342.654 180.35 L
345.115 186.351 L
347.577 189.475 L
350.038 194.159 L
352.5 195.297 L
354.962 192.105 L
357.423 190.568 L
359.885 189.058 L
362.346 189.265 L
364.808 193.298 L
367.269 192.953 L
369.731 193.568 L
372.192 194.751 L
374.654 195.672 L
377.115 192.91 L
379.577 189.586 L
382.038 185.609 L
384.5 178.678 L
384.538 178.528 L
S
GR
GS
[1.00046 0 0 1 0 0] CT
0.959 0.918 0.918 RC
N
121.115 202.463 M
118.654 205.995 L
116.192 208.065 L
113.731 208.361 L
111.269 208.004 L
108.808 208.492 L
106.346 208.236 L
103.885 208.577 L
101.423 208.04 L
98.962 207.462 L
96.5 208.342 L
94.038 205.312 L
91.577 201.857 L
89.115 202.017 L
86.654 198.93 L
84.192 194.135 L
81.731 189.231 L
79.269 185.975 L
76.808 184.164 L
74.346 178.969 L
71.885 173.473 L
69.423 168.61 L
66.962 160.517 L
64.5 154.099 L
64.462 154.006 L
64.462 154.222 L
64.462 167.301 L
64.5 167.385 L
66.962 173.51 L
69.423 182.002 L
71.885 186.657 L
74.346 191.99 L
76.808 198.03 L
79.269 200.289 L
81.731 203.165 L
84.192 207.089 L
86.654 211.329 L
89.115 214.148 L
91.577 213.679 L
94.038 217.234 L
96.5 220.157 L
98.962 219.037 L
101.423 219.663 L
103.885 220.831 L
106.346 220.085 L
108.808 219.861 L
111.269 219.081 L
113.731 219.823 L
116.192 219.648 L
118.654 216.886 L
121.115 213.677 L
123.577 210.085 L
126.038 205.564 L
128.5 199.462 L
130.962 196.54 L
133.423 188.59 L
135.885 178.284 L
138.346 164.269 L
140.808 146.667 L
143.269 126.197 L
145.731 109.327 L
148.192 101.241 L
150.654 100.377 L
153.115 105.168 L
155.577 111.948 L
158.038 119.816 L
160.5 128.492 L
162.962 137.006 L
165.423 146.636 L
167.885 155.928 L
170.346 161.825 L
172.808 169.893 L
175.269 178.009 L
177.731 185.026 L
180.192 186.619 L
182.654 185.848 L
185.115 183.984 L
187.577 181.535 L
190.038 180.645 L
192.5 184.704 L
194.962 188.774 L
197.423 195.228 L
199.885 199.033 L
202.346 201.22 L
204.808 200.58 L
207.269 200.386 L
209.731 199.732 L
212.192 201.582 L
214.654 204.34 L
217.115 208.22 L
219.577 209.766 L
222.038 212.902 L
224.5 217.149 L
226.962 217.952 L
229.423 218.199 L
231.885 216.513 L
234.346 218.402 L
236.808 223.886 L
239.269 227.324 L
241.731 230.254 L
244.192 230.8 L
246.654 228.62 L
249.115 226.47 L
251.577 224.765 L
254.038 224.43 L
256.5 224.335 L
258.962 225.941 L
261.423 225.832 L
263.885 227.641 L
266.346 229.042 L
268.808 230.843 L
271.269 233.328 L
273.731 233.492 L
276.192 231.839 L
278.654 230.596 L
281.115 227.293 L
283.577 226.392 L
286.038 221.744 L
288.5 213.68 L
290.962 199.34 L
293.423 181.415 L
295.885 161.117 L
298.346 140.606 L
300.808 121.069 L
303.269 103.591 L
305.731 91.476 L
308.192 84.413 L
310.654 86.037 L
313.115 91.505 L
315.577 97.838 L
318.038 104.822 L
320.5 113.366 L
322.962 123.025 L
325.423 130.398 L
327.885 142.594 L
330.346 150.89 L
332.808 156.075 L
335.269 159.379 L
337.731 164.793 L
340.192 173.604 L
342.654 185.522 L
345.115 196.316 L
347.577 206.535 L
350.038 209.247 L
352.5 210.888 L
354.962 214.697 L
357.423 216.669 L
359.885 215.204 L
362.346 212.958 L
364.808 209.72 L
367.269 207.514 L
369.731 206.255 L
372.192 205.461 L
374.654 202.595 L
377.115 200.488 L
379.577 201.195 L
382.038 198.169 L
384.5 189.842 L
384.538 189.672 L
384.538 178.52 L
384.538 178.349 L
384.5 178.515 L
382.038 185.974 L
379.577 188.618 L
377.115 187.414 L
374.654 189.305 L
372.192 192.161 L
369.731 193.238 L
367.269 194.555 L
364.808 196.366 L
362.346 199.164 L
359.885 201.248 L
357.423 202.746 L
354.962 200.328 L
352.5 196.261 L
350.038 194.474 L
347.577 191.817 L
345.115 181.233 L
342.654 170.502 L
340.192 159.143 L
337.731 151.501 L
335.269 146.055 L
332.808 143.57 L
330.346 139.327 L
327.885 131.828 L
325.423 119.26 L
322.962 110.514 L
320.5 99.846 L
318.038 91.304 L
315.577 84.335 L
313.115 77.826 L
310.654 72.134 L
308.192 70.712 L
305.731 77.496 L
303.269 89.715 L
300.808 107.009 L
298.346 126.683 L
295.885 147.727 L
293.423 168.482 L
290.962 186.058 L
288.5 200.602 L
286.038 209.471 L
283.577 214.385 L
281.115 215.667 L
278.654 218.471 L
276.192 219.285 L
273.731 221.049 L
271.269 220.806 L
268.808 218.125 L
266.346 215.9 L
263.885 215.413 L
261.423 214.509 L
258.962 215.525 L
256.5 214.478 L
254.038 214.611 L
251.577 215.337 L
249.115 216.831 L
246.654 218.966 L
244.192 221.138 L
241.731 220.497 L
239.269 216.892 L
236.808 212.974 L
234.346 208.05 L
231.885 206.53 L
229.423 207.906 L
226.962 206.796 L
224.5 205.274 L
222.038 201.236 L
219.577 198.056 L
217.115 196.439 L
214.654 192.875 L
212.192 190.505 L
209.731 189.283 L
207.269 190.107 L
204.808 190.515 L
202.346 190.595 L
199.885 187.817 L
197.423 183.289 L
194.962 177.308 L
192.5 174.116 L
190.038 170.651 L
187.577 171.14 L
185.115 172.43 L
182.654 173.766 L
180.192 175.041 L
177.731 174.058 L
175.269 167.708 L
172.808 159.341 L
170.346 150.899 L
167.885 145.172 L
165.423 135.631 L
162.962 125.593 L
160.5 116.987 L
158.038 108.278 L
155.577 101.073 L
153.115 95.114 L
150.654 90.351 L
148.192 91.078 L
145.731 98.369 L
143.269 114.809 L
140.808 134.643 L
138.346 152.18 L
135.885 166.551 L
133.423 176.877 L
130.962 184.763 L
128.5 187.447 L
126.038 193.656 L
123.577 198.636 L
cp
f
GR
GS
[1.00046 0 0 1 0 0] CT
0.82 0.639 0.639 RC
1 LJ
0.5 LW
N
64.462 167.301 M
64.5 167.385 L
66.962 173.51 L
69.423 182.002 L
71.885 186.657 L
74.346 191.99 L
76.808 198.03 L
79.269 200.289 L
81.731 203.165 L
84.192 207.089 L
86.654 211.329 L
89.115 214.148 L
91.577 213.679 L
94.038 217.234 L
96.5 220.157 L
98.962 219.037 L
101.423 219.663 L
103.885 220.831 L
106.346 220.085 L
108.808 219.861 L
111.269 219.081 L
113.731 219.823 L
116.192 219.648 L
118.654 216.886 L
121.115 213.677 L
123.577 210.085 L
126.038 205.564 L
128.5 199.462 L
130.962 196.54 L
133.423 188.59 L
135.885 178.284 L
138.346 164.269 L
140.808 146.667 L
143.269 126.197 L
145.731 109.327 L
148.192 101.241 L
150.654 100.377 L
153.115 105.168 L
155.577 111.948 L
158.038 119.816 L
160.5 128.492 L
162.962 137.006 L
165.423 146.636 L
167.885 155.928 L
170.346 161.825 L
172.808 169.893 L
175.269 178.009 L
177.731 185.026 L
180.192 186.619 L
182.654 185.848 L
185.115 183.984 L
187.577 181.535 L
190.038 180.645 L
192.5 184.704 L
194.962 188.774 L
197.423 195.228 L
199.885 199.033 L
202.346 201.22 L
204.808 200.58 L
207.269 200.386 L
209.731 199.732 L
212.192 201.582 L
214.654 204.34 L
217.115 208.22 L
219.577 209.766 L
222.038 212.902 L
224.5 217.149 L
226.962 217.952 L
229.423 218.199 L
231.885 216.513 L
234.346 218.402 L
236.808 223.886 L
239.269 227.324 L
241.731 230.254 L
244.192 230.8 L
246.654 228.62 L
249.115 226.47 L
251.577 224.765 L
254.038 224.43 L
256.5 224.335 L
258.962 225.941 L
261.423 225.832 L
263.885 227.641 L
266.346 229.042 L
268.808 230.843 L
271.269 233.328 L
273.731 233.492 L
276.192 231.839 L
278.654 230.596 L
281.115 227.293 L
283.577 226.392 L
286.038 221.744 L
288.5 213.68 L
290.962 199.34 L
293.423 181.415 L
295.885 161.117 L
298.346 140.606 L
300.808 121.069 L
303.269 103.591 L
305.731 91.476 L
308.192 84.413 L
310.654 86.037 L
313.115 91.505 L
315.577 97.838 L
318.038 104.822 L
320.5 113.366 L
322.962 123.025 L
325.423 130.398 L
327.885 142.594 L
330.346 150.89 L
332.808 156.075 L
335.269 159.379 L
337.731 164.793 L
340.192 173.604 L
342.654 185.522 L
345.115 196.316 L
347.577 206.535 L
350.038 209.247 L
352.5 210.888 L
354.962 214.697 L
357.423 216.669 L
359.885 215.204 L
362.346 212.958 L
364.808 209.72 L
367.269 207.514 L
369.731 206.255 L
372.192 205.461 L
374.654 202.595 L
377.115 200.488 L
379.577 201.195 L
382.038 198.169 L
384.5 189.842 L
384.538 189.672 L
S
GR
GS
[1.00046 0 0 1 0 0] CT
0.82 0.639 0.639 RC
1 LJ
0.5 LW
N
64.462 154.006 M
64.5 154.099 L
66.962 160.517 L
69.423 168.61 L
71.885 173.473 L
74.346 178.969 L
76.808 184.164 L
79.269 185.975 L
81.731 189.231 L
84.192 194.135 L
86.654 198.93 L
89.115 202.017 L
91.577 201.857 L
94.038 205.312 L
96.5 208.342 L
98.962 207.462 L
101.423 208.04 L
103.885 208.577 L
106.346 208.236 L
108.808 208.492 L
111.269 208.004 L
113.731 208.361 L
116.192 208.065 L
118.654 205.995 L
121.115 202.463 L
123.577 198.636 L
126.038 193.656 L
128.5 187.447 L
130.962 184.763 L
133.423 176.877 L
135.885 166.551 L
138.346 152.18 L
140.808 134.643 L
143.269 114.809 L
145.731 98.369 L
148.192 91.078 L
150.654 90.351 L
153.115 95.114 L
155.577 101.073 L
158.038 108.278 L
160.5 116.987 L
162.962 125.593 L
165.423 135.631 L
167.885 145.172 L
170.346 150.899 L
172.808 159.341 L
175.269 167.708 L
177.731 174.058 L
180.192 175.041 L
182.654 173.766 L
185.115 172.43 L
187.577 171.14 L
190.038 170.651 L
192.5 174.116 L
194.962 177.308 L
197.423 183.289 L
199.885 187.817 L
202.346 190.595 L
204.808 190.515 L
207.269 190.107 L
209.731 189.283 L
212.192 190.505 L
214.654 192.875 L
217.115 196.439 L
219.577 198.056 L
222.038 201.236 L
224.5 205.274 L
226.962 206.796 L
229.423 207.906 L
231.885 206.53 L
234.346 208.05 L
236.808 212.974 L
239.269 216.892 L
241.731 220.497 L
244.192 221.138 L
246.654 218.966 L
249.115 216.831 L
251.577 215.337 L
254.038 214.611 L
256.5 214.478 L
258.962 215.525 L
261.423 214.509 L
263.885 215.413 L
266.346 215.9 L
268.808 218.125 L
271.269 220.806 L
273.731 221.049 L
276.192 219.285 L
278.654 218.471 L
281.115 215.667 L
283.577 214.385 L
286.038 209.471 L
288.5 200.602 L
290.962 186.058 L
293.423 168.482 L
295.885 147.727 L
298.346 126.683 L
300.808 107.009 L
303.269 89.715 L
305.731 77.496 L
308.192 70.712 L
310.654 72.134 L
313.115 77.826 L
315.577 84.335 L
318.038 91.304 L
320.5 99.846 L
322.962 110.514 L
325.423 119.26 L
327.885 131.828 L
330.346 139.327 L
332.808 143.57 L
335.269 146.055 L
337.731 151.501 L
340.192 159.143 L
342.654 170.502 L
345.115 181.233 L
347.577 191.817 L
350.038 194.474 L
352.5 196.261 L
354.962 200.328 L
357.423 202.746 L
359.885 201.248 L
362.346 199.164 L
364.808 196.366 L
367.269 194.555 L
369.731 193.238 L
372.192 192.161 L
374.654 189.305 L
377.115 187.414 L
379.577 188.618 L
382.038 185.974 L
384.5 178.515 L
384.538 178.349 L
S
GR
GS
[1.00046 0 0 1 0 0] CT
0.6 0.2 0.2 RC
1 LJ
2 LW
N
64.462 160.654 M
64.5 160.742 L
66.962 167.014 L
69.423 175.306 L
71.885 180.065 L
74.346 185.48 L
76.808 191.097 L
79.269 193.132 L
81.731 196.199 L
84.192 200.612 L
86.654 205.13 L
89.115 208.083 L
91.577 207.768 L
94.038 211.273 L
96.5 214.25 L
98.962 213.249 L
101.423 213.851 L
103.885 214.704 L
106.346 214.161 L
108.808 214.177 L
111.269 213.542 L
113.731 214.091 L
116.192 213.857 L
118.654 211.44 L
121.115 208.07 L
123.577 204.361 L
126.038 199.61 L
128.5 193.455 L
130.962 190.652 L
133.423 182.734 L
135.885 172.417 L
138.346 158.225 L
140.808 140.655 L
143.269 120.503 L
145.731 103.848 L
148.192 96.16 L
150.654 95.365 L
153.115 100.141 L
155.577 106.511 L
158.038 114.047 L
160.5 122.739 L
162.962 131.3 L
165.423 141.134 L
167.885 150.55 L
170.346 156.362 L
172.808 164.617 L
175.269 172.859 L
177.731 179.542 L
180.192 180.83 L
182.654 179.807 L
185.115 178.207 L
187.577 176.338 L
190.038 175.648 L
192.5 179.41 L
194.962 183.041 L
197.423 189.259 L
199.885 193.425 L
202.346 195.908 L
204.808 195.548 L
207.269 195.246 L
209.731 194.508 L
212.192 196.043 L
214.654 198.607 L
217.115 202.329 L
219.577 203.911 L
222.038 207.068 L
224.5 211.212 L
226.962 212.374 L
229.423 213.053 L
231.885 211.522 L
234.346 213.226 L
236.808 218.43 L
239.269 222.108 L
241.731 225.376 L
244.192 225.969 L
246.654 223.793 L
249.115 221.65 L
251.577 220.051 L
254.038 219.52 L
256.5 219.407 L
258.962 220.733 L
261.423 220.17 L
263.885 221.527 L
266.346 222.471 L
268.808 224.484 L
271.269 227.067 L
273.731 227.27 L
276.192 225.563 L
278.654 224.534 L
281.115 221.48 L
283.577 220.388 L
286.038 215.607 L
288.5 207.141 L
290.962 192.699 L
293.423 174.949 L
295.885 154.422 L
298.346 133.644 L
300.808 114.038 L
303.269 96.653 L
305.731 84.486 L
308.192 77.562 L
310.654 79.085 L
313.115 84.665 L
315.577 91.086 L
318.038 98.063 L
320.5 106.606 L
322.962 116.769 L
325.423 124.829 L
327.885 137.21 L
330.346 145.109 L
332.808 149.822 L
335.269 152.717 L
337.731 158.146 L
340.192 166.373 L
342.654 178.012 L
345.115 188.774 L
347.577 199.176 L
350.038 201.86 L
352.5 203.575 L
354.962 207.512 L
357.423 209.708 L
359.885 208.225 L
362.346 206.061 L
364.808 203.043 L
367.269 201.035 L
369.731 199.747 L
372.192 198.811 L
374.654 195.95 L
377.115 193.951 L
379.577 194.906 L
382.038 192.071 L
384.5 184.179 L
384.538 184.011 L
S
GR
%%Trailer
%%Pages: 1
%%EOF
