%!PS-Adobe-3.0 EPSF-3.0
%%Creator: (MATLAB, The Mathworks, Inc. Version 9.10.0.1602886 \(R2021a\). Operating System: Mac OS X)
%%Title: /Users/kosciessa/Desktop/tardis/LNDG/stateswitch/stsw_eeg_task/tfr/figures/b01_thetaTraces_ya.eps
%%CreationDate: 2022-02-22T16:23:57
%%Pages: (atend)
%%BoundingBox:     2     0   388   266
%%LanguageLevel: 3
%%EndComments
%%BeginProlog
%%BeginResource: procset (Apache XML Graphics Std ProcSet) 1.2 0
%%Version: 1.2 0
%%Copyright: (Copyright 2001-2003,2010 The Apache Software Foundation. License terms: http://www.apache.org/licenses/LICENSE-2.0)
/bd{bind def}bind def
/ld{load def}bd
/GR/grestore ld
/GS/gsave ld
/RM/rmoveto ld
/C/curveto ld
/t/show ld
/L/lineto ld
/ML/setmiterlimit ld
/CT/concat ld
/f/fill ld
/N/newpath ld
/S/stroke ld
/CC/setcmykcolor ld
/A/ashow ld
/cp/closepath ld
/RC/setrgbcolor ld
/LJ/setlinejoin ld
/GC/setgray ld
/LW/setlinewidth ld
/M/moveto ld
/re {4 2 roll M
1 index 0 rlineto
0 exch rlineto
neg 0 rlineto
cp } bd
/_ctm matrix def
/_tm matrix def
/BT { _ctm currentmatrix pop matrix _tm copy pop 0 0 moveto } bd
/ET { _ctm setmatrix } bd
/iTm { _ctm setmatrix _tm concat } bd
/Tm { _tm astore pop iTm 0 0 moveto } bd
/ux 0.0 def
/uy 0.0 def
/F {
  /Tp exch def
  /Tf exch def
  Tf findfont Tp scalefont setfont
  /cf Tf def  /cs Tp def
} bd
/ULS {currentpoint /uy exch def /ux exch def} bd
/ULE {
  /Tcx currentpoint pop def
  gsave
  newpath
  cf findfont cs scalefont dup
  /FontMatrix get 0 get /Ts exch def /FontInfo get dup
  /UnderlinePosition get Ts mul /To exch def
  /UnderlineThickness get Ts mul /Tt exch def
  ux uy To add moveto  Tcx uy To add lineto
  Tt setlinewidth stroke
  grestore
} bd
/OLE {
  /Tcx currentpoint pop def
  gsave
  newpath
  cf findfont cs scalefont dup
  /FontMatrix get 0 get /Ts exch def /FontInfo get dup
  /UnderlinePosition get Ts mul /To exch def
  /UnderlineThickness get Ts mul /Tt exch def
  ux uy To add cs add moveto Tcx uy To add cs add lineto
  Tt setlinewidth stroke
  grestore
} bd
/SOE {
  /Tcx currentpoint pop def
  gsave
  newpath
  cf findfont cs scalefont dup
  /FontMatrix get 0 get /Ts exch def /FontInfo get dup
  /UnderlinePosition get Ts mul /To exch def
  /UnderlineThickness get Ts mul /Tt exch def
  ux uy To add cs 10 mul 26 idiv add moveto Tcx uy To add cs 10 mul 26 idiv add lineto
  Tt setlinewidth stroke
  grestore
} bd
/QT {
/Y22 exch store
/X22 exch store
/Y21 exch store
/X21 exch store
currentpoint
/Y21 load 2 mul add 3 div exch
/X21 load 2 mul add 3 div exch
/X21 load 2 mul /X22 load add 3 div
/Y21 load 2 mul /Y22 load add 3 div
/X22 load /Y22 load curveto
} bd
/SSPD {
dup length /d exch dict def
{
/v exch def
/k exch def
currentpagedevice k known {
/cpdv currentpagedevice k get def
v cpdv ne {
/upd false def
/nullv v type /nulltype eq def
/nullcpdv cpdv type /nulltype eq def
nullv nullcpdv or
{
/upd true def
} {
/sametype v type cpdv type eq def
sametype {
v type /arraytype eq {
/vlen v length def
/cpdvlen cpdv length def
vlen cpdvlen eq {
0 1 vlen 1 sub {
/i exch def
/obj v i get def
/cpdobj cpdv i get def
obj cpdobj ne {
/upd true def
exit
} if
} for
} {
/upd true def
} ifelse
} {
v type /dicttype eq {
v {
/dv exch def
/dk exch def
/cpddv cpdv dk get def
dv cpddv ne {
/upd true def
exit
} if
} forall
} {
/upd true def
} ifelse
} ifelse
} if
} ifelse
upd true eq {
d k v put
} if
} if
} if
} forall
d length 0 gt {
d setpagedevice
} if
} bd
/RE { % /NewFontName [NewEncodingArray] /FontName RE -
  findfont dup length dict begin
  {
    1 index /FID ne
    {def} {pop pop} ifelse
  } forall
  /Encoding exch def
  /FontName 1 index def
  currentdict definefont pop
  end
} bind def
%%EndResource
%%BeginResource: procset (Apache XML Graphics EPS ProcSet) 1.0 0
%%Version: 1.0 0
%%Copyright: (Copyright 2002-2003 The Apache Software Foundation. License terms: http://www.apache.org/licenses/LICENSE-2.0)
/BeginEPSF { %def
/b4_Inc_state save def         % Save state for cleanup
/dict_count countdictstack def % Count objects on dict stack
/op_count count 1 sub def      % Count objects on operand stack
userdict begin                 % Push userdict on dict stack
/showpage { } def              % Redefine showpage, { } = null proc
0 setgray 0 setlinecap         % Prepare graphics state
1 setlinewidth 0 setlinejoin
10 setmiterlimit [ ] 0 setdash newpath
/languagelevel where           % If level not equal to 1 then
{pop languagelevel             % set strokeadjust and
1 ne                           % overprint to their defaults.
{false setstrokeadjust false setoverprint
} if
} if
} bd
/EndEPSF { %def
count op_count sub {pop} repeat            % Clean up stacks
countdictstack dict_count sub {end} repeat
b4_Inc_state restore
} bd
%%EndResource
%FOPBeginFontDict
%%IncludeResource: font Courier-Oblique
%%IncludeResource: font Courier-BoldOblique
%%IncludeResource: font Courier-Bold
%%IncludeResource: font ZapfDingbats
%%IncludeResource: font Symbol
%%IncludeResource: font Helvetica
%%IncludeResource: font Helvetica-Oblique
%%IncludeResource: font Helvetica-Bold
%%IncludeResource: font Helvetica-BoldOblique
%%IncludeResource: font Times-Roman
%%IncludeResource: font Times-Italic
%%IncludeResource: font Times-Bold
%%IncludeResource: font Times-BoldItalic
%%IncludeResource: font Courier
%FOPEndFontDict
%%BeginResource: encoding WinAnsiEncoding
/WinAnsiEncoding [
/.notdef /.notdef /.notdef /.notdef /.notdef
/.notdef /.notdef /.notdef /.notdef /.notdef
/.notdef /.notdef /.notdef /.notdef /.notdef
/.notdef /.notdef /.notdef /.notdef /.notdef
/.notdef /.notdef /.notdef /.notdef /.notdef
/.notdef /.notdef /.notdef /.notdef /.notdef
/.notdef /.notdef /space /exclam /quotedbl
/numbersign /dollar /percent /ampersand /quotesingle
/parenleft /parenright /asterisk /plus /comma
/hyphen /period /slash /zero /one
/two /three /four /five /six
/seven /eight /nine /colon /semicolon
/less /equal /greater /question /at
/A /B /C /D /E
/F /G /H /I /J
/K /L /M /N /O
/P /Q /R /S /T
/U /V /W /X /Y
/Z /bracketleft /backslash /bracketright /asciicircum
/underscore /quoteleft /a /b /c
/d /e /f /g /h
/i /j /k /l /m
/n /o /p /q /r
/s /t /u /v /w
/x /y /z /braceleft /bar
/braceright /asciitilde /bullet /Euro /bullet
/quotesinglbase /florin /quotedblbase /ellipsis /dagger
/daggerdbl /circumflex /perthousand /Scaron /guilsinglleft
/OE /bullet /Zcaron /bullet /bullet
/quoteleft /quoteright /quotedblleft /quotedblright /bullet
/endash /emdash /asciitilde /trademark /scaron
/guilsinglright /oe /bullet /zcaron /Ydieresis
/space /exclamdown /cent /sterling /currency
/yen /brokenbar /section /dieresis /copyright
/ordfeminine /guillemotleft /logicalnot /sfthyphen /registered
/macron /degree /plusminus /twosuperior /threesuperior
/acute /mu /paragraph /middot /cedilla
/onesuperior /ordmasculine /guillemotright /onequarter /onehalf
/threequarters /questiondown /Agrave /Aacute /Acircumflex
/Atilde /Adieresis /Aring /AE /Ccedilla
/Egrave /Eacute /Ecircumflex /Edieresis /Igrave
/Iacute /Icircumflex /Idieresis /Eth /Ntilde
/Ograve /Oacute /Ocircumflex /Otilde /Odieresis
/multiply /Oslash /Ugrave /Uacute /Ucircumflex
/Udieresis /Yacute /Thorn /germandbls /agrave
/aacute /acircumflex /atilde /adieresis /aring
/ae /ccedilla /egrave /eacute /ecircumflex
/edieresis /igrave /iacute /icircumflex /idieresis
/eth /ntilde /ograve /oacute /ocircumflex
/otilde /odieresis /divide /oslash /ugrave
/uacute /ucircumflex /udieresis /yacute /thorn
/ydieresis
] def
%%EndResource
%FOPBeginFontReencode
/Courier-Oblique findfont
dup length dict begin
  {1 index /FID ne {def} {pop pop} ifelse} forall
  /Encoding WinAnsiEncoding def
  currentdict
end
/Courier-Oblique exch definefont pop
/Courier-BoldOblique findfont
dup length dict begin
  {1 index /FID ne {def} {pop pop} ifelse} forall
  /Encoding WinAnsiEncoding def
  currentdict
end
/Courier-BoldOblique exch definefont pop
/Courier-Bold findfont
dup length dict begin
  {1 index /FID ne {def} {pop pop} ifelse} forall
  /Encoding WinAnsiEncoding def
  currentdict
end
/Courier-Bold exch definefont pop
/Helvetica findfont
dup length dict begin
  {1 index /FID ne {def} {pop pop} ifelse} forall
  /Encoding WinAnsiEncoding def
  currentdict
end
/Helvetica exch definefont pop
/Helvetica-Oblique findfont
dup length dict begin
  {1 index /FID ne {def} {pop pop} ifelse} forall
  /Encoding WinAnsiEncoding def
  currentdict
end
/Helvetica-Oblique exch definefont pop
/Helvetica-Bold findfont
dup length dict begin
  {1 index /FID ne {def} {pop pop} ifelse} forall
  /Encoding WinAnsiEncoding def
  currentdict
end
/Helvetica-Bold exch definefont pop
/Helvetica-BoldOblique findfont
dup length dict begin
  {1 index /FID ne {def} {pop pop} ifelse} forall
  /Encoding WinAnsiEncoding def
  currentdict
end
/Helvetica-BoldOblique exch definefont pop
/Times-Roman findfont
dup length dict begin
  {1 index /FID ne {def} {pop pop} ifelse} forall
  /Encoding WinAnsiEncoding def
  currentdict
end
/Times-Roman exch definefont pop
/Times-Italic findfont
dup length dict begin
  {1 index /FID ne {def} {pop pop} ifelse} forall
  /Encoding WinAnsiEncoding def
  currentdict
end
/Times-Italic exch definefont pop
/Times-Bold findfont
dup length dict begin
  {1 index /FID ne {def} {pop pop} ifelse} forall
  /Encoding WinAnsiEncoding def
  currentdict
end
/Times-Bold exch definefont pop
/Times-BoldItalic findfont
dup length dict begin
  {1 index /FID ne {def} {pop pop} ifelse} forall
  /Encoding WinAnsiEncoding def
  currentdict
end
/Times-BoldItalic exch definefont pop
/Courier findfont
dup length dict begin
  {1 index /FID ne {def} {pop pop} ifelse} forall
  /Encoding WinAnsiEncoding def
  currentdict
end
/Courier exch definefont pop
%FOPEndFontReencode
%%EndProlog
%%Page: 1 1
%%PageBoundingBox: 0 0 425 283
%%BeginPageSetup
[1 0 0 -1 0 283] CT
%%EndPageSetup
GS
[1.00046 0 0 1 0 0] CT
1 GC
N
0 0 425 283 re
f
GR
GS
[1.00046 0 0 1 0 0] CT
1 GC
N
0 0 425 283 re
f
GR
GS
[1.00046 0 0 1 0 0] CT
1 GC
N
64.5 248.5 M
384.5 248.5 L
384.5 21 L
64.5 21 L
cp
f
GR
GS
[1.00046 0 0 1 0 0] CT
0.149 GC
2 setlinecap
1 LJ
0.5 LW
N
64.5 248.5 M
384.5 248.5 L
S
GR
GS
[1.00046 0 0 1 0 0] CT
0.149 GC
2 setlinecap
1 LJ
0.5 LW
N
89.115 248.5 M
89.115 245.304 L
S
GR
GS
[1.00046 0 0 1 0 0] CT
0.149 GC
2 setlinecap
1 LJ
0.5 LW
N
138.346 248.5 M
138.346 245.304 L
S
GR
GS
[1.00046 0 0 1 0 0] CT
0.149 GC
2 setlinecap
1 LJ
0.5 LW
N
187.577 248.5 M
187.577 245.304 L
S
GR
GS
[1.00046 0 0 1 0 0] CT
0.149 GC
2 setlinecap
1 LJ
0.5 LW
N
236.808 248.5 M
236.808 245.304 L
S
GR
GS
[1.00046 0 0 1 0 0] CT
0.149 GC
2 setlinecap
1 LJ
0.5 LW
N
286.038 248.5 M
286.038 245.304 L
S
GR
GS
[1.00046 0 0 1 0 0] CT
0.149 GC
2 setlinecap
1 LJ
0.5 LW
N
335.269 248.5 M
335.269 245.304 L
S
GR
GS
[1.00046 0 0 1 0 0] CT
0.149 GC
2 setlinecap
1 LJ
0.5 LW
N
384.5 248.5 M
384.5 245.304 L
S
GR
GS
[1.00046 0 0 1 89.15666 252.90005] CT
0.149 GC
/Helvetica 12 F
GS
[1 0 0 1 0 0] CT
-6 12 moveto 
1 -1 scale
(-1) t 
GR
GR
GS
[1.00046 0 0 1 138.41024 252.90005] CT
0.149 GC
/Helvetica 12 F
GS
[1 0 0 1 0 0] CT
-3.5 12 moveto 
1 -1 scale
(0) t 
GR
GR
GS
[1.00046 0 0 1 187.6638 252.90005] CT
0.149 GC
/Helvetica 12 F
GS
[1 0 0 1 0 0] CT
-3.5 12 moveto 
1 -1 scale
(1) t 
GR
GR
GS
[1.00046 0 0 1 236.91737 252.90005] CT
0.149 GC
/Helvetica 12 F
GS
[1 0 0 1 0 0] CT
-3.5 12 moveto 
1 -1 scale
(2) t 
GR
GR
GS
[1.00046 0 0 1 286.17093 252.90005] CT
0.149 GC
/Helvetica 12 F
GS
[1 0 0 1 0 0] CT
-3.5 12 moveto 
1 -1 scale
(3) t 
GR
GR
GS
[1.00046 0 0 1 335.42451 252.90005] CT
0.149 GC
/Helvetica 12 F
GS
[1 0 0 1 0 0] CT
-3.5 12 moveto 
1 -1 scale
(4) t 
GR
GR
GS
[1.00046 0 0 1 384.67808 252.90005] CT
0.149 GC
/Helvetica 12 F
GS
[1 0 0 1 0 0] CT
-3.5 12 moveto 
1 -1 scale
(5) t 
GR
GR
GS
[1.00046 0 0 1 224.60413 268.49997] CT
0.149 GC
/Helvetica 12 F
GS
[1 0 0 1 0 0] CT
-21 12 moveto 
1 -1 scale
(Time \(s\)) t 
GR
GR
GS
[1.00046 0 0 1 0 0] CT
0.149 GC
2 setlinecap
1 LJ
0.5 LW
N
64.5 248.5 M
64.5 21 L
S
GR
GS
[1.00046 0 0 1 0 0] CT
0.149 GC
2 setlinecap
1 LJ
0.5 LW
N
64.5 248.5 M
67.696 248.5 L
S
GR
GS
[1.00046 0 0 1 0 0] CT
0.149 GC
2 setlinecap
1 LJ
0.5 LW
N
64.5 203 M
67.696 203 L
S
GR
GS
[1.00046 0 0 1 0 0] CT
0.149 GC
2 setlinecap
1 LJ
0.5 LW
N
64.5 157.5 M
67.696 157.5 L
S
GR
GS
[1.00046 0 0 1 0 0] CT
0.149 GC
2 setlinecap
1 LJ
0.5 LW
N
64.5 112 M
67.696 112 L
S
GR
GS
[1.00046 0 0 1 0 0] CT
0.149 GC
2 setlinecap
1 LJ
0.5 LW
N
64.5 66.5 M
67.696 66.5 L
S
GR
GS
[1.00046 0 0 1 0 0] CT
0.149 GC
2 setlinecap
1 LJ
0.5 LW
N
64.5 21 M
67.696 21 L
S
GR
GS
[1.00046 0 0 1 60.12783 248.50009] CT
0.149 GC
/Helvetica 12 F
GS
[1 0 0 1 0 0] CT
-29 4.5 moveto 
1 -1 scale
(-5.15) t 
GR
GR
GS
[1.00046 0 0 1 60.12783 202.99991] CT
0.149 GC
/Helvetica 12 F
GS
[1 0 0 1 0 0] CT
-22 4.5 moveto 
1 -1 scale
(-5.1) t 
GR
GR
GS
[1.00046 0 0 1 60.12783 157.50017] CT
0.149 GC
/Helvetica 12 F
GS
[1 0 0 1 0 0] CT
-29 4.5 moveto 
1 -1 scale
(-5.05) t 
GR
GR
GS
[1.00046 0 0 1 60.12783 112] CT
0.149 GC
/Helvetica 12 F
GS
[1 0 0 1 0 0] CT
-12 4.5 moveto 
1 -1 scale
(-5) t 
GR
GR
GS
[1.00046 0 0 1 60.12783 66.49982] CT
0.149 GC
/Helvetica 12 F
GS
[1 0 0 1 0 0] CT
-29 4.5 moveto 
1 -1 scale
(-4.95) t 
GR
GR
GS
[1.00046 0 0 1 60.12783 21.00009] CT
0.149 GC
/Helvetica 12 F
GS
[1 0 0 1 0 0] CT
-22 4.5 moveto 
1 -1 scale
(-4.9) t 
GR
GR
GS
[0 -1 1.00046 0 29.01344 134.75009] CT
0.149 GC
/Helvetica 12 F
GS
[1 0 0 1 0 0] CT
-53.5 -18 moveto 
1 -1 scale
(2-8 Hz Theta Power) t 
GR
GR
GS
[0 -1 1.00046 0 29.01344 134.75009] CT
0.149 GC
/Helvetica 12 F
GS
[1 0 0 1 0 0] CT
-46 -3 moveto 
1 -1 scale
(\(a.u.; normalized\)) t 
GR
GR
GS
[1.00046 0 0 1 0 0] CT
0.996 0.98 0.98 RC
N
69.423 224.844 M
71.885 226.234 L
74.346 227.821 L
76.808 229.832 L
79.269 231.472 L
81.731 234.076 L
84.192 234.734 L
86.654 235.203 L
89.115 234.784 L
91.577 233.359 L
94.038 234.044 L
96.5 234.14 L
98.962 232.481 L
101.423 230.521 L
103.885 228.227 L
106.346 227.072 L
108.808 224.339 L
111.269 222.341 L
113.731 220.499 L
116.192 219.964 L
118.654 218.019 L
121.115 217.886 L
123.577 218.278 L
126.038 219.283 L
128.5 221.455 L
130.962 218.374 L
133.423 213.88 L
135.885 209.957 L
138.346 202.145 L
140.808 192.737 L
143.269 183.356 L
145.731 174.04 L
148.192 166.115 L
150.654 162.64 L
153.115 160.326 L
155.577 158.917 L
158.038 161.609 L
160.5 165.335 L
162.962 170.71 L
165.423 176.343 L
167.885 182.872 L
170.346 185.706 L
172.808 187.02 L
175.269 188.405 L
177.731 192.013 L
180.192 196.626 L
182.654 199.127 L
185.115 203.008 L
187.577 207.377 L
190.038 213.371 L
192.5 217.621 L
194.962 218.261 L
197.423 218.876 L
199.885 218.152 L
202.346 218.424 L
204.808 218.563 L
207.269 218.533 L
209.731 220.077 L
212.192 224.427 L
214.654 226.427 L
217.115 229.3 L
219.577 230.126 L
222.038 230.266 L
224.5 227.711 L
226.962 225.11 L
229.423 222.577 L
231.885 220.761 L
234.346 219.935 L
236.808 220.089 L
239.269 218.982 L
241.731 219.869 L
244.192 220.569 L
246.654 220.913 L
249.115 220.126 L
251.577 218.231 L
254.038 216.683 L
256.5 216.122 L
258.962 216.071 L
261.423 216.983 L
263.885 217.279 L
266.346 217.375 L
268.808 217.532 L
271.269 217.171 L
273.731 214.565 L
276.192 211.807 L
278.654 209.419 L
281.115 207.396 L
283.577 204.803 L
286.038 201.353 L
288.5 195.348 L
290.962 186.07 L
293.423 174.96 L
295.885 161.051 L
298.346 145.722 L
300.808 132.175 L
303.269 122.638 L
305.731 119.644 L
308.192 119.715 L
310.654 122.386 L
313.115 127.281 L
315.577 133.674 L
318.038 140.543 L
320.5 146.589 L
322.962 153.627 L
325.423 159.355 L
327.885 167.318 L
330.346 174.11 L
332.808 180.103 L
335.269 186.61 L
337.731 195.242 L
340.192 201.566 L
342.654 205.996 L
345.115 206.876 L
347.577 207.404 L
350.038 206.443 L
352.5 205.82 L
354.962 205.051 L
357.423 206.749 L
359.885 209.573 L
362.346 211.315 L
364.808 214.327 L
367.269 217.109 L
369.731 220.535 L
372.192 222.782 L
374.654 222.894 L
377.115 221.822 L
379.577 219.292 L
382.038 217.165 L
384.5 212.463 L
384.538 212.388 L
384.538 203.681 L
384.538 203.541 L
384.5 203.619 L
382.038 208.297 L
379.577 210.252 L
377.115 212.016 L
374.654 212.786 L
372.192 212.548 L
369.731 210.63 L
367.269 207.695 L
364.808 205.419 L
362.346 202.362 L
359.885 200.299 L
357.423 197.72 L
354.962 196.193 L
352.5 196.903 L
350.038 197.299 L
347.577 198.074 L
345.115 197.706 L
342.654 196.513 L
340.192 191.988 L
337.731 185.587 L
335.269 176.776 L
332.808 169.893 L
330.346 163.248 L
327.885 155.006 L
325.423 146.007 L
322.962 139.391 L
320.5 131.913 L
318.038 125.691 L
315.577 119.133 L
313.115 112.716 L
310.654 107.828 L
308.192 105.423 L
305.731 106.001 L
303.269 109.779 L
300.808 119.783 L
298.346 133.92 L
295.885 149.994 L
293.423 164.816 L
290.962 176.571 L
288.5 186.012 L
286.038 191.878 L
283.577 195.275 L
281.115 197.318 L
278.654 199.45 L
276.192 202.114 L
273.731 205.249 L
271.269 208.03 L
268.808 208.394 L
266.346 208.219 L
263.885 208.428 L
261.423 207.907 L
258.962 207.028 L
256.5 206.992 L
254.038 207.215 L
251.577 208.788 L
249.115 210.909 L
246.654 211.685 L
244.192 211.374 L
241.731 210.499 L
239.269 209.662 L
236.808 210.635 L
234.346 210.039 L
231.885 210.679 L
229.423 212.536 L
226.962 215.181 L
224.5 217.456 L
222.038 219.892 L
219.577 219.689 L
217.115 218.917 L
214.654 215.843 L
212.192 213.935 L
209.731 210.202 L
207.269 208.821 L
204.808 208.776 L
202.346 208.583 L
199.885 208.42 L
197.423 208.568 L
194.962 207.983 L
192.5 207.645 L
190.038 203.584 L
187.577 197.72 L
185.115 192.99 L
182.654 189.352 L
180.192 187.321 L
177.731 183.027 L
175.269 179.487 L
172.808 178.078 L
170.346 176.803 L
167.885 174.434 L
165.423 168.365 L
162.962 163.159 L
160.5 157.737 L
158.038 153.702 L
155.577 151.226 L
153.115 152.536 L
150.654 154.645 L
148.192 158.316 L
145.731 166.3 L
143.269 175.367 L
140.808 184.583 L
138.346 193.457 L
135.885 200.909 L
133.423 205.087 L
130.962 209.846 L
128.5 213.148 L
126.038 211.764 L
123.577 210.681 L
121.115 210.41 L
118.654 210.477 L
116.192 212.119 L
113.731 212.134 L
111.269 213.796 L
108.808 215.886 L
106.346 218.523 L
103.885 219.994 L
101.423 222.399 L
98.962 224.429 L
96.5 225.907 L
94.038 225.913 L
91.577 225.087 L
89.115 226.167 L
86.654 226.515 L
84.192 225.951 L
81.731 225.342 L
79.269 222.615 L
76.808 220.743 L
74.346 218.496 L
71.885 216.816 L
69.423 215.155 L
66.962 212.425 L
64.5 210.181 L
64.462 210.121 L
64.462 210.269 L
64.462 219.367 L
64.5 219.421 L
66.962 222.124 L
cp
f
GR
GS
[1.00046 0 0 1 0 0] CT
0.98 0.91 0.91 RC
1 LJ
0.5 LW
N
64.462 219.367 M
64.5 219.421 L
66.962 222.124 L
69.423 224.844 L
71.885 226.234 L
74.346 227.821 L
76.808 229.832 L
79.269 231.472 L
81.731 234.076 L
84.192 234.734 L
86.654 235.203 L
89.115 234.784 L
91.577 233.359 L
94.038 234.044 L
96.5 234.14 L
98.962 232.481 L
101.423 230.521 L
103.885 228.227 L
106.346 227.072 L
108.808 224.339 L
111.269 222.341 L
113.731 220.499 L
116.192 219.964 L
118.654 218.019 L
121.115 217.886 L
123.577 218.278 L
126.038 219.283 L
128.5 221.455 L
130.962 218.374 L
133.423 213.88 L
135.885 209.957 L
138.346 202.145 L
140.808 192.737 L
143.269 183.356 L
145.731 174.04 L
148.192 166.115 L
150.654 162.64 L
153.115 160.326 L
155.577 158.917 L
158.038 161.609 L
160.5 165.335 L
162.962 170.71 L
165.423 176.343 L
167.885 182.872 L
170.346 185.706 L
172.808 187.02 L
175.269 188.405 L
177.731 192.013 L
180.192 196.626 L
182.654 199.127 L
185.115 203.008 L
187.577 207.377 L
190.038 213.371 L
192.5 217.621 L
194.962 218.261 L
197.423 218.876 L
199.885 218.152 L
202.346 218.424 L
204.808 218.563 L
207.269 218.533 L
209.731 220.077 L
212.192 224.427 L
214.654 226.427 L
217.115 229.3 L
219.577 230.126 L
222.038 230.266 L
224.5 227.711 L
226.962 225.11 L
229.423 222.577 L
231.885 220.761 L
234.346 219.935 L
236.808 220.089 L
239.269 218.982 L
241.731 219.869 L
244.192 220.569 L
246.654 220.913 L
249.115 220.126 L
251.577 218.231 L
254.038 216.683 L
256.5 216.122 L
258.962 216.071 L
261.423 216.983 L
263.885 217.279 L
266.346 217.375 L
268.808 217.532 L
271.269 217.171 L
273.731 214.565 L
276.192 211.807 L
278.654 209.419 L
281.115 207.396 L
283.577 204.803 L
286.038 201.353 L
288.5 195.348 L
290.962 186.07 L
293.423 174.96 L
295.885 161.051 L
298.346 145.722 L
300.808 132.175 L
303.269 122.638 L
305.731 119.644 L
308.192 119.715 L
310.654 122.386 L
313.115 127.281 L
315.577 133.674 L
318.038 140.543 L
320.5 146.589 L
322.962 153.627 L
325.423 159.355 L
327.885 167.318 L
330.346 174.11 L
332.808 180.103 L
335.269 186.61 L
337.731 195.242 L
340.192 201.566 L
342.654 205.996 L
345.115 206.876 L
347.577 207.404 L
350.038 206.443 L
352.5 205.82 L
354.962 205.051 L
357.423 206.749 L
359.885 209.573 L
362.346 211.315 L
364.808 214.327 L
367.269 217.109 L
369.731 220.535 L
372.192 222.782 L
374.654 222.894 L
377.115 221.822 L
379.577 219.292 L
382.038 217.165 L
384.5 212.463 L
384.538 212.388 L
S
GR
GS
[1.00046 0 0 1 0 0] CT
0.98 0.91 0.91 RC
1 LJ
0.5 LW
N
64.462 210.121 M
64.5 210.181 L
66.962 212.425 L
69.423 215.155 L
71.885 216.816 L
74.346 218.496 L
76.808 220.743 L
79.269 222.615 L
81.731 225.342 L
84.192 225.951 L
86.654 226.515 L
89.115 226.167 L
91.577 225.087 L
94.038 225.913 L
96.5 225.907 L
98.962 224.429 L
101.423 222.399 L
103.885 219.994 L
106.346 218.523 L
108.808 215.886 L
111.269 213.796 L
113.731 212.134 L
116.192 212.119 L
118.654 210.477 L
121.115 210.41 L
123.577 210.681 L
126.038 211.764 L
128.5 213.148 L
130.962 209.846 L
133.423 205.087 L
135.885 200.909 L
138.346 193.457 L
140.808 184.583 L
143.269 175.367 L
145.731 166.3 L
148.192 158.316 L
150.654 154.645 L
153.115 152.536 L
155.577 151.226 L
158.038 153.702 L
160.5 157.737 L
162.962 163.159 L
165.423 168.365 L
167.885 174.434 L
170.346 176.803 L
172.808 178.078 L
175.269 179.487 L
177.731 183.027 L
180.192 187.321 L
182.654 189.352 L
185.115 192.99 L
187.577 197.72 L
190.038 203.584 L
192.5 207.645 L
194.962 207.983 L
197.423 208.568 L
199.885 208.42 L
202.346 208.583 L
204.808 208.776 L
207.269 208.821 L
209.731 210.202 L
212.192 213.935 L
214.654 215.843 L
217.115 218.917 L
219.577 219.689 L
222.038 219.892 L
224.5 217.456 L
226.962 215.181 L
229.423 212.536 L
231.885 210.679 L
234.346 210.039 L
236.808 210.635 L
239.269 209.662 L
241.731 210.499 L
244.192 211.374 L
246.654 211.685 L
249.115 210.909 L
251.577 208.788 L
254.038 207.215 L
256.5 206.992 L
258.962 207.028 L
261.423 207.907 L
263.885 208.428 L
266.346 208.219 L
268.808 208.394 L
271.269 208.03 L
273.731 205.249 L
276.192 202.114 L
278.654 199.45 L
281.115 197.318 L
283.577 195.275 L
286.038 191.878 L
288.5 186.012 L
290.962 176.571 L
293.423 164.816 L
295.885 149.994 L
298.346 133.92 L
300.808 119.783 L
303.269 109.779 L
305.731 106.001 L
308.192 105.423 L
310.654 107.828 L
313.115 112.716 L
315.577 119.133 L
318.038 125.691 L
320.5 131.913 L
322.962 139.391 L
325.423 146.007 L
327.885 155.006 L
330.346 163.248 L
332.808 169.893 L
335.269 176.776 L
337.731 185.587 L
340.192 191.988 L
342.654 196.513 L
345.115 197.706 L
347.577 198.074 L
350.038 197.299 L
352.5 196.903 L
354.962 196.193 L
357.423 197.72 L
359.885 200.299 L
362.346 202.362 L
364.808 205.419 L
367.269 207.695 L
369.731 210.63 L
372.192 212.548 L
374.654 212.786 L
377.115 212.016 L
379.577 210.252 L
382.038 208.297 L
384.5 203.619 L
384.538 203.541 L
S
GR
GS
[1.00046 0 0 1 0 0] CT
0.961 0.8 0.8 RC
1 LJ
2 LW
N
64.462 214.743 M
64.5 214.801 L
66.962 217.274 L
69.423 219.999 L
71.885 221.525 L
74.346 223.158 L
76.808 225.288 L
79.269 227.043 L
81.731 229.709 L
84.192 230.343 L
86.654 230.859 L
89.115 230.476 L
91.577 229.223 L
94.038 229.979 L
96.5 230.024 L
98.962 228.455 L
101.423 226.46 L
103.885 224.111 L
106.346 222.797 L
108.808 220.112 L
111.269 218.069 L
113.731 216.317 L
116.192 216.041 L
118.654 214.248 L
121.115 214.148 L
123.577 214.479 L
126.038 215.523 L
128.5 217.301 L
130.962 214.11 L
133.423 209.484 L
135.885 205.433 L
138.346 197.801 L
140.808 188.66 L
143.269 179.362 L
145.731 170.17 L
148.192 162.216 L
150.654 158.643 L
153.115 156.431 L
155.577 155.072 L
158.038 157.655 L
160.5 161.537 L
162.962 166.934 L
165.423 172.354 L
167.885 178.653 L
170.346 181.255 L
172.808 182.549 L
175.269 183.946 L
177.731 187.52 L
180.192 191.973 L
182.654 194.239 L
185.115 197.999 L
187.577 202.549 L
190.038 208.478 L
192.5 212.633 L
194.962 213.122 L
197.423 213.722 L
199.885 213.286 L
202.346 213.503 L
204.808 213.67 L
207.269 213.677 L
209.731 215.14 L
212.192 219.181 L
214.654 221.135 L
217.115 224.108 L
219.577 224.908 L
222.038 225.079 L
224.5 222.584 L
226.962 220.145 L
229.423 217.557 L
231.885 215.72 L
234.346 214.987 L
236.808 215.362 L
239.269 214.322 L
241.731 215.184 L
244.192 215.971 L
246.654 216.299 L
249.115 215.518 L
251.577 213.51 L
254.038 211.949 L
256.5 211.557 L
258.962 211.549 L
261.423 212.445 L
263.885 212.853 L
266.346 212.797 L
268.808 212.963 L
271.269 212.6 L
273.731 209.908 L
276.192 206.961 L
278.654 204.435 L
281.115 202.357 L
283.577 200.039 L
286.038 196.616 L
288.5 190.68 L
290.962 181.321 L
293.423 169.888 L
295.885 155.522 L
298.346 139.821 L
300.808 125.979 L
303.269 116.209 L
305.731 112.823 L
308.192 112.569 L
310.654 115.107 L
313.115 119.998 L
315.577 126.403 L
318.038 133.117 L
320.5 139.251 L
322.962 146.509 L
325.423 152.681 L
327.885 161.162 L
330.346 168.679 L
332.808 174.998 L
335.269 181.693 L
337.731 190.414 L
340.192 196.777 L
342.654 201.255 L
345.115 202.291 L
347.577 202.739 L
350.038 201.871 L
352.5 201.361 L
354.962 200.622 L
357.423 202.234 L
359.885 204.936 L
362.346 206.839 L
364.808 209.873 L
367.269 212.402 L
369.731 215.582 L
372.192 217.666 L
374.654 217.84 L
377.115 216.919 L
379.577 214.772 L
382.038 212.731 L
384.5 208.041 L
384.538 207.965 L
S
GR
GS
[1.00046 0 0 1 0 0] CT
0.99 0.959 0.959 RC
N
98.962 237.206 M
101.423 233.741 L
103.885 232.776 L
106.346 231.773 L
108.808 231.772 L
111.269 231.895 L
113.731 232.113 L
116.192 230.236 L
118.654 226.618 L
121.115 223.92 L
123.577 221.495 L
126.038 220.842 L
128.5 221.312 L
130.962 219.262 L
133.423 217.231 L
135.885 213.081 L
138.346 207.261 L
140.808 201.871 L
143.269 194.313 L
145.731 185.558 L
148.192 178.66 L
150.654 174.946 L
153.115 173.38 L
155.577 171.16 L
158.038 172.621 L
160.5 175.427 L
162.962 178.922 L
165.423 181.457 L
167.885 184.101 L
170.346 185.516 L
172.808 185.973 L
175.269 185.114 L
177.731 183.888 L
180.192 182.244 L
182.654 182.25 L
185.115 182.324 L
187.577 182.327 L
190.038 182.166 L
192.5 183.357 L
194.962 185.295 L
197.423 186.211 L
199.885 187.228 L
202.346 190.107 L
204.808 192.193 L
207.269 192.91 L
209.731 193.642 L
212.192 193.487 L
214.654 194.955 L
217.115 196.682 L
219.577 196.996 L
222.038 197.829 L
224.5 197.54 L
226.962 197.546 L
229.423 199.211 L
231.885 200.112 L
234.346 199.096 L
236.808 199.141 L
239.269 199.568 L
241.731 201.071 L
244.192 201.691 L
246.654 202.587 L
249.115 203.261 L
251.577 204.328 L
254.038 204.63 L
256.5 204.334 L
258.962 204.714 L
261.423 203.447 L
263.885 203.785 L
266.346 204 L
268.808 205.764 L
271.269 205.825 L
273.731 204.639 L
276.192 203.958 L
278.654 202.329 L
281.115 201.935 L
283.577 199.502 L
286.038 193.077 L
288.5 186.917 L
290.962 179.106 L
293.423 170.661 L
295.885 159.545 L
298.346 141.921 L
300.808 123.252 L
303.269 105.357 L
305.731 89.727 L
308.192 76.996 L
310.654 68.119 L
313.115 62.118 L
315.577 61.706 L
318.038 69.306 L
320.5 82.234 L
322.962 97.347 L
325.423 112.578 L
327.885 125.912 L
330.346 137.672 L
332.808 149.7 L
335.269 160.199 L
337.731 167.629 L
340.192 174.326 L
342.654 180.104 L
345.115 184.743 L
347.577 188.708 L
350.038 192.463 L
352.5 196.888 L
354.962 200.612 L
357.423 205.048 L
359.885 208.296 L
362.346 210.724 L
364.808 212.397 L
367.269 212.866 L
369.731 212.428 L
372.192 213.097 L
374.654 212.37 L
377.115 211.413 L
379.577 209.8 L
382.038 206.001 L
384.5 201.688 L
384.538 201.593 L
384.538 195.016 L
384.538 194.902 L
384.5 195.007 L
382.038 199.168 L
379.577 202.886 L
377.115 203.626 L
374.654 204.044 L
372.192 204.169 L
369.731 203.635 L
367.269 204.254 L
364.808 204.07 L
362.346 201.913 L
359.885 199.269 L
357.423 195.697 L
354.962 191.299 L
352.5 187.692 L
350.038 183.161 L
347.577 179.268 L
345.115 175.257 L
342.654 170.72 L
340.192 165.207 L
337.731 158.545 L
335.269 151.239 L
332.808 140.846 L
330.346 128.755 L
327.885 116.616 L
325.423 103.21 L
322.962 87.952 L
320.5 72.865 L
318.038 60.216 L
315.577 52.805 L
313.115 53.586 L
310.654 59.567 L
308.192 68.072 L
305.731 80.584 L
303.269 96.483 L
300.808 114.761 L
298.346 133.719 L
295.885 151.933 L
293.423 163.454 L
290.962 172.251 L
288.5 179.933 L
286.038 185.922 L
283.577 191.855 L
281.115 193.898 L
278.654 193.975 L
276.192 195.156 L
273.731 194.924 L
271.269 195.674 L
268.808 195.738 L
266.346 194.624 L
263.885 195.112 L
261.423 195.169 L
258.962 196.884 L
256.5 196.981 L
254.038 197.178 L
251.577 196.07 L
249.115 194.729 L
246.654 193.921 L
244.192 193.146 L
241.731 192.435 L
239.269 190.801 L
236.808 190.013 L
234.346 189.955 L
231.885 190.67 L
229.423 190.289 L
226.962 189.094 L
224.5 189.333 L
222.038 189.932 L
219.577 189.432 L
217.115 189.178 L
214.654 187.724 L
212.192 186.371 L
209.731 185.921 L
207.269 184.818 L
204.808 183.718 L
202.346 181.058 L
199.885 178.268 L
197.423 177.078 L
194.962 176.22 L
192.5 175.286 L
190.038 175.168 L
187.577 175.758 L
185.115 175.788 L
182.654 175.129 L
180.192 175.102 L
177.731 177.081 L
175.269 178.267 L
172.808 178.811 L
170.346 177.74 L
167.885 175.967 L
165.423 173.038 L
162.962 170.335 L
160.5 166.988 L
158.038 164.106 L
155.577 162.451 L
153.115 164.364 L
150.654 165.627 L
148.192 169.377 L
145.731 176.401 L
143.269 185.564 L
140.808 193.124 L
138.346 198.66 L
135.885 205.023 L
133.423 209.223 L
130.962 210.875 L
128.5 212.621 L
126.038 212.301 L
123.577 213.192 L
121.115 215.832 L
118.654 218.37 L
116.192 222.13 L
113.731 224.245 L
111.269 224.496 L
108.808 224.537 L
106.346 224.268 L
103.885 224.778 L
101.423 225.786 L
98.962 228.855 L
96.5 231.829 L
94.038 233.441 L
91.577 234.549 L
89.115 235.879 L
86.654 237.784 L
84.192 238.405 L
81.731 238.141 L
79.269 236.229 L
76.808 232.379 L
74.346 227.103 L
71.885 221.404 L
69.423 216.278 L
66.962 210.536 L
64.5 206.429 L
64.462 206.339 L
64.462 206.471 L
64.462 214.492 L
64.5 214.577 L
66.962 218.233 L
69.423 223.097 L
71.885 228.012 L
74.346 233.695 L
76.808 239.476 L
79.269 243.653 L
81.731 246.051 L
84.192 246.438 L
86.654 245.54 L
89.115 243.69 L
91.577 242.518 L
94.038 241.342 L
96.5 239.755 L
cp
f
GR
GS
[1.00046 0 0 1 0 0] CT
0.957 0.82 0.82 RC
1 LJ
0.5 LW
N
64.462 214.492 M
64.5 214.577 L
66.962 218.233 L
69.423 223.097 L
71.885 228.012 L
74.346 233.695 L
76.808 239.476 L
79.269 243.653 L
81.731 246.051 L
84.192 246.438 L
86.654 245.54 L
89.115 243.69 L
91.577 242.518 L
94.038 241.342 L
96.5 239.755 L
98.962 237.206 L
101.423 233.741 L
103.885 232.776 L
106.346 231.773 L
108.808 231.772 L
111.269 231.895 L
113.731 232.113 L
116.192 230.236 L
118.654 226.618 L
121.115 223.92 L
123.577 221.495 L
126.038 220.842 L
128.5 221.312 L
130.962 219.262 L
133.423 217.231 L
135.885 213.081 L
138.346 207.261 L
140.808 201.871 L
143.269 194.313 L
145.731 185.558 L
148.192 178.66 L
150.654 174.946 L
153.115 173.38 L
155.577 171.16 L
158.038 172.621 L
160.5 175.427 L
162.962 178.922 L
165.423 181.457 L
167.885 184.101 L
170.346 185.516 L
172.808 185.973 L
175.269 185.114 L
177.731 183.888 L
180.192 182.244 L
182.654 182.25 L
185.115 182.324 L
187.577 182.327 L
190.038 182.166 L
192.5 183.357 L
194.962 185.295 L
197.423 186.211 L
199.885 187.228 L
202.346 190.107 L
204.808 192.193 L
207.269 192.91 L
209.731 193.642 L
212.192 193.487 L
214.654 194.955 L
217.115 196.682 L
219.577 196.996 L
222.038 197.829 L
224.5 197.54 L
226.962 197.546 L
229.423 199.211 L
231.885 200.112 L
234.346 199.096 L
236.808 199.141 L
239.269 199.568 L
241.731 201.071 L
244.192 201.691 L
246.654 202.587 L
249.115 203.261 L
251.577 204.328 L
254.038 204.63 L
256.5 204.334 L
258.962 204.714 L
261.423 203.447 L
263.885 203.785 L
266.346 204 L
268.808 205.764 L
271.269 205.825 L
273.731 204.639 L
276.192 203.958 L
278.654 202.329 L
281.115 201.935 L
283.577 199.502 L
286.038 193.077 L
288.5 186.917 L
290.962 179.106 L
293.423 170.661 L
295.885 159.545 L
298.346 141.921 L
300.808 123.252 L
303.269 105.357 L
305.731 89.727 L
308.192 76.996 L
310.654 68.119 L
313.115 62.118 L
315.577 61.706 L
318.038 69.306 L
320.5 82.234 L
322.962 97.347 L
325.423 112.578 L
327.885 125.912 L
330.346 137.672 L
332.808 149.7 L
335.269 160.199 L
337.731 167.629 L
340.192 174.326 L
342.654 180.104 L
345.115 184.743 L
347.577 188.708 L
350.038 192.463 L
352.5 196.888 L
354.962 200.612 L
357.423 205.048 L
359.885 208.296 L
362.346 210.724 L
364.808 212.397 L
367.269 212.866 L
369.731 212.428 L
372.192 213.097 L
374.654 212.37 L
377.115 211.413 L
379.577 209.8 L
382.038 206.001 L
384.5 201.688 L
384.538 201.593 L
S
GR
GS
[1.00046 0 0 1 0 0] CT
0.957 0.82 0.82 RC
1 LJ
0.5 LW
N
64.462 206.339 M
64.5 206.429 L
66.962 210.536 L
69.423 216.278 L
71.885 221.404 L
74.346 227.103 L
76.808 232.379 L
79.269 236.229 L
81.731 238.141 L
84.192 238.405 L
86.654 237.784 L
89.115 235.879 L
91.577 234.549 L
94.038 233.441 L
96.5 231.829 L
98.962 228.855 L
101.423 225.786 L
103.885 224.778 L
106.346 224.268 L
108.808 224.537 L
111.269 224.496 L
113.731 224.245 L
116.192 222.13 L
118.654 218.37 L
121.115 215.832 L
123.577 213.192 L
126.038 212.301 L
128.5 212.621 L
130.962 210.875 L
133.423 209.223 L
135.885 205.023 L
138.346 198.66 L
140.808 193.124 L
143.269 185.564 L
145.731 176.401 L
148.192 169.377 L
150.654 165.627 L
153.115 164.364 L
155.577 162.451 L
158.038 164.106 L
160.5 166.988 L
162.962 170.335 L
165.423 173.038 L
167.885 175.967 L
170.346 177.74 L
172.808 178.811 L
175.269 178.267 L
177.731 177.081 L
180.192 175.102 L
182.654 175.129 L
185.115 175.788 L
187.577 175.758 L
190.038 175.168 L
192.5 175.286 L
194.962 176.22 L
197.423 177.078 L
199.885 178.268 L
202.346 181.058 L
204.808 183.718 L
207.269 184.818 L
209.731 185.921 L
212.192 186.371 L
214.654 187.724 L
217.115 189.178 L
219.577 189.432 L
222.038 189.932 L
224.5 189.333 L
226.962 189.094 L
229.423 190.289 L
231.885 190.67 L
234.346 189.955 L
236.808 190.013 L
239.269 190.801 L
241.731 192.435 L
244.192 193.146 L
246.654 193.921 L
249.115 194.729 L
251.577 196.07 L
254.038 197.178 L
256.5 196.981 L
258.962 196.884 L
261.423 195.169 L
263.885 195.112 L
266.346 194.624 L
268.808 195.738 L
271.269 195.674 L
273.731 194.924 L
276.192 195.156 L
278.654 193.975 L
281.115 193.898 L
283.577 191.855 L
286.038 185.922 L
288.5 179.933 L
290.962 172.251 L
293.423 163.454 L
295.885 151.933 L
298.346 133.719 L
300.808 114.761 L
303.269 96.483 L
305.731 80.584 L
308.192 68.072 L
310.654 59.567 L
313.115 53.586 L
315.577 52.805 L
318.038 60.216 L
320.5 72.865 L
322.962 87.952 L
325.423 103.21 L
327.885 116.616 L
330.346 128.755 L
332.808 140.846 L
335.269 151.239 L
337.731 158.545 L
340.192 165.207 L
342.654 170.72 L
345.115 175.257 L
347.577 179.268 L
350.038 183.161 L
352.5 187.692 L
354.962 191.299 L
357.423 195.697 L
359.885 199.269 L
362.346 201.913 L
364.808 204.07 L
367.269 204.254 L
369.731 203.635 L
372.192 204.169 L
374.654 204.044 L
377.115 203.626 L
379.577 202.886 L
382.038 199.168 L
384.5 195.007 L
384.538 194.902 L
S
GR
GS
[1.00046 0 0 1 0 0] CT
0.898 0.6 0.6 RC
1 LJ
2 LW
N
64.462 210.415 M
64.5 210.503 L
66.962 214.384 L
69.423 219.688 L
71.885 224.708 L
74.346 230.399 L
76.808 235.928 L
79.269 239.941 L
81.731 242.096 L
84.192 242.422 L
86.654 241.662 L
89.115 239.785 L
91.577 238.533 L
94.038 237.392 L
96.5 235.792 L
98.962 233.03 L
101.423 229.764 L
103.885 228.777 L
106.346 228.02 L
108.808 228.155 L
111.269 228.196 L
113.731 228.179 L
116.192 226.183 L
118.654 222.494 L
121.115 219.876 L
123.577 217.344 L
126.038 216.572 L
128.5 216.967 L
130.962 215.068 L
133.423 213.227 L
135.885 209.052 L
138.346 202.96 L
140.808 197.497 L
143.269 189.938 L
145.731 180.98 L
148.192 174.018 L
150.654 170.287 L
153.115 168.872 L
155.577 166.806 L
158.038 168.363 L
160.5 171.207 L
162.962 174.628 L
165.423 177.248 L
167.885 180.034 L
170.346 181.628 L
172.808 182.392 L
175.269 181.69 L
177.731 180.485 L
180.192 178.673 L
182.654 178.689 L
185.115 179.056 L
187.577 179.042 L
190.038 178.667 L
192.5 179.321 L
194.962 180.758 L
197.423 181.644 L
199.885 182.748 L
202.346 185.583 L
204.808 187.955 L
207.269 188.864 L
209.731 189.781 L
212.192 189.929 L
214.654 191.34 L
217.115 192.93 L
219.577 193.214 L
222.038 193.881 L
224.5 193.437 L
226.962 193.32 L
229.423 194.75 L
231.885 195.391 L
234.346 194.525 L
236.808 194.577 L
239.269 195.185 L
241.731 196.753 L
244.192 197.418 L
246.654 198.254 L
249.115 198.995 L
251.577 200.199 L
254.038 200.904 L
256.5 200.658 L
258.962 200.799 L
261.423 199.308 L
263.885 199.448 L
266.346 199.312 L
268.808 200.751 L
271.269 200.749 L
273.731 199.782 L
276.192 199.557 L
278.654 198.152 L
281.115 197.917 L
283.577 195.678 L
286.038 189.5 L
288.5 183.424 L
290.962 175.679 L
293.423 167.057 L
295.885 155.739 L
298.346 137.82 L
300.808 119.007 L
303.269 100.92 L
305.731 85.155 L
308.192 72.534 L
310.654 63.843 L
313.115 57.852 L
315.577 57.255 L
318.038 64.761 L
320.5 77.55 L
322.962 92.65 L
325.423 107.895 L
327.885 121.264 L
330.346 133.214 L
332.808 145.273 L
335.269 155.719 L
337.731 163.087 L
340.192 169.767 L
342.654 175.412 L
345.115 180 L
347.577 183.988 L
350.038 187.812 L
352.5 192.29 L
354.962 195.955 L
357.423 200.373 L
359.885 203.782 L
362.346 206.319 L
364.808 208.233 L
367.269 208.56 L
369.731 208.032 L
372.192 208.633 L
374.654 208.207 L
377.115 207.52 L
379.577 206.343 L
382.038 202.585 L
384.5 198.347 L
384.538 198.248 L
S
GR
GS
[1.00046 0 0 1 0 0] CT
0.98 0.939 0.939 RC
N
140.808 209.266 M
143.269 199.708 L
145.731 191.992 L
148.192 185.876 L
150.654 183.822 L
153.115 183.047 L
155.577 183.015 L
158.038 183.921 L
160.5 185.164 L
162.962 185.929 L
165.423 185.912 L
167.885 187.598 L
170.346 187.782 L
172.808 188.558 L
175.269 188.562 L
177.731 187.612 L
180.192 186.344 L
182.654 185.985 L
185.115 185.239 L
187.577 183.132 L
190.038 181.178 L
192.5 180.049 L
194.962 179.291 L
197.423 181.188 L
199.885 182.79 L
202.346 183.66 L
204.808 180.985 L
207.269 180.248 L
209.731 179.957 L
212.192 182.177 L
214.654 184.745 L
217.115 186.299 L
219.577 187.984 L
222.038 188.477 L
224.5 188.776 L
226.962 189.449 L
229.423 189.709 L
231.885 189.022 L
234.346 188.341 L
236.808 184.992 L
239.269 181.123 L
241.731 179.552 L
244.192 178.751 L
246.654 178.427 L
249.115 180.908 L
251.577 183.061 L
254.038 185.017 L
256.5 186.923 L
258.962 188.566 L
261.423 190.555 L
263.885 192.474 L
266.346 192.858 L
268.808 191.492 L
271.269 189.728 L
273.731 189.7 L
276.192 191.564 L
278.654 193.582 L
281.115 195.237 L
283.577 194.77 L
286.038 192.569 L
288.5 188.236 L
290.962 180.491 L
293.423 169.983 L
295.885 156.269 L
298.346 139.637 L
300.808 119.605 L
303.269 100.163 L
305.731 84.655 L
308.192 74.024 L
310.654 67.835 L
313.115 65.428 L
315.577 67.838 L
318.038 72.856 L
320.5 78.797 L
322.962 87.307 L
325.423 96.934 L
327.885 107.592 L
330.346 118.66 L
332.808 130.489 L
335.269 141.841 L
337.731 153.53 L
340.192 162.526 L
342.654 170.289 L
345.115 175.652 L
347.577 180.348 L
350.038 187.039 L
352.5 192.186 L
354.962 196.116 L
357.423 198.834 L
359.885 198.741 L
362.346 199.177 L
364.808 198.791 L
367.269 199.361 L
369.731 200.84 L
372.192 203.486 L
374.654 204.805 L
377.115 206.124 L
379.577 205.805 L
382.038 202.316 L
384.5 199.814 L
384.538 199.741 L
384.538 191.289 L
384.538 191.158 L
384.5 191.229 L
382.038 193.1 L
379.577 196.275 L
377.115 196.668 L
374.654 195.265 L
372.192 193.816 L
369.731 191.386 L
367.269 189.866 L
364.808 189.627 L
362.346 190.175 L
359.885 189.898 L
357.423 189.813 L
354.962 187.255 L
352.5 183.989 L
350.038 179.162 L
347.577 172.555 L
345.115 167.903 L
342.654 162.387 L
340.192 154.495 L
337.731 146.144 L
335.269 134.804 L
332.808 123.024 L
330.346 110.942 L
327.885 99.352 L
325.423 88.232 L
322.962 77.974 L
320.5 68.672 L
318.038 62.582 L
315.577 57.994 L
313.115 55.982 L
310.654 59.075 L
308.192 66.037 L
305.731 76.707 L
303.269 91.83 L
300.808 111.03 L
298.346 131.493 L
295.885 148.683 L
293.423 162.581 L
290.962 172.936 L
288.5 180.185 L
286.038 183.741 L
283.577 185.207 L
281.115 185.545 L
278.654 184.237 L
276.192 182.903 L
273.731 181.594 L
271.269 181.467 L
268.808 183.06 L
266.346 183.926 L
263.885 183.073 L
261.423 181.739 L
258.962 180.65 L
256.5 179.852 L
254.038 177.766 L
251.577 174.916 L
249.115 172.238 L
246.654 169.658 L
244.192 170.178 L
241.731 171.236 L
239.269 172.457 L
236.808 176.328 L
234.346 179.702 L
231.885 180.377 L
229.423 181.211 L
226.962 181.384 L
224.5 180.81 L
222.038 180.278 L
219.577 179.858 L
217.115 178.277 L
214.654 176.389 L
212.192 173.402 L
209.731 171.206 L
207.269 171.634 L
204.808 172.911 L
202.346 175.905 L
199.885 175.419 L
197.423 173.739 L
194.962 171.748 L
192.5 171.799 L
190.038 172.612 L
187.577 173.849 L
185.115 175.696 L
182.654 176.236 L
180.192 176.998 L
177.731 178.521 L
175.269 179.892 L
172.808 180.63 L
170.346 180.003 L
167.885 179.725 L
165.423 178.171 L
162.962 178.385 L
160.5 177.554 L
158.038 176.336 L
155.577 174.863 L
153.115 174.666 L
150.654 175.433 L
148.192 177.873 L
145.731 183.692 L
143.269 191.012 L
140.808 199.998 L
138.346 205.513 L
135.885 208.901 L
133.423 212.498 L
130.962 214.73 L
128.5 218.379 L
126.038 220 L
123.577 221.101 L
121.115 222.669 L
118.654 224.835 L
116.192 227.049 L
113.731 227.344 L
111.269 227.152 L
108.808 227.631 L
106.346 229.061 L
103.885 229.412 L
101.423 227.804 L
98.962 227.122 L
96.5 225.965 L
94.038 225.948 L
91.577 227.471 L
89.115 228.038 L
86.654 226.443 L
84.192 226.627 L
81.731 226.267 L
79.269 225.997 L
76.808 223.859 L
74.346 222.165 L
71.885 220.74 L
69.423 219.047 L
66.962 217.952 L
64.5 216.557 L
64.462 216.508 L
64.462 216.652 L
64.462 225.431 L
64.5 225.474 L
66.962 226.814 L
69.423 227.727 L
71.885 229.046 L
74.346 230.233 L
76.808 232.034 L
79.269 234.521 L
81.731 234.567 L
84.192 234.396 L
86.654 233.247 L
89.115 234.494 L
91.577 234.473 L
94.038 233.374 L
96.5 234.11 L
98.962 235.762 L
101.423 236.404 L
103.885 237.897 L
106.346 238.09 L
108.808 236.805 L
111.269 236.319 L
113.731 236.014 L
116.192 234.819 L
118.654 232.268 L
121.115 230.066 L
123.577 228.448 L
126.038 227.885 L
128.5 226.466 L
130.962 223.33 L
133.423 221.758 L
135.885 218.38 L
138.346 214.926 L
cp
f
GR
GS
[1.00046 0 0 1 0 0] CT
0.91 0.729 0.729 RC
1 LJ
0.5 LW
N
64.462 225.431 M
64.5 225.474 L
66.962 226.814 L
69.423 227.727 L
71.885 229.046 L
74.346 230.233 L
76.808 232.034 L
79.269 234.521 L
81.731 234.567 L
84.192 234.396 L
86.654 233.247 L
89.115 234.494 L
91.577 234.473 L
94.038 233.374 L
96.5 234.11 L
98.962 235.762 L
101.423 236.404 L
103.885 237.897 L
106.346 238.09 L
108.808 236.805 L
111.269 236.319 L
113.731 236.014 L
116.192 234.819 L
118.654 232.268 L
121.115 230.066 L
123.577 228.448 L
126.038 227.885 L
128.5 226.466 L
130.962 223.33 L
133.423 221.758 L
135.885 218.38 L
138.346 214.926 L
140.808 209.266 L
143.269 199.708 L
145.731 191.992 L
148.192 185.876 L
150.654 183.822 L
153.115 183.047 L
155.577 183.015 L
158.038 183.921 L
160.5 185.164 L
162.962 185.929 L
165.423 185.912 L
167.885 187.598 L
170.346 187.782 L
172.808 188.558 L
175.269 188.562 L
177.731 187.612 L
180.192 186.344 L
182.654 185.985 L
185.115 185.239 L
187.577 183.132 L
190.038 181.178 L
192.5 180.049 L
194.962 179.291 L
197.423 181.188 L
199.885 182.79 L
202.346 183.66 L
204.808 180.985 L
207.269 180.248 L
209.731 179.957 L
212.192 182.177 L
214.654 184.745 L
217.115 186.299 L
219.577 187.984 L
222.038 188.477 L
224.5 188.776 L
226.962 189.449 L
229.423 189.709 L
231.885 189.022 L
234.346 188.341 L
236.808 184.992 L
239.269 181.123 L
241.731 179.552 L
244.192 178.751 L
246.654 178.427 L
249.115 180.908 L
251.577 183.061 L
254.038 185.017 L
256.5 186.923 L
258.962 188.566 L
261.423 190.555 L
263.885 192.474 L
266.346 192.858 L
268.808 191.492 L
271.269 189.728 L
273.731 189.7 L
276.192 191.564 L
278.654 193.582 L
281.115 195.237 L
283.577 194.77 L
286.038 192.569 L
288.5 188.236 L
290.962 180.491 L
293.423 169.983 L
295.885 156.269 L
298.346 139.637 L
300.808 119.605 L
303.269 100.163 L
305.731 84.655 L
308.192 74.024 L
310.654 67.835 L
313.115 65.428 L
315.577 67.838 L
318.038 72.856 L
320.5 78.797 L
322.962 87.307 L
325.423 96.934 L
327.885 107.592 L
330.346 118.66 L
332.808 130.489 L
335.269 141.841 L
337.731 153.53 L
340.192 162.526 L
342.654 170.289 L
345.115 175.652 L
347.577 180.348 L
350.038 187.039 L
352.5 192.186 L
354.962 196.116 L
357.423 198.834 L
359.885 198.741 L
362.346 199.177 L
364.808 198.791 L
367.269 199.361 L
369.731 200.84 L
372.192 203.486 L
374.654 204.805 L
377.115 206.124 L
379.577 205.805 L
382.038 202.316 L
384.5 199.814 L
384.538 199.741 L
S
GR
GS
[1.00046 0 0 1 0 0] CT
0.91 0.729 0.729 RC
1 LJ
0.5 LW
N
64.462 216.508 M
64.5 216.557 L
66.962 217.952 L
69.423 219.047 L
71.885 220.74 L
74.346 222.165 L
76.808 223.859 L
79.269 225.997 L
81.731 226.267 L
84.192 226.627 L
86.654 226.443 L
89.115 228.038 L
91.577 227.471 L
94.038 225.948 L
96.5 225.965 L
98.962 227.122 L
101.423 227.804 L
103.885 229.412 L
106.346 229.061 L
108.808 227.631 L
111.269 227.152 L
113.731 227.344 L
116.192 227.049 L
118.654 224.835 L
121.115 222.669 L
123.577 221.101 L
126.038 220 L
128.5 218.379 L
130.962 214.73 L
133.423 212.498 L
135.885 208.901 L
138.346 205.513 L
140.808 199.998 L
143.269 191.012 L
145.731 183.692 L
148.192 177.873 L
150.654 175.433 L
153.115 174.666 L
155.577 174.863 L
158.038 176.336 L
160.5 177.554 L
162.962 178.385 L
165.423 178.171 L
167.885 179.725 L
170.346 180.003 L
172.808 180.63 L
175.269 179.892 L
177.731 178.521 L
180.192 176.998 L
182.654 176.236 L
185.115 175.696 L
187.577 173.849 L
190.038 172.612 L
192.5 171.799 L
194.962 171.748 L
197.423 173.739 L
199.885 175.419 L
202.346 175.905 L
204.808 172.911 L
207.269 171.634 L
209.731 171.206 L
212.192 173.402 L
214.654 176.389 L
217.115 178.277 L
219.577 179.858 L
222.038 180.278 L
224.5 180.81 L
226.962 181.384 L
229.423 181.211 L
231.885 180.377 L
234.346 179.702 L
236.808 176.328 L
239.269 172.457 L
241.731 171.236 L
244.192 170.178 L
246.654 169.658 L
249.115 172.238 L
251.577 174.916 L
254.038 177.766 L
256.5 179.852 L
258.962 180.65 L
261.423 181.739 L
263.885 183.073 L
266.346 183.926 L
268.808 183.06 L
271.269 181.467 L
273.731 181.594 L
276.192 182.903 L
278.654 184.237 L
281.115 185.545 L
283.577 185.207 L
286.038 183.741 L
288.5 180.185 L
290.962 172.936 L
293.423 162.581 L
295.885 148.683 L
298.346 131.493 L
300.808 111.03 L
303.269 91.83 L
305.731 76.707 L
308.192 66.037 L
310.654 59.075 L
313.115 55.982 L
315.577 57.994 L
318.038 62.582 L
320.5 68.672 L
322.962 77.974 L
325.423 88.232 L
327.885 99.352 L
330.346 110.942 L
332.808 123.024 L
335.269 134.804 L
337.731 146.144 L
340.192 154.495 L
342.654 162.387 L
345.115 167.903 L
347.577 172.555 L
350.038 179.162 L
352.5 183.989 L
354.962 187.255 L
357.423 189.813 L
359.885 189.898 L
362.346 190.175 L
364.808 189.627 L
367.269 189.866 L
369.731 191.386 L
372.192 193.816 L
374.654 195.265 L
377.115 196.668 L
379.577 196.275 L
382.038 193.1 L
384.5 191.229 L
384.538 191.158 L
S
GR
GS
[1.00046 0 0 1 0 0] CT
0.8 0.4 0.4 RC
1 LJ
2 LW
N
64.462 220.969 M
64.5 221.015 L
66.962 222.383 L
69.423 223.387 L
71.885 224.893 L
74.346 226.199 L
76.808 227.946 L
79.269 230.259 L
81.731 230.417 L
84.192 230.512 L
86.654 229.845 L
89.115 231.266 L
91.577 230.972 L
94.038 229.661 L
96.5 230.038 L
98.962 231.442 L
101.423 232.104 L
103.885 233.654 L
106.346 233.575 L
108.808 232.218 L
111.269 231.736 L
113.731 231.679 L
116.192 230.934 L
118.654 228.551 L
121.115 226.367 L
123.577 224.775 L
126.038 223.943 L
128.5 222.422 L
130.962 219.03 L
133.423 217.128 L
135.885 213.641 L
138.346 210.219 L
140.808 204.632 L
143.269 195.36 L
145.731 187.842 L
148.192 181.874 L
150.654 179.628 L
153.115 178.857 L
155.577 178.939 L
158.038 180.129 L
160.5 181.359 L
162.962 182.157 L
165.423 182.042 L
167.885 183.662 L
170.346 183.893 L
172.808 184.594 L
175.269 184.227 L
177.731 183.066 L
180.192 181.671 L
182.654 181.111 L
185.115 180.468 L
187.577 178.491 L
190.038 176.895 L
192.5 175.924 L
194.962 175.52 L
197.423 177.463 L
199.885 179.104 L
202.346 179.782 L
204.808 176.948 L
207.269 175.941 L
209.731 175.582 L
212.192 177.789 L
214.654 180.567 L
217.115 182.288 L
219.577 183.921 L
222.038 184.377 L
224.5 184.793 L
226.962 185.417 L
229.423 185.46 L
231.885 184.699 L
234.346 184.021 L
236.808 180.66 L
239.269 176.79 L
241.731 175.394 L
244.192 174.464 L
246.654 174.043 L
249.115 176.573 L
251.577 178.988 L
254.038 181.392 L
256.5 183.388 L
258.962 184.608 L
261.423 186.147 L
263.885 187.773 L
266.346 188.392 L
268.808 187.276 L
271.269 185.597 L
273.731 185.647 L
276.192 187.234 L
278.654 188.909 L
281.115 190.391 L
283.577 189.989 L
286.038 188.155 L
288.5 184.211 L
290.962 176.714 L
293.423 166.282 L
295.885 152.476 L
298.346 135.565 L
300.808 115.317 L
303.269 95.997 L
305.731 80.681 L
308.192 70.03 L
310.654 63.455 L
313.115 60.705 L
315.577 62.916 L
318.038 67.719 L
320.5 73.735 L
322.962 82.641 L
325.423 92.583 L
327.885 103.472 L
330.346 114.801 L
332.808 126.756 L
335.269 138.323 L
337.731 149.837 L
340.192 158.511 L
342.654 166.338 L
345.115 171.777 L
347.577 176.452 L
350.038 183.101 L
352.5 188.087 L
354.962 191.685 L
357.423 194.324 L
359.885 194.32 L
362.346 194.676 L
364.808 194.209 L
367.269 194.614 L
369.731 196.113 L
372.192 198.651 L
374.654 200.035 L
377.115 201.396 L
379.577 201.039 L
382.038 197.708 L
384.5 195.522 L
384.538 195.45 L
S
GR
GS
[1.00046 0 0 1 0 0] CT
0.959 0.918 0.918 RC
N
66.962 208.786 M
64.5 204.896 L
64.462 204.83 L
64.462 204.944 L
64.462 212.535 L
64.5 212.607 L
66.962 217.312 L
69.423 221.014 L
71.885 225.38 L
74.346 231.027 L
76.808 234.484 L
79.269 236.046 L
81.731 236.902 L
84.192 236.441 L
86.654 236.303 L
89.115 235.122 L
91.577 234.086 L
94.038 231.396 L
96.5 230.821 L
98.962 232.047 L
101.423 233.041 L
103.885 233.736 L
106.346 232.573 L
108.808 229.896 L
111.269 228.993 L
113.731 228.212 L
116.192 227.645 L
118.654 225.466 L
121.115 223.526 L
123.577 222.007 L
126.038 221.195 L
128.5 219.081 L
130.962 217.629 L
133.423 215.744 L
135.885 214.05 L
138.346 210.698 L
140.808 203.799 L
143.269 196.919 L
145.731 189.984 L
148.192 184.756 L
150.654 182.502 L
153.115 181.539 L
155.577 180.883 L
158.038 180.277 L
160.5 181.67 L
162.962 182.519 L
165.423 184.148 L
167.885 186.061 L
170.346 186.672 L
172.808 188.669 L
175.269 191.011 L
177.731 190.716 L
180.192 190.251 L
182.654 189.191 L
185.115 189.659 L
187.577 188.637 L
190.038 186.87 L
192.5 185.882 L
194.962 185.484 L
197.423 184.533 L
199.885 184.179 L
202.346 184.248 L
204.808 186.208 L
207.269 187.699 L
209.731 189.466 L
212.192 189.836 L
214.654 189.71 L
217.115 190.027 L
219.577 190.128 L
222.038 190.692 L
224.5 191.63 L
226.962 191.126 L
229.423 190.627 L
231.885 190.867 L
234.346 190.905 L
236.808 191.613 L
239.269 190.521 L
241.731 189.678 L
244.192 190.522 L
246.654 191.622 L
249.115 192.787 L
251.577 192.995 L
254.038 191.56 L
256.5 191.58 L
258.962 190.719 L
261.423 191.903 L
263.885 194 L
266.346 196.21 L
268.808 197.408 L
271.269 199.016 L
273.731 202.43 L
276.192 204.084 L
278.654 204.246 L
281.115 203.611 L
283.577 201.247 L
286.038 198.645 L
288.5 193.019 L
290.962 185.366 L
293.423 177.116 L
295.885 164.116 L
298.346 147.851 L
300.808 128.768 L
303.269 108.583 L
305.731 90.905 L
308.192 76.23 L
310.654 67.406 L
313.115 63.389 L
315.577 63.84 L
318.038 70.415 L
320.5 80.645 L
322.962 91.395 L
325.423 104.733 L
327.885 119.742 L
330.346 133.118 L
332.808 146.213 L
335.269 159.921 L
337.731 171.513 L
340.192 180.561 L
342.654 187.606 L
345.115 192.581 L
347.577 196.803 L
350.038 200.15 L
352.5 204.614 L
354.962 208.169 L
357.423 210.687 L
359.885 213.142 L
362.346 213.58 L
364.808 215.76 L
367.269 215.883 L
369.731 213.32 L
372.192 209.198 L
374.654 208.189 L
377.115 208.307 L
379.577 206.568 L
382.038 204.647 L
384.5 202.346 L
384.538 202.303 L
384.538 195.238 L
384.538 195.132 L
384.5 195.169 L
382.038 197.178 L
379.577 198.625 L
377.115 199.607 L
374.654 199.229 L
372.192 200.06 L
369.731 203.837 L
367.269 206.158 L
364.808 206.314 L
362.346 204.684 L
359.885 204.645 L
357.423 202.803 L
354.962 199.956 L
352.5 195.692 L
350.038 190.989 L
347.577 187.626 L
345.115 182.774 L
342.654 177.251 L
340.192 169.718 L
337.731 160.555 L
335.269 148.84 L
332.808 134.964 L
330.346 122.218 L
327.885 108.569 L
325.423 93.304 L
322.962 80.219 L
320.5 69.763 L
318.038 60.666 L
315.577 54.896 L
313.115 54.865 L
310.654 58.884 L
308.192 67.344 L
305.731 81.671 L
303.269 99.622 L
300.808 120.359 L
298.346 139.678 L
295.885 155.943 L
293.423 169.165 L
290.962 177.576 L
288.5 184.916 L
286.038 190.055 L
283.577 193.047 L
281.115 195.202 L
278.654 195.863 L
276.192 195.811 L
273.731 194.242 L
271.269 190.311 L
268.808 188.688 L
266.346 187.764 L
263.885 185.587 L
261.423 183.834 L
258.962 182.655 L
256.5 183.338 L
254.038 183.204 L
251.577 184.225 L
249.115 183.757 L
246.654 181.958 L
244.192 180.505 L
241.731 179.709 L
239.269 180.643 L
236.808 182.141 L
234.346 181.701 L
231.885 181.924 L
229.423 182.149 L
226.962 182.575 L
224.5 183.26 L
222.038 182.13 L
219.577 181.139 L
217.115 180.537 L
214.654 180.025 L
212.192 180.198 L
209.731 180.006 L
207.269 178.226 L
204.808 176.902 L
202.346 174.805 L
199.885 174.844 L
197.423 174.971 L
194.962 176.032 L
192.5 176.959 L
190.038 178.266 L
187.577 180.446 L
185.115 181.618 L
182.654 181.552 L
180.192 182.374 L
177.731 182.502 L
175.269 182.643 L
172.808 180.743 L
170.346 178.844 L
167.885 177.949 L
165.423 176.223 L
162.962 174.76 L
160.5 173.795 L
158.038 172.416 L
155.577 173.318 L
153.115 174.411 L
150.654 174.941 L
148.192 176.676 L
145.731 181.518 L
143.269 188.211 L
140.808 195.13 L
138.346 202.324 L
135.885 205.997 L
133.423 208.285 L
130.962 210.483 L
128.5 211.77 L
126.038 213.347 L
123.577 214.215 L
121.115 215.697 L
118.654 217.917 L
116.192 220.237 L
113.731 221.296 L
111.269 222.335 L
108.808 223.504 L
106.346 226.303 L
103.885 226.875 L
101.423 226.034 L
98.962 224.805 L
96.5 223.452 L
94.038 223.63 L
91.577 225.897 L
89.115 227.421 L
86.654 228.692 L
84.192 228.351 L
81.731 229.08 L
79.269 228.613 L
76.808 227.319 L
74.346 223.453 L
71.885 217.417 L
69.423 212.718 L
cp
f
GR
GS
[1.00046 0 0 1 0 0] CT
0.82 0.639 0.639 RC
1 LJ
0.5 LW
N
64.462 212.535 M
64.5 212.607 L
66.962 217.312 L
69.423 221.014 L
71.885 225.38 L
74.346 231.027 L
76.808 234.484 L
79.269 236.046 L
81.731 236.902 L
84.192 236.441 L
86.654 236.303 L
89.115 235.122 L
91.577 234.086 L
94.038 231.396 L
96.5 230.821 L
98.962 232.047 L
101.423 233.041 L
103.885 233.736 L
106.346 232.573 L
108.808 229.896 L
111.269 228.993 L
113.731 228.212 L
116.192 227.645 L
118.654 225.466 L
121.115 223.526 L
123.577 222.007 L
126.038 221.195 L
128.5 219.081 L
130.962 217.629 L
133.423 215.744 L
135.885 214.05 L
138.346 210.698 L
140.808 203.799 L
143.269 196.919 L
145.731 189.984 L
148.192 184.756 L
150.654 182.502 L
153.115 181.539 L
155.577 180.883 L
158.038 180.277 L
160.5 181.67 L
162.962 182.519 L
165.423 184.148 L
167.885 186.061 L
170.346 186.672 L
172.808 188.669 L
175.269 191.011 L
177.731 190.716 L
180.192 190.251 L
182.654 189.191 L
185.115 189.659 L
187.577 188.637 L
190.038 186.87 L
192.5 185.882 L
194.962 185.484 L
197.423 184.533 L
199.885 184.179 L
202.346 184.248 L
204.808 186.208 L
207.269 187.699 L
209.731 189.466 L
212.192 189.836 L
214.654 189.71 L
217.115 190.027 L
219.577 190.128 L
222.038 190.692 L
224.5 191.63 L
226.962 191.126 L
229.423 190.627 L
231.885 190.867 L
234.346 190.905 L
236.808 191.613 L
239.269 190.521 L
241.731 189.678 L
244.192 190.522 L
246.654 191.622 L
249.115 192.787 L
251.577 192.995 L
254.038 191.56 L
256.5 191.58 L
258.962 190.719 L
261.423 191.903 L
263.885 194 L
266.346 196.21 L
268.808 197.408 L
271.269 199.016 L
273.731 202.43 L
276.192 204.084 L
278.654 204.246 L
281.115 203.611 L
283.577 201.247 L
286.038 198.645 L
288.5 193.019 L
290.962 185.366 L
293.423 177.116 L
295.885 164.116 L
298.346 147.851 L
300.808 128.768 L
303.269 108.583 L
305.731 90.905 L
308.192 76.23 L
310.654 67.406 L
313.115 63.389 L
315.577 63.84 L
318.038 70.415 L
320.5 80.645 L
322.962 91.395 L
325.423 104.733 L
327.885 119.742 L
330.346 133.118 L
332.808 146.213 L
335.269 159.921 L
337.731 171.513 L
340.192 180.561 L
342.654 187.606 L
345.115 192.581 L
347.577 196.803 L
350.038 200.15 L
352.5 204.614 L
354.962 208.169 L
357.423 210.687 L
359.885 213.142 L
362.346 213.58 L
364.808 215.76 L
367.269 215.883 L
369.731 213.32 L
372.192 209.198 L
374.654 208.189 L
377.115 208.307 L
379.577 206.568 L
382.038 204.647 L
384.5 202.346 L
384.538 202.303 L
S
GR
GS
[1.00046 0 0 1 0 0] CT
0.82 0.639 0.639 RC
1 LJ
0.5 LW
N
64.462 204.83 M
64.5 204.896 L
66.962 208.786 L
69.423 212.718 L
71.885 217.417 L
74.346 223.453 L
76.808 227.319 L
79.269 228.613 L
81.731 229.08 L
84.192 228.351 L
86.654 228.692 L
89.115 227.421 L
91.577 225.897 L
94.038 223.63 L
96.5 223.452 L
98.962 224.805 L
101.423 226.034 L
103.885 226.875 L
106.346 226.303 L
108.808 223.504 L
111.269 222.335 L
113.731 221.296 L
116.192 220.237 L
118.654 217.917 L
121.115 215.697 L
123.577 214.215 L
126.038 213.347 L
128.5 211.77 L
130.962 210.483 L
133.423 208.285 L
135.885 205.997 L
138.346 202.324 L
140.808 195.13 L
143.269 188.211 L
145.731 181.518 L
148.192 176.676 L
150.654 174.941 L
153.115 174.411 L
155.577 173.318 L
158.038 172.416 L
160.5 173.795 L
162.962 174.76 L
165.423 176.223 L
167.885 177.949 L
170.346 178.844 L
172.808 180.743 L
175.269 182.643 L
177.731 182.502 L
180.192 182.374 L
182.654 181.552 L
185.115 181.618 L
187.577 180.446 L
190.038 178.266 L
192.5 176.959 L
194.962 176.032 L
197.423 174.971 L
199.885 174.844 L
202.346 174.805 L
204.808 176.902 L
207.269 178.226 L
209.731 180.006 L
212.192 180.198 L
214.654 180.025 L
217.115 180.537 L
219.577 181.139 L
222.038 182.13 L
224.5 183.26 L
226.962 182.575 L
229.423 182.149 L
231.885 181.924 L
234.346 181.701 L
236.808 182.141 L
239.269 180.643 L
241.731 179.709 L
244.192 180.505 L
246.654 181.958 L
249.115 183.757 L
251.577 184.225 L
254.038 183.204 L
256.5 183.338 L
258.962 182.655 L
261.423 183.834 L
263.885 185.587 L
266.346 187.764 L
268.808 188.688 L
271.269 190.311 L
273.731 194.242 L
276.192 195.811 L
278.654 195.863 L
281.115 195.202 L
283.577 193.047 L
286.038 190.055 L
288.5 184.916 L
290.962 177.576 L
293.423 169.165 L
295.885 155.943 L
298.346 139.678 L
300.808 120.359 L
303.269 99.622 L
305.731 81.671 L
308.192 67.344 L
310.654 58.884 L
313.115 54.865 L
315.577 54.896 L
318.038 60.666 L
320.5 69.763 L
322.962 80.219 L
325.423 93.304 L
327.885 108.569 L
330.346 122.218 L
332.808 134.964 L
335.269 148.84 L
337.731 160.555 L
340.192 169.718 L
342.654 177.251 L
345.115 182.774 L
347.577 187.626 L
350.038 190.989 L
352.5 195.692 L
354.962 199.956 L
357.423 202.803 L
359.885 204.645 L
362.346 204.684 L
364.808 206.314 L
367.269 206.158 L
369.731 203.837 L
372.192 200.06 L
374.654 199.229 L
377.115 199.607 L
379.577 198.625 L
382.038 197.178 L
384.5 195.169 L
384.538 195.132 L
S
GR
GS
[1.00046 0 0 1 0 0] CT
0.6 0.2 0.2 RC
1 LJ
2 LW
N
64.462 208.682 M
64.5 208.751 L
66.962 213.049 L
69.423 216.866 L
71.885 221.398 L
74.346 227.24 L
76.808 230.902 L
79.269 232.33 L
81.731 232.991 L
84.192 232.396 L
86.654 232.498 L
89.115 231.272 L
91.577 229.992 L
94.038 227.513 L
96.5 227.137 L
98.962 228.426 L
101.423 229.538 L
103.885 230.306 L
106.346 229.438 L
108.808 226.7 L
111.269 225.665 L
113.731 224.754 L
116.192 223.941 L
118.654 221.692 L
121.115 219.611 L
123.577 218.111 L
126.038 217.271 L
128.5 215.426 L
130.962 214.056 L
133.423 212.014 L
135.885 210.024 L
138.346 206.511 L
140.808 199.464 L
143.269 192.565 L
145.731 185.751 L
148.192 180.716 L
150.654 178.722 L
153.115 177.975 L
155.577 177.1 L
158.038 176.346 L
160.5 177.733 L
162.962 178.64 L
165.423 180.186 L
167.885 182.005 L
170.346 182.758 L
172.808 184.706 L
175.269 186.827 L
177.731 186.609 L
180.192 186.313 L
182.654 185.371 L
185.115 185.639 L
187.577 184.541 L
190.038 182.568 L
192.5 181.421 L
194.962 180.758 L
197.423 179.752 L
199.885 179.512 L
202.346 179.527 L
204.808 181.555 L
207.269 182.962 L
209.731 184.736 L
212.192 185.017 L
214.654 184.868 L
217.115 185.282 L
219.577 185.633 L
222.038 186.411 L
224.5 187.445 L
226.962 186.851 L
229.423 186.388 L
231.885 186.395 L
234.346 186.303 L
236.808 186.877 L
239.269 185.582 L
241.731 184.693 L
244.192 185.513 L
246.654 186.79 L
249.115 188.272 L
251.577 188.61 L
254.038 187.382 L
256.5 187.459 L
258.962 186.687 L
261.423 187.869 L
263.885 189.794 L
266.346 191.987 L
268.808 193.048 L
271.269 194.663 L
273.731 198.336 L
276.192 199.947 L
278.654 200.054 L
281.115 199.407 L
283.577 197.148 L
286.038 194.35 L
288.5 188.968 L
290.962 181.471 L
293.423 173.141 L
295.885 160.029 L
298.346 143.764 L
300.808 124.563 L
303.269 104.103 L
305.731 86.288 L
308.192 71.787 L
310.654 63.145 L
313.115 59.127 L
315.577 59.368 L
318.038 65.54 L
320.5 75.204 L
322.962 85.807 L
325.423 99.018 L
327.885 114.156 L
330.346 127.668 L
332.808 140.589 L
335.269 154.381 L
337.731 166.034 L
340.192 175.139 L
342.654 182.429 L
345.115 187.678 L
347.577 192.214 L
350.038 195.569 L
352.5 200.153 L
354.962 204.063 L
357.423 206.745 L
359.885 208.893 L
362.346 209.132 L
364.808 211.037 L
367.269 211.021 L
369.731 208.578 L
372.192 204.629 L
374.654 203.709 L
377.115 203.957 L
379.577 202.596 L
382.038 200.913 L
384.5 198.757 L
384.538 198.717 L
S
GR
%%Trailer
%%Pages: 1
%%EOF
