%!PS-Adobe-3.0 EPSF-3.0
%%Creator: (MATLAB, The Mathworks, Inc. Version 9.10.0.1602886 \(R2021a\). Operating System: Mac OS X)
%%Title: /Users/kosciessa/Desktop/tardis/LNDG/stateswitch/stsw_eeg_task/tfr/figures/b01_alphaTraces_oa.eps
%%CreationDate: 2022-02-22T16:23:37
%%Pages: (atend)
%%BoundingBox:     2     0   388   266
%%LanguageLevel: 3
%%EndComments
%%BeginProlog
%%BeginResource: procset (Apache XML Graphics Std ProcSet) 1.2 0
%%Version: 1.2 0
%%Copyright: (Copyright 2001-2003,2010 The Apache Software Foundation. License terms: http://www.apache.org/licenses/LICENSE-2.0)
/bd{bind def}bind def
/ld{load def}bd
/GR/grestore ld
/GS/gsave ld
/RM/rmoveto ld
/C/curveto ld
/t/show ld
/L/lineto ld
/ML/setmiterlimit ld
/CT/concat ld
/f/fill ld
/N/newpath ld
/S/stroke ld
/CC/setcmykcolor ld
/A/ashow ld
/cp/closepath ld
/RC/setrgbcolor ld
/LJ/setlinejoin ld
/GC/setgray ld
/LW/setlinewidth ld
/M/moveto ld
/re {4 2 roll M
1 index 0 rlineto
0 exch rlineto
neg 0 rlineto
cp } bd
/_ctm matrix def
/_tm matrix def
/BT { _ctm currentmatrix pop matrix _tm copy pop 0 0 moveto } bd
/ET { _ctm setmatrix } bd
/iTm { _ctm setmatrix _tm concat } bd
/Tm { _tm astore pop iTm 0 0 moveto } bd
/ux 0.0 def
/uy 0.0 def
/F {
  /Tp exch def
  /Tf exch def
  Tf findfont Tp scalefont setfont
  /cf Tf def  /cs Tp def
} bd
/ULS {currentpoint /uy exch def /ux exch def} bd
/ULE {
  /Tcx currentpoint pop def
  gsave
  newpath
  cf findfont cs scalefont dup
  /FontMatrix get 0 get /Ts exch def /FontInfo get dup
  /UnderlinePosition get Ts mul /To exch def
  /UnderlineThickness get Ts mul /Tt exch def
  ux uy To add moveto  Tcx uy To add lineto
  Tt setlinewidth stroke
  grestore
} bd
/OLE {
  /Tcx currentpoint pop def
  gsave
  newpath
  cf findfont cs scalefont dup
  /FontMatrix get 0 get /Ts exch def /FontInfo get dup
  /UnderlinePosition get Ts mul /To exch def
  /UnderlineThickness get Ts mul /Tt exch def
  ux uy To add cs add moveto Tcx uy To add cs add lineto
  Tt setlinewidth stroke
  grestore
} bd
/SOE {
  /Tcx currentpoint pop def
  gsave
  newpath
  cf findfont cs scalefont dup
  /FontMatrix get 0 get /Ts exch def /FontInfo get dup
  /UnderlinePosition get Ts mul /To exch def
  /UnderlineThickness get Ts mul /Tt exch def
  ux uy To add cs 10 mul 26 idiv add moveto Tcx uy To add cs 10 mul 26 idiv add lineto
  Tt setlinewidth stroke
  grestore
} bd
/QT {
/Y22 exch store
/X22 exch store
/Y21 exch store
/X21 exch store
currentpoint
/Y21 load 2 mul add 3 div exch
/X21 load 2 mul add 3 div exch
/X21 load 2 mul /X22 load add 3 div
/Y21 load 2 mul /Y22 load add 3 div
/X22 load /Y22 load curveto
} bd
/SSPD {
dup length /d exch dict def
{
/v exch def
/k exch def
currentpagedevice k known {
/cpdv currentpagedevice k get def
v cpdv ne {
/upd false def
/nullv v type /nulltype eq def
/nullcpdv cpdv type /nulltype eq def
nullv nullcpdv or
{
/upd true def
} {
/sametype v type cpdv type eq def
sametype {
v type /arraytype eq {
/vlen v length def
/cpdvlen cpdv length def
vlen cpdvlen eq {
0 1 vlen 1 sub {
/i exch def
/obj v i get def
/cpdobj cpdv i get def
obj cpdobj ne {
/upd true def
exit
} if
} for
} {
/upd true def
} ifelse
} {
v type /dicttype eq {
v {
/dv exch def
/dk exch def
/cpddv cpdv dk get def
dv cpddv ne {
/upd true def
exit
} if
} forall
} {
/upd true def
} ifelse
} ifelse
} if
} ifelse
upd true eq {
d k v put
} if
} if
} if
} forall
d length 0 gt {
d setpagedevice
} if
} bd
/RE { % /NewFontName [NewEncodingArray] /FontName RE -
  findfont dup length dict begin
  {
    1 index /FID ne
    {def} {pop pop} ifelse
  } forall
  /Encoding exch def
  /FontName 1 index def
  currentdict definefont pop
  end
} bind def
%%EndResource
%%BeginResource: procset (Apache XML Graphics EPS ProcSet) 1.0 0
%%Version: 1.0 0
%%Copyright: (Copyright 2002-2003 The Apache Software Foundation. License terms: http://www.apache.org/licenses/LICENSE-2.0)
/BeginEPSF { %def
/b4_Inc_state save def         % Save state for cleanup
/dict_count countdictstack def % Count objects on dict stack
/op_count count 1 sub def      % Count objects on operand stack
userdict begin                 % Push userdict on dict stack
/showpage { } def              % Redefine showpage, { } = null proc
0 setgray 0 setlinecap         % Prepare graphics state
1 setlinewidth 0 setlinejoin
10 setmiterlimit [ ] 0 setdash newpath
/languagelevel where           % If level not equal to 1 then
{pop languagelevel             % set strokeadjust and
1 ne                           % overprint to their defaults.
{false setstrokeadjust false setoverprint
} if
} if
} bd
/EndEPSF { %def
count op_count sub {pop} repeat            % Clean up stacks
countdictstack dict_count sub {end} repeat
b4_Inc_state restore
} bd
%%EndResource
%FOPBeginFontDict
%%IncludeResource: font Courier-Oblique
%%IncludeResource: font Courier-BoldOblique
%%IncludeResource: font Courier-Bold
%%IncludeResource: font ZapfDingbats
%%IncludeResource: font Symbol
%%IncludeResource: font Helvetica
%%IncludeResource: font Helvetica-Oblique
%%IncludeResource: font Helvetica-Bold
%%IncludeResource: font Helvetica-BoldOblique
%%IncludeResource: font Times-Roman
%%IncludeResource: font Times-Italic
%%IncludeResource: font Times-Bold
%%IncludeResource: font Times-BoldItalic
%%IncludeResource: font Courier
%FOPEndFontDict
%%BeginResource: encoding WinAnsiEncoding
/WinAnsiEncoding [
/.notdef /.notdef /.notdef /.notdef /.notdef
/.notdef /.notdef /.notdef /.notdef /.notdef
/.notdef /.notdef /.notdef /.notdef /.notdef
/.notdef /.notdef /.notdef /.notdef /.notdef
/.notdef /.notdef /.notdef /.notdef /.notdef
/.notdef /.notdef /.notdef /.notdef /.notdef
/.notdef /.notdef /space /exclam /quotedbl
/numbersign /dollar /percent /ampersand /quotesingle
/parenleft /parenright /asterisk /plus /comma
/hyphen /period /slash /zero /one
/two /three /four /five /six
/seven /eight /nine /colon /semicolon
/less /equal /greater /question /at
/A /B /C /D /E
/F /G /H /I /J
/K /L /M /N /O
/P /Q /R /S /T
/U /V /W /X /Y
/Z /bracketleft /backslash /bracketright /asciicircum
/underscore /quoteleft /a /b /c
/d /e /f /g /h
/i /j /k /l /m
/n /o /p /q /r
/s /t /u /v /w
/x /y /z /braceleft /bar
/braceright /asciitilde /bullet /Euro /bullet
/quotesinglbase /florin /quotedblbase /ellipsis /dagger
/daggerdbl /circumflex /perthousand /Scaron /guilsinglleft
/OE /bullet /Zcaron /bullet /bullet
/quoteleft /quoteright /quotedblleft /quotedblright /bullet
/endash /emdash /asciitilde /trademark /scaron
/guilsinglright /oe /bullet /zcaron /Ydieresis
/space /exclamdown /cent /sterling /currency
/yen /brokenbar /section /dieresis /copyright
/ordfeminine /guillemotleft /logicalnot /sfthyphen /registered
/macron /degree /plusminus /twosuperior /threesuperior
/acute /mu /paragraph /middot /cedilla
/onesuperior /ordmasculine /guillemotright /onequarter /onehalf
/threequarters /questiondown /Agrave /Aacute /Acircumflex
/Atilde /Adieresis /Aring /AE /Ccedilla
/Egrave /Eacute /Ecircumflex /Edieresis /Igrave
/Iacute /Icircumflex /Idieresis /Eth /Ntilde
/Ograve /Oacute /Ocircumflex /Otilde /Odieresis
/multiply /Oslash /Ugrave /Uacute /Ucircumflex
/Udieresis /Yacute /Thorn /germandbls /agrave
/aacute /acircumflex /atilde /adieresis /aring
/ae /ccedilla /egrave /eacute /ecircumflex
/edieresis /igrave /iacute /icircumflex /idieresis
/eth /ntilde /ograve /oacute /ocircumflex
/otilde /odieresis /divide /oslash /ugrave
/uacute /ucircumflex /udieresis /yacute /thorn
/ydieresis
] def
%%EndResource
%FOPBeginFontReencode
/Courier-Oblique findfont
dup length dict begin
  {1 index /FID ne {def} {pop pop} ifelse} forall
  /Encoding WinAnsiEncoding def
  currentdict
end
/Courier-Oblique exch definefont pop
/Courier-BoldOblique findfont
dup length dict begin
  {1 index /FID ne {def} {pop pop} ifelse} forall
  /Encoding WinAnsiEncoding def
  currentdict
end
/Courier-BoldOblique exch definefont pop
/Courier-Bold findfont
dup length dict begin
  {1 index /FID ne {def} {pop pop} ifelse} forall
  /Encoding WinAnsiEncoding def
  currentdict
end
/Courier-Bold exch definefont pop
/Helvetica findfont
dup length dict begin
  {1 index /FID ne {def} {pop pop} ifelse} forall
  /Encoding WinAnsiEncoding def
  currentdict
end
/Helvetica exch definefont pop
/Helvetica-Oblique findfont
dup length dict begin
  {1 index /FID ne {def} {pop pop} ifelse} forall
  /Encoding WinAnsiEncoding def
  currentdict
end
/Helvetica-Oblique exch definefont pop
/Helvetica-Bold findfont
dup length dict begin
  {1 index /FID ne {def} {pop pop} ifelse} forall
  /Encoding WinAnsiEncoding def
  currentdict
end
/Helvetica-Bold exch definefont pop
/Helvetica-BoldOblique findfont
dup length dict begin
  {1 index /FID ne {def} {pop pop} ifelse} forall
  /Encoding WinAnsiEncoding def
  currentdict
end
/Helvetica-BoldOblique exch definefont pop
/Times-Roman findfont
dup length dict begin
  {1 index /FID ne {def} {pop pop} ifelse} forall
  /Encoding WinAnsiEncoding def
  currentdict
end
/Times-Roman exch definefont pop
/Times-Italic findfont
dup length dict begin
  {1 index /FID ne {def} {pop pop} ifelse} forall
  /Encoding WinAnsiEncoding def
  currentdict
end
/Times-Italic exch definefont pop
/Times-Bold findfont
dup length dict begin
  {1 index /FID ne {def} {pop pop} ifelse} forall
  /Encoding WinAnsiEncoding def
  currentdict
end
/Times-Bold exch definefont pop
/Times-BoldItalic findfont
dup length dict begin
  {1 index /FID ne {def} {pop pop} ifelse} forall
  /Encoding WinAnsiEncoding def
  currentdict
end
/Times-BoldItalic exch definefont pop
/Courier findfont
dup length dict begin
  {1 index /FID ne {def} {pop pop} ifelse} forall
  /Encoding WinAnsiEncoding def
  currentdict
end
/Courier exch definefont pop
%FOPEndFontReencode
%%EndProlog
%%Page: 1 1
%%PageBoundingBox: 0 0 425 283
%%BeginPageSetup
[1 0 0 -1 0 283] CT
%%EndPageSetup
GS
[1.00046 0 0 1 0 0] CT
1 GC
N
0 0 425 283 re
f
GR
GS
[1.00046 0 0 1 0 0] CT
1 GC
N
0 0 425 283 re
f
GR
GS
[1.00046 0 0 1 0 0] CT
1 GC
N
57.5 248.5 M
384.5 248.5 L
384.5 21 L
57.5 21 L
cp
f
GR
GS
[1.00046 0 0 1 0 0] CT
0.149 GC
2 setlinecap
1 LJ
0.5 LW
N
57.5 248.5 M
384.5 248.5 L
S
GR
GS
[1.00046 0 0 1 0 0] CT
0.149 GC
2 setlinecap
1 LJ
0.5 LW
N
82.654 248.5 M
82.654 245.234 L
S
GR
GS
[1.00046 0 0 1 0 0] CT
0.149 GC
2 setlinecap
1 LJ
0.5 LW
N
132.962 248.5 M
132.962 245.234 L
S
GR
GS
[1.00046 0 0 1 0 0] CT
0.149 GC
2 setlinecap
1 LJ
0.5 LW
N
183.269 248.5 M
183.269 245.234 L
S
GR
GS
[1.00046 0 0 1 0 0] CT
0.149 GC
2 setlinecap
1 LJ
0.5 LW
N
233.577 248.5 M
233.577 245.234 L
S
GR
GS
[1.00046 0 0 1 0 0] CT
0.149 GC
2 setlinecap
1 LJ
0.5 LW
N
283.885 248.5 M
283.885 245.234 L
S
GR
GS
[1.00046 0 0 1 0 0] CT
0.149 GC
2 setlinecap
1 LJ
0.5 LW
N
334.192 248.5 M
334.192 245.234 L
S
GR
GS
[1.00046 0 0 1 0 0] CT
0.149 GC
2 setlinecap
1 LJ
0.5 LW
N
384.5 248.5 M
384.5 245.234 L
S
GR
GS
[1.00046 0 0 1 82.69213 252.8999] CT
0.149 GC
/Helvetica 12 F
GS
[1 0 0 1 0 0] CT
-6 12 moveto 
1 -1 scale
(-1) t 
GR
GR
GS
[1.00046 0 0 1 133.02311 252.8999] CT
0.149 GC
/Helvetica 12 F
GS
[1 0 0 1 0 0] CT
-3.5 12 moveto 
1 -1 scale
(0) t 
GR
GR
GS
[1.00046 0 0 1 183.35411 252.8999] CT
0.149 GC
/Helvetica 12 F
GS
[1 0 0 1 0 0] CT
-3.5 12 moveto 
1 -1 scale
(1) t 
GR
GR
GS
[1.00046 0 0 1 233.6851 252.8999] CT
0.149 GC
/Helvetica 12 F
GS
[1 0 0 1 0 0] CT
-3.5 12 moveto 
1 -1 scale
(2) t 
GR
GR
GS
[1.00046 0 0 1 284.01609 252.8999] CT
0.149 GC
/Helvetica 12 F
GS
[1 0 0 1 0 0] CT
-3.5 12 moveto 
1 -1 scale
(3) t 
GR
GR
GS
[1.00046 0 0 1 334.3471 252.8999] CT
0.149 GC
/Helvetica 12 F
GS
[1 0 0 1 0 0] CT
-3.5 12 moveto 
1 -1 scale
(4) t 
GR
GR
GS
[1.00046 0 0 1 384.67808 252.8999] CT
0.149 GC
/Helvetica 12 F
GS
[1 0 0 1 0 0] CT
-3.5 12 moveto 
1 -1 scale
(5) t 
GR
GR
GS
[1.00046 0 0 1 221.10251 268.5] CT
0.149 GC
/Helvetica 12 F
GS
[1 0 0 1 0 0] CT
-21 12 moveto 
1 -1 scale
(Time \(s\)) t 
GR
GR
GS
[1.00046 0 0 1 0 0] CT
0.149 GC
2 setlinecap
1 LJ
0.5 LW
N
57.5 248.5 M
57.5 21 L
S
GR
GS
[1.00046 0 0 1 0 0] CT
0.149 GC
2 setlinecap
1 LJ
0.5 LW
N
57.5 248.5 M
60.766 248.5 L
S
GR
GS
[1.00046 0 0 1 0 0] CT
0.149 GC
2 setlinecap
1 LJ
0.5 LW
N
57.5 216 M
60.766 216 L
S
GR
GS
[1.00046 0 0 1 0 0] CT
0.149 GC
2 setlinecap
1 LJ
0.5 LW
N
57.5 183.5 M
60.766 183.5 L
S
GR
GS
[1.00046 0 0 1 0 0] CT
0.149 GC
2 setlinecap
1 LJ
0.5 LW
N
57.5 151 M
60.766 151 L
S
GR
GS
[1.00046 0 0 1 0 0] CT
0.149 GC
2 setlinecap
1 LJ
0.5 LW
N
57.5 118.5 M
60.766 118.5 L
S
GR
GS
[1.00046 0 0 1 0 0] CT
0.149 GC
2 setlinecap
1 LJ
0.5 LW
N
57.5 86 M
60.766 86 L
S
GR
GS
[1.00046 0 0 1 0 0] CT
0.149 GC
2 setlinecap
1 LJ
0.5 LW
N
57.5 53.5 M
60.766 53.5 L
S
GR
GS
[1.00046 0 0 1 0 0] CT
0.149 GC
2 setlinecap
1 LJ
0.5 LW
N
57.5 21 M
60.766 21 L
S
GR
GS
[1.00046 0 0 1 53.12459 248.49994] CT
0.149 GC
/Helvetica 12 F
GS
[1 0 0 1 0 0] CT
-22 4.5 moveto 
1 -1 scale
(-5.7) t 
GR
GR
GS
[1.00046 0 0 1 53.12459 215.99997] CT
0.149 GC
/Helvetica 12 F
GS
[1 0 0 1 0 0] CT
-22 4.5 moveto 
1 -1 scale
(-5.6) t 
GR
GR
GS
[1.00046 0 0 1 53.12459 183.5] CT
0.149 GC
/Helvetica 12 F
GS
[1 0 0 1 0 0] CT
-22 4.5 moveto 
1 -1 scale
(-5.5) t 
GR
GR
GS
[1.00046 0 0 1 53.12459 151.00003] CT
0.149 GC
/Helvetica 12 F
GS
[1 0 0 1 0 0] CT
-22 4.5 moveto 
1 -1 scale
(-5.4) t 
GR
GR
GS
[1.00046 0 0 1 53.12459 118.50006] CT
0.149 GC
/Helvetica 12 F
GS
[1 0 0 1 0 0] CT
-22 4.5 moveto 
1 -1 scale
(-5.3) t 
GR
GR
GS
[1.00046 0 0 1 53.12459 85.99994] CT
0.149 GC
/Helvetica 12 F
GS
[1 0 0 1 0 0] CT
-22 4.5 moveto 
1 -1 scale
(-5.2) t 
GR
GR
GS
[1.00046 0 0 1 53.12459 53.49997] CT
0.149 GC
/Helvetica 12 F
GS
[1 0 0 1 0 0] CT
-22 4.5 moveto 
1 -1 scale
(-5.1) t 
GR
GR
GS
[1.00046 0 0 1 53.12459 21] CT
0.149 GC
/Helvetica 12 F
GS
[1 0 0 1 0 0] CT
-12 4.5 moveto 
1 -1 scale
(-5) t 
GR
GR
GS
[0 -1 1.00046 0 29.01343 134.74982] CT
0.149 GC
/Helvetica 12 F
GS
[1 0 0 1 0 0] CT
-57 -18 moveto 
1 -1 scale
(8-12 Hz Alpha Power) t 
GR
GR
GS
[0 -1 1.00046 0 29.01343 134.74982] CT
0.149 GC
/Helvetica 12 F
GS
[1 0 0 1 0 0] CT
-46 -3 moveto 
1 -1 scale
(\(a.u.; normalized\)) t 
GR
GR
GS
[1.00046 0 0 1 0 0] CT
0.996 0.98 0.98 RC
N
163.146 184.435 M
160.631 183.941 L
158.115 182.716 L
155.6 179.386 L
153.085 172.019 L
150.569 156.543 L
148.054 128.583 L
145.538 90.341 L
143.023 54.907 L
140.508 37.372 L
137.992 41.574 L
135.477 58.047 L
132.962 74.27 L
130.446 81.771 L
127.931 84.82 L
125.415 85.275 L
122.9 84.168 L
120.385 83.338 L
117.869 82.598 L
115.354 81.842 L
112.838 81.608 L
110.323 82.618 L
107.808 83.693 L
105.292 84.56 L
102.777 84.922 L
100.262 85.279 L
97.746 85.224 L
95.231 85.721 L
92.715 86.341 L
90.2 86.91 L
87.685 86.962 L
85.169 87.025 L
82.654 88.157 L
80.138 90.551 L
77.623 92.634 L
75.108 94.564 L
72.592 97.418 L
70.077 101.291 L
67.562 105.421 L
65.046 109.468 L
62.531 113.094 L
60.015 115.944 L
57.5 118.883 L
57.461 118.949 L
57.461 122.473 L
57.461 122.525 L
57.5 122.462 L
60.015 119.682 L
62.531 117.032 L
65.046 113.517 L
67.562 109.375 L
70.077 105.154 L
72.592 101.288 L
75.108 98.57 L
77.623 96.843 L
80.138 94.829 L
82.654 92.437 L
85.169 91.264 L
87.685 91.071 L
90.2 90.926 L
92.715 90.596 L
95.231 90.039 L
97.746 89.522 L
100.262 89.518 L
102.777 89.195 L
105.292 88.997 L
107.808 88.298 L
110.323 87.193 L
112.838 85.952 L
115.354 86.115 L
117.869 86.8 L
120.385 87.376 L
122.9 87.853 L
125.415 88.755 L
127.931 88.262 L
130.446 85.379 L
132.962 78 L
135.477 61.638 L
137.992 44.928 L
140.508 40.487 L
143.023 57.817 L
145.538 93.123 L
148.054 131.209 L
150.569 159.025 L
153.085 174.435 L
155.6 181.775 L
158.115 184.944 L
160.631 186.42 L
163.146 187.301 L
165.662 187.796 L
168.177 188.863 L
170.692 189.497 L
173.208 189.355 L
175.723 189.133 L
178.238 188.312 L
180.754 187.697 L
183.269 186.386 L
185.785 185.333 L
188.3 185.186 L
190.815 184.156 L
193.331 182.654 L
195.846 181.181 L
198.362 181.132 L
200.877 181.502 L
203.392 181.746 L
205.908 181.466 L
208.423 181.379 L
210.938 181.283 L
213.454 180.721 L
215.969 179.41 L
218.485 178.845 L
221 178.243 L
223.515 178.234 L
226.031 178.141 L
228.546 177.782 L
231.062 177.804 L
233.577 177.571 L
236.092 177.125 L
238.608 176.808 L
241.123 176.598 L
243.638 176.31 L
246.154 176.072 L
248.669 175.799 L
251.185 176.188 L
253.7 177.023 L
256.215 177.315 L
258.731 177.114 L
261.246 176.622 L
263.762 176.363 L
266.277 176.104 L
268.792 175.163 L
271.308 174.551 L
273.823 174.016 L
276.338 173.792 L
278.854 174.039 L
281.369 174.642 L
283.885 174.512 L
286.4 173.594 L
288.915 172.534 L
291.431 171.464 L
293.946 171.463 L
296.462 174.302 L
298.977 180.108 L
301.492 186.434 L
304.008 191.621 L
306.523 194.275 L
309.038 197.141 L
311.554 201.064 L
314.069 205.188 L
316.585 207.996 L
319.1 208.175 L
321.615 204.399 L
324.131 197.936 L
326.646 189.577 L
329.162 179.2 L
331.677 167.099 L
334.192 154.833 L
336.708 143.263 L
339.223 133.352 L
341.738 124.773 L
344.254 116.345 L
346.769 109.152 L
349.285 103.589 L
351.8 99.747 L
354.315 97.16 L
356.831 95.27 L
359.346 94.13 L
361.862 92.724 L
364.377 91.732 L
366.892 89.92 L
369.408 88.108 L
371.923 86.523 L
374.438 85.003 L
376.954 83.485 L
379.469 81.636 L
381.985 79.594 L
384.5 77.221 L
384.539 77.149 L
384.539 72.324 L
384.539 72.257 L
384.5 72.32 L
381.985 74.232 L
379.469 75.983 L
376.954 77.78 L
374.438 79.426 L
371.923 80.833 L
369.408 82.266 L
366.892 83.958 L
364.377 85.668 L
361.862 86.613 L
359.346 87.815 L
356.831 88.714 L
354.315 90.505 L
351.8 92.844 L
349.285 96.454 L
346.769 101.901 L
344.254 109.027 L
341.738 117.418 L
339.223 126.102 L
336.708 136.173 L
334.192 147.907 L
331.677 160.589 L
329.162 173.281 L
326.646 184.326 L
324.131 193.32 L
321.615 200.239 L
319.1 204.278 L
316.585 204.408 L
314.069 201.819 L
311.554 197.695 L
309.038 193.519 L
306.523 190.555 L
304.008 187.945 L
301.492 182.878 L
298.977 176.648 L
296.462 170.914 L
293.946 168.147 L
291.431 168.033 L
288.915 168.941 L
286.4 169.848 L
283.885 170.898 L
281.369 171.269 L
278.854 170.926 L
276.338 170.768 L
273.823 171.188 L
271.308 171.889 L
268.792 172.462 L
266.277 173.208 L
263.762 173.403 L
261.246 173.713 L
258.731 173.985 L
256.215 174.058 L
253.7 173.909 L
251.185 173.214 L
248.669 172.899 L
246.154 173.251 L
243.638 173.696 L
241.123 174.135 L
238.608 174.253 L
236.092 174.22 L
233.577 174.496 L
231.062 174.672 L
228.546 174.562 L
226.031 174.878 L
223.515 175.185 L
221 175.224 L
218.485 175.776 L
215.969 176.218 L
213.454 177.651 L
210.938 178.295 L
208.423 178.311 L
205.908 178.59 L
203.392 179.054 L
200.877 178.887 L
198.362 178.523 L
195.846 178.523 L
193.331 179.75 L
190.815 181.276 L
188.3 182.404 L
185.785 182.623 L
183.269 183.607 L
180.754 184.865 L
178.238 185.618 L
175.723 186.505 L
173.208 186.532 L
170.692 186.599 L
168.177 185.905 L
165.662 184.819 L
cp
f
GR
GS
[1.00046 0 0 1 0 0] CT
0.98 0.91 0.91 RC
1 LJ
0.5 LW
N
57.461 122.525 M
57.5 122.462 L
60.015 119.682 L
62.531 117.032 L
65.046 113.517 L
67.562 109.375 L
70.077 105.154 L
72.592 101.288 L
75.108 98.57 L
77.623 96.843 L
80.138 94.829 L
82.654 92.437 L
85.169 91.264 L
87.685 91.071 L
90.2 90.926 L
92.715 90.596 L
95.231 90.039 L
97.746 89.522 L
100.262 89.518 L
102.777 89.195 L
105.292 88.997 L
107.808 88.298 L
110.323 87.193 L
112.838 85.952 L
115.354 86.115 L
117.869 86.8 L
120.385 87.376 L
122.9 87.853 L
125.415 88.755 L
127.931 88.262 L
130.446 85.379 L
132.962 78 L
135.477 61.638 L
137.992 44.928 L
140.508 40.487 L
143.023 57.817 L
145.538 93.123 L
148.054 131.209 L
150.569 159.025 L
153.085 174.435 L
155.6 181.775 L
158.115 184.944 L
160.631 186.42 L
163.146 187.301 L
165.662 187.796 L
168.177 188.863 L
170.692 189.497 L
173.208 189.355 L
175.723 189.133 L
178.238 188.312 L
180.754 187.697 L
183.269 186.386 L
185.785 185.333 L
188.3 185.186 L
190.815 184.156 L
193.331 182.654 L
195.846 181.181 L
198.362 181.132 L
200.877 181.502 L
203.392 181.746 L
205.908 181.466 L
208.423 181.379 L
210.938 181.283 L
213.454 180.721 L
215.969 179.41 L
218.485 178.845 L
221 178.243 L
223.515 178.234 L
226.031 178.141 L
228.546 177.782 L
231.062 177.804 L
233.577 177.571 L
236.092 177.125 L
238.608 176.808 L
241.123 176.598 L
243.638 176.31 L
246.154 176.072 L
248.669 175.799 L
251.185 176.188 L
253.7 177.023 L
256.215 177.315 L
258.731 177.114 L
261.246 176.622 L
263.762 176.363 L
266.277 176.104 L
268.792 175.163 L
271.308 174.551 L
273.823 174.016 L
276.338 173.792 L
278.854 174.039 L
281.369 174.642 L
283.885 174.512 L
286.4 173.594 L
288.915 172.534 L
291.431 171.464 L
293.946 171.463 L
296.462 174.302 L
298.977 180.108 L
301.492 186.434 L
304.008 191.621 L
306.523 194.275 L
309.038 197.141 L
311.554 201.064 L
314.069 205.188 L
316.585 207.996 L
319.1 208.175 L
321.615 204.399 L
324.131 197.936 L
326.646 189.577 L
329.162 179.2 L
331.677 167.099 L
334.192 154.833 L
336.708 143.263 L
339.223 133.352 L
341.738 124.773 L
344.254 116.345 L
346.769 109.152 L
349.285 103.589 L
351.8 99.747 L
354.315 97.16 L
356.831 95.27 L
359.346 94.13 L
361.862 92.724 L
364.377 91.732 L
366.892 89.92 L
369.408 88.108 L
371.923 86.523 L
374.438 85.003 L
376.954 83.485 L
379.469 81.636 L
381.985 79.594 L
384.5 77.221 L
384.539 77.149 L
S
GR
GS
[1.00046 0 0 1 0 0] CT
0.98 0.91 0.91 RC
1 LJ
0.5 LW
N
57.461 118.949 M
57.5 118.883 L
60.015 115.944 L
62.531 113.094 L
65.046 109.468 L
67.562 105.421 L
70.077 101.291 L
72.592 97.418 L
75.108 94.564 L
77.623 92.634 L
80.138 90.551 L
82.654 88.157 L
85.169 87.025 L
87.685 86.962 L
90.2 86.91 L
92.715 86.341 L
95.231 85.721 L
97.746 85.224 L
100.262 85.279 L
102.777 84.922 L
105.292 84.56 L
107.808 83.693 L
110.323 82.618 L
112.838 81.608 L
115.354 81.842 L
117.869 82.598 L
120.385 83.338 L
122.9 84.168 L
125.415 85.275 L
127.931 84.82 L
130.446 81.771 L
132.962 74.27 L
135.477 58.047 L
137.992 41.574 L
140.508 37.372 L
143.023 54.907 L
145.538 90.341 L
148.054 128.583 L
150.569 156.543 L
153.085 172.019 L
155.6 179.386 L
158.115 182.716 L
160.631 183.941 L
163.146 184.435 L
165.662 184.819 L
168.177 185.905 L
170.692 186.599 L
173.208 186.532 L
175.723 186.505 L
178.238 185.618 L
180.754 184.865 L
183.269 183.607 L
185.785 182.623 L
188.3 182.404 L
190.815 181.276 L
193.331 179.75 L
195.846 178.523 L
198.362 178.523 L
200.877 178.887 L
203.392 179.054 L
205.908 178.59 L
208.423 178.311 L
210.938 178.295 L
213.454 177.651 L
215.969 176.218 L
218.485 175.776 L
221 175.224 L
223.515 175.185 L
226.031 174.878 L
228.546 174.562 L
231.062 174.672 L
233.577 174.496 L
236.092 174.22 L
238.608 174.253 L
241.123 174.135 L
243.638 173.696 L
246.154 173.251 L
248.669 172.899 L
251.185 173.214 L
253.7 173.909 L
256.215 174.058 L
258.731 173.985 L
261.246 173.713 L
263.762 173.403 L
266.277 173.208 L
268.792 172.462 L
271.308 171.889 L
273.823 171.188 L
276.338 170.768 L
278.854 170.926 L
281.369 171.269 L
283.885 170.898 L
286.4 169.848 L
288.915 168.941 L
291.431 168.033 L
293.946 168.147 L
296.462 170.914 L
298.977 176.648 L
301.492 182.878 L
304.008 187.945 L
306.523 190.555 L
309.038 193.519 L
311.554 197.695 L
314.069 201.819 L
316.585 204.408 L
319.1 204.278 L
321.615 200.239 L
324.131 193.32 L
326.646 184.326 L
329.162 173.281 L
331.677 160.589 L
334.192 147.907 L
336.708 136.173 L
339.223 126.102 L
341.738 117.418 L
344.254 109.027 L
346.769 101.901 L
349.285 96.454 L
351.8 92.844 L
354.315 90.505 L
356.831 88.714 L
359.346 87.815 L
361.862 86.613 L
364.377 85.668 L
366.892 83.958 L
369.408 82.266 L
371.923 80.833 L
374.438 79.426 L
376.954 77.78 L
379.469 75.983 L
381.985 74.232 L
384.5 72.32 L
384.539 72.257 L
S
GR
GS
[1.00046 0 0 1 0 0] CT
0.961 0.8 0.8 RC
1 LJ
2 LW
N
57.461 120.737 M
57.5 120.672 L
60.015 117.813 L
62.531 115.063 L
65.046 111.492 L
67.562 107.398 L
70.077 103.223 L
72.592 99.353 L
75.108 96.567 L
77.623 94.738 L
80.138 92.69 L
82.654 90.297 L
85.169 89.144 L
87.685 89.016 L
90.2 88.918 L
92.715 88.469 L
95.231 87.88 L
97.746 87.373 L
100.262 87.398 L
102.777 87.059 L
105.292 86.778 L
107.808 85.995 L
110.323 84.905 L
112.838 83.78 L
115.354 83.978 L
117.869 84.699 L
120.385 85.357 L
122.9 86.011 L
125.415 87.015 L
127.931 86.541 L
130.446 83.575 L
132.962 76.135 L
135.477 59.842 L
137.992 43.251 L
140.508 38.929 L
143.023 56.362 L
145.538 91.732 L
148.054 129.896 L
150.569 157.784 L
153.085 173.227 L
155.6 180.58 L
158.115 183.83 L
160.631 185.181 L
163.146 185.868 L
165.662 186.308 L
168.177 187.384 L
170.692 188.048 L
173.208 187.943 L
175.723 187.819 L
178.238 186.965 L
180.754 186.281 L
183.269 184.997 L
185.785 183.978 L
188.3 183.795 L
190.815 182.716 L
193.331 181.202 L
195.846 179.852 L
198.362 179.827 L
200.877 180.194 L
203.392 180.4 L
205.908 180.028 L
208.423 179.845 L
210.938 179.789 L
213.454 179.186 L
215.969 177.814 L
218.485 177.311 L
221 176.733 L
223.515 176.71 L
226.031 176.51 L
228.546 176.172 L
231.062 176.238 L
233.577 176.034 L
236.092 175.673 L
238.608 175.531 L
241.123 175.367 L
243.638 175.003 L
246.154 174.661 L
248.669 174.349 L
251.185 174.701 L
253.7 175.466 L
256.215 175.687 L
258.731 175.549 L
261.246 175.167 L
263.762 174.883 L
266.277 174.656 L
268.792 173.813 L
271.308 173.22 L
273.823 172.602 L
276.338 172.28 L
278.854 172.483 L
281.369 172.955 L
283.885 172.705 L
286.4 171.721 L
288.915 170.737 L
291.431 169.749 L
293.946 169.805 L
296.462 172.608 L
298.977 178.378 L
301.492 184.656 L
304.008 189.783 L
306.523 192.415 L
309.038 195.33 L
311.554 199.379 L
314.069 203.503 L
316.585 206.202 L
319.1 206.227 L
321.615 202.319 L
324.131 195.628 L
326.646 186.951 L
329.162 176.24 L
331.677 163.844 L
334.192 151.37 L
336.708 139.718 L
339.223 129.727 L
341.738 121.096 L
344.254 112.686 L
346.769 105.526 L
349.285 100.021 L
351.8 96.295 L
354.315 93.833 L
356.831 91.992 L
359.346 90.972 L
361.862 89.668 L
364.377 88.7 L
366.892 86.939 L
369.408 85.187 L
371.923 83.678 L
374.438 82.215 L
376.954 80.633 L
379.469 78.81 L
381.985 76.913 L
384.5 74.77 L
384.539 74.703 L
S
GR
GS
[1.00046 0 0 1 0 0] CT
0.99 0.959 0.959 RC
N
173.208 182.123 M
175.723 182.952 L
178.238 183.387 L
180.754 183.196 L
183.269 182.393 L
185.785 181.957 L
188.3 181.969 L
190.815 181.921 L
193.331 180.986 L
195.846 180.389 L
198.362 179.929 L
200.877 179.166 L
203.392 179.678 L
205.908 180.025 L
208.423 181.179 L
210.938 181.81 L
213.454 181.335 L
215.969 180.888 L
218.485 181.549 L
221 182.18 L
223.515 182.037 L
226.031 181.779 L
228.546 181.168 L
231.062 180.612 L
233.577 181.092 L
236.092 180.975 L
238.608 180.65 L
241.123 179.682 L
243.638 179.63 L
246.154 179.56 L
248.669 178.618 L
251.185 178.227 L
253.7 178.244 L
256.215 179.142 L
258.731 179.599 L
261.246 179.52 L
263.762 179.888 L
266.277 180.015 L
268.792 180.257 L
271.308 179.962 L
273.823 179.678 L
276.338 179.889 L
278.854 179.676 L
281.369 180.186 L
283.885 180.853 L
286.4 180.763 L
288.915 180.113 L
291.431 179.44 L
293.946 180.426 L
296.462 183.81 L
298.977 189.166 L
301.492 195.669 L
304.008 200.528 L
306.523 203.17 L
309.038 207.072 L
311.554 213.737 L
314.069 221.424 L
316.585 226.337 L
319.1 226.12 L
321.615 221.718 L
324.131 213.323 L
326.646 203.666 L
329.162 193.172 L
331.677 183.549 L
334.192 174.108 L
336.708 165.688 L
339.223 156.874 L
341.738 147.72 L
344.254 139.573 L
346.769 132.433 L
349.285 126.107 L
351.8 120.75 L
354.315 116.593 L
356.831 112.955 L
359.346 109.988 L
361.862 107.616 L
364.377 106.272 L
366.892 104.508 L
369.408 100.781 L
371.923 96.304 L
374.438 93.358 L
376.954 91.34 L
379.469 89.305 L
381.985 87.643 L
384.5 84.965 L
384.539 84.88 L
384.539 81.493 L
384.539 81.439 L
384.5 81.524 L
381.985 84.337 L
379.469 86.14 L
376.954 88.159 L
374.438 90.173 L
371.923 93.046 L
369.408 97.593 L
366.892 101.326 L
364.377 102.999 L
361.862 104.105 L
359.346 106.221 L
356.831 109.037 L
354.315 112.838 L
351.8 117.052 L
349.285 122.525 L
346.769 128.988 L
344.254 136.239 L
341.738 144.432 L
339.223 153.491 L
336.708 162.438 L
334.192 170.881 L
331.677 180.704 L
329.162 190.835 L
326.646 201.539 L
324.131 211.352 L
321.615 219.682 L
319.1 224.001 L
316.585 224.118 L
314.069 218.852 L
311.554 211.067 L
309.038 204.589 L
306.523 200.865 L
304.008 198.348 L
301.492 193.483 L
298.977 186.795 L
296.462 181.191 L
293.946 177.754 L
291.431 176.884 L
288.915 177.733 L
286.4 178.546 L
283.885 178.715 L
281.369 177.743 L
278.854 176.944 L
276.338 177.29 L
273.823 177.297 L
271.308 177.653 L
268.792 178.034 L
266.277 177.676 L
263.762 177.408 L
261.246 177.047 L
258.731 177.013 L
256.215 176.475 L
253.7 175.643 L
251.185 175.984 L
248.669 176.638 L
246.154 177.599 L
243.638 177.513 L
241.123 177.35 L
238.608 178.153 L
236.092 178.475 L
233.577 178.479 L
231.062 178.046 L
228.546 178.554 L
226.031 179.12 L
223.515 179.303 L
221 179.421 L
218.485 178.888 L
215.969 178.359 L
213.454 178.926 L
210.938 179.372 L
208.423 178.743 L
205.908 177.715 L
203.392 177.443 L
200.877 176.915 L
198.362 177.492 L
195.846 177.756 L
193.331 178.32 L
190.815 179.375 L
188.3 179.449 L
185.785 179.408 L
183.269 179.731 L
180.754 180.424 L
178.238 180.718 L
175.723 180.33 L
173.208 179.463 L
170.692 178.757 L
168.177 179.014 L
165.662 179.465 L
163.146 179.748 L
160.631 179.127 L
158.115 177.948 L
155.6 175.046 L
153.085 168.139 L
150.569 153.202 L
148.054 125.613 L
145.538 86.813 L
143.023 50.415 L
140.508 31.211 L
137.992 33.446 L
135.477 48.875 L
132.962 64.001 L
130.446 71.026 L
127.931 72.932 L
125.415 73.539 L
122.9 73.554 L
120.385 73.809 L
117.869 72.944 L
115.354 72.475 L
112.838 72.347 L
110.323 72.059 L
107.808 71.988 L
105.292 71.95 L
102.777 72.449 L
100.262 73.439 L
97.746 73.666 L
95.231 73.07 L
92.715 72.939 L
90.2 73.866 L
87.685 75.188 L
85.169 76.873 L
82.654 77.932 L
80.138 79.912 L
77.623 82.005 L
75.108 84.234 L
72.592 88.118 L
70.077 93.222 L
67.562 99.235 L
65.046 105.608 L
62.531 110.994 L
60.015 115.514 L
57.5 120.683 L
57.461 120.788 L
57.461 124.015 L
57.461 124.066 L
57.5 123.961 L
60.015 118.569 L
62.531 113.861 L
65.046 108.544 L
67.562 102.423 L
70.077 96.809 L
72.592 91.91 L
75.108 87.974 L
77.623 85.484 L
80.138 83.044 L
82.654 80.908 L
85.169 79.872 L
87.685 78.05 L
90.2 76.581 L
92.715 75.645 L
95.231 75.914 L
97.746 76.738 L
100.262 76.78 L
102.777 76.155 L
105.292 75.835 L
107.808 75.851 L
110.323 75.778 L
112.838 75.932 L
115.354 75.96 L
117.869 76.352 L
120.385 77.121 L
122.9 76.938 L
125.415 76.883 L
127.931 76.276 L
130.446 74.586 L
132.962 67.768 L
135.477 52.424 L
137.992 36.668 L
140.508 34.168 L
143.023 53.247 L
145.538 89.525 L
148.054 128.117 L
150.569 155.523 L
153.085 170.416 L
155.6 177.328 L
158.115 180.13 L
160.631 181.436 L
163.146 182.134 L
165.662 181.966 L
168.177 181.58 L
170.692 181.321 L
cp
f
GR
GS
[1.00046 0 0 1 0 0] CT
0.957 0.82 0.82 RC
1 LJ
0.5 LW
N
57.461 124.066 M
57.5 123.961 L
60.015 118.569 L
62.531 113.861 L
65.046 108.544 L
67.562 102.423 L
70.077 96.809 L
72.592 91.91 L
75.108 87.974 L
77.623 85.484 L
80.138 83.044 L
82.654 80.908 L
85.169 79.872 L
87.685 78.05 L
90.2 76.581 L
92.715 75.645 L
95.231 75.914 L
97.746 76.738 L
100.262 76.78 L
102.777 76.155 L
105.292 75.835 L
107.808 75.851 L
110.323 75.778 L
112.838 75.932 L
115.354 75.96 L
117.869 76.352 L
120.385 77.121 L
122.9 76.938 L
125.415 76.883 L
127.931 76.276 L
130.446 74.586 L
132.962 67.768 L
135.477 52.424 L
137.992 36.668 L
140.508 34.168 L
143.023 53.247 L
145.538 89.525 L
148.054 128.117 L
150.569 155.523 L
153.085 170.416 L
155.6 177.328 L
158.115 180.13 L
160.631 181.436 L
163.146 182.134 L
165.662 181.966 L
168.177 181.58 L
170.692 181.321 L
173.208 182.123 L
175.723 182.952 L
178.238 183.387 L
180.754 183.196 L
183.269 182.393 L
185.785 181.957 L
188.3 181.969 L
190.815 181.921 L
193.331 180.986 L
195.846 180.389 L
198.362 179.929 L
200.877 179.166 L
203.392 179.678 L
205.908 180.025 L
208.423 181.179 L
210.938 181.81 L
213.454 181.335 L
215.969 180.888 L
218.485 181.549 L
221 182.18 L
223.515 182.037 L
226.031 181.779 L
228.546 181.168 L
231.062 180.612 L
233.577 181.092 L
236.092 180.975 L
238.608 180.65 L
241.123 179.682 L
243.638 179.63 L
246.154 179.56 L
248.669 178.618 L
251.185 178.227 L
253.7 178.244 L
256.215 179.142 L
258.731 179.599 L
261.246 179.52 L
263.762 179.888 L
266.277 180.015 L
268.792 180.257 L
271.308 179.962 L
273.823 179.678 L
276.338 179.889 L
278.854 179.676 L
281.369 180.186 L
283.885 180.853 L
286.4 180.763 L
288.915 180.113 L
291.431 179.44 L
293.946 180.426 L
296.462 183.81 L
298.977 189.166 L
301.492 195.669 L
304.008 200.528 L
306.523 203.17 L
309.038 207.072 L
311.554 213.737 L
314.069 221.424 L
316.585 226.337 L
319.1 226.12 L
321.615 221.718 L
324.131 213.323 L
326.646 203.666 L
329.162 193.172 L
331.677 183.549 L
334.192 174.108 L
336.708 165.688 L
339.223 156.874 L
341.738 147.72 L
344.254 139.573 L
346.769 132.433 L
349.285 126.107 L
351.8 120.75 L
354.315 116.593 L
356.831 112.955 L
359.346 109.988 L
361.862 107.616 L
364.377 106.272 L
366.892 104.508 L
369.408 100.781 L
371.923 96.304 L
374.438 93.358 L
376.954 91.34 L
379.469 89.305 L
381.985 87.643 L
384.5 84.965 L
384.539 84.88 L
S
GR
GS
[1.00046 0 0 1 0 0] CT
0.957 0.82 0.82 RC
1 LJ
0.5 LW
N
57.461 120.788 M
57.5 120.683 L
60.015 115.514 L
62.531 110.994 L
65.046 105.608 L
67.562 99.235 L
70.077 93.222 L
72.592 88.118 L
75.108 84.234 L
77.623 82.005 L
80.138 79.912 L
82.654 77.932 L
85.169 76.873 L
87.685 75.188 L
90.2 73.866 L
92.715 72.939 L
95.231 73.07 L
97.746 73.666 L
100.262 73.439 L
102.777 72.449 L
105.292 71.95 L
107.808 71.988 L
110.323 72.059 L
112.838 72.347 L
115.354 72.475 L
117.869 72.944 L
120.385 73.809 L
122.9 73.554 L
125.415 73.539 L
127.931 72.932 L
130.446 71.026 L
132.962 64.001 L
135.477 48.875 L
137.992 33.446 L
140.508 31.211 L
143.023 50.415 L
145.538 86.813 L
148.054 125.613 L
150.569 153.202 L
153.085 168.139 L
155.6 175.046 L
158.115 177.948 L
160.631 179.127 L
163.146 179.748 L
165.662 179.465 L
168.177 179.014 L
170.692 178.757 L
173.208 179.463 L
175.723 180.33 L
178.238 180.718 L
180.754 180.424 L
183.269 179.731 L
185.785 179.408 L
188.3 179.449 L
190.815 179.375 L
193.331 178.32 L
195.846 177.756 L
198.362 177.492 L
200.877 176.915 L
203.392 177.443 L
205.908 177.715 L
208.423 178.743 L
210.938 179.372 L
213.454 178.926 L
215.969 178.359 L
218.485 178.888 L
221 179.421 L
223.515 179.303 L
226.031 179.12 L
228.546 178.554 L
231.062 178.046 L
233.577 178.479 L
236.092 178.475 L
238.608 178.153 L
241.123 177.35 L
243.638 177.513 L
246.154 177.599 L
248.669 176.638 L
251.185 175.984 L
253.7 175.643 L
256.215 176.475 L
258.731 177.013 L
261.246 177.047 L
263.762 177.408 L
266.277 177.676 L
268.792 178.034 L
271.308 177.653 L
273.823 177.297 L
276.338 177.29 L
278.854 176.944 L
281.369 177.743 L
283.885 178.715 L
286.4 178.546 L
288.915 177.733 L
291.431 176.884 L
293.946 177.754 L
296.462 181.191 L
298.977 186.795 L
301.492 193.483 L
304.008 198.348 L
306.523 200.865 L
309.038 204.589 L
311.554 211.067 L
314.069 218.852 L
316.585 224.118 L
319.1 224.001 L
321.615 219.682 L
324.131 211.352 L
326.646 201.539 L
329.162 190.835 L
331.677 180.704 L
334.192 170.881 L
336.708 162.438 L
339.223 153.491 L
341.738 144.432 L
344.254 136.239 L
346.769 128.988 L
349.285 122.525 L
351.8 117.052 L
354.315 112.838 L
356.831 109.037 L
359.346 106.221 L
361.862 104.105 L
364.377 102.999 L
366.892 101.326 L
369.408 97.593 L
371.923 93.046 L
374.438 90.173 L
376.954 88.159 L
379.469 86.14 L
381.985 84.337 L
384.5 81.524 L
384.539 81.439 L
S
GR
GS
[1.00046 0 0 1 0 0] CT
0.898 0.6 0.6 RC
1 LJ
2 LW
N
57.461 122.426 M
57.5 122.322 L
60.015 117.042 L
62.531 112.427 L
65.046 107.076 L
67.562 100.829 L
70.077 95.015 L
72.592 90.014 L
75.108 86.104 L
77.623 83.744 L
80.138 81.478 L
82.654 79.42 L
85.169 78.372 L
87.685 76.619 L
90.2 75.223 L
92.715 74.292 L
95.231 74.492 L
97.746 75.202 L
100.262 75.11 L
102.777 74.302 L
105.292 73.893 L
107.808 73.919 L
110.323 73.918 L
112.838 74.139 L
115.354 74.217 L
117.869 74.648 L
120.385 75.465 L
122.9 75.246 L
125.415 75.211 L
127.931 74.604 L
130.446 72.806 L
132.962 65.885 L
135.477 50.65 L
137.992 35.057 L
140.508 32.69 L
143.023 51.831 L
145.538 88.169 L
148.054 126.865 L
150.569 154.362 L
153.085 169.277 L
155.6 176.187 L
158.115 179.039 L
160.631 180.282 L
163.146 180.941 L
165.662 180.715 L
168.177 180.297 L
170.692 180.039 L
173.208 180.793 L
175.723 181.641 L
178.238 182.052 L
180.754 181.81 L
183.269 181.062 L
185.785 180.682 L
188.3 180.709 L
190.815 180.648 L
193.331 179.653 L
195.846 179.073 L
198.362 178.71 L
200.877 178.04 L
203.392 178.56 L
205.908 178.87 L
208.423 179.961 L
210.938 180.591 L
213.454 180.13 L
215.969 179.624 L
218.485 180.219 L
221 180.8 L
223.515 180.67 L
226.031 180.45 L
228.546 179.861 L
231.062 179.329 L
233.577 179.786 L
236.092 179.725 L
238.608 179.402 L
241.123 178.516 L
243.638 178.572 L
246.154 178.579 L
248.669 177.628 L
251.185 177.105 L
253.7 176.944 L
256.215 177.808 L
258.731 178.306 L
261.246 178.283 L
263.762 178.648 L
266.277 178.846 L
268.792 179.145 L
271.308 178.808 L
273.823 178.487 L
276.338 178.59 L
278.854 178.31 L
281.369 178.965 L
283.885 179.784 L
286.4 179.655 L
288.915 178.923 L
291.431 178.162 L
293.946 179.09 L
296.462 182.5 L
298.977 187.981 L
301.492 194.576 L
304.008 199.438 L
306.523 202.018 L
309.038 205.831 L
311.554 212.402 L
314.069 220.138 L
316.585 225.228 L
319.1 225.06 L
321.615 220.7 L
324.131 212.337 L
326.646 202.602 L
329.162 192.003 L
331.677 182.127 L
334.192 172.494 L
336.708 164.063 L
339.223 155.183 L
341.738 146.076 L
344.254 137.906 L
346.769 130.71 L
349.285 124.316 L
351.8 118.901 L
354.315 114.715 L
356.831 110.996 L
359.346 108.105 L
361.862 105.861 L
364.377 104.635 L
366.892 102.917 L
369.408 99.187 L
371.923 94.675 L
374.438 91.765 L
376.954 89.749 L
379.469 87.723 L
381.985 85.99 L
384.5 83.245 L
384.539 83.16 L
S
GR
GS
[1.00046 0 0 1 0 0] CT
0.98 0.939 0.939 RC
N
168.177 177.303 M
165.662 177.555 L
163.146 177.246 L
160.631 177.324 L
158.115 177.343 L
155.6 175.007 L
153.085 167.877 L
150.569 151.953 L
148.054 123.217 L
145.538 83.684 L
143.023 47.446 L
140.508 28.87 L
137.992 31.556 L
135.477 46.161 L
132.962 58.983 L
130.446 63.31 L
127.931 63.499 L
125.415 62.972 L
122.9 62.737 L
120.385 62.553 L
117.869 62.294 L
115.354 61.044 L
112.838 59.821 L
110.323 58.474 L
107.808 57.926 L
105.292 57.731 L
102.777 57.455 L
100.262 56.985 L
97.746 57.344 L
95.231 57.533 L
92.715 57.943 L
90.2 59.051 L
87.685 60.093 L
85.169 61.201 L
82.654 62.771 L
80.138 64.665 L
77.623 67.612 L
75.108 72.958 L
72.592 79.735 L
70.077 87.326 L
67.562 94.694 L
65.046 101.73 L
62.531 107.246 L
60.015 112.096 L
57.5 117.675 L
57.461 117.779 L
57.461 120.467 L
57.461 120.514 L
57.5 120.406 L
60.015 114.69 L
62.531 109.89 L
65.046 104.434 L
67.562 97.547 L
70.077 90.266 L
72.592 82.773 L
75.108 76.055 L
77.623 70.647 L
80.138 67.854 L
82.654 66.22 L
85.169 64.988 L
87.685 64 L
90.2 62.968 L
92.715 61.914 L
95.231 61.504 L
97.746 61.297 L
100.262 61.126 L
102.777 61.779 L
105.292 61.968 L
107.808 62.001 L
110.323 62.413 L
112.838 63.778 L
115.354 65.118 L
117.869 66.324 L
120.385 66.533 L
122.9 66.724 L
125.415 67.062 L
127.931 67.664 L
130.446 67.574 L
132.962 63.341 L
135.477 50.31 L
137.992 35.327 L
140.508 32.5 L
143.023 50.997 L
145.538 87.112 L
148.054 126.276 L
150.569 154.813 L
153.085 170.473 L
155.6 177.551 L
158.115 179.791 L
160.631 179.622 L
163.146 179.375 L
165.662 179.656 L
168.177 179.506 L
170.692 179.174 L
173.208 179.76 L
175.723 180.008 L
178.238 180.166 L
180.754 179.901 L
183.269 180.565 L
185.785 180.59 L
188.3 181.078 L
190.815 181.243 L
193.331 180.23 L
195.846 180.634 L
198.362 180.151 L
200.877 179.183 L
203.392 178.946 L
205.908 178.733 L
208.423 178.449 L
210.938 178.345 L
213.454 178.254 L
215.969 178.456 L
218.485 178.997 L
221 179.395 L
223.515 179.552 L
226.031 179.545 L
228.546 179.894 L
231.062 180.132 L
233.577 179.699 L
236.092 178.829 L
238.608 177.956 L
241.123 177.233 L
243.638 177.03 L
246.154 177.722 L
248.669 177.369 L
251.185 176.947 L
253.7 176.509 L
256.215 176.383 L
258.731 176.599 L
261.246 176.776 L
263.762 177.432 L
266.277 177.612 L
268.792 178.213 L
271.308 178.818 L
273.823 178.524 L
276.338 178.353 L
278.854 177.491 L
281.369 177.484 L
283.885 177.702 L
286.4 177.502 L
288.915 176.862 L
291.431 176.835 L
293.946 178.618 L
296.462 182.422 L
298.977 188.08 L
301.492 195.043 L
304.008 200.597 L
306.523 204.494 L
309.038 208.197 L
311.554 213.793 L
314.069 219.749 L
316.585 224.448 L
319.1 226.172 L
321.615 224.986 L
324.131 220.277 L
326.646 212.483 L
329.162 203.456 L
331.677 193.059 L
334.192 182.514 L
336.708 171.969 L
339.223 162.74 L
341.738 153.801 L
344.254 146.162 L
346.769 138.739 L
349.285 132.132 L
351.8 126.225 L
354.315 121.457 L
356.831 117.742 L
359.346 114.838 L
361.862 112.448 L
364.377 110.536 L
366.892 108.09 L
369.408 104.388 L
371.923 101.708 L
374.438 100.203 L
376.954 97.846 L
379.469 95.49 L
381.985 93.011 L
384.5 89.955 L
384.539 89.85 L
384.539 86.127 L
384.539 86.068 L
384.5 86.174 L
381.985 89.408 L
379.469 92.122 L
376.954 94.557 L
374.438 96.903 L
371.923 98.393 L
369.408 101.121 L
366.892 104.789 L
364.377 107.169 L
361.862 109.052 L
359.346 111.197 L
356.831 113.861 L
354.315 117.598 L
351.8 122.525 L
349.285 128.372 L
346.769 134.777 L
344.254 142.135 L
341.738 149.903 L
339.223 159.18 L
336.708 168.744 L
334.192 179.454 L
331.677 190.036 L
329.162 200.446 L
326.646 209.261 L
324.131 217.022 L
321.615 221.806 L
319.1 223.266 L
316.585 221.918 L
314.069 217.31 L
311.554 211.234 L
309.038 205.398 L
306.523 201.693 L
304.008 197.784 L
301.492 192.171 L
298.977 185.218 L
296.462 179.734 L
293.946 175.999 L
291.431 174.061 L
288.915 173.846 L
286.4 174.136 L
283.885 174.123 L
281.369 174.056 L
278.854 174.275 L
276.338 175.311 L
273.823 175.633 L
271.308 175.989 L
268.792 175.374 L
266.277 174.802 L
263.762 174.55 L
261.246 173.91 L
258.731 173.774 L
256.215 173.831 L
253.7 174.075 L
251.185 174.437 L
248.669 174.744 L
246.154 175.173 L
243.638 174.652 L
241.123 175.042 L
238.608 175.858 L
236.092 176.699 L
233.577 177.371 L
231.062 177.698 L
228.546 177.26 L
226.031 176.926 L
223.515 176.943 L
221 176.901 L
218.485 176.514 L
215.969 176.239 L
213.454 176.02 L
210.938 175.81 L
208.423 175.873 L
205.908 176.28 L
203.392 176.635 L
200.877 176.973 L
198.362 177.715 L
195.846 178.008 L
193.331 177.665 L
190.815 178.579 L
188.3 178.46 L
185.785 178.174 L
183.269 178.279 L
180.754 177.446 L
178.238 177.646 L
175.723 177.625 L
173.208 177.474 L
170.692 176.981 L
cp
f
GR
GS
[1.00046 0 0 1 0 0] CT
0.91 0.729 0.729 RC
1 LJ
0.5 LW
N
57.461 120.514 M
57.5 120.406 L
60.015 114.69 L
62.531 109.89 L
65.046 104.434 L
67.562 97.547 L
70.077 90.266 L
72.592 82.773 L
75.108 76.055 L
77.623 70.647 L
80.138 67.854 L
82.654 66.22 L
85.169 64.988 L
87.685 64 L
90.2 62.968 L
92.715 61.914 L
95.231 61.504 L
97.746 61.297 L
100.262 61.126 L
102.777 61.779 L
105.292 61.968 L
107.808 62.001 L
110.323 62.413 L
112.838 63.778 L
115.354 65.118 L
117.869 66.324 L
120.385 66.533 L
122.9 66.724 L
125.415 67.062 L
127.931 67.664 L
130.446 67.574 L
132.962 63.341 L
135.477 50.31 L
137.992 35.327 L
140.508 32.5 L
143.023 50.997 L
145.538 87.112 L
148.054 126.276 L
150.569 154.813 L
153.085 170.473 L
155.6 177.551 L
158.115 179.791 L
160.631 179.622 L
163.146 179.375 L
165.662 179.656 L
168.177 179.506 L
170.692 179.174 L
173.208 179.76 L
175.723 180.008 L
178.238 180.166 L
180.754 179.901 L
183.269 180.565 L
185.785 180.59 L
188.3 181.078 L
190.815 181.243 L
193.331 180.23 L
195.846 180.634 L
198.362 180.151 L
200.877 179.183 L
203.392 178.946 L
205.908 178.733 L
208.423 178.449 L
210.938 178.345 L
213.454 178.254 L
215.969 178.456 L
218.485 178.997 L
221 179.395 L
223.515 179.552 L
226.031 179.545 L
228.546 179.894 L
231.062 180.132 L
233.577 179.699 L
236.092 178.829 L
238.608 177.956 L
241.123 177.233 L
243.638 177.03 L
246.154 177.722 L
248.669 177.369 L
251.185 176.947 L
253.7 176.509 L
256.215 176.383 L
258.731 176.599 L
261.246 176.776 L
263.762 177.432 L
266.277 177.612 L
268.792 178.213 L
271.308 178.818 L
273.823 178.524 L
276.338 178.353 L
278.854 177.491 L
281.369 177.484 L
283.885 177.702 L
286.4 177.502 L
288.915 176.862 L
291.431 176.835 L
293.946 178.618 L
296.462 182.422 L
298.977 188.08 L
301.492 195.043 L
304.008 200.597 L
306.523 204.494 L
309.038 208.197 L
311.554 213.793 L
314.069 219.749 L
316.585 224.448 L
319.1 226.172 L
321.615 224.986 L
324.131 220.277 L
326.646 212.483 L
329.162 203.456 L
331.677 193.059 L
334.192 182.514 L
336.708 171.969 L
339.223 162.74 L
341.738 153.801 L
344.254 146.162 L
346.769 138.739 L
349.285 132.132 L
351.8 126.225 L
354.315 121.457 L
356.831 117.742 L
359.346 114.838 L
361.862 112.448 L
364.377 110.536 L
366.892 108.09 L
369.408 104.388 L
371.923 101.708 L
374.438 100.203 L
376.954 97.846 L
379.469 95.49 L
381.985 93.011 L
384.5 89.955 L
384.539 89.85 L
S
GR
GS
[1.00046 0 0 1 0 0] CT
0.91 0.729 0.729 RC
1 LJ
0.5 LW
N
57.461 117.779 M
57.5 117.675 L
60.015 112.096 L
62.531 107.246 L
65.046 101.73 L
67.562 94.694 L
70.077 87.326 L
72.592 79.735 L
75.108 72.958 L
77.623 67.612 L
80.138 64.665 L
82.654 62.771 L
85.169 61.201 L
87.685 60.093 L
90.2 59.051 L
92.715 57.943 L
95.231 57.533 L
97.746 57.344 L
100.262 56.985 L
102.777 57.455 L
105.292 57.731 L
107.808 57.926 L
110.323 58.474 L
112.838 59.821 L
115.354 61.044 L
117.869 62.294 L
120.385 62.553 L
122.9 62.737 L
125.415 62.972 L
127.931 63.499 L
130.446 63.31 L
132.962 58.983 L
135.477 46.161 L
137.992 31.556 L
140.508 28.87 L
143.023 47.446 L
145.538 83.684 L
148.054 123.217 L
150.569 151.953 L
153.085 167.877 L
155.6 175.007 L
158.115 177.343 L
160.631 177.324 L
163.146 177.246 L
165.662 177.555 L
168.177 177.303 L
170.692 176.981 L
173.208 177.474 L
175.723 177.625 L
178.238 177.646 L
180.754 177.446 L
183.269 178.279 L
185.785 178.174 L
188.3 178.46 L
190.815 178.579 L
193.331 177.665 L
195.846 178.008 L
198.362 177.715 L
200.877 176.973 L
203.392 176.635 L
205.908 176.28 L
208.423 175.873 L
210.938 175.81 L
213.454 176.02 L
215.969 176.239 L
218.485 176.514 L
221 176.901 L
223.515 176.943 L
226.031 176.926 L
228.546 177.26 L
231.062 177.698 L
233.577 177.371 L
236.092 176.699 L
238.608 175.858 L
241.123 175.042 L
243.638 174.652 L
246.154 175.173 L
248.669 174.744 L
251.185 174.437 L
253.7 174.075 L
256.215 173.831 L
258.731 173.774 L
261.246 173.91 L
263.762 174.55 L
266.277 174.802 L
268.792 175.374 L
271.308 175.989 L
273.823 175.633 L
276.338 175.311 L
278.854 174.275 L
281.369 174.056 L
283.885 174.123 L
286.4 174.136 L
288.915 173.846 L
291.431 174.061 L
293.946 175.999 L
296.462 179.734 L
298.977 185.218 L
301.492 192.171 L
304.008 197.784 L
306.523 201.693 L
309.038 205.398 L
311.554 211.234 L
314.069 217.31 L
316.585 221.918 L
319.1 223.266 L
321.615 221.806 L
324.131 217.022 L
326.646 209.261 L
329.162 200.446 L
331.677 190.036 L
334.192 179.454 L
336.708 168.744 L
339.223 159.18 L
341.738 149.903 L
344.254 142.135 L
346.769 134.777 L
349.285 128.372 L
351.8 122.525 L
354.315 117.598 L
356.831 113.861 L
359.346 111.197 L
361.862 109.052 L
364.377 107.169 L
366.892 104.789 L
369.408 101.121 L
371.923 98.393 L
374.438 96.903 L
376.954 94.557 L
379.469 92.122 L
381.985 89.408 L
384.5 86.174 L
384.539 86.068 L
S
GR
GS
[1.00046 0 0 1 0 0] CT
0.8 0.4 0.4 RC
1 LJ
2 LW
N
57.461 119.146 M
57.5 119.04 L
60.015 113.393 L
62.531 108.568 L
65.046 103.082 L
67.562 96.121 L
70.077 88.796 L
72.592 81.254 L
75.108 74.506 L
77.623 69.13 L
80.138 66.259 L
82.654 64.495 L
85.169 63.095 L
87.685 62.047 L
90.2 61.009 L
92.715 59.928 L
95.231 59.518 L
97.746 59.32 L
100.262 59.055 L
102.777 59.617 L
105.292 59.849 L
107.808 59.964 L
110.323 60.443 L
112.838 61.8 L
115.354 63.081 L
117.869 64.309 L
120.385 64.543 L
122.9 64.73 L
125.415 65.017 L
127.931 65.582 L
130.446 65.442 L
132.962 61.162 L
135.477 48.235 L
137.992 33.441 L
140.508 30.685 L
143.023 49.222 L
145.538 85.398 L
148.054 124.747 L
150.569 153.383 L
153.085 169.175 L
155.6 176.279 L
158.115 178.567 L
160.631 178.473 L
163.146 178.31 L
165.662 178.606 L
168.177 178.405 L
170.692 178.077 L
173.208 178.617 L
175.723 178.817 L
178.238 178.906 L
180.754 178.674 L
183.269 179.422 L
185.785 179.382 L
188.3 179.769 L
190.815 179.911 L
193.331 178.948 L
195.846 179.321 L
198.362 178.933 L
200.877 178.078 L
203.392 177.791 L
205.908 177.506 L
208.423 177.161 L
210.938 177.077 L
213.454 177.137 L
215.969 177.347 L
218.485 177.756 L
221 178.148 L
223.515 178.247 L
226.031 178.236 L
228.546 178.577 L
231.062 178.915 L
233.577 178.535 L
236.092 177.764 L
238.608 176.907 L
241.123 176.138 L
243.638 175.841 L
246.154 176.448 L
248.669 176.057 L
251.185 175.692 L
253.7 175.292 L
256.215 175.107 L
258.731 175.187 L
261.246 175.343 L
263.762 175.991 L
266.277 176.207 L
268.792 176.794 L
271.308 177.404 L
273.823 177.079 L
276.338 176.832 L
278.854 175.883 L
281.369 175.77 L
283.885 175.912 L
286.4 175.819 L
288.915 175.354 L
291.431 175.448 L
293.946 177.308 L
296.462 181.078 L
298.977 186.649 L
301.492 193.607 L
304.008 199.191 L
306.523 203.094 L
309.038 206.798 L
311.554 212.514 L
314.069 218.53 L
316.585 223.183 L
319.1 224.719 L
321.615 223.396 L
324.131 218.649 L
326.646 210.872 L
329.162 201.951 L
331.677 191.547 L
334.192 180.984 L
336.708 170.357 L
339.223 160.96 L
341.738 151.852 L
344.254 144.149 L
346.769 136.758 L
349.285 130.252 L
351.8 124.375 L
354.315 119.527 L
356.831 115.802 L
359.346 113.017 L
361.862 110.75 L
364.377 108.853 L
366.892 106.44 L
369.408 102.755 L
371.923 100.05 L
374.438 98.553 L
376.954 96.201 L
379.469 93.806 L
381.985 91.209 L
384.5 88.064 L
384.539 87.959 L
S
GR
GS
[1.00046 0 0 1 0 0] CT
0.959 0.918 0.918 RC
N
173.208 177.66 M
170.692 178.009 L
168.177 177.839 L
165.662 177.995 L
163.146 179.046 L
160.631 180.019 L
158.115 178.576 L
155.6 174.292 L
153.085 165.834 L
150.569 148.521 L
148.054 119.405 L
145.538 80.362 L
143.023 45.052 L
140.508 26.38 L
137.992 29.072 L
135.477 43.502 L
132.962 56.66 L
130.446 62.087 L
127.931 63.178 L
125.415 62.77 L
122.9 62.487 L
120.385 62.319 L
117.869 62.069 L
115.354 61.792 L
112.838 61.22 L
110.323 61.899 L
107.808 62.056 L
105.292 61.905 L
102.777 61.085 L
100.262 59.764 L
97.746 59.337 L
95.231 58.534 L
92.715 58.001 L
90.2 57.586 L
87.685 58.818 L
85.169 61.103 L
82.654 63.473 L
80.138 66.025 L
77.623 69.75 L
75.108 75.709 L
72.592 82.453 L
70.077 89.195 L
67.562 95.163 L
65.046 101.518 L
62.531 108.269 L
60.015 114.961 L
57.5 120.149 L
57.461 120.233 L
57.461 123.452 L
57.461 123.503 L
57.5 123.418 L
60.015 118.159 L
62.531 111.599 L
65.046 105.105 L
67.562 99.085 L
70.077 93.307 L
72.592 86.648 L
75.108 79.865 L
77.623 73.853 L
80.138 69.872 L
82.654 67.021 L
85.169 64.473 L
87.685 62.205 L
90.2 61.088 L
92.715 61.669 L
95.231 62.345 L
97.746 63.142 L
100.262 63.69 L
102.777 65.109 L
105.292 66.124 L
107.808 66.408 L
110.323 66.508 L
112.838 65.864 L
115.354 66.258 L
117.869 66.295 L
120.385 66.432 L
122.9 66.243 L
125.415 66.226 L
127.931 66.462 L
130.446 65.366 L
132.962 59.975 L
135.477 46.663 L
137.992 31.874 L
140.508 29.068 L
143.023 47.702 L
145.538 83.005 L
148.054 122.003 L
150.569 151.097 L
153.085 168.393 L
155.6 176.815 L
158.115 180.736 L
160.631 181.932 L
163.146 180.963 L
165.662 180.202 L
168.177 180.2 L
170.692 180.216 L
173.208 179.536 L
175.723 178.617 L
178.238 177.948 L
180.754 177.82 L
183.269 178.815 L
185.785 178.509 L
188.3 178.506 L
190.815 178.11 L
193.331 177.69 L
195.846 177.529 L
198.362 177.253 L
200.877 177.747 L
203.392 178.451 L
205.908 179.125 L
208.423 180.048 L
210.938 180.489 L
213.454 180.744 L
215.969 180.118 L
218.485 179.772 L
221 179.686 L
223.515 180.263 L
226.031 180.386 L
228.546 180.162 L
231.062 180.134 L
233.577 179.387 L
236.092 178.582 L
238.608 178.448 L
241.123 178.787 L
243.638 178.597 L
246.154 178.747 L
248.669 179.397 L
251.185 180.243 L
253.7 180.669 L
256.215 180.506 L
258.731 180.355 L
261.246 179.899 L
263.762 179.165 L
266.277 178.146 L
268.792 177.305 L
271.308 177.585 L
273.823 178.275 L
276.338 178.498 L
278.854 178.31 L
281.369 178.124 L
283.885 177.937 L
286.4 178.468 L
288.915 178.69 L
291.431 177.749 L
293.946 178.133 L
296.462 182.175 L
298.977 188.494 L
301.492 195.282 L
304.008 200.996 L
306.523 204.939 L
309.038 208.874 L
311.554 214.942 L
314.069 222.013 L
316.585 227.441 L
319.1 228.943 L
321.615 226.515 L
324.131 221.238 L
326.646 213.749 L
329.162 204.394 L
331.677 194.229 L
334.192 184.135 L
336.708 174.372 L
339.223 164.966 L
341.738 156.035 L
344.254 148.334 L
346.769 141.928 L
349.285 137.191 L
351.8 133.462 L
354.315 129.805 L
356.831 127.27 L
359.346 124.895 L
361.862 121.97 L
364.377 118.541 L
366.892 115.354 L
369.408 112.498 L
371.923 110.315 L
374.438 107.899 L
376.954 104.528 L
379.469 100.566 L
381.985 95.617 L
384.5 90.773 L
384.539 90.685 L
384.539 86.8 L
384.539 86.743 L
384.5 86.828 L
381.985 91.174 L
379.469 95.619 L
376.954 99.369 L
374.438 102.821 L
371.923 105.353 L
369.408 107.645 L
366.892 110.363 L
364.377 113.393 L
361.862 116.716 L
359.346 119.801 L
356.831 122.351 L
354.315 124.991 L
351.8 128.62 L
349.285 132.511 L
346.769 137.415 L
344.254 143.722 L
341.738 151.24 L
339.223 160.214 L
336.708 169.875 L
334.192 180.072 L
331.677 190.586 L
329.162 200.986 L
326.646 210.667 L
324.131 218.433 L
321.615 223.784 L
319.1 226.213 L
316.585 224.747 L
314.069 219.282 L
311.554 212.332 L
309.038 206.197 L
306.523 202.187 L
304.008 198.198 L
301.492 192.521 L
298.977 185.816 L
296.462 179.449 L
293.946 175.452 L
291.431 175.226 L
288.915 176.34 L
286.4 176.09 L
283.885 175.581 L
281.369 175.674 L
278.854 175.731 L
276.338 175.757 L
273.823 175.717 L
271.308 175.097 L
268.792 174.704 L
266.277 175.373 L
263.762 176.077 L
261.246 176.694 L
258.731 177.13 L
256.215 177.22 L
253.7 177.516 L
251.185 177.188 L
248.669 176.424 L
246.154 175.939 L
243.638 175.817 L
241.123 176.068 L
238.608 175.862 L
236.092 176.028 L
233.577 176.639 L
231.062 177.286 L
228.546 177.119 L
226.031 177.452 L
223.515 177.528 L
221 176.9 L
218.485 176.948 L
215.969 177.385 L
213.454 178.194 L
210.938 177.811 L
208.423 177.139 L
205.908 176.206 L
203.392 175.548 L
200.877 174.859 L
198.362 174.238 L
195.846 174.627 L
193.331 175.06 L
190.815 175.571 L
188.3 175.926 L
185.785 175.948 L
183.269 176.355 L
180.754 175.535 L
178.238 175.871 L
175.723 176.786 L
cp
f
GR
GS
[1.00046 0 0 1 0 0] CT
0.82 0.639 0.639 RC
1 LJ
0.5 LW
N
57.461 123.503 M
57.5 123.418 L
60.015 118.159 L
62.531 111.599 L
65.046 105.105 L
67.562 99.085 L
70.077 93.307 L
72.592 86.648 L
75.108 79.865 L
77.623 73.853 L
80.138 69.872 L
82.654 67.021 L
85.169 64.473 L
87.685 62.205 L
90.2 61.088 L
92.715 61.669 L
95.231 62.345 L
97.746 63.142 L
100.262 63.69 L
102.777 65.109 L
105.292 66.124 L
107.808 66.408 L
110.323 66.508 L
112.838 65.864 L
115.354 66.258 L
117.869 66.295 L
120.385 66.432 L
122.9 66.243 L
125.415 66.226 L
127.931 66.462 L
130.446 65.366 L
132.962 59.975 L
135.477 46.663 L
137.992 31.874 L
140.508 29.068 L
143.023 47.702 L
145.538 83.005 L
148.054 122.003 L
150.569 151.097 L
153.085 168.393 L
155.6 176.815 L
158.115 180.736 L
160.631 181.932 L
163.146 180.963 L
165.662 180.202 L
168.177 180.2 L
170.692 180.216 L
173.208 179.536 L
175.723 178.617 L
178.238 177.948 L
180.754 177.82 L
183.269 178.815 L
185.785 178.509 L
188.3 178.506 L
190.815 178.11 L
193.331 177.69 L
195.846 177.529 L
198.362 177.253 L
200.877 177.747 L
203.392 178.451 L
205.908 179.125 L
208.423 180.048 L
210.938 180.489 L
213.454 180.744 L
215.969 180.118 L
218.485 179.772 L
221 179.686 L
223.515 180.263 L
226.031 180.386 L
228.546 180.162 L
231.062 180.134 L
233.577 179.387 L
236.092 178.582 L
238.608 178.448 L
241.123 178.787 L
243.638 178.597 L
246.154 178.747 L
248.669 179.397 L
251.185 180.243 L
253.7 180.669 L
256.215 180.506 L
258.731 180.355 L
261.246 179.899 L
263.762 179.165 L
266.277 178.146 L
268.792 177.305 L
271.308 177.585 L
273.823 178.275 L
276.338 178.498 L
278.854 178.31 L
281.369 178.124 L
283.885 177.937 L
286.4 178.468 L
288.915 178.69 L
291.431 177.749 L
293.946 178.133 L
296.462 182.175 L
298.977 188.494 L
301.492 195.282 L
304.008 200.996 L
306.523 204.939 L
309.038 208.874 L
311.554 214.942 L
314.069 222.013 L
316.585 227.441 L
319.1 228.943 L
321.615 226.515 L
324.131 221.238 L
326.646 213.749 L
329.162 204.394 L
331.677 194.229 L
334.192 184.135 L
336.708 174.372 L
339.223 164.966 L
341.738 156.035 L
344.254 148.334 L
346.769 141.928 L
349.285 137.191 L
351.8 133.462 L
354.315 129.805 L
356.831 127.27 L
359.346 124.895 L
361.862 121.97 L
364.377 118.541 L
366.892 115.354 L
369.408 112.498 L
371.923 110.315 L
374.438 107.899 L
376.954 104.528 L
379.469 100.566 L
381.985 95.617 L
384.5 90.773 L
384.539 90.685 L
S
GR
GS
[1.00046 0 0 1 0 0] CT
0.82 0.639 0.639 RC
1 LJ
0.5 LW
N
57.461 120.233 M
57.5 120.149 L
60.015 114.961 L
62.531 108.269 L
65.046 101.518 L
67.562 95.163 L
70.077 89.195 L
72.592 82.453 L
75.108 75.709 L
77.623 69.75 L
80.138 66.025 L
82.654 63.473 L
85.169 61.103 L
87.685 58.818 L
90.2 57.586 L
92.715 58.001 L
95.231 58.534 L
97.746 59.337 L
100.262 59.764 L
102.777 61.085 L
105.292 61.905 L
107.808 62.056 L
110.323 61.899 L
112.838 61.22 L
115.354 61.792 L
117.869 62.069 L
120.385 62.319 L
122.9 62.487 L
125.415 62.77 L
127.931 63.178 L
130.446 62.087 L
132.962 56.66 L
135.477 43.502 L
137.992 29.072 L
140.508 26.38 L
143.023 45.052 L
145.538 80.362 L
148.054 119.405 L
150.569 148.521 L
153.085 165.834 L
155.6 174.292 L
158.115 178.576 L
160.631 180.019 L
163.146 179.046 L
165.662 177.995 L
168.177 177.839 L
170.692 178.009 L
173.208 177.66 L
175.723 176.786 L
178.238 175.871 L
180.754 175.535 L
183.269 176.355 L
185.785 175.948 L
188.3 175.926 L
190.815 175.571 L
193.331 175.06 L
195.846 174.627 L
198.362 174.238 L
200.877 174.859 L
203.392 175.548 L
205.908 176.206 L
208.423 177.139 L
210.938 177.811 L
213.454 178.194 L
215.969 177.385 L
218.485 176.948 L
221 176.9 L
223.515 177.528 L
226.031 177.452 L
228.546 177.119 L
231.062 177.286 L
233.577 176.639 L
236.092 176.028 L
238.608 175.862 L
241.123 176.068 L
243.638 175.817 L
246.154 175.939 L
248.669 176.424 L
251.185 177.188 L
253.7 177.516 L
256.215 177.22 L
258.731 177.13 L
261.246 176.694 L
263.762 176.077 L
266.277 175.373 L
268.792 174.704 L
271.308 175.097 L
273.823 175.717 L
276.338 175.757 L
278.854 175.731 L
281.369 175.674 L
283.885 175.581 L
286.4 176.09 L
288.915 176.34 L
291.431 175.226 L
293.946 175.452 L
296.462 179.449 L
298.977 185.816 L
301.492 192.521 L
304.008 198.198 L
306.523 202.187 L
309.038 206.197 L
311.554 212.332 L
314.069 219.282 L
316.585 224.747 L
319.1 226.213 L
321.615 223.784 L
324.131 218.433 L
326.646 210.667 L
329.162 200.986 L
331.677 190.586 L
334.192 180.072 L
336.708 169.875 L
339.223 160.214 L
341.738 151.24 L
344.254 143.722 L
346.769 137.415 L
349.285 132.511 L
351.8 128.62 L
354.315 124.991 L
356.831 122.351 L
359.346 119.801 L
361.862 116.716 L
364.377 113.393 L
366.892 110.363 L
369.408 107.645 L
371.923 105.353 L
374.438 102.821 L
376.954 99.369 L
379.469 95.619 L
381.985 91.174 L
384.5 86.828 L
384.539 86.743 L
S
GR
GS
[1.00046 0 0 1 0 0] CT
0.6 0.2 0.2 RC
1 LJ
2 LW
N
57.461 121.868 M
57.5 121.783 L
60.015 116.56 L
62.531 109.934 L
65.046 103.312 L
67.562 97.124 L
70.077 91.251 L
72.592 84.551 L
75.108 77.787 L
77.623 71.801 L
80.138 67.948 L
82.654 65.247 L
85.169 62.788 L
87.685 60.512 L
90.2 59.337 L
92.715 59.835 L
95.231 60.44 L
97.746 61.239 L
100.262 61.727 L
102.777 63.097 L
105.292 64.014 L
107.808 64.232 L
110.323 64.203 L
112.838 63.542 L
115.354 64.025 L
117.869 64.182 L
120.385 64.375 L
122.9 64.365 L
125.415 64.498 L
127.931 64.82 L
130.446 63.726 L
132.962 58.318 L
135.477 45.082 L
137.992 30.473 L
140.508 27.724 L
143.023 46.377 L
145.538 81.683 L
148.054 120.704 L
150.569 149.809 L
153.085 167.113 L
155.6 175.553 L
158.115 179.656 L
160.631 180.975 L
163.146 180.004 L
165.662 179.098 L
168.177 179.019 L
170.692 179.112 L
173.208 178.598 L
175.723 177.702 L
178.238 176.909 L
180.754 176.678 L
183.269 177.585 L
185.785 177.229 L
188.3 177.216 L
190.815 176.841 L
193.331 176.375 L
195.846 176.078 L
198.362 175.746 L
200.877 176.303 L
203.392 176.999 L
205.908 177.666 L
208.423 178.593 L
210.938 179.15 L
213.454 179.469 L
215.969 178.751 L
218.485 178.36 L
221 178.293 L
223.515 178.895 L
226.031 178.919 L
228.546 178.641 L
231.062 178.71 L
233.577 178.013 L
236.092 177.305 L
238.608 177.155 L
241.123 177.428 L
243.638 177.207 L
246.154 177.343 L
248.669 177.911 L
251.185 178.715 L
253.7 179.092 L
256.215 178.863 L
258.731 178.743 L
261.246 178.296 L
263.762 177.621 L
266.277 176.759 L
268.792 176.005 L
271.308 176.341 L
273.823 176.996 L
276.338 177.127 L
278.854 177.02 L
281.369 176.899 L
283.885 176.759 L
286.4 177.279 L
288.915 177.515 L
291.431 176.487 L
293.946 176.792 L
296.462 180.812 L
298.977 187.155 L
301.492 193.901 L
304.008 199.597 L
306.523 203.563 L
309.038 207.536 L
311.554 213.637 L
314.069 220.648 L
316.585 226.094 L
319.1 227.578 L
321.615 225.15 L
324.131 219.835 L
326.646 212.208 L
329.162 202.69 L
331.677 192.408 L
334.192 182.103 L
336.708 172.124 L
339.223 162.59 L
341.738 153.637 L
344.254 146.028 L
346.769 139.671 L
349.285 134.851 L
351.8 131.041 L
354.315 127.398 L
356.831 124.81 L
359.346 122.348 L
361.862 119.343 L
364.377 115.967 L
366.892 112.859 L
369.408 110.072 L
371.923 107.834 L
374.438 105.36 L
376.954 101.949 L
379.469 98.092 L
381.985 93.396 L
384.5 88.8 L
384.539 88.714 L
S
GR
%%Trailer
%%Pages: 1
%%EOF
