%!PS-Adobe-3.0 EPSF-3.0
%%Creator: (MATLAB, The Mathworks, Inc. Version 9.10.0.1602886 \(R2021a\). Operating System: Mac OS X)
%%Title: /Users/kosciessa/Desktop/tardis/LNDG/stateswitch/stsw_eeg_task/tfr/figures/b01_alphaTraces_stim_ya.eps
%%CreationDate: 2022-02-22T16:21:54
%%Pages: (atend)
%%BoundingBox:     2     0   388   266
%%LanguageLevel: 3
%%EndComments
%%BeginProlog
%%BeginResource: procset (Apache XML Graphics Std ProcSet) 1.2 0
%%Version: 1.2 0
%%Copyright: (Copyright 2001-2003,2010 The Apache Software Foundation. License terms: http://www.apache.org/licenses/LICENSE-2.0)
/bd{bind def}bind def
/ld{load def}bd
/GR/grestore ld
/GS/gsave ld
/RM/rmoveto ld
/C/curveto ld
/t/show ld
/L/lineto ld
/ML/setmiterlimit ld
/CT/concat ld
/f/fill ld
/N/newpath ld
/S/stroke ld
/CC/setcmykcolor ld
/A/ashow ld
/cp/closepath ld
/RC/setrgbcolor ld
/LJ/setlinejoin ld
/GC/setgray ld
/LW/setlinewidth ld
/M/moveto ld
/re {4 2 roll M
1 index 0 rlineto
0 exch rlineto
neg 0 rlineto
cp } bd
/_ctm matrix def
/_tm matrix def
/BT { _ctm currentmatrix pop matrix _tm copy pop 0 0 moveto } bd
/ET { _ctm setmatrix } bd
/iTm { _ctm setmatrix _tm concat } bd
/Tm { _tm astore pop iTm 0 0 moveto } bd
/ux 0.0 def
/uy 0.0 def
/F {
  /Tp exch def
  /Tf exch def
  Tf findfont Tp scalefont setfont
  /cf Tf def  /cs Tp def
} bd
/ULS {currentpoint /uy exch def /ux exch def} bd
/ULE {
  /Tcx currentpoint pop def
  gsave
  newpath
  cf findfont cs scalefont dup
  /FontMatrix get 0 get /Ts exch def /FontInfo get dup
  /UnderlinePosition get Ts mul /To exch def
  /UnderlineThickness get Ts mul /Tt exch def
  ux uy To add moveto  Tcx uy To add lineto
  Tt setlinewidth stroke
  grestore
} bd
/OLE {
  /Tcx currentpoint pop def
  gsave
  newpath
  cf findfont cs scalefont dup
  /FontMatrix get 0 get /Ts exch def /FontInfo get dup
  /UnderlinePosition get Ts mul /To exch def
  /UnderlineThickness get Ts mul /Tt exch def
  ux uy To add cs add moveto Tcx uy To add cs add lineto
  Tt setlinewidth stroke
  grestore
} bd
/SOE {
  /Tcx currentpoint pop def
  gsave
  newpath
  cf findfont cs scalefont dup
  /FontMatrix get 0 get /Ts exch def /FontInfo get dup
  /UnderlinePosition get Ts mul /To exch def
  /UnderlineThickness get Ts mul /Tt exch def
  ux uy To add cs 10 mul 26 idiv add moveto Tcx uy To add cs 10 mul 26 idiv add lineto
  Tt setlinewidth stroke
  grestore
} bd
/QT {
/Y22 exch store
/X22 exch store
/Y21 exch store
/X21 exch store
currentpoint
/Y21 load 2 mul add 3 div exch
/X21 load 2 mul add 3 div exch
/X21 load 2 mul /X22 load add 3 div
/Y21 load 2 mul /Y22 load add 3 div
/X22 load /Y22 load curveto
} bd
/SSPD {
dup length /d exch dict def
{
/v exch def
/k exch def
currentpagedevice k known {
/cpdv currentpagedevice k get def
v cpdv ne {
/upd false def
/nullv v type /nulltype eq def
/nullcpdv cpdv type /nulltype eq def
nullv nullcpdv or
{
/upd true def
} {
/sametype v type cpdv type eq def
sametype {
v type /arraytype eq {
/vlen v length def
/cpdvlen cpdv length def
vlen cpdvlen eq {
0 1 vlen 1 sub {
/i exch def
/obj v i get def
/cpdobj cpdv i get def
obj cpdobj ne {
/upd true def
exit
} if
} for
} {
/upd true def
} ifelse
} {
v type /dicttype eq {
v {
/dv exch def
/dk exch def
/cpddv cpdv dk get def
dv cpddv ne {
/upd true def
exit
} if
} forall
} {
/upd true def
} ifelse
} ifelse
} if
} ifelse
upd true eq {
d k v put
} if
} if
} if
} forall
d length 0 gt {
d setpagedevice
} if
} bd
/RE { % /NewFontName [NewEncodingArray] /FontName RE -
  findfont dup length dict begin
  {
    1 index /FID ne
    {def} {pop pop} ifelse
  } forall
  /Encoding exch def
  /FontName 1 index def
  currentdict definefont pop
  end
} bind def
%%EndResource
%%BeginResource: procset (Apache XML Graphics EPS ProcSet) 1.0 0
%%Version: 1.0 0
%%Copyright: (Copyright 2002-2003 The Apache Software Foundation. License terms: http://www.apache.org/licenses/LICENSE-2.0)
/BeginEPSF { %def
/b4_Inc_state save def         % Save state for cleanup
/dict_count countdictstack def % Count objects on dict stack
/op_count count 1 sub def      % Count objects on operand stack
userdict begin                 % Push userdict on dict stack
/showpage { } def              % Redefine showpage, { } = null proc
0 setgray 0 setlinecap         % Prepare graphics state
1 setlinewidth 0 setlinejoin
10 setmiterlimit [ ] 0 setdash newpath
/languagelevel where           % If level not equal to 1 then
{pop languagelevel             % set strokeadjust and
1 ne                           % overprint to their defaults.
{false setstrokeadjust false setoverprint
} if
} if
} bd
/EndEPSF { %def
count op_count sub {pop} repeat            % Clean up stacks
countdictstack dict_count sub {end} repeat
b4_Inc_state restore
} bd
%%EndResource
%FOPBeginFontDict
%%IncludeResource: font Courier-Oblique
%%IncludeResource: font Courier-BoldOblique
%%IncludeResource: font Courier-Bold
%%IncludeResource: font ZapfDingbats
%%IncludeResource: font Symbol
%%IncludeResource: font Helvetica
%%IncludeResource: font Helvetica-Oblique
%%IncludeResource: font Helvetica-Bold
%%IncludeResource: font Helvetica-BoldOblique
%%IncludeResource: font Times-Roman
%%IncludeResource: font Times-Italic
%%IncludeResource: font Times-Bold
%%IncludeResource: font Times-BoldItalic
%%IncludeResource: font Courier
%FOPEndFontDict
%%BeginResource: encoding WinAnsiEncoding
/WinAnsiEncoding [
/.notdef /.notdef /.notdef /.notdef /.notdef
/.notdef /.notdef /.notdef /.notdef /.notdef
/.notdef /.notdef /.notdef /.notdef /.notdef
/.notdef /.notdef /.notdef /.notdef /.notdef
/.notdef /.notdef /.notdef /.notdef /.notdef
/.notdef /.notdef /.notdef /.notdef /.notdef
/.notdef /.notdef /space /exclam /quotedbl
/numbersign /dollar /percent /ampersand /quotesingle
/parenleft /parenright /asterisk /plus /comma
/hyphen /period /slash /zero /one
/two /three /four /five /six
/seven /eight /nine /colon /semicolon
/less /equal /greater /question /at
/A /B /C /D /E
/F /G /H /I /J
/K /L /M /N /O
/P /Q /R /S /T
/U /V /W /X /Y
/Z /bracketleft /backslash /bracketright /asciicircum
/underscore /quoteleft /a /b /c
/d /e /f /g /h
/i /j /k /l /m
/n /o /p /q /r
/s /t /u /v /w
/x /y /z /braceleft /bar
/braceright /asciitilde /bullet /Euro /bullet
/quotesinglbase /florin /quotedblbase /ellipsis /dagger
/daggerdbl /circumflex /perthousand /Scaron /guilsinglleft
/OE /bullet /Zcaron /bullet /bullet
/quoteleft /quoteright /quotedblleft /quotedblright /bullet
/endash /emdash /asciitilde /trademark /scaron
/guilsinglright /oe /bullet /zcaron /Ydieresis
/space /exclamdown /cent /sterling /currency
/yen /brokenbar /section /dieresis /copyright
/ordfeminine /guillemotleft /logicalnot /sfthyphen /registered
/macron /degree /plusminus /twosuperior /threesuperior
/acute /mu /paragraph /middot /cedilla
/onesuperior /ordmasculine /guillemotright /onequarter /onehalf
/threequarters /questiondown /Agrave /Aacute /Acircumflex
/Atilde /Adieresis /Aring /AE /Ccedilla
/Egrave /Eacute /Ecircumflex /Edieresis /Igrave
/Iacute /Icircumflex /Idieresis /Eth /Ntilde
/Ograve /Oacute /Ocircumflex /Otilde /Odieresis
/multiply /Oslash /Ugrave /Uacute /Ucircumflex
/Udieresis /Yacute /Thorn /germandbls /agrave
/aacute /acircumflex /atilde /adieresis /aring
/ae /ccedilla /egrave /eacute /ecircumflex
/edieresis /igrave /iacute /icircumflex /idieresis
/eth /ntilde /ograve /oacute /ocircumflex
/otilde /odieresis /divide /oslash /ugrave
/uacute /ucircumflex /udieresis /yacute /thorn
/ydieresis
] def
%%EndResource
%FOPBeginFontReencode
/Courier-Oblique findfont
dup length dict begin
  {1 index /FID ne {def} {pop pop} ifelse} forall
  /Encoding WinAnsiEncoding def
  currentdict
end
/Courier-Oblique exch definefont pop
/Courier-BoldOblique findfont
dup length dict begin
  {1 index /FID ne {def} {pop pop} ifelse} forall
  /Encoding WinAnsiEncoding def
  currentdict
end
/Courier-BoldOblique exch definefont pop
/Courier-Bold findfont
dup length dict begin
  {1 index /FID ne {def} {pop pop} ifelse} forall
  /Encoding WinAnsiEncoding def
  currentdict
end
/Courier-Bold exch definefont pop
/Helvetica findfont
dup length dict begin
  {1 index /FID ne {def} {pop pop} ifelse} forall
  /Encoding WinAnsiEncoding def
  currentdict
end
/Helvetica exch definefont pop
/Helvetica-Oblique findfont
dup length dict begin
  {1 index /FID ne {def} {pop pop} ifelse} forall
  /Encoding WinAnsiEncoding def
  currentdict
end
/Helvetica-Oblique exch definefont pop
/Helvetica-Bold findfont
dup length dict begin
  {1 index /FID ne {def} {pop pop} ifelse} forall
  /Encoding WinAnsiEncoding def
  currentdict
end
/Helvetica-Bold exch definefont pop
/Helvetica-BoldOblique findfont
dup length dict begin
  {1 index /FID ne {def} {pop pop} ifelse} forall
  /Encoding WinAnsiEncoding def
  currentdict
end
/Helvetica-BoldOblique exch definefont pop
/Times-Roman findfont
dup length dict begin
  {1 index /FID ne {def} {pop pop} ifelse} forall
  /Encoding WinAnsiEncoding def
  currentdict
end
/Times-Roman exch definefont pop
/Times-Italic findfont
dup length dict begin
  {1 index /FID ne {def} {pop pop} ifelse} forall
  /Encoding WinAnsiEncoding def
  currentdict
end
/Times-Italic exch definefont pop
/Times-Bold findfont
dup length dict begin
  {1 index /FID ne {def} {pop pop} ifelse} forall
  /Encoding WinAnsiEncoding def
  currentdict
end
/Times-Bold exch definefont pop
/Times-BoldItalic findfont
dup length dict begin
  {1 index /FID ne {def} {pop pop} ifelse} forall
  /Encoding WinAnsiEncoding def
  currentdict
end
/Times-BoldItalic exch definefont pop
/Courier findfont
dup length dict begin
  {1 index /FID ne {def} {pop pop} ifelse} forall
  /Encoding WinAnsiEncoding def
  currentdict
end
/Courier exch definefont pop
%FOPEndFontReencode
%%EndProlog
%%Page: 1 1
%%PageBoundingBox: 0 0 425 283
%%BeginPageSetup
[1 0 0 -1 0 283] CT
%%EndPageSetup
GS
[1.00046 0 0 1 0 0] CT
1 GC
N
0 0 425 283 re
f
GR
GS
[1.00046 0 0 1 0 0] CT
1 GC
N
0 0 425 283 re
f
GR
GS
[1.00046 0 0 1 0 0] CT
1 GC
N
64.5 248.5 M
384.5 248.5 L
384.5 21 L
64.5 21 L
cp
f
GR
GS
[1.00046 0 0 1 0 0] CT
0.149 GC
2 setlinecap
1 LJ
0.5 LW
N
64.5 248.5 M
384.5 248.5 L
S
GR
GS
[1.00046 0 0 1 0 0] CT
0.149 GC
2 setlinecap
1 LJ
0.5 LW
N
64.5 248.5 M
64.5 245.304 L
S
GR
GS
[1.00046 0 0 1 0 0] CT
0.149 GC
2 setlinecap
1 LJ
0.5 LW
N
128.5 248.5 M
128.5 245.304 L
S
GR
GS
[1.00046 0 0 1 0 0] CT
0.149 GC
2 setlinecap
1 LJ
0.5 LW
N
192.5 248.5 M
192.5 245.304 L
S
GR
GS
[1.00046 0 0 1 0 0] CT
0.149 GC
2 setlinecap
1 LJ
0.5 LW
N
256.5 248.5 M
256.5 245.304 L
S
GR
GS
[1.00046 0 0 1 0 0] CT
0.149 GC
2 setlinecap
1 LJ
0.5 LW
N
320.5 248.5 M
320.5 245.304 L
S
GR
GS
[1.00046 0 0 1 0 0] CT
0.149 GC
2 setlinecap
1 LJ
0.5 LW
N
384.5 248.5 M
384.5 245.304 L
S
GR
GS
[1.00046 0 0 1 64.52987 252.89935] CT
0.149 GC
/Helvetica 12 F
GS
[1 0 0 1 0 0] CT
-8.5 12 moveto 
1 -1 scale
(0.5) t 
GR
GR
GS
[1.00046 0 0 1 128.55951 252.89935] CT
0.149 GC
/Helvetica 12 F
GS
[1 0 0 1 0 0] CT
-3.5 12 moveto 
1 -1 scale
(1) t 
GR
GR
GS
[1.00046 0 0 1 192.58916 252.89935] CT
0.149 GC
/Helvetica 12 F
GS
[1 0 0 1 0 0] CT
-8.5 12 moveto 
1 -1 scale
(1.5) t 
GR
GR
GS
[1.00046 0 0 1 256.6188 252.89935] CT
0.149 GC
/Helvetica 12 F
GS
[1 0 0 1 0 0] CT
-3.5 12 moveto 
1 -1 scale
(2) t 
GR
GR
GS
[1.00046 0 0 1 320.64844 252.89935] CT
0.149 GC
/Helvetica 12 F
GS
[1 0 0 1 0 0] CT
-8.5 12 moveto 
1 -1 scale
(2.5) t 
GR
GR
GS
[1.00046 0 0 1 384.67808 252.89935] CT
0.149 GC
/Helvetica 12 F
GS
[1 0 0 1 0 0] CT
-3.5 12 moveto 
1 -1 scale
(3) t 
GR
GR
GS
[1.00046 0 0 1 224.60413 268.49976] CT
0.149 GC
/Helvetica 12 F
GS
[1 0 0 1 0 0] CT
-21 12 moveto 
1 -1 scale
(Time \(s\)) t 
GR
GR
GS
[1.00046 0 0 1 0 0] CT
0.149 GC
2 setlinecap
1 LJ
0.5 LW
N
64.5 248.5 M
64.5 21 L
S
GR
GS
[1.00046 0 0 1 0 0] CT
0.149 GC
2 setlinecap
1 LJ
0.5 LW
N
64.5 248.5 M
67.696 248.5 L
S
GR
GS
[1.00046 0 0 1 0 0] CT
0.149 GC
2 setlinecap
1 LJ
0.5 LW
N
64.5 210.583 M
67.696 210.583 L
S
GR
GS
[1.00046 0 0 1 0 0] CT
0.149 GC
2 setlinecap
1 LJ
0.5 LW
N
64.5 172.666 M
67.696 172.666 L
S
GR
GS
[1.00046 0 0 1 0 0] CT
0.149 GC
2 setlinecap
1 LJ
0.5 LW
N
64.5 134.75 M
67.696 134.75 L
S
GR
GS
[1.00046 0 0 1 0 0] CT
0.149 GC
2 setlinecap
1 LJ
0.5 LW
N
64.5 96.833 M
67.696 96.833 L
S
GR
GS
[1.00046 0 0 1 0 0] CT
0.149 GC
2 setlinecap
1 LJ
0.5 LW
N
64.5 58.916 M
67.696 58.916 L
S
GR
GS
[1.00046 0 0 1 0 0] CT
0.149 GC
2 setlinecap
1 LJ
0.5 LW
N
64.5 21 M
67.696 21 L
S
GR
GS
[1.00046 0 0 1 60.12783 248.49957] CT
0.149 GC
/Helvetica 12 F
GS
[1 0 0 1 0 0] CT
-29 4.5 moveto 
1 -1 scale
(-5.24) t 
GR
GR
GS
[1.00046 0 0 1 60.12783 210.58293] CT
0.149 GC
/Helvetica 12 F
GS
[1 0 0 1 0 0] CT
-29 4.5 moveto 
1 -1 scale
(-5.22) t 
GR
GR
GS
[1.00046 0 0 1 60.12783 172.66631] CT
0.149 GC
/Helvetica 12 F
GS
[1 0 0 1 0 0] CT
-22 4.5 moveto 
1 -1 scale
(-5.2) t 
GR
GR
GS
[1.00046 0 0 1 60.12783 134.74968] CT
0.149 GC
/Helvetica 12 F
GS
[1 0 0 1 0 0] CT
-29 4.5 moveto 
1 -1 scale
(-5.18) t 
GR
GR
GS
[1.00046 0 0 1 60.12783 96.83305] CT
0.149 GC
/Helvetica 12 F
GS
[1 0 0 1 0 0] CT
-29 4.5 moveto 
1 -1 scale
(-5.16) t 
GR
GR
GS
[1.00046 0 0 1 60.12783 58.91641] CT
0.149 GC
/Helvetica 12 F
GS
[1 0 0 1 0 0] CT
-29 4.5 moveto 
1 -1 scale
(-5.14) t 
GR
GR
GS
[1.00046 0 0 1 60.12783 20.99978] CT
0.149 GC
/Helvetica 12 F
GS
[1 0 0 1 0 0] CT
-29 4.5 moveto 
1 -1 scale
(-5.12) t 
GR
GR
GS
[0 -1 1.00046 0 29.01343 134.74968] CT
0.149 GC
/Helvetica 12 F
GS
[1 0 0 1 0 0] CT
-57 -18 moveto 
1 -1 scale
(8-12 Hz Alpha Power) t 
GR
GR
GS
[0 -1 1.00046 0 29.01343 134.74968] CT
0.149 GC
/Helvetica 12 F
GS
[1 0 0 1 0 0] CT
-46 -3 moveto 
1 -1 scale
(\(a.u.; normalized\)) t 
GR
GR
GS
[1.00046 0 0 1 0 0] CT
0.996 0.98 0.98 RC
N
96.5 131 M
102.9 138.222 L
109.3 142.009 L
115.7 140.839 L
122.1 135.323 L
128.5 133.395 L
134.9 131.873 L
141.3 132.712 L
147.7 138.555 L
154.1 143.82 L
160.5 146.602 L
166.9 147.477 L
173.3 141.777 L
179.7 135.238 L
186.1 133.216 L
192.5 126.813 L
198.9 121.125 L
205.3 115.944 L
211.7 110.727 L
218.1 106.558 L
224.5 104.923 L
230.9 104.547 L
237.3 98.693 L
243.7 94.228 L
250.1 89.824 L
256.5 91.136 L
262.9 90.207 L
269.3 89.475 L
275.7 90.862 L
282.1 97.368 L
288.5 102.095 L
294.9 101.938 L
301.3 98.425 L
307.7 90.989 L
314.1 83.478 L
320.5 74.936 L
326.9 69.77 L
333.3 72.969 L
339.7 71.575 L
346.1 68.957 L
352.5 71.017 L
358.9 75.284 L
365.3 73.977 L
371.7 68.944 L
378.1 62.937 L
384.5 57.32 L
384.538 57.303 L
384.538 21.499 L
384.538 21.286 L
384.5 21.301 L
378.1 26.43 L
371.7 32.281 L
365.3 36.673 L
358.9 37.011 L
352.5 31.461 L
346.1 29.177 L
339.7 32.689 L
333.3 35.316 L
326.9 33.535 L
320.5 40.234 L
314.1 50.137 L
307.7 57.936 L
301.3 64.206 L
294.9 66.717 L
288.5 66.866 L
282.1 62.104 L
275.7 54.891 L
269.3 54.261 L
262.9 56.845 L
256.5 58.862 L
250.1 58.968 L
243.7 63.869 L
237.3 68.908 L
230.9 75.277 L
224.5 75.441 L
218.1 76.385 L
211.7 80.009 L
205.3 85.196 L
198.9 90.781 L
192.5 97.155 L
186.1 104.35 L
179.7 107.281 L
173.3 112.302 L
166.9 116.697 L
160.5 116.256 L
154.1 115.08 L
147.7 111.84 L
141.3 106.668 L
134.9 105.876 L
128.5 107.515 L
122.1 108.935 L
115.7 113.874 L
109.3 115.449 L
102.9 113.622 L
96.5 108.845 L
90.1 104.937 L
83.7 101.276 L
77.3 93.316 L
70.9 71.862 L
64.5 35.292 L
64.462 34.969 L
64.462 35.103 L
64.462 58.376 L
64.5 58.705 L
70.9 96.043 L
77.3 117.176 L
83.7 124.055 L
90.1 126.647 L
cp
f
GR
GS
[1.00046 0 0 1 0 0] CT
0.98 0.91 0.91 RC
1 LJ
0.5 LW
N
64.462 58.376 M
64.5 58.705 L
70.9 96.043 L
77.3 117.176 L
83.7 124.055 L
90.1 126.647 L
96.5 131 L
102.9 138.222 L
109.3 142.009 L
115.7 140.839 L
122.1 135.323 L
128.5 133.395 L
134.9 131.873 L
141.3 132.712 L
147.7 138.555 L
154.1 143.82 L
160.5 146.602 L
166.9 147.477 L
173.3 141.777 L
179.7 135.238 L
186.1 133.216 L
192.5 126.813 L
198.9 121.125 L
205.3 115.944 L
211.7 110.727 L
218.1 106.558 L
224.5 104.923 L
230.9 104.547 L
237.3 98.693 L
243.7 94.228 L
250.1 89.824 L
256.5 91.136 L
262.9 90.207 L
269.3 89.475 L
275.7 90.862 L
282.1 97.368 L
288.5 102.095 L
294.9 101.938 L
301.3 98.425 L
307.7 90.989 L
314.1 83.478 L
320.5 74.936 L
326.9 69.77 L
333.3 72.969 L
339.7 71.575 L
346.1 68.957 L
352.5 71.017 L
358.9 75.284 L
365.3 73.977 L
371.7 68.944 L
378.1 62.937 L
384.5 57.32 L
384.538 57.303 L
S
GR
GS
[1.00046 0 0 1 0 0] CT
0.98 0.91 0.91 RC
1 LJ
0.5 LW
N
64.462 34.969 M
64.5 35.292 L
70.9 71.862 L
77.3 93.316 L
83.7 101.276 L
90.1 104.937 L
96.5 108.845 L
102.9 113.622 L
109.3 115.449 L
115.7 113.874 L
122.1 108.935 L
128.5 107.515 L
134.9 105.876 L
141.3 106.668 L
147.7 111.84 L
154.1 115.08 L
160.5 116.256 L
166.9 116.697 L
173.3 112.302 L
179.7 107.281 L
186.1 104.35 L
192.5 97.155 L
198.9 90.781 L
205.3 85.196 L
211.7 80.009 L
218.1 76.385 L
224.5 75.441 L
230.9 75.277 L
237.3 68.908 L
243.7 63.869 L
250.1 58.968 L
256.5 58.862 L
262.9 56.845 L
269.3 54.261 L
275.7 54.891 L
282.1 62.104 L
288.5 66.866 L
294.9 66.717 L
301.3 64.206 L
307.7 57.936 L
314.1 50.137 L
320.5 40.234 L
326.9 33.535 L
333.3 35.316 L
339.7 32.689 L
346.1 29.177 L
352.5 31.461 L
358.9 37.011 L
365.3 36.673 L
371.7 32.281 L
378.1 26.43 L
384.5 21.301 L
384.538 21.286 L
S
GR
GS
[1.00046 0 0 1 0 0] CT
0.961 0.8 0.8 RC
1 LJ
2 LW
N
64.462 46.673 M
64.5 46.999 L
70.9 83.952 L
77.3 105.247 L
83.7 112.666 L
90.1 115.792 L
96.5 119.922 L
102.9 125.922 L
109.3 128.729 L
115.7 127.357 L
122.1 122.129 L
128.5 120.455 L
134.9 118.874 L
141.3 119.69 L
147.7 125.197 L
154.1 129.449 L
160.5 131.429 L
166.9 132.087 L
173.3 127.039 L
179.7 121.259 L
186.1 118.782 L
192.5 111.984 L
198.9 105.954 L
205.3 100.569 L
211.7 95.368 L
218.1 91.471 L
224.5 90.181 L
230.9 89.912 L
237.3 83.8 L
243.7 79.049 L
250.1 74.397 L
256.5 74.999 L
262.9 73.526 L
269.3 71.868 L
275.7 72.876 L
282.1 79.737 L
288.5 84.481 L
294.9 84.328 L
301.3 81.316 L
307.7 74.463 L
314.1 66.807 L
320.5 57.586 L
326.9 51.652 L
333.3 54.142 L
339.7 52.133 L
346.1 49.067 L
352.5 51.239 L
358.9 56.147 L
365.3 55.326 L
371.7 50.612 L
378.1 44.683 L
384.5 39.31 L
384.538 39.295 L
S
GR
GS
[1.00046 0 0 1 0 0] CT
0.99 0.959 0.959 RC
N
96.5 150.499 M
102.9 156.245 L
109.3 161.311 L
115.7 160.916 L
122.1 163.678 L
128.5 167.154 L
134.9 172.797 L
141.3 180.812 L
147.7 187.264 L
154.1 189.893 L
160.5 189.324 L
166.9 193.344 L
173.3 198.346 L
179.7 203.345 L
186.1 208.629 L
192.5 214.081 L
198.9 218.541 L
205.3 222.027 L
211.7 220.842 L
218.1 212.829 L
224.5 205.379 L
230.9 197.014 L
237.3 192.525 L
243.7 188.208 L
250.1 188.837 L
256.5 192.586 L
262.9 195.201 L
269.3 192.066 L
275.7 186.532 L
282.1 182.876 L
288.5 186.502 L
294.9 191.591 L
301.3 193.014 L
307.7 195.91 L
314.1 197.208 L
320.5 196.77 L
326.9 195.142 L
333.3 190.636 L
339.7 186.258 L
346.1 184.053 L
352.5 184.854 L
358.9 181.405 L
365.3 177.527 L
371.7 171.956 L
378.1 167.119 L
384.5 163.436 L
384.538 163.393 L
384.538 138.295 L
384.538 138.147 L
384.5 138.188 L
378.1 142.316 L
371.7 146.431 L
365.3 151.093 L
358.9 156.466 L
352.5 161.165 L
346.1 161.145 L
339.7 162.878 L
333.3 166.977 L
326.9 172.104 L
320.5 176.514 L
314.1 179.633 L
307.7 178.239 L
301.3 174.934 L
294.9 173.47 L
288.5 168.712 L
282.1 164.886 L
275.7 167.001 L
269.3 170.197 L
262.9 172.463 L
256.5 170.168 L
250.1 167.165 L
243.7 167.549 L
237.3 172.574 L
230.9 176.725 L
224.5 184.597 L
218.1 191.765 L
211.7 200.964 L
205.3 203.249 L
198.9 200.773 L
192.5 195.832 L
186.1 189.22 L
179.7 183.243 L
173.3 177.382 L
166.9 172.553 L
160.5 169.317 L
154.1 171.448 L
147.7 169.495 L
141.3 163.792 L
134.9 155.85 L
128.5 150.145 L
122.1 146.415 L
115.7 142.665 L
109.3 142.23 L
102.9 137.613 L
96.5 132.52 L
90.1 132.746 L
83.7 128.259 L
77.3 113.817 L
70.9 89.75 L
64.5 49.991 L
64.462 49.612 L
64.462 49.737 L
64.462 71.131 L
64.5 71.514 L
70.9 112.878 L
77.3 136.128 L
83.7 149.166 L
90.1 152.324 L
cp
f
GR
GS
[1.00046 0 0 1 0 0] CT
0.957 0.82 0.82 RC
1 LJ
0.5 LW
N
64.462 71.131 M
64.5 71.514 L
70.9 112.878 L
77.3 136.128 L
83.7 149.166 L
90.1 152.324 L
96.5 150.499 L
102.9 156.245 L
109.3 161.311 L
115.7 160.916 L
122.1 163.678 L
128.5 167.154 L
134.9 172.797 L
141.3 180.812 L
147.7 187.264 L
154.1 189.893 L
160.5 189.324 L
166.9 193.344 L
173.3 198.346 L
179.7 203.345 L
186.1 208.629 L
192.5 214.081 L
198.9 218.541 L
205.3 222.027 L
211.7 220.842 L
218.1 212.829 L
224.5 205.379 L
230.9 197.014 L
237.3 192.525 L
243.7 188.208 L
250.1 188.837 L
256.5 192.586 L
262.9 195.201 L
269.3 192.066 L
275.7 186.532 L
282.1 182.876 L
288.5 186.502 L
294.9 191.591 L
301.3 193.014 L
307.7 195.91 L
314.1 197.208 L
320.5 196.77 L
326.9 195.142 L
333.3 190.636 L
339.7 186.258 L
346.1 184.053 L
352.5 184.854 L
358.9 181.405 L
365.3 177.527 L
371.7 171.956 L
378.1 167.119 L
384.5 163.436 L
384.538 163.393 L
S
GR
GS
[1.00046 0 0 1 0 0] CT
0.957 0.82 0.82 RC
1 LJ
0.5 LW
N
64.462 49.612 M
64.5 49.991 L
70.9 89.75 L
77.3 113.817 L
83.7 128.259 L
90.1 132.746 L
96.5 132.52 L
102.9 137.613 L
109.3 142.23 L
115.7 142.665 L
122.1 146.415 L
128.5 150.145 L
134.9 155.85 L
141.3 163.792 L
147.7 169.495 L
154.1 171.448 L
160.5 169.317 L
166.9 172.553 L
173.3 177.382 L
179.7 183.243 L
186.1 189.22 L
192.5 195.832 L
198.9 200.773 L
205.3 203.249 L
211.7 200.964 L
218.1 191.765 L
224.5 184.597 L
230.9 176.725 L
237.3 172.574 L
243.7 167.549 L
250.1 167.165 L
256.5 170.168 L
262.9 172.463 L
269.3 170.197 L
275.7 167.001 L
282.1 164.886 L
288.5 168.712 L
294.9 173.47 L
301.3 174.934 L
307.7 178.239 L
314.1 179.633 L
320.5 176.514 L
326.9 172.104 L
333.3 166.977 L
339.7 162.878 L
346.1 161.145 L
352.5 161.165 L
358.9 156.466 L
365.3 151.093 L
371.7 146.431 L
378.1 142.316 L
384.5 138.188 L
384.538 138.147 L
S
GR
GS
[1.00046 0 0 1 0 0] CT
0.898 0.6 0.6 RC
1 LJ
2 LW
N
64.462 60.372 M
64.5 60.752 L
70.9 101.314 L
77.3 124.973 L
83.7 138.713 L
90.1 142.536 L
96.5 141.51 L
102.9 146.928 L
109.3 151.771 L
115.7 151.791 L
122.1 155.046 L
128.5 158.65 L
134.9 164.324 L
141.3 172.302 L
147.7 178.38 L
154.1 180.67 L
160.5 179.321 L
166.9 182.948 L
173.3 187.864 L
179.7 193.294 L
186.1 198.924 L
192.5 204.956 L
198.9 209.656 L
205.3 212.638 L
211.7 210.903 L
218.1 202.298 L
224.5 194.988 L
230.9 186.869 L
237.3 182.549 L
243.7 177.878 L
250.1 178.002 L
256.5 181.377 L
262.9 183.833 L
269.3 181.131 L
275.7 176.767 L
282.1 173.881 L
288.5 177.608 L
294.9 182.531 L
301.3 183.974 L
307.7 187.074 L
314.1 188.42 L
320.5 186.642 L
326.9 183.623 L
333.3 178.807 L
339.7 174.567 L
346.1 172.599 L
352.5 173.009 L
358.9 168.935 L
365.3 164.311 L
371.7 159.194 L
378.1 154.718 L
384.5 150.812 L
384.538 150.77 L
S
GR
GS
[1.00046 0 0 1 0 0] CT
0.98 0.939 0.939 RC
N
115.7 155.483 M
122.1 164.053 L
128.5 169.852 L
134.9 174.99 L
141.3 181.126 L
147.7 183.425 L
154.1 182.127 L
160.5 185.206 L
166.9 190.439 L
173.3 189.185 L
179.7 190.381 L
186.1 192.859 L
192.5 194.209 L
198.9 198.288 L
205.3 201.895 L
211.7 205.68 L
218.1 206.706 L
224.5 209.153 L
230.9 210.641 L
237.3 212.983 L
243.7 211.54 L
250.1 201.651 L
256.5 194.488 L
262.9 191.356 L
269.3 197.1 L
275.7 202.678 L
282.1 210.485 L
288.5 215.558 L
294.9 220.22 L
301.3 218.461 L
307.7 215.829 L
314.1 211.21 L
320.5 209.588 L
326.9 212.448 L
333.3 216.526 L
339.7 218.426 L
346.1 220.405 L
352.5 221.146 L
358.9 215.123 L
365.3 208.424 L
371.7 210 L
378.1 209.042 L
384.5 206.515 L
384.538 206.506 L
384.538 181.088 L
384.538 180.94 L
384.5 180.944 L
378.1 183.56 L
371.7 183.925 L
365.3 181.971 L
358.9 189.372 L
352.5 195.413 L
346.1 194.69 L
339.7 192.315 L
333.3 189.773 L
326.9 186.387 L
320.5 184.179 L
314.1 186.678 L
307.7 192.124 L
301.3 195.972 L
294.9 199.459 L
288.5 197.345 L
282.1 193.189 L
275.7 185.697 L
269.3 179.115 L
262.9 173.249 L
256.5 175.019 L
250.1 180.964 L
243.7 190.61 L
237.3 192.485 L
230.9 190.835 L
224.5 190.081 L
218.1 188.011 L
211.7 187.453 L
205.3 184.041 L
198.9 181.108 L
192.5 177.006 L
186.1 176.538 L
179.7 173.97 L
173.3 171.401 L
166.9 172.116 L
160.5 166.324 L
154.1 162.826 L
147.7 164.604 L
141.3 164.355 L
134.9 159.46 L
128.5 153.367 L
122.1 146.401 L
115.7 136.158 L
109.3 126.167 L
102.9 116.621 L
96.5 113.515 L
90.1 110.294 L
83.7 100.85 L
77.3 91.927 L
70.9 73.98 L
64.5 36.599 L
64.462 36.233 L
64.462 36.371 L
64.462 58.16 L
64.5 58.519 L
70.9 94.235 L
77.3 112.668 L
83.7 121.388 L
90.1 128.808 L
96.5 131.019 L
102.9 134.572 L
109.3 145.509 L
cp
f
GR
GS
[1.00046 0 0 1 0 0] CT
0.91 0.729 0.729 RC
1 LJ
0.5 LW
N
64.462 58.16 M
64.5 58.519 L
70.9 94.235 L
77.3 112.668 L
83.7 121.388 L
90.1 128.808 L
96.5 131.019 L
102.9 134.572 L
109.3 145.509 L
115.7 155.483 L
122.1 164.053 L
128.5 169.852 L
134.9 174.99 L
141.3 181.126 L
147.7 183.425 L
154.1 182.127 L
160.5 185.206 L
166.9 190.439 L
173.3 189.185 L
179.7 190.381 L
186.1 192.859 L
192.5 194.209 L
198.9 198.288 L
205.3 201.895 L
211.7 205.68 L
218.1 206.706 L
224.5 209.153 L
230.9 210.641 L
237.3 212.983 L
243.7 211.54 L
250.1 201.651 L
256.5 194.488 L
262.9 191.356 L
269.3 197.1 L
275.7 202.678 L
282.1 210.485 L
288.5 215.558 L
294.9 220.22 L
301.3 218.461 L
307.7 215.829 L
314.1 211.21 L
320.5 209.588 L
326.9 212.448 L
333.3 216.526 L
339.7 218.426 L
346.1 220.405 L
352.5 221.146 L
358.9 215.123 L
365.3 208.424 L
371.7 210 L
378.1 209.042 L
384.5 206.515 L
384.538 206.506 L
S
GR
GS
[1.00046 0 0 1 0 0] CT
0.91 0.729 0.729 RC
1 LJ
0.5 LW
N
64.462 36.233 M
64.5 36.599 L
70.9 73.98 L
77.3 91.927 L
83.7 100.85 L
90.1 110.294 L
96.5 113.515 L
102.9 116.621 L
109.3 126.167 L
115.7 136.158 L
122.1 146.401 L
128.5 153.367 L
134.9 159.46 L
141.3 164.355 L
147.7 164.604 L
154.1 162.826 L
160.5 166.324 L
166.9 172.116 L
173.3 171.401 L
179.7 173.97 L
186.1 176.538 L
192.5 177.006 L
198.9 181.108 L
205.3 184.041 L
211.7 187.453 L
218.1 188.011 L
224.5 190.081 L
230.9 190.835 L
237.3 192.485 L
243.7 190.61 L
250.1 180.964 L
256.5 175.019 L
262.9 173.249 L
269.3 179.115 L
275.7 185.697 L
282.1 193.189 L
288.5 197.345 L
294.9 199.459 L
301.3 195.972 L
307.7 192.124 L
314.1 186.678 L
320.5 184.179 L
326.9 186.387 L
333.3 189.773 L
339.7 192.315 L
346.1 194.69 L
352.5 195.413 L
358.9 189.372 L
365.3 181.971 L
371.7 183.925 L
378.1 183.56 L
384.5 180.944 L
384.538 180.94 L
S
GR
GS
[1.00046 0 0 1 0 0] CT
0.8 0.4 0.4 RC
1 LJ
2 LW
N
64.462 47.197 M
64.5 47.559 L
70.9 84.107 L
77.3 102.298 L
83.7 111.119 L
90.1 119.551 L
96.5 122.267 L
102.9 125.596 L
109.3 135.838 L
115.7 145.821 L
122.1 155.227 L
128.5 161.609 L
134.9 167.225 L
141.3 172.74 L
147.7 174.014 L
154.1 172.476 L
160.5 175.764 L
166.9 181.277 L
173.3 180.293 L
179.7 182.176 L
186.1 184.699 L
192.5 185.607 L
198.9 189.698 L
205.3 192.968 L
211.7 196.566 L
218.1 197.358 L
224.5 199.616 L
230.9 200.738 L
237.3 202.733 L
243.7 201.076 L
250.1 191.308 L
256.5 184.754 L
262.9 182.303 L
269.3 188.107 L
275.7 194.188 L
282.1 201.837 L
288.5 206.451 L
294.9 209.839 L
301.3 207.216 L
307.7 203.976 L
314.1 198.945 L
320.5 196.883 L
326.9 199.418 L
333.3 203.149 L
339.7 205.37 L
346.1 207.547 L
352.5 208.28 L
358.9 202.248 L
365.3 195.198 L
371.7 196.962 L
378.1 196.301 L
384.5 193.73 L
384.538 193.723 L
S
GR
GS
[1.00046 0 0 1 0 0] CT
0.959 0.918 0.918 RC
N
109.3 148.945 M
115.7 150.638 L
122.1 151.878 L
128.5 154.985 L
134.9 162.955 L
141.3 169.654 L
147.7 174.671 L
154.1 182.835 L
160.5 187.779 L
166.9 187.971 L
173.3 188.559 L
179.7 192.521 L
186.1 196.168 L
192.5 196.504 L
198.9 195.895 L
205.3 199.576 L
211.7 200.634 L
218.1 203.659 L
224.5 206.318 L
230.9 207.347 L
237.3 207.396 L
243.7 204.888 L
250.1 204.096 L
256.5 205.88 L
262.9 207.829 L
269.3 212.659 L
275.7 221.594 L
282.1 226.481 L
288.5 221.805 L
294.9 216.981 L
301.3 216.683 L
307.7 222.525 L
314.1 227.482 L
320.5 227.095 L
326.9 219.195 L
333.3 215.331 L
339.7 213.051 L
346.1 210.321 L
352.5 208.742 L
358.9 205.764 L
365.3 206.133 L
371.7 208.145 L
378.1 212.168 L
384.5 214.921 L
384.538 214.927 L
384.538 214.742 L
384.538 185.223 L
384.5 185.226 L
378.1 183.956 L
371.7 181.02 L
365.3 179.241 L
358.9 179.695 L
352.5 183.378 L
346.1 186.239 L
339.7 189.917 L
333.3 192.986 L
326.9 196.782 L
320.5 204.457 L
314.1 204.29 L
307.7 199.166 L
301.3 194.576 L
294.9 196.416 L
288.5 200.623 L
282.1 203.788 L
275.7 197.971 L
269.3 189.341 L
262.9 184.285 L
256.5 182.191 L
250.1 180.179 L
243.7 180.587 L
237.3 183.383 L
230.9 183.466 L
224.5 182.834 L
218.1 181.807 L
211.7 180.547 L
205.3 180.521 L
198.9 177.881 L
192.5 179.439 L
186.1 178.042 L
179.7 174.172 L
173.3 171.148 L
166.9 171.183 L
160.5 170.396 L
154.1 165.822 L
147.7 157.249 L
141.3 150.823 L
134.9 143.114 L
128.5 134.936 L
122.1 132.727 L
115.7 131.118 L
109.3 128.75 L
102.9 124.662 L
96.5 119.408 L
90.1 115.927 L
83.7 107.21 L
77.3 90.514 L
70.9 66.546 L
64.5 23.516 L
64.462 23.144 L
64.462 23.264 L
64.462 42.912 L
64.5 43.282 L
70.9 84.861 L
77.3 108.786 L
83.7 126.171 L
90.1 135.508 L
96.5 139.767 L
102.9 144.907 L
cp
f
GR
GS
[1.00046 0 0 1 0 0] CT
0.82 0.639 0.639 RC
1 LJ
0.5 LW
N
64.462 42.912 M
64.5 43.282 L
70.9 84.861 L
77.3 108.786 L
83.7 126.171 L
90.1 135.508 L
96.5 139.767 L
102.9 144.907 L
109.3 148.945 L
115.7 150.638 L
122.1 151.878 L
128.5 154.985 L
134.9 162.955 L
141.3 169.654 L
147.7 174.671 L
154.1 182.835 L
160.5 187.779 L
166.9 187.971 L
173.3 188.559 L
179.7 192.521 L
186.1 196.168 L
192.5 196.504 L
198.9 195.895 L
205.3 199.576 L
211.7 200.634 L
218.1 203.659 L
224.5 206.318 L
230.9 207.347 L
237.3 207.396 L
243.7 204.888 L
250.1 204.096 L
256.5 205.88 L
262.9 207.829 L
269.3 212.659 L
275.7 221.594 L
282.1 226.481 L
288.5 221.805 L
294.9 216.981 L
301.3 216.683 L
307.7 222.525 L
314.1 227.482 L
320.5 227.095 L
326.9 219.195 L
333.3 215.331 L
339.7 213.051 L
346.1 210.321 L
352.5 208.742 L
358.9 205.764 L
365.3 206.133 L
371.7 208.145 L
378.1 212.168 L
384.5 214.921 L
384.538 214.927 L
S
GR
GS
[1.00046 0 0 1 0 0] CT
0.82 0.639 0.639 RC
1 LJ
0.5 LW
N
64.462 23.144 M
64.5 23.516 L
70.9 66.546 L
77.3 90.514 L
83.7 107.21 L
90.1 115.927 L
96.5 119.408 L
102.9 124.662 L
109.3 128.75 L
115.7 131.118 L
122.1 132.727 L
128.5 134.936 L
134.9 143.114 L
141.3 150.823 L
147.7 157.249 L
154.1 165.822 L
160.5 170.396 L
166.9 171.183 L
173.3 171.148 L
179.7 174.172 L
186.1 178.042 L
192.5 179.439 L
198.9 177.881 L
205.3 180.521 L
211.7 180.547 L
218.1 181.807 L
224.5 182.834 L
230.9 183.466 L
237.3 183.383 L
243.7 180.587 L
250.1 180.179 L
256.5 182.191 L
262.9 184.285 L
269.3 189.341 L
275.7 197.971 L
282.1 203.788 L
288.5 200.623 L
294.9 196.416 L
301.3 194.576 L
307.7 199.166 L
314.1 204.29 L
320.5 204.457 L
326.9 196.782 L
333.3 192.986 L
339.7 189.917 L
346.1 186.239 L
352.5 183.378 L
358.9 179.695 L
365.3 179.241 L
371.7 181.02 L
378.1 183.956 L
384.5 185.226 L
384.538 185.223 L
S
GR
GS
[1.00046 0 0 1 0 0] CT
0.6 0.2 0.2 RC
1 LJ
2 LW
N
64.462 33.028 M
64.5 33.398 L
70.9 75.704 L
77.3 99.65 L
83.7 116.69 L
90.1 125.718 L
96.5 129.588 L
102.9 134.785 L
109.3 138.848 L
115.7 140.878 L
122.1 142.302 L
128.5 144.96 L
134.9 153.035 L
141.3 160.239 L
147.7 165.96 L
154.1 174.329 L
160.5 179.088 L
166.9 179.577 L
173.3 179.853 L
179.7 183.347 L
186.1 187.105 L
192.5 187.971 L
198.9 186.887 L
205.3 190.048 L
211.7 190.591 L
218.1 192.733 L
224.5 194.576 L
230.9 195.406 L
237.3 195.39 L
243.7 192.738 L
250.1 192.138 L
256.5 194.035 L
262.9 196.057 L
269.3 201 L
275.7 209.782 L
282.1 215.135 L
288.5 211.214 L
294.9 206.698 L
301.3 205.63 L
307.7 210.846 L
314.1 215.887 L
320.5 215.776 L
326.9 207.988 L
333.3 204.159 L
339.7 201.483 L
346.1 198.28 L
352.5 196.06 L
358.9 192.73 L
365.3 192.687 L
371.7 194.583 L
378.1 198.062 L
384.5 200.074 L
384.538 200.075 L
S
GR
%%Trailer
%%Pages: 1
%%EOF
