%!PS-Adobe-3.0 EPSF-3.0
%%Creator: (MATLAB, The Mathworks, Inc. Version 9.10.0.1602886 \(R2021a\). Operating System: Mac OS X)
%%Title: /Users/kosciessa/Desktop/tardis/LNDG/stateswitch/stsw_eeg_task/tfr/figures/b01_gammaTraces_ya.eps
%%CreationDate: 2022-02-22T16:35:26
%%Pages: (atend)
%%BoundingBox:     2     0   388   266
%%LanguageLevel: 3
%%EndComments
%%BeginProlog
%%BeginResource: procset (Apache XML Graphics Std ProcSet) 1.2 0
%%Version: 1.2 0
%%Copyright: (Copyright 2001-2003,2010 The Apache Software Foundation. License terms: http://www.apache.org/licenses/LICENSE-2.0)
/bd{bind def}bind def
/ld{load def}bd
/GR/grestore ld
/GS/gsave ld
/RM/rmoveto ld
/C/curveto ld
/t/show ld
/L/lineto ld
/ML/setmiterlimit ld
/CT/concat ld
/f/fill ld
/N/newpath ld
/S/stroke ld
/CC/setcmykcolor ld
/A/ashow ld
/cp/closepath ld
/RC/setrgbcolor ld
/LJ/setlinejoin ld
/GC/setgray ld
/LW/setlinewidth ld
/M/moveto ld
/re {4 2 roll M
1 index 0 rlineto
0 exch rlineto
neg 0 rlineto
cp } bd
/_ctm matrix def
/_tm matrix def
/BT { _ctm currentmatrix pop matrix _tm copy pop 0 0 moveto } bd
/ET { _ctm setmatrix } bd
/iTm { _ctm setmatrix _tm concat } bd
/Tm { _tm astore pop iTm 0 0 moveto } bd
/ux 0.0 def
/uy 0.0 def
/F {
  /Tp exch def
  /Tf exch def
  Tf findfont Tp scalefont setfont
  /cf Tf def  /cs Tp def
} bd
/ULS {currentpoint /uy exch def /ux exch def} bd
/ULE {
  /Tcx currentpoint pop def
  gsave
  newpath
  cf findfont cs scalefont dup
  /FontMatrix get 0 get /Ts exch def /FontInfo get dup
  /UnderlinePosition get Ts mul /To exch def
  /UnderlineThickness get Ts mul /Tt exch def
  ux uy To add moveto  Tcx uy To add lineto
  Tt setlinewidth stroke
  grestore
} bd
/OLE {
  /Tcx currentpoint pop def
  gsave
  newpath
  cf findfont cs scalefont dup
  /FontMatrix get 0 get /Ts exch def /FontInfo get dup
  /UnderlinePosition get Ts mul /To exch def
  /UnderlineThickness get Ts mul /Tt exch def
  ux uy To add cs add moveto Tcx uy To add cs add lineto
  Tt setlinewidth stroke
  grestore
} bd
/SOE {
  /Tcx currentpoint pop def
  gsave
  newpath
  cf findfont cs scalefont dup
  /FontMatrix get 0 get /Ts exch def /FontInfo get dup
  /UnderlinePosition get Ts mul /To exch def
  /UnderlineThickness get Ts mul /Tt exch def
  ux uy To add cs 10 mul 26 idiv add moveto Tcx uy To add cs 10 mul 26 idiv add lineto
  Tt setlinewidth stroke
  grestore
} bd
/QT {
/Y22 exch store
/X22 exch store
/Y21 exch store
/X21 exch store
currentpoint
/Y21 load 2 mul add 3 div exch
/X21 load 2 mul add 3 div exch
/X21 load 2 mul /X22 load add 3 div
/Y21 load 2 mul /Y22 load add 3 div
/X22 load /Y22 load curveto
} bd
/SSPD {
dup length /d exch dict def
{
/v exch def
/k exch def
currentpagedevice k known {
/cpdv currentpagedevice k get def
v cpdv ne {
/upd false def
/nullv v type /nulltype eq def
/nullcpdv cpdv type /nulltype eq def
nullv nullcpdv or
{
/upd true def
} {
/sametype v type cpdv type eq def
sametype {
v type /arraytype eq {
/vlen v length def
/cpdvlen cpdv length def
vlen cpdvlen eq {
0 1 vlen 1 sub {
/i exch def
/obj v i get def
/cpdobj cpdv i get def
obj cpdobj ne {
/upd true def
exit
} if
} for
} {
/upd true def
} ifelse
} {
v type /dicttype eq {
v {
/dv exch def
/dk exch def
/cpddv cpdv dk get def
dv cpddv ne {
/upd true def
exit
} if
} forall
} {
/upd true def
} ifelse
} ifelse
} if
} ifelse
upd true eq {
d k v put
} if
} if
} if
} forall
d length 0 gt {
d setpagedevice
} if
} bd
/RE { % /NewFontName [NewEncodingArray] /FontName RE -
  findfont dup length dict begin
  {
    1 index /FID ne
    {def} {pop pop} ifelse
  } forall
  /Encoding exch def
  /FontName 1 index def
  currentdict definefont pop
  end
} bind def
%%EndResource
%%BeginResource: procset (Apache XML Graphics EPS ProcSet) 1.0 0
%%Version: 1.0 0
%%Copyright: (Copyright 2002-2003 The Apache Software Foundation. License terms: http://www.apache.org/licenses/LICENSE-2.0)
/BeginEPSF { %def
/b4_Inc_state save def         % Save state for cleanup
/dict_count countdictstack def % Count objects on dict stack
/op_count count 1 sub def      % Count objects on operand stack
userdict begin                 % Push userdict on dict stack
/showpage { } def              % Redefine showpage, { } = null proc
0 setgray 0 setlinecap         % Prepare graphics state
1 setlinewidth 0 setlinejoin
10 setmiterlimit [ ] 0 setdash newpath
/languagelevel where           % If level not equal to 1 then
{pop languagelevel             % set strokeadjust and
1 ne                           % overprint to their defaults.
{false setstrokeadjust false setoverprint
} if
} if
} bd
/EndEPSF { %def
count op_count sub {pop} repeat            % Clean up stacks
countdictstack dict_count sub {end} repeat
b4_Inc_state restore
} bd
%%EndResource
%FOPBeginFontDict
%%IncludeResource: font Courier-Oblique
%%IncludeResource: font Courier-BoldOblique
%%IncludeResource: font Courier-Bold
%%IncludeResource: font ZapfDingbats
%%IncludeResource: font Symbol
%%IncludeResource: font Helvetica
%%IncludeResource: font Helvetica-Oblique
%%IncludeResource: font Helvetica-Bold
%%IncludeResource: font Helvetica-BoldOblique
%%IncludeResource: font Times-Roman
%%IncludeResource: font Times-Italic
%%IncludeResource: font Times-Bold
%%IncludeResource: font Times-BoldItalic
%%IncludeResource: font Courier
%FOPEndFontDict
%%BeginResource: encoding WinAnsiEncoding
/WinAnsiEncoding [
/.notdef /.notdef /.notdef /.notdef /.notdef
/.notdef /.notdef /.notdef /.notdef /.notdef
/.notdef /.notdef /.notdef /.notdef /.notdef
/.notdef /.notdef /.notdef /.notdef /.notdef
/.notdef /.notdef /.notdef /.notdef /.notdef
/.notdef /.notdef /.notdef /.notdef /.notdef
/.notdef /.notdef /space /exclam /quotedbl
/numbersign /dollar /percent /ampersand /quotesingle
/parenleft /parenright /asterisk /plus /comma
/hyphen /period /slash /zero /one
/two /three /four /five /six
/seven /eight /nine /colon /semicolon
/less /equal /greater /question /at
/A /B /C /D /E
/F /G /H /I /J
/K /L /M /N /O
/P /Q /R /S /T
/U /V /W /X /Y
/Z /bracketleft /backslash /bracketright /asciicircum
/underscore /quoteleft /a /b /c
/d /e /f /g /h
/i /j /k /l /m
/n /o /p /q /r
/s /t /u /v /w
/x /y /z /braceleft /bar
/braceright /asciitilde /bullet /Euro /bullet
/quotesinglbase /florin /quotedblbase /ellipsis /dagger
/daggerdbl /circumflex /perthousand /Scaron /guilsinglleft
/OE /bullet /Zcaron /bullet /bullet
/quoteleft /quoteright /quotedblleft /quotedblright /bullet
/endash /emdash /asciitilde /trademark /scaron
/guilsinglright /oe /bullet /zcaron /Ydieresis
/space /exclamdown /cent /sterling /currency
/yen /brokenbar /section /dieresis /copyright
/ordfeminine /guillemotleft /logicalnot /sfthyphen /registered
/macron /degree /plusminus /twosuperior /threesuperior
/acute /mu /paragraph /middot /cedilla
/onesuperior /ordmasculine /guillemotright /onequarter /onehalf
/threequarters /questiondown /Agrave /Aacute /Acircumflex
/Atilde /Adieresis /Aring /AE /Ccedilla
/Egrave /Eacute /Ecircumflex /Edieresis /Igrave
/Iacute /Icircumflex /Idieresis /Eth /Ntilde
/Ograve /Oacute /Ocircumflex /Otilde /Odieresis
/multiply /Oslash /Ugrave /Uacute /Ucircumflex
/Udieresis /Yacute /Thorn /germandbls /agrave
/aacute /acircumflex /atilde /adieresis /aring
/ae /ccedilla /egrave /eacute /ecircumflex
/edieresis /igrave /iacute /icircumflex /idieresis
/eth /ntilde /ograve /oacute /ocircumflex
/otilde /odieresis /divide /oslash /ugrave
/uacute /ucircumflex /udieresis /yacute /thorn
/ydieresis
] def
%%EndResource
%FOPBeginFontReencode
/Courier-Oblique findfont
dup length dict begin
  {1 index /FID ne {def} {pop pop} ifelse} forall
  /Encoding WinAnsiEncoding def
  currentdict
end
/Courier-Oblique exch definefont pop
/Courier-BoldOblique findfont
dup length dict begin
  {1 index /FID ne {def} {pop pop} ifelse} forall
  /Encoding WinAnsiEncoding def
  currentdict
end
/Courier-BoldOblique exch definefont pop
/Courier-Bold findfont
dup length dict begin
  {1 index /FID ne {def} {pop pop} ifelse} forall
  /Encoding WinAnsiEncoding def
  currentdict
end
/Courier-Bold exch definefont pop
/Helvetica findfont
dup length dict begin
  {1 index /FID ne {def} {pop pop} ifelse} forall
  /Encoding WinAnsiEncoding def
  currentdict
end
/Helvetica exch definefont pop
/Helvetica-Oblique findfont
dup length dict begin
  {1 index /FID ne {def} {pop pop} ifelse} forall
  /Encoding WinAnsiEncoding def
  currentdict
end
/Helvetica-Oblique exch definefont pop
/Helvetica-Bold findfont
dup length dict begin
  {1 index /FID ne {def} {pop pop} ifelse} forall
  /Encoding WinAnsiEncoding def
  currentdict
end
/Helvetica-Bold exch definefont pop
/Helvetica-BoldOblique findfont
dup length dict begin
  {1 index /FID ne {def} {pop pop} ifelse} forall
  /Encoding WinAnsiEncoding def
  currentdict
end
/Helvetica-BoldOblique exch definefont pop
/Times-Roman findfont
dup length dict begin
  {1 index /FID ne {def} {pop pop} ifelse} forall
  /Encoding WinAnsiEncoding def
  currentdict
end
/Times-Roman exch definefont pop
/Times-Italic findfont
dup length dict begin
  {1 index /FID ne {def} {pop pop} ifelse} forall
  /Encoding WinAnsiEncoding def
  currentdict
end
/Times-Italic exch definefont pop
/Times-Bold findfont
dup length dict begin
  {1 index /FID ne {def} {pop pop} ifelse} forall
  /Encoding WinAnsiEncoding def
  currentdict
end
/Times-Bold exch definefont pop
/Times-BoldItalic findfont
dup length dict begin
  {1 index /FID ne {def} {pop pop} ifelse} forall
  /Encoding WinAnsiEncoding def
  currentdict
end
/Times-BoldItalic exch definefont pop
/Courier findfont
dup length dict begin
  {1 index /FID ne {def} {pop pop} ifelse} forall
  /Encoding WinAnsiEncoding def
  currentdict
end
/Courier exch definefont pop
%FOPEndFontReencode
%%EndProlog
%%Page: 1 1
%%PageBoundingBox: 0 0 425 283
%%BeginPageSetup
[1 0 0 -1 0 283] CT
%%EndPageSetup
GS
[1.00046 0 0 1 0 0] CT
1 GC
N
0 0 425 283 re
f
GR
GS
[1.00046 0 0 1 0 0] CT
1 GC
N
0 0 425 283 re
f
GR
GS
[1.00046 0 0 1 0 0] CT
1 GC
N
64.5 248.5 M
384.5 248.5 L
384.5 21 L
64.5 21 L
cp
f
GR
GS
[1.00046 0 0 1 0 0] CT
0.149 GC
2 setlinecap
1 LJ
0.5 LW
N
64.5 248.5 M
384.5 248.5 L
S
GR
GS
[1.00046 0 0 1 0 0] CT
0.149 GC
2 setlinecap
1 LJ
0.5 LW
N
64.5 248.5 M
64.5 245.304 L
S
GR
GS
[1.00046 0 0 1 0 0] CT
0.149 GC
2 setlinecap
1 LJ
0.5 LW
N
110.214 248.5 M
110.214 245.304 L
S
GR
GS
[1.00046 0 0 1 0 0] CT
0.149 GC
2 setlinecap
1 LJ
0.5 LW
N
155.929 248.5 M
155.929 245.304 L
S
GR
GS
[1.00046 0 0 1 0 0] CT
0.149 GC
2 setlinecap
1 LJ
0.5 LW
N
201.643 248.5 M
201.643 245.304 L
S
GR
GS
[1.00046 0 0 1 0 0] CT
0.149 GC
2 setlinecap
1 LJ
0.5 LW
N
247.357 248.5 M
247.357 245.304 L
S
GR
GS
[1.00046 0 0 1 0 0] CT
0.149 GC
2 setlinecap
1 LJ
0.5 LW
N
293.071 248.5 M
293.071 245.304 L
S
GR
GS
[1.00046 0 0 1 0 0] CT
0.149 GC
2 setlinecap
1 LJ
0.5 LW
N
338.786 248.5 M
338.786 245.304 L
S
GR
GS
[1.00046 0 0 1 0 0] CT
0.149 GC
2 setlinecap
1 LJ
0.5 LW
N
384.5 248.5 M
384.5 245.304 L
S
GR
GS
[1.00046 0 0 1 64.52987 252.90001] CT
0.149 GC
/Helvetica 12 F
GS
[1 0 0 1 0 0] CT
-3.5 12 moveto 
1 -1 scale
(1) t 
GR
GR
GS
[1.00046 0 0 1 110.26533 252.90001] CT
0.149 GC
/Helvetica 12 F
GS
[1 0 0 1 0 0] CT
-3.5 12 moveto 
1 -1 scale
(2) t 
GR
GR
GS
[1.00046 0 0 1 156.00079 252.90001] CT
0.149 GC
/Helvetica 12 F
GS
[1 0 0 1 0 0] CT
-3.5 12 moveto 
1 -1 scale
(3) t 
GR
GR
GS
[1.00046 0 0 1 201.73624 252.90001] CT
0.149 GC
/Helvetica 12 F
GS
[1 0 0 1 0 0] CT
-3.5 12 moveto 
1 -1 scale
(4) t 
GR
GR
GS
[1.00046 0 0 1 247.47171 252.90001] CT
0.149 GC
/Helvetica 12 F
GS
[1 0 0 1 0 0] CT
-3.5 12 moveto 
1 -1 scale
(5) t 
GR
GR
GS
[1.00046 0 0 1 293.20718 252.90001] CT
0.149 GC
/Helvetica 12 F
GS
[1 0 0 1 0 0] CT
-3.5 12 moveto 
1 -1 scale
(6) t 
GR
GR
GS
[1.00046 0 0 1 338.94261 252.90001] CT
0.149 GC
/Helvetica 12 F
GS
[1 0 0 1 0 0] CT
-3.5 12 moveto 
1 -1 scale
(7) t 
GR
GR
GS
[1.00046 0 0 1 384.67808 252.90001] CT
0.149 GC
/Helvetica 12 F
GS
[1 0 0 1 0 0] CT
-3.5 12 moveto 
1 -1 scale
(8) t 
GR
GR
GS
[1.00046 0 0 1 224.60413 268.5] CT
0.149 GC
/Helvetica 12 F
GS
[1 0 0 1 0 0] CT
-21 12 moveto 
1 -1 scale
(Time \(s\)) t 
GR
GR
GS
[1.00046 0 0 1 0 0] CT
0.149 GC
2 setlinecap
1 LJ
0.5 LW
N
64.5 248.5 M
64.5 21 L
S
GR
GS
[1.00046 0 0 1 0 0] CT
0.149 GC
2 setlinecap
1 LJ
0.5 LW
N
64.5 248.5 M
67.696 248.5 L
S
GR
GS
[1.00046 0 0 1 0 0] CT
0.149 GC
2 setlinecap
1 LJ
0.5 LW
N
64.5 203 M
67.696 203 L
S
GR
GS
[1.00046 0 0 1 0 0] CT
0.149 GC
2 setlinecap
1 LJ
0.5 LW
N
64.5 157.5 M
67.696 157.5 L
S
GR
GS
[1.00046 0 0 1 0 0] CT
0.149 GC
2 setlinecap
1 LJ
0.5 LW
N
64.5 112 M
67.696 112 L
S
GR
GS
[1.00046 0 0 1 0 0] CT
0.149 GC
2 setlinecap
1 LJ
0.5 LW
N
64.5 66.5 M
67.696 66.5 L
S
GR
GS
[1.00046 0 0 1 0 0] CT
0.149 GC
2 setlinecap
1 LJ
0.5 LW
N
64.5 21 M
67.696 21 L
S
GR
GS
[1.00046 0 0 1 60.12783 248.5] CT
0.149 GC
/Helvetica 12 F
GS
[1 0 0 1 0 0] CT
-29 4.5 moveto 
1 -1 scale
(-0.05) t 
GR
GR
GS
[1.00046 0 0 1 60.12783 203] CT
0.149 GC
/Helvetica 12 F
GS
[1 0 0 1 0 0] CT
-7 4.5 moveto 
1 -1 scale
(0) t 
GR
GR
GS
[1.00046 0 0 1 60.12783 157.5] CT
0.149 GC
/Helvetica 12 F
GS
[1 0 0 1 0 0] CT
-24 4.5 moveto 
1 -1 scale
(0.05) t 
GR
GR
GS
[1.00046 0 0 1 60.12783 112] CT
0.149 GC
/Helvetica 12 F
GS
[1 0 0 1 0 0] CT
-17 4.5 moveto 
1 -1 scale
(0.1) t 
GR
GR
GS
[1.00046 0 0 1 60.12783 66.49999] CT
0.149 GC
/Helvetica 12 F
GS
[1 0 0 1 0 0] CT
-24 4.5 moveto 
1 -1 scale
(0.15) t 
GR
GR
GS
[1.00046 0 0 1 60.12783 21] CT
0.149 GC
/Helvetica 12 F
GS
[1 0 0 1 0 0] CT
-17 4.5 moveto 
1 -1 scale
(0.2) t 
GR
GR
GS
[0 -1 1.00046 0 29.01343 134.74989] CT
0.149 GC
/Helvetica 12 F
GS
[1 0 0 1 0 0] CT
-70 -18 moveto 
1 -1 scale
(60-150 Hz Gamma Power) t 
GR
GR
GS
[0 -1 1.00046 0 29.01343 134.74989] CT
0.149 GC
/Helvetica 12 F
GS
[1 0 0 1 0 0] CT
-46 -3 moveto 
1 -1 scale
(\(a.u.; normalized\)) t 
GR
GR
GS
[1.00046 0 0 1 0 0] CT
0.996 0.98 0.98 RC
N
80.5 210.971 M
82.786 213.274 L
85.071 213.702 L
87.357 210.942 L
89.643 211.408 L
91.929 213.599 L
94.214 211.595 L
96.5 206.956 L
98.786 208.533 L
101.071 207.387 L
103.357 207.834 L
105.643 202.065 L
107.929 200.516 L
110.214 199.897 L
112.5 204.849 L
114.786 202.844 L
117.071 205.161 L
119.357 205.955 L
121.643 206.943 L
123.929 205.75 L
126.214 205.981 L
128.5 202.865 L
130.786 203.261 L
133.071 201.088 L
135.357 200.739 L
137.643 203.689 L
139.929 206.353 L
142.214 209.163 L
144.5 210.691 L
146.786 212.936 L
149.071 215.29 L
151.357 219.28 L
153.643 215.833 L
155.929 210.566 L
158.214 187.7 L
160.5 166.596 L
162.786 148.333 L
165.071 125.781 L
167.357 106.366 L
169.643 89.275 L
171.929 82.651 L
174.214 87.829 L
176.5 88.727 L
178.786 85.792 L
181.071 95.18 L
183.357 99.913 L
185.643 103.79 L
187.929 111.896 L
190.214 118.116 L
192.5 125.357 L
194.786 128.626 L
197.071 127.538 L
199.357 129.678 L
201.643 133.996 L
203.929 131.215 L
206.214 134.981 L
208.5 134.381 L
210.786 136.383 L
213.071 137.389 L
215.357 136.923 L
217.643 135.768 L
219.929 137.277 L
222.214 134.685 L
224.5 136.442 L
226.786 136.007 L
229.071 135.04 L
231.357 132.612 L
233.643 133.649 L
235.929 131.644 L
238.214 131.531 L
240.5 130.528 L
242.786 128.782 L
245.071 127.355 L
247.357 131.091 L
249.643 132.078 L
251.929 133.139 L
254.214 133.595 L
256.5 133.682 L
258.786 136.273 L
261.071 135.715 L
263.357 135.344 L
265.643 136.514 L
267.929 136.62 L
270.214 139.227 L
272.5 139.426 L
274.786 138.015 L
277.071 138.95 L
279.357 139.205 L
281.643 138.876 L
283.929 139.086 L
286.214 137.362 L
288.5 138.036 L
290.786 136.257 L
293.071 135.616 L
295.357 134.859 L
297.643 135.202 L
299.929 135.004 L
302.214 137.563 L
304.5 143.232 L
306.786 158.335 L
309.071 168.836 L
311.357 179.475 L
313.643 187.493 L
315.929 196.996 L
318.214 207.223 L
320.5 217.108 L
322.786 218.722 L
325.071 223.122 L
327.357 222.116 L
329.643 220.862 L
331.929 221.366 L
334.214 219.145 L
336.5 213.624 L
338.786 213.952 L
341.071 212.849 L
343.357 216.012 L
345.643 218.293 L
347.929 220.22 L
350.214 218.584 L
352.5 220.02 L
354.786 217.473 L
357.071 216.95 L
359.357 215.14 L
361.643 212.017 L
363.929 211.385 L
366.214 212.89 L
368.5 211.027 L
370.786 211.188 L
373.071 214.456 L
375.357 215.311 L
377.643 210.829 L
379.929 210.137 L
382.214 206.334 L
384.5 200.972 L
384.5 177.355 L
382.214 181.773 L
379.929 185.718 L
377.643 186.837 L
375.357 191.498 L
373.071 191.699 L
370.786 188.552 L
368.5 188.336 L
366.214 190.167 L
363.929 188.344 L
361.643 189.071 L
359.357 191.086 L
357.071 191.429 L
354.786 191.437 L
352.5 193.164 L
350.214 191.285 L
347.929 193.013 L
345.643 191.274 L
343.357 188.492 L
341.071 185.36 L
338.786 187.347 L
336.5 188.141 L
334.214 193.839 L
331.929 195.882 L
329.643 195.958 L
327.357 198.626 L
325.071 200.505 L
322.786 196.095 L
320.5 195.213 L
318.214 185.048 L
315.929 174.935 L
313.643 164.957 L
311.357 156.85 L
309.071 146.7 L
306.786 136.744 L
304.5 122.531 L
302.214 117.234 L
299.929 115.986 L
297.643 116.865 L
295.357 116.549 L
293.071 117.374 L
290.786 118.934 L
288.5 120.157 L
286.214 119.639 L
283.929 120.772 L
281.643 120.684 L
279.357 121.63 L
277.071 121.298 L
274.786 119.997 L
272.5 121.209 L
270.214 121.816 L
267.929 119.734 L
265.643 119.503 L
263.357 117.485 L
261.071 117.553 L
258.786 118.251 L
256.5 116.257 L
254.214 116.104 L
251.929 115.34 L
249.643 114.44 L
247.357 113.894 L
245.071 110.099 L
242.786 111.673 L
240.5 113.793 L
238.214 115.224 L
235.929 116.55 L
233.643 119.11 L
231.357 118.58 L
229.071 120.362 L
226.786 120.804 L
224.5 121.53 L
222.214 120.073 L
219.929 122.038 L
217.643 122.002 L
215.357 123.245 L
213.071 123.409 L
210.786 122.101 L
208.5 120.29 L
206.214 121.01 L
203.929 117.367 L
201.643 119.926 L
199.357 115.379 L
197.071 113.475 L
194.786 114.595 L
192.5 111.521 L
190.214 105.026 L
187.929 100.306 L
185.643 92.15 L
183.357 88.12 L
181.071 84.684 L
178.786 74.476 L
176.5 77.399 L
174.214 75.229 L
171.929 69.911 L
169.643 75.896 L
167.357 93.326 L
165.071 112.631 L
162.786 136.209 L
160.5 154.001 L
158.214 176.104 L
155.929 199.188 L
153.643 204.496 L
151.357 209.086 L
149.071 206.066 L
146.786 204.366 L
144.5 203.274 L
142.214 202.77 L
139.929 200.701 L
137.643 198.733 L
135.357 195.435 L
133.071 194.856 L
130.786 197.778 L
128.5 196.54 L
126.214 198.837 L
123.929 196.667 L
121.643 197.229 L
119.357 195.515 L
117.071 193.599 L
114.786 191.711 L
112.5 194.876 L
110.214 190.337 L
107.929 190.665 L
105.643 191.129 L
103.357 194.968 L
101.071 193.173 L
98.786 194.397 L
96.5 192.21 L
94.214 196.372 L
91.929 197.982 L
89.643 195.8 L
87.357 195.397 L
85.071 197.692 L
82.786 197.363 L
80.5 194.901 L
78.214 192.937 L
75.929 191.716 L
73.643 188.772 L
71.357 187.938 L
69.071 182.082 L
66.786 176.985 L
64.5 176.458 L
64.5 191.643 L
66.786 193.273 L
69.071 198.44 L
71.357 204.481 L
73.643 205.479 L
75.929 206.78 L
78.214 208.149 L
cp
f
GR
GS
[1.00046 0 0 1 0 0] CT
0.98 0.91 0.91 RC
1 LJ
0.5 LW
N
64.5 191.643 M
66.786 193.273 L
69.071 198.44 L
71.357 204.481 L
73.643 205.479 L
75.929 206.78 L
78.214 208.149 L
80.5 210.971 L
82.786 213.274 L
85.071 213.702 L
87.357 210.942 L
89.643 211.408 L
91.929 213.599 L
94.214 211.595 L
96.5 206.956 L
98.786 208.533 L
101.071 207.387 L
103.357 207.834 L
105.643 202.065 L
107.929 200.516 L
110.214 199.897 L
112.5 204.849 L
114.786 202.844 L
117.071 205.161 L
119.357 205.955 L
121.643 206.943 L
123.929 205.75 L
126.214 205.981 L
128.5 202.865 L
130.786 203.261 L
133.071 201.088 L
135.357 200.739 L
137.643 203.689 L
139.929 206.353 L
142.214 209.163 L
144.5 210.691 L
146.786 212.936 L
149.071 215.29 L
151.357 219.28 L
153.643 215.833 L
155.929 210.566 L
158.214 187.7 L
160.5 166.596 L
162.786 148.333 L
165.071 125.781 L
167.357 106.366 L
169.643 89.275 L
171.929 82.651 L
174.214 87.829 L
176.5 88.727 L
178.786 85.792 L
181.071 95.18 L
183.357 99.913 L
185.643 103.79 L
187.929 111.896 L
190.214 118.116 L
192.5 125.357 L
194.786 128.626 L
197.071 127.538 L
199.357 129.678 L
201.643 133.996 L
203.929 131.215 L
206.214 134.981 L
208.5 134.381 L
210.786 136.383 L
213.071 137.389 L
215.357 136.923 L
217.643 135.768 L
219.929 137.277 L
222.214 134.685 L
224.5 136.442 L
226.786 136.007 L
229.071 135.04 L
231.357 132.612 L
233.643 133.649 L
235.929 131.644 L
238.214 131.531 L
240.5 130.528 L
242.786 128.782 L
245.071 127.355 L
247.357 131.091 L
249.643 132.078 L
251.929 133.139 L
254.214 133.595 L
256.5 133.682 L
258.786 136.273 L
261.071 135.715 L
263.357 135.344 L
265.643 136.514 L
267.929 136.62 L
270.214 139.227 L
272.5 139.426 L
274.786 138.015 L
277.071 138.95 L
279.357 139.205 L
281.643 138.876 L
283.929 139.086 L
286.214 137.362 L
288.5 138.036 L
290.786 136.257 L
293.071 135.616 L
295.357 134.859 L
297.643 135.202 L
299.929 135.004 L
302.214 137.563 L
304.5 143.232 L
306.786 158.335 L
309.071 168.836 L
311.357 179.475 L
313.643 187.493 L
315.929 196.996 L
318.214 207.223 L
320.5 217.108 L
322.786 218.722 L
325.071 223.122 L
327.357 222.116 L
329.643 220.862 L
331.929 221.366 L
334.214 219.145 L
336.5 213.624 L
338.786 213.952 L
341.071 212.849 L
343.357 216.012 L
345.643 218.293 L
347.929 220.22 L
350.214 218.584 L
352.5 220.02 L
354.786 217.473 L
357.071 216.95 L
359.357 215.14 L
361.643 212.017 L
363.929 211.385 L
366.214 212.89 L
368.5 211.027 L
370.786 211.188 L
373.071 214.456 L
375.357 215.311 L
377.643 210.829 L
379.929 210.137 L
382.214 206.334 L
384.5 200.972 L
S
GR
GS
[1.00046 0 0 1 0 0] CT
0.98 0.91 0.91 RC
1 LJ
0.5 LW
N
64.5 176.458 M
66.786 176.985 L
69.071 182.082 L
71.357 187.938 L
73.643 188.772 L
75.929 191.716 L
78.214 192.937 L
80.5 194.901 L
82.786 197.363 L
85.071 197.692 L
87.357 195.397 L
89.643 195.8 L
91.929 197.982 L
94.214 196.372 L
96.5 192.21 L
98.786 194.397 L
101.071 193.173 L
103.357 194.968 L
105.643 191.129 L
107.929 190.665 L
110.214 190.337 L
112.5 194.876 L
114.786 191.711 L
117.071 193.599 L
119.357 195.515 L
121.643 197.229 L
123.929 196.667 L
126.214 198.837 L
128.5 196.54 L
130.786 197.778 L
133.071 194.856 L
135.357 195.435 L
137.643 198.733 L
139.929 200.701 L
142.214 202.77 L
144.5 203.274 L
146.786 204.366 L
149.071 206.066 L
151.357 209.086 L
153.643 204.496 L
155.929 199.188 L
158.214 176.104 L
160.5 154.001 L
162.786 136.209 L
165.071 112.631 L
167.357 93.326 L
169.643 75.896 L
171.929 69.911 L
174.214 75.229 L
176.5 77.399 L
178.786 74.476 L
181.071 84.684 L
183.357 88.12 L
185.643 92.15 L
187.929 100.306 L
190.214 105.026 L
192.5 111.521 L
194.786 114.595 L
197.071 113.475 L
199.357 115.379 L
201.643 119.926 L
203.929 117.367 L
206.214 121.01 L
208.5 120.29 L
210.786 122.101 L
213.071 123.409 L
215.357 123.245 L
217.643 122.002 L
219.929 122.038 L
222.214 120.073 L
224.5 121.53 L
226.786 120.804 L
229.071 120.362 L
231.357 118.58 L
233.643 119.11 L
235.929 116.55 L
238.214 115.224 L
240.5 113.793 L
242.786 111.673 L
245.071 110.099 L
247.357 113.894 L
249.643 114.44 L
251.929 115.34 L
254.214 116.104 L
256.5 116.257 L
258.786 118.251 L
261.071 117.553 L
263.357 117.485 L
265.643 119.503 L
267.929 119.734 L
270.214 121.816 L
272.5 121.209 L
274.786 119.997 L
277.071 121.298 L
279.357 121.63 L
281.643 120.684 L
283.929 120.772 L
286.214 119.639 L
288.5 120.157 L
290.786 118.934 L
293.071 117.374 L
295.357 116.549 L
297.643 116.865 L
299.929 115.986 L
302.214 117.234 L
304.5 122.531 L
306.786 136.744 L
309.071 146.7 L
311.357 156.85 L
313.643 164.957 L
315.929 174.935 L
318.214 185.048 L
320.5 195.213 L
322.786 196.095 L
325.071 200.505 L
327.357 198.626 L
329.643 195.958 L
331.929 195.882 L
334.214 193.839 L
336.5 188.141 L
338.786 187.347 L
341.071 185.36 L
343.357 188.492 L
345.643 191.274 L
347.929 193.013 L
350.214 191.285 L
352.5 193.164 L
354.786 191.437 L
357.071 191.429 L
359.357 191.086 L
361.643 189.071 L
363.929 188.344 L
366.214 190.167 L
368.5 188.336 L
370.786 188.552 L
373.071 191.699 L
375.357 191.498 L
377.643 186.837 L
379.929 185.718 L
382.214 181.773 L
384.5 177.355 L
S
GR
GS
[1.00046 0 0 1 0 0] CT
0.961 0.8 0.8 RC
1 LJ
2 LW
N
64.5 184.05 M
66.786 185.129 L
69.071 190.261 L
71.357 196.21 L
73.643 197.125 L
75.929 199.248 L
78.214 200.543 L
80.5 202.936 L
82.786 205.319 L
85.071 205.697 L
87.357 203.17 L
89.643 203.604 L
91.929 205.791 L
94.214 203.984 L
96.5 199.583 L
98.786 201.465 L
101.071 200.28 L
103.357 201.401 L
105.643 196.597 L
107.929 195.59 L
110.214 195.117 L
112.5 199.862 L
114.786 197.278 L
117.071 199.38 L
119.357 200.735 L
121.643 202.086 L
123.929 201.208 L
126.214 202.409 L
128.5 199.703 L
130.786 200.52 L
133.071 197.972 L
135.357 198.087 L
137.643 201.211 L
139.929 203.527 L
142.214 205.966 L
144.5 206.983 L
146.786 208.651 L
149.071 210.678 L
151.357 214.183 L
153.643 210.164 L
155.929 204.877 L
158.214 181.902 L
160.5 160.298 L
162.786 142.271 L
165.071 119.206 L
167.357 99.846 L
169.643 82.585 L
171.929 76.281 L
174.214 81.529 L
176.5 83.063 L
178.786 80.134 L
181.071 89.932 L
183.357 94.016 L
185.643 97.97 L
187.929 106.101 L
190.214 111.571 L
192.5 118.439 L
194.786 121.611 L
197.071 120.506 L
199.357 122.529 L
201.643 126.961 L
203.929 124.291 L
206.214 127.995 L
208.5 127.336 L
210.786 129.242 L
213.071 130.399 L
215.357 130.084 L
217.643 128.885 L
219.929 129.657 L
222.214 127.379 L
224.5 128.986 L
226.786 128.405 L
229.071 127.701 L
231.357 125.596 L
233.643 126.38 L
235.929 124.097 L
238.214 123.377 L
240.5 122.161 L
242.786 120.227 L
245.071 118.727 L
247.357 122.493 L
249.643 123.259 L
251.929 124.24 L
254.214 124.849 L
256.5 124.969 L
258.786 127.262 L
261.071 126.634 L
263.357 126.414 L
265.643 128.008 L
267.929 128.177 L
270.214 130.521 L
272.5 130.317 L
274.786 129.006 L
277.071 130.124 L
279.357 130.418 L
281.643 129.78 L
283.929 129.929 L
286.214 128.501 L
288.5 129.096 L
290.786 127.596 L
293.071 126.495 L
295.357 125.704 L
297.643 126.033 L
299.929 125.495 L
302.214 127.399 L
304.5 132.882 L
306.786 147.539 L
309.071 157.768 L
311.357 168.162 L
313.643 176.225 L
315.929 185.965 L
318.214 196.135 L
320.5 206.16 L
322.786 207.409 L
325.071 211.813 L
327.357 210.371 L
329.643 208.41 L
331.929 208.624 L
334.214 206.492 L
336.5 200.883 L
338.786 200.65 L
341.071 199.105 L
343.357 202.252 L
345.643 204.784 L
347.929 206.616 L
350.214 204.935 L
352.5 206.592 L
354.786 204.455 L
357.071 204.19 L
359.357 203.113 L
361.643 200.544 L
363.929 199.865 L
366.214 201.529 L
368.5 199.681 L
370.786 199.87 L
373.071 203.077 L
375.357 203.405 L
377.643 198.833 L
379.929 197.928 L
382.214 194.053 L
384.5 189.164 L
S
GR
GS
[1.00046 0 0 1 0 0] CT
0.99 0.959 0.959 RC
N
96.5 181.603 M
94.214 183.802 L
91.929 184.943 L
89.643 187.711 L
87.357 188.214 L
85.071 188.115 L
82.786 185.314 L
80.5 179.576 L
78.214 174.432 L
75.929 173.435 L
73.643 166.408 L
71.357 163.288 L
69.071 162.4 L
66.786 165.066 L
64.5 169.219 L
64.5 186.356 L
66.786 182.013 L
69.071 179.233 L
71.357 179.615 L
73.643 182.417 L
75.929 188.735 L
78.214 190.279 L
80.5 195.149 L
82.786 199.934 L
85.071 201.747 L
87.357 201.741 L
89.643 201.936 L
91.929 198.911 L
94.214 196.796 L
96.5 194.956 L
98.786 192.256 L
101.071 192.505 L
103.357 190.251 L
105.643 190.429 L
107.929 193.937 L
110.214 193.778 L
112.5 195.339 L
114.786 195.098 L
117.071 195.429 L
119.357 197.704 L
121.643 195.548 L
123.929 195.463 L
126.214 197.55 L
128.5 198.18 L
130.786 203.898 L
133.071 208.844 L
135.357 211.256 L
137.643 213.215 L
139.929 211.382 L
142.214 212.68 L
144.5 212.324 L
146.786 209.812 L
149.071 209.015 L
151.357 202.034 L
153.643 206.113 L
155.929 199.644 L
158.214 180.068 L
160.5 153.709 L
162.786 133.938 L
165.071 109.198 L
167.357 88.988 L
169.643 69.681 L
171.929 63.984 L
174.214 69.091 L
176.5 72.937 L
178.786 75.999 L
181.071 86.371 L
183.357 90.919 L
185.643 94.026 L
187.929 100.249 L
190.214 101.468 L
192.5 102.157 L
194.786 103.455 L
197.071 103.865 L
199.357 101.747 L
201.643 101.668 L
203.929 104.405 L
206.214 109.08 L
208.5 112.68 L
210.786 113.657 L
213.071 111.526 L
215.357 114.439 L
217.643 113.654 L
219.929 111.06 L
222.214 108.938 L
224.5 108.638 L
226.786 110.204 L
229.071 112.271 L
231.357 110.384 L
233.643 109.218 L
235.929 109.611 L
238.214 108.609 L
240.5 108.701 L
242.786 106.413 L
245.071 104.846 L
247.357 104.588 L
249.643 102.297 L
251.929 104.315 L
254.214 104.357 L
256.5 102.339 L
258.786 106.703 L
261.071 112.479 L
263.357 112.146 L
265.643 111.4 L
267.929 109.166 L
270.214 109.642 L
272.5 108.844 L
274.786 106.222 L
277.071 102.49 L
279.357 101.024 L
281.643 104.696 L
283.929 105.816 L
286.214 105.196 L
288.5 105.397 L
290.786 104.257 L
293.071 102.851 L
295.357 102.899 L
297.643 98.248 L
299.929 99.231 L
302.214 99.238 L
304.5 103.142 L
306.786 107.548 L
309.071 116.184 L
311.357 122.713 L
313.643 130.117 L
315.929 137.35 L
318.214 145.125 L
320.5 151.253 L
322.786 158.226 L
325.071 161.683 L
327.357 166.213 L
329.643 171.3 L
331.929 174.768 L
334.214 180.73 L
336.5 180.858 L
338.786 181.035 L
341.071 184.166 L
343.357 184.333 L
345.643 189.448 L
347.929 189.275 L
350.214 191.833 L
352.5 191.867 L
354.786 192.357 L
357.071 191.62 L
359.357 191.133 L
361.643 188.083 L
363.929 187.949 L
366.214 184.147 L
368.5 183.757 L
370.786 183.013 L
373.071 181.678 L
375.357 180.844 L
377.643 174.002 L
379.929 177.78 L
382.214 175.291 L
384.5 175.228 L
384.5 156.343 L
382.214 158.286 L
379.929 161.274 L
377.643 158.6 L
375.357 165.732 L
373.071 166.851 L
370.786 167.673 L
368.5 169.375 L
366.214 170.144 L
363.929 173.834 L
361.643 174.255 L
359.357 177.141 L
357.071 177.521 L
354.786 178.298 L
352.5 177.343 L
350.214 176.178 L
347.929 173.256 L
345.643 173.342 L
343.357 169.056 L
341.071 168.892 L
338.786 165.494 L
336.5 164.925 L
334.214 164.915 L
331.929 159.086 L
329.643 155.594 L
327.357 150.357 L
325.071 145.231 L
322.786 141.994 L
320.5 135.116 L
318.214 128.368 L
315.929 120.931 L
313.643 114.605 L
311.357 107.4 L
309.071 101.282 L
306.786 92.31 L
304.5 88.365 L
302.214 85.572 L
299.929 85.883 L
297.643 84.605 L
295.357 89.967 L
293.071 89.795 L
290.786 91.96 L
288.5 92.656 L
286.214 91.86 L
283.929 92.269 L
281.643 91.091 L
279.357 86.277 L
277.071 87.478 L
274.786 90.476 L
272.5 93.189 L
270.214 93.779 L
267.929 93.515 L
265.643 95.654 L
263.357 96.583 L
261.071 96.83 L
258.786 92.115 L
256.5 88.497 L
254.214 91.121 L
251.929 91.115 L
249.643 89.136 L
247.357 91.012 L
245.071 90.803 L
242.786 92.408 L
240.5 95.561 L
238.214 96.254 L
235.929 97.235 L
233.643 96.495 L
231.357 97.83 L
229.071 100.198 L
226.786 97.957 L
224.5 96.15 L
222.214 97.315 L
219.929 99.744 L
217.643 102.243 L
215.357 103.217 L
213.071 101.104 L
210.786 103.694 L
208.5 102.535 L
206.214 99.442 L
203.929 94.103 L
201.643 92.354 L
199.357 91.803 L
197.071 93.526 L
194.786 92.971 L
192.5 91.811 L
190.214 90.218 L
187.929 89.082 L
185.643 82.195 L
183.357 78.793 L
181.071 74.638 L
178.786 65.166 L
176.5 62.122 L
174.214 58.336 L
171.929 53.69 L
169.643 58.874 L
167.357 79.134 L
165.071 99.454 L
162.786 123.413 L
160.5 144.182 L
158.214 171.608 L
155.929 191.394 L
153.643 198.585 L
151.357 194.914 L
149.071 202.467 L
146.786 203.528 L
144.5 206.146 L
142.214 206.863 L
139.929 205.737 L
137.643 207.057 L
135.357 205.855 L
133.071 203.635 L
130.786 198.786 L
128.5 191.971 L
126.214 191.412 L
123.929 188.041 L
121.643 187.337 L
119.357 188.979 L
117.071 185.34 L
114.786 184.622 L
112.5 183.88 L
110.214 181.657 L
107.929 181.432 L
105.643 179.276 L
103.357 178.241 L
101.071 179.389 L
98.786 178.465 L
cp
f
GR
GS
[1.00046 0 0 1 0 0] CT
0.957 0.82 0.82 RC
1 LJ
0.5 LW
N
64.5 186.356 M
66.786 182.013 L
69.071 179.233 L
71.357 179.615 L
73.643 182.417 L
75.929 188.735 L
78.214 190.279 L
80.5 195.149 L
82.786 199.934 L
85.071 201.747 L
87.357 201.741 L
89.643 201.936 L
91.929 198.911 L
94.214 196.796 L
96.5 194.956 L
98.786 192.256 L
101.071 192.505 L
103.357 190.251 L
105.643 190.429 L
107.929 193.937 L
110.214 193.778 L
112.5 195.339 L
114.786 195.098 L
117.071 195.429 L
119.357 197.704 L
121.643 195.548 L
123.929 195.463 L
126.214 197.55 L
128.5 198.18 L
130.786 203.898 L
133.071 208.844 L
135.357 211.256 L
137.643 213.215 L
139.929 211.382 L
142.214 212.68 L
144.5 212.324 L
146.786 209.812 L
149.071 209.015 L
151.357 202.034 L
153.643 206.113 L
155.929 199.644 L
158.214 180.068 L
160.5 153.709 L
162.786 133.938 L
165.071 109.198 L
167.357 88.988 L
169.643 69.681 L
171.929 63.984 L
174.214 69.091 L
176.5 72.937 L
178.786 75.999 L
181.071 86.371 L
183.357 90.919 L
185.643 94.026 L
187.929 100.249 L
190.214 101.468 L
192.5 102.157 L
194.786 103.455 L
197.071 103.865 L
199.357 101.747 L
201.643 101.668 L
203.929 104.405 L
206.214 109.08 L
208.5 112.68 L
210.786 113.657 L
213.071 111.526 L
215.357 114.439 L
217.643 113.654 L
219.929 111.06 L
222.214 108.938 L
224.5 108.638 L
226.786 110.204 L
229.071 112.271 L
231.357 110.384 L
233.643 109.218 L
235.929 109.611 L
238.214 108.609 L
240.5 108.701 L
242.786 106.413 L
245.071 104.846 L
247.357 104.588 L
249.643 102.297 L
251.929 104.315 L
254.214 104.357 L
256.5 102.339 L
258.786 106.703 L
261.071 112.479 L
263.357 112.146 L
265.643 111.4 L
267.929 109.166 L
270.214 109.642 L
272.5 108.844 L
274.786 106.222 L
277.071 102.49 L
279.357 101.024 L
281.643 104.696 L
283.929 105.816 L
286.214 105.196 L
288.5 105.397 L
290.786 104.257 L
293.071 102.851 L
295.357 102.899 L
297.643 98.248 L
299.929 99.231 L
302.214 99.238 L
304.5 103.142 L
306.786 107.548 L
309.071 116.184 L
311.357 122.713 L
313.643 130.117 L
315.929 137.35 L
318.214 145.125 L
320.5 151.253 L
322.786 158.226 L
325.071 161.683 L
327.357 166.213 L
329.643 171.3 L
331.929 174.768 L
334.214 180.73 L
336.5 180.858 L
338.786 181.035 L
341.071 184.166 L
343.357 184.333 L
345.643 189.448 L
347.929 189.275 L
350.214 191.833 L
352.5 191.867 L
354.786 192.357 L
357.071 191.62 L
359.357 191.133 L
361.643 188.083 L
363.929 187.949 L
366.214 184.147 L
368.5 183.757 L
370.786 183.013 L
373.071 181.678 L
375.357 180.844 L
377.643 174.002 L
379.929 177.78 L
382.214 175.291 L
384.5 175.228 L
S
GR
GS
[1.00046 0 0 1 0 0] CT
0.957 0.82 0.82 RC
1 LJ
0.5 LW
N
64.5 169.219 M
66.786 165.066 L
69.071 162.4 L
71.357 163.288 L
73.643 166.408 L
75.929 173.435 L
78.214 174.432 L
80.5 179.576 L
82.786 185.314 L
85.071 188.115 L
87.357 188.214 L
89.643 187.711 L
91.929 184.943 L
94.214 183.802 L
96.5 181.603 L
98.786 178.465 L
101.071 179.389 L
103.357 178.241 L
105.643 179.276 L
107.929 181.432 L
110.214 181.657 L
112.5 183.88 L
114.786 184.622 L
117.071 185.34 L
119.357 188.979 L
121.643 187.337 L
123.929 188.041 L
126.214 191.412 L
128.5 191.971 L
130.786 198.786 L
133.071 203.635 L
135.357 205.855 L
137.643 207.057 L
139.929 205.737 L
142.214 206.863 L
144.5 206.146 L
146.786 203.528 L
149.071 202.467 L
151.357 194.914 L
153.643 198.585 L
155.929 191.394 L
158.214 171.608 L
160.5 144.182 L
162.786 123.413 L
165.071 99.454 L
167.357 79.134 L
169.643 58.874 L
171.929 53.69 L
174.214 58.336 L
176.5 62.122 L
178.786 65.166 L
181.071 74.638 L
183.357 78.793 L
185.643 82.195 L
187.929 89.082 L
190.214 90.218 L
192.5 91.811 L
194.786 92.971 L
197.071 93.526 L
199.357 91.803 L
201.643 92.354 L
203.929 94.103 L
206.214 99.442 L
208.5 102.535 L
210.786 103.694 L
213.071 101.104 L
215.357 103.217 L
217.643 102.243 L
219.929 99.744 L
222.214 97.315 L
224.5 96.15 L
226.786 97.957 L
229.071 100.198 L
231.357 97.83 L
233.643 96.495 L
235.929 97.235 L
238.214 96.254 L
240.5 95.561 L
242.786 92.408 L
245.071 90.803 L
247.357 91.012 L
249.643 89.136 L
251.929 91.115 L
254.214 91.121 L
256.5 88.497 L
258.786 92.115 L
261.071 96.83 L
263.357 96.583 L
265.643 95.654 L
267.929 93.515 L
270.214 93.779 L
272.5 93.189 L
274.786 90.476 L
277.071 87.478 L
279.357 86.277 L
281.643 91.091 L
283.929 92.269 L
286.214 91.86 L
288.5 92.656 L
290.786 91.96 L
293.071 89.795 L
295.357 89.967 L
297.643 84.605 L
299.929 85.883 L
302.214 85.572 L
304.5 88.365 L
306.786 92.31 L
309.071 101.282 L
311.357 107.4 L
313.643 114.605 L
315.929 120.931 L
318.214 128.368 L
320.5 135.116 L
322.786 141.994 L
325.071 145.231 L
327.357 150.357 L
329.643 155.594 L
331.929 159.086 L
334.214 164.915 L
336.5 164.925 L
338.786 165.494 L
341.071 168.892 L
343.357 169.056 L
345.643 173.342 L
347.929 173.256 L
350.214 176.178 L
352.5 177.343 L
354.786 178.298 L
357.071 177.521 L
359.357 177.141 L
361.643 174.255 L
363.929 173.834 L
366.214 170.144 L
368.5 169.375 L
370.786 167.673 L
373.071 166.851 L
375.357 165.732 L
377.643 158.6 L
379.929 161.274 L
382.214 158.286 L
384.5 156.343 L
S
GR
GS
[1.00046 0 0 1 0 0] CT
0.898 0.6 0.6 RC
1 LJ
2 LW
N
64.5 177.787 M
66.786 173.54 L
69.071 170.817 L
71.357 171.451 L
73.643 174.412 L
75.929 181.085 L
78.214 182.356 L
80.5 187.363 L
82.786 192.624 L
85.071 194.931 L
87.357 194.977 L
89.643 194.823 L
91.929 191.927 L
94.214 190.299 L
96.5 188.28 L
98.786 185.36 L
101.071 185.947 L
103.357 184.246 L
105.643 184.852 L
107.929 187.685 L
110.214 187.718 L
112.5 189.61 L
114.786 189.86 L
117.071 190.384 L
119.357 193.341 L
121.643 191.443 L
123.929 191.752 L
126.214 194.481 L
128.5 195.076 L
130.786 201.342 L
133.071 206.24 L
135.357 208.555 L
137.643 210.136 L
139.929 208.559 L
142.214 209.771 L
144.5 209.235 L
146.786 206.67 L
149.071 205.741 L
151.357 198.474 L
153.643 202.349 L
155.929 195.519 L
158.214 175.838 L
160.5 148.945 L
162.786 128.675 L
165.071 104.326 L
167.357 84.061 L
169.643 64.277 L
171.929 58.837 L
174.214 63.714 L
176.5 67.529 L
178.786 70.582 L
181.071 80.504 L
183.357 84.856 L
185.643 88.111 L
187.929 94.666 L
190.214 95.843 L
192.5 96.984 L
194.786 98.213 L
197.071 98.695 L
199.357 96.775 L
201.643 97.011 L
203.929 99.254 L
206.214 104.261 L
208.5 107.608 L
210.786 108.676 L
213.071 106.315 L
215.357 108.828 L
217.643 107.949 L
219.929 105.402 L
222.214 103.126 L
224.5 102.394 L
226.786 104.08 L
229.071 106.234 L
231.357 104.107 L
233.643 102.857 L
235.929 103.423 L
238.214 102.431 L
240.5 102.131 L
242.786 99.411 L
245.071 97.824 L
247.357 97.8 L
249.643 95.717 L
251.929 97.715 L
254.214 97.739 L
256.5 95.418 L
258.786 99.409 L
261.071 104.654 L
263.357 104.365 L
265.643 103.527 L
267.929 101.341 L
270.214 101.71 L
272.5 101.017 L
274.786 98.349 L
277.071 94.984 L
279.357 93.651 L
281.643 97.894 L
283.929 99.043 L
286.214 98.528 L
288.5 99.027 L
290.786 98.109 L
293.071 96.323 L
295.357 96.433 L
297.643 91.427 L
299.929 92.557 L
302.214 92.405 L
304.5 95.754 L
306.786 99.929 L
309.071 108.733 L
311.357 115.056 L
313.643 122.361 L
315.929 129.14 L
318.214 136.746 L
320.5 143.185 L
322.786 150.11 L
325.071 153.457 L
327.357 158.285 L
329.643 163.447 L
331.929 166.927 L
334.214 172.822 L
336.5 172.891 L
338.786 173.265 L
341.071 176.529 L
343.357 176.694 L
345.643 181.395 L
347.929 181.266 L
350.214 184.006 L
352.5 184.605 L
354.786 185.327 L
357.071 184.57 L
359.357 184.137 L
361.643 181.169 L
363.929 180.892 L
366.214 177.145 L
368.5 176.566 L
370.786 175.343 L
373.071 174.265 L
375.357 173.288 L
377.643 166.301 L
379.929 169.527 L
382.214 166.789 L
384.5 165.785 L
S
GR
GS
[1.00046 0 0 1 0 0] CT
0.98 0.939 0.939 RC
N
85.071 209.479 M
87.357 206.528 L
89.643 207.222 L
91.929 204.272 L
94.214 200.534 L
96.5 198.425 L
98.786 197.385 L
101.071 193.959 L
103.357 195.526 L
105.643 195.347 L
107.929 191.33 L
110.214 188.148 L
112.5 192.287 L
114.786 193.673 L
117.071 196.734 L
119.357 199.039 L
121.643 197.57 L
123.929 201.805 L
126.214 203.786 L
128.5 203.09 L
130.786 207.713 L
133.071 208.886 L
135.357 208.497 L
137.643 211.865 L
139.929 208.431 L
142.214 209.941 L
144.5 208.823 L
146.786 205.769 L
149.071 204.511 L
151.357 203.069 L
153.643 202.829 L
155.929 200.378 L
158.214 181.277 L
160.5 156.393 L
162.786 138.646 L
165.071 113.245 L
167.357 91.525 L
169.643 70.806 L
171.929 64.556 L
174.214 72.854 L
176.5 76.24 L
178.786 78.12 L
181.071 88.449 L
183.357 86.538 L
185.643 91.991 L
187.929 96.739 L
190.214 99.533 L
192.5 99.347 L
194.786 101.656 L
197.071 101.592 L
199.357 101.737 L
201.643 104.879 L
203.929 108.004 L
206.214 107.452 L
208.5 113.095 L
210.786 114.06 L
213.071 116.462 L
215.357 120.716 L
217.643 118.111 L
219.929 116.145 L
222.214 115.246 L
224.5 112.337 L
226.786 112.836 L
229.071 111.551 L
231.357 111.723 L
233.643 117.416 L
235.929 116.95 L
238.214 117.535 L
240.5 119.293 L
242.786 119.534 L
245.071 119.763 L
247.357 111.863 L
249.643 105.436 L
251.929 103.819 L
254.214 103.364 L
256.5 97.971 L
258.786 95.701 L
261.071 92.656 L
263.357 98.579 L
265.643 102.094 L
267.929 98.8 L
270.214 95.28 L
272.5 98.247 L
274.786 97.18 L
277.071 95.962 L
279.357 89.239 L
281.643 84.46 L
283.929 85.031 L
286.214 83.272 L
288.5 79.922 L
290.786 75.54 L
293.071 71.238 L
295.357 73.291 L
297.643 75.547 L
299.929 76.422 L
302.214 79.671 L
304.5 83.549 L
306.786 90.519 L
309.071 100.124 L
311.357 102.952 L
313.643 104.765 L
315.929 109.519 L
318.214 113.134 L
320.5 117.941 L
322.786 123.397 L
325.071 126.388 L
327.357 129.797 L
329.643 138.777 L
331.929 146.408 L
334.214 155.03 L
336.5 160.236 L
338.786 165.13 L
341.071 166.138 L
343.357 167.453 L
345.643 169.066 L
347.929 167.018 L
350.214 165.875 L
352.5 165.96 L
354.786 162.292 L
357.071 164.731 L
359.357 168.912 L
361.643 168.257 L
363.929 170.397 L
366.214 172.895 L
368.5 172.85 L
370.786 175.279 L
373.071 171.318 L
375.357 170.502 L
377.643 170.571 L
379.929 168.888 L
382.214 169.16 L
384.5 166.73 L
384.5 148.562 L
382.214 151.048 L
379.929 151.684 L
377.643 153.163 L
375.357 152.944 L
373.071 154.109 L
370.786 158.764 L
368.5 156.48 L
366.214 156.775 L
363.929 154.134 L
361.643 151.779 L
359.357 152.876 L
357.071 147.983 L
354.786 145.239 L
352.5 147.946 L
350.214 147.176 L
347.929 146.994 L
345.643 148.607 L
343.357 148.402 L
341.071 147.502 L
338.786 146.98 L
336.5 142.472 L
334.214 136.888 L
331.929 128.955 L
329.643 121.805 L
327.357 113.205 L
325.071 110.037 L
322.786 107.211 L
320.5 102.831 L
318.214 98.025 L
315.929 94.757 L
313.643 89.892 L
311.357 86.914 L
309.071 84.679 L
306.786 75.118 L
304.5 68.523 L
302.214 65.492 L
299.929 62.284 L
297.643 61.751 L
295.357 60.259 L
293.071 57.498 L
290.786 62.781 L
288.5 67.102 L
286.214 70.833 L
283.929 72.767 L
281.643 71.852 L
279.357 75.811 L
277.071 82.396 L
274.786 83.354 L
272.5 84.446 L
270.214 82 L
267.929 86.261 L
265.643 89.62 L
263.357 87.588 L
261.071 81.761 L
258.786 85.597 L
256.5 87.469 L
254.214 92.625 L
251.929 92.983 L
249.643 94.218 L
247.357 100.49 L
245.071 108.469 L
242.786 108.112 L
240.5 108.517 L
238.214 106.836 L
235.929 105.888 L
233.643 106.266 L
231.357 100.25 L
229.071 99.538 L
226.786 99.614 L
224.5 99.006 L
222.214 101.861 L
219.929 102.503 L
217.643 104.006 L
215.357 107.73 L
213.071 103.384 L
210.786 101.143 L
208.5 100.618 L
206.214 95.756 L
203.929 96.213 L
201.643 93.232 L
199.357 88.92 L
197.071 88.736 L
194.786 89.184 L
192.5 86.958 L
190.214 86.939 L
187.929 85.067 L
185.643 80.576 L
183.357 74.811 L
181.071 76.824 L
178.786 67.688 L
176.5 65.812 L
174.214 62.952 L
171.929 54.533 L
169.643 60.855 L
167.357 82.189 L
165.071 103.597 L
162.786 128.551 L
160.5 146.558 L
158.214 171.907 L
155.929 191.324 L
153.643 194.541 L
151.357 195.014 L
149.071 196.74 L
146.786 199.644 L
144.5 201.975 L
142.214 203.579 L
139.929 202.417 L
137.643 206.443 L
135.357 203.418 L
133.071 204.179 L
130.786 204.086 L
128.5 196.626 L
126.214 196.461 L
123.929 193.255 L
121.643 188.491 L
119.357 188.979 L
117.071 185.89 L
114.786 182.824 L
112.5 181.149 L
110.214 177.033 L
107.929 179.234 L
105.643 183.463 L
103.357 183.655 L
101.071 182.277 L
98.786 184.303 L
96.5 184.881 L
94.214 185.499 L
91.929 189.944 L
89.643 192.865 L
87.357 193.121 L
85.071 196.856 L
82.786 196.423 L
80.5 194.972 L
78.214 188.531 L
75.929 185.109 L
73.643 179.369 L
71.357 176.389 L
69.071 171.473 L
66.786 170.149 L
64.5 166.967 L
64.5 178.835 L
66.786 182.599 L
69.071 184.032 L
71.357 189.627 L
73.643 192.573 L
75.929 197.668 L
78.214 200.184 L
80.5 206.792 L
82.786 208.518 L
cp
f
GR
GS
[1.00046 0 0 1 0 0] CT
0.91 0.729 0.729 RC
1 LJ
0.5 LW
N
64.5 178.835 M
66.786 182.599 L
69.071 184.032 L
71.357 189.627 L
73.643 192.573 L
75.929 197.668 L
78.214 200.184 L
80.5 206.792 L
82.786 208.518 L
85.071 209.479 L
87.357 206.528 L
89.643 207.222 L
91.929 204.272 L
94.214 200.534 L
96.5 198.425 L
98.786 197.385 L
101.071 193.959 L
103.357 195.526 L
105.643 195.347 L
107.929 191.33 L
110.214 188.148 L
112.5 192.287 L
114.786 193.673 L
117.071 196.734 L
119.357 199.039 L
121.643 197.57 L
123.929 201.805 L
126.214 203.786 L
128.5 203.09 L
130.786 207.713 L
133.071 208.886 L
135.357 208.497 L
137.643 211.865 L
139.929 208.431 L
142.214 209.941 L
144.5 208.823 L
146.786 205.769 L
149.071 204.511 L
151.357 203.069 L
153.643 202.829 L
155.929 200.378 L
158.214 181.277 L
160.5 156.393 L
162.786 138.646 L
165.071 113.245 L
167.357 91.525 L
169.643 70.806 L
171.929 64.556 L
174.214 72.854 L
176.5 76.24 L
178.786 78.12 L
181.071 88.449 L
183.357 86.538 L
185.643 91.991 L
187.929 96.739 L
190.214 99.533 L
192.5 99.347 L
194.786 101.656 L
197.071 101.592 L
199.357 101.737 L
201.643 104.879 L
203.929 108.004 L
206.214 107.452 L
208.5 113.095 L
210.786 114.06 L
213.071 116.462 L
215.357 120.716 L
217.643 118.111 L
219.929 116.145 L
222.214 115.246 L
224.5 112.337 L
226.786 112.836 L
229.071 111.551 L
231.357 111.723 L
233.643 117.416 L
235.929 116.95 L
238.214 117.535 L
240.5 119.293 L
242.786 119.534 L
245.071 119.763 L
247.357 111.863 L
249.643 105.436 L
251.929 103.819 L
254.214 103.364 L
256.5 97.971 L
258.786 95.701 L
261.071 92.656 L
263.357 98.579 L
265.643 102.094 L
267.929 98.8 L
270.214 95.28 L
272.5 98.247 L
274.786 97.18 L
277.071 95.962 L
279.357 89.239 L
281.643 84.46 L
283.929 85.031 L
286.214 83.272 L
288.5 79.922 L
290.786 75.54 L
293.071 71.238 L
295.357 73.291 L
297.643 75.547 L
299.929 76.422 L
302.214 79.671 L
304.5 83.549 L
306.786 90.519 L
309.071 100.124 L
311.357 102.952 L
313.643 104.765 L
315.929 109.519 L
318.214 113.134 L
320.5 117.941 L
322.786 123.397 L
325.071 126.388 L
327.357 129.797 L
329.643 138.777 L
331.929 146.408 L
334.214 155.03 L
336.5 160.236 L
338.786 165.13 L
341.071 166.138 L
343.357 167.453 L
345.643 169.066 L
347.929 167.018 L
350.214 165.875 L
352.5 165.96 L
354.786 162.292 L
357.071 164.731 L
359.357 168.912 L
361.643 168.257 L
363.929 170.397 L
366.214 172.895 L
368.5 172.85 L
370.786 175.279 L
373.071 171.318 L
375.357 170.502 L
377.643 170.571 L
379.929 168.888 L
382.214 169.16 L
384.5 166.73 L
S
GR
GS
[1.00046 0 0 1 0 0] CT
0.91 0.729 0.729 RC
1 LJ
0.5 LW
N
64.5 166.967 M
66.786 170.149 L
69.071 171.473 L
71.357 176.389 L
73.643 179.369 L
75.929 185.109 L
78.214 188.531 L
80.5 194.972 L
82.786 196.423 L
85.071 196.856 L
87.357 193.121 L
89.643 192.865 L
91.929 189.944 L
94.214 185.499 L
96.5 184.881 L
98.786 184.303 L
101.071 182.277 L
103.357 183.655 L
105.643 183.463 L
107.929 179.234 L
110.214 177.033 L
112.5 181.149 L
114.786 182.824 L
117.071 185.89 L
119.357 188.979 L
121.643 188.491 L
123.929 193.255 L
126.214 196.461 L
128.5 196.626 L
130.786 204.086 L
133.071 204.179 L
135.357 203.418 L
137.643 206.443 L
139.929 202.417 L
142.214 203.579 L
144.5 201.975 L
146.786 199.644 L
149.071 196.74 L
151.357 195.014 L
153.643 194.541 L
155.929 191.324 L
158.214 171.907 L
160.5 146.558 L
162.786 128.551 L
165.071 103.597 L
167.357 82.189 L
169.643 60.855 L
171.929 54.533 L
174.214 62.952 L
176.5 65.812 L
178.786 67.688 L
181.071 76.824 L
183.357 74.811 L
185.643 80.576 L
187.929 85.067 L
190.214 86.939 L
192.5 86.958 L
194.786 89.184 L
197.071 88.736 L
199.357 88.92 L
201.643 93.232 L
203.929 96.213 L
206.214 95.756 L
208.5 100.618 L
210.786 101.143 L
213.071 103.384 L
215.357 107.73 L
217.643 104.006 L
219.929 102.503 L
222.214 101.861 L
224.5 99.006 L
226.786 99.614 L
229.071 99.538 L
231.357 100.25 L
233.643 106.266 L
235.929 105.888 L
238.214 106.836 L
240.5 108.517 L
242.786 108.112 L
245.071 108.469 L
247.357 100.49 L
249.643 94.218 L
251.929 92.983 L
254.214 92.625 L
256.5 87.469 L
258.786 85.597 L
261.071 81.761 L
263.357 87.588 L
265.643 89.62 L
267.929 86.261 L
270.214 82 L
272.5 84.446 L
274.786 83.354 L
277.071 82.396 L
279.357 75.811 L
281.643 71.852 L
283.929 72.767 L
286.214 70.833 L
288.5 67.102 L
290.786 62.781 L
293.071 57.498 L
295.357 60.259 L
297.643 61.751 L
299.929 62.284 L
302.214 65.492 L
304.5 68.523 L
306.786 75.118 L
309.071 84.679 L
311.357 86.914 L
313.643 89.892 L
315.929 94.757 L
318.214 98.025 L
320.5 102.831 L
322.786 107.211 L
325.071 110.037 L
327.357 113.205 L
329.643 121.805 L
331.929 128.955 L
334.214 136.888 L
336.5 142.472 L
338.786 146.98 L
341.071 147.502 L
343.357 148.402 L
345.643 148.607 L
347.929 146.994 L
350.214 147.176 L
352.5 147.946 L
354.786 145.239 L
357.071 147.983 L
359.357 152.876 L
361.643 151.779 L
363.929 154.134 L
366.214 156.775 L
368.5 156.48 L
370.786 158.764 L
373.071 154.109 L
375.357 152.944 L
377.643 153.163 L
379.929 151.684 L
382.214 151.048 L
384.5 148.562 L
S
GR
GS
[1.00046 0 0 1 0 0] CT
0.8 0.4 0.4 RC
1 LJ
2 LW
N
64.5 172.901 M
66.786 176.374 L
69.071 177.752 L
71.357 183.008 L
73.643 185.971 L
75.929 191.389 L
78.214 194.358 L
80.5 200.882 L
82.786 202.471 L
85.071 203.167 L
87.357 199.824 L
89.643 200.043 L
91.929 197.108 L
94.214 193.016 L
96.5 191.653 L
98.786 190.844 L
101.071 188.118 L
103.357 189.59 L
105.643 189.405 L
107.929 185.282 L
110.214 182.59 L
112.5 186.718 L
114.786 188.248 L
117.071 191.312 L
119.357 194.009 L
121.643 193.03 L
123.929 197.53 L
126.214 200.123 L
128.5 199.858 L
130.786 205.899 L
133.071 206.533 L
135.357 205.957 L
137.643 209.154 L
139.929 205.424 L
142.214 206.76 L
144.5 205.399 L
146.786 202.707 L
149.071 200.625 L
151.357 199.041 L
153.643 198.685 L
155.929 195.851 L
158.214 176.592 L
160.5 151.476 L
162.786 133.599 L
165.071 108.421 L
167.357 86.857 L
169.643 65.83 L
171.929 59.544 L
174.214 67.903 L
176.5 71.026 L
178.786 72.904 L
181.071 82.637 L
183.357 80.674 L
185.643 86.283 L
187.929 90.903 L
190.214 93.236 L
192.5 93.152 L
194.786 95.42 L
197.071 95.164 L
199.357 95.328 L
201.643 99.055 L
203.929 102.109 L
206.214 101.604 L
208.5 106.857 L
210.786 107.601 L
213.071 109.923 L
215.357 114.223 L
217.643 111.059 L
219.929 109.324 L
222.214 108.553 L
224.5 105.672 L
226.786 106.225 L
229.071 105.544 L
231.357 105.986 L
233.643 111.841 L
235.929 111.419 L
238.214 112.186 L
240.5 113.905 L
242.786 113.823 L
245.071 114.116 L
247.357 106.176 L
249.643 99.827 L
251.929 98.401 L
254.214 97.994 L
256.5 92.72 L
258.786 90.649 L
261.071 87.208 L
263.357 93.084 L
265.643 95.857 L
267.929 92.531 L
270.214 88.64 L
272.5 91.347 L
274.786 90.267 L
277.071 89.179 L
279.357 82.525 L
281.643 78.156 L
283.929 78.899 L
286.214 77.053 L
288.5 73.512 L
290.786 69.161 L
293.071 64.368 L
295.357 66.775 L
297.643 68.649 L
299.929 69.353 L
302.214 72.582 L
304.5 76.036 L
306.786 82.818 L
309.071 92.401 L
311.357 94.933 L
313.643 97.328 L
315.929 102.138 L
318.214 105.579 L
320.5 110.386 L
322.786 115.304 L
325.071 118.213 L
327.357 121.501 L
329.643 130.291 L
331.929 137.682 L
334.214 145.959 L
336.5 151.354 L
338.786 156.055 L
341.071 156.82 L
343.357 157.927 L
345.643 158.836 L
347.929 157.006 L
350.214 156.526 L
352.5 156.953 L
354.786 153.765 L
357.071 156.357 L
359.357 160.894 L
361.643 160.018 L
363.929 162.266 L
366.214 164.835 L
368.5 164.665 L
370.786 167.021 L
373.071 162.714 L
375.357 161.723 L
377.643 161.867 L
379.929 160.286 L
382.214 160.104 L
384.5 157.646 L
S
GR
GS
[1.00046 0 0 1 0 0] CT
0.959 0.918 0.918 RC
N
101.071 198.75 M
103.357 198.02 L
105.643 197.371 L
107.929 196.743 L
110.214 196.192 L
112.5 197.153 L
114.786 198.015 L
117.071 199.966 L
119.357 200.833 L
121.643 203.559 L
123.929 205.199 L
126.214 201.76 L
128.5 204.483 L
130.786 202.945 L
133.071 202.161 L
135.357 205.837 L
137.643 202.892 L
139.929 204.258 L
142.214 209.6 L
144.5 211.242 L
146.786 214.106 L
149.071 214.72 L
151.357 211.571 L
153.643 213.273 L
155.929 208.05 L
158.214 188.304 L
160.5 164.235 L
162.786 147.37 L
165.071 130.307 L
167.357 115.701 L
169.643 97.999 L
171.929 92.565 L
174.214 97.852 L
176.5 107.139 L
178.786 108.891 L
181.071 110.443 L
183.357 111 L
185.643 114.262 L
187.929 113.214 L
190.214 114.518 L
192.5 112.172 L
194.786 114.692 L
197.071 118.731 L
199.357 124.133 L
201.643 127.914 L
203.929 132.774 L
206.214 133.045 L
208.5 131.155 L
210.786 129.164 L
213.071 127.343 L
215.357 122.817 L
217.643 121.168 L
219.929 120.041 L
222.214 123.58 L
224.5 125 L
226.786 124.648 L
229.071 121.843 L
231.357 120.397 L
233.643 119.091 L
235.929 117.195 L
238.214 114.877 L
240.5 114.496 L
242.786 115.552 L
245.071 113.606 L
247.357 113.104 L
249.643 114.126 L
251.929 113.141 L
254.214 112.518 L
256.5 115.39 L
258.786 111.759 L
261.071 112.231 L
263.357 112.635 L
265.643 109.724 L
267.929 105.59 L
270.214 105.01 L
272.5 103.031 L
274.786 101.698 L
277.071 102.161 L
279.357 101.831 L
281.643 97.254 L
283.929 95.58 L
286.214 93.62 L
288.5 93.115 L
290.786 94.466 L
293.071 91.294 L
295.357 88.063 L
297.643 91.626 L
299.929 91.283 L
302.214 93.048 L
304.5 89.933 L
306.786 92.833 L
309.071 95.615 L
311.357 97.596 L
313.643 96.274 L
315.929 103.412 L
318.214 108.512 L
320.5 114.058 L
322.786 116.264 L
325.071 123.1 L
327.357 126.753 L
329.643 136.177 L
331.929 142.805 L
334.214 148.243 L
336.5 152.589 L
338.786 156.876 L
341.071 159.753 L
343.357 163.132 L
345.643 165.848 L
347.929 166.026 L
350.214 167.004 L
352.5 164.248 L
354.786 165.04 L
357.071 165.28 L
359.357 167.321 L
361.643 165.466 L
363.929 166.43 L
366.214 167.554 L
368.5 168.679 L
370.786 172.061 L
373.071 170.716 L
375.357 163.976 L
377.643 164.722 L
379.929 167.33 L
382.214 168.067 L
384.5 169.26 L
384.5 148.791 L
382.214 147.246 L
379.929 146.567 L
377.643 143.686 L
375.357 142.773 L
373.071 148.557 L
370.786 150.515 L
368.5 146.875 L
366.214 145.574 L
363.929 143.112 L
361.643 142.165 L
359.357 142.482 L
357.071 140.406 L
354.786 139.514 L
352.5 138.171 L
350.214 140.627 L
347.929 140.163 L
345.643 139.859 L
343.357 137.692 L
341.071 134.982 L
338.786 133.005 L
336.5 129.269 L
334.214 125.641 L
331.929 120.369 L
329.643 113.703 L
327.357 104.504 L
325.071 100.029 L
322.786 93.186 L
320.5 90.539 L
318.214 84.468 L
315.929 79.177 L
313.643 72.234 L
311.357 73.434 L
309.071 71.835 L
306.786 69.497 L
304.5 67.373 L
302.214 70.761 L
299.929 70.112 L
297.643 71.584 L
295.357 68.678 L
293.071 72.597 L
290.786 75.103 L
288.5 73.733 L
286.214 73.6 L
283.929 74.805 L
281.643 76.628 L
279.357 81.044 L
277.071 81.577 L
274.786 81.466 L
272.5 82.262 L
270.214 83.388 L
267.929 84.049 L
265.643 87.49 L
263.357 90.084 L
261.071 90.43 L
258.786 90.386 L
256.5 94.872 L
254.214 93.017 L
251.929 94.815 L
249.643 96.692 L
247.357 97.047 L
245.071 97.231 L
242.786 99.356 L
240.5 99.125 L
238.214 99.957 L
235.929 102.87 L
233.643 104.911 L
231.357 105.647 L
229.071 107.008 L
226.786 109.801 L
224.5 110.121 L
222.214 108.999 L
219.929 105.082 L
217.643 105.825 L
215.357 106.497 L
213.071 111.781 L
210.786 113.43 L
208.5 116.4 L
206.214 117.969 L
203.929 117.97 L
201.643 112.659 L
199.357 109.105 L
197.071 103.953 L
194.786 100.774 L
192.5 97.19 L
190.214 99.229 L
187.929 99.624 L
185.643 100.807 L
183.357 97.242 L
181.071 97.308 L
178.786 96.61 L
176.5 95.891 L
174.214 86.803 L
171.929 81.094 L
169.643 86.61 L
167.357 104.842 L
165.071 119.555 L
162.786 135.673 L
160.5 152.66 L
158.214 177.682 L
155.929 197.707 L
153.643 203.144 L
151.357 202.046 L
149.071 205.402 L
146.786 205.608 L
144.5 204.399 L
142.214 203.695 L
139.929 199.156 L
137.643 197.632 L
135.357 199.723 L
133.071 196.353 L
130.786 198.313 L
128.5 198.079 L
126.214 194.126 L
123.929 197.135 L
121.643 195.616 L
119.357 192.506 L
117.071 191.137 L
114.786 188.247 L
112.5 185.964 L
110.214 183.338 L
107.929 182.927 L
105.643 183.966 L
103.357 185.661 L
101.071 185.967 L
98.786 183.864 L
96.5 185.257 L
94.214 188.158 L
91.929 182.044 L
89.643 182.716 L
87.357 184.411 L
85.071 184.368 L
82.786 186.667 L
80.5 188.946 L
78.214 181.846 L
75.929 183.357 L
73.643 176.571 L
71.357 174.843 L
69.071 168.226 L
66.786 164.555 L
64.5 161.046 L
64.5 176.988 L
66.786 179.968 L
69.071 183.504 L
71.357 189.775 L
73.643 191.467 L
75.929 197.321 L
78.214 195.052 L
80.5 201.862 L
82.786 200.245 L
85.071 199.72 L
87.357 200.264 L
89.643 198.676 L
91.929 197.542 L
94.214 201.537 L
96.5 198.782 L
98.786 196.602 L
cp
f
GR
GS
[1.00046 0 0 1 0 0] CT
0.82 0.639 0.639 RC
1 LJ
0.5 LW
N
64.5 176.988 M
66.786 179.968 L
69.071 183.504 L
71.357 189.775 L
73.643 191.467 L
75.929 197.321 L
78.214 195.052 L
80.5 201.862 L
82.786 200.245 L
85.071 199.72 L
87.357 200.264 L
89.643 198.676 L
91.929 197.542 L
94.214 201.537 L
96.5 198.782 L
98.786 196.602 L
101.071 198.75 L
103.357 198.02 L
105.643 197.371 L
107.929 196.743 L
110.214 196.192 L
112.5 197.153 L
114.786 198.015 L
117.071 199.966 L
119.357 200.833 L
121.643 203.559 L
123.929 205.199 L
126.214 201.76 L
128.5 204.483 L
130.786 202.945 L
133.071 202.161 L
135.357 205.837 L
137.643 202.892 L
139.929 204.258 L
142.214 209.6 L
144.5 211.242 L
146.786 214.106 L
149.071 214.72 L
151.357 211.571 L
153.643 213.273 L
155.929 208.05 L
158.214 188.304 L
160.5 164.235 L
162.786 147.37 L
165.071 130.307 L
167.357 115.701 L
169.643 97.999 L
171.929 92.565 L
174.214 97.852 L
176.5 107.139 L
178.786 108.891 L
181.071 110.443 L
183.357 111 L
185.643 114.262 L
187.929 113.214 L
190.214 114.518 L
192.5 112.172 L
194.786 114.692 L
197.071 118.731 L
199.357 124.133 L
201.643 127.914 L
203.929 132.774 L
206.214 133.045 L
208.5 131.155 L
210.786 129.164 L
213.071 127.343 L
215.357 122.817 L
217.643 121.168 L
219.929 120.041 L
222.214 123.58 L
224.5 125 L
226.786 124.648 L
229.071 121.843 L
231.357 120.397 L
233.643 119.091 L
235.929 117.195 L
238.214 114.877 L
240.5 114.496 L
242.786 115.552 L
245.071 113.606 L
247.357 113.104 L
249.643 114.126 L
251.929 113.141 L
254.214 112.518 L
256.5 115.39 L
258.786 111.759 L
261.071 112.231 L
263.357 112.635 L
265.643 109.724 L
267.929 105.59 L
270.214 105.01 L
272.5 103.031 L
274.786 101.698 L
277.071 102.161 L
279.357 101.831 L
281.643 97.254 L
283.929 95.58 L
286.214 93.62 L
288.5 93.115 L
290.786 94.466 L
293.071 91.294 L
295.357 88.063 L
297.643 91.626 L
299.929 91.283 L
302.214 93.048 L
304.5 89.933 L
306.786 92.833 L
309.071 95.615 L
311.357 97.596 L
313.643 96.274 L
315.929 103.412 L
318.214 108.512 L
320.5 114.058 L
322.786 116.264 L
325.071 123.1 L
327.357 126.753 L
329.643 136.177 L
331.929 142.805 L
334.214 148.243 L
336.5 152.589 L
338.786 156.876 L
341.071 159.753 L
343.357 163.132 L
345.643 165.848 L
347.929 166.026 L
350.214 167.004 L
352.5 164.248 L
354.786 165.04 L
357.071 165.28 L
359.357 167.321 L
361.643 165.466 L
363.929 166.43 L
366.214 167.554 L
368.5 168.679 L
370.786 172.061 L
373.071 170.716 L
375.357 163.976 L
377.643 164.722 L
379.929 167.33 L
382.214 168.067 L
384.5 169.26 L
S
GR
GS
[1.00046 0 0 1 0 0] CT
0.82 0.639 0.639 RC
1 LJ
0.5 LW
N
64.5 161.046 M
66.786 164.555 L
69.071 168.226 L
71.357 174.843 L
73.643 176.571 L
75.929 183.357 L
78.214 181.846 L
80.5 188.946 L
82.786 186.667 L
85.071 184.368 L
87.357 184.411 L
89.643 182.716 L
91.929 182.044 L
94.214 188.158 L
96.5 185.257 L
98.786 183.864 L
101.071 185.967 L
103.357 185.661 L
105.643 183.966 L
107.929 182.927 L
110.214 183.338 L
112.5 185.964 L
114.786 188.247 L
117.071 191.137 L
119.357 192.506 L
121.643 195.616 L
123.929 197.135 L
126.214 194.126 L
128.5 198.079 L
130.786 198.313 L
133.071 196.353 L
135.357 199.723 L
137.643 197.632 L
139.929 199.156 L
142.214 203.695 L
144.5 204.399 L
146.786 205.608 L
149.071 205.402 L
151.357 202.046 L
153.643 203.144 L
155.929 197.707 L
158.214 177.682 L
160.5 152.66 L
162.786 135.673 L
165.071 119.555 L
167.357 104.842 L
169.643 86.61 L
171.929 81.094 L
174.214 86.803 L
176.5 95.891 L
178.786 96.61 L
181.071 97.308 L
183.357 97.242 L
185.643 100.807 L
187.929 99.624 L
190.214 99.229 L
192.5 97.19 L
194.786 100.774 L
197.071 103.953 L
199.357 109.105 L
201.643 112.659 L
203.929 117.97 L
206.214 117.969 L
208.5 116.4 L
210.786 113.43 L
213.071 111.781 L
215.357 106.497 L
217.643 105.825 L
219.929 105.082 L
222.214 108.999 L
224.5 110.121 L
226.786 109.801 L
229.071 107.008 L
231.357 105.647 L
233.643 104.911 L
235.929 102.87 L
238.214 99.957 L
240.5 99.125 L
242.786 99.356 L
245.071 97.231 L
247.357 97.047 L
249.643 96.692 L
251.929 94.815 L
254.214 93.017 L
256.5 94.872 L
258.786 90.386 L
261.071 90.43 L
263.357 90.084 L
265.643 87.49 L
267.929 84.049 L
270.214 83.388 L
272.5 82.262 L
274.786 81.466 L
277.071 81.577 L
279.357 81.044 L
281.643 76.628 L
283.929 74.805 L
286.214 73.6 L
288.5 73.733 L
290.786 75.103 L
293.071 72.597 L
295.357 68.678 L
297.643 71.584 L
299.929 70.112 L
302.214 70.761 L
304.5 67.373 L
306.786 69.497 L
309.071 71.835 L
311.357 73.434 L
313.643 72.234 L
315.929 79.177 L
318.214 84.468 L
320.5 90.539 L
322.786 93.186 L
325.071 100.029 L
327.357 104.504 L
329.643 113.703 L
331.929 120.369 L
334.214 125.641 L
336.5 129.269 L
338.786 133.005 L
341.071 134.982 L
343.357 137.692 L
345.643 139.859 L
347.929 140.163 L
350.214 140.627 L
352.5 138.171 L
354.786 139.514 L
357.071 140.406 L
359.357 142.482 L
361.643 142.165 L
363.929 143.112 L
366.214 145.574 L
368.5 146.875 L
370.786 150.515 L
373.071 148.557 L
375.357 142.773 L
377.643 143.686 L
379.929 146.567 L
382.214 147.246 L
384.5 148.791 L
S
GR
GS
[1.00046 0 0 1 0 0] CT
0.6 0.2 0.2 RC
1 LJ
2 LW
N
64.5 169.017 M
66.786 172.262 L
69.071 175.865 L
71.357 182.309 L
73.643 184.019 L
75.929 190.339 L
78.214 188.449 L
80.5 195.404 L
82.786 193.456 L
85.071 192.044 L
87.357 192.337 L
89.643 190.696 L
91.929 189.793 L
94.214 194.847 L
96.5 192.02 L
98.786 190.233 L
101.071 192.358 L
103.357 191.84 L
105.643 190.668 L
107.929 189.835 L
110.214 189.765 L
112.5 191.558 L
114.786 193.131 L
117.071 195.552 L
119.357 196.67 L
121.643 199.587 L
123.929 201.167 L
126.214 197.943 L
128.5 201.281 L
130.786 200.629 L
133.071 199.257 L
135.357 202.78 L
137.643 200.262 L
139.929 201.707 L
142.214 206.647 L
144.5 207.821 L
146.786 209.857 L
149.071 210.061 L
151.357 206.809 L
153.643 208.208 L
155.929 202.878 L
158.214 182.993 L
160.5 158.448 L
162.786 141.522 L
165.071 124.931 L
167.357 110.272 L
169.643 92.305 L
171.929 86.83 L
174.214 92.327 L
176.5 101.515 L
178.786 102.751 L
181.071 103.875 L
183.357 104.121 L
185.643 107.535 L
187.929 106.419 L
190.214 106.873 L
192.5 104.681 L
194.786 107.733 L
197.071 111.342 L
199.357 116.619 L
201.643 120.286 L
203.929 125.372 L
206.214 125.507 L
208.5 123.778 L
210.786 121.297 L
213.071 119.562 L
215.357 114.657 L
217.643 113.496 L
219.929 112.562 L
222.214 116.29 L
224.5 117.561 L
226.786 117.224 L
229.071 114.426 L
231.357 113.022 L
233.643 112.001 L
235.929 110.033 L
238.214 107.417 L
240.5 106.811 L
242.786 107.454 L
245.071 105.418 L
247.357 105.076 L
249.643 105.409 L
251.929 103.978 L
254.214 102.768 L
256.5 105.131 L
258.786 101.072 L
261.071 101.331 L
263.357 101.359 L
265.643 98.607 L
267.929 94.82 L
270.214 94.199 L
272.5 92.646 L
274.786 91.582 L
277.071 91.869 L
279.357 91.438 L
281.643 86.941 L
283.929 85.192 L
286.214 83.61 L
288.5 83.424 L
290.786 84.785 L
293.071 81.946 L
295.357 78.371 L
297.643 81.605 L
299.929 80.698 L
302.214 81.904 L
304.5 78.653 L
306.786 81.165 L
309.071 83.725 L
311.357 85.515 L
313.643 84.254 L
315.929 91.295 L
318.214 96.49 L
320.5 102.299 L
322.786 104.725 L
325.071 111.564 L
327.357 115.629 L
329.643 124.94 L
331.929 131.587 L
334.214 136.942 L
336.5 140.929 L
338.786 144.94 L
341.071 147.368 L
343.357 150.412 L
345.643 152.854 L
347.929 153.094 L
350.214 153.815 L
352.5 151.21 L
354.786 152.277 L
357.071 152.843 L
359.357 154.902 L
361.643 153.815 L
363.929 154.771 L
366.214 156.564 L
368.5 157.777 L
370.786 161.288 L
373.071 159.636 L
375.357 153.375 L
377.643 154.204 L
379.929 156.948 L
382.214 157.656 L
384.5 159.025 L
S
GR
%%Trailer
%%Pages: 1
%%EOF
