%!PS-Adobe-3.0 EPSF-3.0
%%Creator: (MATLAB, The Mathworks, Inc. Version 9.8.0.1323502 \(R2020a\). Operating System: Mac OS X)
%%Title: /Users/kosciessa/Desktop/tardis/LNDG/stateswitch/stsw_eeg_task/tfr/figures/f02_signatureBS.eps
%%CreationDate: 2022-02-21T12:22:55
%%Pages: (atend)
%%BoundingBox:   221     0  1797   329
%%LanguageLevel: 3
%%EndComments
%%BeginProlog
%%BeginResource: procset (Apache XML Graphics Std ProcSet) 1.2 0
%%Version: 1.2 0
%%Copyright: (Copyright 2001-2003,2010 The Apache Software Foundation. License terms: http://www.apache.org/licenses/LICENSE-2.0)
/bd{bind def}bind def
/ld{load def}bd
/GR/grestore ld
/GS/gsave ld
/RM/rmoveto ld
/C/curveto ld
/t/show ld
/L/lineto ld
/ML/setmiterlimit ld
/CT/concat ld
/f/fill ld
/N/newpath ld
/S/stroke ld
/CC/setcmykcolor ld
/A/ashow ld
/cp/closepath ld
/RC/setrgbcolor ld
/LJ/setlinejoin ld
/GC/setgray ld
/LW/setlinewidth ld
/M/moveto ld
/re {4 2 roll M
1 index 0 rlineto
0 exch rlineto
neg 0 rlineto
cp } bd
/_ctm matrix def
/_tm matrix def
/BT { _ctm currentmatrix pop matrix _tm copy pop 0 0 moveto } bd
/ET { _ctm setmatrix } bd
/iTm { _ctm setmatrix _tm concat } bd
/Tm { _tm astore pop iTm 0 0 moveto } bd
/ux 0.0 def
/uy 0.0 def
/F {
  /Tp exch def
  /Tf exch def
  Tf findfont Tp scalefont setfont
  /cf Tf def  /cs Tp def
} bd
/ULS {currentpoint /uy exch def /ux exch def} bd
/ULE {
  /Tcx currentpoint pop def
  gsave
  newpath
  cf findfont cs scalefont dup
  /FontMatrix get 0 get /Ts exch def /FontInfo get dup
  /UnderlinePosition get Ts mul /To exch def
  /UnderlineThickness get Ts mul /Tt exch def
  ux uy To add moveto  Tcx uy To add lineto
  Tt setlinewidth stroke
  grestore
} bd
/OLE {
  /Tcx currentpoint pop def
  gsave
  newpath
  cf findfont cs scalefont dup
  /FontMatrix get 0 get /Ts exch def /FontInfo get dup
  /UnderlinePosition get Ts mul /To exch def
  /UnderlineThickness get Ts mul /Tt exch def
  ux uy To add cs add moveto Tcx uy To add cs add lineto
  Tt setlinewidth stroke
  grestore
} bd
/SOE {
  /Tcx currentpoint pop def
  gsave
  newpath
  cf findfont cs scalefont dup
  /FontMatrix get 0 get /Ts exch def /FontInfo get dup
  /UnderlinePosition get Ts mul /To exch def
  /UnderlineThickness get Ts mul /Tt exch def
  ux uy To add cs 10 mul 26 idiv add moveto Tcx uy To add cs 10 mul 26 idiv add lineto
  Tt setlinewidth stroke
  grestore
} bd
/QT {
/Y22 exch store
/X22 exch store
/Y21 exch store
/X21 exch store
currentpoint
/Y21 load 2 mul add 3 div exch
/X21 load 2 mul add 3 div exch
/X21 load 2 mul /X22 load add 3 div
/Y21 load 2 mul /Y22 load add 3 div
/X22 load /Y22 load curveto
} bd
/SSPD {
dup length /d exch dict def
{
/v exch def
/k exch def
currentpagedevice k known {
/cpdv currentpagedevice k get def
v cpdv ne {
/upd false def
/nullv v type /nulltype eq def
/nullcpdv cpdv type /nulltype eq def
nullv nullcpdv or
{
/upd true def
} {
/sametype v type cpdv type eq def
sametype {
v type /arraytype eq {
/vlen v length def
/cpdvlen cpdv length def
vlen cpdvlen eq {
0 1 vlen 1 sub {
/i exch def
/obj v i get def
/cpdobj cpdv i get def
obj cpdobj ne {
/upd true def
exit
} if
} for
} {
/upd true def
} ifelse
} {
v type /dicttype eq {
v {
/dv exch def
/dk exch def
/cpddv cpdv dk get def
dv cpddv ne {
/upd true def
exit
} if
} forall
} {
/upd true def
} ifelse
} ifelse
} if
} ifelse
upd true eq {
d k v put
} if
} if
} if
} forall
d length 0 gt {
d setpagedevice
} if
} bd
/RE { % /NewFontName [NewEncodingArray] /FontName RE -
  findfont dup length dict begin
  {
    1 index /FID ne
    {def} {pop pop} ifelse
  } forall
  /Encoding exch def
  /FontName 1 index def
  currentdict definefont pop
  end
} bind def
%%EndResource
%%BeginResource: procset (Apache XML Graphics EPS ProcSet) 1.0 0
%%Version: 1.0 0
%%Copyright: (Copyright 2002-2003 The Apache Software Foundation. License terms: http://www.apache.org/licenses/LICENSE-2.0)
/BeginEPSF { %def
/b4_Inc_state save def         % Save state for cleanup
/dict_count countdictstack def % Count objects on dict stack
/op_count count 1 sub def      % Count objects on operand stack
userdict begin                 % Push userdict on dict stack
/showpage { } def              % Redefine showpage, { } = null proc
0 setgray 0 setlinecap         % Prepare graphics state
1 setlinewidth 0 setlinejoin
10 setmiterlimit [ ] 0 setdash newpath
/languagelevel where           % If level not equal to 1 then
{pop languagelevel             % set strokeadjust and
1 ne                           % overprint to their defaults.
{false setstrokeadjust false setoverprint
} if
} if
} bd
/EndEPSF { %def
count op_count sub {pop} repeat            % Clean up stacks
countdictstack dict_count sub {end} repeat
b4_Inc_state restore
} bd
%%EndResource
%FOPBeginFontDict
%%IncludeResource: font Courier-Oblique
%%IncludeResource: font Courier-BoldOblique
%%IncludeResource: font Courier-Bold
%%IncludeResource: font ZapfDingbats
%%IncludeResource: font Symbol
%%IncludeResource: font Helvetica
%%IncludeResource: font Helvetica-Oblique
%%IncludeResource: font Helvetica-Bold
%%IncludeResource: font Helvetica-BoldOblique
%%IncludeResource: font Times-Roman
%%IncludeResource: font Times-Italic
%%IncludeResource: font Times-Bold
%%IncludeResource: font Times-BoldItalic
%%IncludeResource: font Courier
%FOPEndFontDict
%%BeginResource: encoding WinAnsiEncoding
/WinAnsiEncoding [
/.notdef /.notdef /.notdef /.notdef /.notdef
/.notdef /.notdef /.notdef /.notdef /.notdef
/.notdef /.notdef /.notdef /.notdef /.notdef
/.notdef /.notdef /.notdef /.notdef /.notdef
/.notdef /.notdef /.notdef /.notdef /.notdef
/.notdef /.notdef /.notdef /.notdef /.notdef
/.notdef /.notdef /space /exclam /quotedbl
/numbersign /dollar /percent /ampersand /quotesingle
/parenleft /parenright /asterisk /plus /comma
/hyphen /period /slash /zero /one
/two /three /four /five /six
/seven /eight /nine /colon /semicolon
/less /equal /greater /question /at
/A /B /C /D /E
/F /G /H /I /J
/K /L /M /N /O
/P /Q /R /S /T
/U /V /W /X /Y
/Z /bracketleft /backslash /bracketright /asciicircum
/underscore /quoteleft /a /b /c
/d /e /f /g /h
/i /j /k /l /m
/n /o /p /q /r
/s /t /u /v /w
/x /y /z /braceleft /bar
/braceright /asciitilde /bullet /Euro /bullet
/quotesinglbase /florin /quotedblbase /ellipsis /dagger
/daggerdbl /circumflex /perthousand /Scaron /guilsinglleft
/OE /bullet /Zcaron /bullet /bullet
/quoteleft /quoteright /quotedblleft /quotedblright /bullet
/endash /emdash /asciitilde /trademark /scaron
/guilsinglright /oe /bullet /zcaron /Ydieresis
/space /exclamdown /cent /sterling /currency
/yen /brokenbar /section /dieresis /copyright
/ordfeminine /guillemotleft /logicalnot /sfthyphen /registered
/macron /degree /plusminus /twosuperior /threesuperior
/acute /mu /paragraph /middot /cedilla
/onesuperior /ordmasculine /guillemotright /onequarter /onehalf
/threequarters /questiondown /Agrave /Aacute /Acircumflex
/Atilde /Adieresis /Aring /AE /Ccedilla
/Egrave /Eacute /Ecircumflex /Edieresis /Igrave
/Iacute /Icircumflex /Idieresis /Eth /Ntilde
/Ograve /Oacute /Ocircumflex /Otilde /Odieresis
/multiply /Oslash /Ugrave /Uacute /Ucircumflex
/Udieresis /Yacute /Thorn /germandbls /agrave
/aacute /acircumflex /atilde /adieresis /aring
/ae /ccedilla /egrave /eacute /ecircumflex
/edieresis /igrave /iacute /icircumflex /idieresis
/eth /ntilde /ograve /oacute /ocircumflex
/otilde /odieresis /divide /oslash /ugrave
/uacute /ucircumflex /udieresis /yacute /thorn
/ydieresis
] def
%%EndResource
%FOPBeginFontReencode
/Courier-Oblique findfont
dup length dict begin
  {1 index /FID ne {def} {pop pop} ifelse} forall
  /Encoding WinAnsiEncoding def
  currentdict
end
/Courier-Oblique exch definefont pop
/Courier-BoldOblique findfont
dup length dict begin
  {1 index /FID ne {def} {pop pop} ifelse} forall
  /Encoding WinAnsiEncoding def
  currentdict
end
/Courier-BoldOblique exch definefont pop
/Courier-Bold findfont
dup length dict begin
  {1 index /FID ne {def} {pop pop} ifelse} forall
  /Encoding WinAnsiEncoding def
  currentdict
end
/Courier-Bold exch definefont pop
/Helvetica findfont
dup length dict begin
  {1 index /FID ne {def} {pop pop} ifelse} forall
  /Encoding WinAnsiEncoding def
  currentdict
end
/Helvetica exch definefont pop
/Helvetica-Oblique findfont
dup length dict begin
  {1 index /FID ne {def} {pop pop} ifelse} forall
  /Encoding WinAnsiEncoding def
  currentdict
end
/Helvetica-Oblique exch definefont pop
/Helvetica-Bold findfont
dup length dict begin
  {1 index /FID ne {def} {pop pop} ifelse} forall
  /Encoding WinAnsiEncoding def
  currentdict
end
/Helvetica-Bold exch definefont pop
/Helvetica-BoldOblique findfont
dup length dict begin
  {1 index /FID ne {def} {pop pop} ifelse} forall
  /Encoding WinAnsiEncoding def
  currentdict
end
/Helvetica-BoldOblique exch definefont pop
/Times-Roman findfont
dup length dict begin
  {1 index /FID ne {def} {pop pop} ifelse} forall
  /Encoding WinAnsiEncoding def
  currentdict
end
/Times-Roman exch definefont pop
/Times-Italic findfont
dup length dict begin
  {1 index /FID ne {def} {pop pop} ifelse} forall
  /Encoding WinAnsiEncoding def
  currentdict
end
/Times-Italic exch definefont pop
/Times-Bold findfont
dup length dict begin
  {1 index /FID ne {def} {pop pop} ifelse} forall
  /Encoding WinAnsiEncoding def
  currentdict
end
/Times-Bold exch definefont pop
/Times-BoldItalic findfont
dup length dict begin
  {1 index /FID ne {def} {pop pop} ifelse} forall
  /Encoding WinAnsiEncoding def
  currentdict
end
/Times-BoldItalic exch definefont pop
/Courier findfont
dup length dict begin
  {1 index /FID ne {def} {pop pop} ifelse} forall
  /Encoding WinAnsiEncoding def
  currentdict
end
/Courier exch definefont pop
%FOPEndFontReencode
%%EndProlog
%%Page: 1 1
%%PageBoundingBox: 0 0 1969 337
%%BeginPageSetup
[1 0 0 -1 0 337] CT
%%EndPageSetup
GS
1 GC
N
0 0 1969 337 re
f
GR
GS
1 GC
N
0 0 1969 337 re
f
GR
GS
1 GC
N
294.5 282 M
405.5 282 L
405.5 32 L
294.5 32 L
cp
f
GR
GS
0.149 GC
2 setlinecap
1 LJ
0.5 LW
N
294.5 282 M
405.5 282 L
S
GR
GS
0.149 GC
2 setlinecap
1 LJ
0.5 LW
N
327.8 282 M
327.8 279.5 L
S
GR
GS
0.149 GC
2 setlinecap
1 LJ
0.5 LW
N
372.2 282 M
372.2 279.5 L
S
GR
GS
[1 0 0 1 327.79999 288] CT
0.149 GC
/Helvetica 20 F
GS
[1 0 0 1 0 0] CT
-13 20 moveto 
1 -1 scale
(YA) t 
GR
GR
GS
[1 0 0 1 372.20001 288] CT
0.149 GC
/Helvetica 20 F
GS
[1 0 0 1 0 0] CT
-14.5 20 moveto 
1 -1 scale
(OA) t 
GR
GR
GS
[1 0 0 1 350.00006 313] CT
0.149 GC
/Helvetica 20 F
GS
[1 0 0 1 0 0] CT
-49 20 moveto 
1 -1 scale
(Age Group) t 
GR
GR
GS
0.149 GC
2 setlinecap
1 LJ
0.5 LW
N
294.5 282 M
294.5 32 L
S
GR
GS
0.149 GC
2 setlinecap
1 LJ
0.5 LW
N
294.5 282 M
297 282 L
S
GR
GS
0.149 GC
2 setlinecap
1 LJ
0.5 LW
N
294.5 219.5 M
297 219.5 L
S
GR
GS
0.149 GC
2 setlinecap
1 LJ
0.5 LW
N
294.5 157 M
297 157 L
S
GR
GS
0.149 GC
2 setlinecap
1 LJ
0.5 LW
N
294.5 94.5 M
297 94.5 L
S
GR
GS
0.149 GC
2 setlinecap
1 LJ
0.5 LW
N
294.5 32 M
297 32 L
S
GR
GS
[1 0 0 1 288.5 282] CT
0.149 GC
/Helvetica 20 F
GS
[1 0 0 1 0 0] CT
-19 7.5 moveto 
1 -1 scale
(-1) t 
GR
GR
GS
[1 0 0 1 288.5 219.5] CT
0.149 GC
/Helvetica 20 F
GS
[1 0 0 1 0 0] CT
-36 7.5 moveto 
1 -1 scale
(-0.5) t 
GR
GR
GS
[1 0 0 1 288.5 157] CT
0.149 GC
/Helvetica 20 F
GS
[1 0 0 1 0 0] CT
-12 7.5 moveto 
1 -1 scale
(0) t 
GR
GR
GS
[1 0 0 1 288.5 94.5] CT
0.149 GC
/Helvetica 20 F
GS
[1 0 0 1 0 0] CT
-28 7.5 moveto 
1 -1 scale
(0.5) t 
GR
GR
GS
[1 0 0 1 288.5 32] CT
0.149 GC
/Helvetica 20 F
GS
[1 0 0 1 0 0] CT
-12 7.5 moveto 
1 -1 scale
(1) t 
GR
GR
GS
[0 -1 1 0 236 249] CT
0.149 GC
/Helvetica 20 F
GS
[1 0 0 1 0 0] CT
0 0 moveto 
1 -1 scale
(TFR) t 
GR
GR
GS
[0 -1 1 0 246 212] CT
0.149 GC
/Helvetica 16 F
GS
[1 0 0 1 0 0] CT
0 0 moveto 
1 -1 scale
(t) t 
GR
GR
GS
[0 -1 1 0 236 206] CT
0.149 GC
/Helvetica 20 F
GS
[1 0 0 1 0 0] CT
0 0 moveto 
1 -1 scale
(heta) t 
GR
GR
GS
[0 -1 1 0 246 167] CT
0.149 GC
/Helvetica 16 F
GS
[1 0 0 1 0 0] CT
0 0 moveto 
1 -1 scale
(l) t 
GR
GR
GS
[0 -1 1 0 236 163] CT
0.149 GC
/Helvetica 20 F
GS
[1 0 0 1 0 0] CT
0 0 moveto 
1 -1 scale
(inear linear) t 
GR
GR
GS
[1 0 0 1 350.00034 29.5] CT
/Helvetica-Bold 20 F
GS
[1 0 0 1 0 0] CT
-54 -5 moveto 
1 -1 scale
(p = 0.15417) t 
GR
GR
GS
0.149 GC
1 LJ
0.5 LW
N
294.5 157 M
405.5 157 L
S
GR
GS
0.6 GC
N
345.56 157 M
345.56 87.723 L
310.04 87.723 L
310.04 157 L
cp
f
GR
GS
[1 0 0 1 325.1676 92.82468] CT
0.302 GC
N
2.236 0 M
2.236 -1.235 1.235 -2.236 0 -2.236 C
-1.235 -2.236 -2.236 -1.235 -2.236 0 C
-2.236 1.235 -1.235 2.236 0 2.236 C
1.235 2.236 2.236 1.235 2.236 0 C
cp
f
GR
GS
[1 0 0 1 332.79651 127.64913] CT
0.302 GC
N
/f-1586420743{2.236 0 M
2.236 -1.235 1.235 -2.236 0 -2.236 C
-1.235 -2.236 -2.236 -1.235 -2.236 0 C
-2.236 1.235 -1.235 2.236 0 2.236 C
1.235 2.236 2.236 1.235 2.236 0 C
cp}def
f-1586420743
f
GR
GS
[1 0 0 1 326.70773 82.10883] CT
0.302 GC
N
f-1586420743
f
GR
GS
[1 0 0 1 329.47867 38.97092] CT
0.302 GC
N
f-1586420743
f
GR
GS
[1 0 0 1 335.62488 224.15228] CT
0.302 GC
N
f-1586420743
f
GR
GS
[1 0 0 1 326.8194 41.43055] CT
0.302 GC
N
f-1586420743
f
GR
GS
[1 0 0 1 325.0455 108.07119] CT
0.302 GC
N
f-1586420743
f
GR
GS
[1 0 0 1 335.87869 81.83984] CT
0.302 GC
N
f-1586420743
f
GR
GS
[1 0 0 1 330.33102 50.04568] CT
0.302 GC
N
f-1586420743
f
GR
GS
[1 0 0 1 321.6413 54.6752] CT
0.302 GC
N
f-1586420743
f
GR
GS
[1 0 0 1 336.55005 34.8827] CT
0.302 GC
N
f-1586420743
f
GR
GS
[1 0 0 1 327.74594 170.73083] CT
0.302 GC
N
f-1586420743
f
GR
GS
[1 0 0 1 324.53571 56.81716] CT
0.302 GC
N
f-1586420743
f
GR
GS
[1 0 0 1 334.52716 47.60886] CT
0.302 GC
N
f-1586420743
f
GR
GS
[1 0 0 1 320.95114 52.94671] CT
0.302 GC
N
f-1586420743
f
GR
GS
[1 0 0 1 322.28156 88.37682] CT
0.302 GC
N
f-1586420743
f
GR
GS
[1 0 0 1 324.30963 47.6526] CT
0.302 GC
N
f-1586420743
f
GR
GS
[1 0 0 1 333.93451 90.09486] CT
0.302 GC
N
f-1586420743
f
GR
GS
[1 0 0 1 331.10165 48.8666] CT
0.302 GC
N
f-1586420743
f
GR
GS
[1 0 0 1 318.96292 95.20687] CT
0.302 GC
N
f-1586420743
f
GR
GS
[1 0 0 1 322.63171 50.62516] CT
0.302 GC
N
f-1586420743
f
GR
GS
[1 0 0 1 329.89993 68.19007] CT
0.302 GC
N
f-1586420743
f
GR
GS
[1 0 0 1 321.38733 113.01271] CT
0.302 GC
N
f-1586420743
f
GR
GS
[1 0 0 1 323.44464 88.49947] CT
0.302 GC
N
f-1586420743
f
GR
GS
[1 0 0 1 329.9079 127.19872] CT
0.302 GC
N
f-1586420743
f
GR
GS
[1 0 0 1 328.82413 159.66658] CT
0.302 GC
N
f-1586420743
f
GR
GS
[1 0 0 1 328.60684 135.32289] CT
0.302 GC
N
f-1586420743
f
GR
GS
[1 0 0 1 333.75723 91.45496] CT
0.302 GC
N
f-1586420743
f
GR
GS
[1 0 0 1 324.76465 47.51849] CT
0.302 GC
N
f-1586420743
f
GR
GS
[1 0 0 1 320.95493 83.95983] CT
0.302 GC
N
f-1586420743
f
GR
GS
[1 0 0 1 330.15146 103.11551] CT
0.302 GC
N
f-1586420743
f
GR
GS
[1 0 0 1 321.82648 34.26463] CT
0.302 GC
N
f-1586420743
f
GR
GS
[1 0 0 1 319.49686 39.06636] CT
0.302 GC
N
f-1586420743
f
GR
GS
[1 0 0 1 327.26651 51.69674] CT
0.302 GC
N
f-1586420743
f
GR
GS
[1 0 0 1 330.85944 132.50452] CT
0.302 GC
N
f-1586420743
f
GR
GS
[1 0 0 1 326.72748 126.57334] CT
0.302 GC
N
f-1586420743
f
GR
GS
[1 0 0 1 320.18872 50.76514] CT
0.302 GC
N
f-1586420743
f
GR
GS
[1 0 0 1 336.23224 46.79896] CT
0.302 GC
N
f-1586420743
f
GR
GS
[1 0 0 1 320.18588 42.79082] CT
0.302 GC
N
f-1586420743
f
GR
GS
[1 0 0 1 331.46365 66.99551] CT
0.302 GC
N
f-1586420743
f
GR
GS
[1 0 0 1 327.60855 40.20189] CT
0.302 GC
N
f-1586420743
f
GR
GS
[1 0 0 1 320.87305 233.75221] CT
0.302 GC
N
f-1586420743
f
GR
GS
[1 0 0 1 324.88748 42.24435] CT
0.302 GC
N
f-1586420743
f
GR
GS
[1 0 0 1 328.04068 142.07956] CT
0.302 GC
N
f-1586420743
f
GR
GS
[1 0 0 1 325.67804 79.60846] CT
0.302 GC
N
f-1586420743
f
GR
GS
[1 0 0 1 327.87415 53.77923] CT
0.302 GC
N
f-1586420743
f
GR
GS
[1 0 0 1 332.87 236.36148] CT
0.302 GC
N
f-1586420743
f
GR
GS
[1 0 0 1 327.79999 157] CT
/Helvetica 20 F
GS
[1 0 0 1 0 0] CT
0 7.5 moveto 
1 -1 scale
(0) t 
GR
GR
GS
0.6 GC
N
/f-1255393682{389.96 157 M
389.96 104.957 L
354.44 104.957 L
354.44 157 L
cp}def
f-1255393682
f
GR
GS
[1 0 0 1 372.15298 178.83224] CT
0.302 GC
N
f-1586420743
f
GR
GS
[1 0 0 1 366.3342 127.67492] CT
0.302 GC
N
f-1586420743
f
GR
GS
[1 0 0 1 365.14481 59.61721] CT
0.302 GC
N
f-1586420743
f
GR
GS
[1 0 0 1 379.55634 124.92999] CT
0.302 GC
N
f-1586420743
f
GR
GS
[1 0 0 1 369.27039 150.89272] CT
0.302 GC
N
f-1586420743
f
GR
GS
[1 0 0 1 370.30188 34.83899] CT
0.302 GC
N
f-1586420743
f
GR
GS
[1 0 0 1 369.89346 193.49339] CT
0.302 GC
N
f-1586420743
f
GR
GS
[1 0 0 1 374.11676 37.76706] CT
0.302 GC
N
f-1586420743
f
GR
GS
[1 0 0 1 377.31195 121.60918] CT
0.302 GC
N
f-1586420743
f
GR
GS
[1 0 0 1 369.98816 52.70627] CT
0.302 GC
N
f-1586420743
f
GR
GS
[1 0 0 1 372.68005 122.45336] CT
0.302 GC
N
f-1586420743
f
GR
GS
[1 0 0 1 379.14279 194.03459] CT
0.302 GC
N
f-1586420743
f
GR
GS
[1 0 0 1 372.06451 100.77273] CT
0.302 GC
N
f-1586420743
f
GR
GS
[1 0 0 1 379.44064 195.17111] CT
0.302 GC
N
f-1586420743
f
GR
GS
[1 0 0 1 380.8475 48.18914] CT
0.302 GC
N
f-1586420743
f
GR
GS
[1 0 0 1 378.23004 86.34489] CT
0.302 GC
N
f-1586420743
f
GR
GS
[1 0 0 1 376.9382 213.49222] CT
0.302 GC
N
f-1586420743
f
GR
GS
[1 0 0 1 369.43576 56.57828] CT
0.302 GC
N
f-1586420743
f
GR
GS
[1 0 0 1 363.45764 49.72644] CT
0.302 GC
N
f-1586420743
f
GR
GS
[1 0 0 1 373.90939 202.12494] CT
0.302 GC
N
f-1586420743
f
GR
GS
[1 0 0 1 368.6907 91.95579] CT
0.302 GC
N
f-1586420743
f
GR
GS
[1 0 0 1 370.84247 36.36109] CT
0.302 GC
N
f-1586420743
f
GR
GS
[1 0 0 1 368.55249 108.97793] CT
0.302 GC
N
f-1586420743
f
GR
GS
[1 0 0 1 377.01419 243.11624] CT
0.302 GC
N
f-1586420743
f
GR
GS
[1 0 0 1 376.15317 50.71716] CT
0.302 GC
N
f-1586420743
f
GR
GS
[1 0 0 1 370.77795 34.05296] CT
0.302 GC
N
f-1586420743
f
GR
GS
[1 0 0 1 374.87653 32.39758] CT
0.302 GC
N
f-1586420743
f
GR
GS
[1 0 0 1 379.95966 160.15987] CT
0.302 GC
N
f-1586420743
f
GR
GS
[1 0 0 1 379.78848 36.35928] CT
0.302 GC
N
f-1586420743
f
GR
GS
[1 0 0 1 369.55807 83.80511] CT
0.302 GC
N
f-1586420743
f
GR
GS
[1 0 0 1 369.03479 148.45546] CT
0.302 GC
N
f-1586420743
f
GR
GS
[1 0 0 1 379.88828 69.77673] CT
0.302 GC
N
f-1586420743
f
GR
GS
[1 0 0 1 365.73624 34.95544] CT
0.302 GC
N
f-1586420743
f
GR
GS
[1 0 0 1 376.61029 50.47813] CT
0.302 GC
N
f-1586420743
f
GR
GS
[1 0 0 1 366.28378 53.32423] CT
0.302 GC
N
f-1586420743
f
GR
GS
[1 0 0 1 371.49167 265.68463] CT
0.302 GC
N
f-1586420743
f
GR
GS
[1 0 0 1 364.86957 110.9184] CT
0.302 GC
N
f-1586420743
f
GR
GS
[1 0 0 1 377.54285 44.59945] CT
0.302 GC
N
f-1586420743
f
GR
GS
[1 0 0 1 375.23389 57.50352] CT
0.302 GC
N
f-1586420743
f
GR
GS
[1 0 0 1 369.39108 58.97218] CT
0.302 GC
N
f-1586420743
f
GR
GS
[1 0 0 1 379.48318 122.69385] CT
0.302 GC
N
f-1586420743
f
GR
GS
[1 0 0 1 377.65622 179.88321] CT
0.302 GC
N
f-1586420743
f
GR
GS
[1 0 0 1 375.01276 243.2706] CT
0.302 GC
N
f-1586420743
f
GR
GS
[1 0 0 1 365.60617 36.96326] CT
0.302 GC
N
f-1586420743
f
GR
GS
[1 0 0 1 366.40073 76.2261] CT
0.302 GC
N
f-1586420743
f
GR
GS
[1 0 0 1 368.53839 174.63797] CT
0.302 GC
N
f-1586420743
f
GR
GS
[1 0 0 1 377.04428 58.10916] CT
0.302 GC
N
f-1586420743
f
GR
GS
[1 0 0 1 368.87607 132.49326] CT
0.302 GC
N
f-1586420743
f
GR
GS
[1 0 0 1 376.28296 80.54041] CT
0.302 GC
N
f-1586420743
f
GR
GS
[1 0 0 1 364.15433 61.20022] CT
0.302 GC
N
f-1586420743
f
GR
GS
[1 0 0 1 368.79626 62.96423] CT
0.302 GC
N
f-1586420743
f
GR
GS
[1 0 0 1 372.20001 157] CT
/Helvetica 20 F
GS
[1 0 0 1 0 0] CT
0 7.5 moveto 
1 -1 scale
(6.5565e-07) t 
GR
GR
GS
1 GC
N
/f770407552{491.5 282 M
602 282 L
602 32 L
491.5 32 L
cp}def
f770407552
f
GR
GS
0.149 GC
2 setlinecap
1 LJ
0.5 LW
N
491.5 282 M
602 282 L
S
GR
GS
0.149 GC
2 setlinecap
1 LJ
0.5 LW
N
524.65 282 M
524.65 279.5 L
S
GR
GS
0.149 GC
2 setlinecap
1 LJ
0.5 LW
N
568.85 282 M
568.85 279.5 L
S
GR
GS
[1 0 0 1 524.65002 288] CT
0.149 GC
/Helvetica 20 F
GS
[1 0 0 1 0 0] CT
-13 20 moveto 
1 -1 scale
(YA) t 
GR
GR
GS
[1 0 0 1 568.84998 288] CT
0.149 GC
/Helvetica 20 F
GS
[1 0 0 1 0 0] CT
-14.5 20 moveto 
1 -1 scale
(OA) t 
GR
GR
GS
[1 0 0 1 546.75006 313] CT
0.149 GC
/Helvetica 20 F
GS
[1 0 0 1 0 0] CT
-49 20 moveto 
1 -1 scale
(Age Group) t 
GR
GR
GS
0.149 GC
2 setlinecap
1 LJ
0.5 LW
N
491.5 282 M
491.5 32 L
S
GR
GS
0.149 GC
2 setlinecap
1 LJ
0.5 LW
N
491.5 282 M
494 282 L
S
GR
GS
0.149 GC
2 setlinecap
1 LJ
0.5 LW
N
491.5 219.5 M
494 219.5 L
S
GR
GS
0.149 GC
2 setlinecap
1 LJ
0.5 LW
N
491.5 157 M
494 157 L
S
GR
GS
0.149 GC
2 setlinecap
1 LJ
0.5 LW
N
491.5 94.5 M
494 94.5 L
S
GR
GS
0.149 GC
2 setlinecap
1 LJ
0.5 LW
N
491.5 32 M
494 32 L
S
GR
GS
[1 0 0 1 485.5 282] CT
0.149 GC
/Helvetica 20 F
GS
[1 0 0 1 0 0] CT
-19 7.5 moveto 
1 -1 scale
(-1) t 
GR
GR
GS
[1 0 0 1 485.5 219.5] CT
0.149 GC
/Helvetica 20 F
GS
[1 0 0 1 0 0] CT
-36 7.5 moveto 
1 -1 scale
(-0.5) t 
GR
GR
GS
[1 0 0 1 485.5 157] CT
0.149 GC
/Helvetica 20 F
GS
[1 0 0 1 0 0] CT
-12 7.5 moveto 
1 -1 scale
(0) t 
GR
GR
GS
[1 0 0 1 485.5 94.5] CT
0.149 GC
/Helvetica 20 F
GS
[1 0 0 1 0 0] CT
-28 7.5 moveto 
1 -1 scale
(0.5) t 
GR
GR
GS
[1 0 0 1 485.5 32] CT
0.149 GC
/Helvetica 20 F
GS
[1 0 0 1 0 0] CT
-12 7.5 moveto 
1 -1 scale
(1) t 
GR
GR
GS
[0 -1 1 0 433 251] CT
0.149 GC
/Helvetica 20 F
GS
[1 0 0 1 0 0] CT
0 0 moveto 
1 -1 scale
(TFR) t 
GR
GR
GS
[0 -1 1 0 443 214] CT
0.149 GC
/Helvetica 16 F
GS
[1 0 0 1 0 0] CT
0 0 moveto 
1 -1 scale
(a) t 
GR
GR
GS
[0 -1 1 0 433 205] CT
0.149 GC
/Helvetica 20 F
GS
[1 0 0 1 0 0] CT
0 0 moveto 
1 -1 scale
(lpha) t 
GR
GR
GS
[0 -1 1 0 443 166] CT
0.149 GC
/Helvetica 16 F
GS
[1 0 0 1 0 0] CT
0 0 moveto 
1 -1 scale
(l) t 
GR
GR
GS
[0 -1 1 0 433 162] CT
0.149 GC
/Helvetica 20 F
GS
[1 0 0 1 0 0] CT
0 0 moveto 
1 -1 scale
(inear linear) t 
GR
GR
GS
[1 0 0 1 546.75055 29.5] CT
/Helvetica-Bold 20 F
GS
[1 0 0 1 0 0] CT
-69.5 -5 moveto 
1 -1 scale
(p = 1.3888e-05) t 
GR
GR
GS
0.149 GC
1 LJ
0.5 LW
N
491.5 157 M
602 157 L
S
GR
GS
0.6 GC
N
/f1770315292{542.33 157 M
542.33 76.445 L
506.97 76.445 L
506.97 157 L
cp}def
f1770315292
f
GR
GS
[1 0 0 1 516.35248 45.82074] CT
0.302 GC
N
f-1586420743
f
GR
GS
[1 0 0 1 525.31702 58.19781] CT
0.302 GC
N
f-1586420743
f
GR
GS
[1 0 0 1 517.38635 36.57186] CT
0.302 GC
N
f-1586420743
f
GR
GS
[1 0 0 1 528.26746 49.81075] CT
0.302 GC
N
f-1586420743
f
GR
GS
[1 0 0 1 533.08398 190.17404] CT
0.302 GC
N
f-1586420743
f
GR
GS
[1 0 0 1 518.02832 49.34944] CT
0.302 GC
N
f-1586420743
f
GR
GS
[1 0 0 1 521.89655 97.58495] CT
0.302 GC
N
f-1586420743
f
GR
GS
[1 0 0 1 521.06104 48.84118] CT
0.302 GC
N
f-1586420743
f
GR
GS
[1 0 0 1 525.05054 76.72653] CT
0.302 GC
N
f-1586420743
f
GR
GS
[1 0 0 1 526.52405 49.84551] CT
0.302 GC
N
f-1586420743
f
GR
GS
[1 0 0 1 530.48688 61.26342] CT
0.302 GC
N
f-1586420743
f
GR
GS
[1 0 0 1 527.92926 39.85685] CT
0.302 GC
N
f-1586420743
f
GR
GS
[1 0 0 1 522.97852 50.93513] CT
0.302 GC
N
f-1586420743
f
GR
GS
[1 0 0 1 530.16388 42.47341] CT
0.302 GC
N
f-1586420743
f
GR
GS
[1 0 0 1 519.07953 217.97984] CT
0.302 GC
N
f-1586420743
f
GR
GS
[1 0 0 1 526.26233 37.81734] CT
0.302 GC
N
f-1586420743
f
GR
GS
[1 0 0 1 526.3382 85.32987] CT
0.302 GC
N
f-1586420743
f
GR
GS
[1 0 0 1 522.82581 51.78978] CT
0.302 GC
N
f-1586420743
f
GR
GS
[1 0 0 1 526.22919 47.70335] CT
0.302 GC
N
f-1586420743
f
GR
GS
[1 0 0 1 519.1922 266.86328] CT
0.302 GC
N
f-1586420743
f
GR
GS
[1 0 0 1 519.22125 50.56286] CT
0.302 GC
N
f-1586420743
f
GR
GS
[1 0 0 1 516.66302 42.58978] CT
0.302 GC
N
f-1586420743
f
GR
GS
[1 0 0 1 533.07977 33.96938] CT
0.302 GC
N
f-1586420743
f
GR
GS
[1 0 0 1 528.57501 196.20308] CT
0.302 GC
N
f-1586420743
f
GR
GS
[1 0 0 1 521.00623 36.01027] CT
0.302 GC
N
f-1586420743
f
GR
GS
[1 0 0 1 519.70734 74.64053] CT
0.302 GC
N
f-1586420743
f
GR
GS
[1 0 0 1 531.72345 35.57032] CT
0.302 GC
N
f-1586420743
f
GR
GS
[1 0 0 1 517.58472 88.80967] CT
0.302 GC
N
f-1586420743
f
GR
GS
[1 0 0 1 515.99084 103.10794] CT
0.302 GC
N
f-1586420743
f
GR
GS
[1 0 0 1 516.95935 40.41679] CT
0.302 GC
N
f-1586420743
f
GR
GS
[1 0 0 1 526.30969 142.78003] CT
0.302 GC
N
f-1586420743
f
GR
GS
[1 0 0 1 521.93427 33.56826] CT
0.302 GC
N
f-1586420743
f
GR
GS
[1 0 0 1 524.05768 39.23274] CT
0.302 GC
N
f-1586420743
f
GR
GS
[1 0 0 1 518.97888 38.1632] CT
0.302 GC
N
f-1586420743
f
GR
GS
[1 0 0 1 525.74554 51.00286] CT
0.302 GC
N
f-1586420743
f
GR
GS
[1 0 0 1 518.73828 43.05127] CT
0.302 GC
N
f-1586420743
f
GR
GS
[1 0 0 1 524.36993 38.28129] CT
0.302 GC
N
f-1586420743
f
GR
GS
[1 0 0 1 533.33984 35.74189] CT
0.302 GC
N
f-1586420743
f
GR
GS
[1 0 0 1 525.69763 41.05664] CT
0.302 GC
N
f-1586420743
f
GR
GS
[1 0 0 1 532.09717 47.55252] CT
0.302 GC
N
f-1586420743
f
GR
GS
[1 0 0 1 517.90259 37.25109] CT
0.302 GC
N
f-1586420743
f
GR
GS
[1 0 0 1 525.50256 117.99792] CT
0.302 GC
N
f-1586420743
f
GR
GS
[1 0 0 1 521.35327 47.72654] CT
0.302 GC
N
f-1586420743
f
GR
GS
[1 0 0 1 529.14636 228.17775] CT
0.302 GC
N
f-1586420743
f
GR
GS
[1 0 0 1 530.75531 45.11104] CT
0.302 GC
N
f-1586420743
f
GR
GS
[1 0 0 1 520.68726 261.116] CT
0.302 GC
N
f-1586420743
f
GR
GS
[1 0 0 1 531.74603 38.28298] CT
0.302 GC
N
f-1586420743
f
GR
GS
[1 0 0 1 524.65002 157] CT
/Helvetica 20 F
GS
[1 0 0 1 0 0] CT
0 7.5 moveto 
1 -1 scale
(0) t 
GR
GR
GS
0.6 GC
N
/f1226316814{586.53 157 M
586.53 144.805 L
551.17 144.805 L
551.17 157 L
cp}def
f1226316814
f
GR
GS
[1 0 0 1 565.16351 99.57105] CT
0.302 GC
N
f-1586420743
f
GR
GS
[1 0 0 1 564.07507 139.10616] CT
0.302 GC
N
f-1586420743
f
GR
GS
[1 0 0 1 566.70752 32.99168] CT
0.302 GC
N
f-1586420743
f
GR
GS
[1 0 0 1 572.29193 278.51047] CT
0.302 GC
N
f-1586420743
f
GR
GS
[1 0 0 1 570.53058 41.64733] CT
0.302 GC
N
f-1586420743
f
GR
GS
[1 0 0 1 574.31677 257.62692] CT
0.302 GC
N
f-1586420743
f
GR
GS
[1 0 0 1 566.547 72.8243] CT
0.302 GC
N
f-1586420743
f
GR
GS
[1 0 0 1 576.87811 203.08336] CT
0.302 GC
N
f-1586420743
f
GR
GS
[1 0 0 1 576.11322 117.52771] CT
0.302 GC
N
f-1586420743
f
GR
GS
[1 0 0 1 570.28735 58.76428] CT
0.302 GC
N
f-1586420743
f
GR
GS
[1 0 0 1 563.78674 208.19908] CT
0.302 GC
N
f-1586420743
f
GR
GS
[1 0 0 1 566.08405 274.45905] CT
0.302 GC
N
f-1586420743
f
GR
GS
[1 0 0 1 573.52051 190.16261] CT
0.302 GC
N
f-1586420743
f
GR
GS
[1 0 0 1 575.56744 96.03997] CT
0.302 GC
N
f-1586420743
f
GR
GS
[1 0 0 1 568.23615 220.92616] CT
0.302 GC
N
f-1586420743
f
GR
GS
[1 0 0 1 572.50073 219.10181] CT
0.302 GC
N
f-1586420743
f
GR
GS
[1 0 0 1 575.87793 131.90671] CT
0.302 GC
N
f-1586420743
f
GR
GS
[1 0 0 1 569.67804 102.95905] CT
0.302 GC
N
f-1586420743
f
GR
GS
[1 0 0 1 575.67395 259.85645] CT
0.302 GC
N
f-1586420743
f
GR
GS
[1 0 0 1 564.53394 133.94113] CT
0.302 GC
N
f-1586420743
f
GR
GS
[1 0 0 1 567.45178 37.24227] CT
0.302 GC
N
f-1586420743
f
GR
GS
[1 0 0 1 576.46289 116.66816] CT
0.302 GC
N
f-1586420743
f
GR
GS
[1 0 0 1 565.20026 53.56462] CT
0.302 GC
N
f-1586420743
f
GR
GS
[1 0 0 1 567.7699 166.65599] CT
0.302 GC
N
f-1586420743
f
GR
GS
[1 0 0 1 577.12646 89.34517] CT
0.302 GC
N
f-1586420743
f
GR
GS
[1 0 0 1 563.26953 84.14886] CT
0.302 GC
N
f-1586420743
f
GR
GS
[1 0 0 1 568.07855 39.91581] CT
0.302 GC
N
f-1586420743
f
GR
GS
[1 0 0 1 565.06799 39.34999] CT
0.302 GC
N
f-1586420743
f
GR
GS
[1 0 0 1 562.97931 76.31455] CT
0.302 GC
N
f-1586420743
f
GR
GS
[1 0 0 1 570.34204 153.37274] CT
0.302 GC
N
f-1586420743
f
GR
GS
[1 0 0 1 572.77942 214.01685] CT
0.302 GC
N
f-1586420743
f
GR
GS
[1 0 0 1 568.31097 63.4348] CT
0.302 GC
N
f-1586420743
f
GR
GS
[1 0 0 1 564.00519 181.39537] CT
0.302 GC
N
f-1586420743
f
GR
GS
[1 0 0 1 575.23987 237.73132] CT
0.302 GC
N
f-1586420743
f
GR
GS
[1 0 0 1 573.51312 51.66591] CT
0.302 GC
N
f-1586420743
f
GR
GS
[1 0 0 1 572.38531 213.50606] CT
0.302 GC
N
f-1586420743
f
GR
GS
[1 0 0 1 561.33984 225.34386] CT
0.302 GC
N
f-1586420743
f
GR
GS
[1 0 0 1 561.13452 94.3784] CT
0.302 GC
N
f-1586420743
f
GR
GS
[1 0 0 1 565.00568 48.72226] CT
0.302 GC
N
f-1586420743
f
GR
GS
[1 0 0 1 572.97528 72.11607] CT
0.302 GC
N
f-1586420743
f
GR
GS
[1 0 0 1 566.28864 254.02031] CT
0.302 GC
N
f-1586420743
f
GR
GS
[1 0 0 1 564.52814 269.39627] CT
0.302 GC
N
f-1586420743
f
GR
GS
[1 0 0 1 564.85895 273.18234] CT
0.302 GC
N
f-1586420743
f
GR
GS
[1 0 0 1 560.09497 63.69536] CT
0.302 GC
N
f-1586420743
f
GR
GS
[1 0 0 1 569.75397 126.08295] CT
0.302 GC
N
f-1586420743
f
GR
GS
[1 0 0 1 561.25897 88.21984] CT
0.302 GC
N
f-1586420743
f
GR
GS
[1 0 0 1 565.83862 272.4017] CT
0.302 GC
N
f-1586420743
f
GR
GS
[1 0 0 1 571.31903 186.3381] CT
0.302 GC
N
f-1586420743
f
GR
GS
[1 0 0 1 565.23767 269.5267] CT
0.302 GC
N
f-1586420743
f
GR
GS
[1 0 0 1 568.75122 32.64826] CT
0.302 GC
N
f-1586420743
f
GR
GS
[1 0 0 1 570.43896 151.42455] CT
0.302 GC
N
f-1586420743
f
GR
GS
[1 0 0 1 568.84998 157] CT
/Helvetica 20 F
GS
[1 0 0 1 0 0] CT
0 7.5 moveto 
1 -1 scale
(0.29441) t 
GR
GR
GS
1 GC
N
/f648277526{688 282 M
798.5 282 L
798.5 32 L
688 32 L
cp}def
f648277526
f
GR
GS
0.149 GC
2 setlinecap
1 LJ
0.5 LW
N
688 282 M
798.5 282 L
S
GR
GS
0.149 GC
2 setlinecap
1 LJ
0.5 LW
N
721.15 282 M
721.15 279.5 L
S
GR
GS
0.149 GC
2 setlinecap
1 LJ
0.5 LW
N
765.35 282 M
765.35 279.5 L
S
GR
GS
[1 0 0 1 721.15002 288] CT
0.149 GC
/Helvetica 20 F
GS
[1 0 0 1 0 0] CT
-13 20 moveto 
1 -1 scale
(YA) t 
GR
GR
GS
[1 0 0 1 765.34998 288] CT
0.149 GC
/Helvetica 20 F
GS
[1 0 0 1 0 0] CT
-14.5 20 moveto 
1 -1 scale
(OA) t 
GR
GR
GS
[1 0 0 1 743.25006 313] CT
0.149 GC
/Helvetica 20 F
GS
[1 0 0 1 0 0] CT
-49 20 moveto 
1 -1 scale
(Age Group) t 
GR
GR
GS
0.149 GC
2 setlinecap
1 LJ
0.5 LW
N
688 282 M
688 32 L
S
GR
GS
0.149 GC
2 setlinecap
1 LJ
0.5 LW
N
688 282 M
690.5 282 L
S
GR
GS
0.149 GC
2 setlinecap
1 LJ
0.5 LW
N
688 219.5 M
690.5 219.5 L
S
GR
GS
0.149 GC
2 setlinecap
1 LJ
0.5 LW
N
688 157 M
690.5 157 L
S
GR
GS
0.149 GC
2 setlinecap
1 LJ
0.5 LW
N
688 94.5 M
690.5 94.5 L
S
GR
GS
0.149 GC
2 setlinecap
1 LJ
0.5 LW
N
688 32 M
690.5 32 L
S
GR
GS
[1 0 0 1 682 282] CT
0.149 GC
/Helvetica 20 F
GS
[1 0 0 1 0 0] CT
-19 7.5 moveto 
1 -1 scale
(-1) t 
GR
GR
GS
[1 0 0 1 682 219.5] CT
0.149 GC
/Helvetica 20 F
GS
[1 0 0 1 0 0] CT
-36 7.5 moveto 
1 -1 scale
(-0.5) t 
GR
GR
GS
[1 0 0 1 682 157] CT
0.149 GC
/Helvetica 20 F
GS
[1 0 0 1 0 0] CT
-12 7.5 moveto 
1 -1 scale
(0) t 
GR
GR
GS
[1 0 0 1 682 94.5] CT
0.149 GC
/Helvetica 20 F
GS
[1 0 0 1 0 0] CT
-28 7.5 moveto 
1 -1 scale
(0.5) t 
GR
GR
GS
[1 0 0 1 682 32] CT
0.149 GC
/Helvetica 20 F
GS
[1 0 0 1 0 0] CT
-12 7.5 moveto 
1 -1 scale
(1) t 
GR
GR
GS
[0 -1 1 0 629 260] CT
0.149 GC
/Helvetica 20 F
GS
[1 0 0 1 0 0] CT
0 0 moveto 
1 -1 scale
(TFR) t 
GR
GR
GS
[0 -1 1 0 639 223] CT
0.149 GC
/Helvetica 16 F
GS
[1 0 0 1 0 0] CT
0 0 moveto 
1 -1 scale
(g) t 
GR
GR
GS
[0 -1 1 0 629 213] CT
0.149 GC
/Helvetica 20 F
GS
[1 0 0 1 0 0] CT
0 0 moveto 
1 -1 scale
(amma) t 
GR
GR
GS
[0 -1 1 0 639 157] CT
0.149 GC
/Helvetica 16 F
GS
[1 0 0 1 0 0] CT
0 0 moveto 
1 -1 scale
(l) t 
GR
GR
GS
[0 -1 1 0 629 153] CT
0.149 GC
/Helvetica 20 F
GS
[1 0 0 1 0 0] CT
0 0 moveto 
1 -1 scale
(inear linear) t 
GR
GR
GS
[1 0 0 1 743.25073 29.5] CT
/Helvetica-Bold 20 F
GS
[1 0 0 1 0 0] CT
-59.5 -5 moveto 
1 -1 scale
(p = 0.030281) t 
GR
GR
GS
0.149 GC
1 LJ
0.5 LW
N
688 157 M
798.5 157 L
S
GR
GS
0.6 GC
N
/f-2012305304{738.83 157 M
738.83 56.829 L
703.47 56.829 L
703.47 157 L
cp}def
f-2012305304
f
GR
GS
[1 0 0 1 724.85022 58.18815] CT
0.302 GC
N
f-1586420743
f
GR
GS
[1 0 0 1 729.82025 109.57276] CT
0.302 GC
N
f-1586420743
f
GR
GS
[1 0 0 1 716.25977 70.3496] CT
0.302 GC
N
f-1586420743
f
GR
GS
[1 0 0 1 729.60602 37.69093] CT
0.302 GC
N
f-1586420743
f
GR
GS
[1 0 0 1 728.64508 65.25799] CT
0.302 GC
N
f-1586420743
f
GR
GS
[1 0 0 1 724.36505 44.24401] CT
0.302 GC
N
f-1586420743
f
GR
GS
[1 0 0 1 721.38953 86.02229] CT
0.302 GC
N
f-1586420743
f
GR
GS
[1 0 0 1 713.59155 56.20547] CT
0.302 GC
N
f-1586420743
f
GR
GS
[1 0 0 1 725.479 42.56247] CT
0.302 GC
N
f-1586420743
f
GR
GS
[1 0 0 1 717.81451 63.82546] CT
0.302 GC
N
f-1586420743
f
GR
GS
[1 0 0 1 727.31921 33.38] CT
0.302 GC
N
f-1586420743
f
GR
GS
[1 0 0 1 729.81653 55.30874] CT
0.302 GC
N
f-1586420743
f
GR
GS
[1 0 0 1 714.49817 48.48427] CT
0.302 GC
N
f-1586420743
f
GR
GS
[1 0 0 1 724.46564 33.462] CT
0.302 GC
N
f-1586420743
f
GR
GS
[1 0 0 1 722.87781 82.89075] CT
0.302 GC
N
f-1586420743
f
GR
GS
[1 0 0 1 713.5957 40.47617] CT
0.302 GC
N
f-1586420743
f
GR
GS
[1 0 0 1 719.00421 32.2466] CT
0.302 GC
N
f-1586420743
f
GR
GS
[1 0 0 1 729.75232 77.4787] CT
0.302 GC
N
f-1586420743
f
GR
GS
[1 0 0 1 713.15283 55.13264] CT
0.302 GC
N
f-1586420743
f
GR
GS
[1 0 0 1 722.49377 268.11374] CT
0.302 GC
N
f-1586420743
f
GR
GS
[1 0 0 1 725.12933 46.8195] CT
0.302 GC
N
f-1586420743
f
GR
GS
[1 0 0 1 725.59784 33.56775] CT
0.302 GC
N
f-1586420743
f
GR
GS
[1 0 0 1 726.53467 38.88385] CT
0.302 GC
N
f-1586420743
f
GR
GS
[1 0 0 1 720.67133 43.09988] CT
0.302 GC
N
f-1586420743
f
GR
GS
[1 0 0 1 727.82471 40.52235] CT
0.302 GC
N
f-1586420743
f
GR
GS
[1 0 0 1 714.87482 48.2281] CT
0.302 GC
N
f-1586420743
f
GR
GS
[1 0 0 1 713.85791 69.14599] CT
0.302 GC
N
f-1586420743
f
GR
GS
[1 0 0 1 729.13544 124.69986] CT
0.302 GC
N
f-1586420743
f
GR
GS
[1 0 0 1 728.48877 57.09061] CT
0.302 GC
N
f-1586420743
f
GR
GS
[1 0 0 1 727.27875 38.27398] CT
0.302 GC
N
f-1586420743
f
GR
GS
[1 0 0 1 715.55713 51.06608] CT
0.302 GC
N
f-1586420743
f
GR
GS
[1 0 0 1 712.75995 41.42732] CT
0.302 GC
N
f-1586420743
f
GR
GS
[1 0 0 1 722.66113 36.14705] CT
0.302 GC
N
f-1586420743
f
GR
GS
[1 0 0 1 718.54993 65.12222] CT
0.302 GC
N
f-1586420743
f
GR
GS
[1 0 0 1 715.95911 61.63833] CT
0.302 GC
N
f-1586420743
f
GR
GS
[1 0 0 1 724.1507 38.45097] CT
0.302 GC
N
f-1586420743
f
GR
GS
[1 0 0 1 725.81207 40.84565] CT
0.302 GC
N
f-1586420743
f
GR
GS
[1 0 0 1 717.94073 32.77946] CT
0.302 GC
N
f-1586420743
f
GR
GS
[1 0 0 1 725.34241 43.27522] CT
0.302 GC
N
f-1586420743
f
GR
GS
[1 0 0 1 719.8479 45.95311] CT
0.302 GC
N
f-1586420743
f
GR
GS
[1 0 0 1 722.01141 33.1599] CT
0.302 GC
N
f-1586420743
f
GR
GS
[1 0 0 1 726.67657 82.18124] CT
0.302 GC
N
f-1586420743
f
GR
GS
[1 0 0 1 716.02972 52.42665] CT
0.302 GC
N
f-1586420743
f
GR
GS
[1 0 0 1 729.90332 35.12471] CT
0.302 GC
N
f-1586420743
f
GR
GS
[1 0 0 1 715.82751 34.49669] CT
0.302 GC
N
f-1586420743
f
GR
GS
[1 0 0 1 715.94153 38.88536] CT
0.302 GC
N
f-1586420743
f
GR
GS
[1 0 0 1 727.38403 36.77932] CT
0.302 GC
N
f-1586420743
f
GR
GS
[1 0 0 1 721.15002 157] CT
/Helvetica 20 F
GS
[1 0 0 1 0 0] CT
0 7.5 moveto 
1 -1 scale
(0) t 
GR
GR
GS
0.6 GC
N
/f-1265547090{783.03 157 M
783.03 77.94 L
747.67 77.94 L
747.67 157 L
cp}def
f-1265547090
f
GR
GS
[1 0 0 1 758.78918 60.15391] CT
0.302 GC
N
f-1586420743
f
GR
GS
[1 0 0 1 757.92078 83.26668] CT
0.302 GC
N
f-1586420743
f
GR
GS
[1 0 0 1 762.52557 64.2687] CT
0.302 GC
N
f-1586420743
f
GR
GS
[1 0 0 1 773.89703 34.62857] CT
0.302 GC
N
f-1586420743
f
GR
GS
[1 0 0 1 769.2077 105.04819] CT
0.302 GC
N
f-1586420743
f
GR
GS
[1 0 0 1 772.49597 252.00816] CT
0.302 GC
N
f-1586420743
f
GR
GS
[1 0 0 1 772.84009 68.15596] CT
0.302 GC
N
f-1586420743
f
GR
GS
[1 0 0 1 764.19653 70.97187] CT
0.302 GC
N
f-1586420743
f
GR
GS
[1 0 0 1 770.67316 98.90348] CT
0.302 GC
N
f-1586420743
f
GR
GS
[1 0 0 1 761.95331 45.83273] CT
0.302 GC
N
f-1586420743
f
GR
GS
[1 0 0 1 767.24713 62.50764] CT
0.302 GC
N
f-1586420743
f
GR
GS
[1 0 0 1 772.00073 60.68303] CT
0.302 GC
N
f-1586420743
f
GR
GS
[1 0 0 1 771.53357 74.88951] CT
0.302 GC
N
f-1586420743
f
GR
GS
[1 0 0 1 769.60028 35.80051] CT
0.302 GC
N
f-1586420743
f
GR
GS
[1 0 0 1 759.677 108.2987] CT
0.302 GC
N
f-1586420743
f
GR
GS
[1 0 0 1 757.74274 33.93222] CT
0.302 GC
N
f-1586420743
f
GR
GS
[1 0 0 1 760.43549 43.50922] CT
0.302 GC
N
f-1586420743
f
GR
GS
[1 0 0 1 768.48944 98.83064] CT
0.302 GC
N
f-1586420743
f
GR
GS
[1 0 0 1 763.78137 53.04752] CT
0.302 GC
N
f-1586420743
f
GR
GS
[1 0 0 1 757.20294 233.15802] CT
0.302 GC
N
f-1586420743
f
GR
GS
[1 0 0 1 765.11377 33.62329] CT
0.302 GC
N
f-1586420743
f
GR
GS
[1 0 0 1 758.91498 62.81855] CT
0.302 GC
N
f-1586420743
f
GR
GS
[1 0 0 1 761.01971 50.0761] CT
0.302 GC
N
f-1586420743
f
GR
GS
[1 0 0 1 757.16718 59.29274] CT
0.302 GC
N
f-1586420743
f
GR
GS
[1 0 0 1 761.56628 52.62066] CT
0.302 GC
N
f-1586420743
f
GR
GS
[1 0 0 1 761.05151 119.81901] CT
0.302 GC
N
f-1586420743
f
GR
GS
[1 0 0 1 770.73578 53.82312] CT
0.302 GC
N
f-1586420743
f
GR
GS
[1 0 0 1 772.61548 42.86121] CT
0.302 GC
N
f-1586420743
f
GR
GS
[1 0 0 1 759.5589 120.24948] CT
0.302 GC
N
f-1586420743
f
GR
GS
[1 0 0 1 758.07867 34.30277] CT
0.302 GC
N
f-1586420743
f
GR
GS
[1 0 0 1 763.17224 159.78305] CT
0.302 GC
N
f-1586420743
f
GR
GS
[1 0 0 1 761.70453 59.57012] CT
0.302 GC
N
f-1586420743
f
GR
GS
[1 0 0 1 757.19684 189.4357] CT
0.302 GC
N
f-1586420743
f
GR
GS
[1 0 0 1 766.97882 38.20425] CT
0.302 GC
N
f-1586420743
f
GR
GS
[1 0 0 1 766.97614 38.78197] CT
0.302 GC
N
f-1586420743
f
GR
GS
[1 0 0 1 769.66534 104.39914] CT
0.302 GC
N
f-1586420743
f
GR
GS
[1 0 0 1 762.5014 46.35886] CT
0.302 GC
N
f-1586420743
f
GR
GS
[1 0 0 1 758.27136 35.9414] CT
0.302 GC
N
f-1586420743
f
GR
GS
[1 0 0 1 771.89374 36.2789] CT
0.302 GC
N
f-1586420743
f
GR
GS
[1 0 0 1 756.85382 146.72525] CT
0.302 GC
N
f-1586420743
f
GR
GS
[1 0 0 1 760.05756 86.44026] CT
0.302 GC
N
f-1586420743
f
GR
GS
[1 0 0 1 762.76617 32.22937] CT
0.302 GC
N
f-1586420743
f
GR
GS
[1 0 0 1 763.12897 46.81602] CT
0.302 GC
N
f-1586420743
f
GR
GS
[1 0 0 1 767.66925 34.07433] CT
0.302 GC
N
f-1586420743
f
GR
GS
[1 0 0 1 765.6322 66.37732] CT
0.302 GC
N
f-1586420743
f
GR
GS
[1 0 0 1 774.12866 90.44283] CT
0.302 GC
N
f-1586420743
f
GR
GS
[1 0 0 1 767.74976 34.83541] CT
0.302 GC
N
f-1586420743
f
GR
GS
[1 0 0 1 771.00311 86.05204] CT
0.302 GC
N
f-1586420743
f
GR
GS
[1 0 0 1 759.25079 35.18396] CT
0.302 GC
N
f-1586420743
f
GR
GS
[1 0 0 1 762.71912 253.98895] CT
0.302 GC
N
f-1586420743
f
GR
GS
[1 0 0 1 767.40204 35.63637] CT
0.302 GC
N
f-1586420743
f
GR
GS
[1 0 0 1 765.34998 157] CT
/Helvetica 20 F
GS
[1 0 0 1 0 0] CT
0 7.5 moveto 
1 -1 scale
(0) t 
GR
GR
GS
1 GC
N
/f-1240509128{884.5 282 M
995.5 282 L
995.5 32 L
884.5 32 L
cp}def
f-1240509128
f
GR
GS
0.149 GC
2 setlinecap
1 LJ
0.5 LW
N
884.5 282 M
995.5 282 L
S
GR
GS
0.149 GC
2 setlinecap
1 LJ
0.5 LW
N
917.8 282 M
917.8 279.5 L
S
GR
GS
0.149 GC
2 setlinecap
1 LJ
0.5 LW
N
962.2 282 M
962.2 279.5 L
S
GR
GS
[1 0 0 1 917.79999 288] CT
0.149 GC
/Helvetica 20 F
GS
[1 0 0 1 0 0] CT
-13 20 moveto 
1 -1 scale
(YA) t 
GR
GR
GS
[1 0 0 1 962.20001 288] CT
0.149 GC
/Helvetica 20 F
GS
[1 0 0 1 0 0] CT
-14.5 20 moveto 
1 -1 scale
(OA) t 
GR
GR
GS
[1 0 0 1 940.00006 313] CT
0.149 GC
/Helvetica 20 F
GS
[1 0 0 1 0 0] CT
-49 20 moveto 
1 -1 scale
(Age Group) t 
GR
GR
GS
0.149 GC
2 setlinecap
1 LJ
0.5 LW
N
884.5 282 M
884.5 32 L
S
GR
GS
0.149 GC
2 setlinecap
1 LJ
0.5 LW
N
884.5 282 M
887 282 L
S
GR
GS
0.149 GC
2 setlinecap
1 LJ
0.5 LW
N
884.5 219.5 M
887 219.5 L
S
GR
GS
0.149 GC
2 setlinecap
1 LJ
0.5 LW
N
884.5 157 M
887 157 L
S
GR
GS
0.149 GC
2 setlinecap
1 LJ
0.5 LW
N
884.5 94.5 M
887 94.5 L
S
GR
GS
0.149 GC
2 setlinecap
1 LJ
0.5 LW
N
884.5 32 M
887 32 L
S
GR
GS
[1 0 0 1 878.5 282] CT
0.149 GC
/Helvetica 20 F
GS
[1 0 0 1 0 0] CT
-19 7.5 moveto 
1 -1 scale
(-1) t 
GR
GR
GS
[1 0 0 1 878.5 219.5] CT
0.149 GC
/Helvetica 20 F
GS
[1 0 0 1 0 0] CT
-36 7.5 moveto 
1 -1 scale
(-0.5) t 
GR
GR
GS
[1 0 0 1 878.5 157] CT
0.149 GC
/Helvetica 20 F
GS
[1 0 0 1 0 0] CT
-12 7.5 moveto 
1 -1 scale
(0) t 
GR
GR
GS
[1 0 0 1 878.5 94.5] CT
0.149 GC
/Helvetica 20 F
GS
[1 0 0 1 0 0] CT
-28 7.5 moveto 
1 -1 scale
(0.5) t 
GR
GR
GS
[1 0 0 1 878.5 32] CT
0.149 GC
/Helvetica 20 F
GS
[1 0 0 1 0 0] CT
-12 7.5 moveto 
1 -1 scale
(1) t 
GR
GR
GS
[0 -1 1 0 826 244] CT
0.149 GC
/Helvetica 20 F
GS
[1 0 0 1 0 0] CT
0 0 moveto 
1 -1 scale
(sampen) t 
GR
GR
GS
[0 -1 1 0 836 172] CT
0.149 GC
/Helvetica 16 F
GS
[1 0 0 1 0 0] CT
0 0 moveto 
1 -1 scale
(l) t 
GR
GR
GS
[0 -1 1 0 826 168] CT
0.149 GC
/Helvetica 20 F
GS
[1 0 0 1 0 0] CT
0 0 moveto 
1 -1 scale
(inear linear) t 
GR
GR
GS
[1 0 0 1 940.00092 29.5] CT
/Helvetica-Bold 20 F
GS
[1 0 0 1 0 0] CT
-59.5 -5 moveto 
1 -1 scale
(p = 0.064762) t 
GR
GR
GS
0.149 GC
1 LJ
0.5 LW
N
884.5 157 M
995.5 157 L
S
GR
GS
0.6 GC
N
/f896954670{935.56 157 M
935.56 119.223 L
900.04 119.223 L
900.04 157 L
cp}def
f896954670
f
GR
GS
[1 0 0 1 911.26324 276.93823] CT
0.302 GC
N
f-1586420743
f
GR
GS
[1 0 0 1 915.19617 124.67026] CT
0.302 GC
N
f-1586420743
f
GR
GS
[1 0 0 1 917.24664 32.09649] CT
0.302 GC
N
f-1586420743
f
GR
GS
[1 0 0 1 921.39087 70.53687] CT
0.302 GC
N
f-1586420743
f
GR
GS
[1 0 0 1 925.31781 43.19456] CT
0.302 GC
N
f-1586420743
f
GR
GS
[1 0 0 1 919.58215 68.147] CT
0.302 GC
N
f-1586420743
f
GR
GS
[1 0 0 1 920.6557 113.83969] CT
0.302 GC
N
f-1586420743
f
GR
GS
[1 0 0 1 925.53796 35.07994] CT
0.302 GC
N
f-1586420743
f
GR
GS
[1 0 0 1 921.11108 95.25566] CT
0.302 GC
N
f-1586420743
f
GR
GS
[1 0 0 1 923.48132 265.86609] CT
0.302 GC
N
f-1586420743
f
GR
GS
[1 0 0 1 923.85529 125.84361] CT
0.302 GC
N
f-1586420743
f
GR
GS
[1 0 0 1 925.64966 143.22218] CT
0.302 GC
N
f-1586420743
f
GR
GS
[1 0 0 1 919.6073 209.53246] CT
0.302 GC
N
f-1586420743
f
GR
GS
[1 0 0 1 922.20386 61.38381] CT
0.302 GC
N
f-1586420743
f
GR
GS
[1 0 0 1 924.41248 67.81689] CT
0.302 GC
N
f-1586420743
f
GR
GS
[1 0 0 1 909.43402 145.28209] CT
0.302 GC
N
f-1586420743
f
GR
GS
[1 0 0 1 914.26221 125.38937] CT
0.302 GC
N
f-1586420743
f
GR
GS
[1 0 0 1 917.84052 160.09584] CT
0.302 GC
N
f-1586420743
f
GR
GS
[1 0 0 1 919.0741 57.86392] CT
0.302 GC
N
f-1586420743
f
GR
GS
[1 0 0 1 915.60333 92.14803] CT
0.302 GC
N
f-1586420743
f
GR
GS
[1 0 0 1 916.65564 121.06741] CT
0.302 GC
N
f-1586420743
f
GR
GS
[1 0 0 1 913.85663 102.54895] CT
0.302 GC
N
f-1586420743
f
GR
GS
[1 0 0 1 921.2691 270.11362] CT
0.302 GC
N
f-1586420743
f
GR
GS
[1 0 0 1 914.88171 83.58438] CT
0.302 GC
N
f-1586420743
f
GR
GS
[1 0 0 1 922.46649 36.85409] CT
0.302 GC
N
f-1586420743
f
GR
GS
[1 0 0 1 915.04376 48.56939] CT
0.302 GC
N
f-1586420743
f
GR
GS
[1 0 0 1 913.35498 111.1886] CT
0.302 GC
N
f-1586420743
f
GR
GS
[1 0 0 1 916.76611 143.05034] CT
0.302 GC
N
f-1586420743
f
GR
GS
[1 0 0 1 924.50641 82.96885] CT
0.302 GC
N
f-1586420743
f
GR
GS
[1 0 0 1 921.40643 78.23886] CT
0.302 GC
N
f-1586420743
f
GR
GS
[1 0 0 1 925.57819 77.45185] CT
0.302 GC
N
f-1586420743
f
GR
GS
[1 0 0 1 911.76007 68.51239] CT
0.302 GC
N
f-1586420743
f
GR
GS
[1 0 0 1 923.09814 218.42276] CT
0.302 GC
N
f-1586420743
f
GR
GS
[1 0 0 1 925.59912 63.71925] CT
0.302 GC
N
f-1586420743
f
GR
GS
[1 0 0 1 926.60437 63.51349] CT
0.302 GC
N
f-1586420743
f
GR
GS
[1 0 0 1 909.53284 171.08983] CT
0.302 GC
N
f-1586420743
f
GR
GS
[1 0 0 1 924.99994 34.7138] CT
0.302 GC
N
f-1586420743
f
GR
GS
[1 0 0 1 910.00409 193.5672] CT
0.302 GC
N
f-1586420743
f
GR
GS
[1 0 0 1 922.72705 134.27539] CT
0.302 GC
N
f-1586420743
f
GR
GS
[1 0 0 1 912.65149 146.39351] CT
0.302 GC
N
f-1586420743
f
GR
GS
[1 0 0 1 909.54706 45.89236] CT
0.302 GC
N
f-1586420743
f
GR
GS
[1 0 0 1 916.82886 138.15453] CT
0.302 GC
N
f-1586420743
f
GR
GS
[1 0 0 1 912.91937 163.52374] CT
0.302 GC
N
f-1586420743
f
GR
GS
[1 0 0 1 918.21454 260.64279] CT
0.302 GC
N
f-1586420743
f
GR
GS
[1 0 0 1 921.47119 67.68962] CT
0.302 GC
N
f-1586420743
f
GR
GS
[1 0 0 1 916.90637 278.70596] CT
0.302 GC
N
f-1586420743
f
GR
GS
[1 0 0 1 924.01324 84.8063] CT
0.302 GC
N
f-1586420743
f
GR
GS
[1 0 0 1 917.79999 157] CT
/Helvetica 20 F
GS
[1 0 0 1 0 0] CT
0 7.5 moveto 
1 -1 scale
(0.00060445) t 
GR
GR
GS
0.6 GC
N
/f812721550{979.96 157 M
979.96 144.578 L
944.44 144.578 L
944.44 157 L
cp}def
f812721550
f
GR
GS
[1 0 0 1 957.54071 229.13483] CT
0.302 GC
N
f-1586420743
f
GR
GS
[1 0 0 1 960.51013 203.06952] CT
0.302 GC
N
f-1586420743
f
GR
GS
[1 0 0 1 966.388 76.81752] CT
0.302 GC
N
f-1586420743
f
GR
GS
[1 0 0 1 953.32288 156.07938] CT
0.302 GC
N
f-1586420743
f
GR
GS
[1 0 0 1 968.62732 86.59194] CT
0.302 GC
N
f-1586420743
f
GR
GS
[1 0 0 1 959.82111 76.08778] CT
0.302 GC
N
f-1586420743
f
GR
GS
[1 0 0 1 956.3161 200.30208] CT
0.302 GC
N
f-1586420743
f
GR
GS
[1 0 0 1 962.78003 252.10919] CT
0.302 GC
N
f-1586420743
f
GR
GS
[1 0 0 1 966.37 137.9223] CT
0.302 GC
N
f-1586420743
f
GR
GS
[1 0 0 1 957.30048 33.21816] CT
0.302 GC
N
f-1586420743
f
GR
GS
[1 0 0 1 959.43018 137.7207] CT
0.302 GC
N
f-1586420743
f
GR
GS
[1 0 0 1 968.40503 194.26445] CT
0.302 GC
N
f-1586420743
f
GR
GS
[1 0 0 1 958.83911 208.11269] CT
0.302 GC
N
f-1586420743
f
GR
GS
[1 0 0 1 954.08685 119.11075] CT
0.302 GC
N
f-1586420743
f
GR
GS
[1 0 0 1 957.22949 47.58163] CT
0.302 GC
N
f-1586420743
f
GR
GS
[1 0 0 1 960.91199 126.63644] CT
0.302 GC
N
f-1586420743
f
GR
GS
[1 0 0 1 961.6366 168.18808] CT
0.302 GC
N
f-1586420743
f
GR
GS
[1 0 0 1 957.99237 71.90326] CT
0.302 GC
N
f-1586420743
f
GR
GS
[1 0 0 1 956.74329 228.60968] CT
0.302 GC
N
f-1586420743
f
GR
GS
[1 0 0 1 962.07294 239.9485] CT
0.302 GC
N
f-1586420743
f
GR
GS
[1 0 0 1 958.8374 123.75245] CT
0.302 GC
N
f-1586420743
f
GR
GS
[1 0 0 1 967.97815 32.22577] CT
0.302 GC
N
f-1586420743
f
GR
GS
[1 0 0 1 960.18329 138.54828] CT
0.302 GC
N
f-1586420743
f
GR
GS
[1 0 0 1 968.06934 93.04143] CT
0.302 GC
N
f-1586420743
f
GR
GS
[1 0 0 1 959.57385 74.98634] CT
0.302 GC
N
f-1586420743
f
GR
GS
[1 0 0 1 968.41711 215.27652] CT
0.302 GC
N
f-1586420743
f
GR
GS
[1 0 0 1 968.49786 59.06581] CT
0.302 GC
N
f-1586420743
f
GR
GS
[1 0 0 1 970.7522 197.59854] CT
0.302 GC
N
f-1586420743
f
GR
GS
[1 0 0 1 970.95111 171.6274] CT
0.302 GC
N
f-1586420743
f
GR
GS
[1 0 0 1 966.51086 97.77321] CT
0.302 GC
N
f-1586420743
f
GR
GS
[1 0 0 1 961.89581 80.12749] CT
0.302 GC
N
f-1586420743
f
GR
GS
[1 0 0 1 956.77008 256.14337] CT
0.302 GC
N
f-1586420743
f
GR
GS
[1 0 0 1 969.99359 102.7845] CT
0.302 GC
N
f-1586420743
f
GR
GS
[1 0 0 1 970.34363 75.35648] CT
0.302 GC
N
f-1586420743
f
GR
GS
[1 0 0 1 966.28345 114.42872] CT
0.302 GC
N
f-1586420743
f
GR
GS
[1 0 0 1 958.05029 135.07977] CT
0.302 GC
N
f-1586420743
f
GR
GS
[1 0 0 1 962.07123 106.26092] CT
0.302 GC
N
f-1586420743
f
GR
GS
[1 0 0 1 967.07318 204.90288] CT
0.302 GC
N
f-1586420743
f
GR
GS
[1 0 0 1 963.6734 209.40698] CT
0.302 GC
N
f-1586420743
f
GR
GS
[1 0 0 1 962.87469 121.78577] CT
0.302 GC
N
f-1586420743
f
GR
GS
[1 0 0 1 958.53644 109.61133] CT
0.302 GC
N
f-1586420743
f
GR
GS
[1 0 0 1 965.42657 137.57033] CT
0.302 GC
N
f-1586420743
f
GR
GS
[1 0 0 1 965.55408 176.43907] CT
0.302 GC
N
f-1586420743
f
GR
GS
[1 0 0 1 954.01752 206.96579] CT
0.302 GC
N
f-1586420743
f
GR
GS
[1 0 0 1 969.62183 145.38782] CT
0.302 GC
N
f-1586420743
f
GR
GS
[1 0 0 1 958.06268 240.15594] CT
0.302 GC
N
f-1586420743
f
GR
GS
[1 0 0 1 959.90912 98.57457] CT
0.302 GC
N
f-1586420743
f
GR
GS
[1 0 0 1 963.92151 156.71724] CT
0.302 GC
N
f-1586420743
f
GR
GS
[1 0 0 1 970.92834 265.05695] CT
0.302 GC
N
f-1586420743
f
GR
GS
[1 0 0 1 960.12909 48.28387] CT
0.302 GC
N
f-1586420743
f
GR
GS
[1 0 0 1 961.36627 185.14519] CT
0.302 GC
N
f-1586420743
f
GR
GS
[1 0 0 1 962.20001 157] CT
/Helvetica 20 F
GS
[1 0 0 1 0 0] CT
0 7.5 moveto 
1 -1 scale
(0.17208) t 
GR
GR
GS
1 GC
N
/f-2107788100{1081 282 M
1192 282 L
1192 32 L
1081 32 L
cp}def
f-2107788100
f
GR
GS
0.149 GC
2 setlinecap
1 LJ
0.5 LW
N
1081 282 M
1192 282 L
S
GR
GS
0.149 GC
2 setlinecap
1 LJ
0.5 LW
N
1114.3 282 M
1114.3 279.5 L
S
GR
GS
0.149 GC
2 setlinecap
1 LJ
0.5 LW
N
1158.7 282 M
1158.7 279.5 L
S
GR
GS
[1 0 0 1 1114.30005 288] CT
0.149 GC
/Helvetica 20 F
GS
[1 0 0 1 0 0] CT
-13 20 moveto 
1 -1 scale
(YA) t 
GR
GR
GS
[1 0 0 1 1158.69995 288] CT
0.149 GC
/Helvetica 20 F
GS
[1 0 0 1 0 0] CT
-14.5 20 moveto 
1 -1 scale
(OA) t 
GR
GR
GS
[1 0 0 1 1136.5 313] CT
0.149 GC
/Helvetica 20 F
GS
[1 0 0 1 0 0] CT
-49 20 moveto 
1 -1 scale
(Age Group) t 
GR
GR
GS
0.149 GC
2 setlinecap
1 LJ
0.5 LW
N
1081 282 M
1081 32 L
S
GR
GS
0.149 GC
2 setlinecap
1 LJ
0.5 LW
N
1081 282 M
1083.5 282 L
S
GR
GS
0.149 GC
2 setlinecap
1 LJ
0.5 LW
N
1081 219.5 M
1083.5 219.5 L
S
GR
GS
0.149 GC
2 setlinecap
1 LJ
0.5 LW
N
1081 157 M
1083.5 157 L
S
GR
GS
0.149 GC
2 setlinecap
1 LJ
0.5 LW
N
1081 94.5 M
1083.5 94.5 L
S
GR
GS
0.149 GC
2 setlinecap
1 LJ
0.5 LW
N
1081 32 M
1083.5 32 L
S
GR
GS
[1 0 0 1 1075 282] CT
0.149 GC
/Helvetica 20 F
GS
[1 0 0 1 0 0] CT
-19 7.5 moveto 
1 -1 scale
(-1) t 
GR
GR
GS
[1 0 0 1 1075 219.5] CT
0.149 GC
/Helvetica 20 F
GS
[1 0 0 1 0 0] CT
-36 7.5 moveto 
1 -1 scale
(-0.5) t 
GR
GR
GS
[1 0 0 1 1075 157] CT
0.149 GC
/Helvetica 20 F
GS
[1 0 0 1 0 0] CT
-12 7.5 moveto 
1 -1 scale
(0) t 
GR
GR
GS
[1 0 0 1 1075 94.5] CT
0.149 GC
/Helvetica 20 F
GS
[1 0 0 1 0 0] CT
-28 7.5 moveto 
1 -1 scale
(0.5) t 
GR
GR
GS
[1 0 0 1 1075 32] CT
0.149 GC
/Helvetica 20 F
GS
[1 0 0 1 0 0] CT
-12 7.5 moveto 
1 -1 scale
(1) t 
GR
GR
GS
[0 -1 1 0 1022 254] CT
0.149 GC
/Helvetica 20 F
GS
[1 0 0 1 0 0] CT
0 0 moveto 
1 -1 scale
(OneOverF) t 
GR
GR
GS
[0 -1 1 0 1032 162] CT
0.149 GC
/Helvetica 16 F
GS
[1 0 0 1 0 0] CT
0 0 moveto 
1 -1 scale
(l) t 
GR
GR
GS
[0 -1 1 0 1022 158] CT
0.149 GC
/Helvetica 20 F
GS
[1 0 0 1 0 0] CT
0 0 moveto 
1 -1 scale
(inear linear) t 
GR
GR
GS
[1 0 0 1 1136.5011 29.5] CT
/Helvetica-Bold 20 F
GS
[1 0 0 1 0 0] CT
-59.5 -5 moveto 
1 -1 scale
(p = 0.002265) t 
GR
GR
GS
0.149 GC
1 LJ
0.5 LW
N
1081 157 M
1192 157 L
S
GR
GS
0.6 GC
N
/f-687552480{1132.06 157 M
1132.06 114.993 L
1096.54 114.993 L
1096.54 157 L
cp}def
f-687552480
f
GR
GS
[1 0 0 1 1113.89734 191.00999] CT
0.302 GC
N
f-1586420743
f
GR
GS
[1 0 0 1 1115.32385 232.71507] CT
0.302 GC
N
f-1586420743
f
GR
GS
[1 0 0 1 1106.2782 68.62162] CT
0.302 GC
N
f-1586420743
f
GR
GS
[1 0 0 1 1108.03882 33.02683] CT
0.302 GC
N
f-1586420743
f
GR
GS
[1 0 0 1 1117.92773 84.8206] CT
0.302 GC
N
f-1586420743
f
GR
GS
[1 0 0 1 1114.8009 60.61171] CT
0.302 GC
N
f-1586420743
f
GR
GS
[1 0 0 1 1111.47559 129.35155] CT
0.302 GC
N
f-1586420743
f
GR
GS
[1 0 0 1 1118.2572 110.34219] CT
0.302 GC
N
f-1586420743
f
GR
GS
[1 0 0 1 1109.87671 110.02403] CT
0.302 GC
N
f-1586420743
f
GR
GS
[1 0 0 1 1115.86853 70.07618] CT
0.302 GC
N
f-1586420743
f
GR
GS
[1 0 0 1 1108.86743 129.07843] CT
0.302 GC
N
f-1586420743
f
GR
GS
[1 0 0 1 1114.05762 53.91803] CT
0.302 GC
N
f-1586420743
f
GR
GS
[1 0 0 1 1118.12219 99.80554] CT
0.302 GC
N
f-1586420743
f
GR
GS
[1 0 0 1 1111.99512 53.72233] CT
0.302 GC
N
f-1586420743
f
GR
GS
[1 0 0 1 1110.59045 105.57488] CT
0.302 GC
N
f-1586420743
f
GR
GS
[1 0 0 1 1117.71521 147.02094] CT
0.302 GC
N
f-1586420743
f
GR
GS
[1 0 0 1 1111.52612 240.89464] CT
0.302 GC
N
f-1586420743
f
GR
GS
[1 0 0 1 1111.54297 181.37833] CT
0.302 GC
N
f-1586420743
f
GR
GS
[1 0 0 1 1122.6626 40.96624] CT
0.302 GC
N
f-1586420743
f
GR
GS
[1 0 0 1 1106.64246 231.87393] CT
0.302 GC
N
f-1586420743
f
GR
GS
[1 0 0 1 1106.82361 56.02218] CT
0.302 GC
N
f-1586420743
f
GR
GS
[1 0 0 1 1117.82996 84.67004] CT
0.302 GC
N
f-1586420743
f
GR
GS
[1 0 0 1 1121.32373 89.72805] CT
0.302 GC
N
f-1586420743
f
GR
GS
[1 0 0 1 1109.34253 87.71119] CT
0.302 GC
N
f-1586420743
f
GR
GS
[1 0 0 1 1111.36328 38.01278] CT
0.302 GC
N
f-1586420743
f
GR
GS
[1 0 0 1 1112.24585 39.66327] CT
0.302 GC
N
f-1586420743
f
GR
GS
[1 0 0 1 1112.41492 98.53053] CT
0.302 GC
N
f-1586420743
f
GR
GS
[1 0 0 1 1109.16089 132.00845] CT
0.302 GC
N
f-1586420743
f
GR
GS
[1 0 0 1 1117.6366 127.94687] CT
0.302 GC
N
f-1586420743
f
GR
GS
[1 0 0 1 1108.45276 39.997] CT
0.302 GC
N
f-1586420743
f
GR
GS
[1 0 0 1 1118.06201 68.66853] CT
0.302 GC
N
f-1586420743
f
GR
GS
[1 0 0 1 1114.20178 56.92969] CT
0.302 GC
N
f-1586420743
f
GR
GS
[1 0 0 1 1115.12817 164.50671] CT
0.302 GC
N
f-1586420743
f
GR
GS
[1 0 0 1 1107.06653 53.59005] CT
0.302 GC
N
f-1586420743
f
GR
GS
[1 0 0 1 1122.63672 32.8605] CT
0.302 GC
N
f-1586420743
f
GR
GS
[1 0 0 1 1122.18799 116.31242] CT
0.302 GC
N
f-1586420743
f
GR
GS
[1 0 0 1 1117.96985 40.64451] CT
0.302 GC
N
f-1586420743
f
GR
GS
[1 0 0 1 1120.22009 140.35817] CT
0.302 GC
N
f-1586420743
f
GR
GS
[1 0 0 1 1113.34924 196.05254] CT
0.302 GC
N
f-1586420743
f
GR
GS
[1 0 0 1 1116.56995 118.32392] CT
0.302 GC
N
f-1586420743
f
GR
GS
[1 0 0 1 1113.80042 86.53465] CT
0.302 GC
N
f-1586420743
f
GR
GS
[1 0 0 1 1122.90527 171.33739] CT
0.302 GC
N
f-1586420743
f
GR
GS
[1 0 0 1 1113.55811 163.4877] CT
0.302 GC
N
f-1586420743
f
GR
GS
[1 0 0 1 1115.27795 270.65039] CT
0.302 GC
N
f-1586420743
f
GR
GS
[1 0 0 1 1115.18359 95.77532] CT
0.302 GC
N
f-1586420743
f
GR
GS
[1 0 0 1 1107.698 268.51968] CT
0.302 GC
N
f-1586420743
f
GR
GS
[1 0 0 1 1109.14404 191.00969] CT
0.302 GC
N
f-1586420743
f
GR
GS
[1 0 0 1 1114.30005 157] CT
/Helvetica 20 F
GS
[1 0 0 1 0 0] CT
0 7.5 moveto 
1 -1 scale
(6.6698e-05) t 
GR
GR
GS
0.6 GC
N
/f-1753579152{1140.94 157 M
1140.94 159.079 L
1176.46 159.079 L
1176.46 157 L
cp}def
f-1753579152
f
GR
GS
[1 0 0 1 1160.05664 204.97386] CT
0.302 GC
N
f-1586420743
f
GR
GS
[1 0 0 1 1154.18665 237.32922] CT
0.302 GC
N
f-1586420743
f
GR
GS
[1 0 0 1 1150.01001 176.71825] CT
0.302 GC
N
f-1586420743
f
GR
GS
[1 0 0 1 1160.53052 129.50528] CT
0.302 GC
N
f-1586420743
f
GR
GS
[1 0 0 1 1164.104 71.05748] CT
0.302 GC
N
f-1586420743
f
GR
GS
[1 0 0 1 1151.91956 123.78457] CT
0.302 GC
N
f-1586420743
f
GR
GS
[1 0 0 1 1163.51941 121.59441] CT
0.302 GC
N
f-1586420743
f
GR
GS
[1 0 0 1 1155.95532 102.43303] CT
0.302 GC
N
f-1586420743
f
GR
GS
[1 0 0 1 1160.57813 193.89374] CT
0.302 GC
N
f-1586420743
f
GR
GS
[1 0 0 1 1157.80164 41.03006] CT
0.302 GC
N
f-1586420743
f
GR
GS
[1 0 0 1 1157.08325 230.57996] CT
0.302 GC
N
f-1586420743
f
GR
GS
[1 0 0 1 1160.57568 269.87851] CT
0.302 GC
N
f-1586420743
f
GR
GS
[1 0 0 1 1166.09973 269.38736] CT
0.302 GC
N
f-1586420743
f
GR
GS
[1 0 0 1 1167.22351 49.446] CT
0.302 GC
N
f-1586420743
f
GR
GS
[1 0 0 1 1163.46545 236.96692] CT
0.302 GC
N
f-1586420743
f
GR
GS
[1 0 0 1 1151.77124 255.60365] CT
0.302 GC
N
f-1586420743
f
GR
GS
[1 0 0 1 1153.95471 92.74734] CT
0.302 GC
N
f-1586420743
f
GR
GS
[1 0 0 1 1164.79382 140.73766] CT
0.302 GC
N
f-1586420743
f
GR
GS
[1 0 0 1 1150.70117 225.35033] CT
0.302 GC
N
f-1586420743
f
GR
GS
[1 0 0 1 1160.30688 111.61118] CT
0.302 GC
N
f-1586420743
f
GR
GS
[1 0 0 1 1152.65137 204.62781] CT
0.302 GC
N
f-1586420743
f
GR
GS
[1 0 0 1 1158.57922 48.68344] CT
0.302 GC
N
f-1586420743
f
GR
GS
[1 0 0 1 1155.2793 139.24976] CT
0.302 GC
N
f-1586420743
f
GR
GS
[1 0 0 1 1150.49524 118.01297] CT
0.302 GC
N
f-1586420743
f
GR
GS
[1 0 0 1 1156.55945 140.65269] CT
0.302 GC
N
f-1586420743
f
GR
GS
[1 0 0 1 1165.88672 232.58495] CT
0.302 GC
N
f-1586420743
f
GR
GS
[1 0 0 1 1167.0249 69.687] CT
0.302 GC
N
f-1586420743
f
GR
GS
[1 0 0 1 1153.22949 126.13989] CT
0.302 GC
N
f-1586420743
f
GR
GS
[1 0 0 1 1166.32263 166.85736] CT
0.302 GC
N
f-1586420743
f
GR
GS
[1 0 0 1 1161.57886 197.66606] CT
0.302 GC
N
f-1586420743
f
GR
GS
[1 0 0 1 1159.70386 57.80008] CT
0.302 GC
N
f-1586420743
f
GR
GS
[1 0 0 1 1153.67664 219.65913] CT
0.302 GC
N
f-1586420743
f
GR
GS
[1 0 0 1 1160.84521 43.94304] CT
0.302 GC
N
f-1586420743
f
GR
GS
[1 0 0 1 1156.7041 45.92484] CT
0.302 GC
N
f-1586420743
f
GR
GS
[1 0 0 1 1162.59399 109.9994] CT
0.302 GC
N
f-1586420743
f
GR
GS
[1 0 0 1 1166.77319 214.12405] CT
0.302 GC
N
f-1586420743
f
GR
GS
[1 0 0 1 1150.1178 139.45738] CT
0.302 GC
N
f-1586420743
f
GR
GS
[1 0 0 1 1155.05798 199.04723] CT
0.302 GC
N
f-1586420743
f
GR
GS
[1 0 0 1 1158.20044 185.35962] CT
0.302 GC
N
f-1586420743
f
GR
GS
[1 0 0 1 1164.36926 242.74332] CT
0.302 GC
N
f-1586420743
f
GR
GS
[1 0 0 1 1156.54968 134.94453] CT
0.302 GC
N
f-1586420743
f
GR
GS
[1 0 0 1 1156.15808 245.3934] CT
0.302 GC
N
f-1586420743
f
GR
GS
[1 0 0 1 1161.24426 190.44496] CT
0.302 GC
N
f-1586420743
f
GR
GS
[1 0 0 1 1154.77673 192.08475] CT
0.302 GC
N
f-1586420743
f
GR
GS
[1 0 0 1 1164.72998 32.4795] CT
0.302 GC
N
f-1586420743
f
GR
GS
[1 0 0 1 1159.18481 262.64059] CT
0.302 GC
N
f-1586420743
f
GR
GS
[1 0 0 1 1154.46521 238.7881] CT
0.302 GC
N
f-1586420743
f
GR
GS
[1 0 0 1 1161.66956 101.83867] CT
0.302 GC
N
f-1586420743
f
GR
GS
[1 0 0 1 1162.9126 218.70863] CT
0.302 GC
N
f-1586420743
f
GR
GS
[1 0 0 1 1165.43848 52.06788] CT
0.302 GC
N
f-1586420743
f
GR
GS
[1 0 0 1 1158.91296 256.81128] CT
0.302 GC
N
f-1586420743
f
GR
GS
[1 0 0 1 1158.69995 157] CT
/Helvetica 20 F
GS
[1 0 0 1 0 0] CT
0 7.5 moveto 
1 -1 scale
(0.8393) t 
GR
GR
GS
1 GC
N
/f1624971984{1278 282 M
1388.5 282 L
1388.5 32 L
1278 32 L
cp}def
f1624971984
f
GR
GS
0.149 GC
2 setlinecap
1 LJ
0.5 LW
N
1278 282 M
1388.5 282 L
S
GR
GS
0.149 GC
2 setlinecap
1 LJ
0.5 LW
N
1311.15 282 M
1311.15 279.5 L
S
GR
GS
0.149 GC
2 setlinecap
1 LJ
0.5 LW
N
1355.35 282 M
1355.35 279.5 L
S
GR
GS
[1 0 0 1 1311.15002 288] CT
0.149 GC
/Helvetica 20 F
GS
[1 0 0 1 0 0] CT
-13 20 moveto 
1 -1 scale
(YA) t 
GR
GR
GS
[1 0 0 1 1355.34998 288] CT
0.149 GC
/Helvetica 20 F
GS
[1 0 0 1 0 0] CT
-14.5 20 moveto 
1 -1 scale
(OA) t 
GR
GR
GS
[1 0 0 1 1333.25 313] CT
0.149 GC
/Helvetica 20 F
GS
[1 0 0 1 0 0] CT
-49 20 moveto 
1 -1 scale
(Age Group) t 
GR
GR
GS
0.149 GC
2 setlinecap
1 LJ
0.5 LW
N
1278 282 M
1278 32 L
S
GR
GS
0.149 GC
2 setlinecap
1 LJ
0.5 LW
N
1278 282 M
1280.5 282 L
S
GR
GS
0.149 GC
2 setlinecap
1 LJ
0.5 LW
N
1278 219.5 M
1280.5 219.5 L
S
GR
GS
0.149 GC
2 setlinecap
1 LJ
0.5 LW
N
1278 157 M
1280.5 157 L
S
GR
GS
0.149 GC
2 setlinecap
1 LJ
0.5 LW
N
1278 94.5 M
1280.5 94.5 L
S
GR
GS
0.149 GC
2 setlinecap
1 LJ
0.5 LW
N
1278 32 M
1280.5 32 L
S
GR
GS
[1 0 0 1 1272 282] CT
0.149 GC
/Helvetica 20 F
GS
[1 0 0 1 0 0] CT
-19 7.5 moveto 
1 -1 scale
(-1) t 
GR
GR
GS
[1 0 0 1 1272 219.5] CT
0.149 GC
/Helvetica 20 F
GS
[1 0 0 1 0 0] CT
-36 7.5 moveto 
1 -1 scale
(-0.5) t 
GR
GR
GS
[1 0 0 1 1272 157] CT
0.149 GC
/Helvetica 20 F
GS
[1 0 0 1 0 0] CT
-12 7.5 moveto 
1 -1 scale
(0) t 
GR
GR
GS
[1 0 0 1 1272 94.5] CT
0.149 GC
/Helvetica 20 F
GS
[1 0 0 1 0 0] CT
-28 7.5 moveto 
1 -1 scale
(0.5) t 
GR
GR
GS
[1 0 0 1 1272 32] CT
0.149 GC
/Helvetica 20 F
GS
[1 0 0 1 0 0] CT
-12 7.5 moveto 
1 -1 scale
(1) t 
GR
GR
GS
[0 -1 1 0 1219 230] CT
0.149 GC
/Helvetica 20 F
GS
[1 0 0 1 0 0] CT
0 0 moveto 
1 -1 scale
(pupil) t 
GR
GR
GS
[0 -1 1 0 1229 186] CT
0.149 GC
/Helvetica 16 F
GS
[1 0 0 1 0 0] CT
0 0 moveto 
1 -1 scale
(l) t 
GR
GR
GS
[0 -1 1 0 1219 182] CT
0.149 GC
/Helvetica 20 F
GS
[1 0 0 1 0 0] CT
0 0 moveto 
1 -1 scale
(inear linear) t 
GR
GR
GS
[1 0 0 1 1333.25122 29.5] CT
/Helvetica-Bold 20 F
GS
[1 0 0 1 0 0] CT
-54 -5 moveto 
1 -1 scale
(p = 0.28048) t 
GR
GR
GS
0.149 GC
1 LJ
0.5 LW
N
1278 157 M
1388.5 157 L
S
GR
GS
0.6 GC
N
/f1308360896{1328.83 157 M
1328.83 81.736 L
1293.47 81.736 L
1293.47 157 L
cp}def
f1308360896
f
GR
GS
[1 0 0 1 1302.8501 257.96027] CT
0.302 GC
N
f-1586420743
f
GR
GS
[1 0 0 1 1305.3269 53.79942] CT
0.302 GC
N
f-1586420743
f
GR
GS
[1 0 0 1 1309.84973 62.97121] CT
0.302 GC
N
f-1586420743
f
GR
GS
[1 0 0 1 1308.7926 186.66595] CT
0.302 GC
N
f-1586420743
f
GR
GS
[1 0 0 1 1312.18665 93.98194] CT
0.302 GC
N
f-1586420743
f
GR
GS
[1 0 0 1 1303.33167 70.26698] CT
0.302 GC
N
f-1586420743
f
GR
GS
[1 0 0 1 1305.87671 47.27184] CT
0.302 GC
N
f-1586420743
f
GR
GS
[1 0 0 1 1308.10437 47.27857] CT
0.302 GC
N
f-1586420743
f
GR
GS
[1 0 0 1 1311.35962 68.54883] CT
0.302 GC
N
f-1586420743
f
GR
GS
[1 0 0 1 1308.63501 84.9706] CT
0.302 GC
N
f-1586420743
f
GR
GS
[1 0 0 1 1311.82568 41.45736] CT
0.302 GC
N
f-1586420743
f
GR
GS
[1 0 0 1 1302.83203 67.95768] CT
0.302 GC
N
f-1586420743
f
GR
GS
[1 0 0 1 1306.20239 37.11628] CT
0.302 GC
N
f-1586420743
f
GR
GS
[1 0 0 1 1313.96411 70.59576] CT
0.302 GC
N
f-1586420743
f
GR
GS
[1 0 0 1 1318.38635 95.45277] CT
0.302 GC
N
f-1586420743
f
GR
GS
[1 0 0 1 1313.28259 81.01371] CT
0.302 GC
N
f-1586420743
f
GR
GS
[1 0 0 1 1304.12805 32.21756] CT
0.302 GC
N
f-1586420743
f
GR
GS
[1 0 0 1 1315.29016 271.34253] CT
0.302 GC
N
f-1586420743
f
GR
GS
[1 0 0 1 1318.04419 64.57294] CT
0.302 GC
N
f-1586420743
f
GR
GS
[1 0 0 1 1310.32104 60.82578] CT
0.302 GC
N
f-1586420743
f
GR
GS
[1 0 0 1 1311.18555 57.86351] CT
0.302 GC
N
f-1586420743
f
GR
GS
[1 0 0 1 1313.48218 32.62823] CT
0.302 GC
N
f-1586420743
f
GR
GS
[1 0 0 1 1303.05396 59.12459] CT
0.302 GC
N
f-1586420743
f
GR
GS
[1 0 0 1 1310.33276 35.21476] CT
0.302 GC
N
f-1586420743
f
GR
GS
[1 0 0 1 1311.99231 185.85904] CT
0.302 GC
N
f-1586420743
f
GR
GS
[1 0 0 1 1309.81299 48.02101] CT
0.302 GC
N
f-1586420743
f
GR
GS
[1 0 0 1 1311.74634 115.17438] CT
0.302 GC
N
f-1586420743
f
GR
GS
[1 0 0 1 1317.58887 137.17523] CT
0.302 GC
N
f-1586420743
f
GR
GS
[1 0 0 1 1303.73779 38.35032] CT
0.302 GC
N
f-1586420743
f
GR
GS
[1 0 0 1 1318.49597 109.30263] CT
0.302 GC
N
f-1586420743
f
GR
GS
[1 0 0 1 1309.58118 241.05066] CT
0.302 GC
N
f-1586420743
f
GR
GS
[1 0 0 1 1314.44482 55.96441] CT
0.302 GC
N
f-1586420743
f
GR
GS
[1 0 0 1 1318.24646 38.44802] CT
0.302 GC
N
f-1586420743
f
GR
GS
[1 0 0 1 1311.11157 40.4223] CT
0.302 GC
N
f-1586420743
f
GR
GS
[1 0 0 1 1315.94641 124.52893] CT
0.302 GC
N
f-1586420743
f
GR
GS
[1 0 0 1 1302.79749 69.63097] CT
0.302 GC
N
f-1586420743
f
GR
GS
[1 0 0 1 1305.56873 139.46478] CT
0.302 GC
N
f-1586420743
f
GR
GS
[1 0 0 1 1311.54236 33.23581] CT
0.302 GC
N
f-1586420743
f
GR
GS
[1 0 0 1 1311.83679 50.16928] CT
0.302 GC
N
f-1586420743
f
GR
GS
[1 0 0 1 1313.354 43.80913] CT
0.302 GC
N
f-1586420743
f
GR
GS
[1 0 0 1 1302.9342 35.9357] CT
0.302 GC
N
f-1586420743
f
GR
GS
[1 0 0 1 1306.22363 66.29422] CT
0.302 GC
N
f-1586420743
f
GR
GS
[1 0 0 1 1319.2738 36.50993] CT
0.302 GC
N
f-1586420743
f
GR
GS
[1 0 0 1 1310.4928 61.75836] CT
0.302 GC
N
f-1586420743
f
GR
GS
[1 0 0 1 1313.30432 65.73126] CT
0.302 GC
N
f-1586420743
f
GR
GS
[1 0 0 1 1314.37561 60.78438] CT
0.302 GC
N
f-1586420743
f
GR
GS
[1 0 0 1 1319.76416 62.88412] CT
0.302 GC
N
f-1586420743
f
GR
GS
[1 0 0 1 1311.15002 157] CT
/Helvetica 20 F
GS
[1 0 0 1 0 0] CT
0 7.5 moveto 
1 -1 scale
(0) t 
GR
GR
GS
0.6 GC
N
/f749923516{1373.03 157 M
1373.03 95.287 L
1337.67 95.287 L
1337.67 157 L
cp}def
f749923516
f
GR
GS
[1 0 0 1 1350.58289 187.30386] CT
0.302 GC
N
f-1586420743
f
GR
GS
[1 0 0 1 1346.7135 44.21815] CT
0.302 GC
N
f-1586420743
f
GR
GS
[1 0 0 1 1350.99524 37.82314] CT
0.302 GC
N
f-1586420743
f
GR
GS
[1 0 0 1 1363.20422 152.13684] CT
0.302 GC
N
f-1586420743
f
GR
GS
[1 0 0 1 1349.76196 48.04535] CT
0.302 GC
N
f-1586420743
f
GR
GS
[1 0 0 1 1350.89014 70.32867] CT
0.302 GC
N
f-1586420743
f
GR
GS
[1 0 0 1 1355.86548 208.98131] CT
0.302 GC
N
f-1586420743
f
GR
GS
[1 0 0 1 1357.50208 166.79175] CT
0.302 GC
N
f-1586420743
f
GR
GS
[1 0 0 1 1348.29846 278.97305] CT
0.302 GC
N
f-1586420743
f
GR
GS
[1 0 0 1 1354.56262 256.30865] CT
0.302 GC
N
f-1586420743
f
GR
GS
[1 0 0 1 1361.04321 102.4533] CT
0.302 GC
N
f-1586420743
f
GR
GS
[1 0 0 1 1354.68103 251.33214] CT
0.302 GC
N
f-1586420743
f
GR
GS
[1 0 0 1 1354.63904 89.6385] CT
0.302 GC
N
f-1586420743
f
GR
GS
[1 0 0 1 1351.67358 115.46203] CT
0.302 GC
N
f-1586420743
f
GR
GS
[1 0 0 1 1346.65259 33.23674] CT
0.302 GC
N
f-1586420743
f
GR
GS
[1 0 0 1 1354.33508 149.76637] CT
0.302 GC
N
f-1586420743
f
GR
GS
[1 0 0 1 1363.85217 141.23766] CT
0.302 GC
N
f-1586420743
f
GR
GS
[1 0 0 1 1363.01965 87.807] CT
0.302 GC
N
f-1586420743
f
GR
GS
[1 0 0 1 1353.74377 39.14375] CT
0.302 GC
N
f-1586420743
f
GR
GS
[1 0 0 1 1362.72375 210.47874] CT
0.302 GC
N
f-1586420743
f
GR
GS
[1 0 0 1 1347.38574 132.65318] CT
0.302 GC
N
f-1586420743
f
GR
GS
[1 0 0 1 1349.5127 36.60409] CT
0.302 GC
N
f-1586420743
f
GR
GS
[1 0 0 1 1351.68774 148.15854] CT
0.302 GC
N
f-1586420743
f
GR
GS
[1 0 0 1 1358.34363 42.49565] CT
0.302 GC
N
f-1586420743
f
GR
GS
[1 0 0 1 1351.8407 41.36433] CT
0.302 GC
N
f-1586420743
f
GR
GS
[1 0 0 1 1360.26501 67.12511] CT
0.302 GC
N
f-1586420743
f
GR
GS
[1 0 0 1 1349.65027 40.12502] CT
0.302 GC
N
f-1586420743
f
GR
GS
[1 0 0 1 1357.78369 63.78191] CT
0.302 GC
N
f-1586420743
f
GR
GS
[1 0 0 1 1347.89624 64.25695] CT
0.302 GC
N
f-1586420743
f
GR
GS
[1 0 0 1 1356.27625 94.49271] CT
0.302 GC
N
f-1586420743
f
GR
GS
[1 0 0 1 1353.08923 41.0129] CT
0.302 GC
N
f-1586420743
f
GR
GS
[1 0 0 1 1362.30359 72.86148] CT
0.302 GC
N
f-1586420743
f
GR
GS
[1 0 0 1 1349.0791 52.5539] CT
0.302 GC
N
f-1586420743
f
GR
GS
[1 0 0 1 1364.13574 67.85074] CT
0.302 GC
N
f-1586420743
f
GR
GS
[1 0 0 1 1361.29675 51.52121] CT
0.302 GC
N
f-1586420743
f
GR
GS
[1 0 0 1 1357.83081 92.95036] CT
0.302 GC
N
f-1586420743
f
GR
GS
[1 0 0 1 1357.22559 34.4734] CT
0.302 GC
N
f-1586420743
f
GR
GS
[1 0 0 1 1360.60132 33.09404] CT
0.302 GC
N
f-1586420743
f
GR
GS
[1 0 0 1 1361.84277 152.86479] CT
0.302 GC
N
f-1586420743
f
GR
GS
[1 0 0 1 1350.56494 60.31765] CT
0.302 GC
N
f-1586420743
f
GR
GS
[1 0 0 1 1348.651 75.37461] CT
0.302 GC
N
f-1586420743
f
GR
GS
[1 0 0 1 1361.09924 77.14571] CT
0.302 GC
N
f-1586420743
f
GR
GS
[1 0 0 1 1353.64941 45.00414] CT
0.302 GC
N
f-1586420743
f
GR
GS
[1 0 0 1 1352.65112 43.70376] CT
0.302 GC
N
f-1586420743
f
GR
GS
[1 0 0 1 1346.68225 82.04383] CT
0.302 GC
N
f-1586420743
f
GR
GS
[1 0 0 1 1346.57141 81.04035] CT
0.302 GC
N
f-1586420743
f
GR
GS
[1 0 0 1 1355.10815 34.10448] CT
0.302 GC
N
f-1586420743
f
GR
GS
[1 0 0 1 1356.28271 51.67139] CT
0.302 GC
N
f-1586420743
f
GR
GS
[1 0 0 1 1354.68481 125.00888] CT
0.302 GC
N
f-1586420743
f
GR
GS
[1 0 0 1 1353.48218 35.38945] CT
0.302 GC
N
f-1586420743
f
GR
GS
[1 0 0 1 1351.77429 147.11292] CT
0.302 GC
N
f-1586420743
f
GR
GS
[1 0 0 1 1355.34998 157] CT
/Helvetica 20 F
GS
[1 0 0 1 0 0] CT
0 7.5 moveto 
1 -1 scale
(0) t 
GR
GR
GS
1 GC
N
/f1735867770{1474.5 282 M
1585.5 282 L
1585.5 32 L
1474.5 32 L
cp}def
f1735867770
f
GR
GS
0.149 GC
2 setlinecap
1 LJ
0.5 LW
N
1474.5 282 M
1585.5 282 L
S
GR
GS
0.149 GC
2 setlinecap
1 LJ
0.5 LW
N
1507.8 282 M
1507.8 279.5 L
S
GR
GS
0.149 GC
2 setlinecap
1 LJ
0.5 LW
N
1552.2 282 M
1552.2 279.5 L
S
GR
GS
[1 0 0 1 1507.80005 288] CT
0.149 GC
/Helvetica 20 F
GS
[1 0 0 1 0 0] CT
-13 20 moveto 
1 -1 scale
(YA) t 
GR
GR
GS
[1 0 0 1 1552.19995 288] CT
0.149 GC
/Helvetica 20 F
GS
[1 0 0 1 0 0] CT
-14.5 20 moveto 
1 -1 scale
(OA) t 
GR
GR
GS
[1 0 0 1 1530 313] CT
0.149 GC
/Helvetica 20 F
GS
[1 0 0 1 0 0] CT
-49 20 moveto 
1 -1 scale
(Age Group) t 
GR
GR
GS
0.149 GC
2 setlinecap
1 LJ
0.5 LW
N
1474.5 282 M
1474.5 32 L
S
GR
GS
0.149 GC
2 setlinecap
1 LJ
0.5 LW
N
1474.5 282 M
1477 282 L
S
GR
GS
0.149 GC
2 setlinecap
1 LJ
0.5 LW
N
1474.5 219.5 M
1477 219.5 L
S
GR
GS
0.149 GC
2 setlinecap
1 LJ
0.5 LW
N
1474.5 157 M
1477 157 L
S
GR
GS
0.149 GC
2 setlinecap
1 LJ
0.5 LW
N
1474.5 94.5 M
1477 94.5 L
S
GR
GS
0.149 GC
2 setlinecap
1 LJ
0.5 LW
N
1474.5 32 M
1477 32 L
S
GR
GS
[1 0 0 1 1468.5 282] CT
0.149 GC
/Helvetica 20 F
GS
[1 0 0 1 0 0] CT
-19 7.5 moveto 
1 -1 scale
(-1) t 
GR
GR
GS
[1 0 0 1 1468.5 219.5] CT
0.149 GC
/Helvetica 20 F
GS
[1 0 0 1 0 0] CT
-36 7.5 moveto 
1 -1 scale
(-0.5) t 
GR
GR
GS
[1 0 0 1 1468.5 157] CT
0.149 GC
/Helvetica 20 F
GS
[1 0 0 1 0 0] CT
-12 7.5 moveto 
1 -1 scale
(0) t 
GR
GR
GS
[1 0 0 1 1468.5 94.5] CT
0.149 GC
/Helvetica 20 F
GS
[1 0 0 1 0 0] CT
-28 7.5 moveto 
1 -1 scale
(0.5) t 
GR
GR
GS
[1 0 0 1 1468.5 32] CT
0.149 GC
/Helvetica 20 F
GS
[1 0 0 1 0 0] CT
-12 7.5 moveto 
1 -1 scale
(1) t 
GR
GR
GS
[0 -1 1 0 1416 218] CT
0.149 GC
/Helvetica 20 F
GS
[1 0 0 1 0 0] CT
0 0 moveto 
1 -1 scale
(all) t 
GR
GR
GS
[0 -1 1 0 1426 198] CT
0.149 GC
/Helvetica 16 F
GS
[1 0 0 1 0 0] CT
0 0 moveto 
1 -1 scale
(l) t 
GR
GR
GS
[0 -1 1 0 1416 194] CT
0.149 GC
/Helvetica 20 F
GS
[1 0 0 1 0 0] CT
0 0 moveto 
1 -1 scale
(inear linear) t 
GR
GR
GS
[1 0 0 1 1530.00146 29.5] CT
/Helvetica-Bold 20 F
GS
[1 0 0 1 0 0] CT
-59.5 -5 moveto 
1 -1 scale
(p = 0.093166) t 
GR
GR
GS
0.149 GC
1 LJ
0.5 LW
N
1474.5 157 M
1585.5 157 L
S
GR
GS
0.6 GC
N
/f1031010958{1525.56 157 M
1525.56 65.92 L
1490.04 65.92 L
1490.04 157 L
cp}def
f1031010958
f
GR
GS
[1 0 0 1 1504.17053 121.90427] CT
0.302 GC
N
f-1586420743
f
GR
GS
[1 0 0 1 1514.93909 49.26231] CT
0.302 GC
N
f-1586420743
f
GR
GS
[1 0 0 1 1504.89331 62.74409] CT
0.302 GC
N
f-1586420743
f
GR
GS
[1 0 0 1 1509.06799 173.01955] CT
0.302 GC
N
f-1586420743
f
GR
GS
[1 0 0 1 1514.47485 63.54978] CT
0.302 GC
N
f-1586420743
f
GR
GS
[1 0 0 1 1499.13794 66.84293] CT
0.302 GC
N
f-1586420743
f
GR
GS
[1 0 0 1 1508.45801 44.35835] CT
0.302 GC
N
f-1586420743
f
GR
GS
[1 0 0 1 1505.43994 38.48044] CT
0.302 GC
N
f-1586420743
f
GR
GS
[1 0 0 1 1501.06189 59.83911] CT
0.302 GC
N
f-1586420743
f
GR
GS
[1 0 0 1 1503.97925 39.68536] CT
0.302 GC
N
f-1586420743
f
GR
GS
[1 0 0 1 1511.27246 38.73888] CT
0.302 GC
N
f-1586420743
f
GR
GS
[1 0 0 1 1512.13013 65.26166] CT
0.302 GC
N
f-1586420743
f
GR
GS
[1 0 0 1 1515.92969 34.98125] CT
0.302 GC
N
f-1586420743
f
GR
GS
[1 0 0 1 1505.60815 73.72549] CT
0.302 GC
N
f-1586420743
f
GR
GS
[1 0 0 1 1501.23291 93.92742] CT
0.302 GC
N
f-1586420743
f
GR
GS
[1 0 0 1 1502.96497 71.24487] CT
0.302 GC
N
f-1586420743
f
GR
GS
[1 0 0 1 1499.82068 32.10189] CT
0.302 GC
N
f-1586420743
f
GR
GS
[1 0 0 1 1502.30774 259.7764] CT
0.302 GC
N
f-1586420743
f
GR
GS
[1 0 0 1 1506.47839 74.48933] CT
0.302 GC
N
f-1586420743
f
GR
GS
[1 0 0 1 1514.33936 36.37779] CT
0.302 GC
N
f-1586420743
f
GR
GS
[1 0 0 1 1503.65906 46.35652] CT
0.302 GC
N
f-1586420743
f
GR
GS
[1 0 0 1 1512.70203 33.4646] CT
0.302 GC
N
f-1586420743
f
GR
GS
[1 0 0 1 1508.98926 57.08632] CT
0.302 GC
N
f-1586420743
f
GR
GS
[1 0 0 1 1516.5614 33.68794] CT
0.302 GC
N
f-1586420743
f
GR
GS
[1 0 0 1 1506.18152 128.0083] CT
0.302 GC
N
f-1586420743
f
GR
GS
[1 0 0 1 1500.88806 52.40282] CT
0.302 GC
N
f-1586420743
f
GR
GS
[1 0 0 1 1513.66345 82.2275] CT
0.302 GC
N
f-1586420743
f
GR
GS
[1 0 0 1 1502.698 54.03441] CT
0.302 GC
N
f-1586420743
f
GR
GS
[1 0 0 1 1504.34692 36.15392] CT
0.302 GC
N
f-1586420743
f
GR
GS
[1 0 0 1 1506.42896 67.79649] CT
0.302 GC
N
f-1586420743
f
GR
GS
[1 0 0 1 1501.02783 143.30246] CT
0.302 GC
N
f-1586420743
f
GR
GS
[1 0 0 1 1501.90271 50.05439] CT
0.302 GC
N
f-1586420743
f
GR
GS
[1 0 0 1 1501.23914 39.95067] CT
0.302 GC
N
f-1586420743
f
GR
GS
[1 0 0 1 1505.09363 40.70736] CT
0.302 GC
N
f-1586420743
f
GR
GS
[1 0 0 1 1508.04993 96.7569] CT
0.302 GC
N
f-1586420743
f
GR
GS
[1 0 0 1 1502.40845 59.72096] CT
0.302 GC
N
f-1586420743
f
GR
GS
[1 0 0 1 1513.78198 104.30018] CT
0.302 GC
N
f-1586420743
f
GR
GS
[1 0 0 1 1510.04553 33.11473] CT
0.302 GC
N
f-1586420743
f
GR
GS
[1 0 0 1 1508.45349 42.9733] CT
0.302 GC
N
f-1586420743
f
GR
GS
[1 0 0 1 1503.99194 43.95416] CT
0.302 GC
N
f-1586420743
f
GR
GS
[1 0 0 1 1501.27295 35.46397] CT
0.302 GC
N
f-1586420743
f
GR
GS
[1 0 0 1 1500.21729 61.04375] CT
0.302 GC
N
f-1586420743
f
GR
GS
[1 0 0 1 1500.70459 35.70081] CT
0.302 GC
N
f-1586420743
f
GR
GS
[1 0 0 1 1502.37512 60.32753] CT
0.302 GC
N
f-1586420743
f
GR
GS
[1 0 0 1 1512.39905 55.41545] CT
0.302 GC
N
f-1586420743
f
GR
GS
[1 0 0 1 1502.82959 55.67059] CT
0.302 GC
N
f-1586420743
f
GR
GS
[1 0 0 1 1499.45081 48.23713] CT
0.302 GC
N
f-1586420743
f
GR
GS
[1 0 0 1 1507.80005 157] CT
/Helvetica 20 F
GS
[1 0 0 1 0 0] CT
0 7.5 moveto 
1 -1 scale
(0) t 
GR
GR
GS
0.6 GC
N
/f-661917574{1569.96 157 M
1569.96 82.899 L
1534.44 82.899 L
1534.44 157 L
cp}def
f-661917574
f
GR
GS
[1 0 0 1 1552.81628 138.25186] CT
0.302 GC
N
f-1586420743
f
GR
GS
[1 0 0 1 1559.29663 39.0464] CT
0.302 GC
N
f-1586420743
f
GR
GS
[1 0 0 1 1558.08557 41.81791] CT
0.302 GC
N
f-1586420743
f
GR
GS
[1 0 0 1 1552.96753 128.72784] CT
0.302 GC
N
f-1586420743
f
GR
GS
[1 0 0 1 1556.13867 68.89487] CT
0.302 GC
N
f-1586420743
f
GR
GS
[1 0 0 1 1551.06165 66.26022] CT
0.302 GC
N
f-1586420743
f
GR
GS
[1 0 0 1 1559.64502 200.91844] CT
0.302 GC
N
f-1586420743
f
GR
GS
[1 0 0 1 1553.72607 146.10858] CT
0.302 GC
N
f-1586420743
f
GR
GS
[1 0 0 1 1555.48901 239.83372] CT
0.302 GC
N
f-1586420743
f
GR
GS
[1 0 0 1 1555.91248 225.12221] CT
0.302 GC
N
f-1586420743
f
GR
GS
[1 0 0 1 1545.22388 84.77457] CT
0.302 GC
N
f-1586420743
f
GR
GS
[1 0 0 1 1557.64246 244.7997] CT
0.302 GC
N
f-1586420743
f
GR
GS
[1 0 0 1 1546.69165 75.20793] CT
0.302 GC
N
f-1586420743
f
GR
GS
[1 0 0 1 1545.55969 106.32394] CT
0.302 GC
N
f-1586420743
f
GR
GS
[1 0 0 1 1552.73511 35.91163] CT
0.302 GC
N
f-1586420743
f
GR
GS
[1 0 0 1 1556.25452 107.29688] CT
0.302 GC
N
f-1586420743
f
GR
GS
[1 0 0 1 1548.47864 123.28437] CT
0.302 GC
N
f-1586420743
f
GR
GS
[1 0 0 1 1556.67969 80.22275] CT
0.302 GC
N
f-1586420743
f
GR
GS
[1 0 0 1 1555.68823 40.83421] CT
0.302 GC
N
f-1586420743
f
GR
GS
[1 0 0 1 1559.53589 173.29768] CT
0.302 GC
N
f-1586420743
f
GR
GS
[1 0 0 1 1548.9762 119.58852] CT
0.302 GC
N
f-1586420743
f
GR
GS
[1 0 0 1 1551.24048 42.89126] CT
0.302 GC
N
f-1586420743
f
GR
GS
[1 0 0 1 1545.48181 106.13802] CT
0.302 GC
N
f-1586420743
f
GR
GS
[1 0 0 1 1548.79773 39.51765] CT
0.302 GC
N
f-1586420743
f
GR
GS
[1 0 0 1 1558.36035 36.59974] CT
0.302 GC
N
f-1586420743
f
GR
GS
[1 0 0 1 1553.12744 46.62364] CT
0.302 GC
N
f-1586420743
f
GR
GS
[1 0 0 1 1558.04858 35.71949] CT
0.302 GC
N
f-1586420743
f
GR
GS
[1 0 0 1 1552.42346 53.84809] CT
0.302 GC
N
f-1586420743
f
GR
GS
[1 0 0 1 1544.06897 53.95401] CT
0.302 GC
N
f-1586420743
f
GR
GS
[1 0 0 1 1547.29346 86.30563] CT
0.302 GC
N
f-1586420743
f
GR
GS
[1 0 0 1 1548.54565 39.7794] CT
0.302 GC
N
f-1586420743
f
GR
GS
[1 0 0 1 1560.16211 68.8868] CT
0.302 GC
N
f-1586420743
f
GR
GS
[1 0 0 1 1543.97449 51.70993] CT
0.302 GC
N
f-1586420743
f
GR
GS
[1 0 0 1 1555.3656 90.61749] CT
0.302 GC
N
f-1586420743
f
GR
GS
[1 0 0 1 1546.56677 36.15756] CT
0.302 GC
N
f-1586420743
f
GR
GS
[1 0 0 1 1561.03394 91.6377] CT
0.302 GC
N
f-1586420743
f
GR
GS
[1 0 0 1 1561.06006 33.56116] CT
0.302 GC
N
f-1586420743
f
GR
GS
[1 0 0 1 1547.87756 32.1955] CT
0.302 GC
N
f-1586420743
f
GR
GS
[1 0 0 1 1557.30603 143.68761] CT
0.302 GC
N
f-1586420743
f
GR
GS
[1 0 0 1 1550.79236 57.25208] CT
0.302 GC
N
f-1586420743
f
GR
GS
[1 0 0 1 1558.9115 72.92302] CT
0.302 GC
N
f-1586420743
f
GR
GS
[1 0 0 1 1549.4408 73.77504] CT
0.302 GC
N
f-1586420743
f
GR
GS
[1 0 0 1 1553.7312 39.46574] CT
0.302 GC
N
f-1586420743
f
GR
GS
[1 0 0 1 1557.64014 41.15884] CT
0.302 GC
N
f-1586420743
f
GR
GS
[1 0 0 1 1552.5791 41.96057] CT
0.302 GC
N
f-1586420743
f
GR
GS
[1 0 0 1 1554.40332 49.30967] CT
0.302 GC
N
f-1586420743
f
GR
GS
[1 0 0 1 1546.72314 35.61876] CT
0.302 GC
N
f-1586420743
f
GR
GS
[1 0 0 1 1543.42175 51.4911] CT
0.302 GC
N
f-1586420743
f
GR
GS
[1 0 0 1 1544.21851 98.01775] CT
0.302 GC
N
f-1586420743
f
GR
GS
[1 0 0 1 1553.02429 32.66641] CT
0.302 GC
N
f-1586420743
f
GR
GS
[1 0 0 1 1543.67114 57.84539] CT
0.302 GC
N
f-1586420743
f
GR
GS
[1 0 0 1 1552.19995 157] CT
/Helvetica 20 F
GS
[1 0 0 1 0 0] CT
0 7.5 moveto 
1 -1 scale
(0) t 
GR
GR
GS
1 GC
N
/f-473925334{1671 282 M
1782 282 L
1782 32 L
1671 32 L
cp}def
f-473925334
f
GR
GS
0.149 GC
2 setlinecap
1 LJ
0.5 LW
N
1671 282 M
1782 282 L
S
GR
GS
0.149 GC
2 setlinecap
1 LJ
0.5 LW
N
1704.3 282 M
1704.3 279.5 L
S
GR
GS
0.149 GC
2 setlinecap
1 LJ
0.5 LW
N
1748.7 282 M
1748.7 279.5 L
S
GR
GS
[1 0 0 1 1704.30005 288] CT
0.149 GC
/Helvetica 20 F
GS
[1 0 0 1 0 0] CT
-13 20 moveto 
1 -1 scale
(YA) t 
GR
GR
GS
[1 0 0 1 1748.69995 288] CT
0.149 GC
/Helvetica 20 F
GS
[1 0 0 1 0 0] CT
-14.5 20 moveto 
1 -1 scale
(OA) t 
GR
GR
GS
[1 0 0 1 1726.5 313] CT
0.149 GC
/Helvetica 20 F
GS
[1 0 0 1 0 0] CT
-49 20 moveto 
1 -1 scale
(Age Group) t 
GR
GR
GS
0.149 GC
2 setlinecap
1 LJ
0.5 LW
N
1671 282 M
1671 32 L
S
GR
GS
0.149 GC
2 setlinecap
1 LJ
0.5 LW
N
1671 282 M
1673.5 282 L
S
GR
GS
0.149 GC
2 setlinecap
1 LJ
0.5 LW
N
1671 198.667 M
1673.5 198.667 L
S
GR
GS
0.149 GC
2 setlinecap
1 LJ
0.5 LW
N
1671 115.333 M
1673.5 115.333 L
S
GR
GS
0.149 GC
2 setlinecap
1 LJ
0.5 LW
N
1671 32 M
1673.5 32 L
S
GR
GS
[1 0 0 1 1665 282] CT
0.149 GC
/Helvetica 20 F
GS
[1 0 0 1 0 0] CT
-36 7.5 moveto 
1 -1 scale
(-0.5) t 
GR
GR
GS
[1 0 0 1 1665 198.66667] CT
0.149 GC
/Helvetica 20 F
GS
[1 0 0 1 0 0] CT
-12 7.5 moveto 
1 -1 scale
(0) t 
GR
GR
GS
[1 0 0 1 1665 115.33334] CT
0.149 GC
/Helvetica 20 F
GS
[1 0 0 1 0 0] CT
-28 7.5 moveto 
1 -1 scale
(0.5) t 
GR
GR
GS
[1 0 0 1 1665 32] CT
0.149 GC
/Helvetica 20 F
GS
[1 0 0 1 0 0] CT
-12 7.5 moveto 
1 -1 scale
(1) t 
GR
GR
GS
[0 -1 1 0 1612 236] CT
0.149 GC
/Helvetica 20 F
GS
[1 0 0 1 0 0] CT
0 0 moveto 
1 -1 scale
(all) t 
GR
GR
GS
[0 -1 1 0 1622 216] CT
0.149 GC
/Helvetica 16 F
GS
[1 0 0 1 0 0] CT
0 0 moveto 
1 -1 scale
(e) t 
GR
GR
GS
[0 -1 1 0 1612 207] CT
0.149 GC
/Helvetica 20 F
GS
[1 0 0 1 0 0] CT
0 0 moveto 
1 -1 scale
(qualized linear) t 
GR
GR
GS
[1 0 0 1 1726.50159 29.25] CT
/Helvetica-Bold 22 F
GS
[1 0 0 1 0 0] CT
-76.5 -5 moveto 
1 -1 scale
(p = 6.0797e-06) t 
GR
GR
GS
0.149 GC
1 LJ
0.5 LW
N
1671 198.667 M
1782 198.667 L
S
GR
GS
0.6 GC
N
/f1470739550{1722.06 198.667 M
1722.06 108.656 L
1686.54 108.656 L
1686.54 198.667 L
cp}def
f1470739550
f
GR
GS
[1 0 0 1 1709.81189 194.38712] CT
0.302 GC
N
f-1586420743
f
GR
GS
[1 0 0 1 1703.52686 146.35654] CT
0.302 GC
N
f-1586420743
f
GR
GS
[1 0 0 1 1706.9458 67.71547] CT
0.302 GC
N
f-1586420743
f
GR
GS
[1 0 0 1 1696.08594 81.93383] CT
0.302 GC
N
f-1586420743
f
GR
GS
[1 0 0 1 1708.87109 145.24031] CT
0.302 GC
N
f-1586420743
f
GR
GS
[1 0 0 1 1706.82605 63.56659] CT
0.302 GC
N
f-1586420743
f
GR
GS
[1 0 0 1 1700.0553 118.69811] CT
0.302 GC
N
f-1586420743
f
GR
GS
[1 0 0 1 1698.11707 73.68605] CT
0.302 GC
N
f-1586420743
f
GR
GS
[1 0 0 1 1705.19812 87.81405] CT
0.302 GC
N
f-1586420743
f
GR
GS
[1 0 0 1 1695.83582 120.27979] CT
0.302 GC
N
f-1586420743
f
GR
GS
[1 0 0 1 1711.4364 83.97901] CT
0.302 GC
N
f-1586420743
f
GR
GS
[1 0 0 1 1707.09912 107.33208] CT
0.302 GC
N
f-1586420743
f
GR
GS
[1 0 0 1 1709.98975 101.0424] CT
0.302 GC
N
f-1586420743
f
GR
GS
[1 0 0 1 1705.24707 58.0547] CT
0.302 GC
N
f-1586420743
f
GR
GS
[1 0 0 1 1706.79565 127.70264] CT
0.302 GC
N
f-1586420743
f
GR
GS
[1 0 0 1 1699.65955 109.33046] CT
0.302 GC
N
f-1586420743
f
GR
GS
[1 0 0 1 1711.27063 114.60681] CT
0.302 GC
N
f-1586420743
f
GR
GS
[1 0 0 1 1700.61023 174.26224] CT
0.302 GC
N
f-1586420743
f
GR
GS
[1 0 0 1 1710.91516 59.35682] CT
0.302 GC
N
f-1586420743
f
GR
GS
[1 0 0 1 1713.01392 214.89592] CT
0.302 GC
N
f-1586420743
f
GR
GS
[1 0 0 1 1697.55774 74.4357] CT
0.302 GC
N
f-1586420743
f
GR
GS
[1 0 0 1 1697.49182 70.2655] CT
0.302 GC
N
f-1586420743
f
GR
GS
[1 0 0 1 1709.59216 123.74049] CT
0.302 GC
N
f-1586420743
f
GR
GS
[1 0 0 1 1709.01538 108.0695] CT
0.302 GC
N
f-1586420743
f
GR
GS
[1 0 0 1 1708.62219 92.54605] CT
0.302 GC
N
f-1586420743
f
GR
GS
[1 0 0 1 1709.13635 82.39752] CT
0.302 GC
N
f-1586420743
f
GR
GS
[1 0 0 1 1699.43481 114.87393] CT
0.302 GC
N
f-1586420743
f
GR
GS
[1 0 0 1 1704.54468 148.71078] CT
0.302 GC
N
f-1586420743
f
GR
GS
[1 0 0 1 1700.90381 90.88514] CT
0.302 GC
N
f-1586420743
f
GR
GS
[1 0 0 1 1706.18652 76.04202] CT
0.302 GC
N
f-1586420743
f
GR
GS
[1 0 0 1 1704.55701 141.36281] CT
0.302 GC
N
f-1586420743
f
GR
GS
[1 0 0 1 1701.38623 53.92594] CT
0.302 GC
N
f-1586420743
f
GR
GS
[1 0 0 1 1699.01172 108.40526] CT
0.302 GC
N
f-1586420743
f
GR
GS
[1 0 0 1 1704.50732 58.82528] CT
0.302 GC
N
f-1586420743
f
GR
GS
[1 0 0 1 1698.76135 92.8997] CT
0.302 GC
N
f-1586420743
f
GR
GS
[1 0 0 1 1698.62158 114.91306] CT
0.302 GC
N
f-1586420743
f
GR
GS
[1 0 0 1 1707.81091 65.93671] CT
0.302 GC
N
f-1586420743
f
GR
GS
[1 0 0 1 1698.05872 96.55145] CT
0.302 GC
N
f-1586420743
f
GR
GS
[1 0 0 1 1697.89868 102.13776] CT
0.302 GC
N
f-1586420743
f
GR
GS
[1 0 0 1 1712.56873 93.56171] CT
0.302 GC
N
f-1586420743
f
GR
GS
[1 0 0 1 1705.9635 51.32791] CT
0.302 GC
N
f-1586420743
f
GR
GS
[1 0 0 1 1698.95435 169.27055] CT
0.302 GC
N
f-1586420743
f
GR
GS
[1 0 0 1 1701.59229 101.75976] CT
0.302 GC
N
f-1586420743
f
GR
GS
[1 0 0 1 1713.06384 211.20746] CT
0.302 GC
N
f-1586420743
f
GR
GS
[1 0 0 1 1701.01697 75.6472] CT
0.302 GC
N
f-1586420743
f
GR
GS
[1 0 0 1 1702.97473 203.06458] CT
0.302 GC
N
f-1586420743
f
GR
GS
[1 0 0 1 1705.95667 133.80531] CT
0.302 GC
N
f-1586420743
f
GR
GS
[1 0 0 1 1704.30005 198.66667] CT
/Helvetica 20 F
GS
[1 0 0 1 0 0] CT
0 7.5 moveto 
1 -1 scale
(0) t 
GR
GR
GS
0.6 GC
N
/f273570914{1766.46 198.667 M
1766.46 150.81 L
1730.94 150.81 L
1730.94 198.667 L
cp}def
f273570914
f
GR
GS
[1 0 0 1 1742.28894 202.65994] CT
0.302 GC
N
f-1586420743
f
GR
GS
[1 0 0 1 1752.32507 174.81436] CT
0.302 GC
N
f-1586420743
f
GR
GS
[1 0 0 1 1740.65869 88.94144] CT
0.302 GC
N
f-1586420743
f
GR
GS
[1 0 0 1 1745.9635 183.95345] CT
0.302 GC
N
f-1586420743
f
GR
GS
[1 0 0 1 1749.2865 101.174] CT
0.302 GC
N
f-1586420743
f
GR
GS
[1 0 0 1 1747.89221 170.37224] CT
0.302 GC
N
f-1586420743
f
GR
GS
[1 0 0 1 1740.93713 181.63365] CT
0.302 GC
N
f-1586420743
f
GR
GS
[1 0 0 1 1740.53271 174.47917] CT
0.302 GC
N
f-1586420743
f
GR
GS
[1 0 0 1 1747.21887 200.18433] CT
0.302 GC
N
f-1586420743
f
GR
GS
[1 0 0 1 1746.39478 97.7467] CT
0.302 GC
N
f-1586420743
f
GR
GS
[1 0 0 1 1742.46692 181.31422] CT
0.302 GC
N
f-1586420743
f
GR
GS
[1 0 0 1 1741.54993 265.92261] CT
0.302 GC
N
f-1586420743
f
GR
GS
[1 0 0 1 1743.50928 196.65854] CT
0.302 GC
N
f-1586420743
f
GR
GS
[1 0 0 1 1752.09033 125.11786] CT
0.302 GC
N
f-1586420743
f
GR
GS
[1 0 0 1 1754.6958 143.82205] CT
0.302 GC
N
f-1586420743
f
GR
GS
[1 0 0 1 1748.09412 182.97453] CT
0.302 GC
N
f-1586420743
f
GR
GS
[1 0 0 1 1753.51331 165.12917] CT
0.302 GC
N
f-1586420743
f
GR
GS
[1 0 0 1 1749.10254 113.51463] CT
0.302 GC
N
f-1586420743
f
GR
GS
[1 0 0 1 1747.32263 179.49649] CT
0.302 GC
N
f-1586420743
f
GR
GS
[1 0 0 1 1752.3175 240.72501] CT
0.302 GC
N
f-1586420743
f
GR
GS
[1 0 0 1 1744.55688 127.96773] CT
0.302 GC
N
f-1586420743
f
GR
GS
[1 0 0 1 1748.01099 63.41359] CT
0.302 GC
N
f-1586420743
f
GR
GS
[1 0 0 1 1740.09961 131.23895] CT
0.302 GC
N
f-1586420743
f
GR
GS
[1 0 0 1 1741.50745 149.91446] CT
0.302 GC
N
f-1586420743
f
GR
GS
[1 0 0 1 1747.03967 89.26363] CT
0.302 GC
N
f-1586420743
f
GR
GS
[1 0 0 1 1740.22974 156.6683] CT
0.302 GC
N
f-1586420743
f
GR
GS
[1 0 0 1 1743.43701 54.89207] CT
0.302 GC
N
f-1586420743
f
GR
GS
[1 0 0 1 1755.05444 129.3092] CT
0.302 GC
N
f-1586420743
f
GR
GS
[1 0 0 1 1746.15833 130.59222] CT
0.302 GC
N
f-1586420743
f
GR
GS
[1 0 0 1 1742.93921 136.31392] CT
0.302 GC
N
f-1586420743
f
GR
GS
[1 0 0 1 1756.55127 145.15463] CT
0.302 GC
N
f-1586420743
f
GR
GS
[1 0 0 1 1754.51208 154.09903] CT
0.302 GC
N
f-1586420743
f
GR
GS
[1 0 0 1 1750.64282 123.79288] CT
0.302 GC
N
f-1586420743
f
GR
GS
[1 0 0 1 1749.29333 103.89906] CT
0.302 GC
N
f-1586420743
f
GR
GS
[1 0 0 1 1747.36987 82.60477] CT
0.302 GC
N
f-1586420743
f
GR
GS
[1 0 0 1 1753.97705 217.27644] CT
0.302 GC
N
f-1586420743
f
GR
GS
[1 0 0 1 1753.13794 136.62508] CT
0.302 GC
N
f-1586420743
f
GR
GS
[1 0 0 1 1746.79443 125.3252] CT
0.302 GC
N
f-1586420743
f
GR
GS
[1 0 0 1 1749.05627 142.6969] CT
0.302 GC
N
f-1586420743
f
GR
GS
[1 0 0 1 1749.14197 145.48006] CT
0.302 GC
N
f-1586420743
f
GR
GS
[1 0 0 1 1746.16003 163.3522] CT
0.302 GC
N
f-1586420743
f
GR
GS
[1 0 0 1 1754.27783 198.58185] CT
0.302 GC
N
f-1586420743
f
GR
GS
[1 0 0 1 1741.33948 206.03493] CT
0.302 GC
N
f-1586420743
f
GR
GS
[1 0 0 1 1746.22485 117.66383] CT
0.302 GC
N
f-1586420743
f
GR
GS
[1 0 0 1 1745.63794 106.79945] CT
0.302 GC
N
f-1586420743
f
GR
GS
[1 0 0 1 1750.41357 197.58612] CT
0.302 GC
N
f-1586420743
f
GR
GS
[1 0 0 1 1743.63928 153.06966] CT
0.302 GC
N
f-1586420743
f
GR
GS
[1 0 0 1 1741.8623 148.24683] CT
0.302 GC
N
f-1586420743
f
GR
GS
[1 0 0 1 1742.74951 210.22791] CT
0.302 GC
N
f-1586420743
f
GR
GS
[1 0 0 1 1751.17981 96.79524] CT
0.302 GC
N
f-1586420743
f
GR
GS
[1 0 0 1 1740.29004 175.79878] CT
0.302 GC
N
f-1586420743
f
GR
GS
[1 0 0 1 1748.69995 198.66667] CT
/Helvetica 20 F
GS
[1 0 0 1 0 0] CT
0 7.5 moveto 
1 -1 scale
(0) t 
GR
GR
%%Trailer
%%Pages: 1
%%EOF
