%!PS-Adobe-3.0 EPSF-3.0
%%Creator: (MATLAB, The Mathworks, Inc. Version 9.10.0.1602886 \(R2021a\). Operating System: Mac OS X)
%%Title: /Users/kosciessa/Desktop/tardis/LNDG/stateswitch/stsw_eeg_task/tfr/figures/b01_gammaTraces_yaoa.eps
%%CreationDate: 2022-02-22T16:35:28
%%Pages: (atend)
%%BoundingBox:     2     0   388   266
%%LanguageLevel: 3
%%EndComments
%%BeginProlog
%%BeginResource: procset (Apache XML Graphics Std ProcSet) 1.2 0
%%Version: 1.2 0
%%Copyright: (Copyright 2001-2003,2010 The Apache Software Foundation. License terms: http://www.apache.org/licenses/LICENSE-2.0)
/bd{bind def}bind def
/ld{load def}bd
/GR/grestore ld
/GS/gsave ld
/RM/rmoveto ld
/C/curveto ld
/t/show ld
/L/lineto ld
/ML/setmiterlimit ld
/CT/concat ld
/f/fill ld
/N/newpath ld
/S/stroke ld
/CC/setcmykcolor ld
/A/ashow ld
/cp/closepath ld
/RC/setrgbcolor ld
/LJ/setlinejoin ld
/GC/setgray ld
/LW/setlinewidth ld
/M/moveto ld
/re {4 2 roll M
1 index 0 rlineto
0 exch rlineto
neg 0 rlineto
cp } bd
/_ctm matrix def
/_tm matrix def
/BT { _ctm currentmatrix pop matrix _tm copy pop 0 0 moveto } bd
/ET { _ctm setmatrix } bd
/iTm { _ctm setmatrix _tm concat } bd
/Tm { _tm astore pop iTm 0 0 moveto } bd
/ux 0.0 def
/uy 0.0 def
/F {
  /Tp exch def
  /Tf exch def
  Tf findfont Tp scalefont setfont
  /cf Tf def  /cs Tp def
} bd
/ULS {currentpoint /uy exch def /ux exch def} bd
/ULE {
  /Tcx currentpoint pop def
  gsave
  newpath
  cf findfont cs scalefont dup
  /FontMatrix get 0 get /Ts exch def /FontInfo get dup
  /UnderlinePosition get Ts mul /To exch def
  /UnderlineThickness get Ts mul /Tt exch def
  ux uy To add moveto  Tcx uy To add lineto
  Tt setlinewidth stroke
  grestore
} bd
/OLE {
  /Tcx currentpoint pop def
  gsave
  newpath
  cf findfont cs scalefont dup
  /FontMatrix get 0 get /Ts exch def /FontInfo get dup
  /UnderlinePosition get Ts mul /To exch def
  /UnderlineThickness get Ts mul /Tt exch def
  ux uy To add cs add moveto Tcx uy To add cs add lineto
  Tt setlinewidth stroke
  grestore
} bd
/SOE {
  /Tcx currentpoint pop def
  gsave
  newpath
  cf findfont cs scalefont dup
  /FontMatrix get 0 get /Ts exch def /FontInfo get dup
  /UnderlinePosition get Ts mul /To exch def
  /UnderlineThickness get Ts mul /Tt exch def
  ux uy To add cs 10 mul 26 idiv add moveto Tcx uy To add cs 10 mul 26 idiv add lineto
  Tt setlinewidth stroke
  grestore
} bd
/QT {
/Y22 exch store
/X22 exch store
/Y21 exch store
/X21 exch store
currentpoint
/Y21 load 2 mul add 3 div exch
/X21 load 2 mul add 3 div exch
/X21 load 2 mul /X22 load add 3 div
/Y21 load 2 mul /Y22 load add 3 div
/X22 load /Y22 load curveto
} bd
/SSPD {
dup length /d exch dict def
{
/v exch def
/k exch def
currentpagedevice k known {
/cpdv currentpagedevice k get def
v cpdv ne {
/upd false def
/nullv v type /nulltype eq def
/nullcpdv cpdv type /nulltype eq def
nullv nullcpdv or
{
/upd true def
} {
/sametype v type cpdv type eq def
sametype {
v type /arraytype eq {
/vlen v length def
/cpdvlen cpdv length def
vlen cpdvlen eq {
0 1 vlen 1 sub {
/i exch def
/obj v i get def
/cpdobj cpdv i get def
obj cpdobj ne {
/upd true def
exit
} if
} for
} {
/upd true def
} ifelse
} {
v type /dicttype eq {
v {
/dv exch def
/dk exch def
/cpddv cpdv dk get def
dv cpddv ne {
/upd true def
exit
} if
} forall
} {
/upd true def
} ifelse
} ifelse
} if
} ifelse
upd true eq {
d k v put
} if
} if
} if
} forall
d length 0 gt {
d setpagedevice
} if
} bd
/RE { % /NewFontName [NewEncodingArray] /FontName RE -
  findfont dup length dict begin
  {
    1 index /FID ne
    {def} {pop pop} ifelse
  } forall
  /Encoding exch def
  /FontName 1 index def
  currentdict definefont pop
  end
} bind def
%%EndResource
%%BeginResource: procset (Apache XML Graphics EPS ProcSet) 1.0 0
%%Version: 1.0 0
%%Copyright: (Copyright 2002-2003 The Apache Software Foundation. License terms: http://www.apache.org/licenses/LICENSE-2.0)
/BeginEPSF { %def
/b4_Inc_state save def         % Save state for cleanup
/dict_count countdictstack def % Count objects on dict stack
/op_count count 1 sub def      % Count objects on operand stack
userdict begin                 % Push userdict on dict stack
/showpage { } def              % Redefine showpage, { } = null proc
0 setgray 0 setlinecap         % Prepare graphics state
1 setlinewidth 0 setlinejoin
10 setmiterlimit [ ] 0 setdash newpath
/languagelevel where           % If level not equal to 1 then
{pop languagelevel             % set strokeadjust and
1 ne                           % overprint to their defaults.
{false setstrokeadjust false setoverprint
} if
} if
} bd
/EndEPSF { %def
count op_count sub {pop} repeat            % Clean up stacks
countdictstack dict_count sub {end} repeat
b4_Inc_state restore
} bd
%%EndResource
%FOPBeginFontDict
%%IncludeResource: font Courier-Oblique
%%IncludeResource: font Courier-BoldOblique
%%IncludeResource: font Courier-Bold
%%IncludeResource: font ZapfDingbats
%%IncludeResource: font Symbol
%%IncludeResource: font Helvetica
%%IncludeResource: font Helvetica-Oblique
%%IncludeResource: font Helvetica-Bold
%%IncludeResource: font Helvetica-BoldOblique
%%IncludeResource: font Times-Roman
%%IncludeResource: font Times-Italic
%%IncludeResource: font Times-Bold
%%IncludeResource: font Times-BoldItalic
%%IncludeResource: font Courier
%FOPEndFontDict
%%BeginResource: encoding WinAnsiEncoding
/WinAnsiEncoding [
/.notdef /.notdef /.notdef /.notdef /.notdef
/.notdef /.notdef /.notdef /.notdef /.notdef
/.notdef /.notdef /.notdef /.notdef /.notdef
/.notdef /.notdef /.notdef /.notdef /.notdef
/.notdef /.notdef /.notdef /.notdef /.notdef
/.notdef /.notdef /.notdef /.notdef /.notdef
/.notdef /.notdef /space /exclam /quotedbl
/numbersign /dollar /percent /ampersand /quotesingle
/parenleft /parenright /asterisk /plus /comma
/hyphen /period /slash /zero /one
/two /three /four /five /six
/seven /eight /nine /colon /semicolon
/less /equal /greater /question /at
/A /B /C /D /E
/F /G /H /I /J
/K /L /M /N /O
/P /Q /R /S /T
/U /V /W /X /Y
/Z /bracketleft /backslash /bracketright /asciicircum
/underscore /quoteleft /a /b /c
/d /e /f /g /h
/i /j /k /l /m
/n /o /p /q /r
/s /t /u /v /w
/x /y /z /braceleft /bar
/braceright /asciitilde /bullet /Euro /bullet
/quotesinglbase /florin /quotedblbase /ellipsis /dagger
/daggerdbl /circumflex /perthousand /Scaron /guilsinglleft
/OE /bullet /Zcaron /bullet /bullet
/quoteleft /quoteright /quotedblleft /quotedblright /bullet
/endash /emdash /asciitilde /trademark /scaron
/guilsinglright /oe /bullet /zcaron /Ydieresis
/space /exclamdown /cent /sterling /currency
/yen /brokenbar /section /dieresis /copyright
/ordfeminine /guillemotleft /logicalnot /sfthyphen /registered
/macron /degree /plusminus /twosuperior /threesuperior
/acute /mu /paragraph /middot /cedilla
/onesuperior /ordmasculine /guillemotright /onequarter /onehalf
/threequarters /questiondown /Agrave /Aacute /Acircumflex
/Atilde /Adieresis /Aring /AE /Ccedilla
/Egrave /Eacute /Ecircumflex /Edieresis /Igrave
/Iacute /Icircumflex /Idieresis /Eth /Ntilde
/Ograve /Oacute /Ocircumflex /Otilde /Odieresis
/multiply /Oslash /Ugrave /Uacute /Ucircumflex
/Udieresis /Yacute /Thorn /germandbls /agrave
/aacute /acircumflex /atilde /adieresis /aring
/ae /ccedilla /egrave /eacute /ecircumflex
/edieresis /igrave /iacute /icircumflex /idieresis
/eth /ntilde /ograve /oacute /ocircumflex
/otilde /odieresis /divide /oslash /ugrave
/uacute /ucircumflex /udieresis /yacute /thorn
/ydieresis
] def
%%EndResource
%FOPBeginFontReencode
/Courier-Oblique findfont
dup length dict begin
  {1 index /FID ne {def} {pop pop} ifelse} forall
  /Encoding WinAnsiEncoding def
  currentdict
end
/Courier-Oblique exch definefont pop
/Courier-BoldOblique findfont
dup length dict begin
  {1 index /FID ne {def} {pop pop} ifelse} forall
  /Encoding WinAnsiEncoding def
  currentdict
end
/Courier-BoldOblique exch definefont pop
/Courier-Bold findfont
dup length dict begin
  {1 index /FID ne {def} {pop pop} ifelse} forall
  /Encoding WinAnsiEncoding def
  currentdict
end
/Courier-Bold exch definefont pop
/Helvetica findfont
dup length dict begin
  {1 index /FID ne {def} {pop pop} ifelse} forall
  /Encoding WinAnsiEncoding def
  currentdict
end
/Helvetica exch definefont pop
/Helvetica-Oblique findfont
dup length dict begin
  {1 index /FID ne {def} {pop pop} ifelse} forall
  /Encoding WinAnsiEncoding def
  currentdict
end
/Helvetica-Oblique exch definefont pop
/Helvetica-Bold findfont
dup length dict begin
  {1 index /FID ne {def} {pop pop} ifelse} forall
  /Encoding WinAnsiEncoding def
  currentdict
end
/Helvetica-Bold exch definefont pop
/Helvetica-BoldOblique findfont
dup length dict begin
  {1 index /FID ne {def} {pop pop} ifelse} forall
  /Encoding WinAnsiEncoding def
  currentdict
end
/Helvetica-BoldOblique exch definefont pop
/Times-Roman findfont
dup length dict begin
  {1 index /FID ne {def} {pop pop} ifelse} forall
  /Encoding WinAnsiEncoding def
  currentdict
end
/Times-Roman exch definefont pop
/Times-Italic findfont
dup length dict begin
  {1 index /FID ne {def} {pop pop} ifelse} forall
  /Encoding WinAnsiEncoding def
  currentdict
end
/Times-Italic exch definefont pop
/Times-Bold findfont
dup length dict begin
  {1 index /FID ne {def} {pop pop} ifelse} forall
  /Encoding WinAnsiEncoding def
  currentdict
end
/Times-Bold exch definefont pop
/Times-BoldItalic findfont
dup length dict begin
  {1 index /FID ne {def} {pop pop} ifelse} forall
  /Encoding WinAnsiEncoding def
  currentdict
end
/Times-BoldItalic exch definefont pop
/Courier findfont
dup length dict begin
  {1 index /FID ne {def} {pop pop} ifelse} forall
  /Encoding WinAnsiEncoding def
  currentdict
end
/Courier exch definefont pop
%FOPEndFontReencode
%%EndProlog
%%Page: 1 1
%%PageBoundingBox: 0 0 425 283
%%BeginPageSetup
[1 0 0 -1 0 283] CT
%%EndPageSetup
GS
[1.00046 0 0 1 0 0] CT
1 GC
N
0 0 425 283 re
f
GR
GS
[1.00046 0 0 1 0 0] CT
1 GC
N
0 0 425 283 re
f
GR
GS
[1.00046 0 0 1 0 0] CT
1 GC
N
64.5 248.5 M
384.5 248.5 L
384.5 21 L
64.5 21 L
cp
f
GR
GS
[1.00046 0 0 1 0 0] CT
0.149 GC
2 setlinecap
1 LJ
0.5 LW
N
64.5 248.5 M
384.5 248.5 L
S
GR
GS
[1.00046 0 0 1 0 0] CT
0.149 GC
2 setlinecap
1 LJ
0.5 LW
N
64.5 248.5 M
64.5 245.304 L
S
GR
GS
[1.00046 0 0 1 0 0] CT
0.149 GC
2 setlinecap
1 LJ
0.5 LW
N
110.214 248.5 M
110.214 245.304 L
S
GR
GS
[1.00046 0 0 1 0 0] CT
0.149 GC
2 setlinecap
1 LJ
0.5 LW
N
155.929 248.5 M
155.929 245.304 L
S
GR
GS
[1.00046 0 0 1 0 0] CT
0.149 GC
2 setlinecap
1 LJ
0.5 LW
N
201.643 248.5 M
201.643 245.304 L
S
GR
GS
[1.00046 0 0 1 0 0] CT
0.149 GC
2 setlinecap
1 LJ
0.5 LW
N
247.357 248.5 M
247.357 245.304 L
S
GR
GS
[1.00046 0 0 1 0 0] CT
0.149 GC
2 setlinecap
1 LJ
0.5 LW
N
293.071 248.5 M
293.071 245.304 L
S
GR
GS
[1.00046 0 0 1 0 0] CT
0.149 GC
2 setlinecap
1 LJ
0.5 LW
N
338.786 248.5 M
338.786 245.304 L
S
GR
GS
[1.00046 0 0 1 0 0] CT
0.149 GC
2 setlinecap
1 LJ
0.5 LW
N
384.5 248.5 M
384.5 245.304 L
S
GR
GS
[1.00046 0 0 1 64.52987 252.89999] CT
0.149 GC
/Helvetica 12 F
GS
[1 0 0 1 0 0] CT
-3.5 12 moveto 
1 -1 scale
(1) t 
GR
GR
GS
[1.00046 0 0 1 110.26533 252.89999] CT
0.149 GC
/Helvetica 12 F
GS
[1 0 0 1 0 0] CT
-3.5 12 moveto 
1 -1 scale
(2) t 
GR
GR
GS
[1.00046 0 0 1 156.00079 252.89999] CT
0.149 GC
/Helvetica 12 F
GS
[1 0 0 1 0 0] CT
-3.5 12 moveto 
1 -1 scale
(3) t 
GR
GR
GS
[1.00046 0 0 1 201.73624 252.89999] CT
0.149 GC
/Helvetica 12 F
GS
[1 0 0 1 0 0] CT
-3.5 12 moveto 
1 -1 scale
(4) t 
GR
GR
GS
[1.00046 0 0 1 247.47171 252.89999] CT
0.149 GC
/Helvetica 12 F
GS
[1 0 0 1 0 0] CT
-3.5 12 moveto 
1 -1 scale
(5) t 
GR
GR
GS
[1.00046 0 0 1 293.20718 252.89999] CT
0.149 GC
/Helvetica 12 F
GS
[1 0 0 1 0 0] CT
-3.5 12 moveto 
1 -1 scale
(6) t 
GR
GR
GS
[1.00046 0 0 1 338.94261 252.89999] CT
0.149 GC
/Helvetica 12 F
GS
[1 0 0 1 0 0] CT
-3.5 12 moveto 
1 -1 scale
(7) t 
GR
GR
GS
[1.00046 0 0 1 384.67808 252.89999] CT
0.149 GC
/Helvetica 12 F
GS
[1 0 0 1 0 0] CT
-3.5 12 moveto 
1 -1 scale
(8) t 
GR
GR
GS
[1.00046 0 0 1 224.60413 268.5] CT
0.149 GC
/Helvetica 12 F
GS
[1 0 0 1 0 0] CT
-21 12 moveto 
1 -1 scale
(Time \(s\)) t 
GR
GR
GS
[1.00046 0 0 1 0 0] CT
0.149 GC
2 setlinecap
1 LJ
0.5 LW
N
64.5 248.5 M
64.5 21 L
S
GR
GS
[1.00046 0 0 1 0 0] CT
0.149 GC
2 setlinecap
1 LJ
0.5 LW
N
64.5 248.5 M
67.696 248.5 L
S
GR
GS
[1.00046 0 0 1 0 0] CT
0.149 GC
2 setlinecap
1 LJ
0.5 LW
N
64.5 220.063 M
67.696 220.063 L
S
GR
GS
[1.00046 0 0 1 0 0] CT
0.149 GC
2 setlinecap
1 LJ
0.5 LW
N
64.5 191.625 M
67.696 191.625 L
S
GR
GS
[1.00046 0 0 1 0 0] CT
0.149 GC
2 setlinecap
1 LJ
0.5 LW
N
64.5 163.188 M
67.696 163.188 L
S
GR
GS
[1.00046 0 0 1 0 0] CT
0.149 GC
2 setlinecap
1 LJ
0.5 LW
N
64.5 134.75 M
67.696 134.75 L
S
GR
GS
[1.00046 0 0 1 0 0] CT
0.149 GC
2 setlinecap
1 LJ
0.5 LW
N
64.5 106.313 M
67.696 106.313 L
S
GR
GS
[1.00046 0 0 1 0 0] CT
0.149 GC
2 setlinecap
1 LJ
0.5 LW
N
64.5 77.875 M
67.696 77.875 L
S
GR
GS
[1.00046 0 0 1 0 0] CT
0.149 GC
2 setlinecap
1 LJ
0.5 LW
N
64.5 49.438 M
67.696 49.438 L
S
GR
GS
[1.00046 0 0 1 0 0] CT
0.149 GC
2 setlinecap
1 LJ
0.5 LW
N
64.5 21 M
67.696 21 L
S
GR
GS
[1.00046 0 0 1 60.12783 248.5] CT
0.149 GC
/Helvetica 12 F
GS
[1 0 0 1 0 0] CT
-29 4.5 moveto 
1 -1 scale
(-0.02) t 
GR
GR
GS
[1.00046 0 0 1 60.12783 220.0625] CT
0.149 GC
/Helvetica 12 F
GS
[1 0 0 1 0 0] CT
-7 4.5 moveto 
1 -1 scale
(0) t 
GR
GR
GS
[1.00046 0 0 1 60.12783 191.625] CT
0.149 GC
/Helvetica 12 F
GS
[1 0 0 1 0 0] CT
-24 4.5 moveto 
1 -1 scale
(0.02) t 
GR
GR
GS
[1.00046 0 0 1 60.12783 163.1875] CT
0.149 GC
/Helvetica 12 F
GS
[1 0 0 1 0 0] CT
-24 4.5 moveto 
1 -1 scale
(0.04) t 
GR
GR
GS
[1.00046 0 0 1 60.12783 134.75] CT
0.149 GC
/Helvetica 12 F
GS
[1 0 0 1 0 0] CT
-24 4.5 moveto 
1 -1 scale
(0.06) t 
GR
GR
GS
[1.00046 0 0 1 60.12783 106.3125] CT
0.149 GC
/Helvetica 12 F
GS
[1 0 0 1 0 0] CT
-24 4.5 moveto 
1 -1 scale
(0.08) t 
GR
GR
GS
[1.00046 0 0 1 60.12783 77.875] CT
0.149 GC
/Helvetica 12 F
GS
[1 0 0 1 0 0] CT
-17 4.5 moveto 
1 -1 scale
(0.1) t 
GR
GR
GS
[1.00046 0 0 1 60.12783 49.4375] CT
0.149 GC
/Helvetica 12 F
GS
[1 0 0 1 0 0] CT
-24 4.5 moveto 
1 -1 scale
(0.12) t 
GR
GR
GS
[1.00046 0 0 1 60.12783 21] CT
0.149 GC
/Helvetica 12 F
GS
[1 0 0 1 0 0] CT
-24 4.5 moveto 
1 -1 scale
(0.14) t 
GR
GR
GS
[0 -1 1.00046 0 29.01343 134.74989] CT
0.149 GC
/Helvetica 12 F
GS
[1 0 0 1 0 0] CT
-70 -18 moveto 
1 -1 scale
(60-150 Hz Gamma Power) t 
GR
GR
GS
[0 -1 1.00046 0 29.01343 134.74989] CT
0.149 GC
/Helvetica 12 F
GS
[1 0 0 1 0 0] CT
-46 -3 moveto 
1 -1 scale
(\(a.u.; normalized\)) t 
GR
GR
GS
[1.00046 0 0 1 0 0] CT
0.996 0.98 0.98 RC
N
89.643 199.832 M
87.357 199.872 L
85.071 200.206 L
82.786 193.801 L
80.5 189.59 L
78.214 186.557 L
75.929 185.256 L
73.643 182.269 L
71.357 180.77 L
69.071 174.959 L
66.786 171.199 L
64.5 170.165 L
64.5 185.88 L
66.786 187.668 L
69.071 191.133 L
71.357 196.636 L
73.643 197.898 L
75.929 199.757 L
78.214 201.093 L
80.5 204.365 L
82.786 208.456 L
85.071 215.152 L
87.357 214.446 L
89.643 214.789 L
91.929 215.944 L
94.214 215.24 L
96.5 214.155 L
98.786 217.186 L
101.071 214.676 L
103.357 215.703 L
105.643 211.905 L
107.929 210.524 L
110.214 211.099 L
112.5 216.058 L
114.786 215.131 L
117.071 218.511 L
119.357 218.186 L
121.643 219.04 L
123.929 220.155 L
126.214 219.656 L
128.5 216.706 L
130.786 217.529 L
133.071 217.314 L
135.357 217.772 L
137.643 221.599 L
139.929 226.32 L
142.214 228.72 L
144.5 230.63 L
146.786 233.115 L
149.071 236.574 L
151.357 239.673 L
153.643 229.631 L
155.929 220.281 L
158.214 197.928 L
160.5 167.982 L
162.786 146.916 L
165.071 120.494 L
167.357 97.824 L
169.643 77.29 L
171.929 62.233 L
174.214 71.302 L
176.5 75.1 L
178.786 69.287 L
181.071 79.978 L
183.357 85.956 L
185.643 89.058 L
187.929 98.345 L
190.214 103.334 L
192.5 111.387 L
194.786 116.514 L
197.071 118.507 L
199.357 121.438 L
201.643 123.226 L
203.929 122.271 L
206.214 125.964 L
208.5 128.746 L
210.786 131.125 L
213.071 131.968 L
215.357 130.925 L
217.643 135.885 L
219.929 136.748 L
222.214 135.097 L
224.5 135.578 L
226.786 135.157 L
229.071 135.014 L
231.357 131.057 L
233.643 129.797 L
235.929 127.399 L
238.214 125.012 L
240.5 123.453 L
242.786 124.207 L
245.071 121.211 L
247.357 125.121 L
249.643 127.948 L
251.929 130.636 L
254.214 133.468 L
256.5 133.31 L
258.786 132.286 L
261.071 132.986 L
263.357 132.979 L
265.643 131.19 L
267.929 130.266 L
270.214 130.054 L
272.5 131.061 L
274.786 129.04 L
277.071 127.751 L
279.357 129.748 L
281.643 129.895 L
283.929 129.568 L
286.214 129.17 L
288.5 127.876 L
290.786 125.912 L
293.071 125.003 L
295.357 120.224 L
297.643 118.761 L
299.929 123.315 L
302.214 121.631 L
304.5 118.058 L
306.786 117.529 L
309.071 116.54 L
311.357 118.091 L
313.643 116.225 L
315.929 114.272 L
318.214 122.726 L
320.5 136.083 L
322.786 147.196 L
325.071 160.464 L
327.357 170.85 L
329.643 178.09 L
331.929 185.278 L
334.214 190.612 L
336.5 189.93 L
338.786 192.7 L
341.071 194.278 L
343.357 198.975 L
345.643 205.621 L
347.929 209.135 L
350.214 208.109 L
352.5 209.821 L
354.786 209.768 L
357.071 209.866 L
359.357 209.664 L
361.643 205.959 L
363.929 202.102 L
366.214 204.107 L
368.5 202.662 L
370.786 202.887 L
373.071 206.974 L
375.357 205.754 L
377.643 200.925 L
379.929 202.22 L
382.214 198.244 L
384.5 190.691 L
384.5 170.368 L
382.214 177.149 L
379.929 180.842 L
377.643 179.115 L
375.357 183.748 L
373.071 184.904 L
370.786 180.545 L
368.5 180.215 L
366.214 180.722 L
363.929 177.709 L
361.643 180.552 L
359.357 183.28 L
357.071 181.979 L
354.786 181.463 L
352.5 180.76 L
350.214 178.074 L
347.929 178.135 L
345.643 173.942 L
343.357 167.166 L
341.071 162.524 L
338.786 161.474 L
336.5 158.582 L
334.214 160.422 L
331.929 155.853 L
329.643 149.679 L
327.357 143.263 L
325.071 133.988 L
322.786 120.146 L
320.5 107.316 L
318.214 92.456 L
315.929 84.436 L
313.643 86.5 L
311.357 89.307 L
309.071 89.652 L
306.786 93.493 L
304.5 96.899 L
302.214 100.829 L
299.929 103.338 L
297.643 99.331 L
295.357 100.931 L
293.071 106.503 L
290.786 107.477 L
288.5 108.915 L
286.214 110.803 L
283.929 110.771 L
281.643 111.015 L
279.357 110.954 L
277.071 108.453 L
274.786 109.957 L
272.5 111.58 L
270.214 110.583 L
267.929 111.612 L
265.643 112.615 L
263.357 114.432 L
261.071 114.459 L
258.786 114.179 L
256.5 115.946 L
254.214 116.156 L
251.929 113.209 L
249.643 110.463 L
247.357 107.886 L
245.071 104.171 L
242.786 107.423 L
240.5 107.056 L
238.214 108.845 L
235.929 111.63 L
233.643 114.217 L
231.357 115.472 L
229.071 118.678 L
226.786 118.63 L
224.5 119.318 L
222.214 118.707 L
219.929 120.295 L
217.643 120.504 L
215.357 115.641 L
213.071 117.287 L
210.786 116.512 L
208.5 114.244 L
206.214 111.578 L
203.929 107.923 L
201.643 108.685 L
199.357 106.88 L
197.071 103.901 L
194.786 101.538 L
192.5 96.583 L
190.214 88.542 L
187.929 84.33 L
185.643 75.056 L
183.357 72.19 L
181.071 67.524 L
178.786 56.893 L
176.5 62.709 L
174.214 58.492 L
171.929 49.196 L
169.643 63.756 L
167.357 84.286 L
165.071 106.875 L
162.786 134.075 L
160.5 155.458 L
158.214 185.983 L
155.929 208.801 L
153.643 218.238 L
151.357 229.428 L
149.071 227.423 L
146.786 224.936 L
144.5 223.631 L
142.214 222.545 L
139.929 220.716 L
137.643 216.617 L
135.357 212.366 L
133.071 211.132 L
130.786 211.91 L
128.5 210.562 L
126.214 212.735 L
123.929 211.751 L
121.643 210.171 L
119.357 208.733 L
117.071 207.582 L
114.786 204.195 L
112.5 204.78 L
110.214 199.697 L
107.929 198.576 L
105.643 199.122 L
103.357 202.044 L
101.071 200.742 L
98.786 203.219 L
96.5 199.644 L
94.214 200.277 L
91.929 200.651 L
cp
f
GR
GS
[1.00046 0 0 1 0 0] CT
0.98 0.91 0.91 RC
1 LJ
0.5 LW
N
64.5 185.88 M
66.786 187.668 L
69.071 191.133 L
71.357 196.636 L
73.643 197.898 L
75.929 199.757 L
78.214 201.093 L
80.5 204.365 L
82.786 208.456 L
85.071 215.152 L
87.357 214.446 L
89.643 214.789 L
91.929 215.944 L
94.214 215.24 L
96.5 214.155 L
98.786 217.186 L
101.071 214.676 L
103.357 215.703 L
105.643 211.905 L
107.929 210.524 L
110.214 211.099 L
112.5 216.058 L
114.786 215.131 L
117.071 218.511 L
119.357 218.186 L
121.643 219.04 L
123.929 220.155 L
126.214 219.656 L
128.5 216.706 L
130.786 217.529 L
133.071 217.314 L
135.357 217.772 L
137.643 221.599 L
139.929 226.32 L
142.214 228.72 L
144.5 230.63 L
146.786 233.115 L
149.071 236.574 L
151.357 239.673 L
153.643 229.631 L
155.929 220.281 L
158.214 197.928 L
160.5 167.982 L
162.786 146.916 L
165.071 120.494 L
167.357 97.824 L
169.643 77.29 L
171.929 62.233 L
174.214 71.302 L
176.5 75.1 L
178.786 69.287 L
181.071 79.978 L
183.357 85.956 L
185.643 89.058 L
187.929 98.345 L
190.214 103.334 L
192.5 111.387 L
194.786 116.514 L
197.071 118.507 L
199.357 121.438 L
201.643 123.226 L
203.929 122.271 L
206.214 125.964 L
208.5 128.746 L
210.786 131.125 L
213.071 131.968 L
215.357 130.925 L
217.643 135.885 L
219.929 136.748 L
222.214 135.097 L
224.5 135.578 L
226.786 135.157 L
229.071 135.014 L
231.357 131.057 L
233.643 129.797 L
235.929 127.399 L
238.214 125.012 L
240.5 123.453 L
242.786 124.207 L
245.071 121.211 L
247.357 125.121 L
249.643 127.948 L
251.929 130.636 L
254.214 133.468 L
256.5 133.31 L
258.786 132.286 L
261.071 132.986 L
263.357 132.979 L
265.643 131.19 L
267.929 130.266 L
270.214 130.054 L
272.5 131.061 L
274.786 129.04 L
277.071 127.751 L
279.357 129.748 L
281.643 129.895 L
283.929 129.568 L
286.214 129.17 L
288.5 127.876 L
290.786 125.912 L
293.071 125.003 L
295.357 120.224 L
297.643 118.761 L
299.929 123.315 L
302.214 121.631 L
304.5 118.058 L
306.786 117.529 L
309.071 116.54 L
311.357 118.091 L
313.643 116.225 L
315.929 114.272 L
318.214 122.726 L
320.5 136.083 L
322.786 147.196 L
325.071 160.464 L
327.357 170.85 L
329.643 178.09 L
331.929 185.278 L
334.214 190.612 L
336.5 189.93 L
338.786 192.7 L
341.071 194.278 L
343.357 198.975 L
345.643 205.621 L
347.929 209.135 L
350.214 208.109 L
352.5 209.821 L
354.786 209.768 L
357.071 209.866 L
359.357 209.664 L
361.643 205.959 L
363.929 202.102 L
366.214 204.107 L
368.5 202.662 L
370.786 202.887 L
373.071 206.974 L
375.357 205.754 L
377.643 200.925 L
379.929 202.22 L
382.214 198.244 L
384.5 190.691 L
S
GR
GS
[1.00046 0 0 1 0 0] CT
0.98 0.91 0.91 RC
1 LJ
0.5 LW
N
64.5 170.165 M
66.786 171.199 L
69.071 174.959 L
71.357 180.77 L
73.643 182.269 L
75.929 185.256 L
78.214 186.557 L
80.5 189.59 L
82.786 193.801 L
85.071 200.206 L
87.357 199.872 L
89.643 199.832 L
91.929 200.651 L
94.214 200.277 L
96.5 199.644 L
98.786 203.219 L
101.071 200.742 L
103.357 202.044 L
105.643 199.122 L
107.929 198.576 L
110.214 199.697 L
112.5 204.78 L
114.786 204.195 L
117.071 207.582 L
119.357 208.733 L
121.643 210.171 L
123.929 211.751 L
126.214 212.735 L
128.5 210.562 L
130.786 211.91 L
133.071 211.132 L
135.357 212.366 L
137.643 216.617 L
139.929 220.716 L
142.214 222.545 L
144.5 223.631 L
146.786 224.936 L
149.071 227.423 L
151.357 229.428 L
153.643 218.238 L
155.929 208.801 L
158.214 185.983 L
160.5 155.458 L
162.786 134.075 L
165.071 106.875 L
167.357 84.286 L
169.643 63.756 L
171.929 49.196 L
174.214 58.492 L
176.5 62.709 L
178.786 56.893 L
181.071 67.524 L
183.357 72.19 L
185.643 75.056 L
187.929 84.33 L
190.214 88.542 L
192.5 96.583 L
194.786 101.538 L
197.071 103.901 L
199.357 106.88 L
201.643 108.685 L
203.929 107.923 L
206.214 111.578 L
208.5 114.244 L
210.786 116.512 L
213.071 117.287 L
215.357 115.641 L
217.643 120.504 L
219.929 120.295 L
222.214 118.707 L
224.5 119.318 L
226.786 118.63 L
229.071 118.678 L
231.357 115.472 L
233.643 114.217 L
235.929 111.63 L
238.214 108.845 L
240.5 107.056 L
242.786 107.423 L
245.071 104.171 L
247.357 107.886 L
249.643 110.463 L
251.929 113.209 L
254.214 116.156 L
256.5 115.946 L
258.786 114.179 L
261.071 114.459 L
263.357 114.432 L
265.643 112.615 L
267.929 111.612 L
270.214 110.583 L
272.5 111.58 L
274.786 109.957 L
277.071 108.453 L
279.357 110.954 L
281.643 111.015 L
283.929 110.771 L
286.214 110.803 L
288.5 108.915 L
290.786 107.477 L
293.071 106.503 L
295.357 100.931 L
297.643 99.331 L
299.929 103.338 L
302.214 100.829 L
304.5 96.899 L
306.786 93.493 L
309.071 89.652 L
311.357 89.307 L
313.643 86.5 L
315.929 84.436 L
318.214 92.456 L
320.5 107.316 L
322.786 120.146 L
325.071 133.988 L
327.357 143.263 L
329.643 149.679 L
331.929 155.853 L
334.214 160.422 L
336.5 158.582 L
338.786 161.474 L
341.071 162.524 L
343.357 167.166 L
345.643 173.942 L
347.929 178.135 L
350.214 178.074 L
352.5 180.76 L
354.786 181.463 L
357.071 181.979 L
359.357 183.28 L
361.643 180.552 L
363.929 177.709 L
366.214 180.722 L
368.5 180.215 L
370.786 180.545 L
373.071 184.904 L
375.357 183.748 L
377.643 179.115 L
379.929 180.842 L
382.214 177.149 L
384.5 170.368 L
S
GR
GS
[1.00046 0 0 1 0 0] CT
0.961 0.8 0.8 RC
1 LJ
2 LW
N
64.5 178.023 M
66.786 179.433 L
69.071 183.046 L
71.357 188.703 L
73.643 190.084 L
75.929 192.506 L
78.214 193.825 L
80.5 196.978 L
82.786 201.129 L
85.071 207.679 L
87.357 207.159 L
89.643 207.31 L
91.929 208.297 L
94.214 207.759 L
96.5 206.9 L
98.786 210.202 L
101.071 207.709 L
103.357 208.874 L
105.643 205.514 L
107.929 204.55 L
110.214 205.398 L
112.5 210.419 L
114.786 209.663 L
117.071 213.046 L
119.357 213.459 L
121.643 214.606 L
123.929 215.953 L
126.214 216.195 L
128.5 213.634 L
130.786 214.72 L
133.071 214.223 L
135.357 215.069 L
137.643 219.108 L
139.929 223.518 L
142.214 225.633 L
144.5 227.13 L
146.786 229.025 L
149.071 231.999 L
151.357 234.551 L
153.643 223.935 L
155.929 214.541 L
158.214 191.956 L
160.5 161.72 L
162.786 140.495 L
165.071 113.685 L
167.357 91.055 L
169.643 70.523 L
171.929 55.715 L
174.214 64.897 L
176.5 68.905 L
178.786 63.09 L
181.071 73.751 L
183.357 79.073 L
185.643 82.057 L
187.929 91.337 L
190.214 95.938 L
192.5 103.985 L
194.786 109.026 L
197.071 111.204 L
199.357 114.159 L
201.643 115.955 L
203.929 115.097 L
206.214 118.771 L
208.5 121.495 L
210.786 123.819 L
213.071 124.627 L
215.357 123.283 L
217.643 128.194 L
219.929 128.522 L
222.214 126.902 L
224.5 127.448 L
226.786 126.894 L
229.071 126.846 L
231.357 123.265 L
233.643 122.007 L
235.929 119.515 L
238.214 116.928 L
240.5 115.254 L
242.786 115.815 L
245.071 112.691 L
247.357 116.504 L
249.643 119.205 L
251.929 121.923 L
254.214 124.812 L
256.5 124.628 L
258.786 123.233 L
261.071 123.723 L
263.357 123.705 L
265.643 121.902 L
267.929 120.939 L
270.214 120.319 L
272.5 121.321 L
274.786 119.498 L
277.071 118.102 L
279.357 120.351 L
281.643 120.455 L
283.929 120.17 L
286.214 119.987 L
288.5 118.396 L
290.786 116.694 L
293.071 115.753 L
295.357 110.578 L
297.643 109.046 L
299.929 113.326 L
302.214 111.23 L
304.5 107.478 L
306.786 105.511 L
309.071 103.096 L
311.357 103.699 L
313.643 101.363 L
315.929 99.354 L
318.214 107.591 L
320.5 121.699 L
322.786 133.671 L
325.071 147.226 L
327.357 157.057 L
329.643 163.885 L
331.929 170.566 L
334.214 175.517 L
336.5 174.256 L
338.786 177.087 L
341.071 178.401 L
343.357 183.071 L
345.643 189.781 L
347.929 193.635 L
350.214 193.092 L
352.5 195.291 L
354.786 195.615 L
357.071 195.923 L
359.357 196.472 L
361.643 193.256 L
363.929 189.905 L
366.214 192.415 L
368.5 191.438 L
370.786 191.716 L
373.071 195.939 L
375.357 194.751 L
377.643 190.02 L
379.929 191.531 L
382.214 187.697 L
384.5 180.53 L
S
GR
GS
[1.00046 0 0 1 0 0] CT
0.99 0.959 0.959 RC
N
80.5 211.289 M
82.786 213.632 L
85.071 212.788 L
87.357 209.005 L
89.643 206.791 L
91.929 203.89 L
94.214 200.459 L
96.5 197.82 L
98.786 197.16 L
101.071 199.314 L
103.357 199.191 L
105.643 200.246 L
107.929 204.353 L
110.214 206.19 L
112.5 209.249 L
114.786 207.987 L
117.071 210.297 L
119.357 214.943 L
121.643 214.335 L
123.929 212.31 L
126.214 214.482 L
128.5 216.102 L
130.786 222.997 L
133.071 227.1 L
135.357 226.69 L
137.643 228.465 L
139.929 227.34 L
142.214 229.069 L
144.5 229.878 L
146.786 227.55 L
149.071 228.692 L
151.357 225.168 L
153.643 223.299 L
155.929 218.145 L
158.214 196.386 L
160.5 160.569 L
162.786 136.376 L
165.071 111.348 L
167.357 87.544 L
169.643 65.907 L
171.929 54.33 L
174.214 64.892 L
176.5 72.816 L
178.786 74.102 L
181.071 84.4 L
183.357 90.7 L
185.643 93.772 L
187.929 99.422 L
190.214 101.645 L
192.5 102.258 L
194.786 104.57 L
197.071 103.477 L
199.357 105.572 L
201.643 105.567 L
203.929 108.674 L
206.214 112.84 L
208.5 118.26 L
210.786 120.254 L
213.071 120.941 L
215.357 120.058 L
217.643 119.914 L
219.929 119.23 L
222.214 116.63 L
224.5 116.058 L
226.786 118.819 L
229.071 120.296 L
231.357 119.1 L
233.643 119.987 L
235.929 119.434 L
238.214 118.943 L
240.5 120.585 L
242.786 119.102 L
245.071 120.488 L
247.357 121.863 L
249.643 119.065 L
251.929 122.37 L
254.214 120.779 L
256.5 114.801 L
258.786 118.161 L
261.071 119.735 L
263.357 119.481 L
265.643 119.385 L
267.929 117.248 L
270.214 119.665 L
272.5 120.483 L
274.786 118.578 L
277.071 114.715 L
279.357 111.543 L
281.643 111.04 L
283.929 110.976 L
286.214 107.852 L
288.5 107.803 L
290.786 104.999 L
293.071 104.401 L
295.357 103.077 L
297.643 102.242 L
299.929 103.299 L
302.214 98.938 L
304.5 93.223 L
306.786 92.335 L
309.071 95.016 L
311.357 95.939 L
313.643 92.898 L
315.929 91.53 L
318.214 95.673 L
320.5 101.378 L
322.786 103.627 L
325.071 106.445 L
327.357 111.599 L
329.643 118.433 L
331.929 121.911 L
334.214 128.857 L
336.5 131.009 L
338.786 134.028 L
341.071 141.852 L
343.357 145.494 L
345.643 149.187 L
347.929 150 L
350.214 157.889 L
352.5 163.343 L
354.786 166.475 L
357.071 166.179 L
359.357 165.93 L
361.643 168.372 L
363.929 172.486 L
366.214 168.724 L
368.5 171.432 L
370.786 172.128 L
373.071 172.24 L
375.357 173.304 L
377.643 168.765 L
379.929 168.781 L
382.214 166.381 L
384.5 163.261 L
384.5 145.048 L
382.214 149.201 L
379.929 151.796 L
377.643 152.157 L
375.357 156.695 L
373.071 155.479 L
370.786 155.743 L
368.5 155.671 L
366.214 153.285 L
363.929 156.582 L
361.643 152.036 L
359.357 149.52 L
357.071 149.863 L
354.786 149.145 L
352.5 146.081 L
350.214 140.406 L
347.929 132.749 L
345.643 131.909 L
343.357 128.291 L
341.071 124.875 L
338.786 117.356 L
336.5 113.617 L
334.214 111.564 L
331.929 104.953 L
329.643 101.576 L
327.357 94.726 L
325.071 89.191 L
322.786 85.773 L
320.5 82.781 L
318.214 76.494 L
315.929 71.857 L
313.643 74.453 L
311.357 78.43 L
309.071 78.088 L
306.786 76.334 L
304.5 77.692 L
302.214 84.186 L
299.929 89.072 L
297.643 87.872 L
295.357 89.083 L
293.071 90.316 L
290.786 91.375 L
288.5 94.278 L
286.214 93.787 L
283.929 96.358 L
281.643 96.509 L
279.357 96.123 L
277.071 99.309 L
274.786 102.697 L
272.5 104.982 L
270.214 104.402 L
267.929 102.458 L
265.643 104.63 L
263.357 105.16 L
261.071 104.847 L
258.786 103.909 L
256.5 101.16 L
254.214 107.382 L
251.929 108.693 L
249.643 105.273 L
247.357 107.534 L
245.071 106.186 L
242.786 105.029 L
240.5 107.15 L
238.214 106.257 L
235.929 106.902 L
233.643 107.041 L
231.357 105.853 L
229.071 106.613 L
226.786 104.875 L
224.5 101.882 L
222.214 102.745 L
219.929 105.024 L
217.643 105.935 L
215.357 106.662 L
213.071 107.821 L
210.786 107.582 L
208.5 105.228 L
206.214 100.018 L
203.929 95.812 L
201.643 93.085 L
199.357 92.507 L
197.071 90.936 L
194.786 92.071 L
192.5 90.052 L
190.214 88.96 L
187.929 86.854 L
185.643 81.109 L
183.357 78.341 L
181.071 72.226 L
178.786 62.521 L
176.5 60.887 L
174.214 52.571 L
171.929 41.883 L
169.643 52.848 L
167.357 74.779 L
165.071 99.338 L
162.786 124.147 L
160.5 149.083 L
158.214 185.859 L
155.929 208.059 L
153.643 213.917 L
151.357 216.703 L
149.071 220.514 L
146.786 219.886 L
144.5 222.934 L
142.214 222.576 L
139.929 221.393 L
137.643 222.484 L
135.357 220.988 L
133.071 221.184 L
130.786 217.272 L
128.5 209.705 L
126.214 207.682 L
123.929 204.423 L
121.643 205.574 L
119.357 205.23 L
117.071 199.654 L
114.786 196.857 L
112.5 197.501 L
110.214 194.282 L
107.929 192.432 L
105.643 189.229 L
103.357 187.596 L
101.071 187.102 L
98.786 184.244 L
96.5 184.771 L
94.214 187.116 L
91.929 189.984 L
89.643 192.723 L
87.357 195.329 L
85.071 199.201 L
82.786 199.061 L
80.5 196.159 L
78.214 191.611 L
75.929 191.915 L
73.643 185.757 L
71.357 181.557 L
69.071 178.081 L
66.786 179.303 L
64.5 177.166 L
64.5 192.93 L
66.786 195.185 L
69.071 194.501 L
71.357 198.155 L
73.643 201.983 L
75.929 207.384 L
78.214 206.824 L
cp
f
GR
GS
[1.00046 0 0 1 0 0] CT
0.957 0.82 0.82 RC
1 LJ
0.5 LW
N
64.5 192.93 M
66.786 195.185 L
69.071 194.501 L
71.357 198.155 L
73.643 201.983 L
75.929 207.384 L
78.214 206.824 L
80.5 211.289 L
82.786 213.632 L
85.071 212.788 L
87.357 209.005 L
89.643 206.791 L
91.929 203.89 L
94.214 200.459 L
96.5 197.82 L
98.786 197.16 L
101.071 199.314 L
103.357 199.191 L
105.643 200.246 L
107.929 204.353 L
110.214 206.19 L
112.5 209.249 L
114.786 207.987 L
117.071 210.297 L
119.357 214.943 L
121.643 214.335 L
123.929 212.31 L
126.214 214.482 L
128.5 216.102 L
130.786 222.997 L
133.071 227.1 L
135.357 226.69 L
137.643 228.465 L
139.929 227.34 L
142.214 229.069 L
144.5 229.878 L
146.786 227.55 L
149.071 228.692 L
151.357 225.168 L
153.643 223.299 L
155.929 218.145 L
158.214 196.386 L
160.5 160.569 L
162.786 136.376 L
165.071 111.348 L
167.357 87.544 L
169.643 65.907 L
171.929 54.33 L
174.214 64.892 L
176.5 72.816 L
178.786 74.102 L
181.071 84.4 L
183.357 90.7 L
185.643 93.772 L
187.929 99.422 L
190.214 101.645 L
192.5 102.258 L
194.786 104.57 L
197.071 103.477 L
199.357 105.572 L
201.643 105.567 L
203.929 108.674 L
206.214 112.84 L
208.5 118.26 L
210.786 120.254 L
213.071 120.941 L
215.357 120.058 L
217.643 119.914 L
219.929 119.23 L
222.214 116.63 L
224.5 116.058 L
226.786 118.819 L
229.071 120.296 L
231.357 119.1 L
233.643 119.987 L
235.929 119.434 L
238.214 118.943 L
240.5 120.585 L
242.786 119.102 L
245.071 120.488 L
247.357 121.863 L
249.643 119.065 L
251.929 122.37 L
254.214 120.779 L
256.5 114.801 L
258.786 118.161 L
261.071 119.735 L
263.357 119.481 L
265.643 119.385 L
267.929 117.248 L
270.214 119.665 L
272.5 120.483 L
274.786 118.578 L
277.071 114.715 L
279.357 111.543 L
281.643 111.04 L
283.929 110.976 L
286.214 107.852 L
288.5 107.803 L
290.786 104.999 L
293.071 104.401 L
295.357 103.077 L
297.643 102.242 L
299.929 103.299 L
302.214 98.938 L
304.5 93.223 L
306.786 92.335 L
309.071 95.016 L
311.357 95.939 L
313.643 92.898 L
315.929 91.53 L
318.214 95.673 L
320.5 101.378 L
322.786 103.627 L
325.071 106.445 L
327.357 111.599 L
329.643 118.433 L
331.929 121.911 L
334.214 128.857 L
336.5 131.009 L
338.786 134.028 L
341.071 141.852 L
343.357 145.494 L
345.643 149.187 L
347.929 150 L
350.214 157.889 L
352.5 163.343 L
354.786 166.475 L
357.071 166.179 L
359.357 165.93 L
361.643 168.372 L
363.929 172.486 L
366.214 168.724 L
368.5 171.432 L
370.786 172.128 L
373.071 172.24 L
375.357 173.304 L
377.643 168.765 L
379.929 168.781 L
382.214 166.381 L
384.5 163.261 L
S
GR
GS
[1.00046 0 0 1 0 0] CT
0.957 0.82 0.82 RC
1 LJ
0.5 LW
N
64.5 177.166 M
66.786 179.303 L
69.071 178.081 L
71.357 181.557 L
73.643 185.757 L
75.929 191.915 L
78.214 191.611 L
80.5 196.159 L
82.786 199.061 L
85.071 199.201 L
87.357 195.329 L
89.643 192.723 L
91.929 189.984 L
94.214 187.116 L
96.5 184.771 L
98.786 184.244 L
101.071 187.102 L
103.357 187.596 L
105.643 189.229 L
107.929 192.432 L
110.214 194.282 L
112.5 197.501 L
114.786 196.857 L
117.071 199.654 L
119.357 205.23 L
121.643 205.574 L
123.929 204.423 L
126.214 207.682 L
128.5 209.705 L
130.786 217.272 L
133.071 221.184 L
135.357 220.988 L
137.643 222.484 L
139.929 221.393 L
142.214 222.576 L
144.5 222.934 L
146.786 219.886 L
149.071 220.514 L
151.357 216.703 L
153.643 213.917 L
155.929 208.059 L
158.214 185.859 L
160.5 149.083 L
162.786 124.147 L
165.071 99.338 L
167.357 74.779 L
169.643 52.848 L
171.929 41.883 L
174.214 52.571 L
176.5 60.887 L
178.786 62.521 L
181.071 72.226 L
183.357 78.341 L
185.643 81.109 L
187.929 86.854 L
190.214 88.96 L
192.5 90.052 L
194.786 92.071 L
197.071 90.936 L
199.357 92.507 L
201.643 93.085 L
203.929 95.812 L
206.214 100.018 L
208.5 105.228 L
210.786 107.582 L
213.071 107.821 L
215.357 106.662 L
217.643 105.935 L
219.929 105.024 L
222.214 102.745 L
224.5 101.882 L
226.786 104.875 L
229.071 106.613 L
231.357 105.853 L
233.643 107.041 L
235.929 106.902 L
238.214 106.257 L
240.5 107.15 L
242.786 105.029 L
245.071 106.186 L
247.357 107.534 L
249.643 105.273 L
251.929 108.693 L
254.214 107.382 L
256.5 101.16 L
258.786 103.909 L
261.071 104.847 L
263.357 105.16 L
265.643 104.63 L
267.929 102.458 L
270.214 104.402 L
272.5 104.982 L
274.786 102.697 L
277.071 99.309 L
279.357 96.123 L
281.643 96.509 L
283.929 96.358 L
286.214 93.787 L
288.5 94.278 L
290.786 91.375 L
293.071 90.316 L
295.357 89.083 L
297.643 87.872 L
299.929 89.072 L
302.214 84.186 L
304.5 77.692 L
306.786 76.334 L
309.071 78.088 L
311.357 78.43 L
313.643 74.453 L
315.929 71.857 L
318.214 76.494 L
320.5 82.781 L
322.786 85.773 L
325.071 89.191 L
327.357 94.726 L
329.643 101.576 L
331.929 104.953 L
334.214 111.564 L
336.5 113.617 L
338.786 117.356 L
341.071 124.875 L
343.357 128.291 L
345.643 131.909 L
347.929 132.749 L
350.214 140.406 L
352.5 146.081 L
354.786 149.145 L
357.071 149.863 L
359.357 149.52 L
361.643 152.036 L
363.929 156.582 L
366.214 153.285 L
368.5 155.671 L
370.786 155.743 L
373.071 155.479 L
375.357 156.695 L
377.643 152.157 L
379.929 151.796 L
382.214 149.201 L
384.5 145.048 L
S
GR
GS
[1.00046 0 0 1 0 0] CT
0.898 0.6 0.6 RC
1 LJ
2 LW
N
64.5 185.048 M
66.786 187.244 L
69.071 186.291 L
71.357 189.856 L
73.643 193.87 L
75.929 199.649 L
78.214 199.217 L
80.5 203.724 L
82.786 206.347 L
85.071 205.995 L
87.357 202.167 L
89.643 199.757 L
91.929 196.937 L
94.214 193.787 L
96.5 191.296 L
98.786 190.702 L
101.071 193.208 L
103.357 193.394 L
105.643 194.737 L
107.929 198.392 L
110.214 200.236 L
112.5 203.375 L
114.786 202.422 L
117.071 204.975 L
119.357 210.086 L
121.643 209.955 L
123.929 208.366 L
126.214 211.082 L
128.5 212.904 L
130.786 220.135 L
133.071 224.142 L
135.357 223.839 L
137.643 225.475 L
139.929 224.367 L
142.214 225.822 L
144.5 226.406 L
146.786 223.718 L
149.071 224.603 L
151.357 220.936 L
153.643 218.608 L
155.929 213.102 L
158.214 191.123 L
160.5 154.826 L
162.786 130.261 L
165.071 105.343 L
167.357 81.161 L
169.643 59.378 L
171.929 48.106 L
174.214 58.732 L
176.5 66.852 L
178.786 68.311 L
181.071 78.313 L
183.357 84.521 L
185.643 87.441 L
187.929 93.138 L
190.214 95.302 L
192.5 96.155 L
194.786 98.321 L
197.071 97.206 L
199.357 99.04 L
201.643 99.326 L
203.929 102.243 L
206.214 106.429 L
208.5 111.744 L
210.786 113.918 L
213.071 114.381 L
215.357 113.36 L
217.643 112.925 L
219.929 112.127 L
222.214 109.687 L
224.5 108.97 L
226.786 111.847 L
229.071 113.454 L
231.357 112.477 L
233.643 113.514 L
235.929 113.168 L
238.214 112.6 L
240.5 113.867 L
242.786 112.066 L
245.071 113.337 L
247.357 114.699 L
249.643 112.169 L
251.929 115.531 L
254.214 114.081 L
256.5 107.98 L
258.786 111.035 L
261.071 112.291 L
263.357 112.321 L
265.643 112.007 L
267.929 109.853 L
270.214 112.034 L
272.5 112.733 L
274.786 110.637 L
277.071 107.012 L
279.357 103.833 L
281.643 103.775 L
283.929 103.667 L
286.214 100.819 L
288.5 101.041 L
290.786 98.187 L
293.071 97.359 L
295.357 96.08 L
297.643 95.057 L
299.929 96.186 L
302.214 91.562 L
304.5 85.458 L
306.786 84.335 L
309.071 86.552 L
311.357 87.184 L
313.643 83.676 L
315.929 81.693 L
318.214 86.084 L
320.5 92.079 L
322.786 94.7 L
325.071 97.818 L
327.357 103.163 L
329.643 110.004 L
331.929 113.432 L
334.214 120.21 L
336.5 122.313 L
338.786 125.692 L
341.071 133.363 L
343.357 136.892 L
345.643 140.548 L
347.929 141.374 L
350.214 149.148 L
352.5 154.712 L
354.786 157.81 L
357.071 158.021 L
359.357 157.725 L
361.643 160.204 L
363.929 164.534 L
366.214 161.005 L
368.5 163.552 L
370.786 163.935 L
373.071 163.859 L
375.357 164.999 L
377.643 160.461 L
379.929 160.289 L
382.214 157.791 L
384.5 154.155 L
S
GR
GS
[1.00046 0 0 1 0 0] CT
0.98 0.939 0.939 RC
N
80.5 181.592 M
78.214 176.124 L
75.929 171.772 L
73.643 167.009 L
71.357 164.543 L
69.071 159.39 L
66.786 157.311 L
64.5 154.6 L
64.5 167.354 L
66.786 170.588 L
69.071 172.587 L
71.357 178.183 L
73.643 180.744 L
75.929 184.947 L
78.214 188.872 L
80.5 194.358 L
82.786 196.856 L
85.071 200.206 L
87.357 198.931 L
89.643 200.51 L
91.929 198.269 L
94.214 196.803 L
96.5 199.375 L
98.786 199.396 L
101.071 195.677 L
103.357 198.931 L
105.643 200.446 L
107.929 197.834 L
110.214 197.962 L
112.5 201.677 L
114.786 199.432 L
117.071 202.402 L
119.357 204.331 L
121.643 204.491 L
123.929 210.003 L
126.214 211.337 L
128.5 213.777 L
130.786 223.253 L
133.071 227.042 L
135.357 230.397 L
137.643 234.547 L
139.929 230.665 L
142.214 232.828 L
144.5 231.473 L
146.786 229.772 L
149.071 226.488 L
151.357 225.055 L
153.643 217.844 L
155.929 216.12 L
158.214 192.62 L
160.5 159.724 L
162.786 141.332 L
165.071 117.721 L
167.357 93.235 L
169.643 69.248 L
171.929 56.33 L
174.214 70.625 L
176.5 78.677 L
178.786 75.487 L
181.071 85.334 L
183.357 86.303 L
185.643 92.025 L
187.929 96.552 L
190.214 101.336 L
192.5 101.277 L
194.786 104.17 L
197.071 103.342 L
199.357 106.219 L
201.643 110.347 L
203.929 116.025 L
206.214 118.384 L
208.5 123.992 L
210.786 122.743 L
213.071 123.188 L
215.357 124.515 L
217.643 123.799 L
219.929 122.994 L
222.214 121.601 L
224.5 118.159 L
226.786 121.561 L
229.071 120.32 L
231.357 119.639 L
233.643 123.64 L
235.929 121.799 L
238.214 123.735 L
240.5 125.108 L
242.786 123.817 L
245.071 125.654 L
247.357 120.291 L
249.643 116.02 L
251.929 117.033 L
254.214 119.741 L
256.5 117.795 L
258.786 117.049 L
261.071 116.035 L
263.357 121.667 L
265.643 122.065 L
267.929 118.378 L
270.214 114.483 L
272.5 118.361 L
274.786 118.654 L
277.071 114.898 L
279.357 107.82 L
281.643 103.507 L
283.929 101.837 L
286.214 100.565 L
288.5 98.19 L
290.786 92.278 L
293.071 86.592 L
295.357 87.174 L
297.643 89.166 L
299.929 92.299 L
302.214 88.216 L
304.5 83.442 L
306.786 81.184 L
309.071 84.383 L
311.357 77.57 L
313.643 66.382 L
315.929 61.294 L
318.214 62.793 L
320.5 63.362 L
322.786 68.235 L
325.071 73.104 L
327.357 80.822 L
329.643 94.515 L
331.929 101.79 L
334.214 110.903 L
336.5 121.055 L
338.786 128.465 L
341.071 128.54 L
343.357 129.993 L
345.643 129.358 L
347.929 130.026 L
350.214 126.856 L
352.5 127.3 L
354.786 125.728 L
357.071 131.092 L
359.357 137.705 L
361.643 140.92 L
363.929 144.609 L
366.214 150.498 L
368.5 152.038 L
370.786 155.096 L
373.071 151.91 L
375.357 153.868 L
377.643 152.25 L
379.929 153.244 L
382.214 152.988 L
384.5 151.024 L
384.5 132.731 L
382.214 134.554 L
379.929 135.429 L
377.643 134.603 L
375.357 136.112 L
373.071 134.185 L
370.786 137.749 L
368.5 134.757 L
366.214 133.305 L
363.929 127.325 L
361.643 122.943 L
359.357 120.895 L
357.071 113.83 L
354.786 107.554 L
352.5 108.719 L
350.214 108.208 L
347.929 110.01 L
345.643 109.771 L
343.357 111.373 L
341.071 110.105 L
338.786 110.256 L
336.5 103.04 L
334.214 93.027 L
331.929 84.171 L
329.643 75.73 L
327.357 60.367 L
325.071 52.842 L
322.786 49.017 L
320.5 45.239 L
318.214 44.817 L
315.929 44.112 L
313.643 49.737 L
311.357 61.38 L
309.071 68.931 L
306.786 66.156 L
304.5 68.245 L
302.214 73.025 L
299.929 77.12 L
297.643 74.473 L
295.357 72.632 L
293.071 71.544 L
290.786 77.558 L
288.5 83.748 L
286.214 86.853 L
283.929 87.893 L
281.643 89.02 L
279.357 93.295 L
277.071 100.667 L
274.786 104.123 L
272.5 103.561 L
270.214 99.329 L
267.929 103.894 L
265.643 107.58 L
263.357 108.028 L
261.071 102.068 L
258.786 103.627 L
256.5 104.552 L
254.214 106.96 L
251.929 104.403 L
249.643 103.239 L
247.357 107.057 L
245.071 112.694 L
242.786 110.595 L
240.5 112.126 L
238.214 110.625 L
235.929 108.839 L
233.643 110.043 L
231.357 105.105 L
229.071 104.827 L
226.786 106.059 L
224.5 102.648 L
222.214 106.278 L
219.929 108.055 L
217.643 109.338 L
215.357 111.029 L
213.071 109.378 L
210.786 108.847 L
208.5 110.518 L
206.214 105.113 L
203.929 102.564 L
201.643 97.017 L
199.357 92.045 L
197.071 89.44 L
194.786 90.422 L
192.5 87.528 L
190.214 87.333 L
187.929 83.221 L
185.643 78.98 L
183.357 73.623 L
181.071 73.04 L
178.786 63.842 L
176.5 67.136 L
174.214 59.68 L
171.929 45.521 L
169.643 58.476 L
167.357 82.741 L
165.071 107 L
162.786 130.649 L
160.5 149.257 L
158.214 182.185 L
155.929 206.108 L
153.643 208.384 L
151.357 215.492 L
149.071 216.988 L
146.786 222.057 L
144.5 224.448 L
142.214 226.429 L
139.929 224.895 L
137.643 228.716 L
135.357 224.548 L
133.071 221.581 L
130.786 218.407 L
128.5 207.275 L
126.214 203.81 L
123.929 201.349 L
121.643 195.047 L
119.357 193.777 L
117.071 191.14 L
114.786 187.756 L
112.5 189.414 L
110.214 185.569 L
107.929 184.708 L
105.643 187.297 L
103.357 185.768 L
101.071 182.553 L
98.786 185.439 L
96.5 185.046 L
94.214 182.068 L
91.929 184.082 L
89.643 186.486 L
87.357 185.646 L
85.071 186.959 L
82.786 183.729 L
cp
f
GR
GS
[1.00046 0 0 1 0 0] CT
0.91 0.729 0.729 RC
1 LJ
0.5 LW
N
64.5 167.354 M
66.786 170.588 L
69.071 172.587 L
71.357 178.183 L
73.643 180.744 L
75.929 184.947 L
78.214 188.872 L
80.5 194.358 L
82.786 196.856 L
85.071 200.206 L
87.357 198.931 L
89.643 200.51 L
91.929 198.269 L
94.214 196.803 L
96.5 199.375 L
98.786 199.396 L
101.071 195.677 L
103.357 198.931 L
105.643 200.446 L
107.929 197.834 L
110.214 197.962 L
112.5 201.677 L
114.786 199.432 L
117.071 202.402 L
119.357 204.331 L
121.643 204.491 L
123.929 210.003 L
126.214 211.337 L
128.5 213.777 L
130.786 223.253 L
133.071 227.042 L
135.357 230.397 L
137.643 234.547 L
139.929 230.665 L
142.214 232.828 L
144.5 231.473 L
146.786 229.772 L
149.071 226.488 L
151.357 225.055 L
153.643 217.844 L
155.929 216.12 L
158.214 192.62 L
160.5 159.724 L
162.786 141.332 L
165.071 117.721 L
167.357 93.235 L
169.643 69.248 L
171.929 56.33 L
174.214 70.625 L
176.5 78.677 L
178.786 75.487 L
181.071 85.334 L
183.357 86.303 L
185.643 92.025 L
187.929 96.552 L
190.214 101.336 L
192.5 101.277 L
194.786 104.17 L
197.071 103.342 L
199.357 106.219 L
201.643 110.347 L
203.929 116.025 L
206.214 118.384 L
208.5 123.992 L
210.786 122.743 L
213.071 123.188 L
215.357 124.515 L
217.643 123.799 L
219.929 122.994 L
222.214 121.601 L
224.5 118.159 L
226.786 121.561 L
229.071 120.32 L
231.357 119.639 L
233.643 123.64 L
235.929 121.799 L
238.214 123.735 L
240.5 125.108 L
242.786 123.817 L
245.071 125.654 L
247.357 120.291 L
249.643 116.02 L
251.929 117.033 L
254.214 119.741 L
256.5 117.795 L
258.786 117.049 L
261.071 116.035 L
263.357 121.667 L
265.643 122.065 L
267.929 118.378 L
270.214 114.483 L
272.5 118.361 L
274.786 118.654 L
277.071 114.898 L
279.357 107.82 L
281.643 103.507 L
283.929 101.837 L
286.214 100.565 L
288.5 98.19 L
290.786 92.278 L
293.071 86.592 L
295.357 87.174 L
297.643 89.166 L
299.929 92.299 L
302.214 88.216 L
304.5 83.442 L
306.786 81.184 L
309.071 84.383 L
311.357 77.57 L
313.643 66.382 L
315.929 61.294 L
318.214 62.793 L
320.5 63.362 L
322.786 68.235 L
325.071 73.104 L
327.357 80.822 L
329.643 94.515 L
331.929 101.79 L
334.214 110.903 L
336.5 121.055 L
338.786 128.465 L
341.071 128.54 L
343.357 129.993 L
345.643 129.358 L
347.929 130.026 L
350.214 126.856 L
352.5 127.3 L
354.786 125.728 L
357.071 131.092 L
359.357 137.705 L
361.643 140.92 L
363.929 144.609 L
366.214 150.498 L
368.5 152.038 L
370.786 155.096 L
373.071 151.91 L
375.357 153.868 L
377.643 152.25 L
379.929 153.244 L
382.214 152.988 L
384.5 151.024 L
S
GR
GS
[1.00046 0 0 1 0 0] CT
0.91 0.729 0.729 RC
1 LJ
0.5 LW
N
64.5 154.6 M
66.786 157.311 L
69.071 159.39 L
71.357 164.543 L
73.643 167.009 L
75.929 171.772 L
78.214 176.124 L
80.5 181.592 L
82.786 183.729 L
85.071 186.959 L
87.357 185.646 L
89.643 186.486 L
91.929 184.082 L
94.214 182.068 L
96.5 185.046 L
98.786 185.439 L
101.071 182.553 L
103.357 185.768 L
105.643 187.297 L
107.929 184.708 L
110.214 185.569 L
112.5 189.414 L
114.786 187.756 L
117.071 191.14 L
119.357 193.777 L
121.643 195.047 L
123.929 201.349 L
126.214 203.81 L
128.5 207.275 L
130.786 218.407 L
133.071 221.581 L
135.357 224.548 L
137.643 228.716 L
139.929 224.895 L
142.214 226.429 L
144.5 224.448 L
146.786 222.057 L
149.071 216.988 L
151.357 215.492 L
153.643 208.384 L
155.929 206.108 L
158.214 182.185 L
160.5 149.257 L
162.786 130.649 L
165.071 107 L
167.357 82.741 L
169.643 58.476 L
171.929 45.521 L
174.214 59.68 L
176.5 67.136 L
178.786 63.842 L
181.071 73.04 L
183.357 73.623 L
185.643 78.98 L
187.929 83.221 L
190.214 87.333 L
192.5 87.528 L
194.786 90.422 L
197.071 89.44 L
199.357 92.045 L
201.643 97.017 L
203.929 102.564 L
206.214 105.113 L
208.5 110.518 L
210.786 108.847 L
213.071 109.378 L
215.357 111.029 L
217.643 109.338 L
219.929 108.055 L
222.214 106.278 L
224.5 102.648 L
226.786 106.059 L
229.071 104.827 L
231.357 105.105 L
233.643 110.043 L
235.929 108.839 L
238.214 110.625 L
240.5 112.126 L
242.786 110.595 L
245.071 112.694 L
247.357 107.057 L
249.643 103.239 L
251.929 104.403 L
254.214 106.96 L
256.5 104.552 L
258.786 103.627 L
261.071 102.068 L
263.357 108.028 L
265.643 107.58 L
267.929 103.894 L
270.214 99.329 L
272.5 103.561 L
274.786 104.123 L
277.071 100.667 L
279.357 93.295 L
281.643 89.02 L
283.929 87.893 L
286.214 86.853 L
288.5 83.748 L
290.786 77.558 L
293.071 71.544 L
295.357 72.632 L
297.643 74.473 L
299.929 77.12 L
302.214 73.025 L
304.5 68.245 L
306.786 66.156 L
309.071 68.931 L
311.357 61.38 L
313.643 49.737 L
315.929 44.112 L
318.214 44.817 L
320.5 45.239 L
322.786 49.017 L
325.071 52.842 L
327.357 60.367 L
329.643 75.73 L
331.929 84.171 L
334.214 93.027 L
336.5 103.04 L
338.786 110.256 L
341.071 110.105 L
343.357 111.373 L
345.643 109.771 L
347.929 110.01 L
350.214 108.208 L
352.5 108.719 L
354.786 107.554 L
357.071 113.83 L
359.357 120.895 L
361.643 122.943 L
363.929 127.325 L
366.214 133.305 L
368.5 134.757 L
370.786 137.749 L
373.071 134.185 L
375.357 136.112 L
377.643 134.603 L
379.929 135.429 L
382.214 134.554 L
384.5 132.731 L
S
GR
GS
[1.00046 0 0 1 0 0] CT
0.8 0.4 0.4 RC
1 LJ
2 LW
N
64.5 160.977 M
66.786 163.95 L
69.071 165.989 L
71.357 171.363 L
73.643 173.876 L
75.929 178.359 L
78.214 182.498 L
80.5 187.975 L
82.786 190.292 L
85.071 193.582 L
87.357 192.289 L
89.643 193.498 L
91.929 191.176 L
94.214 189.435 L
96.5 192.211 L
98.786 192.417 L
101.071 189.115 L
103.357 192.349 L
105.643 193.872 L
107.929 191.271 L
110.214 191.765 L
112.5 195.545 L
114.786 193.594 L
117.071 196.771 L
119.357 199.054 L
121.643 199.769 L
123.929 205.676 L
126.214 207.574 L
128.5 210.526 L
130.786 220.83 L
133.071 224.311 L
135.357 227.473 L
137.643 231.632 L
139.929 227.78 L
142.214 229.629 L
144.5 227.961 L
146.786 225.914 L
149.071 221.738 L
151.357 220.273 L
153.643 213.114 L
155.929 211.114 L
158.214 187.403 L
160.5 154.491 L
162.786 135.99 L
165.071 112.36 L
167.357 87.988 L
169.643 63.862 L
171.929 50.926 L
174.214 65.153 L
176.5 72.907 L
178.786 69.665 L
181.071 79.187 L
183.357 79.963 L
185.643 85.503 L
187.929 89.886 L
190.214 94.335 L
192.5 94.403 L
194.786 97.296 L
197.071 96.391 L
199.357 99.132 L
201.643 103.682 L
203.929 109.294 L
206.214 111.748 L
208.5 117.255 L
210.786 115.795 L
213.071 116.283 L
215.357 117.772 L
217.643 116.568 L
219.929 115.524 L
222.214 113.939 L
224.5 110.404 L
226.786 113.81 L
229.071 112.573 L
231.357 112.372 L
233.643 116.842 L
235.929 115.319 L
238.214 117.18 L
240.5 118.617 L
242.786 117.206 L
245.071 119.174 L
247.357 113.674 L
249.643 109.63 L
251.929 110.718 L
254.214 113.35 L
256.5 111.173 L
258.786 110.338 L
261.071 109.052 L
263.357 114.847 L
265.643 114.823 L
267.929 111.136 L
270.214 106.906 L
272.5 110.961 L
274.786 111.389 L
277.071 107.782 L
279.357 100.558 L
281.643 96.263 L
283.929 94.865 L
286.214 93.709 L
288.5 90.969 L
290.786 84.918 L
293.071 79.068 L
295.357 79.903 L
297.643 81.819 L
299.929 84.71 L
302.214 80.621 L
304.5 75.844 L
306.786 73.67 L
309.071 76.657 L
311.357 69.475 L
313.643 58.06 L
315.929 52.703 L
318.214 53.805 L
320.5 54.301 L
322.786 58.626 L
325.071 62.973 L
327.357 70.594 L
329.643 85.122 L
331.929 92.981 L
334.214 101.965 L
336.5 112.048 L
338.786 119.36 L
341.071 119.322 L
343.357 120.683 L
345.643 119.565 L
347.929 120.018 L
350.214 117.532 L
352.5 118.01 L
354.786 116.641 L
357.071 122.461 L
359.357 129.3 L
361.643 131.932 L
363.929 135.967 L
366.214 141.901 L
368.5 143.398 L
370.786 146.422 L
373.071 143.048 L
375.357 144.99 L
377.643 143.426 L
379.929 144.336 L
382.214 143.771 L
384.5 141.878 L
S
GR
GS
[1.00046 0 0 1 0 0] CT
0.959 0.918 0.918 RC
N
87.357 199.59 M
89.643 203.663 L
91.929 204.255 L
94.214 208.486 L
96.5 209.442 L
98.786 211.512 L
101.071 215.567 L
103.357 218.076 L
105.643 215.761 L
107.929 215.854 L
110.214 215.138 L
112.5 213.775 L
114.786 212.814 L
117.071 212.989 L
119.357 211.765 L
121.643 215.136 L
123.929 217.832 L
126.214 215.528 L
128.5 216.678 L
130.786 218.254 L
133.071 218.661 L
135.357 225.21 L
137.643 224.434 L
139.929 223.458 L
142.214 229.075 L
144.5 233.186 L
146.786 233.101 L
149.071 234.584 L
151.357 234.757 L
153.643 230.318 L
155.929 226.413 L
158.214 203.902 L
160.5 172.991 L
162.786 156.369 L
165.071 137.907 L
167.357 119.859 L
169.643 97.701 L
171.929 85.772 L
174.214 95.564 L
176.5 103.268 L
178.786 102.593 L
181.071 107.969 L
183.357 108.056 L
185.643 114.404 L
187.929 117.642 L
190.214 122.046 L
192.5 125.045 L
194.786 127.114 L
197.071 126.931 L
199.357 131.075 L
201.643 134.959 L
203.929 140.794 L
206.214 142.565 L
208.5 145.053 L
210.786 144.824 L
213.071 148.603 L
215.357 150.443 L
217.643 147.349 L
219.929 143.743 L
222.214 143.385 L
224.5 141.305 L
226.786 141.439 L
229.071 138.675 L
231.357 136.932 L
233.643 138.59 L
235.929 139.125 L
238.214 138.177 L
240.5 139.312 L
242.786 142.65 L
245.071 138.076 L
247.357 138.717 L
249.643 138.257 L
251.929 137.704 L
254.214 136.744 L
256.5 136.816 L
258.786 132.79 L
261.071 131.939 L
263.357 129.026 L
265.643 124.249 L
267.929 119.022 L
270.214 117.427 L
272.5 118.715 L
274.786 119.058 L
277.071 123.586 L
279.357 124.515 L
281.643 123.161 L
283.929 124.029 L
286.214 121.8 L
288.5 117.933 L
290.786 117.261 L
293.071 113.77 L
295.357 109.278 L
297.643 109.443 L
299.929 109.984 L
302.214 109.3 L
304.5 101.674 L
306.786 99.566 L
309.071 96.897 L
311.357 95.777 L
313.643 88.467 L
315.929 87.77 L
318.214 86.842 L
320.5 87.433 L
322.786 85.085 L
325.071 87.473 L
327.357 89.408 L
329.643 97.784 L
331.929 102.824 L
334.214 110.372 L
336.5 114.218 L
338.786 121.11 L
341.071 123.614 L
343.357 126.858 L
345.643 130.428 L
347.929 136.169 L
350.214 139.499 L
352.5 143.264 L
354.786 147.041 L
357.071 149.432 L
359.357 154.494 L
361.643 157.217 L
363.929 161.687 L
366.214 165.309 L
368.5 169.353 L
370.786 174.51 L
373.071 176.495 L
375.357 170.754 L
377.643 174.063 L
379.929 174.378 L
382.214 172.245 L
384.5 167.463 L
384.5 149.11 L
382.214 153.644 L
379.929 155.37 L
377.643 154.291 L
375.357 150.736 L
373.071 155.878 L
370.786 154.308 L
368.5 148.925 L
366.214 144.532 L
363.929 140.048 L
361.643 135.416 L
359.357 131.039 L
357.071 125.288 L
354.786 122.383 L
352.5 118.075 L
350.214 112.981 L
347.929 109.978 L
345.643 103.095 L
343.357 99.313 L
341.071 97.038 L
338.786 95.23 L
336.5 88.808 L
334.214 86.113 L
331.929 79.398 L
329.643 75.603 L
327.357 68.542 L
325.071 66.397 L
322.786 62.804 L
320.5 63.531 L
318.214 61.135 L
315.929 61.186 L
313.643 62.709 L
311.357 71.362 L
309.071 73.567 L
306.786 77.596 L
304.5 81.06 L
302.214 89.262 L
299.929 90.917 L
297.643 90.719 L
295.357 90.752 L
293.071 95.614 L
290.786 98.35 L
288.5 98.948 L
286.214 102.637 L
283.929 104.135 L
281.643 103.38 L
279.357 104.995 L
277.071 104.228 L
274.786 100.238 L
272.5 99.807 L
270.214 97.848 L
267.929 99.923 L
265.643 104.74 L
263.357 109.135 L
261.071 112.358 L
258.786 113.962 L
256.5 118.613 L
254.214 119.23 L
251.929 120.694 L
249.643 121.677 L
247.357 122.743 L
245.071 122.051 L
242.786 126.738 L
240.5 124.008 L
238.214 123.48 L
235.929 124.691 L
233.643 124.097 L
231.357 121.966 L
229.071 123.025 L
226.786 125.726 L
224.5 125.821 L
222.214 127.938 L
219.929 128.014 L
217.643 131.503 L
215.357 133.993 L
213.071 133.122 L
210.786 129.253 L
208.5 130.127 L
206.214 127.683 L
203.929 126.526 L
201.643 120.13 L
199.357 116.463 L
197.071 112.726 L
194.786 112.877 L
192.5 110.158 L
190.214 107.354 L
187.929 103.882 L
185.643 101.033 L
183.357 94.586 L
181.071 95.036 L
178.786 90.389 L
176.5 92.097 L
174.214 84.464 L
171.929 74.228 L
169.643 85.941 L
167.357 108.423 L
165.071 126.823 L
162.786 144.65 L
160.5 161.629 L
158.214 193.133 L
155.929 215.884 L
153.643 220.172 L
151.357 225.311 L
149.071 225.44 L
146.786 224.746 L
144.5 226.356 L
142.214 223.305 L
139.929 217.996 L
137.643 218.7 L
135.357 219.006 L
133.071 212.644 L
130.786 212.896 L
128.5 210.566 L
126.214 208.283 L
123.929 209.901 L
121.643 206.65 L
119.357 202.263 L
117.071 202.709 L
114.786 201.837 L
112.5 201.615 L
110.214 201.815 L
107.929 201.772 L
105.643 201.744 L
103.357 204.502 L
101.071 201.673 L
98.786 197.819 L
96.5 195.955 L
94.214 195.185 L
91.929 189.279 L
89.643 188.4 L
87.357 184.296 L
85.071 180.224 L
82.786 176.943 L
80.5 175.76 L
78.214 165.136 L
75.929 162.123 L
73.643 155.124 L
71.357 155.926 L
69.071 152.734 L
66.786 153.905 L
64.5 152.78 L
64.5 169.124 L
66.786 170.335 L
69.071 168.804 L
71.357 171.51 L
73.643 171.141 L
75.929 177.427 L
78.214 179.686 L
80.5 189.944 L
82.786 191.379 L
85.071 195.148 L
cp
f
GR
GS
[1.00046 0 0 1 0 0] CT
0.82 0.639 0.639 RC
1 LJ
0.5 LW
N
64.5 169.124 M
66.786 170.335 L
69.071 168.804 L
71.357 171.51 L
73.643 171.141 L
75.929 177.427 L
78.214 179.686 L
80.5 189.944 L
82.786 191.379 L
85.071 195.148 L
87.357 199.59 L
89.643 203.663 L
91.929 204.255 L
94.214 208.486 L
96.5 209.442 L
98.786 211.512 L
101.071 215.567 L
103.357 218.076 L
105.643 215.761 L
107.929 215.854 L
110.214 215.138 L
112.5 213.775 L
114.786 212.814 L
117.071 212.989 L
119.357 211.765 L
121.643 215.136 L
123.929 217.832 L
126.214 215.528 L
128.5 216.678 L
130.786 218.254 L
133.071 218.661 L
135.357 225.21 L
137.643 224.434 L
139.929 223.458 L
142.214 229.075 L
144.5 233.186 L
146.786 233.101 L
149.071 234.584 L
151.357 234.757 L
153.643 230.318 L
155.929 226.413 L
158.214 203.902 L
160.5 172.991 L
162.786 156.369 L
165.071 137.907 L
167.357 119.859 L
169.643 97.701 L
171.929 85.772 L
174.214 95.564 L
176.5 103.268 L
178.786 102.593 L
181.071 107.969 L
183.357 108.056 L
185.643 114.404 L
187.929 117.642 L
190.214 122.046 L
192.5 125.045 L
194.786 127.114 L
197.071 126.931 L
199.357 131.075 L
201.643 134.959 L
203.929 140.794 L
206.214 142.565 L
208.5 145.053 L
210.786 144.824 L
213.071 148.603 L
215.357 150.443 L
217.643 147.349 L
219.929 143.743 L
222.214 143.385 L
224.5 141.305 L
226.786 141.439 L
229.071 138.675 L
231.357 136.932 L
233.643 138.59 L
235.929 139.125 L
238.214 138.177 L
240.5 139.312 L
242.786 142.65 L
245.071 138.076 L
247.357 138.717 L
249.643 138.257 L
251.929 137.704 L
254.214 136.744 L
256.5 136.816 L
258.786 132.79 L
261.071 131.939 L
263.357 129.026 L
265.643 124.249 L
267.929 119.022 L
270.214 117.427 L
272.5 118.715 L
274.786 119.058 L
277.071 123.586 L
279.357 124.515 L
281.643 123.161 L
283.929 124.029 L
286.214 121.8 L
288.5 117.933 L
290.786 117.261 L
293.071 113.77 L
295.357 109.278 L
297.643 109.443 L
299.929 109.984 L
302.214 109.3 L
304.5 101.674 L
306.786 99.566 L
309.071 96.897 L
311.357 95.777 L
313.643 88.467 L
315.929 87.77 L
318.214 86.842 L
320.5 87.433 L
322.786 85.085 L
325.071 87.473 L
327.357 89.408 L
329.643 97.784 L
331.929 102.824 L
334.214 110.372 L
336.5 114.218 L
338.786 121.11 L
341.071 123.614 L
343.357 126.858 L
345.643 130.428 L
347.929 136.169 L
350.214 139.499 L
352.5 143.264 L
354.786 147.041 L
357.071 149.432 L
359.357 154.494 L
361.643 157.217 L
363.929 161.687 L
366.214 165.309 L
368.5 169.353 L
370.786 174.51 L
373.071 176.495 L
375.357 170.754 L
377.643 174.063 L
379.929 174.378 L
382.214 172.245 L
384.5 167.463 L
S
GR
GS
[1.00046 0 0 1 0 0] CT
0.82 0.639 0.639 RC
1 LJ
0.5 LW
N
64.5 152.78 M
66.786 153.905 L
69.071 152.734 L
71.357 155.926 L
73.643 155.124 L
75.929 162.123 L
78.214 165.136 L
80.5 175.76 L
82.786 176.943 L
85.071 180.224 L
87.357 184.296 L
89.643 188.4 L
91.929 189.279 L
94.214 195.185 L
96.5 195.955 L
98.786 197.819 L
101.071 201.673 L
103.357 204.502 L
105.643 201.744 L
107.929 201.772 L
110.214 201.815 L
112.5 201.615 L
114.786 201.837 L
117.071 202.709 L
119.357 202.263 L
121.643 206.65 L
123.929 209.901 L
126.214 208.283 L
128.5 210.566 L
130.786 212.896 L
133.071 212.644 L
135.357 219.006 L
137.643 218.7 L
139.929 217.996 L
142.214 223.305 L
144.5 226.356 L
146.786 224.746 L
149.071 225.44 L
151.357 225.311 L
153.643 220.172 L
155.929 215.884 L
158.214 193.133 L
160.5 161.629 L
162.786 144.65 L
165.071 126.823 L
167.357 108.423 L
169.643 85.941 L
171.929 74.228 L
174.214 84.464 L
176.5 92.097 L
178.786 90.389 L
181.071 95.036 L
183.357 94.586 L
185.643 101.033 L
187.929 103.882 L
190.214 107.354 L
192.5 110.158 L
194.786 112.877 L
197.071 112.726 L
199.357 116.463 L
201.643 120.13 L
203.929 126.526 L
206.214 127.683 L
208.5 130.127 L
210.786 129.253 L
213.071 133.122 L
215.357 133.993 L
217.643 131.503 L
219.929 128.014 L
222.214 127.938 L
224.5 125.821 L
226.786 125.726 L
229.071 123.025 L
231.357 121.966 L
233.643 124.097 L
235.929 124.691 L
238.214 123.48 L
240.5 124.008 L
242.786 126.738 L
245.071 122.051 L
247.357 122.743 L
249.643 121.677 L
251.929 120.694 L
254.214 119.23 L
256.5 118.613 L
258.786 113.962 L
261.071 112.358 L
263.357 109.135 L
265.643 104.74 L
267.929 99.923 L
270.214 97.848 L
272.5 99.807 L
274.786 100.238 L
277.071 104.228 L
279.357 104.995 L
281.643 103.38 L
283.929 104.135 L
286.214 102.637 L
288.5 98.948 L
290.786 98.35 L
293.071 95.614 L
295.357 90.752 L
297.643 90.719 L
299.929 90.917 L
302.214 89.262 L
304.5 81.06 L
306.786 77.596 L
309.071 73.567 L
311.357 71.362 L
313.643 62.709 L
315.929 61.186 L
318.214 61.135 L
320.5 63.531 L
322.786 62.804 L
325.071 66.397 L
327.357 68.542 L
329.643 75.603 L
331.929 79.398 L
334.214 86.113 L
336.5 88.808 L
338.786 95.23 L
341.071 97.038 L
343.357 99.313 L
345.643 103.095 L
347.929 109.978 L
350.214 112.981 L
352.5 118.075 L
354.786 122.383 L
357.071 125.288 L
359.357 131.039 L
361.643 135.416 L
363.929 140.048 L
366.214 144.532 L
368.5 148.925 L
370.786 154.308 L
373.071 155.878 L
375.357 150.736 L
377.643 154.291 L
379.929 155.37 L
382.214 153.644 L
384.5 149.11 L
S
GR
GS
[1.00046 0 0 1 0 0] CT
0.6 0.2 0.2 RC
1 LJ
2 LW
N
64.5 160.952 M
66.786 162.12 L
69.071 160.769 L
71.357 163.718 L
73.643 163.132 L
75.929 169.775 L
78.214 172.411 L
80.5 182.852 L
82.786 184.161 L
85.071 187.686 L
87.357 191.943 L
89.643 196.031 L
91.929 196.767 L
94.214 201.836 L
96.5 202.698 L
98.786 204.665 L
101.071 208.62 L
103.357 211.289 L
105.643 208.753 L
107.929 208.813 L
110.214 208.476 L
112.5 207.695 L
114.786 207.326 L
117.071 207.849 L
119.357 207.014 L
121.643 210.893 L
123.929 213.867 L
126.214 211.905 L
128.5 213.622 L
130.786 215.575 L
133.071 215.653 L
135.357 222.108 L
137.643 221.567 L
139.929 220.727 L
142.214 226.19 L
144.5 229.771 L
146.786 228.923 L
149.071 230.012 L
151.357 230.034 L
153.643 225.245 L
155.929 221.149 L
158.214 198.518 L
160.5 167.31 L
162.786 150.51 L
165.071 132.365 L
167.357 114.141 L
169.643 91.821 L
171.929 80 L
174.214 90.014 L
176.5 97.682 L
178.786 96.491 L
181.071 101.502 L
183.357 101.321 L
185.643 107.718 L
187.929 110.762 L
190.214 114.7 L
192.5 117.601 L
194.786 119.995 L
197.071 119.828 L
199.357 123.769 L
201.643 127.544 L
203.929 133.66 L
206.214 135.124 L
208.5 137.59 L
210.786 137.038 L
213.071 140.863 L
215.357 142.218 L
217.643 139.426 L
219.929 135.879 L
222.214 135.661 L
224.5 133.563 L
226.786 133.583 L
229.071 130.85 L
231.357 129.449 L
233.643 131.343 L
235.929 131.908 L
238.214 130.829 L
240.5 131.66 L
242.786 134.694 L
245.071 130.063 L
247.357 130.73 L
249.643 129.967 L
251.929 129.199 L
254.214 127.987 L
256.5 127.715 L
258.786 123.376 L
261.071 122.149 L
263.357 119.081 L
265.643 114.494 L
267.929 109.472 L
270.214 107.638 L
272.5 109.261 L
274.786 109.648 L
277.071 113.907 L
279.357 114.755 L
281.643 113.271 L
283.929 114.082 L
286.214 112.218 L
288.5 108.441 L
290.786 107.806 L
293.071 104.692 L
295.357 100.015 L
297.643 100.081 L
299.929 100.451 L
302.214 99.281 L
304.5 91.367 L
306.786 88.581 L
309.071 85.232 L
311.357 83.569 L
313.643 75.588 L
315.929 74.478 L
318.214 73.988 L
320.5 75.482 L
322.786 73.944 L
325.071 76.935 L
327.357 78.975 L
329.643 86.694 L
331.929 91.111 L
334.214 98.242 L
336.5 101.513 L
338.786 108.17 L
341.071 110.326 L
343.357 113.086 L
345.643 116.761 L
347.929 123.073 L
350.214 126.24 L
352.5 130.669 L
354.786 134.712 L
357.071 137.36 L
359.357 142.766 L
361.643 146.316 L
363.929 150.867 L
366.214 154.92 L
368.5 159.139 L
370.786 164.409 L
373.071 166.187 L
375.357 160.745 L
377.643 164.177 L
379.929 164.874 L
382.214 162.944 L
384.5 158.286 L
S
GR
%%Trailer
%%Pages: 1
%%EOF
