%!PS-Adobe-3.0 EPSF-3.0
%%Creator: (MATLAB, The Mathworks, Inc. Version 9.8.0.1323502 \(R2020a\). Operating System: Mac OS X)
%%Title: /Users/kosciessa/Volumes/tardis/LNDG/stateswitch/stsw_eeg_task/ssvep/figures/b_SpectraNormalized_OA.eps
%%CreationDate: 2022-02-14T15:18:48
%%Pages: (atend)
%%BoundingBox:    74     0   936   282
%%LanguageLevel: 3
%%EndComments
%%BeginProlog
%%BeginResource: procset (Apache XML Graphics Std ProcSet) 1.2 0
%%Version: 1.2 0
%%Copyright: (Copyright 2001-2003,2010 The Apache Software Foundation. License terms: http://www.apache.org/licenses/LICENSE-2.0)
/bd{bind def}bind def
/ld{load def}bd
/GR/grestore ld
/GS/gsave ld
/RM/rmoveto ld
/C/curveto ld
/t/show ld
/L/lineto ld
/ML/setmiterlimit ld
/CT/concat ld
/f/fill ld
/N/newpath ld
/S/stroke ld
/CC/setcmykcolor ld
/A/ashow ld
/cp/closepath ld
/RC/setrgbcolor ld
/LJ/setlinejoin ld
/GC/setgray ld
/LW/setlinewidth ld
/M/moveto ld
/re {4 2 roll M
1 index 0 rlineto
0 exch rlineto
neg 0 rlineto
cp } bd
/_ctm matrix def
/_tm matrix def
/BT { _ctm currentmatrix pop matrix _tm copy pop 0 0 moveto } bd
/ET { _ctm setmatrix } bd
/iTm { _ctm setmatrix _tm concat } bd
/Tm { _tm astore pop iTm 0 0 moveto } bd
/ux 0.0 def
/uy 0.0 def
/F {
  /Tp exch def
  /Tf exch def
  Tf findfont Tp scalefont setfont
  /cf Tf def  /cs Tp def
} bd
/ULS {currentpoint /uy exch def /ux exch def} bd
/ULE {
  /Tcx currentpoint pop def
  gsave
  newpath
  cf findfont cs scalefont dup
  /FontMatrix get 0 get /Ts exch def /FontInfo get dup
  /UnderlinePosition get Ts mul /To exch def
  /UnderlineThickness get Ts mul /Tt exch def
  ux uy To add moveto  Tcx uy To add lineto
  Tt setlinewidth stroke
  grestore
} bd
/OLE {
  /Tcx currentpoint pop def
  gsave
  newpath
  cf findfont cs scalefont dup
  /FontMatrix get 0 get /Ts exch def /FontInfo get dup
  /UnderlinePosition get Ts mul /To exch def
  /UnderlineThickness get Ts mul /Tt exch def
  ux uy To add cs add moveto Tcx uy To add cs add lineto
  Tt setlinewidth stroke
  grestore
} bd
/SOE {
  /Tcx currentpoint pop def
  gsave
  newpath
  cf findfont cs scalefont dup
  /FontMatrix get 0 get /Ts exch def /FontInfo get dup
  /UnderlinePosition get Ts mul /To exch def
  /UnderlineThickness get Ts mul /Tt exch def
  ux uy To add cs 10 mul 26 idiv add moveto Tcx uy To add cs 10 mul 26 idiv add lineto
  Tt setlinewidth stroke
  grestore
} bd
/QT {
/Y22 exch store
/X22 exch store
/Y21 exch store
/X21 exch store
currentpoint
/Y21 load 2 mul add 3 div exch
/X21 load 2 mul add 3 div exch
/X21 load 2 mul /X22 load add 3 div
/Y21 load 2 mul /Y22 load add 3 div
/X22 load /Y22 load curveto
} bd
/SSPD {
dup length /d exch dict def
{
/v exch def
/k exch def
currentpagedevice k known {
/cpdv currentpagedevice k get def
v cpdv ne {
/upd false def
/nullv v type /nulltype eq def
/nullcpdv cpdv type /nulltype eq def
nullv nullcpdv or
{
/upd true def
} {
/sametype v type cpdv type eq def
sametype {
v type /arraytype eq {
/vlen v length def
/cpdvlen cpdv length def
vlen cpdvlen eq {
0 1 vlen 1 sub {
/i exch def
/obj v i get def
/cpdobj cpdv i get def
obj cpdobj ne {
/upd true def
exit
} if
} for
} {
/upd true def
} ifelse
} {
v type /dicttype eq {
v {
/dv exch def
/dk exch def
/cpddv cpdv dk get def
dv cpddv ne {
/upd true def
exit
} if
} forall
} {
/upd true def
} ifelse
} ifelse
} if
} ifelse
upd true eq {
d k v put
} if
} if
} if
} forall
d length 0 gt {
d setpagedevice
} if
} bd
/RE { % /NewFontName [NewEncodingArray] /FontName RE -
  findfont dup length dict begin
  {
    1 index /FID ne
    {def} {pop pop} ifelse
  } forall
  /Encoding exch def
  /FontName 1 index def
  currentdict definefont pop
  end
} bind def
%%EndResource
%%BeginResource: procset (Apache XML Graphics EPS ProcSet) 1.0 0
%%Version: 1.0 0
%%Copyright: (Copyright 2002-2003 The Apache Software Foundation. License terms: http://www.apache.org/licenses/LICENSE-2.0)
/BeginEPSF { %def
/b4_Inc_state save def         % Save state for cleanup
/dict_count countdictstack def % Count objects on dict stack
/op_count count 1 sub def      % Count objects on operand stack
userdict begin                 % Push userdict on dict stack
/showpage { } def              % Redefine showpage, { } = null proc
0 setgray 0 setlinecap         % Prepare graphics state
1 setlinewidth 0 setlinejoin
10 setmiterlimit [ ] 0 setdash newpath
/languagelevel where           % If level not equal to 1 then
{pop languagelevel             % set strokeadjust and
1 ne                           % overprint to their defaults.
{false setstrokeadjust false setoverprint
} if
} if
} bd
/EndEPSF { %def
count op_count sub {pop} repeat            % Clean up stacks
countdictstack dict_count sub {end} repeat
b4_Inc_state restore
} bd
%%EndResource
%FOPBeginFontDict
%%IncludeResource: font Courier-Oblique
%%IncludeResource: font Courier-BoldOblique
%%IncludeResource: font Courier-Bold
%%IncludeResource: font ZapfDingbats
%%IncludeResource: font Symbol
%%IncludeResource: font Helvetica
%%IncludeResource: font Helvetica-Oblique
%%IncludeResource: font Helvetica-Bold
%%IncludeResource: font Helvetica-BoldOblique
%%IncludeResource: font Times-Roman
%%IncludeResource: font Times-Italic
%%IncludeResource: font Times-Bold
%%IncludeResource: font Times-BoldItalic
%%IncludeResource: font Courier
%FOPEndFontDict
%%BeginResource: encoding WinAnsiEncoding
/WinAnsiEncoding [
/.notdef /.notdef /.notdef /.notdef /.notdef
/.notdef /.notdef /.notdef /.notdef /.notdef
/.notdef /.notdef /.notdef /.notdef /.notdef
/.notdef /.notdef /.notdef /.notdef /.notdef
/.notdef /.notdef /.notdef /.notdef /.notdef
/.notdef /.notdef /.notdef /.notdef /.notdef
/.notdef /.notdef /space /exclam /quotedbl
/numbersign /dollar /percent /ampersand /quotesingle
/parenleft /parenright /asterisk /plus /comma
/hyphen /period /slash /zero /one
/two /three /four /five /six
/seven /eight /nine /colon /semicolon
/less /equal /greater /question /at
/A /B /C /D /E
/F /G /H /I /J
/K /L /M /N /O
/P /Q /R /S /T
/U /V /W /X /Y
/Z /bracketleft /backslash /bracketright /asciicircum
/underscore /quoteleft /a /b /c
/d /e /f /g /h
/i /j /k /l /m
/n /o /p /q /r
/s /t /u /v /w
/x /y /z /braceleft /bar
/braceright /asciitilde /bullet /Euro /bullet
/quotesinglbase /florin /quotedblbase /ellipsis /dagger
/daggerdbl /circumflex /perthousand /Scaron /guilsinglleft
/OE /bullet /Zcaron /bullet /bullet
/quoteleft /quoteright /quotedblleft /quotedblright /bullet
/endash /emdash /asciitilde /trademark /scaron
/guilsinglright /oe /bullet /zcaron /Ydieresis
/space /exclamdown /cent /sterling /currency
/yen /brokenbar /section /dieresis /copyright
/ordfeminine /guillemotleft /logicalnot /sfthyphen /registered
/macron /degree /plusminus /twosuperior /threesuperior
/acute /mu /paragraph /middot /cedilla
/onesuperior /ordmasculine /guillemotright /onequarter /onehalf
/threequarters /questiondown /Agrave /Aacute /Acircumflex
/Atilde /Adieresis /Aring /AE /Ccedilla
/Egrave /Eacute /Ecircumflex /Edieresis /Igrave
/Iacute /Icircumflex /Idieresis /Eth /Ntilde
/Ograve /Oacute /Ocircumflex /Otilde /Odieresis
/multiply /Oslash /Ugrave /Uacute /Ucircumflex
/Udieresis /Yacute /Thorn /germandbls /agrave
/aacute /acircumflex /atilde /adieresis /aring
/ae /ccedilla /egrave /eacute /ecircumflex
/edieresis /igrave /iacute /icircumflex /idieresis
/eth /ntilde /ograve /oacute /ocircumflex
/otilde /odieresis /divide /oslash /ugrave
/uacute /ucircumflex /udieresis /yacute /thorn
/ydieresis
] def
%%EndResource
%FOPBeginFontReencode
/Courier-Oblique findfont
dup length dict begin
  {1 index /FID ne {def} {pop pop} ifelse} forall
  /Encoding WinAnsiEncoding def
  currentdict
end
/Courier-Oblique exch definefont pop
/Courier-BoldOblique findfont
dup length dict begin
  {1 index /FID ne {def} {pop pop} ifelse} forall
  /Encoding WinAnsiEncoding def
  currentdict
end
/Courier-BoldOblique exch definefont pop
/Courier-Bold findfont
dup length dict begin
  {1 index /FID ne {def} {pop pop} ifelse} forall
  /Encoding WinAnsiEncoding def
  currentdict
end
/Courier-Bold exch definefont pop
/Helvetica findfont
dup length dict begin
  {1 index /FID ne {def} {pop pop} ifelse} forall
  /Encoding WinAnsiEncoding def
  currentdict
end
/Helvetica exch definefont pop
/Helvetica-Oblique findfont
dup length dict begin
  {1 index /FID ne {def} {pop pop} ifelse} forall
  /Encoding WinAnsiEncoding def
  currentdict
end
/Helvetica-Oblique exch definefont pop
/Helvetica-Bold findfont
dup length dict begin
  {1 index /FID ne {def} {pop pop} ifelse} forall
  /Encoding WinAnsiEncoding def
  currentdict
end
/Helvetica-Bold exch definefont pop
/Helvetica-BoldOblique findfont
dup length dict begin
  {1 index /FID ne {def} {pop pop} ifelse} forall
  /Encoding WinAnsiEncoding def
  currentdict
end
/Helvetica-BoldOblique exch definefont pop
/Times-Roman findfont
dup length dict begin
  {1 index /FID ne {def} {pop pop} ifelse} forall
  /Encoding WinAnsiEncoding def
  currentdict
end
/Times-Roman exch definefont pop
/Times-Italic findfont
dup length dict begin
  {1 index /FID ne {def} {pop pop} ifelse} forall
  /Encoding WinAnsiEncoding def
  currentdict
end
/Times-Italic exch definefont pop
/Times-Bold findfont
dup length dict begin
  {1 index /FID ne {def} {pop pop} ifelse} forall
  /Encoding WinAnsiEncoding def
  currentdict
end
/Times-Bold exch definefont pop
/Times-BoldItalic findfont
dup length dict begin
  {1 index /FID ne {def} {pop pop} ifelse} forall
  /Encoding WinAnsiEncoding def
  currentdict
end
/Times-BoldItalic exch definefont pop
/Courier findfont
dup length dict begin
  {1 index /FID ne {def} {pop pop} ifelse} forall
  /Encoding WinAnsiEncoding def
  currentdict
end
/Courier exch definefont pop
%FOPEndFontReencode
%%EndProlog
%%Page: 1 1
%%PageBoundingBox: 0 0 1024 288
%%BeginPageSetup
[1 0 0 -1 0 288] CT
%%EndPageSetup
GS
1 GC
N
0 0 1024 288 re
f
GR
GS
1 GC
N
0 0 1024 288 re
f
GR
GS
1 GC
N
133 238.5 M
476 238.5 L
476 26.5 L
133 26.5 L
cp
f
GR
GS
0.149 GC
2 setlinecap
1 LJ
0.5 LW
N
133 238.5 M
476 238.5 L
S
GR
GS
0.149 GC
2 setlinecap
1 LJ
0.5 LW
N
133 238.5 M
133 235.07 L
S
GR
GS
0.149 GC
2 setlinecap
1 LJ
0.5 LW
N
218.75 238.5 M
218.75 235.07 L
S
GR
GS
0.149 GC
2 setlinecap
1 LJ
0.5 LW
N
304.5 238.5 M
304.5 235.07 L
S
GR
GS
0.149 GC
2 setlinecap
1 LJ
0.5 LW
N
390.25 238.5 M
390.25 235.07 L
S
GR
GS
0.149 GC
2 setlinecap
1 LJ
0.5 LW
N
476 238.5 M
476 235.07 L
S
GR
GS
[1 0 0 1 133 244.09995] CT
0.149 GC
/Helvetica 18 F
GS
[1 0 0 1 0 0] CT
-5.5 18 moveto 
1 -1 scale
(0) t 
GR
GR
GS
[1 0 0 1 218.75 244.09995] CT
0.149 GC
/Helvetica 18 F
GS
[1 0 0 1 0 0] CT
-13 18 moveto 
1 -1 scale
(0.5) t 
GR
GR
GS
[1 0 0 1 304.5 244.09995] CT
0.149 GC
/Helvetica 18 F
GS
[1 0 0 1 0 0] CT
-5.5 18 moveto 
1 -1 scale
(1) t 
GR
GR
GS
[1 0 0 1 390.25 244.09995] CT
0.149 GC
/Helvetica 18 F
GS
[1 0 0 1 0 0] CT
-13 18 moveto 
1 -1 scale
(1.5) t 
GR
GR
GS
[1 0 0 1 476 244.09995] CT
0.149 GC
/Helvetica 18 F
GS
[1 0 0 1 0 0] CT
-5.5 18 moveto 
1 -1 scale
(2) t 
GR
GR
GS
[1 0 0 1 304.50015 266.60004] CT
0.149 GC
/Helvetica 18 F
GS
[1 0 0 1 0 0] CT
-60.5 18 moveto 
1 -1 scale
(Frequency \(Hz\)) t 
GR
GR
GS
0.149 GC
2 setlinecap
1 LJ
0.5 LW
N
133 238.5 M
133 26.5 L
S
GR
GS
0.149 GC
2 setlinecap
1 LJ
0.5 LW
N
133 238.5 M
136.43 238.5 L
S
GR
GS
0.149 GC
2 setlinecap
1 LJ
0.5 LW
N
133 185.5 M
136.43 185.5 L
S
GR
GS
0.149 GC
2 setlinecap
1 LJ
0.5 LW
N
133 132.5 M
136.43 132.5 L
S
GR
GS
0.149 GC
2 setlinecap
1 LJ
0.5 LW
N
133 79.5 M
136.43 79.5 L
S
GR
GS
0.149 GC
2 setlinecap
1 LJ
0.5 LW
N
133 26.5 M
136.43 26.5 L
S
GR
GS
[1 0 0 1 127.4 238.5] CT
0.149 GC
/Helvetica 18 F
GS
[1 0 0 1 0 0] CT
-33 7 moveto 
1 -1 scale
(-9.5) t 
GR
GR
GS
[1 0 0 1 127.4 185.5] CT
0.149 GC
/Helvetica 18 F
GS
[1 0 0 1 0 0] CT
-18 7 moveto 
1 -1 scale
(-9) t 
GR
GR
GS
[1 0 0 1 127.4 132.5] CT
0.149 GC
/Helvetica 18 F
GS
[1 0 0 1 0 0] CT
-33 7 moveto 
1 -1 scale
(-8.5) t 
GR
GR
GS
[1 0 0 1 127.4 79.5] CT
0.149 GC
/Helvetica 18 F
GS
[1 0 0 1 0 0] CT
-18 7 moveto 
1 -1 scale
(-8) t 
GR
GR
GS
[1 0 0 1 127.4 26.5] CT
0.149 GC
/Helvetica 18 F
GS
[1 0 0 1 0 0] CT
-33 7 moveto 
1 -1 scale
(-7.5) t 
GR
GR
GS
[0 -1 1 0 91.9 132.49989] CT
0.149 GC
/Helvetica 18 F
GS
[1 0 0 1 0 0] CT
-55.5 -4 moveto 
1 -1 scale
(Power \(log10\)) t 
GR
GR
GS
[1 0 0 1 304.50027 24.25] CT
/Helvetica-Bold 18 F
GS
[1 0 0 1 0 0] CT
-108.5 -4 moveto 
1 -1 scale
(Non-normalized estimate) t 
GR
GR
GS
0 0.447 0.741 RC
1 LJ
2 LW
N
183.152 64.663 M
234.778 91.182 L
267.42 110.783 L
288.244 123.968 L
304.5 131.277 L
317.836 145.37 L
329.143 155.36 L
339.871 165.507 L
348.441 170.13 L
356.127 178.605 L
363.093 185.494 L
369.462 196.654 L
375.892 202.081 L
381.292 205.575 L
386.326 196.765 L
391.042 208.6 L
395.477 214.683 L
400.068 215.017 L
404.01 218.352 L
407.753 217.624 L
411.318 219.363 L
414.719 222.291 L
418.29 223.826 L
421.394 222.314 L
424.373 224.91 L
427.238 225.543 L
429.997 227.984 L
432.918 226.452 L
435.478 230.443 L
437.953 231.259 L
S
GR
GS
0.851 0.325 0.098 RC
1 LJ
2 LW
N
183.152 64.553 M
234.778 93.538 L
267.42 110.389 L
288.244 124.423 L
304.5 131.621 L
317.836 142.437 L
329.143 151.268 L
339.871 162.218 L
348.441 174.49 L
356.127 179.49 L
363.093 186.003 L
369.462 195.715 L
375.892 197.734 L
381.292 199.718 L
386.326 197.353 L
391.042 208.314 L
395.477 212.165 L
400.068 212.954 L
404.01 215.562 L
407.753 217.158 L
411.318 221.107 L
414.719 221.074 L
418.29 220.854 L
421.394 224.338 L
424.373 224.123 L
427.238 227.518 L
429.997 226.532 L
432.918 228.003 L
435.478 228.672 L
437.953 229.51 L
S
GR
GS
0.929 0.694 0.125 RC
1 LJ
2 LW
N
183.152 66.146 M
234.778 92.305 L
267.42 112.055 L
288.244 123.691 L
304.5 131.405 L
317.836 145.928 L
329.143 152.606 L
339.871 162.725 L
348.441 171.981 L
356.127 176.901 L
363.093 187.365 L
369.462 194.688 L
375.892 199.477 L
381.292 203.978 L
386.326 196.815 L
391.042 209.254 L
395.477 210.436 L
400.068 215.18 L
404.01 215.287 L
407.753 216.853 L
411.318 218.718 L
414.719 220.892 L
418.29 222.566 L
421.394 220.897 L
424.373 221.865 L
427.238 226.379 L
429.997 228.06 L
432.918 227.558 L
435.478 228.49 L
437.953 227.345 L
S
GR
GS
0.494 0.184 0.557 RC
1 LJ
2 LW
N
183.152 65.105 M
234.778 92.067 L
267.42 112.747 L
288.244 123.569 L
304.5 128.836 L
317.836 142.823 L
329.143 155.899 L
339.871 167.154 L
348.441 173.152 L
356.127 180.249 L
363.093 188.22 L
369.462 193.404 L
375.892 200.063 L
381.292 205.882 L
386.326 198.796 L
391.042 209.457 L
395.477 212.369 L
400.068 217.038 L
404.01 216.975 L
407.753 218.995 L
411.318 223.643 L
414.719 220.543 L
418.29 223.706 L
421.394 225.128 L
424.373 225.391 L
427.238 224.047 L
429.997 228.417 L
432.918 229.508 L
435.478 230.784 L
437.953 231.476 L
S
GR
GS
[1 0 0 1 408 47.25] CT
/Helvetica 18 F
GS
[1 0 0 1 0 0] CT
0 7 moveto 
1 -1 scale
(Load 1) t 
GR
GR
GS
0 0.447 0.741 RC
1 LJ
2 LW
N
375 47.25 M
405 47.25 L
S
GR
GS
[1 0 0 1 408 69.25] CT
/Helvetica 18 F
GS
[1 0 0 1 0 0] CT
0 7 moveto 
1 -1 scale
(Load 2) t 
GR
GR
GS
0.851 0.325 0.098 RC
1 LJ
2 LW
N
375 69.25 M
405 69.25 L
S
GR
GS
[1 0 0 1 408 91.25] CT
/Helvetica 18 F
GS
[1 0 0 1 0 0] CT
0 7 moveto 
1 -1 scale
(Load 3) t 
GR
GR
GS
0.929 0.694 0.125 RC
1 LJ
2 LW
N
375 91.25 M
405 91.25 L
S
GR
GS
[1 0 0 1 408 113.25] CT
/Helvetica 18 F
GS
[1 0 0 1 0 0] CT
0 7 moveto 
1 -1 scale
(Load 4) t 
GR
GR
GS
0.494 0.184 0.557 RC
1 LJ
2 LW
N
375 113.25 M
405 113.25 L
S
GR
GS
1 GC
N
584 238.5 M
926.5 238.5 L
926.5 26.5 L
584 26.5 L
cp
f
GR
GS
0.149 GC
2 setlinecap
1 LJ
0.5 LW
N
584 238.5 M
926.5 238.5 L
S
GR
GS
0.149 GC
2 setlinecap
1 LJ
0.5 LW
N
584 238.5 M
584 235.075 L
S
GR
GS
0.149 GC
2 setlinecap
1 LJ
0.5 LW
N
698.167 238.5 M
698.167 235.075 L
S
GR
GS
0.149 GC
2 setlinecap
1 LJ
0.5 LW
N
812.333 238.5 M
812.333 235.075 L
S
GR
GS
0.149 GC
2 setlinecap
1 LJ
0.5 LW
N
926.5 238.5 M
926.5 235.075 L
S
GR
GS
[1 0 0 1 584 244.10001] CT
0.149 GC
/Helvetica 18 F
GS
[1 0 0 1 0 0] CT
-5.5 18 moveto 
1 -1 scale
(0) t 
GR
GR
GS
[1 0 0 1 698.16669 244.10001] CT
0.149 GC
/Helvetica 18 F
GS
[1 0 0 1 0 0] CT
-10.5 18 moveto 
1 -1 scale
(20) t 
GR
GR
GS
[1 0 0 1 812.33331 244.10001] CT
0.149 GC
/Helvetica 18 F
GS
[1 0 0 1 0 0] CT
-10.5 18 moveto 
1 -1 scale
(40) t 
GR
GR
GS
[1 0 0 1 926.5 244.10001] CT
0.149 GC
/Helvetica 18 F
GS
[1 0 0 1 0 0] CT
-10.5 18 moveto 
1 -1 scale
(60) t 
GR
GR
GS
[1 0 0 1 755.25018 266.60001] CT
0.149 GC
/Helvetica 18 F
GS
[1 0 0 1 0 0] CT
-60.5 18 moveto 
1 -1 scale
(Frequency \(Hz\)) t 
GR
GR
GS
0.149 GC
2 setlinecap
1 LJ
0.5 LW
N
584 238.5 M
584 26.5 L
S
GR
GS
0.149 GC
2 setlinecap
1 LJ
0.5 LW
N
584 238.5 M
587.425 238.5 L
S
GR
GS
0.149 GC
2 setlinecap
1 LJ
0.5 LW
N
584 185.5 M
587.425 185.5 L
S
GR
GS
0.149 GC
2 setlinecap
1 LJ
0.5 LW
N
584 132.5 M
587.425 132.5 L
S
GR
GS
0.149 GC
2 setlinecap
1 LJ
0.5 LW
N
584 79.5 M
587.425 79.5 L
S
GR
GS
0.149 GC
2 setlinecap
1 LJ
0.5 LW
N
584 26.5 M
587.425 26.5 L
S
GR
GS
[1 0 0 1 578.40002 238.5] CT
0.149 GC
/Helvetica 18 F
GS
[1 0 0 1 0 0] CT
-33 7 moveto 
1 -1 scale
(-0.2) t 
GR
GR
GS
[1 0 0 1 578.40002 185.5] CT
0.149 GC
/Helvetica 18 F
GS
[1 0 0 1 0 0] CT
-33 7 moveto 
1 -1 scale
(-0.1) t 
GR
GR
GS
[1 0 0 1 578.40002 132.5] CT
0.149 GC
/Helvetica 18 F
GS
[1 0 0 1 0 0] CT
-11 7 moveto 
1 -1 scale
(0) t 
GR
GR
GS
[1 0 0 1 578.40002 79.5] CT
0.149 GC
/Helvetica 18 F
GS
[1 0 0 1 0 0] CT
-26 7 moveto 
1 -1 scale
(0.1) t 
GR
GR
GS
[1 0 0 1 578.40002 26.5] CT
0.149 GC
/Helvetica 18 F
GS
[1 0 0 1 0 0] CT
-26 7 moveto 
1 -1 scale
(0.2) t 
GR
GR
GS
[0 -1 1 0 542.90002 132.49989] CT
0.149 GC
/Helvetica 18 F
GS
[1 0 0 1 0 0] CT
-56.5 -4 moveto 
1 -1 scale
(Power \(norm.\)) t 
GR
GR
GS
[1 0 0 1 755.25073 24.25] CT
/Helvetica-Bold 18 F
GS
[1 0 0 1 0 0] CT
-139 -4 moveto 
1 -1 scale
(Spectrally-normalized estimates) t 
GR
GR
GS
0 0.447 0.741 RC
1 LJ
2 LW
N
595.193 132.5 M
606.386 234.343 L
618.698 210.855 L
629.891 195.842 L
641.083 147.453 L
652.276 162.024 L
663.469 150.894 L
675.781 148.256 L
686.974 149.608 L
698.167 151.708 L
709.359 146.458 L
720.552 151.985 L
732.864 136.262 L
744.057 207.716 L
755.25 27.262 L
766.443 195.022 L
777.636 141.865 L
789.948 131.766 L
801.141 139.812 L
812.333 136.73 L
823.526 132.889 L
834.719 133.949 L
847.031 141.829 L
858.224 132.151 L
869.417 138.762 L
880.609 127.482 L
891.802 144.317 L
904.114 128.071 L
915.307 144.991 L
926.5 132.5 L
S
GR
GS
0.851 0.325 0.098 RC
1 LJ
2 LW
N
595.193 132.5 M
606.386 227.03 L
618.698 196.968 L
629.891 212.881 L
641.083 126.069 L
652.276 154.595 L
663.469 157.145 L
675.781 155.114 L
686.974 145.435 L
698.167 163.694 L
709.359 147.736 L
720.552 150.245 L
732.864 144.738 L
744.057 188.844 L
755.25 37.491 L
766.443 200.17 L
777.636 133.196 L
789.948 132.976 L
801.141 140.014 L
812.333 130.038 L
823.526 142.058 L
834.719 137.66 L
847.031 132.559 L
858.224 130.992 L
869.417 132.307 L
880.609 137.279 L
891.802 135.641 L
904.114 136.031 L
915.307 137.654 L
926.5 132.5 L
S
GR
GS
0.929 0.694 0.125 RC
1 LJ
2 LW
N
595.193 132.5 M
606.386 228.319 L
618.698 201.068 L
629.891 197.305 L
641.083 144.026 L
652.276 138.374 L
663.469 159.24 L
675.781 149.045 L
686.974 153.75 L
698.167 146.884 L
709.359 145.568 L
720.552 147.471 L
732.864 139.007 L
744.057 187.077 L
755.25 51.675 L
766.443 191.65 L
777.636 136.111 L
789.948 143.371 L
801.141 139.683 L
812.333 136.877 L
823.526 133.079 L
834.719 143.97 L
847.031 132.746 L
858.224 138.658 L
869.417 136.686 L
880.609 134.489 L
891.802 133.082 L
904.114 140.201 L
915.307 147.634 L
926.5 132.5 L
S
GR
GS
0.494 0.184 0.557 RC
1 LJ
2 LW
N
595.193 132.5 M
606.386 208.304 L
618.698 205.935 L
629.891 195.94 L
641.083 146.457 L
652.276 152.04 L
663.469 160.633 L
675.781 148.531 L
686.974 148.135 L
698.167 132.519 L
709.359 157.38 L
720.552 139.145 L
732.864 151.241 L
744.057 195.479 L
755.25 39.906 L
766.443 187.995 L
777.636 141.678 L
789.948 128.485 L
801.141 140.476 L
812.333 131.39 L
823.526 143.234 L
834.719 138.334 L
847.031 140.438 L
858.224 133.252 L
869.417 134.924 L
880.609 130.375 L
891.802 134.935 L
904.114 141.442 L
915.307 130.139 L
926.5 132.5 L
S
GR
%%Trailer
%%Pages: 1
%%EOF
