%!PS-Adobe-3.0 EPSF-3.0
%%Creator: (MATLAB, The Mathworks, Inc. Version 9.8.0.1323502 \(R2020a\). Operating System: Mac OS X)
%%Title: /Users/kosciessa/Volumes/tardis/LNDG/stateswitch/stsw_eeg_task/ssvep/figures/b_SpectraNormalized_YA.eps
%%CreationDate: 2022-02-14T15:18:29
%%Pages: (atend)
%%BoundingBox:    74     0   936   282
%%LanguageLevel: 3
%%EndComments
%%BeginProlog
%%BeginResource: procset (Apache XML Graphics Std ProcSet) 1.2 0
%%Version: 1.2 0
%%Copyright: (Copyright 2001-2003,2010 The Apache Software Foundation. License terms: http://www.apache.org/licenses/LICENSE-2.0)
/bd{bind def}bind def
/ld{load def}bd
/GR/grestore ld
/GS/gsave ld
/RM/rmoveto ld
/C/curveto ld
/t/show ld
/L/lineto ld
/ML/setmiterlimit ld
/CT/concat ld
/f/fill ld
/N/newpath ld
/S/stroke ld
/CC/setcmykcolor ld
/A/ashow ld
/cp/closepath ld
/RC/setrgbcolor ld
/LJ/setlinejoin ld
/GC/setgray ld
/LW/setlinewidth ld
/M/moveto ld
/re {4 2 roll M
1 index 0 rlineto
0 exch rlineto
neg 0 rlineto
cp } bd
/_ctm matrix def
/_tm matrix def
/BT { _ctm currentmatrix pop matrix _tm copy pop 0 0 moveto } bd
/ET { _ctm setmatrix } bd
/iTm { _ctm setmatrix _tm concat } bd
/Tm { _tm astore pop iTm 0 0 moveto } bd
/ux 0.0 def
/uy 0.0 def
/F {
  /Tp exch def
  /Tf exch def
  Tf findfont Tp scalefont setfont
  /cf Tf def  /cs Tp def
} bd
/ULS {currentpoint /uy exch def /ux exch def} bd
/ULE {
  /Tcx currentpoint pop def
  gsave
  newpath
  cf findfont cs scalefont dup
  /FontMatrix get 0 get /Ts exch def /FontInfo get dup
  /UnderlinePosition get Ts mul /To exch def
  /UnderlineThickness get Ts mul /Tt exch def
  ux uy To add moveto  Tcx uy To add lineto
  Tt setlinewidth stroke
  grestore
} bd
/OLE {
  /Tcx currentpoint pop def
  gsave
  newpath
  cf findfont cs scalefont dup
  /FontMatrix get 0 get /Ts exch def /FontInfo get dup
  /UnderlinePosition get Ts mul /To exch def
  /UnderlineThickness get Ts mul /Tt exch def
  ux uy To add cs add moveto Tcx uy To add cs add lineto
  Tt setlinewidth stroke
  grestore
} bd
/SOE {
  /Tcx currentpoint pop def
  gsave
  newpath
  cf findfont cs scalefont dup
  /FontMatrix get 0 get /Ts exch def /FontInfo get dup
  /UnderlinePosition get Ts mul /To exch def
  /UnderlineThickness get Ts mul /Tt exch def
  ux uy To add cs 10 mul 26 idiv add moveto Tcx uy To add cs 10 mul 26 idiv add lineto
  Tt setlinewidth stroke
  grestore
} bd
/QT {
/Y22 exch store
/X22 exch store
/Y21 exch store
/X21 exch store
currentpoint
/Y21 load 2 mul add 3 div exch
/X21 load 2 mul add 3 div exch
/X21 load 2 mul /X22 load add 3 div
/Y21 load 2 mul /Y22 load add 3 div
/X22 load /Y22 load curveto
} bd
/SSPD {
dup length /d exch dict def
{
/v exch def
/k exch def
currentpagedevice k known {
/cpdv currentpagedevice k get def
v cpdv ne {
/upd false def
/nullv v type /nulltype eq def
/nullcpdv cpdv type /nulltype eq def
nullv nullcpdv or
{
/upd true def
} {
/sametype v type cpdv type eq def
sametype {
v type /arraytype eq {
/vlen v length def
/cpdvlen cpdv length def
vlen cpdvlen eq {
0 1 vlen 1 sub {
/i exch def
/obj v i get def
/cpdobj cpdv i get def
obj cpdobj ne {
/upd true def
exit
} if
} for
} {
/upd true def
} ifelse
} {
v type /dicttype eq {
v {
/dv exch def
/dk exch def
/cpddv cpdv dk get def
dv cpddv ne {
/upd true def
exit
} if
} forall
} {
/upd true def
} ifelse
} ifelse
} if
} ifelse
upd true eq {
d k v put
} if
} if
} if
} forall
d length 0 gt {
d setpagedevice
} if
} bd
/RE { % /NewFontName [NewEncodingArray] /FontName RE -
  findfont dup length dict begin
  {
    1 index /FID ne
    {def} {pop pop} ifelse
  } forall
  /Encoding exch def
  /FontName 1 index def
  currentdict definefont pop
  end
} bind def
%%EndResource
%%BeginResource: procset (Apache XML Graphics EPS ProcSet) 1.0 0
%%Version: 1.0 0
%%Copyright: (Copyright 2002-2003 The Apache Software Foundation. License terms: http://www.apache.org/licenses/LICENSE-2.0)
/BeginEPSF { %def
/b4_Inc_state save def         % Save state for cleanup
/dict_count countdictstack def % Count objects on dict stack
/op_count count 1 sub def      % Count objects on operand stack
userdict begin                 % Push userdict on dict stack
/showpage { } def              % Redefine showpage, { } = null proc
0 setgray 0 setlinecap         % Prepare graphics state
1 setlinewidth 0 setlinejoin
10 setmiterlimit [ ] 0 setdash newpath
/languagelevel where           % If level not equal to 1 then
{pop languagelevel             % set strokeadjust and
1 ne                           % overprint to their defaults.
{false setstrokeadjust false setoverprint
} if
} if
} bd
/EndEPSF { %def
count op_count sub {pop} repeat            % Clean up stacks
countdictstack dict_count sub {end} repeat
b4_Inc_state restore
} bd
%%EndResource
%FOPBeginFontDict
%%IncludeResource: font Courier-Oblique
%%IncludeResource: font Courier-BoldOblique
%%IncludeResource: font Courier-Bold
%%IncludeResource: font ZapfDingbats
%%IncludeResource: font Symbol
%%IncludeResource: font Helvetica
%%IncludeResource: font Helvetica-Oblique
%%IncludeResource: font Helvetica-Bold
%%IncludeResource: font Helvetica-BoldOblique
%%IncludeResource: font Times-Roman
%%IncludeResource: font Times-Italic
%%IncludeResource: font Times-Bold
%%IncludeResource: font Times-BoldItalic
%%IncludeResource: font Courier
%FOPEndFontDict
%%BeginResource: encoding WinAnsiEncoding
/WinAnsiEncoding [
/.notdef /.notdef /.notdef /.notdef /.notdef
/.notdef /.notdef /.notdef /.notdef /.notdef
/.notdef /.notdef /.notdef /.notdef /.notdef
/.notdef /.notdef /.notdef /.notdef /.notdef
/.notdef /.notdef /.notdef /.notdef /.notdef
/.notdef /.notdef /.notdef /.notdef /.notdef
/.notdef /.notdef /space /exclam /quotedbl
/numbersign /dollar /percent /ampersand /quotesingle
/parenleft /parenright /asterisk /plus /comma
/hyphen /period /slash /zero /one
/two /three /four /five /six
/seven /eight /nine /colon /semicolon
/less /equal /greater /question /at
/A /B /C /D /E
/F /G /H /I /J
/K /L /M /N /O
/P /Q /R /S /T
/U /V /W /X /Y
/Z /bracketleft /backslash /bracketright /asciicircum
/underscore /quoteleft /a /b /c
/d /e /f /g /h
/i /j /k /l /m
/n /o /p /q /r
/s /t /u /v /w
/x /y /z /braceleft /bar
/braceright /asciitilde /bullet /Euro /bullet
/quotesinglbase /florin /quotedblbase /ellipsis /dagger
/daggerdbl /circumflex /perthousand /Scaron /guilsinglleft
/OE /bullet /Zcaron /bullet /bullet
/quoteleft /quoteright /quotedblleft /quotedblright /bullet
/endash /emdash /asciitilde /trademark /scaron
/guilsinglright /oe /bullet /zcaron /Ydieresis
/space /exclamdown /cent /sterling /currency
/yen /brokenbar /section /dieresis /copyright
/ordfeminine /guillemotleft /logicalnot /sfthyphen /registered
/macron /degree /plusminus /twosuperior /threesuperior
/acute /mu /paragraph /middot /cedilla
/onesuperior /ordmasculine /guillemotright /onequarter /onehalf
/threequarters /questiondown /Agrave /Aacute /Acircumflex
/Atilde /Adieresis /Aring /AE /Ccedilla
/Egrave /Eacute /Ecircumflex /Edieresis /Igrave
/Iacute /Icircumflex /Idieresis /Eth /Ntilde
/Ograve /Oacute /Ocircumflex /Otilde /Odieresis
/multiply /Oslash /Ugrave /Uacute /Ucircumflex
/Udieresis /Yacute /Thorn /germandbls /agrave
/aacute /acircumflex /atilde /adieresis /aring
/ae /ccedilla /egrave /eacute /ecircumflex
/edieresis /igrave /iacute /icircumflex /idieresis
/eth /ntilde /ograve /oacute /ocircumflex
/otilde /odieresis /divide /oslash /ugrave
/uacute /ucircumflex /udieresis /yacute /thorn
/ydieresis
] def
%%EndResource
%FOPBeginFontReencode
/Courier-Oblique findfont
dup length dict begin
  {1 index /FID ne {def} {pop pop} ifelse} forall
  /Encoding WinAnsiEncoding def
  currentdict
end
/Courier-Oblique exch definefont pop
/Courier-BoldOblique findfont
dup length dict begin
  {1 index /FID ne {def} {pop pop} ifelse} forall
  /Encoding WinAnsiEncoding def
  currentdict
end
/Courier-BoldOblique exch definefont pop
/Courier-Bold findfont
dup length dict begin
  {1 index /FID ne {def} {pop pop} ifelse} forall
  /Encoding WinAnsiEncoding def
  currentdict
end
/Courier-Bold exch definefont pop
/Helvetica findfont
dup length dict begin
  {1 index /FID ne {def} {pop pop} ifelse} forall
  /Encoding WinAnsiEncoding def
  currentdict
end
/Helvetica exch definefont pop
/Helvetica-Oblique findfont
dup length dict begin
  {1 index /FID ne {def} {pop pop} ifelse} forall
  /Encoding WinAnsiEncoding def
  currentdict
end
/Helvetica-Oblique exch definefont pop
/Helvetica-Bold findfont
dup length dict begin
  {1 index /FID ne {def} {pop pop} ifelse} forall
  /Encoding WinAnsiEncoding def
  currentdict
end
/Helvetica-Bold exch definefont pop
/Helvetica-BoldOblique findfont
dup length dict begin
  {1 index /FID ne {def} {pop pop} ifelse} forall
  /Encoding WinAnsiEncoding def
  currentdict
end
/Helvetica-BoldOblique exch definefont pop
/Times-Roman findfont
dup length dict begin
  {1 index /FID ne {def} {pop pop} ifelse} forall
  /Encoding WinAnsiEncoding def
  currentdict
end
/Times-Roman exch definefont pop
/Times-Italic findfont
dup length dict begin
  {1 index /FID ne {def} {pop pop} ifelse} forall
  /Encoding WinAnsiEncoding def
  currentdict
end
/Times-Italic exch definefont pop
/Times-Bold findfont
dup length dict begin
  {1 index /FID ne {def} {pop pop} ifelse} forall
  /Encoding WinAnsiEncoding def
  currentdict
end
/Times-Bold exch definefont pop
/Times-BoldItalic findfont
dup length dict begin
  {1 index /FID ne {def} {pop pop} ifelse} forall
  /Encoding WinAnsiEncoding def
  currentdict
end
/Times-BoldItalic exch definefont pop
/Courier findfont
dup length dict begin
  {1 index /FID ne {def} {pop pop} ifelse} forall
  /Encoding WinAnsiEncoding def
  currentdict
end
/Courier exch definefont pop
%FOPEndFontReencode
%%EndProlog
%%Page: 1 1
%%PageBoundingBox: 0 0 1024 288
%%BeginPageSetup
[1 0 0 -1 0 288] CT
%%EndPageSetup
GS
1 GC
N
0 0 1024 288 re
f
GR
GS
1 GC
N
0 0 1024 288 re
f
GR
GS
1 GC
N
133 238.5 M
476 238.5 L
476 26.5 L
133 26.5 L
cp
f
GR
GS
0.149 GC
2 setlinecap
1 LJ
0.5 LW
N
133 238.5 M
476 238.5 L
S
GR
GS
0.149 GC
2 setlinecap
1 LJ
0.5 LW
N
133 238.5 M
133 235.07 L
S
GR
GS
0.149 GC
2 setlinecap
1 LJ
0.5 LW
N
218.75 238.5 M
218.75 235.07 L
S
GR
GS
0.149 GC
2 setlinecap
1 LJ
0.5 LW
N
304.5 238.5 M
304.5 235.07 L
S
GR
GS
0.149 GC
2 setlinecap
1 LJ
0.5 LW
N
390.25 238.5 M
390.25 235.07 L
S
GR
GS
0.149 GC
2 setlinecap
1 LJ
0.5 LW
N
476 238.5 M
476 235.07 L
S
GR
GS
[1 0 0 1 133 244.09995] CT
0.149 GC
/Helvetica 18 F
GS
[1 0 0 1 0 0] CT
-5.5 18 moveto 
1 -1 scale
(0) t 
GR
GR
GS
[1 0 0 1 218.75 244.09995] CT
0.149 GC
/Helvetica 18 F
GS
[1 0 0 1 0 0] CT
-13 18 moveto 
1 -1 scale
(0.5) t 
GR
GR
GS
[1 0 0 1 304.5 244.09995] CT
0.149 GC
/Helvetica 18 F
GS
[1 0 0 1 0 0] CT
-5.5 18 moveto 
1 -1 scale
(1) t 
GR
GR
GS
[1 0 0 1 390.25 244.09995] CT
0.149 GC
/Helvetica 18 F
GS
[1 0 0 1 0 0] CT
-13 18 moveto 
1 -1 scale
(1.5) t 
GR
GR
GS
[1 0 0 1 476 244.09995] CT
0.149 GC
/Helvetica 18 F
GS
[1 0 0 1 0 0] CT
-5.5 18 moveto 
1 -1 scale
(2) t 
GR
GR
GS
[1 0 0 1 304.50015 266.60004] CT
0.149 GC
/Helvetica 18 F
GS
[1 0 0 1 0 0] CT
-60.5 18 moveto 
1 -1 scale
(Frequency \(Hz\)) t 
GR
GR
GS
0.149 GC
2 setlinecap
1 LJ
0.5 LW
N
133 238.5 M
133 26.5 L
S
GR
GS
0.149 GC
2 setlinecap
1 LJ
0.5 LW
N
133 238.5 M
136.43 238.5 L
S
GR
GS
0.149 GC
2 setlinecap
1 LJ
0.5 LW
N
133 185.5 M
136.43 185.5 L
S
GR
GS
0.149 GC
2 setlinecap
1 LJ
0.5 LW
N
133 132.5 M
136.43 132.5 L
S
GR
GS
0.149 GC
2 setlinecap
1 LJ
0.5 LW
N
133 79.5 M
136.43 79.5 L
S
GR
GS
0.149 GC
2 setlinecap
1 LJ
0.5 LW
N
133 26.5 M
136.43 26.5 L
S
GR
GS
[1 0 0 1 127.4 238.5] CT
0.149 GC
/Helvetica 18 F
GS
[1 0 0 1 0 0] CT
-33 7 moveto 
1 -1 scale
(-9.5) t 
GR
GR
GS
[1 0 0 1 127.4 185.5] CT
0.149 GC
/Helvetica 18 F
GS
[1 0 0 1 0 0] CT
-18 7 moveto 
1 -1 scale
(-9) t 
GR
GR
GS
[1 0 0 1 127.4 132.5] CT
0.149 GC
/Helvetica 18 F
GS
[1 0 0 1 0 0] CT
-33 7 moveto 
1 -1 scale
(-8.5) t 
GR
GR
GS
[1 0 0 1 127.4 79.5] CT
0.149 GC
/Helvetica 18 F
GS
[1 0 0 1 0 0] CT
-18 7 moveto 
1 -1 scale
(-8) t 
GR
GR
GS
[1 0 0 1 127.4 26.5] CT
0.149 GC
/Helvetica 18 F
GS
[1 0 0 1 0 0] CT
-33 7 moveto 
1 -1 scale
(-7.5) t 
GR
GR
GS
[0 -1 1 0 91.9 132.49989] CT
0.149 GC
/Helvetica 18 F
GS
[1 0 0 1 0 0] CT
-55.5 -4 moveto 
1 -1 scale
(Power \(log10\)) t 
GR
GR
GS
[1 0 0 1 304.50027 24.25] CT
/Helvetica-Bold 18 F
GS
[1 0 0 1 0 0] CT
-108.5 -4 moveto 
1 -1 scale
(Non-normalized estimate) t 
GR
GR
GS
0 0.447 0.741 RC
1 LJ
2 LW
N
183.152 54.593 M
234.778 84.307 L
267.42 105.19 L
288.244 103.343 L
304.5 97.553 L
317.836 120.902 L
329.143 143.153 L
339.871 157.222 L
348.441 161.619 L
356.127 169.81 L
363.093 176.535 L
369.462 184.172 L
375.892 187.741 L
381.292 188.82 L
386.326 183.007 L
391.042 195.042 L
395.477 199.119 L
400.068 202.486 L
404.01 205.855 L
407.753 205.766 L
411.318 212.467 L
414.719 211.728 L
418.29 210.713 L
421.394 216.256 L
424.373 216.256 L
427.238 219.185 L
429.997 220.615 L
432.918 220.981 L
435.478 225.449 L
437.953 222.94 L
S
GR
GS
0.851 0.325 0.098 RC
1 LJ
2 LW
N
183.152 54.624 M
234.778 84.938 L
267.42 102.108 L
288.244 110.343 L
304.5 108.93 L
317.836 123.463 L
329.143 144.788 L
339.871 156.847 L
348.441 164.187 L
356.127 169.947 L
363.093 178.736 L
369.462 179.799 L
375.892 187.358 L
381.292 189.938 L
386.326 182.784 L
391.042 193.473 L
395.477 198.65 L
400.068 201.184 L
404.01 199.797 L
407.753 205.085 L
411.318 206.809 L
414.719 210.74 L
418.29 212.117 L
421.394 212.154 L
424.373 217.42 L
427.238 218.496 L
429.997 218.198 L
432.918 224.476 L
435.478 223.308 L
437.953 216.96 L
S
GR
GS
0.929 0.694 0.125 RC
1 LJ
2 LW
N
183.152 55.307 M
234.778 84.812 L
267.42 104.186 L
288.244 113.618 L
304.5 106.055 L
317.836 123.936 L
329.143 143.5 L
339.871 158.757 L
348.441 167.129 L
356.127 170.352 L
363.093 177.03 L
369.462 180.352 L
375.892 184.357 L
381.292 187.012 L
386.326 181.589 L
391.042 194.204 L
395.477 197.674 L
400.068 197.986 L
404.01 202.861 L
407.753 204.215 L
411.318 208.548 L
414.719 210.397 L
418.29 211.482 L
421.394 213.885 L
424.373 215.775 L
427.238 218.231 L
429.997 216.384 L
432.918 221.607 L
435.478 219.735 L
437.953 214.605 L
S
GR
GS
0.494 0.184 0.557 RC
1 LJ
2 LW
N
183.152 55.883 M
234.778 84.53 L
267.42 104.647 L
288.244 112.273 L
304.5 106.16 L
317.836 126.12 L
329.143 144.406 L
339.871 158.442 L
348.441 163.728 L
356.127 170.797 L
363.093 176.436 L
369.462 183.369 L
375.892 187.845 L
381.292 190.674 L
386.326 180.58 L
391.042 193.805 L
395.477 195.807 L
400.068 198.803 L
404.01 200.62 L
407.753 204.562 L
411.318 205.838 L
414.719 206.789 L
418.29 210.795 L
421.394 213.622 L
424.373 213.553 L
427.238 216.354 L
429.997 214.929 L
432.918 219.838 L
435.478 218.376 L
437.953 216.491 L
S
GR
GS
[1 0 0 1 408 47.25] CT
/Helvetica 18 F
GS
[1 0 0 1 0 0] CT
0 7 moveto 
1 -1 scale
(Load 1) t 
GR
GR
GS
0 0.447 0.741 RC
1 LJ
2 LW
N
375 47.25 M
405 47.25 L
S
GR
GS
[1 0 0 1 408 69.25] CT
/Helvetica 18 F
GS
[1 0 0 1 0 0] CT
0 7 moveto 
1 -1 scale
(Load 2) t 
GR
GR
GS
0.851 0.325 0.098 RC
1 LJ
2 LW
N
375 69.25 M
405 69.25 L
S
GR
GS
[1 0 0 1 408 91.25] CT
/Helvetica 18 F
GS
[1 0 0 1 0 0] CT
0 7 moveto 
1 -1 scale
(Load 3) t 
GR
GR
GS
0.929 0.694 0.125 RC
1 LJ
2 LW
N
375 91.25 M
405 91.25 L
S
GR
GS
[1 0 0 1 408 113.25] CT
/Helvetica 18 F
GS
[1 0 0 1 0 0] CT
0 7 moveto 
1 -1 scale
(Load 4) t 
GR
GR
GS
0.494 0.184 0.557 RC
1 LJ
2 LW
N
375 113.25 M
405 113.25 L
S
GR
GS
1 GC
N
584 238.5 M
926.5 238.5 L
926.5 26.5 L
584 26.5 L
cp
f
GR
GS
0.149 GC
2 setlinecap
1 LJ
0.5 LW
N
584 238.5 M
926.5 238.5 L
S
GR
GS
0.149 GC
2 setlinecap
1 LJ
0.5 LW
N
584 238.5 M
584 235.075 L
S
GR
GS
0.149 GC
2 setlinecap
1 LJ
0.5 LW
N
698.167 238.5 M
698.167 235.075 L
S
GR
GS
0.149 GC
2 setlinecap
1 LJ
0.5 LW
N
812.333 238.5 M
812.333 235.075 L
S
GR
GS
0.149 GC
2 setlinecap
1 LJ
0.5 LW
N
926.5 238.5 M
926.5 235.075 L
S
GR
GS
[1 0 0 1 584 244.10001] CT
0.149 GC
/Helvetica 18 F
GS
[1 0 0 1 0 0] CT
-5.5 18 moveto 
1 -1 scale
(0) t 
GR
GR
GS
[1 0 0 1 698.16669 244.10001] CT
0.149 GC
/Helvetica 18 F
GS
[1 0 0 1 0 0] CT
-10.5 18 moveto 
1 -1 scale
(20) t 
GR
GR
GS
[1 0 0 1 812.33331 244.10001] CT
0.149 GC
/Helvetica 18 F
GS
[1 0 0 1 0 0] CT
-10.5 18 moveto 
1 -1 scale
(40) t 
GR
GR
GS
[1 0 0 1 926.5 244.10001] CT
0.149 GC
/Helvetica 18 F
GS
[1 0 0 1 0 0] CT
-10.5 18 moveto 
1 -1 scale
(60) t 
GR
GR
GS
[1 0 0 1 755.25018 266.60001] CT
0.149 GC
/Helvetica 18 F
GS
[1 0 0 1 0 0] CT
-60.5 18 moveto 
1 -1 scale
(Frequency \(Hz\)) t 
GR
GR
GS
0.149 GC
2 setlinecap
1 LJ
0.5 LW
N
584 238.5 M
584 26.5 L
S
GR
GS
0.149 GC
2 setlinecap
1 LJ
0.5 LW
N
584 221.828 M
587.425 221.828 L
S
GR
GS
0.149 GC
2 setlinecap
1 LJ
0.5 LW
N
584 176.521 M
587.425 176.521 L
S
GR
GS
0.149 GC
2 setlinecap
1 LJ
0.5 LW
N
584 131.213 M
587.425 131.213 L
S
GR
GS
0.149 GC
2 setlinecap
1 LJ
0.5 LW
N
584 85.906 M
587.425 85.906 L
S
GR
GS
0.149 GC
2 setlinecap
1 LJ
0.5 LW
N
584 40.599 M
587.425 40.599 L
S
GR
GS
[1 0 0 1 578.40002 221.82767] CT
0.149 GC
/Helvetica 18 F
GS
[1 0 0 1 0 0] CT
-33 7 moveto 
1 -1 scale
(-0.2) t 
GR
GR
GS
[1 0 0 1 578.40002 176.52052] CT
0.149 GC
/Helvetica 18 F
GS
[1 0 0 1 0 0] CT
-33 7 moveto 
1 -1 scale
(-0.1) t 
GR
GR
GS
[1 0 0 1 578.40002 131.21336] CT
0.149 GC
/Helvetica 18 F
GS
[1 0 0 1 0 0] CT
-11 7 moveto 
1 -1 scale
(0) t 
GR
GR
GS
[1 0 0 1 578.40002 85.90622] CT
0.149 GC
/Helvetica 18 F
GS
[1 0 0 1 0 0] CT
-26 7 moveto 
1 -1 scale
(0.1) t 
GR
GR
GS
[1 0 0 1 578.40002 40.59906] CT
0.149 GC
/Helvetica 18 F
GS
[1 0 0 1 0 0] CT
-26 7 moveto 
1 -1 scale
(0.2) t 
GR
GR
GS
[0 -1 1 0 542.90002 132.49989] CT
0.149 GC
/Helvetica 18 F
GS
[1 0 0 1 0 0] CT
-56.5 -4 moveto 
1 -1 scale
(Power \(norm.\)) t 
GR
GR
GS
[1 0 0 1 755.25073 24.24999] CT
/Helvetica-Bold 18 F
GS
[1 0 0 1 0 0] CT
-139 -4 moveto 
1 -1 scale
(Spectrally-normalized estimates) t 
GR
GR
GS
0 0.447 0.741 RC
1 LJ
2 LW
N
595.193 131.213 M
606.386 238.5 L
618.698 230.028 L
629.891 204.417 L
641.083 47.297 L
652.276 171.451 L
663.469 200.877 L
675.781 171.652 L
686.974 145.866 L
698.167 133.803 L
709.359 133.637 L
720.552 139.432 L
732.864 150.515 L
744.057 172.39 L
755.25 54.16 L
766.443 179.381 L
777.636 135.808 L
789.948 137.467 L
801.141 139.398 L
812.333 130.366 L
823.526 135.268 L
834.719 129.436 L
847.031 138.196 L
858.224 127.452 L
869.417 135.083 L
880.609 138.713 L
891.802 121.721 L
904.114 142.061 L
915.307 139.885 L
926.5 131.213 L
S
GR
GS
0.851 0.325 0.098 RC
1 LJ
2 LW
N
595.193 131.213 M
606.386 225.088 L
618.698 221.829 L
629.891 201.64 L
641.083 26.5 L
652.276 167.703 L
663.469 195.155 L
675.781 178.848 L
686.974 144.457 L
698.167 132.416 L
709.359 140.445 L
720.552 143.025 L
732.864 149.682 L
744.057 183.006 L
755.25 55.122 L
766.443 183.799 L
777.636 127.533 L
789.948 134.956 L
801.141 133.713 L
812.333 138.646 L
823.526 133.654 L
834.719 133.68 L
847.031 135.324 L
858.224 121.866 L
869.417 138.642 L
880.609 135.613 L
891.802 132.71 L
904.114 139.327 L
915.307 133.857 L
926.5 131.213 L
S
GR
GS
0.929 0.694 0.125 RC
1 LJ
2 LW
N
595.193 131.213 M
606.386 233.381 L
618.698 204.232 L
629.891 213.303 L
641.083 74.641 L
652.276 161.603 L
663.469 184.857 L
675.781 171.75 L
686.974 153.068 L
698.167 124.459 L
709.359 146.411 L
720.552 127.896 L
732.864 146.21 L
744.057 178.403 L
755.25 53.038 L
766.443 179.635 L
777.636 139.885 L
789.948 118.34 L
801.141 146.275 L
812.333 134.654 L
823.526 128.757 L
834.719 136.735 L
847.031 125.588 L
858.224 138.222 L
869.417 131.49 L
880.609 126.384 L
891.802 135.685 L
904.114 130.649 L
915.307 143.077 L
926.5 131.213 L
S
GR
GS
0.494 0.184 0.557 RC
1 LJ
2 LW
N
595.193 131.213 M
606.386 220.153 L
618.698 215.996 L
629.891 204.402 L
641.083 53.986 L
652.276 158.981 L
663.469 190.214 L
675.781 174.433 L
686.974 154.075 L
698.167 138.665 L
709.359 136.775 L
720.552 142.207 L
732.864 146.558 L
744.057 181.76 L
755.25 50.519 L
766.443 191.408 L
777.636 124.252 L
789.948 142.266 L
801.141 135.704 L
812.333 133.568 L
823.526 122.901 L
834.719 135.838 L
847.031 136.244 L
858.224 120.404 L
869.417 140.2 L
880.609 124.076 L
891.802 121.821 L
904.114 139.81 L
915.307 136.882 L
926.5 131.213 L
S
GR
%%Trailer
%%Pages: 1
%%EOF
