%!PS-Adobe-3.0 EPSF-3.0
%%Creator: (MATLAB, The Mathworks, Inc. Version 9.8.0.1323502 \(R2020a\). Operating System: Mac OS X)
%%Title: /Users/kosciessa/Volumes/tardis/LNDG/stateswitch/stsw_eeg_task/ssvep/figures/b_SpectraNormalized_YAOA.eps
%%CreationDate: 2022-02-14T15:19:12
%%Pages: (atend)
%%BoundingBox:    74     0   936   282
%%LanguageLevel: 3
%%EndComments
%%BeginProlog
%%BeginResource: procset (Apache XML Graphics Std ProcSet) 1.2 0
%%Version: 1.2 0
%%Copyright: (Copyright 2001-2003,2010 The Apache Software Foundation. License terms: http://www.apache.org/licenses/LICENSE-2.0)
/bd{bind def}bind def
/ld{load def}bd
/GR/grestore ld
/GS/gsave ld
/RM/rmoveto ld
/C/curveto ld
/t/show ld
/L/lineto ld
/ML/setmiterlimit ld
/CT/concat ld
/f/fill ld
/N/newpath ld
/S/stroke ld
/CC/setcmykcolor ld
/A/ashow ld
/cp/closepath ld
/RC/setrgbcolor ld
/LJ/setlinejoin ld
/GC/setgray ld
/LW/setlinewidth ld
/M/moveto ld
/re {4 2 roll M
1 index 0 rlineto
0 exch rlineto
neg 0 rlineto
cp } bd
/_ctm matrix def
/_tm matrix def
/BT { _ctm currentmatrix pop matrix _tm copy pop 0 0 moveto } bd
/ET { _ctm setmatrix } bd
/iTm { _ctm setmatrix _tm concat } bd
/Tm { _tm astore pop iTm 0 0 moveto } bd
/ux 0.0 def
/uy 0.0 def
/F {
  /Tp exch def
  /Tf exch def
  Tf findfont Tp scalefont setfont
  /cf Tf def  /cs Tp def
} bd
/ULS {currentpoint /uy exch def /ux exch def} bd
/ULE {
  /Tcx currentpoint pop def
  gsave
  newpath
  cf findfont cs scalefont dup
  /FontMatrix get 0 get /Ts exch def /FontInfo get dup
  /UnderlinePosition get Ts mul /To exch def
  /UnderlineThickness get Ts mul /Tt exch def
  ux uy To add moveto  Tcx uy To add lineto
  Tt setlinewidth stroke
  grestore
} bd
/OLE {
  /Tcx currentpoint pop def
  gsave
  newpath
  cf findfont cs scalefont dup
  /FontMatrix get 0 get /Ts exch def /FontInfo get dup
  /UnderlinePosition get Ts mul /To exch def
  /UnderlineThickness get Ts mul /Tt exch def
  ux uy To add cs add moveto Tcx uy To add cs add lineto
  Tt setlinewidth stroke
  grestore
} bd
/SOE {
  /Tcx currentpoint pop def
  gsave
  newpath
  cf findfont cs scalefont dup
  /FontMatrix get 0 get /Ts exch def /FontInfo get dup
  /UnderlinePosition get Ts mul /To exch def
  /UnderlineThickness get Ts mul /Tt exch def
  ux uy To add cs 10 mul 26 idiv add moveto Tcx uy To add cs 10 mul 26 idiv add lineto
  Tt setlinewidth stroke
  grestore
} bd
/QT {
/Y22 exch store
/X22 exch store
/Y21 exch store
/X21 exch store
currentpoint
/Y21 load 2 mul add 3 div exch
/X21 load 2 mul add 3 div exch
/X21 load 2 mul /X22 load add 3 div
/Y21 load 2 mul /Y22 load add 3 div
/X22 load /Y22 load curveto
} bd
/SSPD {
dup length /d exch dict def
{
/v exch def
/k exch def
currentpagedevice k known {
/cpdv currentpagedevice k get def
v cpdv ne {
/upd false def
/nullv v type /nulltype eq def
/nullcpdv cpdv type /nulltype eq def
nullv nullcpdv or
{
/upd true def
} {
/sametype v type cpdv type eq def
sametype {
v type /arraytype eq {
/vlen v length def
/cpdvlen cpdv length def
vlen cpdvlen eq {
0 1 vlen 1 sub {
/i exch def
/obj v i get def
/cpdobj cpdv i get def
obj cpdobj ne {
/upd true def
exit
} if
} for
} {
/upd true def
} ifelse
} {
v type /dicttype eq {
v {
/dv exch def
/dk exch def
/cpddv cpdv dk get def
dv cpddv ne {
/upd true def
exit
} if
} forall
} {
/upd true def
} ifelse
} ifelse
} if
} ifelse
upd true eq {
d k v put
} if
} if
} if
} forall
d length 0 gt {
d setpagedevice
} if
} bd
/RE { % /NewFontName [NewEncodingArray] /FontName RE -
  findfont dup length dict begin
  {
    1 index /FID ne
    {def} {pop pop} ifelse
  } forall
  /Encoding exch def
  /FontName 1 index def
  currentdict definefont pop
  end
} bind def
%%EndResource
%%BeginResource: procset (Apache XML Graphics EPS ProcSet) 1.0 0
%%Version: 1.0 0
%%Copyright: (Copyright 2002-2003 The Apache Software Foundation. License terms: http://www.apache.org/licenses/LICENSE-2.0)
/BeginEPSF { %def
/b4_Inc_state save def         % Save state for cleanup
/dict_count countdictstack def % Count objects on dict stack
/op_count count 1 sub def      % Count objects on operand stack
userdict begin                 % Push userdict on dict stack
/showpage { } def              % Redefine showpage, { } = null proc
0 setgray 0 setlinecap         % Prepare graphics state
1 setlinewidth 0 setlinejoin
10 setmiterlimit [ ] 0 setdash newpath
/languagelevel where           % If level not equal to 1 then
{pop languagelevel             % set strokeadjust and
1 ne                           % overprint to their defaults.
{false setstrokeadjust false setoverprint
} if
} if
} bd
/EndEPSF { %def
count op_count sub {pop} repeat            % Clean up stacks
countdictstack dict_count sub {end} repeat
b4_Inc_state restore
} bd
%%EndResource
%FOPBeginFontDict
%%IncludeResource: font Courier-Oblique
%%IncludeResource: font Courier-BoldOblique
%%IncludeResource: font Courier-Bold
%%IncludeResource: font ZapfDingbats
%%IncludeResource: font Symbol
%%IncludeResource: font Helvetica
%%IncludeResource: font Helvetica-Oblique
%%IncludeResource: font Helvetica-Bold
%%IncludeResource: font Helvetica-BoldOblique
%%IncludeResource: font Times-Roman
%%IncludeResource: font Times-Italic
%%IncludeResource: font Times-Bold
%%IncludeResource: font Times-BoldItalic
%%IncludeResource: font Courier
%FOPEndFontDict
%%BeginResource: encoding WinAnsiEncoding
/WinAnsiEncoding [
/.notdef /.notdef /.notdef /.notdef /.notdef
/.notdef /.notdef /.notdef /.notdef /.notdef
/.notdef /.notdef /.notdef /.notdef /.notdef
/.notdef /.notdef /.notdef /.notdef /.notdef
/.notdef /.notdef /.notdef /.notdef /.notdef
/.notdef /.notdef /.notdef /.notdef /.notdef
/.notdef /.notdef /space /exclam /quotedbl
/numbersign /dollar /percent /ampersand /quotesingle
/parenleft /parenright /asterisk /plus /comma
/hyphen /period /slash /zero /one
/two /three /four /five /six
/seven /eight /nine /colon /semicolon
/less /equal /greater /question /at
/A /B /C /D /E
/F /G /H /I /J
/K /L /M /N /O
/P /Q /R /S /T
/U /V /W /X /Y
/Z /bracketleft /backslash /bracketright /asciicircum
/underscore /quoteleft /a /b /c
/d /e /f /g /h
/i /j /k /l /m
/n /o /p /q /r
/s /t /u /v /w
/x /y /z /braceleft /bar
/braceright /asciitilde /bullet /Euro /bullet
/quotesinglbase /florin /quotedblbase /ellipsis /dagger
/daggerdbl /circumflex /perthousand /Scaron /guilsinglleft
/OE /bullet /Zcaron /bullet /bullet
/quoteleft /quoteright /quotedblleft /quotedblright /bullet
/endash /emdash /asciitilde /trademark /scaron
/guilsinglright /oe /bullet /zcaron /Ydieresis
/space /exclamdown /cent /sterling /currency
/yen /brokenbar /section /dieresis /copyright
/ordfeminine /guillemotleft /logicalnot /sfthyphen /registered
/macron /degree /plusminus /twosuperior /threesuperior
/acute /mu /paragraph /middot /cedilla
/onesuperior /ordmasculine /guillemotright /onequarter /onehalf
/threequarters /questiondown /Agrave /Aacute /Acircumflex
/Atilde /Adieresis /Aring /AE /Ccedilla
/Egrave /Eacute /Ecircumflex /Edieresis /Igrave
/Iacute /Icircumflex /Idieresis /Eth /Ntilde
/Ograve /Oacute /Ocircumflex /Otilde /Odieresis
/multiply /Oslash /Ugrave /Uacute /Ucircumflex
/Udieresis /Yacute /Thorn /germandbls /agrave
/aacute /acircumflex /atilde /adieresis /aring
/ae /ccedilla /egrave /eacute /ecircumflex
/edieresis /igrave /iacute /icircumflex /idieresis
/eth /ntilde /ograve /oacute /ocircumflex
/otilde /odieresis /divide /oslash /ugrave
/uacute /ucircumflex /udieresis /yacute /thorn
/ydieresis
] def
%%EndResource
%FOPBeginFontReencode
/Courier-Oblique findfont
dup length dict begin
  {1 index /FID ne {def} {pop pop} ifelse} forall
  /Encoding WinAnsiEncoding def
  currentdict
end
/Courier-Oblique exch definefont pop
/Courier-BoldOblique findfont
dup length dict begin
  {1 index /FID ne {def} {pop pop} ifelse} forall
  /Encoding WinAnsiEncoding def
  currentdict
end
/Courier-BoldOblique exch definefont pop
/Courier-Bold findfont
dup length dict begin
  {1 index /FID ne {def} {pop pop} ifelse} forall
  /Encoding WinAnsiEncoding def
  currentdict
end
/Courier-Bold exch definefont pop
/Helvetica findfont
dup length dict begin
  {1 index /FID ne {def} {pop pop} ifelse} forall
  /Encoding WinAnsiEncoding def
  currentdict
end
/Helvetica exch definefont pop
/Helvetica-Oblique findfont
dup length dict begin
  {1 index /FID ne {def} {pop pop} ifelse} forall
  /Encoding WinAnsiEncoding def
  currentdict
end
/Helvetica-Oblique exch definefont pop
/Helvetica-Bold findfont
dup length dict begin
  {1 index /FID ne {def} {pop pop} ifelse} forall
  /Encoding WinAnsiEncoding def
  currentdict
end
/Helvetica-Bold exch definefont pop
/Helvetica-BoldOblique findfont
dup length dict begin
  {1 index /FID ne {def} {pop pop} ifelse} forall
  /Encoding WinAnsiEncoding def
  currentdict
end
/Helvetica-BoldOblique exch definefont pop
/Times-Roman findfont
dup length dict begin
  {1 index /FID ne {def} {pop pop} ifelse} forall
  /Encoding WinAnsiEncoding def
  currentdict
end
/Times-Roman exch definefont pop
/Times-Italic findfont
dup length dict begin
  {1 index /FID ne {def} {pop pop} ifelse} forall
  /Encoding WinAnsiEncoding def
  currentdict
end
/Times-Italic exch definefont pop
/Times-Bold findfont
dup length dict begin
  {1 index /FID ne {def} {pop pop} ifelse} forall
  /Encoding WinAnsiEncoding def
  currentdict
end
/Times-Bold exch definefont pop
/Times-BoldItalic findfont
dup length dict begin
  {1 index /FID ne {def} {pop pop} ifelse} forall
  /Encoding WinAnsiEncoding def
  currentdict
end
/Times-BoldItalic exch definefont pop
/Courier findfont
dup length dict begin
  {1 index /FID ne {def} {pop pop} ifelse} forall
  /Encoding WinAnsiEncoding def
  currentdict
end
/Courier exch definefont pop
%FOPEndFontReencode
%%EndProlog
%%Page: 1 1
%%PageBoundingBox: 0 0 1024 288
%%BeginPageSetup
[1 0 0 -1 0 288] CT
%%EndPageSetup
GS
1 GC
N
0 0 1024 288 re
f
GR
GS
1 GC
N
0 0 1024 288 re
f
GR
GS
1 GC
N
133 238.5 M
476 238.5 L
476 26.5 L
133 26.5 L
cp
f
GR
GS
0.149 GC
2 setlinecap
1 LJ
0.5 LW
N
133 238.5 M
476 238.5 L
S
GR
GS
0.149 GC
2 setlinecap
1 LJ
0.5 LW
N
133 238.5 M
133 235.07 L
S
GR
GS
0.149 GC
2 setlinecap
1 LJ
0.5 LW
N
218.75 238.5 M
218.75 235.07 L
S
GR
GS
0.149 GC
2 setlinecap
1 LJ
0.5 LW
N
304.5 238.5 M
304.5 235.07 L
S
GR
GS
0.149 GC
2 setlinecap
1 LJ
0.5 LW
N
390.25 238.5 M
390.25 235.07 L
S
GR
GS
0.149 GC
2 setlinecap
1 LJ
0.5 LW
N
476 238.5 M
476 235.07 L
S
GR
GS
[1 0 0 1 133 244.09995] CT
0.149 GC
/Helvetica 18 F
GS
[1 0 0 1 0 0] CT
-5.5 18 moveto 
1 -1 scale
(0) t 
GR
GR
GS
[1 0 0 1 218.75 244.09995] CT
0.149 GC
/Helvetica 18 F
GS
[1 0 0 1 0 0] CT
-13 18 moveto 
1 -1 scale
(0.5) t 
GR
GR
GS
[1 0 0 1 304.5 244.09995] CT
0.149 GC
/Helvetica 18 F
GS
[1 0 0 1 0 0] CT
-5.5 18 moveto 
1 -1 scale
(1) t 
GR
GR
GS
[1 0 0 1 390.25 244.09995] CT
0.149 GC
/Helvetica 18 F
GS
[1 0 0 1 0 0] CT
-13 18 moveto 
1 -1 scale
(1.5) t 
GR
GR
GS
[1 0 0 1 476 244.09995] CT
0.149 GC
/Helvetica 18 F
GS
[1 0 0 1 0 0] CT
-5.5 18 moveto 
1 -1 scale
(2) t 
GR
GR
GS
[1 0 0 1 304.50015 266.60004] CT
0.149 GC
/Helvetica 18 F
GS
[1 0 0 1 0 0] CT
-60.5 18 moveto 
1 -1 scale
(Frequency \(Hz\)) t 
GR
GR
GS
0.149 GC
2 setlinecap
1 LJ
0.5 LW
N
133 238.5 M
133 26.5 L
S
GR
GS
0.149 GC
2 setlinecap
1 LJ
0.5 LW
N
133 238.5 M
136.43 238.5 L
S
GR
GS
0.149 GC
2 setlinecap
1 LJ
0.5 LW
N
133 185.5 M
136.43 185.5 L
S
GR
GS
0.149 GC
2 setlinecap
1 LJ
0.5 LW
N
133 132.5 M
136.43 132.5 L
S
GR
GS
0.149 GC
2 setlinecap
1 LJ
0.5 LW
N
133 79.5 M
136.43 79.5 L
S
GR
GS
0.149 GC
2 setlinecap
1 LJ
0.5 LW
N
133 26.5 M
136.43 26.5 L
S
GR
GS
[1 0 0 1 127.4 238.5] CT
0.149 GC
/Helvetica 18 F
GS
[1 0 0 1 0 0] CT
-33 7 moveto 
1 -1 scale
(-9.5) t 
GR
GR
GS
[1 0 0 1 127.4 185.5] CT
0.149 GC
/Helvetica 18 F
GS
[1 0 0 1 0 0] CT
-18 7 moveto 
1 -1 scale
(-9) t 
GR
GR
GS
[1 0 0 1 127.4 132.5] CT
0.149 GC
/Helvetica 18 F
GS
[1 0 0 1 0 0] CT
-33 7 moveto 
1 -1 scale
(-8.5) t 
GR
GR
GS
[1 0 0 1 127.4 79.5] CT
0.149 GC
/Helvetica 18 F
GS
[1 0 0 1 0 0] CT
-18 7 moveto 
1 -1 scale
(-8) t 
GR
GR
GS
[1 0 0 1 127.4 26.5] CT
0.149 GC
/Helvetica 18 F
GS
[1 0 0 1 0 0] CT
-33 7 moveto 
1 -1 scale
(-7.5) t 
GR
GR
GS
[0 -1 1 0 91.9 132.49989] CT
0.149 GC
/Helvetica 18 F
GS
[1 0 0 1 0 0] CT
-55.5 -4 moveto 
1 -1 scale
(Power \(log10\)) t 
GR
GR
GS
[1 0 0 1 304.50027 24.25] CT
/Helvetica-Bold 18 F
GS
[1 0 0 1 0 0] CT
-108.5 -4 moveto 
1 -1 scale
(Non-normalized estimate) t 
GR
GR
GS
0 0.447 0.741 RC
1 LJ
2 LW
N
183.152 61.037 M
234.778 88.386 L
267.42 107.946 L
288.244 113.473 L
304.5 112.716 L
317.836 130.403 L
329.143 145.663 L
339.871 158.866 L
348.441 166.142 L
356.127 172.069 L
363.093 181.764 L
369.462 187.278 L
375.892 192.435 L
381.292 195.863 L
386.326 188.552 L
391.042 202.615 L
395.477 204.8 L
400.068 208.327 L
404.01 210.316 L
407.753 211.185 L
411.318 214.397 L
414.719 218.479 L
418.29 218.208 L
421.394 220.101 L
424.373 223.688 L
427.238 222.027 L
429.997 226.32 L
432.918 225.69 L
435.478 226.084 L
437.953 225.686 L
S
GR
GS
0.851 0.325 0.098 RC
1 LJ
2 LW
N
183.152 58.767 M
234.778 86.123 L
267.42 107.071 L
288.244 116.001 L
304.5 115.787 L
317.836 127.481 L
329.143 146.427 L
339.871 158.997 L
348.441 167.496 L
356.127 173.213 L
363.093 180.415 L
369.462 187.31 L
375.892 190.993 L
381.292 193.825 L
386.326 187.859 L
391.042 200.881 L
395.477 202.895 L
400.068 206.42 L
404.01 211.528 L
407.753 214.777 L
411.318 214.009 L
414.719 215.002 L
418.29 217.134 L
421.394 220.154 L
424.373 223.211 L
427.238 223.722 L
429.997 223.818 L
432.918 225.51 L
435.478 226.549 L
437.953 226.48 L
S
GR
GS
0.929 0.694 0.125 RC
1 LJ
2 LW
N
183.152 59.597 M
234.778 87.223 L
267.42 106.272 L
288.244 118.267 L
304.5 116.779 L
317.836 130.496 L
329.143 146.88 L
339.871 160.394 L
348.441 169.458 L
356.127 175.176 L
363.093 182.427 L
369.462 187.322 L
375.892 192.57 L
381.292 194.181 L
386.326 187.61 L
391.042 199.091 L
395.477 205.104 L
400.068 206.12 L
404.01 209.517 L
407.753 210.573 L
411.318 213.406 L
414.719 214.944 L
418.29 217.473 L
421.394 218.478 L
424.373 219.154 L
427.238 222.438 L
429.997 222.901 L
432.918 224.341 L
435.478 224.734 L
437.953 226.089 L
S
GR
GS
0.494 0.184 0.557 RC
1 LJ
2 LW
N
183.152 58.533 M
234.778 88.311 L
267.42 108.386 L
288.244 116.657 L
304.5 117.431 L
317.836 130.24 L
329.143 145.309 L
339.871 160.678 L
348.441 168.157 L
356.127 173.322 L
363.093 181.563 L
369.462 189.61 L
375.892 193.352 L
381.292 195.879 L
386.326 186.357 L
391.042 200.09 L
395.477 205.431 L
400.068 205.911 L
404.01 211.287 L
407.753 211.252 L
411.318 213.61 L
414.719 216.457 L
418.29 217.82 L
421.394 218.925 L
424.373 220.849 L
427.238 220.27 L
429.997 224.28 L
432.918 226.169 L
435.478 226.691 L
437.953 225.525 L
S
GR
GS
[1 0 0 1 408 47.25] CT
/Helvetica 18 F
GS
[1 0 0 1 0 0] CT
0 7 moveto 
1 -1 scale
(Load 1) t 
GR
GR
GS
0 0.447 0.741 RC
1 LJ
2 LW
N
375 47.25 M
405 47.25 L
S
GR
GS
[1 0 0 1 408 69.25] CT
/Helvetica 18 F
GS
[1 0 0 1 0 0] CT
0 7 moveto 
1 -1 scale
(Load 2) t 
GR
GR
GS
0.851 0.325 0.098 RC
1 LJ
2 LW
N
375 69.25 M
405 69.25 L
S
GR
GS
[1 0 0 1 408 91.25] CT
/Helvetica 18 F
GS
[1 0 0 1 0 0] CT
0 7 moveto 
1 -1 scale
(Load 3) t 
GR
GR
GS
0.929 0.694 0.125 RC
1 LJ
2 LW
N
375 91.25 M
405 91.25 L
S
GR
GS
[1 0 0 1 408 113.25] CT
/Helvetica 18 F
GS
[1 0 0 1 0 0] CT
0 7 moveto 
1 -1 scale
(Load 4) t 
GR
GR
GS
0.494 0.184 0.557 RC
1 LJ
2 LW
N
375 113.25 M
405 113.25 L
S
GR
GS
1 GC
N
584 238.5 M
926.5 238.5 L
926.5 26.5 L
584 26.5 L
cp
f
GR
GS
0.149 GC
2 setlinecap
1 LJ
0.5 LW
N
584 238.5 M
926.5 238.5 L
S
GR
GS
0.149 GC
2 setlinecap
1 LJ
0.5 LW
N
584 238.5 M
584 235.075 L
S
GR
GS
0.149 GC
2 setlinecap
1 LJ
0.5 LW
N
698.167 238.5 M
698.167 235.075 L
S
GR
GS
0.149 GC
2 setlinecap
1 LJ
0.5 LW
N
812.333 238.5 M
812.333 235.075 L
S
GR
GS
0.149 GC
2 setlinecap
1 LJ
0.5 LW
N
926.5 238.5 M
926.5 235.075 L
S
GR
GS
[1 0 0 1 584 244.10001] CT
0.149 GC
/Helvetica 18 F
GS
[1 0 0 1 0 0] CT
-5.5 18 moveto 
1 -1 scale
(0) t 
GR
GR
GS
[1 0 0 1 698.16669 244.10001] CT
0.149 GC
/Helvetica 18 F
GS
[1 0 0 1 0 0] CT
-10.5 18 moveto 
1 -1 scale
(20) t 
GR
GR
GS
[1 0 0 1 812.33331 244.10001] CT
0.149 GC
/Helvetica 18 F
GS
[1 0 0 1 0 0] CT
-10.5 18 moveto 
1 -1 scale
(40) t 
GR
GR
GS
[1 0 0 1 926.5 244.10001] CT
0.149 GC
/Helvetica 18 F
GS
[1 0 0 1 0 0] CT
-10.5 18 moveto 
1 -1 scale
(60) t 
GR
GR
GS
[1 0 0 1 755.25018 266.60001] CT
0.149 GC
/Helvetica 18 F
GS
[1 0 0 1 0 0] CT
-60.5 18 moveto 
1 -1 scale
(Frequency \(Hz\)) t 
GR
GR
GS
0.149 GC
2 setlinecap
1 LJ
0.5 LW
N
584 238.5 M
584 26.5 L
S
GR
GS
0.149 GC
2 setlinecap
1 LJ
0.5 LW
N
584 238.5 M
587.425 238.5 L
S
GR
GS
0.149 GC
2 setlinecap
1 LJ
0.5 LW
N
584 196.1 M
587.425 196.1 L
S
GR
GS
0.149 GC
2 setlinecap
1 LJ
0.5 LW
N
584 153.7 M
587.425 153.7 L
S
GR
GS
0.149 GC
2 setlinecap
1 LJ
0.5 LW
N
584 111.3 M
587.425 111.3 L
S
GR
GS
0.149 GC
2 setlinecap
1 LJ
0.5 LW
N
584 68.9 M
587.425 68.9 L
S
GR
GS
0.149 GC
2 setlinecap
1 LJ
0.5 LW
N
584 26.5 M
587.425 26.5 L
S
GR
GS
[1 0 0 1 578.40002 238.5] CT
0.149 GC
/Helvetica 18 F
GS
[1 0 0 1 0 0] CT
-33 7 moveto 
1 -1 scale
(-0.3) t 
GR
GR
GS
[1 0 0 1 578.40002 196.10001] CT
0.149 GC
/Helvetica 18 F
GS
[1 0 0 1 0 0] CT
-33 7 moveto 
1 -1 scale
(-0.2) t 
GR
GR
GS
[1 0 0 1 578.40002 153.7] CT
0.149 GC
/Helvetica 18 F
GS
[1 0 0 1 0 0] CT
-33 7 moveto 
1 -1 scale
(-0.1) t 
GR
GR
GS
[1 0 0 1 578.40002 111.3] CT
0.149 GC
/Helvetica 18 F
GS
[1 0 0 1 0 0] CT
-11 7 moveto 
1 -1 scale
(0) t 
GR
GR
GS
[1 0 0 1 578.40002 68.9] CT
0.149 GC
/Helvetica 18 F
GS
[1 0 0 1 0 0] CT
-26 7 moveto 
1 -1 scale
(0.1) t 
GR
GR
GS
[1 0 0 1 578.40002 26.5] CT
0.149 GC
/Helvetica 18 F
GS
[1 0 0 1 0 0] CT
-26 7 moveto 
1 -1 scale
(0.2) t 
GR
GR
GS
[0 -1 1 0 542.90002 132.49989] CT
0.149 GC
/Helvetica 18 F
GS
[1 0 0 1 0 0] CT
-56.5 -4 moveto 
1 -1 scale
(Power \(norm.\)) t 
GR
GR
GS
[1 0 0 1 755.25073 24.25] CT
/Helvetica-Bold 18 F
GS
[1 0 0 1 0 0] CT
-139 -4 moveto 
1 -1 scale
(Spectrally-normalized estimates) t 
GR
GR
GS
0 0.447 0.741 RC
1 LJ
2 LW
N
595.193 111.3 M
606.386 201.577 L
618.698 183.275 L
629.891 172.203 L
641.083 87.492 L
652.276 141.098 L
663.469 139.542 L
675.781 138.547 L
686.974 125 L
698.167 120.736 L
709.359 116.56 L
720.552 124.773 L
732.864 121.706 L
744.057 161.985 L
755.25 29.86 L
766.443 159.027 L
777.636 116.557 L
789.948 114.445 L
801.141 118.264 L
812.333 113.557 L
823.526 113.947 L
834.719 111.268 L
847.031 118.15 L
858.224 110.648 L
869.417 115.222 L
880.609 110.825 L
891.802 111.67 L
904.114 110.557 L
915.307 120.554 L
926.5 111.3 L
S
GR
GS
0.851 0.325 0.098 RC
1 LJ
2 LW
N
595.193 111.3 M
606.386 198.219 L
618.698 182.107 L
629.891 176.307 L
641.083 98.235 L
652.276 137.033 L
663.469 147.006 L
675.781 135.502 L
686.974 122.437 L
698.167 127.673 L
709.359 122.317 L
720.552 123.453 L
732.864 125.709 L
744.057 158.857 L
755.25 36.141 L
766.443 163.76 L
777.636 107.912 L
789.948 114.629 L
801.141 115.392 L
812.333 114.492 L
823.526 115.304 L
834.719 114.409 L
847.031 112.107 L
858.224 107.957 L
869.417 113.492 L
880.609 115.27 L
891.802 112.837 L
904.114 117.404 L
915.307 114.456 L
926.5 111.3 L
S
GR
GS
0.929 0.694 0.125 RC
1 LJ
2 LW
N
595.193 111.3 M
606.386 200.611 L
618.698 173.011 L
629.891 173.856 L
641.083 102.578 L
652.276 132.032 L
663.469 143.631 L
675.781 133.501 L
686.974 130.22 L
698.167 117.039 L
709.359 123.966 L
720.552 114.675 L
732.864 121.042 L
744.057 154.978 L
755.25 39.644 L
766.443 157.808 L
777.636 115.13 L
789.948 105.751 L
801.141 121.003 L
812.333 114.661 L
823.526 111.085 L
834.719 118.77 L
847.031 110.294 L
858.224 117.364 L
869.417 112.269 L
880.609 111.398 L
891.802 113.842 L
904.114 113.317 L
915.307 123.189 L
926.5 111.3 L
S
GR
GS
0.494 0.184 0.557 RC
1 LJ
2 LW
N
595.193 111.3 M
606.386 192.088 L
618.698 177.833 L
629.891 168.215 L
641.083 98.129 L
652.276 131.792 L
663.469 147.284 L
675.781 133.789 L
686.974 127.631 L
698.167 117.753 L
709.359 122.171 L
720.552 120.288 L
732.864 126.117 L
744.057 160.949 L
755.25 36.287 L
766.443 162.013 L
777.636 113.117 L
789.948 112.432 L
801.141 115.913 L
812.333 111.791 L
823.526 112.981 L
834.719 115.798 L
847.031 116.311 L
858.224 107.781 L
869.417 116.876 L
880.609 109.188 L
891.802 111.261 L
904.114 119.214 L
915.307 116.117 L
926.5 111.3 L
S
GR
%%Trailer
%%Pages: 1
%%EOF
