%!PS-Adobe-3.0 EPSF-3.0
%%Creator: (MATLAB, The Mathworks, Inc. Version 9.8.0.1323502 \(R2020a\). Operating System: Mac OS X)
%%Title: /Users/kosciessa/Volumes/tardis/LNDG/stateswitch/stsw_eeg_task/ssvep/figures/e_SSVEP_byAge.eps
%%CreationDate: 2022-02-14T16:11:56
%%Pages: (atend)
%%BoundingBox:    35     0   699   282
%%LanguageLevel: 3
%%EndComments
%%BeginProlog
%%BeginResource: procset (Apache XML Graphics Std ProcSet) 1.2 0
%%Version: 1.2 0
%%Copyright: (Copyright 2001-2003,2010 The Apache Software Foundation. License terms: http://www.apache.org/licenses/LICENSE-2.0)
/bd{bind def}bind def
/ld{load def}bd
/GR/grestore ld
/GS/gsave ld
/RM/rmoveto ld
/C/curveto ld
/t/show ld
/L/lineto ld
/ML/setmiterlimit ld
/CT/concat ld
/f/fill ld
/N/newpath ld
/S/stroke ld
/CC/setcmykcolor ld
/A/ashow ld
/cp/closepath ld
/RC/setrgbcolor ld
/LJ/setlinejoin ld
/GC/setgray ld
/LW/setlinewidth ld
/M/moveto ld
/re {4 2 roll M
1 index 0 rlineto
0 exch rlineto
neg 0 rlineto
cp } bd
/_ctm matrix def
/_tm matrix def
/BT { _ctm currentmatrix pop matrix _tm copy pop 0 0 moveto } bd
/ET { _ctm setmatrix } bd
/iTm { _ctm setmatrix _tm concat } bd
/Tm { _tm astore pop iTm 0 0 moveto } bd
/ux 0.0 def
/uy 0.0 def
/F {
  /Tp exch def
  /Tf exch def
  Tf findfont Tp scalefont setfont
  /cf Tf def  /cs Tp def
} bd
/ULS {currentpoint /uy exch def /ux exch def} bd
/ULE {
  /Tcx currentpoint pop def
  gsave
  newpath
  cf findfont cs scalefont dup
  /FontMatrix get 0 get /Ts exch def /FontInfo get dup
  /UnderlinePosition get Ts mul /To exch def
  /UnderlineThickness get Ts mul /Tt exch def
  ux uy To add moveto  Tcx uy To add lineto
  Tt setlinewidth stroke
  grestore
} bd
/OLE {
  /Tcx currentpoint pop def
  gsave
  newpath
  cf findfont cs scalefont dup
  /FontMatrix get 0 get /Ts exch def /FontInfo get dup
  /UnderlinePosition get Ts mul /To exch def
  /UnderlineThickness get Ts mul /Tt exch def
  ux uy To add cs add moveto Tcx uy To add cs add lineto
  Tt setlinewidth stroke
  grestore
} bd
/SOE {
  /Tcx currentpoint pop def
  gsave
  newpath
  cf findfont cs scalefont dup
  /FontMatrix get 0 get /Ts exch def /FontInfo get dup
  /UnderlinePosition get Ts mul /To exch def
  /UnderlineThickness get Ts mul /Tt exch def
  ux uy To add cs 10 mul 26 idiv add moveto Tcx uy To add cs 10 mul 26 idiv add lineto
  Tt setlinewidth stroke
  grestore
} bd
/QT {
/Y22 exch store
/X22 exch store
/Y21 exch store
/X21 exch store
currentpoint
/Y21 load 2 mul add 3 div exch
/X21 load 2 mul add 3 div exch
/X21 load 2 mul /X22 load add 3 div
/Y21 load 2 mul /Y22 load add 3 div
/X22 load /Y22 load curveto
} bd
/SSPD {
dup length /d exch dict def
{
/v exch def
/k exch def
currentpagedevice k known {
/cpdv currentpagedevice k get def
v cpdv ne {
/upd false def
/nullv v type /nulltype eq def
/nullcpdv cpdv type /nulltype eq def
nullv nullcpdv or
{
/upd true def
} {
/sametype v type cpdv type eq def
sametype {
v type /arraytype eq {
/vlen v length def
/cpdvlen cpdv length def
vlen cpdvlen eq {
0 1 vlen 1 sub {
/i exch def
/obj v i get def
/cpdobj cpdv i get def
obj cpdobj ne {
/upd true def
exit
} if
} for
} {
/upd true def
} ifelse
} {
v type /dicttype eq {
v {
/dv exch def
/dk exch def
/cpddv cpdv dk get def
dv cpddv ne {
/upd true def
exit
} if
} forall
} {
/upd true def
} ifelse
} ifelse
} if
} ifelse
upd true eq {
d k v put
} if
} if
} if
} forall
d length 0 gt {
d setpagedevice
} if
} bd
/RE { % /NewFontName [NewEncodingArray] /FontName RE -
  findfont dup length dict begin
  {
    1 index /FID ne
    {def} {pop pop} ifelse
  } forall
  /Encoding exch def
  /FontName 1 index def
  currentdict definefont pop
  end
} bind def
%%EndResource
%%BeginResource: procset (Apache XML Graphics EPS ProcSet) 1.0 0
%%Version: 1.0 0
%%Copyright: (Copyright 2002-2003 The Apache Software Foundation. License terms: http://www.apache.org/licenses/LICENSE-2.0)
/BeginEPSF { %def
/b4_Inc_state save def         % Save state for cleanup
/dict_count countdictstack def % Count objects on dict stack
/op_count count 1 sub def      % Count objects on operand stack
userdict begin                 % Push userdict on dict stack
/showpage { } def              % Redefine showpage, { } = null proc
0 setgray 0 setlinecap         % Prepare graphics state
1 setlinewidth 0 setlinejoin
10 setmiterlimit [ ] 0 setdash newpath
/languagelevel where           % If level not equal to 1 then
{pop languagelevel             % set strokeadjust and
1 ne                           % overprint to their defaults.
{false setstrokeadjust false setoverprint
} if
} if
} bd
/EndEPSF { %def
count op_count sub {pop} repeat            % Clean up stacks
countdictstack dict_count sub {end} repeat
b4_Inc_state restore
} bd
%%EndResource
%FOPBeginFontDict
%%IncludeResource: font Courier-Oblique
%%IncludeResource: font Courier-BoldOblique
%%IncludeResource: font Courier-Bold
%%IncludeResource: font ZapfDingbats
%%IncludeResource: font Symbol
%%IncludeResource: font Helvetica
%%IncludeResource: font Helvetica-Oblique
%%IncludeResource: font Helvetica-Bold
%%IncludeResource: font Helvetica-BoldOblique
%%IncludeResource: font Times-Roman
%%IncludeResource: font Times-Italic
%%IncludeResource: font Times-Bold
%%IncludeResource: font Times-BoldItalic
%%IncludeResource: font Courier
%FOPEndFontDict
%%BeginResource: encoding WinAnsiEncoding
/WinAnsiEncoding [
/.notdef /.notdef /.notdef /.notdef /.notdef
/.notdef /.notdef /.notdef /.notdef /.notdef
/.notdef /.notdef /.notdef /.notdef /.notdef
/.notdef /.notdef /.notdef /.notdef /.notdef
/.notdef /.notdef /.notdef /.notdef /.notdef
/.notdef /.notdef /.notdef /.notdef /.notdef
/.notdef /.notdef /space /exclam /quotedbl
/numbersign /dollar /percent /ampersand /quotesingle
/parenleft /parenright /asterisk /plus /comma
/hyphen /period /slash /zero /one
/two /three /four /five /six
/seven /eight /nine /colon /semicolon
/less /equal /greater /question /at
/A /B /C /D /E
/F /G /H /I /J
/K /L /M /N /O
/P /Q /R /S /T
/U /V /W /X /Y
/Z /bracketleft /backslash /bracketright /asciicircum
/underscore /quoteleft /a /b /c
/d /e /f /g /h
/i /j /k /l /m
/n /o /p /q /r
/s /t /u /v /w
/x /y /z /braceleft /bar
/braceright /asciitilde /bullet /Euro /bullet
/quotesinglbase /florin /quotedblbase /ellipsis /dagger
/daggerdbl /circumflex /perthousand /Scaron /guilsinglleft
/OE /bullet /Zcaron /bullet /bullet
/quoteleft /quoteright /quotedblleft /quotedblright /bullet
/endash /emdash /asciitilde /trademark /scaron
/guilsinglright /oe /bullet /zcaron /Ydieresis
/space /exclamdown /cent /sterling /currency
/yen /brokenbar /section /dieresis /copyright
/ordfeminine /guillemotleft /logicalnot /sfthyphen /registered
/macron /degree /plusminus /twosuperior /threesuperior
/acute /mu /paragraph /middot /cedilla
/onesuperior /ordmasculine /guillemotright /onequarter /onehalf
/threequarters /questiondown /Agrave /Aacute /Acircumflex
/Atilde /Adieresis /Aring /AE /Ccedilla
/Egrave /Eacute /Ecircumflex /Edieresis /Igrave
/Iacute /Icircumflex /Idieresis /Eth /Ntilde
/Ograve /Oacute /Ocircumflex /Otilde /Odieresis
/multiply /Oslash /Ugrave /Uacute /Ucircumflex
/Udieresis /Yacute /Thorn /germandbls /agrave
/aacute /acircumflex /atilde /adieresis /aring
/ae /ccedilla /egrave /eacute /ecircumflex
/edieresis /igrave /iacute /icircumflex /idieresis
/eth /ntilde /ograve /oacute /ocircumflex
/otilde /odieresis /divide /oslash /ugrave
/uacute /ucircumflex /udieresis /yacute /thorn
/ydieresis
] def
%%EndResource
%FOPBeginFontReencode
/Courier-Oblique findfont
dup length dict begin
  {1 index /FID ne {def} {pop pop} ifelse} forall
  /Encoding WinAnsiEncoding def
  currentdict
end
/Courier-Oblique exch definefont pop
/Courier-BoldOblique findfont
dup length dict begin
  {1 index /FID ne {def} {pop pop} ifelse} forall
  /Encoding WinAnsiEncoding def
  currentdict
end
/Courier-BoldOblique exch definefont pop
/Courier-Bold findfont
dup length dict begin
  {1 index /FID ne {def} {pop pop} ifelse} forall
  /Encoding WinAnsiEncoding def
  currentdict
end
/Courier-Bold exch definefont pop
/Helvetica findfont
dup length dict begin
  {1 index /FID ne {def} {pop pop} ifelse} forall
  /Encoding WinAnsiEncoding def
  currentdict
end
/Helvetica exch definefont pop
/Helvetica-Oblique findfont
dup length dict begin
  {1 index /FID ne {def} {pop pop} ifelse} forall
  /Encoding WinAnsiEncoding def
  currentdict
end
/Helvetica-Oblique exch definefont pop
/Helvetica-Bold findfont
dup length dict begin
  {1 index /FID ne {def} {pop pop} ifelse} forall
  /Encoding WinAnsiEncoding def
  currentdict
end
/Helvetica-Bold exch definefont pop
/Helvetica-BoldOblique findfont
dup length dict begin
  {1 index /FID ne {def} {pop pop} ifelse} forall
  /Encoding WinAnsiEncoding def
  currentdict
end
/Helvetica-BoldOblique exch definefont pop
/Times-Roman findfont
dup length dict begin
  {1 index /FID ne {def} {pop pop} ifelse} forall
  /Encoding WinAnsiEncoding def
  currentdict
end
/Times-Roman exch definefont pop
/Times-Italic findfont
dup length dict begin
  {1 index /FID ne {def} {pop pop} ifelse} forall
  /Encoding WinAnsiEncoding def
  currentdict
end
/Times-Italic exch definefont pop
/Times-Bold findfont
dup length dict begin
  {1 index /FID ne {def} {pop pop} ifelse} forall
  /Encoding WinAnsiEncoding def
  currentdict
end
/Times-Bold exch definefont pop
/Times-BoldItalic findfont
dup length dict begin
  {1 index /FID ne {def} {pop pop} ifelse} forall
  /Encoding WinAnsiEncoding def
  currentdict
end
/Times-BoldItalic exch definefont pop
/Courier findfont
dup length dict begin
  {1 index /FID ne {def} {pop pop} ifelse} forall
  /Encoding WinAnsiEncoding def
  currentdict
end
/Courier exch definefont pop
%FOPEndFontReencode
%%EndProlog
%%Page: 1 1
%%PageBoundingBox: 0 0 768 288
%%BeginPageSetup
[1 0 0 -1 0 288] CT
%%EndPageSetup
GS
1 GC
N
0 0 768 288 re
f
GR
GS
1 GC
N
0 0 768 288 re
f
GR
GS
1 GC
N
112 240.5 M
357 240.5 L
357 25 L
112 25 L
cp
f
GR
GS
0.149 GC
2 setlinecap
1 LJ
0.5 LW
N
112 240.5 M
357 240.5 L
S
GR
GS
0.149 GC
2 setlinecap
1 LJ
0.5 LW
N
112 240.5 M
112 238.05 L
S
GR
GS
0.149 GC
2 setlinecap
1 LJ
0.5 LW
N
161 240.5 M
161 238.05 L
S
GR
GS
0.149 GC
2 setlinecap
1 LJ
0.5 LW
N
210 240.5 M
210 238.05 L
S
GR
GS
0.149 GC
2 setlinecap
1 LJ
0.5 LW
N
259 240.5 M
259 238.05 L
S
GR
GS
0.149 GC
2 setlinecap
1 LJ
0.5 LW
N
308 240.5 M
308 238.05 L
S
GR
GS
0.149 GC
2 setlinecap
1 LJ
0.5 LW
N
357 240.5 M
357 238.05 L
S
GR
GS
[1 0 0 1 112 245.89999] CT
0.149 GC
/Helvetica 17 F
GS
[1 0 0 1 0 0] CT
-8.5 17 moveto 
1 -1 scale
(-1) t 
GR
GR
GS
[1 0 0 1 161 245.89999] CT
0.149 GC
/Helvetica 17 F
GS
[1 0 0 1 0 0] CT
-5 17 moveto 
1 -1 scale
(0) t 
GR
GR
GS
[1 0 0 1 210 245.89999] CT
0.149 GC
/Helvetica 17 F
GS
[1 0 0 1 0 0] CT
-5 17 moveto 
1 -1 scale
(1) t 
GR
GR
GS
[1 0 0 1 259 245.89999] CT
0.149 GC
/Helvetica 17 F
GS
[1 0 0 1 0 0] CT
-5 17 moveto 
1 -1 scale
(2) t 
GR
GR
GS
[1 0 0 1 308 245.89999] CT
0.149 GC
/Helvetica 17 F
GS
[1 0 0 1 0 0] CT
-5 17 moveto 
1 -1 scale
(3) t 
GR
GR
GS
[1 0 0 1 357 245.89999] CT
0.149 GC
/Helvetica 17 F
GS
[1 0 0 1 0 0] CT
-5 17 moveto 
1 -1 scale
(4) t 
GR
GR
GS
[1 0 0 1 234.50012 267.39999] CT
0.149 GC
/Helvetica 17 F
GS
[1 0 0 1 0 0] CT
-107 17 moveto 
1 -1 scale
(Time \(s from stimulus onset\)) t 
GR
GR
GS
0.149 GC
2 setlinecap
1 LJ
0.5 LW
N
112 240.5 M
112 25 L
S
GR
GS
0.149 GC
2 setlinecap
1 LJ
0.5 LW
N
112 240.5 M
114.45 240.5 L
S
GR
GS
0.149 GC
2 setlinecap
1 LJ
0.5 LW
N
112 204.583 M
114.45 204.583 L
S
GR
GS
0.149 GC
2 setlinecap
1 LJ
0.5 LW
N
112 168.667 M
114.45 168.667 L
S
GR
GS
0.149 GC
2 setlinecap
1 LJ
0.5 LW
N
112 132.75 M
114.45 132.75 L
S
GR
GS
0.149 GC
2 setlinecap
1 LJ
0.5 LW
N
112 96.833 M
114.45 96.833 L
S
GR
GS
0.149 GC
2 setlinecap
1 LJ
0.5 LW
N
112 60.917 M
114.45 60.917 L
S
GR
GS
[1 0 0 1 106.6 240.5] CT
0.149 GC
/Helvetica 17 F
GS
[1 0 0 1 0 0] CT
-31 6.5 moveto 
1 -1 scale
(-0.1) t 
GR
GR
GS
[1 0 0 1 106.6 204.58333] CT
0.149 GC
/Helvetica 17 F
GS
[1 0 0 1 0 0] CT
-10 6.5 moveto 
1 -1 scale
(0) t 
GR
GR
GS
[1 0 0 1 106.6 168.66667] CT
0.149 GC
/Helvetica 17 F
GS
[1 0 0 1 0 0] CT
-24 6.5 moveto 
1 -1 scale
(0.1) t 
GR
GR
GS
[1 0 0 1 106.6 132.75] CT
0.149 GC
/Helvetica 17 F
GS
[1 0 0 1 0 0] CT
-24 6.5 moveto 
1 -1 scale
(0.2) t 
GR
GR
GS
[1 0 0 1 106.6 96.83333] CT
0.149 GC
/Helvetica 17 F
GS
[1 0 0 1 0 0] CT
-24 6.5 moveto 
1 -1 scale
(0.3) t 
GR
GR
GS
[1 0 0 1 106.6 60.91666] CT
0.149 GC
/Helvetica 17 F
GS
[1 0 0 1 0 0] CT
-24 6.5 moveto 
1 -1 scale
(0.4) t 
GR
GR
GS
[0 -1 1 0 73.1 132.74989] CT
0.149 GC
/Helvetica 17 F
GS
[1 0 0 1 0 0] CT
-56.5 -25 moveto 
1 -1 scale
(relative SSVEP) t 
GR
GR
GS
[0 -1 1 0 73.1 132.74989] CT
0.149 GC
/Helvetica 17 F
GS
[1 0 0 1 0 0] CT
-45.5 -4 moveto 
1 -1 scale
(Power \(a.u.\)) t 
GR
GR
GS
[1 0 0 1 234.50023 22.875] CT
/Helvetica-Bold 17 F
GS
[1 0 0 1 0 0] CT
-92 -4 moveto 
1 -1 scale
(SpecNorm SSVEP \(YA\)) t 
GR
GR
GS
1 0.949 0.8 RC
N
161 240.5 M
311.234 240.5 L
311.234 25 L
161 25 L
cp
f
GR
GS
0.98 GC
N
111.971 199.264 M
111.971 211.219 L
112 211.222 L
116.9 209.265 L
121.8 205.124 L
126.7 202.654 L
131.6 204.929 L
136.5 208.946 L
141.4 212.422 L
146.3 214.661 L
151.2 216.943 L
156.1 219.561 L
161 216.551 L
165.9 198.976 L
170.8 161.942 L
175.7 114.973 L
180.6 82.052 L
185.5 74.063 L
190.4 77.1 L
195.3 78.005 L
200.2 79.175 L
205.1 79.76 L
210 78.331 L
214.9 79.169 L
219.8 86.566 L
224.7 99.509 L
229.6 109.924 L
234.5 113.73 L
239.4 112.709 L
244.3 108.341 L
249.2 103.351 L
254.1 98.862 L
259 96.892 L
263.9 99.72 L
268.8 105.627 L
273.7 109.868 L
278.6 109.172 L
283.5 103.271 L
288.4 97.655 L
293.3 95.06 L
298.2 93.631 L
303.1 98.307 L
308 120.11 L
312.9 154.645 L
317.8 186.626 L
322.7 205.554 L
327.6 212.102 L
332.5 214.819 L
337.4 217.306 L
342.3 220.074 L
347.2 222.104 L
352.1 222.894 L
357 224.357 L
357.029 224.367 L
357.029 224.307 L
357.029 215.321 L
357 215.317 L
352.1 213.025 L
347.2 211.171 L
342.3 209.871 L
337.4 207.719 L
332.5 204.352 L
327.6 200.977 L
322.7 194.105 L
317.8 173.54 L
312.9 138.846 L
308 103.924 L
303.1 82.27 L
298.2 75.494 L
293.3 73.957 L
288.4 75.191 L
283.5 82.647 L
278.6 92.771 L
273.7 96.113 L
268.8 92.433 L
263.9 86.953 L
259 84.422 L
254.1 84.903 L
249.2 86.775 L
244.3 90.445 L
239.4 95.71 L
234.5 98.496 L
229.6 95.779 L
224.7 85.83 L
219.8 73.299 L
214.9 65.487 L
210 63.002 L
205.1 63.175 L
200.2 62.62 L
195.3 62.297 L
190.4 62.078 L
185.5 59.463 L
180.6 67.117 L
175.7 100.858 L
170.8 150.228 L
165.9 188.956 L
161 206.509 L
156.1 207.613 L
151.2 204.338 L
146.3 204.38 L
141.4 203.414 L
136.5 199.521 L
131.6 195.03 L
126.7 191.166 L
121.8 191.817 L
116.9 196.352 L
112 199.195 L
111.971 199.195 L
cp
f
GR
GS
0.91 GC
1 LJ
0.5 LW
N
111.971 211.219 M
112 211.222 L
116.9 209.265 L
121.8 205.124 L
126.7 202.654 L
131.6 204.929 L
136.5 208.946 L
141.4 212.422 L
146.3 214.661 L
151.2 216.943 L
156.1 219.561 L
161 216.551 L
165.9 198.976 L
170.8 161.942 L
175.7 114.973 L
180.6 82.052 L
185.5 74.063 L
190.4 77.1 L
195.3 78.005 L
200.2 79.175 L
205.1 79.76 L
210 78.331 L
214.9 79.169 L
219.8 86.566 L
224.7 99.509 L
229.6 109.924 L
234.5 113.73 L
239.4 112.709 L
244.3 108.341 L
249.2 103.351 L
254.1 98.862 L
259 96.892 L
263.9 99.72 L
268.8 105.627 L
273.7 109.868 L
278.6 109.172 L
283.5 103.271 L
288.4 97.655 L
293.3 95.06 L
298.2 93.631 L
303.1 98.307 L
308 120.11 L
312.9 154.645 L
317.8 186.626 L
322.7 205.554 L
327.6 212.102 L
332.5 214.819 L
337.4 217.306 L
342.3 220.074 L
347.2 222.104 L
352.1 222.894 L
357 224.357 L
357.029 224.367 L
S
GR
GS
0.91 GC
1 LJ
0.5 LW
N
111.971 199.195 M
112 199.195 L
116.9 196.352 L
121.8 191.817 L
126.7 191.166 L
131.6 195.03 L
136.5 199.521 L
141.4 203.414 L
146.3 204.38 L
151.2 204.338 L
156.1 207.613 L
161 206.509 L
165.9 188.956 L
170.8 150.228 L
175.7 100.858 L
180.6 67.117 L
185.5 59.463 L
190.4 62.078 L
195.3 62.297 L
200.2 62.62 L
205.1 63.175 L
210 63.002 L
214.9 65.487 L
219.8 73.299 L
224.7 85.83 L
229.6 95.779 L
234.5 98.496 L
239.4 95.71 L
244.3 90.445 L
249.2 86.775 L
254.1 84.903 L
259 84.422 L
263.9 86.953 L
268.8 92.433 L
273.7 96.113 L
278.6 92.771 L
283.5 82.647 L
288.4 75.191 L
293.3 73.957 L
298.2 75.494 L
303.1 82.27 L
308 103.924 L
312.9 138.846 L
317.8 173.54 L
322.7 194.105 L
327.6 200.977 L
332.5 204.352 L
337.4 207.719 L
342.3 209.871 L
347.2 211.171 L
352.1 213.025 L
357 215.317 L
357.029 215.321 L
S
GR
GS
0.8 GC
1 LJ
2 LW
N
111.971 205.207 M
112 205.208 L
116.9 202.808 L
121.8 198.471 L
126.7 196.91 L
131.6 199.979 L
136.5 204.233 L
141.4 207.918 L
146.3 209.521 L
151.2 210.641 L
156.1 213.587 L
161 211.53 L
165.9 193.966 L
170.8 156.085 L
175.7 107.916 L
180.6 74.585 L
185.5 66.763 L
190.4 69.589 L
195.3 70.151 L
200.2 70.898 L
205.1 71.468 L
210 70.667 L
214.9 72.328 L
219.8 79.933 L
224.7 92.67 L
229.6 102.852 L
234.5 106.113 L
239.4 104.21 L
244.3 99.393 L
249.2 95.063 L
254.1 91.882 L
259 90.657 L
263.9 93.337 L
268.8 99.03 L
273.7 102.991 L
278.6 100.972 L
283.5 92.959 L
288.4 86.423 L
293.3 84.508 L
298.2 84.563 L
303.1 90.289 L
308 112.017 L
312.9 146.746 L
317.8 180.083 L
322.7 199.829 L
327.6 206.539 L
332.5 209.586 L
337.4 212.512 L
342.3 214.973 L
347.2 216.638 L
352.1 217.96 L
357 219.837 L
357.029 219.844 L
S
GR
GS
0.959 GC
N
116.9 207.78 M
112 198.791 L
111.971 198.749 L
111.971 198.815 L
111.971 209.292 L
112 209.331 L
116.9 218.959 L
121.8 222.751 L
126.7 219.241 L
131.6 211.299 L
136.5 203.546 L
141.4 201.723 L
146.3 205.923 L
151.2 208.515 L
156.1 209.48 L
161 205.417 L
165.9 187.879 L
170.8 154.656 L
175.7 118.009 L
180.6 97.356 L
185.5 97.771 L
190.4 103.515 L
195.3 102.479 L
200.2 98.859 L
205.1 94.792 L
210 89.676 L
214.9 86.331 L
219.8 85.748 L
224.7 86.966 L
229.6 88.743 L
234.5 88.842 L
239.4 87.908 L
244.3 86.264 L
249.2 84 L
254.1 83.164 L
259 83.285 L
263.9 84.158 L
268.8 86.091 L
273.7 89.25 L
278.6 93.951 L
283.5 98.178 L
288.4 99.903 L
293.3 100.507 L
298.2 105.21 L
303.1 120.52 L
308 149.949 L
312.9 183.475 L
317.8 207.6 L
322.7 216.018 L
327.6 213.166 L
332.5 207.641 L
337.4 207.49 L
342.3 214.184 L
347.2 223.309 L
352.1 229.008 L
357 227.66 L
357.029 227.609 L
357.029 217.087 L
357.029 217.024 L
357 217.076 L
352.1 217.923 L
347.2 211.808 L
342.3 202.929 L
337.4 196.507 L
332.5 196.438 L
327.6 202.578 L
322.7 205.856 L
317.8 195.471 L
312.9 168.421 L
308 132.447 L
303.1 102.368 L
298.2 86.603 L
293.3 80.515 L
288.4 78.676 L
283.5 77.382 L
278.6 75.067 L
273.7 72.413 L
268.8 70.349 L
263.9 68.963 L
259 67.833 L
254.1 67.9 L
249.2 69.988 L
244.3 71.98 L
239.4 72.004 L
234.5 72.225 L
229.6 72.218 L
224.7 70.919 L
219.8 69.592 L
214.9 68.997 L
210 71.564 L
205.1 77.463 L
200.2 83.113 L
195.3 87.932 L
190.4 86.208 L
185.5 77 L
180.6 76.489 L
175.7 99.395 L
170.8 138.941 L
165.9 173.833 L
161 192.698 L
156.1 196.586 L
151.2 195.247 L
146.3 194.134 L
141.4 190.421 L
136.5 191.359 L
131.6 200.325 L
126.7 209.389 L
121.8 211.729 L
cp
f
GR
GS
0.82 GC
1 LJ
0.5 LW
N
111.971 209.292 M
112 209.331 L
116.9 218.959 L
121.8 222.751 L
126.7 219.241 L
131.6 211.299 L
136.5 203.546 L
141.4 201.723 L
146.3 205.923 L
151.2 208.515 L
156.1 209.48 L
161 205.417 L
165.9 187.879 L
170.8 154.656 L
175.7 118.009 L
180.6 97.356 L
185.5 97.771 L
190.4 103.515 L
195.3 102.479 L
200.2 98.859 L
205.1 94.792 L
210 89.676 L
214.9 86.331 L
219.8 85.748 L
224.7 86.966 L
229.6 88.743 L
234.5 88.842 L
239.4 87.908 L
244.3 86.264 L
249.2 84 L
254.1 83.164 L
259 83.285 L
263.9 84.158 L
268.8 86.091 L
273.7 89.25 L
278.6 93.951 L
283.5 98.178 L
288.4 99.903 L
293.3 100.507 L
298.2 105.21 L
303.1 120.52 L
308 149.949 L
312.9 183.475 L
317.8 207.6 L
322.7 216.018 L
327.6 213.166 L
332.5 207.641 L
337.4 207.49 L
342.3 214.184 L
347.2 223.309 L
352.1 229.008 L
357 227.66 L
357.029 227.609 L
S
GR
GS
0.82 GC
1 LJ
0.5 LW
N
111.971 198.749 M
112 198.791 L
116.9 207.78 L
121.8 211.729 L
126.7 209.389 L
131.6 200.325 L
136.5 191.359 L
141.4 190.421 L
146.3 194.134 L
151.2 195.247 L
156.1 196.586 L
161 192.698 L
165.9 173.833 L
170.8 138.941 L
175.7 99.395 L
180.6 76.489 L
185.5 77 L
190.4 86.208 L
195.3 87.932 L
200.2 83.113 L
205.1 77.463 L
210 71.564 L
214.9 68.997 L
219.8 69.592 L
224.7 70.919 L
229.6 72.218 L
234.5 72.225 L
239.4 72.004 L
244.3 71.98 L
249.2 69.988 L
254.1 67.9 L
259 67.833 L
263.9 68.963 L
268.8 70.349 L
273.7 72.413 L
278.6 75.067 L
283.5 77.382 L
288.4 78.676 L
293.3 80.515 L
298.2 86.603 L
303.1 102.368 L
308 132.447 L
312.9 168.421 L
317.8 195.471 L
322.7 205.856 L
327.6 202.578 L
332.5 196.438 L
337.4 196.507 L
342.3 202.929 L
347.2 211.808 L
352.1 217.923 L
357 217.076 L
357.029 217.024 L
S
GR
GS
0.6 GC
1 LJ
2 LW
N
111.971 204.02 M
112 204.061 L
116.9 213.369 L
121.8 217.24 L
126.7 214.315 L
131.6 205.812 L
136.5 197.452 L
141.4 196.072 L
146.3 200.028 L
151.2 201.881 L
156.1 203.033 L
161 199.058 L
165.9 180.856 L
170.8 146.799 L
175.7 108.702 L
180.6 86.922 L
185.5 87.386 L
190.4 94.861 L
195.3 95.206 L
200.2 90.986 L
205.1 86.127 L
210 80.62 L
214.9 77.664 L
219.8 77.67 L
224.7 78.942 L
229.6 80.48 L
234.5 80.534 L
239.4 79.956 L
244.3 79.122 L
249.2 76.994 L
254.1 75.532 L
259 75.559 L
263.9 76.561 L
268.8 78.22 L
273.7 80.831 L
278.6 84.509 L
283.5 87.78 L
288.4 89.289 L
293.3 90.511 L
298.2 95.906 L
303.1 111.444 L
308 141.198 L
312.9 175.948 L
317.8 201.536 L
322.7 210.937 L
327.6 207.872 L
332.5 202.039 L
337.4 201.999 L
342.3 208.557 L
347.2 217.558 L
352.1 223.465 L
357 222.368 L
357.029 222.316 L
S
GR
GS
0.939 GC
N
116.9 215.367 M
121.8 211.997 L
126.7 209.926 L
131.6 210.18 L
136.5 211.515 L
141.4 214.019 L
146.3 217.394 L
151.2 217.33 L
156.1 211.792 L
161 202.159 L
165.9 185.188 L
170.8 155.151 L
175.7 115.532 L
180.6 86.795 L
185.5 83.254 L
190.4 91.252 L
195.3 94.427 L
200.2 94.262 L
205.1 93.728 L
210 92.084 L
214.9 91.689 L
219.8 94.78 L
224.7 98.284 L
229.6 97.731 L
234.5 92.521 L
239.4 87.297 L
244.3 84.833 L
249.2 86.23 L
254.1 89.969 L
259 94.905 L
263.9 98.155 L
268.8 97.96 L
273.7 94.933 L
278.6 90.253 L
283.5 85.853 L
288.4 84.712 L
293.3 87.534 L
298.2 94.479 L
303.1 108.521 L
308 133.426 L
312.9 164.744 L
317.8 190.968 L
322.7 204.416 L
327.6 208.147 L
332.5 208.977 L
337.4 208.242 L
342.3 206.244 L
347.2 205.131 L
352.1 204.537 L
357 201.589 L
357.029 201.566 L
357.029 191.897 L
357.029 191.841 L
357 191.862 L
352.1 194.606 L
347.2 194.745 L
342.3 195.337 L
337.4 197.19 L
332.5 198.805 L
327.6 199.531 L
322.7 195.51 L
317.8 180.859 L
312.9 151.372 L
308 116.786 L
303.1 91.999 L
298.2 78.255 L
293.3 71.306 L
288.4 68.968 L
283.5 71.282 L
278.6 74.971 L
273.7 76.92 L
268.8 80.514 L
263.9 84.178 L
259 81.553 L
254.1 75.121 L
249.2 70.623 L
244.3 67.63 L
239.4 69.084 L
234.5 75.257 L
229.6 81.557 L
224.7 81.903 L
219.8 76.008 L
214.9 70.39 L
210 70.336 L
205.1 74.062 L
200.2 76.311 L
195.3 76.956 L
190.4 74.05 L
185.5 64.107 L
180.6 66.133 L
175.7 97.577 L
170.8 140.714 L
165.9 172.769 L
161 190.504 L
156.1 199.361 L
151.2 204.079 L
146.3 205.239 L
141.4 202.994 L
136.5 199.628 L
131.6 197.416 L
126.7 198.019 L
121.8 201.912 L
116.9 206.621 L
112 207.056 L
111.971 207.044 L
111.971 207.109 L
111.971 217.427 L
112 217.436 L
cp
f
GR
GS
0.729 GC
1 LJ
0.5 LW
N
111.971 217.427 M
112 217.436 L
116.9 215.367 L
121.8 211.997 L
126.7 209.926 L
131.6 210.18 L
136.5 211.515 L
141.4 214.019 L
146.3 217.394 L
151.2 217.33 L
156.1 211.792 L
161 202.159 L
165.9 185.188 L
170.8 155.151 L
175.7 115.532 L
180.6 86.795 L
185.5 83.254 L
190.4 91.252 L
195.3 94.427 L
200.2 94.262 L
205.1 93.728 L
210 92.084 L
214.9 91.689 L
219.8 94.78 L
224.7 98.284 L
229.6 97.731 L
234.5 92.521 L
239.4 87.297 L
244.3 84.833 L
249.2 86.23 L
254.1 89.969 L
259 94.905 L
263.9 98.155 L
268.8 97.96 L
273.7 94.933 L
278.6 90.253 L
283.5 85.853 L
288.4 84.712 L
293.3 87.534 L
298.2 94.479 L
303.1 108.521 L
308 133.426 L
312.9 164.744 L
317.8 190.968 L
322.7 204.416 L
327.6 208.147 L
332.5 208.977 L
337.4 208.242 L
342.3 206.244 L
347.2 205.131 L
352.1 204.537 L
357 201.589 L
357.029 201.566 L
S
GR
GS
0.729 GC
1 LJ
0.5 LW
N
111.971 207.044 M
112 207.056 L
116.9 206.621 L
121.8 201.912 L
126.7 198.019 L
131.6 197.416 L
136.5 199.628 L
141.4 202.994 L
146.3 205.239 L
151.2 204.079 L
156.1 199.361 L
161 190.504 L
165.9 172.769 L
170.8 140.714 L
175.7 97.577 L
180.6 66.133 L
185.5 64.107 L
190.4 74.05 L
195.3 76.956 L
200.2 76.311 L
205.1 74.062 L
210 70.336 L
214.9 70.39 L
219.8 76.008 L
224.7 81.903 L
229.6 81.557 L
234.5 75.257 L
239.4 69.084 L
244.3 67.63 L
249.2 70.623 L
254.1 75.121 L
259 81.553 L
263.9 84.178 L
268.8 80.514 L
273.7 76.92 L
278.6 74.971 L
283.5 71.282 L
288.4 68.968 L
293.3 71.306 L
298.2 78.255 L
303.1 91.999 L
308 116.786 L
312.9 151.372 L
317.8 180.859 L
322.7 195.51 L
327.6 199.531 L
332.5 198.805 L
337.4 197.19 L
342.3 195.337 L
347.2 194.745 L
352.1 194.606 L
357 191.862 L
357.029 191.841 L
S
GR
GS
0.4 GC
1 LJ
2 LW
N
111.971 212.236 M
112 212.246 L
116.9 210.994 L
121.8 206.955 L
126.7 203.973 L
131.6 203.798 L
136.5 205.571 L
141.4 208.506 L
146.3 211.316 L
151.2 210.704 L
156.1 205.576 L
161 196.331 L
165.9 178.979 L
170.8 147.933 L
175.7 106.555 L
180.6 76.464 L
185.5 73.681 L
190.4 82.651 L
195.3 85.692 L
200.2 85.287 L
205.1 83.895 L
210 81.21 L
214.9 81.04 L
219.8 85.394 L
224.7 90.093 L
229.6 89.644 L
234.5 83.889 L
239.4 78.191 L
244.3 76.232 L
249.2 78.427 L
254.1 82.545 L
259 88.229 L
263.9 91.166 L
268.8 89.237 L
273.7 85.926 L
278.6 82.612 L
283.5 78.567 L
288.4 76.84 L
293.3 79.42 L
298.2 86.367 L
303.1 100.26 L
308 125.106 L
312.9 158.058 L
317.8 185.914 L
322.7 199.963 L
327.6 203.839 L
332.5 203.891 L
337.4 202.716 L
342.3 200.791 L
347.2 199.938 L
352.1 199.571 L
357 196.725 L
357.029 196.703 L
S
GR
GS
0.918 GC
N
111.971 208.344 M
112 208.304 L
116.9 205.731 L
121.8 210.368 L
126.7 216.615 L
131.6 218.242 L
136.5 213.57 L
141.4 206.7 L
146.3 202.218 L
151.2 202.836 L
156.1 205.596 L
161 204.603 L
165.9 190.337 L
170.8 158.593 L
175.7 117.476 L
180.6 84.826 L
185.5 71.926 L
190.4 72.888 L
195.3 74.862 L
200.2 79.299 L
205.1 86.773 L
210 94.691 L
214.9 100.404 L
219.8 103.604 L
224.7 103.811 L
229.6 101.586 L
234.5 98.044 L
239.4 95.758 L
244.3 94.741 L
249.2 91.989 L
254.1 88.753 L
259 90.486 L
263.9 96.349 L
268.8 101.02 L
273.7 102.813 L
278.6 103.73 L
283.5 106.136 L
288.4 107.068 L
293.3 102.057 L
298.2 96.749 L
303.1 106.018 L
308 134.505 L
312.9 167.048 L
317.8 188.559 L
322.7 198.937 L
327.6 203.032 L
332.5 206.244 L
337.4 209.06 L
342.3 208.668 L
347.2 206.493 L
352.1 204.447 L
357 204.577 L
357.029 204.614 L
357.029 204.553 L
357.029 193.964 L
357 193.925 L
352.1 192.999 L
347.2 194.588 L
342.3 197.403 L
337.4 198.919 L
332.5 196.858 L
327.6 193.232 L
322.7 188.66 L
317.8 178.75 L
312.9 156.359 L
308 122.185 L
303.1 92.956 L
298.2 83.71 L
293.3 87.984 L
288.4 91.396 L
283.5 89.844 L
278.6 85.848 L
273.7 83.893 L
268.8 84.208 L
263.9 81.734 L
259 76.338 L
254.1 73.667 L
249.2 76.495 L
244.3 78.418 L
239.4 78.457 L
234.5 81.372 L
229.6 86.39 L
224.7 88.927 L
219.8 88.078 L
214.9 84.495 L
210 79.42 L
205.1 72.374 L
200.2 65.735 L
195.3 61.772 L
190.4 59.592 L
185.5 57.382 L
180.6 68.307 L
175.7 100.889 L
170.8 143.766 L
165.9 177.527 L
161 193.691 L
156.1 194.992 L
151.2 191.93 L
146.3 191.623 L
141.4 196.749 L
136.5 203.502 L
131.6 209.093 L
126.7 209.012 L
121.8 202.304 L
116.9 195.55 L
112 197.278 L
111.971 197.322 L
111.971 208.283 L
cp
f
GR
GS
0.639 GC
1 LJ
0.5 LW
N
111.971 208.344 M
112 208.304 L
116.9 205.731 L
121.8 210.368 L
126.7 216.615 L
131.6 218.242 L
136.5 213.57 L
141.4 206.7 L
146.3 202.218 L
151.2 202.836 L
156.1 205.596 L
161 204.603 L
165.9 190.337 L
170.8 158.593 L
175.7 117.476 L
180.6 84.826 L
185.5 71.926 L
190.4 72.888 L
195.3 74.862 L
200.2 79.299 L
205.1 86.773 L
210 94.691 L
214.9 100.404 L
219.8 103.604 L
224.7 103.811 L
229.6 101.586 L
234.5 98.044 L
239.4 95.758 L
244.3 94.741 L
249.2 91.989 L
254.1 88.753 L
259 90.486 L
263.9 96.349 L
268.8 101.02 L
273.7 102.813 L
278.6 103.73 L
283.5 106.136 L
288.4 107.068 L
293.3 102.057 L
298.2 96.749 L
303.1 106.018 L
308 134.505 L
312.9 167.048 L
317.8 188.559 L
322.7 198.937 L
327.6 203.032 L
332.5 206.244 L
337.4 209.06 L
342.3 208.668 L
347.2 206.493 L
352.1 204.447 L
357 204.577 L
357.029 204.614 L
S
GR
GS
0.639 GC
1 LJ
0.5 LW
N
111.971 197.322 M
112 197.278 L
116.9 195.55 L
121.8 202.304 L
126.7 209.012 L
131.6 209.093 L
136.5 203.502 L
141.4 196.749 L
146.3 191.623 L
151.2 191.93 L
156.1 194.992 L
161 193.691 L
165.9 177.527 L
170.8 143.766 L
175.7 100.889 L
180.6 68.307 L
185.5 57.382 L
190.4 59.592 L
195.3 61.772 L
200.2 65.735 L
205.1 72.374 L
210 79.42 L
214.9 84.495 L
219.8 88.078 L
224.7 88.927 L
229.6 86.39 L
234.5 81.372 L
239.4 78.457 L
244.3 78.418 L
249.2 76.495 L
254.1 73.667 L
259 76.338 L
263.9 81.734 L
268.8 84.208 L
273.7 83.893 L
278.6 85.848 L
283.5 89.844 L
288.4 91.396 L
293.3 87.984 L
298.2 83.71 L
303.1 92.956 L
308 122.185 L
312.9 156.359 L
317.8 178.75 L
322.7 188.66 L
327.6 193.232 L
332.5 196.858 L
337.4 198.919 L
342.3 197.403 L
347.2 194.588 L
352.1 192.999 L
357 193.925 L
357.029 193.964 L
S
GR
GS
0.2 GC
1 LJ
2 LW
N
111.971 202.833 M
112 202.791 L
116.9 200.641 L
121.8 206.336 L
126.7 212.813 L
131.6 213.668 L
136.5 208.536 L
141.4 201.725 L
146.3 196.92 L
151.2 197.383 L
156.1 200.294 L
161 199.147 L
165.9 183.932 L
170.8 151.179 L
175.7 109.183 L
180.6 76.567 L
185.5 64.654 L
190.4 66.24 L
195.3 68.317 L
200.2 72.517 L
205.1 79.574 L
210 87.056 L
214.9 92.45 L
219.8 95.841 L
224.7 96.369 L
229.6 93.988 L
234.5 89.708 L
239.4 87.107 L
244.3 86.579 L
249.2 84.242 L
254.1 81.21 L
259 83.412 L
263.9 89.041 L
268.8 92.614 L
273.7 93.353 L
278.6 94.789 L
283.5 97.99 L
288.4 99.232 L
293.3 95.02 L
298.2 90.23 L
303.1 99.487 L
308 128.345 L
312.9 161.703 L
317.8 183.654 L
322.7 193.799 L
327.6 198.132 L
332.5 201.551 L
337.4 203.989 L
342.3 203.035 L
347.2 200.54 L
352.1 198.723 L
357 199.251 L
357.029 199.289 L
S
GR
GS
[1 0 0 1 224.5 157.25] CT
/Helvetica 17 F
GS
[1 0 0 1 0 0] CT
0 6.5 moveto 
1 -1 scale
(Load 1) t 
GR
GR
GS
0.8 GC
1 LJ
2 LW
N
191.5 157.25 M
221.5 157.25 L
S
GR
GS
[1 0 0 1 224.5 178.25] CT
/Helvetica 17 F
GS
[1 0 0 1 0 0] CT
0 6.5 moveto 
1 -1 scale
(Load 2) t 
GR
GR
GS
0.6 GC
1 LJ
2 LW
N
191.5 178.25 M
221.5 178.25 L
S
GR
GS
[1 0 0 1 224.5 199.25] CT
/Helvetica 17 F
GS
[1 0 0 1 0 0] CT
0 6.5 moveto 
1 -1 scale
(Load 3) t 
GR
GR
GS
0.4 GC
1 LJ
2 LW
N
191.5 199.25 M
221.5 199.25 L
S
GR
GS
[1 0 0 1 224.5 220.25] CT
/Helvetica 17 F
GS
[1 0 0 1 0 0] CT
0 6.5 moveto 
1 -1 scale
(Load 4) t 
GR
GR
GS
0.2 GC
1 LJ
2 LW
N
191.5 220.25 M
221.5 220.25 L
S
GR
GS
1 GC
N
450.5 240.5 M
695 240.5 L
695 25 L
450.5 25 L
cp
f
GR
GS
0.149 GC
2 setlinecap
1 LJ
0.5 LW
N
450.5 240.5 M
695 240.5 L
S
GR
GS
0.149 GC
2 setlinecap
1 LJ
0.5 LW
N
450.5 240.5 M
450.5 238.055 L
S
GR
GS
0.149 GC
2 setlinecap
1 LJ
0.5 LW
N
499.4 240.5 M
499.4 238.055 L
S
GR
GS
0.149 GC
2 setlinecap
1 LJ
0.5 LW
N
548.3 240.5 M
548.3 238.055 L
S
GR
GS
0.149 GC
2 setlinecap
1 LJ
0.5 LW
N
597.2 240.5 M
597.2 238.055 L
S
GR
GS
0.149 GC
2 setlinecap
1 LJ
0.5 LW
N
646.1 240.5 M
646.1 238.055 L
S
GR
GS
0.149 GC
2 setlinecap
1 LJ
0.5 LW
N
695 240.5 M
695 238.055 L
S
GR
GS
[1 0 0 1 450.5 245.89999] CT
0.149 GC
/Helvetica 17 F
GS
[1 0 0 1 0 0] CT
-8.5 17 moveto 
1 -1 scale
(-1) t 
GR
GR
GS
[1 0 0 1 499.39999 245.89999] CT
0.149 GC
/Helvetica 17 F
GS
[1 0 0 1 0 0] CT
-5 17 moveto 
1 -1 scale
(0) t 
GR
GR
GS
[1 0 0 1 548.29999 245.89999] CT
0.149 GC
/Helvetica 17 F
GS
[1 0 0 1 0 0] CT
-5 17 moveto 
1 -1 scale
(1) t 
GR
GR
GS
[1 0 0 1 597.20001 245.89999] CT
0.149 GC
/Helvetica 17 F
GS
[1 0 0 1 0 0] CT
-5 17 moveto 
1 -1 scale
(2) t 
GR
GR
GS
[1 0 0 1 646.09998 245.89999] CT
0.149 GC
/Helvetica 17 F
GS
[1 0 0 1 0 0] CT
-5 17 moveto 
1 -1 scale
(3) t 
GR
GR
GS
[1 0 0 1 695 245.89999] CT
0.149 GC
/Helvetica 17 F
GS
[1 0 0 1 0 0] CT
-5 17 moveto 
1 -1 scale
(4) t 
GR
GR
GS
[1 0 0 1 572.75012 267.39999] CT
0.149 GC
/Helvetica 17 F
GS
[1 0 0 1 0 0] CT
-107 17 moveto 
1 -1 scale
(Time \(s from stimulus onset\)) t 
GR
GR
GS
0.149 GC
2 setlinecap
1 LJ
0.5 LW
N
450.5 240.5 M
450.5 25 L
S
GR
GS
0.149 GC
2 setlinecap
1 LJ
0.5 LW
N
450.5 240.5 M
452.945 240.5 L
S
GR
GS
0.149 GC
2 setlinecap
1 LJ
0.5 LW
N
450.5 204.583 M
452.945 204.583 L
S
GR
GS
0.149 GC
2 setlinecap
1 LJ
0.5 LW
N
450.5 168.667 M
452.945 168.667 L
S
GR
GS
0.149 GC
2 setlinecap
1 LJ
0.5 LW
N
450.5 132.75 M
452.945 132.75 L
S
GR
GS
0.149 GC
2 setlinecap
1 LJ
0.5 LW
N
450.5 96.833 M
452.945 96.833 L
S
GR
GS
0.149 GC
2 setlinecap
1 LJ
0.5 LW
N
450.5 60.917 M
452.945 60.917 L
S
GR
GS
[1 0 0 1 445.10001 240.5] CT
0.149 GC
/Helvetica 17 F
GS
[1 0 0 1 0 0] CT
-31 6.5 moveto 
1 -1 scale
(-0.1) t 
GR
GR
GS
[1 0 0 1 445.10001 204.58333] CT
0.149 GC
/Helvetica 17 F
GS
[1 0 0 1 0 0] CT
-10 6.5 moveto 
1 -1 scale
(0) t 
GR
GR
GS
[1 0 0 1 445.10001 168.66667] CT
0.149 GC
/Helvetica 17 F
GS
[1 0 0 1 0 0] CT
-24 6.5 moveto 
1 -1 scale
(0.1) t 
GR
GR
GS
[1 0 0 1 445.10001 132.75] CT
0.149 GC
/Helvetica 17 F
GS
[1 0 0 1 0 0] CT
-24 6.5 moveto 
1 -1 scale
(0.2) t 
GR
GR
GS
[1 0 0 1 445.10001 96.83333] CT
0.149 GC
/Helvetica 17 F
GS
[1 0 0 1 0 0] CT
-24 6.5 moveto 
1 -1 scale
(0.3) t 
GR
GR
GS
[1 0 0 1 445.10001 60.91666] CT
0.149 GC
/Helvetica 17 F
GS
[1 0 0 1 0 0] CT
-24 6.5 moveto 
1 -1 scale
(0.4) t 
GR
GR
GS
[0 -1 1 0 411.60001 132.74989] CT
0.149 GC
/Helvetica 17 F
GS
[1 0 0 1 0 0] CT
-56.5 -25 moveto 
1 -1 scale
(relative SSVEP) t 
GR
GR
GS
[0 -1 1 0 411.60001 132.74989] CT
0.149 GC
/Helvetica 17 F
GS
[1 0 0 1 0 0] CT
-45.5 -4 moveto 
1 -1 scale
(Power \(a.u.\)) t 
GR
GR
GS
[1 0 0 1 572.75055 22.875] CT
/Helvetica-Bold 17 F
GS
[1 0 0 1 0 0] CT
-93 -4 moveto 
1 -1 scale
(SpecNorm SSVEP \(OA\)) t 
GR
GR
GS
1 0.949 0.8 RC
N
499.4 240.5 M
649.327 240.5 L
649.327 25 L
499.4 25 L
cp
f
GR
GS
0.98 GC
N
450.471 207.482 M
450.5 207.47 L
455.39 205.79 L
460.28 204.131 L
465.17 203.47 L
470.06 204.638 L
474.95 205.743 L
479.84 206.733 L
484.73 207.837 L
489.62 210.732 L
494.51 214.006 L
499.4 209.395 L
504.29 190.071 L
509.18 157.721 L
514.07 124.17 L
518.96 100.138 L
523.85 90.577 L
528.74 90.455 L
533.63 93.402 L
538.52 97.788 L
543.41 99.92 L
548.3 100.427 L
553.19 99.335 L
558.08 97.205 L
562.97 95.734 L
567.86 97.362 L
572.75 101.338 L
577.64 103.167 L
582.53 101.456 L
587.42 99.377 L
592.31 98.812 L
597.2 97.381 L
602.09 94.314 L
606.98 88.856 L
611.87 80.347 L
616.76 71.394 L
621.65 66.625 L
626.54 65.708 L
631.43 66.011 L
636.32 69.75 L
641.21 89.639 L
646.1 128.616 L
650.99 170.8 L
655.88 198.553 L
660.77 207.638 L
665.66 207.996 L
670.55 207.599 L
675.44 207.88 L
680.33 208.479 L
685.22 209.2 L
690.11 212.076 L
695 213.549 L
695.029 213.53 L
695.029 202.778 L
695.029 202.704 L
695 202.732 L
690.11 203.51 L
685.22 200.941 L
680.33 198.337 L
675.44 196.193 L
670.55 195.325 L
665.66 196.005 L
660.77 196.18 L
655.88 187.706 L
650.99 160.296 L
646.1 117.196 L
641.21 77.516 L
636.32 56.243 L
631.43 51.092 L
626.54 50.474 L
621.65 50.011 L
616.76 53.655 L
611.87 63.038 L
606.98 73.742 L
602.09 81.276 L
597.2 83.42 L
592.31 83.376 L
587.42 83.388 L
582.53 85.276 L
577.64 86.415 L
572.75 83.151 L
567.86 78.071 L
562.97 77.425 L
558.08 80.547 L
553.19 82.851 L
548.3 83.67 L
543.41 83.028 L
538.52 80.455 L
533.63 75.599 L
528.74 73.513 L
523.85 75.042 L
518.96 84.915 L
514.07 109.33 L
509.18 144.626 L
504.29 178.44 L
499.4 199.342 L
494.51 204.195 L
489.62 199.353 L
484.73 196.383 L
479.84 197.151 L
474.95 196.176 L
470.06 192.885 L
465.17 190.126 L
460.28 190.96 L
455.39 194.128 L
450.5 196.169 L
450.471 196.175 L
450.471 207.409 L
cp
f
GR
GS
0.91 GC
1 LJ
0.5 LW
N
450.471 207.482 M
450.5 207.47 L
455.39 205.79 L
460.28 204.131 L
465.17 203.47 L
470.06 204.638 L
474.95 205.743 L
479.84 206.733 L
484.73 207.837 L
489.62 210.732 L
494.51 214.006 L
499.4 209.395 L
504.29 190.071 L
509.18 157.721 L
514.07 124.17 L
518.96 100.138 L
523.85 90.577 L
528.74 90.455 L
533.63 93.402 L
538.52 97.788 L
543.41 99.92 L
548.3 100.427 L
553.19 99.335 L
558.08 97.205 L
562.97 95.734 L
567.86 97.362 L
572.75 101.338 L
577.64 103.167 L
582.53 101.456 L
587.42 99.377 L
592.31 98.812 L
597.2 97.381 L
602.09 94.314 L
606.98 88.856 L
611.87 80.347 L
616.76 71.394 L
621.65 66.625 L
626.54 65.708 L
631.43 66.011 L
636.32 69.75 L
641.21 89.639 L
646.1 128.616 L
650.99 170.8 L
655.88 198.553 L
660.77 207.638 L
665.66 207.996 L
670.55 207.599 L
675.44 207.88 L
680.33 208.479 L
685.22 209.2 L
690.11 212.076 L
695 213.549 L
695.029 213.53 L
S
GR
GS
0.91 GC
1 LJ
0.5 LW
N
450.471 196.175 M
450.5 196.169 L
455.39 194.128 L
460.28 190.96 L
465.17 190.126 L
470.06 192.885 L
474.95 196.176 L
479.84 197.151 L
484.73 196.383 L
489.62 199.353 L
494.51 204.195 L
499.4 199.342 L
504.29 178.44 L
509.18 144.626 L
514.07 109.33 L
518.96 84.915 L
523.85 75.042 L
528.74 73.513 L
533.63 75.599 L
538.52 80.455 L
543.41 83.028 L
548.3 83.67 L
553.19 82.851 L
558.08 80.547 L
562.97 77.425 L
567.86 78.071 L
572.75 83.151 L
577.64 86.415 L
582.53 85.276 L
587.42 83.388 L
592.31 83.376 L
597.2 83.42 L
602.09 81.276 L
606.98 73.742 L
611.87 63.038 L
616.76 53.655 L
621.65 50.011 L
626.54 50.474 L
631.43 51.092 L
636.32 56.243 L
641.21 77.516 L
646.1 117.196 L
650.99 160.296 L
655.88 187.706 L
660.77 196.18 L
665.66 196.005 L
670.55 195.325 L
675.44 196.193 L
680.33 198.337 L
685.22 200.941 L
690.11 203.51 L
695 202.732 L
695.029 202.704 L
S
GR
GS
0.8 GC
1 LJ
2 LW
N
450.471 201.828 M
450.5 201.819 L
455.39 199.959 L
460.28 197.546 L
465.17 196.798 L
470.06 198.761 L
474.95 200.959 L
479.84 201.942 L
484.73 202.11 L
489.62 205.043 L
494.51 209.1 L
499.4 204.369 L
504.29 184.256 L
509.18 151.174 L
514.07 116.75 L
518.96 92.526 L
523.85 82.81 L
528.74 81.984 L
533.63 84.501 L
538.52 89.122 L
543.41 91.474 L
548.3 92.048 L
553.19 91.093 L
558.08 88.876 L
562.97 86.579 L
567.86 87.716 L
572.75 92.244 L
577.64 94.791 L
582.53 93.366 L
587.42 91.383 L
592.31 91.094 L
597.2 90.4 L
602.09 87.795 L
606.98 81.299 L
611.87 71.693 L
616.76 62.525 L
621.65 58.318 L
626.54 58.091 L
631.43 58.551 L
636.32 62.996 L
641.21 83.578 L
646.1 122.906 L
650.99 165.548 L
655.88 193.129 L
660.77 201.909 L
665.66 202.001 L
670.55 201.462 L
675.44 202.036 L
680.33 203.408 L
685.22 205.07 L
690.11 207.793 L
695 208.14 L
695.029 208.117 L
S
GR
GS
0.959 GC
N
450.5 219.886 M
455.39 219.901 L
460.28 218.271 L
465.17 213.897 L
470.06 209.232 L
474.95 209.639 L
479.84 214.351 L
484.73 218.148 L
489.62 219.118 L
494.51 217.327 L
499.4 211.652 L
504.29 200.253 L
509.18 177.75 L
514.07 145.138 L
518.96 115.108 L
523.85 97.055 L
528.74 86.04 L
533.63 78.076 L
538.52 78.177 L
543.41 88.938 L
548.3 103.4 L
553.19 112.699 L
558.08 114.286 L
562.97 110.407 L
567.86 101.817 L
572.75 92.417 L
577.64 86.854 L
582.53 86.049 L
587.42 88.005 L
592.31 89.859 L
597.2 90.211 L
602.09 86.893 L
606.98 81.982 L
611.87 79.956 L
616.76 83.266 L
621.65 89.108 L
626.54 92.383 L
631.43 89.367 L
636.32 86.623 L
641.21 97.363 L
646.1 126.693 L
650.99 164.188 L
655.88 194.333 L
660.77 209.595 L
665.66 212.844 L
670.55 211.624 L
675.44 210.468 L
680.33 211.328 L
685.22 211.991 L
690.11 209.971 L
695 206.754 L
695.029 206.735 L
695.029 196.286 L
695.029 196.222 L
695 196.242 L
690.11 199.09 L
685.22 200.48 L
680.33 200.354 L
675.44 200.39 L
670.55 200.995 L
665.66 201.343 L
660.77 198.149 L
655.88 183.36 L
650.99 152.291 L
646.1 113.191 L
641.21 82.525 L
636.32 71.533 L
631.43 75.17 L
626.54 78.471 L
621.65 74.983 L
616.76 69.872 L
611.87 66.946 L
606.98 68.692 L
602.09 72.31 L
597.2 74.739 L
592.31 74.998 L
587.42 74.229 L
582.53 72.603 L
577.64 72.877 L
572.75 78.981 L
567.86 89.159 L
562.97 97.608 L
558.08 100.751 L
553.19 98.31 L
548.3 87.546 L
543.41 72.407 L
538.52 62.422 L
533.63 62.961 L
528.74 71.384 L
523.85 82.55 L
518.96 100.523 L
514.07 131.167 L
509.18 165.052 L
504.29 188.134 L
499.4 199.564 L
494.51 206.184 L
489.62 208.914 L
484.73 207.269 L
479.84 202.665 L
474.95 197.705 L
470.06 197.52 L
465.17 202.739 L
460.28 207.904 L
455.39 208.503 L
450.5 207.385 L
450.471 207.374 L
450.471 207.445 L
450.471 219.872 L
cp
f
GR
GS
0.82 GC
1 LJ
0.5 LW
N
450.471 219.872 M
450.5 219.886 L
455.39 219.901 L
460.28 218.271 L
465.17 213.897 L
470.06 209.232 L
474.95 209.639 L
479.84 214.351 L
484.73 218.148 L
489.62 219.118 L
494.51 217.327 L
499.4 211.652 L
504.29 200.253 L
509.18 177.75 L
514.07 145.138 L
518.96 115.108 L
523.85 97.055 L
528.74 86.04 L
533.63 78.076 L
538.52 78.177 L
543.41 88.938 L
548.3 103.4 L
553.19 112.699 L
558.08 114.286 L
562.97 110.407 L
567.86 101.817 L
572.75 92.417 L
577.64 86.854 L
582.53 86.049 L
587.42 88.005 L
592.31 89.859 L
597.2 90.211 L
602.09 86.893 L
606.98 81.982 L
611.87 79.956 L
616.76 83.266 L
621.65 89.108 L
626.54 92.383 L
631.43 89.367 L
636.32 86.623 L
641.21 97.363 L
646.1 126.693 L
650.99 164.188 L
655.88 194.333 L
660.77 209.595 L
665.66 212.844 L
670.55 211.624 L
675.44 210.468 L
680.33 211.328 L
685.22 211.991 L
690.11 209.971 L
695 206.754 L
695.029 206.735 L
S
GR
GS
0.82 GC
1 LJ
0.5 LW
N
450.471 207.374 M
450.5 207.385 L
455.39 208.503 L
460.28 207.904 L
465.17 202.739 L
470.06 197.52 L
474.95 197.705 L
479.84 202.665 L
484.73 207.269 L
489.62 208.914 L
494.51 206.184 L
499.4 199.564 L
504.29 188.134 L
509.18 165.052 L
514.07 131.167 L
518.96 100.523 L
523.85 82.55 L
528.74 71.384 L
533.63 62.961 L
538.52 62.422 L
543.41 72.407 L
548.3 87.546 L
553.19 98.31 L
558.08 100.751 L
562.97 97.608 L
567.86 89.159 L
572.75 78.981 L
577.64 72.877 L
582.53 72.603 L
587.42 74.229 L
592.31 74.998 L
597.2 74.739 L
602.09 72.31 L
606.98 68.692 L
611.87 66.946 L
616.76 69.872 L
621.65 74.983 L
626.54 78.471 L
631.43 75.17 L
636.32 71.533 L
641.21 82.525 L
646.1 113.191 L
650.99 152.291 L
655.88 183.36 L
660.77 198.149 L
665.66 201.343 L
670.55 200.995 L
675.44 200.39 L
680.33 200.354 L
685.22 200.48 L
690.11 199.09 L
695 196.242 L
695.029 196.222 L
S
GR
GS
0.6 GC
1 LJ
2 LW
N
450.471 213.623 M
450.5 213.635 L
455.39 214.202 L
460.28 213.088 L
465.17 208.318 L
470.06 203.376 L
474.95 203.672 L
479.84 208.508 L
484.73 212.709 L
489.62 214.016 L
494.51 211.755 L
499.4 205.608 L
504.29 194.194 L
509.18 171.401 L
514.07 138.153 L
518.96 107.815 L
523.85 89.803 L
528.74 78.712 L
533.63 70.518 L
538.52 70.299 L
543.41 80.672 L
548.3 95.473 L
553.19 105.504 L
558.08 107.518 L
562.97 104.007 L
567.86 95.488 L
572.75 85.699 L
577.64 79.866 L
582.53 79.326 L
587.42 81.117 L
592.31 82.429 L
597.2 82.475 L
602.09 79.601 L
606.98 75.337 L
611.87 73.451 L
616.76 76.569 L
621.65 82.045 L
626.54 85.427 L
631.43 82.269 L
636.32 79.078 L
641.21 89.944 L
646.1 119.942 L
650.99 158.239 L
655.88 188.847 L
660.77 203.872 L
665.66 207.093 L
670.55 206.31 L
675.44 205.429 L
680.33 205.841 L
685.22 206.236 L
690.11 204.531 L
695 201.498 L
695.029 201.478 L
S
GR
GS
0.939 GC
N
460.28 208.79 M
465.17 211.673 L
470.06 213.031 L
474.95 211.606 L
479.84 209.542 L
484.73 208.796 L
489.62 211.132 L
494.51 214.197 L
499.4 209.976 L
504.29 193.724 L
509.18 165.2 L
514.07 129.382 L
518.96 102.638 L
523.85 96.194 L
528.74 102.1 L
533.63 105.802 L
538.52 105.849 L
543.41 103.304 L
548.3 100.336 L
553.19 98.853 L
558.08 102.072 L
562.97 109.519 L
567.86 114.739 L
572.75 112.042 L
577.64 105.329 L
582.53 99.298 L
587.42 96.204 L
592.31 96.818 L
597.2 96.787 L
602.09 92.977 L
606.98 89.295 L
611.87 89.133 L
616.76 90.829 L
621.65 89.68 L
626.54 83.52 L
631.43 75.736 L
636.32 75.491 L
641.21 92.67 L
646.1 127.915 L
650.99 169.159 L
655.88 198.618 L
660.77 210.61 L
665.66 210.598 L
670.55 204.855 L
675.44 197.04 L
680.33 193.113 L
685.22 195.534 L
690.11 200.469 L
695 204.263 L
695.029 204.278 L
695.029 204.216 L
695.029 193.114 L
695 193.094 L
690.11 190.08 L
685.22 185.289 L
680.33 181.995 L
675.44 185.899 L
670.55 194.593 L
665.66 201.354 L
660.77 201.546 L
655.88 188.931 L
650.99 158.003 L
646.1 115.83 L
641.21 79.439 L
636.32 60.573 L
631.43 59.97 L
626.54 67.17 L
621.65 72.973 L
616.76 73.761 L
611.87 70.874 L
606.98 70.121 L
602.09 75.106 L
597.2 81.238 L
592.31 82.483 L
587.42 81.8 L
582.53 83.656 L
577.64 89.021 L
572.75 97.61 L
567.86 103.065 L
562.97 99.831 L
558.08 90.852 L
553.19 84.729 L
548.3 85.47 L
543.41 89.718 L
538.52 92.82 L
533.63 92.37 L
528.74 87.563 L
523.85 80.515 L
518.96 87.9 L
514.07 116.674 L
509.18 154.582 L
504.29 184.592 L
499.4 201.364 L
494.51 204.517 L
489.62 199.949 L
484.73 197.744 L
479.84 198.797 L
474.95 199.981 L
470.06 200.353 L
465.17 198.867 L
460.28 197.121 L
455.39 196.496 L
450.5 196.01 L
450.471 196.018 L
450.471 206.793 L
450.471 206.858 L
450.5 206.849 L
455.39 207.105 L
cp
f
GR
GS
0.729 GC
1 LJ
0.5 LW
N
450.471 206.858 M
450.5 206.849 L
455.39 207.105 L
460.28 208.79 L
465.17 211.673 L
470.06 213.031 L
474.95 211.606 L
479.84 209.542 L
484.73 208.796 L
489.62 211.132 L
494.51 214.197 L
499.4 209.976 L
504.29 193.724 L
509.18 165.2 L
514.07 129.382 L
518.96 102.638 L
523.85 96.194 L
528.74 102.1 L
533.63 105.802 L
538.52 105.849 L
543.41 103.304 L
548.3 100.336 L
553.19 98.853 L
558.08 102.072 L
562.97 109.519 L
567.86 114.739 L
572.75 112.042 L
577.64 105.329 L
582.53 99.298 L
587.42 96.204 L
592.31 96.818 L
597.2 96.787 L
602.09 92.977 L
606.98 89.295 L
611.87 89.133 L
616.76 90.829 L
621.65 89.68 L
626.54 83.52 L
631.43 75.736 L
636.32 75.491 L
641.21 92.67 L
646.1 127.915 L
650.99 169.159 L
655.88 198.618 L
660.77 210.61 L
665.66 210.598 L
670.55 204.855 L
675.44 197.04 L
680.33 193.113 L
685.22 195.534 L
690.11 200.469 L
695 204.263 L
695.029 204.278 L
S
GR
GS
0.729 GC
1 LJ
0.5 LW
N
450.471 196.018 M
450.5 196.01 L
455.39 196.496 L
460.28 197.121 L
465.17 198.867 L
470.06 200.353 L
474.95 199.981 L
479.84 198.797 L
484.73 197.744 L
489.62 199.949 L
494.51 204.517 L
499.4 201.364 L
504.29 184.592 L
509.18 154.582 L
514.07 116.674 L
518.96 87.9 L
523.85 80.515 L
528.74 87.563 L
533.63 92.37 L
538.52 92.82 L
543.41 89.718 L
548.3 85.47 L
553.19 84.729 L
558.08 90.852 L
562.97 99.831 L
567.86 103.065 L
572.75 97.61 L
577.64 89.021 L
582.53 83.656 L
587.42 81.8 L
592.31 82.483 L
597.2 81.238 L
602.09 75.106 L
606.98 70.121 L
611.87 70.874 L
616.76 73.761 L
621.65 72.973 L
626.54 67.17 L
631.43 59.97 L
636.32 60.573 L
641.21 79.439 L
646.1 115.83 L
650.99 158.003 L
655.88 188.931 L
660.77 201.546 L
665.66 201.354 L
670.55 194.593 L
675.44 185.899 L
680.33 181.995 L
685.22 185.289 L
690.11 190.08 L
695 193.094 L
695.029 193.114 L
S
GR
GS
0.4 GC
1 LJ
2 LW
N
450.471 201.438 M
450.5 201.43 L
455.39 201.8 L
460.28 202.956 L
465.17 205.27 L
470.06 206.692 L
474.95 205.793 L
479.84 204.17 L
484.73 203.27 L
489.62 205.541 L
494.51 209.357 L
499.4 205.67 L
504.29 189.158 L
509.18 159.891 L
514.07 123.028 L
518.96 95.269 L
523.85 88.354 L
528.74 94.832 L
533.63 99.086 L
538.52 99.334 L
543.41 96.511 L
548.3 92.903 L
553.19 91.791 L
558.08 96.462 L
562.97 104.675 L
567.86 108.902 L
572.75 104.826 L
577.64 97.175 L
582.53 91.477 L
587.42 89.002 L
592.31 89.651 L
597.2 89.012 L
602.09 84.042 L
606.98 79.708 L
611.87 80.003 L
616.76 82.295 L
621.65 81.326 L
626.54 75.345 L
631.43 67.853 L
636.32 68.032 L
641.21 86.055 L
646.1 121.872 L
650.99 163.581 L
655.88 193.775 L
660.77 206.078 L
665.66 205.976 L
670.55 199.724 L
675.44 191.47 L
680.33 187.554 L
685.22 190.411 L
690.11 195.275 L
695 198.678 L
695.029 198.696 L
S
GR
GS
0.918 GC
N
460.28 220.531 M
465.17 221.374 L
470.06 216.585 L
474.95 208.845 L
479.84 204.607 L
484.73 205.745 L
489.62 207.406 L
494.51 204.412 L
499.4 196.459 L
504.29 182.743 L
509.18 161.456 L
514.07 134.571 L
518.96 110.547 L
523.85 95.839 L
528.74 89.087 L
533.63 85.983 L
538.52 85.929 L
543.41 89.078 L
548.3 92.6 L
553.19 94.19 L
558.08 96.339 L
562.97 102.02 L
567.86 108.121 L
572.75 110.594 L
577.64 106.324 L
582.53 99.58 L
587.42 96.259 L
592.31 95.613 L
597.2 94.513 L
602.09 95.398 L
606.98 97.706 L
611.87 98.595 L
616.76 95.315 L
621.65 90.118 L
626.54 87.511 L
631.43 88.494 L
636.32 93.544 L
641.21 108.73 L
646.1 137.412 L
650.99 169.962 L
655.88 192.536 L
660.77 202.089 L
665.66 203.436 L
670.55 205.048 L
675.44 211.077 L
680.33 218.056 L
685.22 225.166 L
690.11 228.63 L
695 226.259 L
695.029 226.225 L
695.029 216.061 L
695.029 215.995 L
695 216.034 L
690.11 219.734 L
685.22 216.755 L
680.33 209.468 L
675.44 201.693 L
670.55 194.996 L
665.66 193.554 L
660.77 192.335 L
655.88 182.428 L
650.99 159.553 L
646.1 126.917 L
641.21 97.185 L
636.32 80.504 L
631.43 74.621 L
626.54 73.99 L
621.65 77.526 L
616.76 83.284 L
611.87 86.174 L
606.98 83.72 L
602.09 80.543 L
597.2 79.541 L
592.31 80.458 L
587.42 80.819 L
582.53 83.553 L
577.64 90.317 L
572.75 95.259 L
567.86 92.831 L
562.97 87.309 L
558.08 83.677 L
553.19 82.71 L
548.3 80.857 L
543.41 76.52 L
538.52 72.771 L
533.63 73.212 L
528.74 76.9 L
523.85 82.63 L
518.96 95.845 L
514.07 120.402 L
509.18 149.381 L
504.29 171.797 L
499.4 185.503 L
494.51 193.846 L
489.62 197.304 L
484.73 195.344 L
479.84 193.436 L
474.95 196.995 L
470.06 203.944 L
465.17 208.424 L
460.28 208.584 L
455.39 206.202 L
450.5 203.308 L
450.471 203.295 L
450.471 203.36 L
450.471 213.673 L
450.5 213.683 L
455.39 216.916 L
cp
f
GR
GS
0.639 GC
1 LJ
0.5 LW
N
450.471 213.673 M
450.5 213.683 L
455.39 216.916 L
460.28 220.531 L
465.17 221.374 L
470.06 216.585 L
474.95 208.845 L
479.84 204.607 L
484.73 205.745 L
489.62 207.406 L
494.51 204.412 L
499.4 196.459 L
504.29 182.743 L
509.18 161.456 L
514.07 134.571 L
518.96 110.547 L
523.85 95.839 L
528.74 89.087 L
533.63 85.983 L
538.52 85.929 L
543.41 89.078 L
548.3 92.6 L
553.19 94.19 L
558.08 96.339 L
562.97 102.02 L
567.86 108.121 L
572.75 110.594 L
577.64 106.324 L
582.53 99.58 L
587.42 96.259 L
592.31 95.613 L
597.2 94.513 L
602.09 95.398 L
606.98 97.706 L
611.87 98.595 L
616.76 95.315 L
621.65 90.118 L
626.54 87.511 L
631.43 88.494 L
636.32 93.544 L
641.21 108.73 L
646.1 137.412 L
650.99 169.962 L
655.88 192.536 L
660.77 202.089 L
665.66 203.436 L
670.55 205.048 L
675.44 211.077 L
680.33 218.056 L
685.22 225.166 L
690.11 228.63 L
695 226.259 L
695.029 226.225 L
S
GR
GS
0.639 GC
1 LJ
0.5 LW
N
450.471 203.295 M
450.5 203.308 L
455.39 206.202 L
460.28 208.584 L
465.17 208.424 L
470.06 203.944 L
474.95 196.995 L
479.84 193.436 L
484.73 195.344 L
489.62 197.304 L
494.51 193.846 L
499.4 185.503 L
504.29 171.797 L
509.18 149.381 L
514.07 120.402 L
518.96 95.845 L
523.85 82.63 L
528.74 76.9 L
533.63 73.212 L
538.52 72.771 L
543.41 76.52 L
548.3 80.857 L
553.19 82.71 L
558.08 83.677 L
562.97 87.309 L
567.86 92.831 L
572.75 95.259 L
577.64 90.317 L
582.53 83.553 L
587.42 80.819 L
592.31 80.458 L
597.2 79.541 L
602.09 80.543 L
606.98 83.72 L
611.87 86.174 L
616.76 83.284 L
621.65 77.526 L
626.54 73.99 L
631.43 74.621 L
636.32 80.504 L
641.21 97.185 L
646.1 126.917 L
650.99 159.553 L
655.88 182.428 L
660.77 192.335 L
665.66 193.554 L
670.55 194.996 L
675.44 201.693 L
680.33 209.468 L
685.22 216.755 L
690.11 219.734 L
695 216.034 L
695.029 215.995 L
S
GR
GS
0.2 GC
1 LJ
2 LW
N
450.471 208.484 M
450.5 208.495 L
455.39 211.559 L
460.28 214.557 L
465.17 214.899 L
470.06 210.265 L
474.95 202.92 L
479.84 199.022 L
484.73 200.544 L
489.62 202.355 L
494.51 199.129 L
499.4 190.981 L
504.29 177.27 L
509.18 155.418 L
514.07 127.487 L
518.96 103.196 L
523.85 89.234 L
528.74 82.994 L
533.63 79.597 L
538.52 79.35 L
543.41 82.799 L
548.3 86.728 L
553.19 88.45 L
558.08 90.008 L
562.97 94.665 L
567.86 100.476 L
572.75 102.926 L
577.64 98.32 L
582.53 91.567 L
587.42 88.539 L
592.31 88.035 L
597.2 87.027 L
602.09 87.971 L
606.98 90.713 L
611.87 92.384 L
616.76 89.3 L
621.65 83.822 L
626.54 80.75 L
631.43 81.557 L
636.32 87.024 L
641.21 102.958 L
646.1 132.164 L
650.99 164.758 L
655.88 187.482 L
660.77 197.212 L
665.66 198.495 L
670.55 200.022 L
675.44 206.385 L
680.33 213.762 L
685.22 220.96 L
690.11 224.182 L
695 221.147 L
695.029 221.11 L
S
GR
GS
[1 0 0 1 563 157.25] CT
/Helvetica 17 F
GS
[1 0 0 1 0 0] CT
0 6.5 moveto 
1 -1 scale
(Load 1) t 
GR
GR
GS
0.8 GC
1 LJ
2 LW
N
530 157.25 M
560 157.25 L
S
GR
GS
[1 0 0 1 563 178.25] CT
/Helvetica 17 F
GS
[1 0 0 1 0 0] CT
0 6.5 moveto 
1 -1 scale
(Load 2) t 
GR
GR
GS
0.6 GC
1 LJ
2 LW
N
530 178.25 M
560 178.25 L
S
GR
GS
[1 0 0 1 563 199.25] CT
/Helvetica 17 F
GS
[1 0 0 1 0 0] CT
0 6.5 moveto 
1 -1 scale
(Load 3) t 
GR
GR
GS
0.4 GC
1 LJ
2 LW
N
530 199.25 M
560 199.25 L
S
GR
GS
[1 0 0 1 563 220.25] CT
/Helvetica 17 F
GS
[1 0 0 1 0 0] CT
0 6.5 moveto 
1 -1 scale
(Load 4) t 
GR
GR
GS
0.2 GC
1 LJ
2 LW
N
530 220.25 M
560 220.25 L
S
GR
%%Trailer
%%Pages: 1
%%EOF
