%!PS-Adobe-3.0 EPSF-3.0
%%Creator: (MATLAB, The Mathworks, Inc. Version 9.10.0.1602886 \(R2021a\). Operating System: Mac OS X)
%%Title: /Users/kosciessa/Desktop/tardis/LNDG/stateswitch/stsw_eeg_task/mse/figures/e01_EntropyTraces_oa.eps
%%CreationDate: 2022-02-17T09:22:19
%%Pages: (atend)
%%BoundingBox:     4     0   375   240
%%LanguageLevel: 3
%%EndComments
%%BeginProlog
%%BeginResource: procset (Apache XML Graphics Std ProcSet) 1.2 0
%%Version: 1.2 0
%%Copyright: (Copyright 2001-2003,2010 The Apache Software Foundation. License terms: http://www.apache.org/licenses/LICENSE-2.0)
/bd{bind def}bind def
/ld{load def}bd
/GR/grestore ld
/GS/gsave ld
/RM/rmoveto ld
/C/curveto ld
/t/show ld
/L/lineto ld
/ML/setmiterlimit ld
/CT/concat ld
/f/fill ld
/N/newpath ld
/S/stroke ld
/CC/setcmykcolor ld
/A/ashow ld
/cp/closepath ld
/RC/setrgbcolor ld
/LJ/setlinejoin ld
/GC/setgray ld
/LW/setlinewidth ld
/M/moveto ld
/re {4 2 roll M
1 index 0 rlineto
0 exch rlineto
neg 0 rlineto
cp } bd
/_ctm matrix def
/_tm matrix def
/BT { _ctm currentmatrix pop matrix _tm copy pop 0 0 moveto } bd
/ET { _ctm setmatrix } bd
/iTm { _ctm setmatrix _tm concat } bd
/Tm { _tm astore pop iTm 0 0 moveto } bd
/ux 0.0 def
/uy 0.0 def
/F {
  /Tp exch def
  /Tf exch def
  Tf findfont Tp scalefont setfont
  /cf Tf def  /cs Tp def
} bd
/ULS {currentpoint /uy exch def /ux exch def} bd
/ULE {
  /Tcx currentpoint pop def
  gsave
  newpath
  cf findfont cs scalefont dup
  /FontMatrix get 0 get /Ts exch def /FontInfo get dup
  /UnderlinePosition get Ts mul /To exch def
  /UnderlineThickness get Ts mul /Tt exch def
  ux uy To add moveto  Tcx uy To add lineto
  Tt setlinewidth stroke
  grestore
} bd
/OLE {
  /Tcx currentpoint pop def
  gsave
  newpath
  cf findfont cs scalefont dup
  /FontMatrix get 0 get /Ts exch def /FontInfo get dup
  /UnderlinePosition get Ts mul /To exch def
  /UnderlineThickness get Ts mul /Tt exch def
  ux uy To add cs add moveto Tcx uy To add cs add lineto
  Tt setlinewidth stroke
  grestore
} bd
/SOE {
  /Tcx currentpoint pop def
  gsave
  newpath
  cf findfont cs scalefont dup
  /FontMatrix get 0 get /Ts exch def /FontInfo get dup
  /UnderlinePosition get Ts mul /To exch def
  /UnderlineThickness get Ts mul /Tt exch def
  ux uy To add cs 10 mul 26 idiv add moveto Tcx uy To add cs 10 mul 26 idiv add lineto
  Tt setlinewidth stroke
  grestore
} bd
/QT {
/Y22 exch store
/X22 exch store
/Y21 exch store
/X21 exch store
currentpoint
/Y21 load 2 mul add 3 div exch
/X21 load 2 mul add 3 div exch
/X21 load 2 mul /X22 load add 3 div
/Y21 load 2 mul /Y22 load add 3 div
/X22 load /Y22 load curveto
} bd
/SSPD {
dup length /d exch dict def
{
/v exch def
/k exch def
currentpagedevice k known {
/cpdv currentpagedevice k get def
v cpdv ne {
/upd false def
/nullv v type /nulltype eq def
/nullcpdv cpdv type /nulltype eq def
nullv nullcpdv or
{
/upd true def
} {
/sametype v type cpdv type eq def
sametype {
v type /arraytype eq {
/vlen v length def
/cpdvlen cpdv length def
vlen cpdvlen eq {
0 1 vlen 1 sub {
/i exch def
/obj v i get def
/cpdobj cpdv i get def
obj cpdobj ne {
/upd true def
exit
} if
} for
} {
/upd true def
} ifelse
} {
v type /dicttype eq {
v {
/dv exch def
/dk exch def
/cpddv cpdv dk get def
dv cpddv ne {
/upd true def
exit
} if
} forall
} {
/upd true def
} ifelse
} ifelse
} if
} ifelse
upd true eq {
d k v put
} if
} if
} if
} forall
d length 0 gt {
d setpagedevice
} if
} bd
/RE { % /NewFontName [NewEncodingArray] /FontName RE -
  findfont dup length dict begin
  {
    1 index /FID ne
    {def} {pop pop} ifelse
  } forall
  /Encoding exch def
  /FontName 1 index def
  currentdict definefont pop
  end
} bind def
%%EndResource
%%BeginResource: procset (Apache XML Graphics EPS ProcSet) 1.0 0
%%Version: 1.0 0
%%Copyright: (Copyright 2002-2003 The Apache Software Foundation. License terms: http://www.apache.org/licenses/LICENSE-2.0)
/BeginEPSF { %def
/b4_Inc_state save def         % Save state for cleanup
/dict_count countdictstack def % Count objects on dict stack
/op_count count 1 sub def      % Count objects on operand stack
userdict begin                 % Push userdict on dict stack
/showpage { } def              % Redefine showpage, { } = null proc
0 setgray 0 setlinecap         % Prepare graphics state
1 setlinewidth 0 setlinejoin
10 setmiterlimit [ ] 0 setdash newpath
/languagelevel where           % If level not equal to 1 then
{pop languagelevel             % set strokeadjust and
1 ne                           % overprint to their defaults.
{false setstrokeadjust false setoverprint
} if
} if
} bd
/EndEPSF { %def
count op_count sub {pop} repeat            % Clean up stacks
countdictstack dict_count sub {end} repeat
b4_Inc_state restore
} bd
%%EndResource
%FOPBeginFontDict
%%IncludeResource: font Courier-Oblique
%%IncludeResource: font Courier-BoldOblique
%%IncludeResource: font Courier-Bold
%%IncludeResource: font ZapfDingbats
%%IncludeResource: font Symbol
%%IncludeResource: font Helvetica
%%IncludeResource: font Helvetica-Oblique
%%IncludeResource: font Helvetica-Bold
%%IncludeResource: font Helvetica-BoldOblique
%%IncludeResource: font Times-Roman
%%IncludeResource: font Times-Italic
%%IncludeResource: font Times-Bold
%%IncludeResource: font Times-BoldItalic
%%IncludeResource: font Courier
%FOPEndFontDict
%%BeginResource: encoding WinAnsiEncoding
/WinAnsiEncoding [
/.notdef /.notdef /.notdef /.notdef /.notdef
/.notdef /.notdef /.notdef /.notdef /.notdef
/.notdef /.notdef /.notdef /.notdef /.notdef
/.notdef /.notdef /.notdef /.notdef /.notdef
/.notdef /.notdef /.notdef /.notdef /.notdef
/.notdef /.notdef /.notdef /.notdef /.notdef
/.notdef /.notdef /space /exclam /quotedbl
/numbersign /dollar /percent /ampersand /quotesingle
/parenleft /parenright /asterisk /plus /comma
/hyphen /period /slash /zero /one
/two /three /four /five /six
/seven /eight /nine /colon /semicolon
/less /equal /greater /question /at
/A /B /C /D /E
/F /G /H /I /J
/K /L /M /N /O
/P /Q /R /S /T
/U /V /W /X /Y
/Z /bracketleft /backslash /bracketright /asciicircum
/underscore /quoteleft /a /b /c
/d /e /f /g /h
/i /j /k /l /m
/n /o /p /q /r
/s /t /u /v /w
/x /y /z /braceleft /bar
/braceright /asciitilde /bullet /Euro /bullet
/quotesinglbase /florin /quotedblbase /ellipsis /dagger
/daggerdbl /circumflex /perthousand /Scaron /guilsinglleft
/OE /bullet /Zcaron /bullet /bullet
/quoteleft /quoteright /quotedblleft /quotedblright /bullet
/endash /emdash /asciitilde /trademark /scaron
/guilsinglright /oe /bullet /zcaron /Ydieresis
/space /exclamdown /cent /sterling /currency
/yen /brokenbar /section /dieresis /copyright
/ordfeminine /guillemotleft /logicalnot /sfthyphen /registered
/macron /degree /plusminus /twosuperior /threesuperior
/acute /mu /paragraph /middot /cedilla
/onesuperior /ordmasculine /guillemotright /onequarter /onehalf
/threequarters /questiondown /Agrave /Aacute /Acircumflex
/Atilde /Adieresis /Aring /AE /Ccedilla
/Egrave /Eacute /Ecircumflex /Edieresis /Igrave
/Iacute /Icircumflex /Idieresis /Eth /Ntilde
/Ograve /Oacute /Ocircumflex /Otilde /Odieresis
/multiply /Oslash /Ugrave /Uacute /Ucircumflex
/Udieresis /Yacute /Thorn /germandbls /agrave
/aacute /acircumflex /atilde /adieresis /aring
/ae /ccedilla /egrave /eacute /ecircumflex
/edieresis /igrave /iacute /icircumflex /idieresis
/eth /ntilde /ograve /oacute /ocircumflex
/otilde /odieresis /divide /oslash /ugrave
/uacute /ucircumflex /udieresis /yacute /thorn
/ydieresis
] def
%%EndResource
%FOPBeginFontReencode
/Courier-Oblique findfont
dup length dict begin
  {1 index /FID ne {def} {pop pop} ifelse} forall
  /Encoding WinAnsiEncoding def
  currentdict
end
/Courier-Oblique exch definefont pop
/Courier-BoldOblique findfont
dup length dict begin
  {1 index /FID ne {def} {pop pop} ifelse} forall
  /Encoding WinAnsiEncoding def
  currentdict
end
/Courier-BoldOblique exch definefont pop
/Courier-Bold findfont
dup length dict begin
  {1 index /FID ne {def} {pop pop} ifelse} forall
  /Encoding WinAnsiEncoding def
  currentdict
end
/Courier-Bold exch definefont pop
/Helvetica findfont
dup length dict begin
  {1 index /FID ne {def} {pop pop} ifelse} forall
  /Encoding WinAnsiEncoding def
  currentdict
end
/Helvetica exch definefont pop
/Helvetica-Oblique findfont
dup length dict begin
  {1 index /FID ne {def} {pop pop} ifelse} forall
  /Encoding WinAnsiEncoding def
  currentdict
end
/Helvetica-Oblique exch definefont pop
/Helvetica-Bold findfont
dup length dict begin
  {1 index /FID ne {def} {pop pop} ifelse} forall
  /Encoding WinAnsiEncoding def
  currentdict
end
/Helvetica-Bold exch definefont pop
/Helvetica-BoldOblique findfont
dup length dict begin
  {1 index /FID ne {def} {pop pop} ifelse} forall
  /Encoding WinAnsiEncoding def
  currentdict
end
/Helvetica-BoldOblique exch definefont pop
/Times-Roman findfont
dup length dict begin
  {1 index /FID ne {def} {pop pop} ifelse} forall
  /Encoding WinAnsiEncoding def
  currentdict
end
/Times-Roman exch definefont pop
/Times-Italic findfont
dup length dict begin
  {1 index /FID ne {def} {pop pop} ifelse} forall
  /Encoding WinAnsiEncoding def
  currentdict
end
/Times-Italic exch definefont pop
/Times-Bold findfont
dup length dict begin
  {1 index /FID ne {def} {pop pop} ifelse} forall
  /Encoding WinAnsiEncoding def
  currentdict
end
/Times-Bold exch definefont pop
/Times-BoldItalic findfont
dup length dict begin
  {1 index /FID ne {def} {pop pop} ifelse} forall
  /Encoding WinAnsiEncoding def
  currentdict
end
/Times-BoldItalic exch definefont pop
/Courier findfont
dup length dict begin
  {1 index /FID ne {def} {pop pop} ifelse} forall
  /Encoding WinAnsiEncoding def
  currentdict
end
/Courier exch definefont pop
%FOPEndFontReencode
%%EndProlog
%%Page: 1 1
%%PageBoundingBox: 0 0 410 259
%%BeginPageSetup
[1 0 0 -1 0 259] CT
%%EndPageSetup
GS
[0.99902 0 0 1.00077 0 -0.19998] CT
1 GC
N
0 0 410 259 re
f
GR
GS
[0.99902 0 0 1.00077 0 -0.19998] CT
1 GC
N
0 0 410 259 re
f
GR
GS
[0.99902 0 0 1.00077 0 -0.19998] CT
1 GC
N
65.5 209.5 M
371 209.5 L
371 19.5 L
65.5 19.5 L
cp
f
GR
GS
[0.99902 0 0 1.00077 0 -0.19998] CT
0.149 GC
2 setlinecap
1 LJ
0.5 LW
N
65.5 209.5 M
371 209.5 L
S
GR
GS
[0.99902 0 0 1.00077 0 -0.19998] CT
0.149 GC
2 setlinecap
1 LJ
0.5 LW
N
65.5 209.5 M
65.5 206.446 L
S
GR
GS
[0.99902 0 0 1.00077 0 -0.19998] CT
0.149 GC
2 setlinecap
1 LJ
0.5 LW
N
126.6 209.5 M
126.6 206.446 L
S
GR
GS
[0.99902 0 0 1.00077 0 -0.19998] CT
0.149 GC
2 setlinecap
1 LJ
0.5 LW
N
187.7 209.5 M
187.7 206.446 L
S
GR
GS
[0.99902 0 0 1.00077 0 -0.19998] CT
0.149 GC
2 setlinecap
1 LJ
0.5 LW
N
248.8 209.5 M
248.8 206.446 L
S
GR
GS
[0.99902 0 0 1.00077 0 -0.19998] CT
0.149 GC
2 setlinecap
1 LJ
0.5 LW
N
309.9 209.5 M
309.9 206.446 L
S
GR
GS
[0.99902 0 0 1.00077 0 -0.19998] CT
0.149 GC
2 setlinecap
1 LJ
0.5 LW
N
371 209.5 M
371 206.446 L
S
GR
GS
[0.99902 0 0 1.00077 65.4361 215.06608] CT
0.149 GC
/Helvetica 18 F
GS
[1 0 0 1 0 0] CT
-9 18 moveto 
1 -1 scale
(-1) t 
GR
GR
GS
[0.99902 0 0 1.00077 126.47649 215.06608] CT
0.149 GC
/Helvetica 18 F
GS
[1 0 0 1 0 0] CT
-5.5 18 moveto 
1 -1 scale
(0) t 
GR
GR
GS
[0.99902 0 0 1.00077 187.51688 215.06608] CT
0.149 GC
/Helvetica 18 F
GS
[1 0 0 1 0 0] CT
-5.5 18 moveto 
1 -1 scale
(1) t 
GR
GR
GS
[0.99902 0 0 1.00077 248.55728 215.06608] CT
0.149 GC
/Helvetica 18 F
GS
[1 0 0 1 0 0] CT
-5.5 18 moveto 
1 -1 scale
(2) t 
GR
GR
GS
[0.99902 0 0 1.00077 309.59766 215.06608] CT
0.149 GC
/Helvetica 18 F
GS
[1 0 0 1 0 0] CT
-5.5 18 moveto 
1 -1 scale
(3) t 
GR
GR
GS
[0.99902 0 0 1.00077 370.63805 215.06608] CT
0.149 GC
/Helvetica 18 F
GS
[1 0 0 1 0 0] CT
-5.5 18 moveto 
1 -1 scale
(4) t 
GR
GR
GS
[0.99902 0 0 1.00077 218.03723 237.48341] CT
0.149 GC
/Helvetica 18 F
GS
[1 0 0 1 0 0] CT
-113.5 18 moveto 
1 -1 scale
(Time \(s from stimulus onset\)) t 
GR
GR
GS
[0.99902 0 0 1.00077 0 -0.19998] CT
0.149 GC
2 setlinecap
1 LJ
0.5 LW
N
65.5 209.5 M
65.5 19.5 L
S
GR
GS
[0.99902 0 0 1.00077 0 -0.19998] CT
0.149 GC
2 setlinecap
1 LJ
0.5 LW
N
65.5 203.361 M
68.554 203.361 L
S
GR
GS
[0.99902 0 0 1.00077 0 -0.19998] CT
0.149 GC
2 setlinecap
1 LJ
0.5 LW
N
65.5 125.102 M
68.554 125.102 L
S
GR
GS
[0.99902 0 0 1.00077 0 -0.19998] CT
0.149 GC
2 setlinecap
1 LJ
0.5 LW
N
65.5 46.842 M
68.554 46.842 L
S
GR
GS
[0.99902 0 0 1.00077 59.84156 203.31818] CT
0.149 GC
/Helvetica 18 F
GS
[1 0 0 1 0 0] CT
-36 7 moveto 
1 -1 scale
(0.45) t 
GR
GR
GS
[0.99902 0 0 1.00077 59.84156 124.99815] CT
0.149 GC
/Helvetica 18 F
GS
[1 0 0 1 0 0] CT
-26 7 moveto 
1 -1 scale
(0.5) t 
GR
GR
GS
[0.99902 0 0 1.00077 59.84156 46.67813] CT
0.149 GC
/Helvetica 18 F
GS
[1 0 0 1 0 0] CT
-36 7 moveto 
1 -1 scale
(0.55) t 
GR
GR
GS
[0 -1.00077 0.99902 0 21.47902 114.38837] CT
0.149 GC
/Helvetica 18 F
GS
[1 0 0 1 0 0] CT
-64 -4 moveto 
1 -1 scale
(Sample entropy) t 
GR
GR
GS
[0.99902 0 0 1.00077 0 -0.19998] CT
1 0.949 0.8 RC
N
228.671 209.523 M
309.9 209.523 L
309.9 19.477 L
246.476 19.477 L
126.6 19.477 L
126.6 209.523 L
cp
f
GR
GS
[0.99902 0 0 1.00077 0 -0.19998] CT
0.974 0.9 0.9 RC
N
123.545 121.812 M
114.38 73.426 L
105.215 69.094 L
96.05 64.461 L
86.885 62.447 L
77.72 62.42 L
68.555 63.868 L
65.464 64.377 L
65.464 69.285 L
65.464 72.213 L
68.555 71.274 L
77.72 68.624 L
86.885 68.736 L
96.05 71.861 L
105.215 78.085 L
114.38 82.839 L
123.545 129.846 L
132.71 184.172 L
141.875 178.278 L
151.04 145.238 L
160.205 107.213 L
169.37 78.881 L
178.535 72.879 L
187.7 71.041 L
196.865 74.393 L
206.03 74.597 L
215.195 75.459 L
224.36 73.862 L
233.525 70.03 L
242.69 66.797 L
251.855 63.926 L
261.02 64.035 L
270.185 67.952 L
279.35 73.782 L
288.515 80.17 L
297.68 88.927 L
306.845 94.409 L
316.01 121.063 L
325.175 134.475 L
334.34 128.328 L
343.505 112.387 L
352.67 97.812 L
361.835 85.14 L
371 80.279 L
371.036 80.274 L
371.036 71.833 L
371.036 71.804 L
371 71.804 L
361.835 75.969 L
352.67 88.252 L
343.505 102.289 L
334.34 118.992 L
325.175 126.139 L
316.01 112.919 L
306.845 86.355 L
297.68 81.037 L
288.515 72.572 L
279.35 67.173 L
270.185 61.413 L
261.02 57.449 L
251.855 56.246 L
242.69 57.69 L
233.525 59.943 L
224.36 63.762 L
215.195 66.266 L
206.03 66.073 L
196.865 66.449 L
187.7 63.089 L
178.535 64.513 L
169.37 70.609 L
160.205 99.048 L
151.04 137.62 L
141.875 171.479 L
132.71 177.448 L
cp
f
GR
GS
[0.99902 0 0 1.00077 0 -0.19998] CT
0.957 0.82 0.82 RC
1 LJ
0.5 LW
N
65.464 72.213 M
68.555 71.274 L
77.72 68.624 L
86.885 68.736 L
96.05 71.861 L
105.215 78.085 L
114.38 82.839 L
123.545 129.846 L
132.71 184.172 L
141.875 178.278 L
151.04 145.238 L
160.205 107.213 L
169.37 78.881 L
178.535 72.879 L
187.7 71.041 L
196.865 74.393 L
206.03 74.597 L
215.195 75.459 L
224.36 73.862 L
233.525 70.03 L
242.69 66.797 L
251.855 63.926 L
261.02 64.035 L
270.185 67.952 L
279.35 73.782 L
288.515 80.17 L
297.68 88.927 L
306.845 94.409 L
316.01 121.063 L
325.175 134.475 L
334.34 128.328 L
343.505 112.387 L
352.67 97.812 L
361.835 85.14 L
371 80.279 L
371.036 80.274 L
S
GR
GS
[0.99902 0 0 1.00077 0 -0.19998] CT
0.957 0.82 0.82 RC
1 LJ
0.5 LW
N
65.464 64.377 M
68.555 63.868 L
77.72 62.42 L
86.885 62.447 L
96.05 64.461 L
105.215 69.094 L
114.38 73.426 L
123.545 121.812 L
132.71 177.448 L
141.875 171.479 L
151.04 137.62 L
160.205 99.048 L
169.37 70.609 L
178.535 64.513 L
187.7 63.089 L
196.865 66.449 L
206.03 66.073 L
215.195 66.266 L
224.36 63.762 L
233.525 59.943 L
242.69 57.69 L
251.855 56.246 L
261.02 57.449 L
270.185 61.413 L
279.35 67.173 L
288.515 72.572 L
297.68 81.037 L
306.845 86.355 L
316.01 112.919 L
325.175 126.139 L
334.34 118.992 L
343.505 102.289 L
352.67 88.252 L
361.835 75.969 L
371 71.804 L
371.036 71.804 L
S
GR
GS
[0.99902 0 0 1.00077 0 -0.19998] CT
0.898 0.6 0.6 RC
1 LJ
2 LW
N
65.464 68.295 M
68.555 67.571 L
77.72 65.522 L
86.885 65.591 L
96.05 68.161 L
105.215 73.59 L
114.38 78.132 L
123.545 125.829 L
132.71 180.81 L
141.875 174.878 L
151.04 141.429 L
160.205 103.13 L
169.37 74.745 L
178.535 68.696 L
187.7 67.065 L
196.865 70.421 L
206.03 70.335 L
215.195 70.863 L
224.36 68.812 L
233.525 64.987 L
242.69 62.243 L
251.855 60.086 L
261.02 60.742 L
270.185 64.682 L
279.35 70.478 L
288.515 76.371 L
297.68 84.982 L
306.845 90.382 L
316.01 116.991 L
325.175 130.307 L
334.34 123.66 L
343.505 107.338 L
352.67 93.032 L
361.835 80.555 L
371 76.042 L
371.036 76.039 L
S
GR
GS
[0.99902 0 0 1.00077 0 -0.19998] CT
1 0.875 0.875 RC
N
65.464 77.767 M
65.464 80.749 L
68.555 79.628 L
77.72 77.019 L
86.885 78.962 L
96.05 79.759 L
105.215 78.958 L
114.38 80.212 L
123.545 123.146 L
132.71 175.051 L
141.875 174.412 L
151.04 147.695 L
160.205 119.487 L
169.37 89.715 L
178.535 82.076 L
187.7 79.574 L
196.865 79.318 L
206.03 78.676 L
215.195 75.289 L
224.36 72.449 L
233.525 69.79 L
242.69 66.668 L
251.855 66.37 L
261.02 65.592 L
270.185 66.08 L
279.35 70.734 L
288.515 76.482 L
297.68 86.537 L
306.845 93.74 L
316.01 118.502 L
325.175 125.693 L
334.34 118.831 L
343.505 101.697 L
352.67 89.716 L
361.835 82.119 L
371 79.909 L
371.036 79.9 L
371.036 67.913 L
371.036 67.872 L
371 67.873 L
361.835 68.504 L
352.67 76.387 L
343.505 88.97 L
334.34 107.392 L
325.175 115.222 L
316.01 107.598 L
306.845 82.931 L
297.68 76.216 L
288.515 67.072 L
279.35 62.114 L
270.185 58.271 L
261.02 58.106 L
251.855 58.332 L
242.69 57.959 L
233.525 60.861 L
224.36 63.383 L
215.195 65.888 L
206.03 69.539 L
196.865 70.567 L
187.7 71.373 L
178.535 73.417 L
169.37 80.235 L
160.205 109.388 L
151.04 138.512 L
141.875 166.165 L
132.71 166.66 L
123.545 113.802 L
114.38 70.638 L
105.215 70.66 L
96.05 71.189 L
86.885 69.955 L
77.72 67.516 L
68.555 70.589 L
65.464 71.777 L
cp
f
GR
GS
[0.99902 0 0 1.00077 0 -0.19998] CT
1 0.776 0.776 RC
1 LJ
0.5 LW
N
65.464 80.749 M
68.555 79.628 L
77.72 77.019 L
86.885 78.962 L
96.05 79.759 L
105.215 78.958 L
114.38 80.212 L
123.545 123.146 L
132.71 175.051 L
141.875 174.412 L
151.04 147.695 L
160.205 119.487 L
169.37 89.715 L
178.535 82.076 L
187.7 79.574 L
196.865 79.318 L
206.03 78.676 L
215.195 75.289 L
224.36 72.449 L
233.525 69.79 L
242.69 66.668 L
251.855 66.37 L
261.02 65.592 L
270.185 66.08 L
279.35 70.734 L
288.515 76.482 L
297.68 86.537 L
306.845 93.74 L
316.01 118.502 L
325.175 125.693 L
334.34 118.831 L
343.505 101.697 L
352.67 89.716 L
361.835 82.119 L
371 79.909 L
371.036 79.9 L
S
GR
GS
[0.99902 0 0 1.00077 0 -0.19998] CT
1 0.776 0.776 RC
1 LJ
0.5 LW
N
65.464 71.777 M
68.555 70.589 L
77.72 67.516 L
86.885 69.955 L
96.05 71.189 L
105.215 70.66 L
114.38 70.638 L
123.545 113.802 L
132.71 166.66 L
141.875 166.165 L
151.04 138.512 L
160.205 109.388 L
169.37 80.235 L
178.535 73.417 L
187.7 71.373 L
196.865 70.567 L
206.03 69.539 L
215.195 65.888 L
224.36 63.383 L
233.525 60.861 L
242.69 57.959 L
251.855 58.332 L
261.02 58.106 L
270.185 58.271 L
279.35 62.114 L
288.515 67.072 L
297.68 76.216 L
306.845 82.931 L
316.01 107.598 L
325.175 115.222 L
334.34 107.392 L
343.505 88.97 L
352.67 76.387 L
361.835 68.504 L
371 67.873 L
371.036 67.872 L
S
GR
GS
[0.99902 0 0 1.00077 0 -0.19998] CT
1 0.502 0.502 RC
1 LJ
2 LW
N
65.464 76.263 M
68.555 75.108 L
77.72 72.267 L
86.885 74.458 L
96.05 75.474 L
105.215 74.809 L
114.38 75.425 L
123.545 118.474 L
132.71 170.855 L
141.875 170.288 L
151.04 143.103 L
160.205 114.437 L
169.37 84.975 L
178.535 77.746 L
187.7 75.474 L
196.865 74.942 L
206.03 74.107 L
215.195 70.589 L
224.36 67.916 L
233.525 65.325 L
242.69 62.313 L
251.855 62.351 L
261.02 61.849 L
270.185 62.175 L
279.35 66.424 L
288.515 71.777 L
297.68 81.376 L
306.845 88.335 L
316.01 113.05 L
325.175 120.458 L
334.34 113.112 L
343.505 95.334 L
352.67 83.052 L
361.835 75.311 L
371 73.891 L
371.036 73.886 L
S
GR
GS
[0.99902 0 0 1.00077 0 -0.19998] CT
0.974 0.825 0.825 RC
N
132.71 179.012 M
141.875 177.461 L
151.04 147.649 L
160.205 113.123 L
169.37 79.889 L
178.535 71.746 L
187.7 72.53 L
196.865 72.567 L
206.03 71.822 L
215.195 71.2 L
224.36 71.133 L
233.525 70.442 L
242.69 69.259 L
251.855 66.429 L
261.02 65.949 L
270.185 67.95 L
279.35 70.448 L
288.515 73.626 L
297.68 79.088 L
306.845 82.516 L
316.01 106.861 L
325.175 116.768 L
334.34 112.865 L
343.505 94.159 L
352.67 79.176 L
361.835 68.438 L
371 64.75 L
371.036 64.749 L
371.036 57.179 L
371.036 57.15 L
371 57.15 L
361.835 60.115 L
352.67 71.372 L
343.505 87.102 L
334.34 106.336 L
325.175 110.212 L
316.01 100.136 L
306.845 74.793 L
297.68 71.185 L
288.515 65.529 L
279.35 61.831 L
270.185 59.617 L
261.02 57.891 L
251.855 58.43 L
242.69 61.141 L
233.525 62.104 L
224.36 63.364 L
215.195 63.554 L
206.03 63.144 L
196.865 63.112 L
187.7 63.14 L
178.535 62.348 L
169.37 69.832 L
160.205 103.169 L
151.04 137.23 L
141.875 167.204 L
132.71 168.7 L
123.545 117.487 L
114.38 77.753 L
105.215 74.483 L
96.05 73.669 L
86.885 72.758 L
77.72 71.724 L
68.555 74.933 L
65.464 75.88 L
65.464 81.589 L
65.464 84.64 L
68.555 83.546 L
77.72 80.65 L
86.885 81.782 L
96.05 82.675 L
105.215 83.657 L
114.38 87.703 L
123.545 128.04 L
cp
f
GR
GS
[0.99902 0 0 1.00077 0 -0.19998] CT
0.957 0.686 0.686 RC
1 LJ
0.5 LW
N
65.464 84.64 M
68.555 83.546 L
77.72 80.65 L
86.885 81.782 L
96.05 82.675 L
105.215 83.657 L
114.38 87.703 L
123.545 128.04 L
132.71 179.012 L
141.875 177.461 L
151.04 147.649 L
160.205 113.123 L
169.37 79.889 L
178.535 71.746 L
187.7 72.53 L
196.865 72.567 L
206.03 71.822 L
215.195 71.2 L
224.36 71.133 L
233.525 70.442 L
242.69 69.259 L
251.855 66.429 L
261.02 65.949 L
270.185 67.95 L
279.35 70.448 L
288.515 73.626 L
297.68 79.088 L
306.845 82.516 L
316.01 106.861 L
325.175 116.768 L
334.34 112.865 L
343.505 94.159 L
352.67 79.176 L
361.835 68.438 L
371 64.75 L
371.036 64.749 L
S
GR
GS
[0.99902 0 0 1.00077 0 -0.19998] CT
0.957 0.686 0.686 RC
1 LJ
0.5 LW
N
65.464 75.88 M
68.555 74.933 L
77.72 71.724 L
86.885 72.758 L
96.05 73.669 L
105.215 74.483 L
114.38 77.753 L
123.545 117.487 L
132.71 168.7 L
141.875 167.204 L
151.04 137.23 L
160.205 103.169 L
169.37 69.832 L
178.535 62.348 L
187.7 63.14 L
196.865 63.112 L
206.03 63.144 L
215.195 63.554 L
224.36 63.364 L
233.525 62.104 L
242.69 61.141 L
251.855 58.43 L
261.02 57.891 L
270.185 59.617 L
279.35 61.831 L
288.515 65.529 L
297.68 71.185 L
306.845 74.793 L
316.01 100.136 L
325.175 110.212 L
334.34 106.336 L
343.505 87.102 L
352.67 71.372 L
361.835 60.115 L
371 57.15 L
371.036 57.15 L
S
GR
GS
[0.99902 0 0 1.00077 0 -0.19998] CT
0.898 0.302 0.302 RC
1 LJ
2 LW
N
65.464 80.26 M
68.555 79.24 L
77.72 76.187 L
86.885 77.27 L
96.05 78.172 L
105.215 79.07 L
114.38 82.728 L
123.545 122.763 L
132.71 173.856 L
141.875 172.332 L
151.04 142.439 L
160.205 108.146 L
169.37 74.86 L
178.535 67.047 L
187.7 67.835 L
196.865 67.84 L
206.03 67.483 L
215.195 67.377 L
224.36 67.249 L
233.525 66.273 L
242.69 65.2 L
251.855 62.429 L
261.02 61.92 L
270.185 63.784 L
279.35 66.139 L
288.515 69.577 L
297.68 75.137 L
306.845 78.654 L
316.01 103.498 L
325.175 113.49 L
334.34 109.6 L
343.505 90.63 L
352.67 75.274 L
361.835 64.276 L
371 60.95 L
371.036 60.95 L
S
GR
GS
[0.99902 0 0 1.00077 0 -0.19998] CT
0.9 0.799 0.799 RC
N
65.464 80.599 M
68.555 78.851 L
77.72 75.363 L
86.885 75.156 L
96.05 76.862 L
105.215 81.052 L
114.38 81.701 L
123.545 119.288 L
132.71 169.194 L
141.875 168.819 L
151.04 144.058 L
160.205 112.363 L
169.37 80.945 L
178.535 75.831 L
187.7 77.469 L
196.865 79.583 L
206.03 79.371 L
215.195 76.905 L
224.36 73.53 L
233.525 68.916 L
242.69 68.657 L
251.855 66.302 L
261.02 66.623 L
270.185 69.328 L
279.35 74.404 L
288.515 83.996 L
297.68 89.156 L
306.845 95.65 L
316.01 116.105 L
325.175 124.565 L
334.34 118.235 L
343.505 95.306 L
352.67 77.664 L
361.835 68.724 L
371 66.849 L
371.036 66.842 L
371.036 58.309 L
371.036 58.276 L
371 58.282 L
361.835 60.566 L
352.67 70.481 L
343.505 87.533 L
334.34 111.011 L
325.175 117.231 L
316.01 108.722 L
306.845 88.235 L
297.68 80.928 L
288.515 75.156 L
279.35 66.116 L
270.185 60.703 L
261.02 59.121 L
251.855 58.327 L
242.69 59.688 L
233.525 60.068 L
224.36 64.981 L
215.195 69.181 L
206.03 71.063 L
196.865 70.523 L
187.7 68.786 L
178.535 67.934 L
169.37 73.241 L
160.205 104.791 L
151.04 136.531 L
141.875 161.283 L
132.71 161.785 L
123.545 111.682 L
114.38 73.682 L
105.215 72.369 L
96.05 68.741 L
86.885 67.34 L
77.72 68.468 L
68.555 72.032 L
65.464 73.587 L
65.464 78.106 L
cp
f
GR
GS
[0.99902 0 0 1.00077 0 -0.19998] CT
0.82 0.639 0.639 RC
1 LJ
0.5 LW
N
65.464 80.599 M
68.555 78.851 L
77.72 75.363 L
86.885 75.156 L
96.05 76.862 L
105.215 81.052 L
114.38 81.701 L
123.545 119.288 L
132.71 169.194 L
141.875 168.819 L
151.04 144.058 L
160.205 112.363 L
169.37 80.945 L
178.535 75.831 L
187.7 77.469 L
196.865 79.583 L
206.03 79.371 L
215.195 76.905 L
224.36 73.53 L
233.525 68.916 L
242.69 68.657 L
251.855 66.302 L
261.02 66.623 L
270.185 69.328 L
279.35 74.404 L
288.515 83.996 L
297.68 89.156 L
306.845 95.65 L
316.01 116.105 L
325.175 124.565 L
334.34 118.235 L
343.505 95.306 L
352.67 77.664 L
361.835 68.724 L
371 66.849 L
371.036 66.842 L
S
GR
GS
[0.99902 0 0 1.00077 0 -0.19998] CT
0.82 0.639 0.639 RC
1 LJ
0.5 LW
N
65.464 73.587 M
68.555 72.032 L
77.72 68.468 L
86.885 67.34 L
96.05 68.741 L
105.215 72.369 L
114.38 73.682 L
123.545 111.682 L
132.71 161.785 L
141.875 161.283 L
151.04 136.531 L
160.205 104.791 L
169.37 73.241 L
178.535 67.934 L
187.7 68.786 L
196.865 70.523 L
206.03 71.063 L
215.195 69.181 L
224.36 64.981 L
233.525 60.068 L
242.69 59.688 L
251.855 58.327 L
261.02 59.121 L
270.185 60.703 L
279.35 66.116 L
288.515 75.156 L
297.68 80.928 L
306.845 88.235 L
316.01 108.722 L
325.175 117.231 L
334.34 111.011 L
343.505 87.533 L
352.67 70.481 L
361.835 60.566 L
371 58.282 L
371.036 58.276 L
S
GR
GS
[0.99902 0 0 1.00077 0 -0.19998] CT
0.6 0.2 0.2 RC
1 LJ
2 LW
N
65.464 77.093 M
68.555 75.441 L
77.72 71.915 L
86.885 71.248 L
96.05 72.801 L
105.215 76.711 L
114.38 77.692 L
123.545 115.485 L
132.71 165.489 L
141.875 165.051 L
151.04 140.294 L
160.205 108.577 L
169.37 77.093 L
178.535 71.883 L
187.7 73.127 L
196.865 75.053 L
206.03 75.217 L
215.195 73.043 L
224.36 69.255 L
233.525 64.492 L
242.69 64.173 L
251.855 62.314 L
261.02 62.872 L
270.185 65.015 L
279.35 70.26 L
288.515 79.576 L
297.68 85.042 L
306.845 91.943 L
316.01 112.414 L
325.175 120.898 L
334.34 114.623 L
343.505 91.419 L
352.67 74.073 L
361.835 64.645 L
371 62.566 L
371.036 62.559 L
S
GR
GS
[0.99902 0 0 1.00077 202.80195 135.40464] CT
/Helvetica 15 F
GS
[1 0 0 1 0 0] CT
0 5.5 moveto 
1 -1 scale
(1 Target) t 
GR
GR
GS
[0.99902 0 0 1.00077 0 -0.19998] CT
0.898 0.6 0.6 RC
1 LJ
2 LW
N
170 135.5 M
200 135.5 L
S
GR
GS
[0.99902 0 0 1.00077 202.80195 153.91893] CT
/Helvetica 15 F
GS
[1 0 0 1 0 0] CT
0 5.5 moveto 
1 -1 scale
(2 Targets) t 
GR
GR
GS
[0.99902 0 0 1.00077 0 -0.19998] CT
1 0.502 0.502 RC
1 LJ
2 LW
N
170 154 M
200 154 L
S
GR
GS
[0.99902 0 0 1.00077 202.80195 172.43321] CT
/Helvetica 15 F
GS
[1 0 0 1 0 0] CT
0 5.5 moveto 
1 -1 scale
(3 Targets) t 
GR
GR
GS
[0.99902 0 0 1.00077 0 -0.19998] CT
0.898 0.302 0.302 RC
1 LJ
2 LW
N
170 172.5 M
200 172.5 L
S
GR
GS
[0.99902 0 0 1.00077 202.80195 190.9475] CT
/Helvetica 15 F
GS
[1 0 0 1 0 0] CT
0 5.5 moveto 
1 -1 scale
(4 Targets) t 
GR
GR
GS
[0.99902 0 0 1.00077 0 -0.19998] CT
0.6 0.2 0.2 RC
1 LJ
2 LW
N
170 191 M
200 191 L
S
GR
%%Trailer
%%Pages: 1
%%EOF
