
                            < M A T L A B (R) >
                  Copyright 1984-2016 The MathWorks, Inc.
                   R2016b (9.1.0.441655) 64-bit (glnxa64)
                             September 7, 2016

 
To get started, type one of these: helpwin, helpdesk, or demo.
For product information, visit www.mathworks.com.
 
-------------------------------------------------------------------------------------------
FieldTrip is developed by members and collaborators of the Donders Institute for Brain,
Cognition and Behaviour at Radboud University, Nijmegen, the Netherlands.

                          --------------------------
                        /                            \
                     ------------------------------------
                    /                                    \
          -------------------------------------------------
         /                            /\/\/\/\/\ 
         ---------------------------------------------------
                  |        F  i  e  l  d  T  r  i  p       |
                  ------------------------------------------
                   \                                      /
                     ------------------------------------
                          \            /
                            ----------

Please cite the FieldTrip reference paper when you have used FieldTrip in your study.
Robert Oostenveld, Pascal Fries, Eric Maris, and Jan-Mathijs Schoffelen. FieldTrip: Open
Source Software for Advanced Analysis of MEG, EEG, and Invasive Electrophysiological Data.
Computational Intelligence and Neuroscience, vol. 2011, Article ID 156869, 9 pages, 2011.
doi:10.1155/2011/156869.
-------------------------------------------------------------------------------------------
the input is raw data with 60 channels and 62 trials
the call to "ft_selectdata" took 0 seconds and required the additional allocation of an estimated 3 MB
the input is raw data with 60 channels and 62 trials
the call to "ft_redefinetrial" took 0 seconds and required the additional allocation of an estimated 159 MB
Scale 1 of 18; Time 1 of 57
the input is raw data with 60 channels and 62 trials
removing 0 trials in which no data was selected
the input is raw data with 60 channels and 62 trials
removing 0 trials that are too short
8 chunks: 1 2 3 4 5 6 7 8 Scale 1 of 18; Time 2 of 57
the input is raw data with 60 channels and 62 trials
removing 0 trials in which no data was selected
the input is raw data with 60 channels and 62 trials
removing 0 trials that are too short
8 chunks: 1 2 3 4 5 6 7 8 Scale 1 of 18; Time 3 of 57
the input is raw data with 60 channels and 62 trials
removing 0 trials in which no data was selected
the input is raw data with 60 channels and 62 trials
removing 0 trials that are too short
8 chunks: 1 2 3 4 5 6 7 8 Scale 1 of 18; Time 4 of 57
the input is raw data with 60 channels and 62 trials
removing 0 trials in which no data was selected
the input is raw data with 60 channels and 62 trials
removing 0 trials that are too short
8 chunks: 1 2 3 4 5 6 7 8 Scale 1 of 18; Time 5 of 57
the input is raw data with 60 channels and 62 trials
removing 0 trials in which no data was selected
the input is raw data with 60 channels and 62 trials
removing 0 trials that are too short
8 chunks: 1 2 3 4 5 6 7 8 Scale 1 of 18; Time 6 of 57
the input is raw data with 60 channels and 62 trials
removing 0 trials in which no data was selected
the input is raw data with 60 channels and 62 trials
removing 0 trials that are too short
8 chunks: 1 2 3 4 5 6 7 8 Scale 1 of 18; Time 7 of 57
the input is raw data with 60 channels and 62 trials
removing 0 trials in which no data was selected
the input is raw data with 60 channels and 62 trials
removing 0 trials that are too short
8 chunks: 1 2 3 4 5 6 7 8 Scale 1 of 18; Time 8 of 57
the input is raw data with 60 channels and 62 trials
removing 0 trials in which no data was selected
the input is raw data with 60 channels and 62 trials
removing 0 trials that are too short
8 chunks: 1 2 3 4 5 6 7 8 Scale 1 of 18; Time 9 of 57
the input is raw data with 60 channels and 62 trials
removing 0 trials in which no data was selected
the input is raw data with 60 channels and 62 trials
removing 0 trials that are too short
8 chunks: 1 2 3 4 5 6 7 8 Scale 1 of 18; Time 10 of 57
the input is raw data with 60 channels and 62 trials
removing 0 trials in which no data was selected
the input is raw data with 60 channels and 62 trials
removing 0 trials that are too short
8 chunks: 1 2 3 4 5 6 7 8 Scale 1 of 18; Time 11 of 57
the input is raw data with 60 channels and 62 trials
removing 0 trials in which no data was selected
the input is raw data with 60 channels and 62 trials
removing 0 trials that are too short
8 chunks: 1 2 3 4 5 6 7 8 Scale 1 of 18; Time 12 of 57
the input is raw data with 60 channels and 62 trials
removing 0 trials in which no data was selected
the input is raw data with 60 channels and 62 trials
removing 0 trials that are too short
8 chunks: 1 2 3 4 5 6 7 8 Scale 1 of 18; Time 13 of 57
the input is raw data with 60 channels and 62 trials
removing 0 trials in which no data was selected
the input is raw data with 60 channels and 62 trials
removing 0 trials that are too short
8 chunks: 1 2 3 4 5 6 7 8 Scale 1 of 18; Time 14 of 57
the input is raw data with 60 channels and 62 trials
removing 0 trials in which no data was selected
the input is raw data with 60 channels and 62 trials
removing 0 trials that are too short
8 chunks: 1 2 3 4 5 6 7 8 Scale 1 of 18; Time 15 of 57
the input is raw data with 60 channels and 62 trials
removing 0 trials in which no data was selected
the input is raw data with 60 channels and 62 trials
removing 0 trials that are too short
8 chunks: 1 2 3 4 5 6 7 8 Scale 1 of 18; Time 16 of 57
the input is raw data with 60 channels and 62 trials
removing 0 trials in which no data was selected
the input is raw data with 60 channels and 62 trials
removing 0 trials that are too short
8 chunks: 1 2 3 4 5 6 7 8 Scale 1 of 18; Time 17 of 57
the input is raw data with 60 channels and 62 trials
removing 0 trials in which no data was selected
the input is raw data with 60 channels and 62 trials
removing 0 trials that are too short
8 chunks: 1 2 3 4 5 6 7 8 Scale 1 of 18; Time 18 of 57
the input is raw data with 60 channels and 62 trials
removing 0 trials in which no data was selected
the input is raw data with 60 channels and 62 trials
removing 0 trials that are too short
8 chunks: 1 2 3 4 5 6 7 8 Scale 1 of 18; Time 19 of 57
the input is raw data with 60 channels and 62 trials
removing 0 trials in which no data was selected
the input is raw data with 60 channels and 62 trials
removing 0 trials that are too short
8 chunks: 1 2 3 4 5 6 7 8 Scale 1 of 18; Time 20 of 57
the input is raw data with 60 channels and 62 trials
removing 0 trials in which no data was selected
the input is raw data with 60 channels and 62 trials
removing 0 trials that are too short
8 chunks: 1 2 3 4 5 6 7 8 Scale 1 of 18; Time 21 of 57
the input is raw data with 60 channels and 62 trials
removing 0 trials in which no data was selected
the input is raw data with 60 channels and 62 trials
removing 0 trials that are too short
8 chunks: 1 2 3 4 5 6 7 8 Scale 1 of 18; Time 22 of 57
the input is raw data with 60 channels and 62 trials
removing 0 trials in which no data was selected
the input is raw data with 60 channels and 62 trials
removing 0 trials that are too short
8 chunks: 1 2 3 4 5 6 7 8 Scale 1 of 18; Time 23 of 57
the input is raw data with 60 channels and 62 trials
removing 0 trials in which no data was selected
the input is raw data with 60 channels and 62 trials
removing 0 trials that are too short
8 chunks: 1 2 3 4 5 6 7 8 Scale 1 of 18; Time 24 of 57
the input is raw data with 60 channels and 62 trials
removing 0 trials in which no data was selected
the input is raw data with 60 channels and 62 trials
removing 0 trials that are too short
8 chunks: 1 2 3 4 5 6 7 8 Scale 1 of 18; Time 25 of 57
the input is raw data with 60 channels and 62 trials
removing 0 trials in which no data was selected
the input is raw data with 60 channels and 62 trials
removing 0 trials that are too short
8 chunks: 1 2 3 4 5 6 7 8 Scale 1 of 18; Time 26 of 57
the input is raw data with 60 channels and 62 trials
removing 0 trials in which no data was selected
the input is raw data with 60 channels and 62 trials
removing 0 trials that are too short
8 chunks: 1 2 3 4 5 6 7 8 Scale 1 of 18; Time 27 of 57
the input is raw data with 60 channels and 62 trials
removing 0 trials in which no data was selected
the input is raw data with 60 channels and 62 trials
removing 0 trials that are too short
8 chunks: 1 2 3 slurmstepd-ood-36: error: *** JOB 1598408 ON ood-36 CANCELLED AT 2022-02-15T12:46:11 ***
4 5 