%!PS-Adobe-3.0 EPSF-3.0
%%Creator: (MATLAB, The Mathworks, Inc. Version 9.10.0.1602886 \(R2021a\). Operating System: Mac OS X)
%%Title: /Users/kosciessa/Desktop/tardis/LNDG/stateswitch/stsw_eeg_task/mse/figures/e01_EntropyTraces_ya.eps
%%CreationDate: 2022-02-17T09:22:04
%%Pages: (atend)
%%BoundingBox:     4     0   375   240
%%LanguageLevel: 3
%%EndComments
%%BeginProlog
%%BeginResource: procset (Apache XML Graphics Std ProcSet) 1.2 0
%%Version: 1.2 0
%%Copyright: (Copyright 2001-2003,2010 The Apache Software Foundation. License terms: http://www.apache.org/licenses/LICENSE-2.0)
/bd{bind def}bind def
/ld{load def}bd
/GR/grestore ld
/GS/gsave ld
/RM/rmoveto ld
/C/curveto ld
/t/show ld
/L/lineto ld
/ML/setmiterlimit ld
/CT/concat ld
/f/fill ld
/N/newpath ld
/S/stroke ld
/CC/setcmykcolor ld
/A/ashow ld
/cp/closepath ld
/RC/setrgbcolor ld
/LJ/setlinejoin ld
/GC/setgray ld
/LW/setlinewidth ld
/M/moveto ld
/re {4 2 roll M
1 index 0 rlineto
0 exch rlineto
neg 0 rlineto
cp } bd
/_ctm matrix def
/_tm matrix def
/BT { _ctm currentmatrix pop matrix _tm copy pop 0 0 moveto } bd
/ET { _ctm setmatrix } bd
/iTm { _ctm setmatrix _tm concat } bd
/Tm { _tm astore pop iTm 0 0 moveto } bd
/ux 0.0 def
/uy 0.0 def
/F {
  /Tp exch def
  /Tf exch def
  Tf findfont Tp scalefont setfont
  /cf Tf def  /cs Tp def
} bd
/ULS {currentpoint /uy exch def /ux exch def} bd
/ULE {
  /Tcx currentpoint pop def
  gsave
  newpath
  cf findfont cs scalefont dup
  /FontMatrix get 0 get /Ts exch def /FontInfo get dup
  /UnderlinePosition get Ts mul /To exch def
  /UnderlineThickness get Ts mul /Tt exch def
  ux uy To add moveto  Tcx uy To add lineto
  Tt setlinewidth stroke
  grestore
} bd
/OLE {
  /Tcx currentpoint pop def
  gsave
  newpath
  cf findfont cs scalefont dup
  /FontMatrix get 0 get /Ts exch def /FontInfo get dup
  /UnderlinePosition get Ts mul /To exch def
  /UnderlineThickness get Ts mul /Tt exch def
  ux uy To add cs add moveto Tcx uy To add cs add lineto
  Tt setlinewidth stroke
  grestore
} bd
/SOE {
  /Tcx currentpoint pop def
  gsave
  newpath
  cf findfont cs scalefont dup
  /FontMatrix get 0 get /Ts exch def /FontInfo get dup
  /UnderlinePosition get Ts mul /To exch def
  /UnderlineThickness get Ts mul /Tt exch def
  ux uy To add cs 10 mul 26 idiv add moveto Tcx uy To add cs 10 mul 26 idiv add lineto
  Tt setlinewidth stroke
  grestore
} bd
/QT {
/Y22 exch store
/X22 exch store
/Y21 exch store
/X21 exch store
currentpoint
/Y21 load 2 mul add 3 div exch
/X21 load 2 mul add 3 div exch
/X21 load 2 mul /X22 load add 3 div
/Y21 load 2 mul /Y22 load add 3 div
/X22 load /Y22 load curveto
} bd
/SSPD {
dup length /d exch dict def
{
/v exch def
/k exch def
currentpagedevice k known {
/cpdv currentpagedevice k get def
v cpdv ne {
/upd false def
/nullv v type /nulltype eq def
/nullcpdv cpdv type /nulltype eq def
nullv nullcpdv or
{
/upd true def
} {
/sametype v type cpdv type eq def
sametype {
v type /arraytype eq {
/vlen v length def
/cpdvlen cpdv length def
vlen cpdvlen eq {
0 1 vlen 1 sub {
/i exch def
/obj v i get def
/cpdobj cpdv i get def
obj cpdobj ne {
/upd true def
exit
} if
} for
} {
/upd true def
} ifelse
} {
v type /dicttype eq {
v {
/dv exch def
/dk exch def
/cpddv cpdv dk get def
dv cpddv ne {
/upd true def
exit
} if
} forall
} {
/upd true def
} ifelse
} ifelse
} if
} ifelse
upd true eq {
d k v put
} if
} if
} if
} forall
d length 0 gt {
d setpagedevice
} if
} bd
/RE { % /NewFontName [NewEncodingArray] /FontName RE -
  findfont dup length dict begin
  {
    1 index /FID ne
    {def} {pop pop} ifelse
  } forall
  /Encoding exch def
  /FontName 1 index def
  currentdict definefont pop
  end
} bind def
%%EndResource
%%BeginResource: procset (Apache XML Graphics EPS ProcSet) 1.0 0
%%Version: 1.0 0
%%Copyright: (Copyright 2002-2003 The Apache Software Foundation. License terms: http://www.apache.org/licenses/LICENSE-2.0)
/BeginEPSF { %def
/b4_Inc_state save def         % Save state for cleanup
/dict_count countdictstack def % Count objects on dict stack
/op_count count 1 sub def      % Count objects on operand stack
userdict begin                 % Push userdict on dict stack
/showpage { } def              % Redefine showpage, { } = null proc
0 setgray 0 setlinecap         % Prepare graphics state
1 setlinewidth 0 setlinejoin
10 setmiterlimit [ ] 0 setdash newpath
/languagelevel where           % If level not equal to 1 then
{pop languagelevel             % set strokeadjust and
1 ne                           % overprint to their defaults.
{false setstrokeadjust false setoverprint
} if
} if
} bd
/EndEPSF { %def
count op_count sub {pop} repeat            % Clean up stacks
countdictstack dict_count sub {end} repeat
b4_Inc_state restore
} bd
%%EndResource
%FOPBeginFontDict
%%IncludeResource: font Courier-Oblique
%%IncludeResource: font Courier-BoldOblique
%%IncludeResource: font Courier-Bold
%%IncludeResource: font ZapfDingbats
%%IncludeResource: font Symbol
%%IncludeResource: font Helvetica
%%IncludeResource: font Helvetica-Oblique
%%IncludeResource: font Helvetica-Bold
%%IncludeResource: font Helvetica-BoldOblique
%%IncludeResource: font Times-Roman
%%IncludeResource: font Times-Italic
%%IncludeResource: font Times-Bold
%%IncludeResource: font Times-BoldItalic
%%IncludeResource: font Courier
%FOPEndFontDict
%%BeginResource: encoding WinAnsiEncoding
/WinAnsiEncoding [
/.notdef /.notdef /.notdef /.notdef /.notdef
/.notdef /.notdef /.notdef /.notdef /.notdef
/.notdef /.notdef /.notdef /.notdef /.notdef
/.notdef /.notdef /.notdef /.notdef /.notdef
/.notdef /.notdef /.notdef /.notdef /.notdef
/.notdef /.notdef /.notdef /.notdef /.notdef
/.notdef /.notdef /space /exclam /quotedbl
/numbersign /dollar /percent /ampersand /quotesingle
/parenleft /parenright /asterisk /plus /comma
/hyphen /period /slash /zero /one
/two /three /four /five /six
/seven /eight /nine /colon /semicolon
/less /equal /greater /question /at
/A /B /C /D /E
/F /G /H /I /J
/K /L /M /N /O
/P /Q /R /S /T
/U /V /W /X /Y
/Z /bracketleft /backslash /bracketright /asciicircum
/underscore /quoteleft /a /b /c
/d /e /f /g /h
/i /j /k /l /m
/n /o /p /q /r
/s /t /u /v /w
/x /y /z /braceleft /bar
/braceright /asciitilde /bullet /Euro /bullet
/quotesinglbase /florin /quotedblbase /ellipsis /dagger
/daggerdbl /circumflex /perthousand /Scaron /guilsinglleft
/OE /bullet /Zcaron /bullet /bullet
/quoteleft /quoteright /quotedblleft /quotedblright /bullet
/endash /emdash /asciitilde /trademark /scaron
/guilsinglright /oe /bullet /zcaron /Ydieresis
/space /exclamdown /cent /sterling /currency
/yen /brokenbar /section /dieresis /copyright
/ordfeminine /guillemotleft /logicalnot /sfthyphen /registered
/macron /degree /plusminus /twosuperior /threesuperior
/acute /mu /paragraph /middot /cedilla
/onesuperior /ordmasculine /guillemotright /onequarter /onehalf
/threequarters /questiondown /Agrave /Aacute /Acircumflex
/Atilde /Adieresis /Aring /AE /Ccedilla
/Egrave /Eacute /Ecircumflex /Edieresis /Igrave
/Iacute /Icircumflex /Idieresis /Eth /Ntilde
/Ograve /Oacute /Ocircumflex /Otilde /Odieresis
/multiply /Oslash /Ugrave /Uacute /Ucircumflex
/Udieresis /Yacute /Thorn /germandbls /agrave
/aacute /acircumflex /atilde /adieresis /aring
/ae /ccedilla /egrave /eacute /ecircumflex
/edieresis /igrave /iacute /icircumflex /idieresis
/eth /ntilde /ograve /oacute /ocircumflex
/otilde /odieresis /divide /oslash /ugrave
/uacute /ucircumflex /udieresis /yacute /thorn
/ydieresis
] def
%%EndResource
%FOPBeginFontReencode
/Courier-Oblique findfont
dup length dict begin
  {1 index /FID ne {def} {pop pop} ifelse} forall
  /Encoding WinAnsiEncoding def
  currentdict
end
/Courier-Oblique exch definefont pop
/Courier-BoldOblique findfont
dup length dict begin
  {1 index /FID ne {def} {pop pop} ifelse} forall
  /Encoding WinAnsiEncoding def
  currentdict
end
/Courier-BoldOblique exch definefont pop
/Courier-Bold findfont
dup length dict begin
  {1 index /FID ne {def} {pop pop} ifelse} forall
  /Encoding WinAnsiEncoding def
  currentdict
end
/Courier-Bold exch definefont pop
/Helvetica findfont
dup length dict begin
  {1 index /FID ne {def} {pop pop} ifelse} forall
  /Encoding WinAnsiEncoding def
  currentdict
end
/Helvetica exch definefont pop
/Helvetica-Oblique findfont
dup length dict begin
  {1 index /FID ne {def} {pop pop} ifelse} forall
  /Encoding WinAnsiEncoding def
  currentdict
end
/Helvetica-Oblique exch definefont pop
/Helvetica-Bold findfont
dup length dict begin
  {1 index /FID ne {def} {pop pop} ifelse} forall
  /Encoding WinAnsiEncoding def
  currentdict
end
/Helvetica-Bold exch definefont pop
/Helvetica-BoldOblique findfont
dup length dict begin
  {1 index /FID ne {def} {pop pop} ifelse} forall
  /Encoding WinAnsiEncoding def
  currentdict
end
/Helvetica-BoldOblique exch definefont pop
/Times-Roman findfont
dup length dict begin
  {1 index /FID ne {def} {pop pop} ifelse} forall
  /Encoding WinAnsiEncoding def
  currentdict
end
/Times-Roman exch definefont pop
/Times-Italic findfont
dup length dict begin
  {1 index /FID ne {def} {pop pop} ifelse} forall
  /Encoding WinAnsiEncoding def
  currentdict
end
/Times-Italic exch definefont pop
/Times-Bold findfont
dup length dict begin
  {1 index /FID ne {def} {pop pop} ifelse} forall
  /Encoding WinAnsiEncoding def
  currentdict
end
/Times-Bold exch definefont pop
/Times-BoldItalic findfont
dup length dict begin
  {1 index /FID ne {def} {pop pop} ifelse} forall
  /Encoding WinAnsiEncoding def
  currentdict
end
/Times-BoldItalic exch definefont pop
/Courier findfont
dup length dict begin
  {1 index /FID ne {def} {pop pop} ifelse} forall
  /Encoding WinAnsiEncoding def
  currentdict
end
/Courier exch definefont pop
%FOPEndFontReencode
%%EndProlog
%%Page: 1 1
%%PageBoundingBox: 0 0 410 259
%%BeginPageSetup
[1 0 0 -1 0 259] CT
%%EndPageSetup
GS
[0.99902 0 0 1.00077 0 -0.19998] CT
1 GC
N
0 0 410 259 re
f
GR
GS
[0.99902 0 0 1.00077 0 -0.19998] CT
1 GC
N
0 0 410 259 re
f
GR
GS
[0.99902 0 0 1.00077 0 -0.19998] CT
1 GC
N
65.5 209.5 M
371 209.5 L
371 19.5 L
65.5 19.5 L
cp
f
GR
GS
[0.99902 0 0 1.00077 0 -0.19998] CT
0.149 GC
2 setlinecap
1 LJ
0.5 LW
N
65.5 209.5 M
371 209.5 L
S
GR
GS
[0.99902 0 0 1.00077 0 -0.19998] CT
0.149 GC
2 setlinecap
1 LJ
0.5 LW
N
65.5 209.5 M
65.5 206.446 L
S
GR
GS
[0.99902 0 0 1.00077 0 -0.19998] CT
0.149 GC
2 setlinecap
1 LJ
0.5 LW
N
126.6 209.5 M
126.6 206.446 L
S
GR
GS
[0.99902 0 0 1.00077 0 -0.19998] CT
0.149 GC
2 setlinecap
1 LJ
0.5 LW
N
187.7 209.5 M
187.7 206.446 L
S
GR
GS
[0.99902 0 0 1.00077 0 -0.19998] CT
0.149 GC
2 setlinecap
1 LJ
0.5 LW
N
248.8 209.5 M
248.8 206.446 L
S
GR
GS
[0.99902 0 0 1.00077 0 -0.19998] CT
0.149 GC
2 setlinecap
1 LJ
0.5 LW
N
309.9 209.5 M
309.9 206.446 L
S
GR
GS
[0.99902 0 0 1.00077 0 -0.19998] CT
0.149 GC
2 setlinecap
1 LJ
0.5 LW
N
371 209.5 M
371 206.446 L
S
GR
GS
[0.99902 0 0 1.00077 65.4361 215.06606] CT
0.149 GC
/Helvetica 18 F
GS
[1 0 0 1 0 0] CT
-9 18 moveto 
1 -1 scale
(-1) t 
GR
GR
GS
[0.99902 0 0 1.00077 126.47649 215.06606] CT
0.149 GC
/Helvetica 18 F
GS
[1 0 0 1 0 0] CT
-5.5 18 moveto 
1 -1 scale
(0) t 
GR
GR
GS
[0.99902 0 0 1.00077 187.51688 215.06606] CT
0.149 GC
/Helvetica 18 F
GS
[1 0 0 1 0 0] CT
-5.5 18 moveto 
1 -1 scale
(1) t 
GR
GR
GS
[0.99902 0 0 1.00077 248.55728 215.06606] CT
0.149 GC
/Helvetica 18 F
GS
[1 0 0 1 0 0] CT
-5.5 18 moveto 
1 -1 scale
(2) t 
GR
GR
GS
[0.99902 0 0 1.00077 309.59766 215.06606] CT
0.149 GC
/Helvetica 18 F
GS
[1 0 0 1 0 0] CT
-5.5 18 moveto 
1 -1 scale
(3) t 
GR
GR
GS
[0.99902 0 0 1.00077 370.63805 215.06606] CT
0.149 GC
/Helvetica 18 F
GS
[1 0 0 1 0 0] CT
-5.5 18 moveto 
1 -1 scale
(4) t 
GR
GR
GS
[0.99902 0 0 1.00077 218.03723 237.48338] CT
0.149 GC
/Helvetica 18 F
GS
[1 0 0 1 0 0] CT
-113.5 18 moveto 
1 -1 scale
(Time \(s from stimulus onset\)) t 
GR
GR
GS
[0.99902 0 0 1.00077 0 -0.19998] CT
0.149 GC
2 setlinecap
1 LJ
0.5 LW
N
65.5 209.5 M
65.5 19.5 L
S
GR
GS
[0.99902 0 0 1.00077 0 -0.19998] CT
0.149 GC
2 setlinecap
1 LJ
0.5 LW
N
65.5 203.049 M
68.554 203.049 L
S
GR
GS
[0.99902 0 0 1.00077 0 -0.19998] CT
0.149 GC
2 setlinecap
1 LJ
0.5 LW
N
65.5 171.58 M
68.554 171.58 L
S
GR
GS
[0.99902 0 0 1.00077 0 -0.19998] CT
0.149 GC
2 setlinecap
1 LJ
0.5 LW
N
65.5 140.112 M
68.554 140.112 L
S
GR
GS
[0.99902 0 0 1.00077 0 -0.19998] CT
0.149 GC
2 setlinecap
1 LJ
0.5 LW
N
65.5 108.643 M
68.554 108.643 L
S
GR
GS
[0.99902 0 0 1.00077 0 -0.19998] CT
0.149 GC
2 setlinecap
1 LJ
0.5 LW
N
65.5 77.174 M
68.554 77.174 L
S
GR
GS
[0.99902 0 0 1.00077 0 -0.19998] CT
0.149 GC
2 setlinecap
1 LJ
0.5 LW
N
65.5 45.706 M
68.554 45.706 L
S
GR
GS
[0.99902 0 0 1.00077 59.84156 203.0059] CT
0.149 GC
/Helvetica 18 F
GS
[1 0 0 1 0 0] CT
-36 7 moveto 
1 -1 scale
(0.42) t 
GR
GR
GS
[0.99902 0 0 1.00077 59.84156 171.51291] CT
0.149 GC
/Helvetica 18 F
GS
[1 0 0 1 0 0] CT
-36 7 moveto 
1 -1 scale
(0.44) t 
GR
GR
GS
[0.99902 0 0 1.00077 59.84156 140.01993] CT
0.149 GC
/Helvetica 18 F
GS
[1 0 0 1 0 0] CT
-36 7 moveto 
1 -1 scale
(0.46) t 
GR
GR
GS
[0.99902 0 0 1.00077 59.84156 108.52699] CT
0.149 GC
/Helvetica 18 F
GS
[1 0 0 1 0 0] CT
-36 7 moveto 
1 -1 scale
(0.48) t 
GR
GR
GS
[0.99902 0 0 1.00077 59.84156 77.034] CT
0.149 GC
/Helvetica 18 F
GS
[1 0 0 1 0 0] CT
-26 7 moveto 
1 -1 scale
(0.5) t 
GR
GR
GS
[0.99902 0 0 1.00077 59.84156 45.54106] CT
0.149 GC
/Helvetica 18 F
GS
[1 0 0 1 0 0] CT
-36 7 moveto 
1 -1 scale
(0.52) t 
GR
GR
GS
[0 -1.00077 0.99902 0 21.47902 114.38831] CT
0.149 GC
/Helvetica 18 F
GS
[1 0 0 1 0 0] CT
-64 -4 moveto 
1 -1 scale
(Sample entropy) t 
GR
GR
GS
[0.99902 0 0 1.00077 0 -0.19998] CT
1 0.949 0.8 RC
N
224.245 209.523 M
309.9 209.523 L
309.9 19.477 L
241.957 19.477 L
126.6 19.477 L
126.6 209.523 L
cp
f
GR
GS
[0.99902 0 0 1.00077 0 -0.19998] CT
0.974 0.9 0.9 RC
N
123.545 142.761 M
114.38 113.127 L
105.215 111.203 L
96.05 107.872 L
86.885 106.252 L
77.72 103.81 L
68.555 103.158 L
65.464 103.427 L
65.464 109.781 L
65.464 112.985 L
68.555 112.746 L
77.72 113.067 L
86.885 114.932 L
96.05 116.455 L
105.215 120.036 L
114.38 121.352 L
123.545 150.175 L
132.71 186.603 L
141.875 190.468 L
151.04 144.088 L
160.205 124.638 L
169.37 101.052 L
178.535 93.352 L
187.7 87.654 L
196.865 85.21 L
206.03 84.639 L
215.195 84.269 L
224.36 83.932 L
233.525 81.37 L
242.69 80.967 L
251.855 81.061 L
261.02 81.529 L
270.185 82.106 L
279.35 84.367 L
288.515 89.681 L
297.68 94.396 L
306.845 101.341 L
316.01 126.202 L
325.175 139.242 L
334.34 138.573 L
343.505 126.132 L
352.67 123.164 L
361.835 124.31 L
371 127.156 L
371.036 127.153 L
371.036 115.066 L
371.036 115.02 L
371 115.021 L
361.835 113.206 L
352.67 112.585 L
343.505 116.04 L
334.34 129.41 L
325.175 131.534 L
316.01 119.259 L
306.845 94.057 L
297.68 87.209 L
288.515 81.981 L
279.35 75.675 L
270.185 71.509 L
261.02 68.893 L
251.855 68.004 L
242.69 68.86 L
233.525 70.877 L
224.36 74.389 L
215.195 75.668 L
206.03 76.578 L
196.865 76.949 L
187.7 78.496 L
178.535 82.814 L
169.37 91.114 L
160.205 115.285 L
151.04 135.216 L
141.875 182.124 L
132.71 178.713 L
cp
f
GR
GS
[0.99902 0 0 1.00077 0 -0.19998] CT
0.957 0.82 0.82 RC
1 LJ
0.5 LW
N
65.464 112.985 M
68.555 112.746 L
77.72 113.067 L
86.885 114.932 L
96.05 116.455 L
105.215 120.036 L
114.38 121.352 L
123.545 150.175 L
132.71 186.603 L
141.875 190.468 L
151.04 144.088 L
160.205 124.638 L
169.37 101.052 L
178.535 93.352 L
187.7 87.654 L
196.865 85.21 L
206.03 84.639 L
215.195 84.269 L
224.36 83.932 L
233.525 81.37 L
242.69 80.967 L
251.855 81.061 L
261.02 81.529 L
270.185 82.106 L
279.35 84.367 L
288.515 89.681 L
297.68 94.396 L
306.845 101.341 L
316.01 126.202 L
325.175 139.242 L
334.34 138.573 L
343.505 126.132 L
352.67 123.164 L
361.835 124.31 L
371 127.156 L
371.036 127.153 L
S
GR
GS
[0.99902 0 0 1.00077 0 -0.19998] CT
0.957 0.82 0.82 RC
1 LJ
0.5 LW
N
65.464 103.427 M
68.555 103.158 L
77.72 103.81 L
86.885 106.252 L
96.05 107.872 L
105.215 111.203 L
114.38 113.127 L
123.545 142.761 L
132.71 178.713 L
141.875 182.124 L
151.04 135.216 L
160.205 115.285 L
169.37 91.114 L
178.535 82.814 L
187.7 78.496 L
196.865 76.949 L
206.03 76.578 L
215.195 75.668 L
224.36 74.389 L
233.525 70.877 L
242.69 68.86 L
251.855 68.004 L
261.02 68.893 L
270.185 71.509 L
279.35 75.675 L
288.515 81.981 L
297.68 87.209 L
306.845 94.057 L
316.01 119.259 L
325.175 131.534 L
334.34 129.41 L
343.505 116.04 L
352.67 112.585 L
361.835 113.206 L
371 115.021 L
371.036 115.02 L
S
GR
GS
[0.99902 0 0 1.00077 0 -0.19998] CT
0.898 0.6 0.6 RC
1 LJ
2 LW
N
65.464 108.206 M
68.555 107.952 L
77.72 108.438 L
86.885 110.592 L
96.05 112.164 L
105.215 115.619 L
114.38 117.24 L
123.545 146.468 L
132.71 182.658 L
141.875 186.296 L
151.04 139.652 L
160.205 119.962 L
169.37 96.083 L
178.535 88.083 L
187.7 83.075 L
196.865 81.079 L
206.03 80.608 L
215.195 79.969 L
224.36 79.16 L
233.525 76.124 L
242.69 74.914 L
251.855 74.533 L
261.02 75.211 L
270.185 76.807 L
279.35 80.021 L
288.515 85.831 L
297.68 90.802 L
306.845 97.699 L
316.01 122.731 L
325.175 135.388 L
334.34 133.991 L
343.505 121.086 L
352.67 117.874 L
361.835 118.758 L
371 121.089 L
371.036 121.086 L
S
GR
GS
[0.99902 0 0 1.00077 0 -0.19998] CT
1 0.875 0.875 RC
N
114.38 121.139 M
123.545 144.895 L
132.71 178.287 L
141.875 179.454 L
151.04 132.613 L
160.205 113.765 L
169.37 89.494 L
178.535 79.748 L
187.7 75.981 L
196.865 74.436 L
206.03 72.764 L
215.195 70.892 L
224.36 66.397 L
233.525 64.646 L
242.69 61.394 L
251.855 61.795 L
261.02 62.224 L
270.185 65.169 L
279.35 69.304 L
288.515 76.453 L
297.68 83.557 L
306.845 91.773 L
316.01 119.659 L
325.175 130.253 L
334.34 125.126 L
343.505 108.835 L
352.67 101.36 L
361.835 101.189 L
371 101.312 L
371.036 101.307 L
371.036 95.093 L
371.036 95.068 L
371 95.073 L
361.835 94.038 L
352.67 93.745 L
343.505 100.895 L
334.34 117.489 L
325.175 123.073 L
316.01 112.322 L
306.845 84.261 L
297.68 75.857 L
288.515 68.579 L
279.35 61.079 L
270.185 56.251 L
261.02 52.211 L
251.855 50.308 L
242.69 49.96 L
233.525 54.889 L
224.36 57.973 L
215.195 63.333 L
206.03 66.118 L
196.865 67.809 L
187.7 68.672 L
178.535 71.115 L
169.37 81.454 L
160.205 106.204 L
151.04 125.75 L
141.875 173.473 L
132.71 171.614 L
123.545 137.615 L
114.38 113.292 L
105.215 111.591 L
96.05 110.078 L
86.885 106.666 L
77.72 102.945 L
68.555 103.28 L
65.464 104.062 L
65.464 109.558 L
65.464 112.446 L
68.555 111.575 L
77.72 111.813 L
86.885 115.282 L
96.05 118.243 L
105.215 119.719 L
cp
f
GR
GS
[0.99902 0 0 1.00077 0 -0.19998] CT
1 0.776 0.776 RC
1 LJ
0.5 LW
N
65.464 112.446 M
68.555 111.575 L
77.72 111.813 L
86.885 115.282 L
96.05 118.243 L
105.215 119.719 L
114.38 121.139 L
123.545 144.895 L
132.71 178.287 L
141.875 179.454 L
151.04 132.613 L
160.205 113.765 L
169.37 89.494 L
178.535 79.748 L
187.7 75.981 L
196.865 74.436 L
206.03 72.764 L
215.195 70.892 L
224.36 66.397 L
233.525 64.646 L
242.69 61.394 L
251.855 61.795 L
261.02 62.224 L
270.185 65.169 L
279.35 69.304 L
288.515 76.453 L
297.68 83.557 L
306.845 91.773 L
316.01 119.659 L
325.175 130.253 L
334.34 125.126 L
343.505 108.835 L
352.67 101.36 L
361.835 101.189 L
371 101.312 L
371.036 101.307 L
S
GR
GS
[0.99902 0 0 1.00077 0 -0.19998] CT
1 0.776 0.776 RC
1 LJ
0.5 LW
N
65.464 104.062 M
68.555 103.28 L
77.72 102.945 L
86.885 106.666 L
96.05 110.078 L
105.215 111.591 L
114.38 113.292 L
123.545 137.615 L
132.71 171.614 L
141.875 173.473 L
151.04 125.75 L
160.205 106.204 L
169.37 81.454 L
178.535 71.115 L
187.7 68.672 L
196.865 67.809 L
206.03 66.118 L
215.195 63.333 L
224.36 57.973 L
233.525 54.889 L
242.69 49.96 L
251.855 50.308 L
261.02 52.211 L
270.185 56.251 L
279.35 61.079 L
288.515 68.579 L
297.68 75.857 L
306.845 84.261 L
316.01 112.322 L
325.175 123.073 L
334.34 117.489 L
343.505 100.895 L
352.67 93.745 L
361.835 94.038 L
371 95.073 L
371.036 95.068 L
S
GR
GS
[0.99902 0 0 1.00077 0 -0.19998] CT
1 0.502 0.502 RC
1 LJ
2 LW
N
65.464 108.254 M
68.555 107.427 L
77.72 107.379 L
86.885 110.974 L
96.05 114.16 L
105.215 115.655 L
114.38 117.215 L
123.545 141.255 L
132.71 174.951 L
141.875 176.463 L
151.04 129.182 L
160.205 109.985 L
169.37 85.474 L
178.535 75.432 L
187.7 72.326 L
196.865 71.123 L
206.03 69.441 L
215.195 67.112 L
224.36 62.185 L
233.525 59.767 L
242.69 55.677 L
251.855 56.052 L
261.02 57.218 L
270.185 60.709 L
279.35 65.191 L
288.515 72.516 L
297.68 79.707 L
306.845 88.017 L
316.01 115.991 L
325.175 126.663 L
334.34 121.307 L
343.505 104.865 L
352.67 97.553 L
361.835 97.614 L
371 98.192 L
371.036 98.188 L
S
GR
GS
[0.99902 0 0 1.00077 0 -0.19998] CT
0.974 0.825 0.825 RC
N
65.464 116.304 M
65.464 122.508 L
65.464 126.003 L
68.555 125.459 L
77.72 118.521 L
86.885 114.13 L
96.05 111.911 L
105.215 111.649 L
114.38 113.743 L
123.545 141.513 L
132.71 173.061 L
141.875 172.301 L
151.04 122.611 L
160.205 102.994 L
169.37 86.682 L
178.535 83.216 L
187.7 81.945 L
196.865 80.785 L
206.03 76.792 L
215.195 74.226 L
224.36 74.551 L
233.525 74.732 L
242.69 71.463 L
251.855 65.533 L
261.02 62.79 L
270.185 68.591 L
279.35 76.853 L
288.515 84.951 L
297.68 89.564 L
306.845 96.474 L
316.01 118.981 L
325.175 128.707 L
334.34 120.598 L
343.505 99.171 L
352.67 90.725 L
361.835 92.947 L
371 95.496 L
371.036 95.505 L
371.036 95.468 L
371.036 85.521 L
371 85.509 L
361.835 84.013 L
352.67 81.474 L
343.505 90.539 L
334.34 111.665 L
325.175 119.946 L
316.01 110.054 L
306.845 86.699 L
297.68 79.566 L
288.515 74.004 L
279.35 65.456 L
270.185 57.483 L
261.02 52.477 L
251.855 54.18 L
242.69 59.308 L
233.525 62.8 L
224.36 63.678 L
215.195 65.056 L
206.03 68.555 L
196.865 73.075 L
187.7 73.732 L
178.535 74.494 L
169.37 78.681 L
160.205 96.124 L
151.04 116.621 L
141.875 166.06 L
132.71 166.447 L
123.545 133.927 L
114.38 105.289 L
105.215 103.064 L
96.05 103.248 L
86.885 105.643 L
77.72 109.951 L
68.555 116.099 L
cp
f
GR
GS
[0.99902 0 0 1.00077 0 -0.19998] CT
0.957 0.686 0.686 RC
1 LJ
0.5 LW
N
65.464 126.003 M
68.555 125.459 L
77.72 118.521 L
86.885 114.13 L
96.05 111.911 L
105.215 111.649 L
114.38 113.743 L
123.545 141.513 L
132.71 173.061 L
141.875 172.301 L
151.04 122.611 L
160.205 102.994 L
169.37 86.682 L
178.535 83.216 L
187.7 81.945 L
196.865 80.785 L
206.03 76.792 L
215.195 74.226 L
224.36 74.551 L
233.525 74.732 L
242.69 71.463 L
251.855 65.533 L
261.02 62.79 L
270.185 68.591 L
279.35 76.853 L
288.515 84.951 L
297.68 89.564 L
306.845 96.474 L
316.01 118.981 L
325.175 128.707 L
334.34 120.598 L
343.505 99.171 L
352.67 90.725 L
361.835 92.947 L
371 95.496 L
371.036 95.505 L
S
GR
GS
[0.99902 0 0 1.00077 0 -0.19998] CT
0.957 0.686 0.686 RC
1 LJ
0.5 LW
N
65.464 116.304 M
68.555 116.099 L
77.72 109.951 L
86.885 105.643 L
96.05 103.248 L
105.215 103.064 L
114.38 105.289 L
123.545 133.927 L
132.71 166.447 L
141.875 166.06 L
151.04 116.621 L
160.205 96.124 L
169.37 78.681 L
178.535 74.494 L
187.7 73.732 L
196.865 73.075 L
206.03 68.555 L
215.195 65.056 L
224.36 63.678 L
233.525 62.8 L
242.69 59.308 L
251.855 54.18 L
261.02 52.477 L
270.185 57.483 L
279.35 65.456 L
288.515 74.004 L
297.68 79.566 L
306.845 86.699 L
316.01 110.054 L
325.175 119.946 L
334.34 111.665 L
343.505 90.539 L
352.67 81.474 L
361.835 84.013 L
371 85.509 L
371.036 85.521 L
S
GR
GS
[0.99902 0 0 1.00077 0 -0.19998] CT
0.898 0.302 0.302 RC
1 LJ
2 LW
N
65.464 121.154 M
68.555 120.779 L
77.72 114.236 L
86.885 109.886 L
96.05 107.579 L
105.215 107.356 L
114.38 109.516 L
123.545 137.72 L
132.71 169.754 L
141.875 169.181 L
151.04 119.616 L
160.205 99.559 L
169.37 82.681 L
178.535 78.855 L
187.7 77.839 L
196.865 76.93 L
206.03 72.673 L
215.195 69.641 L
224.36 69.115 L
233.525 68.766 L
242.69 65.386 L
251.855 59.857 L
261.02 57.633 L
270.185 63.037 L
279.35 71.154 L
288.515 79.478 L
297.68 84.565 L
306.845 91.587 L
316.01 114.517 L
325.175 124.327 L
334.34 116.131 L
343.505 94.855 L
352.67 86.1 L
361.835 88.48 L
371 90.502 L
371.036 90.513 L
S
GR
GS
[0.99902 0 0 1.00077 0 -0.19998] CT
0.9 0.799 0.799 RC
N
65.464 122.231 M
65.464 126.545 L
68.555 126.103 L
77.72 120.89 L
86.885 116.186 L
96.05 114.21 L
105.215 111.187 L
114.38 112.436 L
123.545 135.942 L
132.71 170.646 L
141.875 171.783 L
151.04 128.782 L
160.205 108.985 L
169.37 88.799 L
178.535 81.438 L
187.7 77.346 L
196.865 73.861 L
206.03 70.289 L
215.195 67.423 L
224.36 65.186 L
233.525 62.038 L
242.69 58.577 L
251.855 55.842 L
261.02 54.133 L
270.185 56.103 L
279.35 57.947 L
288.515 66.409 L
297.68 73.075 L
306.845 82.795 L
316.01 108.752 L
325.175 118.057 L
334.34 113.391 L
343.505 92.468 L
352.67 85.979 L
361.835 87.002 L
371 87.057 L
371.036 87.056 L
371.036 87.017 L
371.036 76.18 L
371 76.177 L
361.835 75.23 L
352.67 73.825 L
343.505 80.587 L
334.34 102.677 L
325.175 108.33 L
316.01 99.304 L
306.845 73.49 L
297.68 63.372 L
288.515 55.899 L
279.35 46.746 L
270.185 44.391 L
261.02 43.415 L
251.855 45.889 L
242.69 48.137 L
233.525 50.997 L
224.36 54.44 L
215.195 57.228 L
206.03 60.851 L
196.865 65.398 L
187.7 69.086 L
178.535 73.024 L
169.37 80.178 L
160.205 100.53 L
151.04 120.856 L
141.875 164.803 L
132.71 164.021 L
123.545 128.636 L
114.38 104.173 L
105.215 102.666 L
96.05 105.705 L
86.885 106.813 L
77.72 110.329 L
68.555 113.617 L
65.464 113.956 L
cp
f
GR
GS
[0.99902 0 0 1.00077 0 -0.19998] CT
0.82 0.639 0.639 RC
1 LJ
0.5 LW
N
65.464 126.545 M
68.555 126.103 L
77.72 120.89 L
86.885 116.186 L
96.05 114.21 L
105.215 111.187 L
114.38 112.436 L
123.545 135.942 L
132.71 170.646 L
141.875 171.783 L
151.04 128.782 L
160.205 108.985 L
169.37 88.799 L
178.535 81.438 L
187.7 77.346 L
196.865 73.861 L
206.03 70.289 L
215.195 67.423 L
224.36 65.186 L
233.525 62.038 L
242.69 58.577 L
251.855 55.842 L
261.02 54.133 L
270.185 56.103 L
279.35 57.947 L
288.515 66.409 L
297.68 73.075 L
306.845 82.795 L
316.01 108.752 L
325.175 118.057 L
334.34 113.391 L
343.505 92.468 L
352.67 85.979 L
361.835 87.002 L
371 87.057 L
371.036 87.056 L
S
GR
GS
[0.99902 0 0 1.00077 0 -0.19998] CT
0.82 0.639 0.639 RC
1 LJ
0.5 LW
N
65.464 113.956 M
68.555 113.617 L
77.72 110.329 L
86.885 106.813 L
96.05 105.705 L
105.215 102.666 L
114.38 104.173 L
123.545 128.636 L
132.71 164.021 L
141.875 164.803 L
151.04 120.856 L
160.205 100.53 L
169.37 80.178 L
178.535 73.024 L
187.7 69.086 L
196.865 65.398 L
206.03 60.851 L
215.195 57.228 L
224.36 54.44 L
233.525 50.997 L
242.69 48.137 L
251.855 45.889 L
261.02 43.415 L
270.185 44.391 L
279.35 46.746 L
288.515 55.899 L
297.68 63.372 L
306.845 73.49 L
316.01 99.304 L
325.175 108.33 L
334.34 102.677 L
343.505 80.587 L
352.67 73.825 L
361.835 75.23 L
371 76.177 L
371.036 76.18 L
S
GR
GS
[0.99902 0 0 1.00077 0 -0.19998] CT
0.6 0.2 0.2 RC
1 LJ
2 LW
N
65.464 120.25 M
68.555 119.86 L
77.72 115.609 L
86.885 111.5 L
96.05 109.958 L
105.215 106.926 L
114.38 108.305 L
123.545 132.289 L
132.71 167.333 L
141.875 168.293 L
151.04 124.819 L
160.205 104.758 L
169.37 84.488 L
178.535 77.231 L
187.7 73.216 L
196.865 69.629 L
206.03 65.57 L
215.195 62.326 L
224.36 59.813 L
233.525 56.517 L
242.69 53.357 L
251.855 50.866 L
261.02 48.774 L
270.185 50.247 L
279.35 52.347 L
288.515 61.154 L
297.68 68.223 L
306.845 78.142 L
316.01 104.028 L
325.175 113.194 L
334.34 108.034 L
343.505 86.527 L
352.67 79.902 L
361.835 81.116 L
371 81.617 L
371.036 81.618 L
S
GR
GS
[0.99902 0 0 1.00077 0 -0.19998] CT
1 LJ
5 LW
N
187.7 175.058 M
196.865 175.058 L
206.03 175.058 L
215.195 175.058 L
224.36 175.058 L
233.525 175.058 L
242.69 175.058 L
251.855 175.058 L
261.02 175.058 L
270.185 175.058 L
279.35 175.058 L
S
GR
GS
[0.99902 0 0 1.00077 0 -0.19998] CT
1 LJ
5 LW
N
306.845 175.058 M
316.01 175.058 L
325.175 175.058 L
334.34 175.058 L
343.505 175.058 L
352.67 175.058 L
361.835 175.058 L
371 175.058 L
371.036 175.058 L
S
GR
GS
[0.99902 0 0 1.00077 202.80195 135.40464] CT
/Helvetica 15 F
GS
[1 0 0 1 0 0] CT
0 5.5 moveto 
1 -1 scale
(1 Target) t 
GR
GR
GS
[0.99902 0 0 1.00077 0 -0.19998] CT
0.898 0.6 0.6 RC
1 LJ
2 LW
N
170 135.5 M
200 135.5 L
S
GR
GS
[0.99902 0 0 1.00077 202.80195 153.91893] CT
/Helvetica 15 F
GS
[1 0 0 1 0 0] CT
0 5.5 moveto 
1 -1 scale
(2 Targets) t 
GR
GR
GS
[0.99902 0 0 1.00077 0 -0.19998] CT
1 0.502 0.502 RC
1 LJ
2 LW
N
170 154 M
200 154 L
S
GR
GS
[0.99902 0 0 1.00077 202.80195 172.43321] CT
/Helvetica 15 F
GS
[1 0 0 1 0 0] CT
0 5.5 moveto 
1 -1 scale
(3 Targets) t 
GR
GR
GS
[0.99902 0 0 1.00077 0 -0.19998] CT
0.898 0.302 0.302 RC
1 LJ
2 LW
N
170 172.5 M
200 172.5 L
S
GR
GS
[0.99902 0 0 1.00077 202.80195 190.9475] CT
/Helvetica 15 F
GS
[1 0 0 1 0 0] CT
0 5.5 moveto 
1 -1 scale
(4 Targets) t 
GR
GR
GS
[0.99902 0 0 1.00077 0 -0.19998] CT
0.6 0.2 0.2 RC
1 LJ
2 LW
N
170 191 M
200 191 L
S
GR
%%Trailer
%%Pages: 1
%%EOF
