%!PS-Adobe-3.0 EPSF-3.0
%%Creator: (MATLAB, The Mathworks, Inc. Version 9.10.0.1602886 \(R2021a\). Operating System: Mac OS X)
%%Title: /Users/kosciessa/Desktop/tardis/LNDG/stateswitch/stsw_eeg_task/mse/figures/e01_EntropyTraces_yaoa.eps
%%CreationDate: 2022-02-17T09:22:34
%%Pages: (atend)
%%BoundingBox:     4     0   375   241
%%LanguageLevel: 3
%%EndComments
%%BeginProlog
%%BeginResource: procset (Apache XML Graphics Std ProcSet) 1.2 0
%%Version: 1.2 0
%%Copyright: (Copyright 2001-2003,2010 The Apache Software Foundation. License terms: http://www.apache.org/licenses/LICENSE-2.0)
/bd{bind def}bind def
/ld{load def}bd
/GR/grestore ld
/GS/gsave ld
/RM/rmoveto ld
/C/curveto ld
/t/show ld
/L/lineto ld
/ML/setmiterlimit ld
/CT/concat ld
/f/fill ld
/N/newpath ld
/S/stroke ld
/CC/setcmykcolor ld
/A/ashow ld
/cp/closepath ld
/RC/setrgbcolor ld
/LJ/setlinejoin ld
/GC/setgray ld
/LW/setlinewidth ld
/M/moveto ld
/re {4 2 roll M
1 index 0 rlineto
0 exch rlineto
neg 0 rlineto
cp } bd
/_ctm matrix def
/_tm matrix def
/BT { _ctm currentmatrix pop matrix _tm copy pop 0 0 moveto } bd
/ET { _ctm setmatrix } bd
/iTm { _ctm setmatrix _tm concat } bd
/Tm { _tm astore pop iTm 0 0 moveto } bd
/ux 0.0 def
/uy 0.0 def
/F {
  /Tp exch def
  /Tf exch def
  Tf findfont Tp scalefont setfont
  /cf Tf def  /cs Tp def
} bd
/ULS {currentpoint /uy exch def /ux exch def} bd
/ULE {
  /Tcx currentpoint pop def
  gsave
  newpath
  cf findfont cs scalefont dup
  /FontMatrix get 0 get /Ts exch def /FontInfo get dup
  /UnderlinePosition get Ts mul /To exch def
  /UnderlineThickness get Ts mul /Tt exch def
  ux uy To add moveto  Tcx uy To add lineto
  Tt setlinewidth stroke
  grestore
} bd
/OLE {
  /Tcx currentpoint pop def
  gsave
  newpath
  cf findfont cs scalefont dup
  /FontMatrix get 0 get /Ts exch def /FontInfo get dup
  /UnderlinePosition get Ts mul /To exch def
  /UnderlineThickness get Ts mul /Tt exch def
  ux uy To add cs add moveto Tcx uy To add cs add lineto
  Tt setlinewidth stroke
  grestore
} bd
/SOE {
  /Tcx currentpoint pop def
  gsave
  newpath
  cf findfont cs scalefont dup
  /FontMatrix get 0 get /Ts exch def /FontInfo get dup
  /UnderlinePosition get Ts mul /To exch def
  /UnderlineThickness get Ts mul /Tt exch def
  ux uy To add cs 10 mul 26 idiv add moveto Tcx uy To add cs 10 mul 26 idiv add lineto
  Tt setlinewidth stroke
  grestore
} bd
/QT {
/Y22 exch store
/X22 exch store
/Y21 exch store
/X21 exch store
currentpoint
/Y21 load 2 mul add 3 div exch
/X21 load 2 mul add 3 div exch
/X21 load 2 mul /X22 load add 3 div
/Y21 load 2 mul /Y22 load add 3 div
/X22 load /Y22 load curveto
} bd
/SSPD {
dup length /d exch dict def
{
/v exch def
/k exch def
currentpagedevice k known {
/cpdv currentpagedevice k get def
v cpdv ne {
/upd false def
/nullv v type /nulltype eq def
/nullcpdv cpdv type /nulltype eq def
nullv nullcpdv or
{
/upd true def
} {
/sametype v type cpdv type eq def
sametype {
v type /arraytype eq {
/vlen v length def
/cpdvlen cpdv length def
vlen cpdvlen eq {
0 1 vlen 1 sub {
/i exch def
/obj v i get def
/cpdobj cpdv i get def
obj cpdobj ne {
/upd true def
exit
} if
} for
} {
/upd true def
} ifelse
} {
v type /dicttype eq {
v {
/dv exch def
/dk exch def
/cpddv cpdv dk get def
dv cpddv ne {
/upd true def
exit
} if
} forall
} {
/upd true def
} ifelse
} ifelse
} if
} ifelse
upd true eq {
d k v put
} if
} if
} if
} forall
d length 0 gt {
d setpagedevice
} if
} bd
/RE { % /NewFontName [NewEncodingArray] /FontName RE -
  findfont dup length dict begin
  {
    1 index /FID ne
    {def} {pop pop} ifelse
  } forall
  /Encoding exch def
  /FontName 1 index def
  currentdict definefont pop
  end
} bind def
%%EndResource
%%BeginResource: procset (Apache XML Graphics EPS ProcSet) 1.0 0
%%Version: 1.0 0
%%Copyright: (Copyright 2002-2003 The Apache Software Foundation. License terms: http://www.apache.org/licenses/LICENSE-2.0)
/BeginEPSF { %def
/b4_Inc_state save def         % Save state for cleanup
/dict_count countdictstack def % Count objects on dict stack
/op_count count 1 sub def      % Count objects on operand stack
userdict begin                 % Push userdict on dict stack
/showpage { } def              % Redefine showpage, { } = null proc
0 setgray 0 setlinecap         % Prepare graphics state
1 setlinewidth 0 setlinejoin
10 setmiterlimit [ ] 0 setdash newpath
/languagelevel where           % If level not equal to 1 then
{pop languagelevel             % set strokeadjust and
1 ne                           % overprint to their defaults.
{false setstrokeadjust false setoverprint
} if
} if
} bd
/EndEPSF { %def
count op_count sub {pop} repeat            % Clean up stacks
countdictstack dict_count sub {end} repeat
b4_Inc_state restore
} bd
%%EndResource
%FOPBeginFontDict
%%IncludeResource: font Courier-Oblique
%%IncludeResource: font Courier-BoldOblique
%%IncludeResource: font Courier-Bold
%%IncludeResource: font ZapfDingbats
%%IncludeResource: font Symbol
%%IncludeResource: font Helvetica
%%IncludeResource: font Helvetica-Oblique
%%IncludeResource: font Helvetica-Bold
%%IncludeResource: font Helvetica-BoldOblique
%%IncludeResource: font Times-Roman
%%IncludeResource: font Times-Italic
%%IncludeResource: font Times-Bold
%%IncludeResource: font Times-BoldItalic
%%IncludeResource: font Courier
%FOPEndFontDict
%%BeginResource: encoding WinAnsiEncoding
/WinAnsiEncoding [
/.notdef /.notdef /.notdef /.notdef /.notdef
/.notdef /.notdef /.notdef /.notdef /.notdef
/.notdef /.notdef /.notdef /.notdef /.notdef
/.notdef /.notdef /.notdef /.notdef /.notdef
/.notdef /.notdef /.notdef /.notdef /.notdef
/.notdef /.notdef /.notdef /.notdef /.notdef
/.notdef /.notdef /space /exclam /quotedbl
/numbersign /dollar /percent /ampersand /quotesingle
/parenleft /parenright /asterisk /plus /comma
/hyphen /period /slash /zero /one
/two /three /four /five /six
/seven /eight /nine /colon /semicolon
/less /equal /greater /question /at
/A /B /C /D /E
/F /G /H /I /J
/K /L /M /N /O
/P /Q /R /S /T
/U /V /W /X /Y
/Z /bracketleft /backslash /bracketright /asciicircum
/underscore /quoteleft /a /b /c
/d /e /f /g /h
/i /j /k /l /m
/n /o /p /q /r
/s /t /u /v /w
/x /y /z /braceleft /bar
/braceright /asciitilde /bullet /Euro /bullet
/quotesinglbase /florin /quotedblbase /ellipsis /dagger
/daggerdbl /circumflex /perthousand /Scaron /guilsinglleft
/OE /bullet /Zcaron /bullet /bullet
/quoteleft /quoteright /quotedblleft /quotedblright /bullet
/endash /emdash /asciitilde /trademark /scaron
/guilsinglright /oe /bullet /zcaron /Ydieresis
/space /exclamdown /cent /sterling /currency
/yen /brokenbar /section /dieresis /copyright
/ordfeminine /guillemotleft /logicalnot /sfthyphen /registered
/macron /degree /plusminus /twosuperior /threesuperior
/acute /mu /paragraph /middot /cedilla
/onesuperior /ordmasculine /guillemotright /onequarter /onehalf
/threequarters /questiondown /Agrave /Aacute /Acircumflex
/Atilde /Adieresis /Aring /AE /Ccedilla
/Egrave /Eacute /Ecircumflex /Edieresis /Igrave
/Iacute /Icircumflex /Idieresis /Eth /Ntilde
/Ograve /Oacute /Ocircumflex /Otilde /Odieresis
/multiply /Oslash /Ugrave /Uacute /Ucircumflex
/Udieresis /Yacute /Thorn /germandbls /agrave
/aacute /acircumflex /atilde /adieresis /aring
/ae /ccedilla /egrave /eacute /ecircumflex
/edieresis /igrave /iacute /icircumflex /idieresis
/eth /ntilde /ograve /oacute /ocircumflex
/otilde /odieresis /divide /oslash /ugrave
/uacute /ucircumflex /udieresis /yacute /thorn
/ydieresis
] def
%%EndResource
%FOPBeginFontReencode
/Courier-Oblique findfont
dup length dict begin
  {1 index /FID ne {def} {pop pop} ifelse} forall
  /Encoding WinAnsiEncoding def
  currentdict
end
/Courier-Oblique exch definefont pop
/Courier-BoldOblique findfont
dup length dict begin
  {1 index /FID ne {def} {pop pop} ifelse} forall
  /Encoding WinAnsiEncoding def
  currentdict
end
/Courier-BoldOblique exch definefont pop
/Courier-Bold findfont
dup length dict begin
  {1 index /FID ne {def} {pop pop} ifelse} forall
  /Encoding WinAnsiEncoding def
  currentdict
end
/Courier-Bold exch definefont pop
/Helvetica findfont
dup length dict begin
  {1 index /FID ne {def} {pop pop} ifelse} forall
  /Encoding WinAnsiEncoding def
  currentdict
end
/Helvetica exch definefont pop
/Helvetica-Oblique findfont
dup length dict begin
  {1 index /FID ne {def} {pop pop} ifelse} forall
  /Encoding WinAnsiEncoding def
  currentdict
end
/Helvetica-Oblique exch definefont pop
/Helvetica-Bold findfont
dup length dict begin
  {1 index /FID ne {def} {pop pop} ifelse} forall
  /Encoding WinAnsiEncoding def
  currentdict
end
/Helvetica-Bold exch definefont pop
/Helvetica-BoldOblique findfont
dup length dict begin
  {1 index /FID ne {def} {pop pop} ifelse} forall
  /Encoding WinAnsiEncoding def
  currentdict
end
/Helvetica-BoldOblique exch definefont pop
/Times-Roman findfont
dup length dict begin
  {1 index /FID ne {def} {pop pop} ifelse} forall
  /Encoding WinAnsiEncoding def
  currentdict
end
/Times-Roman exch definefont pop
/Times-Italic findfont
dup length dict begin
  {1 index /FID ne {def} {pop pop} ifelse} forall
  /Encoding WinAnsiEncoding def
  currentdict
end
/Times-Italic exch definefont pop
/Times-Bold findfont
dup length dict begin
  {1 index /FID ne {def} {pop pop} ifelse} forall
  /Encoding WinAnsiEncoding def
  currentdict
end
/Times-Bold exch definefont pop
/Times-BoldItalic findfont
dup length dict begin
  {1 index /FID ne {def} {pop pop} ifelse} forall
  /Encoding WinAnsiEncoding def
  currentdict
end
/Times-BoldItalic exch definefont pop
/Courier findfont
dup length dict begin
  {1 index /FID ne {def} {pop pop} ifelse} forall
  /Encoding WinAnsiEncoding def
  currentdict
end
/Courier exch definefont pop
%FOPEndFontReencode
%%EndProlog
%%Page: 1 1
%%PageBoundingBox: 0 0 410 259
%%BeginPageSetup
[1 0 0 -1 0 259] CT
%%EndPageSetup
GS
[0.99902 0 0 1.00077 0 -0.19998] CT
1 GC
N
0 0 410 259 re
f
GR
GS
[0.99902 0 0 1.00077 0 -0.19998] CT
1 GC
N
0 0 410 259 re
f
GR
GS
[0.99902 0 0 1.00077 0 -0.19998] CT
1 GC
N
65.5 209.5 M
371 209.5 L
371 19.5 L
65.5 19.5 L
cp
f
GR
GS
[0.99902 0 0 1.00077 0 -0.19998] CT
0.149 GC
2 setlinecap
1 LJ
0.5 LW
N
65.5 209.5 M
371 209.5 L
S
GR
GS
[0.99902 0 0 1.00077 0 -0.19998] CT
0.149 GC
2 setlinecap
1 LJ
0.5 LW
N
65.5 209.5 M
65.5 206.446 L
S
GR
GS
[0.99902 0 0 1.00077 0 -0.19998] CT
0.149 GC
2 setlinecap
1 LJ
0.5 LW
N
126.6 209.5 M
126.6 206.446 L
S
GR
GS
[0.99902 0 0 1.00077 0 -0.19998] CT
0.149 GC
2 setlinecap
1 LJ
0.5 LW
N
187.7 209.5 M
187.7 206.446 L
S
GR
GS
[0.99902 0 0 1.00077 0 -0.19998] CT
0.149 GC
2 setlinecap
1 LJ
0.5 LW
N
248.8 209.5 M
248.8 206.446 L
S
GR
GS
[0.99902 0 0 1.00077 0 -0.19998] CT
0.149 GC
2 setlinecap
1 LJ
0.5 LW
N
309.9 209.5 M
309.9 206.446 L
S
GR
GS
[0.99902 0 0 1.00077 0 -0.19998] CT
0.149 GC
2 setlinecap
1 LJ
0.5 LW
N
371 209.5 M
371 206.446 L
S
GR
GS
[0.99902 0 0 1.00077 65.4361 215.06606] CT
0.149 GC
/Helvetica 18 F
GS
[1 0 0 1 0 0] CT
-9 18 moveto 
1 -1 scale
(-1) t 
GR
GR
GS
[0.99902 0 0 1.00077 126.47649 215.06606] CT
0.149 GC
/Helvetica 18 F
GS
[1 0 0 1 0 0] CT
-5.5 18 moveto 
1 -1 scale
(0) t 
GR
GR
GS
[0.99902 0 0 1.00077 187.51688 215.06606] CT
0.149 GC
/Helvetica 18 F
GS
[1 0 0 1 0 0] CT
-5.5 18 moveto 
1 -1 scale
(1) t 
GR
GR
GS
[0.99902 0 0 1.00077 248.55728 215.06606] CT
0.149 GC
/Helvetica 18 F
GS
[1 0 0 1 0 0] CT
-5.5 18 moveto 
1 -1 scale
(2) t 
GR
GR
GS
[0.99902 0 0 1.00077 309.59766 215.06606] CT
0.149 GC
/Helvetica 18 F
GS
[1 0 0 1 0 0] CT
-5.5 18 moveto 
1 -1 scale
(3) t 
GR
GR
GS
[0.99902 0 0 1.00077 370.63805 215.06606] CT
0.149 GC
/Helvetica 18 F
GS
[1 0 0 1 0 0] CT
-5.5 18 moveto 
1 -1 scale
(4) t 
GR
GR
GS
[0.99902 0 0 1.00077 218.03723 237.48341] CT
0.149 GC
/Helvetica 18 F
GS
[1 0 0 1 0 0] CT
-113.5 18 moveto 
1 -1 scale
(Time \(s from stimulus onset\)) t 
GR
GR
GS
[0.99902 0 0 1.00077 0 -0.19998] CT
0.149 GC
2 setlinecap
1 LJ
0.5 LW
N
65.5 209.5 M
65.5 19.5 L
S
GR
GS
[0.99902 0 0 1.00077 0 -0.19998] CT
0.149 GC
2 setlinecap
1 LJ
0.5 LW
N
65.5 181.613 M
68.554 181.613 L
S
GR
GS
[0.99902 0 0 1.00077 0 -0.19998] CT
0.149 GC
2 setlinecap
1 LJ
0.5 LW
N
65.5 102.893 M
68.554 102.893 L
S
GR
GS
[0.99902 0 0 1.00077 0 -0.19998] CT
0.149 GC
2 setlinecap
1 LJ
0.5 LW
N
65.5 24.173 M
68.554 24.173 L
S
GR
GS
[0.99902 0 0 1.00077 59.84156 181.55322] CT
0.149 GC
/Helvetica 18 F
GS
[1 0 0 1 0 0] CT
-36 7 moveto 
1 -1 scale
(0.45) t 
GR
GR
GS
[0.99902 0 0 1.00077 59.84156 102.77266] CT
0.149 GC
/Helvetica 18 F
GS
[1 0 0 1 0 0] CT
-26 7 moveto 
1 -1 scale
(0.5) t 
GR
GR
GS
[0.99902 0 0 1.00077 59.84156 23.99209] CT
0.149 GC
/Helvetica 18 F
GS
[1 0 0 1 0 0] CT
-36 7 moveto 
1 -1 scale
(0.55) t 
GR
GR
GS
[0 -1.00077 0.99902 0 21.47902 114.38834] CT
0.149 GC
/Helvetica 18 F
GS
[1 0 0 1 0 0] CT
-64 -4 moveto 
1 -1 scale
(Sample entropy) t 
GR
GR
GS
[0.99902 0 0 1.00077 0 -0.19998] CT
1 0.949 0.8 RC
N
226.648 209.523 M
309.9 209.523 L
309.9 19.477 L
244.349 19.477 L
126.6 19.477 L
126.6 209.523 L
cp
f
GR
GS
[0.99902 0 0 1.00077 0 -0.19998] CT
0.974 0.9 0.9 RC
N
233.525 66.66 M
224.36 70.27 L
215.195 72.077 L
206.03 72.311 L
196.865 72.677 L
187.7 71.663 L
178.535 74.575 L
169.37 81.671 L
160.205 108.095 L
151.04 138.011 L
141.875 178.055 L
132.71 179.62 L
123.545 133.106 L
114.38 93.52 L
105.215 90.323 L
96.05 86.15 L
86.885 84.222 L
77.72 83.095 L
68.555 83.7 L
65.464 84.131 L
65.464 88.104 L
65.464 90.274 L
68.555 89.694 L
77.72 88.571 L
86.885 89.544 L
96.05 91.834 L
105.215 96.7 L
114.38 99.871 L
123.545 138.632 L
132.71 184.78 L
141.875 183.442 L
151.04 143.95 L
160.205 114.509 L
169.37 88.209 L
178.535 81.33 L
187.7 77.793 L
196.865 78.48 L
206.03 78.312 L
215.195 78.507 L
224.36 77.367 L
233.525 74.042 L
242.69 72.124 L
251.855 70.765 L
261.02 71.208 L
270.185 73.623 L
279.35 77.862 L
288.515 83.739 L
297.68 90.632 L
306.845 96.798 L
316.01 122.714 L
325.175 135.914 L
334.34 132.149 L
343.505 117.685 L
352.67 108.539 L
361.835 102.335 L
371 101.112 L
371.036 101.108 L
371.036 93.696 L
371.036 93.668 L
371 93.67 L
361.835 95.067 L
352.67 101.335 L
343.505 110.463 L
334.34 125.541 L
325.175 130.177 L
316.01 117.274 L
306.845 91.275 L
297.68 85.196 L
288.515 78.231 L
279.35 72.361 L
270.185 67.397 L
261.02 64.109 L
251.855 63.215 L
242.69 64.515 L
cp
f
GR
GS
[0.99902 0 0 1.00077 0 -0.19998] CT
0.957 0.82 0.82 RC
1 LJ
0.5 LW
N
65.464 90.274 M
68.555 89.694 L
77.72 88.571 L
86.885 89.544 L
96.05 91.834 L
105.215 96.7 L
114.38 99.871 L
123.545 138.632 L
132.71 184.78 L
141.875 183.442 L
151.04 143.95 L
160.205 114.509 L
169.37 88.209 L
178.535 81.33 L
187.7 77.793 L
196.865 78.48 L
206.03 78.312 L
215.195 78.507 L
224.36 77.367 L
233.525 74.042 L
242.69 72.124 L
251.855 70.765 L
261.02 71.208 L
270.185 73.623 L
279.35 77.862 L
288.515 83.739 L
297.68 90.632 L
306.845 96.798 L
316.01 122.714 L
325.175 135.914 L
334.34 132.149 L
343.505 117.685 L
352.67 108.539 L
361.835 102.335 L
371 101.112 L
371.036 101.108 L
S
GR
GS
[0.99902 0 0 1.00077 0 -0.19998] CT
0.957 0.82 0.82 RC
1 LJ
0.5 LW
N
65.464 84.131 M
68.555 83.7 L
77.72 83.095 L
86.885 84.222 L
96.05 86.15 L
105.215 90.323 L
114.38 93.52 L
123.545 133.106 L
132.71 179.62 L
141.875 178.055 L
151.04 138.011 L
160.205 108.095 L
169.37 81.671 L
178.535 74.575 L
187.7 71.663 L
196.865 72.677 L
206.03 72.311 L
215.195 72.077 L
224.36 70.27 L
233.525 66.66 L
242.69 64.515 L
251.855 63.215 L
261.02 64.109 L
270.185 67.397 L
279.35 72.361 L
288.515 78.231 L
297.68 85.196 L
306.845 91.275 L
316.01 117.274 L
325.175 130.177 L
334.34 125.541 L
343.505 110.463 L
352.67 101.335 L
361.835 95.067 L
371 93.67 L
371.036 93.668 L
S
GR
GS
[0.99902 0 0 1.00077 0 -0.19998] CT
0.898 0.6 0.6 RC
1 LJ
2 LW
N
65.464 87.203 M
68.555 86.697 L
77.72 85.833 L
86.885 86.883 L
96.05 88.992 L
105.215 93.511 L
114.38 96.695 L
123.545 135.869 L
132.71 182.2 L
141.875 180.749 L
151.04 140.98 L
160.205 111.302 L
169.37 84.94 L
178.535 77.952 L
187.7 74.728 L
196.865 75.579 L
206.03 75.311 L
215.195 75.292 L
224.36 73.818 L
233.525 70.351 L
242.69 68.319 L
251.855 66.99 L
261.02 67.659 L
270.185 70.51 L
279.35 75.111 L
288.515 80.985 L
297.68 87.914 L
306.845 94.036 L
316.01 119.994 L
325.175 133.045 L
334.34 128.845 L
343.505 114.074 L
352.67 104.937 L
361.835 98.701 L
371 97.391 L
371.036 97.388 L
S
GR
GS
[0.99902 0 0 1.00077 0 -0.19998] CT
1 0.875 0.875 RC
N
123.545 126.467 M
114.38 92.071 L
105.215 91.243 L
96.05 90.845 L
86.885 88.647 L
77.72 85.641 L
68.555 87.347 L
65.464 88.353 L
65.464 92.491 L
65.464 94.592 L
68.555 93.59 L
77.72 92.221 L
86.885 94.933 L
96.05 96.815 L
105.215 97.115 L
114.38 98.41 L
123.545 132.525 L
132.71 176.005 L
141.875 176.288 L
151.04 139.881 L
160.205 115.872 L
169.37 88.591 L
178.535 79.949 L
187.7 76.972 L
196.865 76.13 L
206.03 74.975 L
215.195 72.175 L
224.36 68.492 L
233.525 66.157 L
242.69 62.872 L
251.855 62.962 L
261.02 62.876 L
270.185 64.558 L
279.35 68.979 L
288.515 75.392 L
297.68 84.068 L
306.845 91.773 L
316.01 118.103 L
325.175 126.956 L
334.34 120.799 L
343.505 103.923 L
352.67 94.038 L
361.835 89.964 L
371 89.014 L
371.036 89.007 L
371.036 81.961 L
371.036 81.936 L
371 81.939 L
361.835 81.959 L
352.67 86.081 L
343.505 96.169 L
334.34 113.713 L
325.175 120.427 L
316.01 111.343 L
306.845 85.011 L
297.68 77.48 L
288.515 69.157 L
279.35 62.973 L
270.185 58.648 L
261.02 56.698 L
251.855 56.05 L
242.69 55.747 L
233.525 59.522 L
224.36 62.223 L
215.195 66.024 L
206.03 69.166 L
196.865 70.483 L
187.7 71.34 L
178.535 73.706 L
169.37 82.218 L
160.205 109.404 L
151.04 134.017 L
141.875 171.066 L
132.71 170.531 L
cp
f
GR
GS
[0.99902 0 0 1.00077 0 -0.19998] CT
1 0.776 0.776 RC
1 LJ
0.5 LW
N
65.464 94.592 M
68.555 93.59 L
77.72 92.221 L
86.885 94.933 L
96.05 96.815 L
105.215 97.115 L
114.38 98.41 L
123.545 132.525 L
132.71 176.005 L
141.875 176.288 L
151.04 139.881 L
160.205 115.872 L
169.37 88.591 L
178.535 79.949 L
187.7 76.972 L
196.865 76.13 L
206.03 74.975 L
215.195 72.175 L
224.36 68.492 L
233.525 66.157 L
242.69 62.872 L
251.855 62.962 L
261.02 62.876 L
270.185 64.558 L
279.35 68.979 L
288.515 75.392 L
297.68 84.068 L
306.845 91.773 L
316.01 118.103 L
325.175 126.956 L
334.34 120.799 L
343.505 103.923 L
352.67 94.038 L
361.835 89.964 L
371 89.014 L
371.036 89.007 L
S
GR
GS
[0.99902 0 0 1.00077 0 -0.19998] CT
1 0.776 0.776 RC
1 LJ
0.5 LW
N
65.464 88.353 M
68.555 87.347 L
77.72 85.641 L
86.885 88.647 L
96.05 90.845 L
105.215 91.243 L
114.38 92.071 L
123.545 126.467 L
132.71 170.531 L
141.875 171.066 L
151.04 134.017 L
160.205 109.404 L
169.37 82.218 L
178.535 73.706 L
187.7 71.34 L
196.865 70.483 L
206.03 69.166 L
215.195 66.024 L
224.36 62.223 L
233.525 59.522 L
242.69 55.747 L
251.855 56.05 L
261.02 56.698 L
270.185 58.648 L
279.35 62.973 L
288.515 69.157 L
297.68 77.48 L
306.845 85.011 L
316.01 111.343 L
325.175 120.427 L
334.34 113.713 L
343.505 96.169 L
352.67 86.081 L
361.835 81.959 L
371 81.939 L
371.036 81.936 L
S
GR
GS
[0.99902 0 0 1.00077 0 -0.19998] CT
1 0.502 0.502 RC
1 LJ
2 LW
N
65.464 91.473 M
68.555 90.469 L
77.72 88.931 L
86.885 91.79 L
96.05 93.83 L
105.215 94.179 L
114.38 95.24 L
123.545 129.496 L
132.71 173.268 L
141.875 173.677 L
151.04 136.949 L
160.205 112.638 L
169.37 85.404 L
178.535 76.828 L
187.7 74.156 L
196.865 73.306 L
206.03 72.071 L
215.195 69.099 L
224.36 65.357 L
233.525 62.839 L
242.69 59.31 L
251.855 59.506 L
261.02 59.787 L
270.185 61.603 L
279.35 65.976 L
288.515 72.274 L
297.68 80.774 L
306.845 88.392 L
316.01 114.723 L
325.175 123.691 L
334.34 117.256 L
343.505 100.046 L
352.67 90.059 L
361.835 85.962 L
371 85.477 L
371.036 85.472 L
S
GR
GS
[0.99902 0 0 1.00077 0 -0.19998] CT
0.974 0.825 0.825 RC
N
123.545 126.784 M
114.38 92.176 L
105.215 89.356 L
96.05 89 L
86.885 89.638 L
77.72 91.126 L
68.555 95.768 L
65.464 96.405 L
65.464 100.622 L
65.464 102.936 L
68.555 102.132 L
77.72 97.365 L
86.885 95.917 L
96.05 95.347 L
105.215 95.738 L
114.38 98.851 L
123.545 133.457 L
132.71 175.592 L
141.875 174.469 L
151.04 135.245 L
160.205 107.517 L
169.37 81.974 L
178.535 75.976 L
187.7 75.844 L
196.865 75.373 L
206.03 73.086 L
215.195 71.547 L
224.36 71.553 L
233.525 71.158 L
242.69 69 L
251.855 64.754 L
261.02 63.261 L
270.185 66.984 L
279.35 72.171 L
288.515 77.768 L
297.68 82.93 L
306.845 88.048 L
316.01 111.729 L
325.175 121.604 L
334.34 115.68 L
343.505 95.599 L
352.67 83.54 L
361.835 78.839 L
371 78.062 L
371.036 78.067 L
371.036 78.043 L
371.036 71.865 L
371 71.859 L
361.835 72.727 L
352.67 77.513 L
343.505 90.063 L
334.34 110.22 L
325.175 116.152 L
316.01 106.147 L
306.845 81.771 L
297.68 76.534 L
288.515 70.983 L
279.35 65.085 L
270.185 60.126 L
261.02 56.779 L
251.855 57.92 L
242.69 61.829 L
233.525 63.995 L
224.36 64.968 L
215.195 65.606 L
206.03 67.032 L
196.865 69.129 L
187.7 69.507 L
178.535 69.492 L
169.37 75.423 L
160.205 101.245 L
151.04 128.947 L
141.875 168.216 L
132.71 169.256 L
cp
f
GR
GS
[0.99902 0 0 1.00077 0 -0.19998] CT
0.957 0.686 0.686 RC
1 LJ
0.5 LW
N
65.464 102.936 M
68.555 102.132 L
77.72 97.365 L
86.885 95.917 L
96.05 95.347 L
105.215 95.738 L
114.38 98.851 L
123.545 133.457 L
132.71 175.592 L
141.875 174.469 L
151.04 135.245 L
160.205 107.517 L
169.37 81.974 L
178.535 75.976 L
187.7 75.844 L
196.865 75.373 L
206.03 73.086 L
215.195 71.547 L
224.36 71.553 L
233.525 71.158 L
242.69 69 L
251.855 64.754 L
261.02 63.261 L
270.185 66.984 L
279.35 72.171 L
288.515 77.768 L
297.68 82.93 L
306.845 88.048 L
316.01 111.729 L
325.175 121.604 L
334.34 115.68 L
343.505 95.599 L
352.67 83.54 L
361.835 78.839 L
371 78.062 L
371.036 78.067 L
S
GR
GS
[0.99902 0 0 1.00077 0 -0.19998] CT
0.957 0.686 0.686 RC
1 LJ
0.5 LW
N
65.464 96.405 M
68.555 95.768 L
77.72 91.126 L
86.885 89.638 L
96.05 89 L
105.215 89.356 L
114.38 92.176 L
123.545 126.784 L
132.71 169.256 L
141.875 168.216 L
151.04 128.947 L
160.205 101.245 L
169.37 75.423 L
178.535 69.492 L
187.7 69.507 L
196.865 69.129 L
206.03 67.032 L
215.195 65.606 L
224.36 64.968 L
233.525 63.995 L
242.69 61.829 L
251.855 57.92 L
261.02 56.779 L
270.185 60.126 L
279.35 65.085 L
288.515 70.983 L
297.68 76.534 L
306.845 81.771 L
316.01 106.147 L
325.175 116.152 L
334.34 110.22 L
343.505 90.063 L
352.67 77.513 L
361.835 72.727 L
371 71.859 L
371.036 71.865 L
S
GR
GS
[0.99902 0 0 1.00077 0 -0.19998] CT
0.898 0.302 0.302 RC
1 LJ
2 LW
N
65.464 99.67 M
68.555 98.95 L
77.72 94.246 L
86.885 92.777 L
96.05 92.173 L
105.215 92.547 L
114.38 95.513 L
123.545 130.12 L
132.71 172.424 L
141.875 171.342 L
151.04 132.096 L
160.205 104.381 L
169.37 78.699 L
178.535 72.734 L
187.7 72.676 L
196.865 72.251 L
206.03 70.059 L
215.195 68.576 L
224.36 68.261 L
233.525 67.576 L
242.69 65.415 L
251.855 61.337 L
261.02 60.02 L
270.185 63.555 L
279.35 68.628 L
288.515 74.376 L
297.68 79.732 L
306.845 84.909 L
316.01 108.938 L
325.175 118.878 L
334.34 112.95 L
343.505 92.831 L
352.67 80.527 L
361.835 75.783 L
371 74.961 L
371.036 74.966 L
S
GR
GS
[0.99902 0 0 1.00077 0 -0.19998] CT
0.9 0.799 0.799 RC
N
123.545 121.027 M
114.38 89.363 L
105.215 88.015 L
96.05 87.482 L
86.885 87.292 L
77.72 89.519 L
68.555 93.032 L
65.464 94.05 L
65.464 98.637 L
65.464 101.065 L
68.555 99.954 L
77.72 95.709 L
86.885 93.359 L
96.05 93.376 L
105.215 94.159 L
114.38 95.153 L
123.545 126.346 L
132.71 169.341 L
141.875 169.638 L
151.04 136.14 L
160.205 109.895 L
169.37 83.626 L
178.535 77.441 L
187.7 76.358 L
196.865 75.818 L
206.03 74.016 L
215.195 71.356 L
224.36 68.386 L
233.525 64.396 L
242.69 62.671 L
251.855 60.248 L
261.02 59.634 L
270.185 61.847 L
279.35 65.519 L
288.515 74.631 L
297.68 80.592 L
306.845 88.718 L
316.01 111.778 L
325.175 120.653 L
334.34 115.04 L
343.505 92.853 L
352.67 80.435 L
361.835 76.064 L
371 75.112 L
371.036 75.108 L
371.036 68.199 L
371.036 68.173 L
371 68.175 L
361.835 68.969 L
352.67 73.508 L
343.505 85.818 L
334.34 108.6 L
325.175 114.53 L
316.01 105.737 L
306.845 82.624 L
297.68 74.063 L
288.515 67.546 L
279.35 58.442 L
270.185 54.546 L
261.02 53.089 L
251.855 53.847 L
242.69 55.75 L
233.525 57.336 L
224.36 61.526 L
215.195 64.957 L
206.03 67.668 L
196.865 69.508 L
187.7 70.288 L
178.535 71.655 L
169.37 77.851 L
160.205 104.216 L
151.04 130.659 L
141.875 164.448 L
132.71 164.309 L
cp
f
GR
GS
[0.99902 0 0 1.00077 0 -0.19998] CT
0.82 0.639 0.639 RC
1 LJ
0.5 LW
N
65.464 101.065 M
68.555 99.954 L
77.72 95.709 L
86.885 93.359 L
96.05 93.376 L
105.215 94.159 L
114.38 95.153 L
123.545 126.346 L
132.71 169.341 L
141.875 169.638 L
151.04 136.14 L
160.205 109.895 L
169.37 83.626 L
178.535 77.441 L
187.7 76.358 L
196.865 75.818 L
206.03 74.016 L
215.195 71.356 L
224.36 68.386 L
233.525 64.396 L
242.69 62.671 L
251.855 60.248 L
261.02 59.634 L
270.185 61.847 L
279.35 65.519 L
288.515 74.631 L
297.68 80.592 L
306.845 88.718 L
316.01 111.778 L
325.175 120.653 L
334.34 115.04 L
343.505 92.853 L
352.67 80.435 L
361.835 76.064 L
371 75.112 L
371.036 75.108 L
S
GR
GS
[0.99902 0 0 1.00077 0 -0.19998] CT
0.82 0.639 0.639 RC
1 LJ
0.5 LW
N
65.464 94.05 M
68.555 93.032 L
77.72 89.519 L
86.885 87.292 L
96.05 87.482 L
105.215 88.015 L
114.38 89.363 L
123.545 121.027 L
132.71 164.309 L
141.875 164.448 L
151.04 130.659 L
160.205 104.216 L
169.37 77.851 L
178.535 71.655 L
187.7 70.288 L
196.865 69.508 L
206.03 67.668 L
215.195 64.957 L
224.36 61.526 L
233.525 57.336 L
242.69 55.75 L
251.855 53.847 L
261.02 53.089 L
270.185 54.546 L
279.35 58.442 L
288.515 67.546 L
297.68 74.063 L
306.845 82.624 L
316.01 105.737 L
325.175 114.53 L
334.34 108.6 L
343.505 85.818 L
352.67 73.508 L
361.835 68.969 L
371 68.175 L
371.036 68.173 L
S
GR
GS
[0.99902 0 0 1.00077 0 -0.19998] CT
0.6 0.2 0.2 RC
1 LJ
2 LW
N
65.464 97.557 M
68.555 96.493 L
77.72 92.614 L
86.885 90.326 L
96.05 90.429 L
105.215 91.087 L
114.38 92.258 L
123.545 123.686 L
132.71 166.825 L
141.875 167.043 L
151.04 133.399 L
160.205 107.056 L
169.37 80.738 L
178.535 74.548 L
187.7 73.323 L
196.865 72.663 L
206.03 70.842 L
215.195 68.157 L
224.36 64.956 L
233.525 60.866 L
242.69 59.21 L
251.855 57.048 L
261.02 56.361 L
270.185 58.197 L
279.35 61.98 L
288.515 71.088 L
297.68 77.327 L
306.845 85.671 L
316.01 108.758 L
325.175 117.592 L
334.34 111.82 L
343.505 89.335 L
352.67 76.972 L
361.835 72.516 L
371 71.644 L
371.036 71.641 L
S
GR
GS
[0.99902 0 0 1.00077 0 -0.19998] CT
1 LJ
5 LW
N
316.01 173.679 M
325.175 173.679 L
334.34 173.679 L
343.505 173.679 L
352.67 173.679 L
361.835 173.679 L
371 173.679 L
371.036 173.679 L
S
GR
GS
[0.99902 0 0 1.00077 202.80195 135.40464] CT
/Helvetica 15 F
GS
[1 0 0 1 0 0] CT
0 5.5 moveto 
1 -1 scale
(1 Target) t 
GR
GR
GS
[0.99902 0 0 1.00077 0 -0.19998] CT
0.898 0.6 0.6 RC
1 LJ
2 LW
N
170 135.5 M
200 135.5 L
S
GR
GS
[0.99902 0 0 1.00077 202.80195 153.91893] CT
/Helvetica 15 F
GS
[1 0 0 1 0 0] CT
0 5.5 moveto 
1 -1 scale
(2 Targets) t 
GR
GR
GS
[0.99902 0 0 1.00077 0 -0.19998] CT
1 0.502 0.502 RC
1 LJ
2 LW
N
170 154 M
200 154 L
S
GR
GS
[0.99902 0 0 1.00077 202.80195 172.43321] CT
/Helvetica 15 F
GS
[1 0 0 1 0 0] CT
0 5.5 moveto 
1 -1 scale
(3 Targets) t 
GR
GR
GS
[0.99902 0 0 1.00077 0 -0.19998] CT
0.898 0.302 0.302 RC
1 LJ
2 LW
N
170 172.5 M
200 172.5 L
S
GR
GS
[0.99902 0 0 1.00077 202.80195 190.9475] CT
/Helvetica 15 F
GS
[1 0 0 1 0 0] CT
0 5.5 moveto 
1 -1 scale
(4 Targets) t 
GR
GR
GS
[0.99902 0 0 1.00077 0 -0.19998] CT
0.6 0.2 0.2 RC
1 LJ
2 LW
N
170 191 M
200 191 L
S
GR
%%Trailer
%%Pages: 1
%%EOF
