%!PS-Adobe-3.0 EPSF-3.0
%%Creator: (MATLAB, The Mathworks, Inc. Version 9.8.0.1323502 \(R2020a\). Operating System: Mac OS X)
%%Title: /Users/kosciessa/Desktop/tardis/LNDG/stateswitch/stsw_eeg_task/mse/figures/e02_EntropyTraces_oa.eps
%%CreationDate: 2022-02-18T14:16:22
%%Pages: (atend)
%%BoundingBox:     4     0   375   243
%%LanguageLevel: 3
%%EndComments
%%BeginProlog
%%BeginResource: procset (Apache XML Graphics Std ProcSet) 1.2 0
%%Version: 1.2 0
%%Copyright: (Copyright 2001-2003,2010 The Apache Software Foundation. License terms: http://www.apache.org/licenses/LICENSE-2.0)
/bd{bind def}bind def
/ld{load def}bd
/GR/grestore ld
/GS/gsave ld
/RM/rmoveto ld
/C/curveto ld
/t/show ld
/L/lineto ld
/ML/setmiterlimit ld
/CT/concat ld
/f/fill ld
/N/newpath ld
/S/stroke ld
/CC/setcmykcolor ld
/A/ashow ld
/cp/closepath ld
/RC/setrgbcolor ld
/LJ/setlinejoin ld
/GC/setgray ld
/LW/setlinewidth ld
/M/moveto ld
/re {4 2 roll M
1 index 0 rlineto
0 exch rlineto
neg 0 rlineto
cp } bd
/_ctm matrix def
/_tm matrix def
/BT { _ctm currentmatrix pop matrix _tm copy pop 0 0 moveto } bd
/ET { _ctm setmatrix } bd
/iTm { _ctm setmatrix _tm concat } bd
/Tm { _tm astore pop iTm 0 0 moveto } bd
/ux 0.0 def
/uy 0.0 def
/F {
  /Tp exch def
  /Tf exch def
  Tf findfont Tp scalefont setfont
  /cf Tf def  /cs Tp def
} bd
/ULS {currentpoint /uy exch def /ux exch def} bd
/ULE {
  /Tcx currentpoint pop def
  gsave
  newpath
  cf findfont cs scalefont dup
  /FontMatrix get 0 get /Ts exch def /FontInfo get dup
  /UnderlinePosition get Ts mul /To exch def
  /UnderlineThickness get Ts mul /Tt exch def
  ux uy To add moveto  Tcx uy To add lineto
  Tt setlinewidth stroke
  grestore
} bd
/OLE {
  /Tcx currentpoint pop def
  gsave
  newpath
  cf findfont cs scalefont dup
  /FontMatrix get 0 get /Ts exch def /FontInfo get dup
  /UnderlinePosition get Ts mul /To exch def
  /UnderlineThickness get Ts mul /Tt exch def
  ux uy To add cs add moveto Tcx uy To add cs add lineto
  Tt setlinewidth stroke
  grestore
} bd
/SOE {
  /Tcx currentpoint pop def
  gsave
  newpath
  cf findfont cs scalefont dup
  /FontMatrix get 0 get /Ts exch def /FontInfo get dup
  /UnderlinePosition get Ts mul /To exch def
  /UnderlineThickness get Ts mul /Tt exch def
  ux uy To add cs 10 mul 26 idiv add moveto Tcx uy To add cs 10 mul 26 idiv add lineto
  Tt setlinewidth stroke
  grestore
} bd
/QT {
/Y22 exch store
/X22 exch store
/Y21 exch store
/X21 exch store
currentpoint
/Y21 load 2 mul add 3 div exch
/X21 load 2 mul add 3 div exch
/X21 load 2 mul /X22 load add 3 div
/Y21 load 2 mul /Y22 load add 3 div
/X22 load /Y22 load curveto
} bd
/SSPD {
dup length /d exch dict def
{
/v exch def
/k exch def
currentpagedevice k known {
/cpdv currentpagedevice k get def
v cpdv ne {
/upd false def
/nullv v type /nulltype eq def
/nullcpdv cpdv type /nulltype eq def
nullv nullcpdv or
{
/upd true def
} {
/sametype v type cpdv type eq def
sametype {
v type /arraytype eq {
/vlen v length def
/cpdvlen cpdv length def
vlen cpdvlen eq {
0 1 vlen 1 sub {
/i exch def
/obj v i get def
/cpdobj cpdv i get def
obj cpdobj ne {
/upd true def
exit
} if
} for
} {
/upd true def
} ifelse
} {
v type /dicttype eq {
v {
/dv exch def
/dk exch def
/cpddv cpdv dk get def
dv cpddv ne {
/upd true def
exit
} if
} forall
} {
/upd true def
} ifelse
} ifelse
} if
} ifelse
upd true eq {
d k v put
} if
} if
} if
} forall
d length 0 gt {
d setpagedevice
} if
} bd
/RE { % /NewFontName [NewEncodingArray] /FontName RE -
  findfont dup length dict begin
  {
    1 index /FID ne
    {def} {pop pop} ifelse
  } forall
  /Encoding exch def
  /FontName 1 index def
  currentdict definefont pop
  end
} bind def
%%EndResource
%%BeginResource: procset (Apache XML Graphics EPS ProcSet) 1.0 0
%%Version: 1.0 0
%%Copyright: (Copyright 2002-2003 The Apache Software Foundation. License terms: http://www.apache.org/licenses/LICENSE-2.0)
/BeginEPSF { %def
/b4_Inc_state save def         % Save state for cleanup
/dict_count countdictstack def % Count objects on dict stack
/op_count count 1 sub def      % Count objects on operand stack
userdict begin                 % Push userdict on dict stack
/showpage { } def              % Redefine showpage, { } = null proc
0 setgray 0 setlinecap         % Prepare graphics state
1 setlinewidth 0 setlinejoin
10 setmiterlimit [ ] 0 setdash newpath
/languagelevel where           % If level not equal to 1 then
{pop languagelevel             % set strokeadjust and
1 ne                           % overprint to their defaults.
{false setstrokeadjust false setoverprint
} if
} if
} bd
/EndEPSF { %def
count op_count sub {pop} repeat            % Clean up stacks
countdictstack dict_count sub {end} repeat
b4_Inc_state restore
} bd
%%EndResource
%FOPBeginFontDict
%%IncludeResource: font Courier-Oblique
%%IncludeResource: font Courier-BoldOblique
%%IncludeResource: font Courier-Bold
%%IncludeResource: font ZapfDingbats
%%IncludeResource: font Symbol
%%IncludeResource: font Helvetica
%%IncludeResource: font Helvetica-Oblique
%%IncludeResource: font Helvetica-Bold
%%IncludeResource: font Helvetica-BoldOblique
%%IncludeResource: font Times-Roman
%%IncludeResource: font Times-Italic
%%IncludeResource: font Times-Bold
%%IncludeResource: font Times-BoldItalic
%%IncludeResource: font Courier
%FOPEndFontDict
%%BeginResource: encoding WinAnsiEncoding
/WinAnsiEncoding [
/.notdef /.notdef /.notdef /.notdef /.notdef
/.notdef /.notdef /.notdef /.notdef /.notdef
/.notdef /.notdef /.notdef /.notdef /.notdef
/.notdef /.notdef /.notdef /.notdef /.notdef
/.notdef /.notdef /.notdef /.notdef /.notdef
/.notdef /.notdef /.notdef /.notdef /.notdef
/.notdef /.notdef /space /exclam /quotedbl
/numbersign /dollar /percent /ampersand /quotesingle
/parenleft /parenright /asterisk /plus /comma
/hyphen /period /slash /zero /one
/two /three /four /five /six
/seven /eight /nine /colon /semicolon
/less /equal /greater /question /at
/A /B /C /D /E
/F /G /H /I /J
/K /L /M /N /O
/P /Q /R /S /T
/U /V /W /X /Y
/Z /bracketleft /backslash /bracketright /asciicircum
/underscore /quoteleft /a /b /c
/d /e /f /g /h
/i /j /k /l /m
/n /o /p /q /r
/s /t /u /v /w
/x /y /z /braceleft /bar
/braceright /asciitilde /bullet /Euro /bullet
/quotesinglbase /florin /quotedblbase /ellipsis /dagger
/daggerdbl /circumflex /perthousand /Scaron /guilsinglleft
/OE /bullet /Zcaron /bullet /bullet
/quoteleft /quoteright /quotedblleft /quotedblright /bullet
/endash /emdash /asciitilde /trademark /scaron
/guilsinglright /oe /bullet /zcaron /Ydieresis
/space /exclamdown /cent /sterling /currency
/yen /brokenbar /section /dieresis /copyright
/ordfeminine /guillemotleft /logicalnot /sfthyphen /registered
/macron /degree /plusminus /twosuperior /threesuperior
/acute /mu /paragraph /middot /cedilla
/onesuperior /ordmasculine /guillemotright /onequarter /onehalf
/threequarters /questiondown /Agrave /Aacute /Acircumflex
/Atilde /Adieresis /Aring /AE /Ccedilla
/Egrave /Eacute /Ecircumflex /Edieresis /Igrave
/Iacute /Icircumflex /Idieresis /Eth /Ntilde
/Ograve /Oacute /Ocircumflex /Otilde /Odieresis
/multiply /Oslash /Ugrave /Uacute /Ucircumflex
/Udieresis /Yacute /Thorn /germandbls /agrave
/aacute /acircumflex /atilde /adieresis /aring
/ae /ccedilla /egrave /eacute /ecircumflex
/edieresis /igrave /iacute /icircumflex /idieresis
/eth /ntilde /ograve /oacute /ocircumflex
/otilde /odieresis /divide /oslash /ugrave
/uacute /ucircumflex /udieresis /yacute /thorn
/ydieresis
] def
%%EndResource
%FOPBeginFontReencode
/Courier-Oblique findfont
dup length dict begin
  {1 index /FID ne {def} {pop pop} ifelse} forall
  /Encoding WinAnsiEncoding def
  currentdict
end
/Courier-Oblique exch definefont pop
/Courier-BoldOblique findfont
dup length dict begin
  {1 index /FID ne {def} {pop pop} ifelse} forall
  /Encoding WinAnsiEncoding def
  currentdict
end
/Courier-BoldOblique exch definefont pop
/Courier-Bold findfont
dup length dict begin
  {1 index /FID ne {def} {pop pop} ifelse} forall
  /Encoding WinAnsiEncoding def
  currentdict
end
/Courier-Bold exch definefont pop
/Helvetica findfont
dup length dict begin
  {1 index /FID ne {def} {pop pop} ifelse} forall
  /Encoding WinAnsiEncoding def
  currentdict
end
/Helvetica exch definefont pop
/Helvetica-Oblique findfont
dup length dict begin
  {1 index /FID ne {def} {pop pop} ifelse} forall
  /Encoding WinAnsiEncoding def
  currentdict
end
/Helvetica-Oblique exch definefont pop
/Helvetica-Bold findfont
dup length dict begin
  {1 index /FID ne {def} {pop pop} ifelse} forall
  /Encoding WinAnsiEncoding def
  currentdict
end
/Helvetica-Bold exch definefont pop
/Helvetica-BoldOblique findfont
dup length dict begin
  {1 index /FID ne {def} {pop pop} ifelse} forall
  /Encoding WinAnsiEncoding def
  currentdict
end
/Helvetica-BoldOblique exch definefont pop
/Times-Roman findfont
dup length dict begin
  {1 index /FID ne {def} {pop pop} ifelse} forall
  /Encoding WinAnsiEncoding def
  currentdict
end
/Times-Roman exch definefont pop
/Times-Italic findfont
dup length dict begin
  {1 index /FID ne {def} {pop pop} ifelse} forall
  /Encoding WinAnsiEncoding def
  currentdict
end
/Times-Italic exch definefont pop
/Times-Bold findfont
dup length dict begin
  {1 index /FID ne {def} {pop pop} ifelse} forall
  /Encoding WinAnsiEncoding def
  currentdict
end
/Times-Bold exch definefont pop
/Times-BoldItalic findfont
dup length dict begin
  {1 index /FID ne {def} {pop pop} ifelse} forall
  /Encoding WinAnsiEncoding def
  currentdict
end
/Times-BoldItalic exch definefont pop
/Courier findfont
dup length dict begin
  {1 index /FID ne {def} {pop pop} ifelse} forall
  /Encoding WinAnsiEncoding def
  currentdict
end
/Courier exch definefont pop
%FOPEndFontReencode
%%EndProlog
%%Page: 1 1
%%PageBoundingBox: 0 0 410 259
%%BeginPageSetup
[1 0 0 -1 0 259] CT
%%EndPageSetup
GS
[0.99902 0 0 1.00077 0 -0.19998] CT
1 GC
N
0 0 410 259 re
f
GR
GS
[0.99902 0 0 1.00077 0 -0.19998] CT
1 GC
N
0 0 410 259 re
f
GR
GS
[0.99902 0 0 1.00077 0 -0.19998] CT
1 GC
N
65.5 209.5 M
371 209.5 L
371 19.5 L
65.5 19.5 L
cp
f
GR
GS
[0.99902 0 0 1.00077 0 -0.19998] CT
0.149 GC
2 setlinecap
1 LJ
0.5 LW
N
65.5 209.5 M
371 209.5 L
S
GR
GS
[0.99902 0 0 1.00077 0 -0.19998] CT
0.149 GC
2 setlinecap
1 LJ
0.5 LW
N
65.5 209.5 M
65.5 206.446 L
S
GR
GS
[0.99902 0 0 1.00077 0 -0.19998] CT
0.149 GC
2 setlinecap
1 LJ
0.5 LW
N
126.6 209.5 M
126.6 206.446 L
S
GR
GS
[0.99902 0 0 1.00077 0 -0.19998] CT
0.149 GC
2 setlinecap
1 LJ
0.5 LW
N
187.7 209.5 M
187.7 206.446 L
S
GR
GS
[0.99902 0 0 1.00077 0 -0.19998] CT
0.149 GC
2 setlinecap
1 LJ
0.5 LW
N
248.8 209.5 M
248.8 206.446 L
S
GR
GS
[0.99902 0 0 1.00077 0 -0.19998] CT
0.149 GC
2 setlinecap
1 LJ
0.5 LW
N
309.9 209.5 M
309.9 206.446 L
S
GR
GS
[0.99902 0 0 1.00077 0 -0.19998] CT
0.149 GC
2 setlinecap
1 LJ
0.5 LW
N
371 209.5 M
371 206.446 L
S
GR
GS
[0.99902 0 0 1.00077 65.4361 215.06609] CT
0.149 GC
/Helvetica 18 F
GS
[1 0 0 1 0 0] CT
-9 18 moveto 
1 -1 scale
(-1) t 
GR
GR
GS
[0.99902 0 0 1.00077 126.47649 215.06609] CT
0.149 GC
/Helvetica 18 F
GS
[1 0 0 1 0 0] CT
-5.5 18 moveto 
1 -1 scale
(0) t 
GR
GR
GS
[0.99902 0 0 1.00077 187.51688 215.06609] CT
0.149 GC
/Helvetica 18 F
GS
[1 0 0 1 0 0] CT
-5.5 18 moveto 
1 -1 scale
(1) t 
GR
GR
GS
[0.99902 0 0 1.00077 248.55728 215.06609] CT
0.149 GC
/Helvetica 18 F
GS
[1 0 0 1 0 0] CT
-5.5 18 moveto 
1 -1 scale
(2) t 
GR
GR
GS
[0.99902 0 0 1.00077 309.59766 215.06609] CT
0.149 GC
/Helvetica 18 F
GS
[1 0 0 1 0 0] CT
-5.5 18 moveto 
1 -1 scale
(3) t 
GR
GR
GS
[0.99902 0 0 1.00077 370.63805 215.06609] CT
0.149 GC
/Helvetica 18 F
GS
[1 0 0 1 0 0] CT
-5.5 18 moveto 
1 -1 scale
(4) t 
GR
GR
GS
[0.99902 0 0 1.00077 218.03723 237.48338] CT
0.149 GC
/Helvetica 18 F
GS
[1 0 0 1 0 0] CT
-113.5 18 moveto 
1 -1 scale
(Time \(s from stimulus onset\)) t 
GR
GR
GS
[0.99902 0 0 1.00077 0 -0.19998] CT
0.149 GC
2 setlinecap
1 LJ
0.5 LW
N
65.5 209.5 M
65.5 19.5 L
S
GR
GS
[0.99902 0 0 1.00077 0 -0.19998] CT
0.149 GC
2 setlinecap
1 LJ
0.5 LW
N
65.5 178.314 M
68.554 178.314 L
S
GR
GS
[0.99902 0 0 1.00077 0 -0.19998] CT
0.149 GC
2 setlinecap
1 LJ
0.5 LW
N
65.5 100.394 M
68.554 100.394 L
S
GR
GS
[0.99902 0 0 1.00077 0 -0.19998] CT
0.149 GC
2 setlinecap
1 LJ
0.5 LW
N
65.5 22.474 M
68.554 22.474 L
S
GR
GS
[0.99902 0 0 1.00077 59.84156 178.25195] CT
0.149 GC
/Helvetica 18 F
GS
[1 0 0 1 0 0] CT
-36 7 moveto 
1 -1 scale
(0.45) t 
GR
GR
GS
[0.99902 0 0 1.00077 59.84156 100.27147] CT
0.149 GC
/Helvetica 18 F
GS
[1 0 0 1 0 0] CT
-26 7 moveto 
1 -1 scale
(0.5) t 
GR
GR
GS
[0.99902 0 0 1.00077 59.84156 22.29098] CT
0.149 GC
/Helvetica 18 F
GS
[1 0 0 1 0 0] CT
-36 7 moveto 
1 -1 scale
(0.55) t 
GR
GR
GS
[0 -1.00077 0.99902 0 21.47902 114.38832] CT
0.149 GC
/Helvetica 18 F
GS
[1 0 0 1 0 0] CT
-64 -4 moveto 
1 -1 scale
(Sample entropy) t 
GR
GR
GS
[0.99902 0 0 1.00077 0 -0.19998] CT
0.974 0.9 0.9 RC
N
141.875 180.245 M
132.71 190.249 L
123.545 128.57 L
114.38 62.819 L
105.215 55.998 L
96.05 49.579 L
86.885 45.439 L
77.72 46.223 L
68.555 47.85 L
65.464 49.255 L
65.464 55.585 L
65.464 59.604 L
68.555 57.402 L
77.72 54.632 L
86.885 54.004 L
96.05 59.598 L
105.215 68.435 L
114.38 75.897 L
123.545 139.518 L
132.71 198.322 L
141.875 188.042 L
151.04 136.23 L
160.205 93.497 L
169.37 69.466 L
178.535 64.317 L
187.7 62.288 L
196.865 62.864 L
206.03 61.94 L
215.195 61.811 L
224.36 60.612 L
233.525 57.628 L
242.69 54.759 L
251.855 51.828 L
261.02 51.283 L
270.185 56.354 L
279.35 62.417 L
288.515 69.202 L
297.68 77.247 L
306.845 81.003 L
316.01 116.812 L
325.175 130.163 L
334.34 123.41 L
343.505 102.265 L
352.67 86.422 L
361.835 73.012 L
371 70.351 L
371.036 70.349 L
371.036 58.218 L
371.036 58.173 L
371 58.171 L
361.835 60.303 L
352.67 73.54 L
343.505 89.074 L
334.34 111.327 L
325.175 119.331 L
316.01 106.26 L
306.845 70.229 L
297.68 66.155 L
288.515 58.469 L
279.35 53.297 L
270.185 47.523 L
261.02 43.566 L
251.855 42.293 L
242.69 42.934 L
233.525 44.607 L
224.36 47.81 L
215.195 50.102 L
206.03 50.896 L
196.865 52.529 L
187.7 51.898 L
178.535 53.521 L
169.37 58.649 L
160.205 82.833 L
151.04 127.113 L
cp
f
GR
GS
[0.99902 0 0 1.00077 0 -0.19998] CT
0.957 0.82 0.82 RC
1 LJ
0.5 LW
N
65.464 59.604 M
68.555 57.402 L
77.72 54.632 L
86.885 54.004 L
96.05 59.598 L
105.215 68.435 L
114.38 75.897 L
123.545 139.518 L
132.71 198.322 L
141.875 188.042 L
151.04 136.23 L
160.205 93.497 L
169.37 69.466 L
178.535 64.317 L
187.7 62.288 L
196.865 62.864 L
206.03 61.94 L
215.195 61.811 L
224.36 60.612 L
233.525 57.628 L
242.69 54.759 L
251.855 51.828 L
261.02 51.283 L
270.185 56.354 L
279.35 62.417 L
288.515 69.202 L
297.68 77.247 L
306.845 81.003 L
316.01 116.812 L
325.175 130.163 L
334.34 123.41 L
343.505 102.265 L
352.67 86.422 L
361.835 73.012 L
371 70.351 L
371.036 70.349 L
S
GR
GS
[0.99902 0 0 1.00077 0 -0.19998] CT
0.957 0.82 0.82 RC
1 LJ
0.5 LW
N
65.464 49.255 M
68.555 47.85 L
77.72 46.223 L
86.885 45.439 L
96.05 49.579 L
105.215 55.998 L
114.38 62.819 L
123.545 128.57 L
132.71 190.249 L
141.875 180.245 L
151.04 127.113 L
160.205 82.833 L
169.37 58.649 L
178.535 53.521 L
187.7 51.898 L
196.865 52.529 L
206.03 50.896 L
215.195 50.102 L
224.36 47.81 L
233.525 44.607 L
242.69 42.934 L
251.855 42.293 L
261.02 43.566 L
270.185 47.523 L
279.35 53.297 L
288.515 58.469 L
297.68 66.155 L
306.845 70.229 L
316.01 106.26 L
325.175 119.331 L
334.34 111.327 L
343.505 89.074 L
352.67 73.54 L
361.835 60.303 L
371 58.171 L
371.036 58.173 L
S
GR
GS
[0.99902 0 0 1.00077 0 -0.19998] CT
0.898 0.6 0.6 RC
1 LJ
2 LW
N
65.464 54.43 M
68.555 52.626 L
77.72 50.427 L
86.885 49.721 L
96.05 54.588 L
105.215 62.216 L
114.38 69.358 L
123.545 134.044 L
132.71 194.285 L
141.875 184.144 L
151.04 131.672 L
160.205 88.165 L
169.37 64.058 L
178.535 58.919 L
187.7 57.093 L
196.865 57.697 L
206.03 56.418 L
215.195 55.956 L
224.36 54.211 L
233.525 51.117 L
242.69 48.847 L
251.855 47.061 L
261.02 47.424 L
270.185 51.938 L
279.35 57.857 L
288.515 63.836 L
297.68 71.701 L
306.845 75.616 L
316.01 111.536 L
325.175 124.747 L
334.34 117.368 L
343.505 95.67 L
352.67 79.981 L
361.835 66.657 L
371 64.261 L
371.036 64.261 L
S
GR
GS
[0.99902 0 0 1.00077 0 -0.19998] CT
1 0.875 0.875 RC
N
123.545 119.456 M
114.38 57.964 L
105.215 55.653 L
96.05 53.777 L
86.885 53.431 L
77.72 50.899 L
68.555 53.595 L
65.464 54.754 L
65.464 62.369 L
65.464 66.607 L
68.555 65.086 L
77.72 61.957 L
86.885 63.866 L
96.05 63.886 L
105.215 65.213 L
114.38 68.305 L
123.545 129.72 L
132.71 186.251 L
141.875 182.976 L
151.04 143.271 L
160.205 110.036 L
169.37 80.471 L
178.535 71.7 L
187.7 71.474 L
196.865 73.171 L
206.03 71.78 L
215.195 65.954 L
224.36 62.922 L
233.525 61.068 L
242.69 56.513 L
251.855 56.377 L
261.02 54.799 L
270.185 55.203 L
279.35 61.307 L
288.515 68.813 L
297.68 81.098 L
306.845 88.81 L
316.01 119.138 L
325.175 125.71 L
334.34 114.624 L
343.505 92.862 L
352.67 78.5 L
361.835 71.629 L
371 72.379 L
371.036 72.375 L
371.036 72.298 L
371.036 51.181 L
371 51.177 L
361.835 49.621 L
352.67 57.607 L
343.505 73.221 L
334.34 96.458 L
325.175 108.604 L
316.01 101.712 L
306.845 72.242 L
297.68 65.618 L
288.515 54.674 L
279.35 48.647 L
270.185 44.152 L
261.02 45.179 L
251.855 46.783 L
242.69 45.719 L
233.525 49.452 L
224.36 51.383 L
215.195 55.244 L
206.03 61.415 L
196.865 62.494 L
187.7 61.045 L
178.535 61.072 L
169.37 68.459 L
160.205 97.158 L
151.04 132.581 L
141.875 174.018 L
132.71 176.596 L
cp
f
GR
GS
[0.99902 0 0 1.00077 0 -0.19998] CT
1 0.776 0.776 RC
1 LJ
0.5 LW
N
65.464 66.607 M
68.555 65.086 L
77.72 61.957 L
86.885 63.866 L
96.05 63.886 L
105.215 65.213 L
114.38 68.305 L
123.545 129.72 L
132.71 186.251 L
141.875 182.976 L
151.04 143.271 L
160.205 110.036 L
169.37 80.471 L
178.535 71.7 L
187.7 71.474 L
196.865 73.171 L
206.03 71.78 L
215.195 65.954 L
224.36 62.922 L
233.525 61.068 L
242.69 56.513 L
251.855 56.377 L
261.02 54.799 L
270.185 55.203 L
279.35 61.307 L
288.515 68.813 L
297.68 81.098 L
306.845 88.81 L
316.01 119.138 L
325.175 125.71 L
334.34 114.624 L
343.505 92.862 L
352.67 78.5 L
361.835 71.629 L
371 72.379 L
371.036 72.375 L
S
GR
GS
[0.99902 0 0 1.00077 0 -0.19998] CT
1 0.776 0.776 RC
1 LJ
0.5 LW
N
65.464 54.754 M
68.555 53.595 L
77.72 50.899 L
86.885 53.431 L
96.05 53.777 L
105.215 55.653 L
114.38 57.964 L
123.545 119.456 L
132.71 176.596 L
141.875 174.018 L
151.04 132.581 L
160.205 97.158 L
169.37 68.459 L
178.535 61.072 L
187.7 61.045 L
196.865 62.494 L
206.03 61.415 L
215.195 55.244 L
224.36 51.383 L
233.525 49.452 L
242.69 45.719 L
251.855 46.783 L
261.02 45.179 L
270.185 44.152 L
279.35 48.647 L
288.515 54.674 L
297.68 65.618 L
306.845 72.242 L
316.01 101.712 L
325.175 108.604 L
334.34 96.458 L
343.505 73.221 L
352.67 57.607 L
361.835 49.621 L
371 51.177 L
371.036 51.181 L
S
GR
GS
[0.99902 0 0 1.00077 0 -0.19998] CT
1 0.502 0.502 RC
1 LJ
2 LW
N
65.464 60.681 M
68.555 59.34 L
77.72 56.428 L
86.885 58.649 L
96.05 58.832 L
105.215 60.432 L
114.38 63.135 L
123.545 124.588 L
132.71 181.423 L
141.875 178.497 L
151.04 137.926 L
160.205 103.597 L
169.37 74.465 L
178.535 66.386 L
187.7 66.259 L
196.865 67.833 L
206.03 66.598 L
215.195 60.599 L
224.36 57.152 L
233.525 55.26 L
242.69 51.116 L
251.855 51.58 L
261.02 49.989 L
270.185 49.678 L
279.35 54.978 L
288.515 61.743 L
297.68 73.358 L
306.845 80.526 L
316.01 110.425 L
325.175 117.157 L
334.34 105.541 L
343.505 83.041 L
352.67 68.053 L
361.835 60.625 L
371 61.778 L
371.036 61.778 L
S
GR
GS
[0.99902 0 0 1.00077 0 -0.19998] CT
0.974 0.825 0.825 RC
N
123.545 122.261 M
114.38 66.508 L
105.215 62.501 L
96.05 59.989 L
86.885 60.478 L
77.72 61.243 L
68.555 64.809 L
65.464 65.464 L
65.464 72.46 L
65.464 75.955 L
68.555 75.366 L
77.72 71.715 L
86.885 70.435 L
96.05 68.876 L
105.215 70.898 L
114.38 76.483 L
123.545 132.264 L
132.71 187.79 L
141.875 183.441 L
151.04 137.92 L
160.205 98.954 L
169.37 66.22 L
178.535 56.757 L
187.7 57.088 L
196.865 57.468 L
206.03 56.556 L
215.195 57.384 L
224.36 57.161 L
233.525 57.747 L
242.69 56.689 L
251.855 53.299 L
261.02 51.033 L
270.185 53.277 L
279.35 53.656 L
288.515 55.302 L
297.68 59.827 L
306.845 64.057 L
316.01 96.092 L
325.175 106.632 L
334.34 102.49 L
343.505 78.287 L
352.67 59.025 L
361.835 46.123 L
371 41.755 L
371.036 41.756 L
371.036 41.723 L
371.036 32.689 L
371 32.685 L
361.835 35.073 L
352.67 47.783 L
343.505 67.105 L
334.34 91.786 L
325.175 96.857 L
316.01 86.648 L
306.845 53.748 L
297.68 50.006 L
288.515 45.383 L
279.35 43.517 L
270.185 43.381 L
261.02 41.694 L
251.855 43.568 L
242.69 46.526 L
233.525 47.987 L
224.36 48.823 L
215.195 49.484 L
206.03 47.272 L
196.865 47.129 L
187.7 47.221 L
178.535 47.257 L
169.37 56.08 L
160.205 89.63 L
151.04 128.829 L
141.875 174.553 L
132.71 178.07 L
cp
f
GR
GS
[0.99902 0 0 1.00077 0 -0.19998] CT
0.957 0.686 0.686 RC
1 LJ
0.5 LW
N
65.464 75.955 M
68.555 75.366 L
77.72 71.715 L
86.885 70.435 L
96.05 68.876 L
105.215 70.898 L
114.38 76.483 L
123.545 132.264 L
132.71 187.79 L
141.875 183.441 L
151.04 137.92 L
160.205 98.954 L
169.37 66.22 L
178.535 56.757 L
187.7 57.088 L
196.865 57.468 L
206.03 56.556 L
215.195 57.384 L
224.36 57.161 L
233.525 57.747 L
242.69 56.689 L
251.855 53.299 L
261.02 51.033 L
270.185 53.277 L
279.35 53.656 L
288.515 55.302 L
297.68 59.827 L
306.845 64.057 L
316.01 96.092 L
325.175 106.632 L
334.34 102.49 L
343.505 78.287 L
352.67 59.025 L
361.835 46.123 L
371 41.755 L
371.036 41.756 L
S
GR
GS
[0.99902 0 0 1.00077 0 -0.19998] CT
0.957 0.686 0.686 RC
1 LJ
0.5 LW
N
65.464 65.464 M
68.555 64.809 L
77.72 61.243 L
86.885 60.478 L
96.05 59.989 L
105.215 62.501 L
114.38 66.508 L
123.545 122.261 L
132.71 178.07 L
141.875 174.553 L
151.04 128.829 L
160.205 89.63 L
169.37 56.08 L
178.535 47.257 L
187.7 47.221 L
196.865 47.129 L
206.03 47.272 L
215.195 49.484 L
224.36 48.823 L
233.525 47.987 L
242.69 46.526 L
251.855 43.568 L
261.02 41.694 L
270.185 43.381 L
279.35 43.517 L
288.515 45.383 L
297.68 50.006 L
306.845 53.748 L
316.01 86.648 L
325.175 96.857 L
334.34 91.786 L
343.505 67.105 L
352.67 47.783 L
361.835 35.073 L
371 32.685 L
371.036 32.689 L
S
GR
GS
[0.99902 0 0 1.00077 0 -0.19998] CT
0.898 0.302 0.302 RC
1 LJ
2 LW
N
65.464 70.709 M
68.555 70.088 L
77.72 66.479 L
86.885 65.456 L
96.05 64.433 L
105.215 66.7 L
114.38 71.496 L
123.545 127.263 L
132.71 182.93 L
141.875 178.997 L
151.04 133.374 L
160.205 94.292 L
169.37 61.15 L
178.535 52.008 L
187.7 52.154 L
196.865 52.298 L
206.03 51.914 L
215.195 53.434 L
224.36 52.992 L
233.525 52.867 L
242.69 51.607 L
251.855 48.433 L
261.02 46.364 L
270.185 48.329 L
279.35 48.586 L
288.515 50.343 L
297.68 54.916 L
306.845 58.903 L
316.01 91.37 L
325.175 101.745 L
334.34 97.138 L
343.505 72.696 L
352.67 53.404 L
361.835 40.598 L
371 37.22 L
371.036 37.222 L
S
GR
GS
[0.99902 0 0 1.00077 0 -0.19998] CT
0.9 0.799 0.799 RC
N
123.545 109.636 M
114.38 56.863 L
105.215 54.205 L
96.05 49.471 L
86.885 48.068 L
77.72 47.383 L
68.555 50.845 L
65.464 52.466 L
65.464 58.094 L
65.464 61.1 L
68.555 59.339 L
77.72 55.87 L
86.885 57.277 L
96.05 58.558 L
105.215 63.99 L
114.38 66.151 L
123.545 118.477 L
132.71 175.223 L
141.875 174.571 L
151.04 136.719 L
160.205 96.982 L
169.37 65.608 L
178.535 58.411 L
187.7 60.389 L
196.865 64.995 L
206.03 66.866 L
215.195 63.478 L
224.36 57.789 L
233.525 52.738 L
242.69 49.972 L
251.855 46.245 L
261.02 47.029 L
270.185 49.868 L
279.35 57.641 L
288.515 66.942 L
297.68 71.945 L
306.845 77.276 L
316.01 101.308 L
325.175 109.207 L
334.34 101.641 L
343.505 75.995 L
352.67 57.824 L
361.835 47.239 L
371 46.932 L
371.036 46.93 L
371.036 35.942 L
371.036 35.901 L
371 35.9 L
361.835 36.705 L
352.67 49.515 L
343.505 67.433 L
334.34 94.07 L
325.175 100.942 L
316.01 92.372 L
306.845 68.569 L
297.68 62.251 L
288.515 55.763 L
279.35 46.753 L
270.185 39.47 L
261.02 38.56 L
251.855 38.558 L
242.69 41.731 L
233.525 44.388 L
224.36 49.448 L
215.195 54.838 L
206.03 57.114 L
196.865 54.233 L
187.7 50.579 L
178.535 49.138 L
169.37 56.212 L
160.205 86.827 L
151.04 126.493 L
141.875 165.103 L
132.71 166.357 L
cp
f
GR
GS
[0.99902 0 0 1.00077 0 -0.19998] CT
0.82 0.639 0.639 RC
1 LJ
0.5 LW
N
65.464 61.1 M
68.555 59.339 L
77.72 55.87 L
86.885 57.277 L
96.05 58.558 L
105.215 63.99 L
114.38 66.151 L
123.545 118.477 L
132.71 175.223 L
141.875 174.571 L
151.04 136.719 L
160.205 96.982 L
169.37 65.608 L
178.535 58.411 L
187.7 60.389 L
196.865 64.995 L
206.03 66.866 L
215.195 63.478 L
224.36 57.789 L
233.525 52.738 L
242.69 49.972 L
251.855 46.245 L
261.02 47.029 L
270.185 49.868 L
279.35 57.641 L
288.515 66.942 L
297.68 71.945 L
306.845 77.276 L
316.01 101.308 L
325.175 109.207 L
334.34 101.641 L
343.505 75.995 L
352.67 57.824 L
361.835 47.239 L
371 46.932 L
371.036 46.93 L
S
GR
GS
[0.99902 0 0 1.00077 0 -0.19998] CT
0.82 0.639 0.639 RC
1 LJ
0.5 LW
N
65.464 52.466 M
68.555 50.845 L
77.72 47.383 L
86.885 48.068 L
96.05 49.471 L
105.215 54.205 L
114.38 56.863 L
123.545 109.636 L
132.71 166.357 L
141.875 165.103 L
151.04 126.493 L
160.205 86.827 L
169.37 56.212 L
178.535 49.138 L
187.7 50.579 L
196.865 54.233 L
206.03 57.114 L
215.195 54.838 L
224.36 49.448 L
233.525 44.388 L
242.69 41.731 L
251.855 38.558 L
261.02 38.56 L
270.185 39.47 L
279.35 46.753 L
288.515 55.763 L
297.68 62.251 L
306.845 68.569 L
316.01 92.372 L
325.175 100.942 L
334.34 94.07 L
343.505 67.433 L
352.67 49.515 L
361.835 36.705 L
371 35.9 L
371.036 35.901 L
S
GR
GS
[0.99902 0 0 1.00077 0 -0.19998] CT
0.6 0.2 0.2 RC
1 LJ
2 LW
N
65.464 56.783 M
68.555 55.092 L
77.72 51.626 L
86.885 52.673 L
96.05 54.015 L
105.215 59.097 L
114.38 61.507 L
123.545 114.057 L
132.71 170.79 L
141.875 169.837 L
151.04 131.606 L
160.205 91.904 L
169.37 60.91 L
178.535 53.775 L
187.7 55.484 L
196.865 59.614 L
206.03 61.99 L
215.195 59.158 L
224.36 53.619 L
233.525 48.563 L
242.69 45.852 L
251.855 42.401 L
261.02 42.794 L
270.185 44.669 L
279.35 52.197 L
288.515 61.352 L
297.68 67.098 L
306.845 72.923 L
316.01 96.84 L
325.175 105.075 L
334.34 97.856 L
343.505 71.714 L
352.67 53.67 L
361.835 41.972 L
371 41.416 L
371.036 41.415 L
S
GR
GS
[0.99902 0 0 1.00077 202.80195 135.40464] CT
/Helvetica 15 F
GS
[1 0 0 1 0 0] CT
0 5.5 moveto 
1 -1 scale
(1 Target) t 
GR
GR
GS
[0.99902 0 0 1.00077 0 -0.19998] CT
0.898 0.6 0.6 RC
1 LJ
2 LW
N
170 135.5 M
200 135.5 L
S
GR
GS
[0.99902 0 0 1.00077 202.80195 153.91893] CT
/Helvetica 15 F
GS
[1 0 0 1 0 0] CT
0 5.5 moveto 
1 -1 scale
(2 Targets) t 
GR
GR
GS
[0.99902 0 0 1.00077 0 -0.19998] CT
1 0.502 0.502 RC
1 LJ
2 LW
N
170 154 M
200 154 L
S
GR
GS
[0.99902 0 0 1.00077 202.80195 172.43321] CT
/Helvetica 15 F
GS
[1 0 0 1 0 0] CT
0 5.5 moveto 
1 -1 scale
(3 Targets) t 
GR
GR
GS
[0.99902 0 0 1.00077 0 -0.19998] CT
0.898 0.302 0.302 RC
1 LJ
2 LW
N
170 172.5 M
200 172.5 L
S
GR
GS
[0.99902 0 0 1.00077 202.80195 190.9475] CT
/Helvetica 15 F
GS
[1 0 0 1 0 0] CT
0 5.5 moveto 
1 -1 scale
(4 Targets) t 
GR
GR
GS
[0.99902 0 0 1.00077 0 -0.19998] CT
0.6 0.2 0.2 RC
1 LJ
2 LW
N
170 191 M
200 191 L
S
GR
%%Trailer
%%Pages: 1
%%EOF
