%!PS-Adobe-3.0 EPSF-3.0
%%Creator: (MATLAB, The Mathworks, Inc. Version 9.8.0.1323502 \(R2020a\). Operating System: Mac OS X)
%%Title: /Users/kosciessa/Desktop/tardis/LNDG/stateswitch/stsw_eeg_task/mse/figures/a3_input_spectrum.eps
%%CreationDate: 2022-02-15T12:02:44
%%Pages: (atend)
%%BoundingBox:     7     0   261   193
%%LanguageLevel: 3
%%EndComments
%%BeginProlog
%%BeginResource: procset (Apache XML Graphics Std ProcSet) 1.2 0
%%Version: 1.2 0
%%Copyright: (Copyright 2001-2003,2010 The Apache Software Foundation. License terms: http://www.apache.org/licenses/LICENSE-2.0)
/bd{bind def}bind def
/ld{load def}bd
/GR/grestore ld
/GS/gsave ld
/RM/rmoveto ld
/C/curveto ld
/t/show ld
/L/lineto ld
/ML/setmiterlimit ld
/CT/concat ld
/f/fill ld
/N/newpath ld
/S/stroke ld
/CC/setcmykcolor ld
/A/ashow ld
/cp/closepath ld
/RC/setrgbcolor ld
/LJ/setlinejoin ld
/GC/setgray ld
/LW/setlinewidth ld
/M/moveto ld
/re {4 2 roll M
1 index 0 rlineto
0 exch rlineto
neg 0 rlineto
cp } bd
/_ctm matrix def
/_tm matrix def
/BT { _ctm currentmatrix pop matrix _tm copy pop 0 0 moveto } bd
/ET { _ctm setmatrix } bd
/iTm { _ctm setmatrix _tm concat } bd
/Tm { _tm astore pop iTm 0 0 moveto } bd
/ux 0.0 def
/uy 0.0 def
/F {
  /Tp exch def
  /Tf exch def
  Tf findfont Tp scalefont setfont
  /cf Tf def  /cs Tp def
} bd
/ULS {currentpoint /uy exch def /ux exch def} bd
/ULE {
  /Tcx currentpoint pop def
  gsave
  newpath
  cf findfont cs scalefont dup
  /FontMatrix get 0 get /Ts exch def /FontInfo get dup
  /UnderlinePosition get Ts mul /To exch def
  /UnderlineThickness get Ts mul /Tt exch def
  ux uy To add moveto  Tcx uy To add lineto
  Tt setlinewidth stroke
  grestore
} bd
/OLE {
  /Tcx currentpoint pop def
  gsave
  newpath
  cf findfont cs scalefont dup
  /FontMatrix get 0 get /Ts exch def /FontInfo get dup
  /UnderlinePosition get Ts mul /To exch def
  /UnderlineThickness get Ts mul /Tt exch def
  ux uy To add cs add moveto Tcx uy To add cs add lineto
  Tt setlinewidth stroke
  grestore
} bd
/SOE {
  /Tcx currentpoint pop def
  gsave
  newpath
  cf findfont cs scalefont dup
  /FontMatrix get 0 get /Ts exch def /FontInfo get dup
  /UnderlinePosition get Ts mul /To exch def
  /UnderlineThickness get Ts mul /Tt exch def
  ux uy To add cs 10 mul 26 idiv add moveto Tcx uy To add cs 10 mul 26 idiv add lineto
  Tt setlinewidth stroke
  grestore
} bd
/QT {
/Y22 exch store
/X22 exch store
/Y21 exch store
/X21 exch store
currentpoint
/Y21 load 2 mul add 3 div exch
/X21 load 2 mul add 3 div exch
/X21 load 2 mul /X22 load add 3 div
/Y21 load 2 mul /Y22 load add 3 div
/X22 load /Y22 load curveto
} bd
/SSPD {
dup length /d exch dict def
{
/v exch def
/k exch def
currentpagedevice k known {
/cpdv currentpagedevice k get def
v cpdv ne {
/upd false def
/nullv v type /nulltype eq def
/nullcpdv cpdv type /nulltype eq def
nullv nullcpdv or
{
/upd true def
} {
/sametype v type cpdv type eq def
sametype {
v type /arraytype eq {
/vlen v length def
/cpdvlen cpdv length def
vlen cpdvlen eq {
0 1 vlen 1 sub {
/i exch def
/obj v i get def
/cpdobj cpdv i get def
obj cpdobj ne {
/upd true def
exit
} if
} for
} {
/upd true def
} ifelse
} {
v type /dicttype eq {
v {
/dv exch def
/dk exch def
/cpddv cpdv dk get def
dv cpddv ne {
/upd true def
exit
} if
} forall
} {
/upd true def
} ifelse
} ifelse
} if
} ifelse
upd true eq {
d k v put
} if
} if
} if
} forall
d length 0 gt {
d setpagedevice
} if
} bd
/RE { % /NewFontName [NewEncodingArray] /FontName RE -
  findfont dup length dict begin
  {
    1 index /FID ne
    {def} {pop pop} ifelse
  } forall
  /Encoding exch def
  /FontName 1 index def
  currentdict definefont pop
  end
} bind def
%%EndResource
%%BeginResource: procset (Apache XML Graphics EPS ProcSet) 1.0 0
%%Version: 1.0 0
%%Copyright: (Copyright 2002-2003 The Apache Software Foundation. License terms: http://www.apache.org/licenses/LICENSE-2.0)
/BeginEPSF { %def
/b4_Inc_state save def         % Save state for cleanup
/dict_count countdictstack def % Count objects on dict stack
/op_count count 1 sub def      % Count objects on operand stack
userdict begin                 % Push userdict on dict stack
/showpage { } def              % Redefine showpage, { } = null proc
0 setgray 0 setlinecap         % Prepare graphics state
1 setlinewidth 0 setlinejoin
10 setmiterlimit [ ] 0 setdash newpath
/languagelevel where           % If level not equal to 1 then
{pop languagelevel             % set strokeadjust and
1 ne                           % overprint to their defaults.
{false setstrokeadjust false setoverprint
} if
} if
} bd
/EndEPSF { %def
count op_count sub {pop} repeat            % Clean up stacks
countdictstack dict_count sub {end} repeat
b4_Inc_state restore
} bd
%%EndResource
%FOPBeginFontDict
%%IncludeResource: font Courier-Oblique
%%IncludeResource: font Courier-BoldOblique
%%IncludeResource: font Courier-Bold
%%IncludeResource: font ZapfDingbats
%%IncludeResource: font Symbol
%%IncludeResource: font Helvetica
%%IncludeResource: font Helvetica-Oblique
%%IncludeResource: font Helvetica-Bold
%%IncludeResource: font Helvetica-BoldOblique
%%IncludeResource: font Times-Roman
%%IncludeResource: font Times-Italic
%%IncludeResource: font Times-Bold
%%IncludeResource: font Times-BoldItalic
%%IncludeResource: font Courier
%FOPEndFontDict
%%BeginResource: encoding WinAnsiEncoding
/WinAnsiEncoding [
/.notdef /.notdef /.notdef /.notdef /.notdef
/.notdef /.notdef /.notdef /.notdef /.notdef
/.notdef /.notdef /.notdef /.notdef /.notdef
/.notdef /.notdef /.notdef /.notdef /.notdef
/.notdef /.notdef /.notdef /.notdef /.notdef
/.notdef /.notdef /.notdef /.notdef /.notdef
/.notdef /.notdef /space /exclam /quotedbl
/numbersign /dollar /percent /ampersand /quotesingle
/parenleft /parenright /asterisk /plus /comma
/hyphen /period /slash /zero /one
/two /three /four /five /six
/seven /eight /nine /colon /semicolon
/less /equal /greater /question /at
/A /B /C /D /E
/F /G /H /I /J
/K /L /M /N /O
/P /Q /R /S /T
/U /V /W /X /Y
/Z /bracketleft /backslash /bracketright /asciicircum
/underscore /quoteleft /a /b /c
/d /e /f /g /h
/i /j /k /l /m
/n /o /p /q /r
/s /t /u /v /w
/x /y /z /braceleft /bar
/braceright /asciitilde /bullet /Euro /bullet
/quotesinglbase /florin /quotedblbase /ellipsis /dagger
/daggerdbl /circumflex /perthousand /Scaron /guilsinglleft
/OE /bullet /Zcaron /bullet /bullet
/quoteleft /quoteright /quotedblleft /quotedblright /bullet
/endash /emdash /asciitilde /trademark /scaron
/guilsinglright /oe /bullet /zcaron /Ydieresis
/space /exclamdown /cent /sterling /currency
/yen /brokenbar /section /dieresis /copyright
/ordfeminine /guillemotleft /logicalnot /sfthyphen /registered
/macron /degree /plusminus /twosuperior /threesuperior
/acute /mu /paragraph /middot /cedilla
/onesuperior /ordmasculine /guillemotright /onequarter /onehalf
/threequarters /questiondown /Agrave /Aacute /Acircumflex
/Atilde /Adieresis /Aring /AE /Ccedilla
/Egrave /Eacute /Ecircumflex /Edieresis /Igrave
/Iacute /Icircumflex /Idieresis /Eth /Ntilde
/Ograve /Oacute /Ocircumflex /Otilde /Odieresis
/multiply /Oslash /Ugrave /Uacute /Ucircumflex
/Udieresis /Yacute /Thorn /germandbls /agrave
/aacute /acircumflex /atilde /adieresis /aring
/ae /ccedilla /egrave /eacute /ecircumflex
/edieresis /igrave /iacute /icircumflex /idieresis
/eth /ntilde /ograve /oacute /ocircumflex
/otilde /odieresis /divide /oslash /ugrave
/uacute /ucircumflex /udieresis /yacute /thorn
/ydieresis
] def
%%EndResource
%FOPBeginFontReencode
/Courier-Oblique findfont
dup length dict begin
  {1 index /FID ne {def} {pop pop} ifelse} forall
  /Encoding WinAnsiEncoding def
  currentdict
end
/Courier-Oblique exch definefont pop
/Courier-BoldOblique findfont
dup length dict begin
  {1 index /FID ne {def} {pop pop} ifelse} forall
  /Encoding WinAnsiEncoding def
  currentdict
end
/Courier-BoldOblique exch definefont pop
/Courier-Bold findfont
dup length dict begin
  {1 index /FID ne {def} {pop pop} ifelse} forall
  /Encoding WinAnsiEncoding def
  currentdict
end
/Courier-Bold exch definefont pop
/Helvetica findfont
dup length dict begin
  {1 index /FID ne {def} {pop pop} ifelse} forall
  /Encoding WinAnsiEncoding def
  currentdict
end
/Helvetica exch definefont pop
/Helvetica-Oblique findfont
dup length dict begin
  {1 index /FID ne {def} {pop pop} ifelse} forall
  /Encoding WinAnsiEncoding def
  currentdict
end
/Helvetica-Oblique exch definefont pop
/Helvetica-Bold findfont
dup length dict begin
  {1 index /FID ne {def} {pop pop} ifelse} forall
  /Encoding WinAnsiEncoding def
  currentdict
end
/Helvetica-Bold exch definefont pop
/Helvetica-BoldOblique findfont
dup length dict begin
  {1 index /FID ne {def} {pop pop} ifelse} forall
  /Encoding WinAnsiEncoding def
  currentdict
end
/Helvetica-BoldOblique exch definefont pop
/Times-Roman findfont
dup length dict begin
  {1 index /FID ne {def} {pop pop} ifelse} forall
  /Encoding WinAnsiEncoding def
  currentdict
end
/Times-Roman exch definefont pop
/Times-Italic findfont
dup length dict begin
  {1 index /FID ne {def} {pop pop} ifelse} forall
  /Encoding WinAnsiEncoding def
  currentdict
end
/Times-Italic exch definefont pop
/Times-Bold findfont
dup length dict begin
  {1 index /FID ne {def} {pop pop} ifelse} forall
  /Encoding WinAnsiEncoding def
  currentdict
end
/Times-Bold exch definefont pop
/Times-BoldItalic findfont
dup length dict begin
  {1 index /FID ne {def} {pop pop} ifelse} forall
  /Encoding WinAnsiEncoding def
  currentdict
end
/Times-BoldItalic exch definefont pop
/Courier findfont
dup length dict begin
  {1 index /FID ne {def} {pop pop} ifelse} forall
  /Encoding WinAnsiEncoding def
  currentdict
end
/Courier exch definefont pop
%FOPEndFontReencode
%%EndProlog
%%Page: 1 1
%%PageBoundingBox: 0 0 283 198
%%BeginPageSetup
[1 0 0 -1 0 198] CT
%%EndPageSetup
GS
[1.00164 0 0 1 0 0] CT
1 GC
N
0 0 283 198 re
f
GR
GS
[1.00164 0 0 1 0 0] CT
1 GC
N
0 0 283 198 re
f
GR
GS
[1.00164 0 0 1 0 0] CT
1 GC
N
55.5 154 M
256 154 L
256 23.5 L
55.5 23.5 L
cp
f
GR
GS
[1.00164 0 0 1 0 0] CT
0.149 GC
2 setlinecap
1 LJ
0.5 LW
N
55.5 154 M
256 154 L
S
GR
GS
[1.00164 0 0 1 0 0] CT
0.149 GC
2 setlinecap
1 LJ
0.5 LW
N
55.5 23.5 M
256 23.5 L
S
GR
GS
[1.00164 0 0 1 0 0] CT
0.149 GC
2 setlinecap
1 LJ
0.5 LW
N
55.5 154 M
55.5 151.995 L
S
GR
GS
[1.00164 0 0 1 0 0] CT
0.149 GC
2 setlinecap
1 LJ
0.5 LW
N
155.75 154 M
155.75 151.995 L
S
GR
GS
[1.00164 0 0 1 0 0] CT
0.149 GC
2 setlinecap
1 LJ
0.5 LW
N
256 154 M
256 151.995 L
S
GR
GS
[1.00164 0 0 1 0 0] CT
0.149 GC
2 setlinecap
1 LJ
0.5 LW
N
55.5 23.5 M
55.5 25.505 L
S
GR
GS
[1.00164 0 0 1 0 0] CT
0.149 GC
2 setlinecap
1 LJ
0.5 LW
N
155.75 23.5 M
155.75 25.505 L
S
GR
GS
[1.00164 0 0 1 0 0] CT
0.149 GC
2 setlinecap
1 LJ
0.5 LW
N
256 23.5 M
256 25.505 L
S
GR
GS
[1.00164 0 0 1 55.59111 159.19998] CT
0.149 GC
/Helvetica 16 F
GS
[1 0 0 1 0 0] CT
-4.5 16 moveto 
1 -1 scale
(0) t 
GR
GR
GS
[1.00164 0 0 1 156.00568 159.19998] CT
0.149 GC
/Helvetica 16 F
GS
[1 0 0 1 0 0] CT
-4.5 16 moveto 
1 -1 scale
(1) t 
GR
GR
GS
[1.00164 0 0 1 256.42025 159.19998] CT
0.149 GC
/Helvetica 16 F
GS
[1 0 0 1 0 0] CT
-4.5 16 moveto 
1 -1 scale
(2) t 
GR
GR
GS
[1.00164 0 0 1 156.00577 179.19998] CT
0.149 GC
/Helvetica 16 F
GS
[1 0 0 1 0 0] CT
-74 16 moveto 
1 -1 scale
(Frequency \(log10Hz\)) t 
GR
GR
GS
[1.00164 0 0 1 0 0] CT
0.149 GC
2 setlinecap
1 LJ
0.5 LW
N
55.5 154 M
55.5 23.5 L
S
GR
GS
[1.00164 0 0 1 0 0] CT
0.149 GC
2 setlinecap
1 LJ
0.5 LW
N
256 154 M
256 23.5 L
S
GR
GS
[1.00164 0 0 1 0 0] CT
0.149 GC
2 setlinecap
1 LJ
0.5 LW
N
55.5 154 M
57.505 154 L
S
GR
GS
[1.00164 0 0 1 0 0] CT
0.149 GC
2 setlinecap
1 LJ
0.5 LW
N
55.5 97.261 M
57.505 97.261 L
S
GR
GS
[1.00164 0 0 1 0 0] CT
0.149 GC
2 setlinecap
1 LJ
0.5 LW
N
55.5 40.522 M
57.505 40.522 L
S
GR
GS
[1.00164 0 0 1 0 0] CT
0.149 GC
2 setlinecap
1 LJ
0.5 LW
N
256 154 M
253.995 154 L
S
GR
GS
[1.00164 0 0 1 0 0] CT
0.149 GC
2 setlinecap
1 LJ
0.5 LW
N
256 97.261 M
253.995 97.261 L
S
GR
GS
[1.00164 0 0 1 0 0] CT
0.149 GC
2 setlinecap
1 LJ
0.5 LW
N
256 40.522 M
253.995 40.522 L
S
GR
GS
[1.00164 0 0 1 50.38257 154] CT
0.149 GC
/Helvetica 16 F
GS
[1 0 0 1 0 0] CT
-25 6 moveto 
1 -1 scale
(-10) t 
GR
GR
GS
[1.00164 0 0 1 50.38257 97.26087] CT
0.149 GC
/Helvetica 16 F
GS
[1 0 0 1 0 0] CT
-16 6 moveto 
1 -1 scale
(-9) t 
GR
GR
GS
[1.00164 0 0 1 50.38257 40.52174] CT
0.149 GC
/Helvetica 16 F
GS
[1 0 0 1 0 0] CT
-16 6 moveto 
1 -1 scale
(-8) t 
GR
GR
GS
[0 -1 1.00164 0 22.83743 88.74992] CT
0.149 GC
/Helvetica 16 F
GS
[1 0 0 1 0 0] CT
-49.5 -4 moveto 
1 -1 scale
(Power \(log10\)) t 
GR
GR
GS
[1.00164 0 0 1 156.00581 21.49998] CT
/Helvetica-Bold 16 F
GS
[1 0 0 1 0 0] CT
-85 -4 moveto 
1 -1 scale
(mMSE input spectrum) t 
GR
GR
GS
[1.00164 0 0 1 0 0] CT
1 LJ
2 LW
N
55.5 28.182 M
59.65 30.753 L
63.438 33.353 L
66.923 37.98 L
70.149 40.143 L
74.581 43.217 L
78.603 46.529 L
82.284 47.456 L
85.678 49.154 L
89.828 50.888 L
93.616 52.381 L
97.101 54.43 L
101.098 55.706 L
104.759 56.624 L
108.136 57.949 L
111.87 59.749 L
115.857 61.546 L
119.509 63.181 L
123.339 65.662 L
127.279 67.776 L
130.893 70.535 L
134.585 74.013 L
138.638 92.352 L
141.499 154.016 L
S
GR
GS
[1.00164 0 0 1 0 0] CT
1 LJ
2 LW
N
175.236 154.016 M
176.213 125.3 L
179.99 98.424 L
183.809 97.739 L
187.531 101.084 L
191.346 106.245 L
195.118 110.447 L
198.833 112.993 L
202.628 114.578 L
206.391 117.202 L
210.168 119.252 L
213.931 121.18 L
217.709 122.374 L
221.476 123.94 L
225.252 125.366 L
229.011 126.459 L
232.806 127.744 L
236.57 129.23 L
240.346 130.599 L
244.109 132.105 L
247.888 134.295 L
251.654 136.723 L
S
GR
%%Trailer
%%Pages: 1
%%EOF
