%!PS-Adobe-3.0 EPSF-3.0
%%Creator: (MATLAB, The Mathworks, Inc. Version 9.8.0.1323502 \(R2020a\). Operating System: Mac OS X)
%%Title: /Users/kosciessa/Desktop/tardis/LNDG/stateswitch/stsw_eeg_task/mse/figures/e02_EntropyTraces_ya.eps
%%CreationDate: 2022-02-18T14:16:18
%%Pages: (atend)
%%BoundingBox:     4     0   375   240
%%LanguageLevel: 3
%%EndComments
%%BeginProlog
%%BeginResource: procset (Apache XML Graphics Std ProcSet) 1.2 0
%%Version: 1.2 0
%%Copyright: (Copyright 2001-2003,2010 The Apache Software Foundation. License terms: http://www.apache.org/licenses/LICENSE-2.0)
/bd{bind def}bind def
/ld{load def}bd
/GR/grestore ld
/GS/gsave ld
/RM/rmoveto ld
/C/curveto ld
/t/show ld
/L/lineto ld
/ML/setmiterlimit ld
/CT/concat ld
/f/fill ld
/N/newpath ld
/S/stroke ld
/CC/setcmykcolor ld
/A/ashow ld
/cp/closepath ld
/RC/setrgbcolor ld
/LJ/setlinejoin ld
/GC/setgray ld
/LW/setlinewidth ld
/M/moveto ld
/re {4 2 roll M
1 index 0 rlineto
0 exch rlineto
neg 0 rlineto
cp } bd
/_ctm matrix def
/_tm matrix def
/BT { _ctm currentmatrix pop matrix _tm copy pop 0 0 moveto } bd
/ET { _ctm setmatrix } bd
/iTm { _ctm setmatrix _tm concat } bd
/Tm { _tm astore pop iTm 0 0 moveto } bd
/ux 0.0 def
/uy 0.0 def
/F {
  /Tp exch def
  /Tf exch def
  Tf findfont Tp scalefont setfont
  /cf Tf def  /cs Tp def
} bd
/ULS {currentpoint /uy exch def /ux exch def} bd
/ULE {
  /Tcx currentpoint pop def
  gsave
  newpath
  cf findfont cs scalefont dup
  /FontMatrix get 0 get /Ts exch def /FontInfo get dup
  /UnderlinePosition get Ts mul /To exch def
  /UnderlineThickness get Ts mul /Tt exch def
  ux uy To add moveto  Tcx uy To add lineto
  Tt setlinewidth stroke
  grestore
} bd
/OLE {
  /Tcx currentpoint pop def
  gsave
  newpath
  cf findfont cs scalefont dup
  /FontMatrix get 0 get /Ts exch def /FontInfo get dup
  /UnderlinePosition get Ts mul /To exch def
  /UnderlineThickness get Ts mul /Tt exch def
  ux uy To add cs add moveto Tcx uy To add cs add lineto
  Tt setlinewidth stroke
  grestore
} bd
/SOE {
  /Tcx currentpoint pop def
  gsave
  newpath
  cf findfont cs scalefont dup
  /FontMatrix get 0 get /Ts exch def /FontInfo get dup
  /UnderlinePosition get Ts mul /To exch def
  /UnderlineThickness get Ts mul /Tt exch def
  ux uy To add cs 10 mul 26 idiv add moveto Tcx uy To add cs 10 mul 26 idiv add lineto
  Tt setlinewidth stroke
  grestore
} bd
/QT {
/Y22 exch store
/X22 exch store
/Y21 exch store
/X21 exch store
currentpoint
/Y21 load 2 mul add 3 div exch
/X21 load 2 mul add 3 div exch
/X21 load 2 mul /X22 load add 3 div
/Y21 load 2 mul /Y22 load add 3 div
/X22 load /Y22 load curveto
} bd
/SSPD {
dup length /d exch dict def
{
/v exch def
/k exch def
currentpagedevice k known {
/cpdv currentpagedevice k get def
v cpdv ne {
/upd false def
/nullv v type /nulltype eq def
/nullcpdv cpdv type /nulltype eq def
nullv nullcpdv or
{
/upd true def
} {
/sametype v type cpdv type eq def
sametype {
v type /arraytype eq {
/vlen v length def
/cpdvlen cpdv length def
vlen cpdvlen eq {
0 1 vlen 1 sub {
/i exch def
/obj v i get def
/cpdobj cpdv i get def
obj cpdobj ne {
/upd true def
exit
} if
} for
} {
/upd true def
} ifelse
} {
v type /dicttype eq {
v {
/dv exch def
/dk exch def
/cpddv cpdv dk get def
dv cpddv ne {
/upd true def
exit
} if
} forall
} {
/upd true def
} ifelse
} ifelse
} if
} ifelse
upd true eq {
d k v put
} if
} if
} if
} forall
d length 0 gt {
d setpagedevice
} if
} bd
/RE { % /NewFontName [NewEncodingArray] /FontName RE -
  findfont dup length dict begin
  {
    1 index /FID ne
    {def} {pop pop} ifelse
  } forall
  /Encoding exch def
  /FontName 1 index def
  currentdict definefont pop
  end
} bind def
%%EndResource
%%BeginResource: procset (Apache XML Graphics EPS ProcSet) 1.0 0
%%Version: 1.0 0
%%Copyright: (Copyright 2002-2003 The Apache Software Foundation. License terms: http://www.apache.org/licenses/LICENSE-2.0)
/BeginEPSF { %def
/b4_Inc_state save def         % Save state for cleanup
/dict_count countdictstack def % Count objects on dict stack
/op_count count 1 sub def      % Count objects on operand stack
userdict begin                 % Push userdict on dict stack
/showpage { } def              % Redefine showpage, { } = null proc
0 setgray 0 setlinecap         % Prepare graphics state
1 setlinewidth 0 setlinejoin
10 setmiterlimit [ ] 0 setdash newpath
/languagelevel where           % If level not equal to 1 then
{pop languagelevel             % set strokeadjust and
1 ne                           % overprint to their defaults.
{false setstrokeadjust false setoverprint
} if
} if
} bd
/EndEPSF { %def
count op_count sub {pop} repeat            % Clean up stacks
countdictstack dict_count sub {end} repeat
b4_Inc_state restore
} bd
%%EndResource
%FOPBeginFontDict
%%IncludeResource: font Courier-Oblique
%%IncludeResource: font Courier-BoldOblique
%%IncludeResource: font Courier-Bold
%%IncludeResource: font ZapfDingbats
%%IncludeResource: font Symbol
%%IncludeResource: font Helvetica
%%IncludeResource: font Helvetica-Oblique
%%IncludeResource: font Helvetica-Bold
%%IncludeResource: font Helvetica-BoldOblique
%%IncludeResource: font Times-Roman
%%IncludeResource: font Times-Italic
%%IncludeResource: font Times-Bold
%%IncludeResource: font Times-BoldItalic
%%IncludeResource: font Courier
%FOPEndFontDict
%%BeginResource: encoding WinAnsiEncoding
/WinAnsiEncoding [
/.notdef /.notdef /.notdef /.notdef /.notdef
/.notdef /.notdef /.notdef /.notdef /.notdef
/.notdef /.notdef /.notdef /.notdef /.notdef
/.notdef /.notdef /.notdef /.notdef /.notdef
/.notdef /.notdef /.notdef /.notdef /.notdef
/.notdef /.notdef /.notdef /.notdef /.notdef
/.notdef /.notdef /space /exclam /quotedbl
/numbersign /dollar /percent /ampersand /quotesingle
/parenleft /parenright /asterisk /plus /comma
/hyphen /period /slash /zero /one
/two /three /four /five /six
/seven /eight /nine /colon /semicolon
/less /equal /greater /question /at
/A /B /C /D /E
/F /G /H /I /J
/K /L /M /N /O
/P /Q /R /S /T
/U /V /W /X /Y
/Z /bracketleft /backslash /bracketright /asciicircum
/underscore /quoteleft /a /b /c
/d /e /f /g /h
/i /j /k /l /m
/n /o /p /q /r
/s /t /u /v /w
/x /y /z /braceleft /bar
/braceright /asciitilde /bullet /Euro /bullet
/quotesinglbase /florin /quotedblbase /ellipsis /dagger
/daggerdbl /circumflex /perthousand /Scaron /guilsinglleft
/OE /bullet /Zcaron /bullet /bullet
/quoteleft /quoteright /quotedblleft /quotedblright /bullet
/endash /emdash /asciitilde /trademark /scaron
/guilsinglright /oe /bullet /zcaron /Ydieresis
/space /exclamdown /cent /sterling /currency
/yen /brokenbar /section /dieresis /copyright
/ordfeminine /guillemotleft /logicalnot /sfthyphen /registered
/macron /degree /plusminus /twosuperior /threesuperior
/acute /mu /paragraph /middot /cedilla
/onesuperior /ordmasculine /guillemotright /onequarter /onehalf
/threequarters /questiondown /Agrave /Aacute /Acircumflex
/Atilde /Adieresis /Aring /AE /Ccedilla
/Egrave /Eacute /Ecircumflex /Edieresis /Igrave
/Iacute /Icircumflex /Idieresis /Eth /Ntilde
/Ograve /Oacute /Ocircumflex /Otilde /Odieresis
/multiply /Oslash /Ugrave /Uacute /Ucircumflex
/Udieresis /Yacute /Thorn /germandbls /agrave
/aacute /acircumflex /atilde /adieresis /aring
/ae /ccedilla /egrave /eacute /ecircumflex
/edieresis /igrave /iacute /icircumflex /idieresis
/eth /ntilde /ograve /oacute /ocircumflex
/otilde /odieresis /divide /oslash /ugrave
/uacute /ucircumflex /udieresis /yacute /thorn
/ydieresis
] def
%%EndResource
%FOPBeginFontReencode
/Courier-Oblique findfont
dup length dict begin
  {1 index /FID ne {def} {pop pop} ifelse} forall
  /Encoding WinAnsiEncoding def
  currentdict
end
/Courier-Oblique exch definefont pop
/Courier-BoldOblique findfont
dup length dict begin
  {1 index /FID ne {def} {pop pop} ifelse} forall
  /Encoding WinAnsiEncoding def
  currentdict
end
/Courier-BoldOblique exch definefont pop
/Courier-Bold findfont
dup length dict begin
  {1 index /FID ne {def} {pop pop} ifelse} forall
  /Encoding WinAnsiEncoding def
  currentdict
end
/Courier-Bold exch definefont pop
/Helvetica findfont
dup length dict begin
  {1 index /FID ne {def} {pop pop} ifelse} forall
  /Encoding WinAnsiEncoding def
  currentdict
end
/Helvetica exch definefont pop
/Helvetica-Oblique findfont
dup length dict begin
  {1 index /FID ne {def} {pop pop} ifelse} forall
  /Encoding WinAnsiEncoding def
  currentdict
end
/Helvetica-Oblique exch definefont pop
/Helvetica-Bold findfont
dup length dict begin
  {1 index /FID ne {def} {pop pop} ifelse} forall
  /Encoding WinAnsiEncoding def
  currentdict
end
/Helvetica-Bold exch definefont pop
/Helvetica-BoldOblique findfont
dup length dict begin
  {1 index /FID ne {def} {pop pop} ifelse} forall
  /Encoding WinAnsiEncoding def
  currentdict
end
/Helvetica-BoldOblique exch definefont pop
/Times-Roman findfont
dup length dict begin
  {1 index /FID ne {def} {pop pop} ifelse} forall
  /Encoding WinAnsiEncoding def
  currentdict
end
/Times-Roman exch definefont pop
/Times-Italic findfont
dup length dict begin
  {1 index /FID ne {def} {pop pop} ifelse} forall
  /Encoding WinAnsiEncoding def
  currentdict
end
/Times-Italic exch definefont pop
/Times-Bold findfont
dup length dict begin
  {1 index /FID ne {def} {pop pop} ifelse} forall
  /Encoding WinAnsiEncoding def
  currentdict
end
/Times-Bold exch definefont pop
/Times-BoldItalic findfont
dup length dict begin
  {1 index /FID ne {def} {pop pop} ifelse} forall
  /Encoding WinAnsiEncoding def
  currentdict
end
/Times-BoldItalic exch definefont pop
/Courier findfont
dup length dict begin
  {1 index /FID ne {def} {pop pop} ifelse} forall
  /Encoding WinAnsiEncoding def
  currentdict
end
/Courier exch definefont pop
%FOPEndFontReencode
%%EndProlog
%%Page: 1 1
%%PageBoundingBox: 0 0 410 259
%%BeginPageSetup
[1 0 0 -1 0 259] CT
%%EndPageSetup
GS
[0.99902 0 0 1.00077 0 -0.19998] CT
1 GC
N
0 0 410 259 re
f
GR
GS
[0.99902 0 0 1.00077 0 -0.19998] CT
1 GC
N
0 0 410 259 re
f
GR
GS
[0.99902 0 0 1.00077 0 -0.19998] CT
1 GC
N
65.5 209.5 M
371 209.5 L
371 19.5 L
65.5 19.5 L
cp
f
GR
GS
[0.99902 0 0 1.00077 0 -0.19998] CT
0.149 GC
2 setlinecap
1 LJ
0.5 LW
N
65.5 209.5 M
371 209.5 L
S
GR
GS
[0.99902 0 0 1.00077 0 -0.19998] CT
0.149 GC
2 setlinecap
1 LJ
0.5 LW
N
65.5 209.5 M
65.5 206.446 L
S
GR
GS
[0.99902 0 0 1.00077 0 -0.19998] CT
0.149 GC
2 setlinecap
1 LJ
0.5 LW
N
126.6 209.5 M
126.6 206.446 L
S
GR
GS
[0.99902 0 0 1.00077 0 -0.19998] CT
0.149 GC
2 setlinecap
1 LJ
0.5 LW
N
187.7 209.5 M
187.7 206.446 L
S
GR
GS
[0.99902 0 0 1.00077 0 -0.19998] CT
0.149 GC
2 setlinecap
1 LJ
0.5 LW
N
248.8 209.5 M
248.8 206.446 L
S
GR
GS
[0.99902 0 0 1.00077 0 -0.19998] CT
0.149 GC
2 setlinecap
1 LJ
0.5 LW
N
309.9 209.5 M
309.9 206.446 L
S
GR
GS
[0.99902 0 0 1.00077 0 -0.19998] CT
0.149 GC
2 setlinecap
1 LJ
0.5 LW
N
371 209.5 M
371 206.446 L
S
GR
GS
[0.99902 0 0 1.00077 65.4361 215.06608] CT
0.149 GC
/Helvetica 18 F
GS
[1 0 0 1 0 0] CT
-9 18 moveto 
1 -1 scale
(-1) t 
GR
GR
GS
[0.99902 0 0 1.00077 126.47649 215.06608] CT
0.149 GC
/Helvetica 18 F
GS
[1 0 0 1 0 0] CT
-5.5 18 moveto 
1 -1 scale
(0) t 
GR
GR
GS
[0.99902 0 0 1.00077 187.51688 215.06608] CT
0.149 GC
/Helvetica 18 F
GS
[1 0 0 1 0 0] CT
-5.5 18 moveto 
1 -1 scale
(1) t 
GR
GR
GS
[0.99902 0 0 1.00077 248.55728 215.06608] CT
0.149 GC
/Helvetica 18 F
GS
[1 0 0 1 0 0] CT
-5.5 18 moveto 
1 -1 scale
(2) t 
GR
GR
GS
[0.99902 0 0 1.00077 309.59766 215.06608] CT
0.149 GC
/Helvetica 18 F
GS
[1 0 0 1 0 0] CT
-5.5 18 moveto 
1 -1 scale
(3) t 
GR
GR
GS
[0.99902 0 0 1.00077 370.63805 215.06608] CT
0.149 GC
/Helvetica 18 F
GS
[1 0 0 1 0 0] CT
-5.5 18 moveto 
1 -1 scale
(4) t 
GR
GR
GS
[0.99902 0 0 1.00077 218.03723 237.48338] CT
0.149 GC
/Helvetica 18 F
GS
[1 0 0 1 0 0] CT
-113.5 18 moveto 
1 -1 scale
(Time \(s from stimulus onset\)) t 
GR
GR
GS
[0.99902 0 0 1.00077 0 -0.19998] CT
0.149 GC
2 setlinecap
1 LJ
0.5 LW
N
65.5 209.5 M
65.5 19.5 L
S
GR
GS
[0.99902 0 0 1.00077 0 -0.19998] CT
0.149 GC
2 setlinecap
1 LJ
0.5 LW
N
65.5 196.369 M
68.554 196.369 L
S
GR
GS
[0.99902 0 0 1.00077 0 -0.19998] CT
0.149 GC
2 setlinecap
1 LJ
0.5 LW
N
65.5 123.461 M
68.554 123.461 L
S
GR
GS
[0.99902 0 0 1.00077 0 -0.19998] CT
0.149 GC
2 setlinecap
1 LJ
0.5 LW
N
65.5 50.554 M
68.554 50.554 L
S
GR
GS
[0.99902 0 0 1.00077 59.84156 196.32031] CT
0.149 GC
/Helvetica 18 F
GS
[1 0 0 1 0 0] CT
-26 7 moveto 
1 -1 scale
(0.4) t 
GR
GR
GS
[0.99902 0 0 1.00077 59.84156 123.35665] CT
0.149 GC
/Helvetica 18 F
GS
[1 0 0 1 0 0] CT
-36 7 moveto 
1 -1 scale
(0.45) t 
GR
GR
GS
[0.99902 0 0 1.00077 59.84156 50.39295] CT
0.149 GC
/Helvetica 18 F
GS
[1 0 0 1 0 0] CT
-26 7 moveto 
1 -1 scale
(0.5) t 
GR
GR
GS
[0 -1.00077 0.99902 0 21.47902 114.38833] CT
0.149 GC
/Helvetica 18 F
GS
[1 0 0 1 0 0] CT
-64 -4 moveto 
1 -1 scale
(Sample entropy) t 
GR
GR
GS
[0.99902 0 0 1.00077 0 -0.19998] CT
0.974 0.9 0.9 RC
N
123.545 141.474 M
114.38 100.975 L
105.215 99.332 L
96.05 95.64 L
86.885 92.977 L
77.72 88.611 L
68.555 88.87 L
65.464 88.57 L
65.464 92.001 L
65.464 99.011 L
68.555 99.448 L
77.72 99.344 L
86.885 103.207 L
96.05 105.397 L
105.215 109.235 L
114.38 110.548 L
123.545 150.845 L
132.71 194.524 L
141.875 201.221 L
151.04 135.141 L
160.205 114.607 L
169.37 94.033 L
178.535 87.341 L
187.7 79.921 L
196.865 77.401 L
206.03 78.823 L
215.195 76.755 L
224.36 77.58 L
233.525 73.836 L
242.69 72.531 L
251.855 70.796 L
261.02 70.332 L
270.185 69.773 L
279.35 74.7 L
288.515 79.959 L
297.68 84.698 L
306.845 91.994 L
316.01 130.124 L
325.175 145.806 L
334.34 143.414 L
343.505 125.574 L
352.67 122.43 L
361.835 121.654 L
371 123.738 L
371.036 123.735 L
371.036 106.069 L
371.036 106.001 L
371 106.002 L
361.835 104.661 L
352.67 106.442 L
343.505 110.857 L
334.34 130.86 L
325.175 135.116 L
316.01 120.525 L
306.845 82.252 L
297.68 76.094 L
288.515 71.827 L
279.35 65.936 L
270.185 59.72 L
261.02 57.676 L
251.855 57.115 L
242.69 59.583 L
233.525 62.037 L
224.36 66.318 L
215.195 65.992 L
206.03 68.128 L
196.865 66.972 L
187.7 69.092 L
178.535 75.032 L
169.37 82.1 L
160.205 103.059 L
151.04 124.414 L
141.875 191.888 L
132.71 184.958 L
cp
f
GR
GS
[0.99902 0 0 1.00077 0 -0.19998] CT
0.957 0.82 0.82 RC
1 LJ
0.5 LW
N
65.464 99.011 M
68.555 99.448 L
77.72 99.344 L
86.885 103.207 L
96.05 105.397 L
105.215 109.235 L
114.38 110.548 L
123.545 150.845 L
132.71 194.524 L
141.875 201.221 L
151.04 135.141 L
160.205 114.607 L
169.37 94.033 L
178.535 87.341 L
187.7 79.921 L
196.865 77.401 L
206.03 78.823 L
215.195 76.755 L
224.36 77.58 L
233.525 73.836 L
242.69 72.531 L
251.855 70.796 L
261.02 70.332 L
270.185 69.773 L
279.35 74.7 L
288.515 79.959 L
297.68 84.698 L
306.845 91.994 L
316.01 130.124 L
325.175 145.806 L
334.34 143.414 L
343.505 125.574 L
352.67 122.43 L
361.835 121.654 L
371 123.738 L
371.036 123.735 L
S
GR
GS
[0.99902 0 0 1.00077 0 -0.19998] CT
0.957 0.82 0.82 RC
1 LJ
0.5 LW
N
65.464 88.57 M
68.555 88.87 L
77.72 88.611 L
86.885 92.977 L
96.05 95.64 L
105.215 99.332 L
114.38 100.975 L
123.545 141.474 L
132.71 184.958 L
141.875 191.888 L
151.04 124.414 L
160.205 103.059 L
169.37 82.1 L
178.535 75.032 L
187.7 69.092 L
196.865 66.972 L
206.03 68.128 L
215.195 65.992 L
224.36 66.318 L
233.525 62.037 L
242.69 59.583 L
251.855 57.115 L
261.02 57.676 L
270.185 59.72 L
279.35 65.936 L
288.515 71.827 L
297.68 76.094 L
306.845 82.252 L
316.01 120.525 L
325.175 135.116 L
334.34 130.86 L
343.505 110.857 L
352.67 106.442 L
361.835 104.661 L
371 106.002 L
371.036 106.001 L
S
GR
GS
[0.99902 0 0 1.00077 0 -0.19998] CT
0.898 0.6 0.6 RC
1 LJ
2 LW
N
65.464 93.791 M
68.555 94.159 L
77.72 93.977 L
86.885 98.092 L
96.05 100.519 L
105.215 104.283 L
114.38 105.762 L
123.545 146.159 L
132.71 189.741 L
141.875 196.554 L
151.04 129.777 L
160.205 108.833 L
169.37 88.067 L
178.535 81.186 L
187.7 74.507 L
196.865 72.187 L
206.03 73.475 L
215.195 71.374 L
224.36 71.949 L
233.525 67.937 L
242.69 66.057 L
251.855 63.955 L
261.02 64.004 L
270.185 64.746 L
279.35 70.318 L
288.515 75.893 L
297.68 80.396 L
306.845 87.123 L
316.01 125.324 L
325.175 140.461 L
334.34 137.137 L
343.505 118.215 L
352.67 114.436 L
361.835 113.157 L
371 114.87 L
371.036 114.868 L
S
GR
GS
[0.99902 0 0 1.00077 0 -0.19998] CT
1 0.875 0.875 RC
N
114.38 109.054 M
123.545 142.975 L
132.71 181.702 L
141.875 185.068 L
151.04 116.513 L
160.205 99.64 L
169.37 79.372 L
178.535 71.523 L
187.7 64.85 L
196.865 61.81 L
206.03 60.136 L
215.195 57.543 L
224.36 51.384 L
233.525 47.736 L
242.69 41.975 L
251.855 46.018 L
261.02 49.925 L
270.185 53.847 L
279.35 56.127 L
288.515 59.519 L
297.68 63.883 L
306.845 70.459 L
316.01 112.851 L
325.175 130.249 L
334.34 123.404 L
343.505 101.931 L
352.67 90.035 L
361.835 88.438 L
371 87.88 L
371.036 87.871 L
371.036 79.326 L
371.036 79.295 L
371 79.301 L
361.835 78.92 L
352.67 80.09 L
343.505 91.423 L
334.34 113.554 L
325.175 120.911 L
316.01 104.483 L
306.845 62.423 L
297.68 55.501 L
288.515 50.225 L
279.35 46.49 L
270.185 43.721 L
261.02 39.046 L
251.855 33.608 L
242.69 28.892 L
233.525 36.077 L
224.36 40.565 L
215.195 47.536 L
206.03 51.438 L
196.865 52.82 L
187.7 55.56 L
178.535 60.508 L
169.37 68.389 L
160.205 89.2 L
151.04 107.357 L
141.875 178.326 L
132.71 174.033 L
123.545 134.975 L
114.38 100.07 L
105.215 98.26 L
96.05 93.643 L
86.885 89.851 L
77.72 85.113 L
68.555 86.098 L
65.464 87.149 L
65.464 92.901 L
65.464 95.985 L
68.555 94.778 L
77.72 94.593 L
86.885 99.125 L
96.05 102.97 L
105.215 107.58 L
cp
f
GR
GS
[0.99902 0 0 1.00077 0 -0.19998] CT
1 0.776 0.776 RC
1 LJ
0.5 LW
N
65.464 95.985 M
68.555 94.778 L
77.72 94.593 L
86.885 99.125 L
96.05 102.97 L
105.215 107.58 L
114.38 109.054 L
123.545 142.975 L
132.71 181.702 L
141.875 185.068 L
151.04 116.513 L
160.205 99.64 L
169.37 79.372 L
178.535 71.523 L
187.7 64.85 L
196.865 61.81 L
206.03 60.136 L
215.195 57.543 L
224.36 51.384 L
233.525 47.736 L
242.69 41.975 L
251.855 46.018 L
261.02 49.925 L
270.185 53.847 L
279.35 56.127 L
288.515 59.519 L
297.68 63.883 L
306.845 70.459 L
316.01 112.851 L
325.175 130.249 L
334.34 123.404 L
343.505 101.931 L
352.67 90.035 L
361.835 88.438 L
371 87.88 L
371.036 87.871 L
S
GR
GS
[0.99902 0 0 1.00077 0 -0.19998] CT
1 0.776 0.776 RC
1 LJ
0.5 LW
N
65.464 87.149 M
68.555 86.098 L
77.72 85.113 L
86.885 89.851 L
96.05 93.643 L
105.215 98.26 L
114.38 100.07 L
123.545 134.975 L
132.71 174.033 L
141.875 178.326 L
151.04 107.357 L
160.205 89.2 L
169.37 68.389 L
178.535 60.508 L
187.7 55.56 L
196.865 52.82 L
206.03 51.438 L
215.195 47.536 L
224.36 40.565 L
233.525 36.077 L
242.69 28.892 L
251.855 33.608 L
261.02 39.046 L
270.185 43.721 L
279.35 46.49 L
288.515 50.225 L
297.68 55.501 L
306.845 62.423 L
316.01 104.483 L
325.175 120.911 L
334.34 113.554 L
343.505 91.423 L
352.67 80.09 L
361.835 78.92 L
371 79.301 L
371.036 79.295 L
S
GR
GS
[0.99902 0 0 1.00077 0 -0.19998] CT
1 0.502 0.502 RC
1 LJ
2 LW
N
65.464 91.567 M
68.555 90.438 L
77.72 89.853 L
86.885 94.488 L
96.05 98.307 L
105.215 102.92 L
114.38 104.562 L
123.545 138.975 L
132.71 177.868 L
141.875 181.697 L
151.04 111.935 L
160.205 94.42 L
169.37 73.881 L
178.535 66.016 L
187.7 60.205 L
196.865 57.315 L
206.03 55.787 L
215.195 52.539 L
224.36 45.974 L
233.525 41.907 L
242.69 35.434 L
251.855 39.813 L
261.02 44.485 L
270.185 48.784 L
279.35 51.309 L
288.515 54.872 L
297.68 59.692 L
306.845 66.441 L
316.01 108.667 L
325.175 125.58 L
334.34 118.479 L
343.505 96.677 L
352.67 85.063 L
361.835 83.679 L
371 83.591 L
371.036 83.583 L
S
GR
GS
[0.99902 0 0 1.00077 0 -0.19998] CT
0.974 0.825 0.825 RC
N
123.545 139.868 M
132.71 177.242 L
141.875 179.624 L
151.04 106.918 L
160.205 85.35 L
169.37 71.92 L
178.535 68.794 L
187.7 67.724 L
196.865 66.186 L
206.03 62.567 L
215.195 60.985 L
224.36 61.897 L
233.525 60.169 L
242.69 56.165 L
251.855 48.729 L
261.02 46.501 L
270.185 53.715 L
279.35 63.685 L
288.515 73.456 L
297.68 78.887 L
306.845 85.839 L
316.01 119.266 L
325.175 130.218 L
334.34 119.373 L
343.505 90.056 L
352.67 78.061 L
361.835 79.222 L
371 81.168 L
371.036 81.184 L
371.036 81.142 L
371.036 69.769 L
371 69.75 L
361.835 68.867 L
352.67 67.975 L
343.505 81.325 L
334.34 110.715 L
325.175 121.542 L
316.01 109.863 L
306.845 75.262 L
297.68 67.725 L
288.515 60.722 L
279.35 50.575 L
270.185 40.817 L
261.02 34.72 L
251.855 36.511 L
242.69 43.076 L
233.525 47.112 L
224.36 49.162 L
215.195 50.001 L
206.03 52.864 L
196.865 56.631 L
187.7 58.345 L
178.535 58.677 L
169.37 62.275 L
160.205 76.608 L
151.04 99.212 L
141.875 172.223 L
132.71 169.139 L
123.545 130.69 L
114.38 92.053 L
105.215 86.645 L
96.05 86.341 L
86.885 88.348 L
77.72 93.531 L
68.555 98.091 L
65.464 98.071 L
65.464 105.581 L
65.464 109.783 L
68.555 109.424 L
77.72 103.954 L
86.885 98.427 L
96.05 96.538 L
105.215 96.517 L
114.38 102.045 L
cp
f
GR
GS
[0.99902 0 0 1.00077 0 -0.19998] CT
0.957 0.686 0.686 RC
1 LJ
0.5 LW
N
65.464 109.783 M
68.555 109.424 L
77.72 103.954 L
86.885 98.427 L
96.05 96.538 L
105.215 96.517 L
114.38 102.045 L
123.545 139.868 L
132.71 177.242 L
141.875 179.624 L
151.04 106.918 L
160.205 85.35 L
169.37 71.92 L
178.535 68.794 L
187.7 67.724 L
196.865 66.186 L
206.03 62.567 L
215.195 60.985 L
224.36 61.897 L
233.525 60.169 L
242.69 56.165 L
251.855 48.729 L
261.02 46.501 L
270.185 53.715 L
279.35 63.685 L
288.515 73.456 L
297.68 78.887 L
306.845 85.839 L
316.01 119.266 L
325.175 130.218 L
334.34 119.373 L
343.505 90.056 L
352.67 78.061 L
361.835 79.222 L
371 81.168 L
371.036 81.184 L
S
GR
GS
[0.99902 0 0 1.00077 0 -0.19998] CT
0.957 0.686 0.686 RC
1 LJ
0.5 LW
N
65.464 98.071 M
68.555 98.091 L
77.72 93.531 L
86.885 88.348 L
96.05 86.341 L
105.215 86.645 L
114.38 92.053 L
123.545 130.69 L
132.71 169.139 L
141.875 172.223 L
151.04 99.212 L
160.205 76.608 L
169.37 62.275 L
178.535 58.677 L
187.7 58.345 L
196.865 56.631 L
206.03 52.864 L
215.195 50.001 L
224.36 49.162 L
233.525 47.112 L
242.69 43.076 L
251.855 36.511 L
261.02 34.72 L
270.185 40.817 L
279.35 50.575 L
288.515 60.722 L
297.68 67.725 L
306.845 75.262 L
316.01 109.863 L
325.175 121.542 L
334.34 110.715 L
343.505 81.325 L
352.67 67.975 L
361.835 68.867 L
371 69.75 L
371.036 69.769 L
S
GR
GS
[0.99902 0 0 1.00077 0 -0.19998] CT
0.898 0.302 0.302 RC
1 LJ
2 LW
N
65.464 103.927 M
68.555 103.757 L
77.72 98.742 L
86.885 93.388 L
96.05 91.439 L
105.215 91.581 L
114.38 97.049 L
123.545 135.279 L
132.71 173.191 L
141.875 175.924 L
151.04 103.065 L
160.205 80.979 L
169.37 67.098 L
178.535 63.736 L
187.7 63.035 L
196.865 61.408 L
206.03 57.716 L
215.195 55.493 L
224.36 55.529 L
233.525 53.641 L
242.69 49.621 L
251.855 42.62 L
261.02 40.61 L
270.185 47.266 L
279.35 57.13 L
288.515 67.089 L
297.68 73.306 L
306.845 80.551 L
316.01 114.565 L
325.175 125.88 L
334.34 115.044 L
343.505 85.69 L
352.67 73.018 L
361.835 74.045 L
371 75.459 L
371.036 75.476 L
S
GR
GS
[0.99902 0 0 1.00077 0 -0.19998] CT
0.9 0.799 0.799 RC
N
123.545 125.539 M
114.38 91.264 L
105.215 88.267 L
96.05 91.039 L
86.885 92.182 L
77.72 95.834 L
68.555 95.832 L
65.464 95.401 L
65.464 100.291 L
65.464 109.17 L
68.555 109.231 L
77.72 106.479 L
86.885 100.939 L
96.05 99.871 L
105.215 97.281 L
114.38 99.965 L
123.545 133.359 L
132.71 174.227 L
141.875 179.318 L
151.04 117.662 L
160.205 94.16 L
169.37 77.891 L
178.535 72.579 L
187.7 68.233 L
196.865 62.207 L
206.03 56.841 L
215.195 53.26 L
224.36 52.043 L
233.525 50.819 L
242.69 47.776 L
251.855 45.935 L
261.02 43.499 L
270.185 45.399 L
279.35 45.527 L
288.515 54.872 L
297.68 60.923 L
306.845 70.313 L
316.01 107.803 L
325.175 116.979 L
334.34 108.15 L
343.505 79.285 L
352.67 71.029 L
361.835 73.11 L
371 73.546 L
371.036 73.561 L
371.036 73.514 L
371.036 59.991 L
371 59.969 L
361.835 57.676 L
352.67 55.743 L
343.505 65.423 L
334.34 96.98 L
325.175 107.289 L
316.01 98.313 L
306.845 59.763 L
297.68 49.914 L
288.515 43.155 L
279.35 32.807 L
270.185 32.411 L
261.02 31.444 L
251.855 35.176 L
242.69 36.868 L
233.525 39.448 L
224.36 40.674 L
215.195 42.232 L
206.03 46.085 L
196.865 52.563 L
187.7 58.86 L
178.535 63.614 L
169.37 68.077 L
160.205 83.691 L
151.04 107.867 L
141.875 171.188 L
132.71 166.59 L
cp
f
GR
GS
[0.99902 0 0 1.00077 0 -0.19998] CT
0.82 0.639 0.639 RC
1 LJ
0.5 LW
N
65.464 109.17 M
68.555 109.231 L
77.72 106.479 L
86.885 100.939 L
96.05 99.871 L
105.215 97.281 L
114.38 99.965 L
123.545 133.359 L
132.71 174.227 L
141.875 179.318 L
151.04 117.662 L
160.205 94.16 L
169.37 77.891 L
178.535 72.579 L
187.7 68.233 L
196.865 62.207 L
206.03 56.841 L
215.195 53.26 L
224.36 52.043 L
233.525 50.819 L
242.69 47.776 L
251.855 45.935 L
261.02 43.499 L
270.185 45.399 L
279.35 45.527 L
288.515 54.872 L
297.68 60.923 L
306.845 70.313 L
316.01 107.803 L
325.175 116.979 L
334.34 108.15 L
343.505 79.285 L
352.67 71.029 L
361.835 73.11 L
371 73.546 L
371.036 73.561 L
S
GR
GS
[0.99902 0 0 1.00077 0 -0.19998] CT
0.82 0.639 0.639 RC
1 LJ
0.5 LW
N
65.464 95.401 M
68.555 95.832 L
77.72 95.834 L
86.885 92.182 L
96.05 91.039 L
105.215 88.267 L
114.38 91.264 L
123.545 125.539 L
132.71 166.59 L
141.875 171.188 L
151.04 107.867 L
160.205 83.691 L
169.37 68.077 L
178.535 63.614 L
187.7 58.86 L
196.865 52.563 L
206.03 46.085 L
215.195 42.232 L
224.36 40.674 L
233.525 39.448 L
242.69 36.868 L
251.855 35.176 L
261.02 31.444 L
270.185 32.411 L
279.35 32.807 L
288.515 43.155 L
297.68 49.914 L
306.845 59.763 L
316.01 98.313 L
325.175 107.289 L
334.34 96.98 L
343.505 65.423 L
352.67 55.743 L
361.835 57.676 L
371 59.969 L
371.036 59.991 L
S
GR
GS
[0.99902 0 0 1.00077 0 -0.19998] CT
0.6 0.2 0.2 RC
1 LJ
2 LW
N
65.464 102.285 M
68.555 102.531 L
77.72 101.157 L
86.885 96.561 L
96.05 95.455 L
105.215 92.774 L
114.38 95.615 L
123.545 129.449 L
132.71 170.409 L
141.875 175.253 L
151.04 112.765 L
160.205 88.926 L
169.37 72.984 L
178.535 68.096 L
187.7 63.546 L
196.865 57.385 L
206.03 51.463 L
215.195 47.746 L
224.36 46.359 L
233.525 45.134 L
242.69 42.322 L
251.855 40.556 L
261.02 37.472 L
270.185 38.905 L
279.35 39.167 L
288.515 49.013 L
297.68 55.418 L
306.845 65.038 L
316.01 103.058 L
325.175 112.134 L
334.34 102.565 L
343.505 72.354 L
352.67 63.386 L
361.835 65.393 L
371 66.757 L
371.036 66.776 L
S
GR
GS
[0.99902 0 0 1.00077 202.80195 135.40464] CT
/Helvetica 15 F
GS
[1 0 0 1 0 0] CT
0 5.5 moveto 
1 -1 scale
(1 Target) t 
GR
GR
GS
[0.99902 0 0 1.00077 0 -0.19998] CT
0.898 0.6 0.6 RC
1 LJ
2 LW
N
170 135.5 M
200 135.5 L
S
GR
GS
[0.99902 0 0 1.00077 202.80195 153.91893] CT
/Helvetica 15 F
GS
[1 0 0 1 0 0] CT
0 5.5 moveto 
1 -1 scale
(2 Targets) t 
GR
GR
GS
[0.99902 0 0 1.00077 0 -0.19998] CT
1 0.502 0.502 RC
1 LJ
2 LW
N
170 154 M
200 154 L
S
GR
GS
[0.99902 0 0 1.00077 202.80195 172.43321] CT
/Helvetica 15 F
GS
[1 0 0 1 0 0] CT
0 5.5 moveto 
1 -1 scale
(3 Targets) t 
GR
GR
GS
[0.99902 0 0 1.00077 0 -0.19998] CT
0.898 0.302 0.302 RC
1 LJ
2 LW
N
170 172.5 M
200 172.5 L
S
GR
GS
[0.99902 0 0 1.00077 202.80195 190.9475] CT
/Helvetica 15 F
GS
[1 0 0 1 0 0] CT
0 5.5 moveto 
1 -1 scale
(4 Targets) t 
GR
GR
GS
[0.99902 0 0 1.00077 0 -0.19998] CT
0.6 0.2 0.2 RC
1 LJ
2 LW
N
170 191 M
200 191 L
S
GR
%%Trailer
%%Pages: 1
%%EOF
