%!PS-Adobe-3.0 EPSF-3.0
%%Creator: (MATLAB, The Mathworks, Inc. Version 9.8.0.1323502 \(R2020a\). Operating System: Mac OS X)
%%Title: /Users/kosciessa/Desktop/tardis/LNDG/stateswitch/stsw_eeg_task/mse/figures/e02_EntropyTraces_yaoa.eps
%%CreationDate: 2022-02-18T14:16:25
%%Pages: (atend)
%%BoundingBox:     4     0   375   240
%%LanguageLevel: 3
%%EndComments
%%BeginProlog
%%BeginResource: procset (Apache XML Graphics Std ProcSet) 1.2 0
%%Version: 1.2 0
%%Copyright: (Copyright 2001-2003,2010 The Apache Software Foundation. License terms: http://www.apache.org/licenses/LICENSE-2.0)
/bd{bind def}bind def
/ld{load def}bd
/GR/grestore ld
/GS/gsave ld
/RM/rmoveto ld
/C/curveto ld
/t/show ld
/L/lineto ld
/ML/setmiterlimit ld
/CT/concat ld
/f/fill ld
/N/newpath ld
/S/stroke ld
/CC/setcmykcolor ld
/A/ashow ld
/cp/closepath ld
/RC/setrgbcolor ld
/LJ/setlinejoin ld
/GC/setgray ld
/LW/setlinewidth ld
/M/moveto ld
/re {4 2 roll M
1 index 0 rlineto
0 exch rlineto
neg 0 rlineto
cp } bd
/_ctm matrix def
/_tm matrix def
/BT { _ctm currentmatrix pop matrix _tm copy pop 0 0 moveto } bd
/ET { _ctm setmatrix } bd
/iTm { _ctm setmatrix _tm concat } bd
/Tm { _tm astore pop iTm 0 0 moveto } bd
/ux 0.0 def
/uy 0.0 def
/F {
  /Tp exch def
  /Tf exch def
  Tf findfont Tp scalefont setfont
  /cf Tf def  /cs Tp def
} bd
/ULS {currentpoint /uy exch def /ux exch def} bd
/ULE {
  /Tcx currentpoint pop def
  gsave
  newpath
  cf findfont cs scalefont dup
  /FontMatrix get 0 get /Ts exch def /FontInfo get dup
  /UnderlinePosition get Ts mul /To exch def
  /UnderlineThickness get Ts mul /Tt exch def
  ux uy To add moveto  Tcx uy To add lineto
  Tt setlinewidth stroke
  grestore
} bd
/OLE {
  /Tcx currentpoint pop def
  gsave
  newpath
  cf findfont cs scalefont dup
  /FontMatrix get 0 get /Ts exch def /FontInfo get dup
  /UnderlinePosition get Ts mul /To exch def
  /UnderlineThickness get Ts mul /Tt exch def
  ux uy To add cs add moveto Tcx uy To add cs add lineto
  Tt setlinewidth stroke
  grestore
} bd
/SOE {
  /Tcx currentpoint pop def
  gsave
  newpath
  cf findfont cs scalefont dup
  /FontMatrix get 0 get /Ts exch def /FontInfo get dup
  /UnderlinePosition get Ts mul /To exch def
  /UnderlineThickness get Ts mul /Tt exch def
  ux uy To add cs 10 mul 26 idiv add moveto Tcx uy To add cs 10 mul 26 idiv add lineto
  Tt setlinewidth stroke
  grestore
} bd
/QT {
/Y22 exch store
/X22 exch store
/Y21 exch store
/X21 exch store
currentpoint
/Y21 load 2 mul add 3 div exch
/X21 load 2 mul add 3 div exch
/X21 load 2 mul /X22 load add 3 div
/Y21 load 2 mul /Y22 load add 3 div
/X22 load /Y22 load curveto
} bd
/SSPD {
dup length /d exch dict def
{
/v exch def
/k exch def
currentpagedevice k known {
/cpdv currentpagedevice k get def
v cpdv ne {
/upd false def
/nullv v type /nulltype eq def
/nullcpdv cpdv type /nulltype eq def
nullv nullcpdv or
{
/upd true def
} {
/sametype v type cpdv type eq def
sametype {
v type /arraytype eq {
/vlen v length def
/cpdvlen cpdv length def
vlen cpdvlen eq {
0 1 vlen 1 sub {
/i exch def
/obj v i get def
/cpdobj cpdv i get def
obj cpdobj ne {
/upd true def
exit
} if
} for
} {
/upd true def
} ifelse
} {
v type /dicttype eq {
v {
/dv exch def
/dk exch def
/cpddv cpdv dk get def
dv cpddv ne {
/upd true def
exit
} if
} forall
} {
/upd true def
} ifelse
} ifelse
} if
} ifelse
upd true eq {
d k v put
} if
} if
} if
} forall
d length 0 gt {
d setpagedevice
} if
} bd
/RE { % /NewFontName [NewEncodingArray] /FontName RE -
  findfont dup length dict begin
  {
    1 index /FID ne
    {def} {pop pop} ifelse
  } forall
  /Encoding exch def
  /FontName 1 index def
  currentdict definefont pop
  end
} bind def
%%EndResource
%%BeginResource: procset (Apache XML Graphics EPS ProcSet) 1.0 0
%%Version: 1.0 0
%%Copyright: (Copyright 2002-2003 The Apache Software Foundation. License terms: http://www.apache.org/licenses/LICENSE-2.0)
/BeginEPSF { %def
/b4_Inc_state save def         % Save state for cleanup
/dict_count countdictstack def % Count objects on dict stack
/op_count count 1 sub def      % Count objects on operand stack
userdict begin                 % Push userdict on dict stack
/showpage { } def              % Redefine showpage, { } = null proc
0 setgray 0 setlinecap         % Prepare graphics state
1 setlinewidth 0 setlinejoin
10 setmiterlimit [ ] 0 setdash newpath
/languagelevel where           % If level not equal to 1 then
{pop languagelevel             % set strokeadjust and
1 ne                           % overprint to their defaults.
{false setstrokeadjust false setoverprint
} if
} if
} bd
/EndEPSF { %def
count op_count sub {pop} repeat            % Clean up stacks
countdictstack dict_count sub {end} repeat
b4_Inc_state restore
} bd
%%EndResource
%FOPBeginFontDict
%%IncludeResource: font Courier-Oblique
%%IncludeResource: font Courier-BoldOblique
%%IncludeResource: font Courier-Bold
%%IncludeResource: font ZapfDingbats
%%IncludeResource: font Symbol
%%IncludeResource: font Helvetica
%%IncludeResource: font Helvetica-Oblique
%%IncludeResource: font Helvetica-Bold
%%IncludeResource: font Helvetica-BoldOblique
%%IncludeResource: font Times-Roman
%%IncludeResource: font Times-Italic
%%IncludeResource: font Times-Bold
%%IncludeResource: font Times-BoldItalic
%%IncludeResource: font Courier
%FOPEndFontDict
%%BeginResource: encoding WinAnsiEncoding
/WinAnsiEncoding [
/.notdef /.notdef /.notdef /.notdef /.notdef
/.notdef /.notdef /.notdef /.notdef /.notdef
/.notdef /.notdef /.notdef /.notdef /.notdef
/.notdef /.notdef /.notdef /.notdef /.notdef
/.notdef /.notdef /.notdef /.notdef /.notdef
/.notdef /.notdef /.notdef /.notdef /.notdef
/.notdef /.notdef /space /exclam /quotedbl
/numbersign /dollar /percent /ampersand /quotesingle
/parenleft /parenright /asterisk /plus /comma
/hyphen /period /slash /zero /one
/two /three /four /five /six
/seven /eight /nine /colon /semicolon
/less /equal /greater /question /at
/A /B /C /D /E
/F /G /H /I /J
/K /L /M /N /O
/P /Q /R /S /T
/U /V /W /X /Y
/Z /bracketleft /backslash /bracketright /asciicircum
/underscore /quoteleft /a /b /c
/d /e /f /g /h
/i /j /k /l /m
/n /o /p /q /r
/s /t /u /v /w
/x /y /z /braceleft /bar
/braceright /asciitilde /bullet /Euro /bullet
/quotesinglbase /florin /quotedblbase /ellipsis /dagger
/daggerdbl /circumflex /perthousand /Scaron /guilsinglleft
/OE /bullet /Zcaron /bullet /bullet
/quoteleft /quoteright /quotedblleft /quotedblright /bullet
/endash /emdash /asciitilde /trademark /scaron
/guilsinglright /oe /bullet /zcaron /Ydieresis
/space /exclamdown /cent /sterling /currency
/yen /brokenbar /section /dieresis /copyright
/ordfeminine /guillemotleft /logicalnot /sfthyphen /registered
/macron /degree /plusminus /twosuperior /threesuperior
/acute /mu /paragraph /middot /cedilla
/onesuperior /ordmasculine /guillemotright /onequarter /onehalf
/threequarters /questiondown /Agrave /Aacute /Acircumflex
/Atilde /Adieresis /Aring /AE /Ccedilla
/Egrave /Eacute /Ecircumflex /Edieresis /Igrave
/Iacute /Icircumflex /Idieresis /Eth /Ntilde
/Ograve /Oacute /Ocircumflex /Otilde /Odieresis
/multiply /Oslash /Ugrave /Uacute /Ucircumflex
/Udieresis /Yacute /Thorn /germandbls /agrave
/aacute /acircumflex /atilde /adieresis /aring
/ae /ccedilla /egrave /eacute /ecircumflex
/edieresis /igrave /iacute /icircumflex /idieresis
/eth /ntilde /ograve /oacute /ocircumflex
/otilde /odieresis /divide /oslash /ugrave
/uacute /ucircumflex /udieresis /yacute /thorn
/ydieresis
] def
%%EndResource
%FOPBeginFontReencode
/Courier-Oblique findfont
dup length dict begin
  {1 index /FID ne {def} {pop pop} ifelse} forall
  /Encoding WinAnsiEncoding def
  currentdict
end
/Courier-Oblique exch definefont pop
/Courier-BoldOblique findfont
dup length dict begin
  {1 index /FID ne {def} {pop pop} ifelse} forall
  /Encoding WinAnsiEncoding def
  currentdict
end
/Courier-BoldOblique exch definefont pop
/Courier-Bold findfont
dup length dict begin
  {1 index /FID ne {def} {pop pop} ifelse} forall
  /Encoding WinAnsiEncoding def
  currentdict
end
/Courier-Bold exch definefont pop
/Helvetica findfont
dup length dict begin
  {1 index /FID ne {def} {pop pop} ifelse} forall
  /Encoding WinAnsiEncoding def
  currentdict
end
/Helvetica exch definefont pop
/Helvetica-Oblique findfont
dup length dict begin
  {1 index /FID ne {def} {pop pop} ifelse} forall
  /Encoding WinAnsiEncoding def
  currentdict
end
/Helvetica-Oblique exch definefont pop
/Helvetica-Bold findfont
dup length dict begin
  {1 index /FID ne {def} {pop pop} ifelse} forall
  /Encoding WinAnsiEncoding def
  currentdict
end
/Helvetica-Bold exch definefont pop
/Helvetica-BoldOblique findfont
dup length dict begin
  {1 index /FID ne {def} {pop pop} ifelse} forall
  /Encoding WinAnsiEncoding def
  currentdict
end
/Helvetica-BoldOblique exch definefont pop
/Times-Roman findfont
dup length dict begin
  {1 index /FID ne {def} {pop pop} ifelse} forall
  /Encoding WinAnsiEncoding def
  currentdict
end
/Times-Roman exch definefont pop
/Times-Italic findfont
dup length dict begin
  {1 index /FID ne {def} {pop pop} ifelse} forall
  /Encoding WinAnsiEncoding def
  currentdict
end
/Times-Italic exch definefont pop
/Times-Bold findfont
dup length dict begin
  {1 index /FID ne {def} {pop pop} ifelse} forall
  /Encoding WinAnsiEncoding def
  currentdict
end
/Times-Bold exch definefont pop
/Times-BoldItalic findfont
dup length dict begin
  {1 index /FID ne {def} {pop pop} ifelse} forall
  /Encoding WinAnsiEncoding def
  currentdict
end
/Times-BoldItalic exch definefont pop
/Courier findfont
dup length dict begin
  {1 index /FID ne {def} {pop pop} ifelse} forall
  /Encoding WinAnsiEncoding def
  currentdict
end
/Courier exch definefont pop
%FOPEndFontReencode
%%EndProlog
%%Page: 1 1
%%PageBoundingBox: 0 0 410 259
%%BeginPageSetup
[1 0 0 -1 0 259] CT
%%EndPageSetup
GS
[0.99902 0 0 1.00077 0 -0.19998] CT
1 GC
N
0 0 410 259 re
f
GR
GS
[0.99902 0 0 1.00077 0 -0.19998] CT
1 GC
N
0 0 410 259 re
f
GR
GS
[0.99902 0 0 1.00077 0 -0.19998] CT
1 GC
N
65.5 209.5 M
371 209.5 L
371 19.5 L
65.5 19.5 L
cp
f
GR
GS
[0.99902 0 0 1.00077 0 -0.19998] CT
0.149 GC
2 setlinecap
1 LJ
0.5 LW
N
65.5 209.5 M
371 209.5 L
S
GR
GS
[0.99902 0 0 1.00077 0 -0.19998] CT
0.149 GC
2 setlinecap
1 LJ
0.5 LW
N
65.5 209.5 M
65.5 206.446 L
S
GR
GS
[0.99902 0 0 1.00077 0 -0.19998] CT
0.149 GC
2 setlinecap
1 LJ
0.5 LW
N
126.6 209.5 M
126.6 206.446 L
S
GR
GS
[0.99902 0 0 1.00077 0 -0.19998] CT
0.149 GC
2 setlinecap
1 LJ
0.5 LW
N
187.7 209.5 M
187.7 206.446 L
S
GR
GS
[0.99902 0 0 1.00077 0 -0.19998] CT
0.149 GC
2 setlinecap
1 LJ
0.5 LW
N
248.8 209.5 M
248.8 206.446 L
S
GR
GS
[0.99902 0 0 1.00077 0 -0.19998] CT
0.149 GC
2 setlinecap
1 LJ
0.5 LW
N
309.9 209.5 M
309.9 206.446 L
S
GR
GS
[0.99902 0 0 1.00077 0 -0.19998] CT
0.149 GC
2 setlinecap
1 LJ
0.5 LW
N
371 209.5 M
371 206.446 L
S
GR
GS
[0.99902 0 0 1.00077 65.4361 215.06609] CT
0.149 GC
/Helvetica 18 F
GS
[1 0 0 1 0 0] CT
-9 18 moveto 
1 -1 scale
(-1) t 
GR
GR
GS
[0.99902 0 0 1.00077 126.47649 215.06609] CT
0.149 GC
/Helvetica 18 F
GS
[1 0 0 1 0 0] CT
-5.5 18 moveto 
1 -1 scale
(0) t 
GR
GR
GS
[0.99902 0 0 1.00077 187.51688 215.06609] CT
0.149 GC
/Helvetica 18 F
GS
[1 0 0 1 0 0] CT
-5.5 18 moveto 
1 -1 scale
(1) t 
GR
GR
GS
[0.99902 0 0 1.00077 248.55728 215.06609] CT
0.149 GC
/Helvetica 18 F
GS
[1 0 0 1 0 0] CT
-5.5 18 moveto 
1 -1 scale
(2) t 
GR
GR
GS
[0.99902 0 0 1.00077 309.59766 215.06609] CT
0.149 GC
/Helvetica 18 F
GS
[1 0 0 1 0 0] CT
-5.5 18 moveto 
1 -1 scale
(3) t 
GR
GR
GS
[0.99902 0 0 1.00077 370.63805 215.06609] CT
0.149 GC
/Helvetica 18 F
GS
[1 0 0 1 0 0] CT
-5.5 18 moveto 
1 -1 scale
(4) t 
GR
GR
GS
[0.99902 0 0 1.00077 218.03723 237.48341] CT
0.149 GC
/Helvetica 18 F
GS
[1 0 0 1 0 0] CT
-113.5 18 moveto 
1 -1 scale
(Time \(s from stimulus onset\)) t 
GR
GR
GS
[0.99902 0 0 1.00077 0 -0.19998] CT
0.149 GC
2 setlinecap
1 LJ
0.5 LW
N
65.5 209.5 M
65.5 19.5 L
S
GR
GS
[0.99902 0 0 1.00077 0 -0.19998] CT
0.149 GC
2 setlinecap
1 LJ
0.5 LW
N
65.5 199.407 M
68.554 199.407 L
S
GR
GS
[0.99902 0 0 1.00077 0 -0.19998] CT
0.149 GC
2 setlinecap
1 LJ
0.5 LW
N
65.5 168.713 M
68.554 168.713 L
S
GR
GS
[0.99902 0 0 1.00077 0 -0.19998] CT
0.149 GC
2 setlinecap
1 LJ
0.5 LW
N
65.5 138.019 M
68.554 138.019 L
S
GR
GS
[0.99902 0 0 1.00077 0 -0.19998] CT
0.149 GC
2 setlinecap
1 LJ
0.5 LW
N
65.5 107.326 M
68.554 107.326 L
S
GR
GS
[0.99902 0 0 1.00077 0 -0.19998] CT
0.149 GC
2 setlinecap
1 LJ
0.5 LW
N
65.5 76.632 M
68.554 76.632 L
S
GR
GS
[0.99902 0 0 1.00077 0 -0.19998] CT
0.149 GC
2 setlinecap
1 LJ
0.5 LW
N
65.5 45.938 M
68.554 45.938 L
S
GR
GS
[0.99902 0 0 1.00077 59.84156 199.36086] CT
0.149 GC
/Helvetica 18 F
GS
[1 0 0 1 0 0] CT
-36 7 moveto 
1 -1 scale
(0.42) t 
GR
GR
GS
[0.99902 0 0 1.00077 59.84156 168.64344] CT
0.149 GC
/Helvetica 18 F
GS
[1 0 0 1 0 0] CT
-36 7 moveto 
1 -1 scale
(0.44) t 
GR
GR
GS
[0.99902 0 0 1.00077 59.84156 137.926] CT
0.149 GC
/Helvetica 18 F
GS
[1 0 0 1 0 0] CT
-36 7 moveto 
1 -1 scale
(0.46) t 
GR
GR
GS
[0.99902 0 0 1.00077 59.84156 107.20862] CT
0.149 GC
/Helvetica 18 F
GS
[1 0 0 1 0 0] CT
-36 7 moveto 
1 -1 scale
(0.48) t 
GR
GR
GS
[0.99902 0 0 1.00077 59.84156 76.49118] CT
0.149 GC
/Helvetica 18 F
GS
[1 0 0 1 0 0] CT
-26 7 moveto 
1 -1 scale
(0.5) t 
GR
GR
GS
[0.99902 0 0 1.00077 59.84156 45.77379] CT
0.149 GC
/Helvetica 18 F
GS
[1 0 0 1 0 0] CT
-36 7 moveto 
1 -1 scale
(0.52) t 
GR
GR
GS
[0 -1.00077 0.99902 0 21.47902 114.38835] CT
0.149 GC
/Helvetica 18 F
GS
[1 0 0 1 0 0] CT
-64 -4 moveto 
1 -1 scale
(Sample entropy) t 
GR
GR
GS
[0.99902 0 0 1.00077 0 -0.19998] CT
0.974 0.9 0.9 RC
N
123.545 137.809 M
114.38 83.588 L
105.215 79.205 L
96.05 73.862 L
86.885 70.291 L
77.72 68.584 L
68.555 69.654 L
65.464 70.284 L
65.464 75.077 L
65.464 77.775 L
68.555 76.887 L
77.72 75.482 L
86.885 77.109 L
96.05 81.019 L
105.215 87.364 L
114.38 91.898 L
123.545 145.167 L
132.71 197.657 L
141.875 195.674 L
151.04 135.823 L
160.205 103.222 L
169.37 80.369 L
178.535 74.321 L
187.7 69.726 L
196.865 68.83 L
206.03 69.025 L
215.195 67.874 L
224.36 67.555 L
233.525 64.074 L
242.69 61.945 L
251.855 59.725 L
261.02 59.462 L
270.185 61.808 L
279.35 67.484 L
288.515 73.573 L
297.68 80.039 L
306.845 85.522 L
316.01 123.076 L
325.175 137.69 L
334.34 132.761 L
343.505 112.68 L
352.67 102.831 L
361.835 95.41 L
371 95.083 L
371.036 95.08 L
371.036 84.135 L
371.036 84.094 L
371 84.094 L
361.835 84.574 L
352.67 92.326 L
343.505 102.593 L
334.34 123.882 L
325.175 129.944 L
316.01 115.792 L
306.845 78.057 L
297.68 72.797 L
288.515 66.598 L
279.35 60.93 L
270.185 54.916 L
261.02 51.816 L
251.855 51.125 L
242.69 52.848 L
233.525 54.949 L
224.36 58.668 L
215.195 59.601 L
206.03 61.011 L
196.865 61.266 L
187.7 62.035 L
178.535 65.954 L
169.37 72.078 L
160.205 94.934 L
151.04 128.469 L
141.875 189.458 L
132.71 191.32 L
cp
f
GR
GS
[0.99902 0 0 1.00077 0 -0.19998] CT
0.957 0.82 0.82 RC
1 LJ
0.5 LW
N
65.464 77.775 M
68.555 76.887 L
77.72 75.482 L
86.885 77.109 L
96.05 81.019 L
105.215 87.364 L
114.38 91.898 L
123.545 145.167 L
132.71 197.657 L
141.875 195.674 L
151.04 135.823 L
160.205 103.222 L
169.37 80.369 L
178.535 74.321 L
187.7 69.726 L
196.865 68.83 L
206.03 69.025 L
215.195 67.874 L
224.36 67.555 L
233.525 64.074 L
242.69 61.945 L
251.855 59.725 L
261.02 59.462 L
270.185 61.808 L
279.35 67.484 L
288.515 73.573 L
297.68 80.039 L
306.845 85.522 L
316.01 123.076 L
325.175 137.69 L
334.34 132.761 L
343.505 112.68 L
352.67 102.831 L
361.835 95.41 L
371 95.083 L
371.036 95.08 L
S
GR
GS
[0.99902 0 0 1.00077 0 -0.19998] CT
0.957 0.82 0.82 RC
1 LJ
0.5 LW
N
65.464 70.284 M
68.555 69.654 L
77.72 68.584 L
86.885 70.291 L
96.05 73.862 L
105.215 79.205 L
114.38 83.588 L
123.545 137.809 L
132.71 191.32 L
141.875 189.458 L
151.04 128.469 L
160.205 94.934 L
169.37 72.078 L
178.535 65.954 L
187.7 62.035 L
196.865 61.266 L
206.03 61.011 L
215.195 59.601 L
224.36 58.668 L
233.525 54.949 L
242.69 52.848 L
251.855 51.125 L
261.02 51.816 L
270.185 54.916 L
279.35 60.93 L
288.515 66.598 L
297.68 72.797 L
306.845 78.057 L
316.01 115.792 L
325.175 129.944 L
334.34 123.882 L
343.505 102.593 L
352.67 92.326 L
361.835 84.574 L
371 84.094 L
371.036 84.094 L
S
GR
GS
[0.99902 0 0 1.00077 0 -0.19998] CT
0.898 0.6 0.6 RC
1 LJ
2 LW
N
65.464 74.03 M
68.555 73.27 L
77.72 72.033 L
86.885 73.7 L
96.05 77.441 L
105.215 83.284 L
114.38 87.743 L
123.545 141.488 L
132.71 194.489 L
141.875 192.566 L
151.04 132.146 L
160.205 99.078 L
169.37 76.223 L
178.535 70.138 L
187.7 65.88 L
196.865 65.048 L
206.03 65.018 L
215.195 63.737 L
224.36 63.111 L
233.525 59.512 L
242.69 57.396 L
251.855 55.425 L
261.02 55.639 L
270.185 58.362 L
279.35 64.207 L
288.515 70.086 L
297.68 76.418 L
306.845 81.789 L
316.01 119.434 L
325.175 133.817 L
334.34 128.322 L
343.505 107.636 L
352.67 97.578 L
361.835 89.992 L
371 89.588 L
371.036 89.587 L
S
GR
GS
[0.99902 0 0 1.00077 0 -0.19998] CT
1 0.875 0.875 RC
N
123.545 129.667 M
114.38 80.387 L
105.215 78.265 L
96.05 75.056 L
86.885 73.013 L
77.72 69.392 L
68.555 71.226 L
65.464 72.389 L
65.464 77.304 L
65.464 79.995 L
68.555 78.642 L
77.72 76.858 L
86.885 80.141 L
96.05 82.066 L
105.215 85.093 L
114.38 87.416 L
123.545 136.331 L
132.71 185.057 L
141.875 185.142 L
151.04 130.194 L
160.205 104.259 L
169.37 78.821 L
178.535 70.468 L
187.7 67.218 L
196.865 66.609 L
206.03 65.083 L
215.195 60.597 L
224.36 55.871 L
233.525 53.04 L
242.69 47.791 L
251.855 49.843 L
261.02 51.013 L
270.185 53.107 L
279.35 57.382 L
288.515 62.969 L
297.68 71.639 L
306.845 78.956 L
316.01 115.648 L
325.175 127.528 L
334.34 118.249 L
343.505 96.138 L
352.67 82.806 L
361.835 78.483 L
371 78.776 L
371.036 78.77 L
371.036 66.904 L
371.036 66.861 L
371 66.863 L
361.835 66.04 L
352.67 70.839 L
343.505 84.643 L
334.34 107.588 L
325.175 117.461 L
316.01 105.581 L
306.845 69.286 L
297.68 62.444 L
288.515 54.222 L
279.35 49.22 L
270.185 45.465 L
261.02 43.632 L
251.855 41.839 L
242.69 39.075 L
233.525 44.556 L
224.36 47.724 L
215.195 53.091 L
206.03 58.08 L
196.865 59.355 L
187.7 59.963 L
178.535 62.594 L
169.37 70.454 L
160.205 95.747 L
151.04 122.975 L
141.875 179.397 L
132.71 178.748 L
cp
f
GR
GS
[0.99902 0 0 1.00077 0 -0.19998] CT
1 0.776 0.776 RC
1 LJ
0.5 LW
N
65.464 79.995 M
68.555 78.642 L
77.72 76.858 L
86.885 80.141 L
96.05 82.066 L
105.215 85.093 L
114.38 87.416 L
123.545 136.331 L
132.71 185.057 L
141.875 185.142 L
151.04 130.194 L
160.205 104.259 L
169.37 78.821 L
178.535 70.468 L
187.7 67.218 L
196.865 66.609 L
206.03 65.083 L
215.195 60.597 L
224.36 55.871 L
233.525 53.04 L
242.69 47.791 L
251.855 49.843 L
261.02 51.013 L
270.185 53.107 L
279.35 57.382 L
288.515 62.969 L
297.68 71.639 L
306.845 78.956 L
316.01 115.648 L
325.175 127.528 L
334.34 118.249 L
343.505 96.138 L
352.67 82.806 L
361.835 78.483 L
371 78.776 L
371.036 78.77 L
S
GR
GS
[0.99902 0 0 1.00077 0 -0.19998] CT
1 0.776 0.776 RC
1 LJ
0.5 LW
N
65.464 72.389 M
68.555 71.226 L
77.72 69.392 L
86.885 73.013 L
96.05 75.056 L
105.215 78.265 L
114.38 80.387 L
123.545 129.667 L
132.71 178.748 L
141.875 179.397 L
151.04 122.975 L
160.205 95.747 L
169.37 70.454 L
178.535 62.594 L
187.7 59.963 L
196.865 59.355 L
206.03 58.08 L
215.195 53.091 L
224.36 47.724 L
233.525 44.556 L
242.69 39.075 L
251.855 41.839 L
261.02 43.632 L
270.185 45.465 L
279.35 49.22 L
288.515 54.222 L
297.68 62.444 L
306.845 69.286 L
316.01 105.581 L
325.175 117.461 L
334.34 107.588 L
343.505 84.643 L
352.67 70.839 L
361.835 66.04 L
371 66.863 L
371.036 66.861 L
S
GR
GS
[0.99902 0 0 1.00077 0 -0.19998] CT
1 0.502 0.502 RC
1 LJ
2 LW
N
65.464 76.192 M
68.555 74.934 L
77.72 73.125 L
86.885 76.577 L
96.05 78.561 L
105.215 81.679 L
114.38 83.901 L
123.545 132.999 L
132.71 181.902 L
141.875 182.269 L
151.04 126.585 L
160.205 100.003 L
169.37 74.638 L
178.535 66.531 L
187.7 63.59 L
196.865 62.982 L
206.03 61.581 L
215.195 56.844 L
224.36 51.797 L
233.525 48.798 L
242.69 43.433 L
251.855 45.841 L
261.02 47.322 L
270.185 49.286 L
279.35 53.301 L
288.515 58.595 L
297.68 67.041 L
306.845 74.121 L
316.01 110.614 L
325.175 122.494 L
334.34 112.919 L
343.505 90.391 L
352.67 76.823 L
361.835 72.261 L
371 72.819 L
371.036 72.815 L
S
GR
GS
[0.99902 0 0 1.00077 0 -0.19998] CT
0.974 0.825 0.825 RC
N
114.38 88.166 M
123.545 136.034 L
132.71 183.619 L
141.875 182.655 L
151.04 122.919 L
160.205 91.815 L
169.37 67.904 L
178.535 61.421 L
187.7 61.097 L
196.865 60.499 L
206.03 58.291 L
215.195 57.978 L
224.36 58.182 L
233.525 57.466 L
242.69 54.892 L
251.855 49.544 L
261.02 47.324 L
270.185 51.938 L
279.35 57.047 L
288.515 62.829 L
297.68 68.024 L
306.845 73.685 L
316.01 107.034 L
325.175 117.97 L
334.34 110.359 L
343.505 83.187 L
352.67 67.071 L
361.835 60.9 L
371 59.668 L
371.036 59.677 L
371.036 59.65 L
371.036 52.301 L
371 52.29 L
361.835 53.186 L
352.67 59.367 L
343.505 75.926 L
334.34 103.309 L
325.175 111.227 L
316.01 100.138 L
306.845 65.945 L
297.68 60.277 L
288.515 54.548 L
279.35 48.643 L
270.185 43.725 L
261.02 39.702 L
251.855 41.631 L
242.69 46.522 L
233.525 49.24 L
224.36 50.523 L
215.195 51.153 L
206.03 51.451 L
196.865 53.298 L
187.7 54.158 L
178.535 54.376 L
169.37 60.762 L
160.205 85.181 L
151.04 116.723 L
141.875 176.694 L
132.71 177.131 L
123.545 129.1 L
114.38 80.932 L
105.215 76.013 L
96.05 74.612 L
86.885 75.942 L
77.72 78.994 L
68.555 83.196 L
65.464 83.549 L
65.464 88.766 L
65.464 91.532 L
68.555 91.069 L
77.72 86.542 L
86.885 83.229 L
96.05 81.563 L
105.215 82.668 L
cp
f
GR
GS
[0.99902 0 0 1.00077 0 -0.19998] CT
0.957 0.686 0.686 RC
1 LJ
0.5 LW
N
65.464 91.532 M
68.555 91.069 L
77.72 86.542 L
86.885 83.229 L
96.05 81.563 L
105.215 82.668 L
114.38 88.166 L
123.545 136.034 L
132.71 183.619 L
141.875 182.655 L
151.04 122.919 L
160.205 91.815 L
169.37 67.904 L
178.535 61.421 L
187.7 61.097 L
196.865 60.499 L
206.03 58.291 L
215.195 57.978 L
224.36 58.182 L
233.525 57.466 L
242.69 54.892 L
251.855 49.544 L
261.02 47.324 L
270.185 51.938 L
279.35 57.047 L
288.515 62.829 L
297.68 68.024 L
306.845 73.685 L
316.01 107.034 L
325.175 117.97 L
334.34 110.359 L
343.505 83.187 L
352.67 67.071 L
361.835 60.9 L
371 59.668 L
371.036 59.677 L
S
GR
GS
[0.99902 0 0 1.00077 0 -0.19998] CT
0.957 0.686 0.686 RC
1 LJ
0.5 LW
N
65.464 83.549 M
68.555 83.196 L
77.72 78.994 L
86.885 75.942 L
96.05 74.612 L
105.215 76.013 L
114.38 80.932 L
123.545 129.1 L
132.71 177.131 L
141.875 176.694 L
151.04 116.723 L
160.205 85.181 L
169.37 60.762 L
178.535 54.376 L
187.7 54.158 L
196.865 53.298 L
206.03 51.451 L
215.195 51.153 L
224.36 50.523 L
233.525 49.24 L
242.69 46.522 L
251.855 41.631 L
261.02 39.702 L
270.185 43.725 L
279.35 48.643 L
288.515 54.548 L
297.68 60.277 L
306.845 65.945 L
316.01 100.138 L
325.175 111.227 L
334.34 103.309 L
343.505 75.926 L
352.67 59.367 L
361.835 53.186 L
371 52.29 L
371.036 52.301 L
S
GR
GS
[0.99902 0 0 1.00077 0 -0.19998] CT
0.898 0.302 0.302 RC
1 LJ
2 LW
N
65.464 87.541 M
68.555 87.132 L
77.72 82.768 L
86.885 79.586 L
96.05 78.087 L
105.215 79.341 L
114.38 84.549 L
123.545 132.567 L
132.71 180.375 L
141.875 179.674 L
151.04 119.821 L
160.205 88.498 L
169.37 64.333 L
178.535 57.898 L
187.7 57.628 L
196.865 56.899 L
206.03 54.871 L
215.195 54.565 L
224.36 54.353 L
233.525 53.353 L
242.69 50.707 L
251.855 45.587 L
261.02 43.513 L
270.185 47.831 L
279.35 52.845 L
288.515 58.688 L
297.68 64.15 L
306.845 69.815 L
316.01 103.586 L
325.175 114.599 L
334.34 106.834 L
343.505 79.557 L
352.67 63.219 L
361.835 57.043 L
371 55.979 L
371.036 55.989 L
S
GR
GS
[0.99902 0 0 1.00077 0 -0.19998] CT
0.9 0.799 0.799 RC
N
123.545 119.777 M
114.38 75.384 L
105.215 72.571 L
96.05 71.409 L
86.885 71.239 L
77.72 72.734 L
68.555 74.686 L
65.464 75.354 L
65.464 80.673 L
65.464 83.566 L
68.555 82.712 L
77.72 79.687 L
86.885 77.727 L
96.05 77.864 L
105.215 79.355 L
114.38 81.868 L
123.545 125.803 L
132.71 175.655 L
141.875 177.748 L
151.04 127.301 L
160.205 94.889 L
169.37 70.571 L
178.535 64.262 L
187.7 63.073 L
196.865 62.42 L
206.03 60.762 L
215.195 57.305 L
224.36 53.723 L
233.525 50.462 L
242.69 47.546 L
251.855 44.752 L
261.02 43.82 L
270.185 46.007 L
279.35 50.148 L
288.515 59.676 L
297.68 65.431 L
306.845 72.963 L
316.01 104.067 L
325.175 112.784 L
334.34 104.469 L
343.505 76.591 L
352.67 62.99 L
361.835 58.207 L
371 58.315 L
371.036 58.322 L
371.036 58.29 L
371.036 49.426 L
371 49.415 L
361.835 48.753 L
352.67 54.195 L
343.505 68.303 L
334.34 97.602 L
325.175 106.29 L
316.01 97.432 L
306.845 65.954 L
297.68 57.889 L
288.515 51.31 L
279.35 41.539 L
270.185 37.562 L
261.02 36.374 L
251.855 38.084 L
242.69 40.639 L
233.525 43.335 L
224.36 46.564 L
215.195 50.137 L
206.03 53.313 L
196.865 55.033 L
187.7 56.165 L
178.535 57.693 L
169.37 63.669 L
160.205 87.476 L
151.04 120.092 L
141.875 171.376 L
132.71 169.67 L
cp
f
GR
GS
[0.99902 0 0 1.00077 0 -0.19998] CT
0.82 0.639 0.639 RC
1 LJ
0.5 LW
N
65.464 83.566 M
68.555 82.712 L
77.72 79.687 L
86.885 77.727 L
96.05 77.864 L
105.215 79.355 L
114.38 81.868 L
123.545 125.803 L
132.71 175.655 L
141.875 177.748 L
151.04 127.301 L
160.205 94.889 L
169.37 70.571 L
178.535 64.262 L
187.7 63.073 L
196.865 62.42 L
206.03 60.762 L
215.195 57.305 L
224.36 53.723 L
233.525 50.462 L
242.69 47.546 L
251.855 44.752 L
261.02 43.82 L
270.185 46.007 L
279.35 50.148 L
288.515 59.676 L
297.68 65.431 L
306.845 72.963 L
316.01 104.067 L
325.175 112.784 L
334.34 104.469 L
343.505 76.591 L
352.67 62.99 L
361.835 58.207 L
371 58.315 L
371.036 58.322 L
S
GR
GS
[0.99902 0 0 1.00077 0 -0.19998] CT
0.82 0.639 0.639 RC
1 LJ
0.5 LW
N
65.464 75.354 M
68.555 74.686 L
77.72 72.734 L
86.885 71.239 L
96.05 71.409 L
105.215 72.571 L
114.38 75.384 L
123.545 119.777 L
132.71 169.67 L
141.875 171.376 L
151.04 120.092 L
160.205 87.476 L
169.37 63.669 L
178.535 57.693 L
187.7 56.165 L
196.865 55.033 L
206.03 53.313 L
215.195 50.137 L
224.36 46.564 L
233.525 43.335 L
242.69 40.639 L
251.855 38.084 L
261.02 36.374 L
270.185 37.562 L
279.35 41.539 L
288.515 51.31 L
297.68 57.889 L
306.845 65.954 L
316.01 97.432 L
325.175 106.29 L
334.34 97.602 L
343.505 68.303 L
352.67 54.195 L
361.835 48.753 L
371 49.415 L
371.036 49.426 L
S
GR
GS
[0.99902 0 0 1.00077 0 -0.19998] CT
0.6 0.2 0.2 RC
1 LJ
2 LW
N
65.464 79.46 M
68.555 78.699 L
77.72 76.21 L
86.885 74.483 L
96.05 74.637 L
105.215 75.963 L
114.38 78.626 L
123.545 122.79 L
132.71 172.663 L
141.875 174.562 L
151.04 123.696 L
160.205 91.182 L
169.37 67.12 L
178.535 60.978 L
187.7 59.619 L
196.865 58.727 L
206.03 57.037 L
215.195 53.721 L
224.36 50.143 L
233.525 46.898 L
242.69 44.092 L
251.855 41.418 L
261.02 40.097 L
270.185 41.785 L
279.35 45.844 L
288.515 55.493 L
297.68 61.66 L
306.845 69.459 L
316.01 100.749 L
325.175 109.537 L
334.34 101.036 L
343.505 72.447 L
352.67 58.593 L
361.835 53.48 L
371 53.865 L
371.036 53.874 L
S
GR
GS
[0.99902 0 0 1.00077 202.80195 135.40464] CT
/Helvetica 15 F
GS
[1 0 0 1 0 0] CT
0 5.5 moveto 
1 -1 scale
(1 Target) t 
GR
GR
GS
[0.99902 0 0 1.00077 0 -0.19998] CT
0.898 0.6 0.6 RC
1 LJ
2 LW
N
170 135.5 M
200 135.5 L
S
GR
GS
[0.99902 0 0 1.00077 202.80195 153.91893] CT
/Helvetica 15 F
GS
[1 0 0 1 0 0] CT
0 5.5 moveto 
1 -1 scale
(2 Targets) t 
GR
GR
GS
[0.99902 0 0 1.00077 0 -0.19998] CT
1 0.502 0.502 RC
1 LJ
2 LW
N
170 154 M
200 154 L
S
GR
GS
[0.99902 0 0 1.00077 202.80195 172.43321] CT
/Helvetica 15 F
GS
[1 0 0 1 0 0] CT
0 5.5 moveto 
1 -1 scale
(3 Targets) t 
GR
GR
GS
[0.99902 0 0 1.00077 0 -0.19998] CT
0.898 0.302 0.302 RC
1 LJ
2 LW
N
170 172.5 M
200 172.5 L
S
GR
GS
[0.99902 0 0 1.00077 202.80195 190.9475] CT
/Helvetica 15 F
GS
[1 0 0 1 0 0] CT
0 5.5 moveto 
1 -1 scale
(4 Targets) t 
GR
GR
GS
[0.99902 0 0 1.00077 0 -0.19998] CT
0.6 0.2 0.2 RC
1 LJ
2 LW
N
170 191 M
200 191 L
S
GR
%%Trailer
%%Pages: 1
%%EOF
