%!PS-Adobe-3.0 EPSF-3.0
%%Creator: (MATLAB, The Mathworks, Inc. Version 9.8.0.1323502 \(R2020a\). Operating System: Mac OS X)
%%Title: /Users/kosciessa/Desktop/tardis/LNDG/stateswitch/stsw_eeg_task/cpp/figures/E/F2_Slope_Thresh_Modulation_byProbe_OA.eps
%%CreationDate: 2022-02-01T15:43:14
%%Pages: (atend)
%%BoundingBox:    63     3   931   285
%%LanguageLevel: 3
%%EndComments
%%BeginProlog
%%BeginResource: procset (Apache XML Graphics Std ProcSet) 1.2 0
%%Version: 1.2 0
%%Copyright: (Copyright 2001-2003,2010 The Apache Software Foundation. License terms: http://www.apache.org/licenses/LICENSE-2.0)
/bd{bind def}bind def
/ld{load def}bd
/GR/grestore ld
/GS/gsave ld
/RM/rmoveto ld
/C/curveto ld
/t/show ld
/L/lineto ld
/ML/setmiterlimit ld
/CT/concat ld
/f/fill ld
/N/newpath ld
/S/stroke ld
/CC/setcmykcolor ld
/A/ashow ld
/cp/closepath ld
/RC/setrgbcolor ld
/LJ/setlinejoin ld
/GC/setgray ld
/LW/setlinewidth ld
/M/moveto ld
/re {4 2 roll M
1 index 0 rlineto
0 exch rlineto
neg 0 rlineto
cp } bd
/_ctm matrix def
/_tm matrix def
/BT { _ctm currentmatrix pop matrix _tm copy pop 0 0 moveto } bd
/ET { _ctm setmatrix } bd
/iTm { _ctm setmatrix _tm concat } bd
/Tm { _tm astore pop iTm 0 0 moveto } bd
/ux 0.0 def
/uy 0.0 def
/F {
  /Tp exch def
  /Tf exch def
  Tf findfont Tp scalefont setfont
  /cf Tf def  /cs Tp def
} bd
/ULS {currentpoint /uy exch def /ux exch def} bd
/ULE {
  /Tcx currentpoint pop def
  gsave
  newpath
  cf findfont cs scalefont dup
  /FontMatrix get 0 get /Ts exch def /FontInfo get dup
  /UnderlinePosition get Ts mul /To exch def
  /UnderlineThickness get Ts mul /Tt exch def
  ux uy To add moveto  Tcx uy To add lineto
  Tt setlinewidth stroke
  grestore
} bd
/OLE {
  /Tcx currentpoint pop def
  gsave
  newpath
  cf findfont cs scalefont dup
  /FontMatrix get 0 get /Ts exch def /FontInfo get dup
  /UnderlinePosition get Ts mul /To exch def
  /UnderlineThickness get Ts mul /Tt exch def
  ux uy To add cs add moveto Tcx uy To add cs add lineto
  Tt setlinewidth stroke
  grestore
} bd
/SOE {
  /Tcx currentpoint pop def
  gsave
  newpath
  cf findfont cs scalefont dup
  /FontMatrix get 0 get /Ts exch def /FontInfo get dup
  /UnderlinePosition get Ts mul /To exch def
  /UnderlineThickness get Ts mul /Tt exch def
  ux uy To add cs 10 mul 26 idiv add moveto Tcx uy To add cs 10 mul 26 idiv add lineto
  Tt setlinewidth stroke
  grestore
} bd
/QT {
/Y22 exch store
/X22 exch store
/Y21 exch store
/X21 exch store
currentpoint
/Y21 load 2 mul add 3 div exch
/X21 load 2 mul add 3 div exch
/X21 load 2 mul /X22 load add 3 div
/Y21 load 2 mul /Y22 load add 3 div
/X22 load /Y22 load curveto
} bd
/SSPD {
dup length /d exch dict def
{
/v exch def
/k exch def
currentpagedevice k known {
/cpdv currentpagedevice k get def
v cpdv ne {
/upd false def
/nullv v type /nulltype eq def
/nullcpdv cpdv type /nulltype eq def
nullv nullcpdv or
{
/upd true def
} {
/sametype v type cpdv type eq def
sametype {
v type /arraytype eq {
/vlen v length def
/cpdvlen cpdv length def
vlen cpdvlen eq {
0 1 vlen 1 sub {
/i exch def
/obj v i get def
/cpdobj cpdv i get def
obj cpdobj ne {
/upd true def
exit
} if
} for
} {
/upd true def
} ifelse
} {
v type /dicttype eq {
v {
/dv exch def
/dk exch def
/cpddv cpdv dk get def
dv cpddv ne {
/upd true def
exit
} if
} forall
} {
/upd true def
} ifelse
} ifelse
} if
} ifelse
upd true eq {
d k v put
} if
} if
} if
} forall
d length 0 gt {
d setpagedevice
} if
} bd
/RE { % /NewFontName [NewEncodingArray] /FontName RE -
  findfont dup length dict begin
  {
    1 index /FID ne
    {def} {pop pop} ifelse
  } forall
  /Encoding exch def
  /FontName 1 index def
  currentdict definefont pop
  end
} bind def
%%EndResource
%%BeginResource: procset (Apache XML Graphics EPS ProcSet) 1.0 0
%%Version: 1.0 0
%%Copyright: (Copyright 2002-2003 The Apache Software Foundation. License terms: http://www.apache.org/licenses/LICENSE-2.0)
/BeginEPSF { %def
/b4_Inc_state save def         % Save state for cleanup
/dict_count countdictstack def % Count objects on dict stack
/op_count count 1 sub def      % Count objects on operand stack
userdict begin                 % Push userdict on dict stack
/showpage { } def              % Redefine showpage, { } = null proc
0 setgray 0 setlinecap         % Prepare graphics state
1 setlinewidth 0 setlinejoin
10 setmiterlimit [ ] 0 setdash newpath
/languagelevel where           % If level not equal to 1 then
{pop languagelevel             % set strokeadjust and
1 ne                           % overprint to their defaults.
{false setstrokeadjust false setoverprint
} if
} if
} bd
/EndEPSF { %def
count op_count sub {pop} repeat            % Clean up stacks
countdictstack dict_count sub {end} repeat
b4_Inc_state restore
} bd
%%EndResource
%FOPBeginFontDict
%%IncludeResource: font Courier-Oblique
%%IncludeResource: font Courier-BoldOblique
%%IncludeResource: font Courier-Bold
%%IncludeResource: font ZapfDingbats
%%IncludeResource: font Symbol
%%IncludeResource: font Helvetica
%%IncludeResource: font Helvetica-Oblique
%%IncludeResource: font Helvetica-Bold
%%IncludeResource: font Helvetica-BoldOblique
%%IncludeResource: font Times-Roman
%%IncludeResource: font Times-Italic
%%IncludeResource: font Times-Bold
%%IncludeResource: font Times-BoldItalic
%%IncludeResource: font Courier
%FOPEndFontDict
%%BeginResource: encoding WinAnsiEncoding
/WinAnsiEncoding [
/.notdef /.notdef /.notdef /.notdef /.notdef
/.notdef /.notdef /.notdef /.notdef /.notdef
/.notdef /.notdef /.notdef /.notdef /.notdef
/.notdef /.notdef /.notdef /.notdef /.notdef
/.notdef /.notdef /.notdef /.notdef /.notdef
/.notdef /.notdef /.notdef /.notdef /.notdef
/.notdef /.notdef /space /exclam /quotedbl
/numbersign /dollar /percent /ampersand /quotesingle
/parenleft /parenright /asterisk /plus /comma
/hyphen /period /slash /zero /one
/two /three /four /five /six
/seven /eight /nine /colon /semicolon
/less /equal /greater /question /at
/A /B /C /D /E
/F /G /H /I /J
/K /L /M /N /O
/P /Q /R /S /T
/U /V /W /X /Y
/Z /bracketleft /backslash /bracketright /asciicircum
/underscore /quoteleft /a /b /c
/d /e /f /g /h
/i /j /k /l /m
/n /o /p /q /r
/s /t /u /v /w
/x /y /z /braceleft /bar
/braceright /asciitilde /bullet /Euro /bullet
/quotesinglbase /florin /quotedblbase /ellipsis /dagger
/daggerdbl /circumflex /perthousand /Scaron /guilsinglleft
/OE /bullet /Zcaron /bullet /bullet
/quoteleft /quoteright /quotedblleft /quotedblright /bullet
/endash /emdash /asciitilde /trademark /scaron
/guilsinglright /oe /bullet /zcaron /Ydieresis
/space /exclamdown /cent /sterling /currency
/yen /brokenbar /section /dieresis /copyright
/ordfeminine /guillemotleft /logicalnot /sfthyphen /registered
/macron /degree /plusminus /twosuperior /threesuperior
/acute /mu /paragraph /middot /cedilla
/onesuperior /ordmasculine /guillemotright /onequarter /onehalf
/threequarters /questiondown /Agrave /Aacute /Acircumflex
/Atilde /Adieresis /Aring /AE /Ccedilla
/Egrave /Eacute /Ecircumflex /Edieresis /Igrave
/Iacute /Icircumflex /Idieresis /Eth /Ntilde
/Ograve /Oacute /Ocircumflex /Otilde /Odieresis
/multiply /Oslash /Ugrave /Uacute /Ucircumflex
/Udieresis /Yacute /Thorn /germandbls /agrave
/aacute /acircumflex /atilde /adieresis /aring
/ae /ccedilla /egrave /eacute /ecircumflex
/edieresis /igrave /iacute /icircumflex /idieresis
/eth /ntilde /ograve /oacute /ocircumflex
/otilde /odieresis /divide /oslash /ugrave
/uacute /ucircumflex /udieresis /yacute /thorn
/ydieresis
] def
%%EndResource
%FOPBeginFontReencode
/Courier-Oblique findfont
dup length dict begin
  {1 index /FID ne {def} {pop pop} ifelse} forall
  /Encoding WinAnsiEncoding def
  currentdict
end
/Courier-Oblique exch definefont pop
/Courier-BoldOblique findfont
dup length dict begin
  {1 index /FID ne {def} {pop pop} ifelse} forall
  /Encoding WinAnsiEncoding def
  currentdict
end
/Courier-BoldOblique exch definefont pop
/Courier-Bold findfont
dup length dict begin
  {1 index /FID ne {def} {pop pop} ifelse} forall
  /Encoding WinAnsiEncoding def
  currentdict
end
/Courier-Bold exch definefont pop
/Helvetica findfont
dup length dict begin
  {1 index /FID ne {def} {pop pop} ifelse} forall
  /Encoding WinAnsiEncoding def
  currentdict
end
/Helvetica exch definefont pop
/Helvetica-Oblique findfont
dup length dict begin
  {1 index /FID ne {def} {pop pop} ifelse} forall
  /Encoding WinAnsiEncoding def
  currentdict
end
/Helvetica-Oblique exch definefont pop
/Helvetica-Bold findfont
dup length dict begin
  {1 index /FID ne {def} {pop pop} ifelse} forall
  /Encoding WinAnsiEncoding def
  currentdict
end
/Helvetica-Bold exch definefont pop
/Helvetica-BoldOblique findfont
dup length dict begin
  {1 index /FID ne {def} {pop pop} ifelse} forall
  /Encoding WinAnsiEncoding def
  currentdict
end
/Helvetica-BoldOblique exch definefont pop
/Times-Roman findfont
dup length dict begin
  {1 index /FID ne {def} {pop pop} ifelse} forall
  /Encoding WinAnsiEncoding def
  currentdict
end
/Times-Roman exch definefont pop
/Times-Italic findfont
dup length dict begin
  {1 index /FID ne {def} {pop pop} ifelse} forall
  /Encoding WinAnsiEncoding def
  currentdict
end
/Times-Italic exch definefont pop
/Times-Bold findfont
dup length dict begin
  {1 index /FID ne {def} {pop pop} ifelse} forall
  /Encoding WinAnsiEncoding def
  currentdict
end
/Times-Bold exch definefont pop
/Times-BoldItalic findfont
dup length dict begin
  {1 index /FID ne {def} {pop pop} ifelse} forall
  /Encoding WinAnsiEncoding def
  currentdict
end
/Times-BoldItalic exch definefont pop
/Courier findfont
dup length dict begin
  {1 index /FID ne {def} {pop pop} ifelse} forall
  /Encoding WinAnsiEncoding def
  currentdict
end
/Courier exch definefont pop
%FOPEndFontReencode
%%EndProlog
%%Page: 1 1
%%PageBoundingBox: 0 0 1024 288
%%BeginPageSetup
[1 0 0 -1 0 288] CT
%%EndPageSetup
GS
1 GC
N
0 0 1024 288 re
f
GR
GS
1 GC
N
0 0 1024 288 re
f
GR
GS
1 GC
N
136 233 M
476 233 L
476 30 L
136 30 L
cp
f
GR
GS
0.149 GC
2 setlinecap
1 LJ
0.5 LW
N
136 233 M
476 233 L
S
GR
GS
0.149 GC
2 setlinecap
1 LJ
0.5 LW
N
178.5 233 M
178.5 229.6 L
S
GR
GS
0.149 GC
2 setlinecap
1 LJ
0.5 LW
N
263.5 233 M
263.5 229.6 L
S
GR
GS
0.149 GC
2 setlinecap
1 LJ
0.5 LW
N
348.5 233 M
348.5 229.6 L
S
GR
GS
0.149 GC
2 setlinecap
1 LJ
0.5 LW
N
433.5 233 M
433.5 229.6 L
S
GR
GS
[1 0 0 1 178.5 239] CT
0.149 GC
/Helvetica 20 F
GS
[1 0 0 1 0 0] CT
-24.5 20 moveto 
1 -1 scale
(Color) t 
GR
GR
GS
[1 0 0 1 263.5 239] CT
0.149 GC
/Helvetica 20 F
GS
[1 0 0 1 0 0] CT
-40 20 moveto 
1 -1 scale
(Direction) t 
GR
GR
GS
[1 0 0 1 348.5 239] CT
0.149 GC
/Helvetica 20 F
GS
[1 0 0 1 0 0] CT
-19 20 moveto 
1 -1 scale
(Size) t 
GR
GR
GS
[1 0 0 1 433.5 239] CT
0.149 GC
/Helvetica 20 F
GS
[1 0 0 1 0 0] CT
-49.5 20 moveto 
1 -1 scale
(Luminance) t 
GR
GR
GS
[1 0 0 1 306.00015 264] CT
0.149 GC
/Helvetica 20 F
GS
[1 0 0 1 0 0] CT
-74 20 moveto 
1 -1 scale
(Probed Attribute) t 
GR
GR
GS
0.149 GC
2 setlinecap
1 LJ
0.5 LW
N
136 233 M
136 30 L
S
GR
GS
0.149 GC
2 setlinecap
1 LJ
0.5 LW
N
136 210.444 M
139.4 210.444 L
S
GR
GS
0.149 GC
2 setlinecap
1 LJ
0.5 LW
N
136 154.056 M
139.4 154.056 L
S
GR
GS
0.149 GC
2 setlinecap
1 LJ
0.5 LW
N
136 97.667 M
139.4 97.667 L
S
GR
GS
0.149 GC
2 setlinecap
1 LJ
0.5 LW
N
136 41.278 M
139.4 41.278 L
S
GR
GS
[1 0 0 1 130 210.44444] CT
0.149 GC
/Helvetica 20 F
GS
[1 0 0 1 0 0] CT
-19 7.5 moveto 
1 -1 scale
(-3) t 
GR
GR
GS
[1 0 0 1 130 154.05556] CT
0.149 GC
/Helvetica 20 F
GS
[1 0 0 1 0 0] CT
-19 7.5 moveto 
1 -1 scale
(-2) t 
GR
GR
GS
[1 0 0 1 130 97.66666] CT
0.149 GC
/Helvetica 20 F
GS
[1 0 0 1 0 0] CT
-19 7.5 moveto 
1 -1 scale
(-1) t 
GR
GR
GS
[1 0 0 1 130 41.27778] CT
0.149 GC
/Helvetica 20 F
GS
[1 0 0 1 0 0] CT
-12 7.5 moveto 
1 -1 scale
(0) t 
GR
GR
GS
[0 -1 1 0 108 131.49991] CT
0.149 GC
/Helvetica 20 F
GS
[1 0 0 1 0 0] CT
-47.5 -30 moveto 
1 -1 scale
(CPP slope) t 
GR
GR
GS
[0 -1 1 0 108 131.49991] CT
0.149 GC
/Helvetica 20 F
GS
[1 0 0 1 0 0] CT
-74 -5 moveto 
1 -1 scale
([linear load beta]) t 
GR
GR
GS
[1 0 0 1 136 25] CT
0.149 GC
N
2.938 -0.578 M
2.938 -0.734 3.031 -0.859 QT
7.203 -5 L
3.031 -9.156 L
2.938 -9.266 2.938 -9.422 QT
2.938 -9.578 3.055 -9.703 QT
3.172 -9.828 3.344 -9.828 QT
3.484 -9.828 3.641 -9.703 QT
7.781 -5.563 L
11.906 -9.703 L
12.078 -9.828 12.203 -9.828 QT
12.359 -9.828 12.477 -9.711 QT
12.594 -9.594 12.594 -9.422 QT
12.594 -9.266 12.5 -9.156 QT
8.344 -5 L
12.5 -0.859 L
12.594 -0.734 12.594 -0.578 QT
12.594 -0.406 12.477 -0.289 QT
12.359 -0.172 12.203 -0.172 QT
12.047 -0.172 11.906 -0.328 QT
7.781 -4.438 L
3.641 -0.328 L
3.5 -0.172 3.344 -0.172 QT
3.172 -0.172 3.055 -0.305 QT
2.938 -0.438 2.938 -0.578 QT
cp
f
GR
GS
[1 0 0 1 152 25] CT
0.149 GC
/Helvetica 20 F
GS
[1 0 0 1 0 0] CT
0 0 moveto 
1 -1 scale
(10) t 
GR
GR
GS
[1 0 0 1 175 15] CT
0.149 GC
/Helvetica 16 F
GS
[1 0 0 1 0 0] CT
0 0 moveto 
1 -1 scale
(-6) t 
GR
GR
GS
0.149 GC
1 LJ
0.5 LW
N
136 41.278 M
476 41.278 L
S
GR
GS
0.02 0.443 0.69 RC
N
144.5 41.278 M
144.5 94.504 L
212.5 94.504 L
212.5 41.278 L
cp
229.5 41.278 M
229.5 108.529 L
297.5 108.529 L
297.5 41.278 L
cp
314.5 41.278 M
314.5 84.31 L
382.5 84.31 L
382.5 41.278 L
cp
399.5 41.278 M
399.5 55.169 L
467.5 55.169 L
467.5 41.278 L
cp
f
GR
GS
1 LJ
4 LW
N
178.5 77.218 M
178.5 111.79 L
S
GR
GS
1 LJ
4 LW
N
178.5 77.218 M
178.5 77.218 L
S
GR
GS
1 LJ
4 LW
N
178.5 111.79 M
178.5 111.79 L
S
GR
GS
1 LJ
4 LW
N
263.5 93.875 M
263.5 123.182 L
S
GR
GS
1 LJ
4 LW
N
263.5 93.875 M
263.5 93.875 L
S
GR
GS
1 LJ
4 LW
N
263.5 123.182 M
263.5 123.182 L
S
GR
GS
1 LJ
4 LW
N
348.5 70.807 M
348.5 97.814 L
S
GR
GS
1 LJ
4 LW
N
348.5 70.807 M
348.5 70.807 L
S
GR
GS
1 LJ
4 LW
N
348.5 97.814 M
348.5 97.814 L
S
GR
GS
1 LJ
4 LW
N
433.5 43.172 M
433.5 67.166 L
S
GR
GS
1 LJ
4 LW
N
433.5 43.172 M
433.5 43.172 L
S
GR
GS
1 LJ
4 LW
N
433.5 67.166 M
433.5 67.166 L
S
GR
GS
[1 0 0 1 178.5 210.44444] CT
/Helvetica-Bold 20 F
GS
[1 0 0 1 0 0] CT
-8.5 7.5 moveto 
1 -1 scale
(**) t 
GR
GR
GS
[1 0 0 1 263.5 210.44444] CT
/Helvetica-Bold 20 F
GS
[1 0 0 1 0 0] CT
-12.5 7.5 moveto 
1 -1 scale
(***) t 
GR
GR
GS
[1 0 0 1 348.5 210.44444] CT
/Helvetica-Bold 20 F
GS
[1 0 0 1 0 0] CT
-8.5 7.5 moveto 
1 -1 scale
(**) t 
GR
GR
GS
1 GC
N
587 233 M
926.5 233 L
926.5 30 L
587 30 L
cp
f
GR
GS
0.149 GC
2 setlinecap
1 LJ
0.5 LW
N
587 233 M
926.5 233 L
S
GR
GS
0.149 GC
2 setlinecap
1 LJ
0.5 LW
N
629.438 233 M
629.438 229.605 L
S
GR
GS
0.149 GC
2 setlinecap
1 LJ
0.5 LW
N
714.313 233 M
714.313 229.605 L
S
GR
GS
0.149 GC
2 setlinecap
1 LJ
0.5 LW
N
799.188 233 M
799.188 229.605 L
S
GR
GS
0.149 GC
2 setlinecap
1 LJ
0.5 LW
N
884.063 233 M
884.063 229.605 L
S
GR
GS
[1 0 0 1 629.4375 239] CT
0.149 GC
/Helvetica 20 F
GS
[1 0 0 1 0 0] CT
-24.5 20 moveto 
1 -1 scale
(Color) t 
GR
GR
GS
[1 0 0 1 714.3125 239] CT
0.149 GC
/Helvetica 20 F
GS
[1 0 0 1 0 0] CT
-40 20 moveto 
1 -1 scale
(Direction) t 
GR
GR
GS
[1 0 0 1 799.1875 239] CT
0.149 GC
/Helvetica 20 F
GS
[1 0 0 1 0 0] CT
-19 20 moveto 
1 -1 scale
(Size) t 
GR
GR
GS
[1 0 0 1 884.0625 239] CT
0.149 GC
/Helvetica 20 F
GS
[1 0 0 1 0 0] CT
-49.5 20 moveto 
1 -1 scale
(Luminance) t 
GR
GR
GS
[1 0 0 1 756.75018 264] CT
0.149 GC
/Helvetica 20 F
GS
[1 0 0 1 0 0] CT
-74 20 moveto 
1 -1 scale
(Probed Attribute) t 
GR
GR
GS
0.149 GC
2 setlinecap
1 LJ
0.5 LW
N
587 233 M
587 30 L
S
GR
GS
0.149 GC
2 setlinecap
1 LJ
0.5 LW
N
587 220.313 M
590.395 220.313 L
S
GR
GS
0.149 GC
2 setlinecap
1 LJ
0.5 LW
N
587 156.875 M
590.395 156.875 L
S
GR
GS
0.149 GC
2 setlinecap
1 LJ
0.5 LW
N
587 93.438 M
590.395 93.438 L
S
GR
GS
0.149 GC
2 setlinecap
1 LJ
0.5 LW
N
587 30 M
590.395 30 L
S
GR
GS
[1 0 0 1 581 220.31252] CT
0.149 GC
/Helvetica 20 F
GS
[1 0 0 1 0 0] CT
-36 7.5 moveto 
1 -1 scale
(-1.5) t 
GR
GR
GS
[1 0 0 1 581 156.875] CT
0.149 GC
/Helvetica 20 F
GS
[1 0 0 1 0 0] CT
-19 7.5 moveto 
1 -1 scale
(-1) t 
GR
GR
GS
[1 0 0 1 581 93.4375] CT
0.149 GC
/Helvetica 20 F
GS
[1 0 0 1 0 0] CT
-36 7.5 moveto 
1 -1 scale
(-0.5) t 
GR
GR
GS
[1 0 0 1 581 30] CT
0.149 GC
/Helvetica 20 F
GS
[1 0 0 1 0 0] CT
-12 7.5 moveto 
1 -1 scale
(0) t 
GR
GR
GS
[0 -1 1 0 542 131.49991] CT
0.149 GC
/Helvetica 20 F
GS
[1 0 0 1 0 0] CT
-65 -30 moveto 
1 -1 scale
(CPP threshold) t 
GR
GR
GS
[0 -1 1 0 542 131.49991] CT
0.149 GC
/Helvetica 20 F
GS
[1 0 0 1 0 0] CT
-74 -5 moveto 
1 -1 scale
([linear load beta]) t 
GR
GR
GS
[1 0 0 1 587 25] CT
0.149 GC
N
/f682067884{2.938 -0.578 M
2.938 -0.734 3.031 -0.859 QT
7.203 -5 L
3.031 -9.156 L
2.938 -9.266 2.938 -9.422 QT
2.938 -9.578 3.055 -9.703 QT
3.172 -9.828 3.344 -9.828 QT
3.484 -9.828 3.641 -9.703 QT
7.781 -5.563 L
11.906 -9.703 L
12.078 -9.828 12.203 -9.828 QT
12.359 -9.828 12.477 -9.711 QT
12.594 -9.594 12.594 -9.422 QT
12.594 -9.266 12.5 -9.156 QT
8.344 -5 L
12.5 -0.859 L
12.594 -0.734 12.594 -0.578 QT
12.594 -0.406 12.477 -0.289 QT
12.359 -0.172 12.203 -0.172 QT
12.047 -0.172 11.906 -0.328 QT
7.781 -4.438 L
3.641 -0.328 L
3.5 -0.172 3.344 -0.172 QT
3.172 -0.172 3.055 -0.305 QT
2.938 -0.438 2.938 -0.578 QT
cp}def
f682067884
f
GR
GS
[1 0 0 1 603 25] CT
0.149 GC
/Helvetica 20 F
GS
[1 0 0 1 0 0] CT
0 0 moveto 
1 -1 scale
(10) t 
GR
GR
GS
[1 0 0 1 626 15] CT
0.149 GC
/Helvetica 16 F
GS
[1 0 0 1 0 0] CT
0 0 moveto 
1 -1 scale
(-4) t 
GR
GR
GS
0.149 GC
1 LJ
0.5 LW
N
587 30 M
926.5 30 L
S
GR
GS
0.502 GC
N
595.487 30 M
595.487 123.571 L
663.388 123.571 L
663.388 30 L
cp
680.362 30 M
680.362 133.184 L
748.263 133.184 L
748.263 30 L
cp
765.237 30 M
765.237 139.467 L
833.138 139.467 L
833.138 30 L
cp
850.112 30 M
850.112 107.148 L
918.013 107.148 L
918.013 30 L
cp
f
GR
GS
1 LJ
4 LW
N
629.438 98.356 M
629.438 148.787 L
S
GR
GS
1 LJ
4 LW
N
629.438 98.356 M
629.438 98.356 L
S
GR
GS
1 LJ
4 LW
N
629.438 148.787 M
629.438 148.787 L
S
GR
GS
1 LJ
4 LW
N
714.313 102.29 M
714.313 164.078 L
S
GR
GS
1 LJ
4 LW
N
714.313 102.29 M
714.313 102.29 L
S
GR
GS
1 LJ
4 LW
N
714.313 164.078 M
714.313 164.078 L
S
GR
GS
1 LJ
4 LW
N
799.188 110.976 M
799.188 167.959 L
S
GR
GS
1 LJ
4 LW
N
799.188 110.976 M
799.188 110.976 L
S
GR
GS
1 LJ
4 LW
N
799.188 167.959 M
799.188 167.959 L
S
GR
GS
1 LJ
4 LW
N
884.063 79.479 M
884.063 134.817 L
S
GR
GS
1 LJ
4 LW
N
884.063 79.479 M
884.063 79.479 L
S
GR
GS
1 LJ
4 LW
N
884.063 134.817 M
884.063 134.817 L
S
GR
GS
[1 0 0 1 629.4375 188.59375] CT
/Helvetica-Bold 20 F
GS
[1 0 0 1 0 0] CT
-12.5 7.5 moveto 
1 -1 scale
(***) t 
GR
GR
GS
[1 0 0 1 714.3125 188.59375] CT
/Helvetica-Bold 20 F
GS
[1 0 0 1 0 0] CT
-8.5 7.5 moveto 
1 -1 scale
(**) t 
GR
GR
GS
[1 0 0 1 799.1875 188.59375] CT
/Helvetica-Bold 20 F
GS
[1 0 0 1 0 0] CT
-12.5 7.5 moveto 
1 -1 scale
(***) t 
GR
GR
GS
[1 0 0 1 884.0625 188.59375] CT
/Helvetica-Bold 20 F
GS
[1 0 0 1 0 0] CT
-8.5 7.5 moveto 
1 -1 scale
(**) t 
GR
GR
%%Trailer
%%Pages: 1
%%EOF
