%!PS-Adobe-3.0 EPSF-3.0
%%Creator: (MATLAB, The Mathworks, Inc. Version 9.8.0.1323502 \(R2020a\). Operating System: Mac OS X)
%%Title: /Users/kosciessa/Desktop/tardis/LNDG/stateswitch/stsw_eeg_task/cpp/figures/E/F2_Slope_Thresh_Modulation_byProbe_RCP_OA.eps
%%CreationDate: 2022-02-01T15:43:51
%%Pages: (atend)
%%BoundingBox:    48     3   931   285
%%LanguageLevel: 3
%%EndComments
%%BeginProlog
%%BeginResource: procset (Apache XML Graphics Std ProcSet) 1.2 0
%%Version: 1.2 0
%%Copyright: (Copyright 2001-2003,2010 The Apache Software Foundation. License terms: http://www.apache.org/licenses/LICENSE-2.0)
/bd{bind def}bind def
/ld{load def}bd
/GR/grestore ld
/GS/gsave ld
/RM/rmoveto ld
/C/curveto ld
/t/show ld
/L/lineto ld
/ML/setmiterlimit ld
/CT/concat ld
/f/fill ld
/N/newpath ld
/S/stroke ld
/CC/setcmykcolor ld
/A/ashow ld
/cp/closepath ld
/RC/setrgbcolor ld
/LJ/setlinejoin ld
/GC/setgray ld
/LW/setlinewidth ld
/M/moveto ld
/re {4 2 roll M
1 index 0 rlineto
0 exch rlineto
neg 0 rlineto
cp } bd
/_ctm matrix def
/_tm matrix def
/BT { _ctm currentmatrix pop matrix _tm copy pop 0 0 moveto } bd
/ET { _ctm setmatrix } bd
/iTm { _ctm setmatrix _tm concat } bd
/Tm { _tm astore pop iTm 0 0 moveto } bd
/ux 0.0 def
/uy 0.0 def
/F {
  /Tp exch def
  /Tf exch def
  Tf findfont Tp scalefont setfont
  /cf Tf def  /cs Tp def
} bd
/ULS {currentpoint /uy exch def /ux exch def} bd
/ULE {
  /Tcx currentpoint pop def
  gsave
  newpath
  cf findfont cs scalefont dup
  /FontMatrix get 0 get /Ts exch def /FontInfo get dup
  /UnderlinePosition get Ts mul /To exch def
  /UnderlineThickness get Ts mul /Tt exch def
  ux uy To add moveto  Tcx uy To add lineto
  Tt setlinewidth stroke
  grestore
} bd
/OLE {
  /Tcx currentpoint pop def
  gsave
  newpath
  cf findfont cs scalefont dup
  /FontMatrix get 0 get /Ts exch def /FontInfo get dup
  /UnderlinePosition get Ts mul /To exch def
  /UnderlineThickness get Ts mul /Tt exch def
  ux uy To add cs add moveto Tcx uy To add cs add lineto
  Tt setlinewidth stroke
  grestore
} bd
/SOE {
  /Tcx currentpoint pop def
  gsave
  newpath
  cf findfont cs scalefont dup
  /FontMatrix get 0 get /Ts exch def /FontInfo get dup
  /UnderlinePosition get Ts mul /To exch def
  /UnderlineThickness get Ts mul /Tt exch def
  ux uy To add cs 10 mul 26 idiv add moveto Tcx uy To add cs 10 mul 26 idiv add lineto
  Tt setlinewidth stroke
  grestore
} bd
/QT {
/Y22 exch store
/X22 exch store
/Y21 exch store
/X21 exch store
currentpoint
/Y21 load 2 mul add 3 div exch
/X21 load 2 mul add 3 div exch
/X21 load 2 mul /X22 load add 3 div
/Y21 load 2 mul /Y22 load add 3 div
/X22 load /Y22 load curveto
} bd
/SSPD {
dup length /d exch dict def
{
/v exch def
/k exch def
currentpagedevice k known {
/cpdv currentpagedevice k get def
v cpdv ne {
/upd false def
/nullv v type /nulltype eq def
/nullcpdv cpdv type /nulltype eq def
nullv nullcpdv or
{
/upd true def
} {
/sametype v type cpdv type eq def
sametype {
v type /arraytype eq {
/vlen v length def
/cpdvlen cpdv length def
vlen cpdvlen eq {
0 1 vlen 1 sub {
/i exch def
/obj v i get def
/cpdobj cpdv i get def
obj cpdobj ne {
/upd true def
exit
} if
} for
} {
/upd true def
} ifelse
} {
v type /dicttype eq {
v {
/dv exch def
/dk exch def
/cpddv cpdv dk get def
dv cpddv ne {
/upd true def
exit
} if
} forall
} {
/upd true def
} ifelse
} ifelse
} if
} ifelse
upd true eq {
d k v put
} if
} if
} if
} forall
d length 0 gt {
d setpagedevice
} if
} bd
/RE { % /NewFontName [NewEncodingArray] /FontName RE -
  findfont dup length dict begin
  {
    1 index /FID ne
    {def} {pop pop} ifelse
  } forall
  /Encoding exch def
  /FontName 1 index def
  currentdict definefont pop
  end
} bind def
%%EndResource
%%BeginResource: procset (Apache XML Graphics EPS ProcSet) 1.0 0
%%Version: 1.0 0
%%Copyright: (Copyright 2002-2003 The Apache Software Foundation. License terms: http://www.apache.org/licenses/LICENSE-2.0)
/BeginEPSF { %def
/b4_Inc_state save def         % Save state for cleanup
/dict_count countdictstack def % Count objects on dict stack
/op_count count 1 sub def      % Count objects on operand stack
userdict begin                 % Push userdict on dict stack
/showpage { } def              % Redefine showpage, { } = null proc
0 setgray 0 setlinecap         % Prepare graphics state
1 setlinewidth 0 setlinejoin
10 setmiterlimit [ ] 0 setdash newpath
/languagelevel where           % If level not equal to 1 then
{pop languagelevel             % set strokeadjust and
1 ne                           % overprint to their defaults.
{false setstrokeadjust false setoverprint
} if
} if
} bd
/EndEPSF { %def
count op_count sub {pop} repeat            % Clean up stacks
countdictstack dict_count sub {end} repeat
b4_Inc_state restore
} bd
%%EndResource
%FOPBeginFontDict
%%IncludeResource: font Courier-Oblique
%%IncludeResource: font Courier-BoldOblique
%%IncludeResource: font Courier-Bold
%%IncludeResource: font ZapfDingbats
%%IncludeResource: font Symbol
%%IncludeResource: font Helvetica
%%IncludeResource: font Helvetica-Oblique
%%IncludeResource: font Helvetica-Bold
%%IncludeResource: font Helvetica-BoldOblique
%%IncludeResource: font Times-Roman
%%IncludeResource: font Times-Italic
%%IncludeResource: font Times-Bold
%%IncludeResource: font Times-BoldItalic
%%IncludeResource: font Courier
%FOPEndFontDict
%%BeginResource: encoding WinAnsiEncoding
/WinAnsiEncoding [
/.notdef /.notdef /.notdef /.notdef /.notdef
/.notdef /.notdef /.notdef /.notdef /.notdef
/.notdef /.notdef /.notdef /.notdef /.notdef
/.notdef /.notdef /.notdef /.notdef /.notdef
/.notdef /.notdef /.notdef /.notdef /.notdef
/.notdef /.notdef /.notdef /.notdef /.notdef
/.notdef /.notdef /space /exclam /quotedbl
/numbersign /dollar /percent /ampersand /quotesingle
/parenleft /parenright /asterisk /plus /comma
/hyphen /period /slash /zero /one
/two /three /four /five /six
/seven /eight /nine /colon /semicolon
/less /equal /greater /question /at
/A /B /C /D /E
/F /G /H /I /J
/K /L /M /N /O
/P /Q /R /S /T
/U /V /W /X /Y
/Z /bracketleft /backslash /bracketright /asciicircum
/underscore /quoteleft /a /b /c
/d /e /f /g /h
/i /j /k /l /m
/n /o /p /q /r
/s /t /u /v /w
/x /y /z /braceleft /bar
/braceright /asciitilde /bullet /Euro /bullet
/quotesinglbase /florin /quotedblbase /ellipsis /dagger
/daggerdbl /circumflex /perthousand /Scaron /guilsinglleft
/OE /bullet /Zcaron /bullet /bullet
/quoteleft /quoteright /quotedblleft /quotedblright /bullet
/endash /emdash /asciitilde /trademark /scaron
/guilsinglright /oe /bullet /zcaron /Ydieresis
/space /exclamdown /cent /sterling /currency
/yen /brokenbar /section /dieresis /copyright
/ordfeminine /guillemotleft /logicalnot /sfthyphen /registered
/macron /degree /plusminus /twosuperior /threesuperior
/acute /mu /paragraph /middot /cedilla
/onesuperior /ordmasculine /guillemotright /onequarter /onehalf
/threequarters /questiondown /Agrave /Aacute /Acircumflex
/Atilde /Adieresis /Aring /AE /Ccedilla
/Egrave /Eacute /Ecircumflex /Edieresis /Igrave
/Iacute /Icircumflex /Idieresis /Eth /Ntilde
/Ograve /Oacute /Ocircumflex /Otilde /Odieresis
/multiply /Oslash /Ugrave /Uacute /Ucircumflex
/Udieresis /Yacute /Thorn /germandbls /agrave
/aacute /acircumflex /atilde /adieresis /aring
/ae /ccedilla /egrave /eacute /ecircumflex
/edieresis /igrave /iacute /icircumflex /idieresis
/eth /ntilde /ograve /oacute /ocircumflex
/otilde /odieresis /divide /oslash /ugrave
/uacute /ucircumflex /udieresis /yacute /thorn
/ydieresis
] def
%%EndResource
%FOPBeginFontReencode
/Courier-Oblique findfont
dup length dict begin
  {1 index /FID ne {def} {pop pop} ifelse} forall
  /Encoding WinAnsiEncoding def
  currentdict
end
/Courier-Oblique exch definefont pop
/Courier-BoldOblique findfont
dup length dict begin
  {1 index /FID ne {def} {pop pop} ifelse} forall
  /Encoding WinAnsiEncoding def
  currentdict
end
/Courier-BoldOblique exch definefont pop
/Courier-Bold findfont
dup length dict begin
  {1 index /FID ne {def} {pop pop} ifelse} forall
  /Encoding WinAnsiEncoding def
  currentdict
end
/Courier-Bold exch definefont pop
/Helvetica findfont
dup length dict begin
  {1 index /FID ne {def} {pop pop} ifelse} forall
  /Encoding WinAnsiEncoding def
  currentdict
end
/Helvetica exch definefont pop
/Helvetica-Oblique findfont
dup length dict begin
  {1 index /FID ne {def} {pop pop} ifelse} forall
  /Encoding WinAnsiEncoding def
  currentdict
end
/Helvetica-Oblique exch definefont pop
/Helvetica-Bold findfont
dup length dict begin
  {1 index /FID ne {def} {pop pop} ifelse} forall
  /Encoding WinAnsiEncoding def
  currentdict
end
/Helvetica-Bold exch definefont pop
/Helvetica-BoldOblique findfont
dup length dict begin
  {1 index /FID ne {def} {pop pop} ifelse} forall
  /Encoding WinAnsiEncoding def
  currentdict
end
/Helvetica-BoldOblique exch definefont pop
/Times-Roman findfont
dup length dict begin
  {1 index /FID ne {def} {pop pop} ifelse} forall
  /Encoding WinAnsiEncoding def
  currentdict
end
/Times-Roman exch definefont pop
/Times-Italic findfont
dup length dict begin
  {1 index /FID ne {def} {pop pop} ifelse} forall
  /Encoding WinAnsiEncoding def
  currentdict
end
/Times-Italic exch definefont pop
/Times-Bold findfont
dup length dict begin
  {1 index /FID ne {def} {pop pop} ifelse} forall
  /Encoding WinAnsiEncoding def
  currentdict
end
/Times-Bold exch definefont pop
/Times-BoldItalic findfont
dup length dict begin
  {1 index /FID ne {def} {pop pop} ifelse} forall
  /Encoding WinAnsiEncoding def
  currentdict
end
/Times-BoldItalic exch definefont pop
/Courier findfont
dup length dict begin
  {1 index /FID ne {def} {pop pop} ifelse} forall
  /Encoding WinAnsiEncoding def
  currentdict
end
/Courier exch definefont pop
%FOPEndFontReencode
%%EndProlog
%%Page: 1 1
%%PageBoundingBox: 0 0 1024 288
%%BeginPageSetup
[1 0 0 -1 0 288] CT
%%EndPageSetup
GS
1 GC
N
0 0 1024 288 re
f
GR
GS
1 GC
N
0 0 1024 288 re
f
GR
GS
1 GC
N
133 233 M
476 233 L
476 30 L
133 30 L
cp
f
GR
GS
0.149 GC
2 setlinecap
1 LJ
0.5 LW
N
133 233 M
476 233 L
S
GR
GS
0.149 GC
2 setlinecap
1 LJ
0.5 LW
N
175.875 233 M
175.875 229.57 L
S
GR
GS
0.149 GC
2 setlinecap
1 LJ
0.5 LW
N
261.625 233 M
261.625 229.57 L
S
GR
GS
0.149 GC
2 setlinecap
1 LJ
0.5 LW
N
347.375 233 M
347.375 229.57 L
S
GR
GS
0.149 GC
2 setlinecap
1 LJ
0.5 LW
N
433.125 233 M
433.125 229.57 L
S
GR
GS
[1 0 0 1 175.875 239] CT
0.149 GC
/Helvetica 20 F
GS
[1 0 0 1 0 0] CT
-24.5 20 moveto 
1 -1 scale
(Color) t 
GR
GR
GS
[1 0 0 1 261.625 239] CT
0.149 GC
/Helvetica 20 F
GS
[1 0 0 1 0 0] CT
-40 20 moveto 
1 -1 scale
(Direction) t 
GR
GR
GS
[1 0 0 1 347.375 239] CT
0.149 GC
/Helvetica 20 F
GS
[1 0 0 1 0 0] CT
-19 20 moveto 
1 -1 scale
(Size) t 
GR
GR
GS
[1 0 0 1 433.125 239] CT
0.149 GC
/Helvetica 20 F
GS
[1 0 0 1 0 0] CT
-49.5 20 moveto 
1 -1 scale
(Luminance) t 
GR
GR
GS
[1 0 0 1 304.50015 264] CT
0.149 GC
/Helvetica 20 F
GS
[1 0 0 1 0 0] CT
-74 20 moveto 
1 -1 scale
(Probed Attribute) t 
GR
GR
GS
0.149 GC
2 setlinecap
1 LJ
0.5 LW
N
133 233 M
133 30 L
S
GR
GS
0.149 GC
2 setlinecap
1 LJ
0.5 LW
N
133 209.395 M
136.43 209.395 L
S
GR
GS
0.149 GC
2 setlinecap
1 LJ
0.5 LW
N
133 162.186 M
136.43 162.186 L
S
GR
GS
0.149 GC
2 setlinecap
1 LJ
0.5 LW
N
133 114.977 M
136.43 114.977 L
S
GR
GS
0.149 GC
2 setlinecap
1 LJ
0.5 LW
N
133 67.767 M
136.43 67.767 L
S
GR
GS
[1 0 0 1 127 209.39534] CT
0.149 GC
/Helvetica 20 F
GS
[1 0 0 1 0 0] CT
-31 7.5 moveto 
1 -1 scale
(-10) t 
GR
GR
GS
[1 0 0 1 127 162.18605] CT
0.149 GC
/Helvetica 20 F
GS
[1 0 0 1 0 0] CT
-19 7.5 moveto 
1 -1 scale
(-5) t 
GR
GR
GS
[1 0 0 1 127 114.97675] CT
0.149 GC
/Helvetica 20 F
GS
[1 0 0 1 0 0] CT
-12 7.5 moveto 
1 -1 scale
(0) t 
GR
GR
GS
[1 0 0 1 127 67.76744] CT
0.149 GC
/Helvetica 20 F
GS
[1 0 0 1 0 0] CT
-12 7.5 moveto 
1 -1 scale
(5) t 
GR
GR
GS
[0 -1 1 0 93.5 131.49989] CT
0.149 GC
/Helvetica 20 F
GS
[1 0 0 1 0 0] CT
-47.5 -30 moveto 
1 -1 scale
(CPP slope) t 
GR
GR
GS
[0 -1 1 0 93.5 131.49989] CT
0.149 GC
/Helvetica 20 F
GS
[1 0 0 1 0 0] CT
-74 -5 moveto 
1 -1 scale
([linear load beta]) t 
GR
GR
GS
[1 0 0 1 133 25] CT
0.149 GC
N
2.938 -0.578 M
2.938 -0.734 3.031 -0.859 QT
7.203 -5 L
3.031 -9.156 L
2.938 -9.266 2.938 -9.422 QT
2.938 -9.578 3.055 -9.703 QT
3.172 -9.828 3.344 -9.828 QT
3.484 -9.828 3.641 -9.703 QT
7.781 -5.563 L
11.906 -9.703 L
12.078 -9.828 12.203 -9.828 QT
12.359 -9.828 12.477 -9.711 QT
12.594 -9.594 12.594 -9.422 QT
12.594 -9.266 12.5 -9.156 QT
8.344 -5 L
12.5 -0.859 L
12.594 -0.734 12.594 -0.578 QT
12.594 -0.406 12.477 -0.289 QT
12.359 -0.172 12.203 -0.172 QT
12.047 -0.172 11.906 -0.328 QT
7.781 -4.438 L
3.641 -0.328 L
3.5 -0.172 3.344 -0.172 QT
3.172 -0.172 3.055 -0.305 QT
2.938 -0.438 2.938 -0.578 QT
cp
f
GR
GS
[1 0 0 1 149 25] CT
0.149 GC
/Helvetica 20 F
GS
[1 0 0 1 0 0] CT
0 0 moveto 
1 -1 scale
(10) t 
GR
GR
GS
[1 0 0 1 172 15] CT
0.149 GC
/Helvetica 16 F
GS
[1 0 0 1 0 0] CT
0 0 moveto 
1 -1 scale
(-6) t 
GR
GR
GS
0.149 GC
1 LJ
0.5 LW
N
133 114.977 M
476 114.977 L
S
GR
GS
0.302 0.6 0.8 RC
N
141.575 114.977 M
141.575 123.889 L
210.175 123.889 L
210.175 114.977 L
cp
227.325 114.977 M
227.325 126.237 L
295.925 126.237 L
295.925 114.977 L
cp
313.075 114.977 M
313.075 122.182 L
381.675 122.182 L
381.675 114.977 L
cp
398.825 114.977 M
398.825 117.303 L
467.425 117.303 L
467.425 114.977 L
cp
f
GR
GS
1 LJ
30 LW
N
175.875 120.995 M
175.875 126.784 L
S
GR
GS
1 LJ
30 LW
N
175.875 120.995 M
175.875 120.995 L
S
GR
GS
1 LJ
30 LW
N
175.875 126.784 M
175.875 126.784 L
S
GR
GS
1 LJ
30 LW
N
261.625 123.784 M
261.625 128.691 L
S
GR
GS
1 LJ
30 LW
N
261.625 123.784 M
261.625 123.784 L
S
GR
GS
1 LJ
30 LW
N
261.625 128.691 M
261.625 128.691 L
S
GR
GS
1 LJ
30 LW
N
347.375 119.921 M
347.375 124.443 L
S
GR
GS
1 LJ
30 LW
N
347.375 119.921 M
347.375 119.921 L
S
GR
GS
1 LJ
30 LW
N
347.375 124.443 M
347.375 124.443 L
S
GR
GS
1 LJ
30 LW
N
433.125 115.294 M
433.125 119.312 L
S
GR
GS
1 LJ
30 LW
N
433.125 115.294 M
433.125 115.294 L
S
GR
GS
1 LJ
30 LW
N
433.125 119.312 M
433.125 119.312 L
S
GR
GS
[1 0 0 1 175.875 209.39534] CT
/Helvetica-Bold 20 F
GS
[1 0 0 1 0 0] CT
-8.5 7.5 moveto 
1 -1 scale
(**) t 
GR
GR
GS
[1 0 0 1 182.19492 133.73347] CT
0.02 0.443 0.69 RC
N
2.739 0 M
2.739 -1.512 1.512 -2.739 0 -2.739 C
-1.512 -2.739 -2.739 -1.512 -2.739 0 C
-2.739 1.512 -1.512 2.739 0 2.739 C
1.512 2.739 2.739 1.512 2.739 0 C
cp
f
GR
GS
[1 0 0 1 158.78746 119.03162] CT
0.02 0.443 0.69 RC
N
/f-775751039{2.739 0 M
2.739 -1.512 1.512 -2.739 0 -2.739 C
-1.512 -2.739 -2.739 -1.512 -2.739 0 C
-2.739 1.512 -1.512 2.739 0 2.739 C
1.512 2.739 2.739 1.512 2.739 0 C
cp}def
f-775751039
f
GR
GS
[1 0 0 1 188.0461 188.65776] CT
0.02 0.443 0.69 RC
N
f-775751039
f
GR
GS
[1 0 0 1 169.07141 120.34447] CT
0.02 0.443 0.69 RC
N
f-775751039
f
GR
GS
[1 0 0 1 188.91214 127.1741] CT
0.02 0.443 0.69 RC
N
f-775751039
f
GR
GS
[1 0 0 1 183.13693 107.85931] CT
0.02 0.443 0.69 RC
N
f-775751039
f
GR
GS
[1 0 0 1 182.86482 115.44958] CT
0.02 0.443 0.69 RC
N
f-775751039
f
GR
GS
[1 0 0 1 165.8017 121.25514] CT
0.02 0.443 0.69 RC
N
f-775751039
f
GR
GS
[1 0 0 1 193.0155 129.49409] CT
0.02 0.443 0.69 RC
N
f-775751039
f
GR
GS
[1 0 0 1 177.88837 123.67915] CT
0.02 0.443 0.69 RC
N
f-775751039
f
GR
GS
[1 0 0 1 189.43939 108.27019] CT
0.02 0.443 0.69 RC
N
f-775751039
f
GR
GS
[1 0 0 1 191.37918 126.9562] CT
0.02 0.443 0.69 RC
N
f-775751039
f
GR
GS
[1 0 0 1 160.89764 114.16263] CT
0.02 0.443 0.69 RC
N
f-775751039
f
GR
GS
[1 0 0 1 180.02765 103.22113] CT
0.02 0.443 0.69 RC
N
f-775751039
f
GR
GS
[1 0 0 1 181.52094 125.00922] CT
0.02 0.443 0.69 RC
N
f-775751039
f
GR
GS
[1 0 0 1 167.20338 129.80219] CT
0.02 0.443 0.69 RC
N
f-775751039
f
GR
GS
[1 0 0 1 188.48111 128.79121] CT
0.02 0.443 0.69 RC
N
f-775751039
f
GR
GS
[1 0 0 1 182.05647 119.39577] CT
0.02 0.443 0.69 RC
N
f-775751039
f
GR
GS
[1 0 0 1 168.92024 101.28627] CT
0.02 0.443 0.69 RC
N
f-775751039
f
GR
GS
[1 0 0 1 179.30498 110.95692] CT
0.02 0.443 0.69 RC
N
f-775751039
f
GR
GS
[1 0 0 1 184.00848 119.76935] CT
0.02 0.443 0.69 RC
N
f-775751039
f
GR
GS
[1 0 0 1 178.3596 124.61106] CT
0.02 0.443 0.69 RC
N
f-775751039
f
GR
GS
[1 0 0 1 178.23978 142.35185] CT
0.02 0.443 0.69 RC
N
f-775751039
f
GR
GS
[1 0 0 1 169.28352 105.19122] CT
0.02 0.443 0.69 RC
N
f-775751039
f
GR
GS
[1 0 0 1 175.56613 131.40401] CT
0.02 0.443 0.69 RC
N
f-775751039
f
GR
GS
[1 0 0 1 190.89374 111.0472] CT
0.02 0.443 0.69 RC
N
f-775751039
f
GR
GS
[1 0 0 1 183.21231 118.41323] CT
0.02 0.443 0.69 RC
N
f-775751039
f
GR
GS
[1 0 0 1 178.53957 135.3385] CT
0.02 0.443 0.69 RC
N
f-775751039
f
GR
GS
[1 0 0 1 178.4561 100.5105] CT
0.02 0.443 0.69 RC
N
f-775751039
f
GR
GS
[1 0 0 1 170.22052 106.25826] CT
0.02 0.443 0.69 RC
N
f-775751039
f
GR
GS
[1 0 0 1 184.58759 132.98679] CT
0.02 0.443 0.69 RC
N
f-775751039
f
GR
GS
[1 0 0 1 164.26845 112.4278] CT
0.02 0.443 0.69 RC
N
f-775751039
f
GR
GS
[1 0 0 1 178.55272 175.52634] CT
0.02 0.443 0.69 RC
N
f-775751039
f
GR
GS
[1 0 0 1 167.77769 117.36313] CT
0.02 0.443 0.69 RC
N
f-775751039
f
GR
GS
[1 0 0 1 160.56502 69.97794] CT
0.02 0.443 0.69 RC
N
f-775751039
f
GR
GS
[1 0 0 1 191.48582 179.85088] CT
0.02 0.443 0.69 RC
N
f-775751039
f
GR
GS
[1 0 0 1 178.20523 137.86041] CT
0.02 0.443 0.69 RC
N
f-775751039
f
GR
GS
[1 0 0 1 184.16562 136.68536] CT
0.02 0.443 0.69 RC
N
f-775751039
f
GR
GS
[1 0 0 1 168.342 117.48582] CT
0.02 0.443 0.69 RC
N
f-775751039
f
GR
GS
[1 0 0 1 176.42436 113.28305] CT
0.02 0.443 0.69 RC
N
f-775751039
f
GR
GS
[1 0 0 1 185.80711 105.18998] CT
0.02 0.443 0.69 RC
N
f-775751039
f
GR
GS
[1 0 0 1 174.90627 126.05899] CT
0.02 0.443 0.69 RC
N
f-775751039
f
GR
GS
[1 0 0 1 164.48141 132.90364] CT
0.02 0.443 0.69 RC
N
f-775751039
f
GR
GS
[1 0 0 1 192.51074 106.73484] CT
0.02 0.443 0.69 RC
N
f-775751039
f
GR
GS
[1 0 0 1 162.68768 101.10239] CT
0.02 0.443 0.69 RC
N
f-775751039
f
GR
GS
[1 0 0 1 162.21068 121.16706] CT
0.02 0.443 0.69 RC
N
f-775751039
f
GR
GS
[1 0 0 1 189.26187 140.08388] CT
0.02 0.443 0.69 RC
N
f-775751039
f
GR
GS
[1 0 0 1 164.787 112.53346] CT
0.02 0.443 0.69 RC
N
f-775751039
f
GR
GS
[1 0 0 1 178.65837 130.71211] CT
0.02 0.443 0.69 RC
N
f-775751039
f
GR
GS
[1 0 0 1 174.02403 108.65414] CT
0.02 0.443 0.69 RC
N
f-775751039
f
GR
GS
[1 0 0 1 166.89464 133.96861] CT
0.02 0.443 0.69 RC
N
f-775751039
f
GR
GS
[1 0 0 1 172.84216 182.17326] CT
0.02 0.443 0.69 RC
N
f-775751039
f
GR
GS
[1 0 0 1 180.86839 121.96411] CT
0.02 0.443 0.69 RC
N
f-775751039
f
GR
GS
[1 0 0 1 261.625 209.39534] CT
/Helvetica-Bold 20 F
GS
[1 0 0 1 0 0] CT
-12.5 7.5 moveto 
1 -1 scale
(***) t 
GR
GR
GS
[1 0 0 1 263.6452 156.60156] CT
0.02 0.443 0.69 RC
N
f-775751039
f
GR
GS
[1 0 0 1 247.51401 118.12386] CT
0.02 0.443 0.69 RC
N
f-775751039
f
GR
GS
[1 0 0 1 247.36781 145.15434] CT
0.02 0.443 0.69 RC
N
f-775751039
f
GR
GS
[1 0 0 1 256.61017 122.68011] CT
0.02 0.443 0.69 RC
N
f-775751039
f
GR
GS
[1 0 0 1 270.17288 120.38463] CT
0.02 0.443 0.69 RC
N
f-775751039
f
GR
GS
[1 0 0 1 248.561 111.3237] CT
0.02 0.443 0.69 RC
N
f-775751039
f
GR
GS
[1 0 0 1 249.10406 117.51116] CT
0.02 0.443 0.69 RC
N
f-775751039
f
GR
GS
[1 0 0 1 250.14131 122.58154] CT
0.02 0.443 0.69 RC
N
f-775751039
f
GR
GS
[1 0 0 1 262.53134 118.18491] CT
0.02 0.443 0.69 RC
N
f-775751039
f
GR
GS
[1 0 0 1 265.21552 138.40283] CT
0.02 0.443 0.69 RC
N
f-775751039
f
GR
GS
[1 0 0 1 254.60167 112.02992] CT
0.02 0.443 0.69 RC
N
f-775751039
f
GR
GS
[1 0 0 1 268.14648 130.03371] CT
0.02 0.443 0.69 RC
N
f-775751039
f
GR
GS
[1 0 0 1 273.56418 122.14822] CT
0.02 0.443 0.69 RC
N
f-775751039
f
GR
GS
[1 0 0 1 253.16548 124.04688] CT
0.02 0.443 0.69 RC
N
f-775751039
f
GR
GS
[1 0 0 1 255.47496 118.17693] CT
0.02 0.443 0.69 RC
N
f-775751039
f
GR
GS
[1 0 0 1 267.60651 136.61983] CT
0.02 0.443 0.69 RC
N
f-775751039
f
GR
GS
[1 0 0 1 269.19141 120.02631] CT
0.02 0.443 0.69 RC
N
f-775751039
f
GR
GS
[1 0 0 1 270.44528 117.2364] CT
0.02 0.443 0.69 RC
N
f-775751039
f
GR
GS
[1 0 0 1 263.27509 110.5784] CT
0.02 0.443 0.69 RC
N
f-775751039
f
GR
GS
[1 0 0 1 274.25113 112.72338] CT
0.02 0.443 0.69 RC
N
f-775751039
f
GR
GS
[1 0 0 1 255.78236 119.8576] CT
0.02 0.443 0.69 RC
N
f-775751039
f
GR
GS
[1 0 0 1 273.41574 155.20732] CT
0.02 0.443 0.69 RC
N
f-775751039
f
GR
GS
[1 0 0 1 246.85168 121.70766] CT
0.02 0.443 0.69 RC
N
f-775751039
f
GR
GS
[1 0 0 1 274.76514 127.29759] CT
0.02 0.443 0.69 RC
N
f-775751039
f
GR
GS
[1 0 0 1 258.34787 131.19276] CT
0.02 0.443 0.69 RC
N
f-775751039
f
GR
GS
[1 0 0 1 263.5943 114.95295] CT
0.02 0.443 0.69 RC
N
f-775751039
f
GR
GS
[1 0 0 1 258.73148 141.22826] CT
0.02 0.443 0.69 RC
N
f-775751039
f
GR
GS
[1 0 0 1 258.34607 118.09581] CT
0.02 0.443 0.69 RC
N
f-775751039
f
GR
GS
[1 0 0 1 265.06219 171.13998] CT
0.02 0.443 0.69 RC
N
f-775751039
f
GR
GS
[1 0 0 1 255.58089 153.65646] CT
0.02 0.443 0.69 RC
N
f-775751039
f
GR
GS
[1 0 0 1 255.31035 121.22301] CT
0.02 0.443 0.69 RC
N
f-775751039
f
GR
GS
[1 0 0 1 252.85831 155.81491] CT
0.02 0.443 0.69 RC
N
f-775751039
f
GR
GS
[1 0 0 1 265.61362 163.35847] CT
0.02 0.443 0.69 RC
N
f-775751039
f
GR
GS
[1 0 0 1 275.23529 136.74501] CT
0.02 0.443 0.69 RC
N
f-775751039
f
GR
GS
[1 0 0 1 249.26703 93.53107] CT
0.02 0.443 0.69 RC
N
f-775751039
f
GR
GS
[1 0 0 1 272.97726 152.96075] CT
0.02 0.443 0.69 RC
N
f-775751039
f
GR
GS
[1 0 0 1 273.49423 102.85596] CT
0.02 0.443 0.69 RC
N
f-775751039
f
GR
GS
[1 0 0 1 276.05368 123.65736] CT
0.02 0.443 0.69 RC
N
f-775751039
f
GR
GS
[1 0 0 1 244.85321 85.01479] CT
0.02 0.443 0.69 RC
N
f-775751039
f
GR
GS
[1 0 0 1 255.58136 144.71092] CT
0.02 0.443 0.69 RC
N
f-775751039
f
GR
GS
[1 0 0 1 266.51077 108.46047] CT
0.02 0.443 0.69 RC
N
f-775751039
f
GR
GS
[1 0 0 1 265.69485 124.18594] CT
0.02 0.443 0.69 RC
N
f-775751039
f
GR
GS
[1 0 0 1 270.96619 116.06612] CT
0.02 0.443 0.69 RC
N
f-775751039
f
GR
GS
[1 0 0 1 252.67001 119.3418] CT
0.02 0.443 0.69 RC
N
f-775751039
f
GR
GS
[1 0 0 1 263.82425 113.11431] CT
0.02 0.443 0.69 RC
N
f-775751039
f
GR
GS
[1 0 0 1 270.63666 112.34714] CT
0.02 0.443 0.69 RC
N
f-775751039
f
GR
GS
[1 0 0 1 274.8074 153.22035] CT
0.02 0.443 0.69 RC
N
f-775751039
f
GR
GS
[1 0 0 1 275.34143 119.26833] CT
0.02 0.443 0.69 RC
N
f-775751039
f
GR
GS
[1 0 0 1 252.49124 122.98132] CT
0.02 0.443 0.69 RC
N
f-775751039
f
GR
GS
[1 0 0 1 246.29399 94.14379] CT
0.02 0.443 0.69 RC
N
f-775751039
f
GR
GS
[1 0 0 1 263.11453 127.10717] CT
0.02 0.443 0.69 RC
N
f-775751039
f
GR
GS
[1 0 0 1 253.64775 135.09042] CT
0.02 0.443 0.69 RC
N
f-775751039
f
GR
GS
[1 0 0 1 253.43781 136.47809] CT
0.02 0.443 0.69 RC
N
f-775751039
f
GR
GS
[1 0 0 1 347.375 209.39534] CT
/Helvetica-Bold 20 F
GS
[1 0 0 1 0 0] CT
-8.5 7.5 moveto 
1 -1 scale
(**) t 
GR
GR
GS
[1 0 0 1 339.7428 127.99876] CT
0.02 0.443 0.69 RC
N
f-775751039
f
GR
GS
[1 0 0 1 355.96884 136.56891] CT
0.02 0.443 0.69 RC
N
f-775751039
f
GR
GS
[1 0 0 1 339.83334 179.48427] CT
0.02 0.443 0.69 RC
N
f-775751039
f
GR
GS
[1 0 0 1 341.07941 108.45979] CT
0.02 0.443 0.69 RC
N
f-775751039
f
GR
GS
[1 0 0 1 334.40555 139.56459] CT
0.02 0.443 0.69 RC
N
f-775751039
f
GR
GS
[1 0 0 1 352.80881 128.78838] CT
0.02 0.443 0.69 RC
N
f-775751039
f
GR
GS
[1 0 0 1 332.58267 133.56087] CT
0.02 0.443 0.69 RC
N
f-775751039
f
GR
GS
[1 0 0 1 343.12375 113.18433] CT
0.02 0.443 0.69 RC
N
f-775751039
f
GR
GS
[1 0 0 1 357.73602 138.0119] CT
0.02 0.443 0.69 RC
N
f-775751039
f
GR
GS
[1 0 0 1 345.54007 136.6123] CT
0.02 0.443 0.69 RC
N
f-775751039
f
GR
GS
[1 0 0 1 341.52835 115.49012] CT
0.02 0.443 0.69 RC
N
f-775751039
f
GR
GS
[1 0 0 1 336.1651 103.85084] CT
0.02 0.443 0.69 RC
N
f-775751039
f
GR
GS
[1 0 0 1 335.74026 98.70226] CT
0.02 0.443 0.69 RC
N
f-775751039
f
GR
GS
[1 0 0 1 343.68573 124.81305] CT
0.02 0.443 0.69 RC
N
f-775751039
f
GR
GS
[1 0 0 1 360.00797 113.30982] CT
0.02 0.443 0.69 RC
N
f-775751039
f
GR
GS
[1 0 0 1 331.85263 143.66417] CT
0.02 0.443 0.69 RC
N
f-775751039
f
GR
GS
[1 0 0 1 336.81403 123.69009] CT
0.02 0.443 0.69 RC
N
f-775751039
f
GR
GS
[1 0 0 1 353.04037 127.22598] CT
0.02 0.443 0.69 RC
N
f-775751039
f
GR
GS
[1 0 0 1 341.73972 119.50967] CT
0.02 0.443 0.69 RC
N
f-775751039
f
GR
GS
[1 0 0 1 330.94366 95.21331] CT
0.02 0.443 0.69 RC
N
f-775751039
f
GR
GS
[1 0 0 1 364.49356 110.06525] CT
0.02 0.443 0.69 RC
N
f-775751039
f
GR
GS
[1 0 0 1 334.38632 110.86924] CT
0.02 0.443 0.69 RC
N
f-775751039
f
GR
GS
[1 0 0 1 333.18628 117.14616] CT
0.02 0.443 0.69 RC
N
f-775751039
f
GR
GS
[1 0 0 1 347.69861 145.1367] CT
0.02 0.443 0.69 RC
N
f-775751039
f
GR
GS
[1 0 0 1 337.72888 134.05849] CT
0.02 0.443 0.69 RC
N
f-775751039
f
GR
GS
[1 0 0 1 335.71619 115.09103] CT
0.02 0.443 0.69 RC
N
f-775751039
f
GR
GS
[1 0 0 1 331.19122 153.99586] CT
0.02 0.443 0.69 RC
N
f-775751039
f
GR
GS
[1 0 0 1 349.31448 98.48656] CT
0.02 0.443 0.69 RC
N
f-775751039
f
GR
GS
[1 0 0 1 339.9201 130.69148] CT
0.02 0.443 0.69 RC
N
f-775751039
f
GR
GS
[1 0 0 1 345.91281 108.27921] CT
0.02 0.443 0.69 RC
N
f-775751039
f
GR
GS
[1 0 0 1 359.82272 129.99823] CT
0.02 0.443 0.69 RC
N
f-775751039
f
GR
GS
[1 0 0 1 347.8844 113.22392] CT
0.02 0.443 0.69 RC
N
f-775751039
f
GR
GS
[1 0 0 1 354.88699 124.90732] CT
0.02 0.443 0.69 RC
N
f-775751039
f
GR
GS
[1 0 0 1 364.24069 119.42812] CT
0.02 0.443 0.69 RC
N
f-775751039
f
GR
GS
[1 0 0 1 360.63867 132.3029] CT
0.02 0.443 0.69 RC
N
f-775751039
f
GR
GS
[1 0 0 1 363.24142 152.73305] CT
0.02 0.443 0.69 RC
N
f-775751039
f
GR
GS
[1 0 0 1 342.24554 97.82434] CT
0.02 0.443 0.69 RC
N
f-775751039
f
GR
GS
[1 0 0 1 333.53101 120.51236] CT
0.02 0.443 0.69 RC
N
f-775751039
f
GR
GS
[1 0 0 1 343.61414 132.26172] CT
0.02 0.443 0.69 RC
N
f-775751039
f
GR
GS
[1 0 0 1 348.24158 118.69869] CT
0.02 0.443 0.69 RC
N
f-775751039
f
GR
GS
[1 0 0 1 339.40808 122.32687] CT
0.02 0.443 0.69 RC
N
f-775751039
f
GR
GS
[1 0 0 1 362.63321 112.42516] CT
0.02 0.443 0.69 RC
N
f-775751039
f
GR
GS
[1 0 0 1 358.2449 111.69253] CT
0.02 0.443 0.69 RC
N
f-775751039
f
GR
GS
[1 0 0 1 332.02866 121.30812] CT
0.02 0.443 0.69 RC
N
f-775751039
f
GR
GS
[1 0 0 1 339.69193 107.43404] CT
0.02 0.443 0.69 RC
N
f-775751039
f
GR
GS
[1 0 0 1 349.77451 110.06429] CT
0.02 0.443 0.69 RC
N
f-775751039
f
GR
GS
[1 0 0 1 339.48105 135.27586] CT
0.02 0.443 0.69 RC
N
f-775751039
f
GR
GS
[1 0 0 1 364.21896 112.03217] CT
0.02 0.443 0.69 RC
N
f-775751039
f
GR
GS
[1 0 0 1 343.13229 107.8756] CT
0.02 0.443 0.69 RC
N
f-775751039
f
GR
GS
[1 0 0 1 336.48215 136.50662] CT
0.02 0.443 0.69 RC
N
f-775751039
f
GR
GS
[1 0 0 1 363.12775 104.68771] CT
0.02 0.443 0.69 RC
N
f-775751039
f
GR
GS
[1 0 0 1 355.22647 94.22075] CT
0.02 0.443 0.69 RC
N
f-775751039
f
GR
GS
[1 0 0 1 356.57648 126.39311] CT
0.02 0.443 0.69 RC
N
f-775751039
f
GR
GS
[1 0 0 1 428.80695 143.46465] CT
0.02 0.443 0.69 RC
N
f-775751039
f
GR
GS
[1 0 0 1 428.98596 132.55493] CT
0.02 0.443 0.69 RC
N
f-775751039
f
GR
GS
[1 0 0 1 445.3215 126.87906] CT
0.02 0.443 0.69 RC
N
f-775751039
f
GR
GS
[1 0 0 1 446.20786 116.48273] CT
0.02 0.443 0.69 RC
N
f-775751039
f
GR
GS
[1 0 0 1 417.82794 110.20248] CT
0.02 0.443 0.69 RC
N
f-775751039
f
GR
GS
[1 0 0 1 423.66895 107.23587] CT
0.02 0.443 0.69 RC
N
f-775751039
f
GR
GS
[1 0 0 1 435.16187 112.8737] CT
0.02 0.443 0.69 RC
N
f-775751039
f
GR
GS
[1 0 0 1 426.12363 116.7066] CT
0.02 0.443 0.69 RC
N
f-775751039
f
GR
GS
[1 0 0 1 448.12811 121.85239] CT
0.02 0.443 0.69 RC
N
f-775751039
f
GR
GS
[1 0 0 1 449.93018 113.68301] CT
0.02 0.443 0.69 RC
N
f-775751039
f
GR
GS
[1 0 0 1 421.79587 130.55418] CT
0.02 0.443 0.69 RC
N
f-775751039
f
GR
GS
[1 0 0 1 440.66016 114.05219] CT
0.02 0.443 0.69 RC
N
f-775751039
f
GR
GS
[1 0 0 1 447.92624 119.53453] CT
0.02 0.443 0.69 RC
N
f-775751039
f
GR
GS
[1 0 0 1 420.63403 112.63679] CT
0.02 0.443 0.69 RC
N
f-775751039
f
GR
GS
[1 0 0 1 440.69003 122.44043] CT
0.02 0.443 0.69 RC
N
f-775751039
f
GR
GS
[1 0 0 1 424.80856 108.37176] CT
0.02 0.443 0.69 RC
N
f-775751039
f
GR
GS
[1 0 0 1 442.24896 122.10008] CT
0.02 0.443 0.69 RC
N
f-775751039
f
GR
GS
[1 0 0 1 418.2305 138.09216] CT
0.02 0.443 0.69 RC
N
f-775751039
f
GR
GS
[1 0 0 1 418.78769 122.39772] CT
0.02 0.443 0.69 RC
N
f-775751039
f
GR
GS
[1 0 0 1 433.60995 113.99318] CT
0.02 0.443 0.69 RC
N
f-775751039
f
GR
GS
[1 0 0 1 419.1875 119.78203] CT
0.02 0.443 0.69 RC
N
f-775751039
f
GR
GS
[1 0 0 1 435.1366 115.0882] CT
0.02 0.443 0.69 RC
N
f-775751039
f
GR
GS
[1 0 0 1 429.79733 104.76597] CT
0.02 0.443 0.69 RC
N
f-775751039
f
GR
GS
[1 0 0 1 419.20056 114.61625] CT
0.02 0.443 0.69 RC
N
f-775751039
f
GR
GS
[1 0 0 1 421.49814 105.16922] CT
0.02 0.443 0.69 RC
N
f-775751039
f
GR
GS
[1 0 0 1 438.27444 119.71732] CT
0.02 0.443 0.69 RC
N
f-775751039
f
GR
GS
[1 0 0 1 431.09787 126.00748] CT
0.02 0.443 0.69 RC
N
f-775751039
f
GR
GS
[1 0 0 1 416.18155 102.64434] CT
0.02 0.443 0.69 RC
N
f-775751039
f
GR
GS
[1 0 0 1 426.60071 127.13618] CT
0.02 0.443 0.69 RC
N
f-775751039
f
GR
GS
[1 0 0 1 443.13763 111.78046] CT
0.02 0.443 0.69 RC
N
f-775751039
f
GR
GS
[1 0 0 1 442.5336 116.07092] CT
0.02 0.443 0.69 RC
N
f-775751039
f
GR
GS
[1 0 0 1 448.99512 132.59032] CT
0.02 0.443 0.69 RC
N
f-775751039
f
GR
GS
[1 0 0 1 430.62506 145.76138] CT
0.02 0.443 0.69 RC
N
f-775751039
f
GR
GS
[1 0 0 1 423.37555 115.42877] CT
0.02 0.443 0.69 RC
N
f-775751039
f
GR
GS
[1 0 0 1 442.79678 98.23614] CT
0.02 0.443 0.69 RC
N
f-775751039
f
GR
GS
[1 0 0 1 421.33707 169.24585] CT
0.02 0.443 0.69 RC
N
f-775751039
f
GR
GS
[1 0 0 1 447.13245 107.16747] CT
0.02 0.443 0.69 RC
N
f-775751039
f
GR
GS
[1 0 0 1 427.43497 125.73167] CT
0.02 0.443 0.69 RC
N
f-775751039
f
GR
GS
[1 0 0 1 417.7764 123.16228] CT
0.02 0.443 0.69 RC
N
f-775751039
f
GR
GS
[1 0 0 1 424.46945 113.23296] CT
0.02 0.443 0.69 RC
N
f-775751039
f
GR
GS
[1 0 0 1 419.34058 134.90408] CT
0.02 0.443 0.69 RC
N
f-775751039
f
GR
GS
[1 0 0 1 430.62878 111.16129] CT
0.02 0.443 0.69 RC
N
f-775751039
f
GR
GS
[1 0 0 1 421.39539 108.92387] CT
0.02 0.443 0.69 RC
N
f-775751039
f
GR
GS
[1 0 0 1 424.6488 95.14983] CT
0.02 0.443 0.69 RC
N
f-775751039
f
GR
GS
[1 0 0 1 429.4472 95.95245] CT
0.02 0.443 0.69 RC
N
f-775751039
f
GR
GS
[1 0 0 1 449.02484 109.22611] CT
0.02 0.443 0.69 RC
N
f-775751039
f
GR
GS
[1 0 0 1 418.65958 141.48976] CT
0.02 0.443 0.69 RC
N
f-775751039
f
GR
GS
[1 0 0 1 428.19455 109.16965] CT
0.02 0.443 0.69 RC
N
f-775751039
f
GR
GS
[1 0 0 1 425.80179 112.55893] CT
0.02 0.443 0.69 RC
N
f-775751039
f
GR
GS
[1 0 0 1 420.41144 98.5365] CT
0.02 0.443 0.69 RC
N
f-775751039
f
GR
GS
[1 0 0 1 423.92969 104.92059] CT
0.02 0.443 0.69 RC
N
f-775751039
f
GR
GS
[1 0 0 1 430.06369 115.76302] CT
0.02 0.443 0.69 RC
N
f-775751039
f
GR
GS
[1 0 0 1 443.77277 79.84588] CT
0.02 0.443 0.69 RC
N
f-775751039
f
GR
GS
1 GC
N
/f-550536740{584 233 M
926.5 233 L
926.5 30 L
584 30 L
cp}def
f-550536740
f
GR
GS
0.149 GC
2 setlinecap
1 LJ
0.5 LW
N
584 233 M
926.5 233 L
S
GR
GS
0.149 GC
2 setlinecap
1 LJ
0.5 LW
N
626.813 233 M
626.813 229.575 L
S
GR
GS
0.149 GC
2 setlinecap
1 LJ
0.5 LW
N
712.438 233 M
712.438 229.575 L
S
GR
GS
0.149 GC
2 setlinecap
1 LJ
0.5 LW
N
798.063 233 M
798.063 229.575 L
S
GR
GS
0.149 GC
2 setlinecap
1 LJ
0.5 LW
N
883.688 233 M
883.688 229.575 L
S
GR
GS
[1 0 0 1 626.8125 239] CT
0.149 GC
/Helvetica 20 F
GS
[1 0 0 1 0 0] CT
-24.5 20 moveto 
1 -1 scale
(Color) t 
GR
GR
GS
[1 0 0 1 712.4375 239] CT
0.149 GC
/Helvetica 20 F
GS
[1 0 0 1 0 0] CT
-40 20 moveto 
1 -1 scale
(Direction) t 
GR
GR
GS
[1 0 0 1 798.0625 239] CT
0.149 GC
/Helvetica 20 F
GS
[1 0 0 1 0 0] CT
-19 20 moveto 
1 -1 scale
(Size) t 
GR
GR
GS
[1 0 0 1 883.6875 239] CT
0.149 GC
/Helvetica 20 F
GS
[1 0 0 1 0 0] CT
-49.5 20 moveto 
1 -1 scale
(Luminance) t 
GR
GR
GS
[1 0 0 1 755.25018 264] CT
0.149 GC
/Helvetica 20 F
GS
[1 0 0 1 0 0] CT
-74 20 moveto 
1 -1 scale
(Probed Attribute) t 
GR
GR
GS
0.149 GC
2 setlinecap
1 LJ
0.5 LW
N
584 233 M
584 30 L
S
GR
GS
0.149 GC
2 setlinecap
1 LJ
0.5 LW
N
584 210.444 M
587.425 210.444 L
S
GR
GS
0.149 GC
2 setlinecap
1 LJ
0.5 LW
N
584 154.056 M
587.425 154.056 L
S
GR
GS
0.149 GC
2 setlinecap
1 LJ
0.5 LW
N
584 97.667 M
587.425 97.667 L
S
GR
GS
0.149 GC
2 setlinecap
1 LJ
0.5 LW
N
584 41.278 M
587.425 41.278 L
S
GR
GS
[1 0 0 1 578 210.44444] CT
0.149 GC
/Helvetica 20 F
GS
[1 0 0 1 0 0] CT
-19 7.5 moveto 
1 -1 scale
(-5) t 
GR
GR
GS
[1 0 0 1 578 154.05556] CT
0.149 GC
/Helvetica 20 F
GS
[1 0 0 1 0 0] CT
-12 7.5 moveto 
1 -1 scale
(0) t 
GR
GR
GS
[1 0 0 1 578 97.66666] CT
0.149 GC
/Helvetica 20 F
GS
[1 0 0 1 0 0] CT
-12 7.5 moveto 
1 -1 scale
(5) t 
GR
GR
GS
[1 0 0 1 578 41.27777] CT
0.149 GC
/Helvetica 20 F
GS
[1 0 0 1 0 0] CT
-23 7.5 moveto 
1 -1 scale
(10) t 
GR
GR
GS
[0 -1 1 0 552.5 131.49991] CT
0.149 GC
/Helvetica 20 F
GS
[1 0 0 1 0 0] CT
-65 -30 moveto 
1 -1 scale
(CPP threshold) t 
GR
GR
GS
[0 -1 1 0 552.5 131.49991] CT
0.149 GC
/Helvetica 20 F
GS
[1 0 0 1 0 0] CT
-74 -5 moveto 
1 -1 scale
([linear load beta]) t 
GR
GR
GS
[1 0 0 1 584 25] CT
0.149 GC
N
/f682067884{2.938 -0.578 M
2.938 -0.734 3.031 -0.859 QT
7.203 -5 L
3.031 -9.156 L
2.938 -9.266 2.938 -9.422 QT
2.938 -9.578 3.055 -9.703 QT
3.172 -9.828 3.344 -9.828 QT
3.484 -9.828 3.641 -9.703 QT
7.781 -5.563 L
11.906 -9.703 L
12.078 -9.828 12.203 -9.828 QT
12.359 -9.828 12.477 -9.711 QT
12.594 -9.594 12.594 -9.422 QT
12.594 -9.266 12.5 -9.156 QT
8.344 -5 L
12.5 -0.859 L
12.594 -0.734 12.594 -0.578 QT
12.594 -0.406 12.477 -0.289 QT
12.359 -0.172 12.203 -0.172 QT
12.047 -0.172 11.906 -0.328 QT
7.781 -4.438 L
3.641 -0.328 L
3.5 -0.172 3.344 -0.172 QT
3.172 -0.172 3.055 -0.305 QT
2.938 -0.438 2.938 -0.578 QT
cp}def
f682067884
f
GR
GS
[1 0 0 1 600 25] CT
0.149 GC
/Helvetica 20 F
GS
[1 0 0 1 0 0] CT
0 0 moveto 
1 -1 scale
(10) t 
GR
GR
GS
[1 0 0 1 623 15] CT
0.149 GC
/Helvetica 16 F
GS
[1 0 0 1 0 0] CT
0 0 moveto 
1 -1 scale
(-4) t 
GR
GR
GS
0.149 GC
1 LJ
0.5 LW
N
584 154.056 M
926.5 154.056 L
S
GR
GS
0.702 GC
N
/f1171451150{592.563 154.056 M
592.563 162.373 L
661.063 162.373 L
661.063 154.056 L
cp
678.188 154.056 M
678.188 163.227 L
746.688 163.227 L
746.688 154.056 L
cp
763.813 154.056 M
763.813 163.786 L
832.313 163.786 L
832.313 154.056 L
cp
849.438 154.056 M
849.438 160.913 L
917.938 160.913 L
917.938 154.056 L
cp}def
f1171451150
f
GR
GS
1 LJ
30 LW
N
626.813 160.132 M
626.813 164.614 L
S
GR
GS
1 LJ
30 LW
N
626.813 160.132 M
626.813 160.132 L
S
GR
GS
1 LJ
30 LW
N
626.813 164.614 M
626.813 164.614 L
S
GR
GS
1 LJ
30 LW
N
712.438 160.481 M
712.438 165.974 L
S
GR
GS
1 LJ
30 LW
N
712.438 160.481 M
712.438 160.481 L
S
GR
GS
1 LJ
30 LW
N
712.438 165.974 M
712.438 165.974 L
S
GR
GS
1 LJ
30 LW
N
798.063 161.253 M
798.063 166.319 L
S
GR
GS
1 LJ
30 LW
N
798.063 161.253 M
798.063 161.253 L
S
GR
GS
1 LJ
30 LW
N
798.063 166.319 M
798.063 166.319 L
S
GR
GS
1 LJ
30 LW
N
883.688 158.454 M
883.688 163.373 L
S
GR
GS
1 LJ
30 LW
N
883.688 158.454 M
883.688 158.454 L
S
GR
GS
1 LJ
30 LW
N
883.688 163.373 M
883.688 163.373 L
S
GR
GS
[1 0 0 1 626.8125 123.04166] CT
/Helvetica-Bold 20 F
GS
[1 0 0 1 0 0] CT
-12.5 7.5 moveto 
1 -1 scale
(***) t 
GR
GR
GS
[1 0 0 1 631.5661 173.17003] CT
0.2 GC
N
f-775751039
f
GR
GS
[1 0 0 1 633.62708 157.35248] CT
0.2 GC
N
f-775751039
f
GR
GS
[1 0 0 1 633.9126 209.67683] CT
0.2 GC
N
f-775751039
f
GR
GS
[1 0 0 1 630.90045 142.55409] CT
0.2 GC
N
f-775751039
f
GR
GS
[1 0 0 1 628.66614 170.59149] CT
0.2 GC
N
f-775751039
f
GR
GS
[1 0 0 1 636.43524 151.77739] CT
0.2 GC
N
f-775751039
f
GR
GS
[1 0 0 1 613.06519 159.94003] CT
0.2 GC
N
f-775751039
f
GR
GS
[1 0 0 1 629.43152 159.18343] CT
0.2 GC
N
f-775751039
f
GR
GS
[1 0 0 1 626.03015 163.88493] CT
0.2 GC
N
f-775751039
f
GR
GS
[1 0 0 1 621.24164 171.72903] CT
0.2 GC
N
f-775751039
f
GR
GS
[1 0 0 1 616.47052 151.68121] CT
0.2 GC
N
f-775751039
f
GR
GS
[1 0 0 1 615.22339 147.65115] CT
0.2 GC
N
f-775751039
f
GR
GS
[1 0 0 1 628.54572 151.0515] CT
0.2 GC
N
f-775751039
f
GR
GS
[1 0 0 1 621.18219 140.53392] CT
0.2 GC
N
f-775751039
f
GR
GS
[1 0 0 1 624.84991 156.42314] CT
0.2 GC
N
f-775751039
f
GR
GS
[1 0 0 1 632.7655 152.79012] CT
0.2 GC
N
f-775751039
f
GR
GS
[1 0 0 1 636.87286 171.49884] CT
0.2 GC
N
f-775751039
f
GR
GS
[1 0 0 1 636.12854 162.93178] CT
0.2 GC
N
f-775751039
f
GR
GS
[1 0 0 1 624.65509 147.21114] CT
0.2 GC
N
f-775751039
f
GR
GS
[1 0 0 1 638.00153 187.83228] CT
0.2 GC
N
f-775751039
f
GR
GS
[1 0 0 1 643.62878 168.54047] CT
0.2 GC
N
f-775751039
f
GR
GS
[1 0 0 1 626.27106 181.30812] CT
0.2 GC
N
f-775751039
f
GR
GS
[1 0 0 1 637.53149 169.29103] CT
0.2 GC
N
f-775751039
f
GR
GS
[1 0 0 1 623.55774 143.92233] CT
0.2 GC
N
f-775751039
f
GR
GS
[1 0 0 1 640.51331 162.47646] CT
0.2 GC
N
f-775751039
f
GR
GS
[1 0 0 1 642.17413 154.12677] CT
0.2 GC
N
f-775751039
f
GR
GS
[1 0 0 1 639.97937 185.81087] CT
0.2 GC
N
f-775751039
f
GR
GS
[1 0 0 1 617.88629 160.2946] CT
0.2 GC
N
f-775751039
f
GR
GS
[1 0 0 1 641.1488 161.30551] CT
0.2 GC
N
f-775751039
f
GR
GS
[1 0 0 1 618.20477 179.89159] CT
0.2 GC
N
f-775751039
f
GR
GS
[1 0 0 1 641.3396 162.13013] CT
0.2 GC
N
f-775751039
f
GR
GS
[1 0 0 1 619.51025 173.37253] CT
0.2 GC
N
f-775751039
f
GR
GS
[1 0 0 1 623.10962 191.99857] CT
0.2 GC
N
f-775751039
f
GR
GS
[1 0 0 1 639.17548 150.41397] CT
0.2 GC
N
f-775751039
f
GR
GS
[1 0 0 1 639.8689 145.68985] CT
0.2 GC
N
f-775751039
f
GR
GS
[1 0 0 1 615.37543 166.99408] CT
0.2 GC
N
f-775751039
f
GR
GS
[1 0 0 1 622.60443 154.68298] CT
0.2 GC
N
f-775751039
f
GR
GS
[1 0 0 1 622.56213 174.00121] CT
0.2 GC
N
f-775751039
f
GR
GS
[1 0 0 1 636.38666 143.74821] CT
0.2 GC
N
f-775751039
f
GR
GS
[1 0 0 1 622.95691 154.93069] CT
0.2 GC
N
f-775751039
f
GR
GS
[1 0 0 1 613.15033 134.37379] CT
0.2 GC
N
f-775751039
f
GR
GS
[1 0 0 1 631.82861 150.49739] CT
0.2 GC
N
f-775751039
f
GR
GS
[1 0 0 1 629.48376 167.04337] CT
0.2 GC
N
f-775751039
f
GR
GS
[1 0 0 1 618.35901 134.95061] CT
0.2 GC
N
f-775751039
f
GR
GS
[1 0 0 1 631.5213 158.87457] CT
0.2 GC
N
f-775751039
f
GR
GS
[1 0 0 1 629.45435 160.37602] CT
0.2 GC
N
f-775751039
f
GR
GS
[1 0 0 1 639.58948 160.74776] CT
0.2 GC
N
f-775751039
f
GR
GS
[1 0 0 1 613.6322 155.53001] CT
0.2 GC
N
f-775751039
f
GR
GS
[1 0 0 1 609.85034 149.70313] CT
0.2 GC
N
f-775751039
f
GR
GS
[1 0 0 1 637.12805 174.41719] CT
0.2 GC
N
f-775751039
f
GR
GS
[1 0 0 1 635.54602 178.60445] CT
0.2 GC
N
f-775751039
f
GR
GS
[1 0 0 1 637.2074 213.25029] CT
0.2 GC
N
f-775751039
f
GR
GS
[1 0 0 1 623.27911 153.00598] CT
0.2 GC
N
f-775751039
f
GR
GS
[1 0 0 1 712.4375 123.04166] CT
/Helvetica-Bold 20 F
GS
[1 0 0 1 0 0] CT
-8.5 7.5 moveto 
1 -1 scale
(**) t 
GR
GR
GS
[1 0 0 1 726.89111 186.6973] CT
0.2 GC
N
f-775751039
f
GR
GS
[1 0 0 1 717.08441 144.47731] CT
0.2 GC
N
f-775751039
f
GR
GS
[1 0 0 1 725.97534 202.91943] CT
0.2 GC
N
f-775751039
f
GR
GS
[1 0 0 1 708.50299 167.53821] CT
0.2 GC
N
f-775751039
f
GR
GS
[1 0 0 1 704.4483 184.20729] CT
0.2 GC
N
f-775751039
f
GR
GS
[1 0 0 1 711.01746 157.13922] CT
0.2 GC
N
f-775751039
f
GR
GS
[1 0 0 1 724.00128 181.74321] CT
0.2 GC
N
f-775751039
f
GR
GS
[1 0 0 1 716.53784 161.19722] CT
0.2 GC
N
f-775751039
f
GR
GS
[1 0 0 1 719.49982 163.6299] CT
0.2 GC
N
f-775751039
f
GR
GS
[1 0 0 1 726.37384 176.56831] CT
0.2 GC
N
f-775751039
f
GR
GS
[1 0 0 1 700.77722 154.51527] CT
0.2 GC
N
f-775751039
f
GR
GS
[1 0 0 1 703.26324 130.54245] CT
0.2 GC
N
f-775751039
f
GR
GS
[1 0 0 1 699.3288 161.23128] CT
0.2 GC
N
f-775751039
f
GR
GS
[1 0 0 1 725.30676 153.68225] CT
0.2 GC
N
f-775751039
f
GR
GS
[1 0 0 1 713.02289 157.65977] CT
0.2 GC
N
f-775751039
f
GR
GS
[1 0 0 1 708.47107 191.77145] CT
0.2 GC
N
f-775751039
f
GR
GS
[1 0 0 1 721.27209 158.00414] CT
0.2 GC
N
f-775751039
f
GR
GS
[1 0 0 1 702.55273 163.2066] CT
0.2 GC
N
f-775751039
f
GR
GS
[1 0 0 1 709.66681 159.27122] CT
0.2 GC
N
f-775751039
f
GR
GS
[1 0 0 1 725.42731 156.07594] CT
0.2 GC
N
f-775751039
f
GR
GS
[1 0 0 1 711.93805 186.28555] CT
0.2 GC
N
f-775751039
f
GR
GS
[1 0 0 1 718.49829 212.76817] CT
0.2 GC
N
f-775751039
f
GR
GS
[1 0 0 1 695.4447 145.15807] CT
0.2 GC
N
f-775751039
f
GR
GS
[1 0 0 1 704.47559 178.71185] CT
0.2 GC
N
f-775751039
f
GR
GS
[1 0 0 1 718.09875 171.05226] CT
0.2 GC
N
f-775751039
f
GR
GS
[1 0 0 1 723.59064 149.52333] CT
0.2 GC
N
f-775751039
f
GR
GS
[1 0 0 1 723.06854 141.18176] CT
0.2 GC
N
f-775751039
f
GR
GS
[1 0 0 1 699.39221 172.66043] CT
0.2 GC
N
f-775751039
f
GR
GS
[1 0 0 1 720.91907 206.25945] CT
0.2 GC
N
f-775751039
f
GR
GS
[1 0 0 1 700.14978 140.9912] CT
0.2 GC
N
f-775751039
f
GR
GS
[1 0 0 1 728.04852 144.20229] CT
0.2 GC
N
f-775751039
f
GR
GS
[1 0 0 1 721.20734 174.23439] CT
0.2 GC
N
f-775751039
f
GR
GS
[1 0 0 1 710.58691 160.61336] CT
0.2 GC
N
f-775751039
f
GR
GS
[1 0 0 1 719.69366 138.3481] CT
0.2 GC
N
f-775751039
f
GR
GS
[1 0 0 1 729.43146 136.8244] CT
0.2 GC
N
f-775751039
f
GR
GS
[1 0 0 1 706.26587 150.45441] CT
0.2 GC
N
f-775751039
f
GR
GS
[1 0 0 1 727.54327 156.19923] CT
0.2 GC
N
f-775751039
f
GR
GS
[1 0 0 1 715.58026 156.23079] CT
0.2 GC
N
f-775751039
f
GR
GS
[1 0 0 1 727.3642 127.72865] CT
0.2 GC
N
f-775751039
f
GR
GS
[1 0 0 1 702.67542 160.55515] CT
0.2 GC
N
f-775751039
f
GR
GS
[1 0 0 1 716.71783 135.48616] CT
0.2 GC
N
f-775751039
f
GR
GS
[1 0 0 1 724.97321 153.01544] CT
0.2 GC
N
f-775751039
f
GR
GS
[1 0 0 1 709.64374 149.79454] CT
0.2 GC
N
f-775751039
f
GR
GS
[1 0 0 1 709.00739 180.81372] CT
0.2 GC
N
f-775751039
f
GR
GS
[1 0 0 1 701.94617 151.40607] CT
0.2 GC
N
f-775751039
f
GR
GS
[1 0 0 1 720.32703 159.56755] CT
0.2 GC
N
f-775751039
f
GR
GS
[1 0 0 1 695.35956 153.09502] CT
0.2 GC
N
f-775751039
f
GR
GS
[1 0 0 1 729.04462 166.86414] CT
0.2 GC
N
f-775751039
f
GR
GS
[1 0 0 1 712.71509 177.81834] CT
0.2 GC
N
f-775751039
f
GR
GS
[1 0 0 1 704.01874 165.40367] CT
0.2 GC
N
f-775751039
f
GR
GS
[1 0 0 1 728.69293 153.06505] CT
0.2 GC
N
f-775751039
f
GR
GS
[1 0 0 1 700.92975 218.85445] CT
0.2 GC
N
f-775751039
f
GR
GS
[1 0 0 1 706.90668 163.81239] CT
0.2 GC
N
f-775751039
f
GR
GS
[1 0 0 1 798.0625 123.04166] CT
/Helvetica-Bold 20 F
GS
[1 0 0 1 0 0] CT
-12.5 7.5 moveto 
1 -1 scale
(***) t 
GR
GR
GS
[1 0 0 1 805.31866 162.70769] CT
0.2 GC
N
f-775751039
f
GR
GS
[1 0 0 1 786.51227 184.35658] CT
0.2 GC
N
f-775751039
f
GR
GS
[1 0 0 1 785.95264 155.9756] CT
0.2 GC
N
f-775751039
f
GR
GS
[1 0 0 1 812.20239 171.4442] CT
0.2 GC
N
f-775751039
f
GR
GS
[1 0 0 1 807.21332 156.00806] CT
0.2 GC
N
f-775751039
f
GR
GS
[1 0 0 1 787.98059 160.42397] CT
0.2 GC
N
f-775751039
f
GR
GS
[1 0 0 1 806.44983 151.81149] CT
0.2 GC
N
f-775751039
f
GR
GS
[1 0 0 1 809.08228 170.96596] CT
0.2 GC
N
f-775751039
f
GR
GS
[1 0 0 1 787.85553 170.74803] CT
0.2 GC
N
f-775751039
f
GR
GS
[1 0 0 1 802.31958 154.39601] CT
0.2 GC
N
f-775751039
f
GR
GS
[1 0 0 1 800.47174 147.53735] CT
0.2 GC
N
f-775751039
f
GR
GS
[1 0 0 1 784.77399 151.96027] CT
0.2 GC
N
f-775751039
f
GR
GS
[1 0 0 1 781.35675 170.37804] CT
0.2 GC
N
f-775751039
f
GR
GS
[1 0 0 1 795.11328 158.3875] CT
0.2 GC
N
f-775751039
f
GR
GS
[1 0 0 1 798.08746 171.06787] CT
0.2 GC
N
f-775751039
f
GR
GS
[1 0 0 1 783.97021 156.66521] CT
0.2 GC
N
f-775751039
f
GR
GS
[1 0 0 1 786.83124 164.41545] CT
0.2 GC
N
f-775751039
f
GR
GS
[1 0 0 1 807.88898 154.14543] CT
0.2 GC
N
f-775751039
f
GR
GS
[1 0 0 1 784.42224 151.94695] CT
0.2 GC
N
f-775751039
f
GR
GS
[1 0 0 1 792.42407 178.53561] CT
0.2 GC
N
f-775751039
f
GR
GS
[1 0 0 1 788.34387 175.04291] CT
0.2 GC
N
f-775751039
f
GR
GS
[1 0 0 1 793.47314 172.6562] CT
0.2 GC
N
f-775751039
f
GR
GS
[1 0 0 1 793.11389 189.19946] CT
0.2 GC
N
f-775751039
f
GR
GS
[1 0 0 1 814.03082 186.46527] CT
0.2 GC
N
f-775751039
f
GR
GS
[1 0 0 1 789.72772 169.24706] CT
0.2 GC
N
f-775751039
f
GR
GS
[1 0 0 1 788.24304 165.61844] CT
0.2 GC
N
f-775751039
f
GR
GS
[1 0 0 1 787.91528 128.87779] CT
0.2 GC
N
f-775751039
f
GR
GS
[1 0 0 1 789.54626 186.03162] CT
0.2 GC
N
f-775751039
f
GR
GS
[1 0 0 1 783.1134 166.22688] CT
0.2 GC
N
f-775751039
f
GR
GS
[1 0 0 1 806.14722 161.35275] CT
0.2 GC
N
f-775751039
f
GR
GS
[1 0 0 1 788.36566 184.01674] CT
0.2 GC
N
f-775751039
f
GR
GS
[1 0 0 1 796.36969 177.2422] CT
0.2 GC
N
f-775751039
f
GR
GS
[1 0 0 1 808.64819 159.17197] CT
0.2 GC
N
f-775751039
f
GR
GS
[1 0 0 1 781.52423 175.92851] CT
0.2 GC
N
f-775751039
f
GR
GS
[1 0 0 1 793.52386 144.75926] CT
0.2 GC
N
f-775751039
f
GR
GS
[1 0 0 1 799.53613 140.11102] CT
0.2 GC
N
f-775751039
f
GR
GS
[1 0 0 1 811.00641 157.713] CT
0.2 GC
N
f-775751039
f
GR
GS
[1 0 0 1 800.86279 129.85829] CT
0.2 GC
N
f-775751039
f
GR
GS
[1 0 0 1 799.69257 179.90543] CT
0.2 GC
N
f-775751039
f
GR
GS
[1 0 0 1 802.26776 159.17509] CT
0.2 GC
N
f-775751039
f
GR
GS
[1 0 0 1 796.99738 143.74474] CT
0.2 GC
N
f-775751039
f
GR
GS
[1 0 0 1 807.05853 165.76895] CT
0.2 GC
N
f-775751039
f
GR
GS
[1 0 0 1 781.81158 150.40656] CT
0.2 GC
N
f-775751039
f
GR
GS
[1 0 0 1 784.25464 140.68645] CT
0.2 GC
N
f-775751039
f
GR
GS
[1 0 0 1 792.76611 175.08952] CT
0.2 GC
N
f-775751039
f
GR
GS
[1 0 0 1 803.51459 123.8852] CT
0.2 GC
N
f-775751039
f
GR
GS
[1 0 0 1 811.09888 145.75827] CT
0.2 GC
N
f-775751039
f
GR
GS
[1 0 0 1 788.86334 181.45311] CT
0.2 GC
N
f-775751039
f
GR
GS
[1 0 0 1 782.80292 163.88622] CT
0.2 GC
N
f-775751039
f
GR
GS
[1 0 0 1 794.27002 178.74739] CT
0.2 GC
N
f-775751039
f
GR
GS
[1 0 0 1 791.5061 147.58537] CT
0.2 GC
N
f-775751039
f
GR
GS
[1 0 0 1 795.2868 174.21916] CT
0.2 GC
N
f-775751039
f
GR
GS
[1 0 0 1 883.6875 123.04166] CT
/Helvetica-Bold 20 F
GS
[1 0 0 1 0 0] CT
-8.5 7.5 moveto 
1 -1 scale
(**) t 
GR
GR
GS
[1 0 0 1 893.83563 183.50365] CT
0.2 GC
N
f-775751039
f
GR
GS
[1 0 0 1 899.95337 151.11746] CT
0.2 GC
N
f-775751039
f
GR
GS
[1 0 0 1 894.83643 207.19536] CT
0.2 GC
N
f-775751039
f
GR
GS
[1 0 0 1 900.75494 151.84406] CT
0.2 GC
N
f-775751039
f
GR
GS
[1 0 0 1 874.3869 155.121] CT
0.2 GC
N
f-775751039
f
GR
GS
[1 0 0 1 897.4986 140.58867] CT
0.2 GC
N
f-775751039
f
GR
GS
[1 0 0 1 886.85895 167.35229] CT
0.2 GC
N
f-775751039
f
GR
GS
[1 0 0 1 874.30029 158.56183] CT
0.2 GC
N
f-775751039
f
GR
GS
[1 0 0 1 875.08466 157.37785] CT
0.2 GC
N
f-775751039
f
GR
GS
[1 0 0 1 883.95752 140.60075] CT
0.2 GC
N
f-775751039
f
GR
GS
[1 0 0 1 884.58392 149.6059] CT
0.2 GC
N
f-775751039
f
GR
GS
[1 0 0 1 879.46716 127.26368] CT
0.2 GC
N
f-775751039
f
GR
GS
[1 0 0 1 897.95483 158.72066] CT
0.2 GC
N
f-775751039
f
GR
GS
[1 0 0 1 893.67596 151.87819] CT
0.2 GC
N
f-775751039
f
GR
GS
[1 0 0 1 871.20013 170.0834] CT
0.2 GC
N
f-775751039
f
GR
GS
[1 0 0 1 879.50806 150.03772] CT
0.2 GC
N
f-775751039
f
GR
GS
[1 0 0 1 878.22986 147.87611] CT
0.2 GC
N
f-775751039
f
GR
GS
[1 0 0 1 875.88428 179.1324] CT
0.2 GC
N
f-775751039
f
GR
GS
[1 0 0 1 897.27899 160.67827] CT
0.2 GC
N
f-775751039
f
GR
GS
[1 0 0 1 869.80176 133.67575] CT
0.2 GC
N
f-775751039
f
GR
GS
[1 0 0 1 887.60693 180.91977] CT
0.2 GC
N
f-775751039
f
GR
GS
[1 0 0 1 880.30023 168.90161] CT
0.2 GC
N
f-775751039
f
GR
GS
[1 0 0 1 872.29816 138.31848] CT
0.2 GC
N
f-775751039
f
GR
GS
[1 0 0 1 893.14557 184.64087] CT
0.2 GC
N
f-775751039
f
GR
GS
[1 0 0 1 896.24646 161.42894] CT
0.2 GC
N
f-775751039
f
GR
GS
[1 0 0 1 899.98877 163.41859] CT
0.2 GC
N
f-775751039
f
GR
GS
[1 0 0 1 882.72864 155.17328] CT
0.2 GC
N
f-775751039
f
GR
GS
[1 0 0 1 869.33405 165.67484] CT
0.2 GC
N
f-775751039
f
GR
GS
[1 0 0 1 883.38409 192.61215] CT
0.2 GC
N
f-775751039
f
GR
GS
[1 0 0 1 890.16412 143.85521] CT
0.2 GC
N
f-775751039
f
GR
GS
[1 0 0 1 882.71069 152.10947] CT
0.2 GC
N
f-775751039
f
GR
GS
[1 0 0 1 887.09705 172.27446] CT
0.2 GC
N
f-775751039
f
GR
GS
[1 0 0 1 877.95569 174.26855] CT
0.2 GC
N
f-775751039
f
GR
GS
[1 0 0 1 878.34869 155.84332] CT
0.2 GC
N
f-775751039
f
GR
GS
[1 0 0 1 896.09027 172.73035] CT
0.2 GC
N
f-775751039
f
GR
GS
[1 0 0 1 890.96564 153.80458] CT
0.2 GC
N
f-775751039
f
GR
GS
[1 0 0 1 900.24854 144.62553] CT
0.2 GC
N
f-775751039
f
GR
GS
[1 0 0 1 898.5235 150.63608] CT
0.2 GC
N
f-775751039
f
GR
GS
[1 0 0 1 894.92065 135.9505] CT
0.2 GC
N
f-775751039
f
GR
GS
[1 0 0 1 872.93286 165.65482] CT
0.2 GC
N
f-775751039
f
GR
GS
[1 0 0 1 896.05579 214.76826] CT
0.2 GC
N
f-775751039
f
GR
GS
[1 0 0 1 896.52368 164.20584] CT
0.2 GC
N
f-775751039
f
GR
GS
[1 0 0 1 896.92834 153.46159] CT
0.2 GC
N
f-775751039
f
GR
GS
[1 0 0 1 884.28717 181.13647] CT
0.2 GC
N
f-775751039
f
GR
GS
[1 0 0 1 874.63104 142.45604] CT
0.2 GC
N
f-775751039
f
GR
GS
[1 0 0 1 894.40198 164.00433] CT
0.2 GC
N
f-775751039
f
GR
GS
[1 0 0 1 898.02362 168.3084] CT
0.2 GC
N
f-775751039
f
GR
GS
[1 0 0 1 874.64978 132.55135] CT
0.2 GC
N
f-775751039
f
GR
GS
[1 0 0 1 891.23199 161.74283] CT
0.2 GC
N
f-775751039
f
GR
GS
[1 0 0 1 888.14893 157.11311] CT
0.2 GC
N
f-775751039
f
GR
GS
[1 0 0 1 886.56091 174.21191] CT
0.2 GC
N
f-775751039
f
GR
GS
[1 0 0 1 898.77026 188.18999] CT
0.2 GC
N
f-775751039
f
GR
GS
[1 0 0 1 873.12109 151.19101] CT
0.2 GC
N
f-775751039
f
GR
%%Trailer
%%Pages: 1
%%EOF
