%!PS-Adobe-3.0 EPSF-3.0
%%Creator: (MATLAB, The Mathworks, Inc. Version 9.8.0.1323502 \(R2020a\). Operating System: Mac OS X)
%%Title: /Users/kosciessa/Desktop/tardis/LNDG/stateswitch/stsw_eeg_task/cpp/figures/E/F2_CPPbyStim_ThreshSlope_OA.eps
%%CreationDate: 2022-02-01T15:43:35
%%Pages: (atend)
%%BoundingBox:    69     4   940   282
%%LanguageLevel: 3
%%EndComments
%%BeginProlog
%%BeginResource: procset (Apache XML Graphics Std ProcSet) 1.2 0
%%Version: 1.2 0
%%Copyright: (Copyright 2001-2003,2010 The Apache Software Foundation. License terms: http://www.apache.org/licenses/LICENSE-2.0)
/bd{bind def}bind def
/ld{load def}bd
/GR/grestore ld
/GS/gsave ld
/RM/rmoveto ld
/C/curveto ld
/t/show ld
/L/lineto ld
/ML/setmiterlimit ld
/CT/concat ld
/f/fill ld
/N/newpath ld
/S/stroke ld
/CC/setcmykcolor ld
/A/ashow ld
/cp/closepath ld
/RC/setrgbcolor ld
/LJ/setlinejoin ld
/GC/setgray ld
/LW/setlinewidth ld
/M/moveto ld
/re {4 2 roll M
1 index 0 rlineto
0 exch rlineto
neg 0 rlineto
cp } bd
/_ctm matrix def
/_tm matrix def
/BT { _ctm currentmatrix pop matrix _tm copy pop 0 0 moveto } bd
/ET { _ctm setmatrix } bd
/iTm { _ctm setmatrix _tm concat } bd
/Tm { _tm astore pop iTm 0 0 moveto } bd
/ux 0.0 def
/uy 0.0 def
/F {
  /Tp exch def
  /Tf exch def
  Tf findfont Tp scalefont setfont
  /cf Tf def  /cs Tp def
} bd
/ULS {currentpoint /uy exch def /ux exch def} bd
/ULE {
  /Tcx currentpoint pop def
  gsave
  newpath
  cf findfont cs scalefont dup
  /FontMatrix get 0 get /Ts exch def /FontInfo get dup
  /UnderlinePosition get Ts mul /To exch def
  /UnderlineThickness get Ts mul /Tt exch def
  ux uy To add moveto  Tcx uy To add lineto
  Tt setlinewidth stroke
  grestore
} bd
/OLE {
  /Tcx currentpoint pop def
  gsave
  newpath
  cf findfont cs scalefont dup
  /FontMatrix get 0 get /Ts exch def /FontInfo get dup
  /UnderlinePosition get Ts mul /To exch def
  /UnderlineThickness get Ts mul /Tt exch def
  ux uy To add cs add moveto Tcx uy To add cs add lineto
  Tt setlinewidth stroke
  grestore
} bd
/SOE {
  /Tcx currentpoint pop def
  gsave
  newpath
  cf findfont cs scalefont dup
  /FontMatrix get 0 get /Ts exch def /FontInfo get dup
  /UnderlinePosition get Ts mul /To exch def
  /UnderlineThickness get Ts mul /Tt exch def
  ux uy To add cs 10 mul 26 idiv add moveto Tcx uy To add cs 10 mul 26 idiv add lineto
  Tt setlinewidth stroke
  grestore
} bd
/QT {
/Y22 exch store
/X22 exch store
/Y21 exch store
/X21 exch store
currentpoint
/Y21 load 2 mul add 3 div exch
/X21 load 2 mul add 3 div exch
/X21 load 2 mul /X22 load add 3 div
/Y21 load 2 mul /Y22 load add 3 div
/X22 load /Y22 load curveto
} bd
/SSPD {
dup length /d exch dict def
{
/v exch def
/k exch def
currentpagedevice k known {
/cpdv currentpagedevice k get def
v cpdv ne {
/upd false def
/nullv v type /nulltype eq def
/nullcpdv cpdv type /nulltype eq def
nullv nullcpdv or
{
/upd true def
} {
/sametype v type cpdv type eq def
sametype {
v type /arraytype eq {
/vlen v length def
/cpdvlen cpdv length def
vlen cpdvlen eq {
0 1 vlen 1 sub {
/i exch def
/obj v i get def
/cpdobj cpdv i get def
obj cpdobj ne {
/upd true def
exit
} if
} for
} {
/upd true def
} ifelse
} {
v type /dicttype eq {
v {
/dv exch def
/dk exch def
/cpddv cpdv dk get def
dv cpddv ne {
/upd true def
exit
} if
} forall
} {
/upd true def
} ifelse
} ifelse
} if
} ifelse
upd true eq {
d k v put
} if
} if
} if
} forall
d length 0 gt {
d setpagedevice
} if
} bd
/RE { % /NewFontName [NewEncodingArray] /FontName RE -
  findfont dup length dict begin
  {
    1 index /FID ne
    {def} {pop pop} ifelse
  } forall
  /Encoding exch def
  /FontName 1 index def
  currentdict definefont pop
  end
} bind def
%%EndResource
%%BeginResource: procset (Apache XML Graphics EPS ProcSet) 1.0 0
%%Version: 1.0 0
%%Copyright: (Copyright 2002-2003 The Apache Software Foundation. License terms: http://www.apache.org/licenses/LICENSE-2.0)
/BeginEPSF { %def
/b4_Inc_state save def         % Save state for cleanup
/dict_count countdictstack def % Count objects on dict stack
/op_count count 1 sub def      % Count objects on operand stack
userdict begin                 % Push userdict on dict stack
/showpage { } def              % Redefine showpage, { } = null proc
0 setgray 0 setlinecap         % Prepare graphics state
1 setlinewidth 0 setlinejoin
10 setmiterlimit [ ] 0 setdash newpath
/languagelevel where           % If level not equal to 1 then
{pop languagelevel             % set strokeadjust and
1 ne                           % overprint to their defaults.
{false setstrokeadjust false setoverprint
} if
} if
} bd
/EndEPSF { %def
count op_count sub {pop} repeat            % Clean up stacks
countdictstack dict_count sub {end} repeat
b4_Inc_state restore
} bd
%%EndResource
%FOPBeginFontDict
%%IncludeResource: font Courier-Oblique
%%IncludeResource: font Courier-BoldOblique
%%IncludeResource: font Courier-Bold
%%IncludeResource: font ZapfDingbats
%%IncludeResource: font Symbol
%%IncludeResource: font Helvetica
%%IncludeResource: font Helvetica-Oblique
%%IncludeResource: font Helvetica-Bold
%%IncludeResource: font Helvetica-BoldOblique
%%IncludeResource: font Times-Roman
%%IncludeResource: font Times-Italic
%%IncludeResource: font Times-Bold
%%IncludeResource: font Times-BoldItalic
%%IncludeResource: font Courier
%FOPEndFontDict
%%BeginResource: encoding WinAnsiEncoding
/WinAnsiEncoding [
/.notdef /.notdef /.notdef /.notdef /.notdef
/.notdef /.notdef /.notdef /.notdef /.notdef
/.notdef /.notdef /.notdef /.notdef /.notdef
/.notdef /.notdef /.notdef /.notdef /.notdef
/.notdef /.notdef /.notdef /.notdef /.notdef
/.notdef /.notdef /.notdef /.notdef /.notdef
/.notdef /.notdef /space /exclam /quotedbl
/numbersign /dollar /percent /ampersand /quotesingle
/parenleft /parenright /asterisk /plus /comma
/hyphen /period /slash /zero /one
/two /three /four /five /six
/seven /eight /nine /colon /semicolon
/less /equal /greater /question /at
/A /B /C /D /E
/F /G /H /I /J
/K /L /M /N /O
/P /Q /R /S /T
/U /V /W /X /Y
/Z /bracketleft /backslash /bracketright /asciicircum
/underscore /quoteleft /a /b /c
/d /e /f /g /h
/i /j /k /l /m
/n /o /p /q /r
/s /t /u /v /w
/x /y /z /braceleft /bar
/braceright /asciitilde /bullet /Euro /bullet
/quotesinglbase /florin /quotedblbase /ellipsis /dagger
/daggerdbl /circumflex /perthousand /Scaron /guilsinglleft
/OE /bullet /Zcaron /bullet /bullet
/quoteleft /quoteright /quotedblleft /quotedblright /bullet
/endash /emdash /asciitilde /trademark /scaron
/guilsinglright /oe /bullet /zcaron /Ydieresis
/space /exclamdown /cent /sterling /currency
/yen /brokenbar /section /dieresis /copyright
/ordfeminine /guillemotleft /logicalnot /sfthyphen /registered
/macron /degree /plusminus /twosuperior /threesuperior
/acute /mu /paragraph /middot /cedilla
/onesuperior /ordmasculine /guillemotright /onequarter /onehalf
/threequarters /questiondown /Agrave /Aacute /Acircumflex
/Atilde /Adieresis /Aring /AE /Ccedilla
/Egrave /Eacute /Ecircumflex /Edieresis /Igrave
/Iacute /Icircumflex /Idieresis /Eth /Ntilde
/Ograve /Oacute /Ocircumflex /Otilde /Odieresis
/multiply /Oslash /Ugrave /Uacute /Ucircumflex
/Udieresis /Yacute /Thorn /germandbls /agrave
/aacute /acircumflex /atilde /adieresis /aring
/ae /ccedilla /egrave /eacute /ecircumflex
/edieresis /igrave /iacute /icircumflex /idieresis
/eth /ntilde /ograve /oacute /ocircumflex
/otilde /odieresis /divide /oslash /ugrave
/uacute /ucircumflex /udieresis /yacute /thorn
/ydieresis
] def
%%EndResource
%FOPBeginFontReencode
/Courier-Oblique findfont
dup length dict begin
  {1 index /FID ne {def} {pop pop} ifelse} forall
  /Encoding WinAnsiEncoding def
  currentdict
end
/Courier-Oblique exch definefont pop
/Courier-BoldOblique findfont
dup length dict begin
  {1 index /FID ne {def} {pop pop} ifelse} forall
  /Encoding WinAnsiEncoding def
  currentdict
end
/Courier-BoldOblique exch definefont pop
/Courier-Bold findfont
dup length dict begin
  {1 index /FID ne {def} {pop pop} ifelse} forall
  /Encoding WinAnsiEncoding def
  currentdict
end
/Courier-Bold exch definefont pop
/Helvetica findfont
dup length dict begin
  {1 index /FID ne {def} {pop pop} ifelse} forall
  /Encoding WinAnsiEncoding def
  currentdict
end
/Helvetica exch definefont pop
/Helvetica-Oblique findfont
dup length dict begin
  {1 index /FID ne {def} {pop pop} ifelse} forall
  /Encoding WinAnsiEncoding def
  currentdict
end
/Helvetica-Oblique exch definefont pop
/Helvetica-Bold findfont
dup length dict begin
  {1 index /FID ne {def} {pop pop} ifelse} forall
  /Encoding WinAnsiEncoding def
  currentdict
end
/Helvetica-Bold exch definefont pop
/Helvetica-BoldOblique findfont
dup length dict begin
  {1 index /FID ne {def} {pop pop} ifelse} forall
  /Encoding WinAnsiEncoding def
  currentdict
end
/Helvetica-BoldOblique exch definefont pop
/Times-Roman findfont
dup length dict begin
  {1 index /FID ne {def} {pop pop} ifelse} forall
  /Encoding WinAnsiEncoding def
  currentdict
end
/Times-Roman exch definefont pop
/Times-Italic findfont
dup length dict begin
  {1 index /FID ne {def} {pop pop} ifelse} forall
  /Encoding WinAnsiEncoding def
  currentdict
end
/Times-Italic exch definefont pop
/Times-Bold findfont
dup length dict begin
  {1 index /FID ne {def} {pop pop} ifelse} forall
  /Encoding WinAnsiEncoding def
  currentdict
end
/Times-Bold exch definefont pop
/Times-BoldItalic findfont
dup length dict begin
  {1 index /FID ne {def} {pop pop} ifelse} forall
  /Encoding WinAnsiEncoding def
  currentdict
end
/Times-BoldItalic exch definefont pop
/Courier findfont
dup length dict begin
  {1 index /FID ne {def} {pop pop} ifelse} forall
  /Encoding WinAnsiEncoding def
  currentdict
end
/Courier exch definefont pop
%FOPEndFontReencode
%%EndProlog
%%Page: 1 1
%%PageBoundingBox: 0 0 1024 288
%%BeginPageSetup
[1 0 0 -1 0 288] CT
%%EndPageSetup
GS
1 GC
N
0 0 1024 288 re
f
GR
GS
1 GC
N
0 0 1024 288 re
f
GR
GS
1 GC
N
133 226.5 M
476 226.5 L
476 34.5 L
133 34.5 L
cp
f
GR
GS
0.149 GC
2 setlinecap
1 LJ
0.5 LW
N
133 226.5 M
476 226.5 L
S
GR
GS
0.149 GC
2 setlinecap
1 LJ
0.5 LW
N
175.875 226.5 M
175.875 223.07 L
S
GR
GS
0.149 GC
2 setlinecap
1 LJ
0.5 LW
N
261.625 226.5 M
261.625 223.07 L
S
GR
GS
0.149 GC
2 setlinecap
1 LJ
0.5 LW
N
347.375 226.5 M
347.375 223.07 L
S
GR
GS
0.149 GC
2 setlinecap
1 LJ
0.5 LW
N
433.125 226.5 M
433.125 223.07 L
S
GR
GS
[1 0 0 1 175.875 233.10001] CT
0.149 GC
/Helvetica 23 F
GS
[1 0 0 1 0 0] CT
-28 22 moveto 
1 -1 scale
(Color) t 
GR
GR
GS
[1 0 0 1 261.625 233.10001] CT
0.149 GC
/Helvetica 23 F
GS
[1 0 0 1 0 0] CT
-46 22 moveto 
1 -1 scale
(Direction) t 
GR
GR
GS
[1 0 0 1 347.375 233.10001] CT
0.149 GC
/Helvetica 23 F
GS
[1 0 0 1 0 0] CT
-22 22 moveto 
1 -1 scale
(Size) t 
GR
GR
GS
[1 0 0 1 433.125 233.10001] CT
0.149 GC
/Helvetica 23 F
GS
[1 0 0 1 0 0] CT
-56.5 22 moveto 
1 -1 scale
(Luminance) t 
GR
GR
GS
[1 0 0 1 304.50015 261.10001] CT
0.149 GC
/Helvetica 23 F
GS
[1 0 0 1 0 0] CT
-80 22 moveto 
1 -1 scale
(Probed Feature) t 
GR
GR
GS
0.149 GC
2 setlinecap
1 LJ
0.5 LW
N
133 226.5 M
133 34.5 L
S
GR
GS
0.149 GC
2 setlinecap
1 LJ
0.5 LW
N
133 226.5 M
136.43 226.5 L
S
GR
GS
0.149 GC
2 setlinecap
1 LJ
0.5 LW
N
133 135.071 M
136.43 135.071 L
S
GR
GS
0.149 GC
2 setlinecap
1 LJ
0.5 LW
N
133 43.643 M
136.43 43.643 L
S
GR
GS
[1 0 0 1 126.4 226.5] CT
0.149 GC
/Helvetica 23 F
GS
[1 0 0 1 0 0] CT
-13 8.5 moveto 
1 -1 scale
(0) t 
GR
GR
GS
[1 0 0 1 126.4 135.07143] CT
0.149 GC
/Helvetica 23 F
GS
[1 0 0 1 0 0] CT
-32 8.5 moveto 
1 -1 scale
(0.5) t 
GR
GR
GS
[1 0 0 1 126.4 43.64286] CT
0.149 GC
/Helvetica 23 F
GS
[1 0 0 1 0 0] CT
-13 8.5 moveto 
1 -1 scale
(1) t 
GR
GR
GS
[0 -1 1 0 91.4 130.49991] CT
0.149 GC
/Helvetica 23 F
GS
[1 0 0 1 0 0] CT
-54.5 -5 moveto 
1 -1 scale
(CPP slope) t 
GR
GR
GS
[1 0 0 1 133 30] CT
0.149 GC
N
3.375 -0.656 M
3.375 -0.844 3.5 -0.984 QT
8.281 -5.75 L
3.5 -10.531 L
3.375 -10.641 3.375 -10.844 QT
3.375 -11 3.516 -11.148 QT
3.656 -11.297 3.844 -11.297 QT
4 -11.297 4.188 -11.156 QT
8.953 -6.391 L
13.688 -11.156 L
13.875 -11.297 14.031 -11.297 QT
14.219 -11.297 14.352 -11.164 QT
14.484 -11.031 14.484 -10.844 QT
14.484 -10.641 14.375 -10.531 QT
9.594 -5.75 L
14.375 -0.984 L
14.484 -0.844 14.484 -0.656 QT
14.484 -0.469 14.352 -0.336 QT
14.219 -0.203 14.031 -0.203 QT
13.859 -0.203 13.688 -0.375 QT
8.953 -5.109 L
4.188 -0.375 L
4.016 -0.203 3.844 -0.203 QT
3.656 -0.203 3.516 -0.352 QT
3.375 -0.5 3.375 -0.656 QT
cp
f
GR
GS
[1 0 0 1 151 30] CT
0.149 GC
/Helvetica 23 F
GS
[1 0 0 1 0 0] CT
0 0 moveto 
1 -1 scale
(10) t 
GR
GR
GS
[1 0 0 1 177 19] CT
0.149 GC
/Helvetica 18.4 F
GS
[1 0 0 1 0 0] CT
0 0 moveto 
1 -1 scale
(-5) t 
GR
GR
GS
0.149 GC
1 LJ
0.5 LW
N
133 226.5 M
476 226.5 L
S
GR
GS
0.2 0.6 0.2 RC
N
210.175 226.5 M
210.175 165.659 L
141.575 165.659 L
141.575 226.5 L
cp
295.925 226.5 M
295.925 148.331 L
227.325 148.331 L
227.325 226.5 L
cp
381.675 226.5 M
381.675 176.832 L
313.075 176.832 L
313.075 226.5 L
cp
467.425 226.5 M
467.425 190.483 L
398.825 190.483 L
398.825 226.5 L
cp
f
GR
GS
1 LJ
4 LW
N
175.875 151.129 M
175.875 180.188 L
S
GR
GS
1 LJ
4 LW
N
175.875 151.129 M
175.875 151.129 L
S
GR
GS
1 LJ
4 LW
N
175.875 180.188 M
175.875 180.188 L
S
GR
GS
1 LJ
4 LW
N
261.625 135.443 M
261.625 161.218 L
S
GR
GS
1 LJ
4 LW
N
261.625 135.443 M
261.625 135.443 L
S
GR
GS
1 LJ
4 LW
N
261.625 161.218 M
261.625 161.218 L
S
GR
GS
1 LJ
4 LW
N
347.375 166.844 M
347.375 186.819 L
S
GR
GS
1 LJ
4 LW
N
347.375 166.844 M
347.375 166.844 L
S
GR
GS
1 LJ
4 LW
N
347.375 186.819 M
347.375 186.819 L
S
GR
GS
1 LJ
4 LW
N
433.125 179.605 M
433.125 201.361 L
S
GR
GS
1 LJ
4 LW
N
433.125 179.605 M
433.125 179.605 L
S
GR
GS
1 LJ
4 LW
N
433.125 201.361 M
433.125 201.361 L
S
GR
GS
1 LJ
0.5 LW
N
270.2 39.986 M
338.8 39.986 L
S
GR
GS
1 GC
N
298.5 54.986 M
310.5 54.986 L
310.5 24.986 L
298.5 24.986 L
cp
f
GR
GS
[1 0 0 1 304.5 39.98571] CT
/Helvetica-Bold 23 F
GS
[1 0 0 1 0 0] CT
-5 9 moveto 
1 -1 scale
(*) t 
GR
GR
GS
1 LJ
0.5 LW
N
270.2 61.929 M
424.55 61.929 L
S
GR
GS
1 GC
N
336.875 76.929 M
357.875 76.929 L
357.875 46.929 L
336.875 46.929 L
cp
f
GR
GS
[1 0 0 1 347.375 61.92857] CT
/Helvetica-Bold 23 F
GS
[1 0 0 1 0 0] CT
-9.5 9 moveto 
1 -1 scale
(**) t 
GR
GR
GS
1 GC
N
584 226.5 M
926.5 226.5 L
926.5 34.5 L
584 34.5 L
cp
f
GR
GS
0.149 GC
2 setlinecap
1 LJ
0.5 LW
N
584 226.5 M
926.5 226.5 L
S
GR
GS
0.149 GC
2 setlinecap
1 LJ
0.5 LW
N
626.813 226.5 M
626.813 223.075 L
S
GR
GS
0.149 GC
2 setlinecap
1 LJ
0.5 LW
N
712.438 226.5 M
712.438 223.075 L
S
GR
GS
0.149 GC
2 setlinecap
1 LJ
0.5 LW
N
798.063 226.5 M
798.063 223.075 L
S
GR
GS
0.149 GC
2 setlinecap
1 LJ
0.5 LW
N
883.688 226.5 M
883.688 223.075 L
S
GR
GS
[1 0 0 1 626.8125 233.10001] CT
0.149 GC
/Helvetica 23 F
GS
[1 0 0 1 0 0] CT
-28 22 moveto 
1 -1 scale
(Color) t 
GR
GR
GS
[1 0 0 1 712.4375 233.10001] CT
0.149 GC
/Helvetica 23 F
GS
[1 0 0 1 0 0] CT
-46 22 moveto 
1 -1 scale
(Direction) t 
GR
GR
GS
[1 0 0 1 798.0625 233.10001] CT
0.149 GC
/Helvetica 23 F
GS
[1 0 0 1 0 0] CT
-22 22 moveto 
1 -1 scale
(Size) t 
GR
GR
GS
[1 0 0 1 883.6875 233.10001] CT
0.149 GC
/Helvetica 23 F
GS
[1 0 0 1 0 0] CT
-56.5 22 moveto 
1 -1 scale
(Luminance) t 
GR
GR
GS
[1 0 0 1 755.25018 261.10001] CT
0.149 GC
/Helvetica 23 F
GS
[1 0 0 1 0 0] CT
-80 22 moveto 
1 -1 scale
(Probed Feature) t 
GR
GR
GS
0.149 GC
2 setlinecap
1 LJ
0.5 LW
N
584 226.5 M
584 34.5 L
S
GR
GS
0.149 GC
2 setlinecap
1 LJ
0.5 LW
N
584 226.5 M
587.425 226.5 L
S
GR
GS
0.149 GC
2 setlinecap
1 LJ
0.5 LW
N
584 183.833 M
587.425 183.833 L
S
GR
GS
0.149 GC
2 setlinecap
1 LJ
0.5 LW
N
584 141.167 M
587.425 141.167 L
S
GR
GS
0.149 GC
2 setlinecap
1 LJ
0.5 LW
N
584 98.5 M
587.425 98.5 L
S
GR
GS
0.149 GC
2 setlinecap
1 LJ
0.5 LW
N
584 55.833 M
587.425 55.833 L
S
GR
GS
[1 0 0 1 577.40002 226.5] CT
0.149 GC
/Helvetica 23 F
GS
[1 0 0 1 0 0] CT
-13 8.5 moveto 
1 -1 scale
(0) t 
GR
GR
GS
[1 0 0 1 577.40002 183.83333] CT
0.149 GC
/Helvetica 23 F
GS
[1 0 0 1 0 0] CT
-13 8.5 moveto 
1 -1 scale
(2) t 
GR
GR
GS
[1 0 0 1 577.40002 141.16667] CT
0.149 GC
/Helvetica 23 F
GS
[1 0 0 1 0 0] CT
-13 8.5 moveto 
1 -1 scale
(4) t 
GR
GR
GS
[1 0 0 1 577.40002 98.49999] CT
0.149 GC
/Helvetica 23 F
GS
[1 0 0 1 0 0] CT
-13 8.5 moveto 
1 -1 scale
(6) t 
GR
GR
GS
[1 0 0 1 577.40002 55.83334] CT
0.149 GC
/Helvetica 23 F
GS
[1 0 0 1 0 0] CT
-13 8.5 moveto 
1 -1 scale
(8) t 
GR
GR
GS
[0 -1 1 0 561.40002 130.49991] CT
0.149 GC
/Helvetica 23 F
GS
[1 0 0 1 0 0] CT
-100.5 -5 moveto 
1 -1 scale
(CPP Threshold \(?V\)) t 
GR
GR
GS
[1 0 0 1 584 30] CT
0.149 GC
N
/f-708981657{3.375 -0.656 M
3.375 -0.844 3.5 -0.984 QT
8.281 -5.75 L
3.5 -10.531 L
3.375 -10.641 3.375 -10.844 QT
3.375 -11 3.516 -11.148 QT
3.656 -11.297 3.844 -11.297 QT
4 -11.297 4.188 -11.156 QT
8.953 -6.391 L
13.688 -11.156 L
13.875 -11.297 14.031 -11.297 QT
14.219 -11.297 14.352 -11.164 QT
14.484 -11.031 14.484 -10.844 QT
14.484 -10.641 14.375 -10.531 QT
9.594 -5.75 L
14.375 -0.984 L
14.484 -0.844 14.484 -0.656 QT
14.484 -0.469 14.352 -0.336 QT
14.219 -0.203 14.031 -0.203 QT
13.859 -0.203 13.688 -0.375 QT
8.953 -5.109 L
4.188 -0.375 L
4.016 -0.203 3.844 -0.203 QT
3.656 -0.203 3.516 -0.352 QT
3.375 -0.5 3.375 -0.656 QT
cp}def
f-708981657
f
GR
GS
[1 0 0 1 602 30] CT
0.149 GC
/Helvetica 23 F
GS
[1 0 0 1 0 0] CT
0 0 moveto 
1 -1 scale
(10) t 
GR
GR
GS
[1 0 0 1 628 19] CT
0.149 GC
/Helvetica 18.4 F
GS
[1 0 0 1 0 0] CT
0 0 moveto 
1 -1 scale
(-4) t 
GR
GR
GS
0.149 GC
1 LJ
0.5 LW
N
584 226.5 M
926.5 226.5 L
S
GR
GS
0.2 0.6 0.2 RC
N
661.063 226.5 M
661.063 133.407 L
592.563 133.407 L
592.563 226.5 L
cp
746.688 226.5 M
746.688 96.627 L
678.188 96.627 L
678.188 226.5 L
cp
832.313 226.5 M
832.313 120.402 L
763.813 120.402 L
763.813 226.5 L
cp
917.938 226.5 M
917.938 141.852 L
849.438 141.852 L
849.438 226.5 L
cp
f
GR
GS
1 LJ
4 LW
N
626.813 117.272 M
626.813 149.541 L
S
GR
GS
1 LJ
4 LW
N
626.813 117.272 M
626.813 117.272 L
S
GR
GS
1 LJ
4 LW
N
626.813 149.541 M
626.813 149.541 L
S
GR
GS
1 LJ
4 LW
N
712.438 82.215 M
712.438 111.038 L
S
GR
GS
1 LJ
4 LW
N
712.438 82.215 M
712.438 82.215 L
S
GR
GS
1 LJ
4 LW
N
712.438 111.038 M
712.438 111.038 L
S
GR
GS
1 LJ
4 LW
N
798.063 106.183 M
798.063 134.621 L
S
GR
GS
1 LJ
4 LW
N
798.063 106.183 M
798.063 106.183 L
S
GR
GS
1 LJ
4 LW
N
798.063 134.621 M
798.063 134.621 L
S
GR
GS
1 LJ
4 LW
N
883.688 126.865 M
883.688 156.839 L
S
GR
GS
1 LJ
4 LW
N
883.688 126.865 M
883.688 126.865 L
S
GR
GS
1 LJ
4 LW
N
883.688 156.839 M
883.688 156.839 L
S
GR
GS
1 LJ
0.5 LW
N
635.375 49.433 M
703.875 49.433 L
S
GR
GS
1 GC
N
663.625 64.433 M
675.625 64.433 L
675.625 34.433 L
663.625 34.433 L
cp
f
GR
GS
[1 0 0 1 669.625 49.43334] CT
/Helvetica-Bold 23 F
GS
[1 0 0 1 0 0] CT
-5 9 moveto 
1 -1 scale
(*) t 
GR
GR
GS
1 LJ
0.5 LW
N
721 36.633 M
789.5 36.633 L
S
GR
GS
1 GC
N
749.25 51.633 M
761.25 51.633 L
761.25 21.633 L
749.25 21.633 L
cp
f
GR
GS
[1 0 0 1 755.25 36.63333] CT
/Helvetica-Bold 23 F
GS
[1 0 0 1 0 0] CT
-5 9 moveto 
1 -1 scale
(*) t 
GR
GR
GS
1 LJ
0.5 LW
N
806.625 61.167 M
875.125 61.167 L
S
GR
GS
1 GC
N
834.875 76.167 M
846.875 76.167 L
846.875 46.167 L
834.875 46.167 L
cp
f
GR
GS
[1 0 0 1 840.875 61.16666] CT
/Helvetica-Bold 23 F
GS
[1 0 0 1 0 0] CT
-5 9 moveto 
1 -1 scale
(*) t 
GR
GR
GS
1 LJ
0.5 LW
N
721 45.167 M
875.125 45.167 L
S
GR
GS
1 GC
N
787.563 60.167 M
808.563 60.167 L
808.563 30.167 L
787.563 30.167 L
cp
f
GR
GS
[1 0 0 1 798.0625 45.16666] CT
/Helvetica-Bold 23 F
GS
[1 0 0 1 0 0] CT
-9.5 9 moveto 
1 -1 scale
(**) t 
GR
GR
%%Trailer
%%Pages: 1
%%EOF
