%!PS-Adobe-3.0 EPSF-3.0
%%Creator: (MATLAB, The Mathworks, Inc. Version 9.8.0.1323502 \(R2020a\). Operating System: Mac OS X)
%%Title: /Users/kosciessa/Desktop/mntTardisLNDG/LNDG/stateswitch/stsw_eeg_task/cpp/figures/E/Z3_CPP_YAOA_rescaled.eps
%%CreationDate: 2022-03-02T18:41:45
%%Pages: (atend)
%%BoundingBox:     3     0   234   202
%%LanguageLevel: 3
%%EndComments
%%BeginProlog
%%BeginResource: procset (Apache XML Graphics Std ProcSet) 1.2 0
%%Version: 1.2 0
%%Copyright: (Copyright 2001-2003,2010 The Apache Software Foundation. License terms: http://www.apache.org/licenses/LICENSE-2.0)
/bd{bind def}bind def
/ld{load def}bd
/GR/grestore ld
/GS/gsave ld
/RM/rmoveto ld
/C/curveto ld
/t/show ld
/L/lineto ld
/ML/setmiterlimit ld
/CT/concat ld
/f/fill ld
/N/newpath ld
/S/stroke ld
/CC/setcmykcolor ld
/A/ashow ld
/cp/closepath ld
/RC/setrgbcolor ld
/LJ/setlinejoin ld
/GC/setgray ld
/LW/setlinewidth ld
/M/moveto ld
/re {4 2 roll M
1 index 0 rlineto
0 exch rlineto
neg 0 rlineto
cp } bd
/_ctm matrix def
/_tm matrix def
/BT { _ctm currentmatrix pop matrix _tm copy pop 0 0 moveto } bd
/ET { _ctm setmatrix } bd
/iTm { _ctm setmatrix _tm concat } bd
/Tm { _tm astore pop iTm 0 0 moveto } bd
/ux 0.0 def
/uy 0.0 def
/F {
  /Tp exch def
  /Tf exch def
  Tf findfont Tp scalefont setfont
  /cf Tf def  /cs Tp def
} bd
/ULS {currentpoint /uy exch def /ux exch def} bd
/ULE {
  /Tcx currentpoint pop def
  gsave
  newpath
  cf findfont cs scalefont dup
  /FontMatrix get 0 get /Ts exch def /FontInfo get dup
  /UnderlinePosition get Ts mul /To exch def
  /UnderlineThickness get Ts mul /Tt exch def
  ux uy To add moveto  Tcx uy To add lineto
  Tt setlinewidth stroke
  grestore
} bd
/OLE {
  /Tcx currentpoint pop def
  gsave
  newpath
  cf findfont cs scalefont dup
  /FontMatrix get 0 get /Ts exch def /FontInfo get dup
  /UnderlinePosition get Ts mul /To exch def
  /UnderlineThickness get Ts mul /Tt exch def
  ux uy To add cs add moveto Tcx uy To add cs add lineto
  Tt setlinewidth stroke
  grestore
} bd
/SOE {
  /Tcx currentpoint pop def
  gsave
  newpath
  cf findfont cs scalefont dup
  /FontMatrix get 0 get /Ts exch def /FontInfo get dup
  /UnderlinePosition get Ts mul /To exch def
  /UnderlineThickness get Ts mul /Tt exch def
  ux uy To add cs 10 mul 26 idiv add moveto Tcx uy To add cs 10 mul 26 idiv add lineto
  Tt setlinewidth stroke
  grestore
} bd
/QT {
/Y22 exch store
/X22 exch store
/Y21 exch store
/X21 exch store
currentpoint
/Y21 load 2 mul add 3 div exch
/X21 load 2 mul add 3 div exch
/X21 load 2 mul /X22 load add 3 div
/Y21 load 2 mul /Y22 load add 3 div
/X22 load /Y22 load curveto
} bd
/SSPD {
dup length /d exch dict def
{
/v exch def
/k exch def
currentpagedevice k known {
/cpdv currentpagedevice k get def
v cpdv ne {
/upd false def
/nullv v type /nulltype eq def
/nullcpdv cpdv type /nulltype eq def
nullv nullcpdv or
{
/upd true def
} {
/sametype v type cpdv type eq def
sametype {
v type /arraytype eq {
/vlen v length def
/cpdvlen cpdv length def
vlen cpdvlen eq {
0 1 vlen 1 sub {
/i exch def
/obj v i get def
/cpdobj cpdv i get def
obj cpdobj ne {
/upd true def
exit
} if
} for
} {
/upd true def
} ifelse
} {
v type /dicttype eq {
v {
/dv exch def
/dk exch def
/cpddv cpdv dk get def
dv cpddv ne {
/upd true def
exit
} if
} forall
} {
/upd true def
} ifelse
} ifelse
} if
} ifelse
upd true eq {
d k v put
} if
} if
} if
} forall
d length 0 gt {
d setpagedevice
} if
} bd
/RE { % /NewFontName [NewEncodingArray] /FontName RE -
  findfont dup length dict begin
  {
    1 index /FID ne
    {def} {pop pop} ifelse
  } forall
  /Encoding exch def
  /FontName 1 index def
  currentdict definefont pop
  end
} bind def
%%EndResource
%%BeginResource: procset (Apache XML Graphics EPS ProcSet) 1.0 0
%%Version: 1.0 0
%%Copyright: (Copyright 2002-2003 The Apache Software Foundation. License terms: http://www.apache.org/licenses/LICENSE-2.0)
/BeginEPSF { %def
/b4_Inc_state save def         % Save state for cleanup
/dict_count countdictstack def % Count objects on dict stack
/op_count count 1 sub def      % Count objects on operand stack
userdict begin                 % Push userdict on dict stack
/showpage { } def              % Redefine showpage, { } = null proc
0 setgray 0 setlinecap         % Prepare graphics state
1 setlinewidth 0 setlinejoin
10 setmiterlimit [ ] 0 setdash newpath
/languagelevel where           % If level not equal to 1 then
{pop languagelevel             % set strokeadjust and
1 ne                           % overprint to their defaults.
{false setstrokeadjust false setoverprint
} if
} if
} bd
/EndEPSF { %def
count op_count sub {pop} repeat            % Clean up stacks
countdictstack dict_count sub {end} repeat
b4_Inc_state restore
} bd
%%EndResource
%FOPBeginFontDict
%%IncludeResource: font Courier-Oblique
%%IncludeResource: font Courier-BoldOblique
%%IncludeResource: font Courier-Bold
%%IncludeResource: font ZapfDingbats
%%IncludeResource: font Symbol
%%IncludeResource: font Helvetica
%%IncludeResource: font Helvetica-Oblique
%%IncludeResource: font Helvetica-Bold
%%IncludeResource: font Helvetica-BoldOblique
%%IncludeResource: font Times-Roman
%%IncludeResource: font Times-Italic
%%IncludeResource: font Times-Bold
%%IncludeResource: font Times-BoldItalic
%%IncludeResource: font Courier
%FOPEndFontDict
%%BeginResource: encoding WinAnsiEncoding
/WinAnsiEncoding [
/.notdef /.notdef /.notdef /.notdef /.notdef
/.notdef /.notdef /.notdef /.notdef /.notdef
/.notdef /.notdef /.notdef /.notdef /.notdef
/.notdef /.notdef /.notdef /.notdef /.notdef
/.notdef /.notdef /.notdef /.notdef /.notdef
/.notdef /.notdef /.notdef /.notdef /.notdef
/.notdef /.notdef /space /exclam /quotedbl
/numbersign /dollar /percent /ampersand /quotesingle
/parenleft /parenright /asterisk /plus /comma
/hyphen /period /slash /zero /one
/two /three /four /five /six
/seven /eight /nine /colon /semicolon
/less /equal /greater /question /at
/A /B /C /D /E
/F /G /H /I /J
/K /L /M /N /O
/P /Q /R /S /T
/U /V /W /X /Y
/Z /bracketleft /backslash /bracketright /asciicircum
/underscore /quoteleft /a /b /c
/d /e /f /g /h
/i /j /k /l /m
/n /o /p /q /r
/s /t /u /v /w
/x /y /z /braceleft /bar
/braceright /asciitilde /bullet /Euro /bullet
/quotesinglbase /florin /quotedblbase /ellipsis /dagger
/daggerdbl /circumflex /perthousand /Scaron /guilsinglleft
/OE /bullet /Zcaron /bullet /bullet
/quoteleft /quoteright /quotedblleft /quotedblright /bullet
/endash /emdash /asciitilde /trademark /scaron
/guilsinglright /oe /bullet /zcaron /Ydieresis
/space /exclamdown /cent /sterling /currency
/yen /brokenbar /section /dieresis /copyright
/ordfeminine /guillemotleft /logicalnot /sfthyphen /registered
/macron /degree /plusminus /twosuperior /threesuperior
/acute /mu /paragraph /middot /cedilla
/onesuperior /ordmasculine /guillemotright /onequarter /onehalf
/threequarters /questiondown /Agrave /Aacute /Acircumflex
/Atilde /Adieresis /Aring /AE /Ccedilla
/Egrave /Eacute /Ecircumflex /Edieresis /Igrave
/Iacute /Icircumflex /Idieresis /Eth /Ntilde
/Ograve /Oacute /Ocircumflex /Otilde /Odieresis
/multiply /Oslash /Ugrave /Uacute /Ucircumflex
/Udieresis /Yacute /Thorn /germandbls /agrave
/aacute /acircumflex /atilde /adieresis /aring
/ae /ccedilla /egrave /eacute /ecircumflex
/edieresis /igrave /iacute /icircumflex /idieresis
/eth /ntilde /ograve /oacute /ocircumflex
/otilde /odieresis /divide /oslash /ugrave
/uacute /ucircumflex /udieresis /yacute /thorn
/ydieresis
] def
%%EndResource
%FOPBeginFontReencode
/Courier-Oblique findfont
dup length dict begin
  {1 index /FID ne {def} {pop pop} ifelse} forall
  /Encoding WinAnsiEncoding def
  currentdict
end
/Courier-Oblique exch definefont pop
/Courier-BoldOblique findfont
dup length dict begin
  {1 index /FID ne {def} {pop pop} ifelse} forall
  /Encoding WinAnsiEncoding def
  currentdict
end
/Courier-BoldOblique exch definefont pop
/Courier-Bold findfont
dup length dict begin
  {1 index /FID ne {def} {pop pop} ifelse} forall
  /Encoding WinAnsiEncoding def
  currentdict
end
/Courier-Bold exch definefont pop
/Helvetica findfont
dup length dict begin
  {1 index /FID ne {def} {pop pop} ifelse} forall
  /Encoding WinAnsiEncoding def
  currentdict
end
/Helvetica exch definefont pop
/Helvetica-Oblique findfont
dup length dict begin
  {1 index /FID ne {def} {pop pop} ifelse} forall
  /Encoding WinAnsiEncoding def
  currentdict
end
/Helvetica-Oblique exch definefont pop
/Helvetica-Bold findfont
dup length dict begin
  {1 index /FID ne {def} {pop pop} ifelse} forall
  /Encoding WinAnsiEncoding def
  currentdict
end
/Helvetica-Bold exch definefont pop
/Helvetica-BoldOblique findfont
dup length dict begin
  {1 index /FID ne {def} {pop pop} ifelse} forall
  /Encoding WinAnsiEncoding def
  currentdict
end
/Helvetica-BoldOblique exch definefont pop
/Times-Roman findfont
dup length dict begin
  {1 index /FID ne {def} {pop pop} ifelse} forall
  /Encoding WinAnsiEncoding def
  currentdict
end
/Times-Roman exch definefont pop
/Times-Italic findfont
dup length dict begin
  {1 index /FID ne {def} {pop pop} ifelse} forall
  /Encoding WinAnsiEncoding def
  currentdict
end
/Times-Italic exch definefont pop
/Times-Bold findfont
dup length dict begin
  {1 index /FID ne {def} {pop pop} ifelse} forall
  /Encoding WinAnsiEncoding def
  currentdict
end
/Times-Bold exch definefont pop
/Times-BoldItalic findfont
dup length dict begin
  {1 index /FID ne {def} {pop pop} ifelse} forall
  /Encoding WinAnsiEncoding def
  currentdict
end
/Times-BoldItalic exch definefont pop
/Courier findfont
dup length dict begin
  {1 index /FID ne {def} {pop pop} ifelse} forall
  /Encoding WinAnsiEncoding def
  currentdict
end
/Courier exch definefont pop
%FOPEndFontReencode
%%EndProlog
%%Page: 1 1
%%PageBoundingBox: 0 0 256 216
%%BeginPageSetup
[1 0 0 -1 0 216] CT
%%EndPageSetup
GS
1 GC
N
0 0 256 216 re
f
GR
GS
1 GC
N
0 0 256 216 re
f
GR
GS
1 GC
N
49.5 172 M
231.5 172 L
231.5 16 L
49.5 16 L
cp
f
GR
GS
0.149 GC
2 setlinecap
1 LJ
0.5 LW
N
49.5 172 M
231.5 172 L
S
GR
GS
0.149 GC
2 setlinecap
1 LJ
0.5 LW
N
49.5 172 M
49.5 170.18 L
S
GR
GS
0.149 GC
2 setlinecap
1 LJ
0.5 LW
N
132.227 172 M
132.227 170.18 L
S
GR
GS
0.149 GC
2 setlinecap
1 LJ
0.5 LW
N
214.955 172 M
214.955 170.18 L
S
GR
GS
[1 0 0 1 49.5 177.2] CT
0.149 GC
/Helvetica 16 F
GS
[1 0 0 1 0 0] CT
-21 16 moveto 
1 -1 scale
(-1000) t 
GR
GR
GS
[1 0 0 1 132.22728 177.2] CT
0.149 GC
/Helvetica 16 F
GS
[1 0 0 1 0 0] CT
-16.5 16 moveto 
1 -1 scale
(-500) t 
GR
GR
GS
[1 0 0 1 214.95454 177.2] CT
0.149 GC
/Helvetica 16 F
GS
[1 0 0 1 0 0] CT
-4.5 16 moveto 
1 -1 scale
(0) t 
GR
GR
GS
[1 0 0 1 140.50009 197.2] CT
0.149 GC
/Helvetica 16 F
GS
[1 0 0 1 0 0] CT
-79.5 16 moveto 
1 -1 scale
(Time to response \(ms\)) t 
GR
GR
GS
0.149 GC
2 setlinecap
1 LJ
0.5 LW
N
49.5 172 M
49.5 16 L
S
GR
GS
0.149 GC
2 setlinecap
1 LJ
0.5 LW
N
49.5 164.527 M
51.32 164.527 L
S
GR
GS
0.149 GC
2 setlinecap
1 LJ
0.5 LW
N
49.5 96.419 M
51.32 96.419 L
S
GR
GS
0.149 GC
2 setlinecap
1 LJ
0.5 LW
N
49.5 28.311 M
51.32 28.311 L
S
GR
GS
[1 0 0 1 44.3 164.52721] CT
0.149 GC
/Helvetica 16 F
GS
[1 0 0 1 0 0] CT
-9 6 moveto 
1 -1 scale
(0) t 
GR
GR
GS
[1 0 0 1 44.3 96.41893] CT
0.149 GC
/Helvetica 16 F
GS
[1 0 0 1 0 0] CT
-23 6 moveto 
1 -1 scale
(0.5) t 
GR
GR
GS
[1 0 0 1 44.3 28.31065] CT
0.149 GC
/Helvetica 16 F
GS
[1 0 0 1 0 0] CT
-9 6 moveto 
1 -1 scale
(1) t 
GR
GR
GS
[0 -1 1 0 18.8 93.99993] CT
0.149 GC
/Helvetica 16 F
GS
[1 0 0 1 0 0] CT
-53 -4 moveto 
1 -1 scale
(CPP \(rescaled\)) t 
GR
GR
GS
0.62 0.792 0.882 RC
1 LJ
3 LW
N
49.5 164.768 M
49.831 164.749 L
50.162 164.732 L
50.493 164.716 L
50.824 164.7 L
51.155 164.685 L
51.485 164.671 L
51.816 164.656 L
52.147 164.642 L
52.478 164.628 L
52.809 164.613 L
53.14 164.598 L
53.471 164.583 L
53.802 164.568 L
54.133 164.552 L
54.464 164.536 L
54.795 164.52 L
55.125 164.503 L
55.456 164.487 L
55.787 164.471 L
56.118 164.456 L
56.449 164.441 L
56.78 164.426 L
57.111 164.413 L
57.442 164.401 L
57.773 164.39 L
58.104 164.381 L
58.435 164.374 L
58.765 164.369 L
59.096 164.366 L
59.427 164.365 L
59.758 164.367 L
60.089 164.372 L
60.42 164.38 L
60.751 164.392 L
61.082 164.406 L
61.413 164.423 L
61.744 164.444 L
62.075 164.469 L
62.405 164.496 L
62.736 164.527 L
63.067 164.562 L
63.398 164.599 L
63.729 164.64 L
64.06 164.684 L
64.391 164.731 L
64.722 164.78 L
65.053 164.833 L
65.384 164.887 L
65.715 164.944 L
66.045 165.003 L
66.376 165.064 L
66.707 165.127 L
67.038 165.19 L
67.369 165.255 L
67.7 165.32 L
68.031 165.386 L
68.362 165.453 L
68.693 165.519 L
69.024 165.584 L
69.355 165.65 L
69.685 165.714 L
70.016 165.777 L
70.347 165.838 L
70.678 165.898 L
71.009 165.955 L
71.34 166.01 L
71.671 166.062 L
72.002 166.112 L
72.333 166.158 L
72.664 166.201 L
72.995 166.24 L
73.325 166.275 L
73.656 166.305 L
73.987 166.332 L
74.318 166.353 L
74.649 166.37 L
74.98 166.382 L
75.311 166.389 L
75.642 166.391 L
75.973 166.388 L
76.304 166.38 L
76.635 166.366 L
76.965 166.348 L
77.296 166.324 L
77.627 166.296 L
77.958 166.262 L
78.289 166.225 L
78.62 166.183 L
78.951 166.137 L
79.282 166.088 L
79.613 166.035 L
79.944 165.98 L
80.275 165.923 L
80.605 165.863 L
80.936 165.803 L
81.267 165.741 L
81.598 165.68 L
81.929 165.619 L
82.26 165.559 L
82.591 165.501 L
82.922 165.445 L
83.253 165.392 L
83.584 165.342 L
83.915 165.296 L
84.245 165.255 L
84.576 165.218 L
84.907 165.187 L
85.238 165.161 L
85.569 165.142 L
85.9 165.129 L
86.231 165.122 L
86.562 165.121 L
86.893 165.128 L
87.224 165.141 L
87.555 165.16 L
87.885 165.186 L
88.216 165.218 L
88.547 165.255 L
88.878 165.298 L
89.209 165.346 L
89.54 165.398 L
89.871 165.454 L
90.202 165.512 L
90.533 165.573 L
90.864 165.635 L
91.195 165.699 L
91.525 165.761 L
91.856 165.823 L
92.187 165.883 L
92.518 165.941 L
92.849 165.994 L
93.18 166.044 L
93.511 166.088 L
93.842 166.126 L
94.173 166.157 L
94.504 166.181 L
94.835 166.196 L
95.165 166.203 L
95.496 166.201 L
95.827 166.19 L
96.158 166.169 L
96.489 166.138 L
96.82 166.097 L
97.151 166.045 L
97.482 165.984 L
97.813 165.913 L
98.144 165.833 L
98.475 165.743 L
98.805 165.645 L
99.136 165.539 L
99.467 165.425 L
99.798 165.305 L
100.129 165.178 L
100.46 165.047 L
100.791 164.911 L
101.122 164.772 L
101.453 164.631 L
101.784 164.489 L
102.115 164.346 L
102.445 164.204 L
102.776 164.063 L
103.107 163.926 L
103.438 163.791 L
103.769 163.661 L
104.1 163.537 L
104.431 163.418 L
104.762 163.306 L
105.093 163.201 L
105.424 163.104 L
105.755 163.015 L
106.085 162.935 L
106.416 162.864 L
106.747 162.801 L
107.078 162.748 L
107.409 162.704 L
107.74 162.669 L
108.071 162.643 L
108.402 162.626 L
108.733 162.616 L
109.064 162.615 L
109.395 162.621 L
109.725 162.633 L
110.056 162.652 L
110.387 162.677 L
110.718 162.706 L
111.049 162.74 L
111.38 162.777 L
111.711 162.817 L
112.042 162.859 L
112.373 162.903 L
112.704 162.947 L
113.035 162.991 L
113.365 163.034 L
113.696 163.076 L
114.027 163.116 L
114.358 163.154 L
114.689 163.189 L
115.02 163.22 L
115.351 163.247 L
115.682 163.271 L
116.013 163.289 L
116.344 163.303 L
116.675 163.312 L
117.005 163.315 L
117.336 163.313 L
117.667 163.306 L
117.998 163.293 L
118.329 163.275 L
118.66 163.252 L
118.991 163.223 L
119.322 163.188 L
119.653 163.149 L
119.984 163.105 L
120.315 163.056 L
120.645 163.002 L
120.976 162.945 L
121.307 162.883 L
121.638 162.817 L
121.969 162.748 L
122.3 162.676 L
122.631 162.6 L
122.962 162.522 L
123.293 162.442 L
123.624 162.36 L
123.955 162.276 L
124.285 162.19 L
124.616 162.104 L
124.947 162.017 L
125.278 161.93 L
125.609 161.842 L
125.94 161.755 L
126.271 161.669 L
126.602 161.584 L
126.933 161.5 L
127.264 161.418 L
127.595 161.338 L
127.925 161.261 L
128.256 161.187 L
128.587 161.115 L
128.918 161.047 L
129.249 160.983 L
129.58 160.923 L
129.911 160.867 L
130.242 160.816 L
130.573 160.769 L
130.904 160.728 L
131.235 160.691 L
131.565 160.66 L
131.896 160.634 L
132.227 160.614 L
132.558 160.598 L
132.889 160.588 L
133.22 160.584 L
133.551 160.585 L
133.882 160.59 L
134.213 160.601 L
134.544 160.616 L
134.875 160.635 L
135.205 160.659 L
135.536 160.686 L
135.867 160.716 L
136.198 160.749 L
136.529 160.785 L
136.86 160.822 L
137.191 160.861 L
137.522 160.901 L
137.853 160.941 L
138.184 160.982 L
138.515 161.021 L
138.845 161.06 L
139.176 161.097 L
139.507 161.132 L
139.838 161.164 L
140.169 161.193 L
140.5 161.219 L
140.831 161.242 L
141.162 161.26 L
141.493 161.274 L
141.824 161.284 L
142.155 161.289 L
142.485 161.289 L
142.816 161.284 L
143.147 161.275 L
143.478 161.26 L
143.809 161.241 L
144.14 161.218 L
144.471 161.19 L
144.802 161.159 L
145.133 161.123 L
145.464 161.084 L
145.795 161.042 L
146.125 160.998 L
146.456 160.951 L
146.787 160.902 L
147.118 160.851 L
147.449 160.8 L
147.78 160.747 L
148.111 160.694 L
148.442 160.642 L
148.773 160.589 L
149.104 160.536 L
149.435 160.484 L
149.765 160.433 L
150.096 160.383 L
150.427 160.333 L
150.758 160.284 L
151.089 160.235 L
151.42 160.186 L
151.751 160.137 L
152.082 160.088 L
152.413 160.037 L
152.744 159.985 L
153.075 159.93 L
153.405 159.872 L
153.736 159.81 L
154.067 159.744 L
154.398 159.672 L
154.729 159.594 L
155.06 159.508 L
155.391 159.414 L
155.722 159.311 L
156.053 159.197 L
156.384 159.072 L
156.715 158.934 L
157.045 158.784 L
157.376 158.619 L
157.707 158.44 L
158.038 158.245 L
158.369 158.034 L
158.7 157.806 L
159.031 157.56 L
159.362 157.298 L
159.693 157.017 L
160.024 156.718 L
160.355 156.401 L
160.685 156.066 L
161.016 155.714 L
161.347 155.344 L
161.678 154.957 L
162.009 154.553 L
162.34 154.135 L
162.671 153.701 L
163.002 153.253 L
163.333 152.793 L
163.664 152.321 L
163.995 151.839 L
164.325 151.347 L
164.656 150.847 L
164.987 150.341 L
165.318 149.83 L
165.649 149.315 L
165.98 148.798 L
166.311 148.279 L
166.642 147.762 L
166.973 147.246 L
167.304 146.733 L
167.635 146.224 L
167.965 145.721 L
168.296 145.224 L
168.627 144.734 L
168.958 144.252 L
169.289 143.779 L
169.62 143.316 L
169.951 142.861 L
170.282 142.417 L
170.613 141.983 L
170.944 141.558 L
171.275 141.143 L
171.605 140.737 L
171.936 140.339 L
172.267 139.949 L
172.598 139.567 L
172.929 139.19 L
173.26 138.818 L
173.591 138.45 L
173.922 138.084 L
174.253 137.718 L
174.584 137.352 L
174.915 136.984 L
175.245 136.612 L
175.576 136.234 L
175.907 135.849 L
176.238 135.455 L
176.569 135.05 L
176.9 134.632 L
177.231 134.2 L
177.562 133.753 L
177.893 133.287 L
178.224 132.803 L
178.555 132.299 L
178.885 131.773 L
179.216 131.224 L
179.547 130.651 L
179.878 130.053 L
180.209 129.43 L
180.54 128.779 L
180.871 128.102 L
181.202 127.396 L
181.533 126.663 L
181.864 125.902 L
182.195 125.111 L
182.525 124.293 L
182.856 123.446 L
183.187 122.571 L
183.518 121.668 L
183.849 120.738 L
184.18 119.78 L
184.511 118.796 L
184.842 117.786 L
185.173 116.751 L
185.504 115.691 L
185.835 114.607 L
186.165 113.5 L
186.496 112.371 L
186.827 111.22 L
187.158 110.047 L
187.489 108.854 L
187.82 107.641 L
188.151 106.409 L
188.482 105.159 L
188.813 103.89 L
189.144 102.604 L
189.475 101.301 L
189.805 99.981 L
190.136 98.645 L
190.467 97.293 L
190.798 95.925 L
191.129 94.542 L
191.46 93.144 L
191.791 91.731 L
192.122 90.304 L
192.453 88.862 L
192.784 87.406 L
193.115 85.936 L
193.445 84.452 L
193.776 82.955 L
194.107 81.445 L
194.438 79.922 L
194.769 78.386 L
195.1 76.839 L
195.431 75.281 L
195.762 73.712 L
196.093 72.133 L
196.424 70.546 L
196.755 68.95 L
197.085 67.346 L
197.416 65.737 L
197.747 64.123 L
198.078 62.506 L
198.409 60.887 L
198.74 59.267 L
199.071 57.648 L
199.402 56.032 L
199.733 54.421 L
200.064 52.816 L
200.395 51.22 L
200.725 49.635 L
201.056 48.063 L
201.387 46.505 L
201.718 44.965 L
202.049 43.444 L
202.38 41.945 L
202.711 40.47 L
203.042 39.021 L
203.373 37.601 L
203.704 36.212 L
204.035 34.856 L
204.365 33.535 L
204.696 32.252 L
205.027 31.008 L
205.358 29.805 L
205.689 28.645 L
206.02 27.531 L
206.351 26.463 L
206.682 25.442 L
207.013 24.471 L
207.344 23.551 L
207.675 22.682 L
208.005 21.865 L
208.336 21.102 L
208.667 20.392 L
208.998 19.736 L
209.329 19.135 L
209.66 18.587 L
209.991 18.094 L
210.322 17.655 L
210.653 17.27 L
210.984 16.937 L
211.315 16.656 L
211.645 16.427 L
211.976 16.248 L
212.307 16.118 L
212.638 16.036 L
212.969 16 L
213.3 16.01 L
213.631 16.063 L
213.962 16.159 L
214.293 16.295 L
214.624 16.47 L
214.955 16.683 L
215.285 16.931 L
215.616 17.214 L
215.947 17.529 L
216.278 17.876 L
216.609 18.252 L
216.94 18.656 L
217.271 19.088 L
217.602 19.545 L
217.933 20.027 L
218.264 20.533 L
218.595 21.062 L
218.925 21.613 L
219.256 22.186 L
219.587 22.78 L
219.918 23.395 L
220.249 24.031 L
220.58 24.689 L
220.911 25.368 L
221.242 26.069 L
221.573 26.792 L
221.904 27.539 L
222.235 28.311 L
222.565 29.107 L
222.896 29.931 L
223.227 30.783 L
223.558 31.664 L
223.889 32.578 L
224.22 33.524 L
224.551 34.506 L
224.882 35.525 L
225.213 36.583 L
225.544 37.683 L
225.875 38.826 L
226.205 40.015 L
226.536 41.251 L
226.867 42.538 L
227.198 43.876 L
227.529 45.268 L
227.86 46.716 L
228.191 48.22 L
228.522 49.783 L
228.853 51.406 L
229.184 53.088 L
229.515 54.832 L
229.845 56.638 L
230.176 58.504 L
230.507 60.432 L
230.838 62.419 L
231.169 64.466 L
231.5 66.569 L
231.522 66.711 L
S
GR
GS
0.031 0.318 0.612 RC
1 LJ
3 LW
N
49.5 167.778 M
49.831 167.647 L
50.162 167.514 L
50.493 167.377 L
50.824 167.238 L
51.155 167.097 L
51.485 166.954 L
51.816 166.811 L
52.147 166.668 L
52.478 166.525 L
52.809 166.383 L
53.14 166.241 L
53.471 166.102 L
53.802 165.964 L
54.133 165.828 L
54.464 165.695 L
54.795 165.564 L
55.125 165.436 L
55.456 165.311 L
55.787 165.19 L
56.118 165.071 L
56.449 164.956 L
56.78 164.844 L
57.111 164.735 L
57.442 164.63 L
57.773 164.527 L
58.104 164.428 L
58.435 164.332 L
58.765 164.238 L
59.096 164.148 L
59.427 164.06 L
59.758 163.974 L
60.089 163.892 L
60.42 163.811 L
60.751 163.733 L
61.082 163.657 L
61.413 163.583 L
61.744 163.511 L
62.075 163.441 L
62.405 163.373 L
62.736 163.307 L
63.067 163.243 L
63.398 163.181 L
63.729 163.12 L
64.06 163.061 L
64.391 163.004 L
64.722 162.949 L
65.053 162.895 L
65.384 162.844 L
65.715 162.793 L
66.045 162.745 L
66.376 162.698 L
66.707 162.653 L
67.038 162.609 L
67.369 162.567 L
67.7 162.526 L
68.031 162.486 L
68.362 162.448 L
68.693 162.41 L
69.024 162.373 L
69.355 162.336 L
69.685 162.3 L
70.016 162.264 L
70.347 162.228 L
70.678 162.191 L
71.009 162.154 L
71.34 162.116 L
71.671 162.076 L
72.002 162.035 L
72.333 161.992 L
72.664 161.946 L
72.995 161.899 L
73.325 161.848 L
73.656 161.795 L
73.987 161.738 L
74.318 161.677 L
74.649 161.613 L
74.98 161.545 L
75.311 161.473 L
75.642 161.397 L
75.973 161.316 L
76.304 161.231 L
76.635 161.142 L
76.965 161.048 L
77.296 160.95 L
77.627 160.847 L
77.958 160.741 L
78.289 160.63 L
78.62 160.516 L
78.951 160.398 L
79.282 160.277 L
79.613 160.153 L
79.944 160.026 L
80.275 159.897 L
80.605 159.766 L
80.936 159.633 L
81.267 159.499 L
81.598 159.364 L
81.929 159.229 L
82.26 159.094 L
82.591 158.959 L
82.922 158.824 L
83.253 158.69 L
83.584 158.558 L
83.915 158.427 L
84.245 158.299 L
84.576 158.172 L
84.907 158.047 L
85.238 157.925 L
85.569 157.805 L
85.9 157.687 L
86.231 157.572 L
86.562 157.459 L
86.893 157.348 L
87.224 157.24 L
87.555 157.133 L
87.885 157.027 L
88.216 156.923 L
88.547 156.819 L
88.878 156.715 L
89.209 156.61 L
89.54 156.505 L
89.871 156.398 L
90.202 156.289 L
90.533 156.177 L
90.864 156.061 L
91.195 155.94 L
91.525 155.814 L
91.856 155.682 L
92.187 155.543 L
92.518 155.396 L
92.849 155.24 L
93.18 155.075 L
93.511 154.9 L
93.842 154.713 L
94.173 154.515 L
94.504 154.305 L
94.835 154.081 L
95.165 153.844 L
95.496 153.592 L
95.827 153.326 L
96.158 153.044 L
96.489 152.747 L
96.82 152.434 L
97.151 152.105 L
97.482 151.76 L
97.813 151.399 L
98.144 151.022 L
98.475 150.629 L
98.805 150.22 L
99.136 149.796 L
99.467 149.357 L
99.798 148.904 L
100.129 148.436 L
100.46 147.956 L
100.791 147.463 L
101.122 146.958 L
101.453 146.442 L
101.784 145.916 L
102.115 145.381 L
102.445 144.838 L
102.776 144.288 L
103.107 143.732 L
103.438 143.171 L
103.769 142.605 L
104.1 142.037 L
104.431 141.466 L
104.762 140.894 L
105.093 140.323 L
105.424 139.752 L
105.755 139.183 L
106.085 138.617 L
106.416 138.054 L
106.747 137.495 L
107.078 136.94 L
107.409 136.392 L
107.74 135.849 L
108.071 135.312 L
108.402 134.783 L
108.733 134.26 L
109.064 133.745 L
109.395 133.237 L
109.725 132.736 L
110.056 132.243 L
110.387 131.758 L
110.718 131.28 L
111.049 130.809 L
111.38 130.345 L
111.711 129.888 L
112.042 129.437 L
112.373 128.991 L
112.704 128.552 L
113.035 128.116 L
113.365 127.686 L
113.696 127.258 L
114.027 126.834 L
114.358 126.413 L
114.689 125.993 L
115.02 125.575 L
115.351 125.157 L
115.682 124.739 L
116.013 124.32 L
116.344 123.9 L
116.675 123.478 L
117.005 123.053 L
117.336 122.625 L
117.667 122.193 L
117.998 121.757 L
118.329 121.316 L
118.66 120.87 L
118.991 120.418 L
119.322 119.959 L
119.653 119.495 L
119.984 119.023 L
120.315 118.545 L
120.645 118.059 L
120.976 117.566 L
121.307 117.065 L
121.638 116.557 L
121.969 116.041 L
122.3 115.518 L
122.631 114.988 L
122.962 114.451 L
123.293 113.907 L
123.624 113.356 L
123.955 112.8 L
124.285 112.238 L
124.616 111.67 L
124.947 111.098 L
125.278 110.522 L
125.609 109.942 L
125.94 109.359 L
126.271 108.774 L
126.602 108.186 L
126.933 107.598 L
127.264 107.01 L
127.595 106.421 L
127.925 105.834 L
128.256 105.247 L
128.587 104.663 L
128.918 104.082 L
129.249 103.503 L
129.58 102.929 L
129.911 102.358 L
130.242 101.792 L
130.573 101.231 L
130.904 100.674 L
131.235 100.123 L
131.565 99.578 L
131.896 99.037 L
132.227 98.502 L
132.558 97.972 L
132.889 97.447 L
133.22 96.927 L
133.551 96.411 L
133.882 95.899 L
134.213 95.39 L
134.544 94.884 L
134.875 94.38 L
135.205 93.877 L
135.536 93.375 L
135.867 92.873 L
136.198 92.37 L
136.529 91.864 L
136.86 91.356 L
137.191 90.844 L
137.522 90.326 L
137.853 89.804 L
138.184 89.274 L
138.515 88.737 L
138.845 88.191 L
139.176 87.636 L
139.507 87.071 L
139.838 86.496 L
140.169 85.908 L
140.5 85.309 L
140.831 84.698 L
141.162 84.074 L
141.493 83.437 L
141.824 82.786 L
142.155 82.123 L
142.485 81.446 L
142.816 80.756 L
143.147 80.053 L
143.478 79.339 L
143.809 78.612 L
144.14 77.874 L
144.471 77.126 L
144.802 76.369 L
145.133 75.603 L
145.464 74.829 L
145.795 74.049 L
146.125 73.264 L
146.456 72.476 L
146.787 71.685 L
147.118 70.892 L
147.449 70.101 L
147.78 69.311 L
148.111 68.525 L
148.442 67.744 L
148.773 66.97 L
149.104 66.204 L
149.435 65.448 L
149.765 64.703 L
150.096 63.97 L
150.427 63.252 L
150.758 62.549 L
151.089 61.863 L
151.42 61.195 L
151.751 60.546 L
152.082 59.917 L
152.413 59.309 L
152.744 58.723 L
153.075 58.159 L
153.405 57.619 L
153.736 57.101 L
154.067 56.608 L
154.398 56.138 L
154.729 55.692 L
155.06 55.27 L
155.391 54.872 L
155.722 54.496 L
156.053 54.144 L
156.384 53.813 L
156.715 53.503 L
157.045 53.213 L
157.376 52.943 L
157.707 52.691 L
158.038 52.456 L
158.369 52.236 L
158.7 52.031 L
159.031 51.838 L
159.362 51.657 L
159.693 51.486 L
160.024 51.322 L
160.355 51.165 L
160.685 51.013 L
161.016 50.864 L
161.347 50.717 L
161.678 50.571 L
162.009 50.422 L
162.34 50.271 L
162.671 50.116 L
163.002 49.956 L
163.333 49.788 L
163.664 49.613 L
163.995 49.428 L
164.325 49.234 L
164.656 49.03 L
164.987 48.813 L
165.318 48.585 L
165.649 48.345 L
165.98 48.092 L
166.311 47.827 L
166.642 47.548 L
166.973 47.257 L
167.304 46.953 L
167.635 46.637 L
167.965 46.31 L
168.296 45.971 L
168.627 45.622 L
168.958 45.263 L
169.289 44.896 L
169.62 44.52 L
169.951 44.138 L
170.282 43.75 L
170.613 43.358 L
170.944 42.963 L
171.275 42.565 L
171.605 42.167 L
171.936 41.769 L
172.267 41.373 L
172.598 40.98 L
172.929 40.592 L
173.26 40.209 L
173.591 39.834 L
173.922 39.467 L
174.253 39.109 L
174.584 38.762 L
174.915 38.427 L
175.245 38.105 L
175.576 37.796 L
175.907 37.503 L
176.238 37.225 L
176.569 36.963 L
176.9 36.719 L
177.231 36.492 L
177.562 36.284 L
177.893 36.094 L
178.224 35.924 L
178.555 35.774 L
178.885 35.643 L
179.216 35.532 L
179.547 35.442 L
179.878 35.371 L
180.209 35.32 L
180.54 35.29 L
180.871 35.278 L
181.202 35.286 L
181.533 35.313 L
181.864 35.357 L
182.195 35.42 L
182.525 35.5 L
182.856 35.597 L
183.187 35.709 L
183.518 35.837 L
183.849 35.978 L
184.18 36.133 L
184.511 36.3 L
184.842 36.479 L
185.173 36.668 L
185.504 36.866 L
185.835 37.073 L
186.165 37.286 L
186.496 37.505 L
186.827 37.729 L
187.158 37.956 L
187.489 38.185 L
187.82 38.415 L
188.151 38.644 L
188.482 38.871 L
188.813 39.096 L
189.144 39.315 L
189.475 39.529 L
189.805 39.736 L
190.136 39.935 L
190.467 40.124 L
190.798 40.302 L
191.129 40.468 L
191.46 40.621 L
191.791 40.76 L
192.122 40.883 L
192.453 40.99 L
192.784 41.079 L
193.115 41.15 L
193.445 41.202 L
193.776 41.233 L
194.107 41.244 L
194.438 41.234 L
194.769 41.202 L
195.1 41.147 L
195.431 41.07 L
195.762 40.97 L
196.093 40.846 L
196.424 40.699 L
196.755 40.529 L
197.085 40.335 L
197.416 40.119 L
197.747 39.879 L
198.078 39.617 L
198.409 39.333 L
198.74 39.028 L
199.071 38.701 L
199.402 38.354 L
199.733 37.988 L
200.064 37.603 L
200.395 37.201 L
200.725 36.782 L
201.056 36.347 L
201.387 35.898 L
201.718 35.436 L
202.049 34.961 L
202.38 34.476 L
202.711 33.981 L
203.042 33.478 L
203.373 32.969 L
203.704 32.454 L
204.035 31.935 L
204.365 31.414 L
204.696 30.891 L
205.027 30.369 L
205.358 29.848 L
205.689 29.331 L
206.02 28.818 L
206.351 28.311 L
206.682 27.811 L
207.013 27.319 L
207.344 26.837 L
207.675 26.366 L
208.005 25.908 L
208.336 25.462 L
208.667 25.031 L
208.998 24.614 L
209.329 24.214 L
209.66 23.832 L
209.991 23.467 L
210.322 23.12 L
210.653 22.793 L
210.984 22.486 L
211.315 22.2 L
211.645 21.935 L
211.976 21.691 L
212.307 21.47 L
212.638 21.271 L
212.969 21.095 L
213.3 20.942 L
213.631 20.812 L
213.962 20.707 L
214.293 20.625 L
214.624 20.568 L
214.955 20.536 L
215.285 20.529 L
215.616 20.547 L
215.947 20.591 L
216.278 20.661 L
216.609 20.759 L
216.94 20.883 L
217.271 21.035 L
217.602 21.216 L
217.933 21.427 L
218.264 21.668 L
218.595 21.941 L
218.925 22.246 L
219.256 22.585 L
219.587 22.96 L
219.918 23.371 L
220.249 23.821 L
220.58 24.312 L
220.911 24.844 L
221.242 25.421 L
221.573 26.045 L
221.904 26.717 L
222.235 27.441 L
222.565 28.218 L
222.896 29.052 L
223.227 29.945 L
223.558 30.899 L
223.889 31.918 L
224.22 33.004 L
224.551 34.16 L
224.882 35.388 L
225.213 36.692 L
225.544 38.074 L
225.875 39.536 L
226.205 41.081 L
226.536 42.711 L
226.867 44.429 L
227.198 46.234 L
227.529 48.13 L
227.86 50.118 L
228.191 52.197 L
228.522 54.37 L
228.853 56.635 L
229.184 58.993 L
229.515 61.443 L
229.845 63.984 L
230.176 66.614 L
230.507 69.331 L
230.838 72.132 L
231.169 75.015 L
231.5 77.975 L
231.522 78.174 L
S
GR
GS
0.988 0.573 0.447 RC
1 LJ
3 LW
N
49.5 159.424 M
49.831 159.4 L
50.162 159.399 L
50.493 159.421 L
50.824 159.466 L
51.155 159.534 L
51.485 159.625 L
51.816 159.738 L
52.147 159.873 L
52.478 160.03 L
52.809 160.207 L
53.14 160.404 L
53.471 160.62 L
53.802 160.854 L
54.133 161.104 L
54.464 161.369 L
54.795 161.648 L
55.125 161.94 L
55.456 162.243 L
55.787 162.555 L
56.118 162.874 L
56.449 163.2 L
56.78 163.529 L
57.111 163.862 L
57.442 164.195 L
57.773 164.527 L
58.104 164.857 L
58.435 165.182 L
58.765 165.502 L
59.096 165.814 L
59.427 166.117 L
59.758 166.409 L
60.089 166.69 L
60.42 166.958 L
60.751 167.211 L
61.082 167.449 L
61.413 167.67 L
61.744 167.874 L
62.075 168.06 L
62.405 168.228 L
62.736 168.376 L
63.067 168.504 L
63.398 168.613 L
63.729 168.702 L
64.06 168.77 L
64.391 168.82 L
64.722 168.849 L
65.053 168.86 L
65.384 168.852 L
65.715 168.827 L
66.045 168.784 L
66.376 168.726 L
66.707 168.653 L
67.038 168.565 L
67.369 168.465 L
67.7 168.354 L
68.031 168.233 L
68.362 168.103 L
68.693 167.967 L
69.024 167.825 L
69.355 167.679 L
69.685 167.531 L
70.016 167.382 L
70.347 167.234 L
70.678 167.088 L
71.009 166.947 L
71.34 166.811 L
71.671 166.683 L
72.002 166.562 L
72.333 166.452 L
72.664 166.352 L
72.995 166.265 L
73.325 166.191 L
73.656 166.13 L
73.987 166.085 L
74.318 166.055 L
74.649 166.042 L
74.98 166.045 L
75.311 166.064 L
75.642 166.101 L
75.973 166.154 L
76.304 166.225 L
76.635 166.311 L
76.965 166.414 L
77.296 166.533 L
77.627 166.666 L
77.958 166.813 L
78.289 166.974 L
78.62 167.147 L
78.951 167.331 L
79.282 167.525 L
79.613 167.728 L
79.944 167.938 L
80.275 168.154 L
80.605 168.375 L
80.936 168.6 L
81.267 168.826 L
81.598 169.053 L
81.929 169.279 L
82.26 169.503 L
82.591 169.723 L
82.922 169.938 L
83.253 170.147 L
83.584 170.349 L
83.915 170.543 L
84.245 170.727 L
84.576 170.901 L
84.907 171.064 L
85.238 171.215 L
85.569 171.353 L
85.9 171.479 L
86.231 171.591 L
86.562 171.69 L
86.893 171.775 L
87.224 171.846 L
87.555 171.904 L
87.885 171.948 L
88.216 171.978 L
88.547 171.995 L
88.878 172 L
89.209 171.992 L
89.54 171.973 L
89.871 171.943 L
90.202 171.902 L
90.533 171.851 L
90.864 171.791 L
91.195 171.723 L
91.525 171.647 L
91.856 171.564 L
92.187 171.474 L
92.518 171.379 L
92.849 171.28 L
93.18 171.175 L
93.511 171.068 L
93.842 170.957 L
94.173 170.843 L
94.504 170.727 L
94.835 170.61 L
95.165 170.491 L
95.496 170.371 L
95.827 170.251 L
96.158 170.13 L
96.489 170.008 L
96.82 169.886 L
97.151 169.765 L
97.482 169.643 L
97.813 169.521 L
98.144 169.399 L
98.475 169.278 L
98.805 169.156 L
99.136 169.034 L
99.467 168.912 L
99.798 168.791 L
100.129 168.669 L
100.46 168.547 L
100.791 168.425 L
101.122 168.303 L
101.453 168.181 L
101.784 168.06 L
102.115 167.938 L
102.445 167.818 L
102.776 167.698 L
103.107 167.578 L
103.438 167.46 L
103.769 167.344 L
104.1 167.229 L
104.431 167.116 L
104.762 167.005 L
105.093 166.897 L
105.424 166.792 L
105.755 166.69 L
106.085 166.592 L
106.416 166.499 L
106.747 166.409 L
107.078 166.324 L
107.409 166.244 L
107.74 166.169 L
108.071 166.1 L
108.402 166.036 L
108.733 165.977 L
109.064 165.924 L
109.395 165.876 L
109.725 165.834 L
110.056 165.797 L
110.387 165.766 L
110.718 165.739 L
111.049 165.716 L
111.38 165.698 L
111.711 165.683 L
112.042 165.671 L
112.373 165.662 L
112.704 165.655 L
113.035 165.65 L
113.365 165.645 L
113.696 165.64 L
114.027 165.634 L
114.358 165.628 L
114.689 165.619 L
115.02 165.607 L
115.351 165.593 L
115.682 165.574 L
116.013 165.552 L
116.344 165.524 L
116.675 165.491 L
117.005 165.452 L
117.336 165.407 L
117.667 165.356 L
117.998 165.299 L
118.329 165.236 L
118.66 165.166 L
118.991 165.089 L
119.322 165.007 L
119.653 164.919 L
119.984 164.826 L
120.315 164.729 L
120.645 164.627 L
120.976 164.521 L
121.307 164.413 L
121.638 164.302 L
121.969 164.19 L
122.3 164.078 L
122.631 163.967 L
122.962 163.856 L
123.293 163.748 L
123.624 163.643 L
123.955 163.542 L
124.285 163.446 L
124.616 163.356 L
124.947 163.272 L
125.278 163.195 L
125.609 163.126 L
125.94 163.064 L
126.271 163.012 L
126.602 162.968 L
126.933 162.934 L
127.264 162.909 L
127.595 162.893 L
127.925 162.886 L
128.256 162.888 L
128.587 162.899 L
128.918 162.918 L
129.249 162.945 L
129.58 162.979 L
129.911 163.018 L
130.242 163.064 L
130.573 163.113 L
130.904 163.166 L
131.235 163.222 L
131.565 163.278 L
131.896 163.335 L
132.227 163.391 L
132.558 163.445 L
132.889 163.495 L
133.22 163.541 L
133.551 163.581 L
133.882 163.615 L
134.213 163.641 L
134.544 163.659 L
134.875 163.667 L
135.205 163.665 L
135.536 163.652 L
135.867 163.629 L
136.198 163.593 L
136.529 163.546 L
136.86 163.486 L
137.191 163.415 L
137.522 163.331 L
137.853 163.236 L
138.184 163.129 L
138.515 163.011 L
138.845 162.883 L
139.176 162.745 L
139.507 162.598 L
139.838 162.443 L
140.169 162.282 L
140.5 162.114 L
140.831 161.941 L
141.162 161.764 L
141.493 161.584 L
141.824 161.403 L
142.155 161.22 L
142.485 161.039 L
142.816 160.858 L
143.147 160.68 L
143.478 160.504 L
143.809 160.333 L
144.14 160.166 L
144.471 160.004 L
144.802 159.848 L
145.133 159.697 L
145.464 159.552 L
145.795 159.412 L
146.125 159.278 L
146.456 159.15 L
146.787 159.026 L
147.118 158.907 L
147.449 158.79 L
147.78 158.677 L
148.111 158.564 L
148.442 158.453 L
148.773 158.34 L
149.104 158.225 L
149.435 158.107 L
149.765 157.983 L
150.096 157.853 L
150.427 157.715 L
150.758 157.567 L
151.089 157.408 L
151.42 157.237 L
151.751 157.051 L
152.082 156.85 L
152.413 156.632 L
152.744 156.396 L
153.075 156.14 L
153.405 155.865 L
153.736 155.568 L
154.067 155.25 L
154.398 154.909 L
154.729 154.545 L
155.06 154.158 L
155.391 153.748 L
155.722 153.315 L
156.053 152.859 L
156.384 152.381 L
156.715 151.88 L
157.045 151.359 L
157.376 150.817 L
157.707 150.255 L
158.038 149.676 L
158.369 149.079 L
158.7 148.467 L
159.031 147.84 L
159.362 147.2 L
159.693 146.549 L
160.024 145.889 L
160.355 145.219 L
160.685 144.543 L
161.016 143.862 L
161.347 143.177 L
161.678 142.489 L
162.009 141.801 L
162.34 141.112 L
162.671 140.425 L
163.002 139.741 L
163.333 139.059 L
163.664 138.382 L
163.995 137.71 L
164.325 137.042 L
164.656 136.381 L
164.987 135.725 L
165.318 135.076 L
165.649 134.432 L
165.98 133.793 L
166.311 133.16 L
166.642 132.532 L
166.973 131.907 L
167.304 131.286 L
167.635 130.667 L
167.965 130.049 L
168.296 129.432 L
168.627 128.813 L
168.958 128.192 L
169.289 127.568 L
169.62 126.939 L
169.951 126.303 L
170.282 125.66 L
170.613 125.008 L
170.944 124.346 L
171.275 123.672 L
171.605 122.985 L
171.936 122.284 L
172.267 121.568 L
172.598 120.836 L
172.929 120.086 L
173.26 119.318 L
173.591 118.532 L
173.922 117.726 L
174.253 116.9 L
174.584 116.054 L
174.915 115.187 L
175.245 114.299 L
175.576 113.391 L
175.907 112.463 L
176.238 111.514 L
176.569 110.546 L
176.9 109.558 L
177.231 108.553 L
177.562 107.529 L
177.893 106.489 L
178.224 105.433 L
178.555 104.363 L
178.885 103.279 L
179.216 102.183 L
179.547 101.076 L
179.878 99.96 L
180.209 98.837 L
180.54 97.706 L
180.871 96.571 L
181.202 95.433 L
181.533 94.292 L
181.864 93.151 L
182.195 92.012 L
182.525 90.874 L
182.856 89.741 L
183.187 88.612 L
183.518 87.49 L
183.849 86.375 L
184.18 85.269 L
184.511 84.173 L
184.842 83.087 L
185.173 82.012 L
185.504 80.95 L
185.835 79.9 L
186.165 78.863 L
186.496 77.84 L
186.827 76.83 L
187.158 75.834 L
187.489 74.852 L
187.82 73.883 L
188.151 72.928 L
188.482 71.986 L
188.813 71.058 L
189.144 70.141 L
189.475 69.237 L
189.805 68.343 L
190.136 67.46 L
190.467 66.587 L
190.798 65.723 L
191.129 64.867 L
191.46 64.018 L
191.791 63.176 L
192.122 62.339 L
192.453 61.507 L
192.784 60.678 L
193.115 59.852 L
193.445 59.029 L
193.776 58.207 L
194.107 57.385 L
194.438 56.563 L
194.769 55.741 L
195.1 54.917 L
195.431 54.092 L
195.762 53.265 L
196.093 52.436 L
196.424 51.604 L
196.755 50.77 L
197.085 49.933 L
197.416 49.095 L
197.747 48.254 L
198.078 47.412 L
198.409 46.569 L
198.74 45.725 L
199.071 44.882 L
199.402 44.04 L
199.733 43.2 L
200.064 42.363 L
200.395 41.531 L
200.725 40.703 L
201.056 39.882 L
201.387 39.069 L
201.718 38.266 L
202.049 37.473 L
202.38 36.692 L
202.711 35.925 L
203.042 35.172 L
203.373 34.437 L
203.704 33.72 L
204.035 33.022 L
204.365 32.346 L
204.696 31.692 L
205.027 31.062 L
205.358 30.457 L
205.689 29.878 L
206.02 29.327 L
206.351 28.804 L
206.682 28.311 L
207.013 27.847 L
207.344 27.415 L
207.675 27.014 L
208.005 26.644 L
208.336 26.306 L
208.667 26 L
208.998 25.726 L
209.329 25.483 L
209.66 25.271 L
209.991 25.09 L
210.322 24.938 L
210.653 24.815 L
210.984 24.72 L
211.315 24.651 L
211.645 24.607 L
211.976 24.587 L
212.307 24.589 L
212.638 24.611 L
212.969 24.652 L
213.3 24.709 L
213.631 24.782 L
213.962 24.867 L
214.293 24.964 L
214.624 25.07 L
214.955 25.183 L
215.285 25.302 L
215.616 25.425 L
215.947 25.551 L
216.278 25.678 L
216.609 25.804 L
216.94 25.93 L
217.271 26.053 L
217.602 26.173 L
217.933 26.29 L
218.264 26.404 L
218.595 26.514 L
218.925 26.622 L
219.256 26.727 L
219.587 26.831 L
219.918 26.936 L
220.249 27.042 L
220.58 27.152 L
220.911 27.268 L
221.242 27.393 L
221.573 27.529 L
221.904 27.68 L
222.235 27.85 L
222.565 28.042 L
222.896 28.26 L
223.227 28.509 L
223.558 28.792 L
223.889 29.115 L
224.22 29.483 L
224.551 29.899 L
224.882 30.37 L
225.213 30.9 L
225.544 31.494 L
225.875 32.157 L
226.205 32.894 L
226.536 33.709 L
226.867 34.608 L
227.198 35.594 L
227.529 36.671 L
227.86 37.844 L
228.191 39.115 L
228.522 40.488 L
228.853 41.966 L
229.184 43.549 L
229.515 45.241 L
229.845 47.042 L
230.176 48.953 L
230.507 50.973 L
230.838 53.103 L
231.169 55.34 L
231.5 57.684 L
231.522 57.844 L
S
GR
GS
0.647 0.059 0.082 RC
1 LJ
3 LW
N
49.5 164.375 M
49.831 164.442 L
50.162 164.527 L
50.493 164.63 L
50.824 164.747 L
51.155 164.875 L
51.485 165.012 L
51.816 165.154 L
52.147 165.298 L
52.478 165.44 L
52.809 165.578 L
53.14 165.707 L
53.471 165.825 L
53.802 165.928 L
54.133 166.012 L
54.464 166.075 L
54.795 166.114 L
55.125 166.125 L
55.456 166.106 L
55.787 166.055 L
56.118 165.968 L
56.449 165.844 L
56.78 165.681 L
57.111 165.477 L
57.442 165.231 L
57.773 164.942 L
58.104 164.61 L
58.435 164.234 L
58.765 163.813 L
59.096 163.349 L
59.427 162.841 L
59.758 162.291 L
60.089 161.699 L
60.42 161.068 L
60.751 160.398 L
61.082 159.693 L
61.413 158.953 L
61.744 158.182 L
62.075 157.382 L
62.405 156.557 L
62.736 155.708 L
63.067 154.841 L
63.398 153.956 L
63.729 153.06 L
64.06 152.153 L
64.391 151.241 L
64.722 150.327 L
65.053 149.413 L
65.384 148.505 L
65.715 147.604 L
66.045 146.715 L
66.376 145.841 L
66.707 144.984 L
67.038 144.147 L
67.369 143.334 L
67.7 142.547 L
68.031 141.787 L
68.362 141.058 L
68.693 140.36 L
69.024 139.695 L
69.355 139.065 L
69.685 138.471 L
70.016 137.912 L
70.347 137.39 L
70.678 136.905 L
71.009 136.456 L
71.34 136.043 L
71.671 135.665 L
72.002 135.322 L
72.333 135.011 L
72.664 134.732 L
72.995 134.482 L
73.325 134.261 L
73.656 134.065 L
73.987 133.892 L
74.318 133.741 L
74.649 133.608 L
74.98 133.49 L
75.311 133.386 L
75.642 133.293 L
75.973 133.206 L
76.304 133.125 L
76.635 133.046 L
76.965 132.967 L
77.296 132.884 L
77.627 132.796 L
77.958 132.7 L
78.289 132.594 L
78.62 132.477 L
78.951 132.345 L
79.282 132.198 L
79.613 132.035 L
79.944 131.853 L
80.275 131.654 L
80.605 131.434 L
80.936 131.196 L
81.267 130.937 L
81.598 130.659 L
81.929 130.362 L
82.26 130.046 L
82.591 129.713 L
82.922 129.363 L
83.253 128.998 L
83.584 128.619 L
83.915 128.228 L
84.245 127.827 L
84.576 127.417 L
84.907 127.001 L
85.238 126.581 L
85.569 126.159 L
85.9 125.738 L
86.231 125.318 L
86.562 124.903 L
86.893 124.495 L
87.224 124.096 L
87.555 123.707 L
87.885 123.33 L
88.216 122.968 L
88.547 122.621 L
88.878 122.29 L
89.209 121.978 L
89.54 121.684 L
89.871 121.41 L
90.202 121.155 L
90.533 120.92 L
90.864 120.705 L
91.195 120.509 L
91.525 120.332 L
91.856 120.172 L
92.187 120.029 L
92.518 119.902 L
92.849 119.789 L
93.18 119.688 L
93.511 119.597 L
93.842 119.514 L
94.173 119.437 L
94.504 119.364 L
94.835 119.292 L
95.165 119.22 L
95.496 119.144 L
95.827 119.061 L
96.158 118.97 L
96.489 118.869 L
96.82 118.753 L
97.151 118.623 L
97.482 118.474 L
97.813 118.306 L
98.144 118.117 L
98.475 117.904 L
98.805 117.667 L
99.136 117.404 L
99.467 117.114 L
99.798 116.796 L
100.129 116.45 L
100.46 116.076 L
100.791 115.673 L
101.122 115.242 L
101.453 114.783 L
101.784 114.297 L
102.115 113.784 L
102.445 113.246 L
102.776 112.683 L
103.107 112.099 L
103.438 111.493 L
103.769 110.868 L
104.1 110.225 L
104.431 109.567 L
104.762 108.896 L
105.093 108.213 L
105.424 107.521 L
105.755 106.822 L
106.085 106.118 L
106.416 105.411 L
106.747 104.703 L
107.078 103.995 L
107.409 103.291 L
107.74 102.591 L
108.071 101.896 L
108.402 101.209 L
108.733 100.531 L
109.064 99.862 L
109.395 99.204 L
109.725 98.557 L
110.056 97.922 L
110.387 97.299 L
110.718 96.688 L
111.049 96.089 L
111.38 95.502 L
111.711 94.928 L
112.042 94.364 L
112.373 93.811 L
112.704 93.267 L
113.035 92.733 L
113.365 92.206 L
113.696 91.685 L
114.027 91.171 L
114.358 90.66 L
114.689 90.153 L
115.02 89.647 L
115.351 89.141 L
115.682 88.635 L
116.013 88.127 L
116.344 87.615 L
116.675 87.099 L
117.005 86.578 L
117.336 86.051 L
117.667 85.516 L
117.998 84.974 L
118.329 84.424 L
118.66 83.865 L
118.991 83.297 L
119.322 82.72 L
119.653 82.134 L
119.984 81.54 L
120.315 80.936 L
120.645 80.325 L
120.976 79.707 L
121.307 79.082 L
121.638 78.452 L
121.969 77.817 L
122.3 77.178 L
122.631 76.536 L
122.962 75.894 L
123.293 75.252 L
123.624 74.611 L
123.955 73.974 L
124.285 73.341 L
124.616 72.713 L
124.947 72.093 L
125.278 71.481 L
125.609 70.88 L
125.94 70.289 L
126.271 69.711 L
126.602 69.147 L
126.933 68.597 L
127.264 68.062 L
127.595 67.544 L
127.925 67.043 L
128.256 66.56 L
128.587 66.094 L
128.918 65.647 L
129.249 65.219 L
129.58 64.809 L
129.911 64.418 L
130.242 64.045 L
130.573 63.691 L
130.904 63.354 L
131.235 63.034 L
131.565 62.731 L
131.896 62.444 L
132.227 62.172 L
132.558 61.914 L
132.889 61.67 L
133.22 61.438 L
133.551 61.218 L
133.882 61.008 L
134.213 60.807 L
134.544 60.616 L
134.875 60.431 L
135.205 60.254 L
135.536 60.081 L
135.867 59.914 L
136.198 59.75 L
136.529 59.589 L
136.86 59.431 L
137.191 59.274 L
137.522 59.118 L
137.853 58.963 L
138.184 58.807 L
138.515 58.651 L
138.845 58.494 L
139.176 58.336 L
139.507 58.177 L
139.838 58.017 L
140.169 57.855 L
140.5 57.692 L
140.831 57.528 L
141.162 57.362 L
141.493 57.196 L
141.824 57.03 L
142.155 56.863 L
142.485 56.696 L
142.816 56.529 L
143.147 56.363 L
143.478 56.199 L
143.809 56.035 L
144.14 55.874 L
144.471 55.715 L
144.802 55.559 L
145.133 55.406 L
145.464 55.256 L
145.795 55.11 L
146.125 54.968 L
146.456 54.829 L
146.787 54.696 L
147.118 54.566 L
147.449 54.441 L
147.78 54.321 L
148.111 54.205 L
148.442 54.094 L
148.773 53.987 L
149.104 53.884 L
149.435 53.784 L
149.765 53.689 L
150.096 53.596 L
150.427 53.506 L
150.758 53.418 L
151.089 53.332 L
151.42 53.247 L
151.751 53.162 L
152.082 53.077 L
152.413 52.991 L
152.744 52.903 L
153.075 52.813 L
153.405 52.72 L
153.736 52.623 L
154.067 52.521 L
154.398 52.414 L
154.729 52.301 L
155.06 52.181 L
155.391 52.054 L
155.722 51.918 L
156.053 51.773 L
156.384 51.619 L
156.715 51.456 L
157.045 51.282 L
157.376 51.097 L
157.707 50.901 L
158.038 50.695 L
158.369 50.477 L
158.7 50.248 L
159.031 50.007 L
159.362 49.756 L
159.693 49.494 L
160.024 49.222 L
160.355 48.94 L
160.685 48.649 L
161.016 48.349 L
161.347 48.042 L
161.678 47.728 L
162.009 47.408 L
162.34 47.084 L
162.671 46.757 L
163.002 46.427 L
163.333 46.097 L
163.664 45.767 L
163.995 45.439 L
164.325 45.116 L
164.656 44.797 L
164.987 44.486 L
165.318 44.183 L
165.649 43.891 L
165.98 43.61 L
166.311 43.343 L
166.642 43.091 L
166.973 42.855 L
167.304 42.637 L
167.635 42.439 L
167.965 42.261 L
168.296 42.104 L
168.627 41.971 L
168.958 41.861 L
169.289 41.776 L
169.62 41.716 L
169.951 41.681 L
170.282 41.672 L
170.613 41.689 L
170.944 41.733 L
171.275 41.801 L
171.605 41.895 L
171.936 42.014 L
172.267 42.156 L
172.598 42.321 L
172.929 42.508 L
173.26 42.715 L
173.591 42.941 L
173.922 43.184 L
174.253 43.442 L
174.584 43.714 L
174.915 43.996 L
175.245 44.288 L
175.576 44.586 L
175.907 44.888 L
176.238 45.193 L
176.569 45.496 L
176.9 45.797 L
177.231 46.091 L
177.562 46.378 L
177.893 46.653 L
178.224 46.916 L
178.555 47.163 L
178.885 47.392 L
179.216 47.601 L
179.547 47.788 L
179.878 47.951 L
180.209 48.087 L
180.54 48.196 L
180.871 48.276 L
181.202 48.326 L
181.533 48.343 L
181.864 48.328 L
182.195 48.28 L
182.525 48.197 L
182.856 48.08 L
183.187 47.928 L
183.518 47.741 L
183.849 47.52 L
184.18 47.264 L
184.511 46.974 L
184.842 46.651 L
185.173 46.295 L
185.504 45.907 L
185.835 45.489 L
186.165 45.041 L
186.496 44.566 L
186.827 44.063 L
187.158 43.535 L
187.489 42.982 L
187.82 42.408 L
188.151 41.812 L
188.482 41.198 L
188.813 40.566 L
189.144 39.918 L
189.475 39.255 L
189.805 38.58 L
190.136 37.894 L
190.467 37.198 L
190.798 36.495 L
191.129 35.784 L
191.46 35.069 L
191.791 34.351 L
192.122 33.63 L
192.453 32.909 L
192.784 32.188 L
193.115 31.469 L
193.445 30.753 L
193.776 30.041 L
194.107 29.335 L
194.438 28.636 L
194.769 27.945 L
195.1 27.262 L
195.431 26.59 L
195.762 25.93 L
196.093 25.282 L
196.424 24.648 L
196.755 24.03 L
197.085 23.428 L
197.416 22.845 L
197.747 22.281 L
198.078 21.738 L
198.409 21.217 L
198.74 20.721 L
199.071 20.251 L
199.402 19.808 L
199.733 19.394 L
200.064 19.012 L
200.395 18.662 L
200.725 18.347 L
201.056 18.068 L
201.387 17.827 L
201.718 17.626 L
202.049 17.467 L
202.38 17.351 L
202.711 17.279 L
203.042 17.254 L
203.373 17.275 L
203.704 17.345 L
204.035 17.464 L
204.365 17.632 L
204.696 17.85 L
205.027 18.119 L
205.358 18.437 L
205.689 18.805 L
206.02 19.221 L
206.351 19.685 L
206.682 20.195 L
207.013 20.75 L
207.344 21.346 L
207.675 21.981 L
208.005 22.653 L
208.336 23.358 L
208.667 24.092 L
208.998 24.851 L
209.329 25.632 L
209.66 26.428 L
209.991 27.236 L
210.322 28.05 L
210.653 28.865 L
210.984 29.674 L
211.315 30.473 L
211.645 31.256 L
211.976 32.015 L
212.307 32.747 L
212.638 33.444 L
212.969 34.101 L
213.3 34.713 L
213.631 35.274 L
213.962 35.779 L
214.293 36.223 L
214.624 36.603 L
214.955 36.914 L
215.285 37.154 L
215.616 37.318 L
215.947 37.407 L
216.278 37.417 L
216.609 37.349 L
216.94 37.203 L
217.271 36.979 L
217.602 36.68 L
217.933 36.308 L
218.264 35.866 L
218.595 35.359 L
218.925 34.792 L
219.256 34.172 L
219.587 33.506 L
219.918 32.801 L
220.249 32.066 L
220.58 31.311 L
220.911 30.547 L
221.242 29.784 L
221.573 29.035 L
221.904 28.311 L
222.235 27.625 L
222.565 26.992 L
222.896 26.425 L
223.227 25.938 L
223.558 25.545 L
223.889 25.262 L
224.22 25.102 L
224.551 25.08 L
224.882 25.211 L
225.213 25.509 L
225.544 25.986 L
225.875 26.658 L
226.205 27.536 L
226.536 28.632 L
226.867 29.957 L
227.198 31.523 L
227.529 33.338 L
227.86 35.41 L
228.191 37.748 L
228.522 40.356 L
228.853 43.24 L
229.184 46.402 L
229.515 49.845 L
229.845 53.569 L
230.176 57.573 L
230.507 61.854 L
230.838 66.407 L
231.169 71.228 L
231.5 76.308 L
231.522 76.657 L
S
GR
GS
[8 8] 0 setdash
2 LJ
2 LW
N
214.955 164.554 M
214.955 164.391 L
S
GR
%%Trailer
%%Pages: 1
%%EOF
