%!PS-Adobe-3.0 EPSF-3.0
%%Creator: (MATLAB, The Mathworks, Inc. Version 9.8.0.1323502 \(R2020a\). Operating System: Mac OS X)
%%Title: /Users/kosciessa/Desktop/tardis/LNDG/stateswitch/stsw_eeg_task/cpp/figures/E/F2_CPPbyStim_ThreshSlope_RCP_OA.eps
%%CreationDate: 2022-02-01T15:44:02
%%Pages: (atend)
%%BoundingBox:    79     4   940   283
%%LanguageLevel: 3
%%EndComments
%%BeginProlog
%%BeginResource: procset (Apache XML Graphics Std ProcSet) 1.2 0
%%Version: 1.2 0
%%Copyright: (Copyright 2001-2003,2010 The Apache Software Foundation. License terms: http://www.apache.org/licenses/LICENSE-2.0)
/bd{bind def}bind def
/ld{load def}bd
/GR/grestore ld
/GS/gsave ld
/RM/rmoveto ld
/C/curveto ld
/t/show ld
/L/lineto ld
/ML/setmiterlimit ld
/CT/concat ld
/f/fill ld
/N/newpath ld
/S/stroke ld
/CC/setcmykcolor ld
/A/ashow ld
/cp/closepath ld
/RC/setrgbcolor ld
/LJ/setlinejoin ld
/GC/setgray ld
/LW/setlinewidth ld
/M/moveto ld
/re {4 2 roll M
1 index 0 rlineto
0 exch rlineto
neg 0 rlineto
cp } bd
/_ctm matrix def
/_tm matrix def
/BT { _ctm currentmatrix pop matrix _tm copy pop 0 0 moveto } bd
/ET { _ctm setmatrix } bd
/iTm { _ctm setmatrix _tm concat } bd
/Tm { _tm astore pop iTm 0 0 moveto } bd
/ux 0.0 def
/uy 0.0 def
/F {
  /Tp exch def
  /Tf exch def
  Tf findfont Tp scalefont setfont
  /cf Tf def  /cs Tp def
} bd
/ULS {currentpoint /uy exch def /ux exch def} bd
/ULE {
  /Tcx currentpoint pop def
  gsave
  newpath
  cf findfont cs scalefont dup
  /FontMatrix get 0 get /Ts exch def /FontInfo get dup
  /UnderlinePosition get Ts mul /To exch def
  /UnderlineThickness get Ts mul /Tt exch def
  ux uy To add moveto  Tcx uy To add lineto
  Tt setlinewidth stroke
  grestore
} bd
/OLE {
  /Tcx currentpoint pop def
  gsave
  newpath
  cf findfont cs scalefont dup
  /FontMatrix get 0 get /Ts exch def /FontInfo get dup
  /UnderlinePosition get Ts mul /To exch def
  /UnderlineThickness get Ts mul /Tt exch def
  ux uy To add cs add moveto Tcx uy To add cs add lineto
  Tt setlinewidth stroke
  grestore
} bd
/SOE {
  /Tcx currentpoint pop def
  gsave
  newpath
  cf findfont cs scalefont dup
  /FontMatrix get 0 get /Ts exch def /FontInfo get dup
  /UnderlinePosition get Ts mul /To exch def
  /UnderlineThickness get Ts mul /Tt exch def
  ux uy To add cs 10 mul 26 idiv add moveto Tcx uy To add cs 10 mul 26 idiv add lineto
  Tt setlinewidth stroke
  grestore
} bd
/QT {
/Y22 exch store
/X22 exch store
/Y21 exch store
/X21 exch store
currentpoint
/Y21 load 2 mul add 3 div exch
/X21 load 2 mul add 3 div exch
/X21 load 2 mul /X22 load add 3 div
/Y21 load 2 mul /Y22 load add 3 div
/X22 load /Y22 load curveto
} bd
/SSPD {
dup length /d exch dict def
{
/v exch def
/k exch def
currentpagedevice k known {
/cpdv currentpagedevice k get def
v cpdv ne {
/upd false def
/nullv v type /nulltype eq def
/nullcpdv cpdv type /nulltype eq def
nullv nullcpdv or
{
/upd true def
} {
/sametype v type cpdv type eq def
sametype {
v type /arraytype eq {
/vlen v length def
/cpdvlen cpdv length def
vlen cpdvlen eq {
0 1 vlen 1 sub {
/i exch def
/obj v i get def
/cpdobj cpdv i get def
obj cpdobj ne {
/upd true def
exit
} if
} for
} {
/upd true def
} ifelse
} {
v type /dicttype eq {
v {
/dv exch def
/dk exch def
/cpddv cpdv dk get def
dv cpddv ne {
/upd true def
exit
} if
} forall
} {
/upd true def
} ifelse
} ifelse
} if
} ifelse
upd true eq {
d k v put
} if
} if
} if
} forall
d length 0 gt {
d setpagedevice
} if
} bd
/RE { % /NewFontName [NewEncodingArray] /FontName RE -
  findfont dup length dict begin
  {
    1 index /FID ne
    {def} {pop pop} ifelse
  } forall
  /Encoding exch def
  /FontName 1 index def
  currentdict definefont pop
  end
} bind def
%%EndResource
%%BeginResource: procset (Apache XML Graphics EPS ProcSet) 1.0 0
%%Version: 1.0 0
%%Copyright: (Copyright 2002-2003 The Apache Software Foundation. License terms: http://www.apache.org/licenses/LICENSE-2.0)
/BeginEPSF { %def
/b4_Inc_state save def         % Save state for cleanup
/dict_count countdictstack def % Count objects on dict stack
/op_count count 1 sub def      % Count objects on operand stack
userdict begin                 % Push userdict on dict stack
/showpage { } def              % Redefine showpage, { } = null proc
0 setgray 0 setlinecap         % Prepare graphics state
1 setlinewidth 0 setlinejoin
10 setmiterlimit [ ] 0 setdash newpath
/languagelevel where           % If level not equal to 1 then
{pop languagelevel             % set strokeadjust and
1 ne                           % overprint to their defaults.
{false setstrokeadjust false setoverprint
} if
} if
} bd
/EndEPSF { %def
count op_count sub {pop} repeat            % Clean up stacks
countdictstack dict_count sub {end} repeat
b4_Inc_state restore
} bd
%%EndResource
%FOPBeginFontDict
%%IncludeResource: font Courier-Oblique
%%IncludeResource: font Courier-BoldOblique
%%IncludeResource: font Courier-Bold
%%IncludeResource: font ZapfDingbats
%%IncludeResource: font Symbol
%%IncludeResource: font Helvetica
%%IncludeResource: font Helvetica-Oblique
%%IncludeResource: font Helvetica-Bold
%%IncludeResource: font Helvetica-BoldOblique
%%IncludeResource: font Times-Roman
%%IncludeResource: font Times-Italic
%%IncludeResource: font Times-Bold
%%IncludeResource: font Times-BoldItalic
%%IncludeResource: font Courier
%FOPEndFontDict
%%BeginResource: encoding WinAnsiEncoding
/WinAnsiEncoding [
/.notdef /.notdef /.notdef /.notdef /.notdef
/.notdef /.notdef /.notdef /.notdef /.notdef
/.notdef /.notdef /.notdef /.notdef /.notdef
/.notdef /.notdef /.notdef /.notdef /.notdef
/.notdef /.notdef /.notdef /.notdef /.notdef
/.notdef /.notdef /.notdef /.notdef /.notdef
/.notdef /.notdef /space /exclam /quotedbl
/numbersign /dollar /percent /ampersand /quotesingle
/parenleft /parenright /asterisk /plus /comma
/hyphen /period /slash /zero /one
/two /three /four /five /six
/seven /eight /nine /colon /semicolon
/less /equal /greater /question /at
/A /B /C /D /E
/F /G /H /I /J
/K /L /M /N /O
/P /Q /R /S /T
/U /V /W /X /Y
/Z /bracketleft /backslash /bracketright /asciicircum
/underscore /quoteleft /a /b /c
/d /e /f /g /h
/i /j /k /l /m
/n /o /p /q /r
/s /t /u /v /w
/x /y /z /braceleft /bar
/braceright /asciitilde /bullet /Euro /bullet
/quotesinglbase /florin /quotedblbase /ellipsis /dagger
/daggerdbl /circumflex /perthousand /Scaron /guilsinglleft
/OE /bullet /Zcaron /bullet /bullet
/quoteleft /quoteright /quotedblleft /quotedblright /bullet
/endash /emdash /asciitilde /trademark /scaron
/guilsinglright /oe /bullet /zcaron /Ydieresis
/space /exclamdown /cent /sterling /currency
/yen /brokenbar /section /dieresis /copyright
/ordfeminine /guillemotleft /logicalnot /sfthyphen /registered
/macron /degree /plusminus /twosuperior /threesuperior
/acute /mu /paragraph /middot /cedilla
/onesuperior /ordmasculine /guillemotright /onequarter /onehalf
/threequarters /questiondown /Agrave /Aacute /Acircumflex
/Atilde /Adieresis /Aring /AE /Ccedilla
/Egrave /Eacute /Ecircumflex /Edieresis /Igrave
/Iacute /Icircumflex /Idieresis /Eth /Ntilde
/Ograve /Oacute /Ocircumflex /Otilde /Odieresis
/multiply /Oslash /Ugrave /Uacute /Ucircumflex
/Udieresis /Yacute /Thorn /germandbls /agrave
/aacute /acircumflex /atilde /adieresis /aring
/ae /ccedilla /egrave /eacute /ecircumflex
/edieresis /igrave /iacute /icircumflex /idieresis
/eth /ntilde /ograve /oacute /ocircumflex
/otilde /odieresis /divide /oslash /ugrave
/uacute /ucircumflex /udieresis /yacute /thorn
/ydieresis
] def
%%EndResource
%FOPBeginFontReencode
/Courier-Oblique findfont
dup length dict begin
  {1 index /FID ne {def} {pop pop} ifelse} forall
  /Encoding WinAnsiEncoding def
  currentdict
end
/Courier-Oblique exch definefont pop
/Courier-BoldOblique findfont
dup length dict begin
  {1 index /FID ne {def} {pop pop} ifelse} forall
  /Encoding WinAnsiEncoding def
  currentdict
end
/Courier-BoldOblique exch definefont pop
/Courier-Bold findfont
dup length dict begin
  {1 index /FID ne {def} {pop pop} ifelse} forall
  /Encoding WinAnsiEncoding def
  currentdict
end
/Courier-Bold exch definefont pop
/Helvetica findfont
dup length dict begin
  {1 index /FID ne {def} {pop pop} ifelse} forall
  /Encoding WinAnsiEncoding def
  currentdict
end
/Helvetica exch definefont pop
/Helvetica-Oblique findfont
dup length dict begin
  {1 index /FID ne {def} {pop pop} ifelse} forall
  /Encoding WinAnsiEncoding def
  currentdict
end
/Helvetica-Oblique exch definefont pop
/Helvetica-Bold findfont
dup length dict begin
  {1 index /FID ne {def} {pop pop} ifelse} forall
  /Encoding WinAnsiEncoding def
  currentdict
end
/Helvetica-Bold exch definefont pop
/Helvetica-BoldOblique findfont
dup length dict begin
  {1 index /FID ne {def} {pop pop} ifelse} forall
  /Encoding WinAnsiEncoding def
  currentdict
end
/Helvetica-BoldOblique exch definefont pop
/Times-Roman findfont
dup length dict begin
  {1 index /FID ne {def} {pop pop} ifelse} forall
  /Encoding WinAnsiEncoding def
  currentdict
end
/Times-Roman exch definefont pop
/Times-Italic findfont
dup length dict begin
  {1 index /FID ne {def} {pop pop} ifelse} forall
  /Encoding WinAnsiEncoding def
  currentdict
end
/Times-Italic exch definefont pop
/Times-Bold findfont
dup length dict begin
  {1 index /FID ne {def} {pop pop} ifelse} forall
  /Encoding WinAnsiEncoding def
  currentdict
end
/Times-Bold exch definefont pop
/Times-BoldItalic findfont
dup length dict begin
  {1 index /FID ne {def} {pop pop} ifelse} forall
  /Encoding WinAnsiEncoding def
  currentdict
end
/Times-BoldItalic exch definefont pop
/Courier findfont
dup length dict begin
  {1 index /FID ne {def} {pop pop} ifelse} forall
  /Encoding WinAnsiEncoding def
  currentdict
end
/Courier exch definefont pop
%FOPEndFontReencode
%%EndProlog
%%Page: 1 1
%%PageBoundingBox: 0 0 1024 288
%%BeginPageSetup
[1 0 0 -1 0 288] CT
%%EndPageSetup
GS
1 GC
N
0 0 1024 288 re
f
GR
GS
1 GC
N
0 0 1024 288 re
f
GR
GS
1 GC
N
133 226.5 M
476 226.5 L
476 34.5 L
133 34.5 L
cp
f
GR
GS
0.149 GC
2 setlinecap
1 LJ
0.5 LW
N
133 226.5 M
476 226.5 L
S
GR
GS
0.149 GC
2 setlinecap
1 LJ
0.5 LW
N
175.875 226.5 M
175.875 223.07 L
S
GR
GS
0.149 GC
2 setlinecap
1 LJ
0.5 LW
N
261.625 226.5 M
261.625 223.07 L
S
GR
GS
0.149 GC
2 setlinecap
1 LJ
0.5 LW
N
347.375 226.5 M
347.375 223.07 L
S
GR
GS
0.149 GC
2 setlinecap
1 LJ
0.5 LW
N
433.125 226.5 M
433.125 223.07 L
S
GR
GS
[1 0 0 1 175.875 233.10001] CT
0.149 GC
/Helvetica 23 F
GS
[1 0 0 1 0 0] CT
-28 22 moveto 
1 -1 scale
(Color) t 
GR
GR
GS
[1 0 0 1 261.625 233.10001] CT
0.149 GC
/Helvetica 23 F
GS
[1 0 0 1 0 0] CT
-46 22 moveto 
1 -1 scale
(Direction) t 
GR
GR
GS
[1 0 0 1 347.375 233.10001] CT
0.149 GC
/Helvetica 23 F
GS
[1 0 0 1 0 0] CT
-22 22 moveto 
1 -1 scale
(Size) t 
GR
GR
GS
[1 0 0 1 433.125 233.10001] CT
0.149 GC
/Helvetica 23 F
GS
[1 0 0 1 0 0] CT
-56.5 22 moveto 
1 -1 scale
(Luminance) t 
GR
GR
GS
[1 0 0 1 304.50015 261.10001] CT
0.149 GC
/Helvetica 23 F
GS
[1 0 0 1 0 0] CT
-80 22 moveto 
1 -1 scale
(Probed Feature) t 
GR
GR
GS
0.149 GC
2 setlinecap
1 LJ
0.5 LW
N
133 226.5 M
133 34.5 L
S
GR
GS
0.149 GC
2 setlinecap
1 LJ
0.5 LW
N
133 226.5 M
136.43 226.5 L
S
GR
GS
0.149 GC
2 setlinecap
1 LJ
0.5 LW
N
133 171.643 M
136.43 171.643 L
S
GR
GS
0.149 GC
2 setlinecap
1 LJ
0.5 LW
N
133 116.786 M
136.43 116.786 L
S
GR
GS
0.149 GC
2 setlinecap
1 LJ
0.5 LW
N
133 61.929 M
136.43 61.929 L
S
GR
GS
[1 0 0 1 126.4 226.5] CT
0.149 GC
/Helvetica 23 F
GS
[1 0 0 1 0 0] CT
-22 8.5 moveto 
1 -1 scale
(-1) t 
GR
GR
GS
[1 0 0 1 126.4 171.64285] CT
0.149 GC
/Helvetica 23 F
GS
[1 0 0 1 0 0] CT
-13 8.5 moveto 
1 -1 scale
(0) t 
GR
GR
GS
[1 0 0 1 126.4 116.78571] CT
0.149 GC
/Helvetica 23 F
GS
[1 0 0 1 0 0] CT
-13 8.5 moveto 
1 -1 scale
(1) t 
GR
GR
GS
[1 0 0 1 126.4 61.92857] CT
0.149 GC
/Helvetica 23 F
GS
[1 0 0 1 0 0] CT
-13 8.5 moveto 
1 -1 scale
(2) t 
GR
GR
GS
[0 -1 1 0 101.4 130.49991] CT
0.149 GC
/Helvetica 23 F
GS
[1 0 0 1 0 0] CT
-54.5 -5 moveto 
1 -1 scale
(CPP slope) t 
GR
GR
GS
[1 0 0 1 133 30] CT
0.149 GC
N
3.375 -0.656 M
3.375 -0.844 3.5 -0.984 QT
8.281 -5.75 L
3.5 -10.531 L
3.375 -10.641 3.375 -10.844 QT
3.375 -11 3.516 -11.148 QT
3.656 -11.297 3.844 -11.297 QT
4 -11.297 4.188 -11.156 QT
8.953 -6.391 L
13.688 -11.156 L
13.875 -11.297 14.031 -11.297 QT
14.219 -11.297 14.352 -11.164 QT
14.484 -11.031 14.484 -10.844 QT
14.484 -10.641 14.375 -10.531 QT
9.594 -5.75 L
14.375 -0.984 L
14.484 -0.844 14.484 -0.656 QT
14.484 -0.469 14.352 -0.336 QT
14.219 -0.203 14.031 -0.203 QT
13.859 -0.203 13.688 -0.375 QT
8.953 -5.109 L
4.188 -0.375 L
4.016 -0.203 3.844 -0.203 QT
3.656 -0.203 3.516 -0.352 QT
3.375 -0.5 3.375 -0.656 QT
cp
f
GR
GS
[1 0 0 1 151 30] CT
0.149 GC
/Helvetica 23 F
GS
[1 0 0 1 0 0] CT
0 0 moveto 
1 -1 scale
(10) t 
GR
GR
GS
[1 0 0 1 177 19] CT
0.149 GC
/Helvetica 18.4 F
GS
[1 0 0 1 0 0] CT
0 0 moveto 
1 -1 scale
(-5) t 
GR
GR
GS
0.149 GC
1 LJ
0.5 LW
N
133 171.643 M
476 171.643 L
S
GR
GS
0.2 0.6 0.2 RC
N
210.175 171.643 M
210.175 153.39 L
141.575 153.39 L
141.575 171.643 L
cp
295.925 171.643 M
295.925 148.192 L
227.325 148.192 L
227.325 171.643 L
cp
381.675 171.643 M
381.675 156.742 L
313.075 156.742 L
313.075 171.643 L
cp
467.425 171.643 M
467.425 160.838 L
398.825 160.838 L
398.825 171.643 L
cp
f
GR
GS
1 LJ
4 LW
N
175.875 149.032 M
175.875 157.749 L
S
GR
GS
1 LJ
4 LW
N
175.875 149.032 M
175.875 149.032 L
S
GR
GS
1 LJ
4 LW
N
175.875 157.749 M
175.875 157.749 L
S
GR
GS
1 LJ
4 LW
N
261.625 144.326 M
261.625 152.058 L
S
GR
GS
1 LJ
4 LW
N
261.625 144.326 M
261.625 144.326 L
S
GR
GS
1 LJ
4 LW
N
261.625 152.058 M
261.625 152.058 L
S
GR
GS
1 LJ
4 LW
N
347.375 153.746 M
347.375 159.739 L
S
GR
GS
1 LJ
4 LW
N
347.375 153.746 M
347.375 153.746 L
S
GR
GS
1 LJ
4 LW
N
347.375 159.739 M
347.375 159.739 L
S
GR
GS
1 LJ
4 LW
N
433.125 157.574 M
433.125 164.101 L
S
GR
GS
1 LJ
4 LW
N
433.125 157.574 M
433.125 157.574 L
S
GR
GS
1 LJ
4 LW
N
433.125 164.101 M
433.125 164.101 L
S
GR
GS
1 LJ
0.5 LW
N
270.2 200.169 M
338.8 200.169 L
S
GR
GS
1 GC
N
298.5 215.169 M
310.5 215.169 L
310.5 185.169 L
298.5 185.169 L
cp
f
GR
GS
[1 0 0 1 304.5 200.16858] CT
/Helvetica-Bold 23 F
GS
[1 0 0 1 0 0] CT
-5 9 moveto 
1 -1 scale
(*) t 
GR
GR
GS
1 LJ
0.5 LW
N
270.2 199.071 M
424.55 199.071 L
S
GR
GS
1 GC
N
336.875 214.071 M
357.875 214.071 L
357.875 184.071 L
336.875 184.071 L
cp
f
GR
GS
[1 0 0 1 347.375 199.07143] CT
/Helvetica-Bold 23 F
GS
[1 0 0 1 0 0] CT
-9.5 9 moveto 
1 -1 scale
(**) t 
GR
GR
GS
[1 0 0 1 164.70554 160.74632] CT
0.2 GC
N
2.739 0 M
2.739 -1.512 1.512 -2.739 0 -2.739 C
-1.512 -2.739 -2.739 -1.512 -2.739 0 C
-2.739 1.512 -1.512 2.739 0 2.739 C
1.512 2.739 2.739 1.512 2.739 0 C
cp
f
GR
GS
[1 0 0 1 175.04459 156.66357] CT
0.2 GC
N
/f-775751039{2.739 0 M
2.739 -1.512 1.512 -2.739 0 -2.739 C
-1.512 -2.739 -2.739 -1.512 -2.739 0 C
-2.739 1.512 -1.512 2.739 0 2.739 C
1.512 2.739 2.739 1.512 2.739 0 C
cp}def
f-775751039
f
GR
GS
[1 0 0 1 184.4238 112.45065] CT
0.2 GC
N
f-775751039
f
GR
GS
[1 0 0 1 183.31209 145.53201] CT
0.2 GC
N
f-775751039
f
GR
GS
[1 0 0 1 160.39473 163.02036] CT
0.2 GC
N
f-775751039
f
GR
GS
[1 0 0 1 171.84776 155.7151] CT
0.2 GC
N
f-775751039
f
GR
GS
[1 0 0 1 186.21446 156.22197] CT
0.2 GC
N
f-775751039
f
GR
GS
[1 0 0 1 165.05304 150.69431] CT
0.2 GC
N
f-775751039
f
GR
GS
[1 0 0 1 191.50194 155.37747] CT
0.2 GC
N
f-775751039
f
GR
GS
[1 0 0 1 185.29994 156.60895] CT
0.2 GC
N
f-775751039
f
GR
GS
[1 0 0 1 166.80872 168.90279] CT
0.2 GC
N
f-775751039
f
GR
GS
[1 0 0 1 191.80347 163.90982] CT
0.2 GC
N
f-775751039
f
GR
GS
[1 0 0 1 183.20166 150.46861] CT
0.2 GC
N
f-775751039
f
GR
GS
[1 0 0 1 183.91403 172.96288] CT
0.2 GC
N
f-775751039
f
GR
GS
[1 0 0 1 182.41461 134.32756] CT
0.2 GC
N
f-775751039
f
GR
GS
[1 0 0 1 189.23535 156.24449] CT
0.2 GC
N
f-775751039
f
GR
GS
[1 0 0 1 167.0815 166.23033] CT
0.2 GC
N
f-775751039
f
GR
GS
[1 0 0 1 162.86444 157.05286] CT
0.2 GC
N
f-775751039
f
GR
GS
[1 0 0 1 169.62599 172.10463] CT
0.2 GC
N
f-775751039
f
GR
GS
[1 0 0 1 184.85481 141.3163] CT
0.2 GC
N
f-775751039
f
GR
GS
[1 0 0 1 160.53143 144.56769] CT
0.2 GC
N
f-775751039
f
GR
GS
[1 0 0 1 175.76871 149.84102] CT
0.2 GC
N
f-775751039
f
GR
GS
[1 0 0 1 161.42819 136.53938] CT
0.2 GC
N
f-775751039
f
GR
GS
[1 0 0 1 163.00998 176.50313] CT
0.2 GC
N
f-775751039
f
GR
GS
[1 0 0 1 179.25021 159.26747] CT
0.2 GC
N
f-775751039
f
GR
GS
[1 0 0 1 192.19357 143.43294] CT
0.2 GC
N
f-775751039
f
GR
GS
[1 0 0 1 177.85617 188.54042] CT
0.2 GC
N
f-775751039
f
GR
GS
[1 0 0 1 176.57474 140.59306] CT
0.2 GC
N
f-775751039
f
GR
GS
[1 0 0 1 183.31494 192.49895] CT
0.2 GC
N
f-775751039
f
GR
GS
[1 0 0 1 189.31259 185.64964] CT
0.2 GC
N
f-775751039
f
GR
GS
[1 0 0 1 167.79062 144.03401] CT
0.2 GC
N
f-775751039
f
GR
GS
[1 0 0 1 173.37411 189.78497] CT
0.2 GC
N
f-775751039
f
GR
GS
[1 0 0 1 185.03729 122.93194] CT
0.2 GC
N
f-775751039
f
GR
GS
[1 0 0 1 173.32661 162.41202] CT
0.2 GC
N
f-775751039
f
GR
GS
[1 0 0 1 165.53809 178.46028] CT
0.2 GC
N
f-775751039
f
GR
GS
[1 0 0 1 176.90645 103.69159] CT
0.2 GC
N
f-775751039
f
GR
GS
[1 0 0 1 160.81949 116.08108] CT
0.2 GC
N
f-775751039
f
GR
GS
[1 0 0 1 166.99962 142.32874] CT
0.2 GC
N
f-775751039
f
GR
GS
[1 0 0 1 171.50443 157.46709] CT
0.2 GC
N
f-775751039
f
GR
GS
[1 0 0 1 167.88466 164.1993] CT
0.2 GC
N
f-775751039
f
GR
GS
[1 0 0 1 162.92448 140.04686] CT
0.2 GC
N
f-775751039
f
GR
GS
[1 0 0 1 164.8622 154.76852] CT
0.2 GC
N
f-775751039
f
GR
GS
[1 0 0 1 182.28189 139.7169] CT
0.2 GC
N
f-775751039
f
GR
GS
[1 0 0 1 177.28165 143.15414] CT
0.2 GC
N
f-775751039
f
GR
GS
[1 0 0 1 170.5621 157.89272] CT
0.2 GC
N
f-775751039
f
GR
GS
[1 0 0 1 173.15927 152.51016] CT
0.2 GC
N
f-775751039
f
GR
GS
[1 0 0 1 182.66899 170.4892] CT
0.2 GC
N
f-775751039
f
GR
GS
[1 0 0 1 161.57466 161.38159] CT
0.2 GC
N
f-775751039
f
GR
GS
[1 0 0 1 181.70555 147.84209] CT
0.2 GC
N
f-775751039
f
GR
GS
[1 0 0 1 165.75334 147.81543] CT
0.2 GC
N
f-775751039
f
GR
GS
[1 0 0 1 183.70718 149.59384] CT
0.2 GC
N
f-775751039
f
GR
GS
[1 0 0 1 177.3163 147.23712] CT
0.2 GC
N
f-775751039
f
GR
GS
[1 0 0 1 186.55296 121.87049] CT
0.2 GC
N
f-775751039
f
GR
GS
[1 0 0 1 248.09636 131.25418] CT
0.2 GC
N
f-775751039
f
GR
GS
[1 0 0 1 255.98856 157.64052] CT
0.2 GC
N
f-775751039
f
GR
GS
[1 0 0 1 263.89755 148.72763] CT
0.2 GC
N
f-775751039
f
GR
GS
[1 0 0 1 270.30469 157.22438] CT
0.2 GC
N
f-775751039
f
GR
GS
[1 0 0 1 246.10187 148.99747] CT
0.2 GC
N
f-775751039
f
GR
GS
[1 0 0 1 268.11893 151.5186] CT
0.2 GC
N
f-775751039
f
GR
GS
[1 0 0 1 258.42535 169.68074] CT
0.2 GC
N
f-775751039
f
GR
GS
[1 0 0 1 268.79694 130.55951] CT
0.2 GC
N
f-775751039
f
GR
GS
[1 0 0 1 260.48141 156.61983] CT
0.2 GC
N
f-775751039
f
GR
GS
[1 0 0 1 258.31586 140.726] CT
0.2 GC
N
f-775751039
f
GR
GS
[1 0 0 1 277.29993 163.1131] CT
0.2 GC
N
f-775751039
f
GR
GS
[1 0 0 1 271.26282 137.74529] CT
0.2 GC
N
f-775751039
f
GR
GS
[1 0 0 1 245.62692 144.70314] CT
0.2 GC
N
f-775751039
f
GR
GS
[1 0 0 1 260.4458 140.10425] CT
0.2 GC
N
f-775751039
f
GR
GS
[1 0 0 1 248.09084 164.4303] CT
0.2 GC
N
f-775751039
f
GR
GS
[1 0 0 1 257.53799 153.8768] CT
0.2 GC
N
f-775751039
f
GR
GS
[1 0 0 1 261.9071 156.86545] CT
0.2 GC
N
f-775751039
f
GR
GS
[1 0 0 1 252.59813 174.99034] CT
0.2 GC
N
f-775751039
f
GR
GS
[1 0 0 1 253.47775 160.37689] CT
0.2 GC
N
f-775751039
f
GR
GS
[1 0 0 1 274.62723 194.65172] CT
0.2 GC
N
f-775751039
f
GR
GS
[1 0 0 1 271.70169 148.9109] CT
0.2 GC
N
f-775751039
f
GR
GS
[1 0 0 1 255.14291 126.84731] CT
0.2 GC
N
f-775751039
f
GR
GS
[1 0 0 1 278.64847 147.11938] CT
0.2 GC
N
f-775751039
f
GR
GS
[1 0 0 1 256.03955 137.4776] CT
0.2 GC
N
f-775751039
f
GR
GS
[1 0 0 1 269.10797 116.40856] CT
0.2 GC
N
f-775751039
f
GR
GS
[1 0 0 1 261.63333 151.55492] CT
0.2 GC
N
f-775751039
f
GR
GS
[1 0 0 1 265.1991 141.00859] CT
0.2 GC
N
f-775751039
f
GR
GS
[1 0 0 1 255.65579 160.95927] CT
0.2 GC
N
f-775751039
f
GR
GS
[1 0 0 1 265.64822 98.10935] CT
0.2 GC
N
f-775751039
f
GR
GS
[1 0 0 1 254.3343 108.22736] CT
0.2 GC
N
f-775751039
f
GR
GS
[1 0 0 1 267.58533 154.46593] CT
0.2 GC
N
f-775751039
f
GR
GS
[1 0 0 1 274.92197 92.84113] CT
0.2 GC
N
f-775751039
f
GR
GS
[1 0 0 1 246.3839 133.216] CT
0.2 GC
N
f-775751039
f
GR
GS
[1 0 0 1 250.23712 122.62645] CT
0.2 GC
N
f-775751039
f
GR
GS
[1 0 0 1 275.2121 183.04086] CT
0.2 GC
N
f-775751039
f
GR
GS
[1 0 0 1 252.35135 182.45863] CT
0.2 GC
N
f-775751039
f
GR
GS
[1 0 0 1 272.89828 178.18539] CT
0.2 GC
N
f-775751039
f
GR
GS
[1 0 0 1 252.9825 147.5836] CT
0.2 GC
N
f-775751039
f
GR
GS
[1 0 0 1 275.54675 153.00444] CT
0.2 GC
N
f-775751039
f
GR
GS
[1 0 0 1 254.23454 117.69108] CT
0.2 GC
N
f-775751039
f
GR
GS
[1 0 0 1 268.16638 170.84938] CT
0.2 GC
N
f-775751039
f
GR
GS
[1 0 0 1 262.62793 145.39175] CT
0.2 GC
N
f-775751039
f
GR
GS
[1 0 0 1 257.24185 159.92786] CT
0.2 GC
N
f-775751039
f
GR
GS
[1 0 0 1 250.02661 150.64656] CT
0.2 GC
N
f-775751039
f
GR
GS
[1 0 0 1 277.9957 154.18141] CT
0.2 GC
N
f-775751039
f
GR
GS
[1 0 0 1 251.06543 151.83824] CT
0.2 GC
N
f-775751039
f
GR
GS
[1 0 0 1 262.56909 126.94872] CT
0.2 GC
N
f-775751039
f
GR
GS
[1 0 0 1 268.18533 144.92528] CT
0.2 GC
N
f-775751039
f
GR
GS
[1 0 0 1 263.05188 141.91473] CT
0.2 GC
N
f-775751039
f
GR
GS
[1 0 0 1 276.45462 176.7997] CT
0.2 GC
N
f-775751039
f
GR
GS
[1 0 0 1 276.93314 126.60938] CT
0.2 GC
N
f-775751039
f
GR
GS
[1 0 0 1 276.10974 181.41331] CT
0.2 GC
N
f-775751039
f
GR
GS
[1 0 0 1 269.57089 137.18732] CT
0.2 GC
N
f-775751039
f
GR
GS
[1 0 0 1 333.12445 169.63016] CT
0.2 GC
N
f-775751039
f
GR
GS
[1 0 0 1 355.80981 149.19112] CT
0.2 GC
N
f-775751039
f
GR
GS
[1 0 0 1 343.91077 138.89714] CT
0.2 GC
N
f-775751039
f
GR
GS
[1 0 0 1 333.36252 161.58339] CT
0.2 GC
N
f-775751039
f
GR
GS
[1 0 0 1 330.37192 139.69344] CT
0.2 GC
N
f-775751039
f
GR
GS
[1 0 0 1 336.34995 149.57832] CT
0.2 GC
N
f-775751039
f
GR
GS
[1 0 0 1 331.48294 130.25667] CT
0.2 GC
N
f-775751039
f
GR
GS
[1 0 0 1 357.12518 173.70372] CT
0.2 GC
N
f-775751039
f
GR
GS
[1 0 0 1 356.4762 152.47885] CT
0.2 GC
N
f-775751039
f
GR
GS
[1 0 0 1 340.98734 141.79913] CT
0.2 GC
N
f-775751039
f
GR
GS
[1 0 0 1 338.6394 155.2682] CT
0.2 GC
N
f-775751039
f
GR
GS
[1 0 0 1 357.80887 146.63771] CT
0.2 GC
N
f-775751039
f
GR
GS
[1 0 0 1 360.63187 171.28368] CT
0.2 GC
N
f-775751039
f
GR
GS
[1 0 0 1 356.31387 141.62968] CT
0.2 GC
N
f-775751039
f
GR
GS
[1 0 0 1 348.37057 163.32515] CT
0.2 GC
N
f-775751039
f
GR
GS
[1 0 0 1 330.7742 133.66972] CT
0.2 GC
N
f-775751039
f
GR
GS
[1 0 0 1 331.06052 143.26471] CT
0.2 GC
N
f-775751039
f
GR
GS
[1 0 0 1 358.52319 150.75453] CT
0.2 GC
N
f-775751039
f
GR
GS
[1 0 0 1 350.60919 141.98531] CT
0.2 GC
N
f-775751039
f
GR
GS
[1 0 0 1 356.64108 156.66058] CT
0.2 GC
N
f-775751039
f
GR
GS
[1 0 0 1 358.54059 182.89008] CT
0.2 GC
N
f-775751039
f
GR
GS
[1 0 0 1 344.87964 171.47119] CT
0.2 GC
N
f-775751039
f
GR
GS
[1 0 0 1 331.0553 169.23303] CT
0.2 GC
N
f-775751039
f
GR
GS
[1 0 0 1 338.83316 144.10094] CT
0.2 GC
N
f-775751039
f
GR
GS
[1 0 0 1 356.35748 151.62125] CT
0.2 GC
N
f-775751039
f
GR
GS
[1 0 0 1 349.2767 174.60649] CT
0.2 GC
N
f-775751039
f
GR
GS
[1 0 0 1 350.27216 144.12196] CT
0.2 GC
N
f-775751039
f
GR
GS
[1 0 0 1 355.53897 161.10303] CT
0.2 GC
N
f-775751039
f
GR
GS
[1 0 0 1 332.13617 144.06178] CT
0.2 GC
N
f-775751039
f
GR
GS
[1 0 0 1 333.24667 177.03078] CT
0.2 GC
N
f-775751039
f
GR
GS
[1 0 0 1 330.53464 157.25052] CT
0.2 GC
N
f-775751039
f
GR
GS
[1 0 0 1 364.38159 175.94821] CT
0.2 GC
N
f-775751039
f
GR
GS
[1 0 0 1 351.75449 180.61058] CT
0.2 GC
N
f-775751039
f
GR
GS
[1 0 0 1 362.88828 178.84238] CT
0.2 GC
N
f-775751039
f
GR
GS
[1 0 0 1 355.4603 136.33655] CT
0.2 GC
N
f-775751039
f
GR
GS
[1 0 0 1 337.60779 189.13222] CT
0.2 GC
N
f-775751039
f
GR
GS
[1 0 0 1 358.75931 165.82649] CT
0.2 GC
N
f-775751039
f
GR
GS
[1 0 0 1 330.47729 163.25732] CT
0.2 GC
N
f-775751039
f
GR
GS
[1 0 0 1 332.68683 142.2276] CT
0.2 GC
N
f-775751039
f
GR
GS
[1 0 0 1 353.22336 163.70372] CT
0.2 GC
N
f-775751039
f
GR
GS
[1 0 0 1 351.19016 139.67775] CT
0.2 GC
N
f-775751039
f
GR
GS
[1 0 0 1 358.60608 155.28151] CT
0.2 GC
N
f-775751039
f
GR
GS
[1 0 0 1 356.16864 167.79079] CT
0.2 GC
N
f-775751039
f
GR
GS
[1 0 0 1 360.94901 157.84821] CT
0.2 GC
N
f-775751039
f
GR
GS
[1 0 0 1 356.74249 148.77734] CT
0.2 GC
N
f-775751039
f
GR
GS
[1 0 0 1 351.48682 151.68411] CT
0.2 GC
N
f-775751039
f
GR
GS
[1 0 0 1 330.24469 165.84425] CT
0.2 GC
N
f-775751039
f
GR
GS
[1 0 0 1 345.87289 151.20129] CT
0.2 GC
N
f-775751039
f
GR
GS
[1 0 0 1 341.94324 171.78931] CT
0.2 GC
N
f-775751039
f
GR
GS
[1 0 0 1 334.48535 134.32883] CT
0.2 GC
N
f-775751039
f
GR
GS
[1 0 0 1 337.82083 171.24722] CT
0.2 GC
N
f-775751039
f
GR
GS
[1 0 0 1 352.22223 158.0697] CT
0.2 GC
N
f-775751039
f
GR
GS
[1 0 0 1 360.47638 149.13687] CT
0.2 GC
N
f-775751039
f
GR
GS
[1 0 0 1 446.13324 157.53198] CT
0.2 GC
N
f-775751039
f
GR
GS
[1 0 0 1 420.48721 155.66743] CT
0.2 GC
N
f-775751039
f
GR
GS
[1 0 0 1 432.92435 219.08723] CT
0.2 GC
N
f-775751039
f
GR
GS
[1 0 0 1 428.70557 154.82289] CT
0.2 GC
N
f-775751039
f
GR
GS
[1 0 0 1 446.12134 167.4514] CT
0.2 GC
N
f-775751039
f
GR
GS
[1 0 0 1 428.19385 162.35063] CT
0.2 GC
N
f-775751039
f
GR
GS
[1 0 0 1 441.1778 163.00327] CT
0.2 GC
N
f-775751039
f
GR
GS
[1 0 0 1 441.91248 164.20512] CT
0.2 GC
N
f-775751039
f
GR
GS
[1 0 0 1 423.23032 154.68651] CT
0.2 GC
N
f-775751039
f
GR
GS
[1 0 0 1 445.36996 180.02856] CT
0.2 GC
N
f-775751039
f
GR
GS
[1 0 0 1 433.22858 131.87857] CT
0.2 GC
N
f-775751039
f
GR
GS
[1 0 0 1 426.88403 170.86983] CT
0.2 GC
N
f-775751039
f
GR
GS
[1 0 0 1 449.50751 152.70721] CT
0.2 GC
N
f-775751039
f
GR
GS
[1 0 0 1 439.26392 164.46584] CT
0.2 GC
N
f-775751039
f
GR
GS
[1 0 0 1 433.2435 157.07965] CT
0.2 GC
N
f-775751039
f
GR
GS
[1 0 0 1 449.65805 175.37163] CT
0.2 GC
N
f-775751039
f
GR
GS
[1 0 0 1 428.05508 152.80215] CT
0.2 GC
N
f-775751039
f
GR
GS
[1 0 0 1 438.98911 136.36493] CT
0.2 GC
N
f-775751039
f
GR
GS
[1 0 0 1 435.14243 144.69583] CT
0.2 GC
N
f-775751039
f
GR
GS
[1 0 0 1 417.96011 126.53405] CT
0.2 GC
N
f-775751039
f
GR
GS
[1 0 0 1 426.67236 142.79399] CT
0.2 GC
N
f-775751039
f
GR
GS
[1 0 0 1 429.72852 171.00313] CT
0.2 GC
N
f-775751039
f
GR
GS
[1 0 0 1 416.46994 166.27084] CT
0.2 GC
N
f-775751039
f
GR
GS
[1 0 0 1 441.01932 161.08098] CT
0.2 GC
N
f-775751039
f
GR
GS
[1 0 0 1 433.84296 191.86537] CT
0.2 GC
N
f-775751039
f
GR
GS
[1 0 0 1 432.62781 149.56831] CT
0.2 GC
N
f-775751039
f
GR
GS
[1 0 0 1 429.67007 145.49168] CT
0.2 GC
N
f-775751039
f
GR
GS
[1 0 0 1 445.69028 156.50731] CT
0.2 GC
N
f-775751039
f
GR
GS
[1 0 0 1 428.40762 184.49257] CT
0.2 GC
N
f-775751039
f
GR
GS
[1 0 0 1 448.12592 148.25487] CT
0.2 GC
N
f-775751039
f
GR
GS
[1 0 0 1 438.62921 163.4122] CT
0.2 GC
N
f-775751039
f
GR
GS
[1 0 0 1 435.18134 160.58833] CT
0.2 GC
N
f-775751039
f
GR
GS
[1 0 0 1 427.31827 182.40413] CT
0.2 GC
N
f-775751039
f
GR
GS
[1 0 0 1 423.88068 155.28181] CT
0.2 GC
N
f-775751039
f
GR
GS
[1 0 0 1 434.58145 121.32496] CT
0.2 GC
N
f-775751039
f
GR
GS
[1 0 0 1 418.4332 143.88022] CT
0.2 GC
N
f-775751039
f
GR
GS
[1 0 0 1 433.0293 159.06969] CT
0.2 GC
N
f-775751039
f
GR
GS
[1 0 0 1 445.8172 165.993] CT
0.2 GC
N
f-775751039
f
GR
GS
[1 0 0 1 421.33844 166.46353] CT
0.2 GC
N
f-775751039
f
GR
GS
[1 0 0 1 424.61829 173.56857] CT
0.2 GC
N
f-775751039
f
GR
GS
[1 0 0 1 435.25894 168.58867] CT
0.2 GC
N
f-775751039
f
GR
GS
[1 0 0 1 439.84924 163.72087] CT
0.2 GC
N
f-775751039
f
GR
GS
[1 0 0 1 449.74661 151.72711] CT
0.2 GC
N
f-775751039
f
GR
GS
[1 0 0 1 422.16968 167.51375] CT
0.2 GC
N
f-775751039
f
GR
GS
[1 0 0 1 417.46829 158.3112] CT
0.2 GC
N
f-775751039
f
GR
GS
[1 0 0 1 427.43967 163.13014] CT
0.2 GC
N
f-775751039
f
GR
GS
[1 0 0 1 432.24286 155.88048] CT
0.2 GC
N
f-775751039
f
GR
GS
[1 0 0 1 446.36844 161.65451] CT
0.2 GC
N
f-775751039
f
GR
GS
[1 0 0 1 416.63699 157.61653] CT
0.2 GC
N
f-775751039
f
GR
GS
[1 0 0 1 447.0704 160.2187] CT
0.2 GC
N
f-775751039
f
GR
GS
[1 0 0 1 428.90228 171.7122] CT
0.2 GC
N
f-775751039
f
GR
GS
[1 0 0 1 426.00272 132.44252] CT
0.2 GC
N
f-775751039
f
GR
GS
[1 0 0 1 433.25436 210.96797] CT
0.2 GC
N
f-775751039
f
GR
GS
1 GC
N
/f-133304026{584 226.5 M
926.5 226.5 L
926.5 34.5 L
584 34.5 L
cp}def
f-133304026
f
GR
GS
0.149 GC
2 setlinecap
1 LJ
0.5 LW
N
584 226.5 M
926.5 226.5 L
S
GR
GS
0.149 GC
2 setlinecap
1 LJ
0.5 LW
N
626.813 226.5 M
626.813 223.075 L
S
GR
GS
0.149 GC
2 setlinecap
1 LJ
0.5 LW
N
712.438 226.5 M
712.438 223.075 L
S
GR
GS
0.149 GC
2 setlinecap
1 LJ
0.5 LW
N
798.063 226.5 M
798.063 223.075 L
S
GR
GS
0.149 GC
2 setlinecap
1 LJ
0.5 LW
N
883.688 226.5 M
883.688 223.075 L
S
GR
GS
[1 0 0 1 626.8125 233.10001] CT
0.149 GC
/Helvetica 23 F
GS
[1 0 0 1 0 0] CT
-28 22 moveto 
1 -1 scale
(Color) t 
GR
GR
GS
[1 0 0 1 712.4375 233.10001] CT
0.149 GC
/Helvetica 23 F
GS
[1 0 0 1 0 0] CT
-46 22 moveto 
1 -1 scale
(Direction) t 
GR
GR
GS
[1 0 0 1 798.0625 233.10001] CT
0.149 GC
/Helvetica 23 F
GS
[1 0 0 1 0 0] CT
-22 22 moveto 
1 -1 scale
(Size) t 
GR
GR
GS
[1 0 0 1 883.6875 233.10001] CT
0.149 GC
/Helvetica 23 F
GS
[1 0 0 1 0 0] CT
-56.5 22 moveto 
1 -1 scale
(Luminance) t 
GR
GR
GS
[1 0 0 1 755.25018 261.10001] CT
0.149 GC
/Helvetica 23 F
GS
[1 0 0 1 0 0] CT
-80 22 moveto 
1 -1 scale
(Probed Feature) t 
GR
GR
GS
0.149 GC
2 setlinecap
1 LJ
0.5 LW
N
584 226.5 M
584 34.5 L
S
GR
GS
0.149 GC
2 setlinecap
1 LJ
0.5 LW
N
584 188.1 M
587.425 188.1 L
S
GR
GS
0.149 GC
2 setlinecap
1 LJ
0.5 LW
N
584 111.3 M
587.425 111.3 L
S
GR
GS
0.149 GC
2 setlinecap
1 LJ
0.5 LW
N
584 34.5 M
587.425 34.5 L
S
GR
GS
[1 0 0 1 577.40002 188.10001] CT
0.149 GC
/Helvetica 23 F
GS
[1 0 0 1 0 0] CT
-13 8.5 moveto 
1 -1 scale
(0) t 
GR
GR
GS
[1 0 0 1 577.40002 111.3] CT
0.149 GC
/Helvetica 23 F
GS
[1 0 0 1 0 0] CT
-26 8.5 moveto 
1 -1 scale
(10) t 
GR
GR
GS
[1 0 0 1 577.40002 34.49999] CT
0.149 GC
/Helvetica 23 F
GS
[1 0 0 1 0 0] CT
-26 8.5 moveto 
1 -1 scale
(20) t 
GR
GR
GS
[0 -1 1 0 548.40002 130.49991] CT
0.149 GC
/Helvetica 23 F
GS
[1 0 0 1 0 0] CT
-100.5 -5 moveto 
1 -1 scale
(CPP Threshold \(?V\)) t 
GR
GR
GS
[1 0 0 1 584 29] CT
0.149 GC
N
/f-708981657{3.375 -0.656 M
3.375 -0.844 3.5 -0.984 QT
8.281 -5.75 L
3.5 -10.531 L
3.375 -10.641 3.375 -10.844 QT
3.375 -11 3.516 -11.148 QT
3.656 -11.297 3.844 -11.297 QT
4 -11.297 4.188 -11.156 QT
8.953 -6.391 L
13.688 -11.156 L
13.875 -11.297 14.031 -11.297 QT
14.219 -11.297 14.352 -11.164 QT
14.484 -11.031 14.484 -10.844 QT
14.484 -10.641 14.375 -10.531 QT
9.594 -5.75 L
14.375 -0.984 L
14.484 -0.844 14.484 -0.656 QT
14.484 -0.469 14.352 -0.336 QT
14.219 -0.203 14.031 -0.203 QT
13.859 -0.203 13.688 -0.375 QT
8.953 -5.109 L
4.188 -0.375 L
4.016 -0.203 3.844 -0.203 QT
3.656 -0.203 3.516 -0.352 QT
3.375 -0.5 3.375 -0.656 QT
cp}def
f-708981657
f
GR
GS
[1 0 0 1 602 29] CT
0.149 GC
/Helvetica 23 F
GS
[1 0 0 1 0 0] CT
0 0 moveto 
1 -1 scale
(10) t 
GR
GR
GS
[1 0 0 1 628 18] CT
0.149 GC
/Helvetica 18.4 F
GS
[1 0 0 1 0 0] CT
0 0 moveto 
1 -1 scale
(-4) t 
GR
GR
GS
0.149 GC
1 LJ
0.5 LW
N
584 188.1 M
926.5 188.1 L
S
GR
GS
0.2 0.6 0.2 RC
N
/f52772402{661.063 188.1 M
661.063 154.586 L
592.563 154.586 L
592.563 188.1 L
cp
746.688 188.1 M
746.688 141.346 L
678.188 141.346 L
678.188 188.1 L
cp
832.313 188.1 M
832.313 149.905 L
763.813 149.905 L
763.813 188.1 L
cp
917.938 188.1 M
917.938 157.627 L
849.438 157.627 L
849.438 188.1 L
cp}def
f52772402
f
GR
GS
1 LJ
4 LW
N
626.813 148.778 M
626.813 160.395 L
S
GR
GS
1 LJ
4 LW
N
626.813 148.778 M
626.813 148.778 L
S
GR
GS
1 LJ
4 LW
N
626.813 160.395 M
626.813 160.395 L
S
GR
GS
1 LJ
4 LW
N
712.438 136.158 M
712.438 146.534 L
S
GR
GS
1 LJ
4 LW
N
712.438 136.158 M
712.438 136.158 L
S
GR
GS
1 LJ
4 LW
N
712.438 146.534 M
712.438 146.534 L
S
GR
GS
1 LJ
4 LW
N
798.063 144.786 M
798.063 155.024 L
S
GR
GS
1 LJ
4 LW
N
798.063 144.786 M
798.063 144.786 L
S
GR
GS
1 LJ
4 LW
N
798.063 155.024 M
798.063 155.024 L
S
GR
GS
1 LJ
4 LW
N
883.688 152.232 M
883.688 163.022 L
S
GR
GS
1 LJ
4 LW
N
883.688 152.232 M
883.688 152.232 L
S
GR
GS
1 LJ
4 LW
N
883.688 163.022 M
883.688 163.022 L
S
GR
GS
1 LJ
0.5 LW
N
635.375 221.124 M
703.875 221.124 L
S
GR
GS
1 GC
N
/f-1934222308{663.625 236.124 M
675.625 236.124 L
675.625 206.124 L
663.625 206.124 L
cp}def
f-1934222308
f
GR
GS
[1 0 0 1 669.625 221.12399] CT
/Helvetica-Bold 23 F
GS
[1 0 0 1 0 0] CT
-5 9 moveto 
1 -1 scale
(*) t 
GR
GR
GS
1 LJ
0.5 LW
N
721 225.732 M
789.5 225.732 L
S
GR
GS
1 GC
N
/f-2001247922{749.25 240.732 M
761.25 240.732 L
761.25 210.732 L
749.25 210.732 L
cp}def
f-2001247922
f
GR
GS
[1 0 0 1 755.25 225.73199] CT
/Helvetica-Bold 23 F
GS
[1 0 0 1 0 0] CT
-5 9 moveto 
1 -1 scale
(*) t 
GR
GR
GS
1 LJ
0.5 LW
N
806.625 224.58 M
875.125 224.58 L
S
GR
GS
1 GC
N
/f-1406739602{834.875 239.58 M
846.875 239.58 L
846.875 209.58 L
834.875 209.58 L
cp}def
f-1406739602
f
GR
GS
[1 0 0 1 840.875 224.58] CT
/Helvetica-Bold 23 F
GS
[1 0 0 1 0 0] CT
-5 9 moveto 
1 -1 scale
(*) t 
GR
GR
GS
1 LJ
0.5 LW
N
721 222.66 M
875.125 222.66 L
S
GR
GS
1 GC
N
/f934194894{787.563 237.66 M
808.563 237.66 L
808.563 207.66 L
787.563 207.66 L
cp}def
f934194894
f
GR
GS
[1 0 0 1 798.0625 222.66] CT
/Helvetica-Bold 23 F
GS
[1 0 0 1 0 0] CT
-9.5 9 moveto 
1 -1 scale
(**) t 
GR
GR
GS
[1 0 0 1 637.77527 155.32053] CT
0.2 GC
N
f-775751039
f
GR
GS
[1 0 0 1 614.19836 148.27322] CT
0.2 GC
N
f-775751039
f
GR
GS
[1 0 0 1 630.68311 144.34087] CT
0.2 GC
N
f-775751039
f
GR
GS
[1 0 0 1 643.36505 165.12616] CT
0.2 GC
N
f-775751039
f
GR
GS
[1 0 0 1 637.51678 154.27368] CT
0.2 GC
N
f-775751039
f
GR
GS
[1 0 0 1 638.67505 141.6312] CT
0.2 GC
N
f-775751039
f
GR
GS
[1 0 0 1 643.50793 149.38156] CT
0.2 GC
N
f-775751039
f
GR
GS
[1 0 0 1 634.39972 137.53796] CT
0.2 GC
N
f-775751039
f
GR
GS
[1 0 0 1 642.59424 165.98134] CT
0.2 GC
N
f-775751039
f
GR
GS
[1 0 0 1 642.70392 143.28683] CT
0.2 GC
N
f-775751039
f
GR
GS
[1 0 0 1 619.32715 161.76163] CT
0.2 GC
N
f-775751039
f
GR
GS
[1 0 0 1 636.94135 151.44041] CT
0.2 GC
N
f-775751039
f
GR
GS
[1 0 0 1 622.00629 140.53416] CT
0.2 GC
N
f-775751039
f
GR
GS
[1 0 0 1 623.35168 158.09814] CT
0.2 GC
N
f-775751039
f
GR
GS
[1 0 0 1 627.26788 157.3356] CT
0.2 GC
N
f-775751039
f
GR
GS
[1 0 0 1 629.31299 183.82944] CT
0.2 GC
N
f-775751039
f
GR
GS
[1 0 0 1 632.06268 150.32037] CT
0.2 GC
N
f-775751039
f
GR
GS
[1 0 0 1 639.15546 155.82835] CT
0.2 GC
N
f-775751039
f
GR
GS
[1 0 0 1 633.92981 156.51997] CT
0.2 GC
N
f-775751039
f
GR
GS
[1 0 0 1 633.21173 88.7665] CT
0.2 GC
N
f-775751039
f
GR
GS
[1 0 0 1 632.315 162.76204] CT
0.2 GC
N
f-775751039
f
GR
GS
[1 0 0 1 635.50421 145.48317] CT
0.2 GC
N
f-775751039
f
GR
GS
[1 0 0 1 621.09143 136.04057] CT
0.2 GC
N
f-775751039
f
GR
GS
[1 0 0 1 611.07349 197.93309] CT
0.2 GC
N
f-775751039
f
GR
GS
[1 0 0 1 629.91174 167.77621] CT
0.2 GC
N
f-775751039
f
GR
GS
[1 0 0 1 613.89569 160.37178] CT
0.2 GC
N
f-775751039
f
GR
GS
[1 0 0 1 636.54498 153.69455] CT
0.2 GC
N
f-775751039
f
GR
GS
[1 0 0 1 619.98419 158.34074] CT
0.2 GC
N
f-775751039
f
GR
GS
[1 0 0 1 627.72668 225.39418] CT
0.2 GC
N
f-775751039
f
GR
GS
[1 0 0 1 623.73566 150.09125] CT
0.2 GC
N
f-775751039
f
GR
GS
[1 0 0 1 619.36255 136.1711] CT
0.2 GC
N
f-775751039
f
GR
GS
[1 0 0 1 634.88995 152.42551] CT
0.2 GC
N
f-775751039
f
GR
GS
[1 0 0 1 613.46716 121.43282] CT
0.2 GC
N
f-775751039
f
GR
GS
[1 0 0 1 613.01111 153.23541] CT
0.2 GC
N
f-775751039
f
GR
GS
[1 0 0 1 610.30164 210.88512] CT
0.2 GC
N
f-775751039
f
GR
GS
[1 0 0 1 631.29681 126.2365] CT
0.2 GC
N
f-775751039
f
GR
GS
[1 0 0 1 614.56543 134.86644] CT
0.2 GC
N
f-775751039
f
GR
GS
[1 0 0 1 617.23621 131.54427] CT
0.2 GC
N
f-775751039
f
GR
GS
[1 0 0 1 636.98773 158.82468] CT
0.2 GC
N
f-775751039
f
GR
GS
[1 0 0 1 618.96582 155.26286] CT
0.2 GC
N
f-775751039
f
GR
GS
[1 0 0 1 615.47498 167.65559] CT
0.2 GC
N
f-775751039
f
GR
GS
[1 0 0 1 636.13733 118.43033] CT
0.2 GC
N
f-775751039
f
GR
GS
[1 0 0 1 631.58136 157.96841] CT
0.2 GC
N
f-775751039
f
GR
GS
[1 0 0 1 642.00854 147.49512] CT
0.2 GC
N
f-775751039
f
GR
GS
[1 0 0 1 634.09088 156.00763] CT
0.2 GC
N
f-775751039
f
GR
GS
[1 0 0 1 622.69708 157.44727] CT
0.2 GC
N
f-775751039
f
GR
GS
[1 0 0 1 612.98993 150.43982] CT
0.2 GC
N
f-775751039
f
GR
GS
[1 0 0 1 640.36633 119.42668] CT
0.2 GC
N
f-775751039
f
GR
GS
[1 0 0 1 624.51044 161.00847] CT
0.2 GC
N
f-775751039
f
GR
GS
[1 0 0 1 637.41992 144.02931] CT
0.2 GC
N
f-775751039
f
GR
GS
[1 0 0 1 619.58197 179.95497] CT
0.2 GC
N
f-775751039
f
GR
GS
[1 0 0 1 613.84106 150.22502] CT
0.2 GC
N
f-775751039
f
GR
GS
[1 0 0 1 709.18854 134.3007] CT
0.2 GC
N
f-775751039
f
GR
GS
[1 0 0 1 703.79193 138.77892] CT
0.2 GC
N
f-775751039
f
GR
GS
[1 0 0 1 722.61029 130.05927] CT
0.2 GC
N
f-775751039
f
GR
GS
[1 0 0 1 707.68555 145.84912] CT
0.2 GC
N
f-775751039
f
GR
GS
[1 0 0 1 718.80811 123.76398] CT
0.2 GC
N
f-775751039
f
GR
GS
[1 0 0 1 700.1828 141.55669] CT
0.2 GC
N
f-775751039
f
GR
GS
[1 0 0 1 719.97919 168.5672] CT
0.2 GC
N
f-775751039
f
GR
GS
[1 0 0 1 707.09991 130.79865] CT
0.2 GC
N
f-775751039
f
GR
GS
[1 0 0 1 719.14185 123.98362] CT
0.2 GC
N
f-775751039
f
GR
GS
[1 0 0 1 729.17548 108.17002] CT
0.2 GC
N
f-775751039
f
GR
GS
[1 0 0 1 722.24884 144.67484] CT
0.2 GC
N
f-775751039
f
GR
GS
[1 0 0 1 713.79169 131.59979] CT
0.2 GC
N
f-775751039
f
GR
GS
[1 0 0 1 708.73242 143.96957] CT
0.2 GC
N
f-775751039
f
GR
GS
[1 0 0 1 713.99097 159.26048] CT
0.2 GC
N
f-775751039
f
GR
GS
[1 0 0 1 700.97211 139.51791] CT
0.2 GC
N
f-775751039
f
GR
GS
[1 0 0 1 711.36603 113.08698] CT
0.2 GC
N
f-775751039
f
GR
GS
[1 0 0 1 728.4635 140.45917] CT
0.2 GC
N
f-775751039
f
GR
GS
[1 0 0 1 702.45239 157.93976] CT
0.2 GC
N
f-775751039
f
GR
GS
[1 0 0 1 714.591 147.47981] CT
0.2 GC
N
f-775751039
f
GR
GS
[1 0 0 1 721.49371 179.05008] CT
0.2 GC
N
f-775751039
f
GR
GS
[1 0 0 1 697.32819 119.88943] CT
0.2 GC
N
f-775751039
f
GR
GS
[1 0 0 1 715.02753 121.67093] CT
0.2 GC
N
f-775751039
f
GR
GS
[1 0 0 1 715.06842 147.00581] CT
0.2 GC
N
f-775751039
f
GR
GS
[1 0 0 1 717.7876 148.46474] CT
0.2 GC
N
f-775751039
f
GR
GS
[1 0 0 1 725.01495 146.3317] CT
0.2 GC
N
f-775751039
f
GR
GS
[1 0 0 1 711.73975 161.19255] CT
0.2 GC
N
f-775751039
f
GR
GS
[1 0 0 1 716.12885 166.01262] CT
0.2 GC
N
f-775751039
f
GR
GS
[1 0 0 1 720.11548 117.13269] CT
0.2 GC
N
f-775751039
f
GR
GS
[1 0 0 1 702.45166 82.052] CT
0.2 GC
N
f-775751039
f
GR
GS
[1 0 0 1 708.66412 159.48622] CT
0.2 GC
N
f-775751039
f
GR
GS
[1 0 0 1 710.07629 158.2742] CT
0.2 GC
N
f-775751039
f
GR
GS
[1 0 0 1 729.30261 134.57489] CT
0.2 GC
N
f-775751039
f
GR
GS
[1 0 0 1 698.71082 160.77684] CT
0.2 GC
N
f-775751039
f
GR
GS
[1 0 0 1 723.14111 153.49222] CT
0.2 GC
N
f-775751039
f
GR
GS
[1 0 0 1 725.95911 147.6732] CT
0.2 GC
N
f-775751039
f
GR
GS
[1 0 0 1 727.68604 168.88025] CT
0.2 GC
N
f-775751039
f
GR
GS
[1 0 0 1 724.02869 137.80113] CT
0.2 GC
N
f-775751039
f
GR
GS
[1 0 0 1 696.51996 150.81398] CT
0.2 GC
N
f-775751039
f
GR
GS
[1 0 0 1 726.43933 127.59985] CT
0.2 GC
N
f-775751039
f
GR
GS
[1 0 0 1 718.04755 141.94456] CT
0.2 GC
N
f-775751039
f
GR
GS
[1 0 0 1 699.02399 175.16167] CT
0.2 GC
N
f-775751039
f
GR
GS
[1 0 0 1 698.61182 138.22943] CT
0.2 GC
N
f-775751039
f
GR
GS
[1 0 0 1 718.7309 158.93672] CT
0.2 GC
N
f-775751039
f
GR
GS
[1 0 0 1 714.92596 84.5443] CT
0.2 GC
N
f-775751039
f
GR
GS
[1 0 0 1 726.5495 160.97353] CT
0.2 GC
N
f-775751039
f
GR
GS
[1 0 0 1 711.8219 152.27881] CT
0.2 GC
N
f-775751039
f
GR
GS
[1 0 0 1 707.62292 128.48412] CT
0.2 GC
N
f-775751039
f
GR
GS
[1 0 0 1 717.75275 127.83553] CT
0.2 GC
N
f-775751039
f
GR
GS
[1 0 0 1 725.69159 170.18701] CT
0.2 GC
N
f-775751039
f
GR
GS
[1 0 0 1 696.29791 153.46521] CT
0.2 GC
N
f-775751039
f
GR
GS
[1 0 0 1 707.80823 141.82272] CT
0.2 GC
N
f-775751039
f
GR
GS
[1 0 0 1 712.4671 99.96382] CT
0.2 GC
N
f-775751039
f
GR
GS
[1 0 0 1 706.03033 145.4971] CT
0.2 GC
N
f-775751039
f
GR
GS
[1 0 0 1 800.14038 175.27504] CT
0.2 GC
N
f-775751039
f
GR
GS
[1 0 0 1 805.61462 167.53146] CT
0.2 GC
N
f-775751039
f
GR
GS
[1 0 0 1 810.30981 143.47437] CT
0.2 GC
N
f-775751039
f
GR
GS
[1 0 0 1 790.27356 150.22725] CT
0.2 GC
N
f-775751039
f
GR
GS
[1 0 0 1 809.24084 160.24901] CT
0.2 GC
N
f-775751039
f
GR
GS
[1 0 0 1 784.54126 158.7659] CT
0.2 GC
N
f-775751039
f
GR
GS
[1 0 0 1 814.31799 117.96239] CT
0.2 GC
N
f-775751039
f
GR
GS
[1 0 0 1 806.81085 167.2131] CT
0.2 GC
N
f-775751039
f
GR
GS
[1 0 0 1 805.98572 141.29372] CT
0.2 GC
N
f-775751039
f
GR
GS
[1 0 0 1 803.90479 164.68704] CT
0.2 GC
N
f-775751039
f
GR
GS
[1 0 0 1 792.30408 131.61206] CT
0.2 GC
N
f-775751039
f
GR
GS
[1 0 0 1 805.32178 116.89433] CT
0.2 GC
N
f-775751039
f
GR
GS
[1 0 0 1 795.47638 150.83841] CT
0.2 GC
N
f-775751039
f
GR
GS
[1 0 0 1 812.85876 112.84899] CT
0.2 GC
N
f-775751039
f
GR
GS
[1 0 0 1 814.32349 155.67834] CT
0.2 GC
N
f-775751039
f
GR
GS
[1 0 0 1 783.57111 155.48164] CT
0.2 GC
N
f-775751039
f
GR
GS
[1 0 0 1 797.46075 146.93477] CT
0.2 GC
N
f-775751039
f
GR
GS
[1 0 0 1 814.10876 152.0379] CT
0.2 GC
N
f-775751039
f
GR
GS
[1 0 0 1 809.5224 152.23784] CT
0.2 GC
N
f-775751039
f
GR
GS
[1 0 0 1 781.32819 143.4395] CT
0.2 GC
N
f-775751039
f
GR
GS
[1 0 0 1 798.21179 150.6067] CT
0.2 GC
N
f-775751039
f
GR
GS
[1 0 0 1 783.19745 150.80551] CT
0.2 GC
N
f-775751039
f
GR
GS
[1 0 0 1 809.79156 140.82722] CT
0.2 GC
N
f-775751039
f
GR
GS
[1 0 0 1 794.60297 128.72408] CT
0.2 GC
N
f-775751039
f
GR
GS
[1 0 0 1 798.3446 121.48437] CT
0.2 GC
N
f-775751039
f
GR
GS
[1 0 0 1 783.93921 153.47615] CT
0.2 GC
N
f-775751039
f
GR
GS
[1 0 0 1 814.03442 134.7531] CT
0.2 GC
N
f-775751039
f
GR
GS
[1 0 0 1 798.09192 181.06732] CT
0.2 GC
N
f-775751039
f
GR
GS
[1 0 0 1 809.10211 139.85803] CT
0.2 GC
N
f-775751039
f
GR
GS
[1 0 0 1 797.02039 150.14735] CT
0.2 GC
N
f-775751039
f
GR
GS
[1 0 0 1 798.03003 156.79074] CT
0.2 GC
N
f-775751039
f
GR
GS
[1 0 0 1 794.02856 160.85608] CT
0.2 GC
N
f-775751039
f
GR
GS
[1 0 0 1 783.70819 163.70952] CT
0.2 GC
N
f-775751039
f
GR
GS
[1 0 0 1 809.44995 159.22679] CT
0.2 GC
N
f-775751039
f
GR
GS
[1 0 0 1 812.07806 123.9189] CT
0.2 GC
N
f-775751039
f
GR
GS
[1 0 0 1 799.7171 141.75758] CT
0.2 GC
N
f-775751039
f
GR
GS
[1 0 0 1 796.41229 164.79572] CT
0.2 GC
N
f-775751039
f
GR
GS
[1 0 0 1 813.10175 154.13899] CT
0.2 GC
N
f-775751039
f
GR
GS
[1 0 0 1 809.55518 162.1958] CT
0.2 GC
N
f-775751039
f
GR
GS
[1 0 0 1 802.26904 144.73413] CT
0.2 GC
N
f-775751039
f
GR
GS
[1 0 0 1 800.77264 127.1717] CT
0.2 GC
N
f-775751039
f
GR
GS
[1 0 0 1 787.52679 164.33463] CT
0.2 GC
N
f-775751039
f
GR
GS
[1 0 0 1 808.1153 154.6792] CT
0.2 GC
N
f-775751039
f
GR
GS
[1 0 0 1 812.80853 165.48293] CT
0.2 GC
N
f-775751039
f
GR
GS
[1 0 0 1 805.54333 148.40373] CT
0.2 GC
N
f-775751039
f
GR
GS
[1 0 0 1 802.90747 145.84616] CT
0.2 GC
N
f-775751039
f
GR
GS
[1 0 0 1 792.80194 180.03735] CT
0.2 GC
N
f-775751039
f
GR
GS
[1 0 0 1 809.70923 143.21597] CT
0.2 GC
N
f-775751039
f
GR
GS
[1 0 0 1 784.73938 161.07805] CT
0.2 GC
N
f-775751039
f
GR
GS
[1 0 0 1 783.71185 132.45247] CT
0.2 GC
N
f-775751039
f
GR
GS
[1 0 0 1 784.88165 161.06833] CT
0.2 GC
N
f-775751039
f
GR
GS
[1 0 0 1 790.76825 172.60551] CT
0.2 GC
N
f-775751039
f
GR
GS
[1 0 0 1 796.47003 140.01494] CT
0.2 GC
N
f-775751039
f
GR
GS
[1 0 0 1 894.88 138.56725] CT
0.2 GC
N
f-775751039
f
GR
GS
[1 0 0 1 870.76947 148.87991] CT
0.2 GC
N
f-775751039
f
GR
GS
[1 0 0 1 867.52039 185.58904] CT
0.2 GC
N
f-775751039
f
GR
GS
[1 0 0 1 867.97186 142.261] CT
0.2 GC
N
f-775751039
f
GR
GS
[1 0 0 1 874.98468 165.17685] CT
0.2 GC
N
f-775751039
f
GR
GS
[1 0 0 1 878.73016 161.50974] CT
0.2 GC
N
f-775751039
f
GR
GS
[1 0 0 1 875.32709 167.55235] CT
0.2 GC
N
f-775751039
f
GR
GS
[1 0 0 1 893.73267 167.9138] CT
0.2 GC
N
f-775751039
f
GR
GS
[1 0 0 1 879.43994 172.20483] CT
0.2 GC
N
f-775751039
f
GR
GS
[1 0 0 1 890.28558 187.31964] CT
0.2 GC
N
f-775751039
f
GR
GS
[1 0 0 1 900.39923 165.41499] CT
0.2 GC
N
f-775751039
f
GR
GS
[1 0 0 1 886.6347 203.52899] CT
0.2 GC
N
f-775751039
f
GR
GS
[1 0 0 1 894.00934 168.12138] CT
0.2 GC
N
f-775751039
f
GR
GS
[1 0 0 1 876.4306 173.25591] CT
0.2 GC
N
f-775751039
f
GR
GS
[1 0 0 1 882.86328 150.93167] CT
0.2 GC
N
f-775751039
f
GR
GS
[1 0 0 1 892.66803 151.06546] CT
0.2 GC
N
f-775751039
f
GR
GS
[1 0 0 1 884.26129 165.74921] CT
0.2 GC
N
f-775751039
f
GR
GS
[1 0 0 1 891.10791 137.6575] CT
0.2 GC
N
f-775751039
f
GR
GS
[1 0 0 1 894.07166 147.22589] CT
0.2 GC
N
f-775751039
f
GR
GS
[1 0 0 1 867.35272 192.20744] CT
0.2 GC
N
f-775751039
f
GR
GS
[1 0 0 1 892.94818 170.20535] CT
0.2 GC
N
f-775751039
f
GR
GS
[1 0 0 1 871.54797 185.50391] CT
0.2 GC
N
f-775751039
f
GR
GS
[1 0 0 1 892.04395 179.58992] CT
0.2 GC
N
f-775751039
f
GR
GS
[1 0 0 1 874.39459 128.34163] CT
0.2 GC
N
f-775751039
f
GR
GS
[1 0 0 1 882.41528 167.87125] CT
0.2 GC
N
f-775751039
f
GR
GS
[1 0 0 1 886.35309 128.42303] CT
0.2 GC
N
f-775751039
f
GR
GS
[1 0 0 1 872.5708 149.00323] CT
0.2 GC
N
f-775751039
f
GR
GS
[1 0 0 1 885.56866 146.92276] CT
0.2 GC
N
f-775751039
f
GR
GS
[1 0 0 1 893.34503 156.1593] CT
0.2 GC
N
f-775751039
f
GR
GS
[1 0 0 1 872.03699 143.73869] CT
0.2 GC
N
f-775751039
f
GR
GS
[1 0 0 1 892.88123 152.22748] CT
0.2 GC
N
f-775751039
f
GR
GS
[1 0 0 1 869.74609 155.60704] CT
0.2 GC
N
f-775751039
f
GR
GS
[1 0 0 1 883.84552 157.54433] CT
0.2 GC
N
f-775751039
f
GR
GS
[1 0 0 1 867.70154 137.50909] CT
0.2 GC
N
f-775751039
f
GR
GS
[1 0 0 1 892.50134 120.98632] CT
0.2 GC
N
f-775751039
f
GR
GS
[1 0 0 1 886.00067 166.58919] CT
0.2 GC
N
f-775751039
f
GR
GS
[1 0 0 1 873.72992 166.00024] CT
0.2 GC
N
f-775751039
f
GR
GS
[1 0 0 1 892.17719 166.96629] CT
0.2 GC
N
f-775751039
f
GR
GS
[1 0 0 1 896.27509 154.84319] CT
0.2 GC
N
f-775751039
f
GR
GS
[1 0 0 1 875.90552 161.52196] CT
0.2 GC
N
f-775751039
f
GR
GS
[1 0 0 1 893.42023 66.50091] CT
0.2 GC
N
f-775751039
f
GR
GS
[1 0 0 1 894.44653 133.24387] CT
0.2 GC
N
f-775751039
f
GR
GS
[1 0 0 1 898.57111 171.41727] CT
0.2 GC
N
f-775751039
f
GR
GS
[1 0 0 1 885.41803 195.46788] CT
0.2 GC
N
f-775751039
f
GR
GS
[1 0 0 1 898.8396 146.59116] CT
0.2 GC
N
f-775751039
f
GR
GS
[1 0 0 1 896.66974 149.33092] CT
0.2 GC
N
f-775751039
f
GR
GS
[1 0 0 1 896.63593 137.4948] CT
0.2 GC
N
f-775751039
f
GR
GS
[1 0 0 1 875.86871 181.9722] CT
0.2 GC
N
f-775751039
f
GR
GS
[1 0 0 1 885.14105 152.77177] CT
0.2 GC
N
f-775751039
f
GR
GS
[1 0 0 1 867.76538 156.53738] CT
0.2 GC
N
f-775751039
f
GR
GS
[1 0 0 1 868.21368 156.54317] CT
0.2 GC
N
f-775751039
f
GR
GS
[1 0 0 1 881.90582 150.93922] CT
0.2 GC
N
f-775751039
f
GR
GS
[1 0 0 1 875.44916 167.72647] CT
0.2 GC
N
f-775751039
f
GR
%%Trailer
%%Pages: 1
%%EOF
