/home/mpib/kosciessa/.virtualenvs/fooof/lib/python3.7/site-packages/fooof/objs/group.py:379: VisibleDeprecationWarning: Creating an ndarray from ragged nested sequences (which is a list-or-tuple of lists-or-tuples-or ndarrays with different lengths or shapes) is deprecated. If you meant to do this, you must specify 'dtype=object' when creating the ndarray.
  for index, data in enumerate(self.group_results)])
/home/mpib/kosciessa/.virtualenvs/fooof/lib/python3.7/site-packages/fooof/objs/group.py:379: VisibleDeprecationWarning: Creating an ndarray from ragged nested sequences (which is a list-or-tuple of lists-or-tuples-or ndarrays with different lengths or shapes) is deprecated. If you meant to do this, you must specify 'dtype=object' when creating the ndarray.
  for index, data in enumerate(self.group_results)])
/home/mpib/kosciessa/.virtualenvs/fooof/lib/python3.7/site-packages/fooof/objs/group.py:379: VisibleDeprecationWarning: Creating an ndarray from ragged nested sequences (which is a list-or-tuple of lists-or-tuples-or ndarrays with different lengths or shapes) is deprecated. If you meant to do this, you must specify 'dtype=object' when creating the ndarray.
  for index, data in enumerate(self.group_results)])
/home/mpib/kosciessa/.virtualenvs/fooof/lib/python3.7/site-packages/fooof/objs/group.py:379: VisibleDeprecationWarning: Creating an ndarray from ragged nested sequences (which is a list-or-tuple of lists-or-tuples-or ndarrays with different lengths or shapes) is deprecated. If you meant to do this, you must specify 'dtype=object' when creating the ndarray.
  for index, data in enumerate(self.group_results)])
b_runFOOOF.py
/home/mpib/LNDG/stateswitch/stsw_eeg_task/aperiodic_fooof
2209
Setting up paths ...

Loading backgrounds from .mat ...

Running FOOOFGroup across 60 power spectra.

FOOOF WARNING: Lower-bound peak width limit is < or ~= the frequency resolution: 0.50 <= 0.50
	Lower bounds below frequency-resolution have no effect (effective lower bound is the frequency resolution).
	Too low a limit may lead to overfitting noise as small bandwidth peaks.
	We recommend a lower bound of approximately 2x the frequency resolution.

==================================================================================================
                                                                                                  
                                       FOOOF - GROUP RESULTS                                      
                                                                                                  
                             Number of power spectra in the Group: 60                             
                                                                                                  
                        The model was run on the frequency range 2 - 80 Hz                        
                                 Frequency Resolution is 0.50 Hz                                  
                                                                                                  
                              Power spectra were fit without a knee.                              
                                                                                                  
                                      Aperiodic Fit Values:                                       
                        Exponents - Min:  0.707, Max:  1.401, Mean: 1.083                         
                                                                                                  
                         In total 551 peaks were extracted from the group                         
                                                                                                  
                                     Goodness of fit metrics:                                     
                            R2s -  Min:  0.954, Max:  0.994, Mean: 0.985                          
                         Errors -  Min:  0.029, Max:  0.061, Mean: 0.045                          
                                                                                                  
==================================================================================================
Running FOOOFGroup across 60 power spectra.

FOOOF WARNING: Lower-bound peak width limit is < or ~= the frequency resolution: 0.50 <= 0.50
	Lower bounds below frequency-resolution have no effect (effective lower bound is the frequency resolution).
	Too low a limit may lead to overfitting noise as small bandwidth peaks.
	We recommend a lower bound of approximately 2x the frequency resolution.

==================================================================================================
                                                                                                  
                                       FOOOF - GROUP RESULTS                                      
                                                                                                  
                             Number of power spectra in the Group: 60                             
                                                                                                  
                        The model was run on the frequency range 2 - 80 Hz                        
                                 Frequency Resolution is 0.50 Hz                                  
                                                                                                  
                              Power spectra were fit without a knee.                              
                                                                                                  
                                      Aperiodic Fit Values:                                       
                        Exponents - Min:  0.728, Max:  1.520, Mean: 1.137                         
                                                                                                  
                         In total 645 peaks were extracted from the group                         
                                                                                                  
                                     Goodness of fit metrics:                                     
                            R2s -  Min:  0.954, Max:  0.994, Mean: 0.985                          
                         Errors -  Min:  0.030, Max:  0.057, Mean: 0.044                          
                                                                                                  
==================================================================================================
Running FOOOFGroup across 60 power spectra.

FOOOF WARNING: Lower-bound peak width limit is < or ~= the frequency resolution: 0.50 <= 0.50
	Lower bounds below frequency-resolution have no effect (effective lower bound is the frequency resolution).
	Too low a limit may lead to overfitting noise as small bandwidth peaks.
	We recommend a lower bound of approximately 2x the frequency resolution.

==================================================================================================
                                                                                                  
                                       FOOOF - GROUP RESULTS                                      
                                                                                                  
                             Number of power spectra in the Group: 60                             
                                                                                                  
                        The model was run on the frequency range 2 - 80 Hz                        
                                 Frequency Resolution is 0.50 Hz                                  
                                                                                                  
                              Power spectra were fit without a knee.                              
                                                                                                  
                                      Aperiodic Fit Values:                                       
                        Exponents - Min:  0.733, Max:  1.422, Mean: 1.083                         
                                                                                                  
                         In total 634 peaks were extracted from the group                         
                                                                                                  
                                     Goodness of fit metrics:                                     
                            R2s -  Min:  0.966, Max:  0.995, Mean: 0.987                          
                         Errors -  Min:  0.025, Max:  0.053, Mean: 0.040                          
                                                                                                  
==================================================================================================
Running FOOOFGroup across 60 power spectra.

FOOOF WARNING: Lower-bound peak width limit is < or ~= the frequency resolution: 0.50 <= 0.50
	Lower bounds below frequency-resolution have no effect (effective lower bound is the frequency resolution).
	Too low a limit may lead to overfitting noise as small bandwidth peaks.
	We recommend a lower bound of approximately 2x the frequency resolution.

==================================================================================================
                                                                                                  
                                       FOOOF - GROUP RESULTS                                      
                                                                                                  
                             Number of power spectra in the Group: 60                             
                                                                                                  
                        The model was run on the frequency range 2 - 80 Hz                        
                                 Frequency Resolution is 0.50 Hz                                  
                                                                                                  
                              Power spectra were fit without a knee.                              
                                                                                                  
                                      Aperiodic Fit Values:                                       
                        Exponents - Min:  0.584, Max:  1.439, Mean: 1.095                         
                                                                                                  
                         In total 719 peaks were extracted from the group                         
                                                                                                  
                                     Goodness of fit metrics:                                     
                            R2s -  Min:  0.948, Max:  0.993, Mean: 0.985                          
                         Errors -  Min:  0.026, Max:  0.053, Mean: 0.041                          
                                                                                                  
==================================================================================================
2209Done!
