/home/mpib/kosciessa/.virtualenvs/fooof/lib/python3.7/site-packages/fooof/objs/group.py:379: VisibleDeprecationWarning: Creating an ndarray from ragged nested sequences (which is a list-or-tuple of lists-or-tuples-or ndarrays with different lengths or shapes) is deprecated. If you meant to do this, you must specify 'dtype=object' when creating the ndarray.
  for index, data in enumerate(self.group_results)])
/home/mpib/kosciessa/.virtualenvs/fooof/lib/python3.7/site-packages/fooof/objs/group.py:379: VisibleDeprecationWarning: Creating an ndarray from ragged nested sequences (which is a list-or-tuple of lists-or-tuples-or ndarrays with different lengths or shapes) is deprecated. If you meant to do this, you must specify 'dtype=object' when creating the ndarray.
  for index, data in enumerate(self.group_results)])
/home/mpib/kosciessa/.virtualenvs/fooof/lib/python3.7/site-packages/fooof/objs/group.py:379: VisibleDeprecationWarning: Creating an ndarray from ragged nested sequences (which is a list-or-tuple of lists-or-tuples-or ndarrays with different lengths or shapes) is deprecated. If you meant to do this, you must specify 'dtype=object' when creating the ndarray.
  for index, data in enumerate(self.group_results)])
/home/mpib/kosciessa/.virtualenvs/fooof/lib/python3.7/site-packages/fooof/objs/group.py:379: VisibleDeprecationWarning: Creating an ndarray from ragged nested sequences (which is a list-or-tuple of lists-or-tuples-or ndarrays with different lengths or shapes) is deprecated. If you meant to do this, you must specify 'dtype=object' when creating the ndarray.
  for index, data in enumerate(self.group_results)])
b_runFOOOF.py
/home/mpib/LNDG/stateswitch/stsw_eeg_task/aperiodic_fooof
1261
Setting up paths ...

Loading backgrounds from .mat ...

Running FOOOFGroup across 60 power spectra.

FOOOF WARNING: Lower-bound peak width limit is < or ~= the frequency resolution: 0.50 <= 0.50
	Lower bounds below frequency-resolution have no effect (effective lower bound is the frequency resolution).
	Too low a limit may lead to overfitting noise as small bandwidth peaks.
	We recommend a lower bound of approximately 2x the frequency resolution.

==================================================================================================
                                                                                                  
                                       FOOOF - GROUP RESULTS                                      
                                                                                                  
                             Number of power spectra in the Group: 60                             
                                                                                                  
                        The model was run on the frequency range 2 - 80 Hz                        
                                 Frequency Resolution is 0.50 Hz                                  
                                                                                                  
                              Power spectra were fit without a knee.                              
                                                                                                  
                                      Aperiodic Fit Values:                                       
                        Exponents - Min:  0.150, Max:  1.510, Mean: 0.966                         
                                                                                                  
                         In total 943 peaks were extracted from the group                         
                                                                                                  
                                     Goodness of fit metrics:                                     
                            R2s -  Min:  0.548, Max:  0.996, Mean: 0.972                          
                         Errors -  Min:  0.024, Max:  0.050, Mean: 0.036                          
                                                                                                  
==================================================================================================
Running FOOOFGroup across 60 power spectra.

FOOOF WARNING: Lower-bound peak width limit is < or ~= the frequency resolution: 0.50 <= 0.50
	Lower bounds below frequency-resolution have no effect (effective lower bound is the frequency resolution).
	Too low a limit may lead to overfitting noise as small bandwidth peaks.
	We recommend a lower bound of approximately 2x the frequency resolution.

==================================================================================================
                                                                                                  
                                       FOOOF - GROUP RESULTS                                      
                                                                                                  
                             Number of power spectra in the Group: 60                             
                                                                                                  
                        The model was run on the frequency range 2 - 80 Hz                        
                                 Frequency Resolution is 0.50 Hz                                  
                                                                                                  
                              Power spectra were fit without a knee.                              
                                                                                                  
                                      Aperiodic Fit Values:                                       
                        Exponents - Min:  0.256, Max:  1.490, Mean: 0.989                         
                                                                                                  
                         In total 954 peaks were extracted from the group                         
                                                                                                  
                                     Goodness of fit metrics:                                     
                            R2s -  Min:  0.548, Max:  0.995, Mean: 0.966                          
                         Errors -  Min:  0.024, Max:  0.062, Mean: 0.038                          
                                                                                                  
==================================================================================================
Running FOOOFGroup across 60 power spectra.

FOOOF WARNING: Lower-bound peak width limit is < or ~= the frequency resolution: 0.50 <= 0.50
	Lower bounds below frequency-resolution have no effect (effective lower bound is the frequency resolution).
	Too low a limit may lead to overfitting noise as small bandwidth peaks.
	We recommend a lower bound of approximately 2x the frequency resolution.

==================================================================================================
                                                                                                  
                                       FOOOF - GROUP RESULTS                                      
                                                                                                  
                             Number of power spectra in the Group: 60                             
                                                                                                  
                        The model was run on the frequency range 2 - 80 Hz                        
                                 Frequency Resolution is 0.50 Hz                                  
                                                                                                  
                              Power spectra were fit without a knee.                              
                                                                                                  
                                      Aperiodic Fit Values:                                       
                        Exponents - Min:  0.229, Max:  1.502, Mean: 0.993                         
                                                                                                  
                        In total 1011 peaks were extracted from the group                         
                                                                                                  
                                     Goodness of fit metrics:                                     
                            R2s -  Min:  0.559, Max:  0.996, Mean: 0.967                          
                         Errors -  Min:  0.025, Max:  0.058, Mean: 0.038                          
                                                                                                  
==================================================================================================
Running FOOOFGroup across 60 power spectra.

FOOOF WARNING: Lower-bound peak width limit is < or ~= the frequency resolution: 0.50 <= 0.50
	Lower bounds below frequency-resolution have no effect (effective lower bound is the frequency resolution).
	Too low a limit may lead to overfitting noise as small bandwidth peaks.
	We recommend a lower bound of approximately 2x the frequency resolution.

==================================================================================================
                                                                                                  
                                       FOOOF - GROUP RESULTS                                      
                                                                                                  
                             Number of power spectra in the Group: 60                             
                                                                                                  
                        The model was run on the frequency range 2 - 80 Hz                        
                                 Frequency Resolution is 0.50 Hz                                  
                                                                                                  
                              Power spectra were fit without a knee.                              
                                                                                                  
                                      Aperiodic Fit Values:                                       
                        Exponents - Min: -0.002, Max:  1.529, Mean: 0.983                         
                                                                                                  
                         In total 991 peaks were extracted from the group                         
                                                                                                  
                                     Goodness of fit metrics:                                     
                            R2s -  Min:  0.629, Max:  0.996, Mean: 0.966                          
                         Errors -  Min:  0.024, Max:  0.058, Mean: 0.038                          
                                                                                                  
==================================================================================================
1261Done!
