{"freq_range": [2.0, 80.0], "freq_res": 0.5, "aperiodic_params_": [-8.001940119291566, 0.9417009897119663], "gaussian_params_": [[7.946224583906119, 0.41263787120552325, 0.6765487383596797], [8.885246005452315, 0.4159871560821143, 0.39374211376395074], [10.400965988746819, 0.26197978030467134, 0.915349155999693], [12.740087579575414, 0.15525683232318915, 0.44594869670808257], [16.487743142907995, 0.243769307942867, 2.848982997154164], [21.89827520793825, 0.1639430774124346, 0.25000000000000006], [24.45556696488489, 0.17073282354417435, 1.078646889123419], [41.40539182845617, 0.11985405340707747, 0.25000000000000006], [47.51539886609586, 0.1426157022264574, 0.3315508018492044], [53.18492808475435, 0.16578921830153515, 1.0295032459433642], [57.01535294907301, 0.11228867967690546, 0.25000000000000006], [58.015504789150434, 0.21829348672026322, 0.40815251434388256], [60.18955435992622, 0.21939468274955023, 0.25000000000000006], [62.27010657162294, 0.14679166120710793, 0.8047344162685139], [64.18151676398178, 0.22255068137711184, 0.25000000000000006], [65.14294543403255, 0.14101823715609021, 0.5122750964271137], [69.25688590363298, 0.16529959428022417, 0.8710100865128596], [71.58970120292351, 0.10685927509954238, 0.30615539273679304], [73.37323889605783, 0.15960806050063658, 0.2500000000069297], [74.24285030777656, 0.040790068192681314, 0.25000000000011174], [77.77398270043201, 0.138064789534601, 4.709734764316468]], "peak_params_": [[7.946224583906119, 0.4558410349827753, 1.3530974767193593], [8.885246005452315, 0.6102839667741211, 0.7874842275279015], [10.400965988746819, 0.2876556312464267, 1.830698311999386], [12.740087579575414, 0.24473451045847483, 0.8918973934161651], [16.487743142907995, 0.24376705207343186, 5.697965994308328], [21.89827520793825, 0.20121453576630977, 0.5000000000000001], [24.45556696488489, 0.17526029983557123, 2.157293778246838], [41.40539182845617, 0.11157188949732522, 0.5000000000000001], [47.51539886609586, 0.14246200428082645, 0.6631016036984088], [53.18492808475435, 0.16313610466178652, 2.0590064918867284], [57.01535294907301, 0.12213942245496057, 0.5000000000000001], [58.015504789150434, 0.21820768915288724, 0.8163050286877651], [60.18955435992622, 0.16744392623396287, 0.5000000000000001], [62.27010657162294, 0.1416407560813724, 1.6094688325370279], [64.18151676398178, 0.19916927159503395, 0.5000000000000001], [65.14294543403255, 0.14063589109997565, 1.0245501928542273], [69.25688590363298, 0.18849001533872034, 1.7420201730257192], [71.58970120292351, 0.1652203036049702, 0.6123107854735861], [73.37323889605783, 0.23231532792922494, 0.5000000000138594], [74.24285030777656, 0.13248802366786983, 0.5000000000002235], [77.77398270043201, 0.13790590069835318, 9.419469528632936]], "r_squared_": 0.9856280247197174, "error_": 0.032039927844787805}
{"freq_range": [2.0, 80.0], "freq_res": 0.5, "aperiodic_params_": [-8.201936038842563, 0.9697184589409755], "gaussian_params_": [[5.781378862790054, 0.599387304463503, 0.4095367620077566], [8.51827336655855, 0.5687553647222993, 0.8010757377096378], [10.338021591565962, 0.16366455354986195, 0.5880426068676998], [11.520370828710147, 0.1636409792188373, 0.25000000000246625], [13.919454142695104, 0.19925852778978517, 0.3788020566747946], [17.447294094794216, 0.3635851849548195, 2.2464983683101445], [23.996731430305925, 0.12638428481087544, 1.7292625943406323], [39.76151788850426, 0.2515093858325881, 0.25000000000000006], [46.00638311339923, 0.10156301051968336, 1.0069214093578922], [52.95626487493545, 0.13681569397190022, 0.25000000000000006], [54.085039157286495, 0.16298107602282738, 0.25000000000000094], [59.7370649464685, 0.14715893861568524, 0.6595243964039854], [62.16848795062849, 0.22381349226295022, 0.30677384905878946], [64.48211386152818, 0.17934032762710833, 1.2015472924029986], [67.9801522798034, 0.16260171355943567, 0.7617826318125616], [70.17341118354723, 0.17994195279009323, 0.25000000000000006], [71.30469040498544, 0.10569360970639032, 0.25000000000000006], [72.32092282954906, 0.12019655410964405, 0.2500000000004693], [74.06852864669241, 0.0795794408613922, 0.3500748028609713], [77.29552739566893, 0.16529402655895475, 4.026874135817067]], "peak_params_": [[5.781378862790054, 0.5238544645009604, 0.8190735240155133], [8.51827336655855, 0.5699753735004371, 1.6021514754192756], [10.338021591565962, 0.18732831267934635, 1.1760852137353996], [11.520370828710147, 0.1978205705300926, 0.5000000000049325], [13.919454142695104, 0.3068203064989987, 0.7576041133495892], [17.447294094794216, 0.36359396428360213, 4.492996736620289], [23.996731430305925, 0.13154953570534822, 3.4585251886812647], [39.76151788850426, 0.15957125785564763, 0.5000000000000001], [46.00638311339923, 0.10156096983843277, 2.0138428187157844], [52.95626487493545, 0.13475130223409515, 0.5000000000000001], [54.085039157286495, 0.15384211244007062, 0.5000000000000019], [59.7370649464685, 0.13799544247828344, 1.3190487928079708], [62.16848795062849, 0.21424349347719662, 0.6135476981175789], [64.48211386152818, 0.1803863993960828, 2.4030945848059972], [67.9801522798034, 0.17652673419173048, 1.5235652636251231], [70.17341118354723, 0.1783346120777729, 0.5000000000000001], [71.30469040498544, 0.13712545435061507, 0.5000000000000001], [72.32092282954906, 0.1743418850219367, 0.5000000000009386], [74.06852864669241, 0.1963250237136247, 0.7001496057219426], [77.29552739566893, 0.16508107471552336, 8.053748271634134]], "r_squared_": 0.9879283059553348, "error_": 0.033174078030454975}
{"freq_range": [2.0, 80.0], "freq_res": 0.5, "aperiodic_params_": [-7.450959789401247, 0.9983338810448426], "gaussian_params_": [[8.652961294556077, 0.7522905649530583, 0.9704535228603617], [16.721663428313207, 0.26986293670591904, 3.304986383799662], [24.285019205174553, 0.1704909052099987, 1.0456615487169472], [25.753821262917196, 0.22622382590080262, 0.25000000261091104], [53.224251230805514, 0.15295089074727017, 1.4451744835692055], [58.09801655667644, 0.1880257011643614, 0.3224330479691759], [60.132124585249606, 0.2568006872639262, 0.3419328040544606], [62.92832758909036, 0.1593574804306404, 1.3786671156384143], [65.18590484871528, 0.18213623075634078, 0.5496700590813892], [68.23176632018173, 0.17177381760670413, 0.5138754053393899], [70.413482532139, 0.12037470744091354, 1.4090578740633013], [73.46099722433792, 0.1282642745488523, 0.39957644947585835], [77.43339701308797, 0.1965360964970601, 4.057243333828566]], "peak_params_": [[8.652961294556077, 0.7552312628221074, 1.9409070457207234], [16.721663428313207, 0.26925665608961147, 6.609972767599324], [24.285019205174553, 0.18384460889290288, 2.0913230974338943], [25.753821262917196, 0.18897546554664757, 0.5000000052218221], [53.224251230805514, 0.15112052100112017, 2.890348967138411], [58.09801655667644, 0.1804557260321218, 0.6448660959383518], [60.132124585249606, 0.2550492231335646, 0.6838656081089212], [62.92832758909036, 0.15956048121505084, 2.7573342312768285], [65.18590484871528, 0.2254114096773847, 1.0993401181627784], [68.23176632018173, 0.19627810706919568, 1.0277508106787798], [70.413482532139, 0.16579372573216666, 2.8181157481266026], [73.46099722433792, 0.2614273194655077, 0.7991528989517167], [77.43339701308797, 0.19651000445859168, 8.114486667657133]], "r_squared_": 0.9823984656654414, "error_": 0.03863518694688357}
{"freq_range": [2.0, 80.0], "freq_res": 0.5, "aperiodic_params_": [-8.031656151600934, 0.7368247874126159], "gaussian_params_": [[5.857136978048343, 0.5709601831549981, 0.46757968177253006], [8.288697705781017, 0.342927937884868, 0.9537796537590078], [11.83415455775741, 0.2333020048652319, 0.9702301277172992], [14.783260695508714, 0.3581779301856693, 0.6494584904860092], [16.526660814059692, 0.2663614837961357, 0.32141747852641556], [18.197598907556213, 0.24336507153659243, 1.1141604421482145], [20.72921728320492, 0.23424916026581602, 1.0502208754500684], [21.850503138252655, 0.283203408885886, 0.25000000000000006], [24.243797397654163, 0.1806786385621682, 0.7964778374471129], [39.93515616718862, 0.1344068068187433, 0.25000000000000006], [43.839530342496516, 0.09789887993201785, 3.4319558709272036], [62.04796540086405, 0.10422149265478799, 5.999999999999999], [62.360535707258315, 0.23247349343696455, 0.25000000000000006], [74.39790429637436, 0.1568677843907403, 0.3099936094477126]], "peak_params_": [[5.857136978048343, 0.564190440912089, 0.9351593635450601], [8.288697705781017, 0.3352509956608518, 1.9075593075180155], [11.83415455775741, 0.2301320316186235, 1.9404602554345984], [14.783260695508714, 0.3438785708953205, 1.2989169809720185], [16.526660814059692, 0.3526378754137607, 0.6428349570528311], [18.197598907556213, 0.24757902641753482, 2.228320884296429], [20.72921728320492, 0.2575099064157591, 2.1004417509001367], [21.850503138252655, 0.353626207971967, 0.5000000000000001], [24.243797397654163, 0.17424432552376246, 1.5929556748942257], [39.93515616718862, 0.18244173692142596, 0.5000000000000001], [43.839530342496516, 0.09892224536050165, 6.863911741854407], [62.04796540086405, 0.18639629440417416, 11.999999999999998], [62.360535707258315, 0.3029001173859296, 0.5000000000000001], [74.39790429637436, 0.16068419761832686, 0.6199872188954252]], "r_squared_": 0.9702050301136002, "error_": 0.04305199207103802}
{"freq_range": [2.0, 80.0], "freq_res": 0.5, "aperiodic_params_": [-7.825835055635213, 1.1263632152122722], "gaussian_params_": [[5.767693703700413, 0.8874971102491166, 0.4785874432213511], [8.4951790328506, 0.6424606573820906, 1.0412614861604703], [11.478222864071718, 0.28116853396083796, 0.4425393081942105], [13.83409554667853, 0.2240430070018776, 0.327044287108075], [17.479640074316936, 0.5120338930356407, 2.544872074775144], [24.4269341554313, 0.18021565897736985, 1.0043535513896549], [39.82202967159172, 0.17224843722119965, 0.25000000000000006], [46.66042637592853, 0.17806142200708341, 0.2772402275906188], [52.82734603885246, 0.10382536932547222, 0.5989883790894468], [56.83050640920725, 0.18740035106851224, 0.3791274511056259], [59.80398781212361, 0.19678922450228906, 0.46759492531496477], [62.12360588313384, 0.17917805519954882, 0.3991153742467075], [64.16247565319001, 0.13517376816626564, 0.7864422139252311], [66.00252237984817, 0.12145284122464964, 0.5245510606206869], [67.70592882631382, 0.10505054339907366, 0.3469784298203913], [68.82910366571524, 0.14709101590500231, 0.25000000000000006], [75.46148964411091, 0.18302296098817905, 4.528551770377321]], "peak_params_": [[5.767693703700413, 0.8252727772575428, 0.9571748864427022], [8.4951790328506, 0.6434670855318689, 2.0825229723209406], [11.478222864071718, 0.32320897502116885, 0.885078616388421], [13.83409554667853, 0.39805644793200123, 0.65408857421615], [17.479640074316936, 0.5120175066940185, 5.089744149550288], [24.4269341554313, 0.19113664443073475, 2.0087071027793097], [39.82202967159172, 0.13369356258803933, 0.5000000000000001], [46.66042637592853, 0.15061213610906243, 0.5544804551812376], [52.82734603885246, 0.0996014587172187, 1.1979767581788936], [56.83050640920725, 0.1696233700181793, 0.7582549022112518], [59.80398781212361, 0.18077571023796146, 0.9351898506299295], [62.12360588313384, 0.17608166047852514, 0.798230748493415], [64.16247565319001, 0.13984492123727676, 1.5728844278504621], [66.00252237984817, 0.15090716187526354, 1.0491021212413738], [67.70592882631382, 0.1291932199582444, 0.6939568596407826], [68.82910366571524, 0.18267795310061707, 0.5000000000000001], [75.46148964411091, 0.18301634333320926, 9.057103540754643]], "r_squared_": 0.9929619809733562, "error_": 0.03224690271799875}
{"freq_range": [2.0, 80.0], "freq_res": 0.5, "aperiodic_params_": [-8.727061438704705, 0.7522590057389648], "gaussian_params_": [[2.279558752427265, 0.2511322621537917, 0.40515068819477495], [5.985093312656941, 0.20487566124368775, 0.3688786038901551], [8.499378620816708, 0.40145488888633657, 0.8441889046755999], [10.710777037919732, 0.10401719668369179, 0.6114994843139674], [14.933756176860593, 0.13029521301565172, 1.114384029896858], [16.599486523768462, 0.19152152233428693, 0.3061172900459696], [18.168669297523817, 0.2865820280683335, 0.5051034239093956], [22.110392585295717, 0.1940605130573846, 2.275901993110162], [38.57162237290133, 0.10791515660018891, 0.8964711410101719], [39.801930933876605, 0.176158659717342, 0.2923673538185734], [54.13317357919279, 0.1299400326825176, 0.25000000000000006], [61.773982700405114, 0.08802528555767805, 3.2621558510161313], [62.25402605984547, 0.2345629149222978, 0.25000009754970337], [69.66409583149151, 0.09848736945248227, 1.239154976223777], [72.1162903031337, 0.07348046892667935, 0.6223662004469176], [74.37064616327585, 0.1888812148841855, 0.3283068404216747], [76.07088540892929, 0.1403197772926373, 0.39599954675915267]], "peak_params_": [[2.279558752427265, 0.21657978554207347, 0.8103013763895499], [5.985093312656941, 0.209722591175181, 0.7377572077803102], [8.499378620816708, 0.40160574555726214, 1.6883778093511999], [10.710777037919732, 0.12228032463645633, 1.2229989686279348], [14.933756176860593, 0.13153921512354927, 2.228768059793716], [16.599486523768462, 0.2407165219462879, 0.6122345800919392], [18.168669297523817, 0.3119917656952964, 1.010206847818791], [22.110392585295717, 0.1938323612071855, 4.551803986220324], [38.57162237290133, 0.10758000246084265, 1.7929422820203438], [39.801930933876605, 0.17036223207800383, 0.5847347076371469], [54.13317357919279, 0.1178973924210478, 0.5000000000000001], [61.773982700405114, 0.22779297229113027, 6.5243117020322625], [62.25402605984547, 0.23043263616971466, 0.5000001950994067], [69.66409583149151, 0.10296648797787711, 2.478309952447554], [72.1162903031337, 0.08951831516351305, 1.2447324008938352], [74.37064616327585, 0.1749688063273389, 0.6566136808433494], [76.07088540892929, 0.1380971876321091, 0.7919990935183053]], "r_squared_": 0.9769043982641145, "error_": 0.037154185478568566}
{"freq_range": [2.0, 80.0], "freq_res": 0.5, "aperiodic_params_": [-7.290494467866657, 1.0579480989741954], "gaussian_params_": [[8.631897260978192, 0.7685144381869928, 1.0204306431098478], [14.016931070663901, 0.21549551668567238, 0.8383569962654878], [15.917533397809919, 0.3418365183445448, 0.4017145722411605], [16.726017305900246, 0.14885674201669644, 0.25000000000000006], [18.52760742525456, 0.3529945919776003, 1.1227147642303306], [23.331854761931694, 0.14979207844527043, 0.932193946426366], [25.60753227279104, 0.1875884081517882, 0.9372979069644795], [46.65681074395584, 0.11344246978709903, 0.7736272492407662], [51.08011393813853, 0.07872111451510616, 0.34279130963515714], [53.16744485403114, 0.12731988129382388, 1.6751398609339856], [58.133393842309786, 0.1830300793912462, 0.25000000000000006], [60.16745848107775, 0.2322399485575744, 0.3152836574517799], [62.58226168249683, 0.07130181105222765, 0.8324862399467434], [65.31490930493592, 0.13561142681117402, 0.25000000000000006], [70.54796540086404, 0.20747242553244297, 5.999999999999999]], "peak_params_": [[8.631897260978192, 0.7621213028570821, 2.0408612862196955], [14.016931070663901, 0.21556001199009067, 1.6767139925309755], [15.917533397809919, 0.37803933812040924, 0.803429144482321], [16.726017305900246, 0.29019041233095955, 0.5000000000000001], [18.52760742525456, 0.35288823977442263, 2.245429528460661], [23.331854761931694, 0.1623686787691323, 1.864387892852732], [25.60753227279104, 0.19637665101812374, 1.874595813928959], [46.65681074395584, 0.11124944864265984, 1.5472544984815324], [51.08011393813853, 0.1327548323113863, 0.6855826192703143], [53.16744485403114, 0.12956652169341076, 3.350279721867971], [58.133393842309786, 0.18402320469001765, 0.5000000000000001], [60.16745848107775, 0.2465431528936204, 0.6305673149035598], [62.58226168249683, 0.15534202037383338, 1.6649724798934868], [65.31490930493592, 0.24888792713190888, 0.5000000000000001], [70.54796540086404, 0.20746579608845117, 11.999999999999998]], "r_squared_": 0.9781279763061174, "error_": 0.04505907717875429}
{"freq_range": [2.0, 80.0], "freq_res": 0.5, "aperiodic_params_": [-7.307700520277058, 1.0557700714099898], "gaussian_params_": [[8.568277078483286, 0.7911913813893194, 0.8456018898343217], [10.1536535613101, 0.145430925221864, 0.25000000000000006], [10.958580300049503, 0.25491278962263664, 0.38817686576629884], [13.196210728158666, 0.2650974474565776, 0.25000000000000006], [14.126503924795934, 0.18781848925087147, 0.25000000000000006], [16.07304029931553, 0.34758090788544665, 0.9319552520091864], [17.857427562538756, 0.2013765355153778, 0.25000000000000006], [18.933919078412647, 0.3038465371693061, 0.7779081074596311], [24.063081419023924, 0.17254777369239752, 1.6053231887189277], [25.732895146261473, 0.18151510778866542, 0.25000000000000006], [46.827130519792014, 0.11951990404228764, 0.7399929533326148], [51.10944026854043, 0.10740182039763507, 0.25000000000000006], [53.34373626330998, 0.1484064343774163, 1.231510271147936], [57.98815737773889, 0.13296769397896888, 0.34249735560973954], [60.07685714928441, 0.2515700460768481, 0.3918137165645823], [63.23503130575695, 0.14545522632119656, 1.3202153372098047], [65.30341367694764, 0.20734835854118613, 0.27873279587583344], [68.11388802726061, 0.1904547985617786, 0.45489150799349204], [69.29431372048637, 0.10116808949756335, 0.33146727970639345], [70.96524367835653, 0.06490317466639209, 0.25000000000000006], [76.00622173854703, 0.20270343116916528, 4.948920254825627]], "peak_params_": [[8.568277078483286, 0.7886164730667202, 1.6912037796686434], [10.1536535613101, 0.3211879212513651, 0.5000000000000001], [10.958580300049503, 0.26660018758663817, 0.7763537315325977], [13.196210728158666, 0.19634838023721812, 0.5000000000000001], [14.126503924795934, 0.19604093411735235, 0.5000000000000001], [16.07304029931553, 0.3467632785554766, 1.8639105040183728], [17.857427562538756, 0.36008456254798205, 0.5000000000000001], [18.933919078412647, 0.30645881925597607, 1.5558162149192623], [24.063081419023924, 0.17241460901454353, 3.2106463774378553], [25.732895146261473, 0.2332081546573228, 0.5000000000000001], [46.827130519792014, 0.11630295376044764, 1.4799859066652297], [51.10944026854043, 0.12185286752775859, 0.5000000000000001], [53.34373626330998, 0.14722306376905792, 2.463020542295872], [57.98815737773889, 0.13333175467164793, 0.6849947112194791], [60.07685714928441, 0.2550872921453049, 0.7836274331291646], [63.23503130575695, 0.1495813218819837, 2.6404306744196093], [65.30341367694764, 0.2163713793810409, 0.5574655917516669], [68.11388802726061, 0.23961409619795404, 0.9097830159869841], [69.29431372048637, 0.17070526858054968, 0.6629345594127869], [70.96524367835653, 0.18580152571610142, 0.5000000000000001], [76.00622173854703, 0.2027032709798533, 9.897840509651253]], "r_squared_": 0.9887168940922774, "error_": 0.031333666773347923}
{"freq_range": [2.0, 80.0], "freq_res": 0.5, "aperiodic_params_": [-7.644644515091722, 0.9094047006413257], "gaussian_params_": [[8.366216388056651, 0.5135135013513141, 0.7760137186341204], [10.694751278848699, 0.18505488340188764, 1.7365333584711966], [15.653897848130093, 0.30354337243681556, 1.369444214215902], [18.14266242018813, 0.25613073837143585, 0.3286748100463114], [19.23330781365187, 0.38530222903685396, 0.26036982186424007], [20.235506476758143, 0.2581812150059017, 0.25001965617152955], [21.232854111734305, 0.36574904625866883, 0.25005974748333987], [22.08645013344286, 0.3212018242414843, 0.28284575264752315], [23.322363271069133, 0.3122127066463489, 0.25000000000000006], [24.23189861198791, 0.2618646498798071, 0.25000000000000006], [25.25001926576744, 0.21733471696600853, 0.4658259227390244], [27.3371039633797, 0.16650725075742184, 0.25000000000000006], [37.21009565055548, 0.17332487376602151, 0.25000000000000006], [39.87258402980723, 0.11634699698515043, 0.25000000000000006], [44.77398270043202, 0.09690454049962423, 2.5243089132057017], [52.944950882645685, 0.13333060074039138, 0.25000000000000006], [57.330150563034366, 0.1972332017363325, 0.3519247043388943], [59.70922818969455, 0.23803925476395607, 0.342842747941614], [62.41787802586625, 0.22084591153116517, 0.25000000000000006], [68.96724546289195, 0.08770464704579649, 3.461286646366595], [78.2193411021631, 0.18113894503276504, 0.25000000000000006]], "peak_params_": [[8.366216388056651, 0.5891992642996842, 1.5520274372682408], [10.694751278848699, 0.195865452050775, 3.473066716942393], [15.653897848130093, 0.3056559127105576, 2.738888428431804], [18.14266242018813, 0.3031039956184163, 0.6573496200926228], [19.23330781365187, 0.28177080413393973, 0.5207396437284801], [20.235506476758143, 0.17269569951070451, 0.5000393123430591], [21.232854111734305, 0.23983509859014163, 0.5001194949666797], [22.08645013344286, 0.3098577869265764, 0.5656915052950463], [23.322363271069133, 0.24635314594453916, 0.5000000000000001], [24.23189861198791, 0.18417038034304234, 0.5000000000000001], [25.25001926576744, 0.18818981324987938, 0.9316518454780488], [27.3371039633797, 0.1346625165008124, 0.5000000000000001], [37.21009565055548, 0.12260433849580288, 0.5000000000000001], [39.87258402980723, 0.1183824718303299, 0.5000000000000001], [44.77398270043202, 0.09651688819332449, 5.048617826411403], [52.944950882645685, 0.13061827279739902, 0.5000000000000001], [57.330150563034366, 0.1759125291814616, 0.7038494086777886], [59.70922818969455, 0.1996768135340119, 0.685685495883228], [62.41787802586625, 0.22455519660952383, 0.5000000000000001], [68.96724546289195, 0.08770072013816765, 6.92257329273319], [78.2193411021631, 0.12618236762155277, 0.5000000000000001]], "r_squared_": 0.9840259480877925, "error_": 0.033779587744661735}
{"freq_range": [2.0, 80.0], "freq_res": 0.5, "aperiodic_params_": [-7.638487538519302, 0.7035706745435951], "gaussian_params_": [[5.880738470620879, 0.7482494768859956, 0.49480643063715113], [8.399881623189655, 0.4572780859739108, 0.9889454804296554], [11.591172073444945, 0.2593328234120295, 0.39759429046643197], [14.470290280614993, 0.1766711760075135, 0.5355263752262102], [15.452034599141776, 0.28736673396516854, 2.2809001744989628], [19.574723391892135, 0.2976702120700504, 2.290583501088543], [21.93953489511242, 0.20488018171966432, 0.25000000000000006], [24.3121892381699, 0.17176442387030852, 0.8386830916983331], [62.34751516905456, 0.2846223886748406, 0.40155037865843207]], "peak_params_": [[5.880738470620879, 0.7509482770265352, 0.9896128612743023], [8.399881623189655, 0.4577054545671082, 1.9778909608593107], [11.591172073444945, 0.3206114258572441, 0.7951885809328639], [14.470290280614993, 0.46537375755456534, 1.0710527504524203], [15.452034599141776, 0.37629708795692807, 4.5618003489979255], [19.574723391892135, 0.3570096462753405, 4.581167002177086], [21.93953489511242, 0.37742224548100545, 0.5000000000000001], [24.3121892381699, 0.197116992934955, 1.6773661833966662], [62.34751516905456, 0.26482309331612086, 0.8031007573168641]], "r_squared_": 0.9734843335404477, "error_": 0.04658190448785938}
{"freq_range": [2.0, 80.0], "freq_res": 0.5, "aperiodic_params_": [-7.3213098842322655, 1.0150472953122667], "gaussian_params_": [[5.812596118164, 0.9763849372832497, 0.5131866441572372], [8.408172269799975, 0.6210607817770067, 0.9692384126621699], [11.51977692607262, 0.2375456806012297, 0.36275635017766494], [16.970657091066716, 0.5591525171556317, 3.7278541065342594], [62.319355712100155, 0.23379081944564287, 0.4285564183421423]], "peak_params_": [[5.812596118164, 0.9491209428458323, 1.0263732883144745], [8.408172269799975, 0.660582899158161, 1.9384768253243398], [11.51977692607262, 0.4315215566485735, 0.7255127003553299], [16.970657091066716, 0.5591351957920221, 7.455708213068519], [62.319355712100155, 0.21391698657596514, 0.8571128366842846]], "r_squared_": 0.9841311139427913, "error_": 0.054403119441047976}
{"freq_range": [2.0, 80.0], "freq_res": 0.5, "aperiodic_params_": [-7.0753316929659995, 1.2618374940258146], "gaussian_params_": [[5.757372966676406, 0.7831967253049509, 0.46457966086610863], [8.31082439190368, 0.636521933332222, 0.9052770286427949], [11.468923352112881, 0.1902059882333874, 0.4460079073006215], [14.038968661692348, 0.08159650958146869, 0.3515282384689671], [17.39577416375825, 0.37674928000011976, 2.7135198788493584], [19.64350885989979, 0.09843928720032374, 0.25000000000000006], [24.678314561778713, 0.19102992009290853, 0.49579673532869867], [47.48984724507483, 0.13251627588908496, 0.2890630066369682], [57.16808455184567, 0.2162766549070337, 0.46254498449591425], [59.47705753334805, 0.19572354030663475, 0.43711026793354146], [61.964858887279924, 0.16009128183218893, 0.6540086019496358], [66.29503173221495, 0.08911528982856437, 0.9155634321944317], [69.127538431832, 0.2185637065983776, 0.5023985893048251], [71.63235631161687, 0.21341141528388383, 0.5301162200253521], [75.16898206443734, 0.21226626976737192, 1.3839530395573132], [78.53733797315003, 0.1202111371266665, 0.34802209349378865]], "peak_params_": [[5.757372966676406, 0.7078942382787945, 0.9291593217322173], [8.31082439190368, 0.6245216410747378, 1.8105540572855898], [11.468923352112881, 0.22658827111426838, 0.892015814601243], [14.038968661692348, 0.2532773485535884, 0.7030564769379342], [17.39577416375825, 0.37647147054253516, 5.427039757698717], [19.64350885989979, 0.362402291945056, 0.5000000000000001], [24.678314561778713, 0.19130227029944002, 0.9915934706573973], [47.48984724507483, 0.13243456346972948, 0.5781260132739364], [57.16808455184567, 0.20245792667004459, 0.9250899689918285], [59.47705753334805, 0.195586599766445, 0.8742205358670829], [61.964858887279924, 0.1598618423567597, 1.3080172038992717], [66.29503173221495, 0.08691013617928078, 1.8311268643888634], [69.127538431832, 0.21277841808219478, 1.0047971786096501], [71.63235631161687, 0.2131853452449448, 1.0602324400507042], [75.16898206443734, 0.21068985053383216, 2.7679060791146264], [78.53733797315003, 0.1312412105153129, 0.6960441869875773]], "r_squared_": 0.9919359334046454, "error_": 0.03584844397308871}
{"freq_range": [2.0, 80.0], "freq_res": 0.5, "aperiodic_params_": [-7.637679396285858, 1.0595640903446586], "gaussian_params_": [[5.751990469246476, 0.49895584003989396, 0.46622452941164844], [8.223975347953756, 0.7129008150171449, 0.7969778738499224], [17.49122830592618, 0.30995246169101953, 2.6813023698043748], [20.21406542900689, 0.0689769784462814, 0.25001642750283803], [22.34249020208873, 0.18949041570033506, 1.0421987515665974], [24.92876861206466, 0.20639123490957884, 0.44870691961798426], [35.772360312421306, 0.1275081623590901, 1.4765948242795326], [72.31119154175427, 0.20836486870074938, 0.250000000297305], [75.54567467576933, 0.18331944230736963, 0.839916763738322], [78.5426546795744, 0.14969012210788493, 0.6844972215084199]], "peak_params_": [[5.751990469246476, 0.44768360958664033, 0.9324490588232969], [8.223975347953756, 0.6858914457535077, 1.5939557476998447], [17.49122830592618, 0.3099546895546794, 5.3626047396087495], [20.21406542900689, 0.2630410789079516, 0.5000328550056761], [22.34249020208873, 0.24148225272304913, 2.0843975031331947], [24.92876861206466, 0.21728940023800725, 0.8974138392359685], [35.772360312421306, 0.1260018905159317, 2.953189648559065], [72.31119154175427, 0.15691954401288122, 0.50000000059461], [75.54567467576933, 0.18305625461173136, 1.679833527476644], [78.5426546795744, 0.14977702208151022, 1.3689944430168397]], "r_squared_": 0.9851441858863483, "error_": 0.04300877613155096}
{"freq_range": [2.0, 80.0], "freq_res": 0.5, "aperiodic_params_": [-8.237876214981203, 0.8614823253085839], "gaussian_params_": [[8.160036713969193, 0.6906405417801301, 0.6910473861479339], [17.672828959447326, 0.2682069072500453, 3.441279064113031], [23.78447049876481, 0.19033800330759645, 1.6785628873751424], [57.135477601966194, 0.12750196379151943, 2.1404056216720746], [68.86643540478931, 0.19265341453108817, 0.25000000000000006], [72.38629321433338, 0.1868173202439423, 0.25000000000000006], [76.40747672000427, 0.11005196068799857, 1.1185954184924647], [78.63166814070723, 0.16737075626754502, 0.2500000000008206]], "peak_params_": [[8.160036713969193, 0.677528814662697, 1.3820947722958679], [17.672828959447326, 0.26804095111114634, 6.882558128226062], [23.78447049876481, 0.2382527571666877, 3.3571257747502847], [57.135477601966194, 0.12724681424043816, 4.280811243344149], [68.86643540478931, 0.16703058657464354, 0.5000000000000001], [72.38629321433338, 0.16870636992771004, 0.5000000000000001], [76.40747672000427, 0.10967613959239308, 2.2371908369849294], [78.63166814070723, 0.16482542052702165, 0.5000000000016412]], "r_squared_": 0.9692257356869522, "error_": 0.050343711407022776}
{"freq_range": [2.0, 80.0], "freq_res": 0.5, "aperiodic_params_": [-8.705250292971739, 0.9127767462557105], "gaussian_params_": [[5.781227047709361, 0.2827202038161953, 0.269327514595789], [8.156099428275354, 0.4282471174514288, 0.576935864104096], [10.744418474391592, 0.1162428415535773, 1.640943913869198], [16.204748745006242, 0.21715549424826971, 1.0500937028196404], [19.024108898150683, 0.2193139661773419, 0.4400191852836703], [21.762629558582827, 0.18254854261481135, 1.0814808053168858], [24.029465684386672, 0.17838386958919597, 0.39614623567643165], [25.24476251841901, 0.24342853283155408, 0.25000000000000006], [38.81412220030508, 0.1760275266850215, 0.25000000000000006], [39.75371147393127, 0.23572242375493696, 0.25000000000000006], [43.204561904845576, 0.09496788634754885, 1.0957321314589186], [47.63963372347763, 0.14007213266628732, 0.4266548795494569], [49.14891417800982, 0.15826123980337534, 0.2960502512460542], [56.036393272641014, 0.1456053165255403, 0.25000000000000006], [57.31084057307528, 0.2790009771925382, 0.41415366762738937], [59.09384844329845, 0.12679898280949847, 0.4898759432002948], [61.34684460289169, 0.1676126325014755, 0.9805801925249368], [62.411634290400876, 0.10494341043239355, 0.2920352910038052], [69.20916985823101, 0.3034457766164171, 0.25000000000000006], [71.34781092460366, 0.2541635270600422, 0.25000000000000006], [72.33720653058454, 0.22167768797527404, 0.25000000000000006], [74.65525708522149, 0.15570712942783146, 0.46151887300209915], [77.65234711520964, 0.10930594660729458, 1.0503844276628749]], "peak_params_": [[5.781227047709361, 0.205448463668235, 0.538655029191578], [8.156099428275354, 0.44156161346162826, 1.153871728208192], [10.744418474391592, 0.11507215295389273, 3.281887827738396], [16.204748745006242, 0.21375523929094875, 2.100187405639281], [19.024108898150683, 0.2322565431114363, 0.8800383705673406], [21.762629558582827, 0.1782044096041968, 2.1629616106337717], [24.029465684386672, 0.19937041722522153, 0.7922924713528633], [25.24476251841901, 0.16167909725408158, 0.5000000000000001], [38.81412220030508, 0.13608253612729904, 0.5000000000000001], [39.75371147393127, 0.14641665652825608, 0.5000000000000001], [43.204561904845576, 0.09332726304959493, 2.191464262917837], [47.63963372347763, 0.1328116857348487, 0.8533097590989138], [49.14891417800982, 0.14032349520525322, 0.5921005024921084], [56.036393272641014, 0.14593386393114294, 0.5000000000000001], [57.31084057307528, 0.25207992371971777, 0.8283073352547787], [59.09384844329845, 0.13412218038439505, 0.9797518864005896], [61.34684460289169, 0.16638469812400558, 1.9611603850498736], [62.411634290400876, 0.1841936839533176, 0.5840705820076104], [69.20916985823101, 0.2138311527082326, 0.5000000000000001], [71.34781092460366, 0.21198846002493887, 0.5000000000000001], [72.33720653058454, 0.17933668447533613, 0.5000000000000001], [74.65525708522149, 0.14835136888721046, 0.9230377460041983], [77.65234711520964, 0.10816226961672548, 2.1007688553257498]], "r_squared_": 0.9866850803336132, "error_": 0.025944213679126964}
{"freq_range": [2.0, 80.0], "freq_res": 0.5, "aperiodic_params_": [-7.647018222339701, 1.1449048737824519], "gaussian_params_": [[8.550032238909289, 0.7758369477582624, 0.9305074225149053], [13.972637534223669, 0.159493675670762, 0.5683721506361854], [16.103756276940256, 0.25342880340453566, 0.6138794064851703], [16.994523581772363, 0.1500345448894403, 5.999999999999999], [18.610612644764796, 0.1997830030819315, 0.5338822342983585], [65.36331724746657, 0.16940127848649134, 0.5689974099340531], [67.81658430949388, 0.16853583837415081, 0.3497445590979423], [75.46104414929951, 0.16858888160751825, 5.999999999999999]], "peak_params_": [[8.550032238909289, 0.8297907079832081, 1.8610148450298105], [13.972637534223669, 0.2924882757857219, 1.1367443012723708], [16.103756276940256, 0.3980989459201414, 1.2277588129703405], [16.994523581772363, 0.23944293796512994, 11.999999999999998], [18.610612644764796, 0.34105050677248094, 1.067764468596717], [65.36331724746657, 0.20707801812139692, 1.1379948198681062], [67.81658430949388, 0.2246996175778957, 0.6994891181958846], [75.46104414929951, 0.1685853282636156, 11.999999999999998]], "r_squared_": 0.9811864865948037, "error_": 0.052255706936611676}
{"freq_range": [2.0, 80.0], "freq_res": 0.5, "aperiodic_params_": [-7.618006394282251, 1.0137313501020375], "gaussian_params_": [[5.735084826081469, 0.29588358907177353, 0.34192002333595745], [8.583554653097263, 0.7931381476110158, 0.9055742570766165], [13.95907720226287, 0.22463543192479293, 0.59926746273559], [16.01883418580171, 0.34304667995401794, 0.6517188148545432], [18.386491215607208, 0.3509950825403304, 1.1399939496502347], [23.590880719946867, 0.1478303638039204, 1.285807006490795], [25.73175191180284, 0.1570254751163758, 0.3973482345253628], [51.21088398644718, 0.07964699210155321, 0.5555765456932255], [52.616493375726954, 0.09629700221013492, 3.0894780647537448], [58.185541920579176, 0.1806853062694478, 0.25000000000000006], [60.19336001995529, 0.2888660183319101, 0.25000000000000006], [62.59127719789275, 0.10766378046503129, 0.8609711208299454], [65.50819203312189, 0.09959679067500488, 0.25000000000000006], [70.54796540086404, 0.21278526516169674, 5.999999999999999]], "peak_params_": [[5.735084826081469, 0.23600729993386516, 0.6838400466719149], [8.583554653097263, 0.7897692484971586, 1.811148514153233], [13.95907720226287, 0.22715535867636305, 1.19853492547118], [16.01883418580171, 0.38281858811688885, 1.3034376297090864], [18.386491215607208, 0.34956214270544095, 2.2799878993004694], [23.590880719946867, 0.1474765978733128, 2.57161401298159], [25.73175191180284, 0.18156249598013474, 0.7946964690507256], [51.21088398644718, 0.15914351984027952, 1.111153091386451], [52.616493375726954, 0.10393231683088189, 6.1789561295074895], [58.185541920579176, 0.18217692654230966, 0.5000000000000001], [60.19336001995529, 0.2662659021914102, 0.5000000000000001], [62.59127719789275, 0.194185982396208, 1.7219422416598908], [65.50819203312189, 0.24927842305624637, 0.5000000000000001], [70.54796540086404, 0.21277847105569236, 11.999999999999998]], "r_squared_": 0.9796095948517041, "error_": 0.04170467940910583}
{"freq_range": [2.0, 80.0], "freq_res": 0.5, "aperiodic_params_": [-7.794289620822258, 1.0142432810827324], "gaussian_params_": [[8.470077365275873, 0.7243805314311739, 0.8239238782073632], [15.332533211216118, 0.4001773217765907, 4.804396719544272], [24.299082857729495, 0.18381321962202457, 1.3374687828041463], [24.82067308472317, 0.029421086020488044, 0.25000000000000006], [25.517082145060385, 0.1229743376090012, 0.25000374076217247], [58.12922809897899, 0.16792925109732287, 0.25000000000000006], [60.16110012185079, 0.18923215851861716, 0.28261419468753807], [62.47373722177555, 0.2051881457023194, 0.9610449940726835], [65.12244886640727, 0.24427479850112072, 0.591371973141866], [68.14949301513244, 0.18839478229875295, 0.6844596016161144], [73.65378972358332, 0.16976914053618625, 2.7941532083365725], [76.44840645710929, 0.1231436695491456, 0.25000000000000006], [79.0338211661087, 0.13785965485083745, 1.4421401253681447]], "peak_params_": [[8.470077365275873, 0.8694740130831633, 1.6478477564147265], [15.332533211216118, 0.399934286062944, 9.608793439088544], [24.299082857729495, 0.2595124047786488, 2.6749375656082925], [24.82067308472317, 0.25030700086369784, 0.5000000000000001], [25.517082145060385, 0.2888823219549028, 0.5000074815243449], [58.12922809897899, 0.14693219800411583, 0.5000000000000001], [60.16110012185079, 0.16832832712711365, 0.5652283893750761], [62.47373722177555, 0.2051834979922056, 1.922089988145367], [65.12244886640727, 0.24698332094331477, 1.182743946283732], [68.14949301513244, 0.20587389338242978, 1.3689192032322288], [73.65378972358332, 0.16959970405603286, 5.588306416673145], [76.44840645710929, 0.2510522391075476, 0.5000000000000001], [79.0338211661087, 0.1650423368367928, 2.8842802507362895]], "r_squared_": 0.9863380965779366, "error_": 0.038358312229271836}
{"freq_range": [2.0, 80.0], "freq_res": 0.5, "aperiodic_params_": [-7.584399807016957, 0.9483866737178904], "gaussian_params_": [[6.0518553883705195, 0.36960517700428364, 0.47340802944299504], [8.275230147797586, 0.7274036899340549, 0.7551194630516885], [11.29326437050425, 0.23148007112000363, 1.6765361525195155], [16.67246774619984, 0.5183497642843957, 3.386292728180441], [22.54474060790528, 0.1399590822587, 0.34533957667155807], [24.183933226688612, 0.2862039485534036, 1.6913337004439652], [27.251038290270305, 0.19094983179589078, 0.6450911008989417], [43.73249107805585, 0.2294613188855897, 0.25000000000000006]], "peak_params_": [[6.0518553883705195, 0.3803599897820771, 0.9468160588859901], [8.275230147797586, 0.7818323978196613, 1.510238926103377], [11.29326437050425, 0.3912354410750556, 3.353072305039031], [16.67246774619984, 0.5195499174263194, 6.772585456360882], [22.54474060790528, 0.4310444427064368, 0.6906791533431161], [24.183933226688612, 0.3344086774871524, 3.3826674008879305], [27.251038290270305, 0.2222437870522338, 1.2901822017978835], [43.73249107805585, 0.14890636106048305, 0.5000000000000001]], "r_squared_": 0.9871196305421426, "error_": 0.04391373172114583}
{"freq_range": [2.0, 80.0], "freq_res": 0.5, "aperiodic_params_": [-7.1593124577581415, 1.2291629297249567], "gaussian_params_": [[5.836099620319888, 0.5008696733671455, 0.3368493071783909], [8.3318609751517, 0.7587214334847578, 0.7596481718665348], [14.72115527986137, 0.4878186478435244, 4.04971694424663], [25.562927162164208, 0.34520678686162737, 5.999999999999999]], "peak_params_": [[5.836099620319888, 0.5014693927042346, 0.6736986143567818], [8.3318609751517, 0.8963188496858203, 1.5192963437330695], [14.72115527986137, 0.5501655799797049, 8.09943388849326], [25.562927162164208, 0.359310860293391, 11.999999999999998]], "r_squared_": 0.9841412325162469, "error_": 0.06015491867861476}
{"freq_range": [2.0, 80.0], "freq_res": 0.5, "aperiodic_params_": [-7.256245181504158, 1.1833232246998464], "gaussian_params_": [[5.737123694072313, 0.35263209017464603, 0.3997039090784975], [8.222750452926665, 0.8811634777985758, 0.7238108968131133], [14.264139404226242, 0.3148622036767222, 3.638878573733067], [22.89850877741951, 0.34747546270591956, 5.428793388993531], [35.271047129098505, 0.09909081928545557, 2.7589262947304047], [43.47720320315268, 0.17077716452640668, 0.2500000013756499]], "peak_params_": [[5.737123694072313, 0.31584008552048193, 0.799407818156995], [8.222750452926665, 0.9200071297446595, 1.4476217936262266], [14.264139404226242, 0.4192101122021068, 7.277757147466134], [22.89850877741951, 0.3650647478541238, 10.857586777987063], [35.271047129098505, 0.1222416061464795, 5.5178525894608095], [43.47720320315268, 0.1714873097712335, 0.5000000027512999]], "r_squared_": 0.987752466302158, "error_": 0.04717861460967735}
{"freq_range": [2.0, 80.0], "freq_res": 0.5, "aperiodic_params_": [-7.428370819945017, 0.8540406747770466], "gaussian_params_": [[6.577837306562493, 0.13861318561164937, 0.5193047556388184], [8.045935906020706, 0.135239775673635, 0.25000000000000006], [8.320993651300272, 0.5464652407548329, 0.6937500981547927], [12.800594131266832, 0.1385528241485336, 0.9133667041550184], [16.17704380494842, 0.30868487762607116, 1.2278915487423483], [18.744528027065083, 0.25979571391213463, 0.4040293299906238], [22.292025573179487, 0.30238230223636847, 2.2903840462203844], [25.232729376889434, 0.11068995845686158, 0.34935016952612175], [35.656590193642906, 0.1350437556285216, 1.8935930966374408], [42.81108946873514, 0.20129428008363137, 0.25960780777621173], [45.648108168189, 0.17736526547726672, 0.37770293733225396], [57.792930412250485, 0.1749213751654429, 0.5065272432062681], [72.33455006106026, 0.16183132087007787, 0.25000000000000006], [76.21827825280172, 0.11868213145538606, 1.1076883697206552]], "peak_params_": [[6.577837306562493, 0.15450085368478472, 1.0386095112776368], [8.045935906020706, 0.6272283047601324, 0.5000000000000001], [8.320993651300272, 0.5547109027203643, 1.3875001963095854], [12.800594131266832, 0.14622968449390683, 1.8267334083100368], [16.17704380494842, 0.31273965109958013, 2.4557830974846966], [18.744528027065083, 0.34467638128941225, 0.8080586599812476], [22.292025573179487, 0.3011388000311168, 4.580768092440769], [25.232729376889434, 0.23897970962524084, 0.6987003390522435], [35.656590193642906, 0.13458281930740412, 3.7871861932748816], [42.81108946873514, 0.15454500281373917, 0.5192156155524235], [45.648108168189, 0.16424018556286235, 0.7554058746645079], [57.792930412250485, 0.16089900319183315, 1.0130544864125361], [72.33455006106026, 0.1304281751600591, 0.5000000000000001], [76.21827825280172, 0.11640004645003366, 2.2153767394413104]], "r_squared_": 0.9780118778869341, "error_": 0.040030902146780865}
{"freq_range": [2.0, 80.0], "freq_res": 0.5, "aperiodic_params_": [-7.796008220778033, 0.8366351388012918], "gaussian_params_": [[8.174797738599397, 0.5150333581699058, 0.7005088998098421], [17.232027735070478, 0.27901251883612277, 2.9337877907398577], [23.730966378635035, 0.237164564694474, 2.01332410589642], [29.333665686359343, 0.1776637906029348, 0.25000000000000006], [34.32623016208307, 0.1623507985004063, 0.5749166491148744], [36.85294691746603, 0.17523914842551638, 0.6076555867630503], [42.76022255045175, 0.25771220600852895, 0.25000000000000006], [45.62702915889849, 0.14795352126159414, 0.2728425419927349], [56.93350008598678, 0.1271427530793717, 2.410187616004335], [63.87159782112084, 0.16857625714704275, 0.25000000026654035], [68.95105906243697, 0.14370102767672743, 0.25000000000000006], [71.80705654916267, 0.12153063506403737, 0.5716477650099822]], "peak_params_": [[8.174797738599397, 0.5012201662700217, 1.4010177996196842], [17.232027735070478, 0.27902840094733783, 5.8675755814797155], [23.730966378635035, 0.2640830007009818, 4.02664821179284], [29.333665686359343, 0.14634211340039904, 0.5000000000000001], [34.32623016208307, 0.15519910892295918, 1.1498332982297488], [36.85294691746603, 0.17018543085085547, 1.2153111735261006], [42.76022255045175, 0.16269832553582653, 0.5000000000000001], [45.62702915889849, 0.1327582402475791, 0.5456850839854698], [56.93350008598678, 0.12709436711178412, 4.82037523200867], [63.87159782112084, 0.14947392465715836, 0.5000000005330807], [68.95105906243697, 0.14097484672745786, 0.5000000000000001], [71.80705654916267, 0.11480166303308614, 1.1432955300199643]], "r_squared_": 0.9746495246259976, "error_": 0.04206524331193103}
{"freq_range": [2.0, 80.0], "freq_res": 0.5, "aperiodic_params_": [-8.280900353760247, 1.116613714885708], "gaussian_params_": [[8.23340806636467, 0.5003003853698104, 1.1683472753637736], [11.0814399662344, 0.1752828985894424, 0.8069675091844434], [15.67571288774167, 0.4199999177787991, 2.78489027431011], [59.07014955148538, 0.1362614442283715, 0.41513815663449005], [65.17805189872057, 0.07923935697514119, 5.999999999999999], [73.39330154625215, 0.13060743526977947, 0.25000000000000006], [74.43737515720544, 0.11082775360421156, 0.25000000000000006], [79.99999999999999, 0.1991778216829747, 2.1474613222846672]], "peak_params_": [[8.23340806636467, 0.49994677294081846, 2.336694550727547], [11.0814399662344, 0.3073030840501172, 1.6139350183688868], [15.67571288774167, 0.41916479770280013, 5.56978054862022], [59.07014955148538, 0.18096515850493056, 0.8302763132689801], [65.17805189872057, 0.0792044746044791, 11.999999999999998], [73.39330154625215, 0.1516601587652211, 0.5000000000000001], [74.43737515720544, 0.13860983248243564, 0.5000000000000001], [79.99999999999999, 0.20292581689096956, 4.2949226445693345]], "r_squared_": 0.9857373219875276, "error_": 0.04215178516710475}
{"freq_range": [2.0, 80.0], "freq_res": 0.5, "aperiodic_params_": [-7.66040778447576, 0.9539366377421549], "gaussian_params_": [[8.563006777885516, 0.7704971750318914, 0.9272318978044358], [10.434660680289342, 0.453070725619315, 0.5667316083954346], [12.446692487544048, 0.32065415852725837, 1.533859443380706], [16.81618678592176, 0.32194804160141727, 3.1004701171419686], [23.246714353774816, 0.14251668075494683, 0.8010090392368983], [52.832360335291554, 0.21981593186705403, 0.3212600363646238], [56.815558017554146, 0.20766305383638167, 0.25000000000000006], [68.91866394013383, 0.16017014610602254, 0.46230442745937733]], "peak_params_": [[8.563006777885516, 0.7905831913905592, 1.8544637956088716], [10.434660680289342, 0.720725442568579, 1.1334632167908691], [12.446692487544048, 0.4433156700471308, 3.067718886761412], [16.81618678592176, 0.32529564871701133, 6.200940234283937], [23.246714353774816, 0.17996875315228067, 1.6020180784737965], [52.832360335291554, 0.19183638908605438, 0.6425200727292476], [56.815558017554146, 0.15818513278885504, 0.5000000000000001], [68.91866394013383, 0.15771031477418518, 0.9246088549187547]], "r_squared_": 0.9865437774354483, "error_": 0.043618819234294955}
{"freq_range": [2.0, 80.0], "freq_res": 0.5, "aperiodic_params_": [-7.682325329706235, 1.1302253549579522], "gaussian_params_": [[8.26205689595708, 0.5002111197503658, 0.4609662952696092], [9.705786644652024, 0.5568536349911841, 1.4195547694110813], [17.374994500465156, 0.6071854946172748, 5.93770672006012]], "peak_params_": [[8.26205689595708, 1.0247317889635497, 0.9219325905392184], [9.705786644652024, 0.816595720861975, 2.8391095388221625], [17.374994500465156, 0.60705110900596, 11.87541344012024]], "r_squared_": 0.9905088254506529, "error_": 0.045966662353506965}
{"freq_range": [2.0, 80.0], "freq_res": 0.5, "aperiodic_params_": [-7.726733802871431, 0.8465208857715509], "gaussian_params_": [[6.205579866163413, 0.2502863331862104, 0.25000000000000006], [7.08153690890636, 0.1844015989061242, 0.2500000000046166], [8.851594989799013, 0.5820423202016761, 0.8213373439309002], [11.14992308671633, 0.1614543709375504, 0.4301371467345868], [15.469454958435604, 0.5663849728903829, 3.052376160473625], [21.640016565659405, 0.38756547400761276, 3.6169461783245658], [28.332733443569914, 0.21972208622468392, 1.825034430846217], [61.14890081523055, 0.18103939334945396, 0.6297051317342908], [73.68533021895463, 0.12057666816891828, 1.1840107456893163]], "peak_params_": [[6.205579866163413, 0.18454296156450845, 0.5000000000000001], [7.08153690890636, 0.2344760268424384, 0.5000000000092332], [8.851594989799013, 0.6334123618349903, 1.6426746878618004], [11.14992308671633, 0.36996142827027434, 0.8602742934691736], [15.469454958435604, 0.6581017205717394, 6.10475232094725], [21.640016565659405, 0.46792108276455124, 7.2338923566491315], [28.332733443569914, 0.28301825018249716, 3.650068861692434], [61.14890081523055, 0.17604817986430632, 1.2594102634685815], [73.68533021895463, 0.11910856342281839, 2.3680214913786326]], "r_squared_": 0.9836359327934735, "error_": 0.04492209907016947}
{"freq_range": [2.0, 80.0], "freq_res": 0.5, "aperiodic_params_": [-7.612886715434595, 1.0027646263037808], "gaussian_params_": [[8.176193178477414, 0.7775930695952613, 0.8447443991270166], [10.50751005912773, 0.2526981680625397, 0.6869199080179736], [13.310296193381761, 0.22517406673763232, 0.6051593667077203], [16.552982140475592, 0.7431768281302439, 3.5694159105341257], [24.091337422715377, 0.4832515753847487, 2.7454566651848933], [27.501242688565547, 0.26330053214951427, 1.0321560613988068], [30.565185262112795, 0.24777020665747665, 0.8680690696871801], [40.08536030768194, 0.14271924303058162, 0.3084743121888248]], "peak_params_": [[8.176193178477414, 0.8032859197463784, 1.6894887982540332], [10.50751005912773, 0.4468285236610061, 1.3738398160359473], [13.310296193381761, 0.7301871106460069, 1.2103187334154406], [16.552982140475592, 0.7536625739918534, 7.138831821068251], [24.091337422715377, 0.5681314913589386, 5.490913330369787], [27.501242688565547, 0.494111921391978, 2.0643121227976136], [30.565185262112795, 0.2829938711642388, 1.7361381393743602], [40.08536030768194, 0.13735834934887237, 0.6169486243776496]], "r_squared_": 0.9910701166691052, "error_": 0.04094389984410132}
{"freq_range": [2.0, 80.0], "freq_res": 0.5, "aperiodic_params_": [-7.1445866874678625, 1.237798659235281], "gaussian_params_": [[8.375218229619858, 0.6411850184399268, 0.9336344684542045], [14.778404156016785, 0.6840821826306333, 3.6316581276819524], [25.279516685160825, 0.7050334953001662, 4.413481396510215]], "peak_params_": [[8.375218229619858, 0.78949701976474, 1.867268936908409], [14.778404156016785, 0.7296083904666997, 7.263316255363905], [25.279516685160825, 0.7129139701035321, 8.82696279302043]], "r_squared_": 0.9842624642269285, "error_": 0.0646349596836837}
{"freq_range": [2.0, 80.0], "freq_res": 0.5, "aperiodic_params_": [-7.317963370905984, 1.2044591196066263], "gaussian_params_": [[8.20850825125922, 0.8709771868637225, 0.6986459649116978], [13.637052644406388, 0.34375410555162494, 3.36118857621327], [24.004241930146033, 0.5837163755973569, 5.7569775380322055]], "peak_params_": [[8.20850825125922, 0.9295198265395737, 1.3972919298233957], [13.637052644406388, 0.453946126771136, 6.72237715242654], [24.004241930146033, 0.5866819152724361, 11.513955076064411]], "r_squared_": 0.9887859997795815, "error_": 0.04825631142092305}
{"freq_range": [2.0, 80.0], "freq_res": 0.5, "aperiodic_params_": [-7.757106284853781, 0.7303981270200595], "gaussian_params_": [[5.856838929840832, 0.2611684292985603, 0.31914793720397727], [8.189893415509227, 0.8093689655890894, 0.7409059106314575], [13.386543485293508, 0.37095704013119285, 1.8381918345797756], [16.256866669795734, 0.41770950822967073, 0.9402478362636669], [18.88759774581551, 0.2627808942427922, 0.9697631078562714], [23.53701351678719, 0.24507325290957915, 2.6735078569948203], [27.505686894226255, 0.19560583068709814, 0.4697916663757942], [54.08968612483892, 0.18151793431870872, 0.25000000000000006], [57.21440184410166, 0.14753774578262935, 0.5681790676484201], [58.96651946749471, 0.24289807178111855, 0.3126364343053702], [64.77666803185339, 0.15671438446036212, 1.2635014715729063], [71.79695814784466, 0.22650466112088424, 0.5502485445766553], [74.81250753815475, 0.1617230427084421, 0.9271964023541404], [77.16579374305756, 0.20968530883031072, 0.25000000000000006], [78.68853614005062, 0.23148305126299695, 0.25000000000000006]], "peak_params_": [[5.856838929840832, 0.2465460335042664, 0.6382958744079545], [8.189893415509227, 0.7882837291008213, 1.481811821262915], [13.386543485293508, 0.3761405748503197, 3.6763836691595513], [16.256866669795734, 0.5127150658215172, 1.8804956725273339], [18.88759774581551, 0.32851496621724685, 1.9395262157125428], [23.53701351678719, 0.24505308283822558, 5.347015713989641], [27.505686894226255, 0.27728097124950857, 0.9395833327515885], [54.08968612483892, 0.17020536712200318, 0.5000000000000001], [57.21440184410166, 0.13739883443687262, 1.1363581352968402], [58.96651946749471, 0.2425712483491207, 0.6252728686107404], [64.77666803185339, 0.15428530670341445, 2.5270029431458125], [71.79695814784466, 0.21322195843429448, 1.1004970891533106], [74.81250753815475, 0.1584501433241705, 1.8543928047082807], [77.16579374305756, 0.17829573118143394, 0.5000000000000001], [78.68853614005062, 0.1742483723289343, 0.5000000000000001]], "r_squared_": 0.9814405423598815, "error_": 0.03685004174954507}
{"freq_range": [2.0, 80.0], "freq_res": 0.5, "aperiodic_params_": [-7.817307946366902, 0.9494603385797622], "gaussian_params_": [[8.260569824416441, 0.45084362280966117, 1.1958508371004253], [12.392387998426784, 0.2630928785276431, 1.4437892077047587], [16.174376186814175, 0.5069853204506787, 1.3063278801902094], [19.521045301364484, 0.2418354766935726, 0.834130696041521], [21.577597863314285, 0.2062712680621184, 0.38661465336858797], [23.25114108174779, 0.1871474641404651, 0.5123910594001264], [24.929330164048576, 0.15213315187391702, 0.38642651708354725], [26.896041992227833, 0.1520632032768669, 2.022375786289832], [29.46804590790045, 0.08627024024360427, 0.3355625081637552], [39.00260730578392, 0.11291270219271009, 0.6479655748492694], [44.14354004711406, 0.1385394810173148, 0.25000000000000006], [54.04922217727304, 0.1288566244990676, 0.5352776621278597], [57.882599109380344, 0.12393650700950201, 0.9575530189678755], [64.6852328569139, 0.1526805980375175, 1.0960188248910097], [71.82411013270459, 0.22806470816528057, 0.8065929744945919], [74.39914941134747, 0.20969812800652674, 0.38906585107078046], [78.67475746877155, 0.22867509768073185, 0.25000000000000006]], "peak_params_": [[8.260569824416441, 0.4488449137664947, 2.3917016742008506], [12.392387998426784, 0.27290993149950005, 2.8875784154095174], [16.174376186814175, 0.5141180830553207, 2.612655760380419], [19.521045301364484, 0.2617952705236739, 1.668261392083042], [21.577597863314285, 0.22165047398554272, 0.7732293067371759], [23.25114108174779, 0.20362147986012147, 1.0247821188002528], [24.929330164048576, 0.24814786987509407, 0.7728530341670945], [26.896041992227833, 0.15186252152031443, 4.044751572579664], [29.46804590790045, 0.15225847690128447, 0.6711250163275104], [39.00260730578392, 0.11291179063160861, 1.2959311496985388], [44.14354004711406, 0.11748672934933246, 0.5000000000000001], [54.04922217727304, 0.1283463251987893, 1.0705553242557193], [57.882599109380344, 0.1230084925865409, 1.915106037935751], [64.6852328569139, 0.150515605477473, 2.1920376497820193], [71.82411013270459, 0.22270614869088412, 1.6131859489891838], [74.39914941134747, 0.2036995251052911, 0.7781317021415609], [78.67475746877155, 0.17910654022524497, 0.5000000000000001]], "r_squared_": 0.9865596467573581, "error_": 0.036110825109623254}
{"freq_range": [2.0, 80.0], "freq_res": 0.5, "aperiodic_params_": [-7.45909092634211, 1.1715026998640745], "gaussian_params_": [[8.214469157676572, 0.7518126352930474, 0.8040482645977615], [13.21974016263449, 0.37918745061739084, 3.4004148474960303], [16.279633716196376, 0.21390380373413498, 0.8615000788676594], [22.226017299567975, 0.08850499578786689, 2.4069472648202055], [51.96375470488329, 0.14702138226733596, 1.7835479005445884], [57.14683043200893, 0.20537963025308945, 0.25000000000000006], [58.80167324464719, 0.24496718252664035, 0.34621067249020104], [64.01836959938078, 0.09460920208947943, 3.0488273819201983], [69.17629114370284, 0.1382305726200517, 0.4323859506412115], [75.77398270043201, 0.13054139934065945, 5.999999999999999]], "peak_params_": [[8.214469157676572, 0.8422685391539, 1.608096529195523], [13.21974016263449, 0.3786061330081587, 6.800829694992061], [16.279633716196376, 0.4503557159920675, 1.723000157735319], [22.226017299567975, 0.10163840500252697, 4.813894529640411], [51.96375470488329, 0.14708186734424267, 3.567095801089177], [57.14683043200893, 0.1832364051269817, 0.5000000000000001], [58.80167324464719, 0.23499319938228425, 0.6924213449804021], [64.01836959938078, 0.1136432581783886, 6.097654763840397], [69.17629114370284, 0.22112401499915002, 0.864771901282423], [75.77398270043201, 0.13049071804026546, 11.999999999999998]], "r_squared_": 0.9870691477685684, "error_": 0.042696976123679446}
{"freq_range": [2.0, 80.0], "freq_res": 0.5, "aperiodic_params_": [-7.636557658621077, 0.9624498682726376], "gaussian_params_": [[8.150174222014297, 0.720748129184926, 0.648607500992345], [9.91362413596981, 0.5868766635808292, 1.7146129465125401], [15.511093461967421, 0.4980036641443502, 3.568048891242586], [22.133093356003954, 0.09711775210577485, 0.25000016968704625], [24.995836779380177, 0.14914290464757404, 1.7446559076891484], [52.585172441036256, 0.19311673394111992, 0.7067177481925673]], "peak_params_": [[8.150174222014297, 1.0708288656929827, 1.29721500198469], [9.91362413596981, 0.749551589434656, 3.4292258930250803], [15.511093461967421, 0.5009085853495812, 7.136097782485172], [22.133093356003954, 0.21372058978771769, 0.5000003393740925], [24.995836779380177, 0.16364576887008297, 3.4893118153782967], [52.585172441036256, 0.19171933611540837, 1.4134354963851345]], "r_squared_": 0.9882368730432146, "error_": 0.045070822689092106}
{"freq_range": [2.0, 80.0], "freq_res": 0.5, "aperiodic_params_": [-7.383097414222987, 1.1899351605141633], "gaussian_params_": [[6.700966979920852, 0.19715158816051878, 0.2501865855643363], [8.187406735801874, 0.6423120579924305, 0.49434934096807537], [9.59204850555032, 0.6880164309719317, 1.3992196602964937], [13.009858567750054, 0.4962020887283774, 2.134349202970399], [15.594379050365623, 0.29986619928756114, 0.6277628638287951], [18.00651279037634, 0.3890226738734853, 0.9646216363587984], [21.452034599135967, 0.3501936618467897, 4.801518596698107], [26.07552728196604, 0.10126557561861207, 0.31485452727558155], [27.30554140601396, 0.11288571831211788, 0.2500025180024962], [30.263970622557714, 0.11781685252165744, 0.25000028079163716], [76.7918458919682, 0.21352908627297185, 0.264832077074317]], "peak_params_": [[6.700966979920852, 0.21203234481976274, 0.5003731711286726], [8.187406735801874, 0.9964070164608927, 0.9886986819361507], [9.59204850555032, 0.8496137583531951, 2.7984393205929874], [13.009858567750054, 0.6060716171872631, 4.268698405940798], [15.594379050365623, 0.7235398934999377, 1.2555257276575902], [18.00651279037634, 0.6919062998504089, 1.9292432727175968], [21.452034599135967, 0.3509099059133156, 9.603037193396213], [26.07552728196604, 0.3220026806581693, 0.6297090545511631], [27.30554140601396, 0.24183375150411734, 0.5000050360049924], [30.263970622557714, 0.13477255871066696, 0.5000005615832743], [76.7918458919682, 0.15678675710845624, 0.529664154148634]], "r_squared_": 0.9940744746472631, "error_": 0.03725192344231208}
{"freq_range": [2.0, 80.0], "freq_res": 0.5, "aperiodic_params_": [-7.519028527674256, 1.110999962549953], "gaussian_params_": [[9.039653484896968, 0.4940041729033753, 1.234107330801485], [14.331301316548464, 0.7013407249185166, 3.5393446305429337], [22.71506744294487, 0.5936935465809974, 5.999999999999999]], "peak_params_": [[9.039653484896968, 0.7628426088056495, 2.46821466160297], [14.331301316548464, 0.9331068671983829, 7.078689261085867], [22.71506744294487, 0.6422051963519877, 11.999999999999998]], "r_squared_": 0.9884557158092551, "error_": 0.05646207074174603}
{"freq_range": [2.0, 80.0], "freq_res": 0.5, "aperiodic_params_": [-7.278915350712604, 1.2893514946120779], "gaussian_params_": [[12.751565377655634, 0.9039572645997132, 3.552022764883612], [21.251232827266815, 0.7803383334564891, 5.274661519852046], [32.273510059524114, 0.09658476859004621, 5.999624407281819]], "peak_params_": [[12.751565377655634, 1.1318686632657027, 7.104045529767224], [21.251232827266815, 0.8422757534568408, 10.549323039704092], [32.273510059524114, 0.1768126834829431, 11.999248814563638]], "r_squared_": 0.9896523566167189, "error_": 0.056974194406608}
{"freq_range": [2.0, 80.0], "freq_res": 0.5, "aperiodic_params_": [-7.256831363588375, 1.2820731885264731], "gaussian_params_": [[8.433981792780898, 0.5602593437239586, 1.1981476186268625], [13.466371626320226, 1.012215787779876, 3.0646526089297854], [21.82179507907611, 0.8152868841340972, 5.062009968727555], [26.1021695807024, 0.19251972986079313, 0.6741070490636251], [33.64321416973393, 0.11985441478588756, 5.999773998335226]], "peak_params_": [[8.433981792780898, 0.8572565881402516, 2.396295237253725], [13.466371626320226, 1.2237324409494095, 6.129305217859571], [21.82179507907611, 0.8539857837607983, 10.12401993745511], [26.1021695807024, 0.823721426709124, 1.3482140981272501], [33.64321416973393, 0.1767802110696497, 11.999547996670453]], "r_squared_": 0.9910641958773101, "error_": 0.05639924178844931}
{"freq_range": [2.0, 80.0], "freq_res": 0.5, "aperiodic_params_": [-7.422830908946626, 1.202023805739089], "gaussian_params_": [[8.264598142993506, 0.3577563804980149, 0.7602433723062354], [13.42991922972376, 0.7580211381549434, 3.5526080520438676], [22.467537295950745, 0.7328584396159529, 5.999999999925635], [31.85037652057995, 0.16652734494483756, 0.25000203382551844], [33.011651187475806, 0.09811991987612104, 0.25000002426658985]], "peak_params_": [[8.264598142993506, 0.6792088353101553, 1.5204867446124708], [13.42991922972376, 0.9977332283126579, 7.105216104087735], [22.467537295950745, 0.7619731236980591, 11.99999999985127], [31.85037652057995, 0.3467013274473647, 0.5000040676510369], [33.011651187475806, 0.25501376871197756, 0.5000000485331797]], "r_squared_": 0.9886403227432059, "error_": 0.05905528276034866}
{"freq_range": [2.0, 80.0], "freq_res": 0.5, "aperiodic_params_": [-7.641433089993506, 0.9110171075912182], "gaussian_params_": [[8.177587703045928, 0.5757789387676501, 0.5464557472629284], [10.382089162354307, 0.21196057574675428, 0.36560345909431136], [15.408188346104344, 0.8852419373543434, 4.391205224212199], [22.442892822220188, 0.23772697571883414, 0.29627567982711206], [26.763373665587707, 0.3668370786552393, 2.987584700394444], [77.4368343297063, 0.10076401430199135, 2.1736970434748186]], "peak_params_": [[8.177587703045928, 0.7594822923245514, 1.092911494525857], [10.382089162354307, 0.6752841462486225, 0.7312069181886227], [15.408188346104344, 0.8853491328097416, 8.782410448424399], [22.442892822220188, 0.6061336492365434, 0.5925513596542241], [26.763373665587707, 0.39284552357135283, 5.975169400788888], [77.4368343297063, 0.10072147915143681, 4.347394086949637]], "r_squared_": 0.9867844840520292, "error_": 0.0470250693810471}
{"freq_range": [2.0, 80.0], "freq_res": 0.5, "aperiodic_params_": [-7.741292972766215, 0.9458411388801794], "gaussian_params_": [[8.225123474418902, 0.6013401458784806, 0.5126017054870227], [10.116575152287737, 0.4220659140244326, 2.0605852691997395], [16.170873610221967, 0.6100671634519583, 2.9142244619526645], [22.678238888669497, 0.09424254435369327, 0.25000000000000006], [23.72885255360777, 0.24373158112885812, 2.5191570895834534], [26.904134976354865, 0.15302743572756863, 0.7273156030196706], [28.931432923023625, 0.2454572856047177, 0.4633312727837995], [67.76637312777828, 0.2093304998808281, 0.25000000000000006], [79.56210319634054, 0.169141954276623, 0.2628701780789575]], "peak_params_": [[8.225123474418902, 0.8070745394565115, 1.0252034109740453], [10.116575152287737, 0.4877132408789606, 4.121170538399479], [16.170873610221967, 0.618385663569363, 5.828448923905329], [22.678238888669497, 0.3471807889431293, 0.5000000000000001], [23.72885255360777, 0.268973583938509, 5.038314179166907], [26.904134976354865, 0.25725729257612784, 1.4546312060393412], [28.931432923023625, 0.2725312768316055, 0.926662545567599], [67.76637312777828, 0.135268571233512, 0.5000000000000001], [79.56210319634054, 0.1644869428508553, 0.525740356157915]], "r_squared_": 0.989532071603931, "error_": 0.039823832234251524}
{"freq_range": [2.0, 80.0], "freq_res": 0.5, "aperiodic_params_": [-7.204074332693615, 1.2107494918903408], "gaussian_params_": [[8.113363901985332, 0.33906741004800145, 0.353618667504528], [8.243089832491947, 0.8326061406366065, 0.9237484222148505], [12.47759298670718, 0.4987588776769067, 2.5317375874334163], [16.51069731774354, 0.3602252585248487, 1.1253688701011715], [19.586364633935982, 0.23495097235018245, 0.642125343666882], [23.059528425895287, 0.1777861550568269, 2.0550724850091693], [56.9372805903091, 0.1718661669765595, 0.25000000000000006], [58.776174966023824, 0.3716919165507489, 0.25000000000000006], [63.95203459913595, 0.09122750814394388, 3.1334772063474277], [69.3055649917868, 0.1573448436312746, 0.34433477479698454], [71.67142814456037, 0.1254483272192625, 0.25000000000000006], [75.77398270043201, 0.12965239021210795, 5.999999999999999]], "peak_params_": [[8.113363901985332, 1.230748584951625, 0.707237335009056], [8.243089832491947, 1.230748584951625, 1.847496844429701], [12.47759298670718, 0.4993888404809166, 5.0634751748668325], [16.51069731774354, 0.5024753726670674, 2.250737740202343], [19.586364633935982, 0.2937288650588581, 1.284250687333764], [23.059528425895287, 0.1778002660914506, 4.110144970018339], [56.9372805903091, 0.17529673741655571, 0.5000000000000001], [58.776174966023824, 0.27773098435137555, 0.5000000000000001], [63.95203459913595, 0.11012295717477372, 6.266954412694855], [69.3055649917868, 0.2282357549148113, 0.6886695495939691], [71.67142814456037, 0.20477916431494414, 0.5000000000000001], [75.77398270043201, 0.1296166626016806, 11.999999999999998]], "r_squared_": 0.9896167097868886, "error_": 0.04240175522809448}
{"freq_range": [2.0, 80.0], "freq_res": 0.5, "aperiodic_params_": [-7.465947686190361, 1.0886304740929538], "gaussian_params_": [[8.125716727405779, 1.0597324057077138, 0.669164508277587], [9.500610416078672, 0.40256991020268773, 1.9379015854755774], [15.564421312735103, 0.5807333896772805, 2.2772836868656907], [19.028533581987787, 0.1466300623858666, 0.25000000000000006], [65.77397917844795, 0.10417715896742598, 3.152920852202157], [79.52081317421461, 0.22177666171620303, 0.4132040661689911]], "peak_params_": [[8.125716727405779, 1.3418168578856378, 1.338329016555174], [9.500610416078672, 0.5479421695293221, 3.875803170951155], [15.564421312735103, 0.5838405865819158, 4.554567373731381], [19.028533581987787, 0.3317852519081015, 0.5000000000000001], [65.77397917844795, 0.10390982419932371, 6.305841704404314], [79.52081317421461, 0.2215034847556847, 0.8264081323379822]], "r_squared_": 0.9880314853366432, "error_": 0.04572704765024568}
{"freq_range": [2.0, 80.0], "freq_res": 0.5, "aperiodic_params_": [-7.336980285635979, 1.2313401572422233], "gaussian_params_": [[8.190000389985663, 0.5683046543422916, 0.3565540829543952], [8.335564311375064, 0.46072968095361505, 1.1622374109462583], [11.037678635746895, 0.39231478220371907, 1.214649423365185], [15.775489360400611, 0.5882470409496123, 2.8697706431242374], [24.75189865573014, 0.22225519463189297, 3.0410852432512554], [27.56192829890643, 0.076501469434086, 0.2500000005170091]], "peak_params_": [[8.190000389985663, 0.9671818787082822, 0.7131081659087904], [8.335564311375064, 0.9134712193335055, 2.3244748218925166], [11.037678635746895, 0.5727334926398804, 2.42929884673037], [15.775489360400611, 0.590077816405163, 5.739541286248475], [24.75189865573014, 0.22487379751611591, 6.082170486502511], [27.56192829890643, 0.22208045525128384, 0.5000000010340182]], "r_squared_": 0.9883756604563204, "error_": 0.050979713411852194}
{"freq_range": [2.0, 80.0], "freq_res": 0.5, "aperiodic_params_": [-7.555688960237029, 1.1505137021176604], "gaussian_params_": [[10.39733392259081, 0.49076074476597265, 2.2242124234546075], [16.55668103540392, 0.6243987417323582, 4.054729385620972], [22.877583466485785, 0.33736970880645895, 0.7468788148281409], [24.612745780276235, 0.1833798992359177, 0.46079279723530864], [26.724038612677855, 0.2808804817940484, 1.8151500921888954], [29.468507873071907, 0.243375149093184, 0.4112358583428301], [34.50970470910853, 0.16074072682860316, 3.692498990219159]], "peak_params_": [[10.39733392259081, 0.6948615296805922, 4.448424846909215], [16.55668103540392, 0.6357193027852492, 8.109458771241943], [22.877583466485785, 0.5454085643688522, 1.4937576296562818], [24.612745780276235, 0.4381614721067315, 0.9215855944706173], [26.724038612677855, 0.3249575929484969, 3.630300184377791], [29.468507873071907, 0.39775081224850695, 0.8224717166856602], [34.50970470910853, 0.16080415863646813, 7.384997980438318]], "r_squared_": 0.9892700655450183, "error_": 0.04584113596763938}
{"freq_range": [2.0, 80.0], "freq_res": 0.5, "aperiodic_params_": [-7.555681547527223, 1.1618130612383144], "gaussian_params_": [[10.916776967758073, 0.7811627008890044, 2.8072290823467965], [17.226017299567975, 0.6209556159410613, 2.8852433194839664], [23.456488680528498, 0.36011696307046887, 2.006186767471605], [27.48752491621118, 0.16049365403888116, 0.6333820918082894], [28.952034599445934, 0.2228971951735914, 4.617768207043962]], "peak_params_": [[10.916776967758073, 0.8414593965331347, 5.614458164693593], [17.226017299567975, 0.7035608023916744, 5.770486638967933], [23.456488680528498, 0.5294705641735415, 4.01237353494321], [27.48752491621118, 0.4209450097927139, 1.2667641836165788], [28.952034599445934, 0.24022385410033387, 9.235536414087925]], "r_squared_": 0.9870685971842481, "error_": 0.053772403343666904}
{"freq_range": [2.0, 80.0], "freq_res": 0.5, "aperiodic_params_": [-7.580271874049215, 1.158991508150205], "gaussian_params_": [[12.283202971330528, 0.6812313066019272, 3.4732092827712044], [22.65970404844877, 0.6530612421023765, 5.999999999999999], [40.22601729956798, 0.10699705677489804, 5.26812638786059]], "peak_params_": [[12.283202971330528, 0.8356265221978276, 6.946418565542409], [22.65970404844877, 0.662203765806284, 11.999999999999998], [40.22601729956798, 0.11692760461806273, 10.53625277572118]], "r_squared_": 0.9852106528881256, "error_": 0.05854756824096064}
{"freq_range": [2.0, 80.0], "freq_res": 0.5, "aperiodic_params_": [-7.51661746310608, 1.1630221824938927], "gaussian_params_": [[10.379547391608426, 0.459992513328194, 2.094008025987677], [16.109147471638735, 0.7315515333774378, 3.516167487774766], [22.324811706769456, 0.1539575268562395, 0.250000000000067], [25.277943251212672, 0.5154154065659557, 3.82384680407278], [34.21580949768384, 0.1891796738079556, 2.3309314715159863], [40.62637607085354, 0.17898449945864678, 1.0822573518608767], [63.022275196695674, 0.21781612716001894, 0.27108195808180297]], "peak_params_": [[10.379547391608426, 0.6644762564752202, 4.188016051975354], [16.109147471638735, 0.7708925519429624, 7.032334975549532], [22.324811706769456, 0.6565575365013583, 0.500000000000134], [25.277943251212672, 0.5353910691726469, 7.64769360814556], [34.21580949768384, 0.22660058857610998, 4.661862943031973], [40.62637607085354, 0.18295030153089975, 2.1645147037217534], [63.022275196695674, 0.21708200386567889, 0.5421639161636059]], "r_squared_": 0.990425697307169, "error_": 0.04660101315582803}
{"freq_range": [2.0, 80.0], "freq_res": 0.5, "aperiodic_params_": [-7.703299414622955, 1.0017281802558828], "gaussian_params_": [[8.141981378471499, 1.0777224495477522, 0.8536084152622477], [10.483290340275781, 0.4017782253254476, 0.496235248612228], [15.384198648012205, 0.6005635482699294, 2.8185698272633695], [20.212536878051875, 0.21266390794560094, 0.9302876262463425], [22.45776524291288, 0.25783773676494076, 0.31043517684005006], [25.370504698662412, 0.33849687237546555, 1.4531361585201936], [28.959202901672406, 0.15204878558654797, 0.4611204320892777], [52.38788986796634, 0.2001951811500052, 0.25000000000000006], [78.31501026521747, 0.12414613701865419, 0.7639797075202396]], "peak_params_": [[8.141981378471499, 1.082334321228605, 1.7072168305244955], [10.483290340275781, 0.5591052359393345, 0.992470497224456], [15.384198648012205, 0.600057459205793, 5.637139654526739], [20.212536878051875, 0.36466023144633297, 1.860575252492685], [22.45776524291288, 0.33872149108859695, 0.6208703536801001], [25.370504698662412, 0.33811385156322515, 2.9062723170403872], [28.959202901672406, 0.1664183134678492, 0.9222408641785554], [52.38788986796634, 0.18104458787415112, 0.5000000000000001], [78.31501026521747, 0.12055952387033564, 1.5279594150404792]], "r_squared_": 0.9899024607395747, "error_": 0.03978901497782023}
{"freq_range": [2.0, 80.0], "freq_res": 0.5, "aperiodic_params_": [-7.437693634789594, 1.0767805315412335], "gaussian_params_": [[8.115340242112943, 1.349094716077059, 0.7681242199274646], [10.560793983293328, 0.340280800534258, 1.1320770634809205], [13.184321518259688, 0.26954718693405416, 0.8188238097588738], [15.863559842420653, 0.6098481325871774, 1.382769880227524], [19.846049246769272, 0.2426548673607286, 0.6358620368618569], [25.28787246195863, 0.1691749138833764, 0.4422589570013117], [48.65709806435526, 0.15110465457366892, 0.27736975302331496], [58.17474320900302, 0.16729662543379328, 0.8965090488445666], [60.58302224213376, 0.13303817816036304, 0.25000000000000006], [62.353221326131944, 0.1297937334247748, 0.9444073784383864], [65.47519549927343, 0.2015643592471232, 0.7257009555833193], [67.55021074945378, 0.16855253833885434, 0.2955782767430793], [69.05845394697323, 0.09845969259515956, 0.6187632870103467], [72.5987398532471, 0.14661690400098612, 2.4360261814822644], [75.82990522334646, 0.1438956290663987, 0.25000000407524264], [78.34277461500358, 0.1868920760940637, 1.513650709078988]], "peak_params_": [[8.115340242112943, 1.360318434593431, 1.5362484398549292], [10.560793983293328, 0.3522637062864096, 2.264154126961841], [13.184321518259688, 0.3676484752283251, 1.6376476195177476], [15.863559842420653, 0.607619281318879, 2.765539760455048], [19.846049246769272, 0.2425972705291919, 1.2717240737237139], [25.28787246195863, 0.15079227828127983, 0.8845179140026234], [48.65709806435526, 0.1287119157567762, 0.5547395060466299], [58.17474320900302, 0.1641518200513925, 1.7930180976891332], [60.58302224213376, 0.15061923243265873, 0.5000000000000001], [62.353221326131944, 0.12830938304881379, 1.8888147568767728], [65.47519549927343, 0.20405063530603584, 1.4514019111666385], [67.55021074945378, 0.1907789142549685, 0.5911565534861586], [69.05845394697323, 0.14725942589060814, 1.2375265740206933], [72.5987398532471, 0.1466051967122297, 4.872052362964529], [75.82990522334646, 0.22589639073701306, 0.5000000081504853], [78.34277461500358, 0.19368235641653087, 3.027301418157976]], "r_squared_": 0.9925205321393644, "error_": 0.032411833378742885}
{"freq_range": [2.0, 80.0], "freq_res": 0.5, "aperiodic_params_": [-7.528333943466816, 0.9917902897248768], "gaussian_params_": [[8.108210102756619, 0.583842359015704, 0.49569609239706636], [8.55453545914874, 0.5437560931446662, 1.4579488962162985], [14.047377287486182, 0.3058669735857775, 2.2670191161308053], [15.879167390783175, 0.22029986557970294, 0.7982487454320841], [18.977273275623855, 0.09523288650814114, 4.285496966059675], [65.77398270043201, 0.09376748980662979, 5.387810386018126], [79.56027792790029, 0.22982702292555351, 0.3014562351825212]], "peak_params_": [[8.108210102756619, 1.0882061382141845, 0.9913921847941327], [8.55453545914874, 0.9907043517933758, 2.915897792432597], [14.047377287486182, 0.3686152360376713, 4.534038232261611], [15.879167390783175, 0.5036807046026208, 1.5964974908641683], [18.977273275623855, 0.12346680884242112, 8.57099393211935], [65.77398270043201, 0.09368502094503484, 10.775620772036252], [79.56027792790029, 0.2289315778410117, 0.6029124703650424]], "r_squared_": 0.9847277645193758, "error_": 0.045704754760681095}
{"freq_range": [2.0, 80.0], "freq_res": 0.5, "aperiodic_params_": [-7.520660358511905, 1.0019307194686256], "gaussian_params_": [[8.162965140944234, 0.705848654210983, 0.47221775064585625], [8.92306266487814, 0.41412873316931975, 1.7809295540813808], [15.176261177630384, 0.46698529624074897, 2.959258512988061], [22.821948101296083, 0.12481011845831622, 1.3838683540329915], [59.659501571034426, 0.23479631984155724, 0.25000000000000006], [66.3800351803169, 0.21567523593498866, 0.25000000000000006]], "peak_params_": [[8.162965140944234, 1.0517988618353726, 0.9444355012917125], [8.92306266487814, 0.6133411202498955, 3.5618591081627615], [15.176261177630384, 0.46738462715259743, 5.918517025976122], [22.821948101296083, 0.13795537712046801, 2.767736708065983], [59.659501571034426, 0.19155833908031816, 0.5000000000000001], [66.3800351803169, 0.19222013951557493, 0.5000000000000001]], "r_squared_": 0.9853835778217138, "error_": 0.04712963268927819}
{"freq_range": [2.0, 80.0], "freq_res": 0.5, "aperiodic_params_": [-7.545000615483954, 1.0788988465423603], "gaussian_params_": [[8.256898942228855, 0.7352345542435352, 0.574319169137229], [10.105130643480251, 0.44415817239696104, 0.7080991518807793], [12.250708444802633, 0.27174808428453573, 0.5226477200781845], [16.39298746850175, 0.42998653784744517, 3.873172471137067], [22.855425996563472, 0.08217283440944473, 0.25000000000000006], [24.24790874260845, 0.1577180300631071, 2.130443468500599], [29.449974161634717, 0.20996633765650038, 0.6040580488287335], [35.819909611296346, 0.12390528581041187, 0.623389232789101], [73.09074899312095, 0.19608077351207706, 0.2859831796050712]], "peak_params_": [[8.256898942228855, 0.7601625509835319, 1.148638338274458], [10.105130643480251, 0.5567798125785455, 1.4161983037615586], [12.250708444802633, 0.5034525301337549, 1.045295440156369], [16.39298746850175, 0.43003423152942055, 7.746344942274134], [22.855425996563472, 0.30273914073238295, 0.5000000000000001], [24.24790874260845, 0.21914911485978195, 4.260886937001198], [29.449974161634717, 0.21820336145738928, 1.208116097657467], [35.819909611296346, 0.1188425089856544, 1.246778465578202], [73.09074899312095, 0.18645311129397513, 0.5719663592101424]], "r_squared_": 0.9894989270837276, "error_": 0.04051169776519364}
{"freq_range": [2.0, 80.0], "freq_res": 0.5, "aperiodic_params_": [-7.510255236523448, 1.1420326534539418], "gaussian_params_": [[8.395626769078762, 0.5978517955917304, 0.877636468518364], [13.035717087416973, 0.45483950827976893, 3.2842516718991392], [21.178051899351267, 0.3785606700671333, 5.219147910177469], [29.083544791113855, 0.06056230109430785, 0.6703689229040716], [31.61369875803737, 0.19247852313570785, 0.6838780018610922]], "peak_params_": [[8.395626769078762, 0.7887096337554915, 1.755272937036728], [13.035717087416973, 0.5657253204390855, 6.5685033437982785], [21.178051899351267, 0.40237883697672316, 10.438295820354938], [29.083544791113855, 0.18336681574341007, 1.3407378458081431], [31.61369875803737, 0.24348327049323615, 1.3677560037221843]], "r_squared_": 0.9862502546156257, "error_": 0.05186013360036708}
{"freq_range": [2.0, 80.0], "freq_res": 0.5, "aperiodic_params_": [-7.507553915979719, 1.0734816502926272], "gaussian_params_": [[8.147846041829945, 0.3754938007132636, 0.8513326441814849], [11.48719262624523, 0.5062573800184568, 1.89642639115775], [15.82059705242025, 0.33095729864042145, 0.9451808292576688], [19.45203464573673, 0.31730752085356073, 3.4217699234462016], [24.559658589232022, 0.10824868857681218, 0.25000000000000006], [26.103446739338093, 0.1492039440522622, 1.7235669371987608], [31.84552988361872, 0.17521042229780512, 0.8629088798299795], [71.59822400781682, 0.15921171108831786, 1.2797702845735253]], "peak_params_": [[8.147846041829945, 0.46440169504436923, 1.7026652883629698], [11.48719262624523, 0.5277335457897081, 3.7928527823155], [15.82059705242025, 0.5456392790636873, 1.8903616585153376], [19.45203464573673, 0.31761000550752705, 6.843539846892403], [24.559658589232022, 0.3088815888152876, 0.5000000000000001], [26.103446739338093, 0.19978655639715903, 3.4471338743975215], [31.84552988361872, 0.1732356817389178, 1.725817759659959], [71.59822400781682, 0.15874346210025259, 2.5595405691470505]], "r_squared_": 0.9867895764097627, "error_": 0.04511847876302566}
{"freq_range": [2.0, 80.0], "freq_res": 0.5, "aperiodic_params_": [-7.466952892360866, 1.1262637968190206], "gaussian_params_": [[8.074088383177184, 1.0615279201926613, 0.91959004068968], [10.957273108898077, 0.2655256155440581, 0.9200284419087642], [13.718603601725565, 0.3743299125581858, 0.7282498430585966], [15.886212309108695, 0.6671697295926184, 0.9146990922741662], [18.542211148476134, 0.13963611871493908, 2.1017813424106655], [21.57941002676766, 0.035866518179681194, 3.604147098972319], [56.668420032917574, 0.18200504540415113, 0.25000000000000006], [68.77398270043182, 0.09537524874548083, 5.999999999999999], [69.98982114162514, 0.05599133318095487, 0.25000000000000006]], "peak_params_": [[8.074088383177184, 1.0596339742178529, 1.83918008137936], [10.957273108898077, 0.27302224917901086, 1.8400568838175284], [13.718603601725565, 0.39663520910894157, 1.4564996861171933], [15.886212309108695, 0.7428081533624322, 1.8293981845483325], [18.542211148476134, 0.17575525773901468, 4.203562684821331], [21.57941002676766, 0.08773221742114323, 7.208294197944638], [56.668420032917574, 0.15682361473418815, 0.5000000000000001], [68.77398270043182, 0.09532969115338652, 11.999999999999998], [69.98982114162514, 0.14934971627530302, 0.5000000000000001]], "r_squared_": 0.9882842954422282, "error_": 0.04422092018673995}
{"freq_range": [2.0, 80.0], "freq_res": 0.5, "aperiodic_params_": [-7.627939187818716, 1.048710187831592], "gaussian_params_": [[5.77500053644314, 0.24765999658701254, 0.25000000000000006], [8.043359808068493, 0.916910272932292, 0.8732317142095061], [10.288192260259153, 0.24375716173064862, 0.7108592050991795], [11.683910554837615, 0.25168645602475864, 0.4286982258757981], [13.237947613449045, 0.14627640464336888, 0.35656967768612446], [15.648771737474318, 0.6325686071558005, 1.496052659790518], [20.434700770174615, 0.21693325018997214, 0.3253717910830377], [21.793372813007057, 0.14778743851330367, 0.48379380886654955], [23.852189622477244, 0.15370560394558025, 0.4733821111790886], [52.27636288101634, 0.17467273460195062, 0.25000000000000006], [55.99172602382752, 0.09226582403252544, 1.054176056218849], [64.05064801986039, 0.10174843645745592, 1.2707739213299496], [67.63001476527263, 0.11896856655282007, 0.25000000000000006], [68.70477158938617, 0.18771183105531586, 0.8540555371131452], [74.50664481966439, 0.11884964584048187, 0.25000000000000006], [76.60782437981453, 0.15725538399024938, 0.3034656119125539], [79.09518617651159, 0.11543632992512921, 0.7799864252587944]], "peak_params_": [[5.77500053644314, 0.22451978870170208, 0.5000000000000001], [8.043359808068493, 0.9171528708823891, 1.7464634284190121], [10.288192260259153, 0.25795128708976023, 1.421718410198359], [11.683910554837615, 0.300456060913449, 0.8573964517515962], [13.237947613449045, 0.251459749573792, 0.7131393553722489], [15.648771737474318, 0.629448629511824, 2.992105319581036], [20.434700770174615, 0.22004928002128743, 0.6507435821660754], [21.793372813007057, 0.13505679774024237, 0.9675876177330991], [23.852189622477244, 0.1463970700939239, 0.9467642223581773], [52.27636288101634, 0.11745647264393355, 0.5000000000000001], [55.99172602382752, 0.09226298234408148, 2.108352112437698], [64.05064801986039, 0.10166770292904737, 2.541547842659899], [67.63001476527263, 0.1758811340796793, 0.5000000000000001], [68.70477158938617, 0.1828938533950737, 1.7081110742262904], [74.50664481966439, 0.11880767548734639, 0.5000000000000001], [76.60782437981453, 0.1480912600921478, 0.6069312238251078], [79.09518617651159, 0.114579942584351, 1.5599728505175887]], "r_squared_": 0.990287619143883, "error_": 0.034700796370844826}
{"freq_range": [2.0, 80.0], "freq_res": 0.5, "aperiodic_params_": [-7.564700217940159, 1.043394040978641], "gaussian_params_": [[6.424893494446686, 0.18067889321805486, 0.25000000000001843], [8.286425834080344, 0.5615068472392996, 0.6147724703815255], [10.219681379328044, 0.46408535233470555, 0.6629279335600691], [12.103464148202887, 0.2953006628422905, 0.5805047554624074], [14.879736135380572, 0.3268456191030122, 1.3807846582326373], [17.22073291943945, 0.2546163209314014, 0.2500069001780077], [19.096329503931116, 0.23846835661765448, 0.8373064602750311], [22.61024005218353, 0.1129575323924418, 1.0998896706234427], [25.038357416822105, 0.10475703212040131, 0.25000000000000006], [47.54673960802953, 0.16734588009771478, 0.34478339438340727], [52.33523641636748, 0.08745681762756621, 1.44796037917586], [59.1747947240819, 0.08987095990541107, 1.3994863041369605], [62.31806072594131, 0.24293511984947003, 0.25000147380042353], [64.73193418151475, 0.13809024439117928, 0.5320689357699838], [72.8305873412881, 0.20065664332659625, 0.3022169781851845], [74.95103525702118, 0.24684806555712385, 0.3299485218892532], [76.63133321218291, 0.16752419256582612, 0.3051580049431968]], "peak_params_": [[6.424893494446686, 0.18094401283597428, 0.5000000000000369], [8.286425834080344, 0.5446787427707838, 1.229544940763051], [10.219681379328044, 0.45188363676869336, 1.3258558671201381], [12.103464148202887, 0.34039031933888, 1.1610095109248149], [14.879736135380572, 0.3256108988086144, 2.7615693164652746], [17.22073291943945, 0.28335053433575297, 0.5000138003560154], [19.096329503931116, 0.24122124030455971, 1.6746129205500622], [22.61024005218353, 0.112453211170779, 2.1997793412468853], [25.038357416822105, 0.1141927520557271, 0.5000000000000001], [47.54673960802953, 0.1661466448441722, 0.6895667887668145], [52.33523641636748, 0.08689347549043624, 2.89592075835172], [59.1747947240819, 0.0891748956267584, 2.798972608273921], [62.31806072594131, 0.19177937892145103, 0.5000029476008471], [64.73193418151475, 0.12563893015342842, 1.0641378715399676], [72.8305873412881, 0.17148193803985023, 0.604433956370369], [74.95103525702118, 0.24414492490815753, 0.6598970437785064], [76.63133321218291, 0.15271016099521795, 0.6103160098863936]], "r_squared_": 0.989686608112485, "error_": 0.03304954029678221}
{"freq_range": [2.0, 80.0], "freq_res": 0.5, "aperiodic_params_": [-7.403368383122588, 1.1491836792912042], "gaussian_params_": [[8.243311261611526, 0.592754914620899, 0.684394186927326], [11.225592891841712, 0.2993942175839071, 1.6888521360805133], [13.648617697067921, 0.23815622222748958, 0.5637192998862538], [15.360853637190788, 0.4701915212991879, 0.546242194216242], [17.416425790110658, 0.2188440562110423, 0.7996143376527752], [19.28503864166007, 0.31909632335250265, 0.25000000000000006], [20.772762767039794, 0.15440974650935035, 0.7245847757239381], [70.00185091310902, 0.08152965342162097, 4.894119453948657], [72.72202487936843, 0.17329801056291963, 0.2500053015858494], [78.33020824245817, 0.1456898084929152, 0.3834531758605718]], "peak_params_": [[8.243311261611526, 0.604774686846441, 1.368788373854652], [11.225592891841712, 0.29691664535199713, 3.3777042721610266], [13.648617697067921, 0.3523397831896258, 1.1274385997725076], [15.360853637190788, 0.48081606930617227, 1.092484388432484], [17.416425790110658, 0.21817889287431136, 1.5992286753055505], [19.28503864166007, 0.26083959082345487, 0.5000000000000001], [20.772762767039794, 0.14700975427992802, 1.4491695514478762], [70.00185091310902, 0.0815296475910845, 9.788238907897314], [72.72202487936843, 0.18839526931201966, 0.5000106031716988], [78.33020824245817, 0.15013998983707566, 0.7669063517211436]], "r_squared_": 0.9862628810073812, "error_": 0.04363358516532008}
{"freq_range": [2.0, 80.0], "freq_res": 0.5, "aperiodic_params_": [-7.409777888193806, 1.111111932024596], "gaussian_params_": [[2.5975266162766073, 0.15777872818915323, 0.26645935481836586], [8.392442596418071, 0.5043832720120928, 0.7813796852145308], [11.044092658762091, 0.3013981995265714, 1.1973425944350318], [13.059447608927355, 0.17403384787037796, 0.2502112279745551], [13.829704742928623, 0.22612409843012365, 0.2500008604334143], [15.489633980120505, 0.33780963731560576, 0.25654839527815104], [16.20080068797174, 0.34418225649144973, 0.2578361836764264], [16.529778018385617, 0.15181726510081975, 3.2747188025839007], [23.57878087367769, 0.1131268454770441, 0.2500000522716812], [31.679432987250387, 0.15550123832858276, 0.25000000000000006], [35.47149530546808, 0.09165068554902846, 0.25000000000000006], [56.56906975621899, 0.18317148915847814, 0.25000000000000006], [58.83195092669448, 0.13303690321026274, 0.2500000000173457], [67.02163564520254, 0.22166157959111177, 0.7438442514030371], [70.0064420435809, 0.1800709218537783, 0.8370410143063807], [72.45317405880321, 0.3148338030497493, 0.40255186894322853], [74.16856427691837, 0.13802678187963519, 0.3794683811595567], [78.62094868543744, 0.18684351874567148, 1.0198858591405817]], "peak_params_": [[2.5975266162766073, 0.14757233938058878, 0.5329187096367317], [8.392442596418071, 0.5386731122601578, 1.5627593704290617], [11.044092658762091, 0.3396060230307718, 2.3946851888700635], [13.059447608927355, 0.3344087423993951, 0.5004224559491102], [13.829704742928623, 0.30641508592208133, 0.5000017208668286], [15.489633980120505, 0.49088621455894454, 0.5130967905563021], [16.20080068797174, 0.45074658517790844, 0.5156723673528528], [16.529778018385617, 0.32750727069514873, 6.549437605167801], [23.57878087367769, 0.12340643376043303, 0.5000001045433624], [31.679432987250387, 0.12019563631369401, 0.5000000000000001], [35.47149530546808, 0.09105688303659853, 0.5000000000000001], [56.56906975621899, 0.17631246027843694, 0.5000000000000001], [58.83195092669448, 0.10613401937075295, 0.5000000000346914], [67.02163564520254, 0.22185234647995067, 1.4876885028060742], [70.0064420435809, 0.18013876529409423, 1.6740820286127613], [72.45317405880321, 0.31484965043666335, 0.8051037378864571], [74.16856427691837, 0.12526340207900155, 0.7589367623191134], [78.62094868543744, 0.18553427304695447, 2.0397717182811634]], "r_squared_": 0.9918542356319878, "error_": 0.03131856481079638}
