%!PS-Adobe-3.0 EPSF-3.0
%%Creator: (MATLAB, The Mathworks, Inc. Version 9.8.0.1323502 \(R2020a\). Operating System: Mac OS X)
%%Title: /Users/kosciessa/Volumes/tardis/LNDG/stateswitch/stsw_eeg_task/aperiodic_fooof/figures/h_spectra_ya.eps
%%CreationDate: 2023-01-03T15:25:55
%%Pages: (atend)
%%BoundingBox:    77     0   898   242
%%LanguageLevel: 3
%%EndComments
%%BeginProlog
%%BeginResource: procset (Apache XML Graphics Std ProcSet) 1.2 0
%%Version: 1.2 0
%%Copyright: (Copyright 2001-2003,2010 The Apache Software Foundation. License terms: http://www.apache.org/licenses/LICENSE-2.0)
/bd{bind def}bind def
/ld{load def}bd
/GR/grestore ld
/GS/gsave ld
/RM/rmoveto ld
/C/curveto ld
/t/show ld
/L/lineto ld
/ML/setmiterlimit ld
/CT/concat ld
/f/fill ld
/N/newpath ld
/S/stroke ld
/CC/setcmykcolor ld
/A/ashow ld
/cp/closepath ld
/RC/setrgbcolor ld
/LJ/setlinejoin ld
/GC/setgray ld
/LW/setlinewidth ld
/M/moveto ld
/re {4 2 roll M
1 index 0 rlineto
0 exch rlineto
neg 0 rlineto
cp } bd
/_ctm matrix def
/_tm matrix def
/BT { _ctm currentmatrix pop matrix _tm copy pop 0 0 moveto } bd
/ET { _ctm setmatrix } bd
/iTm { _ctm setmatrix _tm concat } bd
/Tm { _tm astore pop iTm 0 0 moveto } bd
/ux 0.0 def
/uy 0.0 def
/F {
  /Tp exch def
  /Tf exch def
  Tf findfont Tp scalefont setfont
  /cf Tf def  /cs Tp def
} bd
/ULS {currentpoint /uy exch def /ux exch def} bd
/ULE {
  /Tcx currentpoint pop def
  gsave
  newpath
  cf findfont cs scalefont dup
  /FontMatrix get 0 get /Ts exch def /FontInfo get dup
  /UnderlinePosition get Ts mul /To exch def
  /UnderlineThickness get Ts mul /Tt exch def
  ux uy To add moveto  Tcx uy To add lineto
  Tt setlinewidth stroke
  grestore
} bd
/OLE {
  /Tcx currentpoint pop def
  gsave
  newpath
  cf findfont cs scalefont dup
  /FontMatrix get 0 get /Ts exch def /FontInfo get dup
  /UnderlinePosition get Ts mul /To exch def
  /UnderlineThickness get Ts mul /Tt exch def
  ux uy To add cs add moveto Tcx uy To add cs add lineto
  Tt setlinewidth stroke
  grestore
} bd
/SOE {
  /Tcx currentpoint pop def
  gsave
  newpath
  cf findfont cs scalefont dup
  /FontMatrix get 0 get /Ts exch def /FontInfo get dup
  /UnderlinePosition get Ts mul /To exch def
  /UnderlineThickness get Ts mul /Tt exch def
  ux uy To add cs 10 mul 26 idiv add moveto Tcx uy To add cs 10 mul 26 idiv add lineto
  Tt setlinewidth stroke
  grestore
} bd
/QT {
/Y22 exch store
/X22 exch store
/Y21 exch store
/X21 exch store
currentpoint
/Y21 load 2 mul add 3 div exch
/X21 load 2 mul add 3 div exch
/X21 load 2 mul /X22 load add 3 div
/Y21 load 2 mul /Y22 load add 3 div
/X22 load /Y22 load curveto
} bd
/SSPD {
dup length /d exch dict def
{
/v exch def
/k exch def
currentpagedevice k known {
/cpdv currentpagedevice k get def
v cpdv ne {
/upd false def
/nullv v type /nulltype eq def
/nullcpdv cpdv type /nulltype eq def
nullv nullcpdv or
{
/upd true def
} {
/sametype v type cpdv type eq def
sametype {
v type /arraytype eq {
/vlen v length def
/cpdvlen cpdv length def
vlen cpdvlen eq {
0 1 vlen 1 sub {
/i exch def
/obj v i get def
/cpdobj cpdv i get def
obj cpdobj ne {
/upd true def
exit
} if
} for
} {
/upd true def
} ifelse
} {
v type /dicttype eq {
v {
/dv exch def
/dk exch def
/cpddv cpdv dk get def
dv cpddv ne {
/upd true def
exit
} if
} forall
} {
/upd true def
} ifelse
} ifelse
} if
} ifelse
upd true eq {
d k v put
} if
} if
} if
} forall
d length 0 gt {
d setpagedevice
} if
} bd
/RE { % /NewFontName [NewEncodingArray] /FontName RE -
  findfont dup length dict begin
  {
    1 index /FID ne
    {def} {pop pop} ifelse
  } forall
  /Encoding exch def
  /FontName 1 index def
  currentdict definefont pop
  end
} bind def
%%EndResource
%%BeginResource: procset (Apache XML Graphics EPS ProcSet) 1.0 0
%%Version: 1.0 0
%%Copyright: (Copyright 2002-2003 The Apache Software Foundation. License terms: http://www.apache.org/licenses/LICENSE-2.0)
/BeginEPSF { %def
/b4_Inc_state save def         % Save state for cleanup
/dict_count countdictstack def % Count objects on dict stack
/op_count count 1 sub def      % Count objects on operand stack
userdict begin                 % Push userdict on dict stack
/showpage { } def              % Redefine showpage, { } = null proc
0 setgray 0 setlinecap         % Prepare graphics state
1 setlinewidth 0 setlinejoin
10 setmiterlimit [ ] 0 setdash newpath
/languagelevel where           % If level not equal to 1 then
{pop languagelevel             % set strokeadjust and
1 ne                           % overprint to their defaults.
{false setstrokeadjust false setoverprint
} if
} if
} bd
/EndEPSF { %def
count op_count sub {pop} repeat            % Clean up stacks
countdictstack dict_count sub {end} repeat
b4_Inc_state restore
} bd
%%EndResource
%FOPBeginFontDict
%%IncludeResource: font Courier-Oblique
%%IncludeResource: font Courier-BoldOblique
%%IncludeResource: font Courier-Bold
%%IncludeResource: font ZapfDingbats
%%IncludeResource: font Symbol
%%IncludeResource: font Helvetica
%%IncludeResource: font Helvetica-Oblique
%%IncludeResource: font Helvetica-Bold
%%IncludeResource: font Helvetica-BoldOblique
%%IncludeResource: font Times-Roman
%%IncludeResource: font Times-Italic
%%IncludeResource: font Times-Bold
%%IncludeResource: font Times-BoldItalic
%%IncludeResource: font Courier
%FOPEndFontDict
%%BeginResource: encoding WinAnsiEncoding
/WinAnsiEncoding [
/.notdef /.notdef /.notdef /.notdef /.notdef
/.notdef /.notdef /.notdef /.notdef /.notdef
/.notdef /.notdef /.notdef /.notdef /.notdef
/.notdef /.notdef /.notdef /.notdef /.notdef
/.notdef /.notdef /.notdef /.notdef /.notdef
/.notdef /.notdef /.notdef /.notdef /.notdef
/.notdef /.notdef /space /exclam /quotedbl
/numbersign /dollar /percent /ampersand /quotesingle
/parenleft /parenright /asterisk /plus /comma
/hyphen /period /slash /zero /one
/two /three /four /five /six
/seven /eight /nine /colon /semicolon
/less /equal /greater /question /at
/A /B /C /D /E
/F /G /H /I /J
/K /L /M /N /O
/P /Q /R /S /T
/U /V /W /X /Y
/Z /bracketleft /backslash /bracketright /asciicircum
/underscore /quoteleft /a /b /c
/d /e /f /g /h
/i /j /k /l /m
/n /o /p /q /r
/s /t /u /v /w
/x /y /z /braceleft /bar
/braceright /asciitilde /bullet /Euro /bullet
/quotesinglbase /florin /quotedblbase /ellipsis /dagger
/daggerdbl /circumflex /perthousand /Scaron /guilsinglleft
/OE /bullet /Zcaron /bullet /bullet
/quoteleft /quoteright /quotedblleft /quotedblright /bullet
/endash /emdash /asciitilde /trademark /scaron
/guilsinglright /oe /bullet /zcaron /Ydieresis
/space /exclamdown /cent /sterling /currency
/yen /brokenbar /section /dieresis /copyright
/ordfeminine /guillemotleft /logicalnot /sfthyphen /registered
/macron /degree /plusminus /twosuperior /threesuperior
/acute /mu /paragraph /middot /cedilla
/onesuperior /ordmasculine /guillemotright /onequarter /onehalf
/threequarters /questiondown /Agrave /Aacute /Acircumflex
/Atilde /Adieresis /Aring /AE /Ccedilla
/Egrave /Eacute /Ecircumflex /Edieresis /Igrave
/Iacute /Icircumflex /Idieresis /Eth /Ntilde
/Ograve /Oacute /Ocircumflex /Otilde /Odieresis
/multiply /Oslash /Ugrave /Uacute /Ucircumflex
/Udieresis /Yacute /Thorn /germandbls /agrave
/aacute /acircumflex /atilde /adieresis /aring
/ae /ccedilla /egrave /eacute /ecircumflex
/edieresis /igrave /iacute /icircumflex /idieresis
/eth /ntilde /ograve /oacute /ocircumflex
/otilde /odieresis /divide /oslash /ugrave
/uacute /ucircumflex /udieresis /yacute /thorn
/ydieresis
] def
%%EndResource
%FOPBeginFontReencode
/Courier-Oblique findfont
dup length dict begin
  {1 index /FID ne {def} {pop pop} ifelse} forall
  /Encoding WinAnsiEncoding def
  currentdict
end
/Courier-Oblique exch definefont pop
/Courier-BoldOblique findfont
dup length dict begin
  {1 index /FID ne {def} {pop pop} ifelse} forall
  /Encoding WinAnsiEncoding def
  currentdict
end
/Courier-BoldOblique exch definefont pop
/Courier-Bold findfont
dup length dict begin
  {1 index /FID ne {def} {pop pop} ifelse} forall
  /Encoding WinAnsiEncoding def
  currentdict
end
/Courier-Bold exch definefont pop
/Helvetica findfont
dup length dict begin
  {1 index /FID ne {def} {pop pop} ifelse} forall
  /Encoding WinAnsiEncoding def
  currentdict
end
/Helvetica exch definefont pop
/Helvetica-Oblique findfont
dup length dict begin
  {1 index /FID ne {def} {pop pop} ifelse} forall
  /Encoding WinAnsiEncoding def
  currentdict
end
/Helvetica-Oblique exch definefont pop
/Helvetica-Bold findfont
dup length dict begin
  {1 index /FID ne {def} {pop pop} ifelse} forall
  /Encoding WinAnsiEncoding def
  currentdict
end
/Helvetica-Bold exch definefont pop
/Helvetica-BoldOblique findfont
dup length dict begin
  {1 index /FID ne {def} {pop pop} ifelse} forall
  /Encoding WinAnsiEncoding def
  currentdict
end
/Helvetica-BoldOblique exch definefont pop
/Times-Roman findfont
dup length dict begin
  {1 index /FID ne {def} {pop pop} ifelse} forall
  /Encoding WinAnsiEncoding def
  currentdict
end
/Times-Roman exch definefont pop
/Times-Italic findfont
dup length dict begin
  {1 index /FID ne {def} {pop pop} ifelse} forall
  /Encoding WinAnsiEncoding def
  currentdict
end
/Times-Italic exch definefont pop
/Times-Bold findfont
dup length dict begin
  {1 index /FID ne {def} {pop pop} ifelse} forall
  /Encoding WinAnsiEncoding def
  currentdict
end
/Times-Bold exch definefont pop
/Times-BoldItalic findfont
dup length dict begin
  {1 index /FID ne {def} {pop pop} ifelse} forall
  /Encoding WinAnsiEncoding def
  currentdict
end
/Times-BoldItalic exch definefont pop
/Courier findfont
dup length dict begin
  {1 index /FID ne {def} {pop pop} ifelse} forall
  /Encoding WinAnsiEncoding def
  currentdict
end
/Courier exch definefont pop
%FOPEndFontReencode
%%EndProlog
%%Page: 1 1
%%PageBoundingBox: 0 0 992 255
%%BeginPageSetup
[1 0 0 -1 0 255] CT
%%EndPageSetup
GS
[1.00013 0 0 1 0 0] CT
1 GC
N
0 0 992 255 re
f
GR
GS
[1.00013 0 0 1 0 0] CT
1 GC
N
0 0 992 255 re
f
GR
GS
[1.00013 0 0 1 0 0] CT
1 GC
N
136 205.5 M
339 205.5 L
339 19 L
136 19 L
cp
f
GR
GS
[1.00013 0 0 1 0 0] CT
0.149 GC
2 setlinecap
1 LJ
0.5 LW
N
136 205.5 M
339 205.5 L
S
GR
GS
[1.00013 0 0 1 0 0] CT
0.149 GC
2 setlinecap
1 LJ
0.5 LW
N
136 205.5 M
136 203.47 L
S
GR
GS
[1.00013 0 0 1 0 0] CT
0.149 GC
2 setlinecap
1 LJ
0.5 LW
N
189.421 205.5 M
189.421 203.47 L
S
GR
GS
[1.00013 0 0 1 0 0] CT
0.149 GC
2 setlinecap
1 LJ
0.5 LW
N
242.842 205.5 M
242.842 203.47 L
S
GR
GS
[1.00013 0 0 1 0 0] CT
0.149 GC
2 setlinecap
1 LJ
0.5 LW
N
296.263 205.5 M
296.263 203.47 L
S
GR
GS
[1.00013 0 0 1 136.01727 211.09998] CT
0.149 GC
/Helvetica 18 F
GS
[1 0 0 1 0 0] CT
-5.5 18 moveto 
1 -1 scale
(0) t 
GR
GR
GS
[1.00013 0 0 1 189.44511 211.09998] CT
0.149 GC
/Helvetica 18 F
GS
[1 0 0 1 0 0] CT
-13 18 moveto 
1 -1 scale
(0.5) t 
GR
GR
GS
[1.00013 0 0 1 242.87294 211.09998] CT
0.149 GC
/Helvetica 18 F
GS
[1 0 0 1 0 0] CT
-5.5 18 moveto 
1 -1 scale
(1) t 
GR
GR
GS
[1.00013 0 0 1 296.30078 211.09998] CT
0.149 GC
/Helvetica 18 F
GS
[1 0 0 1 0 0] CT
-13 18 moveto 
1 -1 scale
(1.5) t 
GR
GR
GS
[1.00013 0 0 1 237.53025 233.60001] CT
0.149 GC
/Helvetica 18 F
GS
[1 0 0 1 0 0] CT
-72.5 18 moveto 
1 -1 scale
(Frequency \(log10\)) t 
GR
GR
GS
[1.00013 0 0 1 0 0] CT
0.149 GC
2 setlinecap
1 LJ
0.5 LW
N
136 205.5 M
136 19 L
S
GR
GS
[1.00013 0 0 1 0 0] CT
0.149 GC
2 setlinecap
1 LJ
0.5 LW
N
136 205.024 M
138.03 205.024 L
S
GR
GS
[1.00013 0 0 1 0 0] CT
0.149 GC
2 setlinecap
1 LJ
0.5 LW
N
136 158.518 M
138.03 158.518 L
S
GR
GS
[1.00013 0 0 1 0 0] CT
0.149 GC
2 setlinecap
1 LJ
0.5 LW
N
136 112.012 M
138.03 112.012 L
S
GR
GS
[1.00013 0 0 1 0 0] CT
0.149 GC
2 setlinecap
1 LJ
0.5 LW
N
136 65.506 M
138.03 65.506 L
S
GR
GS
[1.00013 0 0 1 0 0] CT
0.149 GC
2 setlinecap
1 LJ
0.5 LW
N
136 19 M
138.03 19 L
S
GR
GS
[1.00013 0 0 1 130.41655 205.02425] CT
0.149 GC
/Helvetica 18 F
GS
[1 0 0 1 0 0] CT
-18 7 moveto 
1 -1 scale
(-9) t 
GR
GR
GS
[1.00013 0 0 1 130.41655 158.51819] CT
0.149 GC
/Helvetica 18 F
GS
[1 0 0 1 0 0] CT
-33 7 moveto 
1 -1 scale
(-8.5) t 
GR
GR
GS
[1.00013 0 0 1 130.41655 112.01212] CT
0.149 GC
/Helvetica 18 F
GS
[1 0 0 1 0 0] CT
-18 7 moveto 
1 -1 scale
(-8) t 
GR
GR
GS
[1.00013 0 0 1 130.41655 65.50607] CT
0.149 GC
/Helvetica 18 F
GS
[1 0 0 1 0 0] CT
-33 7 moveto 
1 -1 scale
(-7.5) t 
GR
GR
GS
[1.00013 0 0 1 130.41655 19] CT
0.149 GC
/Helvetica 18 F
GS
[1 0 0 1 0 0] CT
-18 7 moveto 
1 -1 scale
(-7) t 
GR
GR
GS
[0 -1 1.00013 0 94.91205 112.24985] CT
0.149 GC
/Helvetica 18 F
GS
[1 0 0 1 0 0] CT
-71 -4 moveto 
1 -1 scale
(Power \(log10; Hz\)) t 
GR
GR
GS
[1.00013 0 0 1 0 0] CT
0.754 0.86 0.922 RC
N
136 35.256 M
154.814 56.668 L
168.163 69.771 L
178.517 76.41 L
186.977 80.645 L
194.129 85.674 L
200.325 89.406 L
205.791 94.165 L
210.679 98.727 L
215.102 102.119 L
219.139 107.549 L
222.853 108.596 L
226.292 110.539 L
229.493 113.112 L
232.488 111.639 L
235.301 108.052 L
237.953 103.603 L
240.462 100.65 L
242.842 99.69 L
245.106 105.146 L
247.265 110.669 L
249.327 116.614 L
251.302 122.238 L
253.196 127.991 L
255.016 132.428 L
256.767 135.647 L
258.455 139.327 L
260.083 142.852 L
261.656 144.446 L
263.178 149.343 L
264.651 149.44 L
266.079 150.687 L
267.464 151.91 L
268.809 153.255 L
270.116 154.77 L
271.387 155.89 L
272.625 156.35 L
273.83 157.075 L
275.005 158.216 L
276.151 160.842 L
277.269 162.061 L
278.361 163.002 L
279.427 164.934 L
280.47 166.719 L
281.49 166.908 L
282.488 169.295 L
283.465 170.379 L
284.421 170.782 L
285.359 172.585 L
286.278 172.202 L
287.179 174.708 L
288.063 173.797 L
288.93 175.988 L
289.781 176.369 L
290.617 176.907 L
291.439 176.139 L
292.246 177.726 L
293.039 174.818 L
293.819 160.305 L
294.586 175.442 L
295.34 178.728 L
296.083 178.485 L
296.813 179.75 L
297.533 180.821 L
298.241 182.105 L
298.939 182.277 L
299.626 182.451 L
300.304 184.303 L
300.971 184.209 L
301.63 185.474 L
302.279 185.463 L
302.919 185.128 L
303.55 185.422 L
304.173 186.34 L
304.787 186.798 L
305.394 186.151 L
305.993 187.548 L
306.584 187.573 L
307.167 188.356 L
307.744 188.168 L
308.313 189.158 L
308.876 189.149 L
309.431 188.955 L
309.98 188.512 L
310.523 190.422 L
311.06 191.407 L
311.59 190.101 L
312.114 190.043 L
312.633 191.034 L
313.145 191.891 L
313.653 191.849 L
314.154 190.627 L
314.65 192.274 L
315.141 191.405 L
315.627 192.028 L
316.108 192.555 L
316.584 193.363 L
317.055 193.656 L
317.522 193.392 L
317.983 193.516 L
318.44 193.588 L
318.893 194.998 L
319.341 194.33 L
319.785 192.736 L
320.225 193.475 L
320.661 194.432 L
321.093 194.542 L
321.52 194.227 L
321.944 194.392 L
322.364 194.99 L
322.78 196.209 L
323.193 196.046 L
323.601 196.788 L
324.007 195.607 L
324.408 195.55 L
324.807 196.952 L
325.202 197.29 L
325.593 196.817 L
325.981 192.721 L
326.366 196.202 L
326.748 197.244 L
327.127 197.249 L
327.503 197.114 L
327.876 198.79 L
328.245 199.13 L
328.612 199.293 L
328.976 198.816 L
329.337 198.42 L
329.695 198.356 L
330.051 197.719 L
330.404 199.104 L
330.754 199.32 L
331.102 199.804 L
331.447 199.843 L
331.789 200.578 L
332.129 200.291 L
332.466 201.135 L
332.802 200.85 L
333.134 200.918 L
333.464 200.958 L
333.792 202.209 L
334.118 201.411 L
334.441 202.15 L
334.762 201.195 L
335.081 201.415 L
335.398 200.941 L
335.713 203.202 L
336.025 203.092 L
336.335 203.483 L
336.644 203.465 L
336.95 204.858 L
337.254 204.719 L
337.557 204.366 L
337.857 205.461 L
338.155 204.678 L
338.452 204.369 L
338.746 205.278 L
339.024 205.521 L
339.024 205.162 L
339.024 204.802 L
339.024 203.967 L
339.024 203.944 L
338.746 203.717 L
338.452 202.748 L
338.155 203.217 L
337.857 203.941 L
337.557 203.029 L
337.254 203.127 L
336.95 203.115 L
336.644 202.079 L
336.335 202.13 L
336.025 201.603 L
335.713 201.387 L
335.398 199.333 L
335.081 199.641 L
334.762 199.52 L
334.441 200.379 L
334.118 199.829 L
333.792 200.621 L
333.464 199.225 L
333.134 199.258 L
332.802 199.193 L
332.466 199.254 L
332.129 198.69 L
331.789 198.997 L
331.447 198.062 L
331.102 197.817 L
330.754 197.689 L
330.404 197.512 L
330.051 196.286 L
329.695 196.689 L
329.337 196.705 L
328.976 196.879 L
328.612 197.403 L
328.245 197.176 L
327.876 197.055 L
327.503 195.533 L
327.127 195.793 L
326.748 195.742 L
326.366 194.537 L
325.981 191.48 L
325.593 195.144 L
325.202 195.391 L
324.807 195.152 L
324.408 193.968 L
324.007 193.733 L
323.601 195.33 L
323.193 194.356 L
322.78 194.571 L
322.364 193.366 L
321.944 192.82 L
321.52 192.684 L
321.093 192.926 L
320.661 192.724 L
320.225 191.682 L
319.785 190.983 L
319.341 192.626 L
318.893 193.506 L
318.44 192.162 L
317.983 192.058 L
317.522 191.695 L
317.055 191.797 L
316.584 191.434 L
316.108 190.688 L
315.627 190.151 L
315.141 189.868 L
314.65 190.26 L
314.154 188.835 L
313.653 190.246 L
313.145 190.241 L
312.633 189.267 L
312.114 188.486 L
311.59 188.531 L
311.06 189.622 L
310.523 188.711 L
309.98 186.787 L
309.431 187.247 L
308.876 187.444 L
308.313 187.485 L
307.744 186.564 L
307.167 186.743 L
306.584 186.165 L
305.993 186.123 L
305.394 184.534 L
304.787 185.187 L
304.173 184.624 L
303.55 183.695 L
302.919 183.485 L
302.279 183.744 L
301.63 183.963 L
300.971 182.48 L
300.304 182.646 L
299.626 181.026 L
298.939 181.01 L
298.241 180.61 L
297.533 179.362 L
296.813 178.315 L
296.083 177.362 L
295.34 177.382 L
294.586 174.048 L
293.819 158.975 L
293.039 172.946 L
292.246 175.887 L
291.439 174.632 L
290.617 175.433 L
289.781 174.789 L
288.93 174.406 L
288.063 172.251 L
287.179 173.056 L
286.278 170.613 L
285.359 171.09 L
284.421 169.224 L
283.465 169.103 L
282.488 168.134 L
281.49 165.718 L
280.47 165.476 L
279.427 164.013 L
278.361 161.63 L
277.269 160.744 L
276.151 159.752 L
275.005 156.945 L
273.83 155.843 L
272.625 154.92 L
271.387 154.406 L
270.116 153.415 L
268.809 151.944 L
267.464 150.67 L
266.079 149.527 L
264.651 148.483 L
263.178 148.213 L
261.656 143.089 L
260.083 141.58 L
258.455 138.056 L
256.767 134.393 L
255.016 131.033 L
253.196 126.164 L
251.302 120.121 L
249.327 114.846 L
247.265 108.943 L
245.106 103.252 L
242.842 97.381 L
240.462 97.941 L
237.953 101.44 L
235.301 106.238 L
232.488 110.399 L
229.493 111.91 L
226.292 109.506 L
222.853 107.52 L
219.139 106.55 L
215.102 100.989 L
210.679 97.721 L
205.791 93.124 L
200.325 88.268 L
194.129 84.368 L
186.977 79.396 L
178.517 74.802 L
168.163 68.089 L
154.814 54.797 L
136 33.017 L
cp
f
GR
GS
[1.00013 0 0 1 0 0] CT
0.561 0.749 0.859 RC
1 LJ
0.5 LW
N
136 35.256 M
154.814 56.668 L
168.163 69.771 L
178.517 76.41 L
186.977 80.645 L
194.129 85.674 L
200.325 89.406 L
205.791 94.165 L
210.679 98.727 L
215.102 102.119 L
219.139 107.549 L
222.853 108.596 L
226.292 110.539 L
229.493 113.112 L
232.488 111.639 L
235.301 108.052 L
237.953 103.603 L
240.462 100.65 L
242.842 99.69 L
245.106 105.146 L
247.265 110.669 L
249.327 116.614 L
251.302 122.238 L
253.196 127.991 L
255.016 132.428 L
256.767 135.647 L
258.455 139.327 L
260.083 142.852 L
261.656 144.446 L
263.178 149.343 L
264.651 149.44 L
266.079 150.687 L
267.464 151.91 L
268.809 153.255 L
270.116 154.77 L
271.387 155.89 L
272.625 156.35 L
273.83 157.075 L
275.005 158.216 L
276.151 160.842 L
277.269 162.061 L
278.361 163.002 L
279.427 164.934 L
280.47 166.719 L
281.49 166.908 L
282.488 169.295 L
283.465 170.379 L
284.421 170.782 L
285.359 172.585 L
286.278 172.202 L
287.179 174.708 L
288.063 173.797 L
288.93 175.988 L
289.781 176.369 L
290.617 176.907 L
291.439 176.139 L
292.246 177.726 L
293.039 174.818 L
293.819 160.305 L
294.586 175.442 L
295.34 178.728 L
296.083 178.485 L
296.813 179.75 L
297.533 180.821 L
298.241 182.105 L
298.939 182.277 L
299.626 182.451 L
300.304 184.303 L
300.971 184.209 L
301.63 185.474 L
302.279 185.463 L
302.919 185.128 L
303.55 185.422 L
304.173 186.34 L
304.787 186.798 L
305.394 186.151 L
305.993 187.548 L
306.584 187.573 L
307.167 188.356 L
307.744 188.168 L
308.313 189.158 L
308.876 189.149 L
309.431 188.955 L
309.98 188.512 L
310.523 190.422 L
311.06 191.407 L
311.59 190.101 L
312.114 190.043 L
312.633 191.034 L
313.145 191.891 L
313.653 191.849 L
314.154 190.627 L
314.65 192.274 L
315.141 191.405 L
315.627 192.028 L
316.108 192.555 L
316.584 193.363 L
317.055 193.656 L
317.522 193.392 L
317.983 193.516 L
318.44 193.588 L
318.893 194.998 L
319.341 194.33 L
319.785 192.736 L
320.225 193.475 L
320.661 194.432 L
321.093 194.542 L
321.52 194.227 L
321.944 194.392 L
322.364 194.99 L
322.78 196.209 L
323.193 196.046 L
323.601 196.788 L
324.007 195.607 L
324.408 195.55 L
324.807 196.952 L
325.202 197.29 L
325.593 196.817 L
325.981 192.721 L
326.366 196.202 L
326.748 197.244 L
327.127 197.249 L
327.503 197.114 L
327.876 198.79 L
328.245 199.13 L
328.612 199.293 L
328.976 198.816 L
329.337 198.42 L
329.695 198.356 L
330.051 197.719 L
330.404 199.104 L
330.754 199.32 L
331.102 199.804 L
331.447 199.843 L
331.789 200.578 L
332.129 200.291 L
332.466 201.135 L
332.802 200.85 L
333.134 200.918 L
333.464 200.958 L
333.792 202.209 L
334.118 201.411 L
334.441 202.15 L
334.762 201.195 L
335.081 201.415 L
335.398 200.941 L
335.713 203.202 L
336.025 203.092 L
336.335 203.483 L
336.644 203.465 L
336.95 204.858 L
337.254 204.719 L
337.557 204.366 L
337.857 205.461 L
338.155 204.678 L
338.452 204.369 L
338.746 205.278 L
339.024 205.521 L
S
GR
GS
[1.00013 0 0 1 0 0] CT
0.561 0.749 0.859 RC
1 LJ
0.5 LW
N
136 33.017 M
154.814 54.797 L
168.163 68.089 L
178.517 74.802 L
186.977 79.396 L
194.129 84.368 L
200.325 88.268 L
205.791 93.124 L
210.679 97.721 L
215.102 100.989 L
219.139 106.55 L
222.853 107.52 L
226.292 109.506 L
229.493 111.91 L
232.488 110.399 L
235.301 106.238 L
237.953 101.44 L
240.462 97.941 L
242.842 97.381 L
245.106 103.252 L
247.265 108.943 L
249.327 114.846 L
251.302 120.121 L
253.196 126.164 L
255.016 131.033 L
256.767 134.393 L
258.455 138.056 L
260.083 141.58 L
261.656 143.089 L
263.178 148.213 L
264.651 148.483 L
266.079 149.527 L
267.464 150.67 L
268.809 151.944 L
270.116 153.415 L
271.387 154.406 L
272.625 154.92 L
273.83 155.843 L
275.005 156.945 L
276.151 159.752 L
277.269 160.744 L
278.361 161.63 L
279.427 164.013 L
280.47 165.476 L
281.49 165.718 L
282.488 168.134 L
283.465 169.103 L
284.421 169.224 L
285.359 171.09 L
286.278 170.613 L
287.179 173.056 L
288.063 172.251 L
288.93 174.406 L
289.781 174.789 L
290.617 175.433 L
291.439 174.632 L
292.246 175.887 L
293.039 172.946 L
293.819 158.975 L
294.586 174.048 L
295.34 177.382 L
296.083 177.362 L
296.813 178.315 L
297.533 179.362 L
298.241 180.61 L
298.939 181.01 L
299.626 181.026 L
300.304 182.646 L
300.971 182.48 L
301.63 183.963 L
302.279 183.744 L
302.919 183.485 L
303.55 183.695 L
304.173 184.624 L
304.787 185.187 L
305.394 184.534 L
305.993 186.123 L
306.584 186.165 L
307.167 186.743 L
307.744 186.564 L
308.313 187.485 L
308.876 187.444 L
309.431 187.247 L
309.98 186.787 L
310.523 188.711 L
311.06 189.622 L
311.59 188.531 L
312.114 188.486 L
312.633 189.267 L
313.145 190.241 L
313.653 190.246 L
314.154 188.835 L
314.65 190.26 L
315.141 189.868 L
315.627 190.151 L
316.108 190.688 L
316.584 191.434 L
317.055 191.797 L
317.522 191.695 L
317.983 192.058 L
318.44 192.162 L
318.893 193.506 L
319.341 192.626 L
319.785 190.983 L
320.225 191.682 L
320.661 192.724 L
321.093 192.926 L
321.52 192.684 L
321.944 192.82 L
322.364 193.366 L
322.78 194.571 L
323.193 194.356 L
323.601 195.33 L
324.007 193.733 L
324.408 193.968 L
324.807 195.152 L
325.202 195.391 L
325.593 195.144 L
325.981 191.48 L
326.366 194.537 L
326.748 195.742 L
327.127 195.793 L
327.503 195.533 L
327.876 197.055 L
328.245 197.176 L
328.612 197.403 L
328.976 196.879 L
329.337 196.705 L
329.695 196.689 L
330.051 196.286 L
330.404 197.512 L
330.754 197.689 L
331.102 197.817 L
331.447 198.062 L
331.789 198.997 L
332.129 198.69 L
332.466 199.254 L
332.802 199.193 L
333.134 199.258 L
333.464 199.225 L
333.792 200.621 L
334.118 199.829 L
334.441 200.379 L
334.762 199.52 L
335.081 199.641 L
335.398 199.333 L
335.713 201.387 L
336.025 201.603 L
336.335 202.13 L
336.644 202.079 L
336.95 203.115 L
337.254 203.127 L
337.557 203.029 L
337.857 203.941 L
338.155 203.217 L
338.452 202.748 L
338.746 203.717 L
339.024 203.944 L
S
GR
GS
[1.00013 0 0 1 0 0] CT
0.02 0.443 0.69 RC
1 LJ
2 LW
N
136 34.136 M
154.814 55.733 L
168.163 68.93 L
178.517 75.606 L
186.977 80.021 L
194.129 85.021 L
200.325 88.837 L
205.791 93.645 L
210.679 98.224 L
215.102 101.554 L
219.139 107.049 L
222.853 108.058 L
226.292 110.022 L
229.493 112.511 L
232.488 111.019 L
235.301 107.145 L
237.953 102.521 L
240.462 99.296 L
242.842 98.536 L
245.106 104.199 L
247.265 109.806 L
249.327 115.73 L
251.302 121.18 L
253.196 127.077 L
255.016 131.731 L
256.767 135.02 L
258.455 138.692 L
260.083 142.216 L
261.656 143.768 L
263.178 148.778 L
264.651 148.961 L
266.079 150.107 L
267.464 151.29 L
268.809 152.599 L
270.116 154.093 L
271.387 155.148 L
272.625 155.635 L
273.83 156.459 L
275.005 157.581 L
276.151 160.297 L
277.269 161.402 L
278.361 162.316 L
279.427 164.473 L
280.47 166.098 L
281.49 166.313 L
282.488 168.714 L
283.465 169.741 L
284.421 170.003 L
285.359 171.838 L
286.278 171.408 L
287.179 173.882 L
288.063 173.024 L
288.93 175.197 L
289.781 175.579 L
290.617 176.17 L
291.439 175.386 L
292.246 176.806 L
293.039 173.882 L
293.819 159.64 L
294.586 174.745 L
295.34 178.055 L
296.083 177.924 L
296.813 179.033 L
297.533 180.092 L
298.241 181.357 L
298.939 181.643 L
299.626 181.739 L
300.304 183.475 L
300.971 183.345 L
301.63 184.719 L
302.279 184.603 L
302.919 184.306 L
303.55 184.559 L
304.173 185.482 L
304.787 185.992 L
305.394 185.342 L
305.993 186.835 L
306.584 186.869 L
307.167 187.55 L
307.744 187.366 L
308.313 188.322 L
308.876 188.296 L
309.431 188.101 L
309.98 187.649 L
310.523 189.567 L
311.06 190.515 L
311.59 189.316 L
312.114 189.265 L
312.633 190.151 L
313.145 191.066 L
313.653 191.047 L
314.154 189.731 L
314.65 191.267 L
315.141 190.637 L
315.627 191.09 L
316.108 191.621 L
316.584 192.398 L
317.055 192.726 L
317.522 192.543 L
317.983 192.787 L
318.44 192.875 L
318.893 194.252 L
319.341 193.478 L
319.785 191.86 L
320.225 192.579 L
320.661 193.578 L
321.093 193.734 L
321.52 193.455 L
321.944 193.606 L
322.364 194.178 L
322.78 195.39 L
323.193 195.201 L
323.601 196.059 L
324.007 194.67 L
324.408 194.759 L
324.807 196.052 L
325.202 196.34 L
325.593 195.98 L
325.981 192.1 L
326.366 195.37 L
326.748 196.493 L
327.127 196.521 L
327.503 196.324 L
327.876 197.923 L
328.245 198.153 L
328.612 198.348 L
328.976 197.847 L
329.337 197.562 L
329.695 197.523 L
330.051 197.002 L
330.404 198.308 L
330.754 198.504 L
331.102 198.81 L
331.447 198.953 L
331.789 199.787 L
332.129 199.49 L
332.466 200.195 L
332.802 200.021 L
333.134 200.088 L
333.464 200.091 L
333.792 201.415 L
334.118 200.62 L
334.441 201.265 L
334.762 200.357 L
335.081 200.528 L
335.398 200.137 L
335.713 202.294 L
336.025 202.347 L
336.335 202.806 L
336.644 202.772 L
336.95 203.987 L
337.254 203.923 L
337.557 203.698 L
337.857 204.701 L
338.155 203.947 L
338.452 203.558 L
338.746 204.498 L
339.024 204.733 L
S
GR
GS
[1.00013 0 0 1 0 0] CT
0.948 0.749 0.781 RC
N
136 39.606 M
154.814 59.702 L
168.163 70.599 L
178.517 77.3 L
186.977 82.312 L
194.129 87.014 L
200.325 89.766 L
205.791 94.962 L
210.679 99.162 L
215.102 103.533 L
219.139 107.545 L
222.853 110.436 L
226.292 113.094 L
229.493 115.162 L
232.488 114.156 L
235.301 111.809 L
237.953 109.018 L
240.462 107.782 L
242.842 104.535 L
245.106 108.14 L
247.265 114.679 L
249.327 120.7 L
251.302 124.749 L
253.196 131.352 L
255.016 136.024 L
256.767 139.859 L
258.455 142.246 L
260.083 144.344 L
261.656 147.192 L
263.178 149.125 L
264.651 151.419 L
266.079 151.942 L
267.464 153.223 L
268.809 155.236 L
270.116 155.656 L
271.387 156.056 L
272.625 157.15 L
273.83 158.084 L
275.005 159.56 L
276.151 158.712 L
277.269 161.789 L
278.361 163.466 L
279.427 163.485 L
280.47 165.804 L
281.49 166.254 L
282.488 167.332 L
283.465 167.688 L
284.421 170.259 L
285.359 171.415 L
286.278 171.198 L
287.179 173.873 L
288.063 174.551 L
288.93 173.624 L
289.781 173.909 L
290.617 174.088 L
291.439 175.421 L
292.246 175.956 L
293.039 172.647 L
293.819 159.197 L
294.586 174.327 L
295.34 177.631 L
296.083 178.936 L
296.813 180.035 L
297.533 180.308 L
298.241 179.493 L
298.939 179.235 L
299.626 180.526 L
300.304 181.3 L
300.971 181.048 L
301.63 180.414 L
302.279 182.385 L
302.919 182.82 L
303.55 183.421 L
304.173 183.32 L
304.787 182.78 L
305.394 184.803 L
305.993 183.541 L
306.584 185.058 L
307.167 185.788 L
307.744 185.005 L
308.313 185.648 L
308.876 185.777 L
309.431 185.94 L
309.98 186.455 L
310.523 187.028 L
311.06 187.281 L
311.59 187.614 L
312.114 187.909 L
312.633 188.026 L
313.145 188.187 L
313.653 187.31 L
314.154 188.784 L
314.65 189.261 L
315.141 188.5 L
315.627 190.121 L
316.108 190.474 L
316.584 189.456 L
317.055 189.768 L
317.522 190.306 L
317.983 189.955 L
318.44 190.276 L
318.893 190.873 L
319.341 190.469 L
319.785 191.296 L
320.225 192.058 L
320.661 190.933 L
321.093 190.79 L
321.52 191.51 L
321.944 193.409 L
322.364 192.913 L
322.78 193.104 L
323.193 191.427 L
323.601 192.682 L
324.007 192.217 L
324.408 192.55 L
324.807 192.931 L
325.202 193.378 L
325.593 193.775 L
325.981 189.562 L
326.366 192.495 L
326.748 193.616 L
327.127 193.958 L
327.503 194.526 L
327.876 195.09 L
328.245 194.956 L
328.612 194.121 L
328.976 194.845 L
329.337 196.039 L
329.695 195.003 L
330.051 195.287 L
330.404 196.294 L
330.754 196.211 L
331.102 196.523 L
331.447 195.997 L
331.789 196.775 L
332.129 198.148 L
332.466 197.394 L
332.802 197.787 L
333.134 197.304 L
333.464 198.72 L
333.792 198.684 L
334.118 198.752 L
334.441 198.701 L
334.762 199.368 L
335.081 199.705 L
335.398 199.292 L
335.713 199.498 L
336.025 200.603 L
336.335 200.583 L
336.644 201.232 L
336.95 201.712 L
337.254 200.971 L
337.557 200.746 L
337.857 200.916 L
338.155 202.516 L
338.452 201.603 L
338.746 201.787 L
339.024 203.542 L
339.024 202.155 L
339.024 202.085 L
338.746 200.423 L
338.452 200.103 L
338.155 201.197 L
337.857 199.364 L
337.557 199.254 L
337.254 199.5 L
336.95 200.189 L
336.644 199.607 L
336.335 198.964 L
336.025 199.156 L
335.713 198.214 L
335.398 197.752 L
335.081 198.268 L
334.762 197.871 L
334.441 197.474 L
334.118 197.198 L
333.792 197.151 L
333.464 197.229 L
333.134 196.026 L
332.802 196.17 L
332.466 195.704 L
332.129 196.672 L
331.789 195.328 L
331.447 194.604 L
331.102 195.099 L
330.754 194.61 L
330.404 194.664 L
330.051 193.875 L
329.695 193.454 L
329.337 194.308 L
328.976 193.54 L
328.612 192.709 L
328.245 193.122 L
327.876 193.313 L
327.503 193.18 L
327.127 192.556 L
326.748 192.114 L
326.366 191.091 L
325.981 187.986 L
325.593 192.242 L
325.202 192.044 L
324.807 191.623 L
324.408 190.897 L
324.007 190.934 L
323.601 191.222 L
323.193 190.292 L
322.78 191.562 L
322.364 191.71 L
321.944 191.648 L
321.52 189.807 L
321.093 189.22 L
320.661 189.494 L
320.225 190.389 L
319.785 190.036 L
319.341 188.895 L
318.893 189.669 L
318.44 188.877 L
317.983 188.584 L
317.522 188.962 L
317.055 188.223 L
316.584 188.098 L
316.108 189.004 L
315.627 188.477 L
315.141 187.104 L
314.65 187.787 L
314.154 187.294 L
313.653 186.181 L
313.145 186.887 L
312.633 186.664 L
312.114 186.218 L
311.59 186.187 L
311.06 185.89 L
310.523 185.633 L
309.98 184.931 L
309.431 184.242 L
308.876 184.269 L
308.313 184.583 L
307.744 183.739 L
307.167 184.517 L
306.584 183.737 L
305.993 182.214 L
305.394 183.397 L
304.787 181.2 L
304.173 181.95 L
303.55 182.038 L
302.919 181.516 L
302.279 180.934 L
301.63 179.004 L
300.971 179.699 L
300.304 180.216 L
299.626 179.301 L
298.939 177.755 L
298.241 178.151 L
297.533 179.045 L
296.813 178.626 L
296.083 177.755 L
295.34 176.407 L
294.586 172.972 L
293.819 157.962 L
293.039 171.268 L
292.246 174.723 L
291.439 174.194 L
290.617 172.8 L
289.781 172.801 L
288.93 172.29 L
288.063 173.324 L
287.179 172.523 L
286.278 169.98 L
285.359 170.147 L
284.421 169.047 L
283.465 166.629 L
282.488 166.114 L
281.49 165.068 L
280.47 164.454 L
279.427 162.637 L
278.361 162.447 L
277.269 160.525 L
276.151 157.523 L
275.005 158.315 L
273.83 156.898 L
272.625 156.158 L
271.387 155.053 L
270.116 154.248 L
268.809 153.847 L
267.464 152.065 L
266.079 150.801 L
264.651 150.111 L
263.178 148.071 L
261.656 146.249 L
260.083 143.095 L
258.455 141.222 L
256.767 138.856 L
255.016 134.763 L
253.196 129.92 L
251.302 123.529 L
249.327 119.407 L
247.265 113.383 L
245.106 106.281 L
242.842 102.733 L
240.462 106.044 L
237.953 107.552 L
235.301 110.421 L
232.488 113.002 L
229.493 114.157 L
226.292 112.045 L
222.853 109.314 L
219.139 106.501 L
215.102 102.488 L
210.679 98.139 L
205.791 93.707 L
200.325 88.705 L
194.129 86.035 L
186.977 81.175 L
178.517 76.162 L
168.163 69.331 L
154.814 58.223 L
136 38.012 L
cp
f
GR
GS
[1.00013 0 0 1 0 0] CT
0.906 0.549 0.608 RC
1 LJ
0.5 LW
N
136 39.606 M
154.814 59.702 L
168.163 70.599 L
178.517 77.3 L
186.977 82.312 L
194.129 87.014 L
200.325 89.766 L
205.791 94.962 L
210.679 99.162 L
215.102 103.533 L
219.139 107.545 L
222.853 110.436 L
226.292 113.094 L
229.493 115.162 L
232.488 114.156 L
235.301 111.809 L
237.953 109.018 L
240.462 107.782 L
242.842 104.535 L
245.106 108.14 L
247.265 114.679 L
249.327 120.7 L
251.302 124.749 L
253.196 131.352 L
255.016 136.024 L
256.767 139.859 L
258.455 142.246 L
260.083 144.344 L
261.656 147.192 L
263.178 149.125 L
264.651 151.419 L
266.079 151.942 L
267.464 153.223 L
268.809 155.236 L
270.116 155.656 L
271.387 156.056 L
272.625 157.15 L
273.83 158.084 L
275.005 159.56 L
276.151 158.712 L
277.269 161.789 L
278.361 163.466 L
279.427 163.485 L
280.47 165.804 L
281.49 166.254 L
282.488 167.332 L
283.465 167.688 L
284.421 170.259 L
285.359 171.415 L
286.278 171.198 L
287.179 173.873 L
288.063 174.551 L
288.93 173.624 L
289.781 173.909 L
290.617 174.088 L
291.439 175.421 L
292.246 175.956 L
293.039 172.647 L
293.819 159.197 L
294.586 174.327 L
295.34 177.631 L
296.083 178.936 L
296.813 180.035 L
297.533 180.308 L
298.241 179.493 L
298.939 179.235 L
299.626 180.526 L
300.304 181.3 L
300.971 181.048 L
301.63 180.414 L
302.279 182.385 L
302.919 182.82 L
303.55 183.421 L
304.173 183.32 L
304.787 182.78 L
305.394 184.803 L
305.993 183.541 L
306.584 185.058 L
307.167 185.788 L
307.744 185.005 L
308.313 185.648 L
308.876 185.777 L
309.431 185.94 L
309.98 186.455 L
310.523 187.028 L
311.06 187.281 L
311.59 187.614 L
312.114 187.909 L
312.633 188.026 L
313.145 188.187 L
313.653 187.31 L
314.154 188.784 L
314.65 189.261 L
315.141 188.5 L
315.627 190.121 L
316.108 190.474 L
316.584 189.456 L
317.055 189.768 L
317.522 190.306 L
317.983 189.955 L
318.44 190.276 L
318.893 190.873 L
319.341 190.469 L
319.785 191.296 L
320.225 192.058 L
320.661 190.933 L
321.093 190.79 L
321.52 191.51 L
321.944 193.409 L
322.364 192.913 L
322.78 193.104 L
323.193 191.427 L
323.601 192.682 L
324.007 192.217 L
324.408 192.55 L
324.807 192.931 L
325.202 193.378 L
325.593 193.775 L
325.981 189.562 L
326.366 192.495 L
326.748 193.616 L
327.127 193.958 L
327.503 194.526 L
327.876 195.09 L
328.245 194.956 L
328.612 194.121 L
328.976 194.845 L
329.337 196.039 L
329.695 195.003 L
330.051 195.287 L
330.404 196.294 L
330.754 196.211 L
331.102 196.523 L
331.447 195.997 L
331.789 196.775 L
332.129 198.148 L
332.466 197.394 L
332.802 197.787 L
333.134 197.304 L
333.464 198.72 L
333.792 198.684 L
334.118 198.752 L
334.441 198.701 L
334.762 199.368 L
335.081 199.705 L
335.398 199.292 L
335.713 199.498 L
336.025 200.603 L
336.335 200.583 L
336.644 201.232 L
336.95 201.712 L
337.254 200.971 L
337.557 200.746 L
337.857 200.916 L
338.155 202.516 L
338.452 201.603 L
338.746 201.787 L
339.024 203.542 L
S
GR
GS
[1.00013 0 0 1 0 0] CT
0.906 0.549 0.608 RC
1 LJ
0.5 LW
N
136 38.012 M
154.814 58.223 L
168.163 69.331 L
178.517 76.162 L
186.977 81.175 L
194.129 86.035 L
200.325 88.705 L
205.791 93.707 L
210.679 98.139 L
215.102 102.488 L
219.139 106.501 L
222.853 109.314 L
226.292 112.045 L
229.493 114.157 L
232.488 113.002 L
235.301 110.421 L
237.953 107.552 L
240.462 106.044 L
242.842 102.733 L
245.106 106.281 L
247.265 113.383 L
249.327 119.407 L
251.302 123.529 L
253.196 129.92 L
255.016 134.763 L
256.767 138.856 L
258.455 141.222 L
260.083 143.095 L
261.656 146.249 L
263.178 148.071 L
264.651 150.111 L
266.079 150.801 L
267.464 152.065 L
268.809 153.847 L
270.116 154.248 L
271.387 155.053 L
272.625 156.158 L
273.83 156.898 L
275.005 158.315 L
276.151 157.523 L
277.269 160.525 L
278.361 162.447 L
279.427 162.637 L
280.47 164.454 L
281.49 165.068 L
282.488 166.114 L
283.465 166.629 L
284.421 169.047 L
285.359 170.147 L
286.278 169.98 L
287.179 172.523 L
288.063 173.324 L
288.93 172.29 L
289.781 172.801 L
290.617 172.8 L
291.439 174.194 L
292.246 174.723 L
293.039 171.268 L
293.819 157.962 L
294.586 172.972 L
295.34 176.407 L
296.083 177.755 L
296.813 178.626 L
297.533 179.045 L
298.241 178.151 L
298.939 177.755 L
299.626 179.301 L
300.304 180.216 L
300.971 179.699 L
301.63 179.004 L
302.279 180.934 L
302.919 181.516 L
303.55 182.038 L
304.173 181.95 L
304.787 181.2 L
305.394 183.397 L
305.993 182.214 L
306.584 183.737 L
307.167 184.517 L
307.744 183.739 L
308.313 184.583 L
308.876 184.269 L
309.431 184.242 L
309.98 184.931 L
310.523 185.633 L
311.06 185.89 L
311.59 186.187 L
312.114 186.218 L
312.633 186.664 L
313.145 186.887 L
313.653 186.181 L
314.154 187.294 L
314.65 187.787 L
315.141 187.104 L
315.627 188.477 L
316.108 189.004 L
316.584 188.098 L
317.055 188.223 L
317.522 188.962 L
317.983 188.584 L
318.44 188.877 L
318.893 189.669 L
319.341 188.895 L
319.785 190.036 L
320.225 190.389 L
320.661 189.494 L
321.093 189.22 L
321.52 189.807 L
321.944 191.648 L
322.364 191.71 L
322.78 191.562 L
323.193 190.292 L
323.601 191.222 L
324.007 190.934 L
324.408 190.897 L
324.807 191.623 L
325.202 192.044 L
325.593 192.242 L
325.981 187.986 L
326.366 191.091 L
326.748 192.114 L
327.127 192.556 L
327.503 193.18 L
327.876 193.313 L
328.245 193.122 L
328.612 192.709 L
328.976 193.54 L
329.337 194.308 L
329.695 193.454 L
330.051 193.875 L
330.404 194.664 L
330.754 194.61 L
331.102 195.099 L
331.447 194.604 L
331.789 195.328 L
332.129 196.672 L
332.466 195.704 L
332.802 196.17 L
333.134 196.026 L
333.464 197.229 L
333.792 197.151 L
334.118 197.198 L
334.441 197.474 L
334.762 197.871 L
335.081 198.268 L
335.398 197.752 L
335.713 198.214 L
336.025 199.156 L
336.335 198.964 L
336.644 199.607 L
336.95 200.189 L
337.254 199.5 L
337.557 199.254 L
337.857 199.364 L
338.155 201.197 L
338.452 200.103 L
338.746 200.423 L
339.024 202.085 L
S
GR
GS
[1.00013 0 0 1 0 0] CT
0.792 0 0.125 RC
1 LJ
2 LW
N
136 38.809 M
154.814 58.962 L
168.163 69.965 L
178.517 76.731 L
186.977 81.744 L
194.129 86.525 L
200.325 89.236 L
205.791 94.335 L
210.679 98.65 L
215.102 103.01 L
219.139 107.023 L
222.853 109.875 L
226.292 112.569 L
229.493 114.659 L
232.488 113.579 L
235.301 111.115 L
237.953 108.285 L
240.462 106.913 L
242.842 103.634 L
245.106 107.21 L
247.265 114.031 L
249.327 120.053 L
251.302 124.139 L
253.196 130.636 L
255.016 135.393 L
256.767 139.358 L
258.455 141.734 L
260.083 143.72 L
261.656 146.721 L
263.178 148.598 L
264.651 150.765 L
266.079 151.372 L
267.464 152.644 L
268.809 154.541 L
270.116 154.952 L
271.387 155.555 L
272.625 156.654 L
273.83 157.491 L
275.005 158.938 L
276.151 158.117 L
277.269 161.157 L
278.361 162.956 L
279.427 163.061 L
280.47 165.129 L
281.49 165.661 L
282.488 166.723 L
283.465 167.158 L
284.421 169.653 L
285.359 170.781 L
286.278 170.589 L
287.179 173.198 L
288.063 173.937 L
288.93 172.957 L
289.781 173.355 L
290.617 173.444 L
291.439 174.808 L
292.246 175.34 L
293.039 171.958 L
293.819 158.58 L
294.586 173.649 L
295.34 177.019 L
296.083 178.345 L
296.813 179.33 L
297.533 179.676 L
298.241 178.822 L
298.939 178.495 L
299.626 179.913 L
300.304 180.758 L
300.971 180.373 L
301.63 179.709 L
302.279 181.66 L
302.919 182.168 L
303.55 182.73 L
304.173 182.635 L
304.787 181.99 L
305.394 184.1 L
305.993 182.877 L
306.584 184.398 L
307.167 185.153 L
307.744 184.372 L
308.313 185.115 L
308.876 185.023 L
309.431 185.091 L
309.98 185.693 L
310.523 186.331 L
311.06 186.586 L
311.59 186.9 L
312.114 187.064 L
312.633 187.345 L
313.145 187.537 L
313.653 186.746 L
314.154 188.039 L
314.65 188.524 L
315.141 187.802 L
315.627 189.299 L
316.108 189.739 L
316.584 188.777 L
317.055 188.995 L
317.522 189.634 L
317.983 189.269 L
318.44 189.576 L
318.893 190.271 L
319.341 189.682 L
319.785 190.666 L
320.225 191.223 L
320.661 190.214 L
321.093 190.005 L
321.52 190.659 L
321.944 192.529 L
322.364 192.312 L
322.78 192.333 L
323.193 190.859 L
323.601 191.952 L
324.007 191.576 L
324.408 191.724 L
324.807 192.277 L
325.202 192.711 L
325.593 193.008 L
325.981 188.774 L
326.366 191.793 L
326.748 192.865 L
327.127 193.257 L
327.503 193.853 L
327.876 194.201 L
328.245 194.039 L
328.612 193.415 L
328.976 194.193 L
329.337 195.174 L
329.695 194.228 L
330.051 194.581 L
330.404 195.479 L
330.754 195.41 L
331.102 195.811 L
331.447 195.301 L
331.789 196.052 L
332.129 197.41 L
332.466 196.549 L
332.802 196.978 L
333.134 196.665 L
333.464 197.974 L
333.792 197.917 L
334.118 197.975 L
334.441 198.088 L
334.762 198.62 L
335.081 198.986 L
335.398 198.522 L
335.713 198.856 L
336.025 199.88 L
336.335 199.773 L
336.644 200.419 L
336.95 200.95 L
337.254 200.236 L
337.557 200 L
337.857 200.14 L
338.155 201.857 L
338.452 200.853 L
338.746 201.105 L
339.024 202.813 L
S
GR
GS
[1.00013 0 0 1 0 0] CT
1 GC
N
414.5 205.5 M
617.5 205.5 L
617.5 19 L
414.5 19 L
cp
f
GR
GS
[1.00013 0 0 1 0 0] CT
0.149 GC
2 setlinecap
1 LJ
0.5 LW
N
414.5 205.5 M
617.5 205.5 L
S
GR
GS
[1.00013 0 0 1 0 0] CT
0.149 GC
2 setlinecap
1 LJ
0.5 LW
N
414.5 205.5 M
414.5 203.47 L
S
GR
GS
[1.00013 0 0 1 0 0] CT
0.149 GC
2 setlinecap
1 LJ
0.5 LW
N
516 205.5 M
516 203.47 L
S
GR
GS
[1.00013 0 0 1 0 0] CT
0.149 GC
2 setlinecap
1 LJ
0.5 LW
N
617.5 205.5 M
617.5 203.47 L
S
GR
GS
[1.00013 0 0 1 414.55264 211.09993] CT
0.149 GC
/Helvetica 18 F
GS
[1 0 0 1 0 0] CT
-5.5 18 moveto 
1 -1 scale
(0) t 
GR
GR
GS
[1.00013 0 0 1 516.06553 211.09993] CT
0.149 GC
/Helvetica 18 F
GS
[1 0 0 1 0 0] CT
-13 18 moveto 
1 -1 scale
(0.1) t 
GR
GR
GS
[1.00013 0 0 1 617.57842 211.09993] CT
0.149 GC
/Helvetica 18 F
GS
[1 0 0 1 0 0] CT
-13 18 moveto 
1 -1 scale
(0.2) t 
GR
GR
GS
[1.00013 0 0 1 516.06565 233.59991] CT
0.149 GC
/Helvetica 18 F
GS
[1 0 0 1 0 0] CT
-72.5 18 moveto 
1 -1 scale
(Frequency \(log10\)) t 
GR
GR
GS
[1.00013 0 0 1 0 0] CT
0.149 GC
2 setlinecap
1 LJ
0.5 LW
N
414.5 205.5 M
414.5 19 L
S
GR
GS
[1.00013 0 0 1 0 0] CT
0.149 GC
2 setlinecap
1 LJ
0.5 LW
N
414.5 205.5 M
416.53 205.5 L
S
GR
GS
[1.00013 0 0 1 0 0] CT
0.149 GC
2 setlinecap
1 LJ
0.5 LW
N
414.5 158.875 M
416.53 158.875 L
S
GR
GS
[1.00013 0 0 1 0 0] CT
0.149 GC
2 setlinecap
1 LJ
0.5 LW
N
414.5 112.25 M
416.53 112.25 L
S
GR
GS
[1.00013 0 0 1 0 0] CT
0.149 GC
2 setlinecap
1 LJ
0.5 LW
N
414.5 65.625 M
416.53 65.625 L
S
GR
GS
[1.00013 0 0 1 0 0] CT
0.149 GC
2 setlinecap
1 LJ
0.5 LW
N
414.5 19 M
416.53 19 L
S
GR
GS
[1.00013 0 0 1 408.95192 205.5] CT
0.149 GC
/Helvetica 18 F
GS
[1 0 0 1 0 0] CT
-33 7 moveto 
1 -1 scale
(-7.5) t 
GR
GR
GS
[1.00013 0 0 1 408.95192 158.87505] CT
0.149 GC
/Helvetica 18 F
GS
[1 0 0 1 0 0] CT
-33 7 moveto 
1 -1 scale
(-7.4) t 
GR
GR
GS
[1.00013 0 0 1 408.95192 112.25009] CT
0.149 GC
/Helvetica 18 F
GS
[1 0 0 1 0 0] CT
-33 7 moveto 
1 -1 scale
(-7.3) t 
GR
GR
GS
[1.00013 0 0 1 408.95192 65.62491] CT
0.149 GC
/Helvetica 18 F
GS
[1 0 0 1 0 0] CT
-33 7 moveto 
1 -1 scale
(-7.2) t 
GR
GR
GS
[1.00013 0 0 1 408.95192 18.99996] CT
0.149 GC
/Helvetica 18 F
GS
[1 0 0 1 0 0] CT
-33 7 moveto 
1 -1 scale
(-7.1) t 
GR
GR
GS
[0 -1 1.00013 0 373.44741 112.24987] CT
0.149 GC
/Helvetica 18 F
GS
[1 0 0 1 0 0] CT
-71 -4 moveto 
1 -1 scale
(Power \(log10; Hz\)) t 
GR
GR
GS
[1.00013 0 0 1 0 0] CT
0.02 0.443 0.69 RC
1 LJ
3 LW
N
414.5 48.25 M
593.233 156.508 L
617.524 169.181 L
S
GR
GS
[1.00013 0 0 1 0 0] CT
0.573 0.773 0.871 RC
1 LJ
3 LW
N
414.5 65.181 M
593.233 164.649 L
617.524 176.352 L
S
GR
GS
[1.00013 0 0 1 0 0] CT
0.957 0.647 0.51 RC
1 LJ
3 LW
N
414.5 62.148 M
593.233 161.186 L
617.524 172.511 L
S
GR
GS
[1.00013 0 0 1 0 0] CT
0.792 0 0.125 RC
1 LJ
3 LW
N
414.5 71.673 M
593.233 172.698 L
617.524 183.263 L
S
GR
GS
[1.00013 0 0 1 0 0] CT
1 GC
N
693 205.5 M
896 205.5 L
896 19 L
693 19 L
cp
f
GR
GS
[1.00013 0 0 1 0 0] CT
0.149 GC
2 setlinecap
1 LJ
0.5 LW
N
693 205.5 M
896 205.5 L
S
GR
GS
[1.00013 0 0 1 0 0] CT
0.149 GC
2 setlinecap
1 LJ
0.5 LW
N
693 205.5 M
693 203.47 L
S
GR
GS
[1.00013 0 0 1 0 0] CT
0.149 GC
2 setlinecap
1 LJ
0.5 LW
N
743.75 205.5 M
743.75 203.47 L
S
GR
GS
[1.00013 0 0 1 0 0] CT
0.149 GC
2 setlinecap
1 LJ
0.5 LW
N
794.5 205.5 M
794.5 203.47 L
S
GR
GS
[1.00013 0 0 1 0 0] CT
0.149 GC
2 setlinecap
1 LJ
0.5 LW
N
845.25 205.5 M
845.25 203.47 L
S
GR
GS
[1.00013 0 0 1 693.08801 211.10022] CT
0.149 GC
/Helvetica 18 F
GS
[1 0 0 1 0 0] CT
-13 18 moveto 
1 -1 scale
(1.5) t 
GR
GR
GS
[1.00013 0 0 1 743.84445 211.10022] CT
0.149 GC
/Helvetica 18 F
GS
[1 0 0 1 0 0] CT
-13 18 moveto 
1 -1 scale
(1.6) t 
GR
GR
GS
[1.00013 0 0 1 794.6009 211.10022] CT
0.149 GC
/Helvetica 18 F
GS
[1 0 0 1 0 0] CT
-13 18 moveto 
1 -1 scale
(1.7) t 
GR
GR
GS
[1.00013 0 0 1 845.35734 211.10022] CT
0.149 GC
/Helvetica 18 F
GS
[1 0 0 1 0 0] CT
-13 18 moveto 
1 -1 scale
(1.8) t 
GR
GR
GS
[1.00013 0 0 1 794.60096 233.60014] CT
0.149 GC
/Helvetica 18 F
GS
[1 0 0 1 0 0] CT
-72.5 18 moveto 
1 -1 scale
(Frequency \(log10\)) t 
GR
GR
GS
[1.00013 0 0 1 0 0] CT
0.149 GC
2 setlinecap
1 LJ
0.5 LW
N
693 205.5 M
693 19 L
S
GR
GS
[1.00013 0 0 1 0 0] CT
0.149 GC
2 setlinecap
1 LJ
0.5 LW
N
693 205.5 M
695.03 205.5 L
S
GR
GS
[1.00013 0 0 1 0 0] CT
0.149 GC
2 setlinecap
1 LJ
0.5 LW
N
693 143.333 M
695.03 143.333 L
S
GR
GS
[1.00013 0 0 1 0 0] CT
0.149 GC
2 setlinecap
1 LJ
0.5 LW
N
693 81.167 M
695.03 81.167 L
S
GR
GS
[1.00013 0 0 1 0 0] CT
0.149 GC
2 setlinecap
1 LJ
0.5 LW
N
693 19 M
695.03 19 L
S
GR
GS
[1.00013 0 0 1 687.48732 205.5] CT
0.149 GC
/Helvetica 18 F
GS
[1 0 0 1 0 0] CT
-18 7 moveto 
1 -1 scale
(-9) t 
GR
GR
GS
[1.00013 0 0 1 687.48732 143.3331] CT
0.149 GC
/Helvetica 18 F
GS
[1 0 0 1 0 0] CT
-33 7 moveto 
1 -1 scale
(-8.9) t 
GR
GR
GS
[1.00013 0 0 1 687.48732 81.16679] CT
0.149 GC
/Helvetica 18 F
GS
[1 0 0 1 0 0] CT
-33 7 moveto 
1 -1 scale
(-8.8) t 
GR
GR
GS
[1.00013 0 0 1 687.48732 18.99988] CT
0.149 GC
/Helvetica 18 F
GS
[1 0 0 1 0 0] CT
-33 7 moveto 
1 -1 scale
(-8.7) t 
GR
GR
GS
[0 -1 1.00013 0 651.98281 112.24964] CT
0.149 GC
/Helvetica 18 F
GS
[1 0 0 1 0 0] CT
-71 -4 moveto 
1 -1 scale
(Power \(log10; Hz\)) t 
GR
GR
GS
[1.00013 0 0 1 0 0] CT
0.02 0.443 0.69 RC
1 LJ
3 LW
N
692.976 26.146 M
695.614 31.78 L
699.031 38.859 L
702.396 47.318 L
705.71 49.229 L
708.976 49.865 L
712.193 61.468 L
715.365 60.6 L
718.491 69.784 L
721.574 69.012 L
724.614 67.028 L
727.612 68.714 L
730.571 74.885 L
733.49 78.296 L
736.371 73.953 L
739.215 83.929 L
742.023 84.156 L
744.795 88.704 L
747.533 87.477 L
750.238 93.864 L
752.909 93.695 L
755.549 92.387 L
758.157 89.371 L
760.735 102.187 L
763.283 108.523 L
765.802 100.507 L
768.293 100.169 L
770.755 106.09 L
773.191 112.207 L
775.6 112.083 L
777.982 103.283 L
780.34 113.55 L
782.672 109.339 L
784.98 112.365 L
787.264 115.919 L
789.524 121.113 L
791.762 123.305 L
793.977 122.082 L
796.17 123.709 L
798.342 124.298 L
800.492 133.502 L
802.622 128.328 L
804.731 117.513 L
806.82 122.317 L
808.89 128.999 L
810.94 130.039 L
812.971 128.178 L
814.984 129.186 L
816.979 133.008 L
818.955 141.107 L
820.915 139.844 L
822.857 145.579 L
824.781 136.296 L
826.69 136.889 L
828.582 145.53 L
830.457 147.46 L
832.317 145.054 L
834.162 119.121 L
835.991 140.971 L
837.805 148.48 L
839.604 148.665 L
841.389 147.347 L
843.159 158.035 L
844.915 159.576 L
846.658 160.876 L
848.386 157.532 L
850.102 155.627 L
851.804 155.361 L
853.492 151.884 L
855.169 160.612 L
856.832 161.924 L
858.483 163.968 L
860.122 164.918 L
861.748 170.499 L
863.363 168.513 L
864.966 173.22 L
866.557 172.063 L
868.137 172.509 L
869.706 172.53 L
871.264 181.377 L
872.81 176.062 L
874.346 180.373 L
875.872 174.309 L
877.386 175.449 L
878.891 172.838 L
880.385 187.254 L
881.869 187.609 L
883.344 190.677 L
884.808 190.447 L
886.263 198.566 L
887.708 198.139 L
889.144 196.632 L
890.571 203.342 L
891.988 198.303 L
893.396 195.703 L
894.796 201.982 L
896.024 203.443 L
S
GR
GS
[1.00013 0 0 1 0 0] CT
0.573 0.773 0.871 RC
1 LJ
3 LW
N
692.976 30.974 M
695.614 32.43 L
699.031 36.793 L
702.396 52.467 L
705.71 42.378 L
708.976 45.025 L
712.193 47.814 L
715.365 56.889 L
718.491 50.546 L
721.574 53.865 L
724.614 53.067 L
727.612 56.867 L
730.571 57.15 L
733.49 76.973 L
736.371 72.953 L
739.215 73.75 L
742.023 79.599 L
744.795 84.61 L
747.533 75.774 L
750.238 82.255 L
752.909 75.704 L
755.549 82.103 L
758.157 80.56 L
760.735 89.912 L
763.283 87.253 L
765.802 81.551 L
768.293 92.815 L
770.755 97.831 L
773.191 95.543 L
775.6 101.676 L
777.982 96.669 L
780.34 104.52 L
782.672 105.027 L
784.98 103.157 L
787.264 95.726 L
789.524 103.823 L
791.762 116.911 L
793.977 118.492 L
796.17 117.232 L
798.342 111.771 L
800.492 110.676 L
802.622 116.758 L
804.731 115.937 L
806.82 119.713 L
808.89 118.835 L
810.94 120.205 L
812.971 126.176 L
814.984 127.517 L
816.979 126.362 L
818.955 130.451 L
820.915 133.168 L
822.857 126.705 L
824.781 121.972 L
826.69 126.436 L
828.582 137.227 L
830.457 135.8 L
832.317 133.835 L
834.162 115.078 L
835.991 131.954 L
837.805 135.177 L
839.604 129.638 L
841.389 139.715 L
843.159 141.674 L
844.915 138.416 L
846.658 137.997 L
848.386 148.616 L
850.102 137.036 L
851.804 134.905 L
853.492 150.752 L
855.169 157.378 L
856.832 151.74 L
858.483 149.041 L
860.122 147.871 L
861.748 156.639 L
863.363 154.081 L
864.966 163.449 L
866.557 156.025 L
868.137 151.69 L
869.706 161.484 L
871.264 164.321 L
872.81 163.572 L
874.346 161.634 L
875.872 164.175 L
877.386 168.475 L
878.891 176.53 L
880.385 185.241 L
881.869 185.082 L
883.344 175.459 L
884.808 182.18 L
886.263 178.737 L
887.708 178.946 L
889.144 176.46 L
890.571 179.639 L
891.988 177.102 L
893.396 185.614 L
894.796 190.789 L
896.024 183.598 L
S
GR
GS
[1.00013 0 0 1 0 0] CT
0.957 0.647 0.51 RC
1 LJ
3 LW
N
692.976 27.679 M
695.614 29.245 L
699.031 39.004 L
702.396 38.587 L
705.71 40.235 L
708.976 42.461 L
712.193 40.505 L
715.365 45.308 L
718.491 39.538 L
721.574 40.364 L
724.614 54.624 L
727.612 59.825 L
730.571 60.22 L
733.49 70.835 L
736.371 73.51 L
739.215 73.466 L
742.023 76.251 L
744.795 73.52 L
747.533 72.059 L
750.238 71.201 L
752.909 76.587 L
755.549 84.646 L
758.157 82.225 L
760.735 83.092 L
763.283 87.469 L
765.802 90.808 L
768.293 95.651 L
770.755 99.951 L
773.191 99.079 L
775.6 92.421 L
777.982 100.37 L
780.34 102.273 L
782.672 99.975 L
784.98 105.645 L
787.264 104.685 L
789.524 99.913 L
791.762 97.279 L
793.977 100.679 L
796.17 101.144 L
798.342 109.863 L
800.492 110.196 L
802.622 102.001 L
804.731 112.126 L
806.82 122.139 L
808.89 120.69 L
810.94 119.295 L
812.971 113.547 L
814.984 117.663 L
816.979 118.616 L
818.955 127.822 L
820.915 124.826 L
822.857 126.478 L
824.781 130.031 L
826.69 124.826 L
828.582 125.267 L
830.457 135.853 L
832.317 125.356 L
834.162 109.974 L
835.991 134.002 L
837.805 132.248 L
839.604 129.826 L
841.389 138.804 L
843.159 147.637 L
844.915 133.586 L
846.658 136.057 L
848.386 138.583 L
850.102 142.012 L
851.804 142.748 L
853.492 140.939 L
855.169 138.332 L
856.832 152.214 L
858.483 156.646 L
860.122 153.706 L
861.748 149.143 L
863.363 147.456 L
864.966 149.657 L
866.557 149.758 L
868.137 164.236 L
869.706 166 L
871.264 165.555 L
872.81 166.472 L
874.346 165.161 L
875.872 166.547 L
877.386 169.901 L
878.891 171.793 L
880.385 175.912 L
881.869 170.955 L
883.344 166.774 L
884.808 174.064 L
886.263 180.617 L
887.708 180.11 L
889.144 182.977 L
890.571 179.289 L
891.988 178.906 L
893.396 182.139 L
894.796 183.815 L
896.024 185.314 L
S
GR
GS
[1.00013 0 0 1 0 0] CT
0.792 0 0.125 RC
1 LJ
3 LW
N
692.976 28.766 M
695.614 33.768 L
699.031 36.082 L
702.396 30.372 L
705.71 28.186 L
708.976 37.666 L
712.193 43.31 L
715.365 40.741 L
718.491 36.298 L
721.574 49.337 L
724.614 52.735 L
727.612 56.492 L
730.571 55.854 L
733.49 51.548 L
736.371 65.651 L
739.215 57.476 L
742.023 67.639 L
744.795 72.685 L
747.533 67.467 L
750.238 72.434 L
752.909 71.819 L
755.549 72.271 L
758.157 76.296 L
760.735 80.557 L
763.283 82.262 L
765.802 84.365 L
768.293 85.456 L
770.755 87.335 L
773.191 88.619 L
775.6 83.33 L
777.982 91.976 L
780.34 95.217 L
782.672 90.391 L
784.98 100.399 L
787.264 103.337 L
789.524 96.909 L
791.762 98.367 L
793.977 102.635 L
796.17 100.198 L
798.342 102.252 L
800.492 106.892 L
802.622 102.959 L
804.731 109.535 L
806.82 113.259 L
808.89 106.511 L
810.94 105.115 L
812.971 109.484 L
814.984 121.983 L
816.979 120.532 L
818.955 120.674 L
820.915 110.827 L
822.857 118.127 L
824.781 115.614 L
826.69 116.602 L
828.582 120.301 L
830.457 123.201 L
832.317 125.19 L
834.162 96.888 L
835.991 117.067 L
837.805 124.23 L
839.604 126.851 L
841.389 130.835 L
843.159 133.164 L
844.915 132.08 L
846.658 127.91 L
848.386 133.105 L
850.102 139.661 L
851.804 133.344 L
853.492 135.701 L
855.169 141.703 L
856.832 141.243 L
858.483 143.921 L
860.122 140.51 L
861.748 145.53 L
863.363 154.607 L
864.966 148.854 L
866.557 151.724 L
868.137 149.628 L
869.706 158.379 L
871.264 157.999 L
872.81 158.384 L
874.346 159.138 L
875.872 162.693 L
877.386 165.145 L
878.891 162.039 L
880.385 164.27 L
881.869 171.115 L
883.344 170.404 L
884.808 174.722 L
886.263 178.271 L
887.708 173.493 L
889.144 171.92 L
890.571 172.855 L
891.988 184.33 L
893.396 177.62 L
894.796 179.306 L
896.024 189.936 L
S
GR
GS
[1.00013 0 0 1 737.09359 119.75] CT
/Helvetica 18 F
GS
[1 0 0 1 0 0] CT
0 7 moveto 
1 -1 scale
(1) t 
GR
GR
GS
[1.00013 0 0 1 0 0] CT
0.02 0.443 0.69 RC
1 LJ
3 LW
N
704 119.75 M
734 119.75 L
S
GR
GS
[1.00013 0 0 1 737.09359 141.75] CT
/Helvetica 18 F
GS
[1 0 0 1 0 0] CT
0 7 moveto 
1 -1 scale
(2) t 
GR
GR
GS
[1.00013 0 0 1 0 0] CT
0.573 0.773 0.871 RC
1 LJ
3 LW
N
704 141.75 M
734 141.75 L
S
GR
GS
[1.00013 0 0 1 737.09359 163.75] CT
/Helvetica 18 F
GS
[1 0 0 1 0 0] CT
0 7 moveto 
1 -1 scale
(3) t 
GR
GR
GS
[1.00013 0 0 1 0 0] CT
0.957 0.647 0.51 RC
1 LJ
3 LW
N
704 163.75 M
734 163.75 L
S
GR
GS
[1.00013 0 0 1 737.09359 185.75] CT
/Helvetica 18 F
GS
[1 0 0 1 0 0] CT
0 7 moveto 
1 -1 scale
(4) t 
GR
GR
GS
[1.00013 0 0 1 0 0] CT
0.792 0 0.125 RC
1 LJ
3 LW
N
704 185.75 M
734 185.75 L
S
GR
%%Trailer
%%Pages: 1
%%EOF
