/home/mpib/kosciessa/.virtualenvs/fooof/lib/python3.7/site-packages/fooof/objs/group.py:379: VisibleDeprecationWarning: Creating an ndarray from ragged nested sequences (which is a list-or-tuple of lists-or-tuples-or ndarrays with different lengths or shapes) is deprecated. If you meant to do this, you must specify 'dtype=object' when creating the ndarray.
  for index, data in enumerate(self.group_results)])
/home/mpib/kosciessa/.virtualenvs/fooof/lib/python3.7/site-packages/fooof/objs/group.py:379: VisibleDeprecationWarning: Creating an ndarray from ragged nested sequences (which is a list-or-tuple of lists-or-tuples-or ndarrays with different lengths or shapes) is deprecated. If you meant to do this, you must specify 'dtype=object' when creating the ndarray.
  for index, data in enumerate(self.group_results)])
/home/mpib/kosciessa/.virtualenvs/fooof/lib/python3.7/site-packages/fooof/objs/group.py:379: VisibleDeprecationWarning: Creating an ndarray from ragged nested sequences (which is a list-or-tuple of lists-or-tuples-or ndarrays with different lengths or shapes) is deprecated. If you meant to do this, you must specify 'dtype=object' when creating the ndarray.
  for index, data in enumerate(self.group_results)])
/home/mpib/kosciessa/.virtualenvs/fooof/lib/python3.7/site-packages/fooof/objs/group.py:379: VisibleDeprecationWarning: Creating an ndarray from ragged nested sequences (which is a list-or-tuple of lists-or-tuples-or ndarrays with different lengths or shapes) is deprecated. If you meant to do this, you must specify 'dtype=object' when creating the ndarray.
  for index, data in enumerate(self.group_results)])
b_runFOOOF.py
/home/mpib/LNDG/stateswitch/stsw_eeg_task/aperiodic_fooof
2139
Setting up paths ...

Loading backgrounds from .mat ...

Running FOOOFGroup across 60 power spectra.

FOOOF WARNING: Lower-bound peak width limit is < or ~= the frequency resolution: 0.50 <= 0.50
	Lower bounds below frequency-resolution have no effect (effective lower bound is the frequency resolution).
	Too low a limit may lead to overfitting noise as small bandwidth peaks.
	We recommend a lower bound of approximately 2x the frequency resolution.

==================================================================================================
                                                                                                  
                                       FOOOF - GROUP RESULTS                                      
                                                                                                  
                             Number of power spectra in the Group: 60                             
                                                                                                  
                        The model was run on the frequency range 2 - 80 Hz                        
                                 Frequency Resolution is 0.50 Hz                                  
                                                                                                  
                              Power spectra were fit without a knee.                              
                                                                                                  
                                      Aperiodic Fit Values:                                       
                        Exponents - Min:  0.102, Max:  1.146, Mean: 0.764                         
                                                                                                  
                        In total 1022 peaks were extracted from the group                         
                                                                                                  
                                     Goodness of fit metrics:                                     
                            R2s -  Min:  0.545, Max:  0.994, Mean: 0.944                          
                         Errors -  Min:  0.024, Max:  0.060, Mean: 0.037                          
                                                                                                  
==================================================================================================
Running FOOOFGroup across 60 power spectra.

FOOOF WARNING: Lower-bound peak width limit is < or ~= the frequency resolution: 0.50 <= 0.50
	Lower bounds below frequency-resolution have no effect (effective lower bound is the frequency resolution).
	Too low a limit may lead to overfitting noise as small bandwidth peaks.
	We recommend a lower bound of approximately 2x the frequency resolution.

==================================================================================================
                                                                                                  
                                       FOOOF - GROUP RESULTS                                      
                                                                                                  
                             Number of power spectra in the Group: 60                             
                                                                                                  
                        The model was run on the frequency range 2 - 80 Hz                        
                                 Frequency Resolution is 0.50 Hz                                  
                                                                                                  
                              Power spectra were fit without a knee.                              
                                                                                                  
                                      Aperiodic Fit Values:                                       
                        Exponents - Min:  0.087, Max:  1.175, Mean: 0.723                         
                                                                                                  
                        In total 1036 peaks were extracted from the group                         
                                                                                                  
                                     Goodness of fit metrics:                                     
                            R2s -  Min:  0.333, Max:  0.993, Mean: 0.907                          
                         Errors -  Min:  0.027, Max:  0.076, Mean: 0.042                          
                                                                                                  
==================================================================================================
Running FOOOFGroup across 60 power spectra.

FOOOF WARNING: Lower-bound peak width limit is < or ~= the frequency resolution: 0.50 <= 0.50
	Lower bounds below frequency-resolution have no effect (effective lower bound is the frequency resolution).
	Too low a limit may lead to overfitting noise as small bandwidth peaks.
	We recommend a lower bound of approximately 2x the frequency resolution.

==================================================================================================
                                                                                                  
                                       FOOOF - GROUP RESULTS                                      
                                                                                                  
                             Number of power spectra in the Group: 60                             
                                                                                                  
                        The model was run on the frequency range 2 - 80 Hz                        
                                 Frequency Resolution is 0.50 Hz                                  
                                                                                                  
                              Power spectra were fit without a knee.                              
                                                                                                  
                                      Aperiodic Fit Values:                                       
                        Exponents - Min:  0.091, Max:  1.167, Mean: 0.742                         
                                                                                                  
                        In total 1032 peaks were extracted from the group                         
                                                                                                  
                                     Goodness of fit metrics:                                     
                            R2s -  Min:  0.540, Max:  0.987, Mean: 0.934                          
                         Errors -  Min:  0.032, Max:  0.067, Mean: 0.041                          
                                                                                                  
==================================================================================================
Running FOOOFGroup across 60 power spectra.

FOOOF WARNING: Lower-bound peak width limit is < or ~= the frequency resolution: 0.50 <= 0.50
	Lower bounds below frequency-resolution have no effect (effective lower bound is the frequency resolution).
	Too low a limit may lead to overfitting noise as small bandwidth peaks.
	We recommend a lower bound of approximately 2x the frequency resolution.

==================================================================================================
                                                                                                  
                                       FOOOF - GROUP RESULTS                                      
                                                                                                  
                             Number of power spectra in the Group: 60                             
                                                                                                  
                        The model was run on the frequency range 2 - 80 Hz                        
                                 Frequency Resolution is 0.50 Hz                                  
                                                                                                  
                              Power spectra were fit without a knee.                              
                                                                                                  
                                      Aperiodic Fit Values:                                       
                        Exponents - Min:  0.102, Max:  1.146, Mean: 0.738                         
                                                                                                  
                         In total 976 peaks were extracted from the group                         
                                                                                                  
                                     Goodness of fit metrics:                                     
                            R2s -  Min:  0.748, Max:  0.992, Mean: 0.945                          
                         Errors -  Min:  0.023, Max:  0.060, Mean: 0.037                          
                                                                                                  
==================================================================================================
2139Done!
