{"freq_range": [2.0, 80.0], "freq_res": 0.5, "aperiodic_params_": [-7.915988525918981, 0.17674928802673423], "gaussian_params_": [[7.5235188286015955, 0.1520679030948569, 0.7615033114360779], [20.668813248439555, 0.3170044499251488, 1.9966312471708298], [24.771494753675043, 0.2947210242720694, 1.51161292076142], [28.304284170016444, 0.1904723380984556, 1.0573079877207443], [32.49132373697421, 0.2264733581304625, 1.8981218840771863], [38.07962485273372, 0.2574531229414029, 1.0442101251567195], [40.47153521597334, 0.1833193337846827, 0.309773352628375], [43.50227893364482, 0.19704178317442436, 1.3451599649163635], [46.801431716718426, 0.2066688868131192, 0.6049923507536504], [49.30682959243551, 0.2974441152757909, 0.6519573331811762], [52.596649506816526, 0.2518301405211464, 1.1363388124205986], [56.41297146021826, 0.12599774672867073, 1.2717751457650797], [58.913067633115816, 0.13696568199796258, 0.25000000000000006], [61.84935775750251, 0.13005743581731133, 1.9087487996192496], [67.67801661328754, 0.10494244575439618, 0.6866372844757224]], "peak_params_": [[7.5235188286015955, 0.15199539423053032, 1.5230066228721557], [20.668813248439555, 0.3213118724352473, 3.9932624943416597], [24.771494753675043, 0.3230562303395663, 3.02322584152284], [28.304284170016444, 0.22627508748145786, 2.1146159754414886], [32.49132373697421, 0.2265442811466052, 3.7962437681543726], [38.07962485273372, 0.2601094980225538, 2.088420250313439], [40.47153521597334, 0.21644330878555795, 0.61954670525675], [43.50227893364482, 0.1970419450029457, 2.690319929832727], [46.801431716718426, 0.20310633902060005, 1.2099847015073009], [49.30682959243551, 0.2908347093850461, 1.3039146663623524], [52.596649506816526, 0.25203201351386895, 2.2726776248411973], [56.41297146021826, 0.12895530701230662, 2.5435502915301593], [58.913067633115816, 0.1875276912996462, 0.5000000000000001], [61.84935775750251, 0.12966114323449673, 3.817497599238499], [67.67801661328754, 0.10310002947231034, 1.3732745689514447]], "r_squared_": 0.7174963324695081, "error_": 0.04719852539265157}
{"freq_range": [2.0, 80.0], "freq_res": 0.5, "aperiodic_params_": [-8.216556632535463, 0.37600732368027445], "gaussian_params_": [[2.726017299567972, 0.2568209841025196, 1.6045284758720835], [8.088872179176553, 0.1955570882787486, 0.4747090224289632], [9.283555029866552, 0.16713928427664024, 0.4610810493296164], [23.729203339628725, 0.35781705574143213, 2.96065680725184], [28.683641016128135, 0.08637486217779347, 0.8931185465514239], [32.32896035985194, 0.1261560216517814, 1.504864092197662], [37.240997579968315, 0.163357005468349, 0.4247471346695434], [38.758009160449994, 0.21614176166122273, 0.452310552715443], [46.72072583739205, 0.093115384993787, 4.106579865186144], [49.40336569259536, 0.17241999264285857, 0.5272088732763305], [53.000165878087174, 0.17826246978859392, 0.7048442461280042], [57.72602772693646, 0.062088407445687784, 2.603410874016198], [61.30645705682665, 0.10437872100244722, 1.0352767625898358], [63.857086260338534, 0.15137398233657645, 0.392122704595854], [67.6236630359299, 0.12952168227599214, 0.663859721723178]], "peak_params_": [[2.726017299567972, 0.25428564261423325, 3.209056951744167], [8.088872179176553, 0.19678753317185382, 0.9494180448579264], [9.283555029866552, 0.15209746652902467, 0.9221620986592328], [23.729203339628725, 0.35674642793888367, 5.92131361450368], [28.683641016128135, 0.1872111340680931, 1.7862370931028477], [32.32896035985194, 0.13003076170619643, 3.009728184395324], [37.240997579968315, 0.14587180020518176, 0.8494942693390868], [38.758009160449994, 0.20326038837519, 0.904621105430886], [46.72072583739205, 0.09298671640859801, 8.213159730372288], [49.40336569259536, 0.24402623877695717, 1.054417746552661], [53.000165878087174, 0.219141815887534, 1.4096884922560085], [57.72602772693646, 0.06494677695831541, 5.206821748032396], [61.30645705682665, 0.12442565029713393, 2.0705535251796716], [63.857086260338534, 0.14860111983460733, 0.784245409191708], [67.6236630359299, 0.12734813153187652, 1.327719443446356]], "r_squared_": 0.9379262876562952, "error_": 0.03718717659683375}
{"freq_range": [2.0, 80.0], "freq_res": 0.5, "aperiodic_params_": [-8.039528731017114, 0.12860953121268803], "gaussian_params_": [[20.575846302366486, 0.31745915149068665, 2.0794962940445334], [24.74081688874033, 0.3174998938716537, 1.7653530512469824], [28.2115100006454, 0.1773339258046875, 0.977213252785656], [32.08052833406937, 0.2505724148731384, 2.1225555224202517], [38.01037066157197, 0.2661483779991483, 1.049330928635252], [40.38095423951256, 0.19269894966891335, 0.25000000000000006], [43.390154391758706, 0.18661865025823973, 1.6090253717020415], [46.824438421803265, 0.20526764073967627, 0.6283357210246941], [49.272834888486734, 0.3138900395520192, 0.689430966523773], [52.7710381181715, 0.26803243047015624, 1.134420569797665], [56.64163490383492, 0.16854984595257716, 1.0774720310721002], [58.94784910645304, 0.15149289620027606, 0.25000000000000006], [61.46828087028985, 0.13863642597303766, 1.2501132490400728], [63.750774634519, 0.16879945313393335, 0.3875156912246695]], "peak_params_": [[20.575846302366486, 0.33497496096334345, 4.158992588089067], [24.74081688874033, 0.3686241885332002, 3.5307061024939648], [28.2115100006454, 0.27100939940791857, 1.954426505571312], [32.08052833406937, 0.2505564975686063, 4.245111044840503], [38.01037066157197, 0.27194695643040756, 2.098661857270504], [40.38095423951256, 0.22527462970612078, 0.5000000000000001], [43.390154391758706, 0.18618488588383286, 3.218050743404083], [46.824438421803265, 0.2138461934833451, 1.2566714420493883], [49.272834888486734, 0.30166216276218094, 1.378861933047546], [52.7710381181715, 0.2631860238850008, 2.26884113959533], [56.64163490383492, 0.16835895504926235, 2.1549440621442004], [58.94784910645304, 0.18333305142910028, 0.5000000000000001], [61.46828087028985, 0.1385982983209324, 2.5002264980801456], [63.750774634519, 0.1550979054270858, 0.775031382449339]], "r_squared_": 0.7115209592436896, "error_": 0.04860691051748707}
{"freq_range": [2.0, 80.0], "freq_res": 0.5, "aperiodic_params_": [-8.176486230719535, 0.1905311600769414], "gaussian_params_": [[7.7288306308009735, 0.21598768713281163, 0.28631362238624747], [20.591097669321783, 0.31663412402089, 1.9261966573232312], [24.875285129867944, 0.2961757284775332, 1.6032569111495072], [28.390233378512615, 0.17516811299373305, 1.0006679956237208], [32.229004463766415, 0.2051010161478779, 1.9545683239800917], [34.980393251061365, 0.06489447261727294, 0.25000000000000006], [37.32253011051546, 0.2198023414945273, 0.5818124191695139], [38.67204546795899, 0.23391902938028747, 0.44361888973961633], [40.358616292404335, 0.1998820130567928, 0.28857397509716254], [43.46256175204641, 0.18389158518015705, 1.3581358131244257], [46.79284665382189, 0.20187659603873295, 0.5992977807391692], [49.261969656527775, 0.28259271794471685, 0.7317862628525059], [52.69947005662051, 0.2527066199897162, 1.0660701934446586], [56.601793439979055, 0.14441889782757142, 1.0541387092503074], [58.93936336251211, 0.15731417981051057, 0.2519593678206315], [61.43633518094705, 0.12720682675614253, 1.1656251280858472], [63.74514382330672, 0.1587505468636441, 0.40053859557290633]], "peak_params_": [[7.7288306308009735, 0.1569357621244727, 0.5726272447724949], [20.591097669321783, 0.3234311078134535, 3.8523933146464624], [24.875285129867944, 0.31912600084054255, 3.2065138222990144], [28.390233378512615, 0.23041483275209984, 2.0013359912474415], [32.229004463766415, 0.20397499410451836, 3.9091366479601835], [34.980393251061365, 0.139852033097851, 0.5000000000000001], [37.32253011051546, 0.22236160454821174, 1.1636248383390277], [38.67204546795899, 0.24675430509827123, 0.8872377794792327], [40.358616292404335, 0.19438461350142688, 0.5771479501943251], [43.46256175204641, 0.1838217992523674, 2.7162716262488513], [46.79284665382189, 0.19873507525872824, 1.1985955614783383], [49.261969656527775, 0.2708460187274504, 1.4635725257050118], [52.69947005662051, 0.24841184289674167, 2.132140386889317], [56.601793439979055, 0.14420273824029373, 2.108277418500615], [58.93936336251211, 0.17799792509024925, 0.503918735641263], [61.43633518094705, 0.12702020980329287, 2.3312502561716943], [63.74514382330672, 0.15817436790830364, 0.8010771911458127]], "r_squared_": 0.7267223755482441, "error_": 0.045900469133057446}
{"freq_range": [2.0, 80.0], "freq_res": 0.5, "aperiodic_params_": [-8.111815315878054, 0.688043409832767], "gaussian_params_": [[2.726017299567972, 0.18335386674508058, 0.994387239397312], [7.614123784887814, 0.29293994961460806, 0.40086521848357426], [9.118837230275354, 0.33618520865322243, 0.9356773777571796], [18.21767886828271, 0.2298186427078232, 0.6576797124663233], [20.736851289430557, 0.19678388890042858, 0.8208155926825372], [22.65859600137103, 0.20601612985291182, 0.6817550908996024], [24.55831522571424, 0.2215509341844612, 0.2595561064589701], [25.819575805355136, 0.1806501703337065, 0.25000000000000006], [37.26097921053476, 0.24365276240371728, 0.25000000000000006], [38.80267792514213, 0.19517762757730572, 0.5341199279868712], [50.36939920688031, 0.20753192280149102, 0.8804249156488722], [53.150717057623645, 0.14352423113387314, 0.25000000000000006], [59.55962976602853, 0.1371504090950824, 0.537711332681058], [61.325515403893725, 0.10671268073799112, 0.25000000000000006], [62.85488437240226, 0.10378272618544493, 1.076636921571764], [67.19604080499931, 0.16248487603654455, 0.6593310778633742], [68.99347056469811, 0.14842293020781078, 0.36886538036750643], [70.2769084468455, 0.11963753374785753, 0.25000000000000006], [74.5081021006069, 0.08979419718741223, 2.6939076222450957]], "peak_params_": [[2.726017299567972, 0.17867828897104232, 1.988774478794624], [7.614123784887814, 0.35657140342146754, 0.8017304369671485], [9.118837230275354, 0.3342283106241073, 1.8713547555143593], [18.21767886828271, 0.21832740416384055, 1.3153594249326466], [20.736851289430557, 0.19068800165918454, 1.6416311853650745], [22.65859600137103, 0.22010721571307634, 1.3635101817992048], [24.55831522571424, 0.2214019923368884, 0.5191122129179402], [25.819575805355136, 0.13923297286398828, 0.5000000000000001], [37.26097921053476, 0.16424034882073535, 0.5000000000000001], [38.80267792514213, 0.18230284818854692, 1.0682398559737425], [50.36939920688031, 0.20526114311165244, 1.7608498312977443], [53.150717057623645, 0.12206558270908019, 0.5000000000000001], [59.55962976602853, 0.13711811021040887, 1.075422665362116], [61.325515403893725, 0.1308644769763614, 0.5000000000000001], [62.85488437240226, 0.10285405430329675, 2.153273843143528], [67.19604080499931, 0.15736885725472938, 1.3186621557267484], [68.99347056469811, 0.1633512413071223, 0.7377307607350129], [70.2769084468455, 0.11006557675650441, 0.5000000000000001], [74.5081021006069, 0.08979379107416285, 5.3878152444901914]], "r_squared_": 0.9765227629829074, "error_": 0.030238302889782607}
{"freq_range": [2.0, 80.0], "freq_res": 0.5, "aperiodic_params_": [-8.329411749833254, 0.23214240338138875], "gaussian_params_": [[2.726017299567972, 0.29999719493054017, 1.4019091445258058], [7.610300312481331, 0.09876210872109097, 0.2500000000035273], [7.888940158063938, 0.15533151889308786, 0.8094205141815589], [17.704932817953466, 0.18714258680201337, 0.25000000000000006], [18.590812443570496, 0.12446952334238177, 0.2500000034438528], [19.944939917550347, 0.10091610114614455, 0.25000000000000017], [23.181004422582742, 0.22798499000487377, 2.726302283865616], [29.23867701620889, 0.12187898794314916, 0.5052814457968717], [33.26452788121815, 0.15293557940145222, 1.3491595404969747], [37.318245967269505, 0.16558919442034722, 0.25000000000000006], [38.3104067161368, 0.1966928776787975, 0.3462677727518865], [40.65838408027567, 0.20174585460785377, 0.25000050035024673], [43.83279987545502, 0.18239037254921853, 0.6617543353954876], [46.83104621048682, 0.13028577871519686, 0.8839831426975288], [49.33238595022136, 0.15455899376094878, 0.7249573974677268], [52.48386200878814, 0.2487693436760356, 0.46154232677826457], [54.90726376288751, 0.14508098137186382, 0.3666896555928391], [57.76933769334151, 0.08773843735402223, 0.8827605098396041], [59.06840159800436, 0.14583146464583688, 0.2500000000030482], [60.32758312819284, 0.1461903866398738, 0.25006131778897617], [61.2948789230915, 0.25387995384618084, 0.2500000000028172], [68.20792739821896, 0.11370448502251165, 0.3509826541971391], [74.59814791757508, 0.10868960432905658, 0.25000000000000006], [78.22356616749656, 0.1984465480410222, 0.25000000000000006]], "peak_params_": [[2.726017299567972, 0.29612362138955284, 2.8038182890516117], [7.610300312481331, 0.22890777529487494, 0.5000000000070546], [7.888940158063938, 0.18343557239984065, 1.6188410283631178], [17.704932817953466, 0.15975142640764872, 0.5000000000000001], [18.590812443570496, 0.16992352312708547, 0.5000000068877056], [19.944939917550347, 0.21391924062485224, 0.5000000000000003], [23.181004422582742, 0.22748307737403017, 5.452604567731232], [29.23867701620889, 0.13341808223851714, 1.0105628915937435], [33.26452788121815, 0.15080051966698704, 2.6983190809939495], [37.318245967269505, 0.14095738057967644, 0.5000000000000001], [38.3104067161368, 0.16939713906160847, 0.692535545503773], [40.65838408027567, 0.16506335853803833, 0.5000010007004935], [43.83279987545502, 0.17743271311617015, 1.3235086707909751], [46.83104621048682, 0.12880350453437472, 1.7679662853950575], [49.33238595022136, 0.15184859763904512, 1.4499147949354536], [52.48386200878814, 0.24862837403773952, 0.9230846535565291], [54.90726376288751, 0.1411547537099178, 0.7333793111856782], [57.76933769334151, 0.08480954888377568, 1.7655210196792082], [59.06840159800436, 0.17367540898602307, 0.5000000000060963], [60.32758312819284, 0.11761489189867191, 0.5001226355779523], [61.2948789230915, 0.1813342306394219, 0.5000000000056344], [68.20792739821896, 0.09540443487750494, 0.7019653083942782], [74.59814791757508, 0.10062815038392792, 0.5000000000000001], [78.22356616749656, 0.1330420354739914, 0.5000000000000001]], "r_squared_": 0.9092770710007431, "error_": 0.029036972491675216}
{"freq_range": [2.0, 80.0], "freq_res": 0.5, "aperiodic_params_": [-8.747091609665267, 0.22164360271571265], "gaussian_params_": [[14.703336339312932, 0.19759460173223495, 0.25000000000000006], [17.66366868755972, 0.10297769412093845, 0.6170633453858813], [22.70347821448718, 0.3850691299205227, 3.6370419610842166], [27.9923116634209, 0.16622698994409402, 0.36755600657457455], [30.614581361210828, 0.1984105027881836, 1.4450580838222742], [31.80437884893086, 0.17105409170532168, 0.31813034895262254], [33.71349561486745, 0.3209943595288364, 0.25000000000000006], [37.69659933480025, 0.2439314139140536, 0.9412362025560261], [40.30493793794718, 0.17165420632825867, 0.25000000000000006], [43.70163726181785, 0.11490658259601966, 1.720510295172811], [46.877518374218276, 0.16316690763941558, 0.6273340535830595], [49.23918302085776, 0.2827753846253411, 0.49185052792938544], [52.107026121943186, 0.22842289308928276, 0.40832581031111487], [53.452474439154074, 0.21600881900302565, 0.5832037944130665], [56.717867726573935, 0.22485463939947073, 0.9725758575189124], [61.60777517132522, 0.13628240714479, 0.6451717686124578], [63.72414270513573, 0.1426901808181259, 0.48351356500101644]], "peak_params_": [[14.703336339312932, 0.17220320132616962, 0.5000000000000001], [17.66366868755972, 0.23779599818956143, 1.2341266907717625], [22.70347821448718, 0.38446700335112105, 7.274083922168433], [27.9923116634209, 0.3381613922921023, 0.7351120131491491], [30.614581361210828, 0.2365252083361753, 2.8901161676445484], [31.80437884893086, 0.28157707601508264, 0.6362606979052451], [33.71349561486745, 0.25465110395230006, 0.5000000000000001], [37.69659933480025, 0.23894168724912035, 1.8824724051120523], [40.30493793794718, 0.14984232793115915, 0.5000000000000001], [43.70163726181785, 0.11412028284821574, 3.441020590345622], [46.877518374218276, 0.178388306341688, 1.254668107166119], [49.23918302085776, 0.2527767151730558, 0.9837010558587709], [52.107026121943186, 0.23043065158824305, 0.8166516206222297], [53.452474439154074, 0.21691507098722163, 1.166407588826133], [56.717867726573935, 0.21928337276538556, 1.9451517150378248], [61.60777517132522, 0.13439900279146855, 1.2903435372249157], [63.72414270513573, 0.1300006454710072, 0.9670271300020329]], "r_squared_": 0.8091460424314629, "error_": 0.044838532193742835}
{"freq_range": [2.0, 80.0], "freq_res": 0.5, "aperiodic_params_": [-8.41427082120593, 0.45397910784662987], "gaussian_params_": [[8.857752605604363, 0.1868102906562889, 0.25000000000000006], [14.05771726589466, 0.14552981787648817, 0.8228751257174891], [17.438491051128455, 0.2121117793944694, 0.6118653703769642], [20.83815386866558, 0.3185746350152299, 3.0542084932698472], [28.103730571722586, 0.2879418334102458, 3.3646149637593563], [40.40194923776692, 0.09281956047208825, 0.25000000000000006], [48.109058004644304, 0.10587262388285301, 5.999999999999999], [53.3858522199746, 0.1304142183085205, 0.6379659207244384], [56.67439480658377, 0.1453085233723656, 0.6578582459131808], [62.10305516083841, 0.14641165492853986, 0.5209590734408098], [63.61750221457164, 0.1678906494490729, 0.35195771542910437]], "peak_params_": [[8.857752605604363, 0.1590652688626033, 0.5000000000000001], [14.05771726589466, 0.1711997190998673, 1.6457502514349782], [17.438491051128455, 0.3883849228423788, 1.2237307407539284], [20.83815386866558, 0.34913050812381385, 6.1084169865396944], [28.103730571722586, 0.30857018769919087, 6.729229927518713], [40.40194923776692, 0.1336484722003881, 0.5000000000000001], [48.109058004644304, 0.10585514362134596, 11.999999999999998], [53.3858522199746, 0.19905508746392186, 1.2759318414488767], [56.67439480658377, 0.1801114569382456, 1.3157164918263615], [62.10305516083841, 0.15083829416494687, 1.0419181468816197], [63.61750221457164, 0.1667541294038184, 0.7039154308582087]], "r_squared_": 0.9217643347760917, "error_": 0.044727176235579556}
{"freq_range": [2.0, 80.0], "freq_res": 0.5, "aperiodic_params_": [-7.923215185262847, 0.7784178426859171], "gaussian_params_": [[13.570854234309243, 0.15595620487604778, 0.7106878437709216], [17.48864491183115, 0.16651224096299685, 0.455836577611853], [20.273982700432025, 0.4280922717815352, 3.489110004377168], [27.279512171665967, 0.32633269044849433, 2.4548502263650054], [69.99000460063468, 0.20317052174044198, 0.8401390926310532], [74.17940459596069, 0.16244167009558358, 0.7696570286010168]], "peak_params_": [[13.570854234309243, 0.22020322001192838, 1.4213756875418433], [17.48864491183115, 0.478668272151868, 0.911673155223706], [20.273982700432025, 0.43439789332997236, 6.978220008754336], [27.279512171665967, 0.375156917601263, 4.909700452730011], [69.99000460063468, 0.2031562074642661, 1.6802781852621065], [74.17940459596069, 0.15809030871802143, 1.5393140572020336]], "r_squared_": 0.9630426736566854, "error_": 0.049140304923617165}
{"freq_range": [2.0, 80.0], "freq_res": 0.5, "aperiodic_params_": [-8.018466973363525, 0.7969493642955477], "gaussian_params_": [[2.2676866033804006, 0.21969738539826525, 0.27644382210721874], [13.030488488550105, 0.13760208813528177, 0.3425129613571634], [13.891865505505505, 0.1749712228096571, 0.25001079637609624], [15.163994765181684, 0.16423312101469292, 0.30483588785081267], [17.286035392483118, 0.13238433176131142, 0.5604481120573652], [20.273982700432025, 0.3587023958716556, 3.0471486413016287], [26.473048880597915, 0.33227567449007905, 2.6898922819160784]], "peak_params_": [[2.2676866033804006, 0.15433807175351255, 0.5528876442144375], [13.030488488550105, 0.15812585025499004, 0.6850259227143268], [13.891865505505505, 0.20504084542065648, 0.5000215927521925], [15.163994765181684, 0.2223974311645911, 0.6096717757016253], [17.286035392483118, 0.3613682166741814, 1.1208962241147304], [20.273982700432025, 0.3859513038565243, 6.094297282603257], [26.473048880597915, 0.37674186601401516, 5.379784563832157]], "r_squared_": 0.9780958053302891, "error_": 0.040267065587326276}
{"freq_range": [2.0, 80.0], "freq_res": 0.5, "aperiodic_params_": [-7.772645880225848, 0.8217138891208623], "gaussian_params_": [[7.77810326015314, 0.18449926130084057, 0.2500000019879897], [19.226017299567975, 0.08479703397477079, 2.579856397855469], [23.52086895063123, 0.16330818842788525, 0.9806265780832847], [26.464764271024197, 0.18357599487805024, 0.7009916941686242], [29.975586664879682, 0.12325087403244615, 0.9969999687601887], [47.77398270043202, 0.05788531191823125, 5.999999999999944], [55.42300383450353, 0.16874572179065309, 0.7826234915484609], [63.18589465322385, 0.14553765803415641, 0.25000000000000006], [64.38906035547515, 0.11930468223569553, 0.7174957483482284], [65.90362932010584, 0.11176419067562021, 0.30404260326183136], [74.77398270043201, 0.07605580075072967, 3.4583186535271215], [78.21026836221515, 0.14924056147310147, 0.25000000000000006]], "peak_params_": [[7.77810326015314, 0.12443616589736273, 0.5000000039759794], [19.226017299567975, 0.08447678640523293, 5.159712795710938], [23.52086895063123, 0.18480966240724506, 1.9612531561665694], [26.464764271024197, 0.18694536177103593, 1.4019833883372483], [29.975586664879682, 0.12394779400176859, 1.9939999375203774], [47.77398270043202, 0.05784425700028706, 11.999999999999888], [55.42300383450353, 0.19319598903322266, 1.5652469830969218], [63.18589465322385, 0.13124401743553094, 0.5000000000000001], [64.38906035547515, 0.12000042707624559, 1.4349914966964568], [65.90362932010584, 0.11950058072297232, 0.6080852065236627], [74.77398270043201, 0.07589550419780444, 6.916637307054243], [78.21026836221515, 0.15400366843469726, 0.5000000000000001]], "r_squared_": 0.9588085945893263, "error_": 0.044490280402961435}
{"freq_range": [2.0, 80.0], "freq_res": 0.5, "aperiodic_params_": [-7.7852311266645, 0.7755071180674664], "gaussian_params_": [[7.724698703364181, 0.14966254401998744, 0.37314717884119614], [9.10472888357262, 0.12194180442557487, 0.4818963652999047], [18.476731098323015, 0.2847091889946821, 1.9634411856609855], [20.82867805650221, 0.20868582697449387, 0.25000000000000006], [22.647835375024194, 0.17568805114614627, 0.595594215494147], [25.467564362070654, 0.2978139458432414, 1.4348735791010736], [29.921581548102083, 0.16032533074134098, 1.0767534533173035], [63.15965321067215, 0.11328549029022801, 0.7926122995271884], [75.84268826334244, 0.06899784098400293, 5.999999999999999], [78.18838013912321, 0.1154163714345385, 0.25000000000000006], [79.64693880890601, 0.07390492379860299, 0.25000000000000006]], "peak_params_": [[7.724698703364181, 0.1253222634061597, 0.7462943576823923], [9.10472888357262, 0.11953353513677278, 0.9637927305998094], [18.476731098323015, 0.28469145424607056, 3.926882371321971], [20.82867805650221, 0.29584771198508264, 0.5000000000000001], [22.647835375024194, 0.24033033026818273, 1.191188430988294], [25.467564362070654, 0.2982488750840151, 2.869747158202147], [29.921581548102083, 0.16192974435078256, 2.153506906634607], [63.15965321067215, 0.11799236255644985, 1.5852245990543767], [75.84268826334244, 0.06897412994292651, 11.999999999999998], [78.18838013912321, 0.1515695668218715, 0.5000000000000001], [79.64693880890601, 0.11948111096535463, 0.5000000000000001]], "r_squared_": 0.965060753398012, "error_": 0.04161188554087637}
{"freq_range": [2.0, 80.0], "freq_res": 0.5, "aperiodic_params_": [-7.678798700883437, 0.6061001404082376], "gaussian_params_": [[2.726017299621773, 0.1542030265751038, 0.9453258529468159], [8.965346763940126, 0.13651313703692988, 0.5300766100950708], [18.698261225487695, 0.38039907666731715, 2.3270515622844266], [23.00689929540725, 0.277779306723159, 1.1066591225391662], [25.13242882000023, 0.3262897607213076, 0.5325213242790154], [26.715524023614975, 0.2604407439358421, 1.256787099818048], [29.662801799895416, 0.19978722720706676, 0.6519079644643658], [31.531520801769375, 0.11949665972390512, 0.3749978174888517], [49.405093921257134, 0.1509571792153213, 1.148553086341439], [62.35259752400269, 0.13060560650239517, 0.9642719381664254]], "peak_params_": [[2.726017299621773, 0.14985800930038362, 1.8906517058936319], [8.965346763940126, 0.13628609398740998, 1.0601532201901416], [18.698261225487695, 0.37909049873575285, 4.654103124568853], [23.00689929540725, 0.3500722148946078, 2.2133182450783324], [25.13242882000023, 0.4835415743560194, 1.0650426485580309], [26.715524023614975, 0.2719897205039974, 2.513574199636096], [29.662801799895416, 0.21603864406658957, 1.3038159289287317], [31.531520801769375, 0.12302757996919311, 0.7499956349777034], [49.405093921257134, 0.15044269912473673, 2.297106172682878], [62.35259752400269, 0.12908852919662372, 1.9285438763328508]], "r_squared_": 0.9647646642644438, "error_": 0.03746328728355074}
{"freq_range": [2.0, 80.0], "freq_res": 0.5, "aperiodic_params_": [-7.610322774771836, 0.5976930895638023], "gaussian_params_": [[17.728388837675933, 0.27051261320979636, 1.7209518218092061], [21.214729949247456, 0.08762497680398056, 0.9953055839587396], [24.91175885483683, 0.43945614481663353, 3.172830827359333], [31.686515483743914, 0.10756411595523482, 0.402600868990649], [40.22306871489504, 0.17896262260068432, 0.5202837170169257], [48.40147313898461, 0.13879613292287896, 1.444111186766142], [49.80852420754838, 0.15199596814175642, 0.2500000001710566], [53.282858809614844, 0.2159366466989372, 0.37461351092763595], [55.99460783378343, 0.14664038404008795, 0.30694447809916375], [61.832550443197256, 0.1123523785377799, 1.3392140641590362]], "peak_params_": [[17.728388837675933, 0.29692866317638256, 3.4419036436184123], [21.214729949247456, 0.3355296668388412, 1.9906111679174792], [24.91175885483683, 0.43938551061181386, 6.345661654718666], [31.686515483743914, 0.14751087129567253, 0.805201737981298], [40.22306871489504, 0.1632526843883273, 1.0405674340338513], [48.40147313898461, 0.13847364019835062, 2.888222373532284], [49.80852420754838, 0.18857373021478807, 0.5000000003421132], [53.282858809614844, 0.18281709254789646, 0.7492270218552719], [55.99460783378343, 0.14662643991442792, 0.6138889561983275], [61.832550443197256, 0.11147754796682996, 2.6784281283180724]], "r_squared_": 0.9544492312363363, "error_": 0.041125474651996334}
{"freq_range": [2.0, 80.0], "freq_res": 0.5, "aperiodic_params_": [-7.445405264653919, 0.6622622374147669], "gaussian_params_": [[2.274901618513619, 0.27073479934697425, 0.3025102991035664], [4.045070350665104, 0.11826272240280604, 0.25000000000000006], [7.651448310389008, 0.506516656351139, 0.7515790128729658], [9.304612704523247, 0.14166970856571565, 0.650700401432702], [18.11223445541364, 0.1989207308603598, 0.3455891671388275], [21.043928659034957, 0.21572520293354758, 0.8001091157039875], [25.36630196756766, 0.32645613608900625, 2.29377231340212], [37.72277324156261, 0.18818747111842435, 0.2500180296605389], [46.55561308506585, 0.1288183696399723, 0.25000000000000006], [48.08576551378797, 0.11825150102342635, 0.4042171302300635], [49.84730253914751, 0.20940441609573987, 0.42768648871792647], [56.02495801434277, 0.10419672746776212, 0.25000000000000006], [61.03097780716439, 0.20236896620406972, 0.5082604042455312], [64.07551899892933, 0.08079995413252136, 0.7589574471660478], [66.28203851517277, 0.1625110029515326, 0.3236795147851792], [68.71368006001629, 0.25796930141303287, 0.25000000000000006], [70.01668613209615, 0.16871935875532268, 0.3423826994517746], [78.89962758212613, 0.15400336143850024, 0.4331367806955793]], "peak_params_": [[2.274901618513619, 0.2052638425915223, 0.6050205982071328], [4.045070350665104, 0.1163602203318943, 0.5000000000000001], [7.651448310389008, 0.49936446099757603, 1.5031580257459316], [9.304612704523247, 0.16002726658944422, 1.301400802865404], [18.11223445541364, 0.19073831049866996, 0.691178334277655], [21.043928659034957, 0.2687330917905637, 1.600218231407975], [25.36630196756766, 0.3259020919813125, 4.58754462680424], [37.72277324156261, 0.12652940594472284, 0.5000360593210778], [46.55561308506585, 0.12572399239685694, 0.5000000000000001], [48.08576551378797, 0.11563807306012741, 0.808434260460127], [49.84730253914751, 0.1964759116120316, 0.8553729774358529], [56.02495801434277, 0.1036787838535016, 0.5000000000000001], [61.03097780716439, 0.20201539990666362, 1.0165208084910624], [64.07551899892933, 0.08040095164978922, 1.5179148943320957], [66.28203851517277, 0.13003548317235314, 0.6473590295703584], [68.71368006001629, 0.17904173251851851, 0.5000000000000001], [70.01668613209615, 0.1685195723963222, 0.6847653989035491], [78.89962758212613, 0.14992334951910102, 0.8662735613911586]], "r_squared_": 0.9785960167618065, "error_": 0.03234391576564088}
{"freq_range": [2.0, 80.0], "freq_res": 0.5, "aperiodic_params_": [-8.105729882631033, 0.5195165555474809], "gaussian_params_": [[2.336878983221691, 0.2851168507808949, 0.3600849774959803], [8.682581159474468, 0.2986100729044954, 0.8593679468746707], [10.792358518969785, 0.15476053406286358, 0.49517450325805157], [14.175874915404403, 0.15912429479901896, 0.9826076969477768], [16.691136624963136, 0.1265477138961362, 0.40275570640486086], [18.39093918833637, 0.10436062529409883, 0.7554210947371282], [21.340431551316684, 0.1825680784870365, 0.43304021357611955], [24.45191951205928, 0.18370244713064957, 1.6846970716731275], [38.89938531821355, 0.1555342698683153, 0.34065766992224916], [46.22488649624207, 0.17034763546840628, 0.25000000000000006], [48.40843971964999, 0.14453198930520691, 0.3180205318841516], [53.311180240615826, 0.13679613287884468, 0.8362182182160495], [55.67741147815937, 0.14515705467471057, 0.25000000000000006], [59.165307325345196, 0.11771620162434637, 0.3003977011488962], [62.484479767440575, 0.1198911254345658, 0.25000000000000006], [62.77398270014926, 0.07028484366634494, 3.0254560661248364], [70.88281261619247, 0.1515989204483076, 0.3483168268399829], [74.21509801288781, 0.16136812428588992, 0.25000000000000006], [77.95051959850564, 0.06570976910406351, 5.999999999806233]], "peak_params_": [[2.336878983221691, 0.2573125326012917, 0.7201699549919606], [8.682581159474468, 0.29194949561996886, 1.7187358937493413], [10.792358518969785, 0.15046368163503132, 0.9903490065161031], [14.175874915404403, 0.15659570115040644, 1.9652153938955537], [16.691136624963136, 0.12732536570568342, 0.8055114128097217], [18.39093918833637, 0.10365178099420191, 1.5108421894742563], [21.340431551316684, 0.21018270992946064, 0.8660804271522391], [24.45191951205928, 0.1836276490242863, 3.369394143346255], [38.89938531821355, 0.14889614266377826, 0.6813153398444983], [46.22488649624207, 0.11366440680950873, 0.5000000000000001], [48.40843971964999, 0.13866569634915216, 0.6360410637683032], [53.311180240615826, 0.13400959234531662, 1.672436436432099], [55.67741147815937, 0.12125987885294087, 0.5000000000000001], [59.165307325345196, 0.1339074719445179, 0.6007954022977924], [62.484479767440575, 0.19204377118575877, 0.5000000000000001], [62.77398270014926, 0.08733948763049426, 6.050912132249673], [70.88281261619247, 0.17859319327813772, 0.6966336536799658], [74.21509801288781, 0.16442372529480487, 0.5000000000000001], [77.95051959850564, 0.06570775710009968, 11.999999999612466]], "r_squared_": 0.9715153736785814, "error_": 0.02684958767480678}
{"freq_range": [2.0, 80.0], "freq_res": 0.5, "aperiodic_params_": [-8.453384526450488, 0.4116481004905113], "gaussian_params_": [[2.262796500746871, 0.20726934247435375, 0.48714927763625254], [18.035038105156055, 0.4162050529158794, 2.7945815208392717], [21.59652454642653, 0.08107350823369314, 0.25000000000000006], [24.874363571077364, 0.2478858051856404, 3.300260424338198], [28.025355285585846, 0.1518606315739198, 0.4225316264659947], [35.08778093114228, 0.10938581341917633, 0.25000000000000006], [37.426986089482725, 0.13630201180709964, 0.25000000000000006], [49.132228322499316, 0.11214177304699831, 1.2382768995041098], [52.7580153558425, 0.15567329044633832, 0.6196573634298901]], "peak_params_": [[2.262796500746871, 0.18409892400919503, 0.9742985552725051], [18.035038105156055, 0.44449248817949893, 5.589163041678543], [21.59652454642653, 0.41519240818226066, 0.5000000000000001], [24.874363571077364, 0.2663474627099376, 6.600520848676396], [28.025355285585846, 0.3106072009295353, 0.8450632529319894], [35.08778093114228, 0.10508596475354004, 0.5000000000000001], [37.426986089482725, 0.13077568736045286, 0.5000000000000001], [49.132228322499316, 0.11150422590556452, 2.4765537990082196], [52.7580153558425, 0.14509790940600809, 1.2393147268597802]], "r_squared_": 0.9558042327881383, "error_": 0.03793126872153819}
{"freq_range": [2.0, 80.0], "freq_res": 0.5, "aperiodic_params_": [-7.655689495213994, 0.5020353773273339], "gaussian_params_": [[20.376919421968843, 0.42470466231789034, 3.101571894686668], [24.559947729534176, 0.1501885862026115, 0.39953443106172687], [27.503330861812877, 0.22703903632202907, 1.9110258308977033], [37.54788293789359, 0.200695654056131, 0.286866997661427], [44.1001723361861, 0.11455797093884341, 0.4813619209238446], [46.46928474744868, 0.11813731040420136, 0.735647047901725], [49.14768763346379, 0.16284703240706466, 0.25000000000000006], [52.731780772539935, 0.12805278733033673, 0.9009985130148884], [73.54311391833319, 0.15071291493310968, 0.39081514707457016]], "peak_params_": [[20.376919421968843, 0.4246456929004987, 6.203143789373336], [24.559947729534176, 0.3900720079604856, 0.7990688621234537], [27.503330861812877, 0.25743132958894144, 3.8220516617954066], [37.54788293789359, 0.19791958475471105, 0.573733995322854], [44.1001723361861, 0.11252657754283746, 0.9627238418476892], [46.46928474744868, 0.11803484056671643, 1.47129409580345], [49.14768763346379, 0.137114618396442, 0.5000000000000001], [52.731780772539935, 0.123885048979675, 1.8019970260297768], [73.54311391833319, 0.14979860800146128, 0.7816302941491403]], "r_squared_": 0.9215995243558186, "error_": 0.04284110546610257}
{"freq_range": [2.0, 80.0], "freq_res": 0.5, "aperiodic_params_": [-7.731106388815269, 0.7375128434341531], "gaussian_params_": [[20.180074459841123, 0.5150133150522035, 3.9291996816073524], [26.905010720697092, 0.35935854878388773, 2.556310570197587], [37.62296717414245, 0.13741609559356996, 0.45392451095783243], [52.488171379285156, 0.1835569221067707, 0.42155411050715574]], "peak_params_": [[20.180074459841123, 0.5238302632650189, 7.858399363214705], [26.905010720697092, 0.4733000531169598, 5.112621140395174], [37.62296717414245, 0.13256327043925253, 0.9078490219156649], [52.488171379285156, 0.18348467560124604, 0.8431082210143115]], "r_squared_": 0.971457255810661, "error_": 0.04778813575392837}
{"freq_range": [2.0, 80.0], "freq_res": 0.5, "aperiodic_params_": [-7.589416607289513, 1.0321920664224336], "gaussian_params_": [[6.379566673370614, 0.14561474776071118, 0.35042301742035525], [22.539730562782747, 0.5489814650071235, 5.7337915492765195], [50.12761400304575, 0.18301520372647107, 0.28550574350767244], [52.052434286536275, 0.10628343914635162, 0.7704097636903467], [73.75722482499961, 0.16216609650999794, 0.4260963268477577]], "peak_params_": [[6.379566673370614, 0.14823588227993767, 0.7008460348407105], [22.539730562782747, 0.5489682858357146, 11.467583098553039], [50.12761400304575, 0.16867942511922251, 0.5710114870153449], [52.052434286536275, 0.1060385774681869, 1.5408195273806935], [73.75722482499961, 0.1378690722253495, 0.8521926536955154]], "r_squared_": 0.9846724411995363, "error_": 0.04487535608108367}
{"freq_range": [2.0, 80.0], "freq_res": 0.5, "aperiodic_params_": [-7.40164762672242, 1.0691776181894799], "gaussian_params_": [[19.332445304019245, 0.5802164690125631, 4.280838741963247], [25.894350875703985, 0.41967402850668495, 1.8085664286789902], [29.952047967649722, 0.3201143102191145, 0.9168332149070901], [78.73349985964467, 0.10945274897718074, 1.0459416642877843]], "peak_params_": [[19.332445304019245, 0.5805821951813552, 8.561677483926495], [25.894350875703985, 0.5914962288452177, 3.6171328573579804], [29.952047967649722, 0.37759367119304876, 1.8336664298141803], [78.73349985964467, 0.10675901209766359, 2.0918833285755687]], "r_squared_": 0.9854440125142332, "error_": 0.0436151590879944}
{"freq_range": [2.0, 80.0], "freq_res": 0.5, "aperiodic_params_": [-7.436300834569202, 0.7798252400678343], "gaussian_params_": [[8.781376130150548, 0.1419429014877665, 0.9286725979390317], [18.562878382178027, 0.5555154054707229, 3.2312454611065875], [22.81148952919371, 0.2038799687558847, 0.5402479440281779], [25.361260390563313, 0.5002090088810967, 0.9481801929205257], [27.345844579353237, 0.28572371624376963, 0.48720055743302293], [29.638297373556686, 0.2534984184921168, 0.975894885838605], [62.5216274631581, 0.15250454901212013, 0.4379184811220765]], "peak_params_": [[8.781376130150548, 0.14502634354104238, 1.8573451958780633], [18.562878382178027, 0.5554102364555842, 6.462490922213175], [22.81148952919371, 0.43074103456155655, 1.0804958880563558], [25.361260390563313, 0.5505752296605904, 1.8963603858410514], [27.345844579353237, 0.3461749695291445, 0.9744011148660459], [29.638297373556686, 0.2528250306569326, 1.95178977167721], [62.5216274631581, 0.15231867758865292, 0.875836962244153]], "r_squared_": 0.9799339679663545, "error_": 0.03950367334900169}
{"freq_range": [2.0, 80.0], "freq_res": 0.5, "aperiodic_params_": [-7.769212495639223, 0.6812010883574515], "gaussian_params_": [[18.31837586805073, 0.4568892868452581, 2.826274515080015], [25.200770017291653, 0.4382325611524433, 2.04922420305073], [29.623249200048168, 0.15918257339696157, 0.9292025711967914], [31.585319083051214, 0.17908524032964265, 0.3273552770263693], [40.32756333195256, 0.17367605725159083, 0.29568614020784917], [49.119036817708455, 0.1874301959113873, 0.7161988222752914], [53.22939343609189, 0.21459892597435082, 0.25000000000000006], [62.27404113204337, 0.19988944039003628, 0.2670382209685435]], "peak_params_": [[18.31837586805073, 0.4580356904581766, 5.65254903016003], [25.200770017291653, 0.4640714731672517, 4.09844840610146], [29.623249200048168, 0.20649153304991863, 1.8584051423935828], [31.585319083051214, 0.19770733618499037, 0.6547105540527386], [40.32756333195256, 0.14651758782044233, 0.5913722804156983], [49.119036817708455, 0.18485915416712118, 1.4323976445505828], [53.22939343609189, 0.14086480444733596, 0.5000000000000001], [62.27404113204337, 0.13973745175240104, 0.534076441937087]], "r_squared_": 0.9738280118324868, "error_": 0.03793002623609835}
{"freq_range": [2.0, 80.0], "freq_res": 0.5, "aperiodic_params_": [-7.348054844672939, 0.7787740142696972], "gaussian_params_": [[7.806526724298364, 0.3829380653946138, 0.810880917607199], [9.684103419516155, 0.29708089733694676, 1.4300631507272854], [14.992188762900467, 0.15772370840605363, 0.3919123458338029], [17.83774930408901, 0.15552277716207413, 0.8372462335296285], [20.510157486372744, 0.1838825571802219, 0.7353578467168856], [23.397762751944004, 0.2207131248920053, 0.8719380008086675], [24.964153318149297, 0.2165488136152765, 0.25000000000000006], [26.2138925965254, 0.3542795714546509, 0.4905286385404573], [49.518389505811044, 0.13307743060693897, 0.8766955524073491], [53.62900389110146, 0.15093144759595833, 0.3905791899592013], [60.70710098289449, 0.24489393672617393, 0.2500000214775142], [61.44983317753206, 0.1518516854201713, 0.25019445923783473], [62.621552116628074, 0.16786768451414796, 0.25000348115988746], [66.93342240688203, 0.18861647981745983, 0.5386879438320078], [69.04283487400924, 0.1558064365150369, 0.37214996534435657], [71.40710849551654, 0.18352261236846965, 0.7338244264842521], [74.19697472494146, 0.1947359005001542, 0.7660784189494644], [76.78577318768819, 0.1930290456781298, 0.2500000096217065], [78.57225250012033, 0.12692961278644704, 0.6730895811556176]], "peak_params_": [[7.806526724298364, 0.5206914948519366, 1.621761835214398], [9.684103419516155, 0.3378832450315654, 2.860126301454571], [14.992188762900467, 0.15848709941249162, 0.7838246916676058], [17.83774930408901, 0.15317211437526446, 1.674492467059257], [20.510157486372744, 0.18573843808320945, 1.4707156934337713], [23.397762751944004, 0.2192485088468299, 1.743876001617335], [24.964153318149297, 0.27170740877265054, 0.5000000000000001], [26.2138925965254, 0.3247598173404036, 0.9810572770809146], [49.518389505811044, 0.13304815747762433, 1.7533911048146982], [53.62900389110146, 0.14292376004850738, 0.7811583799184026], [60.70710098289449, 0.17387678056262068, 0.5000000429550284], [61.44983317753206, 0.15043883791313029, 0.5003889184756695], [62.621552116628074, 0.14917678671906387, 0.5000069623197749], [66.93342240688203, 0.18718145443808965, 1.0773758876640156], [69.04283487400924, 0.1557436175468041, 0.7442999306887131], [71.40710849551654, 0.1824545290109416, 1.4676488529685041], [74.19697472494146, 0.18876099473040497, 1.5321568378989288], [76.78577318768819, 0.1422477281614949, 0.500000019243413], [78.57225250012033, 0.12620044721717782, 1.3461791623112351]], "r_squared_": 0.9809753831964364, "error_": 0.03224302176017723}
{"freq_range": [2.0, 80.0], "freq_res": 0.5, "aperiodic_params_": [-7.640147503217516, 0.5722950967209158], "gaussian_params_": [[2.4616991091166502, 0.26771900944635324, 0.3844839695247489], [8.927813714026541, 0.2892027080912379, 1.0428701226647275], [12.793926898366827, 0.20515773543189475, 2.5810122500340333], [16.97906887833485, 0.14799401723456446, 0.6037030693604606], [21.115627539852486, 0.22141945788278466, 0.4713811633424355], [23.205162270599917, 0.0846908441891089, 0.25000094833830705], [24.72301638668476, 0.16169446433372858, 1.989231812617796], [39.16005635310362, 0.1269724779963304, 0.25000000000000006], [46.05476708941862, 0.17097846034452976, 0.2621268788697815], [48.3378107871738, 0.13593275975029465, 0.25000000000000006], [53.87552005032098, 0.11981711127944235, 1.7043678852967408], [59.057615599866125, 0.10905042132960414, 0.7475948579089258], [60.60678379046542, 0.13836119354500948, 0.2500109357749822], [62.36167196520837, 0.16720715981009188, 0.6469209933659222], [64.7450809198826, 0.20378814870073028, 0.323539555578377], [68.53836907317188, 0.10234011974731, 1.2141589620806448], [70.91909882583077, 0.25109366422318513, 0.43288065988941105], [73.10297425098086, 0.11409356160497706, 0.6031710386276232], [74.21524849481801, 0.2590007819760682, 0.2500839695357819], [75.13224441733244, 0.11305646286796217, 0.2511229235858247], [78.27398270039052, 0.11897788201225887, 2.7165354668704604]], "peak_params_": [[2.4616991091166502, 0.266466064106365, 0.7689679390494978], [8.927813714026541, 0.3581564103221089, 2.085740245329455], [12.793926898366827, 0.20464621203624134, 5.162024500068067], [16.97906887833485, 0.20236856882292642, 1.2074061387209212], [21.115627539852486, 0.24422512543057628, 0.942762326684871], [23.205162270599917, 0.1717522135381362, 0.5000018966766141], [24.72301638668476, 0.1606886068602016, 3.978463625235592], [39.16005635310362, 0.10344355120575699, 0.5000000000000001], [46.05476708941862, 0.16728978058980282, 0.524253757739563], [48.3378107871738, 0.11096497351613621, 0.5000000000000001], [53.87552005032098, 0.11949797077512692, 3.4087357705934815], [59.057615599866125, 0.11003191055176842, 1.4951897158178515], [60.60678379046542, 0.14597786989810935, 0.5000218715499644], [62.36167196520837, 0.16343154695625728, 1.2938419867318445], [64.7450809198826, 0.1540751915589329, 0.647079111156754], [68.53836907317188, 0.10247290835252798, 2.4283179241612896], [70.91909882583077, 0.26341418825654905, 0.8657613197788221], [73.10297425098086, 0.13063864653705615, 1.2063420772552464], [74.21524849481801, 0.2511038348254093, 0.5001679390715638], [75.13224441733244, 0.15866546965223094, 0.5022458471716494], [78.27398270039052, 0.11856679147857996, 5.433070933740921]], "r_squared_": 0.9696355885968502, "error_": 0.03054787371237711}
{"freq_range": [2.0, 80.0], "freq_res": 0.5, "aperiodic_params_": [-8.06517223737941, 0.6497370931801149], "gaussian_params_": [[2.4556830990669516, 0.29226671427961426, 0.3405857953355039], [8.648132395720843, 0.27507374131016293, 0.7038108972288298], [11.142087711886278, 0.29461840303972797, 1.6985168891030076], [16.30110295521346, 0.33033149074145546, 2.3431403397782486], [19.165329260560934, 0.16262668665704189, 0.25000000000000006], [20.907176820114085, 0.21864290152323623, 0.5753958196610135], [23.621696088346557, 0.20153270247925334, 1.6581043069288794], [27.222217047393944, 0.16731592712548107, 1.6742303377960512], [35.78781057813596, 0.19429439609540416, 0.25000000000000067], [45.92706021424558, 0.14534019613507707, 0.25000000000000006], [60.35140757435573, 0.174334235998074, 0.25000000000000006], [62.31802496545727, 0.14578586787693146, 0.6429533132779842], [64.70773000530451, 0.22588685166011768, 0.25000000000000006], [68.35543316175996, 0.08318272805190428, 0.7410991719263771], [70.78748358142245, 0.19601523967258686, 0.3839537117056515], [74.38570638090441, 0.1551562172000533, 0.6359280267714399], [77.54796540086382, 0.09152598520214252, 5.997084832464074]], "peak_params_": [[2.4556830990669516, 0.2898036700314002, 0.6811715906710079], [8.648132395720843, 0.35821145730632686, 1.4076217944576597], [11.142087711886278, 0.32018012494707015, 3.397033778206015], [16.30110295521346, 0.33119813915902085, 4.686280679556497], [19.165329260560934, 0.30589500338567177, 0.5000000000000001], [20.907176820114085, 0.3179498758711219, 1.150791639322027], [23.621696088346557, 0.2180778847306737, 3.316208613857759], [27.222217047393944, 0.1911469716441303, 3.3484606755921025], [35.78781057813596, 0.13552837591006295, 0.5000000000000013], [45.92706021424558, 0.13928415392018323, 0.5000000000000001], [60.35140757435573, 0.15039274890585475, 0.5000000000000001], [62.31802496545727, 0.1439917397238677, 1.2859066265559684], [64.70773000530451, 0.16898630718703878, 0.5000000000000001], [68.35543316175996, 0.11094160239279027, 1.4821983438527542], [70.78748358142245, 0.21874745754553437, 0.767907423411303], [74.38570638090441, 0.23310695139425341, 1.2718560535428798], [77.54796540086382, 0.0915240192533453, 11.994169664928148]], "r_squared_": 0.974341148397708, "error_": 0.03553759664745052}
{"freq_range": [2.0, 80.0], "freq_res": 0.5, "aperiodic_params_": [-7.430165049205796, 1.0105871334548433], "gaussian_params_": [[2.3536529132858584, 0.14523226064894404, 0.2727197975747301], [12.277043888132326, 0.15178641849003374, 1.3673177025228456], [15.687913874913248, 0.29415005432418917, 1.1691967263537608], [18.310475740633017, 0.16316347092533773, 0.5658699616228583], [20.91635277831201, 0.47926921523495675, 3.5415794533488323], [27.565423238554068, 0.31047396719661885, 3.033246835260204], [52.181780476568015, 0.1142497338721851, 0.8615665735136816]], "peak_params_": [[2.3536529132858584, 0.12575788299217283, 0.5454395951494602], [12.277043888132326, 0.18539292285498377, 2.734635405045691], [15.687913874913248, 0.44875276343092807, 2.3383934527075216], [18.310475740633017, 0.5538942281387307, 1.1317399232457166], [20.91635277831201, 0.5089797644647351, 7.083158906697665], [27.565423238554068, 0.3955505461375246, 6.066493670520408], [52.181780476568015, 0.11173485143050144, 1.7231331470273632]], "r_squared_": 0.9875584934482062, "error_": 0.04056096903845982}
{"freq_range": [2.0, 80.0], "freq_res": 0.5, "aperiodic_params_": [-7.581273208121815, 1.028300832636558], "gaussian_params_": [[9.241883565315595, 0.21919023243344463, 0.30504719618306536], [10.931915286479315, 0.2017053554949771, 0.5071191155314327], [13.015319541767838, 0.22716668499185264, 0.4813697993661231], [16.857067530903265, 0.27476199728164225, 1.784814289472301], [23.575769701699155, 0.6815918467400399, 5.152378022500401], [47.08100814547714, 0.08800525980445008, 1.5527616836037168], [54.94675331470877, 0.1367316633790663, 0.4340976682359298]], "peak_params_": [[9.241883565315595, 0.17268754317368362, 0.6100943923661307], [10.931915286479315, 0.23585727497420983, 1.0142382310628655], [13.015319541767838, 0.3366168948863617, 0.9627395987322462], [16.857067530903265, 0.5757571293847974, 3.569628578944602], [23.575769701699155, 0.6817878539013957, 10.304756045000802], [47.08100814547714, 0.08790772611742703, 3.1055233672074336], [54.94675331470877, 0.13570711969357419, 0.8681953364718596]], "r_squared_": 0.9875456411047016, "error_": 0.043051523744519635}
{"freq_range": [2.0, 80.0], "freq_res": 0.5, "aperiodic_params_": [-7.421323439212793, 1.1043896424907074], "gaussian_params_": [[8.551847008152475, 0.20143801761582844, 0.7041980197343357], [10.943448852834965, 0.22422601628159478, 0.5754663845086928], [13.096149130792536, 0.18416538826170273, 0.8414497969071428], [17.083813907543075, 0.5216863946799233, 2.160647280126725], [20.772790966111156, 0.1623818201741972, 1.106683842607395], [25.539902488154745, 0.6303603967951419, 4.118775311145123], [32.63037873151057, 0.061936689605215124, 0.25000000000000006], [34.241732405082324, 0.17168238987885603, 0.25000000000000006], [76.18727235919182, 0.19261350695659618, 0.45087686781507025]], "peak_params_": [[8.551847008152475, 0.2012362160844443, 1.4083960394686714], [10.943448852834965, 0.2430409349368734, 1.1509327690173856], [13.096149130792536, 0.27689608532594434, 1.6828995938142857], [17.083813907543075, 0.595247129328424, 4.32129456025345], [20.772790966111156, 0.6033040178426532, 2.21336768521479], [25.539902488154745, 0.6306132046492685, 8.237550622290247], [32.63037873151057, 0.20524614183259793, 0.5000000000000001], [34.241732405082324, 0.18403299912786686, 0.5000000000000001], [76.18727235919182, 0.1766953767308994, 0.9017537356301405]], "r_squared_": 0.9864916015792173, "error_": 0.04511218702424024}
{"freq_range": [2.0, 80.0], "freq_res": 0.5, "aperiodic_params_": [-7.236193588921828, 1.1805477364708976], "gaussian_params_": [[9.766821903449033, 0.16101585029472906, 0.5633659414715703], [15.865399734968312, 0.059125234523622484, 0.25000000000000006], [17.812874535037015, 0.6576389718327972, 3.243633844223189], [24.968092897038215, 0.640415921748351, 2.9544064915596535], [29.3369879067823, 0.15993653469153316, 0.4945389064701931], [31.75054383094223, 0.15775820849922628, 2.5229912276301594], [75.6523613368767, 0.18206567314140687, 0.25000000000000006], [76.52023726291797, 0.1322754588443204, 0.25000000000024963]], "peak_params_": [[9.766821903449033, 0.1839535639014116, 1.1267318829431405], [15.865399734968312, 0.6200839708978148, 0.5000000000000001], [17.812874535037015, 0.6962219882228222, 6.487267688446378], [24.968092897038215, 0.7012566796101787, 5.908812983119307], [29.3369879067823, 0.45593015461092, 0.9890778129403862], [31.75054383094223, 0.1947321452521642, 5.045982455260319], [75.6523613368767, 0.15123988507644448, 0.5000000000000001], [76.52023726291797, 0.13242345973231373, 0.5000000000004993]], "r_squared_": 0.991951517060152, "error_": 0.0382916289568604}
{"freq_range": [2.0, 80.0], "freq_res": 0.5, "aperiodic_params_": [-7.491013962853588, 0.9798975432723056], "gaussian_params_": [[16.493801830028413, 0.5160029423817416, 4.6823491215384445], [25.79775227487925, 0.4386651098903094, 4.643375080707655], [25.81439985744869, 0.12371453376541905, 0.39028295771017857], [59.72601729956798, 0.09142872434233451, 1.6917945844534257]], "peak_params_": [[16.493801830028413, 0.5750885265874608, 9.364698243076889], [25.79775227487925, 0.6144443094876433, 9.28675016141531], [25.81439985744869, 0.6144443094876433, 0.7805659154203571], [59.72601729956798, 0.09061644690126158, 3.3835891689068514]], "r_squared_": 0.9867202046426329, "error_": 0.044666161355627176}
{"freq_range": [2.0, 80.0], "freq_res": 0.5, "aperiodic_params_": [-7.86626650278924, 0.517278977285092], "gaussian_params_": [[11.725874873958624, 0.14150849879747476, 0.5731342442304227], [17.35805264767109, 0.42714556314703084, 3.245593648201259], [22.086906965002985, 0.19070443793207162, 0.4647797989167622], [23.212392316101386, 0.33680338775976726, 0.25000000000047035], [24.89720347075784, 0.22059477385680515, 0.36721005369145276], [26.23982427132519, 0.4091622208435922, 1.405286570839435], [29.792602974450915, 0.1646664958890054, 0.3471416145094316], [53.148447436846716, 0.14159543273789763, 0.4594721748507755], [55.87861795402598, 0.11965241685829546, 0.25000000000000006], [61.40612613606602, 0.16645823215129632, 0.836820003449789], [67.29895985873624, 0.1925069368473929, 0.7678315004628988], [70.4348098860367, 0.08073704604624687, 1.1460983427805405], [73.67102397313114, 0.15841723397885016, 0.2500000000351421], [74.40768467096582, 0.16533787113928802, 0.250000000000002], [78.27398270024634, 0.10487004729144916, 3.5729186159014668]], "peak_params_": [[11.725874873958624, 0.21471943378701575, 1.1462684884608454], [17.35805264767109, 0.42673724111957867, 6.491187296402518], [22.086906965002985, 0.3453192222725985, 0.9295595978335244], [23.212392316101386, 0.3854238318464276, 0.5000000000009407], [24.89720347075784, 0.5160821341720396, 0.7344201073829055], [26.23982427132519, 0.41800667339220254, 2.81057314167887], [29.792602974450915, 0.14937678610743355, 0.6942832290188632], [53.148447436846716, 0.1343949378500593, 0.918944349701551], [55.87861795402598, 0.10634858278185888, 0.5000000000000001], [61.40612613606602, 0.16541586547545073, 1.673640006899578], [67.29895985873624, 0.19017455274369865, 1.5356630009257977], [70.4348098860367, 0.09047104166725006, 2.292196685561081], [73.67102397313114, 0.17080303086149407, 0.5000000000702842], [74.40768467096582, 0.21527111490730455, 0.500000000000004], [78.27398270024634, 0.10466043141066628, 7.1458372318029335]], "r_squared_": 0.9624722709983665, "error_": 0.03522684349409519}
{"freq_range": [2.0, 80.0], "freq_res": 0.5, "aperiodic_params_": [-7.521759626150103, 0.6360090597836666], "gaussian_params_": [[8.869327640726567, 0.36589920651303687, 0.8986266066117587], [11.30113068930723, 0.34163821561226193, 0.5768228144468639], [14.132824620943191, 0.1791017015024737, 1.167496704454457], [16.287381510378566, 0.1693917699762983, 0.44554883845803245], [18.57813961360012, 0.15217227028156327, 1.1839653650073179], [19.972884521328865, 0.07638955689852582, 0.25000000000000006], [22.441471405716033, 0.12976212787795494, 1.0166414578729401], [25.163124353322367, 0.13217725821155304, 0.6505272667889549], [26.826066241377124, 0.14669747742764708, 0.3617798616607148], [30.850092506254455, 0.16299038806647487, 0.4677323060646324], [38.12288473427894, 0.21018627697187978, 0.285185372595091], [45.619289500488094, 0.157027341792798, 0.25000000000000006], [55.888850915273316, 0.14672304088142368, 0.331421585463222], [61.553017146125505, 0.12854877047029709, 0.25896949208721387], [65.15821036838821, 0.12296597712795453, 0.5410506059663921], [66.9456587084711, 0.13762957929800393, 0.3591676068313761], [69.68375079073328, 0.1430414036669586, 1.245966050672663], [72.89923553189362, 0.10861945324663039, 0.6941124962792025], [78.0792912749335, 0.09513712818074628, 2.159033302384639]], "peak_params_": [[8.869327640726567, 0.36218208095683124, 1.7972532132235175], [11.30113068930723, 0.34105200059644236, 1.1536456288937278], [14.132824620943191, 0.17803894006435428, 2.334993408908914], [16.287381510378566, 0.20670076091001732, 0.8910976769160649], [18.57813961360012, 0.15207658857215556, 2.3679307300146357], [19.972884521328865, 0.1571874866881675, 0.5000000000000001], [22.441471405716033, 0.13020810007226835, 2.0332829157458803], [25.163124353322367, 0.13355497431165375, 1.3010545335779098], [26.826066241377124, 0.13314576894981656, 0.7235597233214296], [30.850092506254455, 0.1548305962617409, 0.9354646121292648], [38.12288473427894, 0.19155198766990722, 0.570370745190182], [45.619289500488094, 0.14013133112031362, 0.5000000000000001], [55.888850915273316, 0.13869953645797217, 0.662843170926444], [61.553017146125505, 0.1258829503526293, 0.5179389841744277], [65.15821036838821, 0.11794185874446583, 1.0821012119327842], [66.9456587084711, 0.15049869541432948, 0.7183352136627522], [69.68375079073328, 0.14153042326591958, 2.491932101345326], [72.89923553189362, 0.11760017049358673, 1.388224992558405], [78.0792912749335, 0.09507299164119587, 4.318066604769278]], "r_squared_": 0.973603035280955, "error_": 0.028025530423637597}
{"freq_range": [2.0, 80.0], "freq_res": 0.5, "aperiodic_params_": [-7.665975725605723, 0.6946327578167167], "gaussian_params_": [[2.416541848823363, 0.18443313025363903, 0.29204042719310136], [8.779729284006363, 0.3029481540807215, 0.9574470707723806], [11.025207693242235, 0.07119600782675121, 0.2500000000000171], [11.930088894743292, 0.2484812749747402, 1.8324177617381465], [16.66211955776195, 0.27908114908331005, 1.759299424535629], [21.116761642972428, 0.3131595332108297, 0.9099561467528693], [23.549548610993472, 0.18262669239175608, 0.7797414780389198], [25.430503247046694, 0.04237642795210436, 0.2500000000000119], [26.471961678992226, 0.13970761291537817, 1.8388176594557635], [45.91194986563341, 0.15868438862088174, 0.25000000000007216], [59.76993996343931, 0.05784138415976926, 4.284318399538984], [64.70148388280214, 0.13742659771488555, 0.25000000000017497], [67.63341712135916, 0.08693119171820514, 0.941447121561127], [70.81077723802085, 0.18486260824442902, 0.2500000000004441], [75.99199157920337, 0.12613327874250055, 4.314958544563299]], "peak_params_": [[2.416541848823363, 0.17705412633463347, 0.5840808543862027], [8.779729284006363, 0.3642518058155808, 1.9148941415447611], [11.025207693242235, 0.3114458389718777, 0.5000000000000342], [11.930088894743292, 0.25772863781496014, 3.664835523476293], [16.66211955776195, 0.28898399277960074, 3.518598849071258], [21.116761642972428, 0.3264850034032989, 1.8199122935057386], [23.549548610993472, 0.23039230167509217, 1.5594829560778396], [25.430503247046694, 0.17026256767672443, 0.5000000000000238], [26.471961678992226, 0.13983799299124122, 3.677635318911527], [45.91194986563341, 0.14947181955743893, 0.5000000000001443], [59.76993996343931, 0.057889317891044456, 8.568636799077968], [64.70148388280214, 0.13474045826805536, 0.5000000000003499], [67.63341712135916, 0.11560957085272072, 1.882894243122254], [70.81077723802085, 0.205421939599427, 0.5000000000008882], [75.99199157920337, 0.1261773200642171, 8.629917089126598]], "r_squared_": 0.9776425097019789, "error_": 0.03489694606977529}
{"freq_range": [2.0, 80.0], "freq_res": 0.5, "aperiodic_params_": [-7.680097981760164, 0.6622200560767334], "gaussian_params_": [[9.492740762373323, 0.17466081904819036, 1.0959056598316952], [16.786546805641354, 0.6123151446637132, 3.1990092055306287], [20.526945624732512, 0.12886843050535368, 0.25006488333960886], [22.921209295606275, 0.24176608827932283, 2.254352490661772], [27.984158348007757, 0.22993929694758883, 1.8863002527535688], [53.265477897468664, 0.19678872477976653, 0.25000000000000006], [63.33292477543008, 0.14671598925751195, 0.611121593976614], [65.56261467314356, 0.1926857590367005, 0.4042266119457523], [72.81348390475365, 0.17113439160601102, 0.41304401940160645]], "peak_params_": [[9.492740762373323, 0.22040608700030262, 2.1918113196633904], [16.786546805641354, 0.6186330006915268, 6.3980184110612575], [20.526945624732512, 0.5761706691993984, 0.5001297666792177], [22.921209295606275, 0.3414745569435613, 4.508704981323544], [27.984158348007757, 0.2503564115837502, 3.7726005055071377], [53.265477897468664, 0.12673848086417472, 0.5000000000000001], [63.33292477543008, 0.1413346301329721, 1.222243187953228], [65.56261467314356, 0.19066078475584725, 0.8084532238915046], [72.81348390475365, 0.1545463155286999, 0.8260880388032129]], "r_squared_": 0.972171865734859, "error_": 0.043977244554996735}
{"freq_range": [2.0, 80.0], "freq_res": 0.5, "aperiodic_params_": [-7.40847677681809, 1.0114088192224866], "gaussian_params_": [[17.646017524135708, 1.0543143202035858, 4.680455497642472], [25.689642558760582, 0.05468789048728236, 0.44201926435881334], [28.032398326619866, 0.5309632606884993, 2.5849888822029845], [31.271864870389063, 0.17006151058274457, 0.25000004787401914], [33.74953855473017, 0.07746209226893261, 1.17595901452599]], "peak_params_": [[17.646017524135708, 1.0539332582484464, 9.360910995284945], [25.689642558760582, 0.6364191304513671, 0.8840385287176267], [28.032398326619866, 0.6221890752364949, 5.169977764405969], [31.271864870389063, 0.35370422270710655, 0.5000000957480383], [33.74953855473017, 0.13583887814793627, 2.35191802905198]], "r_squared_": 0.9869598414869413, "error_": 0.05407863317067952}
{"freq_range": [2.0, 80.0], "freq_res": 0.5, "aperiodic_params_": [-7.472914916766323, 1.072587320732318], "gaussian_params_": [[17.529683956907956, 0.8815872795728253, 4.05631666945647], [22.286335345892237, 0.1800447021612085, 0.5331274075267097], [27.511658655909784, 0.6095757195720323, 3.952658232233281]], "peak_params_": [[17.529683956907956, 0.906218947362694, 8.11263333891294], [22.286335345892237, 0.8551437731535341, 1.0662548150534195], [27.511658655909784, 0.6525605460104522, 7.905316464466562]], "r_squared_": 0.9846117382083561, "error_": 0.057008931712328396}
{"freq_range": [2.0, 80.0], "freq_res": 0.5, "aperiodic_params_": [-7.434337192770631, 1.144453625010466], "gaussian_params_": [[15.148767901290729, 0.5144485932246841, 3.684988775952169], [24.066028100291234, 0.7519237136842929, 5.22787645579926], [29.88717884892537, 0.11109147203975224, 1.209215711611033], [36.54796540086405, 0.06871043139142753, 5.999999999999999]], "peak_params_": [[15.148767901290729, 0.6812999463205767, 7.369977551904338], [24.066028100291234, 0.7883210201432149, 10.45575291159852], [29.88717884892537, 0.5434691162389225, 2.418431423222066], [36.54796540086405, 0.11315300583296484, 11.999999999999998]], "r_squared_": 0.9868400464213751, "error_": 0.053733200887617245}
{"freq_range": [2.0, 80.0], "freq_res": 0.5, "aperiodic_params_": [-7.608382804136353, 1.0171482972498944], "gaussian_params_": [[15.47629894467888, 0.6477450888164187, 3.626113080173303], [25.056623303298014, 0.6532556026259628, 5.480411855675593], [30.47350603968441, 0.09882523091415103, 0.25000000000000006], [33.6360948697641, 0.04791745751132584, 0.25000000000000006]], "peak_params_": [[15.47629894467888, 0.7905515372427949, 7.252226160346606], [25.056623303298014, 0.6738034690708616, 10.960823711351185], [30.47350603968441, 0.49729018899122934, 0.5000000000000001], [33.6360948697641, 0.2406931744655143, 0.5000000000000001]], "r_squared_": 0.9851020641905759, "error_": 0.05458234852092243}
{"freq_range": [2.0, 80.0], "freq_res": 0.5, "aperiodic_params_": [-7.359474961770884, 1.0316750589858195], "gaussian_params_": [[15.224500111322328, 0.6760001373857318, 3.854938640024502], [22.178051908736087, 0.5329068566496266, 4.32300650728374], [29.75422443374568, 0.305324732713554, 3.0541030744102535]], "peak_params_": [[15.224500111322328, 0.8091245859331861, 7.709877280049004], [22.178051908736087, 0.6888717118160734, 8.64601301456748], [29.75422443374568, 0.40846597781539984, 6.108206148820507]], "r_squared_": 0.9874082006645328, "error_": 0.04950379488272411}
{"freq_range": [2.0, 80.0], "freq_res": 0.5, "aperiodic_params_": [-7.357906800395542, 0.7561067960198684], "gaussian_params_": [[9.463606814960952, 0.11738390900661431, 0.3107858592230261], [10.919579492576887, 0.12764341173682767, 0.25000000000000006], [17.534094747355695, 0.7585856584013144, 3.6395397054813703], [22.952616874408864, 0.17900026189890103, 0.2803508636076671], [25.934391826866428, 0.4400678459600588, 1.6693426587072502], [29.66903326085034, 0.19256562836321933, 0.9474508732065003], [60.38685343896849, 0.14381374155116386, 0.2820697664765796], [62.2532806390005, 0.18249103424068028, 0.2995545897117544], [67.28938843539909, 0.13051733407024124, 0.5621778076916086], [71.30889202177187, 0.16530566206665137, 0.6191610887859875], [74.17078286157118, 0.17611678525446314, 0.5084499151727514]], "peak_params_": [[9.463606814960952, 0.18293839921225796, 0.6215717184460522], [10.919579492576887, 0.2726024025094853, 0.5000000000000001], [17.534094747355695, 0.758553632980604, 7.279079410962741], [22.952616874408864, 0.5159456738024044, 0.5607017272153342], [25.934391826866428, 0.49054377920389314, 3.3386853174145004], [29.66903326085034, 0.2378975851899927, 1.8949017464130007], [60.38685343896849, 0.13269676098885874, 0.5641395329531592], [62.2532806390005, 0.1299988384308719, 0.5991091794235088], [67.28938843539909, 0.12167217140271802, 1.1243556153832173], [71.30889202177187, 0.15761621158381445, 1.238322177571975], [74.17078286157118, 0.16646998577443206, 1.0168998303455028]], "r_squared_": 0.9866324153380885, "error_": 0.03504416807539985}
{"freq_range": [2.0, 80.0], "freq_res": 0.5, "aperiodic_params_": [-7.426550679516912, 0.5647424183289775], "gaussian_params_": [[8.829253981919923, 0.10019568427222217, 0.651582099289703], [11.28690007558942, 0.2104766792394597, 0.280217874925324], [17.749449940403565, 0.33782824143671586, 3.1260120888728533], [22.443401346721714, 0.11745273777587083, 0.5466653174971953], [25.46036764463939, 0.27502898100759626, 0.9809541599042266], [28.585551493747857, 0.24234795417513835, 0.47381246466601645], [30.551261963267986, 0.25913931342650826, 0.42745486205983485], [37.85697424315422, 0.1440004313092553, 0.25000000000000006], [43.11707903431181, 0.14101860577229755, 0.8527904301004763], [55.62301862206587, 0.1342079651542253, 0.35527466209973513], [62.19991197039603, 0.20481635487857308, 0.3587815849400105], [64.72913650649397, 0.09385752193625686, 1.5030042473625778], [69.9884337061924, 0.11557846993532589, 1.0005999859523333], [72.3373690664057, 0.18393698206221987, 0.25000000000000006]], "peak_params_": [[8.829253981919923, 0.10353711259527909, 1.303164198579406], [11.28690007558942, 0.20344162596990945, 0.560435749850648], [17.749449940403565, 0.33675435026026257, 6.252024177745707], [22.443401346721714, 0.22618567680277746, 1.0933306349943905], [25.46036764463939, 0.2904299398158843, 1.9619083198084533], [28.585551493747857, 0.24160663679245076, 0.9476249293320329], [30.551261963267986, 0.2574345693735882, 0.8549097241196697], [37.85697424315422, 0.12226188928128678, 0.5000000000000001], [43.11707903431181, 0.1396958635390888, 1.7055808602009526], [55.62301862206587, 0.12639872567559962, 0.7105493241994703], [62.19991197039603, 0.1934183874226374, 0.717563169880021], [64.72913650649397, 0.09277316416244297, 3.0060084947251555], [69.9884337061924, 0.11577116762250839, 2.0011999719046667], [72.3373690664057, 0.15381139430333235, 0.5000000000000001]], "r_squared_": 0.9593773866215228, "error_": 0.03650842508549523}
{"freq_range": [2.0, 80.0], "freq_res": 0.5, "aperiodic_params_": [-7.818725096349868, 0.8597825573298999], "gaussian_params_": [[10.66802512236785, 0.11275089562674401, 0.3809574344398387], [17.74043278954078, 0.3326915051661893, 3.213524895264238], [22.153362748766074, 0.17227343316081345, 0.3440285172392212], [23.827914619446332, 0.112741096730282, 0.8963342165795579], [26.792961497932897, 0.17862472539027235, 0.36133549248415797], [44.44879434996536, 0.10037040227692924, 0.25000000000000006], [49.23694195567802, 0.1812825458125083, 0.25000018627734516], [55.21703068298352, 0.14136231061883178, 0.49156953032914047], [56.89230431078401, 0.13984524353478547, 0.4783724235694459], [62.51240968729695, 0.12893692707766707, 0.9900237790015952], [65.50572635157346, 0.21737430579015826, 0.5306368841152895], [74.36341441841066, 0.17046039147872039, 0.2500609906648271], [77.79104676656884, 0.21045203942570928, 0.6970133179995794]], "peak_params_": [[10.66802512236785, 0.1285843689992454, 0.7619148688796774], [17.74043278954078, 0.33176162255309904, 6.427049790528476], [22.153362748766074, 0.30827493402250994, 0.6880570344784424], [23.827914619446332, 0.16058605898443723, 1.7926684331591158], [26.792961497932897, 0.1570356942265736, 0.7226709849683159], [44.44879434996536, 0.0982869456282387, 0.5000000000000001], [49.23694195567802, 0.1156913173808487, 0.5000003725546903], [55.21703068298352, 0.12829070286650257, 0.9831390606582809], [56.89230431078401, 0.13654248998574658, 0.9567448471388919], [62.51240968729695, 0.12892682165762537, 1.9800475580031904], [65.50572635157346, 0.21871974020005425, 1.061273768230579], [74.36341441841066, 0.1468411591343255, 0.5001219813296542], [77.79104676656884, 0.20120467060455205, 1.3940266359991589]], "r_squared_": 0.9814580857751604, "error_": 0.03541841474941676}
{"freq_range": [2.0, 80.0], "freq_res": 0.5, "aperiodic_params_": [-7.340178201462576, 0.9956138971385204], "gaussian_params_": [[9.900130844240621, 0.14344472644227302, 1.2429513410534916], [16.776035894403726, 0.6950957137074223, 3.273455467829233], [20.20858212035703, 0.195941515756429, 0.43244247243690637], [22.92625533423389, 0.29819145906644956, 1.6254664509614767], [27.063772559423857, 0.22824163124993344, 1.6990610220510525], [29.39427444735721, 0.10868246750261656, 0.25000000000000006], [62.96475978984667, 0.1391311006356026, 0.31445190889123], [72.7612448271527, 0.18091743040202232, 0.39213383737728646], [74.30749783145927, 0.20525351777299258, 0.2581495277285566], [77.2867736276351, 0.10303130852281545, 1.2646472377366054], [79.42904365585619, 0.11803790059714311, 0.26450392527760314]], "peak_params_": [[9.900130844240621, 0.22456457403645835, 2.485902682106983], [16.776035894403726, 0.6938580696770948, 6.546910935658466], [20.20858212035703, 0.6614199474041467, 0.8648849448738127], [22.92625533423389, 0.424985865897586, 3.2509329019229534], [27.063772559423857, 0.2462747226643227, 3.398122044102105], [29.39427444735721, 0.18148144883434725, 0.5000000000000001], [62.96475978984667, 0.13826013738918874, 0.62890381778246], [72.7612448271527, 0.15063782506203083, 0.7842676747545729], [74.30749783145927, 0.16453163990787267, 0.5162990554571132], [77.2867736276351, 0.10157719134434728, 2.5292944754732107], [79.42904365585619, 0.13614533099887893, 0.5290078505552063]], "r_squared_": 0.9894980926857417, "error_": 0.03734243496757946}
{"freq_range": [2.0, 80.0], "freq_res": 0.5, "aperiodic_params_": [-7.24126477308515, 1.14162166086606], "gaussian_params_": [[17.685271468924515, 0.9687550981255014, 4.748211179310549], [25.528527168874366, 0.10736162122634162, 0.8631280493385618], [28.08322095099001, 0.20054252442607184, 0.4698885804688849], [28.452034599135946, 0.24302779196061366, 4.104804150364559], [29.345709985937045, 0.10903430816731699, 0.2689132393036764]], "peak_params_": [[17.685271468924515, 0.9749336039610652, 9.496422358621098], [25.528527168874366, 0.544997509135726, 1.7262560986771236], [28.08322095099001, 0.5322740655854314, 0.9397771609377698], [28.452034599135946, 0.45179515659666336, 8.209608300729117], [29.345709985937045, 0.3736836052154402, 0.5378264786073528]], "r_squared_": 0.9882815124127554, "error_": 0.051490910032340874}
{"freq_range": [2.0, 80.0], "freq_res": 0.5, "aperiodic_params_": [-7.472444430019913, 1.1438457091951537], "gaussian_params_": [[15.934196084852303, 0.6046042010562871, 3.6772810542282257], [24.158156038554857, 0.7073595705982988, 4.655781787045433], [29.129162284375045, 0.11606052742415715, 0.4427496524222211]], "peak_params_": [[15.934196084852303, 0.7568795129973545, 7.354562108456451], [24.158156038554857, 0.761497269650409, 9.311563574090867], [29.129162284375045, 0.5242205872070809, 0.8854993048444422]], "r_squared_": 0.991594719463384, "error_": 0.04183959181013655}
{"freq_range": [2.0, 80.0], "freq_res": 0.5, "aperiodic_params_": [-7.427672712270286, 1.127693396891756], "gaussian_params_": [[8.844344111750488, 0.2637645278654932, 0.8803664274724015], [10.773982700237239, 0.19528417275769291, 1.5820876087028082], [16.162391097613437, 0.8335368516046442, 3.140544675351981], [23.584803543223142, 0.6291892412163359, 4.906893567894965], [30.61526817523906, 0.16138399393594016, 0.9497880453766455], [36.682748267530826, 0.12582104580265738, 0.8931530220032261]], "peak_params_": [[8.844344111750488, 0.4332851195223597, 1.760732854944803], [10.773982700237239, 0.445794244994822, 3.1641752174056164], [16.162391097613437, 1.023779780637109, 6.281089350703962], [23.584803543223142, 0.6834899132744408, 9.81378713578993], [30.61526817523906, 0.39330762945710696, 1.899576090753291], [36.682748267530826, 0.14291397957881635, 1.7863060440064522]], "r_squared_": 0.9907522448381623, "error_": 0.046786968925850096}
{"freq_range": [2.0, 80.0], "freq_res": 0.5, "aperiodic_params_": [-7.462986858915156, 1.061813561426624], "gaussian_params_": [[9.115788469816577, 0.31274022393116213, 1.1686007051402267], [16.606657424580686, 0.9550111310485966, 3.901199005686331], [25.219059082401007, 0.15512776319711474, 0.36033158967476087], [25.336747437025497, 0.3607796224109385, 5.9999989105011595], [27.458921918681686, 0.09337911527528484, 0.25000000000000017]], "peak_params_": [[9.115788469816577, 0.4627779495932014, 2.3372014102804535], [16.606657424580686, 1.0766163295090063, 7.802398011372662], [25.219059082401007, 0.5835425220872423, 0.7206631793495217], [25.336747437025497, 0.5461616755599756, 11.999997821002319], [27.458921918681686, 0.44956397841225204, 0.5000000000000003]], "r_squared_": 0.9913411389235544, "error_": 0.04537290704288807}
{"freq_range": [2.0, 80.0], "freq_res": 0.5, "aperiodic_params_": [-7.45865576561229, 0.8475701889435252], "gaussian_params_": [[7.814790194890471, 0.20727143922726185, 0.5146727434337314], [9.158184738733123, 0.2443437152614668, 0.45719335669275313], [11.862973014286865, 0.16543915008264398, 1.3833032500751037], [17.373169329998653, 0.7629080962151239, 3.3696514233318853], [22.38269969122791, 0.12367980942252244, 0.47327629380007724], [25.168738291113403, 0.28771173152546786, 1.0563313651723463], [27.425381535355662, 0.1751467206387118, 0.47022464296862015], [28.892036050612734, 0.1937096490102404, 0.3353793748998527], [30.339656565094735, 0.1757844364274328, 0.49181876352816445], [60.57866646685724, 0.13950236987604045, 0.25000000000000006], [61.90251946177106, 0.13737933511050754, 0.25000089812219756], [62.839876769651845, 0.15228862212735733, 0.4314869078499027], [70.60232661848124, 0.10570573292317778, 0.8934526709429312], [72.33473697903149, 0.17181608113738017, 0.25000000100163194]], "peak_params_": [[7.814790194890471, 0.22343394290884255, 1.0293454868674627], [9.158184738733123, 0.2990071148542519, 0.9143867133855063], [11.862973014286865, 0.3785916545614523, 2.7666065001502074], [17.373169329998653, 0.7624088716588542, 6.7393028466637706], [22.38269969122791, 0.3715423507418816, 0.9465525876001545], [25.168738291113403, 0.34295475544873355, 2.1126627303446925], [27.425381535355662, 0.20652715257229737, 0.9404492859372403], [28.892036050612734, 0.19125805205300317, 0.6707587497997054], [30.339656565094735, 0.16707555992018186, 0.9836375270563289], [60.57866646685724, 0.1327642380495142, 0.5000000000000001], [61.90251946177106, 0.15022906577691586, 0.5000017962443951], [62.839876769651845, 0.1421644444938206, 0.8629738156998054], [70.60232661848124, 0.10501473091831848, 1.7869053418858625], [72.33473697903149, 0.1491719586777993, 0.5000000020032639]], "r_squared_": 0.9863825796152438, "error_": 0.0397706189178362}
{"freq_range": [2.0, 80.0], "freq_res": 0.5, "aperiodic_params_": [-7.281523600563471, 0.6147522854906458], "gaussian_params_": [[8.4156376907463, 0.17227404900200116, 0.7198480003341488], [12.253013931994808, 0.21568955264719483, 1.1238290421166586], [14.708252173456762, 0.24406518095820928, 0.36275939298214605], [15.648217026890606, 0.2070153081283444, 0.29061709191458596], [16.451385714412854, 0.14181859981780576, 0.2725614272663954], [17.76227722248704, 0.3443959681463791, 1.1851452791427837], [20.333905162178272, 0.178676926026938, 0.5436944445110943], [21.7298770259399, 0.2289688946951777, 0.25000003472958654], [22.54431505793663, 0.14797334961123243, 0.2553239230004046], [25.287667919459096, 0.19328375507414494, 0.831857549041189], [28.699143223551236, 0.16125561369642893, 0.42102457874758176], [30.517946932874224, 0.2404066318150239, 0.44775789444130454], [41.82291166262515, 0.16774960576519904, 0.2500000000000001], [43.49219591878294, 0.2061765379166931, 0.6200523466999637], [46.53733114823397, 0.08565115481610212, 0.25000000000000006], [49.03514401507536, 0.14030151198624316, 0.25000000000000006], [55.235152958597325, 0.12255214640632613, 0.8308143293859532], [57.88026559718691, 0.13017551135127123, 0.7275639159627634], [60.62454176116478, 0.1492744447431086, 0.25000000000000006], [62.4153275935924, 0.22011798821963924, 0.7436998149939276], [64.55045443417389, 0.16351680307370026, 0.43014045232091397], [65.54019105381182, 0.1386338927682154, 0.2508338564075533], [70.10712363524861, 0.1267472700382624, 0.9128077492345595], [72.40547670079006, 0.21539273265239717, 0.3472728437866429], [78.17587958087832, 0.16883667551882842, 0.25000000000000006]], "peak_params_": [[8.4156376907463, 0.17191193617732115, 1.4396960006682975], [12.253013931994808, 0.21056112293118723, 2.247658084233317], [14.708252173456762, 0.24408944904099705, 0.7255187859642921], [15.648217026890606, 0.26365444296478024, 0.5812341838291719], [16.451385714412854, 0.33788587899139255, 0.5451228545327907], [17.76227722248704, 0.33755517228796705, 2.3702905582855673], [20.333905162178272, 0.19442715870015448, 1.0873888890221886], [21.7298770259399, 0.17036841412778347, 0.5000000694591731], [22.54431505793663, 0.1486373019293925, 0.5106478460008091], [25.287667919459096, 0.1870887170579536, 1.663715098082378], [28.699143223551236, 0.14431045854140834, 0.8420491574951635], [30.517946932874224, 0.24023076483962402, 0.8955157888826091], [41.82291166262515, 0.14192083266365962, 0.5000000000000002], [43.49219591878294, 0.20616020821904257, 1.2401046933999273], [46.53733114823397, 0.08470314210830843, 0.5000000000000001], [49.03514401507536, 0.13892204514231388, 0.5000000000000001], [55.235152958597325, 0.11779171772146313, 1.6616286587719065], [57.88026559718691, 0.12890709789138732, 1.4551278319255267], [60.62454176116478, 0.14004092937745405, 0.5000000000000001], [62.4153275935924, 0.21869786479217979, 1.4873996299878551], [64.55045443417389, 0.16675082872141722, 0.8602809046418279], [65.54019105381182, 0.15120753391086694, 0.5016677128151066], [70.10712363524861, 0.1258774566013212, 1.825615498469119], [72.40547670079006, 0.211640353064249, 0.6945456875732858], [78.17587958087832, 0.13182335607560525, 0.5000000000000001]], "r_squared_": 0.9731653727760454, "error_": 0.028330912875869276}
{"freq_range": [2.0, 80.0], "freq_res": 0.5, "aperiodic_params_": [-7.73676106799106, 0.6980909638340228], "gaussian_params_": [[9.935509037622749, 0.036655468784754605, 0.25000000000000006], [11.35009029766957, 0.13483366894978435, 1.1524108159749777], [15.710657282611697, 0.3053419023403269, 1.186824703682893], [18.175227399663264, 0.1962198571825576, 0.6305765170018431], [20.590220342781315, 0.1853617886696865, 0.30676426993830613], [21.718893064074585, 0.16464993931237398, 0.3708379136833856], [25.248345925008945, 0.14573624816098613, 0.6202018324726892], [28.609877644522953, 0.13552749681526485, 0.46889954719670673], [30.25295011333351, 0.18500384871164605, 0.25000000000000006], [35.95500377942375, 0.16033303009234318, 0.49213238939442294], [43.169424912260126, 0.13034729779145543, 0.4695087374182801], [55.254745147199145, 0.08443882454114145, 1.7595921900912002], [57.735583032718786, 0.11418775010471494, 0.25000000000000006], [58.833220078252836, 0.14592002948469177, 0.25000000000000006], [60.43685866464098, 0.09603479267068395, 0.25000000000000006], [62.13469260002526, 0.24067527872313924, 0.39276949239554454], [64.7364695958787, 0.12311550350513809, 1.0497979275825629], [70.19017405404765, 0.16850933803511833, 0.876522935571703], [72.34547963473659, 0.16685471241051505, 0.39999170982414145], [74.49987463745447, 0.20339835256056382, 0.4266576062078618], [78.20924119255798, 0.15728517009437704, 0.4824845487960611]], "peak_params_": [[9.935509037622749, 0.10334235118949309, 0.5000000000000001], [11.35009029766957, 0.13426199316851672, 2.3048216319499555], [15.710657282611697, 0.3007999308402063, 2.373649407365786], [18.175227399663264, 0.23630012660418842, 1.2611530340036863], [20.590220342781315, 0.17856670383581985, 0.6135285398766123], [21.718893064074585, 0.14060927059110817, 0.7416758273667712], [25.248345925008945, 0.13450849288506994, 1.2404036649453785], [28.609877644522953, 0.13185729698409965, 0.9377990943934135], [30.25295011333351, 0.11357472670525581, 0.5000000000000001], [35.95500377942375, 0.15966426459412908, 0.9842647787888459], [43.169424912260126, 0.12213096900889298, 0.9390174748365602], [55.254745147199145, 0.08362258849104798, 3.5191843801824003], [57.735583032718786, 0.11065759655297214, 0.5000000000000001], [58.833220078252836, 0.12557413015129093, 0.5000000000000001], [60.43685866464098, 0.09409065115043802, 0.5000000000000001], [62.13469260002526, 0.2311055304275822, 0.7855389847910891], [64.7364695958787, 0.12003151887705243, 2.0995958551651257], [70.19017405404765, 0.16458992560070307, 1.753045871143406], [72.34547963473659, 0.1600931774857326, 0.7999834196482829], [74.49987463745447, 0.20339937528645713, 0.8533152124157236], [78.20924119255798, 0.1431687192027571, 0.9649690975921222]], "r_squared_": 0.9740208889233527, "error_": 0.03041994849346015}
{"freq_range": [2.0, 80.0], "freq_res": 0.5, "aperiodic_params_": [-7.4670525085691155, 0.986786550832134], "gaussian_params_": [[4.565724979549895, 0.1276314060496656, 0.4529871410612981], [11.427045919047886, 0.1953910147988768, 0.7094936789134393], [13.422915090226688, 0.2129344399051258, 0.5183670769110406], [15.20818948426597, 0.19687366669769643, 0.2500000106471462], [17.405893394637747, 0.3763800134331274, 1.9701299449942247], [20.636845837337784, 0.18456393891619247, 0.32159137212998157], [22.23673625033162, 0.23993342701534912, 0.46113341156432114], [24.00989116706977, 0.1710209850218771, 0.5585142260124263], [56.517105292695085, 0.07727395307250752, 2.9505278915570567], [57.10051018946259, 0.055020664732472455, 0.5307083981391721], [58.97497783036658, 0.06597726054988763, 0.2500000000970009], [62.13626254392298, 0.1985639703905337, 0.46562179262837894], [64.64268715164923, 0.1134542300004546, 0.9796960358153274], [70.12176068816463, 0.1407046369127795, 1.1612265632678875], [74.45544172592166, 0.19787358343253103, 0.47074579621735985], [78.03403015416897, 0.11495378314257451, 0.7675586054757177]], "peak_params_": [[4.565724979549895, 0.12629501670003318, 0.9059742821225962], [11.427045919047886, 0.19878955019098576, 1.4189873578268786], [13.422915090226688, 0.2660675624036646, 1.0367341538220811], [15.20818948426597, 0.3198337787422947, 0.5000000212942924], [17.405893394637747, 0.3759508731092094, 3.9402598899884493], [20.636845837337784, 0.2784439731425383, 0.6431827442599631], [22.23673625033162, 0.23541963070364247, 0.9222668231286423], [24.00989116706977, 0.17254448134750433, 1.1170284520248526], [56.517105292695085, 0.10627955173786674, 5.9010557831141135], [57.10051018946259, 0.13028864540517482, 1.0614167962783443], [58.97497783036658, 0.11997151300704445, 0.5000000001940018], [62.13626254392298, 0.2069709456250326, 0.9312435852567579], [64.64268715164923, 0.1142472075867822, 1.9593920716306548], [70.12176068816463, 0.13993555591028084, 2.322453126535775], [74.45544172592166, 0.19710720211320165, 0.9414915924347197], [78.03403015416897, 0.11484085958281831, 1.5351172109514355]], "r_squared_": 0.9847418378932813, "error_": 0.03376475333441995}
{"freq_range": [2.0, 80.0], "freq_res": 0.5, "aperiodic_params_": [-7.192255727354554, 1.1969271540216966], "gaussian_params_": [[18.594444643690476, 0.6852691520965924, 5.213810101734099], [29.726017299567975, 0.10029397556300876, 1.6578977404921915], [60.12416814720367, 0.2250713792390557, 0.25000000000000006]], "peak_params_": [[18.594444643690476, 0.6851567330844688, 10.427620203468198], [29.726017299567975, 0.17624861882105414, 3.315795480984383], [60.12416814720367, 0.19895442188076018, 0.5000000000000001]], "r_squared_": 0.989194134407553, "error_": 0.04618818856879611}
{"freq_range": [2.0, 80.0], "freq_res": 0.5, "aperiodic_params_": [-7.221031617727155, 1.2742382325581567], "gaussian_params_": [[11.899596689047744, 0.10932205592250353, 0.5071511980328453], [16.574066219678926, 0.6134594303889674, 3.6112977845743206], [24.549951030616715, 0.4109293132308969, 3.8099735949643985], [27.235182910589828, 0.244458607945016, 0.25000000000000006], [28.802353330698864, 0.23139807664340278, 0.25000000000000006], [29.830983483998924, 0.26623736484280736, 0.25000000000000117]], "peak_params_": [[11.899596689047744, 0.3840672496465132, 1.0143023960656905], [16.574066219678926, 0.657424558493604, 7.222595569148641], [24.549951030616715, 0.4660754717137703, 7.619947189928797], [27.235182910589828, 0.500724645673639, 0.5000000000000001], [28.802353330698864, 0.37974638330988064, 0.5000000000000001], [29.830983483998924, 0.3601764378078798, 0.5000000000000023]], "r_squared_": 0.9903691232972244, "error_": 0.045574537586527124}
{"freq_range": [2.0, 80.0], "freq_res": 0.5, "aperiodic_params_": [-7.016657682689817, 1.2559929580676636], "gaussian_params_": [[8.276755446521094, 0.1584914807676356, 0.8370271106100567], [14.25907176280111, 0.5893839628715942, 2.3799518784641993], [18.801246648712898, 0.6056894393147291, 2.536550922206144], [21.9541479244902, 0.20511845411820642, 0.5438131129944154], [24.547910887674828, 0.2877938910765927, 0.8141982365964792], [27.354993526140547, 0.2935516254146131, 1.0013882970108563], [30.38233348256801, 0.25183680999063357, 0.49439156659882477], [66.57084765077616, 0.12726468901790178, 0.25000000000000006]], "peak_params_": [[8.276755446521094, 0.1846534937283293, 1.6740542212201135], [14.25907176280111, 0.7302052157188852, 4.759903756928399], [18.801246648712898, 0.6848770176061993, 5.073101844412288], [21.9541479244902, 0.48299375661513544, 1.0876262259888307], [24.547910887674828, 0.34095027040002535, 1.6283964731929583], [27.354993526140547, 0.2925846537504846, 2.0027765940217126], [30.38233348256801, 0.2469362261476924, 0.9887831331976495], [66.57084765077616, 0.12225560379642175, 0.5000000000000001]], "r_squared_": 0.9915010587056975, "error_": 0.04293483075124572}
{"freq_range": [2.0, 80.0], "freq_res": 0.5, "aperiodic_params_": [-7.022778632357007, 0.9097582476744298], "gaussian_params_": [[4.243654898812042, 0.20640015796206546, 0.7212940100109047], [5.98733160918732, 0.13451343083242787, 0.3115004673031943], [15.452029844490992, 0.3318985723347775, 3.639324389440356], [43.57662765280757, 0.1556983414538423, 0.25000000000000006], [55.365188053903985, 0.09950667290086401, 2.3332881471039877], [61.9599782270805, 0.1520747300544001, 1.0482682752635457], [65.42668643289439, 0.1287003641302482, 0.25000000000000006], [66.58275608399029, 0.07648323137126213, 0.25000000000000006], [71.27398270043201, 0.1186388190756867, 5.999999999999999], [72.5416780211402, 0.13143679306956493, 0.4432925184695218]], "peak_params_": [[4.243654898812042, 0.19730220347210814, 1.4425880200218093], [5.98733160918732, 0.15643167324971596, 0.6230009346063886], [15.452029844490992, 0.3318697414983607, 7.278648778880712], [43.57662765280757, 0.1485565110584801, 0.5000000000000001], [55.365188053903985, 0.10308515810653951, 4.666576294207975], [61.9599782270805, 0.18963899743441992, 2.0965365505270914], [65.42668643289439, 0.19847325856081355, 0.5000000000000001], [66.58275608399029, 0.15888034896981473, 0.5000000000000001], [71.27398270043201, 0.12686576646457404, 11.999999999999998], [72.5416780211402, 0.24704486266750791, 0.8865850369390436]], "r_squared_": 0.9723289172300722, "error_": 0.04292014651042755}
{"freq_range": [2.0, 80.0], "freq_res": 0.5, "aperiodic_params_": [-7.172852925970715, 1.0468382961075824], "gaussian_params_": [[4.06321179962338, 0.2165388381965494, 0.5457759055662091], [7.786417835494469, 0.17030732585261152, 1.4847459559000242], [11.201388784299185, 0.26365936261606465, 0.25000000000000006], [12.191830245382736, 0.1372101582261412, 0.5714618593570112], [15.048207565862887, 0.34578237194701134, 1.8968658924560415], [20.071759568340937, 0.06801280311684448, 0.5167876101019132], [20.18457077427427, 0.06347539136481146, 2.358078403097374], [46.056418708975066, 0.11077935820255867, 0.8735940766514946], [50.52850921230674, 0.12812467805574937, 0.9241558201013789], [53.66587337244475, 0.19103753575884663, 0.5249744157365759], [56.58652447475602, 0.10644917919889145, 1.4039799440502874], [59.648078297085, 0.13900555398324238, 0.5425314136982841], [61.892704088345816, 0.14297721380925546, 0.4302446661600637], [63.37664072822344, 0.09869216600403231, 0.25000000000000006], [64.6781387156078, 0.11206991786255668, 0.9389709745272906], [66.78300090832447, 0.2483578446155592, 0.2500000000851892], [67.65448773369359, 0.21352498520019317, 0.25021478785761014], [68.77520713750333, 0.19544388373397986, 0.25000000000258443], [70.38397188490148, 0.16934366060686057, 0.6740946387080067], [72.582113629203, 0.15440912367493687, 0.3294507194866653], [74.64778534531126, 0.16073532375488672, 0.25000000000000006], [76.77398270042686, 0.12087321454950088, 0.250000001076455], [78.27398270043201, 0.11737070505720391, 4.386262926516558]], "peak_params_": [[4.06321179962338, 0.22168306353887246, 1.0915518111324183], [7.786417835494469, 0.16890175859051126, 2.9694919118000485], [11.201388784299185, 0.2580580014958649, 0.5000000000000001], [12.191830245382736, 0.22955918416851162, 1.1429237187140224], [15.048207565862887, 0.3513339944029532, 3.793731784912083], [20.071759568340937, 0.14209646031467926, 1.0335752202038264], [20.18457077427427, 0.14209646031467926, 4.716156806194748], [46.056418708975066, 0.11054935832561874, 1.7471881533029892], [50.52850921230674, 0.12807282951096965, 1.8483116402027577], [53.66587337244475, 0.19196330067274303, 1.0499488314731518], [56.58652447475602, 0.10624784297713852, 2.8079598881005747], [59.648078297085, 0.14629636627404885, 1.0850628273965681], [61.892704088345816, 0.14071298924699427, 0.8604893323201274], [63.37664072822344, 0.13892485492579532, 0.5000000000000001], [64.6781387156078, 0.11092287646076393, 1.8779419490545812], [66.78300090832447, 0.18696514109867124, 0.5000000001703784], [67.65448773369359, 0.18752437114433107, 0.5004295757152203], [68.77520713750333, 0.16359284786034323, 0.5000000000051689], [70.38397188490148, 0.19125716126824166, 1.3481892774160134], [72.582113629203, 0.2002629768616977, 0.6589014389733306], [74.64778534531126, 0.21602726741528144, 0.5000000000000001], [76.77398270042686, 0.19284720834829727, 0.50000000215291], [78.27398270043201, 0.11721498824897658, 8.772525853033116]], "r_squared_": 0.9881710475378024, "error_": 0.030734781113657933}
{"freq_range": [2.0, 80.0], "freq_res": 0.5, "aperiodic_params_": [-7.099638789238445, 1.1736545116747557], "gaussian_params_": [[4.7428197905372, 0.14447509179067825, 0.7449528233762629], [11.968570827289847, 0.14529824534286945, 0.8884822217664314], [15.155827745274156, 0.0744166522826087, 0.25000000000000006], [16.912213381324094, 0.3490062464914024, 3.0872260025841785], [22.13838933434332, 0.15767170805812156, 0.37728510219648964], [24.68081068911123, 0.11903240115982812, 1.5030929804850508], [29.85525176233763, 0.29164157063386953, 0.25000000000000006], [43.03631946431691, 0.14584940691900242, 0.5819491228512484], [60.03947410828497, 0.2280489352013201, 0.25000000000000006], [61.721384734163834, 0.15702215837272107, 0.25000000000000006], [67.72601729956799, 0.07386354931824576, 5.999999999999999]], "peak_params_": [[4.7428197905372, 0.13710830580765432, 1.4899056467525258], [11.968570827289847, 0.24362541427520057, 1.7769644435328629], [15.155827745274156, 0.3497965456308041, 0.5000000000000001], [16.912213381324094, 0.3488654464926988, 6.174452005168357], [22.13838933434332, 0.2614336062461984, 0.7545702043929793], [24.68081068911123, 0.135199541589202, 3.0061859609701016], [29.85525176233763, 0.24690570927261746, 0.5000000000000001], [43.03631946431691, 0.14558080043711996, 1.163898245702497], [60.03947410828497, 0.25746267916972165, 0.5000000000000001], [61.721384734163834, 0.14920470352399562, 0.5000000000000001], [67.72601729956799, 0.07381116190153492, 11.999999999999998]], "r_squared_": 0.9882142584176676, "error_": 0.03845785746826191}
{"freq_range": [2.0, 80.0], "freq_res": 0.5, "aperiodic_params_": [-7.074451403462489, 1.227440961901151], "gaussian_params_": [[11.686147367141098, 0.15765903080261084, 0.3752372467882435], [12.648770433386552, 0.1899190624876989, 0.2500000000000058], [15.836138072284287, 0.40416893583007346, 2.572812295722498], [17.90788520620258, 0.15934444049082921, 0.2635994333049559], [20.670940650713117, 0.1930119556457204, 0.9214032093680842], [22.318629187397466, 0.2801639892921731, 0.25000000000000006], [24.205322630199937, 0.1894374393201423, 0.7552766639240078], [25.807324343466995, 0.23551139095106954, 0.25000000000000006], [27.51724243813651, 0.13044460873813277, 0.6908910229822143], [29.870462399625275, 0.3550409760880019, 0.3182089073998544], [42.97235177690055, 0.13144427788051272, 0.5357135333145833], [48.35988897890961, 0.14586232238551228, 0.4005318226164669], [60.074758973906626, 0.21605850560795806, 0.25000000000000006], [65.22601729956966, 0.050832292875624276, 5.647501822449174]], "peak_params_": [[11.686147367141098, 0.23708091047986457, 0.750474493576487], [12.648770433386552, 0.34846701076757647, 0.5000000000000115], [15.836138072284287, 0.4033505399789181, 5.145624591444996], [17.90788520620258, 0.43656274966444464, 0.5271988666099118], [20.670940650713117, 0.26788352119370096, 1.8428064187361684], [22.318629187397466, 0.2711732531662321, 0.5000000000000001], [24.205322630199937, 0.18547922252743732, 1.5105533278480157], [25.807324343466995, 0.19811834638819725, 0.5000000000000001], [27.51724243813651, 0.13043188708388698, 1.3817820459644286], [29.870462399625275, 0.327013484705617, 0.6364178147997088], [42.97235177690055, 0.1312913582577675, 1.0714270666291665], [48.35988897890961, 0.13783841486528203, 0.8010636452329338], [60.074758973906626, 0.23973904277710822, 0.5000000000000001], [65.22601729956966, 0.050791601120579344, 11.295003644898348]], "r_squared_": 0.9913468376241465, "error_": 0.03292088191878635}
{"freq_range": [2.0, 80.0], "freq_res": 0.5, "aperiodic_params_": [-6.804211906858961, 1.241762877333102], "gaussian_params_": [[4.600146877918, 0.18005413668067374, 0.8389359437644136], [16.13574159895787, 0.40999755597041687, 3.195524426989846], [55.77767692219624, 0.21845577560325063, 0.36921974881786707], [60.03451553904907, 0.13082213052930083, 0.5609407091559824], [61.862844431198255, 0.16127416985262358, 0.6268757431296371], [65.00575684888568, 0.14227817752005367, 0.9558077013475289], [66.92963107567832, 0.12611527877615833, 0.6398126129413643], [72.19553215046164, 0.1832481739624055, 2.2685532943126687], [75.8976942735766, 0.1596579954368521, 0.4375856737136759], [79.20839165209468, 0.2376083420521103, 0.8461220389364823]], "peak_params_": [[4.600146877918, 0.17931739500402077, 1.6778718875288272], [16.13574159895787, 0.4096278154820139, 6.391048853979692], [55.77767692219624, 0.18223471757652376, 0.7384394976357341], [60.03451553904907, 0.1325249181258421, 1.1218814183119648], [61.862844431198255, 0.1587629212498971, 1.2537514862592742], [65.00575684888568, 0.14480945366890552, 1.9116154026950578], [66.92963107567832, 0.15479874642216274, 1.2796252258827285], [72.19553215046164, 0.18256874871439166, 4.5371065886253374], [75.8976942735766, 0.20044020056223566, 0.8751713474273518], [79.20839165209468, 0.23254891341459327, 1.6922440778729646]], "r_squared_": 0.9845335230119201, "error_": 0.04326529655582305}
