{"freq_range": [2.0, 80.0], "freq_res": 0.5, "aperiodic_params_": [-7.68801048719898, 1.0492265779624272], "gaussian_params_": [[10.75913649411072, 0.35117473120186077, 0.9520421578674017], [13.07923480702006, 0.48065021166665445, 0.4958387019969374], [14.635778323571389, 0.34698995469748317, 0.3662791010364399], [15.881393568363636, 0.5440377773186885, 0.9674269762347407], [18.024285957598522, 0.3174952786338333, 0.5469088923635137], [20.265441763479714, 0.3432300890588411, 0.9873988153910447], [23.731194745645595, 0.254753027463034, 0.8929410798469499], [27.4400881597251, 0.1706034546100211, 0.5891303898861892], [30.0719893464647, 0.27247521148237214, 0.608287623927002]], "peak_params_": [[10.75913649411072, 0.34018842409657424, 1.9040843157348033], [13.07923480702006, 0.5030192256002568, 0.9916774039938748], [14.635778323571389, 0.5283139384087576, 0.7325582020728798], [15.881393568363636, 0.5406686977054651, 1.9348539524694814], [18.024285957598522, 0.3913286562097369, 1.0938177847270274], [20.265441763479714, 0.33406382796685996, 1.9747976307820894], [23.731194745645595, 0.24796024208005996, 1.7858821596938999], [27.4400881597251, 0.16979378828363423, 1.1782607797723783], [30.0719893464647, 0.2705872664865421, 1.216575247854004]], "r_squared_": 0.9838607417615965, "error_": 0.04565285889988706}
{"freq_range": [2.0, 80.0], "freq_res": 0.5, "aperiodic_params_": [-8.070094751321419, 0.8259978905732247], "gaussian_params_": [[2.361635195558355, 0.1778733919033905, 0.481283322574571], [10.892912188671787, 0.21076041983644397, 0.7395400478588222], [13.085290728316874, 0.3389545822579945, 0.3658941736252033], [15.139413321622467, 0.31960413600587173, 0.8425326865191681], [17.931078785383132, 0.2527885619200417, 2.2784888344355707], [20.791836825260216, 0.2089094656596863, 0.2500004759330678], [23.575372550223683, 0.177113538389202, 0.7806758309905252], [25.56214559670745, 0.12935662654427016, 0.25000000000000006], [29.298378852599292, 0.14100626405883404, 1.331888047213944], [29.860474885794822, 0.14321890158658598, 0.2500000000000002], [32.574169829363726, 0.13437682947167479, 0.25000000000000017], [45.25249795067872, 0.2046866395492676, 0.25000000000000006], [55.44547854360065, 0.15867932068223975, 0.34162162557302844], [58.68910329236355, 0.17842253837883815, 0.25000000002213457], [68.3564701901773, 0.07482561768324694, 4.701734515262532], [72.21911722531057, 0.11722668607971616, 0.25000000000000006]], "peak_params_": [[2.361635195558355, 0.17067247524334483, 0.962566645149142], [10.892912188671787, 0.21103808466994423, 1.4790800957176444], [13.085290728316874, 0.3705340946632294, 0.7317883472504066], [15.139413321622467, 0.4257709193825203, 1.6850653730383363], [17.931078785383132, 0.25367625775225733, 4.556977668871141], [20.791836825260216, 0.2505275871881949, 0.5000009518661356], [23.575372550223683, 0.1890525470524249, 1.5613516619810504], [25.56214559670745, 0.1373336346595213, 0.5000000000000001], [29.298378852599292, 0.1900453074743691, 2.663776094427888], [29.860474885794822, 0.24530256499377145, 0.5000000000000004], [32.574169829363726, 0.13643427309427736, 0.5000000000000003], [45.25249795067872, 0.12538970327468668, 0.5000000000000001], [55.44547854360065, 0.15845136735899423, 0.6832432511460569], [58.68910329236355, 0.14234442559084393, 0.5000000000442691], [68.3564701901773, 0.07479076091231285, 9.403469030525065], [72.21911722531057, 0.13525661934066058, 0.5000000000000001]], "r_squared_": 0.9771120174012755, "error_": 0.037564352835395554}
{"freq_range": [2.0, 80.0], "freq_res": 0.5, "aperiodic_params_": [-7.96554456939968, 0.9682341619025983], "gaussian_params_": [[4.546530470039897, 0.1399327494523185, 0.25000000000000006], [10.719349127141067, 0.536657350975107, 0.7496182876624039], [14.488072872700215, 0.47295721363354665, 2.176654012193908], [17.527065164153584, 0.17887501172867623, 0.32362725326446073], [18.665978523666926, 0.2800156162567028, 0.25000000000000006], [19.67306780828644, 0.24230816469690888, 0.25000000000000006], [20.897517467447624, 0.2765253782746036, 0.860039294762279], [24.323512059378864, 0.2147369738419439, 0.7909155680272749], [26.735076808501837, 0.17125563068585362, 0.5004343206542523], [30.084899727536328, 0.18750908360552057, 0.4543329399761364], [38.52972572565965, 0.14576980102871917, 0.25000000000000006], [48.1662355965351, 0.22677481680617836, 0.25000000000000006], [58.49541892215469, 0.19268389317839174, 0.41455315972499235], [66.33428084770212, 0.12084813950744339, 2.348876409175976], [76.36495390305737, 0.09636531540173406, 3.318716558395874]], "peak_params_": [[4.546530470039897, 0.13754255041536823, 0.5000000000000001], [10.719349127141067, 0.6024476397871776, 1.4992365753248078], [14.488072872700215, 0.47295172126684193, 4.353308024387816], [17.527065164153584, 0.359937565103273, 0.6472545065289215], [18.665978523666926, 0.3187826899418482, 0.5000000000000001], [19.67306780828644, 0.29898800435976725, 0.5000000000000001], [20.897517467447624, 0.27998687864336524, 1.720078589524558], [24.323512059378864, 0.20951961103661176, 1.5818311360545498], [26.735076808501837, 0.15823585538708684, 1.0008686413085046], [30.084899727536328, 0.18426366547481976, 0.9086658799522728], [38.52972572565965, 0.14474299507093313, 0.5000000000000001], [48.1662355965351, 0.18179566566557703, 0.5000000000000001], [58.49541892215469, 0.193136265073651, 0.8291063194499847], [66.33428084770212, 0.12170981726482388, 4.697752818351952], [76.36495390305737, 0.09629591376021551, 6.637433116791748]], "r_squared_": 0.977951037889447, "error_": 0.04314111225894429}
{"freq_range": [2.0, 80.0], "freq_res": 0.5, "aperiodic_params_": [-7.693583919936305, 1.0635515391752295], "gaussian_params_": [[10.446227998047503, 0.32652588548235656, 0.9797362856191845], [14.644913563703339, 0.2688439014177638, 1.7458264082163224], [19.515855673927817, 0.28196464975217816, 1.569856025379109], [20.98009818586685, 0.230385310259799, 0.342782871841175], [23.40345448924994, 0.17053707389312583, 0.7703904713239907], [27.10547829803912, 0.15406480619227542, 0.6078742468099086], [30.24009397346981, 0.14002488305816055, 0.8295468485471308], [48.197637810038835, 0.2015059847327779, 0.25000000000000006], [49.82840620313897, 0.1705580438617242, 0.25000000000000006], [58.1411304624251, 0.13974049531584792, 0.25000000000000006], [61.47230496435327, 0.13245233910751572, 0.25000000000000006], [63.25447926029588, 0.13775151421356918, 0.5417969785370056], [66.17648287586506, 0.18078493384019637, 0.593427409484598], [77.24647089262285, 0.11516765171584001, 0.25000000000000006], [77.40712025621549, 0.12279035568856349, 4.895072557503632]], "peak_params_": [[10.446227998047503, 0.3420852314377232, 1.959472571238369], [14.644913563703339, 0.2696935134435936, 3.491652816432645], [19.515855673927817, 0.28759643731058304, 3.139712050758218], [20.98009818586685, 0.41201526940775146, 0.68556574368235], [23.40345448924994, 0.18046438043030477, 1.5407809426479815], [27.10547829803912, 0.15183737402894515, 1.2157484936198173], [30.24009397346981, 0.13428300891148304, 1.6590936970942616], [48.197637810038835, 0.14742704781237137, 0.5000000000000001], [49.82840620313897, 0.13476336184020354, 0.5000000000000001], [58.1411304624251, 0.11920474346761445, 0.5000000000000001], [61.47230496435327, 0.13299519132683812, 0.5000000000000001], [63.25447926029588, 0.12648638285139313, 1.0835939570740112], [66.17648287586506, 0.18109239837254876, 1.186854818969196], [77.24647089262285, 0.19320512654474875, 0.5000000000000001], [77.40712025621549, 0.19163496048958528, 9.790145115007263]], "r_squared_": 0.9852306494608047, "error_": 0.03741341891340918}
{"freq_range": [2.0, 80.0], "freq_res": 0.5, "aperiodic_params_": [-7.783337906911509, 0.9246747554610972], "gaussian_params_": [[8.306670599704521, 0.13537295302538205, 0.25000000000000006], [9.865141409937584, 0.15737750243571702, 0.35066120572375603], [12.142363197276907, 0.20578736945589177, 0.4103826440125302], [15.415806429846032, 0.20927118154813398, 1.207217972184607], [17.304060708180764, 0.3447412766222872, 0.2500000000002292], [18.38847272345533, 0.2984750312134969, 0.30088569600140336], [20.298086549344504, 0.3574177075767433, 0.9102814110350557], [22.22612831332177, 0.34284984270873414, 0.25000000002846284], [24.193430269619455, 0.16694465729041089, 1.1439815589041353], [27.4097716666692, 0.1310337830576787, 1.1692434202277846], [29.655760270090102, 0.1636994716155309, 0.30412749298177566], [37.64510959497397, 0.07512836281013575, 0.7125766199386864], [41.86417101778035, 0.11065265758762913, 0.25000000000149963], [42.88450461099211, 0.1609380434827998, 0.42320475361262094], [54.741204010581384, 0.21159729255927442, 0.2500000000011916], [55.92386490270232, 0.12816301475096964, 0.37353927115806274], [63.35015574737035, 0.18783425919890961, 0.3545142240012761], [64.80610604953134, 0.15189458619418575, 0.5113361462328402], [66.2653381986129, 0.3075577474571385, 0.250435188449631], [68.20098003443537, 0.13323954110706585, 0.8778026458208114], [70.23523210720649, 0.19232962450670432, 0.250000000000336], [73.52827289680118, 0.10394857243220365, 1.5411149319232145], [76.00481635880254, 0.11493271984834191, 0.25000000000000006], [78.77398267048324, 0.08227625339189025, 1.802205105777522]], "peak_params_": [[8.306670599704521, 0.1004666116383941, 0.5000000000000001], [9.865141409937584, 0.14616817077092037, 0.7013224114475121], [12.142363197276907, 0.19759157288981832, 0.8207652880250604], [15.415806429846032, 0.2087631919183952, 2.414435944369214], [17.304060708180764, 0.30771179782408886, 0.5000000000004584], [18.38847272345533, 0.3374739569636951, 0.6017713920028067], [20.298086549344504, 0.3496717975686625, 1.8205628220701113], [22.22612831332177, 0.31655579913754295, 0.5000000000569257], [24.193430269619455, 0.16653181001324313, 2.2879631178082707], [27.4097716666692, 0.13320533000782753, 2.338486840455569], [29.655760270090102, 0.17009300943069938, 0.6082549859635513], [37.64510959497397, 0.07358663277151756, 1.4251532398773727], [41.86417101778035, 0.11358740163029246, 0.5000000000029993], [42.88450461099211, 0.15505873112805268, 0.8464095072252419], [54.741204010581384, 0.1329435477814922, 0.5000000000023832], [55.92386490270232, 0.12552899893962355, 0.7470785423161255], [63.35015574737035, 0.17760126437128498, 0.7090284480025522], [64.80610604953134, 0.1415350052996267, 1.0226722924656804], [66.2653381986129, 0.21929113521630583, 0.500870376899262], [68.20098003443537, 0.1299595331977894, 1.7556052916416227], [70.23523210720649, 0.14741309329031616, 0.500000000000672], [73.52827289680118, 0.10506781576617996, 3.082229863846429], [76.00481635880254, 0.16880087488896223, 0.5000000000000001], [78.77398267048324, 0.08182207341206116, 3.604410211555044]], "r_squared_": 0.9771977902519572, "error_": 0.032818174813029254}
{"freq_range": [2.0, 80.0], "freq_res": 0.5, "aperiodic_params_": [-7.943239013026176, 0.7815966043939402], "gaussian_params_": [[10.523555171326237, 0.32829896072162656, 0.8182615679269485], [14.78514257243037, 0.19859219080277946, 2.1357899874536836], [17.555175521591142, 0.19245601696247, 0.26561889094716723], [18.6465027843923, 0.18041639337682291, 0.2894419643816062], [19.669911954984034, 0.398290431145795, 0.25192801255684755], [20.631655583482672, 0.1963726841075244, 0.4596350618607712], [24.270422730353516, 0.2618705851462523, 2.7023703040613216], [39.063185449554084, 0.10424623594401425, 0.5727935999104337], [46.07567755515238, 0.12536587662369086, 0.2900367426687942], [52.12289447860403, 0.18971422663405316, 0.33705443559405446], [53.65403016439161, 0.18998051483737627, 0.2500000000019559], [58.518777933749504, 0.17778934531158838, 0.7077014341651694], [63.35533106723487, 0.1408903048398535, 0.2500000000005659], [66.38657085079986, 0.12957227455297923, 0.9040668718894458], [71.99365460152525, 0.14867496256268384, 1.3375444761187159], [75.46300943772486, 0.2079358538648102, 0.37509940582718043]], "peak_params_": [[10.523555171326237, 0.354700376636055, 1.636523135853897], [14.78514257243037, 0.19831883351259272, 4.271579974907367], [17.555175521591142, 0.28830412925232274, 0.5312377818943345], [18.6465027843923, 0.22962709107852675, 0.5788839287632124], [19.669911954984034, 0.40158127991598214, 0.5038560251136951], [20.631655583482672, 0.29470605465372124, 0.9192701237215424], [24.270422730353516, 0.2609336895152303, 5.404740608122643], [39.063185449554084, 0.10361399285780237, 1.1455871998208673], [46.07567755515238, 0.12117015540112952, 0.5800734853375884], [52.12289447860403, 0.17751364803070047, 0.6741088711881089], [53.65403016439161, 0.15718218495387326, 0.5000000000039118], [58.518777933749504, 0.17772677119154423, 1.4154028683303388], [63.35533106723487, 0.11996190241242033, 0.5000000000011318], [66.38657085079986, 0.12858872933459153, 1.8081337437788916], [71.99365460152525, 0.14867329007177155, 2.6750889522374317], [75.46300943772486, 0.21171317396874123, 0.7501988116543609]], "r_squared_": 0.9557515776450917, "error_": 0.04198260146107054}
{"freq_range": [2.0, 80.0], "freq_res": 0.5, "aperiodic_params_": [-7.820971285197707, 0.863177137324296], "gaussian_params_": [[10.84712595594537, 0.5358281616189142, 1.3247800820221904], [14.916237906830638, 0.5607635759559171, 2.2618846674567927], [20.683077906269784, 0.1626134846225572, 0.25000000000000006], [23.021967692918015, 0.21479061847495295, 1.8607405361130285], [56.09733056257965, 0.1387292196197206, 0.8559579303490499], [65.87199056487367, 0.14735040400686275, 1.5534925383624605], [67.35005596539806, 0.17425033726314773, 0.25000000000000006], [75.78100081535298, 0.09761435889260743, 2.253191101132743]], "peak_params_": [[10.84712595594537, 0.6575357452973964, 2.649560164044381], [14.916237906830638, 0.5643360496408683, 4.5237693349135855], [20.683077906269784, 0.23672884895989377, 0.5000000000000001], [23.021967692918015, 0.2157201490746452, 3.721481072226057], [56.09733056257965, 0.1378352384558692, 1.7119158606980998], [65.87199056487367, 0.1468589831893894, 3.106985076724921], [67.35005596539806, 0.23076836207849105, 0.5000000000000001], [75.78100081535298, 0.09715437005780281, 4.506382202265486]], "r_squared_": 0.9789606355776673, "error_": 0.04611241637688138}
{"freq_range": [2.0, 80.0], "freq_res": 0.5, "aperiodic_params_": [-7.595448769257283, 0.9738344747085959], "gaussian_params_": [[10.892514888100468, 0.5066373095378617, 0.6743356300172381], [14.75762249396556, 0.30148254464839147, 2.3552838987497053], [21.220490085007288, 0.2819334452247801, 0.25000000251749505], [21.41933919059322, 0.2997236195265737, 5.209877642313929]], "peak_params_": [[10.892514888100468, 0.625253311150419, 1.3486712600344761], [14.75762249396556, 0.44018812520662287, 4.710567797499411], [21.220490085007288, 0.4988374893449521, 0.5000000050349901], [21.41933919059322, 0.4556041643022013, 10.419755284627858]], "r_squared_": 0.9723558393057903, "error_": 0.05660244721623779}
{"freq_range": [2.0, 80.0], "freq_res": 0.5, "aperiodic_params_": [-7.258552494072541, 1.1836942825363075], "gaussian_params_": [[10.581006280885097, 0.44610191252596043, 0.5292442841317908], [11.85992551840999, 0.17949264064209947, 0.39116770811755147], [16.537539358720398, 0.41222319876475755, 2.950623696715474], [19.494156692997397, 0.2881329292981944, 0.44153568492572076], [21.118295359308824, 0.46657578055289556, 0.39700021626194476], [23.646871517782124, 0.39390206752879714, 1.264626069107885], [26.858618762347632, 0.20003035791888624, 0.6228127894651475], [30.44301931914909, 0.21720190736692793, 1.4689491997833937], [32.65297380879778, 0.11558785077414648, 0.5433698272986192], [35.521911028866, 0.15253645719359854, 0.6922365201551334], [70.07366731743338, 0.13975916632926222, 0.8234555936255392], [72.65306383055237, 0.21111894116495075, 0.6095718179581893], [75.37983081395062, 0.21966133522262427, 0.5824738829493847], [77.39173921479207, 0.26900045373227494, 0.4358746810178235], [79.16842852583595, 0.23638145542325245, 0.25000000000000006]], "peak_params_": [[10.581006280885097, 0.4921441233681936, 1.0584885682635816], [11.85992551840999, 0.30696132063567205, 0.7823354162351029], [16.537539358720398, 0.412189884144464, 5.901247393430948], [19.494156692997397, 0.5390673824865573, 0.8830713698514415], [21.118295359308824, 0.6226009158603745, 0.7940004325238895], [23.646871517782124, 0.4167295192070135, 2.52925213821577], [26.858618762347632, 0.2213543210624529, 1.245625578930295], [30.44301931914909, 0.21708945326004958, 2.9378983995667873], [32.65297380879778, 0.19259126318514497, 1.0867396545972383], [35.521911028866, 0.15304011191391886, 1.3844730403102667], [70.07366731743338, 0.13921727685070984, 1.6469111872510784], [72.65306383055237, 0.20638830145759357, 1.2191436359163785], [75.37983081395062, 0.21506171601927093, 1.1649477658987695], [77.39173921479207, 0.26112128088510467, 0.871749362035647], [79.16842852583595, 0.18868508888103364, 0.5000000000000001]], "r_squared_": 0.9879284654730395, "error_": 0.038929158554474055}
{"freq_range": [2.0, 80.0], "freq_res": 0.5, "aperiodic_params_": [-7.363152899119478, 1.20467295805002], "gaussian_params_": [[8.090704583447367, 0.12067171507412727, 0.25000000000000006], [10.547686841276153, 0.2790962427560939, 0.8939810314599964], [13.128411744292736, 0.16325077673504962, 0.4485249045459158], [14.29331686327662, 0.2947543813756748, 0.25000000000000006], [17.109113485674957, 0.3499957248691367, 1.943955137240767], [19.610642299986743, 0.28032512285732597, 0.4947203497871495], [20.961478593114347, 0.41911537244034036, 0.46659336114550043], [23.27174276689493, 0.26753213437702084, 1.097149422113294], [26.32310530947215, 0.17758102840525875, 0.25000000000000006], [27.50033968170147, 0.2044202376417221, 0.32109042735027493], [29.236535771094513, 0.1627754022077051, 0.5247477380925298], [30.668222707847637, 0.2682797149568621, 0.33143160163543683], [35.55974737911354, 0.16003835819891563, 0.34317529700263144], [61.78154783753771, 0.18677491461891027, 0.25000000000000006], [71.16769671210666, 0.12522633140469758, 0.8614649520694869], [75.19571770626767, 0.11262982898373211, 0.6877759290691274], [77.4968158348182, 0.16502121508709158, 0.40151075480453785]], "peak_params_": [[8.090704583447367, 0.1178015470506395, 0.5000000000000001], [10.547686841276153, 0.2797811319596111, 1.7879620629199928], [13.128411744292736, 0.2006609455601538, 0.8970498090918316], [14.29331686327662, 0.3531663585187541, 0.5000000000000001], [17.109113485674957, 0.3494450950241639, 3.887910274481534], [19.610642299986743, 0.44151363777544184, 0.989440699574299], [20.961478593114347, 0.5017056257633801, 0.9331867222910009], [23.27174276689493, 0.2633790796686313, 2.194298844226588], [26.32310530947215, 0.14337948265682954, 0.5000000000000001], [27.50033968170147, 0.20526401108882375, 0.6421808547005499], [29.236535771094513, 0.14705579759725218, 1.0494954761850597], [30.668222707847637, 0.24482415263703317, 0.6628632032708737], [35.55974737911354, 0.15763115410059747, 0.6863505940052629], [61.78154783753771, 0.12750217821002607, 0.5000000000000001], [71.16769671210666, 0.12287598684873657, 1.7229299041389738], [75.19571770626767, 0.10816696988577945, 1.3755518581382549], [77.4968158348182, 0.16542738939738477, 0.8030215096090757]], "r_squared_": 0.9918902461139573, "error_": 0.03048300317788474}
{"freq_range": [2.0, 80.0], "freq_res": 0.5, "aperiodic_params_": [-7.466876854047537, 1.1893379516789744], "gaussian_params_": [[2.776500787145021, 0.19624286098348379, 0.25000000000000006], [12.676822966321218, 0.1457032073515196, 0.25000000000000006], [14.352612919001599, 0.1554258468795692, 0.25000000000000006], [17.17810456032934, 0.20713744083316765, 3.3279614777177295], [20.129399993163954, 0.22301703753534569, 0.6018490866451208], [22.2028391783641, 0.20912288512125157, 0.25000000000000006], [23.27174282691673, 0.15910461141363483, 0.4466581084313441], [27.786830496394554, 0.1131958096827711, 1.5722947285649767], [41.48327498869059, 0.1425502275693593, 0.30094488805535086], [60.06636181998141, 0.11019332957801023, 0.25000000000000006], [64.44016482645252, 0.11572028685663803, 2.1659598007332552], [66.3901658658679, 0.18121325320139975, 0.41188251373250534], [67.83791964879092, 0.1561586092041596, 0.2994160045496596], [70.31396051089779, 0.21582387853569693, 0.3981228545292235], [79.22105915544871, 0.10948643802020702, 5.001069354158697]], "peak_params_": [[2.776500787145021, 0.13161986817457372, 0.5000000000000001], [12.676822966321218, 0.1905810983013687, 0.5000000000000001], [14.352612919001599, 0.28047522500167155, 0.5000000000000001], [17.17810456032934, 0.20684131858365085, 6.655922955435459], [20.129399993163954, 0.3625096102067289, 1.2036981732902416], [22.2028391783641, 0.22765413674775736, 0.5000000000000001], [23.27174282691673, 0.1764733237326439, 0.8933162168626883], [27.786830496394554, 0.11320755603606258, 3.1445894571299533], [41.48327498869059, 0.14233025854838743, 0.6018897761107017], [60.06636181998141, 0.12060026277603164, 0.5000000000000001], [64.44016482645252, 0.11711928288557338, 4.3319196014665104], [66.3901658658679, 0.252823621904561, 0.8237650274650107], [67.83791964879092, 0.1737789405233663, 0.5988320090993192], [70.31396051089779, 0.21974564395198293, 0.796245709058447], [79.22105915544871, 0.10937953021892, 10.002138708317394]], "r_squared_": 0.9897986179122449, "error_": 0.03328374069679026}
{"freq_range": [2.0, 80.0], "freq_res": 0.5, "aperiodic_params_": [-7.407932783055011, 1.139107326551042], "gaussian_params_": [[12.324053210917274, 0.22279046487397025, 0.25000000000000006], [14.567729888829039, 0.2578216151061834, 0.5861136866924794], [15.853542070113312, 0.3378671510852555, 0.25000000000000006], [17.634952488421348, 0.36427675043050733, 0.7592988683408659], [20.080356325613895, 0.35233287542434416, 0.7559021316875831], [22.38194753622442, 0.2152490899386426, 0.5290288477194912], [24.42123801372882, 0.17935616188910286, 2.6819640415463946], [27.196724728950574, 0.17967651691238928, 0.25000000000000006], [28.720325297056736, 0.16754688978178067, 0.25000000000000006], [29.529147038250787, 0.11809896599900338, 0.2500000000000135], [38.46178212492292, 0.13240830280948004, 0.25000000000000006], [46.66540328045004, 0.17949653671838173, 0.25000000000000006], [62.90048430878017, 0.13979711366077846, 0.27051958127448705], [64.44518029297089, 0.20374479567680545, 0.42689764410546394], [66.44268648625712, 0.24761266939931964, 0.5262738519992665], [70.09946723076122, 0.17620318526167073, 0.36321013479324343], [73.4985303712968, 0.08422855856084986, 0.25000000000000006], [76.27398267833122, 0.06817571406550459, 2.3964139968846467]], "peak_params_": [[12.324053210917274, 0.17443676115721019, 0.5000000000000001], [14.567729888829039, 0.25636999818625483, 1.1722273733849589], [15.853542070113312, 0.33477053065438156, 0.5000000000000001], [17.634952488421348, 0.36602859773016583, 1.5185977366817318], [20.080356325613895, 0.3992947569249541, 1.5118042633751663], [22.38194753622442, 0.3508211610064773, 1.0580576954389824], [24.42123801372882, 0.17935000783225163, 5.363928083092789], [27.196724728950574, 0.24480424154100433, 0.5000000000000001], [28.720325297056736, 0.17007801797246458, 0.5000000000000001], [29.529147038250787, 0.1484492278959184, 0.500000000000027], [38.46178212492292, 0.13087032223777229, 0.5000000000000001], [46.66540328045004, 0.14421279505499562, 0.5000000000000001], [62.90048430878017, 0.13131233451853674, 0.5410391625489741], [64.44518029297089, 0.20234436562160063, 0.8537952882109279], [66.44268648625712, 0.2461671988904346, 1.052547703998533], [70.09946723076122, 0.1719324830510498, 0.7264202695864869], [73.4985303712968, 0.11911433132523541, 0.5000000000000001], [76.27398267833122, 0.06787316625251094, 4.7928279937692935]], "r_squared_": 0.9864346074492065, "error_": 0.037708698298228725}
{"freq_range": [2.0, 80.0], "freq_res": 0.5, "aperiodic_params_": [-7.369959771468462, 0.9519333642347623], "gaussian_params_": [[11.483247867583936, 0.0887590097296075, 0.25000000000000006], [15.754244540166013, 0.20023314111534796, 0.25000000000000006], [20.61897895946736, 0.3615886741528682, 4.50033343317783], [29.221571094172628, 0.15992041527780151, 0.4761145900391242], [66.40625389316791, 0.08195931096094282, 0.25000000000000006], [66.72624140064558, 0.05889589098475494, 2.541846275114303], [75.13087618362026, 0.10133670287923849, 4.430404823777165]], "peak_params_": [[11.483247867583936, 0.13497309684062841, 0.5000000000000001], [15.754244540166013, 0.3370432947869748, 0.5000000000000001], [20.61897895946736, 0.36146232862168937, 9.00066686635566], [29.221571094172628, 0.20734955469634286, 0.9522291800782484], [66.40625389316791, 0.15025197271420865, 0.5000000000000001], [66.72624140064558, 0.15025197271420865, 5.083692550228606], [75.13087618362026, 0.10158719544885564, 8.86080964755433]], "r_squared_": 0.9756393244557713, "error_": 0.044182266182388776}
{"freq_range": [2.0, 80.0], "freq_res": 0.5, "aperiodic_params_": [-7.435430081609342, 0.8245882036010427], "gaussian_params_": [[10.130186378336006, 0.1945558077458423, 0.4569874709972895], [11.33078080000102, 0.23592812195732846, 0.25000000000000006], [13.964764422385318, 0.18447684254845825, 0.777374117445859], [15.846765573886646, 0.30279516630639236, 0.46608523890423503], [17.28751834881123, 0.23731422568591273, 0.25000000000000006], [19.60310025626257, 0.31758773164342935, 1.5104375401649974], [24.046715637472914, 0.2640142292407241, 2.2663482396037153], [29.170943077147896, 0.10861490290934328, 0.4915346853107704], [39.344893412737136, 0.14377137855539798, 0.25000000000678124], [63.375763376324706, 0.14323858101605177, 0.32417433079127794], [66.39288149546461, 0.2148016322532827, 0.25000000000000006], [68.91612318927413, 0.11692232248413267, 0.25000000000000006], [72.64692166467589, 0.1335360982673453, 1.6411698943496045], [75.77217293116401, 0.2350325154080493, 0.25000000000000006], [79.54333696834864, 0.12449308770205485, 0.31632679914667866]], "peak_params_": [[10.130186378336006, 0.18681970214830024, 0.913974941994579], [11.33078080000102, 0.19101361983920562, 0.5000000000000001], [13.964764422385318, 0.18474609142363363, 1.554748234891718], [15.846765573886646, 0.3117987176543373, 0.9321704778084701], [17.28751834881123, 0.29047919228911034, 0.5000000000000001], [19.60310025626257, 0.35213918228715535, 3.020875080329995], [24.046715637472914, 0.2685476086109908, 4.532696479207431], [29.170943077147896, 0.12647203479223457, 0.9830693706215408], [39.344893412737136, 0.11860041217506101, 0.5000000000135625], [63.375763376324706, 0.13309661692034602, 0.6483486615825559], [66.39288149546461, 0.1960818965136255, 0.5000000000000001], [68.91612318927413, 0.12183017186790046, 0.5000000000000001], [72.64692166467589, 0.1330020709964792, 3.282339788699209], [75.77217293116401, 0.17172808149481789, 0.5000000000000001], [79.54333696834864, 0.12335207741368315, 0.6326535982933573]], "r_squared_": 0.9646814171475979, "error_": 0.04021837866452786}
{"freq_range": [2.0, 80.0], "freq_res": 0.5, "aperiodic_params_": [-7.662838006285977, 0.728212715858484], "gaussian_params_": [[10.190953056308235, 0.32236068824315006, 0.672684066179735], [11.325755455593114, 0.29843475409348047, 0.25000000000000006], [15.951474558480488, 0.19787784177794857, 2.542762191732603], [19.652171803910868, 0.29274979241462257, 0.25000000000000006], [20.632524117867796, 0.1971859897694574, 0.4470171378187228], [24.158904520808512, 0.2655413881797114, 2.50081543051363], [31.05888072957098, 0.1345520586742434, 0.2841775704840225], [53.57701740871675, 0.16662493169577763, 0.3127696969700164], [58.557943496113886, 0.16223126031454438, 0.9710181009693493], [63.37421278236758, 0.15081987027998456, 0.25000000000000006], [66.5332870321288, 0.11085338527451012, 1.0697814063723265], [72.59165334138133, 0.13972503831314567, 1.4872932513691588], [75.53977532941711, 0.17181314386334295, 0.34906887775480333]], "peak_params_": [[10.190953056308235, 0.3224196580509986, 1.34536813235947], [11.325755455593114, 0.3253572679830512, 0.5000000000000001], [15.951474558480488, 0.1991385159198753, 5.085524383465206], [19.652171803910868, 0.37276549081965804, 0.5000000000000001], [20.632524117867796, 0.32064825188162693, 0.8940342756374456], [24.158904520808512, 0.2663266045556991, 5.00163086102726], [31.05888072957098, 0.13799221883583357, 0.568355140968045], [53.57701740871675, 0.16164923976444534, 0.6255393939400328], [58.557943496113886, 0.16194267599620815, 1.9420362019386985], [63.37421278236758, 0.1348789052346202, 0.5000000000000001], [66.5332870321288, 0.11083154058222533, 2.139562812744653], [72.59165334138133, 0.13946000317075224, 2.9745865027383176], [75.53977532941711, 0.19135225705098158, 0.6981377555096067]], "r_squared_": 0.9538671450806354, "error_": 0.04380003395146703}
{"freq_range": [2.0, 80.0], "freq_res": 0.5, "aperiodic_params_": [-7.5937050870292255, 0.9329410477796423], "gaussian_params_": [[12.611845549693106, 0.7006978030915388, 3.004972731386464], [20.64673145613367, 0.09107725099906934, 0.25000000000000006], [21.431392190478643, 0.19013712933735727, 3.791271364687311], [59.674314886402236, 0.2123333834634106, 0.25000000000000006], [66.22601730026764, 0.1432614884978615, 1.4204283542511051], [75.59259097035924, 0.08901333463861068, 4.125782136807292]], "peak_params_": [[12.611845549693106, 0.7120694180140319, 6.009945462772928], [20.64673145613367, 0.28349851911706914, 0.5000000000000001], [21.431392190478643, 0.1992014011254266, 7.582542729374622], [59.674314886402236, 0.16655897377273376, 0.5000000000000001], [66.22601730026764, 0.14742419846632338, 2.8408567085022103], [75.59259097035924, 0.08899092197128589, 8.251564273614584]], "r_squared_": 0.9809692386859538, "error_": 0.048338136456367115}
{"freq_range": [2.0, 80.0], "freq_res": 0.5, "aperiodic_params_": [-7.728308051970482, 0.977772584414743], "gaussian_params_": [[10.784489998419797, 0.4767088845984688, 1.1701069049794202], [14.335147489802424, 0.4847345137326192, 2.1014329254035062], [21.1951969940392, 0.3067690546902021, 4.934024038621601], [21.374586895622464, 0.25334507465756834, 0.5075934586482588], [30.148950208386754, 0.14536339655406808, 0.25000000000000006], [65.45690749468135, 0.19613877289119006, 0.4121990322309113]], "peak_params_": [[10.784489998419797, 0.6425496182633061, 2.3402138099588403], [14.335147489802424, 0.6085008420688975, 4.2028658508070125], [21.1951969940392, 0.5026551090937375, 9.868048077243202], [21.374586895622464, 0.5533628799303862, 1.0151869172965176], [30.148950208386754, 0.1841414361336522, 0.5000000000000001], [65.45690749468135, 0.1950698732660605, 0.8243980644618226]], "r_squared_": 0.9794800278066685, "error_": 0.051127474900184745}
{"freq_range": [2.0, 80.0], "freq_res": 0.5, "aperiodic_params_": [-7.2284856584249, 1.2482843673968802], "gaussian_params_": [[10.967924353955643, 0.4450408034641704, 0.8264737545457437], [15.907088154015781, 0.4711864833880469, 2.828202122250859], [20.973959391799585, 0.5542627264313238, 1.5387674620231064], [23.52094230040287, 0.36408474753730996, 0.435424401659263], [25.218692195312663, 0.3754806396339756, 1.0201402111373834], [27.32106541330053, 0.3418092093440478, 0.4089710061458169], [28.767222546166245, 0.28277502451587067, 0.42500427345892594], [30.275310469748355, 0.16495901944229913, 0.32639532165344903], [32.22143383634516, 0.27902624541241977, 1.8622484610372578], [65.21086115880415, 0.25578388268647745, 0.36632609697268137]], "peak_params_": [[10.967924353955643, 0.5492954375096213, 1.6529475090914874], [15.907088154015781, 0.473916500013436, 5.656404244501718], [20.973959391799585, 0.6473757767338792, 3.077534924046213], [23.52094230040287, 0.6113822584667865, 0.870848803318526], [25.218692195312663, 0.3890029806609032, 2.040280422274767], [27.32106541330053, 0.35612674564999125, 0.8179420122916338], [28.767222546166245, 0.3064402514119493, 0.8500085469178519], [30.275310469748355, 0.312239340687432, 0.6527906433068981], [32.22143383634516, 0.2770608391508951, 3.7244969220745157], [65.21086115880415, 0.21673364096411518, 0.7326521939453627]], "r_squared_": 0.9850987063408295, "error_": 0.05344973294138839}
{"freq_range": [2.0, 80.0], "freq_res": 0.5, "aperiodic_params_": [-7.254277590565139, 1.281963650332949], "gaussian_params_": [[10.591225736770065, 0.24940137372147406, 0.6781893438335147], [17.062733594171156, 0.31309993692257576, 3.650385443469948], [20.38078772307167, 0.2711000780420467, 1.3387034092215084], [23.596863955408782, 0.35488240344183614, 0.4647752891885188], [24.956438792834323, 0.19431763363107663, 0.29167468049635675], [27.182607129259882, 0.10804641911272614, 0.7695563416534008], [30.522308737704133, 0.24187522347856552, 0.3907259522194141], [30.564559492238704, 0.16932175891572393, 5.607228654515371], [47.335308221721625, 0.16820260954240923, 0.2500001467144668]], "peak_params_": [[10.591225736770065, 0.30964154103500086, 1.3563786876670294], [17.062733594171156, 0.33330487449371127, 7.300770886939896], [20.38078772307167, 0.5048219382203527, 2.677406818443017], [23.596863955408782, 0.5079126732776125, 0.9295505783770376], [24.956438792834323, 0.331453912675876, 0.5833493609927135], [27.182607129259882, 0.2510914923275269, 1.5391126833068016], [30.522308737704133, 0.4111593207177986, 0.7814519044388282], [30.564559492238704, 0.4111593207177986, 11.214457309030742], [47.335308221721625, 0.13716267332795518, 0.5000002934289336]], "r_squared_": 0.9899118710248149, "error_": 0.040786373759935574}
{"freq_range": [2.0, 80.0], "freq_res": 0.5, "aperiodic_params_": [-7.046053202312496, 1.3998193627724402], "gaussian_params_": [[4.505021887379284, 0.10997766915899762, 0.25000000000000006], [17.431680989346255, 0.40545890319582156, 2.828662796221491], [20.788220955551818, 0.06970813726616908, 0.6680178146650866], [23.76135369695232, 0.23238563918588126, 0.6563946510212065], [27.015777543864168, 0.2220090447697769, 0.8807186537491528], [28.590629196769008, 0.1723468252715443, 0.25000000000000006], [30.204803111495572, 0.17693191769444763, 0.3882986215272827], [31.84381730550633, 0.10902886780863746, 3.7845131205128104], [39.660847575537055, 0.19667851246537144, 0.25000000000000006], [40.4976696555536, 0.11480462446902463, 0.25000000000000006], [44.920462330740115, 0.14309707538805844, 0.25000000000000006], [50.62507214917351, 0.12738113421715208, 0.8385862600359025], [55.13207145749473, 0.1316098107045287, 0.4577956328494776], [59.93624246756117, 0.11750372711767763, 0.5418430807032381], [72.11629021746108, 0.19134023697051522, 0.35864556651090684], [79.27398270043201, 0.07787930385814602, 4.7682740808993955]], "peak_params_": [[4.505021887379284, 0.10996721983431623, 0.5000000000000001], [17.431680989346255, 0.405423873548278, 5.657325592442982], [20.788220955551818, 0.25109722513504806, 1.3360356293301732], [23.76135369695232, 0.25824166892302536, 1.312789302042413], [27.015777543864168, 0.2713670014261442, 1.7614373074983056], [28.590629196769008, 0.2890455630568347, 0.5000000000000001], [30.204803111495572, 0.2515181712166452, 0.7765972430545653], [31.84381730550633, 0.10894083254274989, 7.569026241025621], [39.660847575537055, 0.1740348818712274, 0.5000000000000001], [40.4976696555536, 0.12347413197471013, 0.5000000000000001], [44.920462330740115, 0.13629418709840557, 0.5000000000000001], [50.62507214917351, 0.12597278633719, 1.677172520071805], [55.13207145749473, 0.1262456699100074, 0.9155912656989552], [59.93624246756117, 0.11671512811878415, 1.0836861614064761], [72.11629021746108, 0.2058686869124049, 0.7172911330218137], [79.27398270043201, 0.07779186407161731, 9.536548161798791]], "r_squared_": 0.9934376527531035, "error_": 0.0329632361579564}
{"freq_range": [2.0, 80.0], "freq_res": 0.5, "aperiodic_params_": [-6.848153348741005, 1.5195104702698907], "gaussian_params_": [[4.428749860496279, 0.11805002054914854, 0.25000000000000006], [14.922507557081683, 0.23939357077962634, 1.6474467890492683], [17.199124905871138, 0.18731145900383459, 0.7257299689767965], [19.624163337054714, 0.36126660637953717, 1.3436050389289775], [23.526639837342355, 0.2983286748882129, 1.2073194563684864], [26.37285919419827, 0.22801122251647657, 0.5213453769670239], [28.736054700459427, 0.2660572791079152, 1.071565890937747], [31.644929134481714, 0.20943964975673957, 0.7652495098467196], [33.98012523053919, 0.1596909083136056, 0.2931418894744766], [36.37762746560087, 0.1278291936943619, 0.4931623496843826], [39.692786162536215, 0.20829405373933416, 0.25000000000000006], [48.33029319972987, 0.1316794118866158, 0.25000000000000006], [58.50172892920933, 0.17444622418027153, 0.44562784313356696], [68.37704138978043, 0.16176933024724266, 0.25000000000000006], [69.44378160591327, 0.12423526247709239, 0.5180269121192937], [72.7010544726213, 0.15645337996201072, 0.4152680314214696], [74.75186001429229, 0.11603212845999983, 0.8788523818250698], [79.27398270043201, 0.13958373637624413, 1.5015576250321807]], "peak_params_": [[4.428749860496279, 0.11335174627403521, 0.5000000000000001], [14.922507557081683, 0.2419962865751888, 3.2948935780985367], [17.199124905871138, 0.3421294790089924, 1.451459937953593], [19.624163337054714, 0.36714633586347034, 2.687210077857955], [23.526639837342355, 0.30389318130482934, 2.4146389127369727], [26.37285919419827, 0.26586754151120395, 1.0426907539340478], [28.736054700459427, 0.25984145411717563, 2.143131781875494], [31.644929134481714, 0.2152731970533388, 1.5304990196934392], [33.98012523053919, 0.16116533241015318, 0.5862837789489532], [36.37762746560087, 0.1239537620982123, 0.9863246993687652], [39.692786162536215, 0.15472026850809506, 0.5000000000000001], [48.33029319972987, 0.10458154334694747, 0.5000000000000001], [58.50172892920933, 0.17444491125583816, 0.8912556862671339], [68.37704138978043, 0.1669711766786257, 0.5000000000000001], [69.44378160591327, 0.12351254924363886, 1.0360538242385875], [72.7010544726213, 0.14351026468276373, 0.8305360628429392], [74.75186001429229, 0.11392783728746814, 1.7577047636501395], [79.27398270043201, 0.13801144925138864, 3.0031152500643614]], "r_squared_": 0.9935075637772598, "error_": 0.03509956075350226}
{"freq_range": [2.0, 80.0], "freq_res": 0.5, "aperiodic_params_": [-7.123315677095681, 1.2830338940075365], "gaussian_params_": [[11.151323305718494, 0.23851390643285544, 0.7294698444323917], [13.250912576031904, 0.39688224451364273, 0.3703369568856075], [14.367339836213052, 0.3930848782458085, 0.2500000001113034], [15.623676425284906, 0.2719999999329589, 0.2783481962120374], [20.345746532894264, 0.5186368099894536, 3.6464271554456893], [28.229555169599013, 0.30249490981650135, 3.4744598559608533], [32.79524722801981, 0.10622989105600966, 0.6395434270017516], [35.71630392812975, 0.1294644319422784, 0.472121699718247], [37.20643637677778, 0.2164141581952238, 0.2500000011544138], [40.19087740403395, 0.12942143864257832, 1.0815970649155218], [68.14182697234138, 0.16004792033559273, 0.25000000000008604]], "peak_params_": [[11.151323305718494, 0.25286689026684606, 1.4589396888647834], [13.250912576031904, 0.40789661435596436, 0.740673913771215], [14.367339836213052, 0.4864899495369688, 0.5000000002226068], [15.623676425284906, 0.4612941446632828, 0.5566963924240748], [20.345746532894264, 0.543642112479878, 7.292854310891379], [28.229555169599013, 0.35912228066774965, 6.9489197119217065], [32.79524722801981, 0.22004075420899127, 1.2790868540035032], [35.71630392812975, 0.15055813742830182, 0.944243399436494], [37.20643637677778, 0.17129422204462053, 0.5000000023088276], [40.19087740403395, 0.12839606906388212, 2.1631941298310435], [68.14182697234138, 0.1362585456333676, 0.5000000000001721]], "r_squared_": 0.9933534984917685, "error_": 0.033923171322755775}
{"freq_range": [2.0, 80.0], "freq_res": 0.5, "aperiodic_params_": [-7.562475768944992, 1.106679529415263], "gaussian_params_": [[2.515189553537599, 0.12071201999997003, 0.29614325165204786], [10.165927686305535, 0.132821533106705, 0.25000000000000006], [11.263437144183229, 0.158220798992883, 1.098846736778238], [13.21418503083536, 0.2820095801172483, 0.3201730469373956], [14.814561764694586, 0.2201935166091671, 1.061427380301975], [19.956690145848395, 0.41927828290428915, 2.8281146019832373], [25.675824998644234, 0.23641175759435173, 2.252225623366322], [27.672237400380933, 0.0724463021616289, 0.25000000000000006], [29.144344166796852, 0.15724138623828693, 0.3338117306266977], [30.149636722114067, 0.1610342620340593, 0.2500035831134472], [33.684534597423166, 0.07209609803027793, 0.7190460376463655], [35.963741747487774, 0.1039207918441347, 0.25000000000000006], [39.40012942900073, 0.11378931266708421, 0.27245359700756566], [59.53018619260043, 0.10394530535642113, 0.25000000000000006], [63.296470797689935, 0.1298789596142759, 0.25000000012430973], [67.93659177210102, 0.10010784337589888, 0.25000000126622673], [73.99840029698491, 0.08770691183760007, 5.792110334948187], [74.34683188924664, 0.15039984274612822, 0.25000000000000006], [75.93261305580775, 0.151818231694498, 0.25000000000000006]], "peak_params_": [[2.515189553537599, 0.12055334257624217, 0.5922865033040957], [10.165927686305535, 0.1891198491510533, 0.5000000000000001], [11.263437144183229, 0.16107282622129304, 2.197693473556476], [13.21418503083536, 0.34227955285391687, 0.6403460938747912], [14.814561764694586, 0.30760546978962644, 2.12285476060395], [19.956690145848395, 0.429106817221264, 5.6562292039664746], [25.675824998644234, 0.29710367347407995, 4.504451246732644], [27.672237400380933, 0.2394013630794607, 0.5000000000000001], [29.144344166796852, 0.2252837477827807, 0.6676234612533954], [30.149636722114067, 0.178706096467792, 0.5000071662268945], [33.684534597423166, 0.07033119726556158, 1.438092075292731], [35.963741747487774, 0.10324387413712444, 0.5000000000000001], [39.40012942900073, 0.10639574064617463, 0.5449071940151313], [59.53018619260043, 0.1070138610646918, 0.5000000000000001], [63.296470797689935, 0.11021160071127944, 0.5000000002486195], [67.93659177210102, 0.14824220568201163, 0.5000000025324535], [73.99840029698491, 0.14515940684409934, 11.584220669896373], [74.34683188924664, 0.21204159213394114, 0.5000000000000001], [75.93261305580775, 0.22902512935004182, 0.5000000000000001]], "r_squared_": 0.9909254131904986, "error_": 0.030076636260722812}
{"freq_range": [2.0, 80.0], "freq_res": 0.5, "aperiodic_params_": [-7.859393882880148, 0.8426565597434108], "gaussian_params_": [[2.8585066886244417, 0.1760782699608744, 0.3511188651599715], [8.336894388429338, 0.17252639943815223, 0.2500003358811719], [10.743712491967557, 0.26295339344547836, 1.337436793533912], [15.52313901558816, 0.4050097632926188, 2.8607780842984276], [20.597798552514405, 0.1678903769909645, 0.8546999350297748], [24.146017246391175, 0.16523992239818674, 0.9940089234488483], [59.01354541833695, 0.10656145210015178, 0.8966315244341425], [65.32614985451227, 0.10336504941377683, 0.2500000038074825], [66.51462692943073, 0.09884714264260976, 0.25000000000000006], [70.28728890989524, 0.11378403477179741, 4.682399799952398], [73.10583866463665, 0.09718628786417537, 0.6834245672669021], [74.3985690988378, 0.1728135212890047, 0.25000000000000006], [75.85856954440256, 0.15329836368238353, 0.25001824097161457], [79.47519976302193, 0.22139396580703588, 0.3448197058214824]], "peak_params_": [[2.8585066886244417, 0.16237444143062518, 0.702237730319943], [8.336894388429338, 0.22372510855339378, 0.5000006717623438], [10.743712491967557, 0.34531736790149736, 2.674873587067824], [15.52313901558816, 0.405468151328229, 5.721556168596855], [20.597798552514405, 0.2561726055904785, 1.7093998700595496], [24.146017246391175, 0.16854957076562194, 1.9880178468976966], [59.01354541833695, 0.11277607460053574, 1.793263048868285], [65.32614985451227, 0.14865834031671454, 0.500000007614965], [66.51462692943073, 0.1807188250902083, 0.5000000000000001], [70.28728890989524, 0.1137343979434231, 9.364799599904796], [73.10583866463665, 0.19223307488266705, 1.3668491345338043], [74.3985690988378, 0.24720476503289035, 0.5000000000000001], [75.85856954440256, 0.1847028412978471, 0.5000364819432291], [79.47519976302193, 0.2372459719158151, 0.6896394116429648]], "r_squared_": 0.9754626170099184, "error_": 0.04314380148532623}
{"freq_range": [2.0, 80.0], "freq_res": 0.5, "aperiodic_params_": [-7.553199582520376, 1.028304353930242], "gaussian_params_": [[10.308672819813825, 0.6562745892614787, 1.194933410587637], [13.043321456367368, 0.6393512810815599, 1.0269336025259064], [15.512883898362485, 0.46787877622098467, 0.8972807685659037], [19.082764847195065, 0.3273761041927597, 2.2318683027831594], [25.865679411857016, 0.12279870661722565, 1.6274665259397152], [30.05645652389496, 0.2111399063512803, 0.490485400962211], [43.38481864101831, 0.17840831284465677, 0.39443645082529083], [59.30435605629007, 0.11873322425809615, 0.9103899672465612], [69.35915690863669, 0.22036658096131437, 0.5697614608175494], [72.63174768955015, 0.20223020525747695, 0.43632529234942635], [75.094323673361, 0.1766219014093451, 0.8443556857604753], [78.59032116684975, 0.15235797343937824, 0.5145257333600242]], "peak_params_": [[10.308672819813825, 0.6778912716901022, 2.389866821175274], [13.043321456367368, 0.7079786331911482, 2.0538672050518127], [15.512883898362485, 0.5947020304508541, 1.7945615371318073], [19.082764847195065, 0.3274136218012238, 4.463736605566319], [25.865679411857016, 0.12506776540113052, 3.2549330518794304], [30.05645652389496, 0.21462176741222727, 0.980970801924422], [43.38481864101831, 0.17096150881288885, 0.7888729016505817], [59.30435605629007, 0.11602293527935892, 1.8207799344931224], [69.35915690863669, 0.21373551927751677, 1.1395229216350988], [72.63174768955015, 0.19479246734007738, 0.8726505846988527], [75.094323673361, 0.17552335387692963, 1.6887113715209505], [78.59032116684975, 0.15008029368110165, 1.0290514667200483]], "r_squared_": 0.9878201405775026, "error_": 0.039017026661131916}
{"freq_range": [2.0, 80.0], "freq_res": 0.5, "aperiodic_params_": [-7.905645952133127, 0.9596715732293153], "gaussian_params_": [[14.492204653203109, 0.6131686306049873, 3.649930520585194], [21.320911782477165, 0.3246087108856253, 1.4252434229109663], [24.424648218922574, 0.25403368958741435, 0.2500000000001603], [26.236272457354715, 0.28164658496365746, 0.5685854015730472], [28.4221173514701, 0.2192862795297238, 3.4526994533451782]], "peak_params_": [[14.492204653203109, 0.6132353106031943, 7.299861041170388], [21.320911782477165, 0.44852135816721805, 2.8504868458219326], [24.424648218922574, 0.4017068129527903, 0.5000000000003206], [26.236272457354715, 0.435542302068205, 1.1371708031460943], [28.4221173514701, 0.21972165587886217, 6.9053989066903565]], "r_squared_": 0.9819377573473344, "error_": 0.04565860362247207}
{"freq_range": [2.0, 80.0], "freq_res": 0.5, "aperiodic_params_": [-7.271584238056853, 1.1962626378932713], "gaussian_params_": [[17.611703692112417, 0.8044082791487558, 4.9864009155118385], [27.43007693511841, 0.4361770370258832, 1.6346663381681026], [31.945080485940775, 0.2393112608217772, 1.4173688602335526], [35.254758835883855, 0.12521316789392947, 0.6213211168722842], [38.84942535678743, 0.15488876028510823, 0.8877134012737637], [63.915940335509326, 0.14387231120643454, 0.25000000000244]], "peak_params_": [[17.611703692112417, 0.8042064687164299, 9.972801831023677], [27.43007693511841, 0.5501307424850701, 3.269332676336205], [31.945080485940775, 0.26040878296518244, 2.834737720467105], [35.254758835883855, 0.12755137577747888, 1.2426422337445684], [38.84942535678743, 0.15275888696459994, 1.7754268025475275], [63.915940335509326, 0.13596506271253972, 0.50000000000488]], "r_squared_": 0.987797891290994, "error_": 0.049795117880820985}
{"freq_range": [2.0, 80.0], "freq_res": 0.5, "aperiodic_params_": [-7.259188506635448, 1.280299404056592], "gaussian_params_": [[9.946982389511911, 0.16108468723841582, 0.2500186923757773], [10.979702334152387, 0.19345904076852, 0.4346643074813731], [14.127664417761642, 0.4002132523219265, 1.7469308545954219], [19.40556873605593, 0.5542460636540142, 3.5145489974322985], [24.884608187488674, 0.25872639722537444, 0.25000000000000006], [27.13074885617154, 0.20323918793937845, 0.7534216728024267], [31.428555601937777, 0.30866181678357896, 3.6681867545590015], [38.663953087239456, 0.1582135981220237, 0.2500002155813512]], "peak_params_": [[9.946982389511911, 0.21274063653462782, 0.5000373847515546], [10.979702334152387, 0.30559395009392176, 0.8693286149627462], [14.127664417761642, 0.5689806455346158, 3.4938617091908437], [19.40556873605593, 0.5591432222944857, 7.029097994864597], [24.884608187488674, 0.45890162486019825, 0.5000000000000001], [27.13074885617154, 0.4028072352767502, 1.5068433456048533], [31.428555601937777, 0.3100899274393214, 7.336373509118003], [38.663953087239456, 0.17573898718246106, 0.5000004311627024]], "r_squared_": 0.989137112022559, "error_": 0.04508567323211619}
{"freq_range": [2.0, 80.0], "freq_res": 0.5, "aperiodic_params_": [-6.952476527113385, 1.430378271152764], "gaussian_params_": [[11.765719041119825, 0.19135522890198342, 0.4877271944583866], [17.162140352491186, 0.584581603468847, 3.3131258932449033], [21.495223726538775, 0.1523398428740579, 0.4003011792441132], [23.837227942132564, 0.2763469603740729, 1.0626596241365602], [28.207292320255736, 0.5359999508425645, 2.173687548475864], [34.15795472925909, 0.19406171886804321, 1.5298306935395407], [37.66201744089088, 0.13072950689397647, 0.6926414346591064], [73.3785188761045, 0.13411504177857747, 0.2675652813730377]], "peak_params_": [[11.765719041119825, 0.3441608769232971, 0.9754543889167732], [17.162140352491186, 0.5838828900261586, 6.6262517864898065], [21.495223726538775, 0.4296064427294777, 0.8006023584882264], [23.837227942132564, 0.42495690795303176, 2.1253192482731205], [28.207292320255736, 0.5365303714458438, 4.347375096951728], [34.15795472925909, 0.20841410738395538, 3.0596613870790814], [37.66201744089088, 0.1451085722302583, 1.3852828693182129], [73.3785188761045, 0.12098044808758068, 0.5351305627460754]], "r_squared_": 0.9941844204418929, "error_": 0.03545627937197586}
{"freq_range": [2.0, 80.0], "freq_res": 0.5, "aperiodic_params_": [-7.393468469857102, 1.1083448053727316], "gaussian_params_": [[2.7738628165610817, 0.21495054088273172, 0.25000000000000006], [13.77539452854351, 0.36940443729934086, 1.787814785311741], [18.78591312793606, 0.4569840354407639, 2.2800369252527544], [21.771216647410892, 0.16142710176727607, 0.25000000000000006], [23.904340775917056, 0.24228934511065292, 0.9265617473664011], [29.05131955688067, 0.34901707221737094, 3.3458385865927074], [57.09441014328954, 0.18244063200282662, 0.48130288916860214], [69.33709673740839, 0.1597412704052092, 0.37632670362177034]], "peak_params_": [[2.7738628165610817, 0.14277982907969644, 0.5000000000000001], [13.77539452854351, 0.41699803682502257, 3.575629570623482], [18.78591312793606, 0.4639683982722964, 4.560073850505509], [21.771216647410892, 0.34259856203345507, 0.5000000000000001], [23.904340775917056, 0.3861057901078464, 1.8531234947328021], [29.05131955688067, 0.3489961328910951, 6.691677173185415], [57.09441014328954, 0.17896430143824915, 0.9626057783372043], [69.33709673740839, 0.1454546125195595, 0.7526534072435407]], "r_squared_": 0.9870100063459321, "error_": 0.043213010356270676}
{"freq_range": [2.0, 80.0], "freq_res": 0.5, "aperiodic_params_": [-7.282169815552811, 1.2416748271177525], "gaussian_params_": [[9.883627796098944, 0.19467563948944244, 0.8883741571191532], [10.21951755858512, 0.2332593837016136, 0.2500000235817266], [12.500214369703228, 0.49573606156788047, 1.3042085696171581], [14.460456699492946, 0.2339359825412381, 0.2500004717416995], [15.620564638402195, 0.2705691000872041, 0.35311016586493216], [19.14537632322949, 0.7525822115319489, 4.268743207208237], [29.452034599135946, 0.3707516570699581, 4.124622626229538], [34.49114132389772, 0.05824621350971532, 0.250000000000004], [37.07151311734957, 0.08400302747060336, 0.9178244840895465]], "peak_params_": [[9.883627796098944, 0.5064222350263279, 1.7767483142383065], [10.21951755858512, 0.5064222350263279, 0.5000000471634533], [12.500214369703228, 0.7223895483951788, 2.6084171392343163], [14.460456699492946, 0.8026074698074765, 0.500000943483399], [15.620564638402195, 0.8143302035583755, 0.7062203317298643], [19.14537632322949, 0.7670993383255684, 8.537486414416474], [29.452034599135946, 0.41043400229346183, 8.249245252459076], [34.49114132389772, 0.23635538633075015, 0.500000000000008], [37.07151311734957, 0.1533539327950013, 1.835648968179093]], "r_squared_": 0.9893681563466519, "error_": 0.049570036815292956}
{"freq_range": [2.0, 80.0], "freq_res": 0.5, "aperiodic_params_": [-7.575045191984425, 1.0388920601619356], "gaussian_params_": [[11.541085304986566, 0.4800871771250867, 2.0120366360401007], [17.88912427212358, 0.8996904667863678, 3.4963940108310885], [25.813455679274092, 0.35774011035334713, 1.5643854067901104], [30.033260798704067, 0.2548914985036245, 1.665266975762711], [33.98894209773585, 0.1605489326206634, 0.5648916340385217], [53.63776705756018, 0.22378153887988184, 0.3328528314097106], [59.43340006886279, 0.18513317042269542, 0.25000000001192396], [69.76771726213819, 0.23034408445207602, 0.25003329676622255], [74.51953356538775, 0.1323598136002956, 0.25000000000000006]], "peak_params_": [[11.541085304986566, 0.64941927002927, 4.0240732720802015], [17.88912427212358, 0.9020168685887455, 6.992788021662177], [25.813455679274092, 0.42980444960941355, 3.128770813580221], [30.033260798704067, 0.26703610203398753, 3.330533951525422], [33.98894209773585, 0.1754765884724261, 1.1297832680770434], [53.63776705756018, 0.20541136048832875, 0.6657056628194212], [59.43340006886279, 0.17867901782375206, 0.5000000000238479], [69.76771726213819, 0.14961225838032277, 0.5000665935324451], [74.51953356538775, 0.13195640374309292, 0.5000000000000001]], "r_squared_": 0.9882472539339356, "error_": 0.04884138905131953}
{"freq_range": [2.0, 80.0], "freq_res": 0.5, "aperiodic_params_": [-7.8558572266938, 0.7458368008415057], "gaussian_params_": [[14.911114987095035, 0.5240254269749761, 4.079952787520448], [24.079859121638247, 0.176214268068478, 0.8651192929199325], [26.438569753189007, 0.16428041382081476, 0.4141959029403028], [30.040983296933614, 0.19841288715443484, 0.5246508231650857], [51.822010188000085, 0.2868228322302058, 0.25000000000000006], [53.668774334454994, 0.2144856772799853, 0.4402397465951008], [56.052759343335126, 0.1582596914706282, 0.4405616083832791], [59.35730840506366, 0.32217030677291175, 0.25000000000000006], [66.50280974405317, 0.13558186580818515, 0.25000000000000006], [69.89933916939545, 0.15841831251518101, 0.44903678461405633], [73.56050063666177, 0.07219902713816564, 2.2636054954284646], [76.77396437295852, 0.07932489555167317, 5.995506418434326]], "peak_params_": [[14.911114987095035, 0.5239010850349519, 8.159905575040897], [24.079859121638247, 0.21929124727016713, 1.730238585839865], [26.438569753189007, 0.17528110025733312, 0.8283918058806056], [30.040983296933614, 0.19836993743910192, 1.0493016463301714], [51.822010188000085, 0.2227882945201589, 0.5000000000000001], [53.668774334454994, 0.19933158586005462, 0.8804794931902016], [56.052759343335126, 0.1573251767340409, 0.8811232167665582], [59.35730840506366, 0.2749938129341505, 0.5000000000000001], [66.50280974405317, 0.1544014691536777, 0.5000000000000001], [69.89933916939545, 0.21734209376891833, 0.8980735692281127], [73.56050063666177, 0.1405105590782192, 4.527210990856929], [76.77396437295852, 0.10202887932280369, 11.991012836868652]], "r_squared_": 0.9692251720371926, "error_": 0.04433014648955803}
{"freq_range": [2.0, 80.0], "freq_res": 0.5, "aperiodic_params_": [-7.440730336891434, 1.0015638111721086], "gaussian_params_": [[10.454571003055348, 0.6058306479330977, 0.9334460840476467], [13.915625066599542, 0.602692033457296, 1.8693692152045702], [15.492518968271057, 0.21147179695317297, 0.3570544717396875], [17.726017299567975, 0.27640898381136003, 2.7131566350606082], [21.575335815596752, 0.14991236944417743, 0.45053214992455026], [25.052821861409903, 0.1414503150751698, 1.2219028933510019], [29.98819997852913, 0.388302807696321, 0.4584530164452113], [43.59750726042569, 0.23957375652139845, 0.361514250233246], [56.78281303272402, 0.17157989986145714, 0.5001280108247342], [65.16744309691701, 0.16132402658152503, 0.5816995507061259], [74.72601729956799, 0.1286301956712955, 1.7726363516508712]], "peak_params_": [[10.454571003055348, 0.7266206297081403, 1.8668921680952935], [13.915625066599542, 0.7102087718186771, 3.7387384304091404], [15.492518968271057, 0.8296756563770895, 0.714108943479375], [17.726017299567975, 0.3713363836108723, 5.4263132701212164], [21.575335815596752, 0.2551075562895839, 0.9010642998491005], [25.052821861409903, 0.1489170307097698, 2.4438057867020038], [29.98819997852913, 0.3882231484296117, 0.9169060328904226], [43.59750726042569, 0.2310160437566715, 0.723028500466492], [56.78281303272402, 0.15614061458706097, 1.0002560216494685], [65.16744309691701, 0.15477708552360525, 1.1633991014122518], [74.72601729956799, 0.12758885436628553, 3.5452727033017424]], "r_squared_": 0.9824595903413744, "error_": 0.04749945360334701}
{"freq_range": [2.0, 80.0], "freq_res": 0.5, "aperiodic_params_": [-7.414925717114265, 1.176382654565098], "gaussian_params_": [[9.143606074779415, 0.24378816568950967, 0.3602237817305499], [9.950268636661631, 0.3565922708316506, 0.25000308805305643], [10.715987731982379, 0.35269993488045775, 0.4296856273569601], [15.478698781558327, 0.9463571389849055, 3.1475772202449974], [22.051140474359485, 0.3472639037647568, 1.0997811351750522], [23.618510282277743, 0.2541598211939856, 0.4248429836451544], [24.709399266096632, 0.36124321466897463, 0.250000059108636], [26.156077071152996, 0.3888950110102286, 0.8393050055484038], [28.940931329609302, 0.2623208806216098, 0.5108631529704131], [30.08532931256997, 0.32386165896515506, 0.2500000000008353], [30.972178909079428, 0.1241789841510167, 0.2500000289411116], [32.44746572564943, 0.12205173766336878, 1.4742934542805293], [56.14596189078956, 0.15696433329477005, 0.27476368690784114], [66.07823547220175, 0.15632190030917548, 0.2712508802857269], [70.7340630326586, 0.10183547523478896, 1.3706315893940528], [75.96155176415277, 0.19859702428337025, 0.3415564733260631]], "peak_params_": [[9.143606074779415, 0.33932990900648186, 0.7204475634610998], [9.950268636661631, 0.6600965100606917, 0.5000061761061129], [10.715987731982379, 0.6137015244626571, 0.8593712547139202], [15.478698781558327, 0.9463354749709483, 6.295154440489995], [22.051140474359485, 0.4577165857912746, 2.1995622703501043], [23.618510282277743, 0.42967293165815157, 0.8496859672903088], [24.709399266096632, 0.3840881244241441, 0.500000118217272], [26.156077071152996, 0.3863351205696848, 1.6786100110968076], [28.940931329609302, 0.2698699603177417, 1.0217263059408261], [30.08532931256997, 0.3669934522385514, 0.5000000000016706], [30.972178909079428, 0.19927176672998215, 0.5000000578822232], [32.44746572564943, 0.12197469827377816, 2.9485869085610585], [56.14596189078956, 0.13630806897386627, 0.5495273738156823], [66.07823547220175, 0.15021461733190833, 0.5425017605714538], [70.7340630326586, 0.10036136197188661, 2.7412631787881057], [75.96155176415277, 0.19740622082764148, 0.6831129466521262]], "r_squared_": 0.9921607735950729, "error_": 0.038597264234038954}
{"freq_range": [2.0, 80.0], "freq_res": 0.5, "aperiodic_params_": [-7.049937815022002, 1.4008771864086327], "gaussian_params_": [[15.755737467227666, 0.9441226605536448, 3.7231943780467716], [25.354648677891763, 0.5910813000600013, 5.610362765510504], [33.705489483526385, 0.11489632507267171, 1.9027039446536544], [38.274358021029485, 0.20135124293365703, 0.36449285345932797]], "peak_params_": [[15.755737467227666, 1.0893034755289488, 7.446388756093543], [25.354648677891763, 0.6216298194052889, 11.220725531021008], [33.705489483526385, 0.32027162442961554, 3.805407889307309], [38.274358021029485, 0.20902168406580657, 0.7289857069186559]], "r_squared_": 0.9902090729550741, "error_": 0.055373904958308254}
{"freq_range": [2.0, 80.0], "freq_res": 0.5, "aperiodic_params_": [-7.145534970698458, 1.3761651067221055], "gaussian_params_": [[16.77928441454601, 0.964581466354624, 3.898070987393883], [26.178255185214105, 0.13877854730830314, 0.2500000000000046], [27.20319964767125, 0.11396054021194925, 0.25000000000092426], [28.377223708003203, 0.4448885359688019, 5.999999999999999], [40.28422045817033, 0.2634084091089235, 0.25000000000001904]], "peak_params_": [[16.77928441454601, 1.0367384054952122, 7.796141974787766], [26.178255185214105, 0.5777258190121515, 0.5000000000000092], [27.20319964767125, 0.546858473356787, 0.5000000000018485], [28.377223708003203, 0.45529450859114107, 11.999999999999998], [40.28422045817033, 0.2392760720319842, 0.5000000000000381]], "r_squared_": 0.9893338255957056, "error_": 0.055123903555144044}
{"freq_range": [2.0, 80.0], "freq_res": 0.5, "aperiodic_params_": [-7.105854112724207, 1.3998697158099558], "gaussian_params_": [[13.221126108936181, 0.3379766207766744, 0.25000000000000006], [15.793587275516002, 0.7783838809416985, 3.4551840774967717], [23.18220545034577, 0.1225722697096985, 0.25000000000000006], [25.435987663632183, 0.549886123277575, 4.5050463353629295], [29.342121787209155, 0.32721908062886196, 1.0708306810837471], [31.814540779723433, 0.31361239439137606, 0.250000000000608], [32.60985665041563, 0.2912391062243676, 0.25267157144032976], [33.82084945391886, 0.3888966137243647, 0.3104538885889498], [35.76223551717428, 0.20332700802766393, 0.5800368704333619], [37.62564955058033, 0.23454378687548635, 0.25000000216097507], [38.647631452585436, 0.18764329742503327, 0.6514705031235263], [40.56633828062973, 0.19763643015423896, 0.34271241337928915], [46.63103805834593, 0.22181259786551213, 0.25000000000000006], [47.627508557437906, 0.16043236147716228, 0.4762748093777519]], "peak_params_": [[13.221126108936181, 0.8021017461867599, 0.5000000000000001], [15.793587275516002, 0.8383199384759035, 6.910368154993543], [23.18220545034577, 0.6575078951774138, 0.5000000000000001], [25.435987663632183, 0.5654039135292663, 9.010092670725859], [29.342121787209155, 0.6900470623616108, 2.1416613621674943], [31.814540779723433, 0.4592706415757526, 0.500000000001216], [32.60985665041563, 0.4373988934063924, 0.5053431428806595], [33.82084945391886, 0.42156194638264566, 0.6209077771778996], [35.76223551717428, 0.22216726153148514, 1.1600737408667239], [37.62564955058033, 0.2640072265152895, 0.5000000043219501], [38.647631452585436, 0.19161530123381887, 1.3029410062470526], [40.56633828062973, 0.1993153176273985, 0.6854248267585783], [46.63103805834593, 0.20308745660625327, 0.5000000000000001], [47.627508557437906, 0.15531598536000324, 0.9525496187555038]], "r_squared_": 0.991059427985775, "error_": 0.04835665202119402}
{"freq_range": [2.0, 80.0], "freq_res": 0.5, "aperiodic_params_": [-7.3125514015385145, 1.294623539927092], "gaussian_params_": [[13.231031977297564, 0.3398437666502772, 0.25000000000000006], [15.119403013309812, 0.6516054383835062, 2.923578536414049], [24.00020433123843, 0.5126644232078255, 5.9203681174999785], [29.43092891059768, 0.35092403934314054, 1.049539277779485], [32.92633765572913, 0.13808840963189517, 1.4024237785586686], [35.53291595828638, 0.16401442698323632, 0.38493457187720365], [37.657925239598555, 0.26140640513753133, 0.25000000000000006], [42.02327899030207, 0.284801529973725, 0.4124429938927619], [76.8922716341883, 0.18405407736419016, 0.25000000000000006]], "peak_params_": [[13.231031977297564, 0.8140080245854193, 0.5000000000000001], [15.119403013309812, 0.8124971050246508, 5.847157072828098], [24.00020433123843, 0.5191273565957921, 11.840736234999957], [29.43092891059768, 0.6901489594102941, 2.09907855555897], [32.92633765572913, 0.30043155526364806, 2.8048475571173372], [35.53291595828638, 0.2667740111436867, 0.7698691437544073], [37.657925239598555, 0.2528889657638729, 0.5000000000000001], [42.02327899030207, 0.2893905270953905, 0.8248859877855238], [76.8922716341883, 0.167735176737132, 0.5000000000000001]], "r_squared_": 0.991042533876379, "error_": 0.04529051688579281}
{"freq_range": [2.0, 80.0], "freq_res": 0.5, "aperiodic_params_": [-7.161470836704771, 1.3385875916091496], "gaussian_params_": [[10.12549474711565, 0.10958915152933918, 0.25000000000000006], [11.71949278280315, 0.4661209719080356, 1.8732542743717235], [17.111441482545697, 0.8706802890599533, 2.7035887136900856], [23.271853260937625, 0.39028689463254085, 4.369599257749818], [32.780164120054394, 0.28647609227252124, 5.565844676666215]], "peak_params_": [[10.12549474711565, 0.4338066824064928, 0.5000000000000001], [11.71949278280315, 0.5745038174581047, 3.746508548743447], [17.111441482545697, 1.0231802409035478, 5.407177427380171], [23.271853260937625, 0.5144869630429127, 8.739198515499636], [32.780164120054394, 0.31899352614012244, 11.13168935333243]], "r_squared_": 0.9932337426023641, "error_": 0.04165535158847731}
{"freq_range": [2.0, 80.0], "freq_res": 0.5, "aperiodic_params_": [-7.180640147677109, 1.244610284107612], "gaussian_params_": [[16.882909020630787, 1.0389191237810722, 4.319799023690816], [22.17071054530749, 0.10597772462087449, 0.25000000000000006], [25.355337880407692, 0.1941800049394457, 1.5624303872890561], [30.35078189589695, 0.27216660702871875, 3.410679347313549], [38.8277608301937, 0.1438437603331929, 1.6378071520770636]], "peak_params_": [[16.882909020630787, 1.0386657675360702, 8.639598047381632], [22.17071054530749, 0.6319661709107631, 0.5000000000000001], [25.355337880407692, 0.4344149137191433, 3.1248607745781123], [30.35078189589695, 0.27999070816122185, 6.821358694627098], [38.8277608301937, 0.15397665187815868, 3.2756143041541272]], "r_squared_": 0.9894577961186619, "error_": 0.053904200315791885}
{"freq_range": [2.0, 80.0], "freq_res": 0.5, "aperiodic_params_": [-7.630666919100077, 0.9136901086865545], "gaussian_params_": [[9.89515889011716, 0.30989612336639466, 0.6876066036978713], [12.319982224507587, 0.29437546756492616, 1.4882262037935963], [15.901250870115852, 0.6550126743897032, 2.4499929741643918], [19.69397253183564, 0.2247776448654973, 0.45146402144274683], [21.12690017910528, 0.18852261792324806, 0.39367060078434324], [22.380096400522767, 0.22469428694889593, 0.2960413958213156], [23.333402794512583, 0.3352376760634101, 0.2574738925460571], [25.36380931623848, 0.15738896450020137, 1.0538048408666758], [27.773847252470567, 0.07613179046020845, 1.1717524385051634], [29.950026622471434, 0.3926145256110084, 0.3381328757880675], [32.318836568032765, 0.19374780182903975, 0.25000001812388073], [60.29668987349036, 0.1676998280861606, 0.5872199046079284], [69.98094548737606, 0.17227537303394524, 0.4366598071820074], [75.53419582869917, 0.16613198006616178, 0.7800290492080362]], "peak_params_": [[9.89515889011716, 0.42966228353672875, 1.3752132073957426], [12.319982224507587, 0.5423536978343062, 2.9764524075871925], [15.901250870115852, 0.6683213355082174, 4.8999859483287835], [19.69397253183564, 0.4277038057793572, 0.9029280428854937], [21.12690017910528, 0.25755742265899784, 0.7873412015686865], [22.380096400522767, 0.23055079207813556, 0.5920827916426312], [23.333402794512583, 0.3104706439216649, 0.5149477850921143], [25.36380931623848, 0.16796786705483235, 2.1076096817333516], [27.773847252470567, 0.08161797821067118, 2.343504877010327], [29.950026622471434, 0.4008852426916807, 0.676265751576135], [32.318836568032765, 0.14902971452328018, 0.5000000362477615], [60.29668987349036, 0.15794388606892085, 1.1744398092158568], [69.98094548737606, 0.17211142896010045, 0.8733196143640148], [75.53419582869917, 0.16597241445129107, 1.5600580984160723]], "r_squared_": 0.9813840832623536, "error_": 0.04511549344080192}
{"freq_range": [2.0, 80.0], "freq_res": 0.5, "aperiodic_params_": [-7.3212393674443765, 1.1366307202045456], "gaussian_params_": [[10.209615105933496, 0.43751563457103143, 0.9701082205317805], [14.864430393806579, 0.9696113058165622, 3.0227567064326335], [22.782407317256215, 0.2036518585385766, 2.18223914122518], [29.954163889039588, 0.303398188255507, 0.3020106895972907], [73.13512204739997, 0.12960421653457807, 5.999999999999999], [75.4684934790767, 0.1568724155486092, 0.38767404874762224]], "peak_params_": [[10.209615105933496, 0.6930284324144855, 1.940216441063561], [14.864430393806579, 0.9689913506135159, 6.045513412865267], [22.782407317256215, 0.22856081728609823, 4.36447828245036], [29.954163889039588, 0.3007854969649859, 0.6040213791945814], [73.13512204739997, 0.12957135553648058, 11.999999999999998], [75.4684934790767, 0.2762733827493449, 0.7753480974952445]], "r_squared_": 0.9862675727443185, "error_": 0.05028475405019592}
{"freq_range": [2.0, 80.0], "freq_res": 0.5, "aperiodic_params_": [-7.099740120302807, 1.3407419657541693], "gaussian_params_": [[10.140453640424639, 0.5297678203604957, 1.4505879500198056], [10.95764385655273, 0.09723032927108599, 0.25000000000000006], [15.192151422107248, 1.1042179995884736, 2.738792061684146], [22.001657346703194, 0.46911951232987087, 2.6934298485686945], [25.781472666129442, 0.1264641290425973, 0.7237745342318332], [27.538233498360324, 0.13278092083136445, 0.4203376943353386], [28.80784810398573, 0.3253231862265906, 0.2500000005366074], [29.81530792730065, 0.3558990026432548, 0.25000000000000006], [32.069085584661366, 0.1542237711277356, 1.6720184132215592], [69.80365089315272, 0.0887233440907665, 0.25000000000000006], [70.92265362317096, 0.1364013636668126, 1.2718578825291091], [75.39891054821615, 0.1583553830981976, 0.5343353495100713]], "peak_params_": [[10.140453640424639, 0.7104520649477806, 2.901175900039611], [10.95764385655273, 0.8826401481023716, 0.5000000000000001], [15.192151422107248, 1.1194322058083985, 5.477584123368292], [22.001657346703194, 0.5193946958477405, 5.386859697137389], [25.781472666129442, 0.27753364660857827, 1.4475490684636665], [27.538233498360324, 0.20190584022005886, 0.8406753886706771], [28.80784810398573, 0.2888439873358024, 0.5000000010732149], [29.81530792730065, 0.34833035827481673, 0.5000000000000001], [32.069085584661366, 0.15456974418419556, 3.3440368264431184], [69.80365089315272, 0.1700203407274845, 0.5000000000000001], [70.92265362317096, 0.1361503146209646, 2.5437157650582183], [75.39891054821615, 0.15575668596384595, 1.0686706990201427]], "r_squared_": 0.9920647048351936, "error_": 0.04590336028290773}
{"freq_range": [2.0, 80.0], "freq_res": 0.5, "aperiodic_params_": [-7.070388674428664, 1.4007877508391253], "gaussian_params_": [[15.776831926948418, 1.1018262839888386, 3.955472026392494], [23.868798867710918, 0.38803484635096575, 2.442852981354527], [27.16044104621434, 0.1972514730832074, 1.0202352781031516], [28.789373063309636, 0.34059672599098373, 0.31765812791132686], [29.781605211274677, 0.37722261921829675, 0.25000000000000006], [31.597680948854535, 0.2981699790550078, 1.1151164548548094], [34.935548051865034, 0.2512343675504075, 0.7306314271526737]], "peak_params_": [[15.776831926948418, 1.1022406593187757, 7.910944052784988], [23.868798867710918, 0.5160452729380971, 4.885705962709054], [27.16044104621434, 0.3852135406895769, 2.0404705562063032], [28.789373063309636, 0.3816826341150783, 0.6353162558226537], [29.781605211274677, 0.3870867843096306, 0.5000000000000001], [31.597680948854535, 0.30041357107120703, 2.2302329097096187], [34.935548051865034, 0.25311695285921587, 1.4612628543053474]], "r_squared_": 0.9921960112764869, "error_": 0.047156642571050934}
{"freq_range": [2.0, 80.0], "freq_res": 0.5, "aperiodic_params_": [-7.098906683400486, 1.4235235888555564], "gaussian_params_": [[16.36285161533331, 1.0108418587779753, 3.768870029017436], [23.087807414225523, 0.06927487173042418, 0.7246208499924149], [26.502714992380106, 0.3436833731235559, 3.034903726724922], [30.022993822502347, 0.4074247604587382, 0.466754794192119], [32.07393481970539, 0.2818819149699163, 0.8832970194356494], [34.0822162434324, 0.15294974656217042, 0.25000000000000006], [35.71680165478456, 0.15456385020841967, 2.200171804419521], [38.43551060886345, 0.136645954005462, 0.3903234176159115], [42.38121700447581, 0.134850190894594, 0.9654121486930229], [69.59470399989254, 0.16384639777884666, 0.35434008624448815], [74.7278222947348, 0.21764623286714396, 0.25000000000000006], [78.59749010933805, 0.12934653835461876, 0.4179100982870919]], "peak_params_": [[16.36285161533331, 1.0116770047098287, 7.537740058034872], [23.087807414225523, 0.459746582160351, 1.4492416999848299], [26.502714992380106, 0.370855629857898, 6.069807453449844], [30.022993822502347, 0.6085026319502731, 0.933509588384238], [32.07393481970539, 0.3848701154798846, 1.7665940388712988], [34.0822162434324, 0.3013247988275438, 0.5000000000000001], [35.71680165478456, 0.15821337187600193, 4.400343608839042], [38.43551060886345, 0.2044171866033473, 0.780646835231823], [42.38121700447581, 0.13516749336054978, 1.9308242973860459], [69.59470399989254, 0.15809768821779002, 0.7086801724889763], [74.7278222947348, 0.1436883870266108, 0.5000000000000001], [78.59749010933805, 0.12587449561457298, 0.8358201965741838]], "r_squared_": 0.9936160751726363, "error_": 0.0407210900722889}
{"freq_range": [2.0, 80.0], "freq_res": 0.5, "aperiodic_params_": [-7.24101896941578, 1.3432998224845984], "gaussian_params_": [[10.271836155475247, 0.15261492034262383, 0.578172958822574], [15.899553605318713, 0.9080474129692832, 3.2302606703336765], [22.91465991376518, 0.1984747092223713, 1.9001822930663332], [28.889528758302067, 0.14542702343511976, 0.25000000000000006], [28.933663772077363, 0.3120532028210596, 5.999999999999999], [30.196850635893615, 0.3569247286737419, 0.25000000000000006], [37.54987857053809, 0.09034261933156361, 0.25000000000000006], [38.711382811107605, 0.14260061348330258, 0.25000000000000006]], "peak_params_": [[10.271836155475247, 0.36855011080862354, 1.156345917645148], [15.899553605318713, 0.9384375894642485, 6.460521340667353], [22.91465991376518, 0.47071951221597175, 3.8003645861326665], [28.889528758302067, 0.44535796869333844, 0.5000000000000001], [28.933663772077363, 0.44535796869333844, 11.999999999999998], [30.196850635893615, 0.5692123697453759, 0.5000000000000001], [37.54987857053809, 0.20117875047316147, 0.5000000000000001], [38.711382811107605, 0.18735135821629356, 0.5000000000000001]], "r_squared_": 0.9908973335792309, "error_": 0.04698623506087959}
{"freq_range": [2.0, 80.0], "freq_res": 0.5, "aperiodic_params_": [-7.1622446717460955, 1.307817119301872], "gaussian_params_": [[9.116791269738837, 0.1699975046674577, 0.25000000000000006], [11.744243220077998, 0.3157154137545162, 1.4668831577984502], [17.122965753764717, 0.8480321022103162, 2.839971311056169], [22.574392343311732, 0.35280932795490416, 1.3927849481280195], [24.64924609383274, 0.3409247516709955, 0.485395498502156], [27.14776563595689, 0.3974765231514774, 1.0506430334493793], [28.798750733813957, 0.29794502183700344, 0.25000000000000006], [30.553034167380538, 0.3307443789768648, 0.8680040308301736], [32.285336433623755, 0.24490888955531204, 0.2500000000002743], [33.44921938191047, 0.15912403075807782, 0.2500000000000002], [36.236250601290955, 0.1990826447110421, 1.9034440674448234], [44.54813539493765, 0.10342842465458738, 1.352531661471092], [50.09432329457386, 0.1989156443295921, 0.4109796454104587]], "peak_params_": [[9.116791269738837, 0.2214785665234924, 0.5000000000000001], [11.744243220077998, 0.4308125290582385, 2.9337663155969005], [17.122965753764717, 0.8478696520070388, 5.679942622112338], [22.574392343311732, 0.49360004838008287, 2.785569896256039], [24.64924609383274, 0.5065088575406502, 0.970790997004312], [27.14776563595689, 0.39791416188590034, 2.1012860668987585], [28.798750733813957, 0.3665362162986412, 0.5000000000000001], [30.553034167380538, 0.334710793156729, 1.7360080616603473], [32.285336433623755, 0.22524311806199648, 0.5000000000005486], [33.44921938191047, 0.22775955410347493, 0.5000000000000004], [36.236250601290955, 0.1975550888339921, 3.806888134889647], [44.54813539493765, 0.10337902028564372, 2.705063322942184], [50.09432329457386, 0.1937758300413286, 0.8219592908209175]], "r_squared_": 0.9916648920789002, "error_": 0.03940952142403253}
{"freq_range": [2.0, 80.0], "freq_res": 0.5, "aperiodic_params_": [-7.131152136211554, 1.2492552899910483], "gaussian_params_": [[15.42954227578243, 0.6933104708622445, 3.495778707205056], [23.811769183062736, 0.35009796976782126, 5.999999999999897]], "peak_params_": [[15.42954227578243, 0.8272839210225671, 6.991557414410112], [23.811769183062736, 0.38426060927072037, 11.999999999999794]], "r_squared_": 0.9878250451306875, "error_": 0.05226093427722428}
{"freq_range": [2.0, 80.0], "freq_res": 0.5, "aperiodic_params_": [-7.369937641353228, 0.9046480716960125], "gaussian_params_": [[10.136267117073157, 0.25091043810740155, 0.554335931867334], [15.013172294454224, 0.6622079531927796, 3.3370040847390623], [24.226017299568007, 0.13224102031531432, 3.0385705450180875], [26.659167687992454, 0.10354615264958683, 0.25000000000000006], [29.176630075508065, 0.18266666131949444, 0.25000000000000183], [30.26004305672159, 0.2379234449764951, 0.25000000000000006], [56.268616392591674, 0.11300811064092442, 0.6405123963810773], [74.77065030565883, 0.2393388436143269, 0.25000000000000006], [76.50541248823225, 0.18871078144465672, 0.34618959405607774]], "peak_params_": [[10.136267117073157, 0.4576924604901631, 1.108671863734668], [15.013172294454224, 0.6635194061202858, 6.674008169478125], [24.226017299568007, 0.14949918387618943, 6.077141090036175], [26.659167687992454, 0.18626255939867775, 0.5000000000000001], [29.176630075508065, 0.18091231477458436, 0.5000000000000037], [30.26004305672159, 0.16580506071635526, 0.5000000000000001], [56.268616392591674, 0.10586975943575894, 1.2810247927621545], [74.77065030565883, 0.1571442372522771, 0.5000000000000001], [76.50541248823225, 0.18868771897000336, 0.6923791881121555]], "r_squared_": 0.9816870929975864, "error_": 0.04676572029080026}
{"freq_range": [2.0, 80.0], "freq_res": 0.5, "aperiodic_params_": [-7.276538460133825, 0.9694221826929522], "gaussian_params_": [[10.4388461792417, 0.26248101782798366, 0.5196566979309318], [14.269765662109469, 0.6547503923682967, 2.9088785190989306], [20.726017299567975, 0.11119273277628759, 2.6474999073766456], [25.395218788225545, 0.19190446914523637, 0.25000000000000006], [29.90085207038342, 0.4051792400370927, 0.2617488044454754], [47.90693592104626, 0.2086077910905218, 0.25000000000000006], [52.37411932495099, 0.18468359771549755, 0.2798172702115244], [53.690576187591574, 0.15561614875649873, 0.3363099024821822], [69.16412060603005, 0.21619151371802633, 0.25000000001319195], [72.71306025885623, 0.1714309978977043, 0.25000000000000006], [75.31812186979212, 0.17647182863837277, 0.25000000000000006], [76.57548795106298, 0.12258848292039634, 0.5572326654928533], [78.44823757404292, 0.16492084480596547, 0.3914763097469809]], "peak_params_": [[10.4388461792417, 0.5434684621565182, 1.0393133958618637], [14.269765662109469, 0.6597041788415785, 5.817757038197861], [20.726017299567975, 0.17685080946389675, 5.294999814753291], [25.395218788225545, 0.19802601139273968, 0.5000000000000001], [29.90085207038342, 0.37737048677297835, 0.5234976088909508], [47.90693592104626, 0.19464327202110177, 0.5000000000000001], [52.37411932495099, 0.16720540911280146, 0.5596345404230488], [53.690576187591574, 0.13258990708033203, 0.6726198049643644], [69.16412060603005, 0.17428293919090088, 0.5000000000263839], [72.71306025885623, 0.11922630976666682, 0.5000000000000001], [75.31812186979212, 0.15447442874043027, 0.5000000000000001], [76.57548795106298, 0.1214719249217655, 1.1144653309857067], [78.44823757404292, 0.16380046718891172, 0.7829526194939618]], "r_squared_": 0.9901170586189312, "error_": 0.03418390949732894}
{"freq_range": [2.0, 80.0], "freq_res": 0.5, "aperiodic_params_": [-7.164933906662892, 1.0426698197941677], "gaussian_params_": [[7.384538895353509, 0.1629228748641386, 0.2500000000008916], [10.383063603638073, 0.23833818050043196, 0.5229207750371108], [11.868677363019522, 0.3854264961171892, 1.889813614474951], [15.699296412911865, 0.6660133022955255, 2.6243648875085417], [21.449064017761373, 0.2784316546685185, 1.2632151851179179], [23.245489307447972, 0.16302855375422634, 0.2500000820089464], [24.51319531510836, 0.21444786045609798, 0.269487320649016], [25.414008135934996, 0.34043783259624055, 0.2620764284760449], [26.90076995312905, 0.14662750837895222, 0.4857863798270678], [29.868866331378218, 0.2620569599866086, 0.5376886059507662], [52.56446495957892, 0.1868126093920399, 0.2677269618047021], [53.73328209247982, 0.19379163562131105, 0.27643756160804517], [69.02601519918808, 0.14299217507255021, 0.4821230030159723], [75.42924438202732, 0.15754362469140143, 0.36468617190762004]], "peak_params_": [[7.384538895353509, 0.17813730462849442, 0.5000000000017832], [10.383063603638073, 0.6225441588632536, 1.0458415500742215], [11.868677363019522, 0.6331117974875831, 3.779627228949902], [15.699296412911865, 0.7249383699452574, 5.248729775017083], [21.449064017761373, 0.33609587783134387, 2.5264303702358357], [23.245489307447972, 0.2456002064858147, 0.5000001640178928], [24.51319531510836, 0.23244471598619398, 0.538974641298032], [25.414008135934996, 0.32740547158721256, 0.5241528569520898], [26.90076995312905, 0.14368088499789522, 0.9715727596541356], [29.868866331378218, 0.25437844698997303, 1.0753772119015323], [52.56446495957892, 0.1814840737560779, 0.5354539236094042], [53.73328209247982, 0.13615265141242006, 0.5528751232160903], [69.02601519918808, 0.14278415521628318, 0.9642460060319445], [75.42924438202732, 0.15460615438826508, 0.7293723438152401]], "r_squared_": 0.99041347595086, "error_": 0.037366561674125616}
{"freq_range": [2.0, 80.0], "freq_res": 0.5, "aperiodic_params_": [-7.079388221480542, 1.3069082799607707], "gaussian_params_": [[15.106903785700277, 0.861805018379813, 3.3389098223747435], [21.862596328566415, 0.38403430037394054, 1.5658932059325115], [24.754218366130427, 0.29967646957830657, 0.35135736806399165], [27.47552523897408, 0.07799595658462422, 0.2500000003036864], [29.64120797754233, 0.13647744197717931, 0.6600328676895655], [30.63980840555866, 0.22863681951730566, 5.999869823589256], [59.979461612806304, 0.15666647620477062, 0.25000000000000006]], "peak_params_": [[15.106903785700277, 0.8690393979512558, 6.677819644749487], [21.862596328566415, 0.5659397958771883, 3.131786411865023], [24.754218366130427, 0.4439168719906412, 0.7027147361279833], [27.47552523897408, 0.27917689409488844, 0.5000000006073728], [29.64120797754233, 0.35801982484859884, 1.320065735379131], [30.63980840555866, 0.2871341465208541, 11.999739647178512], [59.979461612806304, 0.15614012332333083, 0.5000000000000001]], "r_squared_": 0.9905899618899515, "error_": 0.04683199828322371}
{"freq_range": [2.0, 80.0], "freq_res": 0.5, "aperiodic_params_": [-6.872074623517866, 1.3934958360631364], "gaussian_params_": [[15.442581381889823, 0.9161057292896708, 3.3560265657976176], [24.323715317709603, 0.3847934459826397, 3.3085339944084105], [30.072194094494286, 0.27051601456373314, 0.8594828639437799], [32.66154216060839, 0.19484836223192614, 0.49456714107115535], [34.177801659122416, 0.20605500639762264, 0.25000000000000006], [37.72601729956798, 0.12334436390748164, 3.92375940371301], [43.892173416085164, 0.12938904578665913, 0.5660059722538814]], "peak_params_": [[15.442581381889823, 0.9269550034852134, 6.712053131595235], [24.323715317709603, 0.4086725118944212, 6.617067988816821], [30.072194094494286, 0.37571069211652386, 1.7189657278875599], [32.66154216060839, 0.25869967292946505, 0.9891342821423107], [34.177801659122416, 0.24894441643300702, 0.5000000000000001], [37.72601729956798, 0.12327831883022, 7.84751880742602], [43.892173416085164, 0.16141309258018666, 1.1320119445077628]], "r_squared_": 0.9900448273753883, "error_": 0.050252667289496886}
{"freq_range": [2.0, 80.0], "freq_res": 0.5, "aperiodic_params_": [-7.058490087138672, 1.258303300600807], "gaussian_params_": [[10.60833906623158, 0.09720344297218732, 0.5839070318556314], [15.274718901717314, 0.8187038727740773, 3.2586612653983305], [20.301629532623355, 0.21091595911884062, 0.2500000000195442], [22.27016709754267, 0.23552916083143074, 1.4182705073967363], [26.40843765329542, 0.26418011044608697, 2.954162792856229], [30.167017941295384, 0.23792967152402233, 0.8239217894242181], [32.81788862612352, 0.22261823204817943, 0.3881589050592297], [34.28240591077061, 0.2027254432148505, 0.250000000000055], [36.37930935245289, 0.21261095646917555, 0.5978960064254933], [39.21805662323925, 0.10438536589977077, 1.0376946383811134], [42.57542479139314, 0.149180095814262, 0.38428056537387845], [50.339382873408674, 0.19353128569261607, 0.25184049749597115]], "peak_params_": [[10.60833906623158, 0.37539626820522454, 1.1678140637112628], [15.274718901717314, 0.8170415446306594, 6.517322530796661], [20.301629532623355, 0.5241468000986522, 0.5000000000390884], [22.27016709754267, 0.41263972423583795, 2.8365410147934726], [26.40843765329542, 0.2689928066584919, 5.908325585712458], [30.167017941295384, 0.3592863567395703, 1.6478435788484362], [32.81788862612352, 0.22198086636735326, 0.7763178101184594], [34.28240591077061, 0.1465549885065922, 0.50000000000011], [36.37930935245289, 0.2124749877464911, 1.1957920128509867], [39.21805662323925, 0.10215024745953016, 2.075389276762227], [42.57542479139314, 0.14703652932014144, 0.7685611307477569], [50.339382873408674, 0.1579157777199196, 0.5036809949919423]], "r_squared_": 0.9907584250425525, "error_": 0.04383024191665756}
{"freq_range": [2.0, 80.0], "freq_res": 0.5, "aperiodic_params_": [-7.184142373621915, 1.0791862549985336], "gaussian_params_": [[14.943507310941408, 0.6896095490908075, 3.6018706197508656], [22.995724574149364, 0.11796072186103011, 0.25000000000000006], [24.226017299765406, 0.1409429298174752, 3.464789969090326], [24.358561694584147, 0.08168484274501396, 0.25000000000000006], [29.995674145510524, 0.2972955520869994, 0.5027181587506587], [36.35516545906373, 0.17789457174278675, 0.3203938801506029], [61.886630455045825, 0.17985837063074891, 0.25000000000000006], [76.27398037248854, 0.0967626242317223, 1.8532070534234124]], "peak_params_": [[14.943507310941408, 0.6935926165130493, 7.203741239501731], [22.995724574149364, 0.30685324835501504, 0.5000000000000001], [24.226017299765406, 0.1991111825347769, 6.929579938180652], [24.358561694584147, 0.2305248359840757, 0.5000000000000001], [29.995674145510524, 0.3325509662329793, 1.0054363175013175], [36.35516545906373, 0.1608813780681615, 0.6407877603012058], [61.886630455045825, 0.16228409652223696, 0.5000000000000001], [76.27398037248854, 0.09604564252000003, 3.706414106846825]], "r_squared_": 0.9863350097177992, "error_": 0.0466296762919904}
{"freq_range": [2.0, 80.0], "freq_res": 0.5, "aperiodic_params_": [-7.515694240386865, 0.8413483582736], "gaussian_params_": [[5.354422726991819, 0.17170219038105133, 0.3078821834520851], [8.240141026614062, 0.13191528371851524, 0.25000003615001226], [10.071229585620095, 0.3075102520724228, 0.7258717442773999], [12.294125141135442, 0.17508672636937103, 0.5064071700764776], [15.508915482161, 0.5693880384049755, 3.413911046901276], [22.95258706269683, 0.1250398560089561, 0.25000000000000006], [25.62877655008969, 0.15319607465474122, 0.3255521447394602], [30.119463718577308, 0.3629868077482634, 0.381150862613282], [46.4807779628509, 0.13486023893730514, 0.25000000000000006], [55.906785092735966, 0.1393746170165643, 0.5857789933011246], [61.565630393377724, 0.15825716577955798, 0.6345091370413931], [64.13773147224119, 0.17119653066667606, 0.34541694237755066], [78.97585051513076, 0.13412890719260237, 0.30781626860179784]], "peak_params_": [[5.354422726991819, 0.16128548050104374, 0.6157643669041702], [8.240141026614062, 0.13909629492442654, 0.5000000723000245], [10.071229585620095, 0.46091176736086936, 1.4517434885547997], [12.294125141135442, 0.5484624478068545, 1.0128143401529552], [15.508915482161, 0.569386097138576, 6.827822093802552], [22.95258706269683, 0.17408222722850297, 0.5000000000000001], [25.62877655008969, 0.14953025903864514, 0.6511042894789204], [30.119463718577308, 0.34565776259907643, 0.762301725226564], [46.4807779628509, 0.13446219498463918, 0.5000000000000001], [55.906785092735966, 0.13762109826137348, 1.1715579866022492], [61.565630393377724, 0.15741284679504375, 1.2690182740827862], [64.13773147224119, 0.15821457519244753, 0.6908338847551013], [78.97585051513076, 0.13371675568925312, 0.6156325372035957]], "r_squared_": 0.9819668759842627, "error_": 0.04245173310981012}
{"freq_range": [2.0, 80.0], "freq_res": 0.5, "aperiodic_params_": [-6.872751052980636, 1.2366347713391226], "gaussian_params_": [[10.505109110349457, 0.2569696144738975, 0.45605112919240265], [11.94895392154247, 0.09490697495262067, 0.25000000000000006], [14.343482696383232, 0.42278447240565786, 1.977192091550743], [19.0260268802378, 0.3399437985069106, 5.534034853681184], [25.35301329390756, 0.09858002933185471, 0.25000000000000006], [28.698274678683422, 0.18523747211139885, 0.3659640800905632], [29.98010126852864, 0.626108425231512, 0.31923472013913745], [34.16624400608728, 0.14616752604767616, 1.9367700391365905], [53.18224244625852, 0.15019482497742587, 0.7104039394363078]], "peak_params_": [[10.505109110349457, 0.4246121468970596, 0.9121022583848053], [11.94895392154247, 0.4554248089626931, 0.5000000000000001], [14.343482696383232, 0.6647723876343967, 3.954384183101486], [19.0260268802378, 0.36634564024892136, 11.068069707362367], [25.35301329390756, 0.2544265435868933, 0.5000000000000001], [28.698274678683422, 0.240512903987689, 0.7319281601811264], [29.98010126852864, 0.6872710997225475, 0.6384694402782749], [34.16624400608728, 0.15437182068148303, 3.873540078273181], [53.18224244625852, 0.14533313181303775, 1.4208078788726155]], "r_squared_": 0.9880350453590966, "error_": 0.04580088916623873}
{"freq_range": [2.0, 80.0], "freq_res": 0.5, "aperiodic_params_": [-6.8158804583186745, 1.3143061164818857], "gaussian_params_": [[10.270286800010203, 0.30201259702048366, 1.7072296330165606], [15.581424011133043, 0.8021802871876782, 2.5466112030058974], [23.028663601600105, 0.28750128582873863, 2.284529803733546], [24.761550491310967, 0.028068510052158768, 0.25000000000000006], [25.95569561222413, 0.13789897733195267, 0.25000000000000006], [29.368275423645095, 0.272555763474559, 1.3702387972364305], [30.027705762547804, 0.4500219153787251, 0.2813946445259487], [35.20401681715563, 0.13124654273559336, 1.7967960723934189], [38.84394049372755, 0.23232473246422447, 0.25000000000000006]], "peak_params_": [[10.270286800010203, 0.40886385375558465, 3.414459266033121], [15.581424011133043, 0.8057997423019012, 5.093222406011795], [23.028663601600105, 0.2990056443269218, 4.569059607467092], [24.761550491310967, 0.21858450031770538, 0.5000000000000001], [25.95569561222413, 0.27261741688904095, 0.5000000000000001], [29.368275423645095, 0.3548994989694556, 2.740477594472861], [30.027705762547804, 0.6976340630263405, 0.5627892890518974], [35.20401681715563, 0.13046205738244687, 3.5935921447868377], [38.84394049372755, 0.2052859261386768, 0.5000000000000001]], "r_squared_": 0.9886530492866936, "error_": 0.04839537405377902}
{"freq_range": [2.0, 80.0], "freq_res": 0.5, "aperiodic_params_": [-6.922793871502794, 1.2143402535159584], "gaussian_params_": [[14.294974435729289, 0.6310129351266422, 3.516455609182595], [15.63449296637126, 0.2754666798177206, 0.5761333919598749], [19.226017299567975, 0.15430595537690084, 2.698944213715403], [22.961269806480885, 0.1971030178380884, 0.30487445617805803], [26.773982700430633, 0.13600742276286074, 3.6210758830878365], [29.960094316623824, 0.47576790291668675, 0.4557696318686531], [36.51604388880119, 0.14671470276737655, 0.7561276262292188], [39.01277248814865, 0.17152625380403344, 0.3053240351408312]], "peak_params_": [[14.294974435729289, 0.703319699171038, 7.03291121836519], [15.63449296637126, 0.9236603832054602, 1.1522667839197498], [19.226017299567975, 0.42514464526146334, 5.397888427430806], [22.961269806480885, 0.3620457826912258, 0.6097489123561161], [26.773982700430633, 0.13910290311614304, 7.242151766175673], [29.960094316623824, 0.5654866084370838, 0.9115392637373062], [36.51604388880119, 0.15037141442505408, 1.5122552524584376], [39.01277248814865, 0.17249671389872567, 0.6106480702816623]], "r_squared_": 0.9878276351115287, "error_": 0.049143270990759005}
