{"freq_range": [2.0, 80.0], "freq_res": 0.5, "aperiodic_params_": [-8.301045382295023, 0.5951345325951076], "gaussian_params_": [[10.961187006495868, 0.17394356572822137, 0.6681820101398176], [14.665918723665664, 0.172012928639934, 0.3338839000434468], [16.975893431834066, 0.1971776690691786, 0.43943420513233883], [18.939508014162215, 0.1767902758331906, 0.5269087280227374], [20.299037359756817, 0.2873132869698114, 0.8909213619402135], [22.289706929653644, 0.3882260871546791, 0.5197184304955065], [23.55966948052334, 0.21858055881984043, 0.25000000000065076], [24.837728038180334, 0.3801955327910551, 0.5812718782140883], [26.51183149411121, 0.3382528497025322, 0.4288967520291421], [27.707136102625196, 0.3571004712023506, 0.2500916209355186], [29.141172455727705, 0.3646200556546644, 0.388925450899098], [30.224623121680754, 0.25769389535999654, 0.2644741948944552], [31.09739910464061, 0.21220367309513707, 0.31874512790312126], [32.21950634203074, 0.24980568995133015, 0.2503615638168071], [33.31363263933812, 0.2225073574808802, 0.25000000000122186], [35.645874266023085, 0.16110253154110277, 0.27717719520535494], [40.93849685555536, 0.0769396437015745, 2.330731045515766], [44.24480117172116, 0.19539350387491117, 0.25000000000000006], [47.7260172998594, 0.10353645284248568, 1.2031718083206377], [52.580569551228834, 0.17467301940488542, 0.79227133938408], [55.62312220468952, 0.10256177163926182, 1.6494058943572978], [60.61192293291944, 0.18624806123507817, 0.3487488841216483], [63.52141376865793, 0.1722056166434922, 0.9432814672726572]], "peak_params_": [[10.961187006495868, 0.17365035706210818, 1.3363640202796352], [14.665918723665664, 0.1520331133730135, 0.6677678000868936], [16.975893431834066, 0.19738576995189128, 0.8788684102646777], [18.939508014162215, 0.2748767763392532, 1.0538174560454747], [20.299037359756817, 0.2833311902252884, 1.781842723880427], [22.289706929653644, 0.37144154375965854, 1.039436860991013], [23.55966948052334, 0.2655966139295831, 0.5000000000013015], [24.837728038180334, 0.36634398572435245, 1.1625437564281766], [26.51183149411121, 0.34449793317159383, 0.8577935040582843], [27.707136102625196, 0.277273318081674, 0.5001832418710372], [29.141172455727705, 0.3413803239641169, 0.777850901798196], [30.224623121680754, 0.2120748981839995, 0.5289483897889103], [31.09739910464061, 0.20604355028288346, 0.6374902558062425], [32.21950634203074, 0.17399060502343922, 0.5007231276336142], [33.31363263933812, 0.16900030738798932, 0.5000000000024437], [35.645874266023085, 0.14532422620746566, 0.5543543904107099], [40.93849685555536, 0.07691287791478985, 4.661462091031532], [44.24480117172116, 0.15430294608830053, 0.5000000000000001], [47.7260172998594, 0.10318896699613234, 2.4063436166412755], [52.580569551228834, 0.190890567456087, 1.58454267876816], [55.62312220468952, 0.10247308787960208, 3.2988117887145956], [60.61192293291944, 0.17921459051108002, 0.6974977682432966], [63.52141376865793, 0.17216239381059673, 1.8865629345453143]], "r_squared_": 0.9594983215977715, "error_": 0.033674775129679875}
{"freq_range": [2.0, 80.0], "freq_res": 0.5, "aperiodic_params_": [-8.247291913793966, 0.7826710664864164], "gaussian_params_": [[6.17964409439775, 0.25280995384961863, 0.25000000000000006], [6.924113988163616, 0.2824056675800998, 0.38149396372388594], [11.133533469134532, 0.1742298550357675, 0.3419618007194577], [13.217421782714736, 0.21508335515963115, 0.25000000000000006], [16.282376847355756, 0.13025192931154042, 0.7556638786466293], [19.684366925678912, 0.37717923400321884, 1.2461986981606656], [22.053745473298882, 0.127946070570308, 0.25000000000000006], [24.468968620058728, 0.28614277050689024, 3.369029983083416], [29.20733019405766, 0.262921713272811, 0.25000000000000006], [41.35912576879048, 0.07672228622079504, 2.8240818940873176], [46.589376220670516, 0.1783671805296116, 0.25000000000000006], [52.29294606516345, 0.10558530122333291, 1.1694480490850643], [63.50207624246896, 0.19265416879250497, 0.6025977756486355], [69.11672810161913, 0.13036885339622586, 0.8748101580804024]], "peak_params_": [[6.17964409439775, 0.21030636109377987, 0.5000000000000001], [6.924113988163616, 0.27803422675421174, 0.7629879274477719], [11.133533469134532, 0.16153676600875144, 0.6839236014389154], [13.217421782714736, 0.14823732592197558, 0.5000000000000001], [16.282376847355756, 0.15681712171806161, 1.5113277572932586], [19.684366925678912, 0.4695204857329305, 2.4923973963213313], [22.053745473298882, 0.4108912636402433, 0.5000000000000001], [24.468968620058728, 0.2863464082036362, 6.738059966166832], [29.20733019405766, 0.30224698840021347, 0.5000000000000001], [41.35912576879048, 0.07662769830882432, 5.648163788174635], [46.589376220670516, 0.18195929535797895, 0.5000000000000001], [52.29294606516345, 0.10397530539366429, 2.3388960981701286], [63.50207624246896, 0.19265302540656926, 1.205195551297271], [69.11672810161913, 0.1292134452507998, 1.7496203161608048]], "r_squared_": 0.9688343163949935, "error_": 0.039957765448134744}
{"freq_range": [2.0, 80.0], "freq_res": 0.5, "aperiodic_params_": [-7.909246808356173, 0.6901248484494434], "gaussian_params_": [[11.264848924202163, 0.15862359300178705, 0.753234655567388], [14.823171376381087, 0.2640242772921187, 0.3807630218552761], [16.707677021315988, 0.17747503924699926, 0.5081406332197836], [19.314139087842822, 0.3155935303289737, 1.0972293389686958], [22.233521082390734, 0.39297998168202675, 0.7466542554869605], [23.35173590391755, 0.16989806987421435, 0.25000000006259676], [25.043219061075146, 0.29516497563480787, 0.9253204399650432], [26.638343377560187, 0.25632209351390267, 0.25182364033096855], [27.767118095848947, 0.264598561019964, 0.2500096556542992], [29.096167209473847, 0.2172344548587187, 0.3292392114520362], [30.299779927299785, 0.1574128218070455, 0.9205722986370263], [32.21582001267012, 0.16566394477866883, 0.25000000043233755], [33.29620259737827, 0.26493133205069236, 0.25000018199602386], [35.48023703510528, 0.19568261158799866, 0.38023803255345157], [46.55872518021094, 0.14828183823934096, 0.4156315973639236], [48.367218606644265, 0.10260984232148558, 0.5669404912803785], [52.163149684832945, 0.13525243729273656, 0.31321346095401464], [53.24645491144892, 0.1983216011960991, 0.25143088170917977], [55.778230506341565, 0.13335931633032766, 1.830465881751544], [60.438135786151626, 0.12992979758442685, 0.31259493282711553], [63.726018824894034, 0.09660456102673881, 1.101167210646704], [70.21205232984515, 0.15128093865790226, 0.4590606308736908], [76.73117501898159, 0.21137120373869867, 0.916323794243307]], "peak_params_": [[11.264848924202163, 0.151079060101857, 1.506469311134776], [14.823171376381087, 0.23779987164483174, 0.7615260437105522], [16.707677021315988, 0.17503965020918422, 1.0162812664395673], [19.314139087842822, 0.3115811608067336, 2.1944586779373916], [22.233521082390734, 0.391320158626673, 1.493308510973921], [23.35173590391755, 0.3094255134349613, 0.5000000001251935], [25.043219061075146, 0.2952541698938749, 1.8506408799300864], [26.638343377560187, 0.30592827307257053, 0.5036472806619371], [27.767118095848947, 0.1810526637403047, 0.5000193113085984], [29.096167209473847, 0.2662919378444819, 0.6584784229040724], [30.299779927299785, 0.15375786800289148, 1.8411445972740526], [32.21582001267012, 0.14272760428811182, 0.5000000008646751], [33.29620259737827, 0.19040873602097008, 0.5000003639920477], [35.48023703510528, 0.19541849748484275, 0.7604760651069031], [46.55872518021094, 0.14726210641059367, 0.8312631947278472], [48.367218606644265, 0.09988577605415294, 1.133880982560757], [52.163149684832945, 0.13393942806771264, 0.6264269219080293], [53.24645491144892, 0.16862898660642323, 0.5028617634183595], [55.778230506341565, 0.13238414487908834, 3.660931763503088], [60.438135786151626, 0.13351978652426766, 0.6251898656542311], [63.726018824894034, 0.09460913951024885, 2.202334421293408], [70.21205232984515, 0.13597221822995387, 0.9181212617473816], [76.73117501898159, 0.20475044827651345, 1.832647588486614]], "r_squared_": 0.9714393889087887, "error_": 0.03122286781176239}
{"freq_range": [2.0, 80.0], "freq_res": 0.5, "aperiodic_params_": [-8.062013785183925, 0.6982550389774873], "gaussian_params_": [[6.69649967274843, 0.21446385408030288, 0.846150044044694], [21.98127389133301, 0.25944208194933716, 3.62667832016649], [28.19094686134131, 0.1703616220861407, 0.5961674595992111], [29.68454648560768, 0.2315721557388816, 0.4403725444206402], [49.949256763055494, 0.15341735082406607, 0.5258945094888574], [52.71014852215692, 0.21165570840395517, 0.5235042256315873], [54.71307293111517, 0.20241659981889873, 0.441133831060024], [58.46512185280702, 0.14229971091836605, 0.4390059728948268], [63.37102885706584, 0.09827087187751185, 1.2379756796062462], [77.22603854449777, 0.08214442269435476, 4.77748340932353]], "peak_params_": [[6.69649967274843, 0.20878678369364678, 1.692300088089388], [21.98127389133301, 0.259438623475166, 7.25335664033298], [28.19094686134131, 0.22745800863869547, 1.1923349191984223], [29.68454648560768, 0.2576456231969395, 0.8807450888412804], [49.949256763055494, 0.152705165191227, 1.0517890189777148], [52.71014852215692, 0.1952731979045197, 1.0470084512631745], [54.71307293111517, 0.18074356870452135, 0.882267662120048], [58.46512185280702, 0.14193192179268976, 0.8780119457896536], [63.37102885706584, 0.09906377648958298, 2.4759513592124924], [77.22603854449777, 0.08205253196671158, 9.55496681864706]], "r_squared_": 0.9362185535787362, "error_": 0.04746887239243451}
{"freq_range": [2.0, 80.0], "freq_res": 0.5, "aperiodic_params_": [-7.841962759495288, 0.8602882884738206], "gaussian_params_": [[6.838137203431017, 0.5631793194330011, 0.7647872595023222], [13.129250138442698, 0.15586059092699336, 0.25000000000000006], [16.538543950753095, 0.13769912100014717, 0.3095314684451599], [20.254338214031943, 0.5094694380284795, 2.1736831819246785], [24.159533199380746, 0.20898386813304232, 0.44573266030965986], [25.81496251935613, 0.3562512196335752, 0.5036770491373471], [27.35714143356225, 0.17447331610232886, 0.37886804908930277], [29.322105877133954, 0.23969400837147206, 1.1665984607490265], [38.38908439690686, 0.14157719963953802, 0.5748893298468415], [42.92354061417868, 0.18198547595026843, 1.8845598845939442], [46.30319971344253, 0.14530495342850974, 0.40415961887765384], [50.20774880900273, 0.24193962437433883, 0.41928059440639043], [52.93220071374828, 0.19102878613532068, 0.8704062488343138], [54.84304107115606, 0.16211535761711476, 0.30530252349087894], [75.96688909132378, 0.15469382618253905, 0.8832124247289179]], "peak_params_": [[6.838137203431017, 0.5507062008072356, 1.5295745190046444], [13.129250138442698, 0.1383059214426119, 0.5000000000000001], [16.538543950753095, 0.2512757528071834, 0.6190629368903198], [20.254338214031943, 0.5062261552193341, 4.347366363849357], [24.159533199380746, 0.31199721682135007, 0.8914653206193197], [25.81496251935613, 0.3529728920671591, 1.0073540982746942], [27.35714143356225, 0.2365744913006953, 0.7577360981786055], [29.322105877133954, 0.2369834052333175, 2.333196921498053], [38.38908439690686, 0.1505447992089337, 1.149778659693683], [42.92354061417868, 0.18183575941990426, 3.7691197691878884], [46.30319971344253, 0.1591194737298487, 0.8083192377553077], [50.20774880900273, 0.21480461770633497, 0.8385611888127809], [52.93220071374828, 0.1904502502287091, 1.7408124976686277], [54.84304107115606, 0.1534111683757331, 0.6106050469817579], [75.96688909132378, 0.15458515803590345, 1.7664248494578358]], "r_squared_": 0.9790247219099469, "error_": 0.03846814527904246}
{"freq_range": [2.0, 80.0], "freq_res": 0.5, "aperiodic_params_": [-7.877796942082473, 0.516709311446572], "gaussian_params_": [[10.930822461559396, 0.14833002045298932, 0.5884405967062075], [19.870932376460694, 0.44939021376280736, 1.2482464060508565], [22.361451873194998, 0.2777756699225053, 0.9336684614607359], [25.113346666394413, 0.282691727022453, 1.1465602415131633], [28.942344134292824, 0.13972221571684187, 5.999999999700134], [29.159431143455723, 0.2873681681066361, 0.25000000000000006], [40.669638075766585, 0.1443455220814062, 0.250000000000005], [43.67452083254708, 0.14360559170304069, 1.0671186102598114], [46.77565429089963, 0.13223333937161177, 0.6003916983669403], [52.53545566985442, 0.1578046217202424, 0.8769084210468049], [63.50187371451184, 0.23637242766588784, 0.872518054457821]], "peak_params_": [[10.930822461559396, 0.1489060504934656, 1.176881193412415], [19.870932376460694, 0.5043655336436821, 2.496492812101713], [22.361451873194998, 0.42319323376352713, 1.8673369229214718], [25.113346666394413, 0.39912792363953287, 2.2931204830263265], [28.942344134292824, 0.37511072917491184, 11.999999999400268], [29.159431143455723, 0.37511072917491184, 0.5000000000000001], [40.669638075766585, 0.13823636639020087, 0.50000000000001], [43.67452083254708, 0.14905932808632727, 2.1342372205196227], [46.77565429089963, 0.1259423996916027, 1.2007833967338806], [52.53545566985442, 0.15773846251622636, 1.7538168420936098], [63.50187371451184, 0.2363718913771642, 1.745036108915642]], "r_squared_": 0.9232114295946625, "error_": 0.04654897359614326}
{"freq_range": [2.0, 80.0], "freq_res": 0.5, "aperiodic_params_": [-7.5887428048024725, 0.8529265513376991], "gaussian_params_": [[6.907278700002939, 0.16779531003108905, 0.25000000000000006], [15.042743902847509, 0.09125710307700492, 0.25000000000000006], [20.163891679146772, 0.28118522800021734, 3.939911489484441], [22.68757335958255, 0.19940537727570237, 0.8641281537433195], [25.29757948108191, 0.24228075663689058, 0.25000000000000006], [26.647812767353848, 0.19347818537001052, 0.26769767416810714], [28.037984643903748, 0.10240431159535565, 0.3151978812974959], [29.4482764482134, 0.20339116491162507, 0.2818081580355923], [46.836206091100756, 0.12092839591900383, 0.826731018202453], [53.817102597076364, 0.15314883245225483, 0.6596450416851649], [56.21441180938517, 0.16967233868824141, 0.2661558792748548], [58.158966234208634, 0.09751577429781787, 3.260738044267038], [70.25199538886484, 0.24996024795816574, 0.721002222263116], [77.23921910229186, 0.20351846448084743, 0.9204353726311668], [79.72528452475241, 0.25242598668634775, 0.4014649301687689]], "peak_params_": [[6.907278700002939, 0.1577016226450194, 0.5000000000000001], [15.042743902847509, 0.2090487902431608, 0.5000000000000001], [20.163891679146772, 0.28252423651549563, 7.879822978968882], [22.68757335958255, 0.43062007754924103, 1.728256307486639], [25.29757948108191, 0.287961077419725, 0.5000000000000001], [26.647812767353848, 0.24329703944797565, 0.5353953483362143], [28.037984643903748, 0.14057011773604167, 0.6303957625949917], [29.4482764482134, 0.21696629386393695, 0.5636163160711846], [46.836206091100756, 0.11885737707736865, 1.653462036404906], [53.817102597076364, 0.1906067967683338, 1.3192900833703298], [56.21441180938517, 0.2016187631324584, 0.5323117585497096], [58.158966234208634, 0.09739995961216863, 6.521476088534076], [70.25199538886484, 0.23567751403061266, 1.442004444526232], [77.23921910229186, 0.1967597295611334, 1.8408707452623336], [79.72528452475241, 0.2256198317719047, 0.8029298603375378]], "r_squared_": 0.9761619954790534, "error_": 0.0360461466541213}
{"freq_range": [2.0, 80.0], "freq_res": 0.5, "aperiodic_params_": [-7.480652583780682, 0.7948883407445806], "gaussian_params_": [[6.915427165605219, 0.3262439285428567, 0.3512904662763659], [8.149218413646796, 0.15900075400946964, 0.41341173651387897], [21.564707104885237, 0.40377393018772817, 3.641839622903536], [28.161401787543497, 0.1265448786511528, 0.25000000000000006], [29.770620975945526, 0.14437127972798366, 1.3373601690793675], [43.13463229926988, 0.12082546238027249, 0.7187971590896004], [46.327582139754504, 0.13225218059814037, 1.4118826929237234], [50.1798166355656, 0.15820244962309005, 0.4043005522167308], [52.70653198534439, 0.18750131013571167, 0.5841332310415466], [55.90622621201288, 0.17953341002490988, 0.6317903380378785], [61.634328973323164, 0.19293155382385252, 0.5145513841773751], [63.59117453361351, 0.19874325927151681, 0.32933455123356964], [68.18787060858507, 0.17162893482532307, 0.25000000000000006], [70.37519424888042, 0.12335768880614273, 0.5802029043655403], [77.45587161621452, 0.12858131197583547, 0.25000000000000006], [79.72731315574022, 0.19313125921703442, 0.526264745173421]], "peak_params_": [[6.915427165605219, 0.3203981675967045, 0.7025809325527318], [8.149218413646796, 0.15214356037418852, 0.8268234730277579], [21.564707104885237, 0.4037102020198233, 7.283679245807072], [28.161401787543497, 0.24757886627804027, 0.5000000000000001], [29.770620975945526, 0.1698800473750488, 2.674720338158735], [43.13463229926988, 0.12695106132499845, 1.4375943181792008], [46.327582139754504, 0.1312718043286445, 2.8237653858474467], [50.1798166355656, 0.14779855863971925, 0.8086011044334616], [52.70653198534439, 0.17614960320262263, 1.1682664620830931], [55.90622621201288, 0.17756671341057917, 1.263580676075757], [61.634328973323164, 0.1864679224685304, 1.0291027683547502], [63.59117453361351, 0.19154076708118417, 0.6586691024671393], [68.18787060858507, 0.12943653399626243, 0.5000000000000001], [70.37519424888042, 0.12053650424952522, 1.1604058087310807], [77.45587161621452, 0.1266186295133469, 0.5000000000000001], [79.72731315574022, 0.17592984720633353, 1.052529490346842]], "r_squared_": 0.970324571552246, "error_": 0.037175192947365834}
{"freq_range": [2.0, 80.0], "freq_res": 0.5, "aperiodic_params_": [-7.521874433883943, 0.7925426470102958], "gaussian_params_": [[7.225513556311988, 0.17355389686018804, 0.5807503847962545], [21.517716733691465, 0.4113738693060544, 3.9054454561356997], [28.126747379031837, 0.19129651531119832, 0.25185531713017006], [29.644145983122307, 0.15934092464749613, 0.8974426747657916], [44.72601989915666, 0.10079230181678674, 1.9881168198224086], [49.30129064230698, 0.14835682722081842, 0.44574584210276624], [50.29076797509821, 0.19613278996541414, 0.25000000000000006], [52.864879690828545, 0.22278317020402152, 0.569349605009854], [63.47956682921387, 0.18926862964219743, 0.381714840798155], [70.46256776093144, 0.18172291064692161, 0.2902403393300967]], "peak_params_": [[7.225513556311988, 0.16136087895000628, 1.161500769592509], [21.517716733691465, 0.4113696364779482, 7.810890912271399], [28.126747379031837, 0.30204854202819753, 0.5037106342603401], [29.644145983122307, 0.20824494203042931, 1.7948853495315833], [44.72601989915666, 0.10014307550087942, 3.9762336396448172], [49.30129064230698, 0.14128324254366476, 0.8914916842055325], [50.29076797509821, 0.14369636197380586, 0.5000000000000001], [52.864879690828545, 0.21661429261827614, 1.138699210019708], [63.47956682921387, 0.18899765353107334, 0.76342968159631], [70.46256776093144, 0.18021786012756102, 0.5804806786601934]], "r_squared_": 0.9642974487067049, "error_": 0.04617426554617174}
{"freq_range": [2.0, 80.0], "freq_res": 0.5, "aperiodic_params_": [-7.370947689912454, 1.1122772098658094], "gaussian_params_": [[15.19399504197941, 0.15407951246021345, 0.5974853191908722], [21.73279178621292, 0.45126861629597165, 4.20385921918824], [54.635354380153764, 0.2093094643173997, 0.30161909764993144], [64.45203460095814, 0.07408111183573445, 5.99999999843051], [70.70907473425001, 0.1579071848375809, 0.39035609275512384], [72.23381214272231, 0.1776232057833127, 0.25000055870463556], [74.15339374279634, 0.21504738111201743, 0.3429723262429399], [78.40580381417963, 0.22711572432392108, 1.5050577115608827]], "peak_params_": [[15.19399504197941, 0.27132200598218503, 1.1949706383817444], [21.73279178621292, 0.4505772452021155, 8.40771843837648], [54.635354380153764, 0.20797939178156177, 0.6032381952998629], [64.45203460095814, 0.07407874469444664, 11.99999999686102], [70.70907473425001, 0.18138085365637657, 0.7807121855102477], [72.23381214272231, 0.14897125817683765, 0.5000011174092711], [74.15339374279634, 0.21859357672687807, 0.6859446524858798], [78.40580381417963, 0.23145045118053886, 3.0101154231217655]], "r_squared_": 0.9801677235897395, "error_": 0.04763970179090821}
{"freq_range": [2.0, 80.0], "freq_res": 0.5, "aperiodic_params_": [-7.583820700503085, 1.0913983490649908], "gaussian_params_": [[6.676679360738172, 0.5641227238012902, 0.660123020635181], [8.358224832166592, 0.22754121404658562, 0.5557517760198404], [11.885117620415993, 0.19798718372835836, 0.26162167868398356], [14.272452690875017, 0.2671493907166966, 0.5128936157041818], [15.777918497288098, 0.1812097780078699, 0.483246424983157], [20.45642455125906, 0.4939987117850725, 2.2366369129002], [24.712897980203678, 0.282265761056231, 1.0354264908015016], [28.15245992330544, 0.1829114665138202, 2.1801415882624595], [42.476202636926786, 0.10534003398388464, 0.3862942556840605], [44.22673537573746, 0.12060741745110558, 2.777657781515193], [52.1275215522207, 0.15092025421554572, 1.4729573495327126], [63.22601729957017, 0.10531568010096823, 1.1338812477183893], [68.22838915006977, 0.16939017791247207, 0.5799060953412863]], "peak_params_": [[6.676679360738172, 0.5451249339307811, 1.320246041270362], [8.358224832166592, 0.23269388809258373, 1.1115035520396808], [11.885117620415993, 0.18019350204651374, 0.5232433573679671], [14.272452690875017, 0.2618468067815183, 1.0257872314083636], [15.777918497288098, 0.2318372628510179, 0.966492849966314], [20.45642455125906, 0.4943629536294232, 4.4732738258004], [24.712897980203678, 0.4176969721851549, 2.0708529816030032], [28.15245992330544, 0.18596705329263763, 4.360283176524919], [42.476202636926786, 0.20455657233395996, 0.772588511368121], [44.22673537573746, 0.12025033576765232, 5.555315563030386], [52.1275215522207, 0.15275879727172637, 2.9459146990654252], [63.22601729957017, 0.10324408691995046, 2.2677624954367785], [68.22838915006977, 0.15676464514972643, 1.1598121906825727]], "r_squared_": 0.9868073373079214, "error_": 0.03821701270111174}
{"freq_range": [2.0, 80.0], "freq_res": 0.5, "aperiodic_params_": [-7.693733739038212, 0.8221036483536455], "gaussian_params_": [[7.033068163874296, 0.5755348753881374, 0.9786877474372199], [20.437387757414754, 0.47761487548813775, 2.6664154025945606], [25.647292070063695, 0.2419436825391062, 1.1970410782477243], [29.36414230032344, 0.2357495347422162, 1.2837784288803042], [43.95104777375587, 0.17038768350522715, 2.4466199860401194], [50.35732384728858, 0.17111273096076232, 0.40434791429249217], [52.1929587557566, 0.18768670857053302, 0.2500000032979451], [53.70773664244357, 0.1404588248047798, 0.9635095277143712]], "peak_params_": [[7.033068163874296, 0.5752079000955339, 1.9573754948744397], [20.437387757414754, 0.4775065852689053, 5.332830805189121], [25.647292070063695, 0.32141647674446183, 2.3940821564954486], [29.36414230032344, 0.23727677134245617, 2.5675568577606085], [43.95104777375587, 0.17035358176078041, 4.893239972080239], [50.35732384728858, 0.16607372202675563, 0.8086958285849843], [52.1929587557566, 0.1693449997800336, 0.5000000065958902], [53.70773664244357, 0.13731595075399738, 1.9270190554287423]], "r_squared_": 0.9770609611201779, "error_": 0.043747247010070725}
{"freq_range": [2.0, 80.0], "freq_res": 0.5, "aperiodic_params_": [-7.616311474996901, 0.864317642257249], "gaussian_params_": [[7.082376874544155, 0.5023970021003505, 0.9366394864579995], [19.984911201842344, 0.5613732062606784, 2.335623002902279], [26.308742027386206, 0.30861518648625674, 3.5461629287305]], "peak_params_": [[7.082376874544155, 0.5004579318509883, 1.873278972915999], [19.984911201842344, 0.6247710977779803, 4.671246005804558], [26.308742027386206, 0.3196384098975926, 7.092325857461]], "r_squared_": 0.9657627390209892, "error_": 0.0601685621344393}
{"freq_range": [2.0, 80.0], "freq_res": 0.5, "aperiodic_params_": [-7.663060045069176, 0.7351262312719187], "gaussian_params_": [[6.687599423174446, 0.22069517684533463, 0.32256732218236533], [11.115902060353335, 0.19734092448085921, 0.5791210403760404], [20.648526097099, 0.6249846234811839, 2.1978724997067873], [23.739136022300013, 0.22809614871524747, 0.25000000000000006], [25.020154542197616, 0.3045886347371035, 0.3864410104157728], [26.21107971084641, 0.3486639965400977, 0.4242063310076033], [27.77622120977136, 0.16081371287011523, 0.25000000000000006], [29.10700087029003, 0.23631420379532322, 0.25000000000000006], [29.36696438309432, 0.14629231849047086, 2.820495195813731], [39.03304083934219, 0.11557089294276723, 1.209540775753449], [42.976861296462715, 0.09661197963837359, 0.8484362590790941], [46.61436771043341, 0.16002724025572865, 0.25000000000000006], [53.052322911431396, 0.14099719880741723, 0.31463408657343045], [63.27027284717237, 0.11162464628934307, 1.4769272747748805], [76.75376536201668, 0.1900558497561871, 0.25000000000000006]], "peak_params_": [[6.687599423174446, 0.18635687464067452, 0.6451346443647307], [11.115902060353335, 0.19346895162621003, 1.1582420807520808], [20.648526097099, 0.6246041694367435, 4.395744999413575], [23.739136022300013, 0.43068360520967985, 0.5000000000000001], [25.020154542197616, 0.4422632778554352, 0.7728820208315456], [26.21107971084641, 0.4242940679784688, 0.8484126620152066], [27.77622120977136, 0.240198198766004, 0.5000000000000001], [29.10700087029003, 0.36114911210214373, 0.5000000000000001], [29.36696438309432, 0.2150056677805825, 5.640990391627462], [39.03304083934219, 0.11595821587921407, 2.419081551506898], [42.976861296462715, 0.09711073352645805, 1.6968725181581883], [46.61436771043341, 0.14414576414130664, 0.5000000000000001], [53.052322911431396, 0.13906098365104214, 0.6292681731468609], [63.27027284717237, 0.11028246134151942, 2.953854549549761], [76.75376536201668, 0.1170107720671627, 0.5000000000000001]], "r_squared_": 0.9714528913761208, "error_": 0.038032992601228006}
{"freq_range": [2.0, 80.0], "freq_res": 0.5, "aperiodic_params_": [-7.778285308786262, 0.49412016661912234], "gaussian_params_": [[10.530577497023458, 0.12263878464985672, 0.8685694079544123], [20.23157275380227, 0.4185517288895254, 1.4817188105104817], [23.082380028245755, 0.2726315790579921, 1.16363618189917], [25.069637141640882, 0.3599204252346923, 0.36675172195202627], [26.28546562103889, 0.37721581356988876, 0.26526961590167736], [27.710592284882207, 0.1802846485226098, 0.25000000000000006], [29.169827027967006, 0.27826742048236336, 0.28245457511087635], [33.04796538909249, 0.10419045119863878, 5.999999999999999], [40.709837997636264, 0.15520873901145815, 0.25000000000000305], [63.646572693518834, 0.20609901131327668, 0.7271679141341507]], "peak_params_": [[10.530577497023458, 0.12265217581519039, 1.7371388159088246], [20.23157275380227, 0.43142790255270747, 2.9634376210209634], [23.082380028245755, 0.3706505979497354, 2.32727236379834], [25.069637141640882, 0.4683540587009354, 0.7335034439040525], [26.28546562103889, 0.33332104088548675, 0.5305392318033547], [27.710592284882207, 0.19459890531791402, 0.5000000000000001], [29.169827027967006, 0.31523750908896275, 0.5649091502217527], [33.04796538909249, 0.10418712196382707, 11.999999999999998], [40.709837997636264, 0.15730668290717276, 0.5000000000000061], [63.646572693518834, 0.20195471288419675, 1.4543358282683014]], "r_squared_": 0.8980163304191121, "error_": 0.051623203719558274}
{"freq_range": [2.0, 80.0], "freq_res": 0.5, "aperiodic_params_": [-7.80284556806786, 0.744421567082753], "gaussian_params_": [[6.911108673066792, 0.2256506640863754, 0.33866607932836235], [17.623106645017142, 0.18104088769100876, 0.7944477728635285], [20.458484165569423, 0.32961827800594473, 1.1359278709918779], [22.909973626860452, 0.28955002028833465, 0.909477182107286], [25.02393839729915, 0.28167110460987654, 0.36587582206093155], [26.489095063818723, 0.18397441418587515, 0.8235241774997366], [29.349446678180264, 0.24751605452445866, 0.4340713583933072], [30.89184025987402, 0.1580640716579237, 0.3607625672119257], [45.74995263855365, 0.0704207764060047, 2.928842438550453], [52.50002386234661, 0.12587279485524103, 0.8745081817238656], [53.8211632542236, 0.08456511733585004, 0.25000000000000006], [56.53897906238474, 0.1593826956142495, 1.0978013062693042], [61.69946018775061, 0.1643661855147346, 0.47083237594794897], [63.47865108418947, 0.1668696231330162, 0.4508692654636501], [68.26807647845516, 0.2679608521760078, 0.25000000000000006], [69.87018991699058, 0.18123043108592424, 0.7748937694237361], [77.51448727398203, 0.1318610771588227, 0.25378619985105033], [79.6330360996913, 0.16833254198571695, 0.46889522818363216]], "peak_params_": [[6.911108673066792, 0.2180101337794209, 0.6773321586567247], [17.623106645017142, 0.1899733209222667, 1.588895545727057], [20.458484165569423, 0.3383047703292412, 2.2718557419837557], [22.909973626860452, 0.31513497411105007, 1.818954364214572], [25.02393839729915, 0.33770591145569284, 0.7317516441218631], [26.489095063818723, 0.1841605787620697, 1.6470483549994732], [29.349446678180264, 0.23338994109925615, 0.8681427167866144], [30.89184025987402, 0.15129722566205928, 0.7215251344238514], [45.74995263855365, 0.07016479776954299, 5.857684877100906], [52.50002386234661, 0.1310027943640435, 1.7490163634477311], [53.8211632542236, 0.1067080341907296, 0.5000000000000001], [56.53897906238474, 0.15936948596957912, 2.1956026125386083], [61.69946018775061, 0.15027643985882122, 0.9416647518958979], [63.47865108418947, 0.16679236077539095, 0.9017385309273002], [68.26807647845516, 0.21221418219596977, 0.5000000000000001], [69.87018991699058, 0.1787052628614898, 1.5497875388474722], [77.51448727398203, 0.13165180928983133, 0.5075723997021007], [79.6330360996913, 0.16169182798279103, 0.9377904563672643]], "r_squared_": 0.9720424057862711, "error_": 0.033516677847165006}
{"freq_range": [2.0, 80.0], "freq_res": 0.5, "aperiodic_params_": [-7.711140039601686, 0.764426410981916], "gaussian_params_": [[6.9955814742948625, 0.21456279529946512, 0.3139499519678928], [15.823458034175543, 0.11394793986457627, 0.25000000000000006], [17.74060465278803, 0.16721475001939884, 0.4299167341902173], [22.019525577782, 0.395195608737371, 3.087749801985549], [29.32167417790456, 0.10576989459837548, 0.25000000000000006], [29.726017299567975, 0.08553147626591291, 2.3746922444354968], [46.11902054234511, 0.14292142431395732, 0.25000000000000006], [53.203711260776316, 0.16279769407840233, 0.6210614706985554], [56.301164505386765, 0.18117181744120428, 0.9033215893508768], [61.57410319892761, 0.19524769425745261, 0.4524639766027117], [63.591698736460856, 0.1889336577668444, 0.37152444508192256], [70.25484259843661, 0.14445794602222023, 0.9925341170112383], [77.53776722282417, 0.15077779539986422, 0.25000000000000006]], "peak_params_": [[6.9955814742948625, 0.21454442343983793, 0.6278999039357857], [15.823458034175543, 0.14794195124591702, 0.5000000000000001], [17.74060465278803, 0.27836812733704264, 0.8598334683804346], [22.019525577782, 0.3956178293375405, 6.175499603971098], [29.32167417790456, 0.18816302463739376, 0.5000000000000001], [29.726017299567975, 0.18816302463739376, 4.7493844888709935], [46.11902054234511, 0.12760861482829178, 0.5000000000000001], [53.203711260776316, 0.15449965621293948, 1.2421229413971109], [56.301164505386765, 0.1768356968343845, 1.8066431787017536], [61.57410319892761, 0.1926466560177893, 0.9049279532054234], [63.591698736460856, 0.183288326153896, 0.7430488901638451], [70.25484259843661, 0.14011780978668575, 1.9850682340224766], [77.53776722282417, 0.14906706336999953, 0.5000000000000001]], "r_squared_": 0.9633211846689836, "error_": 0.039856902553561925}
{"freq_range": [2.0, 80.0], "freq_res": 0.5, "aperiodic_params_": [-7.4364927747766085, 1.1042347699548054], "gaussian_params_": [[7.630583232742836, 0.15468936546163106, 0.5347166471581167], [11.793598715718261, 0.21254073122438707, 1.529201063282043], [16.945470410605324, 0.5088867662145251, 2.8630822124344295], [23.055271540567414, 0.7498501885798883, 2.750375284610834], [29.272237167756657, 0.27831247994450437, 1.9141607757361219], [36.67605796750223, 0.2179108111383109, 0.2500000011105281]], "peak_params_": [[7.630583232742836, 0.15647547002261852, 1.0694332943162335], [11.793598715718261, 0.325326254162297, 3.058402126564086], [16.945470410605324, 0.5758817444217712, 5.726164424868859], [23.055271540567414, 0.8053908285437146, 5.500750569221668], [29.272237167756657, 0.3245436859970372, 3.8283215514722437], [36.67605796750223, 0.17028171033156347, 0.5000000022210562]], "r_squared_": 0.9878365812009813, "error_": 0.044580152057972236}
{"freq_range": [2.0, 80.0], "freq_res": 0.5, "aperiodic_params_": [-7.184203377519592, 1.2691064770653335], "gaussian_params_": [[7.4101079625316455, 0.1887569442864896, 0.7514766155701599], [11.06265026878675, 0.30143639921017146, 1.1185300862269112], [13.204766559558392, 0.22594579528512235, 0.2500000000005843], [15.094391286931241, 0.24647851990642436, 0.8693992682891489], [17.441464380020836, 0.16740064476800698, 0.2501006228213046], [20.32980888421928, 0.8048665363367198, 3.0062392826234383], [24.932311410723912, 0.4571475614038867, 1.547068089347157], [29.1395259093976, 0.37545428332703173, 1.9262216315970735], [37.091790047662336, 0.17011092211869355, 0.2719275059800813], [70.88953256474252, 0.16715023892608263, 0.29916810701664]], "peak_params_": [[7.4101079625316455, 0.18938961089589412, 1.5029532311403198], [11.06265026878675, 0.3074897994309218, 2.2370601724538224], [13.204766559558392, 0.2835496161009239, 0.5000000000011686], [15.094391286931241, 0.4128229277896658, 1.7387985365782979], [17.441464380020836, 0.685036566632748, 0.5002012456426091], [20.32980888421928, 0.8111394565774663, 6.012478565246877], [24.932311410723912, 0.7348157576038297, 3.094136178694314], [29.1395259093976, 0.4014634841794038, 3.852443263194147], [37.091790047662336, 0.16078145442206093, 0.5438550119601626], [70.88953256474252, 0.1561349566881809, 0.59833621403328]], "r_squared_": 0.9907733580016373, "error_": 0.04486895424271127}
{"freq_range": [2.0, 80.0], "freq_res": 0.5, "aperiodic_params_": [-7.422961123121249, 1.2038023212783295], "gaussian_params_": [[7.105135222811543, 0.2299766856873883, 0.848786903911549], [19.898725247192917, 0.6986214901691776, 5.58658665586758], [26.675180044922424, 0.3177810906475587, 2.4671159029622434]], "peak_params_": [[7.105135222811543, 0.27682095215411806, 1.697573807823098], [19.898725247192917, 0.7066815454289745, 11.17317331173516], [26.675180044922424, 0.6645576184375237, 4.934231805924487]], "r_squared_": 0.9833517896509119, "error_": 0.060334016805887104}
{"freq_range": [2.0, 80.0], "freq_res": 0.5, "aperiodic_params_": [-7.5546229254401815, 1.1117889843736446], "gaussian_params_": [[7.175836022741852, 0.31795626763748663, 0.8972508442148084], [9.553082471853577, 0.22639971722564942, 1.4719371137286144], [14.106833510302367, 0.2695045313560259, 1.0343126578905042], [22.056243439983557, 0.8612666562914928, 4.394607628101805], [28.65118937838194, 0.14817268169753134, 1.8991717276189914], [32.31566177926419, 0.187007697878224, 0.250000448074031], [33.722751836595656, 0.18470234341920544, 0.5133614672185265]], "peak_params_": [[7.175836022741852, 0.3646448343968931, 1.7945016884296168], [9.553082471853577, 0.251902885929951, 2.9438742274572287], [14.106833510302367, 0.43089526858557115, 2.0686253157810084], [22.056243439983557, 0.8615178158743309, 8.78921525620361], [28.65118937838194, 0.441652589525404, 3.798343455237983], [32.31566177926419, 0.22347000931491579, 0.500000896148062], [33.722751836595656, 0.2028201526735316, 1.026722934437053]], "r_squared_": 0.9846126207789516, "error_": 0.054345926795577315}
{"freq_range": [2.0, 80.0], "freq_res": 0.5, "aperiodic_params_": [-7.747179576775639, 0.9458793668221598], "gaussian_params_": [[7.369533372521653, 0.3179958099847556, 0.975479941827887], [12.25927059582751, 0.3368794340687952, 2.320004572998229], [22.112981674562004, 0.7808584833586514, 5.290917308381155], [32.09124864567146, 0.20246188799023598, 0.4020584452517065]], "peak_params_": [[7.369533372521653, 0.3734720428613514, 1.950959883655774], [12.25927059582751, 0.48495493762366415, 4.640009145996458], [22.112981674562004, 0.7807305429871665, 10.58183461676231], [32.09124864567146, 0.3335539890095056, 0.804116890503413]], "r_squared_": 0.9799041619678426, "error_": 0.057401958592418416}
{"freq_range": [2.0, 80.0], "freq_res": 0.5, "aperiodic_params_": [-8.034568538828529, 0.6846125636640692], "gaussian_params_": [[9.726017299617766, 0.08320715516704061, 0.8983795847636803], [11.698593105888166, 0.21835182544062992, 0.6326676261339836], [13.19064404507518, 0.14608580334449386, 0.2500000037147396], [14.360428259644156, 0.2780281331595825, 0.5207696953150874], [16.08532539301735, 0.28588281981264557, 0.4074800509874717], [17.396189929556304, 0.24075350877083584, 0.45313288621312114], [20.93692048287778, 0.42539108303614176, 2.0748749542976994], [25.52985577520867, 0.22985214152233124, 1.2156429054113904], [27.552817048815655, 0.11531072394705062, 5.999927689098998], [27.713724967836942, 0.1869303488096192, 0.25000000000000006], [29.242798660984295, 0.17479906159532596, 0.3077814320626594], [42.503552994656665, 0.17851431881920732, 0.397736366464127], [49.32170024308659, 0.18452286025241324, 0.2500000000000006], [54.98865593801887, 0.07912435428328492, 2.1663706680689843]], "peak_params_": [[9.726017299617766, 0.08238359381078197, 1.7967591695273606], [11.698593105888166, 0.22292883422398546, 1.2653352522679673], [13.19064404507518, 0.1511954062885188, 0.5000000074294793], [14.360428259644156, 0.28265673146248993, 1.0415393906301749], [16.08532539301735, 0.3268785788027291, 0.8149601019749434], [17.396189929556304, 0.37142877586173384, 0.9062657724262423], [20.93692048287778, 0.48892891935409644, 4.149749908595399], [25.52985577520867, 0.37643063626993545, 2.431285810822781], [27.552817048815655, 0.30969219611815824, 11.999855378197996], [27.713724967836942, 0.30969219611815824, 0.5000000000000001], [29.242798660984295, 0.2441949635169589, 0.6155628641253188], [42.503552994656665, 0.1836857454266152, 0.795472732928254], [49.32170024308659, 0.14642430735808531, 0.5000000000000012], [54.98865593801887, 0.07912656304484322, 4.3327413361379685]], "r_squared_": 0.9615613462500624, "error_": 0.04173259220645892}
{"freq_range": [2.0, 80.0], "freq_res": 0.5, "aperiodic_params_": [-8.017840531966632, 0.582891118842614], "gaussian_params_": [[9.336897010366544, 0.11085027282033556, 0.5496909138784631], [17.505618419858056, 0.11472585787123815, 0.3808008501998901], [22.07081743577214, 0.3323644081936532, 3.6431819305845807], [27.6620094734797, 0.13466368913896565, 0.25000000000000006], [29.500552988761747, 0.17525710497553298, 0.3686687120512623], [41.0888007225329, 0.1984554426939348, 0.3996772357542932], [42.5161039838625, 0.12441323096404432, 0.4284778263230562], [46.199954690396204, 0.10538294372466595, 1.2637090585940653], [49.540723389171575, 0.11372544989263515, 0.6801691586375209], [52.81421078997696, 0.08561766899704433, 0.6589882127716071], [55.19926260708629, 0.17540993067010588, 0.25000000000000006], [58.201765163244396, 0.08276228831819253, 3.6189756730266303]], "peak_params_": [[9.336897010366544, 0.10693991462952823, 1.0993818277569263], [17.505618419858056, 0.2660025922872489, 0.7616017003997801], [22.07081743577214, 0.3323016222874209, 7.2863638611691615], [27.6620094734797, 0.2186493962180318, 0.5000000000000001], [29.500552988761747, 0.21681367264403484, 0.7373374241025246], [41.0888007225329, 0.19387854263220916, 0.7993544715085864], [42.5161039838625, 0.1261715272822368, 0.8569556526461124], [46.199954690396204, 0.10435354203571023, 2.5274181171881307], [49.540723389171575, 0.12160118922351337, 1.3603383172750418], [52.81421078997696, 0.1117402793308031, 1.3179764255432143], [55.19926260708629, 0.18398226691433983, 0.5000000000000001], [58.201765163244396, 0.08263376376612719, 7.2379513460532605]], "r_squared_": 0.9466033370740012, "error_": 0.041538799084796775}
{"freq_range": [2.0, 80.0], "freq_res": 0.5, "aperiodic_params_": [-7.900743416826309, 0.6798528050806788], "gaussian_params_": [[6.864945993450624, 0.11320883243912823, 0.35008576931889046], [10.212721972717052, 0.09883388198957789, 0.7475739897474634], [14.129893646699378, 0.2515398026384576, 1.6232177973742397], [15.828809791234013, 0.08293007937847467, 0.25000000000000094], [17.222018714976425, 0.23025119066891847, 0.2500000000001067], [18.08511045870601, 0.16046987531595489, 0.2500000000063331], [20.016369900220198, 0.34929441720184634, 0.7094164357831967], [21.792249862617552, 0.2729627724686714, 0.25000000000105005], [23.789297455860076, 0.17151050684313165, 1.0815513994963055], [25.401876062710475, 0.1343927292680295, 0.3484596971323782], [26.683949084581375, 0.24569968738258988, 0.2500002878580414], [27.718126503045237, 0.0843468050452353, 0.6511833697577564], [30.484119540273053, 0.0880399318101291, 1.5844423623039137], [33.68704978055397, 0.17932622239204143, 0.37135955099332324], [37.8640174953722, 0.10270599622048439, 1.563610637099586], [38.273849408180055, 0.05279896345729613, 0.25000000000098715], [41.539999853678964, 0.10989953290976613, 0.25000000000008216], [52.0934133124658, 0.16471969010759852, 0.3609592636647434], [54.190563268804496, 0.0922125677465347, 0.9361150535905233], [57.203068067364015, 0.11567595831517814, 0.45325017609203827], [62.130184993829666, 0.12433316698259517, 0.36960091731825623], [76.72853659066888, 0.14124348808548193, 0.26712037243814013]], "peak_params_": [[6.864945993450624, 0.10511656336985276, 0.7001715386377809], [10.212721972717052, 0.10479702805884905, 1.4951479794949267], [14.129893646699378, 0.25073597819072546, 3.2464355947484793], [15.828809791234013, 0.19513283944136894, 0.5000000000000019], [17.222018714976425, 0.20796327958412242, 0.5000000000002134], [18.08511045870601, 0.1740661713929441, 0.5000000000126662], [20.016369900220198, 0.3499356715948103, 1.4188328715663934], [21.792249862617552, 0.2439190790274406, 0.5000000000021001], [23.789297455860076, 0.1683480135728228, 2.163102798992611], [25.401876062710475, 0.1791461686728617, 0.6969193942647564], [26.683949084581375, 0.21417861027019036, 0.5000005757160828], [27.718126503045237, 0.09635748406513223, 1.3023667395155127], [30.484119540273053, 0.08804626300547014, 3.1688847246078273], [33.68704978055397, 0.1744379915588148, 0.7427191019866465], [37.8640174953722, 0.13129767094056533, 3.127221274199172], [38.273849408180055, 0.12962217615248406, 0.5000000000019743], [41.539999853678964, 0.11537880359665564, 0.5000000000001643], [52.0934133124658, 0.16526162352354135, 0.7219185273294868], [54.190563268804496, 0.09032172485271239, 1.8722301071810465], [57.203068067364015, 0.10565067010593765, 0.9065003521840765], [62.130184993829666, 0.11685470969004541, 0.7392018346365125], [76.72853659066888, 0.0979538785960834, 0.5342407448762803]], "r_squared_": 0.983314524751485, "error_": 0.024708535297691285}
{"freq_range": [2.0, 80.0], "freq_res": 0.5, "aperiodic_params_": [-8.064084478503926, 0.9173027007183998], "gaussian_params_": [[9.662879134869575, 0.1718955502073417, 0.7237651582143176], [16.389732812984903, 0.5546357535550064, 2.569557434449525], [20.649415252611888, 0.4026938185339542, 1.2999488909365835], [21.794218300871016, 0.16049483148585095, 0.25000000000000006], [23.791603525315537, 0.4694200752307228, 0.7867986362541546], [25.62050470564829, 0.3472313194632727, 0.5702493374942451], [27.909446836171675, 0.27031777882316615, 0.9198290462639109], [30.33137445336205, 0.13049866483986095, 0.6466601254729111], [40.54478427221262, 0.12056273879106441, 0.8209508908626917], [65.8292641787288, 0.1861102638509909, 0.25000000000000006], [70.6856876245397, 0.19584092631398853, 0.25000000000000006]], "peak_params_": [[9.662879134869575, 0.18283320484654553, 1.4475303164286353], [16.389732812984903, 0.5565942641660904, 5.13911486889905], [20.649415252611888, 0.5544249758771027, 2.599897781873167], [21.794218300871016, 0.4353905389541026, 0.5000000000000001], [23.791603525315537, 0.48083652117755094, 1.5735972725083092], [25.62050470564829, 0.39416901325664355, 1.1404986749884902], [27.909446836171675, 0.2692857501761452, 1.8396580925278219], [30.33137445336205, 0.13125942000329616, 1.2933202509458221], [40.54478427221262, 0.12038348154031198, 1.6419017817253834], [65.8292641787288, 0.14739757814852972, 0.5000000000000001], [70.6856876245397, 0.1486305323709285, 0.5000000000000001]], "r_squared_": 0.9843715009853815, "error_": 0.041564367798235705}
{"freq_range": [2.0, 80.0], "freq_res": 0.5, "aperiodic_params_": [-7.708566551834812, 0.9879328596345262], "gaussian_params_": [[10.092539359424757, 0.10103492807542952, 0.703508029230978], [14.855787912253852, 0.3516682071034022, 2.5835452288530405], [21.952790366731467, 0.84845235353525, 5.868646393502965]], "peak_params_": [[10.092539359424757, 0.2669121248627153, 1.407016058461956], [14.855787912253852, 0.7716926895542144, 5.167090457706081], [21.952790366731467, 0.8561102538569898, 11.73729278700593]], "r_squared_": 0.9801816410482993, "error_": 0.061817745774275894}
{"freq_range": [2.0, 80.0], "freq_res": 0.5, "aperiodic_params_": [-7.493033966269638, 1.1628919189317901], "gaussian_params_": [[10.660649255818653, 0.2890736467641969, 0.48678869806854597], [13.334516421545997, 0.17615778090277323, 0.9681874688490977], [20.958444232855726, 0.819539212638736, 4.285930771182158], [28.172683268559304, 0.4093739172340876, 2.4223153895336895], [31.578747928996172, 0.20826379394766004, 0.4240933407149274], [34.866459219884256, 0.15513832977137473, 1.0683508417943357], [37.309423548538966, 0.21632952781252165, 0.2500000000001127]], "peak_params_": [[10.660649255818653, 0.31791946670089466, 0.9735773961370919], [13.334516421545997, 0.3538933903772392, 1.9363749376981954], [20.958444232855726, 0.8246077054940901, 8.571861542364315], [28.172683268559304, 0.6208697222687309, 4.844630779067379], [31.578747928996172, 0.40496191324612774, 0.8481866814298548], [34.866459219884256, 0.16546869577801893, 2.1367016835886714], [37.309423548538966, 0.16994017274059559, 0.5000000000002254]], "r_squared_": 0.9868110434952404, "error_": 0.049088331091225915}
{"freq_range": [2.0, 80.0], "freq_res": 0.5, "aperiodic_params_": [-7.2518830800311465, 1.2576993428266567], "gaussian_params_": [[14.46938075888458, 0.3315315691404189, 3.0582478928900865], [22.726017299567975, 0.8289529117771188, 5.460146652577841], [26.21763459813989, 0.2048305351745146, 0.4744857306170752], [28.089766539984804, 0.4207278587772522, 0.7468831076021553], [30.821741750342916, 0.11779696362695556, 0.7768154492766538], [31.943959763041544, 0.15267676529295257, 0.2791910024761362], [34.94990911421573, 0.22216606431027539, 0.5303978517761802], [53.20957048724323, 0.26904021470028805, 0.25000000000000006], [59.13084555785369, 0.1837351227349105, 0.45172967655338914]], "peak_params_": [[14.46938075888458, 0.5979972188556335, 6.116495785780173], [22.726017299567975, 0.8387925076030189, 10.920293305155681], [26.21763459813989, 0.8856049135116848, 0.9489714612341504], [28.089766539984804, 0.9379772267415181, 1.4937662152043105], [30.821741750342916, 0.37841993841499466, 1.5536308985533076], [31.943959763041544, 0.3828454493110449, 0.5583820049522724], [34.94990911421573, 0.28743763646036236, 1.0607957035523603], [53.20957048724323, 0.18933226297181527, 0.5000000000000001], [59.13084555785369, 0.17618688725988108, 0.9034593531067783]], "r_squared_": 0.9916057448877507, "error_": 0.04308076407792605}
{"freq_range": [2.0, 80.0], "freq_res": 0.5, "aperiodic_params_": [-7.544124123397627, 1.1345943305464221], "gaussian_params_": [[22.547447682943872, 0.9316734901878262, 5.999999999999999]], "peak_params_": [[22.547447682943872, 0.931644359249745, 11.999999999999998]], "r_squared_": 0.9844030711501385, "error_": 0.05600261802340498}
{"freq_range": [2.0, 80.0], "freq_res": 0.5, "aperiodic_params_": [-7.622853610079794, 1.0772663040382477], "gaussian_params_": [[12.295859120419044, 0.5506113419949787, 2.2603108740453837], [18.02047716868119, 0.7199587079482085, 4.079466024048054], [25.178109453808972, 0.6112451416690521, 4.701870752769947], [35.82194810129608, 0.12629580483140412, 5.999999999999999]], "peak_params_": [[12.295859120419044, 0.8527349088626366, 4.520621748090767], [18.02047716868119, 0.93488025149761, 8.158932048096109], [25.178109453808972, 0.8022403466928534, 9.403741505539895], [35.82194810129608, 0.1695246174622902, 11.999999999999998]], "r_squared_": 0.9878145544256407, "error_": 0.056276027705367306}
{"freq_range": [2.0, 80.0], "freq_res": 0.5, "aperiodic_params_": [-8.04982458060851, 0.670384001942478], "gaussian_params_": [[11.276420162849213, 0.25040471898669575, 1.306549083016603], [19.964890299483304, 0.7674391815468534, 5.4276909807661164], [29.33961810689068, 0.2156493681404001, 0.2500000000000456], [62.275017969933685, 0.32531060102210974, 0.33959760639134856]], "peak_params_": [[11.276420162849213, 0.47421331315995374, 2.613098166033206], [19.964890299483304, 0.7674231257435746, 10.855381961532233], [29.33961810689068, 0.33955832649355955, 0.5000000000000911], [62.275017969933685, 0.26121138837851987, 0.6791952127826971]], "r_squared_": 0.970620959385799, "error_": 0.056127909238452664}
{"freq_range": [2.0, 80.0], "freq_res": 0.5, "aperiodic_params_": [-7.98044610649742, 0.6071556668612025], "gaussian_params_": [[11.411853865193233, 0.12855644583879058, 1.6225188899816323], [19.645333976848473, 0.5333251500683268, 2.382939281701708], [22.743124804684612, 0.2703032148511233, 0.25000000000000006], [23.756432909450773, 0.25490739076890695, 0.25000000000000006], [25.509245285207935, 0.30174496511403653, 0.8992119122106325], [27.768829361956175, 0.4055612766623111, 0.2544342073059727], [29.27018956694579, 0.30510253868228354, 0.29543075161650045], [37.486397350637574, 0.1389862255584142, 0.381284204170116], [45.7247495560521, 0.24041662778242495, 0.25000000000000006], [62.307211737009226, 0.327080722972655, 0.29993757980385405]], "peak_params_": [[11.411853865193233, 0.12991512871429833, 3.2450377799632646], [19.645333976848473, 0.5323346826697684, 4.765878563403416], [22.743124804684612, 0.4298046934979478, 0.5000000000000001], [23.756432909450773, 0.33278610525518815, 0.5000000000000001], [25.509245285207935, 0.3278027722538823, 1.798423824421265], [27.768829361956175, 0.2760940756429022, 0.5088684146119454], [29.27018956694579, 0.22556878511135814, 0.5908615032330009], [37.486397350637574, 0.13889780505949467, 0.762568408340232], [45.7247495560521, 0.16049687369625687, 0.5000000000000001], [62.307211737009226, 0.266037151826902, 0.5998751596077081]], "r_squared_": 0.9616301633917986, "error_": 0.04198733238430515}
{"freq_range": [2.0, 80.0], "freq_res": 0.5, "aperiodic_params_": [-7.715583646014638, 0.7572097662345663], "gaussian_params_": [[6.853127744945388, 0.16161301470754943, 0.5107904975369761], [18.16537623502184, 0.385730415398105, 5.126677177164272], [26.968342205845715, 0.17545139617512304, 0.4454681034244956], [30.126156337399873, 0.1341545715206108, 1.2950490577184413], [33.81512778446714, 0.22266374172089223, 0.6613051719998233], [39.10055370937445, 0.13467208207678083, 1.454711238886795], [53.267105213448346, 0.1327110671852621, 1.4515528505839872], [66.60828638725157, 0.21893761142461668, 0.25000000000000006], [70.66140773682949, 0.19369625610399047, 0.25000000000000006], [76.34933657552538, 0.202315679039608, 0.44139393600416915]], "peak_params_": [[6.853127744945388, 0.19106829868682418, 1.0215809950739523], [18.16537623502184, 0.385529776481663, 10.253354354328543], [26.968342205845715, 0.26967580402473423, 0.8909362068489912], [30.126156337399873, 0.1603810157978316, 2.5900981154368825], [33.81512778446714, 0.2192200998110252, 1.3226103439996466], [39.10055370937445, 0.1344507199263596, 2.90942247777359], [53.267105213448346, 0.13101384386600756, 2.9031057011679744], [66.60828638725157, 0.19933349505184061, 0.5000000000000001], [70.66140773682949, 0.15725545450836442, 0.5000000000000001], [76.34933657552538, 0.1908665093383597, 0.8827878720083383]], "r_squared_": 0.9707282403832926, "error_": 0.04507870209151697}
{"freq_range": [2.0, 80.0], "freq_res": 0.5, "aperiodic_params_": [-7.787579922978685, 0.9855513156884322], "gaussian_params_": [[8.364134985292754, 0.14402893442107162, 1.0372619092155155], [9.982140751138786, 0.18359956522104146, 0.28777776387901527], [14.612447491317397, 0.2216769617594425, 0.25000000000000006], [19.161613277621775, 0.7498406368667699, 5.649393219664621]], "peak_params_": [[8.364134985292754, 0.2691511114595375, 2.074523818431031], [9.982140751138786, 0.4260977738930638, 0.5755555277580305], [14.612447491317397, 0.73383021513885, 0.5000000000000001], [19.161613277621775, 0.749533875549357, 11.298786439329241]], "r_squared_": 0.9761274691539635, "error_": 0.06329410019845358}
{"freq_range": [2.0, 80.0], "freq_res": 0.5, "aperiodic_params_": [-7.458625014566539, 1.2191080292345189], "gaussian_params_": [[9.563010520298546, 0.2535981079895377, 1.4212361595422929], [17.83189425534947, 1.0718808649554914, 3.913489821405163], [25.248135964455898, 0.5810917695345308, 3.2030191239592494], [30.084031614716025, 0.2371011043920247, 1.2062364207643066], [31.67739347794722, 0.2477525579656727, 0.4207556226409921], [34.044032352604425, 0.3195802620352135, 0.8243986576672714], [36.965382406406086, 0.2750297042157219, 1.0316030525429636], [42.70213145138553, 0.15717585364308057, 2.6799372515699016]], "peak_params_": [[9.563010520298546, 0.364494329916095, 2.8424723190845858], [17.83189425534947, 1.1157967240062217, 7.826979642810326], [25.248135964455898, 0.7796637251626795, 6.406038247918499], [30.084031614716025, 0.438483749253999, 2.412472841528613], [31.67739347794722, 0.43738239623065134, 0.8415112452819842], [34.044032352604425, 0.33968008917702974, 1.6487973153345428], [36.965382406406086, 0.29243414755483244, 2.063206105085927], [42.70213145138553, 0.15672986867233618, 5.359874503139803]], "r_squared_": 0.9883000397736087, "error_": 0.05527486756844229}
{"freq_range": [2.0, 80.0], "freq_res": 0.5, "aperiodic_params_": [-7.476418972353187, 1.234487026739109], "gaussian_params_": [[9.749262099784561, 0.21521283469926303, 1.0943652339522172], [19.749095418400273, 0.9301472817855194, 4.567527673929566], [25.3311081019023, 0.24246451783802753, 0.9279211198437662], [28.721156071011226, 0.4038888448626944, 1.7290672252234776], [31.80161003525366, 0.2861468391777098, 0.25000000000000006], [33.562149943935296, 0.1550714650773986, 0.30163279757635064], [35.28684773419898, 0.11576629227381872, 0.25000000000000006], [37.275542418216396, 0.18722955334066033, 3.253826048609041]], "peak_params_": [[9.749262099784561, 0.28472475476456793, 2.1887304679044344], [19.749095418400273, 0.9287654230676807, 9.135055347859131], [25.3311081019023, 0.7310020992722812, 1.8558422396875325], [28.721156071011226, 0.5546561002076622, 3.458134450446955], [31.80161003525366, 0.35154004836680386, 0.5000000000000001], [33.562149943935296, 0.266187489665624, 0.6032655951527013], [35.28684773419898, 0.24443705280719463, 0.5000000000000001], [37.275542418216396, 0.18727412267754673, 6.507652097218082]], "r_squared_": 0.9903634587656672, "error_": 0.04650447761465777}
{"freq_range": [2.0, 80.0], "freq_res": 0.5, "aperiodic_params_": [-7.4453595364906695, 1.2199817521234262], "gaussian_params_": [[14.101709751015015, 0.3481517124343132, 3.687765123811367], [23.465929558567133, 0.7704999304282701, 5.967232832044389], [28.069151425084332, 0.23629629870441365, 0.7840720855423899], [35.534771046472066, 0.14663293700857175, 0.37411697222707624], [39.0473423979796, 0.10809061537245125, 1.4546245183135247]], "peak_params_": [[14.101709751015015, 0.5669679179846607, 7.375530247622734], [23.465929558567133, 0.7840212839043783, 11.934465664088778], [28.069151425084332, 0.8129705842918824, 1.5681441710847799], [35.534771046472066, 0.2523648961476219, 0.7482339444541525], [39.0473423979796, 0.13404752499183736, 2.9092490366270494]], "r_squared_": 0.9886205519189911, "error_": 0.04958747137435651}
{"freq_range": [2.0, 80.0], "freq_res": 0.5, "aperiodic_params_": [-7.732059666447348, 1.101802465018041], "gaussian_params_": [[8.958906342271982, 0.1917919717154749, 0.3898749020339781], [12.252029621083855, 0.27198321705815254, 2.3701466524035224], [21.176401619880615, 0.8711952973474681, 4.542838678346153], [29.85083913725463, 0.38339346892311765, 3.187396058449325], [33.12242378324129, 0.17022298177586653, 0.25000000000000006], [34.130762341846506, 0.11830821063727133, 0.2500000000001878], [35.64247475564328, 0.2743963101452147, 0.572812177893136], [37.115926401344254, 0.19208475439296913, 0.25000000000000006], [39.363821262791305, 0.17739777913547985, 0.692433836239096], [42.47364394097795, 0.14724213918475176, 0.7901781057597049]], "peak_params_": [[8.958906342271982, 0.32082775977712963, 0.7797498040679562], [12.252029621083855, 0.41110926961627925, 4.740293304807045], [21.176401619880615, 0.8789530077338128, 9.085677356692306], [29.85083913725463, 0.5150770609700324, 6.37479211689865], [33.12242378324129, 0.41578450988067317, 0.5000000000000001], [34.130762341846506, 0.28856858100270166, 0.5000000000003756], [35.64247475564328, 0.35179813818106354, 1.145624355786272], [37.115926401344254, 0.22258661134695146, 0.5000000000000001], [39.363821262791305, 0.17830221437911753, 1.384867672478192], [42.47364394097795, 0.14732661691483884, 1.5803562115194099]], "r_squared_": 0.9867207615113163, "error_": 0.05080491863964112}
{"freq_range": [2.0, 80.0], "freq_res": 0.5, "aperiodic_params_": [-7.639095013619821, 1.1133698866470823], "gaussian_params_": [[11.83969095440344, 0.5036246078014024, 2.289270369967295], [19.555826486285774, 0.9320303507766576, 3.378891940494913], [27.61293197807811, 0.6127240769949667, 4.00233968622121], [35.54946106187248, 0.17069127124072025, 0.5027460201352743], [39.14389620094389, 0.10545652980072054, 5.277212860517628]], "peak_params_": [[11.83969095440344, 0.5791812259720057, 4.57854073993459], [19.555826486285774, 1.0123996087883267, 6.757783880989826], [27.61293197807811, 0.680486835911033, 8.00467937244242], [35.54946106187248, 0.3408741113164204, 1.0054920402705485], [39.14389620094389, 0.1161213085391335, 10.554425721035257]], "r_squared_": 0.9877559788443828, "error_": 0.05384954133404846}
{"freq_range": [2.0, 80.0], "freq_res": 0.5, "aperiodic_params_": [-7.783116665537983, 0.9567506910366458], "gaussian_params_": [[10.949533022948032, 0.36568779448153876, 2.031227255479477], [19.58437217930726, 0.8726553859422719, 3.655799693265667], [26.613233220583005, 0.3456354095311301, 1.7294794146575496], [29.934895201499696, 0.3194113067484137, 1.0078921389668474], [33.02410187547462, 0.21923032474782023, 0.8977535109570323], [35.617212552490486, 0.21576813344531845, 0.4377631426829217], [77.31022852733838, 0.17065543205375325, 1.197118890306118]], "peak_params_": [[10.949533022948032, 0.42097787769296247, 4.062454510958954], [19.58437217930726, 0.872548258127587, 7.311599386531334], [26.613233220583005, 0.4916650227610191, 3.4589588293150992], [29.934895201499696, 0.38537757695383235, 2.0157842779336947], [33.02410187547462, 0.2237022001695923, 1.7955070219140645], [35.617212552490486, 0.21312816181076677, 0.8755262853658434], [77.31022852733838, 0.16852458713532315, 2.394237780612236]], "r_squared_": 0.9835399566480163, "error_": 0.04837554487134192}
{"freq_range": [2.0, 80.0], "freq_res": 0.5, "aperiodic_params_": [-8.087689108956592, 0.5637352054032997], "gaussian_params_": [[10.036567435903958, 0.19141484584906884, 1.217167972671317], [19.70431055820758, 0.38649104544784274, 4.386338332409035], [25.787454841149785, 0.14498962167562635, 0.5500195684636139], [30.509011699318915, 0.1429826780221422, 2.0583032428413155], [35.63264012159487, 0.20957270147189527, 0.30565224281066955], [43.107500799771834, 0.24617674763175137, 0.34160205633749197], [44.21403694640604, 0.29948196083022854, 0.25000000000000006], [51.78901535554732, 0.1801094843762017, 0.30180588023288407], [57.10241720480251, 0.12297416288631376, 0.7652496931031503], [70.52459453784385, 0.1832611235704089, 0.3983607910216156], [76.65364194825626, 0.16477893228018461, 1.5302977887082714]], "peak_params_": [[10.036567435903958, 0.22476885989776996, 2.434335945342634], [19.70431055820758, 0.38607209726770897, 8.77267666481807], [25.787454841149785, 0.28551138012166, 1.1000391369272278], [30.509011699318915, 0.16167782296582622, 4.116606485682631], [35.63264012159487, 0.19889046673566746, 0.6113044856213391], [43.107500799771834, 0.23428630688773922, 0.6832041126749839], [44.21403694640604, 0.21569805402602782, 0.5000000000000001], [51.78901535554732, 0.14106385817905398, 0.6036117604657681], [57.10241720480251, 0.12187773495700682, 1.5304993862063005], [70.52459453784385, 0.18296295397663975, 0.7967215820432312], [76.65364194825626, 0.16395052211746552, 3.0605955774165428]], "r_squared_": 0.9449864662682657, "error_": 0.04310361303404119}
{"freq_range": [2.0, 80.0], "freq_res": 0.5, "aperiodic_params_": [-7.521980461762445, 0.8300359658063347], "gaussian_params_": [[9.157445415764322, 0.20192069525038026, 1.946386758689201], [15.9951726849435, 0.3039468008206066, 2.5632872694827964], [17.59163191141937, 0.1430617945605784, 0.8766070682573318], [18.3292757528049, 0.24563193528223534, 0.2500000000008379], [19.943581188796188, 0.14457927163405676, 0.36429812197514555], [22.063973064755423, 0.164383833351771, 2.049831060771694], [28.685482225358577, 0.1506872020137459, 0.7748801484632575], [30.527679828831925, 0.16584541574753475, 0.5483655157580497], [34.544359751098064, 0.215845080556347, 0.5315808496355776], [54.5843784239519, 0.1845897285733726, 0.31215456497162675], [61.555894054517935, 0.1418836393728728, 0.7721540813041717], [63.47504438336299, 0.1374893369870636, 0.3371449881064048], [68.08061770831155, 0.1215641009522967, 0.25000000000000006], [72.89271114594109, 0.0951278710184536, 0.25000000000000006], [74.16473631682553, 0.09845683587189753, 0.25000000000000006], [76.29058693523828, 0.10142735378549636, 5.999999998780614]], "peak_params_": [[9.157445415764322, 0.20859993601067472, 3.892773517378402], [15.9951726849435, 0.33395318745103886, 5.126574538965593], [17.59163191141937, 0.4129232045568205, 1.7532141365146636], [18.3292757528049, 0.5030485471205566, 0.5000000000016758], [19.943581188796188, 0.3348444769322967, 0.7285962439502911], [22.063973064755423, 0.1838528211038728, 4.099662121543388], [28.685482225358577, 0.14780059292035475, 1.549760296926515], [30.527679828831925, 0.17538200454037067, 1.0967310315160994], [34.544359751098064, 0.21509484977049453, 1.0631616992711552], [54.5843784239519, 0.1781063765107085, 0.6243091299432535], [61.555894054517935, 0.14637216307172274, 1.5443081626083435], [63.47504438336299, 0.15353086649122005, 0.6742899762128096], [68.08061770831155, 0.15444970069130548, 0.5000000000000001], [72.89271114594109, 0.1740263964426081, 0.5000000000000001], [74.16473631682553, 0.17354682704605118, 0.5000000000000001], [76.29058693523828, 0.1013655951217558, 11.999999997561227]], "r_squared_": 0.9783178458308939, "error_": 0.039546909114568755}
{"freq_range": [2.0, 80.0], "freq_res": 0.5, "aperiodic_params_": [-7.354905705378915, 1.1159055242774996], "gaussian_params_": [[8.158992637490854, 0.1703467856877397, 1.491548187087813], [11.341188551632083, 0.22353464212169605, 2.1314621427623583], [14.524503463888935, 0.15159077611248717, 0.25000405821740584], [17.645529726913754, 0.5978959216445119, 3.159563106653888], [24.529955121562637, 0.2596566307498344, 1.6386053443729995], [28.50094492808888, 0.1980529664214251, 0.8706740337068293], [30.63369828576867, 0.27739824871234486, 0.5805491837696102], [34.39135800371469, 0.23544586466303222, 0.6498839138615474], [39.708396038237936, 0.16280683683362346, 0.4168972596429484], [54.660462713661545, 0.17916969154842868, 0.25000000000000006], [73.848271876785, 0.09151446343385079, 2.812706689773647], [78.87834972916633, 0.24218303080594697, 0.2871713432510842]], "peak_params_": [[8.158992637490854, 0.24047067858697702, 2.983096374175626], [11.341188551632083, 0.3269554361120832, 4.262924285524717], [14.524503463888935, 0.5896834673227556, 0.5000081164348117], [17.645529726913754, 0.6007266607778785, 6.319126213307776], [24.529955121562637, 0.3164555460759644, 3.277210688745999], [28.50094492808888, 0.21380783658961988, 1.7413480674136586], [30.63369828576867, 0.2848245453572069, 1.1610983675392204], [34.39135800371469, 0.23217922421113002, 1.2997678277230948], [39.708396038237936, 0.14368559078828724, 0.8337945192858968], [54.660462713661545, 0.14581622478397271, 0.5000000000000001], [73.848271876785, 0.09138140968431685, 5.625413379547294], [78.87834972916633, 0.23850043330855186, 0.5743426865021684]], "r_squared_": 0.9885164325749963, "error_": 0.04218493075087454}
{"freq_range": [2.0, 80.0], "freq_res": 0.5, "aperiodic_params_": [-7.258345642557022, 1.3353097818152597], "gaussian_params_": [[9.485581183570968, 0.2395142260727826, 1.7543466151349656], [14.475797814427652, 0.2019423157538094, 0.3669865042710945], [17.633432957873833, 0.6584433721506975, 4.047741965878864], [26.505481671609342, 0.34809983634950703, 5.999999998135316], [36.722146272517335, 0.12649871056987333, 0.369432551435389], [42.01744224464726, 0.13687236035741396, 0.7207874995830346]], "peak_params_": [[9.485581183570968, 0.3332290675338818, 3.508693230269931], [14.475797814427652, 0.7405250409457782, 0.733973008542189], [17.633432957873833, 0.7709494081699546, 8.095483931757729], [26.505481671609342, 0.40788379155441845, 11.999999996270631], [36.722146272517335, 0.1925213327112587, 0.738865102870778], [42.01744224464726, 0.149236603956453, 1.4415749991660691]], "r_squared_": 0.9904164174714911, "error_": 0.04839546423539685}
{"freq_range": [2.0, 80.0], "freq_res": 0.5, "aperiodic_params_": [-7.310583161046614, 1.32169099336834], "gaussian_params_": [[11.217165958731227, 0.32872951872247624, 2.7243127688665343], [16.370180754494204, 0.16988774795929765, 0.8455978516477587], [19.32125750365673, 0.318117247307491, 0.6416430606299228], [22.13847646843902, 0.18699573631378638, 0.25000000000000006], [25.187384312499436, 0.5625421523094868, 5.903508323172085]], "peak_params_": [[11.217165958731227, 0.35902223477437545, 5.448625537733069], [16.370180754494204, 0.40858385921407603, 1.6911957032955174], [19.32125750365673, 0.6631080257629538, 1.2832861212598456], [22.13847646843902, 0.6468291065944722, 0.5000000000000001], [25.187384312499436, 0.5622597519884014, 11.80701664634417]], "r_squared_": 0.9876365155914014, "error_": 0.049722585468322436}
{"freq_range": [2.0, 80.0], "freq_res": 0.5, "aperiodic_params_": [-7.454437593128976, 1.2731470123059125], "gaussian_params_": [[10.925837165636233, 0.3241202833058926, 2.709406334175976], [20.784133772898464, 0.6780498513717178, 4.282281431048452], [28.106799288314793, 0.47247087324160775, 2.331500336613121], [31.567911855789614, 0.16378536340103658, 1.0395288790307018], [34.87777619633179, 0.19760488142486274, 1.4402073428873277], [42.84081060098101, 0.10563114737998165, 1.2343621502074682]], "peak_params_": [[10.925837165636233, 0.3738518235231467, 5.418812668351952], [20.784133772898464, 0.6820487115983074, 8.564562862096905], [28.106799288314793, 0.6363741306705801, 4.663000673226242], [31.567911855789614, 0.36952507057039874, 2.0790577580614036], [34.87777619633179, 0.20631481223958303, 2.8804146857746553], [42.84081060098101, 0.104757359583596, 2.4687243004149364]], "r_squared_": 0.9876151230391786, "error_": 0.051048849876734456}
{"freq_range": [2.0, 80.0], "freq_res": 0.5, "aperiodic_params_": [-7.521443264722911, 1.198552757634081], "gaussian_params_": [[10.767498902233584, 0.33672840262644826, 2.172623424339787], [19.8602343852233, 0.7162918765551021, 4.408385641198464], [24.948512040181726, 0.1740036040452435, 0.48257502705838273], [27.582909370578747, 0.3299607969781894, 1.567323401427023], [31.19819839312658, 0.2826328391226586, 3.48600519650797], [41.86659598918728, 0.11691504905091493, 0.9556911306760183]], "peak_params_": [[10.767498902233584, 0.4298479973686682, 4.345246848679574], [19.8602343852233, 0.7175986153830785, 8.816771282396928], [24.948512040181726, 0.6790624855801521, 0.9651500541167655], [27.582909370578747, 0.6500647162958764, 3.134646802854046], [31.19819839312658, 0.34222735535840876, 6.97201039301594], [41.86659598918728, 0.11810824102453665, 1.9113822613520366]], "r_squared_": 0.9890340629519517, "error_": 0.04798718343639233}
{"freq_range": [2.0, 80.0], "freq_res": 0.5, "aperiodic_params_": [-7.646353960795242, 0.932585567229952], "gaussian_params_": [[8.268178444855057, 0.1879125829570656, 0.3738741636989217], [10.514956695296776, 0.3651716184261153, 1.3658089028889766], [15.984608310022859, 0.4333426851734607, 2.323477952424405], [21.210047458571594, 0.4157583879784261, 2.8704912519940313], [25.23357221785725, 0.21522861424192966, 0.5394564849875009], [27.07494077187774, 0.270286103402166, 0.6551461759232855], [29.655809484336586, 0.2529685768654801, 1.1059733311325926], [31.574474201818326, 0.1602708720209433, 0.25000000000000006], [33.00007950090248, 0.16602219056030543, 0.6547080950244212], [56.19964723751108, 0.18667663680020571, 0.25000000000000006], [62.276661398578604, 0.21007761209321144, 0.25000000000000006], [73.65997396079972, 0.11561662030279861, 0.9804439620835499], [76.6481186112503, 0.16389437575737598, 0.25000000000000006], [78.16723186192645, 0.23931824679837246, 0.338033917915027]], "peak_params_": [[8.268178444855057, 0.2804849733711645, 0.7477483273978434], [10.514956695296776, 0.3922667208734385, 2.731617805777953], [15.984608310022859, 0.5135199759844333, 4.64695590484881], [21.210047458571594, 0.4568212401421672, 5.740982503988063], [25.23357221785725, 0.37193468740185764, 1.0789129699750017], [27.07494077187774, 0.3380664404589986, 1.310292351846571], [29.655809484336586, 0.2571797294563485, 2.211946662265185], [31.574474201818326, 0.22900966928603772, 0.5000000000000001], [33.00007950090248, 0.16872868516731998, 1.3094161900488424], [56.19964723751108, 0.13570803132423137, 0.5000000000000001], [62.276661398578604, 0.1409543383944829, 0.5000000000000001], [73.65997396079972, 0.11408780157497311, 1.9608879241670998], [76.6481186112503, 0.13925477767865857, 0.5000000000000001], [78.16723186192645, 0.21175954563440058, 0.676067835830054]], "r_squared_": 0.9844062915702961, "error_": 0.04050002405500803}
{"freq_range": [2.0, 80.0], "freq_res": 0.5, "aperiodic_params_": [-7.777006911527828, 0.6103445028118802], "gaussian_params_": [[10.290311689308817, 0.2501177463259409, 1.2642543816599163], [16.443928388422112, 0.3309136469893237, 1.9636612669160234], [19.213581309812607, 0.18700965227024935, 0.25000000000000006], [20.910169483022724, 0.1631687434189416, 0.505183739333326], [22.595306543087226, 0.34710903938928145, 0.7484220460638887], [25.286885582325052, 0.16698016073044494, 0.7500959771386759], [30.32050705565186, 0.09428029681545066, 1.2879854574328853], [31.423323235935115, 0.05846655005221172, 0.25000000000000006], [35.62022368219426, 0.15544952853389676, 0.25000000000000006], [43.108941792943895, 0.18723769532840798, 0.25000000000000006], [44.18737540498171, 0.1749835914574203, 0.25000000000000006], [52.153118783971195, 0.0810234600260379, 1.2742729435291722], [54.75342298522876, 0.19016213658249984, 0.25000000002875605], [56.903654102792906, 0.19076582051649196, 0.6357762897864196], [70.59488324565255, 0.2111493754516583, 0.3188542551499724], [72.94425782280108, 0.15946529210893065, 0.3578717895467542], [74.52695604517051, 0.14665920900209212, 0.27784757425650364], [76.76421396472246, 0.15966518390534254, 0.525936507815537], [78.16759864123392, 0.3077532466936342, 0.25000000000000006]], "peak_params_": [[10.290311689308817, 0.2500902622180803, 2.5285087633198327], [16.443928388422112, 0.3307802100478625, 3.9273225338320468], [19.213581309812607, 0.27179630818572953, 0.5000000000000001], [20.910169483022724, 0.2188322314955471, 1.010367478666652], [22.595306543087226, 0.34847408575521044, 1.4968440921277775], [25.286885582325052, 0.16065452068091624, 1.5001919542773519], [30.32050705565186, 0.09343303203396225, 2.5759709148657706], [31.423323235935115, 0.11776938204197762, 0.5000000000000001], [35.62022368219426, 0.1385042252192097, 0.5000000000000001], [43.108941792943895, 0.1702802109549495, 0.5000000000000001], [44.18737540498171, 0.132460352010062, 0.5000000000000001], [52.153118783971195, 0.08044062441957855, 2.5485458870583444], [54.75342298522876, 0.1257543334270057, 0.5000000000575121], [56.903654102792906, 0.18864640045222814, 1.2715525795728393], [70.59488324565255, 0.2020045466524305, 0.6377085102999448], [72.94425782280108, 0.15754260561466538, 0.7157435790935084], [74.52695604517051, 0.1459982718593107, 0.5556951485130073], [76.76421396472246, 0.14440534687130935, 1.051873015631074], [78.16759864123392, 0.25591644521763257, 0.5000000000000001]], "r_squared_": 0.9685136527370098, "error_": 0.03245931538527557}
{"freq_range": [2.0, 80.0], "freq_res": 0.5, "aperiodic_params_": [-7.376566869470162, 1.0573064825461829], "gaussian_params_": [[8.074888372514359, 0.22621041652814625, 1.9551290572979168], [10.95072934322934, 0.11115207926583782, 0.2725513288715418], [13.051365099751424, 0.16870047399488802, 0.8356007944822097], [16.05208206120434, 0.10761512919049428, 0.2500000000000095], [18.439487299575134, 0.261927394291364, 2.450306998391407], [23.494016494782244, 0.09662380676077698, 0.25000000513848897], [36.68329472706527, 0.14084645137348714, 0.4807930315921072], [41.93882365016922, 0.13018860867431273, 0.6945925477111821], [65.95153476810827, 0.16491607281365747, 0.2931010186460157], [74.10385224053636, 0.21164281206545474, 0.2753320012779024], [79.0509151166501, 0.09633155116684665, 1.2482166480097783]], "peak_params_": [[8.074888372514359, 0.22607449898711351, 3.9102581145958335], [10.95072934322934, 0.1941145297924649, 0.5451026577430836], [13.051365099751424, 0.20014441834405083, 1.6712015889644194], [16.05208206120434, 0.2652682260879775, 0.500000000000019], [18.439487299575134, 0.2618476845596067, 4.900613996782814], [23.494016494782244, 0.12764073748310523, 0.5000000102769779], [36.68329472706527, 0.13097422624688804, 0.9615860631842144], [41.93882365016922, 0.12968463492735438, 1.3891850954223641], [65.95153476810827, 0.16267686853743513, 0.5862020372920314], [74.10385224053636, 0.1971372414319763, 0.5506640025558048], [79.0509151166501, 0.09625144398284391, 2.4964332960195565]], "r_squared_": 0.9844088553644647, "error_": 0.04161197666703725}
{"freq_range": [2.0, 80.0], "freq_res": 0.5, "aperiodic_params_": [-7.1215113828010725, 1.1213486220870514], "gaussian_params_": [[5.3275828873800695, 0.2569459181221134, 0.397299635640438], [6.624367064683143, 0.1958892237962507, 0.2500000020699139], [7.801168874454402, 0.2650411095334401, 0.7320271627951042], [9.43367318982981, 0.19979189306758588, 0.25000000000000006], [12.936343250002118, 0.2948610721927385, 2.7240454169090693], [18.371247506430258, 0.3425130575155748, 1.5901662034368649], [21.492108304494774, 0.2755589186303334, 0.4052023450792236], [23.920192575424153, 0.19345249259890865, 0.8906564269471401], [27.833271253349572, 0.1846725222930394, 0.5593892784828288], [29.810991115554206, 0.24685163314959738, 0.25000000000262973], [30.885655682992883, 0.14308452861939155, 0.33668385986588445], [34.41778337993778, 0.15549165632641976, 0.8797348452193648], [42.933738973900326, 0.12294270731921775, 0.25000000000000006], [54.47439558737708, 0.12859551279740655, 0.3563592535757126], [69.29395300708124, 0.1091058470761388, 0.7678281276918755], [73.95311607811631, 0.12147618975916523, 0.8500881431581474], [76.1569463768991, 0.14312112204433267, 0.39954747124664897], [78.82212635597624, 0.2071141208374864, 0.2643815233359701]], "peak_params_": [[5.3275828873800695, 0.2428588096583928, 0.794599271280876], [6.624367064683143, 0.249085105914566, 0.5000000041398278], [7.801168874454402, 0.3125299280016334, 1.4640543255902083], [9.43367318982981, 0.34388658526277105, 0.5000000000000001], [12.936343250002118, 0.29592119946015494, 5.448090833818139], [18.371247506430258, 0.37801807255053355, 3.1803324068737298], [21.492108304494774, 0.33186976733634665, 0.8104046901584472], [23.920192575424153, 0.1934061036603527, 1.7813128538942802], [27.833271253349572, 0.17665462423306977, 1.1187785569656576], [29.810991115554206, 0.19008881194341853, 0.5000000000052595], [30.885655682992883, 0.13515131231091715, 0.6733677197317689], [34.41778337993778, 0.1548141009414401, 1.7594696904387297], [42.933738973900326, 0.11869940204432616, 0.5000000000000001], [54.47439558737708, 0.1282640086317084, 0.7127185071514252], [69.29395300708124, 0.10524740146357559, 1.535656255383751], [73.95311607811631, 0.12129164953826965, 1.7001762863162948], [76.1569463768991, 0.13918609996802722, 0.7990949424932979], [78.82212635597624, 0.16516512958626706, 0.5287630466719402]], "r_squared_": 0.9905400740145952, "error_": 0.03538544009166058}
{"freq_range": [2.0, 80.0], "freq_res": 0.5, "aperiodic_params_": [-6.89549920810686, 1.4013216962529], "gaussian_params_": [[7.497221609948392, 0.14397409995935248, 1.4576079642963549], [13.019407608849875, 0.37425696197316394, 2.7863919359031293], [19.49325619143396, 0.4225958105838548, 2.6191235231407086], [23.46378449425342, 0.25354153362093246, 0.44254017873782975], [24.881755407613593, 0.2377377351381201, 0.4542959285012766], [27.71051834716904, 0.19651908796714712, 0.8556121055154012], [30.13043858225878, 0.22484778310405887, 0.25000000000000006], [33.996069193372534, 0.14184687661291437, 5.999999962974569], [77.92739008554597, 0.15857277002924347, 0.3209499981628209]], "peak_params_": [[7.497221609948392, 0.19661260858873408, 2.9152159285927097], [13.019407608849875, 0.39423039351156675, 5.572783871806259], [19.49325619143396, 0.4552906221180102, 5.238247046281417], [23.46378449425342, 0.4171935960380626, 0.8850803574756595], [24.881755407613593, 0.3242115385733051, 0.9085918570025532], [27.71051834716904, 0.27354740626926777, 1.7112242110308025], [30.13043858225878, 0.31547922194828715, 0.5000000000000001], [33.996069193372534, 0.1418469382749592, 11.999999925949139], [77.92739008554597, 0.15456622018675503, 0.6418999963256418]], "r_squared_": 0.9891799026725002, "error_": 0.04988517973229939}
{"freq_range": [2.0, 80.0], "freq_res": 0.5, "aperiodic_params_": [-6.887318740360037, 1.4262395282623506], "gaussian_params_": [[11.612730899931261, 0.29610889313706484, 2.3115689764740748], [18.760349427821858, 0.39192956758444975, 3.863602408670565], [28.13658838487026, 0.26634474597507973, 5.176485400617927], [39.61032709425461, 0.11295805715560915, 1.4260710739746947], [42.01978271320109, 0.11132601980281105, 0.25000000000000006], [47.21115720324616, 0.140908260429177, 0.4281527279350963]], "peak_params_": [[11.612730899931261, 0.36433015318202067, 4.6231379529481496], [18.760349427821858, 0.4490705870035612, 7.72720481734113], [28.13658838487026, 0.2887076803073878, 10.352970801235854], [39.61032709425461, 0.13655578720305606, 2.8521421479493894], [42.01978271320109, 0.14610047412957528, 0.5000000000000001], [47.21115720324616, 0.12512127526649586, 0.8563054558701926]], "r_squared_": 0.9910711919590881, "error_": 0.04282243288160673}
{"freq_range": [2.0, 80.0], "freq_res": 0.5, "aperiodic_params_": [-7.045763140233074, 1.2851363462356178], "gaussian_params_": [[10.240520252578545, 0.23629095809434397, 0.2500000000000199], [11.529029095532765, 0.23131920480534304, 0.611891581859384], [17.134750919250486, 0.3918026339694395, 4.5107736769842806], [20.460096590415453, 0.14296784593593787, 0.5297848396323849], [22.623518482304846, 0.25446520610205803, 0.5240748005937773], [24.41750081409021, 0.1929686255609804, 0.47174732810287956], [26.17098516057892, 0.24488429045296764, 0.7014231606074972], [27.701959985748545, 0.29600115376821357, 0.250000000000001], [28.785697206703656, 0.23862422743038647, 0.25001073862881124], [29.801324304597536, 0.25487984808737485, 0.2500620700453803], [30.954923340490502, 0.18290058503220413, 0.28956337603842686], [33.18094211908983, 0.17527413604467346, 0.6765406236361978], [34.517226845446956, 0.1153257810825356, 0.25000000000000006], [35.983915696461615, 0.12894467411193655, 0.4655034119069301], [38.48706036903093, 0.24270040082075278, 0.684511473938374], [41.290403696990765, 0.19059662228304552, 0.867929856627514], [79.4909091553876, 0.12631521752101116, 0.26839404278960866]], "peak_params_": [[10.240520252578545, 0.27109349002075156, 0.5000000000000397], [11.529029095532765, 0.410624842039387, 1.223783163718768], [17.134750919250486, 0.3916278499703054, 9.021547353968561], [20.460096590415453, 0.4392560927403757, 1.0595696792647697], [22.623518482304846, 0.440765640307351, 1.0481496011875546], [24.41750081409021, 0.30810882598411204, 0.9434946562057591], [26.17098516057892, 0.2952058617506914, 1.4028463212149944], [27.701959985748545, 0.2822276418393521, 0.500000000000002], [28.785697206703656, 0.17915262760116235, 0.5000214772576225], [29.801324304597536, 0.1934025866014668, 0.5001241400907606], [30.954923340490502, 0.18514971725955576, 0.5791267520768537], [33.18094211908983, 0.16992308637390607, 1.3530812472723956], [34.517226845446956, 0.14228824432211162, 0.5000000000000001], [35.983915696461615, 0.12928980557221337, 0.9310068238138602], [38.48706036903093, 0.2437478356127052, 1.369022947876748], [41.290403696990765, 0.18513456733893463, 1.735859713255028], [79.4909091553876, 0.1262427799553425, 0.5367880855792173]], "r_squared_": 0.9914203550877042, "error_": 0.03541660854903511}
{"freq_range": [2.0, 80.0], "freq_res": 0.5, "aperiodic_params_": [-7.252259746153258, 1.1006539746419712], "gaussian_params_": [[10.016608482490911, 0.22736330377212038, 1.847333931639879], [17.31697024081116, 0.3798837542216746, 2.75784350717674], [20.885833367864965, 0.1368300563481041, 0.4522024880161175], [22.423168712934697, 0.28296392681600535, 0.4809476245526597], [24.769744084717573, 0.12542788461811144, 1.3556910319112527], [27.495240198325863, 0.14052222490323615, 0.25000000000000006], [29.60210277334427, 0.1701162080599432, 0.7421002978480332], [32.91099233138969, 0.1344404335871594, 0.6262466476079087], [36.78001643000231, 0.09696655735085838, 0.7830216145384008], [38.509205096575805, 0.1273615724829417, 0.4318981140036183], [41.426247412934494, 0.11723359207855101, 0.5181488093743658], [54.6458813145548, 0.18583256874436865, 0.28583725532597803], [62.42040355762871, 0.11709942587648577, 0.3655912971593285], [64.88588712314754, 0.16061587169726438, 0.25000000000000006], [66.38104504815867, 0.13033943364260783, 0.25000000000000006], [73.53293864911828, 0.12320564299627247, 0.6827816588287293], [74.62903138816927, 0.09854797814571534, 0.25000000000000006], [76.79361534577241, 0.21011208239805185, 0.36617256981074797]], "peak_params_": [[10.016608482490911, 0.23860295510941576, 3.694667863279758], [17.31697024081116, 0.37911027028330757, 5.51568701435348], [20.885833367864965, 0.29444470380699883, 0.904404976032235], [22.423168712934697, 0.3754572698287362, 0.9618952491053194], [24.769744084717573, 0.13147235134824875, 2.7113820638225055], [27.495240198325863, 0.1604987353245111, 0.5000000000000001], [29.60210277334427, 0.16882062499120565, 1.4842005956960664], [32.91099233138969, 0.13309502809032914, 1.2524932952158174], [36.78001643000231, 0.09349853537993447, 1.5660432290768016], [38.509205096575805, 0.13601981482113423, 0.8637962280072367], [41.426247412934494, 0.11605199543354949, 1.0362976187487316], [54.6458813145548, 0.16314019329237084, 0.5716745106519561], [62.42040355762871, 0.11435669019194883, 0.731182594318657], [64.88588712314754, 0.14472593458764216, 0.5000000000000001], [66.38104504815867, 0.11638920987681267, 0.5000000000000001], [73.53293864911828, 0.1230660311275038, 1.3655633176574586], [74.62903138816927, 0.1314463342707466, 0.5000000000000001], [76.79361534577241, 0.17925426801092392, 0.7323451396214959]], "r_squared_": 0.9890508046532641, "error_": 0.03273792851208263}
{"freq_range": [2.0, 80.0], "freq_res": 0.5, "aperiodic_params_": [-7.454779952149961, 1.0240011568130127], "gaussian_params_": [[9.058338996454157, 0.22667386273664455, 1.387007656332941], [13.271219857153895, 0.1193831887729049, 0.790821942578784], [15.576348066989585, 0.11945235787732643, 0.43736691075194456], [18.735474375895482, 0.3065161442547238, 3.6685949557169724], [24.593229650548885, 0.08198894122629063, 0.6125021671639216], [29.20471521694067, 0.1588271937012133, 0.4143565453442009], [30.95846681655538, 0.14958326694816054, 0.3931522891987118], [37.415256418524166, 0.13289652107166167, 0.4084262742996363], [41.121498770810625, 0.123232436039415, 1.3283480649279915], [45.68984034489536, 0.16917624963325253, 0.25000000000000006], [54.890378345040396, 0.1891380861376547, 0.25000000000000006], [70.79862385105552, 0.06530767313727565, 5.999999999999999]], "peak_params_": [[9.058338996454157, 0.23553576224261974, 2.774015312665882], [13.271219857153895, 0.2265511273368368, 1.581643885157568], [15.576348066989585, 0.3276565019668176, 0.8747338215038891], [18.735474375895482, 0.3058853846897467, 7.337189911433945], [24.593229650548885, 0.17023313047891087, 1.2250043343278432], [29.20471521694067, 0.14669654676506916, 0.8287130906884018], [30.95846681655538, 0.14991113801446687, 0.7863045783974236], [37.415256418524166, 0.13306422800628148, 0.8168525485992726], [41.121498770810625, 0.12271831963070667, 2.656696129855983], [45.68984034489536, 0.1273497364573526, 0.5000000000000001], [54.890378345040396, 0.1738409709729325, 0.5000000000000001], [70.79862385105552, 0.06527090044062689, 11.999999999999998]], "r_squared_": 0.9836359253792831, "error_": 0.04164519888553168}
{"freq_range": [2.0, 80.0], "freq_res": 0.5, "aperiodic_params_": [-6.885175698212307, 1.3241892537835778], "gaussian_params_": [[5.3389523747332905, 0.29004688817623053, 0.25000000000000006], [6.593726430482565, 0.24813385426847467, 0.34034845805225206], [7.8220384825500675, 0.246295234485301, 0.5808711062982513], [9.610742260665544, 0.27714764591922175, 0.42681262268673625], [10.752684616117516, 0.2945604213357395, 0.25000000000000006], [11.742088974542527, 0.3745804649659554, 0.25000000000000006], [13.689508261288593, 0.302627832398645, 1.3001860154354157], [17.8692336880417, 0.30993840381117277, 1.6821263257808512], [21.28140868524556, 0.24891856021213493, 0.5695111548410744], [23.437042323712266, 0.17330309739775923, 0.5828168225843038], [25.21064689213577, 0.21158067387523882, 0.25000000000000006], [27.449819793973596, 0.15625455389638804, 0.7875934515137337], [30.053581594786987, 0.29746793028525786, 0.25000000000000006], [35.41974803769063, 0.1566060699344858, 0.3378872411867573]], "peak_params_": [[5.3389523747332905, 0.2372013894858389, 0.5000000000000001], [6.593726430482565, 0.25738451875178736, 0.6806969161045041], [7.8220384825500675, 0.23529695588350297, 1.1617422125965027], [9.610742260665544, 0.2734572762660683, 0.8536252453734725], [10.752684616117516, 0.2222377124404442, 0.5000000000000001], [11.742088974542527, 0.3113165056032505, 0.5000000000000001], [13.689508261288593, 0.3100531285511341, 2.6003720308708314], [17.8692336880417, 0.3102455696937696, 3.3642526515617024], [21.28140868524556, 0.26210724362603166, 1.1390223096821488], [23.437042323712266, 0.17356469762926707, 1.1656336451686076], [25.21064689213577, 0.15439045133087426, 0.5000000000000001], [27.449819793973596, 0.1559377501397048, 1.5751869030274674], [30.053581594786987, 0.2915400100574832, 0.5000000000000001], [35.41974803769063, 0.15225059092886362, 0.6757744823735146]], "r_squared_": 0.9871962940438758, "error_": 0.047470292582062514}
{"freq_range": [2.0, 80.0], "freq_res": 0.5, "aperiodic_params_": [-6.745909601530789, 1.4752635053346395], "gaussian_params_": [[6.274098991004393, 0.20638885815629252, 0.4024678134724135], [7.9966046741726595, 0.10116619258713301, 0.2500000000000001], [11.655219296044507, 0.30214261988392654, 2.217835142321295], [14.53629543424934, 0.15825669547521512, 0.7459680784164642], [17.346997574101295, 0.2160349454870079, 0.9301598790439002], [20.344958095493435, 0.1701205984549813, 1.0713999301408617], [22.480323265697116, 0.16809835593500536, 0.36629858869605003], [25.2069317185012, 0.21075151313450924, 0.2500000003128601], [26.47342660540926, 0.1792812576688273, 0.34940375752160663], [30.092864292270853, 0.32223515351938414, 0.25000000000000006], [31.029661315205693, 0.12759395410208785, 0.250000000080704], [40.01481980188501, 0.2173983400600053, 0.5103222447058373], [45.47921052858849, 0.09712688486648102, 0.25000000000000006], [50.28409187448219, 0.171480403849205, 0.2500007460408097], [62.18055816911114, 0.1606886987378577, 0.4422425867574965], [64.41976068327368, 0.1146606694740463, 0.25000000000000006], [67.55327677478114, 0.1345361062700181, 0.5679866559274955], [73.0111416217779, 0.07851467484848114, 0.709270539878999], [75.74200664373109, 0.11017986307079139, 4.246042285687867], [79.72508205360701, 0.1629168522731073, 0.35139223577335227]], "peak_params_": [[6.274098991004393, 0.19658427180023175, 0.804935626944827], [7.9966046741726595, 0.1788718616192524, 0.5000000000000002], [11.655219296044507, 0.30144353546248404, 4.43567028464259], [14.53629543424934, 0.2927883816165213, 1.4919361568329284], [17.346997574101295, 0.2275769407544015, 1.8603197580878004], [20.344958095493435, 0.16914596869960086, 2.1427998602817233], [22.480323265697116, 0.19035966526443104, 0.7325971773921001], [25.2069317185012, 0.14966047035240848, 0.5000000006257203], [26.47342660540926, 0.1787638512567291, 0.6988075150432133], [30.092864292270853, 0.3007800520609045, 0.5000000000000001], [31.029661315205693, 0.1271448585042929, 0.500000000161408], [40.01481980188501, 0.21730669048293016, 1.0206444894116746], [45.47921052858849, 0.09679163721491868, 0.5000000000000001], [50.28409187448219, 0.11810105933837178, 0.5000014920816194], [62.18055816911114, 0.14842451360445708, 0.884485173514993], [64.41976068327368, 0.11221514791625431, 0.5000000000000001], [67.55327677478114, 0.15069179058964366, 1.135973311854991], [73.0111416217779, 0.16794772726382412, 1.418541079757998], [75.74200664373109, 0.11016744193143779, 8.492084571375734], [79.72508205360701, 0.20717415071842638, 0.7027844715467045]], "r_squared_": 0.99447145302434, "error_": 0.028187114644043113}
{"freq_range": [2.0, 80.0], "freq_res": 0.5, "aperiodic_params_": [-6.9238526440522286, 1.2984672987861428], "gaussian_params_": [[6.104736063704743, 0.12205089297637202, 0.8592004767709607], [7.190419815767889, 0.1266227951470209, 0.2500000000000001], [8.19134867851224, 0.2900753264032466, 0.2500004270136484], [8.953229376318372, 0.19096560124644568, 0.2501515219876432], [10.214590855004444, 0.3032529770313374, 0.2500000114551249], [11.419889853228367, 0.27187237635533873, 0.2503232083874838], [12.235017547163906, 0.2927140160908745, 0.25000000002196443], [13.351140949262481, 0.2419999692542129, 0.25000000000000006], [16.812245095739257, 0.20513927031357937, 2.545332712632257], [20.398079261572168, 0.15923371151238774, 0.4075674109122268], [22.452052086974525, 0.21087982105021894, 0.4546537338699162], [29.906387092475526, 0.27997091424998954, 0.27179768763992507], [32.61642108619809, 0.1731908031928422, 0.25000000000000006], [38.822442815573034, 0.12544468992336585, 1.8104010664930381], [59.01370344974564, 0.11505771760032268, 0.25000000000000006], [62.24582250446059, 0.1993598087512142, 0.25000000000000006], [71.67247196326096, 0.06937400866316985, 5.998901508399934], [73.39508197269312, 0.08374779644867064, 0.42529664909531006], [74.97124624844899, 0.1847934186691288, 0.3475191820548186], [76.72286243523457, 0.22003917694575756, 0.3700086058349327]], "peak_params_": [[6.104736063704743, 0.12117371755814332, 1.7184009535419213], [7.190419815767889, 0.16578712487911762, 0.5000000000000002], [8.19134867851224, 0.22845051412396256, 0.5000008540272968], [8.953229376318372, 0.19147458629776803, 0.5003030439752864], [10.214590855004444, 0.2155482777943476, 0.5000000229102498], [11.419889853228367, 0.28542454988826904, 0.5006464167749676], [12.235017547163906, 0.24105518895322575, 0.5000000000439289], [13.351140949262481, 0.2906583726325085, 0.5000000000000001], [16.812245095739257, 0.20458192848643542, 5.090665425264514], [20.398079261572168, 0.22617078167315796, 0.8151348218244536], [22.452052086974525, 0.22660553228929992, 0.9093074677398324], [29.906387092475526, 0.26384905454951024, 0.5435953752798501], [32.61642108619809, 0.15567577146839717, 0.5000000000000001], [38.822442815573034, 0.12484284149836888, 3.6208021329860762], [59.01370344974564, 0.12233532062875518, 0.5000000000000001], [62.24582250446059, 0.14184717397125013, 0.5000000000000001], [71.67247196326096, 0.06934943026535478, 11.997803016799867], [73.39508197269312, 0.14748985674700954, 0.8505932981906201], [74.97124624844899, 0.24371588795244747, 0.6950383641096372], [76.72286243523457, 0.23373279078001907, 0.7400172116698654]], "r_squared_": 0.9892331621110196, "error_": 0.035851637883908376}
