%!PS-Adobe-3.0 EPSF-3.0
%%Creator: (MATLAB, The Mathworks, Inc. Version 9.8.0.1323502 \(R2020a\). Operating System: Mac OS X)
%%Title: /Users/kosciessa/Desktop/tardis/LNDG/stateswitch/stsw_eeg_task/aperiodic_fooof/figures/h_spectra_oa.eps
%%CreationDate: 2022-02-18T13:12:42
%%Pages: (atend)
%%BoundingBox:    77     0   898   242
%%LanguageLevel: 3
%%EndComments
%%BeginProlog
%%BeginResource: procset (Apache XML Graphics Std ProcSet) 1.2 0
%%Version: 1.2 0
%%Copyright: (Copyright 2001-2003,2010 The Apache Software Foundation. License terms: http://www.apache.org/licenses/LICENSE-2.0)
/bd{bind def}bind def
/ld{load def}bd
/GR/grestore ld
/GS/gsave ld
/RM/rmoveto ld
/C/curveto ld
/t/show ld
/L/lineto ld
/ML/setmiterlimit ld
/CT/concat ld
/f/fill ld
/N/newpath ld
/S/stroke ld
/CC/setcmykcolor ld
/A/ashow ld
/cp/closepath ld
/RC/setrgbcolor ld
/LJ/setlinejoin ld
/GC/setgray ld
/LW/setlinewidth ld
/M/moveto ld
/re {4 2 roll M
1 index 0 rlineto
0 exch rlineto
neg 0 rlineto
cp } bd
/_ctm matrix def
/_tm matrix def
/BT { _ctm currentmatrix pop matrix _tm copy pop 0 0 moveto } bd
/ET { _ctm setmatrix } bd
/iTm { _ctm setmatrix _tm concat } bd
/Tm { _tm astore pop iTm 0 0 moveto } bd
/ux 0.0 def
/uy 0.0 def
/F {
  /Tp exch def
  /Tf exch def
  Tf findfont Tp scalefont setfont
  /cf Tf def  /cs Tp def
} bd
/ULS {currentpoint /uy exch def /ux exch def} bd
/ULE {
  /Tcx currentpoint pop def
  gsave
  newpath
  cf findfont cs scalefont dup
  /FontMatrix get 0 get /Ts exch def /FontInfo get dup
  /UnderlinePosition get Ts mul /To exch def
  /UnderlineThickness get Ts mul /Tt exch def
  ux uy To add moveto  Tcx uy To add lineto
  Tt setlinewidth stroke
  grestore
} bd
/OLE {
  /Tcx currentpoint pop def
  gsave
  newpath
  cf findfont cs scalefont dup
  /FontMatrix get 0 get /Ts exch def /FontInfo get dup
  /UnderlinePosition get Ts mul /To exch def
  /UnderlineThickness get Ts mul /Tt exch def
  ux uy To add cs add moveto Tcx uy To add cs add lineto
  Tt setlinewidth stroke
  grestore
} bd
/SOE {
  /Tcx currentpoint pop def
  gsave
  newpath
  cf findfont cs scalefont dup
  /FontMatrix get 0 get /Ts exch def /FontInfo get dup
  /UnderlinePosition get Ts mul /To exch def
  /UnderlineThickness get Ts mul /Tt exch def
  ux uy To add cs 10 mul 26 idiv add moveto Tcx uy To add cs 10 mul 26 idiv add lineto
  Tt setlinewidth stroke
  grestore
} bd
/QT {
/Y22 exch store
/X22 exch store
/Y21 exch store
/X21 exch store
currentpoint
/Y21 load 2 mul add 3 div exch
/X21 load 2 mul add 3 div exch
/X21 load 2 mul /X22 load add 3 div
/Y21 load 2 mul /Y22 load add 3 div
/X22 load /Y22 load curveto
} bd
/SSPD {
dup length /d exch dict def
{
/v exch def
/k exch def
currentpagedevice k known {
/cpdv currentpagedevice k get def
v cpdv ne {
/upd false def
/nullv v type /nulltype eq def
/nullcpdv cpdv type /nulltype eq def
nullv nullcpdv or
{
/upd true def
} {
/sametype v type cpdv type eq def
sametype {
v type /arraytype eq {
/vlen v length def
/cpdvlen cpdv length def
vlen cpdvlen eq {
0 1 vlen 1 sub {
/i exch def
/obj v i get def
/cpdobj cpdv i get def
obj cpdobj ne {
/upd true def
exit
} if
} for
} {
/upd true def
} ifelse
} {
v type /dicttype eq {
v {
/dv exch def
/dk exch def
/cpddv cpdv dk get def
dv cpddv ne {
/upd true def
exit
} if
} forall
} {
/upd true def
} ifelse
} ifelse
} if
} ifelse
upd true eq {
d k v put
} if
} if
} if
} forall
d length 0 gt {
d setpagedevice
} if
} bd
/RE { % /NewFontName [NewEncodingArray] /FontName RE -
  findfont dup length dict begin
  {
    1 index /FID ne
    {def} {pop pop} ifelse
  } forall
  /Encoding exch def
  /FontName 1 index def
  currentdict definefont pop
  end
} bind def
%%EndResource
%%BeginResource: procset (Apache XML Graphics EPS ProcSet) 1.0 0
%%Version: 1.0 0
%%Copyright: (Copyright 2002-2003 The Apache Software Foundation. License terms: http://www.apache.org/licenses/LICENSE-2.0)
/BeginEPSF { %def
/b4_Inc_state save def         % Save state for cleanup
/dict_count countdictstack def % Count objects on dict stack
/op_count count 1 sub def      % Count objects on operand stack
userdict begin                 % Push userdict on dict stack
/showpage { } def              % Redefine showpage, { } = null proc
0 setgray 0 setlinecap         % Prepare graphics state
1 setlinewidth 0 setlinejoin
10 setmiterlimit [ ] 0 setdash newpath
/languagelevel where           % If level not equal to 1 then
{pop languagelevel             % set strokeadjust and
1 ne                           % overprint to their defaults.
{false setstrokeadjust false setoverprint
} if
} if
} bd
/EndEPSF { %def
count op_count sub {pop} repeat            % Clean up stacks
countdictstack dict_count sub {end} repeat
b4_Inc_state restore
} bd
%%EndResource
%FOPBeginFontDict
%%IncludeResource: font Courier-Oblique
%%IncludeResource: font Courier-BoldOblique
%%IncludeResource: font Courier-Bold
%%IncludeResource: font ZapfDingbats
%%IncludeResource: font Symbol
%%IncludeResource: font Helvetica
%%IncludeResource: font Helvetica-Oblique
%%IncludeResource: font Helvetica-Bold
%%IncludeResource: font Helvetica-BoldOblique
%%IncludeResource: font Times-Roman
%%IncludeResource: font Times-Italic
%%IncludeResource: font Times-Bold
%%IncludeResource: font Times-BoldItalic
%%IncludeResource: font Courier
%FOPEndFontDict
%%BeginResource: encoding WinAnsiEncoding
/WinAnsiEncoding [
/.notdef /.notdef /.notdef /.notdef /.notdef
/.notdef /.notdef /.notdef /.notdef /.notdef
/.notdef /.notdef /.notdef /.notdef /.notdef
/.notdef /.notdef /.notdef /.notdef /.notdef
/.notdef /.notdef /.notdef /.notdef /.notdef
/.notdef /.notdef /.notdef /.notdef /.notdef
/.notdef /.notdef /space /exclam /quotedbl
/numbersign /dollar /percent /ampersand /quotesingle
/parenleft /parenright /asterisk /plus /comma
/hyphen /period /slash /zero /one
/two /three /four /five /six
/seven /eight /nine /colon /semicolon
/less /equal /greater /question /at
/A /B /C /D /E
/F /G /H /I /J
/K /L /M /N /O
/P /Q /R /S /T
/U /V /W /X /Y
/Z /bracketleft /backslash /bracketright /asciicircum
/underscore /quoteleft /a /b /c
/d /e /f /g /h
/i /j /k /l /m
/n /o /p /q /r
/s /t /u /v /w
/x /y /z /braceleft /bar
/braceright /asciitilde /bullet /Euro /bullet
/quotesinglbase /florin /quotedblbase /ellipsis /dagger
/daggerdbl /circumflex /perthousand /Scaron /guilsinglleft
/OE /bullet /Zcaron /bullet /bullet
/quoteleft /quoteright /quotedblleft /quotedblright /bullet
/endash /emdash /asciitilde /trademark /scaron
/guilsinglright /oe /bullet /zcaron /Ydieresis
/space /exclamdown /cent /sterling /currency
/yen /brokenbar /section /dieresis /copyright
/ordfeminine /guillemotleft /logicalnot /sfthyphen /registered
/macron /degree /plusminus /twosuperior /threesuperior
/acute /mu /paragraph /middot /cedilla
/onesuperior /ordmasculine /guillemotright /onequarter /onehalf
/threequarters /questiondown /Agrave /Aacute /Acircumflex
/Atilde /Adieresis /Aring /AE /Ccedilla
/Egrave /Eacute /Ecircumflex /Edieresis /Igrave
/Iacute /Icircumflex /Idieresis /Eth /Ntilde
/Ograve /Oacute /Ocircumflex /Otilde /Odieresis
/multiply /Oslash /Ugrave /Uacute /Ucircumflex
/Udieresis /Yacute /Thorn /germandbls /agrave
/aacute /acircumflex /atilde /adieresis /aring
/ae /ccedilla /egrave /eacute /ecircumflex
/edieresis /igrave /iacute /icircumflex /idieresis
/eth /ntilde /ograve /oacute /ocircumflex
/otilde /odieresis /divide /oslash /ugrave
/uacute /ucircumflex /udieresis /yacute /thorn
/ydieresis
] def
%%EndResource
%FOPBeginFontReencode
/Courier-Oblique findfont
dup length dict begin
  {1 index /FID ne {def} {pop pop} ifelse} forall
  /Encoding WinAnsiEncoding def
  currentdict
end
/Courier-Oblique exch definefont pop
/Courier-BoldOblique findfont
dup length dict begin
  {1 index /FID ne {def} {pop pop} ifelse} forall
  /Encoding WinAnsiEncoding def
  currentdict
end
/Courier-BoldOblique exch definefont pop
/Courier-Bold findfont
dup length dict begin
  {1 index /FID ne {def} {pop pop} ifelse} forall
  /Encoding WinAnsiEncoding def
  currentdict
end
/Courier-Bold exch definefont pop
/Helvetica findfont
dup length dict begin
  {1 index /FID ne {def} {pop pop} ifelse} forall
  /Encoding WinAnsiEncoding def
  currentdict
end
/Helvetica exch definefont pop
/Helvetica-Oblique findfont
dup length dict begin
  {1 index /FID ne {def} {pop pop} ifelse} forall
  /Encoding WinAnsiEncoding def
  currentdict
end
/Helvetica-Oblique exch definefont pop
/Helvetica-Bold findfont
dup length dict begin
  {1 index /FID ne {def} {pop pop} ifelse} forall
  /Encoding WinAnsiEncoding def
  currentdict
end
/Helvetica-Bold exch definefont pop
/Helvetica-BoldOblique findfont
dup length dict begin
  {1 index /FID ne {def} {pop pop} ifelse} forall
  /Encoding WinAnsiEncoding def
  currentdict
end
/Helvetica-BoldOblique exch definefont pop
/Times-Roman findfont
dup length dict begin
  {1 index /FID ne {def} {pop pop} ifelse} forall
  /Encoding WinAnsiEncoding def
  currentdict
end
/Times-Roman exch definefont pop
/Times-Italic findfont
dup length dict begin
  {1 index /FID ne {def} {pop pop} ifelse} forall
  /Encoding WinAnsiEncoding def
  currentdict
end
/Times-Italic exch definefont pop
/Times-Bold findfont
dup length dict begin
  {1 index /FID ne {def} {pop pop} ifelse} forall
  /Encoding WinAnsiEncoding def
  currentdict
end
/Times-Bold exch definefont pop
/Times-BoldItalic findfont
dup length dict begin
  {1 index /FID ne {def} {pop pop} ifelse} forall
  /Encoding WinAnsiEncoding def
  currentdict
end
/Times-BoldItalic exch definefont pop
/Courier findfont
dup length dict begin
  {1 index /FID ne {def} {pop pop} ifelse} forall
  /Encoding WinAnsiEncoding def
  currentdict
end
/Courier exch definefont pop
%FOPEndFontReencode
%%EndProlog
%%Page: 1 1
%%PageBoundingBox: 0 0 992 255
%%BeginPageSetup
[1 0 0 -1 0 255] CT
%%EndPageSetup
GS
[1.00013 0 0 1 0 0] CT
1 GC
N
0 0 992 255 re
f
GR
GS
[1.00013 0 0 1 0 0] CT
1 GC
N
0 0 992 255 re
f
GR
GS
[1.00013 0 0 1 0 0] CT
1 GC
N
136 205.5 M
339 205.5 L
339 19 L
136 19 L
cp
f
GR
GS
[1.00013 0 0 1 0 0] CT
0.149 GC
2 setlinecap
1 LJ
0.5 LW
N
136 205.5 M
339 205.5 L
S
GR
GS
[1.00013 0 0 1 0 0] CT
0.149 GC
2 setlinecap
1 LJ
0.5 LW
N
136 205.5 M
136 203.47 L
S
GR
GS
[1.00013 0 0 1 0 0] CT
0.149 GC
2 setlinecap
1 LJ
0.5 LW
N
189.421 205.5 M
189.421 203.47 L
S
GR
GS
[1.00013 0 0 1 0 0] CT
0.149 GC
2 setlinecap
1 LJ
0.5 LW
N
242.842 205.5 M
242.842 203.47 L
S
GR
GS
[1.00013 0 0 1 0 0] CT
0.149 GC
2 setlinecap
1 LJ
0.5 LW
N
296.263 205.5 M
296.263 203.47 L
S
GR
GS
[1.00013 0 0 1 136.01727 211.10001] CT
0.149 GC
/Helvetica 18 F
GS
[1 0 0 1 0 0] CT
-5.5 18 moveto 
1 -1 scale
(0) t 
GR
GR
GS
[1.00013 0 0 1 189.44511 211.10001] CT
0.149 GC
/Helvetica 18 F
GS
[1 0 0 1 0 0] CT
-13 18 moveto 
1 -1 scale
(0.5) t 
GR
GR
GS
[1.00013 0 0 1 242.87294 211.10001] CT
0.149 GC
/Helvetica 18 F
GS
[1 0 0 1 0 0] CT
-5.5 18 moveto 
1 -1 scale
(1) t 
GR
GR
GS
[1.00013 0 0 1 296.30078 211.10001] CT
0.149 GC
/Helvetica 18 F
GS
[1 0 0 1 0 0] CT
-13 18 moveto 
1 -1 scale
(1.5) t 
GR
GR
GS
[1.00013 0 0 1 237.53025 233.59999] CT
0.149 GC
/Helvetica 18 F
GS
[1 0 0 1 0 0] CT
-72.5 18 moveto 
1 -1 scale
(Frequency \(log10\)) t 
GR
GR
GS
[1.00013 0 0 1 0 0] CT
0.149 GC
2 setlinecap
1 LJ
0.5 LW
N
136 205.5 M
136 19 L
S
GR
GS
[1.00013 0 0 1 0 0] CT
0.149 GC
2 setlinecap
1 LJ
0.5 LW
N
136 189.559 M
138.03 189.559 L
S
GR
GS
[1.00013 0 0 1 0 0] CT
0.149 GC
2 setlinecap
1 LJ
0.5 LW
N
136 146.919 M
138.03 146.919 L
S
GR
GS
[1.00013 0 0 1 0 0] CT
0.149 GC
2 setlinecap
1 LJ
0.5 LW
N
136 104.28 M
138.03 104.28 L
S
GR
GS
[1.00013 0 0 1 0 0] CT
0.149 GC
2 setlinecap
1 LJ
0.5 LW
N
136 61.64 M
138.03 61.64 L
S
GR
GS
[1.00013 0 0 1 0 0] CT
0.149 GC
2 setlinecap
1 LJ
0.5 LW
N
136 19 M
138.03 19 L
S
GR
GS
[1.00013 0 0 1 130.41655 189.55922] CT
0.149 GC
/Helvetica 18 F
GS
[1 0 0 1 0 0] CT
-18 7 moveto 
1 -1 scale
(-9) t 
GR
GR
GS
[1.00013 0 0 1 130.41655 146.91942] CT
0.149 GC
/Helvetica 18 F
GS
[1 0 0 1 0 0] CT
-33 7 moveto 
1 -1 scale
(-8.5) t 
GR
GR
GS
[1.00013 0 0 1 130.41655 104.27961] CT
0.149 GC
/Helvetica 18 F
GS
[1 0 0 1 0 0] CT
-18 7 moveto 
1 -1 scale
(-8) t 
GR
GR
GS
[1.00013 0 0 1 130.41655 61.6398] CT
0.149 GC
/Helvetica 18 F
GS
[1 0 0 1 0 0] CT
-33 7 moveto 
1 -1 scale
(-7.5) t 
GR
GR
GS
[1.00013 0 0 1 130.41655 19] CT
0.149 GC
/Helvetica 18 F
GS
[1 0 0 1 0 0] CT
-18 7 moveto 
1 -1 scale
(-7) t 
GR
GR
GS
[0 -1 1.00013 0 94.91205 112.24993] CT
0.149 GC
/Helvetica 18 F
GS
[1 0 0 1 0 0] CT
-71 -4 moveto 
1 -1 scale
(Power \(log10; Hz\)) t 
GR
GR
GS
[1.00013 0 0 1 0 0] CT
0.754 0.86 0.922 RC
N
154.814 68.986 M
136 47.763 L
136 49.34 L
154.814 70.001 L
168.163 79.429 L
178.517 85.793 L
186.977 89.221 L
194.129 93.841 L
200.325 97.33 L
205.791 99.713 L
210.679 103.133 L
215.102 105.762 L
219.139 109.133 L
222.853 113.195 L
226.292 115.39 L
229.493 117.162 L
232.488 118.593 L
235.301 118.244 L
237.953 120.333 L
240.462 120.777 L
242.842 122.039 L
245.106 124.677 L
247.265 126.246 L
249.327 128.986 L
251.302 131.601 L
253.196 133.942 L
255.016 136.253 L
256.767 137.613 L
258.455 139.366 L
260.083 141.535 L
261.656 142.809 L
263.178 144.882 L
264.651 145.208 L
266.079 146.652 L
267.464 149.335 L
268.809 150.931 L
270.116 152.904 L
271.387 154.915 L
272.625 156.698 L
273.83 158.405 L
275.005 161.241 L
276.151 161.433 L
277.269 164.539 L
278.361 165.476 L
279.427 166.523 L
280.47 168.85 L
281.49 170.145 L
282.488 171.041 L
283.465 172.076 L
284.421 173.446 L
285.359 173.905 L
286.278 174.551 L
287.179 175.064 L
288.063 176.153 L
288.93 177.343 L
289.781 178.43 L
290.617 178.655 L
291.439 179.098 L
292.246 179.318 L
293.039 176.629 L
293.819 162.764 L
294.586 178.828 L
295.34 181.708 L
296.083 183.503 L
296.813 182.01 L
297.533 183.29 L
298.241 184.63 L
298.939 185.312 L
299.626 185.229 L
300.304 184.736 L
300.971 184.686 L
301.63 184.949 L
302.279 186.721 L
302.919 187.195 L
303.55 187.265 L
304.173 187.329 L
304.787 187.65 L
305.394 187.866 L
305.993 188.383 L
306.584 188.508 L
307.167 188.169 L
307.744 189.838 L
308.313 189.558 L
308.876 189.166 L
309.431 189.395 L
309.98 190.048 L
310.523 191.088 L
311.06 191.235 L
311.59 190.757 L
312.114 191.166 L
312.633 192.001 L
313.145 192.052 L
313.653 192.601 L
314.154 193.04 L
314.65 192.379 L
315.141 193.358 L
315.627 193.53 L
316.108 192.207 L
316.584 193.239 L
317.055 193.693 L
317.522 194.613 L
317.983 195.915 L
318.44 195.09 L
318.893 195.197 L
319.341 195.216 L
319.785 195.159 L
320.225 195.381 L
320.661 196.226 L
321.093 196.361 L
321.52 195.941 L
321.944 197.373 L
322.364 196.858 L
322.78 195.981 L
323.193 196.225 L
323.601 196.711 L
324.007 198.01 L
324.408 198.599 L
324.807 198.267 L
325.202 197.944 L
325.593 197.776 L
325.981 195.614 L
326.366 198.199 L
326.748 198.941 L
327.127 199.592 L
327.503 198.841 L
327.876 199.192 L
328.245 199.571 L
328.612 199.372 L
328.976 200.347 L
329.337 200.735 L
329.695 200.243 L
330.051 199.862 L
330.404 201.292 L
330.754 200.897 L
331.102 201.48 L
331.447 202.013 L
331.789 201.486 L
332.129 202.108 L
332.466 202.152 L
332.802 202.61 L
333.134 202.975 L
333.464 202.083 L
333.792 202.519 L
334.118 202.697 L
334.441 202.484 L
334.762 203.854 L
335.081 204.186 L
335.398 202.798 L
335.713 203.554 L
336.025 203.916 L
336.335 204.495 L
336.644 204.539 L
336.95 204.416 L
337.254 203.748 L
337.557 204.795 L
337.857 204.825 L
338.155 205.5 L
338.452 205.285 L
338.746 204.987 L
339.024 204.998 L
339.024 204.924 L
339.024 204.575 L
339.024 204.357 L
339.024 203.837 L
338.746 203.906 L
338.452 204.054 L
338.155 204.227 L
337.857 203.544 L
337.557 203.665 L
337.254 202.394 L
336.95 203.165 L
336.644 203.262 L
336.335 203.473 L
336.025 202.579 L
335.713 202.113 L
335.398 201.513 L
335.081 202.867 L
334.762 202.544 L
334.441 201.052 L
334.118 201.313 L
333.792 200.79 L
333.464 200.645 L
333.134 201.781 L
332.802 201.461 L
332.466 200.928 L
332.129 200.773 L
331.789 200.278 L
331.447 200.607 L
331.102 200.146 L
330.754 199.565 L
330.404 199.964 L
330.051 198.679 L
329.695 198.894 L
329.337 199.569 L
328.976 199.012 L
328.612 198.055 L
328.245 198.194 L
327.876 198.095 L
327.503 197.591 L
327.127 198.422 L
326.748 197.825 L
326.366 196.997 L
325.981 194.496 L
325.593 196.627 L
325.202 196.888 L
324.807 197.271 L
324.408 197.136 L
324.007 196.513 L
323.601 195.56 L
323.193 195.057 L
322.78 194.731 L
322.364 195.599 L
321.944 196.382 L
321.52 194.57 L
321.093 194.941 L
320.661 195.146 L
320.225 194.087 L
319.785 193.841 L
319.341 194.214 L
318.893 194.276 L
318.44 193.748 L
317.983 194.473 L
317.522 193.397 L
317.055 192.556 L
316.584 192.026 L
316.108 191.185 L
315.627 192.395 L
315.141 192.081 L
314.65 191.212 L
314.154 191.798 L
313.653 191.404 L
313.145 190.935 L
312.633 190.727 L
312.114 189.955 L
311.59 189.623 L
311.06 190.145 L
310.523 190.039 L
309.98 188.765 L
309.431 188.374 L
308.876 188.15 L
308.313 188.53 L
307.744 188.741 L
307.167 187.027 L
306.584 187.367 L
305.993 187.162 L
305.394 186.754 L
304.787 186.491 L
304.173 186.24 L
303.55 186.096 L
302.919 185.964 L
302.279 185.544 L
301.63 183.818 L
300.971 183.57 L
300.304 183.549 L
299.626 184.115 L
298.939 184.312 L
298.241 183.666 L
297.533 182.191 L
296.813 181.032 L
296.083 182.229 L
295.34 180.608 L
294.586 177.728 L
293.819 161.887 L
293.039 175.548 L
292.246 178.189 L
291.439 177.975 L
290.617 177.582 L
289.781 177.319 L
288.93 176.144 L
288.063 175.089 L
287.179 173.931 L
286.278 173.609 L
285.359 172.931 L
284.421 172.528 L
283.465 171.06 L
282.488 170.03 L
281.49 169.153 L
280.47 167.885 L
279.427 165.454 L
278.361 164.4 L
277.269 163.493 L
276.151 160.488 L
275.005 160.153 L
273.83 157.501 L
272.625 155.647 L
271.387 153.818 L
270.116 151.751 L
268.809 149.848 L
267.464 148.1 L
266.079 145.492 L
264.651 144.3 L
263.178 143.947 L
261.656 141.822 L
260.083 140.44 L
258.455 138.227 L
256.767 136.525 L
255.016 135.268 L
253.196 132.835 L
251.302 130.562 L
249.327 127.763 L
247.265 124.971 L
245.106 123.01 L
242.842 120.399 L
240.462 119.579 L
237.953 119.165 L
235.301 117.188 L
232.488 117.509 L
229.493 116.07 L
226.292 114.336 L
222.853 112.109 L
219.139 108.186 L
215.102 104.878 L
210.679 102.237 L
205.791 98.738 L
200.325 96.445 L
194.129 92.74 L
186.977 88.215 L
178.517 84.747 L
168.163 78.459 L
cp
f
GR
GS
[1.00013 0 0 1 0 0] CT
0.561 0.749 0.859 RC
1 LJ
0.5 LW
N
136 49.34 M
154.814 70.001 L
168.163 79.429 L
178.517 85.793 L
186.977 89.221 L
194.129 93.841 L
200.325 97.33 L
205.791 99.713 L
210.679 103.133 L
215.102 105.762 L
219.139 109.133 L
222.853 113.195 L
226.292 115.39 L
229.493 117.162 L
232.488 118.593 L
235.301 118.244 L
237.953 120.333 L
240.462 120.777 L
242.842 122.039 L
245.106 124.677 L
247.265 126.246 L
249.327 128.986 L
251.302 131.601 L
253.196 133.942 L
255.016 136.253 L
256.767 137.613 L
258.455 139.366 L
260.083 141.535 L
261.656 142.809 L
263.178 144.882 L
264.651 145.208 L
266.079 146.652 L
267.464 149.335 L
268.809 150.931 L
270.116 152.904 L
271.387 154.915 L
272.625 156.698 L
273.83 158.405 L
275.005 161.241 L
276.151 161.433 L
277.269 164.539 L
278.361 165.476 L
279.427 166.523 L
280.47 168.85 L
281.49 170.145 L
282.488 171.041 L
283.465 172.076 L
284.421 173.446 L
285.359 173.905 L
286.278 174.551 L
287.179 175.064 L
288.063 176.153 L
288.93 177.343 L
289.781 178.43 L
290.617 178.655 L
291.439 179.098 L
292.246 179.318 L
293.039 176.629 L
293.819 162.764 L
294.586 178.828 L
295.34 181.708 L
296.083 183.503 L
296.813 182.01 L
297.533 183.29 L
298.241 184.63 L
298.939 185.312 L
299.626 185.229 L
300.304 184.736 L
300.971 184.686 L
301.63 184.949 L
302.279 186.721 L
302.919 187.195 L
303.55 187.265 L
304.173 187.329 L
304.787 187.65 L
305.394 187.866 L
305.993 188.383 L
306.584 188.508 L
307.167 188.169 L
307.744 189.838 L
308.313 189.558 L
308.876 189.166 L
309.431 189.395 L
309.98 190.048 L
310.523 191.088 L
311.06 191.235 L
311.59 190.757 L
312.114 191.166 L
312.633 192.001 L
313.145 192.052 L
313.653 192.601 L
314.154 193.04 L
314.65 192.379 L
315.141 193.358 L
315.627 193.53 L
316.108 192.207 L
316.584 193.239 L
317.055 193.693 L
317.522 194.613 L
317.983 195.915 L
318.44 195.09 L
318.893 195.197 L
319.341 195.216 L
319.785 195.159 L
320.225 195.381 L
320.661 196.226 L
321.093 196.361 L
321.52 195.941 L
321.944 197.373 L
322.364 196.858 L
322.78 195.981 L
323.193 196.225 L
323.601 196.711 L
324.007 198.01 L
324.408 198.599 L
324.807 198.267 L
325.202 197.944 L
325.593 197.776 L
325.981 195.614 L
326.366 198.199 L
326.748 198.941 L
327.127 199.592 L
327.503 198.841 L
327.876 199.192 L
328.245 199.571 L
328.612 199.372 L
328.976 200.347 L
329.337 200.735 L
329.695 200.243 L
330.051 199.862 L
330.404 201.292 L
330.754 200.897 L
331.102 201.48 L
331.447 202.013 L
331.789 201.486 L
332.129 202.108 L
332.466 202.152 L
332.802 202.61 L
333.134 202.975 L
333.464 202.083 L
333.792 202.519 L
334.118 202.697 L
334.441 202.484 L
334.762 203.854 L
335.081 204.186 L
335.398 202.798 L
335.713 203.554 L
336.025 203.916 L
336.335 204.495 L
336.644 204.539 L
336.95 204.416 L
337.254 203.748 L
337.557 204.795 L
337.857 204.825 L
338.155 205.5 L
338.452 205.285 L
338.746 204.987 L
339.024 204.998 L
S
GR
GS
[1.00013 0 0 1 0 0] CT
0.561 0.749 0.859 RC
1 LJ
0.5 LW
N
136 47.763 M
154.814 68.986 L
168.163 78.459 L
178.517 84.747 L
186.977 88.215 L
194.129 92.74 L
200.325 96.445 L
205.791 98.738 L
210.679 102.237 L
215.102 104.878 L
219.139 108.186 L
222.853 112.109 L
226.292 114.336 L
229.493 116.07 L
232.488 117.509 L
235.301 117.188 L
237.953 119.165 L
240.462 119.579 L
242.842 120.399 L
245.106 123.01 L
247.265 124.971 L
249.327 127.763 L
251.302 130.562 L
253.196 132.835 L
255.016 135.268 L
256.767 136.525 L
258.455 138.227 L
260.083 140.44 L
261.656 141.822 L
263.178 143.947 L
264.651 144.3 L
266.079 145.492 L
267.464 148.1 L
268.809 149.848 L
270.116 151.751 L
271.387 153.818 L
272.625 155.647 L
273.83 157.501 L
275.005 160.153 L
276.151 160.488 L
277.269 163.493 L
278.361 164.4 L
279.427 165.454 L
280.47 167.885 L
281.49 169.153 L
282.488 170.03 L
283.465 171.06 L
284.421 172.528 L
285.359 172.931 L
286.278 173.609 L
287.179 173.931 L
288.063 175.089 L
288.93 176.144 L
289.781 177.319 L
290.617 177.582 L
291.439 177.975 L
292.246 178.189 L
293.039 175.548 L
293.819 161.887 L
294.586 177.728 L
295.34 180.608 L
296.083 182.229 L
296.813 181.032 L
297.533 182.191 L
298.241 183.666 L
298.939 184.312 L
299.626 184.115 L
300.304 183.549 L
300.971 183.57 L
301.63 183.818 L
302.279 185.544 L
302.919 185.964 L
303.55 186.096 L
304.173 186.24 L
304.787 186.491 L
305.394 186.754 L
305.993 187.162 L
306.584 187.367 L
307.167 187.027 L
307.744 188.741 L
308.313 188.53 L
308.876 188.15 L
309.431 188.374 L
309.98 188.765 L
310.523 190.039 L
311.06 190.145 L
311.59 189.623 L
312.114 189.955 L
312.633 190.727 L
313.145 190.935 L
313.653 191.404 L
314.154 191.798 L
314.65 191.212 L
315.141 192.081 L
315.627 192.395 L
316.108 191.185 L
316.584 192.026 L
317.055 192.556 L
317.522 193.397 L
317.983 194.473 L
318.44 193.748 L
318.893 194.276 L
319.341 194.214 L
319.785 193.841 L
320.225 194.087 L
320.661 195.146 L
321.093 194.941 L
321.52 194.57 L
321.944 196.382 L
322.364 195.599 L
322.78 194.731 L
323.193 195.057 L
323.601 195.56 L
324.007 196.513 L
324.408 197.136 L
324.807 197.271 L
325.202 196.888 L
325.593 196.627 L
325.981 194.496 L
326.366 196.997 L
326.748 197.825 L
327.127 198.422 L
327.503 197.591 L
327.876 198.095 L
328.245 198.194 L
328.612 198.055 L
328.976 199.012 L
329.337 199.569 L
329.695 198.894 L
330.051 198.679 L
330.404 199.964 L
330.754 199.565 L
331.102 200.146 L
331.447 200.607 L
331.789 200.278 L
332.129 200.773 L
332.466 200.928 L
332.802 201.461 L
333.134 201.781 L
333.464 200.645 L
333.792 200.79 L
334.118 201.313 L
334.441 201.052 L
334.762 202.544 L
335.081 202.867 L
335.398 201.513 L
335.713 202.113 L
336.025 202.579 L
336.335 203.473 L
336.644 203.262 L
336.95 203.165 L
337.254 202.394 L
337.557 203.665 L
337.857 203.544 L
338.155 204.227 L
338.452 204.054 L
338.746 203.906 L
339.024 203.837 L
S
GR
GS
[1.00013 0 0 1 0 0] CT
0.02 0.443 0.69 RC
1 LJ
2 LW
N
136 48.551 M
154.814 69.494 L
168.163 78.944 L
178.517 85.27 L
186.977 88.718 L
194.129 93.291 L
200.325 96.888 L
205.791 99.225 L
210.679 102.685 L
215.102 105.32 L
219.139 108.66 L
222.853 112.652 L
226.292 114.863 L
229.493 116.616 L
232.488 118.051 L
235.301 117.716 L
237.953 119.749 L
240.462 120.178 L
242.842 121.219 L
245.106 123.843 L
247.265 125.609 L
249.327 128.374 L
251.302 131.082 L
253.196 133.388 L
255.016 135.76 L
256.767 137.069 L
258.455 138.796 L
260.083 140.987 L
261.656 142.316 L
263.178 144.414 L
264.651 144.754 L
266.079 146.072 L
267.464 148.718 L
268.809 150.389 L
270.116 152.327 L
271.387 154.366 L
272.625 156.173 L
273.83 157.953 L
275.005 160.697 L
276.151 160.96 L
277.269 164.016 L
278.361 164.938 L
279.427 165.989 L
280.47 168.368 L
281.49 169.649 L
282.488 170.535 L
283.465 171.568 L
284.421 172.987 L
285.359 173.418 L
286.278 174.08 L
287.179 174.498 L
288.063 175.621 L
288.93 176.743 L
289.781 177.875 L
290.617 178.119 L
291.439 178.537 L
292.246 178.753 L
293.039 176.089 L
293.819 162.326 L
294.586 178.278 L
295.34 181.158 L
296.083 182.866 L
296.813 181.521 L
297.533 182.74 L
298.241 184.148 L
298.939 184.812 L
299.626 184.672 L
300.304 184.143 L
300.971 184.128 L
301.63 184.383 L
302.279 186.132 L
302.919 186.579 L
303.55 186.68 L
304.173 186.784 L
304.787 187.071 L
305.394 187.31 L
305.993 187.773 L
306.584 187.938 L
307.167 187.598 L
307.744 189.289 L
308.313 189.044 L
308.876 188.658 L
309.431 188.885 L
309.98 189.406 L
310.523 190.564 L
311.06 190.69 L
311.59 190.19 L
312.114 190.56 L
312.633 191.364 L
313.145 191.493 L
313.653 192.002 L
314.154 192.419 L
314.65 191.796 L
315.141 192.719 L
315.627 192.962 L
316.108 191.696 L
316.584 192.632 L
317.055 193.124 L
317.522 194.005 L
317.983 195.194 L
318.44 194.419 L
318.893 194.736 L
319.341 194.715 L
319.785 194.5 L
320.225 194.734 L
320.661 195.686 L
321.093 195.651 L
321.52 195.256 L
321.944 196.877 L
322.364 196.228 L
322.78 195.356 L
323.193 195.641 L
323.601 196.136 L
324.007 197.261 L
324.408 197.868 L
324.807 197.769 L
325.202 197.416 L
325.593 197.202 L
325.981 195.055 L
326.366 197.598 L
326.748 198.383 L
327.127 199.007 L
327.503 198.216 L
327.876 198.643 L
328.245 198.883 L
328.612 198.714 L
328.976 199.679 L
329.337 200.152 L
329.695 199.568 L
330.051 199.271 L
330.404 200.628 L
330.754 200.231 L
331.102 200.813 L
331.447 201.31 L
331.789 200.882 L
332.129 201.441 L
332.466 201.54 L
332.802 202.036 L
333.134 202.378 L
333.464 201.364 L
333.792 201.654 L
334.118 202.005 L
334.441 201.768 L
334.762 203.199 L
335.081 203.527 L
335.398 202.156 L
335.713 202.834 L
336.025 203.247 L
336.335 203.984 L
336.644 203.901 L
336.95 203.791 L
337.254 203.071 L
337.557 204.23 L
337.857 204.185 L
338.155 204.864 L
338.452 204.67 L
338.746 204.447 L
339.024 204.417 L
S
GR
GS
[1.00013 0 0 1 0 0] CT
0.948 0.749 0.781 RC
N
154.814 68.343 M
136 48.733 L
136 50.067 L
154.814 69.49 L
168.163 80.192 L
178.517 84.667 L
186.977 87.429 L
194.129 91.268 L
200.325 95.803 L
205.791 98.845 L
210.679 102.521 L
215.102 105.882 L
219.139 109.148 L
222.853 112.698 L
226.292 115.389 L
229.493 116.8 L
232.488 117.574 L
235.301 117.779 L
237.953 120.142 L
240.462 120.05 L
242.842 121.97 L
245.106 124.184 L
247.265 127.212 L
249.327 129.215 L
251.302 130.473 L
253.196 133.086 L
255.016 136.167 L
256.767 138.195 L
258.455 139.553 L
260.083 141.298 L
261.656 142.869 L
263.178 143.859 L
264.651 145.288 L
266.079 148.138 L
267.464 150 L
268.809 151.912 L
270.116 153.556 L
271.387 155.053 L
272.625 156.97 L
273.83 157.69 L
275.005 159.665 L
276.151 161.458 L
277.269 162.963 L
278.361 165.469 L
279.427 166.613 L
280.47 168.004 L
281.49 168.508 L
282.488 169.839 L
283.465 170.522 L
284.421 172.808 L
285.359 173.825 L
286.278 174.323 L
287.179 174.488 L
288.063 174.873 L
288.93 176.55 L
289.781 177.616 L
290.617 177.757 L
291.439 178.899 L
292.246 178.63 L
293.039 176.56 L
293.819 162.657 L
294.586 178.235 L
295.34 181.772 L
296.083 181.843 L
296.813 181.474 L
297.533 181.549 L
298.241 182.269 L
298.939 182.695 L
299.626 184.006 L
300.304 184.105 L
300.971 185.125 L
301.63 185.176 L
302.279 185.344 L
302.919 185.901 L
303.55 186.905 L
304.173 186.673 L
304.787 188.36 L
305.394 188.76 L
305.993 187.087 L
306.584 188.626 L
307.167 188.955 L
307.744 188.419 L
308.313 188.367 L
308.876 189.196 L
309.431 190.154 L
309.98 189.767 L
310.523 190.158 L
311.06 189.72 L
311.59 190.922 L
312.114 191.119 L
312.633 192.174 L
313.145 191.714 L
313.653 191.208 L
314.154 192.399 L
314.65 192.606 L
315.141 192.046 L
315.627 192.576 L
316.108 192.777 L
316.584 193.222 L
317.055 193.64 L
317.522 193.51 L
317.983 193.435 L
318.44 193.502 L
318.893 194.427 L
319.341 193.973 L
319.785 194.585 L
320.225 193.498 L
320.661 195.232 L
321.093 195.508 L
321.52 194.332 L
321.944 196.201 L
322.364 195.839 L
322.78 196.089 L
323.193 196.299 L
323.601 196.329 L
324.007 196.683 L
324.408 197.096 L
324.807 196.368 L
325.202 196.364 L
325.593 197.735 L
325.981 195.617 L
326.366 198.365 L
326.748 198.428 L
327.127 197.69 L
327.503 198.522 L
327.876 199.169 L
328.245 199.97 L
328.612 199.007 L
328.976 198.756 L
329.337 198.718 L
329.695 198.716 L
330.051 199.084 L
330.404 200.624 L
330.754 199.95 L
331.102 200.38 L
331.447 200.773 L
331.789 200.514 L
332.129 200.623 L
332.466 201.043 L
332.802 200.774 L
333.134 200.561 L
333.464 201.41 L
333.792 202.569 L
334.118 202.253 L
334.441 202.203 L
334.762 202.445 L
335.081 202.193 L
335.398 203.272 L
335.713 203.163 L
336.025 202.349 L
336.335 204.011 L
336.644 203.54 L
336.95 203.628 L
337.254 202.8 L
337.557 202.914 L
337.857 203.32 L
338.155 204.245 L
338.452 203.601 L
338.746 203.703 L
339.024 203.846 L
339.024 202.529 L
339.024 202.475 L
339.024 202.467 L
339.024 202.463 L
338.746 202.421 L
338.452 202.525 L
338.155 203.051 L
337.857 202.212 L
337.557 201.889 L
337.254 201.774 L
336.95 202.565 L
336.644 202.453 L
336.335 202.967 L
336.025 201.276 L
335.713 201.905 L
335.398 201.972 L
335.081 200.872 L
334.762 201.297 L
334.441 201.052 L
334.118 200.903 L
333.792 201.464 L
333.464 200.356 L
333.134 199.573 L
332.802 199.67 L
332.466 199.884 L
332.129 199.364 L
331.789 199.305 L
331.447 199.59 L
331.102 199.146 L
330.754 198.732 L
330.404 199.451 L
330.051 197.983 L
329.695 197.73 L
329.337 197.567 L
328.976 197.542 L
328.612 197.895 L
328.245 198.62 L
327.876 197.878 L
327.503 197.301 L
327.127 196.571 L
326.748 197.35 L
326.366 197.15 L
325.981 194.447 L
325.593 196.641 L
325.202 195.387 L
324.807 195.242 L
324.408 195.803 L
324.007 195.307 L
323.601 194.92 L
323.193 195.046 L
322.78 195.123 L
322.364 194.731 L
321.944 195.068 L
321.52 193.305 L
321.093 194.145 L
320.661 193.966 L
320.225 192.344 L
319.785 193.627 L
319.341 192.972 L
318.893 193.563 L
318.44 192.217 L
317.983 192.192 L
317.522 192.408 L
317.055 192.52 L
316.584 192.183 L
316.108 191.79 L
315.627 191.389 L
315.141 190.863 L
314.65 191.236 L
314.154 191.219 L
313.653 190.244 L
313.145 190.698 L
312.633 191.071 L
312.114 190.162 L
311.59 189.783 L
311.06 188.416 L
310.523 188.892 L
309.98 188.612 L
309.431 188.957 L
308.876 188.22 L
308.313 187.272 L
307.744 187.468 L
307.167 187.958 L
306.584 187.608 L
305.993 186.193 L
305.394 187.887 L
304.787 187.264 L
304.173 185.573 L
303.55 185.688 L
302.919 184.805 L
302.279 184.353 L
301.63 184.144 L
300.971 184.011 L
300.304 183.122 L
299.626 182.915 L
298.939 181.665 L
298.241 181.319 L
297.533 180.484 L
296.813 180.466 L
296.083 180.755 L
295.34 180.585 L
294.586 177.181 L
293.819 161.795 L
293.039 175.683 L
292.246 177.512 L
291.439 177.647 L
290.617 176.833 L
289.781 176.822 L
288.93 175.519 L
288.063 173.867 L
287.179 173.505 L
286.278 173.264 L
285.359 172.891 L
284.421 171.862 L
283.465 169.631 L
282.488 168.92 L
281.49 167.591 L
280.47 167.045 L
279.427 165.596 L
278.361 164.48 L
277.269 161.773 L
276.151 160.471 L
275.005 158.66 L
273.83 156.869 L
272.625 155.921 L
271.387 154.066 L
270.116 152.522 L
268.809 150.786 L
267.464 148.726 L
266.079 147.005 L
264.651 144.294 L
263.178 142.868 L
261.656 141.992 L
260.083 140.282 L
258.455 138.555 L
256.767 137.144 L
255.016 134.995 L
253.196 131.884 L
251.302 129.628 L
249.327 127.957 L
247.265 126.124 L
245.106 123.08 L
242.842 120.639 L
240.462 118.819 L
237.953 119.226 L
235.301 116.663 L
232.488 116.618 L
229.493 116.034 L
226.292 114.466 L
222.853 111.537 L
219.139 108.124 L
215.102 104.823 L
210.679 101.512 L
205.791 97.918 L
200.325 94.853 L
194.129 90.442 L
186.977 86.458 L
178.517 83.618 L
168.163 79.097 L
cp
f
GR
GS
[1.00013 0 0 1 0 0] CT
0.906 0.549 0.608 RC
1 LJ
0.5 LW
N
136 50.067 M
154.814 69.49 L
168.163 80.192 L
178.517 84.667 L
186.977 87.429 L
194.129 91.268 L
200.325 95.803 L
205.791 98.845 L
210.679 102.521 L
215.102 105.882 L
219.139 109.148 L
222.853 112.698 L
226.292 115.389 L
229.493 116.8 L
232.488 117.574 L
235.301 117.779 L
237.953 120.142 L
240.462 120.05 L
242.842 121.97 L
245.106 124.184 L
247.265 127.212 L
249.327 129.215 L
251.302 130.473 L
253.196 133.086 L
255.016 136.167 L
256.767 138.195 L
258.455 139.553 L
260.083 141.298 L
261.656 142.869 L
263.178 143.859 L
264.651 145.288 L
266.079 148.138 L
267.464 150 L
268.809 151.912 L
270.116 153.556 L
271.387 155.053 L
272.625 156.97 L
273.83 157.69 L
275.005 159.665 L
276.151 161.458 L
277.269 162.963 L
278.361 165.469 L
279.427 166.613 L
280.47 168.004 L
281.49 168.508 L
282.488 169.839 L
283.465 170.522 L
284.421 172.808 L
285.359 173.825 L
286.278 174.323 L
287.179 174.488 L
288.063 174.873 L
288.93 176.55 L
289.781 177.616 L
290.617 177.757 L
291.439 178.899 L
292.246 178.63 L
293.039 176.56 L
293.819 162.657 L
294.586 178.235 L
295.34 181.772 L
296.083 181.843 L
296.813 181.474 L
297.533 181.549 L
298.241 182.269 L
298.939 182.695 L
299.626 184.006 L
300.304 184.105 L
300.971 185.125 L
301.63 185.176 L
302.279 185.344 L
302.919 185.901 L
303.55 186.905 L
304.173 186.673 L
304.787 188.36 L
305.394 188.76 L
305.993 187.087 L
306.584 188.626 L
307.167 188.955 L
307.744 188.419 L
308.313 188.367 L
308.876 189.196 L
309.431 190.154 L
309.98 189.767 L
310.523 190.158 L
311.06 189.72 L
311.59 190.922 L
312.114 191.119 L
312.633 192.174 L
313.145 191.714 L
313.653 191.208 L
314.154 192.399 L
314.65 192.606 L
315.141 192.046 L
315.627 192.576 L
316.108 192.777 L
316.584 193.222 L
317.055 193.64 L
317.522 193.51 L
317.983 193.435 L
318.44 193.502 L
318.893 194.427 L
319.341 193.973 L
319.785 194.585 L
320.225 193.498 L
320.661 195.232 L
321.093 195.508 L
321.52 194.332 L
321.944 196.201 L
322.364 195.839 L
322.78 196.089 L
323.193 196.299 L
323.601 196.329 L
324.007 196.683 L
324.408 197.096 L
324.807 196.368 L
325.202 196.364 L
325.593 197.735 L
325.981 195.617 L
326.366 198.365 L
326.748 198.428 L
327.127 197.69 L
327.503 198.522 L
327.876 199.169 L
328.245 199.97 L
328.612 199.007 L
328.976 198.756 L
329.337 198.718 L
329.695 198.716 L
330.051 199.084 L
330.404 200.624 L
330.754 199.95 L
331.102 200.38 L
331.447 200.773 L
331.789 200.514 L
332.129 200.623 L
332.466 201.043 L
332.802 200.774 L
333.134 200.561 L
333.464 201.41 L
333.792 202.569 L
334.118 202.253 L
334.441 202.203 L
334.762 202.445 L
335.081 202.193 L
335.398 203.272 L
335.713 203.163 L
336.025 202.349 L
336.335 204.011 L
336.644 203.54 L
336.95 203.628 L
337.254 202.8 L
337.557 202.914 L
337.857 203.32 L
338.155 204.245 L
338.452 203.601 L
338.746 203.703 L
339.024 203.846 L
S
GR
GS
[1.00013 0 0 1 0 0] CT
0.906 0.549 0.608 RC
1 LJ
0.5 LW
N
136 48.733 M
154.814 68.343 L
168.163 79.097 L
178.517 83.618 L
186.977 86.458 L
194.129 90.442 L
200.325 94.853 L
205.791 97.918 L
210.679 101.512 L
215.102 104.823 L
219.139 108.124 L
222.853 111.537 L
226.292 114.466 L
229.493 116.034 L
232.488 116.618 L
235.301 116.663 L
237.953 119.226 L
240.462 118.819 L
242.842 120.639 L
245.106 123.08 L
247.265 126.124 L
249.327 127.957 L
251.302 129.628 L
253.196 131.884 L
255.016 134.995 L
256.767 137.144 L
258.455 138.555 L
260.083 140.282 L
261.656 141.992 L
263.178 142.868 L
264.651 144.294 L
266.079 147.005 L
267.464 148.726 L
268.809 150.786 L
270.116 152.522 L
271.387 154.066 L
272.625 155.921 L
273.83 156.869 L
275.005 158.66 L
276.151 160.471 L
277.269 161.773 L
278.361 164.48 L
279.427 165.596 L
280.47 167.045 L
281.49 167.591 L
282.488 168.92 L
283.465 169.631 L
284.421 171.862 L
285.359 172.891 L
286.278 173.264 L
287.179 173.505 L
288.063 173.867 L
288.93 175.519 L
289.781 176.822 L
290.617 176.833 L
291.439 177.647 L
292.246 177.512 L
293.039 175.683 L
293.819 161.795 L
294.586 177.181 L
295.34 180.585 L
296.083 180.755 L
296.813 180.466 L
297.533 180.484 L
298.241 181.319 L
298.939 181.665 L
299.626 182.915 L
300.304 183.122 L
300.971 184.011 L
301.63 184.144 L
302.279 184.353 L
302.919 184.805 L
303.55 185.688 L
304.173 185.573 L
304.787 187.264 L
305.394 187.887 L
305.993 186.193 L
306.584 187.608 L
307.167 187.958 L
307.744 187.468 L
308.313 187.272 L
308.876 188.22 L
309.431 188.957 L
309.98 188.612 L
310.523 188.892 L
311.06 188.416 L
311.59 189.783 L
312.114 190.162 L
312.633 191.071 L
313.145 190.698 L
313.653 190.244 L
314.154 191.219 L
314.65 191.236 L
315.141 190.863 L
315.627 191.389 L
316.108 191.79 L
316.584 192.183 L
317.055 192.52 L
317.522 192.408 L
317.983 192.192 L
318.44 192.217 L
318.893 193.563 L
319.341 192.972 L
319.785 193.627 L
320.225 192.344 L
320.661 193.966 L
321.093 194.145 L
321.52 193.305 L
321.944 195.068 L
322.364 194.731 L
322.78 195.123 L
323.193 195.046 L
323.601 194.92 L
324.007 195.307 L
324.408 195.803 L
324.807 195.242 L
325.202 195.387 L
325.593 196.641 L
325.981 194.447 L
326.366 197.15 L
326.748 197.35 L
327.127 196.571 L
327.503 197.301 L
327.876 197.878 L
328.245 198.62 L
328.612 197.895 L
328.976 197.542 L
329.337 197.567 L
329.695 197.73 L
330.051 197.983 L
330.404 199.451 L
330.754 198.732 L
331.102 199.146 L
331.447 199.59 L
331.789 199.305 L
332.129 199.364 L
332.466 199.884 L
332.802 199.67 L
333.134 199.573 L
333.464 200.356 L
333.792 201.464 L
334.118 200.903 L
334.441 201.052 L
334.762 201.297 L
335.081 200.872 L
335.398 201.972 L
335.713 201.905 L
336.025 201.276 L
336.335 202.967 L
336.644 202.453 L
336.95 202.565 L
337.254 201.774 L
337.557 201.889 L
337.857 202.212 L
338.155 203.051 L
338.452 202.525 L
338.746 202.421 L
339.024 202.463 L
S
GR
GS
[1.00013 0 0 1 0 0] CT
0.792 0 0.125 RC
1 LJ
2 LW
N
136 49.4 M
154.814 68.917 L
168.163 79.645 L
178.517 84.143 L
186.977 86.944 L
194.129 90.855 L
200.325 95.328 L
205.791 98.382 L
210.679 102.017 L
215.102 105.353 L
219.139 108.636 L
222.853 112.117 L
226.292 114.928 L
229.493 116.417 L
232.488 117.096 L
235.301 117.221 L
237.953 119.684 L
240.462 119.435 L
242.842 121.305 L
245.106 123.632 L
247.265 126.668 L
249.327 128.586 L
251.302 130.05 L
253.196 132.485 L
255.016 135.581 L
256.767 137.669 L
258.455 139.054 L
260.083 140.79 L
261.656 142.431 L
263.178 143.364 L
264.651 144.791 L
266.079 147.572 L
267.464 149.363 L
268.809 151.349 L
270.116 153.039 L
271.387 154.559 L
272.625 156.446 L
273.83 157.28 L
275.005 159.162 L
276.151 160.965 L
277.269 162.368 L
278.361 164.974 L
279.427 166.104 L
280.47 167.525 L
281.49 168.049 L
282.488 169.379 L
283.465 170.076 L
284.421 172.335 L
285.359 173.358 L
286.278 173.794 L
287.179 173.996 L
288.063 174.37 L
288.93 176.034 L
289.781 177.219 L
290.617 177.295 L
291.439 178.273 L
292.246 178.071 L
293.039 176.122 L
293.819 162.226 L
294.586 177.708 L
295.34 181.179 L
296.083 181.299 L
296.813 180.97 L
297.533 181.017 L
298.241 181.794 L
298.939 182.18 L
299.626 183.46 L
300.304 183.614 L
300.971 184.568 L
301.63 184.66 L
302.279 184.848 L
302.919 185.353 L
303.55 186.296 L
304.173 186.123 L
304.787 187.812 L
305.394 188.324 L
305.993 186.64 L
306.584 188.117 L
307.167 188.456 L
307.744 187.944 L
308.313 187.819 L
308.876 188.708 L
309.431 189.556 L
309.98 189.189 L
310.523 189.525 L
311.06 189.068 L
311.59 190.353 L
312.114 190.641 L
312.633 191.623 L
313.145 191.206 L
313.653 190.726 L
314.154 191.809 L
314.65 191.921 L
315.141 191.454 L
315.627 191.983 L
316.108 192.284 L
316.584 192.703 L
317.055 193.08 L
317.522 192.959 L
317.983 192.814 L
318.44 192.86 L
318.893 193.995 L
319.341 193.473 L
319.785 194.106 L
320.225 192.921 L
320.661 194.599 L
321.093 194.826 L
321.52 193.819 L
321.944 195.635 L
322.364 195.285 L
322.78 195.606 L
323.193 195.672 L
323.601 195.624 L
324.007 195.995 L
324.408 196.45 L
324.807 195.805 L
325.202 195.875 L
325.593 197.188 L
325.981 195.032 L
326.366 197.757 L
326.748 197.889 L
327.127 197.13 L
327.503 197.911 L
327.876 198.523 L
328.245 199.295 L
328.612 198.451 L
328.976 198.149 L
329.337 198.143 L
329.695 198.223 L
330.051 198.533 L
330.404 200.037 L
330.754 199.341 L
331.102 199.763 L
331.447 200.182 L
331.789 199.909 L
332.129 199.993 L
332.466 200.463 L
332.802 200.222 L
333.134 200.067 L
333.464 200.883 L
333.792 202.016 L
334.118 201.578 L
334.441 201.628 L
334.762 201.871 L
335.081 201.533 L
335.398 202.622 L
335.713 202.534 L
336.025 201.812 L
336.335 203.489 L
336.644 202.996 L
336.95 203.096 L
337.254 202.287 L
337.557 202.401 L
337.857 202.766 L
338.155 203.648 L
338.452 203.063 L
338.746 203.062 L
339.024 203.155 L
S
GR
GS
[1.00013 0 0 1 0 0] CT
1 GC
N
414.5 205.5 M
617.5 205.5 L
617.5 19 L
414.5 19 L
cp
f
GR
GS
[1.00013 0 0 1 0 0] CT
0.149 GC
2 setlinecap
1 LJ
0.5 LW
N
414.5 205.5 M
617.5 205.5 L
S
GR
GS
[1.00013 0 0 1 0 0] CT
0.149 GC
2 setlinecap
1 LJ
0.5 LW
N
414.5 205.5 M
414.5 203.47 L
S
GR
GS
[1.00013 0 0 1 0 0] CT
0.149 GC
2 setlinecap
1 LJ
0.5 LW
N
516 205.5 M
516 203.47 L
S
GR
GS
[1.00013 0 0 1 0 0] CT
0.149 GC
2 setlinecap
1 LJ
0.5 LW
N
617.5 205.5 M
617.5 203.47 L
S
GR
GS
[1.00013 0 0 1 414.55264 211.09987] CT
0.149 GC
/Helvetica 18 F
GS
[1 0 0 1 0 0] CT
-5.5 18 moveto 
1 -1 scale
(0) t 
GR
GR
GS
[1.00013 0 0 1 516.06553 211.09987] CT
0.149 GC
/Helvetica 18 F
GS
[1 0 0 1 0 0] CT
-13 18 moveto 
1 -1 scale
(0.1) t 
GR
GR
GS
[1.00013 0 0 1 617.57842 211.09987] CT
0.149 GC
/Helvetica 18 F
GS
[1 0 0 1 0 0] CT
-13 18 moveto 
1 -1 scale
(0.2) t 
GR
GR
GS
[1.00013 0 0 1 516.06565 233.60008] CT
0.149 GC
/Helvetica 18 F
GS
[1 0 0 1 0 0] CT
-72.5 18 moveto 
1 -1 scale
(Frequency \(log10\)) t 
GR
GR
GS
[1.00013 0 0 1 0 0] CT
0.149 GC
2 setlinecap
1 LJ
0.5 LW
N
414.5 205.5 M
414.5 19 L
S
GR
GS
[1.00013 0 0 1 0 0] CT
0.149 GC
2 setlinecap
1 LJ
0.5 LW
N
414.5 205.5 M
416.53 205.5 L
S
GR
GS
[1.00013 0 0 1 0 0] CT
0.149 GC
2 setlinecap
1 LJ
0.5 LW
N
414.5 143.333 M
416.53 143.333 L
S
GR
GS
[1.00013 0 0 1 0 0] CT
0.149 GC
2 setlinecap
1 LJ
0.5 LW
N
414.5 81.167 M
416.53 81.167 L
S
GR
GS
[1.00013 0 0 1 0 0] CT
0.149 GC
2 setlinecap
1 LJ
0.5 LW
N
414.5 19 M
416.53 19 L
S
GR
GS
[1.00013 0 0 1 408.95192 205.49994] CT
0.149 GC
/Helvetica 18 F
GS
[1 0 0 1 0 0] CT
-33 7 moveto 
1 -1 scale
(-7.6) t 
GR
GR
GS
[1.00013 0 0 1 408.95192 143.33333] CT
0.149 GC
/Helvetica 18 F
GS
[1 0 0 1 0 0] CT
-33 7 moveto 
1 -1 scale
(-7.5) t 
GR
GR
GS
[1.00013 0 0 1 408.95192 81.16673] CT
0.149 GC
/Helvetica 18 F
GS
[1 0 0 1 0 0] CT
-33 7 moveto 
1 -1 scale
(-7.4) t 
GR
GR
GS
[1.00013 0 0 1 408.95192 19.00012] CT
0.149 GC
/Helvetica 18 F
GS
[1 0 0 1 0 0] CT
-33 7 moveto 
1 -1 scale
(-7.3) t 
GR
GR
GS
[0 -1 1.00013 0 373.44741 112.24988] CT
0.149 GC
/Helvetica 18 F
GS
[1 0 0 1 0 0] CT
-71 -4 moveto 
1 -1 scale
(Power \(log10; Hz\)) t 
GR
GR
GS
[1.00013 0 0 1 0 0] CT
0.02 0.443 0.69 RC
1 LJ
3 LW
N
414.5 47.923 M
593.233 200.587 L
602.318 205.522 L
S
GR
GS
[1.00013 0 0 1 0 0] CT
0.573 0.773 0.871 RC
1 LJ
3 LW
N
414.5 44.892 M
593.233 197.767 L
606.561 205.522 L
S
GR
GS
[1.00013 0 0 1 0 0] CT
0.957 0.647 0.51 RC
1 LJ
3 LW
N
414.5 52.974 M
593.233 194.163 L
612.764 205.522 L
S
GR
GS
[1.00013 0 0 1 0 0] CT
0.792 0 0.125 RC
1 LJ
3 LW
N
414.5 54.107 M
593.233 196.38 L
608.058 205.522 L
S
GR
GS
[1.00013 0 0 1 0 0] CT
1 GC
N
693 205.5 M
896 205.5 L
896 19 L
693 19 L
cp
f
GR
GS
[1.00013 0 0 1 0 0] CT
0.149 GC
2 setlinecap
1 LJ
0.5 LW
N
693 205.5 M
896 205.5 L
S
GR
GS
[1.00013 0 0 1 0 0] CT
0.149 GC
2 setlinecap
1 LJ
0.5 LW
N
693 205.5 M
693 203.47 L
S
GR
GS
[1.00013 0 0 1 0 0] CT
0.149 GC
2 setlinecap
1 LJ
0.5 LW
N
743.75 205.5 M
743.75 203.47 L
S
GR
GS
[1.00013 0 0 1 0 0] CT
0.149 GC
2 setlinecap
1 LJ
0.5 LW
N
794.5 205.5 M
794.5 203.47 L
S
GR
GS
[1.00013 0 0 1 0 0] CT
0.149 GC
2 setlinecap
1 LJ
0.5 LW
N
845.25 205.5 M
845.25 203.47 L
S
GR
GS
[1.00013 0 0 1 693.08801 211.10011] CT
0.149 GC
/Helvetica 18 F
GS
[1 0 0 1 0 0] CT
-13 18 moveto 
1 -1 scale
(1.5) t 
GR
GR
GS
[1.00013 0 0 1 743.84445 211.10011] CT
0.149 GC
/Helvetica 18 F
GS
[1 0 0 1 0 0] CT
-13 18 moveto 
1 -1 scale
(1.6) t 
GR
GR
GS
[1.00013 0 0 1 794.6009 211.10011] CT
0.149 GC
/Helvetica 18 F
GS
[1 0 0 1 0 0] CT
-13 18 moveto 
1 -1 scale
(1.7) t 
GR
GR
GS
[1.00013 0 0 1 845.35734 211.10011] CT
0.149 GC
/Helvetica 18 F
GS
[1 0 0 1 0 0] CT
-13 18 moveto 
1 -1 scale
(1.8) t 
GR
GR
GS
[1.00013 0 0 1 794.60096 233.60002] CT
0.149 GC
/Helvetica 18 F
GS
[1 0 0 1 0 0] CT
-72.5 18 moveto 
1 -1 scale
(Frequency \(log10\)) t 
GR
GR
GS
[1.00013 0 0 1 0 0] CT
0.149 GC
2 setlinecap
1 LJ
0.5 LW
N
693 205.5 M
693 19 L
S
GR
GS
[1.00013 0 0 1 0 0] CT
0.149 GC
2 setlinecap
1 LJ
0.5 LW
N
693 205.5 M
695.03 205.5 L
S
GR
GS
[1.00013 0 0 1 0 0] CT
0.149 GC
2 setlinecap
1 LJ
0.5 LW
N
693 143.334 M
695.03 143.334 L
S
GR
GS
[1.00013 0 0 1 0 0] CT
0.149 GC
2 setlinecap
1 LJ
0.5 LW
N
693 81.167 M
695.03 81.167 L
S
GR
GS
[1.00013 0 0 1 0 0] CT
0.149 GC
2 setlinecap
1 LJ
0.5 LW
N
693 19 M
695.03 19 L
S
GR
GS
[1.00013 0 0 1 687.48732 205.49988] CT
0.149 GC
/Helvetica 18 F
GS
[1 0 0 1 0 0] CT
-33 7 moveto 
1 -1 scale
(-9.2) t 
GR
GR
GS
[1.00013 0 0 1 687.48732 143.33357] CT
0.149 GC
/Helvetica 18 F
GS
[1 0 0 1 0 0] CT
-33 7 moveto 
1 -1 scale
(-9.1) t 
GR
GR
GS
[1.00013 0 0 1 687.48732 81.16666] CT
0.149 GC
/Helvetica 18 F
GS
[1 0 0 1 0 0] CT
-18 7 moveto 
1 -1 scale
(-9) t 
GR
GR
GS
[1.00013 0 0 1 687.48732 18.99976] CT
0.149 GC
/Helvetica 18 F
GS
[1 0 0 1 0 0] CT
-33 7 moveto 
1 -1 scale
(-8.9) t 
GR
GR
GS
[0 -1 1.00013 0 651.98281 112.24953] CT
0.149 GC
/Helvetica 18 F
GS
[1 0 0 1 0 0] CT
-71 -4 moveto 
1 -1 scale
(Power \(log10; Hz\)) t 
GR
GR
GS
[1.00013 0 0 1 0 0] CT
0.02 0.443 0.69 RC
1 LJ
3 LW
N
692.976 30.023 M
695.614 22.569 L
699.031 31.459 L
702.396 41.72 L
705.71 46.559 L
708.976 45.54 L
712.193 41.681 L
715.365 41.574 L
718.491 43.437 L
721.574 56.184 L
724.614 59.444 L
727.612 60.182 L
730.571 60.939 L
733.49 63.028 L
736.371 64.771 L
739.215 68.143 L
742.023 69.345 L
744.795 66.868 L
747.533 79.198 L
750.238 77.41 L
752.909 74.595 L
755.549 76.248 L
758.157 80.053 L
760.735 88.488 L
763.283 89.41 L
765.802 85.767 L
768.293 88.464 L
770.755 94.324 L
773.191 95.264 L
775.6 98.977 L
777.982 102.015 L
780.34 97.469 L
782.672 104.204 L
784.98 105.975 L
787.264 96.741 L
789.524 103.57 L
791.762 107.154 L
793.977 113.575 L
796.17 122.242 L
798.342 116.593 L
800.492 118.905 L
802.622 118.75 L
804.731 117.183 L
806.82 118.89 L
808.89 125.827 L
810.94 125.574 L
812.971 122.692 L
814.984 134.515 L
816.979 129.782 L
818.955 123.423 L
820.915 125.502 L
822.857 129.108 L
824.781 137.314 L
826.69 141.734 L
828.582 141.015 L
830.457 138.438 L
832.317 136.88 L
834.162 121.231 L
835.991 139.769 L
837.805 145.491 L
839.604 150.039 L
841.389 144.271 L
843.159 147.388 L
844.915 149.134 L
846.658 147.9 L
848.386 154.941 L
850.102 158.385 L
851.804 154.131 L
853.492 151.96 L
855.169 161.855 L
856.832 158.959 L
858.483 163.202 L
860.122 166.829 L
861.748 163.709 L
863.363 167.779 L
864.966 168.504 L
866.557 172.117 L
868.137 174.613 L
869.706 167.221 L
871.264 169.338 L
872.81 171.895 L
874.346 170.168 L
875.872 180.599 L
877.386 182.985 L
878.891 172.991 L
880.385 177.934 L
881.869 180.95 L
883.344 186.321 L
884.808 185.711 L
886.263 184.91 L
887.708 179.667 L
889.144 188.11 L
890.571 187.782 L
891.988 192.731 L
893.396 191.317 L
894.796 189.693 L
896.024 189.494 L
S
GR
GS
[1.00013 0 0 1 0 0] CT
0.573 0.773 0.871 RC
1 LJ
3 LW
N
692.976 24.16 M
695.614 26.235 L
699.031 27.266 L
702.396 25.745 L
705.71 27.468 L
708.976 36.221 L
712.193 42.494 L
715.365 43.094 L
718.491 46.143 L
721.574 41.899 L
724.614 47.252 L
727.612 56.955 L
730.571 54.47 L
733.49 57.681 L
736.371 62.899 L
739.215 60.267 L
742.023 69.91 L
744.795 66.617 L
747.533 73.81 L
750.238 72.537 L
752.909 72.522 L
755.549 80.66 L
758.157 75.885 L
760.735 76.597 L
763.283 82.776 L
765.802 92.237 L
768.293 85.751 L
770.755 87.635 L
773.191 86.886 L
775.6 85.875 L
777.982 85.831 L
780.34 93.4 L
782.672 98.686 L
784.98 100.895 L
787.264 94.793 L
789.524 92.53 L
791.762 104.833 L
793.977 101.108 L
796.17 108.277 L
798.342 104.185 L
800.492 105.531 L
802.622 112.53 L
804.731 113.437 L
806.82 120.977 L
808.89 120.71 L
810.94 115.629 L
812.971 123.947 L
814.984 121.02 L
816.979 122.589 L
818.955 122.197 L
820.915 121.049 L
822.857 126.918 L
824.781 127.585 L
826.69 124.894 L
828.582 124.907 L
830.457 130.705 L
832.317 140.745 L
834.162 108.784 L
835.991 127.369 L
837.805 140.3 L
839.604 144.97 L
841.389 139.609 L
843.159 147.277 L
844.915 147.56 L
846.658 147.941 L
848.386 146.419 L
850.102 142.887 L
851.804 147.963 L
853.492 155.084 L
855.169 150.692 L
856.832 161.48 L
858.483 153.84 L
860.122 148.509 L
861.748 149.666 L
863.363 157.776 L
864.966 160.713 L
866.557 158.153 L
868.137 162.787 L
869.706 165.415 L
871.264 166.892 L
872.81 164.98 L
874.346 169.04 L
875.872 166.951 L
877.386 162.841 L
878.891 176.322 L
880.385 179.182 L
881.869 178.384 L
883.344 176.448 L
884.808 178.923 L
886.263 179.75 L
887.708 178.236 L
889.144 180.803 L
890.571 189.5 L
891.988 184.113 L
893.396 183.711 L
894.796 182.939 L
896.024 183.996 L
S
GR
GS
[1.00013 0 0 1 0 0] CT
0.957 0.647 0.51 RC
1 LJ
3 LW
N
692.976 20.926 M
695.614 24.907 L
699.031 21.185 L
702.396 26.184 L
705.71 27.778 L
708.976 31.672 L
712.193 44.985 L
715.365 44.637 L
718.491 46.389 L
721.574 50.677 L
724.614 49.579 L
727.612 48.353 L
730.571 52.435 L
733.49 59.855 L
736.371 50.862 L
739.215 60.208 L
742.023 60.895 L
744.795 65.42 L
747.533 68.846 L
750.238 66.884 L
752.909 70.914 L
755.549 68.622 L
758.157 76.945 L
760.735 83.664 L
763.283 76.635 L
765.802 77.981 L
768.293 82.175 L
770.755 84.888 L
773.191 82.977 L
775.6 88.301 L
777.982 86.913 L
780.34 91.28 L
782.672 99.795 L
784.98 104.093 L
787.264 102.644 L
789.524 102.593 L
791.762 107.922 L
793.977 100.39 L
796.17 106.668 L
798.342 114.184 L
800.492 114.806 L
802.622 108.64 L
804.731 102.935 L
806.82 108.27 L
808.89 113.51 L
810.94 113.01 L
812.971 113.495 L
814.984 124.404 L
816.979 125.229 L
818.955 119.867 L
820.915 120.987 L
822.857 120.582 L
824.781 123.781 L
826.69 124.47 L
828.582 126.797 L
830.457 127.187 L
832.317 126.863 L
834.162 109.572 L
835.991 135.322 L
837.805 130.461 L
839.604 129.883 L
841.389 138.72 L
843.159 140.273 L
844.915 140.769 L
846.658 144.765 L
848.386 146.399 L
850.102 142.591 L
851.804 140.047 L
853.492 150.021 L
855.169 148.081 L
856.832 152.521 L
858.483 147.168 L
860.122 146.007 L
861.748 157.39 L
863.363 160.051 L
864.966 156.073 L
866.557 163.266 L
868.137 152.953 L
869.706 155.187 L
871.264 157.946 L
872.81 160.877 L
874.346 165.307 L
875.872 159.333 L
877.386 165.225 L
878.891 175.195 L
880.385 176.169 L
881.869 172.494 L
883.344 171.733 L
884.808 172.235 L
886.263 171.113 L
887.708 171.3 L
889.144 175.428 L
890.571 185.026 L
891.988 190.366 L
893.396 191.789 L
894.796 188.859 L
896.024 185.866 L
S
GR
GS
[1.00013 0 0 1 0 0] CT
0.792 0 0.125 RC
1 LJ
3 LW
N
692.976 20.376 M
695 18.978 L
S
GR
GS
[1.00013 0 0 1 0 0] CT
0.792 0 0.125 RC
1 LJ
3 LW
N
699.081 18.978 M
702.396 24.559 L
705.71 27.375 L
708.976 36.708 L
712.193 37.824 L
715.365 44.781 L
718.491 45.452 L
721.574 46.825 L
724.614 50.502 L
727.612 57.379 L
730.571 56.116 L
733.49 68.431 L
736.371 72.16 L
739.215 59.888 L
742.023 70.654 L
744.795 73.125 L
747.533 69.392 L
750.238 68.484 L
752.909 74.962 L
755.549 81.141 L
758.157 78.471 L
760.735 80.918 L
763.283 77.583 L
765.802 86.951 L
768.293 89.05 L
770.755 96.21 L
773.191 93.171 L
775.6 89.67 L
777.982 97.565 L
780.34 98.381 L
782.672 94.98 L
784.98 98.832 L
787.264 101.027 L
789.524 104.082 L
791.762 106.831 L
793.977 105.947 L
796.17 104.892 L
798.342 105.226 L
800.492 113.505 L
802.622 109.694 L
804.731 114.31 L
806.82 105.673 L
808.89 117.903 L
810.94 119.563 L
812.971 112.216 L
814.984 125.456 L
816.979 122.906 L
818.955 125.246 L
820.915 125.729 L
822.857 125.38 L
824.781 128.08 L
826.69 131.396 L
828.582 126.697 L
830.457 127.209 L
832.317 136.781 L
834.162 121.061 L
835.991 140.928 L
837.805 141.889 L
839.604 136.356 L
841.389 142.051 L
843.159 146.513 L
844.915 152.138 L
846.658 145.988 L
848.386 143.784 L
850.102 143.737 L
851.804 144.322 L
853.492 146.586 L
855.169 157.55 L
856.832 152.472 L
858.483 155.55 L
860.122 158.601 L
861.748 156.617 L
863.363 157.229 L
864.966 160.655 L
866.557 158.896 L
868.137 157.767 L
869.706 163.715 L
871.264 171.976 L
872.81 168.784 L
874.346 169.142 L
875.872 170.917 L
877.386 168.449 L
878.891 176.39 L
880.385 175.75 L
881.869 170.49 L
883.344 182.714 L
884.808 179.119 L
886.263 179.849 L
887.708 173.95 L
889.144 174.783 L
890.571 177.439 L
891.988 183.873 L
893.396 179.606 L
894.796 179.599 L
896.024 180.228 L
S
GR
GS
[1.00013 0 0 1 737.09359 119.75] CT
/Helvetica 18 F
GS
[1 0 0 1 0 0] CT
0 7 moveto 
1 -1 scale
(1) t 
GR
GR
GS
[1.00013 0 0 1 0 0] CT
0.02 0.443 0.69 RC
1 LJ
3 LW
N
704 119.75 M
734 119.75 L
S
GR
GS
[1.00013 0 0 1 737.09359 141.75] CT
/Helvetica 18 F
GS
[1 0 0 1 0 0] CT
0 7 moveto 
1 -1 scale
(2) t 
GR
GR
GS
[1.00013 0 0 1 0 0] CT
0.573 0.773 0.871 RC
1 LJ
3 LW
N
704 141.75 M
734 141.75 L
S
GR
GS
[1.00013 0 0 1 737.09359 163.75] CT
/Helvetica 18 F
GS
[1 0 0 1 0 0] CT
0 7 moveto 
1 -1 scale
(3) t 
GR
GR
GS
[1.00013 0 0 1 0 0] CT
0.957 0.647 0.51 RC
1 LJ
3 LW
N
704 163.75 M
734 163.75 L
S
GR
GS
[1.00013 0 0 1 737.09359 185.75] CT
/Helvetica 18 F
GS
[1 0 0 1 0 0] CT
0 7 moveto 
1 -1 scale
(4) t 
GR
GR
GS
[1.00013 0 0 1 0 0] CT
0.792 0 0.125 RC
1 LJ
3 LW
N
704 185.75 M
734 185.75 L
S
GR
%%Trailer
%%Pages: 1
%%EOF
