{"freq_range": [2.0, 80.0], "freq_res": 0.5, "aperiodic_params_": [-7.763807352943188, 0.7041216129850684], "gaussian_params_": [[8.817995773608775, 0.47241367654960476, 0.8104404635231028], [11.552943717724068, 0.34326368089898185, 0.7507578138326337], [17.009101795290064, 0.2631700948071132, 1.6950556394393919], [22.023644447881303, 0.1951430249087306, 2.2949690519940296], [38.19761785436078, 0.16616696432548697, 0.33499673874322183], [51.68306017115912, 0.10739306170114132, 1.0247622423275415], [56.80852964490431, 0.12457170644426106, 0.5288950116631657], [63.20239188878639, 0.17847508964292802, 0.25000000000000006], [70.00394717713695, 0.13405495203404993, 1.4252812099506451], [74.89598667604274, 0.14058579306066543, 0.5968133373175342], [76.72024407292845, 0.2264705313414493, 0.25000000000000006]], "peak_params_": [[8.817995773608775, 0.4617120791449274, 1.6208809270462057], [11.552943717724068, 0.345732519493561, 1.5015156276652675], [17.009101795290064, 0.2809434358749865, 3.3901112788787837], [22.023644447881303, 0.19858170829525612, 4.589938103988059], [38.19761785436078, 0.13963003456081324, 0.6699934774864437], [51.68306017115912, 0.10569314503740657, 2.049524484655083], [56.80852964490431, 0.11667050055641504, 1.0577900233263313], [63.20239188878639, 0.12860621922544624, 0.5000000000000001], [70.00394717713695, 0.13405443796181693, 2.8505624199012902], [74.89598667604274, 0.13875469289799902, 1.1936266746350683], [76.72024407292845, 0.1574321130700138, 0.5000000000000001]], "r_squared_": 0.9658610337801897, "error_": 0.03995819888212347}
{"freq_range": [2.0, 80.0], "freq_res": 0.5, "aperiodic_params_": [-7.721489183317941, 0.6716446826328685], "gaussian_params_": [[8.848782667606676, 0.4197113871097283, 0.8133150099169797], [11.635971720855542, 0.2886794979380465, 0.7217640948684939], [17.93888068972852, 0.2776678414168976, 2.231933524772459], [21.453768917236285, 0.20145248537307853, 0.2906414128882946], [22.43050284318388, 0.1774538237434676, 0.25000000000000006], [23.310546383403185, 0.1555679845628833, 0.25000000000000006], [25.39929795442577, 0.10036797996795702, 1.9802486028587787], [41.98077236030726, 0.09908227015115854, 2.4516959190440395], [45.73872502657248, 0.1733356872327255, 0.25000000000000006], [76.6367260903673, 0.15523487394190258, 0.25000000000000006]], "peak_params_": [[8.848782667606676, 0.41297707114945936, 1.6266300198339594], [11.635971720855542, 0.2899980614449582, 1.4435281897369878], [17.93888068972852, 0.2776570399002445, 4.463867049544918], [21.453768917236285, 0.2912918350004343, 0.5812828257765892], [22.43050284318388, 0.24062319127409815, 0.5000000000000001], [23.310546383403185, 0.19257921962550206, 0.5000000000000001], [25.39929795442577, 0.10113248424350729, 3.9604972057175574], [41.98077236030726, 0.09907922311212936, 4.903391838088079], [45.73872502657248, 0.14523681407909272, 0.5000000000000001], [76.6367260903673, 0.1336717403226313, 0.5000000000000001]], "r_squared_": 0.9603415431403276, "error_": 0.04262156793712922}
{"freq_range": [2.0, 80.0], "freq_res": 0.5, "aperiodic_params_": [-8.42885212577227, 0.626830978544814], "gaussian_params_": [[8.97321821566473, 0.26419394938892865, 0.8896370991906597], [11.35241696619934, 0.2714996166929711, 0.42704215240023014], [17.12874633529123, 0.343105105996316, 2.2749556446655217], [19.19484058423054, 0.14429964884678217, 0.25000000000000006], [20.703773754000256, 0.2063403938173056, 0.9269174535618905], [22.663278452232273, 0.27868266255710483, 0.5175196931111576], [25.377084481991453, 0.11091490014260819, 1.8030580583630205], [29.416520704491372, 0.1607784316953752, 0.25000000000000006], [38.248587959053125, 0.16626309391387684, 1.0105427863359606], [69.07674412594069, 0.1719908126752103, 0.4879082676806963]], "peak_params_": [[8.97321821566473, 0.2646537995877374, 1.7792741983813194], [11.35241696619934, 0.2765136487236308, 0.8540843048004603], [17.12874633529123, 0.34262877600943575, 4.549911289331043], [19.19484058423054, 0.38944754966333406, 0.5000000000000001], [20.703773754000256, 0.31875514083794165, 1.853834907123781], [22.663278452232273, 0.3488967917911534, 1.0350393862223153], [25.377084481991453, 0.11105155471218353, 3.606116116726041], [29.416520704491372, 0.1601812713604147, 0.5000000000000001], [38.248587959053125, 0.16130787271814562, 2.0210855726719212], [69.07674412594069, 0.16987632208800818, 0.9758165353613926]], "r_squared_": 0.9634361139343908, "error_": 0.04018295626578478}
{"freq_range": [2.0, 80.0], "freq_res": 0.5, "aperiodic_params_": [-8.354223827427573, 0.7998259393122896], "gaussian_params_": [[8.76169203968232, 0.5311537144948987, 0.7308257833771898], [11.473659577892741, 0.3911147673670818, 0.746039282884523], [17.08388303768349, 0.33526481419799053, 1.7873782956197664], [20.234456106006967, 0.25827190615546913, 0.25000000000000006], [22.414648183044985, 0.2929813921076158, 1.0788782044345808], [56.910036449911566, 0.12787797066322912, 0.5767285428038377], [63.13299659014882, 0.12267147862760223, 0.25000000000000006], [68.90264647952088, 0.1523954201529119, 0.5308751592311429], [74.22601729956799, 0.05762194406279704, 5.999999999999999], [75.44735048769238, 0.10622317917729239, 0.6403972022086943]], "peak_params_": [[8.76169203968232, 0.505268159434241, 1.4616515667543797], [11.473659577892741, 0.39389335731369, 1.492078565769046], [17.08388303768349, 0.33489680136135824, 3.5747565912395327], [20.234456106006967, 0.2789063924423587, 0.5000000000000001], [22.414648183044985, 0.2954662758259712, 2.1577564088691616], [56.910036449911566, 0.1272663861222849, 1.1534570856076753], [63.13299659014882, 0.11649503649582549, 0.5000000000000001], [68.90264647952088, 0.18928647376965557, 1.0617503184622858], [74.22601729956799, 0.06584216122082687, 11.999999999999998], [75.44735048769238, 0.1622023524187739, 1.2807944044173887]], "r_squared_": 0.9777412210588335, "error_": 0.039031098697660534}
{"freq_range": [2.0, 80.0], "freq_res": 0.5, "aperiodic_params_": [-8.090671169727395, 0.9027632521000687], "gaussian_params_": [[8.777610846127109, 0.3166428795270311, 1.057276956838166], [11.690247126812132, 0.29877558969497303, 0.5012607926241753], [12.759176180384713, 0.10438247857288847, 0.3566361213890544], [16.976279785369755, 0.32670878100901357, 1.570662391527777], [22.161892350870886, 0.3002329302665534, 2.0462054238156915], [51.137441883396335, 0.1490729582481301, 0.25000000000000006], [73.60343763549913, 0.13259621988411663, 2.553463892446601], [78.99947991889417, 0.11696686769373263, 0.530217600818479]], "peak_params_": [[8.777610846127109, 0.3097160788177167, 2.114553913676332], [11.690247126812132, 0.2904715364655228, 1.0025215852483507], [12.759176180384713, 0.10631795344343153, 0.7132722427781087], [16.976279785369755, 0.3391329451086005, 3.141324783055554], [22.161892350870886, 0.30125669843116043, 4.092410847631383], [51.137441883396335, 0.1281643812199249, 0.5000000000000001], [73.60343763549913, 0.13248747202360356, 5.106927784893202], [78.99947991889417, 0.13117785508188362, 1.060435201636958]], "r_squared_": 0.9825158637558846, "error_": 0.03741796349046561}
{"freq_range": [2.0, 80.0], "freq_res": 0.5, "aperiodic_params_": [-8.09376535077067, 0.5628069380143612], "gaussian_params_": [[2.287035558234136, 0.31799642075406037, 0.49745563846373264], [8.920455813817831, 0.3993815810356231, 0.6891131062360545], [11.599136983007536, 0.23544847177011008, 0.6164280068641688], [18.173007108465644, 0.24232321661141235, 2.1340340747710482], [21.386681853534153, 0.27533645509831955, 0.25000000016817053], [22.411374847606236, 0.1761514551711388, 0.25000000000003764], [23.325888181839563, 0.10735918889479908, 0.25000000000000006], [25.498425375294442, 0.11537774303336684, 2.262457404781105], [41.345613053936795, 0.13873605775293815, 1.92781578845662], [45.68802451146411, 0.1280210542896274, 0.4432503401013554], [48.42323320422918, 0.13563330188206485, 0.4831292333005178], [63.27525841276193, 0.19796950615693426, 0.25000000000000006]], "peak_params_": [[2.287035558234136, 0.2901511960305658, 0.9949112769274653], [8.920455813817831, 0.39678576192435777, 1.378226212472109], [11.599136983007536, 0.23460979729621378, 1.2328560137283375], [18.173007108465644, 0.24200339563577877, 4.2680681495420965], [21.386681853534153, 0.34477054856414924, 0.5000000003363411], [22.411374847606236, 0.24485906036437832, 0.5000000000000753], [23.325888181839563, 0.17310978877386418, 0.5000000000000001], [25.498425375294442, 0.11604546215579248, 4.52491480956221], [41.345613053936795, 0.13829188358532285, 3.85563157691324], [45.68802451146411, 0.13061340301007185, 0.8865006802027108], [48.42323320422918, 0.13407360569872928, 0.9662584666010356], [63.27525841276193, 0.1321638923647157, 0.5000000000000001]], "r_squared_": 0.9618603565706583, "error_": 0.038631721620903905}
{"freq_range": [2.0, 80.0], "freq_res": 0.5, "aperiodic_params_": [-8.163928029985732, 0.6756305107393787], "gaussian_params_": [[8.732904931066038, 0.8922769825667004, 0.6006415919118709], [11.074497358709799, 0.511356017115942, 0.6900580939937921], [12.747247823156302, 0.23455061397700117, 0.25000000000000006], [17.727354731714165, 0.3937481110805254, 3.4074786664581196], [27.86991350216014, 0.07296171278081427, 5.999999999999999], [53.72601729956798, 0.09735958015856522, 4.084922038751097]], "peak_params_": [[8.732904931066038, 0.8386055377978892, 1.2012831838237419], [11.074497358709799, 0.5665862359386153, 1.3801161879875843], [12.747247823156302, 0.32850384154285095, 0.5000000000000001], [17.727354731714165, 0.4092580458517183, 6.814957332916239], [27.86991350216014, 0.07712911063765304, 11.999999999999998], [53.72601729956798, 0.09721862437615059, 8.169844077502194]], "r_squared_": 0.9673600170070674, "error_": 0.05078502331489529}
{"freq_range": [2.0, 80.0], "freq_res": 0.5, "aperiodic_params_": [-8.736394949968014, 0.5321863703016609], "gaussian_params_": [[2.3905510746272642, 0.3102399198527396, 0.34805135150127103], [9.01440492760929, 0.3646515141583991, 0.6697174018970461], [11.21329510004923, 0.5305192562943752, 0.7350823227380395], [17.17020505012703, 0.3271948975017327, 3.0671210654645553], [21.69663044660256, 0.1627945832627923, 0.25000000000000006], [22.88484724157678, 0.07566951643504237, 0.4356844397713826], [23.595930801728112, 0.08455797250116633, 5.999999999999999], [34.054440942908016, 0.15331936980591823, 0.25000000000000006], [52.42598789723495, 0.10018639213564504, 4.494123264295783], [54.980372182054076, 0.14142865807938063, 0.25000000000000006]], "peak_params_": [[2.3905510746272642, 0.2954521147735871, 0.6961027030025421], [9.01440492760929, 0.3840745405353001, 1.3394348037940922], [11.21329510004923, 0.565735632309023, 1.470164645476079], [17.17020505012703, 0.37290087952993467, 6.134242130929111], [21.69663044660256, 0.3203209678978052, 0.5000000000000001], [22.88484724157678, 0.21095401479558262, 0.8713688795427652], [23.595930801728112, 0.15137521557358902, 11.999999999999998], [34.054440942908016, 0.1685527855276998, 0.5000000000000001], [52.42598789723495, 0.10017357940423643, 8.988246528591565], [54.980372182054076, 0.2260240986267057, 0.5000000000000001]], "r_squared_": 0.9607092409152511, "error_": 0.04499932779436892}
{"freq_range": [2.0, 80.0], "freq_res": 0.5, "aperiodic_params_": [-8.583144808319707, 0.8367421671241292], "gaussian_params_": [[7.506159362013193, 0.16369690131126416, 0.25000000000000006], [8.87089693218186, 0.32731068827223814, 0.4821793862939622], [11.409792349759943, 0.891112351702376, 0.7460944522014479], [13.704359430557844, 0.2570539143562168, 0.3961138732097749], [15.593081537839987, 0.4396305190753929, 0.8820086340052431], [17.686846026289587, 0.19174269277867304, 0.25000000000000006], [18.56789066390114, 0.27081112033373383, 1.1635436053584836], [22.484056413588156, 0.3805304594324928, 2.040282279422214], [46.328968038486714, 0.11468413150271528, 0.8214139644552492], [56.094447982305866, 0.13588226045437465, 1.0333098008988664], [63.54912441257263, 0.14218989260006637, 0.25000000000000006], [72.69842847546366, 0.14825743562536747, 1.1454839726498889], [74.77365914137239, 0.24570394457883724, 0.25000000000000006], [77.67173396463768, 0.09911736009040457, 1.331160795952575]], "peak_params_": [[7.506159362013193, 0.16939834714323787, 0.5000000000000001], [8.87089693218186, 0.320623711368075, 0.9643587725879244], [11.409792349759943, 0.8846324110879085, 1.4921889044028958], [13.704359430557844, 0.2689879895436693, 0.7922277464195498], [15.593081537839987, 0.4466607560889795, 1.7640172680104862], [17.686846026289587, 0.3844718861227303, 0.5000000000000001], [18.56789066390114, 0.32978801247142364, 2.327087210716967], [22.484056413588156, 0.3814157168495882, 4.080564558844428], [46.328968038486714, 0.11222486772627072, 1.6428279289104983], [56.094447982305866, 0.13531582520932872, 2.0666196017977327], [63.54912441257263, 0.13947115041362323, 0.5000000000000001], [72.69842847546366, 0.14610191855000743, 2.2909679452997778], [74.77365914137239, 0.19600828767988254, 0.5000000000000001], [77.67173396463768, 0.09831861733490754, 2.66232159190515]], "r_squared_": 0.9838514869175886, "error_": 0.03668611550037459}
{"freq_range": [2.0, 80.0], "freq_res": 0.5, "aperiodic_params_": [-8.032301606214752, 0.9434223426500399], "gaussian_params_": [[6.387151006265682, 0.13045792208961854, 0.25000000000000006], [8.31278957292526, 0.11783734205079177, 0.7542019187990555], [11.400625383145956, 0.44633637951444255, 0.4784867913554941], [15.32563132787366, 0.34883644223286847, 1.1216692052038488], [19.207162198475007, 0.413954134412423, 1.619004925109455], [22.845201493585336, 0.45417536164079697, 0.9792524355212904], [25.41670267884383, 0.2186468228581909, 0.6935757853473673], [28.884563585448692, 0.1587583497592156, 0.25000000000000006], [56.022678554172145, 0.15611829129088292, 0.6079486422203851], [72.66390761943244, 0.14643588904741545, 0.65622795632488], [74.74793396693596, 0.231510017674876, 0.25000000000000006], [77.06670948397246, 0.13085965668985888, 0.35376171318715294], [78.62225430779847, 0.10728236538676322, 0.8482860641539196]], "peak_params_": [[6.387151006265682, 0.12437963087130655, 0.5000000000000001], [8.31278957292526, 0.11426243947350301, 1.508403837598111], [11.400625383145956, 0.4378731155026152, 0.9569735827109882], [15.32563132787366, 0.3747373964182348, 2.2433384104076977], [19.207162198475007, 0.41241384524477454, 3.23800985021891], [22.845201493585336, 0.47566049534942856, 1.9585048710425808], [25.41670267884383, 0.2288070043433752, 1.3871515706947346], [28.884563585448692, 0.14270523350845465, 0.5000000000000001], [56.022678554172145, 0.15600970633513533, 1.2158972844407703], [72.66390761943244, 0.14193860344323284, 1.31245591264976], [74.74793396693596, 0.1445013040139571, 0.5000000000000001], [77.06670948397246, 0.14578690859323018, 0.7075234263743059], [78.62225430779847, 0.10620965346089228, 1.6965721283078392]], "r_squared_": 0.9830373049241499, "error_": 0.03955335502446594}
{"freq_range": [2.0, 80.0], "freq_res": 0.5, "aperiodic_params_": [-7.803580953822819, 1.071168486799653], "gaussian_params_": [[5.805885400499402, 0.08213203290430786, 0.6527873367289064], [8.30393481679826, 0.11819555012738014, 1.2682117291411554], [11.29223346420611, 0.24553147005464743, 0.41246259899182924], [18.343839154944078, 0.45128384102796265, 3.246502118961697], [21.963609192706045, 0.19011794393810272, 0.45106142079710243], [23.266093721831012, 0.30670839322157173, 0.5779933073889341], [25.413657265598243, 0.23357206924268104, 0.4900734484501189], [28.833581701425466, 0.21388538553844294, 0.32703785338955943], [57.7579552776932, 0.13702759683136334, 0.6167472396585576], [77.40799921388357, 0.14033248518617797, 0.7292090629934344], [79.6721038106039, 0.197813162980847, 0.34943750131560575]], "peak_params_": [[5.805885400499402, 0.10160314008737714, 1.3055746734578129], [8.30393481679826, 0.12135808566468853, 2.536423458282311], [11.29223346420611, 0.27013065678242754, 0.8249251979836585], [18.343839154944078, 0.45076206812518116, 6.493004237923394], [21.963609192706045, 0.4567036949445491, 0.9021228415942049], [23.266093721831012, 0.411135441989968, 1.1559866147778681], [25.413657265598243, 0.26990344861874327, 0.9801468969002378], [28.833581701425466, 0.18997606126480449, 0.6540757067791189], [57.7579552776932, 0.12687119989318418, 1.2334944793171152], [77.40799921388357, 0.13922003703966546, 1.4584181259868687], [79.6721038106039, 0.17750962893148525, 0.6988750026312115]], "r_squared_": 0.9891188590853541, "error_": 0.036238686535719496}
{"freq_range": [2.0, 80.0], "freq_res": 0.5, "aperiodic_params_": [-7.942378913765956, 0.9435622727902138], "gaussian_params_": [[11.285432953231519, 0.20280089870316653, 0.5122511863169544], [16.153744037267483, 0.31629295185311734, 1.1880357620804223], [19.957913760058723, 0.3594107867779178, 2.2833217423067085], [23.72600789177701, 0.2600194771180931, 1.1424813775304203], [26.068458354580702, 0.15206245208073235, 0.25000000284248436], [29.90912468330604, 0.12594459158613067, 1.3268653243144146], [33.98802137642551, 0.1175294247274532, 0.765480334225206], [36.40051327913384, 0.1753882863678076, 0.43869843167711114], [50.037332848932365, 0.12419886219518128, 0.2500000000122195], [71.98796912098074, 0.13492506303496635, 0.2500001268153556], [79.39642570538459, 0.1685013323279049, 0.3474252106087251]], "peak_params_": [[11.285432953231519, 0.1862919931430671, 1.0245023726339089], [16.153744037267483, 0.39366341962656115, 2.3760715241608446], [19.957913760058723, 0.36229962659184345, 4.566643484613417], [23.72600789177701, 0.36288401869162357, 2.2849627550608407], [26.068458354580702, 0.1948203312558192, 0.5000000056849687], [29.90912468330604, 0.12567244464079508, 2.6537306486288292], [33.98802137642551, 0.11860168928430248, 1.530960668450412], [36.40051327913384, 0.17147561128602007, 0.8773968633542223], [50.037332848932365, 0.12282174486855446, 0.500000000024439], [71.98796912098074, 0.1347689189715382, 0.5000002536307112], [79.39642570538459, 0.1611774582651755, 0.6948504212174502]], "r_squared_": 0.9830793149180108, "error_": 0.03898020468087193}
{"freq_range": [2.0, 80.0], "freq_res": 0.5, "aperiodic_params_": [-8.205942785455356, 0.6208411584441883], "gaussian_params_": [[11.256250105249167, 0.24508120440832534, 0.3908279927847117], [17.506430786660292, 0.7067935336344556, 2.9407534245985967], [20.705286121872852, 0.14054322374831543, 0.25000000000000006], [24.61459537903921, 0.39121382609875527, 1.757065001953834], [29.784930208735826, 0.4050135196512566, 1.6283424755399567], [33.475683259978695, 0.1798805580511854, 0.6972177199696327], [36.98064522866426, 0.4075691041552414, 3.919587955141186], [44.87429385416151, 0.2116904868920339, 0.3671106974555834], [52.22601729956798, 0.11792868880441736, 3.674773541919282]], "peak_params_": [[11.256250105249167, 0.2895487589926251, 0.7816559855694234], [17.506430786660292, 0.7069012970346584, 5.881506849197193], [20.705286121872852, 0.5465869939714665, 0.5000000000000001], [24.61459537903921, 0.4368354444589766, 3.514130003907668], [29.784930208735826, 0.48860436944293895, 3.2566849510799134], [33.475683259978695, 0.484543557411909, 1.3944354399392653], [36.98064522866426, 0.40760879906258296, 7.839175910282372], [44.87429385416151, 0.26695724685127153, 0.7342213949111668], [52.22601729956798, 0.11796995028844215, 7.349547083838564]], "r_squared_": 0.9604617082681618, "error_": 0.054453160535649144}
{"freq_range": [2.0, 80.0], "freq_res": 0.5, "aperiodic_params_": [-8.311743188404288, 0.5585015680840499], "gaussian_params_": [[9.122397381855007, 0.2878627057870321, 0.29963235598054033], [11.200490755387088, 0.338292013044105, 0.41576370476040325], [17.43855028253402, 0.6656238768348417, 3.038694125058947], [20.644379747072808, 0.10536082737357898, 0.25000000000000006], [24.55612891761397, 0.28880199130461076, 1.42509642023668], [29.662202041352497, 0.21110174834611706, 1.6550384585047564], [35.53906469725887, 0.330882762493462, 5.999997282913541], [36.05474349792871, 0.05941496684386006, 0.25000000000000006], [44.984175412518795, 0.16436529580685452, 0.25000000000000006]], "peak_params_": [[9.122397381855007, 0.2789193202549445, 0.5992647119610807], [11.200490755387088, 0.3717606652315748, 0.8315274095208065], [17.43855028253402, 0.6690937442380545, 6.077388250117894], [20.644379747072808, 0.5092075909895666, 0.5000000000000001], [24.55612891761397, 0.39583614917469134, 2.85019284047336], [29.662202041352497, 0.41042999320429807, 3.310076917009513], [35.53906469725887, 0.3363616905328968, 11.999994565827082], [36.05474349792871, 0.38805336174171323, 0.5000000000000001], [44.984175412518795, 0.2594840327268759, 0.5000000000000001]], "r_squared_": 0.9479543448996253, "error_": 0.05726496998359489}
{"freq_range": [2.0, 80.0], "freq_res": 0.5, "aperiodic_params_": [-8.764356743220585, 0.5908182575108223], "gaussian_params_": [[2.344116824507479, 0.37320296962803917, 0.40725904677563785], [9.11086853981117, 0.5725230239989967, 0.6851938756165424], [11.277581375337673, 0.4142830839208046, 0.41778221375294633], [16.863817649769416, 0.3318286566020354, 2.4995483346474776], [21.444118551486987, 0.21457818286334496, 0.293070082841174], [23.772701780044592, 0.18866325581895554, 2.771862900399757], [44.92662554208663, 0.16398269572155494, 0.3342756071005412], [56.922559361279895, 0.19412133289238465, 0.37513319090360253], [63.16234601297432, 0.20982945103456402, 0.25000000000000006], [70.02618881492016, 0.10891810541447905, 1.576970539480761]], "peak_params_": [[2.344116824507479, 0.3468419571938579, 0.8145180935512757], [9.11086853981117, 0.5674303946658537, 1.3703877512330849], [11.277581375337673, 0.394052133964486, 0.8355644275058927], [16.863817649769416, 0.340871074803621, 4.999096669294955], [21.444118551486987, 0.4049278247855863, 0.586140165682348], [23.772701780044592, 0.19366580056042615, 5.543725800799514], [44.92662554208663, 0.16007943352460785, 0.6685512142010824], [56.922559361279895, 0.19002880692766055, 0.7502663818072051], [63.16234601297432, 0.16994529311075546, 0.5000000000000001], [70.02618881492016, 0.10890308697973161, 3.153941078961522]], "r_squared_": 0.9667951790142165, "error_": 0.04042673950272232}
{"freq_range": [2.0, 80.0], "freq_res": 0.5, "aperiodic_params_": [-7.775102530241296, 0.763445709388883], "gaussian_params_": [[8.711597105082237, 0.9523933023034029, 0.5858806657348297], [11.249568013487304, 0.849963588208581, 0.796698844171198], [12.75279295024641, 0.20808328725340777, 1.6573686712507159], [17.402590515776325, 0.42844323058604805, 1.8559179791767868], [21.418457042507853, 0.17114062624171356, 0.25000000000000006], [23.694541912051022, 0.16497638740453435, 1.6045212539773537], [45.541267943763934, 0.16928008591129404, 0.3604445051247789]], "peak_params_": [[8.711597105082237, 0.9022042439855928, 1.1717613314696593], [11.249568013487304, 0.9297971965588623, 1.593397688342396], [12.75279295024641, 0.30754457216985287, 3.3147373425014317], [17.402590515776325, 0.4313904003057427, 3.7118359583535736], [21.418457042507853, 0.2644731873648709, 0.5000000000000001], [23.694541912051022, 0.16570934193823383, 3.2090425079547074], [45.541267943763934, 0.16817422051066266, 0.7208890102495578]], "r_squared_": 0.9788888985708512, "error_": 0.04520186798958087}
{"freq_range": [2.0, 80.0], "freq_res": 0.5, "aperiodic_params_": [-8.43967280125966, 0.6068138339159698], "gaussian_params_": [[8.837245142646426, 0.6047539488943967, 0.6261545176406654], [11.15343872063347, 0.9847516268369659, 0.7329120428957504], [12.81586595898763, 0.2136639024108484, 0.25000000000000006], [17.557061604329657, 0.4512730631164849, 2.4688803626286084], [24.724350873290494, 0.1280605923647315, 2.448872950557267], [32.62516413314366, 0.13600763185519438, 0.25000000000000006], [34.165712293371506, 0.15686412371122074, 0.3392965014807695], [36.80717415338833, 0.14485885616331692, 0.3741664079853169], [39.57635188433524, 0.13437501203666824, 0.4235117481289886], [49.268589136590954, 0.1571921469371056, 0.6081449059204967], [52.172486934383706, 0.1410190713838722, 0.8615919384650039], [54.8192357623423, 0.1454321725684333, 0.5012880399728531], [57.134388579990635, 0.10046631269329231, 0.7692447413149734], [69.06769399449719, 0.14796294371981553, 0.25000000000000006], [71.61365363649963, 0.12952874995596902, 0.2630007235720808]], "peak_params_": [[8.837245142646426, 0.5989202923540073, 1.2523090352813309], [11.15343872063347, 0.9782241024791798, 1.4658240857915008], [12.81586595898763, 0.2862602725338963, 0.5000000000000001], [17.557061604329657, 0.4528029886066882, 4.937760725257217], [24.724350873290494, 0.13617718043412452, 4.897745901114534], [32.62516413314366, 0.1208160751137708, 0.5000000000000001], [34.165712293371506, 0.139326219244996, 0.678593002961539], [36.80717415338833, 0.12684574074458865, 0.7483328159706338], [39.57635188433524, 0.13220894083919, 0.8470234962579772], [49.268589136590954, 0.14736235433371547, 1.2162898118409935], [52.172486934383706, 0.13822786257182784, 1.7231838769300079], [54.8192357623423, 0.13906347947477649, 1.0025760799457062], [57.134388579990635, 0.09895611810340554, 1.538489482629947], [69.06769399449719, 0.1426368724325453, 0.5000000000000001], [71.61365363649963, 0.11798170218989057, 0.5260014471441616]], "r_squared_": 0.9815005351145422, "error_": 0.03316093038195028}
{"freq_range": [2.0, 80.0], "freq_res": 0.5, "aperiodic_params_": [-8.591458590691031, 0.6917170993760605], "gaussian_params_": [[8.732271407614249, 0.2537181685702343, 0.8856273116166758], [11.398581840983814, 0.5772363116024569, 0.5331749330071227], [14.983835284698158, 0.18539885468834336, 2.480263262140689], [15.559346596550439, 0.10613404217553718, 0.25000000000000006], [18.82262571998464, 0.3681049589218347, 1.6663822593998734], [23.51589011935529, 0.443563866031045, 1.9697643299195682], [45.81233777920511, 0.19990061321985314, 0.25000000000000006]], "peak_params_": [[8.732271407614249, 0.2512242051863307, 1.7712546232333517], [11.398581840983814, 0.6379647465439149, 1.0663498660142454], [14.983835284698158, 0.22062218209666895, 4.960526524281378], [15.559346596550439, 0.33515159510313985, 0.5000000000000001], [18.82262571998464, 0.4480355046203037, 3.3327645187997468], [23.51589011935529, 0.4512236286177185, 3.9395286598391364], [45.81233777920511, 0.1508194515366572, 0.5000000000000001]], "r_squared_": 0.9707585121275961, "error_": 0.044817362258268184}
{"freq_range": [2.0, 80.0], "freq_res": 0.5, "aperiodic_params_": [-8.153339434512855, 0.8762101903323252], "gaussian_params_": [[7.296313692036808, 0.25464059660505145, 0.43766411107762304], [8.859350008828377, 0.3299728868634531, 0.5768883788580857], [11.445296374111074, 0.651021921528943, 0.6047086797009112], [13.81897953875788, 0.20324501941324766, 0.7387218897855166], [15.397081975613347, 0.16048356534352545, 0.25000000000000006], [18.18358015100661, 0.4744654214228324, 2.3570286611380484], [23.14822272068969, 0.5598264812820376, 1.8861861878570676], [24.04795833948028, 0.08048075318830565, 5.704549144396832], [73.06162923377214, 0.1425848402936913, 0.4493143421021633]], "peak_params_": [[7.296313692036808, 0.25026833928627745, 0.8753282221552461], [8.859350008828377, 0.323344697977074, 1.1537767577161715], [11.445296374111074, 0.6655233211563321, 1.2094173594018225], [13.81897953875788, 0.31258311419757767, 1.4774437795710331], [15.397081975613347, 0.43719898708954297, 0.5000000000000001], [18.18358015100661, 0.5324078754655712, 4.714057322276097], [23.14822272068969, 0.6960492141410324, 3.772372375714135], [24.04795833948028, 0.6086236680530721, 11.409098288793665], [73.06162923377214, 0.14124985873348805, 0.8986286842043266]], "r_squared_": 0.9847162966658275, "error_": 0.044354539594013725}
{"freq_range": [2.0, 80.0], "freq_res": 0.5, "aperiodic_params_": [-7.680987091278149, 1.1269464674806877], "gaussian_params_": [[8.7151363169649, 0.22213122548021752, 1.0513818189263413], [11.439931199775797, 0.3400339233036404, 0.6166591427900185], [17.297421630460814, 0.6663271107047246, 3.200559716249311], [23.942612200272297, 0.5680496876161504, 2.2115744949476097], [50.016345848244825, 0.13862509272877171, 0.25000009360918757]], "peak_params_": [[8.7151363169649, 0.23277535288354656, 2.1027636378526826], [11.439931199775797, 0.4742629053115692, 1.233318285580037], [17.297421630460814, 0.6731520142933203, 6.401119432498622], [23.942612200272297, 0.6422220307420421, 4.423148989895219], [50.016345848244825, 0.13832909909611502, 0.5000001872183751]], "r_squared_": 0.9861679453567761, "error_": 0.049304763593449624}
{"freq_range": [2.0, 80.0], "freq_res": 0.5, "aperiodic_params_": [-7.936952833014681, 1.0144351287210454], "gaussian_params_": [[9.024902923363424, 0.26029688147792474, 1.4327749081734207], [11.407245253814267, 0.3107418280704246, 0.6183322256182093], [16.164509935989813, 0.5052215864249329, 2.024731950686076], [20.47113601554463, 0.49916384338359127, 1.6625363488028546], [24.13073243100722, 0.6349083110565719, 1.598018744873154], [56.923315558702036, 0.15412654514355117, 0.2856882024081919], [75.24490563928737, 0.12627709652217928, 0.9237741884843896]], "peak_params_": [[9.024902923363424, 0.26138163873670806, 2.8655498163468414], [11.407245253814267, 0.40136980115447507, 1.2366644512364187], [16.164509935989813, 0.5169786867248813, 4.049463901372152], [20.47113601554463, 0.5981818761365663, 3.3250726976057092], [24.13073243100722, 0.6855412305438247, 3.196037489746308], [56.923315558702036, 0.14867300921687132, 0.5713764048163839], [75.24490563928737, 0.12191644170502336, 1.8475483769687793]], "r_squared_": 0.9894681187203443, "error_": 0.037975449937204246}
{"freq_range": [2.0, 80.0], "freq_res": 0.5, "aperiodic_params_": [-8.332539798602427, 0.6522760498540032], "gaussian_params_": [[9.408781076218641, 0.20588731452032932, 0.67815228749579], [11.170264363194084, 0.4209453597822621, 0.41834757264630085], [18.601250443792164, 0.6236449242379142, 3.8696961612090868], [24.510229784979384, 0.32158344861666627, 1.2700289089295733], [25.940361097908728, 0.16597880329441866, 0.25000000000000006], [27.619302821820106, 0.27551786393835176, 0.5023556517333969], [29.164716394240386, 0.32383507006940004, 0.5114486418787808], [30.654551032784106, 0.34383134425915396, 0.6172646352331354], [33.303881554172065, 0.2696269935788831, 1.2196266826977962], [35.91886788026063, 0.2546001838485976, 0.3527821248989028], [39.147354746494614, 0.26614270407157115, 1.844904177887997], [44.70548418294382, 0.14610464722206215, 1.135849610263883], [52.30854275663386, 0.175695355335047, 0.39128477782173327], [54.371130628897546, 0.1620316839107266, 1.0117939718189481]], "peak_params_": [[9.408781076218641, 0.24342253547762027, 1.35630457499158], [11.170264363194084, 0.4912015022559384, 0.8366951452926017], [18.601250443792164, 0.6234358934809698, 7.7393923224181735], [24.510229784979384, 0.5167229895958982, 2.5400578178591466], [25.940361097908728, 0.4247326838624641, 0.5000000000000001], [27.619302821820106, 0.33393800303379706, 1.0047113034667938], [29.164716394240386, 0.3412574154237866, 1.0228972837575616], [30.654551032784106, 0.3686601347884526, 1.2345292704662707], [33.303881554172065, 0.2690058047367483, 2.4392533653955923], [35.91886788026063, 0.33350941638294707, 0.7055642497978056], [39.147354746494614, 0.26530114718078757, 3.689808355775994], [44.70548418294382, 0.14768922835149922, 2.271699220527766], [52.30854275663386, 0.18517934243574707, 0.7825695556434665], [54.371130628897546, 0.16072275500718547, 2.0235879436378963]], "r_squared_": 0.9720917455763797, "error_": 0.04360605536640007}
{"freq_range": [2.0, 80.0], "freq_res": 0.5, "aperiodic_params_": [-8.611781864325467, 0.2103324901307367], "gaussian_params_": [[9.006051833258581, 0.15356923329018204, 0.25000000000000006], [11.208208699217847, 0.41282167966555905, 0.25000000000000006], [17.76326293015845, 0.5350062719870218, 3.186245762561661], [24.630704945334422, 0.19047541761978123, 0.8996845138786074], [25.847108131399647, 0.26581775225521, 0.25000000000000006], [27.558135358489526, 0.2514928198991316, 0.40395414052531226], [30.124513103855485, 0.34439048394308164, 1.5385522105957206], [33.42873105697374, 0.20357228538736222, 0.8842763052542306], [35.835702227344974, 0.2345129285558613, 0.45564873204136436], [37.18206294284774, 0.286079675683641, 0.25000000000000006], [39.478629675980656, 0.22679087232395806, 1.1534946783796622], [40.76852162380521, 0.07429652428756418, 0.25000000000000006], [43.324759190931154, 0.1804702785138148, 0.2843192846586278], [45.19680466230562, 0.21272959557798732, 0.25000000000000006], [47.357623409201544, 0.1458321940735309, 0.3191121122993168], [49.15907238785207, 0.21799129376797405, 0.3716079471901134], [50.218239175623445, 0.2625206193266142, 0.25000000000000006], [52.12136394896995, 0.14837844625262075, 0.4864435252168154], [55.506188037450016, 0.1262550703178223, 1.0485148520607286], [59.6681707095487, 0.17181381537409568, 0.25000000000000006], [61.67558663050968, 0.18725268897361372, 0.3866390685187343], [75.56214963021384, 0.1334520089761109, 0.2932535227050895]], "peak_params_": [[9.006051833258581, 0.16570783695298452, 0.5000000000000001], [11.208208699217847, 0.3480720901244023, 0.5000000000000001], [17.76326293015845, 0.5335315721407881, 6.372491525123322], [24.630704945334422, 0.24613929837717308, 1.7993690277572147], [25.847108131399647, 0.3088529883042739, 0.5000000000000001], [27.558135358489526, 0.33548468955757826, 0.8079082810506245], [30.124513103855485, 0.34371062487057813, 3.077104421191441], [33.42873105697374, 0.23395007307205695, 1.7685526105084612], [35.835702227344974, 0.22536378919685696, 0.9112974640827287], [37.18206294284774, 0.2510201063879496, 0.5000000000000001], [39.478629675980656, 0.22675214810174005, 2.3069893567593245], [40.76852162380521, 0.14343090253002444, 0.5000000000000001], [43.324759190931154, 0.14977026699371088, 0.5686385693172556], [45.19680466230562, 0.15605065596303014, 0.5000000000000001], [47.357623409201544, 0.1320264961331965, 0.6382242245986336], [49.15907238785207, 0.19890867037654658, 0.7432158943802268], [50.218239175623445, 0.1961987151966884, 0.5000000000000001], [52.12136394896995, 0.1443026392171447, 0.9728870504336308], [55.506188037450016, 0.12625287159358578, 2.097029704121457], [59.6681707095487, 0.1371138819218185, 0.5000000000000001], [61.67558663050968, 0.1689055012709293, 0.7732781370374686], [75.56214963021384, 0.13048841779624887, 0.586507045410179]], "r_squared_": 0.9077920965052626, "error_": 0.039068691436471896}
{"freq_range": [2.0, 80.0], "freq_res": 0.5, "aperiodic_params_": [-8.362344625242091, 0.4201823828691544], "gaussian_params_": [[2.3452588104334606, 0.28125611075427775, 0.2822615044011715], [8.88602601519016, 0.26597348381947494, 0.4533646215098722], [11.45824609580419, 0.5803971785248955, 0.7528091267150592], [18.044461853777943, 0.3041194062373182, 3.3669075713078276], [25.573151363657928, 0.16311483951089656, 0.4578861313138526], [28.488022448085164, 0.15684423628200372, 0.9406439633086067], [30.493739717540063, 0.14654150106315098, 0.3533427334115768], [31.81679570224054, 0.15662797273129647, 0.25000000000000006], [33.154301896457945, 0.1700530089774816, 0.41895898965375766], [36.96706654732949, 0.1567921621262484, 0.2702279581866092], [39.01416048448787, 0.1805000133463632, 0.5215024027338434], [40.902124093350935, 0.21624473508879158, 0.5607023444138837], [43.31963600871534, 0.1562951902518795, 0.25000000000000006], [45.63370182978818, 0.13485215527260022, 0.42737598705659713], [50.0183161932859, 0.11833328245806794, 0.9978018916878929], [52.45364270159093, 0.18168948688684103, 0.27283649202764587], [57.95286719758981, 0.11927652611409773, 0.4208078519214895], [61.48237172384248, 0.14165934925114163, 0.4148681550807098]], "peak_params_": [[2.3452588104334606, 0.24202065313759036, 0.564523008802343], [8.88602601519016, 0.26875037582379946, 0.9067292430197444], [11.45824609580419, 0.6254902787075824, 1.5056182534301183], [18.044461853777943, 0.30409289024110997, 6.733815142615655], [25.573151363657928, 0.18825571707405864, 0.9157722626277052], [28.488022448085164, 0.1592806334148804, 1.8812879266172133], [30.493739717540063, 0.16276561785681132, 0.7066854668231536], [31.81679570224054, 0.12378682854657974, 0.5000000000000001], [33.154301896457945, 0.1589216356726304, 0.8379179793075153], [36.96706654732949, 0.15573617123120975, 0.5404559163732184], [39.01416048448787, 0.1811188786713398, 1.0430048054676868], [40.902124093350935, 0.21310327788988204, 1.1214046888277673], [43.31963600871534, 0.12048684404347298, 0.5000000000000001], [45.63370182978818, 0.12841612650151113, 0.8547519741131943], [50.0183161932859, 0.11831334718811526, 1.9956037833757858], [52.45364270159093, 0.18445421300609155, 0.5456729840552917], [57.95286719758981, 0.11853069160770247, 0.841615703842979], [61.48237172384248, 0.14153152339164166, 0.8297363101614196]], "r_squared_": 0.9661539319300484, "error_": 0.028800361359942312}
{"freq_range": [2.0, 80.0], "freq_res": 0.5, "aperiodic_params_": [-7.9246136721011755, 0.7890000877010535], "gaussian_params_": [[8.66187526988485, 0.6591335782557131, 0.6097685715028658], [11.25081750531323, 1.2021039517726084, 0.8946204044605459], [15.039530070901979, 0.4859797061054969, 3.273157173959089], [19.38995557300981, 0.17676213508013663, 0.25000000000000006], [22.87127475894336, 0.2954550294627228, 2.39488113404266], [32.039164713714776, 0.17052479945718016, 0.25000000000000006]], "peak_params_": [[8.66187526988485, 0.7129939969240997, 1.2195371430057316], [11.25081750531323, 1.4272085465845716, 1.7892408089210918], [15.039530070901979, 0.4874616715980782, 6.546314347918178], [19.38995557300981, 0.4621629127200322, 0.5000000000000001], [22.87127475894336, 0.3202764203103321, 4.78976226808532], [32.039164713714776, 0.16865254094861193, 0.5000000000000001]], "r_squared_": 0.9869691425710452, "error_": 0.04118999865164354}
{"freq_range": [2.0, 80.0], "freq_res": 0.5, "aperiodic_params_": [-8.252362668147795, 0.8192072107199913], "gaussian_params_": [[8.820603192512543, 0.5444026735758526, 0.8274263285746241], [11.228450332351118, 1.6556392918891385, 0.8704222129884688], [13.830931717135059, 0.30806762933927, 0.8471220912603187], [17.568791906734994, 0.7417572839381411, 2.5889941868273936], [22.276980534835197, 0.46085485598831466, 0.8404864307996577], [24.836927454037813, 0.17858922006812528, 0.4329369109513069], [24.952034599991425, 0.22854316523491022, 2.954219341911741]], "peak_params_": [[8.820603192512543, 0.5973255052027824, 1.6548526571492481], [11.228450332351118, 1.6473826565247176, 1.7408444259769376], [13.830931717135059, 0.5994887657122305, 1.6942441825206374], [17.568791906734994, 0.751011246497665, 5.177988373654787], [22.276980534835197, 0.7277782188817383, 1.6809728615993154], [24.836927454037813, 0.40935257362238175, 0.8658738219026137], [24.952034599991425, 0.40935257362238175, 5.908438683823482]], "r_squared_": 0.9857027699199421, "error_": 0.05054491951697568}
{"freq_range": [2.0, 80.0], "freq_res": 0.5, "aperiodic_params_": [-8.136904619372984, 0.9361943115734113], "gaussian_params_": [[8.666711707696253, 0.45821960102990006, 0.9498052321652294], [11.140542281493035, 0.5799680104651631, 0.6581713160974403], [16.48094469748101, 0.9841649178026118, 3.280768788597475], [19.61834446740162, 0.16538189945987014, 0.783071710976841], [24.00547442576678, 0.6339768820027675, 2.347804030885686], [30.430333952218433, 0.11543458989282648, 1.6679443314909732]], "peak_params_": [[8.666711707696253, 0.5024562601123908, 1.8996104643304588], [11.140542281493035, 0.8331013296871514, 1.3163426321948806], [16.48094469748101, 0.9880354432328335, 6.56153757719495], [19.61834446740162, 0.9084998335898558, 1.566143421953682], [24.00547442576678, 0.7052431850785332, 4.695608061771372], [30.430333952218433, 0.12925964546202806, 3.3358886629819464]], "r_squared_": 0.9895085980620487, "error_": 0.04645201104200025}
{"freq_range": [2.0, 80.0], "freq_res": 0.5, "aperiodic_params_": [-7.913117289882782, 1.0246170772514689], "gaussian_params_": [[7.69024199449362, 0.2294472013705142, 0.25000000000056266], [8.985713933576726, 0.29546871996326957, 0.8120911930937027], [11.329761056608705, 0.4716489287259606, 0.6380193870429341], [16.495590678040095, 0.7595653847258836, 2.9916203445232803], [21.309481053998358, 0.41883694775750785, 1.8642515671302744], [24.57831954081751, 0.4442061861201164, 1.308513085741169], [26.452034599135946, 0.2490183184723045, 4.250770000369155]], "peak_params_": [[7.69024199449362, 0.2354685782922612, 0.5000000000011253], [8.985713933576726, 0.32899215978562957, 1.6241823861874054], [11.329761056608705, 0.6465092319024652, 1.2760387740858683], [16.495590678040095, 0.7906572799636695, 5.983240689046561], [21.309481053998358, 0.7583709690819713, 3.728503134260549], [24.57831954081751, 0.785529114997539, 2.617026171482338], [26.452034599135946, 0.4116122412673988, 8.50154000073831]], "r_squared_": 0.9895793297682332, "error_": 0.044234918013408966}
{"freq_range": [2.0, 80.0], "freq_res": 0.5, "aperiodic_params_": [-7.870218305438619, 1.0427373619341276], "gaussian_params_": [[8.715583323318784, 0.3158610694558878, 0.8875974030531778], [11.395836442045217, 0.4861630418246534, 0.6687812620137267], [17.39866229922691, 0.8408621459472311, 3.592146640346471], [24.684291322793474, 0.8523626885299772, 2.2938176280426776], [31.226017299567975, 0.1610088101387975, 3.354778232395725]], "peak_params_": [[8.715583323318784, 0.34581810998390594, 1.7751948061063556], [11.395836442045217, 0.7009744966422264, 1.3375625240274533], [17.39866229922691, 0.8468817960233963, 7.184293280692942], [24.684291322793474, 0.9903391103006083, 4.587635256085355], [31.226017299567975, 0.18054175353434943, 6.70955646479145]], "r_squared_": 0.9868599080255464, "error_": 0.053432286975675224}
{"freq_range": [2.0, 80.0], "freq_res": 0.5, "aperiodic_params_": [-7.696246663761662, 0.9665935031817489], "gaussian_params_": [[10.780127062439812, 0.26352435316755723, 1.5849233152279572], [16.900293560464988, 0.3069933386457416, 2.7138558169046583], [23.47998709121873, 0.554021552051222, 2.798921122647299], [30.67529376587216, 0.16444116341588016, 0.611181472494333], [53.51778544055447, 0.1542882474686175, 0.2500000000947624], [57.64311069817166, 0.12801532551412464, 0.7114645268199047], [73.05766685403505, 0.1721223173668955, 0.25000000007657935], [74.54988116617774, 0.164663697265343, 0.25000003624212774]], "peak_params_": [[10.780127062439812, 0.2899143634271919, 3.1698466304559143], [16.900293560464988, 0.3448904493633602, 5.4277116338093165], [23.47998709121873, 0.5699638591886007, 5.597842245294598], [30.67529376587216, 0.18166835234367973, 1.222362944988666], [53.51778544055447, 0.15389830860104325, 0.5000000001895248], [57.64311069817166, 0.125451525974011, 1.4229290536398094], [73.05766685403505, 0.16760359665319058, 0.5000000001531587], [74.54988116617774, 0.1614184753349548, 0.5000000724842555]], "r_squared_": 0.9782853242717772, "error_": 0.05174897032235551}
{"freq_range": [2.0, 80.0], "freq_res": 0.5, "aperiodic_params_": [-8.360140547537442, 0.7630935945950076], "gaussian_params_": [[11.083132074664343, 0.48935200873381923, 1.650223453349299], [16.19065031139672, 0.4343843097718297, 1.8401085514188698], [20.452102570504305, 0.6916354190471644, 4.48232543545584]], "peak_params_": [[11.083132074664343, 0.5717218481595872, 3.300446906698598], [16.19065031139672, 0.8601651891494342, 3.6802171028377395], [20.452102570504305, 0.7195813617176228, 8.96465087091168]], "r_squared_": 0.9850321978475934, "error_": 0.04528325519572599}
{"freq_range": [2.0, 80.0], "freq_res": 0.5, "aperiodic_params_": [-8.628530355665227, 0.6134802354528059], "gaussian_params_": [[8.517418586625999, 0.21235485321427366, 0.25000000000000006], [9.260189818917405, 0.18819405159197816, 0.33046111422586016], [10.862251095564229, 0.36120122889327994, 0.848413733432495], [17.37025326597322, 0.6993227471810681, 3.3900680336157434], [25.03556828982654, 0.2840281460895095, 0.38618054011136954], [32.54796540086398, 0.08092199767519626, 5.999999999999999], [50.27398270043202, 0.09839976616338755, 1.6067694740171197]], "peak_params_": [[8.517418586625999, 0.2555092922049873, 0.5000000000000001], [9.260189818917405, 0.29153760234967585, 0.6609222284517203], [10.862251095564229, 0.4762554238934431, 1.69682746686499], [17.37025326597322, 0.7022957538242274, 6.780136067231487], [25.03556828982654, 0.37506574952507776, 0.7723610802227391], [32.54796540086398, 0.08095248934216848, 11.999999999999998], [50.27398270043202, 0.09835180919282394, 3.2135389480342393]], "r_squared_": 0.9740632846044545, "error_": 0.04221221367614795}
{"freq_range": [2.0, 80.0], "freq_res": 0.5, "aperiodic_params_": [-8.189668491624877, 0.4926720118525948], "gaussian_params_": [[2.3399700926123197, 0.31309081051828974, 0.32957194398482725], [8.855911829615927, 0.29141611147158814, 0.4806883160817202], [11.25887732902976, 0.9253601240147098, 0.8592725046427413], [14.222656464201323, 0.25125203508158916, 1.3776596132867065], [18.394365639791435, 0.08236567764920223, 0.6723093517444068], [20.331823874057285, 0.2671642070550731, 4.0549666530925945], [39.236835025240104, 0.1322382084328569, 0.7072129761226579], [40.99008868333401, 0.21918427622116335, 0.4502897468874467], [47.72601729956798, 0.07031401134187439, 5.999999999999997], [52.61274170426678, 0.09680405288908288, 0.25000000000000006]], "peak_params_": [[2.3399700926123197, 0.27829044898696864, 0.6591438879696545], [8.855911829615927, 0.3134051889096945, 0.9613766321634404], [11.25887732902976, 0.95020684804813, 1.7185450092854826], [14.222656464201323, 0.33264342094052424, 2.755319226573413], [18.394365639791435, 0.3246307673000661, 1.3446187034888135], [20.331823874057285, 0.2675552695334158, 8.109933306185189], [39.236835025240104, 0.1494669253212546, 1.4144259522453158], [40.99008868333401, 0.2625541284678281, 0.9005794937748934], [47.72601729956798, 0.07026414146805138, 11.999999999999995], [52.61274170426678, 0.13867981227592097, 0.5000000000000001]], "r_squared_": 0.9713606101149558, "error_": 0.03905248007714585}
{"freq_range": [2.0, 80.0], "freq_res": 0.5, "aperiodic_params_": [-8.409605517781676, 0.5311114411489503], "gaussian_params_": [[8.872568343500276, 0.4178649902882203, 0.6332758837542132], [9.865173344910826, 0.2787667520393129, 0.25000002948183814], [11.277754332757752, 0.8176223501602031, 0.7258359351168235], [15.248402823878665, 0.45686222464256754, 3.745088788221384], [22.637068110420422, 0.16768644448163542, 0.3421824961465948], [22.904097847172874, 0.29030873410185426, 5.3603904412319165], [30.73527815781943, 0.2093729135169507, 0.2500000000000001], [35.92603060904435, 0.1989176952838416, 2.5127386166623107], [41.57189456114707, 0.09342534072707617, 1.1404136287434459], [47.31306615345095, 0.11997816084539917, 5.845581338636874]], "peak_params_": [[8.872568343500276, 0.5397631123347928, 1.2665517675084264], [9.865173344910826, 0.687465389967862, 0.5000000589636763], [11.277754332757752, 1.087312124149813, 1.451671870233647], [15.248402823878665, 0.5537470460812148, 7.490177576442768], [22.637068110420422, 0.514347320333501, 0.6843649922931896], [22.904097847172874, 0.4394730743699995, 10.720780882463833], [30.73527815781943, 0.26218856754133313, 0.5000000000000002], [35.92603060904435, 0.2319550662803298, 5.025477233324621], [41.57189456114707, 0.18411008012956565, 2.2808272574868917], [47.31306615345095, 0.11992965378967568, 11.691162677273748]], "r_squared_": 0.9683339160769231, "error_": 0.05058212447084391}
{"freq_range": [2.0, 80.0], "freq_res": 0.5, "aperiodic_params_": [-8.349828294945219, 0.7617818738067471], "gaussian_params_": [[8.738908160687291, 0.5841837660788918, 0.7430156831581272], [11.159092833311929, 1.1069139283673337, 0.7551211249910089], [16.92568005543262, 0.6610411120808853, 4.339856989621148], [22.271530680046165, 0.33144956080825266, 0.6890041428139037], [25.639373694843272, 0.09618579462548629, 5.999999999999998]], "peak_params_": [[8.738908160687291, 0.6590259188940895, 1.4860313663162543], [11.159092833311929, 1.353467416837426, 1.5102422499820178], [16.92568005543262, 0.6950556010955538, 8.679713979242296], [22.271530680046165, 0.6873195263093823, 1.3780082856278073], [25.639373694843272, 0.19005246036940981, 11.999999999999996]], "r_squared_": 0.985709232258097, "error_": 0.04590087558435886}
{"freq_range": [2.0, 80.0], "freq_res": 0.5, "aperiodic_params_": [-8.18291440331129, 0.9273421298798264], "gaussian_params_": [[14.533920112063955, 0.7038835183805835, 4.665949890627365], [21.678051898703917, 0.5203840226604398, 5.316635278151411], [22.89195205052118, 0.21280037354216327, 0.39686931081265064]], "peak_params_": [[14.533920112063955, 0.9130388559022808, 9.33189978125473], [21.678051898703917, 0.7514834628913647, 10.633270556302822], [22.89195205052118, 0.8453121978706193, 0.7937386216253013]], "r_squared_": 0.9807042267973041, "error_": 0.06253816209149562}
{"freq_range": [2.0, 80.0], "freq_res": 0.5, "aperiodic_params_": [-8.056254139336714, 0.9552925196886466], "gaussian_params_": [[8.301985654768524, 0.3563405553869853, 0.6451236010236129], [10.945380186755916, 0.5770904509187967, 1.0146814180704167], [12.547965400864056, 0.14775671349037653, 0.9533079355706653], [16.418622255836905, 0.835478976787101, 2.1136002847550297], [19.453608793269723, 0.2959368495112252, 0.7041671673878752], [22.668881426841264, 0.5440649232422845, 2.405642372617746], [27.710322581163418, 0.133839741917268, 5.999999999999999], [33.00794473433459, 0.1389249292964833, 0.25000000000000006]], "peak_params_": [[8.301985654768524, 0.3731306945223327, 1.2902472020472258], [10.945380186755916, 0.6498628132222244, 2.0293628361408333], [12.547965400864056, 0.4812786687283701, 1.9066158711413306], [16.418622255836905, 0.8786073388399025, 4.227200569510059], [19.453608793269723, 0.8649317197843125, 1.4083343347757504], [22.668881426841264, 0.6478621993169682, 4.811284745235492], [27.710322581163418, 0.20618297433069088, 11.999999999999998], [33.00794473433459, 0.22965079418780654, 0.5000000000000001]], "r_squared_": 0.9887943506278517, "error_": 0.04247531041602153}
{"freq_range": [2.0, 80.0], "freq_res": 0.5, "aperiodic_params_": [-8.014665696475268, 0.9977450698414284], "gaussian_params_": [[8.770598286716085, 0.39253657229896377, 1.0437820995720708], [11.298864227334208, 0.6058811222941302, 0.6797492377118736], [17.56705210547771, 0.7809640438737357, 3.59785627959338], [24.452266824155952, 0.40655718376725664, 3.46354379835843], [25.532692705346832, 0.09976268351997633, 0.25000000000000006], [31.016406699588767, 0.15566504999601857, 0.28013962040171697], [33.01127907085061, 0.19555028568769833, 0.853519764541654], [56.1375279582939, 0.18913089074989337, 0.2500000035725096], [57.010406857717, 0.1817278229743096, 0.2500000052407158]], "peak_params_": [[8.770598286716085, 0.43103822800190983, 2.0875641991441416], [11.298864227334208, 0.7815889129072318, 1.3594984754237471], [17.56705210547771, 0.835054327783487, 7.19571255918676], [24.452266824155952, 0.5285270749875757, 6.92708759671686], [25.532692705346832, 0.5559856716164333, 0.5000000000000001], [31.016406699588767, 0.23639392656638947, 0.5602792408034339], [33.01127907085061, 0.21495688768103882, 1.707039529083308], [56.1375279582939, 0.1626246774834783, 0.5000000071450192], [57.010406857717, 0.1820628575769625, 0.5000000104814316]], "r_squared_": 0.9890780778930416, "error_": 0.043175109536139254}
{"freq_range": [2.0, 80.0], "freq_res": 0.5, "aperiodic_params_": [-8.127526504641526, 0.9550950160999433], "gaussian_params_": [[8.95656764812131, 0.29034489065514063, 0.5974995585115624], [11.258149997170449, 0.4731277029181432, 0.7742593786756207], [16.40008299350694, 0.239668789200331, 0.8497620572281588], [19.570468035394565, 0.7964470132154761, 5.034289696648379], [26.362105988903984, 0.1565447334838156, 0.502369844712844], [30.06165865355098, 0.08292684176504866, 1.5894683877900322], [33.259932042775986, 0.22801364098197535, 0.4772314760643447], [57.08861631612215, 0.19207665575694707, 0.3404287325204892]], "peak_params_": [[8.95656764812131, 0.3841720779707405, 1.194999117023125], [11.258149997170449, 0.6709791553966511, 1.5485187573512413], [16.40008299350694, 0.8992895289346095, 1.6995241144563176], [19.570468035394565, 0.7966779252063407, 10.068579393296758], [26.362105988903984, 0.4663348504596563, 1.004739689425688], [30.06165865355098, 0.17601274980622428, 3.1789367755800644], [33.259932042775986, 0.22623082701643327, 0.9544629521286894], [57.08861631612215, 0.18567807944184622, 0.6808574650409784]], "r_squared_": 0.9837491274344308, "error_": 0.0521114378207592}
{"freq_range": [2.0, 80.0], "freq_res": 0.5, "aperiodic_params_": [-8.327674767291523, 0.8041073902017277], "gaussian_params_": [[9.097178154183931, 0.3530671490599481, 0.8917355785682969], [11.111490838145967, 0.3645150071048996, 0.5239565915936306], [17.19702168412691, 1.0196544352776782, 3.9146358366854255], [24.990155642644435, 0.17148701932004445, 0.4488113760627493], [26.952034599135946, 0.18023697349608905, 4.504561782185315], [75.40996644374312, 0.19597484829956116, 0.25000000000000006]], "peak_params_": [[9.097178154183931, 0.4650039976565168, 1.7834711571365938], [11.111490838145967, 0.6841900683012607, 1.0479131831872612], [17.19702168412691, 1.034064716317971, 7.829271673370851], [24.990155642644435, 0.47538801339965175, 0.8976227521254986], [26.952034599135946, 0.22456798456112637, 9.00912356437063], [75.40996644374312, 0.18366950902051116, 0.5000000000000001]], "r_squared_": 0.9881914674273334, "error_": 0.042233794946822535}
{"freq_range": [2.0, 80.0], "freq_res": 0.5, "aperiodic_params_": [-8.401680804733472, 0.6983804607401758], "gaussian_params_": [[8.982474445273688, 0.40816233063077945, 0.5837748426096117], [10.761797317128998, 0.21914935208011183, 0.6169337718301894], [17.37551569906972, 0.7572448111168063, 3.787902680952931], [24.734780047061758, 0.2613048202754531, 0.2500000640060069], [62.94068589264652, 0.1467334836257875, 0.25000000000000006], [72.37371779364173, 0.1717462052065499, 0.25000000000000006]], "peak_params_": [[8.982474445273688, 0.47739634192074476, 1.1675496852192233], [10.761797317128998, 0.3881350981697693, 1.2338675436603788], [17.37551569906972, 0.7568360019753921, 7.575805361905862], [24.734780047061758, 0.297264504970709, 0.5000001280120138], [62.94068589264652, 0.1426612013706574, 0.5000000000000001], [72.37371779364173, 0.15117532724738503, 0.5000000000000001]], "r_squared_": 0.9784355867406888, "error_": 0.043454029102812236}
{"freq_range": [2.0, 80.0], "freq_res": 0.5, "aperiodic_params_": [-8.355978147690484, 0.6520604043799182], "gaussian_params_": [[2.302871920151848, 0.20302903537707337, 0.4223281983651828], [8.91973190410794, 0.38824556220172246, 0.6105583385474372], [11.122379271957342, 0.9352041577259785, 0.822171702918423], [14.243405876598011, 0.4920230444760101, 1.7914644677467255], [20.569452417784124, 0.3721843777776607, 3.042017303574578], [42.54796540086405, 0.10612439819205385, 3.194736921635306], [64.45829701388517, 0.17013039716986003, 0.3665453992097405], [69.35861034580705, 0.2261363043185402, 0.25000000000000006]], "peak_params_": [[2.302871920151848, 0.18207418227567373, 0.8446563967303656], [8.91973190410794, 0.4253728639355643, 1.2211166770948745], [11.122379271957342, 1.0242597001717062, 1.644343405836846], [14.243405876598011, 0.5256921767151681, 3.582928935493451], [20.569452417784124, 0.3731924862922913, 6.084034607149156], [42.54796540086405, 0.1061124377658551, 6.389473843270612], [64.45829701388517, 0.16903284284045839, 0.733090798419481], [69.35861034580705, 0.192714469230312, 0.5000000000000001]], "r_squared_": 0.9770184260119019, "error_": 0.04603674379897584}
{"freq_range": [2.0, 80.0], "freq_res": 0.5, "aperiodic_params_": [-8.392304533957507, 0.7953125923191378], "gaussian_params_": [[8.761705161382174, 0.8208822587457408, 0.5862467554499587], [11.31819821880354, 0.7743868733027659, 0.8613917052008063], [16.590110991123716, 0.3670261262072665, 3.9103311426642517], [24.542167455405384, 0.15352225852352855, 0.38478191695482383], [42.6058297657432, 0.1439597046422849, 0.31457578436746303], [55.72601730054963, 0.04235930258770837, 5.999999999999999], [61.77398270043179, 0.04551218884494302, 4.8333543942475234], [72.3136486923425, 0.1443541187279814, 0.9725602792029819], [77.85117949389728, 0.15687254673995418, 0.41188519065010365]], "peak_params_": [[8.761705161382174, 0.8322971827804189, 1.1724935108999175], [11.31819821880354, 0.9146539560409046, 1.7227834104016126], [16.590110991123716, 0.3669286968521579, 7.8206622853285035], [24.542167455405384, 0.20004655907613333, 0.7695638339096477], [42.6058297657432, 0.13978622642692606, 0.6291515687349261], [55.72601730054963, 0.06192869258602407, 11.999999999999998], [61.77398270043179, 0.06998227350484854, 9.666708788495047], [72.3136486923425, 0.14645830326068854, 1.9451205584059639], [77.85117949389728, 0.14716541831473684, 0.8237703813002073]], "r_squared_": 0.9835338418547696, "error_": 0.037527084303250045}
{"freq_range": [2.0, 80.0], "freq_res": 0.5, "aperiodic_params_": [-8.530494416480058, 0.688064812232451], "gaussian_params_": [[7.352633106169705, 0.15734089992293065, 0.25000000000000006], [8.630390222549037, 0.5928022792516146, 0.5118221087094936], [11.13530481242115, 0.7124580589224617, 1.0731451080316181], [15.371250724647378, 0.48472104315014153, 1.6419180545214525], [18.8020505011811, 0.34385399899304275, 1.092817158048016], [22.089853735738867, 0.3199670169857879, 1.5616384928936775], [54.998835852275846, 0.21985375071952878, 0.41683940809417686], [56.1749202126807, 0.17920027658648266, 0.25000000000000006], [60.19094335079346, 0.13573531719075163, 0.8111525739631766]], "peak_params_": [[7.352633106169705, 0.18627624206939508, 0.5000000000000001], [8.630390222549037, 0.6088912236781177, 1.0236442174189873], [11.13530481242115, 0.7208397103830677, 2.1462902160632362], [15.371250724647378, 0.4870382803016682, 3.283836109042905], [18.8020505011811, 0.4256012229516273, 2.185634316096032], [22.089853735738867, 0.3243295141181548, 3.123276985787355], [54.998835852275846, 0.2198557590438348, 0.8336788161883537], [56.1749202126807, 0.15258068863451868, 0.5000000000000001], [60.19094335079346, 0.13202625213057573, 1.6223051479263533]], "r_squared_": 0.9759077765256318, "error_": 0.044630270878428226}
{"freq_range": [2.0, 80.0], "freq_res": 0.5, "aperiodic_params_": [-8.353821773304503, 0.8328872100547223], "gaussian_params_": [[16.804854006266783, 0.6462554399552014, 5.925315031338171]], "peak_params_": [[16.804854006266783, 0.6459050490346385, 11.850630062676341]], "r_squared_": 0.9731200137916903, "error_": 0.05947798835078196}
{"freq_range": [2.0, 80.0], "freq_res": 0.5, "aperiodic_params_": [-8.109291950399284, 0.9752827224568393], "gaussian_params_": [[9.237606840093862, 0.4224994667103235, 1.4656763483391044], [11.377183381162926, 0.45587442838278397, 0.5838567649265973], [17.87258638284797, 0.7029253029002834, 4.125304189900456], [22.023575943310192, 0.10821595277239944, 1.1351480121354498], [24.113740641057195, 0.18921170863006107, 0.25000000000000006], [69.8485755960917, 0.2118585409997987, 0.25000000000000006]], "peak_params_": [[9.237606840093862, 0.48666909949039905, 2.931352696678209], [11.377183381162926, 0.7874379624340353, 1.1677135298531947], [17.87258638284797, 0.7027924685823574, 8.250608379800912], [22.023575943310192, 0.5343203563123389, 2.2702960242708996], [24.113740641057195, 0.4276382713764004, 0.5000000000000001], [69.8485755960917, 0.1763523516511345, 0.5000000000000001]], "r_squared_": 0.9874635202122107, "error_": 0.04408960052879372}
{"freq_range": [2.0, 80.0], "freq_res": 0.5, "aperiodic_params_": [-8.169831381485192, 0.9184454661057885], "gaussian_params_": [[6.72601729956799, 0.16149735563899822, 0.3229120669135836], [9.06216213953405, 0.42258210137762064, 0.7833880669373094], [11.254814427974202, 0.5324918933181626, 0.6221790968444322], [17.365767245693267, 0.6477408503342826, 3.4847726522615505], [21.76209093534602, 0.09703920823462431, 0.25000000000000006], [23.63749967273512, 0.30333250414156143, 1.8407376812931235], [28.19117303208247, 0.19433316856094382, 0.3186903734426277]], "peak_params_": [[6.72601729956799, 0.13343444314416608, 0.6458241338271672], [9.06216213953405, 0.45830545984768634, 1.566776133874619], [11.254814427974202, 0.6531334710130814, 1.2443581936888644], [17.365767245693267, 0.6484295162598688, 6.969545304523101], [21.76209093534602, 0.5334423305675422, 0.5000000000000001], [23.63749967273512, 0.44006238190123703, 3.681475362586247], [28.19117303208247, 0.18677992425605439, 0.6373807468852554]], "r_squared_": 0.985500587768901, "error_": 0.04501298655844064}
{"freq_range": [2.0, 80.0], "freq_res": 0.5, "aperiodic_params_": [-8.228198568707306, 0.9055463254802232], "gaussian_params_": [[8.029281335624345, 0.12799018166796589, 0.25000000000000006], [9.062486598478703, 0.386272951756515, 0.5045198096997653], [11.13090883518856, 0.529179160682134, 0.6288870848535075], [17.397690516479273, 0.7059224466346202, 3.3422682465735716], [22.858591796784765, 0.23628488616810042, 1.2925434929654704], [25.155807306721975, 0.226661578470844, 0.5001808803813533], [27.94864031520923, 0.14803987234736843, 1.4703536975758933], [32.31669830432525, 0.10154127673497741, 0.7813060483064072], [34.4187071940625, 0.19427444973970337, 0.34350995707724674]], "peak_params_": [[8.029281335624345, 0.18272718205833272, 0.5000000000000001], [9.062486598478703, 0.4151439814713065, 1.0090396193995306], [11.13090883518856, 0.6310893118626204, 1.257774169707015], [17.397690516479273, 0.7056355677501092, 6.684536493147143], [22.858591796784765, 0.40865047011121014, 2.585086985930941], [25.155807306721975, 0.3487681359450754, 1.0003617607627067], [27.94864031520923, 0.15264571728753573, 2.9407073951517866], [32.31669830432525, 0.10004051026410465, 1.5626120966128143], [34.4187071940625, 0.19096479853760862, 0.6870199141544935]], "r_squared_": 0.9874917645722732, "error_": 0.038773901466426466}
{"freq_range": [2.0, 80.0], "freq_res": 0.5, "aperiodic_params_": [-8.364968750492888, 0.7162998296011615], "gaussian_params_": [[9.08016875180454, 0.4482696852803604, 0.4683648466865565], [11.166380679190413, 0.5983796190348774, 0.6343974328257896], [12.985577296660093, 0.12052955988652293, 0.2739333217745459], [17.413946094325315, 0.47324198098510206, 3.966634524928967]], "peak_params_": [[9.08016875180454, 0.4934019225740922, 0.936729693373113], [11.166380679190413, 0.706285951522851, 1.2687948656515793], [12.985577296660093, 0.38434460275007964, 0.5478666435490918], [17.413946094325315, 0.47313062874299305, 7.933269049857934]], "r_squared_": 0.9776391604878666, "error_": 0.04209711621439624}
{"freq_range": [2.0, 80.0], "freq_res": 0.5, "aperiodic_params_": [-8.522495152001861, 0.6079270161137393], "gaussian_params_": [[9.113794005479544, 0.49047883998530395, 0.4555754944991198], [11.052215073998932, 0.469227783988603, 0.61897367772036], [14.91663200919009, 0.30169704562412986, 2.746022509791391], [21.36541024850445, 0.18817945144653572, 1.0413069879980736], [62.54796532309319, 0.11992799115757236, 5.99999999593617], [64.6319585677193, 0.059786100350561276, 0.25000000001290795]], "peak_params_": [[9.113794005479544, 0.506952696848499, 0.9111509889982397], [11.052215073998932, 0.5767544802128697, 1.23794735544072], [14.91663200919009, 0.30155804242184026, 5.492045019582782], [21.36541024850445, 0.20365500268379932, 2.0826139759961473], [62.54796532309319, 0.11992415906604847, 11.99999999187234], [64.6319585677193, 0.16575779391785872, 0.5000000000258159]], "r_squared_": 0.9583001489062962, "error_": 0.04280010685113908}
{"freq_range": [2.0, 80.0], "freq_res": 0.5, "aperiodic_params_": [-8.24319180465594, 0.7594448477843951], "gaussian_params_": [[8.791390115875206, 0.5421359075968732, 0.636692971309881], [11.332814149937809, 0.9504143392819616, 0.8802268842346591], [16.48989264213205, 0.311104566130768, 3.982690038486901], [21.968512351775395, 0.17513895668463073, 0.25000000000000083], [24.697223372299934, 0.1902319811630732, 0.3426659144503891], [29.454839570956402, 0.1592271879772571, 0.6591395598072147]], "peak_params_": [[8.791390115875206, 0.5952431062451158, 1.273385942619762], [11.332814149937809, 1.075407437598762, 1.7604537684693182], [16.48989264213205, 0.3111035955493655, 7.965380076973802], [21.968512351775395, 0.29322628207324186, 0.5000000000000017], [24.697223372299934, 0.20236024011826537, 0.6853318289007782], [29.454839570956402, 0.16035258401336172, 1.3182791196144295]], "r_squared_": 0.9734481918097663, "error_": 0.04874209116006315}
{"freq_range": [2.0, 80.0], "freq_res": 0.5, "aperiodic_params_": [-8.450544517992405, 0.609628424471172], "gaussian_params_": [[8.725840713862413, 0.5407143442806049, 0.5442907206584215], [11.236649498758545, 0.865753034538114, 0.8591943463327961], [15.230941634298473, 0.26895077413413804, 3.5593335614103556], [23.726056101262383, 0.1137103988811156, 3.878020958942796], [29.10184659651524, 0.13239006151330407, 0.52244026906688], [32.69415481484955, 0.078388033539605, 0.7488252965959735], [38.27398270043178, 0.08154024722785762, 5.9999998021142416]], "peak_params_": [[8.725840713862413, 0.5465831995669568, 1.088581441316843], [11.236649498758545, 0.9668335834984774, 1.7183886926655922], [15.230941634298473, 0.2775324513255075, 7.118667122820711], [23.726056101262383, 0.13555059439273442, 7.756041917885592], [29.10184659651524, 0.19984531159915342, 1.04488053813376], [32.69415481484955, 0.13591340254066075, 1.497650593191947], [38.27398270043178, 0.08156262566342498, 11.999999604228483]], "r_squared_": 0.9715714238614981, "error_": 0.045461897908520794}
{"freq_range": [2.0, 80.0], "freq_res": 0.5, "aperiodic_params_": [-8.2058848589581, 0.8003528201918455], "gaussian_params_": [[7.198830001701762, 0.25909784437135297, 0.48001857889349414], [8.944047239420795, 0.30030366940844905, 0.46254244748310874], [11.138027442796758, 0.542398902402649, 1.0075340322433906], [14.938183341406543, 0.21608552710827686, 1.7184753453178727], [20.033877661409957, 0.22090217520927327, 3.9800030293607205], [32.95679389677172, 0.1449339921572872, 0.2943781943705491], [60.105305377602946, 0.13430484850399949, 0.36110209474526067], [64.59466243543817, 0.11949788596890487, 1.1107708344044336], [71.42888373399695, 0.14394139781328466, 1.242716189499034], [73.74883271258084, 0.2252745172993297, 0.25000000000000006], [75.60144934155672, 0.15886397981683545, 0.5682543421164633]], "peak_params_": [[7.198830001701762, 0.23900029905006548, 0.9600371577869883], [8.944047239420795, 0.3607087568316114, 0.9250848949662175], [11.138027442796758, 0.569792845068708, 2.015068064486781], [14.938183341406543, 0.31556824204113987, 3.4369506906357454], [20.033877661409957, 0.22371662953408133, 7.960006058721441], [32.95679389677172, 0.14447661617121987, 0.5887563887410981], [60.105305377602946, 0.12873669637605012, 0.7222041894905213], [64.59466243543817, 0.1190647515563743, 2.221541668808867], [71.42888373399695, 0.1437058965242155, 2.485432378998068], [73.74883271258084, 0.17334006037486205, 0.5000000000000001], [75.60144934155672, 0.1570249551526377, 1.1365086842329266]], "r_squared_": 0.9831609086974316, "error_": 0.03640547028153082}
{"freq_range": [2.0, 80.0], "freq_res": 0.5, "aperiodic_params_": [-8.04407902016655, 0.9596380698438942], "gaussian_params_": [[7.080851450516904, 0.3013523799631092, 0.8765941641004708], [9.056274122792004, 0.3309489264084588, 0.43678121388277436], [11.27003223453151, 0.44878601480013675, 0.9807656981797793], [17.054374724260775, 0.3197935420900871, 4.1159081909492246], [21.97886321112749, 0.09237218090240318, 0.25000000000000006], [23.389593988681092, 0.09715076116398264, 0.5719590800152127], [25.371986209968647, 0.1750184841634271, 0.3587492492400808], [46.41896656573998, 0.15190945400529385, 0.5303955928313506], [49.695612906902284, 0.17557410443202348, 0.25000000000000006], [60.3028046297329, 0.18413095516735412, 0.5915427363115053], [64.5447807568581, 0.17227336235308469, 0.7223917985671544], [66.41667359399995, 0.1348594956765604, 0.25000000000000006], [72.41134473796976, 0.12310147181625922, 0.866998755236553], [75.86347453790822, 0.2230543376401247, 0.863506517731787]], "peak_params_": [[7.080851450516904, 0.3162966787284489, 1.7531883282009415], [9.056274122792004, 0.43359244572437206, 0.8735624277655487], [11.27003223453151, 0.5652703862556514, 1.9615313963595586], [17.054374724260775, 0.3197656543785481, 8.231816381898449], [21.97886321112749, 0.25248448535235823, 0.5000000000000001], [23.389593988681092, 0.18918494207614422, 1.1439181600304253], [25.371986209968647, 0.2032866083463407, 0.7174984984801616], [46.41896656573998, 0.15014686248217046, 1.0607911856627013], [49.695612906902284, 0.12927552531035147, 0.5000000000000001], [60.3028046297329, 0.1741790282643887, 1.1830854726230107], [64.5447807568581, 0.17194268212583452, 1.4447835971343088], [66.41667359399995, 0.13199334784802197, 0.5000000000000001], [72.41134473796976, 0.12257276436082165, 1.733997510473106], [75.86347453790822, 0.2203072296936739, 1.727013035463574]], "r_squared_": 0.9887209289932459, "error_": 0.0352988169996908}
{"freq_range": [2.0, 80.0], "freq_res": 0.5, "aperiodic_params_": [-8.159763665360318, 0.9616194724758521], "gaussian_params_": [[6.19345824631608, 0.19087826006368788, 0.5484342783469447], [8.786322431461434, 0.2980039542989858, 1.1472295346960935], [11.429582983444059, 0.5869427561305974, 0.7448836151396564], [16.98736541860702, 0.36149226604037255, 2.7910558476602394], [19.563403908241728, 0.1381190342816763, 0.3906812219844854], [23.33936072960089, 0.13364450275944662, 1.5167744368575784], [39.009164718877884, 0.2426971856971026, 0.42147234758568203], [49.682645992913905, 0.2303723173451553, 0.25000000000000006], [56.367073062875, 0.16263190046977288, 0.3902987726471782], [61.195398292462656, 0.17269712686424657, 0.6579794834098682], [63.42102619208056, 0.11829255794434647, 0.25000000000000006], [66.42067831652219, 0.11334307577038018, 0.25000000000000006], [67.71100145453241, 0.10434953323071719, 1.596811238675482], [72.13943248585183, 0.2829097564452779, 0.5464169938288442], [75.22205162009759, 0.1475324520305299, 0.80363119780974], [77.27398270043201, 0.0864864887147804, 1.139002757226333], [79.57791342827888, 0.15732871120590874, 0.3419300075825656]], "peak_params_": [[6.19345824631608, 0.19512754091061346, 1.0968685566938894], [8.786322431461434, 0.30177529760250366, 2.294459069392187], [11.429582983444059, 0.6548204319029782, 1.4897672302793128], [16.98736541860702, 0.36151007883493236, 5.582111695320479], [19.563403908241728, 0.38279357085812293, 0.7813624439689708], [23.33936072960089, 0.15665404127392968, 3.033548873715157], [39.009164718877884, 0.2426398158711418, 0.8429446951713641], [49.682645992913905, 0.17641167062173935, 0.5000000000000001], [56.367073062875, 0.15346812467385185, 0.7805975452943564], [61.195398292462656, 0.16526278223509472, 1.3159589668197365], [63.42102619208056, 0.11613326377206512, 0.5000000000000001], [66.42067831652219, 0.18604958567714647, 0.5000000000000001], [67.71100145453241, 0.10345264848157676, 3.193622477350964], [72.13943248585183, 0.2767275191416658, 1.0928339876576885], [75.22205162009759, 0.15379773714301415, 1.60726239561948], [77.27398270043201, 0.08745595104870674, 2.278005514452666], [79.57791342827888, 0.1661070753809355, 0.6838600151651312]], "r_squared_": 0.9907172293038612, "error_": 0.029743570755617354}
{"freq_range": [2.0, 80.0], "freq_res": 0.5, "aperiodic_params_": [-7.947568344441482, 0.933529239639136], "gaussian_params_": [[9.205354558973832, 0.3329105708217094, 0.25000000000000006], [11.37633566309359, 0.7937118211129258, 1.0561604391186117], [15.636677164435064, 0.2841343760058064, 1.3058887138243378], [21.785189291384963, 0.12271268860503938, 1.3811843958671246], [53.200108681911324, 0.1536701181442732, 0.605013304397457], [55.01753156960765, 0.11094032650975265, 0.2500000000000043], [56.72473013979919, 0.15517982370224018, 0.25000000000000006], [60.95208074239377, 0.07586036616137558, 1.0892473109157912], [64.45203459913635, 0.09010018246655745, 5.999999999999999], [71.82030181782083, 0.1468390370251294, 0.39318226617157526], [79.82194810129607, 0.16076461232824685, 5.999999663015197]], "peak_params_": [[9.205354558973832, 0.30073274322729127, 0.5000000000000001], [11.37633566309359, 0.790171481445773, 2.1123208782372234], [15.636677164435064, 0.2829748294009189, 2.6117774276486756], [21.785189291384963, 0.12123949470738005, 2.762368791734249], [53.200108681911324, 0.16007420990966104, 1.210026608794914], [55.01753156960765, 0.13859000773478414, 0.5000000000000085], [56.72473013979919, 0.1411410614588835, 0.5000000000000001], [60.95208074239377, 0.15331662780052113, 2.1784946218315824], [64.45203459913635, 0.09664206196285718, 11.999999999999998], [71.82030181782083, 0.24184569844328863, 0.7863645323431505], [79.82194810129607, 0.16383136200802717, 11.999999326030395]], "r_squared_": 0.9778248346077965, "error_": 0.04077528232865343}
{"freq_range": [2.0, 80.0], "freq_res": 0.5, "aperiodic_params_": [-7.995875437201806, 0.8779843911092822], "gaussian_params_": [[10.864837536361923, 0.28480117584554726, 2.1261523945344636], [11.361989257047307, 0.46314893046469546, 0.45377322758314614], [12.782232436362268, 0.2681659636593513, 0.25000000000000006], [14.386332591516517, 0.13313960545676626, 0.4610069250454099], [16.384082577882218, 0.2525029211523872, 0.770370970364151], [17.674001323952925, 0.22235110745108072, 0.25000000000000006], [21.50566915033575, 0.19414769917196134, 0.6151102831408048], [49.16610417393102, 0.15137282704036287, 0.32171476240870067], [56.646238463665426, 0.17428701126674628, 0.46546403364153943], [60.41300855586743, 0.16346156100908632, 1.1159231881396334], [62.924304338892945, 0.15116048945215982, 0.28781502514200646], [65.78891765171632, 0.12251785232739965, 1.277677590561648], [71.04630094542561, 0.0977960035702835, 1.2072948240049144], [73.85177196747128, 0.10933522041630792, 0.25000000000000006], [79.82194810129607, 0.16241858036922915, 5.410594413380498]], "peak_params_": [[10.864837536361923, 0.621151416892955, 4.252304789068927], [11.361989257047307, 0.7145884116714569, 0.9075464551662923], [12.782232436362268, 0.35766000231311246, 0.5000000000000001], [14.386332591516517, 0.2078779157830457, 0.9220138500908198], [16.384082577882218, 0.2581627555613064, 1.540741940728302], [17.674001323952925, 0.26514378341636125, 0.5000000000000001], [21.50566915033575, 0.1941405040510613, 1.2302205662816097], [49.16610417393102, 0.13248355849711935, 0.6434295248174013], [56.646238463665426, 0.16625858671277527, 0.9309280672830789], [60.41300855586743, 0.1632652272563444, 2.231846376279267], [62.924304338892945, 0.16975558090845944, 0.5756300502840129], [65.78891765171632, 0.12708978552677763, 2.555355181123296], [71.04630094542561, 0.14074197411552447, 2.414589648009829], [73.85177196747128, 0.18765196482859103, 0.5000000000000001], [79.82194810129607, 0.16233065961604787, 10.821188826760997]], "r_squared_": 0.9758265555246997, "error_": 0.03821029941192371}
{"freq_range": [2.0, 80.0], "freq_res": 0.5, "aperiodic_params_": [-8.341549750612648, 0.6715070679364941], "gaussian_params_": [[9.258264987692922, 0.27234602520813506, 1.4029586753419345], [11.400820142482349, 0.5327690406046703, 0.7804971383144418], [14.480086125572699, 0.2636348356764417, 1.4860443256853466], [16.392869568896888, 0.2820407752170771, 0.27734065349383186], [18.673073222593352, 0.30580587345080257, 1.1072827078989238], [22.00592975128275, 0.21893319109055606, 0.2545653356806298], [23.13161404912855, 0.15925130534793383, 0.25000000000000006], [27.773982700432025, 0.10967130518974634, 3.8102541964628016], [37.07196616937789, 0.09793493846787836, 0.25000000000000006], [43.889351145604394, 0.08225938319452068, 5.799684036889448]], "peak_params_": [[9.258264987692922, 0.29674814141906225, 2.805917350683869], [11.400820142482349, 0.6397751393295987, 1.5609942766288836], [14.480086125572699, 0.26457144202815286, 2.9720886513706932], [16.392869568896888, 0.41238587518734704, 0.5546813069876637], [18.673073222593352, 0.31456206365140815, 2.2145654157978476], [22.00592975128275, 0.2570862388280819, 0.5091306713612596], [23.13161404912855, 0.1890508907915649, 0.5000000000000001], [27.773982700432025, 0.11140736963556108, 7.620508392925603], [37.07196616937789, 0.14043079194745367, 0.5000000000000001], [43.889351145604394, 0.08225706541356637, 11.599368073778896]], "r_squared_": 0.9776459760049059, "error_": 0.037644014903496406}
{"freq_range": [2.0, 80.0], "freq_res": 0.5, "aperiodic_params_": [-7.982782275329137, 0.8224307278890542], "gaussian_params_": [[7.047571481437411, 0.2175351965067011, 1.5587846564168837], [9.033986118018134, 0.08503214321991738, 0.2500000000000002], [10.195670829377363, 0.23696443533160802, 0.25000000000000006], [11.166623012789437, 0.412620366706867, 0.250000030417751], [11.818386377748785, 0.3461165147745022, 0.2500000197595756], [13.009498516799583, 0.18542886897869043, 0.4332495911188438], [16.292498329028497, 0.2618316159293735, 1.06267832496261], [18.220981450271143, 0.28571748948915343, 0.25000000000000006], [19.219396263872827, 0.258924462619383, 0.25000000000000006], [20.289292687010136, 0.16709577575051188, 0.25000000000000006], [44.522495482510585, 0.16254749598186632, 0.3533057257092653], [46.16505924373055, 0.19926559774666971, 0.5045489084452297], [49.68662533883795, 0.11057303484151958, 1.341365621417475], [53.802777201864494, 0.17868478237941404, 0.25000000000000006], [56.24610471031997, 0.22244561256129347, 0.25000000000000006], [60.72601729956798, 0.0881201790322128, 2.0731701540712297], [64.77772923615221, 0.1723355217665324, 0.2999026123262805], [66.35564362066359, 0.17159043452912956, 1.0166240139568312], [75.8962356323471, 0.23112512939249796, 0.8808065100721388], [77.83553072342305, 0.15792190549622556, 0.25000000000000006], [79.51272782339109, 0.19111026012693172, 0.2921382103969496]], "peak_params_": [[7.047571481437411, 0.2174339174778055, 3.1175693128337674], [9.033986118018134, 0.18353234798609108, 0.5000000000000004], [10.195670829377363, 0.21068666209281695, 0.5000000000000001], [11.166623012789437, 0.34215263747048397, 0.500000060835502], [11.818386377748785, 0.28119234557474293, 0.5000000395191512], [13.009498516799583, 0.1876928471303021, 0.8664991822376876], [16.292498329028497, 0.2568873893273409, 2.12535664992522], [18.220981450271143, 0.2653312628076776, 0.5000000000000001], [19.219396263872827, 0.1885939438145119, 0.5000000000000001], [20.289292687010136, 0.11724574831512946, 0.5000000000000001], [44.522495482510585, 0.16314113695855603, 0.7066114514185305], [46.16505924373055, 0.1914403175158892, 1.0090978168904594], [49.68662533883795, 0.10950803230593742, 2.68273124283495], [53.802777201864494, 0.13198690430351157, 0.5000000000000001], [56.24610471031997, 0.14357991643912094, 0.5000000000000001], [60.72601729956798, 0.08759807130379826, 4.1463403081424595], [64.77772923615221, 0.21200116750983966, 0.599805224652561], [66.35564362066359, 0.17169195690514272, 2.0332480279136624], [75.8962356323471, 0.22952687213838985, 1.7616130201442777], [77.83553072342305, 0.14053037409315117, 0.5000000000000001], [79.51272782339109, 0.1909825269293588, 0.5842764207938992]], "r_squared_": 0.9804652452127874, "error_": 0.031049004500139147}
{"freq_range": [2.0, 80.0], "freq_res": 0.5, "aperiodic_params_": [-8.143085922294292, 0.8152953029372751], "gaussian_params_": [[3.7454525054194345, 0.20942031592138802, 0.25000000000000006], [7.442855702445517, 0.31693791334497906, 1.920361666124826], [11.38843987655195, 0.635897446205651, 0.8285839839798862], [13.127963032224894, 0.22909644367218848, 0.25000000000000006], [16.426313648935412, 0.27141216268740365, 2.2966769230095574], [44.71525951090099, 0.21103630495340822, 0.25000000000000006], [45.81980194906659, 0.1802503626491667, 0.25000000000000006], [56.30964452171181, 0.30729723295569195, 0.25000000000000006], [60.693982957227604, 0.17519248661581008, 1.437339570766857], [62.06112473681578, 0.13159790443708602, 0.25000000000000006], [64.54731937397919, 0.08197033751317721, 0.6742803919982715], [66.7244163711396, 0.18806305762332529, 1.36397947080495], [69.47838642796815, 0.13705575512091164, 0.25328700348907596], [71.71569120502771, 0.2381266518894068, 0.6335210282852446], [76.44154077133045, 0.25211710244455515, 1.7078778854576844], [79.68199960714908, 0.20198242382951065, 0.25000000000000006]], "peak_params_": [[3.7454525054194345, 0.16784033519931185, 0.5000000000000001], [7.442855702445517, 0.3169504991495362, 3.840723332249652], [11.38843987655195, 0.6913791585021354, 1.6571679679597724], [13.127963032224894, 0.39090644195419166, 0.5000000000000001], [16.426313648935412, 0.27127719444012044, 4.593353846019115], [44.71525951090099, 0.14566915982906004, 0.5000000000000001], [45.81980194906659, 0.13901458900132724, 0.5000000000000001], [56.30964452171181, 0.23244806792470385, 0.5000000000000001], [60.693982957227604, 0.17360989479451483, 2.874679141533714], [62.06112473681578, 0.24419514403212972, 0.5000000000000001], [64.54731937397919, 0.13677658623301703, 1.348560783996543], [66.7244163711396, 0.18682242281881578, 2.7279589416099], [69.47838642796815, 0.16086892304525158, 0.5065740069781519], [71.71569120502771, 0.2289619109618375, 1.2670420565704892], [76.44154077133045, 0.25196945102173096, 3.4157557709153687], [79.68199960714908, 0.205688603662864, 0.5000000000000001]], "r_squared_": 0.9786962792858613, "error_": 0.0395870726440742}
