{"freq_range": [2.0, 80.0], "freq_res": 0.5, "aperiodic_params_": [-8.282098615464944, 0.654380408328311], "gaussian_params_": [[7.974730372911258, 0.5635265519353763, 0.5625308445160421], [9.550434334208422, 0.18081596922726242, 1.0137476736172992], [15.628926971227164, 0.10970101414695045, 3.3290921314410773], [18.62083567814421, 0.12600515582109828, 0.3346248194616921], [19.489318546593086, 0.1437611392773407, 0.25004546570055797], [22.593748518219776, 0.2178417528499121, 0.5563771605884105], [25.09730433009897, 0.29951938539234174, 1.4093210736535517], [27.873507382908166, 0.24203577281136868, 0.33157253506137735], [30.23596227732539, 0.2291075336312079, 1.2268007227596425], [33.78298062673251, 0.19340672828952415, 0.2761392967759132], [56.43075617032608, 0.07193474804851134, 5.999999999999998]], "peak_params_": [[7.974730372911258, 0.6270442337974576, 1.1250616890320841], [9.550434334208422, 0.21501122206650614, 2.0274953472345985], [15.628926971227164, 0.10961878573223949, 6.658184262882155], [18.62083567814421, 0.1937460042305812, 0.6692496389233842], [19.489318546593086, 0.20353330216622112, 0.5000909314011159], [22.593748518219776, 0.28262285844163415, 1.112754321176821], [25.09730433009897, 0.30093809536762706, 2.8186421473071035], [27.873507382908166, 0.3045953002926023, 0.6631450701227547], [30.23596227732539, 0.2256284718850825, 2.453601445519285], [33.78298062673251, 0.14415653485999513, 0.5522785935518264], [56.43075617032608, 0.07192995784539669, 11.999999999999996]], "r_squared_": 0.9607128028834481, "error_": 0.042299323587911594}
{"freq_range": [2.0, 80.0], "freq_res": 0.5, "aperiodic_params_": [-8.166512694700614, 0.7640124231855993], "gaussian_params_": [[8.03450244592106, 0.5132366942716713, 0.49993463624301543], [10.743358382823471, 0.14900223213893674, 0.9741655059721617], [13.800456692497637, 0.16835489761498254, 1.399148992192858], [21.14579466252206, 0.2821111863812942, 4.744603685335517], [27.622370533684343, 0.24928983836543284, 0.34942287369040215], [30.650871143722537, 0.10749553218231916, 0.8834858720138696], [58.76795866984899, 0.1616282226828746, 0.8685960735430407], [65.06210272289157, 0.16700640815689335, 0.44811536831710186]], "peak_params_": [[8.03450244592106, 0.520946333202799, 0.9998692724860309], [10.743358382823471, 0.17760986393034983, 1.9483310119443233], [13.800456692497637, 0.2579628712632491, 2.798297984385716], [21.14579466252206, 0.28197832685618884, 9.489207370671034], [27.622370533684343, 0.3497141551042038, 0.6988457473808043], [30.650871143722537, 0.14633848763665647, 1.7669717440277393], [58.76795866984899, 0.1559624821459895, 1.7371921470860814], [65.06210272289157, 0.1654103043681996, 0.8962307366342037]], "r_squared_": 0.973770808588457, "error_": 0.04026999156042942}
{"freq_range": [2.0, 80.0], "freq_res": 0.5, "aperiodic_params_": [-8.445780613723782, 0.5152533479433284], "gaussian_params_": [[7.709402042476269, 0.3949888168009372, 0.4539545419232711], [9.24113733891583, 0.34478148798533065, 0.7102704228031421], [10.60286007830622, 0.22933373321875702, 0.2500000000616073], [11.752453572802743, 0.22429202539000512, 0.4962113230443956], [13.516547573696153, 0.22020845278651974, 0.4533575857758814], [17.08266954645103, 0.29064506925087863, 1.8264236132530636], [23.188942396540806, 0.3584407727891177, 3.298594657712958], [28.74264236109986, 0.1753117381217494, 1.8427228471477293], [32.100258013175534, 0.14359597795068593, 0.5063251804378097], [49.27398270043202, 0.07738381323864957, 5.999918220381793], [50.39846565992375, 0.09078735073383343, 0.25000000000000006], [59.95020788777282, 0.14808292586464575, 0.25000000000000006]], "peak_params_": [[7.709402042476269, 0.3722149470521785, 0.9079090838465422], [9.24113733891583, 0.3324653814183538, 1.4205408456062842], [10.60286007830622, 0.29234087134783593, 0.5000000001232145], [11.752453572802743, 0.20623634930357504, 0.9924226460887912], [13.516547573696153, 0.26775809150550955, 0.9067151715517628], [17.08266954645103, 0.35200735160310437, 3.652847226506127], [23.188942396540806, 0.36075058040217023, 6.597189315425916], [28.74264236109986, 0.2720492491809612, 3.6854456942954585], [32.100258013175534, 0.18890467316212245, 1.0126503608756194], [49.27398270043202, 0.07747128643326917, 11.999836440763586], [50.39846565992375, 0.1593852253825645, 0.5000000000000001], [59.95020788777282, 0.16083075785793532, 0.5000000000000001]], "r_squared_": 0.9592536888717035, "error_": 0.04176661194708184}
{"freq_range": [2.0, 80.0], "freq_res": 0.5, "aperiodic_params_": [-8.027545326550998, 0.9011839643041812], "gaussian_params_": [[8.078701705549507, 0.6366491675064611, 0.6229828337567087], [10.49308562759316, 0.2996679732061698, 1.1919813858311272], [13.472962304630487, 0.2872419817367452, 0.8669064417538958], [17.049559382327725, 0.29618160884573946, 1.40813612552372], [18.777783586880982, 0.2313241653644452, 0.25000000000004957], [19.50281117433866, 0.2291057927190638, 0.2500000000000031], [20.424135687704503, 0.13318313620947358, 0.8892446222608773], [22.562605898148625, 0.3425255712817624, 0.8529591415541902], [25.191049206203168, 0.40201851169977626, 1.0468742557299844], [27.904949985397412, 0.18043307852861312, 0.31230735916320673], [29.053303406421005, 0.2213920920692862, 1.655416154793357], [56.37393302065161, 0.18192199282349633, 0.25000000000000006], [71.45203459913596, 0.06954699618635031, 5.999999999999999]], "peak_params_": [[8.078701705549507, 0.665218151714642, 1.2459656675134174], [10.49308562759316, 0.30080533149295974, 2.3839627716622545], [13.472962304630487, 0.31189455245878683, 1.7338128835077915], [17.049559382327725, 0.29615172035164505, 2.81627225104744], [18.777783586880982, 0.33663021284573347, 0.5000000000000991], [19.50281117433866, 0.375969750709956, 0.5000000000000062], [20.424135687704503, 0.16591602467493338, 1.7784892445217546], [22.562605898148625, 0.3653591758508945, 1.7059182831083803], [25.191049206203168, 0.4122033296834715, 2.0937485114599688], [27.904949985397412, 0.36407639709902995, 0.6246147183264135], [29.053303406421005, 0.22220000909278959, 3.310832309586714], [56.37393302065161, 0.1633191698091654, 0.5000000000000001], [71.45203459913596, 0.06954477392517511, 11.999999999999998]], "r_squared_": 0.9807771342493748, "error_": 0.041553937967352184}
{"freq_range": [2.0, 80.0], "freq_res": 0.5, "aperiodic_params_": [-7.624320695150803, 0.5941693830399378], "gaussian_params_": [[16.770939179236034, 0.2957367549027224, 2.4739727118708323], [25.182892765852916, 0.5759783316884113, 4.896858846308585], [46.01681667049901, 0.0911821434579978, 0.25000000000000006], [46.557026969599896, 0.12311776355802523, 5.999992148536935], [48.034315568543185, 0.03623362040887405, 0.5370009285438657], [49.48725023884535, 0.07393182511719462, 0.25000000000000006], [51.84681559984999, 0.14476404459069195, 0.49650624466164095]], "peak_params_": [[16.770939179236034, 0.43704735962514984, 4.947945423741665], [25.182892765852916, 0.5769410720502357, 9.79371769261717], [46.01681667049901, 0.21366071137975773, 0.5000000000000001], [46.557026969599896, 0.13785320290680936, 11.99998429707387], [48.034315568543185, 0.1557791272282234, 1.0740018570877314], [49.48725023884535, 0.1838778664816072, 0.5000000000000001], [51.84681559984999, 0.21962264339813053, 0.9930124893232819]], "r_squared_": 0.9570631658723944, "error_": 0.05242057991437296}
{"freq_range": [2.0, 80.0], "freq_res": 0.5, "aperiodic_params_": [-8.357592791734364, 0.6089846958606301], "gaussian_params_": [[8.181165038218873, 0.21060358099917956, 0.39365379765627306], [11.638581790330113, 0.17248972450555494, 0.25000000000000006], [14.213059598970348, 0.23835097803179126, 1.2074099593131369], [16.620390315236108, 0.16014605018318143, 0.25000000000000006], [17.92904864836846, 0.24028309235229706, 0.9769061963756587], [24.483388833165115, 0.5032189439868278, 5.355426627304598], [45.93469213292341, 0.19193437684070197, 0.25000000000000006], [47.498804348484015, 0.16675615422821058, 0.7471915906335532], [49.69334459224083, 0.18028145712228943, 0.31602739267861174], [51.77806398531265, 0.19462571797044356, 0.6055775003039661], [58.238670747637045, 0.21526107988439572, 0.35024232142327943], [64.85532570540633, 0.15999918264743992, 0.5352613652514722]], "peak_params_": [[8.181165038218873, 0.19385373586363208, 0.7873075953125461], [11.638581790330113, 0.1936522114053325, 0.5000000000000001], [14.213059598970348, 0.3088170774142771, 2.4148199186262738], [16.620390315236108, 0.4303388645486397, 0.5000000000000001], [17.92904864836846, 0.4832199512987536, 1.9538123927513174], [24.483388833165115, 0.5032165233389687, 10.710853254609196], [45.93469213292341, 0.20795520206151252, 0.5000000000000001], [47.498804348484015, 0.16680500854620028, 1.4943831812671065], [49.69334459224083, 0.1543027633039067, 0.6320547853572235], [51.77806398531265, 0.18198554294801994, 1.2111550006079321], [58.238670747637045, 0.17065914049207542, 0.7004846428465589], [64.85532570540633, 0.15426025168623703, 1.0705227305029443]], "r_squared_": 0.9571756035009443, "error_": 0.04833864207124067}
{"freq_range": [2.0, 80.0], "freq_res": 0.5, "aperiodic_params_": [-7.697380772983087, 0.6063382266472362], "gaussian_params_": [[7.743850965442554, 0.665226315703418, 0.5200892721516275], [9.37116373239269, 0.3568845909405199, 0.929221611293823], [16.603223932800244, 0.10390510384243515, 3.3136399274485298], [18.965048762448017, 0.112464749857818, 0.4879639198117608], [22.06430950767757, 0.21110889614862613, 0.9185530272311524], [25.389475890686604, 0.2527343386823155, 1.5302552996976528], [28.175931108819267, 0.21537269498261535, 0.25000000000000006], [29.858638307495383, 0.20603701586543427, 1.4950994293333326], [50.41875034095687, 0.141299494588409, 0.25000000000000006], [55.77398267893605, 0.07437491156034144, 5.999999999999986], [59.90638293871002, 0.09817165267878565, 0.25000000000000006]], "peak_params_": [[7.743850965442554, 0.645359145510672, 1.040178544303255], [9.37116373239269, 0.3661373687266929, 1.858443222587646], [16.603223932800244, 0.10385503878150537, 6.6272798548970595], [18.965048762448017, 0.19301611151783504, 0.9759278396235216], [22.06430950767757, 0.2599187274477224, 1.8371060544623048], [25.389475890686604, 0.25803709436861766, 3.0605105993953057], [28.175931108819267, 0.32253585264868256, 0.5000000000000001], [29.858638307495383, 0.20785549121293023, 2.9901988586666652], [50.41875034095687, 0.1845726040367257, 0.5000000000000001], [55.77398267893605, 0.07432216145204684, 11.999999999999972], [59.90638293871002, 0.14956088231293663, 0.5000000000000001]], "r_squared_": 0.9552723065678953, "error_": 0.04298870929220629}
{"freq_range": [2.0, 80.0], "freq_res": 0.5, "aperiodic_params_": [-7.9163923920825425, 0.518065586849906], "gaussian_params_": [[7.696200806732973, 0.3254595366072467, 0.44273951025709174], [9.371816887253864, 0.3032592822047291, 0.9510571749593119], [12.21523968449739, 0.1956026087367114, 1.0340686908913241], [13.702356700352524, 0.16642408063630976, 0.2500000024019478], [14.72155984567188, 0.1879592267342016, 0.47572574015053143], [17.73054947464857, 0.19966536446188002, 1.3050814328918245], [22.165326969562518, 0.2733342589835305, 2.6942348765682], [28.746643288122392, 0.2695174340349556, 2.878214955260263], [44.80390279727943, 0.17305402785792012, 0.2532867007747738], [45.889159499919536, 0.18473827725031755, 0.3798267507713604], [47.582926145875966, 0.13753532578339273, 0.39573246372702187], [52.42004651676921, 0.19489797574981066, 0.30964161343485713], [58.27181943864221, 0.2602411157688722, 0.25000000000000006]], "peak_params_": [[7.696200806732973, 0.33874651896824126, 0.8854790205141835], [9.371816887253864, 0.30682848891005143, 1.9021143499186237], [12.21523968449739, 0.19830668748116764, 2.0681373817826483], [13.702356700352524, 0.21991134750601482, 0.5000000048038956], [14.72155984567188, 0.20080321985569327, 0.9514514803010629], [17.73054947464857, 0.25774196385130743, 2.610162865783649], [22.165326969562518, 0.29104420471187176, 5.3884697531364], [28.746643288122392, 0.28575938248074806, 5.756429910520526], [44.80390279727943, 0.1401679975773451, 0.5065734015495476], [45.889159499919536, 0.17708604145136952, 0.7596535015427208], [47.582926145875966, 0.13457149311638794, 0.7914649274540437], [52.42004651676921, 0.18850777434838406, 0.6192832268697143], [58.27181943864221, 0.171584802732065, 0.5000000000000001]], "r_squared_": 0.9538457870266652, "error_": 0.042483738350298846}
{"freq_range": [2.0, 80.0], "freq_res": 0.5, "aperiodic_params_": [-7.801513583318298, 0.6942009520368027], "gaussian_params_": [[8.228222274136465, 0.3746868425996327, 0.3230303412856687], [9.200308270345719, 0.27202257620405385, 0.2500020624907597], [10.781383718847954, 0.27213788718979215, 0.7084758112342574], [12.326287800749574, 0.2305209941659803, 0.2500000273060731], [13.669867483780887, 0.26196334041313246, 0.706381878941171], [19.446620310292616, 0.3666439686454867, 3.2399881420065424], [23.523445609714965, 0.13668486533719273, 1.1893486833157227], [24.85675280905677, 0.20143920287514658, 0.29372781374810436], [27.213154147391776, 0.14854337478631946, 0.25000000000000616], [28.60930862826259, 0.25259561886352727, 2.256590090009525], [33.60932102333807, 0.164179205412401, 0.25000000041935094], [45.554299543799004, 0.10152145952695625, 0.745472425129722], [49.965469652171684, 0.12223675789262115, 0.6519028262928782], [52.51037125291249, 0.1673648120731101, 0.2500000000000946], [58.205594714339675, 0.18280523417536557, 0.25000000000001826], [59.605722608181765, 0.14751810485593825, 0.25000000000000006], [65.43423533853301, 0.12855348167251587, 0.2500000000000018], [69.45127927632107, 0.12018522837673803, 0.25000000000000006]], "peak_params_": [[8.228222274136465, 0.2927702367965246, 0.6460606825713374], [9.200308270345719, 0.23248002138677926, 0.5000041249815194], [10.781383718847954, 0.271950770574648, 1.4169516224685148], [12.326287800749574, 0.29872462849544235, 0.5000000546121462], [13.669867483780887, 0.32271243596946064, 1.412763757882342], [19.446620310292616, 0.3671147036904685, 6.479976284013085], [23.523445609714965, 0.32376877127682135, 2.3786973666314455], [24.85675280905677, 0.39678474677357833, 0.5874556274962087], [27.213154147391776, 0.32527389596336675, 0.5000000000000123], [28.60930862826259, 0.25971357192899625, 4.51318018001905], [33.60932102333807, 0.17336348851644523, 0.5000000008387019], [45.554299543799004, 0.10125250359661386, 1.490944850259444], [49.965469652171684, 0.12206540219578343, 1.3038056525857564], [52.51037125291249, 0.16728466210934734, 0.5000000000001892], [58.205594714339675, 0.1303558216008991, 0.5000000000000365], [59.605722608181765, 0.13490013975902215, 0.5000000000000001], [65.43423533853301, 0.1241816101301314, 0.5000000000000036], [69.45127927632107, 0.11792448372690778, 0.5000000000000001]], "r_squared_": 0.9773327244199841, "error_": 0.037172675633854554}
{"freq_range": [2.0, 80.0], "freq_res": 0.5, "aperiodic_params_": [-7.686547715718023, 0.968298096870979], "gaussian_params_": [[8.227481090486767, 0.3857204856407282, 0.5043497325459394], [10.666936927408587, 0.3100231611902592, 0.8303254859197345], [12.6176167431014, 0.2750578824300864, 0.2803266615352198], [13.71395712039056, 0.22275529851886824, 0.4346916134406625], [20.933155406420525, 0.4585643946827878, 5.470008298261139], [25.148987208675205, 0.12915894458104465, 0.4858408139216959], [28.44717067475609, 0.2688482250959827, 1.0027354625157154], [30.33376542198413, 0.19142591029861572, 0.38118101589094255], [31.75164229565236, 0.12788797007914163, 0.25000000000000006], [36.64559354681451, 0.14641856480628931, 0.25000000000000006], [43.448524732697486, 0.16188921224149555, 0.3110824311041328], [49.744920879745486, 0.12763567873920031, 0.9958528882990316], [59.61624279473516, 0.1371213123075915, 0.25000000000000006]], "peak_params_": [[8.227481090486767, 0.37821983523145697, 1.0086994650918788], [10.666936927408587, 0.37821122322659484, 1.660650971839469], [12.6176167431014, 0.4232245769940821, 0.5606533230704396], [13.71395712039056, 0.3823479153253757, 0.869383226881325], [20.933155406420525, 0.4585301564987656, 10.940016596522279], [25.148987208675205, 0.47178812116847624, 0.9716816278433918], [28.44717067475609, 0.44461999876612524, 2.005470925031431], [30.33376542198413, 0.3064814990462299, 0.7623620317818851], [31.75164229565236, 0.1378281944312736, 0.5000000000000001], [36.64559354681451, 0.13157384093059576, 0.5000000000000001], [43.448524732697486, 0.1597803499836008, 0.6221648622082656], [49.744920879745486, 0.12383387234233822, 1.9917057765980632], [59.61624279473516, 0.12307167715537304, 0.5000000000000001]], "r_squared_": 0.987852624196365, "error_": 0.03651506106745667}
{"freq_range": [2.0, 80.0], "freq_res": 0.5, "aperiodic_params_": [-7.632991008429212, 1.124849975639693], "gaussian_params_": [[7.9613794584481825, 0.22510010860059598, 0.4451780091817135], [12.030430677569958, 0.37590340800418237, 2.449490029938401], [16.60379827125511, 0.18091119350023036, 0.25000000000000006], [17.401426060491058, 0.18227169288153663, 0.25000000000000006], [18.89479349010634, 0.2043379390603536, 0.614356088026743], [20.773960013684775, 0.40584112529415267, 3.775009083510273], [28.105927535208416, 0.5127317429058054, 3.3029194574867877]], "peak_params_": [[7.9613794584481825, 0.322668541533325, 0.890356018363427], [12.030430677569958, 0.40312529904833916, 4.898980059876802], [16.60379827125511, 0.45235386405281375, 0.5000000000000001], [17.401426060491058, 0.4971179993587249, 0.5000000000000001], [18.89479349010634, 0.582808884193998, 1.228712176053486], [20.773960013684775, 0.45682819613610626, 7.550018167020546], [28.105927535208416, 0.5774379398756988, 6.6058389149735754]], "r_squared_": 0.9871237479979901, "error_": 0.04792454157173564}
{"freq_range": [2.0, 80.0], "freq_res": 0.5, "aperiodic_params_": [-7.619492602815418, 0.8583657315083775], "gaussian_params_": [[7.709180953472065, 0.2305554067864684, 0.3260714049799384], [17.23529399719534, 0.4268148739583794, 3.7578084195004102], [25.94702705703966, 0.5907124311919976, 4.12978132441415], [30.85119812486739, 0.11821972315311925, 0.6145107147759552], [48.22601729956798, 0.09727850481990098, 5.999999999998089], [51.98511009073277, 0.13339344004848017, 0.460302087219818]], "peak_params_": [[7.709180953472065, 0.20259123496836473, 0.6521428099598768], [17.23529399719534, 0.48249626937003853, 7.5156168390008204], [25.94702705703966, 0.618880940646644, 8.2595626488283], [30.85119812486739, 0.396346089156177, 1.2290214295519104], [48.22601729956798, 0.0972098900423326, 11.999999999996177], [51.98511009073277, 0.2131424917605429, 0.920604174439636]], "r_squared_": 0.973696577738592, "error_": 0.054802437524786175}
{"freq_range": [2.0, 80.0], "freq_res": 0.5, "aperiodic_params_": [-7.639430683166851, 0.5551811793558169], "gaussian_params_": [[23.134704556278358, 0.629833656694108, 5.999999999999999], [30.428073279001087, 0.12870594615140307, 0.31470854300567996], [46.175001450755886, 0.1437427827435802, 5.99999999998245], [48.316645788554695, 0.08694969178024779, 0.2500113334244939], [49.49019371316545, 0.09560730699360592, 0.25000000000000006], [51.64405053937101, 0.10977762707975244, 0.6942662714770741]], "peak_params_": [[23.134704556278358, 0.6297577386943916, 11.999999999999998], [30.428073279001087, 0.4266162671027196, 0.6294170860113599], [46.175001450755886, 0.14412386995226, 11.9999999999649], [48.316645788554695, 0.19991719443871503, 0.5000226668489878], [49.49019371316545, 0.21978975847008364, 0.5000000000000001], [51.64405053937101, 0.20439893266925502, 1.3885325429541482]], "r_squared_": 0.953838609691247, "error_": 0.05479459716089467}
{"freq_range": [2.0, 80.0], "freq_res": 0.5, "aperiodic_params_": [-7.908622411730323, 0.46275873439348564], "gaussian_params_": [[17.286764702461397, 0.44494266211118444, 2.3749404432282546], [21.61762424159642, 0.21312262952029093, 0.9051368750460664], [25.838782379181158, 0.5842402366253081, 3.6672788732557287], [30.343041699536858, 0.16483939097821007, 0.25000000000000006], [32.05945382906463, 0.13771299640913978, 0.7173853531924029], [38.08990347011468, 0.14260423328195654, 2.41174392300435], [43.948429417778314, 0.15636125220115202, 1.332161816132783], [46.11584215972367, 0.217668063664709, 0.25000000000000006], [47.248384509382454, 0.2745566086988277, 0.2500000000000977], [48.274679862161065, 0.3282599164506279, 0.250000000009212], [49.30840614839642, 0.27262294527976005, 0.25000000000000006], [50.60978804455482, 0.19479632886993262, 0.5543744037304809], [52.09700998611178, 0.21543576178957766, 0.44455992570573144]], "peak_params_": [[17.286764702461397, 0.4872020477420005, 4.749880886456509], [21.61762424159642, 0.5937282411047065, 1.8102737500921329], [25.838782379181158, 0.5842096230879372, 7.334557746511457], [30.343041699536858, 0.40981620014910725, 0.5000000000000001], [32.05945382906463, 0.2855784009527085, 1.4347707063848059], [38.08990347011468, 0.14490398891055634, 4.8234878460087], [43.948429417778314, 0.1633283408915549, 2.664323632265566], [46.11584215972367, 0.24393643249599606, 0.5000000000000001], [47.248384509382454, 0.17951968607143165, 0.5000000000001954], [48.274679862161065, 0.22076114751543052, 0.500000000018424], [49.30840614839642, 0.22954198997115327, 0.5000000000000001], [50.60978804455482, 0.1913575930456144, 1.1087488074609617], [52.09700998611178, 0.218762077717086, 0.8891198514114629]], "r_squared_": 0.9595460825155141, "error_": 0.04316179181417148}
{"freq_range": [2.0, 80.0], "freq_res": 0.5, "aperiodic_params_": [-8.460245173617219, 0.5160229356792012], "gaussian_params_": [[16.617760964870794, 0.2183804355093358, 1.536392617529366], [24.635892303457187, 0.5268523615905468, 5.5096275801831585], [45.96045403131041, 0.06933281641243118, 0.25000000000000006], [47.22601744608928, 0.1169225172336713, 5.999907863936443], [49.38515844349277, 0.07451232197921441, 1.3938721792197366]], "peak_params_": [[16.617760964870794, 0.3948279513773745, 3.072785235058732], [24.635892303457187, 0.5267821963991342, 11.019255160366317], [45.96045403131041, 0.1871674811255577, 0.5000000000000001], [47.22601744608928, 0.13422544383003832, 11.999815727872885], [49.38515844349277, 0.1830991968628517, 2.787744358439473]], "r_squared_": 0.9481043180171155, "error_": 0.04960173876236979}
{"freq_range": [2.0, 80.0], "freq_res": 0.5, "aperiodic_params_": [-7.396168039719931, 0.9431861979733873], "gaussian_params_": [[7.828146366999559, 0.8617027874678546, 0.6406818149543344], [9.684589055046496, 0.47217571586800877, 1.0649847370749388], [13.564959193140803, 0.3190039106373551, 1.5021900808475162], [16.408319717047725, 0.14381819652942712, 0.4433169544812834], [22.157219902981996, 0.1866642448148308, 2.224038997929109], [25.215451437433334, 0.1386519511397707, 0.7561205290777976], [28.153751241964596, 0.12900967029053625, 0.25000000000000006], [28.946201801675056, 0.17987483209248709, 1.6873477359126074], [50.44863534275123, 0.2156240379097824, 0.2971125481513712], [60.68957649446458, 0.07513604435491039, 5.9999986400304985], [64.07691183562127, 0.11617565592146803, 0.3588114233484493], [68.93995317413169, 0.13912294038681336, 0.4610651878952011], [76.92765119530794, 0.12161363080679846, 2.1294722210417514]], "peak_params_": [[7.828146366999559, 0.9667278503471719, 1.2813636299086688], [9.684589055046496, 0.50195689147154, 2.1299694741498776], [13.564959193140803, 0.31957240716806545, 3.0043801616950323], [16.408319717047725, 0.1954190375240863, 0.8866339089625668], [22.157219902981996, 0.18625246111660587, 4.448077995858218], [25.215451437433334, 0.22727915920844133, 1.5122410581555952], [28.153751241964596, 0.26656314178370977, 0.5000000000000001], [28.946201801675056, 0.18184568545416901, 3.374695471825215], [50.44863534275123, 0.2301911621259336, 0.5942250963027425], [60.68957649446458, 0.07509854907343261, 11.999997280060997], [64.07691183562127, 0.17806475865844185, 0.7176228466968986], [68.93995317413169, 0.16685883218890574, 0.9221303757904022], [76.92765119530794, 0.12341065951425279, 4.258944442083503]], "r_squared_": 0.9770218908748156, "error_": 0.043206906216620905}
{"freq_range": [2.0, 80.0], "freq_res": 0.5, "aperiodic_params_": [-7.902138131005606, 0.770572822845905], "gaussian_params_": [[7.762140756939637, 0.764600900130298, 0.6032284660313044], [9.555268718761514, 0.45943531391993403, 1.0272770915470169], [12.290048137447892, 0.19626416174572697, 0.25000000000000006], [14.165134857997778, 0.16340958674195705, 1.3617366642603281], [21.81442196882443, 0.18261962903127987, 3.0861243393837214], [24.642931060400986, 0.1213778158610446, 0.26701023397850343], [28.919668284786052, 0.1931775285093368, 1.7779732810074604], [45.47072798126662, 0.18590141314426895, 0.6620789394846522], [50.55555023066801, 0.1935303121598452, 0.4150275029947471], [64.72601729956799, 0.10874626353999928, 5.999999999999999]], "peak_params_": [[7.762140756939637, 0.8534752826427976, 1.2064569320626088], [9.555268718761514, 0.47135155916693705, 2.0545541830940337], [12.290048137447892, 0.22478379347717237, 0.5000000000000001], [14.165134857997778, 0.1696529042084034, 2.7234733285206563], [21.81442196882443, 0.18238904669725287, 6.172248678767443], [24.642931060400986, 0.23902690038780428, 0.5340204679570069], [28.919668284786052, 0.2051240083840149, 3.555946562014921], [45.47072798126662, 0.18636071766023576, 1.3241578789693045], [50.55555023066801, 0.19834615435553893, 0.8300550059894942], [64.72601729956799, 0.10866913570256997, 11.999999999999998]], "r_squared_": 0.9627475824811855, "error_": 0.048334526815136294}
{"freq_range": [2.0, 80.0], "freq_res": 0.5, "aperiodic_params_": [-8.019911904431174, 0.8508969061367238], "gaussian_params_": [[8.58242539536388, 0.36022952828347105, 0.8602682410801172], [10.69064045383492, 0.18835524557606456, 0.2500000000000093], [12.803547420987949, 0.2712948288459024, 1.8510945060868214], [17.7827270949616, 0.146047914200274, 1.5229935422979675], [23.86073106915425, 0.49346547984683165, 4.774100674171915], [45.974136276115544, 0.21344520292645086, 0.2799772635508208]], "peak_params_": [[8.58242539536388, 0.37955458455466307, 1.7205364821602345], [10.69064045383492, 0.30577640049609656, 0.5000000000000187], [12.803547420987949, 0.3079334895253236, 3.7021890121736427], [17.7827270949616, 0.38212325705907446, 3.045987084595935], [23.86073106915425, 0.49329069586685925, 9.54820134834383], [45.974136276115544, 0.2125469612545885, 0.5599545271016416]], "r_squared_": 0.9830687060863817, "error_": 0.0405119510949789}
{"freq_range": [2.0, 80.0], "freq_res": 0.5, "aperiodic_params_": [-7.768167448886224, 1.0398685601141333], "gaussian_params_": [[8.083689698501258, 0.34615966776651835, 0.5277049652213737], [9.847764196686624, 0.20301068350329146, 1.168200975854598], [10.747396445058282, 0.3381287275015972, 0.25000000000000006], [13.480998116920809, 0.1545670517947277, 1.4949637140466818], [22.638228794924594, 0.6099331733606226, 5.508146874654837], [43.29750304817242, 0.19556520512299505, 0.25000000000000006]], "peak_params_": [[8.083689698501258, 0.4179809751663299, 1.0554099304427473], [9.847764196686624, 0.25978147183565703, 2.336401951709196], [10.747396445058282, 0.4559094171615925, 0.5000000000000001], [13.480998116920809, 0.31011549498726865, 2.9899274280933636], [22.638228794924594, 0.6097411449285719, 11.016293749309675], [43.29750304817242, 0.14134042435357408, 0.5000000000000001]], "r_squared_": 0.9889150623895366, "error_": 0.04034496196507355}
{"freq_range": [2.0, 80.0], "freq_res": 0.5, "aperiodic_params_": [-7.705534488547384, 1.0063836992514985], "gaussian_params_": [[10.041426996984177, 0.35003077471922805, 1.7371214682743452], [16.55127588759094, 0.3253000238884831, 3.0625983528832053], [20.82431989058774, 0.29771208345983663, 2.0972128518329023], [26.293958894346755, 0.5832448173695116, 3.111756834242303], [39.46948178639168, 0.15981867816598996, 0.4430968814501071], [46.06597926469926, 0.15256607888354481, 0.2900188594872242], [50.64547777286787, 0.2377211701806096, 0.2522631191910564], [62.94203885364498, 0.14308961825640581, 0.33640496630241506]], "peak_params_": [[10.041426996984177, 0.3829428137371824, 3.4742429365486904], [16.55127588759094, 0.3652502745626194, 6.1251967057664105], [20.82431989058774, 0.5471335669714055, 4.194425703665805], [26.293958894346755, 0.5912758888537244, 6.223513668484606], [39.46948178639168, 0.15951164731259126, 0.8861937629002142], [46.06597926469926, 0.1486686061760789, 0.5800377189744484], [50.64547777286787, 0.2013032346634649, 0.5045262383821127], [62.94203885364498, 0.14098143599900226, 0.6728099326048301]], "r_squared_": 0.9830911622021319, "error_": 0.04564509675110238}
{"freq_range": [2.0, 80.0], "freq_res": 0.5, "aperiodic_params_": [-7.813221645054869, 0.9634850532256959], "gaussian_params_": [[9.413759638109104, 0.25622372593416737, 1.347848977509619], [12.473651223645353, 0.2174387325078875, 0.3722933740673703], [23.2259078268677, 0.6544990823649464, 5.999999999999999]], "peak_params_": [[9.413759638109104, 0.3035079244173353, 2.695697955019238], [12.473651223645353, 0.367946699879683, 0.7445867481347406], [23.2259078268677, 0.6540353310071474, 11.999999999999998]], "r_squared_": 0.9806154488813138, "error_": 0.051763262011556295}
{"freq_range": [2.0, 80.0], "freq_res": 0.5, "aperiodic_params_": [-8.081890092520537, 0.8304581337615698], "gaussian_params_": [[10.08866652515786, 0.09071058411498716, 0.25000000000000006], [10.639871433468214, 0.0894239227072975, 1.717954233141705], [15.626366219467254, 0.3436524780371116, 2.3891298879533145], [20.908738094195655, 0.06394439956691898, 0.25000000000000006], [22.25769458320012, 0.17859747614166765, 0.4539895264150431], [25.87566755084215, 0.595727553876666, 4.809180765636738], [44.65993578939633, 0.1713864656403544, 0.4639673983214343]], "peak_params_": [[10.08866652515786, 0.19264522642186144, 0.5000000000000001], [10.639871433468214, 0.1505375018298185, 3.43590846628341], [15.626366219467254, 0.4029233448634777, 4.778259775906629], [20.908738094195655, 0.44739362056762566, 0.5000000000000001], [22.25769458320012, 0.626018315871093, 0.9079790528300862], [25.87566755084215, 0.5955561831944305, 9.618361531273475], [44.65993578939633, 0.16183025706328102, 0.9279347966428686]], "r_squared_": 0.9783513731628578, "error_": 0.047050274601053994}
{"freq_range": [2.0, 80.0], "freq_res": 0.5, "aperiodic_params_": [-8.476173572051822, 0.5864522255400508], "gaussian_params_": [[8.224322639198299, 0.3826703122114577, 0.8661627179522645], [12.197981747044617, 0.24351018806233854, 2.513912812692916], [21.59035486466245, 0.3254446056608491, 5.366136824741788], [28.610957176225273, 0.13103159727749564, 0.25000823585316484], [68.5681669965508, 0.14689190519954387, 0.25004956902469494], [74.05263143306385, 0.1202328882516229, 1.1424937416078096]], "peak_params_": [[8.224322639198299, 0.44361533000310516, 1.732325435904529], [12.197981747044617, 0.3086857127518421, 5.027825625385832], [21.59035486466245, 0.3256575494483531, 10.732273649483576], [28.610957176225273, 0.2607929206314612, 0.5000164717063297], [68.5681669965508, 0.1415345856963519, 0.5000991380493899], [74.05263143306385, 0.12010537784736641, 2.284987483215619]], "r_squared_": 0.9579221167667427, "error_": 0.04636305404574426}
{"freq_range": [2.0, 80.0], "freq_res": 0.5, "aperiodic_params_": [-8.037653044718326, 0.6246240443760941], "gaussian_params_": [[8.33878215599515, 0.5498330417583136, 1.014218166522725], [12.235231883748163, 0.3432105366366433, 2.4445494648015917], [17.95208015786997, 0.23805324267413636, 3.373969451614927], [22.241526500550222, 0.21383839904817636, 0.29698176192507564], [23.38533231760689, 0.17893321933452289, 0.34870812050826877], [25.224638804124247, 0.22606609149533166, 0.6050154213485044], [26.736591165178158, 0.3045546009988798, 0.25000624600961663], [28.73004632434319, 0.2849871942986684, 0.25000000000000006], [56.2199478334182, 0.18129037046910124, 0.38659505464155164], [66.84779394646075, 0.15913806999022345, 0.6263073526274634], [68.71738906708504, 0.20146252895394393, 0.42553136825031224], [72.98488388486831, 0.14420227271822803, 0.655227927011112], [74.3465084570877, 0.2448478179386938, 0.25000000000000006]], "peak_params_": [[8.33878215599515, 0.6544360979017991, 2.02843633304545], [12.235231883748163, 0.3926602506997021, 4.8890989296031835], [17.95208015786997, 0.25930907065548503, 6.747938903229854], [22.241526500550222, 0.26971771484860696, 0.5939635238501513], [23.38533231760689, 0.2350345759256527, 0.6974162410165375], [25.224638804124247, 0.23787492849154646, 1.2100308426970088], [26.736591165178158, 0.2287467943936239, 0.5000124920192333], [28.73004632434319, 0.18841626848049664, 0.5000000000000001], [56.2199478334182, 0.15420084362474462, 0.7731901092831033], [66.84779394646075, 0.15456599144540029, 1.2526147052549268], [68.71738906708504, 0.18172122458070206, 0.8510627365006245], [72.98488388486831, 0.144164026680615, 1.310455854022224], [74.3465084570877, 0.21273933360695452, 0.5000000000000001]], "r_squared_": 0.9663424557907723, "error_": 0.04181919868151914}
{"freq_range": [2.0, 80.0], "freq_res": 0.5, "aperiodic_params_": [-7.584923453017678, 0.7579400503103841], "gaussian_params_": [[8.01670514025428, 0.8366871275989626, 0.7923243500453725], [10.601734819788634, 0.6624748647980536, 1.3492650472069698], [14.087097168163906, 0.6183870040920272, 1.5059276784101385], [15.791068323559228, 0.19848752646152573, 0.25008397400565424], [16.869241175314436, 0.35501227042662326, 0.34739100188615585], [18.242943611072747, 0.27936932590468644, 0.40292935539212416], [20.57279012365648, 0.2292675704944603, 1.2649215699947733], [24.254498679637607, 0.1731493479473752, 0.25033264466601424], [26.44764409736406, 0.1421484226070308, 2.3269739411068913], [27.799069200870726, 0.1198590468154487, 0.25000000000000006], [68.50762176798608, 0.13745660056786957, 1.2289014427225726], [72.13607626404766, 0.25538685446850956, 0.25000000000000006], [73.2358330556419, 0.30328924081987474, 0.25000000000000006]], "peak_params_": [[8.01670514025428, 0.9398989362032415, 1.584648700090745], [10.601734819788634, 0.7029940594795612, 2.6985300944139397], [14.087097168163906, 0.6451334992517488, 3.011855356820277], [15.791068323559228, 0.43207248418318756, 0.5001679480113085], [16.869241175314436, 0.43266259873959534, 0.6947820037723117], [18.242943611072747, 0.2850283566144274, 0.8058587107842483], [20.57279012365648, 0.23438141245238242, 2.5298431399895467], [24.254498679637607, 0.20904017860456747, 0.5006652893320285], [26.44764409736406, 0.14211652378190998, 4.6539478822137825], [27.799069200870726, 0.2005657228818052, 0.5000000000000001], [68.50762176798608, 0.13745395688858686, 2.4578028854451452], [72.13607626404766, 0.222649014430651, 0.5000000000000001], [73.2358330556419, 0.19519123100066516, 0.5000000000000001]], "r_squared_": 0.980493369023966, "error_": 0.04660353857823035}
{"freq_range": [2.0, 80.0], "freq_res": 0.5, "aperiodic_params_": [-7.980441150892124, 0.6799770350898026], "gaussian_params_": [[8.05440873217037, 0.694991485832035, 0.772793214776981], [10.807506133736085, 0.563162754994099, 1.3884128036019334], [13.802983554617485, 0.37282922631961735, 1.1156537698705944], [16.400007579802843, 0.3299799903338976, 1.522670185431428], [21.11234758816739, 0.3271295539432611, 2.189542789931963], [24.987843924341004, 0.18619153194360993, 0.792742167650251], [27.85532533776794, 0.197070512359819, 1.695497048586141], [72.08879959503675, 0.19455765185382257, 0.3258846135460537], [73.2610467395465, 0.2609577394810045, 0.25000000624647684]], "peak_params_": [[8.05440873217037, 0.7661746716347375, 1.545586429553962], [10.807506133736085, 0.574762534922705, 2.776825607203867], [13.802983554617485, 0.5040614568680724, 2.231307539741189], [16.400007579802843, 0.38503729140811416, 3.045340370862856], [21.11234758816739, 0.3301964821097467, 4.379085579863926], [24.987843924341004, 0.30152858364296264, 1.585484335300502], [27.85532533776794, 0.19881327923347314, 3.390994097172282], [72.08879959503675, 0.18746794539223188, 0.6517692270921074], [73.2610467395465, 0.16528461953320495, 0.5000000124929537]], "r_squared_": 0.9703886901212881, "error_": 0.05106361221936509}
{"freq_range": [2.0, 80.0], "freq_res": 0.5, "aperiodic_params_": [-7.9590995074140265, 0.8785393202199936], "gaussian_params_": [[8.17235862695509, 0.325250062330575, 0.729859557978328], [10.651921433300757, 0.4039248222354097, 0.5764420849646682], [12.36415439999898, 0.29519562882687655, 0.25000525051440925], [15.893170520313298, 0.5101718650648598, 3.6545902016742766], [26.068036047242217, 0.655689732897442, 4.780736492536849]], "peak_params_": [[8.17235862695509, 0.3663557136917319, 1.459719115956656], [10.651921433300757, 0.5671358238872966, 1.1528841699293364], [12.36415439999898, 0.6002658297636199, 0.5000105010288185], [15.893170520313298, 0.5813437878399039, 7.309180403348553], [26.068036047242217, 0.6667651727279811, 9.561472985073697]], "r_squared_": 0.981321263884493, "error_": 0.053747116158354986}
{"freq_range": [2.0, 80.0], "freq_res": 0.5, "aperiodic_params_": [-7.875316270473643, 0.9711705365881074], "gaussian_params_": [[8.08334501620207, 0.3154667061165009, 0.5122811259433906], [13.72306408088511, 0.49906581892697355, 3.138739939891645], [18.669118614712488, 0.28390440141080203, 0.6793648936182914], [23.289059694017645, 0.11545658259448884, 0.25000000000000006], [26.761623646045464, 0.7456998839777961, 5.379197686199424]], "peak_params_": [[8.08334501620207, 0.40769257719022356, 1.0245622518867812], [13.72306408088511, 0.533513838169096, 6.27747987978329], [18.669118614712488, 0.6612576485156012, 1.3587297872365829], [23.289059694017645, 0.705261893099971, 0.5000000000000001], [26.761623646045464, 0.7450330224567256, 10.758395372398848]], "r_squared_": 0.979830827342954, "error_": 0.058189489544925366}
{"freq_range": [2.0, 80.0], "freq_res": 0.5, "aperiodic_params_": [-7.637906706678584, 1.078414924209799], "gaussian_params_": [[7.797574493836994, 0.33831984013135086, 0.3426956593958445], [10.28718899766437, 0.19581616587119977, 1.2440394303735398], [12.325332332770387, 0.17907260146118253, 0.4906506132167465], [16.010810531846527, 0.5904190768587598, 3.355235320412999], [26.706015874790335, 0.8779432177510326, 4.783834083457434]], "peak_params_": [[7.797574493836994, 0.35485423717667786, 0.685391318791689], [10.28718899766437, 0.34921712634362123, 2.4880788607470796], [12.325332332770387, 0.5605268666134045, 0.981301226433493], [16.010810531846527, 0.6621832188384378, 6.710470640825998], [26.706015874790335, 0.8815853407514052, 9.567668166914869]], "r_squared_": 0.977578492624214, "error_": 0.07008411902585354}
{"freq_range": [2.0, 80.0], "freq_res": 0.5, "aperiodic_params_": [-7.64564002792031, 1.0639493636088013], "gaussian_params_": [[7.74407863259446, 0.32819196562369546, 0.3289078990679718], [11.216861475630841, 0.2701430409991662, 1.9372747218369895], [16.157165003771308, 0.0797505439450174, 0.2500000000000014], [16.994060659494455, 0.5288410713739212, 3.1239643145987577], [26.71706442681438, 0.7461671271093383, 4.665060348898922], [39.45204845698407, 0.12987562693632196, 2.6602216183285448]], "peak_params_": [[7.74407863259446, 0.2974547836480905, 0.6578157981359436], [11.216861475630841, 0.354938842560216, 3.874549443673979], [16.157165003771308, 0.6343150451828272, 0.5000000000000028], [16.994060659494455, 0.6175012105277773, 6.247928629197515], [26.71706442681438, 0.7505212884186641, 9.330120697797843], [39.45204845698407, 0.14732926131067892, 5.3204432366570895]], "r_squared_": 0.9852163326734449, "error_": 0.05156012654465321}
{"freq_range": [2.0, 80.0], "freq_res": 0.5, "aperiodic_params_": [-7.810794997033948, 0.9310579831525049], "gaussian_params_": [[16.162687007833995, 0.7062580393217353, 4.675740274581959], [27.152523688742473, 0.5859577507100922, 4.75706037436426]], "peak_params_": [[16.162687007833995, 0.7433593992363061, 9.351480549163918], [27.152523688742473, 0.6337883257948782, 9.51412074872852]], "r_squared_": 0.9785232256294263, "error_": 0.06107414964285142}
{"freq_range": [2.0, 80.0], "freq_res": 0.5, "aperiodic_params_": [-8.049350966278526, 0.6618818939028862], "gaussian_params_": [[7.217374976237921, 0.21446363613499447, 0.3777047471078492], [9.001471587759179, 0.46261466073325025, 1.0438989977997937], [15.022617704150784, 0.5289118456138064, 3.7827560515735574], [24.678051898708098, 0.4086348381194624, 5.0519408942640345], [35.8143805674549, 0.12380050137631898, 0.7020191609920641], [45.27398270041889, 0.0759483846242481, 5.9999999999834355]], "peak_params_": [[7.217374976237921, 0.3120480185278911, 0.7554094942156984], [9.001471587759179, 0.6148461189755938, 2.0877979955995873], [15.022617704150784, 0.5941281294346297, 7.565512103147115], [24.678051898708098, 0.431496361884939, 10.103881788528069], [35.8143805674549, 0.17571475242279, 1.4040383219841281], [45.27398270041889, 0.0759781894439584, 11.999999999966871]], "r_squared_": 0.974381861288916, "error_": 0.05020575760100844}
{"freq_range": [2.0, 80.0], "freq_res": 0.5, "aperiodic_params_": [-7.674034548668287, 0.6186975838636283], "gaussian_params_": [[8.365858648786823, 0.5386787160529931, 1.013416063156435], [10.614910725101137, 0.25917702460475933, 1.5592463717161928], [15.113628353167208, 0.478241436105265, 2.9797522133286813], [20.20297465168798, 0.19989779118137244, 0.25600646386838855], [21.16688435041219, 0.19378832538985644, 0.2839597872881507], [22.16982418025375, 0.365983237553451, 0.2585165400904309], [23.367087237261476, 0.25106247277960153, 0.49101910367018803], [25.1933739312354, 0.28113240225591524, 0.6890281488437965], [26.712970117228345, 0.30026827992495597, 0.25020576430795977], [28.443372953629947, 0.24236262861800037, 1.030367705484081], [31.094953199724493, 0.2681196826867403, 0.4825854554431909], [33.207456610155084, 0.1267601322411096, 0.671267878964374], [36.05037957479353, 0.14619215885926037, 1.1817582601753287], [43.92498281151354, 0.17747076365551562, 0.4260036539179375], [50.98586766163816, 0.16174263268932731, 0.3350330088156617], [56.416095879878306, 0.20647164274567215, 0.529691479445892], [66.58313650388885, 0.18552663176121056, 0.27259238534784297]], "peak_params_": [[8.365858648786823, 0.678011541292582, 2.02683212631287], [10.614910725101137, 0.46137000053188615, 3.1184927434323857], [15.113628353167208, 0.4828615490687609, 5.959504426657363], [20.20297465168798, 0.2706810463917986, 0.5120129277367771], [21.16688435041219, 0.2325966133523103, 0.5679195745763014], [22.16982418025375, 0.33588780965530773, 0.5170330801808618], [23.367087237261476, 0.2648657631676592, 0.9820382073403761], [25.1933739312354, 0.27412932183983685, 1.378056297687593], [26.712970117228345, 0.2968289883260322, 0.5004115286159195], [28.443372953629947, 0.2420196594247379, 2.060735410968162], [31.094953199724493, 0.27472120486563867, 0.9651709108863818], [33.207456610155084, 0.12619889776068938, 1.342535757928748], [36.05037957479353, 0.14608150160083078, 2.3635165203506574], [43.92498281151354, 0.17474034480927259, 0.852007307835875], [50.98586766163816, 0.1615988011267966, 0.6700660176313235], [56.416095879878306, 0.20389751776478704, 1.059382958891784], [66.58313650388885, 0.17709576100557456, 0.5451847706956859]], "r_squared_": 0.9700215930017269, "error_": 0.04224888974787158}
{"freq_range": [2.0, 80.0], "freq_res": 0.5, "aperiodic_params_": [-7.744711246610481, 0.6451331023456323], "gaussian_params_": [[8.754337972937131, 0.7279058373887168, 1.5256213666768565], [14.023776221605777, 0.6729490218898756, 3.205594919486401], [19.943204410575245, 0.20704785946872234, 0.2701186176589872], [21.399778098855275, 0.21002286705890535, 0.8037520194779362], [27.426909674658614, 0.18598937490663256, 2.4536104382808377]], "peak_params_": [[8.754337972937131, 0.9156133556117254, 3.051242733353713], [14.023776221605777, 0.6749023804284233, 6.411189838972802], [19.943204410575245, 0.3688949217339754, 0.5402372353179744], [21.399778098855275, 0.2627970415129486, 1.6075040389558723], [27.426909674658614, 0.18600465416962386, 4.907220876561675]], "r_squared_": 0.9701895796260718, "error_": 0.056636208748971684}
{"freq_range": [2.0, 80.0], "freq_res": 0.5, "aperiodic_params_": [-7.996280182945127, 0.6691588810835645], "gaussian_params_": [[7.777817656094454, 0.49935942461799654, 0.8078251397081833], [9.884024261787975, 0.5974746221276582, 1.3788844144353252], [15.162654861012394, 0.5981208396629608, 2.9389940258641105], [21.20985081271953, 0.457660319341003, 1.8088167386360248], [24.74364856399063, 0.1746621200375413, 0.44738233300614283], [26.750724246296574, 0.2211445185130207, 2.097923289738315], [27.789478100527734, 0.2148360001885473, 0.25000032620542534], [31.305272871407887, 0.18014974119885224, 0.6520654949678634]], "peak_params_": [[7.777817656094454, 0.7464438986604724, 1.6156502794163665], [9.884024261787975, 0.7345849570658167, 2.7577688288706503], [15.162654861012394, 0.5990805141047417, 5.877988051728221], [21.20985081271953, 0.5429644247791288, 3.6176334772720495], [24.74364856399063, 0.36633037918587696, 0.8947646660122857], [26.750724246296574, 0.22396231316751702, 4.19584657947663], [27.789478100527734, 0.336361408584521, 0.5000006524108507], [31.305272871407887, 0.1893481070994536, 1.3041309899357267]], "r_squared_": 0.9790414465347633, "error_": 0.048138121916501755}
{"freq_range": [2.0, 80.0], "freq_res": 0.5, "aperiodic_params_": [-7.715462821704228, 1.0092308296136843], "gaussian_params_": [[8.25384607857326, 0.4324279968982219, 1.0347491380499354], [10.716911874201637, 0.6359294278448498, 0.8425600908002402], [12.56449367488599, 0.4530360745375469, 0.3699110213942899], [13.767477182201707, 0.3430718690773513, 0.38353286399041076], [15.18032746912081, 0.2498118745671127, 0.830946234511964], [18.633985022265154, 0.7008982641304645, 3.6001361423249962], [25.88082968280412, 0.4454066864419041, 5.441700448548358]], "peak_params_": [[8.25384607857326, 0.45637136889502194, 2.069498276099871], [10.716911874201637, 0.7189961778121443, 1.6851201816004804], [12.56449367488599, 0.7027081412517511, 0.7398220427885798], [13.767477182201707, 0.7243295764134867, 0.7670657279808215], [15.18032746912081, 0.7274179867548138, 1.661892469023928], [18.633985022265154, 0.8780304020808405, 7.2002722846499925], [25.88082968280412, 0.5317205920598589, 10.883400897096717]], "r_squared_": 0.9917786081030737, "error_": 0.04083003395231062}
{"freq_range": [2.0, 80.0], "freq_res": 0.5, "aperiodic_params_": [-7.670769188861537, 1.1345606392394705], "gaussian_params_": [[7.982458297600263, 0.2771330354964353, 0.6746990720158569], [10.776554908342623, 0.4417942730879343, 2.073903822876554], [19.16353259165915, 0.9741537797744766, 4.757320079091581], [25.317204030957573, 0.1386730566907955, 0.2500000000000011], [29.004606178520266, 0.5325973975213105, 2.564643514631366], [33.351005404276414, 0.2629293831642813, 0.48782758774419516], [35.912225069978795, 0.22506957319866683, 1.2413804224642717], [38.417927247007384, 0.2327979628339192, 0.25000000000000006], [41.30248591431927, 0.1898569376659659, 0.7219800021846329], [43.59112852274566, 0.228408049106642, 0.29518544542135966]], "peak_params_": [[7.982458297600263, 0.5194156078624577, 1.3493981440317138], [10.776554908342623, 0.662714315807241, 4.147807645753108], [19.16353259165915, 0.9740128435448803, 9.514640158183163], [25.317204030957573, 0.7167434408320208, 0.5000000000000022], [29.004606178520266, 0.6474875149203676, 5.129287029262732], [33.351005404276414, 0.4100195915113094, 0.9756551754883903], [35.912225069978795, 0.2392722057086285, 2.4827608449285434], [38.417927247007384, 0.2471274115740627, 0.5000000000000001], [41.30248591431927, 0.18291219025283212, 1.4439600043692657], [43.59112852274566, 0.21962913012144725, 0.5903708908427193]], "r_squared_": 0.991899351212175, "error_": 0.043723264897575664}
{"freq_range": [2.0, 80.0], "freq_res": 0.5, "aperiodic_params_": [-7.404010145280647, 1.2361917147435137], "gaussian_params_": [[7.817811104025142, 0.2940096027338272, 0.7258420817883271], [9.362805701050048, 0.2304401740865359, 0.25000559679235557], [10.4716016742898, 0.30992035099370613, 0.45059077521502505], [12.189605617771944, 0.25943746669604406, 0.29921459550963037], [18.124657503196442, 0.801111855735132, 4.5037451398943995], [26.977411092886815, 0.5323698511445693, 2.4377033152504466], [30.48204339558264, 0.33107253195037145, 1.3098642674269183], [33.777572446904244, 0.2581336609187592, 0.8275608258766267], [35.81220057676696, 0.2229318753297744, 0.2500000003455098], [36.80919644927661, 0.17308631622291687, 0.5198978251715024], [38.54681786193761, 0.2253316101257509, 0.25000000000517725]], "peak_params_": [[7.817811104025142, 0.3489082033567552, 1.4516841635766542], [9.362805701050048, 0.3766331255236395, 0.5000111935847111], [10.4716016742898, 0.5007597370318599, 0.9011815504300501], [12.189605617771944, 0.5310002163783327, 0.5984291910192607], [18.124657503196442, 0.8014092014175862, 9.007490279788799], [26.977411092886815, 0.6569386680966254, 4.875406630500893], [30.48204339558264, 0.536917898505477, 2.6197285348538366], [33.777572446904244, 0.2679646237856499, 1.6551216517532534], [35.81220057676696, 0.22760048433494617, 0.5000000006910196], [36.80919644927661, 0.16218597090559328, 1.0397956503430048], [38.54681786193761, 0.22232520069562867, 0.5000000000103545]], "r_squared_": 0.9898329797325404, "error_": 0.047908472166215764}
{"freq_range": [2.0, 80.0], "freq_res": 0.5, "aperiodic_params_": [-7.310052314489054, 1.3115873011839403], "gaussian_params_": [[17.726693630776435, 0.878527935264158, 5.5181749771219835], [29.102231488046368, 0.40713664133657834, 3.90896014410228], [40.05453522914814, 0.1497612674951678, 2.9125829446483937]], "peak_params_": [[17.726693630776435, 0.8827613135142602, 11.036349954243967], [29.102231488046368, 0.516119367714909, 7.81792028820456], [40.05453522914814, 0.15834560277289178, 5.8251658892967875]], "r_squared_": 0.9853824994627106, "error_": 0.05917414190944475}
{"freq_range": [2.0, 80.0], "freq_res": 0.5, "aperiodic_params_": [-7.7540019556261015, 0.9423338525794526], "gaussian_params_": [[9.501875616224957, 0.31931303077817996, 2.075900425407117], [16.937808004575636, 0.7348144110451718, 3.934543102228465], [24.95355668072338, 0.4279941855432366, 4.862799424953379], [29.91149507974473, 0.09507497230777472, 0.7791398159543159], [31.713517171700342, 0.16006379376979524, 0.3544183649213737], [35.03451520358761, 0.15906934373825765, 0.3465521552677901]], "peak_params_": [[9.501875616224957, 0.44513754603359246, 4.151800850814234], [16.937808004575636, 0.8475315261966525, 7.86908620445693], [24.95355668072338, 0.5180146977601829, 9.725598849906758], [29.91149507974473, 0.3472284195254769, 1.5582796319086318], [31.713517171700342, 0.3191165757700496, 0.7088367298427474], [35.03451520358761, 0.20895363284442503, 0.6931043105355802]], "r_squared_": 0.9822589848926542, "error_": 0.055278701722576214}
{"freq_range": [2.0, 80.0], "freq_res": 0.5, "aperiodic_params_": [-8.23713313279651, 0.3339985004026589], "gaussian_params_": [[7.345546439582641, 0.25541584352624774, 0.28189075549375914], [9.328010363151396, 0.3262802716771047, 1.1225737824947235], [13.23891267675016, 0.3549631060082481, 2.415792021703415], [21.09835450100003, 0.4632413349393424, 4.750231234947624], [26.376857914958165, 0.14186387833713449, 0.2500041650167118], [27.516271360513944, 0.11405319276671998, 0.2884387922219514], [31.533514733341452, 0.2909878475249964, 3.2442195725405214], [38.57319236580646, 0.2583782726861133, 1.3537103312705097], [41.93061005010591, 0.20537785241860734, 0.5021529626662254], [43.6468815824779, 0.1334362997354165, 0.2500275183936935], [44.57293209547096, 0.2410772945693951, 1.1980582346383954], [47.40593274671994, 0.2472680704204471, 0.4772082540433258], [48.7851830736005, 0.328304900205225, 0.25000000000000006], [52.043745136987376, 0.17615494825876812, 0.7588090701873702], [54.66027185811506, 0.1842267591336909, 0.48483472035919156], [56.921408890509696, 0.19027919641437574, 0.406582679524591], [59.523405794195305, 0.15247486699854362, 0.28074595985013967], [61.619163373328036, 0.18182624532278774, 0.30788626967506777]], "peak_params_": [[7.345546439582641, 0.3352852833918867, 0.5637815109875183], [9.328010363151396, 0.45314460205777074, 2.245147564989447], [13.23891267675016, 0.4630932901261353, 4.83158404340683], [21.09835450100003, 0.46667419332954374, 9.500462469895249], [26.376857914958165, 0.4558863273733422, 0.5000083300334236], [27.516271360513944, 0.4350446835750219, 0.5768775844439028], [31.533514733341452, 0.3331053833505617, 6.488439145081043], [38.57319236580646, 0.28757833048552506, 2.7074206625410193], [41.93061005010591, 0.23956753411091292, 1.0043059253324509], [43.6468815824779, 0.2759513909859752, 0.500055036787387], [44.57293209547096, 0.24114608928309877, 2.396116469276791], [47.40593274671994, 0.25470210947312744, 0.9544165080866516], [48.7851830736005, 0.22821123316693992, 0.5000000000000001], [52.043745136987376, 0.17586252210658948, 1.5176181403747404], [54.66027185811506, 0.1753655385729509, 0.9696694407183831], [56.921408890509696, 0.18675904987108005, 0.813165359049182], [59.523405794195305, 0.15194589427696137, 0.5614919197002793], [61.619163373328036, 0.16870518454853212, 0.6157725393501355]], "r_squared_": 0.9554705969786553, "error_": 0.042709816047243526}
{"freq_range": [2.0, 80.0], "freq_res": 0.5, "aperiodic_params_": [-7.901673530374288, 0.5395801319352191], "gaussian_params_": [[9.043645525972796, 0.3383533175245786, 1.2793126580024972], [13.756614848668022, 0.43605256530178627, 2.954121592180666], [25.334982999103122, 0.28621058716955045, 5.999999999999999], [37.452034599458514, 0.12022540374354272, 5.999999972225791], [38.302071275396486, 0.1603239638200944, 0.499856519538252], [44.3913069964464, 0.1250770150183474, 1.6488167346296725], [47.29242884518999, 0.16778979674782274, 0.2719202781562917], [48.78623006169328, 0.23888156321886705, 0.25000000000000006], [52.857373133796074, 0.0895845567596302, 1.909856984600335], [56.74588478929747, 0.27956814008987985, 0.25000000879320833], [74.90300734455118, 0.16864830091946537, 0.25000000000000006]], "peak_params_": [[9.043645525972796, 0.4644692547225384, 2.5586253160049943], [13.756614848668022, 0.4828700111334516, 5.908243184361332], [25.334982999103122, 0.3027962571321705, 11.999999999999998], [37.452034599458514, 0.20113763562859255, 11.999999944451583], [38.302071275396486, 0.2926304029141278, 0.999713039076504], [44.3913069964464, 0.18686170982874728, 3.297633469259345], [47.29242884518999, 0.17817387234737758, 0.5438405563125834], [48.78623006169328, 0.19888589755688812, 0.5000000000000001], [52.857373133796074, 0.09352872817012248, 3.81971396920067], [56.74588478929747, 0.18766856982384894, 0.5000000175864167], [74.90300734455118, 0.15642159399172684, 0.5000000000000001]], "r_squared_": 0.9687353534624159, "error_": 0.041942019121600574}
{"freq_range": [2.0, 80.0], "freq_res": 0.5, "aperiodic_params_": [-7.452648984433184, 0.7309157775226726], "gaussian_params_": [[8.161174511009257, 0.6068930279076675, 0.9311783185200551], [10.425300234639627, 0.543686528182884, 0.9041317330886771], [12.433401104310974, 0.29725764042711617, 0.3527067896193096], [14.851832424319143, 0.46713676983813957, 1.7715162894969256], [20.807133899093902, 0.121053531611444, 2.252136538407536], [44.622083764240166, 0.14984047516262997, 0.25000000000000006], [53.92584696518671, 0.14735226000011706, 0.6506382273597716], [60.314432570960186, 0.09181611453748423, 1.0397656527837618], [65.86145440975272, 0.1438583858013215, 1.1380817665921883], [69.25106678172035, 0.10971642386314114, 0.6064105717754411], [73.18667197815417, 0.14535871040664833, 0.5444057270583148]], "peak_params_": [[8.161174511009257, 0.6130216518698193, 1.8623566370401101], [10.425300234639627, 0.5905908099952271, 1.8082634661773542], [12.433401104310974, 0.5247511993396747, 0.7054135792386192], [14.851832424319143, 0.46986472152288883, 3.5430325789938513], [20.807133899093902, 0.12174270385571795, 4.504273076815072], [44.622083764240166, 0.1329982094482247, 0.5000000000000001], [53.92584696518671, 0.14639837593491833, 1.3012764547195432], [60.314432570960186, 0.09036762877882332, 2.0795313055675235], [65.86145440975272, 0.14279645107563077, 2.2761635331843766], [69.25106678172035, 0.10171861254614356, 1.2128211435508822], [73.18667197815417, 0.13705980225798164, 1.0888114541166296]], "r_squared_": 0.9787650852272448, "error_": 0.04232785825310258}
{"freq_range": [2.0, 80.0], "freq_res": 0.5, "aperiodic_params_": [-7.493736882992881, 0.9136318077834156], "gaussian_params_": [[8.80334844786328, 0.45807378227616824, 1.5187828749563532], [15.130222111703324, 0.4256380373987776, 3.5156656386923495], [19.61609783822192, 0.09374645260473251, 0.37751219767825206], [21.533280375569163, 0.12947857181091676, 0.3953667016870748], [23.221916670337606, 0.18877005644924247, 0.9822615344287533], [60.399753403364755, 0.15155362229250802, 0.25000000000000006], [65.12555587065212, 0.09695898064870438, 1.9461909577909118], [75.35361600121448, 0.18446794477195858, 0.6629679856367067]], "peak_params_": [[8.80334844786328, 0.5473213710458928, 3.0375657499127064], [15.130222111703324, 0.4254573728535611, 7.031331277384699], [19.61609783822192, 0.28615329596407335, 0.7550243953565041], [21.533280375569163, 0.2520837823333526, 0.7907334033741495], [23.221916670337606, 0.21889618358879837, 1.9645230688575066], [60.399753403364755, 0.1456002998250021, 0.5000000000000001], [65.12555587065212, 0.09675741831119389, 3.8923819155818236], [75.35361600121448, 0.18002568385215945, 1.3259359712734133]], "r_squared_": 0.9841116106016343, "error_": 0.04239283113325833}
{"freq_range": [2.0, 80.0], "freq_res": 0.5, "aperiodic_params_": [-7.3743111501702625, 1.0599282187168175], "gaussian_params_": [[16.855741079522716, 0.5335295777440947, 5.857939458734293], [28.94183938123624, 0.11888947185827019, 0.275844416895157], [33.77398270043202, 0.10262565921261227, 4.71588714305914]], "peak_params_": [[16.855741079522716, 0.5335514743251561, 11.715878917468586], [28.94183938123624, 0.23996906504039295, 0.551688833790314], [33.77398270043202, 0.10987341633414438, 9.43177428611828]], "r_squared_": 0.9825637835964173, "error_": 0.049307653649096526}
{"freq_range": [2.0, 80.0], "freq_res": 0.5, "aperiodic_params_": [-7.374712101673818, 1.2233518741555829], "gaussian_params_": [[9.494173442856027, 0.35309294447680684, 1.7563684985686148], [17.78321225515897, 0.7238868212032933, 4.707079237272187], [25.321315363650204, 0.311444430985098, 0.7644193889125279], [26.905361800855406, 0.24174810693122578, 0.34894338160500654], [29.436623239260786, 0.3264882200921356, 1.2644209484036697], [32.08031075726718, 0.2721144776690598, 0.623709099226726], [34.24179373557229, 0.30043669927269917, 0.445068891774219], [36.4614714833631, 0.2314843432051078, 0.4673429417430034], [39.978286593492456, 0.18697830222388245, 2.0326269819848384], [41.512597060283824, 0.086792905283843, 0.25000000000000006]], "peak_params_": [[9.494173442856027, 0.5069907422578552, 3.5127369971372295], [17.78321225515897, 0.7231223522905186, 9.414158474544374], [25.321315363650204, 0.49451275605420975, 1.5288387778250558], [26.905361800855406, 0.41838799738078514, 0.6978867632100131], [29.436623239260786, 0.3588062238945984, 2.5288418968073394], [32.08031075726718, 0.3193391581528804, 1.247418198453452], [34.24179373557229, 0.26647692792756494, 0.890137783548438], [36.4614714833631, 0.27421009493388837, 0.9346858834860068], [39.978286593492456, 0.18697816072645956, 4.065253963969677], [41.512597060283824, 0.22796715486146724, 0.5000000000000001]], "r_squared_": 0.990465833668259, "error_": 0.04667510583724537}
{"freq_range": [2.0, 80.0], "freq_res": 0.5, "aperiodic_params_": [-7.419764970334393, 1.2169263167833018], "gaussian_params_": [[7.2770026904677225, 0.1781154322457722, 0.7807337022651754], [10.109627306703691, 0.3034413340981155, 1.5608891229460666], [17.795079896564285, 0.751987739705496, 4.828700488322019], [25.892977072831208, 0.26845387765734424, 1.068570508871709], [29.32947401165108, 0.2866581634735493, 1.1709999382644598], [31.72387696417414, 0.32885003794421164, 0.2500000000000075], [34.1307532500279, 0.19194909067506297, 1.0583744312306769], [36.58892185362748, 0.19905031800562245, 0.49378332048513185], [39.777460979946014, 0.1916219073102464, 1.1272059616994636], [43.55297354480263, 0.17049491571336772, 0.47152459343550934]], "peak_params_": [[7.2770026904677225, 0.32347279748561775, 1.5614674045303507], [10.109627306703691, 0.5074233941693613, 3.1217782458921333], [17.795079896564285, 0.7513117449428588, 9.657400976644038], [25.892977072831208, 0.44966451369428917, 2.137141017743418], [29.32947401165108, 0.32438427983736595, 2.3419998765289196], [31.72387696417414, 0.29379990441377224, 0.500000000000015], [34.1307532500279, 0.19328637759618772, 2.1167488624613537], [36.58892185362748, 0.21472843377909, 0.9875666409702637], [39.777460979946014, 0.18794294487113739, 2.2544119233989273], [43.55297354480263, 0.17024361810616284, 0.9430491868710187]], "r_squared_": 0.9887305942724887, "error_": 0.04697371424105452}
{"freq_range": [2.0, 80.0], "freq_res": 0.5, "aperiodic_params_": [-7.483596047025745, 1.0816763429530891], "gaussian_params_": [[8.006180854884704, 0.28871775664768484, 1.2200881058383475], [11.073504678850343, 0.34955929271981157, 2.137477015478985], [18.558235026389717, 0.5646927557919185, 4.5567995256052365], [25.5311636770227, 0.13946169611854337, 0.760631781115222], [27.76896182954499, 0.1321920213618246, 0.25002972389661743], [29.49496710593174, 0.09224599128288118, 0.5641945600467521], [31.54318414701476, 0.12443912962520408, 0.25000000000000006], [34.83525448650933, 0.1617259021925622, 0.25000000000000056], [35.273652975098486, 0.09988471773698451, 5.999999968438588]], "peak_params_": [[8.006180854884704, 0.4515901534644726, 2.440176211676695], [11.073504678850343, 0.5062964141509223, 4.27495403095797], [18.558235026389717, 0.5674889630179525, 9.113599051210473], [25.5311636770227, 0.3428095272634497, 1.521263562230444], [27.76896182954499, 0.20363677707373462, 0.5000594477932349], [29.49496710593174, 0.18671808713910565, 1.1283891200935041], [31.54318414701476, 0.21472956025101375, 0.5000000000000001], [34.83525448650933, 0.23078312110745003, 0.5000000000000011], [35.273652975098486, 0.10509158240184568, 11.999999936877176]], "r_squared_": 0.9892990477714524, "error_": 0.04251938072015277}
{"freq_range": [2.0, 80.0], "freq_res": 0.5, "aperiodic_params_": [-7.408671691354014, 0.8856100903835945], "gaussian_params_": [[9.697562773282618, 0.4856565937743282, 2.3200284458242586], [17.405688733779158, 0.22428823766848324, 4.331133977751056], [24.551361065061183, 0.08278577828813752, 1.0825867234487707], [34.07278260793821, 0.16072031690353117, 0.642113584676692], [43.47715779344056, 0.11197696578116562, 1.5557703839148411], [46.81055209640565, 0.1574086854593562, 0.32423615346453044], [59.79002928199423, 0.14359459751847906, 0.4449475779963083], [64.5985004606552, 0.1401320401661158, 0.43029906164739384], [67.76455489109696, 0.13853505430432678, 0.5544027708689026], [74.22114951527381, 0.16053451184167, 1.6304705504012977]], "peak_params_": [[9.697562773282618, 0.5262944417108208, 4.640056891648517], [17.405688733779158, 0.22593460387640008, 8.662267955502111], [24.551361065061183, 0.1413341606365588, 2.1651734468975414], [34.07278260793821, 0.15983677029347376, 1.284227169353384], [43.47715779344056, 0.11196490002593862, 3.1115407678296823], [46.81055209640565, 0.14133206961622768, 0.6484723069290609], [59.79002928199423, 0.12846407276787453, 0.8898951559926166], [64.5985004606552, 0.13650823014231328, 0.8605981232947877], [67.76455489109696, 0.1266997484223058, 1.108805541737805], [74.22114951527381, 0.15906460913945786, 3.2609411008025955]], "r_squared_": 0.9829329450888967, "error_": 0.04139729286622225}
{"freq_range": [2.0, 80.0], "freq_res": 0.5, "aperiodic_params_": [-7.5656398460344025, 0.7089186133926438], "gaussian_params_": [[10.276057951676718, 0.4818881676592524, 2.3323437783306367], [17.726017299567975, 0.11544704909548803, 3.550552588737849], [33.996957725568016, 0.15398093237779234, 0.4580079175958709], [43.06776100871045, 0.13733314086967385, 0.780906351441265], [46.7528617798536, 0.25616706755037955, 0.25000000000000006], [56.18352583633865, 0.24680609664470574, 0.25000000000000006], [59.71989571335011, 0.20275227901915605, 0.25000000000000006], [62.28831866569335, 0.21576334525190613, 0.25000000000000006], [64.67170440660364, 0.14032977700051932, 0.5951315293058647], [67.41856779874149, 0.14543681709810982, 0.7338287335440165], [68.42543317913022, 0.11813779856595878, 0.25000000000000006], [72.06210663736124, 0.08075991445939092, 0.25000000000000006], [72.84180236064137, 0.053866681185924484, 0.25000000000000006], [74.79465664664296, 0.17279962629631507, 2.1956970605664767], [79.60929662164195, 0.16141556304760454, 0.631767014842304]], "peak_params_": [[10.276057951676718, 0.49422549701091434, 4.664687556661273], [17.726017299567975, 0.11919270805363347, 7.101105177475698], [33.996957725568016, 0.15398070093808514, 0.9160158351917418], [43.06776100871045, 0.13681709307063805, 1.56181270288253], [46.7528617798536, 0.15715210624859566, 0.5000000000000001], [56.18352583633865, 0.18850963764477235, 0.5000000000000001], [59.71989571335011, 0.13771026313240853, 0.5000000000000001], [62.28831866569335, 0.15094334860221537, 0.5000000000000001], [64.67170440660364, 0.13466541044643776, 1.1902630586117293], [67.41856779874149, 0.1453639665112174, 1.467657467088033], [68.42543317913022, 0.16493565604915084, 0.5000000000000001], [72.06210663736124, 0.15536352400233966, 0.5000000000000001], [72.84180236064137, 0.16789380237227292, 0.5000000000000001], [74.79465664664296, 0.17204561125757145, 4.3913941211329535], [79.60929662164195, 0.1764088284058829, 1.263534029684608]], "r_squared_": 0.9726607065917369, "error_": 0.039004936647863794}
{"freq_range": [2.0, 80.0], "freq_res": 0.5, "aperiodic_params_": [-7.96562518532377, 0.7212584781260328], "gaussian_params_": [[8.308707713430202, 0.5773410972076352, 0.7928592791962457], [10.59745938258527, 0.3647428084666879, 0.5792483462918051], [12.531240255859625, 0.38236782860255647, 1.0092002905050366], [14.76081566468483, 0.2703031934321979, 0.3530715437757171], [16.280044418364668, 0.2701162391426491, 0.6955440158072114], [19.10876235539835, 0.1912994677665676, 0.25000000000000006], [21.56913563286089, 0.15455697818009204, 0.33287947755850583], [56.67805189870392, 0.05386233125332893, 5.091420079231976], [68.54796540086404, 0.09954847774971276, 5.999999999999999], [73.20277096285426, 0.22442196736834946, 0.25000000000000006]], "peak_params_": [[8.308707713430202, 0.561429291291125, 1.5857185583924913], [10.59745938258527, 0.42272943696778675, 1.1584966925836102], [12.531240255859625, 0.3838426297864057, 2.018400581010073], [14.76081566468483, 0.28373936817740386, 0.7061430875514342], [16.280044418364668, 0.2571109514796053, 1.3910880316144227], [19.10876235539835, 0.1741553205198496, 0.5000000000000001], [21.56913563286089, 0.15125925984590083, 0.6657589551170117], [56.67805189870392, 0.067087712597516, 10.182840158463952], [68.54796540086404, 0.10318077105046441, 11.999999999999998], [73.20277096285426, 0.23742383668178135, 0.5000000000000001]], "r_squared_": 0.9691168668558482, "error_": 0.041739147895376964}
{"freq_range": [2.0, 80.0], "freq_res": 0.5, "aperiodic_params_": [-7.3671311721559105, 0.8943925139563776], "gaussian_params_": [[8.543794378338069, 0.46238768687069354, 1.039964735546028], [10.67327601244705, 0.36450782934921927, 0.5634285853469411], [12.518674528058893, 0.4187596998690804, 0.6238470088022116], [14.482249036716302, 0.2309844349660648, 0.5786076257335553], [16.13814270727664, 0.28376342862403714, 1.0366206311409352], [19.06831395715356, 0.15088826769434802, 0.25000000000000006], [31.64560147156094, 0.1493993750624888, 0.26918985443286564], [60.72363195928117, 0.13646537079622167, 1.0978768532080891], [66.17328003952304, 0.1481880597919226, 1.3979708288287123], [69.48534503039218, 0.14862044128688495, 1.1482342473525524], [72.95510227429625, 0.20501565833170812, 0.3885378746350217], [78.54791959017257, 0.11374901455613211, 4.069236152373327]], "peak_params_": [[8.543794378338069, 0.46219213345898336, 2.079929471092056], [10.67327601244705, 0.4287292342559921, 1.1268571706938821], [12.518674528058893, 0.4220601404298501, 1.2476940176044231], [14.482249036716302, 0.31498851325451227, 1.1572152514671106], [16.13814270727664, 0.2886588357162072, 2.0732412622818703], [19.06831395715356, 0.15163807120907613, 0.5000000000000001], [31.64560147156094, 0.1290685110930081, 0.5383797088657313], [60.72363195928117, 0.13370885385091924, 2.1957537064161783], [66.17328003952304, 0.1495190187383404, 2.7959416576574245], [69.48534503039218, 0.16694340713653943, 2.296468494705105], [72.95510227429625, 0.24993195062043583, 0.7770757492700434], [78.54791959017257, 0.11374112771682476, 8.138472304746655]], "r_squared_": 0.9795970193812342, "error_": 0.04033495215590413}
{"freq_range": [2.0, 80.0], "freq_res": 0.5, "aperiodic_params_": [-7.172855836973267, 1.1149149833164536], "gaussian_params_": [[6.097640279799827, 0.15193854382026886, 0.2752459312106871], [7.132231602367588, 0.1866673736811033, 0.2540630432851598], [8.319731018234013, 0.19803308588568974, 0.8261638794114119], [10.343386899440729, 0.18131013165530965, 0.45978682205786653], [12.775111284975415, 0.07550263179614512, 1.0305263377400933], [16.327149403027125, 0.33574043084953786, 4.326073913050556], [34.26605010917275, 0.20582116301811818, 0.25000000000000006], [37.286815719909946, 0.11258905419930842, 4.38703186378538], [69.62440145732207, 0.16350310496988762, 0.25000000000000006], [75.63521813909684, 0.20342041122150278, 0.5114594641168589], [79.68242082000155, 0.28426887985955834, 0.27524494781189657]], "peak_params_": [[6.097640279799827, 0.16595973752253634, 0.5504918624213742], [7.132231602367588, 0.25186950215071047, 0.5081260865703195], [8.319731018234013, 0.2587842186161593, 1.6523277588228238], [10.343386899440729, 0.31930424532311896, 0.9195736441157331], [12.775111284975415, 0.3235077027120923, 2.0610526754801866], [16.327149403027125, 0.3355839284916069, 8.652147826101112], [34.26605010917275, 0.22490729459540582, 0.5000000000000001], [37.286815719909946, 0.11245831026692166, 8.77406372757076], [69.62440145732207, 0.144463401712839, 0.5000000000000001], [75.63521813909684, 0.19643414184953834, 1.0229189282337179], [79.68242082000155, 0.2282168783160028, 0.5504898956237931]], "r_squared_": 0.9845079074950247, "error_": 0.04120403410611474}
{"freq_range": [2.0, 80.0], "freq_res": 0.5, "aperiodic_params_": [-7.269264920009476, 1.2417874016532664], "gaussian_params_": [[8.180616666503509, 0.2102314790936288, 0.2500000000011068], [9.336526435410809, 0.1558649170946165, 0.25000001315963427], [10.255250944371735, 0.25286599103305046, 0.2500000000000004], [16.737745518697007, 0.4447767801734725, 4.470187901748789], [24.08677928123741, 0.1503634138543369, 0.6411124150362129], [29.552332660132723, 0.20696940527811664, 3.2519065136797565], [34.5622486103775, 0.13058161332256502, 0.5017140059229312], [36.830841205041224, 0.20025501184175262, 0.34459054588225396], [38.52249357992769, 0.17022283260977938, 0.3828914290055044], [40.300044882294166, 0.12676914483659735, 0.7528309935319702], [52.015277579945675, 0.11976125559903229, 0.31821844488219003], [63.55338248919533, 0.12986839991477087, 0.25000000000000006], [67.33821336342623, 0.15045865503008082, 0.25000000000000006]], "peak_params_": [[8.180616666503509, 0.22777921580327032, 0.5000000000022136], [9.336526435410809, 0.24841885812167241, 0.5000000263192685], [10.255250944371735, 0.3245989687371562, 0.5000000000000008], [16.737745518697007, 0.44421388400535733, 8.940375803497577], [24.08677928123741, 0.3160287323468438, 1.2822248300724257], [29.552332660132723, 0.2144971132719249, 6.503813027359513], [34.5622486103775, 0.19479521701124014, 1.0034280118458625], [36.830841205041224, 0.19263943567258934, 0.6891810917645079], [38.52249357992769, 0.18190286558536783, 0.7657828580110088], [40.300044882294166, 0.12309208017669349, 1.5056619870639405], [52.015277579945675, 0.11962331423488237, 0.6364368897643801], [63.55338248919533, 0.1269412153646261, 0.5000000000000001], [67.33821336342623, 0.12203269527031857, 0.5000000000000001]], "r_squared_": 0.9906400895646202, "error_": 0.03913107430302259}
{"freq_range": [2.0, 80.0], "freq_res": 0.5, "aperiodic_params_": [-7.065484071866859, 1.2307265917277481], "gaussian_params_": [[8.07384908026501, 0.3308832834639989, 2.062814649295821], [16.264954643816626, 0.2875498005623395, 4.8353478449615555], [24.88085525902518, 0.17304969846360696, 0.7473660594909607], [29.06111724514497, 0.20426961671216806, 0.3638109442544238], [29.793339305609006, 0.2028200667378719, 0.2500000000000027], [32.375353551214275, 0.09387841044919115, 0.2500000602183964], [35.01100896367679, 0.14177624825820212, 2.364151033068128], [41.87081702268475, 0.09519499819055578, 0.2500000001386576], [44.34776764466368, 0.10849363969347878, 2.563667823485126], [60.12169119952523, 0.2310628971613963, 0.38315594589548324]], "peak_params_": [[8.07384908026501, 0.39739633915977723, 4.125629298591642], [16.264954643816626, 0.28728906403589427, 9.670695689923111], [24.88085525902518, 0.22712557566664238, 1.4947321189819214], [29.06111724514497, 0.21728530848359284, 0.7276218885088476], [29.793339305609006, 0.17151927115195242, 0.5000000000000054], [32.375353551214275, 0.16459019213792914, 0.5000001204367928], [35.01100896367679, 0.14207349273520187, 4.728302066136256], [41.87081702268475, 0.15642531016904826, 0.5000000002773152], [44.34776764466368, 0.10834756204580032, 5.127335646970252], [60.12169119952523, 0.21969810576742077, 0.7663118917909665]], "r_squared_": 0.9880874701063227, "error_": 0.042473705445346316}
{"freq_range": [2.0, 80.0], "freq_res": 0.5, "aperiodic_params_": [-7.272418906558859, 0.944153052380673], "gaussian_params_": [[9.264183202949043, 0.44487351690263555, 2.115391044698433], [16.65553215484547, 0.1865939598920793, 4.364639792973374], [20.17568921690445, 0.06452610889619227, 0.445627137222494], [25.319032966527196, 0.1437684059830055, 0.25000000000000006], [30.42604815091093, 0.140744917622043, 1.3023073191064234], [34.508465930196806, 0.14567393555975539, 1.2383380619871662], [41.726066751840946, 0.04032339205724079, 2.195567682646046], [44.08071332057364, 0.10164463404222011, 1.5198455617316529], [51.01157976817088, 0.12259858029902405, 0.48029543723649437], [56.02214903859901, 0.13264517698563297, 0.3461693957784884]], "peak_params_": [[9.264183202949043, 0.4907879849195087, 4.230782089396866], [16.65553215484547, 0.18775658058252453, 8.729279585946747], [20.17568921690445, 0.1988248124368024, 0.891254274444988], [25.319032966527196, 0.13468830833876844, 0.5000000000000001], [30.42604815091093, 0.1425104375222066, 2.6046146382128468], [34.508465930196806, 0.1469489737958547, 2.4766761239743325], [41.726066751840946, 0.06415371014702842, 4.391135365292092], [44.08071332057364, 0.1250861958264764, 3.0396911234633057], [51.01157976817088, 0.12257154930002656, 0.9605908744729887], [56.02214903859901, 0.13237393967093958, 0.6923387915569768]], "r_squared_": 0.9860499313278798, "error_": 0.037702581189751644}
{"freq_range": [2.0, 80.0], "freq_res": 0.5, "aperiodic_params_": [-8.22405802545535, 0.5031498115665705], "gaussian_params_": [[9.11004845417724, 0.4411615959408646, 1.2189436043617354], [13.717516397152869, 0.31932903339949065, 2.734172866811134], [17.260135721218763, 0.28235406541786606, 0.25000000001285627], [19.84704479315268, 0.1603145491989621, 0.8628448888363679], [22.11628191207322, 0.1905717239451747, 0.28971606271940564], [26.370588309597533, 0.23972129008030935, 5.092451370138147], [31.383022486096138, 0.1124868709163566, 0.6385822126130241], [35.62051113880709, 0.18468092465904282, 0.683829908855102], [37.27398270043202, 0.11631753562078051, 0.42464057176270087], [43.94822559644404, 0.14957307724594035, 2.0976006778058314], [51.015361073899385, 0.14002802685792448, 0.9159616044365064]], "peak_params_": [[9.11004845417724, 0.5121574744831072, 2.437887208723471], [13.717516397152869, 0.3288252377673846, 5.468345733622268], [17.260135721218763, 0.3573889838206892, 0.5000000000257125], [19.84704479315268, 0.2902233778197516, 1.7256897776727358], [22.11628191207322, 0.35206698368674516, 0.5794321254388113], [26.370588309597533, 0.23964962779262322, 10.184902740276295], [31.383022486096138, 0.2549583620458762, 1.2771644252260481], [35.62051113880709, 0.2299628498484516, 1.367659817710204], [37.27398270043202, 0.1285155970883558, 0.8492811435254017], [43.94822559644404, 0.15012633830181343, 4.195201355611663], [51.015361073899385, 0.1405359619230353, 1.8319232088730129]], "r_squared_": 0.9592657611003904, "error_": 0.0419510006616578}
{"freq_range": [2.0, 80.0], "freq_res": 0.5, "aperiodic_params_": [-7.59670146850878, 1.0353066374865805], "gaussian_params_": [[8.765056598794935, 0.25595739494249703, 2.2360411594271654], [12.38487608534526, 0.10455402067481248, 0.2602270233939416], [16.27866762689397, 0.27573491411101814, 3.005704084963588], [34.263382332486096, 0.2618712536494381, 0.25000000000000006], [38.91917096134758, 0.15299819266820416, 0.5049763348364107], [65.87013991898613, 0.1060503868325154, 0.8531381540845224], [67.85192590765534, 0.1489343013565706, 0.4770251282540319], [71.45341853971016, 0.14159269732476448, 0.3092371387137932], [75.97965596117186, 0.1598493318372669, 1.3615789040344786], [79.70702127827464, 0.25204712025099596, 0.5326308253425209]], "peak_params_": [[8.765056598794935, 0.2692406965618712, 4.472082318854331], [12.38487608534526, 0.28335283090395436, 0.5204540467878832], [16.27866762689397, 0.2756336262568784, 6.011408169927176], [34.263382332486096, 0.16732694237303747, 0.5000000000000001], [38.91917096134758, 0.15105072477582837, 1.0099526696728214], [65.87013991898613, 0.10490838893657717, 1.7062763081690449], [67.85192590765534, 0.14662954416645846, 0.9540502565080639], [71.45341853971016, 0.14070859433997818, 0.6184742774275864], [75.97965596117186, 0.15983148977177386, 2.723157808068957], [79.70702127827464, 0.23936120223779866, 1.0652616506850419]], "r_squared_": 0.9827459924690465, "error_": 0.04234079172445874}
{"freq_range": [2.0, 80.0], "freq_res": 0.5, "aperiodic_params_": [-7.66559425122976, 1.0806577513710702], "gaussian_params_": [[4.717299248832522, 0.2019552165010931, 0.5022463048790593], [7.758203071863444, 0.290892070903458, 0.9735655395450793], [10.205722659991975, 0.2342939256615031, 0.4656262317574011], [12.01752157648138, 0.11567787553989053, 0.6246290071468651], [14.661041130610249, 0.11726012241626381, 0.25000000000000006], [17.323197216388078, 0.2971096434825962, 2.6741349489809316], [27.966819868000393, 0.0520627923559646, 3.4634611020579356], [59.68075209346981, 0.13862179240014522, 1.6515165089441612], [64.67933060371053, 0.11625656001034068, 0.7085654070516595], [69.64888478795868, 0.14423579729333144, 1.9949978177588574], [72.06869552754235, 0.10249340797590653, 0.2500000023786683], [74.62022165519951, 0.14437566418159176, 0.3827235060272225], [75.72430098679499, 0.09327147891075321, 0.7152536526454847], [78.77398270043201, 0.13679755213998346, 2.7179913214684213]], "peak_params_": [[4.717299248832522, 0.1849893967278149, 1.0044926097581186], [7.758203071863444, 0.28274195269915303, 1.9471310790901586], [10.205722659991975, 0.24065223474553576, 0.9312524635148022], [12.01752157648138, 0.15676406130736886, 1.2492580142937302], [14.661041130610249, 0.26553100640806093, 0.5000000000000001], [17.323197216388078, 0.2970021546568713, 5.348269897961863], [27.966819868000393, 0.05216305608686156, 6.926922204115871], [59.68075209346981, 0.13779438249198073, 3.3030330178883225], [64.67933060371053, 0.11971471073795215, 1.417130814103319], [69.64888478795868, 0.14424020603584076, 3.989995635517715], [72.06869552754235, 0.17684867273859872, 0.5000000047573366], [74.62022165519951, 0.20621227162360078, 0.765447012054445], [75.72430098679499, 0.16725526958132342, 1.4305073052909694], [78.77398270043201, 0.136330442911202, 5.4359826429368425]], "r_squared_": 0.9874197661822149, "error_": 0.03309818102090344}
{"freq_range": [2.0, 80.0], "freq_res": 0.5, "aperiodic_params_": [-7.48635851848613, 1.055345162626823], "gaussian_params_": [[4.6222290550553025, 0.18550588170788565, 0.29800008469637795], [6.853831731510819, 0.33707944602232975, 1.4201267436048144], [10.216815566608737, 0.28756047332690804, 1.5819372934455431], [16.720229631755405, 0.2668963205740321, 2.4722591376504974], [21.385223625886805, 0.2005428369798877, 0.25000000000000006], [24.475376794531844, 0.11175925610662533, 1.1728714326043146], [29.386581266696336, 0.1940190011131987, 0.5358768659139022], [59.98438147045624, 0.18814522093517247, 0.3979155978321209], [69.81722284336563, 0.12164404964609567, 0.8045173662160578], [74.63071755795436, 0.15508391758593296, 0.6805268130928229]], "peak_params_": [[4.6222290550553025, 0.2563055527746112, 0.5960001693927559], [6.853831731510819, 0.37179323765063366, 2.840253487209629], [10.216815566608737, 0.32047841328848214, 3.1638745868910862], [16.720229631755405, 0.265947396224524, 4.944518275300995], [21.385223625886805, 0.22613733888755938, 0.5000000000000001], [24.475376794531844, 0.1136227885992831, 2.345742865208629], [29.386581266696336, 0.1897336471735489, 1.0717537318278043], [59.98438147045624, 0.18800034565301083, 0.7958311956642418], [69.81722284336563, 0.11854490445912269, 1.6090347324321157], [74.63071755795436, 0.15224917543844718, 1.3610536261856458]], "r_squared_": 0.9869473775513041, "error_": 0.039602224776245525}
