{"freq_range": [2.0, 80.0], "freq_res": 0.5, "aperiodic_params_": [-8.19596477849896, 0.7266752315418404], "gaussian_params_": [[7.801058226565649, 0.6639991426998024, 0.7181414513556814], [10.54031727230897, 0.20032067667499107, 0.8764292924828138], [12.7739826734582, 0.08815122430888545, 0.8166609412515958], [15.270919305932518, 0.2942040661071578, 0.250001268809824], [17.163441969056578, 0.13399979580463448, 1.3655794371664636], [23.161560821040595, 0.25182000640834223, 2.4865351667751114], [25.636541069616953, 0.2580173705754458, 0.3082010028105451], [27.077140099595777, 0.327722347237283, 0.39204847330190995], [28.739509389064146, 0.16857205202298225, 0.6611043699415], [30.185091312267044, 0.26000065485574503, 0.2500000000000001], [31.148941952228054, 0.21375660886638076, 0.30386886291874504], [32.535751641529465, 0.16270155900402555, 0.33601877718788076], [41.433690675706636, 0.1807144504487273, 0.2703869688980218], [57.69825519950776, 0.22522710826529993, 0.25000000000000006], [58.78769607750644, 0.18659769897967915, 0.25265376843882065], [60.684826242059735, 0.1586178991219814, 0.840897704659065], [63.02094724797344, 0.17072015592133108, 0.25000000000000006], [70.92913135343979, 0.16816677684396283, 0.3552503792000317]], "peak_params_": [[7.801058226565649, 0.6420056208213651, 1.4362829027113628], [10.54031727230897, 0.20250576727558922, 1.7528585849656275], [12.7739826734582, 0.09008577552828889, 1.6333218825031917], [15.270919305932518, 0.25967275426931735, 0.500002537619648], [17.163441969056578, 0.1447313903040346, 2.731158874332927], [23.161560821040595, 0.25130348468033503, 4.973070333550223], [25.636541069616953, 0.39582320563618545, 0.6164020056210902], [27.077140099595777, 0.40323838859920436, 0.7840969466038199], [28.739509389064146, 0.18344617633257343, 1.322208739883], [30.185091312267044, 0.23095547290241214, 0.5000000000000002], [31.148941952228054, 0.19308611427410582, 0.6077377258374901], [32.535751641529465, 0.16201207537841533, 0.6720375543757615], [41.433690675706636, 0.175361082345443, 0.5407739377960435], [57.69825519950776, 0.16458232792414407, 0.5000000000000001], [58.78769607750644, 0.1524054825920107, 0.5053075368776413], [60.684826242059735, 0.15483235381954685, 1.68179540931813], [63.02094724797344, 0.17370563072094036, 0.5000000000000001], [70.92913135343979, 0.16485366762398712, 0.7105007584000634]], "r_squared_": 0.9760402152114491, "error_": 0.0368284304207868}
{"freq_range": [2.0, 80.0], "freq_res": 0.5, "aperiodic_params_": [-8.141355346366945, 0.7898938233931335], "gaussian_params_": [[7.748888333771095, 0.5672664114795626, 0.8347847618454046], [10.551920187643637, 0.2345739318615528, 0.814953803620785], [13.39442202395875, 0.11236262034810836, 1.1532927442081753], [21.481909842979984, 0.3332864898120237, 5.163896298401511], [28.38292286906739, 0.13554743602028063, 0.3197088851338973], [32.15731073670439, 0.14756626333297257, 0.30171799691160417], [54.41654366630267, 0.11134994590396437, 0.25000000000000006], [76.55326803090942, 0.1812897484650832, 0.34085193479080955]], "peak_params_": [[7.748888333771095, 0.5513456860667816, 1.6695695236908092], [10.551920187643637, 0.2761330598644687, 1.62990760724157], [13.39442202395875, 0.213156382742687, 2.3065854884163506], [21.481909842979984, 0.333284444707159, 10.327792596803022], [28.38292286906739, 0.25910931489037914, 0.6394177702677946], [32.15731073670439, 0.17068451796218298, 0.6034359938232083], [54.41654366630267, 0.10531525021462151, 0.5000000000000001], [76.55326803090942, 0.17908937703215067, 0.6817038695816191]], "r_squared_": 0.9840973552585667, "error_": 0.036518397130086776}
{"freq_range": [2.0, 80.0], "freq_res": 0.5, "aperiodic_params_": [-8.51547444469421, 0.4906319541695775], "gaussian_params_": [[7.942014904799217, 0.5172372907947707, 0.6299043868217068], [17.7141905732534, 0.42514886595575385, 5.564013067622301], [23.296369941371296, 0.14792571990802747, 0.55952613104134], [25.25494554155072, 0.3701812174243854, 0.25000000000000006], [26.4591859743018, 0.299987552347773, 0.7002144758312091], [28.342162761996235, 0.19723488062034222, 0.25000000000000006], [30.08420397998618, 0.18024709491081436, 1.2492405116189258], [41.08683017554693, 0.2011537510318061, 0.40189163845475684]], "peak_params_": [[7.942014904799217, 0.6076571831924795, 1.2598087736434136], [17.7141905732534, 0.42483396457443057, 11.128026135244601], [23.296369941371296, 0.38607873292375317, 1.11905226208268], [25.25494554155072, 0.5063514165737573, 0.5000000000000001], [26.4591859743018, 0.4246314750755751, 1.4004289516624182], [28.342162761996235, 0.31149232016393746, 0.5000000000000001], [30.08420397998618, 0.21697622436212072, 2.4984810232378516], [41.08683017554693, 0.1965801383048813, 0.8037832769095137]], "r_squared_": 0.9492630753889754, "error_": 0.051812646741362454}
{"freq_range": [2.0, 80.0], "freq_res": 0.5, "aperiodic_params_": [-8.039468277576452, 0.8973360125235262], "gaussian_params_": [[7.80434543556766, 0.6859157341702764, 0.8158631388511265], [10.587741848703487, 0.3285552815607094, 0.508147091765064], [11.685859247746274, 0.11889540907810403, 0.25000000000000006], [14.847771730641691, 0.3105290693490368, 2.5149587278050887], [19.0069559024535, 0.14829971751186782, 0.6059838986009004], [21.16799070789494, 0.20927624113235563, 0.25000000000000006], [25.194281459376562, 0.3705107187251448, 3.894827065333137], [41.532753187919006, 0.14504952458062748, 0.25000000000000006], [57.73645028752892, 0.22445005604909682, 0.25000000000000006], [63.0037169033288, 0.14133834206350995, 0.25000000000000006], [70.84345741514647, 0.21135317637516018, 0.41742643475021446], [77.1440395698772, 0.24949468444895195, 0.4082848200821337]], "peak_params_": [[7.80434543556766, 0.6741203458046297, 1.631726277702253], [10.587741848703487, 0.39660164135933407, 1.016294183530128], [11.685859247746274, 0.28458993776459174, 0.5000000000000001], [14.847771730641691, 0.32201618925027375, 5.029917455610177], [19.0069559024535, 0.33236582175066687, 1.2119677972018008], [21.16799070789494, 0.3907110812168746, 0.5000000000000001], [25.194281459376562, 0.37013992574928345, 7.789654130666274], [41.532753187919006, 0.1438679403743599, 0.5000000000000001], [57.73645028752892, 0.14350692719427016, 0.5000000000000001], [63.0037169033288, 0.1413227217943973, 0.5000000000000001], [70.84345741514647, 0.19700146468102808, 0.8348528695004289], [77.1440395698772, 0.2344416088982193, 0.8165696401642674]], "r_squared_": 0.984218596351317, "error_": 0.0421177885275751}
{"freq_range": [2.0, 80.0], "freq_res": 0.5, "aperiodic_params_": [-7.6421717402436, 0.6047536782862973], "gaussian_params_": [[7.997737167884517, 0.12017811751742954, 0.5208514335918476], [18.96767116659881, 0.4468394525612502, 3.4873289426932113], [25.41000302442029, 0.5109047910573848, 2.1788512667382514], [31.289593764616008, 0.27177186905989814, 2.8095089298401548], [36.743874871621905, 0.26005859356857636, 0.2796194539815032], [40.89298550882393, 0.15186737369964784, 0.9548337469075492], [43.711736512772205, 0.2186090821922891, 0.9394704108779588], [46.431930668200216, 0.19227901264663522, 0.36003245330924644], [49.07139370108678, 0.2292360499752511, 0.8437259102609912], [51.69574249040663, 0.19530157994678765, 1.0111745183819831]], "peak_params_": [[7.997737167884517, 0.12335630339567594, 1.0417028671836952], [18.96767116659881, 0.4535838636962639, 6.9746578853864225], [25.41000302442029, 0.6202946163790575, 4.357702533476503], [31.289593764616008, 0.28199021674421587, 5.6190178596803095], [36.743874871621905, 0.2264703120574456, 0.5592389079630063], [40.89298550882393, 0.15500093192872733, 1.9096674938150984], [43.711736512772205, 0.21680168407689315, 1.8789408217559176], [46.431930668200216, 0.19375082055086423, 0.7200649066184929], [49.07139370108678, 0.23400640584884513, 1.6874518205219824], [51.69574249040663, 0.19531670339288532, 2.0223490367639663]], "r_squared_": 0.9605289389534007, "error_": 0.04817250738854889}
{"freq_range": [2.0, 80.0], "freq_res": 0.5, "aperiodic_params_": [-8.394459453905839, 0.6066161078485885], "gaussian_params_": [[7.605812920097879, 0.26193066079150135, 0.41080712674629566], [8.507245911242068, 0.17633397849399435, 0.2715713696879271], [10.420976759648367, 0.22536736734586665, 0.658345398755855], [18.349519680164665, 0.41175160770426406, 3.4385541981965284], [25.934478024523024, 0.46284989086837425, 3.2313621033461084], [31.759858713189786, 0.2357294333219095, 0.33568084935649295], [33.073905628107596, 0.16974604083993167, 0.26253825631522254], [36.49230146862661, 0.18702563994519666, 0.5030186185283294], [41.51571815785204, 0.090541472554178, 0.25000000000000006], [44.339538224551056, 0.09981777517672986, 2.7642243209135264], [49.47692518311202, 0.1570728387425917, 1.16431173251699], [51.77201473666749, 0.18891544956774137, 0.27344861277879384]], "peak_params_": [[7.605812920097879, 0.2564146538422811, 0.8216142534925913], [8.507245911242068, 0.21078228910267605, 0.5431427393758542], [10.420976759648367, 0.25416689477585663, 1.31669079751171], [18.349519680164665, 0.4441675069277782, 6.877108396393057], [25.934478024523024, 0.4974049562782259, 6.462724206692217], [31.759858713189786, 0.2622030541907332, 0.6713616987129859], [33.073905628107596, 0.2058671890791679, 0.5250765126304451], [36.49230146862661, 0.19100097404748517, 1.0060372370566588], [41.51571815785204, 0.14926033804088057, 0.5000000000000001], [44.339538224551056, 0.09966668847939353, 5.528448641827053], [49.47692518311202, 0.17451635755786832, 2.32862346503398], [51.77201473666749, 0.15060726070785435, 0.5468972255575877]], "r_squared_": 0.9698663465305885, "error_": 0.043967644462371884}
{"freq_range": [2.0, 80.0], "freq_res": 0.5, "aperiodic_params_": [-7.648427092243673, 0.6625849105989601], "gaussian_params_": [[7.717186101094178, 0.8152470438568895, 0.6179012016820462], [9.575024594466194, 0.2569186022130713, 1.2187289986417396], [15.511308526891979, 0.2840644999154779, 1.4496102130289201], [19.953959884277626, 0.24724794271366793, 1.3550131761736892], [23.12908628914431, 0.2583418638283035, 0.7325365116116983], [25.421876023957438, 0.378859510653203, 0.4206720436022654], [26.99681479757501, 0.31833402518518933, 0.7555320538634483], [28.440981300996263, 0.19601010093105437, 0.26294361557006035], [30.226493071580066, 0.22213386787825273, 0.7554478611011048], [57.29442250760693, 0.12221252344020321, 4.432269412868264], [62.96598433842782, 0.17511250343647522, 0.25000000000000006], [67.08363655445272, 0.1882048908635259, 0.25000000000000006], [71.13495983187218, 0.19398142989710035, 0.25000000000000006], [75.78826020191308, 0.147325391637358, 0.45988358524954387]], "peak_params_": [[7.717186101094178, 0.8267098945879665, 1.2358024033640924], [9.575024594466194, 0.26917814645034, 2.437457997283479], [15.511308526891979, 0.2851719440580922, 2.8992204260578402], [19.953959884277626, 0.24948506351812938, 2.7100263523473784], [23.12908628914431, 0.27412303222241974, 1.4650730232233966], [25.421876023957438, 0.4185415441017426, 0.8413440872045308], [26.99681479757501, 0.3186891584184188, 1.5110641077268967], [28.440981300996263, 0.25143169502037743, 0.5258872311401207], [30.226493071580066, 0.21248935246552136, 1.5108957222022097], [57.29442250760693, 0.1220811368655621, 8.864538825736528], [62.96598433842782, 0.2268672444123201, 0.5000000000000001], [67.08363655445272, 0.1890766122976011, 0.5000000000000001], [71.13495983187218, 0.16870376434654588, 0.5000000000000001], [75.78826020191308, 0.13252552811453988, 0.9197671704990877]], "r_squared_": 0.9656868685286234, "error_": 0.045718088425562804}
{"freq_range": [2.0, 80.0], "freq_res": 0.5, "aperiodic_params_": [-7.94895160005561, 0.5297658379079562], "gaussian_params_": [[7.896889795778107, 0.6063773113640416, 0.531744785511881], [12.052522313430032, 0.2578471772216655, 2.2907864199722043], [15.39078412037836, 0.23926159169469507, 0.6999706267608253], [16.342288387929266, 0.27926046432361507, 0.25000000000000017], [19.39584156341295, 0.3448511450242849, 2.0854526605517316], [22.97111060440861, 0.26363360455002915, 0.5769819832701262], [26.89281195070691, 0.3430767557919907, 2.348738029968304], [30.15319465894738, 0.22796946583977765, 0.25000000000000006], [31.078443148026526, 0.2052247852341989, 0.25000000000737477], [56.06506066265307, 0.08776889238521966, 5.468666631200327], [63.01014764675829, 0.13022785135515152, 0.25000000000000006]], "peak_params_": [[7.896889795778107, 0.6490087277625287, 1.063489571023762], [12.052522313430032, 0.2584219343161731, 4.581572839944409], [15.39078412037836, 0.3806518936098442, 1.3999412535216507], [16.342288387929266, 0.46772388280296795, 0.5000000000000003], [19.39584156341295, 0.3481496754919302, 4.170905321103463], [22.97111060440861, 0.4276360192474318, 1.1539639665402524], [26.89281195070691, 0.34316701693364493, 4.697476059936608], [30.15319465894738, 0.3319744874579005, 0.5000000000000001], [31.078443148026526, 0.2704719539489737, 0.5000000000147495], [56.06506066265307, 0.08776268127379794, 10.937333262400655], [63.01014764675829, 0.16939764009960712, 0.5000000000000001]], "r_squared_": 0.9517393678050198, "error_": 0.04846348648651118}
{"freq_range": [2.0, 80.0], "freq_res": 0.5, "aperiodic_params_": [-7.900034045798001, 0.6689969677596632], "gaussian_params_": [[7.809780204195694, 0.3946774355658977, 0.5516512610868629], [12.674219467519409, 0.3292133698453527, 2.313733991100763], [15.958984466814275, 0.349172496234917, 0.7365126678245643], [19.139711723515983, 0.43331036304985676, 1.4485231175934503], [21.036892539680874, 0.17716452805501265, 0.25000000000000006], [23.303055143785357, 0.4677658771832774, 1.2668236323345599], [25.628714177233093, 0.25777541356819567, 0.40446532888084036], [27.001705340730837, 0.3827860081630654, 0.36209645323948025], [28.394300059098693, 0.3591465706579522, 0.6195819901710398], [29.82733805512393, 0.3894101017922641, 0.25000000000000006], [30.827480843031594, 0.3162665807214093, 0.25000000000000006], [34.872060946957596, 0.11488431953576993, 0.8398699334691743], [46.79412012471818, 0.21459151799012657, 0.25000000000000006], [52.42707296995523, 0.10031176062880692, 1.7206216269792938], [65.97962563801313, 0.15700073222255329, 0.25000000000000006]], "peak_params_": [[7.809780204195694, 0.41467849770967646, 1.1033025221737258], [12.674219467519409, 0.3282989425775309, 4.627467982201526], [15.958984466814275, 0.5071648297058378, 1.4730253356491285], [19.139711723515983, 0.44067025059361065, 2.8970462351869006], [21.036892539680874, 0.45531683338564655, 0.5000000000000001], [23.303055143785357, 0.46682212933048106, 2.5336472646691197], [25.628714177233093, 0.34913482631024273, 0.8089306577616807], [27.001705340730837, 0.41877116480593557, 0.7241929064789605], [28.394300059098693, 0.3541353646652663, 1.2391639803420795], [29.82733805512393, 0.3206015017567516, 0.5000000000000001], [30.827480843031594, 0.24931764623626762, 0.5000000000000001], [34.872060946957596, 0.1135590752585891, 1.6797398669383485], [46.79412012471818, 0.15357209873735655, 0.5000000000000001], [52.42707296995523, 0.10022170038286049, 3.4412432539585875], [65.97962563801313, 0.1564802106031138, 0.5000000000000001]], "r_squared_": 0.970055273968915, "error_": 0.04467699251184175}
{"freq_range": [2.0, 80.0], "freq_res": 0.5, "aperiodic_params_": [-7.738251992426809, 0.9548572826249256], "gaussian_params_": [[7.654663225597672, 0.3993492340526481, 0.8446552372097849], [10.595354744556746, 0.2539228920649555, 0.32849186626010635], [13.270851255946802, 0.37106966668293323, 1.847538819662878], [15.795872803437394, 0.3427129380489768, 0.6885254786555739], [18.573371126777385, 0.4657537185703883, 1.3014963514380486], [21.081964287807573, 0.23685504929073217, 0.2518144843474088], [23.687707118404784, 0.5344751148638737, 2.063020711317206], [27.16896208700977, 0.2742290329228602, 0.25000000000000006], [28.257948114329952, 0.23527517588119445, 0.25000000000000006], [29.67915495527418, 0.3261240610052626, 1.7205550491005581], [34.807733249604574, 0.274869760452371, 0.25000000000000006]], "peak_params_": [[7.654663225597672, 0.39553423663871357, 1.6893104744195697], [10.595354744556746, 0.3653319961413608, 0.6569837325202127], [13.270851255946802, 0.3697826947093219, 3.695077639325756], [15.795872803437394, 0.5190761594233173, 1.3770509573111478], [18.573371126777385, 0.4945654688457335, 2.6029927028760973], [21.081964287807573, 0.5353458843941183, 0.5036289686948175], [23.687707118404784, 0.5331437053484205, 4.126041422634412], [27.16896208700977, 0.4625447350696259, 0.5000000000000001], [28.257948114329952, 0.44028897464681904, 0.5000000000000001], [29.67915495527418, 0.3344615303037006, 3.4411100982011162], [34.807733249604574, 0.2072327559328997, 0.5000000000000001]], "r_squared_": 0.9840790376605189, "error_": 0.04649844954278644}
{"freq_range": [2.0, 80.0], "freq_res": 0.5, "aperiodic_params_": [-7.616119995303188, 1.1363689721334547], "gaussian_params_": [[7.431816297733478, 0.27173580934567904, 0.9452498077818118], [10.744527769712896, 0.35175970493948067, 0.6903831314793996], [12.160969235356763, 0.23378168985452663, 0.36905492926668804], [13.315707412779734, 0.41377906187598046, 0.4119537289971105], [14.901126448895214, 0.20209489586721435, 0.3390862605781472], [18.08118158397494, 0.5562705323123541, 2.4660129157698814], [23.359572544263077, 0.46359024252562675, 2.001000202230838], [24.94680474973881, 0.3197529396667692, 0.44244352253162095], [27.179704540653173, 0.24903779815922758, 0.25000000000000006], [29.340588599068795, 0.5041804034067027, 2.4220713331249395], [55.82418690259926, 0.23473152703177805, 0.25000000000000006]], "peak_params_": [[7.431816297733478, 0.2710913079831716, 1.8904996155636236], [10.744527769712896, 0.3367147760569349, 1.3807662629587991], [12.160969235356763, 0.3090069598613834, 0.7381098585333761], [13.315707412779734, 0.4739211937104102, 0.823907457994221], [14.901126448895214, 0.44870728401219395, 0.6781725211562944], [18.08118158397494, 0.5688102022613961, 4.932025831539763], [23.359572544263077, 0.5412577535394707, 4.002000404461676], [24.94680474973881, 0.7607953999029675, 0.8848870450632419], [27.179704540653173, 0.5978271544968852, 0.5000000000000001], [29.340588599068795, 0.5072831040247507, 4.844142666249879], [55.82418690259926, 0.18330665506831068, 0.5000000000000001]], "r_squared_": 0.9888210161998449, "error_": 0.04335086191115862}
{"freq_range": [2.0, 80.0], "freq_res": 0.5, "aperiodic_params_": [-7.581585097991079, 0.9032825008841678], "gaussian_params_": [[7.640728695944085, 0.1428299486917249, 0.4631148098362329], [10.70890011260567, 0.19955829961467594, 0.8900886712897745], [13.305800324228926, 0.1938751511263994, 0.4905275845021624], [17.50238659384109, 0.4309572870846254, 2.5222680174526793], [20.052886253647614, 0.2609994229679029, 1.7664122733192176], [25.25114310468921, 0.681986839794887, 2.715833010199776], [29.779736533535914, 0.2666047128491274, 0.6583032435019576], [31.71203438324348, 0.30805116246192293, 0.2894471822624042], [33.38734631802856, 0.15871888572470993, 1.7061012933391255], [36.62585486013491, 0.20625881622251027, 0.3639360230384986], [40.6257886143677, 0.12229570775285267, 1.0155099822274831], [43.53439563706722, 0.25603837379017197, 0.7158168374732954], [46.39716879905435, 0.16729688061776588, 0.3061577472055666], [49.31853669931794, 0.21141035392372315, 0.6623935138483075], [51.92775145415415, 0.17143884957120983, 0.9947895337876997], [58.92792227607161, 0.16220217288183553, 0.3298602193104361]], "peak_params_": [[7.640728695944085, 0.13685167389245123, 0.9262296196724658], [10.70890011260567, 0.20327428658480784, 1.780177342579549], [13.305800324228926, 0.30341518607375484, 0.9810551690043248], [17.50238659384109, 0.534421278473614, 5.0445360349053585], [20.052886253647614, 0.6300134841815925, 3.532824546638435], [25.25114310468921, 0.6842073908000987, 5.431666020399552], [29.779736533535914, 0.42206255945620974, 1.3166064870039151], [31.71203438324348, 0.3787305529204179, 0.5788943645248084], [33.38734631802856, 0.16514227457458297, 3.412202586678251], [36.62585486013491, 0.22449767880005211, 0.7278720460769972], [40.6257886143677, 0.12141997853454178, 2.0310199644549662], [43.53439563706722, 0.25797096842178746, 1.4316336749465908], [46.39716879905435, 0.15819425819624477, 0.6123154944111332], [49.31853669931794, 0.2123500902219586, 1.324787027696615], [51.92775145415415, 0.1710457329586479, 1.9895790675753995], [58.92792227607161, 0.15837573023945417, 0.6597204386208722]], "r_squared_": 0.9805005918402885, "error_": 0.047715614004754055}
{"freq_range": [2.0, 80.0], "freq_res": 0.5, "aperiodic_params_": [-7.64152899628321, 0.5842593398604933], "gaussian_params_": [[19.20061656716152, 0.5121257507808166, 3.7834469511076927], [25.792484404225032, 0.5531429238735919, 2.148018819630881], [29.91095082968236, 0.2884378464125872, 0.8054300474043093], [31.692620068242114, 0.2757098431221003, 0.25000000000000006], [33.2204092450093, 0.2559936806796783, 0.9963574528720586], [35.365652734239596, 0.2160771722656987, 0.36994846426862926], [36.80124575641933, 0.33367784881271967, 0.34700575625633995], [40.042570324144556, 0.15022258973600874, 0.8565257960181459], [41.40175719617756, 0.2173501803001522, 0.25000000000000006], [43.50173438643572, 0.2663769946742515, 0.9588666057140515], [49.226533019773335, 0.19161244294339358, 2.4689216821888866], [51.97920318477705, 0.12375452240153562, 0.37889266402525623]], "peak_params_": [[19.20061656716152, 0.515134159564135, 7.566893902215385], [25.792484404225032, 0.6524415737923759, 4.296037639261762], [29.91095082968236, 0.37799516333527805, 1.6108600948086187], [31.692620068242114, 0.32255131059101494, 0.5000000000000001], [33.2204092450093, 0.2526387004421462, 1.9927149057441171], [35.365652734239596, 0.22133947419419187, 0.7398969285372585], [36.80124575641933, 0.28368476280677335, 0.6940115125126799], [40.042570324144556, 0.15055350953779723, 1.7130515920362919], [41.40175719617756, 0.2680916348290143, 0.5000000000000001], [43.50173438643572, 0.27942797527356866, 1.917733211428103], [49.226533019773335, 0.19080758735793424, 4.937843364377773], [51.97920318477705, 0.22552160359730244, 0.7577853280505125]], "r_squared_": 0.9588202442600015, "error_": 0.04888253113345938}
{"freq_range": [2.0, 80.0], "freq_res": 0.5, "aperiodic_params_": [-7.916375276411272, 0.4944813401681942], "gaussian_params_": [[16.493717790909326, 0.33305246119660187, 2.0810988790253573], [20.58207023698106, 0.4087459779088588, 2.094820773752678], [22.180479819001548, 0.2378207579478265, 0.25000000000000006], [23.484926692906733, 0.4406614347316966, 0.4389685993901724], [25.535773634580885, 0.5543861852628844, 1.0800294586287742], [29.009205937576397, 0.3638367571910878, 2.4594874158153526], [33.383198806823266, 0.18757439270974188, 0.9502971900613788], [35.34681082610205, 0.25089312460661456, 0.32220391903436124], [36.83247741207073, 0.3265953974214731, 0.39715775662228453], [39.16292195108073, 0.16797220896269477, 0.2913622820144869], [40.3286019720137, 0.2400921978122506, 0.25000000000000006], [41.311456229656194, 0.27194956414939725, 0.25000000000000006], [43.614156095184214, 0.2568541336702443, 1.1779321098703004], [46.3249167689256, 0.20492881404964078, 0.25000000000000006], [49.0715873045019, 0.23909674203653877, 1.2301513712866596], [52.02765301308385, 0.1810362746019352, 0.8614033944279291], [61.47608014497223, 0.11881922337967435, 0.7500980979845188]], "peak_params_": [[16.493717790909326, 0.3942720450692967, 4.162197758050715], [20.58207023698106, 0.4615715965998799, 4.189641547505356], [22.180479819001548, 0.5287039171275172, 0.5000000000000001], [23.484926692906733, 0.7199099319950548, 0.8779371987803448], [25.535773634580885, 0.7115782029316069, 2.1600589172575484], [29.009205937576397, 0.3672001198986621, 4.918974831630705], [33.383198806823266, 0.2548621482569473, 1.9005943801227576], [35.34681082610205, 0.25213052580870965, 0.6444078380687225], [36.83247741207073, 0.3007879821483126, 0.7943155132445691], [39.16292195108073, 0.14387660645362388, 0.5827245640289738], [40.3286019720137, 0.19901709471047724, 0.5000000000000001], [41.311456229656194, 0.25594788862227524, 0.5000000000000001], [43.614156095184214, 0.2556591827873902, 2.355864219740601], [46.3249167689256, 0.20002827064523387, 0.5000000000000001], [49.0715873045019, 0.23907563882738003, 2.4603027425733193], [52.02765301308385, 0.19500402620963442, 1.7228067888558583], [61.47608014497223, 0.11875882472473087, 1.5001961959690375]], "r_squared_": 0.9618353345587441, "error_": 0.04272395286205217}
{"freq_range": [2.0, 80.0], "freq_res": 0.5, "aperiodic_params_": [-8.456200768691476, 0.5460596161989564], "gaussian_params_": [[13.26522301773118, 0.20165516494940802, 0.25010311471409225], [14.679446147757288, 0.1945804903494258, 0.3247651104661776], [16.78309883271541, 0.13719257140904925, 0.5875464742053599], [18.752610917159707, 0.3564690114098647, 2.650793144533927], [25.379415544492733, 0.6036616708101218, 2.302278819223694], [29.64206736875074, 0.2288327006719856, 0.6972801345322206], [32.6489030851763, 0.24718205051728112, 1.6210657176796899], [35.30611676676856, 0.23873525635100437, 0.2500000000000851], [36.83032661570447, 0.27129958308042923, 0.3744182468444241], [42.61250570936257, 0.07259358963972073, 0.25000000000000006], [43.61602723996095, 0.16387705911213363, 2.18172680350634], [48.929389976146474, 0.19418022626001483, 1.021778808974445], [49.868624498948876, 0.13094861120203005, 0.250000108858083], [51.949650319415454, 0.16508827011418406, 0.9364643476012918]], "peak_params_": [[13.26522301773118, 0.1801130290344659, 0.5002062294281845], [14.679446147757288, 0.2655499515384765, 0.6495302209323552], [16.78309883271541, 0.4154403427163622, 1.1750929484107198], [18.752610917159707, 0.368019230195312, 5.301586289067854], [25.379415544492733, 0.6168154936942614, 4.604557638447388], [29.64206736875074, 0.383370623293386, 1.3945602690644412], [32.6489030851763, 0.2512478269997178, 3.2421314353593798], [35.30611676676856, 0.23006359227666806, 0.5000000000001702], [36.83032661570447, 0.25321674680079553, 0.7488364936888482], [42.61250570936257, 0.2093824801422297, 0.5000000000000001], [43.61602723996095, 0.16377877133705887, 4.36345360701268], [48.929389976146474, 0.2029879670208512, 2.04355761794889], [49.868624498948876, 0.24738055054418417, 0.500000217716166], [51.949650319415454, 0.16707562906684892, 1.8729286952025836]], "r_squared_": 0.9556057747437597, "error_": 0.044804090133039154}
{"freq_range": [2.0, 80.0], "freq_res": 0.5, "aperiodic_params_": [-7.402160908413944, 0.9300575890643271], "gaussian_params_": [[7.664618179424798, 0.9574703529201771, 0.7169167757462288], [10.292197968762489, 0.44936875342105037, 1.3786053008222874], [13.73379152834484, 0.33213715872559824, 0.6282761356948117], [15.274346792590428, 0.35433029730404736, 0.6097875057362538], [19.657963306821873, 0.1862382115124711, 0.25000000000000006], [23.376322960067995, 0.2169883967248586, 4.000435826747947], [27.566356777654537, 0.1561020179977963, 0.493362003761083], [60.4312873299415, 0.19057016829143927, 0.3301890626566623], [67.28170256602469, 0.20888914574490858, 0.4737934451209434], [71.1158917876848, 0.22502139545899466, 0.2624630803681683]], "peak_params_": [[7.664618179424798, 0.990428257670918, 1.4338335514924576], [10.292197968762489, 0.4458985436815581, 2.7572106016445748], [13.73379152834484, 0.35534653415059836, 1.2565522713896233], [15.274346792590428, 0.368863344977699, 1.2195750114725077], [19.657963306821873, 0.2882289962771303, 0.5000000000000001], [23.376322960067995, 0.21688472357488564, 8.000871653495894], [27.566356777654537, 0.28225332179583695, 0.986724007522166], [60.4312873299415, 0.18648810440515717, 0.6603781253133246], [67.28170256602469, 0.187853281950348, 0.9475868902418868], [71.1158917876848, 0.20412044659112816, 0.5249261607363366]], "r_squared_": 0.9800325020045846, "error_": 0.05026062568830635}
{"freq_range": [2.0, 80.0], "freq_res": 0.5, "aperiodic_params_": [-7.852773056711899, 0.8136095824855938], "gaussian_params_": [[7.710604568138447, 0.9190977255099558, 0.6366467136951031], [9.81259057458025, 0.33117631412630655, 1.326441117316436], [15.261382449697129, 0.3200595312774955, 1.5112672743354627], [19.759966453251117, 0.21822788599081708, 0.7884836244629915], [22.99491502701068, 0.20291510284594408, 1.0636369343925858], [25.49455939910943, 0.2412917271153828, 0.4280318450320718], [27.373771325281957, 0.22852552543386104, 0.9950478507041026], [30.160275557375147, 0.19763930770977242, 0.5538594875073161], [50.13808778072524, 0.11142460621503292, 0.5383134347204027], [57.47994899546823, 0.11204786415577586, 3.273418443682228], [60.67717105634519, 0.11276591756811714, 0.25000000000146516], [63.096294556604185, 0.18624932335142622, 0.2500000000151641], [67.13548459919866, 0.23154275429525836, 0.2749845977557848], [71.09125361885201, 0.18032058778434581, 0.25000000000000006], [72.5953869698324, 0.17504164503930447, 0.25000000000000006], [76.56947297985432, 0.07635707946846941, 3.2688661677019337]], "peak_params_": [[7.710604568138447, 0.942606056343763, 1.2732934273902061], [9.81259057458025, 0.3300643038690598, 2.652882234632872], [15.261382449697129, 0.3161285731176182, 3.0225345486709254], [19.759966453251117, 0.21454472994397378, 1.576967248925983], [22.99491502701068, 0.20297503180207954, 2.1272738687851716], [25.49455939910943, 0.2927506856296276, 0.8560636900641436], [27.373771325281957, 0.2267259780132065, 1.9900957014082052], [30.160275557375147, 0.19655449974784212, 1.1077189750146321], [50.13808778072524, 0.11605153235280241, 1.0766268694408054], [57.47994899546823, 0.1120457652381237, 6.546836887364456], [60.67717105634519, 0.1609346108470664, 0.5000000000029303], [63.096294556604185, 0.1999805219559061, 0.5000000000303282], [67.13548459919866, 0.2077613772877065, 0.5499691955115696], [71.09125361885201, 0.18660659092792642, 0.5000000000000001], [72.5953869698324, 0.1979372691520691, 0.5000000000000001], [76.56947297985432, 0.07633984189275189, 6.5377323354038674]], "r_squared_": 0.9781192433718952, "error_": 0.041227909008697106}
{"freq_range": [2.0, 80.0], "freq_res": 0.5, "aperiodic_params_": [-8.153439214174167, 0.7828738001305129], "gaussian_params_": [[7.955121598308105, 0.44883843099001636, 0.5176990883132645], [12.959926563686837, 0.33441784573169736, 2.734807159143738], [16.023302423984862, 0.1938424876462472, 0.3807440848520081], [23.156313051573086, 0.5331031697461488, 5.3096852187308], [53.05193609159752, 0.17526610063766127, 0.3257572460857418]], "peak_params_": [[7.955121598308105, 0.5207939166819973, 1.035398176626529], [12.959926563686837, 0.4199517170389502, 5.469614318287476], [16.023302423984862, 0.5887250010437821, 0.7614881697040162], [23.156313051573086, 0.5332681332482867, 10.6193704374616], [53.05193609159752, 0.17305276646974121, 0.6515144921714836]], "r_squared_": 0.9740928713480671, "error_": 0.05246790739598905}
{"freq_range": [2.0, 80.0], "freq_res": 0.5, "aperiodic_params_": [-7.867337819845028, 0.9839166977856482], "gaussian_params_": [[7.856467873503154, 0.453128776224534, 0.8150616636244653], [10.431010704222905, 0.3113211963088509, 0.4911108961680779], [12.313916846222714, 0.29964267932222083, 1.1322598896024803], [14.804603982604139, 0.32501105790991924, 0.25000000000000006], [15.82170441050129, 0.34444760638188004, 0.40917831792832676], [23.120210469809045, 0.6503592163118151, 5.180657351784798], [36.09992386818668, 0.2195550601306029, 0.3013476073149158], [73.00516419920358, 0.15553118641986138, 0.2500000000001121]], "peak_params_": [[7.856467873503154, 0.4555625396320835, 1.6301233272489306], [10.431010704222905, 0.4271229008101738, 0.9822217923361558], [12.313916846222714, 0.37521233856234915, 2.2645197792049605], [14.804603982604139, 0.4936974876639013, 0.5000000000000001], [15.82170441050129, 0.5676687574426875, 0.8183566358566535], [23.120210469809045, 0.6501841592244872, 10.361314703569596], [36.09992386818668, 0.2373907224337657, 0.6026952146298316], [73.00516419920358, 0.15549800712769368, 0.5000000000002242]], "r_squared_": 0.984010413555571, "error_": 0.04809173012677166}
{"freq_range": [2.0, 80.0], "freq_res": 0.5, "aperiodic_params_": [-7.71411035052809, 1.0028252966249804], "gaussian_params_": [[7.718729877362903, 0.24502745196953754, 0.746798992445057], [10.650689890498413, 0.4178210603207784, 0.8241518205150536], [12.283185145053615, 0.31916784941534304, 0.25000101667081875], [13.321269140070314, 0.2685148152422114, 0.35909281924247755], [15.05853319603525, 0.2508223162226753, 0.3566635359412763], [15.964514289673204, 0.11612166744018738, 0.25340588398835656], [17.852549281354577, 0.3523764127668584, 2.4552742472169222], [25.258143554648527, 0.6435545022412208, 3.7168992407292567], [50.78304304493905, 0.09932588974843021, 0.831683520505346], [66.95878535782958, 0.13869175536057682, 0.25000000000000006]], "peak_params_": [[7.718729877362903, 0.23507572603752003, 1.493597984890114], [10.650689890498413, 0.4153546485543913, 1.6483036410301073], [12.283185145053615, 0.3069820131022727, 0.5000020333416375], [13.321269140070314, 0.31584871131161485, 0.7181856384849551], [15.05853319603525, 0.4412649186384865, 0.7133270718825526], [15.964514289673204, 0.4167018093236443, 0.5068117679767131], [17.852549281354577, 0.44736393706627986, 4.9105484944338444], [25.258143554648527, 0.6449501671389957, 7.433798481458513], [50.78304304493905, 0.09600315331745968, 1.663367041010692], [66.95878535782958, 0.13681979697869728, 0.5000000000000001]], "r_squared_": 0.9851815439600365, "error_": 0.04535465462284313}
{"freq_range": [2.0, 80.0], "freq_res": 0.5, "aperiodic_params_": [-7.7918311567051015, 0.9784847044496652], "gaussian_params_": [[7.548785338740911, 0.1587816522322188, 0.25000000000000006], [10.996880610197158, 0.29340566250333894, 1.712064196054444], [16.37074909965078, 0.22866656897819876, 0.8840854319677413], [21.339000205162034, 0.6664614820276549, 3.9688565455699507], [25.21825334167063, 0.3225969988466129, 1.0019227140177462], [29.035359594682024, 0.30830559022029086, 2.227602973199602], [33.12350530648787, 0.1816296496763523, 0.27986873082689945], [35.682938699621694, 0.1411643363614535, 0.4704143831693842]], "peak_params_": [[7.548785338740911, 0.19375313773462643, 0.5000000000000001], [10.996880610197158, 0.315801241920747, 3.424128392108888], [16.37074909965078, 0.5448484568780465, 1.7681708639354825], [21.339000205162034, 0.6672527261450956, 7.937713091139901], [25.21825334167063, 0.8103103221564947, 2.0038454280354925], [29.035359594682024, 0.4119670259035466, 4.455205946399204], [33.12350530648787, 0.23693666321303475, 0.5597374616537989], [35.682938699621694, 0.13660256299306717, 0.9408287663387684]], "r_squared_": 0.9868585765723803, "error_": 0.04412050728221809}
{"freq_range": [2.0, 80.0], "freq_res": 0.5, "aperiodic_params_": [-8.054144759761344, 0.8408545406364863], "gaussian_params_": [[15.899297591222872, 0.4077212695981329, 3.636722816260957], [20.535106579193734, 0.2033436874978663, 1.4487761192474236], [22.31219917032824, 0.1416915332506641, 0.25000000000000006], [25.077813481709818, 0.7638590323620716, 1.8909527259065781], [29.14985014893785, 0.42437769830999295, 0.8231848906894965], [30.75195325032049, 0.22405980925293106, 0.25000000000000006], [32.928756730741306, 0.1822940247517495, 1.3263377289898126], [41.767822008297756, 0.11822837926370629, 0.7973571372332742]], "peak_params_": [[15.899297591222872, 0.4090876805661967, 7.273445632521914], [20.535106579193734, 0.42722062213079326, 2.897552238494847], [22.31219917032824, 0.5680689176839842, 0.5000000000000001], [25.077813481709818, 0.7827798812261797, 3.7819054518131563], [29.14985014893785, 0.5091692800839347, 1.646369781378993], [30.75195325032049, 0.23997291761632056, 0.5000000000000001], [32.928756730741306, 0.1821631500053691, 2.6526754579796252], [41.767822008297756, 0.11332094140892934, 1.5947142744665483]], "r_squared_": 0.9841610581152331, "error_": 0.04081869355490819}
{"freq_range": [2.0, 80.0], "freq_res": 0.5, "aperiodic_params_": [-8.451823441906786, 0.6277858883103553], "gaussian_params_": [[7.907682912317222, 0.34687744727293707, 0.7198662509840031], [10.221082724731296, 0.45929517273616877, 0.6837363374518822], [11.387474046990164, 0.1616360058064416, 0.25000000000000006], [12.286982808943412, 0.29388567430705903, 0.5757382422266587], [14.502476733842785, 0.4161070903569052, 0.8741487867386739], [15.951307712391435, 0.16161400363902745, 0.25000000000000006], [17.830703631532977, 0.4081416997175903, 1.1684152880830803], [21.02489840526517, 0.3551216797931382, 0.7389292629714174], [22.264352605120564, 0.36240608644315075, 0.25000000000000006], [23.616160049897598, 0.2828712813660606, 0.41295822450766645], [25.056384917974203, 0.4003429998305061, 1.0706791311888086], [26.499039143121106, 0.1472394143111312, 0.3962542777250748], [28.766309310987527, 0.2705609742613609, 0.9050577552959648], [30.65326236220338, 0.15431047069731949, 0.3357501360037938], [34.051702497582546, 0.10062108640130935, 1.0516221973923552], [42.46245359978132, 0.1367696979286022, 0.284647535602549], [45.58141691142886, 0.11863539006056649, 0.6241141800633159], [49.84709148829109, 0.15020875719550694, 0.25000000000000006], [63.98769802773159, 0.1844079838128258, 0.25000000000000006], [65.93520095104499, 0.2106496313592631, 0.36387215700314973], [67.41819734545456, 0.13701950172559585, 0.6207313287071051], [73.33797059485411, 0.10303361870183741, 0.9437892670766224], [78.85205042075391, 0.12379005312184037, 0.8574302022822187]], "peak_params_": [[7.907682912317222, 0.34638457569332815, 1.4397325019680063], [10.221082724731296, 0.44109111123536593, 1.3674726749037645], [11.387474046990164, 0.3425378999442259, 0.5000000000000001], [12.286982808943412, 0.3064193307784606, 1.1514764844533174], [14.502476733842785, 0.4233062617982508, 1.7482975734773478], [15.951307712391435, 0.3740995900247839, 0.5000000000000001], [17.830703631532977, 0.4041003456157988, 2.3368305761661605], [21.02489840526517, 0.3655344030509422, 1.4778585259428347], [22.264352605120564, 0.3114559863029047, 0.5000000000000001], [23.616160049897598, 0.4123863663086347, 0.8259164490153329], [25.056384917974203, 0.40098102831190197, 2.1413582623776173], [26.499039143121106, 0.32031903782692694, 0.7925085554501496], [28.766309310987527, 0.26214572437710437, 1.8101155105919295], [30.65326236220338, 0.18257815896653007, 0.6715002720075876], [34.051702497582546, 0.10049956656313341, 2.1032443947847104], [42.46245359978132, 0.13558564112186922, 0.569295071205098], [45.58141691142886, 0.11763022114661226, 1.2482283601266317], [49.84709148829109, 0.12458371973501237, 0.5000000000000001], [63.98769802773159, 0.18418504221030751, 0.5000000000000001], [65.93520095104499, 0.21741172927350405, 0.7277443140062995], [67.41819734545456, 0.13585514872136528, 1.2414626574142102], [73.33797059485411, 0.1015263513828053, 1.8875785341532447], [78.85205042075391, 0.12196087209770745, 1.7148604045644373]], "r_squared_": 0.9837763707856947, "error_": 0.028739556968170352}
{"freq_range": [2.0, 80.0], "freq_res": 0.5, "aperiodic_params_": [-8.039384548009611, 0.6358431058478513], "gaussian_params_": [[8.910440957194854, 0.46296433819910293, 1.553912516470583], [13.730928592863254, 0.40054857263896565, 3.159903434306841], [14.678963825860981, 0.15264976435428032, 0.25000000000000006], [20.737318279020776, 0.07232677391303953, 0.25000000000000056], [23.5899271120834, 0.2874702734015378, 3.552643352888478], [23.620361837670405, 0.08246644218096788, 0.25000000000000006], [64.15932056365551, 0.27251197943939576, 0.25000000000000006], [79.05966254433075, 0.11244043522001816, 5.999029687986968]], "peak_params_": [[8.910440957194854, 0.5928493685436305, 3.107825032941166], [13.730928592863254, 0.4104819381332341, 6.319806868613682], [14.678963825860981, 0.5186123213362777, 0.5000000000000001], [20.737318279020776, 0.2834102459541121, 0.5000000000000011], [23.5899271120834, 0.364186839058835, 7.105286705776956], [23.620361837670405, 0.364186839058835, 0.5000000000000001], [64.15932056365551, 0.22724513160155801, 0.5000000000000001], [79.05966254433075, 0.11243487459894652, 11.998059375973936]], "r_squared_": 0.9656491719537771, "error_": 0.04784157712852172}
{"freq_range": [2.0, 80.0], "freq_res": 0.5, "aperiodic_params_": [-7.6300241674323, 0.7078972942234251], "gaussian_params_": [[7.956384705171141, 0.8048685692874732, 0.815277209443798], [12.529093720548504, 0.806484340248679, 2.7455007065200596], [21.039708404719814, 0.2427455785343895, 3.8323137988834817], [27.861750562026053, 0.21864107154760912, 0.2865118075279097]], "peak_params_": [[7.956384705171141, 1.0113172880265626, 1.630554418887596], [12.529093720548504, 0.8267115641040697, 5.491001413040119], [21.039708404719814, 0.24964211635741052, 7.664627597766963], [27.861750562026053, 0.24126499812074265, 0.5730236150558194]], "r_squared_": 0.9720656211016152, "error_": 0.05973652048734386}
{"freq_range": [2.0, 80.0], "freq_res": 0.5, "aperiodic_params_": [-8.007353119530325, 0.6529997633105638], "gaussian_params_": [[7.9801878641150745, 0.6691648242114846, 0.7527103969395242], [13.101013472914802, 0.6511481285521709, 3.381927052572462], [20.267135006434906, 0.36643187967729407, 1.3168010938196388], [22.76348931241817, 0.256872564519559, 0.42341053856560357], [23.854831351940465, 0.30366783515178597, 0.45312339540934754], [25.320291348837433, 0.22808643024576114, 0.3126896528926083], [28.2460157922097, 0.20781175654829692, 1.598520575170693]], "peak_params_": [[7.9801878641150745, 0.8777022209717078, 1.5054207938790485], [13.101013472914802, 0.6508578269481315, 6.763854105144924], [20.267135006434906, 0.4202201436272226, 2.6336021876392777], [22.76348931241817, 0.3234660346753788, 0.8468210771312071], [23.854831351940465, 0.3084324535101448, 0.9062467908186951], [25.320291348837433, 0.24222122627431197, 0.6253793057852166], [28.2460157922097, 0.20540492394463428, 3.197041150341386]], "r_squared_": 0.9714137027682456, "error_": 0.05170871281042459}
{"freq_range": [2.0, 80.0], "freq_res": 0.5, "aperiodic_params_": [-7.9591748946762, 0.8896715906364436], "gaussian_params_": [[15.091271219473846, 0.6544143990413652, 4.566895461728095], [20.85154251387114, 0.21075855255832965, 0.25000000000000006], [23.599901917792145, 0.13916357130785062, 0.33600886326375506], [26.367665484188713, 0.5809425441255174, 4.660939253168961]], "peak_params_": [[15.091271219473846, 0.6839639910599313, 9.13379092345619], [20.85154251387114, 0.7593861966436641, 0.5000000000000001], [23.599901917792145, 0.7340546482864951, 0.6720177265275101], [26.367665484188713, 0.6095956055378586, 9.321878506337923]], "r_squared_": 0.9747750998245067, "error_": 0.06162958203436002}
{"freq_range": [2.0, 80.0], "freq_res": 0.5, "aperiodic_params_": [-7.846084467065437, 0.9903190162199413], "gaussian_params_": [[7.722999025249705, 0.3262215657197759, 0.7171624771075406], [11.253153571950914, 0.4736407173881511, 1.5743572265400534], [15.045576940996389, 0.5560227218137421, 1.11673911765261], [18.076149530585667, 0.4184235629311832, 1.5823803921666453], [21.34633041584248, 0.19963728342182627, 0.5266291026077086], [26.558208429835297, 0.7809255891810531, 4.488934565027697], [29.85236573864861, 0.18351852760413642, 0.25000000000000006], [68.54543550405883, 0.1599562747314755, 0.25000000000000006]], "peak_params_": [[7.722999025249705, 0.3385508557739776, 1.434324954215081], [11.253153571950914, 0.47434076110908485, 3.148714453080107], [15.045576940996389, 0.6750719961922815, 2.23347823530522], [18.076149530585667, 0.5616462408229967, 3.1647607843332906], [21.34633041584248, 0.6454858637904692, 1.0532582052154171], [26.558208429835297, 0.7808602309240271, 8.977869130055394], [29.85236573864861, 0.736196272873336, 0.5000000000000001], [68.54543550405883, 0.15733627829584407, 0.5000000000000001]], "r_squared_": 0.9849106548142009, "error_": 0.049717257371427744}
{"freq_range": [2.0, 80.0], "freq_res": 0.5, "aperiodic_params_": [-7.61995446999773, 1.0914032282197135], "gaussian_params_": [[16.01548087555005, 0.6162449325062584, 4.3549654950554935], [27.1195486507276, 0.9248107849504034, 4.10026792379929]], "peak_params_": [[16.01548087555005, 0.6396324088369081, 8.709930990110987], [27.1195486507276, 0.9500193054550756, 8.20053584759858]], "r_squared_": 0.9794889914555427, "error_": 0.06779762899746876}
{"freq_range": [2.0, 80.0], "freq_res": 0.5, "aperiodic_params_": [-7.672162130830851, 1.0545892260257665], "gaussian_params_": [[9.942100092443399, 0.20068407702515537, 1.7707314274841073], [15.396966490817867, 0.4623762041731653, 3.32636993515596], [18.400552523617645, 0.18292607084979443, 0.3534054643777393], [25.875302800981885, 0.7830534753234787, 5.321505817604818]], "peak_params_": [[9.942100092443399, 0.3337080094335949, 3.5414628549682146], [15.396966490817867, 0.5806545952359325, 6.65273987031192], [18.400552523617645, 0.7747729076675576, 0.7068109287554786], [25.875302800981885, 0.7857136023547824, 10.643011635209636]], "r_squared_": 0.9855772679337844, "error_": 0.05388503077385112}
{"freq_range": [2.0, 80.0], "freq_res": 0.5, "aperiodic_params_": [-7.820127914983662, 0.9445268214459706], "gaussian_params_": [[15.104066487244499, 0.5419510594674023, 4.541319054913957], [24.939256879840116, 0.6663575541762226, 5.999999999945838], [25.088606779256835, 0.24976325388067577, 0.3942586150113079]], "peak_params_": [[15.104066487244499, 0.7107852324408945, 9.082638109827913], [24.939256879840116, 0.9603069921530576, 11.999999999891676], [25.088606779256835, 0.9603069921530576, 0.7885172300226158]], "r_squared_": 0.9759836697193326, "error_": 0.06599648805332832}
{"freq_range": [2.0, 80.0], "freq_res": 0.5, "aperiodic_params_": [-8.041562571438083, 0.6816109581200844], "gaussian_params_": [[7.825146527697687, 0.28884207252562033, 0.5001006639539297], [10.482773928096064, 0.41441791644471676, 1.9225660248988654], [19.896235620452895, 0.6443214924260539, 5.999999986618598], [32.85427770819238, 0.16113853052404456, 0.44475603472142616], [40.252551523961735, 0.14758489575997638, 3.693980728401645]], "peak_params_": [[7.825146527697687, 0.5419850771240942, 1.0002013279078594], [10.482773928096064, 0.6034413981778997, 3.845132049797731], [19.896235620452895, 0.6442271680343215, 11.999999973237196], [32.85427770819238, 0.23353994647814602, 0.8895120694428523], [40.252551523961735, 0.1490262228803676, 7.38796145680329]], "r_squared_": 0.9730118388466317, "error_": 0.054411974675328593}
{"freq_range": [2.0, 80.0], "freq_res": 0.5, "aperiodic_params_": [-7.669467233079616, 0.6301155186016127], "gaussian_params_": [[8.480233436665877, 0.4643319394126948, 1.2101879903684298], [11.600526053683941, 0.44061148430878444, 2.186151545098821], [16.45208824140864, 0.3697981335816779, 2.9638253861064623], [22.249930925394345, 0.13031735618737847, 0.2500003613482236], [24.31408755243932, 0.3093245577814361, 3.650303464089139], [32.518787147086144, 0.12791342461702204, 0.25000000000000006], [35.92766816430797, 0.21805401199597368, 0.40194520002817097], [42.4301227744254, 0.24162112035843986, 0.45762574180461224], [64.20446932192097, 0.30200750500145357, 0.25000000000000006], [77.55181183899442, 0.23942319025726802, 0.35282156381039315]], "peak_params_": [[8.480233436665877, 0.6355727820241324, 2.4203759807368597], [11.600526053683941, 0.5530106825060788, 4.372303090197642], [16.45208824140864, 0.43679470609400184, 5.927650772212925], [22.249930925394345, 0.39621930123142945, 0.5000007226964472], [24.31408755243932, 0.31818929030020193, 7.300606928178278], [32.518787147086144, 0.15257908430994505, 0.5000000000000001], [35.92766816430797, 0.21639229319713138, 0.8038904000563419], [42.4301227744254, 0.23882194116521305, 0.9152514836092245], [64.20446932192097, 0.216153810346551, 0.5000000000000001], [77.55181183899442, 0.236855487698012, 0.7056431276207863]], "r_squared_": 0.9731208269603956, "error_": 0.046311930883859424}
{"freq_range": [2.0, 80.0], "freq_res": 0.5, "aperiodic_params_": [-7.747359836788766, 0.652967054146431], "gaussian_params_": [[8.120141681541465, 0.9192892216501226, 0.6332020504664236], [12.624470730708337, 0.8357961627363758, 3.0034837464023036], [20.45203459941493, 0.20921157883835553, 4.945917883044485]], "peak_params_": [[8.120141681541465, 1.1671384730180172, 1.2664041009328473], [12.624470730708337, 0.8925244212153451, 6.006967492804607], [20.45203459941493, 0.23606066184059848, 9.89183576608897]], "r_squared_": 0.9792401862430276, "error_": 0.052478521145167864}
{"freq_range": [2.0, 80.0], "freq_res": 0.5, "aperiodic_params_": [-8.07984634379664, 0.6217892464205634], "gaussian_params_": [[8.130202775772247, 0.76465962317728, 0.64538685046533], [16.064389373370407, 0.731376041143913, 5.988905293513513]], "peak_params_": [[8.130202775772247, 1.0446536172171736, 1.29077370093066], [16.064389373370407, 0.7313337711982211, 11.977810587027026]], "r_squared_": 0.9632677230876963, "error_": 0.06726330131589932}
{"freq_range": [2.0, 80.0], "freq_res": 0.5, "aperiodic_params_": [-7.730354840250911, 1.0106137945808356], "gaussian_params_": [[9.340052119050016, 0.33937402572967645, 1.7730122643752553], [17.859190013013496, 0.9252381290765889, 4.84063989632447], [27.452037517517365, 0.31531561232439453, 5.134484859013348], [28.389984493417195, 0.13623401304947436, 0.25000000837299463]], "peak_params_": [[9.340052119050016, 0.5469985249950078, 3.5460245287505106], [17.859190013013496, 0.9827729164863772, 9.68127979264894], [27.452037517517365, 0.44286729493707, 10.268969718026696], [28.389984493417195, 0.5150728531873714, 0.5000000167459893]], "r_squared_": 0.9837157690209377, "error_": 0.06144045571164867}
{"freq_range": [2.0, 80.0], "freq_res": 0.5, "aperiodic_params_": [-7.723134325758826, 1.1039254507653384], "gaussian_params_": [[7.36085981835124, 0.2742273911405541, 0.7093013673846623], [10.371008010729236, 0.38814481951852764, 1.6064446523548601], [16.642032894228358, 0.7398156856360902, 3.9666303133133765], [25.452034599135946, 0.6115030262316165, 5.4585965990594], [30.05003012843316, 0.2000627257659321, 0.31182975750612635], [35.04504410597772, 0.06586239928967144, 5.9998044299055655]], "peak_params_": [[7.36085981835124, 0.4023043993848088, 1.4186027347693246], [10.371008010729236, 0.6243785464324052, 3.2128893047097202], [16.642032894228358, 0.8995199914876952, 7.933260626626753], [25.452034599135946, 0.6911885924152159, 10.9171931981188], [30.05003012843316, 0.6784778291511824, 0.6236595150122527], [35.04504410597772, 0.19831808595302647, 11.999608859811131]], "r_squared_": 0.9870610117578386, "error_": 0.05735266139155269}
{"freq_range": [2.0, 80.0], "freq_res": 0.5, "aperiodic_params_": [-7.483569994250383, 1.190636409276483], "gaussian_params_": [[17.04652994218122, 0.7259220396450023, 5.182452047927329], [25.162782181699342, 0.09980730922080759, 0.4564309955495691], [27.94659960423939, 0.6094679117108116, 4.294600872334102]], "peak_params_": [[17.04652994218122, 0.7495598940261434, 10.364904095854659], [25.162782181699342, 0.7988901500796217, 0.9128619910991382], [27.94659960423939, 0.6871985670291814, 8.589201744668204]], "r_squared_": 0.9852031707199974, "error_": 0.06025477536415437}
{"freq_range": [2.0, 80.0], "freq_res": 0.5, "aperiodic_params_": [-7.446028510555637, 1.221642427358649], "gaussian_params_": [[9.383160823586305, 0.30434359114643483, 1.757186478232604], [17.958839130708487, 0.9035451261560747, 4.578857974252806], [27.726234087189855, 0.556436586713556, 3.583085470422103], [33.628022199554344, 0.14880571842343698, 0.2500000000014001], [36.65512908049366, 0.17182578856420064, 1.5506850527131784]], "peak_params_": [[9.383160823586305, 0.4676850223412856, 3.514372956465208], [17.958839130708487, 0.9174863833071925, 9.157715948505611], [27.726234087189855, 0.6583909599156854, 7.166170940844206], [33.628022199554344, 0.3069553537505314, 0.5000000000028002], [36.65512908049366, 0.19897624410768522, 3.1013701054263567]], "r_squared_": 0.9861075424146823, "error_": 0.059679390324758774}
{"freq_range": [2.0, 80.0], "freq_res": 0.5, "aperiodic_params_": [-7.7424896017673435, 0.9605847794603759], "gaussian_params_": [[6.8465283209938566, 0.23932489337372104, 0.25000000000000006], [8.264368891027688, 0.25604494283445034, 0.5704026064677695], [10.360777473425948, 0.3495076314556044, 0.5767594166817549], [18.632500440469514, 0.8713411391486116, 5.1320275768333765], [24.934872041750317, 0.3296237568793273, 0.6393172883216325], [27.319131168388783, 0.2451048511237577, 0.8742880184109042], [29.79893304403507, 0.27963584369235767, 1.1825665285519733], [33.44234607230005, 0.18356318705245697, 1.2092227233967985], [38.06805516450065, 0.1043897155929597, 1.2609708979684082]], "peak_params_": [[6.8465283209938566, 0.28693590307893047, 0.5000000000000001], [8.264368891027688, 0.3611096185808673, 1.140805212935539], [10.360777473425948, 0.5878474447042734, 1.1535188333635098], [18.632500440469514, 0.8710507753074488, 10.264055153666753], [24.934872041750317, 0.7388179924794009, 1.278634576643265], [27.319131168388783, 0.47811589230840923, 1.7485760368218084], [29.79893304403507, 0.3559968847191364, 2.3651330571039466], [33.44234607230005, 0.1987043101985826, 2.418445446793597], [38.06805516450065, 0.10509283059605323, 2.5219417959368164]], "r_squared_": 0.9837629014614516, "error_": 0.05324775633216536}
{"freq_range": [2.0, 80.0], "freq_res": 0.5, "aperiodic_params_": [-8.228590920450202, 0.3562530871742381], "gaussian_params_": [[8.057252207679156, 0.37712405271164023, 0.3822307006580473], [9.615388392063066, 0.25802774408993345, 0.45441391437313167], [12.236473144679676, 0.34707034276439364, 2.6453761227840706], [21.67738121288471, 0.5123429536728622, 5.999999999999999], [33.56627407857768, 0.2684765244965076, 0.9994836980048327], [35.92303801028955, 0.20684329279538577, 0.4048948214165154], [38.206310635596644, 0.2443026312917489, 0.40256329565649146], [40.25118597276176, 0.1985209263901, 0.41073772770651046], [44.5504362530639, 0.17800357613386358, 5.999999999999999]], "peak_params_": [[8.057252207679156, 0.5077769456013179, 0.7644614013160946], [9.615388392063066, 0.5187367006338235, 0.9088278287462633], [12.236473144679676, 0.48521627579741455, 5.290752245568141], [21.67738121288471, 0.5129846641345761, 11.999999999999998], [33.56627407857768, 0.3740648733916121, 1.9989673960096654], [35.92303801028955, 0.31113299548977835, 0.8097896428330308], [38.206310635596644, 0.3250010652401958, 0.8051265913129829], [40.25118597276176, 0.31071206010927455, 0.8214754554130209], [44.5504362530639, 0.17836688570130477, 11.999999999999998]], "r_squared_": 0.9336362411466342, "error_": 0.05664297160474238}
{"freq_range": [2.0, 80.0], "freq_res": 0.5, "aperiodic_params_": [-7.916553253552834, 0.5388477141999168], "gaussian_params_": [[9.126310539724338, 0.4555746170847483, 1.4668448918633021], [14.525522600767717, 0.5213139937257198, 3.0210152365872753], [18.925774183740696, 0.1409583482586468, 0.38261205778933], [21.704490111389383, 0.3203127778842626, 2.0880711822202223], [25.589991652706757, 0.30112881239088607, 0.25706255986432464], [27.627190290952132, 0.27180584087959, 2.1564122050953243], [32.519717916440534, 0.1874255302650877, 0.25000000000000006], [34.11163970443923, 0.1799237456461898, 1.0370222673141698], [35.81199030486238, 0.27193885402917506, 0.34319623437412], [38.050873133926785, 0.19113517635980073, 0.29760026315161325], [39.615537464476986, 0.10409318364635413, 0.6423192773848413], [43.01981701136798, 0.13759242115651904, 3.9571270649739567], [65.94940247862972, 0.19267714932819546, 0.3007583542663409]], "peak_params_": [[9.126310539724338, 0.5517626267066023, 2.9336897837266043], [14.525522600767717, 0.5226831308116253, 6.042030473174551], [18.925774183740696, 0.45094936222838555, 0.76522411557866], [21.704490111389383, 0.35986454363229115, 4.1761423644404445], [25.589991652706757, 0.5124319072643697, 0.5141251197286493], [27.627190290952132, 0.27825180683079687, 4.3128244101906485], [32.519717916440534, 0.2657997068734588, 0.5000000000000001], [34.11163970443923, 0.1925759427980296, 2.0740445346283396], [35.81199030486238, 0.29699994012693054, 0.68639246874824], [38.050873133926785, 0.2544674359000876, 0.5952005263032265], [39.615537464476986, 0.19506261328131913, 1.2846385547696826], [43.01981701136798, 0.13759079321665446, 7.914254129947913], [65.94940247862972, 0.18996974583747495, 0.6015167085326818]], "r_squared_": 0.9652054784019956, "error_": 0.04662656093197724}
{"freq_range": [2.0, 80.0], "freq_res": 0.5, "aperiodic_params_": [-7.454692334576066, 0.7576615546183917], "gaussian_params_": [[7.784602445544172, 0.6406872752089062, 0.48608077020598334], [8.959368214087604, 0.4510335117565284, 1.1245997627998485], [13.448072313755553, 0.6157253125778955, 2.6093337475986504], [18.388905102539873, 0.16025061971912347, 1.5400218530608445], [21.301580536497244, 0.24822147190315574, 0.2657243107630426], [23.976093095191455, 0.11250570060692454, 0.8646274978720472], [32.372326069149054, 0.1600480199509889, 0.25000000000000006], [36.07486397755616, 0.1887995967767794, 0.31649127657554393], [64.0442960772694, 0.1327509590850198, 0.7745227025055148], [69.30224897452611, 0.27339407742196326, 0.25000000000000006], [72.02574503604677, 0.14190487127397977, 1.5199222531380272]], "peak_params_": [[7.784602445544172, 0.9638562202919845, 0.9721615404119667], [8.959368214087604, 0.6228643617222556, 2.249199525599697], [13.448072313755553, 0.6167720277103337, 5.218667495197301], [18.388905102539873, 0.25433060286287024, 3.080043706121689], [21.301580536497244, 0.2157867095674515, 0.5314486215260852], [23.976093095191455, 0.11284576618768938, 1.7292549957440944], [32.372326069149054, 0.14048052034906355, 0.5000000000000001], [36.07486397755616, 0.18359085854755186, 0.6329825531510879], [64.0442960772694, 0.13253415663247026, 1.5490454050110296], [69.30224897452611, 0.2356250888140874, 0.5000000000000001], [72.02574503604677, 0.1418845158374964, 3.0398445062760544]], "r_squared_": 0.9851199877254803, "error_": 0.03851621139012725}
{"freq_range": [2.0, 80.0], "freq_res": 0.5, "aperiodic_params_": [-7.478331851478174, 0.9327849425353582], "gaussian_params_": [[7.888486867832726, 0.6780797115482369, 0.6534525140599844], [9.403103042054711, 0.34265192884375933, 0.3912782216337451], [11.038760017269139, 0.22755964580922633, 0.7298784276418144], [14.844949200062283, 0.5512529406629694, 3.1884874914174923], [21.19169721048377, 0.19665166111279248, 0.25000000000000006], [21.567894833418677, 0.14429674724155037, 1.5760491122818037], [24.237002681006146, 0.13552921702098109, 0.44904991754664864], [25.310694398328103, 0.2393126096339964, 0.25000000000000006], [36.224638725676556, 0.22308783787530548, 0.25000000000000006], [55.92535474832116, 0.12652474953148352, 0.25000000000000006], [69.25333179237006, 0.20162244005747526, 0.6085584676391699], [71.37052882811312, 0.24289792179490452, 0.3049321356415655], [73.54625307713665, 0.13144052161475722, 0.5517780165554159]], "peak_params_": [[7.888486867832726, 0.7238998879198544, 1.3069050281199688], [9.403103042054711, 0.5246211045201363, 0.7825564432674902], [11.038760017269139, 0.49376064889185667, 1.4597568552836289], [14.844949200062283, 0.5506260830453726, 6.376974982834985], [21.19169721048377, 0.3673284858671195, 0.5000000000000001], [21.567894833418677, 0.29851806893135446, 3.1520982245636073], [24.237002681006146, 0.1707126461188082, 0.8980998350932973], [25.310694398328103, 0.19075097807160368, 0.5000000000000001], [36.224638725676556, 0.14898790529817063, 0.5000000000000001], [55.92535474832116, 0.12100872237174087, 0.5000000000000001], [69.25333179237006, 0.18572179761970808, 1.2171169352783398], [71.37052882811312, 0.2223181944028081, 0.609864271283131], [73.54625307713665, 0.13097953422139597, 1.1035560331108318]], "r_squared_": 0.9875605890873115, "error_": 0.0384755495618395}
{"freq_range": [2.0, 80.0], "freq_res": 0.5, "aperiodic_params_": [-7.322218543425945, 1.0841209687689957], "gaussian_params_": [[8.139065918825958, 0.2476555439876665, 0.6097874708451068], [15.422811000184785, 0.5836664807315368, 4.296499548323573], [20.94379639885937, 0.254042495669189, 1.014305619327292], [24.773034171197942, 0.2841109069409353, 1.6703792149359298], [30.0130787325401, 0.1631826208784295, 0.37617774531423115], [36.82485248559081, 0.2157757711822409, 0.25000000000000006], [67.7035224631987, 0.08604564844957968, 1.3841680283248814], [76.49964463910965, 0.14539204317441126, 0.31358130322667727]], "peak_params_": [[8.139065918825958, 0.3725290513584465, 1.2195749416902135], [15.422811000184785, 0.5835724948650345, 8.592999096647146], [20.94379639885937, 0.5271582462597504, 2.028611238654584], [24.773034171197942, 0.33025073750224365, 3.3407584298718596], [30.0130787325401, 0.16705558530972198, 0.7523554906284623], [36.82485248559081, 0.16882085022094095, 0.5000000000000001], [67.7035224631987, 0.08512052265831294, 2.768336056649763], [76.49964463910965, 0.14539194996302385, 0.6271626064533545]], "r_squared_": 0.9852317496679686, "error_": 0.04797825614250289}
{"freq_range": [2.0, 80.0], "freq_res": 0.5, "aperiodic_params_": [-7.420404145180862, 1.1981169166861942], "gaussian_params_": [[7.303602630930982, 0.2834946397188492, 0.6562276969352442], [10.933798808461972, 0.46133205105720376, 2.047796327839151], [17.53695049138161, 0.6411486915977501, 3.4961067397601697], [24.79424347730791, 0.49056821726020533, 2.192960792262383], [29.805343922474567, 0.2650447184986068, 1.790923163461052], [35.89994479824711, 0.18657342737051605, 3.5368565913868695], [65.68096241794483, 0.25211704725291795, 0.2500045305572884]], "peak_params_": [[7.303602630930982, 0.39457990925223285, 1.3124553938704884], [10.933798808461972, 0.5727247582368413, 4.095592655678302], [17.53695049138161, 0.6457555288341936, 6.9922134795203394], [24.79424347730791, 0.5629572832276519, 4.385921584524766], [29.805343922474567, 0.34031981282599943, 3.581846326922104], [35.89994479824711, 0.18716927416118878, 7.073713182773739], [65.68096241794483, 0.19401272976784156, 0.5000090611145768]], "r_squared_": 0.9904726351139012, "error_": 0.04471739660500439}
{"freq_range": [2.0, 80.0], "freq_res": 0.5, "aperiodic_params_": [-7.467632478613077, 1.1800641139133325], "gaussian_params_": [[9.699293283379806, 0.33175861907464765, 1.857024280776964], [15.82062335280081, 0.6153875840657974, 3.374228274654579], [23.57470008816965, 0.4846410431185179, 3.6786537392066854], [27.166247675040335, 0.255422720691762, 0.2539683020914697], [30.231478411204897, 0.23772400060769794, 1.5270534881128799], [34.02167348349052, 0.22699057745642323, 0.2946822991600305], [35.33529017011653, 0.1946670444055351, 0.25000000000000006], [36.91128614218317, 0.22600031911388546, 0.9431746382446276], [39.58551942924565, 0.1726563445310838, 0.48523833502748726], [53.10950557128446, 0.19221861732210213, 0.2657475574848685]], "peak_params_": [[9.699293283379806, 0.4366383079028946, 3.714048561553928], [15.82062335280081, 0.6737442224451531, 6.748456549309158], [23.57470008816965, 0.5307292363476162, 7.357307478413371], [27.166247675040335, 0.5482009830487566, 0.5079366041829394], [30.231478411204897, 0.340526158401536, 3.0541069762257598], [34.02167348349052, 0.24835742746834377, 0.589364598320061], [35.33529017011653, 0.23361668407590308, 0.5000000000000001], [36.91128614218317, 0.22563702966682797, 1.886349276489255], [39.58551942924565, 0.1752642047559103, 0.9704766700549745], [53.10950557128446, 0.17657294951044733, 0.531495114969737]], "r_squared_": 0.9857414839796037, "error_": 0.05383595541390526}
{"freq_range": [2.0, 80.0], "freq_res": 0.5, "aperiodic_params_": [-7.529237271266783, 1.0555645152175597], "gaussian_params_": [[6.622149956155541, 0.17922720794925764, 0.25000000000000017], [7.978797635332257, 0.3390373713856682, 1.0804534126230603], [11.145056521756073, 0.46857826293193566, 1.3409687792790077], [14.839806681897452, 0.3940895421357961, 1.409795000631479], [19.603626369599993, 0.5749337333062009, 3.1412800786303126], [26.795300979704106, 0.17498337508442488, 0.25000000000000017], [27.067504210487822, 0.234484671125452, 2.7140919527966747], [32.57045596110692, 0.16325859994392877, 0.25000000000000006], [34.009558332304664, 0.21041447696574345, 0.29506219695239183], [36.523385710827974, 0.1369825488751163, 1.0041660764843598], [38.76745359834012, 0.12510566764164385, 0.5861357874713099], [46.89961593161268, 0.14055185309418158, 0.25000000000000006], [69.89629784455344, 0.17766887817232474, 0.28427634704485494], [77.34005643218123, 0.1901646665516306, 0.3293251840996562]], "peak_params_": [[6.622149956155541, 0.29320148189856887, 0.5000000000000003], [7.978797635332257, 0.369545705164402, 2.1609068252461205], [11.145056521756073, 0.495808024861379, 2.6819375585580154], [14.839806681897452, 0.5955289385518245, 2.819590001262958], [19.603626369599993, 0.5810995367882565, 6.282560157260625], [26.795300979704106, 0.39551196302332237, 0.5000000000000003], [27.067504210487822, 0.39551196302332237, 5.428183905593349], [32.57045596110692, 0.18870657147424375, 0.5000000000000001], [34.009558332304664, 0.22512919481089533, 0.5901243939047837], [36.523385710827974, 0.13757504501884021, 2.0083321529687197], [38.76745359834012, 0.12219511139142902, 1.1722715749426198], [46.89961593161268, 0.1296658546215017, 0.5000000000000001], [69.89629784455344, 0.16623200691037887, 0.5685526940897099], [77.34005643218123, 0.16900907051040015, 0.6586503681993124]], "r_squared_": 0.9899346871039438, "error_": 0.038823734132659736}
{"freq_range": [2.0, 80.0], "freq_res": 0.5, "aperiodic_params_": [-7.517533704217744, 0.8116194444239072], "gaussian_params_": [[9.876141375550581, 0.44599195793810353, 2.596379069301199], [14.468177218792595, 0.1631017460085166, 0.33708412061256215], [15.537134486580763, 0.16386894018002374, 0.25000000000000006], [17.749026302600516, 0.34394842528874303, 3.2097855121851033], [21.9049237052081, 0.19487178745423156, 0.25000000000000006], [25.979927886090447, 0.15964149407558206, 0.6565059332469732], [38.71379045964513, 0.16392114627292995, 0.5329966671555392], [55.60496868924926, 0.18275374092290458, 0.25000000000000006], [65.86854933040247, 0.1814399742212662, 0.3377203399357054], [69.82791373168803, 0.1561037058188531, 0.4044117510454656], [74.70263275602906, 0.09302328225162297, 1.4200979948362566]], "peak_params_": [[9.876141375550581, 0.46414397437033283, 5.192758138602398], [14.468177218792595, 0.4598053603395922, 0.6741682412251243], [15.537134486580763, 0.4753694846543297, 0.5000000000000001], [17.749026302600516, 0.3488997780549745, 6.419571024370207], [21.9049237052081, 0.32437908371153057, 0.5000000000000001], [25.979927886090447, 0.17220328398819262, 1.3130118664939463], [38.71379045964513, 0.15125100739617992, 1.0659933343110783], [55.60496868924926, 0.16733405818633607, 0.5000000000000001], [65.86854933040247, 0.16820359782916228, 0.6754406798714108], [69.82791373168803, 0.1429784817912978, 0.8088235020909312], [74.70263275602906, 0.09208109845895862, 2.8401959896725133]], "r_squared_": 0.9808194538688413, "error_": 0.041625024746238824}
{"freq_range": [2.0, 80.0], "freq_res": 0.5, "aperiodic_params_": [-7.658756719045645, 0.6377164417308243], "gaussian_params_": [[9.010779807151389, 0.35058031535131895, 1.5292244487584465], [10.591035769371327, 0.20373551917066585, 0.34886038235173655], [12.198384922543996, 0.19298703421710894, 0.2500000000502904], [14.744628401061519, 0.35985958375854876, 2.581945510266358], [18.876041213243717, 0.22404034040433016, 0.28504403193260947], [20.57664582728687, 0.13783408843816594, 0.3846548175532967], [21.85786756420389, 0.19132348491756224, 0.25000000000000006], [34.35264042013141, 0.1509968234191277, 0.25000000000000006], [38.935193983507254, 0.1702481977558634, 0.5377963985995667], [55.596531928063335, 0.2151604734438102, 0.2838196022679231], [63.05046751723377, 0.1345350565722043, 0.5314342985921598], [65.87996064093838, 0.14087148087499593, 0.31673537905441346], [70.94240151906048, 0.16236518206496026, 0.25000000000000006], [73.81569402678329, 0.2466472477325476, 0.25000000000000006], [75.70988100950896, 0.14665757421095418, 0.8335785120973542]], "peak_params_": [[9.010779807151389, 0.3808604298015954, 3.058448897516893], [10.591035769371327, 0.508282405519326, 0.6977207647034731], [12.198384922543996, 0.39733929905280974, 0.5000000001005808], [14.744628401061519, 0.358806334168861, 5.163891020532716], [18.876041213243717, 0.2963891388513247, 0.5700880638652189], [20.57664582728687, 0.16512819136612045, 0.7693096351065934], [21.85786756420389, 0.16986064836514814, 0.5000000000000001], [34.35264042013141, 0.12691785084216, 0.5000000000000001], [38.935193983507254, 0.16901659184480167, 1.0755927971991335], [55.596531928063335, 0.20306868740247985, 0.5676392045358462], [63.05046751723377, 0.1339297834235964, 1.0628685971843197], [65.87996064093838, 0.13110935022874592, 0.6334707581088269], [70.94240151906048, 0.15811259991934, 0.5000000000000001], [73.81569402678329, 0.20584700132179634, 0.5000000000000001], [75.70988100950896, 0.1420818172478775, 1.6671570241947085]], "r_squared_": 0.9795395575533824, "error_": 0.03241604934032649}
{"freq_range": [2.0, 80.0], "freq_res": 0.5, "aperiodic_params_": [-7.955927518042252, 0.743948471501587], "gaussian_params_": [[7.800316724303069, 0.6356676658673357, 0.646465948660434], [9.60874157859694, 0.4853324908224557, 1.0824810010474544], [12.07048793603528, 0.22398578666297397, 0.7773405532015686], [14.602486699248745, 0.46512038581761245, 1.572016946710567], [17.130510849965752, 0.147059769237618, 0.2500000000413904], [18.30272730671004, 0.14141201578119256, 0.2500000000013055], [20.121653716059367, 0.19184482882916848, 1.0495777917327855], [26.41408161198409, 0.15805137874810238, 0.5084868144435195], [32.209720957659115, 0.18701161871545896, 0.25000000000000006], [48.46136961879446, 0.11032963092941275, 0.4628907092535538], [55.816820346550834, 0.13929952191969652, 0.25000000000938943], [63.93211629758063, 0.1454275488381427, 0.42871525742519984], [65.20920064831358, 0.1659066265615812, 0.2500000005053169], [69.26736205929356, 0.10510501175403122, 1.37314468991205], [70.69134795347124, 0.06647868096876955, 0.25000143998517677], [71.79257682994022, 0.15577089180548973, 0.250001066535658], [74.19525538301106, 0.13344379493812628, 1.3255761913650583], [77.80835021824848, 0.2651245305664191, 0.301980656899365], [79.09895956178987, 0.1694899671633727, 0.5069104554546519]], "peak_params_": [[7.800316724303069, 0.7669780317849186, 1.292931897320868], [9.60874157859694, 0.5062859379584985, 2.1649620020949087], [12.07048793603528, 0.38351911356499, 1.5546811064031372], [14.602486699248745, 0.4658456223952463, 3.144033893421134], [17.130510849965752, 0.27600105983547785, 0.5000000000827808], [18.30272730671004, 0.18325038263252758, 0.500000000002611], [20.121653716059367, 0.19184174565104506, 2.099155583465571], [26.41408161198409, 0.15581118980651354, 1.016973628887039], [32.209720957659115, 0.1315395683611218, 0.5000000000000001], [48.46136961879446, 0.10994609392821708, 0.9257814185071076], [55.816820346550834, 0.10650459878303664, 0.5000000000187789], [63.93211629758063, 0.1436842533244196, 0.8574305148503997], [65.20920064831358, 0.12427526851237936, 0.5000000010106338], [69.26736205929356, 0.10385988061086238, 2.7462893798241], [70.69134795347124, 0.12258911983274068, 0.5000028799703535], [71.79257682994022, 0.1587838543980986, 0.500002133071316], [74.19525538301106, 0.1322807644413384, 2.6511523827301167], [77.80835021824848, 0.23509838701132146, 0.60396131379873], [79.09895956178987, 0.1665882245742747, 1.0138209109093037]], "r_squared_": 0.9840478220085125, "error_": 0.03354237348452778}
{"freq_range": [2.0, 80.0], "freq_res": 0.5, "aperiodic_params_": [-7.336697428308564, 0.9372790599616561], "gaussian_params_": [[8.017779993996651, 0.69451343349382, 0.7291959486241879], [9.599757958369905, 0.40096302918264715, 0.4409668568953702], [10.927798087856425, 0.3347696699229666, 0.49764467105336885], [12.330154600490987, 0.19839601972227897, 0.35391787384534396], [14.155308847889254, 0.4650219781855927, 1.6922865285635473], [18.493431017846376, 0.15822335880118998, 2.047124279026337], [31.834186691947217, 0.1043254829916116, 0.5847613110643239], [36.03037203264728, 0.10767039266261583, 0.25000000000000006], [56.085661100439204, 0.11761697254187853, 0.25000000000000006], [64.79710234614656, 0.11827125281540489, 0.5120035098883376], [69.18441334092756, 0.12938826753149466, 1.4155190641780537], [71.66799156440881, 0.17804719103339428, 0.4052010255658782], [74.13654135848424, 0.1877076725311523, 0.9207634241094372], [78.3924095065243, 0.2388284710633027, 0.8684048740919247]], "peak_params_": [[8.017779993996651, 0.6954867218542056, 1.4583918972483758], [9.599757958369905, 0.4948760744636349, 0.8819337137907404], [10.927798087856425, 0.4161490506138774, 0.9952893421067377], [12.330154600490987, 0.46948330917253855, 0.7078357476906879], [14.155308847889254, 0.4772956868106464, 3.3845730571270947], [18.493431017846376, 0.17544893694735286, 4.094248558052674], [31.834186691947217, 0.10021454124060725, 1.1695226221286479], [36.03037203264728, 0.1068787439550345, 0.5000000000000001], [56.085661100439204, 0.11091129707143921, 0.5000000000000001], [64.79710234614656, 0.11097800853845108, 1.0240070197766753], [69.18441334092756, 0.12829490652348952, 2.8310381283561075], [71.66799156440881, 0.2004437305726654, 0.8104020511317565], [74.13654135848424, 0.18605271724721284, 1.8415268482188745], [78.3924095065243, 0.23700499384533558, 1.7368097481838494]], "r_squared_": 0.9889485163481349, "error_": 0.034526453092675005}
{"freq_range": [2.0, 80.0], "freq_res": 0.5, "aperiodic_params_": [-7.177706087760025, 1.1033118644130588], "gaussian_params_": [[8.09586019953804, 0.2748005328545719, 0.4620378653573415], [14.132211889358812, 0.4553887898746184, 4.015929575981429], [21.19526597419864, 0.2157103155513987, 0.2500006514948004], [21.919633082405134, 0.13420753595299265, 0.2508783331796555], [23.93892016797506, 0.18713716055982985, 1.012495401013544], [26.466767112638024, 0.19194863682521682, 0.42107539294532087], [30.001502501584962, 0.1555118639784347, 0.3647908420444228], [36.38402513198286, 0.2520131140630408, 0.4935129779573045], [41.8121077120695, 0.19651202925890224, 0.9972900022975122], [63.504294606283665, 0.14142380907709462, 0.25000000000000006], [74.00931921244245, 0.17731965111717904, 0.3447828685689049]], "peak_params_": [[8.09586019953804, 0.41087875922410166, 0.924075730714683], [14.132211889358812, 0.4551420703530997, 8.031859151962857], [21.19526597419864, 0.26745011223068893, 0.5000013029896008], [21.919633082405134, 0.22544141634381631, 0.501756666359311], [23.93892016797506, 0.20904668925231462, 2.024990802027088], [26.466767112638024, 0.20295725552509225, 0.8421507858906417], [30.001502501584962, 0.15569601363438856, 0.7295816840888456], [36.38402513198286, 0.24514989627541084, 0.987025955914609], [41.8121077120695, 0.19305513630339988, 1.9945800045950244], [63.504294606283665, 0.14140294365435047, 0.5000000000000001], [74.00931921244245, 0.17725488995702854, 0.6895657371378098]], "r_squared_": 0.9843770765676011, "error_": 0.044092466535460846}
{"freq_range": [2.0, 80.0], "freq_res": 0.5, "aperiodic_params_": [-7.3125914727126435, 1.2244628313836792], "gaussian_params_": [[7.266270189517033, 0.19125738794436412, 1.474089047128453], [10.930707252651878, 0.1215546160703661, 0.30254559356232563], [14.116439842390005, 0.47412697193671793, 3.1124062940107002], [18.20395782349102, 0.3156985287583062, 0.7829675765487344], [21.213330531942937, 0.31331314153701983, 1.116580677722227], [24.216722153019116, 0.3513347613480232, 0.8578037129285636], [26.44889584598841, 0.21326599546590713, 0.4288955064402441], [29.52823544115281, 0.25576300960105147, 2.5952446614096303], [34.47777605769208, 0.19893769398744096, 0.3521138302572683], [36.52055529862233, 0.13640637285277543, 0.5817343531891674], [38.54065410777179, 0.06205332571598406, 0.2500000003339233], [40.13476002401716, 0.1456399082651232, 0.2500000071647561], [40.243933777595274, 0.13981641529740527, 2.7159064329385942]], "peak_params_": [[7.266270189517033, 0.2383648073562501, 2.948178094256906], [10.930707252651878, 0.4133432394860517, 0.6050911871246513], [14.116439842390005, 0.47380109498813106, 6.2248125880214005], [18.20395782349102, 0.5278415547208635, 1.5659351530974688], [21.213330531942937, 0.35074069086173054, 2.233161355444454], [24.216722153019116, 0.38373261094758426, 1.7156074258571272], [26.44889584598841, 0.35157869295244737, 0.8577910128804882], [29.52823544115281, 0.25580611544932985, 5.190489322819261], [34.47777605769208, 0.2546303869865092, 0.7042276605145366], [36.52055529862233, 0.19731620963017704, 1.1634687063783349], [38.54065410777179, 0.1760747579988422, 0.5000000006678466], [40.13476002401716, 0.26527438582838414, 0.5000000143295122], [40.243933777595274, 0.26527438582838414, 5.4318128658771885]], "r_squared_": 0.986259297333135, "error_": 0.045080135731852156}
{"freq_range": [2.0, 80.0], "freq_res": 0.5, "aperiodic_params_": [-7.175938286601246, 1.1791067513097124], "gaussian_params_": [[6.664496618143758, 0.4681500105070599, 1.2535634626061039], [9.01987454025423, 0.20671553189445713, 0.7255577544586007], [11.022826007574677, 0.2903122395164733, 1.177243494858757], [14.668410256973804, 0.17945774312931403, 0.5064939456465882], [18.008570854501517, 0.3882765538625497, 4.167847774328137], [27.727884476375518, 0.19053450972654343, 1.7568134885110323], [37.22601729956798, 0.12053012122182113, 3.505495756053746], [46.65988281257658, 0.10766538670081988, 1.955845456145335]], "peak_params_": [[6.664496618143758, 0.47339419019192164, 2.5071269252122077], [9.01987454025423, 0.39306410787818, 1.4511155089172014], [11.022826007574677, 0.3908603738490122, 2.354486989717514], [14.668410256973804, 0.44594080591842733, 1.0129878912931765], [18.008570854501517, 0.38827581710002335, 8.335695548656274], [27.727884476375518, 0.22054589758852217, 3.5136269770220645], [37.22601729956798, 0.12029260709514666, 7.010991512107492], [46.65988281257658, 0.11094783649067708, 3.91169091229067]], "r_squared_": 0.9827932967651134, "error_": 0.050799466929392155}
{"freq_range": [2.0, 80.0], "freq_res": 0.5, "aperiodic_params_": [-7.372331618733576, 0.8928991701503161], "gaussian_params_": [[8.804153571047031, 0.3997146333031527, 2.2355366141637907], [14.332808685371363, 0.05670217509122901, 0.25000000000000006], [16.40044240311518, 0.3434410060339065, 4.083069751077218], [21.862918974931606, 0.13312119998075728, 0.2653553262563615], [25.866620550100233, 0.14590757209615318, 0.6599087932217804], [32.74956532935311, 0.33352338651329516, 0.25000000000000006], [34.174335127152204, 0.23175676857087646, 0.36488281927527993], [36.67587874315791, 0.16528543323321523, 0.5865375685901826], [38.92593939762268, 0.20010009599683756, 0.49261082023356656], [42.303093541642646, 0.1384619384677405, 0.25000000000000006], [44.7460987722977, 0.08043167831843852, 3.149276188529596]], "peak_params_": [[8.804153571047031, 0.464636455450818, 4.471073228327581], [14.332808685371363, 0.36908738959446374, 0.5000000000000001], [16.40044240311518, 0.34440643894641987, 8.166139502154437], [21.862918974931606, 0.25059883357278245, 0.530710652512723], [25.866620550100233, 0.16461313501197594, 1.3198175864435608], [32.74956532935311, 0.20283644388890387, 0.5000000000000001], [34.174335127152204, 0.20703437497324728, 0.7297656385505599], [36.67587874315791, 0.16063214209581922, 1.1730751371803652], [38.92593939762268, 0.21313975685805708, 0.9852216404671331], [42.303093541642646, 0.16390578467564687, 0.5000000000000001], [44.7460987722977, 0.08018647200093199, 6.298552377059192]], "r_squared_": 0.978816796044489, "error_": 0.04596044934036728}
{"freq_range": [2.0, 80.0], "freq_res": 0.5, "aperiodic_params_": [-8.245577277083834, 0.5069339822232433], "gaussian_params_": [[8.382441525585772, 0.3379746749241841, 1.1435373947077665], [11.744875133165536, 0.33790074916256735, 2.1437750273032647], [19.51185941097989, 0.35390234805003673, 4.958128004023959], [25.73191340969655, 0.1709415864507107, 0.5380408197309899], [29.07160559463178, 0.18663534320311378, 0.7777174864729928], [31.233903803836625, 0.2054005131798069, 0.3735910620429273], [32.7087706866701, 0.3474084612371807, 0.25007516278831793], [33.95784045415716, 0.2596200778610888, 0.5899385899597736], [36.19446097977868, 0.2010321445771806, 0.444436035460717], [40.09984298686862, 0.19188067881874443, 2.1801863278542526], [42.31842674148558, 0.20112515793095484, 0.2500000044377095], [44.91993839779964, 0.18214357997678643, 0.6129487692609951]], "peak_params_": [[8.382441525585772, 0.4737083281949719, 2.287074789415533], [11.744875133165536, 0.43983883663434753, 4.2875500546065295], [19.51185941097989, 0.354387877461388, 9.916256008047919], [25.73191340969655, 0.3264467910417128, 1.0760816394619799], [29.07160559463178, 0.24255838969867405, 1.5554349729459855], [31.233903803836625, 0.20166308567611857, 0.7471821240858546], [32.7087706866701, 0.2700036502967649, 0.5001503255766359], [33.95784045415716, 0.26774110703556175, 1.179877179919547], [36.19446097977868, 0.2174788835885586, 0.888872070921434], [40.09984298686862, 0.19174891995876742, 4.360372655708505], [42.31842674148558, 0.25925796335931217, 0.500000008875419], [44.91993839779964, 0.19594609261595153, 1.2258975385219901]], "r_squared_": 0.9618099440439607, "error_": 0.042097210420475546}
{"freq_range": [2.0, 80.0], "freq_res": 0.5, "aperiodic_params_": [-7.618439887723195, 1.0292038277950286], "gaussian_params_": [[8.158260730365917, 0.37934292560931104, 0.6763513771515293], [10.399272172608377, 0.12201047780439331, 0.5107229185320599], [13.513887789828287, 0.16488391382562653, 1.9840518785222683], [14.892761208851624, 0.23405096602264755, 4.5334032655268235], [20.018685174032957, 0.07765554017384167, 0.25000000000000006], [26.696111013852764, 0.18610897809486573, 0.2501593590586421], [29.8756477823999, 0.1821351303994029, 0.25278575130807784], [36.12146058833177, 0.17393917183819463, 0.3912414533558597], [42.05625357431301, 0.11843983438374663, 1.0342389518184432], [73.98732979383745, 0.2381343694725021, 0.4509680220360029], [78.1756355531283, 0.14045537352450954, 1.2650743136890492]], "peak_params_": [[8.158260730365917, 0.44624429592906445, 1.3527027543030585], [10.399272172608377, 0.31898030442225256, 1.0214458370641197], [13.513887789828287, 0.388141931002405, 3.9681037570445366], [14.892761208851624, 0.35853702063543835, 9.066806531053647], [20.018685174032957, 0.20230957849747888, 0.5000000000000001], [26.696111013852764, 0.1456988017026557, 0.5003187181172842], [29.8756477823999, 0.1622860741983967, 0.5055715026161557], [36.12146058833177, 0.1657605100017463, 0.7824829067117194], [42.05625357431301, 0.11826477109096523, 2.0684779036368863], [73.98732979383745, 0.23864545782597268, 0.9019360440720058], [78.1756355531283, 0.13910824173352943, 2.5301486273780984]], "r_squared_": 0.9835583208784504, "error_": 0.042441378360805755}
{"freq_range": [2.0, 80.0], "freq_res": 0.5, "aperiodic_params_": [-7.83926068164681, 0.9560271446551959], "gaussian_params_": [[6.299118198807331, 0.2875272014810845, 1.3896791709680814], [9.086042923871627, 0.1728552293134158, 0.46684737047340424], [10.661770972546297, 0.2249668308235688, 0.25003526836445283], [11.361083597664692, 0.1566370604217621, 0.2505657927031056], [12.602948653968664, 0.08770649729433105, 0.2517144853220235], [16.547963727678397, 0.2829213325570819, 2.6145006679760967], [19.448999050383044, 0.11654015821212912, 0.6762403671207347], [21.92287837824632, 0.18486310039498596, 0.3725524418357786], [23.735458732672093, 0.21537308572901578, 0.2500000000000003], [26.680928382020962, 0.07548036569940979, 1.7992366939176039], [29.917527366446976, 0.22594567584956746, 0.26445861401853865], [31.422666792644495, 0.18559747413905864, 0.38388221848891096], [53.01323982897354, 0.11425012759464762, 0.25000000000000006], [55.21369299398462, 0.16527857959990797, 0.6547227170813743], [63.502700095780874, 0.14339895357735022, 0.3773387103540532], [70.98331192321832, 0.12839394726814762, 0.25000000000000006], [73.78142302865629, 0.1504771551348943, 0.5519627156783612], [76.2232343228513, 0.21442414330162898, 0.2500000012655004], [77.27954465943381, 0.24841527255179752, 0.36384482062931905]], "peak_params_": [[6.299118198807331, 0.28471442511128586, 2.7793583419361627], [9.086042923871627, 0.21782370651362548, 0.9336947409468085], [10.661770972546297, 0.20713611946447053, 0.5000705367289057], [11.361083597664692, 0.17927746810710055, 0.5011315854062112], [12.602948653968664, 0.1660238580080282, 0.503428970644047], [16.547963727678397, 0.2828823849796187, 5.229001335952193], [19.448999050383044, 0.2658008577935469, 1.3524807342414693], [21.92287837824632, 0.21576432611708007, 0.7451048836715572], [23.735458732672093, 0.16230829159694515, 0.5000000000000006], [26.680928382020962, 0.07530170506951883, 3.5984733878352078], [29.917527366446976, 0.22918396720041123, 0.5289172280370773], [31.422666792644495, 0.18395905453439276, 0.7677644369778219], [53.01323982897354, 0.11463427655231762, 0.5000000000000001], [55.21369299398462, 0.15670548772060755, 1.3094454341627486], [63.502700095780874, 0.14339528239424482, 0.7546774207081064], [70.98331192321832, 0.1281086730108676, 0.5000000000000001], [73.78142302865629, 0.13912926555419425, 1.1039254313567224], [76.2232343228513, 0.14448343060403346, 0.5000000025310009], [77.27954465943381, 0.20675690677034275, 0.7276896412586381]], "r_squared_": 0.9824952529307633, "error_": 0.037639378792582855}
{"freq_range": [2.0, 80.0], "freq_res": 0.5, "aperiodic_params_": [-7.618177809406413, 0.9789711721550736], "gaussian_params_": [[6.43613934941165, 0.43875973537848934, 1.2809485406739656], [9.715162037616544, 0.2225967297501204, 1.3324968348845556], [16.854976951888005, 0.30351119202484705, 5.082485458662287]], "peak_params_": [[6.43613934941165, 0.488418684279476, 2.561897081347931], [9.715162037616544, 0.3513483327961975, 2.6649936697691112], [16.854976951888005, 0.3033877324075931, 10.164970917324574]], "r_squared_": 0.9753331675463026, "error_": 0.05281709701406877}
