{"freq_range": [2.0, 80.0], "freq_res": 0.5, "aperiodic_params_": [-7.719021848212217, 0.7430361646449645], "gaussian_params_": [[8.905703116155594, 0.367322666461074, 0.7188089622666965], [11.155389186158171, 0.33871626837543817, 0.5022695145153098], [13.862019929929046, 0.1681958021595017, 0.7804944710324325], [15.42950159234615, 0.21142286071777805, 0.43648978216684], [17.05235836257204, 0.3313485564270488, 0.5299253270502766], [19.01201008610643, 0.2961558128306635, 0.7324765258703204], [23.4875205741284, 0.2935933194250081, 1.8659816786498413], [30.577161208811386, 0.12887325467327804, 0.7710127962455992], [48.04152501702831, 0.15867364669437722, 0.3768709900850404], [51.983562775587515, 0.14196572365715596, 0.677378788955803], [53.75828582873274, 0.2093756368791859, 0.4431318763175408], [56.30858055539315, 0.1260594324679301, 0.507115071710352], [61.945254562020445, 0.1075403158468377, 0.25000000000000006], [69.73546999326553, 0.0941673184606274, 5.309259769566338], [79.64095622117159, 0.19242638749748206, 0.25000000000000006]], "peak_params_": [[8.905703116155594, 0.36420947455624564, 1.437617924533393], [11.155389186158171, 0.32835947877283367, 1.0045390290306195], [13.862019929929046, 0.16657978945436192, 1.560988942064865], [15.42950159234615, 0.23185162121588654, 0.87297956433368], [17.05235836257204, 0.33761942465259587, 1.0598506541005532], [19.01201008610643, 0.31278991076579565, 1.4649530517406408], [23.4875205741284, 0.2935867557397085, 3.7319633572996826], [30.577161208811386, 0.12848124703855746, 1.5420255924911983], [48.04152501702831, 0.15773498959758747, 0.7537419801700808], [51.983562775587515, 0.14235923030363473, 1.354757577911606], [53.75828582873274, 0.18329312007870335, 0.8862637526350816], [56.30858055539315, 0.1216026615675716, 1.014230143420704], [61.945254562020445, 0.13757200032062222, 0.5000000000000001], [69.73546999326553, 0.09407475067930626, 10.618519539132675], [79.64095622117159, 0.18150154805615593, 0.5000000000000001]], "r_squared_": 0.9597289817046635, "error_": 0.0415186673067664}
{"freq_range": [2.0, 80.0], "freq_res": 0.5, "aperiodic_params_": [-7.6252213276202925, 0.7468634301908259], "gaussian_params_": [[8.899940769284477, 0.2689625102149851, 0.5707455788409418], [11.014754894517441, 0.25519250192274257, 0.49203012059535056], [17.74383220495833, 0.25487370059267583, 2.7253265590831517], [24.051789057100848, 0.24358326327473298, 1.5214708219810842], [27.81860497141429, 0.18182134127103414, 0.25843001904683344], [30.230984583523224, 0.11590812800047319, 0.9907070554739037], [44.51548367903851, 0.11602400327173165, 0.39905909117079835], [48.06805050470469, 0.20586108527842775, 0.36904184076196545], [51.19978534750922, 0.11925079994960552, 0.8931833382722848], [53.57636476984426, 0.1887255823727905, 0.540127942881014], [56.142437358603495, 0.11499762069109022, 0.7951798374997466], [62.17272216642059, 0.11484131181861415, 0.8222124785497971], [67.29874689101244, 0.12847193419062006, 0.7962367282426979], [69.8847170363033, 0.12134673716420949, 0.8102610451161346], [71.77397075051734, 0.04943160666185689, 1.6477224555116317], [75.0553840292447, 0.10504119508939132, 0.25000000000000006], [76.15923047182632, 0.13589583462475033, 0.25000000000000006], [79.68605162882554, 0.15792462768915574, 0.353605318219358]], "peak_params_": [[8.899940769284477, 0.2664020627660726, 1.1414911576818836], [11.014754894517441, 0.26731817297901195, 0.9840602411907011], [17.74383220495833, 0.2538785526409555, 5.450653118166303], [24.051789057100848, 0.2617249020029462, 3.0429416439621684], [27.81860497141429, 0.1599200154305489, 0.5168600380936669], [30.230984583523224, 0.11292741588496469, 1.9814141109478074], [44.51548367903851, 0.11593670044461568, 0.7981181823415967], [48.06805050470469, 0.20258557448419268, 0.7380836815239309], [51.19978534750922, 0.11630680272108229, 1.7863666765445696], [53.57636476984426, 0.19163694375669493, 1.080255885762028], [56.142437358603495, 0.11317550215838779, 1.5903596749994933], [62.17272216642059, 0.11233512469308593, 1.6444249570995941], [67.29874689101244, 0.127739250248446, 1.5924734564853957], [69.8847170363033, 0.1482207112028231, 1.6205220902322692], [71.77397075051734, 0.05298751301603488, 3.2954449110232633], [75.0553840292447, 0.10976933305772363, 0.5000000000000001], [76.15923047182632, 0.11287386943298472, 0.5000000000000001], [79.68605162882554, 0.13751097810434665, 0.707210636438716]], "r_squared_": 0.9676425665661674, "error_": 0.03399883148974778}
{"freq_range": [2.0, 80.0], "freq_res": 0.5, "aperiodic_params_": [-8.425182340949897, 0.641887539498424], "gaussian_params_": [[9.110348839056345, 0.33092173384511564, 0.6263788265494576], [10.894066524607776, 0.3732823449486363, 0.25000000000000006], [11.696241276497966, 0.2732938888310321, 0.26732599246775307], [14.782646931402956, 0.2765076119395591, 1.2059733968903423], [17.247578123059736, 0.4220968605443939, 0.6404278524748883], [19.0824387570486, 0.35009084274866775, 0.6277898947497176], [20.55541984987018, 0.23271760650087428, 0.25000000000000006], [22.230367892510976, 0.19946398452227818, 0.6517858831016117], [24.14140552033477, 0.2402614137666372, 1.69735754159677], [30.35375485154184, 0.12772290828690647, 1.1595502865118188], [30.85343895980791, 0.1183099774371502, 0.25000000000000844], [34.25239015538931, 0.13379168557702037, 1.1880802046508714], [51.59502546105373, 0.13154801961611948, 0.26489178332387664], [53.81222600845238, 0.1598567631810986, 0.3060682489948101], [56.730209952925044, 0.13458896227977687, 0.5109294192361352], [68.10174672050383, 0.1496950216893127, 0.46975080147089854], [70.0868521445361, 0.18718452850761186, 0.4146113749746345], [75.32342174624034, 0.13559771425776276, 0.8830159165848077]], "peak_params_": [[9.110348839056345, 0.32582899219219996, 1.2527576530989153], [10.894066524607776, 0.35594377750309114, 0.5000000000000001], [11.696241276497966, 0.2355648065864493, 0.5346519849355061], [14.782646931402956, 0.2729462213794438, 2.4119467937806847], [17.247578123059736, 0.4441746977412233, 1.2808557049497766], [19.0824387570486, 0.36013157185693245, 1.2555797894994352], [20.55541984987018, 0.28436701263911957, 0.5000000000000001], [22.230367892510976, 0.29580103883239417, 1.3035717662032233], [24.14140552033477, 0.24443135971019458, 3.39471508319354], [30.35375485154184, 0.17139120730738888, 2.3191005730236376], [30.85343895980791, 0.21220519731423693, 0.5000000000000169], [34.25239015538931, 0.13113108360009385, 2.3761604093017428], [51.59502546105373, 0.1233501699133619, 0.5297835666477533], [53.81222600845238, 0.13243413839243345, 0.6121364979896202], [56.730209952925044, 0.12159773227088166, 1.0218588384722704], [68.10174672050383, 0.14622505297870347, 0.9395016029417971], [70.0868521445361, 0.18316490355820392, 0.829222749949269], [75.32342174624034, 0.13291345005388777, 1.7660318331696154]], "r_squared_": 0.9620590896436557, "error_": 0.035753911803217624}
{"freq_range": [2.0, 80.0], "freq_res": 0.5, "aperiodic_params_": [-8.290392941303665, 0.8509159608999934], "gaussian_params_": [[8.787726218031478, 0.4374519173027368, 0.49863509194579164], [11.298788254338533, 0.400030367634244, 0.5680000725399745], [13.778376042879088, 0.0750251731276997, 0.8184429537902131], [17.1203747926047, 0.2339100396111256, 2.751345892995118], [23.030495648697254, 0.28930488663954645, 1.4264343747074724], [25.399410914041873, 0.07004535870646367, 0.25000000000000006], [27.40695525494025, 0.12488543458911709, 0.3569134451410641], [31.26042342498104, 0.1924059304384913, 0.25000000000750516], [51.47937981093983, 0.12976390506798707, 0.2728263279324431], [53.66304834662791, 0.12280745934793194, 0.9605855085248602], [56.73584797799631, 0.13868408248981512, 0.8790200920638614], [61.99670135566056, 0.12724391954616004, 0.9229238258627439], [64.42992724016018, 0.12311690991844998, 0.25000000000000006], [66.39414246486717, 0.10358298383729031, 0.276908851676844], [68.00543920401934, 0.09725263295325189, 0.8739432657990225], [69.91222640269196, 0.1756643580337557, 0.499210673836093], [75.50217078244204, 0.1608272203767972, 1.0236006307940906], [78.16285771123665, 0.15193865514566235, 0.2500000000000238], [79.59656488452414, 0.19084818339861256, 0.28791900584315844]], "peak_params_": [[8.787726218031478, 0.40266906760654564, 0.9972701838915833], [11.298788254338533, 0.40629354802171136, 1.136000145079949], [13.778376042879088, 0.1952838256576488, 1.6368859075804263], [17.1203747926047, 0.23375672289719418, 5.502691785990236], [23.030495648697254, 0.3130832619305899, 2.8528687494149447], [25.399410914041873, 0.1315056225673974, 0.5000000000000001], [27.40695525494025, 0.12303821036655194, 0.7138268902821282], [31.26042342498104, 0.12156318695310375, 0.5000000000150103], [51.47937981093983, 0.13912476149493536, 0.5456526558648862], [53.66304834662791, 0.12120930428385535, 1.9211710170497205], [56.73584797799631, 0.1353484513126446, 1.758040184127723], [61.99670135566056, 0.12724310908486913, 1.8458476517254878], [64.42992724016018, 0.12162013767188462, 0.5000000000000001], [66.39414246486717, 0.11834275491319524, 0.553817703353688], [68.00543920401934, 0.09736518496916169, 1.747886531598045], [69.91222640269196, 0.1801620492819076, 0.998421347672186], [75.50217078244204, 0.16082685871671032, 2.047201261588181], [78.16285771123665, 0.13108108761252701, 0.5000000000000476], [79.59656488452414, 0.18048902786413912, 0.5758380116863169]], "r_squared_": 0.9784782191512889, "error_": 0.034830180990761225}
{"freq_range": [2.0, 80.0], "freq_res": 0.5, "aperiodic_params_": [-8.061323723285286, 0.924680372211322], "gaussian_params_": [[9.065572440910218, 0.2593264386163635, 0.5311042428557604], [10.98118403724046, 0.2659918450259652, 0.44374597028341173], [15.43220812168691, 0.08351962113624972, 0.25000000000000006], [15.773982700432027, 0.19423775006226687, 2.75200629737859], [17.03967163869297, 0.2003327522782546, 0.4286383365241807], [22.51990382384517, 0.28714503675514524, 2.5811177242647467], [68.64606670453993, 0.08026696197365736, 0.9844605690831432], [70.77398270043201, 0.0642084559810902, 5.999999999999999]], "peak_params_": [[9.065572440910218, 0.2667604152917331, 1.0622084857115208], [10.98118403724046, 0.3092473308377883, 0.8874919405668235], [15.43220812168691, 0.28120889685393813, 0.5000000000000001], [15.773982700432027, 0.22231042653409716, 5.50401259475718], [17.03967163869297, 0.40453768738723817, 0.8572766730483614], [22.51990382384517, 0.2969368069298479, 5.1622354485294935], [68.64606670453993, 0.1391470373708632, 1.9689211381662863], [70.77398270043201, 0.06876589533673716, 11.999999999999998]], "r_squared_": 0.97915712620567, "error_": 0.039790199635794846}
{"freq_range": [2.0, 80.0], "freq_res": 0.5, "aperiodic_params_": [-7.975865851327331, 0.6426667754809219], "gaussian_params_": [[9.024522487022965, 0.2760808152903838, 0.5992593439275504], [11.08272484699353, 0.26322366850119955, 0.4508636972545841], [17.536172508487343, 0.18052433326476217, 2.410344697381172], [19.33308172382334, 0.1118030520849168, 0.3651602392429956], [23.80742120604774, 0.29940015989921087, 1.6941374052830536], [27.850471843173043, 0.20346258870586795, 0.3326405439132077], [30.341326319971586, 0.11489939869486782, 0.8942094274817665], [44.69595009834172, 0.1524541244553845, 0.34230208608727364], [48.07810905033949, 0.2010538806070288, 0.37877196142491104], [50.79289879002144, 0.12894986158742294, 0.6792001287319993], [53.275856734195685, 0.18022184684326878, 0.7850147809223834], [62.124594810316076, 0.09648392046100558, 0.701422624717476], [67.28628550049517, 0.09433899735553887, 0.7615285454024692], [70.25694819757928, 0.11724519915262115, 0.8647392184553451], [75.00393200402681, 0.12529651628890753, 0.25000000000000006], [79.66531385523635, 0.14811641075342738, 0.25000000000000006]], "peak_params_": [[9.024522487022965, 0.2761971197240882, 1.1985186878551009], [11.08272484699353, 0.2646041886137933, 0.9017273945091682], [17.536172508487343, 0.18079699492940016, 4.820689394762344], [19.33308172382334, 0.24206438582549517, 0.7303204784859912], [23.80742120604774, 0.30242555010786276, 3.388274810566107], [27.850471843173043, 0.20166158562794045, 0.6652810878264154], [30.341326319971586, 0.11322705066242911, 1.788418854963533], [44.69595009834172, 0.12941385514026038, 0.6846041721745473], [48.07810905033949, 0.19685153345407969, 0.7575439228498221], [50.79289879002144, 0.12578833479947704, 1.3584002574639986], [53.275856734195685, 0.1730689828768206, 1.5700295618447668], [62.124594810316076, 0.09497368732671774, 1.402845249434952], [67.28628550049517, 0.09142381764284124, 1.5230570908049383], [70.25694819757928, 0.11271709255461637, 1.7294784369106901], [75.00393200402681, 0.125281054295602, 0.5000000000000001], [79.66531385523635, 0.11902923769727103, 0.5000000000000001]], "r_squared_": 0.9492783938723331, "error_": 0.03595014392779259}
{"freq_range": [2.0, 80.0], "freq_res": 0.5, "aperiodic_params_": [-8.109330224562855, 0.7243220919220645], "gaussian_params_": [[8.717241012502313, 0.7775069817584445, 0.5519829420952825], [11.354950988606216, 0.47384120500865234, 0.8948492311123443], [16.983570092895466, 0.28710847095340003, 3.8891806628509467], [23.526030765533857, 0.27738544866594395, 0.6212126734204921], [25.12404747089295, 0.20154889177487173, 0.25000000000000006], [26.38191941747417, 0.15352577918056398, 0.4881800546927162], [28.322242912606246, 0.21103092912837243, 0.5586981500963047], [38.82226027415139, 0.17624227364689543, 0.25000000000000006], [46.440147695336236, 0.08815432025655465, 5.999999999999999], [51.30248145663048, 0.13418058790840898, 0.38440680476640304], [53.30564830389443, 0.21012343299936465, 0.25000000000000006], [66.48054741484009, 0.146543860331399, 0.3539840331304992]], "peak_params_": [[8.717241012502313, 0.7490802580005553, 1.103965884190565], [11.354950988606216, 0.5739177205811643, 1.7896984622246885], [16.983570092895466, 0.2871064316424352, 7.778361325701893], [23.526030765533857, 0.3477398950996946, 1.2424253468409843], [25.12404747089295, 0.2320786132440702, 0.5000000000000001], [26.38191941747417, 0.16487390164591886, 0.9763601093854324], [28.322242912606246, 0.20521828932103325, 1.1173963001926095], [38.82226027415139, 0.17774763890831125, 0.5000000000000001], [46.440147695336236, 0.08814993432300255, 11.999999999999998], [51.30248145663048, 0.17936222057624995, 0.7688136095328061], [53.30564830389443, 0.19944122106986306, 0.5000000000000001], [66.48054741484009, 0.14665239161220356, 0.7079680662609984]], "r_squared_": 0.9766340323319915, "error_": 0.04033341288989592}
{"freq_range": [2.0, 80.0], "freq_res": 0.5, "aperiodic_params_": [-8.660212988756369, 0.5951405781290673], "gaussian_params_": [[8.380126672376216, 0.41964591390573275, 0.25000000000000006], [9.203649125893955, 0.45254062799355027, 0.25000000000000006], [11.401827880528227, 0.6219972170325656, 0.7294450047022597], [16.303085541454312, 0.34323135692610857, 2.1808284483949016], [20.67865285587345, 0.1352899631581679, 0.8919493177252469], [23.55511419475371, 0.30074547656151984, 1.0581908384643182], [26.43762486769476, 0.19192148902067774, 0.4852041870529026], [28.424807731846975, 0.1661449912817294, 0.7405622617140016], [38.93259916179666, 0.22449652412064308, 0.25000000000000006], [40.05929120138181, 0.1528058035794537, 0.35792534707368523], [44.94916192113099, 0.12894552009086815, 1.8493997851169912], [51.15928564507779, 0.15387998213812393, 0.2690128292831562], [53.80487477555834, 0.11864275325865992, 1.8839173642183373], [66.45808352677982, 0.214520561421903, 0.26344165144794884], [70.6311130770833, 0.1898591476652423, 0.25000000000000006], [71.54915340291416, 0.14212227301752933, 0.25000000000000006]], "peak_params_": [[8.380126672376216, 0.3834899929104836, 0.5000000000000001], [9.203649125893955, 0.34817767816206313, 0.5000000000000001], [11.401827880528227, 0.6467485071232772, 1.4588900094045194], [16.303085541454312, 0.3418373584547716, 4.361656896789803], [20.67865285587345, 0.1911343372154839, 1.7838986354504938], [23.55511419475371, 0.3027285920098297, 2.1163816769286363], [26.43762486769476, 0.20227620781573385, 0.9704083741058052], [28.424807731846975, 0.16531919778823578, 1.4811245234280033], [38.93259916179666, 0.219129332037582, 0.5000000000000001], [40.05929120138181, 0.1543400900596339, 0.7158506941473705], [44.94916192113099, 0.12889895369924176, 3.6987995702339824], [51.15928564507779, 0.16891269568605516, 0.5380256585663123], [53.80487477555834, 0.11800889218040922, 3.7678347284366747], [66.45808352677982, 0.21182223969395508, 0.5268833028958977], [70.6311130770833, 0.16548591267576107, 0.5000000000000001], [71.54915340291416, 0.13985393558445836, 0.5000000000000001]], "r_squared_": 0.9620787031459272, "error_": 0.039678548280031374}
{"freq_range": [2.0, 80.0], "freq_res": 0.5, "aperiodic_params_": [-8.57510758673716, 0.8580853444097096], "gaussian_params_": [[2.3130666475592165, 0.20925443772981367, 0.25000000000000006], [7.760590172391806, 0.21801185183028177, 0.25000000000000006], [8.929962070132106, 0.2898807236938331, 0.452185528082338], [11.44373208945925, 0.8828547820695953, 0.699182266596555], [15.767153508408233, 0.3792406085980115, 1.773234281381897], [18.944034960882792, 0.1324568291469956, 0.2500000014864284], [19.992307101779158, 0.047949384368419674, 0.25000000000000006], [22.160061750262763, 0.24961216546860632, 2.9560029508838435], [22.848279390120123, 0.17119993824207957, 0.8626824739717582], [28.523781897292345, 0.18045006473970632, 0.4090440434854088], [50.21127849606094, 0.09016345717389695, 2.5090137659307397], [55.953047663099305, 0.10575488491376585, 1.0478993641262904], [64.18627402457939, 0.12337967719598467, 1.6041565588617064], [68.86313455371311, 0.155366171315157, 0.5103760660180617], [70.95651280149745, 0.20730125636795388, 0.4619921780914537], [79.04796540086404, 0.14051905721424385, 2.9814663690857297]], "peak_params_": [[2.3130666475592165, 0.1582218704396965, 0.5000000000000001], [7.760590172391806, 0.17283872687826296, 0.5000000000000001], [8.929962070132106, 0.28866302394543375, 0.904371056164676], [11.44373208945925, 0.9013373183652345, 1.39836453319311], [15.767153508408233, 0.40444667365647646, 3.546468562763794], [18.944034960882792, 0.34213866948584837, 0.5000000029728568], [19.992307101779158, 0.2617604521367731, 0.5000000000000001], [22.160061750262763, 0.3556051780312668, 5.912005901767687], [22.848279390120123, 0.4084012525124461, 1.7253649479435165], [28.523781897292345, 0.2051708324818815, 0.8180880869708176], [50.21127849606094, 0.08984436123868811, 5.018027531861479], [55.953047663099305, 0.11194626893265358, 2.0957987282525807], [64.18627402457939, 0.12255110187205176, 3.2083131177234128], [68.86313455371311, 0.15175301584108247, 1.0207521320361235], [70.95651280149745, 0.2101012591253557, 0.9239843561829074], [79.04796540086404, 0.14050087388267585, 5.962932738171459]], "r_squared_": 0.9831769048279271, "error_": 0.03991617570278399}
{"freq_range": [2.0, 80.0], "freq_res": 0.5, "aperiodic_params_": [-7.965215377389824, 0.999512599577534], "gaussian_params_": [[2.3950052749419872, 0.10938435251065687, 0.25000000000000006], [11.474526224707992, 0.39620545733328333, 0.5428829257538841], [15.14039508981059, 0.288405497222424, 0.9058457698860624], [17.399632271207025, 0.3073521387024354, 1.0509158954192825], [19.79155538659829, 0.22521270932930845, 0.8218966242166234], [22.71885950159042, 0.4578547843143977, 1.6527497899081647], [26.172208849764495, 0.18411609728097525, 0.3506740599491166], [28.288855255193166, 0.23408020343225083, 0.428576824414115], [30.84504718352115, 0.15831694944868613, 0.25000000000000006], [46.95374404833996, 0.1255649501231016, 0.25000000000000006], [55.031409780949126, 0.15431690178218674, 0.25000000000000006], [64.47946723696377, 0.1427959353115552, 1.2577095506244764], [68.89529772655187, 0.22522024602589272, 0.3390506921285398], [70.76131772684266, 0.14871586435148923, 0.5973216571621656], [76.54279415522755, 0.14164824375918827, 0.8447967222234687], [79.25001124132268, 0.23930035837918529, 0.5455339017563262]], "peak_params_": [[2.3950052749419872, 0.10015076607622753, 0.5000000000000001], [11.474526224707992, 0.3958592943177752, 1.0857658515077682], [15.14039508981059, 0.3076419930037808, 1.8116915397721247], [17.399632271207025, 0.32339884267393515, 2.101831790838565], [19.79155538659829, 0.35080500861001873, 1.6437932484332467], [22.71885950159042, 0.4548477783646714, 3.3054995798163294], [26.172208849764495, 0.22701254333706444, 0.7013481198982332], [28.288855255193166, 0.20833746284801968, 0.85715364882823], [30.84504718352115, 0.1306508402954023, 0.5000000000000001], [46.95374404833996, 0.12343395689505599, 0.5000000000000001], [55.031409780949126, 0.15310373483410977, 0.5000000000000001], [64.47946723696377, 0.1427769074060805, 2.515419101248953], [68.89529772655187, 0.21688138704130466, 0.6781013842570796], [70.76131772684266, 0.13730489562727932, 1.1946433143243311], [76.54279415522755, 0.1414673483782476, 1.6895934444469374], [79.25001124132268, 0.21575843665389094, 1.0910678035126524]], "r_squared_": 0.9862575587006578, "error_": 0.03459330699902368}
{"freq_range": [2.0, 80.0], "freq_res": 0.5, "aperiodic_params_": [-7.709773371682615, 1.1267166271697404], "gaussian_params_": [[11.15038123875395, 0.3138974005523275, 0.25000000000036526], [12.349646261833184, 0.09345237683031535, 0.9542811754614893], [15.438938746427597, 0.2764367847622726, 1.1571532356694294], [17.20155901278445, 0.22637968429027036, 0.6951876023434888], [21.730911462867454, 0.43103342175232856, 2.816763554959917], [26.188143464195736, 0.16634287911784454, 0.26982308419607287], [28.29733065353172, 0.19282302537921464, 0.25000000000000006], [69.16946674541867, 0.1825390145761282, 0.2500000003321267], [69.86644115067472, 0.18296001081319155, 0.25000000794692634], [71.1516897947296, 0.16583830237864314, 0.25000000000000006], [72.09655856065504, 0.20184045258568262, 0.250000000002313], [76.51306140931545, 0.1839168532650361, 0.29954709142002567], [79.40965868142398, 0.1893822879506161, 0.625423069568957]], "peak_params_": [[11.15038123875395, 0.29680404560573237, 0.5000000000007305], [12.349646261833184, 0.1052929606192965, 1.9085623509229785], [15.438938746427597, 0.3250964498169626, 2.314306471338859], [17.20155901278445, 0.433524309472185, 1.3903752046869775], [21.730911462867454, 0.42958781620799513, 5.633527109919834], [26.188143464195736, 0.26712738055416096, 0.5396461683921457], [28.29733065353172, 0.1628333635310728, 0.5000000000000001], [69.16946674541867, 0.14552028644572879, 0.5000000006642534], [69.86644115067472, 0.1593648909654668, 0.5000000158938527], [71.1516897947296, 0.1379756981545075, 0.5000000000000001], [72.09655856065504, 0.1878573704745481, 0.500000000004626], [76.51306140931545, 0.1837458754586212, 0.5990941828400513], [79.40965868142398, 0.18741679737359362, 1.250846139137914]], "r_squared_": 0.987169750734312, "error_": 0.03859638228298993}
{"freq_range": [2.0, 80.0], "freq_res": 0.5, "aperiodic_params_": [-7.911388874808033, 0.971552884608887], "gaussian_params_": [[11.152664650390225, 0.237733711437393, 0.29249307427613536], [12.407447650301062, 0.17083708599679012, 0.7641080305481304], [14.426341385656945, 0.2007932987210048, 0.34937298061100913], [16.588944282439062, 0.3824297876759811, 1.1941740157839689], [21.660184573335982, 0.4012873147884573, 2.7958136856052764], [24.597818745312377, 0.10941791948802666, 0.4937987301869466], [26.164957711871956, 0.1475614273637222, 0.2500486183940276], [28.302428222755875, 0.21692293213511016, 0.2500005106513248], [30.123324456538253, 0.18437010880829782, 0.25000000000000006], [33.95574674144711, 0.18854758793811405, 0.659723752782524], [36.64219634356273, 0.14220375211824043, 0.4115047092437545], [41.849258467040094, 0.18347825969987547, 0.27300929144751146], [45.09318854549721, 0.13144531802664053, 0.25000000000000006], [45.93102086607953, 0.1306727185239207, 0.25000000000000006], [47.83446826816589, 0.144564985830037, 0.25000000000000505], [60.493929177997344, 0.12092272711378659, 0.32696471377328357], [76.51862776015133, 0.16963817879357973, 0.25000000000000006], [79.68823959804554, 0.17638214304797092, 0.2500000822844798]], "peak_params_": [[11.152664650390225, 0.23906846489001765, 0.5849861485522707], [12.407447650301062, 0.17255500453005013, 1.5282160610962607], [14.426341385656945, 0.2983167461895029, 0.6987459612220183], [16.588944282439062, 0.45443969194639955, 2.3883480315679377], [21.660184573335982, 0.40071049355569066, 5.591627371210553], [24.597818745312377, 0.34685473718919724, 0.9875974603738932], [26.164957711871956, 0.24093958769600476, 0.5000972367880552], [28.302428222755875, 0.17886802049986983, 0.5000010213026496], [30.123324456538253, 0.16793949930462126, 0.5000000000000001], [33.95574674144711, 0.18814749969176603, 1.319447505565048], [36.64219634356273, 0.1340736405868732, 0.823009418487509], [41.849258467040094, 0.1575373354105718, 0.5460185828950229], [45.09318854549721, 0.1227506644081835, 0.5000000000000001], [45.93102086607953, 0.1259748526544957, 0.5000000000000001], [47.83446826816589, 0.1161082680919403, 0.5000000000000101], [60.493929177997344, 0.12090188538522817, 0.6539294275465671], [76.51862776015133, 0.16916792510243361, 0.5000000000000001], [79.68823959804554, 0.13284458684219658, 0.5000001645689596]], "r_squared_": 0.9872467779025326, "error_": 0.031374084671797677}
{"freq_range": [2.0, 80.0], "freq_res": 0.5, "aperiodic_params_": [-8.233785874756448, 0.6463032921646211], "gaussian_params_": [[2.259207561481362, 0.3010312202222387, 0.25000000000000006], [11.573451094343714, 0.26237929577002267, 0.9193228909286341], [16.528133486343755, 0.7807658832617769, 2.042320380224237], [22.385280589834984, 0.408071196613299, 2.0540445098431257], [24.868889710860266, 0.17672096255472752, 0.25000000000000006], [28.21382019410866, 0.14334599354652355, 0.25000000000000006], [32.32457946900504, 0.4900322526562253, 4.511088439527099], [41.972999902628445, 0.14722322324845774, 0.25000000000000006], [44.59303116464641, 0.2128045257031464, 5.99999995624123]], "peak_params_": [[2.259207561481362, 0.1893062349506529, 0.5000000000000001], [11.573451094343714, 0.29925378120346124, 1.8386457818572681], [16.528133486343755, 0.7884691387317879, 4.084640760448474], [22.385280589834984, 0.4642755040679649, 4.108089019686251], [24.868889710860266, 0.4678265178954639, 0.5000000000000001], [28.21382019410866, 0.42331639810958066, 0.5000000000000001], [32.32457946900504, 0.5175813144638681, 9.022176879054198], [41.972999902628445, 0.3893234022738472, 0.5000000000000001], [44.59303116464641, 0.22561393649505668, 11.99999991248246]], "r_squared_": 0.9696146230963549, "error_": 0.05228517650445654}
{"freq_range": [2.0, 80.0], "freq_res": 0.5, "aperiodic_params_": [-8.375784626318152, 0.555440892835604], "gaussian_params_": [[2.2755244863132122, 0.4307816130176861, 0.25000000000000006], [11.259748852860987, 0.2887891988056235, 1.4366674883076802], [16.54214220235738, 0.7180591841974119, 2.01799189632256], [22.63220689271725, 0.3844019848895382, 2.170405038625586], [31.887985685850108, 0.4346221568771925, 4.143647017474467], [34.50805201151834, 0.16230543626594093, 0.25000216248776813], [38.436712715589735, 0.16176576284579675, 0.364920088388797], [40.85244664285017, 0.10310518875165428, 0.25000000000000006], [41.930919790099935, 0.1296508161265524, 0.25000000000000006], [44.80561868194551, 0.1827503507842962, 5.999999999999999]], "peak_params_": [[2.2755244863132122, 0.287863733898849, 0.5000000000000001], [11.259748852860987, 0.31644284559338764, 2.8733349766153604], [16.54214220235738, 0.7258197639290671, 4.03598379264512], [22.63220689271725, 0.42644263742622, 4.340810077251172], [31.887985685850108, 0.4532362734866435, 8.287294034948934], [34.50805201151834, 0.560335743115683, 0.5000043249755363], [38.436712715589735, 0.3862282108937869, 0.729840176777594], [40.85244664285017, 0.274931300874492, 0.5000000000000001], [41.930919790099935, 0.3107482355801974, 0.5000000000000001], [44.80561868194551, 0.18556365467548375, 11.999999999999998]], "r_squared_": 0.9588858191941234, "error_": 0.05173811335162372}
{"freq_range": [2.0, 80.0], "freq_res": 0.5, "aperiodic_params_": [-8.757612219517368, 0.5891206842689399], "gaussian_params_": [[9.100125155213066, 0.5333661819714964, 0.7178180673235893], [11.260381411585747, 0.38547742615980857, 0.5019613663426693], [12.688745900508966, 0.22605605724437455, 0.25000000000000006], [13.772235910107035, 0.22189914674599812, 0.5363200838875569], [16.215917750708098, 0.3069489322171744, 0.9996775354462767], [18.675097072309015, 0.1895877618792902, 1.0786565341540657], [22.035711904277086, 0.3011659305053087, 1.2884429554675727], [24.148643626078094, 0.2599949568565192, 0.7600921890952421], [27.705484399364895, 0.16209533129755824, 0.8580352867164276], [31.05374709995915, 0.12991918491998095, 0.2999777043507803], [43.17075209876552, 0.18081624401916585, 0.25000000000000006], [45.253842895758446, 0.2544491434439502, 0.25000000000000006], [52.88853096492075, 0.16866580052374408, 0.6677662017922212], [70.45811978910888, 0.12680217798555343, 0.4711741613137234], [79.53903670966818, 0.14513184288109138, 0.25000000000000006]], "peak_params_": [[9.100125155213066, 0.5282179335224928, 1.4356361346471787], [11.260381411585747, 0.34599637204307676, 1.0039227326853386], [12.688745900508966, 0.20189103008680576, 0.5000000000000001], [13.772235910107035, 0.2290910362110079, 1.0726401677751138], [16.215917750708098, 0.30867170977369973, 1.9993550708925534], [18.675097072309015, 0.21664870237849243, 2.1573130683081314], [22.035711904277086, 0.3074729882774978, 2.5768859109351454], [24.148643626078094, 0.3492976909984069, 1.5201843781904842], [27.705484399364895, 0.15756615137591723, 1.7160705734328552], [31.05374709995915, 0.1279524668191918, 0.5999554087015606], [43.17075209876552, 0.1431983962795016, 0.5000000000000001], [45.253842895758446, 0.15670333423766714, 0.5000000000000001], [52.88853096492075, 0.16633215570791648, 1.3355324035844425], [70.45811978910888, 0.1263022654799002, 0.9423483226274468], [79.53903670966818, 0.14337329348614958, 0.5000000000000001]], "r_squared_": 0.9510018151644625, "error_": 0.03984942241561316}
{"freq_range": [2.0, 80.0], "freq_res": 0.5, "aperiodic_params_": [-7.7020228437614735, 0.8130529317526627], "gaussian_params_": [[8.730926910695947, 0.7861318530420087, 0.5793598173575025], [11.37154247294741, 0.9753771211056498, 0.8161045164125922], [13.617816336131987, 0.37787644886056826, 0.8436979901072669], [15.520473850948857, 0.2414388643319283, 0.48599939465584696], [17.461209303928836, 0.22379785877885666, 0.6760234033721183], [19.35711445741829, 0.20487859599268027, 1.2115488065327142], [23.66261137035936, 0.28248779264835866, 1.313519784872803], [27.987755689170296, 0.19138017618455985, 0.29843535592420467], [53.3870815469751, 0.17054608765687626, 0.4895863158124963]], "peak_params_": [[8.730926910695947, 0.7280987439153428, 1.158719634715005], [11.37154247294741, 0.9795629206953143, 1.6322090328251844], [13.617816336131987, 0.40677293131499503, 1.6873959802145337], [15.520473850948857, 0.277226050428963, 0.9719987893116939], [17.461209303928836, 0.286787044825747, 1.3520468067442366], [19.35711445741829, 0.2076920861062863, 2.4230976130654285], [23.66261137035936, 0.2809234764206341, 2.627039569745606], [27.987755689170296, 0.19243043171938368, 0.5968707118484093], [53.3870815469751, 0.16606977632177689, 0.9791726316249926]], "r_squared_": 0.981119622040486, "error_": 0.040372513390720996}
{"freq_range": [2.0, 80.0], "freq_res": 0.5, "aperiodic_params_": [-8.406179257473072, 0.6442989092683967], "gaussian_params_": [[8.807418634013262, 0.501005727946186, 0.5210274243455609], [11.172802323734238, 0.8917883591163354, 0.8184479106466473], [16.079323711023676, 0.31424438132063626, 2.5540815681516786], [22.88693614593943, 0.3008249689578966, 2.776532457794158], [26.712697356088842, 0.10043412758685562, 0.25000000000000006], [27.955829197138026, 0.11558012992561614, 0.25000000000000006], [33.34193841375607, 0.10947480905743019, 1.5279042051986165], [38.838751913382154, 0.18265434795993504, 0.25000000000000006], [40.171264132817335, 0.19026246383622009, 0.25000000000000006], [44.37042286764948, 0.15426193053653028, 1.0415656670456528], [51.11056958634283, 0.12283592692556146, 0.25000000000000006], [53.401531196944696, 0.12989275648442036, 1.3909987435827507], [66.33206458855149, 0.2791788243929803, 0.25000000000000006], [70.6335873979035, 0.18576591076746946, 0.25000000000000006]], "peak_params_": [[8.807418634013262, 0.5009641818617077, 1.0420548486911219], [11.172802323734238, 0.9157312677189537, 1.6368958212932947], [16.079323711023676, 0.32797101549107666, 5.108163136303357], [22.88693614593943, 0.30857260109006823, 5.553064915588316], [26.712697356088842, 0.19902271956783935, 0.5000000000000001], [27.955829197138026, 0.16923610984863657, 0.5000000000000001], [33.34193841375607, 0.10909269750813344, 3.055808410397233], [38.838751913382154, 0.14847077096620076, 0.5000000000000001], [40.171264132817335, 0.15050361691824676, 0.5000000000000001], [44.37042286764948, 0.1530727909819234, 2.0831313340913056], [51.11056958634283, 0.1406543273343459, 0.5000000000000001], [53.401531196944696, 0.12956770301438603, 2.7819974871655013], [66.33206458855149, 0.22279099833709637, 0.5000000000000001], [70.6335873979035, 0.16105124299097007, 0.5000000000000001]], "r_squared_": 0.9746658115938773, "error_": 0.04133579220537371}
{"freq_range": [2.0, 80.0], "freq_res": 0.5, "aperiodic_params_": [-8.523237993179437, 0.7562055018437375], "gaussian_params_": [[2.313555609305089, 0.20510164346564297, 0.25000000000000006], [8.731068381386923, 0.2311652313043551, 0.5727578240558364], [11.425050797256407, 0.44629798219510275, 0.5692762972232998], [14.699045627275439, 0.3064917662067041, 2.498999923200819], [18.0377406861473, 0.17422986517048425, 0.25000000000000006], [21.997705477513037, 0.4695062417347937, 3.11230878258275], [34.2215056576303, 0.2301211466639205, 0.25000000000000006], [35.06487974817115, 0.15917714925421736, 0.25000000001096284], [38.849807547656084, 0.17920887996025064, 0.2500000500103852], [40.812786733778175, 0.11553212647510246, 0.7328702159444073], [44.89273476579308, 0.15797560119266932, 0.3436374084499828], [51.281527566603, 0.1547185967834875, 0.9686522692365639], [61.11075236888084, 0.18463050789620825, 0.3558652869918654], [62.83854733981066, 0.19631296665932246, 0.33343985422525724], [66.55699140801947, 0.15223035953678243, 0.45468341215919417], [71.54492901071106, 0.22259874213134595, 0.46758237209218656]], "peak_params_": [[2.313555609305089, 0.1553105720955017, 0.5000000000000001], [8.731068381386923, 0.22727046377329962, 1.1455156481116728], [11.425050797256407, 0.5791120569032913, 1.1385525944465995], [14.699045627275439, 0.3313096323673612, 4.997999846401638], [18.0377406861473, 0.5061178656077221, 0.5000000000000001], [21.997705477513037, 0.47380116049836474, 6.2246175651655], [34.2215056576303, 0.15570842506385674, 0.5000000000000001], [35.06487974817115, 0.1557865706384547, 0.5000000000219257], [38.849807547656084, 0.1550401544848654, 0.5000001000207704], [40.812786733778175, 0.11182339293939947, 1.4657404318888145], [44.89273476579308, 0.15046386036293669, 0.6872748168999656], [51.281527566603, 0.15083299191880606, 1.9373045384731278], [61.11075236888084, 0.17590215988349378, 0.7117305739837309], [62.83854733981066, 0.17459771635142296, 0.6668797084505145], [66.55699140801947, 0.15103920760547496, 0.9093668243183883], [71.54492901071106, 0.2215734960917235, 0.9351647441843731]], "r_squared_": 0.9804292374257805, "error_": 0.03906427368103404}
{"freq_range": [2.0, 80.0], "freq_res": 0.5, "aperiodic_params_": [-8.134782681096185, 0.8955728768150294], "gaussian_params_": [[8.384732611608056, 0.3503075466189566, 0.6794359807833826], [11.373031654661247, 0.6003420339024568, 0.6422734552077911], [14.473907477762989, 0.3575346974510327, 1.5998784847435452], [17.5536509661983, 0.3431109655617926, 1.1652255414644215], [22.56323174503248, 0.7452160263981364, 2.632241747887554], [30.561961644792696, 0.16173341387801127, 0.73422066559177]], "peak_params_": [[8.384732611608056, 0.3456655524347134, 1.3588719615667653], [11.373031654661247, 0.6523797438809442, 1.2845469104155822], [14.473907477762989, 0.37539434595794674, 3.1997569694870904], [17.5536509661983, 0.5196880164955058, 2.330451082928843], [22.56323174503248, 0.7450441933927419, 5.264483495775108], [30.561961644792696, 0.1690668814175833, 1.46844133118354]], "r_squared_": 0.9837816937589227, "error_": 0.04498703940585722}
{"freq_range": [2.0, 80.0], "freq_res": 0.5, "aperiodic_params_": [-7.657796509326308, 1.14337523220912], "gaussian_params_": [[8.739989521269301, 0.23343987963483978, 0.6560746719828006], [11.158143638966552, 0.449029746125261, 0.6215034807787947], [12.158351900828473, 0.19197725597195134, 0.25000000000000006], [16.620174687082358, 0.663344593449418, 2.5092849994330586], [20.62139435991627, 0.3552497234648778, 0.5034803057465703], [22.258281220131522, 0.22904899286324928, 0.7647446779089434], [24.154949500111393, 0.6741236741975228, 1.7428763786470538], [31.103127305754082, 0.19451886293057694, 0.36391839842352947], [38.43795370968157, 0.10762195804923463, 1.4105203063754634]], "peak_params_": [[8.739989521269301, 0.22191076963997958, 1.3121493439656011], [11.158143638966552, 0.4893524410501495, 1.2430069615575894], [12.158351900828473, 0.4582781546970729, 0.5000000000000001], [16.620174687082358, 0.6626279211383519, 5.018569998866117], [20.62139435991627, 0.6368735169250783, 1.0069606114931406], [22.258281220131522, 0.6903153202820196, 1.5294893558178868], [24.154949500111393, 0.6973678122582321, 3.4857527572941076], [31.103127305754082, 0.18716487090915557, 0.7278367968470589], [38.43795370968157, 0.10751788607814561, 2.821040612750927]], "r_squared_": 0.9845951924936602, "error_": 0.052828482252102425}
{"freq_range": [2.0, 80.0], "freq_res": 0.5, "aperiodic_params_": [-7.915983814989966, 1.0271444794342706], "gaussian_params_": [[8.41066769007699, 0.1585600860977455, 0.6346759899034324], [9.348770676080541, 0.2064918553759604, 0.2500000000239324], [11.442115516612256, 0.4688707164254846, 0.801314065095091], [17.128470700832814, 0.5587522276834095, 2.4509145942832538], [20.856781107114784, 0.3231547735187285, 0.8538326214261337], [22.615928243119527, 0.20124864873303322, 0.4198441178772879], [24.04838102416785, 0.7452704887520502, 1.7143246668618297], [54.28778747403946, 0.17956947432983908, 0.25000000011023304], [56.20175971695503, 0.15579953593803283, 0.7094553389147561]], "peak_params_": [[8.41066769007699, 0.15933739924512658, 1.2693519798068649], [9.348770676080541, 0.2375771644594682, 0.5000000000478648], [11.442115516612256, 0.5076469925671656, 1.602628130190182], [17.128470700832814, 0.5581562202116928, 4.9018291885665075], [20.856781107114784, 0.6325900428641607, 1.7076652428522674], [22.615928243119527, 0.7906876890757975, 0.8396882357545759], [24.04838102416785, 0.7571942605266191, 3.4286493337236594], [54.28778747403946, 0.1340205552729703, 0.5000000002204661], [56.20175971695503, 0.1496250107300945, 1.4189106778295122]], "r_squared_": 0.9879914144259244, "error_": 0.04240653564633208}
{"freq_range": [2.0, 80.0], "freq_res": 0.5, "aperiodic_params_": [-8.28912140850425, 0.693158250841827], "gaussian_params_": [[11.310337939088317, 0.32784586147674766, 1.2332704453748122], [12.154767525998295, 0.1658694869025824, 0.25000000000326217], [16.27384951070662, 0.5721107287253266, 1.9529263599793525], [22.91120594953211, 0.5799602239517944, 2.898512274887354], [29.16686919147869, 0.2562590113801527, 1.5785536996178544], [32.2714185962629, 0.2571863880475867, 0.25000000000000006], [34.88260200342634, 0.2556617209582902, 2.4810889011528254], [39.22771911530801, 0.1606282586519214, 1.0378426632186935], [41.89681162099884, 0.2640416000526665, 0.2597758180887849], [43.726033672195676, 0.09876325285848614, 1.648890944584195], [44.487903386391174, 0.1438606212187752, 0.46325338228551316], [49.49211484225003, 0.13519032649438947, 1.579993518664915], [51.40543445826859, 0.1188761445312707, 0.25000000000000006], [55.99679614293854, 0.1233085320497447, 0.9523267790074842]], "peak_params_": [[11.310337939088317, 0.3584514509758705, 2.4665408907496245], [12.154767525998295, 0.4700014850004113, 0.5000000000065243], [16.27384951070662, 0.6185697798476983, 3.905852719958705], [22.91120594953211, 0.5813345098781344, 5.797024549774708], [29.16686919147869, 0.3340636710218874, 3.157107399235709], [32.2714185962629, 0.3605549359737257, 0.5000000000000001], [34.88260200342634, 0.25579037678204486, 4.962177802305651], [39.22771911530801, 0.2229453079897663, 2.075685326437387], [41.89681162099884, 0.309824430521342, 0.5195516361775698], [43.726033672195676, 0.11339443372219904, 3.29778188916839], [44.487903386391174, 0.23333149458783886, 0.9265067645710263], [49.49211484225003, 0.13540339169063031, 3.15998703732983], [51.40543445826859, 0.17096359515159598, 0.5000000000000001], [55.99679614293854, 0.12333581844861996, 1.9046535580149684]], "r_squared_": 0.9799828311954443, "error_": 0.03991236250606017}
{"freq_range": [2.0, 80.0], "freq_res": 0.5, "aperiodic_params_": [-8.546707087082, 0.24124254558947075], "gaussian_params_": [[10.473534858962841, 0.15426782151875532, 0.44605059445193485], [12.07898159732843, 0.12685078931239963, 0.25000000000000006], [16.52083320546099, 0.49310454830801453, 2.2061401428312037], [24.266250332441615, 0.15780542234786582, 2.4451802087952266], [28.86599730385837, 0.115453404714163, 0.25000000000000006], [32.24490282537445, 0.20257093153745018, 5.999999999999999], [38.72961059479153, 0.14669446407696013, 0.25000000000000006], [41.91140792311651, 0.20270939287947376, 0.25000000000000006], [44.777462710065386, 0.3002735040251341, 0.2739908426565587], [48.59828668454627, 0.14374855779401755, 1.2076953144974623], [51.09054375373046, 0.22453647088184892, 0.42423757521559263], [55.92747592461824, 0.1429079299755339, 0.9559801302888864], [70.65977912779063, 0.1876900235988081, 0.25000000000000006]], "peak_params_": [[10.473534858962841, 0.1661827242367604, 0.8921011889038697], [12.07898159732843, 0.18220769400112147, 0.5000000000000001], [16.52083320546099, 0.5005755043292055, 4.4122802856624075], [24.266250332441615, 0.24585496571767607, 4.890360417590453], [28.86599730385837, 0.29924088834983564, 0.5000000000000001], [32.24490282537445, 0.2034636022957308, 11.999999999999998], [38.72961059479153, 0.21385968139896505, 0.5000000000000001], [41.91140792311651, 0.24439526933407052, 0.5000000000000001], [44.777462710065386, 0.23875272279802573, 0.5479816853131174], [48.59828668454627, 0.1484349411093575, 2.4153906289949245], [51.09054375373046, 0.24090976173669176, 0.8484751504311853], [55.92747592461824, 0.14257722469609568, 1.9119602605777728], [70.65977912779063, 0.15301819500924196, 0.5000000000000001]], "r_squared_": 0.8468502381116341, "error_": 0.04785563298150142}
{"freq_range": [2.0, 80.0], "freq_res": 0.5, "aperiodic_params_": [-8.279617638762018, 0.47690888277073185], "gaussian_params_": [[9.472863942586383, 0.15841745259614193, 0.5721049585875602], [10.764299393574971, 0.6505521621940378, 0.2504313267097085], [11.519054232197618, 0.4783433969868257, 0.2855332339947802], [13.189493160892162, 0.23731753350035473, 1.5717461886659654], [16.08693440628436, 0.3596512399882894, 0.584954032348241], [17.235458589036984, 0.4172898406065475, 0.2500000694649466], [18.8301859053501, 0.30088468416561676, 0.8036925954147096], [20.79804784948734, 0.2676823716529658, 0.3890929895770177], [23.619374093259186, 0.13345498313509818, 0.877234217928676], [25.610464974806977, 0.1219649015418134, 0.3295442064268798], [29.844572666589073, 0.10127661716100511, 4.001391347667473], [36.08269568911875, 0.12377551888776925, 0.25000000000000006], [39.447029630029554, 0.13531868323565205, 0.5755614857156293], [41.432173758090414, 0.12409526919507069, 0.5382556311184677], [44.71932244795512, 0.24307840309444176, 0.2500000008523566], [48.23865199052507, 0.16856747887035398, 0.6448551798244496], [50.887706989430654, 0.22157499808535408, 0.471931536012772], [53.01723971406145, 0.1547256917160076, 0.44856670321959025], [55.36359855343777, 0.1779858131415026, 0.25000000000000006], [70.81969750698534, 0.1305482966514537, 0.42914241250638646]], "peak_params_": [[9.472863942586383, 0.17333540548172088, 1.1442099171751203], [10.764299393574971, 0.6038531444465765, 0.500862653419417], [11.519054232197618, 0.61945110491477, 0.5710664679895604], [13.189493160892162, 0.23561443109909597, 3.1434923773319308], [16.08693440628436, 0.40454297994165245, 1.169908064696482], [17.235458589036984, 0.40982642130884095, 0.5000001389298931], [18.8301859053501, 0.2970795954524146, 1.6073851908294192], [20.79804784948734, 0.25216197673520035, 0.7781859791540354], [23.619374093259186, 0.16103743417460414, 1.754468435857352], [25.610464974806977, 0.18488060913415438, 0.6590884128537596], [29.844572666589073, 0.10120024270722006, 8.002782695334947], [36.08269568911875, 0.1482060352008574, 0.5000000000000001], [39.447029630029554, 0.1404541460025257, 1.1511229714312585], [41.432173758090414, 0.12480337513476236, 1.0765112622369355], [44.71932244795512, 0.1655566271450244, 0.5000000017047131], [48.23865199052507, 0.15741349021974926, 1.2897103596488992], [50.887706989430654, 0.21541443211826028, 0.943863072025544], [53.01723971406145, 0.1546213615536729, 0.8971334064391805], [55.36359855343777, 0.15337121645293195, 0.5000000000000001], [70.81969750698534, 0.11951978140899122, 0.8582848250127729]], "r_squared_": 0.9507268670641299, "error_": 0.03425571301484786}
{"freq_range": [2.0, 80.0], "freq_res": 0.5, "aperiodic_params_": [-7.864601081291584, 0.823925777461575], "gaussian_params_": [[8.799709236988079, 0.5086823188459698, 0.5365961941108394], [11.330442639545863, 1.1525105146872356, 0.8389803821741612], [14.506287509487873, 0.47814562194096183, 2.82951507473649], [22.0723986385493, 0.3403793696936737, 2.457377705364366], [30.759220567631417, 0.22967462726319926, 0.3977665212706413]], "peak_params_": [[8.799709236988079, 0.5707690193655797, 1.0731923882216787], [11.330442639545863, 1.4011616923334955, 1.6779607643483223], [14.506287509487873, 0.482012948002259, 5.65903014947298], [22.0723986385493, 0.3545692123122315, 4.914755410728732], [30.759220567631417, 0.19168870059782428, 0.7955330425412827]], "r_squared_": 0.9839298112332141, "error_": 0.04745282665676843}
{"freq_range": [2.0, 80.0], "freq_res": 0.5, "aperiodic_params_": [-8.251740740523745, 0.8229263833291957], "gaussian_params_": [[8.752280139171761, 0.4035188396996078, 0.6321136349147769], [10.962299755081323, 1.1115288445228217, 0.6526441389294872], [11.857142665411812, 0.32174065144440167, 0.29418466375554525], [12.3667451855452, 0.577805711245521, 2.164199992327379], [16.61888314764315, 0.5863300620043099, 1.525918729311485], [21.746701961714013, 0.682708185709443, 2.658898619050447], [28.82443191382383, 0.1838311580872259, 0.25000000000000006], [52.48632488761167, 0.1746523361895512, 0.42101486879739525], [79.77398270043201, 0.09729819498575093, 5.999999999920407]], "peak_params_": [[8.752280139171761, 0.5580993327381858, 1.2642272698295538], [10.962299755081323, 1.5892207400687894, 1.3052882778589745], [11.857142665411812, 1.1763745556467162, 0.5883693275110905], [12.3667451855452, 0.6924838818250816, 4.328399984654758], [16.61888314764315, 0.7752596967256835, 3.05183745862297], [21.746701961714013, 0.6833716251454973, 5.317797238100894], [28.82443191382383, 0.16018775501436622, 0.5000000000000001], [52.48632488761167, 0.17456339917693953, 0.8420297375947905], [79.77398270043201, 0.09722918664357039, 11.999999999840814]], "r_squared_": 0.985829067292014, "error_": 0.047422852183000255}
{"freq_range": [2.0, 80.0], "freq_res": 0.5, "aperiodic_params_": [-8.125200204533881, 0.9298082128846274], "gaussian_params_": [[8.581004766482694, 0.5129782504541369, 0.7852843270260536], [10.726625716223676, 0.5586489278578948, 0.6083895473094573], [11.978388200004687, 0.18317203409705338, 0.4330882264025008], [15.8459725398735, 0.8532170337410857, 2.683413888322254], [21.618477071628053, 0.18548528463673727, 1.1580348791003319], [22.456698301923677, 0.6021821378079569, 4.0465669163477385], [30.90618689729412, 0.08272351849512767, 0.5739782154860735], [64.49224017467698, 0.13169255652319575, 0.25000000000000006]], "peak_params_": [[8.581004766482694, 0.5326426771484112, 1.570568654052107], [10.726625716223676, 0.6725787104423286, 1.2167790946189145], [11.978388200004687, 0.5723411006348513, 0.8661764528050016], [15.8459725398735, 1.0204246428255281, 5.366827776644508], [21.618477071628053, 0.8627898491054928, 2.3160697582006637], [22.456698301923677, 0.7804094344489005, 8.093133832695477], [30.90618689729412, 0.14646315670713683, 1.147956430972147], [64.49224017467698, 0.1316291329791568, 0.5000000000000001]], "r_squared_": 0.9896260604250057, "error_": 0.04606857941668981}
{"freq_range": [2.0, 80.0], "freq_res": 0.5, "aperiodic_params_": [-7.934020360193969, 1.0060238524422584], "gaussian_params_": [[8.755615284387524, 0.3165252654558945, 0.9343695141160032], [11.509053213632425, 0.5278377350660404, 0.7379294842282411], [14.049249087686254, 0.46442499205999427, 1.0312276676711858], [16.44977918690554, 0.39930755380710303, 0.9812343615089203], [21.795232392844376, 0.9350679846898085, 4.321353328377732]], "peak_params_": [[8.755615284387524, 0.31918479410686196, 1.8687390282320064], [11.509053213632425, 0.6086550392501984, 1.4758589684564822], [14.049249087686254, 0.6671165015315079, 2.0624553353423716], [16.44977918690554, 0.867717615099858, 1.9624687230178406], [21.795232392844376, 0.9340188439940285, 8.642706656755465]], "r_squared_": 0.9851116162620538, "error_": 0.05315395304093986}
{"freq_range": [2.0, 80.0], "freq_res": 0.5, "aperiodic_params_": [-7.834346926234507, 1.0603800639845669], "gaussian_params_": [[7.790861535999468, 0.06650553093435808, 0.2500082510364733], [8.86858737136958, 0.36563338888211766, 0.6310143993107006], [10.906745345121774, 0.38579495738497377, 0.3320492515598421], [11.785845962596811, 0.5304286788556881, 0.2835388662093238], [16.623652801446376, 0.8242637552592164, 3.5508142894766723], [24.73048841772364, 0.984186048810421, 2.710281810051859], [31.420442217343123, 0.15341620832224892, 0.8258970400069243], [34.413213362517375, 0.21797423418419382, 0.3880474267660351], [36.68264899008562, 0.19036118243471367, 0.861827866701843], [43.29210033401968, 0.21987450217780372, 0.29442335644875167]], "peak_params_": [[7.790861535999468, 0.2318275579101723, 0.5000165020729466], [8.86858737136958, 0.44003142475712664, 1.2620287986214012], [10.906745345121774, 0.6186651095844748, 0.6640985031196842], [11.785845962596811, 0.7536076848229776, 0.5670777324186476], [16.623652801446376, 0.8335490583334249, 7.101628578953345], [24.73048841772364, 1.0510430621929583, 5.420563620103718], [31.420442217343123, 0.19632302975509575, 1.6517940800138486], [34.413213362517375, 0.22193002255641048, 0.7760948535320702], [36.68264899008562, 0.1862131187911018, 1.723655733403686], [43.29210033401968, 0.17135728198261369, 0.5888467128975033]], "r_squared_": 0.9860225607560492, "error_": 0.055670823870481306}
{"freq_range": [2.0, 80.0], "freq_res": 0.5, "aperiodic_params_": [-7.76774848208528, 0.9110954866423255], "gaussian_params_": [[8.780866555402108, 0.22937790144779477, 0.7555252504724026], [11.004850643413686, 0.2868243374992924, 0.4838209158105845], [11.892914800497445, 0.345131520532743, 0.3330861350838282], [17.523279573717982, 0.39434846746739655, 2.617789201584484], [23.80698990076726, 0.5721163678857317, 2.655107572098303], [56.048624402757596, 0.1581155261426066, 0.2500000000043345]], "peak_params_": [[8.780866555402108, 0.2219511012961526, 1.5110505009448052], [11.004850643413686, 0.3170604249777611, 0.967641831621169], [11.892914800497445, 0.40497327710574105, 0.6661722701676565], [17.523279573717982, 0.42838993794622837, 5.235578403168968], [23.80698990076726, 0.5890851453916586, 5.310215144196606], [56.048624402757596, 0.15515293123354468, 0.500000000008669]], "r_squared_": 0.9794702893130018, "error_": 0.05023278343810499}
{"freq_range": [2.0, 80.0], "freq_res": 0.5, "aperiodic_params_": [-8.271373001470163, 0.8171065260175907], "gaussian_params_": [[11.131461868260683, 0.4772129026332072, 1.4342037798017722], [17.437379251652022, 0.90331284213046, 3.024578537140396], [23.59652091927915, 0.40884222178245266, 1.8814275895721897], [27.027986420486364, 0.09804472503177077, 5.5860743402994375], [55.71090626002602, 0.27152714567703884, 0.25000000000000006], [76.99250961671677, 0.1753925322812759, 0.48907145543545116], [79.60981536980317, 0.1477876242411866, 0.2961037643436079]], "peak_params_": [[11.131461868260683, 0.5706066068920688, 2.8684075596035443], [17.437379251652022, 0.9281812791953445, 6.049157074280792], [23.59652091927915, 0.6097871831609254, 3.7628551791443794], [27.027986420486364, 0.18375004366362013, 11.172148680598875], [55.71090626002602, 0.1902257817363644, 0.5000000000000001], [76.99250961671677, 0.1753719630014885, 0.9781429108709023], [79.60981536980317, 0.13796599979469804, 0.5922075286872158]], "r_squared_": 0.9864167858198916, "error_": 0.04358317621763128}
{"freq_range": [2.0, 80.0], "freq_res": 0.5, "aperiodic_params_": [-8.560008070867228, 0.657083107949104], "gaussian_params_": [[9.635449801893476, 0.25531164075904983, 0.6799685097180149], [11.394568888845267, 0.31171746693403585, 0.36073643858057436], [18.028851150071844, 0.6435872974917702, 4.544325458232167], [50.935946346084705, 0.17507917839106493, 0.41307821311294535], [55.43546700676456, 0.17642459209568126, 0.25000000000000006]], "peak_params_": [[9.635449801893476, 0.36088791819038946, 1.3599370194360298], [11.394568888845267, 0.5339238798978041, 0.7214728771611487], [18.028851150071844, 0.6435743268789196, 9.088650916464333], [50.935946346084705, 0.17298689882143314, 0.8261564262258907], [55.43546700676456, 0.17064365394297099, 0.5000000000000001]], "r_squared_": 0.9626788904023657, "error_": 0.05475306667109738}
{"freq_range": [2.0, 80.0], "freq_res": 0.5, "aperiodic_params_": [-8.04951861616871, 0.5805705253850566], "gaussian_params_": [[9.365928988501745, 0.25274285879777, 0.5359394909875637], [11.083459452458511, 0.8405624574988037, 0.6519720613163991], [12.586793555517177, 0.3769531109280816, 1.1283470153014061], [16.124178148038585, 0.23552425474846664, 0.9592214357784903], [21.089037021875743, 0.2751836886104433, 3.245824521371747], [39.58752494796133, 0.18122173739408207, 0.406645187604189], [40.88610447790098, 0.17695328237722954, 0.25000000000000006], [41.88276663705842, 0.18083535000821163, 0.25000000000000006], [47.93213676751277, 0.11655292399325554, 0.8283626679695203], [50.92829517178362, 0.16791484742212162, 0.46253882099727406]], "peak_params_": [[9.365928988501745, 0.2983863043724675, 1.0718789819751273], [11.083459452458511, 0.9785505207978407, 1.3039441226327981], [12.586793555517177, 0.46366820716127677, 2.2566940306028123], [16.124178148038585, 0.31794881000885766, 1.9184428715569806], [21.089037021875743, 0.2750807511715099, 6.491649042743494], [39.58752494796133, 0.1770723336188773, 0.813290375208378], [40.88610447790098, 0.1602997300951987, 0.5000000000000001], [41.88276663705842, 0.1620153485644753, 0.5000000000000001], [47.93213676751277, 0.11616244978431922, 1.6567253359390406], [50.92829517178362, 0.16603170012544766, 0.9250776419945481]], "r_squared_": 0.96081138692991, "error_": 0.04520284056648805}
{"freq_range": [2.0, 80.0], "freq_res": 0.5, "aperiodic_params_": [-8.390290219483953, 0.5475093407688798], "gaussian_params_": [[8.968379816753918, 0.5662356609823043, 0.6060431581530736], [11.265563060212765, 0.8966881928514777, 0.7118883405195781], [15.625339298427745, 0.5225553415136545, 3.101113867062805], [21.917241238951036, 0.35110572998771616, 2.6597364528575604], [27.37319666383728, 0.2051981608150986, 0.3921205539596257], [29.20990647252576, 0.2742865862035974, 0.690661652938412], [30.938634112576302, 0.29310508473105423, 0.49801801308050125], [33.80304278644639, 0.1891055127963415, 1.420039281327756], [38.63271808543356, 0.19896264065601124, 3.128536573698436], [45.00225987345059, 0.17762594090783632, 0.32155018413055264], [46.85526592449038, 0.2403913297939799, 0.3911795548483393]], "peak_params_": [[8.968379816753918, 0.6244675897827232, 1.2120863163061473], [11.265563060212765, 1.0653212786176507, 1.4237766810391561], [15.625339298427745, 0.5412430892888782, 6.20222773412561], [21.917241238951036, 0.41411532615462576, 5.319472905715121], [27.37319666383728, 0.24704343056123612, 0.7842411079192514], [29.20990647252576, 0.2746303896924349, 1.381323305876824], [30.938634112576302, 0.3385592249006919, 0.9960360261610025], [33.80304278644639, 0.2537763011226879, 2.840078562655512], [38.63271808543356, 0.19957991020892152, 6.257073147396872], [45.00225987345059, 0.20270398894729702, 0.6431003682611053], [46.85526592449038, 0.23005333264944916, 0.7823591096966785]], "r_squared_": 0.9748415581437512, "error_": 0.042288296682523784}
{"freq_range": [2.0, 80.0], "freq_res": 0.5, "aperiodic_params_": [-8.299184539405713, 0.7952879005547168], "gaussian_params_": [[8.729341558700918, 0.7055040896111089, 0.6144187739857799], [11.05796685024858, 1.0583555758797505, 0.755878840303343], [16.387007025069934, 0.7098219911014532, 3.3498822750422868], [22.470125724380466, 0.3470076311171084, 1.4916640311412086], [26.547965400142225, 0.06874380342810371, 5.999999999999999], [33.01792735040927, 0.15130832008560083, 0.4751677762931015]], "peak_params_": [[8.729341558700918, 0.7066310050095286, 1.2288375479715599], [11.05796685024858, 1.2532089429257027, 1.511757680606686], [16.387007025069934, 0.7264476445233079, 6.6997645500845735], [22.470125724380466, 0.5359788336307307, 2.983328062282417], [26.547965400142225, 0.0852161283246815, 11.999999999999998], [33.01792735040927, 0.18976367963453455, 0.950335552586203]], "r_squared_": 0.9870486628526988, "error_": 0.043877519267315444}
{"freq_range": [2.0, 80.0], "freq_res": 0.5, "aperiodic_params_": [-8.124983064718766, 0.9638369570481039], "gaussian_params_": [[8.569149682753476, 0.5577026100668133, 0.9129967435636591], [11.062829368228073, 0.537759655476321, 0.9321809108045694], [15.73731048285524, 0.9516802273605733, 2.454001738992931], [21.870369268069663, 0.7273361871436123, 3.305461465695685], [31.595930801728112, 0.06966573974345758, 4.4005839668794335], [60.82674828006748, 0.20915528947848513, 0.25000000000000006]], "peak_params_": [[8.569149682753476, 0.5808882461847684, 1.8259934871273182], [11.062829368228073, 0.7035722036337066, 1.8643618216091389], [15.73731048285524, 1.0608892056855765, 4.908003477985862], [21.870369268069663, 0.7699047793745848, 6.61092293139137], [31.595930801728112, 0.08009165087723602, 8.801167933758867], [60.82674828006748, 0.1645061113099615, 0.5000000000000001]], "r_squared_": 0.9884183284029665, "error_": 0.05158008182137264}
{"freq_range": [2.0, 80.0], "freq_res": 0.5, "aperiodic_params_": [-8.01851635200603, 0.9792246751522933], "gaussian_params_": [[9.057051456934438, 0.3941284631898425, 0.7384194108078677], [11.35320268721396, 0.5090531434545477, 0.7540136298608234], [15.491246586876985, 0.5929549227212195, 2.2051467239351092], [20.754665986348424, 0.26666095752743096, 0.2500000000002629], [21.62740194927219, 0.6902969318694515, 4.274024445467463], [28.964099666854576, 0.07937304042069974, 0.25000000000000006], [32.32305446196575, 0.1665143098641896, 0.29269816651028363], [55.6656328887073, 0.18377801916257422, 0.5515873941903547], [78.56682771869693, 0.17214876605867516, 0.3470844167232689]], "peak_params_": [[9.057051456934438, 0.41342944946470084, 1.4768388216157353], [11.35320268721396, 0.6580753144245666, 1.5080272597216469], [15.491246586876985, 0.8399689607005989, 4.4102934478702185], [20.754665986348424, 0.8738301291221937, 0.5000000000005258], [21.62740194927219, 0.7076008684834427, 8.548048890934925], [28.964099666854576, 0.2344795259322261, 0.5000000000000001], [32.32305446196575, 0.1658576419038198, 0.5853963330205673], [55.6656328887073, 0.17567634631052798, 1.1031747883807095], [78.56682771869693, 0.16898722982862502, 0.6941688334465378]], "r_squared_": 0.9865877823905904, "error_": 0.046743733115947345}
{"freq_range": [2.0, 80.0], "freq_res": 0.5, "aperiodic_params_": [-8.058869606266473, 0.9632689893888149], "gaussian_params_": [[8.924428491589634, 0.34696612850635306, 0.7264131030553802], [11.324635918503585, 0.4817056218112259, 0.6240744816665365], [19.218188255262174, 0.8516849695967365, 5.887712916034372], [26.40426276204284, 0.29058499204885224, 0.9226537296120247]], "peak_params_": [[8.924428491589634, 0.534461218331705, 1.4528262061107604], [11.324635918503585, 0.824384482717246, 1.248148963333073], [19.218188255262174, 0.8511003553727203, 11.775425832068745], [26.40426276204284, 0.6854166324064828, 1.8453074592240495]], "r_squared_": 0.9806529888061568, "error_": 0.06051404880752769}
{"freq_range": [2.0, 80.0], "freq_res": 0.5, "aperiodic_params_": [-8.100638538609193, 0.9636451277530612], "gaussian_params_": [[9.03473378638254, 0.323885598867126, 0.8529183151532823], [11.220344628867966, 0.45074656227023546, 0.7692672976138374], [19.03464809674586, 0.8876548778553814, 4.747758577560361], [25.389261328496232, 0.1363481291701791, 0.25000000000000006], [26.617830253659335, 0.2518948213627588, 0.5126274998479617], [30.68114687816257, 0.2263045747958177, 0.7704346753342328], [35.05820284108813, 0.16911151388515527, 0.3386847736817441], [40.27399216201272, 0.1966011427920682, 0.25000000000000006], [55.93664618578565, 0.13553121009891525, 0.8592834993119103]], "peak_params_": [[9.03473378638254, 0.42572356977754566, 1.7058366303065646], [11.220344628867966, 0.6674189497672991, 1.5385345952276748], [19.03464809674586, 0.8876312409901743, 9.495517155120721], [25.389261328496232, 0.4981854628291682, 0.5000000000000001], [26.617830253659335, 0.5031827630855084, 1.0252549996959235], [30.68114687816257, 0.2682076959614452, 1.5408693506684656], [35.05820284108813, 0.1697428913020449, 0.6773695473634882], [40.27399216201272, 0.13068476880599889, 0.5000000000000001], [55.93664618578565, 0.13516334223879234, 1.7185669986238206]], "r_squared_": 0.9891417999228053, "error_": 0.04246899285808648}
{"freq_range": [2.0, 80.0], "freq_res": 0.5, "aperiodic_params_": [-8.251841609556976, 0.8591126317262444], "gaussian_params_": [[8.350578863517118, 0.1634427126332787, 0.25000000000000006], [11.07168312566461, 0.5811198092623104, 1.811525136716398], [14.352646035529789, 0.23531555958670558, 0.25000000000000006], [17.267106630235485, 1.0970577213729775, 2.600605829805201], [23.342765798029287, 0.4604669800758212, 2.4083266467327866], [23.580384501051434, 0.1256382414333188, 0.34871050320644503], [27.74393664745962, 0.19058529795920134, 0.25000000000000006], [28.72442453360088, 0.21988132637861207, 0.25000000000000006], [30.150069158076832, 0.15921193653852028, 0.25000000000000006], [30.798022922987908, 0.17393810843225782, 0.7860233228489644], [32.992978848551935, 0.1616578984051033, 0.4657769392364035], [34.75387657483767, 0.26749128404226324, 0.3069296317284349], [56.607736069750395, 0.14850284663920846, 1.067418618738896]], "peak_params_": [[8.350578863517118, 0.3525937186988255, 0.5000000000000001], [11.07168312566461, 0.640805293412587, 3.623050273432796], [14.352646035529789, 0.9181400734371135, 0.5000000000000001], [17.267106630235485, 1.1180109580767734, 5.201211659610402], [23.342765798029287, 0.643901889483022, 4.816653293465573], [23.580384501051434, 0.643901889483022, 0.6974210064128901], [27.74393664745962, 0.22269324189875483, 0.5000000000000001], [28.72442453360088, 0.19794575923477176, 0.5000000000000001], [30.150069158076832, 0.24694997642479066, 0.5000000000000001], [30.798022922987908, 0.17173756217699676, 1.5720466456979287], [32.992978848551935, 0.16522548893877875, 0.931553878472807], [34.75387657483767, 0.1939638114652631, 0.6138592634568698], [56.607736069750395, 0.14774835938824715, 2.134837237477792]], "r_squared_": 0.990360994719145, "error_": 0.03980955038271639}
{"freq_range": [2.0, 80.0], "freq_res": 0.5, "aperiodic_params_": [-8.356495735735566, 0.7298177248986335], "gaussian_params_": [[9.90420009512364, 0.28878269649885274, 1.5088641807185466], [17.01586107129373, 0.8285430008999579, 3.1827189129727285], [21.646020427179714, 0.06263872125866309, 0.5551270330102703], [24.039867533368536, 0.14165960980032205, 1.9576886888245193], [70.42983733849755, 0.2857984588815001, 0.3347939622007391]], "peak_params_": [[9.90420009512364, 0.3611724507907965, 3.017728361437093], [17.01586107129373, 0.8287576853044616, 6.365437825945457], [21.646020427179714, 0.4286648987233175, 1.1102540660205407], [24.039867533368536, 0.2162265512216539, 3.9153773776490386], [70.42983733849755, 0.27959081213218084, 0.6695879244014782]], "r_squared_": 0.9714743735850627, "error_": 0.053734497178799044}
{"freq_range": [2.0, 80.0], "freq_res": 0.5, "aperiodic_params_": [-8.220639137642697, 0.7298645409257517], "gaussian_params_": [[8.919865705284982, 0.25903164613105406, 0.5189743114581512], [11.162111868428049, 0.9293546340771597, 0.9512195278981173], [15.598386819124665, 0.4036373567103474, 2.6640746739323453], [21.19338021145715, 0.2912156505756336, 1.541441052101869], [23.84301747624959, 0.18373704702580504, 1.015594893048033], [58.72275465794082, 0.23122970938914986, 0.25000000000000006], [64.99669785275101, 0.11435893887004925, 1.2189570939344845], [70.37290783146965, 0.13479905064629455, 0.4836877872018898]], "peak_params_": [[8.919865705284982, 0.3449435851407916, 1.0379486229163024], [11.162111868428049, 1.0070392373375459, 1.9024390557962345], [15.598386819124665, 0.4037080858626947, 5.328149347864691], [21.19338021145715, 0.34426059410871623, 3.082882104203738], [23.84301747624959, 0.23985350143652973, 2.031189786096066], [58.72275465794082, 0.1554703483501143, 0.5000000000000001], [64.99669785275101, 0.11435851925084428, 2.437914187868969], [70.37290783146965, 0.13022940553013207, 0.9673755744037796]], "r_squared_": 0.9758182429326343, "error_": 0.0464909621679896}
{"freq_range": [2.0, 80.0], "freq_res": 0.5, "aperiodic_params_": [-8.438587123265512, 0.7670991687977332], "gaussian_params_": [[4.053392018354503, 0.18187419806447733, 0.25000000000000006], [8.73962768839444, 0.7721503711204163, 0.6514736445055971], [11.424538029436581, 0.8614790812577525, 0.8648563799785037], [13.927389801255517, 0.18327381516864838, 0.739958222695034], [17.25796327323085, 0.34981155481787635, 2.88075331236243], [22.258525762531047, 0.16499734305680472, 0.25000000000000006], [23.2900744959026, 0.19601957123989894, 0.4307721922013884], [25.496390946164784, 0.14770579481934343, 0.25684773382621673], [44.9089444691131, 0.1802484347895657, 0.25000000000000006], [75.29635045584129, 0.22747698744848957, 0.25000000000000006]], "peak_params_": [[4.053392018354503, 0.17778217565363086, 0.5000000000000001], [8.73962768839444, 0.7279190486915343, 1.3029472890111942], [11.424538029436581, 0.9066059085669469, 1.7297127599570075], [13.927389801255517, 0.37715962836160166, 1.479916445390068], [17.25796327323085, 0.34858064018347434, 5.76150662472486], [22.258525762531047, 0.20675507183918995, 0.5000000000000001], [23.2900744959026, 0.20751715928152414, 0.8615443844027768], [25.496390946164784, 0.153530442541431, 0.5136954676524335], [44.9089444691131, 0.16868063863300087, 0.5000000000000001], [75.29635045584129, 0.16324693359909226, 0.5000000000000001]], "r_squared_": 0.9849268027491676, "error_": 0.03871378240156643}
{"freq_range": [2.0, 80.0], "freq_res": 0.5, "aperiodic_params_": [-8.469539743826072, 0.7385356604921632], "gaussian_params_": [[8.819438171444268, 0.6591525400340403, 0.5582947666608296], [11.027334254292418, 0.7409495635312574, 0.6382877354491745], [12.2534303309077, 0.3744978985356779, 0.250000000000001], [13.77057736126416, 0.449874879010415, 1.4149814360110489], [17.631813782084674, 0.5054589483110584, 1.4513439497262606], [21.725566869779833, 0.2776064305249753, 1.484947258748592], [24.46955365951669, 0.07022302445741996, 0.9805303115885632], [49.094478878100624, 0.10975750085566449, 1.1539287605528616], [57.440892857769555, 0.15340688697214838, 0.25000000000000006], [76.43974669227606, 0.06989507125110633, 5.999980207053354]], "peak_params_": [[8.819438171444268, 0.6318726563157586, 1.1165895333216591], [11.027334254292418, 0.8067642324938085, 1.276575470898349], [12.2534303309077, 0.5835904881055942, 0.500000000000002], [13.77057736126416, 0.4660915693778609, 2.8299628720220977], [17.631813782084674, 0.5221729227528584, 2.902687899452521], [21.725566869779833, 0.2896315894690993, 2.969894517497184], [24.46955365951669, 0.1186590009785995, 1.9610606231771264], [49.094478878100624, 0.10939223676529686, 2.3078575211057233], [57.440892857769555, 0.14965806601749598, 0.5000000000000001], [76.43974669227606, 0.06989154699258648, 11.999960414106708]], "r_squared_": 0.980015687436685, "error_": 0.03964432453537241}
{"freq_range": [2.0, 80.0], "freq_res": 0.5, "aperiodic_params_": [-8.30445844420519, 0.8621385612964755], "gaussian_params_": [[8.831890016979612, 0.3661781974156323, 0.5711985710015597], [11.181047784310525, 0.3423187379205085, 1.0005751832787313], [16.672301923619848, 0.7034781326538692, 3.863732458085647], [23.802776994477266, 0.2867770810759387, 1.696794250234171], [31.0191872806297, 0.15594841477689206, 0.2866195818005299], [65.55586029056822, 0.14527728523443761, 0.5567465405172565], [74.59524066650613, 0.10024022396910869, 1.2236527956446477]], "peak_params_": [[8.831890016979612, 0.4804275675078813, 1.1423971420031194], [11.181047784310525, 0.5764948178694702, 2.0011503665574626], [16.672301923619848, 0.702806475705998, 7.727464916171294], [23.802776994477266, 0.40131448889686006, 3.393588500468342], [31.0191872806297, 0.15636139751926414, 0.5732391636010598], [65.55586029056822, 0.1445478839623089, 1.113493081034513], [74.59524066650613, 0.09993705628971838, 2.4473055912892954]], "r_squared_": 0.9853686508766916, "error_": 0.04485890791372859}
{"freq_range": [2.0, 80.0], "freq_res": 0.5, "aperiodic_params_": [-8.092613257700542, 0.9985710910059395], "gaussian_params_": [[6.584304007741819, 0.14828568700404465, 0.25000000000000006], [8.839888606951538, 0.505417849076791, 0.8961347608607497], [11.24619648830322, 0.6896274869240291, 0.9089911694918454], [15.594452218309666, 0.48657186581776457, 2.0229951232680987], [20.590888622050443, 0.6279135488550857, 3.3630393696211853], [26.178318061075196, 0.15608425994368336, 0.2500000000000001], [29.539121265869714, 0.09119306241861252, 0.4656860081708532], [31.273982700432025, 0.08959250818484278, 1.566185467833119], [55.398342317295786, 0.14089653599579313, 0.25000000000000006], [62.097501850800825, 0.1479366222041296, 0.7640014431565666], [66.09793096269806, 0.13910368116943242, 0.3392292351935802]], "peak_params_": [[6.584304007741819, 0.15692532544707838, 0.5000000000000001], [8.839888606951538, 0.5340237284032305, 1.7922695217214994], [11.24619648830322, 0.7401242189843682, 1.8179823389836909], [15.594452218309666, 0.6857194269227254, 4.045990246536197], [20.590888622050443, 0.6534058589330449, 6.726078739242371], [26.178318061075196, 0.2935840144072479, 0.5000000000000002], [29.539121265869714, 0.1568362257190632, 0.9313720163417064], [31.273982700432025, 0.09193560811267787, 3.132370935666238], [55.398342317295786, 0.12971653349973877, 0.5000000000000001], [62.097501850800825, 0.14673680263567945, 1.5280028863131332], [66.09793096269806, 0.1334266590544111, 0.6784584703871605]], "r_squared_": 0.9902291873249229, "error_": 0.039562306757081105}
{"freq_range": [2.0, 80.0], "freq_res": 0.5, "aperiodic_params_": [-8.124971389379223, 0.9668103539026602], "gaussian_params_": [[8.89210772517999, 0.33922787810404365, 1.103145209732117], [11.257085851569112, 0.42919617037000835, 0.9811360705583827], [14.794995511826832, 0.222589132569603, 0.4864398430722605], [19.068438628739482, 0.6656090757890495, 4.66173379614292], [29.171902741111474, 0.16196526197940764, 0.25000000000000006], [33.29111339553695, 0.12100543407428407, 0.9600781360445942], [55.54705192378813, 0.1595489518842498, 0.25000000000000006], [57.93639173233878, 0.138480191612782, 0.48625305162480503], [68.33555573589074, 0.12965128953609484, 0.25000000000000006], [71.35699750035992, 0.07107900681903762, 0.25000000002071276], [76.54796540086394, 0.11221203100919318, 4.20945942842086]], "peak_params_": [[8.89210772517999, 0.43265771976117584, 2.206290419464234], [11.257085851569112, 0.615164846732446, 1.9622721411167654], [14.794995511826832, 0.6587781496732319, 0.972879686144521], [19.068438628739482, 0.6655373503034223, 9.32346759228584], [29.171902741111474, 0.19667799863117352, 0.5000000000000001], [33.29111339553695, 0.12369771040129862, 1.9201562720891885], [55.54705192378813, 0.15674895362288233, 0.5000000000000001], [57.93639173233878, 0.1373072298230653, 0.9725061032496101], [68.33555573589074, 0.12247254397211549, 0.5000000000000001], [71.35699750035992, 0.11502420087197507, 0.5000000000414255], [76.54796540086394, 0.1122047465245668, 8.41891885684172]], "r_squared_": 0.987510327487532, "error_": 0.039423089448501245}
{"freq_range": [2.0, 80.0], "freq_res": 0.5, "aperiodic_params_": [-8.213187756228624, 0.9203140473492947], "gaussian_params_": [[17.077932790472175, 0.6651838312653561, 5.795180634244984], [79.27398270043177, 0.12933570556065893, 2.407090098457407]], "peak_params_": [[17.077932790472175, 0.665123686400575, 11.590361268489968], [79.27398270043177, 0.1287668130473385, 4.814180196914814]], "r_squared_": 0.9766754960675105, "error_": 0.05599285647631119}
{"freq_range": [2.0, 80.0], "freq_res": 0.5, "aperiodic_params_": [-8.26023282228924, 0.810892626841381], "gaussian_params_": [[8.676272304207933, 0.31319270092952484, 0.39165280106391137], [9.662715771301945, 0.24169326315336934, 0.25000000000000006], [11.20027286278367, 0.5623578357271022, 0.8666151787115045], [16.65525771868191, 0.546233541267526, 2.819966300872614], [21.004110489841434, 0.14280055300265498, 0.2896355689335786], [23.242101149612242, 0.17262991933528657, 0.923883832481188], [55.00947100574639, 0.18585808969128717, 0.915660208752997], [56.675146110179135, 0.11234166124559967, 0.25000000000000006], [69.2691171578803, 0.08784648894613185, 3.850735369457566], [70.5768819934049, 0.12468166434801276, 0.25000000000000006], [71.55127862765005, 0.12503816782698687, 0.25000000000000006], [78.82922565984575, 0.11820797707920015, 0.8968031768006426]], "peak_params_": [[8.676272304207933, 0.2957551821928739, 0.7833056021278227], [9.662715771301945, 0.3337625357797105, 0.5000000000000001], [11.20027286278367, 0.6206644724686505, 1.733230357423009], [16.65525771868191, 0.5454062934536399, 5.639932601745228], [21.004110489841434, 0.3185628920050565, 0.5792711378671572], [23.242101149612242, 0.21026775863992953, 1.847767664962376], [55.00947100574639, 0.18593977916019888, 1.831320417505994], [56.675146110179135, 0.13766078580889207, 0.5000000000000001], [69.2691171578803, 0.08770038726464868, 7.701470738915132], [70.5768819934049, 0.20241250912794229, 0.5000000000000001], [71.55127862765005, 0.1968467932307103, 0.5000000000000001], [78.82922565984575, 0.11969034698710779, 1.7936063536012852]], "r_squared_": 0.984914790310743, "error_": 0.03431176036480426}
{"freq_range": [2.0, 80.0], "freq_res": 0.5, "aperiodic_params_": [-8.540879986442778, 0.6082125428031852], "gaussian_params_": [[9.059199594640221, 0.39003686826543155, 0.49853922355604313], [11.427722260114146, 0.3889538167301116, 0.9433438547692621], [15.81868934767008, 0.33981624133781907, 2.107480425122586], [18.93109883142314, 0.1413800263891624, 0.4111118882203575], [20.98152905573919, 0.12367945813257249, 0.25017410995492867], [22.710175482285216, 0.12336879802852373, 1.6838756605818253], [55.112669221172155, 0.21706353642126816, 0.5027889954261059], [56.89139570883936, 0.17890418171554384, 0.25000000000000006], [68.65455714400564, 0.08196068952980791, 0.4733634423811152], [71.22601795270761, 0.07994663059101201, 5.999999999999967], [71.62390787155832, 0.08702686253671806, 0.8285581447627187]], "peak_params_": [[9.059199594640221, 0.40328983793469675, 0.9970784471120863], [11.427722260114146, 0.42944352682366826, 1.8866877095385242], [15.81868934767008, 0.3386080185341207, 4.214960850245172], [18.93109883142314, 0.25904869132206265, 0.822223776440715], [20.98152905573919, 0.21354874398794976, 0.5003482199098573], [22.710175482285216, 0.12464389364076212, 3.3677513211636505], [55.112669221172155, 0.21374538489477324, 1.0055779908522118], [56.89139570883936, 0.1677933063029453, 0.5000000000000001], [68.65455714400564, 0.1498843430264607, 0.9467268847622304], [71.22601795270761, 0.1454334851176693, 11.999999999999934], [71.62390787155832, 0.1659224675604829, 1.6571162895254374]], "r_squared_": 0.956659561891618, "error_": 0.04367920525811641}
{"freq_range": [2.0, 80.0], "freq_res": 0.5, "aperiodic_params_": [-8.202545681342414, 0.7942480446131907], "gaussian_params_": [[7.9817171258175765, 0.23793838790719268, 0.8207319907802547], [9.08591613795734, 0.3337654564377458, 0.5120038065601494], [11.295333380074508, 0.9822021201866545, 0.7839761991111933], [13.755015977589348, 0.32408284115583175, 1.2350538661667299], [15.812050911379627, 0.18912261359377916, 0.25000000000000006], [18.232417137803168, 0.3309855438017147, 1.624404178010558], [20.929309607815505, 0.15644063649665435, 0.2503113944795287], [21.695740548975145, 0.0881512312179274, 0.2501276723434095], [23.169309600124944, 0.22793886984731637, 1.0155786061138403], [26.2115747811409, 0.1760668086429214, 0.7216145743812027], [43.405113370741, 0.21132763087616435, 0.3263265987357812], [77.52021400379942, 0.1839983893273362, 0.3118699329356889]], "peak_params_": [[7.9817171258175765, 0.27323763209647645, 1.6414639815605094], [9.08591613795734, 0.4530146572468894, 1.0240076131202989], [11.295333380074508, 1.0105865403296228, 1.5679523982223866], [13.755015977589348, 0.3314347341174084, 2.4701077323334597], [15.812050911379627, 0.33340818007170014, 0.5000000000000001], [18.232417137803168, 0.32849730350064554, 3.248808356021116], [20.929309607815505, 0.25298200952924965, 0.5006227889590574], [21.695740548975145, 0.17933755626199321, 0.500255344686819], [23.169309600124944, 0.2292616494551858, 2.0311572122276806], [26.2115747811409, 0.17334931738270143, 1.4432291487624054], [43.405113370741, 0.20258012995514108, 0.6526531974715624], [77.52021400379942, 0.18361230190413913, 0.6237398658713778]], "r_squared_": 0.9819152030464062, "error_": 0.04193024032672869}
{"freq_range": [2.0, 80.0], "freq_res": 0.5, "aperiodic_params_": [-8.40951741682034, 0.6485419378015156], "gaussian_params_": [[8.77977575120319, 0.3463822732709184, 0.4645102502610556], [11.422588731907258, 0.8101500836782899, 0.872421371086271], [16.84277558282384, 0.27098940814470723, 4.643932832853812], [21.220370459057776, 0.18459869580904434, 0.2500000000000037], [34.44270053459828, 0.10901855391369814, 0.4240149870875617], [36.547965394762734, 0.12030753247670088, 5.999999999999999]], "peak_params_": [[8.77977575120319, 0.39181698454999925, 0.9290205005221112], [11.422588731907258, 0.9467950963718863, 1.744842742172542], [16.84277558282384, 0.2714303273281953, 9.287865665707624], [21.220370459057776, 0.31088512122668455, 0.5000000000000074], [34.44270053459828, 0.22172386978271774, 0.8480299741751234], [36.547965394762734, 0.1203393853208663, 11.999999999999998]], "r_squared_": 0.9681249909322096, "error_": 0.04789980944261863}
{"freq_range": [2.0, 80.0], "freq_res": 0.5, "aperiodic_params_": [-8.17863338967295, 0.833476271416598], "gaussian_params_": [[9.269984281039566, 0.26746057309313714, 0.4385173707917935], [10.873914566962256, 0.33173113725766834, 0.4659559748061277], [13.05380660229153, 0.4392246885309246, 1.8706077690745495], [16.71501774538373, 0.1727138354171795, 0.4030798290723523], [19.074432177298686, 0.31424436565615954, 1.9479290100854234], [21.28430082877134, 0.15996332310000566, 0.2500000139617264], [22.785102938650173, 0.20771659369363327, 0.25000082325173467], [24.02515549783492, 0.1477249574078907, 0.33804716934880175], [25.497416351662178, 0.14152948093583145, 0.8592200257450829], [28.82443899951826, 0.13495175383175864, 0.25000000000214534], [30.05197546297478, 0.11027422169010574, 0.6966082995310126], [34.160191510874284, 0.22298362304272915, 0.38671110746003207], [38.93872356744421, 0.10173455400595917, 0.7757197799684861], [55.92723468401118, 0.1395415826286595, 0.3575371203689637], [57.92784027995044, 0.16909970976036662, 0.5099522493576476], [64.60750746568182, 0.09806628297722825, 0.8170542031146643], [68.40791143346597, 0.146343337780385, 0.5023811456841814], [71.60211001519582, 0.12431781339266255, 0.39630614520440416], [75.32798287672138, 0.20582090563943045, 0.25000000000000006], [78.46009115175205, 0.19840065329348436, 0.8637133146657657]], "peak_params_": [[9.269984281039566, 0.30964826735411854, 0.877034741583587], [10.873914566962256, 0.560369915200388, 0.9319119496122554], [13.05380660229153, 0.4414831508574082, 3.741215538149099], [16.71501774538373, 0.36150147472728733, 0.8061596581447046], [19.074432177298686, 0.3168239409297069, 3.895858020170847], [21.28430082877134, 0.2550030825062315, 0.5000000279234528], [22.785102938650173, 0.18836208828605017, 0.5000016465034693], [24.02515549783492, 0.19116367111238652, 0.6760943386976035], [25.497416351662178, 0.1429025510536519, 1.7184400514901659], [28.82443899951826, 0.14075550399336656, 0.5000000000042907], [30.05197546297478, 0.10997003402775007, 1.393216599062025], [34.160191510874284, 0.204649892033542, 0.7734222149200641], [38.93872356744421, 0.10141764221820537, 1.5514395599369721], [55.92723468401118, 0.13681469293825188, 0.7150742407379274], [57.92784027995044, 0.16741521545142213, 1.0199044987152952], [64.60750746568182, 0.09722102975036861, 1.6341084062293285], [68.40791143346597, 0.1439064323463768, 1.0047622913683627], [71.60211001519582, 0.1202590799046348, 0.7926122904088083], [75.32798287672138, 0.1629950454541742, 0.5000000000000001], [78.46009115175205, 0.19818897297651183, 1.7274266293315315]], "r_squared_": 0.9877406088050259, "error_": 0.02980736753145762}
{"freq_range": [2.0, 80.0], "freq_res": 0.5, "aperiodic_params_": [-8.006711781494442, 0.9755106742400735], "gaussian_params_": [[6.736154603179614, 0.20574175139510298, 0.2500143295923642], [10.821982073554674, 0.42040572943048726, 2.047170016882182], [16.648874478988436, 0.4225234619658818, 1.7391936773226624], [19.450753354392432, 0.15105689637090228, 0.5830280386139882], [21.106642792466616, 0.37283429832144516, 0.41523394541079545], [21.73956707934103, 0.14598293366837137, 0.25002712322089093], [22.792686552248387, 0.2471522835102758, 0.6796851529202557], [25.112803439688076, 0.04311149793863772, 0.2500000004779329], [25.398924231421372, 0.23001054292381576, 0.7089213116701101], [61.130173470612306, 0.13134233599165754, 0.47821311884163575], [67.07992944370145, 0.16063775267415772, 0.25000000000000006], [71.05211894502531, 0.16679790844765882, 0.5721021726928007], [72.66156779023592, 0.1236424821922147, 0.25000000000019645], [73.32133466127961, 0.1600481793854307, 0.25000000000042544], [78.08647491823905, 0.1533534901252135, 2.888380225318685]], "peak_params_": [[6.736154603179614, 0.1769691023360931, 0.5000286591847284], [10.821982073554674, 0.42098233923229245, 4.094340033764364], [16.648874478988436, 0.42995701538057496, 3.478387354645325], [19.450753354392432, 0.26100867984121656, 1.1660560772279764], [21.106642792466616, 0.3931114973803904, 0.8304678908215909], [21.73956707934103, 0.3797400894018601, 0.5000542464417819], [22.792686552248387, 0.23721816821859143, 1.3593703058405113], [25.112803439688076, 0.23654034780803634, 0.5000000009558658], [25.398924231421372, 0.2407673321003294, 1.4178426233402202], [61.130173470612306, 0.126565325247034, 0.9564262376832715], [67.07992944370145, 0.15273083341269178, 0.5000000000000001], [71.05211894502531, 0.1736685790705188, 1.1442043453856015], [72.66156779023592, 0.13147269495135738, 0.5000000000003929], [73.32133466127961, 0.16791011428840896, 0.5000000000008509], [78.08647491823905, 0.1532847772774737, 5.77676045063737]], "r_squared_": 0.9868278849117019, "error_": 0.037919438593508895}
{"freq_range": [2.0, 80.0], "freq_res": 0.5, "aperiodic_params_": [-8.131701417762853, 0.9878809419738707], "gaussian_params_": [[8.002004260851205, 0.2300586022700601, 1.1911947002045098], [9.184432557210522, 0.19168367697380675, 0.25000612790907356], [11.19914652143378, 0.6084119735474615, 0.7410373354835683], [12.552903859678857, 0.12300758344260057, 0.2500000000117378], [15.454149378189943, 0.35007128529615883, 1.622676583661273], [17.64284343607043, 0.19073948589814788, 0.5686932105132002], [19.117525880820605, 0.19237587800861297, 0.4406223588783465], [21.019315394732455, 0.1295039331191065, 0.3156169503699812], [21.678717009787484, 0.22830691393552816, 1.9378165169740826], [28.669478313945902, 0.12836432121304292, 0.29022150779877426], [41.142418529627165, 0.1051681279860376, 0.5095077310609062], [42.69736040296271, 0.181008507766582, 0.2500000000000001], [49.8653313459684, 0.13599255251591902, 0.4152803477979761], [55.75359201343277, 0.10265744216316039, 0.8092688169088005], [59.27024381048774, 0.1272840139315542, 0.5823070147254333], [63.48629265375317, 0.14195746562789127, 0.4496452374711859], [64.93964299300947, 0.17700679832456725, 0.31859615761448806], [67.11529988379851, 0.1406975503070965, 0.5553926739551248], [69.23966118188592, 0.19639898866150407, 0.250000001967475], [70.4605750224532, 0.1367306672485306, 0.5100527142292343], [73.31979004522316, 0.12659618218543264, 0.33960865354145386], [74.88465941088488, 0.13108699668171958, 0.2500000000000257], [77.2739827004308, 0.12577389955086732, 3.8219046059167283]], "peak_params_": [[8.002004260851205, 0.23012458781505885, 2.3823894004090196], [9.184432557210522, 0.3155545092420393, 0.5000122558181471], [11.19914652143378, 0.604616149278911, 1.4820746709671366], [12.552903859678857, 0.3175488192896605, 0.5000000000234756], [15.454149378189943, 0.3515045797909, 3.245353167322546], [17.64284343607043, 0.36548651284208766, 1.1373864210264004], [19.117525880820605, 0.3166872995796606, 0.881244717756693], [21.019315394732455, 0.34502455879161076, 0.6312339007399624], [21.678717009787484, 0.2682840029356157, 3.8756330339481653], [28.669478313945902, 0.10870712164844498, 0.5804430155975485], [41.142418529627165, 0.10113882358172255, 1.0190154621218124], [42.69736040296271, 0.13556830645626583, 0.5000000000000002], [49.8653313459684, 0.1290268031803148, 0.8305606955959522], [55.75359201343277, 0.09800743530962919, 1.618537633817601], [59.27024381048774, 0.11775688414813601, 1.1646140294508667], [63.48629265375317, 0.14208821969896235, 0.8992904749423718], [64.93964299300947, 0.1751739973788613, 0.6371923152289761], [67.11529988379851, 0.14108974988882927, 1.1107853479102496], [69.23966118188592, 0.13883058076888766, 0.50000000393495], [70.4605750224532, 0.16247126136935464, 1.0201054284584685], [73.31979004522316, 0.1872128195976046, 0.6792173070829077], [74.88465941088488, 0.22322342493586866, 0.5000000000000514], [77.2739827004308, 0.12555416185972135, 7.643809211833457]], "r_squared_": 0.9926430038189472, "error_": 0.025547709486767715}
{"freq_range": [2.0, 80.0], "freq_res": 0.5, "aperiodic_params_": [-7.9285914543517215, 0.961653448876798], "gaussian_params_": [[7.612245989890948, 0.14945491119235624, 0.25000000000000006], [11.239675493765398, 0.7680649851133713, 0.7680263471816271], [12.775190983696127, 0.16113818449676362, 0.25000000000068334], [13.86926156988782, 0.17278847136904463, 0.2500000000221356], [15.72601729961757, 0.11689225076606528, 4.3566625697994805], [15.73969148425393, 0.08847487154457581, 0.250000000006239], [41.914880329229995, 0.15813908734051424, 1.2709900928436135], [54.5592601574089, 0.1064102115368442, 0.4850866733469028], [56.186651730518285, 0.14686601505255006, 0.25000000000000006], [62.793744410237494, 0.11209179870984924, 5.999999999999996], [64.74455651289486, 0.12335829581536686, 0.25000000000000006], [66.8122434162691, 0.16911280161144315, 0.34935242491007507], [71.66502445514176, 0.19160380423578147, 0.25000000000000006], [73.88119016943007, 0.15133422695309856, 1.0074686915070117], [78.51584644596663, 0.20394970281197083, 1.5883484309694211]], "peak_params_": [[7.612245989890948, 0.15479293307464026, 0.5000000000000001], [11.239675493765398, 0.7964637342738055, 1.5360526943632542], [12.775190983696127, 0.2596152940854033, 0.5000000000013667], [13.86926156988782, 0.25997949546466614, 0.5000000000442713], [15.72601729961757, 0.17260940319584073, 8.713325139598961], [15.73969148425393, 0.17260940319584073, 0.500000000012478], [41.914880329229995, 0.15806123455466015, 2.541980185687227], [54.5592601574089, 0.1487377251087132, 0.9701733466938056], [56.186651730518285, 0.17147836926850246, 0.5000000000000001], [62.793744410237494, 0.11202558857397626, 11.999999999999991], [64.74455651289486, 0.18409926569734836, 0.5000000000000001], [66.8122434162691, 0.23404165177187508, 0.6987048498201501], [71.66502445514176, 0.20248898917784608, 0.5000000000000001], [73.88119016943007, 0.173461247826042, 2.0149373830140234], [78.51584644596663, 0.20758781098536083, 3.1766968619388423]], "r_squared_": 0.9723895557557248, "error_": 0.044661355152661286}
{"freq_range": [2.0, 80.0], "freq_res": 0.5, "aperiodic_params_": [-8.013024569050929, 0.8821419755887688], "gaussian_params_": [[6.512359591354103, 0.13944292762921495, 0.25000000000000006], [11.35372303779166, 0.45425046335078506, 0.7612442163570114], [12.941521077925765, 0.16267850376321866, 5.053357448313743], [13.80812260332348, 0.10020582611652044, 0.25000000000000006], [15.780383065415673, 0.03305644106142311, 0.25000000000000006], [18.006036190911924, 0.06417604335513558, 0.5784692184399776], [24.68941384194767, 0.20982637997042874, 0.25000000000000006], [41.47453812004608, 0.15742777575126626, 0.26126303146047314], [44.15040397279158, 0.18814398487535933, 0.3171953035096228], [48.72303980656151, 0.1318177979399552, 1.4488703170666912], [56.252787673004455, 0.09365571947294725, 1.7854091818357634], [62.10060492236003, 0.15179010139322802, 1.0791233879975224], [64.86070879362862, 0.18345949550611934, 0.5931749538652329], [66.74141924506968, 0.14929404358950457, 0.3912722090747642], [75.54796540086404, 0.1255514849707991, 5.999999999999999]], "peak_params_": [[6.512359591354103, 0.21146570565795564, 0.5000000000000001], [11.35372303779166, 0.6021336259453793, 1.522488432714023], [12.941521077925765, 0.20703184551227238, 10.106714896627485], [13.80812260332348, 0.2348692580202183, 0.5000000000000001], [15.780383065415673, 0.1580834941003033, 0.5000000000000001], [18.006036190911924, 0.16274205030240907, 1.1569384368799551], [24.68941384194767, 0.16936669997968679, 0.5000000000000001], [41.47453812004608, 0.15668249625986874, 0.5225260629209463], [44.15040397279158, 0.1687882783609851, 0.6343906070192455], [48.72303980656151, 0.1302775146906079, 2.8977406341333825], [56.252787673004455, 0.0935759285983, 3.5708183636715267], [62.10060492236003, 0.16147055702671054, 2.1582467759950448], [64.86070879362862, 0.2093612195916812, 1.1863499077304658], [66.74141924506968, 0.16775557272788788, 0.7825444181495284], [75.54796540086404, 0.125547473177253, 11.999999999999998]], "r_squared_": 0.9696317727014534, "error_": 0.042015736482608014}
{"freq_range": [2.0, 80.0], "freq_res": 0.5, "aperiodic_params_": [-8.292231732364387, 0.7207976796792405], "gaussian_params_": [[11.245908011317601, 0.5079529297598883, 0.9067672470193096], [13.649101630911375, 0.10291875589808877, 0.6056700204085337], [17.999577912933656, 0.2807556973973293, 4.434113805986806], [26.16978081479743, 0.05845005300404072, 1.4662212545896076], [26.90351253608355, 0.05070730457562509, 0.25012790929824175], [29.862385885027006, 0.16674247880583656, 0.8743867171449377], [33.797854640818755, 0.1654554541201742, 1.3729298807387227], [37.66886226947438, 0.1605840552691737, 0.25000000000000006], [39.33051144873779, 0.18832161635554132, 0.6487105665599191], [42.41430308693581, 0.13993688173394986, 1.0441079699723248], [46.22479531484907, 0.1120830151767508, 0.9269169413783155], [51.32043812091013, 0.16361533026331623, 0.25000000000000006], [57.296251825360656, 0.13201466565878237, 0.4887880693223231], [60.42154233763448, 0.10241117548663506, 0.25000000000000006], [63.35905095695461, 0.09868800400842392, 0.8673229605400974], [67.9110003594626, 0.13229861204564447, 0.3367856831288174]], "peak_params_": [[11.245908011317601, 0.5703851066199803, 1.813534494038619], [13.649101630911375, 0.29073890917835854, 1.2113400408170674], [17.999577912933656, 0.28075570671849803, 8.868227611973612], [26.16978081479743, 0.1132770103122489, 2.9324425091792152], [26.90351253608355, 0.13343091568914112, 0.5002558185964835], [29.862385885027006, 0.177431844293098, 1.7487734342898753], [33.797854640818755, 0.16409170559089148, 2.7458597614774454], [37.66886226947438, 0.13572727502805115, 0.5000000000000001], [39.33051144873779, 0.18488012207043525, 1.2974211331198382], [42.41430308693581, 0.13950254162172904, 2.0882159399446496], [46.22479531484907, 0.10921941867509233, 1.853833882756631], [51.32043812091013, 0.1264160511136172, 0.5000000000000001], [57.296251825360656, 0.12102942886834889, 0.9775761386446462], [60.42154233763448, 0.09792131292463147, 0.5000000000000001], [63.35905095695461, 0.09739341263060375, 1.7346459210801948], [67.9110003594626, 0.12775889564921172, 0.6735713662576348]], "r_squared_": 0.9822961339991992, "error_": 0.03065868581370562}
{"freq_range": [2.0, 80.0], "freq_res": 0.5, "aperiodic_params_": [-7.8967085075044, 0.8881744437281353], "gaussian_params_": [[10.27398270030863, 0.1508628343694947, 2.702360332227782], [11.137729585549666, 0.20825874320020887, 0.6439772044331703], [13.596644522171081, 0.16941766146362833, 0.2626547476484217], [14.681815331796935, 0.20527510110567432, 0.26811329453339555], [15.969353061553177, 0.1836298385747114, 0.506718102613602], [17.421490242926765, 0.1773897375207892, 0.25000058937923914], [18.54965835922216, 0.21210047973504653, 0.7840244266073437], [22.047965360514915, 0.052744333890711974, 1.6968434494909428], [25.514227220856768, 0.1531033654579234, 0.4038396324888765], [39.45784863393285, 0.15929545811380097, 0.2967194575540438], [45.713533527177994, 0.1275674196708105, 0.7821676484956834], [61.64163624651298, 0.05600165082452255, 5.07954175224187], [65.3468871572637, 0.13101233179438068, 0.6057972935431225], [68.06232665648794, 0.12868287352597685, 1.0431782169822157], [70.85499652254974, 0.156787421892415, 0.4973377491827476], [72.867508654683, 0.20196621376290377, 0.5980910747061083], [75.25063787408432, 0.13339836966262686, 0.5678161444383275], [79.27398270043201, 0.13403759930783032, 1.1662800099717447]], "peak_params_": [[10.27398270030863, 0.27787683909100913, 5.404720664455564], [11.137729585549666, 0.34906511683848684, 1.2879544088663406], [13.596644522171081, 0.23257342807458414, 0.5253094952968435], [14.681815331796935, 0.21072802162506044, 0.5362265890667911], [15.969353061553177, 0.20044193903431307, 1.013436205227204], [17.421490242926765, 0.26301230675097464, 0.5000011787584783], [18.54965835922216, 0.21908629899316523, 1.5680488532146875], [22.047965360514915, 0.052748782968210506, 3.3936868989818856], [25.514227220856768, 0.1596682265152225, 0.807679264977753], [39.45784863393285, 0.15770040183091005, 0.5934389151080876], [45.713533527177994, 0.12326033863580932, 1.5643352969913669], [61.64163624651298, 0.05597988500439044, 10.15908350448374], [65.3468871572637, 0.17516238299803355, 1.211594587086245], [68.06232665648794, 0.1540454324618139, 2.0863564339644314], [70.85499652254974, 0.16450557103708263, 0.9946754983654952], [72.867508654683, 0.20173542384099363, 1.1961821494122167], [75.25063787408432, 0.12321635676806864, 1.135632288876655], [79.27398270043201, 0.13166005636326616, 2.3325600199434895]], "r_squared_": 0.9825364044925395, "error_": 0.03439049374275152}
{"freq_range": [2.0, 80.0], "freq_res": 0.5, "aperiodic_params_": [-8.07721206106643, 0.8896102757919709], "gaussian_params_": [[5.933769286182794, 0.23365524885852185, 1.0935272630055415], [7.744821235958982, 0.36068146088035274, 0.25000000000000006], [9.064367631458984, 0.2833831530834199, 0.5082255842923292], [11.086136335638999, 0.746938130559957, 0.7037364784884135], [12.27487401095226, 0.2868740493873992, 0.25000000000000006], [13.703003994085329, 0.27791731796018593, 0.6406260199862913], [15.45146529583969, 0.19179625370983086, 0.5319833018072422], [17.945604997231786, 0.2639438263797166, 1.0650626728171508], [22.605617601528323, 0.10817540221946866, 0.7127315230161967], [42.220937456210585, 0.12025566671543772, 0.9011290456375711], [46.38706684525255, 0.1649867846975908, 0.29190755839284344], [48.18163492679544, 0.17844883629390848, 0.25000000000000006], [54.82617547116745, 0.1660256307053032, 0.25000000000000006], [58.7915462658433, 0.09015967456649807, 2.708451966291533], [65.04051733735936, 0.18067024132651482, 0.4992630098315066], [66.14787546736069, 0.23402457374611663, 0.25000000000000033], [67.23136368868659, 0.22040859812623323, 0.25000000000000006], [68.3004560186139, 0.18018945115504773, 0.25000000000000006], [70.74554384059378, 0.1424494531367482, 0.3765403079767456], [72.56495040662355, 0.09998467957542027, 0.25000000000000006], [77.09535542037634, 0.13861081943005862, 5.836576073085967]], "peak_params_": [[5.933769286182794, 0.2332270916165271, 2.187054526011083], [7.744821235958982, 0.30955576414230457, 0.5000000000000001], [9.064367631458984, 0.2949330837879014, 1.0164511685846584], [11.086136335638999, 0.741608243756394, 1.407472956976827], [12.27487401095226, 0.3381785061390836, 0.5000000000000001], [13.703003994085329, 0.26666493551553927, 1.2812520399725826], [15.45146529583969, 0.2153416803592556, 1.0639666036144844], [17.945604997231786, 0.2636018124879733, 2.1301253456343017], [22.605617601528323, 0.10702240245427319, 1.4254630460323934], [42.220937456210585, 0.1166950132759279, 1.8022580912751422], [46.38706684525255, 0.153094926969235, 0.5838151167856869], [48.18163492679544, 0.137086366291177, 0.5000000000000001], [54.82617547116745, 0.16432602055181889, 0.5000000000000001], [58.7915462658433, 0.09102689572874034, 5.416903932583066], [65.04051733735936, 0.20278894782421908, 0.9985260196630132], [66.14787546736069, 0.25033624470605886, 0.5000000000000007], [67.23136368868659, 0.1763844633851992, 0.5000000000000001], [68.3004560186139, 0.17804793024519938, 0.5000000000000001], [70.74554384059378, 0.18837444827920713, 0.7530806159534912], [72.56495040662355, 0.19833840018879734, 0.5000000000000001], [77.09535542037634, 0.13859232196139537, 11.673152146171933]], "r_squared_": 0.9848859227714597, "error_": 0.031621159881276124}
