/home/mpib/kosciessa/.virtualenvs/fooof/lib/python3.7/site-packages/fooof/objs/group.py:379: VisibleDeprecationWarning: Creating an ndarray from ragged nested sequences (which is a list-or-tuple of lists-or-tuples-or ndarrays with different lengths or shapes) is deprecated. If you meant to do this, you must specify 'dtype=object' when creating the ndarray.
  for index, data in enumerate(self.group_results)])
/home/mpib/kosciessa/.virtualenvs/fooof/lib/python3.7/site-packages/fooof/objs/group.py:379: VisibleDeprecationWarning: Creating an ndarray from ragged nested sequences (which is a list-or-tuple of lists-or-tuples-or ndarrays with different lengths or shapes) is deprecated. If you meant to do this, you must specify 'dtype=object' when creating the ndarray.
  for index, data in enumerate(self.group_results)])
/home/mpib/kosciessa/.virtualenvs/fooof/lib/python3.7/site-packages/fooof/objs/group.py:379: VisibleDeprecationWarning: Creating an ndarray from ragged nested sequences (which is a list-or-tuple of lists-or-tuples-or ndarrays with different lengths or shapes) is deprecated. If you meant to do this, you must specify 'dtype=object' when creating the ndarray.
  for index, data in enumerate(self.group_results)])
/home/mpib/kosciessa/.virtualenvs/fooof/lib/python3.7/site-packages/fooof/objs/group.py:379: VisibleDeprecationWarning: Creating an ndarray from ragged nested sequences (which is a list-or-tuple of lists-or-tuples-or ndarrays with different lengths or shapes) is deprecated. If you meant to do this, you must specify 'dtype=object' when creating the ndarray.
  for index, data in enumerate(self.group_results)])
b_runFOOOF.py
/home/mpib/LNDG/stateswitch/stsw_eeg_task/aperiodic_fooof
2206
Setting up paths ...

Loading backgrounds from .mat ...

Running FOOOFGroup across 60 power spectra.

FOOOF WARNING: Lower-bound peak width limit is < or ~= the frequency resolution: 0.50 <= 0.50
	Lower bounds below frequency-resolution have no effect (effective lower bound is the frequency resolution).
	Too low a limit may lead to overfitting noise as small bandwidth peaks.
	We recommend a lower bound of approximately 2x the frequency resolution.

==================================================================================================
                                                                                                  
                                       FOOOF - GROUP RESULTS                                      
                                                                                                  
                             Number of power spectra in the Group: 60                             
                                                                                                  
                        The model was run on the frequency range 2 - 80 Hz                        
                                 Frequency Resolution is 0.50 Hz                                  
                                                                                                  
                              Power spectra were fit without a knee.                              
                                                                                                  
                                      Aperiodic Fit Values:                                       
                        Exponents - Min:  0.421, Max:  1.169, Mean: 0.865                         
                                                                                                  
                        In total 1103 peaks were extracted from the group                         
                                                                                                  
                                     Goodness of fit metrics:                                     
                            R2s -  Min:  0.921, Max:  0.993, Mean: 0.978                          
                         Errors -  Min:  0.021, Max:  0.046, Mean: 0.032                          
                                                                                                  
==================================================================================================
Running FOOOFGroup across 60 power spectra.

FOOOF WARNING: Lower-bound peak width limit is < or ~= the frequency resolution: 0.50 <= 0.50
	Lower bounds below frequency-resolution have no effect (effective lower bound is the frequency resolution).
	Too low a limit may lead to overfitting noise as small bandwidth peaks.
	We recommend a lower bound of approximately 2x the frequency resolution.

==================================================================================================
                                                                                                  
                                       FOOOF - GROUP RESULTS                                      
                                                                                                  
                             Number of power spectra in the Group: 60                             
                                                                                                  
                        The model was run on the frequency range 2 - 80 Hz                        
                                 Frequency Resolution is 0.50 Hz                                  
                                                                                                  
                              Power spectra were fit without a knee.                              
                                                                                                  
                                      Aperiodic Fit Values:                                       
                        Exponents - Min:  0.355, Max:  1.147, Mean: 0.833                         
                                                                                                  
                        In total 1130 peaks were extracted from the group                         
                                                                                                  
                                     Goodness of fit metrics:                                     
                            R2s -  Min:  0.878, Max:  0.991, Mean: 0.974                          
                         Errors -  Min:  0.024, Max:  0.048, Mean: 0.033                          
                                                                                                  
==================================================================================================
Running FOOOFGroup across 60 power spectra.

FOOOF WARNING: Lower-bound peak width limit is < or ~= the frequency resolution: 0.50 <= 0.50
	Lower bounds below frequency-resolution have no effect (effective lower bound is the frequency resolution).
	Too low a limit may lead to overfitting noise as small bandwidth peaks.
	We recommend a lower bound of approximately 2x the frequency resolution.

==================================================================================================
                                                                                                  
                                       FOOOF - GROUP RESULTS                                      
                                                                                                  
                             Number of power spectra in the Group: 60                             
                                                                                                  
                        The model was run on the frequency range 2 - 80 Hz                        
                                 Frequency Resolution is 0.50 Hz                                  
                                                                                                  
                              Power spectra were fit without a knee.                              
                                                                                                  
                                      Aperiodic Fit Values:                                       
                        Exponents - Min:  0.412, Max:  1.256, Mean: 0.858                         
                                                                                                  
                        In total 1158 peaks were extracted from the group                         
                                                                                                  
                                     Goodness of fit metrics:                                     
                            R2s -  Min:  0.880, Max:  0.991, Mean: 0.974                          
                         Errors -  Min:  0.024, Max:  0.051, Mean: 0.033                          
                                                                                                  
==================================================================================================
Running FOOOFGroup across 60 power spectra.

FOOOF WARNING: Lower-bound peak width limit is < or ~= the frequency resolution: 0.50 <= 0.50
	Lower bounds below frequency-resolution have no effect (effective lower bound is the frequency resolution).
	Too low a limit may lead to overfitting noise as small bandwidth peaks.
	We recommend a lower bound of approximately 2x the frequency resolution.

==================================================================================================
                                                                                                  
                                       FOOOF - GROUP RESULTS                                      
                                                                                                  
                             Number of power spectra in the Group: 60                             
                                                                                                  
                        The model was run on the frequency range 2 - 80 Hz                        
                                 Frequency Resolution is 0.50 Hz                                  
                                                                                                  
                              Power spectra were fit without a knee.                              
                                                                                                  
                                      Aperiodic Fit Values:                                       
                        Exponents - Min:  0.343, Max:  1.168, Mean: 0.840                         
                                                                                                  
                        In total 1110 peaks were extracted from the group                         
                                                                                                  
                                     Goodness of fit metrics:                                     
                            R2s -  Min:  0.869, Max:  0.994, Mean: 0.972                          
                         Errors -  Min:  0.022, Max:  0.051, Mean: 0.033                          
                                                                                                  
==================================================================================================
2206Done!
