/home/mpib/kosciessa/.virtualenvs/fooof/lib/python3.7/site-packages/fooof/objs/group.py:379: VisibleDeprecationWarning: Creating an ndarray from ragged nested sequences (which is a list-or-tuple of lists-or-tuples-or ndarrays with different lengths or shapes) is deprecated. If you meant to do this, you must specify 'dtype=object' when creating the ndarray.
  for index, data in enumerate(self.group_results)])
/home/mpib/kosciessa/.virtualenvs/fooof/lib/python3.7/site-packages/fooof/objs/group.py:379: VisibleDeprecationWarning: Creating an ndarray from ragged nested sequences (which is a list-or-tuple of lists-or-tuples-or ndarrays with different lengths or shapes) is deprecated. If you meant to do this, you must specify 'dtype=object' when creating the ndarray.
  for index, data in enumerate(self.group_results)])
/home/mpib/kosciessa/.virtualenvs/fooof/lib/python3.7/site-packages/fooof/objs/group.py:379: VisibleDeprecationWarning: Creating an ndarray from ragged nested sequences (which is a list-or-tuple of lists-or-tuples-or ndarrays with different lengths or shapes) is deprecated. If you meant to do this, you must specify 'dtype=object' when creating the ndarray.
  for index, data in enumerate(self.group_results)])
/home/mpib/kosciessa/.virtualenvs/fooof/lib/python3.7/site-packages/fooof/objs/group.py:379: VisibleDeprecationWarning: Creating an ndarray from ragged nested sequences (which is a list-or-tuple of lists-or-tuples-or ndarrays with different lengths or shapes) is deprecated. If you meant to do this, you must specify 'dtype=object' when creating the ndarray.
  for index, data in enumerate(self.group_results)])
b_runFOOOF.py
/home/mpib/LNDG/stateswitch/stsw_eeg_task/aperiodic_fooof
1237
Setting up paths ...

Loading backgrounds from .mat ...

Running FOOOFGroup across 60 power spectra.

FOOOF WARNING: Lower-bound peak width limit is < or ~= the frequency resolution: 0.50 <= 0.50
	Lower bounds below frequency-resolution have no effect (effective lower bound is the frequency resolution).
	Too low a limit may lead to overfitting noise as small bandwidth peaks.
	We recommend a lower bound of approximately 2x the frequency resolution.

==================================================================================================
                                                                                                  
                                       FOOOF - GROUP RESULTS                                      
                                                                                                  
                             Number of power spectra in the Group: 60                             
                                                                                                  
                        The model was run on the frequency range 2 - 80 Hz                        
                                 Frequency Resolution is 0.50 Hz                                  
                                                                                                  
                              Power spectra were fit without a knee.                              
                                                                                                  
                                      Aperiodic Fit Values:                                       
                        Exponents - Min:  0.034, Max:  1.695, Mean: 1.118                         
                                                                                                  
                         In total 867 peaks were extracted from the group                         
                                                                                                  
                                     Goodness of fit metrics:                                     
                            R2s -  Min:  0.867, Max:  0.995, Mean: 0.977                          
                         Errors -  Min:  0.024, Max:  0.055, Mean: 0.039                          
                                                                                                  
==================================================================================================
Running FOOOFGroup across 60 power spectra.

FOOOF WARNING: Lower-bound peak width limit is < or ~= the frequency resolution: 0.50 <= 0.50
	Lower bounds below frequency-resolution have no effect (effective lower bound is the frequency resolution).
	Too low a limit may lead to overfitting noise as small bandwidth peaks.
	We recommend a lower bound of approximately 2x the frequency resolution.

==================================================================================================
                                                                                                  
                                       FOOOF - GROUP RESULTS                                      
                                                                                                  
                             Number of power spectra in the Group: 60                             
                                                                                                  
                        The model was run on the frequency range 2 - 80 Hz                        
                                 Frequency Resolution is 0.50 Hz                                  
                                                                                                  
                              Power spectra were fit without a knee.                              
                                                                                                  
                                      Aperiodic Fit Values:                                       
                        Exponents - Min:  0.151, Max:  1.654, Mean: 1.016                         
                                                                                                  
                         In total 962 peaks were extracted from the group                         
                                                                                                  
                                     Goodness of fit metrics:                                     
                            R2s -  Min:  0.719, Max:  0.995, Mean: 0.958                          
                         Errors -  Min:  0.024, Max:  0.104, Mean: 0.042                          
                                                                                                  
==================================================================================================
Running FOOOFGroup across 60 power spectra.

FOOOF WARNING: Lower-bound peak width limit is < or ~= the frequency resolution: 0.50 <= 0.50
	Lower bounds below frequency-resolution have no effect (effective lower bound is the frequency resolution).
	Too low a limit may lead to overfitting noise as small bandwidth peaks.
	We recommend a lower bound of approximately 2x the frequency resolution.

==================================================================================================
                                                                                                  
                                       FOOOF - GROUP RESULTS                                      
                                                                                                  
                             Number of power spectra in the Group: 60                             
                                                                                                  
                        The model was run on the frequency range 2 - 80 Hz                        
                                 Frequency Resolution is 0.50 Hz                                  
                                                                                                  
                              Power spectra were fit without a knee.                              
                                                                                                  
                                      Aperiodic Fit Values:                                       
                        Exponents - Min:  0.042, Max:  1.667, Mean: 1.024                         
                                                                                                  
                         In total 970 peaks were extracted from the group                         
                                                                                                  
                                     Goodness of fit metrics:                                     
                            R2s -  Min:  0.731, Max:  0.996, Mean: 0.965                          
                         Errors -  Min:  0.018, Max:  0.081, Mean: 0.040                          
                                                                                                  
==================================================================================================
Running FOOOFGroup across 60 power spectra.

FOOOF WARNING: Lower-bound peak width limit is < or ~= the frequency resolution: 0.50 <= 0.50
	Lower bounds below frequency-resolution have no effect (effective lower bound is the frequency resolution).
	Too low a limit may lead to overfitting noise as small bandwidth peaks.
	We recommend a lower bound of approximately 2x the frequency resolution.

==================================================================================================
                                                                                                  
                                       FOOOF - GROUP RESULTS                                      
                                                                                                  
                             Number of power spectra in the Group: 60                             
                                                                                                  
                        The model was run on the frequency range 2 - 80 Hz                        
                                 Frequency Resolution is 0.50 Hz                                  
                                                                                                  
                              Power spectra were fit without a knee.                              
                                                                                                  
                                      Aperiodic Fit Values:                                       
                        Exponents - Min:  0.024, Max:  1.697, Mean: 1.045                         
                                                                                                  
                         In total 942 peaks were extracted from the group                         
                                                                                                  
                                     Goodness of fit metrics:                                     
                            R2s -  Min:  0.688, Max:  0.996, Mean: 0.966                          
                         Errors -  Min:  0.023, Max:  0.076, Mean: 0.041                          
                                                                                                  
==================================================================================================
1237Done!
