%!PS-Adobe-3.0 EPSF-3.0
%%Creator: (MATLAB, The Mathworks, Inc. Version 9.3.0.713579 \(R2017b\). Operating System: Mac OS X)
%%Title: /Volumes/LNDG/Projects/StateSwitch/dynamic/data/eeg/rest/B_analyses/F_periRhythmMSE/C_figures/Z_schematicAlphaOnOffset.eps
%%CreationDate: 2020-04-21T13:05:29
%%Pages: (atend)
%%BoundingBox:    66    16   465   133
%%LanguageLevel: 3
%%EndComments
%%BeginProlog
%%BeginResource: procset (Apache XML Graphics Std ProcSet) 1.2 0
%%Version: 1.2 0
%%Copyright: (Copyright 2001-2003,2010 The Apache Software Foundation. License terms: http://www.apache.org/licenses/LICENSE-2.0)
/bd{bind def}bind def
/ld{load def}bd
/GR/grestore ld
/GS/gsave ld
/RM/rmoveto ld
/C/curveto ld
/t/show ld
/L/lineto ld
/ML/setmiterlimit ld
/CT/concat ld
/f/fill ld
/N/newpath ld
/S/stroke ld
/CC/setcmykcolor ld
/A/ashow ld
/cp/closepath ld
/RC/setrgbcolor ld
/LJ/setlinejoin ld
/GC/setgray ld
/LW/setlinewidth ld
/M/moveto ld
/re {4 2 roll M
1 index 0 rlineto
0 exch rlineto
neg 0 rlineto
cp } bd
/_ctm matrix def
/_tm matrix def
/BT { _ctm currentmatrix pop matrix _tm copy pop 0 0 moveto } bd
/ET { _ctm setmatrix } bd
/iTm { _ctm setmatrix _tm concat } bd
/Tm { _tm astore pop iTm 0 0 moveto } bd
/ux 0.0 def
/uy 0.0 def
/F {
  /Tp exch def
  /Tf exch def
  Tf findfont Tp scalefont setfont
  /cf Tf def  /cs Tp def
} bd
/ULS {currentpoint /uy exch def /ux exch def} bd
/ULE {
  /Tcx currentpoint pop def
  gsave
  newpath
  cf findfont cs scalefont dup
  /FontMatrix get 0 get /Ts exch def /FontInfo get dup
  /UnderlinePosition get Ts mul /To exch def
  /UnderlineThickness get Ts mul /Tt exch def
  ux uy To add moveto  Tcx uy To add lineto
  Tt setlinewidth stroke
  grestore
} bd
/OLE {
  /Tcx currentpoint pop def
  gsave
  newpath
  cf findfont cs scalefont dup
  /FontMatrix get 0 get /Ts exch def /FontInfo get dup
  /UnderlinePosition get Ts mul /To exch def
  /UnderlineThickness get Ts mul /Tt exch def
  ux uy To add cs add moveto Tcx uy To add cs add lineto
  Tt setlinewidth stroke
  grestore
} bd
/SOE {
  /Tcx currentpoint pop def
  gsave
  newpath
  cf findfont cs scalefont dup
  /FontMatrix get 0 get /Ts exch def /FontInfo get dup
  /UnderlinePosition get Ts mul /To exch def
  /UnderlineThickness get Ts mul /Tt exch def
  ux uy To add cs 10 mul 26 idiv add moveto Tcx uy To add cs 10 mul 26 idiv add lineto
  Tt setlinewidth stroke
  grestore
} bd
/QT {
/Y22 exch store
/X22 exch store
/Y21 exch store
/X21 exch store
currentpoint
/Y21 load 2 mul add 3 div exch
/X21 load 2 mul add 3 div exch
/X21 load 2 mul /X22 load add 3 div
/Y21 load 2 mul /Y22 load add 3 div
/X22 load /Y22 load curveto
} bd
/SSPD {
dup length /d exch dict def
{
/v exch def
/k exch def
currentpagedevice k known {
/cpdv currentpagedevice k get def
v cpdv ne {
/upd false def
/nullv v type /nulltype eq def
/nullcpdv cpdv type /nulltype eq def
nullv nullcpdv or
{
/upd true def
} {
/sametype v type cpdv type eq def
sametype {
v type /arraytype eq {
/vlen v length def
/cpdvlen cpdv length def
vlen cpdvlen eq {
0 1 vlen 1 sub {
/i exch def
/obj v i get def
/cpdobj cpdv i get def
obj cpdobj ne {
/upd true def
exit
} if
} for
} {
/upd true def
} ifelse
} {
v type /dicttype eq {
v {
/dv exch def
/dk exch def
/cpddv cpdv dk get def
dv cpddv ne {
/upd true def
exit
} if
} forall
} {
/upd true def
} ifelse
} ifelse
} if
} ifelse
upd true eq {
d k v put
} if
} if
} if
} forall
d length 0 gt {
d setpagedevice
} if
} bd
/RE { % /NewFontName [NewEncodingArray] /FontName RE -
  findfont dup length dict begin
  {
    1 index /FID ne
    {def} {pop pop} ifelse
  } forall
  /Encoding exch def
  /FontName 1 index def
  currentdict definefont pop
  end
} bind def
%%EndResource
%%BeginResource: procset (Apache XML Graphics EPS ProcSet) 1.0 0
%%Version: 1.0 0
%%Copyright: (Copyright 2002-2003 The Apache Software Foundation. License terms: http://www.apache.org/licenses/LICENSE-2.0)
/BeginEPSF { %def
/b4_Inc_state save def         % Save state for cleanup
/dict_count countdictstack def % Count objects on dict stack
/op_count count 1 sub def      % Count objects on operand stack
userdict begin                 % Push userdict on dict stack
/showpage { } def              % Redefine showpage, { } = null proc
0 setgray 0 setlinecap         % Prepare graphics state
1 setlinewidth 0 setlinejoin
10 setmiterlimit [ ] 0 setdash newpath
/languagelevel where           % If level not equal to 1 then
{pop languagelevel             % set strokeadjust and
1 ne                           % overprint to their defaults.
{false setstrokeadjust false setoverprint
} if
} if
} bd
/EndEPSF { %def
count op_count sub {pop} repeat            % Clean up stacks
countdictstack dict_count sub {end} repeat
b4_Inc_state restore
} bd
%%EndResource
%FOPBeginFontDict
%%IncludeResource: font Courier-Oblique
%%IncludeResource: font Courier-BoldOblique
%%IncludeResource: font Courier-Bold
%%IncludeResource: font ZapfDingbats
%%IncludeResource: font Symbol
%%IncludeResource: font Helvetica
%%IncludeResource: font Helvetica-Oblique
%%IncludeResource: font Helvetica-Bold
%%IncludeResource: font Helvetica-BoldOblique
%%IncludeResource: font Times-Roman
%%IncludeResource: font Times-Italic
%%IncludeResource: font Times-Bold
%%IncludeResource: font Times-BoldItalic
%%IncludeResource: font Courier
%FOPEndFontDict
%%BeginResource: encoding WinAnsiEncoding
/WinAnsiEncoding [
/.notdef /.notdef /.notdef /.notdef /.notdef
/.notdef /.notdef /.notdef /.notdef /.notdef
/.notdef /.notdef /.notdef /.notdef /.notdef
/.notdef /.notdef /.notdef /.notdef /.notdef
/.notdef /.notdef /.notdef /.notdef /.notdef
/.notdef /.notdef /.notdef /.notdef /.notdef
/.notdef /.notdef /space /exclam /quotedbl
/numbersign /dollar /percent /ampersand /quotesingle
/parenleft /parenright /asterisk /plus /comma
/hyphen /period /slash /zero /one
/two /three /four /five /six
/seven /eight /nine /colon /semicolon
/less /equal /greater /question /at
/A /B /C /D /E
/F /G /H /I /J
/K /L /M /N /O
/P /Q /R /S /T
/U /V /W /X /Y
/Z /bracketleft /backslash /bracketright /asciicircum
/underscore /quoteleft /a /b /c
/d /e /f /g /h
/i /j /k /l /m
/n /o /p /q /r
/s /t /u /v /w
/x /y /z /braceleft /bar
/braceright /asciitilde /bullet /Euro /bullet
/quotesinglbase /florin /quotedblbase /ellipsis /dagger
/daggerdbl /circumflex /perthousand /Scaron /guilsinglleft
/OE /bullet /Zcaron /bullet /bullet
/quoteleft /quoteright /quotedblleft /quotedblright /bullet
/endash /emdash /asciitilde /trademark /scaron
/guilsinglright /oe /bullet /zcaron /Ydieresis
/space /exclamdown /cent /sterling /currency
/yen /brokenbar /section /dieresis /copyright
/ordfeminine /guillemotleft /logicalnot /sfthyphen /registered
/macron /degree /plusminus /twosuperior /threesuperior
/acute /mu /paragraph /middot /cedilla
/onesuperior /ordmasculine /guillemotright /onequarter /onehalf
/threequarters /questiondown /Agrave /Aacute /Acircumflex
/Atilde /Adieresis /Aring /AE /Ccedilla
/Egrave /Eacute /Ecircumflex /Edieresis /Igrave
/Iacute /Icircumflex /Idieresis /Eth /Ntilde
/Ograve /Oacute /Ocircumflex /Otilde /Odieresis
/multiply /Oslash /Ugrave /Uacute /Ucircumflex
/Udieresis /Yacute /Thorn /germandbls /agrave
/aacute /acircumflex /atilde /adieresis /aring
/ae /ccedilla /egrave /eacute /ecircumflex
/edieresis /igrave /iacute /icircumflex /idieresis
/eth /ntilde /ograve /oacute /ocircumflex
/otilde /odieresis /divide /oslash /ugrave
/uacute /ucircumflex /udieresis /yacute /thorn
/ydieresis
] def
%%EndResource
%FOPBeginFontReencode
/Courier-Oblique findfont
dup length dict begin
  {1 index /FID ne {def} {pop pop} ifelse} forall
  /Encoding WinAnsiEncoding def
  currentdict
end
/Courier-Oblique exch definefont pop
/Courier-BoldOblique findfont
dup length dict begin
  {1 index /FID ne {def} {pop pop} ifelse} forall
  /Encoding WinAnsiEncoding def
  currentdict
end
/Courier-BoldOblique exch definefont pop
/Courier-Bold findfont
dup length dict begin
  {1 index /FID ne {def} {pop pop} ifelse} forall
  /Encoding WinAnsiEncoding def
  currentdict
end
/Courier-Bold exch definefont pop
/Helvetica findfont
dup length dict begin
  {1 index /FID ne {def} {pop pop} ifelse} forall
  /Encoding WinAnsiEncoding def
  currentdict
end
/Helvetica exch definefont pop
/Helvetica-Oblique findfont
dup length dict begin
  {1 index /FID ne {def} {pop pop} ifelse} forall
  /Encoding WinAnsiEncoding def
  currentdict
end
/Helvetica-Oblique exch definefont pop
/Helvetica-Bold findfont
dup length dict begin
  {1 index /FID ne {def} {pop pop} ifelse} forall
  /Encoding WinAnsiEncoding def
  currentdict
end
/Helvetica-Bold exch definefont pop
/Helvetica-BoldOblique findfont
dup length dict begin
  {1 index /FID ne {def} {pop pop} ifelse} forall
  /Encoding WinAnsiEncoding def
  currentdict
end
/Helvetica-BoldOblique exch definefont pop
/Times-Roman findfont
dup length dict begin
  {1 index /FID ne {def} {pop pop} ifelse} forall
  /Encoding WinAnsiEncoding def
  currentdict
end
/Times-Roman exch definefont pop
/Times-Italic findfont
dup length dict begin
  {1 index /FID ne {def} {pop pop} ifelse} forall
  /Encoding WinAnsiEncoding def
  currentdict
end
/Times-Italic exch definefont pop
/Times-Bold findfont
dup length dict begin
  {1 index /FID ne {def} {pop pop} ifelse} forall
  /Encoding WinAnsiEncoding def
  currentdict
end
/Times-Bold exch definefont pop
/Times-BoldItalic findfont
dup length dict begin
  {1 index /FID ne {def} {pop pop} ifelse} forall
  /Encoding WinAnsiEncoding def
  currentdict
end
/Times-BoldItalic exch definefont pop
/Courier findfont
dup length dict begin
  {1 index /FID ne {def} {pop pop} ifelse} forall
  /Encoding WinAnsiEncoding def
  currentdict
end
/Courier exch definefont pop
%FOPEndFontReencode
%%EndProlog
%%Page: 1 1
%%PageBoundingBox: 0 0 512 144
%%BeginPageSetup
[1 0 0 -1 0 144] CT
%%EndPageSetup
GS
1 GC
N
0 0 512 144 re
f
GR
GS
1 GC
N
0 0 512 144 re
f
GR
GS
1 LJ
2 LW
N
67.634 64.295 M
68.769 52.701 L
69.903 56.21 L
71.037 55.879 L
72.171 42.345 L
73.306 38.019 L
74.44 49.31 L
75.574 53.695 L
76.709 45.611 L
77.843 45.307 L
78.977 57.527 L
80.111 61.756 L
81.246 49.321 L
82.38 38.311 L
83.514 44.347 L
84.649 60.372 L
85.783 70.206 L
86.917 67.591 L
88.051 61.011 L
89.186 63.067 L
90.32 73.436 L
91.454 79.286 L
92.589 75.36 L
93.723 70.162 L
94.857 68.335 L
95.991 63.775 L
97.126 55.623 L
98.26 52.637 L
99.394 56.966 L
100.529 60.813 L
101.663 59.252 L
102.797 54.081 L
103.931 50.561 L
105.066 55.038 L
106.2 67.024 L
107.334 74.703 L
108.469 67.871 L
109.603 53.512 L
110.737 48.412 L
111.871 55.397 L
113.006 59.804 L
114.14 53.789 L
115.274 48.263 L
116.409 53.513 L
117.543 61.904 L
118.677 60.927 L
119.811 55.659 L
120.946 60.08 L
122.08 69.543 L
123.214 68.503 L
124.349 60.872 L
125.483 61.272 L
126.617 66.863 L
127.751 67.781 L
128.886 67.503 L
130.02 70.009 L
131.154 69.308 L
132.289 64.241 L
133.423 62.417 L
134.557 67.67 L
135.691 77.518 L
136.826 86.185 L
137.96 87.103 L
139.094 82.62 L
140.229 81.958 L
141.363 84.409 L
142.497 83.78 L
143.631 82.472 L
144.766 82.087 L
145.9 79.453 L
147.034 77.835 L
148.169 80.001 L
149.303 81.726 L
150.437 83.659 L
151.571 87.654 L
152.706 86.353 L
153.84 79.144 L
154.974 80.322 L
156.109 91.986 L
157.243 94.544 L
158.377 81.452 L
159.511 72.777 L
160.646 77.583 L
161.78 78.36 L
162.914 68.695 L
164.049 66.005 L
165.183 73.412 L
166.317 73.649 L
167.451 67.663 L
168.586 70.724 L
169.72 75.914 L
170.854 69.864 L
171.989 62.509 L
173.123 64.008 L
174.257 66.844 L
175.391 66.356 L
176.526 65.335 L
177.66 64.372 L
178.794 66.308 L
179.929 73.487 L
S
GR
GS
1 LJ
2 LW
N
351.206 56.433 M
352.34 46.01 L
353.474 39.114 L
354.609 41.894 L
355.743 45.638 L
356.877 48.67 L
358.011 52.745 L
359.146 52.007 L
360.28 52.765 L
361.414 65.759 L
362.549 73.504 L
363.683 58.206 L
364.817 39.66 L
365.951 37.644 L
367.086 41.542 L
368.22 42.079 L
369.354 40.412 L
370.489 33.167 L
371.623 28.946 L
372.757 42.79 L
373.891 61.728 L
375.026 64.514 L
376.16 57.825 L
377.294 55.01 L
378.429 54.771 L
379.563 55.381 L
380.697 56.176 L
381.831 52.746 L
382.966 48.077 L
384.1 48.879 L
385.234 52.448 L
386.369 56.059 L
387.503 63.39 L
388.637 69.798 L
389.771 63.903 L
390.906 49.482 L
392.04 43.994 L
393.174 52.217 L
394.309 58.995 L
395.443 52.539 L
396.577 41.742 L
397.711 41.959 L
398.846 51.83 L
399.98 58.276 L
401.114 59.353 L
402.249 61.77 L
403.383 61.811 L
404.517 51.383 L
405.651 36.551 L
406.786 33.955 L
407.92 50.02 L
409.054 70.889 L
410.189 80.268 L
411.323 78.729 L
412.457 73.898 L
413.591 69.624 L
414.726 70.346 L
415.86 75.129 L
416.994 76.2 L
418.129 74.932 L
419.263 77.65 L
420.397 78.368 L
421.531 71.929 L
422.666 69.441 L
423.8 76.668 L
424.934 81.421 L
426.069 79.409 L
427.203 80.64 L
428.337 84.008 L
429.471 79.745 L
430.606 71.358 L
431.74 67.555 L
432.874 67.731 L
434.009 69.458 L
435.143 70.653 L
436.277 64.901 L
437.411 52.073 L
438.546 42.906 L
439.68 44.074 L
440.814 51.888 L
441.949 59.275 L
443.083 60.4 L
444.217 57.22 L
445.351 61.605 L
446.486 79.333 L
447.62 98.355 L
448.754 103.887 L
449.889 96.746 L
451.023 87.101 L
452.157 78.606 L
453.291 69.911 L
454.426 63.953 L
455.56 63.262 L
456.694 64.819 L
457.829 68.386 L
458.963 76.376 L
460.097 83.171 L
461.231 81.319 L
462.366 74.136 L
463.5 69.421 L
S
GR
GS
1 0 0 RC
1 LJ
2 LW
N
181.063 71.122 M
182.197 63.713 L
183.331 56.155 L
184.466 52.585 L
185.6 51.094 L
186.734 50.196 L
187.869 49.827 L
189.003 48.792 L
190.137 49.877 L
191.271 57.734 L
192.406 67.998 L
193.54 76.359 L
194.674 90.3 L
195.809 109.304 L
196.943 116.973 L
198.077 111.83 L
199.211 111.928 L
200.346 120.999 L
201.48 126.21 L
202.614 124.242 L
203.749 117.456 L
204.883 101.507 L
206.017 82.037 L
207.151 75.622 L
208.286 77.516 L
209.42 65.775 L
210.554 44.671 L
211.689 40.48 L
212.823 52.391 L
213.957 51.312 L
215.091 30.911 L
216.226 20.768 L
217.36 37.476 L
218.494 57.579 L
219.629 58.461 L
220.763 52.883 L
221.897 60.433 L
223.031 75.527 L
224.166 84.357 L
225.3 88.298 L
226.434 94.187 L
227.569 101.666 L
228.703 110.021 L
229.837 118.467 L
230.971 120.185 L
232.106 114.429 L
233.24 110.307 L
234.374 105.892 L
235.509 89.897 L
236.643 68.201 L
237.777 58.144 L
238.911 58.194 L
240.046 51.617 L
241.18 37.533 L
242.314 31.237 L
243.449 34.314 L
244.583 33.484 L
245.717 29.398 L
246.851 34.981 L
247.986 46.8 L
249.12 52.408 L
250.254 59.635 L
251.389 80.287 L
252.523 99.694 L
253.657 102.957 L
254.791 104.514 L
255.926 114.985 L
257.06 116.747 L
258.194 100.743 L
259.329 87.063 L
260.463 89.286 L
261.597 93.77 L
262.731 88.234 L
263.866 78.453 L
265 66.883 L
266.134 49.21 L
267.269 33.7 L
268.403 28.714 L
269.537 23.424 L
270.671 12.571 L
271.806 14.371 L
272.94 36.352 L
274.074 55.232 L
275.209 54.121 L
276.343 48.627 L
277.477 58.419 L
278.611 79.88 L
279.746 96.7 L
280.88 98.043 L
282.014 87.335 L
283.149 82.608 L
284.283 95.24 L
285.417 111.547 L
286.551 115.854 L
287.686 113.287 L
288.82 109.962 L
289.954 101.144 L
291.089 88.891 L
292.223 79.126 L
293.357 69.205 L
294.491 61.739 L
295.626 63.141 L
296.76 61.817 L
297.894 45.839 L
299.029 28.189 L
300.163 21.588 L
301.297 18.895 L
302.431 16.367 L
303.566 21.678 L
304.7 34.785 L
305.834 48.549 L
306.969 62.402 L
308.103 75.541 L
309.237 81.167 L
310.371 81.839 L
311.506 89.466 L
312.64 103.021 L
313.774 109.1 L
314.909 104.196 L
316.043 97.409 L
317.177 93.443 L
318.311 86.66 L
319.446 73.357 L
320.58 59.969 L
321.714 55.234 L
322.849 59.86 L
323.983 63.848 L
325.117 55.256 L
326.251 37.362 L
327.386 26.797 L
328.52 28.02 L
329.654 29.006 L
330.789 26.056 L
331.923 28.851 L
333.057 39.179 L
334.191 46.9 L
335.326 50.451 L
336.46 62.244 L
337.594 83.378 L
338.729 95.06 L
339.863 91.748 L
340.997 89.708 L
342.131 91.163 L
343.266 84.514 L
344.4 74.841 L
345.534 71.556 L
346.669 68.411 L
347.803 61.299 L
348.937 57.278 L
350.071 56.48 L
S
GR
%%Trailer
%%Pages: 1
%%EOF
