%!PS-Adobe-3.0 EPSF-3.0
%%Creator: (MATLAB, The Mathworks, Inc. Version 9.3.0.713579 \(R2017b\). Operating System: Mac OS X)
%%Title: /Volumes/LNDG/Projects/StateSwitch/dynamic/data/eeg/rest/B_analyses/F_periRhythmMSE/C_figures/E_FFT_RCP.eps
%%CreationDate: 2020-04-21T13:52:07
%%Pages: (atend)
%%BoundingBox:     0   190   358   307
%%LanguageLevel: 3
%%EndComments
%%BeginProlog
%%BeginResource: procset (Apache XML Graphics Std ProcSet) 1.2 0
%%Version: 1.2 0
%%Copyright: (Copyright 2001-2003,2010 The Apache Software Foundation. License terms: http://www.apache.org/licenses/LICENSE-2.0)
/bd{bind def}bind def
/ld{load def}bd
/GR/grestore ld
/GS/gsave ld
/RM/rmoveto ld
/C/curveto ld
/t/show ld
/L/lineto ld
/ML/setmiterlimit ld
/CT/concat ld
/f/fill ld
/N/newpath ld
/S/stroke ld
/CC/setcmykcolor ld
/A/ashow ld
/cp/closepath ld
/RC/setrgbcolor ld
/LJ/setlinejoin ld
/GC/setgray ld
/LW/setlinewidth ld
/M/moveto ld
/re {4 2 roll M
1 index 0 rlineto
0 exch rlineto
neg 0 rlineto
cp } bd
/_ctm matrix def
/_tm matrix def
/BT { _ctm currentmatrix pop matrix _tm copy pop 0 0 moveto } bd
/ET { _ctm setmatrix } bd
/iTm { _ctm setmatrix _tm concat } bd
/Tm { _tm astore pop iTm 0 0 moveto } bd
/ux 0.0 def
/uy 0.0 def
/F {
  /Tp exch def
  /Tf exch def
  Tf findfont Tp scalefont setfont
  /cf Tf def  /cs Tp def
} bd
/ULS {currentpoint /uy exch def /ux exch def} bd
/ULE {
  /Tcx currentpoint pop def
  gsave
  newpath
  cf findfont cs scalefont dup
  /FontMatrix get 0 get /Ts exch def /FontInfo get dup
  /UnderlinePosition get Ts mul /To exch def
  /UnderlineThickness get Ts mul /Tt exch def
  ux uy To add moveto  Tcx uy To add lineto
  Tt setlinewidth stroke
  grestore
} bd
/OLE {
  /Tcx currentpoint pop def
  gsave
  newpath
  cf findfont cs scalefont dup
  /FontMatrix get 0 get /Ts exch def /FontInfo get dup
  /UnderlinePosition get Ts mul /To exch def
  /UnderlineThickness get Ts mul /Tt exch def
  ux uy To add cs add moveto Tcx uy To add cs add lineto
  Tt setlinewidth stroke
  grestore
} bd
/SOE {
  /Tcx currentpoint pop def
  gsave
  newpath
  cf findfont cs scalefont dup
  /FontMatrix get 0 get /Ts exch def /FontInfo get dup
  /UnderlinePosition get Ts mul /To exch def
  /UnderlineThickness get Ts mul /Tt exch def
  ux uy To add cs 10 mul 26 idiv add moveto Tcx uy To add cs 10 mul 26 idiv add lineto
  Tt setlinewidth stroke
  grestore
} bd
/QT {
/Y22 exch store
/X22 exch store
/Y21 exch store
/X21 exch store
currentpoint
/Y21 load 2 mul add 3 div exch
/X21 load 2 mul add 3 div exch
/X21 load 2 mul /X22 load add 3 div
/Y21 load 2 mul /Y22 load add 3 div
/X22 load /Y22 load curveto
} bd
/SSPD {
dup length /d exch dict def
{
/v exch def
/k exch def
currentpagedevice k known {
/cpdv currentpagedevice k get def
v cpdv ne {
/upd false def
/nullv v type /nulltype eq def
/nullcpdv cpdv type /nulltype eq def
nullv nullcpdv or
{
/upd true def
} {
/sametype v type cpdv type eq def
sametype {
v type /arraytype eq {
/vlen v length def
/cpdvlen cpdv length def
vlen cpdvlen eq {
0 1 vlen 1 sub {
/i exch def
/obj v i get def
/cpdobj cpdv i get def
obj cpdobj ne {
/upd true def
exit
} if
} for
} {
/upd true def
} ifelse
} {
v type /dicttype eq {
v {
/dv exch def
/dk exch def
/cpddv cpdv dk get def
dv cpddv ne {
/upd true def
exit
} if
} forall
} {
/upd true def
} ifelse
} ifelse
} if
} ifelse
upd true eq {
d k v put
} if
} if
} if
} forall
d length 0 gt {
d setpagedevice
} if
} bd
/RE { % /NewFontName [NewEncodingArray] /FontName RE -
  findfont dup length dict begin
  {
    1 index /FID ne
    {def} {pop pop} ifelse
  } forall
  /Encoding exch def
  /FontName 1 index def
  currentdict definefont pop
  end
} bind def
%%EndResource
%%BeginResource: procset (Apache XML Graphics EPS ProcSet) 1.0 0
%%Version: 1.0 0
%%Copyright: (Copyright 2002-2003 The Apache Software Foundation. License terms: http://www.apache.org/licenses/LICENSE-2.0)
/BeginEPSF { %def
/b4_Inc_state save def         % Save state for cleanup
/dict_count countdictstack def % Count objects on dict stack
/op_count count 1 sub def      % Count objects on operand stack
userdict begin                 % Push userdict on dict stack
/showpage { } def              % Redefine showpage, { } = null proc
0 setgray 0 setlinecap         % Prepare graphics state
1 setlinewidth 0 setlinejoin
10 setmiterlimit [ ] 0 setdash newpath
/languagelevel where           % If level not equal to 1 then
{pop languagelevel             % set strokeadjust and
1 ne                           % overprint to their defaults.
{false setstrokeadjust false setoverprint
} if
} if
} bd
/EndEPSF { %def
count op_count sub {pop} repeat            % Clean up stacks
countdictstack dict_count sub {end} repeat
b4_Inc_state restore
} bd
%%EndResource
%FOPBeginFontDict
%%IncludeResource: font Courier-Oblique
%%IncludeResource: font Courier-BoldOblique
%%IncludeResource: font Courier-Bold
%%IncludeResource: font ZapfDingbats
%%IncludeResource: font Symbol
%%IncludeResource: font Helvetica
%%IncludeResource: font Helvetica-Oblique
%%IncludeResource: font Helvetica-Bold
%%IncludeResource: font Helvetica-BoldOblique
%%IncludeResource: font Times-Roman
%%IncludeResource: font Times-Italic
%%IncludeResource: font Times-Bold
%%IncludeResource: font Times-BoldItalic
%%IncludeResource: font Courier
%FOPEndFontDict
%%BeginResource: encoding WinAnsiEncoding
/WinAnsiEncoding [
/.notdef /.notdef /.notdef /.notdef /.notdef
/.notdef /.notdef /.notdef /.notdef /.notdef
/.notdef /.notdef /.notdef /.notdef /.notdef
/.notdef /.notdef /.notdef /.notdef /.notdef
/.notdef /.notdef /.notdef /.notdef /.notdef
/.notdef /.notdef /.notdef /.notdef /.notdef
/.notdef /.notdef /space /exclam /quotedbl
/numbersign /dollar /percent /ampersand /quotesingle
/parenleft /parenright /asterisk /plus /comma
/hyphen /period /slash /zero /one
/two /three /four /five /six
/seven /eight /nine /colon /semicolon
/less /equal /greater /question /at
/A /B /C /D /E
/F /G /H /I /J
/K /L /M /N /O
/P /Q /R /S /T
/U /V /W /X /Y
/Z /bracketleft /backslash /bracketright /asciicircum
/underscore /quoteleft /a /b /c
/d /e /f /g /h
/i /j /k /l /m
/n /o /p /q /r
/s /t /u /v /w
/x /y /z /braceleft /bar
/braceright /asciitilde /bullet /Euro /bullet
/quotesinglbase /florin /quotedblbase /ellipsis /dagger
/daggerdbl /circumflex /perthousand /Scaron /guilsinglleft
/OE /bullet /Zcaron /bullet /bullet
/quoteleft /quoteright /quotedblleft /quotedblright /bullet
/endash /emdash /asciitilde /trademark /scaron
/guilsinglright /oe /bullet /zcaron /Ydieresis
/space /exclamdown /cent /sterling /currency
/yen /brokenbar /section /dieresis /copyright
/ordfeminine /guillemotleft /logicalnot /sfthyphen /registered
/macron /degree /plusminus /twosuperior /threesuperior
/acute /mu /paragraph /middot /cedilla
/onesuperior /ordmasculine /guillemotright /onequarter /onehalf
/threequarters /questiondown /Agrave /Aacute /Acircumflex
/Atilde /Adieresis /Aring /AE /Ccedilla
/Egrave /Eacute /Ecircumflex /Edieresis /Igrave
/Iacute /Icircumflex /Idieresis /Eth /Ntilde
/Ograve /Oacute /Ocircumflex /Otilde /Odieresis
/multiply /Oslash /Ugrave /Uacute /Ucircumflex
/Udieresis /Yacute /Thorn /germandbls /agrave
/aacute /acircumflex /atilde /adieresis /aring
/ae /ccedilla /egrave /eacute /ecircumflex
/edieresis /igrave /iacute /icircumflex /idieresis
/eth /ntilde /ograve /oacute /ocircumflex
/otilde /odieresis /divide /oslash /ugrave
/uacute /ucircumflex /udieresis /yacute /thorn
/ydieresis
] def
%%EndResource
%FOPBeginFontReencode
/Courier-Oblique findfont
dup length dict begin
  {1 index /FID ne {def} {pop pop} ifelse} forall
  /Encoding WinAnsiEncoding def
  currentdict
end
/Courier-Oblique exch definefont pop
/Courier-BoldOblique findfont
dup length dict begin
  {1 index /FID ne {def} {pop pop} ifelse} forall
  /Encoding WinAnsiEncoding def
  currentdict
end
/Courier-BoldOblique exch definefont pop
/Courier-Bold findfont
dup length dict begin
  {1 index /FID ne {def} {pop pop} ifelse} forall
  /Encoding WinAnsiEncoding def
  currentdict
end
/Courier-Bold exch definefont pop
/Helvetica findfont
dup length dict begin
  {1 index /FID ne {def} {pop pop} ifelse} forall
  /Encoding WinAnsiEncoding def
  currentdict
end
/Helvetica exch definefont pop
/Helvetica-Oblique findfont
dup length dict begin
  {1 index /FID ne {def} {pop pop} ifelse} forall
  /Encoding WinAnsiEncoding def
  currentdict
end
/Helvetica-Oblique exch definefont pop
/Helvetica-Bold findfont
dup length dict begin
  {1 index /FID ne {def} {pop pop} ifelse} forall
  /Encoding WinAnsiEncoding def
  currentdict
end
/Helvetica-Bold exch definefont pop
/Helvetica-BoldOblique findfont
dup length dict begin
  {1 index /FID ne {def} {pop pop} ifelse} forall
  /Encoding WinAnsiEncoding def
  currentdict
end
/Helvetica-BoldOblique exch definefont pop
/Times-Roman findfont
dup length dict begin
  {1 index /FID ne {def} {pop pop} ifelse} forall
  /Encoding WinAnsiEncoding def
  currentdict
end
/Times-Roman exch definefont pop
/Times-Italic findfont
dup length dict begin
  {1 index /FID ne {def} {pop pop} ifelse} forall
  /Encoding WinAnsiEncoding def
  currentdict
end
/Times-Italic exch definefont pop
/Times-Bold findfont
dup length dict begin
  {1 index /FID ne {def} {pop pop} ifelse} forall
  /Encoding WinAnsiEncoding def
  currentdict
end
/Times-Bold exch definefont pop
/Times-BoldItalic findfont
dup length dict begin
  {1 index /FID ne {def} {pop pop} ifelse} forall
  /Encoding WinAnsiEncoding def
  currentdict
end
/Times-BoldItalic exch definefont pop
/Courier findfont
dup length dict begin
  {1 index /FID ne {def} {pop pop} ifelse} forall
  /Encoding WinAnsiEncoding def
  currentdict
end
/Courier exch definefont pop
%FOPEndFontReencode
%%EndProlog
%%Page: 1 1
%%PageBoundingBox: 0 0 384 360
%%BeginPageSetup
[1 0 0 -1 0 360] CT
%%EndPageSetup
GS
1 GC
N
0 0 384 360 re
f
GR
GS
1 GC
N
0 0 384 360 re
f
GR
GS
1 GC
N
96 144 M
96 54 L
0 54 L
0 144 L
cp
f
GR
GS
0.149 GC
2 setlinecap
1 LJ
0.5 LW
N
96 144 M
96 54 L
S
GR
GS
0.149 GC
2 setlinecap
1 LJ
0.5 LW
N
96 121.5 M
95.04 121.5 L
S
GR
GS
0.149 GC
2 setlinecap
1 LJ
0.5 LW
N
96 76.5 M
95.04 76.5 L
S
GR
GS
[1 0 0 1 102 121.5] CT
0.149 GC
/Helvetica 20 F
GS
[1 0 0 1 0 0] CT
0 7.5 moveto 
1 -1 scale
(-1) t 
GR
GR
GS
[1 0 0 1 102 76.5] CT
0.149 GC
/Helvetica 20 F
GS
[1 0 0 1 0 0] CT
0 7.5 moveto 
1 -1 scale
(-0.8) t 
GR
GR
GS
[0 -1 1 0 141 98.99995] CT
0.149 GC
/Helvetica 20 F
GS
[1 0 0 1 0 0] CT
-26 20 moveto 
1 -1 scale
(Slope) t 
GR
GR
GS
0.149 GC
2 setlinecap
1 LJ
0.5 LW
N
96 144 M
0 144 L
S
GR
GS
0.149 GC
2 setlinecap
1 LJ
0.5 LW
N
73.143 144 M
73.143 143.04 L
S
GR
GS
0.149 GC
2 setlinecap
1 LJ
0.5 LW
N
27.429 144 M
27.429 143.04 L
S
GR
GS
[1 0 0 1 73.14286 150] CT
0.149 GC
/Helvetica 20 F
GS
[1 0 0 1 0 0] CT
-6 20 moveto 
1 -1 scale
(2) t 
GR
GR
GS
[1 0 0 1 27.42857 150] CT
0.149 GC
/Helvetica 20 F
GS
[1 0 0 1 0 0] CT
-6 20 moveto 
1 -1 scale
(1) t 
GR
GR
GS
0.598 GC
N
27.42 140.099 M
27.422 140.522 L
27.429 140.522 L
27.429 140.099 L
27.429 139.677 L
27.429 139.255 L
27.429 138.833 L
27.429 138.411 L
27.429 137.988 L
27.429 137.566 L
27.429 137.144 L
27.429 136.722 L
27.429 136.299 L
27.429 135.877 L
27.429 135.455 L
27.429 135.033 L
27.429 134.61 L
27.429 134.188 L
27.429 133.766 L
27.429 133.344 L
27.429 132.921 L
27.429 132.499 L
27.429 132.077 L
27.429 131.655 L
27.429 131.232 L
27.429 130.81 L
27.429 130.388 L
27.429 129.966 L
27.429 129.544 L
27.429 129.121 L
27.429 128.699 L
27.429 128.277 L
27.429 127.855 L
27.429 127.432 L
27.429 127.01 L
27.429 126.588 L
27.429 126.166 L
27.429 125.743 L
27.429 125.321 L
27.429 124.899 L
27.429 124.477 L
27.429 124.054 L
27.429 123.632 L
27.429 123.21 L
27.429 122.788 L
27.429 122.366 L
27.429 121.943 L
27.429 121.521 L
27.429 121.099 L
27.429 120.677 L
27.429 120.254 L
27.429 119.832 L
27.429 119.41 L
27.429 118.988 L
27.429 118.565 L
27.429 118.143 L
27.429 117.721 L
27.429 117.299 L
27.429 116.876 L
27.429 116.454 L
27.429 116.032 L
27.429 115.61 L
27.429 115.188 L
27.429 114.765 L
27.429 114.343 L
27.429 113.921 L
27.429 113.499 L
27.429 113.076 L
27.429 112.654 L
27.429 112.232 L
27.429 111.81 L
27.429 111.387 L
27.429 110.965 L
27.429 110.543 L
27.429 110.121 L
27.429 109.698 L
27.429 109.276 L
27.429 108.854 L
27.429 108.432 L
27.429 108.01 L
27.429 107.587 L
27.429 107.165 L
27.429 106.743 L
27.429 106.321 L
27.429 105.898 L
27.429 105.476 L
27.429 105.054 L
27.429 104.632 L
27.429 104.209 L
27.429 103.787 L
27.429 103.365 L
27.429 102.943 L
27.429 102.52 L
27.429 102.098 L
27.429 101.676 L
27.429 101.254 L
27.429 100.831 L
27.429 100.409 L
27.429 99.987 L
27.429 99.565 L
27.429 99.143 L
27.429 98.72 L
27.429 98.298 L
27.429 97.876 L
27.429 97.454 L
27.429 97.031 L
27.429 96.609 L
27.429 96.187 L
27.429 95.765 L
27.429 95.342 L
27.429 94.92 L
27.429 94.498 L
27.429 94.076 L
27.429 93.653 L
27.429 93.231 L
27.429 92.809 L
27.429 92.387 L
27.429 91.965 L
27.429 91.542 L
27.429 91.12 L
27.429 90.698 L
27.429 90.276 L
27.429 89.853 L
27.429 89.431 L
27.429 89.009 L
27.429 88.587 L
27.429 88.164 L
27.429 87.742 L
27.429 87.32 L
27.429 86.898 L
27.429 86.475 L
27.429 86.053 L
27.429 85.631 L
27.429 85.209 L
27.429 84.787 L
27.429 84.364 L
27.429 83.942 L
27.429 83.52 L
27.429 83.098 L
27.429 82.675 L
27.429 82.253 L
27.429 81.831 L
27.429 81.409 L
27.429 80.986 L
27.429 80.564 L
27.429 80.142 L
27.429 79.72 L
27.429 79.297 L
27.429 78.875 L
27.429 78.453 L
27.429 78.031 L
27.429 77.609 L
27.429 77.186 L
27.429 76.764 L
27.429 76.342 L
27.429 75.92 L
27.429 75.497 L
27.429 75.075 L
27.429 74.653 L
27.429 74.231 L
27.429 73.808 L
27.429 73.386 L
27.429 72.964 L
27.429 72.542 L
27.429 72.119 L
27.429 71.697 L
27.429 71.275 L
27.429 70.853 L
27.429 70.43 L
27.429 70.008 L
27.429 69.586 L
27.429 69.164 L
27.429 68.742 L
27.429 68.319 L
27.429 67.897 L
27.429 67.475 L
27.429 67.053 L
27.429 66.63 L
27.429 66.208 L
27.429 65.786 L
27.429 65.364 L
27.429 64.941 L
27.429 64.519 L
27.429 64.097 L
27.429 63.675 L
27.429 63.252 L
27.429 62.83 L
27.429 62.408 L
27.429 61.986 L
27.429 61.564 L
27.429 61.141 L
27.429 60.719 L
27.429 60.297 L
27.429 59.875 L
27.429 59.452 L
27.429 59.03 L
27.429 58.608 L
27.429 58.186 L
27.429 57.763 L
27.429 57.341 L
27.429 56.919 L
27.429 56.497 L
27.419 56.497 L
27.415 56.919 L
27.41 57.341 L
27.404 57.763 L
27.395 58.186 L
27.384 58.608 L
27.37 59.03 L
27.352 59.452 L
27.33 59.875 L
27.302 60.297 L
27.269 60.719 L
27.229 61.141 L
27.182 61.564 L
27.126 61.986 L
27.062 62.408 L
26.989 62.83 L
26.906 63.252 L
26.814 63.675 L
26.713 64.097 L
26.603 64.519 L
26.486 64.941 L
26.362 65.364 L
26.234 65.786 L
26.102 66.208 L
25.968 66.63 L
25.836 67.053 L
25.706 67.475 L
25.58 67.897 L
25.46 68.319 L
25.347 68.742 L
25.241 69.164 L
25.143 69.586 L
25.051 70.008 L
24.965 70.43 L
24.88 70.853 L
24.795 71.275 L
24.706 71.697 L
24.608 72.119 L
24.497 72.542 L
24.368 72.964 L
24.215 73.386 L
24.034 73.808 L
23.82 74.231 L
23.571 74.653 L
23.281 75.075 L
22.951 75.497 L
22.578 75.92 L
22.163 76.342 L
21.707 76.764 L
21.213 77.186 L
20.682 77.609 L
20.12 78.031 L
19.529 78.453 L
18.916 78.875 L
18.284 79.297 L
17.639 79.72 L
16.983 80.142 L
16.322 80.564 L
15.657 80.986 L
14.992 81.409 L
14.328 81.831 L
13.666 82.253 L
13.008 82.675 L
12.353 83.098 L
11.703 83.52 L
11.058 83.942 L
10.42 84.364 L
9.79 84.787 L
9.172 85.209 L
8.568 85.631 L
7.985 86.053 L
7.426 86.475 L
6.899 86.898 L
6.41 87.32 L
5.965 87.742 L
5.573 88.164 L
5.238 88.587 L
4.967 89.009 L
4.763 89.431 L
4.631 89.853 L
4.571 90.276 L
4.584 90.698 L
4.666 91.12 L
4.814 91.542 L
5.022 91.965 L
5.285 92.387 L
5.593 92.809 L
5.938 93.231 L
6.311 93.653 L
6.705 94.076 L
7.111 94.498 L
7.523 94.92 L
7.935 95.342 L
8.344 95.765 L
8.748 96.187 L
9.146 96.609 L
9.541 97.031 L
9.935 97.454 L
10.333 97.876 L
10.74 98.298 L
11.161 98.72 L
11.602 99.143 L
12.069 99.565 L
12.564 99.987 L
13.092 100.409 L
13.654 100.831 L
14.25 101.254 L
14.877 101.676 L
15.532 102.098 L
16.21 102.52 L
16.906 102.943 L
17.611 103.365 L
18.317 103.787 L
19.017 104.209 L
19.702 104.632 L
20.364 105.054 L
20.997 105.476 L
21.594 105.898 L
22.149 106.321 L
22.659 106.743 L
23.12 107.165 L
23.532 107.587 L
23.893 108.01 L
24.204 108.432 L
24.466 108.854 L
24.682 109.276 L
24.854 109.698 L
24.985 110.121 L
25.08 110.543 L
25.143 110.965 L
25.178 111.387 L
25.188 111.81 L
25.18 112.232 L
25.157 112.654 L
25.124 113.076 L
25.084 113.499 L
25.041 113.921 L
24.999 114.343 L
24.961 114.765 L
24.928 115.188 L
24.904 115.61 L
24.89 116.032 L
24.887 116.454 L
24.894 116.876 L
24.913 117.299 L
24.944 117.721 L
24.984 118.143 L
25.034 118.565 L
25.092 118.988 L
25.157 119.41 L
25.226 119.832 L
25.3 120.254 L
25.376 120.677 L
25.452 121.099 L
25.528 121.521 L
25.603 121.943 L
25.674 122.366 L
25.743 122.788 L
25.809 123.21 L
25.871 123.632 L
25.929 124.054 L
25.984 124.477 L
26.037 124.899 L
26.087 125.321 L
26.136 125.743 L
26.184 126.166 L
26.233 126.588 L
26.281 127.01 L
26.331 127.432 L
26.382 127.855 L
26.434 128.277 L
26.489 128.699 L
26.545 129.121 L
26.603 129.544 L
26.662 129.966 L
26.721 130.388 L
26.781 130.81 L
26.84 131.232 L
26.898 131.655 L
26.955 132.077 L
27.009 132.499 L
27.06 132.921 L
27.108 133.344 L
27.152 133.766 L
27.193 134.188 L
27.229 134.61 L
27.262 135.033 L
27.29 135.455 L
27.315 135.877 L
27.337 136.299 L
27.355 136.722 L
27.37 137.144 L
27.382 137.566 L
27.393 137.988 L
27.401 138.411 L
27.408 138.833 L
27.413 139.255 L
27.417 139.677 L
cp
f
GR
GS
[1 0 0 1 37.36457 81.46931] CT
0.598 GC
N
5 0 M
5 -2.761 2.761 -5 0 -5 C
-2.761 -5 -5 -2.761 -5 0 C
-5 2.761 -2.761 5 0 5 C
2.761 5 5 2.761 5 0 C
f
GR
GS
[1 0 0 1 37.92807 89.08842] CT
0.598 GC
N
/f1626255170{5 0 M
5 -2.761 2.761 -5 0 -5 C
-2.761 -5 -5 -2.761 -5 0 C
-5 2.761 -2.761 5 0 5 C
2.761 5 5 2.761 5 0 C}def
f1626255170
f
GR
GS
[1 0 0 1 35.24271 69.50535] CT
0.598 GC
N
f1626255170
f
GR
GS
[1 0 0 1 33.86885 81.60657] CT
0.598 GC
N
f1626255170
f
GR
GS
[1 0 0 1 33.56187 116.04585] CT
0.598 GC
N
f1626255170
f
GR
GS
[1 0 0 1 38.24124 102.43962] CT
0.598 GC
N
f1626255170
f
GR
GS
[1 0 0 1 34.48461 84.28033] CT
0.598 GC
N
f1626255170
f
GR
GS
[1 0 0 1 37.52686 93.29668] CT
0.598 GC
N
f1626255170
f
GR
GS
[1 0 0 1 35.92606 93.4824] CT
0.598 GC
N
f1626255170
f
GR
GS
[1 0 0 1 37.69387 99.74588] CT
0.598 GC
N
f1626255170
f
GR
GS
[1 0 0 1 34.90631 87.10048] CT
0.598 GC
N
f1626255170
f
GR
GS
[1 0 0 1 36.04911 89.25153] CT
0.598 GC
N
f1626255170
f
GR
GS
[1 0 0 1 37.75499 99.65899] CT
0.598 GC
N
f1626255170
f
GR
GS
[1 0 0 1 37.43036 87.91866] CT
0.598 GC
N
f1626255170
f
GR
GS
[1 0 0 1 38.06715 84.89687] CT
0.598 GC
N
f1626255170
f
GR
GS
[1 0 0 1 36.30454 89.68514] CT
0.598 GC
N
f1626255170
f
GR
GS
[1 0 0 1 37.68939 91.42992] CT
0.598 GC
N
f1626255170
f
GR
GS
[1 0 0 1 38.57063 88.91042] CT
0.598 GC
N
f1626255170
f
GR
GS
[1 0 0 1 37.40479 94.78481] CT
0.598 GC
N
f1626255170
f
GR
GS
[1 0 0 1 33.49704 86.64561] CT
0.598 GC
N
f1626255170
f
GR
GS
[1 0 0 1 34.23058 95.76577] CT
0.598 GC
N
f1626255170
f
GR
GS
[1 0 0 1 37.40829 97.43589] CT
0.598 GC
N
f1626255170
f
GR
GS
[1 0 0 1 33.767 92.57148] CT
0.598 GC
N
f1626255170
f
GR
GS
[1 0 0 1 38.72422 92.51855] CT
0.598 GC
N
f1626255170
f
GR
GS
[1 0 0 1 37.56186 99.86971] CT
0.598 GC
N
f1626255170
f
GR
GS
[1 0 0 1 38.82457 77.38195] CT
0.598 GC
N
f1626255170
f
GR
GS
[1 0 0 1 34.95584 90.95196] CT
0.598 GC
N
f1626255170
f
GR
GS
[1 0 0 1 37.33699 102.90994] CT
0.598 GC
N
f1626255170
f
GR
GS
[1 0 0 1 37.80297 89.21578] CT
0.598 GC
N
f1626255170
f
GR
GS
[1 0 0 1 35.51664 96.08245] CT
0.598 GC
N
f1626255170
f
GR
GS
[1 0 0 1 35.69513 118.61345] CT
0.598 GC
N
f1626255170
f
GR
GS
[1 0 0 1 36.4353 82.00191] CT
0.598 GC
N
f1626255170
f
GR
GS
[1 0 0 1 37.501 80.23368] CT
0.598 GC
N
f1626255170
f
GR
GS
[1 0 0 1 36.67966 97.0827] CT
0.598 GC
N
f1626255170
f
GR
GS
[1 0 0 1 34.94162 84.07936] CT
0.598 GC
N
f1626255170
f
GR
GS
[1 0 0 1 37.7234 119.76604] CT
0.598 GC
N
f1626255170
f
GR
GS
[1 0 0 1 37.50415 88.20148] CT
0.598 GC
N
f1626255170
f
GR
GS
[1 0 0 1 34.54705 89.53452] CT
0.598 GC
N
f1626255170
f
GR
GS
[1 0 0 1 36.04271 89.9118] CT
0.598 GC
N
f1626255170
f
GR
GS
[1 0 0 1 33.98297 92.05667] CT
0.598 GC
N
f1626255170
f
GR
GS
[1 0 0 1 33.88399 79.54144] CT
0.598 GC
N
f1626255170
f
GR
GS
[1 0 0 1 36.91803 91.74891] CT
0.598 GC
N
f1626255170
f
GR
GS
[1 0 0 1 33.56132 86.30526] CT
0.598 GC
N
f1626255170
f
GR
GS
[1 0 0 1 34.29465 92.753] CT
0.598 GC
N
f1626255170
f
GR
GS
[1 0 0 1 38.00427 95.59998] CT
0.598 GC
N
f1626255170
f
GR
GS
[1 0 0 1 36.54741 96.52515] CT
0.598 GC
N
f1626255170
f
GR
GS
[1 0 0 1 37.01321 100.82301] CT
0.598 GC
N
f1626255170
f
GR
GS
[1 0 0 1 38.65688 90.76987] CT
0.598 GC
N
f1626255170
f
GR
GS
[1 0 0 1 37.74538 103.41126] CT
0.598 GC
N
f1626255170
f
GR
GS
[1 0 0 1 37.43461 85.37549] CT
0.598 GC
N
f1626255170
f
GR
GS
[1 0 0 1 37.70537 93.52686] CT
0.598 GC
N
f1626255170
f
GR
GS
[1 0 0 1 34.70785 96.45654] CT
0.598 GC
N
f1626255170
f
GR
GS
[1 0 0 1 35.50214 100.16677] CT
0.598 GC
N
f1626255170
f
GR
GS
[1 0 0 1 34.70527 101.91758] CT
0.598 GC
N
f1626255170
f
GR
GS
[1 0 0 1 34.37059 99.51862] CT
0.598 GC
N
f1626255170
f
GR
GS
[1 0 0 1 34.76921 81.38723] CT
0.598 GC
N
f1626255170
f
GR
GS
[1 0 0 1 37.05449 89.91832] CT
0.598 GC
N
f1626255170
f
GR
GS
[1 0 0 1 35.6272 124.411] CT
0.598 GC
N
f1626255170
f
GR
GS
[1 0 0 1 36.3415 95.15454] CT
0.598 GC
N
f1626255170
f
GR
GS
[1 0 0 1 34.28989 99.36967] CT
0.598 GC
N
f1626255170
f
GR
GS
[1 0 0 1 36.62803 101.88498] CT
0.598 GC
N
f1626255170
f
GR
GS
[1 0 0 1 37.64968 100.20907] CT
0.598 GC
N
f1626255170
f
GR
GS
[1 0 0 1 33.49389 91.75555] CT
0.598 GC
N
f1626255170
f
GR
GS
[1 0 0 1 38.7942 113.71795] CT
0.598 GC
N
f1626255170
f
GR
GS
[1 0 0 1 36.69448 92.08554] CT
0.598 GC
N
f1626255170
f
GR
GS
[1 0 0 1 38.71076 81.11091] CT
0.598 GC
N
f1626255170
f
GR
GS
[1 0 0 1 38.02674 92.64415] CT
0.598 GC
N
f1626255170
f
GR
GS
[1 0 0 1 33.36771 92.01666] CT
0.598 GC
N
f1626255170
f
GR
GS
[1 0 0 1 35.68843 85.74661] CT
0.598 GC
N
f1626255170
f
GR
GS
[1 0 0 1 34.9898 96.21918] CT
0.598 GC
N
f1626255170
f
GR
GS
[1 0 0 1 34.02834 100.99685] CT
0.598 GC
N
f1626255170
f
GR
GS
[1 0 0 1 38.1371 89.83373] CT
0.598 GC
N
f1626255170
f
GR
GS
[1 0 0 1 35.15506 108.31115] CT
0.598 GC
N
f1626255170
f
GR
GS
[1 0 0 1 35.42742 87.17047] CT
0.598 GC
N
f1626255170
f
GR
GS
[1 0 0 1 38.34929 92.80774] CT
0.598 GC
N
f1626255170
f
GR
GS
[1 0 0 1 35.41816 84.06256] CT
0.598 GC
N
f1626255170
f
GR
GS
[1 0 0 1 35.85676 99.63043] CT
0.598 GC
N
f1626255170
f
GR
GS
[1 0 0 1 38.25212 68.4025] CT
0.598 GC
N
f1626255170
f
GR
GS
[1 0 0 1 37.07149 81.04105] CT
0.598 GC
N
f1626255170
f
GR
GS
[1 0 0 1 36.91424 89.60045] CT
0.598 GC
N
f1626255170
f
GR
GS
[1 0 0 1 37.56996 82.54802] CT
0.598 GC
N
f1626255170
f
GR
GS
[1 0 0 1 37.76314 82.72072] CT
0.598 GC
N
f1626255170
f
GR
GS
[1 0 0 1 34.95982 71.16563] CT
0.598 GC
N
f1626255170
f
GR
GS
[1 0 0 1 33.1974 100.87071] CT
0.598 GC
N
f1626255170
f
GR
GS
[1 0 0 1 38.3671 105.09917] CT
0.598 GC
N
f1626255170
f
GR
GS
[1 0 0 1 33.70015 89.80243] CT
0.598 GC
N
f1626255170
f
GR
GS
[1 0 0 1 38.08182 87.54978] CT
0.598 GC
N
f1626255170
f
GR
GS
[1 0 0 1 38.61598 128.61591] CT
0.598 GC
N
f1626255170
f
GR
GS
[1 0 0 1 38.0858 80.38187] CT
0.598 GC
N
f1626255170
f
GR
GS
[1 0 0 1 36.9937 85.45874] CT
0.598 GC
N
f1626255170
f
GR
GS
[1 0 0 1 36.32094 88.08186] CT
0.598 GC
N
f1626255170
f
GR
GS
[1 0 0 1 35.72203 98.35165] CT
0.598 GC
N
f1626255170
f
GR
GS
[1 0 0 1 35.02824 88.04203] CT
0.598 GC
N
f1626255170
f
GR
GS
[1 0 0 1 33.64532 114.74321] CT
0.598 GC
N
f1626255170
f
GR
GS
[1 0 0 1 35.03758 72.24574] CT
0.598 GC
N
f1626255170
f
GR
GS
[1 0 0 1 37.98832 90.74934] CT
0.598 GC
N
f1626255170
f
GR
GS
[1 0 0 1 33.60918 85.41373] CT
0.598 GC
N
f1626255170
f
GR
GS
[1 0 0 1 33.94238 78.22791] CT
0.598 GC
N
f1626255170
f
GR
GS
[1 0 0 1 34.78445 100.36436] CT
0.598 GC
N
f1626255170
f
GR
GS
0.598 GC
N
/f2133045354{73.13 143.032 M
73.133 143.454 L
73.143 143.454 L
73.143 143.032 L
73.143 142.61 L
73.143 142.188 L
73.143 141.765 L
73.143 141.343 L
73.143 140.921 L
73.143 140.499 L
73.143 140.076 L
73.143 139.654 L
73.143 139.232 L
73.143 138.81 L
73.143 138.387 L
73.143 137.965 L
73.143 137.543 L
73.143 137.121 L
73.143 136.699 L
73.143 136.276 L
73.143 135.854 L
73.143 135.432 L
73.143 135.01 L
73.143 134.587 L
73.143 134.165 L
73.143 133.743 L
73.143 133.321 L
73.143 132.898 L
73.143 132.476 L
73.143 132.054 L
73.143 131.632 L
73.143 131.209 L
73.143 130.787 L
73.143 130.365 L
73.143 129.943 L
73.143 129.52 L
73.143 129.098 L
73.143 128.676 L
73.143 128.254 L
73.143 127.832 L
73.143 127.409 L
73.143 126.987 L
73.143 126.565 L
73.143 126.143 L
73.143 125.72 L
73.143 125.298 L
73.143 124.876 L
73.143 124.454 L
73.143 124.031 L
73.143 123.609 L
73.143 123.187 L
73.143 122.765 L
73.143 122.342 L
73.143 121.92 L
73.143 121.498 L
73.143 121.076 L
73.143 120.654 L
73.143 120.231 L
73.143 119.809 L
73.143 119.387 L
73.143 118.965 L
73.143 118.542 L
73.143 118.12 L
73.143 117.698 L
73.143 117.276 L
73.143 116.853 L
73.143 116.431 L
73.143 116.009 L
73.143 115.587 L
73.143 115.164 L
73.143 114.742 L
73.143 114.32 L
73.143 113.898 L
73.143 113.475 L
73.143 113.053 L
73.143 112.631 L
73.143 112.209 L
73.143 111.787 L
73.143 111.364 L
73.143 110.942 L
73.143 110.52 L
73.143 110.098 L
73.143 109.675 L
73.143 109.253 L
73.143 108.831 L
73.143 108.409 L
73.143 107.986 L
73.143 107.564 L
73.143 107.142 L
73.143 106.72 L
73.143 106.297 L
73.143 105.875 L
73.143 105.453 L
73.143 105.031 L
73.143 104.609 L
73.143 104.186 L
73.143 103.764 L
73.143 103.342 L
73.143 102.92 L
73.143 102.497 L
73.143 102.075 L
73.143 101.653 L
73.143 101.231 L
73.143 100.808 L
73.143 100.386 L
73.143 99.964 L
73.143 99.542 L
73.143 99.119 L
73.143 98.697 L
73.143 98.275 L
73.143 97.853 L
73.143 97.431 L
73.143 97.008 L
73.143 96.586 L
73.143 96.164 L
73.143 95.742 L
73.143 95.319 L
73.143 94.897 L
73.143 94.475 L
73.143 94.053 L
73.143 93.63 L
73.143 93.208 L
73.143 92.786 L
73.143 92.364 L
73.143 91.941 L
73.143 91.519 L
73.143 91.097 L
73.143 90.675 L
73.143 90.253 L
73.143 89.83 L
73.143 89.408 L
73.143 88.986 L
73.143 88.564 L
73.143 88.141 L
73.143 87.719 L
73.143 87.297 L
73.143 86.875 L
73.143 86.452 L
73.143 86.03 L
73.143 85.608 L
73.143 85.186 L
73.143 84.763 L
73.143 84.341 L
73.143 83.919 L
73.143 83.497 L
73.143 83.074 L
73.143 82.652 L
73.143 82.23 L
73.143 81.808 L
73.143 81.386 L
73.143 80.963 L
73.143 80.541 L
73.143 80.119 L
73.143 79.697 L
73.143 79.274 L
73.143 78.852 L
73.143 78.43 L
73.143 78.008 L
73.143 77.585 L
73.143 77.163 L
73.143 76.741 L
73.143 76.319 L
73.143 75.896 L
73.143 75.474 L
73.143 75.052 L
73.143 74.63 L
73.143 74.208 L
73.143 73.785 L
73.143 73.363 L
73.143 72.941 L
73.143 72.519 L
73.143 72.096 L
73.143 71.674 L
73.143 71.252 L
73.143 70.83 L
73.143 70.407 L
73.143 69.985 L
73.143 69.563 L
73.143 69.141 L
73.143 68.718 L
73.143 68.296 L
73.143 67.874 L
73.143 67.452 L
73.143 67.03 L
73.143 66.607 L
73.143 66.185 L
73.143 65.763 L
73.143 65.341 L
73.143 64.918 L
73.143 64.496 L
73.143 64.074 L
73.143 63.652 L
73.143 63.229 L
73.143 62.807 L
73.143 62.385 L
73.143 61.963 L
73.143 61.54 L
73.143 61.118 L
73.143 60.696 L
73.143 60.274 L
73.143 59.852 L
73.143 59.429 L
73.137 59.429 L
73.134 59.852 L
73.131 60.274 L
73.127 60.696 L
73.122 61.118 L
73.115 61.54 L
73.107 61.963 L
73.097 62.385 L
73.084 62.807 L
73.069 63.229 L
73.051 63.652 L
73.03 64.074 L
73.005 64.496 L
72.976 64.918 L
72.943 65.341 L
72.907 65.763 L
72.866 66.185 L
72.822 66.607 L
72.774 67.03 L
72.723 67.452 L
72.669 67.874 L
72.612 68.296 L
72.554 68.718 L
72.495 69.141 L
72.435 69.563 L
72.376 69.985 L
72.317 70.407 L
72.259 70.83 L
72.203 71.252 L
72.149 71.674 L
72.096 72.096 L
72.045 72.519 L
71.995 72.941 L
71.947 73.363 L
71.899 73.785 L
71.851 74.208 L
71.802 74.63 L
71.751 75.052 L
71.699 75.474 L
71.643 75.896 L
71.585 76.319 L
71.523 76.741 L
71.458 77.163 L
71.389 77.585 L
71.317 78.008 L
71.242 78.43 L
71.167 78.852 L
71.09 79.274 L
71.014 79.697 L
70.941 80.119 L
70.871 80.541 L
70.806 80.963 L
70.748 81.386 L
70.698 81.808 L
70.658 82.23 L
70.628 82.652 L
70.609 83.074 L
70.601 83.497 L
70.604 83.919 L
70.619 84.341 L
70.643 84.763 L
70.675 85.186 L
70.713 85.608 L
70.755 86.03 L
70.798 86.452 L
70.838 86.875 L
70.871 87.297 L
70.894 87.719 L
70.903 88.141 L
70.892 88.564 L
70.857 88.986 L
70.795 89.408 L
70.7 89.83 L
70.568 90.253 L
70.396 90.675 L
70.181 91.097 L
69.918 91.519 L
69.607 91.941 L
69.246 92.364 L
68.835 92.786 L
68.373 93.208 L
67.863 93.63 L
67.308 94.053 L
66.711 94.475 L
66.079 94.897 L
65.416 95.319 L
64.731 95.742 L
64.031 96.164 L
63.325 96.586 L
62.62 97.008 L
61.925 97.431 L
61.246 97.853 L
60.591 98.275 L
59.964 98.697 L
59.369 99.119 L
58.807 99.542 L
58.279 99.964 L
57.783 100.386 L
57.317 100.808 L
56.875 101.231 L
56.454 101.653 L
56.047 102.075 L
55.649 102.497 L
55.255 102.92 L
54.861 103.342 L
54.462 103.764 L
54.059 104.186 L
53.65 104.609 L
53.238 105.031 L
52.826 105.453 L
52.42 105.875 L
52.026 106.297 L
51.652 106.72 L
51.307 107.142 L
50.999 107.564 L
50.737 107.986 L
50.528 108.409 L
50.38 108.831 L
50.298 109.253 L
50.286 109.675 L
50.346 110.098 L
50.478 110.52 L
50.681 110.942 L
50.952 111.364 L
51.287 111.787 L
51.68 112.209 L
52.124 112.631 L
52.613 113.053 L
53.14 113.475 L
53.699 113.898 L
54.282 114.32 L
54.886 114.742 L
55.504 115.164 L
56.134 115.587 L
56.772 116.009 L
57.417 116.431 L
58.068 116.853 L
58.722 117.276 L
59.381 117.698 L
60.042 118.12 L
60.706 118.542 L
61.372 118.965 L
62.036 119.387 L
62.697 119.809 L
63.353 120.231 L
63.998 120.654 L
64.63 121.076 L
65.244 121.498 L
65.834 121.92 L
66.396 122.342 L
66.927 122.765 L
67.422 123.187 L
67.878 123.609 L
68.293 124.031 L
68.665 124.454 L
68.996 124.876 L
69.285 125.298 L
69.535 125.72 L
69.748 126.143 L
69.929 126.565 L
70.082 126.987 L
70.212 127.409 L
70.323 127.832 L
70.421 128.254 L
70.51 128.676 L
70.595 129.098 L
70.679 129.52 L
70.766 129.943 L
70.857 130.365 L
70.956 130.787 L
71.061 131.209 L
71.174 131.632 L
71.294 132.054 L
71.42 132.476 L
71.55 132.898 L
71.683 133.321 L
71.816 133.743 L
71.948 134.165 L
72.077 134.587 L
72.2 135.01 L
72.318 135.432 L
72.427 135.854 L
72.528 136.276 L
72.621 136.699 L
72.703 137.121 L
72.777 137.543 L
72.841 137.965 L
72.896 138.387 L
72.944 138.81 L
72.983 139.232 L
73.017 139.654 L
73.044 140.076 L
73.066 140.499 L
73.084 140.921 L
73.098 141.343 L
73.109 141.765 L
73.118 142.188 L
73.125 142.61 L
cp}def
f2133045354
f
GR
GS
[1 0 0 1 83.58871 118.48164] CT
0.598 GC
N
f1626255170
f
GR
GS
[1 0 0 1 82.02738 110.86255] CT
0.598 GC
N
f1626255170
f
GR
GS
[1 0 0 1 80.68784 130.44562] CT
0.598 GC
N
f1626255170
f
GR
GS
[1 0 0 1 83.31244 118.34439] CT
0.598 GC
N
f1626255170
f
GR
GS
[1 0 0 1 83.87097 83.90511] CT
0.598 GC
N
f1626255170
f
GR
GS
[1 0 0 1 82.11896 97.51134] CT
0.598 GC
N
f1626255170
f
GR
GS
[1 0 0 1 82.05418 115.67063] CT
0.598 GC
N
f1626255170
f
GR
GS
[1 0 0 1 82.9183 106.65428] CT
0.598 GC
N
f1626255170
f
GR
GS
[1 0 0 1 80.755 106.46855] CT
0.598 GC
N
f1626255170
f
GR
GS
[1 0 0 1 84.21529 100.20509] CT
0.598 GC
N
f1626255170
f
GR
GS
[1 0 0 1 79.5284 112.85048] CT
0.598 GC
N
f1626255170
f
GR
GS
[1 0 0 1 83.39553 110.69942] CT
0.598 GC
N
f1626255170
f
GR
GS
[1 0 0 1 80.74239 100.29198] CT
0.598 GC
N
f1626255170
f
GR
GS
[1 0 0 1 79.51187 112.0323] CT
0.598 GC
N
f1626255170
f
GR
GS
[1 0 0 1 81.9972 115.05408] CT
0.598 GC
N
f1626255170
f
GR
GS
[1 0 0 1 82.57568 110.26582] CT
0.598 GC
N
f1626255170
f
GR
GS
[1 0 0 1 82.36065 108.52104] CT
0.598 GC
N
f1626255170
f
GR
GS
[1 0 0 1 83.15358 111.04053] CT
0.598 GC
N
f1626255170
f
GR
GS
[1 0 0 1 79.78642 105.16615] CT
0.598 GC
N
f1626255170
f
GR
GS
[1 0 0 1 83.27435 113.30536] CT
0.598 GC
N
f1626255170
f
GR
GS
[1 0 0 1 83.26543 104.18519] CT
0.598 GC
N
f1626255170
f
GR
GS
[1 0 0 1 83.74084 102.51507] CT
0.598 GC
N
f1626255170
f
GR
GS
[1 0 0 1 81.95826 107.37949] CT
0.598 GC
N
f1626255170
f
GR
GS
[1 0 0 1 82.25334 107.43242] CT
0.598 GC
N
f1626255170
f
GR
GS
[1 0 0 1 80.36076 100.08125] CT
0.598 GC
N
f1626255170
f
GR
GS
[1 0 0 1 81.68998 122.56902] CT
0.598 GC
N
f1626255170
f
GR
GS
[1 0 0 1 84.52241 108.999] CT
0.598 GC
N
f1626255170
f
GR
GS
[1 0 0 1 79.62609 97.04102] CT
0.598 GC
N
f1626255170
f
GR
GS
[1 0 0 1 80.7467 110.73518] CT
0.598 GC
N
f1626255170
f
GR
GS
[1 0 0 1 78.94361 103.86852] CT
0.598 GC
N
f1626255170
f
GR
GS
[1 0 0 1 83.48772 81.33752] CT
0.598 GC
N
f1626255170
f
GR
GS
[1 0 0 1 83.01486 117.94905] CT
0.598 GC
N
f1626255170
f
GR
GS
[1 0 0 1 83.43439 119.71729] CT
0.598 GC
N
f1626255170
f
GR
GS
[1 0 0 1 81.14375 102.86826] CT
0.598 GC
N
f1626255170
f
GR
GS
[1 0 0 1 83.53915 115.8716] CT
0.598 GC
N
f1626255170
f
GR
GS
[1 0 0 1 82.81243 80.1849] CT
0.598 GC
N
f1626255170
f
GR
GS
[1 0 0 1 84.08766 111.74947] CT
0.598 GC
N
f1626255170
f
GR
GS
[1 0 0 1 82.52306 110.41644] CT
0.598 GC
N
f1626255170
f
GR
GS
[1 0 0 1 82.63587 110.03916] CT
0.598 GC
N
f1626255170
f
GR
GS
[1 0 0 1 78.93406 107.89429] CT
0.598 GC
N
f1626255170
f
GR
GS
[1 0 0 1 83.79203 120.40952] CT
0.598 GC
N
f1626255170
f
GR
GS
[1 0 0 1 79.93227 108.20205] CT
0.598 GC
N
f1626255170
f
GR
GS
[1 0 0 1 80.36955 113.6457] CT
0.598 GC
N
f1626255170
f
GR
GS
[1 0 0 1 79.89244 107.19797] CT
0.598 GC
N
f1626255170
f
GR
GS
[1 0 0 1 81.94121 104.35099] CT
0.598 GC
N
f1626255170
f
GR
GS
[1 0 0 1 81.82077 103.42581] CT
0.598 GC
N
f1626255170
f
GR
GS
[1 0 0 1 82.8621 99.12795] CT
0.598 GC
N
f1626255170
f
GR
GS
[1 0 0 1 83.34043 109.18107] CT
0.598 GC
N
f1626255170
f
GR
GS
[1 0 0 1 80.31728 96.5397] CT
0.598 GC
N
f1626255170
f
GR
GS
[1 0 0 1 84.08641 114.57548] CT
0.598 GC
N
f1626255170
f
GR
GS
[1 0 0 1 80.72909 106.42411] CT
0.598 GC
N
f1626255170
f
GR
GS
[1 0 0 1 79.86609 103.49442] CT
0.598 GC
N
f1626255170
f
GR
GS
[1 0 0 1 80.16518 99.78419] CT
0.598 GC
N
f1626255170
f
GR
GS
[1 0 0 1 79.65451 98.03338] CT
0.598 GC
N
f1626255170
f
GR
GS
[1 0 0 1 82.14141 100.43233] CT
0.598 GC
N
f1626255170
f
GR
GS
[1 0 0 1 82.52676 118.56374] CT
0.598 GC
N
f1626255170
f
GR
GS
[1 0 0 1 80.28017 110.03265] CT
0.598 GC
N
f1626255170
f
GR
GS
[1 0 0 1 82.22983 75.53996] CT
0.598 GC
N
f1626255170
f
GR
GS
[1 0 0 1 80.91821 104.79642] CT
0.598 GC
N
f1626255170
f
GR
GS
[1 0 0 1 82.96904 100.58129] CT
0.598 GC
N
f1626255170
f
GR
GS
[1 0 0 1 80.77471 98.06598] CT
0.598 GC
N
f1626255170
f
GR
GS
[1 0 0 1 81.58868 99.74189] CT
0.598 GC
N
f1626255170
f
GR
GS
[1 0 0 1 80.1362 108.1954] CT
0.598 GC
N
f1626255170
f
GR
GS
[1 0 0 1 81.28241 86.23302] CT
0.598 GC
N
f1626255170
f
GR
GS
[1 0 0 1 82.41026 107.86542] CT
0.598 GC
N
f1626255170
f
GR
GS
[1 0 0 1 79.37869 118.84005] CT
0.598 GC
N
f1626255170
f
GR
GS
[1 0 0 1 79.70948 107.30679] CT
0.598 GC
N
f1626255170
f
GR
GS
[1 0 0 1 79.7116 107.9343] CT
0.598 GC
N
f1626255170
f
GR
GS
[1 0 0 1 79.36442 114.20435] CT
0.598 GC
N
f1626255170
f
GR
GS
[1 0 0 1 82.73125 103.73177] CT
0.598 GC
N
f1626255170
f
GR
GS
[1 0 0 1 82.01638 98.95412] CT
0.598 GC
N
f1626255170
f
GR
GS
[1 0 0 1 83.46228 110.11723] CT
0.598 GC
N
f1626255170
f
GR
GS
[1 0 0 1 81.14297 91.63981] CT
0.598 GC
N
f1626255170
f
GR
GS
[1 0 0 1 82.13683 112.78049] CT
0.598 GC
N
f1626255170
f
GR
GS
[1 0 0 1 80.40951 107.14322] CT
0.598 GC
N
f1626255170
f
GR
GS
[1 0 0 1 82.32286 115.8884] CT
0.598 GC
N
f1626255170
f
GR
GS
[1 0 0 1 84.07481 100.32053] CT
0.598 GC
N
f1626255170
f
GR
GS
[1 0 0 1 82.12466 131.54846] CT
0.598 GC
N
f1626255170
f
GR
GS
[1 0 0 1 84.48704 118.90991] CT
0.598 GC
N
f1626255170
f
GR
GS
[1 0 0 1 78.96045 110.35051] CT
0.598 GC
N
f1626255170
f
GR
GS
[1 0 0 1 81.49052 117.40294] CT
0.598 GC
N
f1626255170
f
GR
GS
[1 0 0 1 81.73653 117.23025] CT
0.598 GC
N
f1626255170
f
GR
GS
[1 0 0 1 82.93806 128.78534] CT
0.598 GC
N
f1626255170
f
GR
GS
[1 0 0 1 82.80341 99.08025] CT
0.598 GC
N
f1626255170
f
GR
GS
[1 0 0 1 84.52967 94.85178] CT
0.598 GC
N
f1626255170
f
GR
GS
[1 0 0 1 80.39317 110.14853] CT
0.598 GC
N
f1626255170
f
GR
GS
[1 0 0 1 82.00631 112.40118] CT
0.598 GC
N
f1626255170
f
GR
GS
[1 0 0 1 79.19482 71.33508] CT
0.598 GC
N
f1626255170
f
GR
GS
[1 0 0 1 80.29435 119.56909] CT
0.598 GC
N
f1626255170
f
GR
GS
[1 0 0 1 81.93248 114.49222] CT
0.598 GC
N
f1626255170
f
GR
GS
[1 0 0 1 81.644 111.8691] CT
0.598 GC
N
f1626255170
f
GR
GS
[1 0 0 1 80.59663 101.59931] CT
0.598 GC
N
f1626255170
f
GR
GS
[1 0 0 1 79.66235 111.90893] CT
0.598 GC
N
f1626255170
f
GR
GS
[1 0 0 1 80.81194 85.20776] CT
0.598 GC
N
f1626255170
f
GR
GS
[1 0 0 1 83.65165 127.70521] CT
0.598 GC
N
f1626255170
f
GR
GS
[1 0 0 1 82.45695 109.20161] CT
0.598 GC
N
f1626255170
f
GR
GS
[1 0 0 1 80.26301 114.53722] CT
0.598 GC
N
f1626255170
f
GR
GS
[1 0 0 1 81.59151 121.72305] CT
0.598 GC
N
f1626255170
f
GR
GS
[1 0 0 1 84.53207 99.58659] CT
0.598 GC
N
f1626255170
f
GR
GS
0.2 GC
1 LJ
4 LW
N
27.429 92.644 M
73.143 107.307 L
S
GR
GS
[1 0 0 1 27.42857 92.64433] CT
0.2 GC
N
/f881756500{7.071 0 M
7.071 -3.905 3.905 -7.071 0 -7.071 C
-3.905 -7.071 -7.071 -3.905 -7.071 0 C
-7.071 3.905 -3.905 7.071 0 7.071 C
3.905 7.071 7.071 3.905 7.071 0 C}def
f881756500
f
GR
GS
[1 0 0 1 27.42857 92.64433] CT
10.0 ML
2 LW
N
7.071 0 M
7.071 -3.905 3.905 -7.071 0 -7.071 C
-3.905 -7.071 -7.071 -3.905 -7.071 0 C
-7.071 3.905 -3.905 7.071 0 7.071 C
3.905 7.071 7.071 3.905 7.071 0 C
S
GR
GS
[1 0 0 1 73.14286 107.30663] CT
0.2 GC
N
f881756500
f
GR
GS
[1 0 0 1 73.14286 107.30663] CT
10.0 ML
2 LW
N
7.071 0 M
7.071 -3.905 3.905 -7.071 0 -7.071 C
-3.905 -7.071 -7.071 -3.905 -7.071 0 C
-7.071 3.905 -3.905 7.071 0 7.071 C
3.905 7.071 7.071 3.905 7.071 0 C
S
GR
GS
1 LJ
0.5 LW
N
27.429 144 M
73.143 144 L
S
GR
GS
1 GC
N
/f808450574{36.786 157.5 M
63.786 157.5 L
63.786 130.5 L
36.786 130.5 L
cp}def
f808450574
f
GR
GS
[1 0 0 1 50.28571 144] CT
/Helvetica-Bold 20 F
GS
[1 0 0 1 0 0] CT
-12.5 7.5 moveto 
1 -1 scale
(***) t 
GR
GR
GS
1 GC
N
/f-2036801182{288 144 M
288 54 L
192 54 L
192 144 L
cp}def
f-2036801182
f
GR
GS
0.149 GC
2 setlinecap
1 LJ
0.5 LW
N
288 144 M
288 54 L
S
GR
GS
0.149 GC
2 setlinecap
1 LJ
0.5 LW
N
288 127.333 M
287.04 127.333 L
S
GR
GS
0.149 GC
2 setlinecap
1 LJ
0.5 LW
N
288 94 M
287.04 94 L
S
GR
GS
0.149 GC
2 setlinecap
1 LJ
0.5 LW
N
288 60.667 M
287.04 60.667 L
S
GR
GS
[1 0 0 1 294 127.33333] CT
0.149 GC
/Helvetica 20 F
GS
[1 0 0 1 0 0] CT
0 7.5 moveto 
1 -1 scale
(-0.9) t 
GR
GR
GS
[1 0 0 1 294 94.00001] CT
0.149 GC
/Helvetica 20 F
GS
[1 0 0 1 0 0] CT
0 7.5 moveto 
1 -1 scale
(-0.8) t 
GR
GR
GS
[1 0 0 1 294 60.66666] CT
0.149 GC
/Helvetica 20 F
GS
[1 0 0 1 0 0] CT
0 7.5 moveto 
1 -1 scale
(-0.7) t 
GR
GR
GS
[0 -1 1 0 333 98.99996] CT
0.149 GC
/Helvetica 20 F
GS
[1 0 0 1 0 0] CT
-26 20 moveto 
1 -1 scale
(Slope) t 
GR
GR
GS
0.149 GC
2 setlinecap
1 LJ
0.5 LW
N
288 144 M
192 144 L
S
GR
GS
0.149 GC
2 setlinecap
1 LJ
0.5 LW
N
265.143 144 M
265.143 143.04 L
S
GR
GS
0.149 GC
2 setlinecap
1 LJ
0.5 LW
N
219.429 144 M
219.429 143.04 L
S
GR
GS
[1 0 0 1 265.14285 150] CT
0.149 GC
/Helvetica 20 F
GS
[1 0 0 1 0 0] CT
-6 20 moveto 
1 -1 scale
(2) t 
GR
GR
GS
[1 0 0 1 219.42857 150] CT
0.149 GC
/Helvetica 20 F
GS
[1 0 0 1 0 0] CT
-6 20 moveto 
1 -1 scale
(1) t 
GR
GR
GS
0.598 GC
N
/f-736874975{219.379 143.637 M
219.388 144.011 L
219.394 144.011 L
219.429 144.011 L
219.429 143.637 L
219.429 143.21 L
219.429 142.783 L
219.429 142.355 L
219.429 141.928 L
219.429 141.501 L
219.429 141.074 L
219.429 140.646 L
219.429 140.219 L
219.429 139.792 L
219.429 139.365 L
219.429 138.937 L
219.429 138.51 L
219.429 138.083 L
219.429 137.656 L
219.429 137.228 L
219.429 136.801 L
219.429 136.374 L
219.429 135.947 L
219.429 135.52 L
219.429 135.092 L
219.429 134.665 L
219.429 134.238 L
219.429 133.811 L
219.429 133.383 L
219.429 132.956 L
219.429 132.529 L
219.429 132.102 L
219.429 131.674 L
219.429 131.247 L
219.429 130.82 L
219.429 130.393 L
219.429 129.965 L
219.429 129.538 L
219.429 129.111 L
219.429 128.684 L
219.429 128.256 L
219.429 127.829 L
219.429 127.402 L
219.429 126.975 L
219.429 126.548 L
219.429 126.12 L
219.429 125.693 L
219.429 125.266 L
219.429 124.839 L
219.429 124.411 L
219.429 123.984 L
219.429 123.557 L
219.429 123.13 L
219.429 122.702 L
219.429 122.275 L
219.429 121.848 L
219.429 121.421 L
219.429 120.993 L
219.429 120.566 L
219.429 120.139 L
219.429 119.712 L
219.429 119.284 L
219.429 118.857 L
219.429 118.43 L
219.429 118.003 L
219.429 117.576 L
219.429 117.148 L
219.429 116.721 L
219.429 116.294 L
219.429 115.867 L
219.429 115.439 L
219.429 115.012 L
219.429 114.585 L
219.429 114.158 L
219.429 113.73 L
219.429 113.303 L
219.429 112.876 L
219.429 112.449 L
219.429 112.021 L
219.429 111.594 L
219.429 111.167 L
219.429 110.74 L
219.429 110.312 L
219.429 109.885 L
219.429 109.458 L
219.429 109.031 L
219.429 108.604 L
219.429 108.176 L
219.429 107.749 L
219.429 107.322 L
219.429 106.895 L
219.429 106.467 L
219.429 106.04 L
219.429 105.613 L
219.429 105.186 L
219.429 104.758 L
219.429 104.331 L
219.429 103.904 L
219.429 103.477 L
219.429 103.049 L
219.429 102.622 L
219.429 102.195 L
219.429 101.768 L
219.429 101.34 L
219.429 100.913 L
219.429 100.486 L
219.429 100.059 L
219.429 99.632 L
219.429 99.204 L
219.429 98.777 L
219.429 98.35 L
219.429 97.923 L
219.429 97.495 L
219.429 97.068 L
219.429 96.641 L
219.429 96.214 L
219.429 95.786 L
219.429 95.359 L
219.429 94.932 L
219.429 94.505 L
219.429 94.077 L
219.429 93.65 L
219.429 93.223 L
219.429 92.796 L
219.429 92.368 L
219.429 91.941 L
219.429 91.514 L
219.429 91.087 L
219.429 90.66 L
219.429 90.232 L
219.429 89.805 L
219.429 89.378 L
219.429 88.951 L
219.429 88.523 L
219.429 88.096 L
219.429 87.669 L
219.429 87.242 L
219.429 86.814 L
219.429 86.387 L
219.429 85.96 L
219.429 85.533 L
219.429 85.105 L
219.429 84.678 L
219.429 84.251 L
219.429 83.824 L
219.429 83.396 L
219.429 82.969 L
219.429 82.542 L
219.429 82.115 L
219.429 81.687 L
219.429 81.26 L
219.429 80.833 L
219.429 80.406 L
219.429 79.979 L
219.429 79.551 L
219.429 79.124 L
219.429 78.697 L
219.429 78.27 L
219.429 77.842 L
219.429 77.415 L
219.429 76.988 L
219.429 76.561 L
219.429 76.133 L
219.429 75.706 L
219.429 75.279 L
219.429 74.852 L
219.429 74.424 L
219.429 73.997 L
219.429 73.57 L
219.429 73.143 L
219.429 72.715 L
219.429 72.288 L
219.429 71.861 L
219.429 71.434 L
219.429 71.007 L
219.429 70.579 L
219.429 70.152 L
219.429 69.725 L
219.429 69.298 L
219.429 68.87 L
219.429 68.443 L
219.429 68.016 L
219.429 67.589 L
219.429 67.161 L
219.429 66.734 L
219.429 66.307 L
219.429 65.88 L
219.429 65.452 L
219.429 65.025 L
219.429 64.598 L
219.429 64.171 L
219.429 63.743 L
219.429 63.316 L
219.429 62.889 L
219.429 62.462 L
219.429 62.035 L
219.421 62.035 L
219.419 62.462 L
219.416 62.889 L
219.412 63.316 L
219.407 63.743 L
219.4 64.171 L
219.392 64.598 L
219.382 65.025 L
219.37 65.452 L
219.355 65.88 L
219.338 66.307 L
219.317 66.734 L
219.292 67.161 L
219.264 67.589 L
219.231 68.016 L
219.194 68.443 L
219.151 68.87 L
219.104 69.298 L
219.051 69.725 L
218.994 70.152 L
218.931 70.579 L
218.863 71.007 L
218.79 71.434 L
218.712 71.861 L
218.631 72.288 L
218.545 72.715 L
218.456 73.143 L
218.364 73.57 L
218.269 73.997 L
218.17 74.424 L
218.069 74.852 L
217.964 75.279 L
217.855 75.706 L
217.741 76.133 L
217.621 76.561 L
217.493 76.988 L
217.355 77.415 L
217.206 77.842 L
217.042 78.27 L
216.86 78.697 L
216.656 79.124 L
216.429 79.551 L
216.173 79.979 L
215.886 80.406 L
215.563 80.833 L
215.202 81.26 L
214.798 81.687 L
214.35 82.115 L
213.855 82.542 L
213.312 82.969 L
212.72 83.396 L
212.079 83.824 L
211.392 84.251 L
210.659 84.678 L
209.885 85.105 L
209.074 85.533 L
208.231 85.96 L
207.363 86.387 L
206.477 86.814 L
205.582 87.242 L
204.686 87.669 L
203.797 88.096 L
202.926 88.523 L
202.081 88.951 L
201.273 89.378 L
200.508 89.805 L
199.796 90.232 L
199.143 90.66 L
198.557 91.087 L
198.042 91.514 L
197.602 91.941 L
197.24 92.368 L
196.956 92.796 L
196.752 93.223 L
196.625 93.65 L
196.571 94.077 L
196.587 94.505 L
196.667 94.932 L
196.803 95.359 L
196.989 95.786 L
197.216 96.214 L
197.476 96.641 L
197.76 97.068 L
198.06 97.495 L
198.368 97.923 L
198.676 98.35 L
198.98 98.777 L
199.274 99.204 L
199.553 99.632 L
199.817 100.059 L
200.063 100.486 L
200.293 100.913 L
200.506 101.34 L
200.706 101.768 L
200.895 102.195 L
201.077 102.622 L
201.256 103.049 L
201.436 103.477 L
201.621 103.904 L
201.816 104.331 L
202.022 104.758 L
202.244 105.186 L
202.483 105.613 L
202.742 106.04 L
203.021 106.467 L
203.323 106.895 L
203.645 107.322 L
203.99 107.749 L
204.356 108.176 L
204.744 108.604 L
205.151 109.031 L
205.577 109.458 L
206.022 109.885 L
206.483 110.312 L
206.96 110.74 L
207.45 111.167 L
207.953 111.594 L
208.465 112.021 L
208.985 112.449 L
209.51 112.876 L
210.037 113.303 L
210.564 113.73 L
211.086 114.158 L
211.602 114.585 L
212.107 115.012 L
212.599 115.439 L
213.074 115.867 L
213.529 116.294 L
213.963 116.721 L
214.373 117.148 L
214.757 117.576 L
215.114 118.003 L
215.444 118.43 L
215.746 118.857 L
216.02 119.284 L
216.267 119.712 L
216.488 120.139 L
216.684 120.566 L
216.856 120.993 L
217.008 121.421 L
217.139 121.848 L
217.253 122.275 L
217.35 122.702 L
217.434 123.13 L
217.506 123.557 L
217.568 123.984 L
217.621 124.411 L
217.666 124.839 L
217.706 125.266 L
217.741 125.693 L
217.772 126.12 L
217.801 126.548 L
217.827 126.975 L
217.853 127.402 L
217.878 127.829 L
217.903 128.256 L
217.928 128.684 L
217.955 129.111 L
217.983 129.538 L
218.013 129.965 L
218.045 130.393 L
218.079 130.82 L
218.117 131.247 L
218.157 131.674 L
218.2 132.102 L
218.246 132.529 L
218.295 132.956 L
218.347 133.383 L
218.401 133.811 L
218.458 134.238 L
218.516 134.665 L
218.576 135.092 L
218.636 135.52 L
218.697 135.947 L
218.757 136.374 L
218.817 136.801 L
218.874 137.228 L
218.93 137.656 L
218.984 138.083 L
219.035 138.51 L
219.082 138.937 L
219.126 139.365 L
219.167 139.792 L
219.203 140.219 L
219.237 140.646 L
219.266 141.074 L
219.292 141.501 L
219.315 141.928 L
219.335 142.355 L
219.352 142.783 L
219.367 143.21 L
cp}def
f-736874975
f
GR
GS
[1 0 0 1 229.29478 92.26398] CT
0.598 GC
N
f1626255170
f
GR
GS
[1 0 0 1 225.30954 92.65346] CT
0.598 GC
N
f1626255170
f
GR
GS
[1 0 0 1 228.30116 111.19752] CT
0.598 GC
N
f1626255170
f
GR
GS
[1 0 0 1 228.79266 90.35143] CT
0.598 GC
N
f1626255170
f
GR
GS
[1 0 0 1 227.30371 109.38696] CT
0.598 GC
N
f1626255170
f
GR
GS
[1 0 0 1 226.60051 125.44676] CT
0.598 GC
N
f1626255170
f
GR
GS
[1 0 0 1 228.33307 91.0929] CT
0.598 GC
N
f1626255170
f
GR
GS
[1 0 0 1 229.45557 89.78663] CT
0.598 GC
N
f1626255170
f
GR
GS
[1 0 0 1 225.69388 93.52466] CT
0.598 GC
N
f1626255170
f
GR
GS
[1 0 0 1 227.52655 93.87733] CT
0.598 GC
N
f1626255170
f
GR
GS
[1 0 0 1 227.98195 108.23772] CT
0.598 GC
N
f1626255170
f
GR
GS
[1 0 0 1 230.04831 88.78948] CT
0.598 GC
N
f1626255170
f
GR
GS
[1 0 0 1 228.54437 102.72131] CT
0.598 GC
N
f1626255170
f
GR
GS
[1 0 0 1 228.7972 104.68603] CT
0.598 GC
N
f1626255170
f
GR
GS
[1 0 0 1 225.47652 93.92287] CT
0.598 GC
N
f1626255170
f
GR
GS
[1 0 0 1 227.91481 94.22137] CT
0.598 GC
N
f1626255170
f
GR
GS
[1 0 0 1 225.87962 91.37037] CT
0.598 GC
N
f1626255170
f
GR
GS
[1 0 0 1 228.98708 111.28078] CT
0.598 GC
N
f1626255170
f
GR
GS
[1 0 0 1 229.52582 89.24407] CT
0.598 GC
N
f1626255170
f
GR
GS
[1 0 0 1 225.84602 117.6978] CT
0.598 GC
N
f1626255170
f
GR
GS
[1 0 0 1 229.24651 88.10306] CT
0.598 GC
N
f1626255170
f
GR
GS
[1 0 0 1 229.04788 89.14706] CT
0.598 GC
N
f1626255170
f
GR
GS
[1 0 0 1 225.33522 100.80481] CT
0.598 GC
N
f1626255170
f
GR
GS
[1 0 0 1 230.45697 101.66283] CT
0.598 GC
N
f1626255170
f
GR
GS
[1 0 0 1 228.17892 122.43756] CT
0.598 GC
N
f1626255170
f
GR
GS
[1 0 0 1 226.30495 105.7967] CT
0.598 GC
N
f1626255170
f
GR
GS
[1 0 0 1 228.40121 91.0124] CT
0.598 GC
N
f1626255170
f
GR
GS
[1 0 0 1 229.08174 113.6266] CT
0.598 GC
N
f1626255170
f
GR
GS
[1 0 0 1 226.6544 86.48726] CT
0.598 GC
N
f1626255170
f
GR
GS
[1 0 0 1 227.62361 101.34908] CT
0.598 GC
N
f1626255170
f
GR
GS
[1 0 0 1 229.60794 105.26174] CT
0.598 GC
N
f1626255170
f
GR
GS
[1 0 0 1 230.41914 97.45435] CT
0.598 GC
N
f1626255170
f
GR
GS
[1 0 0 1 227.39452 107.01826] CT
0.598 GC
N
f1626255170
f
GR
GS
[1 0 0 1 227.37154 97.95233] CT
0.598 GC
N
f1626255170
f
GR
GS
[1 0 0 1 228.94905 96.95615] CT
0.598 GC
N
f1626255170
f
GR
GS
[1 0 0 1 230.59801 111.36679] CT
0.598 GC
N
f1626255170
f
GR
GS
[1 0 0 1 230.39188 95.97793] CT
0.598 GC
N
f1626255170
f
GR
GS
[1 0 0 1 227.24802 112.45406] CT
0.598 GC
N
f1626255170
f
GR
GS
[1 0 0 1 228.35944 96.28733] CT
0.598 GC
N
f1626255170
f
GR
GS
[1 0 0 1 229.71652 104.94498] CT
0.598 GC
N
f1626255170
f
GR
GS
[1 0 0 1 230.27609 88.8116] CT
0.598 GC
N
f1626255170
f
GR
GS
[1 0 0 1 230.42451 106.82224] CT
0.598 GC
N
f1626255170
f
GR
GS
[1 0 0 1 227.50337 90.78443] CT
0.598 GC
N
f1626255170
f
GR
GS
[1 0 0 1 226.30437 81.53524] CT
0.598 GC
N
f1626255170
f
GR
GS
[1 0 0 1 226.28589 94.08887] CT
0.598 GC
N
f1626255170
f
GR
GS
[1 0 0 1 225.15863 97.15241] CT
0.598 GC
N
f1626255170
f
GR
GS
[1 0 0 1 230.76314 116.88689] CT
0.598 GC
N
f1626255170
f
GR
GS
[1 0 0 1 230.40269 109.41096] CT
0.598 GC
N
f1626255170
f
GR
GS
[1 0 0 1 229.57782 112.07422] CT
0.598 GC
N
f1626255170
f
GR
GS
[1 0 0 1 229.6819 96.89764] CT
0.598 GC
N
f1626255170
f
GR
GS
[1 0 0 1 228.29514 103.76638] CT
0.598 GC
N
f1626255170
f
GR
GS
[1 0 0 1 229.2081 105.12881] CT
0.598 GC
N
f1626255170
f
GR
GS
[1 0 0 1 225.50064 102.96297] CT
0.598 GC
N
f1626255170
f
GR
GS
[1 0 0 1 225.49513 102.25906] CT
0.598 GC
N
f1626255170
f
GR
GS
[1 0 0 1 228.60788 98.54005] CT
0.598 GC
N
f1626255170
f
GR
GS
[1 0 0 1 226.55321 110.71037] CT
0.598 GC
N
f1626255170
f
GR
GS
[1 0 0 1 225.15335 94.22986] CT
0.598 GC
N
f1626255170
f
GR
GS
[1 0 0 1 229.5211 77.74693] CT
0.598 GC
N
f1626255170
f
GR
GS
[1 0 0 1 227.57388 112.82331] CT
0.598 GC
N
f1626255170
f
GR
GS
[1 0 0 1 230.7975 94.80785] CT
0.598 GC
N
f1626255170
f
GR
GS
[1 0 0 1 225.5443 95.80688] CT
0.598 GC
N
f1626255170
f
GR
GS
[1 0 0 1 225.85432 94.40096] CT
0.598 GC
N
f1626255170
f
GR
GS
[1 0 0 1 230.67665 93.44131] CT
0.598 GC
N
f1626255170
f
GR
GS
[1 0 0 1 230.15556 108.41245] CT
0.598 GC
N
f1626255170
f
GR
GS
[1 0 0 1 226.51639 83.04163] CT
0.598 GC
N
f1626255170
f
GR
GS
[1 0 0 1 228.09097 113.09077] CT
0.598 GC
N
f1626255170
f
GR
GS
[1 0 0 1 225.59299 90.58237] CT
0.598 GC
N
f1626255170
f
GR
GS
[1 0 0 1 228.77486 111.71494] CT
0.598 GC
N
f1626255170
f
GR
GS
[1 0 0 1 228.66403 106.12188] CT
0.598 GC
N
f1626255170
f
GR
GS
[1 0 0 1 229.02547 105.27213] CT
0.598 GC
N
f1626255170
f
GR
GS
[1 0 0 1 229.94058 105.4739] CT
0.598 GC
N
f1626255170
f
GR
GS
[1 0 0 1 229.53534 89.43317] CT
0.598 GC
N
f1626255170
f
GR
GS
[1 0 0 1 225.45509 93.383] CT
0.598 GC
N
f1626255170
f
GR
GS
[1 0 0 1 225.61136 93.37076] CT
0.598 GC
N
f1626255170
f
GR
GS
[1 0 0 1 228.24582 99.3715] CT
0.598 GC
N
f1626255170
f
GR
GS
[1 0 0 1 226.98354 103.8578] CT
0.598 GC
N
f1626255170
f
GR
GS
[1 0 0 1 226.53934 97.77528] CT
0.598 GC
N
f1626255170
f
GR
GS
[1 0 0 1 225.27043 93.57095] CT
0.598 GC
N
f1626255170
f
GR
GS
[1 0 0 1 226.11787 96.05472] CT
0.598 GC
N
f1626255170
f
GR
GS
[1 0 0 1 230.57687 95.64529] CT
0.598 GC
N
f1626255170
f
GR
GS
[1 0 0 1 227.07648 129.74829] CT
0.598 GC
N
f1626255170
f
GR
GS
[1 0 0 1 227.98784 96.36822] CT
0.598 GC
N
f1626255170
f
GR
GS
[1 0 0 1 227.25829 86.58691] CT
0.598 GC
N
f1626255170
f
GR
GS
[1 0 0 1 228.92131 93.26579] CT
0.598 GC
N
f1626255170
f
GR
GS
[1 0 0 1 227.80392 133.7063] CT
0.598 GC
N
f1626255170
f
GR
GS
[1 0 0 1 230.24416 101.02187] CT
0.598 GC
N
f1626255170
f
GR
GS
[1 0 0 1 226.62601 75.38321] CT
0.598 GC
N
f1626255170
f
GR
GS
[1 0 0 1 229.03023 101.72955] CT
0.598 GC
N
f1626255170
f
GR
GS
[1 0 0 1 228.17685 102.70477] CT
0.598 GC
N
f1626255170
f
GR
GS
[1 0 0 1 225.40689 87.04543] CT
0.598 GC
N
f1626255170
f
GR
GS
[1 0 0 1 229.01826 89.71203] CT
0.598 GC
N
f1626255170
f
GR
GS
[1 0 0 1 226.84755 108.25889] CT
0.598 GC
N
f1626255170
f
GR
GS
[1 0 0 1 225.74481 105.31876] CT
0.598 GC
N
f1626255170
f
GR
GS
[1 0 0 1 227.81439 100.38247] CT
0.598 GC
N
f1626255170
f
GR
GS
[1 0 0 1 229.04169 88.02565] CT
0.598 GC
N
f1626255170
f
GR
GS
[1 0 0 1 229.5999 89.65981] CT
0.598 GC
N
f1626255170
f
GR
GS
[1 0 0 1 229.87215 94.79843] CT
0.598 GC
N
f1626255170
f
GR
GS
[1 0 0 1 227.58899 91.93101] CT
0.598 GC
N
f1626255170
f
GR
GS
[1 0 0 1 228.02463 103.22597] CT
0.598 GC
N
f1626255170
f
GR
GS
0.598 GC
N
/f1965924702{265.133 134.765 M
265.136 135.192 L
265.143 135.192 L
265.143 134.765 L
265.143 134.338 L
265.143 133.91 L
265.143 133.483 L
265.143 133.056 L
265.143 132.629 L
265.143 132.201 L
265.143 131.774 L
265.143 131.347 L
265.143 130.92 L
265.143 130.492 L
265.143 130.065 L
265.143 129.638 L
265.143 129.211 L
265.143 128.783 L
265.143 128.356 L
265.143 127.929 L
265.143 127.502 L
265.143 127.074 L
265.143 126.647 L
265.143 126.22 L
265.143 125.793 L
265.143 125.366 L
265.143 124.938 L
265.143 124.511 L
265.143 124.084 L
265.143 123.657 L
265.143 123.229 L
265.143 122.802 L
265.143 122.375 L
265.143 121.948 L
265.143 121.52 L
265.143 121.093 L
265.143 120.666 L
265.143 120.239 L
265.143 119.811 L
265.143 119.384 L
265.143 118.957 L
265.143 118.53 L
265.143 118.102 L
265.143 117.675 L
265.143 117.248 L
265.143 116.821 L
265.143 116.394 L
265.143 115.966 L
265.143 115.539 L
265.143 115.112 L
265.143 114.685 L
265.143 114.257 L
265.143 113.83 L
265.143 113.403 L
265.143 112.976 L
265.143 112.548 L
265.143 112.121 L
265.143 111.694 L
265.143 111.267 L
265.143 110.839 L
265.143 110.412 L
265.143 109.985 L
265.143 109.558 L
265.143 109.13 L
265.143 108.703 L
265.143 108.276 L
265.143 107.849 L
265.143 107.422 L
265.143 106.994 L
265.143 106.567 L
265.143 106.14 L
265.143 105.713 L
265.143 105.285 L
265.143 104.858 L
265.143 104.431 L
265.143 104.004 L
265.143 103.576 L
265.143 103.149 L
265.143 102.722 L
265.143 102.295 L
265.143 101.867 L
265.143 101.44 L
265.143 101.013 L
265.143 100.586 L
265.143 100.158 L
265.143 99.731 L
265.143 99.304 L
265.143 98.877 L
265.143 98.45 L
265.143 98.022 L
265.143 97.595 L
265.143 97.168 L
265.143 96.741 L
265.143 96.313 L
265.143 95.886 L
265.143 95.459 L
265.143 95.032 L
265.143 94.604 L
265.143 94.177 L
265.143 93.75 L
265.143 93.323 L
265.143 92.895 L
265.143 92.468 L
265.143 92.041 L
265.143 91.614 L
265.143 91.186 L
265.143 90.759 L
265.143 90.332 L
265.143 89.905 L
265.143 89.478 L
265.143 89.05 L
265.143 88.623 L
265.143 88.196 L
265.143 87.769 L
265.143 87.341 L
265.143 86.914 L
265.143 86.487 L
265.143 86.06 L
265.143 85.632 L
265.143 85.205 L
265.143 84.778 L
265.143 84.351 L
265.143 83.923 L
265.143 83.496 L
265.143 83.069 L
265.143 82.642 L
265.143 82.214 L
265.143 81.787 L
265.143 81.36 L
265.143 80.933 L
265.143 80.505 L
265.143 80.078 L
265.143 79.651 L
265.143 79.224 L
265.143 78.797 L
265.143 78.369 L
265.143 77.942 L
265.143 77.515 L
265.143 77.088 L
265.143 76.66 L
265.143 76.233 L
265.143 75.806 L
265.143 75.379 L
265.143 74.951 L
265.143 74.524 L
265.143 74.097 L
265.143 73.67 L
265.143 73.242 L
265.143 72.815 L
265.143 72.388 L
265.143 71.961 L
265.143 71.534 L
265.143 71.106 L
265.143 70.679 L
265.143 70.252 L
265.143 69.825 L
265.143 69.397 L
265.143 68.97 L
265.143 68.543 L
265.143 68.116 L
265.143 67.688 L
265.143 67.261 L
265.143 66.834 L
265.143 66.407 L
265.143 65.979 L
265.143 65.552 L
265.143 65.125 L
265.143 64.698 L
265.143 64.27 L
265.143 63.843 L
265.143 63.416 L
265.143 62.989 L
265.143 62.561 L
265.143 62.134 L
265.143 61.707 L
265.143 61.28 L
265.143 60.853 L
265.143 60.425 L
265.143 59.998 L
265.143 59.571 L
265.143 59.144 L
265.143 58.716 L
265.143 58.289 L
265.143 57.862 L
265.143 57.435 L
265.143 57.007 L
265.143 56.58 L
265.143 56.153 L
265.143 55.726 L
265.143 55.298 L
265.143 54.871 L
265.143 54.444 L
265.143 54.017 L
265.143 53.989 L
265.085 53.989 L
265.082 53.989 L
265.081 54.017 L
265.066 54.444 L
265.049 54.871 L
265.03 55.298 L
265.007 55.726 L
264.981 56.153 L
264.951 56.58 L
264.918 57.007 L
264.881 57.435 L
264.84 57.862 L
264.796 58.289 L
264.749 58.716 L
264.698 59.144 L
264.645 59.571 L
264.589 59.998 L
264.531 60.425 L
264.471 60.853 L
264.411 61.28 L
264.35 61.707 L
264.29 62.134 L
264.23 62.561 L
264.172 62.989 L
264.115 63.416 L
264.061 63.843 L
264.009 64.27 L
263.96 64.698 L
263.914 65.125 L
263.871 65.552 L
263.831 65.979 L
263.794 66.407 L
263.759 66.834 L
263.727 67.261 L
263.697 67.688 L
263.669 68.116 L
263.643 68.543 L
263.617 68.97 L
263.592 69.397 L
263.567 69.825 L
263.542 70.252 L
263.515 70.679 L
263.486 71.106 L
263.455 71.534 L
263.42 71.961 L
263.38 72.388 L
263.335 72.815 L
263.282 73.242 L
263.22 73.67 L
263.149 74.097 L
263.065 74.524 L
262.967 74.951 L
262.853 75.379 L
262.722 75.806 L
262.571 76.233 L
262.398 76.66 L
262.202 77.088 L
261.981 77.515 L
261.734 77.942 L
261.46 78.369 L
261.158 78.797 L
260.828 79.224 L
260.471 79.651 L
260.087 80.078 L
259.677 80.505 L
259.243 80.933 L
258.788 81.36 L
258.313 81.787 L
257.821 82.214 L
257.316 82.642 L
256.801 83.069 L
256.278 83.496 L
255.751 83.923 L
255.224 84.351 L
254.699 84.778 L
254.179 85.205 L
253.667 85.632 L
253.164 86.06 L
252.674 86.487 L
252.197 86.914 L
251.736 87.341 L
251.292 87.769 L
250.865 88.196 L
250.458 88.623 L
250.071 89.05 L
249.704 89.478 L
249.36 89.905 L
249.037 90.332 L
248.736 90.759 L
248.456 91.186 L
248.198 91.614 L
247.958 92.041 L
247.736 92.468 L
247.53 92.895 L
247.336 93.323 L
247.15 93.75 L
246.97 94.177 L
246.791 94.604 L
246.609 95.032 L
246.42 95.459 L
246.22 95.886 L
246.007 96.313 L
245.778 96.741 L
245.531 97.168 L
245.268 97.595 L
244.988 98.022 L
244.694 98.45 L
244.391 98.877 L
244.082 99.304 L
243.774 99.731 L
243.474 100.158 L
243.19 100.586 L
242.931 101.013 L
242.704 101.44 L
242.518 101.867 L
242.381 102.295 L
242.302 102.722 L
242.286 103.149 L
242.339 103.576 L
242.466 104.004 L
242.671 104.431 L
242.954 104.858 L
243.316 105.285 L
243.756 105.713 L
244.271 106.14 L
244.857 106.567 L
245.51 106.994 L
246.222 107.422 L
246.987 107.849 L
247.796 108.276 L
248.64 108.703 L
249.511 109.13 L
250.4 109.558 L
251.296 109.985 L
252.192 110.412 L
253.077 110.839 L
253.945 111.267 L
254.788 111.694 L
255.599 112.121 L
256.373 112.548 L
257.106 112.976 L
257.794 113.403 L
258.434 113.83 L
259.026 114.257 L
259.569 114.685 L
260.064 115.112 L
260.512 115.539 L
260.916 115.966 L
261.277 116.394 L
261.6 116.821 L
261.888 117.248 L
262.143 117.675 L
262.371 118.102 L
262.574 118.53 L
262.756 118.957 L
262.92 119.384 L
263.07 119.811 L
263.207 120.239 L
263.335 120.666 L
263.455 121.093 L
263.569 121.52 L
263.678 121.948 L
263.783 122.375 L
263.884 122.802 L
263.983 123.229 L
264.078 123.657 L
264.171 124.084 L
264.26 124.511 L
264.345 124.938 L
264.427 125.366 L
264.504 125.793 L
264.577 126.22 L
264.645 126.647 L
264.708 127.074 L
264.766 127.502 L
264.818 127.929 L
264.866 128.356 L
264.908 128.783 L
264.945 129.211 L
264.978 129.638 L
265.007 130.065 L
265.031 130.492 L
265.052 130.92 L
265.07 131.347 L
265.084 131.774 L
265.096 132.201 L
265.106 132.629 L
265.114 133.056 L
265.121 133.483 L
265.126 133.91 L
265.13 134.338 L
cp}def
f1965924702
f
GR
GS
[1 0 0 1 274.48126 104.96257] CT
0.598 GC
N
f1626255170
f
GR
GS
[1 0 0 1 275.00974 104.57309] CT
0.598 GC
N
f1626255170
f
GR
GS
[1 0 0 1 273.21692 86.02904] CT
0.598 GC
N
f1626255170
f
GR
GS
[1 0 0 1 272.89325 106.87512] CT
0.598 GC
N
f1626255170
f
GR
GS
[1 0 0 1 272.69455 87.83958] CT
0.598 GC
N
f1626255170
f
GR
GS
[1 0 0 1 273.49966 71.77979] CT
0.598 GC
N
f1626255170
f
GR
GS
[1 0 0 1 274.6517 106.13362] CT
0.598 GC
N
f1626255170
f
GR
GS
[1 0 0 1 274.54855 107.43992] CT
0.598 GC
N
f1626255170
f
GR
GS
[1 0 0 1 272.8222 103.70187] CT
0.598 GC
N
f1626255170
f
GR
GS
[1 0 0 1 274.22504 103.34921] CT
0.598 GC
N
f1626255170
f
GR
GS
[1 0 0 1 275.69537 88.98882] CT
0.598 GC
N
f1626255170
f
GR
GS
[1 0 0 1 271.87396 108.43707] CT
0.598 GC
N
f1626255170
f
GR
GS
[1 0 0 1 272.55173 94.50523] CT
0.598 GC
N
f1626255170
f
GR
GS
[1 0 0 1 271.11893 92.54053] CT
0.598 GC
N
f1626255170
f
GR
GS
[1 0 0 1 275.42844 103.30367] CT
0.598 GC
N
f1626255170
f
GR
GS
[1 0 0 1 275.40625 103.00517] CT
0.598 GC
N
f1626255170
f
GR
GS
[1 0 0 1 273.11835 105.85619] CT
0.598 GC
N
f1626255170
f
GR
GS
[1 0 0 1 272.68533 85.94577] CT
0.598 GC
N
f1626255170
f
GR
GS
[1 0 0 1 276.52505 107.98248] CT
0.598 GC
N
f1626255170
f
GR
GS
[1 0 0 1 274.00522 79.52875] CT
0.598 GC
N
f1626255170
f
GR
GS
[1 0 0 1 270.94046 109.12349] CT
0.598 GC
N
f1626255170
f
GR
GS
[1 0 0 1 275.76672 108.0795] CT
0.598 GC
N
f1626255170
f
GR
GS
[1 0 0 1 274.25034 96.42174] CT
0.598 GC
N
f1626255170
f
GR
GS
[1 0 0 1 275.77927 95.56371] CT
0.598 GC
N
f1626255170
f
GR
GS
[1 0 0 1 275.29742 74.78899] CT
0.598 GC
N
f1626255170
f
GR
GS
[1 0 0 1 271.45657 91.42986] CT
0.598 GC
N
f1626255170
f
GR
GS
[1 0 0 1 273.10968 106.21415] CT
0.598 GC
N
f1626255170
f
GR
GS
[1 0 0 1 276.4342 83.59995] CT
0.598 GC
N
f1626255170
f
GR
GS
[1 0 0 1 273.77423 110.73927] CT
0.598 GC
N
f1626255170
f
GR
GS
[1 0 0 1 273.10553 95.87745] CT
0.598 GC
N
f1626255170
f
GR
GS
[1 0 0 1 274.03009 91.96481] CT
0.598 GC
N
f1626255170
f
GR
GS
[1 0 0 1 276.43106 99.77218] CT
0.598 GC
N
f1626255170
f
GR
GS
[1 0 0 1 273.4165 90.2083] CT
0.598 GC
N
f1626255170
f
GR
GS
[1 0 0 1 275.79474 99.27422] CT
0.598 GC
N
f1626255170
f
GR
GS
[1 0 0 1 271.67386 100.27037] CT
0.598 GC
N
f1626255170
f
GR
GS
[1 0 0 1 271.40387 85.85976] CT
0.598 GC
N
f1626255170
f
GR
GS
[1 0 0 1 272.84418 101.24863] CT
0.598 GC
N
f1626255170
f
GR
GS
[1 0 0 1 271.27286 84.77249] CT
0.598 GC
N
f1626255170
f
GR
GS
[1 0 0 1 273.96823 100.93922] CT
0.598 GC
N
f1626255170
f
GR
GS
[1 0 0 1 276.37369 92.28156] CT
0.598 GC
N
f1626255170
f
GR
GS
[1 0 0 1 272.46384 108.41495] CT
0.598 GC
N
f1626255170
f
GR
GS
[1 0 0 1 271.31506 90.40431] CT
0.598 GC
N
f1626255170
f
GR
GS
[1 0 0 1 271.69031 106.44212] CT
0.598 GC
N
f1626255170
f
GR
GS
[1 0 0 1 271.78882 115.69128] CT
0.598 GC
N
f1626255170
f
GR
GS
[1 0 0 1 273.93472 103.13767] CT
0.598 GC
N
f1626255170
f
GR
GS
[1 0 0 1 273.53693 100.07413] CT
0.598 GC
N
f1626255170
f
GR
GS
[1 0 0 1 272.37323 80.33965] CT
0.598 GC
N
f1626255170
f
GR
GS
[1 0 0 1 274.71164 87.81558] CT
0.598 GC
N
f1626255170
f
GR
GS
[1 0 0 1 271.56882 85.15233] CT
0.598 GC
N
f1626255170
f
GR
GS
[1 0 0 1 272.29581 100.3289] CT
0.598 GC
N
f1626255170
f
GR
GS
[1 0 0 1 274.22382 93.46017] CT
0.598 GC
N
f1626255170
f
GR
GS
[1 0 0 1 272.8634 92.09774] CT
0.598 GC
N
f1626255170
f
GR
GS
[1 0 0 1 273.84442 94.26357] CT
0.598 GC
N
f1626255170
f
GR
GS
[1 0 0 1 272.7724 94.96748] CT
0.598 GC
N
f1626255170
f
GR
GS
[1 0 0 1 270.99164 98.68648] CT
0.598 GC
N
f1626255170
f
GR
GS
[1 0 0 1 273.15247 86.51618] CT
0.598 GC
N
f1626255170
f
GR
GS
[1 0 0 1 273.74106 102.99669] CT
0.598 GC
N
f1626255170
f
GR
GS
[1 0 0 1 271.59766 119.47962] CT
0.598 GC
N
f1626255170
f
GR
GS
[1 0 0 1 274.35983 84.40322] CT
0.598 GC
N
f1626255170
f
GR
GS
[1 0 0 1 276.36261 102.4187] CT
0.598 GC
N
f1626255170
f
GR
GS
[1 0 0 1 271.36948 101.41967] CT
0.598 GC
N
f1626255170
f
GR
GS
[1 0 0 1 272.62094 102.82558] CT
0.598 GC
N
f1626255170
f
GR
GS
[1 0 0 1 273.88123 103.78522] CT
0.598 GC
N
f1626255170
f
GR
GS
[1 0 0 1 273.41379 88.8141] CT
0.598 GC
N
f1626255170
f
GR
GS
[1 0 0 1 276.22836 114.18492] CT
0.598 GC
N
f1626255170
f
GR
GS
[1 0 0 1 274.97775 84.13575] CT
0.598 GC
N
f1626255170
f
GR
GS
[1 0 0 1 275.07361 106.64416] CT
0.598 GC
N
f1626255170
f
GR
GS
[1 0 0 1 274.50934 85.5116] CT
0.598 GC
N
f1626255170
f
GR
GS
[1 0 0 1 271.05893 91.10467] CT
0.598 GC
N
f1626255170
f
GR
GS
[1 0 0 1 274.52353 91.95439] CT
0.598 GC
N
f1626255170
f
GR
GS
[1 0 0 1 272.67767 91.75263] CT
0.598 GC
N
f1626255170
f
GR
GS
[1 0 0 1 271.43488 107.79335] CT
0.598 GC
N
f1626255170
f
GR
GS
[1 0 0 1 271.31989 103.84353] CT
0.598 GC
N
f1626255170
f
GR
GS
[1 0 0 1 276.01227 103.85579] CT
0.598 GC
N
f1626255170
f
GR
GS
[1 0 0 1 272.30136 97.85503] CT
0.598 GC
N
f1626255170
f
GR
GS
[1 0 0 1 273.68518 93.36875] CT
0.598 GC
N
f1626255170
f
GR
GS
[1 0 0 1 273.07492 99.45125] CT
0.598 GC
N
f1626255170
f
GR
GS
[1 0 0 1 272.36359 103.65558] CT
0.598 GC
N
f1626255170
f
GR
GS
[1 0 0 1 272.36066 101.17184] CT
0.598 GC
N
f1626255170
f
GR
GS
[1 0 0 1 274.85443 101.58126] CT
0.598 GC
N
f1626255170
f
GR
GS
[1 0 0 1 271.18134 67.47826] CT
0.598 GC
N
f1626255170
f
GR
GS
[1 0 0 1 275.36411 100.85833] CT
0.598 GC
N
f1626255170
f
GR
GS
[1 0 0 1 272.52744 110.63963] CT
0.598 GC
N
f1626255170
f
GR
GS
[1 0 0 1 275.65393 103.96075] CT
0.598 GC
N
f1626255170
f
GR
GS
[1 0 0 1 273.6265 63.52026] CT
0.598 GC
N
f1626255170
f
GR
GS
[1 0 0 1 272.19131 96.20468] CT
0.598 GC
N
f1626255170
f
GR
GS
[1 0 0 1 272.11734 121.84334] CT
0.598 GC
N
f1626255170
f
GR
GS
[1 0 0 1 272.65305 95.49699] CT
0.598 GC
N
f1626255170
f
GR
GS
[1 0 0 1 276.54529 94.52178] CT
0.598 GC
N
f1626255170
f
GR
GS
[1 0 0 1 271.9379 110.18111] CT
0.598 GC
N
f1626255170
f
GR
GS
[1 0 0 1 275.7171 107.51453] CT
0.598 GC
N
f1626255170
f
GR
GS
[1 0 0 1 275.67944 88.96764] CT
0.598 GC
N
f1626255170
f
GR
GS
[1 0 0 1 273.8761 91.90778] CT
0.598 GC
N
f1626255170
f
GR
GS
[1 0 0 1 274.6564 96.84406] CT
0.598 GC
N
f1626255170
f
GR
GS
[1 0 0 1 272.96924 109.2009] CT
0.598 GC
N
f1626255170
f
GR
GS
[1 0 0 1 272.67108 107.56672] CT
0.598 GC
N
f1626255170
f
GR
GS
[1 0 0 1 275.48758 102.42812] CT
0.598 GC
N
f1626255170
f
GR
GS
[1 0 0 1 271.44357 105.29554] CT
0.598 GC
N
f1626255170
f
GR
GS
[1 0 0 1 272.07294 94.00058] CT
0.598 GC
N
f1626255170
f
GR
GS
0.2 GC
1 LJ
4 LW
N
219.429 99.636 M
265.143 97.59 L
S
GR
GS
[1 0 0 1 219.42857 99.63626] CT
0.2 GC
N
f881756500
f
GR
GS
[1 0 0 1 219.42857 99.63626] CT
10.0 ML
2 LW
N
7.071 0 M
7.071 -3.905 3.905 -7.071 0 -7.071 C
-3.905 -7.071 -7.071 -3.905 -7.071 0 C
-7.071 3.905 -3.905 7.071 0 7.071 C
3.905 7.071 7.071 3.905 7.071 0 C
S
GR
GS
[1 0 0 1 265.14285 97.59029] CT
0.2 GC
N
f881756500
f
GR
GS
[1 0 0 1 265.14285 97.59029] CT
10.0 ML
2 LW
N
7.071 0 M
7.071 -3.905 3.905 -7.071 0 -7.071 C
-3.905 -7.071 -7.071 -3.905 -7.071 0 C
-7.071 3.905 -3.905 7.071 0 7.071 C
3.905 7.071 7.071 3.905 7.071 0 C
S
GR
%%Trailer
%%Pages: 1
%%EOF
