%!PS-Adobe-3.0 EPSF-3.0
%%Creator: (MATLAB, The Mathworks, Inc. Version 9.3.0.713579 \(R2017b\). Operating System: Mac OS X)
%%Title: /Volumes/LNDG/Projects/StateSwitch/dynamic/data/eeg/rest/B_analyses/F_periRhythmMSE/C_figures/E_FFT_low.eps
%%CreationDate: 2020-03-17T18:27:21
%%Pages: (atend)
%%BoundingBox:     4     0   407   340
%%LanguageLevel: 3
%%EndComments
%%BeginProlog
%%BeginResource: procset (Apache XML Graphics Std ProcSet) 1.2 0
%%Version: 1.2 0
%%Copyright: (Copyright 2001-2003,2010 The Apache Software Foundation. License terms: http://www.apache.org/licenses/LICENSE-2.0)
/bd{bind def}bind def
/ld{load def}bd
/GR/grestore ld
/GS/gsave ld
/RM/rmoveto ld
/C/curveto ld
/t/show ld
/L/lineto ld
/ML/setmiterlimit ld
/CT/concat ld
/f/fill ld
/N/newpath ld
/S/stroke ld
/CC/setcmykcolor ld
/A/ashow ld
/cp/closepath ld
/RC/setrgbcolor ld
/LJ/setlinejoin ld
/GC/setgray ld
/LW/setlinewidth ld
/M/moveto ld
/re {4 2 roll M
1 index 0 rlineto
0 exch rlineto
neg 0 rlineto
cp } bd
/_ctm matrix def
/_tm matrix def
/BT { _ctm currentmatrix pop matrix _tm copy pop 0 0 moveto } bd
/ET { _ctm setmatrix } bd
/iTm { _ctm setmatrix _tm concat } bd
/Tm { _tm astore pop iTm 0 0 moveto } bd
/ux 0.0 def
/uy 0.0 def
/F {
  /Tp exch def
  /Tf exch def
  Tf findfont Tp scalefont setfont
  /cf Tf def  /cs Tp def
} bd
/ULS {currentpoint /uy exch def /ux exch def} bd
/ULE {
  /Tcx currentpoint pop def
  gsave
  newpath
  cf findfont cs scalefont dup
  /FontMatrix get 0 get /Ts exch def /FontInfo get dup
  /UnderlinePosition get Ts mul /To exch def
  /UnderlineThickness get Ts mul /Tt exch def
  ux uy To add moveto  Tcx uy To add lineto
  Tt setlinewidth stroke
  grestore
} bd
/OLE {
  /Tcx currentpoint pop def
  gsave
  newpath
  cf findfont cs scalefont dup
  /FontMatrix get 0 get /Ts exch def /FontInfo get dup
  /UnderlinePosition get Ts mul /To exch def
  /UnderlineThickness get Ts mul /Tt exch def
  ux uy To add cs add moveto Tcx uy To add cs add lineto
  Tt setlinewidth stroke
  grestore
} bd
/SOE {
  /Tcx currentpoint pop def
  gsave
  newpath
  cf findfont cs scalefont dup
  /FontMatrix get 0 get /Ts exch def /FontInfo get dup
  /UnderlinePosition get Ts mul /To exch def
  /UnderlineThickness get Ts mul /Tt exch def
  ux uy To add cs 10 mul 26 idiv add moveto Tcx uy To add cs 10 mul 26 idiv add lineto
  Tt setlinewidth stroke
  grestore
} bd
/QT {
/Y22 exch store
/X22 exch store
/Y21 exch store
/X21 exch store
currentpoint
/Y21 load 2 mul add 3 div exch
/X21 load 2 mul add 3 div exch
/X21 load 2 mul /X22 load add 3 div
/Y21 load 2 mul /Y22 load add 3 div
/X22 load /Y22 load curveto
} bd
/SSPD {
dup length /d exch dict def
{
/v exch def
/k exch def
currentpagedevice k known {
/cpdv currentpagedevice k get def
v cpdv ne {
/upd false def
/nullv v type /nulltype eq def
/nullcpdv cpdv type /nulltype eq def
nullv nullcpdv or
{
/upd true def
} {
/sametype v type cpdv type eq def
sametype {
v type /arraytype eq {
/vlen v length def
/cpdvlen cpdv length def
vlen cpdvlen eq {
0 1 vlen 1 sub {
/i exch def
/obj v i get def
/cpdobj cpdv i get def
obj cpdobj ne {
/upd true def
exit
} if
} for
} {
/upd true def
} ifelse
} {
v type /dicttype eq {
v {
/dv exch def
/dk exch def
/cpddv cpdv dk get def
dv cpddv ne {
/upd true def
exit
} if
} forall
} {
/upd true def
} ifelse
} ifelse
} if
} ifelse
upd true eq {
d k v put
} if
} if
} if
} forall
d length 0 gt {
d setpagedevice
} if
} bd
/RE { % /NewFontName [NewEncodingArray] /FontName RE -
  findfont dup length dict begin
  {
    1 index /FID ne
    {def} {pop pop} ifelse
  } forall
  /Encoding exch def
  /FontName 1 index def
  currentdict definefont pop
  end
} bind def
%%EndResource
%%BeginResource: procset (Apache XML Graphics EPS ProcSet) 1.0 0
%%Version: 1.0 0
%%Copyright: (Copyright 2002-2003 The Apache Software Foundation. License terms: http://www.apache.org/licenses/LICENSE-2.0)
/BeginEPSF { %def
/b4_Inc_state save def         % Save state for cleanup
/dict_count countdictstack def % Count objects on dict stack
/op_count count 1 sub def      % Count objects on operand stack
userdict begin                 % Push userdict on dict stack
/showpage { } def              % Redefine showpage, { } = null proc
0 setgray 0 setlinecap         % Prepare graphics state
1 setlinewidth 0 setlinejoin
10 setmiterlimit [ ] 0 setdash newpath
/languagelevel where           % If level not equal to 1 then
{pop languagelevel             % set strokeadjust and
1 ne                           % overprint to their defaults.
{false setstrokeadjust false setoverprint
} if
} if
} bd
/EndEPSF { %def
count op_count sub {pop} repeat            % Clean up stacks
countdictstack dict_count sub {end} repeat
b4_Inc_state restore
} bd
%%EndResource
%FOPBeginFontDict
%%IncludeResource: font Courier-Oblique
%%IncludeResource: font Courier-BoldOblique
%%IncludeResource: font Courier-Bold
%%IncludeResource: font ZapfDingbats
%%IncludeResource: font Symbol
%%IncludeResource: font Helvetica
%%IncludeResource: font Helvetica-Oblique
%%IncludeResource: font Helvetica-Bold
%%IncludeResource: font Helvetica-BoldOblique
%%IncludeResource: font Times-Roman
%%IncludeResource: font Times-Italic
%%IncludeResource: font Times-Bold
%%IncludeResource: font Times-BoldItalic
%%IncludeResource: font Courier
%FOPEndFontDict
%%BeginResource: encoding WinAnsiEncoding
/WinAnsiEncoding [
/.notdef /.notdef /.notdef /.notdef /.notdef
/.notdef /.notdef /.notdef /.notdef /.notdef
/.notdef /.notdef /.notdef /.notdef /.notdef
/.notdef /.notdef /.notdef /.notdef /.notdef
/.notdef /.notdef /.notdef /.notdef /.notdef
/.notdef /.notdef /.notdef /.notdef /.notdef
/.notdef /.notdef /space /exclam /quotedbl
/numbersign /dollar /percent /ampersand /quotesingle
/parenleft /parenright /asterisk /plus /comma
/hyphen /period /slash /zero /one
/two /three /four /five /six
/seven /eight /nine /colon /semicolon
/less /equal /greater /question /at
/A /B /C /D /E
/F /G /H /I /J
/K /L /M /N /O
/P /Q /R /S /T
/U /V /W /X /Y
/Z /bracketleft /backslash /bracketright /asciicircum
/underscore /quoteleft /a /b /c
/d /e /f /g /h
/i /j /k /l /m
/n /o /p /q /r
/s /t /u /v /w
/x /y /z /braceleft /bar
/braceright /asciitilde /bullet /Euro /bullet
/quotesinglbase /florin /quotedblbase /ellipsis /dagger
/daggerdbl /circumflex /perthousand /Scaron /guilsinglleft
/OE /bullet /Zcaron /bullet /bullet
/quoteleft /quoteright /quotedblleft /quotedblright /bullet
/endash /emdash /asciitilde /trademark /scaron
/guilsinglright /oe /bullet /zcaron /Ydieresis
/space /exclamdown /cent /sterling /currency
/yen /brokenbar /section /dieresis /copyright
/ordfeminine /guillemotleft /logicalnot /sfthyphen /registered
/macron /degree /plusminus /twosuperior /threesuperior
/acute /mu /paragraph /middot /cedilla
/onesuperior /ordmasculine /guillemotright /onequarter /onehalf
/threequarters /questiondown /Agrave /Aacute /Acircumflex
/Atilde /Adieresis /Aring /AE /Ccedilla
/Egrave /Eacute /Ecircumflex /Edieresis /Igrave
/Iacute /Icircumflex /Idieresis /Eth /Ntilde
/Ograve /Oacute /Ocircumflex /Otilde /Odieresis
/multiply /Oslash /Ugrave /Uacute /Ucircumflex
/Udieresis /Yacute /Thorn /germandbls /agrave
/aacute /acircumflex /atilde /adieresis /aring
/ae /ccedilla /egrave /eacute /ecircumflex
/edieresis /igrave /iacute /icircumflex /idieresis
/eth /ntilde /ograve /oacute /ocircumflex
/otilde /odieresis /divide /oslash /ugrave
/uacute /ucircumflex /udieresis /yacute /thorn
/ydieresis
] def
%%EndResource
%FOPBeginFontReencode
/Courier-Oblique findfont
dup length dict begin
  {1 index /FID ne {def} {pop pop} ifelse} forall
  /Encoding WinAnsiEncoding def
  currentdict
end
/Courier-Oblique exch definefont pop
/Courier-BoldOblique findfont
dup length dict begin
  {1 index /FID ne {def} {pop pop} ifelse} forall
  /Encoding WinAnsiEncoding def
  currentdict
end
/Courier-BoldOblique exch definefont pop
/Courier-Bold findfont
dup length dict begin
  {1 index /FID ne {def} {pop pop} ifelse} forall
  /Encoding WinAnsiEncoding def
  currentdict
end
/Courier-Bold exch definefont pop
/Helvetica findfont
dup length dict begin
  {1 index /FID ne {def} {pop pop} ifelse} forall
  /Encoding WinAnsiEncoding def
  currentdict
end
/Helvetica exch definefont pop
/Helvetica-Oblique findfont
dup length dict begin
  {1 index /FID ne {def} {pop pop} ifelse} forall
  /Encoding WinAnsiEncoding def
  currentdict
end
/Helvetica-Oblique exch definefont pop
/Helvetica-Bold findfont
dup length dict begin
  {1 index /FID ne {def} {pop pop} ifelse} forall
  /Encoding WinAnsiEncoding def
  currentdict
end
/Helvetica-Bold exch definefont pop
/Helvetica-BoldOblique findfont
dup length dict begin
  {1 index /FID ne {def} {pop pop} ifelse} forall
  /Encoding WinAnsiEncoding def
  currentdict
end
/Helvetica-BoldOblique exch definefont pop
/Times-Roman findfont
dup length dict begin
  {1 index /FID ne {def} {pop pop} ifelse} forall
  /Encoding WinAnsiEncoding def
  currentdict
end
/Times-Roman exch definefont pop
/Times-Italic findfont
dup length dict begin
  {1 index /FID ne {def} {pop pop} ifelse} forall
  /Encoding WinAnsiEncoding def
  currentdict
end
/Times-Italic exch definefont pop
/Times-Bold findfont
dup length dict begin
  {1 index /FID ne {def} {pop pop} ifelse} forall
  /Encoding WinAnsiEncoding def
  currentdict
end
/Times-Bold exch definefont pop
/Times-BoldItalic findfont
dup length dict begin
  {1 index /FID ne {def} {pop pop} ifelse} forall
  /Encoding WinAnsiEncoding def
  currentdict
end
/Times-BoldItalic exch definefont pop
/Courier findfont
dup length dict begin
  {1 index /FID ne {def} {pop pop} ifelse} forall
  /Encoding WinAnsiEncoding def
  currentdict
end
/Courier exch definefont pop
%FOPEndFontReencode
%%EndProlog
%%Page: 1 1
%%PageBoundingBox: 0 0 384 360
%%BeginPageSetup
[1 0 0 -1 0 360] CT
%%EndPageSetup
GS
1 GC
N
0 0 384 360 re
f
GR
GS
1 GC
N
0 0 384 360 re
f
GR
GS
1 GC
N
69 305 M
347.5 305 L
347.5 27 L
69 27 L
cp
f
GR
GS
0.149 GC
2 setlinecap
1 LJ
0.5 LW
N
69 305 M
347.5 305 L
S
GR
GS
0.149 GC
2 setlinecap
1 LJ
0.5 LW
N
102.47 305 M
102.47 302.215 L
S
GR
GS
0.149 GC
2 setlinecap
1 LJ
0.5 LW
N
186.577 305 M
186.577 302.215 L
S
GR
GS
0.149 GC
2 setlinecap
1 LJ
0.5 LW
N
270.685 305 M
270.685 302.215 L
S
GR
GS
[1 0 0 1 102.46976 310.99997] CT
0.149 GC
/Helvetica 20 F
GS
[1 0 0 1 0 0] CT
-14 20 moveto 
1 -1 scale
(0.5) t 
GR
GR
GS
[1 0 0 1 186.57729 310.99997] CT
0.149 GC
/Helvetica 20 F
GS
[1 0 0 1 0 0] CT
-6 20 moveto 
1 -1 scale
(1) t 
GR
GR
GS
[1 0 0 1 270.68481 310.99997] CT
0.149 GC
/Helvetica 20 F
GS
[1 0 0 1 0 0] CT
-14 20 moveto 
1 -1 scale
(1.5) t 
GR
GR
GS
[1 0 0 1 208.25014 336] CT
0.149 GC
/Helvetica 20 F
GS
[1 0 0 1 0 0] CT
-95 20 moveto 
1 -1 scale
(Frequency [log10 Hz]) t 
GR
GR
GS
0.149 GC
2 setlinecap
1 LJ
0.5 LW
N
69 305 M
69 27 L
S
GR
GS
0.149 GC
2 setlinecap
1 LJ
0.5 LW
N
69 305 M
71.785 305 L
S
GR
GS
0.149 GC
2 setlinecap
1 LJ
0.5 LW
N
69 235.5 M
71.785 235.5 L
S
GR
GS
0.149 GC
2 setlinecap
1 LJ
0.5 LW
N
69 166 M
71.785 166 L
S
GR
GS
0.149 GC
2 setlinecap
1 LJ
0.5 LW
N
69 96.5 M
71.785 96.5 L
S
GR
GS
0.149 GC
2 setlinecap
1 LJ
0.5 LW
N
69 27 M
71.785 27 L
S
GR
GS
[1 0 0 1 63 305] CT
0.149 GC
/Helvetica 20 F
GS
[1 0 0 1 0 0] CT
-36 7.5 moveto 
1 -1 scale
(-8.5) t 
GR
GR
GS
[1 0 0 1 63 235.5] CT
0.149 GC
/Helvetica 20 F
GS
[1 0 0 1 0 0] CT
-19 7.5 moveto 
1 -1 scale
(-8) t 
GR
GR
GS
[1 0 0 1 63 166] CT
0.149 GC
/Helvetica 20 F
GS
[1 0 0 1 0 0] CT
-36 7.5 moveto 
1 -1 scale
(-7.5) t 
GR
GR
GS
[1 0 0 1 63 96.5] CT
0.149 GC
/Helvetica 20 F
GS
[1 0 0 1 0 0] CT
-19 7.5 moveto 
1 -1 scale
(-7) t 
GR
GR
GS
[1 0 0 1 63 27] CT
0.149 GC
/Helvetica 20 F
GS
[1 0 0 1 0 0] CT
-36 7.5 moveto 
1 -1 scale
(-6.5) t 
GR
GR
GS
[0 -1 1 0 24 165.99986] CT
0.149 GC
/Helvetica 20 F
GS
[1 0 0 1 0 0] CT
-56.5 -5 moveto 
1 -1 scale
(log10 Power) t 
GR
GR
GS
1 LJ
4 LW
N
69 94.086 M
75.963 95.302 L
82.319 98.594 L
88.167 103.356 L
93.581 108.845 L
101.017 116.696 L
107.765 122.369 L
113.942 125.721 L
119.638 128.246 L
126.601 132.67 L
132.957 137.659 L
138.805 139.903 L
145.512 138.639 L
151.654 138.85 L
157.32 140.411 L
163.586 135.942 L
170.276 130.553 L
176.404 133.962 L
182.83 128.721 L
189.443 129.614 L
195.506 133.532 L
201.701 134.178 L
208.501 146.313 L
214.723 155.67 L
220.913 157.452 L
227.041 165.917 L
233.468 176.528 L
239.728 185.239 L
246.144 197.311 L
252.635 211.831 L
258.868 222.304 L
265.111 227.167 L
271.551 230.024 L
277.889 241.119 L
284.298 240.497 L
290.542 243.136 L
296.943 250.131 L
303.273 250.663 L
309.506 253.784 L
315.874 261.609 L
322.189 262.74 L
328.526 265.557 L
334.839 272.716 L
341.18 274.691 L
347.5 286.654 L
S
GR
GS
1 0 0 RC
1 LJ
4 LW
N
69 95.19 M
75.963 96.355 L
82.319 99.561 L
88.167 104.187 L
93.581 109.469 L
101.017 116.852 L
107.765 121.909 L
113.942 124.652 L
119.638 126.744 L
126.601 131.027 L
132.957 136.605 L
138.805 140.258 L
145.512 140.491 L
151.654 138.796 L
157.32 133.755 L
163.586 121.588 L
170.276 112.422 L
176.404 106.167 L
182.83 86.659 L
189.443 84.536 L
195.506 86.906 L
201.701 87.761 L
208.501 107.067 L
214.723 123.879 L
220.913 141.182 L
227.041 163.144 L
233.468 176.065 L
239.728 184.367 L
246.144 194.938 L
252.635 207.669 L
258.868 219.739 L
265.111 224.145 L
271.551 228.363 L
277.889 237.807 L
284.298 240.624 L
290.542 243.918 L
296.943 248.225 L
303.273 250.292 L
309.506 255.356 L
315.874 261.378 L
322.189 260.686 L
328.526 264.706 L
334.839 272.176 L
341.18 274.78 L
347.5 284.72 L
S
GR
GS
0.91 GC
N
75.963 92.466 M
69 87.642 L
69 96.696 L
75.963 101.273 L
82.319 105.456 L
88.167 109.308 L
93.581 112.878 L
101.017 117.788 L
107.765 122.251 L
113.942 126.343 L
119.638 130.121 L
126.601 134.747 L
132.957 138.978 L
138.805 142.877 L
145.512 147.358 L
151.654 151.47 L
157.32 155.27 L
163.586 159.481 L
170.276 163.986 L
176.404 168.122 L
182.83 172.468 L
189.443 176.95 L
195.506 181.068 L
201.701 185.283 L
208.501 189.92 L
214.723 194.171 L
220.913 198.407 L
227.041 202.608 L
233.468 207.021 L
239.728 211.326 L
246.144 215.744 L
252.635 220.22 L
258.868 224.524 L
265.111 228.839 L
271.551 233.295 L
277.889 237.685 L
284.298 242.129 L
290.542 246.462 L
296.943 250.907 L
303.273 255.306 L
309.506 259.641 L
315.874 264.072 L
322.189 268.47 L
328.526 272.885 L
334.839 277.285 L
341.18 281.706 L
347.5 286.116 L
347.5 274.215 L
341.18 270.092 L
334.839 265.953 L
328.526 261.831 L
322.189 257.69 L
315.874 253.561 L
309.506 249.395 L
303.273 245.315 L
296.943 241.169 L
290.542 236.972 L
284.298 232.875 L
277.889 228.666 L
271.551 224.5 L
265.111 220.262 L
258.868 216.149 L
252.635 212.037 L
246.144 207.75 L
239.728 203.507 L
233.468 199.36 L
227.041 195.096 L
220.913 191.024 L
214.723 186.903 L
208.501 182.754 L
201.701 178.21 L
195.506 174.062 L
189.443 169.994 L
182.83 165.548 L
176.404 161.218 L
170.276 157.081 L
163.586 152.555 L
157.32 148.307 L
151.654 144.457 L
145.512 140.276 L
138.805 135.702 L
132.957 131.707 L
126.601 127.356 L
119.638 122.582 L
113.942 118.671 L
107.765 114.423 L
101.017 109.775 L
93.581 104.646 L
88.167 100.907 L
82.319 96.865 L
cp
f
GR
GS
0.549 GC
1 LJ
0.5 LW
N
69 87.642 M
75.963 92.466 L
82.319 96.865 L
88.167 100.907 L
93.581 104.646 L
101.017 109.775 L
107.765 114.423 L
113.942 118.671 L
119.638 122.582 L
126.601 127.356 L
132.957 131.707 L
138.805 135.702 L
145.512 140.276 L
151.654 144.457 L
157.32 148.307 L
163.586 152.555 L
170.276 157.081 L
176.404 161.218 L
182.83 165.548 L
189.443 169.994 L
195.506 174.062 L
201.701 178.21 L
208.501 182.754 L
214.723 186.903 L
220.913 191.024 L
227.041 195.096 L
233.468 199.36 L
239.728 203.507 L
246.144 207.75 L
252.635 212.037 L
258.868 216.149 L
265.111 220.262 L
271.551 224.5 L
277.889 228.666 L
284.298 232.875 L
290.542 236.972 L
296.943 241.169 L
303.273 245.315 L
309.506 249.395 L
315.874 253.561 L
322.189 257.69 L
328.526 261.831 L
334.839 265.953 L
341.18 270.092 L
347.5 274.215 L
S
GR
GS
0.549 GC
1 LJ
0.5 LW
N
69 96.696 M
75.963 101.273 L
82.319 105.456 L
88.167 109.308 L
93.581 112.878 L
101.017 117.788 L
107.765 122.251 L
113.942 126.343 L
119.638 130.121 L
126.601 134.747 L
132.957 138.978 L
138.805 142.877 L
145.512 147.358 L
151.654 151.47 L
157.32 155.27 L
163.586 159.481 L
170.276 163.986 L
176.404 168.122 L
182.83 172.468 L
189.443 176.95 L
195.506 181.068 L
201.701 185.283 L
208.501 189.92 L
214.723 194.171 L
220.913 198.407 L
227.041 202.608 L
233.468 207.021 L
239.728 211.326 L
246.144 215.744 L
252.635 220.22 L
258.868 224.524 L
265.111 228.839 L
271.551 233.295 L
277.889 237.685 L
284.298 242.129 L
290.542 246.462 L
296.943 250.907 L
303.273 255.306 L
309.506 259.641 L
315.874 264.072 L
322.189 268.47 L
328.526 272.885 L
334.839 277.285 L
341.18 281.706 L
347.5 286.116 L
S
GR
GS
[16 16] 0 setdash
2 LJ
4 LW
N
69 92.169 M
75.963 96.87 L
82.319 101.16 L
88.167 105.108 L
93.581 108.762 L
101.017 113.782 L
107.765 118.337 L
113.942 122.507 L
119.638 126.351 L
126.601 131.052 L
132.957 135.342 L
138.805 139.29 L
145.512 143.817 L
151.654 147.964 L
157.32 151.788 L
163.586 156.018 L
170.276 160.533 L
176.404 164.67 L
182.83 169.008 L
189.443 173.472 L
195.506 177.565 L
201.701 181.746 L
208.501 186.337 L
214.723 190.537 L
220.913 194.716 L
227.041 198.852 L
233.468 203.19 L
239.728 207.416 L
246.144 211.747 L
252.635 216.129 L
258.868 220.336 L
265.111 224.551 L
271.551 228.898 L
277.889 233.176 L
284.298 237.502 L
290.542 241.717 L
296.943 246.038 L
303.273 250.311 L
309.506 254.518 L
315.874 258.817 L
322.189 263.08 L
328.526 267.358 L
334.839 271.619 L
341.18 275.899 L
347.5 280.165 L
S
GR
GS
1 0.91 0.91 RC
N
75.963 92.328 M
69 87.536 L
69 96.666 L
75.963 101.204 L
82.319 105.352 L
88.167 109.171 L
93.581 112.711 L
101.017 117.58 L
107.765 122.005 L
113.942 126.061 L
119.638 129.807 L
126.601 134.394 L
132.957 138.59 L
138.805 142.456 L
145.512 146.899 L
151.654 150.977 L
157.32 154.745 L
163.586 158.921 L
170.276 163.389 L
176.404 167.491 L
182.83 171.802 L
189.443 176.247 L
195.506 180.333 L
201.701 184.515 L
208.501 189.116 L
214.723 193.333 L
220.913 197.537 L
227.041 201.706 L
233.468 206.085 L
239.728 210.358 L
246.144 214.743 L
252.635 219.186 L
258.868 223.458 L
265.111 227.742 L
271.551 232.166 L
277.889 236.524 L
284.298 240.936 L
290.542 245.238 L
296.943 249.652 L
303.273 254.019 L
309.506 258.324 L
315.874 262.724 L
322.189 267.09 L
328.526 271.474 L
334.839 275.843 L
341.18 280.234 L
347.5 284.612 L
347.5 272.757 L
341.18 268.667 L
334.839 264.562 L
328.526 260.473 L
322.189 256.365 L
315.874 252.269 L
309.506 248.137 L
303.273 244.089 L
296.943 239.976 L
290.542 235.813 L
284.298 231.748 L
277.889 227.572 L
271.551 223.438 L
265.111 219.233 L
258.868 215.152 L
252.635 211.072 L
246.144 206.818 L
239.728 202.607 L
233.468 198.491 L
227.041 194.259 L
220.913 190.217 L
214.723 186.126 L
208.501 182.007 L
201.701 177.496 L
195.506 173.377 L
189.443 169.338 L
182.83 164.924 L
176.404 160.624 L
170.276 156.515 L
163.586 152.019 L
157.32 147.8 L
151.654 143.976 L
145.512 139.823 L
138.805 135.279 L
132.957 131.31 L
126.601 126.989 L
119.638 122.246 L
113.942 118.36 L
107.765 114.14 L
101.017 109.523 L
93.581 104.428 L
88.167 100.714 L
82.319 96.698 L
cp
f
GR
GS
1 0.549 0.549 RC
1 LJ
0.5 LW
N
69 87.536 M
75.963 92.328 L
82.319 96.698 L
88.167 100.714 L
93.581 104.428 L
101.017 109.523 L
107.765 114.14 L
113.942 118.36 L
119.638 122.246 L
126.601 126.989 L
132.957 131.31 L
138.805 135.279 L
145.512 139.823 L
151.654 143.976 L
157.32 147.8 L
163.586 152.019 L
170.276 156.515 L
176.404 160.624 L
182.83 164.924 L
189.443 169.338 L
195.506 173.377 L
201.701 177.496 L
208.501 182.007 L
214.723 186.126 L
220.913 190.217 L
227.041 194.259 L
233.468 198.491 L
239.728 202.607 L
246.144 206.818 L
252.635 211.072 L
258.868 215.152 L
265.111 219.233 L
271.551 223.438 L
277.889 227.572 L
284.298 231.748 L
290.542 235.813 L
296.943 239.976 L
303.273 244.089 L
309.506 248.137 L
315.874 252.269 L
322.189 256.365 L
328.526 260.473 L
334.839 264.562 L
341.18 268.667 L
347.5 272.757 L
S
GR
GS
1 0.549 0.549 RC
1 LJ
0.5 LW
N
69 96.666 M
75.963 101.204 L
82.319 105.352 L
88.167 109.171 L
93.581 112.711 L
101.017 117.58 L
107.765 122.005 L
113.942 126.061 L
119.638 129.807 L
126.601 134.394 L
132.957 138.59 L
138.805 142.456 L
145.512 146.899 L
151.654 150.977 L
157.32 154.745 L
163.586 158.921 L
170.276 163.389 L
176.404 167.491 L
182.83 171.802 L
189.443 176.247 L
195.506 180.333 L
201.701 184.515 L
208.501 189.116 L
214.723 193.333 L
220.913 197.537 L
227.041 201.706 L
233.468 206.085 L
239.728 210.358 L
246.144 214.743 L
252.635 219.186 L
258.868 223.458 L
265.111 227.742 L
271.551 232.166 L
277.889 236.524 L
284.298 240.936 L
290.542 245.238 L
296.943 249.652 L
303.273 254.019 L
309.506 258.324 L
315.874 262.724 L
322.189 267.09 L
328.526 271.474 L
334.839 275.843 L
341.18 280.234 L
347.5 284.612 L
S
GR
GS
1 0 0 RC
[16 16] 0 setdash
2 LJ
4 LW
N
69 92.101 M
75.963 96.766 L
82.319 101.025 L
88.167 104.942 L
93.581 108.57 L
101.017 113.551 L
107.765 118.072 L
113.942 122.211 L
119.638 126.027 L
126.601 130.691 L
132.957 134.95 L
138.805 138.868 L
145.512 143.361 L
151.654 147.476 L
157.32 151.272 L
163.586 155.47 L
170.276 159.952 L
176.404 164.057 L
182.83 168.363 L
189.443 172.793 L
195.506 176.855 L
201.701 181.005 L
208.501 185.561 L
214.723 189.729 L
220.913 193.877 L
227.041 197.982 L
233.468 202.288 L
239.728 206.482 L
246.144 210.78 L
252.635 215.129 L
258.868 219.305 L
265.111 223.488 L
271.551 227.802 L
277.889 232.048 L
284.298 236.342 L
290.542 240.526 L
296.943 244.814 L
303.273 249.054 L
309.506 253.23 L
315.874 257.497 L
322.189 261.727 L
328.526 265.973 L
334.839 270.203 L
341.18 274.451 L
347.5 278.685 L
S
GR
GS
[1 0 0 1 116 256.5] CT
/Helvetica 20 F
GS
[1 0 0 1 0 0] CT
0 7.5 moveto 
1 -1 scale
(Pre/Post) t 
GR
GR
GS
1 LJ
4 LW
N
83 256.5 M
113 256.5 L
S
GR
GS
[1 0 0 1 116 281] CT
/Helvetica 20 F
GS
[1 0 0 1 0 0] CT
0 7.5 moveto 
1 -1 scale
(Alpha on-/offset) t 
GR
GR
GS
1 0 0 RC
1 LJ
4 LW
N
83 281 M
113 281 L
S
GR
GS
1 GC
N
269 144 M
326.5 144 L
326.5 54 L
269 54 L
cp
f
GR
GS
0.149 GC
2 setlinecap
1 LJ
0.5 LW
N
269 144 M
326.5 144 L
S
GR
GS
0.149 GC
2 setlinecap
1 LJ
0.5 LW
N
326.5 144 M
326.5 54 L
S
GR
GS
0.149 GC
2 setlinecap
1 LJ
0.5 LW
N
326.5 144 M
325.6 144 L
S
GR
GS
0.149 GC
2 setlinecap
1 LJ
0.5 LW
N
326.5 54 M
325.6 54 L
S
GR
GS
[1 0 0 1 332.5 143.99995] CT
0.149 GC
/Helvetica 20 F
GS
[1 0 0 1 0 0] CT
0 7.5 moveto 
1 -1 scale
(-0.83) t 
GR
GR
GS
[1 0 0 1 332.5 54.00003] CT
0.149 GC
/Helvetica 20 F
GS
[1 0 0 1 0 0] CT
0 7.5 moveto 
1 -1 scale
(-0.8) t 
GR
GR
GS
[0 -1 1 0 382.5 98.99999] CT
0.149 GC
/Helvetica 20 F
GS
[1 0 0 1 0 0] CT
-26 20 moveto 
1 -1 scale
(Slope) t 
GR
GR
GS
0.149 GC
1 LJ
0.5 LW
N
269 54 M
326.5 54 L
S
GR
GS
N
271.875 54 M
271.875 104.726 L
294.875 104.726 L
294.875 54 L
cp
f
GR
GS
10.0 ML
0.5 LW
N
271.875 54 M
271.875 104.726 L
294.875 104.726 L
294.875 54 L
cp
S
GR
GS
1 LJ
2 LW
N
283.375 104.726 M
283.375 114.34 L
S
GR
GS
1 LJ
2 LW
N
283.375 104.726 M
283.375 95.113 L
S
GR
GS
[1 0 0 1 283.375 114.33972] CT
N
-3 0 M
3 0 L
f
GR
GS
[1 0 0 1 283.375 114.33972] CT
10.0 ML
2 LW
N
-3 0 M
3 0 L
S
GR
GS
[1 0 0 1 283.375 95.11294] CT
N
/f1394637256{-3 0 M
3 0 L}def
f1394637256
f
GR
GS
[1 0 0 1 283.375 95.11294] CT
10.0 ML
2 LW
N
-3 0 M
3 0 L
S
GR
GS
1 0 0 RC
N
/f555263438{300.625 54 M
300.625 86.313 L
323.625 86.313 L
323.625 54 L
cp}def
f555263438
f
GR
GS
1 0 0 RC
10.0 ML
0.5 LW
N
300.625 54 M
300.625 86.313 L
323.625 86.313 L
323.625 54 L
cp
S
GR
GS
1 LJ
2 LW
N
312.125 86.313 M
312.125 96.504 L
S
GR
GS
1 LJ
2 LW
N
312.125 86.313 M
312.125 76.121 L
S
GR
GS
[1 0 0 1 312.125 96.50446] CT
N
f1394637256
f
GR
GS
[1 0 0 1 312.125 96.50446] CT
10.0 ML
2 LW
N
-3 0 M
3 0 L
S
GR
GS
[1 0 0 1 312.125 76.12057] CT
N
f1394637256
f
GR
GS
[1 0 0 1 312.125 76.12057] CT
10.0 ML
2 LW
N
-3 0 M
3 0 L
S
GR
%%Trailer
%%Pages: 1
%%EOF
