%!PS-Adobe-3.0 EPSF-3.0
%%Creator: (MATLAB, The Mathworks, Inc. Version 9.3.0.713579 \(R2017b\). Operating System: Mac OS X)
%%Title: /Volumes/LNDG/Projects/StateSwitch/dynamic/data/eeg/rest/B_analyses/F_periRhythmMSE/C_figures/E_SampEn_Alpha_Errors.eps
%%CreationDate: 2020-03-11T10:52:53
%%Pages: (atend)
%%BoundingBox:    25     2   464    70
%%LanguageLevel: 3
%%EndComments
%%BeginProlog
%%BeginResource: procset (Apache XML Graphics Std ProcSet) 1.2 0
%%Version: 1.2 0
%%Copyright: (Copyright 2001-2003,2010 The Apache Software Foundation. License terms: http://www.apache.org/licenses/LICENSE-2.0)
/bd{bind def}bind def
/ld{load def}bd
/GR/grestore ld
/GS/gsave ld
/RM/rmoveto ld
/C/curveto ld
/t/show ld
/L/lineto ld
/ML/setmiterlimit ld
/CT/concat ld
/f/fill ld
/N/newpath ld
/S/stroke ld
/CC/setcmykcolor ld
/A/ashow ld
/cp/closepath ld
/RC/setrgbcolor ld
/LJ/setlinejoin ld
/GC/setgray ld
/LW/setlinewidth ld
/M/moveto ld
/re {4 2 roll M
1 index 0 rlineto
0 exch rlineto
neg 0 rlineto
cp } bd
/_ctm matrix def
/_tm matrix def
/BT { _ctm currentmatrix pop matrix _tm copy pop 0 0 moveto } bd
/ET { _ctm setmatrix } bd
/iTm { _ctm setmatrix _tm concat } bd
/Tm { _tm astore pop iTm 0 0 moveto } bd
/ux 0.0 def
/uy 0.0 def
/F {
  /Tp exch def
  /Tf exch def
  Tf findfont Tp scalefont setfont
  /cf Tf def  /cs Tp def
} bd
/ULS {currentpoint /uy exch def /ux exch def} bd
/ULE {
  /Tcx currentpoint pop def
  gsave
  newpath
  cf findfont cs scalefont dup
  /FontMatrix get 0 get /Ts exch def /FontInfo get dup
  /UnderlinePosition get Ts mul /To exch def
  /UnderlineThickness get Ts mul /Tt exch def
  ux uy To add moveto  Tcx uy To add lineto
  Tt setlinewidth stroke
  grestore
} bd
/OLE {
  /Tcx currentpoint pop def
  gsave
  newpath
  cf findfont cs scalefont dup
  /FontMatrix get 0 get /Ts exch def /FontInfo get dup
  /UnderlinePosition get Ts mul /To exch def
  /UnderlineThickness get Ts mul /Tt exch def
  ux uy To add cs add moveto Tcx uy To add cs add lineto
  Tt setlinewidth stroke
  grestore
} bd
/SOE {
  /Tcx currentpoint pop def
  gsave
  newpath
  cf findfont cs scalefont dup
  /FontMatrix get 0 get /Ts exch def /FontInfo get dup
  /UnderlinePosition get Ts mul /To exch def
  /UnderlineThickness get Ts mul /Tt exch def
  ux uy To add cs 10 mul 26 idiv add moveto Tcx uy To add cs 10 mul 26 idiv add lineto
  Tt setlinewidth stroke
  grestore
} bd
/QT {
/Y22 exch store
/X22 exch store
/Y21 exch store
/X21 exch store
currentpoint
/Y21 load 2 mul add 3 div exch
/X21 load 2 mul add 3 div exch
/X21 load 2 mul /X22 load add 3 div
/Y21 load 2 mul /Y22 load add 3 div
/X22 load /Y22 load curveto
} bd
/SSPD {
dup length /d exch dict def
{
/v exch def
/k exch def
currentpagedevice k known {
/cpdv currentpagedevice k get def
v cpdv ne {
/upd false def
/nullv v type /nulltype eq def
/nullcpdv cpdv type /nulltype eq def
nullv nullcpdv or
{
/upd true def
} {
/sametype v type cpdv type eq def
sametype {
v type /arraytype eq {
/vlen v length def
/cpdvlen cpdv length def
vlen cpdvlen eq {
0 1 vlen 1 sub {
/i exch def
/obj v i get def
/cpdobj cpdv i get def
obj cpdobj ne {
/upd true def
exit
} if
} for
} {
/upd true def
} ifelse
} {
v type /dicttype eq {
v {
/dv exch def
/dk exch def
/cpddv cpdv dk get def
dv cpddv ne {
/upd true def
exit
} if
} forall
} {
/upd true def
} ifelse
} ifelse
} if
} ifelse
upd true eq {
d k v put
} if
} if
} if
} forall
d length 0 gt {
d setpagedevice
} if
} bd
/RE { % /NewFontName [NewEncodingArray] /FontName RE -
  findfont dup length dict begin
  {
    1 index /FID ne
    {def} {pop pop} ifelse
  } forall
  /Encoding exch def
  /FontName 1 index def
  currentdict definefont pop
  end
} bind def
%%EndResource
%%BeginResource: procset (Apache XML Graphics EPS ProcSet) 1.0 0
%%Version: 1.0 0
%%Copyright: (Copyright 2002-2003 The Apache Software Foundation. License terms: http://www.apache.org/licenses/LICENSE-2.0)
/BeginEPSF { %def
/b4_Inc_state save def         % Save state for cleanup
/dict_count countdictstack def % Count objects on dict stack
/op_count count 1 sub def      % Count objects on operand stack
userdict begin                 % Push userdict on dict stack
/showpage { } def              % Redefine showpage, { } = null proc
0 setgray 0 setlinecap         % Prepare graphics state
1 setlinewidth 0 setlinejoin
10 setmiterlimit [ ] 0 setdash newpath
/languagelevel where           % If level not equal to 1 then
{pop languagelevel             % set strokeadjust and
1 ne                           % overprint to their defaults.
{false setstrokeadjust false setoverprint
} if
} if
} bd
/EndEPSF { %def
count op_count sub {pop} repeat            % Clean up stacks
countdictstack dict_count sub {end} repeat
b4_Inc_state restore
} bd
%%EndResource
%FOPBeginFontDict
%%IncludeResource: font Courier-Oblique
%%IncludeResource: font Courier-BoldOblique
%%IncludeResource: font Courier-Bold
%%IncludeResource: font ZapfDingbats
%%IncludeResource: font Symbol
%%IncludeResource: font Helvetica
%%IncludeResource: font Helvetica-Oblique
%%IncludeResource: font Helvetica-Bold
%%IncludeResource: font Helvetica-BoldOblique
%%IncludeResource: font Times-Roman
%%IncludeResource: font Times-Italic
%%IncludeResource: font Times-Bold
%%IncludeResource: font Times-BoldItalic
%%IncludeResource: font Courier
%FOPEndFontDict
%%BeginResource: encoding WinAnsiEncoding
/WinAnsiEncoding [
/.notdef /.notdef /.notdef /.notdef /.notdef
/.notdef /.notdef /.notdef /.notdef /.notdef
/.notdef /.notdef /.notdef /.notdef /.notdef
/.notdef /.notdef /.notdef /.notdef /.notdef
/.notdef /.notdef /.notdef /.notdef /.notdef
/.notdef /.notdef /.notdef /.notdef /.notdef
/.notdef /.notdef /space /exclam /quotedbl
/numbersign /dollar /percent /ampersand /quotesingle
/parenleft /parenright /asterisk /plus /comma
/hyphen /period /slash /zero /one
/two /three /four /five /six
/seven /eight /nine /colon /semicolon
/less /equal /greater /question /at
/A /B /C /D /E
/F /G /H /I /J
/K /L /M /N /O
/P /Q /R /S /T
/U /V /W /X /Y
/Z /bracketleft /backslash /bracketright /asciicircum
/underscore /quoteleft /a /b /c
/d /e /f /g /h
/i /j /k /l /m
/n /o /p /q /r
/s /t /u /v /w
/x /y /z /braceleft /bar
/braceright /asciitilde /bullet /Euro /bullet
/quotesinglbase /florin /quotedblbase /ellipsis /dagger
/daggerdbl /circumflex /perthousand /Scaron /guilsinglleft
/OE /bullet /Zcaron /bullet /bullet
/quoteleft /quoteright /quotedblleft /quotedblright /bullet
/endash /emdash /asciitilde /trademark /scaron
/guilsinglright /oe /bullet /zcaron /Ydieresis
/space /exclamdown /cent /sterling /currency
/yen /brokenbar /section /dieresis /copyright
/ordfeminine /guillemotleft /logicalnot /sfthyphen /registered
/macron /degree /plusminus /twosuperior /threesuperior
/acute /mu /paragraph /middot /cedilla
/onesuperior /ordmasculine /guillemotright /onequarter /onehalf
/threequarters /questiondown /Agrave /Aacute /Acircumflex
/Atilde /Adieresis /Aring /AE /Ccedilla
/Egrave /Eacute /Ecircumflex /Edieresis /Igrave
/Iacute /Icircumflex /Idieresis /Eth /Ntilde
/Ograve /Oacute /Ocircumflex /Otilde /Odieresis
/multiply /Oslash /Ugrave /Uacute /Ucircumflex
/Udieresis /Yacute /Thorn /germandbls /agrave
/aacute /acircumflex /atilde /adieresis /aring
/ae /ccedilla /egrave /eacute /ecircumflex
/edieresis /igrave /iacute /icircumflex /idieresis
/eth /ntilde /ograve /oacute /ocircumflex
/otilde /odieresis /divide /oslash /ugrave
/uacute /ucircumflex /udieresis /yacute /thorn
/ydieresis
] def
%%EndResource
%FOPBeginFontReencode
/Courier-Oblique findfont
dup length dict begin
  {1 index /FID ne {def} {pop pop} ifelse} forall
  /Encoding WinAnsiEncoding def
  currentdict
end
/Courier-Oblique exch definefont pop
/Courier-BoldOblique findfont
dup length dict begin
  {1 index /FID ne {def} {pop pop} ifelse} forall
  /Encoding WinAnsiEncoding def
  currentdict
end
/Courier-BoldOblique exch definefont pop
/Courier-Bold findfont
dup length dict begin
  {1 index /FID ne {def} {pop pop} ifelse} forall
  /Encoding WinAnsiEncoding def
  currentdict
end
/Courier-Bold exch definefont pop
/Helvetica findfont
dup length dict begin
  {1 index /FID ne {def} {pop pop} ifelse} forall
  /Encoding WinAnsiEncoding def
  currentdict
end
/Helvetica exch definefont pop
/Helvetica-Oblique findfont
dup length dict begin
  {1 index /FID ne {def} {pop pop} ifelse} forall
  /Encoding WinAnsiEncoding def
  currentdict
end
/Helvetica-Oblique exch definefont pop
/Helvetica-Bold findfont
dup length dict begin
  {1 index /FID ne {def} {pop pop} ifelse} forall
  /Encoding WinAnsiEncoding def
  currentdict
end
/Helvetica-Bold exch definefont pop
/Helvetica-BoldOblique findfont
dup length dict begin
  {1 index /FID ne {def} {pop pop} ifelse} forall
  /Encoding WinAnsiEncoding def
  currentdict
end
/Helvetica-BoldOblique exch definefont pop
/Times-Roman findfont
dup length dict begin
  {1 index /FID ne {def} {pop pop} ifelse} forall
  /Encoding WinAnsiEncoding def
  currentdict
end
/Times-Roman exch definefont pop
/Times-Italic findfont
dup length dict begin
  {1 index /FID ne {def} {pop pop} ifelse} forall
  /Encoding WinAnsiEncoding def
  currentdict
end
/Times-Italic exch definefont pop
/Times-Bold findfont
dup length dict begin
  {1 index /FID ne {def} {pop pop} ifelse} forall
  /Encoding WinAnsiEncoding def
  currentdict
end
/Times-Bold exch definefont pop
/Times-BoldItalic findfont
dup length dict begin
  {1 index /FID ne {def} {pop pop} ifelse} forall
  /Encoding WinAnsiEncoding def
  currentdict
end
/Times-BoldItalic exch definefont pop
/Courier findfont
dup length dict begin
  {1 index /FID ne {def} {pop pop} ifelse} forall
  /Encoding WinAnsiEncoding def
  currentdict
end
/Courier exch definefont pop
%FOPEndFontReencode
%%EndProlog
%%Page: 1 1
%%PageBoundingBox: 0 0 512 72
%%BeginPageSetup
[1 0 0 -1 0 72] CT
%%EndPageSetup
GS
1 GC
N
0 0 512 72 re
f
GR
GS
1 GC
N
0 0 512 72 re
f
GR
GS
1 GC
N
87 61 M
238 61 L
238 10.5 L
87 10.5 L
cp
f
GR
GS
0.149 GC
2 setlinecap
1 LJ
0.5 LW
N
87 61 M
238 61 L
S
GR
GS
0.149 GC
2 setlinecap
1 LJ
0.5 LW
N
87 61 M
87 10.5 L
S
GR
GS
0.149 GC
2 setlinecap
1 LJ
0.5 LW
N
87 61 M
88.51 61 L
S
GR
GS
0.149 GC
2 setlinecap
1 LJ
0.5 LW
N
87 41.577 M
88.51 41.577 L
S
GR
GS
0.149 GC
2 setlinecap
1 LJ
0.5 LW
N
87 22.154 M
88.51 22.154 L
S
GR
GS
[1 0 0 1 81.4 61] CT
0.149 GC
/Helvetica 18 F
GS
[1 0 0 1 0 0] CT
-36 7 moveto 
1 -1 scale
(0.45) t 
GR
GR
GS
[1 0 0 1 81.4 41.57692] CT
0.149 GC
/Helvetica 18 F
GS
[1 0 0 1 0 0] CT
-26 7 moveto 
1 -1 scale
(0.5) t 
GR
GR
GS
[1 0 0 1 81.4 22.15384] CT
0.149 GC
/Helvetica 18 F
GS
[1 0 0 1 0 0] CT
-36 7 moveto 
1 -1 scale
(0.55) t 
GR
GR
GS
[0 -1 1 0 42.9 35.74998] CT
0.149 GC
/Helvetica 18 F
GS
[1 0 0 1 0 0] CT
-34.5 -4 moveto 
1 -1 scale
(SampEn) t 
GR
GR
GS
0.149 GC
1 LJ
0.5 LW
N
87 61 M
238 61 L
S
GR
GS
N
120.975 61 M
120.975 36.074 L
90.775 36.074 L
90.775 61 L
cp
f
GR
GS
10.0 ML
0.5 LW
N
90.775 61 M
90.775 36.074 L
120.975 36.074 L
120.975 61 L
cp
S
GR
GS
1 LJ
2 LW
N
105.875 36.074 M
105.875 36.643 L
S
GR
GS
1 LJ
2 LW
N
105.875 36.074 M
105.875 35.506 L
S
GR
GS
[1 0 0 1 105.875 36.64294] CT
N
-3 0 M
3 0 L
f
GR
GS
[1 0 0 1 105.875 36.64294] CT
10.0 ML
2 LW
N
-3 0 M
3 0 L
S
GR
GS
[1 0 0 1 105.875 35.50573] CT
N
/f1394637256{-3 0 M
3 0 L}def
f1394637256
f
GR
GS
[1 0 0 1 105.875 35.50573] CT
10.0 ML
2 LW
N
-3 0 M
3 0 L
S
GR
GS
1 0 0 RC
N
/f-816405426{158.725 61 M
158.725 50.389 L
128.525 50.389 L
128.525 61 L
cp}def
f-816405426
f
GR
GS
1 0 0 RC
10.0 ML
0.5 LW
N
128.525 61 M
128.525 50.389 L
158.725 50.389 L
158.725 61 L
cp
S
GR
GS
1 LJ
2 LW
N
143.625 50.389 M
143.625 50.816 L
S
GR
GS
1 LJ
2 LW
N
143.625 50.389 M
143.625 49.962 L
S
GR
GS
[1 0 0 1 143.625 50.81626] CT
N
f1394637256
f
GR
GS
[1 0 0 1 143.625 50.81626] CT
10.0 ML
2 LW
N
-3 0 M
3 0 L
S
GR
GS
[1 0 0 1 143.625 49.96199] CT
N
f1394637256
f
GR
GS
[1 0 0 1 143.625 49.96199] CT
10.0 ML
2 LW
N
-3 0 M
3 0 L
S
GR
GS
1 0 0 RC
N
/f1478047950{196.475 61 M
196.475 54.107 L
166.275 54.107 L
166.275 61 L
cp}def
f1478047950
f
GR
GS
1 0 0 RC
10.0 ML
0.5 LW
N
166.275 61 M
166.275 54.107 L
196.475 54.107 L
196.475 61 L
cp
S
GR
GS
1 LJ
2 LW
N
181.375 54.107 M
181.375 54.669 L
S
GR
GS
1 LJ
2 LW
N
181.375 54.107 M
181.375 53.546 L
S
GR
GS
[1 0 0 1 181.375 54.66911] CT
N
f1394637256
f
GR
GS
[1 0 0 1 181.375 54.66911] CT
10.0 ML
2 LW
N
-3 0 M
3 0 L
S
GR
GS
[1 0 0 1 181.375 53.54571] CT
N
f1394637256
f
GR
GS
[1 0 0 1 181.375 53.54571] CT
10.0 ML
2 LW
N
-3 0 M
3 0 L
S
GR
GS
N
/f-627745618{234.225 61 M
234.225 35.543 L
204.025 35.543 L
204.025 61 L
cp}def
f-627745618
f
GR
GS
10.0 ML
0.5 LW
N
204.025 61 M
204.025 35.543 L
234.225 35.543 L
234.225 61 L
cp
S
GR
GS
1 LJ
2 LW
N
219.125 35.543 M
219.125 36.154 L
S
GR
GS
1 LJ
2 LW
N
219.125 35.543 M
219.125 34.932 L
S
GR
GS
[1 0 0 1 219.125 36.15444] CT
N
f1394637256
f
GR
GS
[1 0 0 1 219.125 36.15444] CT
10.0 ML
2 LW
N
-3 0 M
3 0 L
S
GR
GS
[1 0 0 1 219.125 34.93183] CT
N
f1394637256
f
GR
GS
[1 0 0 1 219.125 34.93183] CT
10.0 ML
2 LW
N
-3 0 M
3 0 L
S
GR
GS
1 LJ
0.5 LW
N
109.65 22.154 M
139.85 22.154 L
S
GR
GS
1 GC
N
/f-1722105056{112.75 34.154 M
136.75 34.154 L
136.75 10.154 L
112.75 10.154 L
cp}def
f-1722105056
f
GR
GS
[1 0 0 1 124.75 22.15384] CT
/Helvetica-Bold 18 F
GS
[1 0 0 1 0 0] CT
-11 7 moveto 
1 -1 scale
(***) t 
GR
GR
GS
1 LJ
0.5 LW
N
185.15 22.154 M
215.35 22.154 L
S
GR
GS
1 GC
N
/f1757831800{188.25 34.154 M
212.25 34.154 L
212.25 10.154 L
188.25 10.154 L
cp}def
f1757831800
f
GR
GS
[1 0 0 1 200.25 22.15384] CT
/Helvetica-Bold 18 F
GS
[1 0 0 1 0 0] CT
-11 7 moveto 
1 -1 scale
(***) t 
GR
GR
GS
1 GC
N
/f1437065134{312.5 61 M
463.5 61 L
463.5 10.5 L
312.5 10.5 L
cp}def
f1437065134
f
GR
GS
0.149 GC
2 setlinecap
1 LJ
0.5 LW
N
312.5 61 M
463.5 61 L
S
GR
GS
0.149 GC
2 setlinecap
1 LJ
0.5 LW
N
312.5 61 M
312.5 10.5 L
S
GR
GS
0.149 GC
2 setlinecap
1 LJ
0.5 LW
N
312.5 61 M
314.01 61 L
S
GR
GS
0.149 GC
2 setlinecap
1 LJ
0.5 LW
N
312.5 35.75 M
314.01 35.75 L
S
GR
GS
0.149 GC
2 setlinecap
1 LJ
0.5 LW
N
312.5 10.5 M
314.01 10.5 L
S
GR
GS
[1 0 0 1 306.89999 60.99997] CT
0.149 GC
/Helvetica 18 F
GS
[1 0 0 1 0 0] CT
-36 7 moveto 
1 -1 scale
(0.54) t 
GR
GR
GS
[1 0 0 1 306.89999 35.75] CT
0.149 GC
/Helvetica 18 F
GS
[1 0 0 1 0 0] CT
-36 7 moveto 
1 -1 scale
(0.56) t 
GR
GR
GS
[1 0 0 1 306.89999 10.50002] CT
0.149 GC
/Helvetica 18 F
GS
[1 0 0 1 0 0] CT
-36 7 moveto 
1 -1 scale
(0.58) t 
GR
GR
GS
[0 -1 1 0 268.39999 35.75] CT
0.149 GC
/Helvetica 18 F
GS
[1 0 0 1 0 0] CT
-34.5 -4 moveto 
1 -1 scale
(SampEn) t 
GR
GR
GS
0.149 GC
1 LJ
0.5 LW
N
312.5 61 M
463.5 61 L
S
GR
GS
N
/f-407154674{346.475 61 M
346.475 29.822 L
316.275 29.822 L
316.275 61 L
cp}def
f-407154674
f
GR
GS
10.0 ML
0.5 LW
N
316.275 61 M
316.275 29.822 L
346.475 29.822 L
346.475 61 L
cp
S
GR
GS
1 LJ
2 LW
N
331.375 29.822 M
331.375 31.301 L
S
GR
GS
1 LJ
2 LW
N
331.375 29.822 M
331.375 28.342 L
S
GR
GS
[1 0 0 1 331.375 31.30109] CT
N
f1394637256
f
GR
GS
[1 0 0 1 331.375 31.30109] CT
10.0 ML
2 LW
N
-3 0 M
3 0 L
S
GR
GS
[1 0 0 1 331.375 28.34223] CT
N
f1394637256
f
GR
GS
[1 0 0 1 331.375 28.34223] CT
10.0 ML
2 LW
N
-3 0 M
3 0 L
S
GR
GS
1 0 0 RC
N
/f1006804526{384.225 61 M
384.225 35.789 L
354.025 35.789 L
354.025 61 L
cp}def
f1006804526
f
GR
GS
1 0 0 RC
10.0 ML
0.5 LW
N
354.025 61 M
354.025 35.789 L
384.225 35.789 L
384.225 61 L
cp
S
GR
GS
1 LJ
2 LW
N
369.125 35.789 M
369.125 37.139 L
S
GR
GS
1 LJ
2 LW
N
369.125 35.789 M
369.125 34.44 L
S
GR
GS
[1 0 0 1 369.125 37.13883] CT
N
f1394637256
f
GR
GS
[1 0 0 1 369.125 37.13883] CT
10.0 ML
2 LW
N
-3 0 M
3 0 L
S
GR
GS
[1 0 0 1 369.125 34.44003] CT
N
f1394637256
f
GR
GS
[1 0 0 1 369.125 34.44003] CT
10.0 ML
2 LW
N
-3 0 M
3 0 L
S
GR
GS
1 0 0 RC
N
/f2049193774{421.975 61 M
421.975 41.408 L
391.775 41.408 L
391.775 61 L
cp}def
f2049193774
f
GR
GS
1 0 0 RC
10.0 ML
0.5 LW
N
391.775 61 M
391.775 41.408 L
421.975 41.408 L
421.975 61 L
cp
S
GR
GS
1 LJ
2 LW
N
406.875 41.408 M
406.875 42.665 L
S
GR
GS
1 LJ
2 LW
N
406.875 41.408 M
406.875 40.151 L
S
GR
GS
[1 0 0 1 406.875 42.66548] CT
N
f1394637256
f
GR
GS
[1 0 0 1 406.875 42.66548] CT
10.0 ML
2 LW
N
-3 0 M
3 0 L
S
GR
GS
[1 0 0 1 406.875 40.1515] CT
N
f1394637256
f
GR
GS
[1 0 0 1 406.875 40.1515] CT
10.0 ML
2 LW
N
-3 0 M
3 0 L
S
GR
GS
N
/f-2045566578{459.725 61 M
459.725 32.909 L
429.525 32.909 L
429.525 61 L
cp}def
f-2045566578
f
GR
GS
10.0 ML
0.5 LW
N
429.525 61 M
429.525 32.909 L
459.725 32.909 L
459.725 61 L
cp
S
GR
GS
1 LJ
2 LW
N
444.625 32.909 M
444.625 34.632 L
S
GR
GS
1 LJ
2 LW
N
444.625 32.909 M
444.625 31.186 L
S
GR
GS
[1 0 0 1 444.625 34.63184] CT
N
f1394637256
f
GR
GS
[1 0 0 1 444.625 34.63184] CT
10.0 ML
2 LW
N
-3 0 M
3 0 L
S
GR
GS
[1 0 0 1 444.625 31.18648] CT
N
f1394637256
f
GR
GS
[1 0 0 1 444.625 31.18648] CT
10.0 ML
2 LW
N
-3 0 M
3 0 L
S
GR
GS
1 LJ
0.5 LW
N
335.15 16.813 M
365.35 16.813 L
S
GR
GS
1 GC
N
/f-678901968{341.75 28.813 M
358.75 28.813 L
358.75 4.812 L
341.75 4.812 L
cp}def
f-678901968
f
GR
GS
[1 0 0 1 350.25 16.81252] CT
/Helvetica-Bold 18 F
GS
[1 0 0 1 0 0] CT
-7.5 7 moveto 
1 -1 scale
(**) t 
GR
GR
GS
1 LJ
0.5 LW
N
410.65 16.813 M
440.85 16.813 L
S
GR
GS
1 GC
N
/f-160169492{413.75 28.813 M
437.75 28.813 L
437.75 4.812 L
413.75 4.812 L
cp}def
f-160169492
f
GR
GS
[1 0 0 1 425.75 16.81252] CT
/Helvetica-Bold 18 F
GS
[1 0 0 1 0 0] CT
-11 7 moveto 
1 -1 scale
(***) t 
GR
GR
%%Trailer
%%Pages: 1
%%EOF
