%!PS-Adobe-3.0 EPSF-3.0
%%Creator: (MATLAB, The Mathworks, Inc. Version 9.3.0.713579 \(R2017b\). Operating System: Mac OS X)
%%Title: /Volumes/LNDG/Projects/StateSwitch/dynamic/data/eeg/rest/B_analyses/F_periRhythmMSE/C_figures/E_FFT.eps
%%CreationDate: 2020-03-11T17:50:31
%%Pages: (atend)
%%BoundingBox:    25     0   464    68
%%LanguageLevel: 3
%%EndComments
%%BeginProlog
%%BeginResource: procset (Apache XML Graphics Std ProcSet) 1.2 0
%%Version: 1.2 0
%%Copyright: (Copyright 2001-2003,2010 The Apache Software Foundation. License terms: http://www.apache.org/licenses/LICENSE-2.0)
/bd{bind def}bind def
/ld{load def}bd
/GR/grestore ld
/GS/gsave ld
/RM/rmoveto ld
/C/curveto ld
/t/show ld
/L/lineto ld
/ML/setmiterlimit ld
/CT/concat ld
/f/fill ld
/N/newpath ld
/S/stroke ld
/CC/setcmykcolor ld
/A/ashow ld
/cp/closepath ld
/RC/setrgbcolor ld
/LJ/setlinejoin ld
/GC/setgray ld
/LW/setlinewidth ld
/M/moveto ld
/re {4 2 roll M
1 index 0 rlineto
0 exch rlineto
neg 0 rlineto
cp } bd
/_ctm matrix def
/_tm matrix def
/BT { _ctm currentmatrix pop matrix _tm copy pop 0 0 moveto } bd
/ET { _ctm setmatrix } bd
/iTm { _ctm setmatrix _tm concat } bd
/Tm { _tm astore pop iTm 0 0 moveto } bd
/ux 0.0 def
/uy 0.0 def
/F {
  /Tp exch def
  /Tf exch def
  Tf findfont Tp scalefont setfont
  /cf Tf def  /cs Tp def
} bd
/ULS {currentpoint /uy exch def /ux exch def} bd
/ULE {
  /Tcx currentpoint pop def
  gsave
  newpath
  cf findfont cs scalefont dup
  /FontMatrix get 0 get /Ts exch def /FontInfo get dup
  /UnderlinePosition get Ts mul /To exch def
  /UnderlineThickness get Ts mul /Tt exch def
  ux uy To add moveto  Tcx uy To add lineto
  Tt setlinewidth stroke
  grestore
} bd
/OLE {
  /Tcx currentpoint pop def
  gsave
  newpath
  cf findfont cs scalefont dup
  /FontMatrix get 0 get /Ts exch def /FontInfo get dup
  /UnderlinePosition get Ts mul /To exch def
  /UnderlineThickness get Ts mul /Tt exch def
  ux uy To add cs add moveto Tcx uy To add cs add lineto
  Tt setlinewidth stroke
  grestore
} bd
/SOE {
  /Tcx currentpoint pop def
  gsave
  newpath
  cf findfont cs scalefont dup
  /FontMatrix get 0 get /Ts exch def /FontInfo get dup
  /UnderlinePosition get Ts mul /To exch def
  /UnderlineThickness get Ts mul /Tt exch def
  ux uy To add cs 10 mul 26 idiv add moveto Tcx uy To add cs 10 mul 26 idiv add lineto
  Tt setlinewidth stroke
  grestore
} bd
/QT {
/Y22 exch store
/X22 exch store
/Y21 exch store
/X21 exch store
currentpoint
/Y21 load 2 mul add 3 div exch
/X21 load 2 mul add 3 div exch
/X21 load 2 mul /X22 load add 3 div
/Y21 load 2 mul /Y22 load add 3 div
/X22 load /Y22 load curveto
} bd
/SSPD {
dup length /d exch dict def
{
/v exch def
/k exch def
currentpagedevice k known {
/cpdv currentpagedevice k get def
v cpdv ne {
/upd false def
/nullv v type /nulltype eq def
/nullcpdv cpdv type /nulltype eq def
nullv nullcpdv or
{
/upd true def
} {
/sametype v type cpdv type eq def
sametype {
v type /arraytype eq {
/vlen v length def
/cpdvlen cpdv length def
vlen cpdvlen eq {
0 1 vlen 1 sub {
/i exch def
/obj v i get def
/cpdobj cpdv i get def
obj cpdobj ne {
/upd true def
exit
} if
} for
} {
/upd true def
} ifelse
} {
v type /dicttype eq {
v {
/dv exch def
/dk exch def
/cpddv cpdv dk get def
dv cpddv ne {
/upd true def
exit
} if
} forall
} {
/upd true def
} ifelse
} ifelse
} if
} ifelse
upd true eq {
d k v put
} if
} if
} if
} forall
d length 0 gt {
d setpagedevice
} if
} bd
/RE { % /NewFontName [NewEncodingArray] /FontName RE -
  findfont dup length dict begin
  {
    1 index /FID ne
    {def} {pop pop} ifelse
  } forall
  /Encoding exch def
  /FontName 1 index def
  currentdict definefont pop
  end
} bind def
%%EndResource
%%BeginResource: procset (Apache XML Graphics EPS ProcSet) 1.0 0
%%Version: 1.0 0
%%Copyright: (Copyright 2002-2003 The Apache Software Foundation. License terms: http://www.apache.org/licenses/LICENSE-2.0)
/BeginEPSF { %def
/b4_Inc_state save def         % Save state for cleanup
/dict_count countdictstack def % Count objects on dict stack
/op_count count 1 sub def      % Count objects on operand stack
userdict begin                 % Push userdict on dict stack
/showpage { } def              % Redefine showpage, { } = null proc
0 setgray 0 setlinecap         % Prepare graphics state
1 setlinewidth 0 setlinejoin
10 setmiterlimit [ ] 0 setdash newpath
/languagelevel where           % If level not equal to 1 then
{pop languagelevel             % set strokeadjust and
1 ne                           % overprint to their defaults.
{false setstrokeadjust false setoverprint
} if
} if
} bd
/EndEPSF { %def
count op_count sub {pop} repeat            % Clean up stacks
countdictstack dict_count sub {end} repeat
b4_Inc_state restore
} bd
%%EndResource
%FOPBeginFontDict
%%IncludeResource: font Courier-Oblique
%%IncludeResource: font Courier-BoldOblique
%%IncludeResource: font Courier-Bold
%%IncludeResource: font ZapfDingbats
%%IncludeResource: font Symbol
%%IncludeResource: font Helvetica
%%IncludeResource: font Helvetica-Oblique
%%IncludeResource: font Helvetica-Bold
%%IncludeResource: font Helvetica-BoldOblique
%%IncludeResource: font Times-Roman
%%IncludeResource: font Times-Italic
%%IncludeResource: font Times-Bold
%%IncludeResource: font Times-BoldItalic
%%IncludeResource: font Courier
%FOPEndFontDict
%%BeginResource: encoding WinAnsiEncoding
/WinAnsiEncoding [
/.notdef /.notdef /.notdef /.notdef /.notdef
/.notdef /.notdef /.notdef /.notdef /.notdef
/.notdef /.notdef /.notdef /.notdef /.notdef
/.notdef /.notdef /.notdef /.notdef /.notdef
/.notdef /.notdef /.notdef /.notdef /.notdef
/.notdef /.notdef /.notdef /.notdef /.notdef
/.notdef /.notdef /space /exclam /quotedbl
/numbersign /dollar /percent /ampersand /quotesingle
/parenleft /parenright /asterisk /plus /comma
/hyphen /period /slash /zero /one
/two /three /four /five /six
/seven /eight /nine /colon /semicolon
/less /equal /greater /question /at
/A /B /C /D /E
/F /G /H /I /J
/K /L /M /N /O
/P /Q /R /S /T
/U /V /W /X /Y
/Z /bracketleft /backslash /bracketright /asciicircum
/underscore /quoteleft /a /b /c
/d /e /f /g /h
/i /j /k /l /m
/n /o /p /q /r
/s /t /u /v /w
/x /y /z /braceleft /bar
/braceright /asciitilde /bullet /Euro /bullet
/quotesinglbase /florin /quotedblbase /ellipsis /dagger
/daggerdbl /circumflex /perthousand /Scaron /guilsinglleft
/OE /bullet /Zcaron /bullet /bullet
/quoteleft /quoteright /quotedblleft /quotedblright /bullet
/endash /emdash /asciitilde /trademark /scaron
/guilsinglright /oe /bullet /zcaron /Ydieresis
/space /exclamdown /cent /sterling /currency
/yen /brokenbar /section /dieresis /copyright
/ordfeminine /guillemotleft /logicalnot /sfthyphen /registered
/macron /degree /plusminus /twosuperior /threesuperior
/acute /mu /paragraph /middot /cedilla
/onesuperior /ordmasculine /guillemotright /onequarter /onehalf
/threequarters /questiondown /Agrave /Aacute /Acircumflex
/Atilde /Adieresis /Aring /AE /Ccedilla
/Egrave /Eacute /Ecircumflex /Edieresis /Igrave
/Iacute /Icircumflex /Idieresis /Eth /Ntilde
/Ograve /Oacute /Ocircumflex /Otilde /Odieresis
/multiply /Oslash /Ugrave /Uacute /Ucircumflex
/Udieresis /Yacute /Thorn /germandbls /agrave
/aacute /acircumflex /atilde /adieresis /aring
/ae /ccedilla /egrave /eacute /ecircumflex
/edieresis /igrave /iacute /icircumflex /idieresis
/eth /ntilde /ograve /oacute /ocircumflex
/otilde /odieresis /divide /oslash /ugrave
/uacute /ucircumflex /udieresis /yacute /thorn
/ydieresis
] def
%%EndResource
%FOPBeginFontReencode
/Courier-Oblique findfont
dup length dict begin
  {1 index /FID ne {def} {pop pop} ifelse} forall
  /Encoding WinAnsiEncoding def
  currentdict
end
/Courier-Oblique exch definefont pop
/Courier-BoldOblique findfont
dup length dict begin
  {1 index /FID ne {def} {pop pop} ifelse} forall
  /Encoding WinAnsiEncoding def
  currentdict
end
/Courier-BoldOblique exch definefont pop
/Courier-Bold findfont
dup length dict begin
  {1 index /FID ne {def} {pop pop} ifelse} forall
  /Encoding WinAnsiEncoding def
  currentdict
end
/Courier-Bold exch definefont pop
/Helvetica findfont
dup length dict begin
  {1 index /FID ne {def} {pop pop} ifelse} forall
  /Encoding WinAnsiEncoding def
  currentdict
end
/Helvetica exch definefont pop
/Helvetica-Oblique findfont
dup length dict begin
  {1 index /FID ne {def} {pop pop} ifelse} forall
  /Encoding WinAnsiEncoding def
  currentdict
end
/Helvetica-Oblique exch definefont pop
/Helvetica-Bold findfont
dup length dict begin
  {1 index /FID ne {def} {pop pop} ifelse} forall
  /Encoding WinAnsiEncoding def
  currentdict
end
/Helvetica-Bold exch definefont pop
/Helvetica-BoldOblique findfont
dup length dict begin
  {1 index /FID ne {def} {pop pop} ifelse} forall
  /Encoding WinAnsiEncoding def
  currentdict
end
/Helvetica-BoldOblique exch definefont pop
/Times-Roman findfont
dup length dict begin
  {1 index /FID ne {def} {pop pop} ifelse} forall
  /Encoding WinAnsiEncoding def
  currentdict
end
/Times-Roman exch definefont pop
/Times-Italic findfont
dup length dict begin
  {1 index /FID ne {def} {pop pop} ifelse} forall
  /Encoding WinAnsiEncoding def
  currentdict
end
/Times-Italic exch definefont pop
/Times-Bold findfont
dup length dict begin
  {1 index /FID ne {def} {pop pop} ifelse} forall
  /Encoding WinAnsiEncoding def
  currentdict
end
/Times-Bold exch definefont pop
/Times-BoldItalic findfont
dup length dict begin
  {1 index /FID ne {def} {pop pop} ifelse} forall
  /Encoding WinAnsiEncoding def
  currentdict
end
/Times-BoldItalic exch definefont pop
/Courier findfont
dup length dict begin
  {1 index /FID ne {def} {pop pop} ifelse} forall
  /Encoding WinAnsiEncoding def
  currentdict
end
/Courier exch definefont pop
%FOPEndFontReencode
%%EndProlog
%%Page: 1 1
%%PageBoundingBox: 0 0 512 72
%%BeginPageSetup
[1 0 0 -1 0 72] CT
%%EndPageSetup
GS
1 GC
N
0 0 512 72 re
f
GR
GS
1 GC
N
0 0 512 72 re
f
GR
GS
1 GC
N
84 64 M
238 64 L
238 10.5 L
84 10.5 L
cp
f
GR
GS
0.149 GC
2 setlinecap
1 LJ
0.5 LW
N
84 64 M
238 64 L
S
GR
GS
0.149 GC
2 setlinecap
1 LJ
0.5 LW
N
84 64 M
84 10.5 L
S
GR
GS
0.149 GC
2 setlinecap
1 LJ
0.5 LW
N
84 53.3 M
85.54 53.3 L
S
GR
GS
0.149 GC
2 setlinecap
1 LJ
0.5 LW
N
84 31.9 M
85.54 31.9 L
S
GR
GS
0.149 GC
2 setlinecap
1 LJ
0.5 LW
N
84 10.5 M
85.54 10.5 L
S
GR
GS
[1 0 0 1 78.4 53.3] CT
0.149 GC
/Helvetica 18 F
GS
[1 0 0 1 0 0] CT
-33 7 moveto 
1 -1 scale
(-0.8) t 
GR
GR
GS
[1 0 0 1 78.4 31.9] CT
0.149 GC
/Helvetica 18 F
GS
[1 0 0 1 0 0] CT
-33 7 moveto 
1 -1 scale
(-0.7) t 
GR
GR
GS
[1 0 0 1 78.4 10.5] CT
0.149 GC
/Helvetica 18 F
GS
[1 0 0 1 0 0] CT
-33 7 moveto 
1 -1 scale
(-0.6) t 
GR
GR
GS
[0 -1 1 0 42.9 37.24998] CT
0.149 GC
/Helvetica 18 F
GS
[1 0 0 1 0 0] CT
-23.5 -4 moveto 
1 -1 scale
(Slope) t 
GR
GR
GS
0.149 GC
1 LJ
0.5 LW
N
84 10.5 M
238 10.5 L
S
GR
GS
N
87.85 10.5 M
87.85 36.324 L
118.65 36.324 L
118.65 10.5 L
cp
f
GR
GS
10.0 ML
0.5 LW
N
87.85 10.5 M
87.85 36.324 L
118.65 36.324 L
118.65 10.5 L
cp
S
GR
GS
1 LJ
2 LW
N
103.25 36.324 M
103.25 38.001 L
S
GR
GS
1 LJ
2 LW
N
103.25 36.324 M
103.25 34.646 L
S
GR
GS
[1 0 0 1 103.25 38.0014] CT
N
-3 0 M
3 0 L
f
GR
GS
[1 0 0 1 103.25 38.0014] CT
10.0 ML
2 LW
N
-3 0 M
3 0 L
S
GR
GS
[1 0 0 1 103.25 34.64593] CT
N
/f1394637256{-3 0 M
3 0 L}def
f1394637256
f
GR
GS
[1 0 0 1 103.25 34.64593] CT
10.0 ML
2 LW
N
-3 0 M
3 0 L
S
GR
GS
1 0 0 RC
N
/f-707505308{126.35 10.5 M
126.35 51.468 L
157.15 51.468 L
157.15 10.5 L
cp}def
f-707505308
f
GR
GS
1 0 0 RC
10.0 ML
0.5 LW
N
126.35 10.5 M
126.35 51.468 L
157.15 51.468 L
157.15 10.5 L
cp
S
GR
GS
1 LJ
2 LW
N
141.75 51.468 M
141.75 53.059 L
S
GR
GS
1 LJ
2 LW
N
141.75 51.468 M
141.75 49.878 L
S
GR
GS
[1 0 0 1 141.75 53.05852] CT
N
f1394637256
f
GR
GS
[1 0 0 1 141.75 53.05852] CT
10.0 ML
2 LW
N
-3 0 M
3 0 L
S
GR
GS
[1 0 0 1 141.75 49.87779] CT
N
f1394637256
f
GR
GS
[1 0 0 1 141.75 49.87779] CT
10.0 ML
2 LW
N
-3 0 M
3 0 L
S
GR
GS
1 0 0 RC
N
/f263197546{164.85 10.5 M
164.85 44.474 L
195.65 44.474 L
195.65 10.5 L
cp}def
f263197546
f
GR
GS
1 0 0 RC
10.0 ML
0.5 LW
N
164.85 10.5 M
164.85 44.474 L
195.65 44.474 L
195.65 10.5 L
cp
S
GR
GS
1 LJ
2 LW
N
180.25 44.474 M
180.25 45.754 L
S
GR
GS
1 LJ
2 LW
N
180.25 44.474 M
180.25 43.194 L
S
GR
GS
[1 0 0 1 180.25 45.75359] CT
N
f1394637256
f
GR
GS
[1 0 0 1 180.25 45.75359] CT
10.0 ML
2 LW
N
-3 0 M
3 0 L
S
GR
GS
[1 0 0 1 180.25 43.19426] CT
N
f1394637256
f
GR
GS
[1 0 0 1 180.25 43.19426] CT
10.0 ML
2 LW
N
-3 0 M
3 0 L
S
GR
GS
N
/f-1846393878{203.35 10.5 M
203.35 41.882 L
234.15 41.882 L
234.15 10.5 L
cp}def
f-1846393878
f
GR
GS
10.0 ML
0.5 LW
N
203.35 10.5 M
203.35 41.882 L
234.15 41.882 L
234.15 10.5 L
cp
S
GR
GS
1 LJ
2 LW
N
218.75 41.882 M
218.75 43.779 L
S
GR
GS
1 LJ
2 LW
N
218.75 41.882 M
218.75 39.984 L
S
GR
GS
[1 0 0 1 218.75 43.77927] CT
N
f1394637256
f
GR
GS
[1 0 0 1 218.75 43.77927] CT
10.0 ML
2 LW
N
-3 0 M
3 0 L
S
GR
GS
[1 0 0 1 218.75 39.98394] CT
N
f1394637256
f
GR
GS
[1 0 0 1 218.75 39.98394] CT
10.0 ML
2 LW
N
-3 0 M
3 0 L
S
GR
GS
1 LJ
0.5 LW
N
107.1 64 M
137.9 64 L
S
GR
GS
1 GC
N
/f-157294098{110.5 72 M
134.5 72 L
134.5 52 L
110.5 52 L
cp}def
f-157294098
f
GR
GS
[1 0 0 1 122.5 64.00001] CT
/Helvetica-Bold 18 F
GS
[1 0 0 1 0 0] CT
-11 7 moveto 
1 -1 scale
(***) t 
GR
GR
GS
1 GC
N
/f-692772210{309.5 64 M
463.5 64 L
463.5 10.5 L
309.5 10.5 L
cp}def
f-692772210
f
GR
GS
0.149 GC
2 setlinecap
1 LJ
0.5 LW
N
309.5 64 M
463.5 64 L
S
GR
GS
0.149 GC
2 setlinecap
1 LJ
0.5 LW
N
309.5 64 M
309.5 10.5 L
S
GR
GS
0.149 GC
2 setlinecap
1 LJ
0.5 LW
N
309.5 53.3 M
311.04 53.3 L
S
GR
GS
0.149 GC
2 setlinecap
1 LJ
0.5 LW
N
309.5 31.9 M
311.04 31.9 L
S
GR
GS
0.149 GC
2 setlinecap
1 LJ
0.5 LW
N
309.5 10.5 M
311.04 10.5 L
S
GR
GS
[1 0 0 1 303.89999 53.3] CT
0.149 GC
/Helvetica 18 F
GS
[1 0 0 1 0 0] CT
-33 7 moveto 
1 -1 scale
(-0.8) t 
GR
GR
GS
[1 0 0 1 303.89999 31.9] CT
0.149 GC
/Helvetica 18 F
GS
[1 0 0 1 0 0] CT
-33 7 moveto 
1 -1 scale
(-0.7) t 
GR
GR
GS
[1 0 0 1 303.89999 10.5] CT
0.149 GC
/Helvetica 18 F
GS
[1 0 0 1 0 0] CT
-33 7 moveto 
1 -1 scale
(-0.6) t 
GR
GR
GS
[0 -1 1 0 268.39999 37.24998] CT
0.149 GC
/Helvetica 18 F
GS
[1 0 0 1 0 0] CT
-23.5 -4 moveto 
1 -1 scale
(Slope) t 
GR
GR
GS
0.149 GC
1 LJ
0.5 LW
N
309.5 10.5 M
463.5 10.5 L
S
GR
GS
N
/f1578816018{313.35 10.5 M
313.35 32.72 L
344.15 32.72 L
344.15 10.5 L
cp}def
f1578816018
f
GR
GS
10.0 ML
0.5 LW
N
313.35 10.5 M
313.35 32.72 L
344.15 32.72 L
344.15 10.5 L
cp
S
GR
GS
1 LJ
2 LW
N
328.75 32.72 M
328.75 34.59 L
S
GR
GS
1 LJ
2 LW
N
328.75 32.72 M
328.75 30.85 L
S
GR
GS
[1 0 0 1 328.75 34.59011] CT
N
f1394637256
f
GR
GS
[1 0 0 1 328.75 34.59011] CT
10.0 ML
2 LW
N
-3 0 M
3 0 L
S
GR
GS
[1 0 0 1 328.75 30.8499] CT
N
f1394637256
f
GR
GS
[1 0 0 1 328.75 30.8499] CT
10.0 ML
2 LW
N
-3 0 M
3 0 L
S
GR
GS
1 0 0 RC
N
/f1238828830{351.85 10.5 M
351.85 43.525 L
382.65 43.525 L
382.65 10.5 L
cp}def
f1238828830
f
GR
GS
1 0 0 RC
10.0 ML
0.5 LW
N
351.85 10.5 M
351.85 43.525 L
382.65 43.525 L
382.65 10.5 L
cp
S
GR
GS
1 LJ
2 LW
N
367.25 43.525 M
367.25 44.92 L
S
GR
GS
1 LJ
2 LW
N
367.25 43.525 M
367.25 42.129 L
S
GR
GS
[1 0 0 1 367.25 44.92017] CT
N
f1394637256
f
GR
GS
[1 0 0 1 367.25 44.92017] CT
10.0 ML
2 LW
N
-3 0 M
3 0 L
S
GR
GS
[1 0 0 1 367.25 42.12924] CT
N
f1394637256
f
GR
GS
[1 0 0 1 367.25 42.12924] CT
10.0 ML
2 LW
N
-3 0 M
3 0 L
S
GR
GS
1 0 0 RC
N
/f937927726{390.35 10.5 M
390.35 36.731 L
421.15 36.731 L
421.15 10.5 L
cp}def
f937927726
f
GR
GS
1 0 0 RC
10.0 ML
0.5 LW
N
390.35 10.5 M
390.35 36.731 L
421.15 36.731 L
421.15 10.5 L
cp
S
GR
GS
1 LJ
2 LW
N
405.75 36.731 M
405.75 38.126 L
S
GR
GS
1 LJ
2 LW
N
405.75 36.731 M
405.75 35.336 L
S
GR
GS
[1 0 0 1 405.75 38.12639] CT
N
f1394637256
f
GR
GS
[1 0 0 1 405.75 38.12639] CT
10.0 ML
2 LW
N
-3 0 M
3 0 L
S
GR
GS
[1 0 0 1 405.75 35.33615] CT
N
f1394637256
f
GR
GS
[1 0 0 1 405.75 35.33615] CT
10.0 ML
2 LW
N
-3 0 M
3 0 L
S
GR
GS
N
/f-1479763924{428.85 10.5 M
428.85 37.743 L
459.65 37.743 L
459.65 10.5 L
cp}def
f-1479763924
f
GR
GS
10.0 ML
0.5 LW
N
428.85 10.5 M
428.85 37.743 L
459.65 37.743 L
459.65 10.5 L
cp
S
GR
GS
1 LJ
2 LW
N
444.25 37.743 M
444.25 39.628 L
S
GR
GS
1 LJ
2 LW
N
444.25 37.743 M
444.25 35.859 L
S
GR
GS
[1 0 0 1 444.25 39.62769] CT
N
f1394637256
f
GR
GS
[1 0 0 1 444.25 39.62769] CT
10.0 ML
2 LW
N
-3 0 M
3 0 L
S
GR
GS
[1 0 0 1 444.25 35.85927] CT
N
f1394637256
f
GR
GS
[1 0 0 1 444.25 35.85927] CT
10.0 ML
2 LW
N
-3 0 M
3 0 L
S
GR
GS
1 LJ
0.5 LW
N
332.6 64 M
363.4 64 L
S
GR
GS
1 GC
N
/f744654{336 72 M
360 72 L
360 52 L
336 52 L
cp}def
f744654
f
GR
GS
[1 0 0 1 348 64.00001] CT
/Helvetica-Bold 18 F
GS
[1 0 0 1 0 0] CT
-11 7 moveto 
1 -1 scale
(***) t 
GR
GR
%%Trailer
%%Pages: 1
%%EOF
