%!PS-Adobe-3.0 EPSF-3.0
%%Creator: (MATLAB, The Mathworks, Inc. Version 9.3.0.713579 \(R2017b\). Operating System: Mac OS X)
%%Title: /Volumes/LNDG/Projects/StateSwitch/dynamic/data/eeg/rest/B_analyses/F_periRhythmMSE/C_figures/E_FFT_high.eps
%%CreationDate: 2020-03-17T18:27:20
%%Pages: (atend)
%%BoundingBox:     4     0   367   340
%%LanguageLevel: 3
%%EndComments
%%BeginProlog
%%BeginResource: procset (Apache XML Graphics Std ProcSet) 1.2 0
%%Version: 1.2 0
%%Copyright: (Copyright 2001-2003,2010 The Apache Software Foundation. License terms: http://www.apache.org/licenses/LICENSE-2.0)
/bd{bind def}bind def
/ld{load def}bd
/GR/grestore ld
/GS/gsave ld
/RM/rmoveto ld
/C/curveto ld
/t/show ld
/L/lineto ld
/ML/setmiterlimit ld
/CT/concat ld
/f/fill ld
/N/newpath ld
/S/stroke ld
/CC/setcmykcolor ld
/A/ashow ld
/cp/closepath ld
/RC/setrgbcolor ld
/LJ/setlinejoin ld
/GC/setgray ld
/LW/setlinewidth ld
/M/moveto ld
/re {4 2 roll M
1 index 0 rlineto
0 exch rlineto
neg 0 rlineto
cp } bd
/_ctm matrix def
/_tm matrix def
/BT { _ctm currentmatrix pop matrix _tm copy pop 0 0 moveto } bd
/ET { _ctm setmatrix } bd
/iTm { _ctm setmatrix _tm concat } bd
/Tm { _tm astore pop iTm 0 0 moveto } bd
/ux 0.0 def
/uy 0.0 def
/F {
  /Tp exch def
  /Tf exch def
  Tf findfont Tp scalefont setfont
  /cf Tf def  /cs Tp def
} bd
/ULS {currentpoint /uy exch def /ux exch def} bd
/ULE {
  /Tcx currentpoint pop def
  gsave
  newpath
  cf findfont cs scalefont dup
  /FontMatrix get 0 get /Ts exch def /FontInfo get dup
  /UnderlinePosition get Ts mul /To exch def
  /UnderlineThickness get Ts mul /Tt exch def
  ux uy To add moveto  Tcx uy To add lineto
  Tt setlinewidth stroke
  grestore
} bd
/OLE {
  /Tcx currentpoint pop def
  gsave
  newpath
  cf findfont cs scalefont dup
  /FontMatrix get 0 get /Ts exch def /FontInfo get dup
  /UnderlinePosition get Ts mul /To exch def
  /UnderlineThickness get Ts mul /Tt exch def
  ux uy To add cs add moveto Tcx uy To add cs add lineto
  Tt setlinewidth stroke
  grestore
} bd
/SOE {
  /Tcx currentpoint pop def
  gsave
  newpath
  cf findfont cs scalefont dup
  /FontMatrix get 0 get /Ts exch def /FontInfo get dup
  /UnderlinePosition get Ts mul /To exch def
  /UnderlineThickness get Ts mul /Tt exch def
  ux uy To add cs 10 mul 26 idiv add moveto Tcx uy To add cs 10 mul 26 idiv add lineto
  Tt setlinewidth stroke
  grestore
} bd
/QT {
/Y22 exch store
/X22 exch store
/Y21 exch store
/X21 exch store
currentpoint
/Y21 load 2 mul add 3 div exch
/X21 load 2 mul add 3 div exch
/X21 load 2 mul /X22 load add 3 div
/Y21 load 2 mul /Y22 load add 3 div
/X22 load /Y22 load curveto
} bd
/SSPD {
dup length /d exch dict def
{
/v exch def
/k exch def
currentpagedevice k known {
/cpdv currentpagedevice k get def
v cpdv ne {
/upd false def
/nullv v type /nulltype eq def
/nullcpdv cpdv type /nulltype eq def
nullv nullcpdv or
{
/upd true def
} {
/sametype v type cpdv type eq def
sametype {
v type /arraytype eq {
/vlen v length def
/cpdvlen cpdv length def
vlen cpdvlen eq {
0 1 vlen 1 sub {
/i exch def
/obj v i get def
/cpdobj cpdv i get def
obj cpdobj ne {
/upd true def
exit
} if
} for
} {
/upd true def
} ifelse
} {
v type /dicttype eq {
v {
/dv exch def
/dk exch def
/cpddv cpdv dk get def
dv cpddv ne {
/upd true def
exit
} if
} forall
} {
/upd true def
} ifelse
} ifelse
} if
} ifelse
upd true eq {
d k v put
} if
} if
} if
} forall
d length 0 gt {
d setpagedevice
} if
} bd
/RE { % /NewFontName [NewEncodingArray] /FontName RE -
  findfont dup length dict begin
  {
    1 index /FID ne
    {def} {pop pop} ifelse
  } forall
  /Encoding exch def
  /FontName 1 index def
  currentdict definefont pop
  end
} bind def
%%EndResource
%%BeginResource: procset (Apache XML Graphics EPS ProcSet) 1.0 0
%%Version: 1.0 0
%%Copyright: (Copyright 2002-2003 The Apache Software Foundation. License terms: http://www.apache.org/licenses/LICENSE-2.0)
/BeginEPSF { %def
/b4_Inc_state save def         % Save state for cleanup
/dict_count countdictstack def % Count objects on dict stack
/op_count count 1 sub def      % Count objects on operand stack
userdict begin                 % Push userdict on dict stack
/showpage { } def              % Redefine showpage, { } = null proc
0 setgray 0 setlinecap         % Prepare graphics state
1 setlinewidth 0 setlinejoin
10 setmiterlimit [ ] 0 setdash newpath
/languagelevel where           % If level not equal to 1 then
{pop languagelevel             % set strokeadjust and
1 ne                           % overprint to their defaults.
{false setstrokeadjust false setoverprint
} if
} if
} bd
/EndEPSF { %def
count op_count sub {pop} repeat            % Clean up stacks
countdictstack dict_count sub {end} repeat
b4_Inc_state restore
} bd
%%EndResource
%FOPBeginFontDict
%%IncludeResource: font Courier-Oblique
%%IncludeResource: font Courier-BoldOblique
%%IncludeResource: font Courier-Bold
%%IncludeResource: font ZapfDingbats
%%IncludeResource: font Symbol
%%IncludeResource: font Helvetica
%%IncludeResource: font Helvetica-Oblique
%%IncludeResource: font Helvetica-Bold
%%IncludeResource: font Helvetica-BoldOblique
%%IncludeResource: font Times-Roman
%%IncludeResource: font Times-Italic
%%IncludeResource: font Times-Bold
%%IncludeResource: font Times-BoldItalic
%%IncludeResource: font Courier
%FOPEndFontDict
%%BeginResource: encoding WinAnsiEncoding
/WinAnsiEncoding [
/.notdef /.notdef /.notdef /.notdef /.notdef
/.notdef /.notdef /.notdef /.notdef /.notdef
/.notdef /.notdef /.notdef /.notdef /.notdef
/.notdef /.notdef /.notdef /.notdef /.notdef
/.notdef /.notdef /.notdef /.notdef /.notdef
/.notdef /.notdef /.notdef /.notdef /.notdef
/.notdef /.notdef /space /exclam /quotedbl
/numbersign /dollar /percent /ampersand /quotesingle
/parenleft /parenright /asterisk /plus /comma
/hyphen /period /slash /zero /one
/two /three /four /five /six
/seven /eight /nine /colon /semicolon
/less /equal /greater /question /at
/A /B /C /D /E
/F /G /H /I /J
/K /L /M /N /O
/P /Q /R /S /T
/U /V /W /X /Y
/Z /bracketleft /backslash /bracketright /asciicircum
/underscore /quoteleft /a /b /c
/d /e /f /g /h
/i /j /k /l /m
/n /o /p /q /r
/s /t /u /v /w
/x /y /z /braceleft /bar
/braceright /asciitilde /bullet /Euro /bullet
/quotesinglbase /florin /quotedblbase /ellipsis /dagger
/daggerdbl /circumflex /perthousand /Scaron /guilsinglleft
/OE /bullet /Zcaron /bullet /bullet
/quoteleft /quoteright /quotedblleft /quotedblright /bullet
/endash /emdash /asciitilde /trademark /scaron
/guilsinglright /oe /bullet /zcaron /Ydieresis
/space /exclamdown /cent /sterling /currency
/yen /brokenbar /section /dieresis /copyright
/ordfeminine /guillemotleft /logicalnot /sfthyphen /registered
/macron /degree /plusminus /twosuperior /threesuperior
/acute /mu /paragraph /middot /cedilla
/onesuperior /ordmasculine /guillemotright /onequarter /onehalf
/threequarters /questiondown /Agrave /Aacute /Acircumflex
/Atilde /Adieresis /Aring /AE /Ccedilla
/Egrave /Eacute /Ecircumflex /Edieresis /Igrave
/Iacute /Icircumflex /Idieresis /Eth /Ntilde
/Ograve /Oacute /Ocircumflex /Otilde /Odieresis
/multiply /Oslash /Ugrave /Uacute /Ucircumflex
/Udieresis /Yacute /Thorn /germandbls /agrave
/aacute /acircumflex /atilde /adieresis /aring
/ae /ccedilla /egrave /eacute /ecircumflex
/edieresis /igrave /iacute /icircumflex /idieresis
/eth /ntilde /ograve /oacute /ocircumflex
/otilde /odieresis /divide /oslash /ugrave
/uacute /ucircumflex /udieresis /yacute /thorn
/ydieresis
] def
%%EndResource
%FOPBeginFontReencode
/Courier-Oblique findfont
dup length dict begin
  {1 index /FID ne {def} {pop pop} ifelse} forall
  /Encoding WinAnsiEncoding def
  currentdict
end
/Courier-Oblique exch definefont pop
/Courier-BoldOblique findfont
dup length dict begin
  {1 index /FID ne {def} {pop pop} ifelse} forall
  /Encoding WinAnsiEncoding def
  currentdict
end
/Courier-BoldOblique exch definefont pop
/Courier-Bold findfont
dup length dict begin
  {1 index /FID ne {def} {pop pop} ifelse} forall
  /Encoding WinAnsiEncoding def
  currentdict
end
/Courier-Bold exch definefont pop
/Helvetica findfont
dup length dict begin
  {1 index /FID ne {def} {pop pop} ifelse} forall
  /Encoding WinAnsiEncoding def
  currentdict
end
/Helvetica exch definefont pop
/Helvetica-Oblique findfont
dup length dict begin
  {1 index /FID ne {def} {pop pop} ifelse} forall
  /Encoding WinAnsiEncoding def
  currentdict
end
/Helvetica-Oblique exch definefont pop
/Helvetica-Bold findfont
dup length dict begin
  {1 index /FID ne {def} {pop pop} ifelse} forall
  /Encoding WinAnsiEncoding def
  currentdict
end
/Helvetica-Bold exch definefont pop
/Helvetica-BoldOblique findfont
dup length dict begin
  {1 index /FID ne {def} {pop pop} ifelse} forall
  /Encoding WinAnsiEncoding def
  currentdict
end
/Helvetica-BoldOblique exch definefont pop
/Times-Roman findfont
dup length dict begin
  {1 index /FID ne {def} {pop pop} ifelse} forall
  /Encoding WinAnsiEncoding def
  currentdict
end
/Times-Roman exch definefont pop
/Times-Italic findfont
dup length dict begin
  {1 index /FID ne {def} {pop pop} ifelse} forall
  /Encoding WinAnsiEncoding def
  currentdict
end
/Times-Italic exch definefont pop
/Times-Bold findfont
dup length dict begin
  {1 index /FID ne {def} {pop pop} ifelse} forall
  /Encoding WinAnsiEncoding def
  currentdict
end
/Times-Bold exch definefont pop
/Times-BoldItalic findfont
dup length dict begin
  {1 index /FID ne {def} {pop pop} ifelse} forall
  /Encoding WinAnsiEncoding def
  currentdict
end
/Times-BoldItalic exch definefont pop
/Courier findfont
dup length dict begin
  {1 index /FID ne {def} {pop pop} ifelse} forall
  /Encoding WinAnsiEncoding def
  currentdict
end
/Courier exch definefont pop
%FOPEndFontReencode
%%EndProlog
%%Page: 1 1
%%PageBoundingBox: 0 0 384 360
%%BeginPageSetup
[1 0 0 -1 0 360] CT
%%EndPageSetup
GS
1 GC
N
0 0 384 360 re
f
GR
GS
1 GC
N
0 0 384 360 re
f
GR
GS
1 GC
N
69 305 M
347.5 305 L
347.5 27 L
69 27 L
cp
f
GR
GS
0.149 GC
2 setlinecap
1 LJ
0.5 LW
N
69 305 M
347.5 305 L
S
GR
GS
0.149 GC
2 setlinecap
1 LJ
0.5 LW
N
102.47 305 M
102.47 302.215 L
S
GR
GS
0.149 GC
2 setlinecap
1 LJ
0.5 LW
N
186.577 305 M
186.577 302.215 L
S
GR
GS
0.149 GC
2 setlinecap
1 LJ
0.5 LW
N
270.685 305 M
270.685 302.215 L
S
GR
GS
[1 0 0 1 102.46976 311.00003] CT
0.149 GC
/Helvetica 20 F
GS
[1 0 0 1 0 0] CT
-14 20 moveto 
1 -1 scale
(0.5) t 
GR
GR
GS
[1 0 0 1 186.57729 311.00003] CT
0.149 GC
/Helvetica 20 F
GS
[1 0 0 1 0 0] CT
-6 20 moveto 
1 -1 scale
(1) t 
GR
GR
GS
[1 0 0 1 270.68481 311.00003] CT
0.149 GC
/Helvetica 20 F
GS
[1 0 0 1 0 0] CT
-14 20 moveto 
1 -1 scale
(1.5) t 
GR
GR
GS
[1 0 0 1 208.25014 336.00003] CT
0.149 GC
/Helvetica 20 F
GS
[1 0 0 1 0 0] CT
-95 20 moveto 
1 -1 scale
(Frequency [log10 Hz]) t 
GR
GR
GS
0.149 GC
2 setlinecap
1 LJ
0.5 LW
N
69 305 M
69 27 L
S
GR
GS
0.149 GC
2 setlinecap
1 LJ
0.5 LW
N
69 305 M
71.785 305 L
S
GR
GS
0.149 GC
2 setlinecap
1 LJ
0.5 LW
N
69 249.4 M
71.785 249.4 L
S
GR
GS
0.149 GC
2 setlinecap
1 LJ
0.5 LW
N
69 193.8 M
71.785 193.8 L
S
GR
GS
0.149 GC
2 setlinecap
1 LJ
0.5 LW
N
69 138.2 M
71.785 138.2 L
S
GR
GS
0.149 GC
2 setlinecap
1 LJ
0.5 LW
N
69 82.6 M
71.785 82.6 L
S
GR
GS
0.149 GC
2 setlinecap
1 LJ
0.5 LW
N
69 27 M
71.785 27 L
S
GR
GS
[1 0 0 1 63 305] CT
0.149 GC
/Helvetica 20 F
GS
[1 0 0 1 0 0] CT
-36 7.5 moveto 
1 -1 scale
(-8.5) t 
GR
GR
GS
[1 0 0 1 63 249.39999] CT
0.149 GC
/Helvetica 20 F
GS
[1 0 0 1 0 0] CT
-19 7.5 moveto 
1 -1 scale
(-8) t 
GR
GR
GS
[1 0 0 1 63 193.8] CT
0.149 GC
/Helvetica 20 F
GS
[1 0 0 1 0 0] CT
-36 7.5 moveto 
1 -1 scale
(-7.5) t 
GR
GR
GS
[1 0 0 1 63 138.2] CT
0.149 GC
/Helvetica 20 F
GS
[1 0 0 1 0 0] CT
-19 7.5 moveto 
1 -1 scale
(-7) t 
GR
GR
GS
[1 0 0 1 63 82.6] CT
0.149 GC
/Helvetica 20 F
GS
[1 0 0 1 0 0] CT
-36 7.5 moveto 
1 -1 scale
(-6.5) t 
GR
GR
GS
[1 0 0 1 63 27] CT
0.149 GC
/Helvetica 20 F
GS
[1 0 0 1 0 0] CT
-19 7.5 moveto 
1 -1 scale
(-6) t 
GR
GR
GS
[0 -1 1 0 24 165.99985] CT
0.149 GC
/Helvetica 20 F
GS
[1 0 0 1 0 0] CT
-56.5 -5 moveto 
1 -1 scale
(log10 Power) t 
GR
GR
GS
1 LJ
4 LW
N
69 128.839 M
75.963 129.673 L
82.319 132.085 L
88.167 135.572 L
93.581 139.534 L
101.017 145.039 L
107.765 148.817 L
113.942 150.909 L
119.638 152.494 L
126.601 155.463 L
132.957 158.746 L
138.805 159.938 L
145.512 158.654 L
151.654 158.826 L
157.32 160.424 L
163.586 157.945 L
170.276 154.396 L
176.404 156.748 L
182.83 152.972 L
189.443 153.776 L
195.506 155.91 L
201.701 156.281 L
208.501 164.571 L
214.723 171.485 L
220.913 172.656 L
227.041 182.032 L
233.468 192.114 L
239.728 201.282 L
246.144 213.843 L
252.635 226.034 L
258.868 234.623 L
265.111 238.362 L
271.551 243.36 L
277.889 251.793 L
284.298 252.466 L
290.542 256.138 L
296.943 258.958 L
303.273 261.957 L
309.506 263.929 L
315.874 269.731 L
322.189 270 L
328.526 271.65 L
334.839 278.083 L
341.18 277.632 L
347.5 289.62 L
S
GR
GS
1 0 0 RC
1 LJ
4 LW
N
69 120.679 M
75.963 121.189 L
82.319 123.079 L
88.167 125.805 L
93.581 128.767 L
101.017 132.472 L
107.765 134.46 L
113.942 135.058 L
119.638 135.345 L
126.601 136.409 L
132.957 137.715 L
138.805 138.041 L
145.512 136.712 L
151.654 130.5 L
157.32 115.739 L
163.586 95.662 L
170.276 84.894 L
176.404 80.296 L
182.83 65.051 L
189.443 64.906 L
195.506 76.136 L
201.701 82.343 L
208.501 115.08 L
214.723 133.267 L
220.913 146.203 L
227.041 163.613 L
233.468 176.14 L
239.728 187.11 L
246.144 201.326 L
252.635 214.873 L
258.868 225.018 L
265.111 231.629 L
271.551 237.068 L
277.889 247.212 L
284.298 250.48 L
290.542 252.921 L
296.943 255.115 L
303.273 258.64 L
309.506 262.577 L
315.874 266.55 L
322.189 268.837 L
328.526 269.629 L
334.839 276.594 L
341.18 276.102 L
347.5 286.728 L
S
GR
GS
0.91 GC
N
75.963 124.671 M
69 120.546 L
69 127.937 L
75.963 131.837 L
82.319 135.401 L
88.167 138.683 L
93.581 141.725 L
101.017 145.908 L
107.765 149.71 L
113.942 153.196 L
119.638 156.415 L
126.601 160.357 L
132.957 163.963 L
138.805 167.286 L
145.512 171.105 L
151.654 174.61 L
157.32 177.85 L
163.586 181.44 L
170.276 185.283 L
176.404 188.811 L
182.83 192.519 L
189.443 196.344 L
195.506 199.86 L
201.701 203.459 L
208.501 207.419 L
214.723 211.049 L
220.913 214.669 L
227.041 218.258 L
233.468 222.028 L
239.728 225.707 L
246.144 229.483 L
252.635 233.308 L
258.868 236.987 L
265.111 240.675 L
271.551 244.484 L
277.889 248.236 L
284.298 252.034 L
290.542 255.738 L
296.943 259.537 L
303.273 263.297 L
309.506 267.002 L
315.874 270.789 L
322.189 274.547 L
328.526 278.32 L
334.839 282.081 L
341.18 285.859 L
347.5 289.627 L
347.5 279.843 L
341.18 276.327 L
334.839 272.797 L
328.526 269.282 L
322.189 265.75 L
315.874 262.23 L
309.506 258.678 L
303.273 255.198 L
296.943 251.663 L
290.542 248.085 L
284.298 244.591 L
277.889 241.003 L
271.551 237.45 L
265.111 233.837 L
258.868 230.33 L
252.635 226.824 L
246.144 223.168 L
239.728 219.55 L
233.468 216.013 L
227.041 212.377 L
220.913 208.903 L
214.723 205.387 L
208.501 201.847 L
201.701 197.969 L
195.506 194.428 L
189.443 190.955 L
182.83 187.159 L
176.404 183.461 L
170.276 179.926 L
163.586 176.058 L
157.32 172.427 L
151.654 169.137 L
145.512 165.562 L
138.805 161.651 L
132.957 158.234 L
126.601 154.513 L
119.638 150.43 L
113.942 147.085 L
107.765 143.451 L
101.017 139.475 L
93.581 135.089 L
88.167 131.891 L
82.319 128.433 L
cp
f
GR
GS
0.549 GC
1 LJ
0.5 LW
N
69 120.546 M
75.963 124.671 L
82.319 128.433 L
88.167 131.891 L
93.581 135.089 L
101.017 139.475 L
107.765 143.451 L
113.942 147.085 L
119.638 150.43 L
126.601 154.513 L
132.957 158.234 L
138.805 161.651 L
145.512 165.562 L
151.654 169.137 L
157.32 172.427 L
163.586 176.058 L
170.276 179.926 L
176.404 183.461 L
182.83 187.159 L
189.443 190.955 L
195.506 194.428 L
201.701 197.969 L
208.501 201.847 L
214.723 205.387 L
220.913 208.903 L
227.041 212.377 L
233.468 216.013 L
239.728 219.55 L
246.144 223.168 L
252.635 226.824 L
258.868 230.33 L
265.111 233.837 L
271.551 237.45 L
277.889 241.003 L
284.298 244.591 L
290.542 248.085 L
296.943 251.663 L
303.273 255.198 L
309.506 258.678 L
315.874 262.23 L
322.189 265.75 L
328.526 269.282 L
334.839 272.797 L
341.18 276.327 L
347.5 279.843 L
S
GR
GS
0.549 GC
1 LJ
0.5 LW
N
69 127.937 M
75.963 131.837 L
82.319 135.401 L
88.167 138.683 L
93.581 141.725 L
101.017 145.908 L
107.765 149.71 L
113.942 153.196 L
119.638 156.415 L
126.601 160.357 L
132.957 163.963 L
138.805 167.286 L
145.512 171.105 L
151.654 174.61 L
157.32 177.85 L
163.586 181.44 L
170.276 185.283 L
176.404 188.811 L
182.83 192.519 L
189.443 196.344 L
195.506 199.86 L
201.701 203.459 L
208.501 207.419 L
214.723 211.049 L
220.913 214.669 L
227.041 218.258 L
233.468 222.028 L
239.728 225.707 L
246.144 229.483 L
252.635 233.308 L
258.868 236.987 L
265.111 240.675 L
271.551 244.484 L
277.889 248.236 L
284.298 252.034 L
290.542 255.738 L
296.943 259.537 L
303.273 263.297 L
309.506 267.002 L
315.874 270.789 L
322.189 274.547 L
328.526 278.32 L
334.839 282.081 L
341.18 285.859 L
347.5 289.627 L
S
GR
GS
[16 16] 0 setdash
2 LJ
4 LW
N
69 124.241 M
75.963 128.254 L
82.319 131.917 L
88.167 135.287 L
93.581 138.407 L
101.017 142.692 L
107.765 146.581 L
113.942 150.14 L
119.638 153.423 L
126.601 157.435 L
132.957 161.098 L
138.805 164.468 L
145.512 168.333 L
151.654 171.873 L
157.32 175.138 L
163.586 178.749 L
170.276 182.604 L
176.404 186.136 L
182.83 189.839 L
189.443 193.65 L
195.506 197.144 L
201.701 200.714 L
208.501 204.633 L
214.723 208.218 L
220.913 211.786 L
227.041 215.317 L
233.468 219.021 L
239.728 222.628 L
246.144 226.325 L
252.635 230.066 L
258.868 233.658 L
265.111 237.256 L
271.551 240.967 L
277.889 244.619 L
284.298 248.313 L
290.542 251.911 L
296.943 255.6 L
303.273 259.248 L
309.506 262.84 L
315.874 266.509 L
322.189 270.149 L
328.526 273.801 L
334.839 277.439 L
341.18 281.093 L
347.5 284.735 L
S
GR
GS
1 0.91 0.91 RC
N
75.963 109.931 M
69 105.501 L
69 113.558 L
75.963 117.753 L
82.319 121.585 L
88.167 125.115 L
93.581 128.385 L
101.017 132.882 L
107.765 136.968 L
113.942 140.714 L
119.638 144.172 L
126.601 148.406 L
132.957 152.277 L
138.805 155.844 L
145.512 159.943 L
151.654 163.704 L
157.32 167.179 L
163.586 171.03 L
170.276 175.15 L
176.404 178.932 L
182.83 182.906 L
189.443 187.005 L
195.506 190.771 L
201.701 194.627 L
208.501 198.869 L
214.723 202.757 L
220.913 206.634 L
227.041 210.478 L
233.468 214.517 L
239.728 218.457 L
246.144 222.502 L
252.635 226.6 L
258.868 230.541 L
265.111 234.493 L
271.551 238.574 L
277.889 242.594 L
284.298 246.665 L
290.542 250.634 L
296.943 254.706 L
303.273 258.736 L
309.506 262.707 L
315.874 266.767 L
322.189 270.796 L
328.526 274.841 L
334.839 278.872 L
341.18 282.924 L
347.5 286.963 L
347.5 277.078 L
341.18 273.289 L
334.839 269.486 L
328.526 265.698 L
322.189 261.893 L
315.874 258.099 L
309.506 254.27 L
303.273 250.52 L
296.943 246.71 L
290.542 242.853 L
284.298 239.087 L
277.889 235.218 L
271.551 231.388 L
265.111 227.493 L
258.868 223.711 L
252.635 219.93 L
246.144 215.988 L
239.728 212.086 L
233.468 208.271 L
227.041 204.349 L
220.913 200.603 L
214.723 196.811 L
208.501 192.993 L
201.701 188.81 L
195.506 184.993 L
189.443 181.248 L
182.83 177.156 L
176.404 173.17 L
170.276 169.361 L
163.586 165.194 L
157.32 161.283 L
151.654 157.74 L
145.512 153.892 L
138.805 149.683 L
132.957 146.007 L
126.601 142.004 L
119.638 137.613 L
113.942 134.016 L
107.765 130.109 L
101.017 125.837 L
93.581 121.123 L
88.167 117.687 L
82.319 113.973 L
cp
f
GR
GS
1 0.549 0.549 RC
1 LJ
0.5 LW
N
69 105.501 M
75.963 109.931 L
82.319 113.973 L
88.167 117.687 L
93.581 121.123 L
101.017 125.837 L
107.765 130.109 L
113.942 134.016 L
119.638 137.613 L
126.601 142.004 L
132.957 146.007 L
138.805 149.683 L
145.512 153.892 L
151.654 157.74 L
157.32 161.283 L
163.586 165.194 L
170.276 169.361 L
176.404 173.17 L
182.83 177.156 L
189.443 181.248 L
195.506 184.993 L
201.701 188.81 L
208.501 192.993 L
214.723 196.811 L
220.913 200.603 L
227.041 204.349 L
233.468 208.271 L
239.728 212.086 L
246.144 215.988 L
252.635 219.93 L
258.868 223.711 L
265.111 227.493 L
271.551 231.388 L
277.889 235.218 L
284.298 239.087 L
290.542 242.853 L
296.943 246.71 L
303.273 250.52 L
309.506 254.27 L
315.874 258.099 L
322.189 261.893 L
328.526 265.698 L
334.839 269.486 L
341.18 273.289 L
347.5 277.078 L
S
GR
GS
1 0.549 0.549 RC
1 LJ
0.5 LW
N
69 113.558 M
75.963 117.753 L
82.319 121.585 L
88.167 125.115 L
93.581 128.385 L
101.017 132.882 L
107.765 136.968 L
113.942 140.714 L
119.638 144.172 L
126.601 148.406 L
132.957 152.277 L
138.805 155.844 L
145.512 159.943 L
151.654 163.704 L
157.32 167.179 L
163.586 171.03 L
170.276 175.15 L
176.404 178.932 L
182.83 182.906 L
189.443 187.005 L
195.506 190.771 L
201.701 194.627 L
208.501 198.869 L
214.723 202.757 L
220.913 206.634 L
227.041 210.478 L
233.468 214.517 L
239.728 218.457 L
246.144 222.502 L
252.635 226.6 L
258.868 230.541 L
265.111 234.493 L
271.551 238.574 L
277.889 242.594 L
284.298 246.665 L
290.542 250.634 L
296.943 254.706 L
303.273 258.736 L
309.506 262.707 L
315.874 266.767 L
322.189 270.796 L
328.526 274.841 L
334.839 278.872 L
341.18 282.924 L
347.5 286.963 L
S
GR
GS
1 0 0 RC
[16 16] 0 setdash
2 LJ
4 LW
N
69 109.53 M
75.963 113.842 L
82.319 117.779 L
88.167 121.401 L
93.581 124.754 L
101.017 129.359 L
107.765 133.539 L
113.942 137.365 L
119.638 140.892 L
126.601 145.205 L
132.957 149.142 L
138.805 152.764 L
145.512 156.918 L
151.654 160.722 L
157.32 164.231 L
163.586 168.112 L
170.276 172.255 L
176.404 176.051 L
182.83 180.031 L
189.443 184.127 L
195.506 187.882 L
201.701 191.719 L
208.501 195.931 L
214.723 199.784 L
220.913 203.618 L
227.041 207.414 L
233.468 211.394 L
239.728 215.271 L
246.144 219.245 L
252.635 223.265 L
258.868 227.126 L
265.111 230.993 L
271.551 234.981 L
277.889 238.906 L
284.298 242.876 L
290.542 246.743 L
296.943 250.708 L
303.273 254.628 L
309.506 258.489 L
315.874 262.433 L
322.189 266.344 L
328.526 270.269 L
334.839 274.179 L
341.18 278.106 L
347.5 282.021 L
S
GR
GS
[1 0 0 1 116 256.5] CT
/Helvetica 20 F
GS
[1 0 0 1 0 0] CT
0 7.5 moveto 
1 -1 scale
(Pre/Post) t 
GR
GR
GS
1 LJ
4 LW
N
83 256.5 M
113 256.5 L
S
GR
GS
[1 0 0 1 116 281] CT
/Helvetica 20 F
GS
[1 0 0 1 0 0] CT
0 7.5 moveto 
1 -1 scale
(Alpha on-/offset) t 
GR
GR
GS
1 0 0 RC
1 LJ
4 LW
N
83 281 M
113 281 L
S
GR
GS
1 GC
N
249.5 144 M
326.5 144 L
326.5 54 L
249.5 54 L
cp
f
GR
GS
0.149 GC
2 setlinecap
1 LJ
0.5 LW
N
249.5 144 M
326.5 144 L
S
GR
GS
0.149 GC
2 setlinecap
1 LJ
0.5 LW
N
326.5 144 M
326.5 54 L
S
GR
GS
0.149 GC
2 setlinecap
1 LJ
0.5 LW
N
326.5 144 M
325.6 144 L
S
GR
GS
0.149 GC
2 setlinecap
1 LJ
0.5 LW
N
326.5 54 M
325.6 54 L
S
GR
GS
[1 0 0 1 332.5 144] CT
0.149 GC
/Helvetica 20 F
GS
[1 0 0 1 0 0] CT
0 7.5 moveto 
1 -1 scale
(-1) t 
GR
GR
GS
[1 0 0 1 332.5 54] CT
0.149 GC
/Helvetica 20 F
GS
[1 0 0 1 0 0] CT
0 7.5 moveto 
1 -1 scale
(-0.8) t 
GR
GR
GS
0.149 GC
1 LJ
0.5 LW
N
249.5 54 M
326.5 54 L
S
GR
GS
N
253.35 54 M
253.35 86.289 L
284.15 86.289 L
284.15 54 L
cp
f
GR
GS
10.0 ML
0.5 LW
N
253.35 54 M
253.35 86.289 L
284.15 86.289 L
284.15 54 L
cp
S
GR
GS
1 LJ
2 LW
N
268.75 86.289 M
268.75 88.307 L
S
GR
GS
1 LJ
2 LW
N
268.75 86.289 M
268.75 84.27 L
S
GR
GS
[1 0 0 1 268.75 88.30715] CT
N
-3 0 M
3 0 L
f
GR
GS
[1 0 0 1 268.75 88.30715] CT
10.0 ML
2 LW
N
-3 0 M
3 0 L
S
GR
GS
[1 0 0 1 268.75 84.27018] CT
N
/f1394637256{-3 0 M
3 0 L}def
f1394637256
f
GR
GS
[1 0 0 1 268.75 84.27018] CT
10.0 ML
2 LW
N
-3 0 M
3 0 L
S
GR
GS
1 0 0 RC
N
/f-2108237908{291.85 54 M
291.85 115.613 L
322.65 115.613 L
322.65 54 L
cp}def
f-2108237908
f
GR
GS
1 0 0 RC
10.0 ML
0.5 LW
N
291.85 54 M
291.85 115.613 L
322.65 115.613 L
322.65 54 L
cp
S
GR
GS
1 LJ
2 LW
N
307.25 115.613 M
307.25 118.226 L
S
GR
GS
1 LJ
2 LW
N
307.25 115.613 M
307.25 113 L
S
GR
GS
[1 0 0 1 307.25 118.22646] CT
N
f1394637256
f
GR
GS
[1 0 0 1 307.25 118.22646] CT
10.0 ML
2 LW
N
-3 0 M
3 0 L
S
GR
GS
[1 0 0 1 307.25 113.00008] CT
N
f1394637256
f
GR
GS
[1 0 0 1 307.25 113.00008] CT
10.0 ML
2 LW
N
-3 0 M
3 0 L
S
GR
GS
1 LJ
0.5 LW
N
272.6 132.75 M
303.4 132.75 L
S
GR
GS
1 GC
N
/f923513006{277.5 143.25 M
298.5 143.25 L
298.5 122.25 L
277.5 122.25 L
cp}def
f923513006
f
GR
GS
[1 0 0 1 288 132.75002] CT
/Helvetica-Bold 15 F
GS
[1 0 0 1 0 0] CT
-9.5 5.5 moveto 
1 -1 scale
(***) t 
GR
GR
%%Trailer
%%Pages: 1
%%EOF
