%!PS-Adobe-3.0 EPSF-3.0
%%Creator: (MATLAB, The Mathworks, Inc. Version 9.3.0.713579 \(R2017b\). Operating System: Mac OS X)
%%Title: /Volumes/LNDG/Projects/StateSwitch/dynamic/data/eeg/rest/B_analyses/A_MSE_CSD_multiVariant/C_figures/F3_FastScalePSDassociation.eps
%%CreationDate: 2020-03-16T16:25:17
%%Pages: (atend)
%%BoundingBox:     4     0   465   425
%%LanguageLevel: 3
%%EndComments
%%BeginProlog
%%BeginResource: procset (Apache XML Graphics Std ProcSet) 1.2 0
%%Version: 1.2 0
%%Copyright: (Copyright 2001-2003,2010 The Apache Software Foundation. License terms: http://www.apache.org/licenses/LICENSE-2.0)
/bd{bind def}bind def
/ld{load def}bd
/GR/grestore ld
/GS/gsave ld
/RM/rmoveto ld
/C/curveto ld
/t/show ld
/L/lineto ld
/ML/setmiterlimit ld
/CT/concat ld
/f/fill ld
/N/newpath ld
/S/stroke ld
/CC/setcmykcolor ld
/A/ashow ld
/cp/closepath ld
/RC/setrgbcolor ld
/LJ/setlinejoin ld
/GC/setgray ld
/LW/setlinewidth ld
/M/moveto ld
/re {4 2 roll M
1 index 0 rlineto
0 exch rlineto
neg 0 rlineto
cp } bd
/_ctm matrix def
/_tm matrix def
/BT { _ctm currentmatrix pop matrix _tm copy pop 0 0 moveto } bd
/ET { _ctm setmatrix } bd
/iTm { _ctm setmatrix _tm concat } bd
/Tm { _tm astore pop iTm 0 0 moveto } bd
/ux 0.0 def
/uy 0.0 def
/F {
  /Tp exch def
  /Tf exch def
  Tf findfont Tp scalefont setfont
  /cf Tf def  /cs Tp def
} bd
/ULS {currentpoint /uy exch def /ux exch def} bd
/ULE {
  /Tcx currentpoint pop def
  gsave
  newpath
  cf findfont cs scalefont dup
  /FontMatrix get 0 get /Ts exch def /FontInfo get dup
  /UnderlinePosition get Ts mul /To exch def
  /UnderlineThickness get Ts mul /Tt exch def
  ux uy To add moveto  Tcx uy To add lineto
  Tt setlinewidth stroke
  grestore
} bd
/OLE {
  /Tcx currentpoint pop def
  gsave
  newpath
  cf findfont cs scalefont dup
  /FontMatrix get 0 get /Ts exch def /FontInfo get dup
  /UnderlinePosition get Ts mul /To exch def
  /UnderlineThickness get Ts mul /Tt exch def
  ux uy To add cs add moveto Tcx uy To add cs add lineto
  Tt setlinewidth stroke
  grestore
} bd
/SOE {
  /Tcx currentpoint pop def
  gsave
  newpath
  cf findfont cs scalefont dup
  /FontMatrix get 0 get /Ts exch def /FontInfo get dup
  /UnderlinePosition get Ts mul /To exch def
  /UnderlineThickness get Ts mul /Tt exch def
  ux uy To add cs 10 mul 26 idiv add moveto Tcx uy To add cs 10 mul 26 idiv add lineto
  Tt setlinewidth stroke
  grestore
} bd
/QT {
/Y22 exch store
/X22 exch store
/Y21 exch store
/X21 exch store
currentpoint
/Y21 load 2 mul add 3 div exch
/X21 load 2 mul add 3 div exch
/X21 load 2 mul /X22 load add 3 div
/Y21 load 2 mul /Y22 load add 3 div
/X22 load /Y22 load curveto
} bd
/SSPD {
dup length /d exch dict def
{
/v exch def
/k exch def
currentpagedevice k known {
/cpdv currentpagedevice k get def
v cpdv ne {
/upd false def
/nullv v type /nulltype eq def
/nullcpdv cpdv type /nulltype eq def
nullv nullcpdv or
{
/upd true def
} {
/sametype v type cpdv type eq def
sametype {
v type /arraytype eq {
/vlen v length def
/cpdvlen cpdv length def
vlen cpdvlen eq {
0 1 vlen 1 sub {
/i exch def
/obj v i get def
/cpdobj cpdv i get def
obj cpdobj ne {
/upd true def
exit
} if
} for
} {
/upd true def
} ifelse
} {
v type /dicttype eq {
v {
/dv exch def
/dk exch def
/cpddv cpdv dk get def
dv cpddv ne {
/upd true def
exit
} if
} forall
} {
/upd true def
} ifelse
} ifelse
} if
} ifelse
upd true eq {
d k v put
} if
} if
} if
} forall
d length 0 gt {
d setpagedevice
} if
} bd
/RE { % /NewFontName [NewEncodingArray] /FontName RE -
  findfont dup length dict begin
  {
    1 index /FID ne
    {def} {pop pop} ifelse
  } forall
  /Encoding exch def
  /FontName 1 index def
  currentdict definefont pop
  end
} bind def
%%EndResource
%%BeginResource: procset (Apache XML Graphics EPS ProcSet) 1.0 0
%%Version: 1.0 0
%%Copyright: (Copyright 2002-2003 The Apache Software Foundation. License terms: http://www.apache.org/licenses/LICENSE-2.0)
/BeginEPSF { %def
/b4_Inc_state save def         % Save state for cleanup
/dict_count countdictstack def % Count objects on dict stack
/op_count count 1 sub def      % Count objects on operand stack
userdict begin                 % Push userdict on dict stack
/showpage { } def              % Redefine showpage, { } = null proc
0 setgray 0 setlinecap         % Prepare graphics state
1 setlinewidth 0 setlinejoin
10 setmiterlimit [ ] 0 setdash newpath
/languagelevel where           % If level not equal to 1 then
{pop languagelevel             % set strokeadjust and
1 ne                           % overprint to their defaults.
{false setstrokeadjust false setoverprint
} if
} if
} bd
/EndEPSF { %def
count op_count sub {pop} repeat            % Clean up stacks
countdictstack dict_count sub {end} repeat
b4_Inc_state restore
} bd
%%EndResource
%FOPBeginFontDict
%%IncludeResource: font Courier-Oblique
%%IncludeResource: font Courier-BoldOblique
%%IncludeResource: font Courier-Bold
%%IncludeResource: font ZapfDingbats
%%IncludeResource: font Symbol
%%IncludeResource: font Helvetica
%%IncludeResource: font Helvetica-Oblique
%%IncludeResource: font Helvetica-Bold
%%IncludeResource: font Helvetica-BoldOblique
%%IncludeResource: font Times-Roman
%%IncludeResource: font Times-Italic
%%IncludeResource: font Times-Bold
%%IncludeResource: font Times-BoldItalic
%%IncludeResource: font Courier
%FOPEndFontDict
%%BeginResource: encoding WinAnsiEncoding
/WinAnsiEncoding [
/.notdef /.notdef /.notdef /.notdef /.notdef
/.notdef /.notdef /.notdef /.notdef /.notdef
/.notdef /.notdef /.notdef /.notdef /.notdef
/.notdef /.notdef /.notdef /.notdef /.notdef
/.notdef /.notdef /.notdef /.notdef /.notdef
/.notdef /.notdef /.notdef /.notdef /.notdef
/.notdef /.notdef /space /exclam /quotedbl
/numbersign /dollar /percent /ampersand /quotesingle
/parenleft /parenright /asterisk /plus /comma
/hyphen /period /slash /zero /one
/two /three /four /five /six
/seven /eight /nine /colon /semicolon
/less /equal /greater /question /at
/A /B /C /D /E
/F /G /H /I /J
/K /L /M /N /O
/P /Q /R /S /T
/U /V /W /X /Y
/Z /bracketleft /backslash /bracketright /asciicircum
/underscore /quoteleft /a /b /c
/d /e /f /g /h
/i /j /k /l /m
/n /o /p /q /r
/s /t /u /v /w
/x /y /z /braceleft /bar
/braceright /asciitilde /bullet /Euro /bullet
/quotesinglbase /florin /quotedblbase /ellipsis /dagger
/daggerdbl /circumflex /perthousand /Scaron /guilsinglleft
/OE /bullet /Zcaron /bullet /bullet
/quoteleft /quoteright /quotedblleft /quotedblright /bullet
/endash /emdash /asciitilde /trademark /scaron
/guilsinglright /oe /bullet /zcaron /Ydieresis
/space /exclamdown /cent /sterling /currency
/yen /brokenbar /section /dieresis /copyright
/ordfeminine /guillemotleft /logicalnot /sfthyphen /registered
/macron /degree /plusminus /twosuperior /threesuperior
/acute /mu /paragraph /middot /cedilla
/onesuperior /ordmasculine /guillemotright /onequarter /onehalf
/threequarters /questiondown /Agrave /Aacute /Acircumflex
/Atilde /Adieresis /Aring /AE /Ccedilla
/Egrave /Eacute /Ecircumflex /Edieresis /Igrave
/Iacute /Icircumflex /Idieresis /Eth /Ntilde
/Ograve /Oacute /Ocircumflex /Otilde /Odieresis
/multiply /Oslash /Ugrave /Uacute /Ucircumflex
/Udieresis /Yacute /Thorn /germandbls /agrave
/aacute /acircumflex /atilde /adieresis /aring
/ae /ccedilla /egrave /eacute /ecircumflex
/edieresis /igrave /iacute /icircumflex /idieresis
/eth /ntilde /ograve /oacute /ocircumflex
/otilde /odieresis /divide /oslash /ugrave
/uacute /ucircumflex /udieresis /yacute /thorn
/ydieresis
] def
%%EndResource
%FOPBeginFontReencode
/Courier-Oblique findfont
dup length dict begin
  {1 index /FID ne {def} {pop pop} ifelse} forall
  /Encoding WinAnsiEncoding def
  currentdict
end
/Courier-Oblique exch definefont pop
/Courier-BoldOblique findfont
dup length dict begin
  {1 index /FID ne {def} {pop pop} ifelse} forall
  /Encoding WinAnsiEncoding def
  currentdict
end
/Courier-BoldOblique exch definefont pop
/Courier-Bold findfont
dup length dict begin
  {1 index /FID ne {def} {pop pop} ifelse} forall
  /Encoding WinAnsiEncoding def
  currentdict
end
/Courier-Bold exch definefont pop
/Helvetica findfont
dup length dict begin
  {1 index /FID ne {def} {pop pop} ifelse} forall
  /Encoding WinAnsiEncoding def
  currentdict
end
/Helvetica exch definefont pop
/Helvetica-Oblique findfont
dup length dict begin
  {1 index /FID ne {def} {pop pop} ifelse} forall
  /Encoding WinAnsiEncoding def
  currentdict
end
/Helvetica-Oblique exch definefont pop
/Helvetica-Bold findfont
dup length dict begin
  {1 index /FID ne {def} {pop pop} ifelse} forall
  /Encoding WinAnsiEncoding def
  currentdict
end
/Helvetica-Bold exch definefont pop
/Helvetica-BoldOblique findfont
dup length dict begin
  {1 index /FID ne {def} {pop pop} ifelse} forall
  /Encoding WinAnsiEncoding def
  currentdict
end
/Helvetica-BoldOblique exch definefont pop
/Times-Roman findfont
dup length dict begin
  {1 index /FID ne {def} {pop pop} ifelse} forall
  /Encoding WinAnsiEncoding def
  currentdict
end
/Times-Roman exch definefont pop
/Times-Italic findfont
dup length dict begin
  {1 index /FID ne {def} {pop pop} ifelse} forall
  /Encoding WinAnsiEncoding def
  currentdict
end
/Times-Italic exch definefont pop
/Times-Bold findfont
dup length dict begin
  {1 index /FID ne {def} {pop pop} ifelse} forall
  /Encoding WinAnsiEncoding def
  currentdict
end
/Times-Bold exch definefont pop
/Times-BoldItalic findfont
dup length dict begin
  {1 index /FID ne {def} {pop pop} ifelse} forall
  /Encoding WinAnsiEncoding def
  currentdict
end
/Times-BoldItalic exch definefont pop
/Courier findfont
dup length dict begin
  {1 index /FID ne {def} {pop pop} ifelse} forall
  /Encoding WinAnsiEncoding def
  currentdict
end
/Courier exch definefont pop
%FOPEndFontReencode
%%EndProlog
%%Page: 1 1
%%PageBoundingBox: 0 0 512 432
%%BeginPageSetup
[1 0 0 -1 0 432] CT
%%EndPageSetup
GS
1 GC
N
0 0 512 432 re
f
GR
GS
1 GC
N
0 0 512 432 re
f
GR
GS
1 GC
N
75 372.5 M
463.5 372.5 L
463.5 59 L
75 59 L
cp
f
GR
GS
0.149 GC
2 setlinecap
1 LJ
0.5 LW
N
75 372.5 M
463.5 372.5 L
S
GR
GS
0.149 GC
2 setlinecap
1 LJ
0.5 LW
N
75 372.5 M
75 368.615 L
S
GR
GS
0.149 GC
2 setlinecap
1 LJ
0.5 LW
N
152.7 372.5 M
152.7 368.615 L
S
GR
GS
0.149 GC
2 setlinecap
1 LJ
0.5 LW
N
230.4 372.5 M
230.4 368.615 L
S
GR
GS
0.149 GC
2 setlinecap
1 LJ
0.5 LW
N
308.1 372.5 M
308.1 368.615 L
S
GR
GS
0.149 GC
2 setlinecap
1 LJ
0.5 LW
N
385.8 372.5 M
385.8 368.615 L
S
GR
GS
0.149 GC
2 setlinecap
1 LJ
0.5 LW
N
463.5 372.5 M
463.5 368.615 L
S
GR
GS
[1 0 0 1 75 378.89999] CT
0.149 GC
/Helvetica 22 F
GS
[1 0 0 1 0 0] CT
-6.5 21 moveto 
1 -1 scale
(0) t 
GR
GR
GS
[1 0 0 1 152.7 378.89999] CT
0.149 GC
/Helvetica 22 F
GS
[1 0 0 1 0 0] CT
-15.5 21 moveto 
1 -1 scale
(0.2) t 
GR
GR
GS
[1 0 0 1 230.40001 378.89999] CT
0.149 GC
/Helvetica 22 F
GS
[1 0 0 1 0 0] CT
-15.5 21 moveto 
1 -1 scale
(0.4) t 
GR
GR
GS
[1 0 0 1 308.10001 378.89999] CT
0.149 GC
/Helvetica 22 F
GS
[1 0 0 1 0 0] CT
-15.5 21 moveto 
1 -1 scale
(0.6) t 
GR
GR
GS
[1 0 0 1 385.80002 378.89999] CT
0.149 GC
/Helvetica 22 F
GS
[1 0 0 1 0 0] CT
-15.5 21 moveto 
1 -1 scale
(0.8) t 
GR
GR
GS
[1 0 0 1 463.5 378.89999] CT
0.149 GC
/Helvetica 22 F
GS
[1 0 0 1 0 0] CT
-6.5 21 moveto 
1 -1 scale
(1) t 
GR
GR
GS
[1 0 0 1 269.25018 405.89999] CT
0.149 GC
/Helvetica 22 F
GS
[1 0 0 1 0 0] CT
-160 21 moveto 
1 -1 scale
(Vanilla MSE, Scales 1:3 \(>50 Hz\)) t 
GR
GR
GS
0.149 GC
2 setlinecap
1 LJ
0.5 LW
N
75 372.5 M
75 59 L
S
GR
GS
0.149 GC
2 setlinecap
1 LJ
0.5 LW
N
75 372.5 M
78.885 372.5 L
S
GR
GS
0.149 GC
2 setlinecap
1 LJ
0.5 LW
N
75 307.188 M
78.885 307.188 L
S
GR
GS
0.149 GC
2 setlinecap
1 LJ
0.5 LW
N
75 241.875 M
78.885 241.875 L
S
GR
GS
0.149 GC
2 setlinecap
1 LJ
0.5 LW
N
75 176.563 M
78.885 176.563 L
S
GR
GS
0.149 GC
2 setlinecap
1 LJ
0.5 LW
N
75 111.25 M
78.885 111.25 L
S
GR
GS
[1 0 0 1 68.6 372.5] CT
0.149 GC
/Helvetica 22 F
GS
[1 0 0 1 0 0] CT
-21 8 moveto 
1 -1 scale
(-2) t 
GR
GR
GS
[1 0 0 1 68.6 307.1875] CT
0.149 GC
/Helvetica 22 F
GS
[1 0 0 1 0 0] CT
-40 8 moveto 
1 -1 scale
(-1.5) t 
GR
GR
GS
[1 0 0 1 68.6 241.875] CT
0.149 GC
/Helvetica 22 F
GS
[1 0 0 1 0 0] CT
-21 8 moveto 
1 -1 scale
(-1) t 
GR
GR
GS
[1 0 0 1 68.6 176.5625] CT
0.149 GC
/Helvetica 22 F
GS
[1 0 0 1 0 0] CT
-40 8 moveto 
1 -1 scale
(-0.5) t 
GR
GR
GS
[1 0 0 1 68.6 111.25] CT
0.149 GC
/Helvetica 22 F
GS
[1 0 0 1 0 0] CT
-13 8 moveto 
1 -1 scale
(0) t 
GR
GR
GS
[0 -1 1 0 26.1 215.74985] CT
0.149 GC
/Helvetica 22 F
GS
[1 0 0 1 0 0] CT
-169.5 -5 moveto 
1 -1 scale
(PSD Slope 2-64 Hz \(excl. 7-13 Hz\)) t 
GR
GR
GS
[1 0 0 1 269.25024 56.25] CT
/Helvetica-Bold 22 F
GS
[1 0 0 1 0 0] CT
-192.5 -32 moveto 
1 -1 scale
(Individual fine-scale Original entropy) t 
GR
GR
GS
[1 0 0 1 269.25024 56.25] CT
/Helvetica-Bold 22 F
GS
[1 0 0 1 0 0] CT
-109.5 -5 moveto 
1 -1 scale
(captures PSD slopes) t 
GR
GR
GS
[1 0 0 1 261.41977 230.24174] CT
1 0 0 RC
N
3.536 0 M
3.536 -1.953 1.953 -3.536 0 -3.536 C
-1.953 -3.536 -3.536 -1.953 -3.536 0 C
-3.536 1.953 -1.953 3.536 0 3.536 C
1.953 3.536 3.536 1.953 3.536 0 C
f
GR
GS
[1 0 0 1 290.20456 239.19128] CT
1 0 0 RC
N
/f-1686801894{3.536 0 M
3.536 -1.953 1.953 -3.536 0 -3.536 C
-1.953 -3.536 -3.536 -1.953 -3.536 0 C
-3.536 1.953 -1.953 3.536 0 3.536 C
1.953 3.536 3.536 1.953 3.536 0 C}def
f-1686801894
f
GR
GS
[1 0 0 1 268.89212 207.8244] CT
1 0 0 RC
N
f-1686801894
f
GR
GS
[1 0 0 1 336.40894 185.29478] CT
1 0 0 RC
N
f-1686801894
f
GR
GS
[1 0 0 1 317.49658 229.82719] CT
1 0 0 RC
N
f-1686801894
f
GR
GS
[1 0 0 1 149.86613 265.82709] CT
1 0 0 RC
N
f-1686801894
f
GR
GS
[1 0 0 1 236.4893 259.72903] CT
1 0 0 RC
N
f-1686801894
f
GR
GS
[1 0 0 1 340.86459 211.65886] CT
1 0 0 RC
N
f-1686801894
f
GR
GS
[1 0 0 1 374.23123 194.47769] CT
1 0 0 RC
N
f-1686801894
f
GR
GS
[1 0 0 1 246.87198 255.1102] CT
1 0 0 RC
N
f-1686801894
f
GR
GS
[1 0 0 1 213.93175 305.28937] CT
1 0 0 RC
N
f-1686801894
f
GR
GS
[1 0 0 1 283.12231 249.07037] CT
1 0 0 RC
N
f-1686801894
f
GR
GS
[1 0 0 1 194.29456 245.18301] CT
1 0 0 RC
N
f-1686801894
f
GR
GS
[1 0 0 1 230.00804 291.45364] CT
1 0 0 RC
N
f-1686801894
f
GR
GS
[1 0 0 1 264.76367 243.28954] CT
1 0 0 RC
N
f-1686801894
f
GR
GS
[1 0 0 1 280.33426 251.44978] CT
1 0 0 RC
N
f-1686801894
f
GR
GS
[1 0 0 1 272.84283 247.73746] CT
1 0 0 RC
N
f-1686801894
f
GR
GS
[1 0 0 1 304.69373 242.90486] CT
1 0 0 RC
N
f-1686801894
f
GR
GS
[1 0 0 1 267.70792 245.03612] CT
1 0 0 RC
N
f-1686801894
f
GR
GS
[1 0 0 1 324.97787 228.05957] CT
1 0 0 RC
N
f-1686801894
f
GR
GS
[1 0 0 1 361.13327 199.08109] CT
1 0 0 RC
N
f-1686801894
f
GR
GS
[1 0 0 1 274.44003 248.8512] CT
1 0 0 RC
N
f-1686801894
f
GR
GS
[1 0 0 1 337.17233 192.36397] CT
1 0 0 RC
N
f-1686801894
f
GR
GS
[1 0 0 1 350.38644 138.10426] CT
1 0 0 RC
N
f-1686801894
f
GR
GS
[1 0 0 1 270.20718 249.66273] CT
1 0 0 RC
N
f-1686801894
f
GR
GS
[1 0 0 1 233.71071 256.11115] CT
1 0 0 RC
N
f-1686801894
f
GR
GS
[1 0 0 1 172.42998 278.04984] CT
1 0 0 RC
N
f-1686801894
f
GR
GS
[1 0 0 1 270.67825 190.28642] CT
1 0 0 RC
N
f-1686801894
f
GR
GS
[1 0 0 1 261.21918 258.94516] CT
1 0 0 RC
N
f-1686801894
f
GR
GS
[1 0 0 1 306.31851 200.95827] CT
1 0 0 RC
N
f-1686801894
f
GR
GS
[1 0 0 1 194.37094 293.22598] CT
1 0 0 RC
N
f-1686801894
f
GR
GS
[1 0 0 1 346.48492 222.19237] CT
1 0 0 RC
N
f-1686801894
f
GR
GS
[1 0 0 1 349.70953 219.32185] CT
1 0 0 RC
N
f-1686801894
f
GR
GS
[1 0 0 1 257.75989 272.97058] CT
1 0 0 RC
N
f-1686801894
f
GR
GS
[1 0 0 1 279.3233 216.61723] CT
1 0 0 RC
N
f-1686801894
f
GR
GS
[1 0 0 1 194.33932 292.59607] CT
1 0 0 RC
N
f-1686801894
f
GR
GS
[1 0 0 1 261.43756 244.82735] CT
1 0 0 RC
N
f-1686801894
f
GR
GS
[1 0 0 1 259.63635 271.70718] CT
1 0 0 RC
N
f-1686801894
f
GR
GS
[1 0 0 1 271.51663 247.69203] CT
1 0 0 RC
N
f-1686801894
f
GR
GS
[1 0 0 1 211.7347 273.06366] CT
1 0 0 RC
N
f-1686801894
f
GR
GS
[1 0 0 1 395.57019 166.72301] CT
1 0 0 RC
N
f-1686801894
f
GR
GS
[1 0 0 1 346.93466 216.12842] CT
1 0 0 RC
N
f-1686801894
f
GR
GS
[1 0 0 1 389.18063 156.02936] CT
1 0 0 RC
N
f-1686801894
f
GR
GS
[1 0 0 1 322.34622 238.31189] CT
1 0 0 RC
N
f-1686801894
f
GR
GS
[1 0 0 1 300.03918 266.03262] CT
1 0 0 RC
N
f-1686801894
f
GR
GS
[1 0 0 1 281.40787 257.36813] CT
1 0 0 RC
N
f-1686801894
f
GR
GS
[1 0 0 1 379.36722 156.45848] CT
1 0 0 RC
N
f-1686801894
f
GR
GS
1 0 0 RC
1 LJ
3 LW
N
261.42 246.984 M
290.205 231.766 L
268.892 243.034 L
336.409 207.339 L
317.497 217.338 L
149.866 305.961 L
236.489 260.165 L
340.865 204.983 L
374.231 187.343 L
246.872 254.676 L
213.932 272.091 L
283.122 235.511 L
194.295 282.472 L
230.008 263.591 L
264.764 245.217 L
280.334 236.985 L
272.843 240.945 L
304.694 224.106 L
267.708 243.66 L
324.978 213.382 L
361.133 194.268 L
274.44 240.101 L
337.172 206.935 L
350.386 199.949 L
270.207 242.339 L
233.711 261.634 L
172.43 294.032 L
270.678 242.09 L
261.219 247.091 L
306.319 223.247 L
194.371 282.432 L
346.485 202.012 L
349.71 200.307 L
257.76 248.919 L
279.323 237.519 L
194.339 282.449 L
261.438 246.975 L
259.636 247.927 L
271.517 241.646 L
211.735 273.252 L
395.57 176.061 L
346.935 201.774 L
389.181 179.439 L
322.346 214.774 L
300.039 226.567 L
281.408 236.417 L
379.367 184.628 L
S
GR
GS
[1 0 0 1 355.59329 189.37492] CT
N
f-1686801894
f
GR
GS
[1 0 0 1 284.3118 186.40274] CT
N
f-1686801894
f
GR
GS
[1 0 0 1 307.72433 232.93195] CT
N
f-1686801894
f
GR
GS
[1 0 0 1 408.54559 157.45688] CT
N
f-1686801894
f
GR
GS
[1 0 0 1 364.12589 155.32179] CT
N
f-1686801894
f
GR
GS
[1 0 0 1 313.5723 218.47757] CT
N
f-1686801894
f
GR
GS
[1 0 0 1 442.31302 79.67344] CT
N
f-1686801894
f
GR
GS
[1 0 0 1 263.48325 232.20332] CT
N
f-1686801894
f
GR
GS
[1 0 0 1 329.94119 222.23071] CT
N
f-1686801894
f
GR
GS
[1 0 0 1 318.98288 220.43481] CT
N
f-1686801894
f
GR
GS
[1 0 0 1 347.16629 199.34554] CT
N
f-1686801894
f
GR
GS
[1 0 0 1 302.38083 222.96977] CT
N
f-1686801894
f
GR
GS
[1 0 0 1 285.35657 237.25636] CT
N
f-1686801894
f
GR
GS
[1 0 0 1 381.42886 171.05086] CT
N
f-1686801894
f
GR
GS
[1 0 0 1 390.86249 140.71504] CT
N
f-1686801894
f
GR
GS
[1 0 0 1 333.55551 214.39732] CT
N
f-1686801894
f
GR
GS
[1 0 0 1 309.98196 206.31223] CT
N
f-1686801894
f
GR
GS
[1 0 0 1 353.49487 189.04576] CT
N
f-1686801894
f
GR
GS
[1 0 0 1 350.60037 151.92406] CT
N
f-1686801894
f
GR
GS
[1 0 0 1 286.99124 237.60847] CT
N
f-1686801894
f
GR
GS
[1 0 0 1 280.56238 252.29129] CT
N
f-1686801894
f
GR
GS
[1 0 0 1 293.4614 222.66156] CT
N
f-1686801894
f
GR
GS
[1 0 0 1 314.49149 206.76591] CT
N
f-1686801894
f
GR
GS
[1 0 0 1 332.88336 229.24193] CT
N
f-1686801894
f
GR
GS
[1 0 0 1 334.02417 226.86815] CT
N
f-1686801894
f
GR
GS
[1 0 0 1 330.24857 220.51099] CT
N
f-1686801894
f
GR
GS
[1 0 0 1 361.89816 219.02328] CT
N
f-1686801894
f
GR
GS
[1 0 0 1 278.63229 242.0094] CT
N
f-1686801894
f
GR
GS
[1 0 0 1 371.22623 231.06422] CT
N
f-1686801894
f
GR
GS
[1 0 0 1 379.43082 199.38449] CT
N
f-1686801894
f
GR
GS
[1 0 0 1 330.00925 182.54579] CT
N
f-1686801894
f
GR
GS
[1 0 0 1 386.24057 172.39584] CT
N
f-1686801894
f
GR
GS
[1 0 0 1 369.76947 181.64447] CT
N
f-1686801894
f
GR
GS
[1 0 0 1 362.67294 193.22469] CT
N
f-1686801894
f
GR
GS
[1 0 0 1 385.76486 181.64864] CT
N
f-1686801894
f
GR
GS
[1 0 0 1 383.16394 162.94011] CT
N
f-1686801894
f
GR
GS
[1 0 0 1 334.28195 193.10556] CT
N
f-1686801894
f
GR
GS
[1 0 0 1 395.785 185.77719] CT
N
f-1686801894
f
GR
GS
[1 0 0 1 297.73343 252.29997] CT
N
f-1686801894
f
GR
GS
[1 0 0 1 247.52304 269.78995] CT
N
f-1686801894
f
GR
GS
[1 0 0 1 370.18033 166.88478] CT
N
f-1686801894
f
GR
GS
[1 0 0 1 420.6171 156.10107] CT
N
f-1686801894
f
GR
GS
[1 0 0 1 257.43274 224.57712] CT
N
f-1686801894
f
GR
GS
[1 0 0 1 295.50287 260.29156] CT
N
f-1686801894
f
GR
GS
[1 0 0 1 424.1507 154.59789] CT
N
f-1686801894
f
GR
GS
[1 0 0 1 364.56012 199.65155] CT
N
f-1686801894
f
GR
GS
[1 0 0 1 274.96536 233.99269] CT
N
f-1686801894
f
GR
GS
[1 0 0 1 326.88205 211.62141] CT
N
f-1686801894
f
GR
GS
[1 0 0 1 371.27893 169.21193] CT
N
f-1686801894
f
GR
GS
[1 0 0 1 311.56348 229.17419] CT
N
f-1686801894
f
GR
GS
[1 0 0 1 254.98758 252.59793] CT
N
f-1686801894
f
GR
GS
[1 0 0 1 385.07538 190.23409] CT
N
f-1686801894
f
GR
GS
1 LJ
3 LW
N
355.593 191.283 M
284.312 236.534 L
307.724 221.671 L
408.546 157.667 L
364.126 185.866 L
313.572 217.959 L
442.313 136.231 L
263.483 249.756 L
329.941 207.567 L
318.983 214.524 L
347.166 196.632 L
302.381 225.063 L
285.357 235.871 L
381.429 174.881 L
390.862 168.893 L
333.556 205.273 L
309.982 220.238 L
353.495 192.615 L
350.6 194.452 L
286.991 234.833 L
280.562 238.914 L
293.461 230.725 L
314.491 217.375 L
332.883 205.699 L
334.024 204.975 L
330.249 207.372 L
361.898 187.28 L
278.632 240.139 L
371.226 181.358 L
379.431 176.15 L
330.009 207.524 L
386.241 171.827 L
369.769 182.283 L
362.673 186.788 L
385.765 172.129 L
383.164 173.78 L
334.282 204.812 L
395.785 165.768 L
297.733 228.013 L
247.523 259.888 L
370.18 182.022 L
420.617 150.004 L
257.433 253.597 L
295.503 229.43 L
424.151 147.76 L
364.56 185.59 L
274.965 242.467 L
326.882 209.509 L
371.279 181.325 L
311.563 219.234 L
254.988 255.15 L
385.075 172.567 L
S
GR
GS
[1 0 0 1 355.59329 189.37492] CT
N
f-1686801894
f
GR
GS
[1 0 0 1 284.3118 186.40274] CT
N
f-1686801894
f
GR
GS
[1 0 0 1 307.72433 232.93195] CT
N
f-1686801894
f
GR
GS
[1 0 0 1 408.54559 157.45688] CT
N
f-1686801894
f
GR
GS
[1 0 0 1 364.12589 155.32179] CT
N
f-1686801894
f
GR
GS
[1 0 0 1 313.5723 218.47757] CT
N
f-1686801894
f
GR
GS
[1 0 0 1 442.31302 79.67344] CT
N
f-1686801894
f
GR
GS
[1 0 0 1 263.48325 232.20332] CT
N
f-1686801894
f
GR
GS
[1 0 0 1 329.94119 222.23071] CT
N
f-1686801894
f
GR
GS
[1 0 0 1 318.98288 220.43481] CT
N
f-1686801894
f
GR
GS
[1 0 0 1 347.16629 199.34554] CT
N
f-1686801894
f
GR
GS
[1 0 0 1 302.38083 222.96977] CT
N
f-1686801894
f
GR
GS
[1 0 0 1 285.35657 237.25636] CT
N
f-1686801894
f
GR
GS
[1 0 0 1 381.42886 171.05086] CT
N
f-1686801894
f
GR
GS
[1 0 0 1 390.86249 140.71504] CT
N
f-1686801894
f
GR
GS
[1 0 0 1 333.55551 214.39732] CT
N
f-1686801894
f
GR
GS
[1 0 0 1 309.98196 206.31223] CT
N
f-1686801894
f
GR
GS
[1 0 0 1 353.49487 189.04576] CT
N
f-1686801894
f
GR
GS
[1 0 0 1 350.60037 151.92406] CT
N
f-1686801894
f
GR
GS
[1 0 0 1 286.99124 237.60847] CT
N
f-1686801894
f
GR
GS
[1 0 0 1 280.56238 252.29129] CT
N
f-1686801894
f
GR
GS
[1 0 0 1 293.4614 222.66156] CT
N
f-1686801894
f
GR
GS
[1 0 0 1 314.49149 206.76591] CT
N
f-1686801894
f
GR
GS
[1 0 0 1 332.88336 229.24193] CT
N
f-1686801894
f
GR
GS
[1 0 0 1 334.02417 226.86815] CT
N
f-1686801894
f
GR
GS
[1 0 0 1 330.24857 220.51099] CT
N
f-1686801894
f
GR
GS
[1 0 0 1 361.89816 219.02328] CT
N
f-1686801894
f
GR
GS
[1 0 0 1 278.63229 242.0094] CT
N
f-1686801894
f
GR
GS
[1 0 0 1 371.22623 231.06422] CT
N
f-1686801894
f
GR
GS
[1 0 0 1 379.43082 199.38449] CT
N
f-1686801894
f
GR
GS
[1 0 0 1 330.00925 182.54579] CT
N
f-1686801894
f
GR
GS
[1 0 0 1 386.24057 172.39584] CT
N
f-1686801894
f
GR
GS
[1 0 0 1 369.76947 181.64447] CT
N
f-1686801894
f
GR
GS
[1 0 0 1 362.67294 193.22469] CT
N
f-1686801894
f
GR
GS
[1 0 0 1 385.76486 181.64864] CT
N
f-1686801894
f
GR
GS
[1 0 0 1 383.16394 162.94011] CT
N
f-1686801894
f
GR
GS
[1 0 0 1 334.28195 193.10556] CT
N
f-1686801894
f
GR
GS
[1 0 0 1 395.785 185.77719] CT
N
f-1686801894
f
GR
GS
[1 0 0 1 297.73343 252.29997] CT
N
f-1686801894
f
GR
GS
[1 0 0 1 247.52304 269.78995] CT
N
f-1686801894
f
GR
GS
[1 0 0 1 370.18033 166.88478] CT
N
f-1686801894
f
GR
GS
[1 0 0 1 420.6171 156.10107] CT
N
f-1686801894
f
GR
GS
[1 0 0 1 257.43274 224.57712] CT
N
f-1686801894
f
GR
GS
[1 0 0 1 295.50287 260.29156] CT
N
f-1686801894
f
GR
GS
[1 0 0 1 424.1507 154.59789] CT
N
f-1686801894
f
GR
GS
[1 0 0 1 364.56012 199.65155] CT
N
f-1686801894
f
GR
GS
[1 0 0 1 274.96536 233.99269] CT
N
f-1686801894
f
GR
GS
[1 0 0 1 326.88205 211.62141] CT
N
f-1686801894
f
GR
GS
[1 0 0 1 371.27893 169.21193] CT
N
f-1686801894
f
GR
GS
[1 0 0 1 311.56348 229.17419] CT
N
f-1686801894
f
GR
GS
[1 0 0 1 254.98758 252.59793] CT
N
f-1686801894
f
GR
GS
[1 0 0 1 385.07538 190.23409] CT
N
f-1686801894
f
GR
GS
1 LJ
3 LW
N
355.593 191.283 M
284.312 236.534 L
307.724 221.671 L
408.546 157.667 L
364.126 185.866 L
313.572 217.959 L
442.313 136.231 L
263.483 249.756 L
329.941 207.567 L
318.983 214.524 L
347.166 196.632 L
302.381 225.063 L
285.357 235.871 L
381.429 174.881 L
390.862 168.893 L
333.556 205.273 L
309.982 220.238 L
353.495 192.615 L
350.6 194.452 L
286.991 234.833 L
280.562 238.914 L
293.461 230.725 L
314.491 217.375 L
332.883 205.699 L
334.024 204.975 L
330.249 207.372 L
361.898 187.28 L
278.632 240.139 L
371.226 181.358 L
379.431 176.15 L
330.009 207.524 L
386.241 171.827 L
369.769 182.283 L
362.673 186.788 L
385.765 172.129 L
383.164 173.78 L
334.282 204.812 L
395.785 165.768 L
297.733 228.013 L
247.523 259.888 L
370.18 182.022 L
420.617 150.004 L
257.433 253.597 L
295.503 229.43 L
424.151 147.76 L
364.56 185.59 L
274.965 242.467 L
326.882 209.509 L
371.279 181.325 L
311.563 219.234 L
254.988 255.15 L
385.075 172.567 L
S
GR
GS
[1 0 0 1 122 333] CT
/Helvetica 16 F
GS
[1 0 0 1 0 0] CT
0 0 moveto 
1 -1 scale
(Younger Adults: r=0.81, p=5e) t 
GR
GR
GS
[1 0 0 1 333 325] CT
/Helvetica 12.8 F
GS
[1 0 0 1 0 0] CT
0 0 moveto 
1 -1 scale
(-) t 
GR
GR
GS
[1 0 0 1 338 333] CT
/Helvetica 16 F
GS
[1 0 0 1 0 0] CT
0 0 moveto 
1 -1 scale
(12) t 
GR
GR
GS
1 0 0 RC
1 LJ
3 LW
N
89 324 M
119 324 L
S
GR
GS
[1 0 0 1 122 358] CT
/Helvetica 16 F
GS
[1 0 0 1 0 0] CT
0 0 moveto 
1 -1 scale
(Older Adults: r=0.83, p=3e) t 
GR
GR
GS
[1 0 0 1 312 350] CT
/Helvetica 12.8 F
GS
[1 0 0 1 0 0] CT
0 0 moveto 
1 -1 scale
(-) t 
GR
GR
GS
[1 0 0 1 317 358] CT
/Helvetica 16 F
GS
[1 0 0 1 0 0] CT
0 0 moveto 
1 -1 scale
(14) t 
GR
GR
GS
1 LJ
3 LW
N
89 348.5 M
119 348.5 L
S
GR
%%Trailer
%%Pages: 1
%%EOF
