%!PS-Adobe-3.0 EPSF-3.0
%%Creator: (MATLAB, The Mathworks, Inc. Version 9.1.0.441655 \(R2016b\). Operating System: Mac OS X)
%%Title: /Users/kosciessa/Desktop/mntTardis/STSWD_Rest/WIP_eeg/A_MSE_CSD_multiVariant/C_figures/F3_FastMSEreflectsPowerRatio.eps
%%CreationDate: 2019-04-11T15:27:34
%%Pages: (atend)
%%BoundingBox:   181    13  1631   553
%%LanguageLevel: 3
%%EndComments
%%BeginProlog
%%BeginResource: procset (Apache XML Graphics Std ProcSet) 1.2 0
%%Version: 1.2 0
%%Copyright: (Copyright 2001-2003,2010 The Apache Software Foundation. License terms: http://www.apache.org/licenses/LICENSE-2.0)
/bd{bind def}bind def
/ld{load def}bd
/GR/grestore ld
/M/moveto ld
/LJ/setlinejoin ld
/C/curveto ld
/f/fill ld
/LW/setlinewidth ld
/GC/setgray ld
/t/show ld
/N/newpath ld
/CT/concat ld
/cp/closepath ld
/S/stroke ld
/L/lineto ld
/CC/setcmykcolor ld
/A/ashow ld
/GS/gsave ld
/RC/setrgbcolor ld
/RM/rmoveto ld
/ML/setmiterlimit ld
/re {4 2 roll M
1 index 0 rlineto
0 exch rlineto
neg 0 rlineto
cp } bd
/_ctm matrix def
/_tm matrix def
/BT { _ctm currentmatrix pop matrix _tm copy pop 0 0 moveto } bd
/ET { _ctm setmatrix } bd
/iTm { _ctm setmatrix _tm concat } bd
/Tm { _tm astore pop iTm 0 0 moveto } bd
/ux 0.0 def
/uy 0.0 def
/F {
  /Tp exch def
  /Tf exch def
  Tf findfont Tp scalefont setfont
  /cf Tf def  /cs Tp def
} bd
/ULS {currentpoint /uy exch def /ux exch def} bd
/ULE {
  /Tcx currentpoint pop def
  gsave
  newpath
  cf findfont cs scalefont dup
  /FontMatrix get 0 get /Ts exch def /FontInfo get dup
  /UnderlinePosition get Ts mul /To exch def
  /UnderlineThickness get Ts mul /Tt exch def
  ux uy To add moveto  Tcx uy To add lineto
  Tt setlinewidth stroke
  grestore
} bd
/OLE {
  /Tcx currentpoint pop def
  gsave
  newpath
  cf findfont cs scalefont dup
  /FontMatrix get 0 get /Ts exch def /FontInfo get dup
  /UnderlinePosition get Ts mul /To exch def
  /UnderlineThickness get Ts mul /Tt exch def
  ux uy To add cs add moveto Tcx uy To add cs add lineto
  Tt setlinewidth stroke
  grestore
} bd
/SOE {
  /Tcx currentpoint pop def
  gsave
  newpath
  cf findfont cs scalefont dup
  /FontMatrix get 0 get /Ts exch def /FontInfo get dup
  /UnderlinePosition get Ts mul /To exch def
  /UnderlineThickness get Ts mul /Tt exch def
  ux uy To add cs 10 mul 26 idiv add moveto Tcx uy To add cs 10 mul 26 idiv add lineto
  Tt setlinewidth stroke
  grestore
} bd
/QT {
/Y22 exch store
/X22 exch store
/Y21 exch store
/X21 exch store
currentpoint
/Y21 load 2 mul add 3 div exch
/X21 load 2 mul add 3 div exch
/X21 load 2 mul /X22 load add 3 div
/Y21 load 2 mul /Y22 load add 3 div
/X22 load /Y22 load curveto
} bd
/SSPD {
dup length /d exch dict def
{
/v exch def
/k exch def
currentpagedevice k known {
/cpdv currentpagedevice k get def
v cpdv ne {
/upd false def
/nullv v type /nulltype eq def
/nullcpdv cpdv type /nulltype eq def
nullv nullcpdv or
{
/upd true def
} {
/sametype v type cpdv type eq def
sametype {
v type /arraytype eq {
/vlen v length def
/cpdvlen cpdv length def
vlen cpdvlen eq {
0 1 vlen 1 sub {
/i exch def
/obj v i get def
/cpdobj cpdv i get def
obj cpdobj ne {
/upd true def
exit
} if
} for
} {
/upd true def
} ifelse
} {
v type /dicttype eq {
v {
/dv exch def
/dk exch def
/cpddv cpdv dk get def
dv cpddv ne {
/upd true def
exit
} if
} forall
} {
/upd true def
} ifelse
} ifelse
} if
} ifelse
upd true eq {
d k v put
} if
} if
} if
} forall
d length 0 gt {
d setpagedevice
} if
} bd
/RE { % /NewFontName [NewEncodingArray] /FontName RE -
  findfont dup length dict begin
  {
    1 index /FID ne
    {def} {pop pop} ifelse
  } forall
  /Encoding exch def
  /FontName 1 index def
  currentdict definefont pop
  end
} bind def
%%EndResource
%%BeginResource: procset (Apache XML Graphics EPS ProcSet) 1.0 0
%%Version: 1.0 0
%%Copyright: (Copyright 2002-2003 The Apache Software Foundation. License terms: http://www.apache.org/licenses/LICENSE-2.0)
/BeginEPSF { %def
/b4_Inc_state save def         % Save state for cleanup
/dict_count countdictstack def % Count objects on dict stack
/op_count count 1 sub def      % Count objects on operand stack
userdict begin                 % Push userdict on dict stack
/showpage { } def              % Redefine showpage, { } = null proc
0 setgray 0 setlinecap         % Prepare graphics state
1 setlinewidth 0 setlinejoin
10 setmiterlimit [ ] 0 setdash newpath
/languagelevel where           % If level not equal to 1 then
{pop languagelevel             % set strokeadjust and
1 ne                           % overprint to their defaults.
{false setstrokeadjust false setoverprint
} if
} if
} bd
/EndEPSF { %def
count op_count sub {pop} repeat            % Clean up stacks
countdictstack dict_count sub {end} repeat
b4_Inc_state restore
} bd
%%EndResource
%FOPBeginFontDict
%%IncludeResource: font Courier-Bold
%%IncludeResource: font Helvetica
%%IncludeResource: font Courier-BoldOblique
%%IncludeResource: font Courier-Oblique
%%IncludeResource: font Times-Roman
%%IncludeResource: font Helvetica-BoldOblique
%%IncludeResource: font Helvetica-Bold
%%IncludeResource: font Helvetica-Oblique
%%IncludeResource: font Times-BoldItalic
%%IncludeResource: font Courier
%%IncludeResource: font Times-Italic
%%IncludeResource: font Times-Bold
%%IncludeResource: font Symbol
%%IncludeResource: font ZapfDingbats
%FOPEndFontDict
%%BeginResource: encoding WinAnsiEncoding
/WinAnsiEncoding [
/.notdef /.notdef /.notdef /.notdef /.notdef
/.notdef /.notdef /.notdef /.notdef /.notdef
/.notdef /.notdef /.notdef /.notdef /.notdef
/.notdef /.notdef /.notdef /.notdef /.notdef
/.notdef /.notdef /.notdef /.notdef /.notdef
/.notdef /.notdef /.notdef /.notdef /.notdef
/.notdef /.notdef /space /exclam /quotedbl
/numbersign /dollar /percent /ampersand /quotesingle
/parenleft /parenright /asterisk /plus /comma
/hyphen /period /slash /zero /one
/two /three /four /five /six
/seven /eight /nine /colon /semicolon
/less /equal /greater /question /at
/A /B /C /D /E
/F /G /H /I /J
/K /L /M /N /O
/P /Q /R /S /T
/U /V /W /X /Y
/Z /bracketleft /backslash /bracketright /asciicircum
/underscore /quoteleft /a /b /c
/d /e /f /g /h
/i /j /k /l /m
/n /o /p /q /r
/s /t /u /v /w
/x /y /z /braceleft /bar
/braceright /asciitilde /bullet /Euro /bullet
/quotesinglbase /florin /quotedblbase /ellipsis /dagger
/daggerdbl /circumflex /perthousand /Scaron /guilsinglleft
/OE /bullet /Zcaron /bullet /bullet
/quoteleft /quoteright /quotedblleft /quotedblright /bullet
/endash /emdash /asciitilde /trademark /scaron
/guilsinglright /oe /bullet /zcaron /Ydieresis
/space /exclamdown /cent /sterling /currency
/yen /brokenbar /section /dieresis /copyright
/ordfeminine /guillemotleft /logicalnot /sfthyphen /registered
/macron /degree /plusminus /twosuperior /threesuperior
/acute /mu /paragraph /middot /cedilla
/onesuperior /ordmasculine /guillemotright /onequarter /onehalf
/threequarters /questiondown /Agrave /Aacute /Acircumflex
/Atilde /Adieresis /Aring /AE /Ccedilla
/Egrave /Eacute /Ecircumflex /Edieresis /Igrave
/Iacute /Icircumflex /Idieresis /Eth /Ntilde
/Ograve /Oacute /Ocircumflex /Otilde /Odieresis
/multiply /Oslash /Ugrave /Uacute /Ucircumflex
/Udieresis /Yacute /Thorn /germandbls /agrave
/aacute /acircumflex /atilde /adieresis /aring
/ae /ccedilla /egrave /eacute /ecircumflex
/edieresis /igrave /iacute /icircumflex /idieresis
/eth /ntilde /ograve /oacute /ocircumflex
/otilde /odieresis /divide /oslash /ugrave
/uacute /ucircumflex /udieresis /yacute /thorn
/ydieresis
] def
%%EndResource
%FOPBeginFontReencode
/Courier-Bold findfont
dup length dict begin
  {1 index /FID ne {def} {pop pop} ifelse} forall
  /Encoding WinAnsiEncoding def
  currentdict
end
/Courier-Bold exch definefont pop
/Helvetica findfont
dup length dict begin
  {1 index /FID ne {def} {pop pop} ifelse} forall
  /Encoding WinAnsiEncoding def
  currentdict
end
/Helvetica exch definefont pop
/Courier-BoldOblique findfont
dup length dict begin
  {1 index /FID ne {def} {pop pop} ifelse} forall
  /Encoding WinAnsiEncoding def
  currentdict
end
/Courier-BoldOblique exch definefont pop
/Courier-Oblique findfont
dup length dict begin
  {1 index /FID ne {def} {pop pop} ifelse} forall
  /Encoding WinAnsiEncoding def
  currentdict
end
/Courier-Oblique exch definefont pop
/Times-Roman findfont
dup length dict begin
  {1 index /FID ne {def} {pop pop} ifelse} forall
  /Encoding WinAnsiEncoding def
  currentdict
end
/Times-Roman exch definefont pop
/Helvetica-BoldOblique findfont
dup length dict begin
  {1 index /FID ne {def} {pop pop} ifelse} forall
  /Encoding WinAnsiEncoding def
  currentdict
end
/Helvetica-BoldOblique exch definefont pop
/Helvetica-Bold findfont
dup length dict begin
  {1 index /FID ne {def} {pop pop} ifelse} forall
  /Encoding WinAnsiEncoding def
  currentdict
end
/Helvetica-Bold exch definefont pop
/Helvetica-Oblique findfont
dup length dict begin
  {1 index /FID ne {def} {pop pop} ifelse} forall
  /Encoding WinAnsiEncoding def
  currentdict
end
/Helvetica-Oblique exch definefont pop
/Times-BoldItalic findfont
dup length dict begin
  {1 index /FID ne {def} {pop pop} ifelse} forall
  /Encoding WinAnsiEncoding def
  currentdict
end
/Times-BoldItalic exch definefont pop
/Courier findfont
dup length dict begin
  {1 index /FID ne {def} {pop pop} ifelse} forall
  /Encoding WinAnsiEncoding def
  currentdict
end
/Courier exch definefont pop
/Times-Italic findfont
dup length dict begin
  {1 index /FID ne {def} {pop pop} ifelse} forall
  /Encoding WinAnsiEncoding def
  currentdict
end
/Times-Italic exch definefont pop
/Times-Bold findfont
dup length dict begin
  {1 index /FID ne {def} {pop pop} ifelse} forall
  /Encoding WinAnsiEncoding def
  currentdict
end
/Times-Bold exch definefont pop
%FOPEndFontReencode
%%EndProlog
%%Page: 1 1
%%PageBoundingBox: 0 0 1792 576
%%BeginPageSetup
[1 0 0 -1 0 576] CT
%%EndPageSetup
GS
1 GC
N
0 0 1792 576 re
f
GR
GS
1 GC
N
0 0 1792 576 re
f
GR
GS
1 GC
N
233 512.5 M
832.5 512.5 L
832.5 43 L
233 43 L
cp
f
GR
GS
0.149 GC
2 setlinecap
1 LJ
0.5 LW
N
233 512.5 M
832.5 512.5 L
S
GR
GS
0.149 GC
2 setlinecap
1 LJ
0.5 LW
N
233 512.5 M
233 506.505 L
S
GR
GS
0.149 GC
2 setlinecap
1 LJ
0.5 LW
N
307.938 512.5 M
307.938 506.505 L
S
GR
GS
0.149 GC
2 setlinecap
1 LJ
0.5 LW
N
382.875 512.5 M
382.875 506.505 L
S
GR
GS
0.149 GC
2 setlinecap
1 LJ
0.5 LW
N
457.813 512.5 M
457.813 506.505 L
S
GR
GS
0.149 GC
2 setlinecap
1 LJ
0.5 LW
N
532.75 512.5 M
532.75 506.505 L
S
GR
GS
0.149 GC
2 setlinecap
1 LJ
0.5 LW
N
607.688 512.5 M
607.688 506.505 L
S
GR
GS
0.149 GC
2 setlinecap
1 LJ
0.5 LW
N
682.625 512.5 M
682.625 506.505 L
S
GR
GS
0.149 GC
2 setlinecap
1 LJ
0.5 LW
N
757.563 512.5 M
757.563 506.505 L
S
GR
GS
0.149 GC
2 setlinecap
1 LJ
0.5 LW
N
832.5 512.5 M
832.5 506.505 L
S
GR
GS
[1 0 0 1 233 518.09998] CT
0.149 GC
/Helvetica 18 F
GS
[1 0 0 1 0 0] CT
-5.5 18 moveto 
1 -1 scale
(2) t 
GR
GR
GS
[1 0 0 1 307.9375 518.09998] CT
0.149 GC
/Helvetica 18 F
GS
[1 0 0 1 0 0] CT
-5.5 18 moveto 
1 -1 scale
(4) t 
GR
GR
GS
[1 0 0 1 382.875 518.09998] CT
0.149 GC
/Helvetica 18 F
GS
[1 0 0 1 0 0] CT
-5.5 18 moveto 
1 -1 scale
(6) t 
GR
GR
GS
[1 0 0 1 457.8125 518.09998] CT
0.149 GC
/Helvetica 18 F
GS
[1 0 0 1 0 0] CT
-5.5 18 moveto 
1 -1 scale
(8) t 
GR
GR
GS
[1 0 0 1 532.75 518.09998] CT
0.149 GC
/Helvetica 18 F
GS
[1 0 0 1 0 0] CT
-10.5 18 moveto 
1 -1 scale
(10) t 
GR
GR
GS
[1 0 0 1 607.6875 518.09998] CT
0.149 GC
/Helvetica 18 F
GS
[1 0 0 1 0 0] CT
-10.5 18 moveto 
1 -1 scale
(12) t 
GR
GR
GS
[1 0 0 1 682.625 518.09998] CT
0.149 GC
/Helvetica 18 F
GS
[1 0 0 1 0 0] CT
-10.5 18 moveto 
1 -1 scale
(14) t 
GR
GR
GS
[1 0 0 1 757.5625 518.09998] CT
0.149 GC
/Helvetica 18 F
GS
[1 0 0 1 0 0] CT
-10.5 18 moveto 
1 -1 scale
(16) t 
GR
GR
GS
[1 0 0 1 832.5 518.09998] CT
0.149 GC
/Helvetica 18 F
GS
[1 0 0 1 0 0] CT
-10.5 18 moveto 
1 -1 scale
(18) t 
GR
GR
GS
[1 0 0 1 532.75031 540.59998] CT
0.149 GC
/Helvetica 18 F
GS
[1 0 0 1 0 0] CT
-116 18 moveto 
1 -1 scale
(Ratio: lowpass R/highpass R) t 
GR
GR
GS
0.149 GC
2 setlinecap
1 LJ
0.5 LW
N
233 512.5 M
233 43 L
S
GR
GS
0.149 GC
2 setlinecap
1 LJ
0.5 LW
N
233 478.933 M
238.995 478.933 L
S
GR
GS
0.149 GC
2 setlinecap
1 LJ
0.5 LW
N
233 435.34 M
238.995 435.34 L
S
GR
GS
0.149 GC
2 setlinecap
1 LJ
0.5 LW
N
233 391.746 M
238.995 391.746 L
S
GR
GS
0.149 GC
2 setlinecap
1 LJ
0.5 LW
N
233 348.153 M
238.995 348.153 L
S
GR
GS
0.149 GC
2 setlinecap
1 LJ
0.5 LW
N
233 304.56 M
238.995 304.56 L
S
GR
GS
0.149 GC
2 setlinecap
1 LJ
0.5 LW
N
233 260.966 M
238.995 260.966 L
S
GR
GS
0.149 GC
2 setlinecap
1 LJ
0.5 LW
N
233 217.373 M
238.995 217.373 L
S
GR
GS
0.149 GC
2 setlinecap
1 LJ
0.5 LW
N
233 173.78 M
238.995 173.78 L
S
GR
GS
0.149 GC
2 setlinecap
1 LJ
0.5 LW
N
233 130.187 M
238.995 130.187 L
S
GR
GS
0.149 GC
2 setlinecap
1 LJ
0.5 LW
N
233 86.593 M
238.995 86.593 L
S
GR
GS
0.149 GC
2 setlinecap
1 LJ
0.5 LW
N
233 43 M
238.995 43 L
S
GR
GS
[1 0 0 1 227.39999 478.93295] CT
0.149 GC
/Helvetica 18 F
GS
[1 0 0 1 0 0] CT
-11 7 moveto 
1 -1 scale
(0) t 
GR
GR
GS
[1 0 0 1 227.39999 435.33966] CT
0.149 GC
/Helvetica 18 F
GS
[1 0 0 1 0 0] CT
-26 7 moveto 
1 -1 scale
(0.1) t 
GR
GR
GS
[1 0 0 1 227.39999 391.74637] CT
0.149 GC
/Helvetica 18 F
GS
[1 0 0 1 0 0] CT
-26 7 moveto 
1 -1 scale
(0.2) t 
GR
GR
GS
[1 0 0 1 227.39999 348.15308] CT
0.149 GC
/Helvetica 18 F
GS
[1 0 0 1 0 0] CT
-26 7 moveto 
1 -1 scale
(0.3) t 
GR
GR
GS
[1 0 0 1 227.39999 304.55978] CT
0.149 GC
/Helvetica 18 F
GS
[1 0 0 1 0 0] CT
-26 7 moveto 
1 -1 scale
(0.4) t 
GR
GR
GS
[1 0 0 1 227.39999 260.96649] CT
0.149 GC
/Helvetica 18 F
GS
[1 0 0 1 0 0] CT
-26 7 moveto 
1 -1 scale
(0.5) t 
GR
GR
GS
[1 0 0 1 227.39999 217.37318] CT
0.149 GC
/Helvetica 18 F
GS
[1 0 0 1 0 0] CT
-26 7 moveto 
1 -1 scale
(0.6) t 
GR
GR
GS
[1 0 0 1 227.39999 173.77989] CT
0.149 GC
/Helvetica 18 F
GS
[1 0 0 1 0 0] CT
-26 7 moveto 
1 -1 scale
(0.7) t 
GR
GR
GS
[1 0 0 1 227.39999 130.18658] CT
0.149 GC
/Helvetica 18 F
GS
[1 0 0 1 0 0] CT
-26 7 moveto 
1 -1 scale
(0.8) t 
GR
GR
GS
[1 0 0 1 227.39999 86.59331] CT
0.149 GC
/Helvetica 18 F
GS
[1 0 0 1 0 0] CT
-26 7 moveto 
1 -1 scale
(0.9) t 
GR
GR
GS
[1 0 0 1 227.39999 43] CT
0.149 GC
/Helvetica 18 F
GS
[1 0 0 1 0 0] CT
-11 7 moveto 
1 -1 scale
(1) t 
GR
GR
GS
[0 -1 1 0 198.89999 277.74979] CT
0.149 GC
/Helvetica 18 F
GS
[1 0 0 1 0 0] CT
-48 -4 moveto 
1 -1 scale
(MSE Vanilla) t 
GR
GR
GS
[1 0 0 1 532.75049 40.75003] CT
/Helvetica-Bold 18 F
GS
[1 0 0 1 0 0] CT
-94.5 -4 moveto 
1 -1 scale
(Eyes open: Scales 1-3) t 
GR
GR
GS
[1 0 0 1 485.61465 243.41267] CT
N
2.5 -0.5 M
2.5 -2.157 1.157 -3.5 -0.5 -3.5 C
-2.157 -3.5 -3.5 -2.157 -3.5 -0.5 C
-3.5 1.157 -2.157 2.5 -0.5 2.5 C
1.157 2.5 2.5 1.157 2.5 -0.5 C
f
GR
GS
[1 0 0 1 386.97772 204.74893] CT
N
/f-2139806394{2.5 -0.5 M
2.5 -2.157 1.157 -3.5 -0.5 -3.5 C
-2.157 -3.5 -3.5 -2.157 -3.5 -0.5 C
-3.5 1.157 -2.157 2.5 -0.5 2.5 C
1.157 2.5 2.5 1.157 2.5 -0.5 C}def
f-2139806394
f
GR
GS
[1 0 0 1 456.5874 241.55573] CT
N
f-2139806394
f
GR
GS
[1 0 0 1 383.2988 206.41307] CT
N
f-2139806394
f
GR
GS
[1 0 0 1 376.38129 208.48624] CT
N
f-2139806394
f
GR
GS
[1 0 0 1 829.46399 388.09] CT
N
f-2139806394
f
GR
GS
[1 0 0 1 389.65012 162.92012] CT
N
f-2139806394
f
GR
GS
[1 0 0 1 374.74509 167.58368] CT
N
f-2139806394
f
GR
GS
[1 0 0 1 324.14694 108.80661] CT
N
f-2139806394
f
GR
GS
[1 0 0 1 533.65845 258.0993] CT
N
f-2139806394
f
GR
GS
[1 0 0 1 614.04773 305.03955] CT
N
f-2139806394
f
GR
GS
[1 0 0 1 371.82932 226.80553] CT
N
f-2139806394
f
GR
GS
[1 0 0 1 794.08441 360.43756] CT
N
f-2139806394
f
GR
GS
[1 0 0 1 509.46057 235.1638] CT
N
f-2139806394
f
GR
GS
[1 0 0 1 491.20889 237.30745] CT
N
f-2139806394
f
GR
GS
[1 0 0 1 498.15134 249.24069] CT
N
f-2139806394
f
GR
GS
[1 0 0 1 537.43579 276.19769] CT
N
f-2139806394
f
GR
GS
[1 0 0 1 456.96136 249.91336] CT
N
f-2139806394
f
GR
GS
[1 0 0 1 577.01343 289.09119] CT
N
f-2139806394
f
GR
GS
[1 0 0 1 381.72092 237.05167] CT
N
f-2139806394
f
GR
GS
[1 0 0 1 424.56586 204.75537] CT
N
f-2139806394
f
GR
GS
[1 0 0 1 436.32153 224.82326] CT
N
f-2139806394
f
GR
GS
[1 0 0 1 355.47922 168.58667] CT
N
f-2139806394
f
GR
GS
[1 0 0 1 292.25748 144.11429] CT
N
f-2139806394
f
GR
GS
[1 0 0 1 470.15521 219.87106] CT
N
f-2139806394
f
GR
GS
[1 0 0 1 505.93774 270.11917] CT
N
f-2139806394
f
GR
GS
[1 0 0 1 832.45074 399.02625] CT
N
f-2139806394
f
GR
GS
[1 0 0 1 438.246 360.78284] CT
N
f-2139806394
f
GR
GS
[1 0 0 1 435.93127 193.55305] CT
N
f-2139806394
f
GR
GS
[1 0 0 1 370.46854 198.23528] CT
N
f-2139806394
f
GR
GS
[1 0 0 1 479.08173 273.70691] CT
N
f-2139806394
f
GR
GS
[1 0 0 1 332.5694 157.86386] CT
N
f-2139806394
f
GR
GS
[1 0 0 1 342.11395 114.82483] CT
N
f-2139806394
f
GR
GS
[1 0 0 1 509.25296 235.52235] CT
N
f-2139806394
f
GR
GS
[1 0 0 1 567.03052 266.99686] CT
N
f-2139806394
f
GR
GS
[1 0 0 1 483.03833 282.34204] CT
N
f-2139806394
f
GR
GS
[1 0 0 1 440.43347 220.31554] CT
N
f-2139806394
f
GR
GS
[1 0 0 1 433.89966 170.888] CT
N
f-2139806394
f
GR
GS
[1 0 0 1 478.39578 262.38269] CT
N
f-2139806394
f
GR
GS
[1 0 0 1 516.35181 263.41296] CT
N
f-2139806394
f
GR
GS
[1 0 0 1 343.70129 124.90228] CT
N
f-2139806394
f
GR
GS
[1 0 0 1 380.98215 191.02846] CT
N
f-2139806394
f
GR
GS
[1 0 0 1 389.28903 181.85701] CT
N
f-2139806394
f
GR
GS
[1 0 0 1 350.77682 169.6913] CT
N
f-2139806394
f
GR
GS
[1 0 0 1 421.12204 182.65944] CT
N
f-2139806394
f
GR
GS
[1 0 0 1 440.44208 212.96149] CT
N
f-2139806394
f
GR
GS
[1 0 0 1 344.21042 112.00475] CT
N
f-2139806394
f
GR
GS
0.749 GC
1 LJ
0.5 LW
N
233 116.446 M
832.5 409.018 L
S
GR
GS
[1 0 0 1 321.21313 138.56129] CT
1 0 0 RC
N
f-2139806394
f
GR
GS
[1 0 0 1 301.78516 297.31558] CT
1 0 0 RC
N
f-2139806394
f
GR
GS
[1 0 0 1 407.92749 180.4619] CT
1 0 0 RC
N
f-2139806394
f
GR
GS
[1 0 0 1 289.68488 203.07301] CT
1 0 0 RC
N
f-2139806394
f
GR
GS
[1 0 0 1 289.17368 124.39481] CT
1 0 0 RC
N
f-2139806394
f
GR
GS
[1 0 0 1 338.81204 147.92494] CT
1 0 0 RC
N
f-2139806394
f
GR
GS
[1 0 0 1 279.78229 67.03802] CT
1 0 0 RC
N
f-2139806394
f
GR
GS
[1 0 0 1 432.01001 244.19525] CT
1 0 0 RC
N
f-2139806394
f
GR
GS
[1 0 0 1 300.63016 149.35855] CT
1 0 0 RC
N
f-2139806394
f
GR
GS
[1 0 0 1 441.40494 198.30603] CT
1 0 0 RC
N
f-2139806394
f
GR
GS
[1 0 0 1 344.14072 135.56291] CT
1 0 0 RC
N
f-2139806394
f
GR
GS
[1 0 0 1 419.21429 221.56145] CT
1 0 0 RC
N
f-2139806394
f
GR
GS
[1 0 0 1 411.60471 272.67285] CT
1 0 0 RC
N
f-2139806394
f
GR
GS
[1 0 0 1 383.46451 222.00266] CT
1 0 0 RC
N
f-2139806394
f
GR
GS
[1 0 0 1 265.31509 117.56278] CT
1 0 0 RC
N
f-2139806394
f
GR
GS
[1 0 0 1 400.56525 196.67023] CT
1 0 0 RC
N
f-2139806394
f
GR
GS
[1 0 0 1 385.81769 270.37164] CT
1 0 0 RC
N
f-2139806394
f
GR
GS
[1 0 0 1 347.8522 167.64453] CT
1 0 0 RC
N
f-2139806394
f
GR
GS
[1 0 0 1 377.23251 193.55029] CT
1 0 0 RC
N
f-2139806394
f
GR
GS
[1 0 0 1 318.82422 208.80788] CT
1 0 0 RC
N
f-2139806394
f
GR
GS
[1 0 0 1 419.71384 259.79388] CT
1 0 0 RC
N
f-2139806394
f
GR
GS
[1 0 0 1 390.59271 208.16447] CT
1 0 0 RC
N
f-2139806394
f
GR
GS
[1 0 0 1 319.89764 179.63232] CT
1 0 0 RC
N
f-2139806394
f
GR
GS
[1 0 0 1 304.42566 123.21217] CT
1 0 0 RC
N
f-2139806394
f
GR
GS
[1 0 0 1 356.93835 147.71541] CT
1 0 0 RC
N
f-2139806394
f
GR
GS
[1 0 0 1 368.16449 151.8945] CT
1 0 0 RC
N
f-2139806394
f
GR
GS
[1 0 0 1 318.36816 135.16675] CT
1 0 0 RC
N
f-2139806394
f
GR
GS
[1 0 0 1 466.30237 192.37943] CT
1 0 0 RC
N
f-2139806394
f
GR
GS
[1 0 0 1 304.7225 100.94012] CT
1 0 0 RC
N
f-2139806394
f
GR
GS
[1 0 0 1 318.14539 154.24452] CT
1 0 0 RC
N
f-2139806394
f
GR
GS
[1 0 0 1 338.44366 99.67214] CT
1 0 0 RC
N
f-2139806394
f
GR
GS
[1 0 0 1 267.09229 107.79694] CT
1 0 0 RC
N
f-2139806394
f
GR
GS
[1 0 0 1 284.63141 88.17769] CT
1 0 0 RC
N
f-2139806394
f
GR
GS
[1 0 0 1 260.34796 95.59866] CT
1 0 0 RC
N
f-2139806394
f
GR
GS
[1 0 0 1 292.25681 87.87186] CT
1 0 0 RC
N
f-2139806394
f
GR
GS
[1 0 0 1 284.81821 84.86732] CT
1 0 0 RC
N
f-2139806394
f
GR
GS
[1 0 0 1 378.00781 133.2606] CT
1 0 0 RC
N
f-2139806394
f
GR
GS
[1 0 0 1 272.41479 72.31034] CT
1 0 0 RC
N
f-2139806394
f
GR
GS
[1 0 0 1 328.69394 158.20508] CT
1 0 0 RC
N
f-2139806394
f
GR
GS
[1 0 0 1 551.97168 292.36301] CT
1 0 0 RC
N
f-2139806394
f
GR
GS
[1 0 0 1 313.6203 147.61659] CT
1 0 0 RC
N
f-2139806394
f
GR
GS
[1 0 0 1 258.33527 86.42301] CT
1 0 0 RC
N
f-2139806394
f
GR
GS
[1 0 0 1 321.89859 290.87442] CT
1 0 0 RC
N
f-2139806394
f
GR
GS
[1 0 0 1 417.11194 218.04938] CT
1 0 0 RC
N
f-2139806394
f
GR
GS
[1 0 0 1 277.33911 90.32243] CT
1 0 0 RC
N
f-2139806394
f
GR
GS
[1 0 0 1 310.95798 110.99323] CT
1 0 0 RC
N
f-2139806394
f
GR
GS
[1 0 0 1 497.41101 291.73856] CT
1 0 0 RC
N
f-2139806394
f
GR
GS
[1 0 0 1 321.75476 132.7735] CT
1 0 0 RC
N
f-2139806394
f
GR
GS
[1 0 0 1 315.27994 103.79745] CT
1 0 0 RC
N
f-2139806394
f
GR
GS
[1 0 0 1 364.24979 170.4465] CT
1 0 0 RC
N
f-2139806394
f
GR
GS
[1 0 0 1 472.98233 249.16153] CT
1 0 0 RC
N
f-2139806394
f
GR
GS
[1 0 0 1 278.36441 102.76086] CT
1 0 0 RC
N
f-2139806394
f
GR
GS
0.749 GC
1 LJ
0.5 LW
N
233 84.687 M
832.5 512.5 L
S
GR
GS
0.749 GC
1 LJ
0.5 LW
N
233 116.446 M
832.5 409.018 L
S
GR
GS
[1 0 0 1 280 65.75] CT
/Helvetica 18 F
GS
[1 0 0 1 0 0] CT
0 7 moveto 
1 -1 scale
(Younger Adults: r=-0.87) t 
GR
GR
GS
[1 0 0 1 262 65.75] CT
N
f-2139806394
f
GR
GS
[1 0 0 1 280 87.75] CT
/Helvetica 18 F
GS
[1 0 0 1 0 0] CT
0 7 moveto 
1 -1 scale
(Older Adults: r=-0.73) t 
GR
GR
GS
[1 0 0 1 262 87.75] CT
1 0 0 RC
N
f-2139806394
f
GR
GS
1 GC
N
/f-299995158{1022 512.5 M
1622 512.5 L
1622 43 L
1022 43 L
cp}def
f-299995158
f
GR
GS
0.149 GC
2 setlinecap
1 LJ
0.5 LW
N
1022 512.5 M
1622 512.5 L
S
GR
GS
0.149 GC
2 setlinecap
1 LJ
0.5 LW
N
1022 512.5 M
1022 506.5 L
S
GR
GS
0.149 GC
2 setlinecap
1 LJ
0.5 LW
N
1142 512.5 M
1142 506.5 L
S
GR
GS
0.149 GC
2 setlinecap
1 LJ
0.5 LW
N
1262 512.5 M
1262 506.5 L
S
GR
GS
0.149 GC
2 setlinecap
1 LJ
0.5 LW
N
1382 512.5 M
1382 506.5 L
S
GR
GS
0.149 GC
2 setlinecap
1 LJ
0.5 LW
N
1502 512.5 M
1502 506.5 L
S
GR
GS
0.149 GC
2 setlinecap
1 LJ
0.5 LW
N
1622 512.5 M
1622 506.5 L
S
GR
GS
[1 0 0 1 1022 518.09998] CT
0.149 GC
/Helvetica 18 F
GS
[1 0 0 1 0 0] CT
-5.5 18 moveto 
1 -1 scale
(0) t 
GR
GR
GS
[1 0 0 1 1142 518.09998] CT
0.149 GC
/Helvetica 18 F
GS
[1 0 0 1 0 0] CT
-5.5 18 moveto 
1 -1 scale
(5) t 
GR
GR
GS
[1 0 0 1 1262 518.09998] CT
0.149 GC
/Helvetica 18 F
GS
[1 0 0 1 0 0] CT
-10.5 18 moveto 
1 -1 scale
(10) t 
GR
GR
GS
[1 0 0 1 1382 518.09998] CT
0.149 GC
/Helvetica 18 F
GS
[1 0 0 1 0 0] CT
-10.5 18 moveto 
1 -1 scale
(15) t 
GR
GR
GS
[1 0 0 1 1502 518.09998] CT
0.149 GC
/Helvetica 18 F
GS
[1 0 0 1 0 0] CT
-10.5 18 moveto 
1 -1 scale
(20) t 
GR
GR
GS
[1 0 0 1 1622 518.09998] CT
0.149 GC
/Helvetica 18 F
GS
[1 0 0 1 0 0] CT
-10.5 18 moveto 
1 -1 scale
(25) t 
GR
GR
GS
[1 0 0 1 1322.00024 540.59998] CT
0.149 GC
/Helvetica 18 F
GS
[1 0 0 1 0 0] CT
-116 18 moveto 
1 -1 scale
(Ratio: lowpass R/highpass R) t 
GR
GR
GS
0.149 GC
2 setlinecap
1 LJ
0.5 LW
N
1022 512.5 M
1022 43 L
S
GR
GS
0.149 GC
2 setlinecap
1 LJ
0.5 LW
N
1022 510.921 M
1028 510.921 L
S
GR
GS
0.149 GC
2 setlinecap
1 LJ
0.5 LW
N
1022 444.075 M
1028 444.075 L
S
GR
GS
0.149 GC
2 setlinecap
1 LJ
0.5 LW
N
1022 377.229 M
1028 377.229 L
S
GR
GS
0.149 GC
2 setlinecap
1 LJ
0.5 LW
N
1022 310.384 M
1028 310.384 L
S
GR
GS
0.149 GC
2 setlinecap
1 LJ
0.5 LW
N
1022 243.538 M
1028 243.538 L
S
GR
GS
0.149 GC
2 setlinecap
1 LJ
0.5 LW
N
1022 176.692 M
1028 176.692 L
S
GR
GS
0.149 GC
2 setlinecap
1 LJ
0.5 LW
N
1022 109.846 M
1028 109.846 L
S
GR
GS
0.149 GC
2 setlinecap
1 LJ
0.5 LW
N
1022 43 M
1028 43 L
S
GR
GS
[1 0 0 1 1016.40002 510.92117] CT
0.149 GC
/Helvetica 18 F
GS
[1 0 0 1 0 0] CT
-26 7 moveto 
1 -1 scale
(0.1) t 
GR
GR
GS
[1 0 0 1 1016.40002 444.07529] CT
0.149 GC
/Helvetica 18 F
GS
[1 0 0 1 0 0] CT
-26 7 moveto 
1 -1 scale
(0.2) t 
GR
GR
GS
[1 0 0 1 1016.40002 377.2294] CT
0.149 GC
/Helvetica 18 F
GS
[1 0 0 1 0 0] CT
-26 7 moveto 
1 -1 scale
(0.3) t 
GR
GR
GS
[1 0 0 1 1016.40002 310.38351] CT
0.149 GC
/Helvetica 18 F
GS
[1 0 0 1 0 0] CT
-26 7 moveto 
1 -1 scale
(0.4) t 
GR
GR
GS
[1 0 0 1 1016.40002 243.53764] CT
0.149 GC
/Helvetica 18 F
GS
[1 0 0 1 0 0] CT
-26 7 moveto 
1 -1 scale
(0.5) t 
GR
GR
GS
[1 0 0 1 1016.40002 176.69174] CT
0.149 GC
/Helvetica 18 F
GS
[1 0 0 1 0 0] CT
-26 7 moveto 
1 -1 scale
(0.6) t 
GR
GR
GS
[1 0 0 1 1016.40002 109.84589] CT
0.149 GC
/Helvetica 18 F
GS
[1 0 0 1 0 0] CT
-26 7 moveto 
1 -1 scale
(0.7) t 
GR
GR
GS
[1 0 0 1 1016.40002 42.99999] CT
0.149 GC
/Helvetica 18 F
GS
[1 0 0 1 0 0] CT
-26 7 moveto 
1 -1 scale
(0.8) t 
GR
GR
GS
[0 -1 1 0 987.90002 277.74976] CT
0.149 GC
/Helvetica 18 F
GS
[1 0 0 1 0 0] CT
-48 -4 moveto 
1 -1 scale
(MSE Vanilla) t 
GR
GR
GS
[1 0 0 1 1322.00122 40.75] CT
/Helvetica-Bold 18 F
GS
[1 0 0 1 0 0] CT
-101.5 -4 moveto 
1 -1 scale
(Eyes closed: Scales 1-3) t 
GR
GR
GS
[1 0 0 1 1311.80261 331.10974] CT
N
f-2139806394
f
GR
GS
[1 0 0 1 1230.85767 227.06458] CT
N
f-2139806394
f
GR
GS
[1 0 0 1 1297.82788 287.34659] CT
N
f-2139806394
f
GR
GS
[1 0 0 1 1178.36792 248.80032] CT
N
f-2139806394
f
GR
GS
[1 0 0 1 1190.07312 213.51329] CT
N
f-2139806394
f
GR
GS
[1 0 0 1 1272.53979 241.5583] CT
N
f-2139806394
f
GR
GS
[1 0 0 1 1251.51746 243.44899] CT
N
f-2139806394
f
GR
GS
[1 0 0 1 1160.79248 100.34463] CT
N
f-2139806394
f
GR
GS
[1 0 0 1 1167.59644 73.39784] CT
N
f-2139806394
f
GR
GS
[1 0 0 1 1342.32825 330.60187] CT
N
f-2139806394
f
GR
GS
[1 0 0 1 1331.73083 308.44376] CT
N
f-2139806394
f
GR
GS
[1 0 0 1 1226.46021 243.86685] CT
N
f-2139806394
f
GR
GS
[1 0 0 1 1515.06604 423.8056] CT
N
f-2139806394
f
GR
GS
[1 0 0 1 1300.33459 284.51636] CT
N
f-2139806394
f
GR
GS
[1 0 0 1 1249.30347 247.01291] CT
N
f-2139806394
f
GR
GS
[1 0 0 1 1374.72095 356.38678] CT
N
f-2139806394
f
GR
GS
[1 0 0 1 1350.87573 288.63684] CT
N
f-2139806394
f
GR
GS
[1 0 0 1 1280.88208 276.13879] CT
N
f-2139806394
f
GR
GS
[1 0 0 1 1363.46912 309.19275] CT
N
f-2139806394
f
GR
GS
[1 0 0 1 1243.98499 314.66925] CT
N
f-2139806394
f
GR
GS
[1 0 0 1 1256.46082 225.68636] CT
N
f-2139806394
f
GR
GS
[1 0 0 1 1160.1781 282.45535] CT
N
f-2139806394
f
GR
GS
[1 0 0 1 1211.98181 186.55789] CT
N
f-2139806394
f
GR
GS
[1 0 0 1 1192.75647 183.72707] CT
N
f-2139806394
f
GR
GS
[1 0 0 1 1221.90588 180.522] CT
N
f-2139806394
f
GR
GS
[1 0 0 1 1333.53809 308.81238] CT
N
f-2139806394
f
GR
GS
[1 0 0 1 1514.948 358.05804] CT
N
f-2139806394
f
GR
GS
[1 0 0 1 1213.8075 423.43475] CT
N
f-2139806394
f
GR
GS
[1 0 0 1 1275.34082 222.93059] CT
N
f-2139806394
f
GR
GS
[1 0 0 1 1158.05322 147.34572] CT
N
f-2139806394
f
GR
GS
[1 0 0 1 1263.52466 330.8428] CT
N
f-2139806394
f
GR
GS
[1 0 0 1 1275.63135 326.15286] CT
N
f-2139806394
f
GR
GS
[1 0 0 1 1168.45508 137.06456] CT
N
f-2139806394
f
GR
GS
[1 0 0 1 1246.94934 204.52165] CT
N
f-2139806394
f
GR
GS
[1 0 0 1 1328.46436 282.4473] CT
N
f-2139806394
f
GR
GS
[1 0 0 1 1258.81433 326.62143] CT
N
f-2139806394
f
GR
GS
[1 0 0 1 1327.71045 345.81149] CT
N
f-2139806394
f
GR
GS
[1 0 0 1 1286.34924 296.78604] CT
N
f-2139806394
f
GR
GS
[1 0 0 1 1264.92322 261.0267] CT
N
f-2139806394
f
GR
GS
[1 0 0 1 1278.07727 240.49155] CT
N
f-2139806394
f
GR
GS
[1 0 0 1 1179.68921 170.45337] CT
N
f-2139806394
f
GR
GS
[1 0 0 1 1221.52332 208.79405] CT
N
f-2139806394
f
GR
GS
[1 0 0 1 1216.0116 204.55481] CT
N
f-2139806394
f
GR
GS
[1 0 0 1 1199.85767 145.65381] CT
N
f-2139806394
f
GR
GS
[1 0 0 1 1190.49854 123.46176] CT
N
f-2139806394
f
GR
GS
[1 0 0 1 1202.87366 169.92688] CT
N
f-2139806394
f
GR
GS
[1 0 0 1 1309.46899 265.12262] CT
N
f-2139806394
f
GR
GS
0.749 GC
1 LJ
0.5 LW
N
1118 147.923 M
1550 460.418 L
S
GR
GS
[1 0 0 1 1277.85876 242.6507] CT
1 0 0 RC
N
f-2139806394
f
GR
GS
[1 0 0 1 1109.01221 359.50339] CT
1 0 0 RC
N
f-2139806394
f
GR
GS
[1 0 0 1 1228.078 201.1916] CT
1 0 0 RC
N
f-2139806394
f
GR
GS
[1 0 0 1 1136.51331 233.9677] CT
1 0 0 RC
N
f-2139806394
f
GR
GS
[1 0 0 1 1124.6405 246.3848] CT
1 0 0 RC
N
f-2139806394
f
GR
GS
[1 0 0 1 1191.65369 195.36325] CT
1 0 0 RC
N
f-2139806394
f
GR
GS
[1 0 0 1 1253.3269 209.49374] CT
1 0 0 RC
N
f-2139806394
f
GR
GS
[1 0 0 1 1344.84656 402.1503] CT
1 0 0 RC
N
f-2139806394
f
GR
GS
[1 0 0 1 1298.82556 258.26492] CT
1 0 0 RC
N
f-2139806394
f
GR
GS
[1 0 0 1 1139.3667 60.10701] CT
1 0 0 RC
N
f-2139806394
f
GR
GS
[1 0 0 1 1259.54297 222.68979] CT
1 0 0 RC
N
f-2139806394
f
GR
GS
[1 0 0 1 1204.2428 229.90129] CT
1 0 0 RC
N
f-2139806394
f
GR
GS
[1 0 0 1 1250.19739 445.55133] CT
1 0 0 RC
N
f-2139806394
f
GR
GS
[1 0 0 1 1264.52673 256.38129] CT
1 0 0 RC
N
f-2139806394
f
GR
GS
[1 0 0 1 1280.15125 315.7373] CT
1 0 0 RC
N
f-2139806394
f
GR
GS
[1 0 0 1 1209.75549 177.96346] CT
1 0 0 RC
N
f-2139806394
f
GR
GS
[1 0 0 1 1319.00891 359.77029] CT
1 0 0 RC
N
f-2139806394
f
GR
GS
[1 0 0 1 1178.97681 236.04305] CT
1 0 0 RC
N
f-2139806394
f
GR
GS
[1 0 0 1 1178.23523 292.96365] CT
1 0 0 RC
N
f-2139806394
f
GR
GS
[1 0 0 1 1328.70007 279.96545] CT
1 0 0 RC
N
f-2139806394
f
GR
GS
[1 0 0 1 1279.9502 317.9418] CT
1 0 0 RC
N
f-2139806394
f
GR
GS
[1 0 0 1 1322.37732 261.80267] CT
1 0 0 RC
N
f-2139806394
f
GR
GS
[1 0 0 1 1173.92017 110.30843] CT
1 0 0 RC
N
f-2139806394
f
GR
GS
[1 0 0 1 1236.10229 214.52794] CT
1 0 0 RC
N
f-2139806394
f
GR
GS
[1 0 0 1 1149.73438 106.45551] CT
1 0 0 RC
N
f-2139806394
f
GR
GS
[1 0 0 1 1247.08264 199.78119] CT
1 0 0 RC
N
f-2139806394
f
GR
GS
[1 0 0 1 1148.08655 95.13807] CT
1 0 0 RC
N
f-2139806394
f
GR
GS
[1 0 0 1 1171.61243 148.2818] CT
1 0 0 RC
N
f-2139806394
f
GR
GS
[1 0 0 1 1188.78992 116.16925] CT
1 0 0 RC
N
f-2139806394
f
GR
GS
[1 0 0 1 1117.42407 330.53506] CT
1 0 0 RC
N
f-2139806394
f
GR
GS
[1 0 0 1 1171.26428 119.24212] CT
1 0 0 RC
N
f-2139806394
f
GR
GS
[1 0 0 1 1159.99512 190.84738] CT
1 0 0 RC
N
f-2139806394
f
GR
GS
[1 0 0 1 1118.07935 191.31203] CT
1 0 0 RC
N
f-2139806394
f
GR
GS
[1 0 0 1 1234.65967 139.39624] CT
1 0 0 RC
N
f-2139806394
f
GR
GS
[1 0 0 1 1131.297 66.30893] CT
1 0 0 RC
N
f-2139806394
f
GR
GS
[1 0 0 1 1293.00317 310.6908] CT
1 0 0 RC
N
f-2139806394
f
GR
GS
[1 0 0 1 1182.11548 198.54457] CT
1 0 0 RC
N
f-2139806394
f
GR
GS
[1 0 0 1 1127.33337 87.64124] CT
1 0 0 RC
N
f-2139806394
f
GR
GS
[1 0 0 1 1107.37317 434.9411] CT
1 0 0 RC
N
f-2139806394
f
GR
GS
[1 0 0 1 1303.12012 301.08682] CT
1 0 0 RC
N
f-2139806394
f
GR
GS
[1 0 0 1 1185.50476 271.44958] CT
1 0 0 RC
N
f-2139806394
f
GR
GS
[1 0 0 1 1229.1228 202.1413] CT
1 0 0 RC
N
f-2139806394
f
GR
GS
[1 0 0 1 1152.71838 73.58375] CT
1 0 0 RC
N
f-2139806394
f
GR
GS
[1 0 0 1 1253.97778 262.28345] CT
1 0 0 RC
N
f-2139806394
f
GR
GS
[1 0 0 1 1565.09253 451.32462] CT
1 0 0 RC
N
f-2139806394
f
GR
GS
[1 0 0 1 1115.40271 124.1022] CT
1 0 0 RC
N
f-2139806394
f
GR
GS
0.749 GC
1 LJ
0.5 LW
N
1022 163.095 M
1622 294.692 L
S
GR
GS
0.749 GC
1 LJ
0.5 LW
N
1022 78.479 M
1622 512.5 L
S
GR
GS
[1 0 0 1 1069 65.75] CT
/Helvetica 18 F
GS
[1 0 0 1 0 0] CT
0 7 moveto 
1 -1 scale
(Younger Adults: r=-0.73) t 
GR
GR
GS
[1 0 0 1 1051 65.75] CT
N
f-2139806394
f
GR
GS
[1 0 0 1 1069 87.75] CT
/Helvetica 18 F
GS
[1 0 0 1 0 0] CT
0 7 moveto 
1 -1 scale
(Older Adults: r=-0.52) t 
GR
GR
GS
[1 0 0 1 1051 87.75] CT
1 0 0 RC
N
f-2139806394
f
GR
%%Trailer
%%Pages: 1
%%EOF
