%!PS-Adobe-3.0 EPSF-3.0
%%Creator: (MATLAB, The Mathworks, Inc. Version 9.4.0.813654 \(R2018a\). Operating System: Mac OS X)
%%Title: /Volumes/LNDG/Projects/StateSwitch/dynamic/data/eeg/rest/B_analyses/A_MSE_CSD_multiVariant/C_figures/F_LowFreqShiftEntropyR.eps
%%CreationDate: 2020-04-23T12:24:01
%%Pages: (atend)
%%BoundingBox:   115    45  1165   833
%%LanguageLevel: 3
%%EndComments
%%BeginProlog
%%BeginResource: procset (Apache XML Graphics Std ProcSet) 1.2 0
%%Version: 1.2 0
%%Copyright: (Copyright 2001-2003,2010 The Apache Software Foundation. License terms: http://www.apache.org/licenses/LICENSE-2.0)
/bd{bind def}bind def
/ld{load def}bd
/GR/grestore ld
/GS/gsave ld
/RM/rmoveto ld
/C/curveto ld
/t/show ld
/L/lineto ld
/ML/setmiterlimit ld
/CT/concat ld
/f/fill ld
/N/newpath ld
/S/stroke ld
/CC/setcmykcolor ld
/A/ashow ld
/cp/closepath ld
/RC/setrgbcolor ld
/LJ/setlinejoin ld
/GC/setgray ld
/LW/setlinewidth ld
/M/moveto ld
/re {4 2 roll M
1 index 0 rlineto
0 exch rlineto
neg 0 rlineto
cp } bd
/_ctm matrix def
/_tm matrix def
/BT { _ctm currentmatrix pop matrix _tm copy pop 0 0 moveto } bd
/ET { _ctm setmatrix } bd
/iTm { _ctm setmatrix _tm concat } bd
/Tm { _tm astore pop iTm 0 0 moveto } bd
/ux 0.0 def
/uy 0.0 def
/F {
  /Tp exch def
  /Tf exch def
  Tf findfont Tp scalefont setfont
  /cf Tf def  /cs Tp def
} bd
/ULS {currentpoint /uy exch def /ux exch def} bd
/ULE {
  /Tcx currentpoint pop def
  gsave
  newpath
  cf findfont cs scalefont dup
  /FontMatrix get 0 get /Ts exch def /FontInfo get dup
  /UnderlinePosition get Ts mul /To exch def
  /UnderlineThickness get Ts mul /Tt exch def
  ux uy To add moveto  Tcx uy To add lineto
  Tt setlinewidth stroke
  grestore
} bd
/OLE {
  /Tcx currentpoint pop def
  gsave
  newpath
  cf findfont cs scalefont dup
  /FontMatrix get 0 get /Ts exch def /FontInfo get dup
  /UnderlinePosition get Ts mul /To exch def
  /UnderlineThickness get Ts mul /Tt exch def
  ux uy To add cs add moveto Tcx uy To add cs add lineto
  Tt setlinewidth stroke
  grestore
} bd
/SOE {
  /Tcx currentpoint pop def
  gsave
  newpath
  cf findfont cs scalefont dup
  /FontMatrix get 0 get /Ts exch def /FontInfo get dup
  /UnderlinePosition get Ts mul /To exch def
  /UnderlineThickness get Ts mul /Tt exch def
  ux uy To add cs 10 mul 26 idiv add moveto Tcx uy To add cs 10 mul 26 idiv add lineto
  Tt setlinewidth stroke
  grestore
} bd
/QT {
/Y22 exch store
/X22 exch store
/Y21 exch store
/X21 exch store
currentpoint
/Y21 load 2 mul add 3 div exch
/X21 load 2 mul add 3 div exch
/X21 load 2 mul /X22 load add 3 div
/Y21 load 2 mul /Y22 load add 3 div
/X22 load /Y22 load curveto
} bd
/SSPD {
dup length /d exch dict def
{
/v exch def
/k exch def
currentpagedevice k known {
/cpdv currentpagedevice k get def
v cpdv ne {
/upd false def
/nullv v type /nulltype eq def
/nullcpdv cpdv type /nulltype eq def
nullv nullcpdv or
{
/upd true def
} {
/sametype v type cpdv type eq def
sametype {
v type /arraytype eq {
/vlen v length def
/cpdvlen cpdv length def
vlen cpdvlen eq {
0 1 vlen 1 sub {
/i exch def
/obj v i get def
/cpdobj cpdv i get def
obj cpdobj ne {
/upd true def
exit
} if
} for
} {
/upd true def
} ifelse
} {
v type /dicttype eq {
v {
/dv exch def
/dk exch def
/cpddv cpdv dk get def
dv cpddv ne {
/upd true def
exit
} if
} forall
} {
/upd true def
} ifelse
} ifelse
} if
} ifelse
upd true eq {
d k v put
} if
} if
} if
} forall
d length 0 gt {
d setpagedevice
} if
} bd
/RE { % /NewFontName [NewEncodingArray] /FontName RE -
  findfont dup length dict begin
  {
    1 index /FID ne
    {def} {pop pop} ifelse
  } forall
  /Encoding exch def
  /FontName 1 index def
  currentdict definefont pop
  end
} bind def
%%EndResource
%%BeginResource: procset (Apache XML Graphics EPS ProcSet) 1.0 0
%%Version: 1.0 0
%%Copyright: (Copyright 2002-2003 The Apache Software Foundation. License terms: http://www.apache.org/licenses/LICENSE-2.0)
/BeginEPSF { %def
/b4_Inc_state save def         % Save state for cleanup
/dict_count countdictstack def % Count objects on dict stack
/op_count count 1 sub def      % Count objects on operand stack
userdict begin                 % Push userdict on dict stack
/showpage { } def              % Redefine showpage, { } = null proc
0 setgray 0 setlinecap         % Prepare graphics state
1 setlinewidth 0 setlinejoin
10 setmiterlimit [ ] 0 setdash newpath
/languagelevel where           % If level not equal to 1 then
{pop languagelevel             % set strokeadjust and
1 ne                           % overprint to their defaults.
{false setstrokeadjust false setoverprint
} if
} if
} bd
/EndEPSF { %def
count op_count sub {pop} repeat            % Clean up stacks
countdictstack dict_count sub {end} repeat
b4_Inc_state restore
} bd
%%EndResource
%FOPBeginFontDict
%%IncludeResource: font Courier-Oblique
%%IncludeResource: font Courier-BoldOblique
%%IncludeResource: font Courier-Bold
%%IncludeResource: font ZapfDingbats
%%IncludeResource: font Symbol
%%IncludeResource: font Helvetica
%%IncludeResource: font Helvetica-Oblique
%%IncludeResource: font Helvetica-Bold
%%IncludeResource: font Helvetica-BoldOblique
%%IncludeResource: font Times-Roman
%%IncludeResource: font Times-Italic
%%IncludeResource: font Times-Bold
%%IncludeResource: font Times-BoldItalic
%%IncludeResource: font Courier
%FOPEndFontDict
%%BeginResource: encoding WinAnsiEncoding
/WinAnsiEncoding [
/.notdef /.notdef /.notdef /.notdef /.notdef
/.notdef /.notdef /.notdef /.notdef /.notdef
/.notdef /.notdef /.notdef /.notdef /.notdef
/.notdef /.notdef /.notdef /.notdef /.notdef
/.notdef /.notdef /.notdef /.notdef /.notdef
/.notdef /.notdef /.notdef /.notdef /.notdef
/.notdef /.notdef /space /exclam /quotedbl
/numbersign /dollar /percent /ampersand /quotesingle
/parenleft /parenright /asterisk /plus /comma
/hyphen /period /slash /zero /one
/two /three /four /five /six
/seven /eight /nine /colon /semicolon
/less /equal /greater /question /at
/A /B /C /D /E
/F /G /H /I /J
/K /L /M /N /O
/P /Q /R /S /T
/U /V /W /X /Y
/Z /bracketleft /backslash /bracketright /asciicircum
/underscore /quoteleft /a /b /c
/d /e /f /g /h
/i /j /k /l /m
/n /o /p /q /r
/s /t /u /v /w
/x /y /z /braceleft /bar
/braceright /asciitilde /bullet /Euro /bullet
/quotesinglbase /florin /quotedblbase /ellipsis /dagger
/daggerdbl /circumflex /perthousand /Scaron /guilsinglleft
/OE /bullet /Zcaron /bullet /bullet
/quoteleft /quoteright /quotedblleft /quotedblright /bullet
/endash /emdash /asciitilde /trademark /scaron
/guilsinglright /oe /bullet /zcaron /Ydieresis
/space /exclamdown /cent /sterling /currency
/yen /brokenbar /section /dieresis /copyright
/ordfeminine /guillemotleft /logicalnot /sfthyphen /registered
/macron /degree /plusminus /twosuperior /threesuperior
/acute /mu /paragraph /middot /cedilla
/onesuperior /ordmasculine /guillemotright /onequarter /onehalf
/threequarters /questiondown /Agrave /Aacute /Acircumflex
/Atilde /Adieresis /Aring /AE /Ccedilla
/Egrave /Eacute /Ecircumflex /Edieresis /Igrave
/Iacute /Icircumflex /Idieresis /Eth /Ntilde
/Ograve /Oacute /Ocircumflex /Otilde /Odieresis
/multiply /Oslash /Ugrave /Uacute /Ucircumflex
/Udieresis /Yacute /Thorn /germandbls /agrave
/aacute /acircumflex /atilde /adieresis /aring
/ae /ccedilla /egrave /eacute /ecircumflex
/edieresis /igrave /iacute /icircumflex /idieresis
/eth /ntilde /ograve /oacute /ocircumflex
/otilde /odieresis /divide /oslash /ugrave
/uacute /ucircumflex /udieresis /yacute /thorn
/ydieresis
] def
%%EndResource
%FOPBeginFontReencode
/Courier-Oblique findfont
dup length dict begin
  {1 index /FID ne {def} {pop pop} ifelse} forall
  /Encoding WinAnsiEncoding def
  currentdict
end
/Courier-Oblique exch definefont pop
/Courier-BoldOblique findfont
dup length dict begin
  {1 index /FID ne {def} {pop pop} ifelse} forall
  /Encoding WinAnsiEncoding def
  currentdict
end
/Courier-BoldOblique exch definefont pop
/Courier-Bold findfont
dup length dict begin
  {1 index /FID ne {def} {pop pop} ifelse} forall
  /Encoding WinAnsiEncoding def
  currentdict
end
/Courier-Bold exch definefont pop
/Helvetica findfont
dup length dict begin
  {1 index /FID ne {def} {pop pop} ifelse} forall
  /Encoding WinAnsiEncoding def
  currentdict
end
/Helvetica exch definefont pop
/Helvetica-Oblique findfont
dup length dict begin
  {1 index /FID ne {def} {pop pop} ifelse} forall
  /Encoding WinAnsiEncoding def
  currentdict
end
/Helvetica-Oblique exch definefont pop
/Helvetica-Bold findfont
dup length dict begin
  {1 index /FID ne {def} {pop pop} ifelse} forall
  /Encoding WinAnsiEncoding def
  currentdict
end
/Helvetica-Bold exch definefont pop
/Helvetica-BoldOblique findfont
dup length dict begin
  {1 index /FID ne {def} {pop pop} ifelse} forall
  /Encoding WinAnsiEncoding def
  currentdict
end
/Helvetica-BoldOblique exch definefont pop
/Times-Roman findfont
dup length dict begin
  {1 index /FID ne {def} {pop pop} ifelse} forall
  /Encoding WinAnsiEncoding def
  currentdict
end
/Times-Roman exch definefont pop
/Times-Italic findfont
dup length dict begin
  {1 index /FID ne {def} {pop pop} ifelse} forall
  /Encoding WinAnsiEncoding def
  currentdict
end
/Times-Italic exch definefont pop
/Times-Bold findfont
dup length dict begin
  {1 index /FID ne {def} {pop pop} ifelse} forall
  /Encoding WinAnsiEncoding def
  currentdict
end
/Times-Bold exch definefont pop
/Times-BoldItalic findfont
dup length dict begin
  {1 index /FID ne {def} {pop pop} ifelse} forall
  /Encoding WinAnsiEncoding def
  currentdict
end
/Times-BoldItalic exch definefont pop
/Courier findfont
dup length dict begin
  {1 index /FID ne {def} {pop pop} ifelse} forall
  /Encoding WinAnsiEncoding def
  currentdict
end
/Courier exch definefont pop
%FOPEndFontReencode
%%EndProlog
%%Page: 1 1
%%PageBoundingBox: 0 0 1280 864
%%BeginPageSetup
[1 0 0 -1 0 864] CT
%%EndPageSetup
GS
1 GC
N
0 0 1280 864 re
f
GR
GS
1 GC
N
0 0 1280 864 re
f
GR
GS
1 GC
N
166.5 358.5 M
595 358.5 L
595 72.5 L
166.5 72.5 L
cp
f
GR
GS
0.149 GC
2 setlinecap
1 LJ
0.5 LW
N
166.5 358.5 M
595 358.5 L
S
GR
GS
0.149 GC
2 setlinecap
1 LJ
0.5 LW
N
166.5 358.5 M
166.5 354.215 L
S
GR
GS
0.149 GC
2 setlinecap
1 LJ
0.5 LW
N
246.481 358.5 M
246.481 354.215 L
S
GR
GS
0.149 GC
2 setlinecap
1 LJ
0.5 LW
N
326.461 358.5 M
326.461 354.215 L
S
GR
GS
0.149 GC
2 setlinecap
1 LJ
0.5 LW
N
406.442 358.5 M
406.442 354.215 L
S
GR
GS
0.149 GC
2 setlinecap
1 LJ
0.5 LW
N
478.975 358.5 M
478.975 354.215 L
S
GR
GS
0.149 GC
2 setlinecap
1 LJ
0.5 LW
N
558.956 358.5 M
558.956 354.215 L
S
GR
GS
0.149 GC
2 setlinecap
1 LJ
0.5 LW
N
166.5 358.5 M
166.5 356.358 L
S
GR
GS
0.149 GC
2 setlinecap
1 LJ
0.5 LW
N
246.481 358.5 M
246.481 356.358 L
S
GR
GS
0.149 GC
2 setlinecap
1 LJ
0.5 LW
N
293.266 358.5 M
293.266 356.358 L
S
GR
GS
0.149 GC
2 setlinecap
1 LJ
0.5 LW
N
326.461 358.5 M
326.461 356.358 L
S
GR
GS
0.149 GC
2 setlinecap
1 LJ
0.5 LW
N
352.209 358.5 M
352.209 356.358 L
S
GR
GS
0.149 GC
2 setlinecap
1 LJ
0.5 LW
N
373.247 358.5 M
373.247 356.358 L
S
GR
GS
0.149 GC
2 setlinecap
1 LJ
0.5 LW
N
391.034 358.5 M
391.034 356.358 L
S
GR
GS
0.149 GC
2 setlinecap
1 LJ
0.5 LW
N
406.442 358.5 M
406.442 356.358 L
S
GR
GS
0.149 GC
2 setlinecap
1 LJ
0.5 LW
N
420.032 358.5 M
420.032 356.358 L
S
GR
GS
0.149 GC
2 setlinecap
1 LJ
0.5 LW
N
432.19 358.5 M
432.19 356.358 L
S
GR
GS
0.149 GC
2 setlinecap
1 LJ
0.5 LW
N
512.17 358.5 M
512.17 356.358 L
S
GR
GS
0.149 GC
2 setlinecap
1 LJ
0.5 LW
N
558.956 358.5 M
558.956 356.358 L
S
GR
GS
0.149 GC
2 setlinecap
1 LJ
0.5 LW
N
592.151 358.5 M
592.151 356.358 L
S
GR
GS
[1 0 0 1 133 382] CT
0.149 GC
/Helvetica 18 F
GS
[1 0 0 1 0 0] CT
0 0 moveto 
1 -1 scale
(250 Hz) t 
GR
GR
GS
[1 0 0 1 133 407] CT
0.149 GC
/Helvetica 18 F
GS
[1 0 0 1 0 0] CT
0 0 moveto 
1 -1 scale
(\(scale 1\)) t 
GR
GR
GS
[1 0 0 1 212 382] CT
0.149 GC
/Helvetica 18 F
GS
[1 0 0 1 0 0] CT
0 0 moveto 
1 -1 scale
(125 Hz) t 
GR
GR
GS
[1 0 0 1 212 407] CT
0.149 GC
/Helvetica 18 F
GS
[1 0 0 1 0 0] CT
0 0 moveto 
1 -1 scale
(\(scale 2\)) t 
GR
GR
GS
[1 0 0 1 292 382] CT
0.149 GC
/Helvetica 18 F
GS
[1 0 0 1 0 0] CT
0 0 moveto 
1 -1 scale
(63 Hz) t 
GR
GR
GS
[1 0 0 1 292 407] CT
0.149 GC
/Helvetica 18 F
GS
[1 0 0 1 0 0] CT
0 0 moveto 
1 -1 scale
(\(scale 4\)) t 
GR
GR
GS
[1 0 0 1 372 382] CT
0.149 GC
/Helvetica 18 F
GS
[1 0 0 1 0 0] CT
0 0 moveto 
1 -1 scale
(31 Hz) t 
GR
GR
GS
[1 0 0 1 372 407] CT
0.149 GC
/Helvetica 18 F
GS
[1 0 0 1 0 0] CT
0 0 moveto 
1 -1 scale
(\(scale 8\)) t 
GR
GR
GS
[1 0 0 1 440 382] CT
0.149 GC
/Helvetica 18 F
GS
[1 0 0 1 0 0] CT
0 0 moveto 
1 -1 scale
(17 Hz) t 
GR
GR
GS
[1 0 0 1 440 407] CT
0.149 GC
/Helvetica 18 F
GS
[1 0 0 1 0 0] CT
0 0 moveto 
1 -1 scale
(\(scale 15\)) t 
GR
GR
GS
[1 0 0 1 520 382] CT
0.149 GC
/Helvetica 18 F
GS
[1 0 0 1 0 0] CT
0 0 moveto 
1 -1 scale
(8 Hz) t 
GR
GR
GS
[1 0 0 1 520 407] CT
0.149 GC
/Helvetica 18 F
GS
[1 0 0 1 0 0] CT
0 0 moveto 
1 -1 scale
(\(scale 30\)) t 
GR
GR
GS
[1 0 0 1 380.75021 411.60001] CT
0.149 GC
/Helvetica 18 F
GS
[1 0 0 1 0 0] CT
-108.5 18 moveto 
1 -1 scale
(Time scale [Hz; log-scaled]) t 
GR
GR
GS
0.149 GC
2 setlinecap
1 LJ
0.5 LW
N
166.5 358.5 M
166.5 72.5 L
S
GR
GS
0.149 GC
2 setlinecap
1 LJ
0.5 LW
N
166.5 358.5 M
170.785 358.5 L
S
GR
GS
0.149 GC
2 setlinecap
1 LJ
0.5 LW
N
166.5 301.3 M
170.785 301.3 L
S
GR
GS
0.149 GC
2 setlinecap
1 LJ
0.5 LW
N
166.5 244.1 M
170.785 244.1 L
S
GR
GS
0.149 GC
2 setlinecap
1 LJ
0.5 LW
N
166.5 186.9 M
170.785 186.9 L
S
GR
GS
0.149 GC
2 setlinecap
1 LJ
0.5 LW
N
166.5 129.7 M
170.785 129.7 L
S
GR
GS
0.149 GC
2 setlinecap
1 LJ
0.5 LW
N
166.5 72.5 M
170.785 72.5 L
S
GR
GS
[1 0 0 1 160.89999 358.5] CT
0.149 GC
/Helvetica 18 F
GS
[1 0 0 1 0 0] CT
-11 7 moveto 
1 -1 scale
(4) t 
GR
GR
GS
[1 0 0 1 160.89999 301.29999] CT
0.149 GC
/Helvetica 18 F
GS
[1 0 0 1 0 0] CT
-11 7 moveto 
1 -1 scale
(5) t 
GR
GR
GS
[1 0 0 1 160.89999 244.09999] CT
0.149 GC
/Helvetica 18 F
GS
[1 0 0 1 0 0] CT
-11 7 moveto 
1 -1 scale
(6) t 
GR
GR
GS
[1 0 0 1 160.89999 186.89999] CT
0.149 GC
/Helvetica 18 F
GS
[1 0 0 1 0 0] CT
-11 7 moveto 
1 -1 scale
(7) t 
GR
GR
GS
[1 0 0 1 160.89999 129.7] CT
0.149 GC
/Helvetica 18 F
GS
[1 0 0 1 0 0] CT
-11 7 moveto 
1 -1 scale
(8) t 
GR
GR
GS
[1 0 0 1 160.89999 72.5] CT
0.149 GC
/Helvetica 18 F
GS
[1 0 0 1 0 0] CT
-11 7 moveto 
1 -1 scale
(9) t 
GR
GR
GS
[0 -1 1 0 147.39999 215.49986] CT
0.149 GC
/Helvetica 18 F
GS
[1 0 0 1 0 0] CT
-97.5 -4 moveto 
1 -1 scale
(Similarity bound \(r x SD\)) t 
GR
GR
GS
[1 0 0 1 167 69] CT
0.149 GC
N
2.641 -0.516 M
2.641 -0.656 2.734 -0.781 QT
6.484 -4.5 L
2.734 -8.25 L
2.641 -8.328 2.641 -8.484 QT
2.641 -8.609 2.75 -8.727 QT
2.859 -8.844 3 -8.844 QT
3.125 -8.844 3.281 -8.734 QT
7 -5 L
10.719 -8.734 L
10.859 -8.844 10.984 -8.844 QT
11.125 -8.844 11.234 -8.734 QT
11.344 -8.625 11.344 -8.484 QT
11.344 -8.328 11.25 -8.25 QT
7.5 -4.5 L
11.25 -0.781 L
11.344 -0.656 11.344 -0.516 QT
11.344 -0.375 11.234 -0.266 QT
11.125 -0.156 10.984 -0.156 QT
10.844 -0.156 10.719 -0.297 QT
7 -4 L
3.281 -0.297 L
3.141 -0.156 3 -0.156 QT
2.859 -0.156 2.75 -0.273 QT
2.641 -0.391 2.641 -0.516 QT
cp
f
GR
GS
[1 0 0 1 181 69] CT
0.149 GC
/Helvetica 18 F
GS
[1 0 0 1 0 0] CT
0 0 moveto 
1 -1 scale
(10) t 
GR
GR
GS
[1 0 0 1 202 60] CT
0.149 GC
/Helvetica 14.4 F
GS
[1 0 0 1 0 0] CT
0 0 moveto 
1 -1 scale
(-4) t 
GR
GR
GS
[1 0 0 1 380.75037 70.25001] CT
/Helvetica-Bold 18 F
GS
[1 0 0 1 0 0] CT
-205.5 -26 moveto 
1 -1 scale
(Discrepancy between global and local bounds...) t 
GR
GR
GS
[1 0 0 1 380.75037 70.25001] CT
/Helvetica-Bold 18 F
GS
[1 0 0 1 0 0] CT
-3 -4 moveto 
1 -1 scale
() t 
GR
GR
GS
1 0 0 RC
[5 5] 0 setdash
2 LJ
5 LW
N
166.5 111.302 M
246.481 111.302 L
293.266 111.302 L
326.461 111.302 L
352.209 111.302 L
373.247 111.302 L
391.034 111.302 L
406.442 111.302 L
420.032 111.302 L
432.19 111.302 L
443.187 111.302 L
453.227 111.302 L
462.463 111.302 L
471.014 111.302 L
478.975 111.302 L
486.422 111.302 L
493.418 111.302 L
500.013 111.302 L
506.252 111.302 L
512.17 111.302 L
517.8 111.302 L
523.168 111.302 L
528.297 111.302 L
533.208 111.302 L
537.918 111.302 L
542.444 111.302 L
546.799 111.302 L
550.995 111.302 L
555.044 111.302 L
558.956 111.302 L
562.739 111.302 L
566.403 111.302 L
569.953 111.302 L
573.398 111.302 L
576.743 111.302 L
579.993 111.302 L
583.155 111.302 L
586.232 111.302 L
589.229 111.302 L
592.151 111.302 L
595 111.302 L
595.051 111.302 L
S
GR
GS
1 0 0 RC
1 LJ
5 LW
N
166.5 111.305 M
246.481 119.823 L
293.266 130.873 L
326.461 141.56 L
352.209 150.531 L
373.247 157.976 L
391.034 164.048 L
406.442 169.547 L
420.032 174.539 L
432.19 179.026 L
443.187 183.455 L
453.227 187.485 L
462.463 191.224 L
471.014 194.834 L
478.975 198.375 L
486.422 201.76 L
493.418 204.855 L
500.013 208.102 L
506.252 211.048 L
512.17 214.041 L
517.8 216.692 L
523.168 219.63 L
528.297 221.943 L
533.208 224.581 L
537.918 226.782 L
542.444 229.612 L
546.799 231.797 L
550.995 234.136 L
555.044 235.827 L
558.956 238.01 L
562.739 240.125 L
566.403 241.981 L
569.953 244.048 L
573.398 245.704 L
576.743 247.294 L
579.993 248.893 L
583.155 250.333 L
586.232 251.767 L
589.229 253.193 L
592.151 254.584 L
595 255.814 L
595.051 255.837 L
S
GR
GS
[5 5] 0 setdash
2 LJ
5 LW
N
166.5 106.521 M
246.481 106.521 L
293.266 106.521 L
326.461 106.521 L
352.209 106.521 L
373.247 106.521 L
391.034 106.521 L
406.442 106.521 L
420.032 106.521 L
432.19 106.521 L
443.187 106.521 L
453.227 106.521 L
462.463 106.521 L
471.014 106.521 L
478.975 106.521 L
486.422 106.521 L
493.418 106.521 L
500.013 106.521 L
506.252 106.521 L
512.17 106.521 L
517.8 106.521 L
523.168 106.521 L
528.297 106.521 L
533.208 106.521 L
537.918 106.521 L
542.444 106.521 L
546.799 106.521 L
550.995 106.521 L
555.044 106.521 L
558.956 106.521 L
562.739 106.521 L
566.403 106.521 L
569.953 106.521 L
573.398 106.521 L
576.743 106.521 L
579.993 106.521 L
583.155 106.521 L
586.232 106.521 L
589.229 106.521 L
592.151 106.521 L
595 106.521 L
595.051 106.521 L
S
GR
GS
1 LJ
5 LW
N
166.5 106.524 M
246.481 124.337 L
293.266 147.561 L
326.461 169.891 L
352.209 188.529 L
373.247 203.081 L
391.034 214.611 L
406.442 224.363 L
420.032 233.042 L
432.19 240.483 L
443.187 247.366 L
453.227 253.445 L
462.463 258.764 L
471.014 263.77 L
478.975 268.387 L
486.422 272.494 L
493.418 276.228 L
500.013 279.908 L
506.252 282.97 L
512.17 286.129 L
517.8 288.507 L
523.168 291.589 L
528.297 293.228 L
533.208 295.68 L
537.918 297.227 L
542.444 299.683 L
546.799 301.375 L
550.995 303.022 L
555.044 303.777 L
558.956 305.573 L
562.739 307.374 L
566.403 308.21 L
569.953 310.048 L
573.398 310.9 L
576.743 311.855 L
579.993 312.79 L
583.155 313.664 L
586.232 314.652 L
589.229 315.574 L
592.151 316.597 L
595 317.561 L
595.051 317.579 L
S
GR
GS
[1 0 0 1 211.5 271.75] CT
/Helvetica 18 F
GS
[1 0 0 1 0 0] CT
0 7 moveto 
1 -1 scale
(YA: global similarity bound) t 
GR
GR
GS
1 0 0 RC
[5 5] 0 setdash
2 LJ
5 LW
N
178.5 271.75 M
208.5 271.75 L
S
GR
GS
[1 0 0 1 211.5 293.75] CT
/Helvetica 18 F
GS
[1 0 0 1 0 0] CT
0 7 moveto 
1 -1 scale
(YA: scale-wise similarity bound) t 
GR
GR
GS
1 0 0 RC
1 LJ
5 LW
N
178.5 293.75 M
208.5 293.75 L
S
GR
GS
[1 0 0 1 211.5 315.75] CT
/Helvetica 18 F
GS
[1 0 0 1 0 0] CT
0 7 moveto 
1 -1 scale
(OA: global similarity bound) t 
GR
GR
GS
[5 5] 0 setdash
2 LJ
5 LW
N
178.5 315.75 M
208.5 315.75 L
S
GR
GS
[1 0 0 1 211.5 337.75] CT
/Helvetica 18 F
GS
[1 0 0 1 0 0] CT
0 7 moveto 
1 -1 scale
(OA: scale-wise similarity bound) t 
GR
GR
GS
1 LJ
5 LW
N
178.5 337.75 M
208.5 337.75 L
S
GR
GS
1 GC
N
730 358.5 M
1158.5 358.5 L
1158.5 72.5 L
730 72.5 L
cp
f
GR
GS
0.149 GC
2 setlinecap
1 LJ
0.5 LW
N
1158.5 358.5 M
730 358.5 L
S
GR
GS
0.149 GC
2 setlinecap
1 LJ
0.5 LW
N
1135.958 358.5 M
1135.958 354.215 L
S
GR
GS
0.149 GC
2 setlinecap
1 LJ
0.5 LW
N
1072.8 358.5 M
1072.8 354.215 L
S
GR
GS
0.149 GC
2 setlinecap
1 LJ
0.5 LW
N
1009.025 358.5 M
1009.025 354.215 L
S
GR
GS
0.149 GC
2 setlinecap
1 LJ
0.5 LW
N
944.4 358.5 M
944.4 354.215 L
S
GR
GS
0.149 GC
2 setlinecap
1 LJ
0.5 LW
N
880.153 358.5 M
880.153 354.215 L
S
GR
GS
0.149 GC
2 setlinecap
1 LJ
0.5 LW
N
815.7 358.5 M
815.7 354.215 L
S
GR
GS
0.149 GC
2 setlinecap
1 LJ
0.5 LW
N
751.465 358.5 M
751.465 354.215 L
S
GR
GS
0.149 GC
2 setlinecap
1 LJ
0.5 LW
N
1158.5 358.5 M
1158.5 356.358 L
S
GR
GS
0.149 GC
2 setlinecap
1 LJ
0.5 LW
N
1108.369 358.5 M
1108.369 356.358 L
S
GR
GS
0.149 GC
2 setlinecap
1 LJ
0.5 LW
N
1072.8 358.5 M
1072.8 356.358 L
S
GR
GS
0.149 GC
2 setlinecap
1 LJ
0.5 LW
N
1045.211 358.5 M
1045.211 356.358 L
S
GR
GS
0.149 GC
2 setlinecap
1 LJ
0.5 LW
N
1022.669 358.5 M
1022.669 356.358 L
S
GR
GS
0.149 GC
2 setlinecap
1 LJ
0.5 LW
N
1003.61 358.5 M
1003.61 356.358 L
S
GR
GS
0.149 GC
2 setlinecap
1 LJ
0.5 LW
N
987.1 358.5 M
987.1 356.358 L
S
GR
GS
0.149 GC
2 setlinecap
1 LJ
0.5 LW
N
972.537 358.5 M
972.537 356.358 L
S
GR
GS
0.149 GC
2 setlinecap
1 LJ
0.5 LW
N
959.511 358.5 M
959.511 356.358 L
S
GR
GS
0.149 GC
2 setlinecap
1 LJ
0.5 LW
N
873.811 358.5 M
873.811 356.358 L
S
GR
GS
0.149 GC
2 setlinecap
1 LJ
0.5 LW
N
823.68 358.5 M
823.68 356.358 L
S
GR
GS
0.149 GC
2 setlinecap
1 LJ
0.5 LW
N
788.111 358.5 M
788.111 356.358 L
S
GR
GS
0.149 GC
2 setlinecap
1 LJ
0.5 LW
N
760.522 358.5 M
760.522 356.358 L
S
GR
GS
0.149 GC
2 setlinecap
1 LJ
0.5 LW
N
737.979 358.5 M
737.979 356.358 L
S
GR
GS
[1 0 0 1 1135.95801 364.10001] CT
0.149 GC
/Helvetica 18 F
GS
[1 0 0 1 0 0] CT
-13 18 moveto 
1 -1 scale
(2.4) t 
GR
GR
GS
[1 0 0 1 1072.80005 364.10001] CT
0.149 GC
/Helvetica 18 F
GS
[1 0 0 1 0 0] CT
-5.5 18 moveto 
1 -1 scale
(4) t 
GR
GR
GS
[1 0 0 1 1009.02539 364.10001] CT
0.149 GC
/Helvetica 18 F
GS
[1 0 0 1 0 0] CT
-13 18 moveto 
1 -1 scale
(6.7) t 
GR
GR
GS
[1 0 0 1 944.3999 364.10001] CT
0.149 GC
/Helvetica 18 F
GS
[1 0 0 1 0 0] CT
-18 18 moveto 
1 -1 scale
(11.3) t 
GR
GR
GS
[1 0 0 1 880.15259 364.10001] CT
0.149 GC
/Helvetica 18 F
GS
[1 0 0 1 0 0] CT
-10.5 18 moveto 
1 -1 scale
(19) t 
GR
GR
GS
[1 0 0 1 815.70001 364.10001] CT
0.149 GC
/Helvetica 18 F
GS
[1 0 0 1 0 0] CT
-10.5 18 moveto 
1 -1 scale
(32) t 
GR
GR
GS
[1 0 0 1 751.4649 364.10001] CT
0.149 GC
/Helvetica 18 F
GS
[1 0 0 1 0 0] CT
-18 18 moveto 
1 -1 scale
(53.8) t 
GR
GR
GS
[1 0 0 1 944.25018 386.60001] CT
0.149 GC
/Helvetica 18 F
GS
[1 0 0 1 0 0] CT
-108 18 moveto 
1 -1 scale
(Frequency \(Hz; log-scaled\)) t 
GR
GR
GS
0.149 GC
2 setlinecap
1 LJ
0.5 LW
N
730 358.5 M
730 72.5 L
S
GR
GS
0.149 GC
2 setlinecap
1 LJ
0.5 LW
N
730 358.5 M
734.285 358.5 L
S
GR
GS
0.149 GC
2 setlinecap
1 LJ
0.5 LW
N
730 263.167 M
734.285 263.167 L
S
GR
GS
0.149 GC
2 setlinecap
1 LJ
0.5 LW
N
730 167.833 M
734.285 167.833 L
S
GR
GS
0.149 GC
2 setlinecap
1 LJ
0.5 LW
N
730 72.5 M
734.285 72.5 L
S
GR
GS
[1 0 0 1 724.40002 358.5] CT
0.149 GC
/Helvetica 18 F
GS
[1 0 0 1 0 0] CT
-33 7 moveto 
1 -1 scale
(-9.5) t 
GR
GR
GS
[1 0 0 1 724.40002 263.16666] CT
0.149 GC
/Helvetica 18 F
GS
[1 0 0 1 0 0] CT
-18 7 moveto 
1 -1 scale
(-9) t 
GR
GR
GS
[1 0 0 1 724.40002 167.83333] CT
0.149 GC
/Helvetica 18 F
GS
[1 0 0 1 0 0] CT
-33 7 moveto 
1 -1 scale
(-8.5) t 
GR
GR
GS
[1 0 0 1 724.40002 72.5] CT
0.149 GC
/Helvetica 18 F
GS
[1 0 0 1 0 0] CT
-18 7 moveto 
1 -1 scale
(-8) t 
GR
GR
GS
[0 -1 1 0 688.90002 215.49986] CT
0.149 GC
/Helvetica 18 F
GS
[1 0 0 1 0 0] CT
-55.5 -4 moveto 
1 -1 scale
(Power \(log10\)) t 
GR
GR
GS
[1 0 0 1 944.25092 70.25001] CT
/Helvetica-Bold 18 F
GS
[1 0 0 1 0 0] CT
-108.5 -26 moveto 
1 -1 scale
(... reflects spectral shape) t 
GR
GR
GS
[1 0 0 1 944.25092 70.25001] CT
/Helvetica-Bold 18 F
GS
[1 0 0 1 0 0] CT
-3 -4 moveto 
1 -1 scale
() t 
GR
GR
GS
1 0 0 RC
1 LJ
5 LW
N
1158.5 87.607 M
1146.716 98.03 L
1135.958 108.852 L
1126.062 119.293 L
1116.899 128.344 L
1104.315 137.726 L
1092.894 144.494 L
1082.439 151.928 L
1072.8 158.717 L
1061.016 165.461 L
1050.258 170.02 L
1040.362 172.805 L
1029.011 176.003 L
1018.615 179.014 L
1009.025 180.389 L
998.421 178.007 L
987.1 169.775 L
976.729 151.557 L
965.853 134.447 L
954.662 132.245 L
944.4 156.141 L
933.916 189.477 L
922.406 218.623 L
911.877 227.651 L
901.4 231.003 L
891.029 228.214 L
880.153 227.686 L
869.557 233.122 L
858.7 247.284 L
847.714 266.278 L
837.165 281.097 L
826.599 290.998 L
815.7 300.534 L
804.974 309.595 L
794.128 316.589 L
783.559 322.598 L
772.727 329.442 L
762.014 334.632 L
751.465 340.633 L
740.688 347.041 L
730 353.421 L
S
GR
GS
1 LJ
5 LW
N
1158.5 117.65 M
1146.716 128.201 L
1135.958 139.625 L
1126.062 150.435 L
1116.899 159.082 L
1104.315 169.877 L
1092.894 179.497 L
1082.439 187.562 L
1072.8 194.58 L
1061.016 202.784 L
1050.258 208.357 L
1040.362 213.084 L
1029.011 217.411 L
1018.615 218.393 L
1009.025 217.418 L
998.421 209.268 L
987.1 197.609 L
976.729 189.508 L
965.853 184.576 L
954.662 190.757 L
944.4 198.613 L
933.916 204.775 L
922.406 206.439 L
911.877 202.649 L
901.4 200.523 L
891.029 199.668 L
880.153 203.143 L
869.557 210.443 L
858.7 218.715 L
847.714 230.286 L
837.165 241.981 L
826.599 254.681 L
815.7 263.762 L
804.974 270.619 L
794.128 272.94 L
783.559 274.924 L
772.727 278.281 L
762.014 283.574 L
751.465 289.49 L
740.688 293.296 L
730 299.911 L
S
GR
GS
1 0 0 RC
[5 5] 0 setdash
2 LJ
5 LW
N
1158.5 212.116 M
1146.716 212.116 L
1135.958 212.116 L
1126.062 212.116 L
1116.899 212.116 L
1104.315 212.116 L
1092.894 212.116 L
1082.439 212.116 L
1072.8 212.116 L
1061.016 212.116 L
1050.258 212.116 L
1040.362 212.116 L
1029.011 212.116 L
1018.615 212.116 L
1009.025 212.116 L
998.421 212.116 L
987.1 212.116 L
976.729 212.116 L
965.853 212.116 L
954.662 212.116 L
944.4 212.116 L
933.916 212.116 L
922.406 212.116 L
911.877 212.116 L
901.4 212.116 L
891.029 212.116 L
880.153 212.116 L
869.557 212.116 L
858.7 212.116 L
847.714 212.116 L
837.165 212.116 L
826.599 212.116 L
815.7 212.116 L
804.974 212.116 L
794.128 212.116 L
783.559 212.116 L
772.727 212.116 L
762.014 212.116 L
751.465 212.116 L
740.688 212.116 L
730 212.116 L
S
GR
GS
[5 5] 0 setdash
2 LJ
5 LW
N
1158.5 214.01 M
1146.716 214.01 L
1135.958 214.01 L
1126.062 214.01 L
1116.899 214.01 L
1104.315 214.01 L
1092.894 214.01 L
1082.439 214.01 L
1072.8 214.01 L
1061.016 214.01 L
1050.258 214.01 L
1040.362 214.01 L
1029.011 214.01 L
1018.615 214.01 L
1009.025 214.01 L
998.421 214.01 L
987.1 214.01 L
976.729 214.01 L
965.853 214.01 L
954.662 214.01 L
944.4 214.01 L
933.916 214.01 L
922.406 214.01 L
911.877 214.01 L
901.4 214.01 L
891.029 214.01 L
880.153 214.01 L
869.557 214.01 L
858.7 214.01 L
847.714 214.01 L
837.165 214.01 L
826.599 214.01 L
815.7 214.01 L
804.974 214.01 L
794.128 214.01 L
783.559 214.01 L
772.727 214.01 L
762.014 214.01 L
751.465 214.01 L
740.688 214.01 L
730 214.01 L
S
GR
GS
[1 0 0 1 906.5 271.75] CT
/Helvetica 18 F
GS
[1 0 0 1 0 0] CT
0 7 moveto 
1 -1 scale
(YA: mean power) t 
GR
GR
GS
1 0 0 RC
[5 5] 0 setdash
2 LJ
5 LW
N
873.5 271.75 M
903.5 271.75 L
S
GR
GS
[1 0 0 1 906.5 293.75] CT
/Helvetica 18 F
GS
[1 0 0 1 0 0] CT
0 7 moveto 
1 -1 scale
(YA: frequency-specific power) t 
GR
GR
GS
1 0 0 RC
1 LJ
5 LW
N
873.5 293.75 M
903.5 293.75 L
S
GR
GS
[1 0 0 1 906.5 315.75] CT
/Helvetica 18 F
GS
[1 0 0 1 0 0] CT
0 7 moveto 
1 -1 scale
(OA: mean power) t 
GR
GR
GS
[5 5] 0 setdash
2 LJ
5 LW
N
873.5 315.75 M
903.5 315.75 L
S
GR
GS
[1 0 0 1 906.5 337.75] CT
/Helvetica 18 F
GS
[1 0 0 1 0 0] CT
0 7 moveto 
1 -1 scale
(OA: frequency-specific power) t 
GR
GR
GS
1 LJ
5 LW
N
873.5 337.75 M
903.5 337.75 L
S
GR
GS
1 GC
N
166.5 768 M
595 768 L
595 482 L
166.5 482 L
cp
f
GR
GS
0.149 GC
2 setlinecap
1 LJ
0.5 LW
N
166.5 768 M
595 768 L
S
GR
GS
0.149 GC
2 setlinecap
1 LJ
0.5 LW
N
195.067 768 M
195.067 763.715 L
S
GR
GS
0.149 GC
2 setlinecap
1 LJ
0.5 LW
N
252.2 768 M
252.2 763.715 L
S
GR
GS
0.149 GC
2 setlinecap
1 LJ
0.5 LW
N
309.333 768 M
309.333 763.715 L
S
GR
GS
0.149 GC
2 setlinecap
1 LJ
0.5 LW
N
366.467 768 M
366.467 763.715 L
S
GR
GS
0.149 GC
2 setlinecap
1 LJ
0.5 LW
N
423.6 768 M
423.6 763.715 L
S
GR
GS
0.149 GC
2 setlinecap
1 LJ
0.5 LW
N
480.733 768 M
480.733 763.715 L
S
GR
GS
0.149 GC
2 setlinecap
1 LJ
0.5 LW
N
537.867 768 M
537.867 763.715 L
S
GR
GS
0.149 GC
2 setlinecap
1 LJ
0.5 LW
N
595 768 M
595 763.715 L
S
GR
GS
[1 0 0 1 195.06668 773.59998] CT
0.149 GC
/Helvetica 18 F
GS
[1 0 0 1 0 0] CT
-13 18 moveto 
1 -1 scale
(0.3) t 
GR
GR
GS
[1 0 0 1 252.2 773.59998] CT
0.149 GC
/Helvetica 18 F
GS
[1 0 0 1 0 0] CT
-13 18 moveto 
1 -1 scale
(0.4) t 
GR
GR
GS
[1 0 0 1 309.33334 773.59998] CT
0.149 GC
/Helvetica 18 F
GS
[1 0 0 1 0 0] CT
-13 18 moveto 
1 -1 scale
(0.5) t 
GR
GR
GS
[1 0 0 1 366.46667 773.59998] CT
0.149 GC
/Helvetica 18 F
GS
[1 0 0 1 0 0] CT
-13 18 moveto 
1 -1 scale
(0.6) t 
GR
GR
GS
[1 0 0 1 423.60001 773.59998] CT
0.149 GC
/Helvetica 18 F
GS
[1 0 0 1 0 0] CT
-13 18 moveto 
1 -1 scale
(0.7) t 
GR
GR
GS
[1 0 0 1 480.73334 773.59998] CT
0.149 GC
/Helvetica 18 F
GS
[1 0 0 1 0 0] CT
-13 18 moveto 
1 -1 scale
(0.8) t 
GR
GR
GS
[1 0 0 1 537.86664 773.59998] CT
0.149 GC
/Helvetica 18 F
GS
[1 0 0 1 0 0] CT
-13 18 moveto 
1 -1 scale
(0.9) t 
GR
GR
GS
[1 0 0 1 595 773.59998] CT
0.149 GC
/Helvetica 18 F
GS
[1 0 0 1 0 0] CT
-5.5 18 moveto 
1 -1 scale
(1) t 
GR
GR
GS
[1 0 0 1 380.75021 796.09998] CT
0.149 GC
/Helvetica 18 F
GS
[1 0 0 1 0 0] CT
-214 18 moveto 
1 -1 scale
(Ratio of similarity bounds: Rescaled vs. global bound) t 
GR
GR
GS
0.149 GC
2 setlinecap
1 LJ
0.5 LW
N
166.5 768 M
166.5 482 L
S
GR
GS
0.149 GC
2 setlinecap
1 LJ
0.5 LW
N
166.5 768 M
170.785 768 L
S
GR
GS
0.149 GC
2 setlinecap
1 LJ
0.5 LW
N
166.5 704.444 M
170.785 704.444 L
S
GR
GS
0.149 GC
2 setlinecap
1 LJ
0.5 LW
N
166.5 640.889 M
170.785 640.889 L
S
GR
GS
0.149 GC
2 setlinecap
1 LJ
0.5 LW
N
166.5 577.333 M
170.785 577.333 L
S
GR
GS
0.149 GC
2 setlinecap
1 LJ
0.5 LW
N
166.5 513.778 M
170.785 513.778 L
S
GR
GS
[1 0 0 1 160.90001 768] CT
0.149 GC
/Helvetica 18 F
GS
[1 0 0 1 0 0] CT
-11 7 moveto 
1 -1 scale
(0) t 
GR
GR
GS
[1 0 0 1 160.90001 704.44446] CT
0.149 GC
/Helvetica 18 F
GS
[1 0 0 1 0 0] CT
-26 7 moveto 
1 -1 scale
(0.2) t 
GR
GR
GS
[1 0 0 1 160.90001 640.88892] CT
0.149 GC
/Helvetica 18 F
GS
[1 0 0 1 0 0] CT
-26 7 moveto 
1 -1 scale
(0.4) t 
GR
GR
GS
[1 0 0 1 160.90001 577.33331] CT
0.149 GC
/Helvetica 18 F
GS
[1 0 0 1 0 0] CT
-26 7 moveto 
1 -1 scale
(0.6) t 
GR
GR
GS
[1 0 0 1 160.90001 513.77777] CT
0.149 GC
/Helvetica 18 F
GS
[1 0 0 1 0 0] CT
-26 7 moveto 
1 -1 scale
(0.8) t 
GR
GR
GS
[0 -1 1 0 132.39999 624.99988] CT
0.149 GC
/Helvetica 18 F
GS
[1 0 0 1 0 0] CT
-184 -4 moveto 
1 -1 scale
(Difference in MSE: Rescaled vs. global bound) t 
GR
GR
GS
[1 0 0 1 380.75037 479.75] CT
/Helvetica-Bold 18 F
GS
[1 0 0 1 0 0] CT
-129 -26 moveto 
1 -1 scale
(Liberality of similarity bounds ) t 
GR
GR
GS
[1 0 0 1 380.75037 479.75] CT
/Helvetica-Bold 18 F
GS
[1 0 0 1 0 0] CT
-166.5 -4 moveto 
1 -1 scale
(relates to coarse-scale \(<8 Hz\) entropy) t 
GR
GR
GS
[1 0 0 1 385.52231 653.08289] CT
1 0 0 RC
N
5 0 M
5 -2.761 2.761 -5 0 -5 C
-2.761 -5 -5 -2.761 -5 0 C
-5 2.761 -2.761 5 0 5 C
2.761 5 5 2.761 5 0 C
cp
f
GR
GS
[1 0 0 1 442.58502 690.10986] CT
1 0 0 RC
N
/f536683381{5 0 M
5 -2.761 2.761 -5 0 -5 C
-2.761 -5 -5 -2.761 -5 0 C
-5 2.761 -2.761 5 0 5 C
2.761 5 5 2.761 5 0 C
cp}def
f536683381
f
GR
GS
[1 0 0 1 411.39551 664.3667] CT
1 0 0 RC
N
f536683381
f
GR
GS
[1 0 0 1 460.73962 708.15179] CT
1 0 0 RC
N
f536683381
f
GR
GS
[1 0 0 1 461.05194 698.72906] CT
1 0 0 RC
N
f536683381
f
GR
GS
[1 0 0 1 554.33746 752.62177] CT
1 0 0 RC
N
f536683381
f
GR
GS
[1 0 0 1 334.2428 605.02783] CT
1 0 0 RC
N
f536683381
f
GR
GS
[1 0 0 1 404.83334 657.96448] CT
1 0 0 RC
N
f536683381
f
GR
GS
[1 0 0 1 362.66962 627.38458] CT
1 0 0 RC
N
f536683381
f
GR
GS
[1 0 0 1 479.69098 707.46216] CT
1 0 0 RC
N
f536683381
f
GR
GS
[1 0 0 1 483.19617 708.27985] CT
1 0 0 RC
N
f536683381
f
GR
GS
[1 0 0 1 385.57031 645.01453] CT
1 0 0 RC
N
f536683381
f
GR
GS
[1 0 0 1 562.8728 756.95624] CT
1 0 0 RC
N
f536683381
f
GR
GS
[1 0 0 1 408.93802 656.37885] CT
1 0 0 RC
N
f536683381
f
GR
GS
[1 0 0 1 469.41086 708.98248] CT
1 0 0 RC
N
f536683381
f
GR
GS
[1 0 0 1 487.23679 711.3717] CT
1 0 0 RC
N
f536683381
f
GR
GS
[1 0 0 1 475.72717 704.13062] CT
1 0 0 RC
N
f536683381
f
GR
GS
[1 0 0 1 487.63379 713.99976] CT
1 0 0 RC
N
f536683381
f
GR
GS
[1 0 0 1 510.46317 728.20801] CT
1 0 0 RC
N
f536683381
f
GR
GS
[1 0 0 1 498.92798 722.16058] CT
1 0 0 RC
N
f536683381
f
GR
GS
[1 0 0 1 468.21429 701.53705] CT
1 0 0 RC
N
f536683381
f
GR
GS
[1 0 0 1 450.53357 688.60315] CT
1 0 0 RC
N
f536683381
f
GR
GS
[1 0 0 1 397.14951 655.2005] CT
1 0 0 RC
N
f536683381
f
GR
GS
[1 0 0 1 304.80106 604.89001] CT
1 0 0 RC
N
f536683381
f
GR
GS
[1 0 0 1 419.07532 670.37506] CT
1 0 0 RC
N
f536683381
f
GR
GS
[1 0 0 1 437.60159 682.4198] CT
1 0 0 RC
N
f536683381
f
GR
GS
[1 0 0 1 559.70435 754.95221] CT
1 0 0 RC
N
f536683381
f
GR
GS
[1 0 0 1 553.97052 757.80859] CT
1 0 0 RC
N
f536683381
f
GR
GS
[1 0 0 1 314.56235 585.51434] CT
1 0 0 RC
N
f536683381
f
GR
GS
[1 0 0 1 395.8887 649.64185] CT
1 0 0 RC
N
f536683381
f
GR
GS
[1 0 0 1 464.33044 701.1814] CT
1 0 0 RC
N
f536683381
f
GR
GS
[1 0 0 1 380.93698 646.38245] CT
1 0 0 RC
N
f536683381
f
GR
GS
[1 0 0 1 320.25543 587.17572] CT
1 0 0 RC
N
f536683381
f
GR
GS
[1 0 0 1 409.54114 656.88202] CT
1 0 0 RC
N
f536683381
f
GR
GS
[1 0 0 1 399.2959 654.8866] CT
1 0 0 RC
N
f536683381
f
GR
GS
[1 0 0 1 466.60837 702.22668] CT
1 0 0 RC
N
f536683381
f
GR
GS
[1 0 0 1 368.50937 628.98737] CT
1 0 0 RC
N
f536683381
f
GR
GS
[1 0 0 1 378.92108 641.88892] CT
1 0 0 RC
N
f536683381
f
GR
GS
[1 0 0 1 450.49304 688.42499] CT
1 0 0 RC
N
f536683381
f
GR
GS
[1 0 0 1 403.08829 655.28809] CT
1 0 0 RC
N
f536683381
f
GR
GS
[1 0 0 1 325.65881 594.21515] CT
1 0 0 RC
N
f536683381
f
GR
GS
[1 0 0 1 411.67252 664.47406] CT
1 0 0 RC
N
f536683381
f
GR
GS
[1 0 0 1 421.36768 670.59125] CT
1 0 0 RC
N
f536683381
f
GR
GS
[1 0 0 1 384.63129 643.60278] CT
1 0 0 RC
N
f536683381
f
GR
GS
[1 0 0 1 383.21201 639.43738] CT
1 0 0 RC
N
f536683381
f
GR
GS
[1 0 0 1 334.81229 596.99091] CT
1 0 0 RC
N
f536683381
f
GR
GS
[1 0 0 1 342.72922 620.25238] CT
1 0 0 RC
N
f536683381
f
GR
GS
1 0 0 RC
1 LJ
3 LW
N
385.522 644.112 M
442.585 682.984 L
411.396 661.737 L
460.74 695.352 L
461.052 695.564 L
554.337 759.113 L
334.243 609.179 L
404.833 657.267 L
362.67 628.544 L
479.691 708.262 L
483.196 710.649 L
385.57 644.145 L
562.873 764.927 L
408.938 660.063 L
469.411 701.259 L
487.237 713.402 L
475.727 705.561 L
487.634 713.672 L
510.463 729.224 L
498.928 721.366 L
468.214 700.443 L
450.534 688.399 L
397.15 652.033 L
304.801 589.123 L
419.075 666.969 L
437.602 679.589 L
559.704 762.769 L
553.971 758.863 L
314.562 595.772 L
395.889 651.174 L
464.33 697.798 L
380.937 640.988 L
320.255 599.651 L
409.541 660.474 L
399.296 653.495 L
466.608 699.349 L
368.509 632.522 L
378.921 639.615 L
450.493 688.371 L
403.088 656.078 L
325.659 603.331 L
411.673 661.926 L
421.368 668.53 L
384.631 643.505 L
383.212 642.538 L
334.812 609.567 L
342.729 614.96 L
S
GR
GS
[1 0 0 1 299.20801 585.7749] CT
N
f536683381
f
GR
GS
[1 0 0 1 429.36935 698.242] CT
N
f536683381
f
GR
GS
[1 0 0 1 343.63281 614.80438] CT
N
f536683381
f
GR
GS
[1 0 0 1 326.74973 614.86371] CT
N
f536683381
f
GR
GS
[1 0 0 1 305.7403 589.72235] CT
N
f536683381
f
GR
GS
[1 0 0 1 322.4476 626.48578] CT
N
f536683381
f
GR
GS
[1 0 0 1 319.75125 604.224] CT
N
f536683381
f
GR
GS
[1 0 0 1 497.38162 722.03662] CT
N
f536683381
f
GR
GS
[1 0 0 1 260.10303 561.67059] CT
N
f536683381
f
GR
GS
[1 0 0 1 366.09766 630.52106] CT
N
f536683381
f
GR
GS
[1 0 0 1 392.26749 663.67664] CT
N
f536683381
f
GR
GS
[1 0 0 1 445.77896 688.99493] CT
N
f536683381
f
GR
GS
[1 0 0 1 442.43692 694.40601] CT
N
f536683381
f
GR
GS
[1 0 0 1 428.81683 680.91766] CT
N
f536683381
f
GR
GS
[1 0 0 1 264.06293 575.47101] CT
N
f536683381
f
GR
GS
[1 0 0 1 440.6264 689.03253] CT
N
f536683381
f
GR
GS
[1 0 0 1 525.88806 743.51392] CT
N
f536683381
f
GR
GS
[1 0 0 1 339.90741 610.79272] CT
N
f536683381
f
GR
GS
[1 0 0 1 482.91129 730.39789] CT
N
f536683381
f
GR
GS
[1 0 0 1 413.13165 693.82965] CT
N
f536683381
f
GR
GS
[1 0 0 1 482.41653 711.64471] CT
N
f536683381
f
GR
GS
[1 0 0 1 368.7132 635.58081] CT
N
f536683381
f
GR
GS
[1 0 0 1 330.9071 624.48846] CT
N
f536683381
f
GR
GS
[1 0 0 1 275.95901 556.68689] CT
N
f536683381
f
GR
GS
[1 0 0 1 309.92471 587.3147] CT
N
f536683381
f
GR
GS
[1 0 0 1 385.23743 647.20508] CT
N
f536683381
f
GR
GS
[1 0 0 1 366.51837 635.81757] CT
N
f536683381
f
GR
GS
[1 0 0 1 338.40128 615.88452] CT
N
f536683381
f
GR
GS
[1 0 0 1 271.93628 559.23853] CT
N
f536683381
f
GR
GS
[1 0 0 1 331.45697 609.97211] CT
N
f536683381
f
GR
GS
[1 0 0 1 235.77698 530.33789] CT
N
f536683381
f
GR
GS
[1 0 0 1 247.64996 535.83429] CT
N
f536683381
f
GR
GS
[1 0 0 1 191.09615 489.68042] CT
N
f536683381
f
GR
GS
[1 0 0 1 244.9492 532.23254] CT
N
f536683381
f
GR
GS
[1 0 0 1 204.56044 495.9053] CT
N
f536683381
f
GR
GS
[1 0 0 1 335.29236 613.06165] CT
N
f536683381
f
GR
GS
[1 0 0 1 255.13174 540.50873] CT
N
f536683381
f
GR
GS
[1 0 0 1 364.94003 636.65125] CT
N
f536683381
f
GR
GS
[1 0 0 1 530.55389 740.1015] CT
N
f536683381
f
GR
GS
[1 0 0 1 329.55887 609.87433] CT
N
f536683381
f
GR
GS
[1 0 0 1 455.52301 719.76886] CT
N
f536683381
f
GR
GS
[1 0 0 1 442.17444 692.57373] CT
N
f536683381
f
GR
GS
[1 0 0 1 329.35287 621.86047] CT
N
f536683381
f
GR
GS
[1 0 0 1 358.49976 636.01526] CT
N
f536683381
f
GR
GS
[1 0 0 1 537.15692 746.2774] CT
N
f536683381
f
GR
GS
[1 0 0 1 344.46512 633.96674] CT
N
f536683381
f
GR
GS
[1 0 0 1 231.97424 517.47778] CT
N
f536683381
f
GR
GS
[1 0 0 1 441.40955 689.30542] CT
N
f536683381
f
GR
GS
[1 0 0 1 485.64874 719.22839] CT
N
f536683381
f
GR
GS
[1 0 0 1 271.7175 568.89972] CT
N
f536683381
f
GR
GS
1 LJ
3 LW
N
299.208 583.009 M
429.369 682.923 L
343.633 617.11 L
326.75 604.15 L
305.74 588.023 L
322.448 600.848 L
319.751 598.778 L
497.382 735.131 L
260.103 552.991 L
366.098 634.354 L
392.267 654.443 L
445.779 695.52 L
442.437 692.954 L
428.817 682.499 L
264.063 556.03 L
440.626 691.564 L
525.888 757.013 L
339.907 614.25 L
482.911 724.023 L
413.132 670.459 L
482.417 723.643 L
368.713 636.362 L
330.907 607.341 L
275.959 565.162 L
309.925 591.235 L
385.237 649.047 L
366.518 634.677 L
338.401 613.094 L
271.936 562.074 L
331.457 607.763 L
178.517 490.364 L
235.777 534.318 L
247.65 543.431 L
191.096 500.02 L
244.949 541.358 L
204.56 510.355 L
335.292 610.708 L
255.132 549.175 L
364.94 633.466 L
530.554 760.595 L
329.559 606.307 L
173.655 486.631 L
455.523 702.999 L
442.174 692.753 L
329.353 606.148 L
358.5 628.522 L
537.157 765.663 L
344.465 617.749 L
231.974 531.398 L
441.41 692.165 L
485.649 726.124 L
271.717 561.906 L
S
GR
GS
[1 0 0 1 312 516] CT
/Helvetica 18 F
GS
[1 0 0 1 0 0] CT
0 0 moveto 
1 -1 scale
(Younger Adults: r=-0.99, p=3e) t 
GR
GR
GS
[1 0 0 1 557 507] CT
/Helvetica 14.4 F
GS
[1 0 0 1 0 0] CT
0 0 moveto 
1 -1 scale
(-) t 
GR
GR
GS
[1 0 0 1 563 516] CT
/Helvetica 18 F
GS
[1 0 0 1 0 0] CT
0 0 moveto 
1 -1 scale
(42) t 
GR
GR
GS
1 0 0 RC
1 LJ
3 LW
N
279 505.5 M
309 505.5 L
S
GR
GS
[1 0 0 1 312 543] CT
/Helvetica 18 F
GS
[1 0 0 1 0 0] CT
0 0 moveto 
1 -1 scale
(Older Adults: r=-0.99, p=8e) t 
GR
GR
GS
[1 0 0 1 533 534] CT
/Helvetica 14.4 F
GS
[1 0 0 1 0 0] CT
0 0 moveto 
1 -1 scale
(-) t 
GR
GR
GS
[1 0 0 1 539 543] CT
/Helvetica 18 F
GS
[1 0 0 1 0 0] CT
0 0 moveto 
1 -1 scale
(43) t 
GR
GR
GS
1 LJ
3 LW
N
279 533 M
309 533 L
S
GR
GS
1 GC
N
/f1879166820{730 768 M
1158.5 768 L
1158.5 482 L
730 482 L
cp}def
f1879166820
f
GR
GS
0.149 GC
2 setlinecap
1 LJ
0.5 LW
N
730 768 M
1158.5 768 L
S
GR
GS
0.149 GC
2 setlinecap
1 LJ
0.5 LW
N
730 768 M
730 763.715 L
S
GR
GS
0.149 GC
2 setlinecap
1 LJ
0.5 LW
N
837.125 768 M
837.125 763.715 L
S
GR
GS
0.149 GC
2 setlinecap
1 LJ
0.5 LW
N
944.25 768 M
944.25 763.715 L
S
GR
GS
0.149 GC
2 setlinecap
1 LJ
0.5 LW
N
1051.375 768 M
1051.375 763.715 L
S
GR
GS
0.149 GC
2 setlinecap
1 LJ
0.5 LW
N
1158.5 768 M
1158.5 763.715 L
S
GR
GS
[1 0 0 1 730 773.59998] CT
0.149 GC
/Helvetica 18 F
GS
[1 0 0 1 0 0] CT
-14 18 moveto 
1 -1 scale
(-10) t 
GR
GR
GS
[1 0 0 1 837.125 773.59998] CT
0.149 GC
/Helvetica 18 F
GS
[1 0 0 1 0 0] CT
-16.5 18 moveto 
1 -1 scale
(-9.5) t 
GR
GR
GS
[1 0 0 1 944.25 773.59998] CT
0.149 GC
/Helvetica 18 F
GS
[1 0 0 1 0 0] CT
-9 18 moveto 
1 -1 scale
(-9) t 
GR
GR
GS
[1 0 0 1 1051.375 773.59998] CT
0.149 GC
/Helvetica 18 F
GS
[1 0 0 1 0 0] CT
-16.5 18 moveto 
1 -1 scale
(-8.5) t 
GR
GR
GS
[1 0 0 1 1158.5 773.59998] CT
0.149 GC
/Helvetica 18 F
GS
[1 0 0 1 0 0] CT
-9 18 moveto 
1 -1 scale
(-8) t 
GR
GR
GS
[1 0 0 1 944.25018 796.09998] CT
0.149 GC
/Helvetica 18 F
GS
[1 0 0 1 0 0] CT
-94.5 18 moveto 
1 -1 scale
(Power 32-64 Hz \(log10\)) t 
GR
GR
GS
0.149 GC
2 setlinecap
1 LJ
0.5 LW
N
730 768 M
730 482 L
S
GR
GS
0.149 GC
2 setlinecap
1 LJ
0.5 LW
N
730 768 M
734.285 768 L
S
GR
GS
0.149 GC
2 setlinecap
1 LJ
0.5 LW
N
730 710.8 M
734.285 710.8 L
S
GR
GS
0.149 GC
2 setlinecap
1 LJ
0.5 LW
N
730 653.6 M
734.285 653.6 L
S
GR
GS
0.149 GC
2 setlinecap
1 LJ
0.5 LW
N
730 596.4 M
734.285 596.4 L
S
GR
GS
0.149 GC
2 setlinecap
1 LJ
0.5 LW
N
730 539.2 M
734.285 539.2 L
S
GR
GS
0.149 GC
2 setlinecap
1 LJ
0.5 LW
N
730 482 M
734.285 482 L
S
GR
GS
[1 0 0 1 724.40009 768] CT
0.149 GC
/Helvetica 18 F
GS
[1 0 0 1 0 0] CT
-11 7 moveto 
1 -1 scale
(0) t 
GR
GR
GS
[1 0 0 1 724.40009 710.79999] CT
0.149 GC
/Helvetica 18 F
GS
[1 0 0 1 0 0] CT
-26 7 moveto 
1 -1 scale
(0.2) t 
GR
GR
GS
[1 0 0 1 724.40009 653.59998] CT
0.149 GC
/Helvetica 18 F
GS
[1 0 0 1 0 0] CT
-26 7 moveto 
1 -1 scale
(0.4) t 
GR
GR
GS
[1 0 0 1 724.40009 596.39996] CT
0.149 GC
/Helvetica 18 F
GS
[1 0 0 1 0 0] CT
-26 7 moveto 
1 -1 scale
(0.6) t 
GR
GR
GS
[1 0 0 1 724.40009 539.20001] CT
0.149 GC
/Helvetica 18 F
GS
[1 0 0 1 0 0] CT
-26 7 moveto 
1 -1 scale
(0.8) t 
GR
GR
GS
[1 0 0 1 724.40009 482] CT
0.149 GC
/Helvetica 18 F
GS
[1 0 0 1 0 0] CT
-11 7 moveto 
1 -1 scale
(1) t 
GR
GR
GS
[0 -1 1 0 695.90002 624.99988] CT
0.149 GC
/Helvetica 18 F
GS
[1 0 0 1 0 0] CT
-126 -4 moveto 
1 -1 scale
("Original" coarse-scale entropy) t 
GR
GR
GS
[1 0 0 1 944.25079 479.75] CT
/Helvetica-Bold 18 F
GS
[1 0 0 1 0 0] CT
-217.5 -26 moveto 
1 -1 scale
(Interindividual differences in high frequency power) t 
GR
GR
GS
[1 0 0 1 944.25079 479.75] CT
/Helvetica-Bold 18 F
GS
[1 0 0 1 0 0] CT
-160.5 -4 moveto 
1 -1 scale
(relate to coarse-scale "Original" MSE) t 
GR
GR
GS
[1 0 0 1 913.48358 624.68701] CT
1 0 0 RC
N
f536683381
f
GR
GS
[1 0 0 1 893.83246 602.75159] CT
1 0 0 RC
N
f536683381
f
GR
GS
[1 0 0 1 809.1123 588.82874] CT
1 0 0 RC
N
f536683381
f
GR
GS
[1 0 0 1 946.9892 685.77631] CT
1 0 0 RC
N
f536683381
f
GR
GS
[1 0 0 1 826.89648 579.76471] CT
1 0 0 RC
N
f536683381
f
GR
GS
[1 0 0 1 852.42975 680.06464] CT
1 0 0 RC
N
f536683381
f
GR
GS
[1 0 0 1 921.25818 627.19312] CT
1 0 0 RC
N
f536683381
f
GR
GS
[1 0 0 1 833.63721 586.61884] CT
1 0 0 RC
N
f536683381
f
GR
GS
[1 0 0 1 925.59088 613.08929] CT
1 0 0 RC
N
f536683381
f
GR
GS
[1 0 0 1 844.30823 561.41479] CT
1 0 0 RC
N
f536683381
f
GR
GS
[1 0 0 1 746.94012 549.10425] CT
1 0 0 RC
N
f536683381
f
GR
GS
[1 0 0 1 1002.13745 599.23004] CT
1 0 0 RC
N
f536683381
f
GR
GS
[1 0 0 1 823.31042 676.91766] CT
1 0 0 RC
N
f536683381
f
GR
GS
[1 0 0 1 830.56537 557.81586] CT
1 0 0 RC
N
f536683381
f
GR
GS
[1 0 0 1 932.49072 629.44775] CT
1 0 0 RC
N
f536683381
f
GR
GS
[1 0 0 1 847.58746 553.55798] CT
1 0 0 RC
N
f536683381
f
GR
GS
[1 0 0 1 888.74335 575.47998] CT
1 0 0 RC
N
f536683381
f
GR
GS
[1 0 0 1 898.17664 589.66315] CT
1 0 0 RC
N
f536683381
f
GR
GS
[1 0 0 1 866.88776 579.8291] CT
1 0 0 RC
N
f536683381
f
GR
GS
[1 0 0 1 889.46423 583.27948] CT
1 0 0 RC
N
f536683381
f
GR
GS
[1 0 0 1 859.4718 573.30042] CT
1 0 0 RC
N
f536683381
f
GR
GS
[1 0 0 1 767.93597 568.05084] CT
1 0 0 RC
N
f536683381
f
GR
GS
[1 0 0 1 981.97327 601.73083] CT
1 0 0 RC
N
f536683381
f
GR
GS
[1 0 0 1 974.18396 677.1676] CT
1 0 0 RC
N
f536683381
f
GR
GS
[1 0 0 1 894.35004 590.50403] CT
1 0 0 RC
N
f536683381
f
GR
GS
[1 0 0 1 851.59241 591.06842] CT
1 0 0 RC
N
f536683381
f
GR
GS
[1 0 0 1 891.48517 645.06299] CT
1 0 0 RC
N
f536683381
f
GR
GS
[1 0 0 1 920.62579 715.53424] CT
1 0 0 RC
N
f536683381
f
GR
GS
[1 0 0 1 937.75818 623.15082] CT
1 0 0 RC
N
f536683381
f
GR
GS
[1 0 0 1 860.15283 588.20245] CT
1 0 0 RC
N
f536683381
f
GR
GS
[1 0 0 1 895.84259 579.23969] CT
1 0 0 RC
N
f536683381
f
GR
GS
[1 0 0 1 929.15839 617.2746] CT
1 0 0 RC
N
f536683381
f
GR
GS
[1 0 0 1 862.06976 618.40985] CT
1 0 0 RC
N
f536683381
f
GR
GS
[1 0 0 1 765.44177 552.81244] CT
1 0 0 RC
N
f536683381
f
GR
GS
[1 0 0 1 855.51727 589.82574] CT
1 0 0 RC
N
f536683381
f
GR
GS
[1 0 0 1 875.15454 580.93494] CT
1 0 0 RC
N
f536683381
f
GR
GS
[1 0 0 1 873.38715 598.06396] CT
1 0 0 RC
N
f536683381
f
GR
GS
[1 0 0 1 907.96497 612.31494] CT
1 0 0 RC
N
f536683381
f
GR
GS
[1 0 0 1 841.43158 570.49078] CT
1 0 0 RC
N
f536683381
f
GR
GS
[1 0 0 1 832.45905 574.92395] CT
1 0 0 RC
N
f536683381
f
GR
GS
[1 0 0 1 914.15295 621.10516] CT
1 0 0 RC
N
f536683381
f
GR
GS
[1 0 0 1 768.22406 593.6861] CT
1 0 0 RC
N
f536683381
f
GR
GS
[1 0 0 1 888.6571 590.63782] CT
1 0 0 RC
N
f536683381
f
GR
GS
[1 0 0 1 813.79437 590.01733] CT
1 0 0 RC
N
f536683381
f
GR
GS
[1 0 0 1 911.80975 595.58759] CT
1 0 0 RC
N
f536683381
f
GR
GS
[1 0 0 1 903.65985 598.03101] CT
1 0 0 RC
N
f536683381
f
GR
GS
[1 0 0 1 963.04871 633.8465] CT
1 0 0 RC
N
f536683381
f
GR
GS
1 0 0 RC
1 LJ
3 LW
N
913.484 614.689 M
893.832 608.269 L
809.112 580.593 L
946.989 625.635 L
826.896 586.402 L
852.43 594.744 L
921.258 617.229 L
833.637 588.604 L
925.591 618.644 L
844.308 592.091 L
746.94 560.282 L
1002.137 643.651 L
823.31 585.231 L
830.565 587.601 L
932.491 620.899 L
847.587 593.162 L
888.743 606.607 L
898.177 609.689 L
866.888 599.467 L
889.464 606.842 L
859.472 597.044 L
767.936 567.141 L
981.973 637.064 L
974.184 634.519 L
894.35 608.439 L
851.592 594.47 L
891.485 607.503 L
920.626 617.022 L
937.758 622.619 L
860.153 597.267 L
895.843 608.926 L
929.158 619.81 L
862.07 597.893 L
765.442 566.326 L
855.517 595.752 L
875.155 602.168 L
873.387 601.59 L
907.965 612.886 L
841.432 591.151 L
832.459 588.22 L
914.153 614.908 L
768.224 567.235 L
888.657 606.579 L
813.794 582.122 L
911.81 614.142 L
903.66 611.48 L
963.049 630.881 L
S
GR
GS
[1 0 0 1 936.77234 664.14703] CT
N
f536683381
f
GR
GS
[1 0 0 1 1017.59155 653.24176] CT
N
f536683381
f
GR
GS
[1 0 0 1 912.76703 621.2157] CT
N
f536683381
f
GR
GS
[1 0 0 1 896.01569 659.45728] CT
N
f536683381
f
GR
GS
[1 0 0 1 940.44281 665.23633] CT
N
f536683381
f
GR
GS
[1 0 0 1 975.11792 680.00311] CT
N
f536683381
f
GR
GS
[1 0 0 1 937.34119 661.43799] CT
N
f536683381
f
GR
GS
[1 0 0 1 823.9201 599.56317] CT
N
f536683381
f
GR
GS
[1 0 0 1 1012.36658 689.85944] CT
N
f536683381
f
GR
GS
[1 0 0 1 795.96051 601.69226] CT
N
f536683381
f
GR
GS
[1 0 0 1 896.39612 642.29663] CT
N
f536683381
f
GR
GS
[1 0 0 1 978.84155 600.70563] CT
N
f536683381
f
GR
GS
[1 0 0 1 842.75433 635.82025] CT
N
f536683381
f
GR
GS
[1 0 0 1 833.98187 622.27924] CT
N
f536683381
f
GR
GS
[1 0 0 1 1111.05615 698.49139] CT
N
f536683381
f
GR
GS
[1 0 0 1 935.07355 614.62054] CT
N
f536683381
f
GR
GS
[1 0 0 1 876.3764 652.66272] CT
N
f536683381
f
GR
GS
[1 0 0 1 805.5094 629.44885] CT
N
f536683381
f
GR
GS
[1 0 0 1 948.4115 690.86829] CT
N
f536683381
f
GR
GS
[1 0 0 1 1130.1925 672.76904] CT
N
f536683381
f
GR
GS
[1 0 0 1 936.15894 584.0838] CT
N
f536683381
f
GR
GS
[1 0 0 1 989.53082 626.96008] CT
N
f536683381
f
GR
GS
[1 0 0 1 920.38794 657.05927] CT
N
f536683381
f
GR
GS
[1 0 0 1 1006.22742 661.02087] CT
N
f536683381
f
GR
GS
[1 0 0 1 902.89325 647.59857] CT
N
f536683381
f
GR
GS
[1 0 0 1 876.96729 603.57892] CT
N
f536683381
f
GR
GS
[1 0 0 1 938.56384 632.1579] CT
N
f536683381
f
GR
GS
[1 0 0 1 928.89069 646.13861] CT
N
f536683381
f
GR
GS
[1 0 0 1 949.92328 664.61517] CT
N
f536683381
f
GR
GS
[1 0 0 1 947.72699 648.67871] CT
N
f536683381
f
GR
GS
[1 0 0 1 1069.78345 721.97729] CT
N
f536683381
f
GR
GS
[1 0 0 1 1036.5238 690.27686] CT
N
f536683381
f
GR
GS
[1 0 0 1 1013.46051 680.57855] CT
N
f536683381
f
GR
GS
[1 0 0 1 1126.29761 716.56769] CT
N
f536683381
f
GR
GS
[1 0 0 1 1032.0874 685.3703] CT
N
f536683381
f
GR
GS
[1 0 0 1 1059.29871 704.9209] CT
N
f536683381
f
GR
GS
[1 0 0 1 1019.78314 644.47333] CT
N
f536683381
f
GR
GS
[1 0 0 1 892.12555 675.09741] CT
N
f536683381
f
GR
GS
[1 0 0 1 959.2417 622.58514] CT
N
f536683381
f
GR
GS
[1 0 0 1 906.1994 609.75653] CT
N
f536683381
f
GR
GS
[1 0 0 1 880.21338 638.59149] CT
N
f536683381
f
GR
GS
[1 0 0 1 1094.77966 730.76135] CT
N
f536683381
f
GR
GS
[1 0 0 1 869.94958 690.90546] CT
N
f536683381
f
GR
GS
[1 0 0 1 845.19769 625.88934] CT
N
f536683381
f
GR
GS
[1 0 0 1 836.00165 654.90918] CT
N
f536683381
f
GR
GS
[1 0 0 1 970.05334 654.16394] CT
N
f536683381
f
GR
GS
[1 0 0 1 804.83905 658.80701] CT
N
f536683381
f
GR
GS
[1 0 0 1 1051.30835 666.18781] CT
N
f536683381
f
GR
GS
[1 0 0 1 1028.69104 687.73187] CT
N
f536683381
f
GR
GS
[1 0 0 1 903.8938 622.31677] CT
N
f536683381
f
GR
GS
[1 0 0 1 994.64362 623.19452] CT
N
f536683381
f
GR
GS
[1 0 0 1 969.6214 684.65631] CT
N
f536683381
f
GR
GS
1 LJ
3 LW
N
936.772 651.065 M
1017.592 671.029 L
912.767 645.135 L
896.016 640.998 L
940.443 651.972 L
975.118 660.537 L
937.341 651.206 L
823.92 623.189 L
1012.367 669.738 L
795.961 616.282 L
896.396 641.092 L
978.842 661.457 L
842.754 627.841 L
833.982 625.674 L
1111.056 694.116 L
935.074 650.646 L
876.376 636.146 L
805.509 618.641 L
948.411 653.94 L
1130.193 698.843 L
936.159 650.914 L
989.531 664.097 L
920.388 647.018 L
1006.227 668.222 L
902.893 642.696 L
876.967 636.292 L
938.564 651.508 L
928.891 649.118 L
949.923 654.314 L
947.727 653.771 L
1069.783 683.921 L
1036.524 675.705 L
1013.461 670.008 L
1126.298 697.881 L
1032.087 674.609 L
1059.299 681.331 L
1019.783 671.57 L
892.126 640.037 L
959.242 656.615 L
906.199 643.513 L
880.213 637.094 L
1094.78 690.095 L
869.95 634.559 L
845.198 628.445 L
836.002 626.173 L
970.053 659.286 L
804.839 618.476 L
1051.308 679.357 L
1028.691 673.771 L
903.894 642.944 L
994.644 665.36 L
969.621 659.179 L
S
GR
GS
[1 0 0 1 886 516] CT
/Helvetica 18 F
GS
[1 0 0 1 0 0] CT
0 0 moveto 
1 -1 scale
(Younger Adults: r=-0.51, p=3e) t 
GR
GR
GS
[1 0 0 1 1131 507] CT
/Helvetica 14.4 F
GS
[1 0 0 1 0 0] CT
0 0 moveto 
1 -1 scale
(-) t 
GR
GR
GS
[1 0 0 1 1137 516] CT
/Helvetica 18 F
GS
[1 0 0 1 0 0] CT
0 0 moveto 
1 -1 scale
(4) t 
GR
GR
GS
1 0 0 RC
1 LJ
3 LW
N
852.5 505.5 M
882.5 505.5 L
S
GR
GS
[1 0 0 1 886 543] CT
/Helvetica 18 F
GS
[1 0 0 1 0 0] CT
0 0 moveto 
1 -1 scale
(Older Adults: r=-0.62, p=1e) t 
GR
GR
GS
[1 0 0 1 1107 534] CT
/Helvetica 14.4 F
GS
[1 0 0 1 0 0] CT
0 0 moveto 
1 -1 scale
(-) t 
GR
GR
GS
[1 0 0 1 1113 543] CT
/Helvetica 18 F
GS
[1 0 0 1 0 0] CT
0 0 moveto 
1 -1 scale
(6) t 
GR
GR
GS
1 LJ
3 LW
N
852.5 533 M
882.5 533 L
S
GR
%%Trailer
%%Pages: 1
%%EOF
