%!PS-Adobe-3.0 EPSF-3.0
%%Creator: (MATLAB, The Mathworks, Inc. Version 9.3.0.713579 \(R2017b\). Operating System: Mac OS X)
%%Title: /Users/kosciessa/Desktop/mntTardis/STSWD_Rest/WIP_eeg/A_MSE_CSD_multiVariant/C_figures/F3_FastMSEreflectsInversePowerRatio.eps
%%CreationDate: 2018-11-14T14:01:55
%%Pages: (atend)
%%BoundingBox:   123     2  1230   466
%%LanguageLevel: 3
%%EndComments
%%BeginProlog
%%BeginResource: procset (Apache XML Graphics Std ProcSet) 1.2 0
%%Version: 1.2 0
%%Copyright: (Copyright 2001-2003,2010 The Apache Software Foundation. License terms: http://www.apache.org/licenses/LICENSE-2.0)
/bd{bind def}bind def
/ld{load def}bd
/GR/grestore ld
/GS/gsave ld
/RM/rmoveto ld
/C/curveto ld
/t/show ld
/L/lineto ld
/ML/setmiterlimit ld
/CT/concat ld
/f/fill ld
/N/newpath ld
/S/stroke ld
/CC/setcmykcolor ld
/A/ashow ld
/cp/closepath ld
/RC/setrgbcolor ld
/LJ/setlinejoin ld
/GC/setgray ld
/LW/setlinewidth ld
/M/moveto ld
/re {4 2 roll M
1 index 0 rlineto
0 exch rlineto
neg 0 rlineto
cp } bd
/_ctm matrix def
/_tm matrix def
/BT { _ctm currentmatrix pop matrix _tm copy pop 0 0 moveto } bd
/ET { _ctm setmatrix } bd
/iTm { _ctm setmatrix _tm concat } bd
/Tm { _tm astore pop iTm 0 0 moveto } bd
/ux 0.0 def
/uy 0.0 def
/F {
  /Tp exch def
  /Tf exch def
  Tf findfont Tp scalefont setfont
  /cf Tf def  /cs Tp def
} bd
/ULS {currentpoint /uy exch def /ux exch def} bd
/ULE {
  /Tcx currentpoint pop def
  gsave
  newpath
  cf findfont cs scalefont dup
  /FontMatrix get 0 get /Ts exch def /FontInfo get dup
  /UnderlinePosition get Ts mul /To exch def
  /UnderlineThickness get Ts mul /Tt exch def
  ux uy To add moveto  Tcx uy To add lineto
  Tt setlinewidth stroke
  grestore
} bd
/OLE {
  /Tcx currentpoint pop def
  gsave
  newpath
  cf findfont cs scalefont dup
  /FontMatrix get 0 get /Ts exch def /FontInfo get dup
  /UnderlinePosition get Ts mul /To exch def
  /UnderlineThickness get Ts mul /Tt exch def
  ux uy To add cs add moveto Tcx uy To add cs add lineto
  Tt setlinewidth stroke
  grestore
} bd
/SOE {
  /Tcx currentpoint pop def
  gsave
  newpath
  cf findfont cs scalefont dup
  /FontMatrix get 0 get /Ts exch def /FontInfo get dup
  /UnderlinePosition get Ts mul /To exch def
  /UnderlineThickness get Ts mul /Tt exch def
  ux uy To add cs 10 mul 26 idiv add moveto Tcx uy To add cs 10 mul 26 idiv add lineto
  Tt setlinewidth stroke
  grestore
} bd
/QT {
/Y22 exch store
/X22 exch store
/Y21 exch store
/X21 exch store
currentpoint
/Y21 load 2 mul add 3 div exch
/X21 load 2 mul add 3 div exch
/X21 load 2 mul /X22 load add 3 div
/Y21 load 2 mul /Y22 load add 3 div
/X22 load /Y22 load curveto
} bd
/SSPD {
dup length /d exch dict def
{
/v exch def
/k exch def
currentpagedevice k known {
/cpdv currentpagedevice k get def
v cpdv ne {
/upd false def
/nullv v type /nulltype eq def
/nullcpdv cpdv type /nulltype eq def
nullv nullcpdv or
{
/upd true def
} {
/sametype v type cpdv type eq def
sametype {
v type /arraytype eq {
/vlen v length def
/cpdvlen cpdv length def
vlen cpdvlen eq {
0 1 vlen 1 sub {
/i exch def
/obj v i get def
/cpdobj cpdv i get def
obj cpdobj ne {
/upd true def
exit
} if
} for
} {
/upd true def
} ifelse
} {
v type /dicttype eq {
v {
/dv exch def
/dk exch def
/cpddv cpdv dk get def
dv cpddv ne {
/upd true def
exit
} if
} forall
} {
/upd true def
} ifelse
} ifelse
} if
} ifelse
upd true eq {
d k v put
} if
} if
} if
} forall
d length 0 gt {
d setpagedevice
} if
} bd
/RE { % /NewFontName [NewEncodingArray] /FontName RE -
  findfont dup length dict begin
  {
    1 index /FID ne
    {def} {pop pop} ifelse
  } forall
  /Encoding exch def
  /FontName 1 index def
  currentdict definefont pop
  end
} bind def
%%EndResource
%%BeginResource: procset (Apache XML Graphics EPS ProcSet) 1.0 0
%%Version: 1.0 0
%%Copyright: (Copyright 2002-2003 The Apache Software Foundation. License terms: http://www.apache.org/licenses/LICENSE-2.0)
/BeginEPSF { %def
/b4_Inc_state save def         % Save state for cleanup
/dict_count countdictstack def % Count objects on dict stack
/op_count count 1 sub def      % Count objects on operand stack
userdict begin                 % Push userdict on dict stack
/showpage { } def              % Redefine showpage, { } = null proc
0 setgray 0 setlinecap         % Prepare graphics state
1 setlinewidth 0 setlinejoin
10 setmiterlimit [ ] 0 setdash newpath
/languagelevel where           % If level not equal to 1 then
{pop languagelevel             % set strokeadjust and
1 ne                           % overprint to their defaults.
{false setstrokeadjust false setoverprint
} if
} if
} bd
/EndEPSF { %def
count op_count sub {pop} repeat            % Clean up stacks
countdictstack dict_count sub {end} repeat
b4_Inc_state restore
} bd
%%EndResource
%FOPBeginFontDict
%%IncludeResource: font Courier-Oblique
%%IncludeResource: font Courier-BoldOblique
%%IncludeResource: font Courier-Bold
%%IncludeResource: font ZapfDingbats
%%IncludeResource: font Symbol
%%IncludeResource: font Helvetica
%%IncludeResource: font Helvetica-Oblique
%%IncludeResource: font Helvetica-Bold
%%IncludeResource: font Helvetica-BoldOblique
%%IncludeResource: font Times-Roman
%%IncludeResource: font Times-Italic
%%IncludeResource: font Times-Bold
%%IncludeResource: font Times-BoldItalic
%%IncludeResource: font Courier
%FOPEndFontDict
%%BeginResource: encoding WinAnsiEncoding
/WinAnsiEncoding [
/.notdef /.notdef /.notdef /.notdef /.notdef
/.notdef /.notdef /.notdef /.notdef /.notdef
/.notdef /.notdef /.notdef /.notdef /.notdef
/.notdef /.notdef /.notdef /.notdef /.notdef
/.notdef /.notdef /.notdef /.notdef /.notdef
/.notdef /.notdef /.notdef /.notdef /.notdef
/.notdef /.notdef /space /exclam /quotedbl
/numbersign /dollar /percent /ampersand /quotesingle
/parenleft /parenright /asterisk /plus /comma
/hyphen /period /slash /zero /one
/two /three /four /five /six
/seven /eight /nine /colon /semicolon
/less /equal /greater /question /at
/A /B /C /D /E
/F /G /H /I /J
/K /L /M /N /O
/P /Q /R /S /T
/U /V /W /X /Y
/Z /bracketleft /backslash /bracketright /asciicircum
/underscore /quoteleft /a /b /c
/d /e /f /g /h
/i /j /k /l /m
/n /o /p /q /r
/s /t /u /v /w
/x /y /z /braceleft /bar
/braceright /asciitilde /bullet /Euro /bullet
/quotesinglbase /florin /quotedblbase /ellipsis /dagger
/daggerdbl /circumflex /perthousand /Scaron /guilsinglleft
/OE /bullet /Zcaron /bullet /bullet
/quoteleft /quoteright /quotedblleft /quotedblright /bullet
/endash /emdash /asciitilde /trademark /scaron
/guilsinglright /oe /bullet /zcaron /Ydieresis
/space /exclamdown /cent /sterling /currency
/yen /brokenbar /section /dieresis /copyright
/ordfeminine /guillemotleft /logicalnot /sfthyphen /registered
/macron /degree /plusminus /twosuperior /threesuperior
/acute /mu /paragraph /middot /cedilla
/onesuperior /ordmasculine /guillemotright /onequarter /onehalf
/threequarters /questiondown /Agrave /Aacute /Acircumflex
/Atilde /Adieresis /Aring /AE /Ccedilla
/Egrave /Eacute /Ecircumflex /Edieresis /Igrave
/Iacute /Icircumflex /Idieresis /Eth /Ntilde
/Ograve /Oacute /Ocircumflex /Otilde /Odieresis
/multiply /Oslash /Ugrave /Uacute /Ucircumflex
/Udieresis /Yacute /Thorn /germandbls /agrave
/aacute /acircumflex /atilde /adieresis /aring
/ae /ccedilla /egrave /eacute /ecircumflex
/edieresis /igrave /iacute /icircumflex /idieresis
/eth /ntilde /ograve /oacute /ocircumflex
/otilde /odieresis /divide /oslash /ugrave
/uacute /ucircumflex /udieresis /yacute /thorn
/ydieresis
] def
%%EndResource
%FOPBeginFontReencode
/Courier-Oblique findfont
dup length dict begin
  {1 index /FID ne {def} {pop pop} ifelse} forall
  /Encoding WinAnsiEncoding def
  currentdict
end
/Courier-Oblique exch definefont pop
/Courier-BoldOblique findfont
dup length dict begin
  {1 index /FID ne {def} {pop pop} ifelse} forall
  /Encoding WinAnsiEncoding def
  currentdict
end
/Courier-BoldOblique exch definefont pop
/Courier-Bold findfont
dup length dict begin
  {1 index /FID ne {def} {pop pop} ifelse} forall
  /Encoding WinAnsiEncoding def
  currentdict
end
/Courier-Bold exch definefont pop
/Helvetica findfont
dup length dict begin
  {1 index /FID ne {def} {pop pop} ifelse} forall
  /Encoding WinAnsiEncoding def
  currentdict
end
/Helvetica exch definefont pop
/Helvetica-Oblique findfont
dup length dict begin
  {1 index /FID ne {def} {pop pop} ifelse} forall
  /Encoding WinAnsiEncoding def
  currentdict
end
/Helvetica-Oblique exch definefont pop
/Helvetica-Bold findfont
dup length dict begin
  {1 index /FID ne {def} {pop pop} ifelse} forall
  /Encoding WinAnsiEncoding def
  currentdict
end
/Helvetica-Bold exch definefont pop
/Helvetica-BoldOblique findfont
dup length dict begin
  {1 index /FID ne {def} {pop pop} ifelse} forall
  /Encoding WinAnsiEncoding def
  currentdict
end
/Helvetica-BoldOblique exch definefont pop
/Times-Roman findfont
dup length dict begin
  {1 index /FID ne {def} {pop pop} ifelse} forall
  /Encoding WinAnsiEncoding def
  currentdict
end
/Times-Roman exch definefont pop
/Times-Italic findfont
dup length dict begin
  {1 index /FID ne {def} {pop pop} ifelse} forall
  /Encoding WinAnsiEncoding def
  currentdict
end
/Times-Italic exch definefont pop
/Times-Bold findfont
dup length dict begin
  {1 index /FID ne {def} {pop pop} ifelse} forall
  /Encoding WinAnsiEncoding def
  currentdict
end
/Times-Bold exch definefont pop
/Times-BoldItalic findfont
dup length dict begin
  {1 index /FID ne {def} {pop pop} ifelse} forall
  /Encoding WinAnsiEncoding def
  currentdict
end
/Times-BoldItalic exch definefont pop
/Courier findfont
dup length dict begin
  {1 index /FID ne {def} {pop pop} ifelse} forall
  /Encoding WinAnsiEncoding def
  currentdict
end
/Courier exch definefont pop
%FOPEndFontReencode
%%EndProlog
%%Page: 1 1
%%PageBoundingBox: 0 0 1344 480
%%BeginPageSetup
[1 0 0 -1 0 480] CT
%%EndPageSetup
GS
1 GC
N
0 0 1344 480 re
f
GR
GS
1 GC
N
0 0 1344 480 re
f
GR
GS
1 GC
N
175 427 M
625 427 L
625 36 L
175 36 L
cp
f
GR
GS
0.149 GC
2 setlinecap
1 LJ
0.5 LW
N
175 427 M
625 427 L
S
GR
GS
0.149 GC
2 setlinecap
1 LJ
0.5 LW
N
175 427 M
175 422.5 L
S
GR
GS
0.149 GC
2 setlinecap
1 LJ
0.5 LW
N
239.286 427 M
239.286 422.5 L
S
GR
GS
0.149 GC
2 setlinecap
1 LJ
0.5 LW
N
303.571 427 M
303.571 422.5 L
S
GR
GS
0.149 GC
2 setlinecap
1 LJ
0.5 LW
N
367.857 427 M
367.857 422.5 L
S
GR
GS
0.149 GC
2 setlinecap
1 LJ
0.5 LW
N
432.143 427 M
432.143 422.5 L
S
GR
GS
0.149 GC
2 setlinecap
1 LJ
0.5 LW
N
496.429 427 M
496.429 422.5 L
S
GR
GS
0.149 GC
2 setlinecap
1 LJ
0.5 LW
N
560.714 427 M
560.714 422.5 L
S
GR
GS
0.149 GC
2 setlinecap
1 LJ
0.5 LW
N
625 427 M
625 422.5 L
S
GR
GS
[1 0 0 1 175 432.60001] CT
0.149 GC
/Helvetica 18 F
GS
[1 0 0 1 0 0] CT
-5.5 18 moveto 
1 -1 scale
(0) t 
GR
GR
GS
[1 0 0 1 239.28572 432.60001] CT
0.149 GC
/Helvetica 18 F
GS
[1 0 0 1 0 0] CT
-10.5 18 moveto 
1 -1 scale
(10) t 
GR
GR
GS
[1 0 0 1 303.57144 432.60001] CT
0.149 GC
/Helvetica 18 F
GS
[1 0 0 1 0 0] CT
-10.5 18 moveto 
1 -1 scale
(20) t 
GR
GR
GS
[1 0 0 1 367.85715 432.60001] CT
0.149 GC
/Helvetica 18 F
GS
[1 0 0 1 0 0] CT
-10.5 18 moveto 
1 -1 scale
(30) t 
GR
GR
GS
[1 0 0 1 432.14285 432.60001] CT
0.149 GC
/Helvetica 18 F
GS
[1 0 0 1 0 0] CT
-10.5 18 moveto 
1 -1 scale
(40) t 
GR
GR
GS
[1 0 0 1 496.42856 432.60001] CT
0.149 GC
/Helvetica 18 F
GS
[1 0 0 1 0 0] CT
-10.5 18 moveto 
1 -1 scale
(50) t 
GR
GR
GS
[1 0 0 1 560.71429 432.60001] CT
0.149 GC
/Helvetica 18 F
GS
[1 0 0 1 0 0] CT
-10.5 18 moveto 
1 -1 scale
(60) t 
GR
GR
GS
[1 0 0 1 625 432.60001] CT
0.149 GC
/Helvetica 18 F
GS
[1 0 0 1 0 0] CT
-10.5 18 moveto 
1 -1 scale
(70) t 
GR
GR
GS
[1 0 0 1 400.00021 455.60001] CT
0.149 GC
/Helvetica 18 F
GS
[1 0 0 1 0 0] CT
-153 18 moveto 
1 -1 scale
(Ratio: low freq Power/high freq power) t 
GR
GR
GS
0.149 GC
2 setlinecap
1 LJ
0.5 LW
N
175 427 M
175 36 L
S
GR
GS
0.149 GC
2 setlinecap
1 LJ
0.5 LW
N
175 381.389 M
179.5 381.389 L
S
GR
GS
0.149 GC
2 setlinecap
1 LJ
0.5 LW
N
175 312.311 M
179.5 312.311 L
S
GR
GS
0.149 GC
2 setlinecap
1 LJ
0.5 LW
N
175 243.233 M
179.5 243.233 L
S
GR
GS
0.149 GC
2 setlinecap
1 LJ
0.5 LW
N
175 174.156 M
179.5 174.156 L
S
GR
GS
0.149 GC
2 setlinecap
1 LJ
0.5 LW
N
175 105.078 M
179.5 105.078 L
S
GR
GS
0.149 GC
2 setlinecap
1 LJ
0.5 LW
N
175 36 M
179.5 36 L
S
GR
GS
[1 0 0 1 169.39999 381.38879] CT
0.149 GC
/Helvetica 18 F
GS
[1 0 0 1 0 0] CT
-11 7 moveto 
1 -1 scale
(0) t 
GR
GR
GS
[1 0 0 1 169.39999 312.31104] CT
0.149 GC
/Helvetica 18 F
GS
[1 0 0 1 0 0] CT
-26 7 moveto 
1 -1 scale
(0.2) t 
GR
GR
GS
[1 0 0 1 169.39999 243.23328] CT
0.149 GC
/Helvetica 18 F
GS
[1 0 0 1 0 0] CT
-26 7 moveto 
1 -1 scale
(0.4) t 
GR
GR
GS
[1 0 0 1 169.39999 174.1555] CT
0.149 GC
/Helvetica 18 F
GS
[1 0 0 1 0 0] CT
-26 7 moveto 
1 -1 scale
(0.6) t 
GR
GR
GS
[1 0 0 1 169.39999 105.07775] CT
0.149 GC
/Helvetica 18 F
GS
[1 0 0 1 0 0] CT
-26 7 moveto 
1 -1 scale
(0.8) t 
GR
GR
GS
[1 0 0 1 169.39999 36] CT
0.149 GC
/Helvetica 18 F
GS
[1 0 0 1 0 0] CT
-11 7 moveto 
1 -1 scale
(1) t 
GR
GR
GS
[0 -1 1 0 140.39999 231.49982] CT
0.149 GC
/Helvetica 18 F
GS
[1 0 0 1 0 0] CT
-48 -4 moveto 
1 -1 scale
(MSE Vanilla) t 
GR
GR
GS
[1 0 0 1 400.0004 31.50002] CT
/Helvetica-Bold 18 F
GS
[1 0 0 1 0 0] CT
-94.5 -4 moveto 
1 -1 scale
(Eyes open: Scales 1-3) t 
GR
GR
GS
[1 0 0 1 211.28877 194.78654] CT
N
3 0 M
3 -1.657 1.657 -3 0 -3 C
-1.657 -3 -3 -1.657 -3 0 C
-3 1.657 -1.657 3 0 3 C
1.657 3 3 1.657 3 0 C
f
GR
GS
[1 0 0 1 255.24876 164.15334] CT
N
/f-1827712652{3 0 M
3 -1.657 1.657 -3 0 -3 C
-1.657 -3 -3 -1.657 -3 0 C
-3 1.657 -1.657 3 0 3 C
1.657 3 3 1.657 3 0 C}def
f-1827712652
f
GR
GS
[1 0 0 1 190.08076 165.47185] CT
N
f-1827712652
f
GR
GS
[1 0 0 1 268.0524 167.1144] CT
N
f-1827712652
f
GR
GS
[1 0 0 1 317.45935 309.41409] CT
N
f-1827712652
f
GR
GS
[1 0 0 1 200.69798 131.01247] CT
N
f-1827712652
f
GR
GS
[1 0 0 1 235.40625 134.7074] CT
N
f-1827712652
f
GR
GS
[1 0 0 1 206.76004 88.13844] CT
N
f-1827712652
f
GR
GS
[1 0 0 1 351.42139 206.42273] CT
N
f-1827712652
f
GR
GS
[1 0 0 1 603.77435 243.6134] CT
N
f-1827712652
f
GR
GS
[1 0 0 1 224.24643 181.62874] CT
N
f-1827712652
f
GR
GS
[1 0 0 1 307.61221 287.50513] CT
N
f-1827712652
f
GR
GS
[1 0 0 1 292.10809 188.25099] CT
N
f-1827712652
f
GR
GS
[1 0 0 1 264.94806 189.9494] CT
N
f-1827712652
f
GR
GS
[1 0 0 1 353.54474 199.40408] CT
N
f-1827712652
f
GR
GS
[1 0 0 1 332.39063 220.76204] CT
N
f-1827712652
f
GR
GS
[1 0 0 1 293.94388 199.93703] CT
N
f-1827712652
f
GR
GS
[1 0 0 1 379.22287 230.97754] CT
N
f-1827712652
f
GR
GS
[1 0 0 1 278.99298 189.74673] CT
N
f-1827712652
f
GR
GS
[1 0 0 1 255.34413 164.15845] CT
N
f-1827712652
f
GR
GS
[1 0 0 1 331.36536 180.0582] CT
N
f-1827712652
f
GR
GS
[1 0 0 1 219.23076 135.50206] CT
N
f-1827712652
f
GR
GS
[1 0 0 1 186.53418 116.11264] CT
N
f-1827712652
f
GR
GS
[1 0 0 1 229.78844 176.13458] CT
N
f-1827712652
f
GR
GS
[1 0 0 1 288.79355 215.94606] CT
N
f-1827712652
f
GR
GS
[1 0 0 1 555.23914 318.07886] CT
N
f-1827712652
f
GR
GS
[1 0 0 1 230.03964 287.77869] CT
N
f-1827712652
f
GR
GS
[1 0 0 1 201.77748 155.28287] CT
N
f-1827712652
f
GR
GS
[1 0 0 1 229.82877 158.99258] CT
N
f-1827712652
f
GR
GS
[1 0 0 1 390.77087 218.78862] CT
N
f-1827712652
f
GR
GS
[1 0 0 1 208.98175 127.0064] CT
N
f-1827712652
f
GR
GS
[1 0 0 1 197.13603 92.90667] CT
N
f-1827712652
f
GR
GS
[1 0 0 1 336.24258 188.53506] CT
N
f-1827712652
f
GR
GS
[1 0 0 1 244.43161 213.47226] CT
N
f-1827712652
f
GR
GS
[1 0 0 1 396.06357 225.6302] CT
N
f-1827712652
f
GR
GS
[1 0 0 1 241.84653 176.48674] CT
N
f-1827712652
f
GR
GS
[1 0 0 1 210.71428 137.32539] CT
N
f-1827712652
f
GR
GS
[1 0 0 1 318.31726 209.81645] CT
N
f-1827712652
f
GR
GS
[1 0 0 1 308.46771 210.63275] CT
N
f-1827712652
f
GR
GS
[1 0 0 1 191.44424 100.891] CT
N
f-1827712652
f
GR
GS
[1 0 0 1 243.15581 153.28264] CT
N
f-1827712652
f
GR
GS
[1 0 0 1 204.9532 146.01613] CT
N
f-1827712652
f
GR
GS
[1 0 0 1 218.24326 136.37726] CT
N
f-1827712652
f
GR
GS
[1 0 0 1 222.44301 146.65189] CT
N
f-1827712652
f
GR
GS
[1 0 0 1 235.93243 170.66014] CT
N
f-1827712652
f
GR
GS
[1 0 0 1 189.95181 90.67233] CT
N
f-1827712652
f
GR
GS
0.749 GC
1 LJ
0.5 LW
N
175 139.23 M
625 328.995 L
S
GR
GS
[1 0 0 1 199.95924 111.71302] CT
1 0 0 RC
N
f-1827712652
f
GR
GS
[1 0 0 1 196.05173 237.49373] CT
1 0 0 RC
N
f-1827712652
f
GR
GS
[1 0 0 1 213.51872 144.91078] CT
1 0 0 RC
N
f-1827712652
f
GR
GS
[1 0 0 1 187.7021 162.82552] CT
1 0 0 RC
N
f-1827712652
f
GR
GS
[1 0 0 1 186.72115 100.48895] CT
1 0 0 RC
N
f-1827712652
f
GR
GS
[1 0 0 1 183.38087 119.13181] CT
1 0 0 RC
N
f-1827712652
f
GR
GS
[1 0 0 1 304.53125 195.40659] CT
1 0 0 RC
N
f-1827712652
f
GR
GS
[1 0 0 1 185.30496 120.26767] CT
1 0 0 RC
N
f-1827712652
f
GR
GS
[1 0 0 1 261.56039 159.04865] CT
1 0 0 RC
N
f-1827712652
f
GR
GS
[1 0 0 1 198.1402 109.3374] CT
1 0 0 RC
N
f-1827712652
f
GR
GS
[1 0 0 1 225.17833 177.47388] CT
1 0 0 RC
N
f-1827712652
f
GR
GS
[1 0 0 1 271.3688 217.96933] CT
1 0 0 RC
N
f-1827712652
f
GR
GS
[1 0 0 1 232.07083 177.82344] CT
1 0 0 RC
N
f-1827712652
f
GR
GS
[1 0 0 1 180.18359 95.07594] CT
1 0 0 RC
N
f-1827712652
f
GR
GS
[1 0 0 1 216.9749 157.75261] CT
1 0 0 RC
N
f-1827712652
f
GR
GS
[1 0 0 1 238.28769 216.14609] CT
1 0 0 RC
N
f-1827712652
f
GR
GS
[1 0 0 1 212.92599 134.75562] CT
1 0 0 RC
N
f-1827712652
f
GR
GS
[1 0 0 1 200.77435 155.28069] CT
1 0 0 RC
N
f-1827712652
f
GR
GS
[1 0 0 1 185.88985 167.36925] CT
1 0 0 RC
N
f-1827712652
f
GR
GS
[1 0 0 1 341.39203 207.76535] CT
1 0 0 RC
N
f-1827712652
f
GR
GS
[1 0 0 1 193.0284 166.85947] CT
1 0 0 RC
N
f-1827712652
f
GR
GS
[1 0 0 1 190.41022 144.25351] CT
1 0 0 RC
N
f-1827712652
f
GR
GS
[1 0 0 1 187.3838 99.55193] CT
1 0 0 RC
N
f-1827712652
f
GR
GS
[1 0 0 1 196.62926 118.9658] CT
1 0 0 RC
N
f-1827712652
f
GR
GS
[1 0 0 1 222.2009 122.27689] CT
1 0 0 RC
N
f-1827712652
f
GR
GS
[1 0 0 1 194.1032 109.02352] CT
1 0 0 RC
N
f-1827712652
f
GR
GS
[1 0 0 1 208.2464 154.35301] CT
1 0 0 RC
N
f-1827712652
f
GR
GS
[1 0 0 1 194.51524 81.90584] CT
1 0 0 RC
N
f-1827712652
f
GR
GS
[1 0 0 1 190.58415 124.1388] CT
1 0 0 RC
N
f-1827712652
f
GR
GS
[1 0 0 1 177.39052 80.90122] CT
1 0 0 RC
N
f-1827712652
f
GR
GS
[1 0 0 1 181.51323 87.33848] CT
1 0 0 RC
N
f-1827712652
f
GR
GS
[1 0 0 1 184.51797 71.79419] CT
1 0 0 RC
N
f-1827712652
f
GR
GS
[1 0 0 1 179.14478 77.67381] CT
1 0 0 RC
N
f-1827712652
f
GR
GS
[1 0 0 1 183.72725 71.55188] CT
1 0 0 RC
N
f-1827712652
f
GR
GS
[1 0 0 1 180.94058 69.17139] CT
1 0 0 RC
N
f-1827712652
f
GR
GS
[1 0 0 1 193.41307 107.51329] CT
1 0 0 RC
N
f-1827712652
f
GR
GS
[1 0 0 1 184.42744 59.22252] CT
1 0 0 RC
N
f-1827712652
f
GR
GS
[1 0 0 1 205.21516 127.27674] CT
1 0 0 RC
N
f-1827712652
f
GR
GS
[1 0 0 1 449.68552 233.56979] CT
1 0 0 RC
N
f-1827712652
f
GR
GS
[1 0 0 1 194.53568 118.8875] CT
1 0 0 RC
N
f-1827712652
f
GR
GS
[1 0 0 1 177.86592 70.40396] CT
1 0 0 RC
N
f-1827712652
f
GR
GS
[1 0 0 1 260.31961 232.39038] CT
1 0 0 RC
N
f-1827712652
f
GR
GS
[1 0 0 1 247.79251 174.69125] CT
1 0 0 RC
N
f-1827712652
f
GR
GS
[1 0 0 1 185.89023 73.49346] CT
1 0 0 RC
N
f-1827712652
f
GR
GS
[1 0 0 1 196.41837 89.8709] CT
1 0 0 RC
N
f-1827712652
f
GR
GS
[1 0 0 1 346.50003 233.07504] CT
1 0 0 RC
N
f-1827712652
f
GR
GS
[1 0 0 1 195.12057 107.12735] CT
1 0 0 RC
N
f-1827712652
f
GR
GS
[1 0 0 1 183.21059 84.1697] CT
1 0 0 RC
N
f-1827712652
f
GR
GS
[1 0 0 1 232.86539 136.9756] CT
1 0 0 RC
N
f-1827712652
f
GR
GS
[1 0 0 1 267.61069 199.34135] CT
1 0 0 RC
N
f-1827712652
f
GR
GS
[1 0 0 1 181.9684 83.34841] CT
1 0 0 RC
N
f-1827712652
f
GR
GS
0.749 GC
1 LJ
0.5 LW
N
175 106.017 M
625 427 L
S
GR
GS
0.749 GC
1 LJ
0.5 LW
N
175 139.23 M
625 328.995 L
S
GR
GS
[1 0 0 1 222 58.86598] CT
/Helvetica 18 F
GS
[1 0 0 1 0 0] CT
0 7 moveto 
1 -1 scale
(Younger Adults: r=-0.69) t 
GR
GR
GS
[1 0 0 1 204 58.86598] CT
N
f-1827712652
f
GR
GS
[1 0 0 1 222 81.13402] CT
/Helvetica 18 F
GS
[1 0 0 1 0 0] CT
0 7 moveto 
1 -1 scale
(Older Adults: r=-0.72) t 
GR
GR
GS
[1 0 0 1 204 81.13402] CT
1 0 0 RC
N
f-1827712652
f
GR
GS
1 GC
N
/f759296204{767 427 M
1216 427 L
1216 36 L
767 36 L
cp}def
f759296204
f
GR
GS
0.149 GC
2 setlinecap
1 LJ
0.5 LW
N
767 427 M
1216 427 L
S
GR
GS
0.149 GC
2 setlinecap
1 LJ
0.5 LW
N
767 427 M
767 422.51 L
S
GR
GS
0.149 GC
2 setlinecap
1 LJ
0.5 LW
N
856.8 427 M
856.8 422.51 L
S
GR
GS
0.149 GC
2 setlinecap
1 LJ
0.5 LW
N
946.6 427 M
946.6 422.51 L
S
GR
GS
0.149 GC
2 setlinecap
1 LJ
0.5 LW
N
1036.4 427 M
1036.4 422.51 L
S
GR
GS
0.149 GC
2 setlinecap
1 LJ
0.5 LW
N
1126.2 427 M
1126.2 422.51 L
S
GR
GS
0.149 GC
2 setlinecap
1 LJ
0.5 LW
N
1216 427 M
1216 422.51 L
S
GR
GS
[1 0 0 1 767 432.60001] CT
0.149 GC
/Helvetica 18 F
GS
[1 0 0 1 0 0] CT
-5.5 18 moveto 
1 -1 scale
(0) t 
GR
GR
GS
[1 0 0 1 856.79999 432.60001] CT
0.149 GC
/Helvetica 18 F
GS
[1 0 0 1 0 0] CT
-10.5 18 moveto 
1 -1 scale
(20) t 
GR
GR
GS
[1 0 0 1 946.59998 432.60001] CT
0.149 GC
/Helvetica 18 F
GS
[1 0 0 1 0 0] CT
-10.5 18 moveto 
1 -1 scale
(40) t 
GR
GR
GS
[1 0 0 1 1036.40002 432.60001] CT
0.149 GC
/Helvetica 18 F
GS
[1 0 0 1 0 0] CT
-10.5 18 moveto 
1 -1 scale
(60) t 
GR
GR
GS
[1 0 0 1 1126.19995 432.60001] CT
0.149 GC
/Helvetica 18 F
GS
[1 0 0 1 0 0] CT
-10.5 18 moveto 
1 -1 scale
(80) t 
GR
GR
GS
[1 0 0 1 1216 432.60001] CT
0.149 GC
/Helvetica 18 F
GS
[1 0 0 1 0 0] CT
-15.5 18 moveto 
1 -1 scale
(100) t 
GR
GR
GS
[1 0 0 1 991.50018 455.60001] CT
0.149 GC
/Helvetica 18 F
GS
[1 0 0 1 0 0] CT
-153 18 moveto 
1 -1 scale
(Ratio: low freq Power/high freq power) t 
GR
GR
GS
0.149 GC
2 setlinecap
1 LJ
0.5 LW
N
767 427 M
767 36 L
S
GR
GS
0.149 GC
2 setlinecap
1 LJ
0.5 LW
N
767 404.344 M
771.49 404.344 L
S
GR
GS
0.149 GC
2 setlinecap
1 LJ
0.5 LW
N
767 330.675 M
771.49 330.675 L
S
GR
GS
0.149 GC
2 setlinecap
1 LJ
0.5 LW
N
767 257.007 M
771.49 257.007 L
S
GR
GS
0.149 GC
2 setlinecap
1 LJ
0.5 LW
N
767 183.338 M
771.49 183.338 L
S
GR
GS
0.149 GC
2 setlinecap
1 LJ
0.5 LW
N
767 109.669 M
771.49 109.669 L
S
GR
GS
0.149 GC
2 setlinecap
1 LJ
0.5 LW
N
767 36 M
771.49 36 L
S
GR
GS
[1 0 0 1 761.40002 404.34436] CT
0.149 GC
/Helvetica 18 F
GS
[1 0 0 1 0 0] CT
-11 7 moveto 
1 -1 scale
(0) t 
GR
GR
GS
[1 0 0 1 761.40002 330.67548] CT
0.149 GC
/Helvetica 18 F
GS
[1 0 0 1 0 0] CT
-26 7 moveto 
1 -1 scale
(0.2) t 
GR
GR
GS
[1 0 0 1 761.40002 257.00662] CT
0.149 GC
/Helvetica 18 F
GS
[1 0 0 1 0 0] CT
-26 7 moveto 
1 -1 scale
(0.4) t 
GR
GR
GS
[1 0 0 1 761.40002 183.33774] CT
0.149 GC
/Helvetica 18 F
GS
[1 0 0 1 0 0] CT
-26 7 moveto 
1 -1 scale
(0.6) t 
GR
GR
GS
[1 0 0 1 761.40002 109.66887] CT
0.149 GC
/Helvetica 18 F
GS
[1 0 0 1 0 0] CT
-26 7 moveto 
1 -1 scale
(0.8) t 
GR
GR
GS
[1 0 0 1 761.40002 36] CT
0.149 GC
/Helvetica 18 F
GS
[1 0 0 1 0 0] CT
-11 7 moveto 
1 -1 scale
(1) t 
GR
GR
GS
[0 -1 1 0 732.40002 231.49982] CT
0.149 GC
/Helvetica 18 F
GS
[1 0 0 1 0 0] CT
-48 -4 moveto 
1 -1 scale
(MSE Vanilla) t 
GR
GR
GS
[1 0 0 1 991.50092 31.50001] CT
/Helvetica-Bold 18 F
GS
[1 0 0 1 0 0] CT
-101.5 -4 moveto 
1 -1 scale
(Eyes closed: Scales 1-3) t 
GR
GR
GS
[1 0 0 1 916.92334 268.42749] CT
N
f-1827712652
f
GR
GS
[1 0 0 1 855.0719 211.09494] CT
N
f-1827712652
f
GR
GS
[1 0 0 1 799.30975 223.0721] CT
N
f-1827712652
f
GR
GS
[1 0 0 1 869.53314 203.6277] CT
N
f-1827712652
f
GR
GS
[1 0 0 1 920.31128 219.0815] CT
N
f-1827712652
f
GR
GS
[1 0 0 1 906.72778 220.12332] CT
N
f-1827712652
f
GR
GS
[1 0 0 1 809.19043 141.26778] CT
N
f-1827712652
f
GR
GS
[1 0 0 1 802.74524 126.41915] CT
N
f-1827712652
f
GR
GS
[1 0 0 1 1073.40308 268.14761] CT
N
f-1827712652
f
GR
GS
[1 0 0 1 1142.93994 255.93774] CT
N
f-1827712652
f
GR
GS
[1 0 0 1 835.96417 220.35358] CT
N
f-1827712652
f
GR
GS
[1 0 0 1 915.08026 319.5062] CT
N
f-1827712652
f
GR
GS
[1 0 0 1 1173.3855 242.75288] CT
N
f-1827712652
f
GR
GS
[1 0 0 1 843.4201 222.08717] CT
N
f-1827712652
f
GR
GS
[1 0 0 1 948.43378 282.35602] CT
N
f-1827712652
f
GR
GS
[1 0 0 1 942.4809 245.02342] CT
N
f-1827712652
f
GR
GS
[1 0 0 1 986.37042 238.13655] CT
N
f-1827712652
f
GR
GS
[1 0 0 1 1071.64246 256.35046] CT
N
f-1827712652
f
GR
GS
[1 0 0 1 1186.52441 259.36819] CT
N
f-1827712652
f
GR
GS
[1 0 0 1 841.85217 210.33548] CT
N
f-1827712652
f
GR
GS
[1 0 0 1 853.31549 241.6172] CT
N
f-1827712652
f
GR
GS
[1 0 0 1 832.97668 188.77432] CT
N
f-1827712652
f
GR
GS
[1 0 0 1 800.28778 187.21445] CT
N
f-1827712652
f
GR
GS
[1 0 0 1 805.26666 185.44833] CT
N
f-1827712652
f
GR
GS
[1 0 0 1 1120.57886 256.14087] CT
N
f-1827712652
f
GR
GS
[1 0 0 1 1112.05774 283.27695] CT
N
f-1827712652
f
GR
GS
[1 0 0 1 792.70856 319.30182] CT
N
f-1827712652
f
GR
GS
[1 0 0 1 823.88458 208.81697] CT
N
f-1827712652
f
GR
GS
[1 0 0 1 805.29486 167.16704] CT
N
f-1827712652
f
GR
GS
[1 0 0 1 953.8833 268.2804] CT
N
f-1827712652
f
GR
GS
[1 0 0 1 858.83472 265.69608] CT
N
f-1827712652
f
GR
GS
[1 0 0 1 856.33081 161.50175] CT
N
f-1827712652
f
GR
GS
[1 0 0 1 879.61902 198.67299] CT
N
f-1827712652
f
GR
GS
[1 0 0 1 867.15283 241.61276] CT
N
f-1827712652
f
GR
GS
[1 0 0 1 939.77887 265.95428] CT
N
f-1827712652
f
GR
GS
[1 0 0 1 996.19653 276.52866] CT
N
f-1827712652
f
GR
GS
[1 0 0 1 1049.28992 249.51393] CT
N
f-1827712652
f
GR
GS
[1 0 0 1 917.47528 229.80927] CT
N
f-1827712652
f
GR
GS
[1 0 0 1 857.96198 218.49367] CT
N
f-1827712652
f
GR
GS
[1 0 0 1 798.48999 179.90016] CT
N
f-1827712652
f
GR
GS
[1 0 0 1 839.56812 201.02724] CT
N
f-1827712652
f
GR
GS
[1 0 0 1 800.11621 198.69125] CT
N
f-1827712652
f
GR
GS
[1 0 0 1 831.43188 166.23474] CT
N
f-1827712652
f
GR
GS
[1 0 0 1 800.13629 154.00613] CT
N
f-1827712652
f
GR
GS
[1 0 0 1 809.55792 179.61005] CT
N
f-1827712652
f
GR
GS
[1 0 0 1 861.57849 232.06625] CT
N
f-1827712652
f
GR
GS
0.749 GC
1 LJ
0.5 LW
N
767 194.417 M
1216 293.376 L
S
GR
GS
[1 0 0 1 845.50305 219.68344] CT
1 0 0 RC
N
f-1827712652
f
GR
GS
[1 0 0 1 781.39667 284.07336] CT
1 0 0 RC
N
f-1827712652
f
GR
GS
[1 0 0 1 829.8092 196.83801] CT
1 0 0 RC
N
f-1827712652
f
GR
GS
[1 0 0 1 798.61548 214.89879] CT
1 0 0 RC
N
f-1827712652
f
GR
GS
[1 0 0 1 781.52686 221.74106] CT
1 0 0 RC
N
f-1827712652
f
GR
GS
[1 0 0 1 788.17114 193.62639] CT
1 0 0 RC
N
f-1827712652
f
GR
GS
[1 0 0 1 835.92297 201.41278] CT
1 0 0 RC
N
f-1827712652
f
GR
GS
[1 0 0 1 1047.72632 307.57333] CT
1 0 0 RC
N
f-1827712652
f
GR
GS
[1 0 0 1 875.96283 228.28743] CT
1 0 0 RC
N
f-1827712652
f
GR
GS
[1 0 0 1 784.94635 119.09544] CT
1 0 0 RC
N
f-1827712652
f
GR
GS
[1 0 0 1 843.5412 208.68427] CT
1 0 0 RC
N
f-1827712652
f
GR
GS
[1 0 0 1 798.68121 212.65807] CT
1 0 0 RC
N
f-1827712652
f
GR
GS
[1 0 0 1 861.58508 331.48883] CT
1 0 0 RC
N
f-1827712652
f
GR
GS
[1 0 0 1 770.4043 76.29395] CT
1 0 0 RC
N
f-1827712652
f
GR
GS
[1 0 0 1 861.58099 227.24948] CT
1 0 0 RC
N
f-1827712652
f
GR
GS
[1 0 0 1 895.0473 259.95673] CT
1 0 0 RC
N
f-1827712652
f
GR
GS
[1 0 0 1 801.11322 184.0385] CT
1 0 0 RC
N
f-1827712652
f
GR
GS
[1 0 0 1 927.96191 284.22046] CT
1 0 0 RC
N
f-1827712652
f
GR
GS
[1 0 0 1 831.28455 216.04239] CT
1 0 0 RC
N
f-1827712652
f
GR
GS
[1 0 0 1 813.87128 247.40765] CT
1 0 0 RC
N
f-1827712652
f
GR
GS
[1 0 0 1 922.60107 240.24519] CT
1 0 0 RC
N
f-1827712652
f
GR
GS
[1 0 0 1 967.17096 261.17148] CT
1 0 0 RC
N
f-1827712652
f
GR
GS
[1 0 0 1 835.52777 230.23686] CT
1 0 0 RC
N
f-1827712652
f
GR
GS
[1 0 0 1 788.90192 146.75818] CT
1 0 0 RC
N
f-1827712652
f
GR
GS
[1 0 0 1 833.26923 204.1868] CT
1 0 0 RC
N
f-1827712652
f
GR
GS
[1 0 0 1 800.59479 144.63509] CT
1 0 0 RC
N
f-1827712652
f
GR
GS
[1 0 0 1 823.69489 196.06082] CT
1 0 0 RC
N
f-1827712652
f
GR
GS
[1 0 0 1 811.63196 138.39879] CT
1 0 0 RC
N
f-1827712652
f
GR
GS
[1 0 0 1 809.42767 167.68285] CT
1 0 0 RC
N
f-1827712652
f
GR
GS
[1 0 0 1 777.52521 149.9877] CT
1 0 0 RC
N
f-1827712652
f
GR
GS
[1 0 0 1 778.83002 268.11081] CT
1 0 0 RC
N
f-1827712652
f
GR
GS
[1 0 0 1 788.93262 151.68097] CT
1 0 0 RC
N
f-1827712652
f
GR
GS
[1 0 0 1 811.03046 191.13799] CT
1 0 0 RC
N
f-1827712652
f
GR
GS
[1 0 0 1 785.42651 191.39403] CT
1 0 0 RC
N
f-1827712652
f
GR
GS
[1 0 0 1 770.54663 66.20031] CT
1 0 0 RC
N
f-1827712652
f
GR
GS
[1 0 0 1 785.84393 162.78659] CT
1 0 0 RC
N
f-1827712652
f
GR
GS
[1 0 0 1 777.09344 96.28887] CT
1 0 0 RC
N
f-1827712652
f
GR
GS
[1 0 0 1 785.32574 122.51291] CT
1 0 0 RC
N
f-1827712652
f
GR
GS
[1 0 0 1 883.48505 257.17593] CT
1 0 0 RC
N
f-1827712652
f
GR
GS
[1 0 0 1 803.36133 195.37941] CT
1 0 0 RC
N
f-1827712652
f
GR
GS
[1 0 0 1 784.59076 134.26778] CT
1 0 0 RC
N
f-1827712652
f
GR
GS
[1 0 0 1 799.08832 325.64221] CT
1 0 0 RC
N
f-1827712652
f
GR
GS
[1 0 0 1 943.68445 251.88379] CT
1 0 0 RC
N
f-1827712652
f
GR
GS
[1 0 0 1 778.20831 78.96824] CT
1 0 0 RC
N
f-1827712652
f
GR
GS
[1 0 0 1 967.92249 395.49597] CT
1 0 0 RC
N
f-1827712652
f
GR
GS
[1 0 0 1 858.12488 235.55264] CT
1 0 0 RC
N
f-1827712652
f
GR
GS
[1 0 0 1 815.09076 197.36133] CT
1 0 0 RC
N
f-1827712652
f
GR
GS
[1 0 0 1 777.70959 126.52159] CT
1 0 0 RC
N
f-1827712652
f
GR
GS
[1 0 0 1 908.99725 230.50179] CT
1 0 0 RC
N
f-1827712652
f
GR
GS
[1 0 0 1 1191.08472 334.6701] CT
1 0 0 RC
N
f-1827712652
f
GR
GS
[1 0 0 1 794.90289 154.35904] CT
1 0 0 RC
N
f-1827712652
f
GR
GS
0.749 GC
1 LJ
0.5 LW
N
767 163.993 M
1216 427 L
S
GR
GS
0.749 GC
1 LJ
0.5 LW
N
767 194.417 M
1216 293.376 L
S
GR
GS
[1 0 0 1 814 58.86598] CT
/Helvetica 18 F
GS
[1 0 0 1 0 0] CT
0 7 moveto 
1 -1 scale
(Younger Adults: r=-0.56) t 
GR
GR
GS
[1 0 0 1 796 58.86598] CT
N
f-1827712652
f
GR
GS
[1 0 0 1 814 81.13402] CT
/Helvetica 18 F
GS
[1 0 0 1 0 0] CT
0 7 moveto 
1 -1 scale
(Older Adults: r=-0.66) t 
GR
GR
GS
[1 0 0 1 796 81.13402] CT
1 0 0 RC
N
f-1827712652
f
GR
%%Trailer
%%Pages: 1
%%EOF
