%!PS-Adobe-3.0 EPSF-3.0
%%Creator: (MATLAB, The Mathworks, Inc. Version 9.0.0.341360 \(R2016a\). Operating System: Mac OS X)
%%Title: /Volumes/LNDG/Projects/StateSwitch/dynamic/data/eeg/rest/B_analyses/A_MSE_CSD_multiVariant/C_figures/Z_PSD_normal1f.eps
%%CreationDate: 2020-09-08T14:27:12
%%Pages: (atend)
%%BoundingBox:     5     0   364   267
%%LanguageLevel: 3
%%EndComments
%%BeginProlog
%%BeginResource: procset (Apache XML Graphics Std ProcSet) 1.2 0
%%Version: 1.2 0
%%Copyright: (Copyright 2001-2003,2010 The Apache Software Foundation. License terms: http://www.apache.org/licenses/LICENSE-2.0)
/bd{bind def}bind def
/ld{load def}bd
/GR/grestore ld
/M/moveto ld
/LJ/setlinejoin ld
/C/curveto ld
/f/fill ld
/LW/setlinewidth ld
/GC/setgray ld
/t/show ld
/N/newpath ld
/CT/concat ld
/cp/closepath ld
/S/stroke ld
/L/lineto ld
/CC/setcmykcolor ld
/A/ashow ld
/GS/gsave ld
/RC/setrgbcolor ld
/RM/rmoveto ld
/ML/setmiterlimit ld
/re {4 2 roll M
1 index 0 rlineto
0 exch rlineto
neg 0 rlineto
cp } bd
/_ctm matrix def
/_tm matrix def
/BT { _ctm currentmatrix pop matrix _tm copy pop 0 0 moveto } bd
/ET { _ctm setmatrix } bd
/iTm { _ctm setmatrix _tm concat } bd
/Tm { _tm astore pop iTm 0 0 moveto } bd
/ux 0.0 def
/uy 0.0 def
/F {
  /Tp exch def
  /Tf exch def
  Tf findfont Tp scalefont setfont
  /cf Tf def  /cs Tp def
} bd
/ULS {currentpoint /uy exch def /ux exch def} bd
/ULE {
  /Tcx currentpoint pop def
  gsave
  newpath
  cf findfont cs scalefont dup
  /FontMatrix get 0 get /Ts exch def /FontInfo get dup
  /UnderlinePosition get Ts mul /To exch def
  /UnderlineThickness get Ts mul /Tt exch def
  ux uy To add moveto  Tcx uy To add lineto
  Tt setlinewidth stroke
  grestore
} bd
/OLE {
  /Tcx currentpoint pop def
  gsave
  newpath
  cf findfont cs scalefont dup
  /FontMatrix get 0 get /Ts exch def /FontInfo get dup
  /UnderlinePosition get Ts mul /To exch def
  /UnderlineThickness get Ts mul /Tt exch def
  ux uy To add cs add moveto Tcx uy To add cs add lineto
  Tt setlinewidth stroke
  grestore
} bd
/SOE {
  /Tcx currentpoint pop def
  gsave
  newpath
  cf findfont cs scalefont dup
  /FontMatrix get 0 get /Ts exch def /FontInfo get dup
  /UnderlinePosition get Ts mul /To exch def
  /UnderlineThickness get Ts mul /Tt exch def
  ux uy To add cs 10 mul 26 idiv add moveto Tcx uy To add cs 10 mul 26 idiv add lineto
  Tt setlinewidth stroke
  grestore
} bd
/QT {
/Y22 exch store
/X22 exch store
/Y21 exch store
/X21 exch store
currentpoint
/Y21 load 2 mul add 3 div exch
/X21 load 2 mul add 3 div exch
/X21 load 2 mul /X22 load add 3 div
/Y21 load 2 mul /Y22 load add 3 div
/X22 load /Y22 load curveto
} bd
/SSPD {
dup length /d exch dict def
{
/v exch def
/k exch def
currentpagedevice k known {
/cpdv currentpagedevice k get def
v cpdv ne {
/upd false def
/nullv v type /nulltype eq def
/nullcpdv cpdv type /nulltype eq def
nullv nullcpdv or
{
/upd true def
} {
/sametype v type cpdv type eq def
sametype {
v type /arraytype eq {
/vlen v length def
/cpdvlen cpdv length def
vlen cpdvlen eq {
0 1 vlen 1 sub {
/i exch def
/obj v i get def
/cpdobj cpdv i get def
obj cpdobj ne {
/upd true def
exit
} if
} for
} {
/upd true def
} ifelse
} {
v type /dicttype eq {
v {
/dv exch def
/dk exch def
/cpddv cpdv dk get def
dv cpddv ne {
/upd true def
exit
} if
} forall
} {
/upd true def
} ifelse
} ifelse
} if
} ifelse
upd true eq {
d k v put
} if
} if
} if
} forall
d length 0 gt {
d setpagedevice
} if
} bd
%%EndResource
%%BeginResource: procset (Apache XML Graphics EPS ProcSet) 1.0 0
%%Version: 1.0 0
%%Copyright: (Copyright 2002-2003 The Apache Software Foundation. License terms: http://www.apache.org/licenses/LICENSE-2.0)
/BeginEPSF { %def
/b4_Inc_state save def         % Save state for cleanup
/dict_count countdictstack def % Count objects on dict stack
/op_count count 1 sub def      % Count objects on operand stack
userdict begin                 % Push userdict on dict stack
/showpage { } def              % Redefine showpage, { } = null proc
0 setgray 0 setlinecap         % Prepare graphics state
1 setlinewidth 0 setlinejoin
10 setmiterlimit [ ] 0 setdash newpath
/languagelevel where           % If level not equal to 1 then
{pop languagelevel             % set strokeadjust and
1 ne                           % overprint to their defaults.
{false setstrokeadjust false setoverprint
} if
} if
} bd
/EndEPSF { %def
count op_count sub {pop} repeat            % Clean up stacks
countdictstack dict_count sub {end} repeat
b4_Inc_state restore
} bd
%%EndResource
%FOPBeginFontDict
%%IncludeResource: font Courier-Bold
%%IncludeResource: font Helvetica
%%IncludeResource: font Courier-BoldOblique
%%IncludeResource: font Courier-Oblique
%%IncludeResource: font Times-Roman
%%IncludeResource: font Helvetica-BoldOblique
%%IncludeResource: font Helvetica-Bold
%%IncludeResource: font Helvetica-Oblique
%%IncludeResource: font Times-BoldItalic
%%IncludeResource: font Courier
%%IncludeResource: font Times-Italic
%%IncludeResource: font Times-Bold
%%IncludeResource: font Symbol
%%IncludeResource: font ZapfDingbats
%FOPEndFontDict
%%BeginResource: encoding WinAnsiEncoding
/WinAnsiEncoding [
/.notdef /.notdef /.notdef /.notdef /.notdef
/.notdef /.notdef /.notdef /.notdef /.notdef
/.notdef /.notdef /.notdef /.notdef /.notdef
/.notdef /.notdef /.notdef /.notdef /.notdef
/.notdef /.notdef /.notdef /.notdef /.notdef
/.notdef /.notdef /.notdef /.notdef /.notdef
/.notdef /.notdef /space /exclam /quotedbl
/numbersign /dollar /percent /ampersand /quotesingle
/parenleft /parenright /asterisk /plus /comma
/hyphen /period /slash /zero /one
/two /three /four /five /six
/seven /eight /nine /colon /semicolon
/less /equal /greater /question /at
/A /B /C /D /E
/F /G /H /I /J
/K /L /M /N /O
/P /Q /R /S /T
/U /V /W /X /Y
/Z /bracketleft /backslash /bracketright /asciicircum
/underscore /quoteleft /a /b /c
/d /e /f /g /h
/i /j /k /l /m
/n /o /p /q /r
/s /t /u /v /w
/x /y /z /braceleft /bar
/braceright /asciitilde /bullet /Euro /bullet
/quotesinglbase /florin /quotedblbase /ellipsis /dagger
/daggerdbl /circumflex /perthousand /Scaron /guilsinglleft
/OE /bullet /Zcaron /bullet /bullet
/quoteleft /quoteright /quotedblleft /quotedblright /bullet
/endash /emdash /asciitilde /trademark /scaron
/guilsinglright /oe /bullet /zcaron /Ydieresis
/space /exclamdown /cent /sterling /currency
/yen /brokenbar /section /dieresis /copyright
/ordfeminine /guillemotleft /logicalnot /sfthyphen /registered
/macron /degree /plusminus /twosuperior /threesuperior
/acute /mu /paragraph /middot /cedilla
/onesuperior /ordmasculine /guillemotright /onequarter /onehalf
/threequarters /questiondown /Agrave /Aacute /Acircumflex
/Atilde /Adieresis /Aring /AE /Ccedilla
/Egrave /Eacute /Ecircumflex /Edieresis /Igrave
/Iacute /Icircumflex /Idieresis /Eth /Ntilde
/Ograve /Oacute /Ocircumflex /Otilde /Odieresis
/multiply /Oslash /Ugrave /Uacute /Ucircumflex
/Udieresis /Yacute /Thorn /germandbls /agrave
/aacute /acircumflex /atilde /adieresis /aring
/ae /ccedilla /egrave /eacute /ecircumflex
/edieresis /igrave /iacute /icircumflex /idieresis
/eth /ntilde /ograve /oacute /ocircumflex
/otilde /odieresis /divide /oslash /ugrave
/uacute /ucircumflex /udieresis /yacute /thorn
/ydieresis
] def
%%EndResource
%FOPBeginFontReencode
/Courier-Bold findfont
dup length dict begin
  {1 index /FID ne {def} {pop pop} ifelse} forall
  /Encoding WinAnsiEncoding def
  currentdict
end
/Courier-Bold exch definefont pop
/Helvetica findfont
dup length dict begin
  {1 index /FID ne {def} {pop pop} ifelse} forall
  /Encoding WinAnsiEncoding def
  currentdict
end
/Helvetica exch definefont pop
/Courier-BoldOblique findfont
dup length dict begin
  {1 index /FID ne {def} {pop pop} ifelse} forall
  /Encoding WinAnsiEncoding def
  currentdict
end
/Courier-BoldOblique exch definefont pop
/Courier-Oblique findfont
dup length dict begin
  {1 index /FID ne {def} {pop pop} ifelse} forall
  /Encoding WinAnsiEncoding def
  currentdict
end
/Courier-Oblique exch definefont pop
/Times-Roman findfont
dup length dict begin
  {1 index /FID ne {def} {pop pop} ifelse} forall
  /Encoding WinAnsiEncoding def
  currentdict
end
/Times-Roman exch definefont pop
/Helvetica-BoldOblique findfont
dup length dict begin
  {1 index /FID ne {def} {pop pop} ifelse} forall
  /Encoding WinAnsiEncoding def
  currentdict
end
/Helvetica-BoldOblique exch definefont pop
/Helvetica-Bold findfont
dup length dict begin
  {1 index /FID ne {def} {pop pop} ifelse} forall
  /Encoding WinAnsiEncoding def
  currentdict
end
/Helvetica-Bold exch definefont pop
/Helvetica-Oblique findfont
dup length dict begin
  {1 index /FID ne {def} {pop pop} ifelse} forall
  /Encoding WinAnsiEncoding def
  currentdict
end
/Helvetica-Oblique exch definefont pop
/Times-BoldItalic findfont
dup length dict begin
  {1 index /FID ne {def} {pop pop} ifelse} forall
  /Encoding WinAnsiEncoding def
  currentdict
end
/Times-BoldItalic exch definefont pop
/Courier findfont
dup length dict begin
  {1 index /FID ne {def} {pop pop} ifelse} forall
  /Encoding WinAnsiEncoding def
  currentdict
end
/Courier exch definefont pop
/Times-Italic findfont
dup length dict begin
  {1 index /FID ne {def} {pop pop} ifelse} forall
  /Encoding WinAnsiEncoding def
  currentdict
end
/Times-Italic exch definefont pop
/Times-Bold findfont
dup length dict begin
  {1 index /FID ne {def} {pop pop} ifelse} forall
  /Encoding WinAnsiEncoding def
  currentdict
end
/Times-Bold exch definefont pop
%FOPEndFontReencode
%%EndProlog
%%Page: 1 1
%%PageBoundingBox: 0 0 384 288
%%BeginPageSetup
[1 0 0 -1 0 288] CT
%%EndPageSetup
GS
1 GC
N
0 0 384 288 re
f
GR
GS
1 GC
N
0 0 384 288 re
f
GR
GS
1 GC
N
77.5 226 M
347.5 226 L
347.5 21.5 L
77.5 21.5 L
cp
f
GR
GS
0.149 GC
2 setlinecap
1 LJ
0.5 LW
N
77.5 226 M
347.5 226 L
S
GR
GS
0.149 GC
2 setlinecap
1 LJ
0.5 LW
N
91.704 226 M
91.704 223.3 L
S
GR
GS
0.149 GC
2 setlinecap
1 LJ
0.5 LW
N
145.704 226 M
145.704 223.3 L
S
GR
GS
0.149 GC
2 setlinecap
1 LJ
0.5 LW
N
198.888 226 M
198.888 223.3 L
S
GR
GS
0.149 GC
2 setlinecap
1 LJ
0.5 LW
N
252.888 226 M
252.888 223.3 L
S
GR
GS
0.149 GC
2 setlinecap
1 LJ
0.5 LW
N
307.093 226 M
307.093 223.3 L
S
GR
GS
0.149 GC
2 setlinecap
1 LJ
0.5 LW
N
109.088 226 M
109.088 224.65 L
S
GR
GS
0.149 GC
2 setlinecap
1 LJ
0.5 LW
N
131.5 226 M
131.5 224.65 L
S
GR
GS
0.149 GC
2 setlinecap
1 LJ
0.5 LW
N
148.884 226 M
148.884 224.65 L
S
GR
GS
0.149 GC
2 setlinecap
1 LJ
0.5 LW
N
163.088 226 M
163.088 224.65 L
S
GR
GS
0.149 GC
2 setlinecap
1 LJ
0.5 LW
N
175.097 226 M
175.097 224.65 L
S
GR
GS
0.149 GC
2 setlinecap
1 LJ
0.5 LW
N
185.5 226 M
185.5 224.65 L
S
GR
GS
0.149 GC
2 setlinecap
1 LJ
0.5 LW
N
194.676 226 M
194.676 224.65 L
S
GR
GS
0.149 GC
2 setlinecap
1 LJ
0.5 LW
N
256.884 226 M
256.884 224.65 L
S
GR
GS
0.149 GC
2 setlinecap
1 LJ
0.5 LW
N
288.472 226 M
288.472 224.65 L
S
GR
GS
0.149 GC
2 setlinecap
1 LJ
0.5 LW
N
310.884 226 M
310.884 224.65 L
S
GR
GS
0.149 GC
2 setlinecap
1 LJ
0.5 LW
N
328.268 226 M
328.268 224.65 L
S
GR
GS
0.149 GC
2 setlinecap
1 LJ
0.5 LW
N
342.472 226 M
342.472 224.65 L
S
GR
GS
[1 0 0 1 91.70386 232.60001] CT
0.149 GC
/Helvetica 23 F
GS
[1 0 0 1 0 0] CT
-16 22 moveto 
1 -1 scale
(2.4) t 
GR
GR
GS
[1 0 0 1 145.70386 232.60001] CT
0.149 GC
/Helvetica 23 F
GS
[1 0 0 1 0 0] CT
-16 22 moveto 
1 -1 scale
(4.8) t 
GR
GR
GS
[1 0 0 1 198.88808 232.60001] CT
0.149 GC
/Helvetica 23 F
GS
[1 0 0 1 0 0] CT
-16 22 moveto 
1 -1 scale
(9.5) t 
GR
GR
GS
[1 0 0 1 252.88808 232.60001] CT
0.149 GC
/Helvetica 23 F
GS
[1 0 0 1 0 0] CT
-13 22 moveto 
1 -1 scale
(19) t 
GR
GR
GS
[1 0 0 1 307.09283 232.60001] CT
0.149 GC
/Helvetica 23 F
GS
[1 0 0 1 0 0] CT
-22.5 22 moveto 
1 -1 scale
(38.1) t 
GR
GR
GS
[1 0 0 1 212.50012 261.10001] CT
0.149 GC
/Helvetica 23 F
GS
[1 0 0 1 0 0] CT
-150.5 22 moveto 
1 -1 scale
(Frequency [Hz, log10-scaled]) t 
GR
GR
GS
0.149 GC
2 setlinecap
1 LJ
0.5 LW
N
77.5 226 M
77.5 21.5 L
S
GR
GS
0.149 GC
2 setlinecap
1 LJ
0.5 LW
N
77.5 224.652 M
80.2 224.652 L
S
GR
GS
0.149 GC
2 setlinecap
1 LJ
0.5 LW
N
77.5 158.724 M
80.2 158.724 L
S
GR
GS
0.149 GC
2 setlinecap
1 LJ
0.5 LW
N
77.5 89.026 M
80.2 89.026 L
S
GR
GS
0.149 GC
2 setlinecap
1 LJ
0.5 LW
N
77.5 218.218 M
78.85 218.218 L
S
GR
GS
0.149 GC
2 setlinecap
1 LJ
0.5 LW
N
77.5 211.749 M
78.85 211.749 L
S
GR
GS
0.149 GC
2 setlinecap
1 LJ
0.5 LW
N
77.5 205.245 M
78.85 205.245 L
S
GR
GS
0.149 GC
2 setlinecap
1 LJ
0.5 LW
N
77.5 198.707 M
78.85 198.707 L
S
GR
GS
0.149 GC
2 setlinecap
1 LJ
0.5 LW
N
77.5 192.133 M
78.85 192.133 L
S
GR
GS
0.149 GC
2 setlinecap
1 LJ
0.5 LW
N
77.5 185.524 M
78.85 185.524 L
S
GR
GS
0.149 GC
2 setlinecap
1 LJ
0.5 LW
N
77.5 178.879 M
78.85 178.879 L
S
GR
GS
0.149 GC
2 setlinecap
1 LJ
0.5 LW
N
77.5 172.198 M
78.85 172.198 L
S
GR
GS
0.149 GC
2 setlinecap
1 LJ
0.5 LW
N
77.5 165.479 M
78.85 165.479 L
S
GR
GS
0.149 GC
2 setlinecap
1 LJ
0.5 LW
N
77.5 151.93 M
78.85 151.93 L
S
GR
GS
0.149 GC
2 setlinecap
1 LJ
0.5 LW
N
77.5 145.099 M
78.85 145.099 L
S
GR
GS
0.149 GC
2 setlinecap
1 LJ
0.5 LW
N
77.5 138.229 M
78.85 138.229 L
S
GR
GS
0.149 GC
2 setlinecap
1 LJ
0.5 LW
N
77.5 131.321 M
78.85 131.321 L
S
GR
GS
0.149 GC
2 setlinecap
1 LJ
0.5 LW
N
77.5 124.373 M
78.85 124.373 L
S
GR
GS
0.149 GC
2 setlinecap
1 LJ
0.5 LW
N
77.5 117.385 M
78.85 117.385 L
S
GR
GS
0.149 GC
2 setlinecap
1 LJ
0.5 LW
N
77.5 110.356 M
78.85 110.356 L
S
GR
GS
0.149 GC
2 setlinecap
1 LJ
0.5 LW
N
77.5 103.288 M
78.85 103.288 L
S
GR
GS
0.149 GC
2 setlinecap
1 LJ
0.5 LW
N
77.5 96.177 M
78.85 96.177 L
S
GR
GS
0.149 GC
2 setlinecap
1 LJ
0.5 LW
N
77.5 81.832 M
78.85 81.832 L
S
GR
GS
0.149 GC
2 setlinecap
1 LJ
0.5 LW
N
77.5 74.595 M
78.85 74.595 L
S
GR
GS
0.149 GC
2 setlinecap
1 LJ
0.5 LW
N
77.5 67.315 M
78.85 67.315 L
S
GR
GS
0.149 GC
2 setlinecap
1 LJ
0.5 LW
N
77.5 59.991 M
78.85 59.991 L
S
GR
GS
0.149 GC
2 setlinecap
1 LJ
0.5 LW
N
77.5 52.623 M
78.85 52.623 L
S
GR
GS
0.149 GC
2 setlinecap
1 LJ
0.5 LW
N
77.5 45.211 M
78.85 45.211 L
S
GR
GS
0.149 GC
2 setlinecap
1 LJ
0.5 LW
N
77.5 37.753 M
78.85 37.753 L
S
GR
GS
0.149 GC
2 setlinecap
1 LJ
0.5 LW
N
77.5 30.249 M
78.85 30.249 L
S
GR
GS
0.149 GC
2 setlinecap
1 LJ
0.5 LW
N
77.5 22.698 M
78.85 22.698 L
S
GR
GS
[1 0 0 1 70.9 224.65228] CT
0.149 GC
/Helvetica 23 F
GS
[1 0 0 1 0 0] CT
-41 8.5 moveto 
1 -1 scale
(-9.5) t 
GR
GR
GS
[1 0 0 1 70.9 158.7236] CT
0.149 GC
/Helvetica 23 F
GS
[1 0 0 1 0 0] CT
-22 8.5 moveto 
1 -1 scale
(-9) t 
GR
GR
GS
[1 0 0 1 70.9 89.0256] CT
0.149 GC
/Helvetica 23 F
GS
[1 0 0 1 0 0] CT
-41 8.5 moveto 
1 -1 scale
(-8.5) t 
GR
GR
GS
[0 -1 1 0 26.9 123.7499] CT
0.149 GC
/Helvetica 23 F
GS
[1 0 0 1 0 0] CT
-93 -5 moveto 
1 -1 scale
(log10 Power \(a.u.\)) t 
GR
GR
GS
1 0.91 0.91 RC
N
333.975 207.776 M
327.328 203.689 L
327.328 213.247 L
cp
f
GR
GS
1 0.91 0.91 RC
N
178.366 102.046 M
171.685 93.452 L
171.685 103.4 L
cp
f
GR
GS
1 0.91 0.91 RC
N
145.704 95.23 M
151.94 97.384 L
151.94 88.119 L
cp
f
GR
GS
1 0.91 0.91 RC
N
320.578 200.08 M
320.578 209.765 L
327.328 203.689 L
cp
f
GR
GS
1 0.91 0.91 RC
N
307.093 191.448 M
300.258 186.732 L
300.258 195.805 L
cp
f
GR
GS
1 0.91 0.91 RC
N
185.5 96.483 M
178.366 91.243 L
178.366 102.046 L
cp
f
GR
GS
1 0.91 0.91 RC
N
192.035 83.362 M
192.035 70.036 L
185.5 84.458 L
cp
f
GR
GS
1 0.91 0.91 RC
N
125.426 81.621 M
131.5 77.509 L
125.426 72.361 L
cp
f
GR
GS
1 0.91 0.91 RC
N
145.704 86.092 M
138.925 82.651 L
138.925 91.81 L
cp
f
GR
GS
1 0.91 0.91 RC
N
145.704 95.23 M
151.94 88.119 L
145.704 86.092 L
cp
f
GR
GS
1 0.91 0.91 RC
N
198.888 71.387 M
192.035 70.036 L
192.035 83.362 L
cp
f
GR
GS
1 0.91 0.91 RC
N
159.092 90.469 M
151.94 88.119 L
151.94 97.384 L
cp
f
GR
GS
1 0.91 0.91 RC
N
239.5 139.934 M
239.5 131.354 L
232.898 137.404 L
cp
f
GR
GS
1 0.91 0.91 RC
N
205.94 69.243 M
212.406 85.885 L
212.406 74.481 L
cp
f
GR
GS
1 0.91 0.91 RC
N
212.406 74.481 M
212.406 85.885 L
219.012 100.183 L
cp
f
GR
GS
1 0.91 0.91 RC
N
286.633 182.694 M
293.5 189.368 L
293.5 180.599 L
cp
f
GR
GS
1 0.91 0.91 RC
N
273.328 156.599 M
266.406 151.691 L
273.328 165.25 L
cp
f
GR
GS
1 0.91 0.91 RC
N
307.093 200.746 M
307.093 191.448 L
300.258 195.805 L
cp
f
GR
GS
1 0.91 0.91 RC
N
205.94 69.243 M
198.888 55.85 L
198.888 71.387 L
cp
f
GR
GS
1 0.91 0.91 RC
N
286.633 173.974 M
279.975 167.19 L
279.975 175.593 L
cp
f
GR
GS
1 0.91 0.91 RC
N
347.5 216.437 M
340.766 212.152 L
340.766 221.657 L
cp
f
GR
GS
1 0.91 0.91 RC
N
159.092 99.826 M
165.642 92.593 L
159.092 90.469 L
cp
f
GR
GS
1 0.91 0.91 RC
N
165.642 102.206 M
165.642 92.593 L
159.092 99.826 L
cp
f
GR
GS
1 0.91 0.91 RC
N
171.685 103.4 M
171.685 93.452 L
165.642 102.206 L
cp
f
GR
GS
1 0.91 0.91 RC
N
165.642 92.593 M
165.642 102.206 L
171.685 93.452 L
cp
f
GR
GS
1 0.91 0.91 RC
N
171.685 93.452 M
178.366 102.046 L
178.366 91.243 L
cp
f
GR
GS
1 0.91 0.91 RC
N
145.704 95.23 M
145.704 86.092 L
138.925 91.81 L
cp
f
GR
GS
1 0.91 0.91 RC
N
159.092 99.826 M
159.092 90.469 L
151.94 97.384 L
cp
f
GR
GS
1 0.91 0.91 RC
N
178.366 91.243 M
185.5 96.483 L
185.5 84.458 L
cp
f
GR
GS
1 0.91 0.91 RC
N
185.5 84.458 M
185.5 96.483 L
192.035 83.362 L
cp
f
GR
GS
1 0.91 0.91 RC
N
131.5 86.767 M
131.5 77.509 L
125.426 81.621 L
cp
f
GR
GS
1 0.91 0.91 RC
N
138.925 82.651 M
131.5 77.509 L
131.5 86.767 L
cp
f
GR
GS
1 0.91 0.91 RC
N
118.839 75.947 M
118.839 66.711 L
111.642 70.912 L
cp
f
GR
GS
1 0.91 0.91 RC
N
138.925 82.651 M
131.5 86.767 L
138.925 91.81 L
cp
f
GR
GS
1 0.91 0.91 RC
N
103.713 53.985 M
97.94 56.963 L
103.713 63.887 L
cp
f
GR
GS
1 0.91 0.91 RC
N
125.426 72.361 M
118.839 75.947 L
125.426 81.621 L
cp
f
GR
GS
1 0.91 0.91 RC
N
103.713 53.985 M
97.94 46.909 L
97.94 56.963 L
cp
f
GR
GS
1 0.91 0.91 RC
N
91.704 48.934 M
97.94 46.909 L
91.704 38.685 L
cp
f
GR
GS
1 0.91 0.91 RC
N
91.704 48.934 M
97.94 56.963 L
97.94 46.909 L
cp
f
GR
GS
1 0.91 0.91 RC
N
111.642 70.912 M
118.839 66.711 L
111.642 61.389 L
cp
f
GR
GS
1 0.91 0.91 RC
N
84.925 40.653 M
91.704 48.934 L
91.704 38.685 L
cp
f
GR
GS
1 0.91 0.91 RC
N
77.5 32.711 M
84.925 40.653 L
84.925 30.006 L
cp
f
GR
GS
1 0.91 0.91 RC
N
77.5 32.711 M
84.925 30.006 L
77.5 21.5 L
cp
f
GR
GS
1 0.91 0.91 RC
N
84.925 40.653 M
91.704 38.685 L
84.925 30.006 L
cp
f
GR
GS
1 0.91 0.91 RC
N
111.642 70.912 M
111.642 61.389 L
103.713 63.887 L
cp
f
GR
GS
1 0.91 0.91 RC
N
103.713 53.985 M
103.713 63.887 L
111.642 61.389 L
cp
f
GR
GS
1 0.91 0.91 RC
N
118.839 66.711 M
118.839 75.947 L
125.426 72.361 L
cp
f
GR
GS
1 0.91 0.91 RC
N
198.888 55.85 M
192.035 70.036 L
198.888 71.387 L
cp
f
GR
GS
1 0.91 0.91 RC
N
205.94 54.615 M
205.94 69.243 L
212.406 74.481 L
cp
f
GR
GS
1 0.91 0.91 RC
N
205.94 54.615 M
198.888 55.85 L
205.94 69.243 L
cp
f
GR
GS
1 0.91 0.91 RC
N
239.5 131.354 M
232.898 129.025 L
232.898 137.404 L
cp
f
GR
GS
1 0.91 0.91 RC
N
232.898 137.404 M
232.898 129.025 L
226.264 130.996 L
cp
f
GR
GS
1 0.91 0.91 RC
N
212.406 85.885 M
219.012 110.202 L
219.012 100.183 L
cp
f
GR
GS
1 0.91 0.91 RC
N
246.035 137.949 M
239.5 131.354 L
239.5 139.934 L
cp
f
GR
GS
1 0.91 0.91 RC
N
226.264 130.996 M
226.264 122.295 L
219.012 110.202 L
cp
f
GR
GS
1 0.91 0.91 RC
N
226.264 130.996 M
232.898 129.025 L
226.264 122.295 L
cp
f
GR
GS
1 0.91 0.91 RC
N
252.888 137.575 M
246.035 129.295 L
246.035 137.949 L
cp
f
GR
GS
1 0.91 0.91 RC
N
239.5 131.354 M
246.035 137.949 L
246.035 129.295 L
cp
f
GR
GS
1 0.91 0.91 RC
N
252.888 128.904 M
246.035 129.295 L
252.888 137.575 L
cp
f
GR
GS
1 0.91 0.91 RC
N
252.888 137.575 M
259.564 132.72 L
252.888 128.904 L
cp
f
GR
GS
1 0.91 0.91 RC
N
259.564 132.72 M
252.888 137.575 L
259.564 141.633 L
cp
f
GR
GS
1 0.91 0.91 RC
N
273.328 156.599 M
266.406 143.063 L
266.406 151.691 L
cp
f
GR
GS
1 0.91 0.91 RC
N
266.406 143.063 M
259.564 141.633 L
266.406 151.691 L
cp
f
GR
GS
1 0.91 0.91 RC
N
259.564 132.72 M
259.564 141.633 L
266.406 143.063 L
cp
f
GR
GS
1 0.91 0.91 RC
N
279.975 167.19 M
273.328 156.599 L
273.328 165.25 L
cp
f
GR
GS
1 0.91 0.91 RC
N
307.093 200.746 M
313.752 195.48 L
307.093 191.448 L
cp
f
GR
GS
1 0.91 0.91 RC
N
300.258 186.732 M
293.5 180.599 L
293.5 189.368 L
cp
f
GR
GS
1 0.91 0.91 RC
N
313.752 204.982 M
320.578 200.08 L
313.752 195.48 L
cp
f
GR
GS
1 0.91 0.91 RC
N
300.258 195.805 M
300.258 186.732 L
293.5 189.368 L
cp
f
GR
GS
1 0.91 0.91 RC
N
307.093 200.746 M
313.752 204.982 L
313.752 195.48 L
cp
f
GR
GS
1 0.91 0.91 RC
N
286.633 182.694 M
293.5 180.599 L
286.633 173.974 L
cp
f
GR
GS
1 0.91 0.91 RC
N
279.975 175.593 M
279.975 167.19 L
273.328 165.25 L
cp
f
GR
GS
1 0.91 0.91 RC
N
286.633 182.694 M
286.633 173.974 L
279.975 175.593 L
cp
f
GR
GS
1 0.91 0.91 RC
N
320.578 209.765 M
320.578 200.08 L
313.752 204.982 L
cp
f
GR
GS
1 0.91 0.91 RC
N
327.328 213.247 M
327.328 203.689 L
320.578 209.765 L
cp
f
GR
GS
1 0.91 0.91 RC
N
333.975 217.335 M
333.975 207.776 L
327.328 213.247 L
cp
f
GR
GS
1 0.91 0.91 RC
N
340.766 212.152 M
333.975 207.776 L
333.975 217.335 L
cp
f
GR
GS
1 0.91 0.91 RC
N
347.5 216.437 M
340.766 221.657 L
347.5 226 L
cp
f
GR
GS
1 0.91 0.91 RC
N
340.766 212.152 M
333.975 217.335 L
340.766 221.657 L
cp
f
GR
GS
1 0.91 0.91 RC
N
226.264 122.295 M
219.012 100.183 L
219.012 110.202 L
cp
f
GR
GS
1 0.549 0.549 RC
1 LJ
0.5 LW
N
77.5 21.5 M
84.925 30.006 L
91.704 38.685 L
97.94 46.909 L
103.713 53.985 L
111.642 61.389 L
118.839 66.711 L
125.426 72.361 L
131.5 77.509 L
138.925 82.651 L
145.704 86.092 L
151.94 88.119 L
159.092 90.469 L
165.642 92.593 L
171.685 93.452 L
178.366 91.243 L
185.5 84.458 L
192.035 70.036 L
198.888 55.85 L
205.94 54.615 L
212.406 74.481 L
219.012 100.183 L
226.264 122.295 L
232.898 129.025 L
239.5 131.354 L
246.035 129.295 L
252.888 128.904 L
259.564 132.72 L
266.406 143.063 L
273.328 156.599 L
279.975 167.19 L
286.633 173.974 L
293.5 180.599 L
300.258 186.732 L
307.093 191.448 L
313.752 195.48 L
320.578 200.08 L
327.328 203.689 L
333.975 207.776 L
340.766 212.152 L
347.5 216.437 L
S
GR
GS
1 0.549 0.549 RC
1 LJ
0.5 LW
N
77.5 32.711 M
84.925 40.653 L
91.704 48.934 L
97.94 56.963 L
103.713 63.887 L
111.642 70.912 L
118.839 75.947 L
125.426 81.621 L
131.5 86.767 L
138.925 91.81 L
145.704 95.23 L
151.94 97.384 L
159.092 99.826 L
165.642 102.206 L
171.685 103.4 L
178.366 102.046 L
185.5 96.483 L
192.035 83.362 L
198.888 71.387 L
205.94 69.243 L
212.406 85.885 L
219.012 110.202 L
226.264 130.996 L
232.898 137.404 L
239.5 139.934 L
246.035 137.949 L
252.888 137.575 L
259.564 141.633 L
266.406 151.691 L
273.328 165.25 L
279.975 175.593 L
286.633 182.694 L
293.5 189.368 L
300.258 195.805 L
307.093 200.746 L
313.752 204.982 L
320.578 209.765 L
327.328 213.247 L
333.975 217.335 L
340.766 221.657 L
347.5 226 L
S
GR
GS
1 0 0 RC
1 LJ
3 LW
N
77.5 27.118 M
84.925 35.341 L
91.704 43.82 L
97.94 51.946 L
103.713 58.946 L
111.642 66.16 L
118.839 71.338 L
125.426 77 L
131.5 82.147 L
138.925 87.239 L
145.704 90.669 L
151.94 92.761 L
159.092 95.157 L
165.642 97.409 L
171.685 98.436 L
178.366 96.656 L
185.5 90.486 L
192.035 76.717 L
198.888 63.643 L
205.94 61.951 L
212.406 80.197 L
219.012 105.203 L
226.264 126.653 L
232.898 133.222 L
239.5 135.651 L
246.035 133.63 L
252.888 133.247 L
259.564 137.185 L
266.406 147.385 L
273.328 160.932 L
279.975 171.399 L
286.633 178.342 L
293.5 184.991 L
300.258 191.277 L
307.093 196.106 L
313.752 200.24 L
320.578 204.932 L
327.328 208.478 L
333.975 212.565 L
340.766 216.914 L
347.5 221.228 L
S
GR
GS
0.91 GC
N
239.5 119.068 M
246.035 118.361 L
239.5 107.658 L
cp
f
GR
GS
0.91 GC
N
178.366 126.041 M
171.685 119.978 L
171.685 131.541 L
cp
f
GR
GS
0.91 GC
N
259.564 115.114 M
252.888 109.589 L
246.035 118.361 L
cp
f
GR
GS
0.91 GC
N
307.093 159.731 M
300.258 158.361 L
300.258 169.628 L
cp
f
GR
GS
0.91 GC
N
300.258 158.361 M
293.5 153.404 L
286.633 158.471 L
cp
f
GR
GS
0.91 GC
N
171.685 119.978 M
165.642 120.98 L
171.685 131.541 L
cp
f
GR
GS
0.91 GC
N
198.888 107.825 M
185.5 104.769 L
192.035 111.521 L
cp
f
GR
GS
0.91 GC
N
111.642 84.848 M
103.713 76.667 L
97.94 81.663 L
cp
f
GR
GS
0.91 GC
N
145.704 113.645 M
138.925 109.526 L
131.5 114.479 L
cp
f
GR
GS
0.91 GC
N
151.94 128.013 M
151.94 117.173 L
145.704 124.611 L
cp
f
GR
GS
0.91 GC
N
178.366 113.545 M
171.685 119.978 L
185.5 117.647 L
cp
f
GR
GS
0.91 GC
N
111.642 84.848 M
97.94 81.663 L
103.713 88.153 L
cp
f
GR
GS
0.91 GC
N
273.328 140.918 M
273.328 129.319 L
266.406 132.298 L
cp
f
GR
GS
0.91 GC
N
239.5 119.068 M
239.5 107.658 L
232.898 109.329 L
cp
f
GR
GS
0.91 GC
N
84.925 52.864 M
77.5 44.512 L
77.5 56.799 L
cp
f
GR
GS
0.91 GC
N
103.713 76.667 M
91.704 73.471 L
97.94 81.663 L
cp
f
GR
GS
0.91 GC
N
307.093 171.538 M
307.093 159.731 L
300.258 169.628 L
cp
f
GR
GS
0.91 GC
N
327.328 166.807 M
320.578 163.193 L
313.752 173.015 L
cp
f
GR
GS
0.91 GC
N
145.704 124.611 M
151.94 117.173 L
138.925 120.535 L
cp
f
GR
GS
0.91 GC
N
159.092 131.114 M
165.642 120.98 L
159.092 120.4 L
cp
f
GR
GS
0.91 GC
N
165.642 131.966 M
165.642 120.98 L
159.092 131.114 L
cp
f
GR
GS
0.91 GC
N
151.94 128.013 M
159.092 120.4 L
151.94 117.173 L
cp
f
GR
GS
0.91 GC
N
151.94 128.013 M
159.092 131.114 L
159.092 120.4 L
cp
f
GR
GS
0.91 GC
N
171.685 131.541 M
165.642 120.98 L
165.642 131.966 L
cp
f
GR
GS
0.91 GC
N
185.5 117.647 M
171.685 119.978 L
178.366 126.041 L
cp
f
GR
GS
0.91 GC
N
198.888 107.825 M
212.406 106.378 L
205.94 100.067 L
cp
f
GR
GS
0.91 GC
N
178.366 113.545 M
192.035 111.521 L
185.5 104.769 L
cp
f
GR
GS
0.91 GC
N
185.5 104.769 M
198.888 107.825 L
192.035 98.898 L
cp
f
GR
GS
0.91 GC
N
219.012 111.099 M
205.94 112.207 L
212.406 117.531 L
cp
f
GR
GS
0.91 GC
N
212.406 106.378 M
198.888 107.825 L
205.94 112.207 L
cp
f
GR
GS
0.91 GC
N
138.925 109.526 M
125.426 109.305 L
131.5 114.479 L
cp
f
GR
GS
0.91 GC
N
145.704 113.645 M
131.5 114.479 L
138.925 120.535 L
cp
f
GR
GS
0.91 GC
N
151.94 117.173 M
145.704 113.645 L
138.925 120.535 L
cp
f
GR
GS
0.91 GC
N
192.035 111.521 M
178.366 113.545 L
185.5 117.647 L
cp
f
GR
GS
0.91 GC
N
91.704 61.731 M
77.5 56.799 L
84.925 64.778 L
cp
f
GR
GS
0.91 GC
N
103.713 76.667 M
97.94 70.038 L
91.704 73.471 L
cp
f
GR
GS
0.91 GC
N
84.925 64.778 M
91.704 73.471 L
97.94 70.038 L
cp
f
GR
GS
0.91 GC
N
111.642 96.251 M
111.642 84.848 L
103.713 88.153 L
cp
f
GR
GS
0.91 GC
N
97.94 70.038 M
91.704 61.731 L
84.925 64.778 L
cp
f
GR
GS
0.91 GC
N
91.704 61.731 M
84.925 52.864 L
77.5 56.799 L
cp
f
GR
GS
0.91 GC
N
125.426 98.23 M
118.839 92.106 L
111.642 96.251 L
cp
f
GR
GS
0.91 GC
N
118.839 92.106 M
111.642 84.848 L
111.642 96.251 L
cp
f
GR
GS
0.91 GC
N
118.839 103.409 M
125.426 98.23 L
111.642 96.251 L
cp
f
GR
GS
0.91 GC
N
198.888 107.825 M
205.94 100.067 L
192.035 98.898 L
cp
f
GR
GS
0.91 GC
N
239.5 107.658 M
246.035 118.361 L
246.035 107.104 L
cp
f
GR
GS
0.91 GC
N
131.5 103.468 M
125.426 98.23 L
118.839 103.409 L
cp
f
GR
GS
0.91 GC
N
125.426 109.305 M
131.5 103.468 L
118.839 103.409 L
cp
f
GR
GS
0.91 GC
N
138.925 109.526 M
131.5 103.468 L
125.426 109.305 L
cp
f
GR
GS
0.91 GC
N
198.888 95.258 M
192.035 98.898 L
205.94 100.067 L
cp
f
GR
GS
0.91 GC
N
219.012 111.099 M
212.406 106.378 L
205.94 112.207 L
cp
f
GR
GS
0.91 GC
N
226.264 112.308 M
226.264 123.132 L
232.898 120.533 L
cp
f
GR
GS
0.91 GC
N
246.035 118.361 M
252.888 109.589 L
246.035 107.104 L
cp
f
GR
GS
0.91 GC
N
219.012 121.893 M
226.264 123.132 L
226.264 112.308 L
cp
f
GR
GS
0.91 GC
N
219.012 121.893 M
219.012 111.099 L
212.406 117.531 L
cp
f
GR
GS
0.91 GC
N
219.012 121.893 M
226.264 112.308 L
219.012 111.099 L
cp
f
GR
GS
0.91 GC
N
232.898 120.533 M
239.5 119.068 L
232.898 109.329 L
cp
f
GR
GS
0.91 GC
N
226.264 112.308 M
232.898 120.533 L
232.898 109.329 L
cp
f
GR
GS
0.91 GC
N
252.888 120.999 M
259.564 115.114 L
246.035 118.361 L
cp
f
GR
GS
0.91 GC
N
259.564 126.202 M
266.406 121.116 L
252.888 120.999 L
cp
f
GR
GS
0.91 GC
N
266.406 132.298 M
273.328 129.319 L
259.564 126.202 L
cp
f
GR
GS
0.91 GC
N
252.888 120.999 M
266.406 121.116 L
259.564 115.114 L
cp
f
GR
GS
0.91 GC
N
307.093 171.538 M
313.752 161.055 L
307.093 159.731 L
cp
f
GR
GS
0.91 GC
N
259.564 126.202 M
273.328 129.319 L
266.406 121.116 L
cp
f
GR
GS
0.91 GC
N
313.752 161.055 M
307.093 171.538 L
313.752 173.015 L
cp
f
GR
GS
0.91 GC
N
300.258 169.628 M
300.258 158.361 L
293.5 164.863 L
cp
f
GR
GS
0.91 GC
N
286.633 158.471 M
293.5 153.404 L
279.975 149.369 L
cp
f
GR
GS
0.91 GC
N
273.328 140.918 M
279.975 137.754 L
273.328 129.319 L
cp
f
GR
GS
0.91 GC
N
273.328 140.918 M
279.975 149.369 L
279.975 137.754 L
cp
f
GR
GS
0.91 GC
N
293.5 164.863 M
300.258 158.361 L
286.633 158.471 L
cp
f
GR
GS
0.91 GC
N
279.975 149.369 M
286.633 146.859 L
279.975 137.754 L
cp
f
GR
GS
0.91 GC
N
279.975 149.369 M
293.5 153.404 L
286.633 146.859 L
cp
f
GR
GS
0.91 GC
N
313.752 173.015 M
320.578 163.193 L
313.752 161.055 L
cp
f
GR
GS
0.91 GC
N
320.578 175.609 M
327.328 166.807 L
313.752 173.015 L
cp
f
GR
GS
0.91 GC
N
333.975 171.004 M
327.328 166.807 L
320.578 175.609 L
cp
f
GR
GS
0.91 GC
N
327.328 179.439 M
333.975 171.004 L
320.578 175.609 L
cp
f
GR
GS
0.91 GC
N
340.766 173.58 M
327.328 179.439 L
333.975 183.537 L
cp
f
GR
GS
0.91 GC
N
340.766 173.58 M
333.975 171.004 L
327.328 179.439 L
cp
f
GR
GS
0.91 GC
N
347.5 178.244 M
340.766 186.283 L
347.5 190.84 L
cp
f
GR
GS
0.91 GC
N
347.5 178.244 M
333.975 183.537 L
340.766 186.283 L
cp
f
GR
GS
0.91 GC
N
333.975 183.537 M
347.5 178.244 L
340.766 173.58 L
cp
f
GR
GS
0.549 GC
1 LJ
0.5 LW
N
77.5 44.512 M
84.925 52.864 L
91.704 61.731 L
97.94 70.038 L
103.713 76.667 L
111.642 84.848 L
118.839 92.106 L
125.426 98.23 L
131.5 103.468 L
138.925 109.526 L
145.704 113.645 L
151.94 117.173 L
159.092 120.4 L
165.642 120.98 L
171.685 119.978 L
178.366 113.545 L
185.5 104.769 L
192.035 98.898 L
198.888 95.258 L
205.94 100.067 L
212.406 106.378 L
219.012 111.099 L
226.264 112.308 L
232.898 109.329 L
239.5 107.658 L
246.035 107.104 L
252.888 109.589 L
259.564 115.114 L
266.406 121.116 L
273.328 129.319 L
279.975 137.754 L
286.633 146.859 L
293.5 153.404 L
300.258 158.361 L
307.093 159.731 L
313.752 161.055 L
320.578 163.193 L
327.328 166.807 L
333.975 171.004 L
340.766 173.58 L
347.5 178.244 L
S
GR
GS
0.549 GC
1 LJ
0.5 LW
N
77.5 56.799 M
84.925 64.778 L
91.704 73.471 L
97.94 81.663 L
103.713 88.153 L
111.642 96.251 L
118.839 103.409 L
125.426 109.305 L
131.5 114.479 L
138.925 120.535 L
145.704 124.611 L
151.94 128.013 L
159.092 131.114 L
165.642 131.966 L
171.685 131.541 L
178.366 126.041 L
185.5 117.647 L
192.035 111.521 L
198.888 107.825 L
205.94 112.207 L
212.406 117.531 L
219.012 121.893 L
226.264 123.132 L
232.898 120.533 L
239.5 119.068 L
246.035 118.361 L
252.888 120.999 L
259.564 126.202 L
266.406 132.298 L
273.328 140.918 L
279.975 149.369 L
286.633 158.471 L
293.5 164.863 L
300.258 169.628 L
307.093 171.538 L
313.752 173.015 L
320.578 175.609 L
327.328 179.439 L
333.975 183.537 L
340.766 186.283 L
347.5 190.84 L
S
GR
GS
1 LJ
3 LW
N
77.5 50.671 M
84.925 58.836 L
91.704 67.615 L
97.94 75.864 L
103.713 82.423 L
111.642 90.563 L
118.839 97.77 L
125.426 103.78 L
131.5 108.986 L
138.925 115.043 L
145.704 119.14 L
151.94 122.605 L
159.092 125.769 L
165.642 126.485 L
171.685 125.773 L
178.366 119.809 L
185.5 111.225 L
192.035 105.226 L
198.888 101.558 L
205.94 106.152 L
212.406 111.967 L
219.012 116.508 L
226.264 117.732 L
232.898 114.944 L
239.5 113.376 L
246.035 112.746 L
252.888 115.307 L
259.564 120.671 L
266.406 126.72 L
273.328 135.132 L
279.975 143.575 L
286.633 152.679 L
293.5 159.147 L
300.258 164.008 L
307.093 165.649 L
313.752 167.05 L
320.578 169.417 L
327.328 173.139 L
333.975 177.287 L
340.766 179.948 L
347.5 184.558 L
S
GR
%%Trailer
%%Pages: 1
%%EOF
