%!PS-Adobe-3.0 EPSF-3.0
%%Creator: (MATLAB, The Mathworks, Inc. Version 9.4.0.813654 \(R2018a\). Operating System: Mac OS X)
%%Title: /Volumes/LNDG/Projects/StateSwitch/dynamic/data/eeg/rest/B_analyses/A_MSE_CSD_multiVariant/C_figures/Z_SummarySchematic.eps
%%CreationDate: 2020-04-23T11:42:12
%%Pages: (atend)
%%BoundingBox:    47    63   351   534
%%LanguageLevel: 3
%%EndComments
%%BeginProlog
%%BeginResource: procset (Apache XML Graphics Std ProcSet) 1.2 0
%%Version: 1.2 0
%%Copyright: (Copyright 2001-2003,2010 The Apache Software Foundation. License terms: http://www.apache.org/licenses/LICENSE-2.0)
/bd{bind def}bind def
/ld{load def}bd
/GR/grestore ld
/GS/gsave ld
/RM/rmoveto ld
/C/curveto ld
/t/show ld
/L/lineto ld
/ML/setmiterlimit ld
/CT/concat ld
/f/fill ld
/N/newpath ld
/S/stroke ld
/CC/setcmykcolor ld
/A/ashow ld
/cp/closepath ld
/RC/setrgbcolor ld
/LJ/setlinejoin ld
/GC/setgray ld
/LW/setlinewidth ld
/M/moveto ld
/re {4 2 roll M
1 index 0 rlineto
0 exch rlineto
neg 0 rlineto
cp } bd
/_ctm matrix def
/_tm matrix def
/BT { _ctm currentmatrix pop matrix _tm copy pop 0 0 moveto } bd
/ET { _ctm setmatrix } bd
/iTm { _ctm setmatrix _tm concat } bd
/Tm { _tm astore pop iTm 0 0 moveto } bd
/ux 0.0 def
/uy 0.0 def
/F {
  /Tp exch def
  /Tf exch def
  Tf findfont Tp scalefont setfont
  /cf Tf def  /cs Tp def
} bd
/ULS {currentpoint /uy exch def /ux exch def} bd
/ULE {
  /Tcx currentpoint pop def
  gsave
  newpath
  cf findfont cs scalefont dup
  /FontMatrix get 0 get /Ts exch def /FontInfo get dup
  /UnderlinePosition get Ts mul /To exch def
  /UnderlineThickness get Ts mul /Tt exch def
  ux uy To add moveto  Tcx uy To add lineto
  Tt setlinewidth stroke
  grestore
} bd
/OLE {
  /Tcx currentpoint pop def
  gsave
  newpath
  cf findfont cs scalefont dup
  /FontMatrix get 0 get /Ts exch def /FontInfo get dup
  /UnderlinePosition get Ts mul /To exch def
  /UnderlineThickness get Ts mul /Tt exch def
  ux uy To add cs add moveto Tcx uy To add cs add lineto
  Tt setlinewidth stroke
  grestore
} bd
/SOE {
  /Tcx currentpoint pop def
  gsave
  newpath
  cf findfont cs scalefont dup
  /FontMatrix get 0 get /Ts exch def /FontInfo get dup
  /UnderlinePosition get Ts mul /To exch def
  /UnderlineThickness get Ts mul /Tt exch def
  ux uy To add cs 10 mul 26 idiv add moveto Tcx uy To add cs 10 mul 26 idiv add lineto
  Tt setlinewidth stroke
  grestore
} bd
/QT {
/Y22 exch store
/X22 exch store
/Y21 exch store
/X21 exch store
currentpoint
/Y21 load 2 mul add 3 div exch
/X21 load 2 mul add 3 div exch
/X21 load 2 mul /X22 load add 3 div
/Y21 load 2 mul /Y22 load add 3 div
/X22 load /Y22 load curveto
} bd
/SSPD {
dup length /d exch dict def
{
/v exch def
/k exch def
currentpagedevice k known {
/cpdv currentpagedevice k get def
v cpdv ne {
/upd false def
/nullv v type /nulltype eq def
/nullcpdv cpdv type /nulltype eq def
nullv nullcpdv or
{
/upd true def
} {
/sametype v type cpdv type eq def
sametype {
v type /arraytype eq {
/vlen v length def
/cpdvlen cpdv length def
vlen cpdvlen eq {
0 1 vlen 1 sub {
/i exch def
/obj v i get def
/cpdobj cpdv i get def
obj cpdobj ne {
/upd true def
exit
} if
} for
} {
/upd true def
} ifelse
} {
v type /dicttype eq {
v {
/dv exch def
/dk exch def
/cpddv cpdv dk get def
dv cpddv ne {
/upd true def
exit
} if
} forall
} {
/upd true def
} ifelse
} ifelse
} if
} ifelse
upd true eq {
d k v put
} if
} if
} if
} forall
d length 0 gt {
d setpagedevice
} if
} bd
/RE { % /NewFontName [NewEncodingArray] /FontName RE -
  findfont dup length dict begin
  {
    1 index /FID ne
    {def} {pop pop} ifelse
  } forall
  /Encoding exch def
  /FontName 1 index def
  currentdict definefont pop
  end
} bind def
%%EndResource
%%BeginResource: procset (Apache XML Graphics EPS ProcSet) 1.0 0
%%Version: 1.0 0
%%Copyright: (Copyright 2002-2003 The Apache Software Foundation. License terms: http://www.apache.org/licenses/LICENSE-2.0)
/BeginEPSF { %def
/b4_Inc_state save def         % Save state for cleanup
/dict_count countdictstack def % Count objects on dict stack
/op_count count 1 sub def      % Count objects on operand stack
userdict begin                 % Push userdict on dict stack
/showpage { } def              % Redefine showpage, { } = null proc
0 setgray 0 setlinecap         % Prepare graphics state
1 setlinewidth 0 setlinejoin
10 setmiterlimit [ ] 0 setdash newpath
/languagelevel where           % If level not equal to 1 then
{pop languagelevel             % set strokeadjust and
1 ne                           % overprint to their defaults.
{false setstrokeadjust false setoverprint
} if
} if
} bd
/EndEPSF { %def
count op_count sub {pop} repeat            % Clean up stacks
countdictstack dict_count sub {end} repeat
b4_Inc_state restore
} bd
%%EndResource
%FOPBeginFontDict
%%IncludeResource: font Courier-Oblique
%%IncludeResource: font Courier-BoldOblique
%%IncludeResource: font Courier-Bold
%%IncludeResource: font ZapfDingbats
%%IncludeResource: font Symbol
%%IncludeResource: font Helvetica
%%IncludeResource: font Helvetica-Oblique
%%IncludeResource: font Helvetica-Bold
%%IncludeResource: font Helvetica-BoldOblique
%%IncludeResource: font Times-Roman
%%IncludeResource: font Times-Italic
%%IncludeResource: font Times-Bold
%%IncludeResource: font Times-BoldItalic
%%IncludeResource: font Courier
%FOPEndFontDict
%%BeginResource: encoding WinAnsiEncoding
/WinAnsiEncoding [
/.notdef /.notdef /.notdef /.notdef /.notdef
/.notdef /.notdef /.notdef /.notdef /.notdef
/.notdef /.notdef /.notdef /.notdef /.notdef
/.notdef /.notdef /.notdef /.notdef /.notdef
/.notdef /.notdef /.notdef /.notdef /.notdef
/.notdef /.notdef /.notdef /.notdef /.notdef
/.notdef /.notdef /space /exclam /quotedbl
/numbersign /dollar /percent /ampersand /quotesingle
/parenleft /parenright /asterisk /plus /comma
/hyphen /period /slash /zero /one
/two /three /four /five /six
/seven /eight /nine /colon /semicolon
/less /equal /greater /question /at
/A /B /C /D /E
/F /G /H /I /J
/K /L /M /N /O
/P /Q /R /S /T
/U /V /W /X /Y
/Z /bracketleft /backslash /bracketright /asciicircum
/underscore /quoteleft /a /b /c
/d /e /f /g /h
/i /j /k /l /m
/n /o /p /q /r
/s /t /u /v /w
/x /y /z /braceleft /bar
/braceright /asciitilde /bullet /Euro /bullet
/quotesinglbase /florin /quotedblbase /ellipsis /dagger
/daggerdbl /circumflex /perthousand /Scaron /guilsinglleft
/OE /bullet /Zcaron /bullet /bullet
/quoteleft /quoteright /quotedblleft /quotedblright /bullet
/endash /emdash /asciitilde /trademark /scaron
/guilsinglright /oe /bullet /zcaron /Ydieresis
/space /exclamdown /cent /sterling /currency
/yen /brokenbar /section /dieresis /copyright
/ordfeminine /guillemotleft /logicalnot /sfthyphen /registered
/macron /degree /plusminus /twosuperior /threesuperior
/acute /mu /paragraph /middot /cedilla
/onesuperior /ordmasculine /guillemotright /onequarter /onehalf
/threequarters /questiondown /Agrave /Aacute /Acircumflex
/Atilde /Adieresis /Aring /AE /Ccedilla
/Egrave /Eacute /Ecircumflex /Edieresis /Igrave
/Iacute /Icircumflex /Idieresis /Eth /Ntilde
/Ograve /Oacute /Ocircumflex /Otilde /Odieresis
/multiply /Oslash /Ugrave /Uacute /Ucircumflex
/Udieresis /Yacute /Thorn /germandbls /agrave
/aacute /acircumflex /atilde /adieresis /aring
/ae /ccedilla /egrave /eacute /ecircumflex
/edieresis /igrave /iacute /icircumflex /idieresis
/eth /ntilde /ograve /oacute /ocircumflex
/otilde /odieresis /divide /oslash /ugrave
/uacute /ucircumflex /udieresis /yacute /thorn
/ydieresis
] def
%%EndResource
%FOPBeginFontReencode
/Courier-Oblique findfont
dup length dict begin
  {1 index /FID ne {def} {pop pop} ifelse} forall
  /Encoding WinAnsiEncoding def
  currentdict
end
/Courier-Oblique exch definefont pop
/Courier-BoldOblique findfont
dup length dict begin
  {1 index /FID ne {def} {pop pop} ifelse} forall
  /Encoding WinAnsiEncoding def
  currentdict
end
/Courier-BoldOblique exch definefont pop
/Courier-Bold findfont
dup length dict begin
  {1 index /FID ne {def} {pop pop} ifelse} forall
  /Encoding WinAnsiEncoding def
  currentdict
end
/Courier-Bold exch definefont pop
/Helvetica findfont
dup length dict begin
  {1 index /FID ne {def} {pop pop} ifelse} forall
  /Encoding WinAnsiEncoding def
  currentdict
end
/Helvetica exch definefont pop
/Helvetica-Oblique findfont
dup length dict begin
  {1 index /FID ne {def} {pop pop} ifelse} forall
  /Encoding WinAnsiEncoding def
  currentdict
end
/Helvetica-Oblique exch definefont pop
/Helvetica-Bold findfont
dup length dict begin
  {1 index /FID ne {def} {pop pop} ifelse} forall
  /Encoding WinAnsiEncoding def
  currentdict
end
/Helvetica-Bold exch definefont pop
/Helvetica-BoldOblique findfont
dup length dict begin
  {1 index /FID ne {def} {pop pop} ifelse} forall
  /Encoding WinAnsiEncoding def
  currentdict
end
/Helvetica-BoldOblique exch definefont pop
/Times-Roman findfont
dup length dict begin
  {1 index /FID ne {def} {pop pop} ifelse} forall
  /Encoding WinAnsiEncoding def
  currentdict
end
/Times-Roman exch definefont pop
/Times-Italic findfont
dup length dict begin
  {1 index /FID ne {def} {pop pop} ifelse} forall
  /Encoding WinAnsiEncoding def
  currentdict
end
/Times-Italic exch definefont pop
/Times-Bold findfont
dup length dict begin
  {1 index /FID ne {def} {pop pop} ifelse} forall
  /Encoding WinAnsiEncoding def
  currentdict
end
/Times-Bold exch definefont pop
/Times-BoldItalic findfont
dup length dict begin
  {1 index /FID ne {def} {pop pop} ifelse} forall
  /Encoding WinAnsiEncoding def
  currentdict
end
/Times-BoldItalic exch definefont pop
/Courier findfont
dup length dict begin
  {1 index /FID ne {def} {pop pop} ifelse} forall
  /Encoding WinAnsiEncoding def
  currentdict
end
/Courier exch definefont pop
%FOPEndFontReencode
%%EndProlog
%%Page: 1 1
%%PageBoundingBox: 0 0 384 576
%%BeginPageSetup
[1 0 0 -1 0 576] CT
%%EndPageSetup
GS
1 GC
N
0 0 384 576 re
f
GR
GS
1 GC
N
0 0 384 576 re
f
GR
GS
1 GC
N
50 239.5 M
347.5 239.5 L
347.5 43 L
50 43 L
cp
f
GR
GS
1 0 0 RC
1 LJ
5 LW
N
50.204 53.379 M
58.414 60.541 L
65.909 67.976 L
72.803 75.15 L
79.186 81.368 L
87.953 87.814 L
95.91 92.465 L
103.193 97.572 L
109.909 102.237 L
118.118 106.87 L
125.613 110.002 L
132.507 111.916 L
140.415 114.113 L
147.658 116.182 L
154.338 117.127 L
161.726 115.49 L
169.613 109.834 L
176.838 97.317 L
184.415 85.561 L
192.212 84.048 L
199.361 100.467 L
206.665 123.371 L
214.683 143.396 L
222.018 149.599 L
229.317 151.901 L
236.542 149.985 L
244.119 149.623 L
251.501 153.357 L
259.065 163.087 L
266.718 176.137 L
274.068 186.319 L
281.429 193.122 L
289.021 199.674 L
296.494 205.899 L
304.05 210.704 L
311.413 214.833 L
318.959 219.536 L
326.423 223.101 L
333.772 227.224 L
341.28 231.627 L
347.535 235.309 L
S
GR
GS
1 LJ
5 LW
N
50.204 74.021 M
58.414 81.27 L
65.909 89.119 L
72.803 96.546 L
79.186 102.487 L
87.953 109.904 L
95.91 116.514 L
103.193 122.055 L
109.909 126.877 L
118.118 132.513 L
125.613 136.342 L
132.507 139.59 L
140.415 142.563 L
147.658 143.238 L
154.338 142.568 L
161.726 136.968 L
169.613 128.958 L
176.838 123.392 L
184.415 120.003 L
192.212 124.25 L
199.361 129.648 L
206.665 133.881 L
214.683 135.025 L
222.018 132.421 L
229.317 130.96 L
236.542 130.372 L
244.119 132.76 L
251.501 137.775 L
259.065 143.459 L
266.718 151.409 L
274.068 159.444 L
281.429 168.17 L
289.021 174.409 L
296.494 179.12 L
304.05 180.715 L
311.413 182.078 L
318.959 184.385 L
326.423 188.021 L
333.772 192.086 L
341.28 194.701 L
347.535 198.519 L
S
GR
GS
1 0.91 0.91 RC
N
109.909 98.312 M
118.118 102.833 L
125.613 106.967 L
132.507 110.776 L
140.415 115.151 L
147.658 119.165 L
154.338 122.873 L
161.726 126.982 L
169.613 131.377 L
176.838 135.412 L
184.415 139.651 L
192.212 144.023 L
199.361 148.041 L
206.665 152.154 L
214.683 156.679 L
222.018 160.828 L
229.317 164.965 L
236.542 169.068 L
244.119 173.38 L
251.501 177.588 L
259.065 181.908 L
266.718 186.286 L
274.068 190.498 L
281.429 194.723 L
289.021 199.087 L
296.494 203.387 L
304.05 207.741 L
311.413 211.989 L
318.959 216.347 L
326.423 220.662 L
333.772 224.914 L
341.28 229.262 L
347.535 232.888 L
347.535 224.659 L
347.535 223.133 L
341.28 219.714 L
333.772 215.609 L
326.423 211.586 L
318.959 207.497 L
311.413 203.357 L
304.05 199.315 L
296.494 195.16 L
289.021 191.047 L
281.429 186.861 L
274.068 182.797 L
266.718 178.733 L
259.065 174.494 L
251.501 170.297 L
244.119 166.193 L
236.542 161.973 L
229.317 157.94 L
222.018 153.858 L
214.683 149.748 L
206.665 145.245 L
199.361 141.134 L
192.212 137.101 L
184.415 132.694 L
176.838 128.402 L
169.613 124.301 L
161.726 119.815 L
154.338 115.605 L
147.658 111.792 L
140.415 107.65 L
132.507 103.121 L
125.613 99.166 L
118.118 94.861 L
109.909 90.138 L
103.193 86.27 L
95.91 82.07 L
87.953 77.477 L
79.186 72.41 L
72.803 68.717 L
65.909 64.726 L
58.414 60.383 L
50.204 55.622 L
50.204 65.6 L
58.414 70.084 L
65.909 74.18 L
72.803 77.952 L
79.186 81.447 L
87.953 86.251 L
95.91 90.617 L
103.193 94.619 L
cp
f
GR
GS
1 0.549 0.549 RC
1 LJ
0.5 LW
N
50.204 55.622 M
58.414 60.383 L
65.909 64.726 L
72.803 68.717 L
79.186 72.41 L
87.953 77.477 L
95.91 82.07 L
103.193 86.27 L
109.909 90.138 L
118.118 94.861 L
125.613 99.166 L
132.507 103.121 L
140.415 107.65 L
147.658 111.792 L
154.338 115.605 L
161.726 119.815 L
169.613 124.301 L
176.838 128.402 L
184.415 132.694 L
192.212 137.101 L
199.361 141.134 L
206.665 145.245 L
214.683 149.748 L
222.018 153.858 L
229.317 157.94 L
236.542 161.973 L
244.119 166.193 L
251.501 170.297 L
259.065 174.494 L
266.718 178.733 L
274.068 182.797 L
281.429 186.861 L
289.021 191.047 L
296.494 195.16 L
304.05 199.315 L
311.413 203.357 L
318.959 207.497 L
326.423 211.586 L
333.772 215.609 L
341.28 219.714 L
347.535 223.133 L
S
GR
GS
1 0.549 0.549 RC
1 LJ
0.5 LW
N
50.204 65.6 M
58.414 70.084 L
65.909 74.18 L
72.803 77.952 L
79.186 81.447 L
87.953 86.251 L
95.91 90.617 L
103.193 94.619 L
109.909 98.312 L
118.118 102.833 L
125.613 106.967 L
132.507 110.776 L
140.415 115.151 L
147.658 119.165 L
154.338 122.873 L
161.726 126.982 L
169.613 131.377 L
176.838 135.412 L
184.415 139.651 L
192.212 144.023 L
199.361 148.041 L
206.665 152.154 L
214.683 156.679 L
222.018 160.828 L
229.317 164.965 L
236.542 169.068 L
244.119 173.38 L
251.501 177.588 L
259.065 181.908 L
266.718 186.286 L
274.068 190.498 L
281.429 194.723 L
289.021 199.087 L
296.494 203.387 L
304.05 207.741 L
311.413 211.989 L
318.959 216.347 L
326.423 220.662 L
333.772 224.914 L
341.28 229.262 L
347.535 232.888 L
S
GR
GS
1 0 0 RC
[8 8] 0 setdash
2 LJ
2 LW
N
50.204 60.611 M
58.414 65.233 L
65.909 69.453 L
72.803 73.335 L
79.186 76.928 L
87.953 81.864 L
95.91 86.344 L
103.193 90.444 L
109.909 94.225 L
118.118 98.847 L
125.613 103.067 L
132.507 106.948 L
140.415 111.401 L
147.658 115.478 L
154.338 119.239 L
161.726 123.399 L
169.613 127.839 L
176.838 131.907 L
184.415 136.173 L
192.212 140.562 L
199.361 144.587 L
206.665 148.699 L
214.683 153.214 L
222.018 157.343 L
229.317 161.453 L
236.542 165.521 L
244.119 169.787 L
251.501 173.942 L
259.065 178.201 L
266.718 182.51 L
274.068 186.648 L
281.429 190.792 L
289.021 195.067 L
296.494 199.274 L
304.05 203.528 L
311.413 207.673 L
318.959 211.922 L
326.423 216.124 L
333.772 220.261 L
341.28 224.488 L
347.535 228.01 L
S
GR
GS
0.91 GC
N
192.212 143.872 M
199.361 146.111 L
206.665 148.408 L
214.683 150.941 L
222.018 153.268 L
229.317 155.592 L
236.542 157.901 L
244.119 160.332 L
251.501 162.708 L
259.065 165.151 L
266.718 167.631 L
274.068 170.019 L
281.429 172.417 L
289.021 174.897 L
296.494 177.344 L
304.05 179.824 L
311.413 182.245 L
318.959 184.732 L
326.423 187.195 L
333.772 189.625 L
341.28 192.112 L
347.535 194.186 L
347.535 183.379 L
347.535 181.372 L
341.28 179.554 L
333.772 177.367 L
326.423 175.224 L
318.959 173.043 L
311.413 170.833 L
304.05 168.672 L
296.494 166.449 L
289.021 164.246 L
281.429 162.001 L
274.068 159.818 L
266.718 157.633 L
259.065 155.349 L
251.501 153.085 L
244.119 150.867 L
236.542 148.582 L
229.317 146.395 L
222.018 144.177 L
214.683 141.939 L
206.665 139.482 L
199.361 137.233 L
192.212 135.024 L
184.415 132.603 L
176.838 130.239 L
169.613 127.976 L
161.726 125.495 L
154.338 123.16 L
147.658 121.041 L
140.415 118.735 L
132.507 116.208 L
125.613 113.996 L
118.118 111.584 L
109.909 108.933 L
103.193 106.757 L
95.91 104.391 L
87.953 101.799 L
79.186 98.935 L
72.803 96.845 L
65.909 94.582 L
58.414 92.118 L
50.204 89.413 L
50.204 101.107 L
58.414 103.511 L
65.909 105.711 L
72.803 107.74 L
79.186 109.622 L
87.953 112.213 L
95.91 114.573 L
103.193 116.739 L
109.909 118.743 L
118.118 121.201 L
125.613 123.453 L
132.507 125.532 L
140.415 127.926 L
147.658 130.127 L
154.338 132.165 L
161.726 134.429 L
169.613 136.856 L
176.838 139.089 L
184.415 141.441 L
cp
f
GR
GS
0.549 GC
1 LJ
0.5 LW
N
50.204 89.413 M
58.414 92.118 L
65.909 94.582 L
72.803 96.845 L
79.186 98.935 L
87.953 101.799 L
95.91 104.391 L
103.193 106.757 L
109.909 108.933 L
118.118 111.584 L
125.613 113.996 L
132.507 116.208 L
140.415 118.735 L
147.658 121.041 L
154.338 123.16 L
161.726 125.495 L
169.613 127.976 L
176.838 130.239 L
184.415 132.603 L
192.212 135.024 L
199.361 137.233 L
206.665 139.482 L
214.683 141.939 L
222.018 144.177 L
229.317 146.395 L
236.542 148.582 L
244.119 150.867 L
251.501 153.085 L
259.065 155.349 L
266.718 157.633 L
274.068 159.818 L
281.429 162.001 L
289.021 164.246 L
296.494 166.449 L
304.05 168.672 L
311.413 170.833 L
318.959 173.043 L
326.423 175.224 L
333.772 177.367 L
341.28 179.554 L
347.535 181.372 L
S
GR
GS
0.549 GC
1 LJ
0.5 LW
N
50.204 101.107 M
58.414 103.511 L
65.909 105.711 L
72.803 107.74 L
79.186 109.622 L
87.953 112.213 L
95.91 114.573 L
103.193 116.739 L
109.909 118.743 L
118.118 121.201 L
125.613 123.453 L
132.507 125.532 L
140.415 127.926 L
147.658 130.127 L
154.338 132.165 L
161.726 134.429 L
169.613 136.856 L
176.838 139.089 L
184.415 141.441 L
192.212 143.872 L
199.361 146.111 L
206.665 148.408 L
214.683 150.941 L
222.018 153.268 L
229.317 155.592 L
236.542 157.901 L
244.119 160.332 L
251.501 162.708 L
259.065 165.151 L
266.718 167.631 L
274.068 170.019 L
281.429 172.417 L
289.021 174.897 L
296.494 177.344 L
304.05 179.824 L
311.413 182.245 L
318.959 184.732 L
326.423 187.195 L
333.772 189.625 L
341.28 192.112 L
347.535 194.186 L
S
GR
GS
[8 8] 0 setdash
2 LJ
2 LW
N
50.204 95.26 M
58.414 97.815 L
65.909 100.147 L
72.803 102.292 L
79.186 104.278 L
87.953 107.006 L
95.91 109.482 L
103.193 111.748 L
109.909 113.838 L
118.118 116.392 L
125.613 118.725 L
132.507 120.87 L
140.415 123.33 L
147.658 125.584 L
154.338 127.663 L
161.726 129.962 L
169.613 132.416 L
176.838 134.664 L
184.415 137.022 L
192.212 139.448 L
199.361 141.672 L
206.665 143.945 L
214.683 146.44 L
222.018 148.722 L
229.317 150.994 L
236.542 153.242 L
244.119 155.6 L
251.501 157.896 L
259.065 160.25 L
266.718 162.632 L
274.068 164.918 L
281.429 167.209 L
289.021 169.572 L
296.494 171.897 L
304.05 174.248 L
311.413 176.539 L
318.959 178.887 L
326.423 181.209 L
333.772 183.496 L
341.28 185.832 L
347.535 187.779 L
S
GR
GS
1 GC
N
50 512.5 M
347.5 512.5 L
347.5 316 L
50 316 L
cp
f
GR
GS
1 0 0 RC
1 LJ
5 LW
N
50 449.313 M
57.438 380.6 L
64.875 362.975 L
72.313 358.848 L
79.75 357.204 L
87.188 355.747 L
94.625 354.41 L
102.063 353.706 L
109.5 353.556 L
116.938 353.728 L
124.375 354.14 L
131.813 354.685 L
139.25 355.382 L
146.688 356.603 L
154.125 358.351 L
161.563 360.729 L
169 363.451 L
176.438 366.8 L
183.875 370.312 L
191.313 374.032 L
198.75 377.557 L
206.188 380.692 L
213.625 383.321 L
221.063 385.399 L
228.5 386.908 L
235.938 388.075 L
243.375 388.853 L
250.813 389.416 L
258.25 389.949 L
265.688 390.766 L
273.125 391.78 L
280.563 392.836 L
288 394.121 L
295.438 395.422 L
302.875 396.842 L
310.313 398.188 L
317.75 399.378 L
325.188 400.682 L
332.625 401.741 L
340.063 402.959 L
347.5 403.801 L
347.535 403.806 L
S
GR
GS
1 LJ
5 LW
N
50 418.711 M
57.438 334.828 L
64.875 324.179 L
72.313 329.192 L
79.75 335.831 L
87.188 341.398 L
94.625 346.576 L
102.063 352.206 L
109.5 358.52 L
116.938 364.896 L
124.375 370.947 L
131.813 376.572 L
139.25 381.764 L
146.688 386.762 L
154.125 391.631 L
161.563 396.308 L
169 400.859 L
176.438 405.114 L
183.875 409.142 L
191.313 412.874 L
198.75 416.35 L
206.188 419.347 L
213.625 422.131 L
221.063 424.474 L
228.5 426.564 L
235.938 428.249 L
243.375 429.63 L
250.813 431.071 L
258.25 432.017 L
265.688 433.116 L
273.125 434.018 L
280.563 434.884 L
288 435.715 L
295.438 436.476 L
302.875 437.223 L
310.313 438.017 L
317.75 438.798 L
325.188 439.41 L
332.625 439.99 L
340.063 440.612 L
347.5 441.124 L
347.535 441.127 L
S
GR
GS
[1 0 0 1 147.5 466] CT
/Helvetica 20 F
GS
[1 0 0 1 0 0] CT
0 7.5 moveto 
1 -1 scale
(Younger adults) t 
GR
GR
GS
1 0 0 RC
1 LJ
5 LW
N
114.5 466 M
144.5 466 L
S
GR
GS
[1 0 0 1 147.5 490.5] CT
/Helvetica 20 F
GS
[1 0 0 1 0 0] CT
0 7.5 moveto 
1 -1 scale
(Older adults) t 
GR
GR
GS
1 LJ
5 LW
N
114.5 490.5 M
144.5 490.5 L
S
GR
%%Trailer
%%Pages: 1
%%EOF
