%!PS-Adobe-3.0 EPSF-3.0
%%Creator: (MATLAB, The Mathworks, Inc. Version 9.3.0.713579 \(R2017b\). Operating System: Mac OS X)
%%Title: /Volumes/LNDG/Projects/StateSwitch/dynamic/data/eeg/rest/B_analyses/A_MSE_CSD_multiVariant/C_figures/F4_FastScalePSDassociation_byMethod_CorrelationOnly.eps
%%CreationDate: 2020-03-16T16:26:37
%%Pages: (atend)
%%BoundingBox:    29     0   742   425
%%LanguageLevel: 3
%%EndComments
%%BeginProlog
%%BeginResource: procset (Apache XML Graphics Std ProcSet) 1.2 0
%%Version: 1.2 0
%%Copyright: (Copyright 2001-2003,2010 The Apache Software Foundation. License terms: http://www.apache.org/licenses/LICENSE-2.0)
/bd{bind def}bind def
/ld{load def}bd
/GR/grestore ld
/GS/gsave ld
/RM/rmoveto ld
/C/curveto ld
/t/show ld
/L/lineto ld
/ML/setmiterlimit ld
/CT/concat ld
/f/fill ld
/N/newpath ld
/S/stroke ld
/CC/setcmykcolor ld
/A/ashow ld
/cp/closepath ld
/RC/setrgbcolor ld
/LJ/setlinejoin ld
/GC/setgray ld
/LW/setlinewidth ld
/M/moveto ld
/re {4 2 roll M
1 index 0 rlineto
0 exch rlineto
neg 0 rlineto
cp } bd
/_ctm matrix def
/_tm matrix def
/BT { _ctm currentmatrix pop matrix _tm copy pop 0 0 moveto } bd
/ET { _ctm setmatrix } bd
/iTm { _ctm setmatrix _tm concat } bd
/Tm { _tm astore pop iTm 0 0 moveto } bd
/ux 0.0 def
/uy 0.0 def
/F {
  /Tp exch def
  /Tf exch def
  Tf findfont Tp scalefont setfont
  /cf Tf def  /cs Tp def
} bd
/ULS {currentpoint /uy exch def /ux exch def} bd
/ULE {
  /Tcx currentpoint pop def
  gsave
  newpath
  cf findfont cs scalefont dup
  /FontMatrix get 0 get /Ts exch def /FontInfo get dup
  /UnderlinePosition get Ts mul /To exch def
  /UnderlineThickness get Ts mul /Tt exch def
  ux uy To add moveto  Tcx uy To add lineto
  Tt setlinewidth stroke
  grestore
} bd
/OLE {
  /Tcx currentpoint pop def
  gsave
  newpath
  cf findfont cs scalefont dup
  /FontMatrix get 0 get /Ts exch def /FontInfo get dup
  /UnderlinePosition get Ts mul /To exch def
  /UnderlineThickness get Ts mul /Tt exch def
  ux uy To add cs add moveto Tcx uy To add cs add lineto
  Tt setlinewidth stroke
  grestore
} bd
/SOE {
  /Tcx currentpoint pop def
  gsave
  newpath
  cf findfont cs scalefont dup
  /FontMatrix get 0 get /Ts exch def /FontInfo get dup
  /UnderlinePosition get Ts mul /To exch def
  /UnderlineThickness get Ts mul /Tt exch def
  ux uy To add cs 10 mul 26 idiv add moveto Tcx uy To add cs 10 mul 26 idiv add lineto
  Tt setlinewidth stroke
  grestore
} bd
/QT {
/Y22 exch store
/X22 exch store
/Y21 exch store
/X21 exch store
currentpoint
/Y21 load 2 mul add 3 div exch
/X21 load 2 mul add 3 div exch
/X21 load 2 mul /X22 load add 3 div
/Y21 load 2 mul /Y22 load add 3 div
/X22 load /Y22 load curveto
} bd
/SSPD {
dup length /d exch dict def
{
/v exch def
/k exch def
currentpagedevice k known {
/cpdv currentpagedevice k get def
v cpdv ne {
/upd false def
/nullv v type /nulltype eq def
/nullcpdv cpdv type /nulltype eq def
nullv nullcpdv or
{
/upd true def
} {
/sametype v type cpdv type eq def
sametype {
v type /arraytype eq {
/vlen v length def
/cpdvlen cpdv length def
vlen cpdvlen eq {
0 1 vlen 1 sub {
/i exch def
/obj v i get def
/cpdobj cpdv i get def
obj cpdobj ne {
/upd true def
exit
} if
} for
} {
/upd true def
} ifelse
} {
v type /dicttype eq {
v {
/dv exch def
/dk exch def
/cpddv cpdv dk get def
dv cpddv ne {
/upd true def
exit
} if
} forall
} {
/upd true def
} ifelse
} ifelse
} if
} ifelse
upd true eq {
d k v put
} if
} if
} if
} forall
d length 0 gt {
d setpagedevice
} if
} bd
/RE { % /NewFontName [NewEncodingArray] /FontName RE -
  findfont dup length dict begin
  {
    1 index /FID ne
    {def} {pop pop} ifelse
  } forall
  /Encoding exch def
  /FontName 1 index def
  currentdict definefont pop
  end
} bind def
%%EndResource
%%BeginResource: procset (Apache XML Graphics EPS ProcSet) 1.0 0
%%Version: 1.0 0
%%Copyright: (Copyright 2002-2003 The Apache Software Foundation. License terms: http://www.apache.org/licenses/LICENSE-2.0)
/BeginEPSF { %def
/b4_Inc_state save def         % Save state for cleanup
/dict_count countdictstack def % Count objects on dict stack
/op_count count 1 sub def      % Count objects on operand stack
userdict begin                 % Push userdict on dict stack
/showpage { } def              % Redefine showpage, { } = null proc
0 setgray 0 setlinecap         % Prepare graphics state
1 setlinewidth 0 setlinejoin
10 setmiterlimit [ ] 0 setdash newpath
/languagelevel where           % If level not equal to 1 then
{pop languagelevel             % set strokeadjust and
1 ne                           % overprint to their defaults.
{false setstrokeadjust false setoverprint
} if
} if
} bd
/EndEPSF { %def
count op_count sub {pop} repeat            % Clean up stacks
countdictstack dict_count sub {end} repeat
b4_Inc_state restore
} bd
%%EndResource
%FOPBeginFontDict
%%IncludeResource: font Courier-Oblique
%%IncludeResource: font Courier-BoldOblique
%%IncludeResource: font Courier-Bold
%%IncludeResource: font ZapfDingbats
%%IncludeResource: font Symbol
%%IncludeResource: font Helvetica
%%IncludeResource: font Helvetica-Oblique
%%IncludeResource: font Helvetica-Bold
%%IncludeResource: font Helvetica-BoldOblique
%%IncludeResource: font Times-Roman
%%IncludeResource: font Times-Italic
%%IncludeResource: font Times-Bold
%%IncludeResource: font Times-BoldItalic
%%IncludeResource: font Courier
%FOPEndFontDict
%%BeginResource: encoding WinAnsiEncoding
/WinAnsiEncoding [
/.notdef /.notdef /.notdef /.notdef /.notdef
/.notdef /.notdef /.notdef /.notdef /.notdef
/.notdef /.notdef /.notdef /.notdef /.notdef
/.notdef /.notdef /.notdef /.notdef /.notdef
/.notdef /.notdef /.notdef /.notdef /.notdef
/.notdef /.notdef /.notdef /.notdef /.notdef
/.notdef /.notdef /space /exclam /quotedbl
/numbersign /dollar /percent /ampersand /quotesingle
/parenleft /parenright /asterisk /plus /comma
/hyphen /period /slash /zero /one
/two /three /four /five /six
/seven /eight /nine /colon /semicolon
/less /equal /greater /question /at
/A /B /C /D /E
/F /G /H /I /J
/K /L /M /N /O
/P /Q /R /S /T
/U /V /W /X /Y
/Z /bracketleft /backslash /bracketright /asciicircum
/underscore /quoteleft /a /b /c
/d /e /f /g /h
/i /j /k /l /m
/n /o /p /q /r
/s /t /u /v /w
/x /y /z /braceleft /bar
/braceright /asciitilde /bullet /Euro /bullet
/quotesinglbase /florin /quotedblbase /ellipsis /dagger
/daggerdbl /circumflex /perthousand /Scaron /guilsinglleft
/OE /bullet /Zcaron /bullet /bullet
/quoteleft /quoteright /quotedblleft /quotedblright /bullet
/endash /emdash /asciitilde /trademark /scaron
/guilsinglright /oe /bullet /zcaron /Ydieresis
/space /exclamdown /cent /sterling /currency
/yen /brokenbar /section /dieresis /copyright
/ordfeminine /guillemotleft /logicalnot /sfthyphen /registered
/macron /degree /plusminus /twosuperior /threesuperior
/acute /mu /paragraph /middot /cedilla
/onesuperior /ordmasculine /guillemotright /onequarter /onehalf
/threequarters /questiondown /Agrave /Aacute /Acircumflex
/Atilde /Adieresis /Aring /AE /Ccedilla
/Egrave /Eacute /Ecircumflex /Edieresis /Igrave
/Iacute /Icircumflex /Idieresis /Eth /Ntilde
/Ograve /Oacute /Ocircumflex /Otilde /Odieresis
/multiply /Oslash /Ugrave /Uacute /Ucircumflex
/Udieresis /Yacute /Thorn /germandbls /agrave
/aacute /acircumflex /atilde /adieresis /aring
/ae /ccedilla /egrave /eacute /ecircumflex
/edieresis /igrave /iacute /icircumflex /idieresis
/eth /ntilde /ograve /oacute /ocircumflex
/otilde /odieresis /divide /oslash /ugrave
/uacute /ucircumflex /udieresis /yacute /thorn
/ydieresis
] def
%%EndResource
%FOPBeginFontReencode
/Courier-Oblique findfont
dup length dict begin
  {1 index /FID ne {def} {pop pop} ifelse} forall
  /Encoding WinAnsiEncoding def
  currentdict
end
/Courier-Oblique exch definefont pop
/Courier-BoldOblique findfont
dup length dict begin
  {1 index /FID ne {def} {pop pop} ifelse} forall
  /Encoding WinAnsiEncoding def
  currentdict
end
/Courier-BoldOblique exch definefont pop
/Courier-Bold findfont
dup length dict begin
  {1 index /FID ne {def} {pop pop} ifelse} forall
  /Encoding WinAnsiEncoding def
  currentdict
end
/Courier-Bold exch definefont pop
/Helvetica findfont
dup length dict begin
  {1 index /FID ne {def} {pop pop} ifelse} forall
  /Encoding WinAnsiEncoding def
  currentdict
end
/Helvetica exch definefont pop
/Helvetica-Oblique findfont
dup length dict begin
  {1 index /FID ne {def} {pop pop} ifelse} forall
  /Encoding WinAnsiEncoding def
  currentdict
end
/Helvetica-Oblique exch definefont pop
/Helvetica-Bold findfont
dup length dict begin
  {1 index /FID ne {def} {pop pop} ifelse} forall
  /Encoding WinAnsiEncoding def
  currentdict
end
/Helvetica-Bold exch definefont pop
/Helvetica-BoldOblique findfont
dup length dict begin
  {1 index /FID ne {def} {pop pop} ifelse} forall
  /Encoding WinAnsiEncoding def
  currentdict
end
/Helvetica-BoldOblique exch definefont pop
/Times-Roman findfont
dup length dict begin
  {1 index /FID ne {def} {pop pop} ifelse} forall
  /Encoding WinAnsiEncoding def
  currentdict
end
/Times-Roman exch definefont pop
/Times-Italic findfont
dup length dict begin
  {1 index /FID ne {def} {pop pop} ifelse} forall
  /Encoding WinAnsiEncoding def
  currentdict
end
/Times-Italic exch definefont pop
/Times-Bold findfont
dup length dict begin
  {1 index /FID ne {def} {pop pop} ifelse} forall
  /Encoding WinAnsiEncoding def
  currentdict
end
/Times-Bold exch definefont pop
/Times-BoldItalic findfont
dup length dict begin
  {1 index /FID ne {def} {pop pop} ifelse} forall
  /Encoding WinAnsiEncoding def
  currentdict
end
/Times-BoldItalic exch definefont pop
/Courier findfont
dup length dict begin
  {1 index /FID ne {def} {pop pop} ifelse} forall
  /Encoding WinAnsiEncoding def
  currentdict
end
/Courier exch definefont pop
%FOPEndFontReencode
%%EndProlog
%%Page: 1 1
%%PageBoundingBox: 0 0 768 432
%%BeginPageSetup
[1 0 0 -1 0 432] CT
%%EndPageSetup
GS
1 GC
N
0 0 768 432 re
f
GR
GS
1 GC
N
0 0 768 432 re
f
GR
GS
1 GC
N
100 342 M
695 342 L
695 59 L
100 59 L
cp
f
GR
GS
0.149 GC
2 setlinecap
1 LJ
0.5 LW
N
100 342 M
695 342 L
S
GR
GS
0.149 GC
2 setlinecap
1 LJ
0.5 LW
N
100 342 M
100 336.05 L
S
GR
GS
0.149 GC
2 setlinecap
1 LJ
0.5 LW
N
276.023 342 M
276.023 336.05 L
S
GR
GS
0.149 GC
2 setlinecap
1 LJ
0.5 LW
N
387.081 342 M
387.081 336.05 L
S
GR
GS
0.149 GC
2 setlinecap
1 LJ
0.5 LW
N
544.233 342 M
544.233 336.05 L
S
GR
GS
0.149 GC
2 setlinecap
1 LJ
0.5 LW
N
695 342 M
695 336.05 L
S
GR
GS
0.149 GC
2 setlinecap
1 LJ
0.5 LW
N
100 342 M
100 339.025 L
S
GR
GS
0.149 GC
2 setlinecap
1 LJ
0.5 LW
N
211.058 342 M
211.058 339.025 L
S
GR
GS
0.149 GC
2 setlinecap
1 LJ
0.5 LW
N
276.023 342 M
276.023 339.025 L
S
GR
GS
0.149 GC
2 setlinecap
1 LJ
0.5 LW
N
322.116 342 M
322.116 339.025 L
S
GR
GS
0.149 GC
2 setlinecap
1 LJ
0.5 LW
N
357.869 342 M
357.869 339.025 L
S
GR
GS
0.149 GC
2 setlinecap
1 LJ
0.5 LW
N
387.081 342 M
387.081 339.025 L
S
GR
GS
0.149 GC
2 setlinecap
1 LJ
0.5 LW
N
411.78 342 M
411.78 339.025 L
S
GR
GS
0.149 GC
2 setlinecap
1 LJ
0.5 LW
N
433.175 342 M
433.175 339.025 L
S
GR
GS
0.149 GC
2 setlinecap
1 LJ
0.5 LW
N
452.046 342 M
452.046 339.025 L
S
GR
GS
0.149 GC
2 setlinecap
1 LJ
0.5 LW
N
468.927 342 M
468.927 339.025 L
S
GR
GS
0.149 GC
2 setlinecap
1 LJ
0.5 LW
N
579.985 342 M
579.985 339.025 L
S
GR
GS
0.149 GC
2 setlinecap
1 LJ
0.5 LW
N
644.95 342 M
644.95 339.025 L
S
GR
GS
0.149 GC
2 setlinecap
1 LJ
0.5 LW
N
691.044 342 M
691.044 339.025 L
S
GR
GS
[1 0 0 1 59 369] CT
0.149 GC
/Helvetica 22 F
GS
[1 0 0 1 0 0] CT
0 0 moveto 
1 -1 scale
(250 Hz) t 
GR
GR
GS
[1 0 0 1 59 399] CT
0.149 GC
/Helvetica 22 F
GS
[1 0 0 1 0 0] CT
0 0 moveto 
1 -1 scale
(\(scale 1\)) t 
GR
GR
GS
[1 0 0 1 235 369] CT
0.149 GC
/Helvetica 22 F
GS
[1 0 0 1 0 0] CT
0 0 moveto 
1 -1 scale
(83 Hz) t 
GR
GR
GS
[1 0 0 1 235 399] CT
0.149 GC
/Helvetica 22 F
GS
[1 0 0 1 0 0] CT
0 0 moveto 
1 -1 scale
(\(scale 3\)) t 
GR
GR
GS
[1 0 0 1 346 369] CT
0.149 GC
/Helvetica 22 F
GS
[1 0 0 1 0 0] CT
0 0 moveto 
1 -1 scale
(42 Hz) t 
GR
GR
GS
[1 0 0 1 346 399] CT
0.149 GC
/Helvetica 22 F
GS
[1 0 0 1 0 0] CT
0 0 moveto 
1 -1 scale
(\(scale 6\)) t 
GR
GR
GS
[1 0 0 1 497 369] CT
0.149 GC
/Helvetica 22 F
GS
[1 0 0 1 0 0] CT
0 0 moveto 
1 -1 scale
(16 Hz) t 
GR
GR
GS
[1 0 0 1 497 399] CT
0.149 GC
/Helvetica 22 F
GS
[1 0 0 1 0 0] CT
0 0 moveto 
1 -1 scale
(\(scale 16\)) t 
GR
GR
GS
[1 0 0 1 648 369] CT
0.149 GC
/Helvetica 22 F
GS
[1 0 0 1 0 0] CT
0 0 moveto 
1 -1 scale
(6 Hz) t 
GR
GR
GS
[1 0 0 1 648 399] CT
0.149 GC
/Helvetica 22 F
GS
[1 0 0 1 0 0] CT
0 0 moveto 
1 -1 scale
(\(scale 41\)) t 
GR
GR
GS
[1 0 0 1 397.50027 405.89999] CT
0.149 GC
/Helvetica 22 F
GS
[1 0 0 1 0 0] CT
-132.5 21 moveto 
1 -1 scale
(Time scale [Hz; log-scaled]) t 
GR
GR
GS
0.149 GC
2 setlinecap
1 LJ
0.5 LW
N
100 342 M
100 59 L
S
GR
GS
0.149 GC
2 setlinecap
1 LJ
0.5 LW
N
100 342 M
105.95 342 L
S
GR
GS
0.149 GC
2 setlinecap
1 LJ
0.5 LW
N
100 271.25 M
105.95 271.25 L
S
GR
GS
0.149 GC
2 setlinecap
1 LJ
0.5 LW
N
100 200.5 M
105.95 200.5 L
S
GR
GS
0.149 GC
2 setlinecap
1 LJ
0.5 LW
N
100 129.75 M
105.95 129.75 L
S
GR
GS
0.149 GC
2 setlinecap
1 LJ
0.5 LW
N
100 59 M
105.95 59 L
S
GR
GS
[1 0 0 1 93.6 342] CT
0.149 GC
/Helvetica 22 F
GS
[1 0 0 1 0 0] CT
-21 8 moveto 
1 -1 scale
(-1) t 
GR
GR
GS
[1 0 0 1 93.6 271.25] CT
0.149 GC
/Helvetica 22 F
GS
[1 0 0 1 0 0] CT
-40 8 moveto 
1 -1 scale
(-0.5) t 
GR
GR
GS
[1 0 0 1 93.6 200.5] CT
0.149 GC
/Helvetica 22 F
GS
[1 0 0 1 0 0] CT
-13 8 moveto 
1 -1 scale
(0) t 
GR
GR
GS
[1 0 0 1 93.6 129.75] CT
0.149 GC
/Helvetica 22 F
GS
[1 0 0 1 0 0] CT
-31 8 moveto 
1 -1 scale
(0.5) t 
GR
GR
GS
[1 0 0 1 93.6 59] CT
0.149 GC
/Helvetica 22 F
GS
[1 0 0 1 0 0] CT
-13 8 moveto 
1 -1 scale
(1) t 
GR
GR
GS
[0 -1 1 0 51.1 200.49986] CT
0.149 GC
/Helvetica 22 F
GS
[1 0 0 1 0 0] CT
-121 -5 moveto 
1 -1 scale
(Correlation coefficient \(r\)) t 
GR
GR
GS
[1 0 0 1 397.5004 56.24999] CT
/Helvetica-Bold 22 F
GS
[1 0 0 1 0 0] CT
-206 -32 moveto 
1 -1 scale
(Correlation with PSD slope depends on) t 
GR
GR
GS
[1 0 0 1 397.5004 56.24999] CT
/Helvetica-Bold 22 F
GS
[1 0 0 1 0 0] CT
-189 -5 moveto 
1 -1 scale
(similarity bounds & spectral content) t 
GR
GR
GS
1 LJ
3 LW
N
100 85.768 M
211.058 84.927 L
276.023 88.314 L
322.116 95.128 L
357.869 104.806 L
387.081 117.973 L
411.78 132.321 L
433.175 147.606 L
452.046 162.311 L
468.927 176.168 L
484.198 189.146 L
498.139 200.401 L
510.964 210.317 L
522.838 217.662 L
533.892 225.451 L
544.233 232.519 L
553.946 237.627 L
563.104 243.043 L
571.767 247.195 L
579.985 251.455 L
587.803 252.215 L
595.256 253.49 L
602.379 252.897 L
609.198 253.346 L
615.738 253.778 L
622.022 255.031 L
628.069 256.951 L
633.896 259.531 L
639.519 262.169 L
644.95 263.672 L
650.204 264.84 L
655.291 266.288 L
660.221 266.683 L
665.004 267.089 L
669.649 267.401 L
674.162 266.724 L
678.552 266.521 L
682.825 265.813 L
686.987 265.334 L
691.044 263.677 L
695 263.135 L
S
GR
GS
1 0 0 RC
1 LJ
3 LW
N
100 82.943 M
211.058 81.507 L
276.023 89.374 L
322.116 107.602 L
357.869 137.624 L
387.081 171.652 L
411.78 200.66 L
433.175 223.723 L
452.046 242.057 L
468.927 256.126 L
484.198 267.039 L
498.139 276.341 L
510.964 283.498 L
522.838 289.4 L
533.892 293.926 L
544.233 297.817 L
553.946 300.536 L
563.104 302.8 L
571.767 304.522 L
579.985 306.66 L
587.803 308.905 L
595.256 310.526 L
602.379 312.561 L
609.198 314.068 L
615.738 315.662 L
622.022 317.197 L
628.069 318.644 L
633.896 319.477 L
639.519 319.779 L
644.95 320.674 L
650.204 320.928 L
655.291 321.055 L
660.221 321.296 L
665.004 320.997 L
669.649 320.885 L
674.162 321.211 L
678.552 320.74 L
682.825 320.457 L
686.987 320.631 L
691.044 320.641 L
695 320.04 L
S
GR
GS
[12 12] 0 setdash
2 LJ
3 LW
N
100 85.768 M
211.058 84.797 L
276.023 85.605 L
322.116 88.577 L
357.869 93.075 L
387.081 99.113 L
411.78 105.98 L
433.175 113.014 L
452.046 119.84 L
468.927 126.354 L
484.198 132.569 L
498.139 138.473 L
510.964 144.166 L
522.838 149.569 L
533.892 154.663 L
544.233 159.259 L
553.946 163.198 L
563.104 166.164 L
571.767 167.878 L
579.985 168.209 L
587.803 167.626 L
595.256 167.212 L
602.379 167.692 L
609.198 169.16 L
615.738 171.077 L
622.022 172.939 L
628.069 174.448 L
633.896 175.714 L
639.519 176.69 L
644.95 177.478 L
650.204 178.066 L
655.291 178.45 L
660.221 178.654 L
665.004 178.712 L
669.649 178.711 L
674.162 178.709 L
678.552 178.634 L
682.825 178.599 L
686.987 178.526 L
691.044 178.471 L
695 178.37 L
S
GR
GS
1 0 0 RC
[12 12] 0 setdash
2 LJ
3 LW
N
100 82.943 M
211.058 81.338 L
276.023 83.329 L
322.116 89.17 L
357.869 98.082 L
387.081 109.325 L
411.78 121.367 L
433.175 132.778 L
452.046 143.14 L
468.927 152.443 L
484.198 160.743 L
498.139 168.013 L
510.964 174.368 L
522.838 179.792 L
533.892 184.208 L
544.233 187.69 L
553.946 190.362 L
563.104 192.298 L
571.767 193.617 L
579.985 194.45 L
587.803 195.009 L
595.256 195.379 L
602.379 195.615 L
609.198 195.613 L
615.738 195.287 L
622.022 194.623 L
628.069 193.671 L
633.896 192.793 L
639.519 192.037 L
644.95 191.503 L
650.204 191.216 L
655.291 191.018 L
660.221 190.901 L
665.004 190.806 L
669.649 190.684 L
674.162 190.642 L
678.552 190.494 L
682.825 190.471 L
686.987 190.417 L
691.044 190.42 L
695 190.45 L
S
GR
GS
[3 3] 0 setdash
2 LJ
3 LW
N
100 252.182 M
211.058 253.634 L
276.023 255.173 L
322.116 256.832 L
357.869 258.294 L
387.081 259.101 L
411.78 258.661 L
433.175 256.335 L
452.046 251.759 L
468.927 244.581 L
484.198 234.594 L
498.139 222.629 L
510.964 210.257 L
522.838 198.927 L
533.892 189.048 L
544.233 180.624 L
553.946 173.425 L
563.104 166.8 L
571.767 160.223 L
579.985 153.673 L
587.803 147.754 L
595.256 142.793 L
602.379 138.737 L
609.198 135.568 L
615.738 133.148 L
622.022 131.239 L
628.069 129.647 L
633.896 128.264 L
639.519 127.024 L
644.95 125.886 L
650.204 124.84 L
655.291 123.888 L
660.221 123.021 L
665.004 122.232 L
669.649 121.518 L
674.162 120.87 L
678.552 120.279 L
682.825 119.739 L
686.987 119.245 L
691.044 118.792 L
695 118.376 L
S
GR
GS
1 0 0 RC
[3 3] 0 setdash
2 LJ
3 LW
N
100 200.397 M
211.058 201.925 L
276.023 203.354 L
322.116 204.609 L
357.869 205.544 L
387.081 205.903 L
411.78 205.317 L
433.175 203.419 L
452.046 200.136 L
468.927 195.493 L
484.198 189.599 L
498.139 182.868 L
510.964 175.915 L
522.838 169.36 L
533.892 163.56 L
544.233 158.585 L
553.946 154.282 L
563.104 150.414 L
571.767 146.793 L
579.985 143.308 L
587.803 139.976 L
595.256 136.872 L
602.379 134.105 L
609.198 131.754 L
615.738 129.831 L
622.022 128.275 L
628.069 126.993 L
633.896 125.892 L
639.519 124.889 L
644.95 123.952 L
650.204 123.075 L
655.291 122.258 L
660.221 121.498 L
665.004 120.794 L
669.649 120.146 L
674.162 119.548 L
678.552 118.993 L
682.825 118.478 L
686.987 117.999 L
691.044 117.552 L
695 117.137 L
S
GR
GS
[1 0 0 1 147 275.25] CT
/Helvetica 18 F
GS
[1 0 0 1 0 0] CT
0 7 moveto 
1 -1 scale
(YA: Original) t 
GR
GR
GS
1 LJ
3 LW
N
114 275.25 M
144 275.25 L
S
GR
GS
[1 0 0 1 147 297.25] CT
/Helvetica 18 F
GS
[1 0 0 1 0 0] CT
0 7 moveto 
1 -1 scale
(YA: low-pass) t 
GR
GR
GS
[12 12] 0 setdash
2 LJ
3 LW
N
114 297.25 M
144 297.25 L
S
GR
GS
[1 0 0 1 147 319.25] CT
/Helvetica 18 F
GS
[1 0 0 1 0 0] CT
0 7 moveto 
1 -1 scale
(YA: high-pass) t 
GR
GR
GS
[3 3] 0 setdash
2 LJ
3 LW
N
114 319.25 M
144 319.25 L
S
GR
GS
[1 0 0 1 347 274.75] CT
/Helvetica 18 F
GS
[1 0 0 1 0 0] CT
0 7 moveto 
1 -1 scale
(OA: Original) t 
GR
GR
GS
1 0 0 RC
1 LJ
3 LW
N
314 274.75 M
344 274.75 L
S
GR
GS
[1 0 0 1 347 296.75] CT
/Helvetica 18 F
GS
[1 0 0 1 0 0] CT
0 7 moveto 
1 -1 scale
(OA: low-pass) t 
GR
GR
GS
1 0 0 RC
[12 12] 0 setdash
2 LJ
3 LW
N
314 296.75 M
344 296.75 L
S
GR
GS
[1 0 0 1 347 318.75] CT
/Helvetica 18 F
GS
[1 0 0 1 0 0] CT
0 7 moveto 
1 -1 scale
(OA: high-pass) t 
GR
GR
GS
1 0 0 RC
[3 3] 0 setdash
2 LJ
3 LW
N
314 318.75 M
344 318.75 L
S
GR
%%Trailer
%%Pages: 1
%%EOF
