%!PS-Adobe-3.0 EPSF-3.0
%%Creator: (MATLAB, The Mathworks, Inc. Version 9.4.0.813654 \(R2018a\). Operating System: Mac OS X)
%%Title: /Volumes/LNDG/Projects/StateSwitch/dynamic/data/eeg/rest/B_analyses/A_MSE_CSD_multiVariant/C_figures/Z_IntroSchematic_Fig3.eps
%%CreationDate: 2020-04-23T11:12:52
%%Pages: (atend)
%%BoundingBox:     4     0   386   517
%%LanguageLevel: 3
%%EndComments
%%BeginProlog
%%BeginResource: procset (Apache XML Graphics Std ProcSet) 1.2 0
%%Version: 1.2 0
%%Copyright: (Copyright 2001-2003,2010 The Apache Software Foundation. License terms: http://www.apache.org/licenses/LICENSE-2.0)
/bd{bind def}bind def
/ld{load def}bd
/GR/grestore ld
/GS/gsave ld
/RM/rmoveto ld
/C/curveto ld
/t/show ld
/L/lineto ld
/ML/setmiterlimit ld
/CT/concat ld
/f/fill ld
/N/newpath ld
/S/stroke ld
/CC/setcmykcolor ld
/A/ashow ld
/cp/closepath ld
/RC/setrgbcolor ld
/LJ/setlinejoin ld
/GC/setgray ld
/LW/setlinewidth ld
/M/moveto ld
/re {4 2 roll M
1 index 0 rlineto
0 exch rlineto
neg 0 rlineto
cp } bd
/_ctm matrix def
/_tm matrix def
/BT { _ctm currentmatrix pop matrix _tm copy pop 0 0 moveto } bd
/ET { _ctm setmatrix } bd
/iTm { _ctm setmatrix _tm concat } bd
/Tm { _tm astore pop iTm 0 0 moveto } bd
/ux 0.0 def
/uy 0.0 def
/F {
  /Tp exch def
  /Tf exch def
  Tf findfont Tp scalefont setfont
  /cf Tf def  /cs Tp def
} bd
/ULS {currentpoint /uy exch def /ux exch def} bd
/ULE {
  /Tcx currentpoint pop def
  gsave
  newpath
  cf findfont cs scalefont dup
  /FontMatrix get 0 get /Ts exch def /FontInfo get dup
  /UnderlinePosition get Ts mul /To exch def
  /UnderlineThickness get Ts mul /Tt exch def
  ux uy To add moveto  Tcx uy To add lineto
  Tt setlinewidth stroke
  grestore
} bd
/OLE {
  /Tcx currentpoint pop def
  gsave
  newpath
  cf findfont cs scalefont dup
  /FontMatrix get 0 get /Ts exch def /FontInfo get dup
  /UnderlinePosition get Ts mul /To exch def
  /UnderlineThickness get Ts mul /Tt exch def
  ux uy To add cs add moveto Tcx uy To add cs add lineto
  Tt setlinewidth stroke
  grestore
} bd
/SOE {
  /Tcx currentpoint pop def
  gsave
  newpath
  cf findfont cs scalefont dup
  /FontMatrix get 0 get /Ts exch def /FontInfo get dup
  /UnderlinePosition get Ts mul /To exch def
  /UnderlineThickness get Ts mul /Tt exch def
  ux uy To add cs 10 mul 26 idiv add moveto Tcx uy To add cs 10 mul 26 idiv add lineto
  Tt setlinewidth stroke
  grestore
} bd
/QT {
/Y22 exch store
/X22 exch store
/Y21 exch store
/X21 exch store
currentpoint
/Y21 load 2 mul add 3 div exch
/X21 load 2 mul add 3 div exch
/X21 load 2 mul /X22 load add 3 div
/Y21 load 2 mul /Y22 load add 3 div
/X22 load /Y22 load curveto
} bd
/SSPD {
dup length /d exch dict def
{
/v exch def
/k exch def
currentpagedevice k known {
/cpdv currentpagedevice k get def
v cpdv ne {
/upd false def
/nullv v type /nulltype eq def
/nullcpdv cpdv type /nulltype eq def
nullv nullcpdv or
{
/upd true def
} {
/sametype v type cpdv type eq def
sametype {
v type /arraytype eq {
/vlen v length def
/cpdvlen cpdv length def
vlen cpdvlen eq {
0 1 vlen 1 sub {
/i exch def
/obj v i get def
/cpdobj cpdv i get def
obj cpdobj ne {
/upd true def
exit
} if
} for
} {
/upd true def
} ifelse
} {
v type /dicttype eq {
v {
/dv exch def
/dk exch def
/cpddv cpdv dk get def
dv cpddv ne {
/upd true def
exit
} if
} forall
} {
/upd true def
} ifelse
} ifelse
} if
} ifelse
upd true eq {
d k v put
} if
} if
} if
} forall
d length 0 gt {
d setpagedevice
} if
} bd
/RE { % /NewFontName [NewEncodingArray] /FontName RE -
  findfont dup length dict begin
  {
    1 index /FID ne
    {def} {pop pop} ifelse
  } forall
  /Encoding exch def
  /FontName 1 index def
  currentdict definefont pop
  end
} bind def
%%EndResource
%%BeginResource: procset (Apache XML Graphics EPS ProcSet) 1.0 0
%%Version: 1.0 0
%%Copyright: (Copyright 2002-2003 The Apache Software Foundation. License terms: http://www.apache.org/licenses/LICENSE-2.0)
/BeginEPSF { %def
/b4_Inc_state save def         % Save state for cleanup
/dict_count countdictstack def % Count objects on dict stack
/op_count count 1 sub def      % Count objects on operand stack
userdict begin                 % Push userdict on dict stack
/showpage { } def              % Redefine showpage, { } = null proc
0 setgray 0 setlinecap         % Prepare graphics state
1 setlinewidth 0 setlinejoin
10 setmiterlimit [ ] 0 setdash newpath
/languagelevel where           % If level not equal to 1 then
{pop languagelevel             % set strokeadjust and
1 ne                           % overprint to their defaults.
{false setstrokeadjust false setoverprint
} if
} if
} bd
/EndEPSF { %def
count op_count sub {pop} repeat            % Clean up stacks
countdictstack dict_count sub {end} repeat
b4_Inc_state restore
} bd
%%EndResource
%FOPBeginFontDict
%%IncludeResource: font Courier-Oblique
%%IncludeResource: font Courier-BoldOblique
%%IncludeResource: font Courier-Bold
%%IncludeResource: font ZapfDingbats
%%IncludeResource: font Symbol
%%IncludeResource: font Helvetica
%%IncludeResource: font Helvetica-Oblique
%%IncludeResource: font Helvetica-Bold
%%IncludeResource: font Helvetica-BoldOblique
%%IncludeResource: font Times-Roman
%%IncludeResource: font Times-Italic
%%IncludeResource: font Times-Bold
%%IncludeResource: font Times-BoldItalic
%%IncludeResource: font Courier
%FOPEndFontDict
%%BeginResource: encoding WinAnsiEncoding
/WinAnsiEncoding [
/.notdef /.notdef /.notdef /.notdef /.notdef
/.notdef /.notdef /.notdef /.notdef /.notdef
/.notdef /.notdef /.notdef /.notdef /.notdef
/.notdef /.notdef /.notdef /.notdef /.notdef
/.notdef /.notdef /.notdef /.notdef /.notdef
/.notdef /.notdef /.notdef /.notdef /.notdef
/.notdef /.notdef /space /exclam /quotedbl
/numbersign /dollar /percent /ampersand /quotesingle
/parenleft /parenright /asterisk /plus /comma
/hyphen /period /slash /zero /one
/two /three /four /five /six
/seven /eight /nine /colon /semicolon
/less /equal /greater /question /at
/A /B /C /D /E
/F /G /H /I /J
/K /L /M /N /O
/P /Q /R /S /T
/U /V /W /X /Y
/Z /bracketleft /backslash /bracketright /asciicircum
/underscore /quoteleft /a /b /c
/d /e /f /g /h
/i /j /k /l /m
/n /o /p /q /r
/s /t /u /v /w
/x /y /z /braceleft /bar
/braceright /asciitilde /bullet /Euro /bullet
/quotesinglbase /florin /quotedblbase /ellipsis /dagger
/daggerdbl /circumflex /perthousand /Scaron /guilsinglleft
/OE /bullet /Zcaron /bullet /bullet
/quoteleft /quoteright /quotedblleft /quotedblright /bullet
/endash /emdash /asciitilde /trademark /scaron
/guilsinglright /oe /bullet /zcaron /Ydieresis
/space /exclamdown /cent /sterling /currency
/yen /brokenbar /section /dieresis /copyright
/ordfeminine /guillemotleft /logicalnot /sfthyphen /registered
/macron /degree /plusminus /twosuperior /threesuperior
/acute /mu /paragraph /middot /cedilla
/onesuperior /ordmasculine /guillemotright /onequarter /onehalf
/threequarters /questiondown /Agrave /Aacute /Acircumflex
/Atilde /Adieresis /Aring /AE /Ccedilla
/Egrave /Eacute /Ecircumflex /Edieresis /Igrave
/Iacute /Icircumflex /Idieresis /Eth /Ntilde
/Ograve /Oacute /Ocircumflex /Otilde /Odieresis
/multiply /Oslash /Ugrave /Uacute /Ucircumflex
/Udieresis /Yacute /Thorn /germandbls /agrave
/aacute /acircumflex /atilde /adieresis /aring
/ae /ccedilla /egrave /eacute /ecircumflex
/edieresis /igrave /iacute /icircumflex /idieresis
/eth /ntilde /ograve /oacute /ocircumflex
/otilde /odieresis /divide /oslash /ugrave
/uacute /ucircumflex /udieresis /yacute /thorn
/ydieresis
] def
%%EndResource
%FOPBeginFontReencode
/Courier-Oblique findfont
dup length dict begin
  {1 index /FID ne {def} {pop pop} ifelse} forall
  /Encoding WinAnsiEncoding def
  currentdict
end
/Courier-Oblique exch definefont pop
/Courier-BoldOblique findfont
dup length dict begin
  {1 index /FID ne {def} {pop pop} ifelse} forall
  /Encoding WinAnsiEncoding def
  currentdict
end
/Courier-BoldOblique exch definefont pop
/Courier-Bold findfont
dup length dict begin
  {1 index /FID ne {def} {pop pop} ifelse} forall
  /Encoding WinAnsiEncoding def
  currentdict
end
/Courier-Bold exch definefont pop
/Helvetica findfont
dup length dict begin
  {1 index /FID ne {def} {pop pop} ifelse} forall
  /Encoding WinAnsiEncoding def
  currentdict
end
/Helvetica exch definefont pop
/Helvetica-Oblique findfont
dup length dict begin
  {1 index /FID ne {def} {pop pop} ifelse} forall
  /Encoding WinAnsiEncoding def
  currentdict
end
/Helvetica-Oblique exch definefont pop
/Helvetica-Bold findfont
dup length dict begin
  {1 index /FID ne {def} {pop pop} ifelse} forall
  /Encoding WinAnsiEncoding def
  currentdict
end
/Helvetica-Bold exch definefont pop
/Helvetica-BoldOblique findfont
dup length dict begin
  {1 index /FID ne {def} {pop pop} ifelse} forall
  /Encoding WinAnsiEncoding def
  currentdict
end
/Helvetica-BoldOblique exch definefont pop
/Times-Roman findfont
dup length dict begin
  {1 index /FID ne {def} {pop pop} ifelse} forall
  /Encoding WinAnsiEncoding def
  currentdict
end
/Times-Roman exch definefont pop
/Times-Italic findfont
dup length dict begin
  {1 index /FID ne {def} {pop pop} ifelse} forall
  /Encoding WinAnsiEncoding def
  currentdict
end
/Times-Italic exch definefont pop
/Times-Bold findfont
dup length dict begin
  {1 index /FID ne {def} {pop pop} ifelse} forall
  /Encoding WinAnsiEncoding def
  currentdict
end
/Times-Bold exch definefont pop
/Times-BoldItalic findfont
dup length dict begin
  {1 index /FID ne {def} {pop pop} ifelse} forall
  /Encoding WinAnsiEncoding def
  currentdict
end
/Times-BoldItalic exch definefont pop
/Courier findfont
dup length dict begin
  {1 index /FID ne {def} {pop pop} ifelse} forall
  /Encoding WinAnsiEncoding def
  currentdict
end
/Courier exch definefont pop
%FOPEndFontReencode
%%EndProlog
%%Page: 1 1
%%PageBoundingBox: 0 0 384 504
%%BeginPageSetup
[1 0 0 -1 0 504] CT
%%EndPageSetup
GS
1 GC
N
0 0 384 504 re
f
GR
GS
1 GC
N
0 0 384 504 re
f
GR
GS
1 GC
N
50 297.5 M
347.5 297.5 L
347.5 38 L
50 38 L
cp
f
GR
GS
0.149 GC
2 setlinecap
1 LJ
0.5 LW
N
347.5 38 M
50 38 L
S
GR
GS
0.149 GC
2 setlinecap
1 LJ
0.5 LW
N
331.591 38 M
331.591 40.975 L
S
GR
GS
0.149 GC
2 setlinecap
1 LJ
0.5 LW
N
271.887 38 M
271.887 40.975 L
S
GR
GS
0.149 GC
2 setlinecap
1 LJ
0.5 LW
N
213.085 38 M
213.085 40.975 L
S
GR
GS
0.149 GC
2 setlinecap
1 LJ
0.5 LW
N
153.381 38 M
153.381 40.975 L
S
GR
GS
0.149 GC
2 setlinecap
1 LJ
0.5 LW
N
93.45 38 M
93.45 40.975 L
S
GR
GS
[1 0 0 1 331.59143 31.99997] CT
0.149 GC
/Helvetica 20 F
GS
[1 0 0 1 0 0] CT
-8.5 -5 moveto 
1 -1 scale
(2 ) t 
GR
GR
GS
[1 0 0 1 271.88715 31.99997] CT
0.149 GC
/Helvetica 20 F
GS
[1 0 0 1 0 0] CT
-8.5 -5 moveto 
1 -1 scale
(5 ) t 
GR
GR
GS
[1 0 0 1 213.08482 31.99997] CT
0.149 GC
/Helvetica 20 F
GS
[1 0 0 1 0 0] CT
-11.5 -5 moveto 
1 -1 scale
(10) t 
GR
GR
GS
[1 0 0 1 153.38052 31.99997] CT
0.149 GC
/Helvetica 20 F
GS
[1 0 0 1 0 0] CT
-11.5 -5 moveto 
1 -1 scale
(19) t 
GR
GR
GS
[1 0 0 1 93.44987 31.99997] CT
0.149 GC
/Helvetica 20 F
GS
[1 0 0 1 0 0] CT
-11.5 -5 moveto 
1 -1 scale
(38) t 
GR
GR
GS
[1 0 0 1 198.75015 7.00002] CT
0.149 GC
/Helvetica 20 F
GS
[1 0 0 1 0 0] CT
-120 -5 moveto 
1 -1 scale
(Frequency [Hz, log-scaled]) t 
GR
GR
GS
0.149 GC
2 setlinecap
1 LJ
0.5 LW
N
50 297.5 M
50 38 L
S
GR
GS
[0 -1 1 0 44.00001 167.74983] CT
0.149 GC
/Helvetica 20 F
GS
[1 0 0 1 0 0] CT
-132.5 -5 moveto 
1 -1 scale
(Power ~ variance [log-scaled]) t 
GR
GR
GS
0.149 GC
1 LJ
0.5 LW
N
347.5 297.5 M
50 297.5 L
S
GR
GS
0.188 0.435 0.729 RC
N
347.296 297.5 M
347.296 51.707 L
339.086 61.164 L
331.591 70.983 L
324.697 80.458 L
318.314 88.67 L
309.547 97.182 L
301.59 103.324 L
294.307 110.069 L
287.591 116.228 L
279.382 122.347 L
271.887 126.484 L
264.993 129.011 L
257.085 131.912 L
249.842 134.645 L
243.162 135.892 L
235.774 133.731 L
227.887 126.262 L
220.662 109.731 L
213.085 94.207 L
213.085 297.5 L
220.662 297.5 L
227.887 297.5 L
235.774 297.5 L
243.162 297.5 L
249.842 297.5 L
257.085 297.5 L
264.993 297.5 L
271.887 297.5 L
279.382 297.5 L
287.591 297.5 L
294.307 297.5 L
301.59 297.5 L
309.547 297.5 L
318.314 297.5 L
324.697 297.5 L
331.591 297.5 L
339.086 297.5 L
cp
f
GR
GS
1 LJ
0.5 LW
N
347.296 297.5 M
339.086 297.5 L
331.591 297.5 L
324.697 297.5 L
318.314 297.5 L
309.547 297.5 L
301.59 297.5 L
294.307 297.5 L
287.591 297.5 L
279.382 297.5 L
271.887 297.5 L
264.993 297.5 L
257.085 297.5 L
249.842 297.5 L
243.162 297.5 L
235.774 297.5 L
227.887 297.5 L
220.662 297.5 L
213.085 297.5 L
213.085 94.207 L
220.662 109.731 L
227.887 126.262 L
235.774 133.731 L
243.162 135.892 L
249.842 134.645 L
257.085 131.912 L
264.993 129.011 L
271.887 126.484 L
279.382 122.347 L
287.591 116.228 L
294.307 110.069 L
301.59 103.324 L
309.547 97.182 L
318.314 88.67 L
324.697 80.458 L
331.591 70.983 L
339.086 61.164 L
347.296 51.707 L
cp
S
GR
GS
0.686 0.141 0.094 RC
N
205.288 297.5 M
205.288 92.209 L
198.139 113.891 L
190.835 144.138 L
182.817 170.584 L
175.482 178.775 L
168.183 181.816 L
160.958 179.286 L
153.381 178.807 L
145.999 183.739 L
138.435 196.589 L
130.782 213.823 L
123.432 227.269 L
116.071 236.253 L
108.479 244.905 L
101.006 253.126 L
93.45 259.472 L
86.087 264.924 L
78.541 271.135 L
71.077 275.844 L
63.728 281.289 L
56.22 287.103 L
49.965 291.966 L
49.965 295.838 L
49.965 297.5 L
56.22 297.5 L
63.728 297.5 L
71.077 297.5 L
78.541 297.5 L
86.087 297.5 L
93.45 297.5 L
101.006 297.5 L
108.479 297.5 L
116.071 297.5 L
123.432 297.5 L
130.782 297.5 L
138.435 297.5 L
145.999 297.5 L
153.381 297.5 L
160.958 297.5 L
168.183 297.5 L
175.482 297.5 L
182.817 297.5 L
190.835 297.5 L
198.139 297.5 L
cp
f
GR
GS
1 LJ
0.5 LW
N
49.965 291.966 M
56.22 287.103 L
63.728 281.289 L
71.077 275.844 L
78.541 271.135 L
86.087 264.924 L
93.45 259.472 L
101.006 253.126 L
108.479 244.905 L
116.071 236.253 L
123.432 227.269 L
130.782 213.823 L
138.435 196.589 L
145.999 183.739 L
153.381 178.807 L
160.958 179.286 L
168.183 181.816 L
175.482 178.775 L
182.817 170.584 L
190.835 144.138 L
198.139 113.891 L
205.288 92.209 L
205.288 297.5 L
198.139 297.5 L
190.835 297.5 L
182.817 297.5 L
175.482 297.5 L
168.183 297.5 L
160.958 297.5 L
153.381 297.5 L
145.999 297.5 L
138.435 297.5 L
130.782 297.5 L
123.432 297.5 L
116.071 297.5 L
108.479 297.5 L
101.006 297.5 L
93.45 297.5 L
86.087 297.5 L
78.541 297.5 L
71.077 297.5 L
63.728 297.5 L
56.22 297.5 L
49.965 297.5 L
S
GR
GS
1 0.702 0 RC
N
213.085 297.5 M
213.085 94.207 L
205.288 92.209 L
205.288 297.5 L
cp
f
GR
GS
1 LJ
0.5 LW
N
213.085 297.5 M
205.288 297.5 L
205.288 92.209 L
213.085 94.207 L
cp
S
GR
GS
1 LJ
5 LW
N
347.296 51.707 M
339.086 61.164 L
331.591 70.983 L
324.697 80.458 L
318.314 88.67 L
309.547 97.182 L
301.59 103.324 L
294.307 110.069 L
287.591 116.228 L
279.382 122.347 L
271.887 126.484 L
264.993 129.011 L
257.085 131.912 L
249.842 134.645 L
243.162 135.892 L
235.774 133.731 L
227.887 126.262 L
220.662 109.731 L
213.085 94.207 L
205.288 92.209 L
198.139 113.891 L
190.835 144.138 L
182.817 170.584 L
175.482 178.775 L
168.183 181.816 L
160.958 179.286 L
153.381 178.807 L
145.999 183.739 L
138.435 196.589 L
130.782 213.823 L
123.432 227.269 L
116.071 236.253 L
108.479 244.905 L
101.006 253.126 L
93.45 259.472 L
86.087 264.924 L
78.541 271.135 L
71.077 275.844 L
63.728 281.289 L
56.22 287.103 L
49.965 291.966 L
S
GR
GS
1 GC
N
61 421 M
341.5 421 L
341.5 340 L
61 340 L
cp
f
GR
GS
0.149 GC
2 setlinecap
1 LJ
0.5 LW
N
61 421 M
341.5 421 L
S
GR
GS
0.149 GC
2 setlinecap
1 LJ
0.5 LW
N
61 421 M
61 418.195 L
S
GR
GS
0.149 GC
2 setlinecap
1 LJ
0.5 LW
N
214 421 M
214 418.195 L
S
GR
GS
0.149 GC
2 setlinecap
1 LJ
0.5 LW
N
341.5 421 M
341.5 418.195 L
S
GR
GS
[1 0 0 1 24 447] CT
0.149 GC
/Helvetica 20 F
GS
[1 0 0 1 0 0] CT
0 0 moveto 
1 -1 scale
(125 Hz) t 
GR
GR
GS
[1 0 0 1 24 475] CT
0.149 GC
/Helvetica 20 F
GS
[1 0 0 1 0 0] CT
0 0 moveto 
1 -1 scale
(\(scale 1\)) t 
GR
GR
GS
[1 0 0 1 171 447] CT
0.149 GC
/Helvetica 20 F
GS
[1 0 0 1 0 0] CT
0 0 moveto 
1 -1 scale
(10 Hz) t 
GR
GR
GS
[1 0 0 1 171 475] CT
0.149 GC
/Helvetica 20 F
GS
[1 0 0 1 0 0] CT
0 0 moveto 
1 -1 scale
(\(scale 13\)) t 
GR
GR
GS
[1 0 0 1 299 447] CT
0.149 GC
/Helvetica 20 F
GS
[1 0 0 1 0 0] CT
0 0 moveto 
1 -1 scale
(5 Hz) t 
GR
GR
GS
[1 0 0 1 299 475] CT
0.149 GC
/Helvetica 20 F
GS
[1 0 0 1 0 0] CT
0 0 moveto 
1 -1 scale
(\(scale 23\)) t 
GR
GR
GS
[1 0 0 1 201.25014 480] CT
0.149 GC
/Helvetica 20 F
GS
[1 0 0 1 0 0] CT
-120.5 20 moveto 
1 -1 scale
(Time scale [Hz; log-scaled]) t 
GR
GR
GS
0.149 GC
2 setlinecap
1 LJ
0.5 LW
N
61 421 M
61 340 L
S
GR
GS
0.149 GC
2 setlinecap
1 LJ
0.5 LW
N
61 421 M
63.805 421 L
S
GR
GS
0.149 GC
2 setlinecap
1 LJ
0.5 LW
N
61 387.25 M
63.805 387.25 L
S
GR
GS
0.149 GC
2 setlinecap
1 LJ
0.5 LW
N
61 353.5 M
63.805 353.5 L
S
GR
GS
[1 0 0 1 55 421] CT
0.149 GC
/Helvetica 20 F
GS
[1 0 0 1 0 0] CT
-12 7.5 moveto 
1 -1 scale
(0) t 
GR
GR
GS
[1 0 0 1 55 387.25] CT
0.149 GC
/Helvetica 20 F
GS
[1 0 0 1 0 0] CT
-28 7.5 moveto 
1 -1 scale
(0.5) t 
GR
GR
GS
[1 0 0 1 55 353.5] CT
0.149 GC
/Helvetica 20 F
GS
[1 0 0 1 0 0] CT
-12 7.5 moveto 
1 -1 scale
(1) t 
GR
GR
GS
[0 -1 1 0 24 380.49997] CT
0.149 GC
/Helvetica 20 F
GS
[1 0 0 1 0 0] CT
-71.5 -5 moveto 
1 -1 scale
(Sample Entropy) t 
GR
GR
GS
0.149 GC
1 LJ
0.5 LW
N
61 421 M
341.5 421 L
S
GR
GS
0.8 GC
N
201.25 340 M
201.25 421.01 L
202.68 421.01 L
214 421.01 L
215.43 421.01 L
226.75 421.01 L
226.75 340 L
214 340 L
cp
f
GR
GS
[5 5] 0 setdash
2 LJ
5 LW
N
214 421 M
214 340 L
S
GR
%%Trailer
%%Pages: 1
%%EOF
