%!PS-Adobe-3.0 EPSF-3.0
%%Creator: (MATLAB, The Mathworks, Inc. Version 9.0.0.341360 \(R2016a\). Operating System: Mac OS X)
%%Title: /Volumes/LNDG/Projects/StateSwitch/dynamic/data/eeg/rest/B_analyses/A_MSE_CSD_multiVariant/C_figures/F2_WaschkeReplication.eps
%%CreationDate: 2019-03-12T14:28:57
%%Pages: (atend)
%%BoundingBox:    96     3  1228   466
%%LanguageLevel: 3
%%EndComments
%%BeginProlog
%%BeginResource: procset (Apache XML Graphics Std ProcSet) 1.2 0
%%Version: 1.2 0
%%Copyright: (Copyright 2001-2003,2010 The Apache Software Foundation. License terms: http://www.apache.org/licenses/LICENSE-2.0)
/bd{bind def}bind def
/ld{load def}bd
/GR/grestore ld
/M/moveto ld
/LJ/setlinejoin ld
/C/curveto ld
/f/fill ld
/LW/setlinewidth ld
/GC/setgray ld
/t/show ld
/N/newpath ld
/CT/concat ld
/cp/closepath ld
/S/stroke ld
/L/lineto ld
/CC/setcmykcolor ld
/A/ashow ld
/GS/gsave ld
/RC/setrgbcolor ld
/RM/rmoveto ld
/ML/setmiterlimit ld
/re {4 2 roll M
1 index 0 rlineto
0 exch rlineto
neg 0 rlineto
cp } bd
/_ctm matrix def
/_tm matrix def
/BT { _ctm currentmatrix pop matrix _tm copy pop 0 0 moveto } bd
/ET { _ctm setmatrix } bd
/iTm { _ctm setmatrix _tm concat } bd
/Tm { _tm astore pop iTm 0 0 moveto } bd
/ux 0.0 def
/uy 0.0 def
/F {
  /Tp exch def
  /Tf exch def
  Tf findfont Tp scalefont setfont
  /cf Tf def  /cs Tp def
} bd
/ULS {currentpoint /uy exch def /ux exch def} bd
/ULE {
  /Tcx currentpoint pop def
  gsave
  newpath
  cf findfont cs scalefont dup
  /FontMatrix get 0 get /Ts exch def /FontInfo get dup
  /UnderlinePosition get Ts mul /To exch def
  /UnderlineThickness get Ts mul /Tt exch def
  ux uy To add moveto  Tcx uy To add lineto
  Tt setlinewidth stroke
  grestore
} bd
/OLE {
  /Tcx currentpoint pop def
  gsave
  newpath
  cf findfont cs scalefont dup
  /FontMatrix get 0 get /Ts exch def /FontInfo get dup
  /UnderlinePosition get Ts mul /To exch def
  /UnderlineThickness get Ts mul /Tt exch def
  ux uy To add cs add moveto Tcx uy To add cs add lineto
  Tt setlinewidth stroke
  grestore
} bd
/SOE {
  /Tcx currentpoint pop def
  gsave
  newpath
  cf findfont cs scalefont dup
  /FontMatrix get 0 get /Ts exch def /FontInfo get dup
  /UnderlinePosition get Ts mul /To exch def
  /UnderlineThickness get Ts mul /Tt exch def
  ux uy To add cs 10 mul 26 idiv add moveto Tcx uy To add cs 10 mul 26 idiv add lineto
  Tt setlinewidth stroke
  grestore
} bd
/QT {
/Y22 exch store
/X22 exch store
/Y21 exch store
/X21 exch store
currentpoint
/Y21 load 2 mul add 3 div exch
/X21 load 2 mul add 3 div exch
/X21 load 2 mul /X22 load add 3 div
/Y21 load 2 mul /Y22 load add 3 div
/X22 load /Y22 load curveto
} bd
/SSPD {
dup length /d exch dict def
{
/v exch def
/k exch def
currentpagedevice k known {
/cpdv currentpagedevice k get def
v cpdv ne {
/upd false def
/nullv v type /nulltype eq def
/nullcpdv cpdv type /nulltype eq def
nullv nullcpdv or
{
/upd true def
} {
/sametype v type cpdv type eq def
sametype {
v type /arraytype eq {
/vlen v length def
/cpdvlen cpdv length def
vlen cpdvlen eq {
0 1 vlen 1 sub {
/i exch def
/obj v i get def
/cpdobj cpdv i get def
obj cpdobj ne {
/upd true def
exit
} if
} for
} {
/upd true def
} ifelse
} {
v type /dicttype eq {
v {
/dv exch def
/dk exch def
/cpddv cpdv dk get def
dv cpddv ne {
/upd true def
exit
} if
} forall
} {
/upd true def
} ifelse
} ifelse
} if
} ifelse
upd true eq {
d k v put
} if
} if
} if
} forall
d length 0 gt {
d setpagedevice
} if
} bd
%%EndResource
%%BeginResource: procset (Apache XML Graphics EPS ProcSet) 1.0 0
%%Version: 1.0 0
%%Copyright: (Copyright 2002-2003 The Apache Software Foundation. License terms: http://www.apache.org/licenses/LICENSE-2.0)
/BeginEPSF { %def
/b4_Inc_state save def         % Save state for cleanup
/dict_count countdictstack def % Count objects on dict stack
/op_count count 1 sub def      % Count objects on operand stack
userdict begin                 % Push userdict on dict stack
/showpage { } def              % Redefine showpage, { } = null proc
0 setgray 0 setlinecap         % Prepare graphics state
1 setlinewidth 0 setlinejoin
10 setmiterlimit [ ] 0 setdash newpath
/languagelevel where           % If level not equal to 1 then
{pop languagelevel             % set strokeadjust and
1 ne                           % overprint to their defaults.
{false setstrokeadjust false setoverprint
} if
} if
} bd
/EndEPSF { %def
count op_count sub {pop} repeat            % Clean up stacks
countdictstack dict_count sub {end} repeat
b4_Inc_state restore
} bd
%%EndResource
%FOPBeginFontDict
%%IncludeResource: font Courier-Bold
%%IncludeResource: font Helvetica
%%IncludeResource: font Courier-BoldOblique
%%IncludeResource: font Courier-Oblique
%%IncludeResource: font Times-Roman
%%IncludeResource: font Helvetica-BoldOblique
%%IncludeResource: font Helvetica-Bold
%%IncludeResource: font Helvetica-Oblique
%%IncludeResource: font Times-BoldItalic
%%IncludeResource: font Courier
%%IncludeResource: font Times-Italic
%%IncludeResource: font Times-Bold
%%IncludeResource: font Symbol
%%IncludeResource: font ZapfDingbats
%FOPEndFontDict
%%BeginResource: encoding WinAnsiEncoding
/WinAnsiEncoding [
/.notdef /.notdef /.notdef /.notdef /.notdef
/.notdef /.notdef /.notdef /.notdef /.notdef
/.notdef /.notdef /.notdef /.notdef /.notdef
/.notdef /.notdef /.notdef /.notdef /.notdef
/.notdef /.notdef /.notdef /.notdef /.notdef
/.notdef /.notdef /.notdef /.notdef /.notdef
/.notdef /.notdef /space /exclam /quotedbl
/numbersign /dollar /percent /ampersand /quotesingle
/parenleft /parenright /asterisk /plus /comma
/hyphen /period /slash /zero /one
/two /three /four /five /six
/seven /eight /nine /colon /semicolon
/less /equal /greater /question /at
/A /B /C /D /E
/F /G /H /I /J
/K /L /M /N /O
/P /Q /R /S /T
/U /V /W /X /Y
/Z /bracketleft /backslash /bracketright /asciicircum
/underscore /quoteleft /a /b /c
/d /e /f /g /h
/i /j /k /l /m
/n /o /p /q /r
/s /t /u /v /w
/x /y /z /braceleft /bar
/braceright /asciitilde /bullet /Euro /bullet
/quotesinglbase /florin /quotedblbase /ellipsis /dagger
/daggerdbl /circumflex /perthousand /Scaron /guilsinglleft
/OE /bullet /Zcaron /bullet /bullet
/quoteleft /quoteright /quotedblleft /quotedblright /bullet
/endash /emdash /asciitilde /trademark /scaron
/guilsinglright /oe /bullet /zcaron /Ydieresis
/space /exclamdown /cent /sterling /currency
/yen /brokenbar /section /dieresis /copyright
/ordfeminine /guillemotleft /logicalnot /sfthyphen /registered
/macron /degree /plusminus /twosuperior /threesuperior
/acute /mu /paragraph /middot /cedilla
/onesuperior /ordmasculine /guillemotright /onequarter /onehalf
/threequarters /questiondown /Agrave /Aacute /Acircumflex
/Atilde /Adieresis /Aring /AE /Ccedilla
/Egrave /Eacute /Ecircumflex /Edieresis /Igrave
/Iacute /Icircumflex /Idieresis /Eth /Ntilde
/Ograve /Oacute /Ocircumflex /Otilde /Odieresis
/multiply /Oslash /Ugrave /Uacute /Ucircumflex
/Udieresis /Yacute /Thorn /germandbls /agrave
/aacute /acircumflex /atilde /adieresis /aring
/ae /ccedilla /egrave /eacute /ecircumflex
/edieresis /igrave /iacute /icircumflex /idieresis
/eth /ntilde /ograve /oacute /ocircumflex
/otilde /odieresis /divide /oslash /ugrave
/uacute /ucircumflex /udieresis /yacute /thorn
/ydieresis
] def
%%EndResource
%FOPBeginFontReencode
/Courier-Bold findfont
dup length dict begin
  {1 index /FID ne {def} {pop pop} ifelse} forall
  /Encoding WinAnsiEncoding def
  currentdict
end
/Courier-Bold exch definefont pop
/Helvetica findfont
dup length dict begin
  {1 index /FID ne {def} {pop pop} ifelse} forall
  /Encoding WinAnsiEncoding def
  currentdict
end
/Helvetica exch definefont pop
/Courier-BoldOblique findfont
dup length dict begin
  {1 index /FID ne {def} {pop pop} ifelse} forall
  /Encoding WinAnsiEncoding def
  currentdict
end
/Courier-BoldOblique exch definefont pop
/Courier-Oblique findfont
dup length dict begin
  {1 index /FID ne {def} {pop pop} ifelse} forall
  /Encoding WinAnsiEncoding def
  currentdict
end
/Courier-Oblique exch definefont pop
/Times-Roman findfont
dup length dict begin
  {1 index /FID ne {def} {pop pop} ifelse} forall
  /Encoding WinAnsiEncoding def
  currentdict
end
/Times-Roman exch definefont pop
/Helvetica-BoldOblique findfont
dup length dict begin
  {1 index /FID ne {def} {pop pop} ifelse} forall
  /Encoding WinAnsiEncoding def
  currentdict
end
/Helvetica-BoldOblique exch definefont pop
/Helvetica-Bold findfont
dup length dict begin
  {1 index /FID ne {def} {pop pop} ifelse} forall
  /Encoding WinAnsiEncoding def
  currentdict
end
/Helvetica-Bold exch definefont pop
/Helvetica-Oblique findfont
dup length dict begin
  {1 index /FID ne {def} {pop pop} ifelse} forall
  /Encoding WinAnsiEncoding def
  currentdict
end
/Helvetica-Oblique exch definefont pop
/Times-BoldItalic findfont
dup length dict begin
  {1 index /FID ne {def} {pop pop} ifelse} forall
  /Encoding WinAnsiEncoding def
  currentdict
end
/Times-BoldItalic exch definefont pop
/Courier findfont
dup length dict begin
  {1 index /FID ne {def} {pop pop} ifelse} forall
  /Encoding WinAnsiEncoding def
  currentdict
end
/Courier exch definefont pop
/Times-Italic findfont
dup length dict begin
  {1 index /FID ne {def} {pop pop} ifelse} forall
  /Encoding WinAnsiEncoding def
  currentdict
end
/Times-Italic exch definefont pop
/Times-Bold findfont
dup length dict begin
  {1 index /FID ne {def} {pop pop} ifelse} forall
  /Encoding WinAnsiEncoding def
  currentdict
end
/Times-Bold exch definefont pop
%FOPEndFontReencode
%%EndProlog
%%Page: 1 1
%%PageBoundingBox: 0 0 1344 480
%%BeginPageSetup
[1 0 0 -1 0 480] CT
%%EndPageSetup
GS
1 GC
N
0 0 1344 480 re
f
GR
GS
1 GC
N
0 0 1344 480 re
f
GR
GS
1 GC
N
175 427 M
625 427 L
625 36 L
175 36 L
cp
f
GR
GS
0.149 GC
2 setlinecap
1 LJ
0.5 LW
N
175 427 M
625 427 L
S
GR
GS
0.149 GC
2 setlinecap
1 LJ
0.5 LW
N
175 427 M
175 422.5 L
S
GR
GS
0.149 GC
2 setlinecap
1 LJ
0.5 LW
N
239.286 427 M
239.286 422.5 L
S
GR
GS
0.149 GC
2 setlinecap
1 LJ
0.5 LW
N
303.571 427 M
303.571 422.5 L
S
GR
GS
0.149 GC
2 setlinecap
1 LJ
0.5 LW
N
367.857 427 M
367.857 422.5 L
S
GR
GS
0.149 GC
2 setlinecap
1 LJ
0.5 LW
N
432.143 427 M
432.143 422.5 L
S
GR
GS
0.149 GC
2 setlinecap
1 LJ
0.5 LW
N
496.429 427 M
496.429 422.5 L
S
GR
GS
0.149 GC
2 setlinecap
1 LJ
0.5 LW
N
560.714 427 M
560.714 422.5 L
S
GR
GS
0.149 GC
2 setlinecap
1 LJ
0.5 LW
N
625 427 M
625 422.5 L
S
GR
GS
[1 0 0 1 175 432.60001] CT
0.149 GC
/Helvetica 18 F
GS
[1 0 0 1 0 0] CT
-13 18 moveto 
1 -1 scale
(0.1) t 
GR
GR
GS
[1 0 0 1 239.28572 432.60001] CT
0.149 GC
/Helvetica 18 F
GS
[1 0 0 1 0 0] CT
-13 18 moveto 
1 -1 scale
(0.2) t 
GR
GR
GS
[1 0 0 1 303.57144 432.60001] CT
0.149 GC
/Helvetica 18 F
GS
[1 0 0 1 0 0] CT
-13 18 moveto 
1 -1 scale
(0.3) t 
GR
GR
GS
[1 0 0 1 367.85715 432.60001] CT
0.149 GC
/Helvetica 18 F
GS
[1 0 0 1 0 0] CT
-13 18 moveto 
1 -1 scale
(0.4) t 
GR
GR
GS
[1 0 0 1 432.14285 432.60001] CT
0.149 GC
/Helvetica 18 F
GS
[1 0 0 1 0 0] CT
-13 18 moveto 
1 -1 scale
(0.5) t 
GR
GR
GS
[1 0 0 1 496.42859 432.60001] CT
0.149 GC
/Helvetica 18 F
GS
[1 0 0 1 0 0] CT
-13 18 moveto 
1 -1 scale
(0.6) t 
GR
GR
GS
[1 0 0 1 560.71429 432.60001] CT
0.149 GC
/Helvetica 18 F
GS
[1 0 0 1 0 0] CT
-13 18 moveto 
1 -1 scale
(0.7) t 
GR
GR
GS
[1 0 0 1 625 432.60001] CT
0.149 GC
/Helvetica 18 F
GS
[1 0 0 1 0 0] CT
-13 18 moveto 
1 -1 scale
(0.8) t 
GR
GR
GS
[1 0 0 1 400.00021 455.59998] CT
0.149 GC
/Helvetica 18 F
GS
[1 0 0 1 0 0] CT
-83 18 moveto 
1 -1 scale
(Vanilla MSE, Scale 1) t 
GR
GR
GS
0.149 GC
2 setlinecap
1 LJ
0.5 LW
N
175 427 M
175 36 L
S
GR
GS
0.149 GC
2 setlinecap
1 LJ
0.5 LW
N
175 427 M
179.5 427 L
S
GR
GS
0.149 GC
2 setlinecap
1 LJ
0.5 LW
N
175 383.556 M
179.5 383.556 L
S
GR
GS
0.149 GC
2 setlinecap
1 LJ
0.5 LW
N
175 340.111 M
179.5 340.111 L
S
GR
GS
0.149 GC
2 setlinecap
1 LJ
0.5 LW
N
175 296.667 M
179.5 296.667 L
S
GR
GS
0.149 GC
2 setlinecap
1 LJ
0.5 LW
N
175 253.222 M
179.5 253.222 L
S
GR
GS
0.149 GC
2 setlinecap
1 LJ
0.5 LW
N
175 209.778 M
179.5 209.778 L
S
GR
GS
0.149 GC
2 setlinecap
1 LJ
0.5 LW
N
175 166.333 M
179.5 166.333 L
S
GR
GS
0.149 GC
2 setlinecap
1 LJ
0.5 LW
N
175 122.889 M
179.5 122.889 L
S
GR
GS
0.149 GC
2 setlinecap
1 LJ
0.5 LW
N
175 79.444 M
179.5 79.444 L
S
GR
GS
0.149 GC
2 setlinecap
1 LJ
0.5 LW
N
175 36 M
179.5 36 L
S
GR
GS
[1 0 0 1 169.40001 427] CT
0.149 GC
/Helvetica 18 F
GS
[1 0 0 1 0 0] CT
-43 7 moveto 
1 -1 scale
(-0.04) t 
GR
GR
GS
[1 0 0 1 169.40001 383.55554] CT
0.149 GC
/Helvetica 18 F
GS
[1 0 0 1 0 0] CT
-53 7 moveto 
1 -1 scale
(-0.035) t 
GR
GR
GS
[1 0 0 1 169.40001 340.11111] CT
0.149 GC
/Helvetica 18 F
GS
[1 0 0 1 0 0] CT
-43 7 moveto 
1 -1 scale
(-0.03) t 
GR
GR
GS
[1 0 0 1 169.40001 296.66666] CT
0.149 GC
/Helvetica 18 F
GS
[1 0 0 1 0 0] CT
-53 7 moveto 
1 -1 scale
(-0.025) t 
GR
GR
GS
[1 0 0 1 169.40001 253.22221] CT
0.149 GC
/Helvetica 18 F
GS
[1 0 0 1 0 0] CT
-43 7 moveto 
1 -1 scale
(-0.02) t 
GR
GR
GS
[1 0 0 1 169.40001 209.77777] CT
0.149 GC
/Helvetica 18 F
GS
[1 0 0 1 0 0] CT
-53 7 moveto 
1 -1 scale
(-0.015) t 
GR
GR
GS
[1 0 0 1 169.40001 166.33333] CT
0.149 GC
/Helvetica 18 F
GS
[1 0 0 1 0 0] CT
-43 7 moveto 
1 -1 scale
(-0.01) t 
GR
GR
GS
[1 0 0 1 169.40001 122.88889] CT
0.149 GC
/Helvetica 18 F
GS
[1 0 0 1 0 0] CT
-53 7 moveto 
1 -1 scale
(-0.005) t 
GR
GR
GS
[1 0 0 1 169.40001 79.44444] CT
0.149 GC
/Helvetica 18 F
GS
[1 0 0 1 0 0] CT
-11 7 moveto 
1 -1 scale
(0) t 
GR
GR
GS
[1 0 0 1 169.40001 36] CT
0.149 GC
/Helvetica 18 F
GS
[1 0 0 1 0 0] CT
-46 7 moveto 
1 -1 scale
(0.005) t 
GR
GR
GS
[0 -1 1 0 113.4 231.4998] CT
0.149 GC
/Helvetica 18 F
GS
[1 0 0 1 0 0] CT
-138.5 -4 moveto 
1 -1 scale
(PSD Slope 2-64 Hz \(excl. 7-13 Hz\)) t 
GR
GR
GS
[1 0 0 1 400.0004 31.5] CT
/Helvetica-Bold 18 F
GS
[1 0 0 1 0 0] CT
-161 -4 moveto 
1 -1 scale
(Fast scale entropy reflects PSD slope) t 
GR
GR
GS
N
362.5 252.5 M
361.621 250.379 L
359.5 249.5 L
357.379 250.379 L
356.5 252.5 L
357.379 254.621 L
359.5 255.5 L
361.621 254.621 L
362.5 252.5 L
cp
f
GR
GS
N
407.5 262.5 M
406.621 260.379 L
404.5 259.5 L
402.379 260.379 L
401.5 262.5 L
402.379 264.621 L
404.5 265.5 L
406.621 264.621 L
407.5 262.5 L
cp
f
GR
GS
N
357.5 267.5 M
356.621 265.379 L
354.5 264.5 L
352.379 265.379 L
351.5 267.5 L
352.379 269.621 L
354.5 270.5 L
356.621 269.621 L
357.5 267.5 L
cp
f
GR
GS
N
408.5 191.5 M
407.621 189.379 L
405.5 188.5 L
403.379 189.379 L
402.5 191.5 L
403.379 193.621 L
405.5 194.5 L
407.621 193.621 L
408.5 191.5 L
cp
f
GR
GS
N
410.5 263.5 M
409.621 261.379 L
407.5 260.5 L
405.379 261.379 L
404.5 263.5 L
405.379 265.621 L
407.5 266.5 L
409.621 265.621 L
410.5 263.5 L
cp
f
GR
GS
N
208.5 335.5 M
207.621 333.379 L
205.5 332.5 L
203.379 333.379 L
202.5 335.5 L
203.379 337.621 L
205.5 338.5 L
207.621 337.621 L
208.5 335.5 L
cp
f
GR
GS
N
457.5 244.5 M
456.621 242.379 L
454.5 241.5 L
452.379 242.379 L
451.5 244.5 L
452.379 246.621 L
454.5 247.5 L
456.621 246.621 L
457.5 244.5 L
cp
f
GR
GS
N
437.5 259.5 M
436.621 257.379 L
434.5 256.5 L
432.379 257.379 L
431.5 259.5 L
432.379 261.621 L
434.5 262.5 L
436.621 261.621 L
437.5 259.5 L
cp
f
GR
GS
N
502.5 174.5 M
501.621 172.379 L
499.5 171.5 L
497.379 172.379 L
496.5 174.5 L
497.379 176.621 L
499.5 177.5 L
501.621 176.621 L
502.5 174.5 L
cp
f
GR
GS
N
335.5 327.5 M
334.621 325.379 L
332.5 324.5 L
330.379 325.379 L
329.5 327.5 L
330.379 329.621 L
332.5 330.5 L
334.621 329.621 L
335.5 327.5 L
cp
f
GR
GS
N
294.5 418.5 M
293.621 416.379 L
291.5 415.5 L
289.379 416.379 L
288.5 418.5 L
289.379 420.621 L
291.5 421.5 L
293.621 420.621 L
294.5 418.5 L
cp
f
GR
GS
N
381.5 283.5 M
380.621 281.379 L
378.5 280.5 L
376.379 281.379 L
375.5 283.5 L
376.379 285.621 L
378.5 286.5 L
380.621 285.621 L
381.5 283.5 L
cp
f
GR
GS
N
226.5 322.5 M
225.621 320.379 L
223.5 319.5 L
221.379 320.379 L
220.5 322.5 L
221.379 324.621 L
223.5 325.5 L
225.621 324.621 L
226.5 322.5 L
cp
f
GR
GS
N
360.5 343.5 M
359.621 341.379 L
357.5 340.5 L
355.379 341.379 L
354.5 343.5 L
355.379 345.621 L
357.5 346.5 L
359.621 345.621 L
360.5 343.5 L
cp
f
GR
GS
N
367.5 279.5 M
366.621 277.379 L
364.5 276.5 L
362.379 277.379 L
361.5 279.5 L
362.379 281.621 L
364.5 282.5 L
366.621 281.621 L
367.5 279.5 L
cp
f
GR
GS
N
348.5 330.5 M
347.621 328.379 L
345.5 327.5 L
343.379 328.379 L
342.5 330.5 L
343.379 332.621 L
345.5 333.5 L
347.621 332.621 L
348.5 330.5 L
cp
f
GR
GS
N
311.5 340.5 M
310.621 338.379 L
308.5 337.5 L
306.379 338.379 L
305.5 340.5 L
306.379 342.621 L
308.5 343.5 L
310.621 342.621 L
311.5 340.5 L
cp
f
GR
GS
N
347.5 311.5 M
346.621 309.379 L
344.5 308.5 L
342.379 309.379 L
341.5 311.5 L
342.379 313.621 L
344.5 314.5 L
346.621 313.621 L
347.5 311.5 L
cp
f
GR
GS
N
302.5 338.5 M
301.621 336.379 L
299.5 335.5 L
297.379 336.379 L
296.5 338.5 L
297.379 340.621 L
299.5 341.5 L
301.621 340.621 L
302.5 338.5 L
cp
f
GR
GS
N
382.5 271.5 M
381.621 269.379 L
379.5 268.5 L
377.379 269.379 L
376.5 271.5 L
377.379 273.621 L
379.5 274.5 L
381.621 273.621 L
382.5 271.5 L
cp
f
GR
GS
N
397.5 266.5 M
396.621 264.379 L
394.5 263.5 L
392.379 264.379 L
391.5 266.5 L
392.379 268.621 L
394.5 269.5 L
396.621 268.621 L
397.5 266.5 L
cp
f
GR
GS
N
382.5 310.5 M
381.621 308.379 L
379.5 307.5 L
377.379 308.379 L
376.5 310.5 L
377.379 312.621 L
379.5 313.5 L
381.621 312.621 L
382.5 310.5 L
cp
f
GR
GS
N
434.5 202.5 M
433.621 200.379 L
431.5 199.5 L
429.379 200.379 L
428.5 202.5 L
429.379 204.621 L
431.5 205.5 L
433.621 204.621 L
434.5 202.5 L
cp
f
GR
GS
N
474.5 125.5 M
473.621 123.379 L
471.5 122.5 L
469.379 123.379 L
468.5 125.5 L
469.379 127.621 L
471.5 128.5 L
473.621 127.621 L
474.5 125.5 L
cp
f
GR
GS
N
375.5 290.5 M
374.621 288.379 L
372.5 287.5 L
370.379 288.379 L
369.5 290.5 L
370.379 292.621 L
372.5 293.5 L
374.621 292.621 L
375.5 290.5 L
cp
f
GR
GS
N
324.5 315.5 M
323.621 313.379 L
321.5 312.5 L
319.379 313.379 L
318.5 315.5 L
319.379 317.621 L
321.5 318.5 L
323.621 317.621 L
324.5 315.5 L
cp
f
GR
GS
N
189.5 363.5 M
188.621 361.379 L
186.5 360.5 L
184.379 361.379 L
183.5 363.5 L
184.379 365.621 L
186.5 366.5 L
188.621 365.621 L
189.5 363.5 L
cp
f
GR
GS
N
238.5 238.5 M
237.621 236.379 L
235.5 235.5 L
233.379 236.379 L
232.5 238.5 L
233.379 240.621 L
235.5 241.5 L
237.621 240.621 L
238.5 238.5 L
cp
f
GR
GS
N
402.5 276.5 M
401.621 274.379 L
399.5 273.5 L
397.379 274.379 L
396.5 276.5 L
397.379 278.621 L
399.5 279.5 L
401.621 278.621 L
402.5 276.5 L
cp
f
GR
GS
N
405.5 261.5 M
404.621 259.379 L
402.5 258.5 L
400.379 259.379 L
399.5 261.5 L
400.379 263.621 L
402.5 264.5 L
404.621 263.621 L
405.5 261.5 L
cp
f
GR
GS
N
335.5 325.5 M
334.621 323.379 L
332.5 322.5 L
330.379 323.379 L
329.5 325.5 L
330.379 327.621 L
332.5 328.5 L
334.621 327.621 L
335.5 325.5 L
cp
f
GR
GS
N
457.5 217.5 M
456.621 215.379 L
454.5 214.5 L
452.379 215.379 L
451.5 217.5 L
452.379 219.621 L
454.5 220.5 L
456.621 219.621 L
457.5 217.5 L
cp
f
GR
GS
N
492.5 210.5 M
491.621 208.379 L
489.5 207.5 L
487.379 208.379 L
486.5 210.5 L
487.379 212.621 L
489.5 213.5 L
491.621 212.621 L
492.5 210.5 L
cp
f
GR
GS
N
360.5 336.5 M
359.621 334.379 L
357.5 333.5 L
355.379 334.379 L
354.5 336.5 L
355.379 338.621 L
357.5 339.5 L
359.621 338.621 L
360.5 336.5 L
cp
f
GR
GS
N
318.5 315.5 M
317.621 313.379 L
315.5 312.5 L
313.379 313.379 L
312.5 315.5 L
313.379 317.621 L
315.5 318.5 L
317.621 317.621 L
318.5 315.5 L
cp
f
GR
GS
N
323.5 338.5 M
322.621 336.379 L
320.5 335.5 L
318.379 336.379 L
317.5 338.5 L
318.379 340.621 L
320.5 341.5 L
322.621 340.621 L
323.5 338.5 L
cp
f
GR
GS
N
373.5 280.5 M
372.621 278.379 L
370.5 277.5 L
368.379 278.379 L
367.5 280.5 L
368.379 282.621 L
370.5 283.5 L
372.621 282.621 L
373.5 280.5 L
cp
f
GR
GS
N
436.5 255.5 M
435.621 253.379 L
433.5 252.5 L
431.379 253.379 L
430.5 255.5 L
431.379 257.621 L
433.5 258.5 L
435.621 257.621 L
436.5 255.5 L
cp
f
GR
GS
N
330.5 319.5 M
329.621 317.379 L
327.5 316.5 L
325.379 317.379 L
324.5 319.5 L
325.379 321.621 L
327.5 322.5 L
329.621 321.621 L
330.5 319.5 L
cp
f
GR
GS
N
333.5 330.5 M
332.621 328.379 L
330.5 327.5 L
328.379 328.379 L
327.5 330.5 L
328.379 332.621 L
330.5 333.5 L
332.621 332.621 L
333.5 330.5 L
cp
f
GR
GS
N
477.5 173.5 M
476.621 171.379 L
474.5 170.5 L
472.379 171.379 L
471.5 173.5 L
472.379 175.621 L
474.5 176.5 L
476.621 175.621 L
477.5 173.5 L
cp
f
GR
GS
N
427.5 266.5 M
426.621 264.379 L
424.5 263.5 L
422.379 264.379 L
421.5 266.5 L
422.379 268.621 L
424.5 269.5 L
426.621 268.621 L
427.5 266.5 L
cp
f
GR
GS
N
428.5 216.5 M
427.621 214.379 L
425.5 213.5 L
423.379 214.379 L
422.5 216.5 L
423.379 218.621 L
425.5 219.5 L
427.621 218.621 L
428.5 216.5 L
cp
f
GR
GS
N
445.5 255.5 M
444.621 253.379 L
442.5 252.5 L
440.379 253.379 L
439.5 255.5 L
440.379 257.621 L
442.5 258.5 L
444.621 257.621 L
445.5 255.5 L
cp
f
GR
GS
N
421.5 273.5 M
420.621 271.379 L
418.5 270.5 L
416.379 271.379 L
415.5 273.5 L
416.379 275.621 L
418.5 276.5 L
420.621 275.621 L
421.5 273.5 L
cp
f
GR
GS
N
382.5 299.5 M
381.621 297.379 L
379.5 296.5 L
377.379 297.379 L
376.5 299.5 L
377.379 301.621 L
379.5 302.5 L
381.621 301.621 L
382.5 299.5 L
cp
f
GR
GS
N
475.5 149.5 M
474.621 147.379 L
472.5 146.5 L
470.379 147.379 L
469.5 149.5 L
470.379 151.621 L
472.5 152.5 L
474.621 151.621 L
475.5 149.5 L
cp
f
GR
GS
0.749 GC
1 LJ
0.5 LW
N
175 400.421 M
560.714 160.323 L
S
GR
GS
1 0 0 RC
N
474.5 187.5 M
473.621 185.379 L
471.5 184.5 L
469.379 185.379 L
468.5 187.5 L
469.379 189.621 L
471.5 190.5 L
473.621 189.621 L
474.5 187.5 L
cp
f
GR
GS
1 0 0 RC
N
318.5 153.5 M
317.621 151.379 L
315.5 150.5 L
313.379 151.379 L
312.5 153.5 L
313.379 155.621 L
315.5 156.5 L
317.621 155.621 L
318.5 153.5 L
cp
f
GR
GS
1 0 0 RC
N
422.5 249.5 M
421.621 247.379 L
419.5 246.5 L
417.379 247.379 L
416.5 249.5 L
417.379 251.621 L
419.5 252.5 L
421.621 251.621 L
422.5 249.5 L
cp
f
GR
GS
1 0 0 RC
N
416.5 155.5 M
415.621 153.379 L
413.5 152.5 L
411.379 153.379 L
410.5 155.5 L
411.379 157.621 L
413.5 158.5 L
415.621 157.621 L
416.5 155.5 L
cp
f
GR
GS
1 0 0 RC
N
505.5 122.5 M
504.621 120.379 L
502.5 119.5 L
500.379 120.379 L
499.5 122.5 L
500.379 124.621 L
502.5 125.5 L
504.621 124.621 L
505.5 122.5 L
cp
f
GR
GS
1 0 0 RC
N
457.5 166.5 M
456.621 164.379 L
454.5 163.5 L
452.379 164.379 L
451.5 166.5 L
452.379 168.621 L
454.5 169.5 L
456.621 168.621 L
457.5 166.5 L
cp
f
GR
GS
1 0 0 RC
N
556.5 77.5 M
555.621 75.379 L
553.5 74.5 L
551.379 75.379 L
550.5 77.5 L
551.379 79.621 L
553.5 80.5 L
555.621 79.621 L
556.5 77.5 L
cp
f
GR
GS
1 0 0 RC
N
357.5 298.5 M
356.621 296.379 L
354.5 295.5 L
352.379 296.379 L
351.5 298.5 L
352.379 300.621 L
354.5 301.5 L
356.621 300.621 L
357.5 298.5 L
cp
f
GR
GS
1 0 0 RC
N
462.5 169.5 M
461.621 167.379 L
459.5 166.5 L
457.379 167.379 L
456.5 169.5 L
457.379 171.621 L
459.5 172.5 L
461.621 171.621 L
462.5 169.5 L
cp
f
GR
GS
1 0 0 RC
N
397.5 294.5 M
396.621 292.379 L
394.5 291.5 L
392.379 292.379 L
391.5 294.5 L
392.379 296.621 L
394.5 297.5 L
396.621 296.621 L
397.5 294.5 L
cp
f
GR
GS
1 0 0 RC
N
480.5 157.5 M
479.621 155.379 L
477.5 154.5 L
475.379 155.379 L
474.5 157.5 L
475.379 159.621 L
477.5 160.5 L
479.621 159.621 L
480.5 157.5 L
cp
f
GR
GS
1 0 0 RC
N
383.5 251.5 M
382.621 249.379 L
380.5 248.5 L
378.379 249.379 L
377.5 251.5 L
378.379 253.621 L
380.5 254.5 L
382.621 253.621 L
383.5 251.5 L
cp
f
GR
GS
1 0 0 RC
N
326.5 283.5 M
325.621 281.379 L
323.5 280.5 L
321.379 281.379 L
320.5 283.5 L
321.379 285.621 L
323.5 286.5 L
325.621 285.621 L
326.5 283.5 L
cp
f
GR
GS
1 0 0 RC
N
372.5 240.5 M
371.621 238.379 L
369.5 237.5 L
367.379 238.379 L
366.5 240.5 L
367.379 242.621 L
369.5 243.5 L
371.621 242.621 L
372.5 240.5 L
cp
f
GR
GS
1 0 0 RC
N
515.5 71.5 M
514.621 69.379 L
512.5 68.5 L
510.379 69.379 L
509.5 71.5 L
510.379 73.621 L
512.5 74.5 L
514.621 73.621 L
515.5 71.5 L
cp
f
GR
GS
1 0 0 RC
N
411.5 227.5 M
410.621 225.379 L
408.5 224.5 L
406.379 225.379 L
405.5 227.5 L
406.379 229.621 L
408.5 230.5 L
410.621 229.621 L
411.5 227.5 L
cp
f
GR
GS
1 0 0 RC
N
364.5 255.5 M
363.621 253.379 L
361.5 252.5 L
359.379 253.379 L
358.5 255.5 L
359.379 257.621 L
361.5 258.5 L
363.621 257.621 L
364.5 255.5 L
cp
f
GR
GS
1 0 0 RC
N
436.5 212.5 M
435.621 210.379 L
433.5 209.5 L
431.379 210.379 L
430.5 212.5 L
431.379 214.621 L
433.5 215.5 L
435.621 214.621 L
436.5 212.5 L
cp
f
GR
GS
1 0 0 RC
N
420.5 147.5 M
419.621 145.379 L
417.5 144.5 L
415.379 145.379 L
414.5 147.5 L
415.379 149.621 L
417.5 150.5 L
419.621 149.621 L
420.5 147.5 L
cp
f
GR
GS
1 0 0 RC
N
419.5 216.5 M
418.621 214.379 L
416.5 213.5 L
414.379 214.379 L
413.5 216.5 L
414.379 218.621 L
416.5 219.5 L
418.621 218.621 L
419.5 216.5 L
cp
f
GR
GS
1 0 0 RC
N
331.5 327.5 M
330.621 325.379 L
328.5 324.5 L
326.379 325.379 L
325.5 327.5 L
326.379 329.621 L
328.5 330.5 L
330.621 329.621 L
331.5 327.5 L
cp
f
GR
GS
1 0 0 RC
N
390.5 241.5 M
389.621 239.379 L
387.5 238.5 L
385.379 239.379 L
384.5 241.5 L
385.379 243.621 L
387.5 244.5 L
389.621 243.621 L
390.5 241.5 L
cp
f
GR
GS
1 0 0 RC
N
438.5 176.5 M
437.621 174.379 L
435.5 173.5 L
433.379 174.379 L
432.5 176.5 L
433.379 178.621 L
435.5 179.5 L
437.621 178.621 L
438.5 176.5 L
cp
f
GR
GS
1 0 0 RC
N
493.5 184.5 M
492.621 182.379 L
490.5 181.5 L
488.379 182.379 L
487.5 184.5 L
488.379 186.621 L
490.5 187.5 L
492.621 186.621 L
493.5 184.5 L
cp
f
GR
GS
1 0 0 RC
N
460.5 226.5 M
459.621 224.379 L
457.5 223.5 L
455.379 224.379 L
454.5 226.5 L
455.379 228.621 L
457.5 229.5 L
459.621 228.621 L
460.5 226.5 L
cp
f
GR
GS
1 0 0 RC
N
458.5 259.5 M
457.621 257.379 L
455.5 256.5 L
453.379 257.379 L
452.5 259.5 L
453.379 261.621 L
455.5 262.5 L
457.621 261.621 L
458.5 259.5 L
cp
f
GR
GS
1 0 0 RC
N
494.5 225.5 M
493.621 223.379 L
491.5 222.5 L
489.379 223.379 L
488.5 225.5 L
489.379 227.621 L
491.5 228.5 L
493.621 227.621 L
494.5 225.5 L
cp
f
GR
GS
1 0 0 RC
N
402.5 266.5 M
401.621 264.379 L
399.5 263.5 L
397.379 264.379 L
396.5 266.5 L
397.379 268.621 L
399.5 269.5 L
401.621 268.621 L
402.5 266.5 L
cp
f
GR
GS
1 0 0 RC
N
528.5 195.5 M
527.621 193.379 L
525.5 192.5 L
523.379 193.379 L
522.5 195.5 L
523.379 197.621 L
525.5 198.5 L
527.621 197.621 L
528.5 195.5 L
cp
f
GR
GS
1 0 0 RC
N
454.5 190.5 M
453.621 188.379 L
451.5 187.5 L
449.379 188.379 L
448.5 190.5 L
449.379 192.621 L
451.5 193.5 L
453.621 192.621 L
454.5 190.5 L
cp
f
GR
GS
1 0 0 RC
N
492.5 48.5 M
491.621 46.379 L
489.5 45.5 L
487.379 46.379 L
486.5 48.5 L
487.379 50.621 L
489.5 51.5 L
491.621 50.621 L
492.5 48.5 L
cp
f
GR
GS
1 0 0 RC
N
517.5 105.5 M
516.621 103.379 L
514.5 102.5 L
512.379 103.379 L
511.5 105.5 L
512.379 107.621 L
514.5 108.5 L
516.621 107.621 L
517.5 105.5 L
cp
f
GR
GS
1 0 0 RC
N
531.5 116.5 M
530.621 114.379 L
528.5 113.5 L
526.379 114.379 L
525.5 116.5 L
526.379 118.621 L
528.5 119.5 L
530.621 118.621 L
531.5 116.5 L
cp
f
GR
GS
1 0 0 RC
N
533.5 78.5 M
532.621 76.379 L
530.5 75.5 L
528.379 76.379 L
527.5 78.5 L
528.379 80.621 L
530.5 81.5 L
532.621 80.621 L
533.5 78.5 L
cp
f
GR
GS
1 0 0 RC
N
530.5 124.5 M
529.621 122.379 L
527.5 121.5 L
525.379 122.379 L
524.5 124.5 L
525.379 126.621 L
527.5 127.5 L
529.621 126.621 L
530.5 124.5 L
cp
f
GR
GS
1 0 0 RC
N
539.5 71.5 M
538.621 69.379 L
536.5 68.5 L
534.379 69.379 L
533.5 71.5 L
534.379 73.621 L
536.5 74.5 L
538.621 73.621 L
539.5 71.5 L
cp
f
GR
GS
1 0 0 RC
N
456.5 177.5 M
455.621 175.379 L
453.5 174.5 L
451.379 175.379 L
450.5 177.5 L
451.379 179.621 L
453.5 180.5 L
455.621 179.621 L
456.5 177.5 L
cp
f
GR
GS
1 0 0 RC
N
550.5 126.5 M
549.621 124.379 L
547.5 123.5 L
545.379 124.379 L
544.5 126.5 L
545.379 128.621 L
547.5 129.5 L
549.621 128.621 L
550.5 126.5 L
cp
f
GR
GS
1 0 0 RC
N
455.5 248.5 M
454.621 246.379 L
452.5 245.5 L
450.379 246.379 L
449.5 248.5 L
450.379 250.621 L
452.5 251.5 L
454.621 250.621 L
455.5 248.5 L
cp
f
GR
GS
1 0 0 RC
N
307.5 341.5 M
306.621 339.379 L
304.5 338.5 L
302.379 339.379 L
301.5 341.5 L
302.379 343.621 L
304.5 344.5 L
306.621 343.621 L
307.5 341.5 L
cp
f
GR
GS
1 0 0 RC
N
459.5 196.5 M
458.621 194.379 L
456.5 193.5 L
454.379 194.379 L
453.5 196.5 L
454.379 198.621 L
456.5 199.5 L
458.621 198.621 L
459.5 196.5 L
cp
f
GR
GS
1 0 0 RC
N
540.5 43.5 M
539.621 41.379 L
537.5 40.5 L
535.379 41.379 L
534.5 43.5 L
535.379 45.621 L
537.5 46.5 L
539.621 45.621 L
540.5 43.5 L
cp
f
GR
GS
1 0 0 RC
N
317.5 254.5 M
316.621 252.379 L
314.5 251.5 L
312.379 252.379 L
311.5 254.5 L
312.379 256.621 L
314.5 257.5 L
316.621 256.621 L
317.5 254.5 L
cp
f
GR
GS
1 0 0 RC
N
396.5 294.5 M
395.621 292.379 L
393.5 291.5 L
391.379 292.379 L
390.5 294.5 L
391.379 296.621 L
393.5 297.5 L
395.621 296.621 L
396.5 294.5 L
cp
f
GR
GS
1 0 0 RC
N
540.5 122.5 M
539.621 120.379 L
537.5 119.5 L
535.379 120.379 L
534.5 122.5 L
535.379 124.621 L
537.5 125.5 L
539.621 124.621 L
540.5 122.5 L
cp
f
GR
GS
1 0 0 RC
N
519.5 169.5 M
518.621 167.379 L
516.5 166.5 L
514.379 167.379 L
513.5 169.5 L
514.379 171.621 L
516.5 172.5 L
518.621 171.621 L
519.5 169.5 L
cp
f
GR
GS
1 0 0 RC
N
317.5 311.5 M
316.621 309.379 L
314.5 308.5 L
312.379 309.379 L
311.5 311.5 L
312.379 313.621 L
314.5 314.5 L
316.621 313.621 L
317.5 311.5 L
cp
f
GR
GS
1 0 0 RC
N
472.5 202.5 M
471.621 200.379 L
469.5 199.5 L
467.379 200.379 L
466.5 202.5 L
467.379 204.621 L
469.5 205.5 L
471.621 204.621 L
472.5 202.5 L
cp
f
GR
GS
1 0 0 RC
N
488.5 123.5 M
487.621 121.379 L
485.5 120.5 L
483.379 121.379 L
482.5 123.5 L
483.379 125.621 L
485.5 126.5 L
487.621 125.621 L
488.5 123.5 L
cp
f
GR
GS
1 0 0 RC
N
446.5 246.5 M
445.621 244.379 L
443.5 243.5 L
441.379 244.379 L
440.5 246.5 L
441.379 248.621 L
443.5 249.5 L
445.621 248.621 L
446.5 246.5 L
cp
f
GR
GS
1 0 0 RC
N
362.5 259.5 M
361.621 257.379 L
359.5 256.5 L
357.379 257.379 L
356.5 259.5 L
357.379 261.621 L
359.5 262.5 L
361.621 261.621 L
362.5 259.5 L
cp
f
GR
GS
1 0 0 RC
N
519.5 120.5 M
518.621 118.379 L
516.5 117.5 L
514.379 118.379 L
513.5 120.5 L
514.379 122.621 L
516.5 123.5 L
518.621 122.621 L
519.5 120.5 L
cp
f
GR
GS
0.749 GC
1 LJ
0.5 LW
N
175 421.231 M
625 38.994 L
S
GR
GS
0.749 GC
1 LJ
0.5 LW
N
175 400.421 M
625 120.307 L
S
GR
GS
[1 0 0 1 222 59.13402] CT
/Helvetica 18 F
GS
[1 0 0 1 0 0] CT
0 7 moveto 
1 -1 scale
(Younger Adults: r=0.76) t 
GR
GR
GS
N
207.5 59.5 M
206.621 57.379 L
204.5 56.5 L
202.379 57.379 L
201.5 59.5 L
202.379 61.621 L
204.5 62.5 L
206.621 61.621 L
207.5 59.5 L
cp
f
GR
GS
[1 0 0 1 222 81.86598] CT
/Helvetica 18 F
GS
[1 0 0 1 0 0] CT
0 7 moveto 
1 -1 scale
(Older Adults: r=0.8) t 
GR
GR
GS
1 0 0 RC
N
207.5 81.5 M
206.621 79.379 L
204.5 78.5 L
202.379 79.379 L
201.5 81.5 L
202.379 83.621 L
204.5 84.5 L
206.621 83.621 L
207.5 81.5 L
cp
f
GR
GS
1 GC
N
767 427 M
1216 427 L
1216 36 L
767 36 L
cp
f
GR
GS
0.149 GC
2 setlinecap
1 LJ
0.5 LW
N
767 427 M
1216 427 L
S
GR
GS
0.149 GC
2 setlinecap
1 LJ
0.5 LW
N
767 427 M
767 422.51 L
S
GR
GS
0.149 GC
2 setlinecap
1 LJ
0.5 LW
N
831.143 427 M
831.143 422.51 L
S
GR
GS
0.149 GC
2 setlinecap
1 LJ
0.5 LW
N
895.286 427 M
895.286 422.51 L
S
GR
GS
0.149 GC
2 setlinecap
1 LJ
0.5 LW
N
959.429 427 M
959.429 422.51 L
S
GR
GS
0.149 GC
2 setlinecap
1 LJ
0.5 LW
N
1023.571 427 M
1023.571 422.51 L
S
GR
GS
0.149 GC
2 setlinecap
1 LJ
0.5 LW
N
1087.714 427 M
1087.714 422.51 L
S
GR
GS
0.149 GC
2 setlinecap
1 LJ
0.5 LW
N
1151.857 427 M
1151.857 422.51 L
S
GR
GS
0.149 GC
2 setlinecap
1 LJ
0.5 LW
N
1216 427 M
1216 422.51 L
S
GR
GS
[1 0 0 1 767 432.60001] CT
0.149 GC
/Helvetica 18 F
GS
[1 0 0 1 0 0] CT
-13 18 moveto 
1 -1 scale
(0.1) t 
GR
GR
GS
[1 0 0 1 831.14288 432.60001] CT
0.149 GC
/Helvetica 18 F
GS
[1 0 0 1 0 0] CT
-13 18 moveto 
1 -1 scale
(0.2) t 
GR
GR
GS
[1 0 0 1 895.28571 432.60001] CT
0.149 GC
/Helvetica 18 F
GS
[1 0 0 1 0 0] CT
-13 18 moveto 
1 -1 scale
(0.3) t 
GR
GR
GS
[1 0 0 1 959.42859 432.60001] CT
0.149 GC
/Helvetica 18 F
GS
[1 0 0 1 0 0] CT
-13 18 moveto 
1 -1 scale
(0.4) t 
GR
GR
GS
[1 0 0 1 1023.57141 432.60001] CT
0.149 GC
/Helvetica 18 F
GS
[1 0 0 1 0 0] CT
-13 18 moveto 
1 -1 scale
(0.5) t 
GR
GR
GS
[1 0 0 1 1087.71436 432.60001] CT
0.149 GC
/Helvetica 18 F
GS
[1 0 0 1 0 0] CT
-13 18 moveto 
1 -1 scale
(0.6) t 
GR
GR
GS
[1 0 0 1 1151.85718 432.60001] CT
0.149 GC
/Helvetica 18 F
GS
[1 0 0 1 0 0] CT
-13 18 moveto 
1 -1 scale
(0.7) t 
GR
GR
GS
[1 0 0 1 1216 432.60001] CT
0.149 GC
/Helvetica 18 F
GS
[1 0 0 1 0 0] CT
-13 18 moveto 
1 -1 scale
(0.8) t 
GR
GR
GS
[1 0 0 1 991.50024 455.60001] CT
0.149 GC
/Helvetica 18 F
GS
[1 0 0 1 0 0] CT
-88 18 moveto 
1 -1 scale
(Vanilla MSE, Scale 41) t 
GR
GR
GS
0.149 GC
2 setlinecap
1 LJ
0.5 LW
N
767 427 M
767 36 L
S
GR
GS
0.149 GC
2 setlinecap
1 LJ
0.5 LW
N
767 427 M
771.49 427 L
S
GR
GS
0.149 GC
2 setlinecap
1 LJ
0.5 LW
N
767 386.518 M
771.49 386.518 L
S
GR
GS
0.149 GC
2 setlinecap
1 LJ
0.5 LW
N
767 346.036 M
771.49 346.036 L
S
GR
GS
0.149 GC
2 setlinecap
1 LJ
0.5 LW
N
767 305.555 M
771.49 305.555 L
S
GR
GS
0.149 GC
2 setlinecap
1 LJ
0.5 LW
N
767 265.073 M
771.49 265.073 L
S
GR
GS
0.149 GC
2 setlinecap
1 LJ
0.5 LW
N
767 224.591 M
771.49 224.591 L
S
GR
GS
0.149 GC
2 setlinecap
1 LJ
0.5 LW
N
767 184.109 M
771.49 184.109 L
S
GR
GS
0.149 GC
2 setlinecap
1 LJ
0.5 LW
N
767 143.628 M
771.49 143.628 L
S
GR
GS
0.149 GC
2 setlinecap
1 LJ
0.5 LW
N
767 103.146 M
771.49 103.146 L
S
GR
GS
0.149 GC
2 setlinecap
1 LJ
0.5 LW
N
767 62.664 M
771.49 62.664 L
S
GR
GS
[1 0 0 1 761.40002 427] CT
0.149 GC
/Helvetica 18 F
GS
[1 0 0 1 0 0] CT
-43 7 moveto 
1 -1 scale
(-0.04) t 
GR
GR
GS
[1 0 0 1 761.40002 386.51822] CT
0.149 GC
/Helvetica 18 F
GS
[1 0 0 1 0 0] CT
-53 7 moveto 
1 -1 scale
(-0.035) t 
GR
GR
GS
[1 0 0 1 761.40002 346.03644] CT
0.149 GC
/Helvetica 18 F
GS
[1 0 0 1 0 0] CT
-43 7 moveto 
1 -1 scale
(-0.03) t 
GR
GR
GS
[1 0 0 1 761.40002 305.55466] CT
0.149 GC
/Helvetica 18 F
GS
[1 0 0 1 0 0] CT
-53 7 moveto 
1 -1 scale
(-0.025) t 
GR
GR
GS
[1 0 0 1 761.40002 265.07288] CT
0.149 GC
/Helvetica 18 F
GS
[1 0 0 1 0 0] CT
-43 7 moveto 
1 -1 scale
(-0.02) t 
GR
GR
GS
[1 0 0 1 761.40002 224.59109] CT
0.149 GC
/Helvetica 18 F
GS
[1 0 0 1 0 0] CT
-53 7 moveto 
1 -1 scale
(-0.015) t 
GR
GR
GS
[1 0 0 1 761.40002 184.10931] CT
0.149 GC
/Helvetica 18 F
GS
[1 0 0 1 0 0] CT
-43 7 moveto 
1 -1 scale
(-0.01) t 
GR
GR
GS
[1 0 0 1 761.40002 143.62753] CT
0.149 GC
/Helvetica 18 F
GS
[1 0 0 1 0 0] CT
-53 7 moveto 
1 -1 scale
(-0.005) t 
GR
GR
GS
[1 0 0 1 761.40002 103.14576] CT
0.149 GC
/Helvetica 18 F
GS
[1 0 0 1 0 0] CT
-11 7 moveto 
1 -1 scale
(0) t 
GR
GR
GS
[1 0 0 1 761.40002 62.66398] CT
0.149 GC
/Helvetica 18 F
GS
[1 0 0 1 0 0] CT
-46 7 moveto 
1 -1 scale
(0.005) t 
GR
GR
GS
[0 -1 1 0 705.40002 231.49982] CT
0.149 GC
/Helvetica 18 F
GS
[1 0 0 1 0 0] CT
-138.5 -4 moveto 
1 -1 scale
(PSD Slope 2-64 Hz \(excl. 7-13 Hz\)) t 
GR
GR
GS
[1 0 0 1 991.50098 31.5] CT
/Helvetica-Bold 18 F
GS
[1 0 0 1 0 0] CT
-204 -4 moveto 
1 -1 scale
(Slow scale entropy inversely reflects PSD slope) t 
GR
GR
GS
N
1016.5 264.5 M
1015.621 262.379 L
1013.5 261.5 L
1011.379 262.379 L
1010.5 264.5 L
1011.379 266.621 L
1013.5 267.5 L
1015.621 266.621 L
1016.5 264.5 L
cp
f
GR
GS
N
1100.5 273.5 M
1099.621 271.379 L
1097.5 270.5 L
1095.379 271.379 L
1094.5 273.5 L
1095.379 275.621 L
1097.5 276.5 L
1099.621 275.621 L
1100.5 273.5 L
cp
f
GR
GS
N
1061.5 278.5 M
1060.621 276.379 L
1058.5 275.5 L
1056.379 276.379 L
1055.5 278.5 L
1056.379 280.621 L
1058.5 281.5 L
1060.621 280.621 L
1061.5 278.5 L
cp
f
GR
GS
N
896.5 207.5 M
895.621 205.379 L
893.5 204.5 L
891.379 205.379 L
890.5 207.5 L
891.379 209.621 L
893.5 210.5 L
895.621 209.621 L
896.5 207.5 L
cp
f
GR
GS
N
1145.5 274.5 M
1144.621 272.379 L
1142.5 271.5 L
1140.379 272.379 L
1139.5 274.5 L
1140.379 276.621 L
1142.5 277.5 L
1144.621 276.621 L
1145.5 274.5 L
cp
f
GR
GS
N
871.5 341.5 M
870.621 339.379 L
868.5 338.5 L
866.379 339.379 L
865.5 341.5 L
866.379 343.621 L
868.5 344.5 L
870.621 343.621 L
871.5 341.5 L
cp
f
GR
GS
N
997.5 257.5 M
996.621 255.379 L
994.5 254.5 L
992.379 255.379 L
991.5 257.5 L
992.379 259.621 L
994.5 260.5 L
996.621 259.621 L
997.5 257.5 L
cp
f
GR
GS
N
1092.5 271.5 M
1091.621 269.379 L
1089.5 268.5 L
1087.379 269.379 L
1086.5 271.5 L
1087.379 273.621 L
1089.5 274.5 L
1091.621 273.621 L
1092.5 271.5 L
cp
f
GR
GS
N
1044.5 191.5 M
1043.621 189.379 L
1041.5 188.5 L
1039.379 189.379 L
1038.5 191.5 L
1039.379 193.621 L
1041.5 194.5 L
1043.621 193.621 L
1044.5 191.5 L
cp
f
GR
GS
N
1141.5 334.5 M
1140.621 332.379 L
1138.5 331.5 L
1136.379 332.379 L
1135.5 334.5 L
1136.379 336.621 L
1138.5 337.5 L
1140.621 336.621 L
1141.5 334.5 L
cp
f
GR
GS
N
1155.5 418.5 M
1154.621 416.379 L
1152.5 415.5 L
1150.379 416.379 L
1149.5 418.5 L
1150.379 420.621 L
1152.5 421.5 L
1154.621 420.621 L
1155.5 418.5 L
cp
f
GR
GS
N
1147.5 293.5 M
1146.621 291.379 L
1144.5 290.5 L
1142.379 291.379 L
1141.5 293.5 L
1142.379 295.621 L
1144.5 296.5 L
1146.621 295.621 L
1147.5 293.5 L
cp
f
GR
GS
N
915.5 329.5 M
914.621 327.379 L
912.5 326.5 L
910.379 327.379 L
909.5 329.5 L
910.379 331.621 L
912.5 332.5 L
914.621 331.621 L
915.5 329.5 L
cp
f
GR
GS
N
1159.5 349.5 M
1158.621 347.379 L
1156.5 346.5 L
1154.379 347.379 L
1153.5 349.5 L
1154.379 351.621 L
1156.5 352.5 L
1158.621 351.621 L
1159.5 349.5 L
cp
f
GR
GS
N
1038.5 289.5 M
1037.621 287.379 L
1035.5 286.5 L
1033.379 287.379 L
1032.5 289.5 L
1033.379 291.621 L
1035.5 292.5 L
1037.621 291.621 L
1038.5 289.5 L
cp
f
GR
GS
N
1183.5 337.5 M
1182.621 335.379 L
1180.5 334.5 L
1178.379 335.379 L
1177.5 337.5 L
1178.379 339.621 L
1180.5 340.5 L
1182.621 339.621 L
1183.5 337.5 L
cp
f
GR
GS
N
1101.5 346.5 M
1100.621 344.379 L
1098.5 343.5 L
1096.379 344.379 L
1095.5 346.5 L
1096.379 348.621 L
1098.5 349.5 L
1100.621 348.621 L
1101.5 346.5 L
cp
f
GR
GS
N
1139.5 319.5 M
1138.621 317.379 L
1136.5 316.5 L
1134.379 317.379 L
1133.5 319.5 L
1134.379 321.621 L
1136.5 322.5 L
1138.621 321.621 L
1139.5 319.5 L
cp
f
GR
GS
N
1140.5 344.5 M
1139.621 342.379 L
1137.5 341.5 L
1135.379 342.379 L
1134.5 344.5 L
1135.379 346.621 L
1137.5 347.5 L
1139.621 346.621 L
1140.5 344.5 L
cp
f
GR
GS
N
1131.5 282.5 M
1130.621 280.379 L
1128.5 279.5 L
1126.379 280.379 L
1125.5 282.5 L
1126.379 284.621 L
1128.5 285.5 L
1130.621 284.621 L
1131.5 282.5 L
cp
f
GR
GS
N
1110.5 277.5 M
1109.621 275.379 L
1107.5 274.5 L
1105.379 275.379 L
1104.5 277.5 L
1105.379 279.621 L
1107.5 280.5 L
1109.621 279.621 L
1110.5 277.5 L
cp
f
GR
GS
N
1122.5 318.5 M
1121.621 316.379 L
1119.5 315.5 L
1117.379 316.379 L
1116.5 318.5 L
1117.379 320.621 L
1119.5 321.5 L
1121.621 320.621 L
1122.5 318.5 L
cp
f
GR
GS
N
1075.5 217.5 M
1074.621 215.379 L
1072.5 214.5 L
1070.379 215.379 L
1069.5 217.5 L
1070.379 219.621 L
1072.5 220.5 L
1074.621 219.621 L
1075.5 217.5 L
cp
f
GR
GS
N
876.5 146.5 M
875.621 144.379 L
873.5 143.5 L
871.379 144.379 L
870.5 146.5 L
871.379 148.621 L
873.5 149.5 L
875.621 148.621 L
876.5 146.5 L
cp
f
GR
GS
N
1107.5 299.5 M
1106.621 297.379 L
1104.5 296.5 L
1102.379 297.379 L
1101.5 299.5 L
1102.379 301.621 L
1104.5 302.5 L
1106.621 301.621 L
1107.5 299.5 L
cp
f
GR
GS
N
1054.5 323.5 M
1053.621 321.379 L
1051.5 320.5 L
1049.379 321.379 L
1048.5 323.5 L
1049.379 325.621 L
1051.5 326.5 L
1053.621 325.621 L
1054.5 323.5 L
cp
f
GR
GS
N
995.5 367.5 M
994.621 365.379 L
992.5 364.5 L
990.379 365.379 L
989.5 367.5 L
990.379 369.621 L
992.5 370.5 L
994.621 369.621 L
995.5 367.5 L
cp
f
GR
GS
N
842.5 251.5 M
841.621 249.379 L
839.5 248.5 L
837.379 249.379 L
836.5 251.5 L
837.379 253.621 L
839.5 254.5 L
841.621 253.621 L
842.5 251.5 L
cp
f
GR
GS
N
1070.5 286.5 M
1069.621 284.379 L
1067.5 283.5 L
1065.379 284.379 L
1064.5 286.5 L
1065.379 288.621 L
1067.5 289.5 L
1069.621 288.621 L
1070.5 286.5 L
cp
f
GR
GS
N
1076.5 273.5 M
1075.621 271.379 L
1073.5 270.5 L
1071.379 271.379 L
1070.5 273.5 L
1071.379 275.621 L
1073.5 276.5 L
1075.621 275.621 L
1076.5 273.5 L
cp
f
GR
GS
N
1119.5 332.5 M
1118.621 330.379 L
1116.5 329.5 L
1114.379 330.379 L
1113.5 332.5 L
1114.379 334.621 L
1116.5 335.5 L
1118.621 334.621 L
1119.5 332.5 L
cp
f
GR
GS
N
1053.5 231.5 M
1052.621 229.379 L
1050.5 228.5 L
1048.379 229.379 L
1047.5 231.5 L
1048.379 233.621 L
1050.5 234.5 L
1052.621 233.621 L
1053.5 231.5 L
cp
f
GR
GS
N
1087.5 225.5 M
1086.621 223.379 L
1084.5 222.5 L
1082.379 223.379 L
1081.5 225.5 L
1082.379 227.621 L
1084.5 228.5 L
1086.621 227.621 L
1087.5 225.5 L
cp
f
GR
GS
N
1135.5 342.5 M
1134.621 340.379 L
1132.5 339.5 L
1130.379 340.379 L
1129.5 342.5 L
1130.379 344.621 L
1132.5 345.5 L
1134.621 344.621 L
1135.5 342.5 L
cp
f
GR
GS
N
1044.5 322.5 M
1043.621 320.379 L
1041.5 319.5 L
1039.379 320.379 L
1038.5 322.5 L
1039.379 324.621 L
1041.5 325.5 L
1043.621 324.621 L
1044.5 322.5 L
cp
f
GR
GS
N
1115.5 344.5 M
1114.621 342.379 L
1112.5 341.5 L
1110.379 342.379 L
1109.5 344.5 L
1110.379 346.621 L
1112.5 347.5 L
1114.621 346.621 L
1115.5 344.5 L
cp
f
GR
GS
N
1059.5 290.5 M
1058.621 288.379 L
1056.5 287.5 L
1054.379 288.379 L
1053.5 290.5 L
1054.379 292.621 L
1056.5 293.5 L
1058.621 292.621 L
1059.5 290.5 L
cp
f
GR
GS
N
1112.5 266.5 M
1111.621 264.379 L
1109.5 263.5 L
1107.379 264.379 L
1106.5 266.5 L
1107.379 268.621 L
1109.5 269.5 L
1111.621 268.621 L
1112.5 266.5 L
cp
f
GR
GS
N
1136.5 327.5 M
1135.621 325.379 L
1133.5 324.5 L
1131.379 325.379 L
1130.5 327.5 L
1131.379 329.621 L
1133.5 330.5 L
1135.621 329.621 L
1136.5 327.5 L
cp
f
GR
GS
N
1086.5 336.5 M
1085.621 334.379 L
1083.5 333.5 L
1081.379 334.379 L
1080.5 336.5 L
1081.379 338.621 L
1083.5 339.5 L
1085.621 338.621 L
1086.5 336.5 L
cp
f
GR
GS
N
1002.5 191.5 M
1001.621 189.379 L
999.5 188.5 L
997.379 189.379 L
996.5 191.5 L
997.379 193.621 L
999.5 194.5 L
1001.621 193.621 L
1002.5 191.5 L
cp
f
GR
GS
N
1075.5 277.5 M
1074.621 275.379 L
1072.5 274.5 L
1070.379 275.379 L
1069.5 277.5 L
1070.379 279.621 L
1072.5 280.5 L
1074.621 279.621 L
1075.5 277.5 L
cp
f
GR
GS
N
1052.5 230.5 M
1051.621 228.379 L
1049.5 227.5 L
1047.379 228.379 L
1046.5 230.5 L
1047.379 232.621 L
1049.5 233.5 L
1051.621 232.621 L
1052.5 230.5 L
cp
f
GR
GS
N
1132.5 266.5 M
1131.621 264.379 L
1129.5 263.5 L
1127.379 264.379 L
1126.5 266.5 L
1127.379 268.621 L
1129.5 269.5 L
1131.621 268.621 L
1132.5 266.5 L
cp
f
GR
GS
N
1153.5 283.5 M
1152.621 281.379 L
1150.5 280.5 L
1148.379 281.379 L
1147.5 283.5 L
1148.379 285.621 L
1150.5 286.5 L
1152.621 285.621 L
1153.5 283.5 L
cp
f
GR
GS
N
1098.5 308.5 M
1097.621 306.379 L
1095.5 305.5 L
1093.379 306.379 L
1092.5 308.5 L
1093.379 310.621 L
1095.5 311.5 L
1097.621 310.621 L
1098.5 308.5 L
cp
f
GR
GS
N
1011.5 168.5 M
1010.621 166.379 L
1008.5 165.5 L
1006.379 166.379 L
1005.5 168.5 L
1006.379 170.621 L
1008.5 171.5 L
1010.621 170.621 L
1011.5 168.5 L
cp
f
GR
GS
0.749 GC
1 LJ
0.5 LW
N
831.143 218.338 M
1216 331.218 L
S
GR
GS
1 0 0 RC
N
942.5 203.5 M
941.621 201.379 L
939.5 200.5 L
937.379 201.379 L
936.5 203.5 L
937.379 205.621 L
939.5 206.5 L
941.621 205.621 L
942.5 203.5 L
cp
f
GR
GS
1 0 0 RC
N
966.5 172.5 M
965.621 170.379 L
963.5 169.5 L
961.379 170.379 L
960.5 172.5 L
961.379 174.621 L
963.5 175.5 L
965.621 174.621 L
966.5 172.5 L
cp
f
GR
GS
1 0 0 RC
N
1067.5 261.5 M
1066.621 259.379 L
1064.5 258.5 L
1062.379 259.379 L
1061.5 261.5 L
1062.379 263.621 L
1064.5 264.5 L
1066.621 263.621 L
1067.5 261.5 L
cp
f
GR
GS
1 0 0 RC
N
958.5 174.5 M
957.621 172.379 L
955.5 171.5 L
953.379 172.379 L
952.5 174.5 L
953.379 176.621 L
955.5 177.5 L
957.621 176.621 L
958.5 174.5 L
cp
f
GR
GS
1 0 0 RC
N
954.5 142.5 M
953.621 140.379 L
951.5 139.5 L
949.379 140.379 L
948.5 142.5 L
949.379 144.621 L
951.5 145.5 L
953.621 144.621 L
954.5 142.5 L
cp
f
GR
GS
1 0 0 RC
N
979.5 184.5 M
978.621 182.379 L
976.5 181.5 L
974.379 182.379 L
973.5 184.5 L
974.379 186.621 L
976.5 187.5 L
978.621 186.621 L
979.5 184.5 L
cp
f
GR
GS
1 0 0 RC
N
909.5 101.5 M
908.621 99.379 L
906.5 98.5 L
904.379 99.379 L
903.5 101.5 L
904.379 103.621 L
906.5 104.5 L
908.621 103.621 L
909.5 101.5 L
cp
f
GR
GS
1 0 0 RC
N
1080.5 306.5 M
1079.621 304.379 L
1077.5 303.5 L
1075.379 304.379 L
1074.5 306.5 L
1075.379 308.621 L
1077.5 309.5 L
1079.621 308.621 L
1080.5 306.5 L
cp
f
GR
GS
1 0 0 RC
N
941.5 187.5 M
940.621 185.379 L
938.5 184.5 L
936.379 185.379 L
935.5 187.5 L
936.379 189.621 L
938.5 190.5 L
940.621 189.621 L
941.5 187.5 L
cp
f
GR
GS
1 0 0 RC
N
1066.5 303.5 M
1065.621 301.379 L
1063.5 300.5 L
1061.379 301.379 L
1060.5 303.5 L
1061.379 305.621 L
1063.5 306.5 L
1065.621 305.621 L
1066.5 303.5 L
cp
f
GR
GS
1 0 0 RC
N
989.5 175.5 M
988.621 173.379 L
986.5 172.5 L
984.379 173.379 L
983.5 175.5 L
984.379 177.621 L
986.5 178.5 L
988.621 177.621 L
989.5 175.5 L
cp
f
GR
GS
1 0 0 RC
N
1120.5 263.5 M
1119.621 261.379 L
1117.5 260.5 L
1115.379 261.379 L
1114.5 263.5 L
1115.379 265.621 L
1117.5 266.5 L
1119.621 265.621 L
1120.5 263.5 L
cp
f
GR
GS
1 0 0 RC
N
1062.5 293.5 M
1061.621 291.379 L
1059.5 290.5 L
1057.379 291.379 L
1056.5 293.5 L
1057.379 295.621 L
1059.5 296.5 L
1061.621 295.621 L
1062.5 293.5 L
cp
f
GR
GS
1 0 0 RC
N
1028.5 253.5 M
1027.621 251.379 L
1025.5 250.5 L
1023.379 251.379 L
1022.5 253.5 L
1023.379 255.621 L
1025.5 256.5 L
1027.621 255.621 L
1028.5 253.5 L
cp
f
GR
GS
1 0 0 RC
N
872.5 95.5 M
871.621 93.379 L
869.5 92.5 L
867.379 93.379 L
866.5 95.5 L
867.379 97.621 L
869.5 98.5 L
871.621 97.621 L
872.5 95.5 L
cp
f
GR
GS
1 0 0 RC
N
1080.5 240.5 M
1079.621 238.379 L
1077.5 237.5 L
1075.379 238.379 L
1074.5 240.5 L
1075.379 242.621 L
1077.5 243.5 L
1079.621 242.621 L
1080.5 240.5 L
cp
f
GR
GS
1 0 0 RC
N
980.5 267.5 M
979.621 265.379 L
977.5 264.5 L
975.379 265.379 L
974.5 267.5 L
975.379 269.621 L
977.5 270.5 L
979.621 269.621 L
980.5 267.5 L
cp
f
GR
GS
1 0 0 RC
N
1005.5 226.5 M
1004.621 224.379 L
1002.5 223.5 L
1000.379 224.379 L
999.5 226.5 L
1000.379 228.621 L
1002.5 229.5 L
1004.621 228.621 L
1005.5 226.5 L
cp
f
GR
GS
1 0 0 RC
N
895.5 166.5 M
894.621 164.379 L
892.5 163.5 L
890.379 164.379 L
889.5 166.5 L
890.379 168.621 L
892.5 169.5 L
894.621 168.621 L
895.5 166.5 L
cp
f
GR
GS
1 0 0 RC
N
1015.5 231.5 M
1014.621 229.379 L
1012.5 228.5 L
1010.379 229.379 L
1009.5 231.5 L
1010.379 233.621 L
1012.5 234.5 L
1014.621 233.621 L
1015.5 231.5 L
cp
f
GR
GS
1 0 0 RC
N
1151.5 334.5 M
1150.621 332.379 L
1148.5 331.5 L
1146.379 332.379 L
1145.5 334.5 L
1146.379 336.621 L
1148.5 337.5 L
1150.621 336.621 L
1151.5 334.5 L
cp
f
GR
GS
1 0 0 RC
N
1067.5 254.5 M
1066.621 252.379 L
1064.5 251.5 L
1062.379 252.379 L
1061.5 254.5 L
1062.379 256.621 L
1064.5 257.5 L
1066.621 256.621 L
1067.5 254.5 L
cp
f
GR
GS
1 0 0 RC
N
990.5 193.5 M
989.621 191.379 L
987.5 190.5 L
985.379 191.379 L
984.5 193.5 L
985.379 195.621 L
987.5 196.5 L
989.621 195.621 L
990.5 193.5 L
cp
f
GR
GS
1 0 0 RC
N
998.5 200.5 M
997.621 198.379 L
995.5 197.5 L
993.379 198.379 L
992.5 200.5 L
993.379 202.621 L
995.5 203.5 L
997.621 202.621 L
998.5 200.5 L
cp
f
GR
GS
1 0 0 RC
N
1016.5 240.5 M
1015.621 238.379 L
1013.5 237.5 L
1011.379 238.379 L
1010.5 240.5 L
1011.379 242.621 L
1013.5 243.5 L
1015.621 242.621 L
1016.5 240.5 L
cp
f
GR
GS
1 0 0 RC
N
1082.5 270.5 M
1081.621 268.379 L
1079.5 267.5 L
1077.379 268.379 L
1076.5 270.5 L
1077.379 272.621 L
1079.5 273.5 L
1081.621 272.621 L
1082.5 270.5 L
cp
f
GR
GS
1 0 0 RC
N
1071.5 239.5 M
1070.621 237.379 L
1068.5 236.5 L
1066.379 237.379 L
1065.5 239.5 L
1066.379 241.621 L
1068.5 242.5 L
1070.621 241.621 L
1071.5 239.5 L
cp
f
GR
GS
1 0 0 RC
N
1014.5 277.5 M
1013.621 275.379 L
1011.5 274.5 L
1009.379 275.379 L
1008.5 277.5 L
1009.379 279.621 L
1011.5 280.5 L
1013.621 279.621 L
1014.5 277.5 L
cp
f
GR
GS
1 0 0 RC
N
1017.5 211.5 M
1016.621 209.379 L
1014.5 208.5 L
1012.379 209.379 L
1011.5 211.5 L
1012.379 213.621 L
1014.5 214.5 L
1016.621 213.621 L
1017.5 211.5 L
cp
f
GR
GS
1 0 0 RC
N
1039.5 206.5 M
1038.621 204.379 L
1036.5 203.5 L
1034.379 204.379 L
1033.5 206.5 L
1034.379 208.621 L
1036.5 209.5 L
1038.621 208.621 L
1039.5 206.5 L
cp
f
GR
GS
1 0 0 RC
N
843.5 74.5 M
842.621 72.379 L
840.5 71.5 L
838.379 72.379 L
837.5 74.5 L
838.379 76.621 L
840.5 77.5 L
842.621 76.621 L
843.5 74.5 L
cp
f
GR
GS
1 0 0 RC
N
891.5 127.5 M
890.621 125.379 L
888.5 124.5 L
886.379 125.379 L
885.5 127.5 L
886.379 129.621 L
888.5 130.5 L
890.621 129.621 L
891.5 127.5 L
cp
f
GR
GS
1 0 0 RC
N
924.5 137.5 M
923.621 135.379 L
921.5 134.5 L
919.379 135.379 L
918.5 137.5 L
919.379 139.621 L
921.5 140.5 L
923.621 139.621 L
924.5 137.5 L
cp
f
GR
GS
1 0 0 RC
N
867.5 102.5 M
866.621 100.379 L
864.5 99.5 L
862.379 100.379 L
861.5 102.5 L
862.379 104.621 L
864.5 105.5 L
866.621 104.621 L
867.5 102.5 L
cp
f
GR
GS
1 0 0 RC
N
926.5 145.5 M
925.621 143.379 L
923.5 142.5 L
921.379 143.379 L
920.5 145.5 L
921.379 147.621 L
923.5 148.5 L
925.621 147.621 L
926.5 145.5 L
cp
f
GR
GS
1 0 0 RC
N
852.5 95.5 M
851.621 93.379 L
849.5 92.5 L
847.379 93.379 L
846.5 95.5 L
847.379 97.621 L
849.5 98.5 L
851.621 97.621 L
852.5 95.5 L
cp
f
GR
GS
1 0 0 RC
N
1000.5 194.5 M
999.621 192.379 L
997.5 191.5 L
995.379 192.379 L
994.5 194.5 L
995.379 196.621 L
997.5 197.5 L
999.621 196.621 L
1000.5 194.5 L
cp
f
GR
GS
1 0 0 RC
N
948.5 146.5 M
947.621 144.379 L
945.5 143.5 L
943.379 144.379 L
942.5 146.5 L
943.379 148.621 L
945.5 149.5 L
947.621 148.621 L
948.5 146.5 L
cp
f
GR
GS
1 0 0 RC
N
1078.5 260.5 M
1077.621 258.379 L
1075.5 257.5 L
1073.379 258.379 L
1072.5 260.5 L
1073.379 262.621 L
1075.5 263.5 L
1077.621 262.621 L
1078.5 260.5 L
cp
f
GR
GS
1 0 0 RC
N
1122.5 347.5 M
1121.621 345.379 L
1119.5 344.5 L
1117.379 345.379 L
1116.5 347.5 L
1117.379 349.621 L
1119.5 350.5 L
1121.621 349.621 L
1122.5 347.5 L
cp
f
GR
GS
1 0 0 RC
N
987.5 211.5 M
986.621 209.379 L
984.5 208.5 L
982.379 209.379 L
981.5 211.5 L
982.379 213.621 L
984.5 214.5 L
986.621 213.621 L
987.5 211.5 L
cp
f
GR
GS
1 0 0 RC
N
809.5 69.5 M
808.621 67.379 L
806.5 66.5 L
804.379 67.379 L
803.5 69.5 L
804.379 71.621 L
806.5 72.5 L
808.621 71.621 L
809.5 69.5 L
cp
f
GR
GS
1 0 0 RC
N
934.5 266.5 M
933.621 264.379 L
931.5 263.5 L
929.379 264.379 L
928.5 266.5 L
929.379 268.621 L
931.5 269.5 L
933.621 268.621 L
934.5 266.5 L
cp
f
GR
GS
1 0 0 RC
N
1110.5 303.5 M
1109.621 301.379 L
1107.5 300.5 L
1105.379 301.379 L
1104.5 303.5 L
1105.379 305.621 L
1107.5 306.5 L
1109.621 305.621 L
1110.5 303.5 L
cp
f
GR
GS
1 0 0 RC
N
961.5 143.5 M
960.621 141.379 L
958.5 140.5 L
956.379 141.379 L
955.5 143.5 L
956.379 145.621 L
958.5 146.5 L
960.621 145.621 L
961.5 143.5 L
cp
f
GR
GS
1 0 0 RC
N
992.5 186.5 M
991.621 184.379 L
989.5 183.5 L
987.379 184.379 L
986.5 186.5 L
987.379 188.621 L
989.5 189.5 L
991.621 188.621 L
992.5 186.5 L
cp
f
GR
GS
1 0 0 RC
N
967.5 319.5 M
966.621 317.379 L
964.5 316.5 L
962.379 317.379 L
961.5 319.5 L
962.379 321.621 L
964.5 322.5 L
966.621 321.621 L
967.5 319.5 L
cp
f
GR
GS
1 0 0 RC
N
996.5 218.5 M
995.621 216.379 L
993.5 215.5 L
991.379 216.379 L
990.5 218.5 L
991.379 220.621 L
993.5 221.5 L
995.621 220.621 L
996.5 218.5 L
cp
f
GR
GS
1 0 0 RC
N
902.5 144.5 M
901.621 142.379 L
899.5 141.5 L
897.379 142.379 L
896.5 144.5 L
897.379 146.621 L
899.5 147.5 L
901.621 146.621 L
902.5 144.5 L
cp
f
GR
GS
1 0 0 RC
N
1031.5 259.5 M
1030.621 257.379 L
1028.5 256.5 L
1026.379 257.379 L
1025.5 259.5 L
1026.379 261.621 L
1028.5 262.5 L
1030.621 261.621 L
1031.5 259.5 L
cp
f
GR
GS
1 0 0 RC
N
1065.5 270.5 M
1064.621 268.379 L
1062.5 267.5 L
1060.379 268.379 L
1059.5 270.5 L
1060.379 272.621 L
1062.5 273.5 L
1064.621 272.621 L
1065.5 270.5 L
cp
f
GR
GS
1 0 0 RC
N
938.5 141.5 M
937.621 139.379 L
935.5 138.5 L
933.379 139.379 L
932.5 141.5 L
933.379 143.621 L
935.5 144.5 L
937.621 143.621 L
938.5 141.5 L
cp
f
GR
GS
0.749 GC
1 LJ
0.5 LW
N
767 36 M
1216 387.026 L
S
GR
GS
0.749 GC
1 LJ
0.5 LW
N
767 199.525 M
1216 331.218 L
S
GR
GS
[1 0 0 1 1009 59.13402] CT
/Helvetica 18 F
GS
[1 0 0 1 0 0] CT
0 7 moveto 
1 -1 scale
(Younger Adults: r=-0.43) t 
GR
GR
GS
N
994.5 59.5 M
993.621 57.379 L
991.5 56.5 L
989.379 57.379 L
988.5 59.5 L
989.379 61.621 L
991.5 62.5 L
993.621 61.621 L
994.5 59.5 L
cp
f
GR
GS
[1 0 0 1 1009 81.86598] CT
/Helvetica 18 F
GS
[1 0 0 1 0 0] CT
0 7 moveto 
1 -1 scale
(Older Adults: r=-0.87) t 
GR
GR
GS
1 0 0 RC
N
994.5 81.5 M
993.621 79.379 L
991.5 78.5 L
989.379 79.379 L
988.5 81.5 L
989.379 83.621 L
991.5 84.5 L
993.621 83.621 L
994.5 81.5 L
cp
f
GR
%%Trailer
%%Pages: 1
%%EOF
