%!PS-Adobe-3.0 EPSF-3.0
%%Creator: (MATLAB, The Mathworks, Inc. Version 9.4.0.813654 \(R2018a\). Operating System: Mac OS X)
%%Title: /Volumes/LNDG/Projects/StateSwitch/dynamic/data/eeg/rest/B_analyses/A_MSE_CSD_multiVariant/C_figures/D_MPE_InversionVanillaBP_PSDslope.eps
%%CreationDate: 2019-04-11T19:15:17
%%Pages: (atend)
%%BoundingBox:   178     0  1638   284
%%LanguageLevel: 3
%%EndComments
%%BeginProlog
%%BeginResource: procset (Apache XML Graphics Std ProcSet) 1.2 0
%%Version: 1.2 0
%%Copyright: (Copyright 2001-2003,2010 The Apache Software Foundation. License terms: http://www.apache.org/licenses/LICENSE-2.0)
/bd{bind def}bind def
/ld{load def}bd
/GR/grestore ld
/GS/gsave ld
/RM/rmoveto ld
/C/curveto ld
/t/show ld
/L/lineto ld
/ML/setmiterlimit ld
/CT/concat ld
/f/fill ld
/N/newpath ld
/S/stroke ld
/CC/setcmykcolor ld
/A/ashow ld
/cp/closepath ld
/RC/setrgbcolor ld
/LJ/setlinejoin ld
/GC/setgray ld
/LW/setlinewidth ld
/M/moveto ld
/re {4 2 roll M
1 index 0 rlineto
0 exch rlineto
neg 0 rlineto
cp } bd
/_ctm matrix def
/_tm matrix def
/BT { _ctm currentmatrix pop matrix _tm copy pop 0 0 moveto } bd
/ET { _ctm setmatrix } bd
/iTm { _ctm setmatrix _tm concat } bd
/Tm { _tm astore pop iTm 0 0 moveto } bd
/ux 0.0 def
/uy 0.0 def
/F {
  /Tp exch def
  /Tf exch def
  Tf findfont Tp scalefont setfont
  /cf Tf def  /cs Tp def
} bd
/ULS {currentpoint /uy exch def /ux exch def} bd
/ULE {
  /Tcx currentpoint pop def
  gsave
  newpath
  cf findfont cs scalefont dup
  /FontMatrix get 0 get /Ts exch def /FontInfo get dup
  /UnderlinePosition get Ts mul /To exch def
  /UnderlineThickness get Ts mul /Tt exch def
  ux uy To add moveto  Tcx uy To add lineto
  Tt setlinewidth stroke
  grestore
} bd
/OLE {
  /Tcx currentpoint pop def
  gsave
  newpath
  cf findfont cs scalefont dup
  /FontMatrix get 0 get /Ts exch def /FontInfo get dup
  /UnderlinePosition get Ts mul /To exch def
  /UnderlineThickness get Ts mul /Tt exch def
  ux uy To add cs add moveto Tcx uy To add cs add lineto
  Tt setlinewidth stroke
  grestore
} bd
/SOE {
  /Tcx currentpoint pop def
  gsave
  newpath
  cf findfont cs scalefont dup
  /FontMatrix get 0 get /Ts exch def /FontInfo get dup
  /UnderlinePosition get Ts mul /To exch def
  /UnderlineThickness get Ts mul /Tt exch def
  ux uy To add cs 10 mul 26 idiv add moveto Tcx uy To add cs 10 mul 26 idiv add lineto
  Tt setlinewidth stroke
  grestore
} bd
/QT {
/Y22 exch store
/X22 exch store
/Y21 exch store
/X21 exch store
currentpoint
/Y21 load 2 mul add 3 div exch
/X21 load 2 mul add 3 div exch
/X21 load 2 mul /X22 load add 3 div
/Y21 load 2 mul /Y22 load add 3 div
/X22 load /Y22 load curveto
} bd
/SSPD {
dup length /d exch dict def
{
/v exch def
/k exch def
currentpagedevice k known {
/cpdv currentpagedevice k get def
v cpdv ne {
/upd false def
/nullv v type /nulltype eq def
/nullcpdv cpdv type /nulltype eq def
nullv nullcpdv or
{
/upd true def
} {
/sametype v type cpdv type eq def
sametype {
v type /arraytype eq {
/vlen v length def
/cpdvlen cpdv length def
vlen cpdvlen eq {
0 1 vlen 1 sub {
/i exch def
/obj v i get def
/cpdobj cpdv i get def
obj cpdobj ne {
/upd true def
exit
} if
} for
} {
/upd true def
} ifelse
} {
v type /dicttype eq {
v {
/dv exch def
/dk exch def
/cpddv cpdv dk get def
dv cpddv ne {
/upd true def
exit
} if
} forall
} {
/upd true def
} ifelse
} ifelse
} if
} ifelse
upd true eq {
d k v put
} if
} if
} if
} forall
d length 0 gt {
d setpagedevice
} if
} bd
/RE { % /NewFontName [NewEncodingArray] /FontName RE -
  findfont dup length dict begin
  {
    1 index /FID ne
    {def} {pop pop} ifelse
  } forall
  /Encoding exch def
  /FontName 1 index def
  currentdict definefont pop
  end
} bind def
%%EndResource
%%BeginResource: procset (Apache XML Graphics EPS ProcSet) 1.0 0
%%Version: 1.0 0
%%Copyright: (Copyright 2002-2003 The Apache Software Foundation. License terms: http://www.apache.org/licenses/LICENSE-2.0)
/BeginEPSF { %def
/b4_Inc_state save def         % Save state for cleanup
/dict_count countdictstack def % Count objects on dict stack
/op_count count 1 sub def      % Count objects on operand stack
userdict begin                 % Push userdict on dict stack
/showpage { } def              % Redefine showpage, { } = null proc
0 setgray 0 setlinecap         % Prepare graphics state
1 setlinewidth 0 setlinejoin
10 setmiterlimit [ ] 0 setdash newpath
/languagelevel where           % If level not equal to 1 then
{pop languagelevel             % set strokeadjust and
1 ne                           % overprint to their defaults.
{false setstrokeadjust false setoverprint
} if
} if
} bd
/EndEPSF { %def
count op_count sub {pop} repeat            % Clean up stacks
countdictstack dict_count sub {end} repeat
b4_Inc_state restore
} bd
%%EndResource
%FOPBeginFontDict
%%IncludeResource: font Courier-Oblique
%%IncludeResource: font Courier-BoldOblique
%%IncludeResource: font Courier-Bold
%%IncludeResource: font ZapfDingbats
%%IncludeResource: font Symbol
%%IncludeResource: font Helvetica
%%IncludeResource: font Helvetica-Oblique
%%IncludeResource: font Helvetica-Bold
%%IncludeResource: font Helvetica-BoldOblique
%%IncludeResource: font Times-Roman
%%IncludeResource: font Times-Italic
%%IncludeResource: font Times-Bold
%%IncludeResource: font Times-BoldItalic
%%IncludeResource: font Courier
%FOPEndFontDict
%%BeginResource: encoding WinAnsiEncoding
/WinAnsiEncoding [
/.notdef /.notdef /.notdef /.notdef /.notdef
/.notdef /.notdef /.notdef /.notdef /.notdef
/.notdef /.notdef /.notdef /.notdef /.notdef
/.notdef /.notdef /.notdef /.notdef /.notdef
/.notdef /.notdef /.notdef /.notdef /.notdef
/.notdef /.notdef /.notdef /.notdef /.notdef
/.notdef /.notdef /space /exclam /quotedbl
/numbersign /dollar /percent /ampersand /quotesingle
/parenleft /parenright /asterisk /plus /comma
/hyphen /period /slash /zero /one
/two /three /four /five /six
/seven /eight /nine /colon /semicolon
/less /equal /greater /question /at
/A /B /C /D /E
/F /G /H /I /J
/K /L /M /N /O
/P /Q /R /S /T
/U /V /W /X /Y
/Z /bracketleft /backslash /bracketright /asciicircum
/underscore /quoteleft /a /b /c
/d /e /f /g /h
/i /j /k /l /m
/n /o /p /q /r
/s /t /u /v /w
/x /y /z /braceleft /bar
/braceright /asciitilde /bullet /Euro /bullet
/quotesinglbase /florin /quotedblbase /ellipsis /dagger
/daggerdbl /circumflex /perthousand /Scaron /guilsinglleft
/OE /bullet /Zcaron /bullet /bullet
/quoteleft /quoteright /quotedblleft /quotedblright /bullet
/endash /emdash /asciitilde /trademark /scaron
/guilsinglright /oe /bullet /zcaron /Ydieresis
/space /exclamdown /cent /sterling /currency
/yen /brokenbar /section /dieresis /copyright
/ordfeminine /guillemotleft /logicalnot /sfthyphen /registered
/macron /degree /plusminus /twosuperior /threesuperior
/acute /mu /paragraph /middot /cedilla
/onesuperior /ordmasculine /guillemotright /onequarter /onehalf
/threequarters /questiondown /Agrave /Aacute /Acircumflex
/Atilde /Adieresis /Aring /AE /Ccedilla
/Egrave /Eacute /Ecircumflex /Edieresis /Igrave
/Iacute /Icircumflex /Idieresis /Eth /Ntilde
/Ograve /Oacute /Ocircumflex /Otilde /Odieresis
/multiply /Oslash /Ugrave /Uacute /Ucircumflex
/Udieresis /Yacute /Thorn /germandbls /agrave
/aacute /acircumflex /atilde /adieresis /aring
/ae /ccedilla /egrave /eacute /ecircumflex
/edieresis /igrave /iacute /icircumflex /idieresis
/eth /ntilde /ograve /oacute /ocircumflex
/otilde /odieresis /divide /oslash /ugrave
/uacute /ucircumflex /udieresis /yacute /thorn
/ydieresis
] def
%%EndResource
%FOPBeginFontReencode
/Courier-Oblique findfont
dup length dict begin
  {1 index /FID ne {def} {pop pop} ifelse} forall
  /Encoding WinAnsiEncoding def
  currentdict
end
/Courier-Oblique exch definefont pop
/Courier-BoldOblique findfont
dup length dict begin
  {1 index /FID ne {def} {pop pop} ifelse} forall
  /Encoding WinAnsiEncoding def
  currentdict
end
/Courier-BoldOblique exch definefont pop
/Courier-Bold findfont
dup length dict begin
  {1 index /FID ne {def} {pop pop} ifelse} forall
  /Encoding WinAnsiEncoding def
  currentdict
end
/Courier-Bold exch definefont pop
/Helvetica findfont
dup length dict begin
  {1 index /FID ne {def} {pop pop} ifelse} forall
  /Encoding WinAnsiEncoding def
  currentdict
end
/Helvetica exch definefont pop
/Helvetica-Oblique findfont
dup length dict begin
  {1 index /FID ne {def} {pop pop} ifelse} forall
  /Encoding WinAnsiEncoding def
  currentdict
end
/Helvetica-Oblique exch definefont pop
/Helvetica-Bold findfont
dup length dict begin
  {1 index /FID ne {def} {pop pop} ifelse} forall
  /Encoding WinAnsiEncoding def
  currentdict
end
/Helvetica-Bold exch definefont pop
/Helvetica-BoldOblique findfont
dup length dict begin
  {1 index /FID ne {def} {pop pop} ifelse} forall
  /Encoding WinAnsiEncoding def
  currentdict
end
/Helvetica-BoldOblique exch definefont pop
/Times-Roman findfont
dup length dict begin
  {1 index /FID ne {def} {pop pop} ifelse} forall
  /Encoding WinAnsiEncoding def
  currentdict
end
/Times-Roman exch definefont pop
/Times-Italic findfont
dup length dict begin
  {1 index /FID ne {def} {pop pop} ifelse} forall
  /Encoding WinAnsiEncoding def
  currentdict
end
/Times-Italic exch definefont pop
/Times-Bold findfont
dup length dict begin
  {1 index /FID ne {def} {pop pop} ifelse} forall
  /Encoding WinAnsiEncoding def
  currentdict
end
/Times-Bold exch definefont pop
/Times-BoldItalic findfont
dup length dict begin
  {1 index /FID ne {def} {pop pop} ifelse} forall
  /Encoding WinAnsiEncoding def
  currentdict
end
/Times-BoldItalic exch definefont pop
/Courier findfont
dup length dict begin
  {1 index /FID ne {def} {pop pop} ifelse} forall
  /Encoding WinAnsiEncoding def
  currentdict
end
/Courier exch definefont pop
%FOPEndFontReencode
%%EndProlog
%%Page: 1 1
%%PageBoundingBox: 0 0 1792 288
%%BeginPageSetup
[1 0 0 -1 0 288] CT
%%EndPageSetup
GS
1 GC
N
0 0 1792 288 re
f
GR
GS
1 GC
N
0 0 1792 288 re
f
GR
GS
1 GC
N
233 249 M
513.5 249 L
513.5 38.5 L
233 38.5 L
cp
f
GR
GS
0.149 GC
2 setlinecap
1 LJ
0.5 LW
N
233 249 M
513.5 249 L
S
GR
GS
0.149 GC
2 setlinecap
1 LJ
0.5 LW
N
250.531 249 M
250.531 246.195 L
S
GR
GS
0.149 GC
2 setlinecap
1 LJ
0.5 LW
N
338.187 249 M
338.187 246.195 L
S
GR
GS
0.149 GC
2 setlinecap
1 LJ
0.5 LW
N
425.844 249 M
425.844 246.195 L
S
GR
GS
0.149 GC
2 setlinecap
1 LJ
0.5 LW
N
513.5 249 M
513.5 246.195 L
S
GR
GS
[1 0 0 1 250.5313 253.8] CT
0.149 GC
/Helvetica 14 F
GS
[1 0 0 1 0 0] CT
-14 14 moveto 
1 -1 scale
(0.85) t 
GR
GR
GS
[1 0 0 1 338.18747 253.8] CT
0.149 GC
/Helvetica 14 F
GS
[1 0 0 1 0 0] CT
-10 14 moveto 
1 -1 scale
(0.9) t 
GR
GR
GS
[1 0 0 1 425.84372 253.8] CT
0.149 GC
/Helvetica 14 F
GS
[1 0 0 1 0 0] CT
-14 14 moveto 
1 -1 scale
(0.95) t 
GR
GR
GS
[1 0 0 1 513.5 253.8] CT
0.149 GC
/Helvetica 14 F
GS
[1 0 0 1 0 0] CT
-4 14 moveto 
1 -1 scale
(1) t 
GR
GR
GS
[1 0 0 1 373.25012 271.29999] CT
0.149 GC
/Helvetica 14 F
GS
[1 0 0 1 0 0] CT
-78 14 moveto 
1 -1 scale
(Vanilla MPE, Scales 1:10) t 
GR
GR
GS
0.149 GC
2 setlinecap
1 LJ
0.5 LW
N
233 249 M
233 38.5 L
S
GR
GS
0.149 GC
2 setlinecap
1 LJ
0.5 LW
N
233 245.197 M
235.805 245.197 L
S
GR
GS
0.149 GC
2 setlinecap
1 LJ
0.5 LW
N
233 215.669 M
235.805 215.669 L
S
GR
GS
0.149 GC
2 setlinecap
1 LJ
0.5 LW
N
233 186.141 M
235.805 186.141 L
S
GR
GS
0.149 GC
2 setlinecap
1 LJ
0.5 LW
N
233 156.613 M
235.805 156.613 L
S
GR
GS
0.149 GC
2 setlinecap
1 LJ
0.5 LW
N
233 127.085 M
235.805 127.085 L
S
GR
GS
0.149 GC
2 setlinecap
1 LJ
0.5 LW
N
233 97.556 M
235.805 97.556 L
S
GR
GS
0.149 GC
2 setlinecap
1 LJ
0.5 LW
N
233 68.028 M
235.805 68.028 L
S
GR
GS
[1 0 0 1 228.2 245.19717] CT
0.149 GC
/Helvetica 14 F
GS
[1 0 0 1 0 0] CT
-33 5.5 moveto 
1 -1 scale
(-0.06) t 
GR
GR
GS
[1 0 0 1 228.2 215.66901] CT
0.149 GC
/Helvetica 14 F
GS
[1 0 0 1 0 0] CT
-33 5.5 moveto 
1 -1 scale
(-0.05) t 
GR
GR
GS
[1 0 0 1 228.2 186.14084] CT
0.149 GC
/Helvetica 14 F
GS
[1 0 0 1 0 0] CT
-33 5.5 moveto 
1 -1 scale
(-0.04) t 
GR
GR
GS
[1 0 0 1 228.2 156.61267] CT
0.149 GC
/Helvetica 14 F
GS
[1 0 0 1 0 0] CT
-33 5.5 moveto 
1 -1 scale
(-0.03) t 
GR
GR
GS
[1 0 0 1 228.2 127.0845] CT
0.149 GC
/Helvetica 14 F
GS
[1 0 0 1 0 0] CT
-33 5.5 moveto 
1 -1 scale
(-0.02) t 
GR
GR
GS
[1 0 0 1 228.2 97.55634] CT
0.149 GC
/Helvetica 14 F
GS
[1 0 0 1 0 0] CT
-33 5.5 moveto 
1 -1 scale
(-0.01) t 
GR
GR
GS
[1 0 0 1 228.2 68.02817] CT
0.149 GC
/Helvetica 14 F
GS
[1 0 0 1 0 0] CT
-8 5.5 moveto 
1 -1 scale
(0) t 
GR
GR
GS
[0 -1 1 0 192.19991 143.74989] CT
0.149 GC
/Helvetica 14 F
GS
[1 0 0 1 0 0] CT
-108 -3 moveto 
1 -1 scale
(PSD Slope 2-64 Hz \(excl. 7-13 Hz\)) t 
GR
GR
GS
[1 0 0 1 373.25034 36.75] CT
/Helvetica-Bold 14 F
GS
[1 0 0 1 0 0] CT
-77.5 -22 moveto 
1 -1 scale
(Fast scale Vanilla MPE ) t 
GR
GR
GS
[1 0 0 1 373.25034 36.75] CT
/Helvetica-Bold 14 F
GS
[1 0 0 1 0 0] CT
-101.5 -4 moveto 
1 -1 scale
(positively relates to PSD slope) t 
GR
GR
GS
[1 0 0 1 280.00351 144.7571] CT
N
3 0 M
3 -1.657 1.657 -3 0 -3 C
-1.657 -3 -3 -1.657 -3 0 C
-3 1.657 -1.657 3 0 3 C
1.657 3 3 1.657 3 0 C
cp
f
GR
GS
[1 0 0 1 408.14917 138.40388] CT
N
/f-2087191549{3 0 M
3 -1.657 1.657 -3 0 -3 C
-1.657 -3 -3 -1.657 -3 0 C
-3 1.657 -1.657 3 0 3 C
1.657 3 3 1.657 3 0 C
cp}def
f-2087191549
f
GR
GS
[1 0 0 1 399.3056 101.82684] CT
N
f-2087191549
f
GR
GS
[1 0 0 1 418.0639 118.56834] CT
N
f-2087191549
f
GR
GS
[1 0 0 1 445.789 103.27532] CT
N
f-2087191549
f
GR
GS
[1 0 0 1 368.685 162.57147] CT
N
f-2087191549
f
GR
GS
[1 0 0 1 256.495 156.05298] CT
N
f-2087191549
f
GR
GS
[1 0 0 1 447.95328 110.05235] CT
N
f-2087191549
f
GR
GS
[1 0 0 1 450.78812 101.23933] CT
N
f-2087191549
f
GR
GS
[1 0 0 1 344.85703 142.12547] CT
N
f-2087191549
f
GR
GS
[1 0 0 1 268.58521 187.66821] CT
N
f-2087191549
f
GR
GS
[1 0 0 1 376.20984 150.18303] CT
N
f-2087191549
f
GR
GS
[1 0 0 1 355.7865 126.67371] CT
N
f-2087191549
f
GR
GS
[1 0 0 1 282.83813 177.39516] CT
N
f-2087191549
f
GR
GS
[1 0 0 1 279.18176 155.94284] CT
N
f-2087191549
f
GR
GS
[1 0 0 1 379.0896 154.90968] CT
N
f-2087191549
f
GR
GS
[1 0 0 1 341.0946 141.82115] CT
N
f-2087191549
f
GR
GS
[1 0 0 1 395.12186 147.39525] CT
N
f-2087191549
f
GR
GS
[1 0 0 1 359.86096 148.40071] CT
N
f-2087191549
f
GR
GS
[1 0 0 1 464.0448 115.29896] CT
N
f-2087191549
f
GR
GS
[1 0 0 1 444.7988 104.31476] CT
N
f-2087191549
f
GR
GS
[1 0 0 1 348.72458 144.51181] CT
N
f-2087191549
f
GR
GS
[1 0 0 1 399.80246 117.79926] CT
N
f-2087191549
f
GR
GS
[1 0 0 1 431.41693 82.69621] CT
N
f-2087191549
f
GR
GS
[1 0 0 1 359.64172 156.40369] CT
N
f-2087191549
f
GR
GS
[1 0 0 1 299.59036 141.04787] CT
N
f-2087191549
f
GR
GS
[1 0 0 1 351.2016 165.93492] CT
N
f-2087191549
f
GR
GS
[1 0 0 1 423.76837 114.04559] CT
N
f-2087191549
f
GR
GS
[1 0 0 1 318.39151 162.56993] CT
N
f-2087191549
f
GR
GS
[1 0 0 1 364.76978 134.49294] CT
N
f-2087191549
f
GR
GS
[1 0 0 1 346.00604 179.3821] CT
N
f-2087191549
f
GR
GS
[1 0 0 1 461.91946 100.83569] CT
N
f-2087191549
f
GR
GS
[1 0 0 1 367.54684 144.2878] CT
N
f-2087191549
f
GR
GS
[1 0 0 1 288.99442 157.20535] CT
N
f-2087191549
f
GR
GS
[1 0 0 1 425.03995 95.7718] CT
N
f-2087191549
f
GR
GS
[1 0 0 1 347.44357 178.78955] CT
N
f-2087191549
f
GR
GS
[1 0 0 1 305.73358 132.89133] CT
N
f-2087191549
f
GR
GS
[1 0 0 1 340.00964 163.74352] CT
N
f-2087191549
f
GR
GS
[1 0 0 1 382.88629 142.10675] CT
N
f-2087191549
f
GR
GS
[1 0 0 1 264.81265 171.64313] CT
N
f-2087191549
f
GR
GS
[1 0 0 1 462.4614 75.40245] CT
N
f-2087191549
f
GR
GS
[1 0 0 1 435.52368 113.74438] CT
N
f-2087191549
f
GR
GS
[1 0 0 1 453.10727 71.36789] CT
N
f-2087191549
f
GR
GS
[1 0 0 1 398.81979 147.25081] CT
N
f-2087191549
f
GR
GS
[1 0 0 1 387.07401 167.44841] CT
N
f-2087191549
f
GR
GS
[1 0 0 1 325.6846 172.37558] CT
N
f-2087191549
f
GR
GS
[1 0 0 1 441.4043 84.0068] CT
N
f-2087191549
f
GR
GS
0.749 GC
1 LJ
0.5 LW
N
233 190.779 M
478.438 94.816 L
S
GR
GS
[1 0 0 1 437.83405 98.24258] CT
1 0 0 RC
N
f-2087191549
f
GR
GS
[1 0 0 1 464.7731 104.21609] CT
1 0 0 RC
N
f-2087191549
f
GR
GS
[1 0 0 1 389.66443 150.27356] CT
1 0 0 RC
N
f-2087191549
f
GR
GS
[1 0 0 1 470.45334 71.96224] CT
1 0 0 RC
N
f-2087191549
f
GR
GS
[1 0 0 1 403.28912 106.14103] CT
1 0 0 RC
N
f-2087191549
f
GR
GS
[1 0 0 1 399.12347 143.01778] CT
1 0 0 RC
N
f-2087191549
f
GR
GS
[1 0 0 1 467.6835 40.15877] CT
1 0 0 RC
N
f-2087191549
f
GR
GS
[1 0 0 1 376.77075 139.18359] CT
1 0 0 RC
N
f-2087191549
f
GR
GS
[1 0 0 1 413.30826 124.61002] CT
1 0 0 RC
N
f-2087191549
f
GR
GS
[1 0 0 1 406.26837 139.44156] CT
1 0 0 RC
N
f-2087191549
f
GR
GS
[1 0 0 1 423.51193 124.46571] CT
1 0 0 RC
N
f-2087191549
f
GR
GS
[1 0 0 1 381.22012 135.95921] CT
1 0 0 RC
N
f-2087191549
f
GR
GS
[1 0 0 1 429.29153 145.85242] CT
1 0 0 RC
N
f-2087191549
f
GR
GS
[1 0 0 1 475.10019 81.52108] CT
1 0 0 RC
N
f-2087191549
f
GR
GS
[1 0 0 1 467.88309 69.17052] CT
1 0 0 RC
N
f-2087191549
f
GR
GS
[1 0 0 1 449.00302 107.46389] CT
1 0 0 RC
N
f-2087191549
f
GR
GS
[1 0 0 1 463.88931 108.30318] CT
1 0 0 RC
N
f-2087191549
f
GR
GS
[1 0 0 1 413.40054 115.36027] CT
1 0 0 RC
N
f-2087191549
f
GR
GS
[1 0 0 1 468.70639 73.42917] CT
1 0 0 RC
N
f-2087191549
f
GR
GS
[1 0 0 1 425.60193 124.42356] CT
1 0 0 RC
N
f-2087191549
f
GR
GS
[1 0 0 1 392.29279 150.99069] CT
1 0 0 RC
N
f-2087191549
f
GR
GS
[1 0 0 1 399.60089 126.79996] CT
1 0 0 RC
N
f-2087191549
f
GR
GS
[1 0 0 1 419.57709 121.74587] CT
1 0 0 RC
N
f-2087191549
f
GR
GS
[1 0 0 1 388.53903 142.81064] CT
1 0 0 RC
N
f-2087191549
f
GR
GS
[1 0 0 1 407.30298 148.33441] CT
1 0 0 RC
N
f-2087191549
f
GR
GS
[1 0 0 1 413.19333 138.46049] CT
1 0 0 RC
N
f-2087191549
f
GR
GS
[1 0 0 1 445.01929 125.99473] CT
1 0 0 RC
N
f-2087191549
f
GR
GS
[1 0 0 1 364.43259 153.72974] CT
1 0 0 RC
N
f-2087191549
f
GR
GS
[1 0 0 1 447.14072 142.2674] CT
1 0 0 RC
N
f-2087191549
f
GR
GS
[1 0 0 1 457.42758 114.97765] CT
1 0 0 RC
N
f-2087191549
f
GR
GS
[1 0 0 1 406.92178 108.2376] CT
1 0 0 RC
N
f-2087191549
f
GR
GS
[1 0 0 1 470.85291 100.0163] CT
1 0 0 RC
N
f-2087191549
f
GR
GS
[1 0 0 1 434.04706 111.01524] CT
1 0 0 RC
N
f-2087191549
f
GR
GS
[1 0 0 1 418.11188 130.13853] CT
1 0 0 RC
N
f-2087191549
f
GR
GS
[1 0 0 1 464.45764 76.2281] CT
1 0 0 RC
N
f-2087191549
f
GR
GS
[1 0 0 1 435.3526 119.11692] CT
1 0 0 RC
N
f-2087191549
f
GR
GS
[1 0 0 1 369.77423 139.38916] CT
1 0 0 RC
N
f-2087191549
f
GR
GS
[1 0 0 1 459.96741 114.51379] CT
1 0 0 RC
N
f-2087191549
f
GR
GS
[1 0 0 1 345.7565 165.86676] CT
1 0 0 RC
N
f-2087191549
f
GR
GS
[1 0 0 1 372.41992 156.49545] CT
1 0 0 RC
N
f-2087191549
f
GR
GS
[1 0 0 1 468.36981 83.30503] CT
1 0 0 RC
N
f-2087191549
f
GR
GS
[1 0 0 1 474.57959 69.91427] CT
1 0 0 RC
N
f-2087191549
f
GR
GS
[1 0 0 1 401.83636 142.05035] CT
1 0 0 RC
N
f-2087191549
f
GR
GS
[1 0 0 1 397.20914 166.12617] CT
1 0 0 RC
N
f-2087191549
f
GR
GS
[1 0 0 1 472.4314 64.42027] CT
1 0 0 RC
N
f-2087191549
f
GR
GS
[1 0 0 1 430.06165 127.03268] CT
1 0 0 RC
N
f-2087191549
f
GR
GS
[1 0 0 1 414.86877 132.38135] CT
1 0 0 RC
N
f-2087191549
f
GR
GS
[1 0 0 1 398.08313 136.81024] CT
1 0 0 RC
N
f-2087191549
f
GR
GS
[1 0 0 1 433.27005 108.67196] CT
1 0 0 RC
N
f-2087191549
f
GR
GS
[1 0 0 1 409.51929 126.65959] CT
1 0 0 RC
N
f-2087191549
f
GR
GS
[1 0 0 1 368.44434 148.26793] CT
1 0 0 RC
N
f-2087191549
f
GR
GS
[1 0 0 1 463.6683 106.09968] CT
1 0 0 RC
N
f-2087191549
f
GR
GS
0.749 GC
1 LJ
0.5 LW
N
233 249 M
478.438 82.686 L
S
GR
GS
0.749 GC
1 LJ
0.5 LW
N
233 190.779 M
478.438 94.816 L
S
GR
GS
[1 0 0 1 278 56.75] CT
/Helvetica 14 F
GS
[1 0 0 1 0 0] CT
0 5.5 moveto 
1 -1 scale
(Younger Adults: r=0.78) t 
GR
GR
GS
[1 0 0 1 260 56.75] CT
N
f-2087191549
f
GR
GS
[1 0 0 1 278 73.75] CT
/Helvetica 14 F
GS
[1 0 0 1 0 0] CT
0 5.5 moveto 
1 -1 scale
(Older Adults: r=0.83) t 
GR
GR
GS
[1 0 0 1 260 73.75] CT
1 0 0 RC
N
f-2087191549
f
GR
GS
1 GC
N
/f777440852{602.5 249 M
883 249 L
883 38.5 L
602.5 38.5 L
cp}def
f777440852
f
GR
GS
0.149 GC
2 setlinecap
1 LJ
0.5 LW
N
602.5 249 M
883 249 L
S
GR
GS
0.149 GC
2 setlinecap
1 LJ
0.5 LW
N
602.5 249 M
602.5 246.195 L
S
GR
GS
0.149 GC
2 setlinecap
1 LJ
0.5 LW
N
696 249 M
696 246.195 L
S
GR
GS
0.149 GC
2 setlinecap
1 LJ
0.5 LW
N
789.5 249 M
789.5 246.195 L
S
GR
GS
0.149 GC
2 setlinecap
1 LJ
0.5 LW
N
883 249 M
883 246.195 L
S
GR
GS
[1 0 0 1 602.49976 253.8] CT
0.149 GC
/Helvetica 14 F
GS
[1 0 0 1 0 0] CT
-14 14 moveto 
1 -1 scale
(0.78) t 
GR
GR
GS
[1 0 0 1 696.00018 253.8] CT
0.149 GC
/Helvetica 14 F
GS
[1 0 0 1 0 0] CT
-14 14 moveto 
1 -1 scale
(0.79) t 
GR
GR
GS
[1 0 0 1 789.50012 253.8] CT
0.149 GC
/Helvetica 14 F
GS
[1 0 0 1 0 0] CT
-10 14 moveto 
1 -1 scale
(0.8) t 
GR
GR
GS
[1 0 0 1 883 253.8] CT
0.149 GC
/Helvetica 14 F
GS
[1 0 0 1 0 0] CT
-14 14 moveto 
1 -1 scale
(0.81) t 
GR
GR
GS
[1 0 0 1 742.75018 271.29999] CT
0.149 GC
/Helvetica 14 F
GS
[1 0 0 1 0 0] CT
-89 14 moveto 
1 -1 scale
(Bandpass MPE, Scales 1:10) t 
GR
GR
GS
0.149 GC
2 setlinecap
1 LJ
0.5 LW
N
602.5 249 M
602.5 38.5 L
S
GR
GS
0.149 GC
2 setlinecap
1 LJ
0.5 LW
N
602.5 241.732 M
605.305 241.732 L
S
GR
GS
0.149 GC
2 setlinecap
1 LJ
0.5 LW
N
602.5 207.86 M
605.305 207.86 L
S
GR
GS
0.149 GC
2 setlinecap
1 LJ
0.5 LW
N
602.5 173.988 M
605.305 173.988 L
S
GR
GS
0.149 GC
2 setlinecap
1 LJ
0.5 LW
N
602.5 140.116 M
605.305 140.116 L
S
GR
GS
0.149 GC
2 setlinecap
1 LJ
0.5 LW
N
602.5 106.244 M
605.305 106.244 L
S
GR
GS
0.149 GC
2 setlinecap
1 LJ
0.5 LW
N
602.5 72.372 M
605.305 72.372 L
S
GR
GS
0.149 GC
2 setlinecap
1 LJ
0.5 LW
N
602.5 38.5 M
605.305 38.5 L
S
GR
GS
[1 0 0 1 597.69971 241.73199] CT
0.149 GC
/Helvetica 14 F
GS
[1 0 0 1 0 0] CT
-33 5.5 moveto 
1 -1 scale
(-0.05) t 
GR
GR
GS
[1 0 0 1 597.69971 207.85999] CT
0.149 GC
/Helvetica 14 F
GS
[1 0 0 1 0 0] CT
-33 5.5 moveto 
1 -1 scale
(-0.04) t 
GR
GR
GS
[1 0 0 1 597.69971 173.98799] CT
0.149 GC
/Helvetica 14 F
GS
[1 0 0 1 0 0] CT
-33 5.5 moveto 
1 -1 scale
(-0.03) t 
GR
GR
GS
[1 0 0 1 597.69971 140.116] CT
0.149 GC
/Helvetica 14 F
GS
[1 0 0 1 0 0] CT
-33 5.5 moveto 
1 -1 scale
(-0.02) t 
GR
GR
GS
[1 0 0 1 597.69971 106.244] CT
0.149 GC
/Helvetica 14 F
GS
[1 0 0 1 0 0] CT
-33 5.5 moveto 
1 -1 scale
(-0.01) t 
GR
GR
GS
[1 0 0 1 597.69971 72.37199] CT
0.149 GC
/Helvetica 14 F
GS
[1 0 0 1 0 0] CT
-8 5.5 moveto 
1 -1 scale
(0) t 
GR
GR
GS
[1 0 0 1 597.69971 38.5] CT
0.149 GC
/Helvetica 14 F
GS
[1 0 0 1 0 0] CT
-28 5.5 moveto 
1 -1 scale
(0.01) t 
GR
GR
GS
[0 -1 1 0 561.69952 143.74991] CT
0.149 GC
/Helvetica 14 F
GS
[1 0 0 1 0 0] CT
-108 -3 moveto 
1 -1 scale
(PSD Slope 2-64 Hz \(excl. 7-13 Hz\)) t 
GR
GR
GS
[1 0 0 1 742.75073 36.75] CT
/Helvetica-Bold 14 F
GS
[1 0 0 1 0 0] CT
-89 -22 moveto 
1 -1 scale
(Fast scale Bandpass MPE ) t 
GR
GR
GS
[1 0 0 1 742.75073 36.75] CT
/Helvetica-Bold 14 F
GS
[1 0 0 1 0 0] CT
-104 -4 moveto 
1 -1 scale
(negatively relates to PSD slope) t 
GR
GR
GS
[1 0 0 1 786.28949 160.38837] CT
N
f-2087191549
f
GR
GS
[1 0 0 1 736.34674 153.10054] CT
N
f-2087191549
f
GR
GS
[1 0 0 1 739.45703 111.14273] CT
N
f-2087191549
f
GR
GS
[1 0 0 1 714.89948 130.34705] CT
N
f-2087191549
f
GR
GS
[1 0 0 1 701.4707 112.80429] CT
N
f-2087191549
f
GR
GS
[1 0 0 1 772.11169 180.82338] CT
N
f-2087191549
f
GR
GS
[1 0 0 1 792.6366 173.34596] CT
N
f-2087191549
f
GR
GS
[1 0 0 1 727.47668 120.57827] CT
N
f-2087191549
f
GR
GS
[1 0 0 1 718.94495 110.4688] CT
N
f-2087191549
f
GR
GS
[1 0 0 1 782.28192 157.36961] CT
N
f-2087191549
f
GR
GS
[1 0 0 1 803.2226 209.61205] CT
N
f-2087191549
f
GR
GS
[1 0 0 1 751.46027 166.6125] CT
N
f-2087191549
f
GR
GS
[1 0 0 1 762.56287 139.64476] CT
N
f-2087191549
f
GR
GS
[1 0 0 1 778.10718 197.82776] CT
N
f-2087191549
f
GR
GS
[1 0 0 1 774.93835 173.21962] CT
N
f-2087191549
f
GR
GS
[1 0 0 1 799.20221 172.03448] CT
N
f-2087191549
f
GR
GS
[1 0 0 1 755.58264 157.02052] CT
N
f-2087191549
f
GR
GS
[1 0 0 1 746.96729 163.41461] CT
N
f-2087191549
f
GR
GS
[1 0 0 1 761.91028 164.56798] CT
N
f-2087191549
f
GR
GS
[1 0 0 1 699.55804 126.59669] CT
N
f-2087191549
f
GR
GS
[1 0 0 1 713.18463 113.99664] CT
N
f-2087191549
f
GR
GS
[1 0 0 1 761.32788 160.10699] CT
N
f-2087191549
f
GR
GS
[1 0 0 1 740.57446 129.46481] CT
N
f-2087191549
f
GR
GS
[1 0 0 1 743.01709 89.19782] CT
N
f-2087191549
f
GR
GS
[1 0 0 1 802.62073 173.74826] CT
N
f-2087191549
f
GR
GS
[1 0 0 1 771.5661 156.13348] CT
N
f-2087191549
f
GR
GS
[1 0 0 1 780.67017 184.68163] CT
N
f-2087191549
f
GR
GS
[1 0 0 1 747.14227 125.15896] CT
N
f-2087191549
f
GR
GS
[1 0 0 1 818.69165 180.82161] CT
N
f-2087191549
f
GR
GS
[1 0 0 1 795.30835 148.61427] CT
N
f-2087191549
f
GR
GS
[1 0 0 1 797.61279 200.10698] CT
N
f-2087191549
f
GR
GS
[1 0 0 1 691.73016 110.00576] CT
N
f-2087191549
f
GR
GS
[1 0 0 1 748.79858 159.85004] CT
N
f-2087191549
f
GR
GS
[1 0 0 1 775.61157 174.66786] CT
N
f-2087191549
f
GR
GS
[1 0 0 1 708.95807 104.19695] CT
N
f-2087191549
f
GR
GS
[1 0 0 1 797.35254 199.42726] CT
N
f-2087191549
f
GR
GS
[1 0 0 1 761.08655 146.77705] CT
N
f-2087191549
f
GR
GS
[1 0 0 1 784.00568 182.16785] CT
N
f-2087191549
f
GR
GS
[1 0 0 1 780.16583 157.34814] CT
N
f-2087191549
f
GR
GS
[1 0 0 1 814.24158 191.22954] CT
N
f-2087191549
f
GR
GS
[1 0 0 1 702.45654 80.8311] CT
N
f-2087191549
f
GR
GS
[1 0 0 1 722.05804 124.81343] CT
N
f-2087191549
f
GR
GS
[1 0 0 1 720.31482 76.20303] CT
N
f-2087191549
f
GR
GS
[1 0 0 1 750.74133 163.24892] CT
N
f-2087191549
f
GR
GS
[1 0 0 1 755.89191 186.41776] CT
N
f-2087191549
f
GR
GS
[1 0 0 1 836.00427 192.06976] CT
N
f-2087191549
f
GR
GS
[1 0 0 1 744.63495 90.70122] CT
N
f-2087191549
f
GR
GS
0.749 GC
1 LJ
0.5 LW
N
691.73 97.42 M
836.25 211.951 L
S
GR
GS
[1 0 0 1 717.93286 107.03119] CT
1 0 0 RC
N
f-2087191549
f
GR
GS
[1 0 0 1 712.71539 113.88345] CT
1 0 0 RC
N
f-2087191549
f
GR
GS
[1 0 0 1 791.0979 166.71635] CT
1 0 0 RC
N
f-2087191549
f
GR
GS
[1 0 0 1 681.83911 76.8848] CT
1 0 0 RC
N
f-2087191549
f
GR
GS
[1 0 0 1 741.56921 116.09156] CT
1 0 0 RC
N
f-2087191549
f
GR
GS
[1 0 0 1 758.4104 158.39317] CT
1 0 0 RC
N
f-2087191549
f
GR
GS
[1 0 0 1 711.01453 40.40279] CT
1 0 0 RC
N
f-2087191549
f
GR
GS
[1 0 0 1 755.17188 153.99496] CT
1 0 0 RC
N
f-2087191549
f
GR
GS
[1 0 0 1 729.56268 137.2775] CT
1 0 0 RC
N
f-2087191549
f
GR
GS
[1 0 0 1 765.41125 154.29086] CT
1 0 0 RC
N
f-2087191549
f
GR
GS
[1 0 0 1 710.28333 137.11195] CT
1 0 0 RC
N
f-2087191549
f
GR
GS
[1 0 0 1 738.83624 150.29625] CT
1 0 0 RC
N
f-2087191549
f
GR
GS
[1 0 0 1 752.1424 161.64482] CT
1 0 0 RC
N
f-2087191549
f
GR
GS
[1 0 0 1 697.06964 87.84982] CT
1 0 0 RC
N
f-2087191549
f
GR
GS
[1 0 0 1 679.27106 73.6824] CT
1 0 0 RC
N
f-2087191549
f
GR
GS
[1 0 0 1 700.04846 117.60903] CT
1 0 0 RC
N
f-2087191549
f
GR
GS
[1 0 0 1 685.39862 118.57179] CT
1 0 0 RC
N
f-2087191549
f
GR
GS
[1 0 0 1 740.43286 126.66702] CT
1 0 0 RC
N
f-2087191549
f
GR
GS
[1 0 0 1 686.57007 78.56753] CT
1 0 0 RC
N
f-2087191549
f
GR
GS
[1 0 0 1 715.82513 137.0636] CT
1 0 0 RC
N
f-2087191549
f
GR
GS
[1 0 0 1 767.2074 167.53897] CT
1 0 0 RC
N
f-2087191549
f
GR
GS
[1 0 0 1 734.89331 139.7896] CT
1 0 0 RC
N
f-2087191549
f
GR
GS
[1 0 0 1 739.45374 133.992] CT
1 0 0 RC
N
f-2087191549
f
GR
GS
[1 0 0 1 755.3692 158.15558] CT
1 0 0 RC
N
f-2087191549
f
GR
GS
[1 0 0 1 752.41327 164.49193] CT
1 0 0 RC
N
f-2087191549
f
GR
GS
[1 0 0 1 781.23529 153.1655] CT
1 0 0 RC
N
f-2087191549
f
GR
GS
[1 0 0 1 721.69971 138.86591] CT
1 0 0 RC
N
f-2087191549
f
GR
GS
[1 0 0 1 790.32379 170.68095] CT
1 0 0 RC
N
f-2087191549
f
GR
GS
[1 0 0 1 718.82013 157.53241] CT
1 0 0 RC
N
f-2087191549
f
GR
GS
[1 0 0 1 719.77753 126.22813] CT
1 0 0 RC
N
f-2087191549
f
GR
GS
[1 0 0 1 741.849 118.49656] CT
1 0 0 RC
N
f-2087191549
f
GR
GS
[1 0 0 1 695.02771 109.06583] CT
1 0 0 RC
N
f-2087191549
f
GR
GS
[1 0 0 1 726.0238 121.68282] CT
1 0 0 RC
N
f-2087191549
f
GR
GS
[1 0 0 1 740.15704 143.61929] CT
1 0 0 RC
N
f-2087191549
f
GR
GS
[1 0 0 1 694.72229 81.77821] CT
1 0 0 RC
N
f-2087191549
f
GR
GS
[1 0 0 1 740.73273 130.97632] CT
1 0 0 RC
N
f-2087191549
f
GR
GS
[1 0 0 1 817.14905 154.23076] CT
1 0 0 RC
N
f-2087191549
f
GR
GS
[1 0 0 1 709.01099 125.69604] CT
1 0 0 RC
N
f-2087191549
f
GR
GS
[1 0 0 1 778.26544 184.60344] CT
1 0 0 RC
N
f-2087191549
f
GR
GS
[1 0 0 1 750.66998 173.85353] CT
1 0 0 RC
N
f-2087191549
f
GR
GS
[1 0 0 1 699.97546 89.89621] CT
1 0 0 RC
N
f-2087191549
f
GR
GS
[1 0 0 1 685.15674 74.53556] CT
1 0 0 RC
N
f-2087191549
f
GR
GS
[1 0 0 1 760.55151 157.28343] CT
1 0 0 RC
N
f-2087191549
f
GR
GS
[1 0 0 1 769.25659 184.90102] CT
1 0 0 RC
N
f-2087191549
f
GR
GS
[1 0 0 1 695.69537 68.23335] CT
1 0 0 RC
N
f-2087191549
f
GR
GS
[1 0 0 1 736.0564 140.05653] CT
1 0 0 RC
N
f-2087191549
f
GR
GS
[1 0 0 1 718.5108 146.19205] CT
1 0 0 RC
N
f-2087191549
f
GR
GS
[1 0 0 1 761.36908 151.27246] CT
1 0 0 RC
N
f-2087191549
f
GR
GS
[1 0 0 1 744.83667 118.99482] CT
1 0 0 RC
N
f-2087191549
f
GR
GS
[1 0 0 1 728.79193 139.62857] CT
1 0 0 RC
N
f-2087191549
f
GR
GS
[1 0 0 1 748.68488 164.41566] CT
1 0 0 RC
N
f-2087191549
f
GR
GS
[1 0 0 1 712.44012 116.04413] CT
1 0 0 RC
N
f-2087191549
f
GR
GS
0.749 GC
1 LJ
0.5 LW
N
649.25 62.337 M
836.25 216.318 L
S
GR
GS
0.749 GC
1 LJ
0.5 LW
N
649.25 63.754 M
883 249 L
S
GR
GS
[1 0 0 1 647.5 213.75] CT
/Helvetica 14 F
GS
[1 0 0 1 0 0] CT
0 5.5 moveto 
1 -1 scale
(Younger Adults: r=-0.81) t 
GR
GR
GS
[1 0 0 1 629.5 213.75] CT
N
f-2087191549
f
GR
GS
[1 0 0 1 647.5 230.75] CT
/Helvetica 14 F
GS
[1 0 0 1 0 0] CT
0 5.5 moveto 
1 -1 scale
(Older Adults: r=-0.79) t 
GR
GR
GS
[1 0 0 1 629.5 230.75] CT
1 0 0 RC
N
f-2087191549
f
GR
GS
1 GC
N
/f-192726452{971.5 249 M
1252.5 249 L
1252.5 38.5 L
971.5 38.5 L
cp}def
f-192726452
f
GR
GS
0.149 GC
2 setlinecap
1 LJ
0.5 LW
N
971.5 249 M
1252.5 249 L
S
GR
GS
0.149 GC
2 setlinecap
1 LJ
0.5 LW
N
971.5 249 M
971.5 246.19 L
S
GR
GS
0.149 GC
2 setlinecap
1 LJ
0.5 LW
N
1065.167 249 M
1065.167 246.19 L
S
GR
GS
0.149 GC
2 setlinecap
1 LJ
0.5 LW
N
1158.833 249 M
1158.833 246.19 L
S
GR
GS
0.149 GC
2 setlinecap
1 LJ
0.5 LW
N
1252.5 249 M
1252.5 246.19 L
S
GR
GS
[1 0 0 1 971.49976 253.80003] CT
0.149 GC
/Helvetica 14 F
GS
[1 0 0 1 0 0] CT
-14 14 moveto 
1 -1 scale
(0.78) t 
GR
GR
GS
[1 0 0 1 1065.16687 253.80003] CT
0.149 GC
/Helvetica 14 F
GS
[1 0 0 1 0 0] CT
-14 14 moveto 
1 -1 scale
(0.79) t 
GR
GR
GS
[1 0 0 1 1158.8335 253.80003] CT
0.149 GC
/Helvetica 14 F
GS
[1 0 0 1 0 0] CT
-10 14 moveto 
1 -1 scale
(0.8) t 
GR
GR
GS
[1 0 0 1 1252.5 253.80003] CT
0.149 GC
/Helvetica 14 F
GS
[1 0 0 1 0 0] CT
-14 14 moveto 
1 -1 scale
(0.81) t 
GR
GR
GS
[1 0 0 1 1112.00012 271.29999] CT
0.149 GC
/Helvetica 14 F
GS
[1 0 0 1 0 0] CT
-89 14 moveto 
1 -1 scale
(Bandpass MPE, Scales 1:10) t 
GR
GR
GS
0.149 GC
2 setlinecap
1 LJ
0.5 LW
N
971.5 249 M
971.5 38.5 L
S
GR
GS
0.149 GC
2 setlinecap
1 LJ
0.5 LW
N
971.5 216.121 M
974.31 216.121 L
S
GR
GS
0.149 GC
2 setlinecap
1 LJ
0.5 LW
N
971.5 159.384 M
974.31 159.384 L
S
GR
GS
0.149 GC
2 setlinecap
1 LJ
0.5 LW
N
971.5 102.647 M
974.31 102.647 L
S
GR
GS
0.149 GC
2 setlinecap
1 LJ
0.5 LW
N
971.5 45.911 M
974.31 45.911 L
S
GR
GS
[1 0 0 1 966.69952 216.12061] CT
0.149 GC
/Helvetica 14 F
GS
[1 0 0 1 0 0] CT
-28 5.5 moveto 
1 -1 scale
(0.85) t 
GR
GR
GS
[1 0 0 1 966.69952 159.38403] CT
0.149 GC
/Helvetica 14 F
GS
[1 0 0 1 0 0] CT
-20 5.5 moveto 
1 -1 scale
(0.9) t 
GR
GR
GS
[1 0 0 1 966.69952 102.64741] CT
0.149 GC
/Helvetica 14 F
GS
[1 0 0 1 0 0] CT
-28 5.5 moveto 
1 -1 scale
(0.95) t 
GR
GR
GS
[1 0 0 1 966.69952 45.91077] CT
0.149 GC
/Helvetica 14 F
GS
[1 0 0 1 0 0] CT
-8 5.5 moveto 
1 -1 scale
(1) t 
GR
GR
GS
[0 -1 1 0 936.19977 143.74994] CT
0.149 GC
/Helvetica 14 F
GS
[1 0 0 1 0 0] CT
-78 -3 moveto 
1 -1 scale
(Vanilla MPE, Scales 1:10) t 
GR
GR
GS
[1 0 0 1 1112.00073 36.74997] CT
/Helvetica-Bold 14 F
GS
[1 0 0 1 0 0] CT
-98 -22 moveto 
1 -1 scale
(PE is anticorrelated between ) t 
GR
GR
GS
[1 0 0 1 1112.00073 36.74997] CT
/Helvetica-Bold 14 F
GS
[1 0 0 1 0 0] CT
-71 -4 moveto 
1 -1 scale
(Vanilla and bandpass) t 
GR
GR
GS
[1 0 0 1 1155.61707 197.04433] CT
N
f-2087191549
f
GR
GS
[1 0 0 1 1105.58533 114.10043] CT
N
f-2087191549
f
GR
GS
[1 0 0 1 1108.70117 119.82455] CT
N
f-2087191549
f
GR
GS
[1 0 0 1 1084.09985 107.68299] CT
N
f-2087191549
f
GR
GS
[1 0 0 1 1070.64709 89.73758] CT
N
f-2087191549
f
GR
GS
[1 0 0 1 1141.41406 139.64413] CT
N
f-2087191549
f
GR
GS
[1 0 0 1 1161.97559 212.26053] CT
N
f-2087191549
f
GR
GS
[1 0 0 1 1096.69946 88.33672] CT
N
f-2087191549
f
GR
GS
[1 0 0 1 1088.15247 86.50184] CT
N
f-2087191549
f
GR
GS
[1 0 0 1 1151.60242 155.06708] CT
N
f-2087191549
f
GR
GS
[1 0 0 1 1172.58044 204.43498] CT
N
f-2087191549
f
GR
GS
[1 0 0 1 1120.72583 134.77357] CT
N
f-2087191549
f
GR
GS
[1 0 0 1 1131.84814 147.99283] CT
N
f-2087191549
f
GR
GS
[1 0 0 1 1147.42017 195.20959] CT
N
f-2087191549
f
GR
GS
[1 0 0 1 1144.24573 197.57622] CT
N
f-2087191549
f
GR
GS
[1 0 0 1 1168.55286 132.90961] CT
N
f-2087191549
f
GR
GS
[1 0 0 1 1124.85547 157.50235] CT
N
f-2087191549
f
GR
GS
[1 0 0 1 1116.22473 122.53253] CT
N
f-2087191549
f
GR
GS
[1 0 0 1 1131.19446 145.35559] CT
N
f-2087191549
f
GR
GS
[1 0 0 1 1068.73108 77.92129] CT
N
f-2087191549
f
GR
GS
[1 0 0 1 1082.38196 90.37849] CT
N
f-2087191549
f
GR
GS
[1 0 0 1 1130.61096 152.56377] CT
N
f-2087191549
f
GR
GS
[1 0 0 1 1109.82056 119.50294] CT
N
f-2087191549
f
GR
GS
[1 0 0 1 1112.26758 99.04008] CT
N
f-2087191549
f
GR
GS
[1 0 0 1 1171.97742 145.4975] CT
N
f-2087191549
f
GR
GS
[1 0 0 1 1140.86743 184.3665] CT
N
f-2087191549
f
GR
GS
[1 0 0 1 1149.98779 150.96046] CT
N
f-2087191549
f
GR
GS
[1 0 0 1 1116.40015 103.99071] CT
N
f-2087191549
f
GR
GS
[1 0 0 1 1188.07703 172.19722] CT
N
f-2087191549
f
GR
GS
[1 0 0 1 1164.65198 142.17828] CT
N
f-2087191549
f
GR
GS
[1 0 0 1 1166.96057 154.32336] CT
N
f-2087191549
f
GR
GS
[1 0 0 1 1060.88916 79.29692] CT
N
f-2087191549
f
GR
GS
[1 0 0 1 1118.05933 140.38081] CT
N
f-2087191549
f
GR
GS
[1 0 0 1 1144.92017 191.22485] CT
N
f-2087191549
f
GR
GS
[1 0 0 1 1078.14783 103.16766] CT
N
f-2087191549
f
GR
GS
[1 0 0 1 1166.69983 153.3929] CT
N
f-2087191549
f
GR
GS
[1 0 0 1 1130.36926 180.39021] CT
N
f-2087191549
f
GR
GS
[1 0 0 1 1153.32922 158.20462] CT
N
f-2087191549
f
GR
GS
[1 0 0 1 1149.48254 130.45215] CT
N
f-2087191549
f
GR
GS
[1 0 0 1 1183.61902 206.87682] CT
N
f-2087191549
f
GR
GS
[1 0 0 1 1071.63477 78.94616] CT
N
f-2087191549
f
GR
GS
[1 0 0 1 1091.27112 96.38194] CT
N
f-2087191549
f
GR
GS
[1 0 0 1 1089.52478 85.00074] CT
N
f-2087191549
f
GR
GS
[1 0 0 1 1120.00562 120.13898] CT
N
f-2087191549
f
GR
GS
[1 0 0 1 1125.16541 127.7416] CT
N
f-2087191549
f
GR
GS
[1 0 0 1 1205.42053 167.47667] CT
N
f-2087191549
f
GR
GS
[1 0 0 1 1113.88831 92.57563] CT
N
f-2087191549
f
GR
GS
0.749 GC
1 LJ
0.5 LW
N
1060.889 76.755 M
1205.667 206.9 L
S
GR
GS
[1 0 0 1 1087.13867 94.88652] CT
1 0 0 RC
N
f-2087191549
f
GR
GS
[1 0 0 1 1081.91187 77.44987] CT
1 0 0 RC
N
f-2087191549
f
GR
GS
[1 0 0 1 1160.43408 126.06492] CT
1 0 0 RC
N
f-2087191549
f
GR
GS
[1 0 0 1 1050.98059 73.77328] CT
1 0 0 RC
N
f-2087191549
f
GR
GS
[1 0 0 1 1110.81714 117.24615] CT
1 0 0 RC
N
f-2087191549
f
GR
GS
[1 0 0 1 1127.68835 119.94244] CT
1 0 0 RC
N
f-2087191549
f
GR
GS
[1 0 0 1 1080.20789 75.56609] CT
1 0 0 RC
N
f-2087191549
f
GR
GS
[1 0 0 1 1124.44409 134.41051] CT
1 0 0 RC
N
f-2087191549
f
GR
GS
[1 0 0 1 1098.78918 110.76114] CT
1 0 0 RC
N
f-2087191549
f
GR
GS
[1 0 0 1 1134.70166 115.3178] CT
1 0 0 RC
N
f-2087191549
f
GR
GS
[1 0 0 1 1079.47546 104.15668] CT
1 0 0 RC
N
f-2087191549
f
GR
GS
[1 0 0 1 1108.07922 131.53059] CT
1 0 0 RC
N
f-2087191549
f
GR
GS
[1 0 0 1 1121.40918 100.41578] CT
1 0 0 RC
N
f-2087191549
f
GR
GS
[1 0 0 1 1066.23828 70.76553] CT
1 0 0 RC
N
f-2087191549
f
GR
GS
[1 0 0 1 1048.40796 75.4369] CT
1 0 0 RC
N
f-2087191549
f
GR
GS
[1 0 0 1 1069.22229 87.65726] CT
1 0 0 RC
N
f-2087191549
f
GR
GS
[1 0 0 1 1054.54639 78.02193] CT
1 0 0 RC
N
f-2087191549
f
GR
GS
[1 0 0 1 1109.67871 110.70142] CT
1 0 0 RC
N
f-2087191549
f
GR
GS
[1 0 0 1 1055.71997 74.90401] CT
1 0 0 RC
N
f-2087191549
f
GR
GS
[1 0 0 1 1085.02722 102.80392] CT
1 0 0 RC
N
f-2087191549
f
GR
GS
[1 0 0 1 1136.50098 124.36369] CT
1 0 0 RC
N
f-2087191549
f
GR
GS
[1 0 0 1 1104.12927 119.63341] CT
1 0 0 RC
N
f-2087191549
f
GR
GS
[1 0 0 1 1108.69788 106.70356] CT
1 0 0 RC
N
f-2087191549
f
GR
GS
[1 0 0 1 1124.64172 126.79335] CT
1 0 0 RC
N
f-2087191549
f
GR
GS
[1 0 0 1 1121.68042 114.64814] CT
1 0 0 RC
N
f-2087191549
f
GR
GS
[1 0 0 1 1150.55396 110.83554] CT
1 0 0 RC
N
f-2087191549
f
GR
GS
[1 0 0 1 1090.91211 90.23579] CT
1 0 0 RC
N
f-2087191549
f
GR
GS
[1 0 0 1 1159.65857 142.39655] CT
1 0 0 RC
N
f-2087191549
f
GR
GS
[1 0 0 1 1088.02747 88.86265] CT
1 0 0 RC
N
f-2087191549
f
GR
GS
[1 0 0 1 1088.98657 82.20436] CT
1 0 0 RC
N
f-2087191549
f
GR
GS
[1 0 0 1 1111.09741 114.89487] CT
1 0 0 RC
N
f-2087191549
f
GR
GS
[1 0 0 1 1064.19263 73.51464] CT
1 0 0 RC
N
f-2087191549
f
GR
GS
[1 0 0 1 1095.24402 97.33769] CT
1 0 0 RC
N
f-2087191549
f
GR
GS
[1 0 0 1 1109.40234 107.65195] CT
1 0 0 RC
N
f-2087191549
f
GR
GS
[1 0 0 1 1063.88672 77.65406] CT
1 0 0 RC
N
f-2087191549
f
GR
GS
[1 0 0 1 1109.97913 96.49266] CT
1 0 0 RC
N
f-2087191549
f
GR
GS
[1 0 0 1 1186.53162 138.9391] CT
1 0 0 RC
N
f-2087191549
f
GR
GS
[1 0 0 1 1078.20081 80.56042] CT
1 0 0 RC
N
f-2087191549
f
GR
GS
[1 0 0 1 1147.57874 154.48488] CT
1 0 0 RC
N
f-2087191549
f
GR
GS
[1 0 0 1 1119.93408 137.22664] CT
1 0 0 RC
N
f-2087191549
f
GR
GS
[1 0 0 1 1069.14917 75.12186] CT
1 0 0 RC
N
f-2087191549
f
GR
GS
[1 0 0 1 1054.30408 71.10249] CT
1 0 0 RC
N
f-2087191549
f
GR
GS
[1 0 0 1 1129.83325 118.18649] CT
1 0 0 RC
N
f-2087191549
f
GR
GS
[1 0 0 1 1138.55383 121.18151] CT
1 0 0 RC
N
f-2087191549
f
GR
GS
[1 0 0 1 1064.86145 72.49294] CT
1 0 0 RC
N
f-2087191549
f
GR
GS
[1 0 0 1 1105.29443 99.9173] CT
1 0 0 RC
N
f-2087191549
f
GR
GS
[1 0 0 1 1087.71765 109.75108] CT
1 0 0 RC
N
f-2087191549
f
GR
GS
[1 0 0 1 1130.65234 120.61581] CT
1 0 0 RC
N
f-2087191549
f
GR
GS
[1 0 0 1 1114.09045 97.84063] CT
1 0 0 RC
N
f-2087191549
f
GR
GS
[1 0 0 1 1098.01709 113.2136] CT
1 0 0 RC
N
f-2087191549
f
GR
GS
[1 0 0 1 1117.94543 139.7999] CT
1 0 0 RC
N
f-2087191549
f
GR
GS
[1 0 0 1 1081.63611 78.16498] CT
1 0 0 RC
N
f-2087191549
f
GR
GS
0.749 GC
1 LJ
0.5 LW
N
1018.334 52.07 M
1205.667 167.263 L
S
GR
GS
0.749 GC
1 LJ
0.5 LW
N
1018.334 38.5 M
1252.5 249 L
S
GR
GS
[1 0 0 1 1016.5 213.75] CT
/Helvetica 14 F
GS
[1 0 0 1 0 0] CT
0 5.5 moveto 
1 -1 scale
(Younger Adults: r=-0.81) t 
GR
GR
GS
[1 0 0 1 998.5 213.75] CT
N
f-2087191549
f
GR
GS
[1 0 0 1 1016.5 230.75] CT
/Helvetica 14 F
GS
[1 0 0 1 0 0] CT
0 5.5 moveto 
1 -1 scale
(Older Adults: r=-0.86) t 
GR
GR
GS
[1 0 0 1 998.5 230.75] CT
1 0 0 RC
N
f-2087191549
f
GR
GS
1 GC
N
/f1707866320{1341 249 M
1622 249 L
1622 38.5 L
1341 38.5 L
cp}def
f1707866320
f
GR
GS
0.149 GC
2 setlinecap
1 LJ
0.5 LW
N
1341 249 M
1622 249 L
S
GR
GS
0.149 GC
2 setlinecap
1 LJ
0.5 LW
N
1341 249 M
1341 246.19 L
S
GR
GS
0.149 GC
2 setlinecap
1 LJ
0.5 LW
N
1434.667 249 M
1434.667 246.19 L
S
GR
GS
0.149 GC
2 setlinecap
1 LJ
0.5 LW
N
1528.333 249 M
1528.333 246.19 L
S
GR
GS
0.149 GC
2 setlinecap
1 LJ
0.5 LW
N
1622 249 M
1622 246.19 L
S
GR
GS
[1 0 0 1 1341 253.80002] CT
0.149 GC
/Helvetica 14 F
GS
[1 0 0 1 0 0] CT
-12.5 14 moveto 
1 -1 scale
(-0.2) t 
GR
GR
GS
[1 0 0 1 1434.66663 253.80002] CT
0.149 GC
/Helvetica 14 F
GS
[1 0 0 1 0 0] CT
-16.5 14 moveto 
1 -1 scale
(-0.15) t 
GR
GR
GS
[1 0 0 1 1528.33337 253.80002] CT
0.149 GC
/Helvetica 14 F
GS
[1 0 0 1 0 0] CT
-12.5 14 moveto 
1 -1 scale
(-0.1) t 
GR
GR
GS
[1 0 0 1 1622 253.80002] CT
0.149 GC
/Helvetica 14 F
GS
[1 0 0 1 0 0] CT
-16.5 14 moveto 
1 -1 scale
(-0.05) t 
GR
GR
GS
[1 0 0 1 1481.50012 271.29999] CT
0.149 GC
/Helvetica 14 F
GS
[1 0 0 1 0 0] CT
-112 14 moveto 
1 -1 scale
(Bandpass-Vanilla MPE, Scales 1:10) t 
GR
GR
GS
0.149 GC
2 setlinecap
1 LJ
0.5 LW
N
1341 249 M
1341 38.5 L
S
GR
GS
0.149 GC
2 setlinecap
1 LJ
0.5 LW
N
1341 223.759 M
1343.81 223.759 L
S
GR
GS
0.149 GC
2 setlinecap
1 LJ
0.5 LW
N
1341 192.883 M
1343.81 192.883 L
S
GR
GS
0.149 GC
2 setlinecap
1 LJ
0.5 LW
N
1341 162.006 M
1343.81 162.006 L
S
GR
GS
0.149 GC
2 setlinecap
1 LJ
0.5 LW
N
1341 131.13 M
1343.81 131.13 L
S
GR
GS
0.149 GC
2 setlinecap
1 LJ
0.5 LW
N
1341 100.253 M
1343.81 100.253 L
S
GR
GS
0.149 GC
2 setlinecap
1 LJ
0.5 LW
N
1341 69.377 M
1343.81 69.377 L
S
GR
GS
0.149 GC
2 setlinecap
1 LJ
0.5 LW
N
1341 38.5 M
1343.81 38.5 L
S
GR
GS
[1 0 0 1 1336.19995 223.75943] CT
0.149 GC
/Helvetica 14 F
GS
[1 0 0 1 0 0] CT
-33 5.5 moveto 
1 -1 scale
(-0.05) t 
GR
GR
GS
[1 0 0 1 1336.19995 192.88286] CT
0.149 GC
/Helvetica 14 F
GS
[1 0 0 1 0 0] CT
-33 5.5 moveto 
1 -1 scale
(-0.04) t 
GR
GR
GS
[1 0 0 1 1336.19995 162.00629] CT
0.149 GC
/Helvetica 14 F
GS
[1 0 0 1 0 0] CT
-33 5.5 moveto 
1 -1 scale
(-0.03) t 
GR
GR
GS
[1 0 0 1 1336.19995 131.12971] CT
0.149 GC
/Helvetica 14 F
GS
[1 0 0 1 0 0] CT
-33 5.5 moveto 
1 -1 scale
(-0.02) t 
GR
GR
GS
[1 0 0 1 1336.19995 100.25314] CT
0.149 GC
/Helvetica 14 F
GS
[1 0 0 1 0 0] CT
-33 5.5 moveto 
1 -1 scale
(-0.01) t 
GR
GR
GS
[1 0 0 1 1336.19995 69.37657] CT
0.149 GC
/Helvetica 14 F
GS
[1 0 0 1 0 0] CT
-8 5.5 moveto 
1 -1 scale
(0) t 
GR
GR
GS
[1 0 0 1 1336.19995 38.5] CT
0.149 GC
/Helvetica 14 F
GS
[1 0 0 1 0 0] CT
-28 5.5 moveto 
1 -1 scale
(0.01) t 
GR
GR
GS
[0 -1 1 0 1300.19995 143.74991] CT
0.149 GC
/Helvetica 14 F
GS
[1 0 0 1 0 0] CT
-108 -3 moveto 
1 -1 scale
(PSD Slope 2-64 Hz \(excl. 7-13 Hz\)) t 
GR
GR
GS
[1 0 0 1 1481.50146 36.75] CT
/Helvetica-Bold 14 F
GS
[1 0 0 1 0 0] CT
-75.5 -22 moveto 
1 -1 scale
(Individual shift in PE is) t 
GR
GR
GS
[1 0 0 1 1481.50146 36.75] CT
/Helvetica-Bold 14 F
GS
[1 0 0 1 0 0] CT
-105.5 -4 moveto 
1 -1 scale
(associated with spectral slopes) t 
GR
GR
GS
[1 0 0 1 1589.86365 149.60933] CT
N
f-2087191549
f
GR
GS
[1 0 0 1 1442.92493 142.96599] CT
N
f-2087191549
f
GR
GS
[1 0 0 1 1452.99805 104.71867] CT
N
f-2087191549
f
GR
GS
[1 0 0 1 1428.03333 122.22466] CT
N
f-2087191549
f
GR
GS
[1 0 0 1 1395.71655 106.23328] CT
N
f-2087191549
f
GR
GS
[1 0 0 1 1492.26086 168.2372] CT
N
f-2087191549
f
GR
GS
[1 0 0 1 1616.25574 161.42104] CT
N
f-2087191549
f
GR
GS
[1 0 0 1 1398.61426 113.31979] CT
N
f-2087191549
f
GR
GS
[1 0 0 1 1393.87573 104.10432] CT
N
f-2087191549
f
GR
GS
[1 0 0 1 1519.76038 146.85753] CT
N
f-2087191549
f
GR
GS
[1 0 0 1 1605.45752 194.47998] CT
N
f-2087191549
f
GR
GS
[1 0 0 1 1480.0824 155.28304] CT
N
f-2087191549
f
GR
GS
[1 0 0 1 1504.13049 130.70016] CT
N
f-2087191549
f
GR
GS
[1 0 0 1 1585.19519 183.73781] CT
N
f-2087191549
f
GR
GS
[1 0 0 1 1588.46741 161.30586] CT
N
f-2087191549
f
GR
GS
[1 0 0 1 1486.57056 160.22552] CT
N
f-2087191549
f
GR
GS
[1 0 0 1 1518.4314 146.53932] CT
N
f-2087191549
f
GR
GS
[1 0 0 1 1458.97339 152.36795] CT
N
f-2087191549
f
GR
GS
[1 0 0 1 1499.646 153.41933] CT
N
f-2087191549
f
GR
GS
[1 0 0 1 1375.82568 118.80598] CT
N
f-2087191549
f
GR
GS
[1 0 0 1 1399.12158 107.32019] CT
N
f-2087191549
f
GR
GS
[1 0 0 1 1511.42932 149.35283] CT
N
f-2087191549
f
GR
GS
[1 0 0 1 1452.69092 121.42046] CT
N
f-2087191549
f
GR
GS
[1 0 0 1 1419.39819 84.71443] CT
N
f-2087191549
f
GR
GS
[1 0 0 1 1508.03674 161.78777] CT
N
f-2087191549
f
GR
GS
[1 0 0 1 1565.98376 145.73071] CT
N
f-2087191549
f
GR
GS
[1 0 0 1 1512.65784 171.75424] CT
N
f-2087191549
f
GR
GS
[1 0 0 1 1428.39771 117.49538] CT
N
f-2087191549
f
GR
GS
[1 0 0 1 1555.33545 168.23558] CT
N
f-2087191549
f
GR
GS
[1 0 0 1 1501.09204 138.87646] CT
N
f-2087191549
f
GR
GS
[1 0 0 1 1521.60425 185.81548] CT
N
f-2087191549
f
GR
GS
[1 0 0 1 1376.52856 103.68224] CT
N
f-2087191549
f
GR
GS
[1 0 0 1 1488.80603 149.11861] CT
N
f-2087191549
f
GR
GS
[1 0 0 1 1578.11694 162.62604] CT
N
f-2087191549
f
GR
GS
[1 0 0 1 1419.38855 98.38712] CT
N
f-2087191549
f
GR
GS
[1 0 0 1 1520.01587 185.19586] CT
N
f-2087191549
f
GR
GS
[1 0 0 1 1557.3197 137.20171] CT
N
f-2087191549
f
GR
GS
[1 0 0 1 1525.2854 169.46277] CT
N
f-2087191549
f
GR
GS
[1 0 0 1 1478.69946 146.83795] CT
N
f-2087191549
f
GR
GS
[1 0 0 1 1611.69641 177.7231] CT
N
f-2087191549
f
GR
GS
[1 0 0 1 1378.09851 77.0876] CT
N
f-2087191549
f
GR
GS
[1 0 0 1 1410.81067 117.18041] CT
N
f-2087191549
f
GR
GS
[1 0 0 1 1391.672 72.8688] CT
N
f-2087191549
f
GR
GS
[1 0 0 1 1455.77808 152.2169] CT
N
f-2087191549
f
GR
GS
[1 0 0 1 1469.36121 173.33684] CT
N
f-2087191549
f
GR
GS
[1 0 0 1 1551.01099 178.48901] CT
N
f-2087191549
f
GR
GS
[1 0 0 1 1409.05029 86.08487] CT
N
f-2087191549
f
GR
GS
0.749 GC
1 LJ
0.5 LW
N
1341 88.955 M
1622 189.555 L
S
GR
GS
[1 0 0 1 1407.51538 100.97072] CT
1 0 0 RC
N
f-2087191549
f
GR
GS
[1 0 0 1 1377.68372 107.21702] CT
1 0 0 RC
N
f-2087191549
f
GR
GS
[1 0 0 1 1473.64685 155.3777] CT
1 0 0 RC
N
f-2087191549
f
GR
GS
[1 0 0 1 1365.42773 73.4903] CT
1 0 0 RC
N
f-2087191549
f
GR
GS
[1 0 0 1 1449.16455 109.22985] CT
1 0 0 RC
N
f-2087191549
f
GR
GS
[1 0 0 1 1456.99011 147.79059] CT
1 0 0 RC
N
f-2087191549
f
GR
GS
[1 0 0 1 1374.23303 40.23452] CT
1 0 0 RC
N
f-2087191549
f
GR
GS
[1 0 0 1 1480.22668 143.78131] CT
1 0 0 RC
N
f-2087191549
f
GR
GS
[1 0 0 1 1436.05286 128.54224] CT
1 0 0 RC
N
f-2087191549
f
GR
GS
[1 0 0 1 1450.75793 144.05106] CT
1 0 0 RC
N
f-2087191549
f
GR
GS
[1 0 0 1 1421.28687 128.39133] CT
1 0 0 RC
N
f-2087191549
f
GR
GS
[1 0 0 1 1472.19922 140.4097] CT
1 0 0 RC
N
f-2087191549
f
GR
GS
[1 0 0 1 1423.49768 150.75467] CT
1 0 0 RC
N
f-2087191549
f
GR
GS
[1 0 0 1 1363.51379 83.48563] CT
1 0 0 RC
N
f-2087191549
f
GR
GS
[1 0 0 1 1367.65979 70.57108] CT
1 0 0 RC
N
f-2087191549
f
GR
GS
[1 0 0 1 1391.99719 110.61313] CT
1 0 0 RC
N
f-2087191549
f
GR
GS
[1 0 0 1 1373.15491 111.49075] CT
1 0 0 RC
N
f-2087191549
f
GR
GS
[1 0 0 1 1438.1322 118.87009] CT
1 0 0 RC
N
f-2087191549
f
GR
GS
[1 0 0 1 1368.24231 75.02421] CT
1 0 0 RC
N
f-2087191549
f
GR
GS
[1 0 0 1 1420.16382 128.34726] CT
1 0 0 RC
N
f-2087191549
f
GR
GS
[1 0 0 1 1466.05164 156.12758] CT
1 0 0 RC
N
f-2087191549
f
GR
GS
[1 0 0 1 1451.76807 130.83218] CT
1 0 0 RC
N
f-2087191549
f
GR
GS
[1 0 0 1 1431.33582 125.54729] CT
1 0 0 RC
N
f-2087191549
f
GR
GS
[1 0 0 1 1467.69104 147.57399] CT
1 0 0 RC
N
f-2087191549
f
GR
GS
[1 0 0 1 1447.04822 153.35001] CT
1 0 0 RC
N
f-2087191549
f
GR
GS
[1 0 0 1 1446.52856 143.02519] CT
1 0 0 RC
N
f-2087191549
f
GR
GS
[1 0 0 1 1400.59204 129.99017] CT
1 0 0 RC
N
f-2087191549
f
GR
GS
[1 0 0 1 1500.45374 158.9917] CT
1 0 0 RC
N
f-2087191549
f
GR
GS
[1 0 0 1 1397.74817 147.00594] CT
1 0 0 RC
N
f-2087191549
f
GR
GS
[1 0 0 1 1386.94788 118.47] CT
1 0 0 RC
N
f-2087191549
f
GR
GS
[1 0 0 1 1445.33899 111.42216] CT
1 0 0 RC
N
f-2087191549
f
GR
GS
[1 0 0 1 1367.64319 102.82544] CT
1 0 0 RC
N
f-2087191549
f
GR
GS
[1 0 0 1 1413.18298 114.32665] CT
1 0 0 RC
N
f-2087191549
f
GR
GS
[1 0 0 1 1433.04248 134.32321] CT
1 0 0 RC
N
f-2087191549
f
GR
GS
[1 0 0 1 1374.41577 77.95095] CT
1 0 0 RC
N
f-2087191549
f
GR
GS
[1 0 0 1 1414.73499 122.79829] CT
1 0 0 RC
N
f-2087191549
f
GR
GS
[1 0 0 1 1500.12036 143.99626] CT
1 0 0 RC
N
f-2087191549
f
GR
GS
[1 0 0 1 1382.07666 117.98497] CT
1 0 0 RC
N
f-2087191549
f
GR
GS
[1 0 0 1 1517.99451 171.68297] CT
1 0 0 RC
N
f-2087191549
f
GR
GS
[1 0 0 1 1483.97388 161.88371] CT
1 0 0 RC
N
f-2087191549
f
GR
GS
[1 0 0 1 1371.28784 85.35105] CT
1 0 0 RC
N
f-2087191549
f
GR
GS
[1 0 0 1 1361.68323 71.3488] CT
1 0 0 RC
N
f-2087191549
f
GR
GS
[1 0 0 1 1454.52014 146.77898] CT
1 0 0 RC
N
f-2087191549
f
GR
GS
[1 0 0 1 1461.20886 171.95422] CT
1 0 0 RC
N
f-2087191549
f
GR
GS
[1 0 0 1 1366.09021 65.60392] CT
1 0 0 RC
N
f-2087191549
f
GR
GS
[1 0 0 1 1419.45178 131.07552] CT
1 0 0 RC
N
f-2087191549
f
GR
GS
[1 0 0 1 1432.1709 136.66844] CT
1 0 0 RC
N
f-2087191549
f
GR
GS
[1 0 0 1 1458.69458 141.29958] CT
1 0 0 RC
N
f-2087191549
f
GR
GS
[1 0 0 1 1417.78247 111.87637] CT
1 0 0 RC
N
f-2087191549
f
GR
GS
[1 0 0 1 1439.94714 130.68539] CT
1 0 0 RC
N
f-2087191549
f
GR
GS
[1 0 0 1 1487.82422 153.28047] CT
1 0 0 RC
N
f-2087191549
f
GR
GS
[1 0 0 1 1378.80908 109.18661] CT
1 0 0 RC
N
f-2087191549
f
GR
GS
0.749 GC
1 LJ
0.5 LW
N
1341 74.043 M
1622 238.065 L
S
GR
GS
0.749 GC
1 LJ
0.5 LW
N
1341 88.955 M
1622 189.555 L
S
GR
GS
[1 0 0 1 1386 213.75] CT
/Helvetica 14 F
GS
[1 0 0 1 0 0] CT
0 5.5 moveto 
1 -1 scale
(Younger Adults: r=-0.8) t 
GR
GR
GS
[1 0 0 1 1368 213.75] CT
N
f-2087191549
f
GR
GS
[1 0 0 1 1386 230.75] CT
/Helvetica 14 F
GS
[1 0 0 1 0 0] CT
0 5.5 moveto 
1 -1 scale
(Older Adults: r=-0.84) t 
GR
GR
GS
[1 0 0 1 1368 230.75] CT
1 0 0 RC
N
f-2087191549
f
GR
%%Trailer
%%Pages: 1
%%EOF
