%!PS-Adobe-3.0 EPSF-3.0
%%Creator: (MATLAB, The Mathworks, Inc. Version 9.3.0.713579 \(R2017b\). Operating System: Mac OS X)
%%Title: /Users/kosciessa/Desktop/mntTardis/STSWD_Rest/WIP_eeg/A_MSE_CSD_multiVariant/C_figures/F2_WaschkeReplication_HPF.eps
%%CreationDate: 2018-11-14T15:45:50
%%Pages: (atend)
%%BoundingBox:    31     3   712   466
%%LanguageLevel: 3
%%EndComments
%%BeginProlog
%%BeginResource: procset (Apache XML Graphics Std ProcSet) 1.2 0
%%Version: 1.2 0
%%Copyright: (Copyright 2001-2003,2010 The Apache Software Foundation. License terms: http://www.apache.org/licenses/LICENSE-2.0)
/bd{bind def}bind def
/ld{load def}bd
/GR/grestore ld
/GS/gsave ld
/RM/rmoveto ld
/C/curveto ld
/t/show ld
/L/lineto ld
/ML/setmiterlimit ld
/CT/concat ld
/f/fill ld
/N/newpath ld
/S/stroke ld
/CC/setcmykcolor ld
/A/ashow ld
/cp/closepath ld
/RC/setrgbcolor ld
/LJ/setlinejoin ld
/GC/setgray ld
/LW/setlinewidth ld
/M/moveto ld
/re {4 2 roll M
1 index 0 rlineto
0 exch rlineto
neg 0 rlineto
cp } bd
/_ctm matrix def
/_tm matrix def
/BT { _ctm currentmatrix pop matrix _tm copy pop 0 0 moveto } bd
/ET { _ctm setmatrix } bd
/iTm { _ctm setmatrix _tm concat } bd
/Tm { _tm astore pop iTm 0 0 moveto } bd
/ux 0.0 def
/uy 0.0 def
/F {
  /Tp exch def
  /Tf exch def
  Tf findfont Tp scalefont setfont
  /cf Tf def  /cs Tp def
} bd
/ULS {currentpoint /uy exch def /ux exch def} bd
/ULE {
  /Tcx currentpoint pop def
  gsave
  newpath
  cf findfont cs scalefont dup
  /FontMatrix get 0 get /Ts exch def /FontInfo get dup
  /UnderlinePosition get Ts mul /To exch def
  /UnderlineThickness get Ts mul /Tt exch def
  ux uy To add moveto  Tcx uy To add lineto
  Tt setlinewidth stroke
  grestore
} bd
/OLE {
  /Tcx currentpoint pop def
  gsave
  newpath
  cf findfont cs scalefont dup
  /FontMatrix get 0 get /Ts exch def /FontInfo get dup
  /UnderlinePosition get Ts mul /To exch def
  /UnderlineThickness get Ts mul /Tt exch def
  ux uy To add cs add moveto Tcx uy To add cs add lineto
  Tt setlinewidth stroke
  grestore
} bd
/SOE {
  /Tcx currentpoint pop def
  gsave
  newpath
  cf findfont cs scalefont dup
  /FontMatrix get 0 get /Ts exch def /FontInfo get dup
  /UnderlinePosition get Ts mul /To exch def
  /UnderlineThickness get Ts mul /Tt exch def
  ux uy To add cs 10 mul 26 idiv add moveto Tcx uy To add cs 10 mul 26 idiv add lineto
  Tt setlinewidth stroke
  grestore
} bd
/QT {
/Y22 exch store
/X22 exch store
/Y21 exch store
/X21 exch store
currentpoint
/Y21 load 2 mul add 3 div exch
/X21 load 2 mul add 3 div exch
/X21 load 2 mul /X22 load add 3 div
/Y21 load 2 mul /Y22 load add 3 div
/X22 load /Y22 load curveto
} bd
/SSPD {
dup length /d exch dict def
{
/v exch def
/k exch def
currentpagedevice k known {
/cpdv currentpagedevice k get def
v cpdv ne {
/upd false def
/nullv v type /nulltype eq def
/nullcpdv cpdv type /nulltype eq def
nullv nullcpdv or
{
/upd true def
} {
/sametype v type cpdv type eq def
sametype {
v type /arraytype eq {
/vlen v length def
/cpdvlen cpdv length def
vlen cpdvlen eq {
0 1 vlen 1 sub {
/i exch def
/obj v i get def
/cpdobj cpdv i get def
obj cpdobj ne {
/upd true def
exit
} if
} for
} {
/upd true def
} ifelse
} {
v type /dicttype eq {
v {
/dv exch def
/dk exch def
/cpddv cpdv dk get def
dv cpddv ne {
/upd true def
exit
} if
} forall
} {
/upd true def
} ifelse
} ifelse
} if
} ifelse
upd true eq {
d k v put
} if
} if
} if
} forall
d length 0 gt {
d setpagedevice
} if
} bd
/RE { % /NewFontName [NewEncodingArray] /FontName RE -
  findfont dup length dict begin
  {
    1 index /FID ne
    {def} {pop pop} ifelse
  } forall
  /Encoding exch def
  /FontName 1 index def
  currentdict definefont pop
  end
} bind def
%%EndResource
%%BeginResource: procset (Apache XML Graphics EPS ProcSet) 1.0 0
%%Version: 1.0 0
%%Copyright: (Copyright 2002-2003 The Apache Software Foundation. License terms: http://www.apache.org/licenses/LICENSE-2.0)
/BeginEPSF { %def
/b4_Inc_state save def         % Save state for cleanup
/dict_count countdictstack def % Count objects on dict stack
/op_count count 1 sub def      % Count objects on operand stack
userdict begin                 % Push userdict on dict stack
/showpage { } def              % Redefine showpage, { } = null proc
0 setgray 0 setlinecap         % Prepare graphics state
1 setlinewidth 0 setlinejoin
10 setmiterlimit [ ] 0 setdash newpath
/languagelevel where           % If level not equal to 1 then
{pop languagelevel             % set strokeadjust and
1 ne                           % overprint to their defaults.
{false setstrokeadjust false setoverprint
} if
} if
} bd
/EndEPSF { %def
count op_count sub {pop} repeat            % Clean up stacks
countdictstack dict_count sub {end} repeat
b4_Inc_state restore
} bd
%%EndResource
%FOPBeginFontDict
%%IncludeResource: font Courier-Oblique
%%IncludeResource: font Courier-BoldOblique
%%IncludeResource: font Courier-Bold
%%IncludeResource: font ZapfDingbats
%%IncludeResource: font Symbol
%%IncludeResource: font Helvetica
%%IncludeResource: font Helvetica-Oblique
%%IncludeResource: font Helvetica-Bold
%%IncludeResource: font Helvetica-BoldOblique
%%IncludeResource: font Times-Roman
%%IncludeResource: font Times-Italic
%%IncludeResource: font Times-Bold
%%IncludeResource: font Times-BoldItalic
%%IncludeResource: font Courier
%FOPEndFontDict
%%BeginResource: encoding WinAnsiEncoding
/WinAnsiEncoding [
/.notdef /.notdef /.notdef /.notdef /.notdef
/.notdef /.notdef /.notdef /.notdef /.notdef
/.notdef /.notdef /.notdef /.notdef /.notdef
/.notdef /.notdef /.notdef /.notdef /.notdef
/.notdef /.notdef /.notdef /.notdef /.notdef
/.notdef /.notdef /.notdef /.notdef /.notdef
/.notdef /.notdef /space /exclam /quotedbl
/numbersign /dollar /percent /ampersand /quotesingle
/parenleft /parenright /asterisk /plus /comma
/hyphen /period /slash /zero /one
/two /three /four /five /six
/seven /eight /nine /colon /semicolon
/less /equal /greater /question /at
/A /B /C /D /E
/F /G /H /I /J
/K /L /M /N /O
/P /Q /R /S /T
/U /V /W /X /Y
/Z /bracketleft /backslash /bracketright /asciicircum
/underscore /quoteleft /a /b /c
/d /e /f /g /h
/i /j /k /l /m
/n /o /p /q /r
/s /t /u /v /w
/x /y /z /braceleft /bar
/braceright /asciitilde /bullet /Euro /bullet
/quotesinglbase /florin /quotedblbase /ellipsis /dagger
/daggerdbl /circumflex /perthousand /Scaron /guilsinglleft
/OE /bullet /Zcaron /bullet /bullet
/quoteleft /quoteright /quotedblleft /quotedblright /bullet
/endash /emdash /asciitilde /trademark /scaron
/guilsinglright /oe /bullet /zcaron /Ydieresis
/space /exclamdown /cent /sterling /currency
/yen /brokenbar /section /dieresis /copyright
/ordfeminine /guillemotleft /logicalnot /sfthyphen /registered
/macron /degree /plusminus /twosuperior /threesuperior
/acute /mu /paragraph /middot /cedilla
/onesuperior /ordmasculine /guillemotright /onequarter /onehalf
/threequarters /questiondown /Agrave /Aacute /Acircumflex
/Atilde /Adieresis /Aring /AE /Ccedilla
/Egrave /Eacute /Ecircumflex /Edieresis /Igrave
/Iacute /Icircumflex /Idieresis /Eth /Ntilde
/Ograve /Oacute /Ocircumflex /Otilde /Odieresis
/multiply /Oslash /Ugrave /Uacute /Ucircumflex
/Udieresis /Yacute /Thorn /germandbls /agrave
/aacute /acircumflex /atilde /adieresis /aring
/ae /ccedilla /egrave /eacute /ecircumflex
/edieresis /igrave /iacute /icircumflex /idieresis
/eth /ntilde /ograve /oacute /ocircumflex
/otilde /odieresis /divide /oslash /ugrave
/uacute /ucircumflex /udieresis /yacute /thorn
/ydieresis
] def
%%EndResource
%FOPBeginFontReencode
/Courier-Oblique findfont
dup length dict begin
  {1 index /FID ne {def} {pop pop} ifelse} forall
  /Encoding WinAnsiEncoding def
  currentdict
end
/Courier-Oblique exch definefont pop
/Courier-BoldOblique findfont
dup length dict begin
  {1 index /FID ne {def} {pop pop} ifelse} forall
  /Encoding WinAnsiEncoding def
  currentdict
end
/Courier-BoldOblique exch definefont pop
/Courier-Bold findfont
dup length dict begin
  {1 index /FID ne {def} {pop pop} ifelse} forall
  /Encoding WinAnsiEncoding def
  currentdict
end
/Courier-Bold exch definefont pop
/Helvetica findfont
dup length dict begin
  {1 index /FID ne {def} {pop pop} ifelse} forall
  /Encoding WinAnsiEncoding def
  currentdict
end
/Helvetica exch definefont pop
/Helvetica-Oblique findfont
dup length dict begin
  {1 index /FID ne {def} {pop pop} ifelse} forall
  /Encoding WinAnsiEncoding def
  currentdict
end
/Helvetica-Oblique exch definefont pop
/Helvetica-Bold findfont
dup length dict begin
  {1 index /FID ne {def} {pop pop} ifelse} forall
  /Encoding WinAnsiEncoding def
  currentdict
end
/Helvetica-Bold exch definefont pop
/Helvetica-BoldOblique findfont
dup length dict begin
  {1 index /FID ne {def} {pop pop} ifelse} forall
  /Encoding WinAnsiEncoding def
  currentdict
end
/Helvetica-BoldOblique exch definefont pop
/Times-Roman findfont
dup length dict begin
  {1 index /FID ne {def} {pop pop} ifelse} forall
  /Encoding WinAnsiEncoding def
  currentdict
end
/Times-Roman exch definefont pop
/Times-Italic findfont
dup length dict begin
  {1 index /FID ne {def} {pop pop} ifelse} forall
  /Encoding WinAnsiEncoding def
  currentdict
end
/Times-Italic exch definefont pop
/Times-Bold findfont
dup length dict begin
  {1 index /FID ne {def} {pop pop} ifelse} forall
  /Encoding WinAnsiEncoding def
  currentdict
end
/Times-Bold exch definefont pop
/Times-BoldItalic findfont
dup length dict begin
  {1 index /FID ne {def} {pop pop} ifelse} forall
  /Encoding WinAnsiEncoding def
  currentdict
end
/Times-BoldItalic exch definefont pop
/Courier findfont
dup length dict begin
  {1 index /FID ne {def} {pop pop} ifelse} forall
  /Encoding WinAnsiEncoding def
  currentdict
end
/Courier exch definefont pop
%FOPEndFontReencode
%%EndProlog
%%Page: 1 1
%%PageBoundingBox: 0 0 768 480
%%BeginPageSetup
[1 0 0 -1 0 480] CT
%%EndPageSetup
GS
1 GC
N
0 0 768 480 re
f
GR
GS
1 GC
N
0 0 768 480 re
f
GR
GS
1 GC
N
100 427 M
695 427 L
695 36 L
100 36 L
cp
f
GR
GS
0.149 GC
2 setlinecap
1 LJ
0.5 LW
N
100 427 M
695 427 L
S
GR
GS
0.149 GC
2 setlinecap
1 LJ
0.5 LW
N
100 427 M
100 421.05 L
S
GR
GS
0.149 GC
2 setlinecap
1 LJ
0.5 LW
N
174.375 427 M
174.375 421.05 L
S
GR
GS
0.149 GC
2 setlinecap
1 LJ
0.5 LW
N
248.75 427 M
248.75 421.05 L
S
GR
GS
0.149 GC
2 setlinecap
1 LJ
0.5 LW
N
323.125 427 M
323.125 421.05 L
S
GR
GS
0.149 GC
2 setlinecap
1 LJ
0.5 LW
N
397.5 427 M
397.5 421.05 L
S
GR
GS
0.149 GC
2 setlinecap
1 LJ
0.5 LW
N
471.875 427 M
471.875 421.05 L
S
GR
GS
0.149 GC
2 setlinecap
1 LJ
0.5 LW
N
546.25 427 M
546.25 421.05 L
S
GR
GS
0.149 GC
2 setlinecap
1 LJ
0.5 LW
N
620.625 427 M
620.625 421.05 L
S
GR
GS
0.149 GC
2 setlinecap
1 LJ
0.5 LW
N
695 427 M
695 421.05 L
S
GR
GS
[1 0 0 1 100 432.60001] CT
0.149 GC
/Helvetica 18 F
GS
[1 0 0 1 0 0] CT
-18 18 moveto 
1 -1 scale
(0.25) t 
GR
GR
GS
[1 0 0 1 174.37502 432.60001] CT
0.149 GC
/Helvetica 18 F
GS
[1 0 0 1 0 0] CT
-13 18 moveto 
1 -1 scale
(0.3) t 
GR
GR
GS
[1 0 0 1 248.74998 432.60001] CT
0.149 GC
/Helvetica 18 F
GS
[1 0 0 1 0 0] CT
-18 18 moveto 
1 -1 scale
(0.35) t 
GR
GR
GS
[1 0 0 1 323.125 432.60001] CT
0.149 GC
/Helvetica 18 F
GS
[1 0 0 1 0 0] CT
-13 18 moveto 
1 -1 scale
(0.4) t 
GR
GR
GS
[1 0 0 1 397.49997 432.60001] CT
0.149 GC
/Helvetica 18 F
GS
[1 0 0 1 0 0] CT
-18 18 moveto 
1 -1 scale
(0.45) t 
GR
GR
GS
[1 0 0 1 471.875 432.60001] CT
0.149 GC
/Helvetica 18 F
GS
[1 0 0 1 0 0] CT
-13 18 moveto 
1 -1 scale
(0.5) t 
GR
GR
GS
[1 0 0 1 546.25 432.60001] CT
0.149 GC
/Helvetica 18 F
GS
[1 0 0 1 0 0] CT
-18 18 moveto 
1 -1 scale
(0.55) t 
GR
GR
GS
[1 0 0 1 620.62506 432.60001] CT
0.149 GC
/Helvetica 18 F
GS
[1 0 0 1 0 0] CT
-13 18 moveto 
1 -1 scale
(0.6) t 
GR
GR
GS
[1 0 0 1 694.99994 432.60001] CT
0.149 GC
/Helvetica 18 F
GS
[1 0 0 1 0 0] CT
-18 18 moveto 
1 -1 scale
(0.65) t 
GR
GR
GS
[1 0 0 1 397.50024 455.59998] CT
0.149 GC
/Helvetica 18 F
GS
[1 0 0 1 0 0] CT
-81 18 moveto 
1 -1 scale
(HP MSE, Scales 1:3) t 
GR
GR
GS
0.149 GC
2 setlinecap
1 LJ
0.5 LW
N
100 427 M
100 36 L
S
GR
GS
0.149 GC
2 setlinecap
1 LJ
0.5 LW
N
100 427 M
105.95 427 L
S
GR
GS
0.149 GC
2 setlinecap
1 LJ
0.5 LW
N
100 378.125 M
105.95 378.125 L
S
GR
GS
0.149 GC
2 setlinecap
1 LJ
0.5 LW
N
100 329.25 M
105.95 329.25 L
S
GR
GS
0.149 GC
2 setlinecap
1 LJ
0.5 LW
N
100 280.375 M
105.95 280.375 L
S
GR
GS
0.149 GC
2 setlinecap
1 LJ
0.5 LW
N
100 231.5 M
105.95 231.5 L
S
GR
GS
0.149 GC
2 setlinecap
1 LJ
0.5 LW
N
100 182.625 M
105.95 182.625 L
S
GR
GS
0.149 GC
2 setlinecap
1 LJ
0.5 LW
N
100 133.75 M
105.95 133.75 L
S
GR
GS
0.149 GC
2 setlinecap
1 LJ
0.5 LW
N
100 84.875 M
105.95 84.875 L
S
GR
GS
0.149 GC
2 setlinecap
1 LJ
0.5 LW
N
100 36 M
105.95 36 L
S
GR
GS
[1 0 0 1 94.4 427] CT
0.149 GC
/Helvetica 18 F
GS
[1 0 0 1 0 0] CT
-43 7 moveto 
1 -1 scale
(-0.06) t 
GR
GR
GS
[1 0 0 1 94.4 378.125] CT
0.149 GC
/Helvetica 18 F
GS
[1 0 0 1 0 0] CT
-43 7 moveto 
1 -1 scale
(-0.05) t 
GR
GR
GS
[1 0 0 1 94.4 329.25] CT
0.149 GC
/Helvetica 18 F
GS
[1 0 0 1 0 0] CT
-43 7 moveto 
1 -1 scale
(-0.04) t 
GR
GR
GS
[1 0 0 1 94.4 280.375] CT
0.149 GC
/Helvetica 18 F
GS
[1 0 0 1 0 0] CT
-43 7 moveto 
1 -1 scale
(-0.03) t 
GR
GR
GS
[1 0 0 1 94.4 231.5] CT
0.149 GC
/Helvetica 18 F
GS
[1 0 0 1 0 0] CT
-43 7 moveto 
1 -1 scale
(-0.02) t 
GR
GR
GS
[1 0 0 1 94.4 182.625] CT
0.149 GC
/Helvetica 18 F
GS
[1 0 0 1 0 0] CT
-43 7 moveto 
1 -1 scale
(-0.01) t 
GR
GR
GS
[1 0 0 1 94.4 133.75] CT
0.149 GC
/Helvetica 18 F
GS
[1 0 0 1 0 0] CT
-11 7 moveto 
1 -1 scale
(0) t 
GR
GR
GS
[1 0 0 1 94.4 84.875] CT
0.149 GC
/Helvetica 18 F
GS
[1 0 0 1 0 0] CT
-36 7 moveto 
1 -1 scale
(0.01) t 
GR
GR
GS
[1 0 0 1 94.4 36] CT
0.149 GC
/Helvetica 18 F
GS
[1 0 0 1 0 0] CT
-36 7 moveto 
1 -1 scale
(0.02) t 
GR
GR
GS
[0 -1 1 0 48.40001 231.49982] CT
0.149 GC
/Helvetica 18 F
GS
[1 0 0 1 0 0] CT
-138.5 -4 moveto 
1 -1 scale
(PSD Slope 2-30 Hz \(excl. 7-13 Hz\)) t 
GR
GR
GS
[1 0 0 1 397.50037 31.5] CT
/Helvetica-Bold 18 F
GS
[1 0 0 1 0 0] CT
-214.5 -4 moveto 
1 -1 scale
(Fast entropy predicts PSD slope \(~Waschke et al.\)) t 
GR
GR
GS
[1 0 0 1 551.99762 256.65414] CT
N
3 0 M
3 -1.657 1.657 -3 0 -3 C
-1.657 -3 -3 -1.657 -3 0 C
-3 1.657 -1.657 3 0 3 C
1.657 3 3 1.657 3 0 C
f
GR
GS
[1 0 0 1 549.33795 312.74506] CT
N
/f-1827712652{3 0 M
3 -1.657 1.657 -3 0 -3 C
-1.657 -3 -3 -1.657 -3 0 C
-3 1.657 -1.657 3 0 3 C
1.657 3 3 1.657 3 0 C}def
f-1827712652
f
GR
GS
[1 0 0 1 534.3349 246.50114] CT
N
f-1827712652
f
GR
GS
[1 0 0 1 522.94427 340.35251] CT
N
f-1827712652
f
GR
GS
[1 0 0 1 522.83417 370.14908] CT
N
f-1827712652
f
GR
GS
[1 0 0 1 578.16156 296.61288] CT
N
f-1827712652
f
GR
GS
[1 0 0 1 574.29059 244.61211] CT
N
f-1827712652
f
GR
GS
[1 0 0 1 562.01501 221.54742] CT
N
f-1827712652
f
GR
GS
[1 0 0 1 554.36346 313.80063] CT
N
f-1827712652
f
GR
GS
[1 0 0 1 592.97296 409.22137] CT
N
f-1827712652
f
GR
GS
[1 0 0 1 338.3566 352.27893] CT
N
f-1827712652
f
GR
GS
[1 0 0 1 498.17859 331.45331] CT
N
f-1827712652
f
GR
GS
[1 0 0 1 567.22931 363.40637] CT
N
f-1827712652
f
GR
GS
[1 0 0 1 568.61847 313.99142] CT
N
f-1827712652
f
GR
GS
[1 0 0 1 579.68512 323.10864] CT
N
f-1827712652
f
GR
GS
[1 0 0 1 556.43994 345.25024] CT
N
f-1827712652
f
GR
GS
[1 0 0 1 562.86053 317.1835] CT
N
f-1827712652
f
GR
GS
[1 0 0 1 534.19122 332.10275] CT
N
f-1827712652
f
GR
GS
[1 0 0 1 490.97809 341.52655] CT
N
f-1827712652
f
GR
GS
[1 0 0 1 558.28418 298.3024] CT
N
f-1827712652
f
GR
GS
[1 0 0 1 597.18878 329.5419] CT
N
f-1827712652
f
GR
GS
[1 0 0 1 525.49268 244.16867] CT
N
f-1827712652
f
GR
GS
[1 0 0 1 452.83353 149.95081] CT
N
f-1827712652
f
GR
GS
[1 0 0 1 558.13849 264.52539] CT
N
f-1827712652
f
GR
GS
[1 0 0 1 506.87402 303.27612] CT
N
f-1827712652
f
GR
GS
[1 0 0 1 382.00311 376.55109] CT
N
f-1827712652
f
GR
GS
[1 0 0 1 261.63416 266.03979] CT
N
f-1827712652
f
GR
GS
[1 0 0 1 518.47693 239.912] CT
N
f-1827712652
f
GR
GS
[1 0 0 1 502.60361 252.62364] CT
N
f-1827712652
f
GR
GS
[1 0 0 1 490.95468 365.83566] CT
N
f-1827712652
f
GR
GS
[1 0 0 1 557.22662 279.56812] CT
N
f-1827712652
f
GR
GS
[1 0 0 1 571.24677 259.52881] CT
N
f-1827712652
f
GR
GS
[1 0 0 1 588.14386 320.86884] CT
N
f-1827712652
f
GR
GS
[1 0 0 1 551.42139 307.39954] CT
N
f-1827712652
f
GR
GS
[1 0 0 1 495.73819 368.77213] CT
N
f-1827712652
f
GR
GS
[1 0 0 1 499.12115 283.36066] CT
N
f-1827712652
f
GR
GS
[1 0 0 1 588.63403 307.04044] CT
N
f-1827712652
f
GR
GS
[1 0 0 1 519.52325 299.50937] CT
N
f-1827712652
f
GR
GS
[1 0 0 1 537.69238 309.84885] CT
N
f-1827712652
f
GR
GS
[1 0 0 1 551.45093 197.58328] CT
N
f-1827712652
f
GR
GS
[1 0 0 1 605.24298 287.82578] CT
N
f-1827712652
f
GR
GS
[1 0 0 1 573.8291 245.59871] CT
N
f-1827712652
f
GR
GS
[1 0 0 1 542.16846 299.78796] CT
N
f-1827712652
f
GR
GS
[1 0 0 1 567.2746 318.64627] CT
N
f-1827712652
f
GR
GS
[1 0 0 1 551.89789 268.31586] CT
N
f-1827712652
f
GR
GS
[1 0 0 1 549.81323 171.91811] CT
N
f-1827712652
f
GR
GS
0.749 GC
1 LJ
0.5 LW
N
248.75 306.402 M
620.625 293.655 L
S
GR
GS
[1 0 0 1 588.68213 162.14766] CT
1 0 0 RC
N
f-1827712652
f
GR
GS
[1 0 0 1 253.08534 240.50624] CT
1 0 0 RC
N
f-1827712652
f
GR
GS
[1 0 0 1 541.71362 198.29897] CT
1 0 0 RC
N
f-1827712652
f
GR
GS
[1 0 0 1 427.16241 213.70776] CT
1 0 0 RC
N
f-1827712652
f
GR
GS
[1 0 0 1 550.72028 201.3882] CT
1 0 0 RC
N
f-1827712652
f
GR
GS
[1 0 0 1 544.37891 194.55836] CT
1 0 0 RC
N
f-1827712652
f
GR
GS
[1 0 0 1 535.65131 301.19571] CT
1 0 0 RC
N
f-1827712652
f
GR
GS
[1 0 0 1 433.75836 232.64386] CT
1 0 0 RC
N
f-1827712652
f
GR
GS
[1 0 0 1 587.76013 205.92015] CT
1 0 0 RC
N
f-1827712652
f
GR
GS
[1 0 0 1 583.45514 205.00349] CT
1 0 0 RC
N
f-1827712652
f
GR
GS
[1 0 0 1 497.12183 288.98456] CT
1 0 0 RC
N
f-1827712652
f
GR
GS
[1 0 0 1 381.53311 279.73099] CT
1 0 0 RC
N
f-1827712652
f
GR
GS
[1 0 0 1 541.48267 203.89903] CT
1 0 0 RC
N
f-1827712652
f
GR
GS
[1 0 0 1 519.52173 153.53799] CT
1 0 0 RC
N
f-1827712652
f
GR
GS
[1 0 0 1 570.34778 290.28394] CT
1 0 0 RC
N
f-1827712652
f
GR
GS
[1 0 0 1 582.7876 323.77496] CT
1 0 0 RC
N
f-1827712652
f
GR
GS
[1 0 0 1 607.06049 189.48732] CT
1 0 0 RC
N
f-1827712652
f
GR
GS
[1 0 0 1 544.09222 178.03461] CT
1 0 0 RC
N
f-1827712652
f
GR
GS
[1 0 0 1 423.70065 270.73959] CT
1 0 0 RC
N
f-1827712652
f
GR
GS
[1 0 0 1 420.3963 330.32156] CT
1 0 0 RC
N
f-1827712652
f
GR
GS
[1 0 0 1 543.11261 244.07332] CT
1 0 0 RC
N
f-1827712652
f
GR
GS
[1 0 0 1 428.49768 203.87383] CT
1 0 0 RC
N
f-1827712652
f
GR
GS
[1 0 0 1 570.24622 184.24019] CT
1 0 0 RC
N
f-1827712652
f
GR
GS
[1 0 0 1 593.85651 200.96774] CT
1 0 0 RC
N
f-1827712652
f
GR
GS
[1 0 0 1 598.67432 224.63074] CT
1 0 0 RC
N
f-1827712652
f
GR
GS
[1 0 0 1 597.92712 286.88403] CT
1 0 0 RC
N
f-1827712652
f
GR
GS
[1 0 0 1 564.89795 219.53252] CT
1 0 0 RC
N
f-1827712652
f
GR
GS
[1 0 0 1 581.7066 188.36258] CT
1 0 0 RC
N
f-1827712652
f
GR
GS
[1 0 0 1 509.47235 217.2258] CT
1 0 0 RC
N
f-1827712652
f
GR
GS
[1 0 0 1 542.53943 53.30359] CT
1 0 0 RC
N
f-1827712652
f
GR
GS
[1 0 0 1 532.93372 156.10707] CT
1 0 0 RC
N
f-1827712652
f
GR
GS
[1 0 0 1 552.32587 136.47137] CT
1 0 0 RC
N
f-1827712652
f
GR
GS
[1 0 0 1 540.97351 121.56762] CT
1 0 0 RC
N
f-1827712652
f
GR
GS
[1 0 0 1 552.84381 158.8503] CT
1 0 0 RC
N
f-1827712652
f
GR
GS
[1 0 0 1 534.6629 68.12224] CT
1 0 0 RC
N
f-1827712652
f
GR
GS
[1 0 0 1 568.34991 160.43466] CT
1 0 0 RC
N
f-1827712652
f
GR
GS
[1 0 0 1 590.9624 181.13344] CT
1 0 0 RC
N
f-1827712652
f
GR
GS
[1 0 0 1 584.97113 278.07669] CT
1 0 0 RC
N
f-1827712652
f
GR
GS
[1 0 0 1 574.62921 371.23062] CT
1 0 0 RC
N
f-1827712652
f
GR
GS
[1 0 0 1 542.06244 174.24414] CT
1 0 0 RC
N
f-1827712652
f
GR
GS
[1 0 0 1 546.88733 64.76366] CT
1 0 0 RC
N
f-1827712652
f
GR
GS
[1 0 0 1 126.36907 253.89058] CT
1 0 0 RC
N
f-1827712652
f
GR
GS
[1 0 0 1 578.3335 333.25229] CT
1 0 0 RC
N
f-1827712652
f
GR
GS
[1 0 0 1 563.51074 178.87135] CT
1 0 0 RC
N
f-1827712652
f
GR
GS
[1 0 0 1 587.62732 209.96425] CT
1 0 0 RC
N
f-1827712652
f
GR
GS
[1 0 0 1 507.4975 365.85205] CT
1 0 0 RC
N
f-1827712652
f
GR
GS
[1 0 0 1 558.67334 203.2187] CT
1 0 0 RC
N
f-1827712652
f
GR
GS
[1 0 0 1 571.73804 103.86618] CT
1 0 0 RC
N
f-1827712652
f
GR
GS
[1 0 0 1 573.90002 296.80588] CT
1 0 0 RC
N
f-1827712652
f
GR
GS
[1 0 0 1 554.58752 325.02142] CT
1 0 0 RC
N
f-1827712652
f
GR
GS
[1 0 0 1 523.93469 172.66815] CT
1 0 0 RC
N
f-1827712652
f
GR
GS
0.749 GC
1 LJ
0.5 LW
N
100 272.039 M
620.625 203.547 L
S
GR
GS
0.749 GC
1 LJ
0.5 LW
N
100 311.502 M
695 291.105 L
S
GR
GS
[1 0 0 1 147 59.13402] CT
/Helvetica 18 F
GS
[1 0 0 1 0 0] CT
0 7 moveto 
1 -1 scale
(Younger Adults: r=0.04) t 
GR
GR
GS
[1 0 0 1 129 59.13402] CT
N
f-1827712652
f
GR
GS
[1 0 0 1 147 81.86598] CT
/Helvetica 18 F
GS
[1 0 0 1 0 0] CT
0 7 moveto 
1 -1 scale
(Older Adults: r=0.16) t 
GR
GR
GS
[1 0 0 1 129 81.86598] CT
1 0 0 RC
N
f-1827712652
f
GR
%%Trailer
%%Pages: 1
%%EOF
