%!PS-Adobe-3.0 EPSF-3.0
%%Creator: (MATLAB, The Mathworks, Inc. Version 9.1.0.441655 \(R2016b\). Operating System: Mac OS X)
%%Title: /Volumes/LNDG/Projects/StateSwitch/dynamic/data/eeg/rest/B_analyses/A_MSE_CSD_multiVariant/C_figures/Z_IntroSchematic_v2.eps
%%CreationDate: 2019-12-16T14:22:45
%%Pages: (atend)
%%BoundingBox: 0 0 512 288
%%LanguageLevel: 3
%%EndComments
%%BeginProlog
%%BeginResource: procset (Apache XML Graphics Std ProcSet) 1.2 0
%%Version: 1.2 0
%%Copyright: (Copyright 2001-2003,2010 The Apache Software Foundation. License terms: http://www.apache.org/licenses/LICENSE-2.0)
/bd{bind def}bind def
/ld{load def}bd
/GR/grestore ld
/M/moveto ld
/LJ/setlinejoin ld
/C/curveto ld
/f/fill ld
/LW/setlinewidth ld
/GC/setgray ld
/t/show ld
/N/newpath ld
/CT/concat ld
/cp/closepath ld
/S/stroke ld
/L/lineto ld
/CC/setcmykcolor ld
/A/ashow ld
/GS/gsave ld
/RC/setrgbcolor ld
/RM/rmoveto ld
/ML/setmiterlimit ld
/re {4 2 roll M
1 index 0 rlineto
0 exch rlineto
neg 0 rlineto
cp } bd
/_ctm matrix def
/_tm matrix def
/BT { _ctm currentmatrix pop matrix _tm copy pop 0 0 moveto } bd
/ET { _ctm setmatrix } bd
/iTm { _ctm setmatrix _tm concat } bd
/Tm { _tm astore pop iTm 0 0 moveto } bd
/ux 0.0 def
/uy 0.0 def
/F {
  /Tp exch def
  /Tf exch def
  Tf findfont Tp scalefont setfont
  /cf Tf def  /cs Tp def
} bd
/ULS {currentpoint /uy exch def /ux exch def} bd
/ULE {
  /Tcx currentpoint pop def
  gsave
  newpath
  cf findfont cs scalefont dup
  /FontMatrix get 0 get /Ts exch def /FontInfo get dup
  /UnderlinePosition get Ts mul /To exch def
  /UnderlineThickness get Ts mul /Tt exch def
  ux uy To add moveto  Tcx uy To add lineto
  Tt setlinewidth stroke
  grestore
} bd
/OLE {
  /Tcx currentpoint pop def
  gsave
  newpath
  cf findfont cs scalefont dup
  /FontMatrix get 0 get /Ts exch def /FontInfo get dup
  /UnderlinePosition get Ts mul /To exch def
  /UnderlineThickness get Ts mul /Tt exch def
  ux uy To add cs add moveto Tcx uy To add cs add lineto
  Tt setlinewidth stroke
  grestore
} bd
/SOE {
  /Tcx currentpoint pop def
  gsave
  newpath
  cf findfont cs scalefont dup
  /FontMatrix get 0 get /Ts exch def /FontInfo get dup
  /UnderlinePosition get Ts mul /To exch def
  /UnderlineThickness get Ts mul /Tt exch def
  ux uy To add cs 10 mul 26 idiv add moveto Tcx uy To add cs 10 mul 26 idiv add lineto
  Tt setlinewidth stroke
  grestore
} bd
/QT {
/Y22 exch store
/X22 exch store
/Y21 exch store
/X21 exch store
currentpoint
/Y21 load 2 mul add 3 div exch
/X21 load 2 mul add 3 div exch
/X21 load 2 mul /X22 load add 3 div
/Y21 load 2 mul /Y22 load add 3 div
/X22 load /Y22 load curveto
} bd
/SSPD {
dup length /d exch dict def
{
/v exch def
/k exch def
currentpagedevice k known {
/cpdv currentpagedevice k get def
v cpdv ne {
/upd false def
/nullv v type /nulltype eq def
/nullcpdv cpdv type /nulltype eq def
nullv nullcpdv or
{
/upd true def
} {
/sametype v type cpdv type eq def
sametype {
v type /arraytype eq {
/vlen v length def
/cpdvlen cpdv length def
vlen cpdvlen eq {
0 1 vlen 1 sub {
/i exch def
/obj v i get def
/cpdobj cpdv i get def
obj cpdobj ne {
/upd true def
exit
} if
} for
} {
/upd true def
} ifelse
} {
v type /dicttype eq {
v {
/dv exch def
/dk exch def
/cpddv cpdv dk get def
dv cpddv ne {
/upd true def
exit
} if
} forall
} {
/upd true def
} ifelse
} ifelse
} if
} ifelse
upd true eq {
d k v put
} if
} if
} if
} forall
d length 0 gt {
d setpagedevice
} if
} bd
/RE { % /NewFontName [NewEncodingArray] /FontName RE -
  findfont dup length dict begin
  {
    1 index /FID ne
    {def} {pop pop} ifelse
  } forall
  /Encoding exch def
  /FontName 1 index def
  currentdict definefont pop
  end
} bind def
%%EndResource
%%BeginResource: procset (Apache XML Graphics EPS ProcSet) 1.0 0
%%Version: 1.0 0
%%Copyright: (Copyright 2002-2003 The Apache Software Foundation. License terms: http://www.apache.org/licenses/LICENSE-2.0)
/BeginEPSF { %def
/b4_Inc_state save def         % Save state for cleanup
/dict_count countdictstack def % Count objects on dict stack
/op_count count 1 sub def      % Count objects on operand stack
userdict begin                 % Push userdict on dict stack
/showpage { } def              % Redefine showpage, { } = null proc
0 setgray 0 setlinecap         % Prepare graphics state
1 setlinewidth 0 setlinejoin
10 setmiterlimit [ ] 0 setdash newpath
/languagelevel where           % If level not equal to 1 then
{pop languagelevel             % set strokeadjust and
1 ne                           % overprint to their defaults.
{false setstrokeadjust false setoverprint
} if
} if
} bd
/EndEPSF { %def
count op_count sub {pop} repeat            % Clean up stacks
countdictstack dict_count sub {end} repeat
b4_Inc_state restore
} bd
%%EndResource
%FOPBeginFontDict
%%IncludeResource: font Courier-Bold
%%IncludeResource: font Helvetica
%%IncludeResource: font Courier-BoldOblique
%%IncludeResource: font Courier-Oblique
%%IncludeResource: font Times-Roman
%%IncludeResource: font Helvetica-BoldOblique
%%IncludeResource: font Helvetica-Bold
%%IncludeResource: font Helvetica-Oblique
%%IncludeResource: font Times-BoldItalic
%%IncludeResource: font Courier
%%IncludeResource: font Times-Italic
%%IncludeResource: font Times-Bold
%%IncludeResource: font Symbol
%%IncludeResource: font ZapfDingbats
%FOPEndFontDict
%%BeginResource: encoding WinAnsiEncoding
/WinAnsiEncoding [
/.notdef /.notdef /.notdef /.notdef /.notdef
/.notdef /.notdef /.notdef /.notdef /.notdef
/.notdef /.notdef /.notdef /.notdef /.notdef
/.notdef /.notdef /.notdef /.notdef /.notdef
/.notdef /.notdef /.notdef /.notdef /.notdef
/.notdef /.notdef /.notdef /.notdef /.notdef
/.notdef /.notdef /space /exclam /quotedbl
/numbersign /dollar /percent /ampersand /quotesingle
/parenleft /parenright /asterisk /plus /comma
/hyphen /period /slash /zero /one
/two /three /four /five /six
/seven /eight /nine /colon /semicolon
/less /equal /greater /question /at
/A /B /C /D /E
/F /G /H /I /J
/K /L /M /N /O
/P /Q /R /S /T
/U /V /W /X /Y
/Z /bracketleft /backslash /bracketright /asciicircum
/underscore /quoteleft /a /b /c
/d /e /f /g /h
/i /j /k /l /m
/n /o /p /q /r
/s /t /u /v /w
/x /y /z /braceleft /bar
/braceright /asciitilde /bullet /Euro /bullet
/quotesinglbase /florin /quotedblbase /ellipsis /dagger
/daggerdbl /circumflex /perthousand /Scaron /guilsinglleft
/OE /bullet /Zcaron /bullet /bullet
/quoteleft /quoteright /quotedblleft /quotedblright /bullet
/endash /emdash /asciitilde /trademark /scaron
/guilsinglright /oe /bullet /zcaron /Ydieresis
/space /exclamdown /cent /sterling /currency
/yen /brokenbar /section /dieresis /copyright
/ordfeminine /guillemotleft /logicalnot /sfthyphen /registered
/macron /degree /plusminus /twosuperior /threesuperior
/acute /mu /paragraph /middot /cedilla
/onesuperior /ordmasculine /guillemotright /onequarter /onehalf
/threequarters /questiondown /Agrave /Aacute /Acircumflex
/Atilde /Adieresis /Aring /AE /Ccedilla
/Egrave /Eacute /Ecircumflex /Edieresis /Igrave
/Iacute /Icircumflex /Idieresis /Eth /Ntilde
/Ograve /Oacute /Ocircumflex /Otilde /Odieresis
/multiply /Oslash /Ugrave /Uacute /Ucircumflex
/Udieresis /Yacute /Thorn /germandbls /agrave
/aacute /acircumflex /atilde /adieresis /aring
/ae /ccedilla /egrave /eacute /ecircumflex
/edieresis /igrave /iacute /icircumflex /idieresis
/eth /ntilde /ograve /oacute /ocircumflex
/otilde /odieresis /divide /oslash /ugrave
/uacute /ucircumflex /udieresis /yacute /thorn
/ydieresis
] def
%%EndResource
%FOPBeginFontReencode
/Courier-Bold findfont
dup length dict begin
  {1 index /FID ne {def} {pop pop} ifelse} forall
  /Encoding WinAnsiEncoding def
  currentdict
end
/Courier-Bold exch definefont pop
/Helvetica findfont
dup length dict begin
  {1 index /FID ne {def} {pop pop} ifelse} forall
  /Encoding WinAnsiEncoding def
  currentdict
end
/Helvetica exch definefont pop
/Courier-BoldOblique findfont
dup length dict begin
  {1 index /FID ne {def} {pop pop} ifelse} forall
  /Encoding WinAnsiEncoding def
  currentdict
end
/Courier-BoldOblique exch definefont pop
/Courier-Oblique findfont
dup length dict begin
  {1 index /FID ne {def} {pop pop} ifelse} forall
  /Encoding WinAnsiEncoding def
  currentdict
end
/Courier-Oblique exch definefont pop
/Times-Roman findfont
dup length dict begin
  {1 index /FID ne {def} {pop pop} ifelse} forall
  /Encoding WinAnsiEncoding def
  currentdict
end
/Times-Roman exch definefont pop
/Helvetica-BoldOblique findfont
dup length dict begin
  {1 index /FID ne {def} {pop pop} ifelse} forall
  /Encoding WinAnsiEncoding def
  currentdict
end
/Helvetica-BoldOblique exch definefont pop
/Helvetica-Bold findfont
dup length dict begin
  {1 index /FID ne {def} {pop pop} ifelse} forall
  /Encoding WinAnsiEncoding def
  currentdict
end
/Helvetica-Bold exch definefont pop
/Helvetica-Oblique findfont
dup length dict begin
  {1 index /FID ne {def} {pop pop} ifelse} forall
  /Encoding WinAnsiEncoding def
  currentdict
end
/Helvetica-Oblique exch definefont pop
/Times-BoldItalic findfont
dup length dict begin
  {1 index /FID ne {def} {pop pop} ifelse} forall
  /Encoding WinAnsiEncoding def
  currentdict
end
/Times-BoldItalic exch definefont pop
/Courier findfont
dup length dict begin
  {1 index /FID ne {def} {pop pop} ifelse} forall
  /Encoding WinAnsiEncoding def
  currentdict
end
/Courier exch definefont pop
/Times-Italic findfont
dup length dict begin
  {1 index /FID ne {def} {pop pop} ifelse} forall
  /Encoding WinAnsiEncoding def
  currentdict
end
/Times-Italic exch definefont pop
/Times-Bold findfont
dup length dict begin
  {1 index /FID ne {def} {pop pop} ifelse} forall
  /Encoding WinAnsiEncoding def
  currentdict
end
/Times-Bold exch definefont pop
%FOPEndFontReencode
%%EndProlog
%%Page: 1 1
%%PageBoundingBox: 0 0 512 288
%%BeginPageSetup
[1 0 0 -1 0 288] CT
%%EndPageSetup
GS
1 GC
N
0 0 512 288 re
f
GR
GS
1 GC
N
0 0 512 288 re
f
GR
GS
0.149 GC
1 LJ
0.5 LW
N
173 120 M
66.5 120 L
S
GR
GS
0.686 0.141 0.094 RC
N
172.927 26.703 M
172.927 120 L
169.988 30.293 L
cp
f
GR
GS
0.686 0.141 0.094 RC
N
172.927 120 M
169.988 30.293 L
169.988 120 L
cp
f
GR
GS
0.686 0.141 0.094 RC
N
169.988 30.293 M
169.988 120 L
167.305 34.02 L
cp
f
GR
GS
0.686 0.141 0.094 RC
N
169.988 120 M
167.305 34.02 L
167.305 120 L
cp
f
GR
GS
0.686 0.141 0.094 RC
N
167.305 34.02 M
167.305 120 L
164.837 37.616 L
cp
f
GR
GS
0.686 0.141 0.094 RC
N
167.305 120 M
164.837 37.616 L
164.837 120 L
cp
f
GR
GS
0.686 0.141 0.094 RC
N
164.837 37.616 M
164.837 120 L
162.552 40.733 L
cp
f
GR
GS
0.686 0.141 0.094 RC
N
164.837 120 M
162.552 40.733 L
162.552 120 L
cp
f
GR
GS
0.686 0.141 0.094 RC
N
162.552 40.733 M
162.552 120 L
159.413 43.964 L
cp
f
GR
GS
0.686 0.141 0.094 RC
N
162.552 120 M
159.413 43.964 L
159.413 120 L
cp
f
GR
GS
0.686 0.141 0.094 RC
N
159.413 43.964 M
159.413 120 L
156.565 46.295 L
cp
f
GR
GS
0.686 0.141 0.094 RC
N
159.413 120 M
156.565 46.295 L
156.565 120 L
cp
f
GR
GS
0.686 0.141 0.094 RC
N
156.565 46.295 M
156.565 120 L
153.958 48.856 L
cp
f
GR
GS
0.686 0.141 0.094 RC
N
156.565 120 M
153.958 48.856 L
153.958 120 L
cp
f
GR
GS
0.686 0.141 0.094 RC
N
153.958 48.856 M
153.958 120 L
151.554 51.194 L
cp
f
GR
GS
0.686 0.141 0.094 RC
N
153.958 120 M
151.554 51.194 L
151.554 120 L
cp
f
GR
GS
0.686 0.141 0.094 RC
N
151.554 51.194 M
151.554 120 L
148.615 53.516 L
cp
f
GR
GS
0.686 0.141 0.094 RC
N
151.554 120 M
148.615 53.516 L
148.615 120 L
cp
f
GR
GS
0.686 0.141 0.094 RC
N
148.615 53.516 M
148.615 120 L
145.932 55.086 L
cp
f
GR
GS
0.686 0.141 0.094 RC
N
148.615 120 M
145.932 55.086 L
145.932 120 L
cp
f
GR
GS
0.686 0.141 0.094 RC
N
145.932 55.086 M
145.932 120 L
143.464 56.046 L
cp
f
GR
GS
0.686 0.141 0.094 RC
N
145.932 120 M
143.464 56.046 L
143.464 120 L
cp
f
GR
GS
0.686 0.141 0.094 RC
N
143.464 56.046 M
143.464 120 L
140.633 57.147 L
cp
f
GR
GS
0.686 0.141 0.094 RC
N
143.464 120 M
140.633 57.147 L
140.633 120 L
cp
f
GR
GS
0.686 0.141 0.094 RC
N
140.633 57.147 M
140.633 120 L
138.04 58.184 L
cp
f
GR
GS
0.686 0.141 0.094 RC
N
140.633 120 M
138.04 58.184 L
138.04 120 L
cp
f
GR
GS
0.686 0.141 0.094 RC
N
138.04 58.184 M
138.04 120 L
135.649 58.658 L
cp
f
GR
GS
0.686 0.141 0.094 RC
N
138.04 120 M
135.649 58.658 L
135.649 120 L
cp
f
GR
GS
0.686 0.141 0.094 RC
N
135.649 58.658 M
135.649 120 L
133.004 57.837 L
cp
f
GR
GS
0.686 0.141 0.094 RC
N
135.649 120 M
133.004 57.837 L
133.004 120 L
cp
f
GR
GS
0.686 0.141 0.094 RC
N
133.004 57.837 M
133.004 120 L
130.181 55.002 L
cp
f
GR
GS
0.686 0.141 0.094 RC
N
133.004 120 M
130.181 55.002 L
130.181 120 L
cp
f
GR
GS
0.686 0.141 0.094 RC
N
130.181 55.002 M
130.181 120 L
127.594 48.727 L
cp
f
GR
GS
0.686 0.141 0.094 RC
N
130.181 120 M
127.594 48.727 L
127.594 120 L
cp
f
GR
GS
0.686 0.141 0.094 RC
N
127.594 48.727 M
127.594 120 L
124.882 42.835 L
cp
f
GR
GS
0.686 0.141 0.094 RC
N
127.594 120 M
124.882 42.835 L
124.882 120 L
cp
f
GR
GS
0.686 0.141 0.094 RC
N
124.882 42.835 M
124.882 120 L
122.091 42.076 L
cp
f
GR
GS
0.686 0.141 0.094 RC
N
124.882 120 M
122.091 42.076 L
122.091 120 L
cp
f
GR
GS
0.686 0.141 0.094 RC
N
122.091 42.076 M
122.091 120 L
119.531 50.307 L
cp
f
GR
GS
0.686 0.141 0.094 RC
N
122.091 120 M
119.531 50.307 L
119.531 120 L
cp
f
GR
GS
0.686 0.141 0.094 RC
N
119.531 50.307 M
119.531 120 L
116.917 61.788 L
cp
f
GR
GS
0.686 0.141 0.094 RC
N
119.531 120 M
116.917 61.788 L
116.917 120 L
cp
f
GR
GS
0.686 0.141 0.094 RC
N
116.917 61.788 M
116.917 120 L
114.046 71.826 L
cp
f
GR
GS
0.686 0.141 0.094 RC
N
116.917 120 M
114.046 71.826 L
114.046 120 L
cp
f
GR
GS
0.686 0.141 0.094 RC
N
114.046 71.826 M
114.046 120 L
111.42 74.935 L
cp
f
GR
GS
0.686 0.141 0.094 RC
N
114.046 120 M
111.42 74.935 L
111.42 120 L
cp
f
GR
GS
0.686 0.141 0.094 RC
N
111.42 74.935 M
111.42 120 L
108.807 76.089 L
cp
f
GR
GS
0.686 0.141 0.094 RC
N
111.42 120 M
108.807 76.089 L
108.807 120 L
cp
f
GR
GS
0.686 0.141 0.094 RC
N
108.807 76.089 M
108.807 120 L
106.221 75.129 L
cp
f
GR
GS
0.686 0.141 0.094 RC
N
108.807 120 M
106.221 75.129 L
106.221 120 L
cp
f
GR
GS
0.686 0.141 0.094 RC
N
106.221 75.129 M
106.221 120 L
103.508 74.947 L
cp
f
GR
GS
0.686 0.141 0.094 RC
N
106.221 120 M
103.508 74.947 L
103.508 120 L
cp
f
GR
GS
0.686 0.141 0.094 RC
N
103.508 74.947 M
103.508 120 L
100.866 76.819 L
cp
f
GR
GS
0.686 0.141 0.094 RC
N
103.508 120 M
100.866 76.819 L
100.866 120 L
cp
f
GR
GS
0.686 0.141 0.094 RC
N
100.866 76.819 M
100.866 120 L
98.158 81.696 L
cp
f
GR
GS
0.686 0.141 0.094 RC
N
100.866 120 M
98.158 81.696 L
98.158 120 L
cp
f
GR
GS
0.686 0.141 0.094 RC
N
98.158 81.696 M
98.158 120 L
95.419 88.238 L
cp
f
GR
GS
0.686 0.141 0.094 RC
N
98.158 120 M
95.419 88.238 L
95.419 120 L
cp
f
GR
GS
0.686 0.141 0.094 RC
N
95.419 88.238 M
95.419 120 L
92.788 93.342 L
cp
f
GR
GS
0.686 0.141 0.094 RC
N
95.419 120 M
92.788 93.342 L
92.788 120 L
cp
f
GR
GS
0.686 0.141 0.094 RC
N
92.788 93.342 M
92.788 120 L
90.152 96.752 L
cp
f
GR
GS
0.686 0.141 0.094 RC
N
92.788 120 M
90.152 96.752 L
90.152 120 L
cp
f
GR
GS
0.686 0.141 0.094 RC
N
90.152 96.752 M
90.152 120 L
87.434 100.036 L
cp
f
GR
GS
0.686 0.141 0.094 RC
N
90.152 120 M
87.434 100.036 L
87.434 120 L
cp
f
GR
GS
0.686 0.141 0.094 RC
N
87.434 100.036 M
87.434 120 L
84.759 103.157 L
cp
f
GR
GS
0.686 0.141 0.094 RC
N
87.434 120 M
84.759 103.157 L
84.759 120 L
cp
f
GR
GS
0.686 0.141 0.094 RC
N
84.759 103.157 M
84.759 120 L
82.054 105.565 L
cp
f
GR
GS
0.686 0.141 0.094 RC
N
84.759 120 M
82.054 105.565 L
82.054 120 L
cp
f
GR
GS
0.686 0.141 0.094 RC
N
82.054 105.565 M
82.054 120 L
79.419 107.635 L
cp
f
GR
GS
0.686 0.141 0.094 RC
N
82.054 120 M
79.419 107.635 L
79.419 120 L
cp
f
GR
GS
0.686 0.141 0.094 RC
N
79.419 107.635 M
79.419 120 L
76.717 109.992 L
cp
f
GR
GS
0.686 0.141 0.094 RC
N
79.419 120 M
76.717 109.992 L
76.717 120 L
cp
f
GR
GS
0.686 0.141 0.094 RC
N
76.717 109.992 M
76.717 120 L
74.045 111.78 L
cp
f
GR
GS
0.686 0.141 0.094 RC
N
76.717 120 M
74.045 111.78 L
74.045 120 L
cp
f
GR
GS
0.686 0.141 0.094 RC
N
74.045 111.78 M
74.045 120 L
71.414 113.847 L
cp
f
GR
GS
0.686 0.141 0.094 RC
N
74.045 120 M
71.414 113.847 L
71.414 120 L
cp
f
GR
GS
0.686 0.141 0.094 RC
N
71.414 113.847 M
71.414 120 L
68.727 116.054 L
cp
f
GR
GS
0.686 0.141 0.094 RC
N
71.414 120 M
68.727 116.054 L
68.727 120 L
cp
f
GR
GS
0.686 0.141 0.094 RC
N
66.487 117.899 M
68.727 116.054 L
68.727 120 L
66.487 118.53 L
cp
f
GR
GS
0.686 0.141 0.094 RC
N
66.487 120 M
68.727 120 L
66.487 118.53 L
cp
f
GR
GS
0.686 0.141 0.094 RC
1 LJ
0.5 LW
N
172.927 120 M
172.927 26.703 L
169.988 30.293 L
167.305 34.02 L
164.837 37.616 L
162.552 40.733 L
159.413 43.964 L
156.565 46.295 L
153.958 48.856 L
151.554 51.194 L
148.615 53.516 L
145.932 55.086 L
143.464 56.046 L
140.633 57.147 L
138.04 58.184 L
135.649 58.658 L
133.004 57.837 L
130.181 55.002 L
127.594 48.727 L
124.882 42.835 L
122.091 42.076 L
119.531 50.307 L
116.917 61.788 L
114.046 71.826 L
111.42 74.935 L
108.807 76.089 L
106.221 75.129 L
103.508 74.947 L
100.866 76.819 L
98.158 81.696 L
95.419 88.238 L
92.788 93.342 L
90.152 96.752 L
87.434 100.036 L
84.759 103.157 L
82.054 105.565 L
79.419 107.635 L
76.717 109.992 L
74.045 111.78 L
71.414 113.847 L
68.727 116.054 L
66.487 117.899 L
S
GR
GS
0.686 0.141 0.094 RC
1 LJ
0.5 LW
N
66.487 120 M
68.727 120 L
71.414 120 L
74.045 120 L
76.717 120 L
79.419 120 L
82.054 120 L
84.759 120 L
87.434 120 L
90.152 120 L
92.788 120 L
95.419 120 L
98.158 120 L
100.866 120 L
103.508 120 L
106.221 120 L
108.807 120 L
111.42 120 L
114.046 120 L
116.917 120 L
119.531 120 L
122.091 120 L
124.882 120 L
127.594 120 L
130.181 120 L
133.004 120 L
135.649 120 L
138.04 120 L
140.633 120 L
143.464 120 L
145.932 120 L
148.615 120 L
151.554 120 L
153.958 120 L
156.565 120 L
159.413 120 L
162.552 120 L
164.837 120 L
167.305 120 L
169.988 120 L
172.927 120 L
S
GR
GS
1 LJ
5 LW
N
172.927 26.703 M
169.988 30.293 L
167.305 34.02 L
164.837 37.616 L
162.552 40.733 L
159.413 43.964 L
156.565 46.295 L
153.958 48.856 L
151.554 51.194 L
148.615 53.516 L
145.932 55.086 L
143.464 56.046 L
140.633 57.147 L
138.04 58.184 L
135.649 58.658 L
133.004 57.837 L
130.181 55.002 L
127.594 48.727 L
124.882 42.835 L
122.091 42.076 L
119.531 50.307 L
116.917 61.788 L
114.046 71.826 L
111.42 74.935 L
108.807 76.089 L
106.221 75.129 L
103.508 74.947 L
100.866 76.819 L
98.158 81.696 L
95.419 88.238 L
92.788 93.342 L
90.152 96.752 L
87.434 100.036 L
84.759 103.157 L
82.054 105.565 L
79.419 107.635 L
76.717 109.992 L
74.045 111.78 L
71.414 113.847 L
68.727 116.054 L
66.487 117.899 L
S
GR
GS
1 GC
N
66.5 215 M
173 215 L
173 127 L
66.5 127 L
cp
f
GR
GS
0.149 GC
2 setlinecap
1 LJ
0.5 LW
N
173 215 M
66.5 215 L
S
GR
GS
0.149 GC
2 setlinecap
1 LJ
0.5 LW
N
172.927 215 M
172.927 213.935 L
S
GR
GS
0.149 GC
2 setlinecap
1 LJ
0.5 LW
N
130.181 215 M
130.181 213.935 L
S
GR
GS
0.149 GC
2 setlinecap
1 LJ
0.5 LW
N
100.866 215 M
100.866 213.935 L
S
GR
GS
0.149 GC
2 setlinecap
1 LJ
0.5 LW
N
79.419 215 M
79.419 213.935 L
S
GR
GS
[1 0 0 1 172.92686 219.99998] CT
0.149 GC
/Helvetica 15 F
GS
[1 0 0 1 0 0] CT
-8.5 15 moveto 
1 -1 scale
(0  ) t 
GR
GR
GS
[1 0 0 1 130.1806 219.99998] CT
0.149 GC
/Helvetica 15 F
GS
[1 0 0 1 0 0] CT
-8.5 15 moveto 
1 -1 scale
(8  ) t 
GR
GR
GS
[1 0 0 1 100.86611 219.99998] CT
0.149 GC
/Helvetica 15 F
GS
[1 0 0 1 0 0] CT
-10.5 15 moveto 
1 -1 scale
(20 ) t 
GR
GR
GS
[1 0 0 1 79.41859 219.99998] CT
0.149 GC
/Helvetica 15 F
GS
[1 0 0 1 0 0] CT
-10.5 15 moveto 
1 -1 scale
(40 ) t 
GR
GR
GS
[1 0 0 1 119.75005 239] CT
0.149 GC
/Helvetica 15 F
GS
[1 0 0 1 0 0] CT
-35.5 15 moveto 
1 -1 scale
(Frequency) t 
GR
GR
GS
[1 0 0 1 119.75005 239] CT
0.149 GC
/Helvetica 15 F
GS
[1 0 0 1 0 0] CT
-52.5 34 moveto 
1 -1 scale
([Hz, log-scaled]) t 
GR
GR
GS
0.149 GC
2 setlinecap
1 LJ
0.5 LW
N
66.5 215 M
66.5 127 L
S
GR
GS
[0 -1 1 0 61.5 170.99994] CT
0.149 GC
/Helvetica 15 F
GS
[1 0 0 1 0 0] CT
-58.5 -23 moveto 
1 -1 scale
(Power ~ variance) t 
GR
GR
GS
[0 -1 1 0 61.5 170.99994] CT
0.149 GC
/Helvetica 15 F
GS
[1 0 0 1 0 0] CT
-39.5 -4 moveto 
1 -1 scale
([log-scaled]) t 
GR
GR
GS
0.149 GC
1 LJ
0.5 LW
N
173 215 M
66.5 215 L
S
GR
GS
0.188 0.435 0.729 RC
N
172.927 131.648 M
169.988 134.855 L
167.305 138.185 L
164.837 141.398 L
162.552 144.183 L
159.413 147.069 L
156.565 149.152 L
153.958 151.439 L
151.554 153.528 L
148.615 155.603 L
145.932 157.006 L
143.464 157.863 L
140.633 158.847 L
138.04 159.774 L
135.649 160.197 L
133.004 159.464 L
130.181 156.931 L
130.181 215 L
133.004 215 L
135.649 215 L
138.04 215 L
140.633 215 L
143.464 215 L
145.932 215 L
148.615 215 L
151.554 215 L
153.958 215 L
156.565 215 L
159.413 215 L
162.552 215 L
164.837 215 L
167.305 215 L
169.988 215 L
172.927 215 L
cp
f
GR
GS
1 LJ
0.5 LW
N
172.927 215 M
172.927 131.648 L
169.988 134.855 L
167.305 138.185 L
164.837 141.398 L
162.552 144.183 L
159.413 147.069 L
156.565 149.152 L
153.958 151.439 L
151.554 153.528 L
148.615 155.603 L
145.932 157.006 L
143.464 157.863 L
140.633 158.847 L
138.04 159.774 L
135.649 160.197 L
133.004 159.464 L
130.181 156.931 L
130.181 215 L
133.004 215 L
135.649 215 L
138.04 215 L
140.633 215 L
143.464 215 L
145.932 215 L
148.615 215 L
151.554 215 L
153.958 215 L
156.565 215 L
159.413 215 L
162.552 215 L
164.837 215 L
167.305 215 L
169.988 215 L
172.927 215 L
S
GR
GS
1 LJ
5 LW
N
172.927 131.648 M
169.988 134.855 L
167.305 138.185 L
164.837 141.398 L
162.552 144.183 L
159.413 147.069 L
156.565 149.152 L
153.958 151.439 L
151.554 153.528 L
148.615 155.603 L
145.932 157.006 L
143.464 157.863 L
140.633 158.847 L
138.04 159.774 L
135.649 160.197 L
133.004 159.464 L
130.181 156.931 L
127.594 151.325 L
124.882 146.061 L
122.091 145.383 L
119.531 152.736 L
116.917 162.993 L
114.046 171.961 L
111.42 174.739 L
108.807 175.77 L
106.221 174.912 L
103.508 174.75 L
100.866 176.422 L
98.158 180.78 L
95.419 186.624 L
92.788 191.184 L
90.152 194.23 L
87.434 197.164 L
84.759 199.952 L
82.054 202.104 L
79.419 203.953 L
76.717 206.059 L
74.045 207.656 L
71.414 209.503 L
68.727 211.474 L
66.487 213.123 L
S
GR
GS
1 GC
N
227 219 M
463.5 219 L
463.5 21.5 L
227 21.5 L
cp
f
GR
GS
0.149 GC
2 setlinecap
1 LJ
0.5 LW
N
227 219 M
463.5 219 L
S
GR
GS
0.149 GC
2 setlinecap
1 LJ
0.5 LW
N
227 219 M
227 216.635 L
S
GR
GS
0.149 GC
2 setlinecap
1 LJ
0.5 LW
N
443.606 219 M
443.606 216.635 L
S
GR
GS
0.149 GC
2 setlinecap
1 LJ
0.5 LW
N
227 219 M
227 217.818 L
S
GR
GS
0.149 GC
2 setlinecap
1 LJ
0.5 LW
N
271.143 219 M
271.143 217.818 L
S
GR
GS
0.149 GC
2 setlinecap
1 LJ
0.5 LW
N
296.965 219 M
296.965 217.818 L
S
GR
GS
0.149 GC
2 setlinecap
1 LJ
0.5 LW
N
315.287 219 M
315.287 217.818 L
S
GR
GS
0.149 GC
2 setlinecap
1 LJ
0.5 LW
N
329.498 219 M
329.498 217.818 L
S
GR
GS
0.149 GC
2 setlinecap
1 LJ
0.5 LW
N
341.109 219 M
341.109 217.818 L
S
GR
GS
0.149 GC
2 setlinecap
1 LJ
0.5 LW
N
350.926 219 M
350.926 217.818 L
S
GR
GS
0.149 GC
2 setlinecap
1 LJ
0.5 LW
N
359.43 219 M
359.43 217.818 L
S
GR
GS
0.149 GC
2 setlinecap
1 LJ
0.5 LW
N
366.931 219 M
366.931 217.818 L
S
GR
GS
0.149 GC
2 setlinecap
1 LJ
0.5 LW
N
373.641 219 M
373.641 217.818 L
S
GR
GS
0.149 GC
2 setlinecap
1 LJ
0.5 LW
N
417.784 219 M
417.784 217.818 L
S
GR
GS
0.149 GC
2 setlinecap
1 LJ
0.5 LW
N
443.606 219 M
443.606 217.818 L
S
GR
GS
0.149 GC
2 setlinecap
1 LJ
0.5 LW
N
461.927 219 M
461.927 217.818 L
S
GR
GS
[1 0 0 1 199 239] CT
0.149 GC
/Helvetica 15 F
GS
[1 0 0 1 0 0] CT
0 0 moveto 
1 -1 scale
(250 Hz) t 
GR
GR
GS
[1 0 0 1 199 260] CT
0.149 GC
/Helvetica 15 F
GS
[1 0 0 1 0 0] CT
0 0 moveto 
1 -1 scale
(\(scale 1\)) t 
GR
GR
GS
[1 0 0 1 412 239] CT
0.149 GC
/Helvetica 15 F
GS
[1 0 0 1 0 0] CT
0 0 moveto 
1 -1 scale
(8 Hz) t 
GR
GR
GS
[1 0 0 1 412 260] CT
0.149 GC
/Helvetica 15 F
GS
[1 0 0 1 0 0] CT
0 0 moveto 
1 -1 scale
(\(scale 30\)) t 
GR
GR
GS
[1 0 0 1 345.25012 264] CT
0.149 GC
/Helvetica 15 F
GS
[1 0 0 1 0 0] CT
-77.5 15 moveto 
1 -1 scale
(Time scale [log-scaled]) t 
GR
GR
GS
0.149 GC
2 setlinecap
1 LJ
0.5 LW
N
463.5 219 M
463.5 21.5 L
S
GR
GS
[0 -1 1 0 468.5 120.24991] CT
0.149 GC
/Helvetica 15 F
GS
[1 0 0 1 0 0] CT
-68 15 moveto 
1 -1 scale
(Cumulative variance) t 
GR
GR
GS
[0 -1 1 0 468.5 120.24991] CT
0.149 GC
/Helvetica 15 F
GS
[1 0 0 1 0 0] CT
-67.5 34 moveto 
1 -1 scale
(\(~ similarity bounds\)) t 
GR
GR
GS
[5 5] 0 setdash
2 LJ
5 LW
N
227 33.241 M
271.143 33.241 L
296.965 33.241 L
315.287 33.241 L
329.498 33.241 L
341.109 33.241 L
350.926 33.241 L
359.43 33.241 L
366.931 33.241 L
373.641 33.241 L
379.711 33.241 L
385.252 33.241 L
390.35 33.241 L
395.069 33.241 L
399.463 33.241 L
403.573 33.241 L
407.434 33.241 L
411.074 33.241 L
414.518 33.241 L
417.784 33.241 L
420.891 33.241 L
423.854 33.241 L
426.685 33.241 L
429.395 33.241 L
431.995 33.241 L
434.493 33.241 L
436.896 33.241 L
439.212 33.241 L
441.447 33.241 L
443.606 33.241 L
445.695 33.241 L
447.716 33.241 L
449.676 33.241 L
451.577 33.241 L
453.423 33.241 L
455.218 33.241 L
456.962 33.241 L
458.661 33.241 L
460.315 33.241 L
461.927 33.241 L
463.5 33.241 L
463.528 33.241 L
S
GR
GS
1 LJ
5 LW
N
227 33.245 M
271.143 43.048 L
296.965 55.767 L
315.287 68.066 L
329.498 78.392 L
341.109 86.961 L
350.926 93.949 L
359.43 100.278 L
366.931 106.023 L
373.641 111.188 L
379.711 116.285 L
385.252 120.924 L
390.35 125.226 L
395.069 129.382 L
399.463 133.456 L
403.573 137.352 L
407.434 140.915 L
411.074 144.652 L
414.518 148.042 L
417.784 151.487 L
420.891 154.539 L
423.854 157.92 L
426.685 160.582 L
429.395 163.618 L
431.995 166.151 L
434.493 169.409 L
436.896 171.924 L
439.212 174.616 L
441.447 176.562 L
443.606 179.074 L
445.695 181.509 L
447.716 183.644 L
449.676 186.024 L
451.577 187.929 L
453.423 189.76 L
455.218 191.599 L
456.962 193.258 L
458.661 194.908 L
460.315 196.549 L
461.927 198.15 L
463.5 199.565 L
463.528 199.592 L
S
GR
%%Trailer
%%Pages: 1
%%EOF
