%!PS-Adobe-3.0 EPSF-3.0
%%Creator: (MATLAB, The Mathworks, Inc. Version 9.0.0.341360 \(R2016a\). Operating System: Mac OS X)
%%Title: /Volumes/LNDG/Projects/StateSwitch/dynamic/data/eeg/rest/B_analyses/A_MSE_CSD_multiVariant/C_figures/F2_PSDCorrelationInversion.eps
%%CreationDate: 2019-03-18T16:33:26
%%Pages: (atend)
%%BoundingBox:    41     6   704   469
%%LanguageLevel: 3
%%EndComments
%%BeginProlog
%%BeginResource: procset (Apache XML Graphics Std ProcSet) 1.2 0
%%Version: 1.2 0
%%Copyright: (Copyright 2001-2003,2010 The Apache Software Foundation. License terms: http://www.apache.org/licenses/LICENSE-2.0)
/bd{bind def}bind def
/ld{load def}bd
/GR/grestore ld
/M/moveto ld
/LJ/setlinejoin ld
/C/curveto ld
/f/fill ld
/LW/setlinewidth ld
/GC/setgray ld
/t/show ld
/N/newpath ld
/CT/concat ld
/cp/closepath ld
/S/stroke ld
/L/lineto ld
/CC/setcmykcolor ld
/A/ashow ld
/GS/gsave ld
/RC/setrgbcolor ld
/RM/rmoveto ld
/ML/setmiterlimit ld
/re {4 2 roll M
1 index 0 rlineto
0 exch rlineto
neg 0 rlineto
cp } bd
/_ctm matrix def
/_tm matrix def
/BT { _ctm currentmatrix pop matrix _tm copy pop 0 0 moveto } bd
/ET { _ctm setmatrix } bd
/iTm { _ctm setmatrix _tm concat } bd
/Tm { _tm astore pop iTm 0 0 moveto } bd
/ux 0.0 def
/uy 0.0 def
/F {
  /Tp exch def
  /Tf exch def
  Tf findfont Tp scalefont setfont
  /cf Tf def  /cs Tp def
} bd
/ULS {currentpoint /uy exch def /ux exch def} bd
/ULE {
  /Tcx currentpoint pop def
  gsave
  newpath
  cf findfont cs scalefont dup
  /FontMatrix get 0 get /Ts exch def /FontInfo get dup
  /UnderlinePosition get Ts mul /To exch def
  /UnderlineThickness get Ts mul /Tt exch def
  ux uy To add moveto  Tcx uy To add lineto
  Tt setlinewidth stroke
  grestore
} bd
/OLE {
  /Tcx currentpoint pop def
  gsave
  newpath
  cf findfont cs scalefont dup
  /FontMatrix get 0 get /Ts exch def /FontInfo get dup
  /UnderlinePosition get Ts mul /To exch def
  /UnderlineThickness get Ts mul /Tt exch def
  ux uy To add cs add moveto Tcx uy To add cs add lineto
  Tt setlinewidth stroke
  grestore
} bd
/SOE {
  /Tcx currentpoint pop def
  gsave
  newpath
  cf findfont cs scalefont dup
  /FontMatrix get 0 get /Ts exch def /FontInfo get dup
  /UnderlinePosition get Ts mul /To exch def
  /UnderlineThickness get Ts mul /Tt exch def
  ux uy To add cs 10 mul 26 idiv add moveto Tcx uy To add cs 10 mul 26 idiv add lineto
  Tt setlinewidth stroke
  grestore
} bd
/QT {
/Y22 exch store
/X22 exch store
/Y21 exch store
/X21 exch store
currentpoint
/Y21 load 2 mul add 3 div exch
/X21 load 2 mul add 3 div exch
/X21 load 2 mul /X22 load add 3 div
/Y21 load 2 mul /Y22 load add 3 div
/X22 load /Y22 load curveto
} bd
/SSPD {
dup length /d exch dict def
{
/v exch def
/k exch def
currentpagedevice k known {
/cpdv currentpagedevice k get def
v cpdv ne {
/upd false def
/nullv v type /nulltype eq def
/nullcpdv cpdv type /nulltype eq def
nullv nullcpdv or
{
/upd true def
} {
/sametype v type cpdv type eq def
sametype {
v type /arraytype eq {
/vlen v length def
/cpdvlen cpdv length def
vlen cpdvlen eq {
0 1 vlen 1 sub {
/i exch def
/obj v i get def
/cpdobj cpdv i get def
obj cpdobj ne {
/upd true def
exit
} if
} for
} {
/upd true def
} ifelse
} {
v type /dicttype eq {
v {
/dv exch def
/dk exch def
/cpddv cpdv dk get def
dv cpddv ne {
/upd true def
exit
} if
} forall
} {
/upd true def
} ifelse
} ifelse
} if
} ifelse
upd true eq {
d k v put
} if
} if
} if
} forall
d length 0 gt {
d setpagedevice
} if
} bd
%%EndResource
%%BeginResource: procset (Apache XML Graphics EPS ProcSet) 1.0 0
%%Version: 1.0 0
%%Copyright: (Copyright 2002-2003 The Apache Software Foundation. License terms: http://www.apache.org/licenses/LICENSE-2.0)
/BeginEPSF { %def
/b4_Inc_state save def         % Save state for cleanup
/dict_count countdictstack def % Count objects on dict stack
/op_count count 1 sub def      % Count objects on operand stack
userdict begin                 % Push userdict on dict stack
/showpage { } def              % Redefine showpage, { } = null proc
0 setgray 0 setlinecap         % Prepare graphics state
1 setlinewidth 0 setlinejoin
10 setmiterlimit [ ] 0 setdash newpath
/languagelevel where           % If level not equal to 1 then
{pop languagelevel             % set strokeadjust and
1 ne                           % overprint to their defaults.
{false setstrokeadjust false setoverprint
} if
} if
} bd
/EndEPSF { %def
count op_count sub {pop} repeat            % Clean up stacks
countdictstack dict_count sub {end} repeat
b4_Inc_state restore
} bd
%%EndResource
%FOPBeginFontDict
%%IncludeResource: font Courier-Bold
%%IncludeResource: font Helvetica
%%IncludeResource: font Courier-BoldOblique
%%IncludeResource: font Courier-Oblique
%%IncludeResource: font Times-Roman
%%IncludeResource: font Helvetica-BoldOblique
%%IncludeResource: font Helvetica-Bold
%%IncludeResource: font Helvetica-Oblique
%%IncludeResource: font Times-BoldItalic
%%IncludeResource: font Courier
%%IncludeResource: font Times-Italic
%%IncludeResource: font Times-Bold
%%IncludeResource: font Symbol
%%IncludeResource: font ZapfDingbats
%FOPEndFontDict
%%BeginResource: encoding WinAnsiEncoding
/WinAnsiEncoding [
/.notdef /.notdef /.notdef /.notdef /.notdef
/.notdef /.notdef /.notdef /.notdef /.notdef
/.notdef /.notdef /.notdef /.notdef /.notdef
/.notdef /.notdef /.notdef /.notdef /.notdef
/.notdef /.notdef /.notdef /.notdef /.notdef
/.notdef /.notdef /.notdef /.notdef /.notdef
/.notdef /.notdef /space /exclam /quotedbl
/numbersign /dollar /percent /ampersand /quotesingle
/parenleft /parenright /asterisk /plus /comma
/hyphen /period /slash /zero /one
/two /three /four /five /six
/seven /eight /nine /colon /semicolon
/less /equal /greater /question /at
/A /B /C /D /E
/F /G /H /I /J
/K /L /M /N /O
/P /Q /R /S /T
/U /V /W /X /Y
/Z /bracketleft /backslash /bracketright /asciicircum
/underscore /quoteleft /a /b /c
/d /e /f /g /h
/i /j /k /l /m
/n /o /p /q /r
/s /t /u /v /w
/x /y /z /braceleft /bar
/braceright /asciitilde /bullet /Euro /bullet
/quotesinglbase /florin /quotedblbase /ellipsis /dagger
/daggerdbl /circumflex /perthousand /Scaron /guilsinglleft
/OE /bullet /Zcaron /bullet /bullet
/quoteleft /quoteright /quotedblleft /quotedblright /bullet
/endash /emdash /asciitilde /trademark /scaron
/guilsinglright /oe /bullet /zcaron /Ydieresis
/space /exclamdown /cent /sterling /currency
/yen /brokenbar /section /dieresis /copyright
/ordfeminine /guillemotleft /logicalnot /sfthyphen /registered
/macron /degree /plusminus /twosuperior /threesuperior
/acute /mu /paragraph /middot /cedilla
/onesuperior /ordmasculine /guillemotright /onequarter /onehalf
/threequarters /questiondown /Agrave /Aacute /Acircumflex
/Atilde /Adieresis /Aring /AE /Ccedilla
/Egrave /Eacute /Ecircumflex /Edieresis /Igrave
/Iacute /Icircumflex /Idieresis /Eth /Ntilde
/Ograve /Oacute /Ocircumflex /Otilde /Odieresis
/multiply /Oslash /Ugrave /Uacute /Ucircumflex
/Udieresis /Yacute /Thorn /germandbls /agrave
/aacute /acircumflex /atilde /adieresis /aring
/ae /ccedilla /egrave /eacute /ecircumflex
/edieresis /igrave /iacute /icircumflex /idieresis
/eth /ntilde /ograve /oacute /ocircumflex
/otilde /odieresis /divide /oslash /ugrave
/uacute /ucircumflex /udieresis /yacute /thorn
/ydieresis
] def
%%EndResource
%FOPBeginFontReencode
/Courier-Bold findfont
dup length dict begin
  {1 index /FID ne {def} {pop pop} ifelse} forall
  /Encoding WinAnsiEncoding def
  currentdict
end
/Courier-Bold exch definefont pop
/Helvetica findfont
dup length dict begin
  {1 index /FID ne {def} {pop pop} ifelse} forall
  /Encoding WinAnsiEncoding def
  currentdict
end
/Helvetica exch definefont pop
/Courier-BoldOblique findfont
dup length dict begin
  {1 index /FID ne {def} {pop pop} ifelse} forall
  /Encoding WinAnsiEncoding def
  currentdict
end
/Courier-BoldOblique exch definefont pop
/Courier-Oblique findfont
dup length dict begin
  {1 index /FID ne {def} {pop pop} ifelse} forall
  /Encoding WinAnsiEncoding def
  currentdict
end
/Courier-Oblique exch definefont pop
/Times-Roman findfont
dup length dict begin
  {1 index /FID ne {def} {pop pop} ifelse} forall
  /Encoding WinAnsiEncoding def
  currentdict
end
/Times-Roman exch definefont pop
/Helvetica-BoldOblique findfont
dup length dict begin
  {1 index /FID ne {def} {pop pop} ifelse} forall
  /Encoding WinAnsiEncoding def
  currentdict
end
/Helvetica-BoldOblique exch definefont pop
/Helvetica-Bold findfont
dup length dict begin
  {1 index /FID ne {def} {pop pop} ifelse} forall
  /Encoding WinAnsiEncoding def
  currentdict
end
/Helvetica-Bold exch definefont pop
/Helvetica-Oblique findfont
dup length dict begin
  {1 index /FID ne {def} {pop pop} ifelse} forall
  /Encoding WinAnsiEncoding def
  currentdict
end
/Helvetica-Oblique exch definefont pop
/Times-BoldItalic findfont
dup length dict begin
  {1 index /FID ne {def} {pop pop} ifelse} forall
  /Encoding WinAnsiEncoding def
  currentdict
end
/Times-BoldItalic exch definefont pop
/Courier findfont
dup length dict begin
  {1 index /FID ne {def} {pop pop} ifelse} forall
  /Encoding WinAnsiEncoding def
  currentdict
end
/Courier exch definefont pop
/Times-Italic findfont
dup length dict begin
  {1 index /FID ne {def} {pop pop} ifelse} forall
  /Encoding WinAnsiEncoding def
  currentdict
end
/Times-Italic exch definefont pop
/Times-Bold findfont
dup length dict begin
  {1 index /FID ne {def} {pop pop} ifelse} forall
  /Encoding WinAnsiEncoding def
  currentdict
end
/Times-Bold exch definefont pop
%FOPEndFontReencode
%%EndProlog
%%Page: 1 1
%%PageBoundingBox: 0 0 768 480
%%BeginPageSetup
[1 0 0 -1 0 480] CT
%%EndPageSetup
GS
1 GC
N
0 0 768 480 re
f
GR
GS
1 GC
N
0 0 768 480 re
f
GR
GS
1 GC
N
100 427 M
695 427 L
695 36 L
100 36 L
cp
f
GR
GS
0.149 GC
2 setlinecap
1 LJ
0.5 LW
N
100 427 M
695 427 L
S
GR
GS
0.149 GC
2 setlinecap
1 LJ
0.5 LW
N
100 427 M
100 421.05 L
S
GR
GS
0.149 GC
2 setlinecap
1 LJ
0.5 LW
N
166.111 427 M
166.111 421.05 L
S
GR
GS
0.149 GC
2 setlinecap
1 LJ
0.5 LW
N
232.222 427 M
232.222 421.05 L
S
GR
GS
0.149 GC
2 setlinecap
1 LJ
0.5 LW
N
298.333 427 M
298.333 421.05 L
S
GR
GS
0.149 GC
2 setlinecap
1 LJ
0.5 LW
N
364.444 427 M
364.444 421.05 L
S
GR
GS
0.149 GC
2 setlinecap
1 LJ
0.5 LW
N
430.556 427 M
430.556 421.05 L
S
GR
GS
0.149 GC
2 setlinecap
1 LJ
0.5 LW
N
496.667 427 M
496.667 421.05 L
S
GR
GS
0.149 GC
2 setlinecap
1 LJ
0.5 LW
N
562.778 427 M
562.778 421.05 L
S
GR
GS
0.149 GC
2 setlinecap
1 LJ
0.5 LW
N
628.889 427 M
628.889 421.05 L
S
GR
GS
0.149 GC
2 setlinecap
1 LJ
0.5 LW
N
695 427 M
695 421.05 L
S
GR
GS
[1 0 0 1 100 432.60001] CT
0.149 GC
/Helvetica 18 F
GS
[1 0 0 1 0 0] CT
-5.5 18 moveto 
1 -1 scale
(0) t 
GR
GR
GS
[1 0 0 1 166.11111 432.60001] CT
0.149 GC
/Helvetica 18 F
GS
[1 0 0 1 0 0] CT
-5.5 18 moveto 
1 -1 scale
(5) t 
GR
GR
GS
[1 0 0 1 232.22223 432.60001] CT
0.149 GC
/Helvetica 18 F
GS
[1 0 0 1 0 0] CT
-10.5 18 moveto 
1 -1 scale
(10) t 
GR
GR
GS
[1 0 0 1 298.33334 432.60001] CT
0.149 GC
/Helvetica 18 F
GS
[1 0 0 1 0 0] CT
-10.5 18 moveto 
1 -1 scale
(15) t 
GR
GR
GS
[1 0 0 1 364.44446 432.60001] CT
0.149 GC
/Helvetica 18 F
GS
[1 0 0 1 0 0] CT
-10.5 18 moveto 
1 -1 scale
(20) t 
GR
GR
GS
[1 0 0 1 430.55554 432.60001] CT
0.149 GC
/Helvetica 18 F
GS
[1 0 0 1 0 0] CT
-10.5 18 moveto 
1 -1 scale
(25) t 
GR
GR
GS
[1 0 0 1 496.66666 432.60001] CT
0.149 GC
/Helvetica 18 F
GS
[1 0 0 1 0 0] CT
-10.5 18 moveto 
1 -1 scale
(30) t 
GR
GR
GS
[1 0 0 1 562.77777 432.60001] CT
0.149 GC
/Helvetica 18 F
GS
[1 0 0 1 0 0] CT
-10.5 18 moveto 
1 -1 scale
(35) t 
GR
GR
GS
[1 0 0 1 628.88892 432.60001] CT
0.149 GC
/Helvetica 18 F
GS
[1 0 0 1 0 0] CT
-10.5 18 moveto 
1 -1 scale
(40) t 
GR
GR
GS
[1 0 0 1 695 432.60001] CT
0.149 GC
/Helvetica 18 F
GS
[1 0 0 1 0 0] CT
-10.5 18 moveto 
1 -1 scale
(45) t 
GR
GR
GS
[1 0 0 1 397.50027 455.60001] CT
0.149 GC
/Helvetica 18 F
GS
[1 0 0 1 0 0] CT
-43.5 18 moveto 
1 -1 scale
(Time scale) t 
GR
GR
GS
0.149 GC
2 setlinecap
1 LJ
0.5 LW
N
100 427 M
100 36 L
S
GR
GS
0.149 GC
2 setlinecap
1 LJ
0.5 LW
N
100 427 M
105.95 427 L
S
GR
GS
0.149 GC
2 setlinecap
1 LJ
0.5 LW
N
100 371.143 M
105.95 371.143 L
S
GR
GS
0.149 GC
2 setlinecap
1 LJ
0.5 LW
N
100 315.286 M
105.95 315.286 L
S
GR
GS
0.149 GC
2 setlinecap
1 LJ
0.5 LW
N
100 259.429 M
105.95 259.429 L
S
GR
GS
0.149 GC
2 setlinecap
1 LJ
0.5 LW
N
100 203.571 M
105.95 203.571 L
S
GR
GS
0.149 GC
2 setlinecap
1 LJ
0.5 LW
N
100 147.714 M
105.95 147.714 L
S
GR
GS
0.149 GC
2 setlinecap
1 LJ
0.5 LW
N
100 91.857 M
105.95 91.857 L
S
GR
GS
0.149 GC
2 setlinecap
1 LJ
0.5 LW
N
100 36 M
105.95 36 L
S
GR
GS
[1 0 0 1 94.4 427] CT
0.149 GC
/Helvetica 18 F
GS
[1 0 0 1 0 0] CT
-33 7 moveto 
1 -1 scale
(-0.6) t 
GR
GR
GS
[1 0 0 1 94.4 371.14285] CT
0.149 GC
/Helvetica 18 F
GS
[1 0 0 1 0 0] CT
-33 7 moveto 
1 -1 scale
(-0.4) t 
GR
GR
GS
[1 0 0 1 94.4 315.28571] CT
0.149 GC
/Helvetica 18 F
GS
[1 0 0 1 0 0] CT
-33 7 moveto 
1 -1 scale
(-0.2) t 
GR
GR
GS
[1 0 0 1 94.4 259.42856] CT
0.149 GC
/Helvetica 18 F
GS
[1 0 0 1 0 0] CT
-11 7 moveto 
1 -1 scale
(0) t 
GR
GR
GS
[1 0 0 1 94.4 203.57143] CT
0.149 GC
/Helvetica 18 F
GS
[1 0 0 1 0 0] CT
-26 7 moveto 
1 -1 scale
(0.2) t 
GR
GR
GS
[1 0 0 1 94.4 147.71428] CT
0.149 GC
/Helvetica 18 F
GS
[1 0 0 1 0 0] CT
-26 7 moveto 
1 -1 scale
(0.4) t 
GR
GR
GS
[1 0 0 1 94.4 91.85714] CT
0.149 GC
/Helvetica 18 F
GS
[1 0 0 1 0 0] CT
-26 7 moveto 
1 -1 scale
(0.6) t 
GR
GR
GS
[1 0 0 1 94.4 36] CT
0.149 GC
/Helvetica 18 F
GS
[1 0 0 1 0 0] CT
-26 7 moveto 
1 -1 scale
(0.8) t 
GR
GR
GS
[0 -1 1 0 58.4 231.49982] CT
0.149 GC
/Helvetica 18 F
GS
[1 0 0 1 0 0] CT
-94 -4 moveto 
1 -1 scale
(Correlation coefficient r) t 
GR
GR
GS
[1 0 0 1 397.50037 31.04999] CT
/Helvetica-Bold 19.8 F
GS
[1 0 0 1 0 0] CT
-235 -5 moveto 
1 -1 scale
(Correlation estimates between SE and PSD slope) t 
GR
GR
GS
0 0.447 0.741 RC
1 LJ
5 LW
N
113.222 88.344 M
126.444 97.978 L
139.667 116.262 L
152.889 137.974 L
166.111 162.927 L
179.333 183.592 L
192.556 202.426 L
205.778 224.016 L
219 243.026 L
232.222 261.077 L
245.444 279.205 L
258.667 291.734 L
271.889 305.981 L
285.111 318.16 L
298.333 328.14 L
311.556 339.212 L
324.778 348.955 L
338 357.718 L
351.222 365.535 L
364.444 370.934 L
377.667 375.745 L
390.889 377.967 L
404.111 375.43 L
417.333 374.261 L
430.556 373.83 L
443.778 373.396 L
457 370.274 L
470.222 370.155 L
483.444 370.37 L
496.667 372.724 L
509.889 375.929 L
523.111 377.281 L
536.333 380.645 L
549.556 387.643 L
562.778 388.8 L
576 391.825 L
589.222 389.616 L
602.444 386.618 L
615.667 380.958 L
628.889 382.275 L
642.111 378.625 L
S
GR
GS
0.851 0.325 0.098 RC
1 LJ
5 LW
N
113.222 69.296 M
126.444 73.909 L
139.667 97.204 L
152.889 123.671 L
166.111 155.933 L
179.333 187.354 L
192.556 216.199 L
205.778 244.533 L
219 267.195 L
232.222 286.591 L
245.444 303.581 L
258.667 318.83 L
271.889 330.142 L
285.111 337.793 L
298.333 344.269 L
311.556 349.828 L
324.778 355.338 L
338 358.216 L
351.222 363.072 L
364.444 366.802 L
377.667 370.732 L
390.889 373.592 L
404.111 378.942 L
417.333 382.805 L
430.556 383.402 L
443.778 383.6 L
457 383.772 L
470.222 383.138 L
483.444 382.269 L
496.667 383.968 L
509.889 384.921 L
523.111 385.635 L
536.333 389.337 L
549.556 392.655 L
562.778 393.161 L
576 396.791 L
589.222 396.087 L
602.444 398.153 L
615.667 397.27 L
628.889 395.336 L
642.111 394.552 L
S
GR
GS
[1 0 0 1 655 58.86598] CT
/Helvetica 18 F
GS
[1 0 0 1 0 0] CT
0 7 moveto 
1 -1 scale
(YA) t 
GR
GR
GS
0 0.447 0.741 RC
1 LJ
5 LW
N
622 58.866 M
652 58.866 L
S
GR
GS
[1 0 0 1 655 81.13402] CT
/Helvetica 18 F
GS
[1 0 0 1 0 0] CT
0 7 moveto 
1 -1 scale
(OA) t 
GR
GR
GS
0.851 0.325 0.098 RC
1 LJ
5 LW
N
622 81.134 M
652 81.134 L
S
GR
%%Trailer
%%Pages: 1
%%EOF
