%!PS-Adobe-3.0 EPSF-3.0
%%Creator: (MATLAB, The Mathworks, Inc. Version 9.1.0.441655 \(R2016b\). Operating System: Mac OS X)
%%Title: /Volumes/LNDG/Projects/StateSwitch/dynamic/data/eeg/rest/B_analyses/A_MSE_CSD_multiVariant/C_figures/F_MSE_InversionVanillaBP_PSDslope.eps
%%CreationDate: 2019-04-11T19:31:46
%%Pages: (atend)
%%BoundingBox:   178     0  1632   284
%%LanguageLevel: 3
%%EndComments
%%BeginProlog
%%BeginResource: procset (Apache XML Graphics Std ProcSet) 1.2 0
%%Version: 1.2 0
%%Copyright: (Copyright 2001-2003,2010 The Apache Software Foundation. License terms: http://www.apache.org/licenses/LICENSE-2.0)
/bd{bind def}bind def
/ld{load def}bd
/GR/grestore ld
/M/moveto ld
/LJ/setlinejoin ld
/C/curveto ld
/f/fill ld
/LW/setlinewidth ld
/GC/setgray ld
/t/show ld
/N/newpath ld
/CT/concat ld
/cp/closepath ld
/S/stroke ld
/L/lineto ld
/CC/setcmykcolor ld
/A/ashow ld
/GS/gsave ld
/RC/setrgbcolor ld
/RM/rmoveto ld
/ML/setmiterlimit ld
/re {4 2 roll M
1 index 0 rlineto
0 exch rlineto
neg 0 rlineto
cp } bd
/_ctm matrix def
/_tm matrix def
/BT { _ctm currentmatrix pop matrix _tm copy pop 0 0 moveto } bd
/ET { _ctm setmatrix } bd
/iTm { _ctm setmatrix _tm concat } bd
/Tm { _tm astore pop iTm 0 0 moveto } bd
/ux 0.0 def
/uy 0.0 def
/F {
  /Tp exch def
  /Tf exch def
  Tf findfont Tp scalefont setfont
  /cf Tf def  /cs Tp def
} bd
/ULS {currentpoint /uy exch def /ux exch def} bd
/ULE {
  /Tcx currentpoint pop def
  gsave
  newpath
  cf findfont cs scalefont dup
  /FontMatrix get 0 get /Ts exch def /FontInfo get dup
  /UnderlinePosition get Ts mul /To exch def
  /UnderlineThickness get Ts mul /Tt exch def
  ux uy To add moveto  Tcx uy To add lineto
  Tt setlinewidth stroke
  grestore
} bd
/OLE {
  /Tcx currentpoint pop def
  gsave
  newpath
  cf findfont cs scalefont dup
  /FontMatrix get 0 get /Ts exch def /FontInfo get dup
  /UnderlinePosition get Ts mul /To exch def
  /UnderlineThickness get Ts mul /Tt exch def
  ux uy To add cs add moveto Tcx uy To add cs add lineto
  Tt setlinewidth stroke
  grestore
} bd
/SOE {
  /Tcx currentpoint pop def
  gsave
  newpath
  cf findfont cs scalefont dup
  /FontMatrix get 0 get /Ts exch def /FontInfo get dup
  /UnderlinePosition get Ts mul /To exch def
  /UnderlineThickness get Ts mul /Tt exch def
  ux uy To add cs 10 mul 26 idiv add moveto Tcx uy To add cs 10 mul 26 idiv add lineto
  Tt setlinewidth stroke
  grestore
} bd
/QT {
/Y22 exch store
/X22 exch store
/Y21 exch store
/X21 exch store
currentpoint
/Y21 load 2 mul add 3 div exch
/X21 load 2 mul add 3 div exch
/X21 load 2 mul /X22 load add 3 div
/Y21 load 2 mul /Y22 load add 3 div
/X22 load /Y22 load curveto
} bd
/SSPD {
dup length /d exch dict def
{
/v exch def
/k exch def
currentpagedevice k known {
/cpdv currentpagedevice k get def
v cpdv ne {
/upd false def
/nullv v type /nulltype eq def
/nullcpdv cpdv type /nulltype eq def
nullv nullcpdv or
{
/upd true def
} {
/sametype v type cpdv type eq def
sametype {
v type /arraytype eq {
/vlen v length def
/cpdvlen cpdv length def
vlen cpdvlen eq {
0 1 vlen 1 sub {
/i exch def
/obj v i get def
/cpdobj cpdv i get def
obj cpdobj ne {
/upd true def
exit
} if
} for
} {
/upd true def
} ifelse
} {
v type /dicttype eq {
v {
/dv exch def
/dk exch def
/cpddv cpdv dk get def
dv cpddv ne {
/upd true def
exit
} if
} forall
} {
/upd true def
} ifelse
} ifelse
} if
} ifelse
upd true eq {
d k v put
} if
} if
} if
} forall
d length 0 gt {
d setpagedevice
} if
} bd
/RE { % /NewFontName [NewEncodingArray] /FontName RE -
  findfont dup length dict begin
  {
    1 index /FID ne
    {def} {pop pop} ifelse
  } forall
  /Encoding exch def
  /FontName 1 index def
  currentdict definefont pop
  end
} bind def
%%EndResource
%%BeginResource: procset (Apache XML Graphics EPS ProcSet) 1.0 0
%%Version: 1.0 0
%%Copyright: (Copyright 2002-2003 The Apache Software Foundation. License terms: http://www.apache.org/licenses/LICENSE-2.0)
/BeginEPSF { %def
/b4_Inc_state save def         % Save state for cleanup
/dict_count countdictstack def % Count objects on dict stack
/op_count count 1 sub def      % Count objects on operand stack
userdict begin                 % Push userdict on dict stack
/showpage { } def              % Redefine showpage, { } = null proc
0 setgray 0 setlinecap         % Prepare graphics state
1 setlinewidth 0 setlinejoin
10 setmiterlimit [ ] 0 setdash newpath
/languagelevel where           % If level not equal to 1 then
{pop languagelevel             % set strokeadjust and
1 ne                           % overprint to their defaults.
{false setstrokeadjust false setoverprint
} if
} if
} bd
/EndEPSF { %def
count op_count sub {pop} repeat            % Clean up stacks
countdictstack dict_count sub {end} repeat
b4_Inc_state restore
} bd
%%EndResource
%FOPBeginFontDict
%%IncludeResource: font Courier-Bold
%%IncludeResource: font Helvetica
%%IncludeResource: font Courier-BoldOblique
%%IncludeResource: font Courier-Oblique
%%IncludeResource: font Times-Roman
%%IncludeResource: font Helvetica-BoldOblique
%%IncludeResource: font Helvetica-Bold
%%IncludeResource: font Helvetica-Oblique
%%IncludeResource: font Times-BoldItalic
%%IncludeResource: font Courier
%%IncludeResource: font Times-Italic
%%IncludeResource: font Times-Bold
%%IncludeResource: font Symbol
%%IncludeResource: font ZapfDingbats
%FOPEndFontDict
%%BeginResource: encoding WinAnsiEncoding
/WinAnsiEncoding [
/.notdef /.notdef /.notdef /.notdef /.notdef
/.notdef /.notdef /.notdef /.notdef /.notdef
/.notdef /.notdef /.notdef /.notdef /.notdef
/.notdef /.notdef /.notdef /.notdef /.notdef
/.notdef /.notdef /.notdef /.notdef /.notdef
/.notdef /.notdef /.notdef /.notdef /.notdef
/.notdef /.notdef /space /exclam /quotedbl
/numbersign /dollar /percent /ampersand /quotesingle
/parenleft /parenright /asterisk /plus /comma
/hyphen /period /slash /zero /one
/two /three /four /five /six
/seven /eight /nine /colon /semicolon
/less /equal /greater /question /at
/A /B /C /D /E
/F /G /H /I /J
/K /L /M /N /O
/P /Q /R /S /T
/U /V /W /X /Y
/Z /bracketleft /backslash /bracketright /asciicircum
/underscore /quoteleft /a /b /c
/d /e /f /g /h
/i /j /k /l /m
/n /o /p /q /r
/s /t /u /v /w
/x /y /z /braceleft /bar
/braceright /asciitilde /bullet /Euro /bullet
/quotesinglbase /florin /quotedblbase /ellipsis /dagger
/daggerdbl /circumflex /perthousand /Scaron /guilsinglleft
/OE /bullet /Zcaron /bullet /bullet
/quoteleft /quoteright /quotedblleft /quotedblright /bullet
/endash /emdash /asciitilde /trademark /scaron
/guilsinglright /oe /bullet /zcaron /Ydieresis
/space /exclamdown /cent /sterling /currency
/yen /brokenbar /section /dieresis /copyright
/ordfeminine /guillemotleft /logicalnot /sfthyphen /registered
/macron /degree /plusminus /twosuperior /threesuperior
/acute /mu /paragraph /middot /cedilla
/onesuperior /ordmasculine /guillemotright /onequarter /onehalf
/threequarters /questiondown /Agrave /Aacute /Acircumflex
/Atilde /Adieresis /Aring /AE /Ccedilla
/Egrave /Eacute /Ecircumflex /Edieresis /Igrave
/Iacute /Icircumflex /Idieresis /Eth /Ntilde
/Ograve /Oacute /Ocircumflex /Otilde /Odieresis
/multiply /Oslash /Ugrave /Uacute /Ucircumflex
/Udieresis /Yacute /Thorn /germandbls /agrave
/aacute /acircumflex /atilde /adieresis /aring
/ae /ccedilla /egrave /eacute /ecircumflex
/edieresis /igrave /iacute /icircumflex /idieresis
/eth /ntilde /ograve /oacute /ocircumflex
/otilde /odieresis /divide /oslash /ugrave
/uacute /ucircumflex /udieresis /yacute /thorn
/ydieresis
] def
%%EndResource
%FOPBeginFontReencode
/Courier-Bold findfont
dup length dict begin
  {1 index /FID ne {def} {pop pop} ifelse} forall
  /Encoding WinAnsiEncoding def
  currentdict
end
/Courier-Bold exch definefont pop
/Helvetica findfont
dup length dict begin
  {1 index /FID ne {def} {pop pop} ifelse} forall
  /Encoding WinAnsiEncoding def
  currentdict
end
/Helvetica exch definefont pop
/Courier-BoldOblique findfont
dup length dict begin
  {1 index /FID ne {def} {pop pop} ifelse} forall
  /Encoding WinAnsiEncoding def
  currentdict
end
/Courier-BoldOblique exch definefont pop
/Courier-Oblique findfont
dup length dict begin
  {1 index /FID ne {def} {pop pop} ifelse} forall
  /Encoding WinAnsiEncoding def
  currentdict
end
/Courier-Oblique exch definefont pop
/Times-Roman findfont
dup length dict begin
  {1 index /FID ne {def} {pop pop} ifelse} forall
  /Encoding WinAnsiEncoding def
  currentdict
end
/Times-Roman exch definefont pop
/Helvetica-BoldOblique findfont
dup length dict begin
  {1 index /FID ne {def} {pop pop} ifelse} forall
  /Encoding WinAnsiEncoding def
  currentdict
end
/Helvetica-BoldOblique exch definefont pop
/Helvetica-Bold findfont
dup length dict begin
  {1 index /FID ne {def} {pop pop} ifelse} forall
  /Encoding WinAnsiEncoding def
  currentdict
end
/Helvetica-Bold exch definefont pop
/Helvetica-Oblique findfont
dup length dict begin
  {1 index /FID ne {def} {pop pop} ifelse} forall
  /Encoding WinAnsiEncoding def
  currentdict
end
/Helvetica-Oblique exch definefont pop
/Times-BoldItalic findfont
dup length dict begin
  {1 index /FID ne {def} {pop pop} ifelse} forall
  /Encoding WinAnsiEncoding def
  currentdict
end
/Times-BoldItalic exch definefont pop
/Courier findfont
dup length dict begin
  {1 index /FID ne {def} {pop pop} ifelse} forall
  /Encoding WinAnsiEncoding def
  currentdict
end
/Courier exch definefont pop
/Times-Italic findfont
dup length dict begin
  {1 index /FID ne {def} {pop pop} ifelse} forall
  /Encoding WinAnsiEncoding def
  currentdict
end
/Times-Italic exch definefont pop
/Times-Bold findfont
dup length dict begin
  {1 index /FID ne {def} {pop pop} ifelse} forall
  /Encoding WinAnsiEncoding def
  currentdict
end
/Times-Bold exch definefont pop
%FOPEndFontReencode
%%EndProlog
%%Page: 1 1
%%PageBoundingBox: 0 0 1792 288
%%BeginPageSetup
[1 0 0 -1 0 288] CT
%%EndPageSetup
GS
1 GC
N
0 0 1792 288 re
f
GR
GS
1 GC
N
0 0 1792 288 re
f
GR
GS
1 GC
N
233 249 M
513.5 249 L
513.5 38.5 L
233 38.5 L
cp
f
GR
GS
0.149 GC
2 setlinecap
1 LJ
0.5 LW
N
233 249 M
513.5 249 L
S
GR
GS
0.149 GC
2 setlinecap
1 LJ
0.5 LW
N
233 249 M
233 246.195 L
S
GR
GS
0.149 GC
2 setlinecap
1 LJ
0.5 LW
N
303.125 249 M
303.125 246.195 L
S
GR
GS
0.149 GC
2 setlinecap
1 LJ
0.5 LW
N
373.25 249 M
373.25 246.195 L
S
GR
GS
0.149 GC
2 setlinecap
1 LJ
0.5 LW
N
443.375 249 M
443.375 246.195 L
S
GR
GS
0.149 GC
2 setlinecap
1 LJ
0.5 LW
N
513.5 249 M
513.5 246.195 L
S
GR
GS
[1 0 0 1 233 253.8] CT
0.149 GC
/Helvetica 14 F
GS
[1 0 0 1 0 0] CT
-4 14 moveto 
1 -1 scale
(0) t 
GR
GR
GS
[1 0 0 1 303.125 253.8] CT
0.149 GC
/Helvetica 14 F
GS
[1 0 0 1 0 0] CT
-10 14 moveto 
1 -1 scale
(0.2) t 
GR
GR
GS
[1 0 0 1 373.25 253.8] CT
0.149 GC
/Helvetica 14 F
GS
[1 0 0 1 0 0] CT
-10 14 moveto 
1 -1 scale
(0.4) t 
GR
GR
GS
[1 0 0 1 443.375 253.8] CT
0.149 GC
/Helvetica 14 F
GS
[1 0 0 1 0 0] CT
-10 14 moveto 
1 -1 scale
(0.6) t 
GR
GR
GS
[1 0 0 1 513.5 253.8] CT
0.149 GC
/Helvetica 14 F
GS
[1 0 0 1 0 0] CT
-10 14 moveto 
1 -1 scale
(0.8) t 
GR
GR
GS
[1 0 0 1 373.25015 271.29999] CT
0.149 GC
/Helvetica 14 F
GS
[1 0 0 1 0 0] CT
-64.5 14 moveto 
1 -1 scale
(Vanilla MPE, Scale 1) t 
GR
GR
GS
0.149 GC
2 setlinecap
1 LJ
0.5 LW
N
233 249 M
233 38.5 L
S
GR
GS
0.149 GC
2 setlinecap
1 LJ
0.5 LW
N
233 249 M
235.805 249 L
S
GR
GS
0.149 GC
2 setlinecap
1 LJ
0.5 LW
N
233 206.9 M
235.805 206.9 L
S
GR
GS
0.149 GC
2 setlinecap
1 LJ
0.5 LW
N
233 164.8 M
235.805 164.8 L
S
GR
GS
0.149 GC
2 setlinecap
1 LJ
0.5 LW
N
233 122.7 M
235.805 122.7 L
S
GR
GS
0.149 GC
2 setlinecap
1 LJ
0.5 LW
N
233 80.6 M
235.805 80.6 L
S
GR
GS
0.149 GC
2 setlinecap
1 LJ
0.5 LW
N
233 38.5 M
235.805 38.5 L
S
GR
GS
[1 0 0 1 228.2 249] CT
0.149 GC
/Helvetica 14 F
GS
[1 0 0 1 0 0] CT
-33 5.5 moveto 
1 -1 scale
(-0.04) t 
GR
GR
GS
[1 0 0 1 228.2 206.89999] CT
0.149 GC
/Helvetica 14 F
GS
[1 0 0 1 0 0] CT
-33 5.5 moveto 
1 -1 scale
(-0.03) t 
GR
GR
GS
[1 0 0 1 228.2 164.8] CT
0.149 GC
/Helvetica 14 F
GS
[1 0 0 1 0 0] CT
-33 5.5 moveto 
1 -1 scale
(-0.02) t 
GR
GR
GS
[1 0 0 1 228.2 122.7] CT
0.149 GC
/Helvetica 14 F
GS
[1 0 0 1 0 0] CT
-33 5.5 moveto 
1 -1 scale
(-0.01) t 
GR
GR
GS
[1 0 0 1 228.2 80.6] CT
0.149 GC
/Helvetica 14 F
GS
[1 0 0 1 0 0] CT
-8 5.5 moveto 
1 -1 scale
(0) t 
GR
GR
GS
[1 0 0 1 228.2 38.5] CT
0.149 GC
/Helvetica 14 F
GS
[1 0 0 1 0 0] CT
-28 5.5 moveto 
1 -1 scale
(0.01) t 
GR
GR
GS
[0 -1 1 0 192.2 143.74989] CT
0.149 GC
/Helvetica 14 F
GS
[1 0 0 1 0 0] CT
-108 -3 moveto 
1 -1 scale
(PSD Slope 2-64 Hz \(excl. 7-13 Hz\)) t 
GR
GR
GS
[1 0 0 1 373.25037 36.75] CT
/Helvetica-Bold 14 F
GS
[1 0 0 1 0 0] CT
-77.5 -22 moveto 
1 -1 scale
(Fast scale Vanilla MPE ) t 
GR
GR
GS
[1 0 0 1 373.25037 36.75] CT
/Helvetica-Bold 14 F
GS
[1 0 0 1 0 0] CT
-101.5 -4 moveto 
1 -1 scale
(positively relates to PSD slope) t 
GR
GR
GS
[1 0 0 1 368.80298 164.41331] CT
N
2.5 -0.5 M
2.5 -2.157 1.157 -3.5 -0.5 -3.5 C
-2.157 -3.5 -3.5 -2.157 -3.5 -0.5 C
-3.5 1.157 -2.157 2.5 -0.5 2.5 C
1.157 2.5 2.5 1.157 2.5 -0.5 C
f
GR
GS
[1 0 0 1 393.05789 169.08609] CT
N
/f-2139806394{2.5 -0.5 M
2.5 -2.157 1.157 -3.5 -0.5 -3.5 C
-2.157 -3.5 -3.5 -2.157 -3.5 -0.5 C
-3.5 1.157 -2.157 2.5 -0.5 2.5 C
1.157 2.5 2.5 1.157 2.5 -0.5 C}def
f-2139806394
f
GR
GS
[1 0 0 1 365.76865 171.95862] CT
N
f-2139806394
f
GR
GS
[1 0 0 1 393.54956 134.76733] CT
N
f-2139806394
f
GR
GS
[1 0 0 1 395.10934 169.90764] CT
N
f-2139806394
f
GR
GS
[1 0 0 1 284.6933 204.53696] CT
N
f-2139806394
f
GR
GS
[1 0 0 1 420.38821 160.72957] CT
N
f-2139806394
f
GR
GS
[1 0 0 1 409.8248 167.88373] CT
N
f-2139806394
f
GR
GS
[1 0 0 1 445.16098 126.75419] CT
N
f-2139806394
f
GR
GS
[1 0 0 1 354.05685 200.92722] CT
N
f-2139806394
f
GR
GS
[1 0 0 1 331.84521 244.69359] CT
N
f-2139806394
f
GR
GS
[1 0 0 1 379.30652 179.32784] CT
N
f-2139806394
f
GR
GS
[1 0 0 1 294.36066 198.46721] CT
N
f-2139806394
f
GR
GS
[1 0 0 1 367.85147 208.75307] CT
N
f-2139806394
f
GR
GS
[1 0 0 1 371.56689 177.39743] CT
N
f-2139806394
f
GR
GS
[1 0 0 1 360.81326 202.427] CT
N
f-2139806394
f
GR
GS
[1 0 0 1 340.96524 207.0578] CT
N
f-2139806394
f
GR
GS
[1 0 0 1 360.42377 193.23126] CT
N
f-2139806394
f
GR
GS
[1 0 0 1 336.22461 206.27457] CT
N
f-2139806394
f
GR
GS
[1 0 0 1 379.75092 173.79263] CT
N
f-2139806394
f
GR
GS
[1 0 0 1 387.60229 171.11208] CT
N
f-2139806394
f
GR
GS
[1 0 0 1 379.54849 192.73486] CT
N
f-2139806394
f
GR
GS
[1 0 0 1 408.02026 140.0233] CT
N
f-2139806394
f
GR
GS
[1 0 0 1 429.97586 102.99554] CT
N
f-2139806394
f
GR
GS
[1 0 0 1 376.04507 182.80055] CT
N
f-2139806394
f
GR
GS
[1 0 0 1 348.13199 195.20813] CT
N
f-2139806394
f
GR
GS
[1 0 0 1 274.49487 218.05624] CT
N
f-2139806394
f
GR
GS
[1 0 0 1 301.19568 157.50539] CT
N
f-2139806394
f
GR
GS
[1 0 0 1 390.34885 176.19901] CT
N
f-2139806394
f
GR
GS
[1 0 0 1 391.99243 169.02016] CT
N
f-2139806394
f
GR
GS
[1 0 0 1 354.08841 199.74835] CT
N
f-2139806394
f
GR
GS
[1 0 0 1 420.74985 147.44702] CT
N
f-2139806394
f
GR
GS
[1 0 0 1 439.70071 144.14041] CT
N
f-2139806394
f
GR
GS
[1 0 0 1 367.53006 204.91736] CT
N
f-2139806394
f
GR
GS
[1 0 0 1 344.61557 194.79735] CT
N
f-2139806394
f
GR
GS
[1 0 0 1 347.31848 205.9333] CT
N
f-2139806394
f
GR
GS
[1 0 0 1 374.86313 178.14925] CT
N
f-2139806394
f
GR
GS
[1 0 0 1 408.98572 165.75972] CT
N
f-2139806394
f
GR
GS
[1 0 0 1 351.26944 197.05481] CT
N
f-2139806394
f
GR
GS
[1 0 0 1 352.80643 202.10971] CT
N
f-2139806394
f
GR
GS
[1 0 0 1 431.36429 126.297] CT
N
f-2139806394
f
GR
GS
[1 0 0 1 403.92572 171.44368] CT
N
f-2139806394
f
GR
GS
[1 0 0 1 404.49927 146.88968] CT
N
f-2139806394
f
GR
GS
[1 0 0 1 413.99078 165.67331] CT
N
f-2139806394
f
GR
GS
[1 0 0 1 400.99771 174.53412] CT
N
f-2139806394
f
GR
GS
[1 0 0 1 379.78128 187.4095] CT
N
f-2139806394
f
GR
GS
[1 0 0 1 430.50793 114.34064] CT
N
f-2139806394
f
GR
GS
0.749 GC
1 LJ
0.5 LW
N
268.063 236.122 M
478.438 119.788 L
S
GR
GS
[1 0 0 1 430.04254 132.89844] CT
1 0 0 RC
N
f-2139806394
f
GR
GS
[1 0 0 1 344.92871 116.54124] CT
1 0 0 RC
N
f-2139806394
f
GR
GS
[1 0 0 1 401.17413 163.01041] CT
1 0 0 RC
N
f-2139806394
f
GR
GS
[1 0 0 1 397.89581 117.67418] CT
1 0 0 RC
N
f-2139806394
f
GR
GS
[1 0 0 1 446.66998 101.29524] CT
1 0 0 RC
N
f-2139806394
f
GR
GS
[1 0 0 1 420.51514 122.7348] CT
1 0 0 RC
N
f-2139806394
f
GR
GS
[1 0 0 1 474.54498 79.89095] CT
1 0 0 RC
N
f-2139806394
f
GR
GS
[1 0 0 1 365.7981 186.5607] CT
1 0 0 RC
N
f-2139806394
f
GR
GS
[1 0 0 1 423.08371 124.34747] CT
1 0 0 RC
N
f-2139806394
f
GR
GS
[1 0 0 1 387.95453 184.59541] CT
1 0 0 RC
N
f-2139806394
f
GR
GS
[1 0 0 1 433.22696 118.44655] CT
1 0 0 RC
N
f-2139806394
f
GR
GS
[1 0 0 1 380.05438 163.78853] CT
1 0 0 RC
N
f-2139806394
f
GR
GS
[1 0 0 1 348.83807 179.33495] CT
1 0 0 RC
N
f-2139806394
f
GR
GS
[1 0 0 1 374.12177 158.74075] CT
1 0 0 RC
N
f-2139806394
f
GR
GS
[1 0 0 1 452.10892 76.62772] CT
1 0 0 RC
N
f-2139806394
f
GR
GS
[1 0 0 1 395.35989 152.14267] CT
1 0 0 RC
N
f-2139806394
f
GR
GS
[1 0 0 1 369.89697 166.12086] CT
1 0 0 RC
N
f-2139806394
f
GR
GS
[1 0 0 1 409.09363 144.99484] CT
1 0 0 RC
N
f-2139806394
f
GR
GS
[1 0 0 1 400.57071 113.56133] CT
1 0 0 RC
N
f-2139806394
f
GR
GS
[1 0 0 1 399.828 147.17578] CT
1 0 0 RC
N
f-2139806394
f
GR
GS
[1 0 0 1 351.81381 200.82639] CT
1 0 0 RC
N
f-2139806394
f
GR
GS
[1 0 0 1 383.94019 159.29385] CT
1 0 0 RC
N
f-2139806394
f
GR
GS
[1 0 0 1 410.1293 127.56641] CT
1 0 0 RC
N
f-2139806394
f
GR
GS
[1 0 0 1 440.00391 131.42163] CT
1 0 0 RC
N
f-2139806394
f
GR
GS
[1 0 0 1 422.34943 152.09172] CT
1 0 0 RC
N
f-2139806394
f
GR
GS
[1 0 0 1 420.93762 167.76389] CT
1 0 0 RC
N
f-2139806394
f
GR
GS
[1 0 0 1 440.63333 151.28444] CT
1 0 0 RC
N
f-2139806394
f
GR
GS
[1 0 0 1 390.32657 171.22058] CT
1 0 0 RC
N
f-2139806394
f
GR
GS
[1 0 0 1 459.34784 136.83324] CT
1 0 0 RC
N
f-2139806394
f
GR
GS
[1 0 0 1 419.10834 134.22104] CT
1 0 0 RC
N
f-2139806394
f
GR
GS
[1 0 0 1 439.59915 65.44604] CT
1 0 0 RC
N
f-2139806394
f
GR
GS
[1 0 0 1 453.02121 93.33976] CT
1 0 0 RC
N
f-2139806394
f
GR
GS
[1 0 0 1 460.84756 98.41003] CT
1 0 0 RC
N
f-2139806394
f
GR
GS
[1 0 0 1 462.11331 80.31091] CT
1 0 0 RC
N
f-2139806394
f
GR
GS
[1 0 0 1 460.39636 102.41992] CT
1 0 0 RC
N
f-2139806394
f
GR
GS
[1 0 0 1 465.43268 76.51277] CT
1 0 0 RC
N
f-2139806394
f
GR
GS
[1 0 0 1 419.82538 127.99242] CT
1 0 0 RC
N
f-2139806394
f
GR
GS
[1 0 0 1 471.06488 103.3736] CT
1 0 0 RC
N
f-2139806394
f
GR
GS
[1 0 0 1 419.46417 162.61943] CT
1 0 0 RC
N
f-2139806394
f
GR
GS
[1 0 0 1 338.93585 207.66707] CT
1 0 0 RC
N
f-2139806394
f
GR
GS
[1 0 0 1 421.75037 137.19482] CT
1 0 0 RC
N
f-2139806394
f
GR
GS
[1 0 0 1 465.78961 63.31655] CT
1 0 0 RC
N
f-2139806394
f
GR
GS
[1 0 0 1 344.16751 165.43094] CT
1 0 0 RC
N
f-2139806394
f
GR
GS
[1 0 0 1 387.29901 184.70819] CT
1 0 0 RC
N
f-2139806394
f
GR
GS
[1 0 0 1 465.79007 101.6921] CT
1 0 0 RC
N
f-2139806394
f
GR
GS
[1 0 0 1 454.207 124.03893] CT
1 0 0 RC
N
f-2139806394
f
GR
GS
[1 0 0 1 344.25876 193.09755] CT
1 0 0 RC
N
f-2139806394
f
GR
GS
[1 0 0 1 428.75723 140.35048] CT
1 0 0 RC
N
f-2139806394
f
GR
GS
[1 0 0 1 437.34866 102.12888] CT
1 0 0 RC
N
f-2139806394
f
GR
GS
[1 0 0 1 414.69455 161.70512] CT
1 0 0 RC
N
f-2139806394
f
GR
GS
[1 0 0 1 368.46176 167.83781] CT
1 0 0 RC
N
f-2139806394
f
GR
GS
[1 0 0 1 454.45621 100.47961] CT
1 0 0 RC
N
f-2139806394
f
GR
GS
0.749 GC
1 LJ
0.5 LW
N
268.063 246.205 M
513.5 61.001 L
S
GR
GS
0.749 GC
1 LJ
0.5 LW
N
268.063 236.122 M
513.5 100.399 L
S
GR
GS
[1 0 0 1 280 58.75] CT
/Helvetica 14 F
GS
[1 0 0 1 0 0] CT
0 5.5 moveto 
1 -1 scale
(Younger Adults: r=0.76) t 
GR
GR
GS
[1 0 0 1 262 58.75] CT
N
f-2139806394
f
GR
GS
[1 0 0 1 280 75.75] CT
/Helvetica 14 F
GS
[1 0 0 1 0 0] CT
0 5.5 moveto 
1 -1 scale
(Older Adults: r=0.8) t 
GR
GR
GS
[1 0 0 1 262 75.75] CT
1 0 0 RC
N
f-2139806394
f
GR
GS
1 GC
N
/f777440852{602.5 249 M
883 249 L
883 38.5 L
602.5 38.5 L
cp}def
f777440852
f
GR
GS
0.149 GC
2 setlinecap
1 LJ
0.5 LW
N
602.5 249 M
883 249 L
S
GR
GS
0.149 GC
2 setlinecap
1 LJ
0.5 LW
N
602.5 249 M
602.5 246.195 L
S
GR
GS
0.149 GC
2 setlinecap
1 LJ
0.5 LW
N
672.625 249 M
672.625 246.195 L
S
GR
GS
0.149 GC
2 setlinecap
1 LJ
0.5 LW
N
742.75 249 M
742.75 246.195 L
S
GR
GS
0.149 GC
2 setlinecap
1 LJ
0.5 LW
N
812.875 249 M
812.875 246.195 L
S
GR
GS
0.149 GC
2 setlinecap
1 LJ
0.5 LW
N
883 249 M
883 246.195 L
S
GR
GS
[1 0 0 1 602.5 253.8] CT
0.149 GC
/Helvetica 14 F
GS
[1 0 0 1 0 0] CT
-10 14 moveto 
1 -1 scale
(0.1) t 
GR
GR
GS
[1 0 0 1 672.625 253.8] CT
0.149 GC
/Helvetica 14 F
GS
[1 0 0 1 0 0] CT
-10 14 moveto 
1 -1 scale
(0.2) t 
GR
GR
GS
[1 0 0 1 742.75 253.8] CT
0.149 GC
/Helvetica 14 F
GS
[1 0 0 1 0 0] CT
-10 14 moveto 
1 -1 scale
(0.3) t 
GR
GR
GS
[1 0 0 1 812.875 253.8] CT
0.149 GC
/Helvetica 14 F
GS
[1 0 0 1 0 0] CT
-10 14 moveto 
1 -1 scale
(0.4) t 
GR
GR
GS
[1 0 0 1 883 253.8] CT
0.149 GC
/Helvetica 14 F
GS
[1 0 0 1 0 0] CT
-10 14 moveto 
1 -1 scale
(0.5) t 
GR
GR
GS
[1 0 0 1 742.75012 271.29999] CT
0.149 GC
/Helvetica 14 F
GS
[1 0 0 1 0 0] CT
-75.5 14 moveto 
1 -1 scale
(Bandpass MPE, Scale 1) t 
GR
GR
GS
0.149 GC
2 setlinecap
1 LJ
0.5 LW
N
602.5 249 M
602.5 38.5 L
S
GR
GS
0.149 GC
2 setlinecap
1 LJ
0.5 LW
N
602.5 249 M
605.305 249 L
S
GR
GS
0.149 GC
2 setlinecap
1 LJ
0.5 LW
N
602.5 206.9 M
605.305 206.9 L
S
GR
GS
0.149 GC
2 setlinecap
1 LJ
0.5 LW
N
602.5 164.8 M
605.305 164.8 L
S
GR
GS
0.149 GC
2 setlinecap
1 LJ
0.5 LW
N
602.5 122.7 M
605.305 122.7 L
S
GR
GS
0.149 GC
2 setlinecap
1 LJ
0.5 LW
N
602.5 80.6 M
605.305 80.6 L
S
GR
GS
0.149 GC
2 setlinecap
1 LJ
0.5 LW
N
602.5 38.5 M
605.305 38.5 L
S
GR
GS
[1 0 0 1 597.70001 249] CT
0.149 GC
/Helvetica 14 F
GS
[1 0 0 1 0 0] CT
-33 5.5 moveto 
1 -1 scale
(-0.04) t 
GR
GR
GS
[1 0 0 1 597.70001 206.89999] CT
0.149 GC
/Helvetica 14 F
GS
[1 0 0 1 0 0] CT
-33 5.5 moveto 
1 -1 scale
(-0.03) t 
GR
GR
GS
[1 0 0 1 597.70001 164.8] CT
0.149 GC
/Helvetica 14 F
GS
[1 0 0 1 0 0] CT
-33 5.5 moveto 
1 -1 scale
(-0.02) t 
GR
GR
GS
[1 0 0 1 597.70001 122.7] CT
0.149 GC
/Helvetica 14 F
GS
[1 0 0 1 0 0] CT
-33 5.5 moveto 
1 -1 scale
(-0.01) t 
GR
GR
GS
[1 0 0 1 597.70001 80.6] CT
0.149 GC
/Helvetica 14 F
GS
[1 0 0 1 0 0] CT
-8 5.5 moveto 
1 -1 scale
(0) t 
GR
GR
GS
[1 0 0 1 597.70001 38.5] CT
0.149 GC
/Helvetica 14 F
GS
[1 0 0 1 0 0] CT
-28 5.5 moveto 
1 -1 scale
(0.01) t 
GR
GR
GS
[0 -1 1 0 561.70001 143.74989] CT
0.149 GC
/Helvetica 14 F
GS
[1 0 0 1 0 0] CT
-108 -3 moveto 
1 -1 scale
(PSD Slope 2-64 Hz \(excl. 7-13 Hz\)) t 
GR
GR
GS
[1 0 0 1 742.75073 36.75] CT
/Helvetica-Bold 14 F
GS
[1 0 0 1 0 0] CT
-89 -22 moveto 
1 -1 scale
(Fast scale Bandpass MPE ) t 
GR
GR
GS
[1 0 0 1 742.75073 36.75] CT
/Helvetica-Bold 14 F
GS
[1 0 0 1 0 0] CT
-104 -4 moveto 
1 -1 scale
(negatively relates to PSD slope) t 
GR
GR
GS
[1 0 0 1 775.82501 164.41331] CT
N
f-2139806394
f
GR
GS
[1 0 0 1 780.41449 169.08609] CT
N
f-2139806394
f
GR
GS
[1 0 0 1 754.41962 171.95862] CT
N
f-2139806394
f
GR
GS
[1 0 0 1 781.39789 134.76733] CT
N
f-2139806394
f
GR
GS
[1 0 0 1 776.4162 169.90764] CT
N
f-2139806394
f
GR
GS
[1 0 0 1 794.59924 204.53696] CT
N
f-2139806394
f
GR
GS
[1 0 0 1 786.33179 160.72957] CT
N
f-2139806394
f
GR
GS
[1 0 0 1 788.67004 167.88373] CT
N
f-2139806394
f
GR
GS
[1 0 0 1 788.95392 126.75419] CT
N
f-2139806394
f
GR
GS
[1 0 0 1 793.0672 200.92722] CT
N
f-2139806394
f
GR
GS
[1 0 0 1 804.5954 244.69359] CT
N
f-2139806394
f
GR
GS
[1 0 0 1 678.66248 179.32784] CT
N
f-2139806394
f
GR
GS
[1 0 0 1 771.75385 198.46721] CT
N
f-2139806394
f
GR
GS
[1 0 0 1 799.64392 208.75307] CT
N
f-2139806394
f
GR
GS
[1 0 0 1 789.87396 177.39743] CT
N
f-2139806394
f
GR
GS
[1 0 0 1 794.25641 202.427] CT
N
f-2139806394
f
GR
GS
[1 0 0 1 790.54877 207.0578] CT
N
f-2139806394
f
GR
GS
[1 0 0 1 792.15228 193.23126] CT
N
f-2139806394
f
GR
GS
[1 0 0 1 776.13928 206.27457] CT
N
f-2139806394
f
GR
GS
[1 0 0 1 749.93152 173.79263] CT
N
f-2139806394
f
GR
GS
[1 0 0 1 786.64398 171.11208] CT
N
f-2139806394
f
GR
GS
[1 0 0 1 801.29462 192.73486] CT
N
f-2139806394
f
GR
GS
[1 0 0 1 778.47314 140.0233] CT
N
f-2139806394
f
GR
GS
[1 0 0 1 739.50073 102.99554] CT
N
f-2139806394
f
GR
GS
[1 0 0 1 786.90082 182.80055] CT
N
f-2139806394
f
GR
GS
[1 0 0 1 776.61694 195.20813] CT
N
f-2139806394
f
GR
GS
[1 0 0 1 752.49756 218.05624] CT
N
f-2139806394
f
GR
GS
[1 0 0 1 662.22748 157.50539] CT
N
f-2139806394
f
GR
GS
[1 0 0 1 772.0271 176.19901] CT
N
f-2139806394
f
GR
GS
[1 0 0 1 763.39465 169.02016] CT
N
f-2139806394
f
GR
GS
[1 0 0 1 760.03351 199.74835] CT
N
f-2139806394
f
GR
GS
[1 0 0 1 780.95203 147.44702] CT
N
f-2139806394
f
GR
GS
[1 0 0 1 792.84943 144.14041] CT
N
f-2139806394
f
GR
GS
[1 0 0 1 799.72192 204.91736] CT
N
f-2139806394
f
GR
GS
[1 0 0 1 793.17615 194.79735] CT
N
f-2139806394
f
GR
GS
[1 0 0 1 758.84998 205.9333] CT
N
f-2139806394
f
GR
GS
[1 0 0 1 764.80908 178.14925] CT
N
f-2139806394
f
GR
GS
[1 0 0 1 800.00232 165.75972] CT
N
f-2139806394
f
GR
GS
[1 0 0 1 772.75842 197.05481] CT
N
f-2139806394
f
GR
GS
[1 0 0 1 781.05536 202.10971] CT
N
f-2139806394
f
GR
GS
[1 0 0 1 784.8504 126.297] CT
N
f-2139806394
f
GR
GS
[1 0 0 1 796.95654 171.44368] CT
N
f-2139806394
f
GR
GS
[1 0 0 1 793.81854 146.88968] CT
N
f-2139806394
f
GR
GS
[1 0 0 1 770.15747 165.67331] CT
N
f-2139806394
f
GR
GS
[1 0 0 1 792.58563 174.53412] CT
N
f-2139806394
f
GR
GS
[1 0 0 1 781.66394 187.4095] CT
N
f-2139806394
f
GR
GS
[1 0 0 1 787.49005 114.34064] CT
N
f-2139806394
f
GR
GS
0.749 GC
1 LJ
0.5 LW
N
637.563 154.671 M
812.875 182.179 L
S
GR
GS
[1 0 0 1 787.94928 132.89844] CT
1 0 0 RC
N
f-2139806394
f
GR
GS
[1 0 0 1 652.20154 116.54124] CT
1 0 0 RC
N
f-2139806394
f
GR
GS
[1 0 0 1 779.53687 163.01041] CT
1 0 0 RC
N
f-2139806394
f
GR
GS
[1 0 0 1 750.58716 117.67418] CT
1 0 0 RC
N
f-2139806394
f
GR
GS
[1 0 0 1 768.42798 101.29524] CT
1 0 0 RC
N
f-2139806394
f
GR
GS
[1 0 0 1 779.26648 122.7348] CT
1 0 0 RC
N
f-2139806394
f
GR
GS
[1 0 0 1 790.59808 79.89095] CT
1 0 0 RC
N
f-2139806394
f
GR
GS
[1 0 0 1 779.03931 186.5607] CT
1 0 0 RC
N
f-2139806394
f
GR
GS
[1 0 0 1 729.34521 124.34747] CT
1 0 0 RC
N
f-2139806394
f
GR
GS
[1 0 0 1 791.24091 184.59541] CT
1 0 0 RC
N
f-2139806394
f
GR
GS
[1 0 0 1 794.01349 118.44655] CT
1 0 0 RC
N
f-2139806394
f
GR
GS
[1 0 0 1 760.47797 163.78853] CT
1 0 0 RC
N
f-2139806394
f
GR
GS
[1 0 0 1 732.0155 179.33495] CT
1 0 0 RC
N
f-2139806394
f
GR
GS
[1 0 0 1 771.35638 158.74075] CT
1 0 0 RC
N
f-2139806394
f
GR
GS
[1 0 0 1 763.47375 76.62772] CT
1 0 0 RC
N
f-2139806394
f
GR
GS
[1 0 0 1 792.98669 152.14267] CT
1 0 0 RC
N
f-2139806394
f
GR
GS
[1 0 0 1 786.54767 166.12086] CT
1 0 0 RC
N
f-2139806394
f
GR
GS
[1 0 0 1 800.95825 144.99484] CT
1 0 0 RC
N
f-2139806394
f
GR
GS
[1 0 0 1 780.21393 113.56133] CT
1 0 0 RC
N
f-2139806394
f
GR
GS
[1 0 0 1 724.78595 147.17578] CT
1 0 0 RC
N
f-2139806394
f
GR
GS
[1 0 0 1 720.50848 200.82639] CT
1 0 0 RC
N
f-2139806394
f
GR
GS
[1 0 0 1 782.7005 159.29385] CT
1 0 0 RC
N
f-2139806394
f
GR
GS
[1 0 0 1 725.67303 127.56641] CT
1 0 0 RC
N
f-2139806394
f
GR
GS
[1 0 0 1 783.77423 131.42163] CT
1 0 0 RC
N
f-2139806394
f
GR
GS
[1 0 0 1 794.97241 152.09172] CT
1 0 0 RC
N
f-2139806394
f
GR
GS
[1 0 0 1 793.862 167.76389] CT
1 0 0 RC
N
f-2139806394
f
GR
GS
[1 0 0 1 792.28369 151.28444] CT
1 0 0 RC
N
f-2139806394
f
GR
GS
[1 0 0 1 787.44043 171.22058] CT
1 0 0 RC
N
f-2139806394
f
GR
GS
[1 0 0 1 784.20514 136.83324] CT
1 0 0 RC
N
f-2139806394
f
GR
GS
[1 0 0 1 770.71375 134.22104] CT
1 0 0 RC
N
f-2139806394
f
GR
GS
[1 0 0 1 780.94977 65.44604] CT
1 0 0 RC
N
f-2139806394
f
GR
GS
[1 0 0 1 767.97211 93.33976] CT
1 0 0 RC
N
f-2139806394
f
GR
GS
[1 0 0 1 778.60895 98.41003] CT
1 0 0 RC
N
f-2139806394
f
GR
GS
[1 0 0 1 762.68317 80.31091] CT
1 0 0 RC
N
f-2139806394
f
GR
GS
[1 0 0 1 776.65686 102.41992] CT
1 0 0 RC
N
f-2139806394
f
GR
GS
[1 0 0 1 765.27814 76.51277] CT
1 0 0 RC
N
f-2139806394
f
GR
GS
[1 0 0 1 791.71161 127.99242] CT
1 0 0 RC
N
f-2139806394
f
GR
GS
[1 0 0 1 788.58667 103.3736] CT
1 0 0 RC
N
f-2139806394
f
GR
GS
[1 0 0 1 790.81903 162.61943] CT
1 0 0 RC
N
f-2139806394
f
GR
GS
[1 0 0 1 791.00159 207.66707] CT
1 0 0 RC
N
f-2139806394
f
GR
GS
[1 0 0 1 775.41626 137.19482] CT
1 0 0 RC
N
f-2139806394
f
GR
GS
[1 0 0 1 771.42206 63.31655] CT
1 0 0 RC
N
f-2139806394
f
GR
GS
[1 0 0 1 619.67285 165.43094] CT
1 0 0 RC
N
f-2139806394
f
GR
GS
[1 0 0 1 793.78687 184.70819] CT
1 0 0 RC
N
f-2139806394
f
GR
GS
[1 0 0 1 780.20947 101.6921] CT
1 0 0 RC
N
f-2139806394
f
GR
GS
[1 0 0 1 787.71906 124.03893] CT
1 0 0 RC
N
f-2139806394
f
GR
GS
[1 0 0 1 770.08923 193.09755] CT
1 0 0 RC
N
f-2139806394
f
GR
GS
[1 0 0 1 782.7243 140.35048] CT
1 0 0 RC
N
f-2139806394
f
GR
GS
[1 0 0 1 791.74469 102.12888] CT
1 0 0 RC
N
f-2139806394
f
GR
GS
[1 0 0 1 788.20697 161.70512] CT
1 0 0 RC
N
f-2139806394
f
GR
GS
[1 0 0 1 783.26062 167.83781] CT
1 0 0 RC
N
f-2139806394
f
GR
GS
[1 0 0 1 761.92883 100.47961] CT
1 0 0 RC
N
f-2139806394
f
GR
GS
0.749 GC
1 LJ
0.5 LW
N
602.5 138.584 M
812.875 134.645 L
S
GR
GS
0.749 GC
1 LJ
0.5 LW
N
602.5 149.169 M
847.938 187.68 L
S
GR
GS
[1 0 0 1 649.5 211.75] CT
/Helvetica 14 F
GS
[1 0 0 1 0 0] CT
0 5.5 moveto 
1 -1 scale
(Younger Adults: r=-0.15) t 
GR
GR
GS
[1 0 0 1 631.5 211.75] CT
N
f-2139806394
f
GR
GS
[1 0 0 1 649.5 228.75] CT
/Helvetica 14 F
GS
[1 0 0 1 0 0] CT
0 5.5 moveto 
1 -1 scale
(Older Adults: r=0.02) t 
GR
GR
GS
[1 0 0 1 631.5 228.75] CT
1 0 0 RC
N
f-2139806394
f
GR
GS
1 GC
N
/f-192726452{971.5 249 M
1252.5 249 L
1252.5 38.5 L
971.5 38.5 L
cp}def
f-192726452
f
GR
GS
0.149 GC
2 setlinecap
1 LJ
0.5 LW
N
971.5 249 M
1252.5 249 L
S
GR
GS
0.149 GC
2 setlinecap
1 LJ
0.5 LW
N
971.5 249 M
971.5 246.19 L
S
GR
GS
0.149 GC
2 setlinecap
1 LJ
0.5 LW
N
1041.75 249 M
1041.75 246.19 L
S
GR
GS
0.149 GC
2 setlinecap
1 LJ
0.5 LW
N
1112 249 M
1112 246.19 L
S
GR
GS
0.149 GC
2 setlinecap
1 LJ
0.5 LW
N
1182.25 249 M
1182.25 246.19 L
S
GR
GS
0.149 GC
2 setlinecap
1 LJ
0.5 LW
N
1252.5 249 M
1252.5 246.19 L
S
GR
GS
[1 0 0 1 971.5 253.8] CT
0.149 GC
/Helvetica 14 F
GS
[1 0 0 1 0 0] CT
-10 14 moveto 
1 -1 scale
(0.1) t 
GR
GR
GS
[1 0 0 1 1041.75 253.8] CT
0.149 GC
/Helvetica 14 F
GS
[1 0 0 1 0 0] CT
-10 14 moveto 
1 -1 scale
(0.2) t 
GR
GR
GS
[1 0 0 1 1112 253.8] CT
0.149 GC
/Helvetica 14 F
GS
[1 0 0 1 0 0] CT
-10 14 moveto 
1 -1 scale
(0.3) t 
GR
GR
GS
[1 0 0 1 1182.25 253.8] CT
0.149 GC
/Helvetica 14 F
GS
[1 0 0 1 0 0] CT
-10 14 moveto 
1 -1 scale
(0.4) t 
GR
GR
GS
[1 0 0 1 1252.5 253.8] CT
0.149 GC
/Helvetica 14 F
GS
[1 0 0 1 0 0] CT
-10 14 moveto 
1 -1 scale
(0.5) t 
GR
GR
GS
[1 0 0 1 1112.00012 271.29999] CT
0.149 GC
/Helvetica 14 F
GS
[1 0 0 1 0 0] CT
-75.5 14 moveto 
1 -1 scale
(Bandpass MPE, Scale 1) t 
GR
GR
GS
0.149 GC
2 setlinecap
1 LJ
0.5 LW
N
971.5 249 M
971.5 38.5 L
S
GR
GS
0.149 GC
2 setlinecap
1 LJ
0.5 LW
N
971.5 249 M
974.31 249 L
S
GR
GS
0.149 GC
2 setlinecap
1 LJ
0.5 LW
N
971.5 213.917 M
974.31 213.917 L
S
GR
GS
0.149 GC
2 setlinecap
1 LJ
0.5 LW
N
971.5 178.833 M
974.31 178.833 L
S
GR
GS
0.149 GC
2 setlinecap
1 LJ
0.5 LW
N
971.5 143.75 M
974.31 143.75 L
S
GR
GS
0.149 GC
2 setlinecap
1 LJ
0.5 LW
N
971.5 108.667 M
974.31 108.667 L
S
GR
GS
0.149 GC
2 setlinecap
1 LJ
0.5 LW
N
971.5 73.583 M
974.31 73.583 L
S
GR
GS
0.149 GC
2 setlinecap
1 LJ
0.5 LW
N
971.5 38.5 M
974.31 38.5 L
S
GR
GS
[1 0 0 1 966.70001 249] CT
0.149 GC
/Helvetica 14 F
GS
[1 0 0 1 0 0] CT
-20 5.5 moveto 
1 -1 scale
(0.1) t 
GR
GR
GS
[1 0 0 1 966.70001 213.91667] CT
0.149 GC
/Helvetica 14 F
GS
[1 0 0 1 0 0] CT
-20 5.5 moveto 
1 -1 scale
(0.2) t 
GR
GR
GS
[1 0 0 1 966.70001 178.83333] CT
0.149 GC
/Helvetica 14 F
GS
[1 0 0 1 0 0] CT
-20 5.5 moveto 
1 -1 scale
(0.3) t 
GR
GR
GS
[1 0 0 1 966.70001 143.75] CT
0.149 GC
/Helvetica 14 F
GS
[1 0 0 1 0 0] CT
-20 5.5 moveto 
1 -1 scale
(0.4) t 
GR
GR
GS
[1 0 0 1 966.70001 108.66666] CT
0.149 GC
/Helvetica 14 F
GS
[1 0 0 1 0 0] CT
-20 5.5 moveto 
1 -1 scale
(0.5) t 
GR
GR
GS
[1 0 0 1 966.70001 73.58333] CT
0.149 GC
/Helvetica 14 F
GS
[1 0 0 1 0 0] CT
-20 5.5 moveto 
1 -1 scale
(0.6) t 
GR
GR
GS
[1 0 0 1 966.70001 38.5] CT
0.149 GC
/Helvetica 14 F
GS
[1 0 0 1 0 0] CT
-20 5.5 moveto 
1 -1 scale
(0.7) t 
GR
GR
GS
[0 -1 1 0 944.20001 143.74991] CT
0.149 GC
/Helvetica 14 F
GS
[1 0 0 1 0 0] CT
-78 -3 moveto 
1 -1 scale
(Vanilla MPE, Scales 1:10) t 
GR
GR
GS
[1 0 0 1 1112.0011 36.75] CT
/Helvetica-Bold 14 F
GS
[1 0 0 1 0 0] CT
-98 -22 moveto 
1 -1 scale
(PE is anticorrelated between ) t 
GR
GR
GS
[1 0 0 1 1112.0011 36.75] CT
/Helvetica-Bold 14 F
GS
[1 0 0 1 0 0] CT
-71 -4 moveto 
1 -1 scale
(Vanilla and bandpass) t 
GR
GR
GS
[1 0 0 1 1145.13391 148.19965] CT
N
f-2139806394
f
GR
GS
[1 0 0 1 1149.73169 123.93034] CT
N
f-2139806394
f
GR
GS
[1 0 0 1 1123.69043 151.23579] CT
N
f-2139806394
f
GR
GS
[1 0 0 1 1150.7168 123.43838] CT
N
f-2139806394
f
GR
GS
[1 0 0 1 1145.7262 121.87768] CT
N
f-2139806394
f
GR
GS
[1 0 0 1 1163.94165 232.35931] CT
N
f-2139806394
f
GR
GS
[1 0 0 1 1155.65942 96.58379] CT
N
f-2139806394
f
GR
GS
[1 0 0 1 1158.00183 107.15347] CT
N
f-2139806394
f
GR
GS
[1 0 0 1 1158.28625 71.79629] CT
N
f-2139806394
f
GR
GS
[1 0 0 1 1162.40686 162.95454] CT
N
f-2139806394
f
GR
GS
[1 0 0 1 1173.95569 185.17938] CT
N
f-2139806394
f
GR
GS
[1 0 0 1 1047.79822 137.68988] CT
N
f-2139806394
f
GR
GS
[1 0 0 1 1141.05554 222.68622] CT
N
f-2139806394
f
GR
GS
[1 0 0 1 1168.99536 149.15175] CT
N
f-2139806394
f
GR
GS
[1 0 0 1 1159.20801 145.43411] CT
N
f-2139806394
f
GR
GS
[1 0 0 1 1163.59827 156.19414] CT
N
f-2139806394
f
GR
GS
[1 0 0 1 1159.88403 176.05394] CT
N
f-2139806394
f
GR
GS
[1 0 0 1 1161.49036 156.58386] CT
N
f-2139806394
f
GR
GS
[1 0 0 1 1145.44873 180.79738] CT
N
f-2139806394
f
GR
GS
[1 0 0 1 1119.19434 137.24521] CT
N
f-2139806394
f
GR
GS
[1 0 0 1 1155.97217 129.38916] CT
N
f-2139806394
f
GR
GS
[1 0 0 1 1170.64893 137.44777] CT
N
f-2139806394
f
GR
GS
[1 0 0 1 1147.78687 108.95909] CT
N
f-2139806394
f
GR
GS
[1 0 0 1 1108.74487 86.99043] CT
N
f-2139806394
f
GR
GS
[1 0 0 1 1156.22949 140.95328] CT
N
f-2139806394
f
GR
GS
[1 0 0 1 1145.92725 168.88293] CT
N
f-2139806394
f
GR
GS
[1 0 0 1 1121.76501 242.56381] CT
N
f-2139806394
f
GR
GS
[1 0 0 1 1031.33398 215.84714] CT
N
f-2139806394
f
GR
GS
[1 0 0 1 1141.32935 126.64099] CT
N
f-2139806394
f
GR
GS
[1 0 0 1 1132.6814 124.99644] CT
N
f-2139806394
f
GR
GS
[1 0 0 1 1129.31433 162.92297] CT
N
f-2139806394
f
GR
GS
[1 0 0 1 1150.27014 96.22194] CT
N
f-2139806394
f
GR
GS
[1 0 0 1 1162.18872 77.2598] CT
N
f-2139806394
f
GR
GS
[1 0 0 1 1169.07349 149.47334] CT
N
f-2139806394
f
GR
GS
[1 0 0 1 1162.51599 172.40143] CT
N
f-2139806394
f
GR
GS
[1 0 0 1 1128.12866 169.69691] CT
N
f-2139806394
f
GR
GS
[1 0 0 1 1134.09839 142.13591] CT
N
f-2139806394
f
GR
GS
[1 0 0 1 1169.35437 107.99305] CT
N
f-2139806394
f
GR
GS
[1 0 0 1 1142.06189 165.74362] CT
N
f-2139806394
f
GR
GS
[1 0 0 1 1150.37366 164.2057] CT
N
f-2139806394
f
GR
GS
[1 0 0 1 1154.17542 85.6012] CT
N
f-2139806394
f
GR
GS
[1 0 0 1 1166.3031 113.05606] CT
N
f-2139806394
f
GR
GS
[1 0 0 1 1163.15955 112.48217] CT
N
f-2139806394
f
GR
GS
[1 0 0 1 1139.4563 102.98501] CT
N
f-2139806394
f
GR
GS
[1 0 0 1 1161.92444 115.98581] CT
N
f-2139806394
f
GR
GS
[1 0 0 1 1150.98328 137.21483] CT
N
f-2139806394
f
GR
GS
[1 0 0 1 1156.81982 86.45803] CT
N
f-2139806394
f
GR
GS
0.749 GC
1 LJ
0.5 LW
N
1006.625 186.445 M
1182.25 129.241 L
S
GR
GS
[1 0 0 1 1157.27991 86.92373] CT
1 0 0 RC
N
f-2139806394
f
GR
GS
[1 0 0 1 1021.2901 172.0881] CT
1 0 0 RC
N
f-2139806394
f
GR
GS
[1 0 0 1 1148.85242 115.80929] CT
1 0 0 RC
N
f-2139806394
f
GR
GS
[1 0 0 1 1119.85107 119.08955] CT
1 0 0 RC
N
f-2139806394
f
GR
GS
[1 0 0 1 1137.72375 70.28638] CT
1 0 0 RC
N
f-2139806394
f
GR
GS
[1 0 0 1 1148.58154 96.45677] CT
1 0 0 RC
N
f-2139806394
f
GR
GS
[1 0 0 1 1159.93335 42.39484] CT
1 0 0 RC
N
f-2139806394
f
GR
GS
[1 0 0 1 1148.354 151.20633] CT
1 0 0 RC
N
f-2139806394
f
GR
GS
[1 0 0 1 1098.57129 93.88669] CT
1 0 0 RC
N
f-2139806394
f
GR
GS
[1 0 0 1 1160.57739 129.03674] CT
1 0 0 RC
N
f-2139806394
f
GR
GS
[1 0 0 1 1163.35486 83.73741] CT
1 0 0 RC
N
f-2139806394
f
GR
GS
[1 0 0 1 1129.75952 136.94159] CT
1 0 0 RC
N
f-2139806394
f
GR
GS
[1 0 0 1 1101.24634 168.17642] CT
1 0 0 RC
N
f-2139806394
f
GR
GS
[1 0 0 1 1140.65735 142.87772] CT
1 0 0 RC
N
f-2139806394
f
GR
GS
[1 0 0 1 1132.76074 64.84422] CT
1 0 0 RC
N
f-2139806394
f
GR
GS
[1 0 0 1 1162.32617 121.62695] CT
1 0 0 RC
N
f-2139806394
f
GR
GS
[1 0 0 1 1155.87573 147.10501] CT
1 0 0 RC
N
f-2139806394
f
GR
GS
[1 0 0 1 1170.31201 107.88506] CT
1 0 0 RC
N
f-2139806394
f
GR
GS
[1 0 0 1 1149.53076 116.41307] CT
1 0 0 RC
N
f-2139806394
f
GR
GS
[1 0 0 1 1094.00391 117.1562] CT
1 0 0 RC
N
f-2139806394
f
GR
GS
[1 0 0 1 1089.71887 165.19893] CT
1 0 0 RC
N
f-2139806394
f
GR
GS
[1 0 0 1 1152.02173 133.05347] CT
1 0 0 RC
N
f-2139806394
f
GR
GS
[1 0 0 1 1094.89258 106.84879] CT
1 0 0 RC
N
f-2139806394
f
GR
GS
[1 0 0 1 1153.09741 76.95644] CT
1 0 0 RC
N
f-2139806394
f
GR
GS
[1 0 0 1 1164.31555 94.62141] CT
1 0 0 RC
N
f-2139806394
f
GR
GS
[1 0 0 1 1163.20313 96.03405] CT
1 0 0 RC
N
f-2139806394
f
GR
GS
[1 0 0 1 1161.62195 76.32664] CT
1 0 0 RC
N
f-2139806394
f
GR
GS
[1 0 0 1 1156.77014 126.66329] CT
1 0 0 RC
N
f-2139806394
f
GR
GS
[1 0 0 1 1153.52905 57.60099] CT
1 0 0 RC
N
f-2139806394
f
GR
GS
[1 0 0 1 1140.01355 97.86441] CT
1 0 0 RC
N
f-2139806394
f
GR
GS
[1 0 0 1 1150.26794 77.36141] CT
1 0 0 RC
N
f-2139806394
f
GR
GS
[1 0 0 1 1137.26709 63.9314] CT
1 0 0 RC
N
f-2139806394
f
GR
GS
[1 0 0 1 1147.92285 56.1004] CT
1 0 0 RC
N
f-2139806394
f
GR
GS
[1 0 0 1 1131.96863 54.8339] CT
1 0 0 RC
N
f-2139806394
f
GR
GS
[1 0 0 1 1145.96729 56.55185] CT
1 0 0 RC
N
f-2139806394
f
GR
GS
[1 0 0 1 1134.56824 51.51254] CT
1 0 0 RC
N
f-2139806394
f
GR
GS
[1 0 0 1 1161.04883 97.14695] CT
1 0 0 RC
N
f-2139806394
f
GR
GS
[1 0 0 1 1157.91833 45.87701] CT
1 0 0 RC
N
f-2139806394
f
GR
GS
[1 0 0 1 1160.15466 97.50838] CT
1 0 0 RC
N
f-2139806394
f
GR
GS
[1 0 0 1 1160.33752 178.08453] CT
1 0 0 RC
N
f-2139806394
f
GR
GS
[1 0 0 1 1144.72449 95.22083] CT
1 0 0 RC
N
f-2139806394
f
GR
GS
[1 0 0 1 1140.72314 51.15541] CT
1 0 0 RC
N
f-2139806394
f
GR
GS
[1 0 0 1 988.70343 172.84976] CT
1 0 0 RC
N
f-2139806394
f
GR
GS
[1 0 0 1 1163.12781 129.69266] CT
1 0 0 RC
N
f-2139806394
f
GR
GS
[1 0 0 1 1149.52625 51.15493] CT
1 0 0 RC
N
f-2139806394
f
GR
GS
[1 0 0 1 1157.04919 62.7449] CT
1 0 0 RC
N
f-2139806394
f
GR
GS
[1 0 0 1 1139.38794 172.75847] CT
1 0 0 RC
N
f-2139806394
f
GR
GS
[1 0 0 1 1152.04553 88.20977] CT
1 0 0 RC
N
f-2139806394
f
GR
GS
[1 0 0 1 1161.08203 79.61324] CT
1 0 0 RC
N
f-2139806394
f
GR
GS
[1 0 0 1 1157.53796 102.28082] CT
1 0 0 RC
N
f-2139806394
f
GR
GS
[1 0 0 1 1152.58289 148.54106] CT
1 0 0 RC
N
f-2139806394
f
GR
GS
[1 0 0 1 1131.21301 62.49555] CT
1 0 0 RC
N
f-2139806394
f
GR
GS
0.749 GC
1 LJ
0.5 LW
N
971.5 178.727 M
1182.25 82.651 L
S
GR
GS
0.749 GC
1 LJ
0.5 LW
N
971.5 197.886 M
1217.375 117.801 L
S
GR
GS
[1 0 0 1 1018.5 211.75] CT
/Helvetica 14 F
GS
[1 0 0 1 0 0] CT
0 5.5 moveto 
1 -1 scale
(Younger Adults: r=0.22) t 
GR
GR
GS
[1 0 0 1 1000.5 211.75] CT
N
f-2139806394
f
GR
GS
[1 0 0 1 1018.5 228.75] CT
/Helvetica 14 F
GS
[1 0 0 1 0 0] CT
0 5.5 moveto 
1 -1 scale
(Older Adults: r=0.4) t 
GR
GR
GS
[1 0 0 1 1000.5 228.75] CT
1 0 0 RC
N
f-2139806394
f
GR
GS
1 GC
N
/f1707866320{1341 249 M
1622 249 L
1622 38.5 L
1341 38.5 L
cp}def
f1707866320
f
GR
GS
0.149 GC
2 setlinecap
1 LJ
0.5 LW
N
1341 249 M
1622 249 L
S
GR
GS
0.149 GC
2 setlinecap
1 LJ
0.5 LW
N
1341 249 M
1341 246.19 L
S
GR
GS
0.149 GC
2 setlinecap
1 LJ
0.5 LW
N
1411.25 249 M
1411.25 246.19 L
S
GR
GS
0.149 GC
2 setlinecap
1 LJ
0.5 LW
N
1481.5 249 M
1481.5 246.19 L
S
GR
GS
0.149 GC
2 setlinecap
1 LJ
0.5 LW
N
1551.75 249 M
1551.75 246.19 L
S
GR
GS
0.149 GC
2 setlinecap
1 LJ
0.5 LW
N
1622 249 M
1622 246.19 L
S
GR
GS
[1 0 0 1 1341 253.8] CT
0.149 GC
/Helvetica 14 F
GS
[1 0 0 1 0 0] CT
-12.5 14 moveto 
1 -1 scale
(-0.4) t 
GR
GR
GS
[1 0 0 1 1411.25 253.8] CT
0.149 GC
/Helvetica 14 F
GS
[1 0 0 1 0 0] CT
-12.5 14 moveto 
1 -1 scale
(-0.2) t 
GR
GR
GS
[1 0 0 1 1481.5 253.8] CT
0.149 GC
/Helvetica 14 F
GS
[1 0 0 1 0 0] CT
-4 14 moveto 
1 -1 scale
(0) t 
GR
GR
GS
[1 0 0 1 1551.75 253.8] CT
0.149 GC
/Helvetica 14 F
GS
[1 0 0 1 0 0] CT
-10 14 moveto 
1 -1 scale
(0.2) t 
GR
GR
GS
[1 0 0 1 1622 253.8] CT
0.149 GC
/Helvetica 14 F
GS
[1 0 0 1 0 0] CT
-10 14 moveto 
1 -1 scale
(0.4) t 
GR
GR
GS
[1 0 0 1 1481.50012 271.29999] CT
0.149 GC
/Helvetica 14 F
GS
[1 0 0 1 0 0] CT
-99 14 moveto 
1 -1 scale
(Bandpass-Vanilla MPE, Scale 1) t 
GR
GR
GS
0.149 GC
2 setlinecap
1 LJ
0.5 LW
N
1341 249 M
1341 38.5 L
S
GR
GS
0.149 GC
2 setlinecap
1 LJ
0.5 LW
N
1341 214.888 M
1343.81 214.888 L
S
GR
GS
0.149 GC
2 setlinecap
1 LJ
0.5 LW
N
1341 174.082 M
1343.81 174.082 L
S
GR
GS
0.149 GC
2 setlinecap
1 LJ
0.5 LW
N
1341 133.275 M
1343.81 133.275 L
S
GR
GS
0.149 GC
2 setlinecap
1 LJ
0.5 LW
N
1341 92.469 M
1343.81 92.469 L
S
GR
GS
0.149 GC
2 setlinecap
1 LJ
0.5 LW
N
1341 51.662 M
1343.81 51.662 L
S
GR
GS
[1 0 0 1 1336.19995 214.88814] CT
0.149 GC
/Helvetica 14 F
GS
[1 0 0 1 0 0] CT
-33 5.5 moveto 
1 -1 scale
(-0.04) t 
GR
GR
GS
[1 0 0 1 1336.19995 174.0816] CT
0.149 GC
/Helvetica 14 F
GS
[1 0 0 1 0 0] CT
-33 5.5 moveto 
1 -1 scale
(-0.03) t 
GR
GR
GS
[1 0 0 1 1336.19995 133.27507] CT
0.149 GC
/Helvetica 14 F
GS
[1 0 0 1 0 0] CT
-33 5.5 moveto 
1 -1 scale
(-0.02) t 
GR
GR
GS
[1 0 0 1 1336.19995 92.46853] CT
0.149 GC
/Helvetica 14 F
GS
[1 0 0 1 0 0] CT
-33 5.5 moveto 
1 -1 scale
(-0.01) t 
GR
GR
GS
[1 0 0 1 1336.19995 51.662] CT
0.149 GC
/Helvetica 14 F
GS
[1 0 0 1 0 0] CT
-8 5.5 moveto 
1 -1 scale
(0) t 
GR
GR
GS
[0 -1 1 0 1300.19995 143.74989] CT
0.149 GC
/Helvetica 14 F
GS
[1 0 0 1 0 0] CT
-108 -3 moveto 
1 -1 scale
(PSD Slope 2-64 Hz \(excl. 7-13 Hz\)) t 
GR
GR
GS
[1 0 0 1 1481.50146 36.75] CT
/Helvetica-Bold 14 F
GS
[1 0 0 1 0 0] CT
-75.5 -22 moveto 
1 -1 scale
(Individual shift in PE is) t 
GR
GR
GS
[1 0 0 1 1481.50146 36.75] CT
/Helvetica-Bold 14 F
GS
[1 0 0 1 0 0] CT
-105.5 -4 moveto 
1 -1 scale
(associated with spectral slopes) t 
GR
GR
GS
[1 0 0 1 1467.39685 132.90027] CT
N
f-2139806394
f
GR
GS
[1 0 0 1 1445.39758 137.42947] CT
N
f-2139806394
f
GR
GS
[1 0 0 1 1459.71484 140.21376] CT
N
f-2139806394
f
GR
GS
[1 0 0 1 1445.39771 104.16512] CT
N
f-2139806394
f
GR
GS
[1 0 0 1 1441.33984 138.22577] CT
N
f-2139806394
f
GR
GS
[1 0 0 1 1561.06042 171.79117] CT
N
f-2139806394
f
GR
GS
[1 0 0 1 1420.98254 129.3297] CT
N
f-2139806394
f
GR
GS
[1 0 0 1 1432.73596 136.26405] CT
N
f-2139806394
f
GR
GS
[1 0 0 1 1397.479 96.39816] CT
N
f-2139806394
f
GR
GS
[1 0 0 1 1490.80579 168.29233] CT
N
f-2139806394
f
GR
GS
[1 0 0 1 1518.83142 210.71402] CT
N
f-2139806394
f
GR
GS
[1 0 0 1 1408.20679 147.35655] CT
N
f-2139806394
f
GR
GS
[1 0 0 1 1539.93274 165.9079] CT
N
f-2139806394
f
GR
GS
[1 0 0 1 1480.28088 175.87773] CT
N
f-2139806394
f
GR
GS
[1 0 0 1 1471.66516 145.48546] CT
N
f-2139806394
f
GR
GS
[1 0 0 1 1484.63306 169.74603] CT
N
f-2139806394
f
GR
GS
[1 0 0 1 1502.6593 174.23456] CT
N
f-2139806394
f
GR
GS
[1 0 0 1 1483.96924 160.83281] CT
N
f-2139806394
f
GR
GS
[1 0 0 1 1500.1908 173.47539] CT
N
f-2139806394
f
GR
GS
[1 0 0 1 1443.45959 141.99141] CT
N
f-2139806394
f
GR
GS
[1 0 0 1 1453.98328 139.39322] CT
N
f-2139806394
f
GR
GS
[1 0 0 1 1469.38977 160.35167] CT
N
f-2139806394
f
GR
GS
[1 0 0 1 1429.43616 109.25959] CT
N
f-2139806394
f
GR
GS
[1 0 0 1 1387.92053 73.36947] CT
N
f-2139806394
f
GR
GS
[1 0 0 1 1465.6897 150.72258] CT
N
f-2139806394
f
GR
GS
[1 0 0 1 1488.50146 162.74895] CT
N
f-2139806394
f
GR
GS
[1 0 0 1 1550.1886 184.89508] CT
N
f-2139806394
f
GR
GS
[1 0 0 1 1478.22473 126.20457] CT
N
f-2139806394
f
GR
GS
[1 0 0 1 1443.91028 144.32385] CT
N
f-2139806394
f
GR
GS
[1 0 0 1 1437.93982 137.36557] CT
N
f-2139806394
f
GR
GS
[1 0 0 1 1474.22791 167.14969] CT
N
f-2139806394
f
GR
GS
[1 0 0 1 1417.92554 116.45524] CT
N
f-2139806394
f
GR
GS
[1 0 0 1 1404.90015 113.25021] CT
N
f-2139806394
f
GR
GS
[1 0 0 1 1480.64185 172.15987] CT
N
f-2139806394
f
GR
GS
[1 0 0 1 1500.31848 162.35078] CT
N
f-2139806394
f
GR
GS
[1 0 0 1 1480.41711 173.14461] CT
N
f-2139806394
f
GR
GS
[1 0 0 1 1455.80823 146.21419] CT
N
f-2139806394
f
GR
GS
[1 0 0 1 1439.25281 134.20531] CT
N
f-2139806394
f
GR
GS
[1 0 0 1 1483.42566 164.53889] CT
N
f-2139806394
f
GR
GS
[1 0 0 1 1486.04187 169.43849] CT
N
f-2139806394
f
GR
GS
[1 0 0 1 1409.24487 95.95502] CT
N
f-2139806394
f
GR
GS
[1 0 0 1 1442.79614 139.71463] CT
N
f-2139806394
f
GR
GS
[1 0 0 1 1440.6499 115.91502] CT
N
f-2139806394
f
GR
GS
[1 0 0 1 1419.28979 134.12155] CT
N
f-2139806394
f
GR
GS
[1 0 0 1 1443.54004 142.71011] CT
N
f-2139806394
f
GR
GS
[1 0 0 1 1459.32373 155.18993] CT
N
f-2139806394
f
GR
GS
[1 0 0 1 1411.42493 84.366] CT
N
f-2139806394
f
GR
GS
0.749 GC
1 LJ
0.5 LW
N
1376.125 94.542 M
1586.875 219.351 L
S
GR
GS
[1 0 0 1 1412.12122 102.35364] CT
1 0 0 RC
N
f-2139806394
f
GR
GS
[1 0 0 1 1429.39185 86.49899] CT
1 0 0 RC
N
f-2139806394
f
GR
GS
[1 0 0 1 1436.82739 131.54045] CT
1 0 0 RC
N
f-2139806394
f
GR
GS
[1 0 0 1 1425.61084 87.59712] CT
1 0 0 RC
N
f-2139806394
f
GR
GS
[1 0 0 1 1385.68604 71.72141] CT
1 0 0 RC
N
f-2139806394
f
GR
GS
[1 0 0 1 1417.31641 92.50227] CT
1 0 0 RC
N
f-2139806394
f
GR
GS
[1 0 0 1 1368.86609 50.97473] CT
1 0 0 RC
N
f-2139806394
f
GR
GS
[1 0 0 1 1472.01721 154.3672] CT
1 0 0 RC
N
f-2139806394
f
GR
GS
[1 0 0 1 1389.73816 94.06539] CT
1 0 0 RC
N
f-2139806394
f
GR
GS
[1 0 0 1 1455.93298 152.4623] CT
1 0 0 RC
N
f-2139806394
f
GR
GS
[1 0 0 1 1411.96863 88.34576] CT
1 0 0 RC
N
f-2139806394
f
GR
GS
[1 0 0 1 1448.43823 132.29468] CT
1 0 0 RC
N
f-2139806394
f
GR
GS
[1 0 0 1 1465.45361 147.36343] CT
1 0 0 RC
N
f-2139806394
f
GR
GS
[1 0 0 1 1459.83044 127.40199] CT
1 0 0 RC
N
f-2139806394
f
GR
GS
[1 0 0 1 1377.75586 47.81176] CT
1 0 0 RC
N
f-2139806394
f
GR
GS
[1 0 0 1 1449.38879 121.00661] CT
1 0 0 RC
N
f-2139806394
f
GR
GS
[1 0 0 1 1471.67188 134.55536] CT
1 0 0 RC
N
f-2139806394
f
GR
GS
[1 0 0 1 1439.62341 114.0784] CT
1 0 0 RC
N
f-2139806394
f
GR
GS
[1 0 0 1 1437.771 83.61063] CT
1 0 0 RC
N
f-2139806394
f
GR
GS
[1 0 0 1 1410.75159 116.19232] CT
1 0 0 RC
N
f-2139806394
f
GR
GS
[1 0 0 1 1456.70886 168.1946] CT
1 0 0 RC
N
f-2139806394
f
GR
GS
[1 0 0 1 1455.67664 127.93809] CT
1 0 0 RC
N
f-2139806394
f
GR
GS
[1 0 0 1 1400.87622 97.18542] CT
1 0 0 RC
N
f-2139806394
f
GR
GS
[1 0 0 1 1400.05078 100.9222] CT
1 0 0 RC
N
f-2139806394
f
GR
GS
[1 0 0 1 1423.34583 120.95724] CT
1 0 0 RC
N
f-2139806394
f
GR
GS
[1 0 0 1 1424.20386 136.14789] CT
1 0 0 RC
N
f-2139806394
f
GR
GS
[1 0 0 1 1403.6825 120.17476] CT
1 0 0 RC
N
f-2139806394
f
GR
GS
[1 0 0 1 1451.65308 139.49838] CT
1 0 0 RC
N
f-2139806394
f
GR
GS
[1 0 0 1 1380.88818 106.16754] CT
1 0 0 RC
N
f-2139806394
f
GR
GS
[1 0 0 1 1414.44177 103.6356] CT
1 0 0 RC
N
f-2139806394
f
GR
GS
[1 0 0 1 1379.09509 64.01035] CT
1 0 0 RC
N
f-2139806394
f
GR
GS
[1 0 0 1 1376.58276 68.92484] CT
1 0 0 RC
N
f-2139806394
f
GR
GS
[1 0 0 1 1367.33765 51.38179] CT
1 0 0 RC
N
f-2139806394
f
GR
GS
[1 0 0 1 1376.05688 72.81154] CT
1 0 0 RC
N
f-2139806394
f
GR
GS
[1 0 0 1 1365.31213 47.70034] CT
1 0 0 RC
N
f-2139806394
f
GR
GS
[1 0 0 1 1424.24097 97.59834] CT
1 0 0 RC
N
f-2139806394
f
GR
GS
[1 0 0 1 1371.34497 73.73591] CT
1 0 0 RC
N
f-2139806394
f
GR
GS
[1 0 0 1 1424.15576 131.1615] CT
1 0 0 RC
N
f-2139806394
f
GR
GS
[1 0 0 1 1504.91907 174.8251] CT
1 0 0 RC
N
f-2139806394
f
GR
GS
[1 0 0 1 1414.15039 106.51802] CT
1 0 0 RC
N
f-2139806394
f
GR
GS
[1 0 0 1 1413.86108 133.88661] CT
1 0 0 RC
N
f-2139806394
f
GR
GS
[1 0 0 1 1457.86487 152.57161] CT
1 0 0 RC
N
f-2139806394
f
GR
GS
[1 0 0 1 1372.43311 72.10607] CT
1 0 0 RC
N
f-2139806394
f
GR
GS
[1 0 0 1 1387.79834 93.76632] CT
1 0 0 RC
N
f-2139806394
f
GR
GS
[1 0 0 1 1489.11194 160.70322] CT
1 0 0 RC
N
f-2139806394
f
GR
GS
[1 0 0 1 1410.79163 109.57673] CT
1 0 0 RC
N
f-2139806394
f
GR
GS
[1 0 0 1 1406.70313 72.52943] CT
1 0 0 RC
N
f-2139806394
f
GR
GS
[1 0 0 1 1427.62561 130.27528] CT
1 0 0 RC
N
f-2139806394
f
GR
GS
[1 0 0 1 1471.46313 136.21954] CT
1 0 0 RC
N
f-2139806394
f
GR
GS
[1 0 0 1 1374.63049 70.93083] CT
1 0 0 RC
N
f-2139806394
f
GR
GS
0.749 GC
1 LJ
0.5 LW
N
1341 38.5 M
1586.875 249 L
S
GR
GS
0.749 GC
1 LJ
0.5 LW
N
1341 73.741 M
1586.875 219.351 L
S
GR
GS
[1 0 0 1 1388 211.75] CT
/Helvetica 14 F
GS
[1 0 0 1 0 0] CT
0 5.5 moveto 
1 -1 scale
(Younger Adults: r=-0.83) t 
GR
GR
GS
[1 0 0 1 1370 211.75] CT
N
f-2139806394
f
GR
GS
[1 0 0 1 1388 228.75] CT
/Helvetica 14 F
GS
[1 0 0 1 0 0] CT
0 5.5 moveto 
1 -1 scale
(Older Adults: r=-0.86) t 
GR
GR
GS
[1 0 0 1 1370 228.75] CT
1 0 0 RC
N
f-2139806394
f
GR
%%Trailer
%%Pages: 1
%%EOF
