%!PS-Adobe-3.0 EPSF-3.0
%%Creator: (MATLAB, The Mathworks, Inc. Version 9.3.0.713579 \(R2017b\). Operating System: Mac OS X)
%%Title: /Volumes/LNDG/Projects/StateSwitch/dynamic/data/eeg/rest/B_analyses/A_MSE_CSD_multiVariant/C_figures/F1_MSE_PSD.eps
%%CreationDate: 2020-03-16T14:55:17
%%Pages: (atend)
%%BoundingBox:     4    36   385   713
%%LanguageLevel: 3
%%EndComments
%%BeginProlog
%%BeginResource: procset (Apache XML Graphics Std ProcSet) 1.2 0
%%Version: 1.2 0
%%Copyright: (Copyright 2001-2003,2010 The Apache Software Foundation. License terms: http://www.apache.org/licenses/LICENSE-2.0)
/bd{bind def}bind def
/ld{load def}bd
/GR/grestore ld
/GS/gsave ld
/RM/rmoveto ld
/C/curveto ld
/t/show ld
/L/lineto ld
/ML/setmiterlimit ld
/CT/concat ld
/f/fill ld
/N/newpath ld
/S/stroke ld
/CC/setcmykcolor ld
/A/ashow ld
/cp/closepath ld
/RC/setrgbcolor ld
/LJ/setlinejoin ld
/GC/setgray ld
/LW/setlinewidth ld
/M/moveto ld
/re {4 2 roll M
1 index 0 rlineto
0 exch rlineto
neg 0 rlineto
cp } bd
/_ctm matrix def
/_tm matrix def
/BT { _ctm currentmatrix pop matrix _tm copy pop 0 0 moveto } bd
/ET { _ctm setmatrix } bd
/iTm { _ctm setmatrix _tm concat } bd
/Tm { _tm astore pop iTm 0 0 moveto } bd
/ux 0.0 def
/uy 0.0 def
/F {
  /Tp exch def
  /Tf exch def
  Tf findfont Tp scalefont setfont
  /cf Tf def  /cs Tp def
} bd
/ULS {currentpoint /uy exch def /ux exch def} bd
/ULE {
  /Tcx currentpoint pop def
  gsave
  newpath
  cf findfont cs scalefont dup
  /FontMatrix get 0 get /Ts exch def /FontInfo get dup
  /UnderlinePosition get Ts mul /To exch def
  /UnderlineThickness get Ts mul /Tt exch def
  ux uy To add moveto  Tcx uy To add lineto
  Tt setlinewidth stroke
  grestore
} bd
/OLE {
  /Tcx currentpoint pop def
  gsave
  newpath
  cf findfont cs scalefont dup
  /FontMatrix get 0 get /Ts exch def /FontInfo get dup
  /UnderlinePosition get Ts mul /To exch def
  /UnderlineThickness get Ts mul /Tt exch def
  ux uy To add cs add moveto Tcx uy To add cs add lineto
  Tt setlinewidth stroke
  grestore
} bd
/SOE {
  /Tcx currentpoint pop def
  gsave
  newpath
  cf findfont cs scalefont dup
  /FontMatrix get 0 get /Ts exch def /FontInfo get dup
  /UnderlinePosition get Ts mul /To exch def
  /UnderlineThickness get Ts mul /Tt exch def
  ux uy To add cs 10 mul 26 idiv add moveto Tcx uy To add cs 10 mul 26 idiv add lineto
  Tt setlinewidth stroke
  grestore
} bd
/QT {
/Y22 exch store
/X22 exch store
/Y21 exch store
/X21 exch store
currentpoint
/Y21 load 2 mul add 3 div exch
/X21 load 2 mul add 3 div exch
/X21 load 2 mul /X22 load add 3 div
/Y21 load 2 mul /Y22 load add 3 div
/X22 load /Y22 load curveto
} bd
/SSPD {
dup length /d exch dict def
{
/v exch def
/k exch def
currentpagedevice k known {
/cpdv currentpagedevice k get def
v cpdv ne {
/upd false def
/nullv v type /nulltype eq def
/nullcpdv cpdv type /nulltype eq def
nullv nullcpdv or
{
/upd true def
} {
/sametype v type cpdv type eq def
sametype {
v type /arraytype eq {
/vlen v length def
/cpdvlen cpdv length def
vlen cpdvlen eq {
0 1 vlen 1 sub {
/i exch def
/obj v i get def
/cpdobj cpdv i get def
obj cpdobj ne {
/upd true def
exit
} if
} for
} {
/upd true def
} ifelse
} {
v type /dicttype eq {
v {
/dv exch def
/dk exch def
/cpddv cpdv dk get def
dv cpddv ne {
/upd true def
exit
} if
} forall
} {
/upd true def
} ifelse
} ifelse
} if
} ifelse
upd true eq {
d k v put
} if
} if
} if
} forall
d length 0 gt {
d setpagedevice
} if
} bd
/RE { % /NewFontName [NewEncodingArray] /FontName RE -
  findfont dup length dict begin
  {
    1 index /FID ne
    {def} {pop pop} ifelse
  } forall
  /Encoding exch def
  /FontName 1 index def
  currentdict definefont pop
  end
} bind def
%%EndResource
%%BeginResource: procset (Apache XML Graphics EPS ProcSet) 1.0 0
%%Version: 1.0 0
%%Copyright: (Copyright 2002-2003 The Apache Software Foundation. License terms: http://www.apache.org/licenses/LICENSE-2.0)
/BeginEPSF { %def
/b4_Inc_state save def         % Save state for cleanup
/dict_count countdictstack def % Count objects on dict stack
/op_count count 1 sub def      % Count objects on operand stack
userdict begin                 % Push userdict on dict stack
/showpage { } def              % Redefine showpage, { } = null proc
0 setgray 0 setlinecap         % Prepare graphics state
1 setlinewidth 0 setlinejoin
10 setmiterlimit [ ] 0 setdash newpath
/languagelevel where           % If level not equal to 1 then
{pop languagelevel             % set strokeadjust and
1 ne                           % overprint to their defaults.
{false setstrokeadjust false setoverprint
} if
} if
} bd
/EndEPSF { %def
count op_count sub {pop} repeat            % Clean up stacks
countdictstack dict_count sub {end} repeat
b4_Inc_state restore
} bd
%%EndResource
%FOPBeginFontDict
%%IncludeResource: font Courier-Oblique
%%IncludeResource: font Courier-BoldOblique
%%IncludeResource: font Courier-Bold
%%IncludeResource: font ZapfDingbats
%%IncludeResource: font Symbol
%%IncludeResource: font Helvetica
%%IncludeResource: font Helvetica-Oblique
%%IncludeResource: font Helvetica-Bold
%%IncludeResource: font Helvetica-BoldOblique
%%IncludeResource: font Times-Roman
%%IncludeResource: font Times-Italic
%%IncludeResource: font Times-Bold
%%IncludeResource: font Times-BoldItalic
%%IncludeResource: font Courier
%FOPEndFontDict
%%BeginResource: encoding WinAnsiEncoding
/WinAnsiEncoding [
/.notdef /.notdef /.notdef /.notdef /.notdef
/.notdef /.notdef /.notdef /.notdef /.notdef
/.notdef /.notdef /.notdef /.notdef /.notdef
/.notdef /.notdef /.notdef /.notdef /.notdef
/.notdef /.notdef /.notdef /.notdef /.notdef
/.notdef /.notdef /.notdef /.notdef /.notdef
/.notdef /.notdef /space /exclam /quotedbl
/numbersign /dollar /percent /ampersand /quotesingle
/parenleft /parenright /asterisk /plus /comma
/hyphen /period /slash /zero /one
/two /three /four /five /six
/seven /eight /nine /colon /semicolon
/less /equal /greater /question /at
/A /B /C /D /E
/F /G /H /I /J
/K /L /M /N /O
/P /Q /R /S /T
/U /V /W /X /Y
/Z /bracketleft /backslash /bracketright /asciicircum
/underscore /quoteleft /a /b /c
/d /e /f /g /h
/i /j /k /l /m
/n /o /p /q /r
/s /t /u /v /w
/x /y /z /braceleft /bar
/braceright /asciitilde /bullet /Euro /bullet
/quotesinglbase /florin /quotedblbase /ellipsis /dagger
/daggerdbl /circumflex /perthousand /Scaron /guilsinglleft
/OE /bullet /Zcaron /bullet /bullet
/quoteleft /quoteright /quotedblleft /quotedblright /bullet
/endash /emdash /asciitilde /trademark /scaron
/guilsinglright /oe /bullet /zcaron /Ydieresis
/space /exclamdown /cent /sterling /currency
/yen /brokenbar /section /dieresis /copyright
/ordfeminine /guillemotleft /logicalnot /sfthyphen /registered
/macron /degree /plusminus /twosuperior /threesuperior
/acute /mu /paragraph /middot /cedilla
/onesuperior /ordmasculine /guillemotright /onequarter /onehalf
/threequarters /questiondown /Agrave /Aacute /Acircumflex
/Atilde /Adieresis /Aring /AE /Ccedilla
/Egrave /Eacute /Ecircumflex /Edieresis /Igrave
/Iacute /Icircumflex /Idieresis /Eth /Ntilde
/Ograve /Oacute /Ocircumflex /Otilde /Odieresis
/multiply /Oslash /Ugrave /Uacute /Ucircumflex
/Udieresis /Yacute /Thorn /germandbls /agrave
/aacute /acircumflex /atilde /adieresis /aring
/ae /ccedilla /egrave /eacute /ecircumflex
/edieresis /igrave /iacute /icircumflex /idieresis
/eth /ntilde /ograve /oacute /ocircumflex
/otilde /odieresis /divide /oslash /ugrave
/uacute /ucircumflex /udieresis /yacute /thorn
/ydieresis
] def
%%EndResource
%FOPBeginFontReencode
/Courier-Oblique findfont
dup length dict begin
  {1 index /FID ne {def} {pop pop} ifelse} forall
  /Encoding WinAnsiEncoding def
  currentdict
end
/Courier-Oblique exch definefont pop
/Courier-BoldOblique findfont
dup length dict begin
  {1 index /FID ne {def} {pop pop} ifelse} forall
  /Encoding WinAnsiEncoding def
  currentdict
end
/Courier-BoldOblique exch definefont pop
/Courier-Bold findfont
dup length dict begin
  {1 index /FID ne {def} {pop pop} ifelse} forall
  /Encoding WinAnsiEncoding def
  currentdict
end
/Courier-Bold exch definefont pop
/Helvetica findfont
dup length dict begin
  {1 index /FID ne {def} {pop pop} ifelse} forall
  /Encoding WinAnsiEncoding def
  currentdict
end
/Helvetica exch definefont pop
/Helvetica-Oblique findfont
dup length dict begin
  {1 index /FID ne {def} {pop pop} ifelse} forall
  /Encoding WinAnsiEncoding def
  currentdict
end
/Helvetica-Oblique exch definefont pop
/Helvetica-Bold findfont
dup length dict begin
  {1 index /FID ne {def} {pop pop} ifelse} forall
  /Encoding WinAnsiEncoding def
  currentdict
end
/Helvetica-Bold exch definefont pop
/Helvetica-BoldOblique findfont
dup length dict begin
  {1 index /FID ne {def} {pop pop} ifelse} forall
  /Encoding WinAnsiEncoding def
  currentdict
end
/Helvetica-BoldOblique exch definefont pop
/Times-Roman findfont
dup length dict begin
  {1 index /FID ne {def} {pop pop} ifelse} forall
  /Encoding WinAnsiEncoding def
  currentdict
end
/Times-Roman exch definefont pop
/Times-Italic findfont
dup length dict begin
  {1 index /FID ne {def} {pop pop} ifelse} forall
  /Encoding WinAnsiEncoding def
  currentdict
end
/Times-Italic exch definefont pop
/Times-Bold findfont
dup length dict begin
  {1 index /FID ne {def} {pop pop} ifelse} forall
  /Encoding WinAnsiEncoding def
  currentdict
end
/Times-Bold exch definefont pop
/Times-BoldItalic findfont
dup length dict begin
  {1 index /FID ne {def} {pop pop} ifelse} forall
  /Encoding WinAnsiEncoding def
  currentdict
end
/Times-BoldItalic exch definefont pop
/Courier findfont
dup length dict begin
  {1 index /FID ne {def} {pop pop} ifelse} forall
  /Encoding WinAnsiEncoding def
  currentdict
end
/Courier exch definefont pop
%FOPEndFontReencode
%%EndProlog
%%Page: 1 1
%%PageBoundingBox: 0 0 384 720
%%BeginPageSetup
[1 0 0 -1 0 720] CT
%%EndPageSetup
GS
1 GC
N
0 0 384 720 re
f
GR
GS
1 GC
N
0 0 384 720 re
f
GR
GS
1 GC
N
68.5 281 M
346 281 L
346 61.5 L
68.5 61.5 L
cp
f
GR
GS
0.149 GC
2 setlinecap
1 LJ
0.5 LW
N
68.5 281 M
346 281 L
S
GR
GS
0.149 GC
2 setlinecap
1 LJ
0.5 LW
N
68.5 281 M
68.5 278.225 L
S
GR
GS
0.149 GC
2 setlinecap
1 LJ
0.5 LW
N
150.595 281 M
150.595 278.225 L
S
GR
GS
0.149 GC
2 setlinecap
1 LJ
0.5 LW
N
254.187 281 M
254.187 278.225 L
S
GR
GS
0.149 GC
2 setlinecap
1 LJ
0.5 LW
N
346 281 M
346 278.225 L
S
GR
GS
0.149 GC
2 setlinecap
1 LJ
0.5 LW
N
68.5 281 M
68.5 279.612 L
S
GR
GS
0.149 GC
2 setlinecap
1 LJ
0.5 LW
N
120.296 281 M
120.296 279.612 L
S
GR
GS
0.149 GC
2 setlinecap
1 LJ
0.5 LW
N
150.595 281 M
150.595 279.612 L
S
GR
GS
0.149 GC
2 setlinecap
1 LJ
0.5 LW
N
172.092 281 M
172.092 279.612 L
S
GR
GS
0.149 GC
2 setlinecap
1 LJ
0.5 LW
N
188.767 281 M
188.767 279.612 L
S
GR
GS
0.149 GC
2 setlinecap
1 LJ
0.5 LW
N
202.391 281 M
202.391 279.612 L
S
GR
GS
0.149 GC
2 setlinecap
1 LJ
0.5 LW
N
213.91 281 M
213.91 279.612 L
S
GR
GS
0.149 GC
2 setlinecap
1 LJ
0.5 LW
N
223.888 281 M
223.888 279.612 L
S
GR
GS
0.149 GC
2 setlinecap
1 LJ
0.5 LW
N
232.69 281 M
232.69 279.612 L
S
GR
GS
0.149 GC
2 setlinecap
1 LJ
0.5 LW
N
240.563 281 M
240.563 279.612 L
S
GR
GS
0.149 GC
2 setlinecap
1 LJ
0.5 LW
N
292.359 281 M
292.359 279.612 L
S
GR
GS
0.149 GC
2 setlinecap
1 LJ
0.5 LW
N
322.658 281 M
322.658 279.612 L
S
GR
GS
0.149 GC
2 setlinecap
1 LJ
0.5 LW
N
344.155 281 M
344.155 279.612 L
S
GR
GS
[1 0 0 1 35 305] CT
0.149 GC
/Helvetica 18 F
GS
[1 0 0 1 0 0] CT
0 0 moveto 
1 -1 scale
(250 Hz) t 
GR
GR
GS
[1 0 0 1 35 330] CT
0.149 GC
/Helvetica 18 F
GS
[1 0 0 1 0 0] CT
0 0 moveto 
1 -1 scale
(\(scale 1\)) t 
GR
GR
GS
[1 0 0 1 117 305] CT
0.149 GC
/Helvetica 18 F
GS
[1 0 0 1 0 0] CT
0 0 moveto 
1 -1 scale
(83 Hz) t 
GR
GR
GS
[1 0 0 1 117 330] CT
0.149 GC
/Helvetica 18 F
GS
[1 0 0 1 0 0] CT
0 0 moveto 
1 -1 scale
(\(scale 3\)) t 
GR
GR
GS
[1 0 0 1 215 305] CT
0.149 GC
/Helvetica 18 F
GS
[1 0 0 1 0 0] CT
0 0 moveto 
1 -1 scale
(21 Hz) t 
GR
GR
GS
[1 0 0 1 215 330] CT
0.149 GC
/Helvetica 18 F
GS
[1 0 0 1 0 0] CT
0 0 moveto 
1 -1 scale
(\(scale 12\)) t 
GR
GR
GS
[1 0 0 1 307 305] CT
0.149 GC
/Helvetica 18 F
GS
[1 0 0 1 0 0] CT
0 0 moveto 
1 -1 scale
(6 Hz) t 
GR
GR
GS
[1 0 0 1 307 330] CT
0.149 GC
/Helvetica 18 F
GS
[1 0 0 1 0 0] CT
0 0 moveto 
1 -1 scale
(\(scale 41\)) t 
GR
GR
GS
[1 0 0 1 207.25014 334.10001] CT
0.149 GC
/Helvetica 23 F
GS
[1 0 0 1 0 0] CT
-138.5 22 moveto 
1 -1 scale
(Time scale [Hz, log-scaled]) t 
GR
GR
GS
0.149 GC
2 setlinecap
1 LJ
0.5 LW
N
68.5 281 M
68.5 61.5 L
S
GR
GS
0.149 GC
2 setlinecap
1 LJ
0.5 LW
N
68.5 226.125 M
71.275 226.125 L
S
GR
GS
0.149 GC
2 setlinecap
1 LJ
0.5 LW
N
68.5 171.25 M
71.275 171.25 L
S
GR
GS
0.149 GC
2 setlinecap
1 LJ
0.5 LW
N
68.5 116.375 M
71.275 116.375 L
S
GR
GS
[1 0 0 1 61.9 226.125] CT
0.149 GC
/Helvetica 23 F
GS
[1 0 0 1 0 0] CT
-32 8.5 moveto 
1 -1 scale
(0.4) t 
GR
GR
GS
[1 0 0 1 61.9 171.25] CT
0.149 GC
/Helvetica 23 F
GS
[1 0 0 1 0 0] CT
-32 8.5 moveto 
1 -1 scale
(0.6) t 
GR
GR
GS
[1 0 0 1 61.9 116.375] CT
0.149 GC
/Helvetica 23 F
GS
[1 0 0 1 0 0] CT
-32 8.5 moveto 
1 -1 scale
(0.8) t 
GR
GR
GS
[0 -1 1 0 26.9 171.24989] CT
0.149 GC
/Helvetica 23 F
GS
[1 0 0 1 0 0] CT
-82.5 -5 moveto 
1 -1 scale
(Sample Entropy) t 
GR
GR
GS
[1 0 0 1 207.2502 58.62499] CT
/Helvetica-Bold 23 F
GS
[1 0 0 1 0 0] CT
-86.5 -34 moveto 
1 -1 scale
(Eyes Open rest:) t 
GR
GR
GS
[1 0 0 1 207.2502 58.62499] CT
/Helvetica-Bold 23 F
GS
[1 0 0 1 0 0] CT
-89 -5 moveto 
1 -1 scale
(Original Entropy) t 
GR
GR
GS
1 0.91 0.91 RC
N
188.767 145.898 M
202.391 144.336 L
213.91 142.944 L
223.888 142.186 L
232.69 141.971 L
240.563 142.098 L
247.685 142.476 L
254.187 142.996 L
260.168 143.665 L
265.706 144.807 L
270.861 146.405 L
275.684 148.552 L
280.214 150.987 L
284.486 153.962 L
288.526 157.055 L
292.359 160.337 L
296.005 163.448 L
299.481 166.207 L
302.803 168.521 L
305.983 170.357 L
309.033 171.677 L
311.964 172.701 L
314.784 173.371 L
317.502 173.857 L
320.124 174.328 L
322.658 175.058 L
325.108 175.946 L
327.48 176.894 L
329.78 178.037 L
332.01 179.192 L
334.177 180.475 L
336.282 181.685 L
338.329 182.757 L
340.322 183.941 L
342.263 184.908 L
344.155 185.998 L
346 186.76 L
346.033 186.776 L
346.033 186.613 L
346.033 182.253 L
346.033 180.701 L
346.033 177.944 L
346 177.929 L
344.155 177.162 L
342.263 176.042 L
340.322 175.086 L
338.329 173.903 L
336.282 172.817 L
334.177 171.582 L
332.01 170.287 L
329.78 169.081 L
327.48 167.891 L
325.108 166.924 L
322.658 165.971 L
320.124 165.217 L
317.502 164.722 L
314.784 164.184 L
311.964 163.443 L
309.033 162.347 L
305.983 160.928 L
302.803 158.992 L
299.481 156.535 L
296.005 153.602 L
292.359 150.314 L
288.526 146.845 L
284.486 143.564 L
280.214 140.459 L
275.684 137.953 L
270.861 135.782 L
265.706 134.208 L
260.168 133.134 L
254.187 132.538 L
247.685 132.068 L
240.563 131.699 L
232.69 131.513 L
223.888 131.571 L
213.91 132.091 L
202.391 133.126 L
188.767 134.208 L
172.092 135.37 L
150.595 138.751 L
120.296 154.81 L
68.5 219.539 L
68.5 227.764 L
120.296 167.764 L
150.595 151.83 L
172.092 147.721 L
cp
f
GR
GS
1 0.549 0.549 RC
1 LJ
0.5 LW
N
68.5 219.539 M
120.296 154.81 L
150.595 138.751 L
172.092 135.37 L
188.767 134.208 L
202.391 133.126 L
213.91 132.091 L
223.888 131.571 L
232.69 131.513 L
240.563 131.699 L
247.685 132.068 L
254.187 132.538 L
260.168 133.134 L
265.706 134.208 L
270.861 135.782 L
275.684 137.953 L
280.214 140.459 L
284.486 143.564 L
288.526 146.845 L
292.359 150.314 L
296.005 153.602 L
299.481 156.535 L
302.803 158.992 L
305.983 160.928 L
309.033 162.347 L
311.964 163.443 L
314.784 164.184 L
317.502 164.722 L
320.124 165.217 L
322.658 165.971 L
325.108 166.924 L
327.48 167.891 L
329.78 169.081 L
332.01 170.287 L
334.177 171.582 L
336.282 172.817 L
338.329 173.903 L
340.322 175.086 L
342.263 176.042 L
344.155 177.162 L
346 177.929 L
346.033 177.944 L
S
GR
GS
1 0.549 0.549 RC
1 LJ
0.5 LW
N
68.5 227.764 M
120.296 167.764 L
150.595 151.83 L
172.092 147.721 L
188.767 145.898 L
202.391 144.336 L
213.91 142.944 L
223.888 142.186 L
232.69 141.971 L
240.563 142.098 L
247.685 142.476 L
254.187 142.996 L
260.168 143.665 L
265.706 144.807 L
270.861 146.405 L
275.684 148.552 L
280.214 150.987 L
284.486 153.962 L
288.526 157.055 L
292.359 160.337 L
296.005 163.448 L
299.481 166.207 L
302.803 168.521 L
305.983 170.357 L
309.033 171.677 L
311.964 172.701 L
314.784 173.371 L
317.502 173.857 L
320.124 174.328 L
322.658 175.058 L
325.108 175.946 L
327.48 176.894 L
329.78 178.037 L
332.01 179.192 L
334.177 180.475 L
336.282 181.685 L
338.329 182.757 L
340.322 183.941 L
342.263 184.908 L
344.155 185.998 L
346 186.76 L
346.033 186.776 L
S
GR
GS
1 0 0 RC
1 LJ
3 LW
N
68.5 223.652 M
120.296 161.287 L
150.595 145.291 L
172.092 141.546 L
188.767 140.053 L
202.391 138.731 L
213.91 137.518 L
223.888 136.879 L
232.69 136.742 L
240.563 136.899 L
247.685 137.272 L
254.187 137.767 L
260.168 138.399 L
265.706 139.507 L
270.861 141.094 L
275.684 143.252 L
280.214 145.723 L
284.486 148.763 L
288.526 151.95 L
292.359 155.326 L
296.005 158.525 L
299.481 161.371 L
302.803 163.757 L
305.983 165.643 L
309.033 167.012 L
311.964 168.072 L
314.784 168.778 L
317.502 169.289 L
320.124 169.772 L
322.658 170.514 L
325.108 171.435 L
327.48 172.393 L
329.78 173.559 L
332.01 174.739 L
334.177 176.028 L
336.282 177.251 L
338.329 178.33 L
340.322 179.514 L
342.263 180.475 L
344.155 181.58 L
346 182.345 L
346.033 182.36 L
S
GR
GS
0.91 GC
N
172.092 119.798 M
188.767 125.451 L
202.391 130.3 L
213.91 134.901 L
223.888 139.954 L
232.69 145.613 L
240.563 151.332 L
247.685 156.753 L
254.187 161.784 L
260.168 166.447 L
265.706 170.928 L
270.861 175.324 L
275.684 179.531 L
280.214 183.62 L
284.486 187.46 L
288.526 191.104 L
292.359 194.442 L
296.005 197.585 L
299.481 200.268 L
302.803 202.775 L
305.983 204.893 L
309.033 206.762 L
311.964 208.257 L
314.784 209.499 L
317.502 210.797 L
320.124 211.638 L
322.658 212.643 L
325.108 213.467 L
327.48 214.255 L
329.78 215.016 L
332.01 215.701 L
334.177 216.4 L
336.282 217.129 L
338.329 217.844 L
340.322 218.414 L
342.263 218.948 L
344.155 219.536 L
346 220.011 L
346.033 220.018 L
346.033 219.879 L
346.033 216.089 L
346.033 212.436 L
346 212.428 L
344.155 211.972 L
342.263 211.432 L
340.322 210.913 L
338.329 210.373 L
336.282 209.668 L
334.177 208.957 L
332.01 208.299 L
329.78 207.603 L
327.48 206.855 L
325.108 206.073 L
322.658 205.258 L
320.124 204.269 L
317.502 203.394 L
314.784 202.075 L
311.964 200.81 L
309.033 199.246 L
305.983 197.322 L
302.803 195.187 L
299.481 192.641 L
296.005 189.883 L
292.359 186.717 L
288.526 183.28 L
284.486 179.613 L
280.214 175.73 L
275.684 171.557 L
270.861 167.274 L
265.706 162.832 L
260.168 158.241 L
254.187 153.479 L
247.685 148.3 L
240.563 142.737 L
232.69 136.882 L
223.888 131.08 L
213.91 125.913 L
202.391 121.116 L
188.767 115.859 L
172.092 109.46 L
150.595 104.39 L
120.296 113.775 L
68.5 192.105 L
68.5 199.648 L
120.296 125.714 L
150.595 115.769 L
cp
f
GR
GS
0.549 GC
1 LJ
0.5 LW
N
68.5 192.105 M
120.296 113.775 L
150.595 104.39 L
172.092 109.46 L
188.767 115.859 L
202.391 121.116 L
213.91 125.913 L
223.888 131.08 L
232.69 136.882 L
240.563 142.737 L
247.685 148.3 L
254.187 153.479 L
260.168 158.241 L
265.706 162.832 L
270.861 167.274 L
275.684 171.557 L
280.214 175.73 L
284.486 179.613 L
288.526 183.28 L
292.359 186.717 L
296.005 189.883 L
299.481 192.641 L
302.803 195.187 L
305.983 197.322 L
309.033 199.246 L
311.964 200.81 L
314.784 202.075 L
317.502 203.394 L
320.124 204.269 L
322.658 205.258 L
325.108 206.073 L
327.48 206.855 L
329.78 207.603 L
332.01 208.299 L
334.177 208.957 L
336.282 209.668 L
338.329 210.373 L
340.322 210.913 L
342.263 211.432 L
344.155 211.972 L
346 212.428 L
346.033 212.436 L
S
GR
GS
0.549 GC
1 LJ
0.5 LW
N
68.5 199.648 M
120.296 125.714 L
150.595 115.769 L
172.092 119.798 L
188.767 125.451 L
202.391 130.3 L
213.91 134.901 L
223.888 139.954 L
232.69 145.613 L
240.563 151.332 L
247.685 156.753 L
254.187 161.784 L
260.168 166.447 L
265.706 170.928 L
270.861 175.324 L
275.684 179.531 L
280.214 183.62 L
284.486 187.46 L
288.526 191.104 L
292.359 194.442 L
296.005 197.585 L
299.481 200.268 L
302.803 202.775 L
305.983 204.893 L
309.033 206.762 L
311.964 208.257 L
314.784 209.499 L
317.502 210.797 L
320.124 211.638 L
322.658 212.643 L
325.108 213.467 L
327.48 214.255 L
329.78 215.016 L
332.01 215.701 L
334.177 216.4 L
336.282 217.129 L
338.329 217.844 L
340.322 218.414 L
342.263 218.948 L
344.155 219.536 L
346 220.011 L
346.033 220.018 L
S
GR
GS
1 LJ
3 LW
N
68.5 195.877 M
120.296 119.744 L
150.595 110.08 L
172.092 114.629 L
188.767 120.655 L
202.391 125.708 L
213.91 130.407 L
223.888 135.517 L
232.69 141.248 L
240.563 147.034 L
247.685 152.527 L
254.187 157.632 L
260.168 162.344 L
265.706 166.88 L
270.861 171.299 L
275.684 175.544 L
280.214 179.675 L
284.486 183.536 L
288.526 187.192 L
292.359 190.58 L
296.005 193.734 L
299.481 196.454 L
302.803 198.981 L
305.983 201.107 L
309.033 203.004 L
311.964 204.534 L
314.784 205.787 L
317.502 207.095 L
320.124 207.953 L
322.658 208.951 L
325.108 209.77 L
327.48 210.555 L
329.78 211.31 L
332.01 212 L
334.177 212.678 L
336.282 213.399 L
338.329 214.108 L
340.322 214.664 L
342.263 215.19 L
344.155 215.754 L
346 216.219 L
346.033 216.227 L
S
GR
GS
[1 0 0 1 155.60452 228] CT
/Helvetica 23 F
GS
[1 0 0 1 0 0] CT
0 8.5 moveto 
1 -1 scale
(Young adults) t 
GR
GR
GS
1 0 0 RC
1 LJ
3 LW
N
122.511 228 M
152.596 228 L
S
GR
GS
[1 0 0 1 155.60452 255.5] CT
/Helvetica 23 F
GS
[1 0 0 1 0 0] CT
0 8.5 moveto 
1 -1 scale
(Older adults) t 
GR
GR
GS
1 LJ
3 LW
N
122.511 255.5 M
152.596 255.5 L
S
GR
GS
1 GC
N
68.5 622 M
346 622 L
346 403 L
68.5 403 L
cp
f
GR
GS
0.149 GC
2 setlinecap
1 LJ
0.5 LW
N
346 622 M
68.5 622 L
S
GR
GS
0.149 GC
2 setlinecap
1 LJ
0.5 LW
N
331.402 622 M
331.402 619.225 L
S
GR
GS
0.149 GC
2 setlinecap
1 LJ
0.5 LW
N
275.902 622 M
275.902 619.225 L
S
GR
GS
0.149 GC
2 setlinecap
1 LJ
0.5 LW
N
221.24 622 M
221.24 619.225 L
S
GR
GS
0.149 GC
2 setlinecap
1 LJ
0.5 LW
N
165.74 622 M
165.74 619.225 L
S
GR
GS
0.149 GC
2 setlinecap
1 LJ
0.5 LW
N
110.03 622 M
110.03 619.225 L
S
GR
GS
0.149 GC
2 setlinecap
1 LJ
0.5 LW
N
346 622 M
346 620.612 L
S
GR
GS
0.149 GC
2 setlinecap
1 LJ
0.5 LW
N
313.535 622 M
313.535 620.612 L
S
GR
GS
0.149 GC
2 setlinecap
1 LJ
0.5 LW
N
290.5 622 M
290.5 620.612 L
S
GR
GS
0.149 GC
2 setlinecap
1 LJ
0.5 LW
N
272.633 622 M
272.633 620.612 L
S
GR
GS
0.149 GC
2 setlinecap
1 LJ
0.5 LW
N
258.035 622 M
258.035 620.612 L
S
GR
GS
0.149 GC
2 setlinecap
1 LJ
0.5 LW
N
245.692 622 M
245.692 620.612 L
S
GR
GS
0.149 GC
2 setlinecap
1 LJ
0.5 LW
N
235 622 M
235 620.612 L
S
GR
GS
0.149 GC
2 setlinecap
1 LJ
0.5 LW
N
225.569 622 M
225.569 620.612 L
S
GR
GS
0.149 GC
2 setlinecap
1 LJ
0.5 LW
N
217.133 622 M
217.133 620.612 L
S
GR
GS
0.149 GC
2 setlinecap
1 LJ
0.5 LW
N
161.633 622 M
161.633 620.612 L
S
GR
GS
0.149 GC
2 setlinecap
1 LJ
0.5 LW
N
129.168 622 M
129.168 620.612 L
S
GR
GS
0.149 GC
2 setlinecap
1 LJ
0.5 LW
N
106.133 622 M
106.133 620.612 L
S
GR
GS
0.149 GC
2 setlinecap
1 LJ
0.5 LW
N
88.266 622 M
88.266 620.612 L
S
GR
GS
0.149 GC
2 setlinecap
1 LJ
0.5 LW
N
73.668 622 M
73.668 620.612 L
S
GR
GS
[1 0 0 1 331.40158 628.59998] CT
0.149 GC
/Helvetica 23 F
GS
[1 0 0 1 0 0] CT
-16 22 moveto 
1 -1 scale
(2.4) t 
GR
GR
GS
[1 0 0 1 275.90158 628.59998] CT
0.149 GC
/Helvetica 23 F
GS
[1 0 0 1 0 0] CT
-16 22 moveto 
1 -1 scale
(4.8) t 
GR
GR
GS
[1 0 0 1 221.24002 628.59998] CT
0.149 GC
/Helvetica 23 F
GS
[1 0 0 1 0 0] CT
-16 22 moveto 
1 -1 scale
(9.5) t 
GR
GR
GS
[1 0 0 1 165.74002 628.59998] CT
0.149 GC
/Helvetica 23 F
GS
[1 0 0 1 0 0] CT
-13 22 moveto 
1 -1 scale
(19) t 
GR
GR
GS
[1 0 0 1 110.02959 628.59998] CT
0.149 GC
/Helvetica 23 F
GS
[1 0 0 1 0 0] CT
-22.5 22 moveto 
1 -1 scale
(38.1) t 
GR
GR
GS
[1 0 0 1 207.25014 656.59998] CT
0.149 GC
/Helvetica 23 F
GS
[1 0 0 1 0 0] CT
-138 22 moveto 
1 -1 scale
(Frequency [Hz, log-scaled]) t 
GR
GR
GS
0.149 GC
2 setlinecap
1 LJ
0.5 LW
N
68.5 622 M
68.5 403 L
S
GR
GS
0.149 GC
2 setlinecap
1 LJ
0.5 LW
N
68.5 622 M
71.275 622 L
S
GR
GS
0.149 GC
2 setlinecap
1 LJ
0.5 LW
N
68.5 567.25 M
71.275 567.25 L
S
GR
GS
0.149 GC
2 setlinecap
1 LJ
0.5 LW
N
68.5 512.5 M
71.275 512.5 L
S
GR
GS
0.149 GC
2 setlinecap
1 LJ
0.5 LW
N
68.5 457.75 M
71.275 457.75 L
S
GR
GS
0.149 GC
2 setlinecap
1 LJ
0.5 LW
N
68.5 403 M
71.275 403 L
S
GR
GS
[1 0 0 1 61.9 622] CT
0.149 GC
/Helvetica 23 F
GS
[1 0 0 1 0 0] CT
-13 8.5 moveto 
1 -1 scale
(0) t 
GR
GR
GS
[1 0 0 1 61.9 567.25] CT
0.149 GC
/Helvetica 23 F
GS
[1 0 0 1 0 0] CT
-32 8.5 moveto 
1 -1 scale
(0.5) t 
GR
GR
GS
[1 0 0 1 61.9 512.5] CT
0.149 GC
/Helvetica 23 F
GS
[1 0 0 1 0 0] CT
-13 8.5 moveto 
1 -1 scale
(1) t 
GR
GR
GS
[1 0 0 1 61.9 457.75] CT
0.149 GC
/Helvetica 23 F
GS
[1 0 0 1 0 0] CT
-32 8.5 moveto 
1 -1 scale
(1.5) t 
GR
GR
GS
[1 0 0 1 61.9 403] CT
0.149 GC
/Helvetica 23 F
GS
[1 0 0 1 0 0] CT
-13 8.5 moveto 
1 -1 scale
(2) t 
GR
GR
GS
[0 -1 1 0 26.9 512.49988] CT
0.149 GC
/Helvetica 23 F
GS
[1 0 0 1 0 0] CT
-33 -5 moveto 
1 -1 scale
(Power) t 
GR
GR
GS
[1 0 0 1 69 398] CT
0.149 GC
N
3.375 -0.656 M
3.375 -0.844 3.5 -0.984 QT
8.281 -5.75 L
3.5 -10.531 L
3.375 -10.641 3.375 -10.844 QT
3.375 -11 3.516 -11.148 QT
3.656 -11.297 3.844 -11.297 QT
4 -11.297 4.188 -11.156 QT
8.953 -6.391 L
13.688 -11.156 L
13.875 -11.297 14.031 -11.297 QT
14.219 -11.297 14.352 -11.164 QT
14.484 -11.031 14.484 -10.844 QT
14.484 -10.641 14.375 -10.531 QT
9.594 -5.75 L
14.375 -0.984 L
14.484 -0.844 14.484 -0.656 QT
14.484 -0.469 14.352 -0.336 QT
14.219 -0.203 14.031 -0.203 QT
13.859 -0.203 13.688 -0.375 QT
8.953 -5.109 L
4.188 -0.375 L
4.016 -0.203 3.844 -0.203 QT
3.656 -0.203 3.516 -0.352 QT
3.375 -0.5 3.375 -0.656 QT
cp
f
GR
GS
[1 0 0 1 87 398] CT
0.149 GC
/Helvetica 23 F
GS
[1 0 0 1 0 0] CT
0 0 moveto 
1 -1 scale
(10) t 
GR
GR
GS
[1 0 0 1 113 387] CT
0.149 GC
/Helvetica 18.4 F
GS
[1 0 0 1 0 0] CT
0 0 moveto 
1 -1 scale
(-8) t 
GR
GR
GS
[1 0 0 1 235.2502 400.125] CT
/Helvetica-Bold 23 F
GS
[1 0 0 1 0 0] CT
-90.5 -5 moveto 
1 -1 scale
(Power spectrum) t 
GR
GR
GS
1 0.91 0.91 RC
N
324.993 526.054 M
319.059 536.901 L
310.909 547.522 L
303.513 554.057 L
296.742 560.421 L
290.5 565.905 L
282.869 570.749 L
275.902 573.842 L
269.493 575.532 L
262.142 577.081 L
255.409 577.948 L
249.199 577.716 L
242.332 573.008 L
235 560.701 L
228.284 527.018 L
221.24 439.134 L
213.993 430.183 L
207.347 527.859 L
200.557 566.034 L
193.104 591.005 L
186.285 595.564 L
179.5 597.013 L
172.784 596.223 L
165.74 595.741 L
158.878 596.107 L
151.847 599.927 L
144.733 603.657 L
137.901 606.421 L
131.058 607.763 L
124 609.104 L
117.054 609.506 L
110.03 609.36 L
103.185 609.802 L
96.17 610.521 L
89.233 611.305 L
82.401 611.877 L
75.421 612.357 L
68.5 612.741 L
68.5 614.639 L
75.421 614.227 L
82.401 613.794 L
89.233 613.297 L
96.17 612.73 L
103.185 612.206 L
110.03 611.797 L
117.054 611.813 L
124 611.31 L
131.058 610.375 L
137.901 609.222 L
144.733 606.797 L
151.847 603.533 L
158.878 600.236 L
165.74 599.205 L
172.784 599.684 L
179.5 600.415 L
186.285 599.036 L
193.104 595.421 L
200.557 578.416 L
207.347 549.035 L
213.993 484.701 L
221.24 499.043 L
228.284 549.35 L
235 573.202 L
242.332 581.933 L
249.199 584.923 L
255.409 584.927 L
262.142 584.223 L
269.493 582.771 L
275.902 581.326 L
282.869 578.939 L
290.5 574.954 L
296.742 570.613 L
303.513 565.417 L
310.909 560.154 L
319.059 552.049 L
324.993 543.652 L
331.402 532.584 L
338.369 519.035 L
346 503.159 L
346 470.004 L
338.369 493.112 L
331.402 511.756 L
cp
f
GR
GS
1 0.549 0.549 RC
1 LJ
0.5 LW
N
346 470.004 M
338.369 493.112 L
331.402 511.756 L
324.993 526.054 L
319.059 536.901 L
310.909 547.522 L
303.513 554.057 L
296.742 560.421 L
290.5 565.905 L
282.869 570.749 L
275.902 573.842 L
269.493 575.532 L
262.142 577.081 L
255.409 577.948 L
249.199 577.716 L
242.332 573.008 L
235 560.701 L
228.284 527.018 L
221.24 439.134 L
213.993 430.183 L
207.347 527.859 L
200.557 566.034 L
193.104 591.005 L
186.285 595.564 L
179.5 597.013 L
172.784 596.223 L
165.74 595.741 L
158.878 596.107 L
151.847 599.927 L
144.733 603.657 L
137.901 606.421 L
131.058 607.763 L
124 609.104 L
117.054 609.506 L
110.03 609.36 L
103.185 609.802 L
96.17 610.521 L
89.233 611.305 L
82.401 611.877 L
75.421 612.357 L
68.5 612.741 L
S
GR
GS
1 0.549 0.549 RC
1 LJ
0.5 LW
N
346 503.159 M
338.369 519.035 L
331.402 532.584 L
324.993 543.652 L
319.059 552.049 L
310.909 560.154 L
303.513 565.417 L
296.742 570.613 L
290.5 574.954 L
282.869 578.939 L
275.902 581.326 L
269.493 582.771 L
262.142 584.223 L
255.409 584.927 L
249.199 584.923 L
242.332 581.933 L
235 573.202 L
228.284 549.35 L
221.24 499.043 L
213.993 484.701 L
207.347 549.035 L
200.557 578.416 L
193.104 595.421 L
186.285 599.036 L
179.5 600.415 L
172.784 599.684 L
165.74 599.205 L
158.878 600.236 L
151.847 603.533 L
144.733 606.797 L
137.901 609.222 L
131.058 610.375 L
124 611.31 L
117.054 611.813 L
110.03 611.797 L
103.185 612.206 L
96.17 612.73 L
89.233 613.297 L
82.401 613.794 L
75.421 614.227 L
68.5 614.639 L
S
GR
GS
1 0 0 RC
1 LJ
3 LW
N
346 486.581 M
338.369 506.074 L
331.402 522.17 L
324.993 534.853 L
319.059 544.475 L
310.909 553.838 L
303.513 559.737 L
296.742 565.517 L
290.5 570.429 L
282.869 574.844 L
275.902 577.584 L
269.493 579.152 L
262.142 580.652 L
255.409 581.437 L
249.199 581.32 L
242.332 577.47 L
235 566.951 L
228.284 538.184 L
221.24 469.088 L
213.993 457.442 L
207.347 538.447 L
200.557 572.225 L
193.104 593.213 L
186.285 597.3 L
179.5 598.714 L
172.784 597.953 L
165.74 597.473 L
158.878 598.172 L
151.847 601.73 L
144.733 605.227 L
137.901 607.822 L
131.058 609.069 L
124 610.207 L
117.054 610.659 L
110.03 610.578 L
103.185 611.004 L
96.17 611.626 L
89.233 612.301 L
82.401 612.835 L
75.421 613.292 L
68.5 613.69 L
S
GR
GS
0.91 GC
N
324.993 548.534 M
319.059 556.262 L
310.909 564.706 L
303.513 571.562 L
296.742 576.902 L
290.5 580.666 L
282.869 584.838 L
275.902 587.29 L
269.493 589.39 L
262.142 591.226 L
255.409 590.643 L
249.199 587.239 L
242.332 576.903 L
235 573.042 L
228.284 568.047 L
221.24 561.776 L
213.993 565.383 L
207.347 579.568 L
200.557 585.367 L
193.104 586.216 L
186.285 583.912 L
179.5 582.015 L
172.784 581.029 L
165.74 580.019 L
158.878 579.73 L
151.847 580.066 L
144.733 581.086 L
137.901 585.911 L
131.058 589.259 L
124 592.001 L
117.054 593.623 L
110.03 592.025 L
103.185 590.653 L
96.17 590.451 L
89.233 591.097 L
82.401 592.914 L
75.421 593.437 L
68.5 596.066 L
68.5 602.672 L
75.421 600.815 L
82.401 600.317 L
89.233 598.669 L
96.17 597.792 L
103.185 597.805 L
110.03 598.716 L
117.054 599.648 L
124 598.364 L
131.058 596.547 L
137.901 593.686 L
144.733 590.073 L
151.847 588.292 L
158.878 587.718 L
165.74 587.525 L
172.784 588.1 L
179.5 589.232 L
186.285 590.375 L
193.104 592.104 L
200.557 591.08 L
207.347 587.572 L
213.993 580.285 L
221.24 575.845 L
228.284 580.463 L
235 585.654 L
242.332 591.975 L
249.199 596.593 L
255.409 597.592 L
262.142 597.466 L
269.493 596.011 L
275.902 594.404 L
282.869 592.273 L
290.5 588.825 L
296.742 585.74 L
303.513 581.83 L
310.909 576.764 L
319.059 570.196 L
324.993 564.259 L
331.402 555.956 L
338.369 545.594 L
346 533.824 L
346 505.902 L
338.369 523.083 L
331.402 537.431 L
cp
f
GR
GS
0.549 GC
1 LJ
0.5 LW
N
346 505.902 M
338.369 523.083 L
331.402 537.431 L
324.993 548.534 L
319.059 556.262 L
310.909 564.706 L
303.513 571.562 L
296.742 576.902 L
290.5 580.666 L
282.869 584.838 L
275.902 587.29 L
269.493 589.39 L
262.142 591.226 L
255.409 590.643 L
249.199 587.239 L
242.332 576.903 L
235 573.042 L
228.284 568.047 L
221.24 561.776 L
213.993 565.383 L
207.347 579.568 L
200.557 585.367 L
193.104 586.216 L
186.285 583.912 L
179.5 582.015 L
172.784 581.029 L
165.74 580.019 L
158.878 579.73 L
151.847 580.066 L
144.733 581.086 L
137.901 585.911 L
131.058 589.259 L
124 592.001 L
117.054 593.623 L
110.03 592.025 L
103.185 590.653 L
96.17 590.451 L
89.233 591.097 L
82.401 592.914 L
75.421 593.437 L
68.5 596.066 L
S
GR
GS
0.549 GC
1 LJ
0.5 LW
N
346 533.824 M
338.369 545.594 L
331.402 555.956 L
324.993 564.259 L
319.059 570.196 L
310.909 576.764 L
303.513 581.83 L
296.742 585.74 L
290.5 588.825 L
282.869 592.273 L
275.902 594.404 L
269.493 596.011 L
262.142 597.466 L
255.409 597.592 L
249.199 596.593 L
242.332 591.975 L
235 585.654 L
228.284 580.463 L
221.24 575.845 L
213.993 580.285 L
207.347 587.572 L
200.557 591.08 L
193.104 592.104 L
186.285 590.375 L
179.5 589.232 L
172.784 588.1 L
165.74 587.525 L
158.878 587.718 L
151.847 588.292 L
144.733 590.073 L
137.901 593.686 L
131.058 596.547 L
124 598.364 L
117.054 599.648 L
110.03 598.716 L
103.185 597.805 L
96.17 597.792 L
89.233 598.669 L
82.401 600.317 L
75.421 600.815 L
68.5 602.672 L
S
GR
GS
1 LJ
3 LW
N
346 519.863 M
338.369 534.338 L
331.402 546.694 L
324.993 556.397 L
319.059 563.229 L
310.909 570.735 L
303.513 576.696 L
296.742 581.321 L
290.5 584.745 L
282.869 588.555 L
275.902 590.847 L
269.493 592.701 L
262.142 594.346 L
255.409 594.118 L
249.199 591.916 L
242.332 584.439 L
235 579.348 L
228.284 574.255 L
221.24 568.81 L
213.993 572.834 L
207.347 583.57 L
200.557 588.224 L
193.104 589.16 L
186.285 587.143 L
179.5 585.623 L
172.784 584.565 L
165.74 583.772 L
158.878 583.724 L
151.847 584.179 L
144.733 585.58 L
137.901 589.799 L
131.058 592.903 L
124 595.182 L
117.054 596.635 L
110.03 595.37 L
103.185 594.229 L
96.17 594.122 L
89.233 594.883 L
82.401 596.616 L
75.421 597.126 L
68.5 599.369 L
S
GR
%%Trailer
%%Pages: 1
%%EOF
