%!PS-Adobe-3.0 EPSF-3.0
%%Creator: (MATLAB, The Mathworks, Inc. Version 9.3.0.713579 \(R2017b\). Operating System: Mac OS X)
%%Title: /Volumes/LNDG/Projects/StateSwitch/dynamic/data/eeg/rest/B_analyses/A_MSE_CSD_multiVariant/C_figures/F4_FastScalePSDassociation_byMethod.eps
%%CreationDate: 2020-03-16T16:55:23
%%Pages: (atend)
%%BoundingBox:   131    24  1181   556
%%LanguageLevel: 3
%%EndComments
%%BeginProlog
%%BeginResource: procset (Apache XML Graphics Std ProcSet) 1.2 0
%%Version: 1.2 0
%%Copyright: (Copyright 2001-2003,2010 The Apache Software Foundation. License terms: http://www.apache.org/licenses/LICENSE-2.0)
/bd{bind def}bind def
/ld{load def}bd
/GR/grestore ld
/GS/gsave ld
/RM/rmoveto ld
/C/curveto ld
/t/show ld
/L/lineto ld
/ML/setmiterlimit ld
/CT/concat ld
/f/fill ld
/N/newpath ld
/S/stroke ld
/CC/setcmykcolor ld
/A/ashow ld
/cp/closepath ld
/RC/setrgbcolor ld
/LJ/setlinejoin ld
/GC/setgray ld
/LW/setlinewidth ld
/M/moveto ld
/re {4 2 roll M
1 index 0 rlineto
0 exch rlineto
neg 0 rlineto
cp } bd
/_ctm matrix def
/_tm matrix def
/BT { _ctm currentmatrix pop matrix _tm copy pop 0 0 moveto } bd
/ET { _ctm setmatrix } bd
/iTm { _ctm setmatrix _tm concat } bd
/Tm { _tm astore pop iTm 0 0 moveto } bd
/ux 0.0 def
/uy 0.0 def
/F {
  /Tp exch def
  /Tf exch def
  Tf findfont Tp scalefont setfont
  /cf Tf def  /cs Tp def
} bd
/ULS {currentpoint /uy exch def /ux exch def} bd
/ULE {
  /Tcx currentpoint pop def
  gsave
  newpath
  cf findfont cs scalefont dup
  /FontMatrix get 0 get /Ts exch def /FontInfo get dup
  /UnderlinePosition get Ts mul /To exch def
  /UnderlineThickness get Ts mul /Tt exch def
  ux uy To add moveto  Tcx uy To add lineto
  Tt setlinewidth stroke
  grestore
} bd
/OLE {
  /Tcx currentpoint pop def
  gsave
  newpath
  cf findfont cs scalefont dup
  /FontMatrix get 0 get /Ts exch def /FontInfo get dup
  /UnderlinePosition get Ts mul /To exch def
  /UnderlineThickness get Ts mul /Tt exch def
  ux uy To add cs add moveto Tcx uy To add cs add lineto
  Tt setlinewidth stroke
  grestore
} bd
/SOE {
  /Tcx currentpoint pop def
  gsave
  newpath
  cf findfont cs scalefont dup
  /FontMatrix get 0 get /Ts exch def /FontInfo get dup
  /UnderlinePosition get Ts mul /To exch def
  /UnderlineThickness get Ts mul /Tt exch def
  ux uy To add cs 10 mul 26 idiv add moveto Tcx uy To add cs 10 mul 26 idiv add lineto
  Tt setlinewidth stroke
  grestore
} bd
/QT {
/Y22 exch store
/X22 exch store
/Y21 exch store
/X21 exch store
currentpoint
/Y21 load 2 mul add 3 div exch
/X21 load 2 mul add 3 div exch
/X21 load 2 mul /X22 load add 3 div
/Y21 load 2 mul /Y22 load add 3 div
/X22 load /Y22 load curveto
} bd
/SSPD {
dup length /d exch dict def
{
/v exch def
/k exch def
currentpagedevice k known {
/cpdv currentpagedevice k get def
v cpdv ne {
/upd false def
/nullv v type /nulltype eq def
/nullcpdv cpdv type /nulltype eq def
nullv nullcpdv or
{
/upd true def
} {
/sametype v type cpdv type eq def
sametype {
v type /arraytype eq {
/vlen v length def
/cpdvlen cpdv length def
vlen cpdvlen eq {
0 1 vlen 1 sub {
/i exch def
/obj v i get def
/cpdobj cpdv i get def
obj cpdobj ne {
/upd true def
exit
} if
} for
} {
/upd true def
} ifelse
} {
v type /dicttype eq {
v {
/dv exch def
/dk exch def
/cpddv cpdv dk get def
dv cpddv ne {
/upd true def
exit
} if
} forall
} {
/upd true def
} ifelse
} ifelse
} if
} ifelse
upd true eq {
d k v put
} if
} if
} if
} forall
d length 0 gt {
d setpagedevice
} if
} bd
/RE { % /NewFontName [NewEncodingArray] /FontName RE -
  findfont dup length dict begin
  {
    1 index /FID ne
    {def} {pop pop} ifelse
  } forall
  /Encoding exch def
  /FontName 1 index def
  currentdict definefont pop
  end
} bind def
%%EndResource
%%BeginResource: procset (Apache XML Graphics EPS ProcSet) 1.0 0
%%Version: 1.0 0
%%Copyright: (Copyright 2002-2003 The Apache Software Foundation. License terms: http://www.apache.org/licenses/LICENSE-2.0)
/BeginEPSF { %def
/b4_Inc_state save def         % Save state for cleanup
/dict_count countdictstack def % Count objects on dict stack
/op_count count 1 sub def      % Count objects on operand stack
userdict begin                 % Push userdict on dict stack
/showpage { } def              % Redefine showpage, { } = null proc
0 setgray 0 setlinecap         % Prepare graphics state
1 setlinewidth 0 setlinejoin
10 setmiterlimit [ ] 0 setdash newpath
/languagelevel where           % If level not equal to 1 then
{pop languagelevel             % set strokeadjust and
1 ne                           % overprint to their defaults.
{false setstrokeadjust false setoverprint
} if
} if
} bd
/EndEPSF { %def
count op_count sub {pop} repeat            % Clean up stacks
countdictstack dict_count sub {end} repeat
b4_Inc_state restore
} bd
%%EndResource
%FOPBeginFontDict
%%IncludeResource: font Courier-Oblique
%%IncludeResource: font Courier-BoldOblique
%%IncludeResource: font Courier-Bold
%%IncludeResource: font ZapfDingbats
%%IncludeResource: font Symbol
%%IncludeResource: font Helvetica
%%IncludeResource: font Helvetica-Oblique
%%IncludeResource: font Helvetica-Bold
%%IncludeResource: font Helvetica-BoldOblique
%%IncludeResource: font Times-Roman
%%IncludeResource: font Times-Italic
%%IncludeResource: font Times-Bold
%%IncludeResource: font Times-BoldItalic
%%IncludeResource: font Courier
%FOPEndFontDict
%%BeginResource: encoding WinAnsiEncoding
/WinAnsiEncoding [
/.notdef /.notdef /.notdef /.notdef /.notdef
/.notdef /.notdef /.notdef /.notdef /.notdef
/.notdef /.notdef /.notdef /.notdef /.notdef
/.notdef /.notdef /.notdef /.notdef /.notdef
/.notdef /.notdef /.notdef /.notdef /.notdef
/.notdef /.notdef /.notdef /.notdef /.notdef
/.notdef /.notdef /space /exclam /quotedbl
/numbersign /dollar /percent /ampersand /quotesingle
/parenleft /parenright /asterisk /plus /comma
/hyphen /period /slash /zero /one
/two /three /four /five /six
/seven /eight /nine /colon /semicolon
/less /equal /greater /question /at
/A /B /C /D /E
/F /G /H /I /J
/K /L /M /N /O
/P /Q /R /S /T
/U /V /W /X /Y
/Z /bracketleft /backslash /bracketright /asciicircum
/underscore /quoteleft /a /b /c
/d /e /f /g /h
/i /j /k /l /m
/n /o /p /q /r
/s /t /u /v /w
/x /y /z /braceleft /bar
/braceright /asciitilde /bullet /Euro /bullet
/quotesinglbase /florin /quotedblbase /ellipsis /dagger
/daggerdbl /circumflex /perthousand /Scaron /guilsinglleft
/OE /bullet /Zcaron /bullet /bullet
/quoteleft /quoteright /quotedblleft /quotedblright /bullet
/endash /emdash /asciitilde /trademark /scaron
/guilsinglright /oe /bullet /zcaron /Ydieresis
/space /exclamdown /cent /sterling /currency
/yen /brokenbar /section /dieresis /copyright
/ordfeminine /guillemotleft /logicalnot /sfthyphen /registered
/macron /degree /plusminus /twosuperior /threesuperior
/acute /mu /paragraph /middot /cedilla
/onesuperior /ordmasculine /guillemotright /onequarter /onehalf
/threequarters /questiondown /Agrave /Aacute /Acircumflex
/Atilde /Adieresis /Aring /AE /Ccedilla
/Egrave /Eacute /Ecircumflex /Edieresis /Igrave
/Iacute /Icircumflex /Idieresis /Eth /Ntilde
/Ograve /Oacute /Ocircumflex /Otilde /Odieresis
/multiply /Oslash /Ugrave /Uacute /Ucircumflex
/Udieresis /Yacute /Thorn /germandbls /agrave
/aacute /acircumflex /atilde /adieresis /aring
/ae /ccedilla /egrave /eacute /ecircumflex
/edieresis /igrave /iacute /icircumflex /idieresis
/eth /ntilde /ograve /oacute /ocircumflex
/otilde /odieresis /divide /oslash /ugrave
/uacute /ucircumflex /udieresis /yacute /thorn
/ydieresis
] def
%%EndResource
%FOPBeginFontReencode
/Courier-Oblique findfont
dup length dict begin
  {1 index /FID ne {def} {pop pop} ifelse} forall
  /Encoding WinAnsiEncoding def
  currentdict
end
/Courier-Oblique exch definefont pop
/Courier-BoldOblique findfont
dup length dict begin
  {1 index /FID ne {def} {pop pop} ifelse} forall
  /Encoding WinAnsiEncoding def
  currentdict
end
/Courier-BoldOblique exch definefont pop
/Courier-Bold findfont
dup length dict begin
  {1 index /FID ne {def} {pop pop} ifelse} forall
  /Encoding WinAnsiEncoding def
  currentdict
end
/Courier-Bold exch definefont pop
/Helvetica findfont
dup length dict begin
  {1 index /FID ne {def} {pop pop} ifelse} forall
  /Encoding WinAnsiEncoding def
  currentdict
end
/Helvetica exch definefont pop
/Helvetica-Oblique findfont
dup length dict begin
  {1 index /FID ne {def} {pop pop} ifelse} forall
  /Encoding WinAnsiEncoding def
  currentdict
end
/Helvetica-Oblique exch definefont pop
/Helvetica-Bold findfont
dup length dict begin
  {1 index /FID ne {def} {pop pop} ifelse} forall
  /Encoding WinAnsiEncoding def
  currentdict
end
/Helvetica-Bold exch definefont pop
/Helvetica-BoldOblique findfont
dup length dict begin
  {1 index /FID ne {def} {pop pop} ifelse} forall
  /Encoding WinAnsiEncoding def
  currentdict
end
/Helvetica-BoldOblique exch definefont pop
/Times-Roman findfont
dup length dict begin
  {1 index /FID ne {def} {pop pop} ifelse} forall
  /Encoding WinAnsiEncoding def
  currentdict
end
/Times-Roman exch definefont pop
/Times-Italic findfont
dup length dict begin
  {1 index /FID ne {def} {pop pop} ifelse} forall
  /Encoding WinAnsiEncoding def
  currentdict
end
/Times-Italic exch definefont pop
/Times-Bold findfont
dup length dict begin
  {1 index /FID ne {def} {pop pop} ifelse} forall
  /Encoding WinAnsiEncoding def
  currentdict
end
/Times-Bold exch definefont pop
/Times-BoldItalic findfont
dup length dict begin
  {1 index /FID ne {def} {pop pop} ifelse} forall
  /Encoding WinAnsiEncoding def
  currentdict
end
/Times-BoldItalic exch definefont pop
/Courier findfont
dup length dict begin
  {1 index /FID ne {def} {pop pop} ifelse} forall
  /Encoding WinAnsiEncoding def
  currentdict
end
/Courier exch definefont pop
%FOPEndFontReencode
%%EndProlog
%%Page: 1 1
%%PageBoundingBox: 0 0 1280 576
%%BeginPageSetup
[1 0 0 -1 0 576] CT
%%EndPageSetup
GS
1 GC
N
0 0 1280 576 re
f
GR
GS
1 GC
N
0 0 1280 576 re
f
GR
GS
1 GC
N
166.5 239.5 M
439.5 239.5 L
439.5 54.5 L
166.5 54.5 L
cp
f
GR
GS
0.149 GC
2 setlinecap
1 LJ
0.5 LW
N
166.5 239.5 M
439.5 239.5 L
S
GR
GS
0.149 GC
2 setlinecap
1 LJ
0.5 LW
N
166.5 239.5 M
166.5 236.77 L
S
GR
GS
0.149 GC
2 setlinecap
1 LJ
0.5 LW
N
221.1 239.5 M
221.1 236.77 L
S
GR
GS
0.149 GC
2 setlinecap
1 LJ
0.5 LW
N
275.7 239.5 M
275.7 236.77 L
S
GR
GS
0.149 GC
2 setlinecap
1 LJ
0.5 LW
N
330.3 239.5 M
330.3 236.77 L
S
GR
GS
0.149 GC
2 setlinecap
1 LJ
0.5 LW
N
384.9 239.5 M
384.9 236.77 L
S
GR
GS
0.149 GC
2 setlinecap
1 LJ
0.5 LW
N
439.5 239.5 M
439.5 236.77 L
S
GR
GS
[1 0 0 1 166.5 244.3] CT
0.149 GC
/Helvetica 14 F
GS
[1 0 0 1 0 0] CT
-4 14 moveto 
1 -1 scale
(0) t 
GR
GR
GS
[1 0 0 1 221.10001 244.3] CT
0.149 GC
/Helvetica 14 F
GS
[1 0 0 1 0 0] CT
-10 14 moveto 
1 -1 scale
(0.2) t 
GR
GR
GS
[1 0 0 1 275.70001 244.3] CT
0.149 GC
/Helvetica 14 F
GS
[1 0 0 1 0 0] CT
-10 14 moveto 
1 -1 scale
(0.4) t 
GR
GR
GS
[1 0 0 1 330.30002 244.3] CT
0.149 GC
/Helvetica 14 F
GS
[1 0 0 1 0 0] CT
-10 14 moveto 
1 -1 scale
(0.6) t 
GR
GR
GS
[1 0 0 1 384.89999 244.3] CT
0.149 GC
/Helvetica 14 F
GS
[1 0 0 1 0 0] CT
-10 14 moveto 
1 -1 scale
(0.8) t 
GR
GR
GS
[1 0 0 1 439.5 244.3] CT
0.149 GC
/Helvetica 14 F
GS
[1 0 0 1 0 0] CT
-4 14 moveto 
1 -1 scale
(1) t 
GR
GR
GS
[1 0 0 1 303.00012 261.79999] CT
0.149 GC
/Helvetica 14 F
GS
[1 0 0 1 0 0] CT
-127 14 moveto 
1 -1 scale
(Original MSE : Scales 1-3 \(> 50 Hz; Fine\)) t 
GR
GR
GS
0.149 GC
2 setlinecap
1 LJ
0.5 LW
N
166.5 239.5 M
166.5 54.5 L
S
GR
GS
0.149 GC
2 setlinecap
1 LJ
0.5 LW
N
166.5 205.241 M
169.23 205.241 L
S
GR
GS
0.149 GC
2 setlinecap
1 LJ
0.5 LW
N
166.5 136.722 M
169.23 136.722 L
S
GR
GS
0.149 GC
2 setlinecap
1 LJ
0.5 LW
N
166.5 68.204 M
169.23 68.204 L
S
GR
GS
[1 0 0 1 161.7 205.24074] CT
0.149 GC
/Helvetica 14 F
GS
[1 0 0 1 0 0] CT
-14 5.5 moveto 
1 -1 scale
(-2) t 
GR
GR
GS
[1 0 0 1 161.7 136.72223] CT
0.149 GC
/Helvetica 14 F
GS
[1 0 0 1 0 0] CT
-14 5.5 moveto 
1 -1 scale
(-1) t 
GR
GR
GS
[1 0 0 1 161.7 68.2037] CT
0.149 GC
/Helvetica 14 F
GS
[1 0 0 1 0 0] CT
-8 5.5 moveto 
1 -1 scale
(0) t 
GR
GR
GS
[0 -1 1 0 145.2 146.99991] CT
0.149 GC
/Helvetica 14 F
GS
[1 0 0 1 0 0] CT
-108 -3 moveto 
1 -1 scale
(PSD Slope 2-64 Hz \(excl. 7-13 Hz\)) t 
GR
GR
GS
[1 0 0 1 303.00031 52.75] CT
/Helvetica-Bold 14 F
GS
[1 0 0 1 0 0] CT
-132.5 -22 moveto 
1 -1 scale
(Relation between MSE and PSD slopes:) t 
GR
GR
GS
[1 0 0 1 303.00031 52.75] CT
/Helvetica-Bold 14 F
GS
[1 0 0 1 0 0] CT
-133 -4 moveto 
1 -1 scale
(Original MSE : Scales 1-3 \(> 50 Hz; Fine\)) t 
GR
GR
GS
[1 0 0 1 297.49768 130.62007] CT
1 0 0 RC
N
3.536 0 M
3.536 -1.953 1.953 -3.536 0 -3.536 C
-1.953 -3.536 -3.536 -1.953 -3.536 0 C
-3.536 1.953 -1.953 3.536 0 3.536 C
1.953 3.536 3.536 1.953 3.536 0 C
f
GR
GS
[1 0 0 1 317.72482 135.3145] CT
1 0 0 RC
N
/f-1686801894{3.536 0 M
3.536 -1.953 1.953 -3.536 0 -3.536 C
-1.953 -3.536 -3.536 -1.953 -3.536 0 C
-3.536 1.953 -1.953 3.536 0 3.536 C
1.953 3.536 3.536 1.953 3.536 0 C}def
f-1686801894
f
GR
GS
[1 0 0 1 302.7485 118.86119] CT
1 0 0 RC
N
f-1686801894
f
GR
GS
[1 0 0 1 350.19278 107.04343] CT
1 0 0 RC
N
f-1686801894
f
GR
GS
[1 0 0 1 336.90302 130.40262] CT
1 0 0 RC
N
f-1686801894
f
GR
GS
[1 0 0 1 219.10863 149.28613] CT
1 0 0 RC
N
f-1686801894
f
GR
GS
[1 0 0 1 279.97897 146.08743] CT
1 0 0 RC
N
f-1686801894
f
GR
GS
[1 0 0 1 353.32379 120.87254] CT
1 0 0 RC
N
f-1686801894
f
GR
GS
[1 0 0 1 376.7706 111.86026] CT
1 0 0 RC
N
f-1686801894
f
GR
GS
[1 0 0 1 287.2749 143.66466] CT
1 0 0 RC
N
f-1686801894
f
GR
GS
[1 0 0 1 264.12772 169.98582] CT
1 0 0 RC
N
f-1686801894
f
GR
GS
[1 0 0 1 312.74811 140.49651] CT
1 0 0 RC
N
f-1686801894
f
GR
GS
[1 0 0 1 250.32861 138.45741] CT
1 0 0 RC
N
f-1686801894
f
GR
GS
[1 0 0 1 275.42456 162.72838] CT
1 0 0 RC
N
f-1686801894
f
GR
GS
[1 0 0 1 299.84744 137.4642] CT
1 0 0 RC
N
f-1686801894
f
GR
GS
[1 0 0 1 310.78894 141.74461] CT
1 0 0 RC
N
f-1686801894
f
GR
GS
[1 0 0 1 305.52469 139.79733] CT
1 0 0 RC
N
f-1686801894
f
GR
GS
[1 0 0 1 327.9064 137.26244] CT
1 0 0 RC
N
f-1686801894
f
GR
GS
[1 0 0 1 301.91638 138.38037] CT
1 0 0 RC
N
f-1686801894
f
GR
GS
[1 0 0 1 342.16013 129.47543] CT
1 0 0 RC
N
f-1686801894
f
GR
GS
[1 0 0 1 367.56662 114.27494] CT
1 0 0 RC
N
f-1686801894
f
GR
GS
[1 0 0 1 306.64703 140.38155] CT
1 0 0 RC
N
f-1686801894
f
GR
GS
[1 0 0 1 350.72922 110.75153] CT
1 0 0 RC
N
f-1686801894
f
GR
GS
[1 0 0 1 360.0148 82.28994] CT
1 0 0 RC
N
f-1686801894
f
GR
GS
[1 0 0 1 303.67261 140.80724] CT
1 0 0 RC
N
f-1686801894
f
GR
GS
[1 0 0 1 278.02646 144.18971] CT
1 0 0 RC
N
f-1686801894
f
GR
GS
[1 0 0 1 234.96431 155.69751] CT
1 0 0 RC
N
f-1686801894
f
GR
GS
[1 0 0 1 304.00363 109.66177] CT
1 0 0 RC
N
f-1686801894
f
GR
GS
[1 0 0 1 297.35672 145.67627] CT
1 0 0 RC
N
f-1686801894
f
GR
GS
[1 0 0 1 329.04816 115.25961] CT
1 0 0 RC
N
f-1686801894
f
GR
GS
[1 0 0 1 250.38228 163.65807] CT
1 0 0 RC
N
f-1686801894
f
GR
GS
[1 0 0 1 357.27319 126.39782] CT
1 0 0 RC
N
f-1686801894
f
GR
GS
[1 0 0 1 359.53912 124.89211] CT
1 0 0 RC
N
f-1686801894
f
GR
GS
[1 0 0 1 294.92587 153.03322] CT
1 0 0 RC
N
f-1686801894
f
GR
GS
[1 0 0 1 310.07855 123.47342] CT
1 0 0 RC
N
f-1686801894
f
GR
GS
[1 0 0 1 250.36008 163.32764] CT
1 0 0 RC
N
f-1686801894
f
GR
GS
[1 0 0 1 297.51019 138.27086] CT
1 0 0 RC
N
f-1686801894
f
GR
GS
[1 0 0 1 296.24445 152.37051] CT
1 0 0 RC
N
f-1686801894
f
GR
GS
[1 0 0 1 304.59277 139.77351] CT
1 0 0 RC
N
f-1686801894
f
GR
GS
[1 0 0 1 262.58383 153.08203] CT
1 0 0 RC
N
f-1686801894
f
GR
GS
[1 0 0 1 391.76553 97.30172] CT
1 0 0 RC
N
f-1686801894
f
GR
GS
[1 0 0 1 357.58923 123.21702] CT
1 0 0 RC
N
f-1686801894
f
GR
GS
[1 0 0 1 387.27557 91.69243] CT
1 0 0 RC
N
f-1686801894
f
GR
GS
[1 0 0 1 340.31085 134.85323] CT
1 0 0 RC
N
f-1686801894
f
GR
GS
[1 0 0 1 324.63562 149.39395] CT
1 0 0 RC
N
f-1686801894
f
GR
GS
[1 0 0 1 311.54337 144.84904] CT
1 0 0 RC
N
f-1686801894
f
GR
GS
[1 0 0 1 380.37967 91.91753] CT
1 0 0 RC
N
f-1686801894
f
GR
GS
1 0 0 RC
1 LJ
3 LW
N
297.498 139.402 M
317.725 131.42 L
302.749 137.33 L
350.193 118.607 L
336.903 123.851 L
219.109 170.338 L
279.979 146.316 L
353.324 117.371 L
376.771 108.118 L
287.275 143.437 L
264.128 152.572 L
312.748 133.384 L
250.329 158.017 L
275.425 148.113 L
299.847 138.475 L
310.789 134.157 L
305.525 136.235 L
327.906 127.402 L
301.916 137.659 L
342.16 121.777 L
367.567 111.75 L
306.647 135.792 L
350.729 118.395 L
360.015 114.73 L
303.673 136.965 L
278.026 147.087 L
234.964 164.081 L
304.004 136.835 L
297.357 139.458 L
329.048 126.951 L
250.382 157.996 L
357.273 115.812 L
359.539 114.918 L
294.926 140.417 L
310.079 134.437 L
250.36 158.005 L
297.51 139.397 L
296.244 139.897 L
304.593 136.602 L
262.584 153.181 L
391.766 102.2 L
357.589 115.688 L
387.276 103.972 L
340.311 122.506 L
324.636 128.693 L
311.543 133.859 L
380.38 106.694 L
S
GR
GS
[1 0 0 1 363.67365 109.18364] CT
N
f-1686801894
f
GR
GS
[1 0 0 1 313.58398 107.6246] CT
N
f-1686801894
f
GR
GS
[1 0 0 1 330.03601 132.03119] CT
N
f-1686801894
f
GR
GS
[1 0 0 1 400.88339 92.44123] CT
N
f-1686801894
f
GR
GS
[1 0 0 1 369.66956 91.32128] CT
N
f-1686801894
f
GR
GS
[1 0 0 1 334.14542 124.44925] CT
N
f-1686801894
f
GR
GS
[1 0 0 1 298.94766 131.649] CT
N
f-1686801894
f
GR
GS
[1 0 0 1 345.64786 126.41794] CT
N
f-1686801894
f
GR
GS
[1 0 0 1 337.94745 125.47591] CT
N
f-1686801894
f
GR
GS
[1 0 0 1 357.75198 114.41366] CT
N
f-1686801894
f
GR
GS
[1 0 0 1 326.28113 126.8056] CT
N
f-1686801894
f
GR
GS
[1 0 0 1 314.31815 134.29955] CT
N
f-1686801894
f
GR
GS
[1 0 0 1 381.8284 99.57187] CT
N
f-1686801894
f
GR
GS
[1 0 0 1 388.45743 83.6594] CT
N
f-1686801894
f
GR
GS
[1 0 0 1 348.18765 122.30898] CT
N
f-1686801894
f
GR
GS
[1 0 0 1 331.62247 118.06799] CT
N
f-1686801894
f
GR
GS
[1 0 0 1 362.1991 109.01098] CT
N
f-1686801894
f
GR
GS
[1 0 0 1 360.16513 89.53902] CT
N
f-1686801894
f
GR
GS
[1 0 0 1 315.46683 134.48424] CT
N
f-1686801894
f
GR
GS
[1 0 0 1 310.94925 142.18602] CT
N
f-1686801894
f
GR
GS
[1 0 0 1 320.0134 126.64393] CT
N
f-1686801894
f
GR
GS
[1 0 0 1 334.79132 118.30597] CT
N
f-1686801894
f
GR
GS
[1 0 0 1 347.71533 130.09563] CT
N
f-1686801894
f
GR
GS
[1 0 0 1 348.51697 128.85048] CT
N
f-1686801894
f
GR
GS
[1 0 0 1 345.86386 125.51586] CT
N
f-1686801894
f
GR
GS
[1 0 0 1 368.1041 124.7355] CT
N
f-1686801894
f
GR
GS
[1 0 0 1 309.59296 136.79272] CT
N
f-1686801894
f
GR
GS
[1 0 0 1 374.65897 131.0515] CT
N
f-1686801894
f
GR
GS
[1 0 0 1 380.42435 114.4341] CT
N
f-1686801894
f
GR
GS
[1 0 0 1 345.69568 105.60146] CT
N
f-1686801894
f
GR
GS
[1 0 0 1 385.20956 100.27737] CT
N
f-1686801894
f
GR
GS
[1 0 0 1 373.63531 105.12868] CT
N
f-1686801894
f
GR
GS
[1 0 0 1 368.64856 111.20301] CT
N
f-1686801894
f
GR
GS
[1 0 0 1 384.87531 105.13087] CT
N
f-1686801894
f
GR
GS
[1 0 0 1 383.04764 95.31742] CT
N
f-1686801894
f
GR
GS
[1 0 0 1 348.69812 111.14052] CT
N
f-1686801894
f
GR
GS
[1 0 0 1 391.91647 107.29647] CT
N
f-1686801894
f
GR
GS
[1 0 0 1 323.01538 142.19057] CT
N
f-1686801894
f
GR
GS
[1 0 0 1 287.73242 151.36484] CT
N
f-1686801894
f
GR
GS
[1 0 0 1 373.92401 97.38657] CT
N
f-1686801894
f
GR
GS
[1 0 0 1 409.36606 91.73006] CT
N
f-1686801894
f
GR
GS
[1 0 0 1 294.69598 127.64873] CT
N
f-1686801894
f
GR
GS
[1 0 0 1 321.44797 146.38251] CT
N
f-1686801894
f
GR
GS
[1 0 0 1 411.84912 90.94157] CT
N
f-1686801894
f
GR
GS
[1 0 0 1 369.97467 114.57417] CT
N
f-1686801894
f
GR
GS
[1 0 0 1 307.0162 132.5876] CT
N
f-1686801894
f
GR
GS
[1 0 0 1 343.4982 120.85289] CT
N
f-1686801894
f
GR
GS
[1 0 0 1 374.69601 98.60727] CT
N
f-1686801894
f
GR
GS
[1 0 0 1 332.7338 130.06009] CT
N
f-1686801894
f
GR
GS
[1 0 0 1 292.97775 142.34686] CT
N
f-1686801894
f
GR
GS
[1 0 0 1 384.39081 109.63431] CT
N
f-1686801894
f
GR
GS
1 LJ
3 LW
N
363.674 110.184 M
313.584 133.921 L
330.036 126.124 L
400.883 92.551 L
369.67 107.343 L
334.145 124.177 L
424.612 81.307 L
298.948 140.856 L
345.648 118.726 L
337.947 122.375 L
357.752 112.99 L
326.281 127.904 L
314.318 133.573 L
381.828 101.581 L
388.457 98.44 L
348.188 117.523 L
331.622 125.373 L
362.199 110.883 L
360.165 111.847 L
315.467 133.028 L
310.949 135.169 L
320.013 130.874 L
334.791 123.871 L
347.715 117.747 L
348.517 117.367 L
345.864 118.624 L
368.104 108.085 L
309.593 135.812 L
374.659 104.979 L
380.424 102.247 L
345.696 118.704 L
385.21 99.979 L
373.635 105.464 L
368.649 107.827 L
384.875 100.137 L
383.048 101.003 L
348.698 117.281 L
391.916 96.801 L
323.015 129.451 L
287.732 146.171 L
373.924 105.327 L
409.366 88.532 L
294.696 142.871 L
321.448 130.194 L
411.849 87.355 L
369.975 107.198 L
307.016 137.033 L
343.498 119.745 L
374.696 104.961 L
332.734 124.846 L
292.978 143.685 L
384.391 100.367 L
S
GR
GS
[1 0 0 1 217 204] CT
/Helvetica 14 F
GS
[1 0 0 1 0 0] CT
0 0 moveto 
1 -1 scale
(Younger Adults: r=0.81, p=5e) t 
GR
GR
GS
[1 0 0 1 402 197] CT
/Helvetica 11.2 F
GS
[1 0 0 1 0 0] CT
0 0 moveto 
1 -1 scale
(-) t 
GR
GR
GS
[1 0 0 1 407 204] CT
/Helvetica 14 F
GS
[1 0 0 1 0 0] CT
0 0 moveto 
1 -1 scale
(12) t 
GR
GR
GS
1 0 0 RC
1 LJ
3 LW
N
184 195.5 M
214 195.5 L
S
GR
GS
[1 0 0 1 217 225] CT
/Helvetica 14 F
GS
[1 0 0 1 0 0] CT
0 0 moveto 
1 -1 scale
(Older Adults: r=0.83, p=3e) t 
GR
GR
GS
[1 0 0 1 383 218] CT
/Helvetica 11.2 F
GS
[1 0 0 1 0 0] CT
0 0 moveto 
1 -1 scale
(-) t 
GR
GR
GS
[1 0 0 1 388 225] CT
/Helvetica 14 F
GS
[1 0 0 1 0 0] CT
0 0 moveto 
1 -1 scale
(14) t 
GR
GR
GS
1 LJ
3 LW
N
184 217 M
214 217 L
S
GR
GS
1 GC
N
/f-1588314756{526 239.5 M
799 239.5 L
799 54.5 L
526 54.5 L
cp}def
f-1588314756
f
GR
GS
0.149 GC
2 setlinecap
1 LJ
0.5 LW
N
526 239.5 M
799 239.5 L
S
GR
GS
0.149 GC
2 setlinecap
1 LJ
0.5 LW
N
526 239.5 M
526 236.77 L
S
GR
GS
0.149 GC
2 setlinecap
1 LJ
0.5 LW
N
580.6 239.5 M
580.6 236.77 L
S
GR
GS
0.149 GC
2 setlinecap
1 LJ
0.5 LW
N
635.2 239.5 M
635.2 236.77 L
S
GR
GS
0.149 GC
2 setlinecap
1 LJ
0.5 LW
N
689.8 239.5 M
689.8 236.77 L
S
GR
GS
0.149 GC
2 setlinecap
1 LJ
0.5 LW
N
744.4 239.5 M
744.4 236.77 L
S
GR
GS
0.149 GC
2 setlinecap
1 LJ
0.5 LW
N
799 239.5 M
799 236.77 L
S
GR
GS
[1 0 0 1 526 244.3] CT
0.149 GC
/Helvetica 14 F
GS
[1 0 0 1 0 0] CT
-10 14 moveto 
1 -1 scale
(0.2) t 
GR
GR
GS
[1 0 0 1 580.59998 244.3] CT
0.149 GC
/Helvetica 14 F
GS
[1 0 0 1 0 0] CT
-10 14 moveto 
1 -1 scale
(0.4) t 
GR
GR
GS
[1 0 0 1 635.20001 244.3] CT
0.149 GC
/Helvetica 14 F
GS
[1 0 0 1 0 0] CT
-10 14 moveto 
1 -1 scale
(0.6) t 
GR
GR
GS
[1 0 0 1 689.79999 244.3] CT
0.149 GC
/Helvetica 14 F
GS
[1 0 0 1 0 0] CT
-10 14 moveto 
1 -1 scale
(0.8) t 
GR
GR
GS
[1 0 0 1 744.40002 244.3] CT
0.149 GC
/Helvetica 14 F
GS
[1 0 0 1 0 0] CT
-4 14 moveto 
1 -1 scale
(1) t 
GR
GR
GS
[1 0 0 1 799 244.3] CT
0.149 GC
/Helvetica 14 F
GS
[1 0 0 1 0 0] CT
-10 14 moveto 
1 -1 scale
(1.2) t 
GR
GR
GS
[1 0 0 1 662.50012 261.79999] CT
0.149 GC
/Helvetica 14 F
GS
[1 0 0 1 0 0] CT
-134 14 moveto 
1 -1 scale
(Low-pass MSE : Scales 1-3 \(> 50 Hz; Fine\)) t 
GR
GR
GS
0.149 GC
2 setlinecap
1 LJ
0.5 LW
N
526 239.5 M
526 54.5 L
S
GR
GS
0.149 GC
2 setlinecap
1 LJ
0.5 LW
N
526 205.241 M
528.73 205.241 L
S
GR
GS
0.149 GC
2 setlinecap
1 LJ
0.5 LW
N
526 136.722 M
528.73 136.722 L
S
GR
GS
0.149 GC
2 setlinecap
1 LJ
0.5 LW
N
526 68.204 M
528.73 68.204 L
S
GR
GS
[1 0 0 1 521.20001 205.24074] CT
0.149 GC
/Helvetica 14 F
GS
[1 0 0 1 0 0] CT
-14 5.5 moveto 
1 -1 scale
(-2) t 
GR
GR
GS
[1 0 0 1 521.20001 136.72223] CT
0.149 GC
/Helvetica 14 F
GS
[1 0 0 1 0 0] CT
-14 5.5 moveto 
1 -1 scale
(-1) t 
GR
GR
GS
[1 0 0 1 521.20001 68.2037] CT
0.149 GC
/Helvetica 14 F
GS
[1 0 0 1 0 0] CT
-8 5.5 moveto 
1 -1 scale
(0) t 
GR
GR
GS
[0 -1 1 0 504.70001 146.99991] CT
0.149 GC
/Helvetica 14 F
GS
[1 0 0 1 0 0] CT
-34 -3 moveto 
1 -1 scale
(PSD Slope) t 
GR
GR
GS
[1 0 0 1 662.50061 52.75] CT
/Helvetica-Bold 14 F
GS
[1 0 0 1 0 0] CT
-132.5 -22 moveto 
1 -1 scale
(Relation between MSE and PSD slopes:) t 
GR
GR
GS
[1 0 0 1 662.50061 52.75] CT
/Helvetica-Bold 14 F
GS
[1 0 0 1 0 0] CT
-140 -4 moveto 
1 -1 scale
(Low-pass MSE : Scales 1-3 \(> 50 Hz; Fine\)) t 
GR
GR
GS
[1 0 0 1 608.44641 130.62007] CT
1 0 0 RC
N
f-1686801894
f
GR
GS
[1 0 0 1 631.99542 135.3145] CT
1 0 0 RC
N
f-1686801894
f
GR
GS
[1 0 0 1 615.35925 118.86119] CT
1 0 0 RC
N
f-1686801894
f
GR
GS
[1 0 0 1 667.5849 107.04343] CT
1 0 0 RC
N
f-1686801894
f
GR
GS
[1 0 0 1 653.93933 130.40262] CT
1 0 0 RC
N
f-1686801894
f
GR
GS
[1 0 0 1 527.18811 149.28613] CT
1 0 0 RC
N
f-1686801894
f
GR
GS
[1 0 0 1 590.08258 146.08743] CT
1 0 0 RC
N
f-1686801894
f
GR
GS
[1 0 0 1 669.10138 120.87254] CT
1 0 0 RC
N
f-1686801894
f
GR
GS
[1 0 0 1 695.62799 111.86026] CT
1 0 0 RC
N
f-1686801894
f
GR
GS
[1 0 0 1 597.67352 143.66466] CT
1 0 0 RC
N
f-1686801894
f
GR
GS
[1 0 0 1 572.92804 169.98582] CT
1 0 0 RC
N
f-1686801894
f
GR
GS
[1 0 0 1 626.76733 140.49651] CT
1 0 0 RC
N
f-1686801894
f
GR
GS
[1 0 0 1 559.17407 138.45741] CT
1 0 0 RC
N
f-1686801894
f
GR
GS
[1 0 0 1 584.90735 162.72838] CT
1 0 0 RC
N
f-1686801894
f
GR
GS
[1 0 0 1 611.14581 137.4642] CT
1 0 0 RC
N
f-1686801894
f
GR
GS
[1 0 0 1 623.22241 141.74461] CT
1 0 0 RC
N
f-1686801894
f
GR
GS
[1 0 0 1 617.17444 139.79733] CT
1 0 0 RC
N
f-1686801894
f
GR
GS
[1 0 0 1 642.56061 137.26244] CT
1 0 0 RC
N
f-1686801894
f
GR
GS
[1 0 0 1 614.50684 138.38037] CT
1 0 0 RC
N
f-1686801894
f
GR
GS
[1 0 0 1 659.17786 129.47543] CT
1 0 0 RC
N
f-1686801894
f
GR
GS
[1 0 0 1 684.94739 114.27494] CT
1 0 0 RC
N
f-1686801894
f
GR
GS
[1 0 0 1 618.84235 140.38155] CT
1 0 0 RC
N
f-1686801894
f
GR
GS
[1 0 0 1 667.15674 110.75153] CT
1 0 0 RC
N
f-1686801894
f
GR
GS
[1 0 0 1 679.1684 82.28994] CT
1 0 0 RC
N
f-1686801894
f
GR
GS
[1 0 0 1 614.45184 140.80724] CT
1 0 0 RC
N
f-1686801894
f
GR
GS
[1 0 0 1 587.49591 144.18971] CT
1 0 0 RC
N
f-1686801894
f
GR
GS
[1 0 0 1 542.97552 155.69751] CT
1 0 0 RC
N
f-1686801894
f
GR
GS
[1 0 0 1 619.13007 109.66177] CT
1 0 0 RC
N
f-1686801894
f
GR
GS
[1 0 0 1 608.15137 145.67627] CT
1 0 0 RC
N
f-1686801894
f
GR
GS
[1 0 0 1 644.2569 115.25961] CT
1 0 0 RC
N
f-1686801894
f
GR
GS
[1 0 0 1 559.33936 163.65807] CT
1 0 0 RC
N
f-1686801894
f
GR
GS
[1 0 0 1 676.44257 126.39782] CT
1 0 0 RC
N
f-1686801894
f
GR
GS
[1 0 0 1 677.54895 124.89211] CT
1 0 0 RC
N
f-1686801894
f
GR
GS
[1 0 0 1 604.45361 153.03322] CT
1 0 0 RC
N
f-1686801894
f
GR
GS
[1 0 0 1 622.86444 123.47342] CT
1 0 0 RC
N
f-1686801894
f
GR
GS
[1 0 0 1 559.32037 163.32764] CT
1 0 0 RC
N
f-1686801894
f
GR
GS
[1 0 0 1 608.47626 138.27086] CT
1 0 0 RC
N
f-1686801894
f
GR
GS
[1 0 0 1 607.64392 152.37051] CT
1 0 0 RC
N
f-1686801894
f
GR
GS
[1 0 0 1 616.26575 139.77351] CT
1 0 0 RC
N
f-1686801894
f
GR
GS
[1 0 0 1 570.91309 153.08203] CT
1 0 0 RC
N
f-1686801894
f
GR
GS
[1 0 0 1 713.05713 97.30172] CT
1 0 0 RC
N
f-1686801894
f
GR
GS
[1 0 0 1 674.02747 123.21702] CT
1 0 0 RC
N
f-1686801894
f
GR
GS
[1 0 0 1 707.15686 91.69243] CT
1 0 0 RC
N
f-1686801894
f
GR
GS
[1 0 0 1 655.08478 134.85323] CT
1 0 0 RC
N
f-1686801894
f
GR
GS
[1 0 0 1 639.39966 149.39395] CT
1 0 0 RC
N
f-1686801894
f
GR
GS
[1 0 0 1 622.54596 144.84904] CT
1 0 0 RC
N
f-1686801894
f
GR
GS
[1 0 0 1 698.88672 91.91753] CT
1 0 0 RC
N
f-1686801894
f
GR
GS
1 0 0 RC
1 LJ
3 LW
N
608.446 139.834 M
631.995 131.209 L
615.359 137.302 L
667.585 118.175 L
653.939 123.172 L
527.188 169.594 L
590.083 146.559 L
669.101 117.619 L
695.628 107.904 L
597.674 143.779 L
572.928 152.842 L
626.767 133.124 L
559.174 157.879 L
584.907 148.455 L
611.146 138.845 L
623.222 134.422 L
617.174 136.637 L
642.561 127.34 L
614.507 137.614 L
659.178 121.254 L
684.947 111.816 L
618.842 136.026 L
667.157 118.332 L
679.168 113.932 L
614.452 137.634 L
587.496 147.507 L
542.976 163.812 L
619.13 135.921 L
608.151 139.942 L
644.257 126.718 L
559.339 157.819 L
676.443 114.931 L
677.549 114.525 L
604.454 141.296 L
622.864 134.553 L
559.32 157.826 L
608.476 139.823 L
607.644 140.128 L
616.266 136.97 L
570.913 153.58 L
713.057 101.521 L
674.027 115.815 L
707.157 103.682 L
655.085 122.753 L
639.4 128.497 L
622.546 134.67 L
698.887 106.711 L
S
GR
GS
[1 0 0 1 681.10651 109.18364] CT
N
f-1686801894
f
GR
GS
[1 0 0 1 630.97632 107.6246] CT
N
f-1686801894
f
GR
GS
[1 0 0 1 642.97607 132.03119] CT
N
f-1686801894
f
GR
GS
[1 0 0 1 724.27789 92.44123] CT
N
f-1686801894
f
GR
GS
[1 0 0 1 688.82819 91.32128] CT
N
f-1686801894
f
GR
GS
[1 0 0 1 648.94775 124.44925] CT
N
f-1686801894
f
GR
GS
[1 0 0 1 611.37781 131.649] CT
N
f-1686801894
f
GR
GS
[1 0 0 1 661.57233 126.41794] CT
N
f-1686801894
f
GR
GS
[1 0 0 1 651.57831 125.47591] CT
N
f-1686801894
f
GR
GS
[1 0 0 1 676.21887 114.41366] CT
N
f-1686801894
f
GR
GS
[1 0 0 1 641.10229 126.8056] CT
N
f-1686801894
f
GR
GS
[1 0 0 1 628.0976 134.29955] CT
N
f-1686801894
f
GR
GS
[1 0 0 1 702.41461 99.57187] CT
N
f-1686801894
f
GR
GS
[1 0 0 1 713.71613 83.6594] CT
N
f-1686801894
f
GR
GS
[1 0 0 1 665.2149 122.30898] CT
N
f-1686801894
f
GR
GS
[1 0 0 1 649.04077 118.06799] CT
N
f-1686801894
f
GR
GS
[1 0 0 1 677.91895 109.01098] CT
N
f-1686801894
f
GR
GS
[1 0 0 1 679.52423 89.53902] CT
N
f-1686801894
f
GR
GS
[1 0 0 1 630.47168 134.48424] CT
N
f-1686801894
f
GR
GS
[1 0 0 1 623.8446 142.18602] CT
N
f-1686801894
f
GR
GS
[1 0 0 1 634.89294 126.64393] CT
N
f-1686801894
f
GR
GS
[1 0 0 1 649.82471 118.30597] CT
N
f-1686801894
f
GR
GS
[1 0 0 1 662.36359 130.09563] CT
N
f-1686801894
f
GR
GS
[1 0 0 1 663.3761 128.85048] CT
N
f-1686801894
f
GR
GS
[1 0 0 1 659.77747 125.51586] CT
N
f-1686801894
f
GR
GS
[1 0 0 1 685.80103 124.7355] CT
N
f-1686801894
f
GR
GS
[1 0 0 1 620.78424 136.79272] CT
N
f-1686801894
f
GR
GS
[1 0 0 1 693.08099 131.0515] CT
N
f-1686801894
f
GR
GS
[1 0 0 1 699.31946 114.4341] CT
N
f-1686801894
f
GR
GS
[1 0 0 1 661.05841 105.60146] CT
N
f-1686801894
f
GR
GS
[1 0 0 1 709.11823 100.27737] CT
N
f-1686801894
f
GR
GS
[1 0 0 1 692.84717 105.12868] CT
N
f-1686801894
f
GR
GS
[1 0 0 1 686.78546 111.20301] CT
N
f-1686801894
f
GR
GS
[1 0 0 1 704.45764 105.13087] CT
N
f-1686801894
f
GR
GS
[1 0 0 1 702.36652 95.31742] CT
N
f-1686801894
f
GR
GS
[1 0 0 1 662.77216 111.14052] CT
N
f-1686801894
f
GR
GS
[1 0 0 1 715.64624 107.29647] CT
N
f-1686801894
f
GR
GS
[1 0 0 1 636.41296 142.19057] CT
N
f-1686801894
f
GR
GS
[1 0 0 1 599.44446 151.36484] CT
N
f-1686801894
f
GR
GS
[1 0 0 1 694.25897 97.38657] CT
N
f-1686801894
f
GR
GS
[1 0 0 1 735.1618 91.73006] CT
N
f-1686801894
f
GR
GS
[1 0 0 1 608.25189 127.64873] CT
N
f-1686801894
f
GR
GS
[1 0 0 1 634.75989 146.38251] CT
N
f-1686801894
f
GR
GS
[1 0 0 1 735.90704 90.94157] CT
N
f-1686801894
f
GR
GS
[1 0 0 1 688.3291 114.57417] CT
N
f-1686801894
f
GR
GS
[1 0 0 1 620.84991 132.5876] CT
N
f-1686801894
f
GR
GS
[1 0 0 1 658.55652 120.85289] CT
N
f-1686801894
f
GR
GS
[1 0 0 1 691.49567 98.60727] CT
N
f-1686801894
f
GR
GS
[1 0 0 1 647.65759 130.06009] CT
N
f-1686801894
f
GR
GS
[1 0 0 1 604.93958 142.34686] CT
N
f-1686801894
f
GR
GS
[1 0 0 1 705.44238 109.63431] CT
N
f-1686801894
f
GR
GS
1 LJ
3 LW
N
681.107 110.563 M
630.976 132.302 L
642.976 127.098 L
724.278 91.841 L
688.828 107.214 L
648.948 124.509 L
751.213 80.16 L
611.378 140.801 L
661.572 119.034 L
651.578 123.368 L
676.219 112.682 L
641.102 127.911 L
628.098 133.551 L
702.415 101.322 L
713.716 96.421 L
665.215 117.454 L
649.041 124.468 L
677.919 111.945 L
679.524 111.249 L
630.472 132.521 L
623.845 135.395 L
634.893 130.604 L
649.825 124.128 L
662.364 118.691 L
663.376 118.252 L
659.777 119.812 L
685.801 108.527 L
620.784 136.722 L
693.081 105.37 L
699.319 102.664 L
661.058 119.257 L
709.118 98.415 L
692.847 105.471 L
686.785 108.1 L
704.458 100.436 L
702.367 101.343 L
662.772 118.514 L
715.646 95.584 L
636.413 129.945 L
599.444 145.976 L
694.259 104.859 L
735.162 87.121 L
608.252 142.157 L
634.76 130.661 L
735.907 86.798 L
688.329 107.431 L
620.85 136.694 L
658.557 120.342 L
691.496 106.057 L
647.658 125.068 L
604.94 143.593 L
705.442 100.009 L
S
GR
GS
[1 0 0 1 577 204] CT
/Helvetica 14 F
GS
[1 0 0 1 0 0] CT
0 0 moveto 
1 -1 scale
(Younger Adults: r=0.82, p=3e) t 
GR
GR
GS
[1 0 0 1 762 197] CT
/Helvetica 11.2 F
GS
[1 0 0 1 0 0] CT
0 0 moveto 
1 -1 scale
(-) t 
GR
GR
GS
[1 0 0 1 767 204] CT
/Helvetica 14 F
GS
[1 0 0 1 0 0] CT
0 0 moveto 
1 -1 scale
(12) t 
GR
GR
GS
1 0 0 RC
1 LJ
3 LW
N
543.5 195.5 M
573.5 195.5 L
S
GR
GS
[1 0 0 1 577 225] CT
/Helvetica 14 F
GS
[1 0 0 1 0 0] CT
0 0 moveto 
1 -1 scale
(Older Adults: r=0.84, p=8e) t 
GR
GR
GS
[1 0 0 1 743 218] CT
/Helvetica 11.2 F
GS
[1 0 0 1 0 0] CT
0 0 moveto 
1 -1 scale
(-) t 
GR
GR
GS
[1 0 0 1 748 225] CT
/Helvetica 14 F
GS
[1 0 0 1 0 0] CT
0 0 moveto 
1 -1 scale
(15) t 
GR
GR
GS
1 LJ
3 LW
N
543.5 217 M
573.5 217 L
S
GR
GS
1 GC
N
/f445205900{885 239.5 M
1158.5 239.5 L
1158.5 54.5 L
885 54.5 L
cp}def
f445205900
f
GR
GS
0.149 GC
2 setlinecap
1 LJ
0.5 LW
N
885 239.5 M
1158.5 239.5 L
S
GR
GS
0.149 GC
2 setlinecap
1 LJ
0.5 LW
N
885 239.5 M
885 236.765 L
S
GR
GS
0.149 GC
2 setlinecap
1 LJ
0.5 LW
N
953.375 239.5 M
953.375 236.765 L
S
GR
GS
0.149 GC
2 setlinecap
1 LJ
0.5 LW
N
1021.75 239.5 M
1021.75 236.765 L
S
GR
GS
0.149 GC
2 setlinecap
1 LJ
0.5 LW
N
1090.125 239.5 M
1090.125 236.765 L
S
GR
GS
0.149 GC
2 setlinecap
1 LJ
0.5 LW
N
1158.5 239.5 M
1158.5 236.765 L
S
GR
GS
[1 0 0 1 885 244.3] CT
0.149 GC
/Helvetica 14 F
GS
[1 0 0 1 0 0] CT
-10 14 moveto 
1 -1 scale
(0.2) t 
GR
GR
GS
[1 0 0 1 953.375 244.3] CT
0.149 GC
/Helvetica 14 F
GS
[1 0 0 1 0 0] CT
-10 14 moveto 
1 -1 scale
(0.3) t 
GR
GR
GS
[1 0 0 1 1021.75 244.3] CT
0.149 GC
/Helvetica 14 F
GS
[1 0 0 1 0 0] CT
-10 14 moveto 
1 -1 scale
(0.4) t 
GR
GR
GS
[1 0 0 1 1090.125 244.3] CT
0.149 GC
/Helvetica 14 F
GS
[1 0 0 1 0 0] CT
-10 14 moveto 
1 -1 scale
(0.5) t 
GR
GR
GS
[1 0 0 1 1158.5 244.3] CT
0.149 GC
/Helvetica 14 F
GS
[1 0 0 1 0 0] CT
-10 14 moveto 
1 -1 scale
(0.6) t 
GR
GR
GS
[1 0 0 1 1021.75012 261.79999] CT
0.149 GC
/Helvetica 14 F
GS
[1 0 0 1 0 0] CT
-135.5 14 moveto 
1 -1 scale
(High-pass MSE : Scales 1-3 \(> 50 Hz; Fine\)) t 
GR
GR
GS
0.149 GC
2 setlinecap
1 LJ
0.5 LW
N
885 239.5 M
885 54.5 L
S
GR
GS
0.149 GC
2 setlinecap
1 LJ
0.5 LW
N
885 205.241 M
887.735 205.241 L
S
GR
GS
0.149 GC
2 setlinecap
1 LJ
0.5 LW
N
885 136.722 M
887.735 136.722 L
S
GR
GS
0.149 GC
2 setlinecap
1 LJ
0.5 LW
N
885 68.204 M
887.735 68.204 L
S
GR
GS
[1 0 0 1 880.20001 205.24074] CT
0.149 GC
/Helvetica 14 F
GS
[1 0 0 1 0 0] CT
-14 5.5 moveto 
1 -1 scale
(-2) t 
GR
GR
GS
[1 0 0 1 880.20001 136.72223] CT
0.149 GC
/Helvetica 14 F
GS
[1 0 0 1 0 0] CT
-14 5.5 moveto 
1 -1 scale
(-1) t 
GR
GR
GS
[1 0 0 1 880.20001 68.2037] CT
0.149 GC
/Helvetica 14 F
GS
[1 0 0 1 0 0] CT
-8 5.5 moveto 
1 -1 scale
(0) t 
GR
GR
GS
[0 -1 1 0 863.70001 146.99991] CT
0.149 GC
/Helvetica 14 F
GS
[1 0 0 1 0 0] CT
-34 -3 moveto 
1 -1 scale
(PSD Slope) t 
GR
GR
GS
[1 0 0 1 1021.75098 52.75] CT
/Helvetica-Bold 14 F
GS
[1 0 0 1 0 0] CT
-132.5 -22 moveto 
1 -1 scale
(Relation between MSE and PSD slopes:) t 
GR
GR
GS
[1 0 0 1 1021.75098 52.75] CT
/Helvetica-Bold 14 F
GS
[1 0 0 1 0 0] CT
-141 -4 moveto 
1 -1 scale
(High-pass MSE : Scales 1-3 \(> 50 Hz; Fine\)) t 
GR
GR
GS
[1 0 0 1 1079.71472 130.62007] CT
1 0 0 RC
N
f-1686801894
f
GR
GS
[1 0 0 1 1071.56335 135.3145] CT
1 0 0 RC
N
f-1686801894
f
GR
GS
[1 0 0 1 1028.96326 118.86119] CT
1 0 0 RC
N
f-1686801894
f
GR
GS
[1 0 0 1 1055.60156 107.04343] CT
1 0 0 RC
N
f-1686801894
f
GR
GS
[1 0 0 1 1043.58374 130.40262] CT
1 0 0 RC
N
f-1686801894
f
GR
GS
[1 0 0 1 1067.22815 149.28613] CT
1 0 0 RC
N
f-1686801894
f
GR
GS
[1 0 0 1 1082.23926 146.08743] CT
1 0 0 RC
N
f-1686801894
f
GR
GS
[1 0 0 1 1061.01636 120.87254] CT
1 0 0 RC
N
f-1686801894
f
GR
GS
[1 0 0 1 1066.16443 111.86026] CT
1 0 0 RC
N
f-1686801894
f
GR
GS
[1 0 0 1 1063.62781 143.66466] CT
1 0 0 RC
N
f-1686801894
f
GR
GS
[1 0 0 1 1078.89441 169.98582] CT
1 0 0 RC
N
f-1686801894
f
GR
GS
[1 0 0 1 983.60229 140.49651] CT
1 0 0 RC
N
f-1686801894
f
GR
GS
[1 0 0 1 1056.10718 138.45741] CT
1 0 0 RC
N
f-1686801894
f
GR
GS
[1 0 0 1 1087.96631 162.72838] CT
1 0 0 RC
N
f-1686801894
f
GR
GS
[1 0 0 1 1080.43738 137.4642] CT
1 0 0 RC
N
f-1686801894
f
GR
GS
[1 0 0 1 1082.26965 141.74461] CT
1 0 0 RC
N
f-1686801894
f
GR
GS
[1 0 0 1 1067.70288 139.79733] CT
1 0 0 RC
N
f-1686801894
f
GR
GS
[1 0 0 1 1067.30188 137.26244] CT
1 0 0 RC
N
f-1686801894
f
GR
GS
[1 0 0 1 1020.91052 138.38037] CT
1 0 0 RC
N
f-1686801894
f
GR
GS
[1 0 0 1 1045.84143 129.47543] CT
1 0 0 RC
N
f-1686801894
f
GR
GS
[1 0 0 1 1060.0293 114.27494] CT
1 0 0 RC
N
f-1686801894
f
GR
GS
[1 0 0 1 1085.44324 140.38155] CT
1 0 0 RC
N
f-1686801894
f
GR
GS
[1 0 0 1 1007.64429 110.75153] CT
1 0 0 RC
N
f-1686801894
f
GR
GS
[1 0 0 1 1000.37726 82.28994] CT
1 0 0 RC
N
f-1686801894
f
GR
GS
[1 0 0 1 1063.36816 140.80724] CT
1 0 0 RC
N
f-1686801894
f
GR
GS
[1 0 0 1 1035.79431 144.18971] CT
1 0 0 RC
N
f-1686801894
f
GR
GS
[1 0 0 1 1050.42944 155.69751] CT
1 0 0 RC
N
f-1686801894
f
GR
GS
[1 0 0 1 937.51196 109.66177] CT
1 0 0 RC
N
f-1686801894
f
GR
GS
[1 0 0 1 1040.67432 145.67627] CT
1 0 0 RC
N
f-1686801894
f
GR
GS
[1 0 0 1 1007.21619 115.25961] CT
1 0 0 RC
N
f-1686801894
f
GR
GS
[1 0 0 1 1053.28479 163.65807] CT
1 0 0 RC
N
f-1686801894
f
GR
GS
[1 0 0 1 1070.62903 126.39782] CT
1 0 0 RC
N
f-1686801894
f
GR
GS
[1 0 0 1 1066.42529 124.89211] CT
1 0 0 RC
N
f-1686801894
f
GR
GS
[1 0 0 1 1090.56494 153.03322] CT
1 0 0 RC
N
f-1686801894
f
GR
GS
[1 0 0 1 1062.46704 123.47342] CT
1 0 0 RC
N
f-1686801894
f
GR
GS
[1 0 0 1 1053.15002 163.32764] CT
1 0 0 RC
N
f-1686801894
f
GR
GS
[1 0 0 1 1027.45361 138.27086] CT
1 0 0 RC
N
f-1686801894
f
GR
GS
[1 0 0 1 1093.52917 152.37051] CT
1 0 0 RC
N
f-1686801894
f
GR
GS
[1 0 0 1 1044.00183 139.77351] CT
1 0 0 RC
N
f-1686801894
f
GR
GS
[1 0 0 1 1048.16602 153.08203] CT
1 0 0 RC
N
f-1686801894
f
GR
GS
[1 0 0 1 1060.41956 97.30172] CT
1 0 0 RC
N
f-1686801894
f
GR
GS
[1 0 0 1 1083.073 123.21702] CT
1 0 0 RC
N
f-1686801894
f
GR
GS
[1 0 0 1 1061.86707 91.69243] CT
1 0 0 RC
N
f-1686801894
f
GR
GS
[1 0 0 1 1063.80286 134.85323] CT
1 0 0 RC
N
f-1686801894
f
GR
GS
[1 0 0 1 1070.10901 149.39395] CT
1 0 0 RC
N
f-1686801894
f
GR
GS
[1 0 0 1 1074.36133 144.84904] CT
1 0 0 RC
N
f-1686801894
f
GR
GS
[1 0 0 1 1045.06421 91.91753] CT
1 0 0 RC
N
f-1686801894
f
GR
GS
1 0 0 RC
1 LJ
3 LW
N
1079.715 139.62 M
1071.563 137.568 L
1028.963 126.844 L
1055.602 133.55 L
1043.584 130.524 L
1067.228 136.476 L
1082.239 140.255 L
1061.016 134.913 L
1066.164 136.209 L
1063.628 135.57 L
1078.894 139.413 L
983.602 115.426 L
1056.107 133.677 L
1087.966 141.697 L
1080.437 139.801 L
1082.27 140.263 L
1067.703 136.596 L
1067.302 136.495 L
1020.911 124.817 L
1045.841 131.093 L
1060.029 134.664 L
1085.443 141.062 L
1007.644 121.478 L
1000.377 119.648 L
1063.368 135.505 L
1035.794 128.564 L
1050.429 132.248 L
937.512 103.824 L
1040.674 129.792 L
1007.216 121.37 L
1053.285 132.966 L
1070.629 137.332 L
1066.425 136.274 L
1090.565 142.351 L
1062.467 135.278 L
1053.15 132.933 L
1027.454 126.464 L
1093.529 143.097 L
1044.002 130.63 L
1048.166 131.678 L
1060.42 134.762 L
1083.073 140.465 L
1061.867 135.127 L
1063.803 135.614 L
1070.109 137.202 L
1074.361 138.272 L
1045.064 130.897 L
S
GR
GS
[1 0 0 1 1070.04297 109.18364] CT
N
f-1686801894
f
GR
GS
[1 0 0 1 988.73956 107.6246] CT
N
f-1686801894
f
GR
GS
[1 0 0 1 1055.71069 132.03119] CT
N
f-1686801894
f
GR
GS
[1 0 0 1 1058.93567 92.44123] CT
N
f-1686801894
f
GR
GS
[1 0 0 1 1074.98584 91.32128] CT
N
f-1686801894
f
GR
GS
[1 0 0 1 1059.37 124.44925] CT
N
f-1686801894
f
GR
GS
[1 0 0 1 1065.19495 131.649] CT
N
f-1686801894
f
GR
GS
[1 0 0 1 1030.96448 126.41794] CT
N
f-1686801894
f
GR
GS
[1 0 0 1 1083.66724 125.47591] CT
N
f-1686801894
f
GR
GS
[1 0 0 1 1080.11353 114.41366] CT
N
f-1686801894
f
GR
GS
[1 0 0 1 1024.59253 126.8056] CT
N
f-1686801894
f
GR
GS
[1 0 0 1 1021.35413 134.29955] CT
N
f-1686801894
f
GR
GS
[1 0 0 1 1072.10864 99.57187] CT
N
f-1686801894
f
GR
GS
[1 0 0 1 1019.29901 83.6594] CT
N
f-1686801894
f
GR
GS
[1 0 0 1 1064.58398 122.30898] CT
N
f-1686801894
f
GR
GS
[1 0 0 1 1070.46069 118.06799] CT
N
f-1686801894
f
GR
GS
[1 0 0 1 1085.58398 109.01098] CT
N
f-1686801894
f
GR
GS
[1 0 0 1 1072.22961 89.53902] CT
N
f-1686801894
f
GR
GS
[1 0 0 1 1014.44348 134.48424] CT
N
f-1686801894
f
GR
GS
[1 0 0 1 1032.21155 142.18602] CT
N
f-1686801894
f
GR
GS
[1 0 0 1 1041.67871 126.64393] CT
N
f-1686801894
f
GR
GS
[1 0 0 1 1033.95605 118.30597] CT
N
f-1686801894
f
GR
GS
[1 0 0 1 1066.94202 130.09563] CT
N
f-1686801894
f
GR
GS
[1 0 0 1 1078.95532 128.85048] CT
N
f-1686801894
f
GR
GS
[1 0 0 1 1088.53467 125.51586] CT
N
f-1686801894
f
GR
GS
[1 0 0 1 1084.22656 124.7355] CT
N
f-1686801894
f
GR
GS
[1 0 0 1 1080.79053 136.79272] CT
N
f-1686801894
f
GR
GS
[1 0 0 1 1073.38318 131.0515] CT
N
f-1686801894
f
GR
GS
[1 0 0 1 1059.28625 114.4341] CT
N
f-1686801894
f
GR
GS
[1 0 0 1 1073.62329 105.60146] CT
N
f-1686801894
f
GR
GS
[1 0 0 1 1040.58203 100.27737] CT
N
f-1686801894
f
GR
GS
[1 0 0 1 1029.74341 105.12868] CT
N
f-1686801894
f
GR
GS
[1 0 0 1 1037.97766 111.20301] CT
N
f-1686801894
f
GR
GS
[1 0 0 1 1058.67407 105.13087] CT
N
f-1686801894
f
GR
GS
[1 0 0 1 1041.21545 95.31742] CT
N
f-1686801894
f
GR
GS
[1 0 0 1 1075.31543 111.14052] CT
N
f-1686801894
f
GR
GS
[1 0 0 1 1059.02637 107.29647] CT
N
f-1686801894
f
GR
GS
[1 0 0 1 1078.74805 142.19057] CT
N
f-1686801894
f
GR
GS
[1 0 0 1 1084.79431 151.36484] CT
N
f-1686801894
f
GR
GS
[1 0 0 1 1034.06152 97.38657] CT
N
f-1686801894
f
GR
GS
[1 0 0 1 1065.01501 91.73006] CT
N
f-1686801894
f
GR
GS
[1 0 0 1 947.08893 127.64873] CT
N
f-1686801894
f
GR
GS
[1 0 0 1 1092.97327 146.38251] CT
N
f-1686801894
f
GR
GS
[1 0 0 1 1073.49902 90.94157] CT
N
f-1686801894
f
GR
GS
[1 0 0 1 1084.48584 114.57417] CT
N
f-1686801894
f
GR
GS
[1 0 0 1 1054.02283 132.5876] CT
N
f-1686801894
f
GR
GS
[1 0 0 1 1049.63464 120.85289] CT
N
f-1686801894
f
GR
GS
[1 0 0 1 1067.89587 98.60727] CT
N
f-1686801894
f
GR
GS
[1 0 0 1 1080.58496 130.06009] CT
N
f-1686801894
f
GR
GS
[1 0 0 1 1061.50537 142.34686] CT
N
f-1686801894
f
GR
GS
[1 0 0 1 1043.78088 109.63431] CT
N
f-1686801894
f
GR
GS
1 LJ
3 LW
N
1070.043 116.258 M
988.74 115.657 L
1055.711 116.152 L
1058.936 116.176 L
1074.986 116.295 L
1059.37 116.179 L
1077.924 116.317 L
1065.195 116.222 L
1030.964 115.969 L
1083.667 116.359 L
1080.114 116.333 L
1024.593 115.922 L
1021.354 115.898 L
1072.109 116.273 L
1019.299 115.883 L
1064.584 116.218 L
1070.461 116.261 L
1085.584 116.373 L
1072.23 116.274 L
1014.443 115.847 L
1032.212 115.978 L
1041.679 116.048 L
1033.956 115.991 L
1066.942 116.235 L
1078.955 116.324 L
1088.535 116.395 L
1084.227 116.363 L
1080.791 116.338 L
1073.383 116.283 L
1059.286 116.179 L
1073.623 116.285 L
1040.582 116.04 L
1029.743 115.96 L
1037.978 116.021 L
1058.674 116.174 L
1041.215 116.045 L
1075.315 116.297 L
1059.026 116.177 L
1078.748 116.323 L
1084.794 116.367 L
1034.062 115.992 L
1065.015 116.221 L
947.089 115.348 L
1092.973 116.428 L
1073.499 116.284 L
1084.486 116.365 L
1054.023 116.14 L
1049.635 116.107 L
1067.896 116.242 L
1080.585 116.336 L
1061.505 116.195 L
1043.781 116.064 L
S
GR
GS
[1 0 0 1 933.5 202.25] CT
/Helvetica 14 F
GS
[1 0 0 1 0 0] CT
0 5.5 moveto 
1 -1 scale
(Younger Adults: r=-0.38, p=0.009) t 
GR
GR
GS
1 0 0 RC
1 LJ
3 LW
N
900.5 202.25 M
930.5 202.25 L
S
GR
GS
[1 0 0 1 933.5 219.25] CT
/Helvetica 14 F
GS
[1 0 0 1 0 0] CT
0 5.5 moveto 
1 -1 scale
(Older Adults: r=-0.01, p=0.940) t 
GR
GR
GS
1 LJ
3 LW
N
900.5 219.25 M
930.5 219.25 L
S
GR
GS
1 GC
N
/f-1756960230{166.5 512.5 M
439.5 512.5 L
439.5 327.5 L
166.5 327.5 L
cp}def
f-1756960230
f
GR
GS
0.149 GC
2 setlinecap
1 LJ
0.5 LW
N
166.5 512.5 M
439.5 512.5 L
S
GR
GS
0.149 GC
2 setlinecap
1 LJ
0.5 LW
N
166.5 512.5 M
166.5 509.77 L
S
GR
GS
0.149 GC
2 setlinecap
1 LJ
0.5 LW
N
257.5 512.5 M
257.5 509.77 L
S
GR
GS
0.149 GC
2 setlinecap
1 LJ
0.5 LW
N
348.5 512.5 M
348.5 509.77 L
S
GR
GS
0.149 GC
2 setlinecap
1 LJ
0.5 LW
N
439.5 512.5 M
439.5 509.77 L
S
GR
GS
[1 0 0 1 166.5 517.29999] CT
0.149 GC
/Helvetica 14 F
GS
[1 0 0 1 0 0] CT
-10 14 moveto 
1 -1 scale
(0.2) t 
GR
GR
GS
[1 0 0 1 257.5 517.29999] CT
0.149 GC
/Helvetica 14 F
GS
[1 0 0 1 0 0] CT
-10 14 moveto 
1 -1 scale
(0.4) t 
GR
GR
GS
[1 0 0 1 348.5 517.29999] CT
0.149 GC
/Helvetica 14 F
GS
[1 0 0 1 0 0] CT
-10 14 moveto 
1 -1 scale
(0.6) t 
GR
GR
GS
[1 0 0 1 439.5 517.29999] CT
0.149 GC
/Helvetica 14 F
GS
[1 0 0 1 0 0] CT
-10 14 moveto 
1 -1 scale
(0.8) t 
GR
GR
GS
[1 0 0 1 303.00012 534.79999] CT
0.149 GC
/Helvetica 14 F
GS
[1 0 0 1 0 0] CT
-140.5 14 moveto 
1 -1 scale
(Original MSE : Scales 32-42 \(< 8 Hz; Coarse\)) t 
GR
GR
GS
0.149 GC
2 setlinecap
1 LJ
0.5 LW
N
166.5 512.5 M
166.5 327.5 L
S
GR
GS
0.149 GC
2 setlinecap
1 LJ
0.5 LW
N
166.5 478.241 M
169.23 478.241 L
S
GR
GS
0.149 GC
2 setlinecap
1 LJ
0.5 LW
N
166.5 409.722 M
169.23 409.722 L
S
GR
GS
0.149 GC
2 setlinecap
1 LJ
0.5 LW
N
166.5 341.204 M
169.23 341.204 L
S
GR
GS
[1 0 0 1 161.7 478.24075] CT
0.149 GC
/Helvetica 14 F
GS
[1 0 0 1 0 0] CT
-14 5.5 moveto 
1 -1 scale
(-2) t 
GR
GR
GS
[1 0 0 1 161.7 409.72223] CT
0.149 GC
/Helvetica 14 F
GS
[1 0 0 1 0 0] CT
-14 5.5 moveto 
1 -1 scale
(-1) t 
GR
GR
GS
[1 0 0 1 161.7 341.2037] CT
0.149 GC
/Helvetica 14 F
GS
[1 0 0 1 0 0] CT
-8 5.5 moveto 
1 -1 scale
(0) t 
GR
GR
GS
[0 -1 1 0 145.2 419.99991] CT
0.149 GC
/Helvetica 14 F
GS
[1 0 0 1 0 0] CT
-108 -3 moveto 
1 -1 scale
(PSD Slope 2-64 Hz \(excl. 7-13 Hz\)) t 
GR
GR
GS
[1 0 0 1 303.00031 325.75] CT
/Helvetica-Bold 14 F
GS
[1 0 0 1 0 0] CT
-132.5 -22 moveto 
1 -1 scale
(Relation between MSE and PSD slopes:) t 
GR
GR
GS
[1 0 0 1 303.00031 325.75] CT
/Helvetica-Bold 14 F
GS
[1 0 0 1 0 0] CT
-147 -4 moveto 
1 -1 scale
(Original MSE : Scales 32-42 \(< 8 Hz; Coarse\)) t 
GR
GR
GS
[1 0 0 1 322.453 403.62009] CT
1 0 0 RC
N
f-1686801894
f
GR
GS
[1 0 0 1 348.56287 408.31448] CT
1 0 0 RC
N
f-1686801894
f
GR
GS
[1 0 0 1 308.69339 391.86121] CT
1 0 0 RC
N
f-1686801894
f
GR
GS
[1 0 0 1 290.04971 380.04343] CT
1 0 0 RC
N
f-1686801894
f
GR
GS
[1 0 0 1 397.60318 403.40262] CT
1 0 0 RC
N
f-1686801894
f
GR
GS
[1 0 0 1 192.42522 422.28613] CT
1 0 0 RC
N
f-1686801894
f
GR
GS
[1 0 0 1 301.69205 419.08743] CT
1 0 0 RC
N
f-1686801894
f
GR
GS
[1 0 0 1 350.72968 393.87253] CT
1 0 0 RC
N
f-1686801894
f
GR
GS
[1 0 0 1 328.16257 384.86026] CT
1 0 0 RC
N
f-1686801894
f
GR
GS
[1 0 0 1 353.98169 416.66467] CT
1 0 0 RC
N
f-1686801894
f
GR
GS
[1 0 0 1 367.82349 442.98581] CT
1 0 0 RC
N
f-1686801894
f
GR
GS
[1 0 0 1 391.06281 413.49652] CT
1 0 0 RC
N
f-1686801894
f
GR
GS
[1 0 0 1 253.98723 411.45743] CT
1 0 0 RC
N
f-1686801894
f
GR
GS
[1 0 0 1 407.31287 435.72839] CT
1 0 0 RC
N
f-1686801894
f
GR
GS
[1 0 0 1 360.78412 410.4642] CT
1 0 0 RC
N
f-1686801894
f
GR
GS
[1 0 0 1 405.42865 414.7446] CT
1 0 0 RC
N
f-1686801894
f
GR
GS
[1 0 0 1 350.60852 412.79733] CT
1 0 0 RC
N
f-1686801894
f
GR
GS
[1 0 0 1 392.21976 410.26242] CT
1 0 0 RC
N
f-1686801894
f
GR
GS
[1 0 0 1 380.76596 411.38037] CT
1 0 0 RC
N
f-1686801894
f
GR
GS
[1 0 0 1 370.86179 402.47543] CT
1 0 0 RC
N
f-1686801894
f
GR
GS
[1 0 0 1 330.02521 387.27493] CT
1 0 0 RC
N
f-1686801894
f
GR
GS
[1 0 0 1 344.73346 413.38153] CT
1 0 0 RC
N
f-1686801894
f
GR
GS
[1 0 0 1 331.72412 383.75153] CT
1 0 0 RC
N
f-1686801894
f
GR
GS
[1 0 0 1 219.87743 355.28995] CT
1 0 0 RC
N
f-1686801894
f
GR
GS
[1 0 0 1 373.58328 413.80722] CT
1 0 0 RC
N
f-1686801894
f
GR
GS
[1 0 0 1 302.04788 417.1897] CT
1 0 0 RC
N
f-1686801894
f
GR
GS
[1 0 0 1 282.3158 428.69751] CT
1 0 0 RC
N
f-1686801894
f
GR
GS
[1 0 0 1 279.89621 382.66177] CT
1 0 0 RC
N
f-1686801894
f
GR
GS
[1 0 0 1 365.04175 418.67627] CT
1 0 0 RC
N
f-1686801894
f
GR
GS
[1 0 0 1 327.20615 388.25961] CT
1 0 0 RC
N
f-1686801894
f
GR
GS
[1 0 0 1 341.40616 436.65805] CT
1 0 0 RC
N
f-1686801894
f
GR
GS
[1 0 0 1 348.5491 399.39783] CT
1 0 0 RC
N
f-1686801894
f
GR
GS
[1 0 0 1 371.16324 397.89212] CT
1 0 0 RC
N
f-1686801894
f
GR
GS
[1 0 0 1 362.39767 426.0332] CT
1 0 0 RC
N
f-1686801894
f
GR
GS
[1 0 0 1 262.35629 396.47342] CT
1 0 0 RC
N
f-1686801894
f
GR
GS
[1 0 0 1 340.31787 436.32764] CT
1 0 0 RC
N
f-1686801894
f
GR
GS
[1 0 0 1 347.46954 411.27087] CT
1 0 0 RC
N
f-1686801894
f
GR
GS
[1 0 0 1 401.35663 425.37051] CT
1 0 0 RC
N
f-1686801894
f
GR
GS
[1 0 0 1 387.09592 412.7735] CT
1 0 0 RC
N
f-1686801894
f
GR
GS
[1 0 0 1 320.25156 426.08203] CT
1 0 0 RC
N
f-1686801894
f
GR
GS
[1 0 0 1 267.8334 370.30173] CT
1 0 0 RC
N
f-1686801894
f
GR
GS
[1 0 0 1 345.89273 396.21701] CT
1 0 0 RC
N
f-1686801894
f
GR
GS
[1 0 0 1 261.75632 364.69244] CT
1 0 0 RC
N
f-1686801894
f
GR
GS
[1 0 0 1 378.18716 407.85321] CT
1 0 0 RC
N
f-1686801894
f
GR
GS
[1 0 0 1 435.55289 422.39395] CT
1 0 0 RC
N
f-1686801894
f
GR
GS
[1 0 0 1 385.83746 417.84906] CT
1 0 0 RC
N
f-1686801894
f
GR
GS
[1 0 0 1 297.39932 364.91754] CT
1 0 0 RC
N
f-1686801894
f
GR
GS
1 0 0 RC
1 LJ
3 LW
N
322.453 403.396 M
348.563 408.098 L
308.693 400.918 L
290.05 397.56 L
397.603 416.93 L
192.425 379.978 L
301.692 399.657 L
350.73 408.489 L
328.163 404.424 L
353.982 409.074 L
367.823 411.567 L
391.063 415.753 L
253.987 391.065 L
407.313 418.679 L
360.784 410.299 L
405.429 418.34 L
350.609 408.467 L
392.22 415.961 L
380.766 413.898 L
370.862 412.114 L
330.025 404.76 L
344.733 407.409 L
331.724 405.066 L
219.877 384.922 L
373.583 412.605 L
302.048 399.721 L
282.316 396.167 L
279.896 395.732 L
365.042 411.066 L
327.206 404.252 L
341.406 406.809 L
348.549 408.096 L
371.163 412.169 L
362.398 410.59 L
262.356 392.573 L
340.318 406.613 L
347.47 407.901 L
401.357 417.606 L
387.096 415.038 L
320.252 403 L
267.833 393.559 L
345.893 407.617 L
261.756 392.465 L
378.187 413.434 L
435.553 423.765 L
385.837 414.811 L
297.399 398.884 L
S
GR
GS
[1 0 0 1 268.63522 382.18362] CT
N
f-1686801894
f
GR
GS
[1 0 0 1 265.28925 380.6246] CT
N
f-1686801894
f
GR
GS
[1 0 0 1 374.12396 405.03119] CT
N
f-1686801894
f
GR
GS
[1 0 0 1 281.36951 365.44122] CT
N
f-1686801894
f
GR
GS
[1 0 0 1 264.13281 364.32129] CT
N
f-1686801894
f
GR
GS
[1 0 0 1 344.20358 397.44925] CT
N
f-1686801894
f
GR
GS
[1 0 0 1 310.76791 404.64902] CT
N
f-1686801894
f
GR
GS
[1 0 0 1 325.93021 399.41794] CT
N
f-1686801894
f
GR
GS
[1 0 0 1 356.50546 398.47592] CT
N
f-1686801894
f
GR
GS
[1 0 0 1 309.11801 387.41367] CT
N
f-1686801894
f
GR
GS
[1 0 0 1 375.97998 399.8056] CT
N
f-1686801894
f
GR
GS
[1 0 0 1 374.65143 407.29956] CT
N
f-1686801894
f
GR
GS
[1 0 0 1 290.08609 372.57187] CT
N
f-1686801894
f
GR
GS
[1 0 0 1 254.77419 356.65939] CT
N
f-1686801894
f
GR
GS
[1 0 0 1 365.55554 395.30899] CT
N
f-1686801894
f
GR
GS
[1 0 0 1 281.22565 391.06799] CT
N
f-1686801894
f
GR
GS
[1 0 0 1 300.63223 382.01099] CT
N
f-1686801894
f
GR
GS
[1 0 0 1 238.28442 362.53903] CT
N
f-1686801894
f
GR
GS
[1 0 0 1 353.98499 407.48425] CT
N
f-1686801894
f
GR
GS
[1 0 0 1 397.47406 415.18604] CT
N
f-1686801894
f
GR
GS
[1 0 0 1 360.61212 399.64392] CT
N
f-1686801894
f
GR
GS
[1 0 0 1 344.01175 391.30597] CT
N
f-1686801894
f
GR
GS
[1 0 0 1 368.39871 403.09564] CT
N
f-1686801894
f
GR
GS
[1 0 0 1 346.34546 401.85046] CT
N
f-1686801894
f
GR
GS
[1 0 0 1 349.28726 398.51587] CT
N
f-1686801894
f
GR
GS
[1 0 0 1 364.29321 397.7355] CT
N
f-1686801894
f
GR
GS
[1 0 0 1 327.13336 409.79272] CT
N
f-1686801894
f
GR
GS
[1 0 0 1 393.09244 404.05148] CT
N
f-1686801894
f
GR
GS
[1 0 0 1 350.77103 387.43408] CT
N
f-1686801894
f
GR
GS
[1 0 0 1 277.86053 378.60147] CT
N
f-1686801894
f
GR
GS
[1 0 0 1 264.32269 373.27737] CT
N
f-1686801894
f
GR
GS
[1 0 0 1 318.18582 378.12869] CT
N
f-1686801894
f
GR
GS
[1 0 0 1 302.2576 384.203] CT
N
f-1686801894
f
GR
GS
[1 0 0 1 307.63934 378.13086] CT
N
f-1686801894
f
GR
GS
[1 0 0 1 270.99393 368.31741] CT
N
f-1686801894
f
GR
GS
[1 0 0 1 313.0444 384.14053] CT
N
f-1686801894
f
GR
GS
[1 0 0 1 318.20346 380.29648] CT
N
f-1686801894
f
GR
GS
[1 0 0 1 391.7937 415.19058] CT
N
f-1686801894
f
GR
GS
[1 0 0 1 393.19168 424.36484] CT
N
f-1686801894
f
GR
GS
[1 0 0 1 258.25482 370.38657] CT
N
f-1686801894
f
GR
GS
[1 0 0 1 262.03516 364.73004] CT
N
f-1686801894
f
GR
GS
[1 0 0 1 280.31665 400.64874] CT
N
f-1686801894
f
GR
GS
[1 0 0 1 408.2807 419.38251] CT
N
f-1686801894
f
GR
GS
[1 0 0 1 276.10904 363.94156] CT
N
f-1686801894
f
GR
GS
[1 0 0 1 317.80301 387.57419] CT
N
f-1686801894
f
GR
GS
[1 0 0 1 277.23145 405.58762] CT
N
f-1686801894
f
GR
GS
[1 0 0 1 313.71341 393.85291] CT
N
f-1686801894
f
GR
GS
[1 0 0 1 283.79568 371.60727] CT
N
f-1686801894
f
GR
GS
[1 0 0 1 323.65015 403.06009] CT
N
f-1686801894
f
GR
GS
[1 0 0 1 355.04025 415.34686] CT
N
f-1686801894
f
GR
GS
[1 0 0 1 334.5784 382.63431] CT
N
f-1686801894
f
GR
GS
1 LJ
3 LW
N
268.635 372.5 M
265.289 371.383 L
374.124 407.705 L
281.37 376.75 L
264.133 370.997 L
344.204 397.72 L
180.2 342.986 L
310.768 386.561 L
325.93 391.621 L
356.505 401.825 L
309.118 386.01 L
375.98 408.324 L
374.651 407.881 L
290.086 379.659 L
254.774 367.874 L
365.556 404.845 L
281.226 376.702 L
300.632 383.178 L
238.284 362.371 L
353.985 400.984 L
397.474 415.498 L
360.612 403.196 L
344.012 397.656 L
368.399 405.794 L
346.345 398.434 L
349.287 399.416 L
364.293 404.424 L
327.133 392.023 L
393.092 414.035 L
350.771 399.911 L
277.861 375.579 L
264.323 371.061 L
318.186 389.037 L
302.258 383.721 L
307.639 385.517 L
270.994 373.287 L
313.044 387.321 L
318.203 389.042 L
391.794 413.602 L
393.192 414.069 L
258.255 369.035 L
262.035 370.297 L
280.317 376.398 L
408.281 419.104 L
276.109 374.994 L
317.803 388.909 L
277.231 375.369 L
313.713 387.544 L
283.796 377.559 L
323.65 390.86 L
355.04 401.336 L
334.578 394.507 L
S
GR
GS
[1 0 0 1 214.5 470.75] CT
/Helvetica 14 F
GS
[1 0 0 1 0 0] CT
0 5.5 moveto 
1 -1 scale
(Younger Adults: r=-0.46, p=0.001) t 
GR
GR
GS
1 0 0 RC
1 LJ
3 LW
N
181.5 470.75 M
211.5 470.75 L
S
GR
GS
[1 0 0 1 215 498] CT
/Helvetica 14 F
GS
[1 0 0 1 0 0] CT
0 0 moveto 
1 -1 scale
(Older Adults: r=-0.85, p=1e) t 
GR
GR
GS
[1 0 0 1 387 491] CT
/Helvetica 11.2 F
GS
[1 0 0 1 0 0] CT
0 0 moveto 
1 -1 scale
(-) t 
GR
GR
GS
[1 0 0 1 392 498] CT
/Helvetica 14 F
GS
[1 0 0 1 0 0] CT
0 0 moveto 
1 -1 scale
(15) t 
GR
GR
GS
1 LJ
3 LW
N
181.5 490 M
211.5 490 L
S
GR
GS
1 GC
N
/f1018346220{526 512.5 M
799 512.5 L
799 327.5 L
526 327.5 L
cp}def
f1018346220
f
GR
GS
0.149 GC
2 setlinecap
1 LJ
0.5 LW
N
526 512.5 M
799 512.5 L
S
GR
GS
0.149 GC
2 setlinecap
1 LJ
0.5 LW
N
526 512.5 M
526 509.77 L
S
GR
GS
0.149 GC
2 setlinecap
1 LJ
0.5 LW
N
580.6 512.5 M
580.6 509.77 L
S
GR
GS
0.149 GC
2 setlinecap
1 LJ
0.5 LW
N
635.2 512.5 M
635.2 509.77 L
S
GR
GS
0.149 GC
2 setlinecap
1 LJ
0.5 LW
N
689.8 512.5 M
689.8 509.77 L
S
GR
GS
0.149 GC
2 setlinecap
1 LJ
0.5 LW
N
744.4 512.5 M
744.4 509.77 L
S
GR
GS
0.149 GC
2 setlinecap
1 LJ
0.5 LW
N
799 512.5 M
799 509.77 L
S
GR
GS
[1 0 0 1 526 517.29999] CT
0.149 GC
/Helvetica 14 F
GS
[1 0 0 1 0 0] CT
-10 14 moveto 
1 -1 scale
(0.2) t 
GR
GR
GS
[1 0 0 1 580.59998 517.29999] CT
0.149 GC
/Helvetica 14 F
GS
[1 0 0 1 0 0] CT
-10 14 moveto 
1 -1 scale
(0.4) t 
GR
GR
GS
[1 0 0 1 635.20001 517.29999] CT
0.149 GC
/Helvetica 14 F
GS
[1 0 0 1 0 0] CT
-10 14 moveto 
1 -1 scale
(0.6) t 
GR
GR
GS
[1 0 0 1 689.79999 517.29999] CT
0.149 GC
/Helvetica 14 F
GS
[1 0 0 1 0 0] CT
-10 14 moveto 
1 -1 scale
(0.8) t 
GR
GR
GS
[1 0 0 1 744.40002 517.29999] CT
0.149 GC
/Helvetica 14 F
GS
[1 0 0 1 0 0] CT
-4 14 moveto 
1 -1 scale
(1) t 
GR
GR
GS
[1 0 0 1 799 517.29999] CT
0.149 GC
/Helvetica 14 F
GS
[1 0 0 1 0 0] CT
-10 14 moveto 
1 -1 scale
(1.2) t 
GR
GR
GS
[1 0 0 1 662.50012 534.79999] CT
0.149 GC
/Helvetica 14 F
GS
[1 0 0 1 0 0] CT
-147 14 moveto 
1 -1 scale
(Low-pass MSE : Scales 32-42 \(< 8 Hz; Coarse\)) t 
GR
GR
GS
0.149 GC
2 setlinecap
1 LJ
0.5 LW
N
526 512.5 M
526 327.5 L
S
GR
GS
0.149 GC
2 setlinecap
1 LJ
0.5 LW
N
526 478.241 M
528.73 478.241 L
S
GR
GS
0.149 GC
2 setlinecap
1 LJ
0.5 LW
N
526 409.722 M
528.73 409.722 L
S
GR
GS
0.149 GC
2 setlinecap
1 LJ
0.5 LW
N
526 341.204 M
528.73 341.204 L
S
GR
GS
[1 0 0 1 521.20001 478.24075] CT
0.149 GC
/Helvetica 14 F
GS
[1 0 0 1 0 0] CT
-14 5.5 moveto 
1 -1 scale
(-2) t 
GR
GR
GS
[1 0 0 1 521.20001 409.72223] CT
0.149 GC
/Helvetica 14 F
GS
[1 0 0 1 0 0] CT
-14 5.5 moveto 
1 -1 scale
(-1) t 
GR
GR
GS
[1 0 0 1 521.20001 341.2037] CT
0.149 GC
/Helvetica 14 F
GS
[1 0 0 1 0 0] CT
-8 5.5 moveto 
1 -1 scale
(0) t 
GR
GR
GS
[0 -1 1 0 504.70001 419.99991] CT
0.149 GC
/Helvetica 14 F
GS
[1 0 0 1 0 0] CT
-34 -3 moveto 
1 -1 scale
(PSD Slope) t 
GR
GR
GS
[1 0 0 1 662.50061 325.75] CT
/Helvetica-Bold 14 F
GS
[1 0 0 1 0 0] CT
-132.5 -22 moveto 
1 -1 scale
(Relation between MSE and PSD slopes:) t 
GR
GR
GS
[1 0 0 1 662.50061 325.75] CT
/Helvetica-Bold 14 F
GS
[1 0 0 1 0 0] CT
-153.5 -4 moveto 
1 -1 scale
(Low-pass MSE : Scales 32-42 \(< 8 Hz; Coarse\)) t 
GR
GR
GS
[1 0 0 1 722.63055 403.62009] CT
1 0 0 RC
N
f-1686801894
f
GR
GS
[1 0 0 1 687.67664 408.31448] CT
1 0 0 RC
N
f-1686801894
f
GR
GS
[1 0 0 1 717.11823 391.86121] CT
1 0 0 RC
N
f-1686801894
f
GR
GS
[1 0 0 1 660.02301 380.04343] CT
1 0 0 RC
N
f-1686801894
f
GR
GS
[1 0 0 1 731.47693 403.40262] CT
1 0 0 RC
N
f-1686801894
f
GR
GS
[1 0 0 1 550.09784 422.28613] CT
1 0 0 RC
N
f-1686801894
f
GR
GS
[1 0 0 1 756.41156 419.08743] CT
1 0 0 RC
N
f-1686801894
f
GR
GS
[1 0 0 1 748.75989 393.87253] CT
1 0 0 RC
N
f-1686801894
f
GR
GS
[1 0 0 1 747.03247 384.86026] CT
1 0 0 RC
N
f-1686801894
f
GR
GS
[1 0 0 1 734.14801 416.66467] CT
1 0 0 RC
N
f-1686801894
f
GR
GS
[1 0 0 1 717.43823 442.98581] CT
1 0 0 RC
N
f-1686801894
f
GR
GS
[1 0 0 1 739.65015 413.49652] CT
1 0 0 RC
N
f-1686801894
f
GR
GS
[1 0 0 1 597.96716 411.45743] CT
1 0 0 RC
N
f-1686801894
f
GR
GS
[1 0 0 1 757.74359 435.72839] CT
1 0 0 RC
N
f-1686801894
f
GR
GS
[1 0 0 1 715.11823 410.4642] CT
1 0 0 RC
N
f-1686801894
f
GR
GS
[1 0 0 1 737.14417 414.7446] CT
1 0 0 RC
N
f-1686801894
f
GR
GS
[1 0 0 1 746.82819 412.79733] CT
1 0 0 RC
N
f-1686801894
f
GR
GS
[1 0 0 1 731.31915 410.26242] CT
1 0 0 RC
N
f-1686801894
f
GR
GS
[1 0 0 1 701.68774 411.38037] CT
1 0 0 RC
N
f-1686801894
f
GR
GS
[1 0 0 1 712.52197 402.47543] CT
1 0 0 RC
N
f-1686801894
f
GR
GS
[1 0 0 1 754.60687 387.27493] CT
1 0 0 RC
N
f-1686801894
f
GR
GS
[1 0 0 1 728.97009 413.38153] CT
1 0 0 RC
N
f-1686801894
f
GR
GS
[1 0 0 1 749.68616 383.75153] CT
1 0 0 RC
N
f-1686801894
f
GR
GS
[1 0 0 1 712.17468 355.28995] CT
1 0 0 RC
N
f-1686801894
f
GR
GS
[1 0 0 1 740.2489 413.80722] CT
1 0 0 RC
N
f-1686801894
f
GR
GS
[1 0 0 1 719.44989 417.1897] CT
1 0 0 RC
N
f-1686801894
f
GR
GS
[1 0 0 1 613.93585 428.69751] CT
1 0 0 RC
N
f-1686801894
f
GR
GS
[1 0 0 1 659.10352 382.66177] CT
1 0 0 RC
N
f-1686801894
f
GR
GS
[1 0 0 1 748.86438 418.67627] CT
1 0 0 RC
N
f-1686801894
f
GR
GS
[1 0 0 1 768.62274 388.25961] CT
1 0 0 RC
N
f-1686801894
f
GR
GS
[1 0 0 1 655.69189 436.65805] CT
1 0 0 RC
N
f-1686801894
f
GR
GS
[1 0 0 1 731.12872 399.39783] CT
1 0 0 RC
N
f-1686801894
f
GR
GS
[1 0 0 1 767.46704 397.89212] CT
1 0 0 RC
N
f-1686801894
f
GR
GS
[1 0 0 1 779.14722 426.0332] CT
1 0 0 RC
N
f-1686801894
f
GR
GS
[1 0 0 1 714.12817 396.47342] CT
1 0 0 RC
N
f-1686801894
f
GR
GS
[1 0 0 1 655.08032 436.32764] CT
1 0 0 RC
N
f-1686801894
f
GR
GS
[1 0 0 1 749.81226 411.27087] CT
1 0 0 RC
N
f-1686801894
f
GR
GS
[1 0 0 1 747.71368 425.37051] CT
1 0 0 RC
N
f-1686801894
f
GR
GS
[1 0 0 1 738.50073 412.7735] CT
1 0 0 RC
N
f-1686801894
f
GR
GS
[1 0 0 1 768.66412 426.08203] CT
1 0 0 RC
N
f-1686801894
f
GR
GS
[1 0 0 1 775.10779 370.30173] CT
1 0 0 RC
N
f-1686801894
f
GR
GS
[1 0 0 1 762.34351 396.21701] CT
1 0 0 RC
N
f-1686801894
f
GR
GS
[1 0 0 1 735.08093 364.69244] CT
1 0 0 RC
N
f-1686801894
f
GR
GS
[1 0 0 1 752.23383 407.85321] CT
1 0 0 RC
N
f-1686801894
f
GR
GS
[1 0 0 1 766.20105 422.39395] CT
1 0 0 RC
N
f-1686801894
f
GR
GS
[1 0 0 1 780.13489 417.84906] CT
1 0 0 RC
N
f-1686801894
f
GR
GS
[1 0 0 1 744.3288 364.91754] CT
1 0 0 RC
N
f-1686801894
f
GR
GS
1 0 0 RC
1 LJ
3 LW
N
722.631 406.29 M
687.677 408.54 L
717.118 406.645 L
660.023 410.32 L
731.477 405.721 L
550.098 417.395 L
756.412 404.116 L
748.76 404.609 L
747.032 404.72 L
734.148 405.549 L
717.438 406.625 L
739.65 405.195 L
597.967 414.314 L
757.744 404.03 L
715.118 406.774 L
737.144 405.356 L
746.828 404.733 L
731.319 405.731 L
701.688 407.638 L
712.522 406.941 L
754.607 404.232 L
728.97 405.882 L
749.686 404.549 L
712.175 406.963 L
740.249 405.156 L
719.45 406.495 L
613.936 413.287 L
659.104 410.379 L
748.864 404.602 L
768.623 403.33 L
655.692 410.599 L
731.129 405.743 L
767.467 403.405 L
779.147 402.653 L
714.128 406.838 L
655.08 410.638 L
749.812 404.541 L
747.714 404.676 L
738.501 405.269 L
768.664 403.327 L
775.108 402.913 L
762.344 403.734 L
735.081 405.489 L
752.234 404.385 L
766.201 403.486 L
780.135 402.589 L
744.329 404.894 L
S
GR
GS
[1 0 0 1 695.66333 382.18362] CT
N
f-1686801894
f
GR
GS
[1 0 0 1 626.802 380.6246] CT
N
f-1686801894
f
GR
GS
[1 0 0 1 746.83484 405.03119] CT
N
f-1686801894
f
GR
GS
[1 0 0 1 751.13611 365.44122] CT
N
f-1686801894
f
GR
GS
[1 0 0 1 744.86029 364.32129] CT
N
f-1686801894
f
GR
GS
[1 0 0 1 717.13647 397.44925] CT
N
f-1686801894
f
GR
GS
[1 0 0 1 649.85919 404.64902] CT
N
f-1686801894
f
GR
GS
[1 0 0 1 729.43445 399.41794] CT
N
f-1686801894
f
GR
GS
[1 0 0 1 754.30212 398.47592] CT
N
f-1686801894
f
GR
GS
[1 0 0 1 688.88477 387.41367] CT
N
f-1686801894
f
GR
GS
[1 0 0 1 730.15015 399.8056] CT
N
f-1686801894
f
GR
GS
[1 0 0 1 716.44702 407.29956] CT
N
f-1686801894
f
GR
GS
[1 0 0 1 693.47607 372.57187] CT
N
f-1686801894
f
GR
GS
[1 0 0 1 722.68976 356.65939] CT
N
f-1686801894
f
GR
GS
[1 0 0 1 710.77032 395.30899] CT
N
f-1686801894
f
GR
GS
[1 0 0 1 629.7973 391.06799] CT
N
f-1686801894
f
GR
GS
[1 0 0 1 755.68567 382.01099] CT
N
f-1686801894
f
GR
GS
[1 0 0 1 620.89783 362.53903] CT
N
f-1686801894
f
GR
GS
[1 0 0 1 708.61993 407.48425] CT
N
f-1686801894
f
GR
GS
[1 0 0 1 727.08044 415.18604] CT
N
f-1686801894
f
GR
GS
[1 0 0 1 723.73523 399.64392] CT
N
f-1686801894
f
GR
GS
[1 0 0 1 734.06726 391.30597] CT
N
f-1686801894
f
GR
GS
[1 0 0 1 778.45227 403.09564] CT
N
f-1686801894
f
GR
GS
[1 0 0 1 750.59442 401.85046] CT
N
f-1686801894
f
GR
GS
[1 0 0 1 738.1167 398.51587] CT
N
f-1686801894
f
GR
GS
[1 0 0 1 721.61804 397.7355] CT
N
f-1686801894
f
GR
GS
[1 0 0 1 733.21381 409.79272] CT
N
f-1686801894
f
GR
GS
[1 0 0 1 770.83771 404.05148] CT
N
f-1686801894
f
GR
GS
[1 0 0 1 754.2417 387.43408] CT
N
f-1686801894
f
GR
GS
[1 0 0 1 766.39026 378.60147] CT
N
f-1686801894
f
GR
GS
[1 0 0 1 718.32239 373.27737] CT
N
f-1686801894
f
GR
GS
[1 0 0 1 769.22064 378.12869] CT
N
f-1686801894
f
GR
GS
[1 0 0 1 746.27142 384.203] CT
N
f-1686801894
f
GR
GS
[1 0 0 1 757.9743 378.13086] CT
N
f-1686801894
f
GR
GS
[1 0 0 1 754.33044 368.31741] CT
N
f-1686801894
f
GR
GS
[1 0 0 1 746.82635 384.14053] CT
N
f-1686801894
f
GR
GS
[1 0 0 1 757.86481 380.29648] CT
N
f-1686801894
f
GR
GS
[1 0 0 1 751.94568 415.19058] CT
N
f-1686801894
f
GR
GS
[1 0 0 1 697.4743 424.36484] CT
N
f-1686801894
f
GR
GS
[1 0 0 1 750.83289 370.38657] CT
N
f-1686801894
f
GR
GS
[1 0 0 1 746.36432 364.73004] CT
N
f-1686801894
f
GR
GS
[1 0 0 1 640.94403 400.64874] CT
N
f-1686801894
f
GR
GS
[1 0 0 1 730.28174 419.38251] CT
N
f-1686801894
f
GR
GS
[1 0 0 1 725.08643 363.94156] CT
N
f-1686801894
f
GR
GS
[1 0 0 1 711.8739 387.57419] CT
N
f-1686801894
f
GR
GS
[1 0 0 1 637.52167 405.58762] CT
N
f-1686801894
f
GR
GS
[1 0 0 1 725.75458 393.85291] CT
N
f-1686801894
f
GR
GS
[1 0 0 1 766.35736 371.60727] CT
N
f-1686801894
f
GR
GS
[1 0 0 1 689.86328 403.06009] CT
N
f-1686801894
f
GR
GS
[1 0 0 1 683.052 415.34686] CT
N
f-1686801894
f
GR
GS
[1 0 0 1 741.93243 382.63431] CT
N
f-1686801894
f
GR
GS
1 LJ
3 LW
N
695.663 390.045 M
626.802 392.356 L
746.835 388.327 L
751.136 388.182 L
744.86 388.393 L
717.136 389.324 L
699.964 389.9 L
649.859 391.582 L
729.434 388.911 L
754.302 388.076 L
688.885 390.272 L
730.15 388.887 L
716.447 389.347 L
693.476 390.118 L
722.69 389.137 L
710.77 389.537 L
629.797 392.256 L
755.686 388.03 L
620.898 392.555 L
708.62 389.61 L
727.08 388.99 L
723.735 389.102 L
734.067 388.755 L
778.452 387.265 L
750.594 388.2 L
738.117 388.619 L
721.618 389.173 L
733.214 388.784 L
770.838 387.521 L
754.242 388.078 L
766.39 387.67 L
718.322 389.284 L
769.221 387.575 L
746.271 388.346 L
757.974 387.953 L
754.33 388.075 L
746.826 388.327 L
757.865 387.956 L
751.946 388.155 L
697.474 389.984 L
750.833 388.192 L
746.364 388.342 L
640.944 391.882 L
730.282 388.882 L
725.086 389.057 L
711.874 389.5 L
637.522 391.996 L
725.755 389.034 L
766.357 387.671 L
689.863 390.239 L
683.052 390.468 L
741.932 388.491 L
S
GR
GS
[1 0 0 1 577 475.25] CT
/Helvetica 14 F
GS
[1 0 0 1 0 0] CT
0 5.5 moveto 
1 -1 scale
(Younger Adults: r=0.16, p=0.298) t 
GR
GR
GS
1 0 0 RC
1 LJ
3 LW
N
544 475.25 M
574 475.25 L
S
GR
GS
[1 0 0 1 577 492.25] CT
/Helvetica 14 F
GS
[1 0 0 1 0 0] CT
0 5.5 moveto 
1 -1 scale
(Older Adults: r=0.07, p=0.622) t 
GR
GR
GS
1 LJ
3 LW
N
544 492.25 M
574 492.25 L
S
GR
GS
1 GC
N
/f1273720896{885 512.5 M
1158.5 512.5 L
1158.5 327.5 L
885 327.5 L
cp}def
f1273720896
f
GR
GS
0.149 GC
2 setlinecap
1 LJ
0.5 LW
N
885 512.5 M
1158.5 512.5 L
S
GR
GS
0.149 GC
2 setlinecap
1 LJ
0.5 LW
N
885 512.5 M
885 509.765 L
S
GR
GS
0.149 GC
2 setlinecap
1 LJ
0.5 LW
N
976.167 512.5 M
976.167 509.765 L
S
GR
GS
0.149 GC
2 setlinecap
1 LJ
0.5 LW
N
1067.333 512.5 M
1067.333 509.765 L
S
GR
GS
0.149 GC
2 setlinecap
1 LJ
0.5 LW
N
1158.5 512.5 M
1158.5 509.765 L
S
GR
GS
[1 0 0 1 885 517.29999] CT
0.149 GC
/Helvetica 14 F
GS
[1 0 0 1 0 0] CT
-10 14 moveto 
1 -1 scale
(0.2) t 
GR
GR
GS
[1 0 0 1 976.16669 517.29999] CT
0.149 GC
/Helvetica 14 F
GS
[1 0 0 1 0 0] CT
-10 14 moveto 
1 -1 scale
(0.4) t 
GR
GR
GS
[1 0 0 1 1067.33337 517.29999] CT
0.149 GC
/Helvetica 14 F
GS
[1 0 0 1 0 0] CT
-10 14 moveto 
1 -1 scale
(0.6) t 
GR
GR
GS
[1 0 0 1 1158.5 517.29999] CT
0.149 GC
/Helvetica 14 F
GS
[1 0 0 1 0 0] CT
-10 14 moveto 
1 -1 scale
(0.8) t 
GR
GR
GS
[1 0 0 1 1021.75012 534.79999] CT
0.149 GC
/Helvetica 14 F
GS
[1 0 0 1 0 0] CT
-148.5 14 moveto 
1 -1 scale
(High-pass MSE : Scales 32-42 \(< 8 Hz; Coarse\)) t 
GR
GR
GS
0.149 GC
2 setlinecap
1 LJ
0.5 LW
N
885 512.5 M
885 327.5 L
S
GR
GS
0.149 GC
2 setlinecap
1 LJ
0.5 LW
N
885 478.241 M
887.735 478.241 L
S
GR
GS
0.149 GC
2 setlinecap
1 LJ
0.5 LW
N
885 409.722 M
887.735 409.722 L
S
GR
GS
0.149 GC
2 setlinecap
1 LJ
0.5 LW
N
885 341.204 M
887.735 341.204 L
S
GR
GS
[1 0 0 1 880.20001 478.24075] CT
0.149 GC
/Helvetica 14 F
GS
[1 0 0 1 0 0] CT
-14 5.5 moveto 
1 -1 scale
(-2) t 
GR
GR
GS
[1 0 0 1 880.20001 409.72223] CT
0.149 GC
/Helvetica 14 F
GS
[1 0 0 1 0 0] CT
-14 5.5 moveto 
1 -1 scale
(-1) t 
GR
GR
GS
[1 0 0 1 880.20001 341.2037] CT
0.149 GC
/Helvetica 14 F
GS
[1 0 0 1 0 0] CT
-8 5.5 moveto 
1 -1 scale
(0) t 
GR
GR
GS
[0 -1 1 0 863.70001 419.99991] CT
0.149 GC
/Helvetica 14 F
GS
[1 0 0 1 0 0] CT
-34 -3 moveto 
1 -1 scale
(PSD Slope) t 
GR
GR
GS
[1 0 0 1 1021.75098 325.75] CT
/Helvetica-Bold 14 F
GS
[1 0 0 1 0 0] CT
-132.5 -22 moveto 
1 -1 scale
(Relation between MSE and PSD slopes:) t 
GR
GR
GS
[1 0 0 1 1021.75098 325.75] CT
/Helvetica-Bold 14 F
GS
[1 0 0 1 0 0] CT
-155 -4 moveto 
1 -1 scale
(High-pass MSE : Scales 32-42 \(< 8 Hz; Coarse\)) t 
GR
GR
GS
[1 0 0 1 967.23224 403.62009] CT
1 0 0 RC
N
f-1686801894
f
GR
GS
[1 0 0 1 1078.06055 408.31448] CT
1 0 0 RC
N
f-1686801894
f
GR
GS
[1 0 0 1 973.42767 391.86121] CT
1 0 0 RC
N
f-1686801894
f
GR
GS
[1 0 0 1 1081.66101 380.04343] CT
1 0 0 RC
N
f-1686801894
f
GR
GS
[1 0 0 1 1072.00354 403.40262] CT
1 0 0 RC
N
f-1686801894
f
GR
GS
[1 0 0 1 1055.19238 422.28613] CT
1 0 0 RC
N
f-1686801894
f
GR
GS
[1 0 0 1 937.67786 419.08743] CT
1 0 0 RC
N
f-1686801894
f
GR
GS
[1 0 0 1 1052.68591 393.87253] CT
1 0 0 RC
N
f-1686801894
f
GR
GS
[1 0 0 1 1070.40283 384.86026] CT
1 0 0 RC
N
f-1686801894
f
GR
GS
[1 0 0 1 960.92487 416.66467] CT
1 0 0 RC
N
f-1686801894
f
GR
GS
[1 0 0 1 953.53308 442.98581] CT
1 0 0 RC
N
f-1686801894
f
GR
GS
[1 0 0 1 1024.1936 413.49652] CT
1 0 0 RC
N
f-1686801894
f
GR
GS
[1 0 0 1 970.01062 411.45743] CT
1 0 0 RC
N
f-1686801894
f
GR
GS
[1 0 0 1 960.07733 435.72839] CT
1 0 0 RC
N
f-1686801894
f
GR
GS
[1 0 0 1 984.23956 410.4642] CT
1 0 0 RC
N
f-1686801894
f
GR
GS
[1 0 0 1 1028.2063 414.7446] CT
1 0 0 RC
N
f-1686801894
f
GR
GS
[1 0 0 1 988.6134 412.79733] CT
1 0 0 RC
N
f-1686801894
f
GR
GS
[1 0 0 1 1047.46899 410.26242] CT
1 0 0 RC
N
f-1686801894
f
GR
GS
[1 0 0 1 1028.60852 411.38037] CT
1 0 0 RC
N
f-1686801894
f
GR
GS
[1 0 0 1 1092.04993 402.47543] CT
1 0 0 RC
N
f-1686801894
f
GR
GS
[1 0 0 1 1060.40503 387.27493] CT
1 0 0 RC
N
f-1686801894
f
GR
GS
[1 0 0 1 994.97974 413.38153] CT
1 0 0 RC
N
f-1686801894
f
GR
GS
[1 0 0 1 1037.69983 383.75153] CT
1 0 0 RC
N
f-1686801894
f
GR
GS
[1 0 0 1 1041.99597 355.28995] CT
1 0 0 RC
N
f-1686801894
f
GR
GS
[1 0 0 1 994.47894 413.80722] CT
1 0 0 RC
N
f-1686801894
f
GR
GS
[1 0 0 1 934.5686 417.1897] CT
1 0 0 RC
N
f-1686801894
f
GR
GS
[1 0 0 1 980.00415 428.69751] CT
1 0 0 RC
N
f-1686801894
f
GR
GS
[1 0 0 1 1013.46014 382.66177] CT
1 0 0 RC
N
f-1686801894
f
GR
GS
[1 0 0 1 970.95313 418.67627] CT
1 0 0 RC
N
f-1686801894
f
GR
GS
[1 0 0 1 1003.44611 388.25961] CT
1 0 0 RC
N
f-1686801894
f
GR
GS
[1 0 0 1 1008.0083 436.65805] CT
1 0 0 RC
N
f-1686801894
f
GR
GS
[1 0 0 1 1077.77808 399.39783] CT
1 0 0 RC
N
f-1686801894
f
GR
GS
[1 0 0 1 1063.2854 397.89212] CT
1 0 0 RC
N
f-1686801894
f
GR
GS
[1 0 0 1 960.83038 426.0332] CT
1 0 0 RC
N
f-1686801894
f
GR
GS
[1 0 0 1 971.28479 396.47342] CT
1 0 0 RC
N
f-1686801894
f
GR
GS
[1 0 0 1 1008.32117 436.32764] CT
1 0 0 RC
N
f-1686801894
f
GR
GS
[1 0 0 1 965.79431 411.27087] CT
1 0 0 RC
N
f-1686801894
f
GR
GS
[1 0 0 1 1002.44708 425.37051] CT
1 0 0 RC
N
f-1686801894
f
GR
GS
[1 0 0 1 1001.96344 412.7735] CT
1 0 0 RC
N
f-1686801894
f
GR
GS
[1 0 0 1 910.2251 426.08203] CT
1 0 0 RC
N
f-1686801894
f
GR
GS
[1 0 0 1 1083.06189 370.30173] CT
1 0 0 RC
N
f-1686801894
f
GR
GS
[1 0 0 1 1060.78918 396.21701] CT
1 0 0 RC
N
f-1686801894
f
GR
GS
[1 0 0 1 1074.42407 364.69244] CT
1 0 0 RC
N
f-1686801894
f
GR
GS
[1 0 0 1 1050.38171 407.85321] CT
1 0 0 RC
N
f-1686801894
f
GR
GS
[1 0 0 1 1047.90295 422.39395] CT
1 0 0 RC
N
f-1686801894
f
GR
GS
[1 0 0 1 988.36438 417.84906] CT
1 0 0 RC
N
f-1686801894
f
GR
GS
[1 0 0 1 1060.9519 364.91754] CT
1 0 0 RC
N
f-1686801894
f
GR
GS
1 0 0 RC
1 LJ
3 LW
N
967.232 417.521 M
1078.061 391.121 L
973.428 416.046 L
1081.661 390.263 L
1072.004 392.563 L
1055.192 396.568 L
937.678 424.562 L
1052.686 397.165 L
1070.403 392.945 L
960.925 419.024 L
953.533 420.785 L
1024.194 403.952 L
970.011 416.86 L
960.077 419.226 L
984.24 413.47 L
1028.206 402.997 L
988.613 412.428 L
1047.469 398.408 L
1028.609 402.901 L
1092.05 387.788 L
1060.405 395.326 L
994.98 410.912 L
1037.7 400.735 L
1041.996 399.712 L
994.479 411.031 L
934.569 425.302 L
980.004 414.479 L
1013.46 406.509 L
970.953 416.635 L
1003.446 408.895 L
1008.008 407.808 L
1077.778 391.188 L
1063.285 394.64 L
960.83 419.046 L
971.285 416.556 L
1008.321 407.733 L
965.794 417.864 L
1002.447 409.133 L
1001.963 409.248 L
910.225 431.101 L
1083.062 389.929 L
1060.789 395.235 L
1074.424 391.987 L
1050.382 397.714 L
1047.903 398.305 L
988.364 412.487 L
1060.952 395.196 L
S
GR
GS
[1 0 0 1 1066.77588 382.18362] CT
N
f-1686801894
f
GR
GS
[1 0 0 1 1074.44861 380.6246] CT
N
f-1686801894
f
GR
GS
[1 0 0 1 1028.54541 405.03119] CT
N
f-1686801894
f
GR
GS
[1 0 0 1 1103.34155 365.44122] CT
N
f-1686801894
f
GR
GS
[1 0 0 1 1060.80688 364.32129] CT
N
f-1686801894
f
GR
GS
[1 0 0 1 1042.27698 397.44925] CT
N
f-1686801894
f
GR
GS
[1 0 0 1 1034.6051 404.64902] CT
N
f-1686801894
f
GR
GS
[1 0 0 1 1038.18237 399.41794] CT
N
f-1686801894
f
GR
GS
[1 0 0 1 1027.87109 398.47592] CT
N
f-1686801894
f
GR
GS
[1 0 0 1 1095.02344 387.41367] CT
N
f-1686801894
f
GR
GS
[1 0 0 1 1043.92285 399.8056] CT
N
f-1686801894
f
GR
GS
[1 0 0 1 1037.85754 407.29956] CT
N
f-1686801894
f
GR
GS
[1 0 0 1 1100.21814 372.57187] CT
N
f-1686801894
f
GR
GS
[1 0 0 1 1082.61816 356.65939] CT
N
f-1686801894
f
GR
GS
[1 0 0 1 1082.83093 395.30899] CT
N
f-1686801894
f
GR
GS
[1 0 0 1 1119.24585 391.06799] CT
N
f-1686801894
f
GR
GS
[1 0 0 1 1051.98511 382.01099] CT
N
f-1686801894
f
GR
GS
[1 0 0 1 1096.59277 362.53903] CT
N
f-1686801894
f
GR
GS
[1 0 0 1 1037.25549 407.48425] CT
N
f-1686801894
f
GR
GS
[1 0 0 1 1039.729 415.18604] CT
N
f-1686801894
f
GR
GS
[1 0 0 1 1015.99127 399.64392] CT
N
f-1686801894
f
GR
GS
[1 0 0 1 1029.45325 391.30597] CT
N
f-1686801894
f
GR
GS
[1 0 0 1 1046.49438 403.09564] CT
N
f-1686801894
f
GR
GS
[1 0 0 1 1050.78247 401.85046] CT
N
f-1686801894
f
GR
GS
[1 0 0 1 1050.90149 398.51587] CT
N
f-1686801894
f
GR
GS
[1 0 0 1 1114.10596 397.7355] CT
N
f-1686801894
f
GR
GS
[1 0 0 1 987.28467 409.79272] CT
N
f-1686801894
f
GR
GS
[1 0 0 1 1101.94531 404.05148] CT
N
f-1686801894
f
GR
GS
[1 0 0 1 1090.28442 387.43408] CT
N
f-1686801894
f
GR
GS
[1 0 0 1 1014.3952 378.60147] CT
N
f-1686801894
f
GR
GS
[1 0 0 1 1097.65857 373.27737] CT
N
f-1686801894
f
GR
GS
[1 0 0 1 1070.26746 378.12869] CT
N
f-1686801894
f
GR
GS
[1 0 0 1 1069.23389 384.203] CT
N
f-1686801894
f
GR
GS
[1 0 0 1 1080.05212 378.13086] CT
N
f-1686801894
f
GR
GS
[1 0 0 1 1073.78906 368.31741] CT
N
f-1686801894
f
GR
GS
[1 0 0 1 1023.32489 384.14053] CT
N
f-1686801894
f
GR
GS
[1 0 0 1 1107.8053 380.29648] CT
N
f-1686801894
f
GR
GS
[1 0 0 1 1024.95642 415.19058] CT
N
f-1686801894
f
GR
GS
[1 0 0 1 1056.61365 424.36484] CT
N
f-1686801894
f
GR
GS
[1 0 0 1 1065.69324 370.38657] CT
N
f-1686801894
f
GR
GS
[1 0 0 1 1119.09412 364.73004] CT
N
f-1686801894
f
GR
GS
[1 0 0 1 1024.41321 400.64874] CT
N
f-1686801894
f
GR
GS
[1 0 0 1 1069.36584 419.38251] CT
N
f-1686801894
f
GR
GS
[1 0 0 1 1125.25183 363.94156] CT
N
f-1686801894
f
GR
GS
[1 0 0 1 1097.05896 387.57419] CT
N
f-1686801894
f
GR
GS
[1 0 0 1 1065.16028 405.58762] CT
N
f-1686801894
f
GR
GS
[1 0 0 1 1036.2533 393.85291] CT
N
f-1686801894
f
GR
GS
[1 0 0 1 1048.22693 371.60727] CT
N
f-1686801894
f
GR
GS
[1 0 0 1 1063.22131 403.06009] CT
N
f-1686801894
f
GR
GS
[1 0 0 1 1012.32684 415.34686] CT
N
f-1686801894
f
GR
GS
[1 0 0 1 1096.83118 382.63431] CT
N
f-1686801894
f
GR
GS
1 LJ
3 LW
N
1066.776 388.195 M
1074.449 385.707 L
1028.545 400.589 L
1103.342 376.34 L
1060.807 390.13 L
1042.277 396.138 L
1124.915 369.346 L
1034.605 398.625 L
1038.182 397.465 L
1027.871 400.808 L
1095.023 379.037 L
1043.923 395.604 L
1037.858 397.57 L
1100.218 377.353 L
1082.618 383.059 L
1082.831 382.99 L
1119.246 371.184 L
1051.985 392.99 L
1096.593 378.528 L
1037.255 397.766 L
1039.729 396.964 L
1015.991 404.66 L
1029.453 400.295 L
1046.494 394.77 L
1050.782 393.38 L
1050.901 393.342 L
1114.106 372.85 L
987.285 413.966 L
1101.945 376.793 L
1090.284 380.573 L
1014.395 405.177 L
1097.659 378.183 L
1070.267 387.063 L
1069.234 387.398 L
1080.052 383.891 L
1073.789 385.921 L
1023.325 402.282 L
1107.805 374.893 L
1024.956 401.753 L
1056.614 391.49 L
1065.693 388.546 L
1119.094 371.233 L
1024.413 401.929 L
1069.366 387.355 L
1125.252 369.237 L
1097.059 378.377 L
1065.16 388.719 L
1036.253 398.091 L
1048.227 394.209 L
1063.221 389.347 L
1012.327 405.848 L
1096.831 378.451 L
S
GR
GS
[1 0 0 1 940 477] CT
/Helvetica 14 F
GS
[1 0 0 1 0 0] CT
0 0 moveto 
1 -1 scale
(Younger Adults: r=0.57, p=3e) t 
GR
GR
GS
[1 0 0 1 1125 470] CT
/Helvetica 11.2 F
GS
[1 0 0 1 0 0] CT
0 0 moveto 
1 -1 scale
(-) t 
GR
GR
GS
[1 0 0 1 1130 477] CT
/Helvetica 14 F
GS
[1 0 0 1 0 0] CT
0 0 moveto 
1 -1 scale
(5) t 
GR
GR
GS
1 0 0 RC
1 LJ
3 LW
N
907 468.5 M
937 468.5 L
S
GR
GS
[1 0 0 1 940 498] CT
/Helvetica 14 F
GS
[1 0 0 1 0 0] CT
0 0 moveto 
1 -1 scale
(Older Adults: r=0.58, p=8e) t 
GR
GR
GS
[1 0 0 1 1106 491] CT
/Helvetica 11.2 F
GS
[1 0 0 1 0 0] CT
0 0 moveto 
1 -1 scale
(-) t 
GR
GR
GS
[1 0 0 1 1111 498] CT
/Helvetica 14 F
GS
[1 0 0 1 0 0] CT
0 0 moveto 
1 -1 scale
(6) t 
GR
GR
GS
1 LJ
3 LW
N
907 490 M
937 490 L
S
GR
%%Trailer
%%Pages: 1
%%EOF
