%!PS-Adobe-3.0 EPSF-3.0
%%Creator: (MATLAB, The Mathworks, Inc. Version 9.8.0.1323502 \(R2020a\). Operating System: Mac OS X)
%%Title: /Users/kosciessa/Desktop/tardis/LNDG/stateswitch/stsw_beh_stroop/figures/D_Interference_Drift.eps
%%CreationDate: 2022-11-03T14:05:08
%%Pages: (atend)
%%BoundingBox:  -111     0   258   266
%%LanguageLevel: 3
%%EndComments
%%BeginProlog
%%BeginResource: procset (Apache XML Graphics Std ProcSet) 1.2 0
%%Version: 1.2 0
%%Copyright: (Copyright 2001-2003,2010 The Apache Software Foundation. License terms: http://www.apache.org/licenses/LICENSE-2.0)
/bd{bind def}bind def
/ld{load def}bd
/GR/grestore ld
/GS/gsave ld
/RM/rmoveto ld
/C/curveto ld
/t/show ld
/L/lineto ld
/ML/setmiterlimit ld
/CT/concat ld
/f/fill ld
/N/newpath ld
/S/stroke ld
/CC/setcmykcolor ld
/A/ashow ld
/cp/closepath ld
/RC/setrgbcolor ld
/LJ/setlinejoin ld
/GC/setgray ld
/LW/setlinewidth ld
/M/moveto ld
/re {4 2 roll M
1 index 0 rlineto
0 exch rlineto
neg 0 rlineto
cp } bd
/_ctm matrix def
/_tm matrix def
/BT { _ctm currentmatrix pop matrix _tm copy pop 0 0 moveto } bd
/ET { _ctm setmatrix } bd
/iTm { _ctm setmatrix _tm concat } bd
/Tm { _tm astore pop iTm 0 0 moveto } bd
/ux 0.0 def
/uy 0.0 def
/F {
  /Tp exch def
  /Tf exch def
  Tf findfont Tp scalefont setfont
  /cf Tf def  /cs Tp def
} bd
/ULS {currentpoint /uy exch def /ux exch def} bd
/ULE {
  /Tcx currentpoint pop def
  gsave
  newpath
  cf findfont cs scalefont dup
  /FontMatrix get 0 get /Ts exch def /FontInfo get dup
  /UnderlinePosition get Ts mul /To exch def
  /UnderlineThickness get Ts mul /Tt exch def
  ux uy To add moveto  Tcx uy To add lineto
  Tt setlinewidth stroke
  grestore
} bd
/OLE {
  /Tcx currentpoint pop def
  gsave
  newpath
  cf findfont cs scalefont dup
  /FontMatrix get 0 get /Ts exch def /FontInfo get dup
  /UnderlinePosition get Ts mul /To exch def
  /UnderlineThickness get Ts mul /Tt exch def
  ux uy To add cs add moveto Tcx uy To add cs add lineto
  Tt setlinewidth stroke
  grestore
} bd
/SOE {
  /Tcx currentpoint pop def
  gsave
  newpath
  cf findfont cs scalefont dup
  /FontMatrix get 0 get /Ts exch def /FontInfo get dup
  /UnderlinePosition get Ts mul /To exch def
  /UnderlineThickness get Ts mul /Tt exch def
  ux uy To add cs 10 mul 26 idiv add moveto Tcx uy To add cs 10 mul 26 idiv add lineto
  Tt setlinewidth stroke
  grestore
} bd
/QT {
/Y22 exch store
/X22 exch store
/Y21 exch store
/X21 exch store
currentpoint
/Y21 load 2 mul add 3 div exch
/X21 load 2 mul add 3 div exch
/X21 load 2 mul /X22 load add 3 div
/Y21 load 2 mul /Y22 load add 3 div
/X22 load /Y22 load curveto
} bd
/SSPD {
dup length /d exch dict def
{
/v exch def
/k exch def
currentpagedevice k known {
/cpdv currentpagedevice k get def
v cpdv ne {
/upd false def
/nullv v type /nulltype eq def
/nullcpdv cpdv type /nulltype eq def
nullv nullcpdv or
{
/upd true def
} {
/sametype v type cpdv type eq def
sametype {
v type /arraytype eq {
/vlen v length def
/cpdvlen cpdv length def
vlen cpdvlen eq {
0 1 vlen 1 sub {
/i exch def
/obj v i get def
/cpdobj cpdv i get def
obj cpdobj ne {
/upd true def
exit
} if
} for
} {
/upd true def
} ifelse
} {
v type /dicttype eq {
v {
/dv exch def
/dk exch def
/cpddv cpdv dk get def
dv cpddv ne {
/upd true def
exit
} if
} forall
} {
/upd true def
} ifelse
} ifelse
} if
} ifelse
upd true eq {
d k v put
} if
} if
} if
} forall
d length 0 gt {
d setpagedevice
} if
} bd
/RE { % /NewFontName [NewEncodingArray] /FontName RE -
  findfont dup length dict begin
  {
    1 index /FID ne
    {def} {pop pop} ifelse
  } forall
  /Encoding exch def
  /FontName 1 index def
  currentdict definefont pop
  end
} bind def
%%EndResource
%%BeginResource: procset (Apache XML Graphics EPS ProcSet) 1.0 0
%%Version: 1.0 0
%%Copyright: (Copyright 2002-2003 The Apache Software Foundation. License terms: http://www.apache.org/licenses/LICENSE-2.0)
/BeginEPSF { %def
/b4_Inc_state save def         % Save state for cleanup
/dict_count countdictstack def % Count objects on dict stack
/op_count count 1 sub def      % Count objects on operand stack
userdict begin                 % Push userdict on dict stack
/showpage { } def              % Redefine showpage, { } = null proc
0 setgray 0 setlinecap         % Prepare graphics state
1 setlinewidth 0 setlinejoin
10 setmiterlimit [ ] 0 setdash newpath
/languagelevel where           % If level not equal to 1 then
{pop languagelevel             % set strokeadjust and
1 ne                           % overprint to their defaults.
{false setstrokeadjust false setoverprint
} if
} if
} bd
/EndEPSF { %def
count op_count sub {pop} repeat            % Clean up stacks
countdictstack dict_count sub {end} repeat
b4_Inc_state restore
} bd
%%EndResource
%FOPBeginFontDict
%%IncludeResource: font Courier-Oblique
%%IncludeResource: font Courier-BoldOblique
%%IncludeResource: font Courier-Bold
%%IncludeResource: font ZapfDingbats
%%IncludeResource: font Symbol
%%IncludeResource: font Helvetica
%%IncludeResource: font Helvetica-Oblique
%%IncludeResource: font Helvetica-Bold
%%IncludeResource: font Helvetica-BoldOblique
%%IncludeResource: font Times-Roman
%%IncludeResource: font Times-Italic
%%IncludeResource: font Times-Bold
%%IncludeResource: font Times-BoldItalic
%%IncludeResource: font Courier
%FOPEndFontDict
%%BeginResource: encoding WinAnsiEncoding
/WinAnsiEncoding [
/.notdef /.notdef /.notdef /.notdef /.notdef
/.notdef /.notdef /.notdef /.notdef /.notdef
/.notdef /.notdef /.notdef /.notdef /.notdef
/.notdef /.notdef /.notdef /.notdef /.notdef
/.notdef /.notdef /.notdef /.notdef /.notdef
/.notdef /.notdef /.notdef /.notdef /.notdef
/.notdef /.notdef /space /exclam /quotedbl
/numbersign /dollar /percent /ampersand /quotesingle
/parenleft /parenright /asterisk /plus /comma
/hyphen /period /slash /zero /one
/two /three /four /five /six
/seven /eight /nine /colon /semicolon
/less /equal /greater /question /at
/A /B /C /D /E
/F /G /H /I /J
/K /L /M /N /O
/P /Q /R /S /T
/U /V /W /X /Y
/Z /bracketleft /backslash /bracketright /asciicircum
/underscore /quoteleft /a /b /c
/d /e /f /g /h
/i /j /k /l /m
/n /o /p /q /r
/s /t /u /v /w
/x /y /z /braceleft /bar
/braceright /asciitilde /bullet /Euro /bullet
/quotesinglbase /florin /quotedblbase /ellipsis /dagger
/daggerdbl /circumflex /perthousand /Scaron /guilsinglleft
/OE /bullet /Zcaron /bullet /bullet
/quoteleft /quoteright /quotedblleft /quotedblright /bullet
/endash /emdash /asciitilde /trademark /scaron
/guilsinglright /oe /bullet /zcaron /Ydieresis
/space /exclamdown /cent /sterling /currency
/yen /brokenbar /section /dieresis /copyright
/ordfeminine /guillemotleft /logicalnot /sfthyphen /registered
/macron /degree /plusminus /twosuperior /threesuperior
/acute /mu /paragraph /middot /cedilla
/onesuperior /ordmasculine /guillemotright /onequarter /onehalf
/threequarters /questiondown /Agrave /Aacute /Acircumflex
/Atilde /Adieresis /Aring /AE /Ccedilla
/Egrave /Eacute /Ecircumflex /Edieresis /Igrave
/Iacute /Icircumflex /Idieresis /Eth /Ntilde
/Ograve /Oacute /Ocircumflex /Otilde /Odieresis
/multiply /Oslash /Ugrave /Uacute /Ucircumflex
/Udieresis /Yacute /Thorn /germandbls /agrave
/aacute /acircumflex /atilde /adieresis /aring
/ae /ccedilla /egrave /eacute /ecircumflex
/edieresis /igrave /iacute /icircumflex /idieresis
/eth /ntilde /ograve /oacute /ocircumflex
/otilde /odieresis /divide /oslash /ugrave
/uacute /ucircumflex /udieresis /yacute /thorn
/ydieresis
] def
%%EndResource
%FOPBeginFontReencode
/Courier-Oblique findfont
dup length dict begin
  {1 index /FID ne {def} {pop pop} ifelse} forall
  /Encoding WinAnsiEncoding def
  currentdict
end
/Courier-Oblique exch definefont pop
/Courier-BoldOblique findfont
dup length dict begin
  {1 index /FID ne {def} {pop pop} ifelse} forall
  /Encoding WinAnsiEncoding def
  currentdict
end
/Courier-BoldOblique exch definefont pop
/Courier-Bold findfont
dup length dict begin
  {1 index /FID ne {def} {pop pop} ifelse} forall
  /Encoding WinAnsiEncoding def
  currentdict
end
/Courier-Bold exch definefont pop
/Helvetica findfont
dup length dict begin
  {1 index /FID ne {def} {pop pop} ifelse} forall
  /Encoding WinAnsiEncoding def
  currentdict
end
/Helvetica exch definefont pop
/Helvetica-Oblique findfont
dup length dict begin
  {1 index /FID ne {def} {pop pop} ifelse} forall
  /Encoding WinAnsiEncoding def
  currentdict
end
/Helvetica-Oblique exch definefont pop
/Helvetica-Bold findfont
dup length dict begin
  {1 index /FID ne {def} {pop pop} ifelse} forall
  /Encoding WinAnsiEncoding def
  currentdict
end
/Helvetica-Bold exch definefont pop
/Helvetica-BoldOblique findfont
dup length dict begin
  {1 index /FID ne {def} {pop pop} ifelse} forall
  /Encoding WinAnsiEncoding def
  currentdict
end
/Helvetica-BoldOblique exch definefont pop
/Times-Roman findfont
dup length dict begin
  {1 index /FID ne {def} {pop pop} ifelse} forall
  /Encoding WinAnsiEncoding def
  currentdict
end
/Times-Roman exch definefont pop
/Times-Italic findfont
dup length dict begin
  {1 index /FID ne {def} {pop pop} ifelse} forall
  /Encoding WinAnsiEncoding def
  currentdict
end
/Times-Italic exch definefont pop
/Times-Bold findfont
dup length dict begin
  {1 index /FID ne {def} {pop pop} ifelse} forall
  /Encoding WinAnsiEncoding def
  currentdict
end
/Times-Bold exch definefont pop
/Times-BoldItalic findfont
dup length dict begin
  {1 index /FID ne {def} {pop pop} ifelse} forall
  /Encoding WinAnsiEncoding def
  currentdict
end
/Times-BoldItalic exch definefont pop
/Courier findfont
dup length dict begin
  {1 index /FID ne {def} {pop pop} ifelse} forall
  /Encoding WinAnsiEncoding def
  currentdict
end
/Courier exch definefont pop
%FOPEndFontReencode
%%EndProlog
%%Page: 1 1
%%PageBoundingBox: 0 0 283 283
%%BeginPageSetup
[1 0 0 -1 0 283] CT
%%EndPageSetup
GS
[1.00164 0 0 1 0 0] CT
1 GC
N
0 0 283 283 re
f
GR
GS
[1.00164 0 0 1 0 0] CT
1 GC
N
0 0 283 283 re
f
GR
GS
[1.00164 0 0 1 0 0] CT
1 GC
N
40.5 233.5 M
256 233.5 L
256 21 L
40.5 21 L
cp
f
GR
GS
[1.00164 0 0 1 0 0] CT
2 setlinecap
1 LJ
0.5 LW
N
40.5 233.5 M
256 233.5 L
S
GR
GS
[1.00164 0 0 1 0 0] CT
2 setlinecap
1 LJ
0.5 LW
N
76.417 233.5 M
76.417 231.346 L
S
GR
GS
[1.00164 0 0 1 0 0] CT
2 setlinecap
1 LJ
0.5 LW
N
148.25 233.5 M
148.25 231.346 L
S
GR
GS
[1.00164 0 0 1 0 0] CT
2 setlinecap
1 LJ
0.5 LW
N
220.083 233.5 M
220.083 231.346 L
S
GR
GS
[1.00164 0 0 1 76.54211 239.10001] CT
/Helvetica 18 F
GS
[1 0 0 1 0 0] CT
-5.5 18 moveto 
1 -1 scale
(0) t 
GR
GR
GS
[1.00164 0 0 1 148.49337 239.10001] CT
/Helvetica 18 F
GS
[1 0 0 1 0 0] CT
-13 18 moveto 
1 -1 scale
(0.1) t 
GR
GR
GS
[1.00164 0 0 1 220.44461 239.10001] CT
/Helvetica 18 F
GS
[1 0 0 1 0 0] CT
-13 18 moveto 
1 -1 scale
(0.2) t 
GR
GR
GS
[1.00164 0 0 1 148.49347 261.5] CT
/Helvetica 18 F
GS
[1 0 0 1 0 0] CT
-98.5 18 moveto 
1 -1 scale
(Stroop SOT Interference) t 
GR
GR
GS
[1.00164 0 0 1 0 0] CT
2 setlinecap
1 LJ
0.5 LW
N
40.5 233.5 M
40.5 21 L
S
GR
GS
[1.00164 0 0 1 0 0] CT
2 setlinecap
1 LJ
0.5 LW
N
40.5 233.5 M
42.654 233.5 L
S
GR
GS
[1.00164 0 0 1 0 0] CT
2 setlinecap
1 LJ
0.5 LW
N
40.5 164.748 M
42.654 164.748 L
S
GR
GS
[1.00164 0 0 1 0 0] CT
2 setlinecap
1 LJ
0.5 LW
N
40.5 95.996 M
42.654 95.996 L
S
GR
GS
[1.00164 0 0 1 0 0] CT
2 setlinecap
1 LJ
0.5 LW
N
40.5 27.244 M
42.654 27.244 L
S
GR
GS
[1.00164 0 0 1 34.95729 233.5] CT
/Helvetica 18 F
GS
[1 0 0 1 0 0] CT
-11 7 moveto 
1 -1 scale
(0) t 
GR
GR
GS
[1.00164 0 0 1 34.95729 164.74785] CT
/Helvetica 18 F
GS
[1 0 0 1 0 0] CT
-11 7 moveto 
1 -1 scale
(1) t 
GR
GR
GS
[1.00164 0 0 1 34.95729 95.9957] CT
/Helvetica 18 F
GS
[1 0 0 1 0 0] CT
-11 7 moveto 
1 -1 scale
(2) t 
GR
GR
GS
[1.00164 0 0 1 34.95729 27.24356] CT
/Helvetica 18 F
GS
[1 0 0 1 0 0] CT
-11 7 moveto 
1 -1 scale
(3) t 
GR
GR
GS
[0 -1 1.00164 0 21.53529 127.2499] CT
/Helvetica 18 F
GS
[1 0 0 1 0 0] CT
-78 -4 moveto 
1 -1 scale
(Drift Rate L1 MAAT) t 
GR
GR
GS
[1.00164 0 0 1 124.22319 62.36318] CT
N
0.5 0 M
0.5 -0.276 0.276 -0.5 0 -0.5 C
-0.276 -0.5 -0.5 -0.276 -0.5 0 C
-0.5 0.276 -0.276 0.5 0 0.5 C
0.276 0.5 0.5 0.276 0.5 0 C
cp
f
GR
GS
[1.00164 0 0 1 105.16925 104.55522] CT
N
/f-2105962265{0.5 0 M
0.5 -0.276 0.276 -0.5 0 -0.5 C
-0.276 -0.5 -0.5 -0.276 -0.5 0 C
-0.5 0.276 -0.276 0.5 0 0.5 C
0.276 0.5 0.5 0.276 0.5 0 C
cp}def
f-2105962265
f
GR
GS
[1.00164 0 0 1 96.08188 70.84269] CT
N
f-2105962265
f
GR
GS
[1.00164 0 0 1 80.89978 100.26105] CT
N
f-2105962265
f
GR
GS
[1.00164 0 0 1 76.17791 148.13155] CT
N
f-2105962265
f
GR
GS
[1.00164 0 0 1 140.32473 76.58411] CT
N
f-2105962265
f
GR
GS
[1.00164 0 0 1 104.81964 76.0301] CT
N
f-2105962265
f
GR
GS
[1.00164 0 0 1 98.77601 54.2805] CT
N
f-2105962265
f
GR
GS
[1.00164 0 0 1 145.27479 132.44775] CT
N
f-2105962265
f
GR
GS
[1.00164 0 0 1 104.19262 118.07829] CT
N
f-2105962265
f
GR
GS
[1.00164 0 0 1 126.35774 101.80945] CT
N
f-2105962265
f
GR
GS
[1.00164 0 0 1 102.3803 77.41784] CT
N
f-2105962265
f
GR
GS
[1.00164 0 0 1 98.24607 81.45527] CT
N
f-2105962265
f
GR
GS
[1.00164 0 0 1 94.07401 114.94781] CT
N
f-2105962265
f
GR
GS
[1.00164 0 0 1 114.27375 121.74379] CT
N
f-2105962265
f
GR
GS
[1.00164 0 0 1 154.48527 71.4574] CT
N
f-2105962265
f
GR
GS
[1.00164 0 0 1 103.45864 111.18056] CT
N
f-2105962265
f
GR
GS
[1.00164 0 0 1 96.60796 98.50426] CT
N
f-2105962265
f
GR
GS
[1.00164 0 0 1 63.30272 125.97823] CT
N
f-2105962265
f
GR
GS
[1.00164 0 0 1 143.66055 193.77803] CT
N
f-2105962265
f
GR
GS
[1.00164 0 0 1 134.2072 113.15849] CT
N
f-2105962265
f
GR
GS
[1.00164 0 0 1 108.83277 65.9379] CT
N
f-2105962265
f
GR
GS
[1.00164 0 0 1 123.63129 233.5] CT
N
f-2105962265
f
GR
GS
[1.00164 0 0 1 106.93997 81.22066] CT
N
f-2105962265
f
GR
GS
[1.00164 0 0 1 114.11715 106.06985] CT
N
f-2105962265
f
GR
GS
[1.00164 0 0 1 113.3873 56.05716] CT
N
f-2105962265
f
GR
GS
[1.00164 0 0 1 115.52707 68.15599] CT
N
f-2105962265
f
GR
GS
[1.00164 0 0 1 116.74526 92.46647] CT
N
f-2105962265
f
GR
GS
[1.00164 0 0 1 141.87985 152.82216] CT
N
f-2105962265
f
GR
GS
[1.00164 0 0 1 120.14227 57.27481] CT
N
f-2105962265
f
GR
GS
[1.00164 0 0 1 107.77891 36.25052] CT
N
f-2105962265
f
GR
GS
[1.00164 0 0 1 91.83997 82.69429] CT
N
f-2105962265
f
GR
GS
[1.00164 0 0 1 88.62596 104.15826] CT
N
f-2105962265
f
GR
GS
[1.00164 0 0 1 102.44258 37.78748] CT
N
f-2105962265
f
GR
GS
[1.00164 0 0 1 110.5913 55.73667] CT
N
f-2105962265
f
GR
GS
[1.00164 0 0 1 161.74924 100.81679] CT
N
f-2105962265
f
GR
GS
[1.00164 0 0 1 76.07814 78.49117] CT
N
f-2105962265
f
GR
GS
[1.00164 0 0 1 111.12169 31.75976] CT
N
f-2105962265
f
GR
GS
[1.00164 0 0 1 86.65797 45.07696] CT
N
f-2105962265
f
GR
GS
[1.00164 0 0 1 99.06002 44.13541] CT
N
f-2105962265
f
GR
GS
[1.00164 0 0 1 145.41462 69.40426] CT
N
f-2105962265
f
GR
GS
[1.00164 0 0 1 100.72163 20.99999] CT
N
f-2105962265
f
GR
GS
[1.00164 0 0 1 169.08925 106.58587] CT
N
f-2105962265
f
GR
GS
[1.00164 0 0 1 126.18838 41.83646] CT
N
f-2105962265
f
GR
GS
[1.00164 0 0 1 118.98011 133.81091] CT
N
f-2105962265
f
GR
GS
[1.00164 0 0 1 110.7519 64.32595] CT
N
f-2105962265
f
GR
GS
[1.00164 0 0 1 80.84044 105.93557] CT
N
f-2105962265
f
GR
GS
[1.00164 0 0 1 99.71567 80.57898] CT
N
f-2105962265
f
GR
GS
[1.00164 0 0 1 191.75748 162.68993] CT
N
f-2105962265
f
GR
GS
[1.00164 0 0 1 144.62883 148.66461] CT
N
f-2105962265
f
GR
GS
[1.00164 0 0 1 126.65363 129.92232] CT
N
f-2105962265
f
GR
GS
[1.00164 0 0 1 109.14531 222.01062] CT
N
f-2105962265
f
GR
GS
[1.00164 0 0 1 126.16299 139.37393] CT
N
f-2105962265
f
GR
GS
[1.00164 0 0 1 118.71661 174.4612] CT
N
f-2105962265
f
GR
GS
[1.00164 0 0 1 132.31295 120.39824] CT
N
f-2105962265
f
GR
GS
[1.00164 0 0 1 142.11907 161.82997] CT
N
f-2105962265
f
GR
GS
[1.00164 0 0 1 152.22759 158.67377] CT
N
f-2105962265
f
GR
GS
[1.00164 0 0 1 104.05216 147.45695] CT
N
f-2105962265
f
GR
GS
[1.00164 0 0 1 149.96058 144.95802] CT
N
f-2105962265
f
GR
GS
[1.00164 0 0 1 86.38694 189.43477] CT
N
f-2105962265
f
GR
GS
[1.00164 0 0 1 102.15855 109.39515] CT
N
f-2105962265
f
GR
GS
[1.00164 0 0 1 105.95322 140.28786] CT
N
f-2105962265
f
GR
GS
[1.00164 0 0 1 145.81733 154.07343] CT
N
f-2105962265
f
GR
GS
[1.00164 0 0 1 140.37566 124.47051] CT
N
f-2105962265
f
GR
GS
[1.00164 0 0 1 125.32197 137.67656] CT
N
f-2105962265
f
GR
GS
[1.00164 0 0 1 121.61063 162.50774] CT
N
f-2105962265
f
GR
GS
[1.00164 0 0 1 203.02306 168.46004] CT
N
f-2105962265
f
GR
GS
[1.00164 0 0 1 91.17394 209.4303] CT
N
f-2105962265
f
GR
GS
[1.00164 0 0 1 162.00056 158.3121] CT
N
f-2105962265
f
GR
GS
[1.00164 0 0 1 174.36345 162.37065] CT
N
f-2105962265
f
GR
GS
[1.00164 0 0 1 138.56821 167.3055] CT
N
f-2105962265
f
GR
GS
[1.00164 0 0 1 113.01204 176.84027] CT
N
f-2105962265
f
GR
GS
[1.00164 0 0 1 176.56831 161.37816] CT
N
f-2105962265
f
GR
GS
[1.00164 0 0 1 112.46764 128.13361] CT
N
f-2105962265
f
GR
GS
[1.00164 0 0 1 118.4007 117.75933] CT
N
f-2105962265
f
GR
GS
[1.00164 0 0 1 156.04916 155.91281] CT
N
f-2105962265
f
GR
GS
[1.00164 0 0 1 153.77202 145.02492] CT
N
f-2105962265
f
GR
GS
[1.00164 0 0 1 192.41005 142.68735] CT
N
f-2105962265
f
GR
GS
[1.00164 0 0 1 190.14778 180.66011] CT
N
f-2105962265
f
GR
GS
[1.00164 0 0 1 137.51694 125.00801] CT
N
f-2105962265
f
GR
GS
[1.00164 0 0 1 144.41964 182.98662] CT
N
f-2105962265
f
GR
GS
[1.00164 0 0 1 156.38484 165.29903] CT
N
f-2105962265
f
GR
GS
[1.00164 0 0 1 124.91207 161.96204] CT
N
f-2105962265
f
GR
GS
[1.00164 0 0 1 155.34023 176.306] CT
N
f-2105962265
f
GR
GS
[1.00164 0 0 1 143.48294 200.43211] CT
N
f-2105962265
f
GR
GS
[1.00164 0 0 1 181.86974 172.05725] CT
N
f-2105962265
f
GR
GS
[1.00164 0 0 1 244.28986 149.98259] CT
N
f-2105962265
f
GR
GS
[1.00164 0 0 1 127.85056 150.64099] CT
N
f-2105962265
f
GR
GS
[1.00164 0 0 1 224.76974 216.61913] CT
N
f-2105962265
f
GR
GS
[1.00164 0 0 1 218.07843 200.59717] CT
N
f-2105962265
f
GR
GS
[1.00164 0 0 1 193.21471 157.875] CT
N
f-2105962265
f
GR
GS
[1.00164 0 0 1 119.60452 152.44104] CT
N
f-2105962265
f
GR
GS
[1.00164 0 0 1 166.47992 150.85519] CT
N
f-2105962265
f
GR
GS
[1.00164 0 0 1 149.09171 166.13948] CT
N
f-2105962265
f
GR
GS
[1.00164 0 0 1 131.73695 163.17607] CT
N
f-2105962265
f
GR
GS
[1.00164 0 0 1 172.04614 161.27531] CT
N
f-2105962265
f
GR
GS
[1.00164 0 0 1 126.75599 137.55753] CT
N
f-2105962265
f
GR
GS
[1.00164 0 0 1 102.09221 151.80594] CT
N
f-2105962265
f
GR
GS
[1.00164 0 0 1 113.1575 115.9341] CT
N
f-2105962265
f
GR
GS
[1.00164 0 0 1 119.49758 173.84116] CT
N
f-2105962265
f
GR
GS
[1.00164 0 0 1 155.83346 176.36806] CT
N
f-2105962265
f
GR
GS
[1.00164 0 0 1 0 0] CT
1 LJ
3 LW
N
40.5 67.854 M
256 208.977 L
S
GR
GS
[1.00164 0 0 1 124.22319 62.36318] CT
N
/f227889816{-3 -3 M
-3 3 L
3 3 L
3 -3 L
cp}def
f227889816
f
GR
GS
[1.00164 0 0 1 105.16925 104.55522] CT
N
f227889816
f
GR
GS
[1.00164 0 0 1 96.08188 70.84269] CT
N
f227889816
f
GR
GS
[1.00164 0 0 1 80.89978 100.26105] CT
N
f227889816
f
GR
GS
[1.00164 0 0 1 76.17791 148.13155] CT
N
f227889816
f
GR
GS
[1.00164 0 0 1 140.32473 76.58411] CT
N
f227889816
f
GR
GS
[1.00164 0 0 1 104.81964 76.0301] CT
N
f227889816
f
GR
GS
[1.00164 0 0 1 98.77601 54.2805] CT
N
f227889816
f
GR
GS
[1.00164 0 0 1 145.27479 132.44775] CT
N
f227889816
f
GR
GS
[1.00164 0 0 1 102.3803 77.41784] CT
N
f227889816
f
GR
GS
[1.00164 0 0 1 94.07401 114.94781] CT
N
f227889816
f
GR
GS
[1.00164 0 0 1 154.48527 71.4574] CT
N
f227889816
f
GR
GS
[1.00164 0 0 1 103.45864 111.18056] CT
N
f227889816
f
GR
GS
[1.00164 0 0 1 96.60796 98.50426] CT
N
f227889816
f
GR
GS
[1.00164 0 0 1 63.30272 125.97823] CT
N
f227889816
f
GR
GS
[1.00164 0 0 1 143.66055 193.77803] CT
N
f227889816
f
GR
GS
[1.00164 0 0 1 134.2072 113.15849] CT
N
f227889816
f
GR
GS
[1.00164 0 0 1 108.83277 65.9379] CT
N
f227889816
f
GR
GS
[1.00164 0 0 1 106.93997 81.22066] CT
N
f227889816
f
GR
GS
[1.00164 0 0 1 114.11715 106.06985] CT
N
f227889816
f
GR
GS
[1.00164 0 0 1 113.3873 56.05716] CT
N
f227889816
f
GR
GS
[1.00164 0 0 1 116.74526 92.46647] CT
N
f227889816
f
GR
GS
[1.00164 0 0 1 141.87985 152.82216] CT
N
f227889816
f
GR
GS
[1.00164 0 0 1 120.14227 57.27481] CT
N
f227889816
f
GR
GS
[1.00164 0 0 1 107.77891 36.25052] CT
N
f227889816
f
GR
GS
[1.00164 0 0 1 91.83997 82.69429] CT
N
f227889816
f
GR
GS
[1.00164 0 0 1 88.62596 104.15826] CT
N
f227889816
f
GR
GS
[1.00164 0 0 1 102.44258 37.78748] CT
N
f227889816
f
GR
GS
[1.00164 0 0 1 110.5913 55.73667] CT
N
f227889816
f
GR
GS
[1.00164 0 0 1 161.74924 100.81679] CT
N
f227889816
f
GR
GS
[1.00164 0 0 1 76.07814 78.49117] CT
N
f227889816
f
GR
GS
[1.00164 0 0 1 111.12169 31.75976] CT
N
f227889816
f
GR
GS
[1.00164 0 0 1 86.65797 45.07696] CT
N
f227889816
f
GR
GS
[1.00164 0 0 1 99.06002 44.13541] CT
N
f227889816
f
GR
GS
[1.00164 0 0 1 145.41462 69.40426] CT
N
f227889816
f
GR
GS
[1.00164 0 0 1 100.72163 20.99999] CT
N
f227889816
f
GR
GS
[1.00164 0 0 1 169.08925 106.58587] CT
N
f227889816
f
GR
GS
[1.00164 0 0 1 126.18838 41.83646] CT
N
f227889816
f
GR
GS
[1.00164 0 0 1 118.98011 133.81091] CT
N
f227889816
f
GR
GS
[1.00164 0 0 1 110.7519 64.32595] CT
N
f227889816
f
GR
GS
[1.00164 0 0 1 80.84044 105.93557] CT
N
f227889816
f
GR
GS
[1.00164 0 0 1 99.71567 80.57898] CT
N
f227889816
f
GR
GS
[1.00164 0 0 1 191.75748 162.68993] CT
N
/f-1969333140{-3.536 0 M
0 4.702 L
3.536 0 L
0 -4.702 L
cp}def
f-1969333140
f
GR
GS
[1.00164 0 0 1 144.62883 148.66461] CT
N
f-1969333140
f
GR
GS
[1.00164 0 0 1 126.65363 129.92232] CT
N
f-1969333140
f
GR
GS
[1.00164 0 0 1 109.14531 222.01062] CT
N
f-1969333140
f
GR
GS
[1.00164 0 0 1 126.16299 139.37393] CT
N
f-1969333140
f
GR
GS
[1.00164 0 0 1 118.71661 174.4612] CT
N
f-1969333140
f
GR
GS
[1.00164 0 0 1 132.31295 120.39824] CT
N
f-1969333140
f
GR
GS
[1.00164 0 0 1 142.11907 161.82997] CT
N
f-1969333140
f
GR
GS
[1.00164 0 0 1 152.22759 158.67377] CT
N
f-1969333140
f
GR
GS
[1.00164 0 0 1 104.05216 147.45695] CT
N
f-1969333140
f
GR
GS
[1.00164 0 0 1 149.96058 144.95802] CT
N
f-1969333140
f
GR
GS
[1.00164 0 0 1 86.38694 189.43477] CT
N
f-1969333140
f
GR
GS
[1.00164 0 0 1 102.15855 109.39515] CT
N
f-1969333140
f
GR
GS
[1.00164 0 0 1 105.95322 140.28786] CT
N
f-1969333140
f
GR
GS
[1.00164 0 0 1 145.81733 154.07343] CT
N
f-1969333140
f
GR
GS
[1.00164 0 0 1 140.37566 124.47051] CT
N
f-1969333140
f
GR
GS
[1.00164 0 0 1 125.32197 137.67656] CT
N
f-1969333140
f
GR
GS
[1.00164 0 0 1 121.61063 162.50774] CT
N
f-1969333140
f
GR
GS
[1.00164 0 0 1 203.02306 168.46004] CT
N
f-1969333140
f
GR
GS
[1.00164 0 0 1 91.17394 209.4303] CT
N
f-1969333140
f
GR
GS
[1.00164 0 0 1 162.00056 158.3121] CT
N
f-1969333140
f
GR
GS
[1.00164 0 0 1 174.36345 162.37065] CT
N
f-1969333140
f
GR
GS
[1.00164 0 0 1 138.56821 167.3055] CT
N
f-1969333140
f
GR
GS
[1.00164 0 0 1 113.01204 176.84027] CT
N
f-1969333140
f
GR
GS
[1.00164 0 0 1 176.56831 161.37816] CT
N
f-1969333140
f
GR
GS
[1.00164 0 0 1 112.46764 128.13361] CT
N
f-1969333140
f
GR
GS
[1.00164 0 0 1 118.4007 117.75933] CT
N
f-1969333140
f
GR
GS
[1.00164 0 0 1 156.04916 155.91281] CT
N
f-1969333140
f
GR
GS
[1.00164 0 0 1 153.77202 145.02492] CT
N
f-1969333140
f
GR
GS
[1.00164 0 0 1 192.41005 142.68735] CT
N
f-1969333140
f
GR
GS
[1.00164 0 0 1 190.14778 180.66011] CT
N
f-1969333140
f
GR
GS
[1.00164 0 0 1 137.51694 125.00801] CT
N
f-1969333140
f
GR
GS
[1.00164 0 0 1 144.41964 182.98662] CT
N
f-1969333140
f
GR
GS
[1.00164 0 0 1 156.38484 165.29903] CT
N
f-1969333140
f
GR
GS
[1.00164 0 0 1 124.91207 161.96204] CT
N
f-1969333140
f
GR
GS
[1.00164 0 0 1 155.34023 176.306] CT
N
f-1969333140
f
GR
GS
[1.00164 0 0 1 143.48294 200.43211] CT
N
f-1969333140
f
GR
GS
[1.00164 0 0 1 181.86974 172.05725] CT
N
f-1969333140
f
GR
GS
[1.00164 0 0 1 244.28986 149.98259] CT
N
f-1969333140
f
GR
GS
[1.00164 0 0 1 127.85056 150.64099] CT
N
f-1969333140
f
GR
GS
[1.00164 0 0 1 224.76974 216.61913] CT
N
f-1969333140
f
GR
GS
[1.00164 0 0 1 218.07843 200.59717] CT
N
f-1969333140
f
GR
GS
[1.00164 0 0 1 193.21471 157.875] CT
N
f-1969333140
f
GR
GS
[1.00164 0 0 1 119.60452 152.44104] CT
N
f-1969333140
f
GR
GS
[1.00164 0 0 1 166.47992 150.85519] CT
N
f-1969333140
f
GR
GS
[1.00164 0 0 1 149.09171 166.13948] CT
N
f-1969333140
f
GR
GS
[1.00164 0 0 1 131.73695 163.17607] CT
N
f-1969333140
f
GR
GS
[1.00164 0 0 1 172.04614 161.27531] CT
N
f-1969333140
f
GR
GS
[1.00164 0 0 1 126.75599 137.55753] CT
N
f-1969333140
f
GR
GS
[1.00164 0 0 1 102.09221 151.80594] CT
N
f-1969333140
f
GR
GS
[1.00164 0 0 1 113.1575 115.9341] CT
N
f-1969333140
f
GR
GS
[1.00164 0 0 1 119.49758 173.84116] CT
N
f-1969333140
f
GR
GS
[1.00164 0 0 1 155.83346 176.36806] CT
N
f-1969333140
f
GR
GS
[1.00164 0 0 1 -113.1855 41.75] CT
/Helvetica 18 F
GS
[1 0 0 1 0 0] CT
0 7 moveto 
1 -1 scale
(r=-0.48, p = 1.1e-06, control r=-0.17, p = 0.1) t 
GR
GR
%%Trailer
%%Pages: 1
%%EOF
