%!PS-Adobe-3.0 EPSF-3.0
%%Creator: (MATLAB, The Mathworks, Inc. Version 9.8.0.1323502 \(R2020a\). Operating System: Mac OS X)
%%Title: /Users/kosciessa/Desktop/tardis/LNDG/stateswitch/stsw_beh_stroop/figures/D_StroopRT_Drift.eps
%%CreationDate: 2022-11-03T14:05:06
%%Pages: (atend)
%%BoundingBox:    16     0   521   396
%%LanguageLevel: 3
%%EndComments
%%BeginProlog
%%BeginResource: procset (Apache XML Graphics Std ProcSet) 1.2 0
%%Version: 1.2 0
%%Copyright: (Copyright 2001-2003,2010 The Apache Software Foundation. License terms: http://www.apache.org/licenses/LICENSE-2.0)
/bd{bind def}bind def
/ld{load def}bd
/GR/grestore ld
/GS/gsave ld
/RM/rmoveto ld
/C/curveto ld
/t/show ld
/L/lineto ld
/ML/setmiterlimit ld
/CT/concat ld
/f/fill ld
/N/newpath ld
/S/stroke ld
/CC/setcmykcolor ld
/A/ashow ld
/cp/closepath ld
/RC/setrgbcolor ld
/LJ/setlinejoin ld
/GC/setgray ld
/LW/setlinewidth ld
/M/moveto ld
/re {4 2 roll M
1 index 0 rlineto
0 exch rlineto
neg 0 rlineto
cp } bd
/_ctm matrix def
/_tm matrix def
/BT { _ctm currentmatrix pop matrix _tm copy pop 0 0 moveto } bd
/ET { _ctm setmatrix } bd
/iTm { _ctm setmatrix _tm concat } bd
/Tm { _tm astore pop iTm 0 0 moveto } bd
/ux 0.0 def
/uy 0.0 def
/F {
  /Tp exch def
  /Tf exch def
  Tf findfont Tp scalefont setfont
  /cf Tf def  /cs Tp def
} bd
/ULS {currentpoint /uy exch def /ux exch def} bd
/ULE {
  /Tcx currentpoint pop def
  gsave
  newpath
  cf findfont cs scalefont dup
  /FontMatrix get 0 get /Ts exch def /FontInfo get dup
  /UnderlinePosition get Ts mul /To exch def
  /UnderlineThickness get Ts mul /Tt exch def
  ux uy To add moveto  Tcx uy To add lineto
  Tt setlinewidth stroke
  grestore
} bd
/OLE {
  /Tcx currentpoint pop def
  gsave
  newpath
  cf findfont cs scalefont dup
  /FontMatrix get 0 get /Ts exch def /FontInfo get dup
  /UnderlinePosition get Ts mul /To exch def
  /UnderlineThickness get Ts mul /Tt exch def
  ux uy To add cs add moveto Tcx uy To add cs add lineto
  Tt setlinewidth stroke
  grestore
} bd
/SOE {
  /Tcx currentpoint pop def
  gsave
  newpath
  cf findfont cs scalefont dup
  /FontMatrix get 0 get /Ts exch def /FontInfo get dup
  /UnderlinePosition get Ts mul /To exch def
  /UnderlineThickness get Ts mul /Tt exch def
  ux uy To add cs 10 mul 26 idiv add moveto Tcx uy To add cs 10 mul 26 idiv add lineto
  Tt setlinewidth stroke
  grestore
} bd
/QT {
/Y22 exch store
/X22 exch store
/Y21 exch store
/X21 exch store
currentpoint
/Y21 load 2 mul add 3 div exch
/X21 load 2 mul add 3 div exch
/X21 load 2 mul /X22 load add 3 div
/Y21 load 2 mul /Y22 load add 3 div
/X22 load /Y22 load curveto
} bd
/SSPD {
dup length /d exch dict def
{
/v exch def
/k exch def
currentpagedevice k known {
/cpdv currentpagedevice k get def
v cpdv ne {
/upd false def
/nullv v type /nulltype eq def
/nullcpdv cpdv type /nulltype eq def
nullv nullcpdv or
{
/upd true def
} {
/sametype v type cpdv type eq def
sametype {
v type /arraytype eq {
/vlen v length def
/cpdvlen cpdv length def
vlen cpdvlen eq {
0 1 vlen 1 sub {
/i exch def
/obj v i get def
/cpdobj cpdv i get def
obj cpdobj ne {
/upd true def
exit
} if
} for
} {
/upd true def
} ifelse
} {
v type /dicttype eq {
v {
/dv exch def
/dk exch def
/cpddv cpdv dk get def
dv cpddv ne {
/upd true def
exit
} if
} forall
} {
/upd true def
} ifelse
} ifelse
} if
} ifelse
upd true eq {
d k v put
} if
} if
} if
} forall
d length 0 gt {
d setpagedevice
} if
} bd
/RE { % /NewFontName [NewEncodingArray] /FontName RE -
  findfont dup length dict begin
  {
    1 index /FID ne
    {def} {pop pop} ifelse
  } forall
  /Encoding exch def
  /FontName 1 index def
  currentdict definefont pop
  end
} bind def
%%EndResource
%%BeginResource: procset (Apache XML Graphics EPS ProcSet) 1.0 0
%%Version: 1.0 0
%%Copyright: (Copyright 2002-2003 The Apache Software Foundation. License terms: http://www.apache.org/licenses/LICENSE-2.0)
/BeginEPSF { %def
/b4_Inc_state save def         % Save state for cleanup
/dict_count countdictstack def % Count objects on dict stack
/op_count count 1 sub def      % Count objects on operand stack
userdict begin                 % Push userdict on dict stack
/showpage { } def              % Redefine showpage, { } = null proc
0 setgray 0 setlinecap         % Prepare graphics state
1 setlinewidth 0 setlinejoin
10 setmiterlimit [ ] 0 setdash newpath
/languagelevel where           % If level not equal to 1 then
{pop languagelevel             % set strokeadjust and
1 ne                           % overprint to their defaults.
{false setstrokeadjust false setoverprint
} if
} if
} bd
/EndEPSF { %def
count op_count sub {pop} repeat            % Clean up stacks
countdictstack dict_count sub {end} repeat
b4_Inc_state restore
} bd
%%EndResource
%FOPBeginFontDict
%%IncludeResource: font Courier-Oblique
%%IncludeResource: font Courier-BoldOblique
%%IncludeResource: font Courier-Bold
%%IncludeResource: font ZapfDingbats
%%IncludeResource: font Symbol
%%IncludeResource: font Helvetica
%%IncludeResource: font Helvetica-Oblique
%%IncludeResource: font Helvetica-Bold
%%IncludeResource: font Helvetica-BoldOblique
%%IncludeResource: font Times-Roman
%%IncludeResource: font Times-Italic
%%IncludeResource: font Times-Bold
%%IncludeResource: font Times-BoldItalic
%%IncludeResource: font Courier
%FOPEndFontDict
%%BeginResource: encoding WinAnsiEncoding
/WinAnsiEncoding [
/.notdef /.notdef /.notdef /.notdef /.notdef
/.notdef /.notdef /.notdef /.notdef /.notdef
/.notdef /.notdef /.notdef /.notdef /.notdef
/.notdef /.notdef /.notdef /.notdef /.notdef
/.notdef /.notdef /.notdef /.notdef /.notdef
/.notdef /.notdef /.notdef /.notdef /.notdef
/.notdef /.notdef /space /exclam /quotedbl
/numbersign /dollar /percent /ampersand /quotesingle
/parenleft /parenright /asterisk /plus /comma
/hyphen /period /slash /zero /one
/two /three /four /five /six
/seven /eight /nine /colon /semicolon
/less /equal /greater /question /at
/A /B /C /D /E
/F /G /H /I /J
/K /L /M /N /O
/P /Q /R /S /T
/U /V /W /X /Y
/Z /bracketleft /backslash /bracketright /asciicircum
/underscore /quoteleft /a /b /c
/d /e /f /g /h
/i /j /k /l /m
/n /o /p /q /r
/s /t /u /v /w
/x /y /z /braceleft /bar
/braceright /asciitilde /bullet /Euro /bullet
/quotesinglbase /florin /quotedblbase /ellipsis /dagger
/daggerdbl /circumflex /perthousand /Scaron /guilsinglleft
/OE /bullet /Zcaron /bullet /bullet
/quoteleft /quoteright /quotedblleft /quotedblright /bullet
/endash /emdash /asciitilde /trademark /scaron
/guilsinglright /oe /bullet /zcaron /Ydieresis
/space /exclamdown /cent /sterling /currency
/yen /brokenbar /section /dieresis /copyright
/ordfeminine /guillemotleft /logicalnot /sfthyphen /registered
/macron /degree /plusminus /twosuperior /threesuperior
/acute /mu /paragraph /middot /cedilla
/onesuperior /ordmasculine /guillemotright /onequarter /onehalf
/threequarters /questiondown /Agrave /Aacute /Acircumflex
/Atilde /Adieresis /Aring /AE /Ccedilla
/Egrave /Eacute /Ecircumflex /Edieresis /Igrave
/Iacute /Icircumflex /Idieresis /Eth /Ntilde
/Ograve /Oacute /Ocircumflex /Otilde /Odieresis
/multiply /Oslash /Ugrave /Uacute /Ucircumflex
/Udieresis /Yacute /Thorn /germandbls /agrave
/aacute /acircumflex /atilde /adieresis /aring
/ae /ccedilla /egrave /eacute /ecircumflex
/edieresis /igrave /iacute /icircumflex /idieresis
/eth /ntilde /ograve /oacute /ocircumflex
/otilde /odieresis /divide /oslash /ugrave
/uacute /ucircumflex /udieresis /yacute /thorn
/ydieresis
] def
%%EndResource
%FOPBeginFontReencode
/Courier-Oblique findfont
dup length dict begin
  {1 index /FID ne {def} {pop pop} ifelse} forall
  /Encoding WinAnsiEncoding def
  currentdict
end
/Courier-Oblique exch definefont pop
/Courier-BoldOblique findfont
dup length dict begin
  {1 index /FID ne {def} {pop pop} ifelse} forall
  /Encoding WinAnsiEncoding def
  currentdict
end
/Courier-BoldOblique exch definefont pop
/Courier-Bold findfont
dup length dict begin
  {1 index /FID ne {def} {pop pop} ifelse} forall
  /Encoding WinAnsiEncoding def
  currentdict
end
/Courier-Bold exch definefont pop
/Helvetica findfont
dup length dict begin
  {1 index /FID ne {def} {pop pop} ifelse} forall
  /Encoding WinAnsiEncoding def
  currentdict
end
/Helvetica exch definefont pop
/Helvetica-Oblique findfont
dup length dict begin
  {1 index /FID ne {def} {pop pop} ifelse} forall
  /Encoding WinAnsiEncoding def
  currentdict
end
/Helvetica-Oblique exch definefont pop
/Helvetica-Bold findfont
dup length dict begin
  {1 index /FID ne {def} {pop pop} ifelse} forall
  /Encoding WinAnsiEncoding def
  currentdict
end
/Helvetica-Bold exch definefont pop
/Helvetica-BoldOblique findfont
dup length dict begin
  {1 index /FID ne {def} {pop pop} ifelse} forall
  /Encoding WinAnsiEncoding def
  currentdict
end
/Helvetica-BoldOblique exch definefont pop
/Times-Roman findfont
dup length dict begin
  {1 index /FID ne {def} {pop pop} ifelse} forall
  /Encoding WinAnsiEncoding def
  currentdict
end
/Times-Roman exch definefont pop
/Times-Italic findfont
dup length dict begin
  {1 index /FID ne {def} {pop pop} ifelse} forall
  /Encoding WinAnsiEncoding def
  currentdict
end
/Times-Italic exch definefont pop
/Times-Bold findfont
dup length dict begin
  {1 index /FID ne {def} {pop pop} ifelse} forall
  /Encoding WinAnsiEncoding def
  currentdict
end
/Times-Bold exch definefont pop
/Times-BoldItalic findfont
dup length dict begin
  {1 index /FID ne {def} {pop pop} ifelse} forall
  /Encoding WinAnsiEncoding def
  currentdict
end
/Times-BoldItalic exch definefont pop
/Courier findfont
dup length dict begin
  {1 index /FID ne {def} {pop pop} ifelse} forall
  /Encoding WinAnsiEncoding def
  currentdict
end
/Courier exch definefont pop
%FOPEndFontReencode
%%EndProlog
%%Page: 1 1
%%PageBoundingBox: 0 0 560 420
%%BeginPageSetup
[1 0 0 -1 0 420] CT
%%EndPageSetup
GS
1 GC
N
0 0 560 420 re
f
GR
GS
1 GC
N
0 0 560 420 re
f
GR
GS
1 GC
N
73 365 M
507 365 L
507 31.5 L
73 31.5 L
cp
f
GR
GS
2 setlinecap
1 LJ
0.5 LW
N
73 365 M
507 365 L
S
GR
GS
2 setlinecap
1 LJ
0.5 LW
N
73 365 M
73 360.66 L
S
GR
GS
2 setlinecap
1 LJ
0.5 LW
N
181.5 365 M
181.5 360.66 L
S
GR
GS
2 setlinecap
1 LJ
0.5 LW
N
290 365 M
290 360.66 L
S
GR
GS
2 setlinecap
1 LJ
0.5 LW
N
398.5 365 M
398.5 360.66 L
S
GR
GS
2 setlinecap
1 LJ
0.5 LW
N
507 365 M
507 360.66 L
S
GR
GS
[1 0 0 1 72.99998 371] CT
/Helvetica 20 F
GS
[1 0 0 1 0 0] CT
-14 20 moveto 
1 -1 scale
(1.4) t 
GR
GR
GS
[1 0 0 1 181.50002 371] CT
/Helvetica 20 F
GS
[1 0 0 1 0 0] CT
-14 20 moveto 
1 -1 scale
(1.6) t 
GR
GR
GS
[1 0 0 1 289.99997 371] CT
/Helvetica 20 F
GS
[1 0 0 1 0 0] CT
-14 20 moveto 
1 -1 scale
(1.8) t 
GR
GR
GS
[1 0 0 1 398.5 371] CT
/Helvetica 20 F
GS
[1 0 0 1 0 0] CT
-6 20 moveto 
1 -1 scale
(2) t 
GR
GR
GS
[1 0 0 1 507.00003 371] CT
/Helvetica 20 F
GS
[1 0 0 1 0 0] CT
-14 20 moveto 
1 -1 scale
(2.2) t 
GR
GR
GS
[1 0 0 1 290.00024 396] CT
/Helvetica 20 F
GS
[1 0 0 1 0 0] CT
-46 20 moveto 
1 -1 scale
(Stroop RT) t 
GR
GR
GS
2 setlinecap
1 LJ
0.5 LW
N
73 365 M
73 31.5 L
S
GR
GS
2 setlinecap
1 LJ
0.5 LW
N
73 365 M
77.34 365 L
S
GR
GS
2 setlinecap
1 LJ
0.5 LW
N
73 309.417 M
77.34 309.417 L
S
GR
GS
2 setlinecap
1 LJ
0.5 LW
N
73 253.833 M
77.34 253.833 L
S
GR
GS
2 setlinecap
1 LJ
0.5 LW
N
73 198.25 M
77.34 198.25 L
S
GR
GS
2 setlinecap
1 LJ
0.5 LW
N
73 142.667 M
77.34 142.667 L
S
GR
GS
2 setlinecap
1 LJ
0.5 LW
N
73 87.083 M
77.34 87.083 L
S
GR
GS
2 setlinecap
1 LJ
0.5 LW
N
73 31.5 M
77.34 31.5 L
S
GR
GS
[1 0 0 1 67 365] CT
/Helvetica 20 F
GS
[1 0 0 1 0 0] CT
-12 7.5 moveto 
1 -1 scale
(0) t 
GR
GR
GS
[1 0 0 1 67 309.41666] CT
/Helvetica 20 F
GS
[1 0 0 1 0 0] CT
-28 7.5 moveto 
1 -1 scale
(0.5) t 
GR
GR
GS
[1 0 0 1 67 253.83333] CT
/Helvetica 20 F
GS
[1 0 0 1 0 0] CT
-12 7.5 moveto 
1 -1 scale
(1) t 
GR
GR
GS
[1 0 0 1 67 198.25] CT
/Helvetica 20 F
GS
[1 0 0 1 0 0] CT
-28 7.5 moveto 
1 -1 scale
(1.5) t 
GR
GR
GS
[1 0 0 1 67 142.66667] CT
/Helvetica 20 F
GS
[1 0 0 1 0 0] CT
-12 7.5 moveto 
1 -1 scale
(2) t 
GR
GR
GS
[1 0 0 1 67 87.08334] CT
/Helvetica 20 F
GS
[1 0 0 1 0 0] CT
-28 7.5 moveto 
1 -1 scale
(2.5) t 
GR
GR
GS
[1 0 0 1 67 31.5] CT
/Helvetica 20 F
GS
[1 0 0 1 0 0] CT
-12 7.5 moveto 
1 -1 scale
(3) t 
GR
GR
GS
[0 -1 1 0 36 198.24985] CT
/Helvetica 20 F
GS
[1 0 0 1 0 0] CT
-86.5 -5 moveto 
1 -1 scale
(Drift Rate L1 MAAT) t 
GR
GR
GS
[1 0 0 1 247.66968 110.07507] CT
N
3.536 0 M
3.536 -1.953 1.953 -3.536 0 -3.536 C
-1.953 -3.536 -3.536 -1.953 -3.536 0 C
-3.536 1.953 -1.953 3.536 0 3.536 C
1.953 3.536 3.536 1.953 3.536 0 C
cp
f
GR
GS
[1 0 0 1 202.80284 172.37717] CT
N
/f-397848163{3.536 0 M
3.536 -1.953 1.953 -3.536 0 -3.536 C
-1.953 -3.536 -3.536 -1.953 -3.536 0 C
-3.536 1.953 -1.953 3.536 0 3.536 C
1.953 3.536 3.536 1.953 3.536 0 C
cp}def
f-397848163
f
GR
GS
[1 0 0 1 192.62906 133.22125] CT
N
f-397848163
f
GR
GS
[1 0 0 1 178.33023 130.43996] CT
N
f-397848163
f
GR
GS
[1 0 0 1 312.47595 230.81015] CT
N
f-397848163
f
GR
GS
[1 0 0 1 211.64661 115.89896] CT
N
f-397848163
f
GR
GS
[1 0 0 1 248.66606 105.83063] CT
N
f-397848163
f
GR
GS
[1 0 0 1 163.91389 57.56648] CT
N
f-397848163
f
GR
GS
[1 0 0 1 200.25668 214.65514] CT
N
f-397848163
f
GR
GS
[1 0 0 1 250.02939 133.42232] CT
N
f-397848163
f
GR
GS
[1 0 0 1 238.51393 166.54083] CT
N
f-397848163
f
GR
GS
[1 0 0 1 257.77026 131.61646] CT
N
f-397848163
f
GR
GS
[1 0 0 1 142.5145 169.0609] CT
N
f-397848163
f
GR
GS
[1 0 0 1 141.00728 136.87683] CT
N
f-397848163
f
GR
GS
[1 0 0 1 227.65858 164.50786] CT
N
f-397848163
f
GR
GS
[1 0 0 1 323.32391 305.95596] CT
N
f-397848163
f
GR
GS
[1 0 0 1 247.16122 187.45059] CT
N
f-397848163
f
GR
GS
[1 0 0 1 287.66916 107.57249] CT
N
f-397848163
f
GR
GS
[1 0 0 1 115.1245 137.3587] CT
N
f-397848163
f
GR
GS
[1 0 0 1 182.76822 165.56268] CT
N
f-397848163
f
GR
GS
[1 0 0 1 130.69308 54.93096] CT
N
f-397848163
f
GR
GS
[1 0 0 1 204.90498 171.6489] CT
N
f-397848163
f
GR
GS
[1 0 0 1 159.57227 237.88509] CT
N
f-397848163
f
GR
GS
[1 0 0 1 113.09389 74.83421] CT
N
f-397848163
f
GR
GS
[1 0 0 1 216.77528 52.33673] CT
N
f-397848163
f
GR
GS
[1 0 0 1 173.57031 133.83093] CT
N
f-397848163
f
GR
GS
[1 0 0 1 131.55748 169.4431] CT
N
f-397848163
f
GR
GS
[1 0 0 1 250.92114 55.98678] CT
N
f-397848163
f
GR
GS
[1 0 0 1 257.64136 86.63716] CT
N
f-397848163
f
GR
GS
[1 0 0 1 211.26752 166.67781] CT
N
f-397848163
f
GR
GS
[1 0 0 1 204.05281 126.7871] CT
N
f-397848163
f
GR
GS
[1 0 0 1 129.70032 48.49293] CT
N
f-397848163
f
GR
GS
[1 0 0 1 163.72343 60.88685] CT
N
f-397848163
f
GR
GS
[1 0 0 1 220.66789 70.62282] CT
N
f-397848163
f
GR
GS
[1 0 0 1 113.45464 115.43896] CT
N
f-397848163
f
GR
GS
[1 0 0 1 180.86333 37.77715] CT
N
f-397848163
f
GR
GS
[1 0 0 1 143.63026 168.18047] CT
N
f-397848163
f
GR
GS
[1 0 0 1 105.14111 41.8572] CT
N
f-397848163
f
GR
GS
[1 0 0 1 222.93423 199.01483] CT
N
f-397848163
f
GR
GS
[1 0 0 1 174.03821 118.24437] CT
N
f-397848163
f
GR
GS
[1 0 0 1 240.078 155.93201] CT
N
f-397848163
f
GR
GS
[1 0 0 1 208.37904 102.88153] CT
N
f-397848163
f
GR
GS
[1 0 0 1 346.69312 266.75623] CT
N
f-397848163
f
GR
GS
[1 0 0 1 342.67072 232.21764] CT
N
f-397848163
f
GR
GS
[1 0 0 1 188.98918 206.69077] CT
N
f-397848163
f
GR
GS
[1 0 0 1 478.28235 355.31662] CT
N
f-397848163
f
GR
GS
[1 0 0 1 275.89398 221.92453] CT
N
f-397848163
f
GR
GS
[1 0 0 1 352.6395 278.69424] CT
N
f-397848163
f
GR
GS
[1 0 0 1 305.87479 183.21402] CT
N
f-397848163
f
GR
GS
[1 0 0 1 268.53696 265.30081] CT
N
f-397848163
f
GR
GS
[1 0 0 1 253.27193 243.52953] CT
N
f-397848163
f
GR
GS
[1 0 0 1 330.8511 241.07523] CT
N
f-397848163
f
GR
GS
[1 0 0 1 144.31604 225.01909] CT
N
f-397848163
f
GR
GS
[1 0 0 1 369.74481 283.05881] CT
N
f-397848163
f
GR
GS
[1 0 0 1 296.61655 173.66037] CT
N
f-397848163
f
GR
GS
[1 0 0 1 305.11249 212.42683] CT
N
f-397848163
f
GR
GS
[1 0 0 1 306.78552 229.70126] CT
N
f-397848163
f
GR
GS
[1 0 0 1 217.59776 191.27596] CT
N
f-397848163
f
GR
GS
[1 0 0 1 297.39096 224.56721] CT
N
f-397848163
f
GR
GS
[1 0 0 1 327.9816 245.0984] CT
N
f-397848163
f
GR
GS
[1 0 0 1 218.76625 262.41125] CT
N
f-397848163
f
GR
GS
[1 0 0 1 273.24228 323.26675] CT
N
f-397848163
f
GR
GS
[1 0 0 1 284.03879 253.11214] CT
N
f-397848163
f
GR
GS
[1 0 0 1 207.56174 248.06711] CT
N
f-397848163
f
GR
GS
[1 0 0 1 286.07217 254.66447] CT
N
f-397848163
f
GR
GS
[1 0 0 1 243.2227 260.52832] CT
N
f-397848163
f
GR
GS
[1 0 0 1 291.18817 259.31128] CT
N
f-397848163
f
GR
GS
[1 0 0 1 312.1619 186.2309] CT
N
f-397848163
f
GR
GS
[1 0 0 1 242.22462 186.99245] CT
N
f-397848163
f
GR
GS
[1 0 0 1 293.78879 243.17117] CT
N
f-397848163
f
GR
GS
[1 0 0 1 257.12381 224.75484] CT
N
f-397848163
f
GR
GS
[1 0 0 1 311.42303 212.04285] CT
N
f-397848163
f
GR
GS
[1 0 0 1 316.23276 286.87518] CT
N
f-397848163
f
GR
GS
[1 0 0 1 301.41635 183.51791] CT
N
f-397848163
f
GR
GS
[1 0 0 1 198.85661 299.01566] CT
N
f-397848163
f
GR
GS
[1 0 0 1 299.59262 269.40283] CT
N
f-397848163
f
GR
GS
[1 0 0 1 303.72699 238.27036] CT
N
f-397848163
f
GR
GS
[1 0 0 1 210.43591 314.17548] CT
N
f-397848163
f
GR
GS
[1 0 0 1 217.15645 289.84009] CT
N
f-397848163
f
GR
GS
[1 0 0 1 236.53532 279.13113] CT
N
f-397848163
f
GR
GS
[1 0 0 1 344.12988 223.19107] CT
N
f-397848163
f
GR
GS
[1 0 0 1 327.04678 216.53755] CT
N
f-397848163
f
GR
GS
[1 0 0 1 369.14542 332.02563] CT
N
f-397848163
f
GR
GS
[1 0 0 1 270.18768 332.46341] CT
N
f-397848163
f
GR
GS
[1 0 0 1 247.30467 224.1817] CT
N
f-397848163
f
GR
GS
[1 0 0 1 303.66269 247.9178] CT
N
f-397848163
f
GR
GS
[1 0 0 1 285.83704 243.14262] CT
N
f-397848163
f
GR
GS
[1 0 0 1 249.76334 261.05313] CT
N
f-397848163
f
GR
GS
[1 0 0 1 213.96346 256.27448] CT
N
f-397848163
f
GR
GS
[1 0 0 1 290.60788 241.60608] CT
N
f-397848163
f
GR
GS
[1 0 0 1 203.55608 210.14862] CT
N
f-397848163
f
GR
GS
[1 0 0 1 286.34128 228.16397] CT
N
f-397848163
f
GR
GS
[1 0 0 1 153.32103 168.35506] CT
N
f-397848163
f
GR
GS
[1 0 0 1 413.2944 268.70657] CT
N
f-397848163
f
GR
GS
[1 0 0 1 257.55524 286.14069] CT
N
f-397848163
f
GR
GS
1 LJ
0.5 LW
N
247.67 197.844 M
202.803 168.995 L
192.629 162.454 L
178.33 153.26 L
312.476 239.513 L
211.647 174.681 L
248.666 198.484 L
163.914 143.99 L
200.257 167.358 L
250.029 199.361 L
238.514 191.957 L
257.77 204.338 L
142.514 130.231 L
141.007 129.262 L
227.659 184.977 L
323.324 246.488 L
247.161 197.517 L
287.669 223.562 L
115.125 112.62 L
182.768 156.113 L
130.693 122.63 L
204.905 170.347 L
159.572 141.199 L
113.094 111.314 L
216.775 177.979 L
173.57 150.199 L
131.557 123.186 L
250.921 199.934 L
257.641 204.255 L
211.268 174.438 L
204.053 169.799 L
129.7 121.992 L
163.723 143.868 L
220.668 180.482 L
113.455 111.546 L
180.863 154.888 L
143.63 130.948 L
105.141 106.2 L
222.934 181.939 L
174.038 150.5 L
240.078 192.962 L
208.379 172.58 L
346.693 261.514 L
342.671 258.927 L
188.989 160.113 L
478.282 346.123 L
275.894 215.991 L
352.639 265.337 L
305.875 235.268 L
268.537 211.261 L
253.272 201.446 L
330.851 251.328 L
144.316 131.389 L
369.745 276.336 L
296.617 229.315 L
305.112 234.778 L
306.786 235.854 L
217.598 178.508 L
297.391 229.813 L
327.982 249.483 L
218.766 179.259 L
273.242 214.286 L
284.039 221.228 L
207.562 172.055 L
286.072 222.536 L
243.223 194.984 L
291.188 225.825 L
312.162 239.311 L
242.225 194.343 L
293.789 227.497 L
257.124 203.922 L
311.423 238.836 L
316.233 241.928 L
301.416 232.402 L
198.857 166.458 L
299.593 231.229 L
303.727 233.887 L
210.436 173.903 L
217.156 178.224 L
236.535 190.684 L
344.13 259.866 L
327.047 248.882 L
369.145 275.95 L
270.188 212.322 L
247.305 197.609 L
303.663 233.846 L
285.837 222.384 L
249.763 199.19 L
213.963 176.171 L
290.608 225.452 L
203.556 169.479 L
286.341 222.709 L
153.321 137.179 L
413.294 304.337 L
257.555 204.2 L
S
GR
GS
[1 0 0 1 81 68] CT
/Helvetica 20 F
GS
[1 0 0 1 0 0] CT
0 0 moveto 
1 -1 scale
(All: r=-0.6, p=10e) t 
GR
GR
GS
[1 0 0 1 237 58] CT
/Helvetica 16 F
GS
[1 0 0 1 0 0] CT
0 0 moveto 
1 -1 scale
(-) t 
GR
GR
GS
[1 0 0 1 244 68] CT
/Helvetica 20 F
GS
[1 0 0 1 0 0] CT
0 0 moveto 
1 -1 scale
(11, control r=-0.31, p=0.003) t 
GR
GR
GS
1 LJ
0.5 LW
N
48 56.5 M
78 56.5 L
S
GR
%%Trailer
%%Pages: 1
%%EOF
