%!PS-Adobe-3.0 EPSF-3.0
%%Creator: (MATLAB, The Mathworks, Inc. Version 9.8.0.1323502 \(R2020a\). Operating System: Mac OS X)
%%Title: /Users/kosciessa/Desktop/tardis/LNDG/stateswitch/stsw_beh_stroop/figures/D_StroopReliability_Interference.eps
%%CreationDate: 2022-11-03T14:05:03
%%Pages: (atend)
%%BoundingBox:     4     3   295   276
%%LanguageLevel: 3
%%EndComments
%%BeginProlog
%%BeginResource: procset (Apache XML Graphics Std ProcSet) 1.2 0
%%Version: 1.2 0
%%Copyright: (Copyright 2001-2003,2010 The Apache Software Foundation. License terms: http://www.apache.org/licenses/LICENSE-2.0)
/bd{bind def}bind def
/ld{load def}bd
/GR/grestore ld
/GS/gsave ld
/RM/rmoveto ld
/C/curveto ld
/t/show ld
/L/lineto ld
/ML/setmiterlimit ld
/CT/concat ld
/f/fill ld
/N/newpath ld
/S/stroke ld
/CC/setcmykcolor ld
/A/ashow ld
/cp/closepath ld
/RC/setrgbcolor ld
/LJ/setlinejoin ld
/GC/setgray ld
/LW/setlinewidth ld
/M/moveto ld
/re {4 2 roll M
1 index 0 rlineto
0 exch rlineto
neg 0 rlineto
cp } bd
/_ctm matrix def
/_tm matrix def
/BT { _ctm currentmatrix pop matrix _tm copy pop 0 0 moveto } bd
/ET { _ctm setmatrix } bd
/iTm { _ctm setmatrix _tm concat } bd
/Tm { _tm astore pop iTm 0 0 moveto } bd
/ux 0.0 def
/uy 0.0 def
/F {
  /Tp exch def
  /Tf exch def
  Tf findfont Tp scalefont setfont
  /cf Tf def  /cs Tp def
} bd
/ULS {currentpoint /uy exch def /ux exch def} bd
/ULE {
  /Tcx currentpoint pop def
  gsave
  newpath
  cf findfont cs scalefont dup
  /FontMatrix get 0 get /Ts exch def /FontInfo get dup
  /UnderlinePosition get Ts mul /To exch def
  /UnderlineThickness get Ts mul /Tt exch def
  ux uy To add moveto  Tcx uy To add lineto
  Tt setlinewidth stroke
  grestore
} bd
/OLE {
  /Tcx currentpoint pop def
  gsave
  newpath
  cf findfont cs scalefont dup
  /FontMatrix get 0 get /Ts exch def /FontInfo get dup
  /UnderlinePosition get Ts mul /To exch def
  /UnderlineThickness get Ts mul /Tt exch def
  ux uy To add cs add moveto Tcx uy To add cs add lineto
  Tt setlinewidth stroke
  grestore
} bd
/SOE {
  /Tcx currentpoint pop def
  gsave
  newpath
  cf findfont cs scalefont dup
  /FontMatrix get 0 get /Ts exch def /FontInfo get dup
  /UnderlinePosition get Ts mul /To exch def
  /UnderlineThickness get Ts mul /Tt exch def
  ux uy To add cs 10 mul 26 idiv add moveto Tcx uy To add cs 10 mul 26 idiv add lineto
  Tt setlinewidth stroke
  grestore
} bd
/QT {
/Y22 exch store
/X22 exch store
/Y21 exch store
/X21 exch store
currentpoint
/Y21 load 2 mul add 3 div exch
/X21 load 2 mul add 3 div exch
/X21 load 2 mul /X22 load add 3 div
/Y21 load 2 mul /Y22 load add 3 div
/X22 load /Y22 load curveto
} bd
/SSPD {
dup length /d exch dict def
{
/v exch def
/k exch def
currentpagedevice k known {
/cpdv currentpagedevice k get def
v cpdv ne {
/upd false def
/nullv v type /nulltype eq def
/nullcpdv cpdv type /nulltype eq def
nullv nullcpdv or
{
/upd true def
} {
/sametype v type cpdv type eq def
sametype {
v type /arraytype eq {
/vlen v length def
/cpdvlen cpdv length def
vlen cpdvlen eq {
0 1 vlen 1 sub {
/i exch def
/obj v i get def
/cpdobj cpdv i get def
obj cpdobj ne {
/upd true def
exit
} if
} for
} {
/upd true def
} ifelse
} {
v type /dicttype eq {
v {
/dv exch def
/dk exch def
/cpddv cpdv dk get def
dv cpddv ne {
/upd true def
exit
} if
} forall
} {
/upd true def
} ifelse
} ifelse
} if
} ifelse
upd true eq {
d k v put
} if
} if
} if
} forall
d length 0 gt {
d setpagedevice
} if
} bd
/RE { % /NewFontName [NewEncodingArray] /FontName RE -
  findfont dup length dict begin
  {
    1 index /FID ne
    {def} {pop pop} ifelse
  } forall
  /Encoding exch def
  /FontName 1 index def
  currentdict definefont pop
  end
} bind def
%%EndResource
%%BeginResource: procset (Apache XML Graphics EPS ProcSet) 1.0 0
%%Version: 1.0 0
%%Copyright: (Copyright 2002-2003 The Apache Software Foundation. License terms: http://www.apache.org/licenses/LICENSE-2.0)
/BeginEPSF { %def
/b4_Inc_state save def         % Save state for cleanup
/dict_count countdictstack def % Count objects on dict stack
/op_count count 1 sub def      % Count objects on operand stack
userdict begin                 % Push userdict on dict stack
/showpage { } def              % Redefine showpage, { } = null proc
0 setgray 0 setlinecap         % Prepare graphics state
1 setlinewidth 0 setlinejoin
10 setmiterlimit [ ] 0 setdash newpath
/languagelevel where           % If level not equal to 1 then
{pop languagelevel             % set strokeadjust and
1 ne                           % overprint to their defaults.
{false setstrokeadjust false setoverprint
} if
} if
} bd
/EndEPSF { %def
count op_count sub {pop} repeat            % Clean up stacks
countdictstack dict_count sub {end} repeat
b4_Inc_state restore
} bd
%%EndResource
%FOPBeginFontDict
%%IncludeResource: font Courier-Oblique
%%IncludeResource: font Courier-BoldOblique
%%IncludeResource: font Courier-Bold
%%IncludeResource: font ZapfDingbats
%%IncludeResource: font Symbol
%%IncludeResource: font Helvetica
%%IncludeResource: font Helvetica-Oblique
%%IncludeResource: font Helvetica-Bold
%%IncludeResource: font Helvetica-BoldOblique
%%IncludeResource: font Times-Roman
%%IncludeResource: font Times-Italic
%%IncludeResource: font Times-Bold
%%IncludeResource: font Times-BoldItalic
%%IncludeResource: font Courier
%FOPEndFontDict
%%BeginResource: encoding WinAnsiEncoding
/WinAnsiEncoding [
/.notdef /.notdef /.notdef /.notdef /.notdef
/.notdef /.notdef /.notdef /.notdef /.notdef
/.notdef /.notdef /.notdef /.notdef /.notdef
/.notdef /.notdef /.notdef /.notdef /.notdef
/.notdef /.notdef /.notdef /.notdef /.notdef
/.notdef /.notdef /.notdef /.notdef /.notdef
/.notdef /.notdef /space /exclam /quotedbl
/numbersign /dollar /percent /ampersand /quotesingle
/parenleft /parenright /asterisk /plus /comma
/hyphen /period /slash /zero /one
/two /three /four /five /six
/seven /eight /nine /colon /semicolon
/less /equal /greater /question /at
/A /B /C /D /E
/F /G /H /I /J
/K /L /M /N /O
/P /Q /R /S /T
/U /V /W /X /Y
/Z /bracketleft /backslash /bracketright /asciicircum
/underscore /quoteleft /a /b /c
/d /e /f /g /h
/i /j /k /l /m
/n /o /p /q /r
/s /t /u /v /w
/x /y /z /braceleft /bar
/braceright /asciitilde /bullet /Euro /bullet
/quotesinglbase /florin /quotedblbase /ellipsis /dagger
/daggerdbl /circumflex /perthousand /Scaron /guilsinglleft
/OE /bullet /Zcaron /bullet /bullet
/quoteleft /quoteright /quotedblleft /quotedblright /bullet
/endash /emdash /asciitilde /trademark /scaron
/guilsinglright /oe /bullet /zcaron /Ydieresis
/space /exclamdown /cent /sterling /currency
/yen /brokenbar /section /dieresis /copyright
/ordfeminine /guillemotleft /logicalnot /sfthyphen /registered
/macron /degree /plusminus /twosuperior /threesuperior
/acute /mu /paragraph /middot /cedilla
/onesuperior /ordmasculine /guillemotright /onequarter /onehalf
/threequarters /questiondown /Agrave /Aacute /Acircumflex
/Atilde /Adieresis /Aring /AE /Ccedilla
/Egrave /Eacute /Ecircumflex /Edieresis /Igrave
/Iacute /Icircumflex /Idieresis /Eth /Ntilde
/Ograve /Oacute /Ocircumflex /Otilde /Odieresis
/multiply /Oslash /Ugrave /Uacute /Ucircumflex
/Udieresis /Yacute /Thorn /germandbls /agrave
/aacute /acircumflex /atilde /adieresis /aring
/ae /ccedilla /egrave /eacute /ecircumflex
/edieresis /igrave /iacute /icircumflex /idieresis
/eth /ntilde /ograve /oacute /ocircumflex
/otilde /odieresis /divide /oslash /ugrave
/uacute /ucircumflex /udieresis /yacute /thorn
/ydieresis
] def
%%EndResource
%FOPBeginFontReencode
/Courier-Oblique findfont
dup length dict begin
  {1 index /FID ne {def} {pop pop} ifelse} forall
  /Encoding WinAnsiEncoding def
  currentdict
end
/Courier-Oblique exch definefont pop
/Courier-BoldOblique findfont
dup length dict begin
  {1 index /FID ne {def} {pop pop} ifelse} forall
  /Encoding WinAnsiEncoding def
  currentdict
end
/Courier-BoldOblique exch definefont pop
/Courier-Bold findfont
dup length dict begin
  {1 index /FID ne {def} {pop pop} ifelse} forall
  /Encoding WinAnsiEncoding def
  currentdict
end
/Courier-Bold exch definefont pop
/Helvetica findfont
dup length dict begin
  {1 index /FID ne {def} {pop pop} ifelse} forall
  /Encoding WinAnsiEncoding def
  currentdict
end
/Helvetica exch definefont pop
/Helvetica-Oblique findfont
dup length dict begin
  {1 index /FID ne {def} {pop pop} ifelse} forall
  /Encoding WinAnsiEncoding def
  currentdict
end
/Helvetica-Oblique exch definefont pop
/Helvetica-Bold findfont
dup length dict begin
  {1 index /FID ne {def} {pop pop} ifelse} forall
  /Encoding WinAnsiEncoding def
  currentdict
end
/Helvetica-Bold exch definefont pop
/Helvetica-BoldOblique findfont
dup length dict begin
  {1 index /FID ne {def} {pop pop} ifelse} forall
  /Encoding WinAnsiEncoding def
  currentdict
end
/Helvetica-BoldOblique exch definefont pop
/Times-Roman findfont
dup length dict begin
  {1 index /FID ne {def} {pop pop} ifelse} forall
  /Encoding WinAnsiEncoding def
  currentdict
end
/Times-Roman exch definefont pop
/Times-Italic findfont
dup length dict begin
  {1 index /FID ne {def} {pop pop} ifelse} forall
  /Encoding WinAnsiEncoding def
  currentdict
end
/Times-Italic exch definefont pop
/Times-Bold findfont
dup length dict begin
  {1 index /FID ne {def} {pop pop} ifelse} forall
  /Encoding WinAnsiEncoding def
  currentdict
end
/Times-Bold exch definefont pop
/Times-BoldItalic findfont
dup length dict begin
  {1 index /FID ne {def} {pop pop} ifelse} forall
  /Encoding WinAnsiEncoding def
  currentdict
end
/Times-BoldItalic exch definefont pop
/Courier findfont
dup length dict begin
  {1 index /FID ne {def} {pop pop} ifelse} forall
  /Encoding WinAnsiEncoding def
  currentdict
end
/Courier exch definefont pop
%FOPEndFontReencode
%%EndProlog
%%Page: 1 1
%%PageBoundingBox: 0 0 283 283
%%BeginPageSetup
[1 0 0 -1 0 283] CT
%%EndPageSetup
GS
[1.00164 0 0 1 0 0] CT
1 GC
N
0 0 283 283 re
f
GR
GS
[1.00164 0 0 1 0 0] CT
1 GC
N
0 0 283 283 re
f
GR
GS
[1.00164 0 0 1 0 0] CT
1 GC
N
55.5 233.5 M
256 233.5 L
256 26.5 L
55.5 26.5 L
cp
f
GR
GS
[1.00164 0 0 1 0 0] CT
0.149 GC
2 setlinecap
1 LJ
0.5 LW
N
55.5 233.5 M
256 233.5 L
S
GR
GS
[1.00164 0 0 1 0 0] CT
0.149 GC
2 setlinecap
1 LJ
0.5 LW
N
83.257 233.5 M
83.257 231.43 L
S
GR
GS
[1.00164 0 0 1 0 0] CT
0.149 GC
2 setlinecap
1 LJ
0.5 LW
N
149.718 233.5 M
149.718 231.43 L
S
GR
GS
[1.00164 0 0 1 0 0] CT
0.149 GC
2 setlinecap
1 LJ
0.5 LW
N
216.18 233.5 M
216.18 231.43 L
S
GR
GS
[1.00164 0 0 1 83.39321 239.10001] CT
0.149 GC
/Helvetica 18 F
GS
[1 0 0 1 0 0] CT
-5.5 18 moveto 
1 -1 scale
(0) t 
GR
GR
GS
[1.00164 0 0 1 149.9639 239.10001] CT
0.149 GC
/Helvetica 18 F
GS
[1 0 0 1 0 0] CT
-13 18 moveto 
1 -1 scale
(0.1) t 
GR
GR
GS
[1.00164 0 0 1 216.53458 239.10001] CT
0.149 GC
/Helvetica 18 F
GS
[1 0 0 1 0 0] CT
-13 18 moveto 
1 -1 scale
(0.2) t 
GR
GR
GS
[1.00164 0 0 1 156.00577 261.60001] CT
0.149 GC
/Helvetica 18 F
GS
[1 0 0 1 0 0] CT
-90 18 moveto 
1 -1 scale
(Interference Session 1) t 
GR
GR
GS
[1.00164 0 0 1 0 0] CT
0.149 GC
2 setlinecap
1 LJ
0.5 LW
N
55.5 233.5 M
55.5 26.5 L
S
GR
GS
[1.00164 0 0 1 0 0] CT
0.149 GC
2 setlinecap
1 LJ
0.5 LW
N
55.5 192.861 M
57.57 192.861 L
S
GR
GS
[1.00164 0 0 1 0 0] CT
0.149 GC
2 setlinecap
1 LJ
0.5 LW
N
55.5 138.863 M
57.57 138.863 L
S
GR
GS
[1.00164 0 0 1 0 0] CT
0.149 GC
2 setlinecap
1 LJ
0.5 LW
N
55.5 84.864 M
57.57 84.864 L
S
GR
GS
[1.00164 0 0 1 0 0] CT
0.149 GC
2 setlinecap
1 LJ
0.5 LW
N
55.5 30.866 M
57.57 30.866 L
S
GR
GS
[1.00164 0 0 1 49.98191 192.86143] CT
0.149 GC
/Helvetica 18 F
GS
[1 0 0 1 0 0] CT
-11 7 moveto 
1 -1 scale
(0) t 
GR
GR
GS
[1.00164 0 0 1 49.98191 138.86284] CT
0.149 GC
/Helvetica 18 F
GS
[1 0 0 1 0 0] CT
-26 7 moveto 
1 -1 scale
(0.1) t 
GR
GR
GS
[1.00164 0 0 1 49.98191 84.86424] CT
0.149 GC
/Helvetica 18 F
GS
[1 0 0 1 0 0] CT
-26 7 moveto 
1 -1 scale
(0.2) t 
GR
GR
GS
[1.00164 0 0 1 49.98191 30.86564] CT
0.149 GC
/Helvetica 18 F
GS
[1 0 0 1 0 0] CT
-26 7 moveto 
1 -1 scale
(0.3) t 
GR
GR
GS
[0 -1 1.00164 0 21.43513 129.99989] CT
0.149 GC
/Helvetica 18 F
GS
[1 0 0 1 0 0] CT
-90 -4 moveto 
1 -1 scale
(Interference Session 2) t 
GR
GR
GS
[1.00164 0 0 1 156.00583 24.24999] CT
/Helvetica-Bold 18 F
GS
[1 0 0 1 0 0] CT
-137 -4 moveto 
1 -1 scale
(Individual interference reliability) t 
GR
GR
GS
[1.00164 0 0 1 122.84181 162.29665] CT
0.8 0.502 0.502 RC
N
0.5 0 M
0.5 -0.276 0.276 -0.5 0 -0.5 C
-0.276 -0.5 -0.5 -0.276 -0.5 0 C
-0.5 0.276 -0.276 0.5 0 0.5 C
0.276 0.5 0.5 0.276 0.5 0 C
cp
f
GR
GS
[1.00164 0 0 1 107.60039 164.3134] CT
0.8 0.502 0.502 RC
N
/f-2105962265{0.5 0 M
0.5 -0.276 0.276 -0.5 0 -0.5 C
-0.276 -0.5 -0.5 -0.276 -0.5 0 C
-0.5 0.276 -0.276 0.5 0 0.5 C
0.276 0.5 0.5 0.276 0.5 0 C
cp}def
f-2105962265
f
GR
GS
[1.00164 0 0 1 92.30279 159.6783] CT
0.8 0.502 0.502 RC
N
f-2105962265
f
GR
GS
[1.00164 0 0 1 88.82553 175.15633] CT
0.8 0.502 0.502 RC
N
f-2105962265
f
GR
GS
[1.00164 0 0 1 84.10166 199.95959] CT
0.8 0.502 0.502 RC
N
f-2105962265
f
GR
GS
[1.00164 0 0 1 136.41157 140.95076] CT
0.8 0.502 0.502 RC
N
f-2105962265
f
GR
GS
[1.00164 0 0 1 116.17804 177.00269] CT
0.8 0.502 0.502 RC
N
f-2105962265
f
GR
GS
[1.00164 0 0 1 99.28293 167.39827] CT
0.8 0.502 0.502 RC
N
f-2105962265
f
GR
GS
[1.00164 0 0 1 135.95776 129.33466] CT
0.8 0.502 0.502 RC
N
f-2105962265
f
GR
GS
[1.00164 0 0 1 111.69549 175.008] CT
0.8 0.502 0.502 RC
N
f-2105962265
f
GR
GS
[1.00164 0 0 1 154.04247 163.54074] CT
0.8 0.502 0.502 RC
N
f-2105962265
f
GR
GS
[1.00164 0 0 1 97.60707 162.21457] CT
0.8 0.502 0.502 RC
N
f-2105962265
f
GR
GS
[1.00164 0 0 1 96.14265 174.3468] CT
0.8 0.502 0.502 RC
N
f-2105962265
f
GR
GS
[1.00164 0 0 1 100.87092 172.18311] CT
0.8 0.502 0.502 RC
N
f-2105962265
f
GR
GS
[1.00164 0 0 1 98.87958 162.20602] CT
0.8 0.502 0.502 RC
N
f-2105962265
f
GR
GS
[1.00164 0 0 1 143.41245 119.29406] CT
0.8 0.502 0.502 RC
N
f-2105962265
f
GR
GS
[1.00164 0 0 1 108.99693 173.54555] CT
0.8 0.502 0.502 RC
N
f-2105962265
f
GR
GS
[1.00164 0 0 1 93.49127 181.0106] CT
0.8 0.502 0.502 RC
N
f-2105962265
f
GR
GS
[1.00164 0 0 1 77.84566 216.25] CT
0.8 0.502 0.502 RC
N
f-2105962265
f
GR
GS
[1.00164 0 0 1 172.15296 126.54829] CT
0.8 0.502 0.502 RC
N
f-2105962265
f
GR
GS
[1.00164 0 0 1 81.14184 131.62494] CT
0.8 0.502 0.502 RC
N
f-2105962265
f
GR
GS
[1.00164 0 0 1 105.60121 167.51012] CT
0.8 0.502 0.502 RC
N
f-2105962265
f
GR
GS
[1.00164 0 0 1 147.0234 182.27364] CT
0.8 0.502 0.502 RC
N
f-2105962265
f
GR
GS
[1.00164 0 0 1 124.3573 175.32387] CT
0.8 0.502 0.502 RC
N
f-2105962265
f
GR
GS
[1.00164 0 0 1 121.49063 163.43616] CT
0.8 0.502 0.502 RC
N
f-2105962265
f
GR
GS
[1.00164 0 0 1 123.75434 163.85484] CT
0.8 0.502 0.502 RC
N
f-2105962265
f
GR
GS
[1.00164 0 0 1 89.45318 149.58723] CT
0.8 0.502 0.502 RC
N
f-2105962265
f
GR
GS
[1.00164 0 0 1 124.43428 153.6474] CT
0.8 0.502 0.502 RC
N
f-2105962265
f
GR
GS
[1.00164 0 0 1 142.45503 142.69075] CT
0.8 0.502 0.502 RC
N
f-2105962265
f
GR
GS
[1.00164 0 0 1 110.56448 157.93602] CT
0.8 0.502 0.502 RC
N
f-2105962265
f
GR
GS
[1.00164 0 0 1 106.75103 167.33307] CT
0.8 0.502 0.502 RC
N
f-2105962265
f
GR
GS
[1.00164 0 0 1 99.38727 183.07338] CT
0.8 0.502 0.502 RC
N
f-2105962265
f
GR
GS
[1.00164 0 0 1 100.61045 179.86874] CT
0.8 0.502 0.502 RC
N
f-2105962265
f
GR
GS
[1.00164 0 0 1 112.44209 173.68906] CT
0.8 0.502 0.502 RC
N
f-2105962265
f
GR
GS
[1.00164 0 0 1 74.78694 141.97244] CT
0.8 0.502 0.502 RC
N
f-2105962265
f
GR
GS
[1.00164 0 0 1 177.96065 132.16913] CT
0.8 0.502 0.502 RC
N
f-2105962265
f
GR
GS
[1.00164 0 0 1 72.32687 185.47632] CT
0.8 0.502 0.502 RC
N
f-2105962265
f
GR
GS
[1.00164 0 0 1 113.68306 158.11635] CT
0.8 0.502 0.502 RC
N
f-2105962265
f
GR
GS
[1.00164 0 0 1 74.25194 169.04337] CT
0.8 0.502 0.502 RC
N
f-2105962265
f
GR
GS
[1.00164 0 0 1 116.17623 173.28992] CT
0.8 0.502 0.502 RC
N
f-2105962265
f
GR
GS
[1.00164 0 0 1 121.64255 147.39461] CT
0.8 0.502 0.502 RC
N
f-2105962265
f
GR
GS
[1.00164 0 0 1 106.29153 171.59042] CT
0.8 0.502 0.502 RC
N
f-2105962265
f
GR
GS
[1.00164 0 0 1 169.89731 126.74177] CT
0.8 0.502 0.502 RC
N
f-2105962265
f
GR
GS
[1.00164 0 0 1 123.79452 160.81473] CT
0.8 0.502 0.502 RC
N
f-2105962265
f
GR
GS
[1.00164 0 0 1 107.91643 156.07774] CT
0.8 0.502 0.502 RC
N
f-2105962265
f
GR
GS
[1.00164 0 0 1 109.37923 162.1532] CT
0.8 0.502 0.502 RC
N
f-2105962265
f
GR
GS
[1.00164 0 0 1 81.69895 185.78691] CT
0.8 0.502 0.502 RC
N
f-2105962265
f
GR
GS
[1.00164 0 0 1 103.01489 167.8925] CT
0.8 0.502 0.502 RC
N
f-2105962265
f
GR
GS
[1.00164 0 0 1 163.08286 87.06622] CT
0.8 0.502 0.502 RC
N
f-2105962265
f
GR
GS
[1.00164 0 0 1 142.55248 131.27812] CT
0.8 0.502 0.502 RC
N
f-2105962265
f
GR
GS
[1.00164 0 0 1 126.8212 157.74551] CT
0.8 0.502 0.502 RC
N
f-2105962265
f
GR
GS
[1.00164 0 0 1 112.98637 164.44128] CT
0.8 0.502 0.502 RC
N
f-2105962265
f
GR
GS
[1.00164 0 0 1 136.03054 142.03011] CT
0.8 0.502 0.502 RC
N
f-2105962265
f
GR
GS
[1.00164 0 0 1 135.06512 168.15982] CT
0.8 0.502 0.502 RC
N
f-2105962265
f
GR
GS
[1.00164 0 0 1 156.04412 153.50386] CT
0.8 0.502 0.502 RC
N
f-2105962265
f
GR
GS
[1.00164 0 0 1 138.4086 138.53328] CT
0.8 0.502 0.502 RC
N
f-2105962265
f
GR
GS
[1.00164 0 0 1 141.78772 133.29652] CT
0.8 0.502 0.502 RC
N
f-2105962265
f
GR
GS
[1.00164 0 0 1 99.31013 135.3255] CT
0.8 0.502 0.502 RC
N
f-2105962265
f
GR
GS
[1.00164 0 0 1 152.73654 137.76172] CT
0.8 0.502 0.502 RC
N
f-2105962265
f
GR
GS
[1.00164 0 0 1 99.15536 174.27573] CT
0.8 0.502 0.502 RC
N
f-2105962265
f
GR
GS
[1.00164 0 0 1 92.35877 171.10394] CT
0.8 0.502 0.502 RC
N
f-2105962265
f
GR
GS
[1.00164 0 0 1 94.15122 154.0334] CT
0.8 0.502 0.502 RC
N
f-2105962265
f
GR
GS
[1.00164 0 0 1 138.72835 122.62891] CT
0.8 0.502 0.502 RC
N
f-2105962265
f
GR
GS
[1.00164 0 0 1 119.86992 142.86346] CT
0.8 0.502 0.502 RC
N
f-2105962265
f
GR
GS
[1.00164 0 0 1 124.97922 148.93594] CT
0.8 0.502 0.502 RC
N
f-2105962265
f
GR
GS
[1.00164 0 0 1 115.60443 163.93175] CT
0.8 0.502 0.502 RC
N
f-2105962265
f
GR
GS
[1.00164 0 0 1 196.56768 81.90708] CT
0.8 0.502 0.502 RC
N
f-2105962265
f
GR
GS
[1.00164 0 0 1 108.28293 164.77159] CT
0.8 0.502 0.502 RC
N
f-2105962265
f
GR
GS
[1.00164 0 0 1 132.44529 125.43991] CT
0.8 0.502 0.502 RC
N
f-2105962265
f
GR
GS
[1.00164 0 0 1 161.49961 108.63129] CT
0.8 0.502 0.502 RC
N
f-2105962265
f
GR
GS
[1.00164 0 0 1 127.53787 162.73552] CT
0.8 0.502 0.502 RC
N
f-2105962265
f
GR
GS
[1.00164 0 0 1 165.95912 127.61707] CT
0.8 0.502 0.502 RC
N
f-2105962265
f
GR
GS
[1.00164 0 0 1 95.82213 157.95441] CT
0.8 0.502 0.502 RC
N
f-2105962265
f
GR
GS
[1.00164 0 0 1 122.3926 151.12813] CT
0.8 0.502 0.502 RC
N
f-2105962265
f
GR
GS
[1.00164 0 0 1 164.98463 148.53064] CT
0.8 0.502 0.502 RC
N
f-2105962265
f
GR
GS
[1.00164 0 0 1 140.73812 139.69633] CT
0.8 0.502 0.502 RC
N
f-2105962265
f
GR
GS
[1.00164 0 0 1 208.56181 128.87187] CT
0.8 0.502 0.502 RC
N
f-2105962265
f
GR
GS
[1.00164 0 0 1 159.77084 85.45381] CT
0.8 0.502 0.502 RC
N
f-2105962265
f
GR
GS
[1.00164 0 0 1 162.04027 167.4726] CT
0.8 0.502 0.502 RC
N
f-2105962265
f
GR
GS
[1.00164 0 0 1 106.3483 148.01318] CT
0.8 0.502 0.502 RC
N
f-2105962265
f
GR
GS
[1.00164 0 0 1 156.906 158.43494] CT
0.8 0.502 0.502 RC
N
f-2105962265
f
GR
GS
[1.00164 0 0 1 188.16202 173.6362] CT
0.8 0.502 0.502 RC
N
f-2105962265
f
GR
GS
[1.00164 0 0 1 130.10883 119.5563] CT
0.8 0.502 0.502 RC
N
f-2105962265
f
GR
GS
[1.00164 0 0 1 135.23274 133.61385] CT
0.8 0.502 0.502 RC
N
f-2105962265
f
GR
GS
[1.00164 0 0 1 174.68075 125.49912] CT
0.8 0.502 0.502 RC
N
f-2105962265
f
GR
GS
[1.00164 0 0 1 224.68076 43.75] CT
0.8 0.502 0.502 RC
N
f-2105962265
f
GR
GS
[1.00164 0 0 1 145.88026 172.44923] CT
0.8 0.502 0.502 RC
N
f-2105962265
f
GR
GS
[1.00164 0 0 1 239.68449 97.97047] CT
0.8 0.502 0.502 RC
N
f-2105962265
f
GR
GS
[1.00164 0 0 1 232.6962 141.09935] CT
0.8 0.502 0.502 RC
N
f-2105962265
f
GR
GS
[1.00164 0 0 1 168.73693 96.12066] CT
0.8 0.502 0.502 RC
N
f-2105962265
f
GR
GS
[1.00164 0 0 1 98.44975 160.28841] CT
0.8 0.502 0.502 RC
N
f-2105962265
f
GR
GS
[1.00164 0 0 1 184.04564 131.84335] CT
0.8 0.502 0.502 RC
N
f-2105962265
f
GR
GS
[1.00164 0 0 1 135.60175 120.07803] CT
0.8 0.502 0.502 RC
N
f-2105962265
f
GR
GS
[1.00164 0 0 1 140.12444 151.43158] CT
0.8 0.502 0.502 RC
N
f-2105962265
f
GR
GS
[1.00164 0 0 1 148.51845 153.88829] CT
0.8 0.502 0.502 RC
N
f-2105962265
f
GR
GS
[1.00164 0 0 1 117.13077 158.8551] CT
0.8 0.502 0.502 RC
N
f-2105962265
f
GR
GS
[1.00164 0 0 1 102.05021 171.82462] CT
0.8 0.502 0.502 RC
N
f-2105962265
f
GR
GS
[1.00164 0 0 1 89.08895 158.61804] CT
0.8 0.502 0.502 RC
N
f-2105962265
f
GR
GS
[1.00164 0 0 1 137.01493 173.41306] CT
0.8 0.502 0.502 RC
N
f-2105962265
f
GR
GS
[1.00164 0 0 1 180.8446 165.17346] CT
0.8 0.502 0.502 RC
N
f-2105962265
f
GR
GS
[1.00164 0 0 1 0 0] CT
0.902 0.6 0.6 RC
1 LJ
3 LW
N
55.476 187.261 M
249.41 92.462 L
S
GR
GS
[1.00164 0 0 1 122.84181 162.29665] CT
1 0.702 0.702 RC
N
/f227889816{-3 -3 M
-3 3 L
3 3 L
3 -3 L
cp}def
f227889816
f
GR
GS
[1.00164 0 0 1 107.60039 164.3134] CT
1 0.702 0.702 RC
N
f227889816
f
GR
GS
[1.00164 0 0 1 92.30279 159.6783] CT
1 0.702 0.702 RC
N
f227889816
f
GR
GS
[1.00164 0 0 1 88.82553 175.15633] CT
1 0.702 0.702 RC
N
f227889816
f
GR
GS
[1.00164 0 0 1 84.10166 199.95959] CT
1 0.702 0.702 RC
N
f227889816
f
GR
GS
[1.00164 0 0 1 136.41157 140.95076] CT
1 0.702 0.702 RC
N
f227889816
f
GR
GS
[1.00164 0 0 1 116.17804 177.00269] CT
1 0.702 0.702 RC
N
f227889816
f
GR
GS
[1.00164 0 0 1 99.28293 167.39827] CT
1 0.702 0.702 RC
N
f227889816
f
GR
GS
[1.00164 0 0 1 135.95776 129.33466] CT
1 0.702 0.702 RC
N
f227889816
f
GR
GS
[1.00164 0 0 1 111.69549 175.008] CT
1 0.702 0.702 RC
N
f227889816
f
GR
GS
[1.00164 0 0 1 154.04247 163.54074] CT
1 0.702 0.702 RC
N
f227889816
f
GR
GS
[1.00164 0 0 1 97.60707 162.21457] CT
1 0.702 0.702 RC
N
f227889816
f
GR
GS
[1.00164 0 0 1 96.14265 174.3468] CT
1 0.702 0.702 RC
N
f227889816
f
GR
GS
[1.00164 0 0 1 100.87092 172.18311] CT
1 0.702 0.702 RC
N
f227889816
f
GR
GS
[1.00164 0 0 1 98.87958 162.20602] CT
1 0.702 0.702 RC
N
f227889816
f
GR
GS
[1.00164 0 0 1 143.41245 119.29406] CT
1 0.702 0.702 RC
N
f227889816
f
GR
GS
[1.00164 0 0 1 108.99693 173.54555] CT
1 0.702 0.702 RC
N
f227889816
f
GR
GS
[1.00164 0 0 1 93.49127 181.0106] CT
1 0.702 0.702 RC
N
f227889816
f
GR
GS
[1.00164 0 0 1 77.84566 216.25] CT
1 0.702 0.702 RC
N
f227889816
f
GR
GS
[1.00164 0 0 1 172.15296 126.54829] CT
1 0.702 0.702 RC
N
f227889816
f
GR
GS
[1.00164 0 0 1 81.14184 131.62494] CT
1 0.702 0.702 RC
N
f227889816
f
GR
GS
[1.00164 0 0 1 105.60121 167.51012] CT
1 0.702 0.702 RC
N
f227889816
f
GR
GS
[1.00164 0 0 1 147.0234 182.27364] CT
1 0.702 0.702 RC
N
f227889816
f
GR
GS
[1.00164 0 0 1 124.3573 175.32387] CT
1 0.702 0.702 RC
N
f227889816
f
GR
GS
[1.00164 0 0 1 121.49063 163.43616] CT
1 0.702 0.702 RC
N
f227889816
f
GR
GS
[1.00164 0 0 1 123.75434 163.85484] CT
1 0.702 0.702 RC
N
f227889816
f
GR
GS
[1.00164 0 0 1 89.45318 149.58723] CT
1 0.702 0.702 RC
N
f227889816
f
GR
GS
[1.00164 0 0 1 124.43428 153.6474] CT
1 0.702 0.702 RC
N
f227889816
f
GR
GS
[1.00164 0 0 1 142.45503 142.69075] CT
1 0.702 0.702 RC
N
f227889816
f
GR
GS
[1.00164 0 0 1 110.56448 157.93602] CT
1 0.702 0.702 RC
N
f227889816
f
GR
GS
[1.00164 0 0 1 106.75103 167.33307] CT
1 0.702 0.702 RC
N
f227889816
f
GR
GS
[1.00164 0 0 1 99.38727 183.07338] CT
1 0.702 0.702 RC
N
f227889816
f
GR
GS
[1.00164 0 0 1 100.61045 179.86874] CT
1 0.702 0.702 RC
N
f227889816
f
GR
GS
[1.00164 0 0 1 112.44209 173.68906] CT
1 0.702 0.702 RC
N
f227889816
f
GR
GS
[1.00164 0 0 1 74.78694 141.97244] CT
1 0.702 0.702 RC
N
f227889816
f
GR
GS
[1.00164 0 0 1 177.96065 132.16913] CT
1 0.702 0.702 RC
N
f227889816
f
GR
GS
[1.00164 0 0 1 72.32687 185.47632] CT
1 0.702 0.702 RC
N
f227889816
f
GR
GS
[1.00164 0 0 1 113.68306 158.11635] CT
1 0.702 0.702 RC
N
f227889816
f
GR
GS
[1.00164 0 0 1 74.25194 169.04337] CT
1 0.702 0.702 RC
N
f227889816
f
GR
GS
[1.00164 0 0 1 116.17623 173.28992] CT
1 0.702 0.702 RC
N
f227889816
f
GR
GS
[1.00164 0 0 1 121.64255 147.39461] CT
1 0.702 0.702 RC
N
f227889816
f
GR
GS
[1.00164 0 0 1 106.29153 171.59042] CT
1 0.702 0.702 RC
N
f227889816
f
GR
GS
[1.00164 0 0 1 169.89731 126.74177] CT
1 0.702 0.702 RC
N
f227889816
f
GR
GS
[1.00164 0 0 1 123.79452 160.81473] CT
1 0.702 0.702 RC
N
f227889816
f
GR
GS
[1.00164 0 0 1 107.91643 156.07774] CT
1 0.702 0.702 RC
N
f227889816
f
GR
GS
[1.00164 0 0 1 109.37923 162.1532] CT
1 0.702 0.702 RC
N
f227889816
f
GR
GS
[1.00164 0 0 1 81.69895 185.78691] CT
1 0.702 0.702 RC
N
f227889816
f
GR
GS
[1.00164 0 0 1 103.01489 167.8925] CT
1 0.702 0.702 RC
N
f227889816
f
GR
GS
[1.00164 0 0 1 163.08286 87.06622] CT
0.8 0.502 0.502 RC
N
/f-1969333140{-3.536 0 M
0 4.702 L
3.536 0 L
0 -4.702 L
cp}def
f-1969333140
f
GR
GS
[1.00164 0 0 1 142.55248 131.27812] CT
0.8 0.502 0.502 RC
N
f-1969333140
f
GR
GS
[1.00164 0 0 1 126.8212 157.74551] CT
0.8 0.502 0.502 RC
N
f-1969333140
f
GR
GS
[1.00164 0 0 1 112.98637 164.44128] CT
0.8 0.502 0.502 RC
N
f-1969333140
f
GR
GS
[1.00164 0 0 1 136.03054 142.03011] CT
0.8 0.502 0.502 RC
N
f-1969333140
f
GR
GS
[1.00164 0 0 1 135.06512 168.15982] CT
0.8 0.502 0.502 RC
N
f-1969333140
f
GR
GS
[1.00164 0 0 1 156.04412 153.50386] CT
0.8 0.502 0.502 RC
N
f-1969333140
f
GR
GS
[1.00164 0 0 1 138.4086 138.53328] CT
0.8 0.502 0.502 RC
N
f-1969333140
f
GR
GS
[1.00164 0 0 1 141.78772 133.29652] CT
0.8 0.502 0.502 RC
N
f-1969333140
f
GR
GS
[1.00164 0 0 1 99.31013 135.3255] CT
0.8 0.502 0.502 RC
N
f-1969333140
f
GR
GS
[1.00164 0 0 1 152.73654 137.76172] CT
0.8 0.502 0.502 RC
N
f-1969333140
f
GR
GS
[1.00164 0 0 1 99.15536 174.27573] CT
0.8 0.502 0.502 RC
N
f-1969333140
f
GR
GS
[1.00164 0 0 1 92.35877 171.10394] CT
0.8 0.502 0.502 RC
N
f-1969333140
f
GR
GS
[1.00164 0 0 1 94.15122 154.0334] CT
0.8 0.502 0.502 RC
N
f-1969333140
f
GR
GS
[1.00164 0 0 1 138.72835 122.62891] CT
0.8 0.502 0.502 RC
N
f-1969333140
f
GR
GS
[1.00164 0 0 1 119.86992 142.86346] CT
0.8 0.502 0.502 RC
N
f-1969333140
f
GR
GS
[1.00164 0 0 1 124.97922 148.93594] CT
0.8 0.502 0.502 RC
N
f-1969333140
f
GR
GS
[1.00164 0 0 1 115.60443 163.93175] CT
0.8 0.502 0.502 RC
N
f-1969333140
f
GR
GS
[1.00164 0 0 1 196.56768 81.90708] CT
0.8 0.502 0.502 RC
N
f-1969333140
f
GR
GS
[1.00164 0 0 1 108.28293 164.77159] CT
0.8 0.502 0.502 RC
N
f-1969333140
f
GR
GS
[1.00164 0 0 1 132.44529 125.43991] CT
0.8 0.502 0.502 RC
N
f-1969333140
f
GR
GS
[1.00164 0 0 1 161.49961 108.63129] CT
0.8 0.502 0.502 RC
N
f-1969333140
f
GR
GS
[1.00164 0 0 1 127.53787 162.73552] CT
0.8 0.502 0.502 RC
N
f-1969333140
f
GR
GS
[1.00164 0 0 1 165.95912 127.61707] CT
0.8 0.502 0.502 RC
N
f-1969333140
f
GR
GS
[1.00164 0 0 1 95.82213 157.95441] CT
0.8 0.502 0.502 RC
N
f-1969333140
f
GR
GS
[1.00164 0 0 1 122.3926 151.12813] CT
0.8 0.502 0.502 RC
N
f-1969333140
f
GR
GS
[1.00164 0 0 1 164.98463 148.53064] CT
0.8 0.502 0.502 RC
N
f-1969333140
f
GR
GS
[1.00164 0 0 1 140.73812 139.69633] CT
0.8 0.502 0.502 RC
N
f-1969333140
f
GR
GS
[1.00164 0 0 1 208.56181 128.87187] CT
0.8 0.502 0.502 RC
N
f-1969333140
f
GR
GS
[1.00164 0 0 1 159.77084 85.45381] CT
0.8 0.502 0.502 RC
N
f-1969333140
f
GR
GS
[1.00164 0 0 1 162.04027 167.4726] CT
0.8 0.502 0.502 RC
N
f-1969333140
f
GR
GS
[1.00164 0 0 1 106.3483 148.01318] CT
0.8 0.502 0.502 RC
N
f-1969333140
f
GR
GS
[1.00164 0 0 1 156.906 158.43494] CT
0.8 0.502 0.502 RC
N
f-1969333140
f
GR
GS
[1.00164 0 0 1 188.16202 173.6362] CT
0.8 0.502 0.502 RC
N
f-1969333140
f
GR
GS
[1.00164 0 0 1 130.10883 119.5563] CT
0.8 0.502 0.502 RC
N
f-1969333140
f
GR
GS
[1.00164 0 0 1 135.23274 133.61385] CT
0.8 0.502 0.502 RC
N
f-1969333140
f
GR
GS
[1.00164 0 0 1 174.68075 125.49912] CT
0.8 0.502 0.502 RC
N
f-1969333140
f
GR
GS
[1.00164 0 0 1 224.68076 43.75] CT
0.8 0.502 0.502 RC
N
f-1969333140
f
GR
GS
[1.00164 0 0 1 145.88026 172.44923] CT
0.8 0.502 0.502 RC
N
f-1969333140
f
GR
GS
[1.00164 0 0 1 239.68449 97.97047] CT
0.8 0.502 0.502 RC
N
f-1969333140
f
GR
GS
[1.00164 0 0 1 232.6962 141.09935] CT
0.8 0.502 0.502 RC
N
f-1969333140
f
GR
GS
[1.00164 0 0 1 168.73693 96.12066] CT
0.8 0.502 0.502 RC
N
f-1969333140
f
GR
GS
[1.00164 0 0 1 98.44975 160.28841] CT
0.8 0.502 0.502 RC
N
f-1969333140
f
GR
GS
[1.00164 0 0 1 184.04564 131.84335] CT
0.8 0.502 0.502 RC
N
f-1969333140
f
GR
GS
[1.00164 0 0 1 135.60175 120.07803] CT
0.8 0.502 0.502 RC
N
f-1969333140
f
GR
GS
[1.00164 0 0 1 140.12444 151.43158] CT
0.8 0.502 0.502 RC
N
f-1969333140
f
GR
GS
[1.00164 0 0 1 148.51845 153.88829] CT
0.8 0.502 0.502 RC
N
f-1969333140
f
GR
GS
[1.00164 0 0 1 117.13077 158.8551] CT
0.8 0.502 0.502 RC
N
f-1969333140
f
GR
GS
[1.00164 0 0 1 102.05021 171.82462] CT
0.8 0.502 0.502 RC
N
f-1969333140
f
GR
GS
[1.00164 0 0 1 89.08895 158.61804] CT
0.8 0.502 0.502 RC
N
f-1969333140
f
GR
GS
[1.00164 0 0 1 137.01493 173.41306] CT
0.8 0.502 0.502 RC
N
f-1969333140
f
GR
GS
[1.00164 0 0 1 180.8446 165.17346] CT
0.8 0.502 0.502 RC
N
f-1969333140
f
GR
GS
[1.00164 0 0 1 90.14774 47.25] CT
/Helvetica 18 F
GS
[1 0 0 1 0 0] CT
0 7 moveto 
1 -1 scale
(r=0.64, p = 4.6e-13) t 
GR
GR
GS
[1.00164 0 0 1 0 0] CT
0.902 0.6 0.6 RC
1 LJ
3 LW
N
57 47.25 M
87 47.25 L
S
GR
%%Trailer
%%Pages: 1
%%EOF
