%!PS-Adobe-3.0 EPSF-3.0
%%Creator: (MATLAB, The Mathworks, Inc. Version 9.8.0.1323502 \(R2020a\). Operating System: Mac OS X)
%%Title: /Users/kosciessa/Desktop/tardis/LNDG/stateswitch/stsw_beh_stroop/figures/D_InterferencebyAge.eps
%%CreationDate: 2022-11-03T14:05:02
%%Pages: (atend)
%%BoundingBox:     4     0   206   275
%%LanguageLevel: 3
%%EndComments
%%BeginProlog
%%BeginResource: procset (Apache XML Graphics Std ProcSet) 1.2 0
%%Version: 1.2 0
%%Copyright: (Copyright 2001-2003,2010 The Apache Software Foundation. License terms: http://www.apache.org/licenses/LICENSE-2.0)
/bd{bind def}bind def
/ld{load def}bd
/GR/grestore ld
/GS/gsave ld
/RM/rmoveto ld
/C/curveto ld
/t/show ld
/L/lineto ld
/ML/setmiterlimit ld
/CT/concat ld
/f/fill ld
/N/newpath ld
/S/stroke ld
/CC/setcmykcolor ld
/A/ashow ld
/cp/closepath ld
/RC/setrgbcolor ld
/LJ/setlinejoin ld
/GC/setgray ld
/LW/setlinewidth ld
/M/moveto ld
/re {4 2 roll M
1 index 0 rlineto
0 exch rlineto
neg 0 rlineto
cp } bd
/_ctm matrix def
/_tm matrix def
/BT { _ctm currentmatrix pop matrix _tm copy pop 0 0 moveto } bd
/ET { _ctm setmatrix } bd
/iTm { _ctm setmatrix _tm concat } bd
/Tm { _tm astore pop iTm 0 0 moveto } bd
/ux 0.0 def
/uy 0.0 def
/F {
  /Tp exch def
  /Tf exch def
  Tf findfont Tp scalefont setfont
  /cf Tf def  /cs Tp def
} bd
/ULS {currentpoint /uy exch def /ux exch def} bd
/ULE {
  /Tcx currentpoint pop def
  gsave
  newpath
  cf findfont cs scalefont dup
  /FontMatrix get 0 get /Ts exch def /FontInfo get dup
  /UnderlinePosition get Ts mul /To exch def
  /UnderlineThickness get Ts mul /Tt exch def
  ux uy To add moveto  Tcx uy To add lineto
  Tt setlinewidth stroke
  grestore
} bd
/OLE {
  /Tcx currentpoint pop def
  gsave
  newpath
  cf findfont cs scalefont dup
  /FontMatrix get 0 get /Ts exch def /FontInfo get dup
  /UnderlinePosition get Ts mul /To exch def
  /UnderlineThickness get Ts mul /Tt exch def
  ux uy To add cs add moveto Tcx uy To add cs add lineto
  Tt setlinewidth stroke
  grestore
} bd
/SOE {
  /Tcx currentpoint pop def
  gsave
  newpath
  cf findfont cs scalefont dup
  /FontMatrix get 0 get /Ts exch def /FontInfo get dup
  /UnderlinePosition get Ts mul /To exch def
  /UnderlineThickness get Ts mul /Tt exch def
  ux uy To add cs 10 mul 26 idiv add moveto Tcx uy To add cs 10 mul 26 idiv add lineto
  Tt setlinewidth stroke
  grestore
} bd
/QT {
/Y22 exch store
/X22 exch store
/Y21 exch store
/X21 exch store
currentpoint
/Y21 load 2 mul add 3 div exch
/X21 load 2 mul add 3 div exch
/X21 load 2 mul /X22 load add 3 div
/Y21 load 2 mul /Y22 load add 3 div
/X22 load /Y22 load curveto
} bd
/SSPD {
dup length /d exch dict def
{
/v exch def
/k exch def
currentpagedevice k known {
/cpdv currentpagedevice k get def
v cpdv ne {
/upd false def
/nullv v type /nulltype eq def
/nullcpdv cpdv type /nulltype eq def
nullv nullcpdv or
{
/upd true def
} {
/sametype v type cpdv type eq def
sametype {
v type /arraytype eq {
/vlen v length def
/cpdvlen cpdv length def
vlen cpdvlen eq {
0 1 vlen 1 sub {
/i exch def
/obj v i get def
/cpdobj cpdv i get def
obj cpdobj ne {
/upd true def
exit
} if
} for
} {
/upd true def
} ifelse
} {
v type /dicttype eq {
v {
/dv exch def
/dk exch def
/cpddv cpdv dk get def
dv cpddv ne {
/upd true def
exit
} if
} forall
} {
/upd true def
} ifelse
} ifelse
} if
} ifelse
upd true eq {
d k v put
} if
} if
} if
} forall
d length 0 gt {
d setpagedevice
} if
} bd
/RE { % /NewFontName [NewEncodingArray] /FontName RE -
  findfont dup length dict begin
  {
    1 index /FID ne
    {def} {pop pop} ifelse
  } forall
  /Encoding exch def
  /FontName 1 index def
  currentdict definefont pop
  end
} bind def
%%EndResource
%%BeginResource: procset (Apache XML Graphics EPS ProcSet) 1.0 0
%%Version: 1.0 0
%%Copyright: (Copyright 2002-2003 The Apache Software Foundation. License terms: http://www.apache.org/licenses/LICENSE-2.0)
/BeginEPSF { %def
/b4_Inc_state save def         % Save state for cleanup
/dict_count countdictstack def % Count objects on dict stack
/op_count count 1 sub def      % Count objects on operand stack
userdict begin                 % Push userdict on dict stack
/showpage { } def              % Redefine showpage, { } = null proc
0 setgray 0 setlinecap         % Prepare graphics state
1 setlinewidth 0 setlinejoin
10 setmiterlimit [ ] 0 setdash newpath
/languagelevel where           % If level not equal to 1 then
{pop languagelevel             % set strokeadjust and
1 ne                           % overprint to their defaults.
{false setstrokeadjust false setoverprint
} if
} if
} bd
/EndEPSF { %def
count op_count sub {pop} repeat            % Clean up stacks
countdictstack dict_count sub {end} repeat
b4_Inc_state restore
} bd
%%EndResource
%FOPBeginFontDict
%%IncludeResource: font Courier-Oblique
%%IncludeResource: font Courier-BoldOblique
%%IncludeResource: font Courier-Bold
%%IncludeResource: font ZapfDingbats
%%IncludeResource: font Symbol
%%IncludeResource: font Helvetica
%%IncludeResource: font Helvetica-Oblique
%%IncludeResource: font Helvetica-Bold
%%IncludeResource: font Helvetica-BoldOblique
%%IncludeResource: font Times-Roman
%%IncludeResource: font Times-Italic
%%IncludeResource: font Times-Bold
%%IncludeResource: font Times-BoldItalic
%%IncludeResource: font Courier
%FOPEndFontDict
%%BeginResource: encoding WinAnsiEncoding
/WinAnsiEncoding [
/.notdef /.notdef /.notdef /.notdef /.notdef
/.notdef /.notdef /.notdef /.notdef /.notdef
/.notdef /.notdef /.notdef /.notdef /.notdef
/.notdef /.notdef /.notdef /.notdef /.notdef
/.notdef /.notdef /.notdef /.notdef /.notdef
/.notdef /.notdef /.notdef /.notdef /.notdef
/.notdef /.notdef /space /exclam /quotedbl
/numbersign /dollar /percent /ampersand /quotesingle
/parenleft /parenright /asterisk /plus /comma
/hyphen /period /slash /zero /one
/two /three /four /five /six
/seven /eight /nine /colon /semicolon
/less /equal /greater /question /at
/A /B /C /D /E
/F /G /H /I /J
/K /L /M /N /O
/P /Q /R /S /T
/U /V /W /X /Y
/Z /bracketleft /backslash /bracketright /asciicircum
/underscore /quoteleft /a /b /c
/d /e /f /g /h
/i /j /k /l /m
/n /o /p /q /r
/s /t /u /v /w
/x /y /z /braceleft /bar
/braceright /asciitilde /bullet /Euro /bullet
/quotesinglbase /florin /quotedblbase /ellipsis /dagger
/daggerdbl /circumflex /perthousand /Scaron /guilsinglleft
/OE /bullet /Zcaron /bullet /bullet
/quoteleft /quoteright /quotedblleft /quotedblright /bullet
/endash /emdash /asciitilde /trademark /scaron
/guilsinglright /oe /bullet /zcaron /Ydieresis
/space /exclamdown /cent /sterling /currency
/yen /brokenbar /section /dieresis /copyright
/ordfeminine /guillemotleft /logicalnot /sfthyphen /registered
/macron /degree /plusminus /twosuperior /threesuperior
/acute /mu /paragraph /middot /cedilla
/onesuperior /ordmasculine /guillemotright /onequarter /onehalf
/threequarters /questiondown /Agrave /Aacute /Acircumflex
/Atilde /Adieresis /Aring /AE /Ccedilla
/Egrave /Eacute /Ecircumflex /Edieresis /Igrave
/Iacute /Icircumflex /Idieresis /Eth /Ntilde
/Ograve /Oacute /Ocircumflex /Otilde /Odieresis
/multiply /Oslash /Ugrave /Uacute /Ucircumflex
/Udieresis /Yacute /Thorn /germandbls /agrave
/aacute /acircumflex /atilde /adieresis /aring
/ae /ccedilla /egrave /eacute /ecircumflex
/edieresis /igrave /iacute /icircumflex /idieresis
/eth /ntilde /ograve /oacute /ocircumflex
/otilde /odieresis /divide /oslash /ugrave
/uacute /ucircumflex /udieresis /yacute /thorn
/ydieresis
] def
%%EndResource
%FOPBeginFontReencode
/Courier-Oblique findfont
dup length dict begin
  {1 index /FID ne {def} {pop pop} ifelse} forall
  /Encoding WinAnsiEncoding def
  currentdict
end
/Courier-Oblique exch definefont pop
/Courier-BoldOblique findfont
dup length dict begin
  {1 index /FID ne {def} {pop pop} ifelse} forall
  /Encoding WinAnsiEncoding def
  currentdict
end
/Courier-BoldOblique exch definefont pop
/Courier-Bold findfont
dup length dict begin
  {1 index /FID ne {def} {pop pop} ifelse} forall
  /Encoding WinAnsiEncoding def
  currentdict
end
/Courier-Bold exch definefont pop
/Helvetica findfont
dup length dict begin
  {1 index /FID ne {def} {pop pop} ifelse} forall
  /Encoding WinAnsiEncoding def
  currentdict
end
/Helvetica exch definefont pop
/Helvetica-Oblique findfont
dup length dict begin
  {1 index /FID ne {def} {pop pop} ifelse} forall
  /Encoding WinAnsiEncoding def
  currentdict
end
/Helvetica-Oblique exch definefont pop
/Helvetica-Bold findfont
dup length dict begin
  {1 index /FID ne {def} {pop pop} ifelse} forall
  /Encoding WinAnsiEncoding def
  currentdict
end
/Helvetica-Bold exch definefont pop
/Helvetica-BoldOblique findfont
dup length dict begin
  {1 index /FID ne {def} {pop pop} ifelse} forall
  /Encoding WinAnsiEncoding def
  currentdict
end
/Helvetica-BoldOblique exch definefont pop
/Times-Roman findfont
dup length dict begin
  {1 index /FID ne {def} {pop pop} ifelse} forall
  /Encoding WinAnsiEncoding def
  currentdict
end
/Times-Roman exch definefont pop
/Times-Italic findfont
dup length dict begin
  {1 index /FID ne {def} {pop pop} ifelse} forall
  /Encoding WinAnsiEncoding def
  currentdict
end
/Times-Italic exch definefont pop
/Times-Bold findfont
dup length dict begin
  {1 index /FID ne {def} {pop pop} ifelse} forall
  /Encoding WinAnsiEncoding def
  currentdict
end
/Times-Bold exch definefont pop
/Times-BoldItalic findfont
dup length dict begin
  {1 index /FID ne {def} {pop pop} ifelse} forall
  /Encoding WinAnsiEncoding def
  currentdict
end
/Times-BoldItalic exch definefont pop
/Courier findfont
dup length dict begin
  {1 index /FID ne {def} {pop pop} ifelse} forall
  /Encoding WinAnsiEncoding def
  currentdict
end
/Courier exch definefont pop
%FOPEndFontReencode
%%EndProlog
%%Page: 1 1
%%PageBoundingBox: 0 0 227 283
%%BeginPageSetup
[1 0 0 -1 0 283] CT
%%EndPageSetup
GS
[0.99899 0 0 1 0 0] CT
N
0 0 M
227 0 L
227 283 L
0 283 L
0 0 L
cp
clip
1 GC
N
0 0 227 283 re
f
GR
GS
[0.99899 0 0 1 0 0] CT
1 GC
N
0 0 227 283 re
f
GR
GS
[0.99899 0 0 1 0 0] CT
1 GC
N
61 228 M
205.5 228 L
205.5 32 L
61 32 L
cp
f
GR
GS
[0.99899 0 0 1 0 0] CT
0.149 GC
2 setlinecap
1 LJ
0.5 LW
N
61 228 M
205.5 228 L
S
GR
GS
[0.99899 0 0 1 0 0] CT
0.149 GC
2 setlinecap
1 LJ
0.5 LW
N
104.35 228 M
104.35 226.04 L
S
GR
GS
[0.99899 0 0 1 0 0] CT
0.149 GC
2 setlinecap
1 LJ
0.5 LW
N
162.15 228 M
162.15 226.04 L
S
GR
GS
[0.99899 0 0 1 104.24503 234] CT
0.149 GC
/Helvetica 20 F
GS
[1 0 0 1 0 0] CT
-13 20 moveto 
1 -1 scale
(YA) t 
GR
GR
GS
[0.99899 0 0 1 161.98688 234] CT
0.149 GC
/Helvetica 20 F
GS
[1 0 0 1 0 0] CT
-14.5 20 moveto 
1 -1 scale
(OA) t 
GR
GR
GS
[0.99899 0 0 1 133.11604 259] CT
0.149 GC
/Helvetica 20 F
GS
[1 0 0 1 0 0] CT
-49 20 moveto 
1 -1 scale
(Age Group) t 
GR
GR
GS
[0.99899 0 0 1 0 0] CT
0.149 GC
2 setlinecap
1 LJ
0.5 LW
N
61 228 M
61 32 L
S
GR
GS
[0.99899 0 0 1 0 0] CT
0.149 GC
2 setlinecap
1 LJ
0.5 LW
N
61 213.336 M
62.96 213.336 L
S
GR
GS
[0.99899 0 0 1 0 0] CT
0.149 GC
2 setlinecap
1 LJ
0.5 LW
N
61 152.891 M
62.96 152.891 L
S
GR
GS
[0.99899 0 0 1 0 0] CT
0.149 GC
2 setlinecap
1 LJ
0.5 LW
N
61 92.445 M
62.96 92.445 L
S
GR
GS
[0.99899 0 0 1 0 0] CT
0.149 GC
2 setlinecap
1 LJ
0.5 LW
N
61 32 M
62.96 32 L
S
GR
GS
[0.99899 0 0 1 54.94467 213.33629] CT
0.149 GC
/Helvetica 20 F
GS
[1 0 0 1 0 0] CT
-12 7.5 moveto 
1 -1 scale
(0) t 
GR
GR
GS
[0.99899 0 0 1 54.94467 152.89085] CT
0.149 GC
/Helvetica 20 F
GS
[1 0 0 1 0 0] CT
-28 7.5 moveto 
1 -1 scale
(0.1) t 
GR
GR
GS
[0.99899 0 0 1 54.94467 92.44543] CT
0.149 GC
/Helvetica 20 F
GS
[1 0 0 1 0 0] CT
-28 7.5 moveto 
1 -1 scale
(0.2) t 
GR
GR
GS
[0.99899 0 0 1 54.94467 31.99999] CT
0.149 GC
/Helvetica 20 F
GS
[1 0 0 1 0 0] CT
-28 7.5 moveto 
1 -1 scale
(0.3) t 
GR
GR
GS
[0 -1 0.99899 0 23.97586 129.99991] CT
0.149 GC
/Helvetica 20 F
GS
[1 0 0 1 0 0] CT
-110 -5 moveto 
1 -1 scale
(Interference Costs \(SOT\)) t 
GR
GR
GS
[0.99899 0 0 1 133.1161 29.24999] CT
/Helvetica-Bold 22 F
GS
[1 0 0 1 0 0] CT
-76.5 -5 moveto 
1 -1 scale
(p = 2.5852e-08) t 
GR
GR
GS
[0.99899 0 0 1 0 0] CT
0.149 GC
1 LJ
0.5 LW
N
61 213.336 M
205.5 213.336 L
S
GR
GS
[0.99899 0 0 1 0 0] CT
0.702 GC
N
127.47 213.336 M
127.47 182.919 L
81.23 182.919 L
81.23 213.336 L
cp
f
GR
GS
[0.99899 0 0 1 100.50561 173.86961] CT
0.302 GC
N
2.739 0 M
2.739 -1.512 1.512 -2.739 0 -2.739 C
-1.512 -2.739 -2.739 -1.512 -2.739 0 C
-2.739 1.512 -1.512 2.739 0 2.739 C
1.512 2.739 2.739 1.512 2.739 0 C
cp
f
GR
GS
[0.99899 0 0 1 99.48648 180.21339] CT
0.302 GC
N
/f-775751039{2.739 0 M
2.739 -1.512 1.512 -2.739 0 -2.739 C
-1.512 -2.739 -2.739 -1.512 -2.739 0 C
-2.739 1.512 -1.512 2.739 0 2.739 C
1.512 2.739 2.739 1.512 2.739 0 C
cp}def
f-775751039
f
GR
GS
[0.99899 0 0 1 109.93407 198.03081] CT
0.302 GC
N
f-775751039
f
GR
GS
[0.99899 0 0 1 92.9354 205.7296] CT
0.302 GC
N
f-775751039
f
GR
GS
[0.99899 0 0 1 108.12335 213.59384] CT
0.302 GC
N
f-775751039
f
GR
GS
[0.99899 0 0 1 106.6348 152.17413] CT
0.302 GC
N
f-775751039
f
GR
GS
[0.99899 0 0 1 104.84791 198.12059] CT
0.302 GC
N
f-775751039
f
GR
GS
[0.99899 0 0 1 109.55057 190.91216] CT
0.302 GC
N
f-775751039
f
GR
GS
[0.99899 0 0 1 109.03191 161.40846] CT
0.302 GC
N
f-775751039
f
GR
GS
[0.99899 0 0 1 110.74392 186.97304] CT
0.302 GC
N
f-775751039
f
GR
GS
[0.99899 0 0 1 99.34799 163.40808] CT
0.302 GC
N
f-775751039
f
GR
GS
[0.99899 0 0 1 108.69189 181.68829] CT
0.302 GC
N
f-775751039
f
GR
GS
[0.99899 0 0 1 105.55391 190.62201] CT
0.302 GC
N
f-775751039
f
GR
GS
[0.99899 0 0 1 101.85499 196.74849] CT
0.302 GC
N
f-775751039
f
GR
GS
[0.99899 0 0 1 94.1192 184.03075] CT
0.302 GC
N
f-775751039
f
GR
GS
[0.99899 0 0 1 110.71617 138.75911] CT
0.302 GC
N
f-775751039
f
GR
GS
[0.99899 0 0 1 100.49375 195.55757] CT
0.302 GC
N
f-775751039
f
GR
GS
[0.99899 0 0 1 106.73638 193.63365] CT
0.302 GC
N
f-775751039
f
GR
GS
[0.99899 0 0 1 109.81721 228] CT
0.302 GC
N
f-775751039
f
GR
GS
[0.99899 0 0 1 95.11751 130.97417] CT
0.302 GC
N
f-775751039
f
GR
GS
[0.99899 0 0 1 95.65047 179.39952] CT
0.302 GC
N
f-775751039
f
GR
GS
[0.99899 0 0 1 105.38925 193.26213] CT
0.302 GC
N
f-775751039
f
GR
GS
[0.99899 0 0 1 103.90388 179.42151] CT
0.302 GC
N
f-775751039
f
GR
GS
[0.99899 0 0 1 111.15004 182.17058] CT
0.302 GC
N
f-775751039
f
GR
GS
[0.99899 0 0 1 109.65755 166.25459] CT
0.302 GC
N
f-775751039
f
GR
GS
[0.99899 0 0 1 93.88226 182.70683] CT
0.302 GC
N
f-775751039
f
GR
GS
[0.99899 0 0 1 94.38007 180.85382] CT
0.302 GC
N
f-775751039
f
GR
GS
[0.99899 0 0 1 94.74135 189.2337] CT
0.302 GC
N
f-775751039
f
GR
GS
[0.99899 0 0 1 111.13596 151.99918] CT
0.302 GC
N
f-775751039
f
GR
GS
[0.99899 0 0 1 114.47708 182.90367] CT
0.302 GC
N
f-775751039
f
GR
GS
[0.99899 0 0 1 108.48826 195.94405] CT
0.302 GC
N
f-775751039
f
GR
GS
[0.99899 0 0 1 95.74734 199.6713] CT
0.302 GC
N
f-775751039
f
GR
GS
[0.99899 0 0 1 109.38925 201.3485] CT
0.302 GC
N
f-775751039
f
GR
GS
[0.99899 0 0 1 95.24546 185.39902] CT
0.302 GC
N
f-775751039
f
GR
GS
[0.99899 0 0 1 95.41036 182.10017] CT
0.302 GC
N
f-775751039
f
GR
GS
[0.99899 0 0 1 107.49516 126.60886] CT
0.302 GC
N
f-775751039
f
GR
GS
[0.99899 0 0 1 100.2912 212.52434] CT
0.302 GC
N
f-775751039
f
GR
GS
[0.99899 0 0 1 107.79759 181.05598] CT
0.302 GC
N
f-775751039
f
GR
GS
[0.99899 0 0 1 109.99915 212.50015] CT
0.302 GC
N
f-775751039
f
GR
GS
[0.99899 0 0 1 106.16635 194.90492] CT
0.302 GC
N
f-775751039
f
GR
GS
[0.99899 0 0 1 109.789 174.76942] CT
0.302 GC
N
f-775751039
f
GR
GS
[0.99899 0 0 1 109.67178 188.87424] CT
0.302 GC
N
f-775751039
f
GR
GS
[0.99899 0 0 1 115.11433 146.54617] CT
0.302 GC
N
f-775751039
f
GR
GS
[0.99899 0 0 1 112.71992 174.34406] CT
0.302 GC
N
f-775751039
f
GR
GS
[0.99899 0 0 1 94.6884 170.8221] CT
0.302 GC
N
f-775751039
f
GR
GS
[0.99899 0 0 1 101.16015 175.62624] CT
0.302 GC
N
f-775751039
f
GR
GS
[0.99899 0 0 1 101.22395 206.0285] CT
0.302 GC
N
f-775751039
f
GR
GS
[0.99899 0 0 1 108.51859 198.37279] CT
0.302 GC
N
f-775751039
f
GR
GS
[0.99899 0 0 1 0 0] CT
0.702 GC
N
/f1514866318{185.27 213.336 M
185.27 153.382 L
139.03 153.382 L
139.03 213.336 L
cp}def
f1514866318
f
GR
GS
[0.99899 0 0 1 164.24902 120.91885] CT
0.302 GC
N
f-775751039
f
GR
GS
[0.99899 0 0 1 168.67025 151.01471] CT
0.302 GC
N
f-775751039
f
GR
GS
[0.99899 0 0 1 158.9301 173.18364] CT
0.302 GC
N
f-775751039
f
GR
GS
[0.99899 0 0 1 155.19709 144.16003] CT
0.302 GC
N
f-775751039
f
GR
GS
[0.99899 0 0 1 152.44024 152.27686] CT
0.302 GC
N
f-775751039
f
GR
GS
[0.99899 0 0 1 168.26767 181.52107] CT
0.302 GC
N
f-775751039
f
GR
GS
[0.99899 0 0 1 155.18893 144.49918] CT
0.302 GC
N
f-775751039
f
GR
GS
[0.99899 0 0 1 159.40633 150.28264] CT
0.302 GC
N
f-775751039
f
GR
GS
[0.99899 0 0 1 155.72658 137.51523] CT
0.302 GC
N
f-775751039
f
GR
GS
[0.99899 0 0 1 165.26526 176.95282] CT
0.302 GC
N
f-775751039
f
GR
GS
[0.99899 0 0 1 161.62843 146.86122] CT
0.302 GC
N
f-775751039
f
GR
GS
[0.99899 0 0 1 153.94565 194.46176] CT
0.302 GC
N
f-775751039
f
GR
GS
[0.99899 0 0 1 168.49859 192.92247] CT
0.302 GC
N
f-775751039
f
GR
GS
[0.99899 0 0 1 152.76219 191.45341] CT
0.302 GC
N
f-775751039
f
GR
GS
[0.99899 0 0 1 157.23049 155.9641] CT
0.302 GC
N
f-775751039
f
GR
GS
[0.99899 0 0 1 155.92106 165.55424] CT
0.302 GC
N
f-775751039
f
GR
GS
[0.99899 0 0 1 162.69994 163.6394] CT
0.302 GC
N
f-775751039
f
GR
GS
[0.99899 0 0 1 152.55183 168.64812] CT
0.302 GC
N
f-775751039
f
GR
GS
[0.99899 0 0 1 152.86012 110.54077] CT
0.302 GC
N
f-775751039
f
GR
GS
[0.99899 0 0 1 153.03191 193.3913] CT
0.302 GC
N
f-775751039
f
GR
GS
[0.99899 0 0 1 168.55625 146.00873] CT
0.302 GC
N
f-775751039
f
GR
GS
[0.99899 0 0 1 157.17284 131.72958] CT
0.302 GC
N
f-775751039
f
GR
GS
[0.99899 0 0 1 164.37817 159.95926] CT
0.302 GC
N
f-775751039
f
GR
GS
[0.99899 0 0 1 172.71354 166.24707] CT
0.302 GC
N
f-775751039
f
GR
GS
[0.99899 0 0 1 160.42751 144.96559] CT
0.302 GC
N
f-775751039
f
GR
GS
[0.99899 0 0 1 166.48502 178.03247] CT
0.302 GC
N
f-775751039
f
GR
GS
[0.99899 0 0 1 167.94815 184.32385] CT
0.302 GC
N
f-775751039
f
GR
GS
[0.99899 0 0 1 160.43115 156.40553] CT
0.302 GC
N
f-775751039
f
GR
GS
[0.99899 0 0 1 165.57837 157.71234] CT
0.302 GC
N
f-775751039
f
GR
GS
[0.99899 0 0 1 152.9735 118.30573] CT
0.302 GC
N
f-775751039
f
GR
GS
[0.99899 0 0 1 172.00533 117.77944] CT
0.302 GC
N
f-775751039
f
GR
GS
[0.99899 0 0 1 154.76824 151.99904] CT
0.302 GC
N
f-775751039
f
GR
GS
[0.99899 0 0 1 156.58637 162.75865] CT
0.302 GC
N
f-775751039
f
GR
GS
[0.99899 0 0 1 168.86579 148.5647] CT
0.302 GC
N
f-775751039
f
GR
GS
[0.99899 0 0 1 161.70058 162.62839] CT
0.302 GC
N
f-775751039
f
GR
GS
[0.99899 0 0 1 168.19895 154.3607] CT
0.302 GC
N
f-775751039
f
GR
GS
[0.99899 0 0 1 159.58499 169.97705] CT
0.302 GC
N
f-775751039
f
GR
GS
[0.99899 0 0 1 156.74251 123.23659] CT
0.302 GC
N
f-775751039
f
GR
GS
[0.99899 0 0 1 151.29852 70.72835] CT
0.302 GC
N
f-775751039
f
GR
GS
[0.99899 0 0 1 165.98944 170.84297] CT
0.302 GC
N
f-775751039
f
GR
GS
[0.99899 0 0 1 160.36006 86.39687] CT
0.302 GC
N
f-775751039
f
GR
GS
[0.99899 0 0 1 160.87222 104.64977] CT
0.302 GC
N
f-775751039
f
GR
GS
[0.99899 0 0 1 164.52423 110.84424] CT
0.302 GC
N
f-775751039
f
GR
GS
[0.99899 0 0 1 151.81054 185.48766] CT
0.302 GC
N
f-775751039
f
GR
GS
[0.99899 0 0 1 157.73273 128.77559] CT
0.302 GC
N
f-775751039
f
GR
GS
[0.99899 0 0 1 168.28588 150.84552] CT
0.302 GC
N
f-775751039
f
GR
GS
[0.99899 0 0 1 166.52385 160.71591] CT
0.302 GC
N
f-775751039
f
GR
GS
[0.99899 0 0 1 153.33327 162.87897] CT
0.302 GC
N
f-775751039
f
GR
GS
[0.99899 0 0 1 153.44459 164.84856] CT
0.302 GC
N
f-775751039
f
GR
GS
[0.99899 0 0 1 152.57156 196.62157] CT
0.302 GC
N
f-775751039
f
GR
GS
[0.99899 0 0 1 150.61915 181.8022] CT
0.302 GC
N
f-775751039
f
GR
GS
[0.99899 0 0 1 162.70773 149.21683] CT
0.302 GC
N
f-775751039
f
GR
GS
[0.99899 0 0 1 152.95185 153.81068] CT
0.302 GC
N
f-775751039
f
GR
%%Trailer
%%Pages: 1
%%EOF
