%!PS-Adobe-3.0 EPSF-3.0
%%Creator: (MATLAB, The Mathworks, Inc. Version 9.8.0.1323502 \(R2020a\). Operating System: Mac OS X)
%%Title: /Users/kosciessa/Desktop/tardis/LNDG/stateswitch/stsw_beh_stroop/figures/D_StroopReliability.eps
%%CreationDate: 2022-11-03T14:05:01
%%Pages: (atend)
%%BoundingBox:     4     3   268   277
%%LanguageLevel: 3
%%EndComments
%%BeginProlog
%%BeginResource: procset (Apache XML Graphics Std ProcSet) 1.2 0
%%Version: 1.2 0
%%Copyright: (Copyright 2001-2003,2010 The Apache Software Foundation. License terms: http://www.apache.org/licenses/LICENSE-2.0)
/bd{bind def}bind def
/ld{load def}bd
/GR/grestore ld
/GS/gsave ld
/RM/rmoveto ld
/C/curveto ld
/t/show ld
/L/lineto ld
/ML/setmiterlimit ld
/CT/concat ld
/f/fill ld
/N/newpath ld
/S/stroke ld
/CC/setcmykcolor ld
/A/ashow ld
/cp/closepath ld
/RC/setrgbcolor ld
/LJ/setlinejoin ld
/GC/setgray ld
/LW/setlinewidth ld
/M/moveto ld
/re {4 2 roll M
1 index 0 rlineto
0 exch rlineto
neg 0 rlineto
cp } bd
/_ctm matrix def
/_tm matrix def
/BT { _ctm currentmatrix pop matrix _tm copy pop 0 0 moveto } bd
/ET { _ctm setmatrix } bd
/iTm { _ctm setmatrix _tm concat } bd
/Tm { _tm astore pop iTm 0 0 moveto } bd
/ux 0.0 def
/uy 0.0 def
/F {
  /Tp exch def
  /Tf exch def
  Tf findfont Tp scalefont setfont
  /cf Tf def  /cs Tp def
} bd
/ULS {currentpoint /uy exch def /ux exch def} bd
/ULE {
  /Tcx currentpoint pop def
  gsave
  newpath
  cf findfont cs scalefont dup
  /FontMatrix get 0 get /Ts exch def /FontInfo get dup
  /UnderlinePosition get Ts mul /To exch def
  /UnderlineThickness get Ts mul /Tt exch def
  ux uy To add moveto  Tcx uy To add lineto
  Tt setlinewidth stroke
  grestore
} bd
/OLE {
  /Tcx currentpoint pop def
  gsave
  newpath
  cf findfont cs scalefont dup
  /FontMatrix get 0 get /Ts exch def /FontInfo get dup
  /UnderlinePosition get Ts mul /To exch def
  /UnderlineThickness get Ts mul /Tt exch def
  ux uy To add cs add moveto Tcx uy To add cs add lineto
  Tt setlinewidth stroke
  grestore
} bd
/SOE {
  /Tcx currentpoint pop def
  gsave
  newpath
  cf findfont cs scalefont dup
  /FontMatrix get 0 get /Ts exch def /FontInfo get dup
  /UnderlinePosition get Ts mul /To exch def
  /UnderlineThickness get Ts mul /Tt exch def
  ux uy To add cs 10 mul 26 idiv add moveto Tcx uy To add cs 10 mul 26 idiv add lineto
  Tt setlinewidth stroke
  grestore
} bd
/QT {
/Y22 exch store
/X22 exch store
/Y21 exch store
/X21 exch store
currentpoint
/Y21 load 2 mul add 3 div exch
/X21 load 2 mul add 3 div exch
/X21 load 2 mul /X22 load add 3 div
/Y21 load 2 mul /Y22 load add 3 div
/X22 load /Y22 load curveto
} bd
/SSPD {
dup length /d exch dict def
{
/v exch def
/k exch def
currentpagedevice k known {
/cpdv currentpagedevice k get def
v cpdv ne {
/upd false def
/nullv v type /nulltype eq def
/nullcpdv cpdv type /nulltype eq def
nullv nullcpdv or
{
/upd true def
} {
/sametype v type cpdv type eq def
sametype {
v type /arraytype eq {
/vlen v length def
/cpdvlen cpdv length def
vlen cpdvlen eq {
0 1 vlen 1 sub {
/i exch def
/obj v i get def
/cpdobj cpdv i get def
obj cpdobj ne {
/upd true def
exit
} if
} for
} {
/upd true def
} ifelse
} {
v type /dicttype eq {
v {
/dv exch def
/dk exch def
/cpddv cpdv dk get def
dv cpddv ne {
/upd true def
exit
} if
} forall
} {
/upd true def
} ifelse
} ifelse
} if
} ifelse
upd true eq {
d k v put
} if
} if
} if
} forall
d length 0 gt {
d setpagedevice
} if
} bd
/RE { % /NewFontName [NewEncodingArray] /FontName RE -
  findfont dup length dict begin
  {
    1 index /FID ne
    {def} {pop pop} ifelse
  } forall
  /Encoding exch def
  /FontName 1 index def
  currentdict definefont pop
  end
} bind def
%%EndResource
%%BeginResource: procset (Apache XML Graphics EPS ProcSet) 1.0 0
%%Version: 1.0 0
%%Copyright: (Copyright 2002-2003 The Apache Software Foundation. License terms: http://www.apache.org/licenses/LICENSE-2.0)
/BeginEPSF { %def
/b4_Inc_state save def         % Save state for cleanup
/dict_count countdictstack def % Count objects on dict stack
/op_count count 1 sub def      % Count objects on operand stack
userdict begin                 % Push userdict on dict stack
/showpage { } def              % Redefine showpage, { } = null proc
0 setgray 0 setlinecap         % Prepare graphics state
1 setlinewidth 0 setlinejoin
10 setmiterlimit [ ] 0 setdash newpath
/languagelevel where           % If level not equal to 1 then
{pop languagelevel             % set strokeadjust and
1 ne                           % overprint to their defaults.
{false setstrokeadjust false setoverprint
} if
} if
} bd
/EndEPSF { %def
count op_count sub {pop} repeat            % Clean up stacks
countdictstack dict_count sub {end} repeat
b4_Inc_state restore
} bd
%%EndResource
%FOPBeginFontDict
%%IncludeResource: font Courier-Oblique
%%IncludeResource: font Courier-BoldOblique
%%IncludeResource: font Courier-Bold
%%IncludeResource: font ZapfDingbats
%%IncludeResource: font Symbol
%%IncludeResource: font Helvetica
%%IncludeResource: font Helvetica-Oblique
%%IncludeResource: font Helvetica-Bold
%%IncludeResource: font Helvetica-BoldOblique
%%IncludeResource: font Times-Roman
%%IncludeResource: font Times-Italic
%%IncludeResource: font Times-Bold
%%IncludeResource: font Times-BoldItalic
%%IncludeResource: font Courier
%FOPEndFontDict
%%BeginResource: encoding WinAnsiEncoding
/WinAnsiEncoding [
/.notdef /.notdef /.notdef /.notdef /.notdef
/.notdef /.notdef /.notdef /.notdef /.notdef
/.notdef /.notdef /.notdef /.notdef /.notdef
/.notdef /.notdef /.notdef /.notdef /.notdef
/.notdef /.notdef /.notdef /.notdef /.notdef
/.notdef /.notdef /.notdef /.notdef /.notdef
/.notdef /.notdef /space /exclam /quotedbl
/numbersign /dollar /percent /ampersand /quotesingle
/parenleft /parenright /asterisk /plus /comma
/hyphen /period /slash /zero /one
/two /three /four /five /six
/seven /eight /nine /colon /semicolon
/less /equal /greater /question /at
/A /B /C /D /E
/F /G /H /I /J
/K /L /M /N /O
/P /Q /R /S /T
/U /V /W /X /Y
/Z /bracketleft /backslash /bracketright /asciicircum
/underscore /quoteleft /a /b /c
/d /e /f /g /h
/i /j /k /l /m
/n /o /p /q /r
/s /t /u /v /w
/x /y /z /braceleft /bar
/braceright /asciitilde /bullet /Euro /bullet
/quotesinglbase /florin /quotedblbase /ellipsis /dagger
/daggerdbl /circumflex /perthousand /Scaron /guilsinglleft
/OE /bullet /Zcaron /bullet /bullet
/quoteleft /quoteright /quotedblleft /quotedblright /bullet
/endash /emdash /asciitilde /trademark /scaron
/guilsinglright /oe /bullet /zcaron /Ydieresis
/space /exclamdown /cent /sterling /currency
/yen /brokenbar /section /dieresis /copyright
/ordfeminine /guillemotleft /logicalnot /sfthyphen /registered
/macron /degree /plusminus /twosuperior /threesuperior
/acute /mu /paragraph /middot /cedilla
/onesuperior /ordmasculine /guillemotright /onequarter /onehalf
/threequarters /questiondown /Agrave /Aacute /Acircumflex
/Atilde /Adieresis /Aring /AE /Ccedilla
/Egrave /Eacute /Ecircumflex /Edieresis /Igrave
/Iacute /Icircumflex /Idieresis /Eth /Ntilde
/Ograve /Oacute /Ocircumflex /Otilde /Odieresis
/multiply /Oslash /Ugrave /Uacute /Ucircumflex
/Udieresis /Yacute /Thorn /germandbls /agrave
/aacute /acircumflex /atilde /adieresis /aring
/ae /ccedilla /egrave /eacute /ecircumflex
/edieresis /igrave /iacute /icircumflex /idieresis
/eth /ntilde /ograve /oacute /ocircumflex
/otilde /odieresis /divide /oslash /ugrave
/uacute /ucircumflex /udieresis /yacute /thorn
/ydieresis
] def
%%EndResource
%FOPBeginFontReencode
/Courier-Oblique findfont
dup length dict begin
  {1 index /FID ne {def} {pop pop} ifelse} forall
  /Encoding WinAnsiEncoding def
  currentdict
end
/Courier-Oblique exch definefont pop
/Courier-BoldOblique findfont
dup length dict begin
  {1 index /FID ne {def} {pop pop} ifelse} forall
  /Encoding WinAnsiEncoding def
  currentdict
end
/Courier-BoldOblique exch definefont pop
/Courier-Bold findfont
dup length dict begin
  {1 index /FID ne {def} {pop pop} ifelse} forall
  /Encoding WinAnsiEncoding def
  currentdict
end
/Courier-Bold exch definefont pop
/Helvetica findfont
dup length dict begin
  {1 index /FID ne {def} {pop pop} ifelse} forall
  /Encoding WinAnsiEncoding def
  currentdict
end
/Helvetica exch definefont pop
/Helvetica-Oblique findfont
dup length dict begin
  {1 index /FID ne {def} {pop pop} ifelse} forall
  /Encoding WinAnsiEncoding def
  currentdict
end
/Helvetica-Oblique exch definefont pop
/Helvetica-Bold findfont
dup length dict begin
  {1 index /FID ne {def} {pop pop} ifelse} forall
  /Encoding WinAnsiEncoding def
  currentdict
end
/Helvetica-Bold exch definefont pop
/Helvetica-BoldOblique findfont
dup length dict begin
  {1 index /FID ne {def} {pop pop} ifelse} forall
  /Encoding WinAnsiEncoding def
  currentdict
end
/Helvetica-BoldOblique exch definefont pop
/Times-Roman findfont
dup length dict begin
  {1 index /FID ne {def} {pop pop} ifelse} forall
  /Encoding WinAnsiEncoding def
  currentdict
end
/Times-Roman exch definefont pop
/Times-Italic findfont
dup length dict begin
  {1 index /FID ne {def} {pop pop} ifelse} forall
  /Encoding WinAnsiEncoding def
  currentdict
end
/Times-Italic exch definefont pop
/Times-Bold findfont
dup length dict begin
  {1 index /FID ne {def} {pop pop} ifelse} forall
  /Encoding WinAnsiEncoding def
  currentdict
end
/Times-Bold exch definefont pop
/Times-BoldItalic findfont
dup length dict begin
  {1 index /FID ne {def} {pop pop} ifelse} forall
  /Encoding WinAnsiEncoding def
  currentdict
end
/Times-BoldItalic exch definefont pop
/Courier findfont
dup length dict begin
  {1 index /FID ne {def} {pop pop} ifelse} forall
  /Encoding WinAnsiEncoding def
  currentdict
end
/Courier exch definefont pop
%FOPEndFontReencode
%%EndProlog
%%Page: 1 1
%%PageBoundingBox: 0 0 283 283
%%BeginPageSetup
[1 0 0 -1 0 283] CT
%%EndPageSetup
GS
[1.00164 0 0 1 0 0] CT
1 GC
N
0 0 283 283 re
f
GR
GS
[1.00164 0 0 1 0 0] CT
1 GC
N
0 0 283 283 re
f
GR
GS
[1.00164 0 0 1 0 0] CT
1 GC
N
55.5 233.5 M
256 233.5 L
256 26.5 L
55.5 26.5 L
cp
f
GR
GS
[1.00164 0 0 1 0 0] CT
0.149 GC
2 setlinecap
1 LJ
0.5 LW
N
55.5 233.5 M
256 233.5 L
S
GR
GS
[1.00164 0 0 1 0 0] CT
0.149 GC
2 setlinecap
1 LJ
0.5 LW
N
55.5 233.5 M
55.5 231.43 L
S
GR
GS
[1.00164 0 0 1 0 0] CT
0.149 GC
2 setlinecap
1 LJ
0.5 LW
N
105.625 233.5 M
105.625 231.43 L
S
GR
GS
[1.00164 0 0 1 0 0] CT
0.149 GC
2 setlinecap
1 LJ
0.5 LW
N
155.75 233.5 M
155.75 231.43 L
S
GR
GS
[1.00164 0 0 1 0 0] CT
0.149 GC
2 setlinecap
1 LJ
0.5 LW
N
205.875 233.5 M
205.875 231.43 L
S
GR
GS
[1.00164 0 0 1 0 0] CT
0.149 GC
2 setlinecap
1 LJ
0.5 LW
N
256 233.5 M
256 231.43 L
S
GR
GS
[1.00164 0 0 1 55.5911 239.09999] CT
0.149 GC
/Helvetica 18 F
GS
[1 0 0 1 0 0] CT
-13 18 moveto 
1 -1 scale
(1.4) t 
GR
GR
GS
[1.00164 0 0 1 105.7984 239.09999] CT
0.149 GC
/Helvetica 18 F
GS
[1 0 0 1 0 0] CT
-13 18 moveto 
1 -1 scale
(1.6) t 
GR
GR
GS
[1.00164 0 0 1 156.00566 239.09999] CT
0.149 GC
/Helvetica 18 F
GS
[1 0 0 1 0 0] CT
-13 18 moveto 
1 -1 scale
(1.8) t 
GR
GR
GS
[1.00164 0 0 1 206.21296 239.09999] CT
0.149 GC
/Helvetica 18 F
GS
[1 0 0 1 0 0] CT
-5.5 18 moveto 
1 -1 scale
(2) t 
GR
GR
GS
[1.00164 0 0 1 256.42025 239.09999] CT
0.149 GC
/Helvetica 18 F
GS
[1 0 0 1 0 0] CT
-13 18 moveto 
1 -1 scale
(2.2) t 
GR
GR
GS
[1.00164 0 0 1 156.00578 261.59998] CT
0.149 GC
/Helvetica 18 F
GS
[1 0 0 1 0 0] CT
-75.5 18 moveto 
1 -1 scale
(md SOT Session 1) t 
GR
GR
GS
[1.00164 0 0 1 0 0] CT
0.149 GC
2 setlinecap
1 LJ
0.5 LW
N
55.5 233.5 M
55.5 26.5 L
S
GR
GS
[1.00164 0 0 1 0 0] CT
0.149 GC
2 setlinecap
1 LJ
0.5 LW
N
55.5 233.5 M
57.57 233.5 L
S
GR
GS
[1.00164 0 0 1 0 0] CT
0.149 GC
2 setlinecap
1 LJ
0.5 LW
N
55.5 192.1 M
57.57 192.1 L
S
GR
GS
[1.00164 0 0 1 0 0] CT
0.149 GC
2 setlinecap
1 LJ
0.5 LW
N
55.5 150.7 M
57.57 150.7 L
S
GR
GS
[1.00164 0 0 1 0 0] CT
0.149 GC
2 setlinecap
1 LJ
0.5 LW
N
55.5 109.3 M
57.57 109.3 L
S
GR
GS
[1.00164 0 0 1 0 0] CT
0.149 GC
2 setlinecap
1 LJ
0.5 LW
N
55.5 67.9 M
57.57 67.9 L
S
GR
GS
[1.00164 0 0 1 0 0] CT
0.149 GC
2 setlinecap
1 LJ
0.5 LW
N
55.5 26.5 M
57.57 26.5 L
S
GR
GS
[1.00164 0 0 1 49.98192 233.49998] CT
0.149 GC
/Helvetica 18 F
GS
[1 0 0 1 0 0] CT
-26 7 moveto 
1 -1 scale
(1.2) t 
GR
GR
GS
[1.00164 0 0 1 49.98192 192.10001] CT
0.149 GC
/Helvetica 18 F
GS
[1 0 0 1 0 0] CT
-26 7 moveto 
1 -1 scale
(1.4) t 
GR
GR
GS
[1.00164 0 0 1 49.98192 150.7] CT
0.149 GC
/Helvetica 18 F
GS
[1 0 0 1 0 0] CT
-26 7 moveto 
1 -1 scale
(1.6) t 
GR
GR
GS
[1.00164 0 0 1 49.98192 109.30001] CT
0.149 GC
/Helvetica 18 F
GS
[1 0 0 1 0 0] CT
-26 7 moveto 
1 -1 scale
(1.8) t 
GR
GR
GS
[1.00164 0 0 1 49.98192 67.9] CT
0.149 GC
/Helvetica 18 F
GS
[1 0 0 1 0 0] CT
-11 7 moveto 
1 -1 scale
(2) t 
GR
GR
GS
[1.00164 0 0 1 49.98192 26.49999] CT
0.149 GC
/Helvetica 18 F
GS
[1 0 0 1 0 0] CT
-26 7 moveto 
1 -1 scale
(2.2) t 
GR
GR
GS
[0 -1 1.00164 0 21.43512 129.99989] CT
0.149 GC
/Helvetica 18 F
GS
[1 0 0 1 0 0] CT
-75.5 -4 moveto 
1 -1 scale
(md SOT Session 2) t 
GR
GR
GS
[1.00164 0 0 1 156.00581 24.25] CT
/Helvetica-Bold 18 F
GS
[1 0 0 1 0 0] CT
-103.5 -4 moveto 
1 -1 scale
(Individual SOT reliability) t 
GR
GR
GS
[1.00164 0 0 1 158.88605 154.02797] CT
0.8 0.502 0.502 RC
N
0.5 0 M
0.5 -0.276 0.276 -0.5 0 -0.5 C
-0.276 -0.5 -0.5 -0.276 -0.5 0 C
-0.5 0.276 -0.276 0.5 0 0.5 C
0.276 0.5 0.5 0.276 0.5 0 C
cp
f
GR
GS
[1.00164 0 0 1 109.91402 148.06674] CT
0.8 0.502 0.502 RC
N
/f-2105962265{0.5 0 M
0.5 -0.276 0.276 -0.5 0 -0.5 C
-0.276 -0.5 -0.5 -0.276 -0.5 0 C
-0.5 0.276 -0.276 0.5 0 0.5 C
0.276 0.5 0.5 0.276 0.5 0 C
cp}def
f-2105962265
f
GR
GS
[1.00164 0 0 1 112.87978 159.98918] CT
0.8 0.502 0.502 RC
N
f-2105962265
f
GR
GS
[1.00164 0 0 1 102.75862 156.78328] CT
0.8 0.502 0.502 RC
N
f-2105962265
f
GR
GS
[1.00164 0 0 1 166.82702 112.29939] CT
0.8 0.502 0.502 RC
N
f-2105962265
f
GR
GS
[1.00164 0 0 1 112.87978 142.1055] CT
0.8 0.502 0.502 RC
N
f-2105962265
f
GR
GS
[1.00164 0 0 1 143.96047 146.05307] CT
0.8 0.502 0.502 RC
N
f-2105962265
f
GR
GS
[1.00164 0 0 1 97.69807 159.98918] CT
0.8 0.502 0.502 RC
N
f-2105962265
f
GR
GS
[1.00164 0 0 1 123.90603 148.06674] CT
0.8 0.502 0.502 RC
N
f-2105962265
f
GR
GS
[1.00164 0 0 1 80.07426 170.4894] CT
0.8 0.502 0.502 RC
N
f-2105962265
f
GR
GS
[1.00164 0 0 1 101.76244 168.1049] CT
0.8 0.502 0.502 RC
N
f-2105962265
f
GR
GS
[1.00164 0 0 1 116.91003 122.21286] CT
0.8 0.502 0.502 RC
N
f-2105962265
f
GR
GS
[1.00164 0 0 1 94.53307 169.29713] CT
0.8 0.502 0.502 RC
N
f-2105962265
f
GR
GS
[1.00164 0 0 1 141.06874 145.45694] CT
0.8 0.502 0.502 RC
N
f-2105962265
f
GR
GS
[1.00164 0 0 1 85.00393 171.91164] CT
0.8 0.502 0.502 RC
N
f-2105962265
f
GR
GS
[1.00164 0 0 1 125.16406 129.36633] CT
0.8 0.502 0.502 RC
N
f-2105962265
f
GR
GS
[1.00164 0 0 1 94.08335 177.87285] CT
0.8 0.502 0.502 RC
N
f-2105962265
f
GR
GS
[1.00164 0 0 1 89.75143 175.25836] CT
0.8 0.502 0.502 RC
N
f-2105962265
f
GR
GS
[1.00164 0 0 1 123.45062 148.06674] CT
0.8 0.502 0.502 RC
N
f-2105962265
f
GR
GS
[1.00164 0 0 1 167.08886 112.29939] CT
0.8 0.502 0.502 RC
N
f-2105962265
f
GR
GS
[1.00164 0 0 1 131.67051 136.1443] CT
0.8 0.502 0.502 RC
N
f-2105962265
f
GR
GS
[1.00164 0 0 1 145.40637 119.23225] CT
0.8 0.502 0.502 RC
N
f-2105962265
f
GR
GS
[1.00164 0 0 1 99.14393 173.76807] CT
0.8 0.502 0.502 RC
N
f-2105962265
f
GR
GS
[1.00164 0 0 1 72.84489 183.83408] CT
0.8 0.502 0.502 RC
N
f-2105962265
f
GR
GS
[1.00164 0 0 1 102.75862 163.93204] CT
0.8 0.502 0.502 RC
N
f-2105962265
f
GR
GS
[1.00164 0 0 1 81.79908 176.15019] CT
0.8 0.502 0.502 RC
N
f-2105962265
f
GR
GS
[1.00164 0 0 1 144.32195 163.33592] CT
0.8 0.502 0.502 RC
N
f-2105962265
f
GR
GS
[1.00164 0 0 1 97.53296 139.00754] CT
0.8 0.502 0.502 RC
N
f-2105962265
f
GR
GS
[1.00164 0 0 1 101.76244 167.50876] CT
0.8 0.502 0.502 RC
N
f-2105962265
f
GR
GS
[1.00164 0 0 1 70.95499 177.87285] CT
0.8 0.502 0.502 RC
N
f-2105962265
f
GR
GS
[1.00164 0 0 1 123.90603 153.80264] CT
0.8 0.502 0.502 RC
N
f-2105962265
f
GR
GS
[1.00164 0 0 1 109.98802 160.36002] CT
0.8 0.502 0.502 RC
N
f-2105962265
f
GR
GS
[1.00164 0 0 1 91.22576 179.43123] CT
0.8 0.502 0.502 RC
N
f-2105962265
f
GR
GS
[1.00164 0 0 1 141.06874 127.57796] CT
0.8 0.502 0.502 RC
N
f-2105962265
f
GR
GS
[1.00164 0 0 1 137.90943 135.32756] CT
0.8 0.502 0.502 RC
N
f-2105962265
f
GR
GS
[1.00164 0 0 1 106.37333 142.1055] CT
0.8 0.502 0.502 RC
N
f-2105962265
f
GR
GS
[1.00164 0 0 1 119.97826 154.02797] CT
0.8 0.502 0.502 RC
N
f-2105962265
f
GR
GS
[1.00164 0 0 1 89.75143 183.00797] CT
0.8 0.502 0.502 RC
N
f-2105962265
f
GR
GS
[1.00164 0 0 1 88.92601 154.02797] CT
0.8 0.502 0.502 RC
N
f-2105962265
f
GR
GS
[1.00164 0 0 1 109.48709 136.51979] CT
0.8 0.502 0.502 RC
N
f-2105962265
f
GR
GS
[1.00164 0 0 1 89.02848 197.26326] CT
0.8 0.502 0.502 RC
N
f-2105962265
f
GR
GS
[1.00164 0 0 1 102.75862 160.36002] CT
0.8 0.502 0.502 RC
N
f-2105962265
f
GR
GS
[1.00164 0 0 1 93.36043 171.91164] CT
0.8 0.502 0.502 RC
N
f-2105962265
f
GR
GS
[1.00164 0 0 1 73.1238 194.92572] CT
0.8 0.502 0.502 RC
N
f-2105962265
f
GR
GS
[1.00164 0 0 1 118.6633 138.89958] CT
0.8 0.502 0.502 RC
N
f-2105962265
f
GR
GS
[1.00164 0 0 1 98.42098 154.02797] CT
0.8 0.502 0.502 RC
N
f-2105962265
f
GR
GS
[1.00164 0 0 1 129.5017 131.75082] CT
0.8 0.502 0.502 RC
N
f-2105962265
f
GR
GS
[1.00164 0 0 1 111.43389 142.1055] CT
0.8 0.502 0.502 RC
N
f-2105962265
f
GR
GS
[1.00164 0 0 1 180.819 88.45449] CT
0.8 0.502 0.502 RC
N
f-2105962265
f
GR
GS
[1.00164 0 0 1 186.87007 100.37693] CT
0.8 0.502 0.502 RC
N
f-2105962265
f
GR
GS
[1.00164 0 0 1 116.22125 154.02797] CT
0.8 0.502 0.502 RC
N
f-2105962265
f
GR
GS
[1.00164 0 0 1 228.84608 47.71161] CT
0.8 0.502 0.502 RC
N
f-2105962265
f
GR
GS
[1.00164 0 0 1 166.82702 136.1443] CT
0.8 0.502 0.502 RC
N
f-2105962265
f
GR
GS
[1.00164 0 0 1 193.83191 100.75714] CT
0.8 0.502 0.502 RC
N
f-2105962265
f
GR
GS
[1.00164 0 0 1 143.96047 100.37693] CT
0.8 0.502 0.502 RC
N
f-2105962265
f
GR
GS
[1.00164 0 0 1 137.90943 118.63612] CT
0.8 0.502 0.502 RC
N
f-2105962265
f
GR
GS
[1.00164 0 0 1 130.90205 125.78959] CT
0.8 0.502 0.502 RC
N
f-2105962265
f
GR
GS
[1.00164 0 0 1 188.51519 122.21286] CT
0.8 0.502 0.502 RC
N
f-2105962265
f
GR
GS
[1.00164 0 0 1 72.84489 165.95041] CT
0.8 0.502 0.502 RC
N
f-2105962265
f
GR
GS
[1.00164 0 0 1 222.74378 115.65552] CT
0.8 0.502 0.502 RC
N
f-2105962265
f
GR
GS
[1.00164 0 0 1 174.05638 126.98183] CT
0.8 0.502 0.502 RC
N
f-2105962265
f
GR
GS
[1.00164 0 0 1 165.88205 107.31448] CT
0.8 0.502 0.502 RC
N
f-2105962265
f
GR
GS
[1.00164 0 0 1 163.95517 123.4051] CT
0.8 0.502 0.502 RC
N
f-2105962265
f
GR
GS
[1.00164 0 0 1 123.90603 148.06674] CT
0.8 0.502 0.502 RC
N
f-2105962265
f
GR
GS
[1.00164 0 0 1 156.24478 118.26063] CT
0.8 0.502 0.502 RC
N
f-2105962265
f
GR
GS
[1.00164 0 0 1 170.70355 103.14164] CT
0.8 0.502 0.502 RC
N
f-2105962265
f
GR
GS
[1.00164 0 0 1 131.67051 143.66858] CT
0.8 0.502 0.502 RC
N
f-2105962265
f
GR
GS
[1.00164 0 0 1 166.36592 134.1353] CT
0.8 0.502 0.502 RC
N
f-2105962265
f
GR
GS
[1.00164 0 0 1 176.48706 136.1443] CT
0.8 0.502 0.502 RC
N
f-2105962265
f
GR
GS
[1.00164 0 0 1 108.99185 154.02797] CT
0.8 0.502 0.502 RC
N
f-2105962265
f
GR
GS
[1.00164 0 0 1 130.68002 136.1443] CT
0.8 0.502 0.502 RC
N
f-2105962265
f
GR
GS
[1.00164 0 0 1 170.70355 129.96246] CT
0.8 0.502 0.502 RC
N
f-2105962265
f
GR
GS
[1.00164 0 0 1 167.54424 106.33816] CT
0.8 0.502 0.502 RC
N
f-2105962265
f
GR
GS
[1.00164 0 0 1 144.89404 142.1055] CT
0.8 0.502 0.502 RC
N
f-2105962265
f
GR
GS
[1.00164 0 0 1 151.18419 110.2951] CT
0.8 0.502 0.502 RC
N
f-2105962265
f
GR
GS
[1.00164 0 0 1 149.01537 128.7702] CT
0.8 0.502 0.502 RC
N
f-2105962265
f
GR
GS
[1.00164 0 0 1 182.13682 121.61673] CT
0.8 0.502 0.502 RC
N
f-2105962265
f
GR
GS
[1.00164 0 0 1 176.12274 112.29939] CT
0.8 0.502 0.502 RC
N
f-2105962265
f
GR
GS
[1.00164 0 0 1 152.3682 112.29939] CT
0.8 0.502 0.502 RC
N
f-2105962265
f
GR
GS
[1.00164 0 0 1 123.45062 159.98918] CT
0.8 0.502 0.502 RC
N
f-2105962265
f
GR
GS
[1.00164 0 0 1 175.04118 128.17409] CT
0.8 0.502 0.502 RC
N
f-2105962265
f
GR
GS
[1.00164 0 0 1 166.36592 115.65552] CT
0.8 0.502 0.502 RC
N
f-2105962265
f
GR
GS
[1.00164 0 0 1 133.83933 149.62981] CT
0.8 0.502 0.502 RC
N
f-2105962265
f
GR
GS
[1.00164 0 0 1 116.91003 148.06674] CT
0.8 0.502 0.502 RC
N
f-2105962265
f
GR
GS
[1.00164 0 0 1 141.66073 147.84145] CT
0.8 0.502 0.502 RC
N
f-2105962265
f
GR
GS
[1.00164 0 0 1 174.31824 91.22388] CT
0.8 0.502 0.502 RC
N
f-2105962265
f
GR
GS
[1.00164 0 0 1 196.00073 118.26063] CT
0.8 0.502 0.502 RC
N
f-2105962265
f
GR
GS
[1.00164 0 0 1 175.76413 80.79173] CT
0.8 0.502 0.502 RC
N
f-2105962265
f
GR
GS
[1.00164 0 0 1 175.27173 137.41399] CT
0.8 0.502 0.502 RC
N
f-2105962265
f
GR
GS
[1.00164 0 0 1 137.45402 144.26471] CT
0.8 0.502 0.502 RC
N
f-2105962265
f
GR
GS
[1.00164 0 0 1 172.87237 118.26063] CT
0.8 0.502 0.502 RC
N
f-2105962265
f
GR
GS
[1.00164 0 0 1 152.3682 129.06827] CT
0.8 0.502 0.502 RC
N
f-2105962265
f
GR
GS
[1.00164 0 0 1 127.69435 129.96246] CT
0.8 0.502 0.502 RC
N
f-2105962265
f
GR
GS
[1.00164 0 0 1 120.10919 144.86081] CT
0.8 0.502 0.502 RC
N
f-2105962265
f
GR
GS
[1.00164 0 0 1 194.91634 156.78328] CT
0.8 0.502 0.502 RC
N
f-2105962265
f
GR
GS
[1.00164 0 0 1 115.78293 148.06674] CT
0.8 0.502 0.502 RC
N
f-2105962265
f
GR
GS
[1.00164 0 0 1 138.17697 118.63612] CT
0.8 0.502 0.502 RC
N
f-2105962265
f
GR
GS
[1.00164 0 0 1 91.99994 171.91164] CT
0.8 0.502 0.502 RC
N
f-2105962265
f
GR
GS
[1.00164 0 0 1 213.34555 80.49368] CT
0.8 0.502 0.502 RC
N
f-2105962265
f
GR
GS
[1.00164 0 0 1 149.37969 148.06674] CT
0.8 0.502 0.502 RC
N
f-2105962265
f
GR
GS
[1.00164 0 0 1 0 0] CT
0.902 0.6 0.6 RC
1 LJ
3 LW
N
55.5 187.888 M
256 65.477 L
S
GR
GS
[1.00164 0 0 1 158.88605 154.02797] CT
1 0.702 0.702 RC
N
/f227889816{-3 -3 M
-3 3 L
3 3 L
3 -3 L
cp}def
f227889816
f
GR
GS
[1.00164 0 0 1 109.91402 148.06674] CT
1 0.702 0.702 RC
N
f227889816
f
GR
GS
[1.00164 0 0 1 112.87978 159.98918] CT
1 0.702 0.702 RC
N
f227889816
f
GR
GS
[1.00164 0 0 1 102.75862 156.78328] CT
1 0.702 0.702 RC
N
f227889816
f
GR
GS
[1.00164 0 0 1 166.82702 112.29939] CT
1 0.702 0.702 RC
N
f227889816
f
GR
GS
[1.00164 0 0 1 112.87978 142.1055] CT
1 0.702 0.702 RC
N
f227889816
f
GR
GS
[1.00164 0 0 1 143.96047 146.05307] CT
1 0.702 0.702 RC
N
f227889816
f
GR
GS
[1.00164 0 0 1 97.69807 159.98918] CT
1 0.702 0.702 RC
N
f227889816
f
GR
GS
[1.00164 0 0 1 123.90603 148.06674] CT
1 0.702 0.702 RC
N
f227889816
f
GR
GS
[1.00164 0 0 1 80.07426 170.4894] CT
1 0.702 0.702 RC
N
f227889816
f
GR
GS
[1.00164 0 0 1 101.76244 168.1049] CT
1 0.702 0.702 RC
N
f227889816
f
GR
GS
[1.00164 0 0 1 116.91003 122.21286] CT
1 0.702 0.702 RC
N
f227889816
f
GR
GS
[1.00164 0 0 1 94.53307 169.29713] CT
1 0.702 0.702 RC
N
f227889816
f
GR
GS
[1.00164 0 0 1 141.06874 145.45694] CT
1 0.702 0.702 RC
N
f227889816
f
GR
GS
[1.00164 0 0 1 85.00393 171.91164] CT
1 0.702 0.702 RC
N
f227889816
f
GR
GS
[1.00164 0 0 1 125.16406 129.36633] CT
1 0.702 0.702 RC
N
f227889816
f
GR
GS
[1.00164 0 0 1 94.08335 177.87285] CT
1 0.702 0.702 RC
N
f227889816
f
GR
GS
[1.00164 0 0 1 89.75143 175.25836] CT
1 0.702 0.702 RC
N
f227889816
f
GR
GS
[1.00164 0 0 1 123.45062 148.06674] CT
1 0.702 0.702 RC
N
f227889816
f
GR
GS
[1.00164 0 0 1 167.08886 112.29939] CT
1 0.702 0.702 RC
N
f227889816
f
GR
GS
[1.00164 0 0 1 131.67051 136.1443] CT
1 0.702 0.702 RC
N
f227889816
f
GR
GS
[1.00164 0 0 1 145.40637 119.23225] CT
1 0.702 0.702 RC
N
f227889816
f
GR
GS
[1.00164 0 0 1 99.14393 173.76807] CT
1 0.702 0.702 RC
N
f227889816
f
GR
GS
[1.00164 0 0 1 72.84489 183.83408] CT
1 0.702 0.702 RC
N
f227889816
f
GR
GS
[1.00164 0 0 1 102.75862 163.93204] CT
1 0.702 0.702 RC
N
f227889816
f
GR
GS
[1.00164 0 0 1 81.79908 176.15019] CT
1 0.702 0.702 RC
N
f227889816
f
GR
GS
[1.00164 0 0 1 144.32195 163.33592] CT
1 0.702 0.702 RC
N
f227889816
f
GR
GS
[1.00164 0 0 1 97.53296 139.00754] CT
1 0.702 0.702 RC
N
f227889816
f
GR
GS
[1.00164 0 0 1 101.76244 167.50876] CT
1 0.702 0.702 RC
N
f227889816
f
GR
GS
[1.00164 0 0 1 70.95499 177.87285] CT
1 0.702 0.702 RC
N
f227889816
f
GR
GS
[1.00164 0 0 1 123.90603 153.80264] CT
1 0.702 0.702 RC
N
f227889816
f
GR
GS
[1.00164 0 0 1 109.98802 160.36002] CT
1 0.702 0.702 RC
N
f227889816
f
GR
GS
[1.00164 0 0 1 91.22576 179.43123] CT
1 0.702 0.702 RC
N
f227889816
f
GR
GS
[1.00164 0 0 1 141.06874 127.57796] CT
1 0.702 0.702 RC
N
f227889816
f
GR
GS
[1.00164 0 0 1 137.90943 135.32756] CT
1 0.702 0.702 RC
N
f227889816
f
GR
GS
[1.00164 0 0 1 106.37333 142.1055] CT
1 0.702 0.702 RC
N
f227889816
f
GR
GS
[1.00164 0 0 1 119.97826 154.02797] CT
1 0.702 0.702 RC
N
f227889816
f
GR
GS
[1.00164 0 0 1 89.75143 183.00797] CT
1 0.702 0.702 RC
N
f227889816
f
GR
GS
[1.00164 0 0 1 88.92601 154.02797] CT
1 0.702 0.702 RC
N
f227889816
f
GR
GS
[1.00164 0 0 1 109.48709 136.51979] CT
1 0.702 0.702 RC
N
f227889816
f
GR
GS
[1.00164 0 0 1 89.02848 197.26326] CT
1 0.702 0.702 RC
N
f227889816
f
GR
GS
[1.00164 0 0 1 102.75862 160.36002] CT
1 0.702 0.702 RC
N
f227889816
f
GR
GS
[1.00164 0 0 1 93.36043 171.91164] CT
1 0.702 0.702 RC
N
f227889816
f
GR
GS
[1.00164 0 0 1 73.1238 194.92572] CT
1 0.702 0.702 RC
N
f227889816
f
GR
GS
[1.00164 0 0 1 118.6633 138.89958] CT
1 0.702 0.702 RC
N
f227889816
f
GR
GS
[1.00164 0 0 1 98.42098 154.02797] CT
1 0.702 0.702 RC
N
f227889816
f
GR
GS
[1.00164 0 0 1 129.5017 131.75082] CT
1 0.702 0.702 RC
N
f227889816
f
GR
GS
[1.00164 0 0 1 111.43389 142.1055] CT
1 0.702 0.702 RC
N
f227889816
f
GR
GS
[1.00164 0 0 1 180.819 88.45449] CT
0.8 0.502 0.502 RC
N
/f-1969333140{-3.536 0 M
0 4.702 L
3.536 0 L
0 -4.702 L
cp}def
f-1969333140
f
GR
GS
[1.00164 0 0 1 186.87007 100.37693] CT
0.8 0.502 0.502 RC
N
f-1969333140
f
GR
GS
[1.00164 0 0 1 116.22125 154.02797] CT
0.8 0.502 0.502 RC
N
f-1969333140
f
GR
GS
[1.00164 0 0 1 228.84608 47.71161] CT
0.8 0.502 0.502 RC
N
f-1969333140
f
GR
GS
[1.00164 0 0 1 166.82702 136.1443] CT
0.8 0.502 0.502 RC
N
f-1969333140
f
GR
GS
[1.00164 0 0 1 193.83191 100.75714] CT
0.8 0.502 0.502 RC
N
f-1969333140
f
GR
GS
[1.00164 0 0 1 143.96047 100.37693] CT
0.8 0.502 0.502 RC
N
f-1969333140
f
GR
GS
[1.00164 0 0 1 137.90943 118.63612] CT
0.8 0.502 0.502 RC
N
f-1969333140
f
GR
GS
[1.00164 0 0 1 130.90205 125.78959] CT
0.8 0.502 0.502 RC
N
f-1969333140
f
GR
GS
[1.00164 0 0 1 188.51519 122.21286] CT
0.8 0.502 0.502 RC
N
f-1969333140
f
GR
GS
[1.00164 0 0 1 72.84489 165.95041] CT
0.8 0.502 0.502 RC
N
f-1969333140
f
GR
GS
[1.00164 0 0 1 222.74378 115.65552] CT
0.8 0.502 0.502 RC
N
f-1969333140
f
GR
GS
[1.00164 0 0 1 174.05638 126.98183] CT
0.8 0.502 0.502 RC
N
f-1969333140
f
GR
GS
[1.00164 0 0 1 165.88205 107.31448] CT
0.8 0.502 0.502 RC
N
f-1969333140
f
GR
GS
[1.00164 0 0 1 163.95517 123.4051] CT
0.8 0.502 0.502 RC
N
f-1969333140
f
GR
GS
[1.00164 0 0 1 123.90603 148.06674] CT
0.8 0.502 0.502 RC
N
f-1969333140
f
GR
GS
[1.00164 0 0 1 156.24478 118.26063] CT
0.8 0.502 0.502 RC
N
f-1969333140
f
GR
GS
[1.00164 0 0 1 170.70355 103.14164] CT
0.8 0.502 0.502 RC
N
f-1969333140
f
GR
GS
[1.00164 0 0 1 131.67051 143.66858] CT
0.8 0.502 0.502 RC
N
f-1969333140
f
GR
GS
[1.00164 0 0 1 166.36592 134.1353] CT
0.8 0.502 0.502 RC
N
f-1969333140
f
GR
GS
[1.00164 0 0 1 176.48706 136.1443] CT
0.8 0.502 0.502 RC
N
f-1969333140
f
GR
GS
[1.00164 0 0 1 108.99185 154.02797] CT
0.8 0.502 0.502 RC
N
f-1969333140
f
GR
GS
[1.00164 0 0 1 130.68002 136.1443] CT
0.8 0.502 0.502 RC
N
f-1969333140
f
GR
GS
[1.00164 0 0 1 170.70355 129.96246] CT
0.8 0.502 0.502 RC
N
f-1969333140
f
GR
GS
[1.00164 0 0 1 167.54424 106.33816] CT
0.8 0.502 0.502 RC
N
f-1969333140
f
GR
GS
[1.00164 0 0 1 144.89404 142.1055] CT
0.8 0.502 0.502 RC
N
f-1969333140
f
GR
GS
[1.00164 0 0 1 151.18419 110.2951] CT
0.8 0.502 0.502 RC
N
f-1969333140
f
GR
GS
[1.00164 0 0 1 149.01537 128.7702] CT
0.8 0.502 0.502 RC
N
f-1969333140
f
GR
GS
[1.00164 0 0 1 182.13682 121.61673] CT
0.8 0.502 0.502 RC
N
f-1969333140
f
GR
GS
[1.00164 0 0 1 176.12274 112.29939] CT
0.8 0.502 0.502 RC
N
f-1969333140
f
GR
GS
[1.00164 0 0 1 152.3682 112.29939] CT
0.8 0.502 0.502 RC
N
f-1969333140
f
GR
GS
[1.00164 0 0 1 123.45062 159.98918] CT
0.8 0.502 0.502 RC
N
f-1969333140
f
GR
GS
[1.00164 0 0 1 175.04118 128.17409] CT
0.8 0.502 0.502 RC
N
f-1969333140
f
GR
GS
[1.00164 0 0 1 166.36592 115.65552] CT
0.8 0.502 0.502 RC
N
f-1969333140
f
GR
GS
[1.00164 0 0 1 133.83933 149.62981] CT
0.8 0.502 0.502 RC
N
f-1969333140
f
GR
GS
[1.00164 0 0 1 116.91003 148.06674] CT
0.8 0.502 0.502 RC
N
f-1969333140
f
GR
GS
[1.00164 0 0 1 141.66073 147.84145] CT
0.8 0.502 0.502 RC
N
f-1969333140
f
GR
GS
[1.00164 0 0 1 174.31824 91.22388] CT
0.8 0.502 0.502 RC
N
f-1969333140
f
GR
GS
[1.00164 0 0 1 196.00073 118.26063] CT
0.8 0.502 0.502 RC
N
f-1969333140
f
GR
GS
[1.00164 0 0 1 175.76413 80.79173] CT
0.8 0.502 0.502 RC
N
f-1969333140
f
GR
GS
[1.00164 0 0 1 175.27173 137.41399] CT
0.8 0.502 0.502 RC
N
f-1969333140
f
GR
GS
[1.00164 0 0 1 137.45402 144.26471] CT
0.8 0.502 0.502 RC
N
f-1969333140
f
GR
GS
[1.00164 0 0 1 172.87237 118.26063] CT
0.8 0.502 0.502 RC
N
f-1969333140
f
GR
GS
[1.00164 0 0 1 152.3682 129.06827] CT
0.8 0.502 0.502 RC
N
f-1969333140
f
GR
GS
[1.00164 0 0 1 127.69435 129.96246] CT
0.8 0.502 0.502 RC
N
f-1969333140
f
GR
GS
[1.00164 0 0 1 120.10919 144.86081] CT
0.8 0.502 0.502 RC
N
f-1969333140
f
GR
GS
[1.00164 0 0 1 194.91634 156.78328] CT
0.8 0.502 0.502 RC
N
f-1969333140
f
GR
GS
[1.00164 0 0 1 115.78293 148.06674] CT
0.8 0.502 0.502 RC
N
f-1969333140
f
GR
GS
[1.00164 0 0 1 138.17697 118.63612] CT
0.8 0.502 0.502 RC
N
f-1969333140
f
GR
GS
[1.00164 0 0 1 91.99994 171.91164] CT
0.8 0.502 0.502 RC
N
f-1969333140
f
GR
GS
[1.00164 0 0 1 213.34555 80.49368] CT
0.8 0.502 0.502 RC
N
f-1969333140
f
GR
GS
[1.00164 0 0 1 149.37969 148.06674] CT
0.8 0.502 0.502 RC
N
f-1969333140
f
GR
GS
[1.00164 0 0 1 90.14774 212.75] CT
/Helvetica 18 F
GS
[1 0 0 1 0 0] CT
0 7 moveto 
1 -1 scale
(r=0.83, p = 4.7e-26) t 
GR
GR
GS
[1.00164 0 0 1 0 0] CT
0.902 0.6 0.6 RC
1 LJ
3 LW
N
57 212.75 M
87 212.75 L
S
GR
%%Trailer
%%Pages: 1
%%EOF
